#
#                              ======================
#                              | THE SUSYHIT OUTPUT |
#                              ======================
#
#
#              ------------------------------------------------------
#              |     This is the output of the SUSY-HIT package     |
#              |  created by A.Djouadi, M.Muehlleitner and M.Spira. |
#              |  In case of problems with SUSY-HIT email to        |
#              |           margarete.muehlleitner@cern.ch           |
#              |           michael.spira@psi.ch                     |
#              |           abdelhak.djouadi@cern.ch                 |
#              ------------------------------------------------------
#
#              ------------------------------------------------------
#              |  SUSY Les Houches Accord - MSSM Spectrum + Decays  |
#              |              based on the decay programs           |
#              |                                                    |
#              |                     SDECAY 1.3b                    |
#              |                                                    |
#              |  Authors: M.Muhlleitner, A.Djouadi and Y.Mambrini  |
#              |  Ref.:    Comput.Phys.Commun.168(2005)46           |
#              |           [hep-ph/0311167]                         |
#              |                                                    |
#              |                     HDECAY 3.4                     |
#              |                                                    |
#              |  By: A.Djouadi,J.Kalinowski,M.Muhlleitner,M.Spira  |
#              |  Ref.:    Comput.Phys.Commun.108(1998)56           |
#              |           [hep-ph/9704448]                         |
#              |                                                    |
#              |                                                    |
#              |  If not stated otherwise all DRbar couplings and   |
#              |  soft SUSY breaking masses are given at the scale  |
#              |  Q=  0.19788050E+04
#              |                                                    |
#              ------------------------------------------------------
#
#
BLOCK DCINFO  # Decay Program information
     1   SDECAY/HDECAY # decay calculator
     2   1.3b  /3.4    # version number
#
BLOCK SPINFO  # Spectrum calculator information
     1     SOFTSUSY    # spectrum calculator               
     2     3.4.0       # version number                    
#
BLOCK MODSEL  # Model selection
     1     0   #  nonUniversal                                     
#
BLOCK SMINPUTS  # Standard Model inputs
         1     1.27908970E+02   # alpha_em^-1(M_Z)^MSbar
         2     1.16637870E-05   # G_F [GeV^-2]
         3     1.18400000E-01   # alpha_S(M_Z)^MSbar
         4     9.11876000E+01   # M_Z pole mass
         5     4.18000000E+00   # mb(mb)^MSbar
         6     1.73200000E+02   # mt pole mass
         7     1.77700000E+00   # mtau pole mass
#
BLOCK MINPAR  # Input parameters - minimal models
         3     3.03600000E+01   # tanb                
#
BLOCK EXTPAR  # Input parameters - non-minimal models
         0    -1.00000000E+00   # Set                 
         1    -3.00800000E+03   # M_1(MX)             
         2     1.88762000E+03   # M_2(MX)             
         3     2.52080000E+02   # M_3(MX)             
        11     2.72673000E+03   # At(MX)              
        12     5.65770000E+02   # Ab(MX)              
        13    -5.02170000E+02   # Atau(MX)            
        23     2.26840000E+02   # mu(MX)              
        26     1.66116000E+03   # mA(pole)            
        31     4.16390000E+02   # meL(MX)             
        32     4.16390000E+02   # mmuL(MX)            
        33     1.67263000E+03   # mtauL(MX)           
        34     1.57812000E+03   # meR(MX)             
        35     1.57812000E+03   # mmuR(MX)            
        36     2.61271000E+03   # mtauR(MX)           
        41     3.58365000E+03   # mqL1(MX)            
        42     3.58365000E+03   # mqL2(MX)            
        43     1.26975000E+03   # mqL3(MX)            
        44     2.29472000E+03   # muR(MX)             
        45     2.29472000E+03   # mcR(MX)             
        46     3.07876000E+03   # mtR(MX)             
        47     1.04853000E+03   # mdR(MX)             
        48     1.04853000E+03   # msR(MX)             
        49     9.15260000E+02   # mbR(MX)             
#
BLOCK MASS  # Mass Spectrum
# PDG code           mass       particle
        24     8.04012182E+01   # W+
        25     1.24933709E+02   # h
        35     1.66117616E+03   # H
        36     1.66115999E+03   # A
        37     1.66344960E+03   # H+
         5     4.81876030E+00   # b-quark pole mass calculated from mb(mb)_Msbar
   1000001     3.62489975E+03   # ~d_L
   2000001     1.06350511E+03   # ~d_R
   1000002     3.62414849E+03   # ~u_L
   2000002     2.31807641E+03   # ~u_R
   1000003     3.62489975E+03   # ~s_L
   2000003     1.06350511E+03   # ~s_R
   1000004     3.62414849E+03   # ~c_L
   2000004     2.31807641E+03   # ~c_R
   1000005     9.19541410E+02   # ~b_1
   2000005     1.28801487E+03   # ~b_2
   1000006     1.28697390E+03   # ~t_1
   2000006     3.07880947E+03   # ~t_2
   1000011     4.54003088E+02   # ~e_L
   2000011     1.58776372E+03   # ~e_R
   1000012     4.46704292E+02   # ~nu_eL
   1000013     4.54003088E+02   # ~mu_L
   2000013     1.58776372E+03   # ~mu_R
   1000014     4.46704292E+02   # ~nu_muL
   1000015     1.68729843E+03   # ~tau_1
   2000015     2.61698540E+03   # ~tau_2
   1000016     1.68510814E+03   # ~nu_tauL
   1000021     3.40265646E+02   # ~g
   1000022     2.35131357E+02   # ~chi_10
   1000023    -2.37517010E+02   # ~chi_20
   1000025     1.90651100E+03   # ~chi_30
   1000035    -2.97672568E+03   # ~chi_40
   1000024     2.36319587E+02   # ~chi_1+
   1000037     1.90667941E+03   # ~chi_2+
#
BLOCK NMIX  # Neutralino Mixing Matrix
  1  1    -9.80682542E-03   # N_11
  1  2    -3.46503447E-02   # N_12
  1  3     7.08729770E-01   # N_13
  1  4    -7.04560354E-01   # N_14
  2  1     1.07992006E-02   # N_21
  2  2     2.55187266E-02   # N_22
  2  3     7.05449230E-01   # N_23
  2  4     7.08218579E-01   # N_24
  3  1    -3.86439725E-04   # N_31
  3  2     9.99073619E-01   # N_32
  3  3     6.56149068E-03   # N_33
  3  4    -4.25288361E-02   # N_34
  4  1     9.99893521E-01   # N_41
  4  2    -2.29334414E-04   # N_42
  4  3    -6.65433874E-04   # N_43
  4  4    -1.45756817E-02   # N_44
#
BLOCK UMIX  # Chargino Mixing Matrix U
  1  1    -9.28364550E-03   # U_11
  1  2     9.99956906E-01   # U_12
  2  1    -9.99956906E-01   # U_21
  2  2    -9.28364550E-03   # U_22
#
BLOCK VMIX  # Chargino Mixing Matrix V
  1  1    -6.01773607E-02   # V_11
  1  2     9.98187700E-01   # V_12
  2  1    -9.98187700E-01   # V_21
  2  2    -6.01773607E-02   # V_22
#
BLOCK STOPMIX  # Stop Mixing Matrix
  1  1     9.98779995E-01   # cos(theta_t)
  1  2    -4.93813891E-02   # sin(theta_t)
  2  1     4.93813891E-02   # -sin(theta_t)
  2  2     9.98779995E-01   # cos(theta_t)
#
BLOCK SBOTMIX  # Sbottom Mixing Matrix
  1  1     1.77779526E-02   # cos(theta_b)
  1  2     9.99841960E-01   # sin(theta_b)
  2  1    -9.99841960E-01   # -sin(theta_b)
  2  2     1.77779526E-02   # cos(theta_b)
#
BLOCK STAUMIX  # Stau Mixing Matrix
  1  1     9.99994623E-01   # cos(theta_tau)
  1  2     3.27932479E-03   # sin(theta_tau)
  2  1    -3.27932479E-03   # -sin(theta_tau)
  2  2     9.99994623E-01   # cos(theta_tau)
#
BLOCK ALPHA  # Higgs mixing
          -3.43425854E-02   # Mixing angle in the neutral Higgs boson sector
#
BLOCK HMIX Q=  1.97880500E+03  # DRbar Higgs Parameters
         1     2.30736522E+02   # mu(Q)MSSM           
         2     2.93769275E+01   # tan                 
         3     2.43118539E+02   # higgs               
         4     2.76720967E+06   # mA^2(Q)MSSM         
#
BLOCK GAUGE Q=  1.97880500E+03  # The gauge couplings
     1     3.64296867E-01   # gprime(Q) DRbar
     2     6.39516473E-01   # g(Q) DRbar
     3     1.06037636E+00   # g3(Q) DRbar
#
BLOCK AU Q=  1.97880500E+03  # The trilinear couplings
  1  1     0.00000000E+00   # A_u(Q) DRbar
  2  2     0.00000000E+00   # A_c(Q) DRbar
  3  3     2.72673000E+03   # A_t(Q) DRbar
#
BLOCK AD Q=  1.97880500E+03  # The trilinear couplings
  1  1     0.00000000E+00   # A_d(Q) DRbar
  2  2     0.00000000E+00   # A_s(Q) DRbar
  3  3     5.65770001E+02   # A_b(Q) DRbar
#
BLOCK AE Q=  1.97880500E+03  # The trilinear couplings
  1  1     0.00000000E+00   # A_e(Q) DRbar
  2  2     0.00000000E+00   # A_mu(Q) DRbar
  3  3    -5.02170000E+02   # A_tau(Q) DRbar
#
BLOCK Yu Q=  1.97880500E+03  # The Yukawa couplings
  1  1     0.00000000E+00   # y_u(Q) DRbar
  2  2     0.00000000E+00   # y_c(Q) DRbar
  3  3     8.42039144E-01   # y_t(Q) DRbar
#
BLOCK Yd Q=  1.97880500E+03  # The Yukawa couplings
  1  1     0.00000000E+00   # y_d(Q) DRbar
  2  2     0.00000000E+00   # y_s(Q) DRbar
  3  3     3.94320121E-01   # y_b(Q) DRbar
#
BLOCK Ye Q=  1.97880500E+03  # The Yukawa couplings
  1  1     0.00000000E+00   # y_e(Q) DRbar
  2  2     0.00000000E+00   # y_mu(Q) DRbar
  3  3     3.04806724E-01   # y_tau(Q) DRbar
#
BLOCK MSOFT Q=  1.97880500E+03  # The soft SUSY breaking masses at the scale Q
         1    -3.00800000E+03   # M_1(Q)              
         2     1.88762000E+03   # M_2(Q)              
         3     2.52080000E+02   # M_3(Q)              
        21     2.69812456E+06   # mH1^2(Q)            
        22    -7.06829603E+04   # mH2^2(Q)            
        31     4.16390000E+02   # meL(Q)              
        32     4.16390000E+02   # mmuL(Q)             
        33     1.67263000E+03   # mtauL(Q)            
        34     1.57812000E+03   # meR(Q)              
        35     1.57812000E+03   # mmuR(Q)             
        36     2.61271000E+03   # mtauR(Q)            
        41     3.58365000E+03   # mqL1(Q)             
        42     3.58365000E+03   # mqL2(Q)             
        43     1.26975000E+03   # mqL3(Q)             
        44     2.29472000E+03   # muR(Q)              
        45     2.29472000E+03   # mcR(Q)              
        46     3.07876000E+03   # mtR(Q)              
        47     1.04853000E+03   # mdR(Q)              
        48     1.04853000E+03   # msR(Q)              
        49     9.15260000E+02   # mbR(Q)              
#
Block HiggsBoundsInputHiggsCouplingsFermions
# ScalarNormEffCoupSq PseudoSNormEffCoupSq NP   IP1 IP2 IP2
    1.01861699E+00    0.00000000E+00        3  25   5   5  # h0-b-b eff. coupling^2, normalised to SM
    8.62985252E+02    0.00000000E+00        3  35   5   5  # H0-b-b eff. coupling^2, normalised to SM
    0.00000000E+00    8.63003869E+02        3  36   5   5  # A0-b-b eff. coupling^2, normalised to SM
#
    9.99978428E-01    0.00000000E+00        3  25   6   6  # h0-t-t eff. coupling^2, normalised to SM
    1.18031567E-03    0.00000000E+00        3  35   6   6  # H0-t-t eff. coupling^2, normalised to SM
    0.00000000E+00    1.15874336E-03        3  36   6   6  # A0-t-t eff. coupling^2, normalised to SM
#
    1.01861699E+00    0.00000000E+00        3  25  15  15  # h0-tau-tau eff. coupling^2, normalised to SM
    8.62985252E+02    0.00000000E+00        3  35  15  15  # H0-tau-tau eff. coupling^2, normalised to SM
    0.00000000E+00    8.63003869E+02        3  36  15  15  # A0-tau-tau eff. coupling^2, normalised to SM
#
Block HiggsBoundsInputHiggsCouplingsBosons
    9.99999901E-01        3  25  24  24  # h0-W-W eff. coupling^2, normalised to SM
    9.94801198E-08        3  35  24  24  # H0-W-W eff. coupling^2, normalised to SM
    0.00000000E+00        3  36  24  24  # A0-W-W eff. coupling^2, normalised to SM
#
    9.99999901E-01        3  25  23  23  # h0-Z-Z eff. coupling^2, normalised to SM
    9.94801198E-08        3  35  23  23  # H0-Z-Z eff. coupling^2, normalised to SM
    0.00000000E+00        3  36  23  23  # A0-Z-Z eff. coupling^2, normalised to SM
#
    8.95357391E-01        3  25  21  21  # h0-g-g eff. coupling^2, normalised to SM
    3.53220401E-10        3  35  21  21  # H0-g-g eff. coupling^2, normalised to SM
    2.40986796E-09        3  36  21  21  # A0-g-g eff. coupling^2, normalised to SM
#
    0.00000000E+00        3  25  25  23  # h0-h0-Z eff. coupling^2, normalised to SM
    0.00000000E+00        3  35  25  23  # H0-h0-Z eff. coupling^2, normalised to SM
    9.94801198E-08        3  36  25  23  # A0-h0-Z eff. coupling^2, normalised to SM
    0.00000000E+00        3  35  35  23  # H0-H0-Z eff. coupling^2, normalised to SM
    9.99999901E-01        3  36  35  23  # A0-H0-Z eff. coupling^2, normalised to SM
    0.00000000E+00        3  36  36  23  # A0-A0-Z eff. coupling^2, normalised to SM
#
    0.00000000E+00        4  25  21  21  23  # h0-g-g-Z eff. coupling^2, normalised to SM
    0.00000000E+00        4  35  21  21  23  # H0-g-g-Z eff. coupling^2, normalised to SM
    0.00000000E+00        4  36  21  21  23  # A0-g-g-Z eff. coupling^2, normalised to SM
#
#
#
#                             =================
#                             |The decay table|
#                             =================
#
# - The QCD corrections to the decays gluino -> squark  + quark
#                                     squark -> gaugino + quark_prime
#                                     squark -> squark_prime + Higgs
#                                     squark -> gluino  + quark
#   are included.
#
# - The multi-body decays for the inos, stops and sbottoms are included.
#
# - The loop induced decays for the gluino, neutralinos and stops
#   are included.
#
# - The SUSY decays of the top quark are included.
#
#
#         PDG            Width
DECAY         6     1.43986566E+00   # top decays
#          BR         NDA      ID1       ID2
     1.00000000E+00    2           5        24   # BR(t ->  b    W+)
#
#         PDG            Width
DECAY   1000021     1.21642819E-06   # gluino decays
#          BR         NDA      ID1       ID2
     2.43583022E-01    2     1000022        21   # BR(~g -> ~chi_10 g)
     3.49866008E-01    2     1000023        21   # BR(~g -> ~chi_20 g)
#           BR         NDA      ID1       ID2       ID3
     5.47226882E-06    3     1000022         1        -1   # BR(~g -> ~chi_10 d  db)
     1.68162910E-06    3     1000023         1        -1   # BR(~g -> ~chi_20 d  db)
     2.83296915E-06    3     1000022         2        -2   # BR(~g -> ~chi_10 u  ub)
     6.19765940E-07    3     1000023         2        -2   # BR(~g -> ~chi_20 u  ub)
     5.47226882E-06    3     1000022         3        -3   # BR(~g -> ~chi_10 s  sb)
     1.68162910E-06    3     1000023         3        -3   # BR(~g -> ~chi_20 s  sb)
     2.83296915E-06    3     1000022         4        -4   # BR(~g -> ~chi_10 c  cb)
     6.19765940E-07    3     1000023         4        -4   # BR(~g -> ~chi_20 c  cb)
     2.15099596E-01    3     1000022         5        -5   # BR(~g -> ~chi_10 b  bb)
     1.91411707E-01    3     1000023         5        -5   # BR(~g -> ~chi_20 b  bb)
     4.61347203E-06    3     1000024         1        -2   # BR(~g -> ~chi_1+ d  ub)
     4.61347203E-06    3    -1000024         2        -1   # BR(~g -> ~chi_1- u  db)
     4.61347203E-06    3     1000024         3        -4   # BR(~g -> ~chi_1+ s  cb)
     4.61347203E-06    3    -1000024         4        -3   # BR(~g -> ~chi_1- c  sb)
#
#         PDG            Width
DECAY   1000006     8.31591643E+01   # stop1 decays
#          BR         NDA      ID1       ID2
     9.74420635E-02    2     1000022         6   # BR(~t_1 -> ~chi_10 t )
     9.78388423E-02    2     1000023         6   # BR(~t_1 -> ~chi_20 t )
     4.45882820E-02    2     1000024         5   # BR(~t_1 -> ~chi_1+ b )
     7.59577734E-01    2     1000021         6   # BR(~t_1 -> ~g      t )
     5.53078145E-04    2     1000005        24   # BR(~t_1 -> ~b_1    W+)
#
#         PDG            Width
DECAY   2000006     3.15773805E+02   # stop2 decays
#          BR         NDA      ID1       ID2
     6.71437191E-02    2     1000022         6   # BR(~t_2 -> ~chi_10 t )
     6.78794874E-02    2     1000023         6   # BR(~t_2 -> ~chi_20 t )
     1.29655915E-05    2     1000025         6   # BR(~t_2 -> ~chi_30 t )
     1.35775866E-01    2     1000024         5   # BR(~t_2 -> ~chi_1+ b )
     2.68565829E-05    2     1000037         5   # BR(~t_2 -> ~chi_2+ b )
     5.64507688E-01    2     1000021         6   # BR(~t_2 -> ~g      t )
     4.36172139E-02    2     1000006        25   # BR(~t_2 -> ~t_1    h )
     2.15965021E-04    2     1000006        35   # BR(~t_2 -> ~t_1    H )
     2.17035810E-04    2     1000006        36   # BR(~t_2 -> ~t_1    A )
     5.75851048E-05    2     1000005        37   # BR(~t_2 -> ~b_1    H+)
     4.24030661E-04    2     2000005        37   # BR(~t_2 -> ~b_2    H+)
     4.07569222E-02    2     1000006        23   # BR(~t_2 -> ~t_1    Z )
     3.37783945E-05    2     1000005        24   # BR(~t_2 -> ~b_1    W+)
     7.93308860E-02    2     2000005        24   # BR(~t_2 -> ~b_2    W+)
#
#         PDG            Width
DECAY   1000005     4.56116829E+01   # sbottom1 decays
#          BR         NDA      ID1       ID2
     2.74053315E-02    2     1000022         5   # BR(~b_1 -> ~chi_10 b )
     2.70051971E-02    2     1000023         5   # BR(~b_1 -> ~chi_20 b )
     4.97192074E-02    2    -1000024         6   # BR(~b_1 -> ~chi_1- t )
     8.95870264E-01    2     1000021         5   # BR(~b_1 -> ~g      b )
#
#         PDG            Width
DECAY   2000005     8.65013980E+01   # sbottom2 decays
#          BR         NDA      ID1       ID2
     2.16414782E-02    2     1000022         5   # BR(~b_2 -> ~chi_10 b )
     2.14408031E-02    2     1000023         5   # BR(~b_2 -> ~chi_20 b )
     1.87887944E-01    2    -1000024         6   # BR(~b_2 -> ~chi_1- t )
     7.68478392E-01    2     1000021         5   # BR(~b_2 -> ~g      b )
     2.80947652E-04    2     1000005        25   # BR(~b_2 -> ~b_1    h )
     2.70435500E-04    2     1000005        23   # BR(~b_2 -> ~b_1    Z )
#
#         PDG            Width
DECAY   1000002     2.79297813E+02   # sup_L decays
#          BR         NDA      ID1       ID2
     6.76762615E-05    2     1000022         2   # BR(~u_L -> ~chi_10 u)
     3.85771207E-05    2     1000023         2   # BR(~u_L -> ~chi_20 u)
     2.66716236E-02    2     1000025         2   # BR(~u_L -> ~chi_30 u)
     1.97319176E-04    2     1000035         2   # BR(~u_L -> ~chi_40 u)
     3.67631431E-04    2     1000024         1   # BR(~u_L -> ~chi_1+ d)
     5.32493205E-02    2     1000037         1   # BR(~u_L -> ~chi_2+ d)
     9.19407852E-01    2     1000021         2   # BR(~u_L -> ~g      u)
#
#         PDG            Width
DECAY   2000002     1.60055753E+02   # sup_R decays
#          BR         NDA      ID1       ID2
     3.10423765E-06    2     1000022         2   # BR(~u_R -> ~chi_10 u)
     3.76267358E-06    2     1000023         2   # BR(~u_R -> ~chi_20 u)
     5.22328343E-10    2     1000025         2   # BR(~u_R -> ~chi_30 u)
     9.99993133E-01    2     1000021         2   # BR(~u_R -> ~g      u)
#
#         PDG            Width
DECAY   1000001     2.79313132E+02   # sdown_L decays
#          BR         NDA      ID1       ID2
     5.45829407E-05    2     1000022         1   # BR(~d_L -> ~chi_10 d)
     2.79578880E-05    2     1000023         1   # BR(~d_L -> ~chi_20 d)
     2.66919721E-02    2     1000025         1   # BR(~d_L -> ~chi_30 d)
     1.98641040E-04    2     1000035         1   # BR(~d_L -> ~chi_40 d)
     8.75087005E-06    2    -1000024         2   # BR(~d_L -> ~chi_1- u)
     5.34633125E-02    2    -1000037         2   # BR(~d_L -> ~chi_2- u)
     9.19554783E-01    2     1000021         1   # BR(~d_L -> ~g      d)
#
#         PDG            Width
DECAY   2000001     6.18015032E+01   # sdown_R decays
#          BR         NDA      ID1       ID2
     8.49951961E-07    2     1000022         1   # BR(~d_R -> ~chi_10 d)
     1.02851724E-06    2     1000023         1   # BR(~d_R -> ~chi_20 d)
     9.99998122E-01    2     1000021         1   # BR(~d_R -> ~g      d)
#
#         PDG            Width
DECAY   1000004     2.35647193E+02   # scharm_L decays
#          BR         NDA      ID1       ID2
     8.27115063E-05    2     1000022         4   # BR(~c_L -> ~chi_10 c)
     4.71476125E-05    2     1000023         4   # BR(~c_L -> ~chi_20 c)
     3.26641322E-02    2     1000025         4   # BR(~c_L -> ~chi_30 c)
     2.38189873E-04    2     1000035         4   # BR(~c_L -> ~chi_40 c)
     4.49306318E-04    2     1000024         3   # BR(~c_L -> ~chi_1+ s)
     6.52132654E-02    2     1000037         3   # BR(~c_L -> ~chi_2+ s)
     9.01305247E-01    2     1000021         4   # BR(~c_L -> ~g      c)
#
#         PDG            Width
DECAY   2000004     1.32382447E+02   # scharm_R decays
#          BR         NDA      ID1       ID2
     3.87132351E-06    2     1000022         4   # BR(~c_R -> ~chi_10 c)
     4.69247117E-06    2     1000023         4   # BR(~c_R -> ~chi_20 c)
     6.42512232E-10    2     1000025         4   # BR(~c_R -> ~chi_30 c)
     9.99991436E-01    2     1000021         4   # BR(~c_R -> ~g      c)
#
#         PDG            Width
DECAY   1000003     2.35651979E+02   # sstrange_L decays
#          BR         NDA      ID1       ID2
     6.67116418E-05    2     1000022         3   # BR(~s_L -> ~chi_10 s)
     3.41703467E-05    2     1000023         3   # BR(~s_L -> ~chi_20 s)
     3.26902291E-02    2     1000025         3   # BR(~s_L -> ~chi_30 s)
     2.39800749E-04    2     1000035         3   # BR(~s_L -> ~chi_40 s)
     1.06953748E-05    2    -1000024         4   # BR(~s_L -> ~chi_1- c)
     6.54776165E-02    2    -1000037         4   # BR(~s_L -> ~chi_2- c)
     9.01480776E-01    2     1000021         3   # BR(~s_L -> ~g      s)
#
#         PDG            Width
DECAY   2000003     5.11161152E+01   # sstrange_R decays
#          BR         NDA      ID1       ID2
     1.06202969E-06    2     1000022         3   # BR(~s_R -> ~chi_10 s)
     1.28514485E-06    2     1000023         3   # BR(~s_R -> ~chi_20 s)
     9.99997653E-01    2     1000021         3   # BR(~s_R -> ~g      s)
#
#         PDG            Width
DECAY   1000011     2.74772064E-03   # selectron_L decays
#          BR         NDA      ID1       ID2
     5.82757124E-01    2     1000022        11   # BR(~e_L -> ~chi_10 e-)
     3.55657582E-01    2     1000023        11   # BR(~e_L -> ~chi_20 e-)
     6.15852942E-02    2    -1000024        12   # BR(~e_L -> ~chi_1- nu_e)
#
#         PDG            Width
DECAY   2000011     2.33221492E-03   # selectron_R decays
#           BR         NDA      ID1       ID2
     3.30738384E-01    2     1000022        11   # BR(~e_R -> ~chi_10 e-)
     4.00694728E-01    2     1000023        11   # BR(~e_R -> ~chi_20 e-)
#           BR         NDA      ID1       ID2       ID3
     2.79914168E-04    3        11       -1        2000001   # BR(~e_R- -> e-  db  ~d_R)
     1.42006638E-03    3        11       1        -2000001   # BR(~e_R- -> e-  d  ~d_R*)
     2.83721707E-04    3        11       -3        2000003   # BR(~e_R- -> e-  sb  ~s_R)
     1.39168134E-03    3        11       3        -2000003   # BR(~e_R- -> e-  s  ~s_R*)
     7.44656928E-04    3        11       -5        1000005   # BR(~e_R- -> e-  bb  ~b_1)
     4.18370533E-03    3        11       5        -1000005   # BR(~e_R- -> e-  b  ~b_1*)
     2.54054630E-05    3        11       -5        2000005   # BR(~e_R- -> e-  bb  ~b_2)
     6.36991036E-06    3        11       5        -2000005   # BR(~e_R- -> e-  b  ~b_2*)
     7.04694916E-06    3        11       -6        1000006   # BR(~e_R- -> e-  tb  ~t_1)
     1.13291446E-06    3        11       6        -1000006   # BR(~e_R- -> e-  t  ~t_1*)
     2.93652181E-02    3        11       -11        1000011   # BR(~e_R- -> e-  e+  ~e_L-)
     3.34223056E-03    3        11       11        -1000011   # BR(~e_R- -> e-  e-  ~e_L+)
     2.94548325E-02    3        11       -12        1000012   # BR(~e_R- -> e-  nu_eb  ~nu_eL)
     3.54015400E-03    3        11       12        -1000012   # BR(~e_R- -> e-  nu_e  ~nu_eL*)
     2.84532096E-02    3        11       -13        1000013   # BR(~e_R- -> e-  mu+  ~mu_L-)
     3.32859546E-03    3        11       13        -1000013   # BR(~e_R- -> e-  mu-  ~mu_L+)
     2.89317246E-02    3        11       -14        1000014   # BR(~e_R- -> e-  nu_mub  ~nu_muL)
     3.56708120E-03    3        11       14        -1000014   # BR(~e_R- -> e-  nu_mu  ~nu_muL*)
     1.85197340E-02    3        11       23        1000022   # BR(~e_R- -> e-  Z  ~chi_10)
     1.24615445E-02    3        11       25        1000022   # BR(~e_R- -> e-  h  ~chi_10)
     1.20327675E-02    3        11       23        1000023   # BR(~e_R- -> e-  Z  ~chi_20)
     1.93271210E-02    3        11       25        1000023   # BR(~e_R- -> e-  h  ~chi_20)
     5.40044567E-03    3        11       -24        1000024   # BR(~e_R- -> e-  W-  ~chi_1+)
     6.24985281E-02    3        11       24        -1000024   # BR(~e_R- -> e-  W+  ~chi_1-)
#
#         PDG            Width
DECAY   1000013     2.74772012E-03   # smuon_L decays
#          BR         NDA      ID1       ID2
     5.82757117E-01    2     1000022        13   # BR(~mu_L -> ~chi_10 mu-)
     3.55657577E-01    2     1000023        13   # BR(~mu_L -> ~chi_20 mu-)
     6.15853060E-02    2    -1000024        14   # BR(~mu_L -> ~chi_1- nu_mu)
#
#         PDG            Width
DECAY   2000013     2.33199655E-03   # smuon_R decays
#           BR         NDA      ID1       ID2
     3.30769353E-01    2     1000022        13   # BR(~mu_R -> ~chi_10 mu-)
     4.00732248E-01    2     1000023        13   # BR(~mu_R -> ~chi_20 mu-)
#           BR         NDA      ID1       ID2       ID3
     2.79940380E-04    3        13       -1        2000001   # BR(~mu_R- -> mu-  db  ~d_R)
     1.42019936E-03    3        13       1        -2000001   # BR(~mu_R- -> mu-  d  ~d_R*)
     2.83748275E-04    3        13       -3        2000003   # BR(~mu_R- -> mu-  sb  ~s_R)
     1.39181166E-03    3        13       3        -2000003   # BR(~mu_R- -> mu-  s  ~s_R*)
     7.55489968E-04    3        13       -5        1000005   # BR(~mu_R- -> mu-  bb  ~b_1)
     4.18409710E-03    3        13       5        -1000005   # BR(~mu_R- -> mu-  b  ~b_1*)
     2.54091285E-05    3        13       -5        2000005   # BR(~mu_R- -> mu-  bb  ~b_2)
     6.41081565E-06    3        13       5        -2000005   # BR(~mu_R- -> mu-  b  ~b_2*)
     7.02659701E-06    3        13       -6        1000006   # BR(~mu_R- -> mu-  tb  ~t_1)
     1.12860373E-06    3        13       6        -1000006   # BR(~mu_R- -> mu-  t  ~t_1*)
     2.93679680E-02    3        13       -11        1000011   # BR(~mu_R- -> mu-  e+  ~e_L-)
     3.32895003E-03    3        13       11        -1000011   # BR(~mu_R- -> mu-  e-  ~e_L+)
     2.94575907E-02    3        13       -12        1000012   # BR(~mu_R- -> mu-  nu_eb  ~nu_eL)
     3.54048551E-03    3        13       12        -1000012   # BR(~mu_R- -> mu-  nu_e  ~nu_eL*)
     2.83611054E-02    3        13       -13        1000013   # BR(~mu_R- -> mu-  mu+  ~mu_L-)
     3.34099979E-03    3        13       13        -1000013   # BR(~mu_R- -> mu-  mu-  ~mu_L+)
     2.89344339E-02    3        13       -14        1000014   # BR(~mu_R- -> mu-  nu_mub  ~nu_muL)
     3.56741522E-03    3        13       14        -1000014   # BR(~mu_R- -> mu-  nu_mu  ~nu_muL*)
     1.85218970E-02    3        13       23        1000022   # BR(~mu_R- -> mu-  Z  ~chi_10)
     1.24627114E-02    3        13       25        1000022   # BR(~mu_R- -> mu-  h  ~chi_10)
     1.20338943E-02    3        13       23        1000023   # BR(~mu_R- -> mu-  Z  ~chi_20)
     1.93289308E-02    3        13       25        1000023   # BR(~mu_R- -> mu-  h  ~chi_20)
     5.39237504E-03    3        13       -24        1000024   # BR(~mu_R- -> mu-  W-  ~chi_1+)
     6.25043806E-02    3        13       24        -1000024   # BR(~mu_R- -> mu-  W+  ~chi_1-)
#
#         PDG            Width
DECAY   1000015     3.01630896E+00   # stau_1 decays
#          BR         NDA      ID1       ID2
     5.03085445E-01    2     1000022        15   # BR(~tau_1 -> ~chi_10  tau-)
     4.96399892E-01    2     1000023        15   # BR(~tau_1 -> ~chi_20  tau-)
     5.14662965E-04    2    -1000024        16   # BR(~tau_1 -> ~chi_1-  nu_tau)
#
#         PDG            Width
DECAY   2000015     9.56757570E+00   # stau_2 decays
#          BR         NDA      ID1       ID2
     2.49900082E-01    2     1000022        15   # BR(~tau_2 -> ~chi_10  tau-)
     2.47704722E-01    2     1000023        15   # BR(~tau_2 -> ~chi_20  tau-)
     1.45763363E-05    2     1000025        15   # BR(~tau_2 -> ~chi_30  tau-)
     4.97243482E-01    2    -1000024        16   # BR(~tau_2 -> ~chi_1-  nu_tau)
     2.90753513E-05    2    -1000037        16   # BR(~tau_2 -> ~chi_2-  nu_tau)
     2.51340255E-03    2     1000016       -24   # BR(~tau_2 -> ~nu_tauL W-)
     1.31223058E-03    2     1000015        25   # BR(~tau_2 -> ~tau_1   h)
     1.28242969E-03    2     1000015        23   # BR(~tau_2 -> ~tau_1   Z)
#
#         PDG            Width
DECAY   1000012     7.97856946E-03   # snu_eL decays
#          BR         NDA      ID1       ID2
     1.00555752E-01    2     1000022        12   # BR(~nu_eL -> ~chi_10 nu_e)
     4.39549455E-02    2     1000023        12   # BR(~nu_eL -> ~chi_20 nu_e)
     8.55489303E-01    2     1000024        11   # BR(~nu_eL -> ~chi_1+ e-)
#
#         PDG            Width
DECAY   1000014     7.97856799E-03   # snu_muL decays
#          BR         NDA      ID1       ID2
     1.00555770E-01    2     1000022        14   # BR(~nu_muL -> ~chi_10 nu_mu)
     4.39549537E-02    2     1000023        14   # BR(~nu_muL -> ~chi_20 nu_mu)
     8.55489276E-01    2     1000024        13   # BR(~nu_muL -> ~chi_1+ mu-)
#
#         PDG            Width
DECAY   1000016     3.04858782E+00   # snu_tauL decays
#          BR         NDA      ID1       ID2
     1.82626395E-03    2     1000022        16   # BR(~nu_tauL -> ~chi_10 nu_tau)
     8.10267540E-04    2     1000023        16   # BR(~nu_tauL -> ~chi_20 nu_tau)
     9.97363469E-01    2     1000024        15   # BR(~nu_tauL -> ~chi_1+ tau-)
#
#         PDG            Width
DECAY   1000024     1.58352981E-12   # chargino1+ decays
#           BR         NDA      ID1       ID2       ID3
     5.99977712E-01    3     1000022         2        -1   # BR(~chi_1+ -> ~chi_10 u    db)
     2.00011144E-01    3     1000022       -11        12   # BR(~chi_1+ -> ~chi_10 e+   nu_e)
     2.00011144E-01    3     1000022       -13        14   # BR(~chi_1+ -> ~chi_10 mu+  nu_mu)
#
#         PDG            Width
DECAY   1000037     5.74227293E+01   # chargino2+ decays
#          BR         NDA      ID1       ID2
     1.20304017E-01    2     1000006        -5   # BR(~chi_2+ -> ~t_1     bb)
     3.30253165E-05    2    -1000005         6   # BR(~chi_2+ -> ~b_1*    t )
     1.11191551E-01    2    -2000005         6   # BR(~chi_2+ -> ~b_2*    t )
     1.20223005E-01    2     1000012       -11   # BR(~chi_2+ -> ~nu_eL   e+  )
     1.20223005E-01    2     1000014       -13   # BR(~chi_2+ -> ~nu_muL mu+ )
     6.44945200E-03    2     1000016       -15   # BR(~chi_2+ -> ~nu_tau1 tau+)
     1.20188303E-01    2    -1000011        12   # BR(~chi_2+ -> ~e_L+    nu_e)
     1.20188303E-01    2    -1000013        14   # BR(~chi_2+ -> ~mu_L+   nu_mu)
     6.35302827E-03    2    -1000015        16   # BR(~chi_2+ -> ~tau_1+  nu_tau)
     6.89296563E-02    2     1000024        23   # BR(~chi_2+ -> ~chi_1+  Z )
     6.67950624E-02    2     1000022        24   # BR(~chi_2+ -> ~chi_10  W+)
     6.74325295E-02    2     1000023        24   # BR(~chi_2+ -> ~chi_20  W+)
     6.77877369E-02    2     1000024        25   # BR(~chi_2+ -> ~chi_1+  h )
     1.04775215E-03    2     1000024        35   # BR(~chi_2+ -> ~chi_1+  H )
     1.05169903E-03    2     1000024        36   # BR(~chi_2+ -> ~chi_1+  A )
     9.83029250E-04    2     1000022        37   # BR(~chi_2+ -> ~chi_10  H+)
     8.18844514E-04    2     1000023        37   # BR(~chi_2+ -> ~chi_20  H+)
#
#         PDG            Width
DECAY   1000022     0.00000000E+00   # neutralino1 decays
#
#         PDG            Width
DECAY   1000023     8.02401920E-11   # neutralino2 decays
#          BR         NDA      ID1       ID2
     2.81198266E-01    2     1000022        22   # BR(~chi_20 -> ~chi_10 gam)
#           BR         NDA      ID1       ID2       ID3
     1.13435089E-01    3     1000022        -2         2   # BR(~chi_20 -> ~chi_10 ub      u)
     1.47176053E-01    3     1000022        -1         1   # BR(~chi_20 -> ~chi_10 db      d)
     1.47176053E-01    3     1000022        -3         3   # BR(~chi_20 -> ~chi_10 sb      s)
     3.37646015E-02    3     1000022       -11        11   # BR(~chi_20 -> ~chi_10 e+      e-)
     3.37646015E-02    3     1000022       -13        13   # BR(~chi_20 -> ~chi_10 mu+     mu-)
     6.75128530E-02    3     1000022       -12        12   # BR(~chi_20 -> ~chi_10 nu_eb   nu_e)
     6.75128530E-02    3     1000022       -14        14   # BR(~chi_20 -> ~chi_10 nu_mub  nu_mu)
     6.75097012E-02    3     1000022       -16        16   # BR(~chi_20 -> ~chi_10 nu_taub nu_tau)
     1.22847835E-02    3     1000024        -2         1   # BR(~chi_20 -> ~chi_1+ ub      d)
     1.22847835E-02    3    -1000024        -1         2   # BR(~chi_20 -> ~chi_1- db      u)
     4.09509039E-03    3     1000024       -12        11   # BR(~chi_20 -> ~chi_1+ nu_eb   e-)
     4.09509039E-03    3    -1000024        12       -11   # BR(~chi_20 -> ~chi_1- nu_e    e+)
     4.09509039E-03    3     1000024       -14        13   # BR(~chi_20 -> ~chi_1+ nu_mub  mu-)
     4.09509039E-03    3    -1000024        14       -13   # BR(~chi_20 -> ~chi_1- nu_mu   mu+)
#
#         PDG            Width
DECAY   1000025     5.74051521E+01   # neutralino3 decays
#          BR         NDA      ID1       ID2
     2.39779979E-02    2     1000022        23   # BR(~chi_30 -> ~chi_10   Z )
     4.49820379E-02    2     1000023        23   # BR(~chi_30 -> ~chi_20   Z )
     6.72522101E-02    2     1000024       -24   # BR(~chi_30 -> ~chi_1+   W-)
     6.72522101E-02    2    -1000024        24   # BR(~chi_30 -> ~chi_1-   W+)
     4.39867299E-02    2     1000022        25   # BR(~chi_30 -> ~chi_10   h )
     1.08788584E-03    2     1000022        35   # BR(~chi_30 -> ~chi_10   H )
     2.32481234E-05    2     1000022        36   # BR(~chi_30 -> ~chi_10   A )
     2.34861099E-02    2     1000023        25   # BR(~chi_30 -> ~chi_20   h )
     1.54705698E-05    2     1000023        35   # BR(~chi_30 -> ~chi_20   H )
     9.52897544E-04    2     1000023        36   # BR(~chi_30 -> ~chi_20   A )
     8.90810723E-04    2     1000024       -37   # BR(~chi_30 -> ~chi_1+   H-)
     8.90810723E-04    2    -1000024        37   # BR(~chi_30 -> ~chi_1-   H+)
     2.00634800E-09    2     2000001        -1   # BR(~chi_30 -> ~d_R      db)
     2.00634800E-09    2    -2000001         1   # BR(~chi_30 -> ~d_R*     d )
     2.00634800E-09    2     2000003        -3   # BR(~chi_30 -> ~s _R      sb)
     2.00634800E-09    2    -2000003         3   # BR(~chi_30 -> ~s _R*     s )
     5.59588277E-02    2     1000006        -6   # BR(~chi_30 -> ~t_1      tb)
     5.59588277E-02    2    -1000006         6   # BR(~chi_30 -> ~t_1*     t )
     1.73071607E-05    2     1000005        -5   # BR(~chi_30 -> ~b_1      bb)
     1.73071607E-05    2    -1000005         5   # BR(~chi_30 -> ~b_1*     b )
     5.97698531E-02    2     2000005        -5   # BR(~chi_30 -> ~b_2      bb)
     5.97698531E-02    2    -2000005         5   # BR(~chi_30 -> ~b_2*     b )
     5.99733893E-02    2     1000011       -11   # BR(~chi_30 -> ~e_L-     e+)
     5.99733893E-02    2    -1000011        11   # BR(~chi_30 -> ~e_L+     e-)
     1.22954038E-09    2     2000011       -11   # BR(~chi_30 -> ~e_R-     e+)
     1.22954038E-09    2    -2000011        11   # BR(~chi_30 -> ~e_R+     e-)
     5.99733893E-02    2     1000013       -13   # BR(~chi_30 -> ~mu_L-    mu+)
     5.99733893E-02    2    -1000013        13   # BR(~chi_30 -> ~mu_L+    mu-)
     1.22954038E-09    2     2000013       -13   # BR(~chi_30 -> ~mu_R-    mu+)
     1.22954038E-09    2    -2000013        13   # BR(~chi_30 -> ~mu_R+    mu-)
     3.16588370E-03    2     1000015       -15   # BR(~chi_30 -> ~tau_1-   tau+)
     3.16588370E-03    2    -1000015        15   # BR(~chi_30 -> ~tau_1+   tau-)
     6.02566779E-02    2     1000012       -12   # BR(~chi_30 -> ~nu_eL    nu_eb)
     6.02566779E-02    2    -1000012        12   # BR(~chi_30 -> ~nu_eL*   nu_e )
     6.02566779E-02    2     1000014       -14   # BR(~chi_30 -> ~nu_muL   nu_mub)
     6.02566779E-02    2    -1000014        14   # BR(~chi_30 -> ~nu_muL*  nu_mu )
     3.22877780E-03    2     1000016       -16   # BR(~chi_30 -> ~nu_tau1  nu_taub)
     3.22877780E-03    2    -1000016        16   # BR(~chi_30 -> ~nu_tau1* nu_tau )
#
#         PDG            Width
DECAY   1000035     6.65397793E+01   # neutralino4 decays
#          BR         NDA      ID1       ID2
     1.45355112E-02    2     1000022        23   # BR(~chi_40 -> ~chi_10   Z )
     1.22385176E-02    2     1000023        23   # BR(~chi_40 -> ~chi_20   Z )
     1.01623035E-05    2     1000025        23   # BR(~chi_40 -> ~chi_30   Z )
     2.60300337E-02    2     1000024       -24   # BR(~chi_40 -> ~chi_1+   W-)
     2.60300337E-02    2    -1000024        24   # BR(~chi_40 -> ~chi_1-   W+)
     1.05527418E-05    2     1000037       -24   # BR(~chi_40 -> ~chi_2+   W-)
     1.05527418E-05    2    -1000037        24   # BR(~chi_40 -> ~chi_2-   W+)
     1.31929590E-02    2     1000022        25   # BR(~chi_40 -> ~chi_10   h )
     5.02189377E-03    2     1000022        35   # BR(~chi_40 -> ~chi_10   H )
     9.14205908E-03    2     1000022        36   # BR(~chi_40 -> ~chi_10   A )
     1.59650192E-02    2     1000023        25   # BR(~chi_40 -> ~chi_20   h )
     9.08498948E-03    2     1000023        35   # BR(~chi_40 -> ~chi_20   H )
     4.96098400E-03    2     1000023        36   # BR(~chi_40 -> ~chi_20   A )
     6.54292812E-07    2     1000025        25   # BR(~chi_40 -> ~chi_30   h )
     1.40452343E-02    2     1000024       -37   # BR(~chi_40 -> ~chi_1+   H-)
     1.40452343E-02    2    -1000024        37   # BR(~chi_40 -> ~chi_1-   H+)
     2.38320953E-02    2     2000002        -2   # BR(~chi_40 -> ~u_R      ub)
     2.38320953E-02    2    -2000002         2   # BR(~chi_40 -> ~u_R*     u )
     2.90039373E-02    2     2000001        -1   # BR(~chi_40 -> ~d_R      db)
     2.90039373E-02    2    -2000001         1   # BR(~chi_40 -> ~d_R*     d )
     2.38320401E-02    2     2000004        -4   # BR(~chi_40 -> ~c_R      cb)
     2.38320401E-02    2    -2000004         4   # BR(~chi_40 -> ~c_R*     c )
     2.90039373E-02    2     2000003        -3   # BR(~chi_40 -> ~s _R      sb)
     2.90039373E-02    2    -2000003         3   # BR(~chi_40 -> ~s _R*     s )
     6.47089277E-03    2     1000006        -6   # BR(~chi_40 -> ~t_1      tb)
     6.47089277E-03    2    -1000006         6   # BR(~chi_40 -> ~t_1*     t )
     3.21968098E-02    2     1000005        -5   # BR(~chi_40 -> ~b_1      bb)
     3.21968098E-02    2    -1000005         5   # BR(~chi_40 -> ~b_1*     b )
     6.52682285E-03    2     2000005        -5   # BR(~chi_40 -> ~b_2      bb)
     6.52682285E-03    2    -2000005         5   # BR(~chi_40 -> ~b_2*     b )
     2.81418538E-02    2     1000011       -11   # BR(~chi_40 -> ~e_L-     e+)
     2.81418538E-02    2    -1000011        11   # BR(~chi_40 -> ~e_L+     e-)
     6.04527186E-02    2     2000011       -11   # BR(~chi_40 -> ~e_R-     e+)
     6.04527186E-02    2    -2000011        11   # BR(~chi_40 -> ~e_R+     e-)
     2.81418538E-02    2     1000013       -13   # BR(~chi_40 -> ~mu_L-    mu+)
     2.81418538E-02    2    -1000013        13   # BR(~chi_40 -> ~mu_L+    mu-)
     6.04527186E-02    2     2000013       -13   # BR(~chi_40 -> ~mu_R-    mu+)
     6.04527186E-02    2    -2000013        13   # BR(~chi_40 -> ~mu_R+    mu-)
     1.35886671E-02    2     1000015       -15   # BR(~chi_40 -> ~tau_1-   tau+)
     1.35886671E-02    2    -1000015        15   # BR(~chi_40 -> ~tau_1+   tau-)
     6.08997802E-03    2     2000015       -15   # BR(~chi_40 -> ~tau_2-   tau+)
     6.08997802E-03    2    -2000015        15   # BR(~chi_40 -> ~tau_2+   tau-)
     2.82300516E-02    2     1000012       -12   # BR(~chi_40 -> ~nu_eL    nu_eb)
     2.82300516E-02    2    -1000012        12   # BR(~chi_40 -> ~nu_eL*   nu_e )
     2.82300516E-02    2     1000014       -14   # BR(~chi_40 -> ~nu_muL   nu_mub)
     2.82300516E-02    2    -1000014        14   # BR(~chi_40 -> ~nu_muL*  nu_mu )
     1.36433756E-02    2     1000016       -16   # BR(~chi_40 -> ~nu_tau1  nu_taub)
     1.36433756E-02    2    -1000016        16   # BR(~chi_40 -> ~nu_tau1* nu_tau )
#
#         PDG            Width
DECAY        25     4.12901098E-03   # h decays
#          BR         NDA      ID1       ID2
     6.06605006E-01    2           5        -5   # BR(h -> b       bb     )
     6.37851085E-02    2         -15        15   # BR(h -> tau+    tau-   )
     2.25709250E-04    2         -13        13   # BR(h -> mu+     mu-    )
     2.46445011E-04    2           3        -3   # BR(h -> s       sb     )
     2.09955503E-02    2           4        -4   # BR(h -> c       cb     )
     7.74382059E-02    2          21        21   # BR(h -> g       g      )
     2.26989046E-03    2          22        22   # BR(h -> gam     gam    )
     1.50443746E-03    2          22        23   # BR(h -> Z       gam    )
     2.01732712E-01    2          24       -24   # BR(h -> W+      W-     )
     2.51969346E-02    2          23        23   # BR(h -> Z       Z      )
#
#         PDG            Width
DECAY        35     1.94343224E+01   # H decays
#          BR         NDA      ID1       ID2
     8.42514756E-01    2           5        -5   # BR(H -> b       bb     )
     1.49542093E-01    2         -15        15   # BR(H -> tau+    tau-   )
     5.11593423E-04    2         -13        13   # BR(H -> mu+     mu-    )
     3.62123033E-04    2           3        -3   # BR(H -> s       sb     )
     4.49193099E-08    2           4        -4   # BR(H -> c       cb     )
     4.29348090E-03    2           6        -6   # BR(H -> t       tb     )
     3.18468142E-05    2          21        21   # BR(H -> g       g      )
     4.17632014E-08    2          22        22   # BR(H -> gam     gam    )
     1.61030326E-08    2          23        22   # BR(H -> Z       gam    )
     7.46355887E-06    2          24       -24   # BR(H -> W+      W-     )
     3.71265536E-06    2          23        23   # BR(H -> Z       Z      )
     2.56700988E-05    2          25        25   # BR(H -> h       h      )
     2.28682167E-03    2     1000024  -1000024   # BR(H -> ~chi_1+ ~chi_1-)
     2.58907038E-04    2     1000022   1000022   # BR(H -> ~chi_10 ~chi_10)
     1.32287663E-04    2     1000023   1000023   # BR(H -> ~chi_20 ~chi_20)
     2.19192985E-05    2     1000022   1000023   # BR(H -> ~chi_10 ~chi_20)
     8.45564287E-07    2     1000011  -1000011   # BR(H -> ~e_L-   ~e_L+  )
     8.45564287E-07    2     1000013  -1000013   # BR(H -> ~mu_L-  ~mu_L+ )
     2.76537170E-06    2     1000012  -1000012   # BR(H -> ~nu_eL  ~nu_eL*   )
     2.76537170E-06    2     1000014  -1000014   # BR(H -> ~nu_muL ~nu_muL*  )
#
#         PDG            Width
DECAY        36     1.94424803E+01   # A decays
#          BR         NDA      ID1       ID2
     8.42209404E-01    2           5        -5   # BR(A -> b       bb     )
     1.49481836E-01    2         -15        15   # BR(A -> tau+    tau-   )
     5.11385130E-04    2         -13        13   # BR(A -> mu+     mu-    )
     3.62005678E-04    2           3        -3   # BR(A -> s       sb     )
     4.44843442E-08    2           4        -4   # BR(A -> c       cb     )
     4.34653872E-03    2           6        -6   # BR(A -> t       tb     )
     8.31430747E-05    2          21        21   # BR(A -> g       g      )
     1.32179554E-07    2          22        22   # BR(A -> gam     gam    )
     4.83187033E-08    2          23        22   # BR(A -> Z       gam    )
     7.49745203E-06    2          23        25   # BR(A -> Z       h      )
     2.54018738E-03    2     1000024  -1000024   # BR(A -> ~chi_1+ ~chi_1-)
     3.22355873E-04    2     1000022   1000022   # BR(A -> ~chi_10 ~chi_10)
     1.25526938E-04    2     1000023   1000023   # BR(A -> ~chi_20 ~chi_20)
     9.89518540E-06    2     1000022   1000023   # BR(A -> ~chi_10 ~chi_20)
#
#         PDG            Width
DECAY        37     1.86375247E+01   # H+ decays
#          BR         NDA      ID1       ID2
     1.41392464E-03    2           4        -5   # BR(H+ -> c       bb     )
     1.56152896E-01    2         -15        16   # BR(H+ -> tau+    nu_tau )
     5.34207172E-04    2         -13        14   # BR(H+ -> mu+     nu_mu  )
     1.41391945E-05    2           2        -5   # BR(H+ -> u       bb     )
     1.88722640E-05    2           2        -3   # BR(H+ -> u       sb     )
     3.71507728E-04    2           4        -3   # BR(H+ -> c       sb     )
     8.40580630E-01    2           6        -5   # BR(H+ -> t       bb     )
     7.87031476E-06    2          24        25   # BR(H+ -> W+      h      )
     4.43684727E-12    2          24        36   # BR(H+ -> W+      A      )
     3.25362072E-04    2     1000024   1000022   # BR(H+ -> ~chi_1+ ~chi_10)
     5.73712192E-04    2     1000024   1000023   # BR(H+ -> ~chi_1+ ~chi_20)
     3.43918933E-06    2    -1000011   1000012   # BR(H+ -> ~e_L+   ~nu_eL )
     3.43918933E-06    2    -1000013   1000014   # BR(H+ -> ~mu_L+  ~nu_muL)
