#
#                              ======================
#                              | THE SUSYHIT OUTPUT |
#                              ======================
#
#
#              ------------------------------------------------------
#              |     This is the output of the SUSY-HIT package     |
#              |  created by A.Djouadi, M.Muehlleitner and M.Spira. |
#              |  In case of problems with SUSY-HIT email to        |
#              |           margarete.muehlleitner@cern.ch           |
#              |           michael.spira@psi.ch                     |
#              |           abdelhak.djouadi@cern.ch                 |
#              ------------------------------------------------------
#
#              ------------------------------------------------------
#              |  SUSY Les Houches Accord - MSSM Spectrum + Decays  |
#              |              based on the decay programs           |
#              |                                                    |
#              |                     SDECAY 1.3b                    |
#              |                                                    |
#              |  Authors: M.Muhlleitner, A.Djouadi and Y.Mambrini  |
#              |  Ref.:    Comput.Phys.Commun.168(2005)46           |
#              |           [hep-ph/0311167]                         |
#              |                                                    |
#              |                     HDECAY 3.4                     |
#              |                                                    |
#              |  By: A.Djouadi,J.Kalinowski,M.Muhlleitner,M.Spira  |
#              |  Ref.:    Comput.Phys.Commun.108(1998)56           |
#              |           [hep-ph/9704448]                         |
#              |                                                    |
#              |                                                    |
#              |  If not stated otherwise all DRbar couplings and   |
#              |  soft SUSY breaking masses are given at the scale  |
#              |  Q=  0.26097340E+04
#              |                                                    |
#              ------------------------------------------------------
#
#
BLOCK DCINFO  # Decay Program information
     1   SDECAY/HDECAY # decay calculator
     2   1.3b  /3.4    # version number
#
BLOCK SPINFO  # Spectrum calculator information
     1     SOFTSUSY    # spectrum calculator               
     2     3.4.0       # version number                    
#
BLOCK MODSEL  # Model selection
     1     0   #  nonUniversal                                     
#
BLOCK SMINPUTS  # Standard Model inputs
         1     1.27908970E+02   # alpha_em^-1(M_Z)^MSbar
         2     1.16637870E-05   # G_F [GeV^-2]
         3     1.18400000E-01   # alpha_S(M_Z)^MSbar
         4     9.11876000E+01   # M_Z pole mass
         5     4.18000000E+00   # mb(mb)^MSbar
         6     1.73200000E+02   # mt pole mass
         7     1.77700000E+00   # mtau pole mass
#
BLOCK MINPAR  # Input parameters - minimal models
         3     3.34600000E+01   # tanb                
#
BLOCK EXTPAR  # Input parameters - non-minimal models
         0    -1.00000000E+00   # Set                 
         1     1.59195000E+03   # M_1(MX)             
         2     1.47148000E+03   # M_2(MX)             
         3     1.45015000E+03   # M_3(MX)             
        11    -3.95692000E+03   # At(MX)              
        12     3.16026000E+03   # Ab(MX)              
        13    -3.11730000E+02   # Atau(MX)            
        23     3.11780000E+02   # mu(MX)              
        26     3.02578000E+03   # mA(pole)            
        31     2.68174000E+03   # meL(MX)             
        32     2.68174000E+03   # mmuL(MX)            
        33     2.75635000E+03   # mtauL(MX)           
        34     8.14260000E+02   # meR(MX)             
        35     8.14260000E+02   # mmuR(MX)            
        36     1.88774000E+03   # mtauR(MX)           
        41     3.99076000E+03   # mqL1(MX)            
        42     3.99076000E+03   # mqL2(MX)            
        43     2.18398000E+03   # mqL3(MX)            
        44     1.62326000E+03   # muR(MX)             
        45     1.62326000E+03   # mcR(MX)             
        46     3.12037000E+03   # mtR(MX)             
        47     1.65881000E+03   # mdR(MX)             
        48     1.65881000E+03   # msR(MX)             
        49     2.26297000E+03   # mbR(MX)             
#
BLOCK MASS  # Mass Spectrum
# PDG code           mass       particle
        24     8.03855896E+01   # W+
        25     1.27721470E+02   # h
        35     3.02578490E+03   # H
        36     3.02578002E+03   # A
        37     3.02695792E+03   # H+
         5     4.81876030E+00   # b-quark pole mass calculated from mb(mb)_Msbar
   1000001     4.03793231E+03   # ~d_L
   2000001     1.73009000E+03   # ~d_R
   1000002     4.03728025E+03   # ~u_L
   2000002     1.69303160E+03   # ~u_R
   1000003     4.03793231E+03   # ~s_L
   2000003     1.73009000E+03   # ~s_R
   1000004     4.03728025E+03   # ~c_L
   2000004     1.69303160E+03   # ~c_R
   1000005     2.20807427E+03   # ~b_1
   2000005     2.29970593E+03   # ~b_2
   1000006     2.19585251E+03   # ~t_1
   2000006     3.09228853E+03   # ~t_2
   1000011     2.69019755E+03   # ~e_L
   2000011     8.38873196E+02   # ~e_R
   1000012     2.68870374E+03   # ~nu_eL
   1000013     2.69019755E+03   # ~mu_L
   2000013     8.38873196E+02   # ~mu_R
   1000014     2.68870374E+03   # ~nu_muL
   1000015     1.89090120E+03   # ~tau_1
   2000015     2.76119368E+03   # ~tau_2
   1000016     2.75971274E+03   # ~nu_tauL
   1000021     1.65351384E+03   # ~g
   1000022     3.22255749E+02   # ~chi_10
   1000023    -3.28156929E+02   # ~chi_20
   1000025     1.52498964E+03   # ~chi_30
   1000035     1.56915586E+03   # ~chi_40
   1000024     3.25106314E+02   # ~chi_1+
   1000037     1.52529297E+03   # ~chi_2+
#
BLOCK NMIX  # Neutralino Mixing Matrix
  1  1     2.54877101E-02   # N_11
  1  2    -4.81064702E-02   # N_12
  1  3     7.09815118E-01   # N_13
  1  4    -7.02281028E-01   # N_14
  2  1    -1.58677827E-02   # N_21
  2  2     2.97671694E-02   # N_22
  2  3     7.04230026E-01   # N_23
  2  4     7.09170078E-01   # N_24
  3  1     3.76539573E-02   # N_31
  3  2     9.97752461E-01   # N_32
  3  3     1.29466407E-02   # N_33
  3  4    -5.38942575E-02   # N_34
  4  1     9.98839712E-01   # N_41
  4  2    -3.59125347E-02   # N_42
  4  3    -7.41308647E-03   # N_43
  4  4     3.12180460E-02   # N_44
#
BLOCK UMIX  # Chargino Mixing Matrix U
  1  1    -1.87547167E-02   # U_11
  1  2     9.99824115E-01   # U_12
  2  1    -9.99824115E-01   # U_21
  2  2    -1.87547167E-02   # U_22
#
BLOCK VMIX  # Chargino Mixing Matrix V
  1  1    -7.80305693E-02   # V_11
  1  2     9.96950967E-01   # V_12
  2  1    -9.96950967E-01   # V_21
  2  2    -7.80305693E-02   # V_22
#
BLOCK STOPMIX  # Stop Mixing Matrix
  1  1     9.92598106E-01   # cos(theta_t)
  1  2     1.21445461E-01   # sin(theta_t)
  2  1    -1.21445461E-01   # -sin(theta_t)
  2  2     9.92598106E-01   # cos(theta_t)
#
BLOCK SBOTMIX  # Sbottom Mixing Matrix
  1  1     9.99186802E-01   # cos(theta_b)
  1  2     4.03204007E-02   # sin(theta_b)
  2  1    -4.03204007E-02   # -sin(theta_b)
  2  2     9.99186802E-01   # cos(theta_b)
#
BLOCK STAUMIX  # Stau Mixing Matrix
  1  1     4.76435356E-03   # cos(theta_tau)
  1  2     9.99988650E-01   # sin(theta_tau)
  2  1    -9.99988650E-01   # -sin(theta_tau)
  2  2     4.76435356E-03   # cos(theta_tau)
#
BLOCK ALPHA  # Higgs mixing
          -3.08663684E-02   # Mixing angle in the neutral Higgs boson sector
#
BLOCK HMIX Q=  2.60973400E+03  # DRbar Higgs Parameters
         1     3.17818056E+02   # mu(Q)MSSM           
         2     3.24702825E+01   # tan                 
         3     2.42176190E+02   # higgs               
         4     9.54571714E+06   # mA^2(Q)MSSM         
#
BLOCK GAUGE Q=  2.60973400E+03  # The gauge couplings
     1     3.65090186E-01   # gprime(Q) DRbar
     2     6.38134533E-01   # g(Q) DRbar
     3     1.02521472E+00   # g3(Q) DRbar
#
BLOCK AU Q=  2.60973400E+03  # The trilinear couplings
  1  1     0.00000000E+00   # A_u(Q) DRbar
  2  2     0.00000000E+00   # A_c(Q) DRbar
  3  3    -3.95691999E+03   # A_t(Q) DRbar
#
BLOCK AD Q=  2.60973400E+03  # The trilinear couplings
  1  1     0.00000000E+00   # A_d(Q) DRbar
  2  2     0.00000000E+00   # A_s(Q) DRbar
  3  3     3.16026000E+03   # A_b(Q) DRbar
#
BLOCK AE Q=  2.60973400E+03  # The trilinear couplings
  1  1     0.00000000E+00   # A_e(Q) DRbar
  2  2     0.00000000E+00   # A_mu(Q) DRbar
  3  3    -3.11729999E+02   # A_tau(Q) DRbar
#
BLOCK Yu Q=  2.60973400E+03  # The Yukawa couplings
  1  1     0.00000000E+00   # y_u(Q) DRbar
  2  2     0.00000000E+00   # y_c(Q) DRbar
  3  3     8.21968545E-01   # y_t(Q) DRbar
#
BLOCK Yd Q=  2.60973400E+03  # The Yukawa couplings
  1  1     0.00000000E+00   # y_d(Q) DRbar
  2  2     0.00000000E+00   # y_s(Q) DRbar
  3  3     4.44350879E-01   # y_b(Q) DRbar
#
BLOCK Ye Q=  2.60973400E+03  # The Yukawa couplings
  1  1     0.00000000E+00   # y_e(Q) DRbar
  2  2     0.00000000E+00   # y_mu(Q) DRbar
  3  3     3.36820354E-01   # y_tau(Q) DRbar
#
BLOCK MSOFT Q=  2.60973400E+03  # The soft SUSY breaking masses at the scale Q
         1     1.59195000E+03   # M_1(Q)              
         2     1.47148000E+03   # M_2(Q)              
         3     1.45015000E+03   # M_3(Q)              
        21     9.16958031E+06   # mH1^2(Q)            
        22     5.12115599E+03   # mH2^2(Q)            
        31     2.68174000E+03   # meL(Q)              
        32     2.68174000E+03   # mmuL(Q)             
        33     2.75635000E+03   # mtauL(Q)            
        34     8.14260000E+02   # meR(Q)              
        35     8.14260000E+02   # mmuR(Q)             
        36     1.88774000E+03   # mtauR(Q)            
        41     3.99076000E+03   # mqL1(Q)             
        42     3.99076000E+03   # mqL2(Q)             
        43     2.18397999E+03   # mqL3(Q)             
        44     1.62326000E+03   # muR(Q)              
        45     1.62326000E+03   # mcR(Q)              
        46     3.12036999E+03   # mtR(Q)              
        47     1.65881000E+03   # mdR(Q)              
        48     1.65881000E+03   # msR(Q)              
        49     2.26297000E+03   # mbR(Q)              
#
Block HiggsBoundsInputHiggsCouplingsFermions
# ScalarNormEffCoupSq PseudoSNormEffCoupSq NP   IP1 IP2 IP2
    1.00511789E+00    0.00000000E+00        3  25   5   5  # h0-b-b eff. coupling^2, normalised to SM
    1.05431413E+03    0.00000000E+00        3  35   5   5  # H0-b-b eff. coupling^2, normalised to SM
    0.00000000E+00    1.05431925E+03        3  36   5   5  # A0-b-b eff. coupling^2, normalised to SM
#
    9.99995146E-01    0.00000000E+00        3  25   6   6  # h0-t-t eff. coupling^2, normalised to SM
    9.53333530E-04    0.00000000E+00        3  35   6   6  # H0-t-t eff. coupling^2, normalised to SM
    0.00000000E+00    9.48479319E-04        3  36   6   6  # A0-t-t eff. coupling^2, normalised to SM
#
    1.00511789E+00    0.00000000E+00        3  25  15  15  # h0-tau-tau eff. coupling^2, normalised to SM
    1.05431413E+03    0.00000000E+00        3  35  15  15  # H0-tau-tau eff. coupling^2, normalised to SM
    0.00000000E+00    1.05431925E+03        3  36  15  15  # A0-tau-tau eff. coupling^2, normalised to SM
#
Block HiggsBoundsInputHiggsCouplingsBosons
    9.99999994E-01        3  25  24  24  # h0-W-W eff. coupling^2, normalised to SM
    6.19500100E-09        3  35  24  24  # H0-W-W eff. coupling^2, normalised to SM
    0.00000000E+00        3  36  24  24  # A0-W-W eff. coupling^2, normalised to SM
#
    9.99999994E-01        3  25  23  23  # h0-Z-Z eff. coupling^2, normalised to SM
    6.19500100E-09        3  35  23  23  # H0-Z-Z eff. coupling^2, normalised to SM
    0.00000000E+00        3  36  23  23  # A0-Z-Z eff. coupling^2, normalised to SM
#
    8.85909548E-01        3  25  21  21  # h0-g-g eff. coupling^2, normalised to SM
    2.98734643E-13        3  35  21  21  # H0-g-g eff. coupling^2, normalised to SM
    2.37110944E-12        3  36  21  21  # A0-g-g eff. coupling^2, normalised to SM
#
    0.00000000E+00        3  25  25  23  # h0-h0-Z eff. coupling^2, normalised to SM
    0.00000000E+00        3  35  25  23  # H0-h0-Z eff. coupling^2, normalised to SM
    6.19500100E-09        3  36  25  23  # A0-h0-Z eff. coupling^2, normalised to SM
    0.00000000E+00        3  35  35  23  # H0-H0-Z eff. coupling^2, normalised to SM
    9.99999994E-01        3  36  35  23  # A0-H0-Z eff. coupling^2, normalised to SM
    0.00000000E+00        3  36  36  23  # A0-A0-Z eff. coupling^2, normalised to SM
#
    0.00000000E+00        4  25  21  21  23  # h0-g-g-Z eff. coupling^2, normalised to SM
    0.00000000E+00        4  35  21  21  23  # H0-g-g-Z eff. coupling^2, normalised to SM
    0.00000000E+00        4  36  21  21  23  # A0-g-g-Z eff. coupling^2, normalised to SM
#
#
#
#                             =================
#                             |The decay table|
#                             =================
#
# - The QCD corrections to the decays gluino -> squark  + quark
#                                     squark -> gaugino + quark_prime
#                                     squark -> squark_prime + Higgs
#                                     squark -> gluino  + quark
#   are included.
#
# - The multi-body decays for the inos, stops and sbottoms are included.
#
# - The loop induced decays for the gluino, neutralinos and stops
#   are included.
#
# - The SUSY decays of the top quark are included.
#
#
#         PDG            Width
DECAY         6     1.43434540E+00   # top decays
#          BR         NDA      ID1       ID2
     1.00000000E+00    2           5        24   # BR(t ->  b    W+)
#
#         PDG            Width
DECAY   1000021     2.22012729E-02   # gluino decays
#          BR         NDA      ID1       ID2
     3.48251638E-03    2     1000022        21   # BR(~g -> ~chi_10 g)
     4.31729716E-03    2     1000023        21   # BR(~g -> ~chi_20 g)
     1.72448357E-08    2     1000025        21   # BR(~g -> ~chi_30 g)
     4.29152071E-07    2     1000035        21   # BR(~g -> ~chi_40 g)
#           BR         NDA      ID1       ID2       ID3
     6.18845517E-05    3     1000022         1        -1   # BR(~g -> ~chi_10 d  db)
     1.60886679E-05    3     1000023         1        -1   # BR(~g -> ~chi_20 d  db)
     3.73765476E-07    3     1000025         1        -1   # BR(~g -> ~chi_30 d  db)
     7.39223756E-06    3     1000035         1        -1   # BR(~g -> ~chi_40 d  db)
     2.49801816E-04    3     1000022         2        -2   # BR(~g -> ~chi_10 u  ub)
     7.03408669E-05    3     1000023         2        -2   # BR(~g -> ~chi_20 u  ub)
     8.19965779E-07    3     1000025         2        -2   # BR(~g -> ~chi_30 u  ub)
     6.74344416E-05    3     1000035         2        -2   # BR(~g -> ~chi_40 u  ub)
     6.18845517E-05    3     1000022         3        -3   # BR(~g -> ~chi_10 s  sb)
     1.60886679E-05    3     1000023         3        -3   # BR(~g -> ~chi_20 s  sb)
     3.73765476E-07    3     1000025         3        -3   # BR(~g -> ~chi_30 s  sb)
     7.39223756E-06    3     1000035         3        -3   # BR(~g -> ~chi_40 s  sb)
     2.49801816E-04    3     1000022         4        -4   # BR(~g -> ~chi_10 c  cb)
     7.03408669E-05    3     1000023         4        -4   # BR(~g -> ~chi_20 c  cb)
     8.19965779E-07    3     1000025         4        -4   # BR(~g -> ~chi_30 c  cb)
     6.74344416E-05    3     1000035         4        -4   # BR(~g -> ~chi_40 c  cb)
     9.67285879E-02    3     1000022         5        -5   # BR(~g -> ~chi_10 b  bb)
     9.42993189E-02    3     1000023         5        -5   # BR(~g -> ~chi_20 b  bb)
     1.06188446E-05    3     1000025         5        -5   # BR(~g -> ~chi_30 b  bb)
     2.25109215E-07    3     1000035         5        -5   # BR(~g -> ~chi_40 b  bb)
     1.46407177E-01    3     1000022         6        -6   # BR(~g -> ~chi_10 t  tb)
     1.43192395E-01    3     1000023         6        -6   # BR(~g -> ~chi_20 t  tb)
     2.99311344E-05    3     1000024         1        -2   # BR(~g -> ~chi_1+ d  ub)
     2.99311344E-05    3    -1000024         2        -1   # BR(~g -> ~chi_1- u  db)
     6.27647820E-07    3     1000037         1        -2   # BR(~g -> ~chi_2+ d  ub)
     6.27647820E-07    3    -1000037         2        -1   # BR(~g -> ~chi_2- u  db)
     2.99311344E-05    3     1000024         3        -4   # BR(~g -> ~chi_1+ s  cb)
     2.99311344E-05    3    -1000024         4        -3   # BR(~g -> ~chi_1- c  sb)
     6.27647820E-07    3     1000037         3        -4   # BR(~g -> ~chi_2+ s  cb)
     6.27647820E-07    3    -1000037         4        -3   # BR(~g -> ~chi_2- c  sb)
     2.55245455E-01    3     1000024         5        -6   # BR(~g -> ~chi_1+ b  tb)
     2.55245455E-01    3    -1000024         6        -5   # BR(~g -> ~chi_1- t  bb)
#
#         PDG            Width
DECAY   1000006     6.68846502E+01   # stop1 decays
#          BR         NDA      ID1       ID2
     2.06818965E-01    2     1000022         6   # BR(~t_1 -> ~chi_10 t )
     2.12416365E-01    2     1000023         6   # BR(~t_1 -> ~chi_20 t )
     3.48020644E-02    2     1000025         6   # BR(~t_1 -> ~chi_30 t )
     8.96742134E-04    2     1000035         6   # BR(~t_1 -> ~chi_40 t )
     1.35312679E-01    2     1000024         5   # BR(~t_1 -> ~chi_1+ b )
     6.80595439E-02    2     1000037         5   # BR(~t_1 -> ~chi_2+ b )
     3.41693642E-01    2     1000021         6   # BR(~t_1 -> ~g      t )
#
#         PDG            Width
DECAY   2000006     2.33566272E+02   # stop2 decays
#          BR         NDA      ID1       ID2
     8.45466573E-02    2     1000022         6   # BR(~t_2 -> ~chi_10 t )
     8.60774742E-02    2     1000023         6   # BR(~t_2 -> ~chi_20 t )
     1.45571152E-03    2     1000025         6   # BR(~t_2 -> ~chi_30 t )
     1.71967501E-02    2     1000035         6   # BR(~t_2 -> ~chi_40 t )
     1.68663579E-01    2     1000024         5   # BR(~t_2 -> ~chi_1+ b )
     2.99543127E-03    2     1000037         5   # BR(~t_2 -> ~chi_2+ b )
     3.64249593E-01    2     1000021         6   # BR(~t_2 -> ~g      t )
     6.75031253E-02    2     1000006        25   # BR(~t_2 -> ~t_1    h )
     7.13109472E-02    2     1000006        23   # BR(~t_2 -> ~t_1    Z )
     1.35833533E-01    2     1000005        24   # BR(~t_2 -> ~b_1    W+)
     1.67198236E-04    2     2000005        24   # BR(~t_2 -> ~b_2    W+)
#
#         PDG            Width
DECAY   1000005     6.73300820E+01   # sbottom1 decays
#          BR         NDA      ID1       ID2
     6.29650576E-02    2     1000022         5   # BR(~b_1 -> ~chi_10 b )
     6.09559818E-02    2     1000023         5   # BR(~b_1 -> ~chi_20 b )
     3.55712546E-02    2     1000025         5   # BR(~b_1 -> ~chi_30 b )
     1.66250574E-03    2     1000035         5   # BR(~b_1 -> ~chi_40 b )
     4.13116100E-01    2    -1000024         6   # BR(~b_1 -> ~chi_1- t )
     7.27516963E-02    2    -1000037         6   # BR(~b_1 -> ~chi_2- t )
     3.52977404E-01    2     1000021         5   # BR(~b_1 -> ~g      b )
#
#         PDG            Width
DECAY   2000005     4.75926874E+01   # sbottom2 decays
#          BR         NDA      ID1       ID2
     9.12699895E-02    2     1000022         5   # BR(~b_2 -> ~chi_10 b )
     9.07475644E-02    2     1000023         5   # BR(~b_2 -> ~chi_20 b )
     1.81812309E-04    2     1000025         5   # BR(~b_2 -> ~chi_30 b )
     8.13160863E-03    2     1000035         5   # BR(~b_2 -> ~chi_40 b )
     1.80983462E-01    2    -1000024         6   # BR(~b_2 -> ~chi_1- t )
     3.48193376E-04    2    -1000037         6   # BR(~b_2 -> ~chi_2- t )
     6.28292524E-01    2     1000021         5   # BR(~b_2 -> ~g      b )
     6.07019163E-08    2     1000005        23   # BR(~b_2 -> ~b_1    Z )
     4.47849483E-05    2     1000006       -24   # BR(~b_2 -> ~t_1    W-)
#
#         PDG            Width
DECAY   1000002     2.36007651E+02   # sup_L decays
#          BR         NDA      ID1       ID2
     1.23725722E-04    2     1000022         2   # BR(~u_L -> ~chi_10 u)
     4.72857981E-05    2     1000023         2   # BR(~u_L -> ~chi_20 u)
     4.98361965E-02    2     1000025         2   # BR(~u_L -> ~chi_30 u)
     1.15620788E-03    2     1000035         2   # BR(~u_L -> ~chi_40 u)
     8.05445506E-04    2     1000024         1   # BR(~u_L -> ~chi_1+ d)
     9.80823105E-02    2     1000037         1   # BR(~u_L -> ~chi_2+ d)
     8.49948828E-01    2     1000021         2   # BR(~u_L -> ~g      u)
#
#         PDG            Width
DECAY   2000002     3.42725419E-01   # sup_R decays
#           BR         NDA      ID1       ID2
     6.72605074E-03    2     1000022         2   # BR(~u_R -> ~chi_10 u)
     2.59985425E-03    2     1000023         2   # BR(~u_R -> ~chi_20 u)
     7.54308498E-01    2     1000021         2   # BR(~u_R -> ~g      u)
     5.92598289E-04    2     1000025         2   # BR(~u_R -> ~chi_30 u)
     2.35772999E-01    2     1000035         2   # BR(~u_R -> ~chi_40 u)
#
#         PDG            Width
DECAY   1000001     2.36029164E+02   # sdown_L decays
#          BR         NDA      ID1       ID2
     1.85617475E-04    2     1000022         1   # BR(~d_L -> ~chi_10 d)
     7.11173668E-05    2     1000023         1   # BR(~d_L -> ~chi_20 d)
     4.84305741E-02    2     1000025         1   # BR(~d_L -> ~chi_30 d)
     2.48081531E-03    2     1000035         1   # BR(~d_L -> ~chi_40 d)
     4.65329731E-05    2    -1000024         2   # BR(~d_L -> ~chi_1- u)
     9.86660688E-02    2    -1000037         2   # BR(~d_L -> ~chi_2- u)
     8.50119274E-01    2     1000021         1   # BR(~d_L -> ~g      d)
#
#         PDG            Width
DECAY   2000001     9.63147535E-01   # sdown_R decays
#           BR         NDA      ID1       ID2
     6.11976010E-04    2     1000022         1   # BR(~d_R -> ~chi_10 d)
     2.36579371E-04    2     1000023         1   # BR(~d_R -> ~chi_20 d)
     9.65516499E-01    2     1000021         1   # BR(~d_R -> ~g      d)
     7.46878209E-05    2     1000025         1   # BR(~d_R -> ~chi_30 d)
     3.35602574E-02    2     1000035         1   # BR(~d_R -> ~chi_40 d)
#
#         PDG            Width
DECAY   1000004     1.92480871E+02   # scharm_L decays
#          BR         NDA      ID1       ID2
     1.56877881E-04    2     1000022         4   # BR(~c_L -> ~chi_10 c)
     5.99550677E-05    2     1000023         4   # BR(~c_L -> ~chi_20 c)
     6.30650236E-02    2     1000025         4   # BR(~c_L -> ~chi_30 c)
     1.46300708E-03    2     1000035         4   # BR(~c_L -> ~chi_40 c)
     1.02125652E-03    2     1000024         3   # BR(~c_L -> ~chi_1+ s)
     1.24117870E-01    2     1000037         3   # BR(~c_L -> ~chi_2+ s)
     8.10116010E-01    2     1000021         4   # BR(~c_L -> ~g      c)
#
#         PDG            Width
DECAY   2000004     2.83463762E-01   # scharm_R decays
#           BR         NDA      ID1       ID2
     8.49480186E-03    2     1000022         4   # BR(~c_R -> ~chi_10 c)
     3.28334452E-03    2     1000023         4   # BR(~c_R -> ~chi_20 c)
     7.08365803E-01    2     1000021         4   # BR(~c_R -> ~g      c)
     7.10395173E-04    2     1000025         4   # BR(~c_R -> ~chi_30 c)
     2.79145656E-01    2     1000035         4   # BR(~c_R -> ~chi_40 c)
#
#         PDG            Width
DECAY   1000003     1.92487870E+02   # sstrange_L decays
#          BR         NDA      ID1       ID2
     2.35365995E-04    2     1000022         3   # BR(~s_L -> ~chi_10 s)
     9.01766264E-05    2     1000023         3   # BR(~s_L -> ~chi_20 s)
     6.12896304E-02    2     1000025         3   # BR(~s_L -> ~chi_30 s)
     3.13927009E-03    2     1000035         3   # BR(~s_L -> ~chi_40 s)
     5.90041318E-05    2    -1000024         4   # BR(~s_L -> ~chi_1- c)
     1.24863321E-01    2    -1000037         4   # BR(~s_L -> ~chi_2- c)
     8.10323232E-01    2     1000021         3   # BR(~s_L -> ~g      s)
#
#         PDG            Width
DECAY   2000003     7.55817487E-01   # sstrange_R decays
#           BR         NDA      ID1       ID2
     8.16508422E-04    2     1000022         3   # BR(~s_R -> ~chi_10 s)
     3.15629020E-04    2     1000023         3   # BR(~s_R -> ~chi_20 s)
     9.56426734E-01    2     1000021         3   # BR(~s_R -> ~g      s)
     9.51419962E-05    2     1000025         3   # BR(~s_R -> ~chi_30 s)
     4.23459866E-02    2     1000035         3   # BR(~s_R -> ~chi_40 s)
#
#         PDG            Width
DECAY   1000011     1.66294392E+01   # selectron_L decays
#          BR         NDA      ID1       ID2
     7.15483528E-04    2     1000022        11   # BR(~e_L -> ~chi_10 e-)
     2.72197152E-04    2     1000023        11   # BR(~e_L -> ~chi_20 e-)
     3.13570328E-01    2     1000025        11   # BR(~e_L -> ~chi_30 e-)
     8.18119614E-02    2     1000035        11   # BR(~e_L -> ~chi_40 e-)
     4.47613835E-04    2    -1000024        12   # BR(~e_L -> ~chi_1- nu_e)
     6.03182416E-01    2    -1000037        12   # BR(~e_L -> ~chi_2- nu_e)
#
#         PDG            Width
DECAY   2000011     2.96658064E-03   # selectron_R decays
#           BR         NDA      ID1       ID2
     7.07906703E-01    2     1000022        11   # BR(~e_R -> ~chi_10 e-)
     2.70876513E-01    2     1000023        11   # BR(~e_R -> ~chi_20 e-)
#           BR         NDA      ID1       ID2       ID3
     9.10442131E-04    3        11       23        1000022   # BR(~e_R- -> e-  Z  ~chi_10)
     3.74943457E-03    3        11       25        1000022   # BR(~e_R- -> e-  h  ~chi_10)
     3.55796834E-03    3        11       23        1000023   # BR(~e_R- -> e-  Z  ~chi_20)
     9.66904443E-04    3        11       25        1000023   # BR(~e_R- -> e-  h  ~chi_20)
     1.55970815E-03    3        11       -24        1000024   # BR(~e_R- -> e-  W-  ~chi_1+)
     1.04723261E-02    3        11       24        -1000024   # BR(~e_R- -> e-  W+  ~chi_1-)
#
#         PDG            Width
DECAY   1000013     1.66294391E+01   # smuon_L decays
#          BR         NDA      ID1       ID2
     7.15483528E-04    2     1000022        13   # BR(~mu_L -> ~chi_10 mu-)
     2.72197152E-04    2     1000023        13   # BR(~mu_L -> ~chi_20 mu-)
     3.13570327E-01    2     1000025        13   # BR(~mu_L -> ~chi_30 mu-)
     8.18119610E-02    2     1000035        13   # BR(~mu_L -> ~chi_40 mu-)
     4.47613836E-04    2    -1000024        14   # BR(~mu_L -> ~chi_1- nu_mu)
     6.03182418E-01    2    -1000037        14   # BR(~mu_L -> ~chi_2- nu_mu)
#
#         PDG            Width
DECAY   2000013     2.96673591E-03   # smuon_R decays
#           BR         NDA      ID1       ID2
     7.07869622E-01    2     1000022        13   # BR(~mu_R -> ~chi_10 mu-)
     2.70862324E-01    2     1000023        13   # BR(~mu_R -> ~chi_20 mu-)
#           BR         NDA      ID1       ID2       ID3
     9.13023633E-04    3        13       23        1000022   # BR(~mu_R- -> mu-  Z  ~chi_10)
     3.74923833E-03    3        13       25        1000022   # BR(~mu_R- -> mu-  h  ~chi_10)
     3.55677091E-03    3        13       23        1000023   # BR(~mu_R- -> mu-  Z  ~chi_20)
     9.66853837E-04    3        13       25        1000023   # BR(~mu_R- -> mu-  h  ~chi_20)
     1.55645805E-03    3        13       -24        1000024   # BR(~mu_R- -> mu-  W-  ~chi_1+)
     1.05257094E-02    3        13       24        -1000024   # BR(~mu_R- -> mu-  W+  ~chi_1-)
#
#         PDG            Width
DECAY   1000015     9.01813257E+00   # stau_1 decays
#          BR         NDA      ID1       ID2
     2.25710610E-01    2     1000022        15   # BR(~tau_1 -> ~chi_10  tau-)
     2.20876082E-01    2     1000023        15   # BR(~tau_1 -> ~chi_20  tau-)
     1.95289231E-04    2     1000025        15   # BR(~tau_1 -> ~chi_30  tau-)
     1.07556012E-01    2     1000035        15   # BR(~tau_1 -> ~chi_40  tau-)
     4.45656541E-01    2    -1000024        16   # BR(~tau_1 -> ~chi_1-  nu_tau)
     5.46654161E-06    2    -1000037        16   # BR(~tau_1 -> ~chi_2-  nu_tau)
#
#         PDG            Width
DECAY   2000015     2.40073395E+01   # stau_2 decays
#          BR         NDA      ID1       ID2
     1.27613599E-01    2     1000022        15   # BR(~tau_2 -> ~chi_10  tau-)
     1.25407661E-01    2     1000023        15   # BR(~tau_2 -> ~chi_20  tau-)
     2.33822298E-01    2     1000025        15   # BR(~tau_2 -> ~chi_30  tau-)
     6.12656774E-02    2     1000035        15   # BR(~tau_2 -> ~chi_40  tau-)
     2.38982446E-04    2    -1000024        16   # BR(~tau_2 -> ~chi_1-  nu_tau)
     4.49747168E-01    2    -1000037        16   # BR(~tau_2 -> ~chi_2-  nu_tau)
     9.57368450E-04    2     1000015        25   # BR(~tau_2 -> ~tau_1   h)
     9.47245735E-04    2     1000015        23   # BR(~tau_2 -> ~tau_1   Z)
#
#         PDG            Width
DECAY   1000012     1.66654975E+01   # snu_eL decays
#          BR         NDA      ID1       ID2
     2.49492425E-03    2     1000022        12   # BR(~nu_eL -> ~chi_10 nu_e)
     9.56960076E-04    2     1000023        12   # BR(~nu_eL -> ~chi_20 nu_e)
     2.86538063E-01    2     1000025        12   # BR(~nu_eL -> ~chi_30 nu_e)
     1.04821851E-01    2     1000035        12   # BR(~nu_eL -> ~chi_40 nu_e)
     7.72708740E-03    2     1000024        11   # BR(~nu_eL -> ~chi_1+ e-)
     5.97461114E-01    2     1000037        11   # BR(~nu_eL -> ~chi_2+ e-)
#
#         PDG            Width
DECAY   1000014     1.66654975E+01   # snu_muL decays
#          BR         NDA      ID1       ID2
     2.49492426E-03    2     1000022        14   # BR(~nu_muL -> ~chi_10 nu_mu)
     9.56960080E-04    2     1000023        14   # BR(~nu_muL -> ~chi_20 nu_mu)
     2.86538064E-01    2     1000025        14   # BR(~nu_muL -> ~chi_30 nu_mu)
     1.04821851E-01    2     1000035        14   # BR(~nu_muL -> ~chi_40 nu_mu)
     7.72708741E-03    2     1000024        13   # BR(~nu_muL -> ~chi_1+ mu-)
     5.97461112E-01    2     1000037        13   # BR(~nu_muL -> ~chi_2+ mu-)
#
#         PDG            Width
DECAY   1000016     2.40387823E+01   # snu_tauL decays
#          BR         NDA      ID1       ID2
     1.77798036E-03    2     1000022        16   # BR(~nu_tauL -> ~chi_10 nu_tau)
     6.82004947E-04    2     1000023        16   # BR(~nu_tauL -> ~chi_20 nu_tau)
     2.13839226E-01    2     1000025        16   # BR(~nu_tauL -> ~chi_30 nu_tau)
     7.85553829E-02    2     1000035        16   # BR(~nu_tauL -> ~chi_40 nu_tau)
     2.57371119E-01    2     1000024        15   # BR(~nu_tauL -> ~chi_1+ tau-)
     4.45941194E-01    2     1000037        15   # BR(~nu_tauL -> ~chi_2+ tau-)
     1.83309218E-03    2    -1000015       -24   # BR(~nu_tauL -> ~tau_1+ W-)
#
#         PDG            Width
DECAY   1000024     2.02311955E-10   # chargino1+ decays
#           BR         NDA      ID1       ID2       ID3
     3.68920232E-01    3     1000022         2        -1   # BR(~chi_1+ -> ~chi_10 u    db)
     3.68920232E-01    3     1000022         4        -3   # BR(~chi_1+ -> ~chi_10 c    sb)
     1.22973807E-01    3     1000022       -11        12   # BR(~chi_1+ -> ~chi_10 e+   nu_e)
     1.22973807E-01    3     1000022       -13        14   # BR(~chi_1+ -> ~chi_10 mu+  nu_mu)
     1.62119221E-02    3     1000022       -15        16   # BR(~chi_1+ -> ~chi_10 tau+ nu_tau)
#
#         PDG            Width
DECAY   1000037     1.24566102E+01   # chargino2+ decays
#          BR         NDA      ID1       ID2
     2.55886616E-01    2     1000024        23   # BR(~chi_2+ -> ~chi_1+  Z )
     2.45807598E-01    2     1000022        24   # BR(~chi_2+ -> ~chi_10  W+)
     2.50227901E-01    2     1000023        24   # BR(~chi_2+ -> ~chi_20  W+)
     2.48077885E-01    2     1000024        25   # BR(~chi_2+ -> ~chi_1+  h )
#
#         PDG            Width
DECAY   1000022     0.00000000E+00   # neutralino1 decays
#
#         PDG            Width
DECAY   1000023     6.74139590E-09   # neutralino2 decays
#          BR         NDA      ID1       ID2
     4.10148259E-02    2     1000022        22   # BR(~chi_20 -> ~chi_10 gam)
#           BR         NDA      ID1       ID2       ID3
     1.22675722E-01    3     1000022        -2         2   # BR(~chi_20 -> ~chi_10 ub      u)
     1.59269553E-01    3     1000022        -1         1   # BR(~chi_20 -> ~chi_10 db      d)
     1.22675722E-01    3     1000022        -4         4   # BR(~chi_20 -> ~chi_10 cb      c)
     1.59269553E-01    3     1000022        -3         3   # BR(~chi_20 -> ~chi_10 sb      s)
     3.66073608E-02    3     1000022       -11        11   # BR(~chi_20 -> ~chi_10 e+      e-)
     3.66073608E-02    3     1000022       -13        13   # BR(~chi_20 -> ~chi_10 mu+     mu-)
     1.79354061E-02    3     1000022       -15        15   # BR(~chi_20 -> ~chi_10 tau+    tau-)
     7.32024169E-02    3     1000022       -12        12   # BR(~chi_20 -> ~chi_10 nu_eb   nu_e)
     7.32024169E-02    3     1000022       -14        14   # BR(~chi_20 -> ~chi_10 nu_mub  nu_mu)
     7.32024007E-02    3     1000022       -16        16   # BR(~chi_20 -> ~chi_10 nu_taub nu_tau)
     1.54694962E-02    3     1000024        -2         1   # BR(~chi_20 -> ~chi_1+ ub      d)
     1.54694962E-02    3    -1000024        -1         2   # BR(~chi_20 -> ~chi_1- db      u)
     1.54694962E-02    3     1000024        -4         3   # BR(~chi_20 -> ~chi_1+ cb      s)
     1.54694962E-02    3    -1000024        -3         4   # BR(~chi_20 -> ~chi_1- sb      c)
     5.15650823E-03    3     1000024       -12        11   # BR(~chi_20 -> ~chi_1+ nu_eb   e-)
     5.15650823E-03    3    -1000024        12       -11   # BR(~chi_20 -> ~chi_1- nu_e    e+)
     5.15650823E-03    3     1000024       -14        13   # BR(~chi_20 -> ~chi_1+ nu_mub  mu-)
     5.15650823E-03    3    -1000024        14       -13   # BR(~chi_20 -> ~chi_1- nu_mu   mu+)
     9.16622116E-04    3     1000024       -16        15   # BR(~chi_20 -> ~chi_1+ nu_taub tau-)
     9.16622116E-04    3    -1000024        16       -15   # BR(~chi_20 -> ~chi_1- nu_tau  tau+)
#
#         PDG            Width
DECAY   1000025     1.24495193E+01   # neutralino3 decays
#          BR         NDA      ID1       ID2
     6.62795823E-02    2     1000022        23   # BR(~chi_30 -> ~chi_10   Z )
     1.78101474E-01    2     1000023        23   # BR(~chi_30 -> ~chi_20   Z )
     2.60523819E-01    2     1000024       -24   # BR(~chi_30 -> ~chi_1+   W-)
     2.60523819E-01    2    -1000024        24   # BR(~chi_30 -> ~chi_1-   W+)
     1.69783302E-01    2     1000022        25   # BR(~chi_30 -> ~chi_10   h )
     6.38920224E-02    2     1000023        25   # BR(~chi_30 -> ~chi_20   h )
     2.23995169E-04    2     2000011       -11   # BR(~chi_30 -> ~e_R-     e+)
     2.23995169E-04    2    -2000011        11   # BR(~chi_30 -> ~e_R+     e-)
     2.23995169E-04    2     2000013       -13   # BR(~chi_30 -> ~mu_R-    mu+)
     2.23995169E-04    2    -2000013        13   # BR(~chi_30 -> ~mu_R+    mu-)
#
#         PDG            Width
DECAY   1000035     1.24023041E+01   # neutralino4 decays
#          BR         NDA      ID1       ID2
     2.46798484E-02    2     1000022        23   # BR(~chi_40 -> ~chi_10   Z )
     6.56170263E-02    2     1000023        23   # BR(~chi_40 -> ~chi_20   Z )
     6.66061408E-02    2     1000024       -24   # BR(~chi_40 -> ~chi_1+   W-)
     6.66061408E-02    2    -1000024        24   # BR(~chi_40 -> ~chi_1-   W+)
     6.74871245E-02    2     1000022        25   # BR(~chi_40 -> ~chi_10   h )
     2.60569445E-02    2     1000023        25   # BR(~chi_40 -> ~chi_20   h )
     1.70736694E-01    2     2000011       -11   # BR(~chi_40 -> ~e_R-     e+)
     1.70736694E-01    2    -2000011        11   # BR(~chi_40 -> ~e_R+     e-)
     1.70736694E-01    2     2000013       -13   # BR(~chi_40 -> ~mu_R-    mu+)
     1.70736694E-01    2    -2000013        13   # BR(~chi_40 -> ~mu_R+    mu-)
#
#         PDG            Width
DECAY        25     4.49548758E-03   # h decays
#          BR         NDA      ID1       ID2
     5.58295382E-01    2           5        -5   # BR(h -> b       bb     )
     5.91109353E-02    2         -15        15   # BR(h -> tau+    tau-   )
     2.09219380E-04    2         -13        13   # BR(h -> mu+     mu-    )
     2.27397086E-04    2           3        -3   # BR(h -> s       sb     )
     1.96291854E-02    2           4        -4   # BR(h -> c       cb     )
     7.55410926E-02    2          21        21   # BR(h -> g       g      )
     2.29703469E-03    2          22        22   # BR(h -> gam     gam    )
     1.75872221E-03    2          22        23   # BR(h -> Z       gam    )
     2.50423696E-01    2          24       -24   # BR(h -> W+      W-     )
     3.25073356E-02    2          23        23   # BR(h -> Z       Z      )
#
#         PDG            Width
DECAY        35     6.46634821E+01   # H decays
#          BR         NDA      ID1       ID2
     5.46267883E-01    2           5        -5   # BR(H -> b       bb     )
     1.00291169E-01    2         -15        15   # BR(H -> tau+    tau-   )
     3.53966229E-04    2         -13        13   # BR(H -> mu+     mu-    )
     2.15821353E-04    2           3        -3   # BR(H -> s       sb     )
     1.82857960E-08    2           4        -4   # BR(H -> c       cb     )
     1.79737780E-03    2           6        -6   # BR(H -> t       tb     )
     7.56781063E-06    2          21        21   # BR(H -> g       g      )
     2.02596300E-08    2          22        22   # BR(H -> gam     gam    )
     4.25828560E-09    2          23        22   # BR(H -> Z       gam    )
     8.52831273E-07    2          24       -24   # BR(H -> W+      W-     )
     4.25480428E-07    2          23        23   # BR(H -> Z       Z      )
     3.08367207E-06    2          25        25   # BR(H -> h       h      )
     2.21509712E-03    2     1000024  -1000024   # BR(H -> ~chi_1+ ~chi_1-)
     1.06184740E-01    2     1000024  -1000037   # BR(H -> ~chi_1+ ~chi_2-)
     1.06184740E-01    2     1000037  -1000024   # BR(H -> ~chi_2+ ~chi_1-)
     6.67919301E-04    2     1000022   1000022   # BR(H -> ~chi_10 ~chi_10)
     2.84776038E-04    2     1000023   1000023   # BR(H -> ~chi_20 ~chi_20)
     6.63504925E-05    2     1000022   1000023   # BR(H -> ~chi_10 ~chi_20)
     4.08174474E-02    2     1000022   1000025   # BR(H -> ~chi_10 ~chi_30)
     1.32284381E-02    2     1000022   1000035   # BR(H -> ~chi_10 ~chi_40)
     6.12587403E-02    2     1000023   1000025   # BR(H -> ~chi_20 ~chi_30)
     2.01534149E-02    2     1000023   1000035   # BR(H -> ~chi_20 ~chi_40)
     7.28036727E-08    2     2000011  -2000011   # BR(H -> ~e_R-   ~e_R+  )
     7.28036727E-08    2     2000013  -2000013   # BR(H -> ~mu_R-  ~mu_R+ )
#
#         PDG            Width
DECAY        36     6.46558086E+01   # A decays
#          BR         NDA      ID1       ID2
     5.46350993E-01    2           5        -5   # BR(A -> b       bb     )
     1.00303540E-01    2         -15        15   # BR(A -> tau+    tau-   )
     3.54009406E-04    2         -13        13   # BR(A -> mu+     mu-    )
     2.15862124E-04    2           3        -3   # BR(A -> s       sb     )
     1.83633287E-08    2           4        -4   # BR(A -> c       cb     )
     1.80377920E-03    2           6        -6   # BR(A -> t       tb     )
     2.13231686E-05    2          21        21   # BR(A -> g       g      )
     6.96487087E-08    2          22        22   # BR(A -> gam     gam    )
     1.60513642E-08    2          23        22   # BR(A -> Z       gam    )
     8.64006241E-07    2          23        25   # BR(A -> Z       h      )
     2.39230770E-03    2     1000024  -1000024   # BR(A -> ~chi_1+ ~chi_1-)
     1.06065308E-01    2     1000024  -1000037   # BR(A -> ~chi_1+ ~chi_2-)
     1.06065308E-01    2     1000037  -1000024   # BR(A -> ~chi_2+ ~chi_1-)
     7.90608580E-04    2     1000022   1000022   # BR(A -> ~chi_10 ~chi_10)
     2.63952426E-04    2     1000023   1000023   # BR(A -> ~chi_20 ~chi_20)
     3.69976145E-05    2     1000022   1000023   # BR(A -> ~chi_10 ~chi_20)
     6.18820112E-02    2     1000022   1000025   # BR(A -> ~chi_10 ~chi_30)
     2.03591328E-02    2     1000022   1000035   # BR(A -> ~chi_10 ~chi_40)
     4.01017819E-02    2     1000023   1000025   # BR(A -> ~chi_20 ~chi_30)
     1.29921166E-02    2     1000023   1000035   # BR(A -> ~chi_20 ~chi_40)
#
#         PDG            Width
DECAY        37     6.34004535E+01   # H+ decays
#          BR         NDA      ID1       ID2
     9.03848827E-04    2           4        -5   # BR(H+ -> c       bb     )
     1.02329411E-01    2         -15        16   # BR(H+ -> tau+    nu_tau )
     3.61159479E-04    2         -13        14   # BR(H+ -> mu+     nu_mu  )
     9.03847757E-06    2           2        -5   # BR(H+ -> u       bb     )
     1.10125216E-05    2           2        -3   # BR(H+ -> u       sb     )
     2.16777815E-04    2           4        -3   # BR(H+ -> c       sb     )
     5.38748199E-01    2           6        -5   # BR(H+ -> t       bb     )
     8.82687691E-07    2          24        25   # BR(H+ -> W+      h      )
     4.70545683E-14    2          24        36   # BR(H+ -> W+      A      )
     4.72880639E-05    2     1000024   1000022   # BR(H+ -> ~chi_1+ ~chi_10)
     3.09051444E-04    2     1000024   1000023   # BR(H+ -> ~chi_1+ ~chi_20)
     1.13051469E-01    2     1000024   1000025   # BR(H+ -> ~chi_1+ ~chi_30)
     2.60175644E-02    2     1000024   1000035   # BR(H+ -> ~chi_1+ ~chi_40)
     1.10037218E-01    2     1000037   1000022   # BR(H+ -> ~chi_2+ ~chi_10)
     1.07957079E-01    2     1000037   1000023   # BR(H+ -> ~chi_2+ ~chi_20)
