#
#                              ======================
#                              | THE SUSYHIT OUTPUT |
#                              ======================
#
#
#              ------------------------------------------------------
#              |     This is the output of the SUSY-HIT package     |
#              |  created by A.Djouadi, M.Muehlleitner and M.Spira. |
#              |  In case of problems with SUSY-HIT email to        |
#              |           margarete.muehlleitner@cern.ch           |
#              |           michael.spira@psi.ch                     |
#              |           abdelhak.djouadi@cern.ch                 |
#              ------------------------------------------------------
#
#              ------------------------------------------------------
#              |  SUSY Les Houches Accord - MSSM Spectrum + Decays  |
#              |              based on the decay programs           |
#              |                                                    |
#              |                     SDECAY 1.3b                    |
#              |                                                    |
#              |  Authors: M.Muhlleitner, A.Djouadi and Y.Mambrini  |
#              |  Ref.:    Comput.Phys.Commun.168(2005)46           |
#              |           [hep-ph/0311167]                         |
#              |                                                    |
#              |                     HDECAY 3.4                     |
#              |                                                    |
#              |  By: A.Djouadi,J.Kalinowski,M.Muhlleitner,M.Spira  |
#              |  Ref.:    Comput.Phys.Commun.108(1998)56           |
#              |           [hep-ph/9704448]                         |
#              |                                                    |
#              |                                                    |
#              |  If not stated otherwise all DRbar couplings and   |
#              |  soft SUSY breaking masses are given at the scale  |
#              |  Q=  0.34765700E+04
#              |                                                    |
#              ------------------------------------------------------
#
#
BLOCK DCINFO  # Decay Program information
     1   SDECAY/HDECAY # decay calculator
     2   1.3b  /3.4    # version number
#
BLOCK SPINFO  # Spectrum calculator information
     1     SOFTSUSY    # spectrum calculator               
     2     3.4.0       # version number                    
#
BLOCK MODSEL  # Model selection
     1     0   #  nonUniversal                                     
#
BLOCK SMINPUTS  # Standard Model inputs
         1     1.27908970E+02   # alpha_em^-1(M_Z)^MSbar
         2     1.16637870E-05   # G_F [GeV^-2]
         3     1.18400000E-01   # alpha_S(M_Z)^MSbar
         4     9.11876000E+01   # M_Z pole mass
         5     4.18000000E+00   # mb(mb)^MSbar
         6     1.73200000E+02   # mt pole mass
         7     1.77700000E+00   # mtau pole mass
#
BLOCK MINPAR  # Input parameters - minimal models
         3     3.56200000E+01   # tanb                
#
BLOCK EXTPAR  # Input parameters - non-minimal models
         0    -1.00000000E+00   # Set                 
         1    -4.56800000E+01   # M_1(MX)             
         2     2.01722000E+03   # M_2(MX)             
         3     3.58732000E+03   # M_3(MX)             
        11    -3.57387000E+03   # At(MX)              
        12    -1.39720000E+02   # Ab(MX)              
        13     1.47733000E+03   # Atau(MX)            
        23     3.84430000E+02   # mu(MX)              
        26     9.52960000E+02   # mA(pole)            
        31     7.62780000E+02   # meL(MX)             
        32     7.62780000E+02   # mmuL(MX)            
        33     1.59317000E+03   # mtauL(MX)           
        34     2.26060000E+02   # meR(MX)             
        35     2.26060000E+02   # mmuR(MX)            
        36     1.86900000E+02   # mtauR(MX)           
        41     1.98517000E+03   # mqL1(MX)            
        42     1.98517000E+03   # mqL2(MX)            
        43     3.36899000E+03   # mqL3(MX)            
        44     3.81040000E+03   # muR(MX)             
        45     3.81040000E+03   # mcR(MX)             
        46     3.58549000E+03   # mtR(MX)             
        47     1.35795000E+03   # mdR(MX)             
        48     1.35795000E+03   # msR(MX)             
        49     1.84662000E+03   # mbR(MX)             
#
BLOCK MASS  # Mass Spectrum
# PDG code           mass       particle
        24     8.03785977E+01   # W+
        25     1.25369944E+02   # h
        35     9.52986110E+02   # H
        36     9.52959997E+02   # A
        37     9.56493764E+02   # H+
         5     4.81876030E+00   # b-quark pole mass calculated from mb(mb)_Msbar
   1000001     2.16679817E+03   # ~d_L
   2000001     1.55096917E+03   # ~d_R
   1000002     2.16544006E+03   # ~u_L
   2000002     3.91768257E+03   # ~u_R
   1000003     2.16679817E+03   # ~s_L
   2000003     1.55096917E+03   # ~s_R
   1000004     2.16544006E+03   # ~c_L
   2000004     3.91768257E+03   # ~c_R
   1000005     1.99490822E+03   # ~b_1
   2000005     3.46468919E+03   # ~b_2
   1000006     3.43807833E+03   # ~t_1
   2000006     3.65569208E+03   # ~t_2
   1000011     8.01331305E+02   # ~e_L
   2000011     2.93600015E+02   # ~e_R
   1000012     7.97163128E+02   # ~nu_eL
   1000013     8.01331305E+02   # ~mu_L
   2000013     2.93600015E+02   # ~mu_R
   1000014     7.97163128E+02   # ~nu_muL
   1000015     2.16335588E+02   # ~tau_1
   2000015     1.61120449E+03   # ~tau_2
   1000016     1.60889227E+03   # ~nu_tauL
   1000021     3.66895754E+03   # ~g
   1000022    -4.42586704E+01   # ~chi_10
   1000023     4.01979849E+02   # ~chi_20
   1000025    -4.05482473E+02   # ~chi_30
   1000035     2.02058114E+03   # ~chi_40
   1000024     4.01255116E+02   # ~chi_1+
   1000037     2.02074888E+03   # ~chi_2+
#
BLOCK NMIX  # Neutralino Mixing Matrix
  1  1     9.93964378E-01   # N_11
  1  2     2.39495352E-04   # N_12
  1  3     1.09346474E-01   # N_13
  1  4     8.83783502E-03   # N_14
  2  1     7.12436745E-02   # N_21
  2  2     3.48950160E-02   # N_22
  2  3    -7.04672450E-01   # N_23
  2  4     7.05083977E-01   # N_24
  3  1    -8.34169972E-02   # N_31
  3  2     2.22182188E-02   # N_32
  3  3     7.00998685E-01   # N_33
  3  4     7.07918639E-01   # N_34
  4  1    -8.71467937E-04   # N_41
  4  2     9.99143949E-01   # N_42
  4  3     8.99612743E-03   # N_43
  4  4    -4.03692826E-02   # N_44
#
BLOCK UMIX  # Chargino Mixing Matrix U
  1  1    -1.27427954E-02   # U_11
  1  2     9.99918807E-01   # U_12
  2  1    -9.99918807E-01   # U_21
  2  2    -1.27427954E-02   # U_22
#
BLOCK VMIX  # Chargino Mixing Matrix V
  1  1    -5.71562402E-02   # V_11
  1  2     9.98365246E-01   # V_12
  2  1    -9.98365246E-01   # V_21
  2  2    -5.71562402E-02   # V_22
#
BLOCK STOPMIX  # Stop Mixing Matrix
  1  1     9.33177207E-01   # cos(theta_t)
  1  2     3.59416611E-01   # sin(theta_t)
  2  1    -3.59416611E-01   # -sin(theta_t)
  2  2     9.33177207E-01   # cos(theta_t)
#
BLOCK SBOTMIX  # Sbottom Mixing Matrix
  1  1     3.96374933E-03   # cos(theta_b)
  1  2     9.99992144E-01   # sin(theta_b)
  2  1    -9.99992144E-01   # -sin(theta_b)
  2  2     3.96374933E-03   # cos(theta_b)
#
BLOCK STAUMIX  # Stau Mixing Matrix
  1  1     8.71628524E-03   # cos(theta_tau)
  1  2     9.99962012E-01   # sin(theta_tau)
  2  1    -9.99962012E-01   # -sin(theta_tau)
  2  2     8.71628524E-03   # cos(theta_tau)
#
BLOCK ALPHA  # Higgs mixing
          -2.96744832E-02   # Mixing angle in the neutral Higgs boson sector
#
BLOCK HMIX Q=  3.47657000E+03  # DRbar Higgs Parameters
         1     3.92534312E+02   # mu(Q)MSSM           
         2     3.45618168E+01   # tan                 
         3     2.42209262E+02   # higgs               
         4     1.36517612E+06   # mA^2(Q)MSSM         
#
BLOCK GAUGE Q=  3.47657000E+03  # The gauge couplings
     1     3.66092648E-01   # gprime(Q) DRbar
     2     6.38811203E-01   # g(Q) DRbar
     3     1.00483764E+00   # g3(Q) DRbar
#
BLOCK AU Q=  3.47657000E+03  # The trilinear couplings
  1  1     0.00000000E+00   # A_u(Q) DRbar
  2  2     0.00000000E+00   # A_c(Q) DRbar
  3  3    -3.57386997E+03   # A_t(Q) DRbar
#
BLOCK AD Q=  3.47657000E+03  # The trilinear couplings
  1  1     0.00000000E+00   # A_d(Q) DRbar
  2  2     0.00000000E+00   # A_s(Q) DRbar
  3  3    -1.39719988E+02   # A_b(Q) DRbar
#
BLOCK AE Q=  3.47657000E+03  # The trilinear couplings
  1  1     0.00000000E+00   # A_e(Q) DRbar
  2  2     0.00000000E+00   # A_mu(Q) DRbar
  3  3     1.47733000E+03   # A_tau(Q) DRbar
#
BLOCK Yu Q=  3.47657000E+03  # The Yukawa couplings
  1  1     0.00000000E+00   # y_u(Q) DRbar
  2  2     0.00000000E+00   # y_c(Q) DRbar
  3  3     8.11950261E-01   # y_t(Q) DRbar
#
BLOCK Yd Q=  3.47657000E+03  # The Yukawa couplings
  1  1     0.00000000E+00   # y_d(Q) DRbar
  2  2     0.00000000E+00   # y_s(Q) DRbar
  3  3     4.55517488E-01   # y_b(Q) DRbar
#
BLOCK Ye Q=  3.47657000E+03  # The Yukawa couplings
  1  1     0.00000000E+00   # y_e(Q) DRbar
  2  2     0.00000000E+00   # y_mu(Q) DRbar
  3  3     3.63372545E-01   # y_tau(Q) DRbar
#
BLOCK MSOFT Q=  3.47657000E+03  # The soft SUSY breaking masses at the scale Q
         1    -4.56800000E+01   # M_1(Q)              
         2     2.01722000E+03   # M_2(Q)              
         3     3.58732000E+03   # M_3(Q)              
        21     8.07151703E+05   # mH1^2(Q)            
        22     6.96372709E+04   # mH2^2(Q)            
        31     7.62780000E+02   # meL(Q)              
        32     7.62780000E+02   # mmuL(Q)             
        33     1.59317000E+03   # mtauL(Q)            
        34     2.26060000E+02   # meR(Q)              
        35     2.26060000E+02   # mmuR(Q)             
        36     1.86900017E+02   # mtauR(Q)            
        41     1.98516998E+03   # mqL1(Q)             
        42     1.98516998E+03   # mqL2(Q)             
        43     3.36898997E+03   # mqL3(Q)             
        44     3.81039999E+03   # muR(Q)              
        45     3.81039999E+03   # mcR(Q)              
        46     3.58548996E+03   # mtR(Q)              
        47     1.35794997E+03   # mdR(Q)              
        48     1.35794997E+03   # msR(Q)              
        49     1.84661997E+03   # mbR(Q)              
#
Block HiggsBoundsInputHiggsCouplingsFermions
# ScalarNormEffCoupSq PseudoSNormEffCoupSq NP   IP1 IP2 IP2
    1.05243528E+00    0.00000000E+00        3  25   5   5  # h0-b-b eff. coupling^2, normalised to SM
    1.19446675E+03    0.00000000E+00        3  35   5   5  # H0-b-b eff. coupling^2, normalised to SM
    0.00000000E+00    1.19451918E+03        3  36   5   5  # A0-b-b eff. coupling^2, normalised to SM
#
    9.99956103E-01    0.00000000E+00        3  25   6   6  # h0-t-t eff. coupling^2, normalised to SM
    8.81053476E-04    0.00000000E+00        3  35   6   6  # H0-t-t eff. coupling^2, normalised to SM
    0.00000000E+00    8.37156922E-04        3  36   6   6  # A0-t-t eff. coupling^2, normalised to SM
#
    1.05243528E+00    0.00000000E+00        3  25  15  15  # h0-tau-tau eff. coupling^2, normalised to SM
    1.19446675E+03    0.00000000E+00        3  35  15  15  # H0-tau-tau eff. coupling^2, normalised to SM
    0.00000000E+00    1.19451918E+03        3  36  15  15  # A0-tau-tau eff. coupling^2, normalised to SM
#
Block HiggsBoundsInputHiggsCouplingsBosons
    9.99999439E-01        3  25  24  24  # h0-W-W eff. coupling^2, normalised to SM
    5.60834621E-07        3  35  24  24  # H0-W-W eff. coupling^2, normalised to SM
    0.00000000E+00        3  36  24  24  # A0-W-W eff. coupling^2, normalised to SM
#
    9.99999439E-01        3  25  23  23  # h0-Z-Z eff. coupling^2, normalised to SM
    5.60834621E-07        3  35  23  23  # H0-Z-Z eff. coupling^2, normalised to SM
    0.00000000E+00        3  36  23  23  # A0-Z-Z eff. coupling^2, normalised to SM
#
    8.85376031E-01        3  25  21  21  # h0-g-g eff. coupling^2, normalised to SM
    5.60103816E-04        3  35  21  21  # H0-g-g eff. coupling^2, normalised to SM
    1.30258776E-03        3  36  21  21  # A0-g-g eff. coupling^2, normalised to SM
#
    0.00000000E+00        3  25  25  23  # h0-h0-Z eff. coupling^2, normalised to SM
    0.00000000E+00        3  35  25  23  # H0-h0-Z eff. coupling^2, normalised to SM
    5.60834621E-07        3  36  25  23  # A0-h0-Z eff. coupling^2, normalised to SM
    0.00000000E+00        3  35  35  23  # H0-H0-Z eff. coupling^2, normalised to SM
    9.99999439E-01        3  36  35  23  # A0-H0-Z eff. coupling^2, normalised to SM
    0.00000000E+00        3  36  36  23  # A0-A0-Z eff. coupling^2, normalised to SM
#
    0.00000000E+00        4  25  21  21  23  # h0-g-g-Z eff. coupling^2, normalised to SM
    0.00000000E+00        4  35  21  21  23  # H0-g-g-Z eff. coupling^2, normalised to SM
    0.00000000E+00        4  36  21  21  23  # A0-g-g-Z eff. coupling^2, normalised to SM
#
#
#
#                             =================
#                             |The decay table|
#                             =================
#
# - The QCD corrections to the decays gluino -> squark  + quark
#                                     squark -> gaugino + quark_prime
#                                     squark -> squark_prime + Higgs
#                                     squark -> gluino  + quark
#   are included.
#
# - The multi-body decays for the inos, stops and sbottoms are included.
#
# - The loop induced decays for the gluino, neutralinos and stops
#   are included.
#
# - The SUSY decays of the top quark are included.
#
#
#         PDG            Width
DECAY         6     1.43770103E+00   # top decays
#          BR         NDA      ID1       ID2
     1.00000000E+00    2           5        24   # BR(t ->  b    W+)
#
#         PDG            Width
DECAY   1000021     2.51739951E+02   # gluino decays
#          BR         NDA      ID1       ID2
     5.95846545E-02    2     1000001        -1   # BR(~g -> ~d_L  db)
     5.95846545E-02    2    -1000001         1   # BR(~g -> ~d_L* d )
     9.47728953E-02    2     2000001        -1   # BR(~g -> ~d_R  db)
     9.47728953E-02    2    -2000001         1   # BR(~g -> ~d_R* d )
     5.96646645E-02    2     1000002        -2   # BR(~g -> ~u_L  ub)
     5.96646645E-02    2    -1000002         2   # BR(~g -> ~u_L* u )
     5.95846545E-02    2     1000003        -3   # BR(~g -> ~s_L  sb)
     5.95846545E-02    2    -1000003         3   # BR(~g -> ~s_L* s )
     9.47728953E-02    2     2000003        -3   # BR(~g -> ~s_R  sb)
     9.47728953E-02    2    -2000003         3   # BR(~g -> ~s_R* s )
     5.96646451E-02    2     1000004        -4   # BR(~g -> ~c_L  cb)
     5.96646451E-02    2    -1000004         4   # BR(~g -> ~c_L* c )
     6.95325829E-02    2     1000005        -5   # BR(~g -> ~b_1  bb)
     6.95325829E-02    2    -1000005         5   # BR(~g -> ~b_1* b )
     1.72083650E-03    2     2000005        -5   # BR(~g -> ~b_2  bb)
     1.72083650E-03    2    -2000005         5   # BR(~g -> ~b_2* b )
     7.02171489E-04    2     1000006        -6   # BR(~g -> ~t_1  tb)
     7.02171489E-04    2    -1000006         6   # BR(~g -> ~t_1* t )
#
#         PDG            Width
DECAY   1000006     7.96366994E+01   # stop1 decays
#          BR         NDA      ID1       ID2
     1.74391474E-02    2     1000022         6   # BR(~t_1 -> ~chi_10 t )
     2.69616995E-01    2     1000023         6   # BR(~t_1 -> ~chi_20 t )
     2.87010375E-01    2     1000025         6   # BR(~t_1 -> ~chi_30 t )
     6.20905373E-02    2     1000035         6   # BR(~t_1 -> ~chi_40 t )
     2.39386374E-01    2     1000024         5   # BR(~t_1 -> ~chi_1+ b )
     1.23147540E-01    2     1000037         5   # BR(~t_1 -> ~chi_2+ b )
     3.50985937E-05    2     1000005        37   # BR(~t_1 -> ~b_1    H+)
     1.27393226E-03    2     1000005        24   # BR(~t_1 -> ~b_1    W+)
#
#         PDG            Width
DECAY   2000006     1.04861309E+02   # stop2 decays
#          BR         NDA      ID1       ID2
     7.23064040E-02    2     1000022         6   # BR(~t_2 -> ~chi_10 t )
     2.23635256E-01    2     1000023         6   # BR(~t_2 -> ~chi_20 t )
     2.13404654E-01    2     1000025         6   # BR(~t_2 -> ~chi_30 t )
     1.24805440E-02    2     1000035         6   # BR(~t_2 -> ~chi_40 t )
     3.92232485E-01    2     1000024         5   # BR(~t_2 -> ~chi_1+ b )
     2.48445711E-02    2     1000037         5   # BR(~t_2 -> ~chi_2+ b )
     1.13533302E-02    2     1000006        25   # BR(~t_2 -> ~t_1    h )
     1.92563201E-04    2     1000005        37   # BR(~t_2 -> ~b_1    H+)
     1.96010430E-02    2     1000006        23   # BR(~t_2 -> ~t_1    Z )
     2.04933275E-04    2     1000005        24   # BR(~t_2 -> ~b_1    W+)
     2.97442163E-02    2     2000005        24   # BR(~t_2 -> ~b_2    W+)
#
#         PDG            Width
DECAY   1000005     1.62166125E+01   # sbottom1 decays
#          BR         NDA      ID1       ID2
     7.82578008E-02    2     1000022         5   # BR(~b_1 -> ~chi_10 b )
     2.32437750E-01    2     1000023         5   # BR(~b_1 -> ~chi_20 b )
     2.29609272E-01    2     1000025         5   # BR(~b_1 -> ~chi_30 b )
     4.59695178E-01    2    -1000024         6   # BR(~b_1 -> ~chi_1- t )
#
#         PDG            Width
DECAY   2000005     7.68803440E+01   # sbottom2 decays
#          BR         NDA      ID1       ID2
     8.70958601E-03    2     1000022         5   # BR(~b_2 -> ~chi_10 b )
     8.99914703E-02    2     1000023         5   # BR(~b_2 -> ~chi_20 b )
     8.92543655E-02    2     1000025         5   # BR(~b_2 -> ~chi_30 b )
     7.95626201E-02    2     1000035         5   # BR(~b_2 -> ~chi_40 b )
     5.70420156E-01    2    -1000024         6   # BR(~b_2 -> ~chi_1- t )
     1.60306079E-01    2    -1000037         6   # BR(~b_2 -> ~chi_2- t )
     8.10022616E-04    2     1000005        25   # BR(~b_2 -> ~b_1    h )
     6.36414121E-05    2     1000005        35   # BR(~b_2 -> ~b_1    H )
     6.39264703E-05    2     1000005        36   # BR(~b_2 -> ~b_1    A )
     8.18132895E-04    2     1000005        23   # BR(~b_2 -> ~b_1    Z )
#
#         PDG            Width
DECAY   1000002     8.58289900E-01   # sup_L decays
#          BR         NDA      ID1       ID2
     3.71110030E-01    2     1000022         2   # BR(~u_L -> ~chi_10 u)
     2.25877105E-02    2     1000023         2   # BR(~u_L -> ~chi_20 u)
     3.78562341E-04    2     1000025         2   # BR(~u_L -> ~chi_30 u)
     1.81472920E-01    2     1000035         2   # BR(~u_L -> ~chi_40 u)
     6.27443413E-02    2     1000024         1   # BR(~u_L -> ~chi_1+ d)
     3.61706436E-01    2     1000037         1   # BR(~u_L -> ~chi_2+ d)
#
#         PDG            Width
DECAY   2000002     1.32171994E+01   # sup_R decays
#          BR         NDA      ID1       ID2
     6.60780661E-01    2     1000022         2   # BR(~u_R -> ~chi_10 u)
     3.33115908E-03    2     1000023         2   # BR(~u_R -> ~chi_20 u)
     4.56517894E-03    2     1000025         2   # BR(~u_R -> ~chi_30 u)
     2.76579475E-07    2     1000035         2   # BR(~u_R -> ~chi_40 u)
     3.31322724E-01    2     1000021         2   # BR(~u_R -> ~g      u)
#
#         PDG            Width
DECAY   1000001     8.10843459E-01   # sdown_L decays
#          BR         NDA      ID1       ID2
     3.91080905E-01    2     1000022         1   # BR(~d_L -> ~chi_10 d)
     4.60751792E-03    2     1000023         1   # BR(~d_L -> ~chi_20 d)
     1.47852184E-02    2     1000025         1   # BR(~d_L -> ~chi_30 d)
     1.95532232E-01    2     1000035         1   # BR(~d_L -> ~chi_40 d)
     3.30346614E-03    2    -1000024         2   # BR(~d_L -> ~chi_1- u)
     3.90690661E-01    2    -1000037         2   # BR(~d_L -> ~chi_2- u)
#
#         PDG            Width
DECAY   2000001     9.34921359E-01   # sdown_R decays
#          BR         NDA      ID1       ID2
     9.89486596E-01    2     1000022         1   # BR(~d_R -> ~chi_10 d)
     4.44071438E-03    2     1000023         1   # BR(~d_R -> ~chi_20 d)
     6.07268994E-03    2     1000025         1   # BR(~d_R -> ~chi_30 d)
#
#         PDG            Width
DECAY   1000004     8.29651749E-01   # scharm_L decays
#          BR         NDA      ID1       ID2
     3.82615996E-01    2     1000022         4   # BR(~c_L -> ~chi_10 c)
     2.32380998E-02    2     1000023         4   # BR(~c_L -> ~chi_20 c)
     3.89456145E-04    2     1000025         4   # BR(~c_L -> ~chi_30 c)
     1.76802023E-01    2     1000035         4   # BR(~c_L -> ~chi_40 c)
     6.45512927E-02    2     1000024         3   # BR(~c_L -> ~chi_1+ s)
     3.52403132E-01    2     1000037         3   # BR(~c_L -> ~chi_2+ s)
#
#         PDG            Width
DECAY   2000004     1.24524295E+01   # scharm_R decays
#          BR         NDA      ID1       ID2
     7.36487695E-01    2     1000022         4   # BR(~c_R -> ~chi_10 c)
     3.70539289E-03    2     1000023         4   # BR(~c_R -> ~chi_20 c)
     5.07795646E-03    2     1000025         4   # BR(~c_R -> ~chi_30 c)
     3.05084772E-07    2     1000035         4   # BR(~c_R -> ~chi_40 c)
     2.54728650E-01    2     1000021         4   # BR(~c_R -> ~g      c)
#
#         PDG            Width
DECAY   1000003     7.82142941E-01   # sstrange_L decays
#          BR         NDA      ID1       ID2
     4.04068403E-01    2     1000022         3   # BR(~s_L -> ~chi_10 s)
     4.75032650E-03    2     1000023         3   # BR(~s_L -> ~chi_20 s)
     1.52432272E-02    2     1000025         3   # BR(~s_L -> ~chi_30 s)
     1.90978749E-01    2     1000035         3   # BR(~s_L -> ~chi_40 s)
     3.40586576E-03    2    -1000024         4   # BR(~s_L -> ~chi_1- c)
     3.81553429E-01    2    -1000037         4   # BR(~s_L -> ~chi_2- c)
#
#         PDG            Width
DECAY   2000003     9.16044511E-01   # sstrange_R decays
#          BR         NDA      ID1       ID2
     9.89510221E-01    2     1000022         3   # BR(~s_R -> ~chi_10 s)
     4.43077802E-03    2     1000023         3   # BR(~s_R -> ~chi_20 s)
     6.05900086E-03    2     1000025         3   # BR(~s_R -> ~chi_30 s)
#
#         PDG            Width
DECAY   1000011     1.06211595E+00   # selectron_L decays
#          BR         NDA      ID1       ID2
     9.88497118E-01    2     1000022        11   # BR(~e_L -> ~chi_10 e-)
     9.83481928E-03    2     1000023        11   # BR(~e_L -> ~chi_20 e-)
     1.10970216E-03    2     1000025        11   # BR(~e_L -> ~chi_30 e-)
     5.58360069E-04    2    -1000024        12   # BR(~e_L -> ~chi_1- nu_e)
#
#         PDG            Width
DECAY   2000011     1.47731921E+00   # selectron_R decays
#          BR         NDA      ID1       ID2
     1.00000000E+00    2     1000022        11   # BR(~e_R -> ~chi_10 e-)
#
#         PDG            Width
DECAY   1000013     1.06211592E+00   # smuon_L decays
#          BR         NDA      ID1       ID2
     9.88497119E-01    2     1000022        13   # BR(~mu_L -> ~chi_10 mu-)
     9.83481902E-03    2     1000023        13   # BR(~mu_L -> ~chi_20 mu-)
     1.10970213E-03    2     1000025        13   # BR(~mu_L -> ~chi_30 mu-)
     5.58360089E-04    2    -1000024        14   # BR(~mu_L -> ~chi_1- nu_mu)
#
#         PDG            Width
DECAY   2000013     1.47731881E+00   # smuon_R decays
#          BR         NDA      ID1       ID2
     1.00000000E+00    2     1000022        13   # BR(~mu_R -> ~chi_10 mu-)
#
#         PDG            Width
DECAY   1000015     1.05360713E+00   # stau_1 decays
#          BR         NDA      ID1       ID2
     1.00000000E+00    2     1000022        15   # BR(~tau_1 -> ~chi_10  tau-)
#
#         PDG            Width
DECAY   2000015     8.28247196E+00   # stau_2 decays
#          BR         NDA      ID1       ID2
     2.61515219E-01    2     1000022        15   # BR(~tau_2 -> ~chi_10  tau-)
     2.27129495E-01    2     1000023        15   # BR(~tau_2 -> ~chi_20  tau-)
     2.21246789E-01    2     1000025        15   # BR(~tau_2 -> ~chi_30  tau-)
     8.42037729E-05    2    -1000024        16   # BR(~tau_2 -> ~chi_1-  nu_tau)
     1.16606310E-02    2     1000015        25   # BR(~tau_2 -> ~tau_1   h)
     1.33352818E-01    2     1000015        35   # BR(~tau_2 -> ~tau_1   H)
     1.33351188E-01    2     1000015        36   # BR(~tau_2 -> ~tau_1   A)
     1.16596564E-02    2     1000015        23   # BR(~tau_2 -> ~tau_1   Z)
#
#         PDG            Width
DECAY   1000012     1.06318306E+00   # snu_eL decays
#          BR         NDA      ID1       ID2
     9.80654740E-01    2     1000022        12   # BR(~nu_eL -> ~chi_10 nu_e)
     5.95899465E-05    2     1000023        12   # BR(~nu_eL -> ~chi_20 nu_e)
     8.20009469E-03    2     1000025        12   # BR(~nu_eL -> ~chi_30 nu_e)
     1.10855755E-02    2     1000024        11   # BR(~nu_eL -> ~chi_1+ e-)
#
#         PDG            Width
DECAY   1000014     1.06318306E+00   # snu_muL decays
#          BR         NDA      ID1       ID2
     9.80654741E-01    2     1000022        14   # BR(~nu_muL -> ~chi_10 nu_mu)
     5.95899465E-05    2     1000023        14   # BR(~nu_muL -> ~chi_20 nu_mu)
     8.20009469E-03    2     1000025        14   # BR(~nu_muL -> ~chi_30 nu_mu)
     1.10855748E-02    2     1000024        13   # BR(~nu_muL -> ~chi_1+ mu-)
#
#         PDG            Width
DECAY   1000016     8.27968870E+00   # snu_tauL decays
#          BR         NDA      ID1       ID2
     2.55337118E-01    2     1000022        16   # BR(~nu_tauL -> ~chi_10 nu_tau)
     2.44123232E-05    2     1000023        16   # BR(~nu_tauL -> ~chi_20 nu_tau)
     3.39188924E-03    2     1000025        16   # BR(~nu_tauL -> ~chi_30 nu_tau)
     4.53324556E-01    2     1000024        15   # BR(~nu_tauL -> ~chi_1+ tau-)
     2.65370096E-01    2    -1000015       -37   # BR(~nu_tauL -> ~tau_1+ H-)
     2.25519277E-02    2    -1000015       -24   # BR(~nu_tauL -> ~tau_1+ W-)
#
#         PDG            Width
DECAY   1000024     4.98439892E-01   # chargino1+ decays
#          BR         NDA      ID1       ID2
     5.32062886E-01    2    -1000015        16   # BR(~chi_1+ -> ~tau_1+  nu_tau)
     4.67937114E-01    2     1000022        24   # BR(~chi_1+ -> ~chi_10  W+)
#
#         PDG            Width
DECAY   1000037     5.07877004E+01   # chargino2+ decays
#          BR         NDA      ID1       ID2
     1.14776293E-01    2     1000012       -11   # BR(~chi_2+ -> ~nu_eL   e+  )
     1.14776293E-01    2     1000014       -13   # BR(~chi_2+ -> ~nu_muL mu+ )
     2.15743339E-02    2     1000016       -15   # BR(~chi_2+ -> ~nu_tau1 tau+)
     1.14689241E-01    2    -1000011        12   # BR(~chi_2+ -> ~e_L+    nu_e)
     1.14689241E-01    2    -1000013        14   # BR(~chi_2+ -> ~mu_L+   nu_mu)
     3.39854912E-07    2    -1000015        16   # BR(~chi_2+ -> ~tau_1+  nu_tau)
     2.14280898E-02    2    -2000015        16   # BR(~chi_2+ -> ~tau_2+  nu_tau)
     7.97194049E-02    2     1000024        23   # BR(~chi_2+ -> ~chi_1+  Z )
     1.54314359E-04    2     1000022        24   # BR(~chi_2+ -> ~chi_10  W+)
     7.72457674E-02    2     1000023        24   # BR(~chi_2+ -> ~chi_20  W+)
     7.71267222E-02    2     1000025        24   # BR(~chi_2+ -> ~chi_30  W+)
     8.14697448E-02    2     1000024        25   # BR(~chi_2+ -> ~chi_1+  h )
     4.55649845E-02    2     1000024        35   # BR(~chi_2+ -> ~chi_1+  H )
     4.56592703E-02    2     1000024        36   # BR(~chi_2+ -> ~chi_1+  A )
     1.05368301E-03    2     1000022        37   # BR(~chi_2+ -> ~chi_10  H+)
     4.53253912E-02    2     1000023        37   # BR(~chi_2+ -> ~chi_20  H+)
     4.47468848E-02    2     1000025        37   # BR(~chi_2+ -> ~chi_30  H+)
#
#         PDG            Width
DECAY   1000022     0.00000000E+00   # neutralino1 decays
#
#         PDG            Width
DECAY   1000023     4.94868833E-01   # neutralino2 decays
#          BR         NDA      ID1       ID2
     2.72928622E-01    2     1000022        23   # BR(~chi_20 -> ~chi_10   Z )
     1.73644539E-01    2     1000022        25   # BR(~chi_20 -> ~chi_10   h )
     2.39272505E-03    2     2000011       -11   # BR(~chi_20 -> ~e_R-     e+)
     2.39272505E-03    2    -2000011        11   # BR(~chi_20 -> ~e_R+     e-)
     2.39272505E-03    2     2000013       -13   # BR(~chi_20 -> ~mu_R-    mu+)
     2.39272505E-03    2    -2000013        13   # BR(~chi_20 -> ~mu_R+    mu-)
     2.71927970E-01    2     1000015       -15   # BR(~chi_20 -> ~tau_1-   tau+)
     2.71927970E-01    2    -1000015        15   # BR(~chi_20 -> ~tau_1+   tau-)
#
#         PDG            Width
DECAY   1000025     5.15504203E-01   # neutralino3 decays
#          BR         NDA      ID1       ID2
     2.05347403E-01    2     1000022        23   # BR(~chi_30 -> ~chi_10   Z )
     2.46023780E-01    2     1000022        25   # BR(~chi_30 -> ~chi_10   h )
     3.30258222E-03    2     2000011       -11   # BR(~chi_30 -> ~e_R-     e+)
     3.30258222E-03    2    -2000011        11   # BR(~chi_30 -> ~e_R+     e-)
     3.30258222E-03    2     2000013       -13   # BR(~chi_30 -> ~mu_R-    mu+)
     3.30258222E-03    2    -2000013        13   # BR(~chi_30 -> ~mu_R+    mu-)
     2.67709244E-01    2     1000015       -15   # BR(~chi_30 -> ~tau_1-   tau+)
     2.67709244E-01    2    -1000015        15   # BR(~chi_30 -> ~tau_1+   tau-)
#
#         PDG            Width
DECAY   1000035     5.07972823E+01   # neutralino4 decays
#          BR         NDA      ID1       ID2
     9.44578121E-05    2     1000022        23   # BR(~chi_40 -> ~chi_10   Z )
     2.28945911E-02    2     1000023        23   # BR(~chi_40 -> ~chi_20   Z )
     5.64959407E-02    2     1000025        23   # BR(~chi_40 -> ~chi_30   Z )
     7.76188392E-02    2     1000024       -24   # BR(~chi_40 -> ~chi_1+   W-)
     7.76188392E-02    2    -1000024        24   # BR(~chi_40 -> ~chi_1-   W+)
     6.31538842E-05    2     1000022        25   # BR(~chi_40 -> ~chi_10   h )
     5.08464635E-04    2     1000022        35   # BR(~chi_40 -> ~chi_10   H )
     5.49164612E-04    2     1000022        36   # BR(~chi_40 -> ~chi_10   A )
     5.82809675E-02    2     1000023        25   # BR(~chi_40 -> ~chi_20   h )
     3.26824494E-02    2     1000023        35   # BR(~chi_40 -> ~chi_20   H )
     1.26833595E-02    2     1000023        36   # BR(~chi_40 -> ~chi_20   A )
     2.29024982E-02    2     1000025        25   # BR(~chi_40 -> ~chi_30   h )
     1.24888101E-02    2     1000025        35   # BR(~chi_40 -> ~chi_30   H )
     3.24990968E-02    2     1000025        36   # BR(~chi_40 -> ~chi_30   A )
     4.54349534E-02    2     1000024       -37   # BR(~chi_40 -> ~chi_1+   H-)
     4.54349534E-02    2    -1000024        37   # BR(~chi_40 -> ~chi_1-   H+)
     4.64539772E-09    2     2000001        -1   # BR(~chi_40 -> ~d_R      db)
     4.64539772E-09    2    -2000001         1   # BR(~chi_40 -> ~d_R*     d )
     4.64539772E-09    2     2000003        -3   # BR(~chi_40 -> ~s _R      sb)
     4.64539772E-09    2    -2000003         3   # BR(~chi_40 -> ~s _R*     s )
     3.88919457E-09    2     1000005        -5   # BR(~chi_40 -> ~b_1      bb)
     3.88919457E-09    2    -1000005         5   # BR(~chi_40 -> ~b_1*     b )
     5.71794758E-02    2     1000011       -11   # BR(~chi_40 -> ~e_L-     e+)
     5.71794758E-02    2    -1000011        11   # BR(~chi_40 -> ~e_L+     e-)
     7.71819080E-08    2     2000011       -11   # BR(~chi_40 -> ~e_R-     e+)
     7.71819080E-08    2    -2000011        11   # BR(~chi_40 -> ~e_R+     e-)
     5.71794758E-02    2     1000013       -13   # BR(~chi_40 -> ~mu_L-    mu+)
     5.71794758E-02    2    -1000013        13   # BR(~chi_40 -> ~mu_L+    mu-)
     7.71819080E-08    2     2000013       -13   # BR(~chi_40 -> ~mu_R-    mu+)
     7.71819080E-08    2    -2000013        13   # BR(~chi_40 -> ~mu_R+    mu-)
     2.39452761E-07    2     1000015       -15   # BR(~chi_40 -> ~tau_1-   tau+)
     2.39452761E-07    2    -1000015        15   # BR(~chi_40 -> ~tau_1+   tau-)
     1.06773949E-02    2     2000015       -15   # BR(~chi_40 -> ~tau_2-   tau+)
     1.06773949E-02    2    -2000015        15   # BR(~chi_40 -> ~tau_2+   tau-)
     5.75160314E-02    2     1000012       -12   # BR(~chi_40 -> ~nu_eL    nu_eb)
     5.75160314E-02    2    -1000012        12   # BR(~chi_40 -> ~nu_eL*   nu_e )
     5.75160314E-02    2     1000014       -14   # BR(~chi_40 -> ~nu_muL   nu_mub)
     5.75160314E-02    2    -1000014        14   # BR(~chi_40 -> ~nu_muL*  nu_mu )
     1.08059141E-02    2     1000016       -16   # BR(~chi_40 -> ~nu_tau1  nu_taub)
     1.08059141E-02    2    -1000016        16   # BR(~chi_40 -> ~nu_tau1* nu_tau )
#
#         PDG            Width
DECAY        25     4.32536674E-03   # h decays
#          BR         NDA      ID1       ID2
     6.09654673E-01    2           5        -5   # BR(h -> b       bb     )
     6.30635205E-02    2         -15        15   # BR(h -> tau+    tau-   )
     2.23032806E-04    2         -13        13   # BR(h -> mu+     mu-    )
     2.42872937E-04    2           3        -3   # BR(h -> s       sb     )
     2.00981493E-02    2           4        -4   # BR(h -> c       cb     )
     7.42735328E-02    2          21        21   # BR(h -> g       g      )
     2.18664141E-03    2          22        22   # BR(h -> gam     gam    )
     1.49188673E-03    2          22        23   # BR(h -> Z       gam    )
     2.02595761E-01    2          24       -24   # BR(h -> W+      W-     )
     2.53971648E-02    2          23        23   # BR(h -> Z       Z      )
     7.72765053E-04    2     1000022   1000022   # BR(h -> ~chi_10 ~chi_10)
#
#         PDG            Width
DECAY        35     1.77764703E+01   # H decays
#          BR         NDA      ID1       ID2
     8.27235435E-01    2           5        -5   # BR(H -> b       bb     )
     1.26090055E-01    2         -15        15   # BR(H -> tau+    tau-   )
     4.30713430E-04    2         -13        13   # BR(H -> mu+     mu-    )
     3.03102759E-04    2           3        -3   # BR(H -> s       sb     )
     2.28364842E-08    2           4        -4   # BR(H -> c       cb     )
     1.97792498E-03    2           6        -6   # BR(H -> t       tb     )
     9.15370408E-05    2          21        21   # BR(H -> g       g      )
     5.66471879E-08    2          22        22   # BR(H -> gam     gam    )
     3.33696532E-08    2          23        22   # BR(H -> Z       gam    )
     8.43200769E-06    2          24       -24   # BR(H -> W+      W-     )
     4.15898665E-06    2          23        23   # BR(H -> Z       Z      )
     3.11354549E-05    2          25        25   # BR(H -> h       h      )
     2.29679995E-04    2     1000024  -1000024   # BR(H -> ~chi_1+ ~chi_1-)
     1.52622217E-03    2     1000022   1000022   # BR(H -> ~chi_10 ~chi_10)
     3.52439062E-07    2     1000023   1000023   # BR(H -> ~chi_20 ~chi_20)
     1.53584772E-04    2     1000025   1000025   # BR(H -> ~chi_30 ~chi_30)
     2.11245781E-02    2     1000022   1000023   # BR(H -> ~chi_10 ~chi_20)
     2.04683886E-02    2     1000022   1000025   # BR(H -> ~chi_10 ~chi_30)
     2.79230324E-04    2     1000023   1000025   # BR(H -> ~chi_20 ~chi_30)
     7.19880002E-07    2     2000011  -2000011   # BR(H -> ~e_R-   ~e_R+  )
     7.19880002E-07    2     2000013  -2000013   # BR(H -> ~mu_R-  ~mu_R+ )
     4.39168473E-05    2     1000015  -1000015   # BR(H -> ~tau_1- ~tau_1+)
#
#         PDG            Width
DECAY        36     1.77918234E+01   # A decays
#          BR         NDA      ID1       ID2
     8.26581707E-01    2           5        -5   # BR(A -> b       bb     )
     1.25985220E-01    2         -15        15   # BR(A -> tau+    tau-   )
     4.30349690E-04    2         -13        13   # BR(A -> mu+     mu-    )
     3.02866633E-04    2           3        -3   # BR(A -> s       sb     )
     2.18775664E-08    2           4        -4   # BR(A -> c       cb     )
     2.09153287E-03    2           6        -6   # BR(A -> t       tb     )
     1.39471444E-04    2          21        21   # BR(A -> g       g      )
     8.13102220E-08    2          22        22   # BR(A -> gam     gam    )
     5.38402658E-08    2          23        22   # BR(A -> Z       gam    )
     8.25169797E-06    2          23        25   # BR(A -> Z       h      )
     8.09780451E-04    2     1000024  -1000024   # BR(A -> ~chi_1+ ~chi_1-)
     1.52369504E-03    2     1000022   1000022   # BR(A -> ~chi_10 ~chi_10)
     1.37345949E-06    2     1000023   1000023   # BR(A -> ~chi_20 ~chi_20)
     4.94163407E-04    2     1000025   1000025   # BR(A -> ~chi_30 ~chi_30)
     2.15725530E-02    2     1000022   1000023   # BR(A -> ~chi_10 ~chi_20)
     1.99713575E-02    2     1000022   1000025   # BR(A -> ~chi_10 ~chi_30)
     8.75210588E-05    2     1000023   1000025   # BR(A -> ~chi_20 ~chi_30)
#
#         PDG            Width
DECAY        37     1.66169478E+01   # H+ decays
#          BR         NDA      ID1       ID2
     1.39746455E-03    2           4        -5   # BR(H+ -> c       bb     )
     1.35393026E-01    2         -15        16   # BR(H+ -> tau+    nu_tau )
     4.62485552E-04    2         -13        14   # BR(H+ -> mu+     nu_mu  )
     1.39745003E-05    2           2        -5   # BR(H+ -> u       bb     )
     1.62043685E-05    2           2        -3   # BR(H+ -> u       sb     )
     3.18972951E-04    2           4        -3   # BR(H+ -> c       sb     )
     8.15113545E-01    2           6        -5   # BR(H+ -> t       bb     )
     8.99723823E-06    2          24        25   # BR(H+ -> W+      h      )
     4.34569763E-11    2          24        36   # BR(H+ -> W+      A      )
     4.69539023E-02    2     1000024   1000022   # BR(H+ -> ~chi_1+ ~chi_10)
     3.14922003E-04    2     1000024   1000023   # BR(H+ -> ~chi_1+ ~chi_20)
     6.50598245E-06    2     1000024   1000025   # BR(H+ -> ~chi_1+ ~chi_30)
