#
#                              ======================
#                              | THE SUSYHIT OUTPUT |
#                              ======================
#
#
#              ------------------------------------------------------
#              |     This is the output of the SUSY-HIT package     |
#              |  created by A.Djouadi, M.Muehlleitner and M.Spira. |
#              |  In case of problems with SUSY-HIT email to        |
#              |           margarete.muehlleitner@cern.ch           |
#              |           michael.spira@psi.ch                     |
#              |           abdelhak.djouadi@cern.ch                 |
#              ------------------------------------------------------
#
#              ------------------------------------------------------
#              |  SUSY Les Houches Accord - MSSM Spectrum + Decays  |
#              |              based on the decay programs           |
#              |                                                    |
#              |                     SDECAY 1.3b                    |
#              |                                                    |
#              |  Authors: M.Muhlleitner, A.Djouadi and Y.Mambrini  |
#              |  Ref.:    Comput.Phys.Commun.168(2005)46           |
#              |           [hep-ph/0311167]                         |
#              |                                                    |
#              |                     HDECAY 3.4                     |
#              |                                                    |
#              |  By: A.Djouadi,J.Kalinowski,M.Muhlleitner,M.Spira  |
#              |  Ref.:    Comput.Phys.Commun.108(1998)56           |
#              |           [hep-ph/9704448]                         |
#              |                                                    |
#              |                                                    |
#              |  If not stated otherwise all DRbar couplings and   |
#              |  soft SUSY breaking masses are given at the scale  |
#              |  Q=  0.27840500E+04
#              |                                                    |
#              ------------------------------------------------------
#
#
BLOCK DCINFO  # Decay Program information
     1   SDECAY/HDECAY # decay calculator
     2   1.3b  /3.4    # version number
#
BLOCK SPINFO  # Spectrum calculator information
     1     SOFTSUSY    # spectrum calculator               
     2     3.4.0       # version number                    
#
BLOCK MODSEL  # Model selection
     1     0   #  nonUniversal                                     
#
BLOCK SMINPUTS  # Standard Model inputs
         1     1.27908970E+02   # alpha_em^-1(M_Z)^MSbar
         2     1.16637870E-05   # G_F [GeV^-2]
         3     1.18400000E-01   # alpha_S(M_Z)^MSbar
         4     9.11876000E+01   # M_Z pole mass
         5     4.18000000E+00   # mb(mb)^MSbar
         6     1.73200000E+02   # mt pole mass
         7     1.77700000E+00   # mtau pole mass
#
BLOCK MINPAR  # Input parameters - minimal models
         3     2.30600000E+01   # tanb                
#
BLOCK EXTPAR  # Input parameters - non-minimal models
         0    -1.00000000E+00   # Set                 
         1    -8.30070000E+02   # M_1(MX)             
         2    -4.41940000E+02   # M_2(MX)             
         3     3.24561000E+03   # M_3(MX)             
        11     2.42367000E+03   # At(MX)              
        12    -3.53934000E+03   # Ab(MX)              
        13    -2.14502000E+03   # Atau(MX)            
        23     1.39102000E+03   # mu(MX)              
        26     3.79580000E+03   # mA(pole)            
        31     2.06819000E+03   # meL(MX)             
        32     2.06819000E+03   # mmuL(MX)            
        33     8.45100000E+02   # mtauL(MX)           
        34     4.93440000E+02   # meR(MX)             
        35     4.93440000E+02   # mmuR(MX)            
        36     1.85593000E+03   # mtauR(MX)           
        41     3.97154000E+03   # mqL1(MX)            
        42     3.97154000E+03   # mqL2(MX)            
        43     2.44403000E+03   # mqL3(MX)            
        44     1.16558000E+03   # muR(MX)             
        45     1.16558000E+03   # mcR(MX)             
        46     3.16667000E+03   # mtR(MX)             
        47     2.86620000E+03   # mdR(MX)             
        48     2.86620000E+03   # msR(MX)             
        49     1.92879000E+03   # mbR(MX)             
#
BLOCK MASS  # Mass Spectrum
# PDG code           mass       particle
        24     8.03915127E+01   # W+
        25     1.24095265E+02   # h
        35     3.79580895E+03   # H
        36     3.79580010E+03   # A
        37     3.79699091E+03   # H+
         5     4.81876030E+00   # b-quark pole mass calculated from mb(mb)_Msbar
   1000001     4.05047351E+03   # ~d_L
   2000001     2.96844147E+03   # ~d_R
   1000002     4.04982971E+03   # ~u_L
   2000002     1.30998107E+03   # ~u_R
   1000003     4.05047351E+03   # ~s_L
   2000003     2.96844147E+03   # ~s_R
   1000004     4.04982971E+03   # ~c_L
   2000004     1.30998107E+03   # ~c_R
   1000005     2.04390815E+03   # ~b_1
   2000005     2.53908577E+03   # ~b_2
   1000006     2.53669982E+03   # ~t_1
   2000006     3.22348545E+03   # ~t_2
   1000011     2.07284257E+03   # ~e_L
   2000011     5.08355849E+02   # ~e_R
   1000012     2.07098168E+03   # ~nu_eL
   1000013     2.07284257E+03   # ~mu_L
   2000013     5.08355849E+02   # ~mu_R
   1000014     2.07098168E+03   # ~nu_muL
   1000015     8.48820431E+02   # ~tau_1
   2000015     1.85767283E+03   # ~tau_2
   1000016     8.45504220E+02   # ~nu_tauL
   1000021     3.36144057E+03   # ~g
   1000022    -4.70739235E+02   # ~chi_10
   1000023    -8.13246040E+02   # ~chi_20
   1000025     1.42876660E+03   # ~chi_30
   1000035    -1.43075356E+03   # ~chi_40
   1000024     4.70908291E+02   # ~chi_1+
   1000037     1.43155010E+03   # ~chi_2+
#
BLOCK NMIX  # Neutralino Mixing Matrix
  1  1    -1.90164654E-03   # N_11
  1  2     9.97993030E-01   # N_12
  1  3    -6.08628551E-02   # N_13
  1  4    -1.73783969E-02   # N_14
  2  1     9.98709944E-01   # N_21
  2  2     5.02969306E-03   # N_22
  2  3     4.43627466E-02   # N_23
  2  4     2.41887603E-02   # N_24
  3  1     1.43942690E-02   # N_31
  3  2    -3.07238980E-02   # N_32
  3  3    -7.06177565E-01   # N_33
  3  4     7.07221389E-01   # N_34
  4  1    -4.86583599E-02   # N_41
  4  2     5.51421468E-02   # N_42
  4  3     7.04017688E-01   # N_43
  4  4     7.06364497E-01   # N_44
#
BLOCK UMIX  # Chargino Mixing Matrix U
  1  1     9.96309538E-01   # U_11
  1  2    -8.58329985E-02   # U_12
  2  1     8.58329985E-02   # U_21
  2  2     9.96309538E-01   # U_22
#
BLOCK VMIX  # Chargino Mixing Matrix V
  1  1    -9.99700114E-01   # V_11
  1  2    -2.44884029E-02   # V_12
  2  1    -2.44884029E-02   # V_21
  2  2     9.99700114E-01   # V_22
#
BLOCK STOPMIX  # Stop Mixing Matrix
  1  1     9.96815117E-01   # cos(theta_t)
  1  2    -7.97472415E-02   # sin(theta_t)
  2  1     7.97472415E-02   # -sin(theta_t)
  2  2     9.96815117E-01   # cos(theta_t)
#
BLOCK SBOTMIX  # Sbottom Mixing Matrix
  1  1     3.14490982E-02   # cos(theta_b)
  1  2     9.99505355E-01   # sin(theta_b)
  2  1    -9.99505355E-01   # -sin(theta_b)
  2  2     3.14490982E-02   # cos(theta_b)
#
BLOCK STAUMIX  # Stau Mixing Matrix
  1  1     9.99778640E-01   # cos(theta_tau)
  1  2     2.10397481E-02   # sin(theta_tau)
  2  1    -2.10397481E-02   # -sin(theta_tau)
  2  2     9.99778640E-01   # cos(theta_tau)
#
BLOCK ALPHA  # Higgs mixing
          -4.53154135E-02   # Mixing angle in the neutral Higgs boson sector
#
BLOCK HMIX Q=  2.78405000E+03  # DRbar Higgs Parameters
         1     1.41231124E+03   # mu(Q)MSSM           
         2     2.20910583E+01   # tan                 
         3     2.42460547E+02   # higgs               
         4     1.39856350E+07   # mA^2(Q)MSSM         
#
BLOCK GAUGE Q=  2.78405000E+03  # The gauge couplings
     1     3.65109690E-01   # gprime(Q) DRbar
     2     6.39328684E-01   # g(Q) DRbar
     3     1.01017025E+00   # g3(Q) DRbar
#
BLOCK AU Q=  2.78405000E+03  # The trilinear couplings
  1  1     0.00000000E+00   # A_u(Q) DRbar
  2  2     0.00000000E+00   # A_c(Q) DRbar
  3  3     2.42367002E+03   # A_t(Q) DRbar
#
BLOCK AD Q=  2.78405000E+03  # The trilinear couplings
  1  1     0.00000000E+00   # A_d(Q) DRbar
  2  2     0.00000000E+00   # A_s(Q) DRbar
  3  3    -3.53933999E+03   # A_b(Q) DRbar
#
BLOCK AE Q=  2.78405000E+03  # The trilinear couplings
  1  1     0.00000000E+00   # A_e(Q) DRbar
  2  2     0.00000000E+00   # A_mu(Q) DRbar
  3  3    -2.14502000E+03   # A_tau(Q) DRbar
#
BLOCK Yu Q=  2.78405000E+03  # The Yukawa couplings
  1  1     0.00000000E+00   # y_u(Q) DRbar
  2  2     0.00000000E+00   # y_c(Q) DRbar
  3  3     8.32870975E-01   # y_t(Q) DRbar
#
BLOCK Yd Q=  2.78405000E+03  # The Yukawa couplings
  1  1     0.00000000E+00   # y_d(Q) DRbar
  2  2     0.00000000E+00   # y_s(Q) DRbar
  3  3     2.56857403E-01   # y_b(Q) DRbar
#
BLOCK Ye Q=  2.78405000E+03  # The Yukawa couplings
  1  1     0.00000000E+00   # y_e(Q) DRbar
  2  2     0.00000000E+00   # y_mu(Q) DRbar
  3  3     2.19540413E-01   # y_tau(Q) DRbar
#
BLOCK MSOFT Q=  2.78405000E+03  # The soft SUSY breaking masses at the scale Q
         1    -8.30070000E+02   # M_1(Q)              
         2    -4.41940000E+02   # M_2(Q)              
         3     3.24561000E+03   # M_3(Q)              
        21     1.23982219E+07   # mH1^2(Q)            
        22    -1.81490301E+06   # mH2^2(Q)            
        31     2.06819000E+03   # meL(Q)              
        32     2.06819000E+03   # mmuL(Q)             
        33     8.45100000E+02   # mtauL(Q)            
        34     4.93440000E+02   # meR(Q)              
        35     4.93440000E+02   # mmuR(Q)             
        36     1.85593000E+03   # mtauR(Q)            
        41     3.97153999E+03   # mqL1(Q)             
        42     3.97153999E+03   # mqL2(Q)             
        43     2.44402998E+03   # mqL3(Q)             
        44     1.16557998E+03   # muR(Q)              
        45     1.16557998E+03   # mcR(Q)              
        46     3.16666998E+03   # mtR(Q)              
        47     2.86619999E+03   # mdR(Q)              
        48     2.86619999E+03   # msR(Q)              
        49     1.92878998E+03   # mbR(Q)              
#
Block HiggsBoundsInputHiggsCouplingsFermions
# ScalarNormEffCoupSq PseudoSNormEffCoupSq NP   IP1 IP2 IP2
    1.00349833E+00    0.00000000E+00        3  25   5   5  # h0-b-b eff. coupling^2, normalised to SM
    4.88011358E+02    0.00000000E+00        3  35   5   5  # H0-b-b eff. coupling^2, normalised to SM
    0.00000000E+00    4.88014857E+02        3  36   5   5  # A0-b-b eff. coupling^2, normalised to SM
#
    9.99992832E-01    0.00000000E+00        3  25   6   6  # h0-t-t eff. coupling^2, normalised to SM
    2.05628644E-03    0.00000000E+00        3  35   6   6  # H0-t-t eff. coupling^2, normalised to SM
    0.00000000E+00    2.04911794E-03        3  36   6   6  # A0-t-t eff. coupling^2, normalised to SM
#
    1.00349833E+00    0.00000000E+00        3  25  15  15  # h0-tau-tau eff. coupling^2, normalised to SM
    4.88011358E+02    0.00000000E+00        3  35  15  15  # H0-tau-tau eff. coupling^2, normalised to SM
    0.00000000E+00    4.88014857E+02        3  36  15  15  # A0-tau-tau eff. coupling^2, normalised to SM
#
Block HiggsBoundsInputHiggsCouplingsBosons
    9.99999994E-01        3  25  24  24  # h0-W-W eff. coupling^2, normalised to SM
    6.25852573E-09        3  35  24  24  # H0-W-W eff. coupling^2, normalised to SM
    0.00000000E+00        3  36  24  24  # A0-W-W eff. coupling^2, normalised to SM
#
    9.99999994E-01        3  25  23  23  # h0-Z-Z eff. coupling^2, normalised to SM
    6.25852573E-09        3  35  23  23  # H0-Z-Z eff. coupling^2, normalised to SM
    0.00000000E+00        3  36  23  23  # A0-Z-Z eff. coupling^2, normalised to SM
#
    8.91536631E-01        3  25  21  21  # h0-g-g eff. coupling^2, normalised to SM
    2.25707226E-15        3  35  21  21  # H0-g-g eff. coupling^2, normalised to SM
    1.64110676E-13        3  36  21  21  # A0-g-g eff. coupling^2, normalised to SM
#
    0.00000000E+00        3  25  25  23  # h0-h0-Z eff. coupling^2, normalised to SM
    0.00000000E+00        3  35  25  23  # H0-h0-Z eff. coupling^2, normalised to SM
    6.25852573E-09        3  36  25  23  # A0-h0-Z eff. coupling^2, normalised to SM
    0.00000000E+00        3  35  35  23  # H0-H0-Z eff. coupling^2, normalised to SM
    9.99999994E-01        3  36  35  23  # A0-H0-Z eff. coupling^2, normalised to SM
    0.00000000E+00        3  36  36  23  # A0-A0-Z eff. coupling^2, normalised to SM
#
    0.00000000E+00        4  25  21  21  23  # h0-g-g-Z eff. coupling^2, normalised to SM
    0.00000000E+00        4  35  21  21  23  # H0-g-g-Z eff. coupling^2, normalised to SM
    0.00000000E+00        4  36  21  21  23  # A0-g-g-Z eff. coupling^2, normalised to SM
#
#
#
#                             =================
#                             |The decay table|
#                             =================
#
# - The QCD corrections to the decays gluino -> squark  + quark
#                                     squark -> gaugino + quark_prime
#                                     squark -> squark_prime + Higgs
#                                     squark -> gluino  + quark
#   are included.
#
# - The multi-body decays for the inos, stops and sbottoms are included.
#
# - The loop induced decays for the gluino, neutralinos and stops
#   are included.
#
# - The SUSY decays of the top quark are included.
#
#
#         PDG            Width
DECAY         6     1.43945389E+00   # top decays
#          BR         NDA      ID1       ID2
     1.00000000E+00    2           5        24   # BR(t ->  b    W+)
#
#         PDG            Width
DECAY   1000021     1.44586802E+02   # gluino decays
#          BR         NDA      ID1       ID2
     1.06262565E-02    2     2000001        -1   # BR(~g -> ~d_R  db)
     1.06262565E-02    2    -2000001         1   # BR(~g -> ~d_R* d )
     1.57699378E-01    2     2000002        -2   # BR(~g -> ~u_R  ub)
     1.57699378E-01    2    -2000002         2   # BR(~g -> ~u_R* u )
     1.06262565E-02    2     2000003        -3   # BR(~g -> ~s_R  sb)
     1.06262565E-02    2    -2000003         3   # BR(~g -> ~s_R* s )
     1.57699362E-01    2     2000004        -4   # BR(~g -> ~c_R  cb)
     1.57699362E-01    2    -2000004         4   # BR(~g -> ~c_R* c )
     8.40099583E-02    2     1000005        -5   # BR(~g -> ~b_1  bb)
     8.40099583E-02    2    -1000005         5   # BR(~g -> ~b_1* b )
     3.92377684E-02    2     2000005        -5   # BR(~g -> ~b_2  bb)
     3.92377684E-02    2    -2000005         5   # BR(~g -> ~b_2* b )
     4.01010207E-02    2     1000006        -6   # BR(~g -> ~t_1  tb)
     4.01010207E-02    2    -1000006         6   # BR(~g -> ~t_1* t )
#
#         PDG            Width
DECAY   1000006     4.71177257E+01   # stop1 decays
#          BR         NDA      ID1       ID2
     2.00700498E-01    2     1000022         6   # BR(~t_1 -> ~chi_10 t )
     8.61756595E-03    2     1000023         6   # BR(~t_1 -> ~chi_20 t )
     1.74539330E-01    2     1000025         6   # BR(~t_1 -> ~chi_30 t )
     1.65704692E-01    2     1000035         6   # BR(~t_1 -> ~chi_40 t )
     4.07866548E-01    2     1000024         5   # BR(~t_1 -> ~chi_1+ b )
     3.36963475E-02    2     1000037         5   # BR(~t_1 -> ~chi_2+ b )
     8.87501872E-03    2     1000005        24   # BR(~t_1 -> ~b_1    W+)
#
#         PDG            Width
DECAY   2000006     7.89529229E+01   # stop2 decays
#          BR         NDA      ID1       ID2
     3.58655035E-04    2     1000022         6   # BR(~t_2 -> ~chi_10 t )
     8.24439410E-02    2     1000023         6   # BR(~t_2 -> ~chi_20 t )
     1.77965197E-01    2     1000025         6   # BR(~t_2 -> ~chi_30 t )
     1.83930219E-01    2     1000035         6   # BR(~t_2 -> ~chi_40 t )
     7.32720527E-04    2     1000024         5   # BR(~t_2 -> ~chi_1+ b )
     3.61850132E-01    2     1000037         5   # BR(~t_2 -> ~chi_2+ b )
     5.48993783E-02    2     1000006        25   # BR(~t_2 -> ~t_1    h )
     4.66845395E-02    2     1000006        23   # BR(~t_2 -> ~t_1    Z )
     3.56297200E-04    2     1000005        24   # BR(~t_2 -> ~b_1    W+)
     9.07789209E-02    2     2000005        24   # BR(~t_2 -> ~b_2    W+)
#
#         PDG            Width
DECAY   1000005     2.26415531E+00   # sbottom1 decays
#          BR         NDA      ID1       ID2
     1.43313729E-02    2     1000022         5   # BR(~b_1 -> ~chi_10 b )
     3.79750528E-01    2     1000023         5   # BR(~b_1 -> ~chi_20 b )
     1.53545828E-01    2     1000025         5   # BR(~b_1 -> ~chi_30 b )
     1.51045957E-01    2     1000035         5   # BR(~b_1 -> ~chi_40 b )
     2.80141665E-02    2    -1000024         6   # BR(~b_1 -> ~chi_1- t )
     2.73312148E-01    2    -1000037         6   # BR(~b_1 -> ~chi_2- t )
#
#         PDG            Width
DECAY   2000005     4.70413893E+01   # sbottom2 decays
#          BR         NDA      ID1       ID2
     2.03562711E-01    2     1000022         5   # BR(~b_2 -> ~chi_10 b )
     6.02884266E-03    2     1000023         5   # BR(~b_2 -> ~chi_20 b )
     1.67251057E-02    2     1000025         5   # BR(~b_2 -> ~chi_30 b )
     1.69719413E-02    2     1000035         5   # BR(~b_2 -> ~chi_40 b )
     4.00638112E-01    2    -1000024         6   # BR(~b_2 -> ~chi_1- t )
     3.46878956E-01    2    -1000037         6   # BR(~b_2 -> ~chi_2- t )
     4.58001349E-03    2     1000005        25   # BR(~b_2 -> ~b_1    h )
     4.61431746E-03    2     1000005        23   # BR(~b_2 -> ~b_1    Z )
#
#         PDG            Width
DECAY   1000002     7.50626437E+01   # sup_L decays
#          BR         NDA      ID1       ID2
     2.02531516E-01    2     1000022         2   # BR(~u_L -> ~chi_10 u)
     7.34628679E-03    2     1000023         2   # BR(~u_L -> ~chi_20 u)
     1.26106069E-04    2     1000025         2   # BR(~u_L -> ~chi_30 u)
     3.38704375E-04    2     1000035         2   # BR(~u_L -> ~chi_40 u)
     4.06737330E-01    2     1000024         1   # BR(~u_L -> ~chi_1+ d)
     1.92929342E-04    2     1000037         1   # BR(~u_L -> ~chi_2+ d)
     3.82727127E-01    2     1000021         2   # BR(~u_L -> ~g      u)
#
#         PDG            Width
DECAY   2000002     1.20121285E+00   # sup_R decays
#          BR         NDA      ID1       ID2
     7.24698357E-06    2     1000022         2   # BR(~u_R -> ~chi_10 u)
     9.99992753E-01    2     1000023         2   # BR(~u_R -> ~chi_20 u)
#
#         PDG            Width
DECAY   1000001     7.50677066E+01   # sdown_L decays
#          BR         NDA      ID1       ID2
     2.02846410E-01    2     1000022         1   # BR(~d_L -> ~chi_10 d)
     6.60922747E-03    2     1000023         1   # BR(~d_L -> ~chi_20 d)
     1.80367579E-04    2     1000025         1   # BR(~d_L -> ~chi_30 d)
     6.67574750E-04    2     1000035         1   # BR(~d_L -> ~chi_40 d)
     4.04024517E-01    2    -1000024         2   # BR(~d_L -> ~chi_1- u)
     2.37064131E-03    2    -1000037         2   # BR(~d_L -> ~chi_2- u)
     3.83301262E-01    2     1000021         1   # BR(~d_L -> ~g      d)
#
#         PDG            Width
DECAY   2000001     1.46710725E+00   # sdown_R decays
#          BR         NDA      ID1       ID2
     4.01404313E-06    2     1000022         1   # BR(~d_R -> ~chi_10 d)
     9.98214686E-01    2     1000023         1   # BR(~d_R -> ~chi_20 d)
     1.43559554E-04    2     1000025         1   # BR(~d_R -> ~chi_30 d)
     1.63774016E-03    2     1000035         1   # BR(~d_R -> ~chi_40 d)
#
#         PDG            Width
DECAY   1000004     6.98195844E+01   # scharm_L decays
#          BR         NDA      ID1       ID2
     2.28419034E-01    2     1000022         4   # BR(~c_L -> ~chi_10 c)
     8.27126309E-03    2     1000023         4   # BR(~c_L -> ~chi_20 c)
     1.41568770E-04    2     1000025         4   # BR(~c_L -> ~chi_30 c)
     3.80231296E-04    2     1000035         4   # BR(~c_L -> ~chi_40 c)
     4.58726105E-01    2     1000024         3   # BR(~c_L -> ~chi_1+ s)
     2.16582683E-04    2     1000037         3   # BR(~c_L -> ~chi_2+ s)
     3.03845216E-01    2     1000021         4   # BR(~c_L -> ~g      c)
#
#         PDG            Width
DECAY   2000004     1.16345956E+00   # scharm_R decays
#          BR         NDA      ID1       ID2
     7.27951242E-06    2     1000022         4   # BR(~c_R -> ~chi_10 c)
     9.99992720E-01    2     1000023         4   # BR(~c_R -> ~chi_20 c)
#
#         PDG            Width
DECAY   1000003     6.98100228E+01   # sstrange_L decays
#          BR         NDA      ID1       ID2
     2.28820456E-01    2     1000022         3   # BR(~s_L -> ~chi_10 s)
     7.44290695E-03    2     1000023         3   # BR(~s_L -> ~chi_20 s)
     2.02524765E-04    2     1000025         3   # BR(~s_L -> ~chi_30 s)
     7.49575094E-04    2     1000035         3   # BR(~s_L -> ~chi_40 s)
     4.55758507E-01    2    -1000024         4   # BR(~s_L -> ~chi_1- c)
     2.66182331E-03    2    -1000037         4   # BR(~s_L -> ~chi_2- c)
     3.04364207E-01    2     1000021         3   # BR(~s_L -> ~g      s)
#
#         PDG            Width
DECAY   2000003     1.49546308E+00   # sstrange_R decays
#          BR         NDA      ID1       ID2
     4.02025956E-06    2     1000022         3   # BR(~s_R -> ~chi_10 s)
     9.98220591E-01    2     1000023         3   # BR(~s_R -> ~chi_20 s)
     1.43085125E-04    2     1000025         3   # BR(~s_R -> ~chi_30 s)
     1.63230363E-03    2     1000035         3   # BR(~s_R -> ~chi_40 s)
#
#         PDG            Width
DECAY   1000011     2.46172055E+01   # selectron_L decays
#          BR         NDA      ID1       ID2
     3.06050157E-01    2     1000022        11   # BR(~e_L -> ~chi_10 e-)
     8.11327803E-02    2     1000023        11   # BR(~e_L -> ~chi_20 e-)
     4.77665044E-05    2     1000025        11   # BR(~e_L -> ~chi_30 e-)
     7.02226226E-05    2     1000035        11   # BR(~e_L -> ~chi_40 e-)
     6.11319048E-01    2    -1000024        12   # BR(~e_L -> ~chi_1- nu_e)
     1.38002576E-03    2    -1000037        12   # BR(~e_L -> ~chi_2- nu_e)
#
#         PDG            Width
DECAY   2000011     1.98048757E-07   # selectron_R decays
#          BR         NDA      ID1       ID2
     1.00000000E+00    2     1000022        11   # BR(~e_R -> ~chi_10 e-)
#
#         PDG            Width
DECAY   1000013     2.46172055E+01   # smuon_L decays
#          BR         NDA      ID1       ID2
     3.06050156E-01    2     1000022        13   # BR(~mu_L -> ~chi_10 mu-)
     8.11327799E-02    2     1000023        13   # BR(~mu_L -> ~chi_20 mu-)
     4.77665036E-05    2     1000025        13   # BR(~mu_L -> ~chi_30 mu-)
     7.02226214E-05    2     1000035        13   # BR(~mu_L -> ~chi_40 mu-)
     6.11319049E-01    2    -1000024        14   # BR(~mu_L -> ~chi_1- nu_mu)
     1.38002576E-03    2    -1000037        14   # BR(~mu_L -> ~chi_2- nu_mu)
#
#         PDG            Width
DECAY   2000013     1.98047915E-07   # smuon_R decays
#          BR         NDA      ID1       ID2
     1.00000000E+00    2     1000022        13   # BR(~mu_R -> ~chi_10 mu-)
#
#         PDG            Width
DECAY   1000015     4.94087847E+00   # stau_1 decays
#          BR         NDA      ID1       ID2
     3.33460667E-01    2     1000022        15   # BR(~tau_1 -> ~chi_10  tau-)
     1.54985289E-03    2     1000023        15   # BR(~tau_1 -> ~chi_20  tau-)
     6.64989480E-01    2    -1000024        16   # BR(~tau_1 -> ~chi_1-  nu_tau)
#
#         PDG            Width
DECAY   2000015     8.80547808E+00   # stau_2 decays
#          BR         NDA      ID1       ID2
     5.70532491E-05    2     1000022        15   # BR(~tau_2 -> ~chi_10  tau-)
     7.29068328E-01    2     1000023        15   # BR(~tau_2 -> ~chi_20  tau-)
     1.69579953E-02    2     1000025        15   # BR(~tau_2 -> ~chi_30  tau-)
     1.71786779E-02    2     1000035        15   # BR(~tau_2 -> ~chi_40  tau-)
     1.08675332E-04    2    -1000024        16   # BR(~tau_2 -> ~chi_1-  nu_tau)
     3.34598947E-02    2    -1000037        16   # BR(~tau_2 -> ~chi_2-  nu_tau)
     9.99612527E-02    2     1000016       -24   # BR(~tau_2 -> ~nu_tauL W-)
     5.21948901E-02    2     1000015        25   # BR(~tau_2 -> ~tau_1   h)
     5.10132323E-02    2     1000015        23   # BR(~tau_2 -> ~tau_1   Z)
#
#         PDG            Width
DECAY   1000012     2.46408260E+01   # snu_eL decays
#          BR         NDA      ID1       ID2
     3.06754878E-01    2     1000022        12   # BR(~nu_eL -> ~chi_10 nu_e)
     7.81242102E-02    2     1000023        12   # BR(~nu_eL -> ~chi_20 nu_e)
     1.42326285E-04    2     1000025        12   # BR(~nu_eL -> ~chi_30 nu_e)
     6.42133059E-04    2     1000035        12   # BR(~nu_eL -> ~chi_40 nu_e)
     6.14224697E-01    2     1000024        11   # BR(~nu_eL -> ~chi_1+ e-)
     1.11755202E-04    2     1000037        11   # BR(~nu_eL -> ~chi_2+ e-)
#
#         PDG            Width
DECAY   1000014     2.46408259E+01   # snu_muL decays
#          BR         NDA      ID1       ID2
     3.06754879E-01    2     1000022        14   # BR(~nu_muL -> ~chi_10 nu_mu)
     7.81242105E-02    2     1000023        14   # BR(~nu_muL -> ~chi_20 nu_mu)
     1.42326285E-04    2     1000025        14   # BR(~nu_muL -> ~chi_30 nu_mu)
     6.42133062E-04    2     1000035        14   # BR(~nu_muL -> ~chi_40 nu_mu)
     6.14224696E-01    2     1000024        13   # BR(~nu_muL -> ~chi_1+ mu-)
     1.11755200E-04    2     1000037        13   # BR(~nu_muL -> ~chi_2+ mu-)
#
#         PDG            Width
DECAY   1000016     4.91285790E+00   # snu_tauL decays
#          BR         NDA      ID1       ID2
     3.32550141E-01    2     1000022        16   # BR(~nu_tauL -> ~chi_10 nu_tau)
     1.25282968E-03    2     1000023        16   # BR(~nu_tauL -> ~chi_20 nu_tau)
     6.66197030E-01    2     1000024        15   # BR(~nu_tauL -> ~chi_1+ tau-)
#
#         PDG            Width
DECAY   1000024     4.17352640E-15   # chargino1+ decays
#           BR         NDA      ID1       ID2       ID3
     1.93448430E-02    3     1000022       -11        12   # BR(~chi_1+ -> ~chi_10 e+   nu_e)
     2.51778580E-03    3     1000022       -13        14   # BR(~chi_1+ -> ~chi_10 mu+  nu_mu)
     9.78137370E-01    2     1000022       211             # BR(~chi_1+ -> ~chi_10 pi+)
#
#         PDG            Width
DECAY   1000037     8.91695281E+00   # chargino2+ decays
#          BR         NDA      ID1       ID2
     3.25795875E-02    2     1000016       -15   # BR(~chi_2+ -> ~nu_tau1 tau+)
     1.69619956E-03    2    -1000015        16   # BR(~chi_2+ -> ~tau_1+  nu_tau)
     2.97688835E-01    2     1000024        23   # BR(~chi_2+ -> ~chi_1+  Z )
     2.89258059E-01    2     1000022        24   # BR(~chi_2+ -> ~chi_10  W+)
     8.19861016E-02    2     1000023        24   # BR(~chi_2+ -> ~chi_20  W+)
     2.96791218E-01    2     1000024        25   # BR(~chi_2+ -> ~chi_1+  h )
#
#         PDG            Width
DECAY   1000022     0.00000000E+00   # neutralino1 decays
#
#         PDG            Width
DECAY   1000023     3.20160487E+00   # neutralino2 decays
#          BR         NDA      ID1       ID2
     9.08981339E-05    2     1000022        23   # BR(~chi_20 -> ~chi_10   Z )
     7.75512918E-04    2     1000024       -24   # BR(~chi_20 -> ~chi_1+   W-)
     7.75512918E-04    2    -1000024        24   # BR(~chi_20 -> ~chi_1-   W+)
     7.26455672E-04    2     1000022        25   # BR(~chi_20 -> ~chi_10   h )
     2.49407905E-01    2     2000011       -11   # BR(~chi_20 -> ~e_R-     e+)
     2.49407905E-01    2    -2000011        11   # BR(~chi_20 -> ~e_R+     e-)
     2.49407905E-01    2     2000013       -13   # BR(~chi_20 -> ~mu_R-    mu+)
     2.49407905E-01    2    -2000013        13   # BR(~chi_20 -> ~mu_R+    mu-)
#
#         PDG            Width
DECAY   1000025     8.82470496E+00   # neutralino3 decays
#          BR         NDA      ID1       ID2
     2.29539996E-01    2     1000022        23   # BR(~chi_30 -> ~chi_10   Z )
     7.53053186E-02    2     1000023        23   # BR(~chi_30 -> ~chi_20   Z )
     2.92655736E-01    2     1000024       -24   # BR(~chi_30 -> ~chi_1+   W-)
     2.92655736E-01    2    -1000024        24   # BR(~chi_30 -> ~chi_1-   W+)
     6.99696306E-02    2     1000022        25   # BR(~chi_30 -> ~chi_10   h )
     6.78050248E-03    2     1000023        25   # BR(~chi_30 -> ~chi_20   h )
     3.21938029E-06    2     2000002        -2   # BR(~chi_30 -> ~u_R      ub)
     3.21938029E-06    2    -2000002         2   # BR(~chi_30 -> ~u_R*     u )
     3.21913017E-06    2     2000004        -4   # BR(~chi_30 -> ~c_R      cb)
     3.21913017E-06    2    -2000004         4   # BR(~chi_30 -> ~c_R*     c )
     6.78655767E-05    2     2000011       -11   # BR(~chi_30 -> ~e_R-     e+)
     6.78655767E-05    2    -2000011        11   # BR(~chi_30 -> ~e_R+     e-)
     6.78655767E-05    2     2000013       -13   # BR(~chi_30 -> ~mu_R-    mu+)
     6.78655767E-05    2    -2000013        13   # BR(~chi_30 -> ~mu_R+    mu-)
     1.61935892E-02    2     1000015       -15   # BR(~chi_30 -> ~tau_1-   tau+)
     1.61935892E-02    2    -1000015        15   # BR(~chi_30 -> ~tau_1+   tau-)
     2.10781631E-04    2     1000016       -16   # BR(~chi_30 -> ~nu_tau1  nu_taub)
     2.10781631E-04    2    -1000016        16   # BR(~chi_30 -> ~nu_tau1* nu_tau )
#
#         PDG            Width
DECAY   1000035     8.91782472E+00   # neutralino4 decays
#          BR         NDA      ID1       ID2
     7.12811818E-02    2     1000022        23   # BR(~chi_40 -> ~chi_10   Z )
     6.80493336E-03    2     1000023        23   # BR(~chi_40 -> ~chi_20   Z )
     2.90135878E-01    2     1000024       -24   # BR(~chi_40 -> ~chi_1+   W-)
     2.90135878E-01    2    -1000024        24   # BR(~chi_40 -> ~chi_1-   W+)
     2.28516277E-01    2     1000022        25   # BR(~chi_40 -> ~chi_10   h )
     7.60862841E-02    2     1000023        25   # BR(~chi_40 -> ~chi_20   h )
     3.75081634E-05    2     2000002        -2   # BR(~chi_40 -> ~u_R      ub)
     3.75081634E-05    2    -2000002         2   # BR(~chi_40 -> ~u_R*     u )
     3.75053470E-05    2     2000004        -4   # BR(~chi_40 -> ~c_R      cb)
     3.75053470E-05    2    -2000004         4   # BR(~chi_40 -> ~c_R*     c )
     7.69093992E-04    2     2000011       -11   # BR(~chi_40 -> ~e_R-     e+)
     7.69093992E-04    2    -2000011        11   # BR(~chi_40 -> ~e_R+     e-)
     7.69093992E-04    2     2000013       -13   # BR(~chi_40 -> ~mu_R-    mu+)
     7.69093992E-04    2    -2000013        13   # BR(~chi_40 -> ~mu_R+    mu-)
     1.59566033E-02    2     1000015       -15   # BR(~chi_40 -> ~tau_1-   tau+)
     1.59566033E-02    2    -1000015        15   # BR(~chi_40 -> ~tau_1+   tau-)
     9.49979595E-04    2     1000016       -16   # BR(~chi_40 -> ~nu_tau1  nu_taub)
     9.49979595E-04    2    -1000016        16   # BR(~chi_40 -> ~nu_tau1* nu_tau )
#
#         PDG            Width
DECAY        25     4.29261727E-03   # h decays
#          BR         NDA      ID1       ID2
     6.44041535E-01    2           5        -5   # BR(h -> b       bb     )
     6.00544131E-02    2         -15        15   # BR(h -> tau+    tau-   )
     2.12565101E-04    2         -13        13   # BR(h -> mu+     mu-    )
     2.32302634E-04    2           3        -3   # BR(h -> s       sb     )
     2.00867652E-02    2           4        -4   # BR(h -> c       cb     )
     7.28589245E-02    2          21        21   # BR(h -> g       g      )
     2.12292687E-03    2          22        22   # BR(h -> gam     gam    )
     1.34078244E-03    2          22        23   # BR(h -> Z       gam    )
     1.77246769E-01    2          24       -24   # BR(h -> W+      W-     )
     2.18030159E-02    2          23        23   # BR(h -> Z       Z      )
#
#         PDG            Width
DECAY        35     5.95925023E+01   # H decays
#          BR         NDA      ID1       ID2
     2.97472994E-01    2           5        -5   # BR(H -> b       bb     )
     6.78845391E-02    2         -15        15   # BR(H -> tau+    tau-   )
     2.34252818E-04    2         -13        13   # BR(H -> mu+     mu-    )
     1.20643036E-04    2           3        -3   # BR(H -> s       sb     )
     5.21160578E-08    2           4        -4   # BR(H -> c       cb     )
     5.14249252E-03    2           6        -6   # BR(H -> t       tb     )
     1.82371603E-06    2          21        21   # BR(H -> g       g      )
     6.61243747E-09    2          22        22   # BR(H -> gam     gam    )
     1.60105127E-09    2          23        22   # BR(H -> Z       gam    )
     1.84867070E-06    2          24       -24   # BR(H -> W+      W-     )
     9.22737344E-07    2          23        23   # BR(H -> Z       Z      )
     7.35034501E-06    2          25        25   # BR(H -> h       h      )
     3.70312771E-03    2     1000024  -1000024   # BR(H -> ~chi_1+ ~chi_1-)
     1.22133324E-04    2     1000037  -1000037   # BR(H -> ~chi_2+ ~chi_2-)
     1.87129328E-01    2     1000024  -1000037   # BR(H -> ~chi_1+ ~chi_2-)
     1.87129328E-01    2     1000037  -1000024   # BR(H -> ~chi_2+ ~chi_1-)
     1.85970133E-03    2     1000022   1000022   # BR(H -> ~chi_10 ~chi_10)
     2.30602480E-04    2     1000023   1000023   # BR(H -> ~chi_20 ~chi_20)
     1.03212294E-04    2     1000025   1000025   # BR(H -> ~chi_30 ~chi_30)
     5.46256603E-04    2     1000035   1000035   # BR(H -> ~chi_40 ~chi_40)
     1.36385424E-03    2     1000022   1000023   # BR(H -> ~chi_10 ~chi_20)
     9.52409532E-02    2     1000022   1000025   # BR(H -> ~chi_10 ~chi_30)
     9.01969762E-02    2     1000022   1000035   # BR(H -> ~chi_10 ~chi_40)
     2.63880447E-02    2     1000023   1000025   # BR(H -> ~chi_20 ~chi_30)
     2.08133014E-02    2     1000023   1000035   # BR(H -> ~chi_20 ~chi_40)
     1.22206731E-03    2     1000025   1000035   # BR(H -> ~chi_30 ~chi_40)
     1.57090739E-07    2     2000002  -2000002   # BR(H -> ~u_R    ~u_R*  )
     1.57090739E-07    2     2000004  -2000004   # BR(H -> ~c_R    ~c_R*  )
     1.56873728E-07    2     2000011  -2000011   # BR(H -> ~e_R-   ~e_R+  )
     1.56873728E-07    2     2000013  -2000013   # BR(H -> ~mu_R-  ~mu_R+ )
     1.78964972E-05    2     1000015  -1000015   # BR(H -> ~tau_1- ~tau_1+)
     3.12085428E-06    2     2000015  -2000015   # BR(H -> ~tau_2- ~tau_2+)
     6.53090261E-03    2     1000015  -2000015   # BR(H -> ~tau_1- ~tau_2+)
     6.53090261E-03    2     2000015  -1000015   # BR(H -> ~tau_2- ~tau_1+)
     7.34343586E-07    2     1000016  -1000016   # BR(H -> ~nu_tauL ~nu_tauL*)
#
#         PDG            Width
DECAY        36     5.95955736E+01   # A decays
#          BR         NDA      ID1       ID2
     2.97477969E-01    2           5        -5   # BR(A -> b       bb     )
     6.78814158E-02    2         -15        15   # BR(A -> tau+    tau-   )
     2.34241855E-04    2         -13        13   # BR(A -> mu+     mu-    )
     1.20654831E-04    2           3        -3   # BR(A -> s       sb     )
     5.24142746E-08    2           4        -4   # BR(A -> c       cb     )
     5.15133845E-03    2           6        -6   # BR(A -> t       tb     )
     1.55498621E-05    2          21        21   # BR(A -> g       g      )
     1.99920616E-09    2          22        22   # BR(A -> gam     gam    )
     1.46628453E-08    2          23        22   # BR(A -> Z       gam    )
     1.87544752E-06    2          23        25   # BR(A -> Z       h      )
     3.74768961E-03    2     1000024  -1000024   # BR(A -> ~chi_1+ ~chi_1-)
     1.48979173E-04    2     1000037  -1000037   # BR(A -> ~chi_2+ ~chi_2-)
     1.87089248E-01    2     1000024  -1000037   # BR(A -> ~chi_1+ ~chi_2-)
     1.87089248E-01    2     1000037  -1000024   # BR(A -> ~chi_2+ ~chi_1-)
     1.88158281E-03    2     1000022   1000022   # BR(A -> ~chi_10 ~chi_10)
     2.55872333E-04    2     1000023   1000023   # BR(A -> ~chi_20 ~chi_20)
     2.85645776E-04    2     1000025   1000025   # BR(A -> ~chi_30 ~chi_30)
     1.05481844E-03    2     1000035   1000035   # BR(A -> ~chi_40 ~chi_40)
     1.41143096E-03    2     1000022   1000023   # BR(A -> ~chi_10 ~chi_20)
     9.15001891E-02    2     1000022   1000025   # BR(A -> ~chi_10 ~chi_30)
     9.38706258E-02    2     1000022   1000035   # BR(A -> ~chi_10 ~chi_40)
     2.11866314E-02    2     1000023   1000025   # BR(A -> ~chi_20 ~chi_30)
     2.59445790E-02    2     1000023   1000035   # BR(A -> ~chi_20 ~chi_40)
     5.64001281E-04    2     1000025   1000035   # BR(A -> ~chi_30 ~chi_40)
     6.54317215E-03    2     1000015  -2000015   # BR(A -> ~tau_1- ~tau_2+)
     6.54317215E-03    2    -1000015   2000015   # BR(A -> ~tau_1+ ~tau_2-)
#
#         PDG            Width
DECAY        37     5.64783601E+01   # H+ decays
#          BR         NDA      ID1       ID2
     4.35016609E-04    2           4        -5   # BR(H+ -> c       bb     )
     7.16504699E-02    2         -15        16   # BR(H+ -> tau+    nu_tau )
     2.47247922E-04    2         -13        14   # BR(H+ -> mu+     nu_mu  )
     4.35016197E-06    2           2        -5   # BR(H+ -> u       bb     )
     6.37231823E-06    2           2        -3   # BR(H+ -> u       sb     )
     1.25479639E-04    2           4        -3   # BR(H+ -> c       sb     )
     2.63926866E-01    2           6        -5   # BR(H+ -> t       bb     )
     1.98159497E-06    2          24        25   # BR(H+ -> W+      h      )
     5.57870033E-14    2          24        36   # BR(H+ -> W+      A      )
     8.85009399E-09    2     1000024   1000022   # BR(H+ -> ~chi_1+ ~chi_10)
     2.96014370E-03    2     1000024   1000023   # BR(H+ -> ~chi_1+ ~chi_20)
     1.98194961E-01    2     1000024   1000025   # BR(H+ -> ~chi_1+ ~chi_30)
     1.96997895E-01    2     1000024   1000035   # BR(H+ -> ~chi_1+ ~chi_40)
     1.99412353E-01    2     1000037   1000022   # BR(H+ -> ~chi_2+ ~chi_10)
     5.12669651E-02    2     1000037   1000023   # BR(H+ -> ~chi_2+ ~chi_20)
     5.14756537E-04    2     1000037   1000025   # BR(H+ -> ~chi_2+ ~chi_30)
     4.28168023E-04    2     1000037   1000035   # BR(H+ -> ~chi_2+ ~chi_40)
     1.36538458E-05    2    -1000015   1000016   # BR(H+ -> ~tau_1+ ~nu_tauL)
     1.38133109E-02    2    -2000015   1000016   # BR(H+ -> ~tau_2+ ~nu_tauL)
