#
#                              ======================
#                              | THE SUSYHIT OUTPUT |
#                              ======================
#
#
#              ------------------------------------------------------
#              |     This is the output of the SUSY-HIT package     |
#              |  created by A.Djouadi, M.Muehlleitner and M.Spira. |
#              |  In case of problems with SUSY-HIT email to        |
#              |           margarete.muehlleitner@cern.ch           |
#              |           michael.spira@psi.ch                     |
#              |           abdelhak.djouadi@cern.ch                 |
#              ------------------------------------------------------
#
#              ------------------------------------------------------
#              |  SUSY Les Houches Accord - MSSM Spectrum + Decays  |
#              |              based on the decay programs           |
#              |                                                    |
#              |                     SDECAY 1.3b                    |
#              |                                                    |
#              |  Authors: M.Muhlleitner, A.Djouadi and Y.Mambrini  |
#              |  Ref.:    Comput.Phys.Commun.168(2005)46           |
#              |           [hep-ph/0311167]                         |
#              |                                                    |
#              |                     HDECAY 3.4                     |
#              |                                                    |
#              |  By: A.Djouadi,J.Kalinowski,M.Muhlleitner,M.Spira  |
#              |  Ref.:    Comput.Phys.Commun.108(1998)56           |
#              |           [hep-ph/9704448]                         |
#              |                                                    |
#              |                                                    |
#              |  If not stated otherwise all DRbar couplings and   |
#              |  soft SUSY breaking masses are given at the scale  |
#              |  Q=  0.24697490E+04
#              |                                                    |
#              ------------------------------------------------------
#
#
BLOCK DCINFO  # Decay Program information
     1   SDECAY/HDECAY # decay calculator
     2   1.3b  /3.4    # version number
#
BLOCK SPINFO  # Spectrum calculator information
     1     SOFTSUSY    # spectrum calculator               
     2     3.4.0       # version number                    
#
BLOCK MODSEL  # Model selection
     1     0   #  nonUniversal                                     
#
BLOCK SMINPUTS  # Standard Model inputs
         1     1.27908970E+02   # alpha_em^-1(M_Z)^MSbar
         2     1.16637870E-05   # G_F [GeV^-2]
         3     1.18400000E-01   # alpha_S(M_Z)^MSbar
         4     9.11876000E+01   # M_Z pole mass
         5     4.18000000E+00   # mb(mb)^MSbar
         6     1.73200000E+02   # mt pole mass
         7     1.77700000E+00   # mtau pole mass
#
BLOCK MINPAR  # Input parameters - minimal models
         3     3.65900000E+01   # tanb                
#
BLOCK EXTPAR  # Input parameters - non-minimal models
         0    -1.00000000E+00   # Set                 
         1    -2.44989000E+03   # M_1(MX)             
         2    -1.95292000E+03   # M_2(MX)             
         3     1.85939000E+03   # M_3(MX)             
        11    -3.78747000E+03   # At(MX)              
        12    -3.24906000E+03   # Ab(MX)              
        13     2.94667000E+03   # Atau(MX)            
        23    -5.85670000E+02   # mu(MX)              
        26     3.79605000E+03   # mA(pole)            
        31     2.45999000E+03   # meL(MX)             
        32     2.45999000E+03   # mmuL(MX)            
        33     3.95061000E+03   # mtauL(MX)           
        34     3.32302000E+03   # meR(MX)             
        35     3.32302000E+03   # mmuR(MX)            
        36     2.03411000E+03   # mtauR(MX)           
        41     2.91147000E+03   # mqL1(MX)            
        42     2.91147000E+03   # mqL2(MX)            
        43     1.54476000E+03   # mqL3(MX)            
        44     4.66060000E+02   # muR(MX)             
        45     4.66060000E+02   # mcR(MX)             
        46     3.94700000E+03   # mtR(MX)             
        47     3.31588000E+03   # mdR(MX)             
        48     3.31588000E+03   # msR(MX)             
        49     2.94608000E+03   # mbR(MX)             
#
BLOCK MASS  # Mass Spectrum
# PDG code           mass       particle
        24     8.03843261E+01   # W+
        25     1.26756070E+02   # h
        35     3.79605541E+03   # H
        36     3.79605006E+03   # A
        37     3.79713058E+03   # H+
         5     4.81876030E+00   # b-quark pole mass calculated from mb(mb)_Msbar
   1000001     2.97101649E+03   # ~d_L
   2000001     3.35956157E+03   # ~d_R
   1000002     2.97009056E+03   # ~u_L
   2000002     6.72187158E+02   # ~u_R
   1000003     2.97101649E+03   # ~s_L
   2000003     3.35956157E+03   # ~s_R
   1000004     2.97009056E+03   # ~c_L
   2000004     6.72187158E+02   # ~c_R
   1000005     1.64560677E+03   # ~b_1
   2000005     2.98229062E+03   # ~b_2
   1000006     1.64363910E+03   # ~t_1
   2000006     3.95087701E+03   # ~t_2
   1000011     2.47781313E+03   # ~e_L
   2000011     3.32565068E+03   # ~e_R
   1000012     2.47621478E+03   # ~nu_eL
   1000013     2.47781313E+03   # ~mu_L
   2000013     3.32565068E+03   # ~mu_R
   1000014     2.47621478E+03   # ~nu_muL
   1000015     2.03693943E+03   # ~tau_1
   2000015     3.95900447E+03   # ~tau_2
   1000016     3.95785409E+03   # ~nu_tauL
   1000021     2.03545861E+03   # ~g
   1000022    -6.07648842E+02   # ~chi_10
   1000023     6.11756921E+02   # ~chi_20
   1000025    -1.98596849E+03   # ~chi_30
   1000035    -2.42957418E+03   # ~chi_40
   1000024     6.09548657E+02   # ~chi_1+
   1000037     1.98614615E+03   # ~chi_2+
#
BLOCK NMIX  # Neutralino Mixing Matrix
  1  1    -1.73042746E-02   # N_11
  1  2     4.15691359E-02   # N_12
  1  3     7.07906054E-01   # N_13
  1  4    -7.04869908E-01   # N_14
  2  1     9.79554592E-03   # N_21
  2  2    -2.11505286E-02   # N_22
  2  3     7.06137347E-01   # N_23
  2  4     7.07691140E-01   # N_24
  3  1     4.50444346E-03   # N_31
  3  2     9.98905346E-01   # N_32
  3  3    -1.44884292E-02   # N_33
  3  4     4.42482205E-02   # N_34
  4  1     9.99792138E-01   # N_41
  4  2    -3.57375078E-03   # N_42
  4  3     5.39918456E-03   # N_43
  4  4    -1.93328157E-02   # N_44
#
BLOCK UMIX  # Chargino Mixing Matrix U
  1  1     2.05595478E-02   # U_11
  1  2     9.99788630E-01   # U_12
  2  1    -9.99788630E-01   # U_21
  2  2     2.05595478E-02   # U_22
#
BLOCK VMIX  # Chargino Mixing Matrix V
  1  1    -6.27807282E-02   # V_11
  1  2    -9.98027344E-01   # V_12
  2  1     9.98027344E-01   # V_21
  2  2    -6.27807282E-02   # V_22
#
BLOCK STOPMIX  # Stop Mixing Matrix
  1  1     9.99125738E-01   # cos(theta_t)
  1  2     4.18062156E-02   # sin(theta_t)
  2  1    -4.18062156E-02   # -sin(theta_t)
  2  2     9.99125738E-01   # cos(theta_t)
#
BLOCK SBOTMIX  # Sbottom Mixing Matrix
  1  1     9.99974866E-01   # cos(theta_b)
  1  2    -7.08994840E-03   # sin(theta_b)
  2  1     7.08994840E-03   # -sin(theta_b)
  2  2     9.99974866E-01   # cos(theta_b)
#
BLOCK STAUMIX  # Stau Mixing Matrix
  1  1    -3.84452960E-03   # cos(theta_tau)
  1  2     9.99992610E-01   # sin(theta_tau)
  2  1    -9.99992610E-01   # -sin(theta_tau)
  2  2    -3.84452960E-03   # cos(theta_tau)
#
BLOCK ALPHA  # Higgs mixing
          -2.80307964E-02   # Mixing angle in the neutral Higgs boson sector
#
BLOCK HMIX Q=  2.46974900E+03  # DRbar Higgs Parameters
         1    -5.98895853E+02   # mu(Q)MSSM           
         2     3.57369526E+01   # tan                 
         3     2.42844971E+02   # higgs               
         4     1.46644600E+07   # mA^2(Q)MSSM         
#
BLOCK GAUGE Q=  2.46974900E+03  # The gauge couplings
     1     3.64569408E-01   # gprime(Q) DRbar
     2     6.37543684E-01   # g(Q) DRbar
     3     1.02387318E+00   # g3(Q) DRbar
#
BLOCK AU Q=  2.46974900E+03  # The trilinear couplings
  1  1     0.00000000E+00   # A_u(Q) DRbar
  2  2     0.00000000E+00   # A_c(Q) DRbar
  3  3    -3.78746999E+03   # A_t(Q) DRbar
#
BLOCK AD Q=  2.46974900E+03  # The trilinear couplings
  1  1     0.00000000E+00   # A_d(Q) DRbar
  2  2     0.00000000E+00   # A_s(Q) DRbar
  3  3    -3.24906000E+03   # A_b(Q) DRbar
#
BLOCK AE Q=  2.46974900E+03  # The trilinear couplings
  1  1     0.00000000E+00   # A_e(Q) DRbar
  2  2     0.00000000E+00   # A_mu(Q) DRbar
  3  3     2.94667000E+03   # A_tau(Q) DRbar
#
BLOCK Yu Q=  2.46974900E+03  # The Yukawa couplings
  1  1     0.00000000E+00   # y_u(Q) DRbar
  2  2     0.00000000E+00   # y_c(Q) DRbar
  3  3     8.22536803E-01   # y_t(Q) DRbar
#
BLOCK Yd Q=  2.46974900E+03  # The Yukawa couplings
  1  1     0.00000000E+00   # y_d(Q) DRbar
  2  2     0.00000000E+00   # y_s(Q) DRbar
  3  3     5.24509568E-01   # y_b(Q) DRbar
#
BLOCK Ye Q=  2.46974900E+03  # The Yukawa couplings
  1  1     0.00000000E+00   # y_e(Q) DRbar
  2  2     0.00000000E+00   # y_mu(Q) DRbar
  3  3     3.72910728E-01   # y_tau(Q) DRbar
#
BLOCK MSOFT Q=  2.46974900E+03  # The soft SUSY breaking masses at the scale Q
         1    -2.44989000E+03   # M_1(Q)              
         2    -1.95292000E+03   # M_2(Q)              
         3     1.85939000E+03   # M_3(Q)              
        21     1.41880746E+07   # mH1^2(Q)            
        22    -3.73719140E+05   # mH2^2(Q)            
        31     2.45999000E+03   # meL(Q)              
        32     2.45999000E+03   # mmuL(Q)             
        33     3.95061000E+03   # mtauL(Q)            
        34     3.32302000E+03   # meR(Q)              
        35     3.32302000E+03   # mmuR(Q)             
        36     2.03411000E+03   # mtauR(Q)            
        41     2.91147000E+03   # mqL1(Q)             
        42     2.91147000E+03   # mqL2(Q)             
        43     1.54475998E+03   # mqL3(Q)             
        44     4.66059981E+02   # muR(Q)              
        45     4.66059981E+02   # mcR(Q)              
        46     3.94699999E+03   # mtR(Q)              
        47     3.31588000E+03   # mdR(Q)              
        48     3.31588000E+03   # msR(Q)              
        49     2.94607999E+03   # mbR(Q)              
#
Block HiggsBoundsInputHiggsCouplingsFermions
# ScalarNormEffCoupSq PseudoSNormEffCoupSq NP   IP1 IP2 IP2
    1.00399622E+00    0.00000000E+00        3  25   5   5  # h0-b-b eff. coupling^2, normalised to SM
    1.27712578E+03    0.00000000E+00        3  35   5   5  # H0-b-b eff. coupling^2, normalised to SM
    0.00000000E+00    1.27712978E+03        3  36   5   5  # A0-b-b eff. coupling^2, normalised to SM
#
    9.99996871E-01    0.00000000E+00        3  25   6   6  # h0-t-t eff. coupling^2, normalised to SM
    7.86134847E-04    0.00000000E+00        3  35   6   6  # H0-t-t eff. coupling^2, normalised to SM
    0.00000000E+00    7.83005780E-04        3  36   6   6  # A0-t-t eff. coupling^2, normalised to SM
#
    1.00399622E+00    0.00000000E+00        3  25  15  15  # h0-tau-tau eff. coupling^2, normalised to SM
    1.27712578E+03    0.00000000E+00        3  35  15  15  # H0-tau-tau eff. coupling^2, normalised to SM
    0.00000000E+00    1.27712978E+03        3  36  15  15  # A0-tau-tau eff. coupling^2, normalised to SM
#
Block HiggsBoundsInputHiggsCouplingsBosons
    9.99999997E-01        3  25  24  24  # h0-W-W eff. coupling^2, normalised to SM
    3.11988785E-09        3  35  24  24  # H0-W-W eff. coupling^2, normalised to SM
    0.00000000E+00        3  36  24  24  # A0-W-W eff. coupling^2, normalised to SM
#
    9.99999997E-01        3  25  23  23  # h0-Z-Z eff. coupling^2, normalised to SM
    3.11988785E-09        3  35  23  23  # H0-Z-Z eff. coupling^2, normalised to SM
    0.00000000E+00        3  36  23  23  # A0-Z-Z eff. coupling^2, normalised to SM
#
    8.85812507E-01        3  25  21  21  # h0-g-g eff. coupling^2, normalised to SM
    5.62136875E-14        3  35  21  21  # H0-g-g eff. coupling^2, normalised to SM
    3.58223226E-13        3  36  21  21  # A0-g-g eff. coupling^2, normalised to SM
#
    0.00000000E+00        3  25  25  23  # h0-h0-Z eff. coupling^2, normalised to SM
    0.00000000E+00        3  35  25  23  # H0-h0-Z eff. coupling^2, normalised to SM
    3.11988785E-09        3  36  25  23  # A0-h0-Z eff. coupling^2, normalised to SM
    0.00000000E+00        3  35  35  23  # H0-H0-Z eff. coupling^2, normalised to SM
    9.99999997E-01        3  36  35  23  # A0-H0-Z eff. coupling^2, normalised to SM
    0.00000000E+00        3  36  36  23  # A0-A0-Z eff. coupling^2, normalised to SM
#
    0.00000000E+00        4  25  21  21  23  # h0-g-g-Z eff. coupling^2, normalised to SM
    0.00000000E+00        4  35  21  21  23  # H0-g-g-Z eff. coupling^2, normalised to SM
    0.00000000E+00        4  36  21  21  23  # A0-g-g-Z eff. coupling^2, normalised to SM
#
#
#
#                             =================
#                             |The decay table|
#                             =================
#
# - The QCD corrections to the decays gluino -> squark  + quark
#                                     squark -> gaugino + quark_prime
#                                     squark -> squark_prime + Higgs
#                                     squark -> gluino  + quark
#   are included.
#
# - The multi-body decays for the inos, stops and sbottoms are included.
#
# - The loop induced decays for the gluino, neutralinos and stops
#   are included.
#
# - The SUSY decays of the top quark are included.
#
#
#         PDG            Width
DECAY         6     1.43174668E+00   # top decays
#          BR         NDA      ID1       ID2
     1.00000000E+00    2           5        24   # BR(t ->  b    W+)
#
#         PDG            Width
DECAY   1000021     7.08148709E+01   # gluino decays
#          BR         NDA      ID1       ID2
     2.15645834E-01    2     2000002        -2   # BR(~g -> ~u_R  ub)
     2.15645834E-01    2    -2000002         2   # BR(~g -> ~u_R* u )
     2.15645794E-01    2     2000004        -4   # BR(~g -> ~c_R  cb)
     2.15645794E-01    2    -2000004         4   # BR(~g -> ~c_R* c )
     3.63760371E-02    2     1000005        -5   # BR(~g -> ~b_1  bb)
     3.63760371E-02    2    -1000005         5   # BR(~g -> ~b_1* b )
     3.23323343E-02    2     1000006        -6   # BR(~g -> ~t_1  tb)
     3.23323343E-02    2    -1000006         6   # BR(~g -> ~t_1* t )
#
#         PDG            Width
DECAY   1000006     2.25513072E+01   # stop1 decays
#          BR         NDA      ID1       ID2
     3.52422721E-01    2     1000022         6   # BR(~t_1 -> ~chi_10 t )
     3.51481991E-01    2     1000023         6   # BR(~t_1 -> ~chi_20 t )
     2.96095288E-01    2     1000024         5   # BR(~t_1 -> ~chi_1+ b )
#
#         PDG            Width
DECAY   2000006     2.99248011E+02   # stop2 decays
#          BR         NDA      ID1       ID2
     8.39935918E-02    2     1000022         6   # BR(~t_2 -> ~chi_10 t )
     8.47028265E-02    2     1000023         6   # BR(~t_2 -> ~chi_20 t )
     4.51725086E-05    2     1000025         6   # BR(~t_2 -> ~chi_30 t )
     1.19628788E-02    2     1000035         6   # BR(~t_2 -> ~chi_40 t )
     1.69189002E-01    2     1000024         5   # BR(~t_2 -> ~chi_1+ b )
     9.16500960E-05    2     1000037         5   # BR(~t_2 -> ~chi_2+ b )
     3.91366734E-01    2     1000021         6   # BR(~t_2 -> ~g      t )
     6.62606935E-02    2     1000006        25   # BR(~t_2 -> ~t_1    h )
     6.54140589E-02    2     1000006        23   # BR(~t_2 -> ~t_1    Z )
     1.26972499E-01    2     1000005        24   # BR(~t_2 -> ~b_1    W+)
     8.92593236E-07    2     2000005        24   # BR(~t_2 -> ~b_2    W+)
#
#         PDG            Width
DECAY   1000005     2.25980269E+01   # sbottom1 decays
#          BR         NDA      ID1       ID2
     1.49501941E-01    2     1000022         5   # BR(~b_1 -> ~chi_10 b )
     1.47628099E-01    2     1000023         5   # BR(~b_1 -> ~chi_20 b )
     7.02869960E-01    2    -1000024         6   # BR(~b_1 -> ~chi_1- t )
#
#         PDG            Width
DECAY   2000005     7.79754064E+01   # sbottom2 decays
#          BR         NDA      ID1       ID2
     9.62922036E-02    2     1000022         5   # BR(~b_2 -> ~chi_10 b )
     9.58225445E-02    2     1000023         5   # BR(~b_2 -> ~chi_20 b )
     2.75424650E-05    2     1000025         5   # BR(~b_2 -> ~chi_30 b )
     2.54307999E-03    2     1000035         5   # BR(~b_2 -> ~chi_40 b )
     1.90766020E-01    2    -1000024         6   # BR(~b_2 -> ~chi_1- t )
     5.43639453E-05    2    -1000037         6   # BR(~b_2 -> ~chi_2- t )
     6.06966783E-01    2     1000021         5   # BR(~b_2 -> ~g      b )
     2.10164340E-03    2     1000005        25   # BR(~b_2 -> ~b_1    h )
     1.84200119E-03    2     1000005        23   # BR(~b_2 -> ~b_1    Z )
     3.58381774E-03    2     1000006       -24   # BR(~b_2 -> ~t_1    W-)
#
#         PDG            Width
DECAY   1000002     7.32167200E+01   # sup_L decays
#          BR         NDA      ID1       ID2
     2.11423488E-04    2     1000022         2   # BR(~u_L -> ~chi_10 u)
     5.36144199E-05    2     1000023         2   # BR(~u_L -> ~chi_20 u)
     4.86822408E-02    2     1000025         2   # BR(~u_L -> ~chi_30 u)
     6.19334488E-04    2     1000035         2   # BR(~u_L -> ~chi_40 u)
     1.13728511E-03    2     1000024         1   # BR(~u_L -> ~chi_1+ d)
     9.69988225E-02    2     1000037         1   # BR(~u_L -> ~chi_2+ d)
     8.52297279E-01    2     1000021         2   # BR(~u_L -> ~g      u)
#
#         PDG            Width
DECAY   2000002     2.18383099E-05   # sup_R decays
#          BR         NDA      ID1       ID2
     7.79191840E-01    2     1000022         2   # BR(~u_R -> ~chi_10 u)
     2.20808160E-01    2     1000023         2   # BR(~u_R -> ~chi_20 u)
#
#         PDG            Width
DECAY   1000001     7.32687718E+01   # sdown_L decays
#          BR         NDA      ID1       ID2
     2.90494267E-04    2     1000022         1   # BR(~d_L -> ~chi_10 d)
     7.63645832E-05    2     1000023         1   # BR(~d_L -> ~chi_20 d)
     4.85442899E-02    2     1000025         1   # BR(~d_L -> ~chi_30 d)
     6.68974568E-04    2     1000035         1   # BR(~d_L -> ~chi_40 d)
     1.21926395E-04    2    -1000024         2   # BR(~d_L -> ~chi_1- u)
     9.73999813E-02    2    -1000037         2   # BR(~d_L -> ~chi_2- u)
     8.52897969E-01    2     1000021         1   # BR(~d_L -> ~g      d)
#
#         PDG            Width
DECAY   2000001     1.00971963E+02   # sdown_R decays
#          BR         NDA      ID1       ID2
     5.26669452E-06    2     1000022         1   # BR(~d_R -> ~chi_10 d)
     1.68615743E-06    2     1000023         1   # BR(~d_R -> ~chi_20 d)
     1.62751243E-07    2     1000025         1   # BR(~d_R -> ~chi_30 d)
     4.34269032E-03    2     1000035         1   # BR(~d_R -> ~chi_40 d)
     9.95650194E-01    2     1000021         1   # BR(~d_R -> ~g      d)
#
#         PDG            Width
DECAY   1000004     5.75917855E+01   # scharm_L decays
#          BR         NDA      ID1       ID2
     2.80364840E-04    2     1000022         4   # BR(~c_L -> ~chi_10 c)
     7.10953795E-05    2     1000023         4   # BR(~c_L -> ~chi_20 c)
     6.37111479E-02    2     1000025         4   # BR(~c_L -> ~chi_30 c)
     7.98130292E-04    2     1000035         4   # BR(~c_L -> ~chi_40 c)
     1.50811704E-03    2     1000024         3   # BR(~c_L -> ~chi_1+ s)
     1.26943497E-01    2     1000037         3   # BR(~c_L -> ~chi_2+ s)
     8.06687648E-01    2     1000021         4   # BR(~c_L -> ~g      c)
#
#         PDG            Width
DECAY   2000004     2.02732433E-05   # scharm_R decays
#          BR         NDA      ID1       ID2
     7.79580664E-01    2     1000022         4   # BR(~c_R -> ~chi_10 c)
     2.20419336E-01    2     1000023         4   # BR(~c_R -> ~chi_20 c)
#
#         PDG            Width
DECAY   1000003     5.76194047E+01   # sstrange_L decays
#          BR         NDA      ID1       ID2
     3.85305440E-04    2     1000022         3   # BR(~s_L -> ~chi_10 s)
     1.01285906E-04    2     1000023         3   # BR(~s_L -> ~chi_20 s)
     6.35459462E-02    2     1000025         3   # BR(~s_L -> ~chi_30 s)
     8.62339100E-04    2     1000035         3   # BR(~s_L -> ~chi_40 s)
     1.61718717E-04    2    -1000024         4   # BR(~s_L -> ~chi_1- c)
     1.27498868E-01    2    -1000037         4   # BR(~s_L -> ~chi_2- c)
     8.07444536E-01    2     1000021         3   # BR(~s_L -> ~g      s)
#
#         PDG            Width
DECAY   2000003     7.52965004E+01   # sstrange_R decays
#          BR         NDA      ID1       ID2
     7.34517338E-06    2     1000022         3   # BR(~s_R -> ~chi_10 s)
     2.35154831E-06    2     1000023         3   # BR(~s_R -> ~chi_20 s)
     2.25131099E-07    2     1000025         3   # BR(~s_R -> ~chi_30 s)
     5.96288581E-03    2     1000035         3   # BR(~s_R -> ~chi_40 s)
     9.94027192E-01    2     1000021         3   # BR(~s_R -> ~g      s)
#
#         PDG            Width
DECAY   1000011     3.86760447E+00   # selectron_L decays
#          BR         NDA      ID1       ID2
     2.29549784E-03    2     1000022        11   # BR(~e_L -> ~chi_10 e-)
     5.52240568E-04    2     1000023        11   # BR(~e_L -> ~chi_20 e-)
     3.32215321E-01    2     1000025        11   # BR(~e_L -> ~chi_30 e-)
     1.24303159E-03    2     1000035        11   # BR(~e_L -> ~chi_40 e-)
     1.93277461E-03    2    -1000024        12   # BR(~e_L -> ~chi_1- nu_e)
     6.61761134E-01    2    -1000037        12   # BR(~e_L -> ~chi_2- nu_e)
#
#         PDG            Width
DECAY   2000011     3.82894465E+00   # selectron_R decays
#          BR         NDA      ID1       ID2
     1.28508524E-03    2     1000022        11   # BR(~e_R -> ~chi_10 e-)
     4.11410464E-04    2     1000023        11   # BR(~e_R -> ~chi_20 e-)
     3.85790311E-05    2     1000025        11   # BR(~e_R -> ~chi_30 e-)
     9.98264925E-01    2     1000035        11   # BR(~e_R -> ~chi_40 e-)
#
#         PDG            Width
DECAY   1000013     3.86760442E+00   # smuon_L decays
#          BR         NDA      ID1       ID2
     2.29549785E-03    2     1000022        13   # BR(~mu_L -> ~chi_10 mu-)
     5.52240572E-04    2     1000023        13   # BR(~mu_L -> ~chi_20 mu-)
     3.32215316E-01    2     1000025        13   # BR(~mu_L -> ~chi_30 mu-)
     1.24302856E-03    2     1000035        13   # BR(~mu_L -> ~chi_40 mu-)
     1.93277464E-03    2    -1000024        14   # BR(~mu_L -> ~chi_1- nu_mu)
     6.61761142E-01    2    -1000037        14   # BR(~mu_L -> ~chi_2- nu_mu)
#
#         PDG            Width
DECAY   2000013     3.82894461E+00   # smuon_R decays
#          BR         NDA      ID1       ID2
     1.28508525E-03    2     1000022        13   # BR(~mu_R -> ~chi_10 mu-)
     4.11410467E-04    2     1000023        13   # BR(~mu_R -> ~chi_20 mu-)
     3.85790312E-05    2     1000025        13   # BR(~mu_R -> ~chi_30 mu-)
     9.98264925E-01    2     1000035        13   # BR(~mu_R -> ~chi_40 mu-)
#
#         PDG            Width
DECAY   1000015     9.34425475E+00   # stau_1 decays
#          BR         NDA      ID1       ID2
     2.51268884E-01    2     1000022        15   # BR(~tau_1 -> ~chi_10  tau-)
     2.48910323E-01    2     1000023        15   # BR(~tau_1 -> ~chi_20  tau-)
     1.94205635E-07    2     1000025        15   # BR(~tau_1 -> ~chi_30  tau-)
     4.99820313E-01    2    -1000024        16   # BR(~tau_1 -> ~chi_1-  nu_tau)
     2.86222834E-07    2    -1000037        16   # BR(~tau_1 -> ~chi_2-  nu_tau)
#
#         PDG            Width
DECAY   2000015     3.96228432E+01   # stau_2 decays
#          BR         NDA      ID1       ID2
     1.32371463E-01    2     1000022        15   # BR(~tau_2 -> ~chi_10  tau-)
     1.31469168E-01    2     1000023        15   # BR(~tau_2 -> ~chi_20  tau-)
     2.26972486E-01    2     1000025        15   # BR(~tau_2 -> ~chi_30  tau-)
     5.06825352E-02    2     1000035        15   # BR(~tau_2 -> ~chi_40  tau-)
     2.58215859E-04    2    -1000024        16   # BR(~tau_2 -> ~chi_1-  nu_tau)
     4.52286974E-01    2    -1000037        16   # BR(~tau_2 -> ~chi_2-  nu_tau)
     3.00167436E-03    2     1000015        25   # BR(~tau_2 -> ~tau_1   h)
     2.95748351E-03    2     1000015        23   # BR(~tau_2 -> ~tau_1   Z)
#
#         PDG            Width
DECAY   1000012     3.90593653E+00   # snu_eL decays
#          BR         NDA      ID1       ID2
     5.99583275E-03    2     1000022        12   # BR(~nu_eL -> ~chi_10 nu_e)
     1.61730848E-03    2     1000023        12   # BR(~nu_eL -> ~chi_20 nu_e)
     3.23861549E-01    2     1000025        12   # BR(~nu_eL -> ~chi_30 nu_e)
     1.18126811E-03    2     1000035        12   # BR(~nu_eL -> ~chi_40 nu_e)
     1.78308140E-02    2     1000024        11   # BR(~nu_eL -> ~chi_1+ e-)
     6.49513227E-01    2     1000037        11   # BR(~nu_eL -> ~chi_2+ e-)
#
#         PDG            Width
DECAY   1000014     3.90593646E+00   # snu_muL decays
#          BR         NDA      ID1       ID2
     5.99583286E-03    2     1000022        14   # BR(~nu_muL -> ~chi_10 nu_mu)
     1.61730851E-03    2     1000023        14   # BR(~nu_muL -> ~chi_20 nu_mu)
     3.23861555E-01    2     1000025        14   # BR(~nu_muL -> ~chi_30 nu_mu)
     1.18126813E-03    2     1000035        14   # BR(~nu_muL -> ~chi_40 nu_mu)
     1.78308143E-02    2     1000024        13   # BR(~nu_muL -> ~chi_1+ mu-)
     6.49513221E-01    2     1000037        13   # BR(~nu_muL -> ~chi_2+ mu-)
#
#         PDG            Width
DECAY   1000016     3.96269713E+01   # snu_tauL decays
#          BR         NDA      ID1       ID2
     1.01972321E-03    2     1000022        16   # BR(~nu_tauL -> ~chi_10 nu_tau)
     2.75357276E-04    2     1000023        16   # BR(~nu_tauL -> ~chi_20 nu_tau)
     2.24414520E-01    2     1000025        16   # BR(~nu_tauL -> ~chi_30 nu_tau)
     5.19015438E-02    2     1000035        16   # BR(~nu_tauL -> ~chi_40 nu_tau)
     2.66279824E-01    2     1000024        15   # BR(~nu_tauL -> ~chi_1+ tau-)
     4.50377357E-01    2     1000037        15   # BR(~nu_tauL -> ~chi_2+ tau-)
     5.73167387E-03    2    -1000015       -24   # BR(~nu_tauL -> ~tau_1+ W-)
#
#         PDG            Width
DECAY   1000024     1.64242681E-11   # chargino1+ decays
#           BR         NDA      ID1       ID2       ID3
     5.99949954E-01    3     1000022         2        -1   # BR(~chi_1+ -> ~chi_10 u    db)
     1.99983678E-01    3     1000022       -11        12   # BR(~chi_1+ -> ~chi_10 e+   nu_e)
     1.99983678E-01    3     1000022       -13        14   # BR(~chi_1+ -> ~chi_10 mu+  nu_mu)
     8.26896224E-05    3     1000022       -15        16   # BR(~chi_1+ -> ~chi_10 tau+ nu_tau)
#
#         PDG            Width
DECAY   1000037     2.03306206E+01   # chargino2+ decays
#          BR         NDA      ID1       ID2
     1.17785135E-01    2     1000006        -5   # BR(~chi_2+ -> ~t_1     bb)
     9.41750541E-02    2    -1000005         6   # BR(~chi_2+ -> ~b_1*    t )
     2.00336848E-01    2     1000024        23   # BR(~chi_2+ -> ~chi_1+  Z )
     1.93814570E-01    2     1000022        24   # BR(~chi_2+ -> ~chi_10  W+)
     1.94999352E-01    2     1000023        24   # BR(~chi_2+ -> ~chi_20  W+)
     1.98889041E-01    2     1000024        25   # BR(~chi_2+ -> ~chi_1+  h )
#
#         PDG            Width
DECAY   1000022     0.00000000E+00   # neutralino1 decays
#
#         PDG            Width
DECAY   1000023     1.14391430E-09   # neutralino2 decays
#          BR         NDA      ID1       ID2
     6.31030530E-02    2     1000022        22   # BR(~chi_20 -> ~chi_10 gam)
#           BR         NDA      ID1       ID2       ID3
     1.19800286E-01    3     1000022        -2         2   # BR(~chi_20 -> ~chi_10 ub      u)
     1.55523385E-01    3     1000022        -1         1   # BR(~chi_20 -> ~chi_10 db      d)
     1.19800286E-01    3     1000022        -4         4   # BR(~chi_20 -> ~chi_10 cb      c)
     1.55523385E-01    3     1000022        -3         3   # BR(~chi_20 -> ~chi_10 sb      s)
     3.57392469E-02    3     1000022       -11        11   # BR(~chi_20 -> ~chi_10 e+      e-)
     3.57392469E-02    3     1000022       -13        13   # BR(~chi_20 -> ~chi_10 mu+     mu-)
     3.11223940E-03    3     1000022       -15        15   # BR(~chi_20 -> ~chi_10 tau+    tau-)
     7.14641283E-02    3     1000022       -12        12   # BR(~chi_20 -> ~chi_10 nu_eb   nu_e)
     7.14641283E-02    3     1000022       -14        14   # BR(~chi_20 -> ~chi_10 nu_mub  nu_mu)
     7.14639947E-02    3     1000022       -16        16   # BR(~chi_20 -> ~chi_10 nu_taub nu_tau)
     1.81989273E-02    3     1000024        -2         1   # BR(~chi_20 -> ~chi_1+ ub      d)
     1.81989273E-02    3    -1000024        -1         2   # BR(~chi_20 -> ~chi_1- db      u)
     1.81989273E-02    3     1000024        -4         3   # BR(~chi_20 -> ~chi_1+ cb      s)
     1.81989273E-02    3    -1000024        -3         4   # BR(~chi_20 -> ~chi_1- sb      c)
     6.06631498E-03    3     1000024       -12        11   # BR(~chi_20 -> ~chi_1+ nu_eb   e-)
     6.06631498E-03    3    -1000024        12       -11   # BR(~chi_20 -> ~chi_1- nu_e    e+)
     6.06631498E-03    3     1000024       -14        13   # BR(~chi_20 -> ~chi_1+ nu_mub  mu-)
     6.06631498E-03    3    -1000024        14       -13   # BR(~chi_20 -> ~chi_1- nu_mu   mu+)
     1.02825518E-04    3     1000024       -16        15   # BR(~chi_20 -> ~chi_1+ nu_taub tau-)
     1.02825518E-04    3    -1000024        16       -15   # BR(~chi_20 -> ~chi_1- nu_tau  tau+)
#
#         PDG            Width
DECAY   1000025     2.03177395E+01   # neutralino3 decays
#          BR         NDA      ID1       ID2
     4.07703079E-02    2     1000022        23   # BR(~chi_30 -> ~chi_10   Z )
     1.58415446E-01    2     1000023        23   # BR(~chi_30 -> ~chi_20   Z )
     1.96286889E-01    2     1000024       -24   # BR(~chi_30 -> ~chi_1+   W-)
     1.96286889E-01    2    -1000024        24   # BR(~chi_30 -> ~chi_1-   W+)
     1.56890766E-01    2     1000022        25   # BR(~chi_30 -> ~chi_10   h )
     3.94964663E-02    2     1000023        25   # BR(~chi_30 -> ~chi_20   h )
     5.31782764E-06    2     2000002        -2   # BR(~chi_30 -> ~u_R      ub)
     5.31782764E-06    2    -2000002         2   # BR(~chi_30 -> ~u_R*     u )
     5.31782660E-06    2     2000004        -4   # BR(~chi_30 -> ~c_R      cb)
     5.31782660E-06    2    -2000004         4   # BR(~chi_30 -> ~c_R*     c )
     4.79561300E-02    2     1000006        -6   # BR(~chi_30 -> ~t_1      tb)
     4.79561300E-02    2    -1000006         6   # BR(~chi_30 -> ~t_1*     t )
     5.79598518E-02    2     1000005        -5   # BR(~chi_30 -> ~b_1      bb)
     5.79598518E-02    2    -1000005         5   # BR(~chi_30 -> ~b_1*     b )
#
#         PDG            Width
DECAY   1000035     3.57919424E+01   # neutralino4 decays
#          BR         NDA      ID1       ID2
     1.02628393E-02    2     1000022        23   # BR(~chi_40 -> ~chi_10   Z )
     3.24255040E-02    2     1000023        23   # BR(~chi_40 -> ~chi_20   Z )
     3.02636005E-06    2     1000025        23   # BR(~chi_40 -> ~chi_30   Z )
     3.99987005E-02    2     1000024       -24   # BR(~chi_40 -> ~chi_1+   W-)
     3.99987005E-02    2    -1000024        24   # BR(~chi_40 -> ~chi_1-   W+)
     2.86876421E-04    2     1000037       -24   # BR(~chi_40 -> ~chi_2+   W-)
     2.86876421E-04    2    -1000037        24   # BR(~chi_40 -> ~chi_2-   W+)
     3.45751298E-02    2     1000022        25   # BR(~chi_40 -> ~chi_10   h )
     1.11379022E-02    2     1000023        25   # BR(~chi_40 -> ~chi_20   h )
     2.92603726E-04    2     1000025        25   # BR(~chi_40 -> ~chi_30   h )
     1.94793544E-01    2     2000002        -2   # BR(~chi_40 -> ~u_R      ub)
     1.94793544E-01    2    -2000002         2   # BR(~chi_40 -> ~u_R*     u )
     1.94793528E-01    2     2000004        -4   # BR(~chi_40 -> ~c_R      cb)
     1.94793528E-01    2    -2000004         4   # BR(~chi_40 -> ~c_R*     c )
     5.40050038E-03    2     1000006        -6   # BR(~chi_40 -> ~t_1      tb)
     5.40050038E-03    2    -1000006         6   # BR(~chi_40 -> ~t_1*     t )
     4.54343451E-03    2     1000005        -5   # BR(~chi_40 -> ~b_1      bb)
     4.54343451E-03    2    -1000005         5   # BR(~chi_40 -> ~b_1*     b )
     1.58349141E-02    2     1000015       -15   # BR(~chi_40 -> ~tau_1-   tau+)
     1.58349141E-02    2    -1000015        15   # BR(~chi_40 -> ~tau_1+   tau-)
#
#         PDG            Width
DECAY        25     4.13011523E-03   # h decays
#          BR         NDA      ID1       ID2
     5.52340877E-01    2           5        -5   # BR(h -> b       bb     )
     6.37812337E-02    2         -15        15   # BR(h -> tau+    tau-   )
     2.25747717E-04    2         -13        13   # BR(h -> mu+     mu-    )
     2.45815606E-04    2           3        -3   # BR(h -> s       sb     )
     2.12358635E-02    2           4        -4   # BR(h -> c       cb     )
     8.03857877E-02    2          21        21   # BR(h -> g       g      )
     2.42101767E-03    2          22        22   # BR(h -> gam     gam    )
     1.76359034E-03    2          22        23   # BR(h -> Z       gam    )
     2.46080680E-01    2          24       -24   # BR(h -> W+      W-     )
     3.15193866E-02    2          23        23   # BR(h -> Z       Z      )
#
#         PDG            Width
DECAY        35     8.97651350E+01   # H decays
#          BR         NDA      ID1       ID2
     6.12968645E-01    2           5        -5   # BR(H -> b       bb     )
     1.08972879E-01    2         -15        15   # BR(H -> tau+    tau-   )
     3.79335781E-04    2         -13        13   # BR(H -> mu+     mu-    )
     2.64313243E-04    2           3        -3   # BR(H -> s       sb     )
     1.32279783E-08    2           4        -4   # BR(H -> c       cb     )
     1.30525676E-03    2           6        -6   # BR(H -> t       tb     )
     6.04366395E-06    2          21        21   # BR(H -> g       g      )
     8.13345501E-09    2          22        22   # BR(H -> gam     gam    )
     3.56749934E-09    2          23        22   # BR(H -> Z       gam    )
     6.11920143E-07    2          24       -24   # BR(H -> W+      W-     )
     3.05431460E-07    2          23        23   # BR(H -> Z       Z      )
     1.68830625E-06    2          25        25   # BR(H -> h       h      )
     1.17742091E-03    2     1000024  -1000024   # BR(H -> ~chi_1+ ~chi_1-)
     8.62606942E-02    2     1000024  -1000037   # BR(H -> ~chi_1+ ~chi_2-)
     8.62606942E-02    2     1000037  -1000024   # BR(H -> ~chi_2+ ~chi_1-)
     3.72945104E-04    2     1000022   1000022   # BR(H -> ~chi_10 ~chi_10)
     1.11653182E-04    2     1000023   1000023   # BR(H -> ~chi_20 ~chi_20)
     5.96095379E-05    2     1000022   1000023   # BR(H -> ~chi_10 ~chi_20)
     3.05076155E-02    2     1000022   1000025   # BR(H -> ~chi_10 ~chi_30)
     4.66322214E-03    2     1000022   1000035   # BR(H -> ~chi_10 ~chi_40)
     5.54477184E-02    2     1000023   1000025   # BR(H -> ~chi_20 ~chi_30)
     1.11186295E-02    2     1000023   1000035   # BR(H -> ~chi_20 ~chi_40)
     5.17078540E-08    2     2000002  -2000002   # BR(H -> ~u_R    ~u_R*  )
     5.17078540E-08    2     2000004  -2000004   # BR(H -> ~c_R    ~c_R*  )
     9.12384663E-05    2     1000006  -1000006   # BR(H -> ~t_1    ~t_1*  )
     2.93510526E-05    2     1000005  -1000005   # BR(H -> ~b_1    ~b_1*  )
#
#         PDG            Width
DECAY        36     8.97451091E+01   # A decays
#          BR         NDA      ID1       ID2
     6.13118945E-01    2           5        -5   # BR(A -> b       bb     )
     1.08997483E-01    2         -15        15   # BR(A -> tau+    tau-   )
     3.79421106E-04    2         -13        13   # BR(A -> mu+     mu-    )
     2.64387199E-04    2           3        -3   # BR(A -> s       sb     )
     1.33007370E-08    2           4        -4   # BR(A -> c       cb     )
     1.30721270E-03    2           6        -6   # BR(A -> t       tb     )
     1.52598629E-05    2          21        21   # BR(A -> g       g      )
     4.48406765E-08    2          22        22   # BR(A -> gam     gam    )
     1.23075693E-08    2          23        22   # BR(A -> Z       gam    )
     6.20869934E-07    2          23        25   # BR(A -> Z       h      )
     1.36210391E-03    2     1000024  -1000024   # BR(A -> ~chi_1+ ~chi_1-)
     8.61470889E-02    2     1000024  -1000037   # BR(A -> ~chi_1+ ~chi_2-)
     8.61470889E-02    2     1000037  -1000024   # BR(A -> ~chi_2+ ~chi_1-)
     4.64696328E-04    2     1000022   1000022   # BR(A -> ~chi_10 ~chi_10)
     1.11385257E-04    2     1000023   1000023   # BR(A -> ~chi_20 ~chi_20)
     3.74461857E-05    2     1000022   1000023   # BR(A -> ~chi_10 ~chi_20)
     5.55379233E-02    2     1000022   1000025   # BR(A -> ~chi_10 ~chi_30)
     1.11515810E-02    2     1000022   1000035   # BR(A -> ~chi_10 ~chi_40)
     3.03378485E-02    2     1000023   1000025   # BR(A -> ~chi_20 ~chi_30)
     4.61943746E-03    2     1000023   1000035   # BR(A -> ~chi_20 ~chi_40)
#
#         PDG            Width
DECAY        37     9.18949661E+01   # H+ decays
#          BR         NDA      ID1       ID2
     1.04509676E-03    2           4        -5   # BR(H+ -> c       bb     )
     1.06477817E-01    2         -15        16   # BR(H+ -> tau+    nu_tau )
     3.70650129E-04    2         -13        14   # BR(H+ -> mu+     nu_mu  )
     1.04509596E-05    2           2        -5   # BR(H+ -> u       bb     )
     1.29238716E-05    2           2        -3   # BR(H+ -> u       sb     )
     2.54393508E-04    2           4        -3   # BR(H+ -> c       sb     )
     6.22475750E-01    2           6        -5   # BR(H+ -> t       bb     )
     6.07099536E-07    2          24        25   # BR(H+ -> W+      h      )
     2.10904250E-14    2          24        36   # BR(H+ -> W+      A      )
     2.15244283E-05    2     1000024   1000022   # BR(H+ -> ~chi_1+ ~chi_10)
     2.09768330E-04    2     1000024   1000023   # BR(H+ -> ~chi_1+ ~chi_20)
     8.49060110E-02    2     1000024   1000025   # BR(H+ -> ~chi_1+ ~chi_30)
     1.50164957E-02    2     1000024   1000035   # BR(H+ -> ~chi_1+ ~chi_40)
     8.49472580E-02    2     1000037   1000022   # BR(H+ -> ~chi_2+ ~chi_10)
     8.42512490E-02    2     1000037   1000023   # BR(H+ -> ~chi_2+ ~chi_20)
     4.00338589E-09    2     1000006  -1000005   # BR(H+ -> ~t_1    ~b_1*  )
