#
#                              ======================
#                              | THE SUSYHIT OUTPUT |
#                              ======================
#
#
#              ------------------------------------------------------
#              |     This is the output of the SUSY-HIT package     |
#              |  created by A.Djouadi, M.Muehlleitner and M.Spira. |
#              |  In case of problems with SUSY-HIT email to        |
#              |           margarete.muehlleitner@cern.ch           |
#              |           michael.spira@psi.ch                     |
#              |           abdelhak.djouadi@cern.ch                 |
#              ------------------------------------------------------
#
#              ------------------------------------------------------
#              |  SUSY Les Houches Accord - MSSM Spectrum + Decays  |
#              |              based on the decay programs           |
#              |                                                    |
#              |                     SDECAY 1.3b                    |
#              |                                                    |
#              |  Authors: M.Muhlleitner, A.Djouadi and Y.Mambrini  |
#              |  Ref.:    Comput.Phys.Commun.168(2005)46           |
#              |           [hep-ph/0311167]                         |
#              |                                                    |
#              |                     HDECAY 3.4                     |
#              |                                                    |
#              |  By: A.Djouadi,J.Kalinowski,M.Muhlleitner,M.Spira  |
#              |  Ref.:    Comput.Phys.Commun.108(1998)56           |
#              |           [hep-ph/9704448]                         |
#              |                                                    |
#              |                                                    |
#              |  If not stated otherwise all DRbar couplings and   |
#              |  soft SUSY breaking masses are given at the scale  |
#              |  Q=  0.19593440E+04
#              |                                                    |
#              ------------------------------------------------------
#
#
BLOCK DCINFO  # Decay Program information
     1   SDECAY/HDECAY # decay calculator
     2   1.3b  /3.4    # version number
#
BLOCK SPINFO  # Spectrum calculator information
     1     SOFTSUSY    # spectrum calculator               
     2     3.4.0       # version number                    
#
BLOCK MODSEL  # Model selection
     1     0   #  nonUniversal                                     
#
BLOCK SMINPUTS  # Standard Model inputs
         1     1.27908970E+02   # alpha_em^-1(M_Z)^MSbar
         2     1.16637870E-05   # G_F [GeV^-2]
         3     1.18400000E-01   # alpha_S(M_Z)^MSbar
         4     9.11876000E+01   # M_Z pole mass
         5     4.18000000E+00   # mb(mb)^MSbar
         6     1.73200000E+02   # mt pole mass
         7     1.77700000E+00   # mtau pole mass
#
BLOCK MINPAR  # Input parameters - minimal models
         3     2.99300000E+01   # tanb                
#
BLOCK EXTPAR  # Input parameters - non-minimal models
         0    -1.00000000E+00   # Set                 
         1     4.91000000E+01   # M_1(MX)             
         2     3.05326000E+03   # M_2(MX)             
         3     2.15844000E+03   # M_3(MX)             
        11     3.13783000E+03   # At(MX)              
        12     5.29470000E+02   # Ab(MX)              
        13    -1.14181000E+03   # Atau(MX)            
        23     1.77330000E+02   # mu(MX)              
        26     1.52198000E+03   # mA(pole)            
        31     1.05762000E+03   # meL(MX)             
        32     1.05762000E+03   # mmuL(MX)            
        33     7.31400000E+02   # mtauL(MX)           
        34     1.98620000E+02   # meR(MX)             
        35     1.98620000E+02   # mmuR(MX)            
        36     1.18290000E+03   # mtauR(MX)           
        41     2.90659000E+03   # mqL1(MX)            
        42     2.90659000E+03   # mqL2(MX)            
        43     2.96538000E+03   # mqL3(MX)            
        44     2.88667000E+03   # muR(MX)             
        45     2.88667000E+03   # mcR(MX)             
        46     1.29468000E+03   # mtR(MX)             
        47     4.91880000E+02   # mdR(MX)             
        48     4.91880000E+02   # msR(MX)             
        49     2.36838000E+03   # mbR(MX)             
#
BLOCK MASS  # Mass Spectrum
# PDG code           mass       particle
        24     8.04110682E+01   # W+
        25     1.25545496E+02   # h
        35     1.52199713E+03   # H
        36     1.52197990E+03   # A
        37     1.52452898E+03   # H+
         5     4.81876030E+00   # b-quark pole mass calculated from mb(mb)_Msbar
   1000001     2.96614858E+03   # ~d_L
   2000001     6.34433216E+02   # ~d_R
   1000002     2.96524252E+03   # ~u_L
   2000002     2.93318477E+03   # ~u_R
   1000003     2.96614858E+03   # ~s_L
   2000003     6.34433216E+02   # ~s_R
   1000004     2.96524252E+03   # ~c_L
   2000004     2.93318477E+03   # ~c_R
   1000005     2.42480273E+03   # ~b_1
   2000005     2.99799269E+03   # ~b_2
   1000006     1.34913290E+03   # ~t_1
   2000006     3.00514685E+03   # ~t_2
   1000011     1.06915291E+03   # ~e_L
   2000011     2.23290129E+02   # ~e_R
   1000012     1.06593923E+03   # ~nu_eL
   1000013     1.06915291E+03   # ~mu_L
   2000013     2.23290129E+02   # ~mu_R
   1000014     1.06593923E+03   # ~nu_muL
   1000015     7.38531898E+02   # ~tau_1
   2000015     1.18290561E+03   # ~tau_2
   1000016     7.34136307E+02   # ~nu_tauL
   1000021     2.30373771E+03   # ~g
   1000022     4.46138713E+01   # ~chi_10
   1000023    -1.90463488E+02   # ~chi_20
   1000025     1.92513565E+02   # ~chi_30
   1000035     3.05027876E+03   # ~chi_40
   1000024     1.85830146E+02   # ~chi_1+
   1000037     3.05044852E+03   # ~chi_2+
#
BLOCK NMIX  # Neutralino Mixing Matrix
  1  1     9.65646123E-01   # N_11
  1  2    -1.92213696E-03   # N_12
  1  3     2.50749201E-01   # N_13
  1  4    -6.81814389E-02   # N_14
  2  1    -1.29436602E-01   # N_21
  2  2     1.63692968E-02   # N_22
  2  3     6.91724046E-01   # N_23
  2  4     7.10278858E-01   # N_24
  3  1    -2.25329874E-01   # N_31
  3  2    -1.95157686E-02   # N_32
  3  3     6.77227462E-01   # N_33
  3  4    -7.00148946E-01   # N_34
  4  1    -4.22733372E-04   # N_41
  4  2     9.99673690E-01   # N_42
  4  3     2.37632796E-03   # N_43
  4  4    -2.54300625E-02   # N_44
#
BLOCK UMIX  # Chargino Mixing Matrix U
  1  1    -3.36155815E-03   # U_11
  1  2     9.99994350E-01   # U_12
  2  1    -9.99994350E-01   # U_21
  2  2    -3.36155815E-03   # U_22
#
BLOCK VMIX  # Chargino Mixing Matrix V
  1  1    -3.59698749E-02   # V_11
  1  2     9.99352875E-01   # V_12
  2  1    -9.99352875E-01   # V_21
  2  2    -3.59698749E-02   # V_22
#
BLOCK STOPMIX  # Stop Mixing Matrix
  1  1    -6.18833362E-02   # cos(theta_t)
  1  2     9.98083390E-01   # sin(theta_t)
  2  1    -9.98083390E-01   # -sin(theta_t)
  2  2    -6.18833362E-02   # cos(theta_t)
#
BLOCK SBOTMIX  # Sbottom Mixing Matrix
  1  1     3.60971152E-03   # cos(theta_b)
  1  2     9.99993485E-01   # sin(theta_b)
  2  1    -9.99993485E-01   # -sin(theta_b)
  2  2     3.60971152E-03   # cos(theta_b)
#
BLOCK STAUMIX  # Stau Mixing Matrix
  1  1     9.99911384E-01   # cos(theta_tau)
  1  2     1.33125560E-02   # sin(theta_tau)
  2  1    -1.33125560E-02   # -sin(theta_tau)
  2  2     9.99911384E-01   # cos(theta_tau)
#
BLOCK ALPHA  # Higgs mixing
          -3.49163376E-02   # Mixing angle in the neutral Higgs boson sector
#
BLOCK HMIX Q=  1.95934400E+03  # DRbar Higgs Parameters
         1     1.80428311E+02   # mu(Q)MSSM           
         2     2.89444070E+01   # tan                 
         3     2.43312610E+02   # higgs               
         4     2.22590514E+06   # mA^2(Q)MSSM         
#
BLOCK GAUGE Q=  1.95934400E+03  # The gauge couplings
     1     3.64663091E-01   # gprime(Q) DRbar
     2     6.37942773E-01   # g(Q) DRbar
     3     1.02617557E+00   # g3(Q) DRbar
#
BLOCK AU Q=  1.95934400E+03  # The trilinear couplings
  1  1     0.00000000E+00   # A_u(Q) DRbar
  2  2     0.00000000E+00   # A_c(Q) DRbar
  3  3     3.13783001E+03   # A_t(Q) DRbar
#
BLOCK AD Q=  1.95934400E+03  # The trilinear couplings
  1  1     0.00000000E+00   # A_d(Q) DRbar
  2  2     0.00000000E+00   # A_s(Q) DRbar
  3  3     5.29470003E+02   # A_b(Q) DRbar
#
BLOCK AE Q=  1.95934400E+03  # The trilinear couplings
  1  1     0.00000000E+00   # A_e(Q) DRbar
  2  2     0.00000000E+00   # A_mu(Q) DRbar
  3  3    -1.14181000E+03   # A_tau(Q) DRbar
#
BLOCK Yu Q=  1.95934400E+03  # The Yukawa couplings
  1  1     0.00000000E+00   # y_u(Q) DRbar
  2  2     0.00000000E+00   # y_c(Q) DRbar
  3  3     8.50640931E-01   # y_t(Q) DRbar
#
BLOCK Yd Q=  1.95934400E+03  # The Yukawa couplings
  1  1     0.00000000E+00   # y_d(Q) DRbar
  2  2     0.00000000E+00   # y_s(Q) DRbar
  3  3     3.91464882E-01   # y_b(Q) DRbar
#
BLOCK Ye Q=  1.95934400E+03  # The Yukawa couplings
  1  1     0.00000000E+00   # y_e(Q) DRbar
  2  2     0.00000000E+00   # y_mu(Q) DRbar
  3  3     3.00989839E-01   # y_tau(Q) DRbar
#
BLOCK MSOFT Q=  1.95934400E+03  # The soft SUSY breaking masses at the scale Q
         1     4.91000000E+01   # M_1(Q)              
         2     3.05326000E+03   # M_2(Q)              
         3     2.15844000E+03   # M_3(Q)              
        21     2.28777647E+06   # mH1^2(Q)            
        22    -1.88233398E+04   # mH2^2(Q)            
        31     1.05762000E+03   # meL(Q)              
        32     1.05762000E+03   # mmuL(Q)             
        33     7.31400000E+02   # mtauL(Q)            
        34     1.98620000E+02   # meR(Q)              
        35     1.98620000E+02   # mmuR(Q)             
        36     1.18290000E+03   # mtauR(Q)            
        41     2.90659000E+03   # mqL1(Q)             
        42     2.90659000E+03   # mqL2(Q)             
        43     2.96538000E+03   # mqL3(Q)             
        44     2.88667000E+03   # muR(Q)              
        45     2.88667000E+03   # mcR(Q)              
        46     1.29467999E+03   # mtR(Q)              
        47     4.91879986E+02   # mdR(Q)              
        48     4.91879986E+02   # msR(Q)              
        49     2.36838000E+03   # mbR(Q)              
#
Block HiggsBoundsInputHiggsCouplingsFermions
# ScalarNormEffCoupSq PseudoSNormEffCoupSq NP   IP1 IP2 IP2
    1.02218208E+00    0.00000000E+00        3  25   5   5  # h0-b-b eff. coupling^2, normalised to SM
    8.37756515E+02    0.00000000E+00        3  35   5   5  # H0-b-b eff. coupling^2, normalised to SM
    0.00000000E+00    8.37778697E+02        3  36   5   5  # A0-b-b eff. coupling^2, normalised to SM
#
    9.99973523E-01    0.00000000E+00        3  25   6   6  # h0-t-t eff. coupling^2, normalised to SM
    1.22010990E-03    0.00000000E+00        3  35   6   6  # H0-t-t eff. coupling^2, normalised to SM
    0.00000000E+00    1.19363264E-03        3  36   6   6  # A0-t-t eff. coupling^2, normalised to SM
#
    1.02218208E+00    0.00000000E+00        3  25  15  15  # h0-tau-tau eff. coupling^2, normalised to SM
    8.37756515E+02    0.00000000E+00        3  35  15  15  # H0-tau-tau eff. coupling^2, normalised to SM
    0.00000000E+00    8.37778697E+02        3  36  15  15  # A0-tau-tau eff. coupling^2, normalised to SM
#
Block HiggsBoundsInputHiggsCouplingsBosons
    9.99999855E-01        3  25  24  24  # h0-W-W eff. coupling^2, normalised to SM
    1.45225769E-07        3  35  24  24  # H0-W-W eff. coupling^2, normalised to SM
    0.00000000E+00        3  36  24  24  # A0-W-W eff. coupling^2, normalised to SM
#
    9.99999855E-01        3  25  23  23  # h0-Z-Z eff. coupling^2, normalised to SM
    1.45225769E-07        3  35  23  23  # H0-Z-Z eff. coupling^2, normalised to SM
    0.00000000E+00        3  36  23  23  # A0-Z-Z eff. coupling^2, normalised to SM
#
    8.91553575E-01        3  25  21  21  # h0-g-g eff. coupling^2, normalised to SM
    1.72099712E-09        3  35  21  21  # H0-g-g eff. coupling^2, normalised to SM
    1.00701055E-08        3  36  21  21  # A0-g-g eff. coupling^2, normalised to SM
#
    0.00000000E+00        3  25  25  23  # h0-h0-Z eff. coupling^2, normalised to SM
    0.00000000E+00        3  35  25  23  # H0-h0-Z eff. coupling^2, normalised to SM
    1.45225769E-07        3  36  25  23  # A0-h0-Z eff. coupling^2, normalised to SM
    0.00000000E+00        3  35  35  23  # H0-H0-Z eff. coupling^2, normalised to SM
    9.99999855E-01        3  36  35  23  # A0-H0-Z eff. coupling^2, normalised to SM
    0.00000000E+00        3  36  36  23  # A0-A0-Z eff. coupling^2, normalised to SM
#
    0.00000000E+00        4  25  21  21  23  # h0-g-g-Z eff. coupling^2, normalised to SM
    0.00000000E+00        4  35  21  21  23  # H0-g-g-Z eff. coupling^2, normalised to SM
    0.00000000E+00        4  36  21  21  23  # A0-g-g-Z eff. coupling^2, normalised to SM
#
#
#
#                             =================
#                             |The decay table|
#                             =================
#
# - The QCD corrections to the decays gluino -> squark  + quark
#                                     squark -> gaugino + quark_prime
#                                     squark -> squark_prime + Higgs
#                                     squark -> gluino  + quark
#   are included.
#
# - The multi-body decays for the inos, stops and sbottoms are included.
#
# - The loop induced decays for the gluino, neutralinos and stops
#   are included.
#
# - The SUSY decays of the top quark are included.
#
#
#         PDG            Width
DECAY         6     1.43234992E+00   # top decays
#          BR         NDA      ID1       ID2
     1.00000000E+00    2           5        24   # BR(t ->  b    W+)
#
#         PDG            Width
DECAY   1000021     1.01313788E+02   # gluino decays
#          BR         NDA      ID1       ID2
     2.00892779E-01    2     2000001        -1   # BR(~g -> ~d_R  db)
     2.00892779E-01    2    -2000001         1   # BR(~g -> ~d_R* d )
     2.00892779E-01    2     2000003        -3   # BR(~g -> ~s_R  sb)
     2.00892779E-01    2    -2000003         3   # BR(~g -> ~s_R* s )
     9.82144426E-02    2     1000006        -6   # BR(~g -> ~t_1  tb)
     9.82144426E-02    2    -1000006         6   # BR(~g -> ~t_1* t )
#
#         PDG            Width
DECAY   1000006     3.96905741E+01   # stop1 decays
#          BR         NDA      ID1       ID2
     7.24717654E-02    2     1000022         6   # BR(~t_1 -> ~chi_10 t )
     2.28575648E-01    2     1000023         6   # BR(~t_1 -> ~chi_20 t )
     2.31607800E-01    2     1000025         6   # BR(~t_1 -> ~chi_30 t )
     4.67344787E-01    2     1000024         5   # BR(~t_1 -> ~chi_1+ b )
#
#         PDG            Width
DECAY   2000006     1.16131356E+02   # stop2 decays
#          BR         NDA      ID1       ID2
     6.29603502E-03    2     1000022         6   # BR(~t_2 -> ~chi_10 t )
     1.86883376E-01    2     1000023         6   # BR(~t_2 -> ~chi_20 t )
     1.78185118E-01    2     1000025         6   # BR(~t_2 -> ~chi_30 t )
     8.08953647E-02    2     1000024         5   # BR(~t_2 -> ~chi_1+ b )
     2.42425358E-01    2     1000021         6   # BR(~t_2 -> ~g      t )
     1.58424304E-01    2     1000006        25   # BR(~t_2 -> ~t_1    h )
     5.03334436E-04    2     1000006        35   # BR(~t_2 -> ~t_1    H )
     5.06685385E-04    2     1000006        36   # BR(~t_2 -> ~t_1    A )
     1.45802074E-01    2     1000006        23   # BR(~t_2 -> ~t_1    Z )
     7.83496650E-05    2     1000005        24   # BR(~t_2 -> ~b_1    W+)
#
#         PDG            Width
DECAY   1000005     1.72431867E+01   # sbottom1 decays
#          BR         NDA      ID1       ID2
     1.04461881E-01    2     1000022         5   # BR(~b_1 -> ~chi_10 b )
     2.03748048E-01    2     1000023         5   # BR(~b_1 -> ~chi_20 b )
     1.98056376E-01    2     1000025         5   # BR(~b_1 -> ~chi_30 b )
     4.19295535E-01    2    -1000024         6   # BR(~b_1 -> ~chi_1- t )
     7.44297354E-02    2     1000021         5   # BR(~b_1 -> ~g      b )
     8.42464476E-06    2     1000006       -24   # BR(~b_1 -> ~t_1    W-)
#
#         PDG            Width
DECAY   2000005     1.12840110E+02   # sbottom2 decays
#          BR         NDA      ID1       ID2
     8.71276788E-03    2     1000022         5   # BR(~b_2 -> ~chi_10 b )
     3.86647058E-02    2     1000023         5   # BR(~b_2 -> ~chi_20 b )
     3.69521220E-02    2     1000025         5   # BR(~b_2 -> ~chi_30 b )
     3.76484192E-01    2    -1000024         6   # BR(~b_2 -> ~chi_1- t )
     2.48901781E-01    2     1000021         5   # BR(~b_2 -> ~g      b )
     3.96680378E-05    2     1000005        25   # BR(~b_2 -> ~b_1    h )
     1.00221525E-03    2     1000006       -37   # BR(~b_2 -> ~t_1    H-)
     3.99777165E-05    2     1000005        23   # BR(~b_2 -> ~b_1    Z )
     2.89202571E-01    2     1000006       -24   # BR(~b_2 -> ~t_1    W-)
#
#         PDG            Width
DECAY   1000002     3.75803642E+01   # sup_L decays
#          BR         NDA      ID1       ID2
     1.00651720E-02    2     1000022         2   # BR(~u_L -> ~chi_10 u)
     2.07477486E-05    2     1000023         2   # BR(~u_L -> ~chi_20 u)
     1.17617889E-03    2     1000025         2   # BR(~u_L -> ~chi_30 u)
     7.80797266E-04    2     1000024         1   # BR(~u_L -> ~chi_1+ d)
     9.87957104E-01    2     1000021         2   # BR(~u_L -> ~g      u)
#
#         PDG            Width
DECAY   2000002     4.08607372E+01   # sup_R decays
#          BR         NDA      ID1       ID2
     1.49575608E-01    2     1000022         2   # BR(~u_R -> ~chi_10 u)
     2.66941339E-03    2     1000023         2   # BR(~u_R -> ~chi_20 u)
     8.08847891E-03    2     1000025         2   # BR(~u_R -> ~chi_30 u)
     8.39666499E-01    2     1000021         2   # BR(~u_R -> ~g      u)
#
#         PDG            Width
DECAY   1000001     3.76283348E+01   # sdown_L decays
#          BR         NDA      ID1       ID2
     1.04846064E-02    2     1000022         1   # BR(~d_L -> ~chi_10 d)
     5.07352660E-04    2     1000023         1   # BR(~d_L -> ~chi_20 d)
     1.65241345E-04    2     1000025         1   # BR(~d_L -> ~chi_30 d)
     6.81280610E-06    2    -1000024         2   # BR(~d_L -> ~chi_1- u)
     9.88835987E-01    2     1000021         1   # BR(~d_L -> ~g      d)
#
#         PDG            Width
DECAY   2000001     3.81179869E-01   # sdown_R decays
#          BR         NDA      ID1       ID2
     9.42999382E-01    2     1000022         1   # BR(~d_R -> ~chi_10 d)
     1.41876126E-02    2     1000023         1   # BR(~d_R -> ~chi_20 d)
     4.28130050E-02    2     1000025         1   # BR(~d_R -> ~chi_30 d)
#
#         PDG            Width
DECAY   1000004     2.65061136E+01   # scharm_L decays
#          BR         NDA      ID1       ID2
     1.50062765E-02    2     1000022         4   # BR(~c_L -> ~chi_10 c)
     3.08946785E-05    2     1000023         4   # BR(~c_L -> ~chi_20 c)
     1.75137396E-03    2     1000025         4   # BR(~c_L -> ~chi_30 c)
     1.16269961E-03    2     1000024         3   # BR(~c_L -> ~chi_1+ s)
     9.82048755E-01    2     1000021         4   # BR(~c_L -> ~g      c)
#
#         PDG            Width
DECAY   2000004     3.09450088E+01   # scharm_R decays
#          BR         NDA      ID1       ID2
     2.07751877E-01    2     1000022         4   # BR(~c_R -> ~chi_10 c)
     3.70300281E-03    2     1000023         4   # BR(~c_R -> ~chi_20 c)
     1.12201272E-02    2     1000025         4   # BR(~c_R -> ~chi_30 c)
     7.77324993E-01    2     1000021         4   # BR(~c_R -> ~g      c)
#
#         PDG            Width
DECAY   1000003     2.65285142E+01   # sstrange_L decays
#          BR         NDA      ID1       ID2
     1.56382264E-02    2     1000022         3   # BR(~s_L -> ~chi_10 s)
     7.55799264E-04    2     1000023         3   # BR(~s_L -> ~chi_20 s)
     2.46154654E-04    2     1000025         3   # BR(~s_L -> ~chi_30 s)
     1.01493614E-05    2    -1000024         4   # BR(~s_L -> ~chi_1- c)
     9.83349670E-01    2     1000021         3   # BR(~s_L -> ~g      s)
#
#         PDG            Width
DECAY   2000003     3.65147630E-01   # sstrange_R decays
#          BR         NDA      ID1       ID2
     9.43080647E-01    2     1000022         3   # BR(~s_R -> ~chi_10 s)
     1.41675608E-02    2     1000023         3   # BR(~s_R -> ~chi_20 s)
     4.27517919E-02    2     1000025         3   # BR(~s_R -> ~chi_30 s)
#
#         PDG            Width
DECAY   1000011     1.40772034E+00   # selectron_L decays
#          BR         NDA      ID1       ID2
     9.27042329E-01    2     1000022        11   # BR(~e_L -> ~chi_10 e-)
     9.57011742E-03    2     1000023        11   # BR(~e_L -> ~chi_20 e-)
     6.33222026E-02    2     1000025        11   # BR(~e_L -> ~chi_30 e-)
     6.53511995E-05    2    -1000024        12   # BR(~e_L -> ~chi_1- nu_e)
#
#         PDG            Width
DECAY   2000011     1.02088170E+00   # selectron_R decays
#          BR         NDA      ID1       ID2
     9.94690246E-01    2     1000022        11   # BR(~e_R -> ~chi_10 e-)
     1.43883326E-03    2     1000023        11   # BR(~e_R -> ~chi_20 e-)
     3.87092060E-03    2     1000025        11   # BR(~e_R -> ~chi_30 e-)
#
#         PDG            Width
DECAY   1000013     1.40772031E+00   # smuon_L decays
#          BR         NDA      ID1       ID2
     9.27042329E-01    2     1000022        13   # BR(~mu_L -> ~chi_10 mu-)
     9.57011741E-03    2     1000023        13   # BR(~mu_L -> ~chi_20 mu-)
     6.33222025E-02    2     1000025        13   # BR(~mu_L -> ~chi_30 mu-)
     6.53512008E-05    2    -1000024        14   # BR(~mu_L -> ~chi_1- nu_mu)
#
#         PDG            Width
DECAY   2000013     1.02088117E+00   # smuon_R decays
#          BR         NDA      ID1       ID2
     9.94690278E-01    2     1000022        13   # BR(~mu_R -> ~chi_10 mu-)
     1.43882532E-03    2     1000023        13   # BR(~mu_R -> ~chi_20 mu-)
     3.87089629E-03    2     1000025        13   # BR(~mu_R -> ~chi_30 mu-)
#
#         PDG            Width
DECAY   1000015     2.13409223E+00   # stau_1 decays
#          BR         NDA      ID1       ID2
     4.63458337E-01    2     1000022        15   # BR(~tau_1 -> ~chi_10  tau-)
     2.62854263E-01    2     1000023        15   # BR(~tau_1 -> ~chi_20  tau-)
     2.73458843E-01    2     1000025        15   # BR(~tau_1 -> ~chi_30  tau-)
     2.28558106E-04    2    -1000024        16   # BR(~tau_1 -> ~chi_1-  nu_tau)
#
#         PDG            Width
DECAY   2000015     1.03564121E+01   # stau_2 decays
#          BR         NDA      ID1       ID2
     5.73604045E-01    2     1000022        15   # BR(~tau_2 -> ~chi_10  tau-)
     1.03520941E-01    2     1000023        15   # BR(~tau_2 -> ~chi_20  tau-)
     1.19185493E-01    2     1000025        15   # BR(~tau_2 -> ~chi_30  tau-)
     1.95751556E-01    2    -1000024        16   # BR(~tau_2 -> ~chi_1-  nu_tau)
     3.91429951E-03    2     1000016       -24   # BR(~tau_2 -> ~nu_tauL W-)
     2.08202981E-03    2     1000015        25   # BR(~tau_2 -> ~tau_1   h)
     1.94163555E-03    2     1000015        23   # BR(~tau_2 -> ~tau_1   Z)
#
#         PDG            Width
DECAY   1000012     1.41106338E+00   # snu_eL decays
#          BR         NDA      ID1       ID2
     9.34979661E-01    2     1000022        12   # BR(~nu_eL -> ~chi_10 nu_e)
     2.33992441E-02    2     1000023        12   # BR(~nu_eL -> ~chi_20 nu_e)
     3.41815013E-02    2     1000025        12   # BR(~nu_eL -> ~chi_30 nu_e)
     7.43959402E-03    2     1000024        11   # BR(~nu_eL -> ~chi_1+ e-)
#
#         PDG            Width
DECAY   1000014     1.41106338E+00   # snu_muL decays
#          BR         NDA      ID1       ID2
     9.34979661E-01    2     1000022        14   # BR(~nu_muL -> ~chi_10 nu_mu)
     2.33992441E-02    2     1000023        14   # BR(~nu_muL -> ~chi_20 nu_mu)
     3.41815013E-02    2     1000025        14   # BR(~nu_muL -> ~chi_30 nu_mu)
     7.43959386E-03    2     1000024        13   # BR(~nu_muL -> ~chi_1+ mu-)
#
#         PDG            Width
DECAY   1000016     2.12250683E+00   # snu_tauL decays
#          BR         NDA      ID1       ID2
     4.26435203E-01    2     1000022        16   # BR(~nu_tauL -> ~chi_10 nu_tau)
     9.94496686E-03    2     1000023        16   # BR(~nu_tauL -> ~chi_20 nu_tau)
     1.45029100E-02    2     1000025        16   # BR(~nu_tauL -> ~chi_30 nu_tau)
     5.49116920E-01    2     1000024        15   # BR(~nu_tauL -> ~chi_1+ tau-)
#
#         PDG            Width
DECAY   1000024     8.66035280E-02   # chargino1+ decays
#          BR         NDA      ID1       ID2
     1.00000000E+00    2     1000022        24   # BR(~chi_1+ -> ~chi_10  W+)
#
#         PDG            Width
DECAY   1000037     9.79662157E+01   # chargino2+ decays
#          BR         NDA      ID1       ID2
     1.21559335E-03    2     1000002        -1   # BR(~chi_2+ -> ~u_L     db)
     1.19232546E-03    2    -1000001         2   # BR(~chi_2+ -> ~d_L*    u )
     1.21558108E-03    2     1000004        -3   # BR(~chi_2+ -> ~c_L     sb)
     1.19212871E-03    2    -1000003         4   # BR(~chi_2+ -> ~s_L*     c )
     2.94530556E-03    2     1000006        -5   # BR(~chi_2+ -> ~t_1     bb)
     3.23085293E-04    2     2000006        -5   # BR(~chi_2+ -> ~t_2     bb)
     1.12172803E-07    2    -1000005         6   # BR(~chi_2+ -> ~b_1*    t )
     9.70225577E-02    2     1000012       -11   # BR(~chi_2+ -> ~nu_eL   e+  )
     9.70225577E-02    2     1000014       -13   # BR(~chi_2+ -> ~nu_muL mu+ )
     1.11728494E-01    2     1000016       -15   # BR(~chi_2+ -> ~nu_tau1 tau+)
     9.69840258E-02    2    -1000011        12   # BR(~chi_2+ -> ~e_L+    nu_e)
     9.69840258E-02    2    -1000013        14   # BR(~chi_2+ -> ~mu_L+   nu_mu)
     1.11682466E-01    2    -1000015        16   # BR(~chi_2+ -> ~tau_1+  nu_tau)
     2.01968632E-05    2    -2000015        16   # BR(~chi_2+ -> ~tau_2+  nu_tau)
     6.03062514E-02    2     1000024        23   # BR(~chi_2+ -> ~chi_1+  Z )
     3.25116853E-04    2     1000022        24   # BR(~chi_2+ -> ~chi_10  W+)
     5.86961917E-02    2     1000023        24   # BR(~chi_2+ -> ~chi_20  W+)
     5.79818896E-02    2     1000025        24   # BR(~chi_2+ -> ~chi_30  W+)
     6.32585075E-02    2     1000024        25   # BR(~chi_2+ -> ~chi_1+  h )
     3.49879148E-02    2     1000024        35   # BR(~chi_2+ -> ~chi_1+  H )
     3.49943668E-02    2     1000024        36   # BR(~chi_2+ -> ~chi_1+  A )
     4.40595852E-03    2     1000022        37   # BR(~chi_2+ -> ~chi_10  H+)
     3.34463248E-02    2     1000023        37   # BR(~chi_2+ -> ~chi_20  H+)
     3.20690231E-02    2     1000025        37   # BR(~chi_2+ -> ~chi_30  H+)
#
#         PDG            Width
DECAY   1000022     0.00000000E+00   # neutralino1 decays
#
#         PDG            Width
DECAY   1000023     5.64282940E-02   # neutralino2 decays
#          BR         NDA      ID1       ID2
     9.36865757E-01    2     1000022        23   # BR(~chi_20 -> ~chi_10   Z )
     6.31342433E-02    2     1000022        25   # BR(~chi_20 -> ~chi_10   h )
#
#         PDG            Width
DECAY   1000025     5.95068903E-02   # neutralino3 decays
#          BR         NDA      ID1       ID2
     5.33084154E-01    2     1000022        23   # BR(~chi_30 -> ~chi_10   Z )
     4.66915846E-01    2     1000022        25   # BR(~chi_30 -> ~chi_10   h )
#
#         PDG            Width
DECAY   1000035     9.79657148E+01   # neutralino4 decays
#          BR         NDA      ID1       ID2
     1.21096723E-04    2     1000022        23   # BR(~chi_40 -> ~chi_10   Z )
     3.58975812E-02    2     1000023        23   # BR(~chi_40 -> ~chi_20   Z )
     2.42567801E-02    2     1000025        23   # BR(~chi_40 -> ~chi_30   Z )
     5.85394954E-02    2     1000024       -24   # BR(~chi_40 -> ~chi_1+   W-)
     5.85394954E-02    2    -1000024        24   # BR(~chi_40 -> ~chi_1-   W+)
     2.54671997E-04    2     1000022        25   # BR(~chi_40 -> ~chi_10   h )
     2.25953692E-03    2     1000022        35   # BR(~chi_40 -> ~chi_10   H )
     2.15420757E-03    2     1000022        36   # BR(~chi_40 -> ~chi_10   A )
     2.56735333E-02    2     1000023        25   # BR(~chi_40 -> ~chi_20   h )
     1.51630082E-02    2     1000023        35   # BR(~chi_40 -> ~chi_20   H )
     1.83678433E-02    2     1000023        36   # BR(~chi_40 -> ~chi_20   A )
     3.72827501E-02    2     1000025        25   # BR(~chi_40 -> ~chi_30   h )
     1.76005345E-02    2     1000025        35   # BR(~chi_40 -> ~chi_30   H )
     1.45080229E-02    2     1000025        36   # BR(~chi_40 -> ~chi_30   A )
     3.49164609E-02    2     1000024       -37   # BR(~chi_40 -> ~chi_1+   H-)
     3.49164609E-02    2    -1000024        37   # BR(~chi_40 -> ~chi_1-   H+)
     6.05790174E-04    2     1000002        -2   # BR(~chi_40 -> ~u_L      ub)
     6.05790174E-04    2    -1000002         2   # BR(~chi_40 -> ~u_L*     u )
     1.16434498E-10    2     2000002        -2   # BR(~chi_40 -> ~u_R      ub)
     1.16434498E-10    2    -2000002         2   # BR(~chi_40 -> ~u_R*     u )
     5.93598969E-04    2     1000001        -1   # BR(~chi_40 -> ~d_L      db)
     5.93598969E-04    2    -1000001         1   # BR(~chi_40 -> ~d_L*     d )
     4.29295434E-09    2     2000001        -1   # BR(~chi_40 -> ~d_R      db)
     4.29295434E-09    2    -2000001         1   # BR(~chi_40 -> ~d_R*     d )
     6.05691923E-04    2     1000004        -4   # BR(~chi_40 -> ~c_L      cb)
     6.05691923E-04    2    -1000004         4   # BR(~chi_40 -> ~c_L*     c )
     1.16424510E-10    2     2000004        -4   # BR(~chi_40 -> ~c_R      cb)
     1.16424510E-10    2    -2000004         4   # BR(~chi_40 -> ~c_R*     c )
     5.93598969E-04    2     1000003        -3   # BR(~chi_40 -> ~s _L      sb)
     5.93598969E-04    2    -1000003         3   # BR(~chi_40 -> ~s _L*     s )
     4.29295434E-09    2     2000003        -3   # BR(~chi_40 -> ~s _R      sb)
     4.29295434E-09    2    -2000003         3   # BR(~chi_40 -> ~s _R*     s )
     1.45869374E-03    2     1000006        -6   # BR(~chi_40 -> ~t_1      tb)
     1.45869374E-03    2    -1000006         6   # BR(~chi_40 -> ~t_1*     t )
     6.19762798E-08    2     1000005        -5   # BR(~chi_40 -> ~b_1      bb)
     6.19762798E-08    2    -1000005         5   # BR(~chi_40 -> ~b_1*     b )
     2.17319516E-04    2     2000005        -5   # BR(~chi_40 -> ~b_2      bb)
     2.17319516E-04    2    -2000005         5   # BR(~chi_40 -> ~b_2*     b )
     4.84335354E-02    2     1000011       -11   # BR(~chi_40 -> ~e_L-     e+)
     4.84335354E-02    2    -1000011        11   # BR(~chi_40 -> ~e_L+     e-)
     1.45628112E-08    2     2000011       -11   # BR(~chi_40 -> ~e_R-     e+)
     1.45628112E-08    2    -2000011        11   # BR(~chi_40 -> ~e_R+     e-)
     4.84335354E-02    2     1000013       -13   # BR(~chi_40 -> ~mu_L-    mu+)
     4.84335354E-02    2    -1000013        13   # BR(~chi_40 -> ~mu_L+    mu-)
     1.45628112E-08    2     2000013       -13   # BR(~chi_40 -> ~mu_R-    mu+)
     1.45628112E-08    2    -2000013        13   # BR(~chi_40 -> ~mu_R+    mu-)
     5.57747764E-02    2     1000015       -15   # BR(~chi_40 -> ~tau_1-   tau+)
     5.57747764E-02    2    -1000015        15   # BR(~chi_40 -> ~tau_1+   tau-)
     1.00974225E-05    2     2000015       -15   # BR(~chi_40 -> ~tau_2-   tau+)
     1.00974225E-05    2    -2000015        15   # BR(~chi_40 -> ~tau_2+   tau-)
     4.85619427E-02    2     1000012       -12   # BR(~chi_40 -> ~nu_eL    nu_eb)
     4.85619427E-02    2    -1000012        12   # BR(~chi_40 -> ~nu_eL*   nu_e )
     4.85619427E-02    2     1000014       -14   # BR(~chi_40 -> ~nu_muL   nu_mub)
     4.85619427E-02    2    -1000014        14   # BR(~chi_40 -> ~nu_muL*  nu_mu )
     5.59236373E-02    2     1000016       -16   # BR(~chi_40 -> ~nu_tau1  nu_taub)
     5.59236373E-02    2    -1000016        16   # BR(~chi_40 -> ~nu_tau1* nu_tau )
#
#         PDG            Width
DECAY        25     4.77354091E-03   # h decays
#          BR         NDA      ID1       ID2
     5.21354953E-01    2           5        -5   # BR(h -> b       bb     )
     5.56302596E-02    2         -15        15   # BR(h -> tau+    tau-   )
     1.96914726E-04    2         -13        13   # BR(h -> mu+     mu-    )
     2.14655058E-04    2           3        -3   # BR(h -> s       sb     )
     1.82319825E-02    2           4        -4   # BR(h -> c       cb     )
     6.78155553E-02    2          21        21   # BR(h -> g       g      )
     1.99220283E-03    2          22        22   # BR(h -> gam     gam    )
     1.37457331E-03    2          22        23   # BR(h -> Z       gam    )
     1.86222172E-01    2          24       -24   # BR(h -> W+      W-     )
     2.35187728E-02    2          23        23   # BR(h -> Z       Z      )
     1.23447958E-01    2     1000022   1000022   # BR(h -> ~chi_10 ~chi_10)
#
#         PDG            Width
DECAY        35     1.94832591E+01   # H decays
#          BR         NDA      ID1       ID2
     7.70989648E-01    2           5        -5   # BR(H -> b       bb     )
     1.31511961E-01    2         -15        15   # BR(H -> tau+    tau-   )
     4.66300149E-04    2         -13        13   # BR(H -> mu+     mu-    )
     3.13548731E-04    2           3        -3   # BR(H -> s       sb     )
     4.29740021E-08    2           4        -4   # BR(H -> c       cb     )
     4.07352664E-03    2           6        -6   # BR(H -> t       tb     )
     3.49075081E-05    2          21        21   # BR(H -> g       g      )
     2.41484966E-08    2          22        22   # BR(H -> gam     gam    )
     1.64854426E-08    2          23        22   # BR(H -> Z       gam    )
     8.33572448E-06    2          24       -24   # BR(H -> W+      W-     )
     4.14319515E-06    2          23        23   # BR(H -> Z       Z      )
     2.91637481E-05    2          25        25   # BR(H -> h       h      )
     7.76214725E-04    2     1000024  -1000024   # BR(H -> ~chi_1+ ~chi_1-)
     1.09186831E-02    2     1000022   1000022   # BR(H -> ~chi_10 ~chi_10)
     2.26037900E-03    2     1000023   1000023   # BR(H -> ~chi_20 ~chi_20)
     2.60599475E-03    2     1000025   1000025   # BR(H -> ~chi_30 ~chi_30)
     3.95567393E-02    2     1000022   1000023   # BR(H -> ~chi_10 ~chi_20)
     3.11707451E-02    2     1000022   1000025   # BR(H -> ~chi_10 ~chi_30)
     5.26934876E-03    2     1000023   1000025   # BR(H -> ~chi_20 ~chi_30)
     1.34192348E-07    2     2000001  -2000001   # BR(H -> ~d_R    ~d_R*  )
     1.34192348E-07    2     2000003  -2000003   # BR(H -> ~s_R    ~s_R*  )
     6.96902406E-07    2     2000011  -2000011   # BR(H -> ~e_R-   ~e_R+  )
     6.96902406E-07    2     2000013  -2000013   # BR(H -> ~mu_R-  ~mu_R+ )
     7.64507715E-06    2     1000015  -1000015   # BR(H -> ~tau_1- ~tau_1+)
     9.70389367E-07    2     1000016  -1000016   # BR(H -> ~nu_tauL ~nu_tauL*)
#
#         PDG            Width
DECAY        36     1.94870994E+01   # A decays
#          BR         NDA      ID1       ID2
     7.70884726E-01    2           5        -5   # BR(A -> b       bb     )
     1.31488808E-01    2         -15        15   # BR(A -> tau+    tau-   )
     4.66215505E-04    2         -13        13   # BR(A -> mu+     mu-    )
     3.13519006E-04    2           3        -3   # BR(A -> s       sb     )
     4.24184390E-08    2           4        -4   # BR(A -> c       cb     )
     4.13752210E-03    2           6        -6   # BR(A -> t       tb     )
     8.44146750E-05    2          21        21   # BR(A -> g       g      )
     9.13264331E-08    2          22        22   # BR(A -> gam     gam    )
     4.69924778E-08    2          23        22   # BR(A -> Z       gam    )
     8.35468250E-06    2          23        25   # BR(A -> Z       h      )
     8.36065302E-04    2     1000024  -1000024   # BR(A -> ~chi_1+ ~chi_1-)
     1.13762042E-02    2     1000022   1000022   # BR(A -> ~chi_10 ~chi_10)
     2.09032432E-03    2     1000023   1000023   # BR(A -> ~chi_20 ~chi_20)
     3.21401229E-03    2     1000025   1000025   # BR(A -> ~chi_30 ~chi_30)
     3.33952303E-02    2     1000022   1000023   # BR(A -> ~chi_10 ~chi_20)
     3.68325311E-02    2     1000022   1000025   # BR(A -> ~chi_10 ~chi_30)
     4.87189243E-03    2     1000023   1000025   # BR(A -> ~chi_20 ~chi_30)
#
#         PDG            Width
DECAY        37     1.89506072E+01   # H+ decays
#          BR         NDA      ID1       ID2
     1.29283270E-03    2           4        -5   # BR(H+ -> c       bb     )
     1.35437718E-01    2         -15        16   # BR(H+ -> tau+    nu_tau )
     4.80217021E-04    2         -13        14   # BR(H+ -> mu+     nu_mu  )
     1.29282711E-05    2           2        -5   # BR(H+ -> u       bb     )
     1.61105794E-05    2           2        -3   # BR(H+ -> u       sb     )
     3.17146703E-04    2           4        -3   # BR(H+ -> c       sb     )
     7.67636085E-01    2           6        -5   # BR(H+ -> t       bb     )
     8.65649315E-06    2          24        25   # BR(H+ -> W+      h      )
     7.46113099E-12    2          24        36   # BR(H+ -> W+      A      )
     8.79984942E-02    2     1000024   1000022   # BR(H+ -> ~chi_1+ ~chi_10)
     7.86945295E-04    2     1000024   1000023   # BR(H+ -> ~chi_1+ ~chi_20)
     6.00533281E-03    2     1000024   1000025   # BR(H+ -> ~chi_1+ ~chi_30)
     7.53299115E-06    2    -1000015   1000016   # BR(H+ -> ~tau_1+ ~nu_tauL)
