#
#                              ======================
#                              | THE SUSYHIT OUTPUT |
#                              ======================
#
#
#              ------------------------------------------------------
#              |     This is the output of the SUSY-HIT package     |
#              |  created by A.Djouadi, M.Muehlleitner and M.Spira. |
#              |  In case of problems with SUSY-HIT email to        |
#              |           margarete.muehlleitner@cern.ch           |
#              |           michael.spira@psi.ch                     |
#              |           abdelhak.djouadi@cern.ch                 |
#              ------------------------------------------------------
#
#              ------------------------------------------------------
#              |  SUSY Les Houches Accord - MSSM Spectrum + Decays  |
#              |              based on the decay programs           |
#              |                                                    |
#              |                     SDECAY 1.3b                    |
#              |                                                    |
#              |  Authors: M.Muhlleitner, A.Djouadi and Y.Mambrini  |
#              |  Ref.:    Comput.Phys.Commun.168(2005)46           |
#              |           [hep-ph/0311167]                         |
#              |                                                    |
#              |                     HDECAY 3.4                     |
#              |                                                    |
#              |  By: A.Djouadi,J.Kalinowski,M.Muhlleitner,M.Spira  |
#              |  Ref.:    Comput.Phys.Commun.108(1998)56           |
#              |           [hep-ph/9704448]                         |
#              |                                                    |
#              |                                                    |
#              |  If not stated otherwise all DRbar couplings and   |
#              |  soft SUSY breaking masses are given at the scale  |
#              |  Q=  0.23492010E+04
#              |                                                    |
#              ------------------------------------------------------
#
#
BLOCK DCINFO  # Decay Program information
     1   SDECAY/HDECAY # decay calculator
     2   1.3b  /3.4    # version number
#
BLOCK SPINFO  # Spectrum calculator information
     1     SOFTSUSY    # spectrum calculator               
     2     3.4.0       # version number                    
#
BLOCK MODSEL  # Model selection
     1     0   #  nonUniversal                                     
#
BLOCK SMINPUTS  # Standard Model inputs
         1     1.27908970E+02   # alpha_em^-1(M_Z)^MSbar
         2     1.16637870E-05   # G_F [GeV^-2]
         3     1.18400000E-01   # alpha_S(M_Z)^MSbar
         4     9.11876000E+01   # M_Z pole mass
         5     4.18000000E+00   # mb(mb)^MSbar
         6     1.73200000E+02   # mt pole mass
         7     1.77700000E+00   # mtau pole mass
#
BLOCK MINPAR  # Input parameters - minimal models
         3     3.32300000E+01   # tanb                
#
BLOCK EXTPAR  # Input parameters - non-minimal models
         0    -1.00000000E+00   # Set                 
         1     1.88134000E+03   # M_1(MX)             
         2    -1.89940000E+02   # M_2(MX)             
         3     3.77013000E+03   # M_3(MX)             
        11     2.38427000E+03   # At(MX)              
        12     1.96816000E+03   # Ab(MX)              
        13    -3.69421000E+03   # Atau(MX)            
        23    -1.41330000E+02   # mu(MX)              
        26     1.70236000E+03   # mA(pole)            
        31     3.75139000E+03   # meL(MX)             
        32     3.75139000E+03   # mmuL(MX)            
        33     3.88952000E+03   # mtauL(MX)           
        34     1.38897000E+03   # meR(MX)             
        35     1.38897000E+03   # mmuR(MX)            
        36     4.60560000E+02   # mtauR(MX)           
        41     2.51871000E+03   # mqL1(MX)            
        42     2.51871000E+03   # mqL2(MX)            
        43     2.10300000E+03   # mqL3(MX)            
        44     3.27080000E+03   # muR(MX)             
        45     3.27080000E+03   # mcR(MX)             
        46     2.62031000E+03   # mtR(MX)             
        47     3.93436000E+03   # mdR(MX)             
        48     3.93436000E+03   # msR(MX)             
        49     1.98060000E+03   # mbR(MX)             
#
BLOCK MASS  # Mass Spectrum
# PDG code           mass       particle
        24     8.03871179E+01   # W+
        25     1.25822674E+02   # h
        35     1.70237069E+03   # H
        36     1.70236001E+03   # A
        37     1.70462175E+03   # H+
         5     4.81876030E+00   # b-quark pole mass calculated from mb(mb)_Msbar
   1000001     2.59591913E+03   # ~d_L
   2000001     3.99943596E+03   # ~d_R
   1000002     2.59479568E+03   # ~u_L
   2000002     3.34489710E+03   # ~u_R
   1000003     2.59591913E+03   # ~s_L
   2000003     3.99943596E+03   # ~s_R
   1000004     2.59479568E+03   # ~c_L
   2000004     3.34489710E+03   # ~c_R
   1000005     2.03643373E+03   # ~b_1
   2000005     2.14753830E+03   # ~b_2
   1000006     2.13977566E+03   # ~t_1
   2000006     2.65494860E+03   # ~t_2
   1000011     3.75911294E+03   # ~e_L
   2000011     1.39972801E+03   # ~e_R
   1000012     3.75793460E+03   # ~nu_eL
   1000013     3.75911294E+03   # ~mu_L
   2000013     1.39972801E+03   # ~mu_R
   1000014     3.75793460E+03   # ~nu_muL
   1000015     4.84357959E+02   # ~tau_1
   2000015     3.89375366E+03   # ~tau_2
   1000016     3.89260149E+03   # ~nu_tauL
   1000021     3.77705495E+03   # ~g
   1000022    -1.14740393E+02   # ~chi_10
   1000023     1.56200582E+02   # ~chi_20
   1000025    -2.46638651E+02   # ~chi_30
   1000035     1.86574309E+03   # ~chi_40
   1000024     1.20137127E+02   # ~chi_1+
   1000037     2.49589714E+02   # ~chi_2+
#
BLOCK NMIX  # Neutralino Mixing Matrix
  1  1     1.21000597E-02   # N_11
  1  2     4.97338083E-01   # N_12
  1  3     6.82000103E-01   # N_13
  1  4    -5.36082344E-01   # N_14
  2  1    -1.74943010E-02   # N_21
  2  2    -1.55868995E-01   # N_22
  2  3     6.78263859E-01   # N_23
  2  4     7.17883655E-01   # N_24
  3  1    -9.19690619E-03   # N_31
  3  2     8.53439444E-01   # N_32
  3  3    -2.73555828E-01   # N_33
  3  4     4.43535501E-01   # N_34
  4  1     9.99731441E-01   # N_41
  4  2    -8.95877701E-04   # N_42
  4  3     1.09793773E-03   # N_43
  4  4     2.31308675E-02   # N_44
#
BLOCK UMIX  # Chargino Mixing Matrix U
  1  1     3.98126413E-01   # U_11
  1  2     9.17330561E-01   # U_12
  2  1    -9.17330561E-01   # U_21
  2  2     3.98126413E-01   # U_22
#
BLOCK VMIX  # Chargino Mixing Matrix V
  1  1    -6.54678587E-01   # V_11
  1  2    -7.55907367E-01   # V_12
  2  1     7.55907367E-01   # V_21
  2  2    -6.54678587E-01   # V_22
#
BLOCK STOPMIX  # Stop Mixing Matrix
  1  1     9.90390587E-01   # cos(theta_t)
  1  2    -1.38298536E-01   # sin(theta_t)
  2  1     1.38298536E-01   # -sin(theta_t)
  2  2     9.90390587E-01   # cos(theta_t)
#
BLOCK SBOTMIX  # Sbottom Mixing Matrix
  1  1    -3.58084049E-02   # cos(theta_b)
  1  2     9.99358673E-01   # sin(theta_b)
  2  1    -9.99358673E-01   # -sin(theta_b)
  2  2    -3.58084049E-02   # cos(theta_b)
#
BLOCK STAUMIX  # Stau Mixing Matrix
  1  1    -1.31593355E-04   # cos(theta_tau)
  1  2     9.99999991E-01   # sin(theta_tau)
  2  1    -9.99999991E-01   # -sin(theta_tau)
  2  2    -1.31593355E-04   # cos(theta_tau)
#
BLOCK ALPHA  # Higgs mixing
          -3.12762969E-02   # Mixing angle in the neutral Higgs boson sector
#
BLOCK HMIX Q=  2.34920100E+03  # DRbar Higgs Parameters
         1    -1.44114380E+02   # mu(Q)MSSM           
         2     3.22322898E+01   # tan                 
         3     2.41227794E+02   # higgs               
         4     2.91011820E+06   # mA^2(Q)MSSM         
#
BLOCK GAUGE Q=  2.34920100E+03  # The gauge couplings
     1     3.64595132E-01   # gprime(Q) DRbar
     2     6.43303458E-01   # g(Q) DRbar
     3     1.01099985E+00   # g3(Q) DRbar
#
BLOCK AU Q=  2.34920100E+03  # The trilinear couplings
  1  1     0.00000000E+00   # A_u(Q) DRbar
  2  2     0.00000000E+00   # A_c(Q) DRbar
  3  3     2.38427001E+03   # A_t(Q) DRbar
#
BLOCK AD Q=  2.34920100E+03  # The trilinear couplings
  1  1     0.00000000E+00   # A_d(Q) DRbar
  2  2     0.00000000E+00   # A_s(Q) DRbar
  3  3     1.96816001E+03   # A_b(Q) DRbar
#
BLOCK AE Q=  2.34920100E+03  # The trilinear couplings
  1  1     0.00000000E+00   # A_e(Q) DRbar
  2  2     0.00000000E+00   # A_mu(Q) DRbar
  3  3    -3.69421000E+03   # A_tau(Q) DRbar
#
BLOCK Yu Q=  2.34920100E+03  # The Yukawa couplings
  1  1     0.00000000E+00   # y_u(Q) DRbar
  2  2     0.00000000E+00   # y_c(Q) DRbar
  3  3     8.40196784E-01   # y_t(Q) DRbar
#
BLOCK Yd Q=  2.34920100E+03  # The Yukawa couplings
  1  1     0.00000000E+00   # y_d(Q) DRbar
  2  2     0.00000000E+00   # y_s(Q) DRbar
  3  3     4.50282334E-01   # y_b(Q) DRbar
#
BLOCK Ye Q=  2.34920100E+03  # The Yukawa couplings
  1  1     0.00000000E+00   # y_e(Q) DRbar
  2  2     0.00000000E+00   # y_mu(Q) DRbar
  3  3     3.30300279E-01   # y_tau(Q) DRbar
#
BLOCK MSOFT Q=  2.34920100E+03  # The soft SUSY breaking masses at the scale Q
         1     1.88134000E+03   # M_1(Q)              
         2    -1.89940000E+02   # M_2(Q)              
         3     3.77013000E+03   # M_3(Q)              
        21     2.94914791E+06   # mH1^2(Q)            
        22     1.12535202E+05   # mH2^2(Q)            
        31     3.75139000E+03   # meL(Q)              
        32     3.75139000E+03   # mmuL(Q)             
        33     3.88952000E+03   # mtauL(Q)            
        34     1.38897000E+03   # meR(Q)              
        35     1.38897000E+03   # mmuR(Q)             
        36     4.60560003E+02   # mtauR(Q)            
        41     2.51870999E+03   # mqL1(Q)             
        42     2.51870999E+03   # mqL2(Q)             
        43     2.10299998E+03   # mqL3(Q)             
        44     3.27079999E+03   # muR(Q)              
        45     3.27079999E+03   # mcR(Q)              
        46     2.62030998E+03   # mtR(Q)              
        47     3.93435999E+03   # mdR(Q)              
        48     3.93435999E+03   # msR(Q)              
        49     1.98059999E+03   # mbR(Q)              
#
Block HiggsBoundsInputHiggsCouplingsFermions
# ScalarNormEffCoupSq PseudoSNormEffCoupSq NP   IP1 IP2 IP2
    1.01692560E+00    0.00000000E+00        3  25   5   5  # h0-b-b eff. coupling^2, normalised to SM
    1.03890358E+03    0.00000000E+00        3  35   5   5  # H0-b-b eff. coupling^2, normalised to SM
    0.00000000E+00    1.03892051E+03        3  36   5   5  # A0-b-b eff. coupling^2, normalised to SM
#
    9.99983708E-01    0.00000000E+00        3  25   6   6  # h0-t-t eff. coupling^2, normalised to SM
    9.78829080E-04    0.00000000E+00        3  35   6   6  # H0-t-t eff. coupling^2, normalised to SM
    0.00000000E+00    9.62537552E-04        3  36   6   6  # A0-t-t eff. coupling^2, normalised to SM
#
    1.01692560E+00    0.00000000E+00        3  25  15  15  # h0-tau-tau eff. coupling^2, normalised to SM
    1.03890358E+03    0.00000000E+00        3  35  15  15  # H0-tau-tau eff. coupling^2, normalised to SM
    0.00000000E+00    1.03892051E+03        3  36  15  15  # A0-tau-tau eff. coupling^2, normalised to SM
#
Block HiggsBoundsInputHiggsCouplingsBosons
    9.99999932E-01        3  25  24  24  # h0-W-W eff. coupling^2, normalised to SM
    6.83592493E-08        3  35  24  24  # H0-W-W eff. coupling^2, normalised to SM
    0.00000000E+00        3  36  24  24  # A0-W-W eff. coupling^2, normalised to SM
#
    9.99999932E-01        3  25  23  23  # h0-Z-Z eff. coupling^2, normalised to SM
    6.83592493E-08        3  35  23  23  # H0-Z-Z eff. coupling^2, normalised to SM
    0.00000000E+00        3  36  23  23  # A0-Z-Z eff. coupling^2, normalised to SM
#
    8.91105113E-01        3  25  21  21  # h0-g-g eff. coupling^2, normalised to SM
    4.35526406E-10        3  35  21  21  # H0-g-g eff. coupling^2, normalised to SM
    2.05939145E-09        3  36  21  21  # A0-g-g eff. coupling^2, normalised to SM
#
    0.00000000E+00        3  25  25  23  # h0-h0-Z eff. coupling^2, normalised to SM
    0.00000000E+00        3  35  25  23  # H0-h0-Z eff. coupling^2, normalised to SM
    6.83592493E-08        3  36  25  23  # A0-h0-Z eff. coupling^2, normalised to SM
    0.00000000E+00        3  35  35  23  # H0-H0-Z eff. coupling^2, normalised to SM
    9.99999932E-01        3  36  35  23  # A0-H0-Z eff. coupling^2, normalised to SM
    0.00000000E+00        3  36  36  23  # A0-A0-Z eff. coupling^2, normalised to SM
#
    0.00000000E+00        4  25  21  21  23  # h0-g-g-Z eff. coupling^2, normalised to SM
    0.00000000E+00        4  35  21  21  23  # H0-g-g-Z eff. coupling^2, normalised to SM
    0.00000000E+00        4  36  21  21  23  # A0-g-g-Z eff. coupling^2, normalised to SM
#
#
#
#                             =================
#                             |The decay table|
#                             =================
#
# - The QCD corrections to the decays gluino -> squark  + quark
#                                     squark -> gaugino + quark_prime
#                                     squark -> squark_prime + Higgs
#                                     squark -> gluino  + quark
#   are included.
#
# - The multi-body decays for the inos, stops and sbottoms are included.
#
# - The loop induced decays for the gluino, neutralinos and stops
#   are included.
#
# - The SUSY decays of the top quark are included.
#
#
#         PDG            Width
DECAY         6     1.45760689E+00   # top decays
#          BR         NDA      ID1       ID2
     1.00000000E+00    2           5        24   # BR(t ->  b    W+)
#
#         PDG            Width
DECAY   1000021     2.00722496E+02   # gluino decays
#          BR         NDA      ID1       ID2
     4.85922682E-02    2     1000001        -1   # BR(~g -> ~d_L  db)
     4.85922682E-02    2    -1000001         1   # BR(~g -> ~d_L* d )
     4.86675871E-02    2     1000002        -2   # BR(~g -> ~u_L  ub)
     4.86675871E-02    2    -1000002         2   # BR(~g -> ~u_L* u )
     8.12392844E-03    2     2000002        -2   # BR(~g -> ~u_R  ub)
     8.12392844E-03    2    -2000002         2   # BR(~g -> ~u_R* u )
     4.85922682E-02    2     1000003        -3   # BR(~g -> ~s_L  sb)
     4.85922682E-02    2    -1000003         3   # BR(~g -> ~s_L* s )
     4.86675547E-02    2     1000004        -4   # BR(~g -> ~c_L  cb)
     4.86675547E-02    2    -1000004         4   # BR(~g -> ~c_L* c )
     8.12387459E-03    2     2000004        -4   # BR(~g -> ~c_R  cb)
     8.12387459E-03    2    -2000004         4   # BR(~g -> ~c_R* c )
     8.66107334E-02    2     1000005        -5   # BR(~g -> ~b_1  bb)
     8.66107334E-02    2    -1000005         5   # BR(~g -> ~b_1* b )
     7.88443666E-02    2     2000005        -5   # BR(~g -> ~b_2  bb)
     7.88443666E-02    2    -2000005         5   # BR(~g -> ~b_2* b )
     8.17847580E-02    2     1000006        -6   # BR(~g -> ~t_1  tb)
     8.17847580E-02    2    -1000006         6   # BR(~g -> ~t_1* t )
     4.19926608E-02    2     2000006        -6   # BR(~g -> ~t_2  tb)
     4.19926608E-02    2    -2000006         6   # BR(~g -> ~t_2* t )
#
#         PDG            Width
DECAY   1000006     6.37775333E+01   # stop1 decays
#          BR         NDA      ID1       ID2
     1.82606075E-01    2     1000022         6   # BR(~t_1 -> ~chi_10 t )
     2.49019110E-01    2     1000023         6   # BR(~t_1 -> ~chi_20 t )
     1.60854072E-01    2     1000025         6   # BR(~t_1 -> ~chi_30 t )
     1.31532592E-04    2     1000035         6   # BR(~t_1 -> ~chi_40 t )
     2.80040313E-01    2     1000024         5   # BR(~t_1 -> ~chi_1+ b )
     1.27323332E-01    2     1000037         5   # BR(~t_1 -> ~chi_2+ b )
     2.55653797E-05    2     1000005        24   # BR(~t_1 -> ~b_1    W+)
#
#         PDG            Width
DECAY   2000006     9.37462469E+01   # stop2 decays
#          BR         NDA      ID1       ID2
     9.83179570E-02    2     1000022         6   # BR(~t_2 -> ~chi_10 t )
     1.95357507E-01    2     1000023         6   # BR(~t_2 -> ~chi_20 t )
     1.00016130E-01    2     1000025         6   # BR(~t_2 -> ~chi_30 t )
     1.65791104E-02    2     1000035         6   # BR(~t_2 -> ~chi_40 t )
     1.84630293E-01    2     1000024         5   # BR(~t_2 -> ~chi_1+ b )
     2.07673431E-01    2     1000037         5   # BR(~t_2 -> ~chi_2+ b )
     5.04185721E-02    2     1000006        25   # BR(~t_2 -> ~t_1    h )
     5.02234172E-02    2     1000006        23   # BR(~t_2 -> ~t_1    Z )
     2.11985212E-04    2     1000005        24   # BR(~t_2 -> ~b_1    W+)
     9.65715964E-02    2     2000005        24   # BR(~t_2 -> ~b_2    W+)
#
#         PDG            Width
DECAY   1000005     1.62226820E+01   # sbottom1 decays
#          BR         NDA      ID1       ID2
     2.46355166E-01    2     1000022         5   # BR(~b_1 -> ~chi_10 b )
     2.26668451E-01    2     1000023         5   # BR(~b_1 -> ~chi_20 b )
     2.89142840E-02    2     1000025         5   # BR(~b_1 -> ~chi_30 b )
     1.90030918E-03    2     1000035         5   # BR(~b_1 -> ~chi_40 b )
     4.35949236E-01    2    -1000024         6   # BR(~b_1 -> ~chi_1- t )
     6.02125532E-02    2    -1000037         6   # BR(~b_1 -> ~chi_2- t )
#
#         PDG            Width
DECAY   2000005     6.39307368E+01   # sbottom2 decays
#          BR         NDA      ID1       ID2
     9.30365641E-02    2     1000022         5   # BR(~b_2 -> ~chi_10 b )
     6.58055716E-02    2     1000023         5   # BR(~b_2 -> ~chi_20 b )
     1.10498982E-01    2     1000025         5   # BR(~b_2 -> ~chi_30 b )
     3.00157679E-04    2     1000035         5   # BR(~b_2 -> ~chi_40 b )
     3.00335704E-01    2    -1000024         6   # BR(~b_2 -> ~chi_1- t )
     4.30010640E-01    2    -1000037         6   # BR(~b_2 -> ~chi_2- t )
     1.23806375E-05    2     1000005        23   # BR(~b_2 -> ~b_1    Z )
#
#         PDG            Width
DECAY   1000002     3.15874061E+01   # sup_L decays
#          BR         NDA      ID1       ID2
     8.36839877E-02    2     1000022         2   # BR(~u_L -> ~chi_10 u)
     8.46757117E-03    2     1000023         2   # BR(~u_L -> ~chi_20 u)
     2.39931534E-01    2     1000025         2   # BR(~u_L -> ~chi_30 u)
     2.81582970E-03    2     1000035         2   # BR(~u_L -> ~chi_40 u)
     2.87271852E-01    2     1000024         1   # BR(~u_L -> ~chi_1+ d)
     3.77829225E-01    2     1000037         1   # BR(~u_L -> ~chi_2+ d)
#
#         PDG            Width
DECAY   2000002     3.68130481E+00   # sup_R decays
#          BR         NDA      ID1       ID2
     3.04877397E-04    2     1000022         2   # BR(~u_R -> ~chi_10 u)
     6.36168382E-04    2     1000023         2   # BR(~u_R -> ~chi_20 u)
     1.74757232E-04    2     1000025         2   # BR(~u_R -> ~chi_30 u)
     9.98884197E-01    2     1000035         2   # BR(~u_R -> ~chi_40 u)
#
#         PDG            Width
DECAY   1000001     3.15176973E+01   # sdown_L decays
#          BR         NDA      ID1       ID2
     8.23749734E-02    2     1000022         1   # BR(~d_L -> ~chi_10 d)
     7.79933644E-03    2     1000023         1   # BR(~d_L -> ~chi_20 d)
     2.42530780E-01    2     1000025         1   # BR(~d_L -> ~chi_30 d)
     2.88256027E-03    2     1000035         1   # BR(~d_L -> ~chi_40 d)
     1.06516408E-01    2    -1000024         2   # BR(~d_L -> ~chi_1- u)
     5.57895942E-01    2    -1000037         2   # BR(~d_L -> ~chi_2- u)
#
#         PDG            Width
DECAY   2000001     4.77489284E+00   # sdown_R decays
#          BR         NDA      ID1       ID2
     6.85378315E-05    2     1000022         1   # BR(~d_R -> ~chi_10 d)
     1.43100687E-04    2     1000023         1   # BR(~d_R -> ~chi_20 d)
     3.93882748E-05    2     1000025         1   # BR(~d_R -> ~chi_30 d)
     2.89322649E-01    2     1000035         1   # BR(~d_R -> ~chi_40 d)
     7.10426324E-01    2     1000021         1   # BR(~d_R -> ~g      d)
#
#         PDG            Width
DECAY   1000004     3.17207541E+01   # scharm_L decays
#          BR         NDA      ID1       ID2
     8.37293614E-02    2     1000022         4   # BR(~c_L -> ~chi_10 c)
     8.46997572E-03    2     1000023         4   # BR(~c_L -> ~chi_20 c)
     2.39874133E-01    2     1000025         4   # BR(~c_L -> ~chi_30 c)
     2.77558237E-03    2     1000035         4   # BR(~c_L -> ~chi_40 c)
     2.87417963E-01    2     1000024         3   # BR(~c_L -> ~chi_1+ s)
     3.77732985E-01    2     1000037         3   # BR(~c_L -> ~chi_2+ s)
#
#         PDG            Width
DECAY   2000004     3.73349488E+00   # scharm_R decays
#          BR         NDA      ID1       ID2
     3.07623004E-04    2     1000022         4   # BR(~c_R -> ~chi_10 c)
     6.41746380E-04    2     1000023         4   # BR(~c_R -> ~chi_20 c)
     1.76203525E-04    2     1000025         4   # BR(~c_R -> ~chi_30 c)
     9.98874427E-01    2     1000035         4   # BR(~c_R -> ~chi_40 c)
#
#         PDG            Width
DECAY   1000003     3.16471449E+01   # sstrange_L decays
#          BR         NDA      ID1       ID2
     8.24312479E-02    2     1000022         3   # BR(~s_L -> ~chi_10 s)
     7.80265063E-03    2     1000023         3   # BR(~s_L -> ~chi_20 s)
     2.42506945E-01    2     1000025         3   # BR(~s_L -> ~chi_30 s)
     2.84182241E-03    2     1000035         3   # BR(~s_L -> ~chi_40 s)
     1.06585480E-01    2    -1000024         4   # BR(~s_L -> ~chi_1- c)
     5.57831854E-01    2    -1000037         4   # BR(~s_L -> ~chi_2- c)
#
#         PDG            Width
DECAY   2000003     3.97412205E+00   # sstrange_R decays
#          BR         NDA      ID1       ID2
     8.64483550E-05    2     1000022         3   # BR(~s_R -> ~chi_10 s)
     1.80453034E-04    2     1000023         3   # BR(~s_R -> ~chi_20 s)
     4.96444717E-05    2     1000025         3   # BR(~s_R -> ~chi_30 s)
     3.61822011E-01    2     1000035         3   # BR(~s_R -> ~chi_40 s)
     6.37861443E-01    2     1000021         3   # BR(~s_R -> ~g      s)
#
#         PDG            Width
DECAY   1000011     4.89112468E+01   # selectron_L decays
#          BR         NDA      ID1       ID2
     8.02781717E-02    2     1000022        11   # BR(~e_L -> ~chi_10 e-)
     8.66547980E-03    2     1000023        11   # BR(~e_L -> ~chi_20 e-)
     2.25676139E-01    2     1000025        11   # BR(~e_L -> ~chi_30 e-)
     5.75099532E-02    2     1000035        11   # BR(~e_L -> ~chi_40 e-)
     1.00090517E-01    2    -1000024        12   # BR(~e_L -> ~chi_1- nu_e)
     5.27779739E-01    2    -1000037        12   # BR(~e_L -> ~chi_2- nu_e)
#
#         PDG            Width
DECAY   2000011     5.23901134E-03   # selectron_R decays
#           BR         NDA      ID1       ID2
     2.04124399E-01    2     1000022        11   # BR(~e_R -> ~chi_10 e-)
     4.21778873E-01    2     1000023        11   # BR(~e_R -> ~chi_20 e-)
#           BR         NDA      ID1       ID2       ID3
     2.46458715E-02    3        11       -15        1000015   # BR(~e_R- -> e-  tau+  ~tau_1-)
     8.86999414E-02    3        11       15        -1000015   # BR(~e_R- -> e-  tau-  ~tau_1+)
     1.55893918E-02    3        11       23        1000022   # BR(~e_R- -> e-  Z  ~chi_10)
     1.23456499E-02    3        11       25        1000022   # BR(~e_R- -> e-  h  ~chi_10)
     1.47634725E-02    3        11       23        1000023   # BR(~e_R- -> e-  Z  ~chi_20)
     2.33192853E-02    3        11       25        1000023   # BR(~e_R- -> e-  h  ~chi_20)
     5.49569339E-03    3        11       23        1000025   # BR(~e_R- -> e-  Z  ~chi_30)
     4.28057863E-03    3        11       25        1000025   # BR(~e_R- -> e-  h  ~chi_30)
     6.74631103E-02    3        11       -24        1000024   # BR(~e_R- -> e-  W-  ~chi_1+)
     9.45960923E-02    3        11       24        -1000024   # BR(~e_R- -> e-  W+  ~chi_1-)
     2.36323214E-03    3        11       -24        1000037   # BR(~e_R- -> e-  W-  ~chi_2+)
     2.05344087E-02    3        11       24        -1000037   # BR(~e_R- -> e-  W+  ~chi_2-)
#
#         PDG            Width
DECAY   1000013     4.89112468E+01   # smuon_L decays
#          BR         NDA      ID1       ID2
     8.02781716E-02    2     1000022        13   # BR(~mu_L -> ~chi_10 mu-)
     8.66547979E-03    2     1000023        13   # BR(~mu_L -> ~chi_20 mu-)
     2.25676139E-01    2     1000025        13   # BR(~mu_L -> ~chi_30 mu-)
     5.75099531E-02    2     1000035        13   # BR(~mu_L -> ~chi_40 mu-)
     1.00090517E-01    2    -1000024        14   # BR(~mu_L -> ~chi_1- nu_mu)
     5.27779740E-01    2    -1000037        14   # BR(~mu_L -> ~chi_2- nu_mu)
#
#         PDG            Width
DECAY   2000013     5.24339531E-03   # smuon_R decays
#           BR         NDA      ID1       ID2
     2.03953730E-01    2     1000022        13   # BR(~mu_R -> ~chi_10 mu-)
     4.21426223E-01    2     1000023        13   # BR(~mu_R -> ~chi_20 mu-)
#           BR         NDA      ID1       ID2       ID3
     2.46252652E-02    3        13       -15        1000015   # BR(~mu_R- -> mu-  tau+  ~tau_1-)
     8.95068886E-02    3        13       15        -1000015   # BR(~mu_R- -> mu-  tau-  ~tau_1+)
     1.55256271E-02    3        13       23        1000022   # BR(~mu_R- -> mu-  Z  ~chi_10)
     1.23353279E-02    3        13       25        1000022   # BR(~mu_R- -> mu-  h  ~chi_10)
     1.47511288E-02    3        13       23        1000023   # BR(~mu_R- -> mu-  Z  ~chi_20)
     2.32997882E-02    3        13       25        1000023   # BR(~mu_R- -> mu-  h  ~chi_20)
     5.49109848E-03    3        13       23        1000025   # BR(~mu_R- -> mu-  Z  ~chi_30)
     4.29416412E-03    3        13       25        1000025   # BR(~mu_R- -> mu-  h  ~chi_30)
     6.73914475E-02    3        13       -24        1000024   # BR(~mu_R- -> mu-  W-  ~chi_1+)
     9.45360727E-02    3        13       24        -1000024   # BR(~mu_R- -> mu-  W+  ~chi_1-)
     2.36125626E-03    3        13       -24        1000037   # BR(~mu_R- -> mu-  W-  ~chi_2+)
     2.05019827E-02    3        13       24        -1000037   # BR(~mu_R- -> mu-  W+  ~chi_2-)
#
#         PDG            Width
DECAY   1000015     1.73739099E+00   # stau_1 decays
#          BR         NDA      ID1       ID2
     2.51014336E-01    2     1000022        15   # BR(~tau_1 -> ~chi_10  tau-)
     2.23860830E-01    2     1000023        15   # BR(~tau_1 -> ~chi_20  tau-)
     2.48949878E-02    2     1000025        15   # BR(~tau_1 -> ~chi_30  tau-)
     4.48553841E-01    2    -1000024        16   # BR(~tau_1 -> ~chi_1-  nu_tau)
     5.16760050E-02    2    -1000037        16   # BR(~tau_1 -> ~chi_2-  nu_tau)
#
#         PDG            Width
DECAY   2000015     6.52325180E+01   # stau_2 decays
#          BR         NDA      ID1       ID2
     1.22491550E-01    2     1000022        15   # BR(~tau_2 -> ~chi_10  tau-)
     6.61436033E-02    2     1000023        15   # BR(~tau_2 -> ~chi_20  tau-)
     1.85008243E-01    2     1000025        15   # BR(~tau_2 -> ~chi_30  tau-)
     4.66719176E-02    2     1000035        15   # BR(~tau_2 -> ~chi_40  tau-)
     7.77223163E-02    2    -1000024        16   # BR(~tau_2 -> ~chi_1-  nu_tau)
     4.10173134E-01    2    -1000037        16   # BR(~tau_2 -> ~chi_2-  nu_tau)
     3.41796251E-06    2     1000015        25   # BR(~tau_2 -> ~tau_1   h)
     4.58904862E-02    2     1000015        35   # BR(~tau_2 -> ~tau_1   H)
     4.58904488E-02    2     1000015        36   # BR(~tau_2 -> ~tau_1   A)
     4.88252705E-06    2     1000015        23   # BR(~tau_2 -> ~tau_1   Z)
#
#         PDG            Width
DECAY   1000012     4.89358187E+01   # snu_eL decays
#          BR         NDA      ID1       ID2
     7.59079615E-02    2     1000022        12   # BR(~nu_eL -> ~chi_10 nu_e)
     6.71095698E-03    2     1000023        12   # BR(~nu_eL -> ~chi_20 nu_e)
     2.31067553E-01    2     1000025        12   # BR(~nu_eL -> ~chi_30 nu_e)
     5.78039304E-02    2     1000035        12   # BR(~nu_eL -> ~chi_40 nu_e)
     2.70428454E-01    2     1000024        11   # BR(~nu_eL -> ~chi_1+ e-)
     3.58081144E-01    2     1000037        11   # BR(~nu_eL -> ~chi_2+ e-)
#
#         PDG            Width
DECAY   1000014     4.89358187E+01   # snu_muL decays
#          BR         NDA      ID1       ID2
     7.59079616E-02    2     1000022        14   # BR(~nu_muL -> ~chi_10 nu_mu)
     6.71095699E-03    2     1000023        14   # BR(~nu_muL -> ~chi_20 nu_mu)
     2.31067553E-01    2     1000025        14   # BR(~nu_muL -> ~chi_30 nu_mu)
     5.78039304E-02    2     1000035        14   # BR(~nu_muL -> ~chi_40 nu_mu)
     2.70428454E-01    2     1000024        13   # BR(~nu_muL -> ~chi_1+ mu-)
     3.58081143E-01    2     1000037        13   # BR(~nu_muL -> ~chi_2+ mu-)
#
#         PDG            Width
DECAY   1000016     6.52501066E+01   # snu_tauL decays
#          BR         NDA      ID1       ID2
     5.89764730E-02    2     1000022        16   # BR(~nu_tauL -> ~chi_10 nu_tau)
     5.21462427E-03    2     1000023        16   # BR(~nu_tauL -> ~chi_20 nu_tau)
     1.79610113E-01    2     1000025        16   # BR(~nu_tauL -> ~chi_30 nu_tau)
     4.69247445E-02    2     1000035        16   # BR(~nu_tauL -> ~chi_40 nu_tau)
     3.18852887E-01    2     1000024        15   # BR(~nu_tauL -> ~chi_1+ tau-)
     2.98706141E-01    2     1000037        15   # BR(~nu_tauL -> ~chi_2+ tau-)
     9.17055153E-02    2    -1000015       -37   # BR(~nu_tauL -> ~tau_1+ H-)
     9.50283122E-06    2    -1000015       -24   # BR(~nu_tauL -> ~tau_1+ W-)
#
#         PDG            Width
DECAY   1000024     7.98549521E-09   # chargino1+ decays
#           BR         NDA      ID1       ID2       ID3
     3.48896082E-01    3     1000022         2        -1   # BR(~chi_1+ -> ~chi_10 u    db)
     3.48896082E-01    3     1000022         4        -3   # BR(~chi_1+ -> ~chi_10 c    sb)
     1.16274601E-01    3     1000022       -11        12   # BR(~chi_1+ -> ~chi_10 e+   nu_e)
     1.16274601E-01    3     1000022       -13        14   # BR(~chi_1+ -> ~chi_10 mu+  nu_mu)
     6.96586331E-02    3     1000022       -15        16   # BR(~chi_1+ -> ~chi_10 tau+ nu_tau)
#
#         PDG            Width
DECAY   1000037     5.25769701E-01   # chargino2+ decays
#          BR         NDA      ID1       ID2
     3.39055651E-01    2     1000024        23   # BR(~chi_2+ -> ~chi_1+  Z )
     5.02964495E-01    2     1000022        24   # BR(~chi_2+ -> ~chi_10  W+)
     1.24881362E-01    2     1000023        24   # BR(~chi_2+ -> ~chi_20  W+)
     3.30984927E-02    2     1000024        25   # BR(~chi_2+ -> ~chi_1+  h )
#
#         PDG            Width
DECAY   1000022     0.00000000E+00   # neutralino1 decays
#
#         PDG            Width
DECAY   1000023     1.63627547E-04   # neutralino2 decays
#          BR         NDA      ID1       ID2
     1.30249309E-02    2     1000022        22   # BR(~chi_20 -> ~chi_10 gam)
#           BR         NDA      ID1       ID2       ID3
     4.93649938E-02    3     1000022        -2         2   # BR(~chi_20 -> ~chi_10 ub      u)
     6.39735336E-02    3     1000022        -1         1   # BR(~chi_20 -> ~chi_10 db      d)
     4.93649938E-02    3     1000022        -4         4   # BR(~chi_20 -> ~chi_10 cb      c)
     6.39735336E-02    3     1000022        -3         3   # BR(~chi_20 -> ~chi_10 sb      s)
     5.65829240E-02    3     1000022        -5         5   # BR(~chi_20 -> ~chi_10 bb      b)
     1.46507481E-02    3     1000022       -11        11   # BR(~chi_20 -> ~chi_10 e+      e-)
     1.46507481E-02    3     1000022       -13        13   # BR(~chi_20 -> ~chi_10 mu+     mu-)
     1.46894841E-02    3     1000022       -15        15   # BR(~chi_20 -> ~chi_10 tau+    tau-)
     2.92839102E-02    3     1000022       -12        12   # BR(~chi_20 -> ~chi_10 nu_eb   nu_e)
     2.92839102E-02    3     1000022       -14        14   # BR(~chi_20 -> ~chi_10 nu_mub  nu_mu)
     2.92837695E-02    3     1000022       -16        16   # BR(~chi_20 -> ~chi_10 nu_taub nu_tau)
     9.53967916E-02    3     1000024        -2         1   # BR(~chi_20 -> ~chi_1+ ub      d)
     9.53967916E-02    3    -1000024        -1         2   # BR(~chi_20 -> ~chi_1- db      u)
     9.53967916E-02    3     1000024        -4         3   # BR(~chi_20 -> ~chi_1+ cb      s)
     9.53967916E-02    3    -1000024        -3         4   # BR(~chi_20 -> ~chi_1- sb      c)
     3.17969302E-02    3     1000024       -12        11   # BR(~chi_20 -> ~chi_1+ nu_eb   e-)
     3.17969302E-02    3    -1000024        12       -11   # BR(~chi_20 -> ~chi_1- nu_e    e+)
     3.17969302E-02    3     1000024       -14        13   # BR(~chi_20 -> ~chi_1+ nu_mub  mu-)
     3.17969302E-02    3    -1000024        14       -13   # BR(~chi_20 -> ~chi_1- nu_mu   mu+)
     3.15488164E-02    3     1000024       -16        15   # BR(~chi_20 -> ~chi_1+ nu_taub tau-)
     3.15488164E-02    3    -1000024        16       -15   # BR(~chi_20 -> ~chi_1- nu_tau  tau+)
#
#         PDG            Width
DECAY   1000025     6.50450792E-01   # neutralino3 decays
#          BR         NDA      ID1       ID2
     1.21844321E-02    2     1000022        23   # BR(~chi_30 -> ~chi_10   Z )
     4.83212184E-01    2     1000024       -24   # BR(~chi_30 -> ~chi_1+   W-)
     4.83212184E-01    2    -1000024        24   # BR(~chi_30 -> ~chi_1-   W+)
     2.13911997E-02    2     1000022        25   # BR(~chi_30 -> ~chi_10   h )
#
#         PDG            Width
DECAY   1000035     1.69237446E+01   # neutralino4 decays
#          BR         NDA      ID1       ID2
     2.14341945E-02    2     1000022        23   # BR(~chi_40 -> ~chi_10   Z )
     3.09495767E-02    2     1000023        23   # BR(~chi_40 -> ~chi_20   Z )
     1.32475949E-02    2     1000025        23   # BR(~chi_40 -> ~chi_30   Z )
     4.05189633E-02    2     1000024       -24   # BR(~chi_40 -> ~chi_1+   W-)
     4.05189633E-02    2    -1000024        24   # BR(~chi_40 -> ~chi_1-   W+)
     2.35877539E-02    2     1000037       -24   # BR(~chi_40 -> ~chi_2+   W-)
     2.35877539E-02    2    -1000037        24   # BR(~chi_40 -> ~chi_2-   W+)
     2.11475978E-02    2     1000022        25   # BR(~chi_40 -> ~chi_10   h )
     1.84836687E-04    2     1000022        35   # BR(~chi_40 -> ~chi_10   H )
     1.24827541E-03    2     1000022        36   # BR(~chi_40 -> ~chi_10   A )
     4.16729654E-02    2     1000023        25   # BR(~chi_40 -> ~chi_20   h )
     6.01681427E-04    2     1000023        35   # BR(~chi_40 -> ~chi_20   H )
     1.08545099E-05    2     1000023        36   # BR(~chi_40 -> ~chi_20   A )
     9.29851175E-03    2     1000025        25   # BR(~chi_40 -> ~chi_30   h )
     1.18271915E-03    2     1000024       -37   # BR(~chi_40 -> ~chi_1+   H-)
     1.18271915E-03    2    -1000024        37   # BR(~chi_40 -> ~chi_1-   H+)
     5.56875639E-02    2     2000011       -11   # BR(~chi_40 -> ~e_R-     e+)
     5.56875639E-02    2    -2000011        11   # BR(~chi_40 -> ~e_R+     e-)
     5.56875639E-02    2     2000013       -13   # BR(~chi_40 -> ~mu_R-    mu+)
     5.56875639E-02    2    -2000013        13   # BR(~chi_40 -> ~mu_R+    mu-)
     2.53437391E-01    2     1000015       -15   # BR(~chi_40 -> ~tau_1-   tau+)
     2.53437391E-01    2    -1000015        15   # BR(~chi_40 -> ~tau_1+   tau-)
#
#         PDG            Width
DECAY        25     4.11394591E-03   # h decays
#          BR         NDA      ID1       ID2
     5.79081364E-01    2           5        -5   # BR(h -> b       bb     )
     6.43802094E-02    2         -15        15   # BR(h -> tau+    tau-   )
     2.27878588E-04    2         -13        13   # BR(h -> mu+     mu-    )
     2.48437226E-04    2           3        -3   # BR(h -> s       sb     )
     2.11928581E-02    2           4        -4   # BR(h -> c       cb     )
     7.91853073E-02    2          21        21   # BR(h -> g       g      )
     2.39065278E-03    2          22        22   # BR(h -> gam     gam    )
     1.63295590E-03    2          22        23   # BR(h -> Z       gam    )
     2.23421454E-01    2          24       -24   # BR(h -> W+      W-     )
     2.82388827E-02    2          23        23   # BR(h -> Z       Z      )
#
#         PDG            Width
DECAY        35     4.67421872E+01   # H decays
#          BR         NDA      ID1       ID2
     4.76786964E-01    2           5        -5   # BR(H -> b       bb     )
     7.82706869E-02    2         -15        15   # BR(H -> tau+    tau-   )
     2.76709217E-04    2         -13        13   # BR(H -> mu+     mu-    )
     1.92497578E-04    2           3        -3   # BR(H -> s       sb     )
     1.58168968E-08    2           4        -4   # BR(H -> c       cb     )
     1.51490260E-03    2           6        -6   # BR(H -> t       tb     )
     1.75785518E-05    2          21        21   # BR(H -> g       g      )
     1.03384649E-07    2          22        22   # BR(H -> gam     gam    )
     8.21336621E-09    2          23        22   # BR(H -> Z       gam    )
     2.29660577E-06    2          24       -24   # BR(H -> W+      W-     )
     1.14264503E-06    2          23        23   # BR(H -> Z       Z      )
     7.87622941E-06    2          25        25   # BR(H -> h       h      )
     1.04643422E-01    2     1000024  -1000024   # BR(H -> ~chi_1+ ~chi_1-)
     2.14710414E-02    2     1000037  -1000037   # BR(H -> ~chi_2+ ~chi_2-)
     8.48565156E-02    2     1000024  -1000037   # BR(H -> ~chi_1+ ~chi_2-)
     8.48565156E-02    2     1000037  -1000024   # BR(H -> ~chi_2+ ~chi_1-)
     3.20143752E-02    2     1000022   1000022   # BR(H -> ~chi_10 ~chi_10)
     3.08955364E-03    2     1000023   1000023   # BR(H -> ~chi_20 ~chi_20)
     1.34439492E-02    2     1000025   1000025   # BR(H -> ~chi_30 ~chi_30)
     9.24875915E-03    2     1000022   1000023   # BR(H -> ~chi_10 ~chi_20)
     2.82444232E-02    2     1000022   1000025   # BR(H -> ~chi_10 ~chi_30)
     6.10606605E-02    2     1000023   1000025   # BR(H -> ~chi_20 ~chi_30)
     2.77450311E-09    2     1000015  -1000015   # BR(H -> ~tau_1- ~tau_1+)
#
#         PDG            Width
DECAY        36     4.67442634E+01   # A decays
#          BR         NDA      ID1       ID2
     4.76786582E-01    2           5        -5   # BR(A -> b       bb     )
     7.82683368E-02    2         -15        15   # BR(A -> tau+    tau-   )
     2.76699707E-04    2         -13        13   # BR(A -> mu+     mu-    )
     1.92504221E-04    2           3        -3   # BR(A -> s       sb     )
     1.56957672E-08    2           4        -4   # BR(A -> c       cb     )
     1.53426521E-03    2           6        -6   # BR(A -> t       tb     )
     3.82213911E-05    2          21        21   # BR(A -> g       g      )
     1.94222825E-07    2          22        22   # BR(A -> gam     gam    )
     2.18243222E-08    2          23        22   # BR(A -> Z       gam    )
     2.30868783E-06    2          23        25   # BR(A -> Z       h      )
     1.13647901E-01    2     1000024  -1000024   # BR(A -> ~chi_1+ ~chi_1-)
     3.01339554E-02    2     1000037  -1000037   # BR(A -> ~chi_2+ ~chi_2-)
     7.60157542E-02    2     1000024  -1000037   # BR(A -> ~chi_1+ ~chi_2-)
     7.60157542E-02    2     1000037  -1000024   # BR(A -> ~chi_2+ ~chi_1-)
     3.59625248E-02    2     1000022   1000022   # BR(A -> ~chi_10 ~chi_10)
     2.80195125E-03    2     1000023   1000023   # BR(A -> ~chi_20 ~chi_20)
     1.79656984E-02    2     1000025   1000025   # BR(A -> ~chi_30 ~chi_30)
     7.16157150E-03    2     1000022   1000023   # BR(A -> ~chi_10 ~chi_20)
     3.14353882E-02    2     1000022   1000025   # BR(A -> ~chi_10 ~chi_30)
     5.17603522E-02    2     1000023   1000025   # BR(A -> ~chi_20 ~chi_30)
#
#         PDG            Width
DECAY        37     4.68428223E+01   # H+ decays
#          BR         NDA      ID1       ID2
     8.09241971E-04    2           4        -5   # BR(H+ -> c       bb     )
     7.82074258E-02    2         -15        16   # BR(H+ -> tau+    nu_tau )
     2.76484369E-04    2         -13        14   # BR(H+ -> mu+     nu_mu  )
     8.09239150E-06    2           2        -5   # BR(H+ -> u       bb     )
     9.60046061E-06    2           2        -3   # BR(H+ -> u       sb     )
     1.88981128E-04    2           4        -3   # BR(H+ -> c       sb     )
     4.80220705E-01    2           6        -5   # BR(H+ -> t       bb     )
     2.31769571E-06    2          24        25   # BR(H+ -> W+      h      )
     1.66055348E-12    2          24        36   # BR(H+ -> W+      A      )
     9.25621587E-04    2     1000024   1000022   # BR(H+ -> ~chi_1+ ~chi_10)
     4.27884024E-02    2     1000024   1000023   # BR(H+ -> ~chi_1+ ~chi_20)
     1.27505100E-01    2     1000024   1000025   # BR(H+ -> ~chi_1+ ~chi_30)
     1.72578691E-01    2     1000037   1000022   # BR(H+ -> ~chi_2+ ~chi_10)
     9.64378208E-02    2     1000037   1000023   # BR(H+ -> ~chi_2+ ~chi_20)
     4.15145973E-05    2     1000037   1000025   # BR(H+ -> ~chi_2+ ~chi_30)
