#
#                              ======================
#                              | THE SUSYHIT OUTPUT |
#                              ======================
#
#
#              ------------------------------------------------------
#              |     This is the output of the SUSY-HIT package     |
#              |  created by A.Djouadi, M.Muehlleitner and M.Spira. |
#              |  In case of problems with SUSY-HIT email to        |
#              |           margarete.muehlleitner@cern.ch           |
#              |           michael.spira@psi.ch                     |
#              |           abdelhak.djouadi@cern.ch                 |
#              ------------------------------------------------------
#
#              ------------------------------------------------------
#              |  SUSY Les Houches Accord - MSSM Spectrum + Decays  |
#              |              based on the decay programs           |
#              |                                                    |
#              |                     SDECAY 1.3b                    |
#              |                                                    |
#              |  Authors: M.Muhlleitner, A.Djouadi and Y.Mambrini  |
#              |  Ref.:    Comput.Phys.Commun.168(2005)46           |
#              |           [hep-ph/0311167]                         |
#              |                                                    |
#              |                     HDECAY 3.4                     |
#              |                                                    |
#              |  By: A.Djouadi,J.Kalinowski,M.Muhlleitner,M.Spira  |
#              |  Ref.:    Comput.Phys.Commun.108(1998)56           |
#              |           [hep-ph/9704448]                         |
#              |                                                    |
#              |                                                    |
#              |  If not stated otherwise all DRbar couplings and   |
#              |  soft SUSY breaking masses are given at the scale  |
#              |  Q=  0.31764550E+04
#              |                                                    |
#              ------------------------------------------------------
#
#
BLOCK DCINFO  # Decay Program information
     1   SDECAY/HDECAY # decay calculator
     2   1.3b  /3.4    # version number
#
BLOCK SPINFO  # Spectrum calculator information
     1     SOFTSUSY    # spectrum calculator               
     2     3.4.0       # version number                    
#
BLOCK MODSEL  # Model selection
     1     0   #  nonUniversal                                     
#
BLOCK SMINPUTS  # Standard Model inputs
         1     1.27908970E+02   # alpha_em^-1(M_Z)^MSbar
         2     1.16637870E-05   # G_F [GeV^-2]
         3     1.18400000E-01   # alpha_S(M_Z)^MSbar
         4     9.11876000E+01   # M_Z pole mass
         5     4.18000000E+00   # mb(mb)^MSbar
         6     1.73200000E+02   # mt pole mass
         7     1.77700000E+00   # mtau pole mass
#
BLOCK MINPAR  # Input parameters - minimal models
         3     2.01000000E+01   # tanb                
#
BLOCK EXTPAR  # Input parameters - non-minimal models
         0    -1.00000000E+00   # Set                 
         1     1.24260000E+03   # M_1(MX)             
         2     5.74000000E+02   # M_2(MX)             
         3     1.56185000E+03   # M_3(MX)             
        11    -2.67232000E+03   # At(MX)              
        12     1.45207000E+03   # Ab(MX)              
        13    -1.79910000E+02   # Atau(MX)            
        23     1.23891000E+03   # mu(MX)              
        26     3.54327000E+03   # mA(pole)            
        31     3.88990000E+03   # meL(MX)             
        32     3.88990000E+03   # mmuL(MX)            
        33     3.02928000E+03   # mtauL(MX)           
        34     2.22041000E+03   # meR(MX)             
        35     2.22041000E+03   # mmuR(MX)            
        36     3.22438000E+03   # mtauR(MX)           
        41     7.15280000E+02   # mqL1(MX)            
        42     7.15280000E+02   # mqL2(MX)            
        43     3.32829000E+03   # mqL3(MX)            
        44     2.87869000E+03   # muR(MX)             
        45     2.87869000E+03   # mcR(MX)             
        46     3.02841000E+03   # mtR(MX)             
        47     5.68060000E+02   # mdR(MX)             
        48     5.68060000E+02   # msR(MX)             
        49     8.17840000E+02   # mbR(MX)             
#
BLOCK MASS  # Mass Spectrum
# PDG code           mass       particle
        24     8.03773712E+01   # W+
        25     1.24353357E+02   # h
        35     3.54328031E+03   # H
        36     3.54327001E+03   # A
        37     3.54431921E+03   # H+
         5     4.81876030E+00   # b-quark pole mass calculated from mb(mb)_Msbar
   1000001     8.83733416E+02   # ~d_L
   2000001     7.58319980E+02   # ~d_R
   1000002     8.80227690E+02   # ~u_L
   2000002     2.92414741E+03   # ~u_R
   1000003     8.83733416E+02   # ~s_L
   2000003     7.58319980E+02   # ~s_R
   1000004     8.80227690E+02   # ~c_L
   2000004     2.92414741E+03   # ~c_R
   1000005     9.64034741E+02   # ~b_1
   2000005     3.35050489E+03   # ~b_2
   1000006     3.01337170E+03   # ~t_1
   2000006     3.36371987E+03   # ~t_2
   1000011     3.89538982E+03   # ~e_L
   2000011     2.23473098E+03   # ~e_R
   1000012     3.89425715E+03   # ~nu_eL
   1000013     3.89538982E+03   # ~mu_L
   2000013     2.23473098E+03   # ~mu_R
   1000014     3.89425715E+03   # ~nu_muL
   1000015     3.03085943E+03   # ~tau_1
   2000015     3.23205647E+03   # ~tau_2
   1000016     3.02975670E+03   # ~nu_tauL
   1000021     1.69101497E+03   # ~g
   1000022     5.91847469E+02   # ~chi_10
   1000023     1.21088980E+03   # ~chi_20
   1000025    -1.27436846E+03   # ~chi_30
   1000035     1.29394349E+03   # ~chi_40
   1000024     5.92026679E+02   # ~chi_1+
   1000037     1.27918033E+03   # ~chi_2+
#
BLOCK NMIX  # Neutralino Mixing Matrix
  1  1    -3.02889771E-03   # N_11
  1  2     9.96061585E-01   # N_12
  1  3    -7.92378858E-02   # N_13
  1  4     3.96673936E-02   # N_14
  2  1     8.78683667E-01   # N_21
  2  2     4.30666391E-02   # N_22
  2  3     3.42898579E-01   # N_23
  2  4    -3.29364301E-01   # N_24
  3  1    -1.18266827E-02   # N_31
  3  2     2.79750303E-02   # N_32
  3  3     7.06217108E-01   # N_33
  3  4     7.07343568E-01   # N_34
  4  1    -4.77248331E-01   # N_41
  4  2     7.22771137E-02   # N_42
  4  3     6.14328348E-01   # N_43
  4  4    -6.24188057E-01   # N_44
#
BLOCK UMIX  # Chargino Mixing Matrix U
  1  1     9.93752417E-01   # U_11
  1  2    -1.11607047E-01   # U_12
  2  1     1.11607047E-01   # U_21
  2  2     9.93752417E-01   # U_22
#
BLOCK VMIX  # Chargino Mixing Matrix V
  1  1     9.98437590E-01   # V_11
  1  2    -5.58782465E-02   # V_12
  2  1     5.58782465E-02   # V_21
  2  2     9.98437590E-01   # V_22
#
BLOCK STOPMIX  # Stop Mixing Matrix
  1  1     1.82397653E-01   # cos(theta_t)
  1  2     9.83224845E-01   # sin(theta_t)
  2  1    -9.83224845E-01   # -sin(theta_t)
  2  2     1.82397653E-01   # cos(theta_t)
#
BLOCK SBOTMIX  # Sbottom Mixing Matrix
  1  1     4.84249917E-03   # cos(theta_b)
  1  2     9.99988275E-01   # sin(theta_b)
  2  1    -9.99988275E-01   # -sin(theta_b)
  2  2     4.84249917E-03   # cos(theta_b)
#
BLOCK STAUMIX  # Stau Mixing Matrix
  1  1     9.99401077E-01   # cos(theta_tau)
  1  2     3.46047293E-02   # sin(theta_tau)
  2  1    -3.46047293E-02   # -sin(theta_tau)
  2  2     9.99401077E-01   # cos(theta_tau)
#
BLOCK ALPHA  # Higgs mixing
          -5.20257635E-02   # Mixing angle in the neutral Higgs boson sector
#
BLOCK HMIX Q=  3.17645500E+03  # DRbar Higgs Parameters
         1     1.25800391E+03   # mu(Q)MSSM           
         2     1.92364010E+01   # tan                 
         3     2.42213491E+02   # higgs               
         4     1.29031691E+07   # mA^2(Q)MSSM         
#
BLOCK GAUGE Q=  3.17645500E+03  # The gauge couplings
     1     3.65142341E-01   # gprime(Q) DRbar
     2     6.40528985E-01   # g(Q) DRbar
     3     1.02577876E+00   # g3(Q) DRbar
#
BLOCK AU Q=  3.17645500E+03  # The trilinear couplings
  1  1     0.00000000E+00   # A_u(Q) DRbar
  2  2     0.00000000E+00   # A_c(Q) DRbar
  3  3    -2.67231999E+03   # A_t(Q) DRbar
#
BLOCK AD Q=  3.17645500E+03  # The trilinear couplings
  1  1     0.00000000E+00   # A_d(Q) DRbar
  2  2     0.00000000E+00   # A_s(Q) DRbar
  3  3     1.45207000E+03   # A_b(Q) DRbar
#
BLOCK AE Q=  3.17645500E+03  # The trilinear couplings
  1  1     0.00000000E+00   # A_e(Q) DRbar
  2  2     0.00000000E+00   # A_mu(Q) DRbar
  3  3    -1.79909999E+02   # A_tau(Q) DRbar
#
BLOCK Yu Q=  3.17645500E+03  # The Yukawa couplings
  1  1     0.00000000E+00   # y_u(Q) DRbar
  2  2     0.00000000E+00   # y_c(Q) DRbar
  3  3     8.17176419E-01   # y_t(Q) DRbar
#
BLOCK Yd Q=  3.17645500E+03  # The Yukawa couplings
  1  1     0.00000000E+00   # y_d(Q) DRbar
  2  2     0.00000000E+00   # y_s(Q) DRbar
  3  3     2.43776000E-01   # y_b(Q) DRbar
#
BLOCK Ye Q=  3.17645500E+03  # The Yukawa couplings
  1  1     0.00000000E+00   # y_e(Q) DRbar
  2  2     0.00000000E+00   # y_mu(Q) DRbar
  3  3     1.98870607E-01   # y_tau(Q) DRbar
#
BLOCK MSOFT Q=  3.17645500E+03  # The soft SUSY breaking masses at the scale Q
         1     1.24260000E+03   # M_1(Q)              
         2     5.74000000E+02   # M_2(Q)              
         3     1.56185000E+03   # M_3(Q)              
        21     1.09654668E+07   # mH1^2(Q)            
        22    -1.35421155E+06   # mH2^2(Q)            
        31     3.88990000E+03   # meL(Q)              
        32     3.88990000E+03   # mmuL(Q)             
        33     3.02928000E+03   # mtauL(Q)            
        34     2.22041000E+03   # meR(Q)              
        35     2.22041000E+03   # mmuR(Q)             
        36     3.22438000E+03   # mtauR(Q)            
        41     7.15279986E+02   # mqL1(Q)             
        42     7.15279986E+02   # mqL2(Q)             
        43     3.32828999E+03   # mqL3(Q)             
        44     2.87869000E+03   # muR(Q)              
        45     2.87869000E+03   # mcR(Q)              
        46     3.02840999E+03   # mtR(Q)              
        47     5.68059982E+02   # mdR(Q)              
        48     5.68059982E+02   # msR(Q)              
        49     8.17839988E+02   # mbR(Q)              
#
Block HiggsBoundsInputHiggsCouplingsFermions
# ScalarNormEffCoupSq PseudoSNormEffCoupSq NP   IP1 IP2 IP2
    1.00337843E+00    0.00000000E+00        3  25   5   5  # h0-b-b eff. coupling^2, normalised to SM
    3.70035745E+02    0.00000000E+00        3  35   5   5  # H0-b-b eff. coupling^2, normalised to SM
    0.00000000E+00    3.70039123E+02        3  36   5   5  # A0-b-b eff. coupling^2, normalised to SM
#
    9.99990870E-01    0.00000000E+00        3  25   6   6  # h0-t-t eff. coupling^2, normalised to SM
    2.71154689E-03    0.00000000E+00        3  35   6   6  # H0-t-t eff. coupling^2, normalised to SM
    0.00000000E+00    2.70241695E-03        3  36   6   6  # A0-t-t eff. coupling^2, normalised to SM
#
    1.00337843E+00    0.00000000E+00        3  25  15  15  # h0-tau-tau eff. coupling^2, normalised to SM
    3.70035745E+02    0.00000000E+00        3  35  15  15  # H0-tau-tau eff. coupling^2, normalised to SM
    0.00000000E+00    3.70039123E+02        3  36  15  15  # A0-tau-tau eff. coupling^2, normalised to SM
#
Block HiggsBoundsInputHiggsCouplingsBosons
    9.99999992E-01        3  25  24  24  # h0-W-W eff. coupling^2, normalised to SM
    7.69826239E-09        3  35  24  24  # H0-W-W eff. coupling^2, normalised to SM
    0.00000000E+00        3  36  24  24  # A0-W-W eff. coupling^2, normalised to SM
#
    9.99999992E-01        3  25  23  23  # h0-Z-Z eff. coupling^2, normalised to SM
    7.69826239E-09        3  35  23  23  # H0-Z-Z eff. coupling^2, normalised to SM
    0.00000000E+00        3  36  23  23  # A0-Z-Z eff. coupling^2, normalised to SM
#
    8.94272425E-01        3  25  21  21  # h0-g-g eff. coupling^2, normalised to SM
    2.21439213E-15        3  35  21  21  # H0-g-g eff. coupling^2, normalised to SM
    2.81663750E-13        3  36  21  21  # A0-g-g eff. coupling^2, normalised to SM
#
    0.00000000E+00        3  25  25  23  # h0-h0-Z eff. coupling^2, normalised to SM
    0.00000000E+00        3  35  25  23  # H0-h0-Z eff. coupling^2, normalised to SM
    7.69826239E-09        3  36  25  23  # A0-h0-Z eff. coupling^2, normalised to SM
    0.00000000E+00        3  35  35  23  # H0-H0-Z eff. coupling^2, normalised to SM
    9.99999992E-01        3  36  35  23  # A0-H0-Z eff. coupling^2, normalised to SM
    0.00000000E+00        3  36  36  23  # A0-A0-Z eff. coupling^2, normalised to SM
#
    0.00000000E+00        4  25  21  21  23  # h0-g-g-Z eff. coupling^2, normalised to SM
    0.00000000E+00        4  35  21  21  23  # H0-g-g-Z eff. coupling^2, normalised to SM
    0.00000000E+00        4  36  21  21  23  # A0-g-g-Z eff. coupling^2, normalised to SM
#
#
#
#                             =================
#                             |The decay table|
#                             =================
#
# - The QCD corrections to the decays gluino -> squark  + quark
#                                     squark -> gaugino + quark_prime
#                                     squark -> squark_prime + Higgs
#                                     squark -> gluino  + quark
#   are included.
#
# - The multi-body decays for the inos, stops and sbottoms are included.
#
# - The loop induced decays for the gluino, neutralinos and stops
#   are included.
#
# - The SUSY decays of the top quark are included.
#
#
#         PDG            Width
DECAY         6     1.44549852E+00   # top decays
#          BR         NDA      ID1       ID2
     1.00000000E+00    2           5        24   # BR(t ->  b    W+)
#
#         PDG            Width
DECAY   1000021     1.40168759E+02   # gluino decays
#          BR         NDA      ID1       ID2
     6.86631898E-02    2     1000001        -1   # BR(~g -> ~d_L  db)
     6.86631898E-02    2    -1000001         1   # BR(~g -> ~d_L* d )
     8.29430449E-02    2     2000001        -1   # BR(~g -> ~d_R  db)
     8.29430449E-02    2    -2000001         1   # BR(~g -> ~d_R* d )
     6.90723626E-02    2     1000002        -2   # BR(~g -> ~u_L  ub)
     6.90723626E-02    2    -1000002         2   # BR(~g -> ~u_L* u )
     6.86631898E-02    2     1000003        -3   # BR(~g -> ~s_L  sb)
     6.86631898E-02    2    -1000003         3   # BR(~g -> ~s_L* s )
     8.29430449E-02    2     2000003        -3   # BR(~g -> ~s_R  sb)
     8.29430449E-02    2    -2000003         3   # BR(~g -> ~s_R* s )
     6.90723013E-02    2     1000004        -4   # BR(~g -> ~c_L  cb)
     6.90723013E-02    2    -1000004         4   # BR(~g -> ~c_L* c )
     5.86428665E-02    2     1000005        -5   # BR(~g -> ~b_1  bb)
     5.86428665E-02    2    -1000005         5   # BR(~g -> ~b_1* b )
#
#         PDG            Width
DECAY   1000006     1.39552500E+02   # stop1 decays
#          BR         NDA      ID1       ID2
     5.13780300E-03    2     1000022         6   # BR(~t_1 -> ~chi_10 t )
     5.13877422E-02    2     1000023         6   # BR(~t_1 -> ~chi_20 t )
     9.89025154E-02    2     1000025         6   # BR(~t_1 -> ~chi_30 t )
     7.41082374E-02    2     1000035         6   # BR(~t_1 -> ~chi_40 t )
     1.03712298E-02    2     1000024         5   # BR(~t_1 -> ~chi_1+ b )
     1.83314018E-01    2     1000037         5   # BR(~t_1 -> ~chi_2+ b )
     5.76708766E-01    2     1000021         6   # BR(~t_1 -> ~g      t )
     6.96888102E-05    2     1000005        24   # BR(~t_1 -> ~b_1    W+)
#
#         PDG            Width
DECAY   2000006     1.80914717E+02   # stop2 decays
#          BR         NDA      ID1       ID2
     6.62465857E-02    2     1000022         6   # BR(~t_2 -> ~chi_10 t )
     1.85799956E-02    2     1000023         6   # BR(~t_2 -> ~chi_20 t )
     8.78444900E-02    2     1000025         6   # BR(~t_2 -> ~chi_30 t )
     7.83367787E-02    2     1000035         6   # BR(~t_2 -> ~chi_40 t )
     1.33959214E-01    2     1000024         5   # BR(~t_2 -> ~chi_1+ b )
     2.45485296E-02    2     1000037         5   # BR(~t_2 -> ~chi_2+ b )
     5.59759356E-01    2     1000021         6   # BR(~t_2 -> ~g      t )
     1.31590113E-02    2     1000006        25   # BR(~t_2 -> ~t_1    h )
     1.52416108E-02    2     1000006        23   # BR(~t_2 -> ~t_1    Z )
     2.32442860E-03    2     1000005        24   # BR(~t_2 -> ~b_1    W+)
#
#         PDG            Width
DECAY   1000005     9.10490983E-03   # sbottom1 decays
#          BR         NDA      ID1       ID2
     3.78149858E-01    2     1000022         5   # BR(~b_1 -> ~chi_10 b )
     6.21850142E-01    2    -1000024         6   # BR(~b_1 -> ~chi_1- t )
#
#         PDG            Width
DECAY   2000005     1.83374257E+02   # sbottom2 decays
#          BR         NDA      ID1       ID2
     6.96100952E-02    2     1000022         5   # BR(~b_2 -> ~chi_10 b )
     2.73591899E-03    2     1000023         5   # BR(~b_2 -> ~chi_20 b )
     7.93695197E-03    2     1000025         5   # BR(~b_2 -> ~chi_30 b )
     7.40279318E-03    2     1000035         5   # BR(~b_2 -> ~chi_40 b )
     1.37712617E-01    2    -1000024         6   # BR(~b_2 -> ~chi_1- t )
     1.78118358E-01    2    -1000037         6   # BR(~b_2 -> ~chi_2- t )
     5.66497397E-01    2     1000021         5   # BR(~b_2 -> ~g      b )
     1.22682399E-03    2     1000005        25   # BR(~b_2 -> ~b_1    h )
     1.20329302E-03    2     1000005        23   # BR(~b_2 -> ~b_1    Z )
     2.75557513E-02    2     1000006       -24   # BR(~b_2 -> ~t_1    W-)
#
#         PDG            Width
DECAY   1000002     3.28693875E+00   # sup_L decays
#          BR         NDA      ID1       ID2
     3.32238239E-01    2     1000022         2   # BR(~u_L -> ~chi_10 u)
     6.67761761E-01    2     1000024         1   # BR(~u_L -> ~chi_1+ d)
#
#         PDG            Width
DECAY   2000002     1.10633542E+02   # sup_R decays
#          BR         NDA      ID1       ID2
     5.06251873E-07    2     1000022         2   # BR(~u_R -> ~chi_10 u)
     3.18930606E-02    2     1000023         2   # BR(~u_R -> ~chi_20 u)
     5.52536192E-06    2     1000025         2   # BR(~u_R -> ~chi_30 u)
     8.86849055E-03    2     1000035         2   # BR(~u_R -> ~chi_40 u)
     9.59232417E-01    2     1000021         2   # BR(~u_R -> ~g      u)
#
#         PDG            Width
DECAY   1000001     3.32389547E+00   # sdown_L decays
#          BR         NDA      ID1       ID2
     3.34839982E-01    2     1000022         1   # BR(~d_L -> ~chi_10 d)
     6.65160018E-01    2    -1000024         2   # BR(~d_L -> ~chi_1- u)
#
#         PDG            Width
DECAY   2000001     6.50775942E-07   # sdown_R decays
#           BR         NDA      ID1       ID2
     9.98694036E-01    2     1000022         1   # BR(~d_R -> ~chi_10 d)
#           BR         NDA      ID1       ID2       ID3
     5.36236787E-06    3        1       23        1000022   # BR(~d_R -> d  Z  ~chi_10)
     1.52110725E-04    3        1       25        1000022   # BR(~d_R -> d  h  ~chi_10)
     6.12007873E-04    3        1       -24        1000024   # BR(~d_R -> d  W-  ~chi_1+)
     5.36482647E-04    3        1       24        -1000024   # BR(~d_R -> d  W+  ~chi_1-)
#
#         PDG            Width
DECAY   1000004     3.21660407E+00   # scharm_L decays
#          BR         NDA      ID1       ID2
     3.32236027E-01    2     1000022         4   # BR(~c_L -> ~chi_10 c)
     6.67763973E-01    2     1000024         3   # BR(~c_L -> ~chi_1+ s)
#
#         PDG            Width
DECAY   2000004     7.69808239E+01   # scharm_R decays
#          BR         NDA      ID1       ID2
     7.55711461E-07    2     1000022         4   # BR(~c_R -> ~chi_10 c)
     4.74668859E-02    2     1000023         4   # BR(~c_R -> ~chi_20 c)
     8.22035249E-06    2     1000025         4   # BR(~c_R -> ~chi_30 c)
     1.31924666E-02    2     1000035         4   # BR(~c_R -> ~chi_40 c)
     9.39331671E-01    2     1000021         4   # BR(~c_R -> ~g      c)
#
#         PDG            Width
DECAY   1000003     3.25383552E+00   # sstrange_L decays
#          BR         NDA      ID1       ID2
     3.34845791E-01    2     1000022         3   # BR(~s_L -> ~chi_10 s)
     6.65154209E-01    2    -1000024         4   # BR(~s_L -> ~chi_1- c)
#
#         PDG            Width
DECAY   2000003     6.27338716E-07   # sstrange_R decays
#           BR         NDA      ID1       ID2
     9.98646942E-01    2     1000022         3   # BR(~s_R -> ~chi_10 s)
#           BR         NDA      ID1       ID2       ID3
     5.56716796E-06    3        3       23        1000022   # BR(~s_R -> s  Z  ~chi_10)
     1.57638924E-04    3        3       25        1000022   # BR(~s_R -> s  h  ~chi_10)
     6.33947802E-04    3        3       -24        1000024   # BR(~s_R -> s  W-  ~chi_1+)
     5.55903839E-04    3        3       24        -1000024   # BR(~s_R -> s  W+  ~chi_1-)
#
#         PDG            Width
DECAY   1000011     4.96279005E+01   # selectron_L decays
#          BR         NDA      ID1       ID2
     3.02261100E-01    2     1000022        11   # BR(~e_L -> ~chi_10 e-)
     7.73550492E-02    2     1000023        11   # BR(~e_L -> ~chi_20 e-)
     1.15161184E-04    2     1000025        11   # BR(~e_L -> ~chi_30 e-)
     1.01199186E-02    2     1000035        11   # BR(~e_L -> ~chi_40 e-)
     6.03796839E-01    2    -1000024        12   # BR(~e_L -> ~chi_1- nu_e)
     6.35193239E-03    2    -1000037        12   # BR(~e_L -> ~chi_2- nu_e)
#
#         PDG            Width
DECAY   2000011     5.76147582E+00   # selectron_R decays
#          BR         NDA      ID1       ID2
     1.63222446E-05    2     1000022        11   # BR(~e_R -> ~chi_10 e-)
     7.92757372E-01    2     1000023        11   # BR(~e_R -> ~chi_20 e-)
     1.31057743E-04    2     1000025        11   # BR(~e_R -> ~chi_30 e-)
     2.07095248E-01    2     1000035        11   # BR(~e_R -> ~chi_40 e-)
#
#         PDG            Width
DECAY   1000013     4.96279005E+01   # smuon_L decays
#          BR         NDA      ID1       ID2
     3.02261100E-01    2     1000022        13   # BR(~mu_L -> ~chi_10 mu-)
     7.73550491E-02    2     1000023        13   # BR(~mu_L -> ~chi_20 mu-)
     1.15161184E-04    2     1000025        13   # BR(~mu_L -> ~chi_30 mu-)
     1.01199186E-02    2     1000035        13   # BR(~mu_L -> ~chi_40 mu-)
     6.03796839E-01    2    -1000024        14   # BR(~mu_L -> ~chi_1- nu_mu)
     6.35193239E-03    2    -1000037        14   # BR(~mu_L -> ~chi_2- nu_mu)
#
#         PDG            Width
DECAY   2000013     5.76147577E+00   # smuon_R decays
#          BR         NDA      ID1       ID2
     1.63222446E-05    2     1000022        13   # BR(~mu_R -> ~chi_10 mu-)
     7.92757372E-01    2     1000023        13   # BR(~mu_R -> ~chi_20 mu-)
     1.31057743E-04    2     1000025        13   # BR(~mu_R -> ~chi_30 mu-)
     2.07095248E-01    2     1000035        13   # BR(~mu_R -> ~chi_40 mu-)
#
#         PDG            Width
DECAY   1000015     3.86586575E+01   # stau_1 decays
#          BR         NDA      ID1       ID2
     2.93393664E-01    2     1000022        15   # BR(~tau_1 -> ~chi_10  tau-)
     7.32824185E-02    2     1000023        15   # BR(~tau_1 -> ~chi_20  tau-)
     2.07844906E-02    2     1000025        15   # BR(~tau_1 -> ~chi_30  tau-)
     2.27846329E-02    2     1000035        15   # BR(~tau_1 -> ~chi_40  tau-)
     5.85357338E-01    2    -1000024        16   # BR(~tau_1 -> ~chi_1-  nu_tau)
     4.39745625E-03    2    -1000037        16   # BR(~tau_1 -> ~chi_2-  nu_tau)
#
#         PDG            Width
DECAY   2000015     1.62484212E+01   # stau_2 decays
#          BR         NDA      ID1       ID2
     3.92885562E-06    2     1000022        15   # BR(~tau_2 -> ~chi_10  tau-)
     6.12204133E-01    2     1000023        15   # BR(~tau_2 -> ~chi_20  tau-)
     5.62059016E-02    2     1000025        15   # BR(~tau_2 -> ~chi_30  tau-)
     2.14716378E-01    2     1000035        15   # BR(~tau_2 -> ~chi_40  tau-)
     8.90480683E-08    2    -1000024        16   # BR(~tau_2 -> ~chi_1-  nu_tau)
     1.12567111E-01    2    -1000037        16   # BR(~tau_2 -> ~chi_2-  nu_tau)
     2.16564520E-03    2     1000016       -24   # BR(~tau_2 -> ~nu_tauL W-)
     1.13253602E-03    2     1000015        25   # BR(~tau_2 -> ~tau_1   h)
     1.00427813E-03    2     1000015        23   # BR(~tau_2 -> ~tau_1   Z)
#
#         PDG            Width
DECAY   1000012     4.96428101E+01   # snu_eL decays
#          BR         NDA      ID1       ID2
     3.04176005E-01    2     1000022        12   # BR(~nu_eL -> ~chi_10 nu_e)
     5.47582935E-02    2     1000023        12   # BR(~nu_eL -> ~chi_20 nu_e)
     3.07643346E-04    2     1000025        12   # BR(~nu_eL -> ~chi_30 nu_e)
     3.00403584E-02    2     1000035        12   # BR(~nu_eL -> ~chi_40 nu_e)
     6.09126626E-01    2     1000024        11   # BR(~nu_eL -> ~chi_1+ e-)
     1.59107384E-03    2     1000037        11   # BR(~nu_eL -> ~chi_2+ e-)
#
#         PDG            Width
DECAY   1000014     4.96428100E+01   # snu_muL decays
#          BR         NDA      ID1       ID2
     3.04176005E-01    2     1000022        14   # BR(~nu_muL -> ~chi_10 nu_mu)
     5.47582935E-02    2     1000023        14   # BR(~nu_muL -> ~chi_20 nu_mu)
     3.07643346E-04    2     1000025        14   # BR(~nu_muL -> ~chi_30 nu_mu)
     3.00403584E-02    2     1000035        14   # BR(~nu_muL -> ~chi_40 nu_mu)
     6.09126626E-01    2     1000024        13   # BR(~nu_muL -> ~chi_1+ mu-)
     1.59107384E-03    2     1000037        13   # BR(~nu_muL -> ~chi_2+ mu-)
#
#         PDG            Width
DECAY   1000016     3.86835417E+01   # snu_tauL decays
#          BR         NDA      ID1       ID2
     2.94402861E-01    2     1000022        16   # BR(~nu_tauL -> ~chi_10 nu_tau)
     4.73063969E-02    2     1000023        16   # BR(~nu_tauL -> ~chi_20 nu_tau)
     2.60992838E-04    2     1000025        16   # BR(~nu_tauL -> ~chi_30 nu_tau)
     2.53348287E-02    2     1000035        16   # BR(~nu_tauL -> ~chi_40 nu_tau)
     5.90243915E-01    2     1000024        15   # BR(~nu_tauL -> ~chi_1+ tau-)
     4.24510048E-02    2     1000037        15   # BR(~nu_tauL -> ~chi_2+ tau-)
#
#         PDG            Width
DECAY   1000024     5.53253120E-15   # chargino1+ decays
#           BR         NDA      ID1       ID2       ID3
     1.95362600E-02    3     1000022       -11        12   # BR(~chi_1+ -> ~chi_10 e+   nu_e)
     3.30619710E-03    3     1000022       -13        14   # BR(~chi_1+ -> ~chi_10 mu+  nu_mu)
     9.77157540E-01    2     1000022       211             # BR(~chi_1+ -> ~chi_10 pi+)
#
#         PDG            Width
DECAY   1000037     7.98538367E+00   # chargino2+ decays
#          BR         NDA      ID1       ID2
     1.70220962E-03    2     1000002        -1   # BR(~chi_2+ -> ~u_L     db)
     6.69467736E-03    2    -1000001         2   # BR(~chi_2+ -> ~d_L*    u )
     1.70220905E-03    2     1000004        -3   # BR(~chi_2+ -> ~c_L     sb)
     6.69464088E-03    2    -1000003         4   # BR(~chi_2+ -> ~s_L*     c )
     4.62386519E-02    2    -1000005         6   # BR(~chi_2+ -> ~b_1*    t )
     3.12851366E-01    2     1000024        23   # BR(~chi_2+ -> ~chi_1+  Z )
     3.04574365E-01    2     1000022        24   # BR(~chi_2+ -> ~chi_10  W+)
     3.19541881E-01    2     1000024        25   # BR(~chi_2+ -> ~chi_1+  h )
#
#         PDG            Width
DECAY   1000022     0.00000000E+00   # neutralino1 decays
#
#         PDG            Width
DECAY   1000023     3.62283686E+00   # neutralino2 decays
#          BR         NDA      ID1       ID2
     1.43706021E-02    2     1000022        23   # BR(~chi_20 -> ~chi_10   Z )
     1.53560776E-01    2     1000024       -24   # BR(~chi_20 -> ~chi_1+   W-)
     1.53560776E-01    2    -1000024        24   # BR(~chi_20 -> ~chi_1-   W+)
     1.49909448E-01    2     1000022        25   # BR(~chi_20 -> ~chi_10   h )
     2.02502204E-02    2     1000002        -2   # BR(~chi_20 -> ~u_L      ub)
     2.02502204E-02    2    -1000002         2   # BR(~chi_20 -> ~u_L*     u )
     6.92309628E-03    2     1000001        -1   # BR(~chi_20 -> ~d_L      db)
     6.92309628E-03    2    -1000001         1   # BR(~chi_20 -> ~d_L*     d )
     8.45296911E-02    2     2000001        -1   # BR(~chi_20 -> ~d_R      db)
     8.45296911E-02    2    -2000001         1   # BR(~chi_20 -> ~d_R*     d )
     2.02500538E-02    2     1000004        -4   # BR(~chi_20 -> ~c_L      cb)
     2.02500538E-02    2    -1000004         4   # BR(~chi_20 -> ~c_L*     c )
     6.92309628E-03    2     1000003        -3   # BR(~chi_20 -> ~s _L      sb)
     6.92309628E-03    2    -1000003         3   # BR(~chi_20 -> ~s _L*     s )
     8.45296911E-02    2     2000003        -3   # BR(~chi_20 -> ~s _R      sb)
     8.45296911E-02    2    -2000003         3   # BR(~chi_20 -> ~s _R*     s )
     4.08933499E-02    2     1000005        -5   # BR(~chi_20 -> ~b_1      bb)
     4.08933499E-02    2    -1000005         5   # BR(~chi_20 -> ~b_1*     b )
#
#         PDG            Width
DECAY   1000025     7.76325204E+00   # neutralino3 decays
#          BR         NDA      ID1       ID2
     2.88366857E-01    2     1000022        23   # BR(~chi_30 -> ~chi_10   Z )
     3.12361756E-01    2     1000024       -24   # BR(~chi_30 -> ~chi_1+   W-)
     3.12361756E-01    2    -1000024        24   # BR(~chi_30 -> ~chi_1-   W+)
     3.20574861E-02    2     1000022        25   # BR(~chi_30 -> ~chi_10   h )
     1.82455312E-04    2     1000002        -2   # BR(~chi_30 -> ~u_L      ub)
     1.82455312E-04    2    -1000002         2   # BR(~chi_30 -> ~u_L*     u )
     2.48164846E-04    2     1000001        -1   # BR(~chi_30 -> ~d_L      db)
     2.48164846E-04    2    -1000001         1   # BR(~chi_30 -> ~d_L*     d )
     8.45653159E-06    2     2000001        -1   # BR(~chi_30 -> ~d_R      db)
     8.45653159E-06    2    -2000001         1   # BR(~chi_30 -> ~d_R*     d )
     1.82454311E-04    2     1000004        -4   # BR(~chi_30 -> ~c_L      cb)
     1.82454311E-04    2    -1000004         4   # BR(~chi_30 -> ~c_L*     c )
     2.48164846E-04    2     1000003        -3   # BR(~chi_30 -> ~s _L      sb)
     2.48164846E-04    2    -1000003         3   # BR(~chi_30 -> ~s _L*     s )
     8.45653159E-06    2     2000003        -3   # BR(~chi_30 -> ~s _R      sb)
     8.45653159E-06    2    -2000003         3   # BR(~chi_30 -> ~s _R*     s )
     2.65479200E-02    2     1000005        -5   # BR(~chi_30 -> ~b_1      bb)
     2.65479200E-02    2    -1000005         5   # BR(~chi_30 -> ~b_1*     b )
#
#         PDG            Width
DECAY   1000035     6.83922192E+00   # neutralino4 decays
#          BR         NDA      ID1       ID2
     2.97609855E-02    2     1000022        23   # BR(~chi_40 -> ~chi_10   Z )
     2.73342632E-01    2     1000024       -24   # BR(~chi_40 -> ~chi_1+   W-)
     2.73342632E-01    2    -1000024        24   # BR(~chi_40 -> ~chi_1-   W+)
     2.58711959E-01    2     1000022        25   # BR(~chi_40 -> ~chi_10   h )
     1.13478542E-04    2     1000002        -2   # BR(~chi_40 -> ~u_L      ub)
     1.13478542E-04    2    -1000002         2   # BR(~chi_40 -> ~u_L*     u )
     8.77125977E-03    2     1000001        -1   # BR(~chi_40 -> ~d_L      db)
     8.77125977E-03    2    -1000001         1   # BR(~chi_40 -> ~d_L*     d )
     1.63770438E-02    2     2000001        -1   # BR(~chi_40 -> ~d_R      db)
     1.63770438E-02    2    -2000001         1   # BR(~chi_40 -> ~d_R*     d )
     1.13477987E-04    2     1000004        -4   # BR(~chi_40 -> ~c_L      cb)
     1.13477987E-04    2    -1000004         4   # BR(~chi_40 -> ~c_L*     c )
     8.77125977E-03    2     1000003        -3   # BR(~chi_40 -> ~s _L      sb)
     8.77125977E-03    2    -1000003         3   # BR(~chi_40 -> ~s _L*     s )
     1.63770438E-02    2     2000003        -3   # BR(~chi_40 -> ~s _R      sb)
     1.63770438E-02    2    -2000003         3   # BR(~chi_40 -> ~s _R*     s )
     3.18973319E-02    2     1000005        -5   # BR(~chi_40 -> ~b_1      bb)
     3.18973319E-02    2    -1000005         5   # BR(~chi_40 -> ~b_1*     b )
#
#         PDG            Width
DECAY        25     4.16421866E-03   # h decays
#          BR         NDA      ID1       ID2
     6.25874539E-01    2           5        -5   # BR(h -> b       bb     )
     6.20204118E-02    2         -15        15   # BR(h -> tau+    tau-   )
     2.19533568E-04    2         -13        13   # BR(h -> mu+     mu-    )
     2.39700112E-04    2           3        -3   # BR(h -> s       sb     )
     2.07406314E-02    2           4        -4   # BR(h -> c       cb     )
     7.56850958E-02    2          21        21   # BR(h -> g       g      )
     2.21611877E-03    2          22        22   # BR(h -> gam     gam    )
     1.41434253E-03    2          22        23   # BR(h -> Z       gam    )
     1.88365917E-01    2          24       -24   # BR(h -> W+      W-     )
     2.32237099E-02    2          23        23   # BR(h -> Z       Z      )
#
#         PDG            Width
DECAY        35     5.10509381E+01   # H decays
#          BR         NDA      ID1       ID2
     2.63785002E-01    2           5        -5   # BR(H -> b       bb     )
     5.24042615E-02    2         -15        15   # BR(H -> tau+    tau-   )
     1.85967140E-04    2         -13        13   # BR(H -> mu+     mu-    )
     6.70249358E-05    2           3        -3   # BR(H -> s       sb     )
     7.55578683E-08    2           4        -4   # BR(H -> c       cb     )
     7.44837219E-03    2           6        -6   # BR(H -> t       tb     )
     1.60230206E-06    2          21        21   # BR(H -> g       g      )
     6.32730845E-08    2          22        22   # BR(H -> gam     gam    )
     2.28772763E-09    2          23        22   # BR(H -> Z       gam    )
     2.15819601E-06    2          24       -24   # BR(H -> W+      W-     )
     1.07710520E-06    2          23        23   # BR(H -> Z       Z      )
     8.80376295E-06    2          25        25   # BR(H -> h       h      )
     5.79013999E-03    2     1000024  -1000024   # BR(H -> ~chi_1+ ~chi_1-)
     4.80694480E-04    2     1000037  -1000037   # BR(H -> ~chi_2+ ~chi_2-)
     2.06825519E-01    2     1000024  -1000037   # BR(H -> ~chi_1+ ~chi_2-)
     2.06825519E-01    2     1000037  -1000024   # BR(H -> ~chi_2+ ~chi_1-)
     2.91379714E-03    2     1000022   1000022   # BR(H -> ~chi_10 ~chi_10)
     4.43239937E-03    2     1000023   1000023   # BR(H -> ~chi_20 ~chi_20)
     1.27914512E-04    2     1000025   1000025   # BR(H -> ~chi_30 ~chi_30)
     6.81239498E-03    2     1000035   1000035   # BR(H -> ~chi_40 ~chi_40)
     2.36321928E-02    2     1000022   1000023   # BR(H -> ~chi_10 ~chi_20)
     1.28629291E-01    2     1000022   1000025   # BR(H -> ~chi_10 ~chi_30)
     5.38028126E-02    2     1000022   1000035   # BR(H -> ~chi_10 ~chi_40)
     1.96616802E-02    2     1000023   1000025   # BR(H -> ~chi_20 ~chi_30)
     2.09407146E-03    2     1000023   1000035   # BR(H -> ~chi_20 ~chi_40)
     1.40566971E-02    2     1000025   1000035   # BR(H -> ~chi_30 ~chi_40)
     1.73621535E-06    2     1000002  -1000002   # BR(H -> ~u_L    ~u_L*  )
     1.73621535E-06    2     1000004  -1000004   # BR(H -> ~c_L    ~c_L*  )
     2.54553253E-06    2     1000001  -1000001   # BR(H -> ~d_L    ~d_L*  )
     8.09831822E-08    2     2000001  -2000001   # BR(H -> ~d_R    ~d_R*  )
     2.54553253E-06    2     1000003  -1000003   # BR(H -> ~s_L    ~s_L*  )
     8.09831822E-08    2     2000003  -2000003   # BR(H -> ~s_R    ~s_R*  )
     1.74027551E-06    2     1000005  -1000005   # BR(H -> ~b_1    ~b_1*  )
#
#         PDG            Width
DECAY        36     5.10470965E+01   # A decays
#          BR         NDA      ID1       ID2
     2.63829283E-01    2           5        -5   # BR(A -> b       bb     )
     5.24085878E-02    2         -15        15   # BR(A -> tau+    tau-   )
     1.85982303E-04    2         -13        13   # BR(A -> mu+     mu-    )
     6.70433199E-05    2           3        -3   # BR(A -> s       sb     )
     7.60081238E-08    2           4        -4   # BR(A -> c       cb     )
     7.46923374E-03    2           6        -6   # BR(A -> t       tb     )
     1.80721647E-05    2          21        21   # BR(A -> g       g      )
     1.04060602E-07    2          22        22   # BR(A -> gam     gam    )
     1.75017165E-08    2          23        22   # BR(A -> Z       gam    )
     2.18900612E-06    2          23        25   # BR(A -> Z       h      )
     7.23103055E-03    2     1000024  -1000024   # BR(A -> ~chi_1+ ~chi_1-)
     1.52729220E-03    2     1000037  -1000037   # BR(A -> ~chi_2+ ~chi_2-)
     2.05572715E-01    2     1000024  -1000037   # BR(A -> ~chi_1+ ~chi_2-)
     2.05572715E-01    2     1000037  -1000024   # BR(A -> ~chi_2+ ~chi_1-)
     3.64036263E-03    2     1000022   1000022   # BR(A -> ~chi_10 ~chi_10)
     1.01615898E-02    2     1000023   1000023   # BR(A -> ~chi_20 ~chi_20)
     2.15166444E-04    2     1000025   1000025   # BR(A -> ~chi_30 ~chi_30)
     1.80444252E-02    2     1000035   1000035   # BR(A -> ~chi_40 ~chi_40)
     3.74375737E-02    2     1000022   1000023   # BR(A -> ~chi_10 ~chi_20)
     7.82631121E-02    2     1000022   1000025   # BR(A -> ~chi_10 ~chi_30)
     8.95512464E-02    2     1000022   1000035   # BR(A -> ~chi_10 ~chi_40)
     7.97763433E-03    2     1000023   1000025   # BR(A -> ~chi_20 ~chi_30)
     5.21535056E-03    2     1000023   1000035   # BR(A -> ~chi_20 ~chi_40)
     5.60919805E-03    2     1000025   1000035   # BR(A -> ~chi_30 ~chi_40)
#
#         PDG            Width
DECAY        37     4.97268234E+01   # H+ decays
#          BR         NDA      ID1       ID2
     4.10824669E-04    2           4        -5   # BR(H+ -> c       bb     )
     5.38159939E-02    2         -15        16   # BR(H+ -> tau+    nu_tau )
     1.90976764E-04    2         -13        14   # BR(H+ -> mu+     nu_mu  )
     4.10824194E-06    2           2        -5   # BR(H+ -> u       bb     )
     3.44394677E-06    2           2        -3   # BR(H+ -> u       sb     )
     6.78621783E-05    2           4        -3   # BR(H+ -> c       sb     )
     2.51703715E-01    2           6        -5   # BR(H+ -> t       bb     )
     2.25013042E-06    2          24        25   # BR(H+ -> W+      h      )
     3.36437337E-14    2          24        36   # BR(H+ -> W+      A      )
     3.77002086E-08    2     1000024   1000022   # BR(H+ -> ~chi_1+ ~chi_10)
     6.45069430E-02    2     1000024   1000023   # BR(H+ -> ~chi_1+ ~chi_20)
     2.13455356E-01    2     1000024   1000025   # BR(H+ -> ~chi_1+ ~chi_30)
     1.51830049E-01    2     1000024   1000035   # BR(H+ -> ~chi_1+ ~chi_40)
     2.15427877E-01    2     1000037   1000022   # BR(H+ -> ~chi_2+ ~chi_10)
     3.49827021E-02    2     1000037   1000023   # BR(H+ -> ~chi_2+ ~chi_20)
     1.29449375E-03    2     1000037   1000025   # BR(H+ -> ~chi_2+ ~chi_30)
     1.22946697E-02    2     1000037   1000035   # BR(H+ -> ~chi_2+ ~chi_40)
     4.34823903E-06    2     1000002  -1000001   # BR(H+ -> ~u_L    ~d_L*  )
     4.34823903E-06    2     1000004  -1000003   # BR(H+ -> ~c_L    ~s_L*  )
