#
#                              ======================
#                              | THE SUSYHIT OUTPUT |
#                              ======================
#
#
#              ------------------------------------------------------
#              |     This is the output of the SUSY-HIT package     |
#              |  created by A.Djouadi, M.Muehlleitner and M.Spira. |
#              |  In case of problems with SUSY-HIT email to        |
#              |           margarete.muehlleitner@cern.ch           |
#              |           michael.spira@psi.ch                     |
#              |           abdelhak.djouadi@cern.ch                 |
#              ------------------------------------------------------
#
#              ------------------------------------------------------
#              |  SUSY Les Houches Accord - MSSM Spectrum + Decays  |
#              |              based on the decay programs           |
#              |                                                    |
#              |                     SDECAY 1.3b                    |
#              |                                                    |
#              |  Authors: M.Muhlleitner, A.Djouadi and Y.Mambrini  |
#              |  Ref.:    Comput.Phys.Commun.168(2005)46           |
#              |           [hep-ph/0311167]                         |
#              |                                                    |
#              |                     HDECAY 3.4                     |
#              |                                                    |
#              |  By: A.Djouadi,J.Kalinowski,M.Muhlleitner,M.Spira  |
#              |  Ref.:    Comput.Phys.Commun.108(1998)56           |
#              |           [hep-ph/9704448]                         |
#              |                                                    |
#              |                                                    |
#              |  If not stated otherwise all DRbar couplings and   |
#              |  soft SUSY breaking masses are given at the scale  |
#              |  Q=  0.18322010E+04
#              |                                                    |
#              ------------------------------------------------------
#
#
BLOCK DCINFO  # Decay Program information
     1   SDECAY/HDECAY # decay calculator
     2   1.3b  /3.4    # version number
#
BLOCK SPINFO  # Spectrum calculator information
     1     SOFTSUSY    # spectrum calculator               
     2     3.4.0       # version number                    
#
BLOCK MODSEL  # Model selection
     1     0   #  nonUniversal                                     
#
BLOCK SMINPUTS  # Standard Model inputs
         1     1.27908970E+02   # alpha_em^-1(M_Z)^MSbar
         2     1.16637870E-05   # G_F [GeV^-2]
         3     1.18400000E-01   # alpha_S(M_Z)^MSbar
         4     9.11876000E+01   # M_Z pole mass
         5     4.18000000E+00   # mb(mb)^MSbar
         6     1.73200000E+02   # mt pole mass
         7     1.77700000E+00   # mtau pole mass
#
BLOCK MINPAR  # Input parameters - minimal models
         3     1.61500000E+01   # tanb                
#
BLOCK EXTPAR  # Input parameters - non-minimal models
         0    -1.00000000E+00   # Set                 
         1    -4.41500000E+02   # M_1(MX)             
         2    -3.55554000E+03   # M_2(MX)             
         3     3.50709000E+03   # M_3(MX)             
        11     2.71062000E+03   # At(MX)              
        12    -1.69651000E+03   # Ab(MX)              
        13    -2.88840000E+03   # Atau(MX)            
        23    -9.95980000E+02   # mu(MX)              
        26     8.71680000E+02   # mA(pole)            
        31     2.07635000E+03   # meL(MX)             
        32     2.07635000E+03   # mmuL(MX)            
        33     3.44073000E+03   # mtauL(MX)           
        34     3.90508000E+03   # meR(MX)             
        35     3.90508000E+03   # mmuR(MX)            
        36     2.07816000E+03   # mtauR(MX)           
        41     8.49620000E+02   # mqL1(MX)            
        42     8.49620000E+02   # mqL2(MX)            
        43     1.52794000E+03   # mqL3(MX)            
        44     1.66184000E+03   # muR(MX)             
        45     1.66184000E+03   # mcR(MX)             
        46     2.19966000E+03   # mtR(MX)             
        47     6.50860000E+02   # mdR(MX)             
        48     6.50860000E+02   # msR(MX)             
        49     2.96382000E+03   # mbR(MX)             
#
BLOCK MASS  # Mass Spectrum
# PDG code           mass       particle
        24     8.04068320E+01   # W+
        25     1.24935920E+02   # h
        35     8.71726300E+02   # H
        36     8.71679844E+02   # A
        37     8.75075345E+02   # H+
         5     4.81876030E+00   # b-quark pole mass calculated from mb(mb)_Msbar
   1000001     8.05426761E+02   # ~d_L
   2000001     5.88483870E+02   # ~d_R
   1000002     8.01571697E+02   # ~u_L
   2000002     1.67597999E+03   # ~u_R
   1000003     8.05426761E+02   # ~s_L
   2000003     5.88483870E+02   # ~s_R
   1000004     8.01571697E+02   # ~c_L
   2000004     1.67597999E+03   # ~c_R
   1000005     1.52544440E+03   # ~b_1
   2000005     3.00724606E+03   # ~b_2
   1000006     1.50773086E+03   # ~t_1
   2000006     2.19217357E+03   # ~t_2
   1000011     2.07998038E+03   # ~e_L
   2000011     3.91128304E+03   # ~e_R
   1000012     2.07818269E+03   # ~nu_eL
   1000013     2.07998038E+03   # ~mu_L
   2000013     3.91128304E+03   # ~mu_R
   1000014     2.07818269E+03   # ~nu_muL
   1000015     2.08557694E+03   # ~tau_1
   2000015     3.44809655E+03   # ~tau_2
   1000016     3.44686496E+03   # ~nu_tauL
   1000021     3.44132170E+03   # ~g
   1000022    -4.38271466E+02   # ~chi_10
   1000023    -1.02262415E+03   # ~chi_20
   1000025     1.02378695E+03   # ~chi_30
   1000035    -3.51214247E+03   # ~chi_40
   1000024     1.02186593E+03   # ~chi_1+
   1000037     3.51230685E+03   # ~chi_2+
#
BLOCK NMIX  # Neutralino Mixing Matrix
  1  1     9.98151522E-01   # N_11
  1  2    -7.76108988E-04   # N_12
  1  3    -5.47005406E-02   # N_13
  1  4     2.64723971E-02   # N_14
  2  1     5.74091318E-02   # N_21
  2  2     2.40736149E-02   # N_22
  2  3     7.05654556E-01   # N_23
  2  4    -7.05816053E-01   # N_24
  3  1     1.99396479E-02   # N_31
  3  2    -1.16136094E-02   # N_32
  3  3     7.06386252E-01   # N_33
  3  4     7.07450349E-01   # N_34
  4  1    -3.75934107E-04   # N_41
  4  2     9.99642427E-01   # N_42
  4  3    -8.82957281E-03   # N_43
  4  4     2.52371655E-02   # N_44
#
BLOCK UMIX  # Chargino Mixing Matrix U
  1  1     1.26686309E-02   # U_11
  1  2     9.99919750E-01   # U_12
  2  1    -9.99919750E-01   # U_21
  2  2     1.26686309E-02   # U_22
#
BLOCK VMIX  # Chargino Mixing Matrix V
  1  1    -3.59963695E-02   # V_11
  1  2    -9.99351921E-01   # V_12
  2  1     9.99351921E-01   # V_21
  2  2    -3.59963695E-02   # V_22
#
BLOCK STOPMIX  # Stop Mixing Matrix
  1  1     9.86434210E-01   # cos(theta_t)
  1  2    -1.64157087E-01   # sin(theta_t)
  2  1     1.64157087E-01   # -sin(theta_t)
  2  2     9.86434210E-01   # cos(theta_t)
#
BLOCK SBOTMIX  # Sbottom Mixing Matrix
  1  1     9.99985830E-01   # cos(theta_b)
  1  2    -5.32351380E-03   # sin(theta_b)
  2  1     5.32351380E-03   # -sin(theta_b)
  2  2     9.99985830E-01   # cos(theta_b)
#
BLOCK STAUMIX  # Stau Mixing Matrix
  1  1    -3.06489755E-03   # cos(theta_tau)
  1  2     9.99995303E-01   # sin(theta_tau)
  2  1    -9.99995303E-01   # -sin(theta_tau)
  2  2    -3.06489755E-03   # cos(theta_tau)
#
BLOCK ALPHA  # Higgs mixing
          -6.61689426E-02   # Mixing angle in the neutral Higgs boson sector
#
BLOCK HMIX Q=  1.83220100E+03  # DRbar Higgs Parameters
         1    -1.01039953E+03   # mu(Q)MSSM           
         2     1.55177698E+01   # tan                 
         3     2.44054975E+02   # higgs               
         4     4.39199862E+05   # mA^2(Q)MSSM         
#
BLOCK GAUGE Q=  1.83220100E+03  # The gauge couplings
     1     3.63324686E-01   # gprime(Q) DRbar
     2     6.35761304E-01   # g(Q) DRbar
     3     1.02185294E+00   # g3(Q) DRbar
#
BLOCK AU Q=  1.83220100E+03  # The trilinear couplings
  1  1     0.00000000E+00   # A_u(Q) DRbar
  2  2     0.00000000E+00   # A_c(Q) DRbar
  3  3     2.71062001E+03   # A_t(Q) DRbar
#
BLOCK AD Q=  1.83220100E+03  # The trilinear couplings
  1  1     0.00000000E+00   # A_d(Q) DRbar
  2  2     0.00000000E+00   # A_s(Q) DRbar
  3  3    -1.69651000E+03   # A_b(Q) DRbar
#
BLOCK AE Q=  1.83220100E+03  # The trilinear couplings
  1  1     0.00000000E+00   # A_e(Q) DRbar
  2  2     0.00000000E+00   # A_mu(Q) DRbar
  3  3    -2.88840000E+03   # A_tau(Q) DRbar
#
BLOCK Yu Q=  1.83220100E+03  # The Yukawa couplings
  1  1     0.00000000E+00   # y_u(Q) DRbar
  2  2     0.00000000E+00   # y_c(Q) DRbar
  3  3     8.45286161E-01   # y_t(Q) DRbar
#
BLOCK Yd Q=  1.83220100E+03  # The Yukawa couplings
  1  1     0.00000000E+00   # y_d(Q) DRbar
  2  2     0.00000000E+00   # y_s(Q) DRbar
  3  3     2.32555773E-01   # y_b(Q) DRbar
#
BLOCK Ye Q=  1.83220100E+03  # The Yukawa couplings
  1  1     0.00000000E+00   # y_e(Q) DRbar
  2  2     0.00000000E+00   # y_mu(Q) DRbar
  3  3     1.61193844E-01   # y_tau(Q) DRbar
#
BLOCK MSOFT Q=  1.83220100E+03  # The soft SUSY breaking masses at the scale Q
         1    -4.41500000E+02   # M_1(Q)              
         2    -3.55554000E+03   # M_2(Q)              
         3     3.50709000E+03   # M_3(Q)              
        21    -2.28089619E+05   # mH1^2(Q)            
        22    -9.15694338E+05   # mH2^2(Q)            
        31     2.07635000E+03   # meL(Q)              
        32     2.07635000E+03   # mmuL(Q)             
        33     3.44073000E+03   # mtauL(Q)            
        34     3.90508000E+03   # meR(Q)              
        35     3.90508000E+03   # mmuR(Q)             
        36     2.07816000E+03   # mtauR(Q)            
        41     8.49619982E+02   # mqL1(Q)             
        42     8.49619982E+02   # mqL2(Q)             
        43     1.52793999E+03   # mqL3(Q)             
        44     1.66183999E+03   # muR(Q)              
        45     1.66183999E+03   # mcR(Q)              
        46     2.19965999E+03   # mtR(Q)              
        47     6.50859976E+02   # mdR(Q)              
        48     6.50859976E+02   # msR(Q)              
        49     2.96381999E+03   # mbR(Q)              
#
Block HiggsBoundsInputHiggsCouplingsFermions
# ScalarNormEffCoupSq PseudoSNormEffCoupSq NP   IP1 IP2 IP2
    1.05714092E+00    0.00000000E+00        3  25   5   5  # h0-b-b eff. coupling^2, normalised to SM
    2.40744039E+02    0.00000000E+00        3  35   5   5  # H0-b-b eff. coupling^2, normalised to SM
    0.00000000E+00    2.40801180E+02        3  36   5   5  # A0-b-b eff. coupling^2, normalised to SM
#
    9.99762705E-01    0.00000000E+00        3  25   6   6  # h0-t-t eff. coupling^2, normalised to SM
    4.39009859E-03    0.00000000E+00        3  35   6   6  # H0-t-t eff. coupling^2, normalised to SM
    0.00000000E+00    4.15280358E-03        3  36   6   6  # A0-t-t eff. coupling^2, normalised to SM
#
    1.05714092E+00    0.00000000E+00        3  25  15  15  # h0-tau-tau eff. coupling^2, normalised to SM
    2.40744039E+02    0.00000000E+00        3  35  15  15  # H0-tau-tau eff. coupling^2, normalised to SM
    0.00000000E+00    2.40801180E+02        3  36  15  15  # A0-tau-tau eff. coupling^2, normalised to SM
#
Block HiggsBoundsInputHiggsCouplingsBosons
    9.99996703E-01        3  25  24  24  # h0-W-W eff. coupling^2, normalised to SM
    3.29667709E-06        3  35  24  24  # H0-W-W eff. coupling^2, normalised to SM
    0.00000000E+00        3  36  24  24  # A0-W-W eff. coupling^2, normalised to SM
#
    9.99996703E-01        3  25  23  23  # h0-Z-Z eff. coupling^2, normalised to SM
    3.29667709E-06        3  35  23  23  # H0-Z-Z eff. coupling^2, normalised to SM
    0.00000000E+00        3  36  23  23  # A0-Z-Z eff. coupling^2, normalised to SM
#
    8.86838928E-01        3  25  21  21  # h0-g-g eff. coupling^2, normalised to SM
    4.76634825E-05        3  35  21  21  # H0-g-g eff. coupling^2, normalised to SM
    3.37468206E-04        3  36  21  21  # A0-g-g eff. coupling^2, normalised to SM
#
    0.00000000E+00        3  25  25  23  # h0-h0-Z eff. coupling^2, normalised to SM
    0.00000000E+00        3  35  25  23  # H0-h0-Z eff. coupling^2, normalised to SM
    3.29667709E-06        3  36  25  23  # A0-h0-Z eff. coupling^2, normalised to SM
    0.00000000E+00        3  35  35  23  # H0-H0-Z eff. coupling^2, normalised to SM
    9.99996703E-01        3  36  35  23  # A0-H0-Z eff. coupling^2, normalised to SM
    0.00000000E+00        3  36  36  23  # A0-A0-Z eff. coupling^2, normalised to SM
#
    0.00000000E+00        4  25  21  21  23  # h0-g-g-Z eff. coupling^2, normalised to SM
    0.00000000E+00        4  35  21  21  23  # H0-g-g-Z eff. coupling^2, normalised to SM
    0.00000000E+00        4  36  21  21  23  # A0-g-g-Z eff. coupling^2, normalised to SM
#
#
#
#                             =================
#                             |The decay table|
#                             =================
#
# - The QCD corrections to the decays gluino -> squark  + quark
#                                     squark -> gaugino + quark_prime
#                                     squark -> squark_prime + Higgs
#                                     squark -> gluino  + quark
#   are included.
#
# - The multi-body decays for the inos, stops and sbottoms are included.
#
# - The loop induced decays for the gluino, neutralinos and stops
#   are included.
#
# - The SUSY decays of the top quark are included.
#
#
#         PDG            Width
DECAY         6     1.42275784E+00   # top decays
#          BR         NDA      ID1       ID2
     1.00000000E+00    2           5        24   # BR(t ->  b    W+)
#
#         PDG            Width
DECAY   1000021     5.84048941E+02   # gluino decays
#          BR         NDA      ID1       ID2
     5.35473025E-02    2     1000001        -1   # BR(~g -> ~d_L  db)
     5.35473025E-02    2    -1000001         1   # BR(~g -> ~d_L* d )
     5.64794793E-02    2     2000001        -1   # BR(~g -> ~d_R  db)
     5.64794793E-02    2    -2000001         1   # BR(~g -> ~d_R* d )
     5.36065882E-02    2     1000002        -2   # BR(~g -> ~u_L  ub)
     5.36065882E-02    2    -1000002         2   # BR(~g -> ~u_L* u )
     3.48744958E-02    2     2000002        -2   # BR(~g -> ~u_R  ub)
     3.48744958E-02    2    -2000002         2   # BR(~g -> ~u_R* u )
     5.35473025E-02    2     1000003        -3   # BR(~g -> ~s_L  sb)
     5.35473025E-02    2    -1000003         3   # BR(~g -> ~s_L* s )
     5.64794793E-02    2     2000003        -3   # BR(~g -> ~s_R  sb)
     5.64794793E-02    2    -2000003         3   # BR(~g -> ~s_R* s )
     5.36065868E-02    2     1000004        -4   # BR(~g -> ~c_L  cb)
     5.36065868E-02    2    -1000004         4   # BR(~g -> ~c_L* c )
     3.48744895E-02    2     2000004        -4   # BR(~g -> ~c_R  cb)
     3.48744895E-02    2    -2000004         4   # BR(~g -> ~c_R* c )
     3.88051506E-02    2     1000005        -5   # BR(~g -> ~b_1  bb)
     3.88051506E-02    2    -1000005         5   # BR(~g -> ~b_1* b )
     3.43116743E-03    2     2000005        -5   # BR(~g -> ~b_2  bb)
     3.43116743E-03    2    -2000005         5   # BR(~g -> ~b_2* b )
     4.06294382E-02    2     1000006        -6   # BR(~g -> ~t_1  tb)
     4.06294382E-02    2    -1000006         6   # BR(~g -> ~t_1* t )
     2.01185199E-02    2     2000006        -6   # BR(~g -> ~t_2  tb)
     2.01185199E-02    2    -2000006         6   # BR(~g -> ~t_2* t )
#
#         PDG            Width
DECAY   1000006     6.65571707E+00   # stop1 decays
#          BR         NDA      ID1       ID2
     4.93729408E-02    2     1000022         6   # BR(~t_1 -> ~chi_10 t )
     3.77679947E-01    2     1000023         6   # BR(~t_1 -> ~chi_20 t )
     4.70171072E-01    2     1000025         6   # BR(~t_1 -> ~chi_30 t )
     1.02776040E-01    2     1000024         5   # BR(~t_1 -> ~chi_1+ b )
#
#         PDG            Width
DECAY   2000006     8.93678579E+01   # stop2 decays
#          BR         NDA      ID1       ID2
     4.96022089E-02    2     1000022         6   # BR(~t_2 -> ~chi_10 t )
     1.08323692E-01    2     1000023         6   # BR(~t_2 -> ~chi_20 t )
     1.00947056E-01    2     1000025         6   # BR(~t_2 -> ~chi_30 t )
     2.06204731E-01    2     1000024         5   # BR(~t_2 -> ~chi_1+ b )
     1.28863392E-01    2     1000006        25   # BR(~t_2 -> ~t_1    h )
     1.41088829E-01    2     1000006        23   # BR(~t_2 -> ~t_1    Z )
     2.64970091E-01    2     1000005        24   # BR(~t_2 -> ~b_1    W+)
#
#         PDG            Width
DECAY   1000005     6.67243668E+00   # sbottom1 decays
#          BR         NDA      ID1       ID2
     2.89372777E-02    2     1000022         5   # BR(~b_1 -> ~chi_10 b )
     3.71441269E-02    2     1000023         5   # BR(~b_1 -> ~chi_20 b )
     3.70880477E-02    2     1000025         5   # BR(~b_1 -> ~chi_30 b )
     8.96830548E-01    2    -1000024         6   # BR(~b_1 -> ~chi_1- t )
#
#         PDG            Width
DECAY   2000005     8.43728659E+00   # sbottom2 decays
#          BR         NDA      ID1       ID2
     1.99370965E-01    2     1000022         5   # BR(~b_2 -> ~chi_10 b )
     1.49944286E-01    2     1000023         5   # BR(~b_2 -> ~chi_20 b )
     1.49722188E-01    2     1000025         5   # BR(~b_2 -> ~chi_30 b )
     2.97957322E-01    2    -1000024         6   # BR(~b_2 -> ~chi_1- t )
     1.26107409E-02    2     1000005        25   # BR(~b_2 -> ~b_1    h )
     3.86897108E-02    2     1000005        35   # BR(~b_2 -> ~b_1    H )
     3.86195556E-02    2     1000005        36   # BR(~b_2 -> ~b_1    A )
     7.79224622E-02    2     1000006       -37   # BR(~b_2 -> ~t_1    H-)
     1.19261696E-02    2     1000005        23   # BR(~b_2 -> ~b_1    Z )
     2.30814208E-02    2     1000006       -24   # BR(~b_2 -> ~t_1    W-)
     1.55179920E-04    2     2000006       -24   # BR(~b_2 -> ~t_2    W-)
#
#         PDG            Width
DECAY   1000002     5.99442428E-02   # sup_L decays
#          BR         NDA      ID1       ID2
     1.00000000E+00    2     1000022         2   # BR(~u_L -> ~chi_10 u)
#
#         PDG            Width
DECAY   2000002     3.44489447E+00   # sup_R decays
#          BR         NDA      ID1       ID2
     9.98311111E-01    2     1000022         2   # BR(~u_R -> ~chi_10 u)
     1.50751633E-03    2     1000023         2   # BR(~u_R -> ~chi_20 u)
     1.81372924E-04    2     1000025         2   # BR(~u_R -> ~chi_30 u)
#
#         PDG            Width
DECAY   1000001     6.17075371E-02   # sdown_L decays
#          BR         NDA      ID1       ID2
     1.00000000E+00    2     1000022         1   # BR(~d_L -> ~chi_10 d)
#
#         PDG            Width
DECAY   2000001     7.31544919E-02   # sdown_R decays
#          BR         NDA      ID1       ID2
     1.00000000E+00    2     1000022         1   # BR(~d_R -> ~chi_10 d)
#
#         PDG            Width
DECAY   1000004     5.67960936E-02   # scharm_L decays
#          BR         NDA      ID1       ID2
     1.00000000E+00    2     1000022         4   # BR(~c_L -> ~chi_10 c)
#
#         PDG            Width
DECAY   2000004     3.38870294E+00   # scharm_R decays
#          BR         NDA      ID1       ID2
     9.98320407E-01    2     1000022         4   # BR(~c_R -> ~chi_10 c)
     1.49922200E-03    2     1000023         4   # BR(~c_R -> ~chi_20 c)
     1.80370665E-04    2     1000025         4   # BR(~c_R -> ~chi_30 c)
#
#         PDG            Width
DECAY   1000003     5.84830489E-02   # sstrange_L decays
#          BR         NDA      ID1       ID2
     1.00000000E+00    2     1000022         3   # BR(~s_L -> ~chi_10 s)
#
#         PDG            Width
DECAY   2000003     6.78644339E-02   # sstrange_R decays
#          BR         NDA      ID1       ID2
     1.00000000E+00    2     1000022         3   # BR(~s_R -> ~chi_10 s)
#
#         PDG            Width
DECAY   1000011     2.49517119E+00   # selectron_L decays
#          BR         NDA      ID1       ID2
     9.93145522E-01    2     1000022        11   # BR(~e_L -> ~chi_10 e-)
     6.23522253E-03    2     1000023        11   # BR(~e_L -> ~chi_20 e-)
     9.18753524E-08    2     1000025        11   # BR(~e_L -> ~chi_30 e-)
     6.19163679E-04    2    -1000024        12   # BR(~e_L -> ~chi_1- nu_e)
#
#         PDG            Width
DECAY   2000011     2.00224823E+01   # selectron_R decays
#          BR         NDA      ID1       ID2
     9.96711029E-01    2     1000022        11   # BR(~e_R -> ~chi_10 e-)
     2.93501775E-03    2     1000023        11   # BR(~e_R -> ~chi_20 e-)
     3.53947390E-04    2     1000025        11   # BR(~e_R -> ~chi_30 e-)
     5.43949042E-09    2     1000035        11   # BR(~e_R -> ~chi_40 e-)
#
#         PDG            Width
DECAY   1000013     2.49517117E+00   # smuon_L decays
#          BR         NDA      ID1       ID2
     9.93145522E-01    2     1000022        13   # BR(~mu_L -> ~chi_10 mu-)
     6.23522251E-03    2     1000023        13   # BR(~mu_L -> ~chi_20 mu-)
     9.18753521E-08    2     1000025        13   # BR(~mu_L -> ~chi_30 mu-)
     6.19163683E-04    2    -1000024        14   # BR(~mu_L -> ~chi_1- nu_mu)
#
#         PDG            Width
DECAY   2000013     2.00224823E+01   # smuon_R decays
#          BR         NDA      ID1       ID2
     9.96711029E-01    2     1000022        13   # BR(~mu_R -> ~chi_10 mu-)
     2.93501775E-03    2     1000023        13   # BR(~mu_R -> ~chi_20 mu-)
     3.53947389E-04    2     1000025        13   # BR(~mu_R -> ~chi_30 mu-)
     5.43949022E-09    2     1000035        13   # BR(~mu_R -> ~chi_40 mu-)
#
#         PDG            Width
DECAY   1000015     1.12398166E+01   # stau_1 decays
#          BR         NDA      ID1       ID2
     8.87405776E-01    2     1000022        15   # BR(~tau_1 -> ~chi_10  tau-)
     2.94190487E-02    2     1000023        15   # BR(~tau_1 -> ~chi_20  tau-)
     2.77761634E-02    2     1000025        15   # BR(~tau_1 -> ~chi_30  tau-)
     5.53990123E-02    2    -1000024        16   # BR(~tau_1 -> ~chi_1-  nu_tau)
#
#         PDG            Width
DECAY   2000015     6.56763641E+00   # stau_2 decays
#          BR         NDA      ID1       ID2
     6.63684039E-01    2     1000022        15   # BR(~tau_2 -> ~chi_10  tau-)
     1.18099898E-01    2     1000023        15   # BR(~tau_2 -> ~chi_20  tau-)
     1.12657988E-01    2     1000025        15   # BR(~tau_2 -> ~chi_30  tau-)
     4.96728972E-04    2    -1000024        16   # BR(~tau_2 -> ~chi_1-  nu_tau)
     4.81164817E-03    2     1000015        25   # BR(~tau_2 -> ~tau_1   h)
     4.77662170E-02    2     1000015        35   # BR(~tau_2 -> ~tau_1   H)
     4.77216795E-02    2     1000015        36   # BR(~tau_2 -> ~tau_1   A)
     4.76180080E-03    2     1000015        23   # BR(~tau_2 -> ~tau_1   Z)
#
#         PDG            Width
DECAY   1000012     2.50438887E+00   # snu_eL decays
#          BR         NDA      ID1       ID2
     9.93870230E-01    2     1000022        12   # BR(~nu_eL -> ~chi_10 nu_e)
     1.46193970E-04    2     1000023        12   # BR(~nu_eL -> ~chi_20 nu_e)
     1.01298367E-03    2     1000025        12   # BR(~nu_eL -> ~chi_30 nu_e)
     4.97059233E-03    2     1000024        11   # BR(~nu_eL -> ~chi_1+ e-)
#
#         PDG            Width
DECAY   1000014     2.50438887E+00   # snu_muL decays
#          BR         NDA      ID1       ID2
     9.93870230E-01    2     1000022        14   # BR(~nu_muL -> ~chi_10 nu_mu)
     1.46193970E-04    2     1000023        14   # BR(~nu_muL -> ~chi_20 nu_mu)
     1.01298367E-03    2     1000025        14   # BR(~nu_muL -> ~chi_30 nu_mu)
     4.97059228E-03    2     1000024        13   # BR(~nu_muL -> ~chi_1+ mu-)
#
#         PDG            Width
DECAY   1000016     6.58054678E+00   # snu_tauL decays
#          BR         NDA      ID1       ID2
     6.65072021E-01    2     1000022        16   # BR(~nu_tauL -> ~chi_10 nu_tau)
     1.33629030E-04    2     1000023        16   # BR(~nu_tauL -> ~chi_20 nu_tau)
     9.26861249E-04    2     1000025        16   # BR(~nu_tauL -> ~chi_30 nu_tau)
     2.29742506E-01    2     1000024        15   # BR(~nu_tauL -> ~chi_1+ tau-)
     9.49165475E-02    2    -1000015       -37   # BR(~nu_tauL -> ~tau_1+ H-)
     9.20843494E-03    2    -1000015       -24   # BR(~nu_tauL -> ~tau_1+ W-)
#
#         PDG            Width
DECAY   1000024     6.59298682E-01   # chargino1+ decays
#          BR         NDA      ID1       ID2
     3.78653838E-03    2     1000002        -1   # BR(~chi_1+ -> ~u_L     db)
     4.54839242E-04    2    -1000001         2   # BR(~chi_1+ -> ~d_L*    u )
     3.78653381E-03    2     1000004        -3   # BR(~chi_1+ -> ~c_L     sb)
     4.54830102E-04    2    -1000003         4   # BR(~chi_1+ -> ~s_L*     c )
     9.91517258E-01    2     1000022        24   # BR(~chi_1+ -> ~chi_10  W+)
#
#         PDG            Width
DECAY   1000037     2.77355981E+02   # chargino2+ decays
#          BR         NDA      ID1       ID2
     1.31397908E-01    2     1000002        -1   # BR(~chi_2+ -> ~u_L     db)
     1.31410274E-01    2    -1000001         2   # BR(~chi_2+ -> ~d_L*    u )
     1.31397907E-01    2     1000004        -3   # BR(~chi_2+ -> ~c_L     sb)
     1.31410271E-01    2    -1000003         4   # BR(~chi_2+ -> ~s_L*     c )
     9.72013108E-02    2     1000006        -5   # BR(~chi_2+ -> ~t_1     bb)
     2.54033419E-03    2     2000006        -5   # BR(~chi_2+ -> ~t_2     bb)
     9.94544722E-02    2    -1000005         6   # BR(~chi_2+ -> ~b_1*    t )
     1.00386466E-06    2    -2000005         6   # BR(~chi_2+ -> ~b_2*    t )
     2.14774902E-02    2     1000012       -11   # BR(~chi_2+ -> ~nu_eL   e+  )
     2.14774902E-02    2     1000014       -13   # BR(~chi_2+ -> ~nu_muL mu+ )
     6.92640561E-05    2     1000016       -15   # BR(~chi_2+ -> ~nu_tau1 tau+)
     2.14618280E-02    2    -1000011        12   # BR(~chi_2+ -> ~e_L+    nu_e)
     2.14618280E-02    2    -1000013        14   # BR(~chi_2+ -> ~mu_L+   nu_mu)
     4.63636452E-10    2    -1000015        16   # BR(~chi_2+ -> ~tau_1+  nu_tau)
     6.68169161E-05    2    -2000015        16   # BR(~chi_2+ -> ~tau_2+  nu_tau)
     2.79216139E-02    2     1000024        23   # BR(~chi_2+ -> ~chi_1+  Z )
     8.54112931E-06    2     1000022        24   # BR(~chi_2+ -> ~chi_10  W+)
     2.62134921E-02    2     1000023        24   # BR(~chi_2+ -> ~chi_20  W+)
     2.69875406E-02    2     1000025        24   # BR(~chi_2+ -> ~chi_30  W+)
     2.69356813E-02    2     1000024        25   # BR(~chi_2+ -> ~chi_1+  h )
     2.02318755E-02    2     1000024        35   # BR(~chi_2+ -> ~chi_1+  H )
     2.02945419E-02    2     1000024        36   # BR(~chi_2+ -> ~chi_1+  A )
     1.08561568E-04    2     1000022        37   # BR(~chi_2+ -> ~chi_10  H+)
     2.02301881E-02    2     1000023        37   # BR(~chi_2+ -> ~chi_20  H+)
     2.02397655E-02    2     1000025        37   # BR(~chi_2+ -> ~chi_30  H+)
#
#         PDG            Width
DECAY   1000022     0.00000000E+00   # neutralino1 decays
#
#         PDG            Width
DECAY   1000023     6.95171319E-01   # neutralino2 decays
#          BR         NDA      ID1       ID2
     1.09618631E-01    2     1000022        23   # BR(~chi_20 -> ~chi_10   Z )
     8.74685241E-01    2     1000022        25   # BR(~chi_20 -> ~chi_10   h )
     1.70765564E-03    2     1000002        -2   # BR(~chi_20 -> ~u_L      ub)
     1.70765564E-03    2    -1000002         2   # BR(~chi_20 -> ~u_L*     u )
     2.33227090E-04    2     1000001        -1   # BR(~chi_20 -> ~d_L      db)
     2.33227090E-04    2    -1000001         1   # BR(~chi_20 -> ~d_L*     d )
     1.98316560E-03    2     2000001        -1   # BR(~chi_20 -> ~d_R      db)
     1.98316560E-03    2    -2000001         1   # BR(~chi_20 -> ~d_R*     d )
     1.70762293E-03    2     1000004        -4   # BR(~chi_20 -> ~c_L      cb)
     1.70762293E-03    2    -1000004         4   # BR(~chi_20 -> ~c_L*     c )
     2.33227090E-04    2     1000003        -3   # BR(~chi_20 -> ~s _L      sb)
     2.33227090E-04    2    -1000003         3   # BR(~chi_20 -> ~s _L*     s )
     1.98316560E-03    2     2000003        -3   # BR(~chi_20 -> ~s _R      sb)
     1.98316560E-03    2    -2000003         3   # BR(~chi_20 -> ~s _R*     s )
#
#         PDG            Width
DECAY   1000025     6.72713967E-01   # neutralino3 decays
#          BR         NDA      ID1       ID2
     8.89264567E-01    2     1000022        23   # BR(~chi_30 -> ~chi_10   Z )
     1.08050667E-01    2     1000022        25   # BR(~chi_30 -> ~chi_10   h )
     8.86623527E-05    2     1000002        -2   # BR(~chi_30 -> ~u_L      ub)
     8.86623527E-05    2    -1000002         2   # BR(~chi_30 -> ~u_L*     u )
     3.34483171E-04    2     1000001        -1   # BR(~chi_30 -> ~d_L      db)
     3.34483171E-04    2    -1000001         1   # BR(~chi_30 -> ~d_L*     d )
     2.48046888E-04    2     2000001        -1   # BR(~chi_30 -> ~d_R      db)
     2.48046888E-04    2    -2000001         1   # BR(~chi_30 -> ~d_R*     d )
     8.86606740E-05    2     1000004        -4   # BR(~chi_30 -> ~c_L      cb)
     8.86606740E-05    2    -1000004         4   # BR(~chi_30 -> ~c_L*     c )
     3.34483171E-04    2     1000003        -3   # BR(~chi_30 -> ~s _L      sb)
     3.34483171E-04    2    -1000003         3   # BR(~chi_30 -> ~s _L*     s )
     2.48046888E-04    2     2000003        -3   # BR(~chi_30 -> ~s _R      sb)
     2.48046888E-04    2    -2000003         3   # BR(~chi_30 -> ~s _R*     s )
#
#         PDG            Width
DECAY   1000035     2.77742652E+02   # neutralino4 decays
#          BR         NDA      ID1       ID2
     1.63611802E-06    2     1000022        23   # BR(~chi_40 -> ~chi_10   Z )
     5.15185409E-03    2     1000023        23   # BR(~chi_40 -> ~chi_20   Z )
     2.22127555E-02    2     1000025        23   # BR(~chi_40 -> ~chi_30   Z )
     2.75543229E-02    2     1000024       -24   # BR(~chi_40 -> ~chi_1+   W-)
     2.75543229E-02    2    -1000024        24   # BR(~chi_40 -> ~chi_1-   W+)
     7.40340222E-06    2     1000022        25   # BR(~chi_40 -> ~chi_10   h )
     6.69303916E-05    2     1000022        35   # BR(~chi_40 -> ~chi_10   H )
     4.17500353E-05    2     1000022        36   # BR(~chi_40 -> ~chi_10   A )
     2.18259083E-02    2     1000023        25   # BR(~chi_40 -> ~chi_20   h )
     1.48394973E-02    2     1000023        35   # BR(~chi_40 -> ~chi_20   H )
     5.29718602E-03    2     1000023        36   # BR(~chi_40 -> ~chi_20   A )
     5.04216089E-03    2     1000025        25   # BR(~chi_40 -> ~chi_30   h )
     5.31978125E-03    2     1000025        35   # BR(~chi_40 -> ~chi_30   H )
     1.49415707E-02    2     1000025        36   # BR(~chi_40 -> ~chi_30   A )
     2.02404745E-02    2     1000024       -37   # BR(~chi_40 -> ~chi_1+   H-)
     2.02404745E-02    2    -1000024        37   # BR(~chi_40 -> ~chi_1-   H+)
     6.56329401E-02    2     1000002        -2   # BR(~chi_40 -> ~u_L      ub)
     6.56329401E-02    2    -1000002         2   # BR(~chi_40 -> ~u_L*     u )
     3.59481311E-09    2     2000002        -2   # BR(~chi_40 -> ~u_R      ub)
     3.59481311E-09    2    -2000002         2   # BR(~chi_40 -> ~u_R*     u )
     6.55833722E-02    2     1000001        -1   # BR(~chi_40 -> ~d_L      db)
     6.55833722E-02    2    -1000001         1   # BR(~chi_40 -> ~d_L*     d )
     1.41523115E-09    2     2000001        -1   # BR(~chi_40 -> ~d_R      db)
     1.41523115E-09    2    -2000001         1   # BR(~chi_40 -> ~d_R*     d )
     6.56329385E-02    2     1000004        -4   # BR(~chi_40 -> ~c_L      cb)
     6.56329385E-02    2    -1000004         4   # BR(~chi_40 -> ~c_L*     c )
     3.59481252E-09    2     2000004        -4   # BR(~chi_40 -> ~c_R      cb)
     3.59481252E-09    2    -2000004         4   # BR(~chi_40 -> ~c_R*     c )
     6.55833722E-02    2     1000003        -3   # BR(~chi_40 -> ~s _L      sb)
     6.55833722E-02    2    -1000003         3   # BR(~chi_40 -> ~s _L*     s )
     1.41523115E-09    2     2000003        -3   # BR(~chi_40 -> ~s _R      sb)
     1.41523115E-09    2    -2000003         3   # BR(~chi_40 -> ~s _R*     s )
     4.80428780E-02    2     1000006        -6   # BR(~chi_40 -> ~t_1      tb)
     4.80428780E-02    2    -1000006         6   # BR(~chi_40 -> ~t_1*     t )
     1.24367623E-03    2     2000006        -6   # BR(~chi_40 -> ~t_2      tb)
     1.24367623E-03    2    -2000006         6   # BR(~chi_40 -> ~t_2*     t )
     5.01698494E-02    2     1000005        -5   # BR(~chi_40 -> ~b_1      bb)
     5.01698494E-02    2    -1000005         5   # BR(~chi_40 -> ~b_1*     b )
     5.31063104E-07    2     2000005        -5   # BR(~chi_40 -> ~b_2      bb)
     5.31063104E-07    2    -2000005         5   # BR(~chi_40 -> ~b_2*     b )
     1.07038448E-02    2     1000011       -11   # BR(~chi_40 -> ~e_L-     e+)
     1.07038448E-02    2    -1000011        11   # BR(~chi_40 -> ~e_L+     e-)
     1.07038448E-02    2     1000013       -13   # BR(~chi_40 -> ~mu_L-    mu+)
     1.07038448E-02    2    -1000013        13   # BR(~chi_40 -> ~mu_L+    mu-)
     1.99029286E-09    2     1000015       -15   # BR(~chi_40 -> ~tau_1-   tau+)
     1.99029286E-09    2    -1000015        15   # BR(~chi_40 -> ~tau_1+   tau-)
     3.31436826E-05    2     2000015       -15   # BR(~chi_40 -> ~tau_2-   tau+)
     3.31436826E-05    2    -2000015        15   # BR(~chi_40 -> ~tau_2+   tau-)
     1.07330580E-02    2     1000012       -12   # BR(~chi_40 -> ~nu_eL    nu_eb)
     1.07330580E-02    2    -1000012        12   # BR(~chi_40 -> ~nu_eL*   nu_e )
     1.07330580E-02    2     1000014       -14   # BR(~chi_40 -> ~nu_muL   nu_mub)
     1.07330580E-02    2    -1000014        14   # BR(~chi_40 -> ~nu_muL*  nu_mu )
     3.44664979E-05    2     1000016       -16   # BR(~chi_40 -> ~nu_tau1  nu_taub)
     3.44664979E-05    2    -1000016        16   # BR(~chi_40 -> ~nu_tau1* nu_tau )
#
#         PDG            Width
DECAY        25     4.04795434E-03   # h decays
#          BR         NDA      ID1       ID2
     5.96754386E-01    2           5        -5   # BR(h -> b       bb     )
     6.74930507E-02    2         -15        15   # BR(h -> tau+    tau-   )
     2.38839820E-04    2         -13        13   # BR(h -> mu+     mu-    )
     2.64174018E-04    2           3        -3   # BR(h -> s       sb     )
     2.14116514E-02    2           4        -4   # BR(h -> c       cb     )
     7.86163121E-02    2          21        21   # BR(h -> g       g      )
     2.32448579E-03    2          22        22   # BR(h -> gam     gam    )
     1.53514969E-03    2          22        23   # BR(h -> Z       gam    )
     2.05653438E-01    2          24       -24   # BR(h -> W+      W-     )
     2.57085123E-02    2          23        23   # BR(h -> Z       Z      )
#
#         PDG            Width
DECAY        35     3.96463467E+00   # H decays
#          BR         NDA      ID1       ID2
     8.51426099E-01    2           5        -5   # BR(H -> b       bb     )
     1.07064938E-01    2         -15        15   # BR(H -> tau+    tau-   )
     3.74959809E-04    2         -13        13   # BR(H -> mu+     mu-    )
     4.43865947E-04    2           3        -3   # BR(H -> s       sb     )
     4.73184651E-07    2           4        -4   # BR(H -> c       cb     )
     3.96786646E-02    2           6        -6   # BR(H -> t       tb     )
     1.14487896E-04    2          21        21   # BR(H -> g       g      )
     1.85701300E-07    2          22        22   # BR(H -> gam     gam    )
     7.68542612E-08    2          23        22   # BR(H -> Z       gam    )
     1.68640864E-04    2          24       -24   # BR(H -> W+      W-     )
     8.29796337E-05    2          23        23   # BR(H -> Z       Z      )
     6.44628855E-04    2          25        25   # BR(H -> h       h      )
#
#         PDG            Width
DECAY        36     3.97618254E+00   # A decays
#          BR         NDA      ID1       ID2
     8.49204905E-01    2           5        -5   # BR(A -> b       bb     )
     1.06775722E-01    2         -15        15   # BR(A -> tau+    tau-   )
     3.73941150E-04    2         -13        13   # BR(A -> mu+     mu-    )
     4.42774779E-04    2           3        -3   # BR(A -> s       sb     )
     4.50363363E-07    2           4        -4   # BR(A -> c       cb     )
     4.27344461E-02    2           6        -6   # BR(A -> t       tb     )
     3.03744922E-04    2          21        21   # BR(A -> g       g      )
     3.70032849E-07    2          22        22   # BR(A -> gam     gam    )
     1.68188233E-07    2          23        22   # BR(A -> Z       gam    )
     1.63477585E-04    2          23        25   # BR(A -> Z       h      )
#
#         PDG            Width
DECAY        37     3.98574376E+00   # H+ decays
#          BR         NDA      ID1       ID2
     1.46817395E-03    2           4        -5   # BR(H+ -> c       bb     )
     1.06934520E-01    2         -15        16   # BR(H+ -> tau+    nu_tau )
     3.74497258E-04    2         -13        14   # BR(H+ -> mu+     nu_mu  )
     1.46815523E-05    2           2        -5   # BR(H+ -> u       bb     )
     2.20646743E-05    2           2        -3   # BR(H+ -> u       sb     )
     4.34729334E-04    2           4        -3   # BR(H+ -> c       sb     )
     8.90584914E-01    2           6        -5   # BR(H+ -> t       bb     )
     1.66418906E-04    2          24        25   # BR(H+ -> W+      h      )
     1.48344922E-10    2          24        36   # BR(H+ -> W+      A      )
