#
#                              ======================
#                              | THE SUSYHIT OUTPUT |
#                              ======================
#
#
#              ------------------------------------------------------
#              |     This is the output of the SUSY-HIT package     |
#              |  created by A.Djouadi, M.Muehlleitner and M.Spira. |
#              |  In case of problems with SUSY-HIT email to        |
#              |           margarete.muehlleitner@cern.ch           |
#              |           michael.spira@psi.ch                     |
#              |           abdelhak.djouadi@cern.ch                 |
#              ------------------------------------------------------
#
#              ------------------------------------------------------
#              |  SUSY Les Houches Accord - MSSM Spectrum + Decays  |
#              |              based on the decay programs           |
#              |                                                    |
#              |                     SDECAY 1.3b                    |
#              |                                                    |
#              |  Authors: M.Muhlleitner, A.Djouadi and Y.Mambrini  |
#              |  Ref.:    Comput.Phys.Commun.168(2005)46           |
#              |           [hep-ph/0311167]                         |
#              |                                                    |
#              |                     HDECAY 3.4                     |
#              |                                                    |
#              |  By: A.Djouadi,J.Kalinowski,M.Muhlleitner,M.Spira  |
#              |  Ref.:    Comput.Phys.Commun.108(1998)56           |
#              |           [hep-ph/9704448]                         |
#              |                                                    |
#              |                                                    |
#              |  If not stated otherwise all DRbar couplings and   |
#              |  soft SUSY breaking masses are given at the scale  |
#              |  Q=  0.21181260E+04
#              |                                                    |
#              ------------------------------------------------------
#
#
BLOCK DCINFO  # Decay Program information
     1   SDECAY/HDECAY # decay calculator
     2   1.3b  /3.4    # version number
#
BLOCK SPINFO  # Spectrum calculator information
     1     SOFTSUSY    # spectrum calculator               
     2     3.4.0       # version number                    
#
BLOCK MODSEL  # Model selection
     1     0   #  nonUniversal                                     
#
BLOCK SMINPUTS  # Standard Model inputs
         1     1.27908970E+02   # alpha_em^-1(M_Z)^MSbar
         2     1.16637870E-05   # G_F [GeV^-2]
         3     1.18400000E-01   # alpha_S(M_Z)^MSbar
         4     9.11876000E+01   # M_Z pole mass
         5     4.18000000E+00   # mb(mb)^MSbar
         6     1.73200000E+02   # mt pole mass
         7     1.77700000E+00   # mtau pole mass
#
BLOCK MINPAR  # Input parameters - minimal models
         3     4.60000000E+01   # tanb                
#
BLOCK EXTPAR  # Input parameters - non-minimal models
         0    -1.00000000E+00   # Set                 
         1     3.64183000E+03   # M_1(MX)             
         2    -1.55099000E+03   # M_2(MX)             
         3     1.24906000E+03   # M_3(MX)             
        11     3.02990000E+03   # At(MX)              
        12    -6.94320000E+02   # Ab(MX)              
        13     1.84181000E+03   # Atau(MX)            
        23    -3.84710000E+02   # mu(MX)              
        26     3.83382000E+03   # mA(pole)            
        31     1.34904000E+03   # meL(MX)             
        32     1.34904000E+03   # mmuL(MX)            
        33     1.05621000E+03   # mtauL(MX)           
        34     3.43039000E+03   # meR(MX)             
        35     3.43039000E+03   # mmuR(MX)            
        36     2.11585000E+03   # mtauR(MX)           
        41     2.59702000E+03   # mqL1(MX)            
        42     2.59702000E+03   # mqL2(MX)            
        43     1.82339000E+03   # mqL3(MX)            
        44     3.29006000E+03   # muR(MX)             
        45     3.29006000E+03   # mcR(MX)             
        46     2.46154000E+03   # mtR(MX)             
        47     1.59854000E+03   # mdR(MX)             
        48     1.59854000E+03   # msR(MX)             
        49     3.75572000E+03   # mbR(MX)             
#
BLOCK MASS  # Mass Spectrum
# PDG code           mass       particle
        24     8.03968316E+01   # W+
        25     1.26481153E+02   # h
        35     3.83381690E+03   # H
        36     3.83382016E+03   # A
        37     3.83481892E+03   # H+
         5     4.81876030E+00   # b-quark pole mass calculated from mb(mb)_Msbar
   1000001     2.63851155E+03   # ~d_L
   2000001     1.64925735E+03   # ~d_R
   1000002     2.63745383E+03   # ~u_L
   2000002     3.32524786E+03   # ~u_R
   1000003     2.63851155E+03   # ~s_L
   2000003     1.64925735E+03   # ~s_R
   1000004     2.63745383E+03   # ~c_L
   2000004     3.32524786E+03   # ~c_R
   1000005     1.85287063E+03   # ~b_1
   2000005     3.77980430E+03   # ~b_2
   1000006     1.83938952E+03   # ~t_1
   2000006     2.44936144E+03   # ~t_2
   1000011     1.36804036E+03   # ~e_L
   2000011     3.43591881E+03   # ~e_R
   1000012     1.36541666E+03   # ~nu_eL
   1000013     1.36804036E+03   # ~mu_L
   2000013     3.43591881E+03   # ~mu_R
   1000014     1.36541666E+03   # ~nu_muL
   1000015     1.07661172E+03   # ~tau_1
   2000015     2.11538321E+03   # ~tau_2
   1000016     1.07358511E+03   # ~nu_tauL
   1000021     1.43727150E+03   # ~g
   1000022    -4.02912923E+02   # ~chi_10
   1000023     4.07005169E+02   # ~chi_20
   1000025    -1.57943197E+03   # ~chi_30
   1000035     3.61766461E+03   # ~chi_40
   1000024     4.04664819E+02   # ~chi_1+
   1000037     1.57960338E+03   # ~chi_2+
#
BLOCK NMIX  # Neutralino Mixing Matrix
  1  1     7.71724985E-03   # N_11
  1  2     4.85573432E-02   # N_12
  1  3     7.08490566E-01   # N_13
  1  4    -7.04005502E-01   # N_14
  2  1    -9.27251019E-03   # N_21
  2  2    -2.78173086E-02   # N_22
  2  3     7.05564299E-01   # N_23
  2  4     7.08039008E-01   # N_24
  3  1    -4.43000754E-04   # N_31
  3  2     9.98432945E-01   # N_32
  3  3    -1.47985064E-02   # N_33
  3  4     5.39672348E-02   # N_34
  4  1     9.99927132E-01   # N_41
  4  2    -1.90372752E-04   # N_42
  4  3     1.06827554E-03   # N_43
  4  4     1.20230689E-02   # N_44
#
BLOCK UMIX  # Chargino Mixing Matrix U
  1  1     2.09585527E-02   # U_11
  1  2     9.99780345E-01   # U_12
  2  1    -9.99780345E-01   # U_21
  2  2     2.09585527E-02   # U_22
#
BLOCK VMIX  # Chargino Mixing Matrix V
  1  1    -7.64265212E-02   # V_11
  1  2    -9.97075216E-01   # V_12
  2  1     9.97075216E-01   # V_21
  2  2    -7.64265212E-02   # V_22
#
BLOCK STOPMIX  # Stop Mixing Matrix
  1  1     9.87225147E-01   # cos(theta_t)
  1  2    -1.59331444E-01   # sin(theta_t)
  2  1     1.59331444E-01   # -sin(theta_t)
  2  2     9.87225147E-01   # cos(theta_t)
#
BLOCK SBOTMIX  # Sbottom Mixing Matrix
  1  1     9.99991842E-01   # cos(theta_b)
  1  2    -4.03929863E-03   # sin(theta_b)
  2  1     4.03929863E-03   # -sin(theta_b)
  2  2     9.99991842E-01   # cos(theta_b)
#
BLOCK STAUMIX  # Stau Mixing Matrix
  1  1     9.99936072E-01   # cos(theta_tau)
  1  2    -1.13071620E-02   # sin(theta_tau)
  2  1     1.13071620E-02   # -sin(theta_tau)
  2  2     9.99936072E-01   # cos(theta_tau)
#
BLOCK ALPHA  # Higgs mixing
          -2.19908355E-02   # Mixing angle in the neutral Higgs boson sector
#
BLOCK HMIX Q=  2.11812600E+03  # DRbar Higgs Parameters
         1    -3.96440187E+02   # mu(Q)MSSM           
         2     4.55351813E+01   # tan                 
         3     2.42702980E+02   # higgs               
         4     1.51551717E+07   # mA^2(Q)MSSM         
#
BLOCK GAUGE Q=  2.11812600E+03  # The gauge couplings
     1     3.63981543E-01   # gprime(Q) DRbar
     2     6.38757288E-01   # g(Q) DRbar
     3     1.03208963E+00   # g3(Q) DRbar
#
BLOCK AU Q=  2.11812600E+03  # The trilinear couplings
  1  1     0.00000000E+00   # A_u(Q) DRbar
  2  2     0.00000000E+00   # A_c(Q) DRbar
  3  3     3.02990000E+03   # A_t(Q) DRbar
#
BLOCK AD Q=  2.11812600E+03  # The trilinear couplings
  1  1     0.00000000E+00   # A_d(Q) DRbar
  2  2     0.00000000E+00   # A_s(Q) DRbar
  3  3    -6.94319996E+02   # A_b(Q) DRbar
#
BLOCK AE Q=  2.11812600E+03  # The trilinear couplings
  1  1     0.00000000E+00   # A_e(Q) DRbar
  2  2     0.00000000E+00   # A_mu(Q) DRbar
  3  3     1.84181000E+03   # A_tau(Q) DRbar
#
BLOCK Yu Q=  2.11812600E+03  # The Yukawa couplings
  1  1     0.00000000E+00   # y_u(Q) DRbar
  2  2     0.00000000E+00   # y_c(Q) DRbar
  3  3     8.48572516E-01   # y_t(Q) DRbar
#
BLOCK Yd Q=  2.11812600E+03  # The Yukawa couplings
  1  1     0.00000000E+00   # y_d(Q) DRbar
  2  2     0.00000000E+00   # y_s(Q) DRbar
  3  3     6.91257315E-01   # y_b(Q) DRbar
#
BLOCK Ye Q=  2.11812600E+03  # The Yukawa couplings
  1  1     0.00000000E+00   # y_e(Q) DRbar
  2  2     0.00000000E+00   # y_mu(Q) DRbar
  3  3     4.93030086E-01   # y_tau(Q) DRbar
#
BLOCK MSOFT Q=  2.11812600E+03  # The soft SUSY breaking masses at the scale Q
         1     3.64183000E+03   # M_1(Q)              
         2    -1.55099000E+03   # M_2(Q)              
         3     1.24906000E+03   # M_3(Q)              
        21     1.46757655E+07   # mH1^2(Q)            
        22    -8.01241276E+04   # mH2^2(Q)            
        31     1.34904000E+03   # meL(Q)              
        32     1.34904000E+03   # mmuL(Q)             
        33     1.05621000E+03   # mtauL(Q)            
        34     3.43039000E+03   # meR(Q)              
        35     3.43039000E+03   # mmuR(Q)             
        36     2.11585000E+03   # mtauR(Q)            
        41     2.59702000E+03   # mqL1(Q)             
        42     2.59702000E+03   # mqL2(Q)             
        43     1.82339000E+03   # mqL3(Q)             
        44     3.29006000E+03   # muR(Q)              
        45     3.29006000E+03   # mcR(Q)              
        46     2.46154000E+03   # mtR(Q)              
        47     1.59854000E+03   # mdR(Q)              
        48     1.59854000E+03   # msR(Q)              
        49     3.75572000E+03   # mbR(Q)              
#
Block HiggsBoundsInputHiggsCouplingsFermions
# ScalarNormEffCoupSq PseudoSNormEffCoupSq NP   IP1 IP2 IP2
    1.00303710E+00    0.00000000E+00        3  25   5   5  # h0-b-b eff. coupling^2, normalised to SM
    2.07344970E+03    0.00000000E+00        3  35   5   5  # H0-b-b eff. coupling^2, normalised to SM
    0.00000000E+00    2.07345274E+03        3  36   5   5  # A0-b-b eff. coupling^2, normalised to SM
#
    9.99998535E-01    0.00000000E+00        3  25   6   6  # h0-t-t eff. coupling^2, normalised to SM
    4.83752091E-04    0.00000000E+00        3  35   6   6  # H0-t-t eff. coupling^2, normalised to SM
    0.00000000E+00    4.82287338E-04        3  36   6   6  # A0-t-t eff. coupling^2, normalised to SM
#
    1.00303710E+00    0.00000000E+00        3  25  15  15  # h0-tau-tau eff. coupling^2, normalised to SM
    2.07344970E+03    0.00000000E+00        3  35  15  15  # H0-tau-tau eff. coupling^2, normalised to SM
    0.00000000E+00    2.07345274E+03        3  36  15  15  # A0-tau-tau eff. coupling^2, normalised to SM
#
Block HiggsBoundsInputHiggsCouplingsBosons
    9.99999999E-01        3  25  24  24  # h0-W-W eff. coupling^2, normalised to SM
    1.11046408E-09        3  35  24  24  # H0-W-W eff. coupling^2, normalised to SM
    0.00000000E+00        3  36  24  24  # A0-W-W eff. coupling^2, normalised to SM
#
    9.99999999E-01        3  25  23  23  # h0-Z-Z eff. coupling^2, normalised to SM
    1.11046408E-09        3  35  23  23  # H0-Z-Z eff. coupling^2, normalised to SM
    0.00000000E+00        3  36  23  23  # A0-Z-Z eff. coupling^2, normalised to SM
#
    8.89455699E-01        3  25  21  21  # h0-g-g eff. coupling^2, normalised to SM
    2.29925141E-13        3  35  21  21  # H0-g-g eff. coupling^2, normalised to SM
    6.28137994E-13        3  36  21  21  # A0-g-g eff. coupling^2, normalised to SM
#
    0.00000000E+00        3  25  25  23  # h0-h0-Z eff. coupling^2, normalised to SM
    0.00000000E+00        3  35  25  23  # H0-h0-Z eff. coupling^2, normalised to SM
    1.11046408E-09        3  36  25  23  # A0-h0-Z eff. coupling^2, normalised to SM
    0.00000000E+00        3  35  35  23  # H0-H0-Z eff. coupling^2, normalised to SM
    9.99999999E-01        3  36  35  23  # A0-H0-Z eff. coupling^2, normalised to SM
    0.00000000E+00        3  36  36  23  # A0-A0-Z eff. coupling^2, normalised to SM
#
    0.00000000E+00        4  25  21  21  23  # h0-g-g-Z eff. coupling^2, normalised to SM
    0.00000000E+00        4  35  21  21  23  # H0-g-g-Z eff. coupling^2, normalised to SM
    0.00000000E+00        4  36  21  21  23  # A0-g-g-Z eff. coupling^2, normalised to SM
#
#
#
#                             =================
#                             |The decay table|
#                             =================
#
# - The QCD corrections to the decays gluino -> squark  + quark
#                                     squark -> gaugino + quark_prime
#                                     squark -> squark_prime + Higgs
#                                     squark -> gluino  + quark
#   are included.
#
# - The multi-body decays for the inos, stops and sbottoms are included.
#
# - The loop induced decays for the gluino, neutralinos and stops
#   are included.
#
# - The SUSY decays of the top quark are included.
#
#
#         PDG            Width
DECAY         6     1.43664475E+00   # top decays
#          BR         NDA      ID1       ID2
     1.00000000E+00    2           5        24   # BR(t ->  b    W+)
#
#         PDG            Width
DECAY   1000021     2.22076524E-02   # gluino decays
#          BR         NDA      ID1       ID2
     5.49244433E-03    2     1000022        21   # BR(~g -> ~chi_10 g)
     6.54654896E-03    2     1000023        21   # BR(~g -> ~chi_20 g)
#           BR         NDA      ID1       ID2       ID3
     1.56435249E-05    3     1000022         1        -1   # BR(~g -> ~chi_10 d  db)
     1.11453588E-05    3     1000023         1        -1   # BR(~g -> ~chi_20 d  db)
     1.67872179E-05    3     1000022         2        -2   # BR(~g -> ~chi_10 u  ub)
     1.18527345E-05    3     1000023         2        -2   # BR(~g -> ~chi_20 u  ub)
     1.56435249E-05    3     1000022         3        -3   # BR(~g -> ~chi_10 s  sb)
     1.11453588E-05    3     1000023         3        -3   # BR(~g -> ~chi_20 s  sb)
     1.67872179E-05    3     1000022         4        -4   # BR(~g -> ~chi_10 c  cb)
     1.18527345E-05    3     1000023         4        -4   # BR(~g -> ~chi_20 c  cb)
     8.99996678E-02    3     1000022         5        -5   # BR(~g -> ~chi_10 b  bb)
     8.82410282E-02    3     1000023         5        -5   # BR(~g -> ~chi_20 b  bb)
     1.39404774E-01    3     1000022         6        -6   # BR(~g -> ~chi_10 t  tb)
     1.61106474E-01    3     1000023         6        -6   # BR(~g -> ~chi_20 t  tb)
     5.20230540E-05    3     1000024         1        -2   # BR(~g -> ~chi_1+ d  ub)
     5.20230540E-05    3    -1000024         2        -1   # BR(~g -> ~chi_1- u  db)
     5.20230540E-05    3     1000024         3        -4   # BR(~g -> ~chi_1+ s  cb)
     5.20230540E-05    3    -1000024         4        -3   # BR(~g -> ~chi_1- c  sb)
     2.54445056E-01    3     1000024         5        -6   # BR(~g -> ~chi_1+ b  tb)
     2.54445056E-01    3    -1000024         6        -5   # BR(~g -> ~chi_1- t  bb)
#
#         PDG            Width
DECAY   1000006     5.35985692E+01   # stop1 decays
#          BR         NDA      ID1       ID2
     2.15436376E-01    2     1000022         6   # BR(~t_1 -> ~chi_10 t )
     2.23291226E-01    2     1000023         6   # BR(~t_1 -> ~chi_20 t )
     7.42372319E-03    2     1000025         6   # BR(~t_1 -> ~chi_30 t )
     3.08306782E-01    2     1000024         5   # BR(~t_1 -> ~chi_1+ b )
     1.80152602E-02    2     1000037         5   # BR(~t_1 -> ~chi_2+ b )
     2.27526633E-01    2     1000021         6   # BR(~t_1 -> ~g      t )
#
#         PDG            Width
DECAY   2000006     1.63344018E+02   # stop2 decays
#          BR         NDA      ID1       ID2
     9.94479536E-02    2     1000022         6   # BR(~t_2 -> ~chi_10 t )
     9.94248046E-02    2     1000023         6   # BR(~t_2 -> ~chi_20 t )
     1.38673378E-03    2     1000025         6   # BR(~t_2 -> ~chi_30 t )
     1.96732938E-01    2     1000024         5   # BR(~t_2 -> ~chi_1+ b )
     2.78857785E-03    2     1000037         5   # BR(~t_2 -> ~chi_2+ b )
     3.70110401E-01    2     1000021         6   # BR(~t_2 -> ~g      t )
     6.33447968E-02    2     1000006        25   # BR(~t_2 -> ~t_1    h )
     5.76323038E-02    2     1000006        23   # BR(~t_2 -> ~t_1    Z )
     1.09131491E-01    2     1000005        24   # BR(~t_2 -> ~b_1    W+)
#
#         PDG            Width
DECAY   1000005     5.75471100E+01   # sbottom1 decays
#          BR         NDA      ID1       ID2
     1.39743019E-01    2     1000022         5   # BR(~b_1 -> ~chi_10 b )
     1.38070566E-01    2     1000023         5   # BR(~b_1 -> ~chi_20 b )
     9.74523784E-03    2     1000025         5   # BR(~b_1 -> ~chi_30 b )
     4.07337056E-01    2    -1000024         6   # BR(~b_1 -> ~chi_1- t )
     1.65143752E-02    2    -1000037         6   # BR(~b_1 -> ~chi_2- t )
     2.88589745E-01    2     1000021         5   # BR(~b_1 -> ~g      b )
#
#         PDG            Width
DECAY   2000005     2.26886891E+02   # sbottom2 decays
#          BR         NDA      ID1       ID2
     7.76733535E-02    2     1000022         5   # BR(~b_2 -> ~chi_10 b )
     7.70351657E-02    2     1000023         5   # BR(~b_2 -> ~chi_20 b )
     3.27961341E-05    2     1000025         5   # BR(~b_2 -> ~chi_30 b )
     6.87077859E-05    2     1000035         5   # BR(~b_2 -> ~chi_40 b )
     1.54019453E-01    2    -1000024         6   # BR(~b_2 -> ~chi_1- t )
     6.54688258E-05    2    -1000037         6   # BR(~b_2 -> ~chi_2- t )
     6.88880766E-01    2     1000021         5   # BR(~b_2 -> ~g      b )
     6.10532585E-04    2     1000005        25   # BR(~b_2 -> ~b_1    h )
     5.48390101E-04    2     1000005        23   # BR(~b_2 -> ~b_1    Z )
     1.05335346E-03    2     1000006       -24   # BR(~b_2 -> ~t_1    W-)
     1.20137399E-05    2     2000006       -24   # BR(~b_2 -> ~t_2    W-)
#
#         PDG            Width
DECAY   1000002     1.07118560E+02   # sup_L decays
#          BR         NDA      ID1       ID2
     2.29667633E-04    2     1000022         2   # BR(~u_L -> ~chi_10 u)
     8.02225651E-05    2     1000023         2   # BR(~u_L -> ~chi_20 u)
     3.97581243E-02    2     1000025         2   # BR(~u_L -> ~chi_30 u)
     1.07176239E-03    2     1000024         1   # BR(~u_L -> ~chi_1+ d)
     7.92944395E-02    2     1000037         1   # BR(~u_L -> ~chi_2+ d)
     8.79565784E-01    2     1000021         2   # BR(~u_L -> ~g      u)
#
#         PDG            Width
DECAY   2000002     1.58925640E+02   # sup_R decays
#          BR         NDA      ID1       ID2
     2.73883510E-06    2     1000022         2   # BR(~u_R -> ~chi_10 u)
     3.95163051E-06    2     1000023         2   # BR(~u_R -> ~chi_20 u)
     5.59083153E-09    2     1000025         2   # BR(~u_R -> ~chi_30 u)
     9.99993304E-01    2     1000021         2   # BR(~u_R -> ~g      u)
#
#         PDG            Width
DECAY   1000001     1.07173445E+02   # sdown_L decays
#          BR         NDA      ID1       ID2
     2.03523288E-04    2     1000022         1   # BR(~d_L -> ~chi_10 d)
     6.22489925E-05    2     1000023         1   # BR(~d_L -> ~chi_20 d)
     3.98025517E-02    2     1000025         1   # BR(~d_L -> ~chi_30 d)
     8.05943686E-05    2    -1000024         2   # BR(~d_L -> ~chi_1- u)
     7.97874957E-02    2    -1000037         2   # BR(~d_L -> ~chi_2- u)
     8.80063586E-01    2     1000021         1   # BR(~d_L -> ~g      d)
#
#         PDG            Width
DECAY   2000001     6.89752220E+00   # sdown_R decays
#          BR         NDA      ID1       ID2
     7.02900349E-06    2     1000022         1   # BR(~d_R -> ~chi_10 d)
     1.01218027E-05    2     1000023         1   # BR(~d_R -> ~chi_20 d)
     1.96945125E-10    2     1000025         1   # BR(~d_R -> ~chi_30 d)
     9.99982849E-01    2     1000021         1   # BR(~d_R -> ~g      d)
#
#         PDG            Width
DECAY   1000004     8.69622884E+01   # scharm_L decays
#          BR         NDA      ID1       ID2
     2.93803596E-04    2     1000022         4   # BR(~c_L -> ~chi_10 c)
     1.02622964E-04    2     1000023         4   # BR(~c_L -> ~chi_20 c)
     5.04688157E-02    2     1000025         4   # BR(~c_L -> ~chi_30 c)
     1.37104641E-03    2     1000024         3   # BR(~c_L -> ~chi_1+ s)
     1.00655997E-01    2     1000037         3   # BR(~c_L -> ~chi_2+ s)
     8.47107715E-01    2     1000021         4   # BR(~c_L -> ~g      c)
#
#         PDG            Width
DECAY   2000004     1.24260163E+02   # scharm_R decays
#          BR         NDA      ID1       ID2
     3.62498842E-06    2     1000022         4   # BR(~c_R -> ~chi_10 c)
     5.23012253E-06    2     1000023         4   # BR(~c_R -> ~chi_20 c)
     7.37835069E-09    2     1000025         4   # BR(~c_R -> ~chi_30 c)
     9.99991138E-01    2     1000021         4   # BR(~c_R -> ~g      c)
#
#         PDG            Width
DECAY   1000003     8.69928682E+01   # sstrange_L decays
#          BR         NDA      ID1       ID2
     2.60398330E-04    2     1000022         3   # BR(~s_L -> ~chi_10 s)
     7.96429099E-05    2     1000023         3   # BR(~s_L -> ~chi_20 s)
     5.05336829E-02    2     1000025         3   # BR(~s_L -> ~chi_30 s)
     1.03115661E-04    2    -1000024         4   # BR(~s_L -> ~chi_1- c)
     1.01298569E-01    2    -1000037         4   # BR(~s_L -> ~chi_2- c)
     8.47724591E-01    2     1000021         3   # BR(~s_L -> ~g      s)
#
#         PDG            Width
DECAY   2000003     5.39303009E+00   # sstrange_R decays
#          BR         NDA      ID1       ID2
     9.43205415E-06    2     1000022         3   # BR(~s_R -> ~chi_10 s)
     1.35815557E-05    2     1000023         3   # BR(~s_R -> ~chi_20 s)
     2.41471726E-10    2     1000025         3   # BR(~s_R -> ~chi_30 s)
     9.99976986E-01    2     1000021         3   # BR(~s_R -> ~g      s)
#
#         PDG            Width
DECAY   1000011     2.21016352E-02   # selectron_L decays
#          BR         NDA      ID1       ID2
     5.87551162E-01    2     1000022        11   # BR(~e_L -> ~chi_10 e-)
     2.28681814E-01    2     1000023        11   # BR(~e_L -> ~chi_20 e-)
     1.83767024E-01    2    -1000024        12   # BR(~e_L -> ~chi_1- nu_e)
#
#         PDG            Width
DECAY   2000011     1.99050249E-02   # selectron_R decays
#           BR         NDA      ID1       ID2
     5.27105128E-02    2     1000022        11   # BR(~e_R -> ~chi_10 e-)
     7.60535456E-02    2     1000023        11   # BR(~e_R -> ~chi_20 e-)
#           BR         NDA      ID1       ID2       ID3
     4.62345566E-04    3        11       -1        1000001   # BR(~e_R- -> e-  db  ~d_L)
     3.38969684E-04    3        11       1        -1000001   # BR(~e_R- -> e-  d  ~d_L*)
     1.74905584E-02    3        11       -1        2000001   # BR(~e_R- -> e-  db  ~d_R)
     3.03873019E-02    3        11       1        -2000001   # BR(~e_R- -> e-  d  ~d_R*)
     4.56814300E-04    3        11       -2        1000002   # BR(~e_R- -> e-  ub  ~u_L)
     3.41893569E-04    3        11       2        -1000002   # BR(~e_R- -> e-  u  ~u_L*)
     1.65716949E-06    3        11       -2        2000002   # BR(~e_R- -> e-  ub  ~u_R)
     1.90268539E-06    3        11       2        -2000002   # BR(~e_R- -> e-  u  ~u_R*)
     4.58557579E-04    3        11       -3        1000003   # BR(~e_R- -> e-  sb  ~s_L)
     3.38206059E-04    3        11       3        -1000003   # BR(~e_R- -> e-  s  ~s_L*)
     1.75242182E-02    3        11       -3        2000003   # BR(~e_R- -> e-  sb  ~s_R)
     3.06962691E-02    3        11       3        -2000003   # BR(~e_R- -> e-  s  ~s_R*)
     4.58859010E-04    3        11       -4        1000004   # BR(~e_R- -> e-  cb  ~c_L)
     3.40798369E-04    3        11       4        -1000004   # BR(~e_R- -> e-  c  ~c_L*)
     1.66430337E-06    3        11       -4        2000004   # BR(~e_R- -> e-  cb  ~c_R)
     1.88670953E-06    3        11       4        -2000004   # BR(~e_R- -> e-  c  ~c_R*)
     5.13438192E-03    3        11       -5        1000005   # BR(~e_R- -> e-  bb  ~b_1)
     3.14156855E-03    3        11       5        -1000005   # BR(~e_R- -> e-  b  ~b_1*)
     8.52799737E-03    3        11       -6        1000006   # BR(~e_R- -> e-  tb  ~t_1)
     7.17256073E-03    3        11       6        -1000006   # BR(~e_R- -> e-  t  ~t_1*)
     9.70257520E-03    3        11       -6        2000006   # BR(~e_R- -> e-  tb  ~t_2)
     1.36247004E-02    3        11       6        -2000006   # BR(~e_R- -> e-  t  ~t_2*)
     3.65294695E-02    3        11       -11        1000011   # BR(~e_R- -> e-  e+  ~e_L-)
     1.87661158E-02    3        11       11        -1000011   # BR(~e_R- -> e-  e-  ~e_L+)
     3.56327111E-02    3        11       -12        1000012   # BR(~e_R- -> e-  nu_eb  ~nu_eL)
     1.93940979E-02    3        11       12        -1000012   # BR(~e_R- -> e-  nu_e  ~nu_eL*)
     3.57673505E-02    3        11       -13        1000013   # BR(~e_R- -> e-  mu+  ~mu_L-)
     1.92001770E-02    3        11       13        -1000013   # BR(~e_R- -> e-  mu-  ~mu_L+)
     3.61144990E-02    3        11       -14        1000014   # BR(~e_R- -> e-  nu_mub  ~nu_muL)
     1.89886726E-02    3        11       14        -1000014   # BR(~e_R- -> e-  nu_mu  ~nu_muL*)
     5.15698928E-02    3        11       -15        1000015   # BR(~e_R- -> e-  tau+  ~tau_1-)
     2.61481714E-02    3        11       15        -1000015   # BR(~e_R- -> e-  tau-  ~tau_1+)
     2.16905029E-02    3        11       -15        2000015   # BR(~e_R- -> e-  tau+  ~tau_2-)
     3.33463537E-02    3        11       15        -2000015   # BR(~e_R- -> e-  tau-  ~tau_2+)
     5.23737099E-02    3        11       -16        1000016   # BR(~e_R- -> e-  nu_taub  ~nu_tau1)
     2.61803240E-02    3        11       16        -1000016   # BR(~e_R- -> e-  nu_tau  ~nu_tau1*)
     4.60873577E-02    3        11       23        1000022   # BR(~e_R- -> e-  Z  ~chi_10)
     2.66038351E-02    3        11       25        1000022   # BR(~e_R- -> e-  h  ~chi_10)
     2.65942898E-02    3        11       23        1000023   # BR(~e_R- -> e-  Z  ~chi_20)
     4.61089603E-02    3        11       25        1000023   # BR(~e_R- -> e-  h  ~chi_20)
     4.09168039E-05    3        11       23        1000025   # BR(~e_R- -> e-  Z  ~chi_30)
     2.56462880E-05    3        11       25        1000025   # BR(~e_R- -> e-  h  ~chi_30)
     4.04922881E-02    3        11       -24        1000024   # BR(~e_R- -> e-  W-  ~chi_1+)
     1.06842368E-01    3        11       24        -1000024   # BR(~e_R- -> e-  W+  ~chi_1-)
     2.03014065E-05    3        11       -24        1000037   # BR(~e_R- -> e-  W-  ~chi_2+)
     1.12243015E-04    3        11       24        -1000037   # BR(~e_R- -> e-  W+  ~chi_2-)
#
#         PDG            Width
DECAY   1000013     2.21016349E-02   # smuon_L decays
#          BR         NDA      ID1       ID2
     5.87551161E-01    2     1000022        13   # BR(~mu_L -> ~chi_10 mu-)
     2.28681813E-01    2     1000023        13   # BR(~mu_L -> ~chi_20 mu-)
     1.83767026E-01    2    -1000024        14   # BR(~mu_L -> ~chi_1- nu_mu)
#
#         PDG            Width
DECAY   2000013     1.99869674E-02   # smuon_R decays
#           BR         NDA      ID1       ID2
     5.24944104E-02    2     1000022        13   # BR(~mu_R -> ~chi_10 mu-)
     7.57417415E-02    2     1000023        13   # BR(~mu_R -> ~chi_20 mu-)
#           BR         NDA      ID1       ID2       ID3
     4.60455046E-04    3        13       -1        1000001   # BR(~mu_R- -> mu-  db  ~d_L)
     3.40181673E-04    3        13       1        -1000001   # BR(~mu_R- -> mu-  d  ~d_L*)
     1.76429968E-02    3        13       -1        2000001   # BR(~mu_R- -> mu-  db  ~d_R)
     3.00715956E-02    3        13       1        -2000001   # BR(~mu_R- -> mu-  d  ~d_R*)
     4.62596442E-04    3        13       -2        1000002   # BR(~mu_R- -> mu-  ub  ~u_L)
     3.41997856E-04    3        13       2        -1000002   # BR(~mu_R- -> mu-  u  ~u_L*)
     1.66038195E-06    3        13       -2        2000002   # BR(~mu_R- -> mu-  ub  ~u_R)
     1.88072554E-06    3        13       2        -2000002   # BR(~mu_R- -> mu-  u  ~u_R*)
     4.53420463E-04    3        13       -3        1000003   # BR(~mu_R- -> mu-  sb  ~s_L)
     3.36664381E-04    3        13       3        -1000003   # BR(~mu_R- -> mu-  s  ~s_L*)
     1.76279869E-02    3        13       -3        2000003   # BR(~mu_R- -> mu-  sb  ~s_R)
     3.00816021E-02    3        13       3        -2000003   # BR(~mu_R- -> mu-  s  ~s_R*)
     4.57152895E-04    3        13       -4        1000004   # BR(~mu_R- -> mu-  cb  ~c_L)
     3.35643716E-04    3        13       4        -1000004   # BR(~mu_R- -> mu-  c  ~c_L*)
     1.66968802E-06    3        13       -4        2000004   # BR(~mu_R- -> mu-  cb  ~c_R)
     1.90954432E-06    3        13       4        -2000004   # BR(~mu_R- -> mu-  c  ~c_R*)
     5.13134373E-03    3        13       -5        1000005   # BR(~mu_R- -> mu-  bb  ~b_1)
     3.14224759E-03    3        13       5        -1000005   # BR(~mu_R- -> mu-  b  ~b_1*)
     8.41048051E-03    3        13       -6        1000006   # BR(~mu_R- -> mu-  tb  ~t_1)
     7.11763806E-03    3        13       6        -1000006   # BR(~mu_R- -> mu-  t  ~t_1*)
     9.66029498E-03    3        13       -6        2000006   # BR(~mu_R- -> mu-  tb  ~t_2)
     1.34657747E-02    3        13       6        -2000006   # BR(~mu_R- -> mu-  t  ~t_2*)
     3.56477291E-02    3        13       -11        1000011   # BR(~mu_R- -> mu-  e+  ~e_L-)
     1.90749299E-02    3        13       11        -1000011   # BR(~mu_R- -> mu-  e-  ~e_L+)
     3.63656971E-02    3        13       -12        1000012   # BR(~mu_R- -> mu-  nu_eb  ~nu_eL)
     1.91764960E-02    3        13       12        -1000012   # BR(~mu_R- -> mu-  nu_e  ~nu_eL*)
     3.58323495E-02    3        13       -13        1000013   # BR(~mu_R- -> mu-  mu+  ~mu_L-)
     1.90168921E-02    3        13       13        -1000013   # BR(~mu_R- -> mu-  mu-  ~mu_L+)
     3.58378531E-02    3        13       -14        1000014   # BR(~mu_R- -> mu-  nu_mub  ~nu_muL)
     1.94021431E-02    3        13       14        -1000014   # BR(~mu_R- -> mu-  nu_mu  ~nu_muL*)
     5.30795882E-02    3        13       -15        1000015   # BR(~mu_R- -> mu-  tau+  ~tau_1-)
     2.50873477E-02    3        13       15        -1000015   # BR(~mu_R- -> mu-  tau-  ~tau_1+)
     2.16541105E-02    3        13       -15        2000015   # BR(~mu_R- -> mu-  tau+  ~tau_2-)
     3.29694839E-02    3        13       15        -2000015   # BR(~mu_R- -> mu-  tau-  ~tau_2+)
     5.33047349E-02    3        13       -16        1000016   # BR(~mu_R- -> mu-  nu_taub  ~nu_tau1)
     2.55321376E-02    3        13       16        -1000016   # BR(~mu_R- -> mu-  nu_tau  ~nu_tau1*)
     4.56792660E-02    3        13       23        1000022   # BR(~mu_R- -> mu-  Z  ~chi_10)
     2.64382280E-02    3        13       25        1000022   # BR(~mu_R- -> mu-  h  ~chi_10)
     2.64897616E-02    3        13       23        1000023   # BR(~mu_R- -> mu-  Z  ~chi_20)
     4.64282541E-02    3        13       25        1000023   # BR(~mu_R- -> mu-  h  ~chi_20)
     4.04853816E-05    3        13       23        1000025   # BR(~mu_R- -> mu-  Z  ~chi_30)
     2.53174976E-05    3        13       25        1000025   # BR(~mu_R- -> mu-  h  ~chi_30)
     4.09316723E-02    3        13       -24        1000024   # BR(~mu_R- -> mu-  W-  ~chi_1+)
     1.08070422E-01    3        13       24        -1000024   # BR(~mu_R- -> mu-  W+  ~chi_1-)
     2.01666412E-05    3        13       -24        1000037   # BR(~mu_R- -> mu-  W-  ~chi_2+)
     1.11587714E-04    3        13       24        -1000037   # BR(~mu_R- -> mu-  W+  ~chi_2-)
#
#         PDG            Width
DECAY   1000015     3.85540218E+00   # stau_1 decays
#          BR         NDA      ID1       ID2
     5.04151340E-01    2     1000022        15   # BR(~tau_1 -> ~chi_10  tau-)
     4.94375983E-01    2     1000023        15   # BR(~tau_1 -> ~chi_20  tau-)
     1.47267686E-03    2    -1000024        16   # BR(~tau_1 -> ~chi_1-  nu_tau)
#
#         PDG            Width
DECAY   2000015     1.96028237E+01   # stau_2 decays
#          BR         NDA      ID1       ID2
     2.43007832E-01    2     1000022        15   # BR(~tau_2 -> ~chi_10  tau-)
     2.41115614E-01    2     1000023        15   # BR(~tau_2 -> ~chi_20  tau-)
     6.46243162E-05    2     1000025        15   # BR(~tau_2 -> ~chi_30  tau-)
     4.83785384E-01    2    -1000024        16   # BR(~tau_2 -> ~chi_1-  nu_tau)
     1.29470066E-04    2    -1000037        16   # BR(~tau_2 -> ~chi_2-  nu_tau)
     1.57076560E-02    2     1000016       -24   # BR(~tau_2 -> ~nu_tauL W-)
     8.17392607E-03    2     1000015        25   # BR(~tau_2 -> ~tau_1   h)
     8.01549257E-03    2     1000015        23   # BR(~tau_2 -> ~tau_1   Z)
#
#         PDG            Width
DECAY   1000012     6.52072453E-02   # snu_eL decays
#          BR         NDA      ID1       ID2
     1.38123227E-01    2     1000022        12   # BR(~nu_eL -> ~chi_10 nu_e)
     3.58243969E-02    2     1000023        12   # BR(~nu_eL -> ~chi_20 nu_e)
     8.26052376E-01    2     1000024        11   # BR(~nu_eL -> ~chi_1+ e-)
#
#         PDG            Width
DECAY   1000014     6.52072446E-02   # snu_muL decays
#          BR         NDA      ID1       ID2
     1.38123229E-01    2     1000022        14   # BR(~nu_muL -> ~chi_10 nu_mu)
     3.58243974E-02    2     1000023        14   # BR(~nu_muL -> ~chi_20 nu_mu)
     8.26052374E-01    2     1000024        13   # BR(~nu_muL -> ~chi_1+ mu-)
#
#         PDG            Width
DECAY   1000016     3.86385926E+00   # snu_tauL decays
#          BR         NDA      ID1       ID2
     1.62323908E-03    2     1000022        16   # BR(~nu_tauL -> ~chi_10 nu_tau)
     4.19832119E-04    2     1000023        16   # BR(~nu_tauL -> ~chi_20 nu_tau)
     9.97956929E-01    2     1000024        15   # BR(~nu_tauL -> ~chi_1+ tau-)
#
#         PDG            Width
DECAY   1000024     1.10197815E-11   # chargino1+ decays
#           BR         NDA      ID1       ID2       ID3
     5.99997027E-01    3     1000022         2        -1   # BR(~chi_1+ -> ~chi_10 u    db)
     2.00001486E-01    3     1000022       -11        12   # BR(~chi_1+ -> ~chi_10 e+   nu_e)
     2.00001486E-01    3     1000022       -13        14   # BR(~chi_1+ -> ~chi_10 mu+  nu_mu)
#
#         PDG            Width
DECAY   1000037     1.80251288E+01   # chargino2+ decays
#          BR         NDA      ID1       ID2
     2.25978321E-02    2     1000012       -11   # BR(~chi_2+ -> ~nu_eL   e+  )
     2.25978321E-02    2     1000014       -13   # BR(~chi_2+ -> ~nu_muL mu+ )
     1.02382901E-01    2     1000016       -15   # BR(~chi_2+ -> ~nu_tau1 tau+)
     2.22069051E-02    2    -1000011        12   # BR(~chi_2+ -> ~e_L+    nu_e)
     2.22069051E-02    2    -1000013        14   # BR(~chi_2+ -> ~mu_L+   nu_mu)
     1.01880747E-01    2    -1000015        16   # BR(~chi_2+ -> ~tau_1+  nu_tau)
     1.79541133E-01    2     1000024        23   # BR(~chi_2+ -> ~chi_1+  Z )
     1.74083139E-01    2     1000022        24   # BR(~chi_2+ -> ~chi_10  W+)
     1.75579306E-01    2     1000023        24   # BR(~chi_2+ -> ~chi_20  W+)
     1.76923301E-01    2     1000024        25   # BR(~chi_2+ -> ~chi_1+  h )
#
#         PDG            Width
DECAY   1000022     0.00000000E+00   # neutralino1 decays
#
#         PDG            Width
DECAY   1000023     1.17993753E-09   # neutralino2 decays
#          BR         NDA      ID1       ID2
     7.51577942E-02    2     1000022        22   # BR(~chi_20 -> ~chi_10 gam)
#           BR         NDA      ID1       ID2       ID3
     1.13982364E-01    3     1000022        -2         2   # BR(~chi_20 -> ~chi_10 ub      u)
     1.47892853E-01    3     1000022        -1         1   # BR(~chi_20 -> ~chi_10 db      d)
     1.13982364E-01    3     1000022        -4         4   # BR(~chi_20 -> ~chi_10 cb      c)
     1.47892853E-01    3     1000022        -3         3   # BR(~chi_20 -> ~chi_10 sb      s)
     3.39367204E-02    3     1000022       -11        11   # BR(~chi_20 -> ~chi_10 e+      e-)
     3.39367204E-02    3     1000022       -13        13   # BR(~chi_20 -> ~chi_10 mu+     mu-)
     2.84608185E-03    3     1000022       -15        15   # BR(~chi_20 -> ~chi_10 tau+    tau-)
     6.78489240E-02    3     1000022       -12        12   # BR(~chi_20 -> ~chi_10 nu_eb   nu_e)
     6.78489240E-02    3     1000022       -14        14   # BR(~chi_20 -> ~chi_10 nu_mub  nu_mu)
     6.78492833E-02    3     1000022       -16        16   # BR(~chi_20 -> ~chi_10 nu_taub nu_tau)
     2.36812875E-02    3     1000024        -2         1   # BR(~chi_20 -> ~chi_1+ ub      d)
     2.36812875E-02    3    -1000024        -1         2   # BR(~chi_20 -> ~chi_1- db      u)
     2.36812875E-02    3     1000024        -4         3   # BR(~chi_20 -> ~chi_1+ cb      s)
     2.36812875E-02    3    -1000024        -3         4   # BR(~chi_20 -> ~chi_1- sb      c)
     7.89378106E-03    3     1000024       -12        11   # BR(~chi_20 -> ~chi_1+ nu_eb   e-)
     7.89378106E-03    3    -1000024        12       -11   # BR(~chi_20 -> ~chi_1- nu_e    e+)
     7.89378106E-03    3     1000024       -14        13   # BR(~chi_20 -> ~chi_1+ nu_mub  mu-)
     7.89378106E-03    3    -1000024        14       -13   # BR(~chi_20 -> ~chi_1- nu_mu   mu+)
     2.62421439E-04    3     1000024       -16        15   # BR(~chi_20 -> ~chi_1+ nu_taub tau-)
     2.62421439E-04    3    -1000024        16       -15   # BR(~chi_20 -> ~chi_1- nu_tau  tau+)
#
#         PDG            Width
DECAY   1000025     1.80208657E+01   # neutralino3 decays
#          BR         NDA      ID1       ID2
     4.39624012E-02    2     1000022        23   # BR(~chi_30 -> ~chi_10   Z )
     1.35335922E-01    2     1000023        23   # BR(~chi_30 -> ~chi_20   Z )
     1.75756616E-01    2     1000024       -24   # BR(~chi_30 -> ~chi_1+   W-)
     1.75756616E-01    2    -1000024        24   # BR(~chi_30 -> ~chi_1-   W+)
     1.32718464E-01    2     1000022        25   # BR(~chi_30 -> ~chi_10   h )
     4.27427287E-02    2     1000023        25   # BR(~chi_30 -> ~chi_20   h )
     1.10549455E-02    2     1000011       -11   # BR(~chi_30 -> ~e_L-     e+)
     1.10549455E-02    2    -1000011        11   # BR(~chi_30 -> ~e_L+     e-)
     1.10549455E-02    2     1000013       -13   # BR(~chi_30 -> ~mu_L-    mu+)
     1.10549455E-02    2    -1000013        13   # BR(~chi_30 -> ~mu_L+    mu-)
     5.07710259E-02    2     1000015       -15   # BR(~chi_30 -> ~tau_1-   tau+)
     5.07710259E-02    2    -1000015        15   # BR(~chi_30 -> ~tau_1+   tau-)
     1.13223477E-02    2     1000012       -12   # BR(~chi_30 -> ~nu_eL    nu_eb)
     1.13223477E-02    2    -1000012        12   # BR(~chi_30 -> ~nu_eL*   nu_e )
     1.13223477E-02    2     1000014       -14   # BR(~chi_30 -> ~nu_muL   nu_mub)
     1.13223477E-02    2    -1000014        14   # BR(~chi_30 -> ~nu_muL*  nu_mu )
     5.13380135E-02    2     1000016       -16   # BR(~chi_30 -> ~nu_tau1  nu_taub)
     5.13380135E-02    2    -1000016        16   # BR(~chi_30 -> ~nu_tau1* nu_tau )
#
#         PDG            Width
DECAY   1000035     5.89113015E+01   # neutralino4 decays
#          BR         NDA      ID1       ID2
     2.12713781E-02    2     1000022        23   # BR(~chi_40 -> ~chi_10   Z )
     1.50621879E-02    2     1000023        23   # BR(~chi_40 -> ~chi_20   Z )
     6.07077763E-05    2     1000025        23   # BR(~chi_40 -> ~chi_30   Z )
     3.53086706E-02    2     1000024       -24   # BR(~chi_40 -> ~chi_1+   W-)
     3.53086706E-02    2    -1000024        24   # BR(~chi_40 -> ~chi_1-   W+)
     6.78653804E-05    2     1000037       -24   # BR(~chi_40 -> ~chi_2+   W-)
     6.78653804E-05    2    -1000037        24   # BR(~chi_40 -> ~chi_2-   W+)
     1.63364770E-02    2     1000022        25   # BR(~chi_40 -> ~chi_10   h )
     2.36933446E-02    2     1000023        25   # BR(~chi_40 -> ~chi_20   h )
     1.14363196E-05    2     1000025        25   # BR(~chi_40 -> ~chi_30   h )
     2.88760476E-03    2     1000002        -2   # BR(~chi_40 -> ~u_L      ub)
     2.88760476E-03    2    -1000002         2   # BR(~chi_40 -> ~u_L*     u )
     5.25702901E-03    2     2000002        -2   # BR(~chi_40 -> ~u_R      ub)
     5.25702901E-03    2    -2000002         2   # BR(~chi_40 -> ~u_R*     u )
     2.89399013E-03    2     1000001        -1   # BR(~chi_40 -> ~d_L      db)
     2.89399013E-03    2    -1000001         1   # BR(~chi_40 -> ~d_L*     d )
     3.28113977E-02    2     2000001        -1   # BR(~chi_40 -> ~d_R      db)
     3.28113977E-02    2    -2000001         1   # BR(~chi_40 -> ~d_R*     d )
     2.88760196E-03    2     1000004        -4   # BR(~chi_40 -> ~c_L      cb)
     2.88760196E-03    2    -1000004         4   # BR(~chi_40 -> ~c_L*     c )
     5.25695769E-03    2     2000004        -4   # BR(~chi_40 -> ~c_R      cb)
     5.25695769E-03    2    -2000004         4   # BR(~chi_40 -> ~c_R*     c )
     2.89399013E-03    2     1000003        -3   # BR(~chi_40 -> ~s _L      sb)
     2.89399013E-03    2    -1000003         3   # BR(~chi_40 -> ~s _L*     s )
     3.28113977E-02    2     2000003        -3   # BR(~chi_40 -> ~s _R      sb)
     3.28113977E-02    2    -2000003         3   # BR(~chi_40 -> ~s _R*     s )
     1.25269617E-02    2     1000006        -6   # BR(~chi_40 -> ~t_1      tb)
     1.25269617E-02    2    -1000006         6   # BR(~chi_40 -> ~t_1*     t )
     5.94472805E-02    2     2000006        -6   # BR(~chi_40 -> ~t_2      tb)
     5.94472805E-02    2    -2000006         6   # BR(~chi_40 -> ~t_2*     t )
     7.35262534E-03    2     1000005        -5   # BR(~chi_40 -> ~b_1      bb)
     7.35262534E-03    2    -1000005         5   # BR(~chi_40 -> ~b_1*     b )
     2.96937417E-02    2     1000011       -11   # BR(~chi_40 -> ~e_L-     e+)
     2.96937417E-02    2    -1000011        11   # BR(~chi_40 -> ~e_L+     e-)
     1.55271030E-03    2     2000011       -11   # BR(~chi_40 -> ~e_R-     e+)
     1.55271030E-03    2    -2000011        11   # BR(~chi_40 -> ~e_R+     e-)
     2.96937417E-02    2     1000013       -13   # BR(~chi_40 -> ~mu_L-    mu+)
     2.96937417E-02    2    -1000013        13   # BR(~chi_40 -> ~mu_L+    mu-)
     1.55271030E-03    2     2000013       -13   # BR(~chi_40 -> ~mu_R-    mu+)
     1.55271030E-03    2    -2000013        13   # BR(~chi_40 -> ~mu_R+    mu-)
     3.35988296E-02    2     1000015       -15   # BR(~chi_40 -> ~tau_1-   tau+)
     3.35988296E-02    2    -1000015        15   # BR(~chi_40 -> ~tau_1+   tau-)
     7.00766641E-02    2     2000015       -15   # BR(~chi_40 -> ~tau_2-   tau+)
     7.00766641E-02    2    -2000015        15   # BR(~chi_40 -> ~tau_2+   tau-)
     2.97714892E-02    2     1000012       -12   # BR(~chi_40 -> ~nu_eL    nu_eb)
     2.97714892E-02    2    -1000012        12   # BR(~chi_40 -> ~nu_eL*   nu_e )
     2.97714892E-02    2     1000014       -14   # BR(~chi_40 -> ~nu_muL   nu_mub)
     2.97714892E-02    2    -1000014        14   # BR(~chi_40 -> ~nu_muL*  nu_mu )
     3.36674853E-02    2     1000016       -16   # BR(~chi_40 -> ~nu_tau1  nu_taub)
     3.36674853E-02    2    -1000016        16   # BR(~chi_40 -> ~nu_tau1* nu_tau )
#
#         PDG            Width
DECAY        25     4.15081862E-03   # h decays
#          BR         NDA      ID1       ID2
     5.63773703E-01    2           5        -5   # BR(h -> b       bb     )
     6.32606111E-02    2         -15        15   # BR(h -> tau+    tau-   )
     2.23918008E-04    2         -13        13   # BR(h -> mu+     mu-    )
     2.43934726E-04    2           3        -3   # BR(h -> s       sb     )
     2.10931554E-02    2           4        -4   # BR(h -> c       cb     )
     7.96338810E-02    2          21        21   # BR(h -> g       g      )
     2.38443988E-03    2          22        22   # BR(h -> gam     gam    )
     1.71449426E-03    2          22        23   # BR(h -> Z       gam    )
     2.37337316E-01    2          24       -24   # BR(h -> W+      W-     )
     3.03345462E-02    2          23        23   # BR(h -> Z       Z      )
#
#         PDG            Width
DECAY        35     1.50278603E+02   # H decays
#          BR         NDA      ID1       ID2
     6.66008365E-01    2           5        -5   # BR(H -> b       bb     )
     1.01344029E-01    2         -15        15   # BR(H -> tau+    tau-   )
     3.63853104E-04    2         -13        13   # BR(H -> mu+     mu-    )
     2.67054549E-04    2           3        -3   # BR(H -> s       sb     )
     4.90424904E-09    2           4        -4   # BR(H -> c       cb     )
     4.83983028E-04    2           6        -6   # BR(H -> t       tb     )
     7.59011268E-06    2          21        21   # BR(H -> g       g      )
     1.14762968E-08    2          22        22   # BR(H -> gam     gam    )
     4.35356020E-09    2          23        22   # BR(H -> Z       gam    )
     1.34026891E-07    2          24       -24   # BR(H -> W+      W-     )
     6.68986146E-08    2          23        23   # BR(H -> Z       Z      )
     4.46234317E-07    2          25        25   # BR(H -> h       h      )
     1.16548238E-03    2     1000024  -1000024   # BR(H -> ~chi_1+ ~chi_1-)
     1.45273250E-05    2     1000037  -1000037   # BR(H -> ~chi_2+ ~chi_2-)
     7.21166436E-02    2     1000024  -1000037   # BR(H -> ~chi_1+ ~chi_2-)
     7.21166436E-02    2     1000037  -1000024   # BR(H -> ~chi_2+ ~chi_1-)
     1.91636985E-04    2     1000022   1000022   # BR(H -> ~chi_10 ~chi_10)
     5.48374528E-05    2     1000023   1000023   # BR(H -> ~chi_20 ~chi_20)
     7.27422016E-06    2     1000025   1000025   # BR(H -> ~chi_30 ~chi_30)
     2.77466408E-05    2     1000022   1000023   # BR(H -> ~chi_10 ~chi_20)
     3.08698517E-02    2     1000022   1000025   # BR(H -> ~chi_10 ~chi_30)
     4.14501466E-02    2     1000023   1000025   # BR(H -> ~chi_20 ~chi_30)
     1.48700678E-04    2     1000006  -1000006   # BR(H -> ~t_1    ~t_1*  )
     2.56120787E-09    2     2000001  -2000001   # BR(H -> ~d_R    ~d_R*  )
     2.56120787E-09    2     2000003  -2000003   # BR(H -> ~s_R    ~s_R*  )
     3.91262297E-07    2     1000005  -1000005   # BR(H -> ~b_1    ~b_1*  )
     1.63817502E-08    2     1000011  -1000011   # BR(H -> ~e_L-   ~e_L+  )
     1.63817502E-08    2     1000013  -1000013   # BR(H -> ~mu_L-  ~mu_L+ )
     5.03636791E-06    2     1000015  -1000015   # BR(H -> ~tau_1- ~tau_1+)
     6.67766549E-03    2     1000015  -2000015   # BR(H -> ~tau_1- ~tau_2+)
     6.67766549E-03    2     2000015  -1000015   # BR(H -> ~tau_2- ~tau_1+)
     5.33536052E-08    2     1000012  -1000012   # BR(H -> ~nu_eL  ~nu_eL*   )
     5.33536052E-08    2     1000014  -1000014   # BR(H -> ~nu_muL ~nu_muL*  )
     6.29755462E-08    2     1000016  -1000016   # BR(H -> ~nu_tauL ~nu_tauL*)
#
#         PDG            Width
DECAY        36     1.50257141E+02   # A decays
#          BR         NDA      ID1       ID2
     6.66113597E-01    2           5        -5   # BR(A -> b       bb     )
     1.01358832E-01    2         -15        15   # BR(A -> tau+    tau-   )
     3.63905936E-04    2         -13        13   # BR(A -> mu+     mu-    )
     2.67102290E-04    2           3        -3   # BR(A -> s       sb     )
     4.93556032E-09    2           4        -4   # BR(A -> c       cb     )
     4.85080472E-04    2           6        -6   # BR(A -> t       tb     )
     1.25471763E-05    2          21        21   # BR(A -> g       g      )
     2.56215424E-08    2          22        22   # BR(A -> gam     gam    )
     9.67960832E-09    2          23        22   # BR(A -> Z       gam    )
     1.35984935E-07    2          23        25   # BR(A -> Z       h      )
     1.24970967E-03    2     1000024  -1000024   # BR(A -> ~chi_1+ ~chi_1-)
     6.24747957E-05    2     1000037  -1000037   # BR(A -> ~chi_2+ ~chi_2-)
     7.20573162E-02    2     1000024  -1000037   # BR(A -> ~chi_1+ ~chi_2-)
     7.20573162E-02    2     1000037  -1000024   # BR(A -> ~chi_2+ ~chi_1-)
     2.18831660E-04    2     1000022   1000022   # BR(A -> ~chi_10 ~chi_10)
     5.25842013E-05    2     1000023   1000023   # BR(A -> ~chi_20 ~chi_20)
     3.12417663E-05    2     1000025   1000025   # BR(A -> ~chi_30 ~chi_30)
     2.01128341E-05    2     1000022   1000023   # BR(A -> ~chi_10 ~chi_20)
     4.16486749E-02    2     1000022   1000025   # BR(A -> ~chi_10 ~chi_30)
     3.06361148E-02    2     1000023   1000025   # BR(A -> ~chi_20 ~chi_30)
     6.68219082E-03    2     1000015  -2000015   # BR(A -> ~tau_1- ~tau_2+)
     6.68219082E-03    2    -1000015   2000015   # BR(A -> ~tau_1+ ~tau_2-)
#
#         PDG            Width
DECAY        37     1.52129489E+02   # H+ decays
#          BR         NDA      ID1       ID2
     1.12557742E-03    2           4        -5   # BR(H+ -> c       bb     )
     1.00137429E-01    2         -15        16   # BR(H+ -> tau+    nu_tau )
     3.59520764E-04    2         -13        14   # BR(H+ -> mu+     nu_mu  )
     1.12557659E-05    2           2        -5   # BR(H+ -> u       bb     )
     1.32050620E-05    2           2        -3   # BR(H+ -> u       sb     )
     2.59920405E-04    2           4        -3   # BR(H+ -> c       sb     )
     6.69543560E-01    2           6        -5   # BR(H+ -> t       bb     )
     1.34467605E-07    2          24        25   # BR(H+ -> W+      h      )
     8.59612414E-15    2          24        36   # BR(H+ -> W+      A      )
     1.02469871E-04    2     1000024   1000022   # BR(H+ -> ~chi_1+ ~chi_10)
     2.94670653E-04    2     1000024   1000023   # BR(H+ -> ~chi_1+ ~chi_20)
     7.14702861E-02    2     1000024   1000025   # BR(H+ -> ~chi_1+ ~chi_30)
     7.21143365E-02    2     1000037   1000022   # BR(H+ -> ~chi_2+ ~chi_10)
     7.12240004E-02    2     1000037   1000023   # BR(H+ -> ~chi_2+ ~chi_20)
     5.39958051E-13    2     1000037   1000025   # BR(H+ -> ~chi_2+ ~chi_30)
     6.35338222E-08    2    -1000011   1000012   # BR(H+ -> ~e_L+   ~nu_eL )
     6.35338222E-08    2    -1000013   1000014   # BR(H+ -> ~mu_L+  ~nu_muL)
     3.07578743E-06    2    -1000015   1000016   # BR(H+ -> ~tau_1+ ~nu_tauL)
     1.32276618E-02    2    -2000015   1000016   # BR(H+ -> ~tau_2+ ~nu_tauL)
     1.12769159E-04    2     1000006  -1000005   # BR(H+ -> ~t_1    ~b_1*  )
