##******************************************************************
##                      MadGraph/MadEvent                          *
##******************************************************************
## Les Houches friendly file for the (MS)SM parameters of MadGraph *
##      SM parameter set and decay widths produced by MSSMCalc     *
##******************************************************************
##*Please note the following IMPORTANT issues:                     *
##                                                                 *
##0. REFRAIN from editing this file by hand! Some of the parame-   *
##   ters are not independent. Always use a calculator.            *
##                                                                 *
##1. alpha_S(MZ) has been used in the calculation of the parameters*
##   This value is KEPT by madgraph when no pdf are used lpp(i)=0, *
##   but, for consistency, it will be reset by madgraph to the     *
##   value expected IF the pdfs for collisions with hadrons are    *
##   used.                                                         *
##                                                                 *
##2. Values of the charm and bottom kinematic (pole) masses are    *
##   those used in the matrix elements and phase space UNLESS they *
##   are set to ZERO from the start in the model (particles.dat)   *
##   This happens, for example,  when using 5-flavor QCD where     *
##   charm and bottom are treated as partons in the initial state  *
##   and a zero mass might be hardwired in the model definition.   *
##                                                                 *
##       The SUSY decays have calculated using SDECAY 1.1a         *
##                                                                 *
##******************************************************************
#
BLOCK DCINFO  # Decay Program information
     1   SDECAY      # decay calculator
     2   1.1a        # version number
#
BLOCK SPINFO  # Spectrum calculator information
     1   ISASUGRA                                          
     2   7.81                                              
#
BLOCK MODSEL  # Model selection
     1     1   #                                                 
#
BLOCK SMINPUTS  # Standard Model inputs
     1     1.25778332E+02   # alpha_em^-1(M_Z)^MSbar
     2     1.16570000E-05   # G_F [GeV^-2]
     3     1.17200002E-01   # alpha_S(M_Z)^MSbar
     4     8.93764874E+01   # M_Z pole mass
     6     1.54540821E+02   # mt pole mass
     7     1.94850223E+00   # mtau pole mass
#
BLOCK MINPAR  # Input parameters - minimal models
     1     6.00000000E+02   #   m_0               
     2     3.00000000E+02   #   m_{1/2}           
     3     1.00000000E+01   #   tan(beta)         
     4     1.00000000E+00   #   sign(mu)          
#
BLOCK EXTPAR  # Input parameters - non-minimal models
     0     2.21278347E+16   #   Input scale       
#
BLOCK MASS  # Mass Spectrum
# PDG code           mass       particle
         5     4.81955182E+00   # b-quark pole mass
         6     1.54540821E+02   # t-quark pole mass (not read by ME)
        24     7.71761851E+01   # W+
        25     1.11844620E+02   # h
        35     7.49062561E+02   # H
        36     7.43967712E+02   # A
        37     7.53755432E+02   # H+
   1000001     1.00000000E+03   # ~d_L
   2000001     1.00000000E+03   # ~d_R
   1000002     1.00000000E+03   # ~u_L
   2000002     1.00000000E+03   # ~u_R
   1000003     1.00000000E+03   # ~s_L
   2000003     1.00000000E+03   # ~s_R
   1000004     1.00000000E+03   # ~c_L
   2000004     1.00000000E+03   # ~c_R
   1000005     4.50000000E+03   # ~b_1
   2000005     4.50000000E+03   # ~b_2
   1000006     4.50000000E+03   # ~t_1
   2000006     4.50000000E+03   # ~t_2
   1000011     4.50000000E+03   # ~e_L
   2000011     4.50000000E+03   # ~e_R
   1000012     4.50000000E+03   # ~nu_eL
   1000013     4.50000000E+03   # ~mu_L
   2000013     4.50000000E+03   # ~mu_R
   1000014     4.50000000E+03   # ~nu_muL
   1000015     4.50000000E+03   # ~tau_1
   2000015     4.50000000E+03   # ~tau_2
   1000016     4.50000000E+03   # ~nu_tauL
   1000021     2.40000000E+03   # ~g
   1000022     0.00000000E+00   # ~chi_10
   1000023     4.50000000E+03   # ~chi_20
   1000025     4.50000000E+03   # ~chi_30
   1000035     4.50000000E+03   # ~chi_40
   1000024     4.50000000E+03   # ~chi_1+
   1000037     4.50000000E+03   # ~chi_2+
#
BLOCK NMIX  # Neutralino Mixing Matrix
  1  1     1.00000000E+00   # N_11
  1  2     0.00000000E+00   # N_12
  1  3     0.00000000E+00   # N_13
  1  4     0.00000000E+00   # N_14
  2  1     0.00000000E+00   # N_21
  2  2     1.00000000E+00   # N_22
  2  3     0.00000000E+00   # N_23
  2  4     0.00000000E+00   # N_24
  3  1     0.00000000E+00   # N_31
  3  2     0.00000000E+00   # N_32
  3  3     1.00000000E+00   # N_33
  3  4     0.00000000E+00   # N_34
  4  1     0.00000000E+00   # N_41
  4  2     0.00000000E+00   # N_42
  4  3     0.00000000E+00   # N_43
  4  4     1.00000000E+00   # N_44
#
BLOCK UMIX  # Chargino Mixing Matrix U
  1  1     1.00000000E+00   # U_11
  1  2     0.00000000E+00   # U_12
  2  1     0.00000000E+00   # U_21
  2  2     1.00000000E+00   # U_22
#
BLOCK VMIX  # Chargino Mixing Matrix V
  1  1     1.00000000E+00   # V_11
  1  2     0.00000000E+00   # V_12
  2  1     0.00000000E+00   # V_21
  2  2     1.00000000E+00   # V_22
#
BLOCK STOPMIX  # Stop Mixing Matrix
  1  1     1.00000000E+00   # O_{11}
  1  2     0.00000000E+00   # O_{12}
  2  1     0.00000000E+00   # O_{21}
  2  2     1.00000000E+00   # O_{22}
#
BLOCK SBOTMIX  # Sbottom Mixing Matrix
  1  1     1.00000000E+00   # O_{11}
  1  2     0.00000000E+00   # O_{12}
  2  1     0.00000000E+00   # O_{21}
  2  2     1.00000000E+00   # O_{22}
#
BLOCK STAUMIX  # Stau Mixing Matrix
  1  1     1.00000000E+00   # O_{11}
  1  2     0.00000000E+00   # O_{12}
  2  1     0.00000000E+00   # O_{21}
  2  2     1.00000000E+00   # O_{22}
#
BLOCK ALPHA  # Higgs mixing
          -1.02914833E-01   # Mixing angle in the neutral Higgs boson sector
#
BLOCK HMIX Q=  6.61219971E+02  # DRbar Higgs Parameters
     1     4.12454407E+02   #   mu(Q)             
     2     9.36003455E+00   #  tanb (extracted)   
     3     2.50607727E+02   #   Higgs vev at Q    
     4     5.53487938E+05   #   m_A^2(Q)          
#
BLOCK GAUGE Q=  6.61219971E+02  # The gauge couplings
     3     1.07717665E+00   # g3(Q) MSbar
#
BLOCK AU Q=  6.61219971E+02  # The trilinear couplings
  3  3    -5.32061523E+02   # A_t(Q) DRbar
#
BLOCK AD Q=  6.61219971E+02  # The trilinear couplings
  3  3    -8.07902039E+02   # A_b(Q) DRbar
#
BLOCK AE Q=  6.61219971E+02  # The trilinear couplings
  3  3    -1.81115051E+02   # A_tau(Q) DRbar
#
BLOCK YU Q=  6.61219971E+02  # The Yukawa couplings
  3  3     8.85841429E-01   # y_t(Q) DRbar
#
BLOCK YD Q=  6.61219971E+02  # The Yukawa couplings
  3  3     1.36232540E-01   # y_b(Q) DRbar
#
BLOCK YE Q=  6.61219971E+02  # The Yukawa couplings
  3  3     1.01981103E-01   # y_tau(Q) DRbar
#
BLOCK MSOFT Q=  6.61219971E+02  # The soft SUSY breaking masses at the scale Q
     1     1.24019547E+02   #   M_1(Q)            
     2     2.32185043E+02   #   M_2(Q)            
     3     6.86750671E+02   #   M_3(Q)            
    31     6.29402649E+02   #   MeL(Q)            
    32     6.29402649E+02   #   MmuL(Q)           
    33     6.26662476E+02   #   MtauL(Q)          
    34     6.08800842E+02   #   MeR(Q)            
    35     6.08800842E+02   #   MmuR(Q)           
    36     6.03154236E+02   #   MtauR(Q)          
    41     8.48326294E+02   #   MqL1(Q)           
    42     8.48326294E+02   #   MqL2(Q)           
    43     7.40788147E+02   #   MqL3(Q)           
    44     8.34092896E+02   #   MuR(Q)            
    45     8.34092896E+02   #   McR(Q)            
    46     5.90198242E+02   #   MtR(Q)            
    47     8.32408752E+02   #   MdR(Q)            
    48     8.32408752E+02   #   MsR(Q)            
    49     8.31454102E+02   #   MbR(Q)            
#
#
#
#                             =================
#                             |The decay table|
#                             =================
#
# - The multi-body decays for the inos, stops and sbottoms are included.
#
# - The SUSY decays of the top quark are included.
#
#
#         PDG            Width
DECAY        23     2.22422351E+00   # Z width (SM calculation)
DECAY        24     1.80891002E+00   # W width (SM calculation)
#
#         PDG            Width
DECAY         6     1.02218095E+00   # top decays
#          BR         NDA      ID1       ID2
     1.00000000E+00    2           5        24   # BR(t ->  b    W+)
     0.00000000E+00    2           5        37   # BR(t ->  b    H+)
     0.00000000E+00    2     1000006   1000022   # BR(t -> ~t_1 ~chi_10)
     0.00000000E+00    2     1000006   1000023   # BR(t -> ~t_1 ~chi_20)
     0.00000000E+00    2     1000006   1000025   # BR(t -> ~t_1 ~chi_30)
     0.00000000E+00    2     1000006   1000035   # BR(t -> ~t_1 ~chi_40)
     0.00000000E+00    2     2000006   1000022   # BR(t -> ~t_2 ~chi_10)
     0.00000000E+00    2     2000006   1000023   # BR(t -> ~t_2 ~chi_20)
     0.00000000E+00    2     2000006   1000025   # BR(t -> ~t_2 ~chi_30)
     0.00000000E+00    2     2000006   1000035   # BR(t -> ~t_2 ~chi_40)
#
#         PDG            Width
DECAY        25     1.65461618E-03   # h decays
#          BR         NDA      ID1       ID2
     1.47339152E-01    2          15       -15   # BR(H1 -> tau- tau+)
     7.81441417E-01    2           5        -5   # BR(H1 -> b bb)
     6.76395565E-02    2          24       -24   # BR(H1 -> W+ W-)
     3.57987419E-03    2          23        23   # BR(H1 -> Z Z)
#
#         PDG            Width
DECAY        35     1.26118245E+00   # H decays
#          BR         NDA      ID1       ID2
     1.21586159E-01    2          15       -15   # BR(H -> tau- tau+)
     2.21890882E-01    2           6        -6   # BR(H -> t tb)
     6.50784860E-01    2           5        -5   # BR(H -> b bb)
     1.26971778E-03    2          24       -24   # BR(H -> W+ W-)
     6.21230090E-04    2          23        23   # BR(H -> Z Z)
     0.00000000E+00    2          24       -37   # BR(H -> W+ H-)
     0.00000000E+00    2         -24        37   # BR(H -> W- H+)
     0.00000000E+00    2          37       -37   # BR(H -> H+ H-)
     3.84715146E-03    2          25        25   # BR(H -> h h)
     0.00000000E+00    2          36        36   # BR(H -> A A)
#
#         PDG            Width
DECAY        36     1.32606570E+00   # A decays
#          BR         NDA      ID1       ID2
     1.14768736E-01    2          15       -15   # BR(A -> tau- tau+)
     2.69728288E-01    2           6        -6   # BR(A -> t tb)
     6.14379413E-01    2           5        -5   # BR(A -> b bb)
     1.12356281E-03    2          23        25   # BR(A -> Z h)
     0.00000000E+00    2          23        35   # BR(A -> Z H)
     0.00000000E+00    2          24       -37   # BR(A -> W+ H-)
     0.00000000E+00    2         -24        37   # BR(A -> W- H+)
#
#         PDG            Width
DECAY        37     1.27808456E+00   # H+ decays
#          BR         NDA      ID1       ID2
     1.20644761E-01    2         -15        16   # BR(H+ -> tau+ nu_tau)
     8.78124903E-01    2           6        -5   # BR(H+ -> t bb)
     1.23033591E-03    2          24        25   # BR(H+ -> W+ h)
     0.00000000E+00    2          24        35   # BR(H+ -> W+ H)
     0.00000000E+00    2          24        36   # BR(H+ -> W+ A)
#
#         PDG            Width
DECAY   1000021     3.02673341E+02   # gluino decays
#          BR         NDA      ID1       ID2
     6.25000000E-02    2     1000001        -1   # BR(~g -> ~d_L  db)
     6.25000000E-02    2    -1000001         1   # BR(~g -> ~d_L* d )
     6.25000000E-02    2     2000001        -1   # BR(~g -> ~d_R  db)
     6.25000000E-02    2    -2000001         1   # BR(~g -> ~d_R* d )
     6.25000000E-02    2     1000002        -2   # BR(~g -> ~u_L  ub)
     6.25000000E-02    2    -1000002         2   # BR(~g -> ~u_L* u )
     6.25000000E-02    2     2000002        -2   # BR(~g -> ~u_R  ub)
     6.25000000E-02    2    -2000002         2   # BR(~g -> ~u_R* u )
     6.25000000E-02    2     1000003        -3   # BR(~g -> ~s_L  sb)
     6.25000000E-02    2    -1000003         3   # BR(~g -> ~s_L* s )
     6.25000000E-02    2     2000003        -3   # BR(~g -> ~s_R  sb)
     6.25000000E-02    2    -2000003         3   # BR(~g -> ~s_R* s )
     6.25000000E-02    2     1000004        -4   # BR(~g -> ~c_L  cb)
     6.25000000E-02    2    -1000004         4   # BR(~g -> ~c_L* c )
     6.25000000E-02    2     2000004        -4   # BR(~g -> ~c_R  cb)
     6.25000000E-02    2    -2000004         4   # BR(~g -> ~c_R* c )
     0.00000000E+00    2     1000005        -5   # BR(~g -> ~b_1  bb)
     0.00000000E+00    2    -1000005         5   # BR(~g -> ~b_1* b )
     0.00000000E+00    2     2000005        -5   # BR(~g -> ~b_2  bb)
     0.00000000E+00    2    -2000005         5   # BR(~g -> ~b_2* b )
     0.00000000E+00    2     1000006        -6   # BR(~g -> ~t_1  tb)
     0.00000000E+00    2    -1000006         6   # BR(~g -> ~t_1* t )
     0.00000000E+00    2     2000006        -6   # BR(~g -> ~t_2  tb)
     0.00000000E+00    2    -2000006         6   # BR(~g -> ~t_2* t )
#
#         PDG            Width
DECAY   1000006     1.41842987E+02   # stop1 decays
#          BR         NDA      ID1       ID2
     4.68728382E-03    2     1000022         6   # BR(~t_1 -> ~chi_10 t )
     0.00000000E+00    2     1000023         6   # BR(~t_1 -> ~chi_20 t )
     0.00000000E+00    2     1000025         6   # BR(~t_1 -> ~chi_30 t )
     0.00000000E+00    2     1000035         6   # BR(~t_1 -> ~chi_40 t )
     0.00000000E+00    2     1000024         5   # BR(~t_1 -> ~chi_1+ b )
     0.00000000E+00    2     1000037         5   # BR(~t_1 -> ~chi_2+ b )
     9.95312716E-01    2     1000021         6   # BR(~t_1 -> ~g      t )
     0.00000000E+00    2     1000005        37   # BR(~t_1 -> ~b_1    H+)
     0.00000000E+00    2     2000005        37   # BR(~t_1 -> ~b_2    H+)
     0.00000000E+00    2     1000005        24   # BR(~t_1 -> ~b_1    W+)
     0.00000000E+00    2     2000005        24   # BR(~t_1 -> ~b_2    W+)
#
#         PDG            Width
DECAY   2000006     1.51815862E+02   # stop2 decays
#          BR         NDA      ID1       ID2
     7.00699733E-02    2     1000022         6   # BR(~t_2 -> ~chi_10 t )
     0.00000000E+00    2     1000023         6   # BR(~t_2 -> ~chi_20 t )
     0.00000000E+00    2     1000025         6   # BR(~t_2 -> ~chi_30 t )
     0.00000000E+00    2     1000035         6   # BR(~t_2 -> ~chi_40 t )
     0.00000000E+00    2     1000024         5   # BR(~t_2 -> ~chi_1+ b )
     0.00000000E+00    2     1000037         5   # BR(~t_2 -> ~chi_2+ b )
     9.29930027E-01    2     1000021         6   # BR(~t_2 -> ~g      t )
     0.00000000E+00    2     1000006        25   # BR(~t_2 -> ~t_1    h )
     0.00000000E+00    2     1000006        35   # BR(~t_2 -> ~t_1    H )
     0.00000000E+00    2     1000006        36   # BR(~t_2 -> ~t_1    A )
     0.00000000E+00    2     1000005        37   # BR(~t_2 -> ~b_1    H+)
     0.00000000E+00    2     2000005        37   # BR(~t_2 -> ~b_2    H+)
     0.00000000E+00    2     1000006        23   # BR(~t_2 -> ~t_1    Z )
     0.00000000E+00    2     1000005        24   # BR(~t_2 -> ~b_1    W+)
     0.00000000E+00    2     2000005        24   # BR(~t_2 -> ~b_2    W+)
#
#         PDG            Width
DECAY   1000005     1.42497054E+02   # sbottom1 decays
#          BR         NDA      ID1       ID2
     4.67678338E-03    2     1000022         5   # BR(~b_1 -> ~chi_10 b )
     0.00000000E+00    2     1000023         5   # BR(~b_1 -> ~chi_20 b )
     0.00000000E+00    2     1000025         5   # BR(~b_1 -> ~chi_30 b )
     0.00000000E+00    2     1000035         5   # BR(~b_1 -> ~chi_40 b )
     0.00000000E+00    2    -1000024         6   # BR(~b_1 -> ~chi_1- t )
     0.00000000E+00    2    -1000037         6   # BR(~b_1 -> ~chi_2- t )
     9.95323217E-01    2     1000021         5   # BR(~b_1 -> ~g      b )
     0.00000000E+00    2     1000006       -37   # BR(~b_1 -> ~t_1    H-)
     0.00000000E+00    2     2000006       -37   # BR(~b_1 -> ~t_2    H-)
     0.00000000E+00    2     1000006       -24   # BR(~b_1 -> ~t_1    W-)
     0.00000000E+00    2     2000006       -24   # BR(~b_1 -> ~t_2    W-)
#
#         PDG            Width
DECAY   2000005     1.44496337E+02   # sbottom2 decays
#          BR         NDA      ID1       ID2
     1.84482975E-02    2     1000022         5   # BR(~b_2 -> ~chi_10 b )
     0.00000000E+00    2     1000023         5   # BR(~b_2 -> ~chi_20 b )
     0.00000000E+00    2     1000025         5   # BR(~b_2 -> ~chi_30 b )
     0.00000000E+00    2     1000035         5   # BR(~b_2 -> ~chi_40 b )
     0.00000000E+00    2    -1000024         6   # BR(~b_2 -> ~chi_1- t )
     0.00000000E+00    2    -1000037         6   # BR(~b_2 -> ~chi_2- t )
     9.81551703E-01    2     1000021         5   # BR(~b_2 -> ~g      b )
     0.00000000E+00    2     1000005        25   # BR(~b_2 -> ~b_1    h )
     0.00000000E+00    2     1000005        35   # BR(~b_2 -> ~b_1    H )
     0.00000000E+00    2     1000005        36   # BR(~b_2 -> ~b_1    A )
     0.00000000E+00    2     1000006       -37   # BR(~b_2 -> ~t_1    H-)
     0.00000000E+00    2     2000006       -37   # BR(~b_2 -> ~t_2    H-)
     0.00000000E+00    2     1000005        23   # BR(~b_2 -> ~b_1    Z )
     0.00000000E+00    2     1000006       -24   # BR(~b_2 -> ~t_1    W-)
     0.00000000E+00    2     2000006       -24   # BR(~b_2 -> ~t_2    W-)
#
#         PDG            Width
DECAY   1000002     1.48095418E-01   # sup_L decays
#          BR         NDA      ID1       ID2
     1.00000000E+00    2     1000022         2   # BR(~u_L -> ~chi_10 u)
     0.00000000E+00    2     1000023         2   # BR(~u_L -> ~chi_20 u)
     0.00000000E+00    2     1000025         2   # BR(~u_L -> ~chi_30 u)
     0.00000000E+00    2     1000035         2   # BR(~u_L -> ~chi_40 u)
     0.00000000E+00    2     1000024         1   # BR(~u_L -> ~chi_1+ d)
     0.00000000E+00    2     1000037         1   # BR(~u_L -> ~chi_2+ d)
     0.00000000E+00    2     1000021         2   # BR(~u_L -> ~g      u)
#
#         PDG            Width
DECAY   2000002     2.36952670E+00   # sup_R decays
#          BR         NDA      ID1       ID2
     1.00000000E+00    2     1000022         2   # BR(~u_R -> ~chi_10 u)
     0.00000000E+00    2     1000023         2   # BR(~u_R -> ~chi_20 u)
     0.00000000E+00    2     1000025         2   # BR(~u_R -> ~chi_30 u)
     0.00000000E+00    2     1000035         2   # BR(~u_R -> ~chi_40 u)
     0.00000000E+00    2     1000024         1   # BR(~u_R -> ~chi_1+ d)
     0.00000000E+00    2     1000037         1   # BR(~u_R -> ~chi_2+ d)
     0.00000000E+00    2     1000021         2   # BR(~u_R -> ~g      u)
#
#         PDG            Width
DECAY   1000001     1.48095418E-01   # sdown_L decays
#          BR         NDA      ID1       ID2
     1.00000000E+00    2     1000022         1   # BR(~d_L -> ~chi_10 d)
     0.00000000E+00    2     1000023         1   # BR(~d_L -> ~chi_20 d)
     0.00000000E+00    2     1000025         1   # BR(~d_L -> ~chi_30 d)
     0.00000000E+00    2     1000035         1   # BR(~d_L -> ~chi_40 d)
     0.00000000E+00    2    -1000024         2   # BR(~d_L -> ~chi_1- u)
     0.00000000E+00    2    -1000037         2   # BR(~d_L -> ~chi_2- u)
     0.00000000E+00    2     1000021         1   # BR(~d_L -> ~g      d)
#
#         PDG            Width
DECAY   2000001     5.92381674E-01   # sdown_R decays
#          BR         NDA      ID1       ID2
     1.00000000E+00    2     1000022         1   # BR(~d_R -> ~chi_10 d)
     0.00000000E+00    2     1000023         1   # BR(~d_R -> ~chi_20 d)
     0.00000000E+00    2     1000025         1   # BR(~d_R -> ~chi_30 d)
     0.00000000E+00    2     1000035         1   # BR(~d_R -> ~chi_40 d)
     0.00000000E+00    2    -1000024         2   # BR(~d_R -> ~chi_1- u)
     0.00000000E+00    2    -1000037         2   # BR(~d_R -> ~chi_2- u)
     0.00000000E+00    2     1000021         1   # BR(~d_R -> ~g      d)
#
#         PDG            Width
DECAY   1000004     1.48095418E-01   # scharm_L decays
#          BR         NDA      ID1       ID2
     1.00000000E+00    2     1000022         4   # BR(~c_L -> ~chi_10 c)
     0.00000000E+00    2     1000023         4   # BR(~c_L -> ~chi_20 c)
     0.00000000E+00    2     1000025         4   # BR(~c_L -> ~chi_30 c)
     0.00000000E+00    2     1000035         4   # BR(~c_L -> ~chi_40 c)
     0.00000000E+00    2     1000024         3   # BR(~c_L -> ~chi_1+ s)
     0.00000000E+00    2     1000037         3   # BR(~c_L -> ~chi_2+ s)
     0.00000000E+00    2     1000021         4   # BR(~c_L -> ~g      c)
#
#         PDG            Width
DECAY   2000004     2.36952670E+00   # scharm_R decays
#          BR         NDA      ID1       ID2
     1.00000000E+00    2     1000022         4   # BR(~c_R -> ~chi_10 c)
     0.00000000E+00    2     1000023         4   # BR(~c_R -> ~chi_20 c)
     0.00000000E+00    2     1000025         4   # BR(~c_R -> ~chi_30 c)
     0.00000000E+00    2     1000035         4   # BR(~c_R -> ~chi_40 c)
     0.00000000E+00    2     1000024         3   # BR(~c_R -> ~chi_1+ s)
     0.00000000E+00    2     1000037         3   # BR(~c_R -> ~chi_2+ s)
     0.00000000E+00    2     1000021         4   # BR(~c_R -> ~g      c)
#
#         PDG            Width
DECAY   1000003     1.48095418E-01   # sstrange_L decays
#          BR         NDA      ID1       ID2
     1.00000000E+00    2     1000022         3   # BR(~s_L -> ~chi_10 s)
     0.00000000E+00    2     1000023         3   # BR(~s_L -> ~chi_20 s)
     0.00000000E+00    2     1000025         3   # BR(~s_L -> ~chi_30 s)
     0.00000000E+00    2     1000035         3   # BR(~s_L -> ~chi_40 s)
     0.00000000E+00    2    -1000024         4   # BR(~s_L -> ~chi_1- c)
     0.00000000E+00    2    -1000037         4   # BR(~s_L -> ~chi_2- c)
     0.00000000E+00    2     1000021         3   # BR(~s_L -> ~g      s)
#
#         PDG            Width
DECAY   2000003     5.92381674E-01   # sstrange_R decays
#          BR         NDA      ID1       ID2
     1.00000000E+00    2     1000022         3   # BR(~s_R -> ~chi_10 s)
     0.00000000E+00    2     1000023         3   # BR(~s_R -> ~chi_20 s)
     0.00000000E+00    2     1000025         3   # BR(~s_R -> ~chi_30 s)
     0.00000000E+00    2     1000035         3   # BR(~s_R -> ~chi_40 s)
     0.00000000E+00    2    -1000024         4   # BR(~s_R -> ~chi_1- c)
     0.00000000E+00    2    -1000037         4   # BR(~s_R -> ~chi_2- c)
     0.00000000E+00    2     1000021         3   # BR(~s_R -> ~g      s)
#
#         PDG            Width
DECAY   1000011     5.99786445E+00   # selectron_L decays
#          BR         NDA      ID1       ID2
     1.00000000E+00    2     1000022        11   # BR(~e_L -> ~chi_10 e-)
     0.00000000E+00    2     1000023        11   # BR(~e_L -> ~chi_20 e-)
     0.00000000E+00    2     1000025        11   # BR(~e_L -> ~chi_30 e-)
     0.00000000E+00    2     1000035        11   # BR(~e_L -> ~chi_40 e-)
     0.00000000E+00    2    -1000024        12   # BR(~e_L -> ~chi_1- nu_e)
     0.00000000E+00    2    -1000037        12   # BR(~e_L -> ~chi_2- nu_e)
#
#         PDG            Width
DECAY   2000011     2.39914578E+01   # selectron_R decays
#          BR         NDA      ID1       ID2
     1.00000000E+00    2     1000022        11   # BR(~e_R -> ~chi_10 e-)
     0.00000000E+00    2     1000023        11   # BR(~e_R -> ~chi_20 e-)
     0.00000000E+00    2     1000025        11   # BR(~e_R -> ~chi_30 e-)
     0.00000000E+00    2     1000035        11   # BR(~e_R -> ~chi_40 e-)
     0.00000000E+00    2    -1000024        12   # BR(~e_R -> ~chi_1- nu_e)
     0.00000000E+00    2    -1000037        12   # BR(~e_R -> ~chi_2- nu_e)
#
#         PDG            Width
DECAY   1000013     5.99786445E+00   # smuon_L decays
#          BR         NDA      ID1       ID2
     1.00000000E+00    2     1000022        13   # BR(~mu_L -> ~chi_10 mu-)
     0.00000000E+00    2     1000023        13   # BR(~mu_L -> ~chi_20 mu-)
     0.00000000E+00    2     1000025        13   # BR(~mu_L -> ~chi_30 mu-)
     0.00000000E+00    2     1000035        13   # BR(~mu_L -> ~chi_40 mu-)
     0.00000000E+00    2    -1000024        14   # BR(~mu_L -> ~chi_1- nu_mu)
     0.00000000E+00    2    -1000037        14   # BR(~mu_L -> ~chi_2- nu_mu)
#
#         PDG            Width
DECAY   2000013     2.39914578E+01   # smuon_R decays
#          BR         NDA      ID1       ID2
     1.00000000E+00    2     1000022        13   # BR(~mu_R -> ~chi_10 mu-)
     0.00000000E+00    2     1000023        13   # BR(~mu_R -> ~chi_20 mu-)
     0.00000000E+00    2     1000025        13   # BR(~mu_R -> ~chi_30 mu-)
     0.00000000E+00    2     1000035        13   # BR(~mu_R -> ~chi_40 mu-)
     0.00000000E+00    2    -1000024        14   # BR(~mu_R -> ~chi_1- nu_mu)
     0.00000000E+00    2    -1000037        14   # BR(~mu_R -> ~chi_2- nu_mu)
#
#         PDG            Width
DECAY   1000015     5.99786220E+00   # stau_1 decays
#          BR         NDA      ID1       ID2
     1.00000000E+00    2     1000022        15   # BR(~tau_1 -> ~chi_10  tau-)
     0.00000000E+00    2     1000023        15   # BR(~tau_1 -> ~chi_20  tau-)
     0.00000000E+00    2     1000025        15   # BR(~tau_1 -> ~chi_30  tau-)
     0.00000000E+00    2     1000035        15   # BR(~tau_1 -> ~chi_40  tau-)
     0.00000000E+00    2    -1000024        16   # BR(~tau_1 -> ~chi_1-  nu_tau)
     0.00000000E+00    2    -1000037        16   # BR(~tau_1 -> ~chi_2-  nu_tau)
     0.00000000E+00    2     1000016       -37   # BR(~tau_1 -> ~nu_tauL H-)
     0.00000000E+00    2     1000016       -24   # BR(~tau_1 -> ~nu_tauL W-)
#
#         PDG            Width
DECAY   2000015     2.39914488E+01   # stau_2 decays
#          BR         NDA      ID1       ID2
     1.00000000E+00    2     1000022        15   # BR(~tau_2 -> ~chi_10  tau-)
     0.00000000E+00    2     1000023        15   # BR(~tau_2 -> ~chi_20  tau-)
     0.00000000E+00    2     1000025        15   # BR(~tau_2 -> ~chi_30  tau-)
     0.00000000E+00    2     1000035        15   # BR(~tau_2 -> ~chi_40  tau-)
     0.00000000E+00    2    -1000024        16   # BR(~tau_2 -> ~chi_1-  nu_tau)
     0.00000000E+00    2    -1000037        16   # BR(~tau_2 -> ~chi_2-  nu_tau)
     0.00000000E+00    2     1000016       -37   # BR(~tau_2 -> ~nu_tauL H-)
     0.00000000E+00    2     1000016       -24   # BR(~tau_2 -> ~nu_tauL W-)
     0.00000000E+00    2     1000015        25   # BR(~tau_2 -> ~tau_1 h)
     0.00000000E+00    2     1000015        35   # BR(~tau_2 -> ~tau_1 H)
     0.00000000E+00    2     1000015        36   # BR(~tau_2 -> ~tau_1 A)
     0.00000000E+00    2     1000015        23   # BR(~tau_2 -> ~tau_1 Z)
#
#         PDG            Width
DECAY   1000012     5.99786445E+00   # snu_eL decays
#          BR         NDA      ID1       ID2
     1.00000000E+00    2     1000022        12   # BR(~nu_eL -> ~chi_10 nu_e)
     0.00000000E+00    2     1000023        12   # BR(~nu_eL -> ~chi_20 nu_e)
     0.00000000E+00    2     1000025        12   # BR(~nu_eL -> ~chi_30 nu_e)
     0.00000000E+00    2     1000035        12   # BR(~nu_eL -> ~chi_40 nu_e)
     0.00000000E+00    2     1000024        11   # BR(~nu_eL -> ~chi_1+ e-)
     0.00000000E+00    2     1000037        11   # BR(~nu_eL -> ~chi_2+ e-)
#
#         PDG            Width
DECAY   1000014     5.99786445E+00   # snu_muL decays
#          BR         NDA      ID1       ID2
     1.00000000E+00    2     1000022        14   # BR(~nu_muL -> ~chi_10 nu_mu)
     0.00000000E+00    2     1000023        14   # BR(~nu_muL -> ~chi_20 nu_mu)
     0.00000000E+00    2     1000025        14   # BR(~nu_muL -> ~chi_30 nu_mu)
     0.00000000E+00    2     1000035        14   # BR(~nu_muL -> ~chi_40 nu_mu)
     0.00000000E+00    2     1000024        13   # BR(~nu_muL -> ~chi_1+ mu-)
     0.00000000E+00    2     1000037        13   # BR(~nu_muL -> ~chi_2+ mu-)
#
#         PDG            Width
DECAY   1000016     5.99786445E+00   # snu_tauL decays
#          BR         NDA      ID1       ID2
     1.00000000E+00    2     1000022        16   # BR(~nu_tauL -> ~chi_10 nu_tau)
     0.00000000E+00    2     1000023        16   # BR(~nu_tauL -> ~chi_20 nu_tau)
     0.00000000E+00    2     1000025        16   # BR(~nu_tauL -> ~chi_30 nu_tau)
     0.00000000E+00    2     1000035        16   # BR(~nu_tauL -> ~chi_40 nu_tau)
     0.00000000E+00    2     1000024        15   # BR(~nu_tauL -> ~chi_1+ tau-)
     0.00000000E+00    2     1000037        15   # BR(~nu_tauL -> ~chi_2+ tau-)
     0.00000000E+00    2    -1000015       -37   # BR(~nu_tauL -> ~tau_1+ H-)
     0.00000000E+00    2    -2000015       -37   # BR(~nu_tauL -> ~tau_2+ H-)
     0.00000000E+00    2    -1000015       -24   # BR(~nu_tauL -> ~tau_1+ W-)
     0.00000000E+00    2    -2000015       -24   # BR(~nu_tauL -> ~tau_2+ W-)
#
#         PDG            Width
DECAY   1000024     1.90648644E+02   # chargino1+ decays
#          BR         NDA      ID1       ID2
     2.50000000E-01    2     1000002        -1   # BR(~chi_1+ -> ~u_L   db)
     0.00000000E+00    2     2000002        -1   # BR(~chi_1+ -> ~u_R   db)
     2.50000000E-01    2    -1000001         2   # BR(~chi_1+ -> ~d_L*  u )
     0.00000000E+00    2    -2000001         2   # BR(~chi_1+ -> ~d_R*  u )
     2.50000000E-01    2     1000004        -3   # BR(~chi_1+ -> ~c_L   sb)
     0.00000000E+00    2     2000004        -3   # BR(~chi_1+ -> ~c_R   sb)
     2.50000000E-01    2    -1000003         4   # BR(~chi_1+ -> ~s_L*  c )
     0.00000000E+00    2    -2000003         4   # BR(~chi_1+ -> ~s_R*  c )
     0.00000000E+00    2     1000006        -5   # BR(~chi_1+ -> ~t_1   bb)
     0.00000000E+00    2     2000006        -5   # BR(~chi_1+ -> ~t_2   bb)
     0.00000000E+00    2    -1000005         6   # BR(~chi_1+ -> ~b_1*  t )
     0.00000000E+00    2    -2000005         6   # BR(~chi_1+ -> ~b_2*  t )
     0.00000000E+00    2     1000012       -11   # BR(~chi_1+ -> ~nu_eL  e+  )
     0.00000000E+00    2     1000014       -13   # BR(~chi_1+ -> ~nu_muL  mu+ )
     0.00000000E+00    2     1000016       -15   # BR(~chi_1+ -> ~nu_tau1 tau+)
     0.00000000E+00    2    -1000011        12   # BR(~chi_1+ -> ~e_L+    nu_e)
     0.00000000E+00    2    -2000011        12   # BR(~chi_1+ -> ~e_R+    nu_e)
     0.00000000E+00    2    -1000013        14   # BR(~chi_1+ -> ~mu_L+   nu_mu)
     0.00000000E+00    2    -2000013        14   # BR(~chi_1+ -> ~mu_R+   nu_mu)
     0.00000000E+00    2    -1000015        16   # BR(~chi_1+ -> ~tau_1+  nu_tau)
     0.00000000E+00    2    -2000015        16   # BR(~chi_1+ -> ~tau_2+  nu_tau)
     0.00000000E+00    2     1000022        24   # BR(~chi_1+ -> ~chi_10  W+)
     0.00000000E+00    2     1000023        24   # BR(~chi_1+ -> ~chi_20  W+)
     0.00000000E+00    2     1000025        24   # BR(~chi_1+ -> ~chi_30  W+)
     0.00000000E+00    2     1000035        24   # BR(~chi_1+ -> ~chi_40  W+)
     0.00000000E+00    2     1000022        37   # BR(~chi_1+ -> ~chi_10  H+)
     0.00000000E+00    2     1000023        37   # BR(~chi_1+ -> ~chi_20  H+)
     0.00000000E+00    2     1000025        37   # BR(~chi_1+ -> ~chi_30  H+)
     0.00000000E+00    2     1000035        37   # BR(~chi_1+ -> ~chi_40  H+)
#
#         PDG            Width
DECAY   1000037     2.83301290E+00   # chargino2+ decays
#          BR         NDA      ID1       ID2
     0.00000000E+00    2     1000002        -1   # BR(~chi_2+ -> ~u_L   db)
     0.00000000E+00    2     2000002        -1   # BR(~chi_2+ -> ~u_R   db)
     0.00000000E+00    2    -1000001         2   # BR(~chi_2+ -> ~d_L*  u )
     0.00000000E+00    2    -2000001         2   # BR(~chi_2+ -> ~d_R*  u )
     0.00000000E+00    2     1000004        -3   # BR(~chi_2+ -> ~c_L   sb)
     0.00000000E+00    2     2000004        -3   # BR(~chi_2+ -> ~c_R   sb)
     0.00000000E+00    2    -1000003         4   # BR(~chi_2+ -> ~s_L*  c )
     0.00000000E+00    2    -2000003         4   # BR(~chi_2+ -> ~s_R*  c )
     0.00000000E+00    2     1000006        -5   # BR(~chi_2+ -> ~t_1   bb)
     0.00000000E+00    2     2000006        -5   # BR(~chi_2+ -> ~t_2   bb)
     0.00000000E+00    2    -1000005         6   # BR(~chi_2+ -> ~b_1*  t )
     0.00000000E+00    2    -2000005         6   # BR(~chi_2+ -> ~b_2*  t )
     0.00000000E+00    2     1000012       -11   # BR(~chi_2+ -> ~nu_eL  e+  )
     0.00000000E+00    2     1000014       -13   # BR(~chi_2+ -> ~nu_muL  mu+ )
     0.00000000E+00    2     1000016       -15   # BR(~chi_2+ -> ~nu_tau1 tau+)
     0.00000000E+00    2    -1000011        12   # BR(~chi_2+ -> ~e_L+    nu_e)
     0.00000000E+00    2    -2000011        12   # BR(~chi_2+ -> ~e_R+    nu_e)
     0.00000000E+00    2    -1000013        14   # BR(~chi_2+ -> ~mu_L+   nu_mu)
     0.00000000E+00    2    -2000013        14   # BR(~chi_2+ -> ~mu_R+   nu_mu)
     0.00000000E+00    2    -1000015        16   # BR(~chi_2+ -> ~tau_1+  nu_tau)
     0.00000000E+00    2    -2000015        16   # BR(~chi_2+ -> ~tau_2+  nu_tau)
     0.00000000E+00    2     1000024        23   # BR(~chi_2+ -> ~chi_1+  Z )
     0.00000000E+00    2     1000022        24   # BR(~chi_2+ -> ~chi_10  W+)
     0.00000000E+00    2     1000023        24   # BR(~chi_2+ -> ~chi_20  W+)
     0.00000000E+00    2     1000025        24   # BR(~chi_2+ -> ~chi_30  W+)
     0.00000000E+00    2     1000035        24   # BR(~chi_2+ -> ~chi_40  W+)
     0.00000000E+00    2     1000024        25   # BR(~chi_2+ -> ~chi_1+  h )
     0.00000000E+00    2     1000024        35   # BR(~chi_2+ -> ~chi_1+  H )
     0.00000000E+00    2     1000024        36   # BR(~chi_2+ -> ~chi_1+  A )
     1.00000000E+00    2     1000022        37   # BR(~chi_2+ -> ~chi_10  H+)
     0.00000000E+00    2     1000023        37   # BR(~chi_2+ -> ~chi_20  H+)
     0.00000000E+00    2     1000025        37   # BR(~chi_2+ -> ~chi_30  H+)
     0.00000000E+00    2     1000035        37   # BR(~chi_2+ -> ~chi_40  H+)
#
#         PDG            Width
DECAY   1000022     0.00000000E+00   # neutralino1 decays
#
#         PDG            Width
DECAY   1000023     1.90648644E+02   # neutralino2 decays
#          BR         NDA      ID1       ID2
     0.00000000E+00    2     1000022        23   # BR(~chi_20 -> ~chi_10   Z )
     0.00000000E+00    2     1000024       -24   # BR(~chi_20 -> ~chi_1+   W-)
     0.00000000E+00    2    -1000024        24   # BR(~chi_20 -> ~chi_1-   W+)
     0.00000000E+00    2     1000037       -24   # BR(~chi_20 -> ~chi_2+   W-)
     0.00000000E+00    2    -1000037        24   # BR(~chi_20 -> ~chi_2-   W+)
     0.00000000E+00    2     1000022        25   # BR(~chi_20 -> ~chi_10   h )
     0.00000000E+00    2     1000022        35   # BR(~chi_20 -> ~chi_10   H )
     0.00000000E+00    2     1000022        36   # BR(~chi_20 -> ~chi_10   A )
     0.00000000E+00    2     1000024       -37   # BR(~chi_20 -> ~chi_1+   H-)
     0.00000000E+00    2    -1000024        37   # BR(~chi_20 -> ~chi_1-   H+)
     0.00000000E+00    2     1000037       -37   # BR(~chi_20 -> ~chi_2+   H-)
     0.00000000E+00    2    -1000037        37   # BR(~chi_20 -> ~chi_2-   H+)
     1.25000000E-01    2     1000002        -2   # BR(~chi_20 -> ~u_L      ub)
     1.25000000E-01    2    -1000002         2   # BR(~chi_20 -> ~u_L*     u )
     0.00000000E+00    2     2000002        -2   # BR(~chi_20 -> ~u_R      ub)
     0.00000000E+00    2    -2000002         2   # BR(~chi_20 -> ~u_R*     u )
     1.25000000E-01    2     1000001        -1   # BR(~chi_20 -> ~d_L      db)
     1.25000000E-01    2    -1000001         1   # BR(~chi_20 -> ~d_L*     d )
     0.00000000E+00    2     2000001        -1   # BR(~chi_20 -> ~d_R      db)
     0.00000000E+00    2    -2000001         1   # BR(~chi_20 -> ~d_R*     d )
     1.25000000E-01    2     1000004        -4   # BR(~chi_20 -> ~c_L      cb)
     1.25000000E-01    2    -1000004         4   # BR(~chi_20 -> ~c_L*     c )
     0.00000000E+00    2     2000004        -4   # BR(~chi_20 -> ~c_R      cb)
     0.00000000E+00    2    -2000004         4   # BR(~chi_20 -> ~c_R*     c )
     1.25000000E-01    2     1000003        -3   # BR(~chi_20 -> ~s_L      sb)
     1.25000000E-01    2    -1000003         3   # BR(~chi_20 -> ~s_L*     s )
     0.00000000E+00    2     2000003        -3   # BR(~chi_20 -> ~s_R      sb)
     0.00000000E+00    2    -2000003         3   # BR(~chi_20 -> ~s_R*     s )
     0.00000000E+00    2     1000006        -6   # BR(~chi_20 -> ~t_1      tb)
     0.00000000E+00    2    -1000006         6   # BR(~chi_20 -> ~t_1*     t )
     0.00000000E+00    2     2000006        -6   # BR(~chi_20 -> ~t_2      tb)
     0.00000000E+00    2    -2000006         6   # BR(~chi_20 -> ~t_2*     t )
     0.00000000E+00    2     1000005        -5   # BR(~chi_20 -> ~b_1      bb)
     0.00000000E+00    2    -1000005         5   # BR(~chi_20 -> ~b_1*     b )
     0.00000000E+00    2     2000005        -5   # BR(~chi_20 -> ~b_2      bb)
     0.00000000E+00    2    -2000005         5   # BR(~chi_20 -> ~b_2*     b )
     0.00000000E+00    2     1000011       -11   # BR(~chi_20 -> ~e_L-     e+)
     0.00000000E+00    2    -1000011        11   # BR(~chi_20 -> ~e_L+     e-)
     0.00000000E+00    2     2000011       -11   # BR(~chi_20 -> ~e_R-     e+)
     0.00000000E+00    2    -2000011        11   # BR(~chi_20 -> ~e_R+     e-)
     0.00000000E+00    2     1000013       -13   # BR(~chi_20 -> ~mu_L-    mu+)
     0.00000000E+00    2    -1000013        13   # BR(~chi_20 -> ~mu_L+    mu-)
     0.00000000E+00    2     2000013       -13   # BR(~chi_20 -> ~mu_R-    mu+)
     0.00000000E+00    2    -2000013        13   # BR(~chi_20 -> ~mu_R+    mu-)
     0.00000000E+00    2     1000015       -15   # BR(~chi_20 -> ~tau_1-   tau+)
     0.00000000E+00    2    -1000015        15   # BR(~chi_20 -> ~tau_1+   tau-)
     0.00000000E+00    2     2000015       -15   # BR(~chi_20 -> ~tau_2-   tau+)
     0.00000000E+00    2    -2000015        15   # BR(~chi_20 -> ~tau_2+   tau-)
     0.00000000E+00    2     1000012       -12   # BR(~chi_20 -> ~nu_eL    nu_eb)
     0.00000000E+00    2    -1000012        12   # BR(~chi_20 -> ~nu_eL*   nu_e )
     0.00000000E+00    2     1000014       -14   # BR(~chi_20 -> ~nu_muL   nu_mub)
     0.00000000E+00    2    -1000014        14   # BR(~chi_20 -> ~nu_muL*  nu_mu )
     0.00000000E+00    2     1000016       -16   # BR(~chi_20 -> ~nu_tau1  nu_taub)
     0.00000000E+00    2    -1000016        16   # BR(~chi_20 -> ~nu_tau1* nu_tau )
#
#         PDG            Width
DECAY   1000025     5.64194950E+00   # neutralino3 decays
#          BR         NDA      ID1       ID2
     0.00000000E+00    2     1000022        23   # BR(~chi_30 -> ~chi_10   Z )
     0.00000000E+00    2     1000023        23   # BR(~chi_30 -> ~chi_20   Z )
     0.00000000E+00    2     1000024       -24   # BR(~chi_30 -> ~chi_1+   W-)
     0.00000000E+00    2    -1000024        24   # BR(~chi_30 -> ~chi_1-   W+)
     0.00000000E+00    2     1000037       -24   # BR(~chi_30 -> ~chi_2+   W-)
     0.00000000E+00    2    -1000037        24   # BR(~chi_30 -> ~chi_2-   W+)
     5.60302891E-03    2     1000022        25   # BR(~chi_30 -> ~chi_10   h )
     4.97190227E-01    2     1000022        35   # BR(~chi_30 -> ~chi_10   H )
     4.97206744E-01    2     1000022        36   # BR(~chi_30 -> ~chi_10   A )
     0.00000000E+00    2     1000023        25   # BR(~chi_30 -> ~chi_20   h )
     0.00000000E+00    2     1000023        35   # BR(~chi_30 -> ~chi_20   H )
     0.00000000E+00    2     1000023        36   # BR(~chi_30 -> ~chi_20   A )
     0.00000000E+00    2     1000024       -37   # BR(~chi_30 -> ~chi_1+   H-)
     0.00000000E+00    2    -1000024        37   # BR(~chi_30 -> ~chi_1-   H+)
     0.00000000E+00    2     1000037       -37   # BR(~chi_30 -> ~chi_2+   H-)
     0.00000000E+00    2    -1000037        37   # BR(~chi_30 -> ~chi_2-   H+)
     0.00000000E+00    2     1000002        -2   # BR(~chi_30 -> ~u_L      ub)
     0.00000000E+00    2    -1000002         2   # BR(~chi_30 -> ~u_L*     u )
     0.00000000E+00    2     2000002        -2   # BR(~chi_30 -> ~u_R      ub)
     0.00000000E+00    2    -2000002         2   # BR(~chi_30 -> ~u_R*     u )
     0.00000000E+00    2     1000001        -1   # BR(~chi_30 -> ~d_L      db)
     0.00000000E+00    2    -1000001         1   # BR(~chi_30 -> ~d_L*     d )
     0.00000000E+00    2     2000001        -1   # BR(~chi_30 -> ~d_R      db)
     0.00000000E+00    2    -2000001         1   # BR(~chi_30 -> ~d_R*     d )
     0.00000000E+00    2     1000004        -4   # BR(~chi_30 -> ~c_L      cb)
     0.00000000E+00    2    -1000004         4   # BR(~chi_30 -> ~c_L*     c )
     0.00000000E+00    2     2000004        -4   # BR(~chi_30 -> ~c_R      cb)
     0.00000000E+00    2    -2000004         4   # BR(~chi_30 -> ~c_R*     c )
     0.00000000E+00    2     1000003        -3   # BR(~chi_30 -> ~s_L      sb)
     0.00000000E+00    2    -1000003         3   # BR(~chi_30 -> ~s_L*     s )
     0.00000000E+00    2     2000003        -3   # BR(~chi_30 -> ~s_R      sb)
     0.00000000E+00    2    -2000003         3   # BR(~chi_30 -> ~s_R*     s )
     0.00000000E+00    2     1000006        -6   # BR(~chi_30 -> ~t_1      tb)
     0.00000000E+00    2    -1000006         6   # BR(~chi_30 -> ~t_1*     t )
     0.00000000E+00    2     2000006        -6   # BR(~chi_30 -> ~t_2      tb)
     0.00000000E+00    2    -2000006         6   # BR(~chi_30 -> ~t_2*     t )
     0.00000000E+00    2     1000005        -5   # BR(~chi_30 -> ~b_1      bb)
     0.00000000E+00    2    -1000005         5   # BR(~chi_30 -> ~b_1*     b )
     0.00000000E+00    2     2000005        -5   # BR(~chi_30 -> ~b_2      bb)
     0.00000000E+00    2    -2000005         5   # BR(~chi_30 -> ~b_2*     b )
     0.00000000E+00    2     1000011       -11   # BR(~chi_30 -> ~e_L-     e+)
     0.00000000E+00    2    -1000011        11   # BR(~chi_30 -> ~e_L+     e-)
     0.00000000E+00    2     2000011       -11   # BR(~chi_30 -> ~e_R-     e+)
     0.00000000E+00    2    -2000011        11   # BR(~chi_30 -> ~e_R+     e-)
     0.00000000E+00    2     1000013       -13   # BR(~chi_30 -> ~mu_L-    mu+)
     0.00000000E+00    2    -1000013        13   # BR(~chi_30 -> ~mu_L+    mu-)
     0.00000000E+00    2     2000013       -13   # BR(~chi_30 -> ~mu_R-    mu+)
     0.00000000E+00    2    -2000013        13   # BR(~chi_30 -> ~mu_R+    mu-)
     0.00000000E+00    2     1000015       -15   # BR(~chi_30 -> ~tau_1-   tau+)
     0.00000000E+00    2    -1000015        15   # BR(~chi_30 -> ~tau_1+   tau-)
     0.00000000E+00    2     2000015       -15   # BR(~chi_30 -> ~tau_2-   tau+)
     0.00000000E+00    2    -2000015        15   # BR(~chi_30 -> ~tau_2+   tau-)
     0.00000000E+00    2     1000012       -12   # BR(~chi_30 -> ~nu_eL    nu_eb)
     0.00000000E+00    2    -1000012        12   # BR(~chi_30 -> ~nu_eL*   nu_e )
     0.00000000E+00    2     1000014       -14   # BR(~chi_30 -> ~nu_muL   nu_mub)
     0.00000000E+00    2    -1000014        14   # BR(~chi_30 -> ~nu_muL*  nu_mu )
     0.00000000E+00    2     1000016       -16   # BR(~chi_30 -> ~nu_tau1  nu_taub)
     0.00000000E+00    2    -1000016        16   # BR(~chi_30 -> ~nu_tau1* nu_tau )
#
#         PDG            Width
DECAY   1000035     3.02555690E+00   # neutralino4 decays
#          BR         NDA      ID1       ID2
     0.00000000E+00    2     1000022        23   # BR(~chi_40 -> ~chi_10   Z )
     0.00000000E+00    2     1000023        23   # BR(~chi_40 -> ~chi_20   Z )
     0.00000000E+00    2     1000025        23   # BR(~chi_40 -> ~chi_30   Z )
     0.00000000E+00    2     1000024       -24   # BR(~chi_40 -> ~chi_1+   W-)
     0.00000000E+00    2    -1000024        24   # BR(~chi_40 -> ~chi_1-   W+)
     0.00000000E+00    2     1000037       -24   # BR(~chi_40 -> ~chi_2+   W-)
     0.00000000E+00    2    -1000037        24   # BR(~chi_40 -> ~chi_2-   W+)
     9.79527518E-01    2     1000022        25   # BR(~chi_40 -> ~chi_10   h )
     9.88955030E-03    2     1000022        35   # BR(~chi_40 -> ~chi_10   H )
     1.05829313E-02    2     1000022        36   # BR(~chi_40 -> ~chi_10   A )
     0.00000000E+00    2     1000023        25   # BR(~chi_40 -> ~chi_20   h )
     0.00000000E+00    2     1000023        35   # BR(~chi_40 -> ~chi_20   H )
     0.00000000E+00    2     1000023        36   # BR(~chi_40 -> ~chi_20   A )
     0.00000000E+00    2     1000025        25   # BR(~chi_40 -> ~chi_30   h )
     0.00000000E+00    2     1000025        35   # BR(~chi_40 -> ~chi_30   H )
     0.00000000E+00    2     1000025        36   # BR(~chi_40 -> ~chi_30   A )
     0.00000000E+00    2     1000024       -37   # BR(~chi_40 -> ~chi_1+   H-)
     0.00000000E+00    2    -1000024        37   # BR(~chi_40 -> ~chi_1-   H+)
     0.00000000E+00    2     1000037       -37   # BR(~chi_40 -> ~chi_2+   H-)
     0.00000000E+00    2    -1000037        37   # BR(~chi_40 -> ~chi_2-   H+)
     0.00000000E+00    2     1000002        -2   # BR(~chi_40 -> ~u_L      ub)
     0.00000000E+00    2    -1000002         2   # BR(~chi_40 -> ~u_L*     u )
     0.00000000E+00    2     2000002        -2   # BR(~chi_40 -> ~u_R      ub)
     0.00000000E+00    2    -2000002         2   # BR(~chi_40 -> ~u_R*     u )
     0.00000000E+00    2     1000001        -1   # BR(~chi_40 -> ~d_L      db)
     0.00000000E+00    2    -1000001         1   # BR(~chi_40 -> ~d_L*     d )
     0.00000000E+00    2     2000001        -1   # BR(~chi_40 -> ~d_R      db)
     0.00000000E+00    2    -2000001         1   # BR(~chi_40 -> ~d_R*     d )
     0.00000000E+00    2     1000004        -4   # BR(~chi_40 -> ~c_L      cb)
     0.00000000E+00    2    -1000004         4   # BR(~chi_40 -> ~c_L*     c )
     0.00000000E+00    2     2000004        -4   # BR(~chi_40 -> ~c_R      cb)
     0.00000000E+00    2    -2000004         4   # BR(~chi_40 -> ~c_R*     c )
     0.00000000E+00    2     1000003        -3   # BR(~chi_40 -> ~s_L      sb)
     0.00000000E+00    2    -1000003         3   # BR(~chi_40 -> ~s_L*     s )
     0.00000000E+00    2     2000003        -3   # BR(~chi_40 -> ~s_R      sb)
     0.00000000E+00    2    -2000003         3   # BR(~chi_40 -> ~s_R*     s )
     0.00000000E+00    2     1000006        -6   # BR(~chi_40 -> ~t_1      tb)
     0.00000000E+00    2    -1000006         6   # BR(~chi_40 -> ~t_1*     t )
     0.00000000E+00    2     2000006        -6   # BR(~chi_40 -> ~t_2      tb)
     0.00000000E+00    2    -2000006         6   # BR(~chi_40 -> ~t_2*     t )
     0.00000000E+00    2     1000005        -5   # BR(~chi_40 -> ~b_1      bb)
     0.00000000E+00    2    -1000005         5   # BR(~chi_40 -> ~b_1*     b )
     0.00000000E+00    2     2000005        -5   # BR(~chi_40 -> ~b_2      bb)
     0.00000000E+00    2    -2000005         5   # BR(~chi_40 -> ~b_2*     b )
     0.00000000E+00    2     1000011       -11   # BR(~chi_40 -> ~e_L-     e+)
     0.00000000E+00    2    -1000011        11   # BR(~chi_40 -> ~e_L+     e-)
     0.00000000E+00    2     2000011       -11   # BR(~chi_40 -> ~e_R-     e+)
     0.00000000E+00    2    -2000011        11   # BR(~chi_40 -> ~e_R+     e-)
     0.00000000E+00    2     1000013       -13   # BR(~chi_40 -> ~mu_L-    mu+)
     0.00000000E+00    2    -1000013        13   # BR(~chi_40 -> ~mu_L+    mu-)
     0.00000000E+00    2     2000013       -13   # BR(~chi_40 -> ~mu_R-    mu+)
     0.00000000E+00    2    -2000013        13   # BR(~chi_40 -> ~mu_R+    mu-)
     0.00000000E+00    2     1000015       -15   # BR(~chi_40 -> ~tau_1-   tau+)
     0.00000000E+00    2    -1000015        15   # BR(~chi_40 -> ~tau_1+   tau-)
     0.00000000E+00    2     2000015       -15   # BR(~chi_40 -> ~tau_2-   tau+)
     0.00000000E+00    2    -2000015        15   # BR(~chi_40 -> ~tau_2+   tau-)
     0.00000000E+00    2     1000012       -12   # BR(~chi_40 -> ~nu_eL    nu_eb)
     0.00000000E+00    2    -1000012        12   # BR(~chi_40 -> ~nu_eL*   nu_e )
     0.00000000E+00    2     1000014       -14   # BR(~chi_40 -> ~nu_muL   nu_mub)
     0.00000000E+00    2    -1000014        14   # BR(~chi_40 -> ~nu_muL*  nu_mu )
     0.00000000E+00    2     1000016       -16   # BR(~chi_40 -> ~nu_tau1  nu_taub)
     0.00000000E+00    2    -1000016        16   # BR(~chi_40 -> ~nu_tau1* nu_tau )
