#
#                              ======================
#                              | THE SUSYHIT OUTPUT |
#                              ======================
#
#
#              ------------------------------------------------------
#              |     This is the output of the SUSY-HIT package     |
#              |  created by A.Djouadi, M.Muehlleitner and M.Spira. |
#              |  In case of problems with SUSY-HIT email to        |
#              |           margarete.muehlleitner@cern.ch           |
#              |           michael.spira@psi.ch                     |
#              |           abdelhak.djouadi@cern.ch                 |
#              ------------------------------------------------------
#
#              ------------------------------------------------------
#              |  SUSY Les Houches Accord - MSSM Spectrum + Decays  |
#              |              based on the decay programs           |
#              |                                                    |
#              |                     SDECAY 1.3b                    |
#              |                                                    |
#              |  Authors: M.Muhlleitner, A.Djouadi and Y.Mambrini  |
#              |  Ref.:    Comput.Phys.Commun.168(2005)46           |
#              |           [hep-ph/0311167]                         |
#              |                                                    |
#              |                     HDECAY 3.4                     |
#              |                                                    |
#              |  By: A.Djouadi,J.Kalinowski,M.Muhlleitner,M.Spira  |
#              |  Ref.:    Comput.Phys.Commun.108(1998)56           |
#              |           [hep-ph/9704448]                         |
#              |                                                    |
#              |                                                    |
#              |  If not stated otherwise all DRbar couplings and   |
#              |  soft SUSY breaking masses are given at the scale  |
#              |  Q=  0.24674080E+04
#              |                                                    |
#              ------------------------------------------------------
#
#
BLOCK DCINFO  # Decay Program information
     1   SDECAY/HDECAY # decay calculator
     2   1.3b  /3.4    # version number
#
BLOCK SPINFO  # Spectrum calculator information
     1     SOFTSUSY    # spectrum calculator               
     2     3.4.0       # version number                    
#
BLOCK MODSEL  # Model selection
     1     0   #  nonUniversal                                     
#
BLOCK SMINPUTS  # Standard Model inputs
         1     1.27908970E+02   # alpha_em^-1(M_Z)^MSbar
         2     1.16637870E-05   # G_F [GeV^-2]
         3     1.18400000E-01   # alpha_S(M_Z)^MSbar
         4     9.11876000E+01   # M_Z pole mass
         5     4.18000000E+00   # mb(mb)^MSbar
         6     1.73200000E+02   # mt pole mass
         7     1.77700000E+00   # mtau pole mass
#
BLOCK MINPAR  # Input parameters - minimal models
         3     4.82800000E+01   # tanb                
#
BLOCK EXTPAR  # Input parameters - non-minimal models
         0    -1.00000000E+00   # Set                 
         1    -6.37500000E+01   # M_1(MX)             
         2    -2.76921000E+03   # M_2(MX)             
         3     2.08952000E+03   # M_3(MX)             
        11    -3.52090000E+03   # At(MX)              
        12    -2.13193000E+03   # Ab(MX)              
        13    -1.46065000E+03   # Atau(MX)            
        23     1.27250000E+02   # mu(MX)              
        26     3.29919000E+03   # mA(pole)            
        31     3.63259000E+03   # meL(MX)             
        32     3.63259000E+03   # mmuL(MX)            
        33     2.83170000E+02   # mtauL(MX)           
        34     1.62230000E+03   # meR(MX)             
        35     1.62230000E+03   # mmuR(MX)            
        36     3.42192000E+03   # mtauR(MX)           
        41     3.19168000E+03   # mqL1(MX)            
        42     3.19168000E+03   # mqL2(MX)            
        43     2.03627000E+03   # mqL3(MX)            
        44     1.43087000E+03   # muR(MX)             
        45     1.43087000E+03   # mcR(MX)             
        46     2.99046000E+03   # mtR(MX)             
        47     1.40184000E+03   # mdR(MX)             
        48     1.40184000E+03   # msR(MX)             
        49     3.08800000E+02   # mbR(MX)             
#
BLOCK MASS  # Mass Spectrum
# PDG code           mass       particle
        24     8.03843794E+01   # W+
        25     1.26403143E+02   # h
        35     3.29919334E+03   # H
        36     3.29919017E+03   # A
        37     3.30060691E+03   # H+
         5     4.81876030E+00   # b-quark pole mass calculated from mb(mb)_Msbar
   1000001     3.25773142E+03   # ~d_L
   2000001     1.51019672E+03   # ~d_R
   1000002     3.25690380E+03   # ~u_L
   2000002     1.53754322E+03   # ~u_R
   1000003     3.25773142E+03   # ~s_L
   2000003     1.51019672E+03   # ~s_R
   1000004     3.25690380E+03   # ~c_L
   2000004     1.53754322E+03   # ~c_R
   1000005     5.15086848E+02   # ~b_1
   2000005     2.10792368E+03   # ~b_2
   1000006     2.09842163E+03   # ~t_1
   2000006     2.98939148E+03   # ~t_2
   1000011     3.64600290E+03   # ~e_L
   2000011     1.62437714E+03   # ~e_R
   1000012     3.64480802E+03   # ~nu_eL
   1000013     3.64600290E+03   # ~mu_L
   2000013     1.62437714E+03   # ~mu_R
   1000014     3.64480802E+03   # ~nu_muL
   1000015     3.43813000E+02   # ~tau_1
   2000015     3.41524856E+03   # ~tau_2
   1000016     3.34442041E+02   # ~nu_tauL
   1000021     2.22366082E+03   # ~g
   1000022    -5.62902708E+01   # ~chi_10
   1000023     1.39520897E+02   # ~chi_20
   1000025    -1.44300922E+02   # ~chi_30
   1000035    -2.79013908E+03   # ~chi_40
   1000024     1.33793088E+02   # ~chi_1+
   1000037     2.79030564E+03   # ~chi_2+
#
BLOCK NMIX  # Neutralino Mixing Matrix
  1  1     9.18982512E-01   # N_11
  1  2    -3.99838276E-03   # N_12
  1  3     3.65482351E-01   # N_13
  1  4     1.47911483E-01   # N_14
  2  1     1.57031662E-01   # N_21
  2  2    -1.95751138E-02   # N_22
  2  3    -6.83462141E-01   # N_23
  2  4     7.12627093E-01   # N_24
  3  1    -3.61679355E-01   # N_31
  3  2    -2.00247095E-02   # N_32
  3  3     6.31903166E-01   # N_33
  3  4     6.85190079E-01   # N_34
  4  1    -4.94365328E-04   # N_41
  4  2     9.99599839E-01   # N_42
  4  3     7.36461185E-04   # N_43
  4  4     2.82732092E-02   # N_44
#
BLOCK UMIX  # Chargino Mixing Matrix U
  1  1    -1.04678976E-03   # U_11
  1  2     9.99999452E-01   # U_12
  2  1    -9.99999452E-01   # U_21
  2  2    -1.04678976E-03   # U_22
#
BLOCK VMIX  # Chargino Mixing Matrix V
  1  1     4.00245262E-02   # V_11
  1  2     9.99198698E-01   # V_12
  2  1     9.99198698E-01   # V_21
  2  2    -4.00245262E-02   # V_22
#
BLOCK STOPMIX  # Stop Mixing Matrix
  1  1     9.93867133E-01   # cos(theta_t)
  1  2     1.10580839E-01   # sin(theta_t)
  2  1    -1.10580839E-01   # -sin(theta_t)
  2  2     9.93867133E-01   # cos(theta_t)
#
BLOCK SBOTMIX  # Sbottom Mixing Matrix
  1  1     4.41620910E-03   # cos(theta_b)
  1  2     9.99990249E-01   # sin(theta_b)
  2  1    -9.99990249E-01   # -sin(theta_b)
  2  2     4.41620910E-03   # cos(theta_b)
#
BLOCK STAUMIX  # Stau Mixing Matrix
  1  1     9.99999381E-01   # cos(theta_tau)
  1  2     1.11265431E-03   # sin(theta_tau)
  2  1    -1.11265431E-03   # -sin(theta_tau)
  2  2     9.99999381E-01   # cos(theta_tau)
#
BLOCK ALPHA  # Higgs mixing
          -2.10647346E-02   # Mixing angle in the neutral Higgs boson sector
#
BLOCK HMIX Q=  2.46740800E+03  # DRbar Higgs Parameters
         1     1.29985276E+02   # mu(Q)MSSM           
         2     4.75644405E+01   # tan                 
         3     2.42862919E+02   # higgs               
         4     1.07737093E+07   # mA^2(Q)MSSM         
#
BLOCK GAUGE Q=  2.46740800E+03  # The gauge couplings
     1     3.64968352E-01   # gprime(Q) DRbar
     2     6.38186522E-01   # g(Q) DRbar
     3     1.02309403E+00   # g3(Q) DRbar
#
BLOCK AU Q=  2.46740800E+03  # The trilinear couplings
  1  1     0.00000000E+00   # A_u(Q) DRbar
  2  2     0.00000000E+00   # A_c(Q) DRbar
  3  3    -3.52089999E+03   # A_t(Q) DRbar
#
BLOCK AD Q=  2.46740800E+03  # The trilinear couplings
  1  1     0.00000000E+00   # A_d(Q) DRbar
  2  2     0.00000000E+00   # A_s(Q) DRbar
  3  3    -2.13192999E+03   # A_b(Q) DRbar
#
BLOCK AE Q=  2.46740800E+03  # The trilinear couplings
  1  1     0.00000000E+00   # A_e(Q) DRbar
  2  2     0.00000000E+00   # A_mu(Q) DRbar
  3  3    -1.46065000E+03   # A_tau(Q) DRbar
#
BLOCK Yu Q=  2.46740800E+03  # The Yukawa couplings
  1  1     0.00000000E+00   # y_u(Q) DRbar
  2  2     0.00000000E+00   # y_c(Q) DRbar
  3  3     8.21699118E-01   # y_t(Q) DRbar
#
BLOCK Yd Q=  2.46740800E+03  # The Yukawa couplings
  1  1     0.00000000E+00   # y_d(Q) DRbar
  2  2     0.00000000E+00   # y_s(Q) DRbar
  3  3     6.13195505E-01   # y_b(Q) DRbar
#
BLOCK Ye Q=  2.46740800E+03  # The Yukawa couplings
  1  1     0.00000000E+00   # y_e(Q) DRbar
  2  2     0.00000000E+00   # y_mu(Q) DRbar
  3  3     4.73258314E-01   # y_tau(Q) DRbar
#
BLOCK MSOFT Q=  2.46740800E+03  # The soft SUSY breaking masses at the scale Q
         1    -6.37500000E+01   # M_1(Q)              
         2    -2.76921000E+03   # M_2(Q)              
         3     2.08952000E+03   # M_3(Q)              
        21     1.10354701E+07   # mH1^2(Q)            
        22     7.38515833E+04   # mH2^2(Q)            
        31     3.63259000E+03   # meL(Q)              
        32     3.63259000E+03   # mmuL(Q)             
        33     2.83169999E+02   # mtauL(Q)            
        34     1.62230000E+03   # meR(Q)              
        35     1.62230000E+03   # mmuR(Q)             
        36     3.42192000E+03   # mtauR(Q)            
        41     3.19168000E+03   # mqL1(Q)             
        42     3.19168000E+03   # mqL2(Q)             
        43     2.03626998E+03   # mqL3(Q)             
        44     1.43086999E+03   # muR(Q)              
        45     1.43086999E+03   # mcR(Q)              
        46     2.99045999E+03   # mtR(Q)              
        47     1.40183999E+03   # mdR(Q)              
        48     1.40183999E+03   # msR(Q)              
        49     3.08799925E+02   # mbR(Q)              
#
Block HiggsBoundsInputHiggsCouplingsFermions
# ScalarNormEffCoupSq PseudoSNormEffCoupSq NP   IP1 IP2 IP2
    1.00416355E+00    0.00000000E+00        3  25   5   5  # h0-b-b eff. coupling^2, normalised to SM
    2.26237184E+03    0.00000000E+00        3  35   5   5  # H0-b-b eff. coupling^2, normalised to SM
    0.00000000E+00    2.26237600E+03        3  36   5   5  # A0-b-b eff. coupling^2, normalised to SM
#
    9.99998160E-01    0.00000000E+00        3  25   6   6  # h0-t-t eff. coupling^2, normalised to SM
    4.43853520E-04    0.00000000E+00        3  35   6   6  # H0-t-t eff. coupling^2, normalised to SM
    0.00000000E+00    4.42013176E-04        3  36   6   6  # A0-t-t eff. coupling^2, normalised to SM
#
    1.00416355E+00    0.00000000E+00        3  25  15  15  # h0-tau-tau eff. coupling^2, normalised to SM
    2.26237184E+03    0.00000000E+00        3  35  15  15  # H0-tau-tau eff. coupling^2, normalised to SM
    0.00000000E+00    2.26237600E+03        3  36  15  15  # A0-tau-tau eff. coupling^2, normalised to SM
#
Block HiggsBoundsInputHiggsCouplingsBosons
    9.99999998E-01        3  25  24  24  # h0-W-W eff. coupling^2, normalised to SM
    1.91161645E-09        3  35  24  24  # H0-W-W eff. coupling^2, normalised to SM
    0.00000000E+00        3  36  24  24  # A0-W-W eff. coupling^2, normalised to SM
#
    9.99999998E-01        3  25  23  23  # h0-Z-Z eff. coupling^2, normalised to SM
    1.91161645E-09        3  35  23  23  # H0-Z-Z eff. coupling^2, normalised to SM
    0.00000000E+00        3  36  23  23  # A0-Z-Z eff. coupling^2, normalised to SM
#
    8.89668658E-01        3  25  21  21  # h0-g-g eff. coupling^2, normalised to SM
    9.22179652E-13        3  35  21  21  # H0-g-g eff. coupling^2, normalised to SM
    2.86861760E-12        3  36  21  21  # A0-g-g eff. coupling^2, normalised to SM
#
    0.00000000E+00        3  25  25  23  # h0-h0-Z eff. coupling^2, normalised to SM
    0.00000000E+00        3  35  25  23  # H0-h0-Z eff. coupling^2, normalised to SM
    1.91161645E-09        3  36  25  23  # A0-h0-Z eff. coupling^2, normalised to SM
    0.00000000E+00        3  35  35  23  # H0-H0-Z eff. coupling^2, normalised to SM
    9.99999998E-01        3  36  35  23  # A0-H0-Z eff. coupling^2, normalised to SM
    0.00000000E+00        3  36  36  23  # A0-A0-Z eff. coupling^2, normalised to SM
#
    0.00000000E+00        4  25  21  21  23  # h0-g-g-Z eff. coupling^2, normalised to SM
    0.00000000E+00        4  35  21  21  23  # H0-g-g-Z eff. coupling^2, normalised to SM
    0.00000000E+00        4  36  21  21  23  # A0-g-g-Z eff. coupling^2, normalised to SM
#
#
#
#                             =================
#                             |The decay table|
#                             =================
#
# - The QCD corrections to the decays gluino -> squark  + quark
#                                     squark -> gaugino + quark_prime
#                                     squark -> squark_prime + Higgs
#                                     squark -> gluino  + quark
#   are included.
#
# - The multi-body decays for the inos, stops and sbottoms are included.
#
# - The loop induced decays for the gluino, neutralinos and stops
#   are included.
#
# - The SUSY decays of the top quark are included.
#
#
#         PDG            Width
DECAY         6     1.43463303E+00   # top decays
#          BR         NDA      ID1       ID2
     1.00000000E+00    2           5        24   # BR(t ->  b    W+)
#
#         PDG            Width
DECAY   1000021     9.05125834E+01   # gluino decays
#          BR         NDA      ID1       ID2
     7.12873645E-02    2     2000001        -1   # BR(~g -> ~d_R  db)
     7.12873645E-02    2    -2000001         1   # BR(~g -> ~d_R* d )
     6.68965511E-02    2     2000002        -2   # BR(~g -> ~u_R  ub)
     6.68965511E-02    2    -2000002         2   # BR(~g -> ~u_R* u )
     7.12873645E-02    2     2000003        -3   # BR(~g -> ~s_R  sb)
     7.12873645E-02    2    -2000003         3   # BR(~g -> ~s_R* s )
     6.68964245E-02    2     2000004        -4   # BR(~g -> ~c_R  cb)
     6.68964245E-02    2    -2000004         4   # BR(~g -> ~c_R* c )
     2.20951291E-01    2     1000005        -5   # BR(~g -> ~b_1  bb)
     2.20951291E-01    2    -1000005         5   # BR(~g -> ~b_1* b )
     2.68100492E-03    2     2000005        -5   # BR(~g -> ~b_2  bb)
     2.68100492E-03    2    -2000005         5   # BR(~g -> ~b_2* b )
#
#         PDG            Width
DECAY   1000006     4.34275256E+01   # stop1 decays
#          BR         NDA      ID1       ID2
     1.47465236E-02    2     1000022         6   # BR(~t_1 -> ~chi_10 t )
     3.15481798E-01    2     1000023         6   # BR(~t_1 -> ~chi_20 t )
     3.09458411E-01    2     1000025         6   # BR(~t_1 -> ~chi_30 t )
     3.58191700E-01    2     1000024         5   # BR(~t_1 -> ~chi_1+ b )
     2.12156736E-03    2     1000005        24   # BR(~t_1 -> ~b_1    W+)
#
#         PDG            Width
DECAY   2000006     1.69803324E+02   # stop2 decays
#          BR         NDA      ID1       ID2
     4.16612235E-02    2     1000022         6   # BR(~t_2 -> ~chi_10 t )
     1.22224263E-01    2     1000023         6   # BR(~t_2 -> ~chi_20 t )
     1.11589242E-01    2     1000025         6   # BR(~t_2 -> ~chi_30 t )
     2.33478493E-06    2     1000035         6   # BR(~t_2 -> ~chi_40 t )
     2.35498778E-01    2     1000024         5   # BR(~t_2 -> ~chi_1+ b )
     8.30588390E-06    2     1000037         5   # BR(~t_2 -> ~chi_2+ b )
     1.80419595E-01    2     1000021         6   # BR(~t_2 -> ~g      t )
     7.83469508E-02    2     1000006        25   # BR(~t_2 -> ~t_1    h )
     7.88890448E-02    2     1000006        23   # BR(~t_2 -> ~t_1    Z )
     2.14395373E-05    2     1000005        24   # BR(~t_2 -> ~b_1    W+)
     1.51338822E-01    2     2000005        24   # BR(~t_2 -> ~b_2    W+)
#
#         PDG            Width
DECAY   1000005     6.16632010E+00   # sbottom1 decays
#          BR         NDA      ID1       ID2
     1.23026486E-01    2     1000022         5   # BR(~b_1 -> ~chi_10 b )
     2.51519046E-01    2     1000023         5   # BR(~b_1 -> ~chi_20 b )
     2.16516048E-01    2     1000025         5   # BR(~b_1 -> ~chi_30 b )
     4.08938420E-01    2    -1000024         6   # BR(~b_1 -> ~chi_1- t )
#
#         PDG            Width
DECAY   2000005     4.37185863E+01   # sbottom2 decays
#          BR         NDA      ID1       ID2
     5.39228665E-02    2     1000022         5   # BR(~b_2 -> ~chi_10 b )
     1.67658482E-01    2     1000023         5   # BR(~b_2 -> ~chi_20 b )
     1.43402044E-01    2     1000025         5   # BR(~b_2 -> ~chi_30 b )
     6.32742427E-01    2    -1000024         6   # BR(~b_2 -> ~chi_1- t )
     1.15878484E-03    2     1000005        25   # BR(~b_2 -> ~b_1    h )
     1.11539590E-03    2     1000005        23   # BR(~b_2 -> ~b_1    Z )
#
#         PDG            Width
DECAY   1000002     7.52594739E+01   # sup_L decays
#          BR         NDA      ID1       ID2
     4.90468019E-03    2     1000022         2   # BR(~u_L -> ~chi_10 u)
     1.79177427E-05    2     1000023         2   # BR(~u_L -> ~chi_20 u)
     1.32131196E-03    2     1000025         2   # BR(~u_L -> ~chi_30 u)
     1.23268314E-02    2     1000035         2   # BR(~u_L -> ~chi_40 u)
     5.35056239E-04    2     1000024         1   # BR(~u_L -> ~chi_1+ d)
     2.46225890E-02    2     1000037         1   # BR(~u_L -> ~chi_2+ d)
     9.56271614E-01    2     1000021         2   # BR(~u_L -> ~g      u)
#
#         PDG            Width
DECAY   2000002     3.58485730E+00   # sup_R decays
#          BR         NDA      ID1       ID2
     8.46347970E-01    2     1000022         2   # BR(~u_R -> ~chi_10 u)
     2.43932590E-02    2     1000023         2   # BR(~u_R -> ~chi_20 u)
     1.29258771E-01    2     1000025         2   # BR(~u_R -> ~chi_30 u)
#
#         PDG            Width
DECAY   1000001     7.53085985E+01   # sdown_L decays
#          BR         NDA      ID1       ID2
     5.37152319E-03    2     1000022         1   # BR(~d_L -> ~chi_10 d)
     4.09089612E-04    2     1000023         1   # BR(~d_L -> ~chi_20 d)
     3.99336975E-04    2     1000025         1   # BR(~d_L -> ~chi_30 d)
     1.23605361E-02    2     1000035         1   # BR(~d_L -> ~chi_40 d)
     3.65844966E-07    2    -1000024         2   # BR(~d_L -> ~chi_1- u)
     2.47202085E-02    2    -1000037         2   # BR(~d_L -> ~chi_2- u)
     9.56738940E-01    2     1000021         1   # BR(~d_L -> ~g      d)
#
#         PDG            Width
DECAY   2000001     8.81090077E-01   # sdown_R decays
#          BR         NDA      ID1       ID2
     8.46418054E-01    2     1000022         1   # BR(~d_R -> ~chi_10 d)
     2.43830042E-02    2     1000023         1   # BR(~d_R -> ~chi_20 d)
     1.29198942E-01    2     1000025         1   # BR(~d_R -> ~chi_30 d)
#
#         PDG            Width
DECAY   1000004     5.48746424E+01   # scharm_L decays
#          BR         NDA      ID1       ID2
     7.04209199E-03    2     1000022         4   # BR(~c_L -> ~chi_10 c)
     2.57104655E-05    2     1000023         4   # BR(~c_L -> ~chi_20 c)
     1.89590811E-03    2     1000025         4   # BR(~c_L -> ~chi_30 c)
     1.70082078E-02    2     1000035         4   # BR(~c_L -> ~chi_40 c)
     7.67792713E-04    2     1000024         3   # BR(~c_L -> ~chi_1+ s)
     3.39733601E-02    2     1000037         3   # BR(~c_L -> ~chi_2+ s)
     9.39286929E-01    2     1000021         4   # BR(~c_L -> ~g      c)
#
#         PDG            Width
DECAY   2000004     3.60375170E+00   # scharm_R decays
#          BR         NDA      ID1       ID2
     8.46466066E-01    2     1000022         4   # BR(~c_R -> ~chi_10 c)
     2.43754530E-02    2     1000023         4   # BR(~c_R -> ~chi_20 c)
     1.29158481E-01    2     1000025         4   # BR(~c_R -> ~chi_30 c)
#
#         PDG            Width
DECAY   1000003     5.48986867E+01   # sstrange_L decays
#          BR         NDA      ID1       ID2
     7.71397589E-03    2     1000022         3   # BR(~s_L -> ~chi_10 s)
     5.87131032E-04    2     1000023         3   # BR(~s_L -> ~chi_20 s)
     5.73114486E-04    2     1000025         3   # BR(~s_L -> ~chi_30 s)
     1.70593155E-02    2     1000035         3   # BR(~s_L -> ~chi_40 s)
     5.25086999E-07    2    -1000024         4   # BR(~s_L -> ~chi_1- c)
     3.41168394E-02    2    -1000037         4   # BR(~s_L -> ~chi_2- c)
     9.39949099E-01    2     1000021         3   # BR(~s_L -> ~g      s)
#
#         PDG            Width
DECAY   2000003     8.84754168E-01   # sstrange_R decays
#          BR         NDA      ID1       ID2
     8.46536841E-01    2     1000022         3   # BR(~s_R -> ~chi_10 s)
     2.43650912E-02    2     1000023         3   # BR(~s_R -> ~chi_20 s)
     1.29098067E-01    2     1000025         3   # BR(~s_R -> ~chi_30 s)
#
#         PDG            Width
DECAY   1000011     1.24503813E+01   # selectron_L decays
#          BR         NDA      ID1       ID2
     3.22566215E-01    2     1000022        11   # BR(~e_L -> ~chi_10 e-)
     5.83426615E-03    2     1000023        11   # BR(~e_L -> ~chi_20 e-)
     6.08689948E-02    2     1000025        11   # BR(~e_L -> ~chi_30 e-)
     2.03436534E-01    2     1000035        11   # BR(~e_L -> ~chi_40 e-)
     2.59303438E-06    2    -1000024        12   # BR(~e_L -> ~chi_1- nu_e)
     4.07291397E-01    2    -1000037        12   # BR(~e_L -> ~chi_2- nu_e)
#
#         PDG            Width
DECAY   2000011     8.57081459E+00   # selectron_R decays
#          BR         NDA      ID1       ID2
     8.46264521E-01    2     1000022        11   # BR(~e_R -> ~chi_10 e-)
     2.44049585E-02    2     1000023        11   # BR(~e_R -> ~chi_20 e-)
     1.29330520E-01    2     1000025        11   # BR(~e_R -> ~chi_30 e-)
#
#         PDG            Width
DECAY   1000013     1.24503812E+01   # smuon_L decays
#          BR         NDA      ID1       ID2
     3.22566215E-01    2     1000022        13   # BR(~mu_L -> ~chi_10 mu-)
     5.83426616E-03    2     1000023        13   # BR(~mu_L -> ~chi_20 mu-)
     6.08689949E-02    2     1000025        13   # BR(~mu_L -> ~chi_30 mu-)
     2.03436532E-01    2     1000035        13   # BR(~mu_L -> ~chi_40 mu-)
     2.59303439E-06    2    -1000024        14   # BR(~mu_L -> ~chi_1- nu_mu)
     4.07291398E-01    2    -1000037        14   # BR(~mu_L -> ~chi_2- nu_mu)
#
#         PDG            Width
DECAY   2000013     8.57081452E+00   # smuon_R decays
#          BR         NDA      ID1       ID2
     8.46264521E-01    2     1000022        13   # BR(~mu_R -> ~chi_10 mu-)
     2.44049585E-02    2     1000023        13   # BR(~mu_R -> ~chi_20 mu-)
     1.29330520E-01    2     1000025        13   # BR(~mu_R -> ~chi_30 mu-)
#
#         PDG            Width
DECAY   1000015     1.52077837E+00   # stau_1 decays
#          BR         NDA      ID1       ID2
     3.63175360E-01    2     1000022        15   # BR(~tau_1 -> ~chi_10  tau-)
     3.31025967E-01    2     1000023        15   # BR(~tau_1 -> ~chi_20  tau-)
     3.05794051E-01    2     1000025        15   # BR(~tau_1 -> ~chi_30  tau-)
     4.62186286E-06    2    -1000024        16   # BR(~tau_1 -> ~chi_1-  nu_tau)
#
#         PDG            Width
DECAY   2000015     4.84865195E+01   # stau_2 decays
#          BR         NDA      ID1       ID2
     3.56877098E-01    2     1000022        15   # BR(~tau_2 -> ~chi_10  tau-)
     1.55346225E-01    2     1000023        15   # BR(~tau_2 -> ~chi_20  tau-)
     1.73606214E-01    2     1000025        15   # BR(~tau_2 -> ~chi_30  tau-)
     1.22004185E-07    2     1000035        15   # BR(~tau_2 -> ~chi_40  tau-)
     3.12889891E-01    2    -1000024        16   # BR(~tau_2 -> ~chi_1-  nu_tau)
     2.25115642E-07    2    -1000037        16   # BR(~tau_2 -> ~chi_2-  nu_tau)
     6.18473512E-04    2     1000016       -24   # BR(~tau_2 -> ~nu_tauL W-)
     3.43537882E-04    2     1000015        25   # BR(~tau_2 -> ~tau_1   h)
     3.18213068E-04    2     1000015        23   # BR(~tau_2 -> ~tau_1   Z)
#
#         PDG            Width
DECAY   1000012     1.24578344E+01   # snu_eL decays
#          BR         NDA      ID1       ID2
     3.32225653E-01    2     1000022        12   # BR(~nu_eL -> ~chi_10 nu_e)
     1.41390812E-02    2     1000023        12   # BR(~nu_eL -> ~chi_20 nu_e)
     4.12365831E-02    2     1000025        12   # BR(~nu_eL -> ~chi_30 nu_e)
     2.03101284E-01    2     1000035        12   # BR(~nu_eL -> ~chi_40 nu_e)
     3.78737860E-03    2     1000024        11   # BR(~nu_eL -> ~chi_1+ e-)
     4.05510020E-01    2     1000037        11   # BR(~nu_eL -> ~chi_2+ e-)
#
#         PDG            Width
DECAY   1000014     1.24578343E+01   # snu_muL decays
#          BR         NDA      ID1       ID2
     3.32225654E-01    2     1000022        14   # BR(~nu_muL -> ~chi_10 nu_mu)
     1.41390813E-02    2     1000023        14   # BR(~nu_muL -> ~chi_20 nu_mu)
     4.12365833E-02    2     1000025        14   # BR(~nu_muL -> ~chi_30 nu_mu)
     2.03101285E-01    2     1000035        14   # BR(~nu_muL -> ~chi_40 nu_mu)
     3.78737861E-03    2     1000024        13   # BR(~nu_muL -> ~chi_1+ mu-)
     4.05510018E-01    2     1000037        13   # BR(~nu_muL -> ~chi_2+ mu-)
#
#         PDG            Width
DECAY   1000016     1.45605442E+00   # snu_tauL decays
#          BR         NDA      ID1       ID2
     2.46371441E-01    2     1000022        16   # BR(~nu_tauL -> ~chi_10 nu_tau)
     7.59502547E-03    2     1000023        16   # BR(~nu_tauL -> ~chi_20 nu_tau)
     2.15094737E-02    2     1000025        16   # BR(~nu_tauL -> ~chi_30 nu_tau)
     7.24524060E-01    2     1000024        15   # BR(~nu_tauL -> ~chi_1+ tau-)
#
#         PDG            Width
DECAY   1000024     1.13821726E-03   # chargino1+ decays
#           BR         NDA      ID1       ID2       ID3
     3.33374869E-01    3     1000022         2        -1   # BR(~chi_1+ -> ~chi_10 u    db)
     3.33374869E-01    3     1000022         4        -3   # BR(~chi_1+ -> ~chi_10 c    sb)
     1.11124299E-01    3     1000022       -11        12   # BR(~chi_1+ -> ~chi_10 e+   nu_e)
     1.11124299E-01    3     1000022       -13        14   # BR(~chi_1+ -> ~chi_10 mu+  nu_mu)
     1.11001664E-01    3     1000022       -15        16   # BR(~chi_1+ -> ~chi_10 tau+ nu_tau)
#
#         PDG            Width
DECAY   1000037     5.62430057E+01   # chargino2+ decays
#          BR         NDA      ID1       ID2
     1.13522263E-01    2     1000006        -5   # BR(~chi_2+ -> ~t_1     bb)
     6.45876441E-06    2    -1000005         6   # BR(~chi_2+ -> ~b_1*    t )
     1.05471279E-01    2    -2000005         6   # BR(~chi_2+ -> ~b_2*    t )
     1.94946208E-01    2     1000016       -15   # BR(~chi_2+ -> ~nu_tau1 tau+)
     1.94934398E-01    2    -1000015        16   # BR(~chi_2+ -> ~tau_1+  nu_tau)
     9.92394363E-02    2     1000024        23   # BR(~chi_2+ -> ~chi_1+  Z )
     3.37029409E-03    2     1000022        24   # BR(~chi_2+ -> ~chi_10  W+)
     9.70151836E-02    2     1000023        24   # BR(~chi_2+ -> ~chi_20  W+)
     9.19764034E-02    2     1000025        24   # BR(~chi_2+ -> ~chi_30  W+)
     9.95180756E-02    2     1000024        25   # BR(~chi_2+ -> ~chi_1+  h )
#
#         PDG            Width
DECAY   1000022     0.00000000E+00   # neutralino1 decays
#
#         PDG            Width
DECAY   1000023     4.44651973E-04   # neutralino2 decays
#          BR         NDA      ID1       ID2
     5.04317748E-04    2     1000022        22   # BR(~chi_20 -> ~chi_10 gam)
#           BR         NDA      ID1       ID2       ID3
     1.16034965E-01    3     1000022        -2         2   # BR(~chi_20 -> ~chi_10 ub      u)
     1.50559239E-01    3     1000022        -1         1   # BR(~chi_20 -> ~chi_10 db      d)
     1.16034965E-01    3     1000022        -4         4   # BR(~chi_20 -> ~chi_10 cb      c)
     1.50559239E-01    3     1000022        -3         3   # BR(~chi_20 -> ~chi_10 sb      s)
     1.52540208E-01    3     1000022        -5         5   # BR(~chi_20 -> ~chi_10 bb      b)
     3.45463760E-02    3     1000022       -11        11   # BR(~chi_20 -> ~chi_10 e+      e-)
     3.45463760E-02    3     1000022       -13        13   # BR(~chi_20 -> ~chi_10 mu+     mu-)
     3.61886372E-02    3     1000022       -15        15   # BR(~chi_20 -> ~chi_10 tau+    tau-)
     6.91966870E-02    3     1000022       -12        12   # BR(~chi_20 -> ~chi_10 nu_eb   nu_e)
     6.91966870E-02    3     1000022       -14        14   # BR(~chi_20 -> ~chi_10 nu_mub  nu_mu)
     7.00628892E-02    3     1000022       -16        16   # BR(~chi_20 -> ~chi_10 nu_taub nu_tau)
     5.11036253E-06    3     1000024        -2         1   # BR(~chi_20 -> ~chi_1+ ub      d)
     5.11036253E-06    3    -1000024        -1         2   # BR(~chi_20 -> ~chi_1- db      u)
     5.11036253E-06    3     1000024        -4         3   # BR(~chi_20 -> ~chi_1+ cb      s)
     5.11036253E-06    3    -1000024        -3         4   # BR(~chi_20 -> ~chi_1- sb      c)
     1.70345865E-06    3     1000024       -12        11   # BR(~chi_20 -> ~chi_1+ nu_eb   e-)
     1.70345865E-06    3    -1000024        12       -11   # BR(~chi_20 -> ~chi_1- nu_e    e+)
     1.70345865E-06    3     1000024       -14        13   # BR(~chi_20 -> ~chi_1+ nu_mub  mu-)
     1.70345865E-06    3    -1000024        14       -13   # BR(~chi_20 -> ~chi_1- nu_mu   mu+)
     1.07952382E-06    3     1000024       -16        15   # BR(~chi_20 -> ~chi_1+ nu_taub tau-)
     1.07952382E-06    3    -1000024        16       -15   # BR(~chi_20 -> ~chi_1- nu_tau  tau+)
#
#         PDG            Width
DECAY   1000025     6.66108369E-04   # neutralino3 decays
#          BR         NDA      ID1       ID2
     2.60936011E-04    2     1000022        22   # BR(~chi_30 -> ~chi_10 gam)
     1.19635584E-07    2     1000023        22   # BR(~chi_30 -> ~chi_20 gam)
#           BR         NDA      ID1       ID2       ID3
     1.15644107E-01    3     1000022        -2         2   # BR(~chi_30 -> ~chi_10 ub      u)
     1.49906273E-01    3     1000022        -1         1   # BR(~chi_30 -> ~chi_10 db      d)
     1.15644107E-01    3     1000022        -4         4   # BR(~chi_30 -> ~chi_10 cb      c)
     1.49906273E-01    3     1000022        -3         3   # BR(~chi_30 -> ~chi_10 sb      s)
     1.55391838E-01    3     1000022        -5         5   # BR(~chi_30 -> ~chi_10 bb      b)
     3.42960971E-02    3     1000022       -11        11   # BR(~chi_30 -> ~chi_10 e+      e-)
     3.42960971E-02    3     1000022       -13        13   # BR(~chi_30 -> ~chi_10 mu+     mu-)
     3.57580978E-02    3     1000022       -15        15   # BR(~chi_30 -> ~chi_10 tau+    tau-)
     6.89098969E-02    3     1000022       -12        12   # BR(~chi_30 -> ~chi_10 nu_eb   nu_e)
     6.89098969E-02    3     1000022       -14        14   # BR(~chi_30 -> ~chi_10 nu_mub  nu_mu)
     7.07146269E-02    3     1000022       -16        16   # BR(~chi_30 -> ~chi_10 nu_taub nu_tau)
     3.59484819E-07    3     1000023        -2         2   # BR(~chi_30 -> ~chi_20 ub      u)
     4.66751022E-07    3     1000023        -1         1   # BR(~chi_30 -> ~chi_20 db      d)
     3.59484819E-07    3     1000023        -4         4   # BR(~chi_30 -> ~chi_20 cb      c)
     4.66751022E-07    3     1000023        -3         3   # BR(~chi_30 -> ~chi_20 sb      s)
     1.07304105E-07    3     1000023       -11        11   # BR(~chi_30 -> ~chi_20 e+      e-)
     1.07304105E-07    3     1000023       -13        13   # BR(~chi_30 -> ~chi_20 mu+     mu-)
     2.88714077E-08    3     1000023       -15        15   # BR(~chi_30 -> ~chi_20 tau+    tau-)
     2.14475236E-07    3     1000023       -12        12   # BR(~chi_30 -> ~chi_20 nu_eb   nu_e)
     2.14475236E-07    3     1000023       -14        14   # BR(~chi_30 -> ~chi_20 nu_mub  nu_mu)
     2.13829893E-07    3     1000023       -16        16   # BR(~chi_30 -> ~chi_20 nu_taub nu_tau)
     6.07474136E-05    3     1000024        -2         1   # BR(~chi_30 -> ~chi_1+ ub      d)
     6.07474136E-05    3    -1000024        -1         2   # BR(~chi_30 -> ~chi_1- db      u)
     6.07474136E-05    3     1000024        -4         3   # BR(~chi_30 -> ~chi_1+ cb      s)
     6.07474136E-05    3    -1000024        -3         4   # BR(~chi_30 -> ~chi_1- sb      c)
     2.02490001E-05    3     1000024       -12        11   # BR(~chi_30 -> ~chi_1+ nu_eb   e-)
     2.02490001E-05    3    -1000024        12       -11   # BR(~chi_30 -> ~chi_1- nu_e    e+)
     2.02490001E-05    3     1000024       -14        13   # BR(~chi_30 -> ~chi_1+ nu_mub  mu-)
     2.02490001E-05    3    -1000024        14       -13   # BR(~chi_30 -> ~chi_1- nu_mu   mu+)
     1.75542862E-05    3     1000024       -16        15   # BR(~chi_30 -> ~chi_1+ nu_taub tau-)
     1.75542862E-05    3    -1000024        16       -15   # BR(~chi_30 -> ~chi_1- nu_tau  tau+)
#
#         PDG            Width
DECAY   1000035     5.62628715E+01   # neutralino4 decays
#          BR         NDA      ID1       ID2
     1.90866467E-03    2     1000022        23   # BR(~chi_40 -> ~chi_10   Z )
     5.28130417E-02    2     1000023        23   # BR(~chi_40 -> ~chi_20   Z )
     4.42733763E-02    2     1000025        23   # BR(~chi_40 -> ~chi_30   Z )
     9.65305612E-02    2     1000024       -24   # BR(~chi_40 -> ~chi_1+   W-)
     9.65305612E-02    2    -1000024        24   # BR(~chi_40 -> ~chi_1-   W+)
     1.63163763E-03    2     1000022        25   # BR(~chi_40 -> ~chi_10   h )
     4.71564756E-02    2     1000023        25   # BR(~chi_40 -> ~chi_20   h )
     5.05804401E-02    2     1000025        25   # BR(~chi_40 -> ~chi_30   h )
     1.99914643E-08    2     2000002        -2   # BR(~chi_40 -> ~u_R      ub)
     1.99914643E-08    2    -2000002         2   # BR(~chi_40 -> ~u_R*     u )
     5.15077099E-09    2     2000001        -1   # BR(~chi_40 -> ~d_R      db)
     5.15077099E-09    2    -2000001         1   # BR(~chi_40 -> ~d_R*     d )
     1.99914558E-08    2     2000004        -4   # BR(~chi_40 -> ~c_R      cb)
     1.99914558E-08    2    -2000004         4   # BR(~chi_40 -> ~c_R*     c )
     5.15077099E-09    2     2000003        -3   # BR(~chi_40 -> ~s _R      sb)
     5.15077099E-09    2    -2000003         3   # BR(~chi_40 -> ~s _R*     s )
     5.39354768E-02    2     1000006        -6   # BR(~chi_40 -> ~t_1      tb)
     5.39354768E-02    2    -1000006         6   # BR(~chi_40 -> ~t_1*     t )
     3.28570130E-06    2     1000005        -5   # BR(~chi_40 -> ~b_1      bb)
     3.28570130E-06    2    -1000005         5   # BR(~chi_40 -> ~b_1*     b )
     5.54891363E-02    2     2000005        -5   # BR(~chi_40 -> ~b_2      bb)
     5.54891363E-02    2    -2000005         5   # BR(~chi_40 -> ~b_2*     b )
     1.40353451E-08    2     2000011       -11   # BR(~chi_40 -> ~e_R-     e+)
     1.40353451E-08    2    -2000011        11   # BR(~chi_40 -> ~e_R+     e-)
     1.40353451E-08    2     2000013       -13   # BR(~chi_40 -> ~mu_R-    mu+)
     1.40353451E-08    2    -2000013        13   # BR(~chi_40 -> ~mu_R+    mu-)
     9.72939521E-02    2     1000015       -15   # BR(~chi_40 -> ~tau_1-   tau+)
     9.72939521E-02    2    -1000015        15   # BR(~chi_40 -> ~tau_1+   tau-)
     9.75656916E-02    2     1000016       -16   # BR(~chi_40 -> ~nu_tau1  nu_taub)
     9.75656916E-02    2    -1000016        16   # BR(~chi_40 -> ~nu_tau1* nu_tau )
#
#         PDG            Width
DECAY        25     4.87344476E-03   # h decays
#          BR         NDA      ID1       ID2
     5.30071116E-01    2           5        -5   # BR(h -> b       bb     )
     5.39196291E-02    2         -15        15   # BR(h -> tau+    tau-   )
     1.90834329E-04    2         -13        13   # BR(h -> mu+     mu-    )
     2.07832085E-04    2           3        -3   # BR(h -> s       sb     )
     1.79565899E-02    2           4        -4   # BR(h -> c       cb     )
     6.77098396E-02    2          21        21   # BR(h -> g       g      )
     2.02092971E-03    2          22        22   # BR(h -> gam     gam    )
     1.44982666E-03    2          22        23   # BR(h -> Z       gam    )
     2.00823935E-01    2          24       -24   # BR(h -> W+      W-     )
     2.55926830E-02    2          23        23   # BR(h -> Z       Z      )
     1.00056784E-01    2     1000022   1000022   # BR(h -> ~chi_10 ~chi_10)
#
#         PDG            Width
DECAY        35     1.26289482E+02   # H decays
#          BR         NDA      ID1       ID2
     6.56378164E-01    2           5        -5   # BR(H -> b       bb     )
     1.28851847E-01    2         -15        15   # BR(H -> tau+    tau-   )
     4.37546410E-04    2         -13        13   # BR(H -> mu+     mu-    )
     2.56917957E-04    2           3        -3   # BR(H -> s       sb     )
     4.69896610E-09    2           4        -4   # BR(H -> c       cb     )
     4.62670533E-04    2           6        -6   # BR(H -> t       tb     )
     9.85426346E-06    2          21        21   # BR(H -> g       g      )
     3.61591006E-09    2          22        22   # BR(H -> gam     gam    )
     6.20027418E-09    2          23        22   # BR(H -> Z       gam    )
     1.74794625E-07    2          24       -24   # BR(H -> W+      W-     )
     8.72233519E-08    2          23        23   # BR(H -> Z       Z      )
     6.56438389E-07    2          25        25   # BR(H -> h       h      )
     3.51695157E-04    2     1000024  -1000024   # BR(H -> ~chi_1+ ~chi_1-)
     8.51049874E-03    2     1000024  -1000037   # BR(H -> ~chi_1+ ~chi_2-)
     8.51049874E-03    2     1000037  -1000024   # BR(H -> ~chi_2+ ~chi_1-)
     7.39575378E-03    2     1000022   1000022   # BR(H -> ~chi_10 ~chi_10)
     1.05238718E-03    2     1000023   1000023   # BR(H -> ~chi_20 ~chi_20)
     2.75916541E-03    2     1000025   1000025   # BR(H -> ~chi_30 ~chi_30)
     9.51108879E-03    2     1000022   1000023   # BR(H -> ~chi_10 ~chi_20)
     7.25351016E-03    2     1000022   1000025   # BR(H -> ~chi_10 ~chi_30)
     1.08439291E-03    2     1000022   1000035   # BR(H -> ~chi_10 ~chi_40)
     3.69931900E-03    2     1000023   1000025   # BR(H -> ~chi_20 ~chi_30)
     4.80395494E-03    2     1000023   1000035   # BR(H -> ~chi_20 ~chi_40)
     2.63967796E-03    2     1000025   1000035   # BR(H -> ~chi_30 ~chi_40)
     9.25458141E-09    2     2000002  -2000002   # BR(H -> ~u_R    ~u_R*  )
     9.25458141E-09    2     2000004  -2000004   # BR(H -> ~c_R    ~c_R*  )
     2.56947420E-09    2     2000001  -2000001   # BR(H -> ~d_R    ~d_R*  )
     2.56947420E-09    2     2000003  -2000003   # BR(H -> ~s_R    ~s_R*  )
     6.59217346E-06    2     1000005  -1000005   # BR(H -> ~b_1    ~b_1*  )
     7.80116928E-02    2     1000005  -2000005   # BR(H -> ~b_1    ~b_2*  )
     7.80116928E-02    2     2000005  -1000005   # BR(H -> ~b_2    ~b_1*  )
     3.33742073E-09    2     2000011  -2000011   # BR(H -> ~e_R-   ~e_R+  )
     3.33742073E-09    2     2000013  -2000013   # BR(H -> ~mu_R-  ~mu_R+ )
     2.16623139E-08    2     1000015  -1000015   # BR(H -> ~tau_1- ~tau_1+)
     9.43957155E-08    2     1000016  -1000016   # BR(H -> ~nu_tauL ~nu_tauL*)
#
#         PDG            Width
DECAY        36     1.26293045E+02   # A decays
#          BR         NDA      ID1       ID2
     6.56371066E-01    2           5        -5   # BR(A -> b       bb     )
     1.28848469E-01    2         -15        15   # BR(A -> tau+    tau-   )
     4.37534449E-04    2         -13        13   # BR(A -> mu+     mu-    )
     2.56918947E-04    2           3        -3   # BR(A -> s       sb     )
     4.72274190E-09    2           4        -4   # BR(A -> c       cb     )
     4.64021859E-04    2           6        -6   # BR(A -> t       tb     )
     1.73795582E-05    2          21        21   # BR(A -> g       g      )
     3.58190543E-09    2          22        22   # BR(A -> gam     gam    )
     1.25042451E-08    2          23        22   # BR(A -> Z       gam    )
     1.77179744E-07    2          23        25   # BR(A -> Z       h      )
     3.53236385E-04    2     1000024  -1000024   # BR(A -> ~chi_1+ ~chi_1-)
     8.51005667E-03    2     1000024  -1000037   # BR(A -> ~chi_1+ ~chi_2-)
     8.51005667E-03    2     1000037  -1000024   # BR(A -> ~chi_2+ ~chi_1-)
     7.15616240E-03    2     1000022   1000022   # BR(A -> ~chi_10 ~chi_10)
     1.15720241E-03    2     1000023   1000023   # BR(A -> ~chi_20 ~chi_20)
     2.53777023E-03    2     1000025   1000025   # BR(A -> ~chi_30 ~chi_30)
     1.05135810E-02    2     1000022   1000023   # BR(A -> ~chi_10 ~chi_20)
     6.54447699E-03    2     1000022   1000025   # BR(A -> ~chi_10 ~chi_30)
     1.28877309E-03    2     1000022   1000035   # BR(A -> ~chi_10 ~chi_40)
     3.76140685E-03    2     1000023   1000025   # BR(A -> ~chi_20 ~chi_30)
     3.12713366E-03    2     1000023   1000035   # BR(A -> ~chi_20 ~chi_40)
     4.11312943E-03    2     1000025   1000035   # BR(A -> ~chi_30 ~chi_40)
     7.80157134E-02    2     1000005  -2000005   # BR(A -> ~b_1    ~b_2*  )
     7.80157134E-02    2    -1000005   2000005   # BR(A -> ~b_1*   ~b_2   )
#
#         PDG            Width
DECAY        37     1.69948823E+02   # H+ decays
#          BR         NDA      ID1       ID2
     7.49271348E-04    2           4        -5   # BR(H+ -> c       bb     )
     9.57915038E-02    2         -15        16   # BR(H+ -> tau+    nu_tau )
     3.25281963E-04    2         -13        14   # BR(H+ -> mu+     nu_mu  )
     7.49270613E-06    2           2        -5   # BR(H+ -> u       bb     )
     9.55396812E-06    2           2        -3   # BR(H+ -> u       sb     )
     1.88054468E-04    2           4        -3   # BR(H+ -> c       sb     )
     4.45570832E-01    2           6        -5   # BR(H+ -> t       bb     )
     1.31904624E-07    2          24        25   # BR(H+ -> W+      h      )
     4.41854311E-14    2          24        36   # BR(H+ -> W+      A      )
     1.95965447E-02    2     1000024   1000022   # BR(H+ -> ~chi_1+ ~chi_10)
     3.30337699E-04    2     1000024   1000023   # BR(H+ -> ~chi_1+ ~chi_20)
     3.70221459E-03    2     1000024   1000025   # BR(H+ -> ~chi_1+ ~chi_30)
     6.36147588E-03    2     1000024   1000035   # BR(H+ -> ~chi_1+ ~chi_40)
     1.77139422E-03    2     1000037   1000022   # BR(H+ -> ~chi_2+ ~chi_10)
     5.92093060E-03    2     1000037   1000023   # BR(H+ -> ~chi_2+ ~chi_20)
     5.04184856E-03    2     1000037   1000025   # BR(H+ -> ~chi_2+ ~chi_30)
     7.65098135E-08    2    -1000015   1000016   # BR(H+ -> ~tau_1+ ~nu_tauL)
     4.14633055E-01    2     1000006  -1000005   # BR(H+ -> ~t_1    ~b_1*  )
