#
#                              ======================
#                              | THE SUSYHIT OUTPUT |
#                              ======================
#
#
#              ------------------------------------------------------
#              |     This is the output of the SUSY-HIT package     |
#              |  created by A.Djouadi, M.Muehlleitner and M.Spira. |
#              |  In case of problems with SUSY-HIT email to        |
#              |           margarete.muehlleitner@cern.ch           |
#              |           michael.spira@psi.ch                     |
#              |           abdelhak.djouadi@cern.ch                 |
#              ------------------------------------------------------
#
#              ------------------------------------------------------
#              |  SUSY Les Houches Accord - MSSM Spectrum + Decays  |
#              |              based on the decay programs           |
#              |                                                    |
#              |                     SDECAY 1.3b                    |
#              |                                                    |
#              |  Authors: M.Muhlleitner, A.Djouadi and Y.Mambrini  |
#              |  Ref.:    Comput.Phys.Commun.168(2005)46           |
#              |           [hep-ph/0311167]                         |
#              |                                                    |
#              |                     HDECAY 3.4                     |
#              |                                                    |
#              |  By: A.Djouadi,J.Kalinowski,M.Muhlleitner,M.Spira  |
#              |  Ref.:    Comput.Phys.Commun.108(1998)56           |
#              |           [hep-ph/9704448]                         |
#              |                                                    |
#              |                                                    |
#              |  If not stated otherwise all DRbar couplings and   |
#              |  soft SUSY breaking masses are given at the scale  |
#              |  Q=  0.15906250E+04
#              |                                                    |
#              ------------------------------------------------------
#
#
BLOCK DCINFO  # Decay Program information
     1   SDECAY/HDECAY # decay calculator
     2   1.3b  /3.4    # version number
#
BLOCK SPINFO  # Spectrum calculator information
     1     SOFTSUSY    # spectrum calculator               
     2     3.4.0       # version number                    
#
BLOCK MODSEL  # Model selection
     1     0   #  nonUniversal                                     
#
BLOCK SMINPUTS  # Standard Model inputs
         1     1.27908970E+02   # alpha_em^-1(M_Z)^MSbar
         2     1.16637870E-05   # G_F [GeV^-2]
         3     1.18400000E-01   # alpha_S(M_Z)^MSbar
         4     9.11876000E+01   # M_Z pole mass
         5     4.18000000E+00   # mb(mb)^MSbar
         6     1.73200000E+02   # mt pole mass
         7     1.77700000E+00   # mtau pole mass
#
BLOCK MINPAR  # Input parameters - minimal models
         3     2.31800000E+01   # tanb                
#
BLOCK EXTPAR  # Input parameters - non-minimal models
         0    -1.00000000E+00   # Set                 
         1    -3.54537000E+03   # M_1(MX)             
         2     1.53989000E+03   # M_2(MX)             
         3     2.01707000E+03   # M_3(MX)             
        11    -5.83805000E+03   # At(MX)              
        12     3.25094000E+03   # Ab(MX)              
        13     4.55630000E+02   # Atau(MX)            
        23     4.04870000E+02   # mu(MX)              
        26     3.25619000E+03   # mA(pole)            
        31     2.47637000E+03   # meL(MX)             
        32     2.47637000E+03   # mmuL(MX)            
        33     5.43730000E+02   # mtauL(MX)           
        34     2.40340000E+03   # meR(MX)             
        35     2.40340000E+03   # mmuR(MX)            
        36     1.71840000E+03   # mtauR(MX)           
        41     3.22950000E+02   # mqL1(MX)            
        42     3.22950000E+02   # mqL2(MX)            
        43     7.68030000E+02   # mqL3(MX)            
        44     2.40324000E+03   # muR(MX)             
        45     2.40324000E+03   # mcR(MX)             
        46     3.41312000E+03   # mtR(MX)             
        47     2.50585000E+03   # mdR(MX)             
        48     2.50585000E+03   # msR(MX)             
        49     3.99700000E+03   # mbR(MX)             
#
BLOCK MASS  # Mass Spectrum
# PDG code           mass       particle
        24     8.03851970E+01   # W+
        25     1.27983437E+02   # h
        35     3.25620045E+03   # H
        36     3.25619000E+03   # A
        37     3.25719350E+03   # H+
         5     4.81876030E+00   # b-quark pole mass calculated from mb(mb)_Msbar
   1000001     4.65335685E+02   # ~d_L
   2000001     2.54679843E+03   # ~d_R
   1000002     4.58786151E+02   # ~u_L
   2000002     2.44766153E+03   # ~u_R
   1000003     4.65335685E+02   # ~s_L
   2000003     2.54679843E+03   # ~s_R
   1000004     4.58786151E+02   # ~c_L
   2000004     2.44766153E+03   # ~c_R
   1000005     9.29548426E+02   # ~b_1
   2000005     4.02343024E+03   # ~b_2
   1000006     9.00011416E+02   # ~t_1
   2000006     3.41767564E+03   # ~t_2
   1000011     2.48369409E+03   # ~e_L
   2000011     2.40359145E+03   # ~e_R
   1000012     2.48221901E+03   # ~nu_eL
   1000013     2.48369409E+03   # ~mu_L
   2000013     2.40359145E+03   # ~mu_R
   1000014     2.48221901E+03   # ~nu_muL
   1000015     5.65155575E+02   # ~tau_1
   2000015     1.71541218E+03   # ~tau_2
   1000016     5.59876537E+02   # ~nu_tauL
   1000021     2.10728346E+03   # ~g
   1000022     4.15067558E+02   # ~chi_10
   1000023    -4.19915263E+02   # ~chi_20
   1000025     1.53313736E+03   # ~chi_30
   1000035    -3.53216555E+03   # ~chi_40
   1000024     4.17081591E+02   # ~chi_1+
   1000037     1.53331282E+03   # ~chi_2+
#
BLOCK NMIX  # Neutralino Mixing Matrix
  1  1    -7.73543459E-03   # N_11
  1  2    -5.37087042E-02   # N_12
  1  3     7.08593722E-01   # N_13
  1  4    -7.03527167E-01   # N_14
  2  1     8.93737294E-03   # N_21
  2  2     2.80737346E-02   # N_22
  2  3     7.05379192E-01   # N_23
  2  4     7.08217611E-01   # N_24
  3  1    -4.54435362E-04   # N_31
  3  2     9.98161908E-01   # N_32
  3  3     1.82884649E-02   # N_33
  3  4    -5.77765550E-02   # N_34
  4  1     9.99930038E-01   # N_41
  4  2    -2.12780424E-04   # N_42
  4  3    -8.14702587E-04   # N_43
  4  4    -1.17987745E-02   # N_44
#
BLOCK UMIX  # Chargino Mixing Matrix U
  1  1    -2.59081606E-02   # U_11
  1  2     9.99664327E-01   # U_12
  2  1    -9.99664327E-01   # U_21
  2  2    -2.59081606E-02   # U_22
#
BLOCK VMIX  # Chargino Mixing Matrix V
  1  1    -8.18390065E-02   # V_11
  1  2     9.96645562E-01   # V_12
  2  1    -9.96645562E-01   # V_21
  2  2    -8.18390065E-02   # V_22
#
BLOCK STOPMIX  # Stop Mixing Matrix
  1  1     9.96715461E-01   # cos(theta_t)
  1  2     8.09832687E-02   # sin(theta_t)
  2  1    -8.09832687E-02   # -sin(theta_t)
  2  2     9.96715461E-01   # cos(theta_t)
#
BLOCK SBOTMIX  # Sbottom Mixing Matrix
  1  1     9.99999608E-01   # cos(theta_b)
  1  2     8.85437658E-04   # sin(theta_b)
  2  1    -8.85437658E-04   # -sin(theta_b)
  2  2     9.99999608E-01   # cos(theta_b)
#
BLOCK STAUMIX  # Stau Mixing Matrix
  1  1     9.99980996E-01   # cos(theta_tau)
  1  2     6.16503356E-03   # sin(theta_tau)
  2  1    -6.16503356E-03   # -sin(theta_tau)
  2  2     9.99980996E-01   # cos(theta_tau)
#
BLOCK ALPHA  # Higgs mixing
          -4.46409696E-02   # Mixing angle in the neutral Higgs boson sector
#
BLOCK HMIX Q=  1.59062500E+03  # DRbar Higgs Parameters
         1     4.09999701E+02   # mu(Q)MSSM           
         2     2.24420417E+01   # tan                 
         3     2.42031208E+02   # higgs               
         4     1.12305867E+07   # mA^2(Q)MSSM         
#
BLOCK GAUGE Q=  1.59062500E+03  # The gauge couplings
     1     3.63114611E-01   # gprime(Q) DRbar
     2     6.40307844E-01   # g(Q) DRbar
     3     1.03687923E+00   # g3(Q) DRbar
#
BLOCK AU Q=  1.59062500E+03  # The trilinear couplings
  1  1     0.00000000E+00   # A_u(Q) DRbar
  2  2     0.00000000E+00   # A_c(Q) DRbar
  3  3    -5.83805000E+03   # A_t(Q) DRbar
#
BLOCK AD Q=  1.59062500E+03  # The trilinear couplings
  1  1     0.00000000E+00   # A_d(Q) DRbar
  2  2     0.00000000E+00   # A_s(Q) DRbar
  3  3     3.25094000E+03   # A_b(Q) DRbar
#
BLOCK AE Q=  1.59062500E+03  # The trilinear couplings
  1  1     0.00000000E+00   # A_e(Q) DRbar
  2  2     0.00000000E+00   # A_mu(Q) DRbar
  3  3     4.55630000E+02   # A_tau(Q) DRbar
#
BLOCK Yu Q=  1.59062500E+03  # The Yukawa couplings
  1  1     0.00000000E+00   # y_u(Q) DRbar
  2  2     0.00000000E+00   # y_c(Q) DRbar
  3  3     8.24911886E-01   # y_t(Q) DRbar
#
BLOCK Yd Q=  1.59062500E+03  # The Yukawa couplings
  1  1     0.00000000E+00   # y_d(Q) DRbar
  2  2     0.00000000E+00   # y_s(Q) DRbar
  3  3     3.27765574E-01   # y_b(Q) DRbar
#
BLOCK Ye Q=  1.59062500E+03  # The Yukawa couplings
  1  1     0.00000000E+00   # y_e(Q) DRbar
  2  2     0.00000000E+00   # y_mu(Q) DRbar
  3  3     2.40218153E-01   # y_tau(Q) DRbar
#
BLOCK MSOFT Q=  1.59062500E+03  # The soft SUSY breaking masses at the scale Q
         1    -3.54537000E+03   # M_1(Q)              
         2     1.53989000E+03   # M_2(Q)              
         3     2.01707000E+03   # M_3(Q)              
        21     1.03681351E+07   # mH1^2(Q)            
        22    -5.69706159E+05   # mH2^2(Q)            
        31     2.47637000E+03   # meL(Q)              
        32     2.47637000E+03   # mmuL(Q)             
        33     5.43730000E+02   # mtauL(Q)            
        34     2.40340000E+03   # meR(Q)              
        35     2.40340000E+03   # mmuR(Q)             
        36     1.71840000E+03   # mtauR(Q)            
        41     3.22949986E+02   # mqL1(Q)             
        42     3.22949986E+02   # mqL2(Q)             
        43     7.68029983E+02   # mqL3(Q)             
        44     2.40324000E+03   # muR(Q)              
        45     2.40324000E+03   # mcR(Q)              
        46     3.41311999E+03   # mtR(Q)              
        47     2.50585000E+03   # mdR(Q)              
        48     2.50585000E+03   # msR(Q)              
        49     3.99700000E+03   # mbR(Q)              
#
Block HiggsBoundsInputHiggsCouplingsFermions
# ScalarNormEffCoupSq PseudoSNormEffCoupSq NP   IP1 IP2 IP2
    1.00499733E+00    0.00000000E+00        3  25   5   5  # h0-b-b eff. coupling^2, normalised to SM
    5.03640238E+02    0.00000000E+00        3  35   5   5  # H0-b-b eff. coupling^2, normalised to SM
    0.00000000E+00    5.03645236E+02        3  36   5   5  # A0-b-b eff. coupling^2, normalised to SM
#
    9.99990078E-01    0.00000000E+00        3  25   6   6  # h0-t-t eff. coupling^2, normalised to SM
    1.99544690E-03    0.00000000E+00        3  35   6   6  # H0-t-t eff. coupling^2, normalised to SM
    0.00000000E+00    1.98552459E-03        3  36   6   6  # A0-t-t eff. coupling^2, normalised to SM
#
    1.00499733E+00    0.00000000E+00        3  25  15  15  # h0-tau-tau eff. coupling^2, normalised to SM
    5.03640238E+02    0.00000000E+00        3  35  15  15  # H0-tau-tau eff. coupling^2, normalised to SM
    0.00000000E+00    5.03645236E+02        3  36  15  15  # A0-tau-tau eff. coupling^2, normalised to SM
#
Block HiggsBoundsInputHiggsCouplingsBosons
    9.99999988E-01        3  25  24  24  # h0-W-W eff. coupling^2, normalised to SM
    1.23654443E-08        3  35  24  24  # H0-W-W eff. coupling^2, normalised to SM
    0.00000000E+00        3  36  24  24  # A0-W-W eff. coupling^2, normalised to SM
#
    9.99999988E-01        3  25  23  23  # h0-Z-Z eff. coupling^2, normalised to SM
    1.23654443E-08        3  35  23  23  # H0-Z-Z eff. coupling^2, normalised to SM
    0.00000000E+00        3  36  23  23  # A0-Z-Z eff. coupling^2, normalised to SM
#
    8.44995010E-01        3  25  21  21  # h0-g-g eff. coupling^2, normalised to SM
    8.86413620E-15        3  35  21  21  # H0-g-g eff. coupling^2, normalised to SM
    6.57239607E-13        3  36  21  21  # A0-g-g eff. coupling^2, normalised to SM
#
    0.00000000E+00        3  25  25  23  # h0-h0-Z eff. coupling^2, normalised to SM
    0.00000000E+00        3  35  25  23  # H0-h0-Z eff. coupling^2, normalised to SM
    1.23654443E-08        3  36  25  23  # A0-h0-Z eff. coupling^2, normalised to SM
    0.00000000E+00        3  35  35  23  # H0-H0-Z eff. coupling^2, normalised to SM
    9.99999988E-01        3  36  35  23  # A0-H0-Z eff. coupling^2, normalised to SM
    0.00000000E+00        3  36  36  23  # A0-A0-Z eff. coupling^2, normalised to SM
#
    0.00000000E+00        4  25  21  21  23  # h0-g-g-Z eff. coupling^2, normalised to SM
    0.00000000E+00        4  35  21  21  23  # H0-g-g-Z eff. coupling^2, normalised to SM
    0.00000000E+00        4  36  21  21  23  # A0-g-g-Z eff. coupling^2, normalised to SM
#
#
#
#                             =================
#                             |The decay table|
#                             =================
#
# - The QCD corrections to the decays gluino -> squark  + quark
#                                     squark -> gaugino + quark_prime
#                                     squark -> squark_prime + Higgs
#                                     squark -> gluino  + quark
#   are included.
#
# - The multi-body decays for the inos, stops and sbottoms are included.
#
# - The loop induced decays for the gluino, neutralinos and stops
#   are included.
#
# - The SUSY decays of the top quark are included.
#
#
#         PDG            Width
DECAY         6     1.44414961E+00   # top decays
#          BR         NDA      ID1       ID2
     1.00000000E+00    2           5        24   # BR(t ->  b    W+)
#
#         PDG            Width
DECAY   1000021     2.12109975E+02   # gluino decays
#          BR         NDA      ID1       ID2
     9.20919002E-02    2     1000001        -1   # BR(~g -> ~d_L  db)
     9.20919002E-02    2    -1000001         1   # BR(~g -> ~d_L* d )
     9.23559995E-02    2     1000002        -2   # BR(~g -> ~u_L  ub)
     9.23559995E-02    2    -1000002         2   # BR(~g -> ~u_L* u )
     9.20919002E-02    2     1000003        -3   # BR(~g -> ~s_L  sb)
     9.20919002E-02    2    -1000003         3   # BR(~g -> ~s_L* s )
     9.23559937E-02    2     1000004        -4   # BR(~g -> ~c_L  cb)
     9.23559937E-02    2    -1000004         4   # BR(~g -> ~c_L* c )
     6.56690663E-02    2     1000005        -5   # BR(~g -> ~b_1  bb)
     6.56690663E-02    2    -1000005         5   # BR(~g -> ~b_1* b )
     6.54351402E-02    2     1000006        -6   # BR(~g -> ~t_1  tb)
     6.54351402E-02    2    -1000006         6   # BR(~g -> ~t_1* t )
#
#         PDG            Width
DECAY   1000006     7.93017558E+00   # stop1 decays
#          BR         NDA      ID1       ID2
     3.94978852E-01    2     1000022         6   # BR(~t_1 -> ~chi_10 t )
     4.37582640E-01    2     1000023         6   # BR(~t_1 -> ~chi_20 t )
     1.67438508E-01    2     1000024         5   # BR(~t_1 -> ~chi_1+ b )
#
#         PDG            Width
DECAY   2000006     4.21813284E+02   # stop2 decays
#          BR         NDA      ID1       ID2
     5.22091970E-02    2     1000022         6   # BR(~t_2 -> ~chi_10 t )
     5.28187202E-02    2     1000023         6   # BR(~t_2 -> ~chi_20 t )
     7.27126509E-04    2     1000025         6   # BR(~t_2 -> ~chi_30 t )
     1.04064995E-01    2     1000024         5   # BR(~t_2 -> ~chi_1+ b )
     1.45550617E-03    2     1000037         5   # BR(~t_2 -> ~chi_2+ b )
     1.72306789E-01    2     1000021         6   # BR(~t_2 -> ~g      t )
     1.45339021E-01    2     1000006        25   # BR(~t_2 -> ~t_1    h )
     1.60655683E-01    2     1000006        23   # BR(~t_2 -> ~t_1    Z )
     3.10422963E-01    2     1000005        24   # BR(~t_2 -> ~b_1    W+)
#
#         PDG            Width
DECAY   1000005     8.33006895E+00   # sbottom1 decays
#          BR         NDA      ID1       ID2
     7.74693085E-02    2     1000022         5   # BR(~b_1 -> ~chi_10 b )
     7.53186854E-02    2     1000023         5   # BR(~b_1 -> ~chi_20 b )
     8.47212006E-01    2    -1000024         6   # BR(~b_1 -> ~chi_1- t )
#
#         PDG            Width
DECAY   2000005     1.37827567E+02   # sbottom2 decays
#          BR         NDA      ID1       ID2
     3.06590440E-02    2     1000022         5   # BR(~b_2 -> ~chi_10 b )
     3.03740755E-02    2     1000023         5   # BR(~b_2 -> ~chi_20 b )
     1.73547486E-05    2     1000025         5   # BR(~b_2 -> ~chi_30 b )
     8.94438057E-04    2     1000035         5   # BR(~b_2 -> ~chi_40 b )
     6.07820204E-02    2    -1000024         6   # BR(~b_2 -> ~chi_1- t )
     3.46605996E-05    2    -1000037         6   # BR(~b_2 -> ~chi_2- t )
     8.76810280E-01    2     1000021         5   # BR(~b_2 -> ~g      b )
     1.27564046E-04    2     1000005        25   # BR(~b_2 -> ~b_1    h )
     1.01668964E-04    2     1000005        23   # BR(~b_2 -> ~b_1    Z )
     1.98861281E-04    2     1000006       -24   # BR(~b_2 -> ~t_1    W-)
     3.22299179E-08    2     2000006       -24   # BR(~b_2 -> ~t_2    W-)
#
#         PDG            Width
DECAY   1000002     1.08372009E-03   # sup_L decays
#          BR         NDA      ID1       ID2
     1.90004121E-01    2     1000022         2   # BR(~u_L -> ~chi_10 u)
     4.43761079E-02    2     1000023         2   # BR(~u_L -> ~chi_20 u)
     7.65619771E-01    2     1000024         1   # BR(~u_L -> ~chi_1+ d)
#
#         PDG            Width
DECAY   2000002     1.31450301E+01   # sup_R decays
#          BR         NDA      ID1       ID2
     2.33140473E-05    2     1000022         2   # BR(~u_R -> ~chi_10 u)
     3.10800181E-05    2     1000023         2   # BR(~u_R -> ~chi_20 u)
     3.19160740E-08    2     1000025         2   # BR(~u_R -> ~chi_30 u)
     9.99945574E-01    2     1000021         2   # BR(~u_R -> ~g      u)
#
#         PDG            Width
DECAY   1000001     3.94057433E-04   # sdown_L decays
#          BR         NDA      ID1       ID2
     5.99859341E-01    2     1000022         1   # BR(~d_L -> ~chi_10 d)
     1.26690652E-01    2     1000023         1   # BR(~d_L -> ~chi_20 d)
     2.73450007E-01    2    -1000024         2   # BR(~d_L -> ~chi_1- u)
#
#         PDG            Width
DECAY   2000001     2.03113262E+01   # sdown_R decays
#          BR         NDA      ID1       ID2
     3.94437277E-06    2     1000022         1   # BR(~d_R -> ~chi_10 d)
     5.25882323E-06    2     1000023         1   # BR(~d_R -> ~chi_20 d)
     5.91130669E-09    2     1000025         1   # BR(~d_R -> ~chi_30 d)
     9.99990791E-01    2     1000021         1   # BR(~d_R -> ~g      d)
#
#         PDG            Width
DECAY   1000004     9.85864675E-04   # scharm_L decays
#          BR         NDA      ID1       ID2
     1.90168839E-01    2     1000022         4   # BR(~c_L -> ~chi_10 c)
     4.42301341E-02    2     1000023         4   # BR(~c_L -> ~chi_20 c)
     7.65601027E-01    2     1000024         3   # BR(~c_L -> ~chi_1+ s)
#
#         PDG            Width
DECAY   2000004     9.35019485E+00   # scharm_R decays
#          BR         NDA      ID1       ID2
     3.44525463E-05    2     1000022         4   # BR(~c_R -> ~chi_10 c)
     4.59269090E-05    2     1000023         4   # BR(~c_R -> ~chi_20 c)
     4.65441080E-08    2     1000025         4   # BR(~c_R -> ~chi_30 c)
     9.99919574E-01    2     1000021         4   # BR(~c_R -> ~g      c)
#
#         PDG            Width
DECAY   1000003     3.60403450E-04   # sstrange_L decays
#          BR         NDA      ID1       ID2
     6.00416031E-01    2     1000022         3   # BR(~s_L -> ~chi_10 s)
     1.26390895E-01    2     1000023         3   # BR(~s_L -> ~chi_20 s)
     2.73193075E-01    2    -1000024         4   # BR(~s_L -> ~chi_1- c)
#
#         PDG            Width
DECAY   2000003     1.44475032E+01   # sstrange_R decays
#          BR         NDA      ID1       ID2
     5.82630955E-06    2     1000022         3   # BR(~s_R -> ~chi_10 s)
     7.76760016E-06    2     1000023         3   # BR(~s_R -> ~chi_20 s)
     8.62710312E-09    2     1000025         3   # BR(~s_R -> ~chi_30 s)
     9.99986397E-01    2     1000021         3   # BR(~s_R -> ~g      s)
#
#         PDG            Width
DECAY   1000011     1.16740122E+01   # selectron_L decays
#          BR         NDA      ID1       ID2
     2.76717320E-03    2     1000022        11   # BR(~e_L -> ~chi_10 e-)
     8.99342475E-04    2     1000023        11   # BR(~e_L -> ~chi_20 e-)
     3.31027702E-01    2     1000025        11   # BR(~e_L -> ~chi_30 e-)
     1.10005118E-03    2    -1000024        12   # BR(~e_L -> ~chi_1- nu_e)
     6.64205731E-01    2    -1000037        12   # BR(~e_L -> ~chi_2- nu_e)
#
#         PDG            Width
DECAY   2000011     3.74500077E-03   # selectron_R decays
#           BR         NDA      ID1       ID2
     1.89639967E-01    2     1000022        11   # BR(~e_R -> ~chi_10 e-)
     2.52785813E-01    2     1000023        11   # BR(~e_R -> ~chi_20 e-)
#           BR         NDA      ID1       ID2       ID3
     2.68811694E-02    3        11       -1        1000001   # BR(~e_R- -> e-  db  ~d_L)
     4.92015921E-03    3        11       1        -1000001   # BR(~e_R- -> e-  d  ~d_L*)
     2.73244270E-02    3        11       -2        1000002   # BR(~e_R- -> e-  ub  ~u_L)
     4.60053310E-03    3        11       2        -1000002   # BR(~e_R- -> e-  u  ~u_L*)
     2.65639465E-02    3        11       -3        1000003   # BR(~e_R- -> e-  sb  ~s_L)
     4.94392422E-03    3        11       3        -1000003   # BR(~e_R- -> e-  s  ~s_L*)
     2.77463228E-02    3        11       -4        1000004   # BR(~e_R- -> e-  cb  ~c_L)
     4.56795634E-03    3        11       4        -1000004   # BR(~e_R- -> e-  c  ~c_L*)
     1.02424545E-02    3        11       -5        1000005   # BR(~e_R- -> e-  bb  ~b_1)
     2.38632795E-03    3        11       5        -1000005   # BR(~e_R- -> e-  b  ~b_1*)
     1.46437887E-02    3        11       -6        1000006   # BR(~e_R- -> e-  tb  ~t_1)
     5.45820983E-03    3        11       6        -1000006   # BR(~e_R- -> e-  t  ~t_1*)
     6.82002531E-02    3        11       -15        1000015   # BR(~e_R- -> e-  tau+  ~tau_1-)
     1.25588759E-02    3        11       15        -1000015   # BR(~e_R- -> e-  tau-  ~tau_1+)
     1.65722263E-03    3        11       -15        2000015   # BR(~e_R- -> e-  tau+  ~tau_2-)
     4.81361717E-03    3        11       15        -2000015   # BR(~e_R- -> e-  tau-  ~tau_2+)
     6.77276230E-02    3        11       -16        1000016   # BR(~e_R- -> e-  nu_taub  ~nu_tau1)
     1.29185555E-02    3        11       16        -1000016   # BR(~e_R- -> e-  nu_tau  ~nu_tau1*)
     3.45340383E-02    3        11       23        1000022   # BR(~e_R- -> e-  Z  ~chi_10)
     2.11361772E-02    3        11       25        1000022   # BR(~e_R- -> e-  h  ~chi_10)
     1.92363111E-02    3        11       23        1000023   # BR(~e_R- -> e-  Z  ~chi_20)
     3.93297650E-02    3        11       25        1000023   # BR(~e_R- -> e-  h  ~chi_20)
     2.73404483E-06    3        11       23        1000025   # BR(~e_R- -> e-  Z  ~chi_30)
     1.42918529E-05    3        11       25        1000025   # BR(~e_R- -> e-  h  ~chi_30)
     1.44464590E-02    3        11       -24        1000024   # BR(~e_R- -> e-  W-  ~chi_1+)
     1.00688898E-01    3        11       24        -1000024   # BR(~e_R- -> e-  W+  ~chi_1-)
     4.58878411E-06    3        11       -24        1000037   # BR(~e_R- -> e-  W-  ~chi_2+)
     2.55898479E-05    3        11       24        -1000037   # BR(~e_R- -> e-  W+  ~chi_2-)
#
#         PDG            Width
DECAY   1000013     1.16740122E+01   # smuon_L decays
#          BR         NDA      ID1       ID2
     2.76717320E-03    2     1000022        13   # BR(~mu_L -> ~chi_10 mu-)
     8.99342474E-04    2     1000023        13   # BR(~mu_L -> ~chi_20 mu-)
     3.31027700E-01    2     1000025        13   # BR(~mu_L -> ~chi_30 mu-)
     1.10005118E-03    2    -1000024        14   # BR(~mu_L -> ~chi_1- nu_mu)
     6.64205733E-01    2    -1000037        14   # BR(~mu_L -> ~chi_2- nu_mu)
#
#         PDG            Width
DECAY   2000013     3.74520464E-03   # smuon_R decays
#           BR         NDA      ID1       ID2
     1.89629641E-01    2     1000022        13   # BR(~mu_R -> ~chi_10 mu-)
     2.52772051E-01    2     1000023        13   # BR(~mu_R -> ~chi_20 mu-)
#           BR         NDA      ID1       ID2       ID3
     2.68797061E-02    3        13       -1        1000001   # BR(~mu_R- -> mu-  db  ~d_L)
     4.91989137E-03    3        13       1        -1000001   # BR(~mu_R- -> mu-  d  ~d_L*)
     2.72641977E-02    3        13       -2        1000002   # BR(~mu_R- -> mu-  ub  ~u_L)
     4.60028266E-03    3        13       2        -1000002   # BR(~mu_R- -> mu-  u  ~u_L*)
     2.65625004E-02    3        13       -3        1000003   # BR(~mu_R- -> mu-  sb  ~s_L)
     4.94365509E-03    3        13       3        -1000003   # BR(~mu_R- -> mu-  s  ~s_L*)
     2.77448123E-02    3        13       -4        1000004   # BR(~mu_R- -> mu-  cb  ~c_L)
     4.56770767E-03    3        13       4        -1000004   # BR(~mu_R- -> mu-  c  ~c_L*)
     1.02418969E-02    3        13       -5        1000005   # BR(~mu_R- -> mu-  bb  ~b_1)
     2.39212563E-03    3        13       5        -1000005   # BR(~mu_R- -> mu-  b  ~b_1*)
     1.46819748E-02    3        13       -6        1000006   # BR(~mu_R- -> mu-  tb  ~t_1)
     5.45791270E-03    3        13       6        -1000006   # BR(~mu_R- -> mu-  t  ~t_1*)
     6.81965404E-02    3        13       -15        1000015   # BR(~mu_R- -> mu-  tau+  ~tau_1-)
     1.25581923E-02    3        13       15        -1000015   # BR(~mu_R- -> mu-  tau-  ~tau_1+)
     1.65758633E-03    3        13       -15        2000015   # BR(~mu_R- -> mu-  tau+  ~tau_2-)
     4.86408667E-03    3        13       15        -2000015   # BR(~mu_R- -> mu-  tau-  ~tau_2+)
     6.77239361E-02    3        13       -16        1000016   # BR(~mu_R- -> mu-  nu_taub  ~nu_tau1)
     1.29178521E-02    3        13       16        -1000016   # BR(~mu_R- -> mu-  nu_tau  ~nu_tau1*)
     3.45321584E-02    3        13       23        1000022   # BR(~mu_R- -> mu-  Z  ~chi_10)
     2.11521151E-02    3        13       25        1000022   # BR(~mu_R- -> mu-  h  ~chi_10)
     1.92352640E-02    3        13       23        1000023   # BR(~mu_R- -> mu-  Z  ~chi_20)
     3.93276240E-02    3        13       25        1000023   # BR(~mu_R- -> mu-  h  ~chi_20)
     2.73389600E-06    3        13       23        1000025   # BR(~mu_R- -> mu-  Z  ~chi_30)
     1.42910749E-05    3        13       25        1000025   # BR(~mu_R- -> mu-  h  ~chi_30)
     1.44456726E-02    3        13       -24        1000024   # BR(~mu_R- -> mu-  W-  ~chi_1+)
     1.00683416E-01    3        13       24        -1000024   # BR(~mu_R- -> mu-  W+  ~chi_1-)
     4.58639824E-06    3        13       -24        1000037   # BR(~mu_R- -> mu-  W-  ~chi_2+)
     2.55884548E-05    3        13       24        -1000037   # BR(~mu_R- -> mu-  W+  ~chi_2-)
#
#         PDG            Width
DECAY   1000015     1.36523258E-01   # stau_1 decays
#          BR         NDA      ID1       ID2
     5.17481169E-01    2     1000022        15   # BR(~tau_1 -> ~chi_10  tau-)
     4.76943198E-01    2     1000023        15   # BR(~tau_1 -> ~chi_20  tau-)
     5.57563372E-03    2    -1000024        16   # BR(~tau_1 -> ~chi_1-  nu_tau)
#
#         PDG            Width
DECAY   2000015     3.65752003E+00   # stau_2 decays
#          BR         NDA      ID1       ID2
     2.39366129E-01    2     1000022        15   # BR(~tau_2 -> ~chi_10  tau-)
     2.37111591E-01    2     1000023        15   # BR(~tau_2 -> ~chi_20  tau-)
     1.95068986E-05    2     1000025        15   # BR(~tau_2 -> ~chi_30  tau-)
     4.75902079E-01    2    -1000024        16   # BR(~tau_2 -> ~chi_1-  nu_tau)
     3.90028042E-05    2    -1000037        16   # BR(~tau_2 -> ~chi_2-  nu_tau)
     2.33986120E-02    2     1000016       -24   # BR(~tau_2 -> ~nu_tauL W-)
     1.22616067E-02    2     1000015        25   # BR(~tau_2 -> ~tau_1   h)
     1.19014736E-02    2     1000015        23   # BR(~tau_2 -> ~tau_1   Z)
#
#         PDG            Width
DECAY   1000012     1.17081717E+01   # snu_eL decays
#          BR         NDA      ID1       ID2
     1.98736231E-03    2     1000022        12   # BR(~nu_eL -> ~chi_10 nu_e)
     4.31785923E-04    2     1000023        12   # BR(~nu_eL -> ~chi_20 nu_e)
     3.29723554E-01    2     1000025        12   # BR(~nu_eL -> ~chi_30 nu_e)
     1.09371335E-02    2     1000024        11   # BR(~nu_eL -> ~chi_1+ e-)
     6.56920164E-01    2     1000037        11   # BR(~nu_eL -> ~chi_2+ e-)
#
#         PDG            Width
DECAY   1000014     1.17081716E+01   # snu_muL decays
#          BR         NDA      ID1       ID2
     1.98736232E-03    2     1000022        14   # BR(~nu_muL -> ~chi_10 nu_mu)
     4.31785926E-04    2     1000023        14   # BR(~nu_muL -> ~chi_20 nu_mu)
     3.29723556E-01    2     1000025        14   # BR(~nu_muL -> ~chi_30 nu_mu)
     1.09371335E-02    2     1000024        13   # BR(~nu_muL -> ~chi_1+ mu-)
     6.56920162E-01    2     1000037        13   # BR(~nu_muL -> ~chi_2+ mu-)
#
#         PDG            Width
DECAY   1000016     1.34031279E-01   # snu_tauL decays
#          BR         NDA      ID1       ID2
     8.40671589E-03    2     1000022        16   # BR(~nu_tauL -> ~chi_10 nu_tau)
     1.72559153E-03    2     1000023        16   # BR(~nu_tauL -> ~chi_20 nu_tau)
     9.89867693E-01    2     1000024        15   # BR(~nu_tauL -> ~chi_1+ tau-)
#
#         PDG            Width
DECAY   1000024     3.58260912E-11   # chargino1+ decays
#           BR         NDA      ID1       ID2       ID3
     3.74942617E-01    3     1000022         2        -1   # BR(~chi_1+ -> ~chi_10 u    db)
     3.74942617E-01    3     1000022         4        -3   # BR(~chi_1+ -> ~chi_10 c    sb)
     1.24859675E-01    3     1000022       -11        12   # BR(~chi_1+ -> ~chi_10 e+   nu_e)
     1.24859675E-01    3     1000022       -13        14   # BR(~chi_1+ -> ~chi_10 mu+  nu_mu)
     3.95416245E-04    3     1000022       -15        16   # BR(~chi_1+ -> ~chi_10 tau+ nu_tau)
#
#         PDG            Width
DECAY   1000037     9.86392181E+01   # chargino2+ decays
#          BR         NDA      ID1       ID2
     1.55779214E-01    2     1000002        -1   # BR(~chi_2+ -> ~u_L     db)
     1.55847194E-01    2    -1000001         2   # BR(~chi_2+ -> ~d_L*    u )
     1.55779212E-01    2     1000004        -3   # BR(~chi_2+ -> ~c_L     sb)
     1.55847156E-01    2    -1000003         4   # BR(~chi_2+ -> ~s_L*     c )
     7.92434443E-02    2     1000006        -5   # BR(~chi_2+ -> ~t_1     bb)
     6.94677533E-02    2    -1000005         6   # BR(~chi_2+ -> ~b_1*    t )
     4.73007345E-02    2     1000016       -15   # BR(~chi_2+ -> ~nu_tau1 tau+)
     4.73012210E-02    2    -1000015        16   # BR(~chi_2+ -> ~tau_1+  nu_tau)
     3.43043705E-02    2     1000024        23   # BR(~chi_2+ -> ~chi_1+  Z )
     3.33382422E-02    2     1000022        24   # BR(~chi_2+ -> ~chi_10  W+)
     3.36513985E-02    2     1000023        24   # BR(~chi_2+ -> ~chi_20  W+)
     3.21400592E-02    2     1000024        25   # BR(~chi_2+ -> ~chi_1+  h )
#
#         PDG            Width
DECAY   1000022     0.00000000E+00   # neutralino1 decays
#
#         PDG            Width
DECAY   1000023     2.81203737E-09   # neutralino2 decays
#          BR         NDA      ID1       ID2
     6.76175172E-02    2     1000022        22   # BR(~chi_20 -> ~chi_10 gam)
#           BR         NDA      ID1       ID2       ID3
     1.12275912E-01    3     1000022        -2         2   # BR(~chi_20 -> ~chi_10 ub      u)
     1.45401515E-01    3     1000022        -1         1   # BR(~chi_20 -> ~chi_10 db      d)
     1.12275912E-01    3     1000022        -4         4   # BR(~chi_20 -> ~chi_10 cb      c)
     1.45401515E-01    3     1000022        -3         3   # BR(~chi_20 -> ~chi_10 sb      s)
     3.33187857E-02    3     1000022       -11        11   # BR(~chi_20 -> ~chi_10 e+      e-)
     3.33187857E-02    3     1000022       -13        13   # BR(~chi_20 -> ~chi_10 mu+     mu-)
     9.26606284E-03    3     1000022       -15        15   # BR(~chi_20 -> ~chi_10 tau+    tau-)
     6.65907437E-02    3     1000022       -12        12   # BR(~chi_20 -> ~chi_10 nu_eb   nu_e)
     6.65907437E-02    3     1000022       -14        14   # BR(~chi_20 -> ~chi_10 nu_mub  nu_mu)
     6.65974252E-02    3     1000022       -16        16   # BR(~chi_20 -> ~chi_10 nu_taub nu_tau)
     2.60874470E-02    3     1000024        -2         1   # BR(~chi_20 -> ~chi_1+ ub      d)
     2.60874470E-02    3    -1000024        -1         2   # BR(~chi_20 -> ~chi_1- db      u)
     2.60874470E-02    3     1000024        -4         3   # BR(~chi_20 -> ~chi_1+ cb      s)
     2.60874470E-02    3    -1000024        -3         4   # BR(~chi_20 -> ~chi_1- sb      c)
     8.69282736E-03    3     1000024       -12        11   # BR(~chi_20 -> ~chi_1+ nu_eb   e-)
     8.69282736E-03    3    -1000024        12       -11   # BR(~chi_20 -> ~chi_1- nu_e    e+)
     8.69282736E-03    3     1000024       -14        13   # BR(~chi_20 -> ~chi_1+ nu_mub  mu-)
     8.69282736E-03    3    -1000024        14       -13   # BR(~chi_20 -> ~chi_1- nu_mu   mu+)
     1.11199195E-03    3     1000024       -16        15   # BR(~chi_20 -> ~chi_1+ nu_taub tau-)
     1.11199195E-03    3    -1000024        16       -15   # BR(~chi_20 -> ~chi_1- nu_tau  tau+)
#
#         PDG            Width
DECAY   1000025     9.86374709E+01   # neutralino3 decays
#          BR         NDA      ID1       ID2
     7.27200076E-03    2     1000022        23   # BR(~chi_30 -> ~chi_10   Z )
     2.69570669E-02    2     1000023        23   # BR(~chi_30 -> ~chi_20   Z )
     3.36934450E-02    2     1000024       -24   # BR(~chi_30 -> ~chi_1+   W-)
     3.36934450E-02    2    -1000024        24   # BR(~chi_30 -> ~chi_1-   W+)
     2.49732971E-02    2     1000022        25   # BR(~chi_30 -> ~chi_10   h )
     6.86037899E-03    2     1000023        25   # BR(~chi_30 -> ~chi_20   h )
     7.81028866E-02    2     1000002        -2   # BR(~chi_30 -> ~u_L      ub)
     7.81028866E-02    2    -1000002         2   # BR(~chi_30 -> ~u_L*     u )
     7.76923996E-02    2     1000001        -1   # BR(~chi_30 -> ~d_L      db)
     7.76923996E-02    2    -1000001         1   # BR(~chi_30 -> ~d_L*     d )
     7.81028681E-02    2     1000004        -4   # BR(~chi_30 -> ~c_L      cb)
     7.81028681E-02    2    -1000004         4   # BR(~chi_30 -> ~c_L*     c )
     7.76923996E-02    2     1000003        -3   # BR(~chi_30 -> ~s _L      sb)
     7.76923996E-02    2    -1000003         3   # BR(~chi_30 -> ~s _L*     s )
     3.65022956E-02    2     1000006        -6   # BR(~chi_30 -> ~t_1      tb)
     3.65022956E-02    2    -1000006         6   # BR(~chi_30 -> ~t_1*     t )
     3.78882595E-02    2     1000005        -5   # BR(~chi_30 -> ~b_1      bb)
     3.78882595E-02    2    -1000005         5   # BR(~chi_30 -> ~b_1*     b )
     2.35644102E-02    2     1000015       -15   # BR(~chi_30 -> ~tau_1-   tau+)
     2.35644102E-02    2    -1000015        15   # BR(~chi_30 -> ~tau_1+   tau-)
     2.37296638E-02    2     1000016       -16   # BR(~chi_30 -> ~nu_tau1  nu_taub)
     2.37296638E-02    2    -1000016        16   # BR(~chi_30 -> ~nu_tau1* nu_tau )
#
#         PDG            Width
DECAY   1000035     6.74929390E+01   # neutralino4 decays
#          BR         NDA      ID1       ID2
     1.59899796E-02    2     1000022        23   # BR(~chi_40 -> ~chi_10   Z )
     1.22835586E-02    2     1000023        23   # BR(~chi_40 -> ~chi_20   Z )
     5.47491732E-05    2     1000025        23   # BR(~chi_40 -> ~chi_30   Z )
     2.75579129E-02    2     1000024       -24   # BR(~chi_40 -> ~chi_1+   W-)
     2.75579129E-02    2    -1000024        24   # BR(~chi_40 -> ~chi_1-   W+)
     6.01219980E-05    2     1000037       -24   # BR(~chi_40 -> ~chi_2+   W-)
     6.01219980E-05    2    -1000037        24   # BR(~chi_40 -> ~chi_2-   W+)
     1.42228775E-02    2     1000022        25   # BR(~chi_40 -> ~chi_10   h )
     1.93504415E-02    2     1000023        25   # BR(~chi_40 -> ~chi_20   h )
     1.27086010E-05    2     1000025        25   # BR(~chi_40 -> ~chi_30   h )
     1.05908673E-02    2     1000002        -2   # BR(~chi_40 -> ~u_L      ub)
     1.05908673E-02    2    -1000002         2   # BR(~chi_40 -> ~u_L*     u )
     4.81602973E-02    2     2000002        -2   # BR(~chi_40 -> ~u_R      ub)
     4.81602973E-02    2    -2000002         2   # BR(~chi_40 -> ~u_R*     u )
     1.06285001E-02    2     1000001        -1   # BR(~chi_40 -> ~d_L      db)
     1.06285001E-02    2    -1000001         1   # BR(~chi_40 -> ~d_L*     d )
     1.02931617E-02    2     2000001        -1   # BR(~chi_40 -> ~d_R      db)
     1.02931617E-02    2    -2000001         1   # BR(~chi_40 -> ~d_R*     d )
     1.05908673E-02    2     1000004        -4   # BR(~chi_40 -> ~c_L      cb)
     1.05908673E-02    2    -1000004         4   # BR(~chi_40 -> ~c_L*     c )
     4.81602613E-02    2     2000004        -4   # BR(~chi_40 -> ~c_R      cb)
     4.81602613E-02    2    -2000004         4   # BR(~chi_40 -> ~c_R*     c )
     1.06285001E-02    2     1000003        -3   # BR(~chi_40 -> ~s _L      sb)
     1.06285001E-02    2    -1000003         3   # BR(~chi_40 -> ~s _L*     s )
     1.02931617E-02    2     2000003        -3   # BR(~chi_40 -> ~s _R      sb)
     1.02931617E-02    2    -2000003         3   # BR(~chi_40 -> ~s _R*     s )
     1.25410487E-02    2     1000006        -6   # BR(~chi_40 -> ~t_1      tb)
     1.25410487E-02    2    -1000006         6   # BR(~chi_40 -> ~t_1*     t )
     9.93108482E-03    2     1000005        -5   # BR(~chi_40 -> ~b_1      bb)
     9.93108482E-03    2    -1000005         5   # BR(~chi_40 -> ~b_1*     b )
     8.76391119E-03    2     1000011       -11   # BR(~chi_40 -> ~e_L-     e+)
     8.76391119E-03    2    -1000011        11   # BR(~chi_40 -> ~e_L+     e-)
     3.95719742E-02    2     2000011       -11   # BR(~chi_40 -> ~e_R-     e+)
     3.95719742E-02    2    -2000011        11   # BR(~chi_40 -> ~e_R+     e-)
     8.76391119E-03    2     1000013       -13   # BR(~chi_40 -> ~mu_L-    mu+)
     8.76391119E-03    2    -1000013        13   # BR(~chi_40 -> ~mu_L+    mu-)
     3.95719742E-02    2     2000013       -13   # BR(~chi_40 -> ~mu_R-    mu+)
     3.95719742E-02    2    -2000013        13   # BR(~chi_40 -> ~mu_R+    mu-)
     3.25599309E-02    2     1000015       -15   # BR(~chi_40 -> ~tau_1-   tau+)
     3.25599309E-02    2    -1000015        15   # BR(~chi_40 -> ~tau_1+   tau-)
     8.01439171E-02    2     2000015       -15   # BR(~chi_40 -> ~tau_2-   tau+)
     8.01439171E-02    2    -2000015        15   # BR(~chi_40 -> ~tau_2+   tau-)
     8.79747351E-03    2     1000012       -12   # BR(~chi_40 -> ~nu_eL    nu_eb)
     8.79747351E-03    2    -1000012        12   # BR(~chi_40 -> ~nu_eL*   nu_e )
     8.79747351E-03    2     1000014       -14   # BR(~chi_40 -> ~nu_muL   nu_mub)
     8.79747351E-03    2    -1000014        14   # BR(~chi_40 -> ~nu_muL*  nu_mu )
     3.26364914E-02    2     1000016       -16   # BR(~chi_40 -> ~nu_tau1  nu_taub)
     3.26364914E-02    2    -1000016        16   # BR(~chi_40 -> ~nu_tau1* nu_tau )
#
#         PDG            Width
DECAY        25     4.51980524E-03   # h decays
#          BR         NDA      ID1       ID2
     5.53745438E-01    2           5        -5   # BR(h -> b       bb     )
     5.89008524E-02    2         -15        15   # BR(h -> tau+    tau-   )
     2.08496955E-04    2         -13        13   # BR(h -> mu+     mu-    )
     2.26484902E-04    2           3        -3   # BR(h -> s       sb     )
     1.95556542E-02    2           4        -4   # BR(h -> c       cb     )
     7.38276950E-02    2          21        21   # BR(h -> g       g      )
     2.33081003E-03    2          22        22   # BR(h -> gam     gam    )
     1.78804400E-03    2          22        23   # BR(h -> Z       gam    )
     2.56065436E-01    2          24       -24   # BR(h -> W+      W-     )
     3.33510879E-02    2          23        23   # BR(h -> Z       Z      )
#
#         PDG            Width
DECAY        35     4.66445402E+01   # H decays
#          BR         NDA      ID1       ID2
     4.06506599E-01    2           5        -5   # BR(H -> b       bb     )
     6.85888590E-02    2         -15        15   # BR(H -> tau+    tau-   )
     2.52825954E-04    2         -13        13   # BR(H -> mu+     mu-    )
     1.42693690E-04    2           3        -3   # BR(H -> s       sb     )
     5.65486964E-08    2           4        -4   # BR(H -> c       cb     )
     5.56658124E-03    2           6        -6   # BR(H -> t       tb     )
     2.47567918E-06    2          21        21   # BR(H -> g       g      )
     5.81540670E-08    2          22        22   # BR(H -> gam     gam    )
     2.33787565E-09    2          23        22   # BR(H -> Z       gam    )
     2.94286726E-06    2          24       -24   # BR(H -> W+      W-     )
     1.46846270E-06    2          23        23   # BR(H -> Z       Z      )
     9.01415398E-06    2          25        25   # BR(H -> h       h      )
     3.47230561E-03    2     1000024  -1000024   # BR(H -> ~chi_1+ ~chi_1-)
     1.10368999E-05    2     1000037  -1000037   # BR(H -> ~chi_2+ ~chi_2-)
     1.70978079E-01    2     1000024  -1000037   # BR(H -> ~chi_1+ ~chi_2-)
     1.70978079E-01    2     1000037  -1000024   # BR(H -> ~chi_2+ ~chi_1-)
     6.01894307E-04    2     1000022   1000022   # BR(H -> ~chi_10 ~chi_10)
     1.56995539E-04    2     1000023   1000023   # BR(H -> ~chi_20 ~chi_20)
     5.53917417E-06    2     1000025   1000025   # BR(H -> ~chi_30 ~chi_30)
     1.23100121E-04    2     1000022   1000023   # BR(H -> ~chi_10 ~chi_20)
     6.51039030E-02    2     1000022   1000025   # BR(H -> ~chi_10 ~chi_30)
     1.06344039E-01    2     1000023   1000025   # BR(H -> ~chi_20 ~chi_30)
     1.68437476E-06    2     1000002  -1000002   # BR(H -> ~u_L    ~u_L*  )
     1.68437476E-06    2     1000004  -1000004   # BR(H -> ~c_L    ~c_L*  )
     1.11048260E-04    2     1000006  -1000006   # BR(H -> ~t_1    ~t_1*  )
     2.46886232E-06    2     1000001  -1000001   # BR(H -> ~d_L    ~d_L*  )
     2.46886232E-06    2     1000003  -1000003   # BR(H -> ~s_L    ~s_L*  )
     9.71439310E-08    2     1000005  -1000005   # BR(H -> ~b_1    ~b_1*  )
     2.56707398E-09    2     1000015  -1000015   # BR(H -> ~tau_1- ~tau_1+)
     5.15442084E-04    2     1000015  -2000015   # BR(H -> ~tau_1- ~tau_2+)
     5.15442084E-04    2     2000015  -1000015   # BR(H -> ~tau_2- ~tau_1+)
     1.11245019E-06    2     1000016  -1000016   # BR(H -> ~nu_tauL ~nu_tauL*)
#
#         PDG            Width
DECAY        36     4.66340330E+01   # A decays
#          BR         NDA      ID1       ID2
     4.06624628E-01    2           5        -5   # BR(A -> b       bb     )
     6.86048761E-02    2         -15        15   # BR(A -> tau+    tau-   )
     2.52884642E-04    2         -13        13   # BR(A -> mu+     mu-    )
     1.42746839E-04    2           3        -3   # BR(A -> s       sb     )
     5.68018484E-08    2           4        -4   # BR(A -> c       cb     )
     5.58073722E-03    2           6        -6   # BR(A -> t       tb     )
     2.13221008E-05    2          21        21   # BR(A -> g       g      )
     1.09694325E-07    2          22        22   # BR(A -> gam     gam    )
     1.88019915E-08    2          23        22   # BR(A -> Z       gam    )
     2.98317979E-06    2          23        25   # BR(A -> Z       h      )
     3.93243826E-03    2     1000024  -1000024   # BR(A -> ~chi_1+ ~chi_1-)
     1.72555740E-04    2     1000037  -1000037   # BR(A -> ~chi_2+ ~chi_2-)
     1.70654677E-01    2     1000024  -1000037   # BR(A -> ~chi_1+ ~chi_2-)
     1.70654677E-01    2     1000037  -1000024   # BR(A -> ~chi_2+ ~chi_1-)
     7.68796166E-04    2     1000022   1000022   # BR(A -> ~chi_10 ~chi_10)
     1.40611187E-04    2     1000023   1000023   # BR(A -> ~chi_20 ~chi_20)
     8.63019320E-05    2     1000025   1000025   # BR(A -> ~chi_30 ~chi_30)
     6.97559057E-05    2     1000022   1000023   # BR(A -> ~chi_10 ~chi_20)
     1.06772063E-01    2     1000022   1000025   # BR(A -> ~chi_10 ~chi_30)
     6.44867303E-02    2     1000023   1000025   # BR(A -> ~chi_20 ~chi_30)
     5.15514918E-04    2     1000015  -2000015   # BR(A -> ~tau_1- ~tau_2+)
     5.15514918E-04    2    -1000015   2000015   # BR(A -> ~tau_1+ ~tau_2-)
#
#         PDG            Width
DECAY        37     4.60451239E+01   # H+ decays
#          BR         NDA      ID1       ID2
     6.71282171E-04    2           4        -5   # BR(H+ -> c       bb     )
     6.95037337E-02    2         -15        16   # BR(H+ -> tau+    nu_tau )
     2.56197923E-04    2         -13        14   # BR(H+ -> mu+     nu_mu  )
     6.71281408E-06    2           2        -5   # BR(H+ -> u       bb     )
     7.23305819E-06    2           2        -3   # BR(H+ -> u       sb     )
     1.42423723E-04    2           4        -3   # BR(H+ -> c       sb     )
     4.04427956E-01    2           6        -5   # BR(H+ -> t       bb     )
     3.02573525E-06    2          24        25   # BR(H+ -> W+      h      )
     2.90795172E-14    2          24        36   # BR(H+ -> W+      A      )
     2.84087939E-04    2     1000024   1000022   # BR(H+ -> ~chi_1+ ~chi_10)
     9.67719229E-04    2     1000024   1000023   # BR(H+ -> ~chi_1+ ~chi_20)
     1.73846394E-01    2     1000024   1000025   # BR(H+ -> ~chi_1+ ~chi_30)
     1.75624891E-01    2     1000037   1000022   # BR(H+ -> ~chi_2+ ~chi_10)
     1.73056360E-01    2     1000037   1000023   # BR(H+ -> ~chi_2+ ~chi_20)
     5.35207457E-12    2     1000037   1000025   # BR(H+ -> ~chi_2+ ~chi_30)
     6.16102214E-07    2    -1000015   1000016   # BR(H+ -> ~tau_1+ ~nu_tauL)
     1.04618743E-03    2    -2000015   1000016   # BR(H+ -> ~tau_2+ ~nu_tauL)
     4.15816308E-06    2     1000002  -1000001   # BR(H+ -> ~u_L    ~d_L*  )
     4.15816308E-06    2     1000004  -1000003   # BR(H+ -> ~c_L    ~s_L*  )
     1.46862612E-04    2     1000006  -1000005   # BR(H+ -> ~t_1    ~b_1*  )
