#=====================================================================
#  ISAJET SUSY parameters in SUSY Les Houches Accord format
#   Created from isa.wig and isa.out by isa2lha.py (b.k.gjelsten@fys.uio.no)
#===================================================================== SPINFO
Block SPINFO   # Program information
     1   ISASUSY FROM ISAJET            # Spectrum Calculator
     2   V7.80   29-OCT-2009 12:50:36   # Version
#===================================================================== MODSEL
Block MODSEL   # Model selection
     1     0   # General MSSM Simulation
#===================================================================== SMINPUTS
Block SMINPUTS   # Standard Model inputs
     1     1.28040973e+02   # alpha_em^{-1}
     3     1.20000000e-01   # alpha_s(m_Z)
     6     1.72500000e+02   # m_{top}(pole)
#===================================================================== MINPAR
Block MINPAR   # SUSY breaking input parameters
     3     6.00000000e+00   # tan(beta)
#===================================================================== MASS
Block MASS   # Scalar and gaugino mass spectrum
# PDG code     mass               particle
        25     1.19707800e+02   # h
        35     1.00709060e+03   # H
        36     1.00000000e+03   # A
        37     1.00966130e+03   # H+
   1000001     3.00055370e+03   # dL
   1000002     2.99954740e+03   # uL
   1000003     3.00055370e+03   # sL
   1000004     2.99954790e+03   # cL
   1000005     2.99848220e+03   # b1
   1000006     2.83566970e+03   # t1
   1000011     3.00035110e+03   # eL
   1000012     2.99934470e+03   # snue
   1000013     3.00035110e+03   # muL
   1000014     2.99934470e+03   # snum
   1000015     3.87660300e+02   # ta1
   1000016     2.99934470e+03   # snut
   1000021     3.00000000e+03   # gl
   1000022     2.47783000e+02   # N1
   1000023     5.27514500e+02   # N2
   1000024     5.27207800e+02   # C1
   1000025    -7.02446400e+02   # N3
   1000035     7.27148700e+02   # N4
   1000037     7.26283400e+02   # C2
   2000001     3.00010130e+03   # dR
   2000002     2.99979740e+03   # uR
   2000003     3.00010130e+03   # sR
   2000004     2.99979760e+03   # cR
   2000005     3.00217430e+03   # b2
   2000006     3.16091970e+03   # t2
   2000011     3.87659900e+02   # eR
   2000013     3.87659900e+02   # muR
   2000015     3.00036500e+03   # ta2
#===================================================================== ALPHA
Block ALPHA   # Effective Higgs mixing parameter
          -1.68784960e-01   # alpha_h
#===================================================================== STOPMIX
Block STOPMIX   # stop mixing matrix
  1  1     7.07378013e-01   # O_{11}
  1  2    -7.06835445e-01   # O_{12}
  2  1     7.06835445e-01   # O_{21}
  2  2     7.07378013e-01   # O_{22}
#===================================================================== SBOTMIX
Block SBOTMIX   # sbottom mixing matrix
  1  1     6.62283226e-01   # O_{11}
  1  2     7.49253581e-01   # O_{12}
  2  1    -7.49253581e-01   # O_{21}
  2  2     6.62283226e-01   # O_{22}
#===================================================================== STAUMIX
Block STAUMIX   # stau mixing matrix
  1  1    -4.32051034e-08   # O_{11}
  1  2    -1.00000000e+00   # O_{12}
  2  1     1.00000000e+00   # O_{21}
  2  2    -4.32051034e-08   # O_{22}
#===================================================================== NMIX
Block NMIX   # neutralino mixing matrix
  1  1     9.96228520e-01   # 
  1  2    -1.32968600e-02   # 
  1  3     7.69502500e-02   # 
  1  4    -3.78316400e-02   # 
  2  1    -4.17023100e-02   # 
  2  2    -9.36439750e-01   # 
  2  3     2.69681300e-01   # 
  2  4    -2.20484120e-01   # 
  3  1     2.70380700e-02   # 
  3  2    -3.74104000e-02   # 
  3  3    -7.04626320e-01   # 
  3  4    -7.08075760e-01   # 
  4  1    -7.11283200e-02   # 
  4  2     3.48574280e-01   # 
  4  3     6.51807190e-01   # 
  4  4    -6.69764640e-01   # 
#===================================================================== UMIX
Block UMIX   # chargino U mixing matrix
  1  1    -9.22590850e-01   # Umix_{11}
  1  2     3.85779890e-01   # Umix_{12}
  2  1    -3.85779890e-01   # Umix_{21}
  2  2    -9.22590850e-01   # Umix_{22}
#===================================================================== VMIX
Block VMIX   # chargino V mixing matrix
  1  1    -9.48793950e-01   # Vmix_{11}
  1  2     3.15895500e-01   # Vmix_{12}
  2  1    -3.15895500e-01   # Vmix_{21}
  2  2    -9.48793950e-01   # Vmix_{22}
#===================================================================== HMIX
Block HMIX  Q= 3.000e+03   # Higgs mixing parameters
     1     7.00000000e+02   # mu(Q)
     2     6.00000000e+00   # tan(beta)(M_{GUT})
     4     1.00000000e+06   # m_A^2(Q)
#===================================================================== MSOFT
Block MSOFT  Q=  3.000e+03   # DRbar SUSY breaking parameters
     1     2.50000000e+02   # M1
     2     5.50000000e+02   # M2
     3     3.00000000e+03   # not M3 but m(gluino) ...
    31     3.00000000e+03   # m_L1 (m_eL)
    32     3.00000000e+03   # m_L2 (m_muL)
    33     3.00000000e+03   # m_L3 (m_tauL)
    34     3.85300000e+02   # m_eR
    35     3.85300000e+02   # m_muR
    36     3.85400000e+02   # m_tauR
    41     3.00000000e+03   # m_Q1
    42     3.00000000e+03   # m_Q2
    43     3.00000000e+03   # m_Q3
    44     3.00000000e+03   # m_uR
    45     3.00000000e+03   # m_cR
    46     3.00000000e+03   # m_tR
    47     3.00000000e+03   # m_dR
    48     3.00000000e+03   # m_sR
    49     3.00000000e+03   # m_bR
#===================================================================== AU
Block AU  Q=  3.000e+03   #
  1  1     7.34850000e+03   # A_u
  2  2     7.34850000e+03   # A_c
  3  3     7.34850000e+03   # A_t
#===================================================================== AD
Block AD  Q=  3.000e+03   #
  1  1     0.00000000e+00   # A_d
  2  2     0.00000000e+00   # A_s
  3  3     0.00000000e+00   # A_b
#===================================================================== AE
Block AE  Q=  3.000e+03   #
  1  1     4.20000000e+03   # A_e
  2  2     4.20000000e+03   # A_mu
  3  3     4.20000000e+03   # A_tau
#=====================================================================
#
#----------------------------------------------------------------------
#           PDG      WIDTH     
DECAY   1000001  3.57193249e+01   # dL decays 
#          BR         NDA          ID1       ID2       ID3       ID4
      1.33734780e-02    2      1000022         1                       
      2.86470260e-01    2      1000023         1                       
      5.66945060e-04    2      1000025         1                       
      4.09643240e-02    2      1000035         1                       
      5.65348270e-01    2     -1000024         2                       
      9.32768210e-02    2     -1000037         2                       
#----------------------------------------------------------------------
#           PDG      WIDTH     
DECAY   1000002  3.57775724e+01   # uL decays 
#          BR         NDA          ID1       ID2       ID3       ID4
      9.96775740e-03    2      1000022         2                       
      2.95375850e-01    2      1000023         2                       
      3.32098400e-04    2      1000025         2                       
      3.51994930e-02    2      1000035         2                       
      5.96710260e-01    2      1000024         1                       
      6.24145160e-02    2      1000037         1                       
#----------------------------------------------------------------------
#           PDG      WIDTH     
DECAY   1000003  3.57193249e+01   # sL decays 
#          BR         NDA          ID1       ID2       ID3       ID4
      1.33734830e-02    2      1000022         3                       
      2.86470350e-01    2      1000023         3                       
      5.66945240e-04    2      1000025         3                       
      4.09643350e-02    2      1000035         3                       
      5.65348210e-01    2     -1000024         4                       
      9.32768140e-02    2     -1000037         4                       
#----------------------------------------------------------------------
#           PDG      WIDTH     
DECAY   1000004  3.57775724e+01   # cL decays 
#          BR         NDA          ID1       ID2       ID3       ID4
      9.96775650e-03    2      1000022         4                       
      2.95375790e-01    2      1000023         4                       
      3.32098370e-04    2      1000025         4                       
      3.51994820e-02    2      1000035         4                       
      5.96710380e-01    2      1000024         3                       
      6.24145380e-02    2      1000037         3                       
#----------------------------------------------------------------------
#           PDG      WIDTH     
DECAY   1000005  3.44499110e+01   # b1 decays 
#          BR         NDA          ID1       ID2       ID3       ID4
      3.62494100e-02    2      1000022         5                       
      1.47846760e-01    2      1000023         5                       
      4.27740350e-03    2      1000025         5                       
      8.03514200e-03    2      1000035         5                       
      3.28518390e-01    2     -1000024         6                       
      3.88456970e-01    2     -1000037         6                       
      8.66159420e-02    2          -24   1000006                       
#----------------------------------------------------------------------
#           PDG      WIDTH     
DECAY   1000006  6.45800628e+01   # t1 decays 
#          BR         NDA          ID1       ID2       ID3       ID4
      4.46252410e-02    2      1000022         6                       
      4.08619270e-02    2      1000023         6                       
      2.16678140e-01    2      1000025         6                       
      2.96579240e-01    2      1000035         6                       
      5.63896410e-02    2      1000024         5                       
      3.44865800e-01    2      1000037         5                       
#----------------------------------------------------------------------
#           PDG      WIDTH     
DECAY   2000001  1.67127949e+00   # dR decays 
#          BR         NDA          ID1       ID2       ID3       ID4
      9.93133540e-01    2      1000022         1                       
      1.65682680e-03    2      1000023         1                       
      6.62542470e-04    2      1000025         1                       
      4.54709730e-03    2      1000035         1                       
#----------------------------------------------------------------------
#           PDG      WIDTH     
DECAY   2000002  6.68440509e+00   # uR decays 
#          BR         NDA          ID1       ID2       ID3       ID4
      9.93133660e-01    2      1000022         2                       
      1.65681020e-03    2      1000023         2                       
      6.62528910e-04    2      1000025         2                       
      4.54699480e-03    2      1000035         2                       
#----------------------------------------------------------------------
#           PDG      WIDTH     
DECAY   2000003  1.67127949e+00   # sR decays 
#          BR         NDA          ID1       ID2       ID3       ID4
      9.93133540e-01    2      1000022         3                       
      1.65682680e-03    2      1000023         3                       
      6.62542470e-04    2      1000025         3                       
      4.54709730e-03    2      1000035         3                       
#----------------------------------------------------------------------
#           PDG      WIDTH     
DECAY   2000004  6.68440509e+00   # cR decays 
#          BR         NDA          ID1       ID2       ID3       ID4
      9.93133660e-01    2      1000022         4                       
      1.65681010e-03    2      1000023         4                       
      6.62528850e-04    2      1000025         4                       
      4.54699530e-03    2      1000035         4                       
#----------------------------------------------------------------------
#           PDG      WIDTH     
DECAY   2000005  4.37778517e+01   # b2 decays 
#          BR         NDA          ID1       ID2       ID3       ID4
      2.04282760e-02    2      1000022         5                       
      1.18966880e-01    2      1000023         5                       
      7.14862390e-03    2      1000025         5                       
      3.58252410e-02    2      1000035         5                       
      2.70752160e-01    2     -1000024         6                       
      4.51750250e-01    2     -1000037         6                       
      9.51285360e-02    2          -24   1000006                       
#----------------------------------------------------------------------
#           PDG      WIDTH     
DECAY   2000006  9.88689108e+01   # t2 decays 
#          BR         NDA          ID1       ID2       ID3       ID4
      2.24760900e-01    2      1000024         5                       
      8.41875230e-02    2      1000037         5                       
      1.73161610e-01    2           23   1000006                       
      2.99944360e-02    2           24   1000005                       
      3.50754520e-02    2           24   2000005                       
      4.25342690e-02    2      1000022         6                       
      1.16280950e-01    2      1000023         6                       
      1.87380840e-01    2      1000025         6                       
      1.06623990e-01    2      1000035         6                       
#----------------------------------------------------------------------
#           PDG      WIDTH     
DECAY   1000011  3.90739092e+01   # eL decays 
#          BR         NDA          ID1       ID2       ID3       ID4
      9.10014290e-02    2      1000022        11                       
      2.79377460e-01    2      1000023        11                       
      1.46831370e-04    2      1000025        11                       
      2.74278370e-02    2      1000035        11                       
      5.16783060e-01    2     -1000024        12                       
      8.52633640e-02    2     -1000037        12                       
#----------------------------------------------------------------------
#           PDG      WIDTH     
DECAY   1000012  3.91040875e+01   # snue decays 
#          BR         NDA          ID1       ID2       ID3       ID4
      1.00174360e-01    2      1000022        12                       
      2.53024490e-01    2      1000023        12                       
      7.88032660e-04    2      1000025        12                       
      4.29858570e-02    2      1000035        12                       
      5.45925260e-01    2      1000024        11                       
      5.71020510e-02    2      1000037        11                       
#----------------------------------------------------------------------
#           PDG      WIDTH     
DECAY   1000013  3.90739092e+01   # muL decays 
#          BR         NDA          ID1       ID2       ID3       ID4
      9.10014290e-02    2      1000022        13                       
      2.79377460e-01    2      1000023        13                       
      1.46831370e-04    2      1000025        13                       
      2.74278370e-02    2      1000035        13                       
      5.16783060e-01    2     -1000024        14                       
      8.52633640e-02    2     -1000037        14                       
#----------------------------------------------------------------------
#           PDG      WIDTH     
DECAY   1000014  3.91040875e+01   # snum decays 
#          BR         NDA          ID1       ID2       ID3       ID4
      1.00174360e-01    2      1000022        14                       
      2.53024490e-01    2      1000023        14                       
      7.88032660e-04    2      1000025        14                       
      4.29858570e-02    2      1000035        14                       
      5.45925260e-01    2      1000024        13                       
      5.71020510e-02    2      1000037        13                       
#----------------------------------------------------------------------
#           PDG      WIDTH     
DECAY   1000015  6.84398786e-01   # ta1 decays 
#          BR         NDA          ID1       ID2       ID3       ID4
      1.00000000e+00    2      1000022        15                       
#----------------------------------------------------------------------
#           PDG      WIDTH     
DECAY   1000016  3.96984318e+01   # snut decays 
#          BR         NDA          ID1       ID2       ID3       ID4
      9.86735080e-02    2      1000022        16                       
      2.49233570e-01    2      1000023        16                       
      7.76226050e-04    2      1000025        16                       
      4.23418250e-02    2      1000035        16                       
      5.38512290e-01    2      1000024        15                       
      6.04406410e-02    2      1000037        15                       
      1.00218660e-02    2           37   1000015                       
#----------------------------------------------------------------------
#           PDG      WIDTH     
DECAY   2000011  6.84541143e-01   # eR decays 
#          BR         NDA          ID1       ID2       ID3       ID4
      1.00000000e+00    2      1000022        11                       
#----------------------------------------------------------------------
#           PDG      WIDTH     
DECAY   2000013  6.84541143e-01   # muR decays 
#          BR         NDA          ID1       ID2       ID3       ID4
      1.00000000e+00    2      1000022        13                       
#----------------------------------------------------------------------
#           PDG      WIDTH     
DECAY   2000015  3.96673296e+01   # ta2 decays 
#          BR         NDA          ID1       ID2       ID3       ID4
      8.96682370e-02    2      1000022        15                       
      2.75558890e-01    2      1000023        15                       
      2.60785060e-03    2      1000025        15                       
      2.91113560e-02    2      1000035        15                       
      5.09026590e-01    2     -1000024        16                       
      8.39836670e-02    2     -1000037        16                       
      5.02652950e-03    2           36   1000015                       
      5.01691080e-03    2           35   1000015                       
#----------------------------------------------------------------------
#           PDG      WIDTH     
DECAY   1000021  1.75632405e+00   # gl decays 
#          BR         NDA          ID1       ID2       ID3       ID4
      1.76798720e-02    3      1000024         1        -2             
      1.76798720e-02    3     -1000024         2        -1             
      1.76798720e-02    3      1000024         3        -4             
      1.76798720e-02    3     -1000024         4        -3             
      4.61679250e-02    3      1000024         5        -6             
      4.61679250e-02    3     -1000024         6        -5             
      2.77396450e-03    3      1000037         1        -2             
      2.77396450e-03    3     -1000037         2        -1             
      2.77396450e-03    3      1000037         3        -4             
      2.77396450e-03    3     -1000037         4        -3             
      1.55269490e-01    3      1000037         5        -6             
      1.55269490e-01    3     -1000037         6        -5             
      3.88659760e-05    2      1000022        21                       
      4.15785010e-03    3      1000022         1        -1             
      4.15785010e-03    3      1000022         3        -3             
      4.12479880e-03    3      1000022         5        -5             
      3.07695080e-02    3      1000022         6        -6             
      2.85036280e-04    2      1000023        21                       
      1.98233370e-02    3      1000023         1        -1             
      1.98233370e-02    3      1000023         3        -3             
      1.97802560e-02    3      1000023         5        -5             
      3.20817980e-02    3      1000023         6        -6             
      1.17064230e-03    2      1000025        21                       
      3.11164110e-05    3      1000025         1        -1             
      3.11164110e-05    3      1000025         3        -3             
      9.75016850e-04    3      1000025         5        -5             
      1.58153940e-01    3      1000025         6        -6             
      7.96540410e-04    2      1000035        21                       
      2.77827050e-03    3      1000035         1        -1             
      2.77827050e-03    3      1000035         3        -3             
      3.57053150e-03    3      1000035         5        -5             
      2.09981860e-01    3      1000035         6        -6             
#----------------------------------------------------------------------
#           PDG      WIDTH     
DECAY   1000023  6.82992633e-02   # N2 decays 
#          BR         NDA          ID1       ID2       ID3       ID4
      5.79996740e-02    2      1000022        23                       
      8.90245620e-01    2      1000022        25                       
      7.22646620e-03    2      2000011       -11                       
      7.22646620e-03    2     -2000011        11                       
      7.22646200e-03    2      2000013       -13                       
      7.22646200e-03    2     -2000013        13                       
      1.14244170e-02    2      1000015       -15                       
      1.14244170e-02    2     -1000015        15                       
#----------------------------------------------------------------------
#           PDG      WIDTH     
DECAY   1000025  2.93132627e+00   # N3 decays 
#          BR         NDA          ID1       ID2       ID3       ID4
      2.84413460e-01    2      1000024       -24                       
      2.84413460e-01    2     -1000024        24                       
      1.63681190e-01    2      1000022        23                       
      2.42704760e-01    2      1000023        23                       
      1.76964870e-02    2      1000022        25                       
      1.55315250e-03    2      1000023        25                       
      2.15462580e-04    2      2000011       -11                       
      2.15462580e-04    2     -2000011        11                       
      2.15462580e-04    2      2000013       -13                       
      2.15462580e-04    2     -2000013        13                       
      2.33792050e-03    2      1000015       -15                       
      2.33792050e-03    2     -1000015        15                       
#----------------------------------------------------------------------
#           PDG      WIDTH     
DECAY   1000035  3.33806674e+00   # N4 decays 
#          BR         NDA          ID1       ID2       ID3       ID4
      3.32716700e-01    2      1000024       -24                       
      3.32716700e-01    2     -1000024        24                       
      1.67815480e-02    2      1000022        23                       
      3.98890120e-03    2      1000023        23                       
      1.17170140e-01    2      1000022        25                       
      1.84572070e-01    2      1000023        25                       
      1.43594090e-03    2      2000011       -11                       
      1.43594090e-03    2     -2000011        11                       
      1.43594040e-03    2      2000013       -13                       
      1.43594040e-03    2     -2000013        13                       
      3.15525450e-03    2      1000015       -15                       
      3.15525450e-03    2     -1000015        15                       
#----------------------------------------------------------------------
#           PDG      WIDTH     
DECAY   1000024  6.36803406e-02   # C1 decays 
#          BR         NDA          ID1       ID2       ID3       ID4
      9.90455930e-01    2      1000022        24                       
      9.54413410e-03    2     -1000015        16                       
#----------------------------------------------------------------------
#           PDG      WIDTH     
DECAY   1000037  3.25438813e+00   # C2 decays 
#          BR         NDA          ID1       ID2       ID3       ID4
      1.27787830e-01    2      1000022        24                       
      3.51989690e-01    2      1000023        24                       
      3.56648120e-03    2     -1000015        16                       
      3.16728200e-01    2      1000024        23                       
      1.99927910e-01    2      1000024        25                       
#----------------------------------------------------------------------
#           PDG      WIDTH     
DECAY        25  4.56354434e-03   # h decays 
#          BR         NDA          ID1       ID2       ID3       ID4
      1.96508570e-04    2           13       -13                       
      5.62089270e-02    2           15       -15                       
      2.35885360e-03    2            3        -3                       
      7.68896940e-01    2            5        -5                       
      3.34320290e-02    2            4        -4                       
      1.91087740e-03    2           22        22                       
      3.96514720e-02    2           21        21                       
      4.94659460e-03    3           24        11       -12             
      4.94659460e-03    3           24        13       -14             
      4.94659460e-03    3           24        15       -16             
      1.48397850e-02    3           24        -2         1             
      1.48397850e-02    3           24        -4         3             
      4.94659460e-03    3          -24       -11        12             
      4.94659460e-03    3          -24       -13        14             
      4.94659460e-03    3          -24       -15        16             
      1.48397850e-02    3          -24         2        -1             
      1.48397850e-02    3          -24         4        -3             
      5.68021550e-04    3           23        12       -12             
      5.68021550e-04    3           23        14       -14             
      5.68021550e-04    3           23        16       -16             
      2.85879560e-04    3           23        11       -11             
      2.85879560e-04    3           23        13       -13             
      2.85879560e-04    3           23        15       -15             
      9.79399080e-04    3           23         2        -2             
      9.79399080e-04    3           23         4        -4             
      1.26170740e-03    3           23         1        -1             
      1.26170740e-03    3           23         3        -3             
      1.26170740e-03    3           23         5        -5             
#----------------------------------------------------------------------
#           PDG      WIDTH     
DECAY        35  2.35956265e+00   # H decays 
#          BR         NDA          ID1       ID2       ID3       ID4
      1.10109750e-04    2           13       -13                       
      3.15365310e-02    2           15       -15                       
      1.29080600e-03    2            3        -3                       
      3.18297150e-01    2            5        -5                       
      1.16110830e-05    2            4        -4                       
      5.29741820e-01    2            6        -6                       
      2.78973310e-04    2           21        21                       
      1.79258200e-03    2           24       -24                       
      9.10131090e-04    2           23        23                       
      3.60186140e-03    2      1000022   1000022                       
      1.65094600e-02    2      1000022   1000023                       
      8.66257320e-02    2      1000022   1000025                       
      1.81897160e-03    2      1000022   1000035                       
      7.05252820e-03    2           25        25                       
      1.43359400e-04    2      2000011  -2000011                       
      1.43329760e-04    2      2000013  -2000013                       
      1.35006090e-04    2      1000015  -1000015                       
#----------------------------------------------------------------------
#           PDG      WIDTH     
DECAY        36  2.41532421e+00   # A decays 
#          BR         NDA          ID1       ID2       ID3       ID4
      1.06944060e-04    2           13       -13                       
      3.06302230e-02    2           15       -15                       
      1.25376820e-03    2            3        -3                       
      3.09435870e-01    2            5        -5                       
      1.07973910e-05    2            4        -4                       
      5.47095840e-01    2            6        -6                       
      3.25586680e-04    2           21        21                       
      6.42219980e-03    2      1000022   1000022                       
      5.82505990e-02    2      1000022   1000023                       
      4.81351510e-03    2      1000022   1000025                       
      3.99708860e-02    2      1000022   1000035                       
      1.68378810e-03    2           25        23                       
#----------------------------------------------------------------------
#           PDG      WIDTH     
DECAY        37  2.21571400e+00   # H+ decays 
#          BR         NDA          ID1       ID2       ID3       ID4
      1.17703140e-04    2           14       -13                       
      3.37117760e-02    2           16       -15                       
      1.27924910e-03    2            4        -3                       
      8.33736780e-01    2            6        -5                       
      7.96733650e-02    2      1000024   1000022                       
      4.96034180e-02    2      1000037   1000022                       
      1.87776200e-03    2           25        24                       
#----------------------------------------------------------------------
#           PDG      WIDTH     
DECAY         6  1.14678979e+00   # t decays 
#          BR         NDA          ID1       ID2       ID3       ID4
      3.33333340e-01    3            2        -1         5             
      3.33333340e-01    3            4        -3         5             
      1.11111110e-01    3           12       -11         5             
      1.11111110e-01    3           14       -13         5             
      1.11111110e-01    3           16       -15         5             
