#
#                              ======================
#                              | THE SUSYHIT OUTPUT |
#                              ======================
#
#
#              ------------------------------------------------------
#              |     This is the output of the SUSY-HIT package     |
#              |  created by A.Djouadi, M.Muehlleitner and M.Spira. |
#              |  In case of problems with SUSY-HIT email to        |
#              |           margarete.muehlleitner@cern.ch           |
#              |           michael.spira@psi.ch                     |
#              |           abdelhak.djouadi@cern.ch                 |
#              ------------------------------------------------------
#
#              ------------------------------------------------------
#              |  SUSY Les Houches Accord - MSSM Spectrum + Decays  |
#              |              based on the decay programs           |
#              |                                                    |
#              |                     SDECAY 1.3b                    |
#              |                                                    |
#              |  Authors: M.Muhlleitner, A.Djouadi and Y.Mambrini  |
#              |  Ref.:    Comput.Phys.Commun.168(2005)46           |
#              |           [hep-ph/0311167]                         |
#              |                                                    |
#              |                     HDECAY 3.4                     |
#              |                                                    |
#              |  By: A.Djouadi,J.Kalinowski,M.Muhlleitner,M.Spira  |
#              |  Ref.:    Comput.Phys.Commun.108(1998)56           |
#              |           [hep-ph/9704448]                         |
#              |                                                    |
#              |                                                    |
#              |  If not stated otherwise all DRbar couplings and   |
#              |  soft SUSY breaking masses are given at the scale  |
#              |  Q=  0.31055470E+04
#              |                                                    |
#              ------------------------------------------------------
#
#
BLOCK DCINFO  # Decay Program information
     1   SDECAY/HDECAY # decay calculator
     2   1.3b  /3.4    # version number
#
BLOCK SPINFO  # Spectrum calculator information
     1     SOFTSUSY    # spectrum calculator               
     2     3.4.0       # version number                    
#
BLOCK MODSEL  # Model selection
     1     0   #  nonUniversal                                     
#
BLOCK SMINPUTS  # Standard Model inputs
         1     1.27908970E+02   # alpha_em^-1(M_Z)^MSbar
         2     1.16637870E-05   # G_F [GeV^-2]
         3     1.18400000E-01   # alpha_S(M_Z)^MSbar
         4     9.11876000E+01   # M_Z pole mass
         5     4.18000000E+00   # mb(mb)^MSbar
         6     1.73200000E+02   # mt pole mass
         7     1.77700000E+00   # mtau pole mass
#
BLOCK MINPAR  # Input parameters - minimal models
         3     6.44000000E+00   # tanb                
#
BLOCK EXTPAR  # Input parameters - non-minimal models
         0    -1.00000000E+00   # Set                 
         1     5.30020000E+02   # M_1(MX)             
         2    -1.35223000E+03   # M_2(MX)             
         3     8.57970000E+02   # M_3(MX)             
        11    -4.50983000E+03   # At(MX)              
        12     2.57511000E+03   # Ab(MX)              
        13    -2.69492000E+03   # Atau(MX)            
        23    -5.16700000E+02   # mu(MX)              
        26     2.26966000E+03   # mA(pole)            
        31     3.00555000E+03   # meL(MX)             
        32     3.00555000E+03   # mmuL(MX)            
        33     1.20438000E+03   # mtauL(MX)           
        34     3.73330000E+03   # meR(MX)             
        35     3.73330000E+03   # mmuR(MX)            
        36     3.12595000E+03   # mtauR(MX)           
        41     1.61167000E+03   # mqL1(MX)            
        42     1.61167000E+03   # mqL2(MX)            
        43     2.71946000E+03   # mqL3(MX)            
        44     3.16171000E+03   # muR(MX)             
        45     3.16171000E+03   # mcR(MX)             
        46     3.54707000E+03   # mtR(MX)             
        47     2.39835000E+03   # mdR(MX)             
        48     2.39835000E+03   # msR(MX)             
        49     3.95685000E+03   # mbR(MX)             
#
BLOCK MASS  # Mass Spectrum
# PDG code           mass       particle
        24     8.03853054E+01   # W+
        25     1.25248894E+02   # h
        35     2.26990470E+03   # H
        36     2.26966000E+03   # A
        37     2.27128327E+03   # H+
         5     4.81876030E+00   # b-quark pole mass calculated from mb(mb)_Msbar
   1000001     1.66372342E+03   # ~d_L
   2000001     2.43038890E+03   # ~d_R
   1000002     1.66208297E+03   # ~u_L
   2000002     3.19423580E+03   # ~u_R
   1000003     1.66372342E+03   # ~s_L
   2000003     2.43038890E+03   # ~s_R
   1000004     1.66208297E+03   # ~c_L
   2000004     3.19423580E+03   # ~c_R
   1000005     2.72251626E+03   # ~b_1
   2000005     3.99457146E+03   # ~b_2
   1000006     2.71060633E+03   # ~t_1
   2000006     3.49947591E+03   # ~t_2
   1000011     3.01388833E+03   # ~e_L
   2000011     3.73827373E+03   # ~e_R
   1000012     3.01257839E+03   # ~nu_eL
   1000013     3.01388833E+03   # ~mu_L
   2000013     3.73827373E+03   # ~mu_R
   1000014     3.01257839E+03   # ~nu_muL
   1000015     1.22339343E+03   # ~tau_1
   2000015     3.13046172E+03   # ~tau_2
   1000016     1.22066366E+03   # ~nu_tauL
   1000021     1.04149966E+03   # ~g
   1000022     5.05959054E+02   # ~chi_10
   1000023    -5.31961254E+02   # ~chi_20
   1000025     5.58196591E+02   # ~chi_30
   1000035    -1.38074016E+03   # ~chi_40
   1000024     5.32086476E+02   # ~chi_1+
   1000037     1.38090883E+03   # ~chi_2+
#
BLOCK NMIX  # Neutralino Mixing Matrix
  1  1     7.61751280E-01   # N_11
  1  2     1.50669739E-02   # N_12
  1  3    -4.75416818E-01   # N_13
  1  4    -4.39871371E-01   # N_14
  2  1     3.33566113E-02   # N_21
  2  2     7.47847490E-02   # N_22
  2  3     7.06354026E-01   # N_23
  2  4    -7.03106370E-01   # N_24
  3  1     6.47007934E-01   # N_31
  3  2    -1.89004281E-02   # N_32
  3  3     5.23216226E-01   # N_33
  3  4     5.54317858E-01   # N_34
  4  1    -1.74853419E-03   # N_41
  4  2     9.96906717E-01   # N_42
  4  3    -3.58834026E-02   # N_43
  4  4     6.99022361E-02   # N_44
#
BLOCK UMIX  # Chargino Mixing Matrix U
  1  1     5.07343096E-02   # U_11
  1  2     9.98712186E-01   # U_12
  2  1    -9.98712186E-01   # U_21
  2  2     5.07343096E-02   # U_22
#
BLOCK VMIX  # Chargino Mixing Matrix V
  1  1    -9.88987957E-02   # V_11
  1  2    -9.95097497E-01   # V_12
  2  1     9.95097497E-01   # V_21
  2  2    -9.88987957E-02   # V_22
#
BLOCK STOPMIX  # Stop Mixing Matrix
  1  1     9.91871372E-01   # cos(theta_t)
  1  2     1.27244573E-01   # sin(theta_t)
  2  1    -1.27244573E-01   # -sin(theta_t)
  2  2     9.91871372E-01   # cos(theta_t)
#
BLOCK SBOTMIX  # Sbottom Mixing Matrix
  1  1     9.99998808E-01   # cos(theta_b)
  1  2    -1.54402027E-03   # sin(theta_b)
  2  1     1.54402027E-03   # -sin(theta_b)
  2  2     9.99998808E-01   # cos(theta_b)
#
BLOCK STAUMIX  # Stau Mixing Matrix
  1  1     9.99999991E-01   # cos(theta_tau)
  1  2    -1.34164078E-04   # sin(theta_tau)
  2  1     1.34164078E-04   # -sin(theta_tau)
  2  2     9.99999991E-01   # cos(theta_tau)
#
BLOCK ALPHA  # Higgs mixing
          -1.62580359E-01   # Mixing angle in the neutral Higgs boson sector
#
BLOCK HMIX Q=  3.10554700E+03  # DRbar Higgs Parameters
         1    -5.24222932E+02   # mu(Q)MSSM           
         2     6.12485491E+00   # tan                 
         3     2.41893854E+02   # higgs               
         4     5.18002192E+06   # mA^2(Q)MSSM         
#
BLOCK GAUGE Q=  3.10554700E+03  # The gauge couplings
     1     3.65116893E-01   # gprime(Q) DRbar
     2     6.39764552E-01   # g(Q) DRbar
     3     1.02970806E+00   # g3(Q) DRbar
#
BLOCK AU Q=  3.10554700E+03  # The trilinear couplings
  1  1     0.00000000E+00   # A_u(Q) DRbar
  2  2     0.00000000E+00   # A_c(Q) DRbar
  3  3    -4.50982999E+03   # A_t(Q) DRbar
#
BLOCK AD Q=  3.10554700E+03  # The trilinear couplings
  1  1     0.00000000E+00   # A_d(Q) DRbar
  2  2     0.00000000E+00   # A_s(Q) DRbar
  3  3     2.57511000E+03   # A_b(Q) DRbar
#
BLOCK AE Q=  3.10554700E+03  # The trilinear couplings
  1  1     0.00000000E+00   # A_e(Q) DRbar
  2  2     0.00000000E+00   # A_mu(Q) DRbar
  3  3    -2.69492000E+03   # A_tau(Q) DRbar
#
BLOCK Yu Q=  3.10554700E+03  # The Yukawa couplings
  1  1     0.00000000E+00   # y_u(Q) DRbar
  2  2     0.00000000E+00   # y_c(Q) DRbar
  3  3     8.30176986E-01   # y_t(Q) DRbar
#
BLOCK Yd Q=  3.10554700E+03  # The Yukawa couplings
  1  1     0.00000000E+00   # y_d(Q) DRbar
  2  2     0.00000000E+00   # y_s(Q) DRbar
  3  3     8.35538368E-02   # y_b(Q) DRbar
#
BLOCK Ye Q=  3.10554700E+03  # The Yukawa couplings
  1  1     0.00000000E+00   # y_e(Q) DRbar
  2  2     0.00000000E+00   # y_mu(Q) DRbar
  3  3     6.39075877E-02   # y_tau(Q) DRbar
#
BLOCK MSOFT Q=  3.10554700E+03  # The soft SUSY breaking masses at the scale Q
         1     5.30020000E+02   # M_1(Q)              
         2    -1.35223000E+03   # M_2(Q)              
         3     8.57970000E+02   # M_3(Q)              
        21     4.71450648E+06   # mH1^2(Q)            
        22     3.60205824E+04   # mH2^2(Q)            
        31     3.00555000E+03   # meL(Q)              
        32     3.00555000E+03   # mmuL(Q)             
        33     1.20438000E+03   # mtauL(Q)            
        34     3.73330000E+03   # meR(Q)              
        35     3.73330000E+03   # mmuR(Q)             
        36     3.12595000E+03   # mtauR(Q)            
        41     1.61167000E+03   # mqL1(Q)             
        42     1.61167000E+03   # mqL2(Q)             
        43     2.71945999E+03   # mqL3(Q)             
        44     3.16171000E+03   # muR(Q)              
        45     3.16171000E+03   # mcR(Q)              
        46     3.54706999E+03   # mtR(Q)              
        47     2.39835000E+03   # mdR(Q)              
        48     2.39835000E+03   # msR(Q)              
        49     3.95685000E+03   # mbR(Q)              
#
Block HiggsBoundsInputHiggsCouplingsFermions
# ScalarNormEffCoupSq PseudoSNormEffCoupSq NP   IP1 IP2 IP2
    1.00907445E+00    0.00000000E+00        3  25   5   5  # h0-b-b eff. coupling^2, normalised to SM
    3.75047732E+01    0.00000000E+00        3  35   5   5  # H0-b-b eff. coupling^2, normalised to SM
    0.00000000E+00    3.75138477E+01        3  36   5   5  # A0-b-b eff. coupling^2, normalised to SM
#
    9.99758104E-01    0.00000000E+00        3  25   6   6  # h0-t-t eff. coupling^2, normalised to SM
    2.68987191E-02    0.00000000E+00        3  35   6   6  # H0-t-t eff. coupling^2, normalised to SM
    0.00000000E+00    2.66568231E-02        3  36   6   6  # A0-t-t eff. coupling^2, normalised to SM
#
    1.00907445E+00    0.00000000E+00        3  25  15  15  # h0-tau-tau eff. coupling^2, normalised to SM
    3.75047732E+01    0.00000000E+00        3  35  15  15  # H0-tau-tau eff. coupling^2, normalised to SM
    0.00000000E+00    3.75138477E+01        3  36  15  15  # A0-tau-tau eff. coupling^2, normalised to SM
#
Block HiggsBoundsInputHiggsCouplingsBosons
    9.99999454E-01        3  25  24  24  # h0-W-W eff. coupling^2, normalised to SM
    5.46358340E-07        3  35  24  24  # H0-W-W eff. coupling^2, normalised to SM
    0.00000000E+00        3  36  24  24  # A0-W-W eff. coupling^2, normalised to SM
#
    9.99999454E-01        3  25  23  23  # h0-Z-Z eff. coupling^2, normalised to SM
    5.46358340E-07        3  35  23  23  # H0-Z-Z eff. coupling^2, normalised to SM
    0.00000000E+00        3  36  23  23  # A0-Z-Z eff. coupling^2, normalised to SM
#
    8.87725115E-01        3  25  21  21  # h0-g-g eff. coupling^2, normalised to SM
    5.51901237E-11        3  35  21  21  # H0-g-g eff. coupling^2, normalised to SM
    1.59777884E-10        3  36  21  21  # A0-g-g eff. coupling^2, normalised to SM
#
    0.00000000E+00        3  25  25  23  # h0-h0-Z eff. coupling^2, normalised to SM
    0.00000000E+00        3  35  25  23  # H0-h0-Z eff. coupling^2, normalised to SM
    5.46358340E-07        3  36  25  23  # A0-h0-Z eff. coupling^2, normalised to SM
    0.00000000E+00        3  35  35  23  # H0-H0-Z eff. coupling^2, normalised to SM
    9.99999454E-01        3  36  35  23  # A0-H0-Z eff. coupling^2, normalised to SM
    0.00000000E+00        3  36  36  23  # A0-A0-Z eff. coupling^2, normalised to SM
#
    0.00000000E+00        4  25  21  21  23  # h0-g-g-Z eff. coupling^2, normalised to SM
    0.00000000E+00        4  35  21  21  23  # H0-g-g-Z eff. coupling^2, normalised to SM
    0.00000000E+00        4  36  21  21  23  # A0-g-g-Z eff. coupling^2, normalised to SM
#
#
#
#                             =================
#                             |The decay table|
#                             =================
#
# - The QCD corrections to the decays gluino -> squark  + quark
#                                     squark -> gaugino + quark_prime
#                                     squark -> squark_prime + Higgs
#                                     squark -> gluino  + quark
#   are included.
#
# - The multi-body decays for the inos, stops and sbottoms are included.
#
# - The loop induced decays for the gluino, neutralinos and stops
#   are included.
#
# - The SUSY decays of the top quark are included.
#
#
#         PDG            Width
DECAY         6     1.44169512E+00   # top decays
#          BR         NDA      ID1       ID2
     1.00000000E+00    2           5        24   # BR(t ->  b    W+)
#
#         PDG            Width
DECAY   1000021     9.56828065E-05   # gluino decays
#          BR         NDA      ID1       ID2
     3.55720964E-02    2     1000022        21   # BR(~g -> ~chi_10 g)
     4.98036466E-02    2     1000023        21   # BR(~g -> ~chi_20 g)
     2.00218172E-02    2     1000025        21   # BR(~g -> ~chi_30 g)
#           BR         NDA      ID1       ID2       ID3
     5.07253027E-02    3     1000022         1        -1   # BR(~g -> ~chi_10 d  db)
     2.59847655E-03    3     1000023         1        -1   # BR(~g -> ~chi_20 d  db)
     3.45956435E-02    3     1000025         1        -1   # BR(~g -> ~chi_30 d  db)
     7.03462380E-02    3     1000022         2        -2   # BR(~g -> ~chi_10 u  ub)
     3.66819360E-03    3     1000023         2        -2   # BR(~g -> ~chi_20 u  ub)
     2.62289219E-02    3     1000025         2        -2   # BR(~g -> ~chi_30 u  ub)
     5.07253027E-02    3     1000022         3        -3   # BR(~g -> ~chi_10 s  sb)
     2.59847655E-03    3     1000023         3        -3   # BR(~g -> ~chi_20 s  sb)
     3.45956435E-02    3     1000025         3        -3   # BR(~g -> ~chi_30 s  sb)
     7.03462380E-02    3     1000022         4        -4   # BR(~g -> ~chi_10 c  cb)
     3.66819360E-03    3     1000023         4        -4   # BR(~g -> ~chi_20 c  cb)
     2.62289219E-02    3     1000025         4        -4   # BR(~g -> ~chi_30 c  cb)
     7.11253160E-03    3     1000022         5        -5   # BR(~g -> ~chi_10 b  bb)
     2.89445420E-03    3     1000023         5        -5   # BR(~g -> ~chi_20 b  bb)
     4.58627104E-03    3     1000025         5        -5   # BR(~g -> ~chi_30 b  bb)
     3.92013358E-02    3     1000022         6        -6   # BR(~g -> ~chi_10 t  tb)
     4.74271672E-02    3     1000023         6        -6   # BR(~g -> ~chi_20 t  tb)
     4.17655575E-02    3     1000025         6        -6   # BR(~g -> ~chi_30 t  tb)
     7.82998045E-03    3     1000024         1        -2   # BR(~g -> ~chi_1+ d  ub)
     7.82998045E-03    3    -1000024         2        -1   # BR(~g -> ~chi_1- u  db)
     7.82998045E-03    3     1000024         3        -4   # BR(~g -> ~chi_1+ s  cb)
     7.82998045E-03    3    -1000024         4        -3   # BR(~g -> ~chi_1- c  sb)
     1.71984824E-01    3     1000024         5        -6   # BR(~g -> ~chi_1+ b  tb)
     1.71984824E-01    3    -1000024         6        -5   # BR(~g -> ~chi_1- t  bb)
#
#         PDG            Width
DECAY   1000006     1.64025234E+02   # stop1 decays
#          BR         NDA      ID1       ID2
     4.78474875E-02    2     1000022         6   # BR(~t_1 -> ~chi_10 t )
     1.02265671E-01    2     1000023         6   # BR(~t_1 -> ~chi_20 t )
     5.73296851E-02    2     1000025         6   # BR(~t_1 -> ~chi_30 t )
     3.81094966E-02    2     1000035         6   # BR(~t_1 -> ~chi_40 t )
     2.62886011E-03    2     1000024         5   # BR(~t_1 -> ~chi_1+ b )
     7.42774569E-02    2     1000037         5   # BR(~t_1 -> ~chi_2+ b )
     6.77541343E-01    2     1000021         6   # BR(~t_1 -> ~g      t )
#
#         PDG            Width
DECAY   2000006     3.14353396E+02   # stop2 decays
#          BR         NDA      ID1       ID2
     3.82857470E-02    2     1000022         6   # BR(~t_2 -> ~chi_10 t )
     7.22154825E-02    2     1000023         6   # BR(~t_2 -> ~chi_20 t )
     5.96583090E-02    2     1000025         6   # BR(~t_2 -> ~chi_30 t )
     7.20975630E-06    2     1000035         6   # BR(~t_2 -> ~chi_40 t )
     1.44723793E-01    2     1000024         5   # BR(~t_2 -> ~chi_1+ b )
     7.48431704E-08    2     1000037         5   # BR(~t_2 -> ~chi_2+ b )
     5.12885314E-01    2     1000021         6   # BR(~t_2 -> ~g      t )
     4.38618356E-02    2     1000006        25   # BR(~t_2 -> ~t_1    h )
     4.42030096E-02    2     1000006        23   # BR(~t_2 -> ~t_1    Z )
     8.41592252E-02    2     1000005        24   # BR(~t_2 -> ~b_1    W+)
#
#         PDG            Width
DECAY   1000005     1.64822361E+02   # sbottom1 decays
#          BR         NDA      ID1       ID2
     1.54828950E-03    2     1000022         5   # BR(~b_1 -> ~chi_10 b )
     1.35087922E-03    2     1000023         5   # BR(~b_1 -> ~chi_20 b )
     1.81205102E-03    2     1000025         5   # BR(~b_1 -> ~chi_30 b )
     3.69017869E-02    2     1000035         5   # BR(~b_1 -> ~chi_40 b )
     2.05544497E-01    2    -1000024         6   # BR(~b_1 -> ~chi_1- t )
     7.57615840E-02    2    -1000037         6   # BR(~b_1 -> ~chi_2- t )
     6.77080912E-01    2     1000021         5   # BR(~b_1 -> ~g      b )
#
#         PDG            Width
DECAY   2000005     1.98556616E+02   # sbottom2 decays
#          BR         NDA      ID1       ID2
     7.26472342E-03    2     1000022         5   # BR(~b_2 -> ~chi_10 b )
     1.35612768E-03    2     1000023         5   # BR(~b_2 -> ~chi_20 b )
     5.51466713E-03    2     1000025         5   # BR(~b_2 -> ~chi_30 b )
     4.26574146E-06    2     1000035         5   # BR(~b_2 -> ~chi_40 b )
     2.67683046E-03    2    -1000024         6   # BR(~b_2 -> ~chi_1- t )
     8.45087173E-06    2    -1000037         6   # BR(~b_2 -> ~chi_2- t )
     9.83022200E-01    2     1000021         5   # BR(~b_2 -> ~g      b )
     4.07523688E-05    2     1000005        25   # BR(~b_2 -> ~b_1    h )
     3.78338230E-05    2     1000005        23   # BR(~b_2 -> ~b_1    Z )
     7.40538132E-05    2     1000006       -24   # BR(~b_2 -> ~t_1    W-)
     9.42789108E-08    2     2000006       -24   # BR(~b_2 -> ~t_2    W-)
#
#         PDG            Width
DECAY   1000002     4.79037615E+01   # sup_L decays
#          BR         NDA      ID1       ID2
     2.86351977E-03    2     1000022         2   # BR(~u_L -> ~chi_10 u)
     7.20851552E-04    2     1000023         2   # BR(~u_L -> ~chi_20 u)
     1.16173361E-03    2     1000025         2   # BR(~u_L -> ~chi_30 u)
     1.33247991E-02    2     1000035         2   # BR(~u_L -> ~chi_40 u)
     2.14212611E-03    2     1000024         1   # BR(~u_L -> ~chi_1+ d)
     2.65422603E-02    2     1000037         1   # BR(~u_L -> ~chi_2+ d)
     9.53244710E-01    2     1000021         2   # BR(~u_L -> ~g      u)
#
#         PDG            Width
DECAY   2000002     1.96920765E+02   # sup_R decays
#          BR         NDA      ID1       ID2
     2.04402293E-02    2     1000022         2   # BR(~u_R -> ~chi_10 u)
     3.89830178E-05    2     1000023         2   # BR(~u_R -> ~chi_20 u)
     1.45825771E-02    2     1000025         2   # BR(~u_R -> ~chi_30 u)
     7.49738752E-08    2     1000035         2   # BR(~u_R -> ~chi_40 u)
     9.64938136E-01    2     1000021         2   # BR(~u_R -> ~g      u)
#
#         PDG            Width
DECAY   1000001     4.80097317E+01   # sdown_L decays
#          BR         NDA      ID1       ID2
     1.88484861E-03    2     1000022         1   # BR(~d_L -> ~chi_10 d)
     5.12578531E-04    2     1000023         1   # BR(~d_L -> ~chi_20 d)
     2.15617663E-03    2     1000025         1   # BR(~d_L -> ~chi_30 d)
     1.34416150E-02    2     1000035         1   # BR(~d_L -> ~chi_40 d)
     5.63298517E-04    2    -1000024         2   # BR(~d_L -> ~chi_1- u)
     2.69340344E-02    2    -1000037         2   # BR(~d_L -> ~chi_2- u)
     9.54507448E-01    2     1000021         1   # BR(~d_L -> ~g      d)
#
#         PDG            Width
DECAY   2000001     1.21897883E+02   # sdown_R decays
#          BR         NDA      ID1       ID2
     6.03600229E-03    2     1000022         1   # BR(~d_R -> ~chi_10 d)
     1.14646413E-05    2     1000023         1   # BR(~d_R -> ~chi_20 d)
     4.26990893E-03    2     1000025         1   # BR(~d_R -> ~chi_30 d)
     1.59990716E-08    2     1000035         1   # BR(~d_R -> ~chi_40 d)
     9.89682608E-01    2     1000021         1   # BR(~d_R -> ~g      d)
#
#         PDG            Width
DECAY   1000004     3.67601367E+01   # scharm_L decays
#          BR         NDA      ID1       ID2
     3.87858295E-03    2     1000022         4   # BR(~c_L -> ~chi_10 c)
     9.76140024E-04    2     1000023         4   # BR(~c_L -> ~chi_20 c)
     1.57276298E-03    2     1000025         4   # BR(~c_L -> ~chi_30 c)
     1.75566291E-02    2     1000035         4   # BR(~c_L -> ~chi_40 c)
     2.90075959E-03    2     1000024         3   # BR(~c_L -> ~chi_1+ s)
     3.49718279E-02    2     1000037         3   # BR(~c_L -> ~chi_2+ s)
     9.38143297E-01    2     1000021         4   # BR(~c_L -> ~g      c)
#
#         PDG            Width
DECAY   2000004     1.50628090E+02   # scharm_R decays
#          BR         NDA      ID1       ID2
     2.75713478E-02    2     1000022         4   # BR(~c_R -> ~chi_10 c)
     5.25818225E-05    2     1000023         4   # BR(~c_R -> ~chi_20 c)
     1.96690401E-02    2     1000025         4   # BR(~c_R -> ~chi_30 c)
     1.01063263E-07    2     1000035         4   # BR(~c_R -> ~chi_40 c)
     9.52706929E-01    2     1000021         4   # BR(~c_R -> ~g      c)
#
#         PDG            Width
DECAY   1000003     3.68239760E+01   # sstrange_L decays
#          BR         NDA      ID1       ID2
     2.55416124E-03    2     1000022         3   # BR(~s_L -> ~chi_10 s)
     6.94425981E-04    2     1000023         3   # BR(~s_L -> ~chi_20 s)
     2.92038883E-03    2     1000025         3   # BR(~s_L -> ~chi_30 s)
     1.77218190E-02    2     1000035         3   # BR(~s_L -> ~chi_40 s)
     7.63138022E-04    2    -1000024         4   # BR(~s_L -> ~chi_1- c)
     3.55094067E-02    2    -1000037         4   # BR(~s_L -> ~chi_2- c)
     9.39836660E-01    2     1000021         3   # BR(~s_L -> ~g      s)
#
#         PDG            Width
DECAY   2000003     9.24102600E+01   # sstrange_R decays
#          BR         NDA      ID1       ID2
     8.23151099E-03    2     1000022         3   # BR(~s_R -> ~chi_10 s)
     1.56335895E-05    2     1000023         3   # BR(~s_R -> ~chi_20 s)
     5.82217785E-03    2     1000025         3   # BR(~s_R -> ~chi_30 s)
     2.17358947E-08    2     1000035         3   # BR(~s_R -> ~chi_40 s)
     9.85930656E-01    2     1000021         3   # BR(~s_R -> ~g      s)
#
#         PDG            Width
DECAY   1000011     2.67873438E+01   # selectron_L decays
#          BR         NDA      ID1       ID2
     8.75288016E-02    2     1000022        11   # BR(~e_L -> ~chi_10 e-)
     3.78488870E-03    2     1000023        11   # BR(~e_L -> ~chi_20 e-)
     5.24355236E-02    2     1000025        11   # BR(~e_L -> ~chi_30 e-)
     2.83637756E-01    2     1000035        11   # BR(~e_L -> ~chi_40 e-)
     2.21344318E-03    2    -1000024        12   # BR(~e_L -> ~chi_1- nu_e)
     5.70399587E-01    2    -1000037        12   # BR(~e_L -> ~chi_2- nu_e)
#
#         PDG            Width
DECAY   2000011     1.90441363E+01   # selectron_R decays
#          BR         NDA      ID1       ID2
     5.82239226E-01    2     1000022        11   # BR(~e_R -> ~chi_10 e-)
     1.11206072E-03    2     1000023        11   # BR(~e_R -> ~chi_20 e-)
     4.16646339E-01    2     1000025        11   # BR(~e_R -> ~chi_30 e-)
     2.37402922E-06    2     1000035        11   # BR(~e_R -> ~chi_40 e-)
#
#         PDG            Width
DECAY   1000013     2.67873438E+01   # smuon_L decays
#          BR         NDA      ID1       ID2
     8.75288015E-02    2     1000022        13   # BR(~mu_L -> ~chi_10 mu-)
     3.78488869E-03    2     1000023        13   # BR(~mu_L -> ~chi_20 mu-)
     5.24355235E-02    2     1000025        13   # BR(~mu_L -> ~chi_30 mu-)
     2.83637755E-01    2     1000035        13   # BR(~mu_L -> ~chi_40 mu-)
     2.21344319E-03    2    -1000024        14   # BR(~mu_L -> ~chi_1- nu_mu)
     5.70399588E-01    2    -1000037        14   # BR(~mu_L -> ~chi_2- nu_mu)
#
#         PDG            Width
DECAY   2000013     1.90441363E+01   # smuon_R decays
#          BR         NDA      ID1       ID2
     5.82239226E-01    2     1000022        13   # BR(~mu_R -> ~chi_10 mu-)
     1.11206072E-03    2     1000023        13   # BR(~mu_R -> ~chi_20 mu-)
     4.16646339E-01    2     1000025        13   # BR(~mu_R -> ~chi_30 mu-)
     2.37402922E-06    2     1000035        13   # BR(~mu_R -> ~chi_40 mu-)
#
#         PDG            Width
DECAY   1000015     1.18650450E+00   # stau_1 decays
#          BR         NDA      ID1       ID2
     5.96420484E-01    2     1000022        15   # BR(~tau_1 -> ~chi_10  tau-)
     5.17111497E-02    2     1000023        15   # BR(~tau_1 -> ~chi_20  tau-)
     3.37652646E-01    2     1000025        15   # BR(~tau_1 -> ~chi_30  tau-)
     1.42157203E-02    2    -1000024        16   # BR(~tau_1 -> ~chi_1-  nu_tau)
#
#         PDG            Width
DECAY   2000015     1.61516326E+01   # stau_2 decays
#          BR         NDA      ID1       ID2
     5.69170807E-01    2     1000022        15   # BR(~tau_2 -> ~chi_10  tau-)
     8.48882157E-03    2     1000023        15   # BR(~tau_2 -> ~chi_20  tau-)
     4.07461454E-01    2     1000025        15   # BR(~tau_2 -> ~chi_30  tau-)
     1.59051647E-05    2     1000035        15   # BR(~tau_2 -> ~chi_40  tau-)
     1.48110292E-02    2    -1000024        16   # BR(~tau_2 -> ~chi_1-  nu_tau)
     2.77034715E-05    2    -1000037        16   # BR(~tau_2 -> ~chi_2-  nu_tau)
     1.30920498E-05    2     1000016       -24   # BR(~tau_2 -> ~nu_tauL W-)
     4.46587644E-06    2     1000015        25   # BR(~tau_2 -> ~tau_1   h)
     6.72140706E-06    2     1000015        23   # BR(~tau_2 -> ~tau_1   Z)
#
#         PDG            Width
DECAY   1000012     2.68012518E+01   # snu_eL decays
#          BR         NDA      ID1       ID2
     7.61173994E-02    2     1000022        12   # BR(~nu_eL -> ~chi_10 nu_e)
     1.33495760E-03    2     1000023        12   # BR(~nu_eL -> ~chi_20 nu_e)
     6.42956105E-02    2     1000025        12   # BR(~nu_eL -> ~chi_30 nu_e)
     2.84372767E-01    2     1000035        12   # BR(~nu_eL -> ~chi_40 nu_e)
     8.40249652E-03    2     1000024        11   # BR(~nu_eL -> ~chi_1+ e-)
     5.65476769E-01    2     1000037        11   # BR(~nu_eL -> ~chi_2+ e-)
#
#         PDG            Width
DECAY   1000014     2.68012517E+01   # snu_muL decays
#          BR         NDA      ID1       ID2
     7.61173996E-02    2     1000022        14   # BR(~nu_muL -> ~chi_10 nu_mu)
     1.33495761E-03    2     1000023        14   # BR(~nu_muL -> ~chi_20 nu_mu)
     6.42956107E-02    2     1000025        14   # BR(~nu_muL -> ~chi_30 nu_mu)
     2.84372767E-01    2     1000035        14   # BR(~nu_muL -> ~chi_40 nu_mu)
     8.40249652E-03    2     1000024        13   # BR(~nu_muL -> ~chi_1+ mu-)
     5.65476768E-01    2     1000037        13   # BR(~nu_muL -> ~chi_2+ mu-)
#
#         PDG            Width
DECAY   1000016     1.20732844E+00   # snu_tauL decays
#          BR         NDA      ID1       ID2
     4.97264607E-01    2     1000022        16   # BR(~nu_tauL -> ~chi_10 nu_tau)
     8.39510538E-03    2     1000023        16   # BR(~nu_tauL -> ~chi_20 nu_tau)
     3.87918987E-01    2     1000025        16   # BR(~nu_tauL -> ~chi_30 nu_tau)
     1.06421301E-01    2     1000024        15   # BR(~nu_tauL -> ~chi_1+ tau-)
#
#         PDG            Width
DECAY   1000024     6.10448896E-06   # chargino1+ decays
#           BR         NDA      ID1       ID2       ID3
     3.34207077E-01    3     1000022         2        -1   # BR(~chi_1+ -> ~chi_10 u    db)
     2.05827646E-12    3     1000023         2        -1   # BR(~chi_1+ -> ~chi_20 u    db)
     3.34207077E-01    3     1000022         4        -3   # BR(~chi_1+ -> ~chi_10 c    sb)
     1.11385567E-01    3     1000022       -11        12   # BR(~chi_1+ -> ~chi_10 e+   nu_e)
     6.86076874E-13    3     1000023       -11        12   # BR(~chi_1+ -> ~chi_20 e+   nu_e)
     1.11385567E-01    3     1000022       -13        14   # BR(~chi_1+ -> ~chi_10 mu+  nu_mu)
     6.86076874E-13    3     1000023       -13        14   # BR(~chi_1+ -> ~chi_20 mu+  nu_mu)
     1.08814711E-01    3     1000022       -15        16   # BR(~chi_1+ -> ~chi_10 tau+ nu_tau)
#
#         PDG            Width
DECAY   1000037     1.31639642E+01   # chargino2+ decays
#          BR         NDA      ID1       ID2
     2.02100543E-02    2     1000016       -15   # BR(~chi_2+ -> ~nu_tau1 tau+)
     1.97136798E-02    2    -1000015        16   # BR(~chi_2+ -> ~tau_1+  nu_tau)
     2.42794666E-01    2     1000024        23   # BR(~chi_2+ -> ~chi_1+  Z )
     1.03797821E-01    2     1000022        24   # BR(~chi_2+ -> ~chi_10  W+)
     2.37083332E-01    2     1000023        24   # BR(~chi_2+ -> ~chi_20  W+)
     1.32679596E-01    2     1000025        24   # BR(~chi_2+ -> ~chi_30  W+)
     2.43720850E-01    2     1000024        25   # BR(~chi_2+ -> ~chi_1+  h )
#
#         PDG            Width
DECAY   1000022     0.00000000E+00   # neutralino1 decays
#
#         PDG            Width
DECAY   1000023     4.76773783E-06   # neutralino2 decays
#          BR         NDA      ID1       ID2
     1.76922467E-03    2     1000022        22   # BR(~chi_20 -> ~chi_10 gam)
#           BR         NDA      ID1       ID2       ID3
     1.21372641E-01    3     1000022        -2         2   # BR(~chi_20 -> ~chi_10 ub      u)
     1.57510159E-01    3     1000022        -1         1   # BR(~chi_20 -> ~chi_10 db      d)
     1.21372641E-01    3     1000022        -4         4   # BR(~chi_20 -> ~chi_10 cb      c)
     1.57510159E-01    3     1000022        -3         3   # BR(~chi_20 -> ~chi_10 sb      s)
     1.16106064E-01    3     1000022        -5         5   # BR(~chi_20 -> ~chi_10 bb      b)
     3.61587037E-02    3     1000022       -11        11   # BR(~chi_20 -> ~chi_10 e+      e-)
     3.61587037E-02    3     1000022       -13        13   # BR(~chi_20 -> ~chi_10 mu+     mu-)
     3.51579059E-02    3     1000022       -15        15   # BR(~chi_20 -> ~chi_10 tau+    tau-)
     7.23021529E-02    3     1000022       -12        12   # BR(~chi_20 -> ~chi_10 nu_eb   nu_e)
     7.23021529E-02    3     1000022       -14        14   # BR(~chi_20 -> ~chi_10 nu_mub  nu_mu)
     7.22794922E-02    3     1000022       -16        16   # BR(~chi_20 -> ~chi_10 nu_taub nu_tau)
#
#         PDG            Width
DECAY   1000025     2.53389119E-05   # neutralino3 decays
#          BR         NDA      ID1       ID2
     5.06378587E-02    2     1000022        22   # BR(~chi_30 -> ~chi_10 gam)
     7.66575587E-03    2     1000023        22   # BR(~chi_30 -> ~chi_20 gam)
#           BR         NDA      ID1       ID2       ID3
     1.76742796E-04    3     1000022        -2         2   # BR(~chi_30 -> ~chi_10 ub      u)
     2.12418023E-04    3     1000022        -1         1   # BR(~chi_30 -> ~chi_10 db      d)
     1.76742796E-04    3     1000022        -4         4   # BR(~chi_30 -> ~chi_10 cb      c)
     2.12418023E-04    3     1000022        -3         3   # BR(~chi_30 -> ~chi_10 sb      s)
     2.00184039E-04    3     1000022        -5         5   # BR(~chi_30 -> ~chi_10 bb      b)
     4.34741463E-05    3     1000022       -11        11   # BR(~chi_30 -> ~chi_10 e+      e-)
     4.34741463E-05    3     1000022       -13        13   # BR(~chi_30 -> ~chi_10 mu+     mu-)
     3.21457168E-05    3     1000022       -15        15   # BR(~chi_30 -> ~chi_10 tau+    tau-)
     1.03823194E-04    3     1000022       -12        12   # BR(~chi_30 -> ~chi_10 nu_eb   nu_e)
     1.03823194E-04    3     1000022       -14        14   # BR(~chi_30 -> ~chi_10 nu_mub  nu_mu)
     1.30335347E-04    3     1000022       -16        16   # BR(~chi_30 -> ~chi_10 nu_taub nu_tau)
     3.32031513E-02    3     1000023        -2         2   # BR(~chi_30 -> ~chi_20 ub      u)
     4.30919790E-02    3     1000023        -1         1   # BR(~chi_30 -> ~chi_20 db      d)
     3.32031513E-02    3     1000023        -4         4   # BR(~chi_30 -> ~chi_20 cb      c)
     4.30919790E-02    3     1000023        -3         3   # BR(~chi_30 -> ~chi_20 sb      s)
     3.19437168E-02    3     1000023        -5         5   # BR(~chi_30 -> ~chi_20 bb      b)
     9.89611160E-03    3     1000023       -11        11   # BR(~chi_30 -> ~chi_20 e+      e-)
     9.89611160E-03    3     1000023       -13        13   # BR(~chi_30 -> ~chi_20 mu+     mu-)
     9.63567966E-03    3     1000023       -15        15   # BR(~chi_30 -> ~chi_20 tau+    tau-)
     1.97852546E-02    3     1000023       -12        12   # BR(~chi_30 -> ~chi_20 nu_eb   nu_e)
     1.97852546E-02    3     1000023       -14        14   # BR(~chi_30 -> ~chi_20 nu_mub  nu_mu)
     1.97902547E-02    3     1000023       -16        16   # BR(~chi_30 -> ~chi_20 nu_taub nu_tau)
     1.11429308E-01    3     1000024        -2         1   # BR(~chi_30 -> ~chi_1+ ub      d)
     1.11429308E-01    3    -1000024        -1         2   # BR(~chi_30 -> ~chi_1- db      u)
     1.11429308E-01    3     1000024        -4         3   # BR(~chi_30 -> ~chi_1+ cb      s)
     1.11429308E-01    3    -1000024        -3         4   # BR(~chi_30 -> ~chi_1- sb      c)
     3.71473195E-02    3     1000024       -12        11   # BR(~chi_30 -> ~chi_1+ nu_eb   e-)
     3.71473195E-02    3    -1000024        12       -11   # BR(~chi_30 -> ~chi_1- nu_e    e+)
     3.71473195E-02    3     1000024       -14        13   # BR(~chi_30 -> ~chi_1+ nu_mub  mu-)
     3.71473195E-02    3    -1000024        14       -13   # BR(~chi_30 -> ~chi_1- nu_mu   mu+)
     3.63158259E-02    3     1000024       -16        15   # BR(~chi_30 -> ~chi_1+ nu_taub tau-)
     3.63158259E-02    3    -1000024        16       -15   # BR(~chi_30 -> ~chi_1- nu_tau  tau+)
#
#         PDG            Width
DECAY   1000035     1.31538121E+01   # neutralino4 decays
#          BR         NDA      ID1       ID2
     9.50816285E-02    2     1000022        23   # BR(~chi_40 -> ~chi_10   Z )
     2.30340386E-02    2     1000023        23   # BR(~chi_40 -> ~chi_20   Z )
     1.23915766E-01    2     1000025        23   # BR(~chi_40 -> ~chi_30   Z )
     2.37491112E-01    2     1000024       -24   # BR(~chi_40 -> ~chi_1+   W-)
     2.37491112E-01    2    -1000024        24   # BR(~chi_40 -> ~chi_1-   W+)
     1.07990997E-02    2     1000022        25   # BR(~chi_40 -> ~chi_10   h )
     2.20881276E-01    2     1000023        25   # BR(~chi_40 -> ~chi_20   h )
     1.14230676E-02    2     1000025        25   # BR(~chi_40 -> ~chi_30   h )
     9.78897833E-03    2     1000015       -15   # BR(~chi_40 -> ~tau_1-   tau+)
     9.78897833E-03    2    -1000015        15   # BR(~chi_40 -> ~tau_1+   tau-)
     1.01524712E-02    2     1000016       -16   # BR(~chi_40 -> ~nu_tau1  nu_taub)
     1.01524712E-02    2    -1000016        16   # BR(~chi_40 -> ~nu_tau1* nu_tau )
#
#         PDG            Width
DECAY        25     4.06173768E-03   # h decays
#          BR         NDA      ID1       ID2
     5.91482313E-01    2           5        -5   # BR(h -> b       bb     )
     6.44061039E-02    2         -15        15   # BR(h -> tau+    tau-   )
     2.27979918E-04    2         -13        13   # BR(h -> mu+     mu-    )
     2.48772554E-04    2           3        -3   # BR(h -> s       sb     )
     2.13818006E-02    2           4        -4   # BR(h -> c       cb     )
     7.89725078E-02    2          21        21   # BR(h -> g       g      )
     2.34428761E-03    2          22        22   # BR(h -> gam     gam    )
     1.57212553E-03    2          22        23   # BR(h -> Z       gam    )
     2.12722310E-01    2          24       -24   # BR(h -> W+      W-     )
     2.66417993E-02    2          23        23   # BR(h -> Z       Z      )
#
#         PDG            Width
DECAY        35     1.54743333E+01   # H decays
#          BR         NDA      ID1       ID2
     6.35445039E-02    2           5        -5   # BR(H -> b       bb     )
     1.12678155E-02    2         -15        15   # BR(H -> tau+    tau-   )
     4.01143105E-05    2         -13        13   # BR(H -> mu+     mu-    )
     2.67677837E-05    2           3        -3   # BR(H -> s       sb     )
     1.68149799E-06    2           4        -4   # BR(H -> c       cb     )
     1.63823176E-01    2           6        -6   # BR(H -> t       tb     )
     1.08854234E-04    2          21        21   # BR(H -> g       g      )
     6.99146779E-07    2          22        22   # BR(H -> gam     gam    )
     1.53143592E-07    2          23        22   # BR(H -> Z       gam    )
     1.32241281E-04    2          24       -24   # BR(H -> W+      W-     )
     6.59103171E-05    2          23        23   # BR(H -> Z       Z      )
     4.73319239E-04    2          25        25   # BR(H -> h       h      )
     6.83730397E-03    2     1000024  -1000024   # BR(H -> ~chi_1+ ~chi_1-)
     2.05770358E-01    2     1000024  -1000037   # BR(H -> ~chi_1+ ~chi_2-)
     2.05770358E-01    2     1000037  -1000024   # BR(H -> ~chi_2+ ~chi_1-)
     4.02211814E-02    2     1000022   1000022   # BR(H -> ~chi_10 ~chi_10)
     9.45177760E-04    2     1000023   1000023   # BR(H -> ~chi_20 ~chi_20)
     4.02769713E-02    2     1000025   1000025   # BR(H -> ~chi_30 ~chi_30)
     3.73657083E-02    2     1000022   1000023   # BR(H -> ~chi_10 ~chi_20)
     7.08670619E-04    2     1000022   1000025   # BR(H -> ~chi_10 ~chi_30)
     7.62583867E-02    2     1000022   1000035   # BR(H -> ~chi_10 ~chi_40)
     1.74063895E-02    2     1000023   1000025   # BR(H -> ~chi_20 ~chi_30)
     3.03693144E-02    2     1000023   1000035   # BR(H -> ~chi_20 ~chi_40)
     9.85849440E-02    2     1000025   1000035   # BR(H -> ~chi_30 ~chi_40)
#
#         PDG            Width
DECAY        36     1.54683030E+01   # A decays
#          BR         NDA      ID1       ID2
     6.36262000E-02    2           5        -5   # BR(A -> b       bb     )
     1.12737639E-02    2         -15        15   # BR(A -> tau+    tau-   )
     4.01353552E-05    2         -13        13   # BR(A -> mu+     mu-    )
     2.68325242E-05    2           3        -3   # BR(A -> s       sb     )
     1.68224366E-06    2           4        -4   # BR(A -> c       cb     )
     1.64989761E-01    2           6        -6   # BR(A -> t       tb     )
     1.85180481E-04    2          21        21   # BR(A -> g       g      )
     1.16195006E-06    2          22        22   # BR(A -> gam     gam    )
     2.21178945E-07    2          23        22   # BR(A -> Z       gam    )
     1.33630074E-04    2          23        25   # BR(A -> Z       h      )
     1.22621284E-02    2     1000024  -1000024   # BR(A -> ~chi_1+ ~chi_1-)
     2.02723445E-01    2     1000024  -1000037   # BR(A -> ~chi_1+ ~chi_2-)
     2.02723445E-01    2     1000037  -1000024   # BR(A -> ~chi_2+ ~chi_1-)
     2.72847230E-02    2     1000022   1000022   # BR(A -> ~chi_10 ~chi_10)
     2.33933424E-03    2     1000023   1000023   # BR(A -> ~chi_20 ~chi_20)
     2.63877977E-02    2     1000025   1000025   # BR(A -> ~chi_30 ~chi_30)
     5.09139049E-02    2     1000022   1000023   # BR(A -> ~chi_10 ~chi_20)
     2.71569543E-04    2     1000022   1000025   # BR(A -> ~chi_10 ~chi_30)
     1.41759561E-02    2     1000022   1000035   # BR(A -> ~chi_10 ~chi_40)
     3.10228311E-02    2     1000023   1000025   # BR(A -> ~chi_20 ~chi_30)
     1.73616295E-01    2     1000023   1000035   # BR(A -> ~chi_20 ~chi_40)
     1.60000003E-02    2     1000025   1000035   # BR(A -> ~chi_30 ~chi_40)
#
#         PDG            Width
DECAY        37     1.53978374E+01   # H+ decays
#          BR         NDA      ID1       ID2
     1.06547459E-04    2           4        -5   # BR(H+ -> c       bb     )
     1.13334563E-02    2         -15        16   # BR(H+ -> tau+    nu_tau )
     4.03478643E-05    2         -13        14   # BR(H+ -> mu+     nu_mu  )
     1.06544523E-06    2           2        -5   # BR(H+ -> u       bb     )
     1.34621414E-06    2           2        -3   # BR(H+ -> u       sb     )
     2.81177210E-05    2           4        -3   # BR(H+ -> c       sb     )
     2.25830904E-01    2           6        -5   # BR(H+ -> t       bb     )
     1.34679182E-04    2          24        25   # BR(H+ -> W+      h      )
     9.62677715E-13    2          24        36   # BR(H+ -> W+      A      )
     9.98147584E-02    2     1000024   1000022   # BR(H+ -> ~chi_1+ ~chi_10)
     8.34881211E-04    2     1000024   1000023   # BR(H+ -> ~chi_1+ ~chi_20)
     3.93765419E-02    2     1000024   1000025   # BR(H+ -> ~chi_1+ ~chi_30)
     2.07421138E-01    2     1000024   1000035   # BR(H+ -> ~chi_1+ ~chi_40)
     9.08105732E-02    2     1000037   1000022   # BR(H+ -> ~chi_2+ ~chi_10)
     2.09218595E-01    2     1000037   1000023   # BR(H+ -> ~chi_2+ ~chi_20)
     1.15047047E-01    2     1000037   1000025   # BR(H+ -> ~chi_2+ ~chi_30)
