#
#                              ======================
#                              | THE SUSYHIT OUTPUT |
#                              ======================
#
#
#              ------------------------------------------------------
#              |     This is the output of the SUSY-HIT package     |
#              |  created by A.Djouadi, M.Muehlleitner and M.Spira. |
#              |  In case of problems with SUSY-HIT email to        |
#              |           margarete.muehlleitner@cern.ch           |
#              |           michael.spira@psi.ch                     |
#              |           abdelhak.djouadi@cern.ch                 |
#              ------------------------------------------------------
#
#              ------------------------------------------------------
#              |  SUSY Les Houches Accord - MSSM Spectrum + Decays  |
#              |              based on the decay programs           |
#              |                                                    |
#              |                     SDECAY 1.3b                    |
#              |                                                    |
#              |  Authors: M.Muhlleitner, A.Djouadi and Y.Mambrini  |
#              |  Ref.:    Comput.Phys.Commun.168(2005)46           |
#              |           [hep-ph/0311167]                         |
#              |                                                    |
#              |                     HDECAY 3.4                     |
#              |                                                    |
#              |  By: A.Djouadi,J.Kalinowski,M.Muhlleitner,M.Spira  |
#              |  Ref.:    Comput.Phys.Commun.108(1998)56           |
#              |           [hep-ph/9704448]                         |
#              |                                                    |
#              |                                                    |
#              |  If not stated otherwise all DRbar couplings and   |
#              |  soft SUSY breaking masses are given at the scale  |
#              |  Q=  0.29411890E+04
#              |                                                    |
#              ------------------------------------------------------
#
#
BLOCK DCINFO  # Decay Program information
     1   SDECAY/HDECAY # decay calculator
     2   1.3b  /3.4    # version number
#
BLOCK SPINFO  # Spectrum calculator information
     1     SOFTSUSY    # spectrum calculator               
     2     3.4.0       # version number                    
#
BLOCK MODSEL  # Model selection
     1     0   #  nonUniversal                                     
#
BLOCK SMINPUTS  # Standard Model inputs
         1     1.27908970E+02   # alpha_em^-1(M_Z)^MSbar
         2     1.16637870E-05   # G_F [GeV^-2]
         3     1.18400000E-01   # alpha_S(M_Z)^MSbar
         4     9.11876000E+01   # M_Z pole mass
         5     4.18000000E+00   # mb(mb)^MSbar
         6     1.73200000E+02   # mt pole mass
         7     1.77700000E+00   # mtau pole mass
#
BLOCK MINPAR  # Input parameters - minimal models
         3     4.63800000E+01   # tanb                
#
BLOCK EXTPAR  # Input parameters - non-minimal models
         0    -1.00000000E+00   # Set                 
         1    -2.03574000E+03   # M_1(MX)             
         2    -4.50540000E+02   # M_2(MX)             
         3     1.81128000E+03   # M_3(MX)             
        11    -3.94634000E+03   # At(MX)              
        12     2.08283000E+03   # Ab(MX)              
        13     1.51381000E+03   # Atau(MX)            
        23     1.67816000E+03   # mu(MX)              
        26     3.91982000E+03   # mA(pole)            
        31     1.50621000E+03   # meL(MX)             
        32     1.50621000E+03   # mmuL(MX)            
        33     1.93587000E+03   # mtauL(MX)           
        34     3.09417000E+03   # meR(MX)             
        35     3.09417000E+03   # mmuR(MX)            
        36     3.09134000E+03   # mtauR(MX)           
        41     2.50486000E+03   # mqL1(MX)            
        42     2.50486000E+03   # mqL2(MX)            
        43     3.92952000E+03   # mqL3(MX)            
        44     2.35760000E+02   # muR(MX)             
        45     2.35760000E+02   # mcR(MX)             
        46     2.20065000E+03   # mtR(MX)             
        47     3.78592000E+03   # mdR(MX)             
        48     3.78592000E+03   # msR(MX)             
        49     3.37398000E+03   # mbR(MX)             
#
BLOCK MASS  # Mass Spectrum
# PDG code           mass       particle
        24     8.03735477E+01   # W+
        25     1.26773639E+02   # h
        35     3.91980217E+03   # H
        36     3.91982060E+03   # A
        37     3.92100434E+03   # H+
         5     4.81876030E+00   # b-quark pole mass calculated from mb(mb)_Msbar
   1000001     2.57237298E+03   # ~d_L
   2000001     3.83092276E+03   # ~d_R
   1000002     2.57129479E+03   # ~u_L
   2000002     5.61810895E+02   # ~u_R
   1000003     2.57237298E+03   # ~s_L
   2000003     3.83092276E+03   # ~s_R
   1000004     2.57129479E+03   # ~c_L
   2000004     5.61810895E+02   # ~c_R
   1000005     3.40455518E+03   # ~b_1
   2000005     3.94130945E+03   # ~b_2
   1000006     2.25215135E+03   # ~t_1
   2000006     3.94633925E+03   # ~t_2
   1000011     1.51757817E+03   # ~e_L
   2000011     3.09591026E+03   # ~e_R
   1000012     1.51518195E+03   # ~nu_eL
   1000013     1.51757817E+03   # ~mu_L
   2000013     3.09591026E+03   # ~mu_R
   1000014     1.51518195E+03   # ~nu_muL
   1000015     1.94040778E+03   # ~tau_1
   2000015     3.08022894E+03   # ~tau_2
   1000016     1.93926999E+03   # ~nu_tauL
   1000021     2.02199668E+03   # ~g
   1000022    -4.78475580E+02   # ~chi_10
   1000023    -1.72659714E+03   # ~chi_20
   1000025     1.72926537E+03   # ~chi_30
   1000035    -2.00932720E+03   # ~chi_40
   1000024     4.78641647E+02   # ~chi_1+
   1000037     1.73171938E+03   # ~chi_2+
#
BLOCK NMIX  # Neutralino Mixing Matrix
  1  1    -3.06647163E-04   # N_11
  1  2     9.98768854E-01   # N_12
  1  3    -4.81340747E-02   # N_13
  1  4    -1.19913666E-02   # N_14
  2  1     1.09130223E-01   # N_21
  2  2     4.23159452E-02   # N_22
  2  3     7.02454192E-01   # N_23
  2  4     7.02038505E-01   # N_24
  3  1     8.62132060E-03   # N_31
  3  2    -2.55576750E-02   # N_32
  3  3    -7.06540100E-01   # N_33
  3  4     7.07158798E-01   # N_34
  4  1     9.93990027E-01   # N_41
  4  2    -4.11607549E-03   # N_42
  4  3    -7.10091974E-02   # N_43
  4  4    -8.32140526E-02   # N_44
#
BLOCK UMIX  # Chargino Mixing Matrix U
  1  1     9.97686034E-01   # U_11
  1  2    -6.79895370E-02   # U_12
  2  1     6.79895370E-02   # U_21
  2  2     9.97686034E-01   # U_22
#
BLOCK VMIX  # Chargino Mixing Matrix V
  1  1    -9.99856687E-01   # V_11
  1  2    -1.69294517E-02   # V_12
  2  1    -1.69294517E-02   # V_21
  2  2     9.99856687E-01   # V_22
#
BLOCK STOPMIX  # Stop Mixing Matrix
  1  1     5.50227868E-02   # cos(theta_t)
  1  2     9.98485099E-01   # sin(theta_t)
  2  1    -9.98485099E-01   # -sin(theta_t)
  2  2     5.50227868E-02   # cos(theta_t)
#
BLOCK SBOTMIX  # Sbottom Mixing Matrix
  1  1     4.10354340E-02   # cos(theta_b)
  1  2     9.99157692E-01   # sin(theta_b)
  2  1    -9.99157692E-01   # -sin(theta_b)
  2  2     4.10354340E-02   # cos(theta_b)
#
BLOCK STAUMIX  # Stau Mixing Matrix
  1  1     9.99735861E-01   # cos(theta_tau)
  1  2     2.29827812E-02   # sin(theta_tau)
  2  1    -2.29827812E-02   # -sin(theta_tau)
  2  2     9.99735861E-01   # cos(theta_tau)
#
BLOCK ALPHA  # Higgs mixing
          -2.20028211E-02   # Mixing angle in the neutral Higgs boson sector
#
BLOCK HMIX Q=  2.94118900E+03  # DRbar Higgs Parameters
         1     1.71321305E+03   # mu(Q)MSSM           
         2     4.54762222E+01   # tan                 
         3     2.42389754E+02   # higgs               
         4     1.50082454E+07   # mA^2(Q)MSSM         
#
BLOCK GAUGE Q=  2.94118900E+03  # The gauge couplings
     1     3.65009642E-01   # gprime(Q) DRbar
     2     6.39468255E-01   # g(Q) DRbar
     3     1.01956234E+00   # g3(Q) DRbar
#
BLOCK AU Q=  2.94118900E+03  # The trilinear couplings
  1  1     0.00000000E+00   # A_u(Q) DRbar
  2  2     0.00000000E+00   # A_c(Q) DRbar
  3  3    -3.94633999E+03   # A_t(Q) DRbar
#
BLOCK AD Q=  2.94118900E+03  # The trilinear couplings
  1  1     0.00000000E+00   # A_d(Q) DRbar
  2  2     0.00000000E+00   # A_s(Q) DRbar
  3  3     2.08283001E+03   # A_b(Q) DRbar
#
BLOCK AE Q=  2.94118900E+03  # The trilinear couplings
  1  1     0.00000000E+00   # A_e(Q) DRbar
  2  2     0.00000000E+00   # A_mu(Q) DRbar
  3  3     1.51381000E+03   # A_tau(Q) DRbar
#
BLOCK Yu Q=  2.94118900E+03  # The Yukawa couplings
  1  1     0.00000000E+00   # y_u(Q) DRbar
  2  2     0.00000000E+00   # y_c(Q) DRbar
  3  3     8.16050252E-01   # y_t(Q) DRbar
#
BLOCK Yd Q=  2.94118900E+03  # The Yukawa couplings
  1  1     0.00000000E+00   # y_d(Q) DRbar
  2  2     0.00000000E+00   # y_s(Q) DRbar
  3  3     5.63952881E-01   # y_b(Q) DRbar
#
BLOCK Ye Q=  2.94118900E+03  # The Yukawa couplings
  1  1     0.00000000E+00   # y_e(Q) DRbar
  2  2     0.00000000E+00   # y_mu(Q) DRbar
  3  3     4.51308649E-01   # y_tau(Q) DRbar
#
BLOCK MSOFT Q=  2.94118900E+03  # The soft SUSY breaking masses at the scale Q
         1    -2.03574000E+03   # M_1(Q)              
         2    -4.50540000E+02   # M_2(Q)              
         3     1.81128000E+03   # M_3(Q)              
        21     1.26661240E+07   # mH1^2(Q)            
        22    -2.82035806E+06   # mH2^2(Q)            
        31     1.50621000E+03   # meL(Q)              
        32     1.50621000E+03   # mmuL(Q)             
        33     1.93587000E+03   # mtauL(Q)            
        34     3.09417000E+03   # meR(Q)              
        35     3.09417000E+03   # mmuR(Q)             
        36     3.09134000E+03   # mtauR(Q)            
        41     2.50486000E+03   # mqL1(Q)             
        42     2.50486000E+03   # mqL2(Q)             
        43     3.92951999E+03   # mqL3(Q)             
        44     2.35759953E+02   # muR(Q)              
        45     2.35759953E+02   # mcR(Q)              
        46     2.20064998E+03   # mtR(Q)              
        47     3.78592000E+03   # mdR(Q)              
        48     3.78592000E+03   # msR(Q)              
        49     3.37398000E+03   # mbR(Q)              
#
Block HiggsBoundsInputHiggsCouplingsFermions
# ScalarNormEffCoupSq PseudoSNormEffCoupSq NP   IP1 IP2 IP2
    1.00153322E+00    0.00000000E+00        3  25   5   5  # h0-b-b eff. coupling^2, normalised to SM
    2.06808525E+03    0.00000000E+00        3  35   5   5  # H0-b-b eff. coupling^2, normalised to SM
    0.00000000E+00    2.06808679E+03        3  36   5   5  # A0-b-b eff. coupling^2, normalised to SM
#
    9.99999259E-01    0.00000000E+00        3  25   6   6  # h0-t-t eff. coupling^2, normalised to SM
    4.84280071E-04    0.00000000E+00        3  35   6   6  # H0-t-t eff. coupling^2, normalised to SM
    0.00000000E+00    4.83538702E-04        3  36   6   6  # A0-t-t eff. coupling^2, normalised to SM
#
    1.00153322E+00    0.00000000E+00        3  25  15  15  # h0-tau-tau eff. coupling^2, normalised to SM
    2.06808525E+03    0.00000000E+00        3  35  15  15  # H0-tau-tau eff. coupling^2, normalised to SM
    0.00000000E+00    2.06808679E+03        3  36  15  15  # A0-tau-tau eff. coupling^2, normalised to SM
#
Block HiggsBoundsInputHiggsCouplingsBosons
    1.00000000E+00        3  25  24  24  # h0-W-W eff. coupling^2, normalised to SM
    2.83952030E-10        3  35  24  24  # H0-W-W eff. coupling^2, normalised to SM
    0.00000000E+00        3  36  24  24  # A0-W-W eff. coupling^2, normalised to SM
#
    1.00000000E+00        3  25  23  23  # h0-Z-Z eff. coupling^2, normalised to SM
    2.83952030E-10        3  35  23  23  # H0-Z-Z eff. coupling^2, normalised to SM
    0.00000000E+00        3  36  23  23  # A0-Z-Z eff. coupling^2, normalised to SM
#
    8.82066944E-01        3  25  21  21  # h0-g-g eff. coupling^2, normalised to SM
    1.91039684E-13        3  35  21  21  # H0-g-g eff. coupling^2, normalised to SM
    5.13013555E-13        3  36  21  21  # A0-g-g eff. coupling^2, normalised to SM
#
    0.00000000E+00        3  25  25  23  # h0-h0-Z eff. coupling^2, normalised to SM
    0.00000000E+00        3  35  25  23  # H0-h0-Z eff. coupling^2, normalised to SM
    2.83952030E-10        3  36  25  23  # A0-h0-Z eff. coupling^2, normalised to SM
    0.00000000E+00        3  35  35  23  # H0-H0-Z eff. coupling^2, normalised to SM
    1.00000000E+00        3  36  35  23  # A0-H0-Z eff. coupling^2, normalised to SM
    0.00000000E+00        3  36  36  23  # A0-A0-Z eff. coupling^2, normalised to SM
#
    0.00000000E+00        4  25  21  21  23  # h0-g-g-Z eff. coupling^2, normalised to SM
    0.00000000E+00        4  35  21  21  23  # H0-g-g-Z eff. coupling^2, normalised to SM
    0.00000000E+00        4  36  21  21  23  # A0-g-g-Z eff. coupling^2, normalised to SM
#
#
#
#                             =================
#                             |The decay table|
#                             =================
#
# - The QCD corrections to the decays gluino -> squark  + quark
#                                     squark -> gaugino + quark_prime
#                                     squark -> squark_prime + Higgs
#                                     squark -> gluino  + quark
#   are included.
#
# - The multi-body decays for the inos, stops and sbottoms are included.
#
# - The loop induced decays for the gluino, neutralinos and stops
#   are included.
#
# - The SUSY decays of the top quark are included.
#
#
#         PDG            Width
DECAY         6     1.44088598E+00   # top decays
#          BR         NDA      ID1       ID2
     1.00000000E+00    2           5        24   # BR(t ->  b    W+)
#
#         PDG            Width
DECAY   1000021     6.80301775E+01   # gluino decays
#          BR         NDA      ID1       ID2
     2.50000015E-01    2     2000002        -2   # BR(~g -> ~u_R  ub)
     2.50000015E-01    2    -2000002         2   # BR(~g -> ~u_R* u )
     2.49999985E-01    2     2000004        -4   # BR(~g -> ~c_R  cb)
     2.49999985E-01    2    -2000004         4   # BR(~g -> ~c_R* c )
#
#         PDG            Width
DECAY   1000006     1.30003719E+01   # stop1 decays
#          BR         NDA      ID1       ID2
     7.04250940E-04    2     1000022         6   # BR(~t_1 -> ~chi_10 t )
     1.78110174E-01    2     1000023         6   # BR(~t_1 -> ~chi_20 t )
     1.73947697E-01    2     1000025         6   # BR(~t_1 -> ~chi_30 t )
     1.49679321E-02    2     1000035         6   # BR(~t_1 -> ~chi_40 t )
     1.45132646E-03    2     1000024         5   # BR(~t_1 -> ~chi_1+ b )
     3.83075301E-01    2     1000037         5   # BR(~t_1 -> ~chi_2+ b )
     2.47743319E-01    2     1000021         6   # BR(~t_1 -> ~g      t )
#
#         PDG            Width
DECAY   2000006     2.51132720E+02   # stop2 decays
#          BR         NDA      ID1       ID2
     6.16083732E-02    2     1000022         6   # BR(~t_2 -> ~chi_10 t )
     6.69366407E-02    2     1000023         6   # BR(~t_2 -> ~chi_20 t )
     6.82417606E-02    2     1000025         6   # BR(~t_2 -> ~chi_30 t )
     1.61775702E-03    2     1000035         6   # BR(~t_2 -> ~chi_40 t )
     1.24436766E-01    2     1000024         5   # BR(~t_2 -> ~chi_1+ b )
     6.45746084E-02    2     1000037         5   # BR(~t_2 -> ~chi_2+ b )
     4.64834674E-01    2     1000021         6   # BR(~t_2 -> ~g      t )
     7.04665829E-02    2     1000006        25   # BR(~t_2 -> ~t_1    h )
     7.30992275E-02    2     1000006        23   # BR(~t_2 -> ~t_1    Z )
     4.18360898E-03    2     1000005        24   # BR(~t_2 -> ~b_1    W+)
#
#         PDG            Width
DECAY   1000005     1.03281890E+02   # sbottom1 decays
#          BR         NDA      ID1       ID2
     1.31438195E-03    2     1000022         5   # BR(~b_1 -> ~chi_10 b )
     5.70381900E-02    2     1000023         5   # BR(~b_1 -> ~chi_20 b )
     5.71547803E-02    2     1000025         5   # BR(~b_1 -> ~chi_30 b )
     8.33818885E-03    2     1000035         5   # BR(~b_1 -> ~chi_40 b )
     2.60615536E-03    2    -1000024         6   # BR(~b_1 -> ~chi_1- t )
     1.11560796E-01    2    -1000037         6   # BR(~b_1 -> ~chi_2- t )
     7.61770983E-01    2     1000021         5   # BR(~b_1 -> ~g      b )
     2.16524354E-04    2     1000006       -24   # BR(~b_1 -> ~t_1    W-)
#
#         PDG            Width
DECAY   2000005     2.51472557E+02   # sbottom2 decays
#          BR         NDA      ID1       ID2
     6.15575756E-02    2     1000022         5   # BR(~b_2 -> ~chi_10 b )
     3.19075787E-02    2     1000023         5   # BR(~b_2 -> ~chi_20 b )
     3.24071777E-02    2     1000025         5   # BR(~b_2 -> ~chi_30 b )
     1.72653325E-03    2     1000035         5   # BR(~b_2 -> ~chi_40 b )
     1.21896725E-01    2    -1000024         6   # BR(~b_2 -> ~chi_1- t )
     1.36086359E-01    2    -1000037         6   # BR(~b_2 -> ~chi_2- t )
     4.69155628E-01    2     1000021         5   # BR(~b_2 -> ~g      b )
     2.16672359E-03    2     1000005        25   # BR(~b_2 -> ~b_1    h )
     2.07668157E-03    2     1000005        23   # BR(~b_2 -> ~b_1    Z )
     1.41019017E-01    2     1000006       -24   # BR(~b_2 -> ~t_1    W-)
#
#         PDG            Width
DECAY   1000002     5.66332065E+01   # sup_L decays
#          BR         NDA      ID1       ID2
     1.63929648E-01    2     1000022         2   # BR(~u_L -> ~chi_10 u)
     2.14794248E-04    2     1000023         2   # BR(~u_L -> ~chi_20 u)
     3.07247776E-05    2     1000025         2   # BR(~u_L -> ~chi_30 u)
     9.38861068E-04    2     1000035         2   # BR(~u_L -> ~chi_40 u)
     3.28596317E-01    2     1000024         1   # BR(~u_L -> ~chi_1+ d)
     3.06456575E-05    2     1000037         1   # BR(~u_L -> ~chi_2+ d)
     5.06259009E-01    2     1000021         2   # BR(~u_L -> ~g      u)
#
#         PDG            Width
DECAY   2000002     1.00380321E-08   # sup_R decays
#          BR         NDA      ID1       ID2
     1.00000000E+00    2     1000022         2   # BR(~u_R -> ~chi_10 u)
#
#         PDG            Width
DECAY   1000001     5.66793383E+01   # sdown_L decays
#          BR         NDA      ID1       ID2
     1.63914607E-01    2     1000022         1   # BR(~d_L -> ~chi_10 d)
     2.50979848E-05    2     1000023         1   # BR(~d_L -> ~chi_20 d)
     3.97706724E-05    2     1000025         1   # BR(~d_L -> ~chi_30 d)
     1.02652176E-03    2     1000035         1   # BR(~d_L -> ~chi_40 d)
     3.27064688E-01    2    -1000024         2   # BR(~d_L -> ~chi_1- u)
     4.94760128E-04    2    -1000037         2   # BR(~d_L -> ~chi_2- u)
     5.07434554E-01    2     1000021         1   # BR(~d_L -> ~g      d)
#
#         PDG            Width
DECAY   2000001     1.53807434E+02   # sdown_R decays
#          BR         NDA      ID1       ID2
     1.28876075E-09    2     1000022         1   # BR(~d_R -> ~chi_10 d)
     1.07384823E-04    2     1000023         1   # BR(~d_R -> ~chi_20 d)
     6.69144997E-07    2     1000025         1   # BR(~d_R -> ~chi_30 d)
     7.38277673E-03    2     1000035         1   # BR(~d_R -> ~chi_40 d)
     9.92509168E-01    2     1000021         1   # BR(~d_R -> ~g      d)
#
#         PDG            Width
DECAY   1000004     4.99309377E+01   # scharm_L decays
#          BR         NDA      ID1       ID2
     1.94710505E-01    2     1000022         4   # BR(~c_L -> ~chi_10 c)
     2.51308171E-04    2     1000023         4   # BR(~c_L -> ~chi_20 c)
     3.59452315E-05    2     1000025         4   # BR(~c_L -> ~chi_30 c)
     1.08682999E-03    2     1000035         4   # BR(~c_L -> ~chi_40 c)
     3.90296231E-01    2     1000024         3   # BR(~c_L -> ~chi_1+ s)
     3.58503566E-05    2     1000037         3   # BR(~c_L -> ~chi_2+ s)
     4.13583330E-01    2     1000021         4   # BR(~c_L -> ~g      c)
#
#         PDG            Width
DECAY   2000004     9.38808947E-09   # scharm_R decays
#          BR         NDA      ID1       ID2
     1.00000000E+00    2     1000022         4   # BR(~c_R -> ~chi_10 c)
#
#         PDG            Width
DECAY   1000003     4.99492764E+01   # sstrange_L decays
#          BR         NDA      ID1       ID2
     1.94778011E-01    2     1000022         3   # BR(~s_L -> ~chi_10 s)
     2.93780587E-05    2     1000023         3   # BR(~s_L -> ~chi_20 s)
     4.65495858E-05    2     1000025         3   # BR(~s_L -> ~chi_30 s)
     1.18888877E-03    2     1000035         3   # BR(~s_L -> ~chi_40 s)
     3.88646883E-01    2    -1000024         4   # BR(~s_L -> ~chi_1- c)
     5.79052278E-04    2    -1000037         4   # BR(~s_L -> ~chi_2- c)
     4.14731238E-01    2     1000021         3   # BR(~s_L -> ~g      s)
#
#         PDG            Width
DECAY   2000003     1.11140648E+02   # sstrange_R decays
#          BR         NDA      ID1       ID2
     1.85002783E-09    2     1000022         3   # BR(~s_R -> ~chi_10 s)
     1.53539886E-04    2     1000023         3   # BR(~s_R -> ~chi_20 s)
     9.56739255E-07    2     1000025         3   # BR(~s_R -> ~chi_30 s)
     1.05408112E-02    2     1000035         3   # BR(~s_R -> ~chi_40 s)
     9.89304690E-01    2     1000021         3   # BR(~s_R -> ~g      s)
#
#         PDG            Width
DECAY   1000011     1.49580302E+01   # selectron_L decays
#          BR         NDA      ID1       ID2
     3.33771750E-01    2     1000022        11   # BR(~e_L -> ~chi_10 e-)
     6.66228250E-01    2    -1000024        12   # BR(~e_L -> ~chi_1- nu_e)
#
#         PDG            Width
DECAY   2000011     5.52492881E+00   # selectron_R decays
#          BR         NDA      ID1       ID2
     2.66139604E-07    2     1000022        11   # BR(~e_R -> ~chi_10 e-)
     1.67926202E-02    2     1000023        11   # BR(~e_R -> ~chi_20 e-)
     1.04511058E-04    2     1000025        11   # BR(~e_R -> ~chi_30 e-)
     9.83102603E-01    2     1000035        11   # BR(~e_R -> ~chi_40 e-)
#
#         PDG            Width
DECAY   1000013     1.49580302E+01   # smuon_L decays
#          BR         NDA      ID1       ID2
     3.33771747E-01    2     1000022        13   # BR(~mu_L -> ~chi_10 mu-)
     6.66228253E-01    2    -1000024        14   # BR(~mu_L -> ~chi_1- nu_mu)
#
#         PDG            Width
DECAY   2000013     5.52492877E+00   # smuon_R decays
#          BR         NDA      ID1       ID2
     2.66139605E-07    2     1000022        13   # BR(~mu_R -> ~chi_10 mu-)
     1.67926203E-02    2     1000023        13   # BR(~mu_R -> ~chi_20 mu-)
     1.04511058E-04    2     1000025        13   # BR(~mu_R -> ~chi_30 mu-)
     9.83102603E-01    2     1000035        13   # BR(~mu_R -> ~chi_40 mu-)
#
#         PDG            Width
DECAY   1000015     2.11923192E+01   # stau_1 decays
#          BR         NDA      ID1       ID2
     3.28923349E-01    2     1000022        15   # BR(~tau_1 -> ~chi_10  tau-)
     8.10958537E-03    2     1000023        15   # BR(~tau_1 -> ~chi_20  tau-)
     7.83491446E-03    2     1000025        15   # BR(~tau_1 -> ~chi_30  tau-)
     6.55049392E-01    2    -1000024        16   # BR(~tau_1 -> ~chi_1-  nu_tau)
     8.27590635E-05    2    -1000037        16   # BR(~tau_1 -> ~chi_2-  nu_tau)
#
#         PDG            Width
DECAY   2000015     2.14370659E+01   # stau_2 decays
#          BR         NDA      ID1       ID2
     3.50386319E-04    2     1000022        15   # BR(~tau_2 -> ~chi_10  tau-)
     1.39247377E-01    2     1000023        15   # BR(~tau_2 -> ~chi_20  tau-)
     1.36615136E-01    2     1000025        15   # BR(~tau_2 -> ~chi_30  tau-)
     2.49552903E-01    2     1000035        15   # BR(~tau_2 -> ~chi_40  tau-)
     6.98046983E-04    2    -1000024        16   # BR(~tau_2 -> ~chi_1-  nu_tau)
     2.72143122E-01    2    -1000037        16   # BR(~tau_2 -> ~chi_2-  nu_tau)
     9.89432270E-02    2     1000016       -24   # BR(~tau_2 -> ~nu_tauL W-)
     5.17542838E-02    2     1000015        25   # BR(~tau_2 -> ~tau_1   h)
     5.06955191E-02    2     1000015        23   # BR(~tau_2 -> ~tau_1   Z)
#
#         PDG            Width
DECAY   1000012     1.49707770E+01   # snu_eL decays
#          BR         NDA      ID1       ID2
     3.32961686E-01    2     1000022        12   # BR(~nu_eL -> ~chi_10 nu_e)
     6.67038314E-01    2     1000024        11   # BR(~nu_eL -> ~chi_1+ e-)
#
#         PDG            Width
DECAY   1000014     1.49707768E+01   # snu_muL decays
#          BR         NDA      ID1       ID2
     3.32961688E-01    2     1000022        14   # BR(~nu_muL -> ~chi_10 nu_mu)
     6.67038312E-01    2     1000024        13   # BR(~nu_muL -> ~chi_1+ mu-)
#
#         PDG            Width
DECAY   1000016     2.12052908E+01   # snu_tauL decays
#          BR         NDA      ID1       ID2
     3.27386406E-01    2     1000022        16   # BR(~nu_tauL -> ~chi_10 nu_tau)
     6.37917168E-06    2     1000023        16   # BR(~nu_tauL -> ~chi_20 nu_tau)
     1.45016097E-05    2     1000025        16   # BR(~nu_tauL -> ~chi_30 nu_tau)
     6.57450650E-01    2     1000024        15   # BR(~nu_tauL -> ~chi_1+ tau-)
     1.51420630E-02    2     1000037        15   # BR(~nu_tauL -> ~chi_2+ tau-)
#
#         PDG            Width
DECAY   1000024     3.79880020E-15   # chargino1+ decays
#           BR         NDA      ID1       ID2       ID3
     1.94398520E-02    3     1000022       -11        12   # BR(~chi_1+ -> ~chi_10 e+   nu_e)
     2.31224060E-03    3     1000022       -13        14   # BR(~chi_1+ -> ~chi_10 mu+  nu_mu)
     9.78247910E-01    2     1000022       211             # BR(~chi_1+ -> ~chi_10 pi+)
#
#         PDG            Width
DECAY   1000037     9.74618777E+00   # chargino2+ decays
#          BR         NDA      ID1       ID2
     1.13857259E-05    2     1000012       -11   # BR(~chi_2+ -> ~nu_eL   e+  )
     1.13857259E-05    2     1000014       -13   # BR(~chi_2+ -> ~nu_muL mu+ )
     1.79859939E-04    2    -1000011        12   # BR(~chi_2+ -> ~e_L+    nu_e)
     1.79859939E-04    2    -1000013        14   # BR(~chi_2+ -> ~mu_L+   nu_mu)
     3.31850098E-01    2     1000024        23   # BR(~chi_2+ -> ~chi_1+  Z )
     3.22864732E-01    2     1000022        24   # BR(~chi_2+ -> ~chi_10  W+)
     3.44902679E-01    2     1000024        25   # BR(~chi_2+ -> ~chi_1+  h )
#
#         PDG            Width
DECAY   1000022     0.00000000E+00   # neutralino1 decays
#
#         PDG            Width
DECAY   1000023     9.76486238E+00   # neutralino2 decays
#          BR         NDA      ID1       ID2
     8.71971108E-02    2     1000022        23   # BR(~chi_20 -> ~chi_10   Z )
     3.18176508E-01    2     1000024       -24   # BR(~chi_20 -> ~chi_1+   W-)
     3.18176508E-01    2    -1000024        24   # BR(~chi_20 -> ~chi_1-   W+)
     2.52183512E-01    2     1000022        25   # BR(~chi_20 -> ~chi_10   h )
     5.85540770E-03    2     2000002        -2   # BR(~chi_20 -> ~u_R      ub)
     5.85540770E-03    2    -2000002         2   # BR(~chi_20 -> ~u_R*     u )
     5.85540634E-03    2     2000004        -4   # BR(~chi_20 -> ~c_R      cb)
     5.85540634E-03    2    -2000004         4   # BR(~chi_20 -> ~c_R*     c )
     2.03599210E-04    2     1000011       -11   # BR(~chi_20 -> ~e_L-     e+)
     2.03599210E-04    2    -1000011        11   # BR(~chi_20 -> ~e_L+     e-)
     2.03599210E-04    2     1000013       -13   # BR(~chi_20 -> ~mu_L-    mu+)
     2.03599210E-04    2    -1000013        13   # BR(~chi_20 -> ~mu_L+    mu-)
     7.58430600E-06    2     1000012       -12   # BR(~chi_20 -> ~nu_eL    nu_eb)
     7.58430600E-06    2    -1000012        12   # BR(~chi_20 -> ~nu_eL*   nu_e )
     7.58430600E-06    2     1000014       -14   # BR(~chi_20 -> ~nu_muL   nu_mub)
     7.58430600E-06    2    -1000014        14   # BR(~chi_20 -> ~nu_muL*  nu_mu )
#
#         PDG            Width
DECAY   1000025     9.53326003E+00   # neutralino3 decays
#          BR         NDA      ID1       ID2
     2.48696160E-01    2     1000022        23   # BR(~chi_30 -> ~chi_10   Z )
     3.29845392E-01    2     1000024       -24   # BR(~chi_30 -> ~chi_1+   W-)
     3.29845392E-01    2    -1000024        24   # BR(~chi_30 -> ~chi_1-   W+)
     9.13558508E-02    2     1000022        25   # BR(~chi_30 -> ~chi_10   h )
     3.75119450E-05    2     2000002        -2   # BR(~chi_30 -> ~u_R      ub)
     3.75119450E-05    2    -2000002         2   # BR(~chi_30 -> ~u_R*     u )
     3.75119364E-05    2     2000004        -4   # BR(~chi_30 -> ~c_R      cb)
     3.75119364E-05    2    -2000004         4   # BR(~chi_30 -> ~c_R*     c )
     8.29985249E-06    2     1000011       -11   # BR(~chi_30 -> ~e_L-     e+)
     8.29985249E-06    2    -1000011        11   # BR(~chi_30 -> ~e_L+     e-)
     8.29985249E-06    2     1000013       -13   # BR(~chi_30 -> ~mu_L-    mu+)
     8.29985249E-06    2    -1000013        13   # BR(~chi_30 -> ~mu_L+    mu-)
     1.84894211E-05    2     1000012       -12   # BR(~chi_30 -> ~nu_eL    nu_eb)
     1.84894211E-05    2    -1000012        12   # BR(~chi_30 -> ~nu_eL*   nu_e )
     1.84894211E-05    2     1000014       -14   # BR(~chi_30 -> ~nu_muL   nu_mub)
     1.84894211E-05    2    -1000014        14   # BR(~chi_30 -> ~nu_muL*  nu_mu )
#
#         PDG            Width
DECAY   1000035     2.70324589E+01   # neutralino4 decays
#          BR         NDA      ID1       ID2
     4.79980095E-04    2     1000022        23   # BR(~chi_40 -> ~chi_10   Z )
     1.45152724E-04    2     1000023        23   # BR(~chi_40 -> ~chi_20   Z )
     1.70661227E-02    2     1000025        23   # BR(~chi_40 -> ~chi_30   Z )
     1.61741672E-03    2     1000024       -24   # BR(~chi_40 -> ~chi_1+   W-)
     1.61741672E-03    2    -1000024        24   # BR(~chi_40 -> ~chi_1-   W+)
     1.69824639E-02    2     1000037       -24   # BR(~chi_40 -> ~chi_2+   W-)
     1.69824639E-02    2    -1000037        24   # BR(~chi_40 -> ~chi_2-   W+)
     1.23039940E-03    2     1000022        25   # BR(~chi_40 -> ~chi_10   h )
     1.86170987E-02    2     1000023        25   # BR(~chi_40 -> ~chi_20   h )
     9.09072332E-05    2     1000025        25   # BR(~chi_40 -> ~chi_30   h )
     2.13029378E-01    2     2000002        -2   # BR(~chi_40 -> ~u_R      ub)
     2.13029378E-01    2    -2000002         2   # BR(~chi_40 -> ~u_R*     u )
     2.13029352E-01    2     2000004        -4   # BR(~chi_40 -> ~c_R      cb)
     2.13029352E-01    2    -2000004         4   # BR(~chi_40 -> ~c_R*     c )
     8.85025346E-03    2     1000011       -11   # BR(~chi_40 -> ~e_L-     e+)
     8.85025346E-03    2    -1000011        11   # BR(~chi_40 -> ~e_L+     e-)
     8.85025346E-03    2     1000013       -13   # BR(~chi_40 -> ~mu_L-    mu+)
     8.85025346E-03    2    -1000013        13   # BR(~chi_40 -> ~mu_L+    mu-)
     2.19564799E-04    2     1000015       -15   # BR(~chi_40 -> ~tau_1-   tau+)
     2.19564799E-04    2    -1000015        15   # BR(~chi_40 -> ~tau_1+   tau-)
     9.18735355E-03    2     1000012       -12   # BR(~chi_40 -> ~nu_eL    nu_eb)
     9.18735355E-03    2    -1000012        12   # BR(~chi_40 -> ~nu_eL*   nu_e )
     9.18735355E-03    2     1000014       -14   # BR(~chi_40 -> ~nu_muL   nu_mub)
     9.18735355E-03    2    -1000014        14   # BR(~chi_40 -> ~nu_muL*  nu_mu )
     2.31779613E-04    2     1000016       -16   # BR(~chi_40 -> ~nu_tau1  nu_taub)
     2.31779613E-04    2    -1000016        16   # BR(~chi_40 -> ~nu_tau1* nu_tau )
#
#         PDG            Width
DECAY        25     4.62156082E-03   # h decays
#          BR         NDA      ID1       ID2
     5.99374039E-01    2           5        -5   # BR(h -> b       bb     )
     5.68723877E-02    2         -15        15   # BR(h -> tau+    tau-   )
     2.01302710E-04    2         -13        13   # BR(h -> mu+     mu-    )
     2.19078976E-04    2           3        -3   # BR(h -> s       sb     )
     1.89798517E-02    2           4        -4   # BR(h -> c       cb     )
     7.17152413E-02    2          21        21   # BR(h -> g       g      )
     2.16513654E-03    2          22        22   # BR(h -> gam     gam    )
     1.57783688E-03    2          22        23   # BR(h -> Z       gam    )
     2.20667565E-01    2          24       -24   # BR(h -> W+      W-     )
     2.82275598E-02    2          23        23   # BR(h -> Z       Z      )
#
#         PDG            Width
DECAY        35     1.39049872E+02   # H decays
#          BR         NDA      ID1       ID2
     6.45058612E-01    2           5        -5   # BR(H -> b       bb     )
     1.27611392E-01    2         -15        15   # BR(H -> tau+    tau-   )
     4.57345275E-04    2         -13        13   # BR(H -> mu+     mu-    )
     1.89733161E-04    2           3        -3   # BR(H -> s       sb     )
     5.40955724E-09    2           4        -4   # BR(H -> c       cb     )
     5.33996488E-04    2           6        -6   # BR(H -> t       tb     )
     8.15250678E-06    2          21        21   # BR(H -> g       g      )
     1.07946595E-08    2          22        22   # BR(H -> gam     gam    )
     4.66261225E-09    2          23        22   # BR(H -> Z       gam    )
     3.95920256E-08    2          24       -24   # BR(H -> W+      W-     )
     1.97628402E-08    2          23        23   # BR(H -> Z       Z      )
     3.87701659E-07    2          25        25   # BR(H -> h       h      )
     1.01786458E-03    2     1000024  -1000024   # BR(H -> ~chi_1+ ~chi_1-)
     8.29441387E-06    2     1000037  -1000037   # BR(H -> ~chi_2+ ~chi_2-)
     7.30876313E-02    2     1000024  -1000037   # BR(H -> ~chi_1+ ~chi_2-)
     7.30876313E-02    2     1000037  -1000024   # BR(H -> ~chi_2+ ~chi_1-)
     5.09271945E-04    2     1000022   1000022   # BR(H -> ~chi_10 ~chi_10)
     3.41030423E-06    2     1000023   1000023   # BR(H -> ~chi_20 ~chi_20)
     1.08303130E-05    2     1000025   1000025   # BR(H -> ~chi_30 ~chi_30)
     3.29844704E-02    2     1000022   1000023   # BR(H -> ~chi_10 ~chi_20)
     3.98628523E-02    2     1000022   1000025   # BR(H -> ~chi_10 ~chi_30)
     1.11076131E-04    2     1000022   1000035   # BR(H -> ~chi_10 ~chi_40)
     6.20735468E-06    2     1000023   1000025   # BR(H -> ~chi_20 ~chi_30)
     4.87727851E-04    2     1000023   1000035   # BR(H -> ~chi_20 ~chi_40)
     4.95995172E-03    2     1000025   1000035   # BR(H -> ~chi_30 ~chi_40)
     2.04761652E-08    2     2000002  -2000002   # BR(H -> ~u_R    ~u_R*  )
     2.04761652E-08    2     2000004  -2000004   # BR(H -> ~c_R    ~c_R*  )
     1.56211261E-08    2     1000011  -1000011   # BR(H -> ~e_L-   ~e_L+  )
     1.56211261E-08    2     1000013  -1000013   # BR(H -> ~mu_L-  ~mu_L+ )
     2.89553759E-06    2     1000015  -1000015   # BR(H -> ~tau_1- ~tau_1+)
     5.10608909E-08    2     1000012  -1000012   # BR(H -> ~nu_eL  ~nu_eL*   )
     5.10608909E-08    2     1000014  -1000014   # BR(H -> ~nu_muL ~nu_muL*  )
     1.16495774E-08    2     1000016  -1000016   # BR(H -> ~nu_tauL ~nu_tauL*)
#
#         PDG            Width
DECAY        36     1.39046117E+02   # A decays
#          BR         NDA      ID1       ID2
     6.45090191E-01    2           5        -5   # BR(A -> b       bb     )
     1.27615635E-01    2         -15        15   # BR(A -> tau+    tau-   )
     4.57360105E-04    2         -13        13   # BR(A -> mu+     mu-    )
     1.89745651E-04    2           3        -3   # BR(A -> s       sb     )
     5.45167447E-09    2           4        -4   # BR(A -> c       cb     )
     5.35823232E-04    2           6        -6   # BR(A -> t       tb     )
     1.33602149E-05    2          21        21   # BR(A -> g       g      )
     1.40232375E-09    2          22        22   # BR(A -> gam     gam    )
     1.03751208E-08    2          23        22   # BR(A -> Z       gam    )
     4.01696824E-08    2          23        25   # BR(A -> Z       h      )
     1.05904938E-03    2     1000024  -1000024   # BR(A -> ~chi_1+ ~chi_1-)
     2.65200503E-05    2     1000037  -1000037   # BR(A -> ~chi_2+ ~chi_2-)
     7.30592499E-02    2     1000024  -1000037   # BR(A -> ~chi_1+ ~chi_2-)
     7.30592499E-02    2     1000037  -1000024   # BR(A -> ~chi_2+ ~chi_1-)
     5.29823813E-04    2     1000022   1000022   # BR(A -> ~chi_10 ~chi_10)
     1.39491880E-05    2     1000023   1000023   # BR(A -> ~chi_20 ~chi_20)
     5.33986259E-05    2     1000025   1000025   # BR(A -> ~chi_30 ~chi_30)
     3.97161614E-02    2     1000022   1000023   # BR(A -> ~chi_10 ~chi_20)
     3.31019230E-02    2     1000022   1000025   # BR(A -> ~chi_10 ~chi_30)
     1.35718136E-04    2     1000022   1000035   # BR(A -> ~chi_10 ~chi_40)
     1.03022812E-06    2     1000023   1000025   # BR(A -> ~chi_20 ~chi_30)
     4.85044612E-03    2     1000023   1000035   # BR(A -> ~chi_20 ~chi_40)
     4.91308359E-04    2     1000025   1000035   # BR(A -> ~chi_30 ~chi_40)
#
#         PDG            Width
DECAY        37     1.26316440E+02   # H+ decays
#          BR         NDA      ID1       ID2
     1.02331502E-03    2           4        -5   # BR(H+ -> c       bb     )
     1.40518662E-01    2         -15        16   # BR(H+ -> tau+    nu_tau )
     5.03603106E-04    2         -13        14   # BR(H+ -> mu+     nu_mu  )
     1.02331429E-05    2           2        -5   # BR(H+ -> u       bb     )
     1.04557099E-05    2           2        -3   # BR(H+ -> u       sb     )
     2.05805886E-04    2           4        -3   # BR(H+ -> c       sb     )
     6.08890207E-01    2           6        -5   # BR(H+ -> t       bb     )
     4.42741089E-08    2          24        25   # BR(H+ -> W+      h      )
     2.42120120E-14    2          24        36   # BR(H+ -> W+      A      )
     4.79503477E-11    2     1000024   1000022   # BR(H+ -> ~chi_1+ ~chi_10)
     8.08059441E-02    2     1000024   1000023   # BR(H+ -> ~chi_1+ ~chi_20)
     8.07310858E-02    2     1000024   1000025   # BR(H+ -> ~chi_1+ ~chi_30)
     2.75980392E-04    2     1000024   1000035   # BR(H+ -> ~chi_1+ ~chi_40)
     8.10406852E-02    2     1000037   1000022   # BR(H+ -> ~chi_2+ ~chi_10)
     3.84987947E-05    2     1000037   1000023   # BR(H+ -> ~chi_2+ ~chi_20)
     8.16679302E-05    2     1000037   1000025   # BR(H+ -> ~chi_2+ ~chi_30)
     5.86223418E-03    2     1000037   1000035   # BR(H+ -> ~chi_2+ ~chi_40)
     6.77267427E-08    2    -1000011   1000012   # BR(H+ -> ~e_L+   ~nu_eL )
     6.77267427E-08    2    -1000013   1000014   # BR(H+ -> ~mu_L+  ~nu_muL)
     1.44203088E-06    2    -1000015   1000016   # BR(H+ -> ~tau_1+ ~nu_tauL)
