#
#                              ======================
#                              | THE SUSYHIT OUTPUT |
#                              ======================
#
#
#              ------------------------------------------------------
#              |     This is the output of the SUSY-HIT package     |
#              |  created by A.Djouadi, M.Muehlleitner and M.Spira. |
#              |  In case of problems with SUSY-HIT email to        |
#              |           margarete.muehlleitner@cern.ch           |
#              |           michael.spira@psi.ch                     |
#              |           abdelhak.djouadi@cern.ch                 |
#              ------------------------------------------------------
#
#              ------------------------------------------------------
#              |  SUSY Les Houches Accord - MSSM Spectrum + Decays  |
#              |              based on the decay programs           |
#              |                                                    |
#              |                     SDECAY 1.3b                    |
#              |                                                    |
#              |  Authors: M.Muhlleitner, A.Djouadi and Y.Mambrini  |
#              |  Ref.:    Comput.Phys.Commun.168(2005)46           |
#              |           [hep-ph/0311167]                         |
#              |                                                    |
#              |                     HDECAY 3.4                     |
#              |                                                    |
#              |  By: A.Djouadi,J.Kalinowski,M.Muhlleitner,M.Spira  |
#              |  Ref.:    Comput.Phys.Commun.108(1998)56           |
#              |           [hep-ph/9704448]                         |
#              |                                                    |
#              |                                                    |
#              |  If not stated otherwise all DRbar couplings and   |
#              |  soft SUSY breaking masses are given at the scale  |
#              |  Q=  0.31543490E+04
#              |                                                    |
#              ------------------------------------------------------
#
#
BLOCK DCINFO  # Decay Program information
     1   SDECAY/HDECAY # decay calculator
     2   1.3b  /3.4    # version number
#
BLOCK SPINFO  # Spectrum calculator information
     1     SOFTSUSY    # spectrum calculator               
     2     3.4.0       # version number                    
#
BLOCK MODSEL  # Model selection
     1     0   #  nonUniversal                                     
#
BLOCK SMINPUTS  # Standard Model inputs
         1     1.27908970E+02   # alpha_em^-1(M_Z)^MSbar
         2     1.16637870E-05   # G_F [GeV^-2]
         3     1.18400000E-01   # alpha_S(M_Z)^MSbar
         4     9.11876000E+01   # M_Z pole mass
         5     4.18000000E+00   # mb(mb)^MSbar
         6     1.73200000E+02   # mt pole mass
         7     1.77700000E+00   # mtau pole mass
#
BLOCK MINPAR  # Input parameters - minimal models
         3     5.52000000E+00   # tanb                
#
BLOCK EXTPAR  # Input parameters - non-minimal models
         0    -1.00000000E+00   # Set                 
         1     4.79000000E+01   # M_1(MX)             
         2    -1.77930000E+02   # M_2(MX)             
         3     3.57120000E+03   # M_3(MX)             
        11     3.78299000E+03   # At(MX)              
        12    -4.49900000E+01   # Ab(MX)              
        13     3.26100000E+02   # Atau(MX)            
        23     1.53650000E+02   # mu(MX)              
        26     3.72144000E+03   # mA(pole)            
        31     1.58681000E+03   # meL(MX)             
        32     1.58681000E+03   # mmuL(MX)            
        33     2.14503000E+03   # mtauL(MX)           
        34     2.16596000E+03   # meR(MX)             
        35     2.16596000E+03   # mmuR(MX)            
        36     1.92790000E+03   # mtauR(MX)           
        41     1.76432000E+03   # mqL1(MX)            
        42     1.76432000E+03   # mqL2(MX)            
        43     3.39271000E+03   # mqL3(MX)            
        44     1.64468000E+03   # muR(MX)             
        45     1.64468000E+03   # mcR(MX)             
        46     2.93145000E+03   # mtR(MX)             
        47     1.01032000E+03   # mdR(MX)             
        48     1.01032000E+03   # msR(MX)             
        49     2.42018000E+03   # mbR(MX)             
#
BLOCK MASS  # Mass Spectrum
# PDG code           mass       particle
        24     8.03964435E+01   # W+
        25     1.24918669E+02   # h
        35     3.72165779E+03   # H
        36     3.72143978E+03   # A
        37     3.72269592E+03   # H+
         5     4.81876030E+00   # b-quark pole mass calculated from mb(mb)_Msbar
   1000001     1.91332952E+03   # ~d_L
   2000001     1.20059336E+03   # ~d_R
   1000002     1.91188033E+03   # ~u_L
   2000002     1.79266149E+03   # ~u_R
   1000003     1.91332952E+03   # ~s_L
   2000003     1.20059336E+03   # ~s_R
   1000004     1.91188033E+03   # ~c_L
   2000004     1.79266149E+03   # ~c_R
   1000005     2.54974088E+03   # ~b_1
   2000005     3.46661504E+03   # ~b_2
   1000006     2.96912003E+03   # ~t_1
   2000006     3.48058639E+03   # ~t_2
   1000011     1.58892085E+03   # ~e_L
   2000011     2.17014844E+03   # ~e_R
   1000012     1.58677068E+03   # ~nu_eL
   1000013     1.58892085E+03   # ~mu_L
   2000013     2.17014844E+03   # ~mu_R
   1000014     1.58677068E+03   # ~nu_muL
   1000015     1.93191653E+03   # ~tau_1
   2000015     2.14834446E+03   # ~tau_2
   1000016     2.14666499E+03   # ~nu_tauL
   1000021     3.59549631E+03   # ~g
   1000022     4.00839736E+01   # ~chi_10
   1000023    -1.35858365E+02   # ~chi_20
   1000025     1.83543438E+02   # ~chi_30
   1000035    -2.32226575E+02   # ~chi_40
   1000024     1.42044209E+02   # ~chi_1+
   1000037     2.35729106E+02   # ~chi_2+
#
BLOCK NMIX  # Neutralino Mixing Matrix
  1  1     9.59916096E-01   # N_11
  1  2     5.23582954E-02   # N_12
  1  3     2.54516240E-01   # N_13
  1  4    -1.05077024E-01   # N_14
  2  1    -9.08723374E-02   # N_21
  2  2    -5.37570319E-01   # N_22
  2  3     6.64378643E-01   # N_23
  2  4     5.11235161E-01   # N_24
  3  1    -2.56628128E-01   # N_31
  3  2     1.72175433E-01   # N_32
  3  3     6.43253930E-01   # N_33
  3  4    -7.00515528E-01   # N_34
  4  1    -6.66731630E-02   # N_41
  4  2     8.23791467E-01   # N_42
  4  3     2.82925579E-01   # N_43
  4  4     4.86698494E-01   # N_44
#
BLOCK UMIX  # Chargino Mixing Matrix U
  1  1    -4.32040826E-01   # U_11
  1  2     9.01854049E-01   # U_12
  2  1    -9.01854049E-01   # U_21
  2  2    -4.32040826E-01   # U_22
#
BLOCK VMIX  # Chargino Mixing Matrix V
  1  1     7.20457883E-01   # V_11
  1  2     6.93498694E-01   # V_12
  2  1     6.93498694E-01   # V_21
  2  2    -7.20457883E-01   # V_22
#
BLOCK STOPMIX  # Stop Mixing Matrix
  1  1    -1.55924599E-01   # cos(theta_t)
  1  2     9.87768961E-01   # sin(theta_t)
  2  1    -9.87768961E-01   # -sin(theta_t)
  2  2    -1.55924599E-01   # cos(theta_t)
#
BLOCK SBOTMIX  # Sbottom Mixing Matrix
  1  1     4.09574364E-04   # cos(theta_b)
  1  2     9.99999916E-01   # sin(theta_b)
  2  1    -9.99999916E-01   # -sin(theta_b)
  2  2     4.09574364E-04   # cos(theta_b)
#
BLOCK STAUMIX  # Stau Mixing Matrix
  1  1     1.00289617E-03   # cos(theta_tau)
  1  2     9.99999497E-01   # sin(theta_tau)
  2  1    -9.99999497E-01   # -sin(theta_tau)
  2  2     1.00289617E-03   # cos(theta_tau)
#
BLOCK ALPHA  # Higgs mixing
          -1.88989078E-01   # Mixing angle in the neutral Higgs boson sector
#
BLOCK HMIX Q=  3.15434900E+03  # DRbar Higgs Parameters
         1     1.56110222E+02   # mu(Q)MSSM           
         2     5.23689386E+00   # tan                 
         3     2.40204875E+02   # higgs               
         4     1.37652573E+07   # mA^2(Q)MSSM         
#
BLOCK GAUGE Q=  3.15434900E+03  # The gauge couplings
     1     3.65589374E-01   # gprime(Q) DRbar
     2     6.44442403E-01   # g(Q) DRbar
     3     1.00843076E+00   # g3(Q) DRbar
#
BLOCK AU Q=  3.15434900E+03  # The trilinear couplings
  1  1     0.00000000E+00   # A_u(Q) DRbar
  2  2     0.00000000E+00   # A_c(Q) DRbar
  3  3     3.78299002E+03   # A_t(Q) DRbar
#
BLOCK AD Q=  3.15434900E+03  # The trilinear couplings
  1  1     0.00000000E+00   # A_d(Q) DRbar
  2  2     0.00000000E+00   # A_s(Q) DRbar
  3  3    -4.49899935E+01   # A_b(Q) DRbar
#
BLOCK AE Q=  3.15434900E+03  # The trilinear couplings
  1  1     0.00000000E+00   # A_e(Q) DRbar
  2  2     0.00000000E+00   # A_mu(Q) DRbar
  3  3     3.26100000E+02   # A_tau(Q) DRbar
#
BLOCK Yu Q=  3.15434900E+03  # The Yukawa couplings
  1  1     0.00000000E+00   # y_u(Q) DRbar
  2  2     0.00000000E+00   # y_c(Q) DRbar
  3  3     8.51776962E-01   # y_t(Q) DRbar
#
BLOCK Yd Q=  3.15434900E+03  # The Yukawa couplings
  1  1     0.00000000E+00   # y_d(Q) DRbar
  2  2     0.00000000E+00   # y_s(Q) DRbar
  3  3     7.11792310E-02   # y_b(Q) DRbar
#
BLOCK Ye Q=  3.15434900E+03  # The Yukawa couplings
  1  1     0.00000000E+00   # y_e(Q) DRbar
  2  2     0.00000000E+00   # y_mu(Q) DRbar
  3  3     5.47113777E-02   # y_tau(Q) DRbar
#
BLOCK MSOFT Q=  3.15434900E+03  # The soft SUSY breaking masses at the scale Q
         1     4.79000000E+01   # M_1(Q)              
         2    -1.77930000E+02   # M_2(Q)              
         3     3.57120000E+03   # M_3(Q)              
        21     1.33115796E+07   # mH1^2(Q)            
        22     7.20150611E+05   # mH2^2(Q)            
        31     1.58681000E+03   # meL(Q)              
        32     1.58681000E+03   # mmuL(Q)             
        33     2.14503000E+03   # mtauL(Q)            
        34     2.16596000E+03   # meR(Q)              
        35     2.16596000E+03   # mmuR(Q)             
        36     1.92790000E+03   # mtauR(Q)            
        41     1.76431998E+03   # mqL1(Q)             
        42     1.76431998E+03   # mqL2(Q)             
        43     3.39270998E+03   # mqL3(Q)             
        44     1.64467998E+03   # muR(Q)              
        45     1.64467998E+03   # mcR(Q)              
        46     2.93144998E+03   # mtR(Q)              
        47     1.01031996E+03   # mdR(Q)              
        48     1.01031996E+03   # msR(Q)              
        49     2.42017998E+03   # mbR(Q)              
#
Block HiggsBoundsInputHiggsCouplingsFermions
# ScalarNormEffCoupSq PseudoSNormEffCoupSq NP   IP1 IP2 IP2
    1.00322430E+00    0.00000000E+00        3  25   5   5  # h0-b-b eff. coupling^2, normalised to SM
    2.74218330E+01    0.00000000E+00        3  35   5   5  # H0-b-b eff. coupling^2, normalised to SM
    0.00000000E+00    2.74250573E+01        3  36   5   5  # A0-b-b eff. coupling^2, normalised to SM
#
    9.99882432E-01    0.00000000E+00        3  25   6   6  # h0-t-t eff. coupling^2, normalised to SM
    3.65805728E-02    0.00000000E+00        3  35   6   6  # H0-t-t eff. coupling^2, normalised to SM
    0.00000000E+00    3.64630049E-02        3  36   6   6  # A0-t-t eff. coupling^2, normalised to SM
#
    1.00322430E+00    0.00000000E+00        3  25  15  15  # h0-tau-tau eff. coupling^2, normalised to SM
    2.74218330E+01    0.00000000E+00        3  35  15  15  # H0-tau-tau eff. coupling^2, normalised to SM
    0.00000000E+00    2.74250573E+01        3  36  15  15  # A0-tau-tau eff. coupling^2, normalised to SM
#
Block HiggsBoundsInputHiggsCouplingsBosons
    9.99999905E-01        3  25  24  24  # h0-W-W eff. coupling^2, normalised to SM
    9.46216776E-08        3  35  24  24  # H0-W-W eff. coupling^2, normalised to SM
    0.00000000E+00        3  36  24  24  # A0-W-W eff. coupling^2, normalised to SM
#
    9.99999905E-01        3  25  23  23  # h0-Z-Z eff. coupling^2, normalised to SM
    9.46216776E-08        3  35  23  23  # H0-Z-Z eff. coupling^2, normalised to SM
    0.00000000E+00        3  36  23  23  # A0-Z-Z eff. coupling^2, normalised to SM
#
    8.90017243E-01        3  25  21  21  # h0-g-g eff. coupling^2, normalised to SM
    1.20954903E-12        3  35  21  21  # H0-g-g eff. coupling^2, normalised to SM
    2.63152770E-12        3  36  21  21  # A0-g-g eff. coupling^2, normalised to SM
#
    0.00000000E+00        3  25  25  23  # h0-h0-Z eff. coupling^2, normalised to SM
    0.00000000E+00        3  35  25  23  # H0-h0-Z eff. coupling^2, normalised to SM
    9.46216776E-08        3  36  25  23  # A0-h0-Z eff. coupling^2, normalised to SM
    0.00000000E+00        3  35  35  23  # H0-H0-Z eff. coupling^2, normalised to SM
    9.99999905E-01        3  36  35  23  # A0-H0-Z eff. coupling^2, normalised to SM
    0.00000000E+00        3  36  36  23  # A0-A0-Z eff. coupling^2, normalised to SM
#
    0.00000000E+00        4  25  21  21  23  # h0-g-g-Z eff. coupling^2, normalised to SM
    0.00000000E+00        4  35  21  21  23  # H0-g-g-Z eff. coupling^2, normalised to SM
    0.00000000E+00        4  36  21  21  23  # A0-g-g-Z eff. coupling^2, normalised to SM
#
#
#
#                             =================
#                             |The decay table|
#                             =================
#
# - The QCD corrections to the decays gluino -> squark  + quark
#                                     squark -> gaugino + quark_prime
#                                     squark -> squark_prime + Higgs
#                                     squark -> gluino  + quark
#   are included.
#
# - The multi-body decays for the inos, stops and sbottoms are included.
#
# - The loop induced decays for the gluino, neutralinos and stops
#   are included.
#
# - The SUSY decays of the top quark are included.
#
#
#         PDG            Width
DECAY         6     1.46234924E+00   # top decays
#          BR         NDA      ID1       ID2
     1.00000000E+00    2           5        24   # BR(t ->  b    W+)
#
#         PDG            Width
DECAY   1000021     3.67137329E+02   # gluino decays
#          BR         NDA      ID1       ID2
     5.01202775E-02    2     1000001        -1   # BR(~g -> ~d_L  db)
     5.01202775E-02    2    -1000001         1   # BR(~g -> ~d_L* d )
     7.70030098E-02    2     2000001        -1   # BR(~g -> ~d_R  db)
     7.70030098E-02    2    -2000001         1   # BR(~g -> ~d_R* d )
     5.01802602E-02    2     1000002        -2   # BR(~g -> ~u_L  ub)
     5.01802602E-02    2    -1000002         2   # BR(~g -> ~u_L* u )
     5.50743984E-02    2     2000002        -2   # BR(~g -> ~u_R  ub)
     5.50743984E-02    2    -2000002         2   # BR(~g -> ~u_R* u )
     5.01202775E-02    2     1000003        -3   # BR(~g -> ~s_L  sb)
     5.01202775E-02    2    -1000003         3   # BR(~g -> ~s_L* s )
     7.70030098E-02    2     2000003        -3   # BR(~g -> ~s_R  sb)
     7.70030098E-02    2    -2000003         3   # BR(~g -> ~s_R* s )
     5.01802491E-02    2     1000004        -4   # BR(~g -> ~c_L  cb)
     5.01802491E-02    2    -1000004         4   # BR(~g -> ~c_L* c )
     5.50743886E-02    2     2000004        -4   # BR(~g -> ~c_R  cb)
     5.50743886E-02    2    -2000004         4   # BR(~g -> ~c_R* c )
     2.42185683E-02    2     1000005        -5   # BR(~g -> ~b_1  bb)
     2.42185683E-02    2    -1000005         5   # BR(~g -> ~b_1* b )
     5.14875084E-04    2     2000005        -5   # BR(~g -> ~b_2  bb)
     5.14875084E-04    2    -2000005         5   # BR(~g -> ~b_2* b )
     1.05106855E-02    2     1000006        -6   # BR(~g -> ~t_1  tb)
     1.05106855E-02    2    -1000006         6   # BR(~g -> ~t_1* t )
#
#         PDG            Width
DECAY   1000006     9.14946665E+01   # stop1 decays
#          BR         NDA      ID1       ID2
     6.97441840E-02    2     1000022         6   # BR(~t_1 -> ~chi_10 t )
     1.41529978E-01    2     1000023         6   # BR(~t_1 -> ~chi_20 t )
     2.49375992E-01    2     1000025         6   # BR(~t_1 -> ~chi_30 t )
     7.93483296E-02    2     1000035         6   # BR(~t_1 -> ~chi_40 t )
     2.76513501E-01    2     1000024         5   # BR(~t_1 -> ~chi_1+ b )
     1.83488002E-01    2     1000037         5   # BR(~t_1 -> ~chi_2+ b )
     1.27540882E-08    2     1000005        24   # BR(~t_1 -> ~b_1    W+)
#
#         PDG            Width
DECAY   2000006     1.06826084E+02   # stop2 decays
#          BR         NDA      ID1       ID2
     1.80337809E-02    2     1000022         6   # BR(~t_2 -> ~chi_10 t )
     1.42540338E-01    2     1000023         6   # BR(~t_2 -> ~chi_20 t )
     2.13246983E-01    2     1000025         6   # BR(~t_2 -> ~chi_30 t )
     2.28653465E-01    2     1000035         6   # BR(~t_2 -> ~chi_40 t )
     8.93820049E-02    2     1000024         5   # BR(~t_2 -> ~chi_1+ b )
     1.85892746E-01    2     1000037         5   # BR(~t_2 -> ~chi_2+ b )
     6.31253447E-02    2     1000006        25   # BR(~t_2 -> ~t_1    h )
     5.91212767E-02    2     1000006        23   # BR(~t_2 -> ~t_1    Z )
     4.06067599E-06    2     1000005        24   # BR(~t_2 -> ~b_1    W+)
#
#         PDG            Width
DECAY   1000005     2.01215275E+00   # sbottom1 decays
#          BR         NDA      ID1       ID2
     6.97930663E-01    2     1000022         5   # BR(~b_1 -> ~chi_10 b )
     6.24128236E-02    2     1000023         5   # BR(~b_1 -> ~chi_20 b )
     1.00995903E-01    2     1000025         5   # BR(~b_1 -> ~chi_30 b )
     1.31644080E-02    2     1000035         5   # BR(~b_1 -> ~chi_40 b )
     1.02641951E-01    2    -1000024         6   # BR(~b_1 -> ~chi_1- t )
     2.28542511E-02    2    -1000037         6   # BR(~b_1 -> ~chi_2- t )
#
#         PDG            Width
DECAY   2000005     1.04811483E+02   # sbottom2 decays
#          BR         NDA      ID1       ID2
     2.49246612E-03    2     1000022         5   # BR(~b_2 -> ~chi_10 b )
     3.83505625E-02    2     1000023         5   # BR(~b_2 -> ~chi_20 b )
     7.99439244E-03    2     1000025         5   # BR(~b_2 -> ~chi_30 b )
     9.49960444E-02    2     1000035         5   # BR(~b_2 -> ~chi_40 b )
     2.77375108E-01    2    -1000024         6   # BR(~b_2 -> ~chi_1- t )
     4.66555247E-01    2    -1000037         6   # BR(~b_2 -> ~chi_2- t )
     1.64710508E-06    2     1000005        25   # BR(~b_2 -> ~b_1    h )
     2.08537767E-06    2     1000005        23   # BR(~b_2 -> ~b_1    Z )
     1.12232447E-01    2     1000006       -24   # BR(~b_2 -> ~t_1    W-)
#
#         PDG            Width
DECAY   1000002     2.37143537E+01   # sup_L decays
#          BR         NDA      ID1       ID2
     1.83648658E-02    2     1000022         2   # BR(~u_L -> ~chi_10 u)
     1.02451417E-01    2     1000023         2   # BR(~u_L -> ~chi_20 u)
     5.04873582E-03    2     1000025         2   # BR(~u_L -> ~chi_30 u)
     2.14939170E-01    2     1000035         2   # BR(~u_L -> ~chi_40 u)
     3.45280695E-01    2     1000024         1   # BR(~u_L -> ~chi_1+ d)
     3.13915115E-01    2     1000037         1   # BR(~u_L -> ~chi_2+ d)
#
#         PDG            Width
DECAY   2000002     4.27867895E+00   # sup_R decays
#          BR         NDA      ID1       ID2
     9.22783239E-01    2     1000022         2   # BR(~u_R -> ~chi_10 u)
     8.18947316E-03    2     1000023         2   # BR(~u_R -> ~chi_20 u)
     6.47133400E-02    2     1000025         2   # BR(~u_R -> ~chi_30 u)
     4.31394812E-03    2     1000035         2   # BR(~u_R -> ~chi_40 u)
#
#         PDG            Width
DECAY   1000001     2.36229071E+01   # sdown_L decays
#          BR         NDA      ID1       ID2
     5.62680904E-03    2     1000022         1   # BR(~d_L -> ~chi_10 d)
     9.05660415E-02    2     1000023         1   # BR(~d_L -> ~chi_20 d)
     1.61596788E-02    2     1000025         1   # BR(~d_L -> ~chi_30 d)
     2.29569366E-01    2     1000035         1   # BR(~d_L -> ~chi_40 d)
     1.24738868E-01    2    -1000024         2   # BR(~d_L -> ~chi_1- u)
     5.33339237E-01    2    -1000037         2   # BR(~d_L -> ~chi_2- u)
#
#         PDG            Width
DECAY   2000001     7.28375151E-01   # sdown_R decays
#          BR         NDA      ID1       ID2
     9.24511966E-01    2     1000022         1   # BR(~d_R -> ~chi_10 d)
     8.09941034E-03    2     1000023         1   # BR(~d_R -> ~chi_20 d)
     6.32406300E-02    2     1000025         1   # BR(~d_R -> ~chi_30 d)
     4.14799358E-03    2     1000035         1   # BR(~d_R -> ~chi_40 d)
#
#         PDG            Width
DECAY   1000004     2.34782621E+01   # scharm_L decays
#          BR         NDA      ID1       ID2
     1.83846685E-02    2     1000022         4   # BR(~c_L -> ~chi_10 c)
     1.02486472E-01    2     1000023         4   # BR(~c_L -> ~chi_20 c)
     5.04882567E-03    2     1000025         4   # BR(~c_L -> ~chi_30 c)
     2.14877269E-01    2     1000035         4   # BR(~c_L -> ~chi_40 c)
     3.45384253E-01    2     1000024         3   # BR(~c_L -> ~chi_1+ s)
     3.13818512E-01    2     1000037         3   # BR(~c_L -> ~chi_2+ s)
#
#         PDG            Width
DECAY   2000004     4.22629098E+00   # scharm_R decays
#          BR         NDA      ID1       ID2
     9.22859248E-01    2     1000022         4   # BR(~c_R -> ~chi_10 c)
     8.18396143E-03    2     1000023         4   # BR(~c_R -> ~chi_20 c)
     6.46484942E-02    2     1000025         4   # BR(~c_R -> ~chi_30 c)
     4.30829668E-03    2     1000035         4   # BR(~c_R -> ~chi_40 c)
#
#         PDG            Width
DECAY   1000003     2.33850187E+01   # sstrange_L decays
#          BR         NDA      ID1       ID2
     5.63375809E-03    2     1000022         3   # BR(~s_L -> ~chi_10 s)
     9.06112330E-02    2     1000023         3   # BR(~s_L -> ~chi_20 s)
     1.61625011E-02    2     1000025         3   # BR(~s_L -> ~chi_30 s)
     2.29539261E-01    2     1000035         3   # BR(~s_L -> ~chi_40 s)
     1.24795589E-01    2    -1000024         4   # BR(~s_L -> ~chi_1- c)
     5.33257658E-01    2    -1000037         4   # BR(~s_L -> ~chi_2- c)
#
#         PDG            Width
DECAY   2000003     7.05420088E-01   # sstrange_R decays
#          BR         NDA      ID1       ID2
     9.24593178E-01    2     1000022         3   # BR(~s_R -> ~chi_10 s)
     8.09323465E-03    2     1000023         3   # BR(~s_R -> ~chi_20 s)
     6.31713574E-02    2     1000025         3   # BR(~s_R -> ~chi_30 s)
     4.14223032E-03    2     1000035         3   # BR(~s_R -> ~chi_40 s)
#
#         PDG            Width
DECAY   1000011     2.10930210E+01   # selectron_L decays
#          BR         NDA      ID1       ID2
     1.10739659E-01    2     1000022        11   # BR(~e_L -> ~chi_10 e-)
     1.06431107E-01    2     1000023        11   # BR(~e_L -> ~chi_20 e-)
     2.14213332E-04    2     1000025        11   # BR(~e_L -> ~chi_30 e-)
     1.84113990E-01    2     1000035        11   # BR(~e_L -> ~chi_40 e-)
     1.14325201E-01    2    -1000024        12   # BR(~e_L -> ~chi_1- nu_e)
     4.84175829E-01    2    -1000037        12   # BR(~e_L -> ~chi_2- nu_e)
#
#         PDG            Width
DECAY   2000011     1.15208179E+01   # selectron_R decays
#          BR         NDA      ID1       ID2
     9.22409069E-01    2     1000022        11   # BR(~e_R -> ~chi_10 e-)
     8.20740683E-03    2     1000023        11   # BR(~e_R -> ~chi_20 e-)
     6.50318954E-02    2     1000025        11   # BR(~e_R -> ~chi_30 e-)
     4.35162919E-03    2     1000035        11   # BR(~e_R -> ~chi_40 e-)
#
#         PDG            Width
DECAY   1000013     2.10930209E+01   # smuon_L decays
#          BR         NDA      ID1       ID2
     1.10739659E-01    2     1000022        13   # BR(~mu_L -> ~chi_10 mu-)
     1.06431106E-01    2     1000023        13   # BR(~mu_L -> ~chi_20 mu-)
     2.14213330E-04    2     1000025        13   # BR(~mu_L -> ~chi_30 mu-)
     1.84113989E-01    2     1000035        13   # BR(~mu_L -> ~chi_40 mu-)
     1.14325201E-01    2    -1000024        14   # BR(~mu_L -> ~chi_1- nu_mu)
     4.84175831E-01    2    -1000037        14   # BR(~mu_L -> ~chi_2- nu_mu)
#
#         PDG            Width
DECAY   2000013     1.15208179E+01   # smuon_R decays
#          BR         NDA      ID1       ID2
     9.22409069E-01    2     1000022        13   # BR(~mu_R -> ~chi_10 mu-)
     8.20740683E-03    2     1000023        13   # BR(~mu_R -> ~chi_20 mu-)
     6.50318954E-02    2     1000025        13   # BR(~mu_R -> ~chi_30 mu-)
     4.35162919E-03    2     1000035        13   # BR(~mu_R -> ~chi_40 mu-)
#
#         PDG            Width
DECAY   1000015     1.04783224E+01   # stau_1 decays
#          BR         NDA      ID1       ID2
     9.03414922E-01    2     1000022        15   # BR(~tau_1 -> ~chi_10  tau-)
     1.28725747E-02    2     1000023        15   # BR(~tau_1 -> ~chi_20  tau-)
     6.78431141E-02    2     1000025        15   # BR(~tau_1 -> ~chi_30  tau-)
     5.04338388E-03    2     1000035        15   # BR(~tau_1 -> ~chi_40  tau-)
     8.93403156E-03    2    -1000024        16   # BR(~tau_1 -> ~chi_1-  nu_tau)
     1.89197343E-03    2    -1000037        16   # BR(~tau_1 -> ~chi_2-  nu_tau)
#
#         PDG            Width
DECAY   2000015     2.90792152E+01   # stau_2 decays
#          BR         NDA      ID1       ID2
     1.08946482E-01    2     1000022        15   # BR(~tau_2 -> ~chi_10  tau-)
     1.06985445E-01    2     1000023        15   # BR(~tau_2 -> ~chi_20  tau-)
     2.02161792E-03    2     1000025        15   # BR(~tau_2 -> ~chi_30  tau-)
     1.84516114E-01    2     1000035        15   # BR(~tau_2 -> ~chi_40  tau-)
     1.12903891E-01    2    -1000024        16   # BR(~tau_2 -> ~chi_1-  nu_tau)
     4.84625231E-01    2    -1000037        16   # BR(~tau_2 -> ~chi_2-  nu_tau)
     6.30653532E-07    2     1000015        25   # BR(~tau_2 -> ~tau_1   h)
     5.87928755E-07    2     1000015        23   # BR(~tau_2 -> ~tau_1   Z)
#
#         PDG            Width
DECAY   1000012     2.11427137E+01   # snu_eL decays
#          BR         NDA      ID1       ID2
     7.50147940E-02    2     1000022        12   # BR(~nu_eL -> ~chi_10 nu_e)
     7.21667595E-02    2     1000023        12   # BR(~nu_eL -> ~chi_20 nu_e)
     3.04732503E-02    2     1000025        12   # BR(~nu_eL -> ~chi_30 nu_e)
     2.20415376E-01    2     1000035        12   # BR(~nu_eL -> ~chi_40 nu_e)
     3.16723710E-01    2     1000024        11   # BR(~nu_eL -> ~chi_1+ e-)
     2.85206110E-01    2     1000037        11   # BR(~nu_eL -> ~chi_2+ e-)
#
#         PDG            Width
DECAY   1000014     2.11427136E+01   # snu_muL decays
#          BR         NDA      ID1       ID2
     7.50147945E-02    2     1000022        14   # BR(~nu_muL -> ~chi_10 nu_mu)
     7.21667599E-02    2     1000023        14   # BR(~nu_muL -> ~chi_20 nu_mu)
     3.04732505E-02    2     1000025        14   # BR(~nu_muL -> ~chi_30 nu_mu)
     2.20415378E-01    2     1000035        14   # BR(~nu_muL -> ~chi_40 nu_mu)
     3.16723709E-01    2     1000024        13   # BR(~nu_muL -> ~chi_1+ mu-)
     2.85206109E-01    2     1000037        13   # BR(~nu_muL -> ~chi_2+ mu-)
#
#         PDG            Width
DECAY   1000016     2.91154222E+01   # snu_tauL decays
#          BR         NDA      ID1       ID2
     7.37371277E-02    2     1000022        16   # BR(~nu_tauL -> ~chi_10 nu_tau)
     7.13723065E-02    2     1000023        16   # BR(~nu_tauL -> ~chi_20 nu_tau)
     3.03063291E-02    2     1000025        16   # BR(~nu_tauL -> ~chi_30 nu_tau)
     2.20856869E-01    2     1000035        16   # BR(~nu_tauL -> ~chi_40 nu_tau)
     3.16980207E-01    2     1000024        15   # BR(~nu_tauL -> ~chi_1+ tau-)
     2.86745966E-01    2     1000037        15   # BR(~nu_tauL -> ~chi_2+ tau-)
     1.19504487E-06    2    -1000015       -24   # BR(~nu_tauL -> ~tau_1+ W-)
#
#         PDG            Width
DECAY   1000024     1.26669898E-02   # chargino1+ decays
#          BR         NDA      ID1       ID2
     1.00000000E+00    2     1000022        24   # BR(~chi_1+ -> ~chi_10  W+)
#
#         PDG            Width
DECAY   1000037     2.06748984E-01   # chargino2+ decays
#          BR         NDA      ID1       ID2
     2.37551091E-02    2     1000024        23   # BR(~chi_2+ -> ~chi_1+  Z )
     5.47700161E-01    2     1000022        24   # BR(~chi_2+ -> ~chi_10  W+)
     4.28544729E-01    2     1000023        24   # BR(~chi_2+ -> ~chi_20  W+)
#
#         PDG            Width
DECAY   1000022     0.00000000E+00   # neutralino1 decays
#
#         PDG            Width
DECAY   1000023     1.16891719E-03   # neutralino2 decays
#          BR         NDA      ID1       ID2
     1.00000000E+00    2     1000022        23   # BR(~chi_20 -> ~chi_10   Z )
#
#         PDG            Width
DECAY   1000025     3.35650799E-02   # neutralino3 decays
#          BR         NDA      ID1       ID2
     4.50723823E-01    2     1000022        23   # BR(~chi_30 -> ~chi_10   Z )
     5.49276177E-01    2     1000022        25   # BR(~chi_30 -> ~chi_10   h )
#
#         PDG            Width
DECAY   1000035     1.86394077E-01   # neutralino4 decays
#          BR         NDA      ID1       ID2
     2.40390179E-01    2     1000022        23   # BR(~chi_40 -> ~chi_10   Z )
     1.90804276E-02    2     1000023        23   # BR(~chi_40 -> ~chi_20   Z )
     3.31926527E-01    2     1000024       -24   # BR(~chi_40 -> ~chi_1+   W-)
     3.31926527E-01    2    -1000024        24   # BR(~chi_40 -> ~chi_1-   W+)
     7.66763406E-02    2     1000022        25   # BR(~chi_40 -> ~chi_10   h )
#
#         PDG            Width
DECAY        25     6.34633770E-03   # h decays
#          BR         NDA      ID1       ID2
     3.79325528E-01    2           5        -5   # BR(h -> b       bb     )
     4.08756633E-02    2         -15        15   # BR(h -> tau+    tau-   )
     1.44685123E-04    2         -13        13   # BR(h -> mu+     mu-    )
     1.57955327E-04    2           3        -3   # BR(h -> s       sb     )
     1.36573504E-02    2           4        -4   # BR(h -> c       cb     )
     5.02139179E-02    2          21        21   # BR(h -> g       g      )
     1.39680134E-03    2          22        22   # BR(h -> gam     gam    )
     9.77326330E-04    2          22        23   # BR(h -> Z       gam    )
     1.31125721E-01    2          24       -24   # BR(h -> W+      W-     )
     1.63626198E-02    2          23        23   # BR(h -> Z       Z      )
     3.65762432E-01    2     1000022   1000022   # BR(h -> ~chi_10 ~chi_10)
#
#         PDG            Width
DECAY        35     5.80157532E+01   # H decays
#          BR         NDA      ID1       ID2
     1.90935486E-02    2           5        -5   # BR(H -> b       bb     )
     3.64845482E-03    2         -15        15   # BR(H -> tau+    tau-   )
     1.29041965E-05    2         -13        13   # BR(H -> mu+     mu-    )
     7.76197366E-06    2           3        -3   # BR(H -> s       sb     )
     9.36109242E-07    2           4        -4   # BR(H -> c       cb     )
     9.23453224E-02    2           6        -6   # BR(H -> t       tb     )
     4.01164052E-05    2          21        21   # BR(H -> g       g      )
     3.28059817E-08    2          22        22   # BR(H -> gam     gam    )
     6.26138196E-08    2          23        22   # BR(H -> Z       gam    )
     2.70564835E-05    2          24       -24   # BR(H -> W+      W-     )
     1.35044031E-05    2          23        23   # BR(H -> Z       Z      )
     1.03018478E-04    2          25        25   # BR(H -> h       h      )
     2.60198916E-01    2     1000024  -1000024   # BR(H -> ~chi_1+ ~chi_1-)
     9.20848328E-02    2     1000037  -1000037   # BR(H -> ~chi_2+ ~chi_2-)
     9.29637986E-02    2     1000024  -1000037   # BR(H -> ~chi_1+ ~chi_2-)
     9.29637986E-02    2     1000037  -1000024   # BR(H -> ~chi_2+ ~chi_1-)
     6.13848256E-03    2     1000022   1000022   # BR(H -> ~chi_10 ~chi_10)
     7.23298756E-02    2     1000023   1000023   # BR(H -> ~chi_20 ~chi_20)
     1.28565854E-02    2     1000025   1000025   # BR(H -> ~chi_30 ~chi_30)
     5.35626379E-02    2     1000035   1000035   # BR(H -> ~chi_40 ~chi_40)
     5.69588741E-02    2     1000022   1000023   # BR(H -> ~chi_10 ~chi_20)
     6.88309080E-03    2     1000022   1000025   # BR(H -> ~chi_10 ~chi_30)
     2.04127221E-04    2     1000022   1000035   # BR(H -> ~chi_10 ~chi_40)
     4.47720963E-05    2     1000023   1000025   # BR(H -> ~chi_20 ~chi_30)
     5.74197887E-02    2     1000023   1000035   # BR(H -> ~chi_20 ~chi_40)
     8.00747255E-02    2     1000025   1000035   # BR(H -> ~chi_30 ~chi_40)
     1.01345720E-06    2     2000002  -2000002   # BR(H -> ~u_R    ~u_R*  )
     1.01345720E-06    2     2000004  -2000004   # BR(H -> ~c_R    ~c_R*  )
     7.21795417E-07    2     2000001  -2000001   # BR(H -> ~d_R    ~d_R*  )
     7.21795417E-07    2     2000003  -2000003   # BR(H -> ~s_R    ~s_R*  )
     2.28800811E-06    2     1000011  -1000011   # BR(H -> ~e_L-   ~e_L+  )
     2.28800811E-06    2     1000013  -1000013   # BR(H -> ~mu_L-  ~mu_L+ )
     7.46444469E-06    2     1000012  -1000012   # BR(H -> ~nu_eL  ~nu_eL*   )
     7.46444469E-06    2     1000014  -1000014   # BR(H -> ~nu_muL ~nu_muL*  )
#
#         PDG            Width
DECAY        36     5.80271295E+01   # A decays
#          BR         NDA      ID1       ID2
     1.91112328E-02    2           5        -5   # BR(A -> b       bb     )
     3.64795790E-03    2         -15        15   # BR(A -> tau+    tau-   )
     1.29024269E-05    2         -13        13   # BR(A -> mu+     mu-    )
     7.78083378E-06    2           3        -3   # BR(A -> s       sb     )
     9.41537996E-07    2           4        -4   # BR(A -> c       cb     )
     9.25324474E-02    2           6        -6   # BR(A -> t       tb     )
     5.91463917E-05    2          21        21   # BR(A -> g       g      )
     1.73764310E-09    2          22        22   # BR(A -> gam     gam    )
     8.22130162E-08    2          23        22   # BR(A -> Z       gam    )
     2.74361547E-05    2          23        25   # BR(A -> Z       h      )
     1.83781923E-01    2     1000024  -1000024   # BR(A -> ~chi_1+ ~chi_1-)
     1.60481670E-02    2     1000037  -1000037   # BR(A -> ~chi_2+ ~chi_2-)
     1.69192152E-01    2     1000024  -1000037   # BR(A -> ~chi_1+ ~chi_2-)
     1.69192152E-01    2     1000037  -1000024   # BR(A -> ~chi_2+ ~chi_1-)
     8.42485027E-03    2     1000022   1000022   # BR(A -> ~chi_10 ~chi_10)
     4.02046642E-02    2     1000023   1000023   # BR(A -> ~chi_20 ~chi_20)
     3.02195243E-02    2     1000025   1000025   # BR(A -> ~chi_30 ~chi_30)
     1.38886795E-02    2     1000035   1000035   # BR(A -> ~chi_40 ~chi_40)
     4.09615997E-02    2     1000022   1000023   # BR(A -> ~chi_10 ~chi_20)
     1.95607987E-02    2     1000022   1000025   # BR(A -> ~chi_10 ~chi_30)
     5.72151808E-03    2     1000022   1000035   # BR(A -> ~chi_10 ~chi_40)
     1.08536699E-02    2     1000023   1000025   # BR(A -> ~chi_20 ~chi_30)
     4.05531733E-02    2     1000023   1000035   # BR(A -> ~chi_20 ~chi_40)
     1.35997199E-01    2     1000025   1000035   # BR(A -> ~chi_30 ~chi_40)
#
#         PDG            Width
DECAY        37     5.78975507E+01   # H+ decays
#          BR         NDA      ID1       ID2
     3.16328536E-05    2           4        -5   # BR(H+ -> c       bb     )
     3.65735639E-03    2         -15        16   # BR(H+ -> tau+    nu_tau )
     1.29356683E-05    2         -13        14   # BR(H+ -> mu+     nu_mu  )
     3.16313074E-07    2           2        -5   # BR(H+ -> u       bb     )
     3.89740411E-07    2           2        -3   # BR(H+ -> u       sb     )
     8.57658868E-06    2           4        -3   # BR(H+ -> c       sb     )
     1.10060397E-01    2           6        -5   # BR(H+ -> t       bb     )
     2.75365877E-05    2          24        25   # BR(H+ -> W+      h      )
     7.10762555E-14    2          24        36   # BR(H+ -> W+      A      )
     1.17184299E-01    2     1000024   1000022   # BR(H+ -> ~chi_1+ ~chi_10)
     4.07122299E-03    2     1000024   1000023   # BR(H+ -> ~chi_1+ ~chi_20)
     5.14568118E-02    2     1000024   1000025   # BR(H+ -> ~chi_1+ ~chi_30)
     2.13162686E-01    2     1000024   1000035   # BR(H+ -> ~chi_1+ ~chi_40)
     4.15011639E-03    2     1000037   1000022   # BR(H+ -> ~chi_2+ ~chi_10)
     3.23024476E-01    2     1000037   1000023   # BR(H+ -> ~chi_2+ ~chi_20)
     1.72947179E-01    2     1000037   1000025   # BR(H+ -> ~chi_2+ ~chi_30)
     1.86042460E-04    2     1000037   1000035   # BR(H+ -> ~chi_2+ ~chi_40)
     9.01282029E-06    2    -1000011   1000012   # BR(H+ -> ~e_L+   ~nu_eL )
     9.01282029E-06    2    -1000013   1000014   # BR(H+ -> ~mu_L+  ~nu_muL)
