#
#                              ======================
#                              | THE SUSYHIT OUTPUT |
#                              ======================
#
#
#              ------------------------------------------------------
#              |     This is the output of the SUSY-HIT package     |
#              |  created by A.Djouadi, M.Muehlleitner and M.Spira. |
#              |  In case of problems with SUSY-HIT email to        |
#              |           margarete.muehlleitner@cern.ch           |
#              |           michael.spira@psi.ch                     |
#              |           abdelhak.djouadi@cern.ch                 |
#              ------------------------------------------------------
#
#              ------------------------------------------------------
#              |  SUSY Les Houches Accord - MSSM Spectrum + Decays  |
#              |              based on the decay programs           |
#              |                                                    |
#              |                     SDECAY 1.3b                    |
#              |                                                    |
#              |  Authors: M.Muhlleitner, A.Djouadi and Y.Mambrini  |
#              |  Ref.:    Comput.Phys.Commun.168(2005)46           |
#              |           [hep-ph/0311167]                         |
#              |                                                    |
#              |                     HDECAY 3.4                     |
#              |                                                    |
#              |  By: A.Djouadi,J.Kalinowski,M.Muhlleitner,M.Spira  |
#              |  Ref.:    Comput.Phys.Commun.108(1998)56           |
#              |           [hep-ph/9704448]                         |
#              |                                                    |
#              |                                                    |
#              |  If not stated otherwise all DRbar couplings and   |
#              |  soft SUSY breaking masses are given at the scale  |
#              |  Q=  0.23733440E+04
#              |                                                    |
#              ------------------------------------------------------
#
#
BLOCK DCINFO  # Decay Program information
     1   SDECAY/HDECAY # decay calculator
     2   1.3b  /3.4    # version number
#
BLOCK SPINFO  # Spectrum calculator information
     1     SOFTSUSY    # spectrum calculator               
     2     3.4.0       # version number                    
#
BLOCK MODSEL  # Model selection
     1     0   #  nonUniversal                                     
#
BLOCK SMINPUTS  # Standard Model inputs
         1     1.27908970E+02   # alpha_em^-1(M_Z)^MSbar
         2     1.16637870E-05   # G_F [GeV^-2]
         3     1.18400000E-01   # alpha_S(M_Z)^MSbar
         4     9.11876000E+01   # M_Z pole mass
         5     4.18000000E+00   # mb(mb)^MSbar
         6     1.73200000E+02   # mt pole mass
         7     1.77700000E+00   # mtau pole mass
#
BLOCK MINPAR  # Input parameters - minimal models
         3     3.10800000E+01   # tanb                
#
BLOCK EXTPAR  # Input parameters - non-minimal models
         0    -1.00000000E+00   # Set                 
         1    -2.55350000E+02   # M_1(MX)             
         2     1.33440000E+03   # M_2(MX)             
         3     2.57437000E+03   # M_3(MX)             
        11    -3.36837000E+03   # At(MX)              
        12     1.46561000E+03   # Ab(MX)              
        13     2.64889000E+03   # Atau(MX)            
        23     3.21970000E+02   # mu(MX)              
        26     5.67430000E+02   # mA(pole)            
        31     3.65611000E+03   # meL(MX)             
        32     3.65611000E+03   # mmuL(MX)            
        33     7.34490000E+02   # mtauL(MX)           
        34     3.09338000E+03   # meR(MX)             
        35     3.09338000E+03   # mmuR(MX)            
        36     2.75917000E+03   # mtauR(MX)           
        41     1.88418000E+03   # mqL1(MX)            
        42     1.88418000E+03   # mqL2(MX)            
        43     1.59965000E+03   # mqL3(MX)            
        44     1.03601000E+03   # muR(MX)             
        45     1.03601000E+03   # mcR(MX)             
        46     3.51938000E+03   # mtR(MX)             
        47     1.48713000E+03   # mdR(MX)             
        48     1.48713000E+03   # msR(MX)             
        49     3.61873000E+03   # mbR(MX)             
#
BLOCK MASS  # Mass Spectrum
# PDG code           mass       particle
        24     8.03768028E+01   # W+
        25     1.26152349E+02   # h
        35     5.67462029E+02   # H
        36     5.67430003E+02   # A
        37     5.73308807E+02   # H+
         5     4.81876030E+00   # b-quark pole mass calculated from mb(mb)_Msbar
   1000001     1.99162929E+03   # ~d_L
   2000001     1.59341890E+03   # ~d_R
   1000002     1.99015186E+03   # ~u_L
   2000002     1.16528698E+03   # ~u_R
   1000003     1.99162929E+03   # ~s_L
   2000003     1.59341890E+03   # ~s_R
   1000004     1.99015186E+03   # ~c_L
   2000004     1.16528698E+03   # ~c_R
   1000005     1.69615249E+03   # ~b_1
   2000005     3.66369915E+03   # ~b_2
   1000006     1.69324646E+03   # ~t_1
   2000006     3.53544922E+03   # ~t_2
   1000011     3.66511615E+03   # ~e_L
   2000011     3.09403360E+03   # ~e_R
   1000012     3.66392941E+03   # ~nu_eL
   1000013     3.66511615E+03   # ~mu_L
   2000013     3.09403360E+03   # ~mu_R
   1000014     3.66392941E+03   # ~nu_muL
   1000015     7.59330032E+02   # ~tau_1
   2000015     2.75158394E+03   # ~tau_2
   1000016     7.54925315E+02   # ~nu_tauL
   1000021     2.62337850E+03   # ~g
   1000022    -2.44937343E+02   # ~chi_10
   1000023     3.33450268E+02   # ~chi_20
   1000025    -3.46474618E+02   # ~chi_30
   1000035     1.35775858E+03   # ~chi_40
   1000024     3.33889338E+02   # ~chi_1+
   1000037     1.35793071E+03   # ~chi_2+
#
BLOCK NMIX  # Neutralino Mixing Matrix
  1  1     9.50291314E-01   # N_11
  1  2     8.64828815E-03   # N_12
  1  3     2.53113158E-01   # N_13
  1  4     1.81122483E-01   # N_14
  2  1     5.36499395E-02   # N_21
  2  2     5.64017940E-02   # N_22
  2  3    -7.06618141E-01   # N_23
  2  4     7.03300309E-01   # N_24
  3  1    -3.06700457E-01   # N_31
  3  2     3.10918489E-02   # N_32
  3  3     6.60552745E-01   # N_33
  3  4     6.84571543E-01   # N_34
  4  1    -1.71208026E-03   # N_41
  4  2     9.97886437E-01   # N_42
  4  3     1.71640063E-02   # N_43
  4  4    -6.26508099E-02   # N_44
#
BLOCK UMIX  # Chargino Mixing Matrix U
  1  1    -2.42540156E-02   # U_11
  1  2     9.99705828E-01   # U_12
  2  1    -9.99705828E-01   # U_21
  2  2    -2.42540156E-02   # U_22
#
BLOCK VMIX  # Chargino Mixing Matrix V
  1  1    -8.86197967E-02   # V_11
  1  2     9.96065526E-01   # V_12
  2  1    -9.96065526E-01   # V_21
  2  2    -8.86197967E-02   # V_22
#
BLOCK STOPMIX  # Stop Mixing Matrix
  1  1     9.98720645E-01   # cos(theta_t)
  1  2     5.05675118E-02   # sin(theta_t)
  2  1    -5.05675118E-02   # -sin(theta_t)
  2  2     9.98720645E-01   # cos(theta_t)
#
BLOCK SBOTMIX  # Sbottom Mixing Matrix
  1  1     9.99998250E-01   # cos(theta_b)
  1  2     1.87082787E-03   # sin(theta_b)
  2  1    -1.87082787E-03   # -sin(theta_b)
  2  2     9.99998250E-01   # cos(theta_b)
#
BLOCK STAUMIX  # Stau Mixing Matrix
  1  1     9.99998131E-01   # cos(theta_tau)
  1  2     1.93338990E-03   # sin(theta_tau)
  2  1    -1.93338990E-03   # -sin(theta_tau)
  2  2     9.99998131E-01   # cos(theta_tau)
#
BLOCK ALPHA  # Higgs mixing
          -3.56627061E-02   # Mixing angle in the neutral Higgs boson sector
#
BLOCK HMIX Q=  2.37334400E+03  # DRbar Higgs Parameters
         1     3.27509702E+02   # mu(Q)MSSM           
         2     3.01247389E+01   # tan                 
         3     2.42423978E+02   # higgs               
         4     6.06009447E+05   # mA^2(Q)MSSM         
#
BLOCK GAUGE Q=  2.37334400E+03  # The gauge couplings
     1     3.64514285E-01   # gprime(Q) DRbar
     2     6.39495443E-01   # g(Q) DRbar
     3     1.02115662E+00   # g3(Q) DRbar
#
BLOCK AU Q=  2.37334400E+03  # The trilinear couplings
  1  1     0.00000000E+00   # A_u(Q) DRbar
  2  2     0.00000000E+00   # A_c(Q) DRbar
  3  3    -3.36836999E+03   # A_t(Q) DRbar
#
BLOCK AD Q=  2.37334400E+03  # The trilinear couplings
  1  1     0.00000000E+00   # A_d(Q) DRbar
  2  2     0.00000000E+00   # A_s(Q) DRbar
  3  3     1.46561000E+03   # A_b(Q) DRbar
#
BLOCK AE Q=  2.37334400E+03  # The trilinear couplings
  1  1     0.00000000E+00   # A_e(Q) DRbar
  2  2     0.00000000E+00   # A_mu(Q) DRbar
  3  3     2.64889000E+03   # A_tau(Q) DRbar
#
BLOCK Yu Q=  2.37334400E+03  # The Yukawa couplings
  1  1     0.00000000E+00   # y_u(Q) DRbar
  2  2     0.00000000E+00   # y_c(Q) DRbar
  3  3     8.21024487E-01   # y_t(Q) DRbar
#
BLOCK Yd Q=  2.37334400E+03  # The Yukawa couplings
  1  1     0.00000000E+00   # y_d(Q) DRbar
  2  2     0.00000000E+00   # y_s(Q) DRbar
  3  3     4.11073760E-01   # y_b(Q) DRbar
#
BLOCK Ye Q=  2.37334400E+03  # The Yukawa couplings
  1  1     0.00000000E+00   # y_e(Q) DRbar
  2  2     0.00000000E+00   # y_mu(Q) DRbar
  3  3     3.21335284E-01   # y_tau(Q) DRbar
#
BLOCK MSOFT Q=  2.37334400E+03  # The soft SUSY breaking masses at the scale Q
         1    -2.55350000E+02   # M_1(Q)              
         2     1.33440000E+03   # M_2(Q)              
         3     2.57437000E+03   # M_3(Q)              
        21     2.11978700E+05   # mH1^2(Q)            
        22    -7.51808943E+04   # mH2^2(Q)            
        31     3.65611000E+03   # meL(Q)              
        32     3.65611000E+03   # mmuL(Q)             
        33     7.34490000E+02   # mtauL(Q)            
        34     3.09338000E+03   # meR(Q)              
        35     3.09338000E+03   # mmuR(Q)             
        36     2.75917000E+03   # mtauR(Q)            
        41     1.88417999E+03   # mqL1(Q)             
        42     1.88417999E+03   # mqL2(Q)             
        43     1.59964998E+03   # mqL3(Q)             
        44     1.03600999E+03   # muR(Q)              
        45     1.03600999E+03   # mcR(Q)              
        46     3.51937999E+03   # mtR(Q)              
        47     1.48712999E+03   # mdR(Q)              
        48     1.48712999E+03   # msR(Q)              
        49     3.61873000E+03   # mbR(Q)              
#
Block HiggsBoundsInputHiggsCouplingsFermions
# ScalarNormEffCoupSq PseudoSNormEffCoupSq NP   IP1 IP2 IP2
    1.15496639E+00    0.00000000E+00        3  25   5   5  # h0-b-b eff. coupling^2, normalised to SM
    9.07344927E+02    0.00000000E+00        3  35   5   5  # H0-b-b eff. coupling^2, normalised to SM
    0.00000000E+00    9.07499894E+02        3  36   5   5  # A0-b-b eff. coupling^2, normalised to SM
#
    9.99829238E-01    0.00000000E+00        3  25   6   6  # h0-t-t eff. coupling^2, normalised to SM
    1.27269039E-03    0.00000000E+00        3  35   6   6  # H0-t-t eff. coupling^2, normalised to SM
    0.00000000E+00    1.10192850E-03        3  36   6   6  # A0-t-t eff. coupling^2, normalised to SM
#
    1.15496639E+00    0.00000000E+00        3  25  15  15  # h0-tau-tau eff. coupling^2, normalised to SM
    9.07344927E+02    0.00000000E+00        3  35  15  15  # H0-tau-tau eff. coupling^2, normalised to SM
    0.00000000E+00    9.07499894E+02        3  36  15  15  # A0-tau-tau eff. coupling^2, normalised to SM
#
Block HiggsBoundsInputHiggsCouplingsBosons
    9.99993852E-01        3  25  24  24  # h0-W-W eff. coupling^2, normalised to SM
    6.14831697E-06        3  35  24  24  # H0-W-W eff. coupling^2, normalised to SM
    0.00000000E+00        3  36  24  24  # A0-W-W eff. coupling^2, normalised to SM
#
    9.99993852E-01        3  25  23  23  # h0-Z-Z eff. coupling^2, normalised to SM
    6.14831697E-06        3  35  23  23  # H0-Z-Z eff. coupling^2, normalised to SM
    0.00000000E+00        3  36  23  23  # A0-Z-Z eff. coupling^2, normalised to SM
#
    8.75890029E-01        3  25  21  21  # h0-g-g eff. coupling^2, normalised to SM
    1.65532288E-03        3  35  21  21  # H0-g-g eff. coupling^2, normalised to SM
    2.29071505E-03        3  36  21  21  # A0-g-g eff. coupling^2, normalised to SM
#
    0.00000000E+00        3  25  25  23  # h0-h0-Z eff. coupling^2, normalised to SM
    0.00000000E+00        3  35  25  23  # H0-h0-Z eff. coupling^2, normalised to SM
    6.14831697E-06        3  36  25  23  # A0-h0-Z eff. coupling^2, normalised to SM
    0.00000000E+00        3  35  35  23  # H0-H0-Z eff. coupling^2, normalised to SM
    9.99993852E-01        3  36  35  23  # A0-H0-Z eff. coupling^2, normalised to SM
    0.00000000E+00        3  36  36  23  # A0-A0-Z eff. coupling^2, normalised to SM
#
    0.00000000E+00        4  25  21  21  23  # h0-g-g-Z eff. coupling^2, normalised to SM
    0.00000000E+00        4  35  21  21  23  # H0-g-g-Z eff. coupling^2, normalised to SM
    0.00000000E+00        4  36  21  21  23  # A0-g-g-Z eff. coupling^2, normalised to SM
#
#
#
#                             =================
#                             |The decay table|
#                             =================
#
# - The QCD corrections to the decays gluino -> squark  + quark
#                                     squark -> gaugino + quark_prime
#                                     squark -> squark_prime + Higgs
#                                     squark -> gluino  + quark
#   are included.
#
# - The multi-body decays for the inos, stops and sbottoms are included.
#
# - The loop induced decays for the gluino, neutralinos and stops
#   are included.
#
# - The SUSY decays of the top quark are included.
#
#
#         PDG            Width
DECAY         6     1.44086287E+00   # top decays
#          BR         NDA      ID1       ID2
     1.00000000E+00    2           5        24   # BR(t ->  b    W+)
#
#         PDG            Width
DECAY   1000021     1.84766839E+02   # gluino decays
#          BR         NDA      ID1       ID2
     2.58386410E-02    2     1000001        -1   # BR(~g -> ~d_L  db)
     2.58386410E-02    2    -1000001         1   # BR(~g -> ~d_L* d )
     5.73378266E-02    2     2000001        -1   # BR(~g -> ~d_R  db)
     5.73378266E-02    2    -2000001         1   # BR(~g -> ~d_R* d )
     2.59430180E-02    2     1000002        -2   # BR(~g -> ~u_L  ub)
     2.59430180E-02    2    -1000002         2   # BR(~g -> ~u_L* u )
     9.27635727E-02    2     2000002        -2   # BR(~g -> ~u_R  ub)
     9.27635727E-02    2    -2000002         2   # BR(~g -> ~u_R* u )
     2.58386410E-02    2     1000003        -3   # BR(~g -> ~s_L  sb)
     2.58386410E-02    2    -1000003         3   # BR(~g -> ~s_L* s )
     5.73378266E-02    2     2000003        -3   # BR(~g -> ~s_R  sb)
     5.73378266E-02    2    -2000003         3   # BR(~g -> ~s_R* s )
     2.59429549E-02    2     1000004        -4   # BR(~g -> ~c_L  cb)
     2.59429549E-02    2    -1000004         4   # BR(~g -> ~c_L* c )
     9.27635511E-02    2     2000004        -4   # BR(~g -> ~c_R  cb)
     9.27635511E-02    2    -2000004         4   # BR(~g -> ~c_R* c )
     4.87658156E-02    2     1000005        -5   # BR(~g -> ~b_1  bb)
     4.87658156E-02    2    -1000005         5   # BR(~g -> ~b_1* b )
     4.74681525E-02    2     1000006        -6   # BR(~g -> ~t_1  tb)
     4.74681525E-02    2    -1000006         6   # BR(~g -> ~t_1* t )
#
#         PDG            Width
DECAY   1000006     2.87441335E+01   # stop1 decays
#          BR         NDA      ID1       ID2
     2.94719237E-02    2     1000022         6   # BR(~t_1 -> ~chi_10 t )
     3.51510543E-01    2     1000023         6   # BR(~t_1 -> ~chi_20 t )
     3.38749341E-01    2     1000025         6   # BR(~t_1 -> ~chi_30 t )
     2.78982167E-02    2     1000035         6   # BR(~t_1 -> ~chi_40 t )
     1.92640169E-01    2     1000024         5   # BR(~t_1 -> ~chi_1+ b )
     5.97298066E-02    2     1000037         5   # BR(~t_1 -> ~chi_2+ b )
#
#         PDG            Width
DECAY   2000006     2.04465602E+02   # stop2 decays
#          BR         NDA      ID1       ID2
     4.45783921E-02    2     1000022         6   # BR(~t_2 -> ~chi_10 t )
     1.12172595E-01    2     1000023         6   # BR(~t_2 -> ~chi_20 t )
     1.08298314E-01    2     1000025         6   # BR(~t_2 -> ~chi_30 t )
     1.37445970E-03    2     1000035         6   # BR(~t_2 -> ~chi_40 t )
     2.23966483E-01    2     1000024         5   # BR(~t_2 -> ~chi_1+ b )
     2.74970529E-03    2     1000037         5   # BR(~t_2 -> ~chi_2+ b )
     1.85488207E-01    2     1000021         6   # BR(~t_2 -> ~g      t )
     8.04689950E-02    2     1000006        25   # BR(~t_2 -> ~t_1    h )
     2.87466891E-04    2     1000006        35   # BR(~t_2 -> ~t_1    H )
     3.14177662E-04    2     1000006        36   # BR(~t_2 -> ~t_1    A )
     6.24718377E-04    2     1000005        37   # BR(~t_2 -> ~b_1    H+)
     8.14199747E-02    2     1000006        23   # BR(~t_2 -> ~t_1    Z )
     1.58256511E-01    2     1000005        24   # BR(~t_2 -> ~b_1    W+)
#
#         PDG            Width
DECAY   1000005     2.84284342E+01   # sbottom1 decays
#          BR         NDA      ID1       ID2
     1.93185376E-02    2     1000022         5   # BR(~b_1 -> ~chi_10 b )
     9.30337234E-02    2     1000023         5   # BR(~b_1 -> ~chi_20 b )
     8.20133594E-02    2     1000025         5   # BR(~b_1 -> ~chi_30 b )
     3.12195971E-02    2     1000035         5   # BR(~b_1 -> ~chi_40 b )
     7.16109869E-01    2    -1000024         6   # BR(~b_1 -> ~chi_1- t )
     5.83049131E-02    2    -1000037         6   # BR(~b_1 -> ~chi_2- t )
#
#         PDG            Width
DECAY   2000005     7.75281682E+01   # sbottom2 decays
#          BR         NDA      ID1       ID2
     3.48495684E-02    2     1000022         5   # BR(~b_2 -> ~chi_10 b )
     7.80821796E-02    2     1000023         5   # BR(~b_2 -> ~chi_20 b )
     7.07285744E-02    2     1000025         5   # BR(~b_2 -> ~chi_30 b )
     4.37348419E-05    2     1000035         5   # BR(~b_2 -> ~chi_40 b )
     1.55426616E-01    2    -1000024         6   # BR(~b_2 -> ~chi_1- t )
     8.68010474E-05    2    -1000037         6   # BR(~b_2 -> ~chi_2- t )
     6.20703414E-01    2     1000021         5   # BR(~b_2 -> ~g      b )
     3.51263387E-04    2     1000005        25   # BR(~b_2 -> ~b_1    h )
     9.64881948E-03    2     1000005        35   # BR(~b_2 -> ~b_1    H )
     9.63991049E-03    2     1000005        36   # BR(~b_2 -> ~b_1    A )
     1.94152730E-02    2     1000006       -37   # BR(~b_2 -> ~t_1    H-)
     3.47655403E-04    2     1000005        23   # BR(~b_2 -> ~b_1    Z )
     6.76189807E-04    2     1000006       -24   # BR(~b_2 -> ~t_1    W-)
     5.50377027E-10    2     2000006       -24   # BR(~b_2 -> ~t_2    W-)
#
#         PDG            Width
DECAY   1000002     7.34217767E+00   # sup_L decays
#          BR         NDA      ID1       ID2
     3.79069736E-02    2     1000022         2   # BR(~u_L -> ~chi_10 u)
     4.57646435E-03    2     1000023         2   # BR(~u_L -> ~chi_20 u)
     7.58973466E-04    2     1000025         2   # BR(~u_L -> ~chi_30 u)
     3.14236097E-01    2     1000035         2   # BR(~u_L -> ~chi_40 u)
     1.62057480E-02    2     1000024         1   # BR(~u_L -> ~chi_1+ d)
     6.26315743E-01    2     1000037         1   # BR(~u_L -> ~chi_2+ d)
#
#         PDG            Width
DECAY   2000002     2.53125590E+00   # sup_R decays
#          BR         NDA      ID1       ID2
     9.10948624E-01    2     1000022         2   # BR(~u_R -> ~chi_10 u)
     2.68058488E-03    2     1000023         2   # BR(~u_R -> ~chi_20 u)
     8.63707913E-02    2     1000025         2   # BR(~u_R -> ~chi_30 u)
#
#         PDG            Width
DECAY   1000001     7.28028737E+00   # sdown_L decays
#          BR         NDA      ID1       ID2
     3.15823363E-02    2     1000022         1   # BR(~d_L -> ~chi_10 d)
     2.22379723E-03    2     1000023         1   # BR(~d_L -> ~chi_20 d)
     8.28003952E-03    2     1000025         1   # BR(~d_L -> ~chi_30 d)
     3.18353029E-01    2     1000035         1   # BR(~d_L -> ~chi_40 d)
     1.22514816E-03    2    -1000024         2   # BR(~d_L -> ~chi_1- u)
     6.38335650E-01    2    -1000037         2   # BR(~d_L -> ~chi_2- u)
#
#         PDG            Width
DECAY   2000001     8.91608769E-01   # sdown_R decays
#          BR         NDA      ID1       ID2
     9.07188950E-01    2     1000022         1   # BR(~d_R -> ~chi_10 d)
     2.77499489E-03    2     1000023         1   # BR(~d_R -> ~chi_20 d)
     9.00358166E-02    2     1000025         1   # BR(~d_R -> ~chi_30 d)
     2.38685381E-07    2     1000035         1   # BR(~d_R -> ~chi_40 d)
#
#         PDG            Width
DECAY   1000004     7.33110948E+00   # scharm_L decays
#          BR         NDA      ID1       ID2
     3.83439388E-02    2     1000022         4   # BR(~c_L -> ~chi_10 c)
     4.62642829E-03    2     1000023         4   # BR(~c_L -> ~chi_20 c)
     7.67195165E-04    2     1000025         4   # BR(~c_L -> ~chi_30 c)
     3.14011778E-01    2     1000035         4   # BR(~c_L -> ~chi_40 c)
     1.63826500E-02    2     1000024         3   # BR(~c_L -> ~chi_1+ s)
     6.25868009E-01    2     1000037         3   # BR(~c_L -> ~chi_2+ s)
#
#         PDG            Width
DECAY   2000004     2.47960117E+00   # scharm_R decays
#          BR         NDA      ID1       ID2
     9.11005270E-01    2     1000022         4   # BR(~c_R -> ~chi_10 c)
     2.67911160E-03    2     1000023         4   # BR(~c_R -> ~chi_20 c)
     8.63156185E-02    2     1000025         4   # BR(~c_R -> ~chi_30 c)
#
#         PDG            Width
DECAY   1000003     7.26845657E+00   # sstrange_L decays
#          BR         NDA      ID1       ID2
     3.19518352E-02    2     1000022         3   # BR(~s_L -> ~chi_10 s)
     2.24845867E-03    2     1000023         3   # BR(~s_L -> ~chi_20 s)
     8.37116013E-03    2     1000025         3   # BR(~s_L -> ~chi_30 s)
     3.18188838E-01    2     1000035         3   # BR(~s_L -> ~chi_40 s)
     1.23873039E-03    2    -1000024         4   # BR(~s_L -> ~chi_1- c)
     6.38000978E-01    2    -1000037         4   # BR(~s_L -> ~chi_2- c)
#
#         PDG            Width
DECAY   2000003     8.88165884E-01   # sstrange_R decays
#          BR         NDA      ID1       ID2
     9.07247221E-01    2     1000022         3   # BR(~s_R -> ~chi_10 s)
     2.77348072E-03    2     1000023         3   # BR(~s_R -> ~chi_20 s)
     8.99790664E-02    2     1000025         3   # BR(~s_R -> ~chi_30 s)
     2.31779264E-07    2     1000035         3   # BR(~s_R -> ~chi_40 s)
#
#         PDG            Width
DECAY   1000011     3.81166036E+01   # selectron_L decays
#          BR         NDA      ID1       ID2
     1.17405036E-01    2     1000022        11   # BR(~e_L -> ~chi_10 e-)
     2.91066413E-03    2     1000023        11   # BR(~e_L -> ~chi_20 e-)
     7.93663182E-03    2     1000025        11   # BR(~e_L -> ~chi_30 e-)
     2.89364010E-01    2     1000035        11   # BR(~e_L -> ~chi_40 e-)
     4.52592489E-04    2    -1000024        12   # BR(~e_L -> ~chi_1- nu_e)
     5.81931066E-01    2    -1000037        12   # BR(~e_L -> ~chi_2- nu_e)
#
#         PDG            Width
DECAY   2000011     1.61333813E+01   # selectron_R decays
#          BR         NDA      ID1       ID2
     9.04152762E-01    2     1000022        11   # BR(~e_R -> ~chi_10 e-)
     2.85088570E-03    2     1000023        11   # BR(~e_R -> ~chi_20 e-)
     9.29944144E-02    2     1000025        11   # BR(~e_R -> ~chi_30 e-)
     1.93750936E-06    2     1000035        11   # BR(~e_R -> ~chi_40 e-)
#
#         PDG            Width
DECAY   1000013     3.81166036E+01   # smuon_L decays
#          BR         NDA      ID1       ID2
     1.17405036E-01    2     1000022        13   # BR(~mu_L -> ~chi_10 mu-)
     2.91066412E-03    2     1000023        13   # BR(~mu_L -> ~chi_20 mu-)
     7.93663181E-03    2     1000025        13   # BR(~mu_L -> ~chi_30 mu-)
     2.89364009E-01    2     1000035        13   # BR(~mu_L -> ~chi_40 mu-)
     4.52592489E-04    2    -1000024        14   # BR(~mu_L -> ~chi_1- nu_mu)
     5.81931066E-01    2    -1000037        14   # BR(~mu_L -> ~chi_2- nu_mu)
#
#         PDG            Width
DECAY   2000013     1.61333813E+01   # smuon_R decays
#          BR         NDA      ID1       ID2
     9.04152762E-01    2     1000022        13   # BR(~mu_R -> ~chi_10 mu-)
     2.85088570E-03    2     1000023        13   # BR(~mu_R -> ~chi_20 mu-)
     9.29944144E-02    2     1000025        13   # BR(~mu_R -> ~chi_30 mu-)
     1.93750936E-06    2     1000035        13   # BR(~mu_R -> ~chi_40 mu-)
#
#         PDG            Width
DECAY   1000015     1.82274767E+00   # stau_1 decays
#          BR         NDA      ID1       ID2
     4.56028458E-01    2     1000022        15   # BR(~tau_1 -> ~chi_10  tau-)
     2.86535545E-01    2     1000023        15   # BR(~tau_1 -> ~chi_20  tau-)
     2.56032705E-01    2     1000025        15   # BR(~tau_1 -> ~chi_30  tau-)
     1.40329178E-03    2    -1000024        16   # BR(~tau_1 -> ~chi_1-  nu_tau)
#
#         PDG            Width
DECAY   2000015     3.45652941E+01   # stau_2 decays
#          BR         NDA      ID1       ID2
     3.84260887E-01    2     1000022        15   # BR(~tau_2 -> ~chi_10  tau-)
     8.04332685E-02    2     1000023        15   # BR(~tau_2 -> ~chi_20  tau-)
     1.07549329E-01    2     1000025        15   # BR(~tau_2 -> ~chi_30  tau-)
     3.77053069E-05    2     1000035        15   # BR(~tau_2 -> ~chi_40  tau-)
     1.58623168E-01    2    -1000024        16   # BR(~tau_2 -> ~chi_1-  nu_tau)
     7.38886064E-05    2    -1000037        16   # BR(~tau_2 -> ~chi_2-  nu_tau)
     1.33376189E-01    2     1000016       -37   # BR(~tau_2 -> ~nu_tauL H-)
     1.11815358E-03    2     1000016       -24   # BR(~tau_2 -> ~nu_tauL W-)
     5.39540978E-04    2     1000015        25   # BR(~tau_2 -> ~tau_1   h)
     6.67212621E-02    2     1000015        35   # BR(~tau_2 -> ~tau_1   H)
     6.66932898E-02    2     1000015        36   # BR(~tau_2 -> ~tau_1   A)
     5.73317552E-04    2     1000015        23   # BR(~tau_2 -> ~tau_1   Z)
#
#         PDG            Width
DECAY   1000012     3.81327813E+01   # snu_eL decays
#          BR         NDA      ID1       ID2
     1.10057874E-01    2     1000022        12   # BR(~nu_eL -> ~chi_10 nu_e)
     2.56301631E-04    2     1000023        12   # BR(~nu_eL -> ~chi_20 nu_e)
     1.62773960E-02    2     1000025        12   # BR(~nu_eL -> ~chi_30 nu_e)
     2.90221076E-01    2     1000035        12   # BR(~nu_eL -> ~chi_40 nu_e)
     6.03770507E-03    2     1000024        11   # BR(~nu_eL -> ~chi_1+ e-)
     5.77149647E-01    2     1000037        11   # BR(~nu_eL -> ~chi_2+ e-)
#
#         PDG            Width
DECAY   1000014     3.81327813E+01   # snu_muL decays
#          BR         NDA      ID1       ID2
     1.10057874E-01    2     1000022        14   # BR(~nu_muL -> ~chi_10 nu_mu)
     2.56301631E-04    2     1000023        14   # BR(~nu_muL -> ~chi_20 nu_mu)
     1.62773960E-02    2     1000025        14   # BR(~nu_muL -> ~chi_30 nu_mu)
     2.90221077E-01    2     1000035        14   # BR(~nu_muL -> ~chi_40 nu_mu)
     6.03770507E-03    2     1000024        13   # BR(~nu_muL -> ~chi_1+ mu-)
     5.77149647E-01    2     1000037        13   # BR(~nu_muL -> ~chi_2+ mu-)
#
#         PDG            Width
DECAY   1000016     1.81403874E+00   # snu_tauL decays
#          BR         NDA      ID1       ID2
     3.85039263E-01    2     1000022        16   # BR(~nu_tauL -> ~chi_10 nu_tau)
     7.31256435E-04    2     1000023        16   # BR(~nu_tauL -> ~chi_20 nu_tau)
     4.47248891E-02    2     1000025        16   # BR(~nu_tauL -> ~chi_30 nu_tau)
     5.69504592E-01    2     1000024        15   # BR(~nu_tauL -> ~chi_1+ tau-)
#
#         PDG            Width
DECAY   1000024     1.20105465E-02   # chargino1+ decays
#          BR         NDA      ID1       ID2
     1.00000000E+00    2     1000022        24   # BR(~chi_1+ -> ~chi_10  W+)
#
#         PDG            Width
DECAY   1000037     2.31594418E+01   # chargino2+ decays
#          BR         NDA      ID1       ID2
     1.12978540E-01    2     1000016       -15   # BR(~chi_2+ -> ~nu_tau1 tau+)
     1.12605496E-01    2    -1000015        16   # BR(~chi_2+ -> ~tau_1+  nu_tau)
     1.21285858E-01    2     1000024        23   # BR(~chi_2+ -> ~chi_1+  Z )
     1.08404816E-02    2     1000022        24   # BR(~chi_2+ -> ~chi_10  W+)
     1.18622529E-01    2     1000023        24   # BR(~chi_2+ -> ~chi_20  W+)
     1.07629600E-01    2     1000025        24   # BR(~chi_2+ -> ~chi_30  W+)
     1.19234455E-01    2     1000024        25   # BR(~chi_2+ -> ~chi_1+  h )
     7.39663059E-02    2     1000024        35   # BR(~chi_2+ -> ~chi_1+  H )
     7.45064950E-02    2     1000024        36   # BR(~chi_2+ -> ~chi_1+  A )
     9.12995599E-03    2     1000022        37   # BR(~chi_2+ -> ~chi_10  H+)
     7.44015979E-02    2     1000023        37   # BR(~chi_2+ -> ~chi_20  H+)
     6.47986851E-02    2     1000025        37   # BR(~chi_2+ -> ~chi_30  H+)
#
#         PDG            Width
DECAY   1000022     0.00000000E+00   # neutralino1 decays
#
#         PDG            Width
DECAY   1000023     1.04511212E-03   # neutralino2 decays
#          BR         NDA      ID1       ID2
     1.64681699E-04    2     1000022        22   # BR(~chi_20 -> ~chi_10 gam)
#           BR         NDA      ID1       ID2       ID3
     1.17009724E-01    3     1000022        -2         2   # BR(~chi_20 -> ~chi_10 ub      u)
     1.51778792E-01    3     1000022        -1         1   # BR(~chi_20 -> ~chi_10 db      d)
     1.17009724E-01    3     1000022        -4         4   # BR(~chi_20 -> ~chi_10 cb      c)
     1.51778792E-01    3     1000022        -3         3   # BR(~chi_20 -> ~chi_10 sb      s)
     1.48916114E-01    3     1000022        -5         5   # BR(~chi_20 -> ~chi_10 bb      b)
     3.48241784E-02    3     1000022       -11        11   # BR(~chi_20 -> ~chi_10 e+      e-)
     3.48241784E-02    3     1000022       -13        13   # BR(~chi_20 -> ~chi_10 mu+     mu-)
     3.48233594E-02    3     1000022       -15        15   # BR(~chi_20 -> ~chi_10 tau+    tau-)
     6.96368167E-02    3     1000022       -12        12   # BR(~chi_20 -> ~chi_10 nu_eb   nu_e)
     6.96368167E-02    3     1000022       -14        14   # BR(~chi_20 -> ~chi_10 nu_mub  nu_mu)
     6.95968225E-02    3     1000022       -16        16   # BR(~chi_20 -> ~chi_10 nu_taub nu_tau)
#
#         PDG            Width
DECAY   1000025     3.49145179E-03   # neutralino3 decays
#          BR         NDA      ID1       ID2
     1.00000000E+00    2     1000022        23   # BR(~chi_30 -> ~chi_10   Z )
#
#         PDG            Width
DECAY   1000035     2.31395710E+01   # neutralino4 decays
#          BR         NDA      ID1       ID2
     7.77544844E-03    2     1000022        23   # BR(~chi_40 -> ~chi_10   Z )
     2.98833138E-02    2     1000023        23   # BR(~chi_40 -> ~chi_20   Z )
     8.35614846E-02    2     1000025        23   # BR(~chi_40 -> ~chi_30   Z )
     1.18757265E-01    2     1000024       -24   # BR(~chi_40 -> ~chi_1+   W-)
     1.18757265E-01    2    -1000024        24   # BR(~chi_40 -> ~chi_1-   W+)
     3.20212582E-03    2     1000022        25   # BR(~chi_40 -> ~chi_10   h )
     2.91269656E-03    2     1000022        35   # BR(~chi_40 -> ~chi_10   H )
     6.32821777E-03    2     1000022        36   # BR(~chi_40 -> ~chi_10   A )
     9.01508143E-02    2     1000023        25   # BR(~chi_40 -> ~chi_20   h )
     5.59836290E-02    2     1000023        35   # BR(~chi_40 -> ~chi_20   H )
     1.84008735E-02    2     1000023        36   # BR(~chi_40 -> ~chi_20   A )
     2.52243269E-02    2     1000025        25   # BR(~chi_40 -> ~chi_30   h )
     1.56141876E-02    2     1000025        35   # BR(~chi_40 -> ~chi_30   H )
     5.00799189E-02    2     1000025        36   # BR(~chi_40 -> ~chi_30   A )
     7.38322148E-02    2     1000024       -37   # BR(~chi_40 -> ~chi_1+   H-)
     7.38322148E-02    2    -1000024        37   # BR(~chi_40 -> ~chi_1-   H+)
     4.38608768E-08    2     2000002        -2   # BR(~chi_40 -> ~u_R      ub)
     4.38608768E-08    2    -2000002         2   # BR(~chi_40 -> ~u_R*     u )
     4.38596367E-08    2     2000004        -4   # BR(~chi_40 -> ~c_R      cb)
     4.38596367E-08    2    -2000004         4   # BR(~chi_40 -> ~c_R*     c )
     5.60194063E-02    2     1000015       -15   # BR(~chi_40 -> ~tau_1-   tau+)
     5.60194063E-02    2    -1000015        15   # BR(~chi_40 -> ~tau_1+   tau-)
     5.68325077E-02    2     1000016       -16   # BR(~chi_40 -> ~nu_tau1  nu_taub)
     5.68325077E-02    2    -1000016        16   # BR(~chi_40 -> ~nu_tau1* nu_tau )
#
#         PDG            Width
DECAY        25     4.65943986E-03   # h decays
#          BR         NDA      ID1       ID2
     6.12198667E-01    2           5        -5   # BR(h -> b       bb     )
     6.44782730E-02    2         -15        15   # BR(h -> tau+    tau-   )
     2.28919252E-04    2         -13        13   # BR(h -> mu+     mu-    )
     2.47444330E-04    2           3        -3   # BR(h -> s       sb     )
     1.87482191E-02    2           4        -4   # BR(h -> c       cb     )
     6.98559628E-02    2          21        21   # BR(h -> g       g      )
     2.10327981E-03    2          22        22   # BR(h -> gam     gam    )
     1.48333965E-03    2          22        23   # BR(h -> Z       gam    )
     2.04694354E-01    2          24       -24   # BR(h -> W+      W-     )
     2.59615418E-02    2          23        23   # BR(h -> Z       Z      )
#
#         PDG            Width
DECAY        35     8.42290059E+00   # H decays
#          BR         NDA      ID1       ID2
     8.75170130E-01    2           5        -5   # BR(H -> b       bb     )
     1.19694316E-01    2         -15        15   # BR(H -> tau+    tau-   )
     4.42423394E-04    2         -13        13   # BR(H -> mu+     mu-    )
     3.24690962E-04    2           3        -3   # BR(H -> s       sb     )
     4.50322524E-08    2           4        -4   # BR(H -> c       cb     )
     2.69375971E-03    2           6        -6   # BR(H -> t       tb     )
     2.31581877E-04    2          21        21   # BR(H -> g       g      )
     1.20685268E-07    2          22        22   # BR(H -> gam     gam    )
     6.60651630E-08    2          23        22   # BR(H -> Z       gam    )
     3.80451675E-05    2          24       -24   # BR(H -> W+      W-     )
     1.83467996E-05    2          23        23   # BR(H -> Z       Z      )
     1.47938219E-04    2          25        25   # BR(H -> h       h      )
     1.23853574E-03    2     1000022   1000022   # BR(H -> ~chi_10 ~chi_10)
#
#         PDG            Width
DECAY        36     8.45673310E+00   # A decays
#          BR         NDA      ID1       ID2
     8.71877487E-01    2           5        -5   # BR(A -> b       bb     )
     1.19234333E-01    2         -15        15   # BR(A -> tau+    tau-   )
     4.40704303E-04    2         -13        13   # BR(A -> mu+     mu-    )
     3.23461171E-04    2           3        -3   # BR(A -> s       sb     )
     3.91864622E-08    2           4        -4   # BR(A -> c       cb     )
     3.43064820E-03    2           6        -6   # BR(A -> t       tb     )
     2.71320622E-04    2          21        21   # BR(A -> g       g      )
     8.15329789E-08    2          22        22   # BR(A -> gam     gam    )
     6.61124078E-08    2          23        22   # BR(A -> Z       gam    )
     3.41620047E-05    2          23        25   # BR(A -> Z       h      )
     4.38769674E-03    2     1000022   1000022   # BR(A -> ~chi_10 ~chi_10)
#
#         PDG            Width
DECAY        37     7.62081273E+00   # H+ decays
#          BR         NDA      ID1       ID2
     1.56327579E-03    2           4        -5   # BR(H+ -> c       bb     )
     1.33683914E-01    2         -15        16   # BR(H+ -> tau+    nu_tau )
     4.94111479E-04    2         -13        14   # BR(H+ -> mu+     nu_mu  )
     1.56323319E-05    2           2        -5   # BR(H+ -> u       bb     )
     1.79944624E-05    2           2        -3   # BR(H+ -> u       sb     )
     3.54225231E-04    2           4        -3   # BR(H+ -> c       sb     )
     8.63830732E-01    2           6        -5   # BR(H+ -> t       bb     )
     4.01132423E-05    2          24        25   # BR(H+ -> W+      h      )
     1.19790557E-09    2          24        36   # BR(H+ -> W+      A      )
