#
#                              ======================
#                              | THE SUSYHIT OUTPUT |
#                              ======================
#
#
#              ------------------------------------------------------
#              |     This is the output of the SUSY-HIT package     |
#              |  created by A.Djouadi, M.Muehlleitner and M.Spira. |
#              |  In case of problems with SUSY-HIT email to        |
#              |           margarete.muehlleitner@cern.ch           |
#              |           michael.spira@psi.ch                     |
#              |           abdelhak.djouadi@cern.ch                 |
#              ------------------------------------------------------
#
#              ------------------------------------------------------
#              |  SUSY Les Houches Accord - MSSM Spectrum + Decays  |
#              |              based on the decay programs           |
#              |                                                    |
#              |                     SDECAY 1.3b                    |
#              |                                                    |
#              |  Authors: M.Muhlleitner, A.Djouadi and Y.Mambrini  |
#              |  Ref.:    Comput.Phys.Commun.168(2005)46           |
#              |           [hep-ph/0311167]                         |
#              |                                                    |
#              |                     HDECAY 3.4                     |
#              |                                                    |
#              |  By: A.Djouadi,J.Kalinowski,M.Muhlleitner,M.Spira  |
#              |  Ref.:    Comput.Phys.Commun.108(1998)56           |
#              |           [hep-ph/9704448]                         |
#              |                                                    |
#              |                                                    |
#              |  If not stated otherwise all DRbar couplings and   |
#              |  soft SUSY breaking masses are given at the scale  |
#              |  Q=  0.26994460E+04
#              |                                                    |
#              ------------------------------------------------------
#
#
BLOCK DCINFO  # Decay Program information
     1   SDECAY/HDECAY # decay calculator
     2   1.3b  /3.4    # version number
#
BLOCK SPINFO  # Spectrum calculator information
     1     SOFTSUSY    # spectrum calculator               
     2     3.4.0       # version number                    
#
BLOCK MODSEL  # Model selection
     1     0   #  nonUniversal                                     
#
BLOCK SMINPUTS  # Standard Model inputs
         1     1.27908970E+02   # alpha_em^-1(M_Z)^MSbar
         2     1.16637870E-05   # G_F [GeV^-2]
         3     1.18400000E-01   # alpha_S(M_Z)^MSbar
         4     9.11876000E+01   # M_Z pole mass
         5     4.18000000E+00   # mb(mb)^MSbar
         6     1.73200000E+02   # mt pole mass
         7     1.77700000E+00   # mtau pole mass
#
BLOCK MINPAR  # Input parameters - minimal models
         3     1.89800000E+01   # tanb                
#
BLOCK EXTPAR  # Input parameters - non-minimal models
         0    -1.00000000E+00   # Set                 
         1     6.25100000E+01   # M_1(MX)             
         2     1.97373000E+03   # M_2(MX)             
         3     1.31135000E+03   # M_3(MX)             
        11     4.14587000E+03   # At(MX)              
        12    -3.33621000E+03   # Ab(MX)              
        13     6.62300000E+02   # Atau(MX)            
        23     1.19800000E+02   # mu(MX)              
        26     3.68233000E+03   # mA(pole)            
        31     3.71566000E+03   # meL(MX)             
        32     3.71566000E+03   # mmuL(MX)            
        33     2.26305000E+03   # mtauL(MX)           
        34     3.81420000E+03   # meR(MX)             
        35     3.81420000E+03   # mmuR(MX)            
        36     2.10242000E+03   # mtauR(MX)           
        41     1.82807000E+03   # mqL1(MX)            
        42     1.82807000E+03   # mqL2(MX)            
        43     3.49340000E+03   # mqL3(MX)            
        44     3.77598000E+03   # muR(MX)             
        45     3.77598000E+03   # mcR(MX)             
        46     2.08670000E+03   # mtR(MX)             
        47     2.60932000E+03   # mdR(MX)             
        48     2.60932000E+03   # msR(MX)             
        49     3.01655000E+03   # mbR(MX)             
#
BLOCK MASS  # Mass Spectrum
# PDG code           mass       particle
        24     8.04046263E+01   # W+
        25     1.27579847E+02   # h
        35     3.68234851E+03   # H
        36     3.68232999E+03   # A
        37     3.68348704E+03   # H+
         5     4.81876030E+00   # b-quark pole mass calculated from mb(mb)_Msbar
   1000001     1.90241492E+03   # ~d_L
   2000001     2.64910730E+03   # ~d_R
   1000002     1.90093357E+03   # ~u_L
   2000002     3.81499768E+03   # ~u_R
   1000003     1.90241492E+03   # ~s_L
   2000003     2.64910730E+03   # ~s_R
   1000004     1.90093357E+03   # ~c_L
   2000004     3.81499768E+03   # ~c_R
   1000005     3.05158332E+03   # ~b_1
   2000005     3.49971510E+03   # ~b_2
   1000006     2.06884464E+03   # ~t_1
   2000006     3.50815911E+03   # ~t_2
   1000011     3.72623629E+03   # ~e_L
   2000011     3.81742434E+03   # ~e_R
   1000012     3.72507448E+03   # ~nu_eL
   1000013     3.72623629E+03   # ~mu_L
   2000013     3.81742434E+03   # ~mu_R
   1000014     3.72507448E+03   # ~nu_muL
   1000015     2.10189202E+03   # ~tau_1
   2000015     2.27924580E+03   # ~tau_2
   1000016     2.27756634E+03   # ~nu_tauL
   1000021     1.51844581E+03   # ~g
   1000022     5.20193326E+01   # ~chi_10
   1000023    -1.31491788E+02   # ~chi_20
   1000025     1.38919742E+02   # ~chi_30
   1000035     2.00397652E+03   # ~chi_40
   1000024     1.25407683E+02   # ~chi_1+
   1000037     2.00414093E+03   # ~chi_2+
#
BLOCK NMIX  # Neutralino Mixing Matrix
  1  1     8.98725216E-01   # N_11
  1  2    -8.06827128E-03   # N_12
  1  3     3.98589794E-01   # N_13
  1  4    -1.82630954E-01   # N_14
  2  1    -1.56116043E-01   # N_21
  2  2     2.47499825E-02   # N_22
  2  3     6.80389095E-01   # N_23
  2  4     7.15601774E-01   # N_24
  3  1    -4.09780218E-01   # N_31
  3  2    -2.94881205E-02   # N_32
  3  3     6.14960552E-01   # N_33
  3  4    -6.73078110E-01   # N_34
  4  1    -9.69370459E-04   # N_41
  4  2     9.99226097E-01   # N_42
  4  3     4.51383651E-03   # N_43
  4  4    -3.90626866E-02   # N_44
#
BLOCK UMIX  # Chargino Mixing Matrix U
  1  1    -6.38746996E-03   # U_11
  1  2     9.99979600E-01   # U_12
  2  1    -9.99979600E-01   # U_21
  2  2    -6.38746996E-03   # U_22
#
BLOCK VMIX  # Chargino Mixing Matrix V
  1  1    -5.52798803E-02   # V_11
  1  2     9.98470898E-01   # V_12
  2  1    -9.98470898E-01   # V_21
  2  2    -5.52798803E-02   # V_22
#
BLOCK STOPMIX  # Stop Mixing Matrix
  1  1    -7.07316443E-02   # cos(theta_t)
  1  2     9.97495381E-01   # sin(theta_t)
  2  1    -9.97495381E-01   # -sin(theta_t)
  2  2    -7.07316443E-02   # cos(theta_t)
#
BLOCK SBOTMIX  # Sbottom Mixing Matrix
  1  1     4.45609843E-03   # cos(theta_b)
  1  2     9.99990072E-01   # sin(theta_b)
  2  1    -9.99990072E-01   # -sin(theta_b)
  2  2     4.45609843E-03   # cos(theta_b)
#
BLOCK STAUMIX  # Stau Mixing Matrix
  1  1     3.68165291E-03   # cos(theta_tau)
  1  2     9.99993223E-01   # sin(theta_tau)
  2  1    -9.99993223E-01   # -sin(theta_tau)
  2  2     3.68165291E-03   # cos(theta_tau)
#
BLOCK ALPHA  # Higgs mixing
          -5.51540515E-02   # Mixing angle in the neutral Higgs boson sector
#
BLOCK HMIX Q=  2.69944600E+03  # DRbar Higgs Parameters
         1     1.21871475E+02   # mu(Q)MSSM           
         2     1.81456346E+01   # tan                 
         3     2.41947788E+02   # higgs               
         4     1.35797818E+07   # mA^2(Q)MSSM         
#
BLOCK GAUGE Q=  2.69944600E+03  # The gauge couplings
     1     3.64881270E-01   # gprime(Q) DRbar
     2     6.39313551E-01   # g(Q) DRbar
     3     1.02564861E+00   # g3(Q) DRbar
#
BLOCK AU Q=  2.69944600E+03  # The trilinear couplings
  1  1     0.00000000E+00   # A_u(Q) DRbar
  2  2     0.00000000E+00   # A_c(Q) DRbar
  3  3     4.14587001E+03   # A_t(Q) DRbar
#
BLOCK AD Q=  2.69944600E+03  # The trilinear couplings
  1  1     0.00000000E+00   # A_d(Q) DRbar
  2  2     0.00000000E+00   # A_s(Q) DRbar
  3  3    -3.33621000E+03   # A_b(Q) DRbar
#
BLOCK AE Q=  2.69944600E+03  # The trilinear couplings
  1  1     0.00000000E+00   # A_e(Q) DRbar
  2  2     0.00000000E+00   # A_mu(Q) DRbar
  3  3     6.62300000E+02   # A_tau(Q) DRbar
#
BLOCK Yu Q=  2.69944600E+03  # The Yukawa couplings
  1  1     0.00000000E+00   # y_u(Q) DRbar
  2  2     0.00000000E+00   # y_c(Q) DRbar
  3  3     8.45226211E-01   # y_t(Q) DRbar
#
BLOCK Yd Q=  2.69944600E+03  # The Yukawa couplings
  1  1     0.00000000E+00   # y_d(Q) DRbar
  2  2     0.00000000E+00   # y_s(Q) DRbar
  3  3     2.40507847E-01   # y_b(Q) DRbar
#
BLOCK Ye Q=  2.69944600E+03  # The Yukawa couplings
  1  1     0.00000000E+00   # y_e(Q) DRbar
  2  2     0.00000000E+00   # y_mu(Q) DRbar
  3  3     1.86695559E-01   # y_tau(Q) DRbar
#
BLOCK MSOFT Q=  2.69944600E+03  # The soft SUSY breaking masses at the scale Q
         1     6.25100000E+01   # M_1(Q)              
         2     1.97373000E+03   # M_2(Q)              
         3     1.31135000E+03   # M_3(Q)              
        21     1.34773775E+07   # mH1^2(Q)            
        22     1.06065537E+05   # mH2^2(Q)            
        31     3.71566000E+03   # meL(Q)              
        32     3.71566000E+03   # mmuL(Q)             
        33     2.26305000E+03   # mtauL(Q)            
        34     3.81420000E+03   # meR(Q)              
        35     3.81420000E+03   # mmuR(Q)             
        36     2.10242000E+03   # mtauR(Q)            
        41     1.82807000E+03   # mqL1(Q)             
        42     1.82807000E+03   # mqL2(Q)             
        43     3.49340000E+03   # mqL3(Q)             
        44     3.77598000E+03   # muR(Q)              
        45     3.77598000E+03   # mcR(Q)              
        46     2.08670000E+03   # mtR(Q)              
        47     2.60932000E+03   # mdR(Q)              
        48     2.60932000E+03   # msR(Q)              
        49     3.01655000E+03   # mbR(Q)              
#
Block HiggsBoundsInputHiggsCouplingsFermions
# ScalarNormEffCoupSq PseudoSNormEffCoupSq NP   IP1 IP2 IP2
    1.00363485E+00    0.00000000E+00        3  25   5   5  # h0-b-b eff. coupling^2, normalised to SM
    3.29260420E+02    0.00000000E+00        3  35   5   5  # H0-b-b eff. coupling^2, normalised to SM
    0.00000000E+00    3.29264055E+02        3  36   5   5  # A0-b-b eff. coupling^2, normalised to SM
#
    9.99988961E-01    0.00000000E+00        3  25   6   6  # h0-t-t eff. coupling^2, normalised to SM
    3.04811545E-03    0.00000000E+00        3  35   6   6  # H0-t-t eff. coupling^2, normalised to SM
    0.00000000E+00    3.03707612E-03        3  36   6   6  # A0-t-t eff. coupling^2, normalised to SM
#
    1.00363485E+00    0.00000000E+00        3  25  15  15  # h0-tau-tau eff. coupling^2, normalised to SM
    3.29260420E+02    0.00000000E+00        3  35  15  15  # H0-tau-tau eff. coupling^2, normalised to SM
    0.00000000E+00    3.29264055E+02        3  36  15  15  # A0-tau-tau eff. coupling^2, normalised to SM
#
Block HiggsBoundsInputHiggsCouplingsBosons
    9.99999990E-01        3  25  24  24  # h0-W-W eff. coupling^2, normalised to SM
    1.00134480E-08        3  35  24  24  # H0-W-W eff. coupling^2, normalised to SM
    0.00000000E+00        3  36  24  24  # A0-W-W eff. coupling^2, normalised to SM
#
    9.99999990E-01        3  25  23  23  # h0-Z-Z eff. coupling^2, normalised to SM
    1.00134480E-08        3  35  23  23  # H0-Z-Z eff. coupling^2, normalised to SM
    0.00000000E+00        3  36  23  23  # A0-Z-Z eff. coupling^2, normalised to SM
#
    8.87253513E-01        3  25  21  21  # h0-g-g eff. coupling^2, normalised to SM
    9.70900619E-16        3  35  21  21  # H0-g-g eff. coupling^2, normalised to SM
    2.00186505E-13        3  36  21  21  # A0-g-g eff. coupling^2, normalised to SM
#
    0.00000000E+00        3  25  25  23  # h0-h0-Z eff. coupling^2, normalised to SM
    0.00000000E+00        3  35  25  23  # H0-h0-Z eff. coupling^2, normalised to SM
    1.00134480E-08        3  36  25  23  # A0-h0-Z eff. coupling^2, normalised to SM
    0.00000000E+00        3  35  35  23  # H0-H0-Z eff. coupling^2, normalised to SM
    9.99999990E-01        3  36  35  23  # A0-H0-Z eff. coupling^2, normalised to SM
    0.00000000E+00        3  36  36  23  # A0-A0-Z eff. coupling^2, normalised to SM
#
    0.00000000E+00        4  25  21  21  23  # h0-g-g-Z eff. coupling^2, normalised to SM
    0.00000000E+00        4  35  21  21  23  # H0-g-g-Z eff. coupling^2, normalised to SM
    0.00000000E+00        4  36  21  21  23  # A0-g-g-Z eff. coupling^2, normalised to SM
#
#
#
#                             =================
#                             |The decay table|
#                             =================
#
# - The QCD corrections to the decays gluino -> squark  + quark
#                                     squark -> gaugino + quark_prime
#                                     squark -> squark_prime + Higgs
#                                     squark -> gluino  + quark
#   are included.
#
# - The multi-body decays for the inos, stops and sbottoms are included.
#
# - The loop induced decays for the gluino, neutralinos and stops
#   are included.
#
# - The SUSY decays of the top quark are included.
#
#
#         PDG            Width
DECAY         6     1.43879980E+00   # top decays
#          BR         NDA      ID1       ID2
     1.00000000E+00    2           5        24   # BR(t ->  b    W+)
#
#         PDG            Width
DECAY   1000021     1.54224922E-02   # gluino decays
#          BR         NDA      ID1       ID2
     9.40737311E-04    2     1000022        21   # BR(~g -> ~chi_10 g)
     6.52403043E-03    2     1000023        21   # BR(~g -> ~chi_20 g)
     4.48981423E-03    2     1000025        21   # BR(~g -> ~chi_30 g)
#           BR         NDA      ID1       ID2       ID3
     9.98576691E-03    3     1000022         1        -1   # BR(~g -> ~chi_10 d  db)
     5.42519547E-04    3     1000023         1        -1   # BR(~g -> ~chi_20 d  db)
     1.30236490E-03    3     1000025         1        -1   # BR(~g -> ~chi_30 d  db)
     8.14287793E-03    3     1000022         2        -2   # BR(~g -> ~chi_10 u  ub)
     7.62645203E-05    3     1000023         2        -2   # BR(~g -> ~chi_20 u  ub)
     2.90214910E-03    3     1000025         2        -2   # BR(~g -> ~chi_30 u  ub)
     9.98576691E-03    3     1000022         3        -3   # BR(~g -> ~chi_10 s  sb)
     5.42519547E-04    3     1000023         3        -3   # BR(~g -> ~chi_20 s  sb)
     1.30236490E-03    3     1000025         3        -3   # BR(~g -> ~chi_30 s  sb)
     8.14287793E-03    3     1000022         4        -4   # BR(~g -> ~chi_10 c  cb)
     7.62645203E-05    3     1000023         4        -4   # BR(~g -> ~chi_20 c  cb)
     2.90214910E-03    3     1000025         4        -4   # BR(~g -> ~chi_30 c  cb)
     4.07183544E-03    3     1000022         5        -5   # BR(~g -> ~chi_10 b  bb)
     4.88314606E-03    3     1000023         5        -5   # BR(~g -> ~chi_20 b  bb)
     4.39516973E-03    3     1000025         5        -5   # BR(~g -> ~chi_30 b  bb)
     4.36856072E-02    3     1000022         6        -6   # BR(~g -> ~chi_10 t  tb)
     2.02434161E-01    3     1000023         6        -6   # BR(~g -> ~chi_20 t  tb)
     2.25403557E-01    3     1000025         6        -6   # BR(~g -> ~chi_30 t  tb)
     5.50594683E-04    3     1000024         1        -2   # BR(~g -> ~chi_1+ d  ub)
     5.50594683E-04    3    -1000024         2        -1   # BR(~g -> ~chi_1- u  db)
     5.50594683E-04    3     1000024         3        -4   # BR(~g -> ~chi_1+ s  cb)
     5.50594683E-04    3    -1000024         4        -3   # BR(~g -> ~chi_1- c  sb)
     2.27532839E-01    3     1000024         5        -6   # BR(~g -> ~chi_1+ b  tb)
     2.27532839E-01    3    -1000024         6        -5   # BR(~g -> ~chi_1- t  bb)
#
#         PDG            Width
DECAY   1000006     8.43293099E+01   # stop1 decays
#          BR         NDA      ID1       ID2
     5.45198028E-02    2     1000022         6   # BR(~t_1 -> ~chi_10 t )
     1.73959694E-01    2     1000023         6   # BR(~t_1 -> ~chi_20 t )
     1.68413781E-01    2     1000025         6   # BR(~t_1 -> ~chi_30 t )
     3.41441316E-01    2     1000024         5   # BR(~t_1 -> ~chi_1+ b )
     1.55369295E-05    2     1000037         5   # BR(~t_1 -> ~chi_2+ b )
     2.61649869E-01    2     1000021         6   # BR(~t_1 -> ~g      t )
#
#         PDG            Width
DECAY   2000006     2.44407207E+02   # stop2 decays
#          BR         NDA      ID1       ID2
     9.90338258E-03    2     1000022         6   # BR(~t_2 -> ~chi_10 t )
     1.04968328E-01    2     1000023         6   # BR(~t_2 -> ~chi_20 t )
     9.01637565E-02    2     1000025         6   # BR(~t_2 -> ~chi_30 t )
     2.62082984E-02    2     1000035         6   # BR(~t_2 -> ~chi_40 t )
     1.89588685E-02    2     1000024         5   # BR(~t_2 -> ~chi_1+ b )
     5.19941430E-02    2     1000037         5   # BR(~t_2 -> ~chi_2+ b )
     5.29031083E-01    2     1000021         6   # BR(~t_2 -> ~g      t )
     9.01715855E-02    2     1000006        25   # BR(~t_2 -> ~t_1    h )
     7.85703881E-02    2     1000006        23   # BR(~t_2 -> ~t_1    Z )
     3.01664203E-05    2     1000005        24   # BR(~t_2 -> ~b_1    W+)
#
#         PDG            Width
DECAY   1000005     1.05182735E+02   # sbottom1 decays
#          BR         NDA      ID1       ID2
     1.92008727E-02    2     1000022         5   # BR(~b_1 -> ~chi_10 b )
     1.57689359E-02    2     1000023         5   # BR(~b_1 -> ~chi_20 b )
     1.53608726E-02    2     1000025         5   # BR(~b_1 -> ~chi_30 b )
     1.65347719E-07    2     1000035         5   # BR(~b_1 -> ~chi_40 b )
     3.30651883E-02    2    -1000024         6   # BR(~b_1 -> ~chi_1- t )
     3.36276520E-07    2    -1000037         6   # BR(~b_1 -> ~chi_2- t )
     9.16600993E-01    2     1000021         5   # BR(~b_1 -> ~g      b )
     2.63560099E-06    2     1000006       -24   # BR(~b_1 -> ~t_1    W-)
#
#         PDG            Width
DECAY   2000005     2.38768762E+02   # sbottom2 decays
#          BR         NDA      ID1       ID2
     4.52936309E-03    2     1000022         5   # BR(~b_2 -> ~chi_10 b )
     7.98403346E-03    2     1000023         5   # BR(~b_2 -> ~chi_20 b )
     6.53388677E-03    2     1000025         5   # BR(~b_2 -> ~chi_30 b )
     2.68883551E-02    2     1000035         5   # BR(~b_2 -> ~chi_40 b )
     2.06127731E-01    2    -1000024         6   # BR(~b_2 -> ~chi_1- t )
     5.41886841E-02    2    -1000037         6   # BR(~b_2 -> ~chi_2- t )
     5.38999638E-01    2     1000021         5   # BR(~b_2 -> ~g      b )
     1.47168380E-05    2     1000005        25   # BR(~b_2 -> ~b_1    h )
     1.49292012E-05    2     1000005        23   # BR(~b_2 -> ~b_1    Z )
     1.54718662E-01    2     1000006       -24   # BR(~b_2 -> ~t_1    W-)
#
#         PDG            Width
DECAY   1000002     1.85743791E+01   # sup_L decays
#          BR         NDA      ID1       ID2
     1.04816193E-02    2     1000022         2   # BR(~u_L -> ~chi_10 u)
     9.61098959E-06    2     1000023         2   # BR(~u_L -> ~chi_20 u)
     4.52283808E-03    2     1000025         2   # BR(~u_L -> ~chi_30 u)
     2.39868414E-03    2     1000024         1   # BR(~u_L -> ~chi_1+ d)
     9.82587248E-01    2     1000021         2   # BR(~u_L -> ~g      u)
#
#         PDG            Width
DECAY   2000002     2.06710278E+02   # sup_R decays
#          BR         NDA      ID1       ID2
     3.39113969E-02    2     1000022         2   # BR(~u_R -> ~chi_10 u)
     1.02148106E-03    2     1000023         2   # BR(~u_R -> ~chi_20 u)
     7.03602509E-03    2     1000025         2   # BR(~u_R -> ~chi_30 u)
     2.07766386E-08    2     1000035         2   # BR(~u_R -> ~chi_40 u)
     9.58031076E-01    2     1000021         2   # BR(~u_R -> ~g      u)
#
#         PDG            Width
DECAY   1000001     1.86402379E+01   # sdown_L decays
#          BR         NDA      ID1       ID2
     1.26262643E-02    2     1000022         1   # BR(~d_L -> ~chi_10 d)
     1.15953560E-03    2     1000023         1   # BR(~d_L -> ~chi_20 d)
     9.17913363E-04    2     1000025         1   # BR(~d_L -> ~chi_30 d)
     3.19382956E-05    2    -1000024         2   # BR(~d_L -> ~chi_1- u)
     9.85264348E-01    2     1000021         1   # BR(~d_L -> ~g      d)
#
#         PDG            Width
DECAY   2000001     8.90303838E+01   # sdown_R decays
#          BR         NDA      ID1       ID2
     1.35702437E-02    2     1000022         1   # BR(~d_R -> ~chi_10 d)
     4.08019208E-04    2     1000023         1   # BR(~d_R -> ~chi_20 d)
     2.80970978E-03    2     1000025         1   # BR(~d_R -> ~chi_30 d)
     2.95030538E-09    2     1000035         1   # BR(~d_R -> ~chi_40 d)
     9.83212024E-01    2     1000021         1   # BR(~d_R -> ~g      d)
#
#         PDG            Width
DECAY   1000004     1.42370657E+01   # scharm_L decays
#          BR         NDA      ID1       ID2
     1.43854571E-02    2     1000022         4   # BR(~c_L -> ~chi_10 c)
     1.31768369E-05    2     1000023         4   # BR(~c_L -> ~chi_20 c)
     6.20031491E-03    2     1000025         4   # BR(~c_L -> ~chi_30 c)
     3.28889488E-03    2     1000024         3   # BR(~c_L -> ~chi_1+ s)
     9.76112156E-01    2     1000021         4   # BR(~c_L -> ~g      c)
#
#         PDG            Width
DECAY   2000004     1.59767766E+02   # scharm_R decays
#          BR         NDA      ID1       ID2
     4.53918778E-02    2     1000022         4   # BR(~c_R -> ~chi_10 c)
     1.36693667E-03    2     1000023         4   # BR(~c_R -> ~chi_20 c)
     9.41532421E-03    2     1000025         4   # BR(~c_R -> ~chi_30 c)
     2.76967018E-08    2     1000035         4   # BR(~c_R -> ~chi_40 c)
     9.43825834E-01    2     1000021         4   # BR(~c_R -> ~g      c)
#
#         PDG            Width
DECAY   1000003     1.42732955E+01   # sstrange_L decays
#          BR         NDA      ID1       ID2
     1.73458572E-02    2     1000022         3   # BR(~s_L -> ~chi_10 s)
     1.59130389E-03    2     1000023         3   # BR(~s_L -> ~chi_20 s)
     1.25959349E-03    2     1000025         3   # BR(~s_L -> ~chi_30 s)
     4.38342642E-05    2    -1000024         4   # BR(~s_L -> ~chi_1- c)
     9.79759411E-01    2     1000021         3   # BR(~s_L -> ~g      s)
#
#         PDG            Width
DECAY   2000003     6.82104680E+01   # sstrange_R decays
#          BR         NDA      ID1       ID2
     1.84496512E-02    2     1000022         3   # BR(~s_R -> ~chi_10 s)
     5.54398094E-04    2     1000023         3   # BR(~s_R -> ~chi_20 s)
     3.81750296E-03    2     1000025         3   # BR(~s_R -> ~chi_30 s)
     3.93032021E-09    2     1000035         3   # BR(~s_R -> ~chi_40 s)
     9.77178444E-01    2     1000021         3   # BR(~s_R -> ~g      s)
#
#         PDG            Width
DECAY   1000011     2.79089789E+01   # selectron_L decays
#          BR         NDA      ID1       ID2
     1.38306694E-01    2     1000022        11   # BR(~e_L -> ~chi_10 e-)
     2.24228191E-03    2     1000023        11   # BR(~e_L -> ~chi_20 e-)
     3.75461009E-02    2     1000025        11   # BR(~e_L -> ~chi_30 e-)
     2.73500511E-01    2     1000035        11   # BR(~e_L -> ~chi_40 e-)
     4.41934349E-05    2    -1000024        12   # BR(~e_L -> ~chi_1- nu_e)
     5.48360219E-01    2    -1000037        12   # BR(~e_L -> ~chi_2- nu_e)
#
#         PDG            Width
DECAY   2000011     2.02062162E+01   # selectron_R decays
#          BR         NDA      ID1       ID2
     8.08055656E-01    2     1000022        11   # BR(~e_R -> ~chi_10 e-)
     2.43339509E-02    2     1000023        11   # BR(~e_R -> ~chi_20 e-)
     1.67609899E-01    2     1000025        11   # BR(~e_R -> ~chi_30 e-)
     4.93527857E-07    2     1000035        11   # BR(~e_R -> ~chi_40 e-)
#
#         PDG            Width
DECAY   1000013     2.79089789E+01   # smuon_L decays
#          BR         NDA      ID1       ID2
     1.38306694E-01    2     1000022        13   # BR(~mu_L -> ~chi_10 mu-)
     2.24228191E-03    2     1000023        13   # BR(~mu_L -> ~chi_20 mu-)
     3.75461009E-02    2     1000025        13   # BR(~mu_L -> ~chi_30 mu-)
     2.73500510E-01    2     1000035        13   # BR(~mu_L -> ~chi_40 mu-)
     4.41934350E-05    2    -1000024        14   # BR(~mu_L -> ~chi_1- nu_mu)
     5.48360220E-01    2    -1000037        14   # BR(~mu_L -> ~chi_2- nu_mu)
#
#         PDG            Width
DECAY   2000013     2.02062162E+01   # smuon_R decays
#          BR         NDA      ID1       ID2
     8.08055656E-01    2     1000022        13   # BR(~mu_R -> ~chi_10 mu-)
     2.43339509E-02    2     1000023        13   # BR(~mu_R -> ~chi_20 mu-)
     1.67609899E-01    2     1000025        13   # BR(~mu_R -> ~chi_30 mu-)
     4.93527856E-07    2     1000035        13   # BR(~mu_R -> ~chi_40 mu-)
#
#         PDG            Width
DECAY   1000015     1.39995817E+01   # stau_1 decays
#          BR         NDA      ID1       ID2
     6.58512636E-01    2     1000022        15   # BR(~tau_1 -> ~chi_10  tau-)
     6.69028181E-02    2     1000023        15   # BR(~tau_1 -> ~chi_20  tau-)
     1.71203123E-01    2     1000025        15   # BR(~tau_1 -> ~chi_30  tau-)
     2.23592062E-08    2     1000035        15   # BR(~tau_1 -> ~chi_40  tau-)
     1.03381366E-01    2    -1000024        16   # BR(~tau_1 -> ~chi_1-  nu_tau)
     3.32406760E-08    2    -1000037        16   # BR(~tau_1 -> ~chi_2-  nu_tau)
#
#         PDG            Width
DECAY   2000015     6.03677304E+00   # stau_2 decays
#          BR         NDA      ID1       ID2
     4.31466556E-01    2     1000022        15   # BR(~tau_2 -> ~chi_10  tau-)
     1.27072584E-01    2     1000023        15   # BR(~tau_2 -> ~chi_20  tau-)
     2.04523185E-01    2     1000025        15   # BR(~tau_2 -> ~chi_30  tau-)
     7.88594971E-02    2     1000035        15   # BR(~tau_2 -> ~chi_40  tau-)
     8.61148779E-05    2    -1000024        16   # BR(~tau_2 -> ~chi_1-  nu_tau)
     1.57954905E-01    2    -1000037        16   # BR(~tau_2 -> ~chi_2-  nu_tau)
     1.89779546E-05    2     1000015        25   # BR(~tau_2 -> ~tau_1   h)
     1.81797464E-05    2     1000015        23   # BR(~tau_2 -> ~tau_1   Z)
#
#         PDG            Width
DECAY   1000012     2.79177934E+01   # snu_eL decays
#          BR         NDA      ID1       ID2
     1.47196600E-01    2     1000022        12   # BR(~nu_eL -> ~chi_10 nu_e)
     7.01417413E-03    2     1000023        12   # BR(~nu_eL -> ~chi_20 nu_e)
     2.25990461E-02    2     1000025        12   # BR(~nu_eL -> ~chi_30 nu_e)
     2.73795864E-01    2     1000035        12   # BR(~nu_eL -> ~chi_40 nu_e)
     3.30796585E-03    2     1000024        11   # BR(~nu_eL -> ~chi_1+ e-)
     5.46086350E-01    2     1000037        11   # BR(~nu_eL -> ~chi_2+ e-)
#
#         PDG            Width
DECAY   1000014     2.79177934E+01   # snu_muL decays
#          BR         NDA      ID1       ID2
     1.47196600E-01    2     1000022        14   # BR(~nu_muL -> ~chi_10 nu_mu)
     7.01417414E-03    2     1000023        14   # BR(~nu_muL -> ~chi_20 nu_mu)
     2.25990462E-02    2     1000025        14   # BR(~nu_muL -> ~chi_30 nu_mu)
     2.73795864E-01    2     1000035        14   # BR(~nu_muL -> ~chi_40 nu_mu)
     3.30796585E-03    2     1000024        13   # BR(~nu_muL -> ~chi_1+ mu-)
     5.46086350E-01    2     1000037        13   # BR(~nu_muL -> ~chi_2+ mu-)
#
#         PDG            Width
DECAY   1000016     6.05262354E+00   # snu_tauL decays
#          BR         NDA      ID1       ID2
     4.14846522E-01    2     1000022        16   # BR(~nu_tauL -> ~chi_10 nu_tau)
     1.96984942E-02    2     1000023        16   # BR(~nu_tauL -> ~chi_20 nu_tau)
     6.34358802E-02    2     1000025        16   # BR(~nu_tauL -> ~chi_30 nu_tau)
     7.79794175E-02    2     1000035        16   # BR(~nu_tauL -> ~chi_40 nu_tau)
     2.68625273E-01    2     1000024        15   # BR(~nu_tauL -> ~chi_1+ tau-)
     1.55376278E-01    2     1000037        15   # BR(~nu_tauL -> ~chi_2+ tau-)
     3.81354924E-05    2    -1000015       -24   # BR(~nu_tauL -> ~tau_1+ W-)
#
#         PDG            Width
DECAY   1000024     6.31120131E-04   # chargino1+ decays
#           BR         NDA      ID1       ID2       ID3
     3.33414536E-01    3     1000022         2        -1   # BR(~chi_1+ -> ~chi_10 u    db)
     3.33414536E-01    3     1000022         4        -3   # BR(~chi_1+ -> ~chi_10 c    sb)
     1.11136737E-01    3     1000022       -11        12   # BR(~chi_1+ -> ~chi_10 e+   nu_e)
     1.11136737E-01    3     1000022       -13        14   # BR(~chi_1+ -> ~chi_10 mu+  nu_mu)
     1.10897453E-01    3     1000022       -15        16   # BR(~chi_1+ -> ~chi_10 tau+ nu_tau)
#
#         PDG            Width
DECAY   1000037     1.67961751E+01   # chargino2+ decays
#          BR         NDA      ID1       ID2
     1.50937086E-02    2     1000002        -1   # BR(~chi_2+ -> ~u_L     db)
     1.47279385E-02    2    -1000001         2   # BR(~chi_2+ -> ~d_L*    u )
     1.50936046E-02    2     1000004        -3   # BR(~chi_2+ -> ~c_L     sb)
     1.47262669E-02    2    -1000003         4   # BR(~chi_2+ -> ~s_L*     c )
     2.36928776E-01    2     1000024        23   # BR(~chi_2+ -> ~chi_1+  Z )
     1.20687313E-02    2     1000022        24   # BR(~chi_2+ -> ~chi_10  W+)
     2.33435609E-01    2     1000023        24   # BR(~chi_2+ -> ~chi_20  W+)
     2.14820743E-01    2     1000025        24   # BR(~chi_2+ -> ~chi_30  W+)
     2.43104622E-01    2     1000024        25   # BR(~chi_2+ -> ~chi_1+  h )
#
#         PDG            Width
DECAY   1000022     0.00000000E+00   # neutralino1 decays
#
#         PDG            Width
DECAY   1000023     3.86842776E-04   # neutralino2 decays
#          BR         NDA      ID1       ID2
     5.61782112E-04    2     1000022        22   # BR(~chi_20 -> ~chi_10 gam)
#           BR         NDA      ID1       ID2       ID3
     1.17242048E-01    3     1000022        -2         2   # BR(~chi_20 -> ~chi_10 ub      u)
     1.52136819E-01    3     1000022        -1         1   # BR(~chi_20 -> ~chi_10 db      d)
     1.17242048E-01    3     1000022        -4         4   # BR(~chi_20 -> ~chi_10 cb      c)
     1.52136819E-01    3     1000022        -3         3   # BR(~chi_20 -> ~chi_10 sb      s)
     1.46492378E-01    3     1000022        -5         5   # BR(~chi_20 -> ~chi_10 bb      b)
     3.49253741E-02    3     1000022       -11        11   # BR(~chi_20 -> ~chi_10 e+      e-)
     3.49253741E-02    3     1000022       -13        13   # BR(~chi_20 -> ~chi_10 mu+     mu-)
     3.47065238E-02    3     1000022       -15        15   # BR(~chi_20 -> ~chi_10 tau+    tau-)
     6.98581364E-02    3     1000022       -12        12   # BR(~chi_20 -> ~chi_10 nu_eb   nu_e)
     6.98581364E-02    3     1000022       -14        14   # BR(~chi_20 -> ~chi_10 nu_mub  nu_mu)
     6.98687172E-02    3     1000022       -16        16   # BR(~chi_20 -> ~chi_10 nu_taub nu_tau)
     7.93603166E-06    3     1000024        -2         1   # BR(~chi_20 -> ~chi_1+ ub      d)
     7.93603166E-06    3    -1000024        -1         2   # BR(~chi_20 -> ~chi_1- db      u)
     7.93603166E-06    3     1000024        -4         3   # BR(~chi_20 -> ~chi_1+ cb      s)
     7.93603166E-06    3    -1000024        -3         4   # BR(~chi_20 -> ~chi_1- sb      c)
     2.64535576E-06    3     1000024       -12        11   # BR(~chi_20 -> ~chi_1+ nu_eb   e-)
     2.64535576E-06    3    -1000024        12       -11   # BR(~chi_20 -> ~chi_1- nu_e    e+)
     2.64535576E-06    3     1000024       -14        13   # BR(~chi_20 -> ~chi_1+ nu_mub  mu-)
     2.64535576E-06    3    -1000024        14       -13   # BR(~chi_20 -> ~chi_1- nu_mu   mu+)
     1.75947502E-06    3     1000024       -16        15   # BR(~chi_20 -> ~chi_1+ nu_taub tau-)
     1.75947502E-06    3    -1000024        16       -15   # BR(~chi_20 -> ~chi_1- nu_tau  tau+)
#
#         PDG            Width
DECAY   1000025     4.28036266E-04   # neutralino3 decays
#          BR         NDA      ID1       ID2
     3.62342394E-04    2     1000022        22   # BR(~chi_30 -> ~chi_10 gam)
     4.77537394E-07    2     1000023        22   # BR(~chi_30 -> ~chi_20 gam)
#           BR         NDA      ID1       ID2       ID3
     1.16795015E-01    3     1000022        -2         2   # BR(~chi_30 -> ~chi_10 ub      u)
     1.51485243E-01    3     1000022        -1         1   # BR(~chi_30 -> ~chi_10 db      d)
     1.16795015E-01    3     1000022        -4         4   # BR(~chi_30 -> ~chi_10 cb      c)
     1.51485243E-01    3     1000022        -3         3   # BR(~chi_30 -> ~chi_10 sb      s)
     1.48431836E-01    3     1000022        -5         5   # BR(~chi_30 -> ~chi_10 bb      b)
     3.47405215E-02    3     1000022       -11        11   # BR(~chi_30 -> ~chi_10 e+      e-)
     3.47405215E-02    3     1000022       -13        13   # BR(~chi_30 -> ~chi_10 mu+     mu-)
     3.45265446E-02    3     1000022       -15        15   # BR(~chi_30 -> ~chi_10 tau+    tau-)
     6.95751525E-02    3     1000022       -12        12   # BR(~chi_30 -> ~chi_10 nu_eb   nu_e)
     6.95751525E-02    3     1000022       -14        14   # BR(~chi_30 -> ~chi_10 nu_mub  nu_mu)
     6.96048321E-02    3     1000022       -16        16   # BR(~chi_30 -> ~chi_10 nu_taub nu_tau)
     4.74291374E-06    3     1000023        -2         2   # BR(~chi_30 -> ~chi_20 ub      u)
     6.15573749E-06    3     1000023        -1         1   # BR(~chi_30 -> ~chi_20 db      d)
     4.74291374E-06    3     1000023        -4         4   # BR(~chi_30 -> ~chi_20 cb      c)
     6.15573749E-06    3     1000023        -3         3   # BR(~chi_30 -> ~chi_20 sb      s)
     1.41358448E-06    3     1000023       -11        11   # BR(~chi_30 -> ~chi_20 e+      e-)
     1.41358448E-06    3     1000023       -13        13   # BR(~chi_30 -> ~chi_20 mu+     mu-)
     9.54885761E-07    3     1000023       -15        15   # BR(~chi_30 -> ~chi_20 tau+    tau-)
     2.82599909E-06    3     1000023       -12        12   # BR(~chi_30 -> ~chi_20 nu_eb   nu_e)
     2.82599909E-06    3     1000023       -14        14   # BR(~chi_30 -> ~chi_20 nu_mub  nu_mu)
     2.82588813E-06    3     1000023       -16        16   # BR(~chi_30 -> ~chi_20 nu_taub nu_tau)
     3.10811163E-04    3     1000024        -2         1   # BR(~chi_30 -> ~chi_1+ ub      d)
     3.10811163E-04    3    -1000024        -1         2   # BR(~chi_30 -> ~chi_1- db      u)
     3.10811163E-04    3     1000024        -4         3   # BR(~chi_30 -> ~chi_1+ cb      s)
     3.10811163E-04    3    -1000024        -3         4   # BR(~chi_30 -> ~chi_1- sb      c)
     1.03601818E-04    3     1000024       -12        11   # BR(~chi_30 -> ~chi_1+ nu_eb   e-)
     1.03601818E-04    3    -1000024        12       -11   # BR(~chi_30 -> ~chi_1- nu_e    e+)
     1.03601818E-04    3     1000024       -14        13   # BR(~chi_30 -> ~chi_1+ nu_mub  mu-)
     1.03601818E-04    3    -1000024        14       -13   # BR(~chi_30 -> ~chi_1- nu_mu   mu+)
     9.51978148E-05    3     1000024       -16        15   # BR(~chi_30 -> ~chi_1+ nu_taub tau-)
     9.51978148E-05    3    -1000024        16       -15   # BR(~chi_30 -> ~chi_1- nu_tau  tau+)
#
#         PDG            Width
DECAY   1000035     1.68000044E+01   # neutralino4 decays
#          BR         NDA      ID1       ID2
     4.41124115E-03    2     1000022        23   # BR(~chi_40 -> ~chi_10   Z )
     1.47394061E-01    2     1000023        23   # BR(~chi_40 -> ~chi_20   Z )
     8.47015002E-02    2     1000025        23   # BR(~chi_40 -> ~chi_30   Z )
     2.30747679E-01    2     1000024       -24   # BR(~chi_40 -> ~chi_1+   W-)
     2.30747679E-01    2    -1000024        24   # BR(~chi_40 -> ~chi_1-   W+)
     8.55143289E-03    2     1000022        25   # BR(~chi_40 -> ~chi_10   h )
     9.44693969E-02    2     1000023        25   # BR(~chi_40 -> ~chi_20   h )
     1.39525742E-01    2     1000025        25   # BR(~chi_40 -> ~chi_30   h )
     7.53141215E-03    2     1000002        -2   # BR(~chi_40 -> ~u_L      ub)
     7.53141215E-03    2    -1000002         2   # BR(~chi_40 -> ~u_L*     u )
     7.33182139E-03    2     1000001        -1   # BR(~chi_40 -> ~d_L      db)
     7.33182139E-03    2    -1000001         1   # BR(~chi_40 -> ~d_L*     d )
     7.53057917E-03    2     1000004        -4   # BR(~chi_40 -> ~c_L      cb)
     7.53057917E-03    2    -1000004         4   # BR(~chi_40 -> ~c_L*     c )
     7.33182139E-03    2     1000003        -3   # BR(~chi_40 -> ~s _L      sb)
     7.33182139E-03    2    -1000003         3   # BR(~chi_40 -> ~s _L*     s )
#
#         PDG            Width
DECAY        25     6.52400004E-03   # h decays
#          BR         NDA      ID1       ID2
     3.78260671E-01    2           5        -5   # BR(h -> b       bb     )
     4.06277939E-02    2         -15        15   # BR(h -> tau+    tau-   )
     1.43801115E-04    2         -13        13   # BR(h -> mu+     mu-    )
     1.56339668E-04    2           3        -3   # BR(h -> s       sb     )
     1.35137292E-02    2           4        -4   # BR(h -> c       cb     )
     5.19209305E-02    2          21        21   # BR(h -> g       g      )
     1.57816969E-03    2          22        22   # BR(h -> gam     gam    )
     1.19831000E-03    2          22        23   # BR(h -> Z       gam    )
     1.69533166E-01    2          24       -24   # BR(h -> W+      W-     )
     2.20259154E-02    2          23        23   # BR(h -> Z       Z      )
     3.21041174E-01    2     1000022   1000022   # BR(h -> ~chi_10 ~chi_10)
#
#         PDG            Width
DECAY        35     4.38883088E+01   # H decays
#          BR         NDA      ID1       ID2
     3.00296597E-01    2           5        -5   # BR(H -> b       bb     )
     5.69295688E-02    2         -15        15   # BR(H -> tau+    tau-   )
     2.01769485E-04    2         -13        13   # BR(H -> mu+     mu-    )
     1.21747592E-04    2           3        -3   # BR(H -> s       sb     )
     1.02162530E-07    2           4        -4   # BR(H -> c       cb     )
     1.00766601E-02    2           6        -6   # BR(H -> t       tb     )
     1.44037704E-06    2          21        21   # BR(H -> g       g      )
     2.83719232E-08    2          22        22   # BR(H -> gam     gam    )
     3.01320522E-09    2          23        22   # BR(H -> Z       gam    )
     3.66606412E-06    2          24       -24   # BR(H -> W+      W-     )
     1.82976681E-06    2          23        23   # BR(H -> Z       Z      )
     1.29213805E-05    2          25        25   # BR(H -> h       h      )
     2.12665871E-03    2     1000024  -1000024   # BR(H -> ~chi_1+ ~chi_1-)
     1.76000217E-01    2     1000024  -1000037   # BR(H -> ~chi_1+ ~chi_2-)
     1.76000217E-01    2     1000037  -1000024   # BR(H -> ~chi_2+ ~chi_1-)
     2.55752954E-02    2     1000022   1000022   # BR(H -> ~chi_10 ~chi_10)
     4.27935442E-03    2     1000023   1000023   # BR(H -> ~chi_20 ~chi_20)
     8.45854154E-03    2     1000025   1000025   # BR(H -> ~chi_30 ~chi_30)
     3.40134588E-02    2     1000022   1000023   # BR(H -> ~chi_10 ~chi_20)
     1.54001897E-02    2     1000022   1000025   # BR(H -> ~chi_10 ~chi_30)
     2.57703524E-02    2     1000022   1000035   # BR(H -> ~chi_10 ~chi_40)
     1.40380414E-02    2     1000023   1000025   # BR(H -> ~chi_20 ~chi_30)
     9.56847492E-02    2     1000023   1000035   # BR(H -> ~chi_20 ~chi_40)
     5.50065892E-02    2     1000025   1000035   # BR(H -> ~chi_30 ~chi_40)
#
#         PDG            Width
DECAY        36     4.38885840E+01   # A decays
#          BR         NDA      ID1       ID2
     3.00323648E-01    2           5        -5   # BR(A -> b       bb     )
     5.69296088E-02    2         -15        15   # BR(A -> tau+    tau-   )
     2.01769437E-04    2         -13        13   # BR(A -> mu+     mu-    )
     1.21773579E-04    2           3        -3   # BR(A -> s       sb     )
     1.02737088E-07    2           4        -4   # BR(A -> c       cb     )
     1.00966053E-02    2           6        -6   # BR(A -> t       tb     )
     2.06821071E-05    2          21        21   # BR(A -> g       g      )
     6.38170357E-08    2          22        22   # BR(A -> gam     gam    )
     2.09055559E-08    2          23        22   # BR(A -> Z       gam    )
     3.71807303E-06    2          23        25   # BR(A -> Z       h      )
     2.19165809E-03    2     1000024  -1000024   # BR(A -> ~chi_1+ ~chi_1-)
     1.75954623E-01    2     1000024  -1000037   # BR(A -> ~chi_1+ ~chi_2-)
     1.75954623E-01    2     1000037  -1000024   # BR(A -> ~chi_2+ ~chi_1-)
     2.83193246E-02    2     1000022   1000022   # BR(A -> ~chi_10 ~chi_10)
     3.40964585E-03    2     1000023   1000023   # BR(A -> ~chi_20 ~chi_20)
     1.08339453E-02    2     1000025   1000025   # BR(A -> ~chi_30 ~chi_30)
     2.55991633E-02    2     1000022   1000023   # BR(A -> ~chi_10 ~chi_20)
     2.06087539E-02    2     1000022   1000025   # BR(A -> ~chi_10 ~chi_30)
     2.94876245E-02    2     1000022   1000035   # BR(A -> ~chi_10 ~chi_40)
     1.30063043E-02    2     1000023   1000025   # BR(A -> ~chi_20 ~chi_30)
     6.80015161E-02    2     1000023   1000035   # BR(A -> ~chi_20 ~chi_40)
     7.89348257E-02    2     1000025   1000035   # BR(A -> ~chi_30 ~chi_40)
#
#         PDG            Width
DECAY        37     4.35417379E+01   # H+ decays
#          BR         NDA      ID1       ID2
     4.95687292E-04    2           4        -5   # BR(H+ -> c       bb     )
     5.74011311E-02    2         -15        16   # BR(H+ -> tau+    nu_tau )
     2.03440602E-04    2         -13        14   # BR(H+ -> mu+     nu_mu  )
     4.95686735E-06    2           2        -5   # BR(H+ -> u       bb     )
     6.14279416E-06    2           2        -3   # BR(H+ -> u       sb     )
     1.21008190E-04    2           4        -3   # BR(H+ -> c       sb     )
     3.04635217E-01    2           6        -5   # BR(H+ -> t       bb     )
     3.75277867E-06    2          24        25   # BR(H+ -> W+      h      )
     6.26685238E-14    2          24        36   # BR(H+ -> W+      A      )
     8.12368547E-02    2     1000024   1000022   # BR(H+ -> ~chi_1+ ~chi_10)
     9.99737998E-04    2     1000024   1000023   # BR(H+ -> ~chi_1+ ~chi_20)
     2.10947648E-02    2     1000024   1000025   # BR(H+ -> ~chi_1+ ~chi_30)
     1.77652407E-01    2     1000024   1000035   # BR(H+ -> ~chi_1+ ~chi_40)
     5.57860803E-02    2     1000037   1000022   # BR(H+ -> ~chi_2+ ~chi_10)
     1.65059138E-01    2     1000037   1000023   # BR(H+ -> ~chi_2+ ~chi_20)
     1.35299681E-01    2     1000037   1000025   # BR(H+ -> ~chi_2+ ~chi_30)
