#
#                              ======================
#                              | THE SUSYHIT OUTPUT |
#                              ======================
#
#
#              ------------------------------------------------------
#              |     This is the output of the SUSY-HIT package     |
#              |  created by A.Djouadi, M.Muehlleitner and M.Spira. |
#              |  In case of problems with SUSY-HIT email to        |
#              |           margarete.muehlleitner@cern.ch           |
#              |           michael.spira@psi.ch                     |
#              |           abdelhak.djouadi@cern.ch                 |
#              ------------------------------------------------------
#
#              ------------------------------------------------------
#              |  SUSY Les Houches Accord - MSSM Spectrum + Decays  |
#              |              based on the decay programs           |
#              |                                                    |
#              |                     SDECAY 1.3b                    |
#              |                                                    |
#              |  Authors: M.Muhlleitner, A.Djouadi and Y.Mambrini  |
#              |  Ref.:    Comput.Phys.Commun.168(2005)46           |
#              |           [hep-ph/0311167]                         |
#              |                                                    |
#              |                     HDECAY 3.4                     |
#              |                                                    |
#              |  By: A.Djouadi,J.Kalinowski,M.Muhlleitner,M.Spira  |
#              |  Ref.:    Comput.Phys.Commun.108(1998)56           |
#              |           [hep-ph/9704448]                         |
#              |                                                    |
#              |                                                    |
#              |  If not stated otherwise all DRbar couplings and   |
#              |  soft SUSY breaking masses are given at the scale  |
#              |  Q=  0.23580950E+04
#              |                                                    |
#              ------------------------------------------------------
#
#
BLOCK DCINFO  # Decay Program information
     1   SDECAY/HDECAY # decay calculator
     2   1.3b  /3.4    # version number
#
BLOCK SPINFO  # Spectrum calculator information
     1     SOFTSUSY    # spectrum calculator               
     2     3.4.0       # version number                    
#
BLOCK MODSEL  # Model selection
     1     0   #  nonUniversal                                     
#
BLOCK SMINPUTS  # Standard Model inputs
         1     1.27908970E+02   # alpha_em^-1(M_Z)^MSbar
         2     1.16637870E-05   # G_F [GeV^-2]
         3     1.18400000E-01   # alpha_S(M_Z)^MSbar
         4     9.11876000E+01   # M_Z pole mass
         5     4.18000000E+00   # mb(mb)^MSbar
         6     1.73200000E+02   # mt pole mass
         7     1.77700000E+00   # mtau pole mass
#
BLOCK MINPAR  # Input parameters - minimal models
         3     2.47400000E+01   # tanb                
#
BLOCK EXTPAR  # Input parameters - non-minimal models
         0    -1.00000000E+00   # Set                 
         1     5.70960000E+02   # M_1(MX)             
         2     2.14130000E+02   # M_2(MX)             
         3     3.84869000E+03   # M_3(MX)             
        11     2.89951000E+03   # At(MX)              
        12     1.05047000E+03   # Ab(MX)              
        13    -5.72300000E+01   # Atau(MX)            
        23    -9.99980000E+02   # mu(MX)              
        26     3.38698000E+03   # mA(pole)            
        31     1.30559000E+03   # meL(MX)             
        32     1.30559000E+03   # mmuL(MX)            
        33     1.95850000E+03   # mtauL(MX)           
        34     3.10614000E+03   # meR(MX)             
        35     3.10614000E+03   # mmuR(MX)            
        36     2.67199000E+03   # mtauR(MX)           
        41     2.59085000E+03   # mqL1(MX)            
        42     2.59085000E+03   # mqL2(MX)            
        43     1.40759000E+03   # mqL3(MX)            
        44     4.95230000E+02   # muR(MX)             
        45     4.95230000E+02   # mcR(MX)             
        46     3.94167000E+03   # mtR(MX)             
        47     2.88713000E+03   # mdR(MX)             
        48     2.88713000E+03   # msR(MX)             
        49     2.40529000E+03   # mbR(MX)             
#
BLOCK MASS  # Mass Spectrum
# PDG code           mass       particle
        24     8.03807827E+01   # W+
        25     1.25916662E+02   # h
        35     3.38698165E+03   # H
        36     3.38698000E+03   # A
        37     3.38816960E+03   # H+
         5     4.81876030E+00   # b-quark pole mass calculated from mb(mb)_Msbar
   1000001     2.66591238E+03   # ~d_L
   2000001     2.95845295E+03   # ~d_R
   1000002     2.66481653E+03   # ~u_L
   2000002     5.46625786E+02   # ~u_R
   1000003     2.66591238E+03   # ~s_L
   2000003     2.95845295E+03   # ~s_R
   1000004     2.66481653E+03   # ~c_L
   2000004     5.46625786E+02   # ~c_R
   1000005     1.46351799E+03   # ~b_1
   2000005     2.46807146E+03   # ~b_2
   1000006     1.46464086E+03   # ~t_1
   2000006     3.98033863E+03   # ~t_2
   1000011     1.31317122E+03   # ~e_L
   2000011     3.10557946E+03   # ~e_R
   1000012     1.31041930E+03   # ~nu_eL
   1000013     1.31317122E+03   # ~mu_L
   2000013     3.10557946E+03   # ~mu_R
   1000014     1.31041930E+03   # ~nu_muL
   1000015     1.96395182E+03   # ~tau_1
   2000015     2.66778838E+03   # ~tau_2
   1000016     1.96214750E+03   # ~nu_tauL
   1000021     3.82820320E+03   # ~g
   1000022     2.29450871E+02   # ~chi_10
   1000023     5.62466211E+02   # ~chi_20
   1000025    -1.03237179E+03   # ~chi_30
   1000035     1.03466333E+03   # ~chi_40
   1000024     2.29617968E+02   # ~chi_1+
   1000037     1.03587122E+03   # ~chi_2+
#
BLOCK NMIX  # Neutralino Mixing Matrix
  1  1    -1.32644657E-03   # N_11
  1  2     9.96661382E-01   # N_12
  1  3     8.03776495E-02   # N_13
  1  4     1.42745492E-02   # N_14
  2  1     9.97852032E-01   # N_21
  2  2     6.42341036E-03   # N_22
  2  3    -5.78399176E-02   # N_23
  2  4    -3.00766781E-02   # N_24
  3  1    -1.98597806E-02   # N_31
  3  2     4.67152363E-02   # N_32
  3  3    -7.05179921E-01   # N_33
  3  4     7.07208990E-01   # N_34
  4  1     6.24111567E-02   # N_41
  4  2    -6.66521962E-02   # N_42
  4  3     7.02079238E-01   # N_43
  4  4     7.06220274E-01   # N_44
#
BLOCK UMIX  # Chargino Mixing Matrix U
  1  1     9.93566874E-01   # U_11
  1  2     1.13246932E-01   # U_12
  2  1    -1.13246932E-01   # U_21
  2  2     9.93566874E-01   # U_22
#
BLOCK VMIX  # Chargino Mixing Matrix V
  1  1     9.99798590E-01   # V_11
  1  2    -2.00693801E-02   # V_12
  2  1    -2.00693801E-02   # V_21
  2  2    -9.99798590E-01   # V_22
#
BLOCK STOPMIX  # Stop Mixing Matrix
  1  1     9.99528684E-01   # cos(theta_t)
  1  2    -3.06986948E-02   # sin(theta_t)
  2  1     3.06986948E-02   # -sin(theta_t)
  2  2     9.99528684E-01   # cos(theta_t)
#
BLOCK SBOTMIX  # Sbottom Mixing Matrix
  1  1     9.99857548E-01   # cos(theta_b)
  1  2    -1.68784984E-02   # sin(theta_b)
  2  1     1.68784984E-02   # -sin(theta_b)
  2  2     9.99857548E-01   # cos(theta_b)
#
BLOCK STAUMIX  # Stau Mixing Matrix
  1  1     9.99914905E-01   # cos(theta_tau)
  1  2    -1.30454114E-02   # sin(theta_tau)
  2  1     1.30454114E-02   # -sin(theta_tau)
  2  2     9.99914905E-01   # cos(theta_tau)
#
BLOCK ALPHA  # Higgs mixing
          -4.19672669E-02   # Mixing angle in the neutral Higgs boson sector
#
BLOCK HMIX Q=  2.35809500E+03  # DRbar Higgs Parameters
         1    -1.01759473E+03   # mu(Q)MSSM           
         2     2.38544868E+01   # tan                 
         3     2.42471574E+02   # higgs               
         4     1.16095116E+07   # mA^2(Q)MSSM         
#
BLOCK GAUGE Q=  2.35809500E+03  # The gauge couplings
     1     3.64131049E-01   # gprime(Q) DRbar
     2     6.41763082E-01   # g(Q) DRbar
     3     1.01232990E+00   # g3(Q) DRbar
#
BLOCK AU Q=  2.35809500E+03  # The trilinear couplings
  1  1     0.00000000E+00   # A_u(Q) DRbar
  2  2     0.00000000E+00   # A_c(Q) DRbar
  3  3     2.89951001E+03   # A_t(Q) DRbar
#
BLOCK AD Q=  2.35809500E+03  # The trilinear couplings
  1  1     0.00000000E+00   # A_d(Q) DRbar
  2  2     0.00000000E+00   # A_s(Q) DRbar
  3  3     1.05047001E+03   # A_b(Q) DRbar
#
BLOCK AE Q=  2.35809500E+03  # The trilinear couplings
  1  1     0.00000000E+00   # A_e(Q) DRbar
  2  2     0.00000000E+00   # A_mu(Q) DRbar
  3  3    -5.72299988E+01   # A_tau(Q) DRbar
#
BLOCK Yu Q=  2.35809500E+03  # The Yukawa couplings
  1  1     0.00000000E+00   # y_u(Q) DRbar
  2  2     0.00000000E+00   # y_c(Q) DRbar
  3  3     8.35049694E-01   # y_t(Q) DRbar
#
BLOCK Yd Q=  2.35809500E+03  # The Yukawa couplings
  1  1     0.00000000E+00   # y_d(Q) DRbar
  2  2     0.00000000E+00   # y_s(Q) DRbar
  3  3     3.55029615E-01   # y_b(Q) DRbar
#
BLOCK Ye Q=  2.35809500E+03  # The Yukawa couplings
  1  1     0.00000000E+00   # y_e(Q) DRbar
  2  2     0.00000000E+00   # y_mu(Q) DRbar
  3  3     2.41769146E-01   # y_tau(Q) DRbar
#
BLOCK MSOFT Q=  2.35809500E+03  # The soft SUSY breaking masses at the scale Q
         1     5.70960000E+02   # M_1(Q)              
         2     2.14130000E+02   # M_2(Q)              
         3     3.84869000E+03   # M_3(Q)              
        21     1.04372755E+07   # mH1^2(Q)            
        22    -1.02447768E+06   # mH2^2(Q)            
        31     1.30559000E+03   # meL(Q)              
        32     1.30559000E+03   # mmuL(Q)             
        33     1.95850000E+03   # mtauL(Q)            
        34     3.10614000E+03   # meR(Q)              
        35     3.10614000E+03   # mmuR(Q)             
        36     2.67199000E+03   # mtauR(Q)            
        41     2.59084999E+03   # mqL1(Q)             
        42     2.59084999E+03   # mqL2(Q)             
        43     1.40758997E+03   # mqL3(Q)             
        44     4.95229944E+02   # muR(Q)              
        45     4.95229944E+02   # mcR(Q)              
        46     3.94166999E+03   # mtR(Q)              
        47     2.88712999E+03   # mdR(Q)              
        48     2.88712999E+03   # msR(Q)              
        49     2.40528999E+03   # mbR(Q)              
#
Block HiggsBoundsInputHiggsCouplingsFermions
# ScalarNormEffCoupSq PseudoSNormEffCoupSq NP   IP1 IP2 IP2
    1.00338843E+00    0.00000000E+00        3  25   5   5  # h0-b-b eff. coupling^2, normalised to SM
    5.69033152E+02    0.00000000E+00        3  35   5   5  # H0-b-b eff. coupling^2, normalised to SM
    0.00000000E+00    5.69036540E+02        3  36   5   5  # A0-b-b eff. coupling^2, normalised to SM
#
    9.99994045E-01    0.00000000E+00        3  25   6   6  # h0-t-t eff. coupling^2, normalised to SM
    1.76331106E-03    0.00000000E+00        3  35   6   6  # H0-t-t eff. coupling^2, normalised to SM
    0.00000000E+00    1.75735639E-03        3  36   6   6  # A0-t-t eff. coupling^2, normalised to SM
#
    1.00338843E+00    0.00000000E+00        3  25  15  15  # h0-tau-tau eff. coupling^2, normalised to SM
    5.69033152E+02    0.00000000E+00        3  35  15  15  # H0-tau-tau eff. coupling^2, normalised to SM
    0.00000000E+00    5.69036540E+02        3  36  15  15  # A0-tau-tau eff. coupling^2, normalised to SM
#
Block HiggsBoundsInputHiggsCouplingsBosons
    9.99999995E-01        3  25  24  24  # h0-W-W eff. coupling^2, normalised to SM
    5.03572909E-09        3  35  24  24  # H0-W-W eff. coupling^2, normalised to SM
    0.00000000E+00        3  36  24  24  # A0-W-W eff. coupling^2, normalised to SM
#
    9.99999995E-01        3  25  23  23  # h0-Z-Z eff. coupling^2, normalised to SM
    5.03572909E-09        3  35  23  23  # H0-Z-Z eff. coupling^2, normalised to SM
    0.00000000E+00        3  36  23  23  # A0-Z-Z eff. coupling^2, normalised to SM
#
    8.87943161E-01        3  25  21  21  # h0-g-g eff. coupling^2, normalised to SM
    2.20380795E-14        3  35  21  21  # H0-g-g eff. coupling^2, normalised to SM
    4.86391165E-13        3  36  21  21  # A0-g-g eff. coupling^2, normalised to SM
#
    0.00000000E+00        3  25  25  23  # h0-h0-Z eff. coupling^2, normalised to SM
    0.00000000E+00        3  35  25  23  # H0-h0-Z eff. coupling^2, normalised to SM
    5.03572909E-09        3  36  25  23  # A0-h0-Z eff. coupling^2, normalised to SM
    0.00000000E+00        3  35  35  23  # H0-H0-Z eff. coupling^2, normalised to SM
    9.99999995E-01        3  36  35  23  # A0-H0-Z eff. coupling^2, normalised to SM
    0.00000000E+00        3  36  36  23  # A0-A0-Z eff. coupling^2, normalised to SM
#
    0.00000000E+00        4  25  21  21  23  # h0-g-g-Z eff. coupling^2, normalised to SM
    0.00000000E+00        4  35  21  21  23  # H0-g-g-Z eff. coupling^2, normalised to SM
    0.00000000E+00        4  36  21  21  23  # A0-g-g-Z eff. coupling^2, normalised to SM
#
#
#
#                             =================
#                             |The decay table|
#                             =================
#
# - The QCD corrections to the decays gluino -> squark  + quark
#                                     squark -> gaugino + quark_prime
#                                     squark -> squark_prime + Higgs
#                                     squark -> gluino  + quark
#   are included.
#
# - The multi-body decays for the inos, stops and sbottoms are included.
#
# - The loop induced decays for the gluino, neutralinos and stops
#   are included.
#
# - The SUSY decays of the top quark are included.
#
#
#         PDG            Width
DECAY         6     1.45092022E+00   # top decays
#          BR         NDA      ID1       ID2
     1.00000000E+00    2           5        24   # BR(t ->  b    W+)
#
#         PDG            Width
DECAY   1000021     3.83185709E+02   # gluino decays
#          BR         NDA      ID1       ID2
     2.59819113E-02    2     1000001        -1   # BR(~g -> ~d_L  db)
     2.59819113E-02    2    -1000001         1   # BR(~g -> ~d_L* d )
     1.58892087E-02    2     2000001        -1   # BR(~g -> ~d_R  db)
     1.58892087E-02    2    -2000001         1   # BR(~g -> ~d_R* d )
     2.60221434E-02    2     1000002        -2   # BR(~g -> ~u_L  ub)
     2.60221434E-02    2    -1000002         2   # BR(~g -> ~u_L* u )
     9.39915741E-02    2     2000002        -2   # BR(~g -> ~u_R  ub)
     9.39915741E-02    2    -2000002         2   # BR(~g -> ~u_R* u )
     2.59819113E-02    2     1000003        -3   # BR(~g -> ~s_L  sb)
     2.59819113E-02    2    -1000003         3   # BR(~g -> ~s_L* s )
     1.58892087E-02    2     2000003        -3   # BR(~g -> ~s_R  sb)
     1.58892087E-02    2    -2000003         3   # BR(~g -> ~s_R* s )
     2.60221261E-02    2     1000004        -4   # BR(~g -> ~c_L  cb)
     2.60221261E-02    2    -1000004         4   # BR(~g -> ~c_L* c )
     9.39915734E-02    2     2000004        -4   # BR(~g -> ~c_R  cb)
     9.39915734E-02    2    -2000004         4   # BR(~g -> ~c_R* c )
     7.12131699E-02    2     1000005        -5   # BR(~g -> ~b_1  bb)
     7.12131699E-02    2    -1000005         5   # BR(~g -> ~b_1* b )
     3.34868044E-02    2     2000005        -5   # BR(~g -> ~b_2  bb)
     3.34868044E-02    2    -2000005         5   # BR(~g -> ~b_2* b )
     7.15303686E-02    2     1000006        -6   # BR(~g -> ~t_1  tb)
     7.15303686E-02    2    -1000006         6   # BR(~g -> ~t_1* t )
#
#         PDG            Width
DECAY   1000006     2.26695442E+01   # stop1 decays
#          BR         NDA      ID1       ID2
     2.41809098E-01    2     1000022         6   # BR(~t_1 -> ~chi_10 t )
     7.60727457E-03    2     1000023         6   # BR(~t_1 -> ~chi_20 t )
     1.00841658E-01    2     1000025         6   # BR(~t_1 -> ~chi_30 t )
     1.05213643E-01    2     1000035         6   # BR(~t_1 -> ~chi_40 t )
     5.04224055E-01    2     1000024         5   # BR(~t_1 -> ~chi_1+ b )
     4.03042710E-02    2     1000037         5   # BR(~t_1 -> ~chi_2+ b )
#
#         PDG            Width
DECAY   2000006     1.54528840E+02   # stop2 decays
#          BR         NDA      ID1       ID2
     3.37654235E-04    2     1000022         6   # BR(~t_2 -> ~chi_10 t )
     5.78868159E-02    2     1000023         6   # BR(~t_2 -> ~chi_20 t )
     1.55563982E-01    2     1000025         6   # BR(~t_2 -> ~chi_30 t )
     1.53772938E-01    2     1000035         6   # BR(~t_2 -> ~chi_40 t )
     6.77020126E-04    2     1000024         5   # BR(~t_2 -> ~chi_1+ b )
     3.09908395E-01    2     1000037         5   # BR(~t_2 -> ~chi_2+ b )
     8.37768981E-02    2     1000006        25   # BR(~t_2 -> ~t_1    h )
     8.06757973E-02    2     1000006        23   # BR(~t_2 -> ~t_1    Z )
     1.57384372E-01    2     1000005        24   # BR(~t_2 -> ~b_1    W+)
     1.61280630E-05    2     2000005        24   # BR(~t_2 -> ~b_2    W+)
#
#         PDG            Width
DECAY   1000005     2.24756328E+01   # sbottom1 decays
#          BR         NDA      ID1       ID2
     2.53748059E-01    2     1000022         5   # BR(~b_1 -> ~chi_10 b )
     7.01927373E-03    2     1000023         5   # BR(~b_1 -> ~chi_20 b )
     2.06205035E-02    2     1000025         5   # BR(~b_1 -> ~chi_30 b )
     2.03724480E-02    2     1000035         5   # BR(~b_1 -> ~chi_40 b )
     4.86679436E-01    2    -1000024         6   # BR(~b_1 -> ~chi_1- t )
     2.11560279E-01    2    -1000037         6   # BR(~b_1 -> ~chi_2- t )
#
#         PDG            Width
DECAY   2000005     1.11773108E+01   # sbottom2 decays
#          BR         NDA      ID1       ID2
     1.88547630E-03    2     1000022         5   # BR(~b_2 -> ~chi_10 b )
     1.16808200E-01    2     1000023         5   # BR(~b_2 -> ~chi_20 b )
     1.88143186E-01    2     1000025         5   # BR(~b_2 -> ~chi_30 b )
     1.86888163E-01    2     1000035         5   # BR(~b_2 -> ~chi_40 b )
     3.70512069E-03    2    -1000024         6   # BR(~b_2 -> ~chi_1- t )
     3.70754811E-01    2    -1000037         6   # BR(~b_2 -> ~chi_2- t )
     3.29358612E-02    2     1000005        25   # BR(~b_2 -> ~b_1    h )
     3.35562936E-02    2     1000005        23   # BR(~b_2 -> ~b_1    Z )
     6.53228881E-02    2     1000006       -24   # BR(~b_2 -> ~t_1    W-)
#
#         PDG            Width
DECAY   1000002     3.24473827E+01   # sup_L decays
#          BR         NDA      ID1       ID2
     3.27507081E-01    2     1000022         2   # BR(~u_L -> ~chi_10 u)
     1.16583798E-02    2     1000023         2   # BR(~u_L -> ~chi_20 u)
     4.47947697E-04    2     1000025         2   # BR(~u_L -> ~chi_30 u)
     7.29064565E-04    2     1000035         2   # BR(~u_L -> ~chi_40 u)
     6.59462462E-01    2     1000024         1   # BR(~u_L -> ~chi_1+ d)
     1.95064961E-04    2     1000037         1   # BR(~u_L -> ~chi_2+ d)
#
#         PDG            Width
DECAY   2000002     2.37916998E-06   # sup_R decays
#           BR         NDA      ID1       ID2
     6.92297731E-01    2     1000022         2   # BR(~u_R -> ~chi_10 u)
#           BR         NDA      ID1       ID2       ID3
     2.54819960E-02    3        2       23        1000022   # BR(~u_R -> u  Z  ~chi_10)
     7.81322905E-02    3        2       25        1000022   # BR(~u_R -> u  h  ~chi_10)
     1.13745551E-01    3        2       -24        1000024   # BR(~u_R -> u  W-  ~chi_1+)
     9.03424311E-02    3        2       24        -1000024   # BR(~u_R -> u  W+  ~chi_1-)
#
#         PDG            Width
DECAY   1000001     3.23824722E+01   # sdown_L decays
#          BR         NDA      ID1       ID2
     3.28624953E-01    2     1000022         1   # BR(~d_L -> ~chi_10 d)
     1.01990416E-02    2     1000023         1   # BR(~d_L -> ~chi_20 d)
     6.19966966E-04    2     1000025         1   # BR(~d_L -> ~chi_30 d)
     1.49573840E-03    2     1000035         1   # BR(~d_L -> ~chi_40 d)
     6.52832592E-01    2    -1000024         2   # BR(~d_L -> ~chi_1- u)
     6.22770847E-03    2    -1000037         2   # BR(~d_L -> ~chi_2- u)
#
#         PDG            Width
DECAY   2000001     1.59368472E+00   # sdown_R decays
#          BR         NDA      ID1       ID2
     1.86961019E-06    2     1000022         1   # BR(~d_R -> ~chi_10 d)
     9.96431460E-01    2     1000023         1   # BR(~d_R -> ~chi_20 d)
     3.28307671E-04    2     1000025         1   # BR(~d_R -> ~chi_30 d)
     3.23836273E-03    2     1000035         1   # BR(~d_R -> ~chi_40 d)
#
#         PDG            Width
DECAY   1000004     3.26060875E+01   # scharm_L decays
#          BR         NDA      ID1       ID2
     3.27514795E-01    2     1000022         4   # BR(~c_L -> ~chi_10 c)
     1.16401842E-02    2     1000023         4   # BR(~c_L -> ~chi_20 c)
     4.46354503E-04    2     1000025         4   # BR(~c_L -> ~chi_30 c)
     7.26463296E-04    2     1000035         4   # BR(~c_L -> ~chi_40 c)
     6.59477835E-01    2     1000024         3   # BR(~c_L -> ~chi_1+ s)
     1.94367996E-04    2     1000037         3   # BR(~c_L -> ~chi_2+ s)
#
#         PDG            Width
DECAY   2000004     2.25983498E-06   # scharm_R decays
#           BR         NDA      ID1       ID2
     6.77214042E-01    2     1000022         4   # BR(~c_R -> ~chi_10 c)
#           BR         NDA      ID1       ID2       ID3
     2.67554934E-02    3        4       23        1000022   # BR(~c_R -> c  Z  ~chi_10)
     8.20325385E-02    3        4       25        1000022   # BR(~c_R -> c  h  ~chi_10)
     1.19128167E-01    3        4       -24        1000024   # BR(~c_R -> c  W-  ~chi_1+)
     9.48697590E-02    3        4       24        -1000024   # BR(~c_R -> c  W+  ~chi_1-)
#
#         PDG            Width
DECAY   1000003     3.25409437E+01   # sstrange_L decays
#          BR         NDA      ID1       ID2
     3.28640396E-01    2     1000022         3   # BR(~s_L -> ~chi_10 s)
     1.01833637E-02    2     1000023         3   # BR(~s_L -> ~chi_20 s)
     6.17776994E-04    2     1000025         3   # BR(~s_L -> ~chi_30 s)
     1.49043796E-03    2     1000035         3   # BR(~s_L -> ~chi_40 s)
     6.52862427E-01    2    -1000024         4   # BR(~s_L -> ~chi_1- c)
     6.20559865E-03    2    -1000037         4   # BR(~s_L -> ~chi_2- c)
#
#         PDG            Width
DECAY   2000003     1.60991111E+00   # sstrange_R decays
#          BR         NDA      ID1       ID2
     1.87255608E-06    2     1000022         3   # BR(~s_R -> ~chi_10 s)
     9.96438221E-01    2     1000023         3   # BR(~s_R -> ~chi_20 s)
     3.27687993E-04    2     1000025         3   # BR(~s_R -> ~chi_30 s)
     3.23221833E-03    2     1000035         3   # BR(~s_R -> ~chi_40 s)
#
#         PDG            Width
DECAY   1000011     1.61946821E+01   # selectron_L decays
#          BR         NDA      ID1       ID2
     3.09674735E-01    2     1000022        11   # BR(~e_L -> ~chi_10 e-)
     7.26184062E-02    2     1000023        11   # BR(~e_L -> ~chi_20 e-)
     6.08906188E-05    2     1000025        11   # BR(~e_L -> ~chi_30 e-)
     4.66189500E-05    2     1000035        11   # BR(~e_L -> ~chi_40 e-)
     6.16383507E-01    2    -1000024        12   # BR(~e_L -> ~chi_1- nu_e)
     1.21584291E-03    2    -1000037        12   # BR(~e_L -> ~chi_2- nu_e)
#
#         PDG            Width
DECAY   2000011     1.53165008E+01   # selectron_R decays
#          BR         NDA      ID1       ID2
     1.86158884E-06    2     1000022        11   # BR(~e_R -> ~chi_10 e-)
     9.96371352E-01    2     1000023        11   # BR(~e_R -> ~chi_20 e-)
     3.33805368E-04    2     1000025        11   # BR(~e_R -> ~chi_30 e-)
     3.29298062E-03    2     1000035        11   # BR(~e_R -> ~chi_40 e-)
#
#         PDG            Width
DECAY   1000013     1.61946820E+01   # smuon_L decays
#          BR         NDA      ID1       ID2
     3.09674732E-01    2     1000022        13   # BR(~mu_L -> ~chi_10 mu-)
     7.26184052E-02    2     1000023        13   # BR(~mu_L -> ~chi_20 mu-)
     6.08906137E-05    2     1000025        13   # BR(~mu_L -> ~chi_30 mu-)
     4.66189460E-05    2     1000035        13   # BR(~mu_L -> ~chi_40 mu-)
     6.16383510E-01    2    -1000024        14   # BR(~mu_L -> ~chi_1- nu_mu)
     1.21584291E-03    2    -1000037        14   # BR(~mu_L -> ~chi_2- nu_mu)
#
#         PDG            Width
DECAY   2000013     1.53165007E+01   # smuon_R decays
#          BR         NDA      ID1       ID2
     1.86158884E-06    2     1000022        13   # BR(~mu_R -> ~chi_10 mu-)
     9.96371352E-01    2     1000023        13   # BR(~mu_R -> ~chi_20 mu-)
     3.33805368E-04    2     1000025        13   # BR(~mu_R -> ~chi_30 mu-)
     3.29298061E-03    2     1000035        13   # BR(~mu_R -> ~chi_40 mu-)
#
#         PDG            Width
DECAY   1000015     2.67718314E+01   # stau_1 decays
#          BR         NDA      ID1       ID2
     2.90821502E-01    2     1000022        15   # BR(~tau_1 -> ~chi_10  tau-)
     8.34234990E-02    2     1000023        15   # BR(~tau_1 -> ~chi_20  tau-)
     2.23296396E-02    2     1000025        15   # BR(~tau_1 -> ~chi_30  tau-)
     2.19398809E-02    2     1000035        15   # BR(~tau_1 -> ~chi_40  tau-)
     5.77808725E-01    2    -1000024        16   # BR(~tau_1 -> ~chi_1-  nu_tau)
     3.67675316E-03    2    -1000037        16   # BR(~tau_1 -> ~chi_2-  nu_tau)
#
#         PDG            Width
DECAY   2000015     1.77221411E+01   # stau_2 decays
#          BR         NDA      ID1       ID2
     5.41130502E-04    2     1000022        15   # BR(~tau_2 -> ~chi_10  tau-)
     7.22221752E-01    2     1000023        15   # BR(~tau_2 -> ~chi_20  tau-)
     6.34156055E-02    2     1000025        15   # BR(~tau_2 -> ~chi_30  tau-)
     6.49408253E-02    2     1000035        15   # BR(~tau_2 -> ~chi_40  tau-)
     1.07179219E-03    2    -1000024        16   # BR(~tau_2 -> ~chi_1-  nu_tau)
     1.25592016E-01    2    -1000037        16   # BR(~tau_2 -> ~chi_2-  nu_tau)
     1.09612929E-02    2     1000016       -24   # BR(~tau_2 -> ~nu_tauL W-)
     5.69658129E-03    2     1000015        25   # BR(~tau_2 -> ~tau_1   h)
     5.55900409E-03    2     1000015        23   # BR(~tau_2 -> ~tau_1   Z)
#
#         PDG            Width
DECAY   1000012     1.62327889E+01   # snu_eL decays
#          BR         NDA      ID1       ID2
     3.09151086E-01    2     1000022        12   # BR(~nu_eL -> ~chi_10 nu_e)
     6.89579466E-02    2     1000023        12   # BR(~nu_eL -> ~chi_20 nu_e)
     1.60007299E-04    2     1000025        12   # BR(~nu_eL -> ~chi_30 nu_e)
     4.88579201E-04    2     1000035        12   # BR(~nu_eL -> ~chi_40 nu_e)
     6.21204890E-01    2     1000024        11   # BR(~nu_eL -> ~chi_1+ e-)
     3.74907331E-05    2     1000037        11   # BR(~nu_eL -> ~chi_2+ e-)
#
#         PDG            Width
DECAY   1000014     1.62327887E+01   # snu_muL decays
#          BR         NDA      ID1       ID2
     3.09151088E-01    2     1000022        14   # BR(~nu_muL -> ~chi_10 nu_mu)
     6.89579472E-02    2     1000023        14   # BR(~nu_muL -> ~chi_20 nu_mu)
     1.60007300E-04    2     1000025        14   # BR(~nu_muL -> ~chi_30 nu_mu)
     4.88579206E-04    2     1000035        14   # BR(~nu_muL -> ~chi_40 nu_mu)
     6.21204887E-01    2     1000024        13   # BR(~nu_muL -> ~chi_1+ mu-)
     3.74907299E-05    2     1000037        13   # BR(~nu_muL -> ~chi_2+ mu-)
#
#         PDG            Width
DECAY   1000016     2.67967893E+01   # snu_tauL decays
#          BR         NDA      ID1       ID2
     2.90328593E-01    2     1000022        16   # BR(~nu_tauL -> ~chi_10 nu_tau)
     7.91785592E-02    2     1000023        16   # BR(~nu_tauL -> ~chi_20 nu_tau)
     5.27462436E-04    2     1000025        16   # BR(~nu_tauL -> ~chi_30 nu_tau)
     1.62872127E-03    2     1000035        16   # BR(~nu_tauL -> ~chi_40 nu_tau)
     5.84485414E-01    2     1000024        15   # BR(~nu_tauL -> ~chi_1+ tau-)
     4.38512498E-02    2     1000037        15   # BR(~nu_tauL -> ~chi_2+ tau-)
#
#         PDG            Width
DECAY   1000024     3.92454310E-15   # chargino1+ decays
#           BR         NDA      ID1       ID2       ID3
     1.93970520E-02    3     1000022       -11        12   # BR(~chi_1+ -> ~chi_10 e+   nu_e)
     2.38166970E-03    3     1000022       -13        14   # BR(~chi_1+ -> ~chi_10 mu+  nu_mu)
     9.78221280E-01    2     1000022       211             # BR(~chi_1+ -> ~chi_10 pi+)
#
#         PDG            Width
DECAY   1000037     6.47204279E+00   # chargino2+ decays
#          BR         NDA      ID1       ID2
     3.12756854E-01    2     1000024        23   # BR(~chi_2+ -> ~chi_1+  Z )
     3.06099347E-01    2     1000022        24   # BR(~chi_2+ -> ~chi_10  W+)
     8.01419166E-02    2     1000023        24   # BR(~chi_2+ -> ~chi_20  W+)
     3.01001882E-01    2     1000024        25   # BR(~chi_2+ -> ~chi_1+  h )
#
#         PDG            Width
DECAY   1000022     0.00000000E+00   # neutralino1 decays
#
#         PDG            Width
DECAY   1000023     3.55677364E-02   # neutralino2 decays
#          BR         NDA      ID1       ID2
     1.82167557E-02    2     1000022        23   # BR(~chi_20 -> ~chi_10   Z )
     6.87453450E-02    2     1000024       -24   # BR(~chi_20 -> ~chi_1+   W-)
     6.87453450E-02    2    -1000024        24   # BR(~chi_20 -> ~chi_1-   W+)
     5.39887577E-02    2     1000022        25   # BR(~chi_20 -> ~chi_10   h )
     1.98000374E-01    2     2000002        -2   # BR(~chi_20 -> ~u_R      ub)
     1.98000374E-01    2    -2000002         2   # BR(~chi_20 -> ~u_R*     u )
     1.97151525E-01    2     2000004        -4   # BR(~chi_20 -> ~c_R      cb)
     1.97151525E-01    2    -2000004         4   # BR(~chi_20 -> ~c_R*     c )
#
#         PDG            Width
DECAY   1000025     6.45792695E+00   # neutralino3 decays
#          BR         NDA      ID1       ID2
     2.10051652E-01    2     1000022        23   # BR(~chi_30 -> ~chi_10   Z )
     7.04770379E-02    2     1000023        23   # BR(~chi_30 -> ~chi_20   Z )
     3.07118506E-01    2     1000024       -24   # BR(~chi_30 -> ~chi_1+   W-)
     3.07118506E-01    2    -1000024        24   # BR(~chi_30 -> ~chi_1-   W+)
     9.74756697E-02    2     1000022        25   # BR(~chi_30 -> ~chi_10   h )
     7.27753696E-03    2     1000023        25   # BR(~chi_30 -> ~chi_20   h )
     1.20273133E-04    2     2000002        -2   # BR(~chi_30 -> ~u_R      ub)
     1.20273133E-04    2    -2000002         2   # BR(~chi_30 -> ~u_R*     u )
     1.20272834E-04    2     2000004        -4   # BR(~chi_30 -> ~c_R      cb)
     1.20272834E-04    2    -2000004         4   # BR(~chi_30 -> ~c_R*     c )
#
#         PDG            Width
DECAY   1000035     6.53790832E+00   # neutralino4 decays
#          BR         NDA      ID1       ID2
     1.03019247E-01    2     1000022        23   # BR(~chi_40 -> ~chi_10   Z )
     7.59132864E-03    2     1000023        23   # BR(~chi_40 -> ~chi_20   Z )
     3.04203522E-01    2     1000024       -24   # BR(~chi_40 -> ~chi_1+   W-)
     3.04203522E-01    2    -1000024        24   # BR(~chi_40 -> ~chi_1-   W+)
     2.02943991E-01    2     1000022        25   # BR(~chi_40 -> ~chi_10   h )
     7.33192195E-02    2     1000023        25   # BR(~chi_40 -> ~chi_20   h )
     1.17979404E-03    2     2000002        -2   # BR(~chi_40 -> ~u_R      ub)
     1.17979404E-03    2    -2000002         2   # BR(~chi_40 -> ~u_R*     u )
     1.17979115E-03    2     2000004        -4   # BR(~chi_40 -> ~c_R      cb)
     1.17979115E-03    2    -2000004         4   # BR(~chi_40 -> ~c_R*     c )
#
#         PDG            Width
DECAY        25     3.89961658E-03   # h decays
#          BR         NDA      ID1       ID2
     5.53811589E-01    2           5        -5   # BR(h -> b       bb     )
     6.70672311E-02    2         -15        15   # BR(h -> tau+    tau-   )
     2.37391961E-04    2         -13        13   # BR(h -> mu+     mu-    )
     2.58828239E-04    2           3        -3   # BR(h -> s       sb     )
     2.23712952E-02    2           4        -4   # BR(h -> c       cb     )
     8.35741565E-02    2          21        21   # BR(h -> g       g      )
     2.48650859E-03    2          22        22   # BR(h -> gam     gam    )
     1.73655969E-03    2          22        23   # BR(h -> Z       gam    )
     2.38319304E-01    2          24       -24   # BR(h -> W+      W-     )
     3.01371357E-02    2          23        23   # BR(h -> Z       Z      )
#
#         PDG            Width
DECAY        35     7.01047454E+01   # H decays
#          BR         NDA      ID1       ID2
     3.95106584E-01    2           5        -5   # BR(H -> b       bb     )
     5.77237133E-02    2         -15        15   # BR(H -> tau+    tau-   )
     2.05505791E-04    2         -13        13   # BR(H -> mu+     mu-    )
     1.45919298E-04    2           3        -3   # BR(H -> s       sb     )
     3.44047353E-08    2           4        -4   # BR(H -> c       cb     )
     3.38911258E-03    2           6        -6   # BR(H -> t       tb     )
     3.06082187E-06    2          21        21   # BR(H -> g       g      )
     8.17127138E-09    2          22        22   # BR(H -> gam     gam    )
     1.61678601E-09    2          23        22   # BR(H -> Z       gam    )
     8.97649932E-07    2          24       -24   # BR(H -> W+      W-     )
     4.47956445E-07    2          23        23   # BR(H -> Z       Z      )
     4.01155761E-06    2          25        25   # BR(H -> h       h      )
     5.17534792E-03    2     1000024  -1000024   # BR(H -> ~chi_1+ ~chi_1-)
     1.23499372E-04    2     1000037  -1000037   # BR(H -> ~chi_2+ ~chi_2-)
     1.63598037E-01    2     1000024  -1000037   # BR(H -> ~chi_1+ ~chi_2-)
     1.63598037E-01    2     1000037  -1000024   # BR(H -> ~chi_2+ ~chi_1-)
     2.59488351E-03    2     1000022   1000022   # BR(H -> ~chi_10 ~chi_10)
     3.34414341E-04    2     1000023   1000023   # BR(H -> ~chi_20 ~chi_20)
     3.05796092E-04    2     1000025   1000025   # BR(H -> ~chi_30 ~chi_30)
     1.08845485E-03    2     1000035   1000035   # BR(H -> ~chi_40 ~chi_40)
     1.93526162E-03    2     1000022   1000023   # BR(H -> ~chi_10 ~chi_20)
     7.78984515E-02    2     1000022   1000025   # BR(H -> ~chi_10 ~chi_30)
     8.26202961E-02    2     1000022   1000035   # BR(H -> ~chi_10 ~chi_40)
     2.18787915E-02    2     1000023   1000025   # BR(H -> ~chi_20 ~chi_30)
     2.01093105E-02    2     1000023   1000035   # BR(H -> ~chi_20 ~chi_40)
     1.94516524E-03    2     1000025   1000035   # BR(H -> ~chi_30 ~chi_40)
     1.68279132E-07    2     2000002  -2000002   # BR(H -> ~u_R    ~u_R*  )
     1.68279132E-07    2     2000004  -2000004   # BR(H -> ~c_R    ~c_R*  )
     1.98820385E-04    2     1000006  -1000006   # BR(H -> ~t_1    ~t_1*  )
     1.46912991E-05    2     1000005  -1000005   # BR(H -> ~b_1    ~b_1*  )
     1.29961845E-07    2     1000011  -1000011   # BR(H -> ~e_L-   ~e_L+  )
     1.29961845E-07    2     1000013  -1000013   # BR(H -> ~mu_L-  ~mu_L+ )
     4.24713902E-07    2     1000012  -1000012   # BR(H -> ~nu_eL  ~nu_eL*   )
     4.24713902E-07    2     1000014  -1000014   # BR(H -> ~nu_muL ~nu_muL*  )
#
#         PDG            Width
DECAY        36     7.00933239E+01   # A decays
#          BR         NDA      ID1       ID2
     3.95190147E-01    2           5        -5   # BR(A -> b       bb     )
     5.77334961E-02    2         -15        15   # BR(A -> tau+    tau-   )
     2.05540390E-04    2         -13        13   # BR(A -> mu+     mu-    )
     1.45961813E-04    2           3        -3   # BR(A -> s       sb     )
     3.46122899E-08    2           4        -4   # BR(A -> c       cb     )
     3.40097135E-03    2           6        -6   # BR(A -> t       tb     )
     1.43818220E-05    2          21        21   # BR(A -> g       g      )
     8.91791437E-10    2          22        22   # BR(A -> gam     gam    )
     1.25733654E-08    2          23        22   # BR(A -> Z       gam    )
     9.10243718E-07    2          23        25   # BR(A -> Z       h      )
     5.11958638E-03    2     1000024  -1000024   # BR(A -> ~chi_1+ ~chi_1-)
     7.47122175E-05    2     1000037  -1000037   # BR(A -> ~chi_2+ ~chi_2-)
     1.63682457E-01    2     1000024  -1000037   # BR(A -> ~chi_1+ ~chi_2-)
     1.63682457E-01    2     1000037  -1000024   # BR(A -> ~chi_2+ ~chi_1-)
     2.56621751E-03    2     1000022   1000022   # BR(A -> ~chi_10 ~chi_10)
     3.44520478E-04    2     1000023   1000023   # BR(A -> ~chi_20 ~chi_20)
     5.76007610E-04    2     1000025   1000025   # BR(A -> ~chi_30 ~chi_30)
     1.46707379E-03    2     1000035   1000035   # BR(A -> ~chi_40 ~chi_40)
     1.90408583E-03    2     1000022   1000023   # BR(A -> ~chi_10 ~chi_20)
     8.42437769E-02    2     1000022   1000025   # BR(A -> ~chi_10 ~chi_30)
     7.63802448E-02    2     1000022   1000035   # BR(A -> ~chi_10 ~chi_40)
     2.05974316E-02    2     1000023   1000025   # BR(A -> ~chi_20 ~chi_30)
     2.13918091E-02    2     1000023   1000035   # BR(A -> ~chi_20 ~chi_40)
     1.27816215E-03    2     1000025   1000035   # BR(A -> ~chi_30 ~chi_40)
#
#         PDG            Width
DECAY        37     7.24664810E+01   # H+ decays
#          BR         NDA      ID1       ID2
     6.97647421E-04    2           4        -5   # BR(H+ -> c       bb     )
     5.58624334E-02    2         -15        16   # BR(H+ -> tau+    nu_tau )
     1.98879110E-04    2         -13        14   # BR(H+ -> mu+     nu_mu  )
     6.97646721E-06    2           2        -5   # BR(H+ -> u       bb     )
     7.06452967E-06    2           2        -3   # BR(H+ -> u       sb     )
     1.39083509E-04    2           4        -3   # BR(H+ -> c       sb     )
     4.17817619E-01    2           6        -5   # BR(H+ -> t       bb     )
     8.81795908E-07    2          24        25   # BR(H+ -> W+      h      )
     4.32559030E-14    2          24        36   # BR(H+ -> W+      A      )
     4.46957097E-09    2     1000024   1000022   # BR(H+ -> ~chi_1+ ~chi_10)
     3.76366576E-03    2     1000024   1000023   # BR(H+ -> ~chi_1+ ~chi_20)
     1.59103892E-01    2     1000024   1000025   # BR(H+ -> ~chi_1+ ~chi_30)
     1.57463682E-01    2     1000024   1000035   # BR(H+ -> ~chi_1+ ~chi_40)
     1.61276680E-01    2     1000037   1000022   # BR(H+ -> ~chi_2+ ~chi_10)
     4.20371208E-02    2     1000037   1000023   # BR(H+ -> ~chi_2+ ~chi_20)
     7.48240221E-04    2     1000037   1000025   # BR(H+ -> ~chi_2+ ~chi_30)
     8.06570852E-04    2     1000037   1000035   # BR(H+ -> ~chi_2+ ~chi_40)
     4.94609923E-07    2    -1000011   1000012   # BR(H+ -> ~e_L+   ~nu_eL )
     4.94609923E-07    2    -1000013   1000014   # BR(H+ -> ~mu_L+  ~nu_muL)
     6.85689669E-05    2     1000006  -1000005   # BR(H+ -> ~t_1    ~b_1*  )
