#
#                              ======================
#                              | THE SUSYHIT OUTPUT |
#                              ======================
#
#
#              ------------------------------------------------------
#              |     This is the output of the SUSY-HIT package     |
#              |  created by A.Djouadi, M.Muehlleitner and M.Spira. |
#              |  In case of problems with SUSY-HIT email to        |
#              |           margarete.muehlleitner@cern.ch           |
#              |           michael.spira@psi.ch                     |
#              |           abdelhak.djouadi@cern.ch                 |
#              ------------------------------------------------------
#
#              ------------------------------------------------------
#              |  SUSY Les Houches Accord - MSSM Spectrum + Decays  |
#              |              based on the decay programs           |
#              |                                                    |
#              |                     SDECAY 1.3b                    |
#              |                                                    |
#              |  Authors: M.Muhlleitner, A.Djouadi and Y.Mambrini  |
#              |  Ref.:    Comput.Phys.Commun.168(2005)46           |
#              |           [hep-ph/0311167]                         |
#              |                                                    |
#              |                     HDECAY 3.4                     |
#              |                                                    |
#              |  By: A.Djouadi,J.Kalinowski,M.Muhlleitner,M.Spira  |
#              |  Ref.:    Comput.Phys.Commun.108(1998)56           |
#              |           [hep-ph/9704448]                         |
#              |                                                    |
#              |                                                    |
#              |  If not stated otherwise all DRbar couplings and   |
#              |  soft SUSY breaking masses are given at the scale  |
#              |  Q=  0.18214950E+04
#              |                                                    |
#              ------------------------------------------------------
#
#
BLOCK DCINFO  # Decay Program information
     1   SDECAY/HDECAY # decay calculator
     2   1.3b  /3.4    # version number
#
BLOCK SPINFO  # Spectrum calculator information
     1     SOFTSUSY    # spectrum calculator               
     2     3.4.0       # version number                    
#
BLOCK MODSEL  # Model selection
     1     0   #  nonUniversal                                     
#
BLOCK SMINPUTS  # Standard Model inputs
         1     1.27908970E+02   # alpha_em^-1(M_Z)^MSbar
         2     1.16637870E-05   # G_F [GeV^-2]
         3     1.18400000E-01   # alpha_S(M_Z)^MSbar
         4     9.11876000E+01   # M_Z pole mass
         5     4.18000000E+00   # mb(mb)^MSbar
         6     1.73200000E+02   # mt pole mass
         7     1.77700000E+00   # mtau pole mass
#
BLOCK MINPAR  # Input parameters - minimal models
         3     5.82000000E+00   # tanb                
#
BLOCK EXTPAR  # Input parameters - non-minimal models
         0    -1.00000000E+00   # Set                 
         1    -3.30053000E+03   # M_1(MX)             
         2    -2.58570000E+02   # M_2(MX)             
         3     1.63518000E+03   # M_3(MX)             
        11    -4.22120000E+03   # At(MX)              
        12    -1.10362000E+03   # Ab(MX)              
        13     3.62447000E+03   # Atau(MX)            
        23    -2.59965000E+03   # mu(MX)              
        26     2.49732000E+03   # mA(pole)            
        31     3.36951000E+03   # meL(MX)             
        32     3.36951000E+03   # mmuL(MX)            
        33     3.80832000E+03   # mtauL(MX)           
        34     4.76430000E+02   # meR(MX)             
        35     4.76430000E+02   # mmuR(MX)            
        36     4.22960000E+02   # mtauR(MX)           
        41     2.45088000E+03   # mqL1(MX)            
        42     2.45088000E+03   # mqL2(MX)            
        43     1.54921000E+03   # mqL3(MX)            
        44     3.28175000E+03   # muR(MX)             
        45     3.28175000E+03   # mcR(MX)             
        46     2.15677000E+03   # mtR(MX)             
        47     5.24660000E+02   # mdR(MX)             
        48     5.24660000E+02   # msR(MX)             
        49     1.96190000E+03   # mbR(MX)             
#
BLOCK MASS  # Mass Spectrum
# PDG code           mass       particle
        24     8.03814111E+01   # W+
        25     1.25340056E+02   # h
        35     2.49723745E+03   # H
        36     2.49731999E+03   # A
        37     2.49881037E+03   # H+
         5     4.81876030E+00   # b-quark pole mass calculated from mb(mb)_Msbar
   1000001     2.49387080E+03   # ~d_L
   2000001     6.39377788E+02   # ~d_R
   1000002     2.49282932E+03   # ~u_L
   2000002     3.31775355E+03   # ~u_R
   1000003     2.49387080E+03   # ~s_L
   2000003     6.39377788E+02   # ~s_R
   1000004     2.49282932E+03   # ~c_L
   2000004     3.31775355E+03   # ~c_R
   1000005     1.60715016E+03   # ~b_1
   2000005     2.01184976E+03   # ~b_2
   1000006     1.57056496E+03   # ~t_1
   2000006     2.17829542E+03   # ~t_2
   1000011     3.37835480E+03   # ~e_L
   2000011     4.48907506E+02   # ~e_R
   1000012     3.37714787E+03   # ~nu_eL
   1000013     3.37835480E+03   # ~mu_L
   2000013     4.48907506E+02   # ~mu_R
   1000014     3.37714787E+03   # ~nu_muL
   1000015     3.92358286E+02   # ~tau_1
   2000015     3.81749666E+03   # ~tau_2
   1000016     3.81637951E+03   # ~nu_tauL
   1000021     1.77718262E+03   # ~g
   1000022    -2.75533127E+02   # ~chi_10
   1000023    -2.61498096E+03   # ~chi_20
   1000025     2.61608971E+03   # ~chi_30
   1000035    -3.28487239E+03   # ~chi_40
   1000024     2.75695516E+02   # ~chi_1+
   1000037     2.61796274E+03   # ~chi_2+
#
BLOCK NMIX  # Neutralino Mixing Matrix
  1  1    -1.73646192E-04   # N_11
  1  2     9.99510294E-01   # N_12
  1  3     3.02432510E-02   # N_13
  1  4    -8.03042122E-03   # N_14
  2  1    -5.32452515E-02   # N_21
  2  2    -2.70372759E-02   # N_22
  2  3     7.05823022E-01   # N_23
  2  4    -7.05866695E-01   # N_24
  3  1     4.24963666E-03   # N_31
  3  2    -1.57071748E-02   # N_32
  3  3     7.06894480E-01   # N_33
  3  4     7.07131826E-01   # N_34
  4  1     9.98572408E-01   # N_41
  4  2    -1.20101016E-03   # N_42
  4  3     3.46323722E-02   # N_43
  4  4    -4.06485270E-02   # N_44
#
BLOCK UMIX  # Chargino Mixing Matrix U
  1  1     9.99085818E-01   # U_11
  1  2     4.27496027E-02   # U_12
  2  1    -4.27496027E-02   # U_21
  2  2     9.99085818E-01   # U_22
#
BLOCK VMIX  # Chargino Mixing Matrix V
  1  1    -9.99935549E-01   # V_11
  1  2    -1.13533133E-02   # V_12
  2  1     1.13533133E-02   # V_21
  2  2    -9.99935549E-01   # V_22
#
BLOCK STOPMIX  # Stop Mixing Matrix
  1  1     9.71079137E-01   # cos(theta_t)
  1  2     2.38757847E-01   # sin(theta_t)
  2  1    -2.38757847E-01   # -sin(theta_t)
  2  2     9.71079137E-01   # cos(theta_t)
#
BLOCK SBOTMIX  # Sbottom Mixing Matrix
  1  1     9.99758794E-01   # cos(theta_b)
  1  2    -2.19625549E-02   # sin(theta_b)
  2  1     2.19625549E-02   # -sin(theta_b)
  2  2     9.99758794E-01   # cos(theta_b)
#
BLOCK STAUMIX  # Stau Mixing Matrix
  1  1    -2.24121997E-03   # cos(theta_tau)
  1  2     9.99997488E-01   # sin(theta_tau)
  2  1    -9.99997488E-01   # -sin(theta_tau)
  2  2    -2.24121997E-03   # cos(theta_tau)
#
BLOCK ALPHA  # Higgs mixing
          -1.78220812E-01   # Mixing angle in the neutral Higgs boson sector
#
BLOCK HMIX Q=  1.82149500E+03  # DRbar Higgs Parameters
         1    -2.62982426E+03   # mu(Q)MSSM           
         2     5.57424550E+00   # tan                 
         3     2.43273369E+02   # higgs               
         4     6.13235931E+06   # mA^2(Q)MSSM         
#
BLOCK GAUGE Q=  1.82149500E+03  # The gauge couplings
     1     3.63481882E-01   # gprime(Q) DRbar
     2     6.40172002E-01   # g(Q) DRbar
     3     1.03393969E+00   # g3(Q) DRbar
#
BLOCK AU Q=  1.82149500E+03  # The trilinear couplings
  1  1     0.00000000E+00   # A_u(Q) DRbar
  2  2     0.00000000E+00   # A_c(Q) DRbar
  3  3    -4.22120000E+03   # A_t(Q) DRbar
#
BLOCK AD Q=  1.82149500E+03  # The trilinear couplings
  1  1     0.00000000E+00   # A_d(Q) DRbar
  2  2     0.00000000E+00   # A_s(Q) DRbar
  3  3    -1.10362000E+03   # A_b(Q) DRbar
#
BLOCK AE Q=  1.82149500E+03  # The trilinear couplings
  1  1     0.00000000E+00   # A_e(Q) DRbar
  2  2     0.00000000E+00   # A_mu(Q) DRbar
  3  3     3.62447000E+03   # A_tau(Q) DRbar
#
BLOCK Yu Q=  1.82149500E+03  # The Yukawa couplings
  1  1     0.00000000E+00   # y_u(Q) DRbar
  2  2     0.00000000E+00   # y_c(Q) DRbar
  3  3     8.40025147E-01   # y_t(Q) DRbar
#
BLOCK Yd Q=  1.82149500E+03  # The Yukawa couplings
  1  1     0.00000000E+00   # y_d(Q) DRbar
  2  2     0.00000000E+00   # y_s(Q) DRbar
  3  3     8.21564459E-02   # y_b(Q) DRbar
#
BLOCK Ye Q=  1.82149500E+03  # The Yukawa couplings
  1  1     0.00000000E+00   # y_e(Q) DRbar
  2  2     0.00000000E+00   # y_mu(Q) DRbar
  3  3     5.80055199E-02   # y_tau(Q) DRbar
#
BLOCK MSOFT Q=  1.82149500E+03  # The soft SUSY breaking masses at the scale Q
         1    -3.30053000E+03   # M_1(Q)              
         2    -2.58570000E+02   # M_2(Q)              
         3     1.63518000E+03   # M_3(Q)              
        21    -8.92524651E+05   # mH1^2(Q)            
        22    -6.65177662E+06   # mH2^2(Q)            
        31     3.36951000E+03   # meL(Q)              
        32     3.36951000E+03   # mmuL(Q)             
        33     3.80832000E+03   # mtauL(Q)            
        34     4.76430000E+02   # meR(Q)              
        35     4.76430000E+02   # mmuR(Q)             
        36     4.22960000E+02   # mtauR(Q)            
        41     2.45088000E+03   # mqL1(Q)             
        42     2.45088000E+03   # mqL2(Q)             
        43     1.54920999E+03   # mqL3(Q)             
        44     3.28175000E+03   # muR(Q)              
        45     3.28175000E+03   # mcR(Q)              
        46     2.15676999E+03   # mtR(Q)              
        47     5.24659992E+02   # mdR(Q)              
        48     5.24659992E+02   # msR(Q)              
        49     1.96190000E+03   # mbR(Q)              
#
Block HiggsBoundsInputHiggsCouplingsFermions
# ScalarNormEffCoupSq PseudoSNormEffCoupSq NP   IP1 IP2 IP2
    1.00795877E+00    0.00000000E+00        3  25   5   5  # h0-b-b eff. coupling^2, normalised to SM
    3.10642541E+01    0.00000000E+00        3  35   5   5  # H0-b-b eff. coupling^2, normalised to SM
    0.00000000E+00    3.10722129E+01        3  36   5   5  # A0-b-b eff. coupling^2, normalised to SM
#
    9.99743862E-01    0.00000000E+00        3  25   6   6  # h0-t-t eff. coupling^2, normalised to SM
    3.24392336E-02    0.00000000E+00        3  35   6   6  # H0-t-t eff. coupling^2, normalised to SM
    0.00000000E+00    3.21830957E-02        3  36   6   6  # A0-t-t eff. coupling^2, normalised to SM
#
    1.00795877E+00    0.00000000E+00        3  25  15  15  # h0-tau-tau eff. coupling^2, normalised to SM
    3.10642541E+01    0.00000000E+00        3  35  15  15  # H0-tau-tau eff. coupling^2, normalised to SM
    0.00000000E+00    3.10722129E+01        3  36  15  15  # A0-tau-tau eff. coupling^2, normalised to SM
#
Block HiggsBoundsInputHiggsCouplingsBosons
    9.99999492E-01        3  25  24  24  # h0-W-W eff. coupling^2, normalised to SM
    5.07682602E-07        3  35  24  24  # H0-W-W eff. coupling^2, normalised to SM
    0.00000000E+00        3  36  24  24  # A0-W-W eff. coupling^2, normalised to SM
#
    9.99999492E-01        3  25  23  23  # h0-Z-Z eff. coupling^2, normalised to SM
    5.07682602E-07        3  35  23  23  # H0-Z-Z eff. coupling^2, normalised to SM
    0.00000000E+00        3  36  23  23  # A0-Z-Z eff. coupling^2, normalised to SM
#
    8.79636114E-01        3  25  21  21  # h0-g-g eff. coupling^2, normalised to SM
    5.16989505E-11        3  35  21  21  # H0-g-g eff. coupling^2, normalised to SM
    8.04503833E-11        3  36  21  21  # A0-g-g eff. coupling^2, normalised to SM
#
    0.00000000E+00        3  25  25  23  # h0-h0-Z eff. coupling^2, normalised to SM
    0.00000000E+00        3  35  25  23  # H0-h0-Z eff. coupling^2, normalised to SM
    5.07682602E-07        3  36  25  23  # A0-h0-Z eff. coupling^2, normalised to SM
    0.00000000E+00        3  35  35  23  # H0-H0-Z eff. coupling^2, normalised to SM
    9.99999492E-01        3  36  35  23  # A0-H0-Z eff. coupling^2, normalised to SM
    0.00000000E+00        3  36  36  23  # A0-A0-Z eff. coupling^2, normalised to SM
#
    0.00000000E+00        4  25  21  21  23  # h0-g-g-Z eff. coupling^2, normalised to SM
    0.00000000E+00        4  35  21  21  23  # H0-g-g-Z eff. coupling^2, normalised to SM
    0.00000000E+00        4  36  21  21  23  # A0-g-g-Z eff. coupling^2, normalised to SM
#
#
#
#                             =================
#                             |The decay table|
#                             =================
#
# - The QCD corrections to the decays gluino -> squark  + quark
#                                     squark -> gaugino + quark_prime
#                                     squark -> squark_prime + Higgs
#                                     squark -> gluino  + quark
#   are included.
#
# - The multi-body decays for the inos, stops and sbottoms are included.
#
# - The loop induced decays for the gluino, neutralinos and stops
#   are included.
#
# - The SUSY decays of the top quark are included.
#
#
#         PDG            Width
DECAY         6     1.44370663E+00   # top decays
#          BR         NDA      ID1       ID2
     1.00000000E+00    2           5        24   # BR(t ->  b    W+)
#
#         PDG            Width
DECAY   1000021     5.13542200E+01   # gluino decays
#          BR         NDA      ID1       ID2
     2.40921542E-01    2     2000001        -1   # BR(~g -> ~d_R  db)
     2.40921542E-01    2    -2000001         1   # BR(~g -> ~d_R* d )
     2.40921542E-01    2     2000003        -3   # BR(~g -> ~s_R  sb)
     2.40921542E-01    2    -2000003         3   # BR(~g -> ~s_R* s )
     1.22478265E-02    2     1000005        -5   # BR(~g -> ~b_1  bb)
     1.22478265E-02    2    -1000005         5   # BR(~g -> ~b_1* b )
     5.90908907E-03    2     1000006        -6   # BR(~g -> ~t_1  tb)
     5.90908907E-03    2    -1000006         6   # BR(~g -> ~t_1* t )
#
#         PDG            Width
DECAY   1000006     1.67320057E+01   # stop1 decays
#          BR         NDA      ID1       ID2
     3.27161968E-01    2     1000022         6   # BR(~t_1 -> ~chi_10 t )
     6.72838032E-01    2     1000024         5   # BR(~t_1 -> ~chi_1+ b )
#
#         PDG            Width
DECAY   2000006     8.10704555E+01   # stop2 decays
#          BR         NDA      ID1       ID2
     6.70313865E-03    2     1000022         6   # BR(~t_2 -> ~chi_10 t )
     1.35992602E-02    2     1000024         5   # BR(~t_2 -> ~chi_1+ b )
     1.23000584E-01    2     1000021         6   # BR(~t_2 -> ~g      t )
     1.98768111E-01    2     1000006        25   # BR(~t_2 -> ~t_1    h )
     2.37449907E-01    2     1000006        23   # BR(~t_2 -> ~t_1    Z )
     4.20474287E-01    2     1000005        24   # BR(~t_2 -> ~b_1    W+)
     4.71325705E-06    2     2000005        24   # BR(~t_2 -> ~b_2    W+)
#
#         PDG            Width
DECAY   1000005     1.81698301E+01   # sbottom1 decays
#          BR         NDA      ID1       ID2
     3.39300570E-01    2     1000022         5   # BR(~b_1 -> ~chi_10 b )
     6.60699430E-01    2    -1000024         6   # BR(~b_1 -> ~chi_1- t )
#
#         PDG            Width
DECAY   2000005     5.77001488E+00   # sbottom2 decays
#          BR         NDA      ID1       ID2
     3.71006690E-04    2     1000022         5   # BR(~b_2 -> ~chi_10 b )
     7.29533760E-04    2    -1000024         6   # BR(~b_2 -> ~chi_1- t )
     9.54884555E-01    2     1000021         5   # BR(~b_2 -> ~g      b )
     1.14371146E-02    2     1000005        25   # BR(~b_2 -> ~b_1    h )
     9.65493651E-03    2     1000005        23   # BR(~b_2 -> ~b_1    Z )
     2.29228536E-02    2     1000006       -24   # BR(~b_2 -> ~t_1    W-)
#
#         PDG            Width
DECAY   1000002     7.31538595E+01   # sup_L decays
#          BR         NDA      ID1       ID2
     1.29302175E-01    2     1000022         2   # BR(~u_L -> ~chi_10 u)
     2.58834281E-01    2     1000024         1   # BR(~u_L -> ~chi_1+ d)
     6.11863544E-01    2     1000021         2   # BR(~u_L -> ~g      u)
#
#         PDG            Width
DECAY   2000002     1.25269355E+02   # sup_R decays
#          BR         NDA      ID1       ID2
     1.77046624E-09    2     1000022         2   # BR(~u_R -> ~chi_10 u)
     2.47425531E-05    2     1000023         2   # BR(~u_R -> ~chi_20 u)
     1.57179141E-07    2     1000025         2   # BR(~u_R -> ~chi_30 u)
     2.66495590E-05    2     1000035         2   # BR(~u_R -> ~chi_40 u)
     9.99948449E-01    2     1000021         2   # BR(~u_R -> ~g      u)
#
#         PDG            Width
DECAY   1000001     7.32317507E+01   # sdown_L decays
#          BR         NDA      ID1       ID2
     1.29239863E-01    2     1000022         1   # BR(~d_L -> ~chi_10 d)
     2.58236077E-01    2    -1000024         2   # BR(~d_L -> ~chi_1- u)
     6.12524060E-01    2     1000021         1   # BR(~d_L -> ~g      d)
#
#         PDG            Width
DECAY   2000001     1.42643025E-07   # sdown_R decays
#           BR         NDA      ID1       ID2
     5.41164452E-02    2     1000022         1   # BR(~d_R -> ~chi_10 d)
#           BR         NDA      ID1       ID2       ID3
     4.65406562E-03    3        1       -11        2000011   # BR(~d_R -> d  e+  ~e_R-)
     1.68869105E-01    3        1       11        -2000011   # BR(~d_R -> d  e-  ~e_R+)
     4.57337468E-03    3        1       -13        2000013   # BR(~d_R -> d  mu+  ~mu_R-)
     1.70495543E-01    3        1       13        -2000013   # BR(~d_R -> d  mu-  ~mu_R+)
     1.42102987E-02    3        1       -15        1000015   # BR(~d_R -> d  tau+  ~tau_1-)
     5.81626756E-01    3        1       15        -1000015   # BR(~d_R -> d  tau-  ~tau_1+)
     7.03644639E-06    3        1       23        1000022   # BR(~d_R -> d  Z  ~chi_10)
     4.79350462E-04    3        1       25        1000022   # BR(~d_R -> d  h  ~chi_10)
     5.28220710E-04    3        1       -24        1000024   # BR(~d_R -> d  W-  ~chi_1+)
     4.39804189E-04    3        1       24        -1000024   # BR(~d_R -> d  W+  ~chi_1-)
#
#         PDG            Width
DECAY   1000004     6.39199950E+01   # scharm_L decays
#          BR         NDA      ID1       ID2
     1.54959453E-01    2     1000022         4   # BR(~c_L -> ~chi_10 c)
     3.10194277E-01    2     1000024         3   # BR(~c_L -> ~chi_1+ s)
     5.34846270E-01    2     1000021         4   # BR(~c_L -> ~g      c)
#
#         PDG            Width
DECAY   2000004     9.56809756E+01   # scharm_R decays
#          BR         NDA      ID1       ID2
     2.40924357E-09    2     1000022         4   # BR(~c_R -> ~chi_10 c)
     3.29522654E-05    2     1000023         4   # BR(~c_R -> ~chi_20 c)
     2.09323498E-07    2     1000025         4   # BR(~c_R -> ~chi_30 c)
     3.13875330E-05    2     1000035         4   # BR(~c_R -> ~chi_40 c)
     9.99935448E-01    2     1000021         4   # BR(~c_R -> ~g      c)
#
#         PDG            Width
DECAY   1000003     6.39741005E+01   # sstrange_L decays
#          BR         NDA      ID1       ID2
     1.54916787E-01    2     1000022         3   # BR(~s_L -> ~chi_10 s)
     3.09540958E-01    2    -1000024         4   # BR(~s_L -> ~chi_1- c)
     5.35542255E-01    2     1000021         3   # BR(~s_L -> ~g      s)
#
#         PDG            Width
DECAY   2000003     1.42774089E-07   # sstrange_R decays
#           BR         NDA      ID1       ID2
     5.22975439E-02    2     1000022         3   # BR(~s_R -> ~chi_10 s)
#           BR         NDA      ID1       ID2       ID3
     4.62913127E-03    3        3       -11        2000011   # BR(~s_R -> s  e+  ~e_R-)
     1.71151503E-01    3        3       11        -2000011   # BR(~s_R -> s  e-  ~e_R+)
     4.56917641E-03    3        3       -13        2000013   # BR(~s_R -> s  mu+  ~mu_R-)
     1.69925791E-01    3        3       13        -2000013   # BR(~s_R -> s  mu-  ~mu_R+)
     1.41972539E-02    3        3       -15        1000015   # BR(~s_R -> s  tau+  ~tau_1-)
     5.81779233E-01    3        3       15        -1000015   # BR(~s_R -> s  tau-  ~tau_1+)
     7.02438381E-06    3        3       23        1000022   # BR(~s_R -> s  Z  ~chi_10)
     4.76564063E-04    3        3       25        1000022   # BR(~s_R -> s  h  ~chi_10)
     5.27392614E-04    3        3       -24        1000024   # BR(~s_R -> s  W-  ~chi_1+)
     4.39386449E-04    3        3       24        -1000024   # BR(~s_R -> s  W+  ~chi_1-)
#
#         PDG            Width
DECAY   1000011     4.07310728E+01   # selectron_L decays
#          BR         NDA      ID1       ID2
     3.33245900E-01    2     1000022        11   # BR(~e_L -> ~chi_10 e-)
     1.78199765E-04    2     1000023        11   # BR(~e_L -> ~chi_20 e-)
     9.57837093E-06    2     1000025        11   # BR(~e_L -> ~chi_30 e-)
     3.22381693E-04    2     1000035        11   # BR(~e_L -> ~chi_40 e-)
     6.66046702E-01    2    -1000024        12   # BR(~e_L -> ~chi_1- nu_e)
     1.97237929E-04    2    -1000037        12   # BR(~e_L -> ~chi_2- nu_e)
#
#         PDG            Width
DECAY   2000011     2.87837677E-08   # selectron_R decays
#           BR         NDA      ID1       ID2
     9.60314312E-01    2     1000022        11   # BR(~e_R -> ~chi_10 e-)
#           BR         NDA      ID1       ID2       ID3
     6.31467019E-04    3        11       -15        1000015   # BR(~e_R- -> e-  tau+  ~tau_1-)
     3.80700682E-02    3        11       15        -1000015   # BR(~e_R- -> e-  tau-  ~tau_1+)
     3.36661972E-05    3        11       23        1000022   # BR(~e_R- -> e-  Z  ~chi_10)
     1.21269739E-04    3        11       25        1000022   # BR(~e_R- -> e-  h  ~chi_10)
     4.32952354E-04    3        11       -24        1000024   # BR(~e_R- -> e-  W-  ~chi_1+)
     3.96265010E-04    3        11       24        -1000024   # BR(~e_R- -> e-  W+  ~chi_1-)
#
#         PDG            Width
DECAY   1000013     4.07310728E+01   # smuon_L decays
#          BR         NDA      ID1       ID2
     3.33245900E-01    2     1000022        13   # BR(~mu_L -> ~chi_10 mu-)
     1.78199763E-04    2     1000023        13   # BR(~mu_L -> ~chi_20 mu-)
     9.57837082E-06    2     1000025        13   # BR(~mu_L -> ~chi_30 mu-)
     3.22381482E-04    2     1000035        13   # BR(~mu_L -> ~chi_40 mu-)
     6.66046703E-01    2    -1000024        14   # BR(~mu_L -> ~chi_1- nu_mu)
     1.97237929E-04    2    -1000037        14   # BR(~mu_L -> ~chi_2- nu_mu)
#
#         PDG            Width
DECAY   2000013     2.87872118E-08   # smuon_R decays
#           BR         NDA      ID1       ID2
     9.60199148E-01    2     1000022        13   # BR(~mu_R -> ~chi_10 mu-)
#           BR         NDA      ID1       ID2       ID3
     6.27882969E-04    3        13       -15        1000015   # BR(~mu_R- -> mu-  tau+  ~tau_1-)
     3.81870953E-02    3        13       15        -1000015   # BR(~mu_R- -> mu-  tau-  ~tau_1+)
     3.36420216E-05    3        13       23        1000022   # BR(~mu_R- -> mu-  Z  ~chi_10)
     1.21411550E-04    3        13       25        1000022   # BR(~mu_R- -> mu-  h  ~chi_10)
     4.33108983E-04    3        13       -24        1000024   # BR(~mu_R- -> mu-  W-  ~chi_1+)
     3.97711320E-04    3        13       24        -1000024   # BR(~mu_R- -> mu-  W+  ~chi_1-)
#
#         PDG            Width
DECAY   1000015     4.60035389E-05   # stau_1 decays
#          BR         NDA      ID1       ID2
     3.34062650E-01    2     1000022        15   # BR(~tau_1 -> ~chi_10  tau-)
     6.65937350E-01    2    -1000024        16   # BR(~tau_1 -> ~chi_1-  nu_tau)
#
#         PDG            Width
DECAY   2000015     4.68347584E+01   # stau_2 decays
#          BR         NDA      ID1       ID2
     3.28437276E-01    2     1000022        15   # BR(~tau_2 -> ~chi_10  tau-)
     1.07383044E-03    2     1000023        15   # BR(~tau_2 -> ~chi_20  tau-)
     7.83869253E-04    2     1000025        15   # BR(~tau_2 -> ~chi_30  tau-)
     7.16703988E-03    2     1000035        15   # BR(~tau_2 -> ~chi_40  tau-)
     6.56428901E-01    2    -1000024        16   # BR(~tau_2 -> ~chi_1-  nu_tau)
     3.44015459E-04    2    -1000037        16   # BR(~tau_2 -> ~chi_2-  nu_tau)
     1.93095678E-03    2     1000015        25   # BR(~tau_2 -> ~tau_1   h)
     9.81267446E-04    2     1000015        35   # BR(~tau_2 -> ~tau_1   H)
     9.82679765E-04    2     1000015        36   # BR(~tau_2 -> ~tau_1   A)
     1.87016472E-03    2     1000015        23   # BR(~tau_2 -> ~tau_1   Z)
#
#         PDG            Width
DECAY   1000012     4.07530557E+01   # snu_eL decays
#          BR         NDA      ID1       ID2
     3.33075360E-01    2     1000022        12   # BR(~nu_eL -> ~chi_10 nu_e)
     5.52858615E-07    2     1000023        12   # BR(~nu_eL -> ~chi_20 nu_e)
     1.77403166E-05    2     1000025        12   # BR(~nu_eL -> ~chi_30 nu_e)
     3.16837723E-04    2     1000035        12   # BR(~nu_eL -> ~chi_40 nu_e)
     6.66575640E-01    2     1000024        11   # BR(~nu_eL -> ~chi_1+ e-)
     1.38690949E-05    2     1000037        11   # BR(~nu_eL -> ~chi_2+ e-)
#
#         PDG            Width
DECAY   1000014     4.07530556E+01   # snu_muL decays
#          BR         NDA      ID1       ID2
     3.33075361E-01    2     1000022        14   # BR(~nu_muL -> ~chi_10 nu_mu)
     5.52858615E-07    2     1000023        14   # BR(~nu_muL -> ~chi_20 nu_mu)
     1.77403166E-05    2     1000025        14   # BR(~nu_muL -> ~chi_30 nu_mu)
     3.16837723E-04    2     1000035        14   # BR(~nu_muL -> ~chi_40 nu_mu)
     6.66575639E-01    2     1000024        13   # BR(~nu_muL -> ~chi_1+ mu-)
     1.38690948E-05    2     1000037        13   # BR(~nu_muL -> ~chi_2+ mu-)
#
#         PDG            Width
DECAY   1000016     4.68455520E+01   # snu_tauL decays
#          BR         NDA      ID1       ID2
     3.28395781E-01    2     1000022        16   # BR(~nu_tauL -> ~chi_10 nu_tau)
     9.53935277E-07    2     1000023        16   # BR(~nu_tauL -> ~chi_20 nu_tau)
     3.06420438E-05    2     1000025        16   # BR(~nu_tauL -> ~chi_30 nu_tau)
     7.19992131E-03    2     1000035        16   # BR(~nu_tauL -> ~chi_40 nu_tau)
     6.57222006E-01    2     1000024        15   # BR(~nu_tauL -> ~chi_1+ tau-)
     1.55017913E-03    2     1000037        15   # BR(~nu_tauL -> ~chi_2+ tau-)
     1.96307211E-03    2    -1000015       -37   # BR(~nu_tauL -> ~tau_1+ H-)
     3.63744441E-03    2    -1000015       -24   # BR(~nu_tauL -> ~tau_1+ W-)
#
#         PDG            Width
DECAY   1000024     3.34942180E-15   # chargino1+ decays
#           BR         NDA      ID1       ID2       ID3
     1.97049950E-02    3     1000022       -11        12   # BR(~chi_1+ -> ~chi_10 e+   nu_e)
     2.07759840E-03    3     1000022       -13        14   # BR(~chi_1+ -> ~chi_10 mu+  nu_mu)
     9.78217410E-01    2     1000022       211             # BR(~chi_1+ -> ~chi_10 pi+)
#
#         PDG            Width
DECAY   1000037     4.41206158E+01   # chargino2+ decays
#          BR         NDA      ID1       ID2
     8.44310607E-07    2     1000002        -1   # BR(~chi_2+ -> ~u_L     db)
     1.17812639E-05    2    -1000001         2   # BR(~chi_2+ -> ~d_L*    u )
     8.44306648E-07    2     1000004        -3   # BR(~chi_2+ -> ~c_L     sb)
     1.17803648E-05    2    -1000003         4   # BR(~chi_2+ -> ~s_L*     c )
     3.57405456E-02    2     1000006        -5   # BR(~chi_2+ -> ~t_1     bb)
     1.11176014E-01    2     2000006        -5   # BR(~chi_2+ -> ~t_2     bb)
     4.74927535E-01    2    -1000005         6   # BR(~chi_2+ -> ~b_1*    t )
     1.78076994E-03    2    -2000005         6   # BR(~chi_2+ -> ~b_2*    t )
     1.89021871E-03    2    -1000015        16   # BR(~chi_2+ -> ~tau_1+  nu_tau)
     1.24447221E-01    2     1000024        23   # BR(~chi_2+ -> ~chi_1+  Z )
     1.21191605E-01    2     1000022        24   # BR(~chi_2+ -> ~chi_10  W+)
     1.28820841E-01    2     1000024        25   # BR(~chi_2+ -> ~chi_1+  h )
#
#         PDG            Width
DECAY   1000022     0.00000000E+00   # neutralino1 decays
#
#         PDG            Width
DECAY   1000023     4.26045008E+01   # neutralino2 decays
#          BR         NDA      ID1       ID2
     3.23647545E-02    2     1000022        23   # BR(~chi_20 -> ~chi_10   Z )
     1.25144680E-01    2     1000024       -24   # BR(~chi_20 -> ~chi_1+   W-)
     1.25144680E-01    2    -1000024        24   # BR(~chi_20 -> ~chi_1-   W+)
     1.01094213E-01    2     1000022        25   # BR(~chi_20 -> ~chi_10   h )
     4.46638482E-06    2     1000002        -2   # BR(~chi_20 -> ~u_L      ub)
     4.46638482E-06    2    -1000002         2   # BR(~chi_20 -> ~u_L*     u )
     9.17512506E-07    2     1000001        -1   # BR(~chi_20 -> ~d_L      db)
     9.17512506E-07    2    -1000001         1   # BR(~chi_20 -> ~d_L*     d )
     1.29218656E-04    2     2000001        -1   # BR(~chi_20 -> ~d_R      db)
     1.29218656E-04    2    -2000001         1   # BR(~chi_20 -> ~d_R*     d )
     4.46603303E-06    2     1000004        -4   # BR(~chi_20 -> ~c_L      cb)
     4.46603303E-06    2    -1000004         4   # BR(~chi_20 -> ~c_L*     c )
     9.17512506E-07    2     1000003        -3   # BR(~chi_20 -> ~s _L      sb)
     9.17512506E-07    2    -1000003         3   # BR(~chi_20 -> ~s _L*     s )
     1.29218656E-04    2     2000003        -3   # BR(~chi_20 -> ~s _R      sb)
     1.29218656E-04    2    -2000003         3   # BR(~chi_20 -> ~s _R*     s )
     2.33425729E-01    2     1000006        -6   # BR(~chi_20 -> ~t_1      tb)
     2.33425729E-01    2    -1000006         6   # BR(~chi_20 -> ~t_1*     t )
     6.86737892E-02    2     2000006        -6   # BR(~chi_20 -> ~t_2      tb)
     6.86737892E-02    2    -2000006         6   # BR(~chi_20 -> ~t_2*     t )
     2.42619940E-03    2     1000005        -5   # BR(~chi_20 -> ~b_1      bb)
     2.42619940E-03    2    -1000005         5   # BR(~chi_20 -> ~b_1*     b )
     1.05246526E-03    2     2000005        -5   # BR(~chi_20 -> ~b_2      bb)
     1.05246526E-03    2    -2000005         5   # BR(~chi_20 -> ~b_2*     b )
     4.30812837E-04    2     2000011       -11   # BR(~chi_20 -> ~e_R-     e+)
     4.30812837E-04    2    -2000011        11   # BR(~chi_20 -> ~e_R+     e-)
     4.30812837E-04    2     2000013       -13   # BR(~chi_20 -> ~mu_R-    mu+)
     4.30812837E-04    2    -2000013        13   # BR(~chi_20 -> ~mu_R+    mu-)
     1.41682244E-03    2     1000015       -15   # BR(~chi_20 -> ~tau_1-   tau+)
     1.41682244E-03    2    -1000015        15   # BR(~chi_20 -> ~tau_1+   tau-)
#
#         PDG            Width
DECAY   1000025     4.46833172E+01   # neutralino3 decays
#          BR         NDA      ID1       ID2
     9.18874553E-02    2     1000022        23   # BR(~chi_30 -> ~chi_10   Z )
     1.19623351E-01    2     1000024       -24   # BR(~chi_30 -> ~chi_1+   W-)
     1.19623351E-01    2    -1000024        24   # BR(~chi_30 -> ~chi_1-   W+)
     3.05978479E-02    2     1000022        25   # BR(~chi_30 -> ~chi_10   h )
     6.98300763E-07    2     1000002        -2   # BR(~chi_30 -> ~u_L      ub)
     6.98300763E-07    2    -1000002         2   # BR(~chi_30 -> ~u_L*     u )
     8.43405563E-07    2     1000001        -1   # BR(~chi_30 -> ~d_L      db)
     8.43405563E-07    2    -1000001         1   # BR(~chi_30 -> ~d_L*     d )
     7.85258233E-07    2     2000001        -1   # BR(~chi_30 -> ~d_R      db)
     7.85258233E-07    2    -2000001         1   # BR(~chi_30 -> ~d_R*     d )
     6.98246750E-07    2     1000004        -4   # BR(~chi_30 -> ~c_L      cb)
     6.98246750E-07    2    -1000004         4   # BR(~chi_30 -> ~c_L*     c )
     8.43405563E-07    2     1000003        -3   # BR(~chi_30 -> ~s _L      sb)
     8.43405563E-07    2    -1000003         3   # BR(~chi_30 -> ~s _L*     s )
     7.85258233E-07    2     2000003        -3   # BR(~chi_30 -> ~s _R      sb)
     7.85258233E-07    2    -2000003         3   # BR(~chi_30 -> ~s _R*     s )
     2.71350333E-01    2     1000006        -6   # BR(~chi_30 -> ~t_1      tb)
     2.71350333E-01    2    -1000006         6   # BR(~chi_30 -> ~t_1*     t )
     4.35348609E-02    2     2000006        -6   # BR(~chi_30 -> ~t_2      tb)
     4.35348609E-02    2    -2000006         6   # BR(~chi_30 -> ~t_2*     t )
     2.31070632E-03    2     1000005        -5   # BR(~chi_30 -> ~b_1      bb)
     2.31070632E-03    2    -1000005         5   # BR(~chi_30 -> ~b_1*     b )
     9.90649377E-04    2     2000005        -5   # BR(~chi_30 -> ~b_2      bb)
     9.90649377E-04    2    -2000005         5   # BR(~chi_30 -> ~b_2*     b )
     2.61786349E-06    2     2000011       -11   # BR(~chi_30 -> ~e_R-     e+)
     2.61786349E-06    2    -2000011        11   # BR(~chi_30 -> ~e_R+     e-)
     2.61786349E-06    2     2000013       -13   # BR(~chi_30 -> ~mu_R-    mu+)
     2.61786349E-06    2    -2000013        13   # BR(~chi_30 -> ~mu_R+    mu-)
     9.37558235E-04    2     1000015       -15   # BR(~chi_30 -> ~tau_1-   tau+)
     9.37558235E-04    2    -1000015        15   # BR(~chi_30 -> ~tau_1+   tau-)
#
#         PDG            Width
DECAY   1000035     7.92111974E+01   # neutralino4 decays
#          BR         NDA      ID1       ID2
     7.38455112E-05    2     1000022        23   # BR(~chi_40 -> ~chi_10   Z )
     1.32106186E-04    2     1000023        23   # BR(~chi_40 -> ~chi_20   Z )
     1.95522830E-02    2     1000025        23   # BR(~chi_40 -> ~chi_30   Z )
     2.17879478E-04    2     1000024       -24   # BR(~chi_40 -> ~chi_1+   W-)
     2.17879478E-04    2    -1000024        24   # BR(~chi_40 -> ~chi_1-   W+)
     1.91620786E-02    2     1000037       -24   # BR(~chi_40 -> ~chi_2+   W-)
     1.91620786E-02    2    -1000037        24   # BR(~chi_40 -> ~chi_2-   W+)
     1.46434826E-04    2     1000022        25   # BR(~chi_40 -> ~chi_10   h )
     2.30887497E-06    2     1000022        35   # BR(~chi_40 -> ~chi_10   H )
     4.82927849E-06    2     1000022        36   # BR(~chi_40 -> ~chi_10   A )
     2.12589542E-02    2     1000023        25   # BR(~chi_40 -> ~chi_20   h )
     1.26975288E-04    2     1000025        25   # BR(~chi_40 -> ~chi_30   h )
     7.17050812E-06    2     1000024       -37   # BR(~chi_40 -> ~chi_1+   H-)
     7.17050812E-06    2    -1000024        37   # BR(~chi_40 -> ~chi_1-   H+)
     1.57607451E-03    2     1000002        -2   # BR(~chi_40 -> ~u_L      ub)
     1.57607451E-03    2    -1000002         2   # BR(~chi_40 -> ~u_L*     u )
     1.61303421E-03    2     1000001        -1   # BR(~chi_40 -> ~d_L      db)
     1.61303421E-03    2    -1000001         1   # BR(~chi_40 -> ~d_L*     d )
     3.23102059E-02    2     2000001        -1   # BR(~chi_40 -> ~d_R      db)
     3.23102059E-02    2    -2000001         1   # BR(~chi_40 -> ~d_R*     d )
     1.57607207E-03    2     1000004        -4   # BR(~chi_40 -> ~c_L      cb)
     1.57607207E-03    2    -1000004         4   # BR(~chi_40 -> ~c_L*     c )
     1.61303421E-03    2     1000003        -3   # BR(~chi_40 -> ~s _L      sb)
     1.61303421E-03    2    -1000003         3   # BR(~chi_40 -> ~s _L*     s )
     3.23102059E-02    2     2000003        -3   # BR(~chi_40 -> ~s _R      sb)
     3.23102059E-02    2    -2000003         3   # BR(~chi_40 -> ~s _R*     s )
     1.54721453E-02    2     1000006        -6   # BR(~chi_40 -> ~t_1      tb)
     1.54721453E-02    2    -1000006         6   # BR(~chi_40 -> ~t_1*     t )
     3.90931763E-02    2     2000006        -6   # BR(~chi_40 -> ~t_2      tb)
     3.90931763E-02    2    -2000006         6   # BR(~chi_40 -> ~t_2*     t )
     5.29778266E-03    2     1000005        -5   # BR(~chi_40 -> ~b_1      bb)
     5.29778266E-03    2    -1000005         5   # BR(~chi_40 -> ~b_1*     b )
     1.41580575E-02    2     2000005        -5   # BR(~chi_40 -> ~b_2      bb)
     1.41580575E-02    2    -2000005         5   # BR(~chi_40 -> ~b_2*     b )
     1.04667498E-01    2     2000011       -11   # BR(~chi_40 -> ~e_R-     e+)
     1.04667498E-01    2    -2000011        11   # BR(~chi_40 -> ~e_R+     e-)
     1.04667498E-01    2     2000013       -13   # BR(~chi_40 -> ~mu_R-    mu+)
     1.04667498E-01    2    -2000013        13   # BR(~chi_40 -> ~mu_R+    mu-)
     1.05609219E-01    2     1000015       -15   # BR(~chi_40 -> ~tau_1-   tau+)
     1.05609219E-01    2    -1000015        15   # BR(~chi_40 -> ~tau_1+   tau-)
#
#         PDG            Width
DECAY        25     3.93392304E-03   # h decays
#          BR         NDA      ID1       ID2
     5.75774322E-01    2           5        -5   # BR(h -> b       bb     )
     6.64763940E-02    2         -15        15   # BR(h -> tau+    tau-   )
     2.35300028E-04    2         -13        13   # BR(h -> mu+     mu-    )
     2.56893226E-04    2           3        -3   # BR(h -> s       sb     )
     2.20890895E-02    2           4        -4   # BR(h -> c       cb     )
     8.13413927E-02    2          21        21   # BR(h -> g       g      )
     2.42609873E-03    2          22        22   # BR(h -> gam     gam    )
     1.63618032E-03    2          22        23   # BR(h -> Z       gam    )
     2.21943455E-01    2          24       -24   # BR(h -> W+      W-     )
     2.78208749E-02    2          23        23   # BR(h -> Z       Z      )
#
#         PDG            Width
DECAY        35     4.49085146E+00   # H decays
#          BR         NDA      ID1       ID2
     2.08126420E-01    2           5        -5   # BR(H -> b       bb     )
     3.56967950E-02    2         -15        15   # BR(H -> tau+    tau-   )
     1.26149411E-04    2         -13        13   # BR(H -> mu+     mu-    )
     9.73316647E-05    2           3        -3   # BR(H -> s       sb     )
     7.58753902E-06    2           4        -4   # BR(H -> c       cb     )
     7.41897770E-01    2           6        -6   # BR(H -> t       tb     )
     5.89970904E-04    2          21        21   # BR(H -> g       g      )
     3.20986222E-06    2          22        22   # BR(H -> gam     gam    )
     6.63680555E-07    2          23        22   # BR(H -> Z       gam    )
     5.64563491E-04    2          24       -24   # BR(H -> W+      W-     )
     2.81494553E-04    2          23        23   # BR(H -> Z       Z      )
     1.90157869E-03    2          25        25   # BR(H -> h       h      )
     7.02142566E-03    2     1000024  -1000024   # BR(H -> ~chi_1+ ~chi_1-)
     3.51188092E-03    2     1000022   1000022   # BR(H -> ~chi_10 ~chi_10)
     1.39722041E-05    2     2000001  -2000001   # BR(H -> ~d_R    ~d_R*  )
     1.39722041E-05    2     2000003  -2000003   # BR(H -> ~s_R    ~s_R*  )
     4.55371542E-05    2     2000011  -2000011   # BR(H -> ~e_R-   ~e_R+  )
     4.55371542E-05    2     2000013  -2000013   # BR(H -> ~mu_R-  ~mu_R+ )
     5.41391509E-05    2     1000015  -1000015   # BR(H -> ~tau_1- ~tau_1+)
#
#         PDG            Width
DECAY        36     4.51164981E+00   # A decays
#          BR         NDA      ID1       ID2
     2.07401214E-01    2           5        -5   # BR(A -> b       bb     )
     3.55425989E-02    2         -15        15   # BR(A -> tau+    tau-   )
     1.25604248E-04    2         -13        13   # BR(A -> mu+     mu-    )
     9.71282809E-05    2           3        -3   # BR(A -> s       sb     )
     7.56233844E-06    2           4        -4   # BR(A -> c       cb     )
     7.42175502E-01    2           6        -6   # BR(A -> t       tb     )
     7.32685524E-04    2          21        21   # BR(A -> g       g      )
     2.75672946E-06    2          22        22   # BR(A -> gam     gam    )
     9.09139139E-07    2          23        22   # BR(A -> Z       gam    )
     5.68494916E-04    2          23        25   # BR(A -> Z       h      )
     8.89584472E-03    2     1000024  -1000024   # BR(A -> ~chi_1+ ~chi_1-)
     4.44969933E-03    2     1000022   1000022   # BR(A -> ~chi_10 ~chi_10)
#
#         PDG            Width
DECAY        37     4.42848556E+00   # H+ decays
#          BR         NDA      ID1       ID2
     3.70963833E-04    2           4        -5   # BR(H+ -> c       bb     )
     3.62316771E-02    2         -15        16   # BR(H+ -> tau+    nu_tau )
     1.28039386E-04    2         -13        14   # BR(H+ -> mu+     nu_mu  )
     3.70950800E-06    2           2        -5   # BR(H+ -> u       bb     )
     4.94171595E-06    2           2        -3   # BR(H+ -> u       sb     )
     1.04654992E-04    2           4        -3   # BR(H+ -> c       sb     )
     9.62575275E-01    2           6        -5   # BR(H+ -> t       bb     )
     5.80738131E-04    2          24        25   # BR(H+ -> W+      h      )
     2.18412752E-12    2          24        36   # BR(H+ -> W+      A      )
     1.04163000E-10    2     1000024   1000022   # BR(H+ -> ~chi_1+ ~chi_10)
