#
#                              ======================
#                              | THE SUSYHIT OUTPUT |
#                              ======================
#
#
#              ------------------------------------------------------
#              |     This is the output of the SUSY-HIT package     |
#              |  created by A.Djouadi, M.Muehlleitner and M.Spira. |
#              |  In case of problems with SUSY-HIT email to        |
#              |           margarete.muehlleitner@cern.ch           |
#              |           michael.spira@psi.ch                     |
#              |           abdelhak.djouadi@cern.ch                 |
#              ------------------------------------------------------
#
#              ------------------------------------------------------
#              |  SUSY Les Houches Accord - MSSM Spectrum + Decays  |
#              |              based on the decay programs           |
#              |                                                    |
#              |                     SDECAY 1.3b                    |
#              |                                                    |
#              |  Authors: M.Muhlleitner, A.Djouadi and Y.Mambrini  |
#              |  Ref.:    Comput.Phys.Commun.168(2005)46           |
#              |           [hep-ph/0311167]                         |
#              |                                                    |
#              |                     HDECAY 3.4                     |
#              |                                                    |
#              |  By: A.Djouadi,J.Kalinowski,M.Muhlleitner,M.Spira  |
#              |  Ref.:    Comput.Phys.Commun.108(1998)56           |
#              |           [hep-ph/9704448]                         |
#              |                                                    |
#              |                                                    |
#              |  If not stated otherwise all DRbar couplings and   |
#              |  soft SUSY breaking masses are given at the scale  |
#              |  Q=  0.17552150E+04
#              |                                                    |
#              ------------------------------------------------------
#
#
BLOCK DCINFO  # Decay Program information
     1   SDECAY/HDECAY # decay calculator
     2   1.3b  /3.4    # version number
#
BLOCK SPINFO  # Spectrum calculator information
     1     SOFTSUSY    # spectrum calculator               
     2     3.4.0       # version number                    
#
BLOCK MODSEL  # Model selection
     1     0   #  nonUniversal                                     
#
BLOCK SMINPUTS  # Standard Model inputs
         1     1.27908970E+02   # alpha_em^-1(M_Z)^MSbar
         2     1.16637870E-05   # G_F [GeV^-2]
         3     1.18400000E-01   # alpha_S(M_Z)^MSbar
         4     9.11876000E+01   # M_Z pole mass
         5     4.18000000E+00   # mb(mb)^MSbar
         6     1.73200000E+02   # mt pole mass
         7     1.77700000E+00   # mtau pole mass
#
BLOCK MINPAR  # Input parameters - minimal models
         3     1.13600000E+01   # tanb                
#
BLOCK EXTPAR  # Input parameters - non-minimal models
         0    -1.00000000E+00   # Set                 
         1     4.59920000E+02   # M_1(MX)             
         2    -2.70483000E+03   # M_2(MX)             
         3     1.90724000E+03   # M_3(MX)             
        11    -2.80871000E+03   # At(MX)              
        12    -6.59700000E+02   # Ab(MX)              
        13    -3.96850000E+02   # Atau(MX)            
        23     1.62472000E+03   # mu(MX)              
        26     2.20475000E+03   # mA(pole)            
        31     2.40263000E+03   # meL(MX)             
        32     2.40263000E+03   # mmuL(MX)            
        33     2.68583000E+03   # mtauL(MX)           
        34     3.69243000E+03   # meR(MX)             
        35     3.69243000E+03   # mmuR(MX)            
        36     3.01875000E+03   # mtauR(MX)           
        41     3.56305000E+03   # mqL1(MX)            
        42     3.56305000E+03   # mqL2(MX)            
        43     1.27934000E+03   # mqL3(MX)            
        44     3.54020000E+02   # muR(MX)             
        45     3.54020000E+02   # mcR(MX)             
        46     2.41362000E+03   # mtR(MX)             
        47     3.56130000E+03   # mdR(MX)             
        48     3.56130000E+03   # msR(MX)             
        49     2.14679000E+03   # mbR(MX)             
#
BLOCK MASS  # Mass Spectrum
# PDG code           mass       particle
        24     8.03995832E+01   # W+
        25     1.24837886E+02   # h
        35     2.20472027E+03   # H
        36     2.20474995E+03   # A
        37     2.20630162E+03   # H+
         5     4.81876030E+00   # b-quark pole mass calculated from mb(mb)_Msbar
   1000001     3.60223885E+03   # ~d_L
   2000001     3.59453148E+03   # ~d_R
   1000002     3.60151067E+03   # ~u_L
   2000002     4.72044064E+02   # ~u_R
   1000003     3.60223885E+03   # ~s_L
   2000003     3.59453148E+03   # ~s_R
   1000004     3.60151067E+03   # ~c_L
   2000004     4.72044064E+02   # ~c_R
   1000005     1.36831241E+03   # ~b_1
   2000005     2.20272780E+03   # ~b_2
   1000006     1.35712165E+03   # ~t_1
   2000006     2.42582850E+03   # ~t_2
   1000011     2.41157151E+03   # ~e_L
   2000011     3.70056471E+03   # ~e_R
   1000012     2.40996477E+03   # ~nu_eL
   1000013     2.41157151E+03   # ~mu_L
   2000013     3.70056471E+03   # ~mu_R
   1000014     2.40996477E+03   # ~nu_muL
   1000015     2.69422641E+03   # ~tau_1
   2000015     3.02724956E+03   # ~tau_2
   1000016     2.69285346E+03   # ~nu_tauL
   1000021     2.05481684E+03   # ~g
   1000022     4.55374983E+02   # ~chi_10
   1000023    -1.64789659E+03   # ~chi_20
   1000025     1.65089808E+03   # ~chi_30
   1000035    -2.72458940E+03   # ~chi_40
   1000024     1.64833513E+03   # ~chi_1+
   1000037     2.72475504E+03   # ~chi_2+
#
BLOCK NMIX  # Neutralino Mixing Matrix
  1  1     9.99510640E-01   # N_11
  1  2     3.46177299E-04   # N_12
  1  3     2.94028793E-02   # N_13
  1  4    -1.06691691E-02   # N_14
  2  1    -1.32401448E-02   # N_21
  2  2    -4.60886741E-02   # N_22
  2  3     7.06745584E-01   # N_23
  2  4     7.05840784E-01   # N_24
  3  1    -2.83347921E-02   # N_31
  3  2     1.38548980E-02   # N_32
  3  3     7.06488691E-01   # N_33
  3  4    -7.07021153E-01   # N_34
  4  1    -5.64306871E-04   # N_41
  4  2     9.98841207E-01   # N_42
  4  3     2.28008810E-02   # N_43
  4  4     4.23797747E-02   # N_44
#
BLOCK UMIX  # Chargino Mixing Matrix U
  1  1    -3.24439754E-02   # U_11
  1  2     9.99473556E-01   # U_12
  2  1    -9.99473556E-01   # U_21
  2  2    -3.24439754E-02   # U_22
#
BLOCK VMIX  # Chargino Mixing Matrix V
  1  1     6.04456268E-02   # V_11
  1  2     9.98171491E-01   # V_12
  2  1     9.98171491E-01   # V_21
  2  2    -6.04456268E-02   # V_22
#
BLOCK STOPMIX  # Stop Mixing Matrix
  1  1     9.94388059E-01   # cos(theta_t)
  1  2     1.05794084E-01   # sin(theta_t)
  2  1    -1.05794084E-01   # -sin(theta_t)
  2  2     9.94388059E-01   # cos(theta_t)
#
BLOCK SBOTMIX  # Sbottom Mixing Matrix
  1  1     9.99910883E-01   # cos(theta_b)
  1  2     1.33501333E-02   # sin(theta_b)
  2  1    -1.33501333E-02   # -sin(theta_b)
  2  2     9.99910883E-01   # cos(theta_b)
#
BLOCK STAUMIX  # Stau Mixing Matrix
  1  1     9.99860034E-01   # cos(theta_tau)
  1  2     1.67305831E-02   # sin(theta_tau)
  2  1    -1.67305831E-02   # -sin(theta_tau)
  2  2     9.99860034E-01   # cos(theta_tau)
#
BLOCK ALPHA  # Higgs mixing
          -9.17997078E-02   # Mixing angle in the neutral Higgs boson sector
#
BLOCK HMIX Q=  1.75521500E+03  # DRbar Higgs Parameters
         1     1.64381811E+03   # mu(Q)MSSM           
         2     1.09044427E+01   # tan                 
         3     2.43763132E+02   # higgs               
         4     5.09539598E+06   # mA^2(Q)MSSM         
#
BLOCK GAUGE Q=  1.75521500E+03  # The gauge couplings
     1     3.63172541E-01   # gprime(Q) DRbar
     2     6.34711839E-01   # g(Q) DRbar
     3     1.03036462E+00   # g3(Q) DRbar
#
BLOCK AU Q=  1.75521500E+03  # The trilinear couplings
  1  1     0.00000000E+00   # A_u(Q) DRbar
  2  2     0.00000000E+00   # A_c(Q) DRbar
  3  3    -2.80871000E+03   # A_t(Q) DRbar
#
BLOCK AD Q=  1.75521500E+03  # The trilinear couplings
  1  1     0.00000000E+00   # A_d(Q) DRbar
  2  2     0.00000000E+00   # A_s(Q) DRbar
  3  3    -6.59699999E+02   # A_b(Q) DRbar
#
BLOCK AE Q=  1.75521500E+03  # The trilinear couplings
  1  1     0.00000000E+00   # A_e(Q) DRbar
  2  2     0.00000000E+00   # A_mu(Q) DRbar
  3  3    -3.96850000E+02   # A_tau(Q) DRbar
#
BLOCK Yu Q=  1.75521500E+03  # The Yukawa couplings
  1  1     0.00000000E+00   # y_u(Q) DRbar
  2  2     0.00000000E+00   # y_c(Q) DRbar
  3  3     8.33512670E-01   # y_t(Q) DRbar
#
BLOCK Yd Q=  1.75521500E+03  # The Yukawa couplings
  1  1     0.00000000E+00   # y_d(Q) DRbar
  2  2     0.00000000E+00   # y_s(Q) DRbar
  3  3     1.37684537E-01   # y_b(Q) DRbar
#
BLOCK Ye Q=  1.75521500E+03  # The Yukawa couplings
  1  1     0.00000000E+00   # y_e(Q) DRbar
  2  2     0.00000000E+00   # y_mu(Q) DRbar
  3  3     1.09880677E-01   # y_tau(Q) DRbar
#
BLOCK MSOFT Q=  1.75521500E+03  # The soft SUSY breaking masses at the scale Q
         1     4.59920000E+02   # M_1(Q)              
         2    -2.70483000E+03   # M_2(Q)              
         3     1.90724000E+03   # M_3(Q)              
        21     2.09373923E+06   # mH1^2(Q)            
        22    -2.63892423E+06   # mH2^2(Q)            
        31     2.40263000E+03   # meL(Q)              
        32     2.40263000E+03   # mmuL(Q)             
        33     2.68583000E+03   # mtauL(Q)            
        34     3.69243000E+03   # meR(Q)              
        35     3.69243000E+03   # mmuR(Q)             
        36     3.01875000E+03   # mtauR(Q)            
        41     3.56305000E+03   # mqL1(Q)             
        42     3.56305000E+03   # mqL2(Q)             
        43     1.27933999E+03   # mqL3(Q)             
        44     3.54019986E+02   # muR(Q)              
        45     3.54019986E+02   # mcR(Q)              
        46     2.41361999E+03   # mtR(Q)              
        47     3.56130000E+03   # mdR(Q)              
        48     3.56130000E+03   # msR(Q)              
        49     2.14679000E+03   # mbR(Q)              
#
Block HiggsBoundsInputHiggsCouplingsFermions
# ScalarNormEffCoupSq PseudoSNormEffCoupSq NP   IP1 IP2 IP2
    1.00764224E+00    0.00000000E+00        3  25   5   5  # h0-b-b eff. coupling^2, normalised to SM
    1.18899228E+02    0.00000000E+00        3  35   5   5  # H0-b-b eff. coupling^2, normalised to SM
    0.00000000E+00    1.18906871E+02        3  36   5   5  # A0-b-b eff. coupling^2, normalised to SM
#
    9.99935729E-01    0.00000000E+00        3  25   6   6  # h0-t-t eff. coupling^2, normalised to SM
    8.47421374E-03    0.00000000E+00        3  35   6   6  # H0-t-t eff. coupling^2, normalised to SM
    0.00000000E+00    8.40994297E-03        3  36   6   6  # A0-t-t eff. coupling^2, normalised to SM
#
    1.00764224E+00    0.00000000E+00        3  25  15  15  # h0-tau-tau eff. coupling^2, normalised to SM
    1.18899228E+02    0.00000000E+00        3  35  15  15  # H0-tau-tau eff. coupling^2, normalised to SM
    0.00000000E+00    1.18906871E+02        3  36  15  15  # A0-tau-tau eff. coupling^2, normalised to SM
#
Block HiggsBoundsInputHiggsCouplingsBosons
    9.99999878E-01        3  25  24  24  # h0-W-W eff. coupling^2, normalised to SM
    1.22330065E-07        3  35  24  24  # H0-W-W eff. coupling^2, normalised to SM
    0.00000000E+00        3  36  24  24  # A0-W-W eff. coupling^2, normalised to SM
#
    9.99999878E-01        3  25  23  23  # h0-Z-Z eff. coupling^2, normalised to SM
    1.22330065E-07        3  35  23  23  # H0-Z-Z eff. coupling^2, normalised to SM
    0.00000000E+00        3  36  23  23  # A0-Z-Z eff. coupling^2, normalised to SM
#
    8.79038276E-01        3  25  21  21  # h0-g-g eff. coupling^2, normalised to SM
    3.62024636E-12        3  35  21  21  # H0-g-g eff. coupling^2, normalised to SM
    4.79019309E-11        3  36  21  21  # A0-g-g eff. coupling^2, normalised to SM
#
    0.00000000E+00        3  25  25  23  # h0-h0-Z eff. coupling^2, normalised to SM
    0.00000000E+00        3  35  25  23  # H0-h0-Z eff. coupling^2, normalised to SM
    1.22330065E-07        3  36  25  23  # A0-h0-Z eff. coupling^2, normalised to SM
    0.00000000E+00        3  35  35  23  # H0-H0-Z eff. coupling^2, normalised to SM
    9.99999878E-01        3  36  35  23  # A0-H0-Z eff. coupling^2, normalised to SM
    0.00000000E+00        3  36  36  23  # A0-A0-Z eff. coupling^2, normalised to SM
#
    0.00000000E+00        4  25  21  21  23  # h0-g-g-Z eff. coupling^2, normalised to SM
    0.00000000E+00        4  35  21  21  23  # H0-g-g-Z eff. coupling^2, normalised to SM
    0.00000000E+00        4  36  21  21  23  # A0-g-g-Z eff. coupling^2, normalised to SM
#
#
#
#                             =================
#                             |The decay table|
#                             =================
#
# - The QCD corrections to the decays gluino -> squark  + quark
#                                     squark -> gaugino + quark_prime
#                                     squark -> squark_prime + Higgs
#                                     squark -> gluino  + quark
#   are included.
#
# - The multi-body decays for the inos, stops and sbottoms are included.
#
# - The loop induced decays for the gluino, neutralinos and stops
#   are included.
#
# - The SUSY decays of the top quark are included.
#
#
#         PDG            Width
DECAY         6     1.41838376E+00   # top decays
#          BR         NDA      ID1       ID2
     1.00000000E+00    2           5        24   # BR(t ->  b    W+)
#
#         PDG            Width
DECAY   1000021     9.04064306E+01   # gluino decays
#          BR         NDA      ID1       ID2
     1.79240565E-01    2     2000002        -2   # BR(~g -> ~u_R  ub)
     1.79240565E-01    2    -2000002         2   # BR(~g -> ~u_R* u )
     1.79240550E-01    2     2000004        -4   # BR(~g -> ~c_R  cb)
     1.79240550E-01    2    -2000004         4   # BR(~g -> ~c_R* c )
     7.26991702E-02    2     1000005        -5   # BR(~g -> ~b_1  bb)
     7.26991702E-02    2    -1000005         5   # BR(~g -> ~b_1* b )
     6.88197154E-02    2     1000006        -6   # BR(~g -> ~t_1  tb)
     6.88197154E-02    2    -1000006         6   # BR(~g -> ~t_1* t )
#
#         PDG            Width
DECAY   1000006     2.01470937E-01   # stop1 decays
#          BR         NDA      ID1       ID2
     1.00000000E+00    2     1000022         6   # BR(~t_1 -> ~chi_10 t )
#
#         PDG            Width
DECAY   2000006     9.62077624E+01   # stop2 decays
#          BR         NDA      ID1       ID2
     5.31781911E-02    2     1000022         6   # BR(~t_2 -> ~chi_10 t )
     4.71555705E-02    2     1000023         6   # BR(~t_2 -> ~chi_20 t )
     5.08281265E-02    2     1000025         6   # BR(~t_2 -> ~chi_30 t )
     1.00509030E-01    2     1000024         5   # BR(~t_2 -> ~chi_1+ b )
     8.93189818E-02    2     1000021         6   # BR(~t_2 -> ~g      t )
     1.67447382E-01    2     1000006        25   # BR(~t_2 -> ~t_1    h )
     1.68315932E-01    2     1000006        23   # BR(~t_2 -> ~t_1    Z )
     3.23245982E-01    2     1000005        24   # BR(~t_2 -> ~b_1    W+)
     8.04394501E-07    2     2000005        24   # BR(~t_2 -> ~b_2    W+)
#
#         PDG            Width
DECAY   1000005     1.57970158E-01   # sbottom1 decays
#          BR         NDA      ID1       ID2
     1.00000000E+00    2     1000022         5   # BR(~b_1 -> ~chi_10 b )
#
#         PDG            Width
DECAY   2000005     4.14298526E+00   # sbottom2 decays
#          BR         NDA      ID1       ID2
     2.83649839E-01    2     1000022         5   # BR(~b_2 -> ~chi_10 b )
     1.93255459E-02    2     1000023         5   # BR(~b_2 -> ~chi_20 b )
     1.93611859E-02    2     1000025         5   # BR(~b_2 -> ~chi_30 b )
     3.79582366E-02    2    -1000024         6   # BR(~b_2 -> ~chi_1- t )
     5.03723627E-01    2     1000021         5   # BR(~b_2 -> ~g      b )
     3.62262014E-02    2     1000005        25   # BR(~b_2 -> ~b_1    h )
     3.34140713E-02    2     1000005        23   # BR(~b_2 -> ~b_1    Z )
     6.63412931E-02    2     1000006       -24   # BR(~b_2 -> ~t_1    W-)
#
#         PDG            Width
DECAY   1000002     1.25929384E+02   # sup_L decays
#          BR         NDA      ID1       ID2
     3.89231056E-03    2     1000022         2   # BR(~u_L -> ~chi_10 u)
     1.63606551E-04    2     1000023         2   # BR(~u_L -> ~chi_20 u)
     4.93432058E-06    2     1000025         2   # BR(~u_L -> ~chi_30 u)
     2.04842042E-02    2     1000035         2   # BR(~u_L -> ~chi_40 u)
     5.05728378E-04    2     1000024         1   # BR(~u_L -> ~chi_1+ d)
     4.09091769E-02    2     1000037         1   # BR(~u_L -> ~chi_2+ d)
     9.34040039E-01    2     1000021         2   # BR(~u_L -> ~g      u)
#
#         PDG            Width
DECAY   2000002     6.00684773E-03   # sup_R decays
#          BR         NDA      ID1       ID2
     1.00000000E+00    2     1000022         2   # BR(~u_R -> ~chi_10 u)
#
#         PDG            Width
DECAY   1000001     1.25973264E+02   # sdown_L decays
#          BR         NDA      ID1       ID2
     3.86364338E-03    2     1000022         1   # BR(~d_L -> ~chi_10 d)
     1.31387063E-04    2     1000023         1   # BR(~d_L -> ~chi_20 d)
     2.56301690E-05    2     1000025         1   # BR(~d_L -> ~chi_30 d)
     2.05119224E-02    2     1000035         1   # BR(~d_L -> ~chi_40 d)
     1.45708796E-04    2    -1000024         2   # BR(~d_L -> ~chi_1- u)
     4.10537889E-02    2    -1000037         2   # BR(~d_L -> ~chi_2- u)
     9.34267919E-01    2     1000021         1   # BR(~d_L -> ~g      d)
#
#         PDG            Width
DECAY   2000001     1.18905752E+02   # sdown_R decays
#          BR         NDA      ID1       ID2
     1.63945725E-02    2     1000022         1   # BR(~d_R -> ~chi_10 d)
     1.86267340E-06    2     1000023         1   # BR(~d_R -> ~chi_20 d)
     8.51442418E-06    2     1000025         1   # BR(~d_R -> ~chi_30 d)
     9.95525512E-10    2     1000035         1   # BR(~d_R -> ~chi_40 d)
     9.83595049E-01    2     1000021         1   # BR(~d_R -> ~g      d)
#
#         PDG            Width
DECAY   1000004     1.00768931E+02   # scharm_L decays
#          BR         NDA      ID1       ID2
     5.05817480E-03    2     1000022         4   # BR(~c_L -> ~chi_10 c)
     2.11588526E-04    2     1000023         4   # BR(~c_L -> ~chi_20 c)
     6.38133767E-06    2     1000025         4   # BR(~c_L -> ~chi_30 c)
     2.61314956E-02    2     1000035         4   # BR(~c_L -> ~chi_40 c)
     6.54045522E-04    2     1000024         3   # BR(~c_L -> ~chi_1+ s)
     5.21872994E-02    2     1000037         3   # BR(~c_L -> ~chi_2+ s)
     9.15751015E-01    2     1000021         4   # BR(~c_L -> ~g      c)
#
#         PDG            Width
DECAY   2000004     5.26981804E-03   # scharm_R decays
#          BR         NDA      ID1       ID2
     1.00000000E+00    2     1000022         4   # BR(~c_R -> ~chi_10 c)
#
#         PDG            Width
DECAY   1000003     1.00796721E+02   # sstrange_L decays
#          BR         NDA      ID1       ID2
     5.02126551E-03    2     1000022         3   # BR(~s_L -> ~chi_10 s)
     1.69932049E-04    2     1000023         3   # BR(~s_L -> ~chi_20 s)
     3.31487461E-05    2     1000025         3   # BR(~s_L -> ~chi_30 s)
     2.61691837E-02    2     1000035         3   # BR(~s_L -> ~chi_40 s)
     1.88454827E-04    2    -1000024         4   # BR(~s_L -> ~chi_1- c)
     5.23762445E-02    2    -1000037         4   # BR(~s_L -> ~chi_2- c)
     9.16041771E-01    2     1000021         3   # BR(~s_L -> ~g      s)
#
#         PDG            Width
DECAY   2000003     9.37838075E+01   # sstrange_R decays
#          BR         NDA      ID1       ID2
     2.16162159E-02    2     1000022         3   # BR(~s_R -> ~chi_10 s)
     2.44404018E-06    2     1000023         3   # BR(~s_R -> ~chi_20 s)
     1.11717136E-05    2     1000025         3   # BR(~s_R -> ~chi_30 s)
     1.28828985E-09    2     1000035         3   # BR(~s_R -> ~chi_40 s)
     9.78370167E-01    2     1000021         3   # BR(~s_R -> ~g      s)
#
#         PDG            Width
DECAY   1000011     2.95669945E+00   # selectron_L decays
#          BR         NDA      ID1       ID2
     9.95366757E-01    2     1000022        11   # BR(~e_L -> ~chi_10 e-)
     2.67469947E-03    2     1000023        11   # BR(~e_L -> ~chi_20 e-)
     5.13041053E-06    2     1000025        11   # BR(~e_L -> ~chi_30 e-)
     1.95341301E-03    2    -1000024        12   # BR(~e_L -> ~chi_1- nu_e)
#
#         PDG            Width
DECAY   2000011     1.88302869E+01   # selectron_R decays
#          BR         NDA      ID1       ID2
     9.99352508E-01    2     1000022        11   # BR(~e_R -> ~chi_10 e-)
     1.16199929E-04    2     1000023        11   # BR(~e_R -> ~chi_20 e-)
     5.31222849E-04    2     1000025        11   # BR(~e_R -> ~chi_30 e-)
     6.88653313E-08    2     1000035        11   # BR(~e_R -> ~chi_40 e-)
#
#         PDG            Width
DECAY   1000013     2.95669944E+00   # smuon_L decays
#          BR         NDA      ID1       ID2
     9.95366757E-01    2     1000022        13   # BR(~mu_L -> ~chi_10 mu-)
     2.67469944E-03    2     1000023        13   # BR(~mu_L -> ~chi_20 mu-)
     5.13041048E-06    2     1000025        13   # BR(~mu_L -> ~chi_30 mu-)
     1.95341301E-03    2    -1000024        14   # BR(~mu_L -> ~chi_1- nu_mu)
#
#         PDG            Width
DECAY   2000013     1.88302868E+01   # smuon_R decays
#          BR         NDA      ID1       ID2
     9.99352508E-01    2     1000022        13   # BR(~mu_R -> ~chi_10 mu-)
     1.16199929E-04    2     1000023        13   # BR(~mu_R -> ~chi_20 mu-)
     5.31222849E-04    2     1000025        13   # BR(~mu_R -> ~chi_30 mu-)
     6.88653309E-08    2     1000035        13   # BR(~mu_R -> ~chi_40 mu-)
#
#         PDG            Width
DECAY   1000015     3.61693708E+00   # stau_1 decays
#          BR         NDA      ID1       ID2
     9.23780581E-01    2     1000022        15   # BR(~tau_1 -> ~chi_10  tau-)
     3.86672631E-02    2     1000023        15   # BR(~tau_1 -> ~chi_20  tau-)
     3.46340707E-02    2     1000025        15   # BR(~tau_1 -> ~chi_30  tau-)
     2.91808501E-03    2    -1000024        16   # BR(~tau_1 -> ~chi_1-  nu_tau)
#
#         PDG            Width
DECAY   2000015     1.59622694E+01   # stau_2 decays
#          BR         NDA      ID1       ID2
     9.49537905E-01    2     1000022        15   # BR(~tau_2 -> ~chi_10  tau-)
     1.12674406E-02    2     1000023        15   # BR(~tau_2 -> ~chi_20  tau-)
     1.16878506E-02    2     1000025        15   # BR(~tau_2 -> ~chi_30  tau-)
     1.36320584E-05    2     1000035        15   # BR(~tau_2 -> ~chi_40  tau-)
     2.23754352E-02    2    -1000024        16   # BR(~tau_2 -> ~chi_1-  nu_tau)
     2.73396385E-05    2    -1000037        16   # BR(~tau_2 -> ~chi_2-  nu_tau)
     2.50728914E-03    2     1000016       -24   # BR(~tau_2 -> ~nu_tauL W-)
     1.33966725E-03    2     1000015        25   # BR(~tau_2 -> ~tau_1   h)
     1.24344010E-03    2     1000015        23   # BR(~tau_2 -> ~tau_1   Z)
#
#         PDG            Width
DECAY   1000012     2.96014543E+00   # snu_eL decays
#          BR         NDA      ID1       ID2
     9.91045173E-01    2     1000022        12   # BR(~nu_eL -> ~chi_10 nu_e)
     1.37183504E-03    2     1000023        12   # BR(~nu_eL -> ~chi_20 nu_e)
     8.30813172E-04    2     1000025        12   # BR(~nu_eL -> ~chi_30 nu_e)
     6.75217876E-03    2     1000024        11   # BR(~nu_eL -> ~chi_1+ e-)
#
#         PDG            Width
DECAY   1000014     2.96014543E+00   # snu_muL decays
#          BR         NDA      ID1       ID2
     9.91045173E-01    2     1000022        14   # BR(~nu_muL -> ~chi_10 nu_mu)
     1.37183504E-03    2     1000023        14   # BR(~nu_muL -> ~chi_20 nu_mu)
     8.30813172E-04    2     1000025        14   # BR(~nu_muL -> ~chi_30 nu_mu)
     6.75217867E-03    2     1000024        13   # BR(~nu_muL -> ~chi_1+ mu-)
#
#         PDG            Width
DECAY   1000016     3.62027536E+00   # snu_tauL decays
#          BR         NDA      ID1       ID2
     9.18851912E-01    2     1000022        16   # BR(~nu_tauL -> ~chi_10 nu_tau)
     1.72986208E-03    2     1000023        16   # BR(~nu_tauL -> ~chi_20 nu_tau)
     1.04978514E-03    2     1000025        16   # BR(~nu_tauL -> ~chi_30 nu_tau)
     7.83684404E-02    2     1000024        15   # BR(~nu_tauL -> ~chi_1+ tau-)
#
#         PDG            Width
DECAY   1000024     3.94396858E+00   # chargino1+ decays
#          BR         NDA      ID1       ID2
     2.77697587E-02    2     1000006        -5   # BR(~chi_1+ -> ~t_1     bb)
     7.02108637E-01    2    -1000005         6   # BR(~chi_1+ -> ~b_1*    t )
     2.70121605E-01    2     1000022        24   # BR(~chi_1+ -> ~chi_10  W+)
#
#         PDG            Width
DECAY   1000037     5.35538159E+01   # chargino2+ decays
#          BR         NDA      ID1       ID2
     3.46536935E-01    2     1000006        -5   # BR(~chi_2+ -> ~t_1     bb)
     1.87381738E-05    2     2000006        -5   # BR(~chi_2+ -> ~t_2     bb)
     3.33310482E-01    2    -1000005         6   # BR(~chi_2+ -> ~b_1*    t )
     2.80689097E-05    2    -2000005         6   # BR(~chi_2+ -> ~b_2*    t )
     9.62868449E-03    2     1000012       -11   # BR(~chi_2+ -> ~nu_eL   e+  )
     9.62868449E-03    2     1000014       -13   # BR(~chi_2+ -> ~nu_muL mu+ )
     1.09989463E-04    2     1000016       -15   # BR(~chi_2+ -> ~nu_tau1 tau+)
     9.56150446E-03    2    -1000011        12   # BR(~chi_2+ -> ~e_L+    nu_e)
     9.56150446E-03    2    -1000013        14   # BR(~chi_2+ -> ~mu_L+   nu_mu)
     1.01081074E-04    2    -1000015        16   # BR(~chi_2+ -> ~tau_1+  nu_tau)
     7.16351445E-02    2     1000024        23   # BR(~chi_2+ -> ~chi_1+  Z )
     2.26599656E-04    2     1000022        24   # BR(~chi_2+ -> ~chi_10  W+)
     6.77726374E-02    2     1000023        24   # BR(~chi_2+ -> ~chi_20  W+)
     6.91123693E-02    2     1000025        24   # BR(~chi_2+ -> ~chi_30  W+)
     7.27630279E-02    2     1000024        25   # BR(~chi_2+ -> ~chi_1+  h )
     4.54920301E-06    2     1000022        37   # BR(~chi_2+ -> ~chi_10  H+)
#
#         PDG            Width
DECAY   1000022     0.00000000E+00   # neutralino1 decays
#
#         PDG            Width
DECAY   1000023     3.85911517E+00   # neutralino2 decays
#          BR         NDA      ID1       ID2
     2.32848465E-01    2     1000022        23   # BR(~chi_20 -> ~chi_10   Z )
     5.38946474E-02    2     1000022        25   # BR(~chi_20 -> ~chi_10   h )
     2.18056025E-04    2     2000002        -2   # BR(~chi_20 -> ~u_R      ub)
     2.18056025E-04    2    -2000002         2   # BR(~chi_20 -> ~u_R*     u )
     2.18055984E-04    2     2000004        -4   # BR(~chi_20 -> ~c_R      cb)
     2.18055984E-04    2    -2000004         4   # BR(~chi_20 -> ~c_R*     c )
     3.44127241E-01    2     1000006        -6   # BR(~chi_20 -> ~t_1      tb)
     3.44127241E-01    2    -1000006         6   # BR(~chi_20 -> ~t_1*     t )
     1.20650908E-02    2     1000005        -5   # BR(~chi_20 -> ~b_1      bb)
     1.20650908E-02    2    -1000005         5   # BR(~chi_20 -> ~b_1*     b )
#
#         PDG            Width
DECAY   1000025     4.61065379E+00   # neutralino3 decays
#          BR         NDA      ID1       ID2
     4.33377957E-02    2     1000022        23   # BR(~chi_30 -> ~chi_10   Z )
     2.05728751E-01    2     1000022        25   # BR(~chi_30 -> ~chi_10   h )
     8.37837230E-04    2     2000002        -2   # BR(~chi_30 -> ~u_R      ub)
     8.37837230E-04    2    -2000002         2   # BR(~chi_30 -> ~u_R*     u )
     8.37837076E-04    2     2000004        -4   # BR(~chi_30 -> ~c_R      cb)
     8.37837076E-04    2    -2000004         4   # BR(~chi_30 -> ~c_R*     c )
     3.63871047E-01    2     1000006        -6   # BR(~chi_30 -> ~t_1      tb)
     3.63871047E-01    2    -1000006         6   # BR(~chi_30 -> ~t_1*     t )
     9.92000552E-03    2     1000005        -5   # BR(~chi_30 -> ~b_1      bb)
     9.92000552E-03    2    -1000005         5   # BR(~chi_30 -> ~b_1*     b )
#
#         PDG            Width
DECAY   1000035     5.37099331E+01   # neutralino4 decays
#          BR         NDA      ID1       ID2
     1.39250147E-04    2     1000022        23   # BR(~chi_40 -> ~chi_10   Z )
     5.90862767E-03    2     1000023        23   # BR(~chi_40 -> ~chi_20   Z )
     6.41434529E-02    2     1000025        23   # BR(~chi_40 -> ~chi_30   Z )
     7.05350717E-02    2     1000024       -24   # BR(~chi_40 -> ~chi_1+   W-)
     7.05350717E-02    2    -1000024        24   # BR(~chi_40 -> ~chi_1-   W+)
     8.95048397E-05    2     1000022        25   # BR(~chi_40 -> ~chi_10   h )
     1.12076005E-07    2     1000022        35   # BR(~chi_40 -> ~chi_10   H )
     4.51554059E-06    2     1000022        36   # BR(~chi_40 -> ~chi_10   A )
     6.66177906E-02    2     1000023        25   # BR(~chi_40 -> ~chi_20   h )
     5.75482407E-03    2     1000025        25   # BR(~chi_40 -> ~chi_30   h )
     5.07734479E-08    2     2000002        -2   # BR(~chi_40 -> ~u_R      ub)
     5.07734479E-08    2    -2000002         2   # BR(~chi_40 -> ~u_R*     u )
     5.07734467E-08    2     2000004        -4   # BR(~chi_40 -> ~c_R      cb)
     5.07734467E-08    2    -2000004         4   # BR(~chi_40 -> ~c_R*     c )
     1.68785850E-01    2     1000006        -6   # BR(~chi_40 -> ~t_1      tb)
     1.68785850E-01    2    -1000006         6   # BR(~chi_40 -> ~t_1*     t )
     6.01002411E-06    2     2000006        -6   # BR(~chi_40 -> ~t_2      tb)
     6.01002411E-06    2    -2000006         6   # BR(~chi_40 -> ~t_2*     t )
     1.70107293E-01    2     1000005        -5   # BR(~chi_40 -> ~b_1      bb)
     1.70107293E-01    2    -1000005         5   # BR(~chi_40 -> ~b_1*     b )
     1.51295113E-05    2     2000005        -5   # BR(~chi_40 -> ~b_2      bb)
     1.51295113E-05    2    -2000005         5   # BR(~chi_40 -> ~b_2*     b )
     4.75327770E-03    2     1000011       -11   # BR(~chi_40 -> ~e_L-     e+)
     4.75327770E-03    2    -1000011        11   # BR(~chi_40 -> ~e_L+     e-)
     4.75327770E-03    2     1000013       -13   # BR(~chi_40 -> ~mu_L-    mu+)
     4.75327770E-03    2    -1000013        13   # BR(~chi_40 -> ~mu_L+    mu-)
     4.97089483E-05    2     1000015       -15   # BR(~chi_40 -> ~tau_1-   tau+)
     4.97089483E-05    2    -1000015        15   # BR(~chi_40 -> ~tau_1+   tau-)
     4.80540622E-03    2     1000012       -12   # BR(~chi_40 -> ~nu_eL    nu_eb)
     4.80540622E-03    2    -1000012        12   # BR(~chi_40 -> ~nu_eL*   nu_e )
     4.80540622E-03    2     1000014       -14   # BR(~chi_40 -> ~nu_muL   nu_mub)
     4.80540622E-03    2    -1000014        14   # BR(~chi_40 -> ~nu_muL*  nu_mu )
     5.44290309E-05    2     1000016       -16   # BR(~chi_40 -> ~nu_tau1  nu_taub)
     5.44290309E-05    2    -1000016        16   # BR(~chi_40 -> ~nu_tau1* nu_tau )
#
#         PDG            Width
DECAY        25     4.26543416E-03   # h decays
#          BR         NDA      ID1       ID2
     6.23041290E-01    2           5        -5   # BR(h -> b       bb     )
     6.10515315E-02    2         -15        15   # BR(h -> tau+    tau-   )
     2.16102081E-04    2         -13        13   # BR(h -> mu+     mu-    )
     2.35860196E-04    2           3        -3   # BR(h -> s       sb     )
     2.03106582E-02    2           4        -4   # BR(h -> c       cb     )
     7.41064031E-02    2          21        21   # BR(h -> g       g      )
     2.19960008E-03    2          22        22   # BR(h -> gam     gam    )
     1.44376326E-03    2          22        23   # BR(h -> Z       gam    )
     1.93294824E-01    2          24       -24   # BR(h -> W+      W-     )
     2.40999671E-02    2          23        23   # BR(h -> Z       Z      )
#
#         PDG            Width
DECAY        35     4.62476854E+00   # H decays
#          BR         NDA      ID1       ID2
     6.42681321E-01    2           5        -5   # BR(H -> b       bb     )
     1.20743957E-01    2         -15        15   # BR(H -> tau+    tau-   )
     4.27626361E-04    2         -13        13   # BR(H -> mu+     mu-    )
     2.54749974E-04    2           3        -3   # BR(H -> s       sb     )
     1.72852636E-06    2           4        -4   # BR(H -> c       cb     )
     1.68192174E-01    2           6        -6   # BR(H -> t       tb     )
     7.98428832E-05    2          21        21   # BR(H -> g       g      )
     3.04637850E-07    2          22        22   # BR(H -> gam     gam    )
     1.28526495E-07    2          23        22   # BR(H -> Z       gam    )
     9.07357001E-05    2          24       -24   # BR(H -> W+      W-     )
     4.52174021E-05    2          23        23   # BR(H -> Z       Z      )
     4.49614111E-04    2          25        25   # BR(H -> h       h      )
     6.99137852E-04    2     1000022   1000022   # BR(H -> ~chi_10 ~chi_10)
     6.12128209E-02    2     1000022   1000023   # BR(H -> ~chi_10 ~chi_20)
     5.08534278E-03    2     1000022   1000025   # BR(H -> ~chi_10 ~chi_30)
     1.76492523E-05    2     2000002  -2000002   # BR(H -> ~u_R    ~u_R*  )
     1.76492523E-05    2     2000004  -2000004   # BR(H -> ~c_R    ~c_R*  )
#
#         PDG            Width
DECAY        36     4.62634292E+00   # A decays
#          BR         NDA      ID1       ID2
     6.42677137E-01    2           5        -5   # BR(A -> b       bb     )
     1.20712458E-01    2         -15        15   # BR(A -> tau+    tau-   )
     4.27513673E-04    2         -13        13   # BR(A -> mu+     mu-    )
     2.54834199E-04    2           3        -3   # BR(A -> s       sb     )
     1.73066152E-06    2           4        -4   # BR(A -> c       cb     )
     1.69698841E-01    2           6        -6   # BR(A -> t       tb     )
     2.90353749E-04    2          21        21   # BR(A -> g       g      )
     7.00198043E-07    2          22        22   # BR(A -> gam     gam    )
     2.98899107E-07    2          23        22   # BR(A -> Z       gam    )
     9.16266943E-05    2          23        25   # BR(A -> Z       h      )
     9.63058204E-04    2     1000022   1000022   # BR(A -> ~chi_10 ~chi_10)
     5.39346473E-03    2     1000022   1000023   # BR(A -> ~chi_10 ~chi_20)
     5.94879832E-02    2     1000022   1000025   # BR(A -> ~chi_10 ~chi_30)
#
#         PDG            Width
DECAY        37     4.27297825E+00   # H+ decays
#          BR         NDA      ID1       ID2
     1.03602503E-03    2           4        -5   # BR(H+ -> c       bb     )
     1.30787059E-01    2         -15        16   # BR(H+ -> tau+    nu_tau )
     4.63193750E-04    2         -13        14   # BR(H+ -> mu+     nu_mu  )
     1.03601983E-05    2           2        -5   # BR(H+ -> u       bb     )
     1.37888192E-05    2           2        -3   # BR(H+ -> u       sb     )
     2.73202015E-04    2           4        -3   # BR(H+ -> c       sb     )
     7.94643789E-01    2           6        -5   # BR(H+ -> t       bb     )
     9.95304327E-05    2          24        25   # BR(H+ -> W+      h      )
     2.76853996E-12    2          24        36   # BR(H+ -> W+      A      )
     7.26730513E-02    2     1000024   1000022   # BR(H+ -> ~chi_1+ ~chi_10)
