#
#                              ======================
#                              | THE SUSYHIT OUTPUT |
#                              ======================
#
#
#              ------------------------------------------------------
#              |     This is the output of the SUSY-HIT package     |
#              |  created by A.Djouadi, M.Muehlleitner and M.Spira. |
#              |  In case of problems with SUSY-HIT email to        |
#              |           margarete.muehlleitner@cern.ch           |
#              |           michael.spira@psi.ch                     |
#              |           abdelhak.djouadi@cern.ch                 |
#              ------------------------------------------------------
#
#              ------------------------------------------------------
#              |  SUSY Les Houches Accord - MSSM Spectrum + Decays  |
#              |              based on the decay programs           |
#              |                                                    |
#              |                     SDECAY 1.3b                    |
#              |                                                    |
#              |  Authors: M.Muhlleitner, A.Djouadi and Y.Mambrini  |
#              |  Ref.:    Comput.Phys.Commun.168(2005)46           |
#              |           [hep-ph/0311167]                         |
#              |                                                    |
#              |                     HDECAY 3.4                     |
#              |                                                    |
#              |  By: A.Djouadi,J.Kalinowski,M.Muhlleitner,M.Spira  |
#              |  Ref.:    Comput.Phys.Commun.108(1998)56           |
#              |           [hep-ph/9704448]                         |
#              |                                                    |
#              |                                                    |
#              |  If not stated otherwise all DRbar couplings and   |
#              |  soft SUSY breaking masses are given at the scale  |
#              |  Q=  0.25655430E+04
#              |                                                    |
#              ------------------------------------------------------
#
#
BLOCK DCINFO  # Decay Program information
     1   SDECAY/HDECAY # decay calculator
     2   1.3b  /3.4    # version number
#
BLOCK SPINFO  # Spectrum calculator information
     1     SOFTSUSY    # spectrum calculator               
     2     3.4.0       # version number                    
#
BLOCK MODSEL  # Model selection
     1     0   #  nonUniversal                                     
#
BLOCK SMINPUTS  # Standard Model inputs
         1     1.27908970E+02   # alpha_em^-1(M_Z)^MSbar
         2     1.16637870E-05   # G_F [GeV^-2]
         3     1.18400000E-01   # alpha_S(M_Z)^MSbar
         4     9.11876000E+01   # M_Z pole mass
         5     4.18000000E+00   # mb(mb)^MSbar
         6     1.73200000E+02   # mt pole mass
         7     1.77700000E+00   # mtau pole mass
#
BLOCK MINPAR  # Input parameters - minimal models
         3     2.71600000E+01   # tanb                
#
BLOCK EXTPAR  # Input parameters - non-minimal models
         0    -1.00000000E+00   # Set                 
         1     1.14571000E+03   # M_1(MX)             
         2     3.37766000E+03   # M_2(MX)             
         3     2.06832000E+03   # M_3(MX)             
        11     3.13180000E+03   # At(MX)              
        12    -1.77720000E+02   # Ab(MX)              
        13    -2.92748000E+03   # Atau(MX)            
        23     2.39020000E+02   # mu(MX)              
        26     2.32713000E+03   # mA(pole)            
        31     2.73036000E+03   # meL(MX)             
        32     2.73036000E+03   # mmuL(MX)            
        33     3.32248000E+03   # mtauL(MX)           
        34     1.45042000E+03   # meR(MX)             
        35     1.45042000E+03   # mmuR(MX)            
        36     3.55517000E+03   # mtauR(MX)           
        41     9.00260000E+02   # mqL1(MX)            
        42     9.00260000E+02   # mqL2(MX)            
        43     3.65813000E+03   # mqL3(MX)            
        44     3.77192000E+03   # muR(MX)             
        45     3.77192000E+03   # mcR(MX)             
        46     1.79686000E+03   # mtR(MX)             
        47     5.36010000E+02   # mdR(MX)             
        48     5.36010000E+02   # msR(MX)             
        49     2.14115000E+03   # mbR(MX)             
#
BLOCK MASS  # Mass Spectrum
# PDG code           mass       particle
        24     8.04027350E+01   # W+
        25     1.24053605E+02   # h
        35     2.32714495E+03   # H
        36     2.32713006E+03   # A
        37     2.32887460E+03   # H+
         5     4.81876030E+00   # b-quark pole mass calculated from mb(mb)_Msbar
   1000001     1.07044803E+03   # ~d_L
   2000001     7.32989968E+02   # ~d_R
   1000002     1.06758743E+03   # ~u_L
   2000002     3.81735591E+03   # ~u_R
   1000003     1.07044803E+03   # ~s_L
   2000003     7.32989968E+02   # ~s_R
   1000004     1.06758743E+03   # ~c_L
   2000004     3.81735591E+03   # ~c_R
   1000005     2.21957509E+03   # ~b_1
   2000005     3.69358453E+03   # ~b_2
   1000006     1.85454374E+03   # ~t_1
   2000006     3.69819238E+03   # ~t_2
   1000011     2.75060149E+03   # ~e_L
   2000011     1.46146358E+03   # ~e_R
   1000012     2.74914833E+03   # ~nu_eL
   1000013     2.75060149E+03   # ~mu_L
   2000013     1.46146358E+03   # ~mu_R
   1000014     2.74914833E+03   # ~nu_muL
   1000015     3.33898979E+03   # ~tau_1
   2000015     3.55694618E+03   # ~tau_2
   1000016     3.33776149E+03   # ~nu_tauL
   1000021     2.18869342E+03   # ~g
   1000022     2.48659043E+02   # ~chi_10
   1000023    -2.52079908E+02   # ~chi_20
   1000025     1.13618399E+03   # ~chi_30
   1000035     3.35848816E+03   # ~chi_40
   1000024     2.50814175E+02   # ~chi_1+
   1000037     3.35865450E+03   # ~chi_2+
#
BLOCK NMIX  # Neutralino Mixing Matrix
  1  1     3.70196070E-02   # N_11
  1  2    -1.81914389E-02   # N_12
  1  3     7.09227889E-01   # N_13
  1  4    -7.03771570E-01   # N_14
  2  1    -2.21008289E-02   # N_21
  2  2     1.46682502E-02   # N_22
  2  3     7.04893592E-01   # N_23
  2  4     7.08816916E-01   # N_24
  3  1     9.99069962E-01   # N_31
  3  2     1.55782922E-03   # N_32
  3  3    -1.06851008E-02   # N_33
  3  4     4.17446058E-02   # N_34
  4  1    -5.58913285E-04   # N_41
  4  2     9.99725706E-01   # N_42
  4  3     2.57967336E-03   # N_43
  4  4    -2.32711355E-02   # N_44
#
BLOCK UMIX  # Chargino Mixing Matrix U
  1  1    -3.64815130E-03   # U_11
  1  2     9.99993345E-01   # U_12
  2  1    -9.99993345E-01   # U_21
  2  2    -3.64815130E-03   # U_22
#
BLOCK VMIX  # Chargino Mixing Matrix V
  1  1    -3.29069761E-02   # V_11
  1  2     9.99458419E-01   # V_12
  2  1    -9.99458419E-01   # V_21
  2  2    -3.29069761E-02   # V_22
#
BLOCK STOPMIX  # Stop Mixing Matrix
  1  1    -4.11175338E-02   # cos(theta_t)
  1  2     9.99154317E-01   # sin(theta_t)
  2  1    -9.99154317E-01   # -sin(theta_t)
  2  2    -4.11175338E-02   # cos(theta_t)
#
BLOCK SBOTMIX  # Sbottom Mixing Matrix
  1  1     1.73776116E-03   # cos(theta_b)
  1  2     9.99998490E-01   # sin(theta_b)
  2  1    -9.99998490E-01   # -sin(theta_b)
  2  2     1.73776116E-03   # cos(theta_b)
#
BLOCK STAUMIX  # Stau Mixing Matrix
  1  1     9.99938965E-01   # cos(theta_tau)
  1  2     1.10483607E-02   # sin(theta_tau)
  2  1    -1.10483607E-02   # -sin(theta_tau)
  2  2     9.99938965E-01   # cos(theta_tau)
#
BLOCK ALPHA  # Higgs mixing
          -3.84024353E-02   # Mixing angle in the neutral Higgs boson sector
#
BLOCK HMIX Q=  2.56554300E+03  # DRbar Higgs Parameters
         1     2.43327515E+02   # mu(Q)MSSM           
         2     2.61463452E+01   # tan                 
         3     2.43190927E+02   # higgs               
         4     5.38363710E+06   # mA^2(Q)MSSM         
#
BLOCK GAUGE Q=  2.56554300E+03  # The gauge couplings
     1     3.64804455E-01   # gprime(Q) DRbar
     2     6.37779307E-01   # g(Q) DRbar
     3     1.02320088E+00   # g3(Q) DRbar
#
BLOCK AU Q=  2.56554300E+03  # The trilinear couplings
  1  1     0.00000000E+00   # A_u(Q) DRbar
  2  2     0.00000000E+00   # A_c(Q) DRbar
  3  3     3.13180001E+03   # A_t(Q) DRbar
#
BLOCK AD Q=  2.56554300E+03  # The trilinear couplings
  1  1     0.00000000E+00   # A_d(Q) DRbar
  2  2     0.00000000E+00   # A_s(Q) DRbar
  3  3    -1.77719995E+02   # A_b(Q) DRbar
#
BLOCK AE Q=  2.56554300E+03  # The trilinear couplings
  1  1     0.00000000E+00   # A_e(Q) DRbar
  2  2     0.00000000E+00   # A_mu(Q) DRbar
  3  3    -2.92748000E+03   # A_tau(Q) DRbar
#
BLOCK Yu Q=  2.56554300E+03  # The Yukawa couplings
  1  1     0.00000000E+00   # y_u(Q) DRbar
  2  2     0.00000000E+00   # y_c(Q) DRbar
  3  3     8.38253508E-01   # y_t(Q) DRbar
#
BLOCK Yd Q=  2.56554300E+03  # The Yukawa couplings
  1  1     0.00000000E+00   # y_d(Q) DRbar
  2  2     0.00000000E+00   # y_s(Q) DRbar
  3  3     3.46374505E-01   # y_b(Q) DRbar
#
BLOCK Ye Q=  2.56554300E+03  # The Yukawa couplings
  1  1     0.00000000E+00   # y_e(Q) DRbar
  2  2     0.00000000E+00   # y_mu(Q) DRbar
  3  3     2.69224602E-01   # y_tau(Q) DRbar
#
BLOCK MSOFT Q=  2.56554300E+03  # The soft SUSY breaking masses at the scale Q
         1     1.14571000E+03   # M_1(Q)              
         2     3.37766000E+03   # M_2(Q)              
         3     2.06832000E+03   # M_3(Q)              
        21     5.31749221E+06   # mH1^2(Q)            
        22    -5.63362715E+03   # mH2^2(Q)            
        31     2.73036000E+03   # meL(Q)              
        32     2.73036000E+03   # mmuL(Q)             
        33     3.32248000E+03   # mtauL(Q)            
        34     1.45042000E+03   # meR(Q)              
        35     1.45042000E+03   # mmuR(Q)             
        36     3.55517000E+03   # mtauR(Q)            
        41     9.00259988E+02   # mqL1(Q)             
        42     9.00259988E+02   # mqL2(Q)             
        43     3.65813000E+03   # mqL3(Q)             
        44     3.77192000E+03   # muR(Q)              
        45     3.77192000E+03   # mcR(Q)              
        46     1.79685999E+03   # mtR(Q)              
        47     5.36009980E+02   # mdR(Q)              
        48     5.36009980E+02   # msR(Q)              
        49     2.14114999E+03   # mbR(Q)              
#
Block HiggsBoundsInputHiggsCouplingsFermions
# ScalarNormEffCoupSq PseudoSNormEffCoupSq NP   IP1 IP2 IP2
    1.00916185E+00    0.00000000E+00        3  25   5   5  # h0-b-b eff. coupling^2, normalised to SM
    6.83622205E+02    0.00000000E+00        3  35   5   5  # H0-b-b eff. coupling^2, normalised to SM
    0.00000000E+00    6.83631367E+02        3  36   5   5  # A0-b-b eff. coupling^2, normalised to SM
#
    9.99986598E-01    0.00000000E+00        3  25   6   6  # h0-t-t eff. coupling^2, normalised to SM
    1.47617839E-03    0.00000000E+00        3  35   6   6  # H0-t-t eff. coupling^2, normalised to SM
    0.00000000E+00    1.46277665E-03        3  36   6   6  # A0-t-t eff. coupling^2, normalised to SM
#
    1.00916185E+00    0.00000000E+00        3  25  15  15  # h0-tau-tau eff. coupling^2, normalised to SM
    6.83622205E+02    0.00000000E+00        3  35  15  15  # H0-tau-tau eff. coupling^2, normalised to SM
    0.00000000E+00    6.83631367E+02        3  36  15  15  # A0-tau-tau eff. coupling^2, normalised to SM
#
Block HiggsBoundsInputHiggsCouplingsBosons
    9.99999969E-01        3  25  24  24  # h0-W-W eff. coupling^2, normalised to SM
    3.05565567E-08        3  35  24  24  # H0-W-W eff. coupling^2, normalised to SM
    0.00000000E+00        3  36  24  24  # A0-W-W eff. coupling^2, normalised to SM
#
    9.99999969E-01        3  25  23  23  # h0-Z-Z eff. coupling^2, normalised to SM
    3.05565567E-08        3  35  23  23  # H0-Z-Z eff. coupling^2, normalised to SM
    0.00000000E+00        3  36  23  23  # A0-Z-Z eff. coupling^2, normalised to SM
#
    8.95164338E-01        3  25  21  21  # h0-g-g eff. coupling^2, normalised to SM
    1.55899565E-12        3  35  21  21  # H0-g-g eff. coupling^2, normalised to SM
    2.37304508E-11        3  36  21  21  # A0-g-g eff. coupling^2, normalised to SM
#
    0.00000000E+00        3  25  25  23  # h0-h0-Z eff. coupling^2, normalised to SM
    0.00000000E+00        3  35  25  23  # H0-h0-Z eff. coupling^2, normalised to SM
    3.05565567E-08        3  36  25  23  # A0-h0-Z eff. coupling^2, normalised to SM
    0.00000000E+00        3  35  35  23  # H0-H0-Z eff. coupling^2, normalised to SM
    9.99999969E-01        3  36  35  23  # A0-H0-Z eff. coupling^2, normalised to SM
    0.00000000E+00        3  36  36  23  # A0-A0-Z eff. coupling^2, normalised to SM
#
    0.00000000E+00        4  25  21  21  23  # h0-g-g-Z eff. coupling^2, normalised to SM
    0.00000000E+00        4  35  21  21  23  # H0-g-g-Z eff. coupling^2, normalised to SM
    0.00000000E+00        4  36  21  21  23  # A0-g-g-Z eff. coupling^2, normalised to SM
#
#
#
#                             =================
#                             |The decay table|
#                             =================
#
# - The QCD corrections to the decays gluino -> squark  + quark
#                                     squark -> gaugino + quark_prime
#                                     squark -> squark_prime + Higgs
#                                     squark -> gluino  + quark
#   are included.
#
# - The multi-body decays for the inos, stops and sbottoms are included.
#
# - The loop induced decays for the gluino, neutralinos and stops
#   are included.
#
# - The SUSY decays of the top quark are included.
#
#
#         PDG            Width
DECAY         6     1.43198642E+00   # top decays
#          BR         NDA      ID1       ID2
     1.00000000E+00    2           5        24   # BR(t ->  b    W+)
#
#         PDG            Width
DECAY   1000021     1.75639876E+02   # gluino decays
#          BR         NDA      ID1       ID2
     7.29170769E-02    2     1000001        -1   # BR(~g -> ~d_L  db)
     7.29170769E-02    2    -1000001         1   # BR(~g -> ~d_L* d )
     9.93026240E-02    2     2000001        -1   # BR(~g -> ~d_R  db)
     9.93026240E-02    2    -2000001         1   # BR(~g -> ~d_R* d )
     7.31620144E-02    2     1000002        -2   # BR(~g -> ~u_L  ub)
     7.31620144E-02    2    -1000002         2   # BR(~g -> ~u_L* u )
     7.29170769E-02    2     1000003        -3   # BR(~g -> ~s_L  sb)
     7.29170769E-02    2    -1000003         3   # BR(~g -> ~s_L* s )
     9.93026240E-02    2     2000003        -3   # BR(~g -> ~s_R  sb)
     9.93026240E-02    2    -2000003         3   # BR(~g -> ~s_R* s )
     7.31619814E-02    2     1000004        -4   # BR(~g -> ~c_L  cb)
     7.31619814E-02    2    -1000004         4   # BR(~g -> ~c_L* c )
     9.23660250E-03    2     1000006        -6   # BR(~g -> ~t_1  tb)
     9.23660250E-03    2    -1000006         6   # BR(~g -> ~t_1* t )
#
#         PDG            Width
DECAY   1000006     5.10085890E+01   # stop1 decays
#          BR         NDA      ID1       ID2
     2.38150950E-01    2     1000022         6   # BR(~t_1 -> ~chi_10 t )
     2.40841693E-01    2     1000023         6   # BR(~t_1 -> ~chi_20 t )
     3.34006497E-02    2     1000025         6   # BR(~t_1 -> ~chi_30 t )
     4.87606707E-01    2     1000024         5   # BR(~t_1 -> ~chi_1+ b )
#
#         PDG            Width
DECAY   2000006     1.73354719E+02   # stop2 decays
#          BR         NDA      ID1       ID2
     1.46005524E-01    2     1000022         6   # BR(~t_2 -> ~chi_10 t )
     1.48139995E-01    2     1000023         6   # BR(~t_2 -> ~chi_20 t )
     2.78928961E-03    2     1000025         6   # BR(~t_2 -> ~chi_30 t )
     2.33803610E-03    2     1000035         6   # BR(~t_2 -> ~chi_40 t )
     5.16536358E-02    2     1000024         5   # BR(~t_2 -> ~chi_1+ b )
     5.26487488E-03    2     1000037         5   # BR(~t_2 -> ~chi_2+ b )
     4.98497636E-01    2     1000021         6   # BR(~t_2 -> ~g      t )
     7.87524175E-02    2     1000006        25   # BR(~t_2 -> ~t_1    h )
     6.64150976E-02    2     1000006        23   # BR(~t_2 -> ~t_1    Z )
     1.43493487E-04    2     1000005        24   # BR(~t_2 -> ~b_1    W+)
#
#         PDG            Width
DECAY   1000005     1.10671457E+01   # sbottom1 decays
#          BR         NDA      ID1       ID2
     2.34985975E-01    2     1000022         5   # BR(~b_1 -> ~chi_10 b )
     2.31763961E-01    2     1000023         5   # BR(~b_1 -> ~chi_20 b )
     6.41704452E-02    2     1000025         5   # BR(~b_1 -> ~chi_30 b )
     4.60674879E-01    2    -1000024         6   # BR(~b_1 -> ~chi_1- t )
     8.40465855E-03    2     1000021         5   # BR(~b_1 -> ~g      b )
     8.05617341E-08    2     1000006       -24   # BR(~b_1 -> ~t_1    W-)
#
#         PDG            Width
DECAY   2000005     1.69932870E+02   # sbottom2 decays
#          BR         NDA      ID1       ID2
     2.59079827E-02    2     1000022         5   # BR(~b_2 -> ~chi_10 b )
     2.55729840E-02    2     1000023         5   # BR(~b_2 -> ~chi_20 b )
     2.57940763E-03    2     1000025         5   # BR(~b_2 -> ~chi_30 b )
     2.63769436E-03    2     1000035         5   # BR(~b_2 -> ~chi_40 b )
     2.99382092E-01    2    -1000024         6   # BR(~b_2 -> ~chi_1- t )
     4.65459025E-03    2    -1000037         6   # BR(~b_2 -> ~chi_2- t )
     5.08268617E-01    2     1000021         5   # BR(~b_2 -> ~g      b )
     7.55239228E-05    2     1000005        25   # BR(~b_2 -> ~b_1    h )
     7.49430793E-05    2     1000005        23   # BR(~b_2 -> ~b_1    Z )
     1.30846165E-01    2     1000006       -24   # BR(~b_2 -> ~t_1    W-)
#
#         PDG            Width
DECAY   1000002     9.40156638E-03   # sup_L decays
#          BR         NDA      ID1       ID2
     5.17663277E-02    2     1000022         2   # BR(~u_L -> ~chi_10 u)
     4.55033013E-02    2     1000023         2   # BR(~u_L -> ~chi_20 u)
     9.02730371E-01    2     1000024         1   # BR(~u_L -> ~chi_1+ d)
#
#         PDG            Width
DECAY   2000002     1.41616816E+02   # sup_R decays
#          BR         NDA      ID1       ID2
     8.28455897E-05    2     1000022         2   # BR(~u_R -> ~chi_10 u)
     2.95207555E-05    2     1000023         2   # BR(~u_R -> ~chi_20 u)
     5.07213427E-02    2     1000025         2   # BR(~u_R -> ~chi_30 u)
     1.01182175E-09    2     1000035         2   # BR(~u_R -> ~chi_40 u)
     9.49166290E-01    2     1000021         2   # BR(~u_R -> ~g      u)
#
#         PDG            Width
DECAY   1000001     4.01587729E-03   # sdown_L decays
#          BR         NDA      ID1       ID2
     6.25335332E-01    2     1000022         1   # BR(~d_L -> ~chi_10 d)
     3.48607962E-01    2     1000023         1   # BR(~d_L -> ~chi_20 d)
     2.60567053E-02    2    -1000024         2   # BR(~d_L -> ~chi_1- u)
#
#         PDG            Width
DECAY   2000001     6.62703140E-04   # sdown_R decays
#           BR         NDA      ID1       ID2
     7.23374142E-01    2     1000022         1   # BR(~d_R -> ~chi_10 d)
     2.55973685E-01    2     1000023         1   # BR(~d_R -> ~chi_20 d)
#           BR         NDA      ID1       ID2       ID3
     9.15689037E-04    3        1       23        1000022   # BR(~d_R -> d  Z  ~chi_10)
     3.62469989E-03    3        1       25        1000022   # BR(~d_R -> d  h  ~chi_10)
     3.86281556E-03    3        1       23        1000023   # BR(~d_R -> d  Z  ~chi_20)
     7.70676898E-04    3        1       25        1000023   # BR(~d_R -> d  h  ~chi_20)
     2.03152802E-03    3        1       -24        1000024   # BR(~d_R -> d  W-  ~chi_1+)
     9.44676375E-03    3        1       24        -1000024   # BR(~d_R -> d  W+  ~chi_1-)
#
#         PDG            Width
DECAY   1000004     9.25074810E-03   # scharm_L decays
#          BR         NDA      ID1       ID2
     5.17669967E-02    2     1000022         4   # BR(~c_L -> ~chi_10 c)
     4.55026172E-02    2     1000023         4   # BR(~c_L -> ~chi_20 c)
     9.02730386E-01    2     1000024         3   # BR(~c_L -> ~chi_1+ s)
#
#         PDG            Width
DECAY   2000004     1.03002482E+02   # scharm_R decays
#          BR         NDA      ID1       ID2
     1.18517650E-04    2     1000022         4   # BR(~c_R -> ~chi_10 c)
     4.22312565E-05    2     1000023         4   # BR(~c_R -> ~chi_20 c)
     7.23160334E-02    2     1000025         4   # BR(~c_R -> ~chi_30 c)
     1.39113574E-09    2     1000035         4   # BR(~c_R -> ~chi_40 c)
     9.27523216E-01    2     1000021         4   # BR(~c_R -> ~g      c)
#
#         PDG            Width
DECAY   1000003     3.95204067E-03   # sstrange_L decays
#          BR         NDA      ID1       ID2
     6.25341753E-01    2     1000022         3   # BR(~s_L -> ~chi_10 s)
     3.48601802E-01    2     1000023         3   # BR(~s_L -> ~chi_20 s)
     2.60564452E-02    2    -1000024         4   # BR(~s_L -> ~chi_1- c)
#
#         PDG            Width
DECAY   2000003     6.40239776E-04   # sstrange_R decays
#           BR         NDA      ID1       ID2
     7.22872374E-01    2     1000022         3   # BR(~s_R -> ~chi_10 s)
     2.55787949E-01    2     1000023         3   # BR(~s_R -> ~chi_20 s)
#           BR         NDA      ID1       ID2       ID3
     9.42584361E-04    3        3       23        1000022   # BR(~s_R -> s  Z  ~chi_10)
     3.72001255E-03    3        3       25        1000022   # BR(~s_R -> s  h  ~chi_10)
     3.99834577E-03    3        3       23        1000023   # BR(~s_R -> s  Z  ~chi_20)
     7.97716760E-04    3        3       25        1000023   # BR(~s_R -> s  h  ~chi_20)
     2.10280593E-03    3        3       -24        1000024   # BR(~s_R -> s  W-  ~chi_1+)
     9.77821159E-03    3        3       24        -1000024   # BR(~s_R -> s  W+  ~chi_1-)
#
#         PDG            Width
DECAY   1000011     2.51409441E+00   # selectron_L decays
#          BR         NDA      ID1       ID2
     3.87616473E-05    2     1000022        11   # BR(~e_L -> ~chi_10 e-)
     1.78799282E-05    2     1000023        11   # BR(~e_L -> ~chi_20 e-)
     9.99827478E-01    2     1000025        11   # BR(~e_L -> ~chi_30 e-)
     1.15880532E-04    2    -1000024        12   # BR(~e_L -> ~chi_1- nu_e)
#
#         PDG            Width
DECAY   2000011     1.22243628E+00   # selectron_R decays
#          BR         NDA      ID1       ID2
     8.18068979E-03    2     1000022        11   # BR(~e_R -> ~chi_10 e-)
     2.91088987E-03    2     1000023        11   # BR(~e_R -> ~chi_20 e-)
     9.88908420E-01    2     1000025        11   # BR(~e_R -> ~chi_30 e-)
#
#         PDG            Width
DECAY   1000013     2.51409440E+00   # smuon_L decays
#          BR         NDA      ID1       ID2
     3.87616474E-05    2     1000022        13   # BR(~mu_L -> ~chi_10 mu-)
     1.78799282E-05    2     1000023        13   # BR(~mu_L -> ~chi_20 mu-)
     9.99827478E-01    2     1000025        13   # BR(~mu_L -> ~chi_30 mu-)
     1.15880533E-04    2    -1000024        14   # BR(~mu_L -> ~chi_1- nu_mu)
#
#         PDG            Width
DECAY   2000013     1.22243620E+00   # smuon_R decays
#          BR         NDA      ID1       ID2
     8.18069024E-03    2     1000022        13   # BR(~mu_R -> ~chi_10 mu-)
     2.91089003E-03    2     1000023        13   # BR(~mu_R -> ~chi_20 mu-)
     9.88908420E-01    2     1000025        13   # BR(~mu_R -> ~chi_30 mu-)
#
#         PDG            Width
DECAY   1000015     8.23281572E+00   # stau_1 decays
#          BR         NDA      ID1       ID2
     2.91527928E-01    2     1000022        15   # BR(~tau_1 -> ~chi_10  tau-)
     2.86877126E-01    2     1000023        15   # BR(~tau_1 -> ~chi_20  tau-)
     4.21370761E-01    2     1000025        15   # BR(~tau_1 -> ~chi_30  tau-)
     2.24184075E-04    2    -1000024        16   # BR(~tau_1 -> ~chi_1-  nu_tau)
#
#         PDG            Width
DECAY   2000015     2.53557356E+01   # stau_2 decays
#          BR         NDA      ID1       ID2
     1.01557054E-01    2     1000022        15   # BR(~tau_2 -> ~chi_10  tau-)
     1.00003350E-01    2     1000023        15   # BR(~tau_2 -> ~chi_20  tau-)
     5.97852236E-01    2     1000025        15   # BR(~tau_2 -> ~chi_30  tau-)
     1.06106900E-06    2     1000035        15   # BR(~tau_2 -> ~chi_40  tau-)
     2.00211670E-01    2    -1000024        16   # BR(~tau_2 -> ~chi_1-  nu_tau)
     2.11328284E-06    2    -1000037        16   # BR(~tau_2 -> ~chi_2-  nu_tau)
     1.86007645E-04    2     1000016       -24   # BR(~tau_2 -> ~nu_tauL W-)
     9.86596394E-05    2     1000015        25   # BR(~tau_2 -> ~tau_1   h)
     8.78471145E-05    2     1000015        23   # BR(~tau_2 -> ~tau_1   Z)
#
#         PDG            Width
DECAY   1000012     2.53281080E+00   # snu_eL decays
#          BR         NDA      ID1       ID2
     6.69501235E-03    2     1000022        12   # BR(~nu_eL -> ~chi_10 nu_e)
     3.22060754E-03    2     1000023        12   # BR(~nu_eL -> ~chi_20 nu_e)
     9.80730703E-01    2     1000025        12   # BR(~nu_eL -> ~chi_30 nu_e)
     9.35367725E-03    2     1000024        11   # BR(~nu_eL -> ~chi_1+ e-)
#
#         PDG            Width
DECAY   1000014     2.53281080E+00   # snu_muL decays
#          BR         NDA      ID1       ID2
     6.69501235E-03    2     1000022        14   # BR(~nu_muL -> ~chi_10 nu_mu)
     3.22060754E-03    2     1000023        14   # BR(~nu_muL -> ~chi_20 nu_mu)
     9.80730703E-01    2     1000025        14   # BR(~nu_muL -> ~chi_30 nu_mu)
     9.35367722E-03    2     1000024        13   # BR(~nu_muL -> ~chi_1+ mu-)
#
#         PDG            Width
DECAY   1000016     8.24689795E+00   # snu_tauL decays
#          BR         NDA      ID1       ID2
     2.50969957E-03    2     1000022        16   # BR(~nu_tauL -> ~chi_10 nu_tau)
     1.20745891E-03    2     1000023        16   # BR(~nu_tauL -> ~chi_20 nu_tau)
     4.15751647E-01    2     1000025        16   # BR(~nu_tauL -> ~chi_30 nu_tau)
     5.80531195E-01    2     1000024        15   # BR(~nu_tauL -> ~chi_1+ tau-)
#
#         PDG            Width
DECAY   1000024     4.88842921E-11   # chargino1+ decays
#           BR         NDA      ID1       ID2       ID3
     3.74441452E-01    3     1000022         2        -1   # BR(~chi_1+ -> ~chi_10 u    db)
     3.74441452E-01    3     1000022         4        -3   # BR(~chi_1+ -> ~chi_10 c    sb)
     1.24813613E-01    3     1000022       -11        12   # BR(~chi_1+ -> ~chi_10 e+   nu_e)
     1.24813613E-01    3     1000022       -13        14   # BR(~chi_1+ -> ~chi_10 mu+  nu_mu)
     1.48986978E-03    3     1000022       -15        16   # BR(~chi_1+ -> ~chi_10 tau+ nu_tau)
#
#         PDG            Width
DECAY   1000037     1.65901634E+02   # chargino2+ decays
#          BR         NDA      ID1       ID2
     1.90812981E-01    2     1000002        -1   # BR(~chi_2+ -> ~u_L     db)
     1.90789636E-01    2    -1000001         2   # BR(~chi_2+ -> ~d_L*    u )
     1.90812980E-01    2     1000004        -3   # BR(~chi_2+ -> ~c_L     sb)
     1.90789625E-01    2    -1000003         4   # BR(~chi_2+ -> ~s_L*     c )
     8.43978129E-04    2     1000006        -5   # BR(~chi_2+ -> ~t_1     bb)
     5.54342024E-09    2    -1000005         6   # BR(~chi_2+ -> ~b_1*    t )
     8.91148402E-03    2     1000012       -11   # BR(~chi_2+ -> ~nu_eL   e+  )
     8.91148402E-03    2     1000014       -13   # BR(~chi_2+ -> ~nu_muL mu+ )
     1.25380722E-05    2     1000016       -15   # BR(~chi_2+ -> ~nu_tau1 tau+)
     8.88276336E-03    2    -1000011        12   # BR(~chi_2+ -> ~e_L+    nu_e)
     8.88276336E-03    2    -1000013        14   # BR(~chi_2+ -> ~mu_L+   nu_mu)
     1.11645189E-05    2    -1000015        16   # BR(~chi_2+ -> ~tau_1+  nu_tau)
     3.96990814E-02    2     1000024        23   # BR(~chi_2+ -> ~chi_1+  Z )
     3.80957924E-02    2     1000022        24   # BR(~chi_2+ -> ~chi_10  W+)
     3.86680904E-02    2     1000023        24   # BR(~chi_2+ -> ~chi_20  W+)
     2.66232493E-04    2     1000025        24   # BR(~chi_2+ -> ~chi_30  W+)
     4.12617925E-02    2     1000024        25   # BR(~chi_2+ -> ~chi_1+  h )
     1.05948932E-02    2     1000024        35   # BR(~chi_2+ -> ~chi_1+  H )
     1.05973085E-02    2     1000024        36   # BR(~chi_2+ -> ~chi_1+  A )
     1.06485857E-02    2     1000022        37   # BR(~chi_2+ -> ~chi_10  H+)
     1.05068204E-02    2     1000023        37   # BR(~chi_2+ -> ~chi_20  H+)
#
#         PDG            Width
DECAY   1000022     0.00000000E+00   # neutralino1 decays
#
#         PDG            Width
DECAY   1000023     4.44229996E-10   # neutralino2 decays
#          BR         NDA      ID1       ID2
     1.35510750E-01    2     1000022        22   # BR(~chi_20 -> ~chi_10 gam)
#           BR         NDA      ID1       ID2       ID3
     1.22414702E-01    3     1000022        -2         2   # BR(~chi_20 -> ~chi_10 ub      u)
     1.58924424E-01    3     1000022        -1         1   # BR(~chi_20 -> ~chi_10 db      d)
     1.22414702E-01    3     1000022        -4         4   # BR(~chi_20 -> ~chi_10 cb      c)
     1.58924424E-01    3     1000022        -3         3   # BR(~chi_20 -> ~chi_10 sb      s)
     3.65249973E-02    3     1000022       -11        11   # BR(~chi_20 -> ~chi_10 e+      e-)
     3.65249973E-02    3     1000022       -13        13   # BR(~chi_20 -> ~chi_10 mu+     mu-)
     7.30364362E-02    3     1000022       -12        12   # BR(~chi_20 -> ~chi_10 nu_eb   nu_e)
     7.30364362E-02    3     1000022       -14        14   # BR(~chi_20 -> ~chi_10 nu_mub  nu_mu)
     7.30363937E-02    3     1000022       -16        16   # BR(~chi_20 -> ~chi_10 nu_taub nu_tau)
     2.89552260E-03    3     1000024        -2         1   # BR(~chi_20 -> ~chi_1+ ub      d)
     2.89552260E-03    3    -1000024        -1         2   # BR(~chi_20 -> ~chi_1- db      u)
     9.65173329E-04    3     1000024       -12        11   # BR(~chi_20 -> ~chi_1+ nu_eb   e-)
     9.65173329E-04    3    -1000024        12       -11   # BR(~chi_20 -> ~chi_1- nu_e    e+)
     9.65173329E-04    3     1000024       -14        13   # BR(~chi_20 -> ~chi_1+ nu_mub  mu-)
     9.65173329E-04    3    -1000024        14       -13   # BR(~chi_20 -> ~chi_1- nu_mu   mu+)
#
#         PDG            Width
DECAY   1000025     4.37639019E+00   # neutralino3 decays
#          BR         NDA      ID1       ID2
     4.47940148E-02    2     1000022        23   # BR(~chi_30 -> ~chi_10   Z )
     1.26940333E-01    2     1000023        23   # BR(~chi_30 -> ~chi_20   Z )
     1.67425358E-01    2     1000024       -24   # BR(~chi_30 -> ~chi_1+   W-)
     1.67425358E-01    2    -1000024        24   # BR(~chi_30 -> ~chi_1-   W+)
     1.24954165E-01    2     1000022        25   # BR(~chi_30 -> ~chi_10   h )
     4.37973973E-02    2     1000023        25   # BR(~chi_30 -> ~chi_20   h )
     8.55999235E-04    2     1000002        -2   # BR(~chi_30 -> ~u_L      ub)
     8.55999235E-04    2    -1000002         2   # BR(~chi_30 -> ~u_L*     u )
     7.64019688E-04    2     1000001        -1   # BR(~chi_30 -> ~d_L      db)
     7.64019688E-04    2    -1000001         1   # BR(~chi_30 -> ~d_L*     d )
     7.95459263E-02    2     2000001        -1   # BR(~chi_30 -> ~d_R      db)
     7.95459263E-02    2    -2000001         1   # BR(~chi_30 -> ~d_R*     d )
     8.55795708E-04    2     1000004        -4   # BR(~chi_30 -> ~c_L      cb)
     8.55795708E-04    2    -1000004         4   # BR(~chi_30 -> ~c_L*     c )
     7.64019688E-04    2     1000003        -3   # BR(~chi_30 -> ~s _L      sb)
     7.64019688E-04    2    -1000003         3   # BR(~chi_30 -> ~s _L*     s )
     7.95459263E-02    2     2000003        -3   # BR(~chi_30 -> ~s _R      sb)
     7.95459263E-02    2    -2000003         3   # BR(~chi_30 -> ~s _R*     s )
#
#         PDG            Width
DECAY   1000035     1.65879093E+02   # neutralino4 decays
#          BR         NDA      ID1       ID2
     1.53565719E-02    2     1000022        23   # BR(~chi_40 -> ~chi_10   Z )
     2.43072936E-02    2     1000023        23   # BR(~chi_40 -> ~chi_20   Z )
     4.57097269E-05    2     1000025        23   # BR(~chi_40 -> ~chi_30   Z )
     3.85077746E-02    2     1000024       -24   # BR(~chi_40 -> ~chi_1+   W-)
     3.85077746E-02    2    -1000024        24   # BR(~chi_40 -> ~chi_1-   W+)
     2.49496257E-02    2     1000022        25   # BR(~chi_40 -> ~chi_10   h )
     6.46028699E-03    2     1000022        35   # BR(~chi_40 -> ~chi_10   H )
     4.21381668E-03    2     1000022        36   # BR(~chi_40 -> ~chi_10   A )
     1.60937757E-02    2     1000023        25   # BR(~chi_40 -> ~chi_20   h )
     4.14535017E-03    2     1000023        35   # BR(~chi_40 -> ~chi_20   H )
     6.39548797E-03    2     1000023        36   # BR(~chi_40 -> ~chi_20   A )
     1.99103037E-04    2     1000025        25   # BR(~chi_40 -> ~chi_30   h )
     1.05640697E-02    2     1000024       -37   # BR(~chi_40 -> ~chi_1+   H-)
     1.05640697E-02    2    -1000024        37   # BR(~chi_40 -> ~chi_1-   H+)
     9.54432019E-02    2     1000002        -2   # BR(~chi_40 -> ~u_L      ub)
     9.54432019E-02    2    -1000002         2   # BR(~chi_40 -> ~u_L*     u )
     9.53700960E-02    2     1000001        -1   # BR(~chi_40 -> ~d_L      db)
     9.53700960E-02    2    -1000001         1   # BR(~chi_40 -> ~d_L*     d )
     4.86178612E-09    2     2000001        -1   # BR(~chi_40 -> ~d_R      db)
     4.86178612E-09    2    -2000001         1   # BR(~chi_40 -> ~d_R*     d )
     9.54431963E-02    2     1000004        -4   # BR(~chi_40 -> ~c_L      cb)
     9.54431963E-02    2    -1000004         4   # BR(~chi_40 -> ~c_L*     c )
     9.53700960E-02    2     1000003        -3   # BR(~chi_40 -> ~s _L      sb)
     9.53700960E-02    2    -1000003         3   # BR(~chi_40 -> ~s _L*     s )
     4.86178612E-09    2     2000003        -3   # BR(~chi_40 -> ~s _R      sb)
     4.86178612E-09    2    -2000003         3   # BR(~chi_40 -> ~s _R*     s )
     4.17703071E-04    2     1000006        -6   # BR(~chi_40 -> ~t_1      tb)
     4.17703071E-04    2    -1000006         6   # BR(~chi_40 -> ~t_1*     t )
     4.01154779E-09    2     1000005        -5   # BR(~chi_40 -> ~b_1      bb)
     4.01154779E-09    2    -1000005         5   # BR(~chi_40 -> ~b_1*     b )
     4.43475915E-03    2     1000011       -11   # BR(~chi_40 -> ~e_L-     e+)
     4.43475915E-03    2    -1000011        11   # BR(~chi_40 -> ~e_L+     e-)
     1.10039208E-08    2     2000011       -11   # BR(~chi_40 -> ~e_R-     e+)
     1.10039208E-08    2    -2000011        11   # BR(~chi_40 -> ~e_R+     e-)
     4.43475915E-03    2     1000013       -13   # BR(~chi_40 -> ~mu_L-    mu+)
     4.43475915E-03    2    -1000013        13   # BR(~chi_40 -> ~mu_L+    mu-)
     1.10039208E-08    2     2000013       -13   # BR(~chi_40 -> ~mu_R-    mu+)
     1.10039208E-08    2    -2000013        13   # BR(~chi_40 -> ~mu_R+    mu-)
     5.45885823E-06    2     1000015       -15   # BR(~chi_40 -> ~tau_1-   tau+)
     5.45885823E-06    2    -1000015        15   # BR(~chi_40 -> ~tau_1+   tau-)
     4.45956825E-03    2     1000012       -12   # BR(~chi_40 -> ~nu_eL    nu_eb)
     4.45956825E-03    2    -1000012        12   # BR(~chi_40 -> ~nu_eL*   nu_e )
     4.45956825E-03    2     1000014       -14   # BR(~chi_40 -> ~nu_muL   nu_mub)
     4.45956825E-03    2    -1000014        14   # BR(~chi_40 -> ~nu_muL*  nu_mu )
     6.20225557E-06    2     1000016       -16   # BR(~chi_40 -> ~nu_tau1  nu_taub)
     6.20225557E-06    2    -1000016        16   # BR(~chi_40 -> ~nu_tau1* nu_tau )
#
#         PDG            Width
DECAY        25     3.96669487E-03   # h decays
#          BR         NDA      ID1       ID2
     6.15699638E-01    2           5        -5   # BR(h -> b       bb     )
     6.53242301E-02    2         -15        15   # BR(h -> tau+    tau-   )
     2.31224714E-04    2         -13        13   # BR(h -> mu+     mu-    )
     2.52625629E-04    2           3        -3   # BR(h -> s       sb     )
     2.17311966E-02    2           4        -4   # BR(h -> c       cb     )
     7.89270529E-02    2          21        21   # BR(h -> g       g      )
     2.30039260E-03    2          22        22   # BR(h -> gam     gam    )
     1.44600965E-03    2          22        23   # BR(h -> Z       gam    )
     1.90617969E-01    2          24       -24   # BR(h -> W+      W-     )
     2.34696609E-02    2          23        23   # BR(h -> Z       Z      )
#
#         PDG            Width
DECAY        35     2.28594809E+01   # H decays
#          BR         NDA      ID1       ID2
     7.79470459E-01    2           5        -5   # BR(H -> b       bb     )
     1.42645340E-01    2         -15        15   # BR(H -> tau+    tau-   )
     5.02721836E-04    2         -13        13   # BR(H -> mu+     mu-    )
     2.88266583E-04    2           3        -3   # BR(H -> s       sb     )
     6.38232976E-08    2           4        -4   # BR(H -> c       cb     )
     6.22443067E-03    2           6        -6   # BR(H -> t       tb     )
     1.41054534E-05    2          21        21   # BR(H -> g       g      )
     2.01080846E-08    2          22        22   # BR(H -> gam     gam    )
     8.16613694E-09    2          23        22   # BR(H -> Z       gam    )
     5.39699935E-06    2          24       -24   # BR(H -> W+      W-     )
     2.69021038E-06    2          23        23   # BR(H -> Z       Z      )
     1.88960767E-05    2          25        25   # BR(H -> h       h      )
     8.62328824E-04    2     1000024  -1000024   # BR(H -> ~chi_1+ ~chi_1-)
     5.40364666E-04    2     1000022   1000022   # BR(H -> ~chi_10 ~chi_10)
     3.01941052E-04    2     1000023   1000023   # BR(H -> ~chi_20 ~chi_20)
     2.02772043E-07    2     1000025   1000025   # BR(H -> ~chi_30 ~chi_30)
     4.00094406E-05    2     1000022   1000023   # BR(H -> ~chi_10 ~chi_20)
     2.73068913E-02    2     1000022   1000025   # BR(H -> ~chi_10 ~chi_30)
     4.17683924E-02    2     1000023   1000025   # BR(H -> ~chi_20 ~chi_30)
     1.47507525E-06    2     1000002  -1000002   # BR(H -> ~u_L    ~u_L*  )
     1.47507525E-06    2     1000004  -1000004   # BR(H -> ~c_L    ~c_L*  )
     2.13202282E-06    2     1000001  -1000001   # BR(H -> ~d_L    ~d_L*  )
     1.28208025E-07    2     2000001  -2000001   # BR(H -> ~d_R    ~d_R*  )
     2.13202282E-06    2     1000003  -1000003   # BR(H -> ~s_L    ~s_L*  )
     1.28208025E-07    2     2000003  -2000003   # BR(H -> ~s_R    ~s_R*  )
#
#         PDG            Width
DECAY        36     2.28631329E+01   # A decays
#          BR         NDA      ID1       ID2
     7.79388174E-01    2           5        -5   # BR(A -> b       bb     )
     1.42623896E-01    2         -15        15   # BR(A -> tau+    tau-   )
     5.02645106E-04    2         -13        13   # BR(A -> mu+     mu-    )
     2.88252806E-04    2           3        -3   # BR(A -> s       sb     )
     6.38167800E-08    2           4        -4   # BR(A -> c       cb     )
     6.26014151E-03    2           6        -6   # BR(A -> t       tb     )
     5.50216789E-05    2          21        21   # BR(A -> g       g      )
     7.95319592E-08    2          22        22   # BR(A -> gam     gam    )
     3.96080993E-08    2          23        22   # BR(A -> Z       gam    )
     5.45492131E-06    2          23        25   # BR(A -> Z       h      )
     9.19704189E-04    2     1000024  -1000024   # BR(A -> ~chi_1+ ~chi_1-)
     6.59233697E-04    2     1000022   1000022   # BR(A -> ~chi_10 ~chi_10)
     2.71482759E-04    2     1000023   1000023   # BR(A -> ~chi_20 ~chi_20)
     7.96982698E-06    2     1000025   1000025   # BR(A -> ~chi_30 ~chi_30)
     1.56983411E-05    2     1000022   1000023   # BR(A -> ~chi_10 ~chi_20)
     4.20435641E-02    2     1000022   1000025   # BR(A -> ~chi_10 ~chi_30)
     2.69585781E-02    2     1000023   1000025   # BR(A -> ~chi_20 ~chi_30)
#
#         PDG            Width
DECAY        37     2.22474678E+01   # H+ decays
#          BR         NDA      ID1       ID2
     1.30269946E-03    2           4        -5   # BR(H+ -> c       bb     )
     1.46680676E-01    2         -15        16   # BR(H+ -> tau+    nu_tau )
     5.16942290E-04    2         -13        14   # BR(H+ -> mu+     nu_mu  )
     1.30269687E-05    2           2        -5   # BR(H+ -> u       bb     )
     1.48118645E-05    2           2        -3   # BR(H+ -> u       sb     )
     2.91605291E-04    2           4        -3   # BR(H+ -> c       sb     )
     7.79228104E-01    2           6        -5   # BR(H+ -> t       bb     )
     5.62441787E-06    2          24        25   # BR(H+ -> W+      h      )
     9.55220575E-13    2          24        36   # BR(H+ -> W+      A      )
     1.26429807E-05    2     1000024   1000022   # BR(H+ -> ~chi_1+ ~chi_10)
     1.84734315E-05    2     1000024   1000023   # BR(H+ -> ~chi_1+ ~chi_20)
     7.19080477E-02    2     1000024   1000025   # BR(H+ -> ~chi_1+ ~chi_30)
     3.67326157E-06    2     1000002  -1000001   # BR(H+ -> ~u_L    ~d_L*  )
     3.67326157E-06    2     1000004  -1000003   # BR(H+ -> ~c_L    ~s_L*  )
