#
#                              ======================
#                              | THE SUSYHIT OUTPUT |
#                              ======================
#
#
#              ------------------------------------------------------
#              |     This is the output of the SUSY-HIT package     |
#              |  created by A.Djouadi, M.Muehlleitner and M.Spira. |
#              |  In case of problems with SUSY-HIT email to        |
#              |           margarete.muehlleitner@cern.ch           |
#              |           michael.spira@psi.ch                     |
#              |           abdelhak.djouadi@cern.ch                 |
#              ------------------------------------------------------
#
#              ------------------------------------------------------
#              |  SUSY Les Houches Accord - MSSM Spectrum + Decays  |
#              |              based on the decay programs           |
#              |                                                    |
#              |                     SDECAY 1.3b                    |
#              |                                                    |
#              |  Authors: M.Muhlleitner, A.Djouadi and Y.Mambrini  |
#              |  Ref.:    Comput.Phys.Commun.168(2005)46           |
#              |           [hep-ph/0311167]                         |
#              |                                                    |
#              |                     HDECAY 3.4                     |
#              |                                                    |
#              |  By: A.Djouadi,J.Kalinowski,M.Muhlleitner,M.Spira  |
#              |  Ref.:    Comput.Phys.Commun.108(1998)56           |
#              |           [hep-ph/9704448]                         |
#              |                                                    |
#              |                                                    |
#              |  If not stated otherwise all DRbar couplings and   |
#              |  soft SUSY breaking masses are given at the scale  |
#              |  Q=  0.19928130E+04
#              |                                                    |
#              ------------------------------------------------------
#
#
BLOCK DCINFO  # Decay Program information
     1   SDECAY/HDECAY # decay calculator
     2   1.3b  /3.4    # version number
#
BLOCK SPINFO  # Spectrum calculator information
     1     SOFTSUSY    # spectrum calculator               
     2     3.4.0       # version number                    
#
BLOCK MODSEL  # Model selection
     1     0   #  nonUniversal                                     
#
BLOCK SMINPUTS  # Standard Model inputs
         1     1.27908970E+02   # alpha_em^-1(M_Z)^MSbar
         2     1.16637870E-05   # G_F [GeV^-2]
         3     1.18400000E-01   # alpha_S(M_Z)^MSbar
         4     9.11876000E+01   # M_Z pole mass
         5     4.18000000E+00   # mb(mb)^MSbar
         6     1.73200000E+02   # mt pole mass
         7     1.77700000E+00   # mtau pole mass
#
BLOCK MINPAR  # Input parameters - minimal models
         3     5.04400000E+01   # tanb                
#
BLOCK EXTPAR  # Input parameters - non-minimal models
         0    -1.00000000E+00   # Set                 
         1     3.66432000E+03   # M_1(MX)             
         2    -1.53400000E+02   # M_2(MX)             
         3     1.15974000E+03   # M_3(MX)             
        11     2.47558000E+03   # At(MX)              
        12     2.99739000E+03   # Ab(MX)              
        13    -3.71705000E+03   # Atau(MX)            
        23    -3.25150000E+02   # mu(MX)              
        26     3.62751000E+03   # mA(pole)            
        31     1.82972000E+03   # meL(MX)             
        32     1.82972000E+03   # mmuL(MX)            
        33     2.66888000E+03   # mtauL(MX)           
        34     3.26059000E+03   # meR(MX)             
        35     3.26059000E+03   # mmuR(MX)            
        36     2.06223000E+03   # mtauR(MX)           
        41     3.25327000E+03   # mqL1(MX)            
        42     3.25327000E+03   # mqL2(MX)            
        43     3.57128000E+03   # mqL3(MX)            
        44     3.22740000E+03   # muR(MX)             
        45     3.22740000E+03   # mcR(MX)             
        46     1.10685000E+03   # mtR(MX)             
        47     1.34720000E+03   # mdR(MX)             
        48     1.34720000E+03   # msR(MX)             
        49     3.69687000E+03   # mbR(MX)             
#
BLOCK MASS  # Mass Spectrum
# PDG code           mass       particle
        24     8.03907756E+01   # W+
        25     1.24925743E+02   # h
        35     3.62751230E+03   # H
        36     3.62751006E+03   # A
        37     3.62853428E+03   # H+
         5     4.81876030E+00   # b-quark pole mass calculated from mb(mb)_Msbar
   1000001     3.29045581E+03   # ~d_L
   2000001     1.40144987E+03   # ~d_R
   1000002     3.28962342E+03   # ~u_L
   2000002     3.25962304E+03   # ~u_R
   1000003     3.29045581E+03   # ~s_L
   2000003     1.40144987E+03   # ~s_R
   1000004     3.28962342E+03   # ~c_L
   2000004     3.25962304E+03   # ~c_R
   1000005     3.59964114E+03   # ~b_1
   2000005     3.73518308E+03   # ~b_2
   1000006     1.17432822E+03   # ~t_1
   2000006     3.60384919E+03   # ~t_2
   1000011     1.83309228E+03   # ~e_L
   2000011     3.26678223E+03   # ~e_R
   1000012     1.83103854E+03   # ~nu_eL
   1000013     1.83309228E+03   # ~mu_L
   2000013     3.26678223E+03   # ~mu_R
   1000014     1.83103854E+03   # ~nu_muL
   1000015     2.07232968E+03   # ~tau_1
   2000015     2.67402410E+03   # ~tau_2
   1000016     2.67248209E+03   # ~nu_tauL
   1000021     1.35042891E+03   # ~g
   1000022    -1.55934363E+02   # ~chi_10
   1000023     3.48215661E+02   # ~chi_20
   1000025    -3.59796988E+02   # ~chi_30
   1000035     3.64310846E+03   # ~chi_40
   1000024     1.56391847E+02   # ~chi_1+
   1000037     3.65582478E+02   # ~chi_2+
#
BLOCK NMIX  # Neutralino Mixing Matrix
  1  1     1.58288638E-03   # N_11
  1  2     9.51830770E-01   # N_12
  1  3     2.77775340E-01   # N_13
  1  4    -1.29832740E-01   # N_14
  2  1    -9.32632843E-03   # N_21
  2  2    -1.06704724E-01   # N_22
  2  3     6.97061667E-01   # N_23
  2  4     7.08965552E-01   # N_24
  3  1     7.81152273E-03   # N_31
  3  2    -2.87458209E-01   # N_32
  3  3     6.61018219E-01   # N_33
  3  4    -6.93081288E-01   # N_34
  4  1     9.99924744E-01   # N_41
  4  2    -2.56336216E-04   # N_42
  4  3     8.97847962E-04   # N_43
  4  4     1.22324969E-02   # N_44
#
BLOCK UMIX  # Chargino Mixing Matrix U
  1  1     9.24132371E-01   # U_11
  1  2     3.82072455E-01   # U_12
  2  1    -3.82072455E-01   # U_21
  2  2     9.24132371E-01   # U_22
#
BLOCK VMIX  # Chargino Mixing Matrix V
  1  1    -9.83842654E-01   # V_11
  1  2    -1.79035283E-01   # V_12
  2  1     1.79035283E-01   # V_21
  2  2    -9.83842654E-01   # V_22
#
BLOCK STOPMIX  # Stop Mixing Matrix
  1  1    -2.98144636E-02   # cos(theta_t)
  1  2     9.99555450E-01   # sin(theta_t)
  2  1    -9.99555450E-01   # -sin(theta_t)
  2  2    -2.98144636E-02   # cos(theta_t)
#
BLOCK SBOTMIX  # Sbottom Mixing Matrix
  1  1     9.98847751E-01   # cos(theta_b)
  1  2    -4.79913567E-02   # sin(theta_b)
  2  1     4.79913567E-02   # -sin(theta_b)
  2  2     9.98847751E-01   # cos(theta_b)
#
BLOCK STAUMIX  # Stau Mixing Matrix
  1  1    -8.29396523E-03   # cos(theta_tau)
  1  2     9.99965604E-01   # sin(theta_tau)
  2  1    -9.99965604E-01   # -sin(theta_tau)
  2  2    -8.29396523E-03   # cos(theta_tau)
#
BLOCK ALPHA  # Higgs mixing
          -2.00074852E-02   # Mixing angle in the neutral Higgs boson sector
#
BLOCK HMIX Q=  1.99281300E+03  # DRbar Higgs Parameters
         1    -3.34231394E+02   # mu(Q)MSSM           
         2     5.00622289E+01   # tan                 
         3     2.41695706E+02   # higgs               
         4     1.43183347E+07   # mA^2(Q)MSSM         
#
BLOCK GAUGE Q=  1.99281300E+03  # The gauge couplings
     1     3.63885845E-01   # gprime(Q) DRbar
     2     6.42553789E-01   # g(Q) DRbar
     3     1.03351421E+00   # g3(Q) DRbar
#
BLOCK AU Q=  1.99281300E+03  # The trilinear couplings
  1  1     0.00000000E+00   # A_u(Q) DRbar
  2  2     0.00000000E+00   # A_c(Q) DRbar
  3  3     2.47558000E+03   # A_t(Q) DRbar
#
BLOCK AD Q=  1.99281300E+03  # The trilinear couplings
  1  1     0.00000000E+00   # A_d(Q) DRbar
  2  2     0.00000000E+00   # A_s(Q) DRbar
  3  3     2.99739000E+03   # A_b(Q) DRbar
#
BLOCK AE Q=  1.99281300E+03  # The trilinear couplings
  1  1     0.00000000E+00   # A_e(Q) DRbar
  2  2     0.00000000E+00   # A_mu(Q) DRbar
  3  3    -3.71705000E+03   # A_tau(Q) DRbar
#
BLOCK Yu Q=  1.99281300E+03  # The Yukawa couplings
  1  1     0.00000000E+00   # y_u(Q) DRbar
  2  2     0.00000000E+00   # y_c(Q) DRbar
  3  3     8.51321532E-01   # y_t(Q) DRbar
#
BLOCK Yd Q=  1.99281300E+03  # The Yukawa couplings
  1  1     0.00000000E+00   # y_d(Q) DRbar
  2  2     0.00000000E+00   # y_s(Q) DRbar
  3  3     7.18471227E-01   # y_b(Q) DRbar
#
BLOCK Ye Q=  1.99281300E+03  # The Yukawa couplings
  1  1     0.00000000E+00   # y_e(Q) DRbar
  2  2     0.00000000E+00   # y_mu(Q) DRbar
  3  3     5.14521196E-01   # y_tau(Q) DRbar
#
BLOCK MSOFT Q=  1.99281300E+03  # The soft SUSY breaking masses at the scale Q
         1     3.66432000E+03   # M_1(Q)              
         2    -1.53400000E+02   # M_2(Q)              
         3     1.15974000E+03   # M_3(Q)              
        21     1.30239409E+07   # mH1^2(Q)            
        22    -1.45862537E+05   # mH2^2(Q)            
        31     1.82972000E+03   # meL(Q)              
        32     1.82972000E+03   # mmuL(Q)             
        33     2.66888000E+03   # mtauL(Q)            
        34     3.26059000E+03   # meR(Q)              
        35     3.26059000E+03   # mmuR(Q)             
        36     2.06223000E+03   # mtauR(Q)            
        41     3.25327000E+03   # mqL1(Q)             
        42     3.25327000E+03   # mqL2(Q)             
        43     3.57128000E+03   # mqL3(Q)             
        44     3.22740000E+03   # muR(Q)              
        45     3.22740000E+03   # mcR(Q)              
        46     1.10685000E+03   # mtR(Q)              
        47     1.34720000E+03   # mdR(Q)              
        48     1.34720000E+03   # msR(Q)              
        49     3.69687000E+03   # mbR(Q)              
#
Block HiggsBoundsInputHiggsCouplingsFermions
# ScalarNormEffCoupSq PseudoSNormEffCoupSq NP   IP1 IP2 IP2
    1.00350762E+00    0.00000000E+00        3  25   5   5  # h0-b-b eff. coupling^2, normalised to SM
    2.50622325E+03    0.00000000E+00        3  35   5   5  # H0-b-b eff. coupling^2, normalised to SM
    0.00000000E+00    2.50622676E+03        3  36   5   5  # A0-b-b eff. coupling^2, normalised to SM
#
    9.99998600E-01    0.00000000E+00        3  25   6   6  # h0-t-t eff. coupling^2, normalised to SM
    4.00405754E-04    0.00000000E+00        3  35   6   6  # H0-t-t eff. coupling^2, normalised to SM
    0.00000000E+00    3.99006193E-04        3  36   6   6  # A0-t-t eff. coupling^2, normalised to SM
#
    1.00350762E+00    0.00000000E+00        3  25  15  15  # h0-tau-tau eff. coupling^2, normalised to SM
    2.50622325E+03    0.00000000E+00        3  35  15  15  # H0-tau-tau eff. coupling^2, normalised to SM
    0.00000000E+00    2.50622676E+03        3  36  15  15  # A0-tau-tau eff. coupling^2, normalised to SM
#
Block HiggsBoundsInputHiggsCouplingsBosons
    9.99999999E-01        3  25  24  24  # h0-W-W eff. coupling^2, normalised to SM
    1.22513426E-09        3  35  24  24  # H0-W-W eff. coupling^2, normalised to SM
    0.00000000E+00        3  36  24  24  # A0-W-W eff. coupling^2, normalised to SM
#
    9.99999999E-01        3  25  23  23  # h0-Z-Z eff. coupling^2, normalised to SM
    1.22513426E-09        3  35  23  23  # H0-Z-Z eff. coupling^2, normalised to SM
    0.00000000E+00        3  36  23  23  # A0-Z-Z eff. coupling^2, normalised to SM
#
    9.00496519E-01        3  25  21  21  # h0-g-g eff. coupling^2, normalised to SM
    4.78319021E-13        3  35  21  21  # H0-g-g eff. coupling^2, normalised to SM
    1.38441222E-12        3  36  21  21  # A0-g-g eff. coupling^2, normalised to SM
#
    0.00000000E+00        3  25  25  23  # h0-h0-Z eff. coupling^2, normalised to SM
    0.00000000E+00        3  35  25  23  # H0-h0-Z eff. coupling^2, normalised to SM
    1.22513426E-09        3  36  25  23  # A0-h0-Z eff. coupling^2, normalised to SM
    0.00000000E+00        3  35  35  23  # H0-H0-Z eff. coupling^2, normalised to SM
    9.99999999E-01        3  36  35  23  # A0-H0-Z eff. coupling^2, normalised to SM
    0.00000000E+00        3  36  36  23  # A0-A0-Z eff. coupling^2, normalised to SM
#
    0.00000000E+00        4  25  21  21  23  # h0-g-g-Z eff. coupling^2, normalised to SM
    0.00000000E+00        4  35  21  21  23  # H0-g-g-Z eff. coupling^2, normalised to SM
    0.00000000E+00        4  36  21  21  23  # A0-g-g-Z eff. coupling^2, normalised to SM
#
#
#
#                             =================
#                             |The decay table|
#                             =================
#
# - The QCD corrections to the decays gluino -> squark  + quark
#                                     squark -> gaugino + quark_prime
#                                     squark -> squark_prime + Higgs
#                                     squark -> gluino  + quark
#   are included.
#
# - The multi-body decays for the inos, stops and sbottoms are included.
#
# - The loop induced decays for the gluino, neutralinos and stops
#   are included.
#
# - The SUSY decays of the top quark are included.
#
#
#         PDG            Width
DECAY         6     1.45404650E+00   # top decays
#          BR         NDA      ID1       ID2
     1.00000000E+00    2           5        24   # BR(t ->  b    W+)
#
#         PDG            Width
DECAY   1000021     3.26664225E-01   # gluino decays
#          BR         NDA      ID1       ID2
     5.00000000E-01    2     1000006        -6   # BR(~g -> ~t_1  tb)
     5.00000000E-01    2    -1000006         6   # BR(~g -> ~t_1* t )
#
#         PDG            Width
DECAY   1000006     2.72278180E+01   # stop1 decays
#          BR         NDA      ID1       ID2
     1.20266921E-02    2     1000022         6   # BR(~t_1 -> ~chi_10 t )
     2.48885572E-01    2     1000023         6   # BR(~t_1 -> ~chi_20 t )
     2.28119696E-01    2     1000025         6   # BR(~t_1 -> ~chi_30 t )
     2.43155687E-02    2     1000024         5   # BR(~t_1 -> ~chi_1+ b )
     4.86652471E-01    2     1000037         5   # BR(~t_1 -> ~chi_2+ b )
#
#         PDG            Width
DECAY   2000006     3.02238740E+02   # stop2 decays
#          BR         NDA      ID1       ID2
     4.60953889E-02    2     1000022         6   # BR(~t_2 -> ~chi_10 t )
     8.46695707E-02    2     1000023         6   # BR(~t_2 -> ~chi_20 t )
     8.59402147E-02    2     1000025         6   # BR(~t_2 -> ~chi_30 t )
     1.10791376E-01    2     1000024         5   # BR(~t_2 -> ~chi_1+ b )
     1.06907261E-01    2     1000037         5   # BR(~t_2 -> ~chi_2+ b )
     4.97384729E-01    2     1000021         6   # BR(~t_2 -> ~g      t )
     3.62640476E-02    2     1000006        25   # BR(~t_2 -> ~t_1    h )
     3.19474118E-02    2     1000006        23   # BR(~t_2 -> ~t_1    Z )
#
#         PDG            Width
DECAY   1000005     3.00264097E+02   # sbottom1 decays
#          BR         NDA      ID1       ID2
     5.57315512E-02    2     1000022         5   # BR(~b_1 -> ~chi_10 b )
     5.87171365E-02    2     1000023         5   # BR(~b_1 -> ~chi_20 b )
     5.53382594E-02    2     1000025         5   # BR(~b_1 -> ~chi_30 b )
     9.22323705E-02    2    -1000024         6   # BR(~b_1 -> ~chi_1- t )
     1.74132911E-01    2    -1000037         6   # BR(~b_1 -> ~chi_2- t )
     5.01514547E-01    2     1000021         5   # BR(~b_1 -> ~g      b )
     6.23332250E-02    2     1000006       -24   # BR(~b_1 -> ~t_1    W-)
#
#         PDG            Width
DECAY   2000005     2.35453525E+02   # sbottom2 decays
#          BR         NDA      ID1       ID2
     1.00620102E-02    2     1000022         5   # BR(~b_2 -> ~chi_10 b )
     7.84752833E-02    2     1000023         5   # BR(~b_2 -> ~chi_20 b )
     7.17540434E-02    2     1000025         5   # BR(~b_2 -> ~chi_30 b )
     2.18959930E-05    2     1000035         5   # BR(~b_2 -> ~chi_40 b )
     1.89239633E-02    2    -1000024         6   # BR(~b_2 -> ~chi_1- t )
     1.41078765E-01    2    -1000037         6   # BR(~b_2 -> ~chi_2- t )
     6.79371539E-01    2     1000021         5   # BR(~b_2 -> ~g      b )
     2.51058470E-05    2     1000005        25   # BR(~b_2 -> ~b_1    h )
     2.43020716E-05    2     1000005        23   # BR(~b_2 -> ~b_1    Z )
     2.10328717E-04    2     1000006       -24   # BR(~b_2 -> ~t_1    W-)
     5.27629775E-05    2     2000006       -24   # BR(~b_2 -> ~t_2    W-)
#
#         PDG            Width
DECAY   1000002     1.99488093E+02   # sup_L decays
#          BR         NDA      ID1       ID2
     5.90486635E-02    2     1000022         2   # BR(~u_L -> ~chi_10 u)
     7.53075321E-04    2     1000023         2   # BR(~u_L -> ~chi_20 u)
     5.22742493E-03    2     1000025         2   # BR(~u_L -> ~chi_30 u)
     1.26092279E-01    2     1000024         1   # BR(~u_L -> ~chi_1+ d)
     4.09429163E-03    2     1000037         1   # BR(~u_L -> ~chi_2+ d)
     8.04784266E-01    2     1000021         2   # BR(~u_L -> ~g      u)
#
#         PDG            Width
DECAY   2000002     1.57891654E+02   # sup_R decays
#          BR         NDA      ID1       ID2
     1.16465962E-07    2     1000022         2   # BR(~u_R -> ~chi_10 u)
     3.97210205E-06    2     1000023         2   # BR(~u_R -> ~chi_20 u)
     2.78231733E-06    2     1000025         2   # BR(~u_R -> ~chi_30 u)
     9.99993129E-01    2     1000021         2   # BR(~u_R -> ~g      u)
#
#         PDG            Width
DECAY   1000001     1.99511368E+02   # sdown_L decays
#          BR         NDA      ID1       ID2
     5.89829242E-02    2     1000022         1   # BR(~d_L -> ~chi_10 d)
     7.05081388E-04    2     1000023         1   # BR(~d_L -> ~chi_20 d)
     5.33660276E-03    2     1000025         1   # BR(~d_L -> ~chi_30 d)
     1.11267195E-01    2    -1000024         2   # BR(~d_L -> ~chi_1- u)
     1.86491425E-02    2    -1000037         2   # BR(~d_L -> ~chi_2- u)
     8.05059054E-01    2     1000021         1   # BR(~d_L -> ~g      d)
#
#         PDG            Width
DECAY   2000001     5.05660191E-01   # sdown_R decays
#           BR         NDA      ID1       ID2
     3.78153438E-06    2     1000022         1   # BR(~d_R -> ~chi_10 d)
     1.18779140E-04    2     1000023         1   # BR(~d_R -> ~chi_20 d)
     8.25996581E-05    2     1000025         1   # BR(~d_R -> ~chi_30 d)
     9.99794840E-01    2     1000021         1   # BR(~d_R -> ~g      d)
#
#         PDG            Width
DECAY   1000004     1.69186934E+02   # scharm_L decays
#          BR         NDA      ID1       ID2
     7.20670143E-02    2     1000022         4   # BR(~c_L -> ~chi_10 c)
     9.18527803E-04    2     1000023         4   # BR(~c_L -> ~chi_20 c)
     6.37569372E-03    2     1000025         4   # BR(~c_L -> ~chi_30 c)
     1.53891421E-01    2     1000024         3   # BR(~c_L -> ~chi_1+ s)
     4.99357501E-03    2     1000037         3   # BR(~c_L -> ~chi_2+ s)
     7.61753768E-01    2     1000021         4   # BR(~c_L -> ~g      c)
#
#         PDG            Width
DECAY   2000004     1.26749172E+02   # scharm_R decays
#          BR         NDA      ID1       ID2
     1.50189489E-07    2     1000022         4   # BR(~c_R -> ~chi_10 c)
     5.11896504E-06    2     1000023         4   # BR(~c_R -> ~chi_20 c)
     3.58553393E-06    2     1000025         4   # BR(~c_R -> ~chi_30 c)
     9.99991145E-01    2     1000021         4   # BR(~c_R -> ~g      c)
#
#         PDG            Width
DECAY   1000003     1.69191865E+02   # sstrange_L decays
#          BR         NDA      ID1       ID2
     7.19928898E-02    2     1000022         3   # BR(~s_L -> ~chi_10 s)
     8.60062801E-04    2     1000023         3   # BR(~s_L -> ~chi_20 s)
     6.50940884E-03    2     1000025         3   # BR(~s_L -> ~chi_30 s)
     1.35809331E-01    2    -1000024         4   # BR(~s_L -> ~chi_1- c)
     2.27472240E-02    2    -1000037         4   # BR(~s_L -> ~chi_2- c)
     7.62081083E-01    2     1000021         3   # BR(~s_L -> ~g      s)
#
#         PDG            Width
DECAY   2000003     4.05948578E-01   # sstrange_R decays
#           BR         NDA      ID1       ID2
     4.93893756E-06    2     1000022         3   # BR(~s_R -> ~chi_10 s)
     1.54748206E-04    2     1000023         3   # BR(~s_R -> ~chi_20 s)
     1.07597488E-04    2     1000025         3   # BR(~s_R -> ~chi_30 s)
     9.99732715E-01    2     1000021         3   # BR(~s_R -> ~g      s)
#
#         PDG            Width
DECAY   1000011     2.20791027E+01   # selectron_L decays
#          BR         NDA      ID1       ID2
     3.05035893E-01    2     1000022        11   # BR(~e_L -> ~chi_10 e-)
     3.97309987E-03    2     1000023        11   # BR(~e_L -> ~chi_20 e-)
     2.52508691E-02    2     1000025        11   # BR(~e_L -> ~chi_30 e-)
     5.73951235E-01    2    -1000024        12   # BR(~e_L -> ~chi_1- nu_e)
     9.17889028E-02    2    -1000037        12   # BR(~e_L -> ~chi_2- nu_e)
#
#         PDG            Width
DECAY   2000011     1.38071415E-02   # selectron_R decays
#           BR         NDA      ID1       ID2
     3.10903097E-03    2     1000022        11   # BR(~e_R -> ~chi_10 e-)
#           BR         NDA      ID1       ID2       ID3
     1.75184705E-02    3        11       -1        2000001   # BR(~e_R- -> e-  db  ~d_R)
     3.68005211E-02    3        11       1        -2000001   # BR(~e_R- -> e-  d  ~d_R*)
     1.12963281E-12    3        11       -2        2000002   # BR(~e_R- -> e-  ub  ~u_R)
     1.40130382E-12    3        11       2        -2000002   # BR(~e_R- -> e-  u  ~u_R*)
     1.74764632E-02    3        11       -3        2000003   # BR(~e_R- -> e-  sb  ~s_R)
     3.74914680E-02    3        11       3        -2000003   # BR(~e_R- -> e-  s  ~s_R*)
     9.32560881E-13    3        11       -4        2000004   # BR(~e_R- -> e-  cb  ~c_R)
     1.16171766E-12    3        11       4        -2000004   # BR(~e_R- -> e-  c  ~c_R*)
     9.08877485E-02    3        11       -6        1000006   # BR(~e_R- -> e-  tb  ~t_1)
     2.09565464E-01    3        11       6        -1000006   # BR(~e_R- -> e-  t  ~t_1*)
     1.11485785E-02    3        11       -11        1000011   # BR(~e_R- -> e-  e+  ~e_L-)
     5.84617753E-03    3        11       11        -1000011   # BR(~e_R- -> e-  e-  ~e_L+)
     1.12724274E-02    3        11       -12        1000012   # BR(~e_R- -> e-  nu_eb  ~nu_eL)
     5.91730015E-03    3        11       12        -1000012   # BR(~e_R- -> e-  nu_e  ~nu_eL*)
     1.10493545E-02    3        11       -13        1000013   # BR(~e_R- -> e-  mu+  ~mu_L-)
     5.92447035E-03    3        11       13        -1000013   # BR(~e_R- -> e-  mu-  ~mu_L+)
     1.11239535E-02    3        11       -14        1000014   # BR(~e_R- -> e-  nu_mub  ~nu_muL)
     5.96459451E-03    3        11       14        -1000014   # BR(~e_R- -> e-  nu_mu  ~nu_muL*)
     1.29918276E-02    3        11       -15        1000015   # BR(~e_R- -> e-  tau+  ~tau_1-)
     2.28678762E-02    3        11       15        -1000015   # BR(~e_R- -> e-  tau-  ~tau_1+)
     3.45589275E-04    3        11       -15        2000015   # BR(~e_R- -> e-  tau+  ~tau_2-)
     2.36290764E-04    3        11       15        -2000015   # BR(~e_R- -> e-  tau-  ~tau_2+)
     3.45842768E-04    3        11       -16        1000016   # BR(~e_R- -> e-  nu_taub  ~nu_tau1)
     2.38383883E-04    3        11       16        -1000016   # BR(~e_R- -> e-  nu_tau  ~nu_tau1*)
     3.43097812E-02    3        11       23        1000022   # BR(~e_R- -> e-  Z  ~chi_10)
     2.03836545E-02    3        11       25        1000022   # BR(~e_R- -> e-  h  ~chi_10)
     2.89893459E-02    3        11       23        1000023   # BR(~e_R- -> e-  Z  ~chi_20)
     4.58682924E-02    3        11       25        1000023   # BR(~e_R- -> e-  h  ~chi_20)
     4.36578421E-02    3        11       23        1000025   # BR(~e_R- -> e-  Z  ~chi_30)
     2.55729980E-02    3        11       25        1000025   # BR(~e_R- -> e-  h  ~chi_30)
     6.82451183E-02    3        11       -24        1000024   # BR(~e_R- -> e-  W-  ~chi_1+)
     6.94321851E-02    3        11       24        -1000024   # BR(~e_R- -> e-  W+  ~chi_1-)
     3.37376134E-02    3        11       -24        1000037   # BR(~e_R- -> e-  W-  ~chi_2+)
     1.11681336E-01    3        11       24        -1000037   # BR(~e_R- -> e-  W+  ~chi_2-)
#
#         PDG            Width
DECAY   1000013     2.20791026E+01   # smuon_L decays
#          BR         NDA      ID1       ID2
     3.05035892E-01    2     1000022        13   # BR(~mu_L -> ~chi_10 mu-)
     3.97309985E-03    2     1000023        13   # BR(~mu_L -> ~chi_20 mu-)
     2.52508690E-02    2     1000025        13   # BR(~mu_L -> ~chi_30 mu-)
     5.73951236E-01    2    -1000024        14   # BR(~mu_L -> ~chi_1- nu_mu)
     9.17889030E-02    2    -1000037        14   # BR(~mu_L -> ~chi_2- nu_mu)
#
#         PDG            Width
DECAY   2000013     1.37989144E-02   # smuon_R decays
#           BR         NDA      ID1       ID2
     3.11088462E-03    2     1000022        13   # BR(~mu_R -> ~chi_10 mu-)
#           BR         NDA      ID1       ID2       ID3
     1.75289153E-02    3        13       -1        2000001   # BR(~mu_R- -> mu-  db  ~d_R)
     3.68224621E-02    3        13       1        -2000001   # BR(~mu_R- -> mu-  d  ~d_R*)
     1.13175570E-12    3        13       -2        2000002   # BR(~mu_R- -> mu-  ub  ~u_R)
     1.38887738E-12    3        13       2        -2000002   # BR(~mu_R- -> mu-  u  ~u_R*)
     1.74868829E-02    3        13       -3        2000003   # BR(~mu_R- -> mu-  sb  ~s_R)
     3.77196341E-02    3        13       3        -2000003   # BR(~mu_R- -> mu-  s  ~s_R*)
     9.28188962E-13    3        13       -4        2000004   # BR(~mu_R- -> mu-  cb  ~c_R)
     1.15226456E-12    3        13       4        -2000004   # BR(~mu_R- -> mu-  c  ~c_R*)
     8.99998339E-02    3        13       -6        1000006   # BR(~mu_R- -> mu-  tb  ~t_1)
     2.09704904E-01    3        13       6        -1000006   # BR(~mu_R- -> mu-  t  ~t_1*)
     1.11552254E-02    3        13       -11        1000011   # BR(~mu_R- -> mu-  e+  ~e_L-)
     5.92800259E-03    3        13       11        -1000011   # BR(~mu_R- -> mu-  e-  ~e_L+)
     1.12791482E-02    3        13       -12        1000012   # BR(~mu_R- -> mu-  nu_eb  ~nu_eL)
     5.92082813E-03    3        13       12        -1000012   # BR(~mu_R- -> mu-  nu_e  ~nu_eL*)
     1.10559422E-02    3        13       -13        1000013   # BR(~mu_R- -> mu-  mu+  ~mu_L-)
     5.91872651E-03    3        13       13        -1000013   # BR(~mu_R- -> mu-  mu-  ~mu_L+)
     1.11305858E-02    3        13       -14        1000014   # BR(~mu_R- -> mu-  nu_mub  ~nu_muL)
     5.96561425E-03    3        13       14        -1000014   # BR(~mu_R- -> mu-  nu_mu  ~nu_muL*)
     1.29995734E-02    3        13       -15        1000015   # BR(~mu_R- -> mu-  tau+  ~tau_1-)
     2.28815103E-02    3        13       15        -1000015   # BR(~mu_R- -> mu-  tau-  ~tau_1+)
     3.46882362E-04    3        13       -15        2000015   # BR(~mu_R- -> mu-  tau+  ~tau_2-)
     2.31351534E-04    3        13       15        -2000015   # BR(~mu_R- -> mu-  tau-  ~tau_2+)
     3.46048963E-04    3        13       -16        1000016   # BR(~mu_R- -> mu-  nu_taub  ~nu_tau1)
     2.38526012E-04    3        13       16        -1000016   # BR(~mu_R- -> mu-  nu_tau  ~nu_tau1*)
     3.43302370E-02    3        13       23        1000022   # BR(~mu_R- -> mu-  Z  ~chi_10)
     2.03979815E-02    3        13       25        1000022   # BR(~mu_R- -> mu-  h  ~chi_10)
     2.90066298E-02    3        13       23        1000023   # BR(~mu_R- -> mu-  Z  ~chi_20)
     4.58956397E-02    3        13       25        1000023   # BR(~mu_R- -> mu-  h  ~chi_20)
     4.36838715E-02    3        13       23        1000025   # BR(~mu_R- -> mu-  Z  ~chi_30)
     2.55875203E-02    3        13       25        1000025   # BR(~mu_R- -> mu-  h  ~chi_30)
     6.82858070E-02    3        13       -24        1000024   # BR(~mu_R- -> mu-  W-  ~chi_1+)
     6.94735816E-02    3        13       24        -1000024   # BR(~mu_R- -> mu-  W+  ~chi_1-)
     3.38193274E-02    3        13       -24        1000037   # BR(~mu_R- -> mu-  W-  ~chi_2+)
     1.11747922E-01    3        13       24        -1000037   # BR(~mu_R- -> mu-  W+  ~chi_2-)
#
#         PDG            Width
DECAY   1000015     2.06600970E+01   # stau_1 decays
#          BR         NDA      ID1       ID2
     4.23488104E-02    2     1000022        15   # BR(~tau_1 -> ~chi_10  tau-)
     2.41927624E-01    2     1000023        15   # BR(~tau_1 -> ~chi_20  tau-)
     2.15750742E-01    2     1000025        15   # BR(~tau_1 -> ~chi_30  tau-)
     8.01045242E-02    2    -1000024        16   # BR(~tau_1 -> ~chi_1-  nu_tau)
     4.19868299E-01    2    -1000037        16   # BR(~tau_1 -> ~chi_2-  nu_tau)
#
#         PDG            Width
DECAY   2000015     4.62703560E+01   # stau_2 decays
#          BR         NDA      ID1       ID2
     2.36103291E-01    2     1000022        15   # BR(~tau_2 -> ~chi_10  tau-)
     1.46090850E-01    2     1000023        15   # BR(~tau_2 -> ~chi_20  tau-)
     1.47397419E-01    2     1000025        15   # BR(~tau_2 -> ~chi_30  tau-)
     4.00392198E-01    2    -1000024        16   # BR(~tau_2 -> ~chi_1-  nu_tau)
     6.88853333E-02    2    -1000037        16   # BR(~tau_2 -> ~chi_2-  nu_tau)
     5.60807814E-04    2     1000015        25   # BR(~tau_2 -> ~tau_1   h)
     5.70100709E-04    2     1000015        23   # BR(~tau_2 -> ~tau_1   Z)
#
#         PDG            Width
DECAY   1000012     2.21565259E+01   # snu_eL decays
#          BR         NDA      ID1       ID2
     3.02477879E-01    2     1000022        12   # BR(~nu_eL -> ~chi_10 nu_e)
     3.24334555E-03    2     1000023        12   # BR(~nu_eL -> ~chi_20 nu_e)
     2.67255744E-02    2     1000025        12   # BR(~nu_eL -> ~chi_30 nu_e)
     6.47495178E-01    2     1000024        11   # BR(~nu_eL -> ~chi_1+ e-)
     2.00580231E-02    2     1000037        11   # BR(~nu_eL -> ~chi_2+ e-)
#
#         PDG            Width
DECAY   1000014     2.21565258E+01   # snu_muL decays
#          BR         NDA      ID1       ID2
     3.02477880E-01    2     1000022        14   # BR(~nu_muL -> ~chi_10 nu_mu)
     3.24334556E-03    2     1000023        14   # BR(~nu_muL -> ~chi_20 nu_mu)
     2.67255745E-02    2     1000025        14   # BR(~nu_muL -> ~chi_30 nu_mu)
     6.47495176E-01    2     1000024        13   # BR(~nu_muL -> ~chi_1+ mu-)
     2.00580231E-02    2     1000037        13   # BR(~nu_muL -> ~chi_2+ mu-)
#
#         PDG            Width
DECAY   1000016     4.63151641E+01   # snu_tauL decays
#          BR         NDA      ID1       ID2
     2.12838233E-01    2     1000022        16   # BR(~nu_tauL -> ~chi_10 nu_tau)
     2.35565534E-03    2     1000023        16   # BR(~nu_tauL -> ~chi_20 nu_tau)
     1.94642370E-02    2     1000025        16   # BR(~nu_tauL -> ~chi_30 nu_tau)
     4.99667095E-01    2     1000024        15   # BR(~nu_tauL -> ~chi_1+ tau-)
     2.64564012E-01    2     1000037        15   # BR(~nu_tauL -> ~chi_2+ tau-)
     1.11076782E-03    2    -1000015       -24   # BR(~nu_tauL -> ~tau_1+ W-)
#
#         PDG            Width
DECAY   1000024     1.57036590E-13   # chargino1+ decays
#           BR         NDA      ID1       ID2       ID3
     7.44568850E-02    3     1000022       -11        12   # BR(~chi_1+ -> ~chi_10 e+   nu_e)
     5.76390840E-02    3     1000022       -13        14   # BR(~chi_1+ -> ~chi_10 mu+  nu_mu)
     8.65963950E-01    2     1000022       211             # BR(~chi_1+ -> ~chi_10 pi+)
     1.94006550E-03    3     1000022       211        111   # BR(~chi_1+ -> ~chi_10 pi+ pi0)
     7.18501200E-09    4     1000022       211        111       111 # BR(~chi_1+ -> ~chi_10 pi+ pi0 pi0)
     7.18501200E-09    4     1000022       211        211      -211 # BR(~chi_1+ -> ~chi_10 pi+ pi+ pi-)
#
#         PDG            Width
DECAY   1000037     1.50634459E+00   # chargino2+ decays
#          BR         NDA      ID1       ID2
     3.61190450E-01    2     1000024        23   # BR(~chi_2+ -> ~chi_1+  Z )
     3.84145367E-01    2     1000022        24   # BR(~chi_2+ -> ~chi_10  W+)
     2.54664183E-01    2     1000024        25   # BR(~chi_2+ -> ~chi_1+  h )
#
#         PDG            Width
DECAY   1000022     0.00000000E+00   # neutralino1 decays
#
#         PDG            Width
DECAY   1000023     1.47959633E+00   # neutralino2 decays
#          BR         NDA      ID1       ID2
     2.77525219E-01    2     1000022        23   # BR(~chi_20 -> ~chi_10   Z )
     3.49831612E-01    2     1000024       -24   # BR(~chi_20 -> ~chi_1+   W-)
     3.49831612E-01    2    -1000024        24   # BR(~chi_20 -> ~chi_1-   W+)
     2.28115574E-02    2     1000022        25   # BR(~chi_20 -> ~chi_10   h )
#
#         PDG            Width
DECAY   1000025     1.66383112E+00   # neutralino3 decays
#          BR         NDA      ID1       ID2
     5.11993616E-02    2     1000022        23   # BR(~chi_30 -> ~chi_10   Z )
     3.67593115E-01    2     1000024       -24   # BR(~chi_30 -> ~chi_1+   W-)
     3.67593115E-01    2    -1000024        24   # BR(~chi_30 -> ~chi_1-   W+)
     2.13614409E-01    2     1000022        25   # BR(~chi_30 -> ~chi_10   h )
#
#         PDG            Width
DECAY   1000035     6.39195184E+01   # neutralino4 decays
#          BR         NDA      ID1       ID2
     8.28399162E-04    2     1000022        23   # BR(~chi_40 -> ~chi_10   Z )
     1.55463688E-02    2     1000023        23   # BR(~chi_40 -> ~chi_20   Z )
     1.97079260E-02    2     1000025        23   # BR(~chi_40 -> ~chi_30   Z )
     1.55030588E-03    2     1000024       -24   # BR(~chi_40 -> ~chi_1+   W-)
     1.55030588E-03    2    -1000024        24   # BR(~chi_40 -> ~chi_1-   W+)
     3.36255060E-02    2     1000037       -24   # BR(~chi_40 -> ~chi_2+   W-)
     3.36255060E-02    2    -1000037        24   # BR(~chi_40 -> ~chi_2-   W+)
     8.32500991E-04    2     1000022        25   # BR(~chi_40 -> ~chi_10   h )
     2.16603589E-02    2     1000023        25   # BR(~chi_40 -> ~chi_20   h )
     1.47596405E-02    2     1000025        25   # BR(~chi_40 -> ~chi_30   h )
     4.27660736E-04    2     1000002        -2   # BR(~chi_40 -> ~u_L      ub)
     4.27660736E-04    2    -1000002         2   # BR(~chi_40 -> ~u_L*     u )
     7.98306321E-03    2     2000002        -2   # BR(~chi_40 -> ~u_R      ub)
     7.98306321E-03    2    -2000002         2   # BR(~chi_40 -> ~u_R*     u )
     4.28105490E-04    2     1000001        -1   # BR(~chi_40 -> ~d_L      db)
     4.28105490E-04    2    -1000001         1   # BR(~chi_40 -> ~d_L*     d )
     3.51990321E-02    2     2000001        -1   # BR(~chi_40 -> ~d_R      db)
     3.51990321E-02    2    -2000001         1   # BR(~chi_40 -> ~d_R*     d )
     4.27656812E-04    2     1000004        -4   # BR(~chi_40 -> ~c_L      cb)
     4.27656812E-04    2    -1000004         4   # BR(~chi_40 -> ~c_L*     c )
     7.98300140E-03    2     2000004        -4   # BR(~chi_40 -> ~c_R      cb)
     7.98300140E-03    2    -2000004         4   # BR(~chi_40 -> ~c_R*     c )
     4.28105490E-04    2     1000003        -3   # BR(~chi_40 -> ~s _L      sb)
     4.28105490E-04    2    -1000003         3   # BR(~chi_40 -> ~s _L*     s )
     3.51990321E-02    2     2000003        -3   # BR(~chi_40 -> ~s _R      sb)
     3.51990321E-02    2    -2000003         3   # BR(~chi_40 -> ~s _R*     s )
     1.60081746E-01    2     1000006        -6   # BR(~chi_40 -> ~t_1      tb)
     1.60081746E-01    2    -1000006         6   # BR(~chi_40 -> ~t_1*     t )
     6.91044124E-06    2     1000005        -5   # BR(~chi_40 -> ~b_1      bb)
     6.91044124E-06    2    -1000005         5   # BR(~chi_40 -> ~b_1*     b )
     2.09129677E-02    2     1000011       -11   # BR(~chi_40 -> ~e_L-     e+)
     2.09129677E-02    2    -1000011        11   # BR(~chi_40 -> ~e_L+     e-)
     5.76257561E-03    2     2000011       -11   # BR(~chi_40 -> ~e_R-     e+)
     5.76257561E-03    2    -2000011        11   # BR(~chi_40 -> ~e_R+     e-)
     2.09129677E-02    2     1000013       -13   # BR(~chi_40 -> ~mu_L-    mu+)
     2.09129677E-02    2    -1000013        13   # BR(~chi_40 -> ~mu_L+    mu-)
     5.76257561E-03    2     2000013       -13   # BR(~chi_40 -> ~mu_R-    mu+)
     5.76257561E-03    2    -2000013        13   # BR(~chi_40 -> ~mu_R+    mu-)
     6.86839532E-02    2     1000015       -15   # BR(~chi_40 -> ~tau_1-   tau+)
     6.86839532E-02    2    -1000015        15   # BR(~chi_40 -> ~tau_1+   tau-)
     7.97856810E-03    2     2000015       -15   # BR(~chi_40 -> ~tau_2-   tau+)
     7.97856810E-03    2    -2000015        15   # BR(~chi_40 -> ~tau_2+   tau-)
     2.09826929E-02    2     1000012       -12   # BR(~chi_40 -> ~nu_eL    nu_eb)
     2.09826929E-02    2    -1000012        12   # BR(~chi_40 -> ~nu_eL*   nu_e )
     2.09826929E-02    2     1000014       -14   # BR(~chi_40 -> ~nu_muL   nu_mub)
     2.09826929E-02    2    -1000014        14   # BR(~chi_40 -> ~nu_muL*  nu_mu )
     8.01328366E-03    2     1000016       -16   # BR(~chi_40 -> ~nu_tau1  nu_taub)
     8.01328366E-03    2    -1000016        16   # BR(~chi_40 -> ~nu_tau1* nu_tau )
#
#         PDG            Width
DECAY        25     3.96392434E-03   # h decays
#          BR         NDA      ID1       ID2
     5.90869640E-01    2           5        -5   # BR(h -> b       bb     )
     6.54641413E-02    2         -15        15   # BR(h -> tau+    tau-   )
     2.31717078E-04    2         -13        13   # BR(h -> mu+     mu-    )
     2.53022239E-04    2           3        -3   # BR(h -> s       sb     )
     2.18692793E-02    2           4        -4   # BR(h -> c       cb     )
     8.08791651E-02    2          21        21   # BR(h -> g       g      )
     2.37692337E-03    2          22        22   # BR(h -> gam     gam    )
     1.56539050E-03    2          22        23   # BR(h -> Z       gam    )
     2.10270561E-01    2          24       -24   # BR(h -> W+      W-     )
     2.62201606E-02    2          23        23   # BR(h -> Z       Z      )
#
#         PDG            Width
DECAY        35     1.72086675E+02   # H decays
#          BR         NDA      ID1       ID2
     6.28054205E-01    2           5        -5   # BR(H -> b       bb     )
     1.08639527E-01    2         -15        15   # BR(H -> tau+    tau-   )
     3.81984763E-04    2         -13        13   # BR(H -> mu+     mu-    )
     2.61495233E-04    2           3        -3   # BR(H -> s       sb     )
     3.37826160E-09    2           4        -4   # BR(H -> c       cb     )
     3.33139387E-04    2           6        -6   # BR(H -> t       tb     )
     7.67935228E-06    2          21        21   # BR(H -> g       g      )
     1.07929278E-08    2          22        22   # BR(H -> gam     gam    )
     5.01314118E-09    2          23        22   # BR(H -> Z       gam    )
     1.09348656E-07    2          24       -24   # BR(H -> W+      W-     )
     5.45756006E-08    2          23        23   # BR(H -> Z       Z      )
     3.30719231E-07    2          25        25   # BR(H -> h       h      )
     2.45381760E-02    2     1000024  -1000024   # BR(H -> ~chi_1+ ~chi_1-)
     4.18946257E-03    2     1000037  -1000037   # BR(H -> ~chi_2+ ~chi_2-)
     7.31062641E-02    2     1000024  -1000037   # BR(H -> ~chi_1+ ~chi_2-)
     7.31062641E-02    2     1000037  -1000024   # BR(H -> ~chi_2+ ~chi_1-)
     1.21055132E-02    2     1000022   1000022   # BR(H -> ~chi_10 ~chi_10)
     8.84223810E-04    2     1000023   1000023   # BR(H -> ~chi_20 ~chi_20)
     5.99510480E-03    2     1000025   1000025   # BR(H -> ~chi_30 ~chi_30)
     3.70533928E-02    2     1000022   1000023   # BR(H -> ~chi_10 ~chi_20)
     2.47866684E-02    2     1000022   1000025   # BR(H -> ~chi_10 ~chi_30)
     6.54483716E-03    2     1000023   1000025   # BR(H -> ~chi_20 ~chi_30)
     1.15441158E-05    2     1000006  -1000006   # BR(H -> ~t_1    ~t_1*  )
     2.43934638E-09    2     2000001  -2000001   # BR(H -> ~d_R    ~d_R*  )
     2.43934638E-09    2     2000003  -2000003   # BR(H -> ~s_R    ~s_R*  )
#
#         PDG            Width
DECAY        36     1.72087158E+02   # A decays
#          BR         NDA      ID1       ID2
     6.28060746E-01    2           5        -5   # BR(A -> b       bb     )
     1.08639411E-01    2         -15        15   # BR(A -> tau+    tau-   )
     3.81983992E-04    2         -13        13   # BR(A -> mu+     mu-    )
     2.61502020E-04    2           3        -3   # BR(A -> s       sb     )
     3.39770878E-09    2           4        -4   # BR(A -> c       cb     )
     3.33904512E-04    2           6        -6   # BR(A -> t       tb     )
     1.30646019E-05    2          21        21   # BR(A -> g       g      )
     3.56220265E-08    2          22        22   # BR(A -> gam     gam    )
     9.70640949E-09    2          23        22   # BR(A -> Z       gam    )
     1.10910631E-07    2          23        25   # BR(A -> Z       h      )
     2.56076457E-02    2     1000024  -1000024   # BR(A -> ~chi_1+ ~chi_1-)
     5.23761900E-03    2     1000037  -1000037   # BR(A -> ~chi_2+ ~chi_2-)
     7.20472449E-02    2     1000024  -1000037   # BR(A -> ~chi_1+ ~chi_2-)
     7.20472449E-02    2     1000037  -1000024   # BR(A -> ~chi_2+ ~chi_1-)
     1.26601289E-02    2     1000022   1000022   # BR(A -> ~chi_10 ~chi_10)
     8.46336614E-04    2     1000023   1000023   # BR(A -> ~chi_20 ~chi_20)
     6.78660605E-03    2     1000025   1000025   # BR(A -> ~chi_30 ~chi_30)
     3.34159753E-02    2     1000022   1000023   # BR(A -> ~chi_10 ~chi_20)
     2.76134313E-02    2     1000022   1000025   # BR(A -> ~chi_10 ~chi_30)
     6.04699552E-03    2     1000023   1000025   # BR(A -> ~chi_20 ~chi_30)
#
#         PDG            Width
DECAY        37     1.73250032E+02   # H+ decays
#          BR         NDA      ID1       ID2
     1.05940583E-03    2           4        -5   # BR(H+ -> c       bb     )
     1.07940680E-01    2         -15        16   # BR(H+ -> tau+    nu_tau )
     3.79527202E-04    2         -13        14   # BR(H+ -> mu+     nu_mu  )
     1.05940496E-05    2           2        -5   # BR(H+ -> u       bb     )
     1.29997771E-05    2           2        -3   # BR(H+ -> u       sb     )
     2.55878331E-04    2           4        -3   # BR(H+ -> c       sb     )
     6.29993123E-01    2           6        -5   # BR(H+ -> t       bb     )
     1.10306612E-07    2          24        25   # BR(H+ -> W+      h      )
     8.56057421E-15    2          24        36   # BR(H+ -> W+      A      )
     8.49875456E-08    2     1000024   1000022   # BR(H+ -> ~chi_1+ ~chi_10)
     7.90426239E-02    2     1000024   1000023   # BR(H+ -> ~chi_1+ ~chi_20)
     8.20306959E-02    2     1000024   1000025   # BR(H+ -> ~chi_1+ ~chi_30)
     9.21078453E-02    2     1000037   1000022   # BR(H+ -> ~chi_2+ ~chi_10)
     6.39095753E-03    2     1000037   1000023   # BR(H+ -> ~chi_2+ ~chi_20)
     7.75474082E-04    2     1000037   1000025   # BR(H+ -> ~chi_2+ ~chi_30)
