#
#                              ======================
#                              | THE SUSYHIT OUTPUT |
#                              ======================
#
#
#              ------------------------------------------------------
#              |     This is the output of the SUSY-HIT package     |
#              |  created by A.Djouadi, M.Muehlleitner and M.Spira. |
#              |  In case of problems with SUSY-HIT email to        |
#              |           margarete.muehlleitner@cern.ch           |
#              |           michael.spira@psi.ch                     |
#              |           abdelhak.djouadi@cern.ch                 |
#              ------------------------------------------------------
#
#              ------------------------------------------------------
#              |  SUSY Les Houches Accord - MSSM Spectrum + Decays  |
#              |              based on the decay programs           |
#              |                                                    |
#              |                     SDECAY 1.3b                    |
#              |                                                    |
#              |  Authors: M.Muhlleitner, A.Djouadi and Y.Mambrini  |
#              |  Ref.:    Comput.Phys.Commun.168(2005)46           |
#              |           [hep-ph/0311167]                         |
#              |                                                    |
#              |                     HDECAY 3.4                     |
#              |                                                    |
#              |  By: A.Djouadi,J.Kalinowski,M.Muhlleitner,M.Spira  |
#              |  Ref.:    Comput.Phys.Commun.108(1998)56           |
#              |           [hep-ph/9704448]                         |
#              |                                                    |
#              |                                                    |
#              |  If not stated otherwise all DRbar couplings and   |
#              |  soft SUSY breaking masses are given at the scale  |
#              |  Q=  0.24410080E+04
#              |                                                    |
#              ------------------------------------------------------
#
#
BLOCK DCINFO  # Decay Program information
     1   SDECAY/HDECAY # decay calculator
     2   1.3b  /3.4    # version number
#
BLOCK SPINFO  # Spectrum calculator information
     1     SOFTSUSY    # spectrum calculator               
     2     3.4.0       # version number                    
#
BLOCK MODSEL  # Model selection
     1     0   #  nonUniversal                                     
#
BLOCK SMINPUTS  # Standard Model inputs
         1     1.27908970E+02   # alpha_em^-1(M_Z)^MSbar
         2     1.16637870E-05   # G_F [GeV^-2]
         3     1.18400000E-01   # alpha_S(M_Z)^MSbar
         4     9.11876000E+01   # M_Z pole mass
         5     4.18000000E+00   # mb(mb)^MSbar
         6     1.73200000E+02   # mt pole mass
         7     1.77700000E+00   # mtau pole mass
#
BLOCK MINPAR  # Input parameters - minimal models
         3     3.56500000E+01   # tanb                
#
BLOCK EXTPAR  # Input parameters - non-minimal models
         0    -1.00000000E+00   # Set                 
         1     6.42800000E+01   # M_1(MX)             
         2    -3.05197000E+03   # M_2(MX)             
         3     1.58657000E+03   # M_3(MX)             
        11    -3.22482000E+03   # At(MX)              
        12     1.40667000E+03   # Ab(MX)              
        13    -3.43770000E+02   # Atau(MX)            
        23    -1.19970000E+02   # mu(MX)              
        26     3.48391000E+03   # mA(pole)            
        31     3.71620000E+03   # meL(MX)             
        32     3.71620000E+03   # mmuL(MX)            
        33     2.94380000E+03   # mtauL(MX)           
        34     1.78979000E+03   # meR(MX)             
        35     1.78979000E+03   # mmuR(MX)            
        36     3.97953000E+03   # mtauR(MX)           
        41     1.31224000E+03   # mqL1(MX)            
        42     1.31224000E+03   # mqL2(MX)            
        43     1.71376000E+03   # mqL3(MX)            
        44     6.70930000E+02   # muR(MX)             
        45     6.70930000E+02   # mcR(MX)             
        46     3.47409000E+03   # mtR(MX)             
        47     2.69728000E+03   # mdR(MX)             
        48     2.69728000E+03   # msR(MX)             
        49     6.10620000E+02   # mbR(MX)             
#
BLOCK MASS  # Mass Spectrum
# PDG code           mass       particle
        24     8.03867082E+01   # W+
        25     1.25093550E+02   # h
        35     3.48391521E+03   # H
        36     3.48390999E+03   # A
        37     3.48516886E+03   # H+
         5     4.81876030E+00   # b-quark pole mass calculated from mb(mb)_Msbar
   1000001     1.42735459E+03   # ~d_L
   2000001     2.74142402E+03   # ~d_R
   1000002     1.42525754E+03   # ~u_L
   2000002     8.10129401E+02   # ~u_R
   1000003     1.42735459E+03   # ~s_L
   2000003     2.74142402E+03   # ~s_R
   1000004     1.42525754E+03   # ~c_L
   2000004     8.10129401E+02   # ~c_R
   1000005     7.33562288E+02   # ~b_1
   2000005     1.78436707E+03   # ~b_2
   1000006     1.78253409E+03   # ~t_1
   2000006     3.47211335E+03   # ~t_2
   1000011     3.73108646E+03   # ~e_L
   2000011     1.78943919E+03   # ~e_R
   1000012     3.72991048E+03   # ~nu_eL
   1000013     3.73108646E+03   # ~mu_L
   2000013     1.78943919E+03   # ~mu_R
   1000014     3.72991048E+03   # ~nu_muL
   1000015     2.96117594E+03   # ~tau_1
   2000015     3.97689685E+03   # ~tau_2
   1000016     2.95978373E+03   # ~nu_tauL
   1000021     1.69872490E+03   # ~g
   1000022     5.62875442E+01   # ~chi_10
   1000023    -1.30310817E+02   # ~chi_20
   1000025     1.39295165E+02   # ~chi_30
   1000035    -3.02721505E+03   # ~chi_40
   1000024     1.26102286E+02   # ~chi_1+
   1000037     3.02738147E+03   # ~chi_2+
#
BLOCK NMIX  # Neutralino Mixing Matrix
  1  1     9.08757050E-01   # N_11
  1  2     3.92068745E-03   # N_12
  1  3    -3.84245790E-01   # N_13
  1  4    -1.62789513E-01   # N_14
  2  1    -1.63296375E-01   # N_21
  2  2    -1.97025270E-02   # N_22
  2  3    -6.86481882E-01   # N_23
  2  4     7.08299887E-01   # N_24
  3  1     3.84050447E-01   # N_31
  3  2    -1.65719471E-02   # N_32
  3  3     6.17328597E-01   # N_33
  3  4     6.86393493E-01   # N_34
  4  1    -4.15980978E-04   # N_41
  4  2     9.99660847E-01   # N_42
  4  3    -1.78919011E-03   # N_43
  4  4     2.59772314E-02   # N_44
#
BLOCK UMIX  # Chargino Mixing Matrix U
  1  1     2.52722519E-03   # U_11
  1  2     9.99996807E-01   # U_12
  2  1    -9.99996807E-01   # U_21
  2  2     2.52722519E-03   # U_22
#
BLOCK VMIX  # Chargino Mixing Matrix V
  1  1    -3.67112033E-02   # V_11
  1  2    -9.99325917E-01   # V_12
  2  1     9.99325917E-01   # V_21
  2  2    -3.67112033E-02   # V_22
#
BLOCK STOPMIX  # Stop Mixing Matrix
  1  1     9.98597683E-01   # cos(theta_t)
  1  2     5.29402258E-02   # sin(theta_t)
  2  1    -5.29402258E-02   # -sin(theta_t)
  2  2     9.98597683E-01   # cos(theta_t)
#
BLOCK SBOTMIX  # Sbottom Mixing Matrix
  1  1    -5.12747666E-03   # cos(theta_b)
  1  2     9.99986854E-01   # sin(theta_b)
  2  1    -9.99986854E-01   # -sin(theta_b)
  2  2    -5.12747666E-03   # cos(theta_b)
#
BLOCK STAUMIX  # Stau Mixing Matrix
  1  1     9.99999514E-01   # cos(theta_tau)
  1  2    -9.85900484E-04   # sin(theta_tau)
  2  1     9.85900484E-04   # -sin(theta_tau)
  2  2     9.99999514E-01   # cos(theta_tau)
#
BLOCK ALPHA  # Higgs mixing
          -2.88479215E-02   # Mixing angle in the neutral Higgs boson sector
#
BLOCK HMIX Q=  2.44100800E+03  # DRbar Higgs Parameters
         1    -1.22441254E+02   # mu(Q)MSSM           
         2     3.47256572E+01   # tan                 
         3     2.43041032E+02   # higgs               
         4     1.21260446E+07   # mA^2(Q)MSSM         
#
BLOCK GAUGE Q=  2.44100800E+03  # The gauge couplings
     1     3.64946283E-01   # gprime(Q) DRbar
     2     6.38863113E-01   # g(Q) DRbar
     3     1.03080143E+00   # g3(Q) DRbar
#
BLOCK AU Q=  2.44100800E+03  # The trilinear couplings
  1  1     0.00000000E+00   # A_u(Q) DRbar
  2  2     0.00000000E+00   # A_c(Q) DRbar
  3  3    -3.22481999E+03   # A_t(Q) DRbar
#
BLOCK AD Q=  2.44100800E+03  # The trilinear couplings
  1  1     0.00000000E+00   # A_d(Q) DRbar
  2  2     0.00000000E+00   # A_s(Q) DRbar
  3  3     1.40667000E+03   # A_b(Q) DRbar
#
BLOCK AE Q=  2.44100800E+03  # The trilinear couplings
  1  1     0.00000000E+00   # A_e(Q) DRbar
  2  2     0.00000000E+00   # A_mu(Q) DRbar
  3  3    -3.43769999E+02   # A_tau(Q) DRbar
#
BLOCK Yu Q=  2.44100800E+03  # The Yukawa couplings
  1  1     0.00000000E+00   # y_u(Q) DRbar
  2  2     0.00000000E+00   # y_c(Q) DRbar
  3  3     8.23368464E-01   # y_t(Q) DRbar
#
BLOCK Yd Q=  2.44100800E+03  # The Yukawa couplings
  1  1     0.00000000E+00   # y_d(Q) DRbar
  2  2     0.00000000E+00   # y_s(Q) DRbar
  3  3     4.90681661E-01   # y_b(Q) DRbar
#
BLOCK Ye Q=  2.44100800E+03  # The Yukawa couplings
  1  1     0.00000000E+00   # y_e(Q) DRbar
  2  2     0.00000000E+00   # y_mu(Q) DRbar
  3  3     3.56781967E-01   # y_tau(Q) DRbar
#
BLOCK MSOFT Q=  2.44100800E+03  # The soft SUSY breaking masses at the scale Q
         1     6.42800000E+01   # M_1(Q)              
         2    -3.05197000E+03   # M_2(Q)              
         3     1.58657000E+03   # M_3(Q)              
        21     1.21472938E+07   # mH1^2(Q)            
        22     4.31643804E+04   # mH2^2(Q)            
        31     3.71620000E+03   # meL(Q)              
        32     3.71620000E+03   # mmuL(Q)             
        33     2.94380000E+03   # mtauL(Q)            
        34     1.78979000E+03   # meR(Q)              
        35     1.78979000E+03   # mmuR(Q)             
        36     3.97953000E+03   # mtauR(Q)            
        41     1.31223999E+03   # mqL1(Q)             
        42     1.31223999E+03   # mqL2(Q)             
        43     1.71375999E+03   # mqL3(Q)             
        44     6.70929990E+02   # muR(Q)              
        45     6.70929990E+02   # mcR(Q)              
        46     3.47408999E+03   # mtR(Q)              
        47     2.69728000E+03   # mdR(Q)              
        48     2.69728000E+03   # msR(Q)              
        49     6.10619988E+02   # mbR(Q)              
#
Block HiggsBoundsInputHiggsCouplingsFermions
# ScalarNormEffCoupSq PseudoSNormEffCoupSq NP   IP1 IP2 IP2
    1.00408280E+00    0.00000000E+00        3  25   5   5  # h0-b-b eff. coupling^2, normalised to SM
    1.20586719E+03    0.00000000E+00        3  35   5   5  # H0-b-b eff. coupling^2, normalised to SM
    0.00000000E+00    1.20587127E+03        3  36   5   5  # A0-b-b eff. coupling^2, normalised to SM
#
    9.99996614E-01    0.00000000E+00        3  25   6   6  # h0-t-t eff. coupling^2, normalised to SM
    8.32661681E-04    0.00000000E+00        3  35   6   6  # H0-t-t eff. coupling^2, normalised to SM
    0.00000000E+00    8.29275916E-04        3  36   6   6  # A0-t-t eff. coupling^2, normalised to SM
#
    1.00408280E+00    0.00000000E+00        3  25  15  15  # h0-tau-tau eff. coupling^2, normalised to SM
    1.20586719E+03    0.00000000E+00        3  35  15  15  # H0-tau-tau eff. coupling^2, normalised to SM
    0.00000000E+00    1.20587127E+03        3  36  15  15  # A0-tau-tau eff. coupling^2, normalised to SM
#
Block HiggsBoundsInputHiggsCouplingsBosons
    9.99999997E-01        3  25  24  24  # h0-W-W eff. coupling^2, normalised to SM
    3.44881695E-09        3  35  24  24  # H0-W-W eff. coupling^2, normalised to SM
    0.00000000E+00        3  36  24  24  # A0-W-W eff. coupling^2, normalised to SM
#
    9.99999997E-01        3  25  23  23  # h0-Z-Z eff. coupling^2, normalised to SM
    3.44881695E-09        3  35  23  23  # H0-Z-Z eff. coupling^2, normalised to SM
    0.00000000E+00        3  36  23  23  # A0-Z-Z eff. coupling^2, normalised to SM
#
    8.90001949E-01        3  25  21  21  # h0-g-g eff. coupling^2, normalised to SM
    8.67776350E-14        3  35  21  21  # H0-g-g eff. coupling^2, normalised to SM
    7.28599544E-13        3  36  21  21  # A0-g-g eff. coupling^2, normalised to SM
#
    0.00000000E+00        3  25  25  23  # h0-h0-Z eff. coupling^2, normalised to SM
    0.00000000E+00        3  35  25  23  # H0-h0-Z eff. coupling^2, normalised to SM
    3.44881695E-09        3  36  25  23  # A0-h0-Z eff. coupling^2, normalised to SM
    0.00000000E+00        3  35  35  23  # H0-H0-Z eff. coupling^2, normalised to SM
    9.99999997E-01        3  36  35  23  # A0-H0-Z eff. coupling^2, normalised to SM
    0.00000000E+00        3  36  36  23  # A0-A0-Z eff. coupling^2, normalised to SM
#
    0.00000000E+00        4  25  21  21  23  # h0-g-g-Z eff. coupling^2, normalised to SM
    0.00000000E+00        4  35  21  21  23  # H0-g-g-Z eff. coupling^2, normalised to SM
    0.00000000E+00        4  36  21  21  23  # A0-g-g-Z eff. coupling^2, normalised to SM
#
#
#
#                             =================
#                             |The decay table|
#                             =================
#
# - The QCD corrections to the decays gluino -> squark  + quark
#                                     squark -> gaugino + quark_prime
#                                     squark -> squark_prime + Higgs
#                                     squark -> gluino  + quark
#   are included.
#
# - The multi-body decays for the inos, stops and sbottoms are included.
#
# - The loop induced decays for the gluino, neutralinos and stops
#   are included.
#
# - The SUSY decays of the top quark are included.
#
#
#         PDG            Width
DECAY         6     1.43757262E+00   # top decays
#          BR         NDA      ID1       ID2
     1.00000000E+00    2           5        24   # BR(t ->  b    W+)
#
#         PDG            Width
DECAY   1000021     7.86211308E+01   # gluino decays
#          BR         NDA      ID1       ID2
     1.98959748E-02    2     1000001        -1   # BR(~g -> ~d_L  db)
     1.98959748E-02    2    -1000001         1   # BR(~g -> ~d_L* d )
     2.01775621E-02    2     1000002        -2   # BR(~g -> ~u_L  ub)
     2.01775621E-02    2    -1000002         2   # BR(~g -> ~u_L* u )
     1.37404080E-01    2     2000002        -2   # BR(~g -> ~u_R  ub)
     1.37404080E-01    2    -2000002         2   # BR(~g -> ~u_R* u )
     1.98959748E-02    2     1000003        -3   # BR(~g -> ~s_L  sb)
     1.98959748E-02    2    -1000003         3   # BR(~g -> ~s_L* s )
     2.01772768E-02    2     1000004        -4   # BR(~g -> ~c_L  cb)
     2.01772768E-02    2    -1000004         4   # BR(~g -> ~c_L* c )
     1.37403987E-01    2     2000004        -4   # BR(~g -> ~c_R  cb)
     1.37403987E-01    2    -2000004         4   # BR(~g -> ~c_R* c )
     1.45045144E-01    2     1000005        -5   # BR(~g -> ~b_1  bb)
     1.45045144E-01    2    -1000005         5   # BR(~g -> ~b_1* b )
#
#         PDG            Width
DECAY   1000006     3.20182859E+01   # stop1 decays
#          BR         NDA      ID1       ID2
     3.04174649E-02    2     1000022         6   # BR(~t_1 -> ~chi_10 t )
     3.68524245E-01    2     1000023         6   # BR(~t_1 -> ~chi_20 t )
     3.35693295E-01    2     1000025         6   # BR(~t_1 -> ~chi_30 t )
     2.63712291E-01    2     1000024         5   # BR(~t_1 -> ~chi_1+ b )
     1.65270412E-03    2     1000005        24   # BR(~t_1 -> ~b_1    W+)
#
#         PDG            Width
DECAY   2000006     2.71781643E+02   # stop2 decays
#          BR         NDA      ID1       ID2
     2.83202308E-02    2     1000022         6   # BR(~t_2 -> ~chi_10 t )
     8.60746716E-02    2     1000023         6   # BR(~t_2 -> ~chi_20 t )
     8.66935030E-02    2     1000025         6   # BR(~t_2 -> ~chi_30 t )
     1.24051259E-07    2     1000035         6   # BR(~t_2 -> ~chi_40 t )
     1.71822880E-01    2     1000024         5   # BR(~t_2 -> ~chi_1+ b )
     1.90987815E-07    2     1000037         5   # BR(~t_2 -> ~chi_2+ b )
     4.10262916E-01    2     1000021         6   # BR(~t_2 -> ~g      t )
     5.37562459E-02    2     1000006        25   # BR(~t_2 -> ~t_1    h )
     5.53965858E-02    2     1000006        23   # BR(~t_2 -> ~t_1    Z )
     6.20575615E-06    2     1000005        24   # BR(~t_2 -> ~b_1    W+)
     1.07666446E-01    2     2000005        24   # BR(~t_2 -> ~b_2    W+)
#
#         PDG            Width
DECAY   1000005     6.65661705E+00   # sbottom1 decays
#          BR         NDA      ID1       ID2
     1.31070090E-01    2     1000022         5   # BR(~b_1 -> ~chi_10 b )
     2.34755935E-01    2     1000023         5   # BR(~b_1 -> ~chi_20 b )
     1.94910778E-01    2     1000025         5   # BR(~b_1 -> ~chi_30 b )
     4.39263198E-01    2    -1000024         6   # BR(~b_1 -> ~chi_1- t )
#
#         PDG            Width
DECAY   2000005     3.30087664E+01   # sbottom2 decays
#          BR         NDA      ID1       ID2
     4.39405451E-02    2     1000022         5   # BR(~b_2 -> ~chi_10 b )
     1.20875769E-01    2     1000023         5   # BR(~b_2 -> ~chi_20 b )
     9.95616297E-02    2     1000025         5   # BR(~b_2 -> ~chi_30 b )
     7.07188801E-01    2    -1000024         6   # BR(~b_2 -> ~chi_1- t )
     2.67173769E-02    2     1000021         5   # BR(~b_2 -> ~g      b )
     8.86229842E-04    2     1000005        25   # BR(~b_2 -> ~b_1    h )
     8.29647765E-04    2     1000005        23   # BR(~b_2 -> ~b_1    Z )
#
#         PDG            Width
DECAY   1000002     2.24553442E-01   # sup_L decays
#          BR         NDA      ID1       ID2
     7.89237710E-01    2     1000022         2   # BR(~u_L -> ~chi_10 u)
     6.42078937E-02    2     1000023         2   # BR(~u_L -> ~chi_20 u)
     7.94128279E-02    2     1000025         2   # BR(~u_L -> ~chi_30 u)
     6.71415682E-02    2     1000024         1   # BR(~u_L -> ~chi_1+ d)
#
#         PDG            Width
DECAY   2000002     1.90410385E+00   # sup_R decays
#          BR         NDA      ID1       ID2
     8.32637913E-01    2     1000022         2   # BR(~u_R -> ~chi_10 u)
     2.57875871E-02    2     1000023         2   # BR(~u_R -> ~chi_20 u)
     1.41574500E-01    2     1000025         2   # BR(~u_R -> ~chi_30 u)
#
#         PDG            Width
DECAY   1000001     2.07805442E-01   # sdown_L decays
#          BR         NDA      ID1       ID2
     7.79996648E-01    2     1000022         1   # BR(~d_L -> ~chi_10 d)
     3.49420820E-03    2     1000023         1   # BR(~d_L -> ~chi_20 d)
     2.16164833E-01    2     1000025         1   # BR(~d_L -> ~chi_30 d)
     3.44310377E-04    2    -1000024         2   # BR(~d_L -> ~chi_1- u)
#
#         PDG            Width
DECAY   2000001     8.66270903E+01   # sdown_R decays
#          BR         NDA      ID1       ID2
     1.47225088E-02    2     1000022         1   # BR(~d_R -> ~chi_10 d)
     4.73912565E-04    2     1000023         1   # BR(~d_R -> ~chi_20 d)
     2.61981824E-03    2     1000025         1   # BR(~d_R -> ~chi_30 d)
     9.82183760E-01    2     1000021         1   # BR(~d_R -> ~g      d)
#
#         PDG            Width
DECAY   1000004     2.28830031E-01   # scharm_L decays
#          BR         NDA      ID1       ID2
     7.89396304E-01    2     1000022         4   # BR(~c_L -> ~chi_10 c)
     6.41610455E-02    2     1000023         4   # BR(~c_L -> ~chi_20 c)
     7.93465824E-02    2     1000025         4   # BR(~c_L -> ~chi_30 c)
     6.70960681E-02    2     1000024         3   # BR(~c_L -> ~chi_1+ s)
#
#         PDG            Width
DECAY   2000004     1.87387293E+00   # scharm_R decays
#          BR         NDA      ID1       ID2
     8.32799452E-01    2     1000022         4   # BR(~c_R -> ~chi_10 c)
     2.57651041E-02    2     1000023         4   # BR(~c_R -> ~chi_20 c)
     1.41435444E-01    2     1000025         4   # BR(~c_R -> ~chi_30 c)
#
#         PDG            Width
DECAY   1000003     2.11784039E-01   # sstrange_L decays
#          BR         NDA      ID1       ID2
     7.80173892E-01    2     1000022         3   # BR(~s_L -> ~chi_10 s)
     3.49175175E-03    2     1000023         3   # BR(~s_L -> ~chi_20 s)
     2.15990271E-01    2     1000025         3   # BR(~s_L -> ~chi_30 s)
     3.44084943E-04    2    -1000024         4   # BR(~s_L -> ~chi_1- c)
#
#         PDG            Width
DECAY   2000003     6.02569513E+01   # sstrange_R decays
#          BR         NDA      ID1       ID2
     2.21041549E-02    2     1000022         3   # BR(~s_R -> ~chi_10 s)
     7.11103616E-04    2     1000023         3   # BR(~s_R -> ~chi_20 s)
     3.93075270E-03    2     1000025         3   # BR(~s_R -> ~chi_30 s)
     9.73253989E-01    2     1000021         3   # BR(~s_R -> ~g      s)
#
#         PDG            Width
DECAY   1000011     1.02593521E+01   # selectron_L decays
#          BR         NDA      ID1       ID2
     4.03744579E-01    2     1000022        11   # BR(~e_L -> ~chi_10 e-)
     1.88021994E-02    2     1000023        11   # BR(~e_L -> ~chi_20 e-)
     6.05643175E-02    2     1000025        11   # BR(~e_L -> ~chi_30 e-)
     1.72206900E-01    2     1000035        11   # BR(~e_L -> ~chi_40 e-)
     1.88172557E-05    2    -1000024        12   # BR(~e_L -> ~chi_1- nu_e)
     3.44663186E-01    2    -1000037        12   # BR(~e_L -> ~chi_2- nu_e)
#
#         PDG            Width
DECAY   2000011     9.44769976E+00   # selectron_R decays
#          BR         NDA      ID1       ID2
     8.27264965E-01    2     1000022        11   # BR(~e_R -> ~chi_10 e-)
     2.64815583E-02    2     1000023        11   # BR(~e_R -> ~chi_20 e-)
     1.46253476E-01    2     1000025        11   # BR(~e_R -> ~chi_30 e-)
#
#         PDG            Width
DECAY   1000013     1.02593521E+01   # smuon_L decays
#          BR         NDA      ID1       ID2
     4.03744580E-01    2     1000022        13   # BR(~mu_L -> ~chi_10 mu-)
     1.88021994E-02    2     1000023        13   # BR(~mu_L -> ~chi_20 mu-)
     6.05643176E-02    2     1000025        13   # BR(~mu_L -> ~chi_30 mu-)
     1.72206898E-01    2     1000035        13   # BR(~mu_L -> ~chi_40 mu-)
     1.88172558E-05    2    -1000024        14   # BR(~mu_L -> ~chi_1- nu_mu)
     3.44663187E-01    2    -1000037        14   # BR(~mu_L -> ~chi_2- nu_mu)
#
#         PDG            Width
DECAY   2000013     9.44769969E+00   # smuon_R decays
#          BR         NDA      ID1       ID2
     8.27264965E-01    2     1000022        13   # BR(~mu_R -> ~chi_10 mu-)
     2.64815583E-02    2     1000023        13   # BR(~mu_R -> ~chi_20 mu-)
     1.46253476E-01    2     1000025        13   # BR(~mu_R -> ~chi_30 mu-)
#
#         PDG            Width
DECAY   1000015     1.14038021E+01   # stau_1 decays
#          BR         NDA      ID1       ID2
     3.85533365E-01    2     1000022        15   # BR(~tau_1 -> ~chi_10  tau-)
     3.22007565E-01    2     1000023        15   # BR(~tau_1 -> ~chi_20  tau-)
     2.92439169E-01    2     1000025        15   # BR(~tau_1 -> ~chi_30  tau-)
     1.99006781E-05    2    -1000024        16   # BR(~tau_1 -> ~chi_1-  nu_tau)
#
#         PDG            Width
DECAY   2000015     4.11675303E+01   # stau_2 decays
#          BR         NDA      ID1       ID2
     4.58586600E-01    2     1000022        15   # BR(~tau_2 -> ~chi_10  tau-)
     1.28695071E-01    2     1000023        15   # BR(~tau_2 -> ~chi_20  tau-)
     1.68406612E-01    2     1000025        15   # BR(~tau_2 -> ~chi_30  tau-)
     4.15075818E-07    2     1000035        15   # BR(~tau_2 -> ~chi_40  tau-)
     2.44143194E-01    2    -1000024        16   # BR(~tau_2 -> ~chi_1-  nu_tau)
     7.97111866E-07    2    -1000037        16   # BR(~tau_2 -> ~chi_2-  nu_tau)
     8.20387603E-05    2     1000016       -24   # BR(~tau_2 -> ~nu_tauL W-)
     4.32578710E-05    2     1000015        25   # BR(~tau_2 -> ~tau_1   h)
     4.20141488E-05    2     1000015        23   # BR(~tau_2 -> ~tau_1   Z)
#
#         PDG            Width
DECAY   1000012     1.02660421E+01   # snu_eL decays
#          BR         NDA      ID1       ID2
     3.91350785E-01    2     1000022        12   # BR(~nu_eL -> ~chi_10 nu_e)
     7.96642049E-03    2     1000023        12   # BR(~nu_eL -> ~chi_20 nu_e)
     8.18971964E-02    2     1000025        12   # BR(~nu_eL -> ~chi_30 nu_e)
     1.71785915E-01    2     1000035        12   # BR(~nu_eL -> ~chi_40 nu_e)
     3.96684297E-03    2     1000024        11   # BR(~nu_eL -> ~chi_1+ e-)
     3.43032840E-01    2     1000037        11   # BR(~nu_eL -> ~chi_2+ e-)
#
#         PDG            Width
DECAY   1000014     1.02660420E+01   # snu_muL decays
#          BR         NDA      ID1       ID2
     3.91350787E-01    2     1000022        14   # BR(~nu_muL -> ~chi_10 nu_mu)
     7.96642053E-03    2     1000023        14   # BR(~nu_muL -> ~chi_20 nu_mu)
     8.18971968E-02    2     1000025        14   # BR(~nu_muL -> ~chi_30 nu_mu)
     1.71785916E-01    2     1000035        14   # BR(~nu_muL -> ~chi_40 nu_mu)
     3.96684298E-03    2     1000024        13   # BR(~nu_muL -> ~chi_1+ mu-)
     3.43032837E-01    2     1000037        13   # BR(~nu_muL -> ~chi_2+ mu-)
#
#         PDG            Width
DECAY   1000016     1.14185127E+01   # snu_tauL decays
#          BR         NDA      ID1       ID2
     2.79128971E-01    2     1000022        16   # BR(~nu_tauL -> ~chi_10 nu_tau)
     5.67536532E-03    2     1000023        16   # BR(~nu_tauL -> ~chi_20 nu_tau)
     5.83324735E-02    2     1000025        16   # BR(~nu_tauL -> ~chi_30 nu_tau)
     6.56863190E-01    2     1000024        15   # BR(~nu_tauL -> ~chi_1+ tau-)
#
#         PDG            Width
DECAY   1000024     4.06029069E-04   # chargino1+ decays
#           BR         NDA      ID1       ID2       ID3
     3.33423831E-01    3     1000022         2        -1   # BR(~chi_1+ -> ~chi_10 u    db)
     3.33423831E-01    3     1000022         4        -3   # BR(~chi_1+ -> ~chi_10 c    sb)
     1.11141754E-01    3     1000022       -11        12   # BR(~chi_1+ -> ~chi_10 e+   nu_e)
     1.11141754E-01    3     1000022       -13        14   # BR(~chi_1+ -> ~chi_10 mu+  nu_mu)
     1.10868830E-01    3     1000022       -15        16   # BR(~chi_1+ -> ~chi_10 tau+ nu_tau)
#
#         PDG            Width
DECAY   1000037     1.41392594E+02   # chargino2+ decays
#          BR         NDA      ID1       ID2
     1.52533922E-01    2     1000002        -1   # BR(~chi_2+ -> ~u_L     db)
     1.52484862E-01    2    -1000001         2   # BR(~chi_2+ -> ~d_L*    u )
     1.52533920E-01    2     1000004        -3   # BR(~chi_2+ -> ~c_L     sb)
     1.52484830E-01    2    -1000003         4   # BR(~chi_2+ -> ~s_L*     c )
     1.11398802E-01    2     1000006        -5   # BR(~chi_2+ -> ~t_1     bb)
     2.31530756E-06    2    -1000005         6   # BR(~chi_2+ -> ~b_1*    t )
     1.08881320E-01    2    -2000005         6   # BR(~chi_2+ -> ~b_2*    t )
     1.69211672E-04    2     1000016       -15   # BR(~chi_2+ -> ~nu_tau1 tau+)
     1.62673283E-04    2    -1000015        16   # BR(~chi_2+ -> ~tau_1+  nu_tau)
     4.27363460E-02    2     1000024        23   # BR(~chi_2+ -> ~chi_1+  Z )
     2.62602251E-03    2     1000022        24   # BR(~chi_2+ -> ~chi_10  W+)
     4.20581274E-02    2     1000023        24   # BR(~chi_2+ -> ~chi_20  W+)
     3.84646665E-02    2     1000025        24   # BR(~chi_2+ -> ~chi_30  W+)
     4.34629816E-02    2     1000024        25   # BR(~chi_2+ -> ~chi_1+  h )
#
#         PDG            Width
DECAY   1000022     0.00000000E+00   # neutralino1 decays
#
#         PDG            Width
DECAY   1000023     2.21846957E-04   # neutralino2 decays
#          BR         NDA      ID1       ID2
     7.57242500E-04    2     1000022        22   # BR(~chi_20 -> ~chi_10 gam)
#           BR         NDA      ID1       ID2       ID3
     1.17186985E-01    3     1000022        -2         2   # BR(~chi_20 -> ~chi_10 ub      u)
     1.51791623E-01    3     1000022        -1         1   # BR(~chi_20 -> ~chi_10 db      d)
     1.17186985E-01    3     1000022        -4         4   # BR(~chi_20 -> ~chi_10 cb      c)
     1.51791623E-01    3     1000022        -3         3   # BR(~chi_20 -> ~chi_10 sb      s)
     1.47822673E-01    3     1000022        -5         5   # BR(~chi_20 -> ~chi_10 bb      b)
     3.48136486E-02    3     1000022       -11        11   # BR(~chi_20 -> ~chi_10 e+      e-)
     3.48136486E-02    3     1000022       -13        13   # BR(~chi_20 -> ~chi_10 mu+     mu-)
     3.46495113E-02    3     1000022       -15        15   # BR(~chi_20 -> ~chi_10 tau+    tau-)
     6.97236104E-02    3     1000022       -12        12   # BR(~chi_20 -> ~chi_10 nu_eb   nu_e)
     6.97236104E-02    3     1000022       -14        14   # BR(~chi_20 -> ~chi_10 nu_mub  nu_mu)
     6.97263507E-02    3     1000022       -16        16   # BR(~chi_20 -> ~chi_10 nu_taub nu_tau)
     2.22389485E-06    3     1000024        -2         1   # BR(~chi_20 -> ~chi_1+ ub      d)
     2.22389485E-06    3    -1000024        -1         2   # BR(~chi_20 -> ~chi_1- db      u)
     2.22389485E-06    3     1000024        -4         3   # BR(~chi_20 -> ~chi_1+ cb      s)
     2.22389485E-06    3    -1000024        -3         4   # BR(~chi_20 -> ~chi_1- sb      c)
     7.41292756E-07    3     1000024       -12        11   # BR(~chi_20 -> ~chi_1+ nu_eb   e-)
     7.41292756E-07    3    -1000024        12       -11   # BR(~chi_20 -> ~chi_1- nu_e    e+)
     7.41292756E-07    3     1000024       -14        13   # BR(~chi_20 -> ~chi_1+ nu_mub  mu-)
     7.41292756E-07    3    -1000024        14       -13   # BR(~chi_20 -> ~chi_1- nu_mu   mu+)
     3.13742100E-07    3     1000024       -16        15   # BR(~chi_20 -> ~chi_1+ nu_taub tau-)
     3.13742100E-07    3    -1000024        16       -15   # BR(~chi_20 -> ~chi_1- nu_tau  tau+)
#
#         PDG            Width
DECAY   1000025     2.52609269E-04   # neutralino3 decays
#          BR         NDA      ID1       ID2
     6.93543518E-04    2     1000022        22   # BR(~chi_30 -> ~chi_10 gam)
     1.63216109E-06    2     1000023        22   # BR(~chi_30 -> ~chi_20 gam)
#           BR         NDA      ID1       ID2       ID3
     1.16933370E-01    3     1000022        -2         2   # BR(~chi_30 -> ~chi_10 ub      u)
     1.50461027E-01    3     1000022        -1         1   # BR(~chi_30 -> ~chi_10 db      d)
     1.16933370E-01    3     1000022        -4         4   # BR(~chi_30 -> ~chi_10 cb      c)
     1.50461027E-01    3     1000022        -3         3   # BR(~chi_30 -> ~chi_10 sb      s)
     1.50910283E-01    3     1000022        -5         5   # BR(~chi_30 -> ~chi_10 bb      b)
     3.43550763E-02    3     1000022       -11        11   # BR(~chi_30 -> ~chi_10 e+      e-)
     3.43550763E-02    3     1000022       -13        13   # BR(~chi_30 -> ~chi_10 mu+     mu-)
     3.43949078E-02    3     1000022       -15        15   # BR(~chi_30 -> ~chi_10 tau+    tau-)
     6.91614573E-02    3     1000022       -12        12   # BR(~chi_30 -> ~chi_10 nu_eb   nu_e)
     6.91614573E-02    3     1000022       -14        14   # BR(~chi_30 -> ~chi_10 nu_mub  nu_mu)
     6.91768914E-02    3     1000022       -16        16   # BR(~chi_30 -> ~chi_10 nu_taub nu_tau)
     2.08835523E-05    3     1000023        -2         2   # BR(~chi_30 -> ~chi_20 ub      u)
     2.71203352E-05    3     1000023        -1         1   # BR(~chi_30 -> ~chi_20 db      d)
     2.08835523E-05    3     1000023        -4         4   # BR(~chi_30 -> ~chi_20 cb      c)
     2.71203352E-05    3     1000023        -3         3   # BR(~chi_30 -> ~chi_20 sb      s)
     6.23181772E-06    3     1000023       -11        11   # BR(~chi_30 -> ~chi_20 e+      e-)
     6.23181772E-06    3     1000023       -13        13   # BR(~chi_30 -> ~chi_20 mu+     mu-)
     4.86236179E-06    3     1000023       -15        15   # BR(~chi_30 -> ~chi_20 tau+    tau-)
     1.24556680E-05    3     1000023       -12        12   # BR(~chi_30 -> ~chi_20 nu_eb   nu_e)
     1.24556680E-05    3     1000023       -14        14   # BR(~chi_30 -> ~chi_20 nu_mub  nu_mu)
     1.24555420E-05    3     1000023       -16        16   # BR(~chi_30 -> ~chi_20 nu_taub nu_tau)
     4.79543965E-04    3     1000024        -2         1   # BR(~chi_30 -> ~chi_1+ ub      d)
     4.79543965E-04    3    -1000024        -1         2   # BR(~chi_30 -> ~chi_1- db      u)
     4.79543965E-04    3     1000024        -4         3   # BR(~chi_30 -> ~chi_1+ cb      s)
     4.79543965E-04    3    -1000024        -3         4   # BR(~chi_30 -> ~chi_1- sb      c)
     1.59850242E-04    3     1000024       -12        11   # BR(~chi_30 -> ~chi_1+ nu_eb   e-)
     1.59850242E-04    3    -1000024        12       -11   # BR(~chi_30 -> ~chi_1- nu_e    e+)
     1.59850242E-04    3     1000024       -14        13   # BR(~chi_30 -> ~chi_1+ nu_mub  mu-)
     1.59850242E-04    3    -1000024        14       -13   # BR(~chi_30 -> ~chi_1- nu_mu   mu+)
     1.46301324E-04    3     1000024       -16        15   # BR(~chi_30 -> ~chi_1+ nu_taub tau-)
     1.46301324E-04    3    -1000024        16       -15   # BR(~chi_30 -> ~chi_1- nu_tau  tau+)
#
#         PDG            Width
DECAY   1000035     1.41343631E+02   # neutralino4 decays
#          BR         NDA      ID1       ID2
     1.53425890E-03    2     1000022        23   # BR(~chi_40 -> ~chi_10   Z )
     1.86385811E-02    2     1000023        23   # BR(~chi_40 -> ~chi_20   Z )
     2.26349804E-02    2     1000025        23   # BR(~chi_40 -> ~chi_30   Z )
     4.14658399E-02    2     1000024       -24   # BR(~chi_40 -> ~chi_1+   W-)
     4.14658399E-02    2    -1000024        24   # BR(~chi_40 -> ~chi_1-   W+)
     1.13605784E-03    2     1000022        25   # BR(~chi_40 -> ~chi_10   h )
     2.50524997E-02    2     1000023        25   # BR(~chi_40 -> ~chi_20   h )
     1.72462099E-02    2     1000025        25   # BR(~chi_40 -> ~chi_30   h )
     7.63234364E-02    2     1000002        -2   # BR(~chi_40 -> ~u_L      ub)
     7.63234364E-02    2    -1000002         2   # BR(~chi_40 -> ~u_L*     u )
     1.08766377E-08    2     2000002        -2   # BR(~chi_40 -> ~u_R      ub)
     1.08766377E-08    2    -2000002         2   # BR(~chi_40 -> ~u_R*     u )
     7.62206821E-02    2     1000001        -1   # BR(~chi_40 -> ~d_L      db)
     7.62206821E-02    2    -1000001         1   # BR(~chi_40 -> ~d_L*     d )
     1.06832454E-10    2     2000001        -1   # BR(~chi_40 -> ~d_R      db)
     1.06832454E-10    2    -2000001         1   # BR(~chi_40 -> ~d_R*     d )
     7.63234203E-02    2     1000004        -4   # BR(~chi_40 -> ~c_L      cb)
     7.63234203E-02    2    -1000004         4   # BR(~chi_40 -> ~c_L*     c )
     1.08766371E-08    2     2000004        -4   # BR(~chi_40 -> ~c_R      cb)
     1.08766371E-08    2    -2000004         4   # BR(~chi_40 -> ~c_R*     c )
     7.62206821E-02    2     1000003        -3   # BR(~chi_40 -> ~s _L      sb)
     7.62206821E-02    2    -1000003         3   # BR(~chi_40 -> ~s _L*     s )
     1.06832454E-10    2     2000003        -3   # BR(~chi_40 -> ~s _R      sb)
     1.06832454E-10    2    -2000003         3   # BR(~chi_40 -> ~s _R*     s )
     5.46476564E-02    2     1000006        -6   # BR(~chi_40 -> ~t_1      tb)
     5.46476564E-02    2    -1000006         6   # BR(~chi_40 -> ~t_1*     t )
     1.17354739E-06    2     1000005        -5   # BR(~chi_40 -> ~b_1      bb)
     1.17354739E-06    2    -1000005         5   # BR(~chi_40 -> ~b_1*     b )
     5.55105880E-02    2     2000005        -5   # BR(~chi_40 -> ~b_2      bb)
     5.55105880E-02    2    -2000005         5   # BR(~chi_40 -> ~b_2*     b )
     4.15627116E-09    2     2000011       -11   # BR(~chi_40 -> ~e_R-     e+)
     4.15627116E-09    2    -2000011        11   # BR(~chi_40 -> ~e_R+     e-)
     4.15627116E-09    2     2000013       -13   # BR(~chi_40 -> ~mu_R-    mu+)
     4.15627116E-09    2    -2000013        13   # BR(~chi_40 -> ~mu_R+    mu-)
     8.08375804E-05    2     1000015       -15   # BR(~chi_40 -> ~tau_1-   tau+)
     8.08375804E-05    2    -1000015        15   # BR(~chi_40 -> ~tau_1+   tau-)
     8.43593428E-05    2     1000016       -16   # BR(~chi_40 -> ~nu_tau1  nu_taub)
     8.43593428E-05    2    -1000016        16   # BR(~chi_40 -> ~nu_tau1* nu_tau )
#
#         PDG            Width
DECAY        25     4.41650028E-03   # h decays
#          BR         NDA      ID1       ID2
     5.21943397E-01    2           5        -5   # BR(h -> b       bb     )
     5.88684215E-02    2         -15        15   # BR(h -> tau+    tau-   )
     2.08372716E-04    2         -13        13   # BR(h -> mu+     mu-    )
     2.27441976E-04    2           3        -3   # BR(h -> s       sb     )
     1.96493749E-02    2           4        -4   # BR(h -> c       cb     )
     7.24547818E-02    2          21        21   # BR(h -> g       g      )
     2.14195999E-03    2          22        22   # BR(h -> gam     gam    )
     1.42602355E-03    2          22        23   # BR(h -> Z       gam    )
     1.92319266E-01    2          24       -24   # BR(h -> W+      W-     )
     2.40320817E-02    2          23        23   # BR(h -> Z       Z      )
     1.06728879E-01    2     1000022   1000022   # BR(h -> ~chi_10 ~chi_10)
#
#         PDG            Width
DECAY        35     6.80251119E+01   # H decays
#          BR         NDA      ID1       ID2
     6.92446491E-01    2           5        -5   # BR(H -> b       bb     )
     1.26934125E-01    2         -15        15   # BR(H -> tau+    tau-   )
     4.49354792E-04    2         -13        13   # BR(H -> mu+     mu-    )
     2.87379548E-04    2           3        -3   # BR(H -> s       sb     )
     1.71587656E-08    2           4        -4   # BR(H -> c       cb     )
     1.69104024E-03    2           6        -6   # BR(H -> t       tb     )
     7.02811986E-06    2          21        21   # BR(H -> g       g      )
     2.41651596E-09    2          22        22   # BR(H -> gam     gam    )
     4.54533806E-09    2          23        22   # BR(H -> Z       gam    )
     6.89670160E-07    2          24       -24   # BR(H -> W+      W-     )
     3.44186814E-07    2          23        23   # BR(H -> Z       Z      )
     2.33243331E-06    2          25        25   # BR(H -> h       h      )
     5.78090315E-04    2     1000024  -1000024   # BR(H -> ~chi_1+ ~chi_1-)
     1.26212792E-02    2     1000024  -1000037   # BR(H -> ~chi_1+ ~chi_2-)
     1.26212792E-02    2     1000037  -1000024   # BR(H -> ~chi_2+ ~chi_1-)
     1.52775898E-02    2     1000022   1000022   # BR(H -> ~chi_10 ~chi_10)
     8.76305260E-04    2     1000023   1000023   # BR(H -> ~chi_20 ~chi_20)
     8.61917988E-03    2     1000025   1000025   # BR(H -> ~chi_30 ~chi_30)
     1.88691057E-02    2     1000022   1000023   # BR(H -> ~chi_10 ~chi_20)
     1.05591521E-02    2     1000022   1000025   # BR(H -> ~chi_10 ~chi_30)
     2.17139899E-03    2     1000022   1000035   # BR(H -> ~chi_10 ~chi_40)
     7.90871293E-03    2     1000023   1000025   # BR(H -> ~chi_20 ~chi_30)
     4.03649215E-03    2     1000023   1000035   # BR(H -> ~chi_20 ~chi_40)
     6.43308567E-03    2     1000025   1000035   # BR(H -> ~chi_30 ~chi_40)
     2.70697087E-07    2     1000002  -1000002   # BR(H -> ~u_L    ~u_L*  )
     7.45026906E-08    2     2000002  -2000002   # BR(H -> ~u_R    ~u_R*  )
     2.70697087E-07    2     1000004  -1000004   # BR(H -> ~c_L    ~c_L*  )
     7.45026906E-08    2     2000004  -2000004   # BR(H -> ~c_R    ~c_R*  )
     3.96053461E-07    2     1000001  -1000001   # BR(H -> ~d_L    ~d_L*  )
     3.96053461E-07    2     1000003  -1000003   # BR(H -> ~s_L    ~s_L*  )
     2.73424688E-06    2     1000005  -1000005   # BR(H -> ~b_1    ~b_1*  )
     3.88026511E-02    2     1000005  -2000005   # BR(H -> ~b_1    ~b_2*  )
     3.88026511E-02    2     2000005  -1000005   # BR(H -> ~b_2    ~b_1*  )
#
#         PDG            Width
DECAY        36     6.80280586E+01   # A decays
#          BR         NDA      ID1       ID2
     6.92434816E-01    2           5        -5   # BR(A -> b       bb     )
     1.26929001E-01    2         -15        15   # BR(A -> tau+    tau-   )
     4.49336183E-04    2         -13        13   # BR(A -> mu+     mu-    )
     2.87384405E-04    2           3        -3   # BR(A -> s       sb     )
     1.72468407E-08    2           4        -4   # BR(A -> c       cb     )
     1.69476741E-03    2           6        -6   # BR(A -> t       tb     )
     2.03637724E-05    2          21        21   # BR(A -> g       g      )
     2.27873174E-08    2          22        22   # BR(A -> gam     gam    )
     1.59799029E-08    2          23        22   # BR(A -> Z       gam    )
     6.99343278E-07    2          23        25   # BR(A -> Z       h      )
     5.85739638E-04    2     1000024  -1000024   # BR(A -> ~chi_1+ ~chi_1-)
     1.26186349E-02    2     1000024  -1000037   # BR(A -> ~chi_1+ ~chi_2-)
     1.26186349E-02    2     1000037  -1000024   # BR(A -> ~chi_2+ ~chi_1-)
     1.45637834E-02    2     1000022   1000022   # BR(A -> ~chi_10 ~chi_10)
     9.92566934E-04    2     1000023   1000023   # BR(A -> ~chi_20 ~chi_20)
     7.63022539E-03    2     1000025   1000025   # BR(A -> ~chi_30 ~chi_30)
     2.15073413E-02    2     1000022   1000023   # BR(A -> ~chi_10 ~chi_20)
     9.01944129E-03    2     1000022   1000025   # BR(A -> ~chi_10 ~chi_30)
     1.63576198E-03    2     1000022   1000035   # BR(A -> ~chi_10 ~chi_40)
     8.39571861E-03    2     1000023   1000025   # BR(A -> ~chi_20 ~chi_30)
     7.85792161E-03    2     1000023   1000035   # BR(A -> ~chi_20 ~chi_40)
     3.14886685E-03    2     1000025   1000035   # BR(A -> ~chi_30 ~chi_40)
     3.88044698E-02    2     1000005  -2000005   # BR(A -> ~b_1    ~b_2*  )
     3.88044698E-02    2    -1000005   2000005   # BR(A -> ~b_1*   ~b_2   )
#
#         PDG            Width
DECAY        37     8.38565116E+01   # H+ decays
#          BR         NDA      ID1       ID2
     9.69717522E-04    2           4        -5   # BR(H+ -> c       bb     )
     1.03007547E-01    2         -15        16   # BR(H+ -> tau+    nu_tau )
     3.64652820E-04    2         -13        14   # BR(H+ -> mu+     nu_mu  )
     9.69716649E-06    2           2        -5   # BR(H+ -> u       bb     )
     1.16673958E-05    2           2        -3   # BR(H+ -> u       sb     )
     2.29663201E-04    2           4        -3   # BR(H+ -> c       sb     )
     5.77657361E-01    2           6        -5   # BR(H+ -> t       bb     )
     5.68216608E-07    2          24        25   # BR(H+ -> W+      h      )
     4.96073722E-14    2          24        36   # BR(H+ -> W+      A      )
     4.25202523E-02    2     1000024   1000022   # BR(H+ -> ~chi_1+ ~chi_10)
     1.92098933E-03    2     1000024   1000023   # BR(H+ -> ~chi_1+ ~chi_20)
     6.12161332E-03    2     1000024   1000025   # BR(H+ -> ~chi_1+ ~chi_30)
     1.02985692E-02    2     1000024   1000035   # BR(H+ -> ~chi_1+ ~chi_40)
     3.10172466E-03    2     1000037   1000022   # BR(H+ -> ~chi_2+ ~chi_10)
     9.69551515E-03    2     1000037   1000023   # BR(H+ -> ~chi_2+ ~chi_20)
     7.80657179E-03    2     1000037   1000025   # BR(H+ -> ~chi_2+ ~chi_30)
     5.35236631E-07    2     1000002  -1000001   # BR(H+ -> ~u_L    ~d_L*  )
     5.35236631E-07    2     1000004  -1000003   # BR(H+ -> ~c_L    ~s_L*  )
     2.36282820E-01    2     1000006  -1000005   # BR(H+ -> ~t_1    ~b_1*  )
