#
#                              ======================
#                              | THE SUSYHIT OUTPUT |
#                              ======================
#
#
#              ------------------------------------------------------
#              |     This is the output of the SUSY-HIT package     |
#              |  created by A.Djouadi, M.Muehlleitner and M.Spira. |
#              |  In case of problems with SUSY-HIT email to        |
#              |           margarete.muehlleitner@cern.ch           |
#              |           michael.spira@psi.ch                     |
#              |           abdelhak.djouadi@cern.ch                 |
#              ------------------------------------------------------
#
#              ------------------------------------------------------
#              |  SUSY Les Houches Accord - MSSM Spectrum + Decays  |
#              |              based on the decay programs           |
#              |                                                    |
#              |                     SDECAY 1.3b                    |
#              |                                                    |
#              |  Authors: M.Muhlleitner, A.Djouadi and Y.Mambrini  |
#              |  Ref.:    Comput.Phys.Commun.168(2005)46           |
#              |           [hep-ph/0311167]                         |
#              |                                                    |
#              |                     HDECAY 3.4                     |
#              |                                                    |
#              |  By: A.Djouadi,J.Kalinowski,M.Muhlleitner,M.Spira  |
#              |  Ref.:    Comput.Phys.Commun.108(1998)56           |
#              |           [hep-ph/9704448]                         |
#              |                                                    |
#              |                                                    |
#              |  If not stated otherwise all DRbar couplings and   |
#              |  soft SUSY breaking masses are given at the scale  |
#              |  Q=  0.21041220E+04
#              |                                                    |
#              ------------------------------------------------------
#
#
BLOCK DCINFO  # Decay Program information
     1   SDECAY/HDECAY # decay calculator
     2   1.3b  /3.4    # version number
#
BLOCK SPINFO  # Spectrum calculator information
     1     SOFTSUSY    # spectrum calculator               
     2     3.4.0       # version number                    
#
BLOCK MODSEL  # Model selection
     1     0   #  nonUniversal                                     
#
BLOCK SMINPUTS  # Standard Model inputs
         1     1.27908970E+02   # alpha_em^-1(M_Z)^MSbar
         2     1.16637870E-05   # G_F [GeV^-2]
         3     1.18400000E-01   # alpha_S(M_Z)^MSbar
         4     9.11876000E+01   # M_Z pole mass
         5     4.18000000E+00   # mb(mb)^MSbar
         6     1.73200000E+02   # mt pole mass
         7     1.77700000E+00   # mtau pole mass
#
BLOCK MINPAR  # Input parameters - minimal models
         3     1.39100000E+01   # tanb                
#
BLOCK EXTPAR  # Input parameters - non-minimal models
         0    -1.00000000E+00   # Set                 
         1    -1.62392000E+03   # M_1(MX)             
         2    -2.54350000E+02   # M_2(MX)             
         3     1.46792000E+03   # M_3(MX)             
        11     3.30553000E+03   # At(MX)              
        12    -2.13447000E+03   # Ab(MX)              
        13     4.89030000E+02   # Atau(MX)            
        23    -2.10966000E+03   # mu(MX)              
        26     2.41193000E+03   # mA(pole)            
        31     2.74726000E+03   # meL(MX)             
        32     2.74726000E+03   # mmuL(MX)            
        33     1.51231000E+03   # mtauL(MX)           
        34     6.50170000E+02   # meR(MX)             
        35     6.50170000E+02   # mmuR(MX)            
        36     3.46994000E+03   # mtauR(MX)           
        41     2.44004000E+03   # mqL1(MX)            
        42     2.44004000E+03   # mqL2(MX)            
        43     2.75312000E+03   # mqL3(MX)            
        44     1.37814000E+03   # muR(MX)             
        45     1.37814000E+03   # mcR(MX)             
        46     1.61039000E+03   # mtR(MX)             
        47     8.84550000E+02   # mdR(MX)             
        48     8.84550000E+02   # msR(MX)             
        49     2.63966000E+03   # mbR(MX)             
#
BLOCK MASS  # Mass Spectrum
# PDG code           mass       particle
        24     8.04017107E+01   # W+
        25     1.27033595E+02   # h
        35     2.41186673E+03   # H
        36     2.41192999E+03   # A
        37     2.41337441E+03   # H+
         5     4.81876030E+00   # b-quark pole mass calculated from mb(mb)_Msbar
   1000001     2.48473628E+03   # ~d_L
   2000001     9.84970063E+02   # ~d_R
   1000002     2.48361785E+03   # ~u_L
   2000002     1.45225303E+03   # ~u_R
   1000003     2.48473628E+03   # ~s_L
   2000003     9.84970063E+02   # ~s_R
   1000004     2.48361785E+03   # ~c_L
   2000004     1.45225303E+03   # ~c_R
   1000005     2.67535426E+03   # ~b_1
   2000005     2.76880518E+03   # ~b_2
   1000006     1.66005695E+03   # ~t_1
   2000006     2.77862284E+03   # ~t_2
   1000011     2.75213644E+03   # ~e_L
   2000011     6.72883576E+02   # ~e_R
   1000012     2.75067552E+03   # ~nu_eL
   1000013     2.75213644E+03   # ~mu_L
   2000013     6.72883576E+02   # ~mu_R
   1000014     2.75067552E+03   # ~nu_muL
   1000015     1.51536895E+03   # ~tau_1
   2000015     3.47437551E+03   # ~tau_2
   1000016     1.51308496E+03   # ~nu_tauL
   1000021     1.61467680E+03   # ~g
   1000022    -2.72527842E+02   # ~chi_10
   1000023    -1.59758007E+03   # ~chi_20
   1000025     2.14304497E+03   # ~chi_30
   1000035    -2.14525712E+03   # ~chi_40
   1000024     2.72690606E+02   # ~chi_1+
   1000037     2.14485937E+03   # ~chi_2+
#
BLOCK NMIX  # Neutralino Mixing Matrix
  1  1    -3.69359304E-04   # N_11
  1  2     9.99285676E-01   # N_12
  1  3     3.70385285E-02   # N_13
  1  4    -7.49327986E-03   # N_14
  2  1     9.97904957E-01   # N_21
  2  2     2.55314797E-03   # N_22
  2  3    -5.08577109E-02   # N_23
  2  4     3.99082845E-02   # N_24
  3  1     7.78486465E-03   # N_31
  3  2    -2.08861045E-02   # N_32
  3  3     7.06652751E-01   # N_33
  3  4     7.07209344E-01   # N_34
  4  1     6.42258200E-02   # N_41
  4  2    -3.13909275E-02   # N_42
  4  3     7.04757781E-01   # N_43
  4  4    -7.05837180E-01   # N_44
#
BLOCK UMIX  # Chargino Mixing Matrix U
  1  1     9.98629476E-01   # U_11
  1  2     5.23370763E-02   # U_12
  2  1    -5.23370763E-02   # U_21
  2  2     9.98629476E-01   # U_22
#
BLOCK VMIX  # Chargino Mixing Matrix V
  1  1    -9.99943891E-01   # V_11
  1  2    -1.05931889E-02   # V_12
  2  1     1.05931889E-02   # V_21
  2  2    -9.99943891E-01   # V_22
#
BLOCK STOPMIX  # Stop Mixing Matrix
  1  1    -9.61527309E-02   # cos(theta_t)
  1  2     9.95366592E-01   # sin(theta_t)
  2  1    -9.95366592E-01   # -sin(theta_t)
  2  2    -9.61527309E-02   # cos(theta_t)
#
BLOCK SBOTMIX  # Sbottom Mixing Matrix
  1  1    -1.41305946E-01   # cos(theta_b)
  1  2     9.89965974E-01   # sin(theta_b)
  2  1    -9.89965974E-01   # -sin(theta_b)
  2  2    -1.41305946E-01   # cos(theta_b)
#
BLOCK STAUMIX  # Stau Mixing Matrix
  1  1     9.99986084E-01   # cos(theta_tau)
  1  2    -5.27558588E-03   # sin(theta_tau)
  2  1     5.27558588E-03   # -sin(theta_tau)
  2  2     9.99986084E-01   # cos(theta_tau)
#
BLOCK ALPHA  # Higgs mixing
          -7.52071695E-02   # Mixing angle in the neutral Higgs boson sector
#
BLOCK HMIX Q=  2.10412200E+03  # DRbar Higgs Parameters
         1    -2.14297618E+03   # mu(Q)MSSM           
         2     1.33153520E+01   # tan                 
         3     2.42876820E+02   # higgs               
         4     6.05269450E+06   # mA^2(Q)MSSM         
#
BLOCK GAUGE Q=  2.10412200E+03  # The gauge couplings
     1     3.64113400E-01   # gprime(Q) DRbar
     2     6.40156966E-01   # g(Q) DRbar
     3     1.03276132E+00   # g3(Q) DRbar
#
BLOCK AU Q=  2.10412200E+03  # The trilinear couplings
  1  1     0.00000000E+00   # A_u(Q) DRbar
  2  2     0.00000000E+00   # A_c(Q) DRbar
  3  3     3.30553000E+03   # A_t(Q) DRbar
#
BLOCK AD Q=  2.10412200E+03  # The trilinear couplings
  1  1     0.00000000E+00   # A_d(Q) DRbar
  2  2     0.00000000E+00   # A_s(Q) DRbar
  3  3    -2.13447000E+03   # A_b(Q) DRbar
#
BLOCK AE Q=  2.10412200E+03  # The trilinear couplings
  1  1     0.00000000E+00   # A_e(Q) DRbar
  2  2     0.00000000E+00   # A_mu(Q) DRbar
  3  3     4.89030000E+02   # A_tau(Q) DRbar
#
BLOCK Yu Q=  2.10412200E+03  # The Yukawa couplings
  1  1     0.00000000E+00   # y_u(Q) DRbar
  2  2     0.00000000E+00   # y_c(Q) DRbar
  3  3     8.51847308E-01   # y_t(Q) DRbar
#
BLOCK Yd Q=  2.10412200E+03  # The Yukawa couplings
  1  1     0.00000000E+00   # y_d(Q) DRbar
  2  2     0.00000000E+00   # y_s(Q) DRbar
  3  3     2.04464226E-01   # y_b(Q) DRbar
#
BLOCK Ye Q=  2.10412200E+03  # The Yukawa couplings
  1  1     0.00000000E+00   # y_e(Q) DRbar
  2  2     0.00000000E+00   # y_mu(Q) DRbar
  3  3     1.37035665E-01   # y_tau(Q) DRbar
#
BLOCK MSOFT Q=  2.10412200E+03  # The soft SUSY breaking masses at the scale Q
         1    -1.62392000E+03   # M_1(Q)              
         2    -2.54350000E+02   # M_2(Q)              
         3     1.46792000E+03   # M_3(Q)              
        21     1.15075110E+06   # mH1^2(Q)            
        22    -4.53181477E+06   # mH2^2(Q)            
        31     2.74726000E+03   # meL(Q)              
        32     2.74726000E+03   # mmuL(Q)             
        33     1.51231000E+03   # mtauL(Q)            
        34     6.50170000E+02   # meR(Q)              
        35     6.50170000E+02   # mmuR(Q)             
        36     3.46994000E+03   # mtauR(Q)            
        41     2.44004000E+03   # mqL1(Q)             
        42     2.44004000E+03   # mqL2(Q)             
        43     2.75312000E+03   # mqL3(Q)             
        44     1.37814000E+03   # muR(Q)              
        45     1.37814000E+03   # mcR(Q)              
        46     1.61039000E+03   # mtR(Q)              
        47     8.84549995E+02   # mdR(Q)              
        48     8.84549995E+02   # msR(Q)              
        49     2.63966000E+03   # mbR(Q)              
#
Block HiggsBoundsInputHiggsCouplingsFermions
# ScalarNormEffCoupSq PseudoSNormEffCoupSq NP   IP1 IP2 IP2
    1.00657805E+00    0.00000000E+00        3  25   5   5  # h0-b-b eff. coupling^2, normalised to SM
    1.77292021E+02    0.00000000E+00        3  35   5   5  # H0-b-b eff. coupling^2, normalised to SM
    0.00000000E+00    1.77298599E+02        3  36   5   5  # A0-b-b eff. coupling^2, normalised to SM
#
    9.99962898E-01    0.00000000E+00        3  25   6   6  # h0-t-t eff. coupling^2, normalised to SM
    5.67730404E-03    0.00000000E+00        3  35   6   6  # H0-t-t eff. coupling^2, normalised to SM
    0.00000000E+00    5.64020250E-03        3  36   6   6  # A0-t-t eff. coupling^2, normalised to SM
#
    1.00657805E+00    0.00000000E+00        3  25  15  15  # h0-tau-tau eff. coupling^2, normalised to SM
    1.77292021E+02    0.00000000E+00        3  35  15  15  # H0-tau-tau eff. coupling^2, normalised to SM
    0.00000000E+00    1.77298599E+02        3  36  15  15  # A0-tau-tau eff. coupling^2, normalised to SM
#
Block HiggsBoundsInputHiggsCouplingsBosons
    9.99999939E-01        3  25  24  24  # h0-W-W eff. coupling^2, normalised to SM
    6.08152500E-08        3  35  24  24  # H0-W-W eff. coupling^2, normalised to SM
    0.00000000E+00        3  36  24  24  # A0-W-W eff. coupling^2, normalised to SM
#
    9.99999939E-01        3  25  23  23  # h0-Z-Z eff. coupling^2, normalised to SM
    6.08152500E-08        3  35  23  23  # H0-Z-Z eff. coupling^2, normalised to SM
    0.00000000E+00        3  36  23  23  # A0-Z-Z eff. coupling^2, normalised to SM
#
    8.86730773E-01        3  25  21  21  # h0-g-g eff. coupling^2, normalised to SM
    4.78453997E-13        3  35  21  21  # H0-g-g eff. coupling^2, normalised to SM
    1.33883566E-11        3  36  21  21  # A0-g-g eff. coupling^2, normalised to SM
#
    0.00000000E+00        3  25  25  23  # h0-h0-Z eff. coupling^2, normalised to SM
    0.00000000E+00        3  35  25  23  # H0-h0-Z eff. coupling^2, normalised to SM
    6.08152500E-08        3  36  25  23  # A0-h0-Z eff. coupling^2, normalised to SM
    0.00000000E+00        3  35  35  23  # H0-H0-Z eff. coupling^2, normalised to SM
    9.99999939E-01        3  36  35  23  # A0-H0-Z eff. coupling^2, normalised to SM
    0.00000000E+00        3  36  36  23  # A0-A0-Z eff. coupling^2, normalised to SM
#
    0.00000000E+00        4  25  21  21  23  # h0-g-g-Z eff. coupling^2, normalised to SM
    0.00000000E+00        4  35  21  21  23  # H0-g-g-Z eff. coupling^2, normalised to SM
    0.00000000E+00        4  36  21  21  23  # A0-g-g-Z eff. coupling^2, normalised to SM
#
#
#
#                             =================
#                             |The decay table|
#                             =================
#
# - The QCD corrections to the decays gluino -> squark  + quark
#                                     squark -> gaugino + quark_prime
#                                     squark -> squark_prime + Higgs
#                                     squark -> gluino  + quark
#   are included.
#
# - The multi-body decays for the inos, stops and sbottoms are included.
#
# - The loop induced decays for the gluino, neutralinos and stops
#   are included.
#
# - The SUSY decays of the top quark are included.
#
#
#         PDG            Width
DECAY         6     1.44272917E+00   # top decays
#          BR         NDA      ID1       ID2
     1.00000000E+00    2           5        24   # BR(t ->  b    W+)
#
#         PDG            Width
DECAY   1000021     2.80079114E+01   # gluino decays
#          BR         NDA      ID1       ID2
     2.28812878E-01    2     2000001        -1   # BR(~g -> ~d_R  db)
     2.28812878E-01    2    -2000001         1   # BR(~g -> ~d_R* d )
     2.11876077E-02    2     2000002        -2   # BR(~g -> ~u_R  ub)
     2.11876077E-02    2    -2000002         2   # BR(~g -> ~u_R* u )
     2.28812878E-01    2     2000003        -3   # BR(~g -> ~s_R  sb)
     2.28812878E-01    2    -2000003         3   # BR(~g -> ~s_R* s )
     2.11866360E-02    2     2000004        -4   # BR(~g -> ~c_R  cb)
     2.11866360E-02    2    -2000004         4   # BR(~g -> ~c_R* c )
#
#         PDG            Width
DECAY   1000006     2.31418055E-01   # stop1 decays
#          BR         NDA      ID1       ID2
     3.27746229E-01    2     1000022         6   # BR(~t_1 -> ~chi_10 t )
     6.72253771E-01    2     1000024         5   # BR(~t_1 -> ~chi_1+ b )
#
#         PDG            Width
DECAY   2000006     1.44872506E+02   # stop2 decays
#          BR         NDA      ID1       ID2
     7.50424871E-02    2     1000022         6   # BR(~t_2 -> ~chi_10 t )
     1.35399618E-03    2     1000023         6   # BR(~t_2 -> ~chi_20 t )
     2.07315727E-02    2     1000025         6   # BR(~t_2 -> ~chi_30 t )
     2.27803567E-02    2     1000035         6   # BR(~t_2 -> ~chi_40 t )
     1.51561325E-01    2     1000024         5   # BR(~t_2 -> ~chi_1+ b )
     3.07891643E-03    2     1000037         5   # BR(~t_2 -> ~chi_2+ b )
     4.77493660E-01    2     1000021         6   # BR(~t_2 -> ~g      t )
     1.31997771E-01    2     1000006        25   # BR(~t_2 -> ~t_1    h )
     1.15782733E-01    2     1000006        23   # BR(~t_2 -> ~t_1    Z )
     1.77182782E-04    2     1000005        24   # BR(~t_2 -> ~b_1    W+)
#
#         PDG            Width
DECAY   1000005     6.36089973E+01   # sbottom1 decays
#          BR         NDA      ID1       ID2
     4.18085677E-03    2     1000022         5   # BR(~b_1 -> ~chi_10 b )
     1.02955270E-02    2     1000023         5   # BR(~b_1 -> ~chi_20 b )
     2.19830288E-03    2     1000025         5   # BR(~b_1 -> ~chi_30 b )
     2.09355411E-03    2     1000035         5   # BR(~b_1 -> ~chi_40 b )
     8.27445759E-03    2    -1000024         6   # BR(~b_1 -> ~chi_1- t )
     3.93638901E-03    2    -1000037         6   # BR(~b_1 -> ~chi_2- t )
     9.60950930E-01    2     1000021         5   # BR(~b_1 -> ~g      b )
     8.06998231E-03    2     1000006       -24   # BR(~b_1 -> ~t_1    W-)
#
#         PDG            Width
DECAY   2000005     1.38794757E+02   # sbottom2 decays
#          BR         NDA      ID1       ID2
     7.77057983E-02    2     1000022         5   # BR(~b_2 -> ~chi_10 b )
     1.22778415E-03    2     1000023         5   # BR(~b_2 -> ~chi_20 b )
     1.36394997E-03    2     1000025         5   # BR(~b_2 -> ~chi_30 b )
     1.42425831E-03    2     1000035         5   # BR(~b_2 -> ~chi_40 b )
     1.53882214E-01    2    -1000024         6   # BR(~b_2 -> ~chi_1- t )
     4.46857377E-02    2    -1000037         6   # BR(~b_2 -> ~chi_2- t )
     4.91997369E-01    2     1000021         5   # BR(~b_2 -> ~g      b )
     2.96910211E-06    2     1000005        23   # BR(~b_2 -> ~b_1    Z )
     2.27709919E-01    2     1000006       -24   # BR(~b_2 -> ~t_1    W-)
#
#         PDG            Width
DECAY   1000002     9.37655882E+01   # sup_L decays
#          BR         NDA      ID1       ID2
     1.00781612E-01    2     1000022         2   # BR(~u_L -> ~chi_10 u)
     1.32378451E-03    2     1000023         2   # BR(~u_L -> ~chi_20 u)
     2.64263988E-06    2     1000025         2   # BR(~u_L -> ~chi_30 u)
     2.55897156E-06    2     1000035         2   # BR(~u_L -> ~chi_40 u)
     2.01851515E-01    2     1000024         1   # BR(~u_L -> ~chi_1+ d)
     1.55898927E-06    2     1000037         1   # BR(~u_L -> ~chi_2+ d)
     6.96036329E-01    2     1000021         2   # BR(~u_L -> ~g      u)
#
#         PDG            Width
DECAY   2000002     1.37285158E-02   # sup_R decays
#           BR         NDA      ID1       ID2
     3.07784677E-05    2     1000022         2   # BR(~u_R -> ~chi_10 u)
#           BR         NDA      ID1       ID2       ID3
     1.74753049E-01    3        2       -1        2000001   # BR(~u_R -> u  db  ~d_R)
     2.93760815E-01    3        2       1        -2000001   # BR(~u_R -> u  d  ~d_R*)
     1.78271274E-01    3        2       -3        2000003   # BR(~u_R -> u  sb  ~s_R)
     2.94387249E-01    3        2       3        -2000003   # BR(~u_R -> u  s  ~s_R*)
     9.83281819E-03    3        2       -11        2000011   # BR(~u_R -> u  e+  ~e_R-)
     1.93808277E-02    3        2       11        -2000011   # BR(~u_R -> u  e-  ~e_R+)
     9.82407726E-03    3        2       -13        2000013   # BR(~u_R -> u  mu+  ~mu_R-)
     1.96292158E-02    3        2       13        -2000013   # BR(~u_R -> u  mu-  ~mu_R+)
     6.35414645E-06    3        2       23        1000022   # BR(~u_R -> u  Z  ~chi_10)
     3.69551965E-05    3        2       25        1000022   # BR(~u_R -> u  h  ~chi_10)
     4.93418232E-05    3        2       -24        1000024   # BR(~u_R -> u  W-  ~chi_1+)
     3.72443756E-05    3        2       24        -1000024   # BR(~u_R -> u  W+  ~chi_1-)
#
#         PDG            Width
DECAY   1000001     9.38459164E+01   # sdown_L decays
#          BR         NDA      ID1       ID2
     1.00772404E-01    2     1000022         1   # BR(~d_L -> ~chi_10 d)
     1.25529209E-03    2     1000023         1   # BR(~d_L -> ~chi_20 d)
     3.52423183E-06    2     1000025         1   # BR(~d_L -> ~chi_30 d)
     1.32202782E-05    2     1000035         1   # BR(~d_L -> ~chi_40 d)
     2.01246392E-01    2    -1000024         2   # BR(~d_L -> ~chi_1- u)
     3.82368501E-05    2    -1000037         2   # BR(~d_L -> ~chi_2- u)
     6.96670930E-01    2     1000021         1   # BR(~d_L -> ~g      d)
#
#         PDG            Width
DECAY   2000001     2.35633039E-06   # sdown_R decays
#           BR         NDA      ID1       ID2
     2.86455414E-02    2     1000022         1   # BR(~d_R -> ~chi_10 d)
#           BR         NDA      ID1       ID2       ID3
     1.02956700E-01    3        1       -11        2000011   # BR(~d_R -> d  e+  ~e_R-)
     3.77353704E-01    3        1       11        -2000011   # BR(~d_R -> d  e-  ~e_R+)
     1.03410795E-01    3        1       -13        2000013   # BR(~d_R -> d  mu+  ~mu_R-)
     3.77404630E-01    3        1       13        -2000013   # BR(~d_R -> d  mu-  ~mu_R+)
     2.31049942E-04    3        1       23        1000022   # BR(~d_R -> d  Z  ~chi_10)
     3.01409345E-03    3        1       25        1000022   # BR(~d_R -> d  h  ~chi_10)
     4.08469884E-03    3        1       -24        1000024   # BR(~d_R -> d  W-  ~chi_1+)
     2.89878704E-03    3        1       24        -1000024   # BR(~d_R -> d  W+  ~chi_1-)
#
#         PDG            Width
DECAY   1000004     7.65971201E+01   # scharm_L decays
#          BR         NDA      ID1       ID2
     1.28807636E-01    2     1000022         4   # BR(~c_L -> ~chi_10 c)
     1.67018328E-03    2     1000023         4   # BR(~c_L -> ~chi_20 c)
     3.24947617E-06    2     1000025         4   # BR(~c_L -> ~chi_30 c)
     3.14590808E-06    2     1000035         4   # BR(~c_L -> ~chi_40 c)
     2.57983609E-01    2     1000024         3   # BR(~c_L -> ~chi_1+ s)
     1.91666421E-06    2     1000037         3   # BR(~c_L -> ~chi_2+ s)
     6.11530259E-01    2     1000021         4   # BR(~c_L -> ~g      c)
#
#         PDG            Width
DECAY   2000004     1.37008674E-02   # scharm_R decays
#           BR         NDA      ID1       ID2
     3.15575346E-05    2     1000022         4   # BR(~c_R -> ~chi_10 c)
#           BR         NDA      ID1       ID2       ID3
     1.74718864E-01    3        4       -1        2000001   # BR(~c_R -> c  db  ~d_R)
     2.94105466E-01    3        4       1        -2000001   # BR(~c_R -> c  d  ~d_R*)
     1.78295280E-01    3        4       -3        2000003   # BR(~c_R -> c  sb  ~s_R)
     2.93988685E-01    3        4       3        -2000003   # BR(~c_R -> c  s  ~s_R*)
     9.66800099E-03    3        4       -11        2000011   # BR(~c_R -> c  e+  ~e_R-)
     1.93929327E-02    3        4       11        -2000011   # BR(~c_R -> c  e-  ~e_R+)
     9.91324094E-03    3        4       -13        2000013   # BR(~c_R -> c  mu+  ~mu_R-)
     1.97556834E-02    3        4       13        -2000013   # BR(~c_R -> c  mu-  ~mu_R+)
     6.38762475E-06    3        4       23        1000022   # BR(~c_R -> c  Z  ~chi_10)
     3.70013068E-05    3        4       25        1000022   # BR(~c_R -> c  h  ~chi_10)
     4.96778764E-05    3        4       -24        1000024   # BR(~c_R -> c  W-  ~chi_1+)
     3.72224607E-05    3        4       24        -1000024   # BR(~c_R -> c  W+  ~chi_1-)
#
#         PDG            Width
DECAY   1000003     7.66429611E+01   # sstrange_L decays
#          BR         NDA      ID1       ID2
     1.28827608E-01    2     1000022         3   # BR(~s_L -> ~chi_10 s)
     1.58419502E-03    2     1000023         3   # BR(~s_L -> ~chi_20 s)
     4.33508821E-06    2     1000025         3   # BR(~s_L -> ~chi_30 s)
     1.62584727E-05    2     1000035         3   # BR(~s_L -> ~chi_40 s)
     2.57273280E-01    2    -1000024         4   # BR(~s_L -> ~chi_1- c)
     4.70255019E-05    2    -1000037         4   # BR(~s_L -> ~chi_2- c)
     6.12247298E-01    2     1000021         3   # BR(~s_L -> ~g      s)
#
#         PDG            Width
DECAY   2000003     2.35860146E-06   # sstrange_R decays
#           BR         NDA      ID1       ID2
     2.84760157E-02    2     1000022         3   # BR(~s_R -> ~chi_10 s)
#           BR         NDA      ID1       ID2       ID3
     1.01721297E-01    3        3       -11        2000011   # BR(~s_R -> s  e+  ~e_R-)
     3.79407040E-01    3        3       11        -2000011   # BR(~s_R -> s  e-  ~e_R+)
     1.03824238E-01    3        3       -13        2000013   # BR(~s_R -> s  mu+  ~mu_R-)
     3.76350144E-01    3        3       13        -2000013   # BR(~s_R -> s  mu-  ~mu_R+)
     2.30980099E-04    3        3       23        1000022   # BR(~s_R -> s  Z  ~chi_10)
     3.01119121E-03    3        3       25        1000022   # BR(~s_R -> s  h  ~chi_10)
     4.08076572E-03    3        3       -24        1000024   # BR(~s_R -> s  W-  ~chi_1+)
     2.89832772E-03    3        3       24        -1000024   # BR(~s_R -> s  W+  ~chi_1-)
#
#         PDG            Width
DECAY   1000011     3.45314294E+01   # selectron_L decays
#          BR         NDA      ID1       ID2
     3.17955236E-01    2     1000022        11   # BR(~e_L -> ~chi_10 e-)
     4.64277771E-02    2     1000023        11   # BR(~e_L -> ~chi_20 e-)
     1.36368584E-05    2     1000025        11   # BR(~e_L -> ~chi_30 e-)
     1.32159212E-06    2     1000035        11   # BR(~e_L -> ~chi_40 e-)
     6.35327662E-01    2    -1000024        12   # BR(~e_L -> ~chi_1- nu_e)
     2.74366324E-04    2    -1000037        12   # BR(~e_L -> ~chi_2- nu_e)
#
#         PDG            Width
DECAY   2000011     3.55190417E-07   # selectron_R decays
#           BR         NDA      ID1       ID2
     9.52761760E-01    2     1000022        11   # BR(~e_R -> ~chi_10 e-)
#           BR         NDA      ID1       ID2       ID3
     7.31354191E-04    3        11       23        1000022   # BR(~e_R- -> e-  Z  ~chi_10)
     1.30240000E-02    3        11       25        1000022   # BR(~e_R- -> e-  h  ~chi_10)
     1.90354235E-02    3        11       -24        1000024   # BR(~e_R- -> e-  W-  ~chi_1+)
     1.44474619E-02    3        11       24        -1000024   # BR(~e_R- -> e-  W+  ~chi_1-)
#
#         PDG            Width
DECAY   1000013     3.45314293E+01   # smuon_L decays
#          BR         NDA      ID1       ID2
     3.17955235E-01    2     1000022        13   # BR(~mu_L -> ~chi_10 mu-)
     4.64277769E-02    2     1000023        13   # BR(~mu_L -> ~chi_20 mu-)
     1.36368582E-05    2     1000025        13   # BR(~mu_L -> ~chi_30 mu-)
     1.32159209E-06    2     1000035        13   # BR(~mu_L -> ~chi_40 mu-)
     6.35327663E-01    2    -1000024        14   # BR(~mu_L -> ~chi_1- nu_mu)
     2.74366325E-04    2    -1000037        14   # BR(~mu_L -> ~chi_2- nu_mu)
#
#         PDG            Width
DECAY   2000013     3.55196754E-07   # smuon_R decays
#           BR         NDA      ID1       ID2
     9.52744698E-01    2     1000022        13   # BR(~mu_R -> ~chi_10 mu-)
#           BR         NDA      ID1       ID2       ID3
     7.30665461E-04    3        13       23        1000022   # BR(~mu_R- -> mu-  Z  ~chi_10)
     1.30254569E-02    3        13       25        1000022   # BR(~mu_R- -> mu-  h  ~chi_10)
     1.90184734E-02    3        13       -24        1000024   # BR(~mu_R- -> mu-  W-  ~chi_1+)
     1.44807067E-02    3        13       24        -1000024   # BR(~mu_R- -> mu-  W+  ~chi_1-)
#
#         PDG            Width
DECAY   1000015     1.73111548E+01   # stau_1 decays
#          BR         NDA      ID1       ID2
     3.33574807E-01    2     1000022        15   # BR(~tau_1 -> ~chi_10  tau-)
     6.66425193E-01    2    -1000024        16   # BR(~tau_1 -> ~chi_1-  nu_tau)
#
#         PDG            Width
DECAY   2000015     1.31709041E+01   # stau_2 decays
#          BR         NDA      ID1       ID2
     3.76384537E-05    2     1000022        15   # BR(~tau_2 -> ~chi_10  tau-)
     8.61751176E-01    2     1000023        15   # BR(~tau_2 -> ~chi_20  tau-)
     1.89431460E-02    2     1000025        15   # BR(~tau_2 -> ~chi_30  tau-)
     2.10139765E-02    2     1000035        15   # BR(~tau_2 -> ~chi_40  tau-)
     7.48251778E-05    2    -1000024        16   # BR(~tau_2 -> ~chi_1-  nu_tau)
     3.77407870E-02    2    -1000037        16   # BR(~tau_2 -> ~chi_2-  nu_tau)
     2.96508579E-02    2     1000016       -24   # BR(~tau_2 -> ~nu_tauL W-)
     1.55787110E-02    2     1000015        25   # BR(~tau_2 -> ~tau_1   h)
     1.52088816E-02    2     1000015        23   # BR(~tau_2 -> ~tau_1   Z)
#
#         PDG            Width
DECAY   1000012     3.45485739E+01   # snu_eL decays
#          BR         NDA      ID1       ID2
     3.17889288E-01    2     1000022        12   # BR(~nu_eL -> ~chi_10 nu_e)
     4.55038752E-02    2     1000023        12   # BR(~nu_eL -> ~chi_20 nu_e)
     3.21222031E-05    2     1000025        12   # BR(~nu_eL -> ~chi_30 nu_e)
     2.29786836E-04    2     1000035        12   # BR(~nu_eL -> ~chi_40 nu_e)
     6.36333736E-01    2     1000024        11   # BR(~nu_eL -> ~chi_1+ e-)
     1.11915518E-05    2     1000037        11   # BR(~nu_eL -> ~chi_2+ e-)
#
#         PDG            Width
DECAY   1000014     3.45485738E+01   # snu_muL decays
#          BR         NDA      ID1       ID2
     3.17889288E-01    2     1000022        14   # BR(~nu_muL -> ~chi_10 nu_mu)
     4.55038753E-02    2     1000023        14   # BR(~nu_muL -> ~chi_20 nu_mu)
     3.21222031E-05    2     1000025        14   # BR(~nu_muL -> ~chi_30 nu_mu)
     2.29786836E-04    2     1000035        14   # BR(~nu_muL -> ~chi_40 nu_mu)
     6.36333736E-01    2     1000024        13   # BR(~nu_muL -> ~chi_1+ mu-)
     1.11915517E-05    2     1000037        13   # BR(~nu_muL -> ~chi_2+ mu-)
#
#         PDG            Width
DECAY   1000016     1.73158374E+01   # snu_tauL decays
#          BR         NDA      ID1       ID2
     3.33126885E-01    2     1000022        16   # BR(~nu_tauL -> ~chi_10 nu_tau)
     6.66873115E-01    2     1000024        15   # BR(~nu_tauL -> ~chi_1+ tau-)
#
#         PDG            Width
DECAY   1000024     3.39446460E-15   # chargino1+ decays
#           BR         NDA      ID1       ID2       ID3
     1.96688420E-02    3     1000022       -11        12   # BR(~chi_1+ -> ~chi_10 e+   nu_e)
     2.10055030E-03    3     1000022       -13        14   # BR(~chi_1+ -> ~chi_10 mu+  nu_mu)
     9.78230610E-01    2     1000022       211             # BR(~chi_1+ -> ~chi_10 pi+)
#
#         PDG            Width
DECAY   1000037     2.16511180E+01   # chargino2+ decays
#          BR         NDA      ID1       ID2
     3.41490986E-01    2     1000006        -5   # BR(~chi_2+ -> ~t_1     bb)
     4.66680753E-03    2     1000016       -15   # BR(~chi_2+ -> ~nu_tau1 tau+)
     2.65629478E-04    2    -1000015        16   # BR(~chi_2+ -> ~tau_1+  nu_tau)
     2.00088023E-01    2     1000024        23   # BR(~chi_2+ -> ~chi_1+  Z )
     1.94653087E-01    2     1000022        24   # BR(~chi_2+ -> ~chi_10  W+)
     5.15549292E-02    2     1000023        24   # BR(~chi_2+ -> ~chi_20  W+)
     2.07280538E-01    2     1000024        25   # BR(~chi_2+ -> ~chi_1+  h )
#
#         PDG            Width
DECAY   1000022     0.00000000E+00   # neutralino1 decays
#
#         PDG            Width
DECAY   1000023     1.42225284E+01   # neutralino2 decays
#          BR         NDA      ID1       ID2
     2.14494408E-04    2     1000022        23   # BR(~chi_20 -> ~chi_10   Z )
     9.12881096E-04    2     1000024       -24   # BR(~chi_20 -> ~chi_1+   W-)
     9.12881096E-04    2    -1000024        24   # BR(~chi_20 -> ~chi_1-   W+)
     7.34444137E-04    2     1000022        25   # BR(~chi_20 -> ~chi_10   h )
     1.20822076E-02    2     2000002        -2   # BR(~chi_20 -> ~u_R      ub)
     1.20822076E-02    2    -2000002         2   # BR(~chi_20 -> ~u_R*     u )
     3.68243461E-02    2     2000001        -1   # BR(~chi_20 -> ~d_R      db)
     3.68243461E-02    2    -2000001         1   # BR(~chi_20 -> ~d_R*     d )
     1.20815555E-02    2     2000004        -4   # BR(~chi_20 -> ~c_R      cb)
     1.20815555E-02    2    -2000004         4   # BR(~chi_20 -> ~c_R*     c )
     3.68243461E-02    2     2000003        -3   # BR(~chi_20 -> ~s _R      sb)
     3.68243461E-02    2    -2000003         3   # BR(~chi_20 -> ~s _R*     s )
     1.99638659E-01    2     2000011       -11   # BR(~chi_20 -> ~e_R-     e+)
     1.99638659E-01    2    -2000011        11   # BR(~chi_20 -> ~e_R+     e-)
     1.99638659E-01    2     2000013       -13   # BR(~chi_20 -> ~mu_R-    mu+)
     1.99638659E-01    2    -2000013        13   # BR(~chi_20 -> ~mu_R+    mu-)
     7.47681800E-04    2     1000015       -15   # BR(~chi_20 -> ~tau_1-   tau+)
     7.47681800E-04    2    -1000015        15   # BR(~chi_20 -> ~tau_1+   tau-)
     7.75194868E-04    2     1000016       -16   # BR(~chi_20 -> ~nu_tau1  nu_taub)
     7.75194868E-04    2    -1000016        16   # BR(~chi_20 -> ~nu_tau1* nu_tau )
#
#         PDG            Width
DECAY   1000025     2.05452982E+01   # neutralino3 decays
#          BR         NDA      ID1       ID2
     1.46381176E-01    2     1000022        23   # BR(~chi_30 -> ~chi_10   Z )
     5.38157391E-02    2     1000023        23   # BR(~chi_30 -> ~chi_20   Z )
     2.05156656E-01    2     1000024       -24   # BR(~chi_30 -> ~chi_1+   W-)
     2.05156656E-01    2    -1000024        24   # BR(~chi_30 -> ~chi_1-   W+)
     6.71869933E-02    2     1000022        25   # BR(~chi_30 -> ~chi_10   h )
     7.68269591E-04    2     1000023        25   # BR(~chi_30 -> ~chi_20   h )
     6.30544322E-06    2     2000002        -2   # BR(~chi_30 -> ~u_R      ub)
     6.30544322E-06    2    -2000002         2   # BR(~chi_30 -> ~u_R*     u )
     3.32098965E-06    2     2000001        -1   # BR(~chi_30 -> ~d_R      db)
     3.32098965E-06    2    -2000001         1   # BR(~chi_30 -> ~d_R*     d )
     6.30543184E-06    2     2000004        -4   # BR(~chi_30 -> ~c_R      cb)
     6.30543184E-06    2    -2000004         4   # BR(~chi_30 -> ~c_R*     c )
     3.32098965E-06    2     2000003        -3   # BR(~chi_30 -> ~s _R      sb)
     3.32098965E-06    2    -2000003         3   # BR(~chi_30 -> ~s _R*     s )
     1.58241763E-01    2     1000006        -6   # BR(~chi_30 -> ~t_1      tb)
     1.58241763E-01    2    -1000006         6   # BR(~chi_30 -> ~t_1*     t )
     1.35479189E-05    2     2000011       -11   # BR(~chi_30 -> ~e_R-     e+)
     1.35479189E-05    2    -2000011        11   # BR(~chi_30 -> ~e_R+     e-)
     1.35479189E-05    2     2000013       -13   # BR(~chi_30 -> ~mu_R-    mu+)
     1.35479189E-05    2    -2000013        13   # BR(~chi_30 -> ~mu_R+    mu-)
     2.44488026E-03    2     1000015       -15   # BR(~chi_30 -> ~tau_1-   tau+)
     2.44488026E-03    2    -1000015        15   # BR(~chi_30 -> ~tau_1+   tau-)
     3.42632788E-05    2     1000016       -16   # BR(~chi_30 -> ~nu_tau1  nu_taub)
     3.42632788E-05    2    -1000016        16   # BR(~chi_30 -> ~nu_tau1* nu_tau )
#
#         PDG            Width
DECAY   1000035     2.14602476E+01   # neutralino4 decays
#          BR         NDA      ID1       ID2
     6.16646735E-02    2     1000022        23   # BR(~chi_40 -> ~chi_10   Z )
     8.07512483E-04    2     1000023        23   # BR(~chi_40 -> ~chi_20   Z )
     1.95799589E-01    2     1000024       -24   # BR(~chi_40 -> ~chi_1+   W-)
     1.95799589E-01    2    -1000024        24   # BR(~chi_40 -> ~chi_1-   W+)
     1.44482105E-01    2     1000022        25   # BR(~chi_40 -> ~chi_10   h )
     4.83747638E-02    2     1000023        25   # BR(~chi_40 -> ~chi_20   h )
     4.12728453E-04    2     2000002        -2   # BR(~chi_40 -> ~u_R      ub)
     4.12728453E-04    2    -2000002         2   # BR(~chi_40 -> ~u_R*     u )
     2.16868086E-04    2     2000001        -1   # BR(~chi_40 -> ~d_R      db)
     2.16868086E-04    2    -2000001         1   # BR(~chi_40 -> ~d_R*     d )
     4.12727713E-04    2     2000004        -4   # BR(~chi_40 -> ~c_R      cb)
     4.12727713E-04    2    -2000004         4   # BR(~chi_40 -> ~c_R*     c )
     2.16868086E-04    2     2000003        -3   # BR(~chi_40 -> ~s _R      sb)
     2.16868086E-04    2    -2000003         3   # BR(~chi_40 -> ~s _R*     s )
     1.70948940E-01    2     1000006        -6   # BR(~chi_40 -> ~t_1      tb)
     1.70948940E-01    2    -1000006         6   # BR(~chi_40 -> ~t_1*     t )
     8.84120282E-04    2     2000011       -11   # BR(~chi_40 -> ~e_R-     e+)
     8.84120282E-04    2    -2000011        11   # BR(~chi_40 -> ~e_R+     e-)
     8.84120282E-04    2     2000013       -13   # BR(~chi_40 -> ~mu_R-    mu+)
     8.84120282E-04    2    -2000013        13   # BR(~chi_40 -> ~mu_R+    mu-)
     2.32213914E-03    2     1000015       -15   # BR(~chi_40 -> ~tau_1-   tau+)
     2.32213914E-03    2    -1000015        15   # BR(~chi_40 -> ~tau_1+   tau-)
     2.37371096E-04    2     1000016       -16   # BR(~chi_40 -> ~nu_tau1  nu_taub)
     2.37371096E-04    2    -1000016        16   # BR(~chi_40 -> ~nu_tau1* nu_tau )
#
#         PDG            Width
DECAY        25     4.19388745E-03   # h decays
#          BR         NDA      ID1       ID2
     5.50482979E-01    2           5        -5   # BR(h -> b       bb     )
     6.31119509E-02    2         -15        15   # BR(h -> tau+    tau-   )
     2.23387150E-04    2         -13        13   # BR(h -> mu+     mu-    )
     2.43329350E-04    2           3        -3   # BR(h -> s       sb     )
     2.09490183E-02    2           4        -4   # BR(h -> c       cb     )
     7.97208564E-02    2          21        21   # BR(h -> g       g      )
     2.40615616E-03    2          22        22   # BR(h -> gam     gam    )
     1.77956795E-03    2          22        23   # BR(h -> Z       gam    )
     2.48986610E-01    2          24       -24   # BR(h -> W+      W-     )
     3.20961446E-02    2          23        23   # BR(h -> Z       Z      )
#
#         PDG            Width
DECAY        35     7.54557973E+00   # H decays
#          BR         NDA      ID1       ID2
     7.96838933E-01    2           5        -5   # BR(H -> b       bb     )
     1.16032610E-01    2         -15        15   # BR(H -> tau+    tau-   )
     4.11724981E-04    2         -13        13   # BR(H -> mu+     mu-    )
     3.62022960E-04    2           3        -3   # BR(H -> s       sb     )
     7.66938835E-07    2           4        -4   # BR(H -> c       cb     )
     7.48984344E-02    2           6        -6   # BR(H -> t       tb     )
     2.84129815E-05    2          21        21   # BR(H -> g       g      )
     3.01591034E-07    2          22        22   # BR(H -> gam     gam    )
     4.62690747E-08    2          23        22   # BR(H -> Z       gam    )
     3.62449326E-05    2          24       -24   # BR(H -> W+      W-     )
     1.80694786E-05    2          23        23   # BR(H -> Z       Z      )
     1.45245654E-04    2          25        25   # BR(H -> h       h      )
     6.62101983E-03    2     1000024  -1000024   # BR(H -> ~chi_1+ ~chi_1-)
     3.31316926E-03    2     1000022   1000022   # BR(H -> ~chi_10 ~chi_10)
     1.28169354E-03    2     1000022   1000023   # BR(H -> ~chi_10 ~chi_20)
     1.06341941E-06    2     2000001  -2000001   # BR(H -> ~d_R    ~d_R*  )
     1.06341941E-06    2     2000003  -2000003   # BR(H -> ~s_R    ~s_R*  )
     4.58860071E-06    2     2000011  -2000011   # BR(H -> ~e_R-   ~e_R+  )
     4.58860071E-06    2     2000013  -2000013   # BR(H -> ~mu_R-  ~mu_R+ )
#
#         PDG            Width
DECAY        36     7.57036059E+00   # A decays
#          BR         NDA      ID1       ID2
     7.94387411E-01    2           5        -5   # BR(A -> b       bb     )
     1.15660390E-01    2         -15        15   # BR(A -> tau+    tau-   )
     4.10403295E-04    2         -13        13   # BR(A -> mu+     mu-    )
     3.61000977E-04    2           3        -3   # BR(A -> s       sb     )
     7.66459844E-07    2           4        -4   # BR(A -> c       cb     )
     7.52048083E-02    2           6        -6   # BR(A -> t       tb     )
     1.49828268E-04    2          21        21   # BR(A -> g       g      )
     5.48704038E-07    2          22        22   # BR(A -> gam     gam    )
     1.47390449E-07    2          23        22   # BR(A -> Z       gam    )
     3.65238274E-05    2          23        25   # BR(A -> Z       h      )
     7.39164697E-03    2     1000024  -1000024   # BR(A -> ~chi_1+ ~chi_1-)
     3.69874744E-03    2     1000022   1000022   # BR(A -> ~chi_10 ~chi_10)
     2.69777724E-03    2     1000022   1000023   # BR(A -> ~chi_10 ~chi_20)
#
#         PDG            Width
DECAY        37     7.68741356E+00   # H+ decays
#          BR         NDA      ID1       ID2
     1.36026429E-03    2           4        -5   # BR(H+ -> c       bb     )
     1.13967489E-01    2         -15        16   # BR(H+ -> tau+    nu_tau )
     4.04396293E-04    2         -13        14   # BR(H+ -> mu+     nu_mu  )
     1.36026066E-05    2           2        -5   # BR(H+ -> u       bb     )
     1.77721453E-05    2           2        -3   # BR(H+ -> u       sb     )
     3.50533369E-04    2           4        -3   # BR(H+ -> c       sb     )
     8.79909949E-01    2           6        -5   # BR(H+ -> t       bb     )
     3.60675985E-05    2          24        25   # BR(H+ -> W+      h      )
     1.07579324E-12    2          24        36   # BR(H+ -> W+      A      )
     4.68516218E-10    2     1000024   1000022   # BR(H+ -> ~chi_1+ ~chi_10)
     3.93992552E-03    2     1000024   1000023   # BR(H+ -> ~chi_1+ ~chi_20)
