#
#                              ======================
#                              | THE SUSYHIT OUTPUT |
#                              ======================
#
#
#              ------------------------------------------------------
#              |     This is the output of the SUSY-HIT package     |
#              |  created by A.Djouadi, M.Muehlleitner and M.Spira. |
#              |  In case of problems with SUSY-HIT email to        |
#              |           margarete.muehlleitner@cern.ch           |
#              |           michael.spira@psi.ch                     |
#              |           abdelhak.djouadi@cern.ch                 |
#              ------------------------------------------------------
#
#              ------------------------------------------------------
#              |  SUSY Les Houches Accord - MSSM Spectrum + Decays  |
#              |              based on the decay programs           |
#              |                                                    |
#              |                     SDECAY 1.3b                    |
#              |                                                    |
#              |  Authors: M.Muhlleitner, A.Djouadi and Y.Mambrini  |
#              |  Ref.:    Comput.Phys.Commun.168(2005)46           |
#              |           [hep-ph/0311167]                         |
#              |                                                    |
#              |                     HDECAY 3.4                     |
#              |                                                    |
#              |  By: A.Djouadi,J.Kalinowski,M.Muhlleitner,M.Spira  |
#              |  Ref.:    Comput.Phys.Commun.108(1998)56           |
#              |           [hep-ph/9704448]                         |
#              |                                                    |
#              |                                                    |
#              |  If not stated otherwise all DRbar couplings and   |
#              |  soft SUSY breaking masses are given at the scale  |
#              |  Q=  0.22673920E+04
#              |                                                    |
#              ------------------------------------------------------
#
#
BLOCK DCINFO  # Decay Program information
     1   SDECAY/HDECAY # decay calculator
     2   1.3b  /3.4    # version number
#
BLOCK SPINFO  # Spectrum calculator information
     1     SOFTSUSY    # spectrum calculator               
     2     3.4.0       # version number                    
#
BLOCK MODSEL  # Model selection
     1     0   #  nonUniversal                                     
#
BLOCK SMINPUTS  # Standard Model inputs
         1     1.27908970E+02   # alpha_em^-1(M_Z)^MSbar
         2     1.16637870E-05   # G_F [GeV^-2]
         3     1.18400000E-01   # alpha_S(M_Z)^MSbar
         4     9.11876000E+01   # M_Z pole mass
         5     4.18000000E+00   # mb(mb)^MSbar
         6     1.73200000E+02   # mt pole mass
         7     1.77700000E+00   # mtau pole mass
#
BLOCK MINPAR  # Input parameters - minimal models
         3     4.22100000E+01   # tanb                
#
BLOCK EXTPAR  # Input parameters - non-minimal models
         0    -1.00000000E+00   # Set                 
         1    -3.82800000E+03   # M_1(MX)             
         2    -2.68928000E+03   # M_2(MX)             
         3     3.16665000E+03   # M_3(MX)             
        11    -6.95269000E+03   # At(MX)              
        12    -1.62437000E+03   # Ab(MX)              
        13    -1.56919000E+03   # Atau(MX)            
        23     2.46380000E+02   # mu(MX)              
        26     2.93359000E+03   # mA(pole)            
        31     4.23340000E+02   # meL(MX)             
        32     4.23340000E+02   # mmuL(MX)            
        33     2.01027000E+03   # mtauL(MX)           
        34     1.61999000E+03   # meR(MX)             
        35     1.61999000E+03   # mmuR(MX)            
        36     3.37786000E+03   # mtauR(MX)           
        41     3.07905000E+03   # mqL1(MX)            
        42     3.07905000E+03   # mqL2(MX)            
        43     1.51407000E+03   # mqL3(MX)            
        44     1.35990000E+03   # muR(MX)             
        45     1.35990000E+03   # mcR(MX)             
        46     3.44009000E+03   # mtR(MX)             
        47     1.01613000E+03   # mdR(MX)             
        48     1.01613000E+03   # msR(MX)             
        49     3.99600000E+02   # mbR(MX)             
#
BLOCK MASS  # Mass Spectrum
# PDG code           mass       particle
        24     8.03744470E+01   # W+
        25     1.27145840E+02   # h
        35     2.93360000E+03   # H
        36     2.93358999E+03   # A
        37     2.93520092E+03   # H+
         5     4.81876030E+00   # b-quark pole mass calculated from mb(mb)_Msbar
   1000001     3.16760940E+03   # ~d_L
   2000001     1.11185081E+03   # ~d_R
   1000002     3.16680557E+03   # ~u_L
   2000002     1.45002638E+03   # ~u_R
   1000003     3.16760940E+03   # ~s_L
   2000003     1.11185081E+03   # ~s_R
   1000004     3.16680557E+03   # ~c_L
   2000004     1.45002638E+03   # ~c_R
   1000005     5.13994414E+02   # ~b_1
   2000005     1.58841916E+03   # ~b_2
   1000006     1.55773705E+03   # ~t_1
   2000006     3.40843309E+03   # ~t_2
   1000011     4.70122382E+02   # ~e_L
   2000011     1.62561149E+03   # ~e_R
   1000012     4.63473831E+02   # ~nu_eL
   1000013     4.70122382E+02   # ~mu_L
   2000013     1.62561149E+03   # ~mu_R
   1000014     4.63473831E+02   # ~nu_muL
   1000015     2.02768333E+03   # ~tau_1
   2000015     3.37699816E+03   # ~tau_2
   1000016     2.02589859E+03   # ~nu_tauL
   1000021     3.20575463E+03   # ~g
   1000022    -2.55821667E+02   # ~chi_10
   1000023     2.58007436E+02   # ~chi_20
   1000025    -2.69165874E+03   # ~chi_30
   1000035    -3.78910004E+03   # ~chi_40
   1000024     2.57190835E+02   # ~chi_1+
   1000037     2.69182726E+03   # ~chi_2+
#
BLOCK NMIX  # Neutralino Mixing Matrix
  1  1     8.38468088E-03   # N_11
  1  2    -2.21240359E-02   # N_12
  1  3     7.08565886E-01   # N_13
  1  4     7.05247906E-01   # N_14
  2  1     7.69655117E-03   # N_21
  2  2    -1.93215800E-02   # N_22
  2  3    -7.05641516E-01   # N_23
  2  4     7.08263715E-01   # N_24
  3  1     1.23692010E-03   # N_31
  3  2     9.99568102E-01   # N_32
  3  3     2.04264778E-03   # N_33
  3  4     2.92900676E-02   # N_34
  4  1     9.99934463E-01   # N_41
  4  2    -9.02232499E-04   # N_42
  4  3    -5.12652985E-04   # N_43
  4  4    -1.14014432E-02   # N_44
#
BLOCK UMIX  # Chargino Mixing Matrix U
  1  1    -2.89094868E-03   # U_11
  1  2     9.99995821E-01   # U_12
  2  1    -9.99995821E-01   # U_21
  2  2    -2.89094868E-03   # U_22
#
BLOCK VMIX  # Chargino Mixing Matrix V
  1  1     4.14539215E-02   # V_11
  1  2     9.99140417E-01   # V_12
  2  1     9.99140417E-01   # V_21
  2  2    -4.14539215E-02   # V_22
#
BLOCK STOPMIX  # Stop Mixing Matrix
  1  1     9.93834786E-01   # cos(theta_t)
  1  2     1.10871178E-01   # sin(theta_t)
  2  1    -1.10871178E-01   # -sin(theta_t)
  2  2     9.93834786E-01   # cos(theta_t)
#
BLOCK SBOTMIX  # Sbottom Mixing Matrix
  1  1     1.16370371E-02   # cos(theta_b)
  1  2     9.99932287E-01   # sin(theta_b)
  2  1    -9.99932287E-01   # -sin(theta_b)
  2  2     1.16370371E-02   # cos(theta_b)
#
BLOCK STAUMIX  # Stau Mixing Matrix
  1  1     9.99996053E-01   # cos(theta_tau)
  1  2     2.80962354E-03   # sin(theta_tau)
  2  1    -2.80962354E-03   # -sin(theta_tau)
  2  2     9.99996053E-01   # cos(theta_tau)
#
BLOCK ALPHA  # Higgs mixing
          -2.42520500E-02   # Mixing angle in the neutral Higgs boson sector
#
BLOCK HMIX Q=  2.26739200E+03  # DRbar Higgs Parameters
         1     2.50670852E+02   # mu(Q)MSSM           
         2     4.13502916E+01   # tan                 
         3     2.42292482E+02   # higgs               
         4     8.58453611E+06   # mA^2(Q)MSSM         
#
BLOCK GAUGE Q=  2.26739200E+03  # The gauge couplings
     1     3.64530896E-01   # gprime(Q) DRbar
     2     6.37777471E-01   # g(Q) DRbar
     3     1.01792919E+00   # g3(Q) DRbar
#
BLOCK AU Q=  2.26739200E+03  # The trilinear couplings
  1  1     0.00000000E+00   # A_u(Q) DRbar
  2  2     0.00000000E+00   # A_c(Q) DRbar
  3  3    -6.95268999E+03   # A_t(Q) DRbar
#
BLOCK AD Q=  2.26739200E+03  # The trilinear couplings
  1  1     0.00000000E+00   # A_d(Q) DRbar
  2  2     0.00000000E+00   # A_s(Q) DRbar
  3  3    -1.62436999E+03   # A_b(Q) DRbar
#
BLOCK AE Q=  2.26739200E+03  # The trilinear couplings
  1  1     0.00000000E+00   # A_e(Q) DRbar
  2  2     0.00000000E+00   # A_mu(Q) DRbar
  3  3    -1.56919000E+03   # A_tau(Q) DRbar
#
BLOCK Yu Q=  2.26739200E+03  # The Yukawa couplings
  1  1     0.00000000E+00   # y_u(Q) DRbar
  2  2     0.00000000E+00   # y_c(Q) DRbar
  3  3     8.12482823E-01   # y_t(Q) DRbar
#
BLOCK Yd Q=  2.26739200E+03  # The Yukawa couplings
  1  1     0.00000000E+00   # y_d(Q) DRbar
  2  2     0.00000000E+00   # y_s(Q) DRbar
  3  3     5.33884129E-01   # y_b(Q) DRbar
#
BLOCK Ye Q=  2.26739200E+03  # The Yukawa couplings
  1  1     0.00000000E+00   # y_e(Q) DRbar
  2  2     0.00000000E+00   # y_mu(Q) DRbar
  3  3     4.16312977E-01   # y_tau(Q) DRbar
#
BLOCK MSOFT Q=  2.26739200E+03  # The soft SUSY breaking masses at the scale Q
         1    -3.82800000E+03   # M_1(Q)              
         2    -2.68928000E+03   # M_2(Q)              
         3     3.16665000E+03   # M_3(Q)              
        21     8.59778445E+06   # mH1^2(Q)            
        22    -1.88029803E+05   # mH2^2(Q)            
        31     4.23340000E+02   # meL(Q)              
        32     4.23340000E+02   # mmuL(Q)             
        33     2.01027000E+03   # mtauL(Q)            
        34     1.61999000E+03   # meR(Q)              
        35     1.61999000E+03   # mmuR(Q)             
        36     3.37786000E+03   # mtauR(Q)            
        41     3.07904999E+03   # mqL1(Q)             
        42     3.07904999E+03   # mqL2(Q)             
        43     1.51406996E+03   # mqL3(Q)             
        44     1.35989999E+03   # muR(Q)              
        45     1.35989999E+03   # mcR(Q)              
        46     3.44008998E+03   # mtR(Q)              
        47     1.01612998E+03   # mdR(Q)              
        48     1.01612998E+03   # msR(Q)              
        49     3.99599923E+02   # mbR(Q)              
#
Block HiggsBoundsInputHiggsCouplingsFermions
# ScalarNormEffCoupSq PseudoSNormEffCoupSq NP   IP1 IP2 IP2
    1.00605758E+00    0.00000000E+00        3  25   5   5  # h0-b-b eff. coupling^2, normalised to SM
    1.70984056E+03    0.00000000E+00        3  35   5   5  # H0-b-b eff. coupling^2, normalised to SM
    0.00000000E+00    1.70984662E+03        3  36   5   5  # A0-b-b eff. coupling^2, normalised to SM
#
    9.99996457E-01    0.00000000E+00        3  25   6   6  # h0-t-t eff. coupling^2, normalised to SM
    5.88390545E-04    0.00000000E+00        3  35   6   6  # H0-t-t eff. coupling^2, normalised to SM
    0.00000000E+00    5.84847782E-04        3  36   6   6  # A0-t-t eff. coupling^2, normalised to SM
#
    1.00605758E+00    0.00000000E+00        3  25  15  15  # h0-tau-tau eff. coupling^2, normalised to SM
    1.70984056E+03    0.00000000E+00        3  35  15  15  # H0-tau-tau eff. coupling^2, normalised to SM
    0.00000000E+00    1.70984662E+03        3  36  15  15  # A0-tau-tau eff. coupling^2, normalised to SM
#
Block HiggsBoundsInputHiggsCouplingsBosons
    9.99999995E-01        3  25  24  24  # h0-W-W eff. coupling^2, normalised to SM
    5.34896416E-09        3  35  24  24  # H0-W-W eff. coupling^2, normalised to SM
    0.00000000E+00        3  36  24  24  # A0-W-W eff. coupling^2, normalised to SM
#
    9.99999995E-01        3  25  23  23  # h0-Z-Z eff. coupling^2, normalised to SM
    5.34896416E-09        3  35  23  23  # H0-Z-Z eff. coupling^2, normalised to SM
    0.00000000E+00        3  36  23  23  # A0-Z-Z eff. coupling^2, normalised to SM
#
    8.62636932E-01        3  25  21  21  # h0-g-g eff. coupling^2, normalised to SM
    1.22986892E-12        3  35  21  21  # H0-g-g eff. coupling^2, normalised to SM
    5.95436014E-12        3  36  21  21  # A0-g-g eff. coupling^2, normalised to SM
#
    0.00000000E+00        3  25  25  23  # h0-h0-Z eff. coupling^2, normalised to SM
    0.00000000E+00        3  35  25  23  # H0-h0-Z eff. coupling^2, normalised to SM
    5.34896416E-09        3  36  25  23  # A0-h0-Z eff. coupling^2, normalised to SM
    0.00000000E+00        3  35  35  23  # H0-H0-Z eff. coupling^2, normalised to SM
    9.99999995E-01        3  36  35  23  # A0-H0-Z eff. coupling^2, normalised to SM
    0.00000000E+00        3  36  36  23  # A0-A0-Z eff. coupling^2, normalised to SM
#
    0.00000000E+00        4  25  21  21  23  # h0-g-g-Z eff. coupling^2, normalised to SM
    0.00000000E+00        4  35  21  21  23  # H0-g-g-Z eff. coupling^2, normalised to SM
    0.00000000E+00        4  36  21  21  23  # A0-g-g-Z eff. coupling^2, normalised to SM
#
#
#
#                             =================
#                             |The decay table|
#                             =================
#
# - The QCD corrections to the decays gluino -> squark  + quark
#                                     squark -> gaugino + quark_prime
#                                     squark -> squark_prime + Higgs
#                                     squark -> gluino  + quark
#   are included.
#
# - The multi-body decays for the inos, stops and sbottoms are included.
#
# - The loop induced decays for the gluino, neutralinos and stops
#   are included.
#
# - The SUSY decays of the top quark are included.
#
#
#         PDG            Width
DECAY         6     1.43323649E+00   # top decays
#          BR         NDA      ID1       ID2
     1.00000000E+00    2           5        24   # BR(t ->  b    W+)
#
#         PDG            Width
DECAY   1000021     3.08071034E+02   # gluino decays
#          BR         NDA      ID1       ID2
     5.72814311E-05    2     1000001        -1   # BR(~g -> ~d_L  db)
     5.72814311E-05    2    -1000001         1   # BR(~g -> ~d_L* d )
     7.92127876E-02    2     2000001        -1   # BR(~g -> ~d_R  db)
     7.92127876E-02    2    -2000001         1   # BR(~g -> ~d_R* d )
     5.97059743E-05    2     1000002        -2   # BR(~g -> ~u_L  ub)
     5.97059743E-05    2    -1000002         2   # BR(~g -> ~u_L* u )
     6.47583266E-02    2     2000002        -2   # BR(~g -> ~u_R  ub)
     6.47583266E-02    2    -2000002         2   # BR(~g -> ~u_R* u )
     5.72814311E-05    2     1000003        -3   # BR(~g -> ~s_L  sb)
     5.72814311E-05    2    -1000003         3   # BR(~g -> ~s_L* s )
     7.92127876E-02    2     2000003        -3   # BR(~g -> ~s_R  sb)
     7.92127876E-02    2    -2000003         3   # BR(~g -> ~s_R* s )
     5.96538072E-05    2     1000004        -4   # BR(~g -> ~c_L  cb)
     5.96538072E-05    2    -1000004         4   # BR(~g -> ~c_L* c )
     6.47583156E-02    2     2000004        -4   # BR(~g -> ~c_R  cb)
     6.47583156E-02    2    -2000004         4   # BR(~g -> ~c_R* c )
     9.61022327E-02    2     1000005        -5   # BR(~g -> ~b_1  bb)
     9.61022327E-02    2    -1000005         5   # BR(~g -> ~b_1* b )
     5.80327420E-02    2     2000005        -5   # BR(~g -> ~b_2  bb)
     5.80327420E-02    2    -2000005         5   # BR(~g -> ~b_2* b )
     5.76888853E-02    2     1000006        -6   # BR(~g -> ~t_1  tb)
     5.76888853E-02    2    -1000006         6   # BR(~g -> ~t_1* t )
#
#         PDG            Width
DECAY   1000006     2.73511717E+01   # stop1 decays
#          BR         NDA      ID1       ID2
     3.44020889E-01    2     1000022         6   # BR(~t_1 -> ~chi_10 t )
     3.41776537E-01    2     1000023         6   # BR(~t_1 -> ~chi_20 t )
     3.06100759E-01    2     1000024         5   # BR(~t_1 -> ~chi_1+ b )
     8.10181402E-03    2     1000005        24   # BR(~t_1 -> ~b_1    W+)
#
#         PDG            Width
DECAY   2000006     3.81662044E+02   # stop2 decays
#          BR         NDA      ID1       ID2
     5.75449143E-02    2     1000022         6   # BR(~t_2 -> ~chi_10 t )
     5.81992253E-02    2     1000023         6   # BR(~t_2 -> ~chi_20 t )
     1.78859972E-05    2     1000025         6   # BR(~t_2 -> ~chi_30 t )
     1.15779766E-01    2     1000024         5   # BR(~t_2 -> ~chi_1+ b )
     3.47676759E-05    2     1000037         5   # BR(~t_2 -> ~chi_2+ b )
     2.69826179E-03    2     1000021         6   # BR(~t_2 -> ~g      t )
     1.83267522E-01    2     1000006        25   # BR(~t_2 -> ~t_1    h )
     2.00490777E-01    2     1000006        23   # BR(~t_2 -> ~t_1    Z )
     1.00777390E-04    2     1000005        24   # BR(~t_2 -> ~b_1    W+)
     3.81866102E-01    2     2000005        24   # BR(~t_2 -> ~b_2    W+)
#
#         PDG            Width
DECAY   1000005     2.62130545E+00   # sbottom1 decays
#          BR         NDA      ID1       ID2
     3.16190285E-01    2     1000022         5   # BR(~b_1 -> ~chi_10 b )
     3.09431843E-01    2     1000023         5   # BR(~b_1 -> ~chi_20 b )
     3.74377872E-01    2    -1000024         6   # BR(~b_1 -> ~chi_1- t )
#
#         PDG            Width
DECAY   2000005     2.80648212E+01   # sbottom2 decays
#          BR         NDA      ID1       ID2
     1.52893592E-01    2     1000022         5   # BR(~b_2 -> ~chi_10 b )
     1.51687636E-01    2     1000023         5   # BR(~b_2 -> ~chi_20 b )
     6.86279456E-01    2    -1000024         6   # BR(~b_2 -> ~chi_1- t )
     4.72137567E-03    2     1000005        25   # BR(~b_2 -> ~b_1    h )
     4.41794042E-03    2     1000005        23   # BR(~b_2 -> ~b_1    Z )
#
#         PDG            Width
DECAY   1000002     3.00731960E+00   # sup_L decays
#          BR         NDA      ID1       ID2
     1.70842696E-03    2     1000022         2   # BR(~u_L -> ~chi_10 u)
     1.29241436E-03    2     1000023         2   # BR(~u_L -> ~chi_20 u)
     3.28118431E-01    2     1000025         2   # BR(~u_L -> ~chi_30 u)
     1.39337193E-02    2     1000024         1   # BR(~u_L -> ~chi_1+ d)
     6.54947008E-01    2     1000037         1   # BR(~u_L -> ~chi_2+ d)
#
#         PDG            Width
DECAY   2000002     6.09762476E-03   # sup_R decays
#           BR         NDA      ID1       ID2
     3.75944797E-02    2     1000022         2   # BR(~u_R -> ~chi_10 u)
     3.16424638E-02    2     1000023         2   # BR(~u_R -> ~chi_20 u)
#           BR         NDA      ID1       ID2       ID3
     1.33019009E-03    3        2       -1        2000001   # BR(~u_R -> u  db  ~d_R)
     8.11496311E-03    3        2       1        -2000001   # BR(~u_R -> u  d  ~d_R*)
     1.28689454E-03    3        2       -3        2000003   # BR(~u_R -> u  sb  ~s_R)
     8.17137852E-03    3        2       3        -2000003   # BR(~u_R -> u  s  ~s_R*)
     7.72858315E-02    3        2       -5        1000005   # BR(~u_R -> u  bb  ~b_1)
     8.18745035E-01    3        2       5        -1000005   # BR(~u_R -> u  b  ~b_1*)
     1.63758847E-03    3        2       -11        1000011   # BR(~u_R -> u  e+  ~e_L-)
     1.05765774E-04    3        2       11        -1000011   # BR(~u_R -> u  e-  ~e_L+)
     1.63229132E-03    3        2       -12        1000012   # BR(~u_R -> u  nu_eb  ~nu_eL)
     1.01944614E-04    3        2       12        -1000012   # BR(~u_R -> u  nu_e  ~nu_eL*)
     1.63737527E-03    3        2       -13        1000013   # BR(~u_R -> u  mu+  ~mu_L-)
     1.06001931E-04    3        2       13        -1000013   # BR(~u_R -> u  mu-  ~mu_L+)
     1.64572278E-03    3        2       -14        1000014   # BR(~u_R -> u  nu_mub  ~nu_muL)
     1.02508768E-04    3        2       14        -1000014   # BR(~u_R -> u  nu_mu  ~nu_muL*)
     1.04171710E-03    3        2       23        1000022   # BR(~u_R -> u  Z  ~chi_10)
     1.20069704E-03    3        2       25        1000022   # BR(~u_R -> u  h  ~chi_10)
     1.39159104E-03    3        2       23        1000023   # BR(~u_R -> u  Z  ~chi_20)
     8.39704016E-04    3        2       25        1000023   # BR(~u_R -> u  h  ~chi_20)
     1.78807330E-04    3        2       -24        1000024   # BR(~u_R -> u  W-  ~chi_1+)
     4.20704799E-03    3        2       24        -1000024   # BR(~u_R -> u  W+  ~chi_1-)
#
#         PDG            Width
DECAY   1000001     2.97947249E+00   # sdown_L decays
#          BR         NDA      ID1       ID2
     2.30344141E-03    2     1000022         1   # BR(~d_L -> ~chi_10 d)
     1.76857571E-03    2     1000023         1   # BR(~d_L -> ~chi_20 d)
     3.31800886E-01    2     1000025         1   # BR(~d_L -> ~chi_30 d)
     6.84141767E-05    2    -1000024         2   # BR(~d_L -> ~chi_1- u)
     6.64058682E-01    2    -1000037         2   # BR(~d_L -> ~chi_2- u)
#
#         PDG            Width
DECAY   2000001     1.14653298E-03   # sdown_R decays
#           BR         NDA      ID1       ID2
     3.71091289E-02    2     1000022         1   # BR(~d_R -> ~chi_10 d)
     3.12084344E-02    2     1000023         1   # BR(~d_R -> ~chi_20 d)
#           BR         NDA      ID1       ID2       ID3
     5.52788286E-02    3        1       -5        1000005   # BR(~d_R -> d  bb  ~b_1)
     8.70537541E-01    3        1       5        -1000005   # BR(~d_R -> d  b  ~b_1*)
     4.72511485E-04    3        1       -11        1000011   # BR(~d_R -> d  e+  ~e_L-)
     2.08341151E-05    3        1       11        -1000011   # BR(~d_R -> d  e-  ~e_L+)
     4.93417992E-04    3        1       -12        1000012   # BR(~d_R -> d  nu_eb  ~nu_eL)
     2.00535008E-05    3        1       12        -1000012   # BR(~d_R -> d  nu_e  ~nu_eL*)
     4.81102603E-04    3        1       -13        1000013   # BR(~d_R -> d  mu+  ~mu_L-)
     2.12414300E-05    3        1       13        -1000013   # BR(~d_R -> d  mu-  ~mu_L+)
     4.93348216E-04    3        1       -14        1000014   # BR(~d_R -> d  nu_mub  ~nu_muL)
     2.04041231E-05    3        1       14        -1000014   # BR(~d_R -> d  nu_mu  ~nu_muL*)
     3.75881033E-04    3        1       23        1000022   # BR(~d_R -> d  Z  ~chi_10)
     5.30076336E-04    3        1       25        1000022   # BR(~d_R -> d  h  ~chi_10)
     5.27276591E-04    3        1       23        1000023   # BR(~d_R -> d  Z  ~chi_20)
     3.80582162E-04    3        1       25        1000023   # BR(~d_R -> d  h  ~chi_20)
     5.03273792E-05    3        1       -24        1000024   # BR(~d_R -> d  W-  ~chi_1+)
     1.97900980E-03    3        1       24        -1000024   # BR(~d_R -> d  W+  ~chi_1-)
#
#         PDG            Width
DECAY   1000004     3.00929385E+00   # scharm_L decays
#          BR         NDA      ID1       ID2
     1.77068469E-03    2     1000022         4   # BR(~c_L -> ~chi_10 c)
     1.33949429E-03    2     1000023         4   # BR(~c_L -> ~chi_20 c)
     3.27913731E-01    2     1000025         4   # BR(~c_L -> ~chi_30 c)
     1.44413734E-02    2     1000024         3   # BR(~c_L -> ~chi_1+ s)
     6.54534716E-01    2     1000037         3   # BR(~c_L -> ~chi_2+ s)
#
#         PDG            Width
DECAY   2000004     6.11763765E-03   # scharm_R decays
#           BR         NDA      ID1       ID2
     3.67574683E-02    2     1000022         4   # BR(~c_R -> ~chi_10 c)
     3.09375439E-02    2     1000023         4   # BR(~c_R -> ~chi_20 c)
#           BR         NDA      ID1       ID2       ID3
     1.31240202E-03    3        4       -1        2000001   # BR(~c_R -> c  db  ~d_R)
     8.10803171E-03    3        4       1        -2000001   # BR(~c_R -> c  d  ~d_R*)
     1.26828368E-03    3        4       -3        2000003   # BR(~c_R -> c  sb  ~s_R)
     8.32527243E-03    3        4       3        -2000003   # BR(~c_R -> c  s  ~s_R*)
     7.69414646E-02    3        4       -5        1000005   # BR(~c_R -> c  bb  ~b_1)
     8.20594532E-01    3        4       5        -1000005   # BR(~c_R -> c  b  ~b_1*)
     1.61156979E-03    3        4       -11        1000011   # BR(~c_R -> c  e+  ~e_L-)
     1.05913432E-04    3        4       11        -1000011   # BR(~c_R -> c  e-  ~e_L+)
     1.65472370E-03    3        4       -12        1000012   # BR(~c_R -> c  nu_eb  ~nu_eL)
     1.01405156E-04    3        4       12        -1000012   # BR(~c_R -> c  nu_e  ~nu_eL*)
     1.61608133E-03    3        4       -13        1000013   # BR(~c_R -> c  mu+  ~mu_L-)
     1.05651893E-04    3        4       13        -1000013   # BR(~c_R -> c  mu-  ~mu_L+)
     1.63134866E-03    3        4       -14        1000014   # BR(~c_R -> c  nu_mub  ~nu_muL)
     1.02171792E-04    3        4       14        -1000014   # BR(~c_R -> c  nu_mu  ~nu_muL*)
     1.03652756E-03    3        4       23        1000022   # BR(~c_R -> c  Z  ~chi_10)
     1.20129704E-03    3        4       25        1000022   # BR(~c_R -> c  h  ~chi_10)
     1.38631944E-03    3        4       23        1000023   # BR(~c_R -> c  Z  ~chi_20)
     8.33998399E-04    3        4       25        1000023   # BR(~c_R -> c  h  ~chi_20)
     1.76506041E-04    3        4       -24        1000024   # BR(~c_R -> c  W-  ~chi_1+)
     4.19148722E-03    3        4       24        -1000024   # BR(~c_R -> c  W+  ~chi_1-)
#
#         PDG            Width
DECAY   1000003     2.98028785E+00   # sstrange_L decays
#          BR         NDA      ID1       ID2
     2.38842838E-03    2     1000022         3   # BR(~s_L -> ~chi_10 s)
     1.83380428E-03    2     1000023         3   # BR(~s_L -> ~chi_20 s)
     3.31753874E-01    2     1000025         3   # BR(~s_L -> ~chi_30 s)
     7.09377577E-05    2    -1000024         4   # BR(~s_L -> ~chi_1- c)
     6.63952956E-01    2    -1000037         4   # BR(~s_L -> ~chi_2- c)
#
#         PDG            Width
DECAY   2000003     1.14823135E-03   # sstrange_R decays
#           BR         NDA      ID1       ID2
     3.58700313E-02    2     1000022         3   # BR(~s_R -> ~chi_10 s)
     3.01659752E-02    2     1000023         3   # BR(~s_R -> ~chi_20 s)
#           BR         NDA      ID1       ID2       ID3
     5.51970644E-02    3        3       -5        1000005   # BR(~s_R -> s  bb  ~b_1)
     8.72907708E-01    3        3       5        -1000005   # BR(~s_R -> s  b  ~b_1*)
     4.71812582E-04    3        3       -11        1000011   # BR(~s_R -> s  e+  ~e_L-)
     2.08032988E-05    3        3       11        -1000011   # BR(~s_R -> s  e-  ~e_L+)
     4.92688166E-04    3        3       -12        1000012   # BR(~s_R -> s  nu_eb  ~nu_eL)
     1.99567795E-05    3        3       12        -1000012   # BR(~s_R -> s  nu_e  ~nu_eL*)
     4.80390993E-04    3        3       -13        1000013   # BR(~s_R -> s  mu+  ~mu_L-)
     2.12100113E-05    3        3       13        -1000013   # BR(~s_R -> s  mu-  ~mu_L+)
     4.92618494E-04    3        3       -14        1000014   # BR(~s_R -> s  nu_mub  ~nu_muL)
     2.03739429E-05    3        3       14        -1000014   # BR(~s_R -> s  nu_mu  ~nu_muL*)
     3.75342476E-04    3        3       23        1000022   # BR(~s_R -> s  Z  ~chi_10)
     5.29292288E-04    3        3       25        1000022   # BR(~s_R -> s  h  ~chi_10)
     5.26496684E-04    3        3       23        1000023   # BR(~s_R -> s  Z  ~chi_20)
     3.80019234E-04    3        3       25        1000023   # BR(~s_R -> s  h  ~chi_20)
     5.03043222E-05    3        3       -24        1000024   # BR(~s_R -> s  W-  ~chi_1+)
     1.97791150E-03    3        3       24        -1000024   # BR(~s_R -> s  W+  ~chi_1-)
#
#         PDG            Width
DECAY   1000011     5.05557892E-04   # selectron_L decays
#          BR         NDA      ID1       ID2
     5.59974460E-01    2     1000022        11   # BR(~e_L -> ~chi_10 e-)
     4.09146161E-01    2     1000023        11   # BR(~e_L -> ~chi_20 e-)
     3.08793790E-02    2    -1000024        12   # BR(~e_L -> ~chi_1- nu_e)
#
#         PDG            Width
DECAY   2000011     1.46127518E-03   # selectron_R decays
#           BR         NDA      ID1       ID2
     3.93282908E-01    2     1000022        11   # BR(~e_R -> ~chi_10 e-)
     3.31089731E-01    2     1000023        11   # BR(~e_R -> ~chi_20 e-)
#           BR         NDA      ID1       ID2       ID3
     1.33534055E-04    3        11       -1        2000001   # BR(~e_R- -> e-  db  ~d_R)
     1.01199282E-03    3        11       1        -2000001   # BR(~e_R- -> e-  d  ~d_R*)
     3.85457857E-06    3        11       -2        2000002   # BR(~e_R- -> e-  ub  ~u_R)
     2.30319384E-05    3        11       2        -2000002   # BR(~e_R- -> e-  u  ~u_R*)
     1.33232948E-04    3        11       -3        2000003   # BR(~e_R- -> e-  sb  ~s_R)
     1.01609883E-03    3        11       3        -2000003   # BR(~e_R- -> e-  s  ~s_R*)
     3.76595734E-06    3        11       -4        2000004   # BR(~e_R- -> e-  cb  ~c_R)
     2.31373258E-05    3        11       4        -2000004   # BR(~e_R- -> e-  c  ~c_R*)
     2.53100856E-03    3        11       -5        1000005   # BR(~e_R- -> e-  bb  ~b_1)
     3.11850913E-02    3        11       5        -1000005   # BR(~e_R- -> e-  b  ~b_1*)
     6.13163086E-10    3        11       -5        2000005   # BR(~e_R- -> e-  bb  ~b_2)
     1.15173379E-10    3        11       5        -2000005   # BR(~e_R- -> e-  b  ~b_2*)
     2.75868642E-02    3        11       -11        1000011   # BR(~e_R- -> e-  e+  ~e_L-)
     2.11041701E-03    3        11       11        -1000011   # BR(~e_R- -> e-  e-  ~e_L+)
     2.75704402E-02    3        11       -12        1000012   # BR(~e_R- -> e-  nu_eb  ~nu_eL)
     2.05443850E-03    3        11       12        -1000012   # BR(~e_R- -> e-  nu_e  ~nu_eL*)
     2.71352039E-02    3        11       -13        1000013   # BR(~e_R- -> e-  mu+  ~mu_L-)
     2.14381250E-03    3        11       13        -1000013   # BR(~e_R- -> e-  mu-  ~mu_L+)
     2.76737746E-02    3        11       -14        1000014   # BR(~e_R- -> e-  nu_mub  ~nu_muL)
     2.08030632E-03    3        11       14        -1000014   # BR(~e_R- -> e-  nu_mu  ~nu_muL*)
     1.14112661E-02    3        11       23        1000022   # BR(~e_R- -> e-  Z  ~chi_10)
     1.74279289E-02    3        11       25        1000022   # BR(~e_R- -> e-  h  ~chi_10)
     1.67702841E-02    3        11       23        1000023   # BR(~e_R- -> e-  Z  ~chi_20)
     1.20778073E-02    3        11       25        1000023   # BR(~e_R- -> e-  h  ~chi_20)
     3.14266611E-03    3        11       -24        1000024   # BR(~e_R- -> e-  W-  ~chi_1+)
     6.03774026E-02    3        11       24        -1000024   # BR(~e_R- -> e-  W+  ~chi_1-)
#
#         PDG            Width
DECAY   1000013     5.05557792E-04   # smuon_L decays
#          BR         NDA      ID1       ID2
     5.59974457E-01    2     1000022        13   # BR(~mu_L -> ~chi_10 mu-)
     4.09146158E-01    2     1000023        13   # BR(~mu_L -> ~chi_20 mu-)
     3.08793851E-02    2    -1000024        14   # BR(~mu_L -> ~chi_1- nu_mu)
#
#         PDG            Width
DECAY   2000013     1.46161773E-03   # smuon_R decays
#           BR         NDA      ID1       ID2
     3.93190734E-01    2     1000022        13   # BR(~mu_R -> ~chi_10 mu-)
     3.31012133E-01    2     1000023        13   # BR(~mu_R -> ~chi_20 mu-)
#           BR         NDA      ID1       ID2       ID3
     1.32339664E-04    3        13       -1        2000001   # BR(~mu_R- -> mu-  db  ~d_R)
     1.01196090E-03    3        13       1        -2000001   # BR(~mu_R- -> mu-  d  ~d_R*)
     3.87180580E-06    3        13       -2        2000002   # BR(~mu_R- -> mu-  ub  ~u_R)
     2.29629125E-05    3        13       2        -2000002   # BR(~mu_R- -> mu-  u  ~u_R*)
     1.33201723E-04    3        13       -3        2000003   # BR(~mu_R- -> mu-  sb  ~s_R)
     1.02167617E-03    3        13       3        -2000003   # BR(~mu_R- -> mu-  s  ~s_R*)
     3.76705885E-06    3        13       -4        2000004   # BR(~mu_R- -> mu-  cb  ~c_R)
     2.34199403E-05    3        13       4        -2000004   # BR(~mu_R- -> mu-  c  ~c_R*)
     2.53055223E-03    3        13       -5        1000005   # BR(~mu_R- -> mu-  bb  ~b_1)
     3.11784669E-02    3        13       5        -1000005   # BR(~mu_R- -> mu-  b  ~b_1*)
     6.12273635E-10    3        13       -5        2000005   # BR(~mu_R- -> mu-  bb  ~b_2)
     1.15077969E-10    3        13       5        -2000005   # BR(~mu_R- -> mu-  b  ~b_2*)
     2.75803989E-02    3        13       -11        1000011   # BR(~mu_R- -> mu-  e+  ~e_L-)
     2.14324165E-03    3        13       11        -1000011   # BR(~mu_R- -> mu-  e-  ~e_L+)
     2.77979660E-02    3        13       -12        1000012   # BR(~mu_R- -> mu-  nu_eb  ~nu_eL)
     2.05395702E-03    3        13       12        -1000012   # BR(~mu_R- -> mu-  nu_e  ~nu_eL*)
     2.71288444E-02    3        13       -13        1000013   # BR(~mu_R- -> mu-  mu+  ~mu_L-)
     2.10992241E-03    3        13       13        -1000013   # BR(~mu_R- -> mu-  mu-  ~mu_L+)
     2.76672889E-02    3        13       -14        1000014   # BR(~mu_R- -> mu-  nu_mub  ~nu_muL)
     2.07981878E-03    3        13       14        -1000014   # BR(~mu_R- -> mu-  nu_mu  ~nu_muL*)
     1.14092759E-02    3        13       23        1000022   # BR(~mu_R- -> mu-  Z  ~chi_10)
     1.74238445E-02    3        13       25        1000022   # BR(~mu_R- -> mu-  h  ~chi_10)
     1.67663538E-02    3        13       23        1000023   # BR(~mu_R- -> mu-  Z  ~chi_20)
     1.20749767E-02    3        13       25        1000023   # BR(~mu_R- -> mu-  h  ~chi_20)
     3.13577203E-03    3        13       -24        1000024   # BR(~mu_R- -> mu-  W-  ~chi_1+)
     6.03632524E-02    3        13       24        -1000024   # BR(~mu_R- -> mu-  W+  ~chi_1-)
#
#         PDG            Width
DECAY   1000015     6.77346364E+00   # stau_1 decays
#          BR         NDA      ID1       ID2
     5.02334549E-01    2     1000022        15   # BR(~tau_1 -> ~chi_10  tau-)
     4.97613096E-01    2     1000023        15   # BR(~tau_1 -> ~chi_20  tau-)
     5.23552704E-05    2    -1000024        16   # BR(~tau_1 -> ~chi_1-  nu_tau)
#
#         PDG            Width
DECAY   2000015     2.31227949E+01   # stau_2 decays
#          BR         NDA      ID1       ID2
     2.49928341E-01    2     1000022        15   # BR(~tau_2 -> ~chi_10  tau-)
     2.47920699E-01    2     1000023        15   # BR(~tau_2 -> ~chi_20  tau-)
     1.89160531E-06    2     1000025        15   # BR(~tau_2 -> ~chi_30  tau-)
     4.97725556E-01    2    -1000024        16   # BR(~tau_2 -> ~chi_1-  nu_tau)
     3.46598139E-06    2    -1000037        16   # BR(~tau_2 -> ~chi_2-  nu_tau)
     2.14760506E-03    2     1000016       -24   # BR(~tau_2 -> ~nu_tauL W-)
     1.17078099E-03    2     1000015        25   # BR(~tau_2 -> ~tau_1   h)
     1.10166043E-03    2     1000015        23   # BR(~tau_2 -> ~tau_1   Z)
#
#         PDG            Width
DECAY   1000012     4.24625556E-03   # snu_eL decays
#          BR         NDA      ID1       ID2
     1.54695951E-01    2     1000022        12   # BR(~nu_eL -> ~chi_10 nu_e)
     1.18342783E-01    2     1000023        12   # BR(~nu_eL -> ~chi_20 nu_e)
     7.26961266E-01    2     1000024        11   # BR(~nu_eL -> ~chi_1+ e-)
#
#         PDG            Width
DECAY   1000014     4.24625489E-03   # snu_muL decays
#          BR         NDA      ID1       ID2
     1.54695975E-01    2     1000022        14   # BR(~nu_muL -> ~chi_10 nu_mu)
     1.18342801E-01    2     1000023        14   # BR(~nu_muL -> ~chi_20 nu_mu)
     7.26961223E-01    2     1000024        13   # BR(~nu_muL -> ~chi_1+ mu-)
#
#         PDG            Width
DECAY   1000016     6.79960943E+00   # snu_tauL decays
#          BR         NDA      ID1       ID2
     8.45756071E-04    2     1000022        16   # BR(~nu_tauL -> ~chi_10 nu_tau)
     6.56481165E-04    2     1000023        16   # BR(~nu_tauL -> ~chi_20 nu_tau)
     9.98497763E-01    2     1000024        15   # BR(~nu_tauL -> ~chi_1+ tau-)
#
#         PDG            Width
DECAY   1000024     3.18115200E-12   # chargino1+ decays
#           BR         NDA      ID1       ID2       ID3
     5.99988100E-01    3     1000022         2        -1   # BR(~chi_1+ -> ~chi_10 u    db)
     2.00005950E-01    3     1000022       -11        12   # BR(~chi_1+ -> ~chi_10 e+   nu_e)
     2.00005950E-01    3     1000022       -13        14   # BR(~chi_1+ -> ~chi_10 mu+  nu_mu)
#
#         PDG            Width
DECAY   1000037     9.38857912E+01   # chargino2+ decays
#          BR         NDA      ID1       ID2
     1.53603805E-01    2     1000006        -5   # BR(~chi_2+ -> ~t_1     bb)
     2.70756059E-05    2    -1000005         6   # BR(~chi_2+ -> ~b_1*    t )
     1.44181149E-01    2    -2000005         6   # BR(~chi_2+ -> ~b_2*    t )
     1.09043525E-01    2     1000012       -11   # BR(~chi_2+ -> ~nu_eL   e+  )
     1.09043525E-01    2     1000014       -13   # BR(~chi_2+ -> ~nu_muL mu+ )
     2.17708984E-02    2     1000016       -15   # BR(~chi_2+ -> ~nu_tau1 tau+)
     1.09037547E-01    2    -1000011        12   # BR(~chi_2+ -> ~e_L+    nu_e)
     1.09037547E-01    2    -1000013        14   # BR(~chi_2+ -> ~mu_L+   nu_mu)
     2.17071970E-02    2    -1000015        16   # BR(~chi_2+ -> ~tau_1+  nu_tau)
     5.62239139E-02    2     1000024        23   # BR(~chi_2+ -> ~chi_1+  Z )
     5.43854260E-02    2     1000022        24   # BR(~chi_2+ -> ~chi_10  W+)
     5.48324598E-02    2     1000023        24   # BR(~chi_2+ -> ~chi_20  W+)
     5.71059315E-02    2     1000024        25   # BR(~chi_2+ -> ~chi_1+  h )
#
#         PDG            Width
DECAY   1000022     0.00000000E+00   # neutralino1 decays
#
#         PDG            Width
DECAY   1000023     5.02552870E-11   # neutralino2 decays
#          BR         NDA      ID1       ID2
     2.95295273E-01    2     1000022        22   # BR(~chi_20 -> ~chi_10 gam)
#           BR         NDA      ID1       ID2       ID3
     1.16205499E-01    3     1000022        -2         2   # BR(~chi_20 -> ~chi_10 ub      u)
     1.50847631E-01    3     1000022        -1         1   # BR(~chi_20 -> ~chi_10 db      d)
     1.50847631E-01    3     1000022        -3         3   # BR(~chi_20 -> ~chi_10 sb      s)
     3.46572323E-02    3     1000022       -11        11   # BR(~chi_20 -> ~chi_10 e+      e-)
     3.46572323E-02    3     1000022       -13        13   # BR(~chi_20 -> ~chi_10 mu+     mu-)
     6.93040343E-02    3     1000022       -12        12   # BR(~chi_20 -> ~chi_10 nu_eb   nu_e)
     6.93040343E-02    3     1000022       -14        14   # BR(~chi_20 -> ~chi_10 nu_mub  nu_mu)
     6.93004429E-02    3     1000022       -16        16   # BR(~chi_20 -> ~chi_10 nu_taub nu_tau)
     2.87425014E-03    3     1000024        -2         1   # BR(~chi_20 -> ~chi_1+ ub      d)
     2.87425014E-03    3    -1000024        -1         2   # BR(~chi_20 -> ~chi_1- db      u)
     9.58122514E-04    3     1000024       -12        11   # BR(~chi_20 -> ~chi_1+ nu_eb   e-)
     9.58122514E-04    3    -1000024        12       -11   # BR(~chi_20 -> ~chi_1- nu_e    e+)
     9.58122514E-04    3     1000024       -14        13   # BR(~chi_20 -> ~chi_1+ nu_mub  mu-)
     9.58122514E-04    3    -1000024        14       -13   # BR(~chi_20 -> ~chi_1- nu_mu   mu+)
#
#         PDG            Width
DECAY   1000025     9.38644335E+01   # neutralino3 decays
#          BR         NDA      ID1       ID2
     2.40966500E-02    2     1000022        23   # BR(~chi_30 -> ~chi_10   Z )
     3.20863619E-02    2     1000023        23   # BR(~chi_30 -> ~chi_20   Z )
     5.47280005E-02    2     1000024       -24   # BR(~chi_30 -> ~chi_1+   W-)
     5.47280005E-02    2    -1000024        24   # BR(~chi_30 -> ~chi_1-   W+)
     3.23336887E-02    2     1000022        25   # BR(~chi_30 -> ~chi_10   h )
     2.44830422E-02    2     1000023        25   # BR(~chi_30 -> ~chi_20   h )
     7.70913796E-08    2     2000002        -2   # BR(~chi_30 -> ~u_R      ub)
     7.70913796E-08    2    -2000002         2   # BR(~chi_30 -> ~u_R*     u )
     2.62425049E-08    2     2000001        -1   # BR(~chi_30 -> ~d_R      db)
     2.62425049E-08    2    -2000001         1   # BR(~chi_30 -> ~d_R*     d )
     7.70913478E-08    2     2000004        -4   # BR(~chi_30 -> ~c_R      cb)
     7.70913478E-08    2    -2000004         4   # BR(~chi_30 -> ~c_R*     c )
     2.62425049E-08    2     2000003        -3   # BR(~chi_30 -> ~s _R      sb)
     2.62425049E-08    2    -2000003         3   # BR(~chi_30 -> ~s _R*     s )
     7.50813315E-02    2     1000006        -6   # BR(~chi_30 -> ~t_1      tb)
     7.50813315E-02    2    -1000006         6   # BR(~chi_30 -> ~t_1*     t )
     1.37553421E-05    2     1000005        -5   # BR(~chi_30 -> ~b_1      bb)
     1.37553421E-05    2    -1000005         5   # BR(~chi_30 -> ~b_1*     b )
     7.38259598E-02    2     2000005        -5   # BR(~chi_30 -> ~b_2      bb)
     7.38259598E-02    2    -2000005         5   # BR(~chi_30 -> ~b_2*     b )
     5.45577939E-02    2     1000011       -11   # BR(~chi_30 -> ~e_L-     e+)
     5.45577939E-02    2    -1000011        11   # BR(~chi_30 -> ~e_L+     e-)
     4.68050209E-08    2     2000011       -11   # BR(~chi_30 -> ~e_R-     e+)
     4.68050209E-08    2    -2000011        11   # BR(~chi_30 -> ~e_R+     e-)
     5.45577939E-02    2     1000013       -13   # BR(~chi_30 -> ~mu_L-    mu+)
     5.45577939E-02    2    -1000013        13   # BR(~chi_30 -> ~mu_L+    mu-)
     4.68050209E-08    2     2000013       -13   # BR(~chi_30 -> ~mu_R-    mu+)
     4.68050209E-08    2    -2000013        13   # BR(~chi_30 -> ~mu_R+    mu-)
     1.08580199E-02    2     1000015       -15   # BR(~chi_30 -> ~tau_1-   tau+)
     1.08580199E-02    2    -1000015        15   # BR(~chi_30 -> ~tau_1+   tau-)
     5.44998550E-02    2     1000012       -12   # BR(~chi_30 -> ~nu_eL    nu_eb)
     5.44998550E-02    2    -1000012        12   # BR(~chi_30 -> ~nu_eL*   nu_e )
     5.44998550E-02    2     1000014       -14   # BR(~chi_30 -> ~nu_muL   nu_mub)
     5.44998550E-02    2    -1000014        14   # BR(~chi_30 -> ~nu_muL*  nu_mu )
     1.08774634E-02    2     1000016       -16   # BR(~chi_30 -> ~nu_tau1  nu_taub)
     1.08774634E-02    2    -1000016        16   # BR(~chi_30 -> ~nu_tau1* nu_tau )
#
#         PDG            Width
DECAY   1000035     1.21208238E+02   # neutralino4 decays
#          BR         NDA      ID1       ID2
     8.42522235E-03    2     1000022        23   # BR(~chi_40 -> ~chi_10   Z )
     1.01670721E-02    2     1000023        23   # BR(~chi_40 -> ~chi_20   Z )
     1.97124704E-06    2     1000025        23   # BR(~chi_40 -> ~chi_30   Z )
     1.78578457E-02    2     1000024       -24   # BR(~chi_40 -> ~chi_1+   W-)
     1.78578457E-02    2    -1000024        24   # BR(~chi_40 -> ~chi_1-   W+)
     7.94332660E-05    2     1000037       -24   # BR(~chi_40 -> ~chi_2+   W-)
     7.94332660E-05    2    -1000037        24   # BR(~chi_40 -> ~chi_2-   W+)
     1.10819412E-02    2     1000022        25   # BR(~chi_40 -> ~chi_10   h )
     2.25011667E-03    2     1000022        35   # BR(~chi_40 -> ~chi_10   H )
     1.02181899E-03    2     1000022        36   # BR(~chi_40 -> ~chi_10   A )
     9.38501361E-03    2     1000023        25   # BR(~chi_40 -> ~chi_20   h )
     1.00802995E-03    2     1000023        35   # BR(~chi_40 -> ~chi_20   H )
     2.23566616E-03    2     1000023        36   # BR(~chi_40 -> ~chi_20   A )
     7.18681804E-05    2     1000025        25   # BR(~chi_40 -> ~chi_30   h )
     3.22588544E-03    2     1000024       -37   # BR(~chi_40 -> ~chi_1+   H-)
     3.22588544E-03    2    -1000024        37   # BR(~chi_40 -> ~chi_1-   H+)
     6.12490615E-04    2     1000002        -2   # BR(~chi_40 -> ~u_L      ub)
     6.12490615E-04    2    -1000002         2   # BR(~chi_40 -> ~u_L*     u )
     7.68435539E-02    2     2000002        -2   # BR(~chi_40 -> ~u_R      ub)
     7.68435539E-02    2    -2000002         2   # BR(~chi_40 -> ~u_R*     u )
     6.22763528E-04    2     1000001        -1   # BR(~chi_40 -> ~d_L      db)
     6.22763528E-04    2    -1000001         1   # BR(~chi_40 -> ~d_L*     d )
     2.19826891E-02    2     2000001        -1   # BR(~chi_40 -> ~d_R      db)
     2.19826891E-02    2    -2000001         1   # BR(~chi_40 -> ~d_R*     d )
     6.12488916E-04    2     1000004        -4   # BR(~chi_40 -> ~c_L      cb)
     6.12488916E-04    2    -1000004         4   # BR(~chi_40 -> ~c_L*     c )
     7.68435482E-02    2     2000004        -4   # BR(~chi_40 -> ~c_R      cb)
     7.68435482E-02    2    -2000004         4   # BR(~chi_40 -> ~c_R*     c )
     6.22763528E-04    2     1000003        -3   # BR(~chi_40 -> ~s _L      sb)
     6.22763528E-04    2    -1000003         3   # BR(~chi_40 -> ~s _L*     s )
     2.19826891E-02    2     2000003        -3   # BR(~chi_40 -> ~s _R      sb)
     2.19826891E-02    2    -2000003         3   # BR(~chi_40 -> ~s _R*     s )
     6.53697040E-03    2     1000006        -6   # BR(~chi_40 -> ~t_1      tb)
     6.53697040E-03    2    -1000006         6   # BR(~chi_40 -> ~t_1*     t )
     3.37153198E-03    2     2000006        -6   # BR(~chi_40 -> ~t_2      tb)
     3.37153198E-03    2    -2000006         6   # BR(~chi_40 -> ~t_2*     t )
     2.65348122E-02    2     1000005        -5   # BR(~chi_40 -> ~b_1      bb)
     2.65348122E-02    2    -1000005         5   # BR(~chi_40 -> ~b_1*     b )
     4.72657703E-03    2     2000005        -5   # BR(~chi_40 -> ~b_2      bb)
     4.72657703E-03    2    -2000005         5   # BR(~chi_40 -> ~b_2*     b )
     1.99635876E-02    2     1000011       -11   # BR(~chi_40 -> ~e_L-     e+)
     1.99635876E-02    2    -1000011        11   # BR(~chi_40 -> ~e_L+     e-)
     5.50125028E-02    2     2000011       -11   # BR(~chi_40 -> ~e_R-     e+)
     5.50125028E-02    2    -2000011        11   # BR(~chi_40 -> ~e_R+     e-)
     1.99635876E-02    2     1000013       -13   # BR(~chi_40 -> ~mu_L-    mu+)
     1.99635876E-02    2    -1000013        13   # BR(~chi_40 -> ~mu_L+    mu-)
     5.50125028E-02    2     2000013       -13   # BR(~chi_40 -> ~mu_R-    mu+)
     5.50125028E-02    2    -2000013        13   # BR(~chi_40 -> ~mu_R+    mu-)
     1.04875312E-02    2     1000015       -15   # BR(~chi_40 -> ~tau_1-   tau+)
     1.04875312E-02    2    -1000015        15   # BR(~chi_40 -> ~tau_1+   tau-)
     3.49596245E-03    2     2000015       -15   # BR(~chi_40 -> ~tau_2-   tau+)
     3.49596245E-03    2    -2000015        15   # BR(~chi_40 -> ~tau_2+   tau-)
     2.01076940E-02    2     1000012       -12   # BR(~chi_40 -> ~nu_eL    nu_eb)
     2.01076940E-02    2    -1000012        12   # BR(~chi_40 -> ~nu_eL*   nu_e )
     2.01076940E-02    2     1000014       -14   # BR(~chi_40 -> ~nu_muL   nu_mub)
     2.01076940E-02    2    -1000014        14   # BR(~chi_40 -> ~nu_muL*  nu_mu )
     1.05685344E-02    2     1000016       -16   # BR(~chi_40 -> ~nu_tau1  nu_taub)
     1.05685344E-02    2    -1000016        16   # BR(~chi_40 -> ~nu_tau1* nu_tau )
#
#         PDG            Width
DECAY        25     4.62244137E-03   # h decays
#          BR         NDA      ID1       ID2
     5.88887867E-01    2           5        -5   # BR(h -> b       bb     )
     5.72890404E-02    2         -15        15   # BR(h -> tau+    tau-   )
     2.02803002E-04    2         -13        13   # BR(h -> mu+     mu-    )
     2.20523546E-04    2           3        -3   # BR(h -> s       sb     )
     1.90209323E-02    2           4        -4   # BR(h -> c       cb     )
     7.15278991E-02    2          21        21   # BR(h -> g       g      )
     2.19535405E-03    2          22        22   # BR(h -> gam     gam    )
     1.62856033E-03    2          22        23   # BR(h -> Z       gam    )
     2.29511309E-01    2          24       -24   # BR(h -> W+      W-     )
     2.95157105E-02    2          23        23   # BR(h -> Z       Z      )
#
#         PDG            Width
DECAY        35     7.85353930E+01   # H decays
#          BR         NDA      ID1       ID2
     7.22982798E-01    2           5        -5   # BR(H -> b       bb     )
     1.36192851E-01    2         -15        15   # BR(H -> tau+    tau-   )
     5.04353966E-04    2         -13        13   # BR(H -> mu+     mu-    )
     2.69828680E-04    2           3        -3   # BR(H -> s       sb     )
     9.04649557E-09    2           4        -4   # BR(H -> c       cb     )
     8.88591246E-04    2           6        -6   # BR(H -> t       tb     )
     1.10313274E-05    2          21        21   # BR(H -> g       g      )
     4.55882283E-09    2          22        22   # BR(H -> gam     gam    )
     7.16526206E-09    2          23        22   # BR(H -> Z       gam    )
     5.52396378E-07    2          24       -24   # BR(H -> W+      W-     )
     2.75570255E-07    2          23        23   # BR(H -> Z       Z      )
     1.72097493E-06    2          25        25   # BR(H -> h       h      )
     5.20849810E-04    2     1000024  -1000024   # BR(H -> ~chi_1+ ~chi_1-)
     1.12757404E-04    2     1000022   1000022   # BR(H -> ~chi_10 ~chi_10)
     7.86835466E-05    2     1000023   1000023   # BR(H -> ~chi_20 ~chi_20)
     2.67751313E-07    2     1000022   1000023   # BR(H -> ~chi_10 ~chi_20)
     9.23993021E-09    2     2000002  -2000002   # BR(H -> ~u_R    ~u_R*  )
     9.23993021E-09    2     2000004  -2000004   # BR(H -> ~c_R    ~c_R*  )
     9.99123957E-09    2     2000001  -2000001   # BR(H -> ~d_R    ~d_R*  )
     9.99123957E-09    2     2000003  -2000003   # BR(H -> ~s_R    ~s_R*  )
     4.27454153E-05    2     1000005  -1000005   # BR(H -> ~b_1    ~b_1*  )
     6.91960308E-02    2     1000005  -2000005   # BR(H -> ~b_1    ~b_2*  )
     6.91960308E-02    2     2000005  -1000005   # BR(H -> ~b_2    ~b_1*  )
     6.70552422E-08    2     1000011  -1000011   # BR(H -> ~e_L-   ~e_L+  )
     6.70552422E-08    2     1000013  -1000013   # BR(H -> ~mu_L-  ~mu_L+ )
     2.18991779E-07    2     1000012  -1000012   # BR(H -> ~nu_eL  ~nu_eL*   )
     2.18991779E-07    2     1000014  -1000014   # BR(H -> ~nu_muL ~nu_muL*  )
#
#         PDG            Width
DECAY        36     7.85419140E+01   # A decays
#          BR         NDA      ID1       ID2
     7.22939974E-01    2           5        -5   # BR(A -> b       bb     )
     1.36181755E-01    2         -15        15   # BR(A -> tau+    tau-   )
     5.04312095E-04    2         -13        13   # BR(A -> mu+     mu-    )
     2.69817568E-04    2           3        -3   # BR(A -> s       sb     )
     9.07448349E-09    2           4        -4   # BR(A -> c       cb     )
     8.91263056E-04    2           6        -6   # BR(A -> t       tb     )
     2.42701948E-05    2          21        21   # BR(A -> g       g      )
     4.79091110E-09    2          22        22   # BR(A -> gam     gam    )
     1.69981877E-08    2          23        22   # BR(A -> Z       gam    )
     5.59415945E-07    2          23        25   # BR(A -> Z       h      )
     5.33711433E-04    2     1000024  -1000024   # BR(A -> ~chi_1+ ~chi_1-)
     1.05594221E-04    2     1000022   1000022   # BR(A -> ~chi_10 ~chi_10)
     8.94825467E-05    2     1000023   1000023   # BR(A -> ~chi_20 ~chi_20)
     1.38209319E-06    2     1000022   1000023   # BR(A -> ~chi_10 ~chi_20)
     6.92289239E-02    2     1000005  -2000005   # BR(A -> ~b_1    ~b_2*  )
     6.92289239E-02    2    -1000005   2000005   # BR(A -> ~b_1*   ~b_2   )
#
#         PDG            Width
DECAY        37     1.02987944E+02   # H+ decays
#          BR         NDA      ID1       ID2
     8.10572857E-04    2           4        -5   # BR(H+ -> c       bb     )
     1.03913611E-01    2         -15        16   # BR(H+ -> tau+    nu_tau )
     3.84815799E-04    2         -13        14   # BR(H+ -> mu+     nu_mu  )
     8.10571857E-06    2           2        -5   # BR(H+ -> u       bb     )
     1.02945806E-05    2           2        -3   # BR(H+ -> u       sb     )
     2.02635231E-04    2           4        -3   # BR(H+ -> c       sb     )
     4.82145726E-01    2           6        -5   # BR(H+ -> t       bb     )
     4.27613743E-07    2          24        25   # BR(H+ -> W+      h      )
     1.38576484E-13    2          24        36   # BR(H+ -> W+      A      )
     2.54883283E-05    2     1000024   1000022   # BR(H+ -> ~chi_1+ ~chi_10)
     3.82794484E-05    2     1000024   1000023   # BR(H+ -> ~chi_1+ ~chi_20)
     2.00722319E-07    2    -1000011   1000012   # BR(H+ -> ~e_L+   ~nu_eL )
     2.00722319E-07    2    -1000013   1000014   # BR(H+ -> ~mu_L+  ~nu_muL)
     4.12459642E-01    2     1000006  -1000005   # BR(H+ -> ~t_1    ~b_1*  )
