#
#                              ======================
#                              | THE SUSYHIT OUTPUT |
#                              ======================
#
#
#              ------------------------------------------------------
#              |     This is the output of the SUSY-HIT package     |
#              |  created by A.Djouadi, M.Muehlleitner and M.Spira. |
#              |  In case of problems with SUSY-HIT email to        |
#              |           margarete.muehlleitner@cern.ch           |
#              |           michael.spira@psi.ch                     |
#              |           abdelhak.djouadi@cern.ch                 |
#              ------------------------------------------------------
#
#              ------------------------------------------------------
#              |  SUSY Les Houches Accord - MSSM Spectrum + Decays  |
#              |              based on the decay programs           |
#              |                                                    |
#              |                     SDECAY 1.3b                    |
#              |                                                    |
#              |  Authors: M.Muhlleitner, A.Djouadi and Y.Mambrini  |
#              |  Ref.:    Comput.Phys.Commun.168(2005)46           |
#              |           [hep-ph/0311167]                         |
#              |                                                    |
#              |                     HDECAY 3.4                     |
#              |                                                    |
#              |  By: A.Djouadi,J.Kalinowski,M.Muhlleitner,M.Spira  |
#              |  Ref.:    Comput.Phys.Commun.108(1998)56           |
#              |           [hep-ph/9704448]                         |
#              |                                                    |
#              |                                                    |
#              |  If not stated otherwise all DRbar couplings and   |
#              |  soft SUSY breaking masses are given at the scale  |
#              |  Q=  0.21889200E+04
#              |                                                    |
#              ------------------------------------------------------
#
#
BLOCK DCINFO  # Decay Program information
     1   SDECAY/HDECAY # decay calculator
     2   1.3b  /3.4    # version number
#
BLOCK SPINFO  # Spectrum calculator information
     1     SOFTSUSY    # spectrum calculator               
     2     3.4.0       # version number                    
#
BLOCK MODSEL  # Model selection
     1     0   #  nonUniversal                                     
#
BLOCK SMINPUTS  # Standard Model inputs
         1     1.27908970E+02   # alpha_em^-1(M_Z)^MSbar
         2     1.16637870E-05   # G_F [GeV^-2]
         3     1.18400000E-01   # alpha_S(M_Z)^MSbar
         4     9.11876000E+01   # M_Z pole mass
         5     4.18000000E+00   # mb(mb)^MSbar
         6     1.73200000E+02   # mt pole mass
         7     1.77700000E+00   # mtau pole mass
#
BLOCK MINPAR  # Input parameters - minimal models
         3     6.90000000E+00   # tanb                
#
BLOCK EXTPAR  # Input parameters - non-minimal models
         0    -1.00000000E+00   # Set                 
         1    -5.78750000E+02   # M_1(MX)             
         2     4.43950000E+02   # M_2(MX)             
         3     2.14410000E+03   # M_3(MX)             
        11     4.18612000E+03   # At(MX)              
        12     1.78213000E+03   # Ab(MX)              
        13     3.74839000E+03   # Atau(MX)            
        23     3.33368000E+03   # mu(MX)              
        26     3.20841000E+03   # mA(pole)            
        31     1.26184000E+03   # meL(MX)             
        32     1.26184000E+03   # mmuL(MX)            
        33     1.88606000E+03   # mtauL(MX)           
        34     3.49534000E+03   # meR(MX)             
        35     3.49534000E+03   # mmuR(MX)            
        36     5.73080000E+02   # mtauR(MX)           
        41     5.37760000E+02   # mqL1(MX)            
        42     5.37760000E+02   # mqL2(MX)            
        43     1.90763000E+03   # mqL3(MX)            
        44     1.23525000E+03   # muR(MX)             
        45     1.23525000E+03   # mcR(MX)             
        46     2.51686000E+03   # mtR(MX)             
        47     1.12528000E+03   # mdR(MX)             
        48     1.12528000E+03   # msR(MX)             
        49     6.50000000E+02   # mbR(MX)             
#
BLOCK MASS  # Mass Spectrum
# PDG code           mass       particle
        24     8.03966515E+01   # W+
        25     1.25345231E+02   # h
        35     3.20837879E+03   # H
        36     3.20841006E+03   # A
        37     3.20959052E+03   # H+
         5     4.81876030E+00   # b-quark pole mass calculated from mb(mb)_Msbar
   1000001     7.07543385E+02   # ~d_L
   2000001     1.23610497E+03   # ~d_R
   1000002     7.03361004E+02   # ~u_L
   2000002     1.33527066E+03   # ~u_R
   1000003     7.07543385E+02   # ~s_L
   2000003     1.23610497E+03   # ~s_R
   1000004     7.03361004E+02   # ~c_L
   2000004     1.33527066E+03   # ~c_R
   1000005     7.97186814E+02   # ~b_1
   2000005     1.98738866E+03   # ~b_2
   1000006     1.96600596E+03   # ~t_1
   2000006     2.54786732E+03   # ~t_2
   1000011     1.26308909E+03   # ~e_L
   2000011     3.50070396E+03   # ~e_R
   1000012     1.26046567E+03   # ~nu_eL
   1000013     1.26308909E+03   # ~mu_L
   2000013     3.50070396E+03   # ~mu_R
   1000014     1.26046567E+03   # ~nu_muL
   1000015     5.91884323E+02   # ~tau_1
   2000015     1.88836179E+03   # ~tau_2
   1000016     1.88639239E+03   # ~nu_tauL
   1000021     2.18019701E+03   # ~g
   1000022     4.55873344E+02   # ~chi_10
   1000023    -5.73037626E+02   # ~chi_20
   1000025    -3.36004054E+03   # ~chi_30
   1000035     3.36082412E+03   # ~chi_40
   1000024     4.56038148E+02   # ~chi_1+
   1000037     3.36142240E+03   # ~chi_2+
#
BLOCK NMIX  # Neutralino Mixing Matrix
  1  1     3.76986553E-04   # N_11
  1  2     9.99705878E-01   # N_12
  1  3    -2.34234206E-02   # N_13
  1  4     6.27359531E-03   # N_14
  2  1     9.99914409E-01   # N_21
  2  2    -7.29732039E-05   # N_22
  2  3     1.30779088E-02   # N_23
  2  4     3.70889740E-04   # N_24
  3  1    -9.50736496E-03   # N_31
  3  2     1.21297331E-02   # N_32
  3  3     7.06930661E-01   # N_33
  3  4     7.07114927E-01   # N_34
  4  1    -8.98011551E-03   # N_41
  4  2     2.10005000E-02   # N_42
  4  3     7.06773904E-01   # N_43
  4  4    -7.07070707E-01   # N_44
#
BLOCK UMIX  # Chargino Mixing Matrix U
  1  1     9.99451125E-01   # U_11
  1  2    -3.31277688E-02   # U_12
  2  1     3.31277688E-02   # U_21
  2  2     9.99451125E-01   # U_22
#
BLOCK VMIX  # Chargino Mixing Matrix V
  1  1     9.99960639E-01   # V_11
  1  2    -8.87241722E-03   # V_12
  2  1     8.87241722E-03   # V_21
  2  2     9.99960639E-01   # V_22
#
BLOCK STOPMIX  # Stop Mixing Matrix
  1  1     9.81285471E-01   # cos(theta_t)
  1  2    -1.92558626E-01   # sin(theta_t)
  2  1     1.92558626E-01   # -sin(theta_t)
  2  2     9.81285471E-01   # cos(theta_t)
#
BLOCK SBOTMIX  # Sbottom Mixing Matrix
  1  1     1.31397172E-02   # cos(theta_b)
  1  2     9.99913670E-01   # sin(theta_b)
  2  1    -9.99913670E-01   # -sin(theta_b)
  2  2     1.31397172E-02   # cos(theta_b)
#
BLOCK STAUMIX  # Stau Mixing Matrix
  1  1     1.02232335E-02   # cos(theta_tau)
  1  2     9.99947741E-01   # sin(theta_tau)
  2  1    -9.99947741E-01   # -sin(theta_tau)
  2  2     1.02232335E-02   # cos(theta_tau)
#
BLOCK ALPHA  # Higgs mixing
          -1.51169961E-01   # Mixing angle in the neutral Higgs boson sector
#
BLOCK HMIX Q=  2.18892000E+03  # DRbar Higgs Parameters
         1     3.38131093E+03   # mu(Q)MSSM           
         2     6.58178774E+00   # tan                 
         3     2.43480547E+02   # higgs               
         4     1.02205522E+07   # mA^2(Q)MSSM         
#
BLOCK GAUGE Q=  2.18892000E+03  # The gauge couplings
     1     3.64054766E-01   # gprime(Q) DRbar
     2     6.40598372E-01   # g(Q) DRbar
     3     1.02997482E+00   # g3(Q) DRbar
#
BLOCK AU Q=  2.18892000E+03  # The trilinear couplings
  1  1     0.00000000E+00   # A_u(Q) DRbar
  2  2     0.00000000E+00   # A_c(Q) DRbar
  3  3     4.18612001E+03   # A_t(Q) DRbar
#
BLOCK AD Q=  2.18892000E+03  # The trilinear couplings
  1  1     0.00000000E+00   # A_d(Q) DRbar
  2  2     0.00000000E+00   # A_s(Q) DRbar
  3  3     1.78213000E+03   # A_b(Q) DRbar
#
BLOCK AE Q=  2.18892000E+03  # The trilinear couplings
  1  1     0.00000000E+00   # A_e(Q) DRbar
  2  2     0.00000000E+00   # A_mu(Q) DRbar
  3  3     3.74839000E+03   # A_tau(Q) DRbar
#
BLOCK Yu Q=  2.18892000E+03  # The Yukawa couplings
  1  1     0.00000000E+00   # y_u(Q) DRbar
  2  2     0.00000000E+00   # y_c(Q) DRbar
  3  3     8.53026158E-01   # y_t(Q) DRbar
#
BLOCK Yd Q=  2.18892000E+03  # The Yukawa couplings
  1  1     0.00000000E+00   # y_d(Q) DRbar
  2  2     0.00000000E+00   # y_s(Q) DRbar
  3  3     7.91584390E-02   # y_b(Q) DRbar
#
BLOCK Ye Q=  2.18892000E+03  # The Yukawa couplings
  1  1     0.00000000E+00   # y_e(Q) DRbar
  2  2     0.00000000E+00   # y_mu(Q) DRbar
  3  3     6.85765184E-02   # y_tau(Q) DRbar
#
BLOCK MSOFT Q=  2.18892000E+03  # The soft SUSY breaking masses at the scale Q
         1    -5.78750000E+02   # M_1(Q)              
         2     4.43950000E+02   # M_2(Q)              
         3     2.14410000E+03   # M_3(Q)              
        21    -1.36598991E+06   # mH1^2(Q)            
        22    -1.11115546E+07   # mH2^2(Q)            
        31     1.26184000E+03   # meL(Q)              
        32     1.26184000E+03   # mmuL(Q)             
        33     1.88606000E+03   # mtauL(Q)            
        34     3.49534000E+03   # meR(Q)              
        35     3.49534000E+03   # mmuR(Q)             
        36     5.73080000E+02   # mtauR(Q)            
        41     5.37759983E+02   # mqL1(Q)             
        42     5.37759983E+02   # mqL2(Q)             
        43     1.90762999E+03   # mqL3(Q)             
        44     1.23524999E+03   # muR(Q)              
        45     1.23524999E+03   # mcR(Q)              
        46     2.51686000E+03   # mtR(Q)              
        47     1.12527999E+03   # mdR(Q)              
        48     1.12527999E+03   # msR(Q)              
        49     6.49999986E+02   # mbR(Q)              
#
Block HiggsBoundsInputHiggsCouplingsFermions
# ScalarNormEffCoupSq PseudoSNormEffCoupSq NP   IP1 IP2 IP2
    1.00512326E+00    0.00000000E+00        3  25   5   5  # h0-b-b eff. coupling^2, normalised to SM
    4.33148066E+01    0.00000000E+00        3  35   5   5  # H0-b-b eff. coupling^2, normalised to SM
    0.00000000E+00    4.33199299E+01        3  36   5   5  # A0-b-b eff. coupling^2, normalised to SM
#
    9.99881734E-01    0.00000000E+00        3  25   6   6  # h0-t-t eff. coupling^2, normalised to SM
    2.32023290E-02    0.00000000E+00        3  35   6   6  # H0-t-t eff. coupling^2, normalised to SM
    0.00000000E+00    2.30840632E-02        3  36   6   6  # A0-t-t eff. coupling^2, normalised to SM
#
    1.00512326E+00    0.00000000E+00        3  25  15  15  # h0-tau-tau eff. coupling^2, normalised to SM
    4.33148066E+01    0.00000000E+00        3  35  15  15  # H0-tau-tau eff. coupling^2, normalised to SM
    0.00000000E+00    4.33199299E+01        3  36  15  15  # A0-tau-tau eff. coupling^2, normalised to SM
#
Block HiggsBoundsInputHiggsCouplingsBosons
    9.99999849E-01        3  25  24  24  # h0-W-W eff. coupling^2, normalised to SM
    1.51098824E-07        3  35  24  24  # H0-W-W eff. coupling^2, normalised to SM
    0.00000000E+00        3  36  24  24  # A0-W-W eff. coupling^2, normalised to SM
#
    9.99999849E-01        3  25  23  23  # h0-Z-Z eff. coupling^2, normalised to SM
    1.51098824E-07        3  35  23  23  # H0-Z-Z eff. coupling^2, normalised to SM
    0.00000000E+00        3  36  23  23  # A0-Z-Z eff. coupling^2, normalised to SM
#
    8.87484210E-01        3  25  21  21  # h0-g-g eff. coupling^2, normalised to SM
    2.25759533E-12        3  35  21  21  # H0-g-g eff. coupling^2, normalised to SM
    4.41082285E-12        3  36  21  21  # A0-g-g eff. coupling^2, normalised to SM
#
    0.00000000E+00        3  25  25  23  # h0-h0-Z eff. coupling^2, normalised to SM
    0.00000000E+00        3  35  25  23  # H0-h0-Z eff. coupling^2, normalised to SM
    1.51098824E-07        3  36  25  23  # A0-h0-Z eff. coupling^2, normalised to SM
    0.00000000E+00        3  35  35  23  # H0-H0-Z eff. coupling^2, normalised to SM
    9.99999849E-01        3  36  35  23  # A0-H0-Z eff. coupling^2, normalised to SM
    0.00000000E+00        3  36  36  23  # A0-A0-Z eff. coupling^2, normalised to SM
#
    0.00000000E+00        4  25  21  21  23  # h0-g-g-Z eff. coupling^2, normalised to SM
    0.00000000E+00        4  35  21  21  23  # H0-g-g-Z eff. coupling^2, normalised to SM
    0.00000000E+00        4  36  21  21  23  # A0-g-g-Z eff. coupling^2, normalised to SM
#
#
#
#                             =================
#                             |The decay table|
#                             =================
#
# - The QCD corrections to the decays gluino -> squark  + quark
#                                     squark -> gaugino + quark_prime
#                                     squark -> squark_prime + Higgs
#                                     squark -> gluino  + quark
#   are included.
#
# - The multi-body decays for the inos, stops and sbottoms are included.
#
# - The loop induced decays for the gluino, neutralinos and stops
#   are included.
#
# - The SUSY decays of the top quark are included.
#
#
#         PDG            Width
DECAY         6     1.44494642E+00   # top decays
#          BR         NDA      ID1       ID2
     1.00000000E+00    2           5        24   # BR(t ->  b    W+)
#
#         PDG            Width
DECAY   1000021     2.65379462E+02   # gluino decays
#          BR         NDA      ID1       ID2
     7.00278139E-02    2     1000001        -1   # BR(~g -> ~d_L  db)
     7.00278139E-02    2    -1000001         1   # BR(~g -> ~d_L* d )
     4.02804421E-02    2     2000001        -1   # BR(~g -> ~d_R  db)
     4.02804421E-02    2    -2000001         1   # BR(~g -> ~d_R* d )
     7.02222890E-02    2     1000002        -2   # BR(~g -> ~u_L  ub)
     7.02222890E-02    2    -1000002         2   # BR(~g -> ~u_L* u )
     3.41630767E-02    2     2000002        -2   # BR(~g -> ~u_R  ub)
     3.41630767E-02    2    -2000002         2   # BR(~g -> ~u_R* u )
     7.00278139E-02    2     1000003        -3   # BR(~g -> ~s_L  sb)
     7.00278139E-02    2    -1000003         3   # BR(~g -> ~s_L* s )
     4.02804421E-02    2     2000003        -3   # BR(~g -> ~s_R  sb)
     4.02804421E-02    2    -2000003         3   # BR(~g -> ~s_R* s )
     7.02222793E-02    2     1000004        -4   # BR(~g -> ~c_L  cb)
     7.02222793E-02    2    -1000004         4   # BR(~g -> ~c_L* c )
     3.41630417E-02    2     2000004        -4   # BR(~g -> ~c_R  cb)
     3.41630417E-02    2    -2000004         4   # BR(~g -> ~c_R* c )
     6.55607042E-02    2     1000005        -5   # BR(~g -> ~b_1  bb)
     6.55607042E-02    2    -1000005         5   # BR(~g -> ~b_1* b )
     2.58184222E-03    2     2000005        -5   # BR(~g -> ~b_2  bb)
     2.58184222E-03    2    -2000005         5   # BR(~g -> ~b_2* b )
     2.47025491E-03    2     1000006        -6   # BR(~g -> ~t_1  tb)
     2.47025491E-03    2    -1000006         6   # BR(~g -> ~t_1* t )
#
#         PDG            Width
DECAY   1000006     2.13815114E+01   # stop1 decays
#          BR         NDA      ID1       ID2
     3.16111727E-01    2     1000022         6   # BR(~t_1 -> ~chi_10 t )
     1.82117198E-02    2     1000023         6   # BR(~t_1 -> ~chi_20 t )
     6.44089166E-01    2     1000024         5   # BR(~t_1 -> ~chi_1+ b )
     2.15873869E-02    2     1000005        24   # BR(~t_1 -> ~b_1    W+)
#
#         PDG            Width
DECAY   2000006     6.41752957E+01   # stop2 decays
#          BR         NDA      ID1       ID2
     6.26145733E-03    2     1000022         6   # BR(~t_2 -> ~chi_10 t )
     7.98374066E-02    2     1000023         6   # BR(~t_2 -> ~chi_20 t )
     0.00000000E+00    2     1000025         6   # BR(~t_2 -> ~chi_30 t )
     1.26562415E-02    2     1000024         5   # BR(~t_2 -> ~chi_1+ b )
     1.61992586E-01    2     1000021         6   # BR(~t_2 -> ~g      t )
     1.96972928E-01    2     1000006        25   # BR(~t_2 -> ~t_1    h )
     1.90537273E-01    2     1000006        23   # BR(~t_2 -> ~t_1    Z )
     7.61857948E-04    2     1000005        24   # BR(~t_2 -> ~b_1    W+)
     3.50980250E-01    2     2000005        24   # BR(~t_2 -> ~b_2    W+)
#
#         PDG            Width
DECAY   1000005     1.10239312E-01   # sbottom1 decays
#          BR         NDA      ID1       ID2
     3.96787078E-03    2     1000022         5   # BR(~b_1 -> ~chi_10 b )
     9.89786286E-01    2     1000023         5   # BR(~b_1 -> ~chi_20 b )
     6.24584358E-03    2    -1000024         6   # BR(~b_1 -> ~chi_1- t )
#
#         PDG            Width
DECAY   2000005     2.23057299E+01   # sbottom2 decays
#          BR         NDA      ID1       ID2
     3.26097790E-01    2     1000022         5   # BR(~b_2 -> ~chi_10 b )
     1.09742683E-02    2     1000023         5   # BR(~b_2 -> ~chi_20 b )
     6.40360215E-01    2    -1000024         6   # BR(~b_2 -> ~chi_1- t )
     1.10343358E-02    2     1000005        25   # BR(~b_2 -> ~b_1    h )
     1.15333914E-02    2     1000005        23   # BR(~b_2 -> ~b_1    Z )
#
#         PDG            Width
DECAY   1000002     3.03309163E+00   # sup_L decays
#          BR         NDA      ID1       ID2
     3.32129795E-01    2     1000022         2   # BR(~u_L -> ~chi_10 u)
     4.05668320E-03    2     1000023         2   # BR(~u_L -> ~chi_20 u)
     6.63813522E-01    2     1000024         1   # BR(~u_L -> ~chi_1+ d)
#
#         PDG            Width
DECAY   2000002     2.09618383E+00   # sup_R decays
#          BR         NDA      ID1       ID2
     1.66496043E-07    2     1000022         2   # BR(~u_R -> ~chi_10 u)
     9.99999834E-01    2     1000023         2   # BR(~u_R -> ~chi_20 u)
#
#         PDG            Width
DECAY   1000001     3.10018257E+00   # sdown_L decays
#          BR         NDA      ID1       ID2
     3.32245412E-01    2     1000022         1   # BR(~d_L -> ~chi_10 d)
     4.18311047E-03    2     1000023         1   # BR(~d_L -> ~chi_20 d)
     6.63571477E-01    2    -1000024         2   # BR(~d_L -> ~chi_1- u)
#
#         PDG            Width
DECAY   2000001     4.51350005E-01   # sdown_R decays
#          BR         NDA      ID1       ID2
     1.71927300E-07    2     1000022         1   # BR(~d_R -> ~chi_10 d)
     9.99999828E-01    2     1000023         1   # BR(~d_R -> ~chi_20 d)
#
#         PDG            Width
DECAY   1000004     2.90572703E+00   # scharm_L decays
#          BR         NDA      ID1       ID2
     3.32142837E-01    2     1000022         4   # BR(~c_L -> ~chi_10 c)
     4.00469950E-03    2     1000023         4   # BR(~c_L -> ~chi_20 c)
     6.63852464E-01    2     1000024         3   # BR(~c_L -> ~chi_1+ s)
#
#         PDG            Width
DECAY   2000004     2.08257364E+00   # scharm_R decays
#          BR         NDA      ID1       ID2
     1.66680534E-07    2     1000022         4   # BR(~c_R -> ~chi_10 c)
     9.99999833E-01    2     1000023         4   # BR(~c_R -> ~chi_20 c)
#
#         PDG            Width
DECAY   1000003     2.97124568E+00   # sstrange_L decays
#          BR         NDA      ID1       ID2
     3.32269220E-01    2     1000022         3   # BR(~s_L -> ~chi_10 s)
     4.13189598E-03    2     1000023         3   # BR(~s_L -> ~chi_20 s)
     6.63598884E-01    2    -1000024         4   # BR(~s_L -> ~chi_1- c)
#
#         PDG            Width
DECAY   2000003     4.46345973E-01   # sstrange_R decays
#          BR         NDA      ID1       ID2
     1.72147927E-07    2     1000022         3   # BR(~s_R -> ~chi_10 s)
     9.99999828E-01    2     1000023         3   # BR(~s_R -> ~chi_20 s)
#
#         PDG            Width
DECAY   1000011     1.27394121E+01   # selectron_L decays
#          BR         NDA      ID1       ID2
     3.06099844E-01    2     1000022        11   # BR(~e_L -> ~chi_10 e-)
     8.24070981E-02    2     1000023        11   # BR(~e_L -> ~chi_20 e-)
     6.11493057E-01    2    -1000024        12   # BR(~e_L -> ~chi_1- nu_e)
#
#         PDG            Width
DECAY   2000011     1.74817029E+01   # selectron_R decays
#          BR         NDA      ID1       ID2
     1.45031051E-07    2     1000022        11   # BR(~e_R -> ~chi_10 e-)
     9.99998741E-01    2     1000023        11   # BR(~e_R -> ~chi_20 e-)
     5.91927964E-07    2     1000025        11   # BR(~e_R -> ~chi_30 e-)
     5.22347450E-07    2     1000035        11   # BR(~e_R -> ~chi_40 e-)
#
#         PDG            Width
DECAY   1000013     1.27394120E+01   # smuon_L decays
#          BR         NDA      ID1       ID2
     3.06099841E-01    2     1000022        13   # BR(~mu_L -> ~chi_10 mu-)
     8.24070969E-02    2     1000023        13   # BR(~mu_L -> ~chi_20 mu-)
     6.11493062E-01    2    -1000024        14   # BR(~mu_L -> ~chi_1- nu_mu)
#
#         PDG            Width
DECAY   2000013     1.74817029E+01   # smuon_R decays
#          BR         NDA      ID1       ID2
     1.45031051E-07    2     1000022        13   # BR(~mu_R -> ~chi_10 mu-)
     9.99998741E-01    2     1000023        13   # BR(~mu_R -> ~chi_20 mu-)
     5.91927791E-07    2     1000025        13   # BR(~mu_R -> ~chi_30 mu-)
     5.22347296E-07    2     1000035        13   # BR(~mu_R -> ~chi_40 mu-)
#
#         PDG            Width
DECAY   1000015     1.24190241E-02   # stau_1 decays
#          BR         NDA      ID1       ID2
     6.11074369E-03    2     1000022        15   # BR(~tau_1 -> ~chi_10  tau-)
     9.81718069E-01    2     1000023        15   # BR(~tau_1 -> ~chi_20  tau-)
     1.21711871E-02    2    -1000024        16   # BR(~tau_1 -> ~chi_1-  nu_tau)
#
#         PDG            Width
DECAY   2000015     2.28761603E+01   # stau_2 decays
#          BR         NDA      ID1       ID2
     2.98727025E-01    2     1000022        15   # BR(~tau_2 -> ~chi_10  tau-)
     8.96928033E-02    2     1000023        15   # BR(~tau_2 -> ~chi_20  tau-)
     5.96835993E-01    2    -1000024        16   # BR(~tau_2 -> ~chi_1-  nu_tau)
     7.48846787E-03    2     1000015        25   # BR(~tau_2 -> ~tau_1   h)
     7.25571120E-03    2     1000015        23   # BR(~tau_2 -> ~tau_1   Z)
#
#         PDG            Width
DECAY   1000012     1.27012520E+01   # snu_eL decays
#          BR         NDA      ID1       ID2
     3.05737324E-01    2     1000022        12   # BR(~nu_eL -> ~chi_10 nu_e)
     8.23472424E-02    2     1000023        12   # BR(~nu_eL -> ~chi_20 nu_e)
     6.11915434E-01    2     1000024        11   # BR(~nu_eL -> ~chi_1+ e-)
#
#         PDG            Width
DECAY   1000014     1.27012519E+01   # snu_muL decays
#          BR         NDA      ID1       ID2
     3.05737328E-01    2     1000022        14   # BR(~nu_muL -> ~chi_10 nu_mu)
     8.23472433E-02    2     1000023        14   # BR(~nu_muL -> ~chi_20 nu_mu)
     6.11915429E-01    2     1000024        13   # BR(~nu_muL -> ~chi_1+ mu-)
#
#         PDG            Width
DECAY   1000016     2.28437066E+01   # snu_tauL decays
#          BR         NDA      ID1       ID2
     2.98556875E-01    2     1000022        16   # BR(~nu_tauL -> ~chi_10 nu_tau)
     8.97100593E-02    2     1000023        16   # BR(~nu_tauL -> ~chi_20 nu_tau)
     5.97624920E-01    2     1000024        15   # BR(~nu_tauL -> ~chi_1+ tau-)
     1.41081459E-02    2    -1000015       -24   # BR(~nu_tauL -> ~tau_1+ W-)
#
#         PDG            Width
DECAY   1000024     3.64330810E-15   # chargino1+ decays
#           BR         NDA      ID1       ID2       ID3
     1.95098890E-02    3     1000022       -11        12   # BR(~chi_1+ -> ~chi_10 e+   nu_e)
     2.22931150E-03    3     1000022       -13        14   # BR(~chi_1+ -> ~chi_10 mu+  nu_mu)
     9.78260800E-01    2     1000022       211             # BR(~chi_1+ -> ~chi_10 pi+)
#
#         PDG            Width
DECAY   1000037     6.83963872E+01   # chargino2+ decays
#          BR         NDA      ID1       ID2
     4.15767041E-05    2     1000002        -1   # BR(~chi_2+ -> ~u_L     db)
     5.79008503E-04    2    -1000001         2   # BR(~chi_2+ -> ~d_L*    u )
     4.15767040E-05    2     1000004        -3   # BR(~chi_2+ -> ~c_L     sb)
     5.79008489E-04    2    -1000003         4   # BR(~chi_2+ -> ~s_L*     c )
     2.20629485E-02    2     1000006        -5   # BR(~chi_2+ -> ~t_1     bb)
     1.85632250E-01    2     2000006        -5   # BR(~chi_2+ -> ~t_2     bb)
     8.52969099E-03    2    -1000005         6   # BR(~chi_2+ -> ~b_1*    t )
     4.45978156E-01    2    -2000005         6   # BR(~chi_2+ -> ~b_2*    t )
     1.16634318E-05    2     1000012       -11   # BR(~chi_2+ -> ~nu_eL   e+  )
     1.16634318E-05    2     1000014       -13   # BR(~chi_2+ -> ~nu_muL mu+ )
     1.08491605E-03    2     1000016       -15   # BR(~chi_2+ -> ~nu_tau1 tau+)
     1.62380707E-04    2    -1000011        12   # BR(~chi_2+ -> ~e_L+    nu_e)
     1.62380707E-04    2    -1000013        14   # BR(~chi_2+ -> ~mu_L+   nu_mu)
     2.14243707E-03    2    -1000015        16   # BR(~chi_2+ -> ~tau_1+  nu_tau)
     1.10039725E-04    2    -2000015        16   # BR(~chi_2+ -> ~tau_2+  nu_tau)
     1.00163358E-01    2     1000024        23   # BR(~chi_2+ -> ~chi_1+  Z )
     9.75074262E-02    2     1000022        24   # BR(~chi_2+ -> ~chi_10  W+)
     2.74274305E-02    2     1000023        24   # BR(~chi_2+ -> ~chi_20  W+)
     1.07772088E-01    2     1000024        25   # BR(~chi_2+ -> ~chi_1+  h )
#
#         PDG            Width
DECAY   1000022     0.00000000E+00   # neutralino1 decays
#
#         PDG            Width
DECAY   1000023     1.94785288E-06   # neutralino2 decays
#          BR         NDA      ID1       ID2
     3.70362073E-02    2     1000022        23   # BR(~chi_20 -> ~chi_10   Z )
     4.81481896E-01    2     1000024       -24   # BR(~chi_20 -> ~chi_1+   W-)
     4.81481896E-01    2    -1000024        24   # BR(~chi_20 -> ~chi_1-   W+)
#
#         PDG            Width
DECAY   1000025     6.80900588E+01   # neutralino3 decays
#          BR         NDA      ID1       ID2
     7.53736645E-02    2     1000022        23   # BR(~chi_30 -> ~chi_10   Z )
     1.33719047E-02    2     1000023        23   # BR(~chi_30 -> ~chi_20   Z )
     9.78389450E-02    2     1000024       -24   # BR(~chi_30 -> ~chi_1+   W-)
     9.78389450E-02    2    -1000024        24   # BR(~chi_30 -> ~chi_1-   W+)
     2.58378752E-02    2     1000022        25   # BR(~chi_30 -> ~chi_10   h )
     1.51613875E-02    2     1000023        25   # BR(~chi_30 -> ~chi_20   h )
     2.82853796E-05    2     1000002        -2   # BR(~chi_30 -> ~u_L      ub)
     2.82853796E-05    2    -1000002         2   # BR(~chi_30 -> ~u_L*     u )
     1.07061943E-05    2     2000002        -2   # BR(~chi_30 -> ~u_R      ub)
     1.07061943E-05    2    -2000002         2   # BR(~chi_30 -> ~u_R*     u )
     5.13988692E-05    2     1000001        -1   # BR(~chi_30 -> ~d_L      db)
     5.13988692E-05    2    -1000001         1   # BR(~chi_30 -> ~d_L*     d )
     2.82049872E-06    2     2000001        -1   # BR(~chi_30 -> ~d_R      db)
     2.82049872E-06    2    -2000001         1   # BR(~chi_30 -> ~d_R*     d )
     2.82853790E-05    2     1000004        -4   # BR(~chi_30 -> ~c_L      cb)
     2.82853790E-05    2    -1000004         4   # BR(~chi_30 -> ~c_L*     c )
     1.07061932E-05    2     2000004        -4   # BR(~chi_30 -> ~c_R      cb)
     1.07061932E-05    2    -2000004         4   # BR(~chi_30 -> ~c_R*     c )
     5.13988692E-05    2     1000003        -3   # BR(~chi_30 -> ~s _L      sb)
     5.13988692E-05    2    -1000003         3   # BR(~chi_30 -> ~s _L*     s )
     2.82049872E-06    2     2000003        -3   # BR(~chi_30 -> ~s _R      sb)
     2.82049872E-06    2    -2000003         3   # BR(~chi_30 -> ~s _R*     s )
     2.42660363E-01    2     1000006        -6   # BR(~chi_30 -> ~t_1      tb)
     2.42660363E-01    2    -1000006         6   # BR(~chi_30 -> ~t_1*     t )
     8.66612322E-02    2     2000006        -6   # BR(~chi_30 -> ~t_2      tb)
     8.66612322E-02    2    -2000006         6   # BR(~chi_30 -> ~t_2*     t )
     4.09541883E-03    2     1000005        -5   # BR(~chi_30 -> ~b_1      bb)
     4.09541883E-03    2    -1000005         5   # BR(~chi_30 -> ~b_1*     b )
     1.98344054E-03    2     2000005        -5   # BR(~chi_30 -> ~b_2      bb)
     1.98344054E-03    2    -2000005         5   # BR(~chi_30 -> ~b_2*     b )
     3.36025363E-06    2     1000011       -11   # BR(~chi_30 -> ~e_L-     e+)
     3.36025363E-06    2    -1000011        11   # BR(~chi_30 -> ~e_L+     e-)
     3.36025363E-06    2     1000013       -13   # BR(~chi_30 -> ~mu_L-    mu+)
     3.36025363E-06    2    -1000013        13   # BR(~chi_30 -> ~mu_L+    mu-)
     1.09077162E-03    2     1000015       -15   # BR(~chi_30 -> ~tau_1-   tau+)
     1.09077162E-03    2    -1000015        15   # BR(~chi_30 -> ~tau_1+   tau-)
     5.44031449E-04    2     2000015       -15   # BR(~chi_30 -> ~tau_2-   tau+)
     5.44031449E-04    2    -2000015        15   # BR(~chi_30 -> ~tau_2+   tau-)
     2.28596406E-05    2     1000012       -12   # BR(~chi_30 -> ~nu_eL    nu_eb)
     2.28596406E-05    2    -1000012        12   # BR(~chi_30 -> ~nu_eL*   nu_e )
     2.28596406E-05    2     1000014       -14   # BR(~chi_30 -> ~nu_muL   nu_mub)
     2.28596406E-05    2    -1000014        14   # BR(~chi_30 -> ~nu_muL*  nu_mu )
     1.45192240E-05    2     1000016       -16   # BR(~chi_30 -> ~nu_tau1  nu_taub)
     1.45192240E-05    2    -1000016        16   # BR(~chi_30 -> ~nu_tau1* nu_tau )
#
#         PDG            Width
DECAY   1000035     6.74801403E+01   # neutralino4 decays
#          BR         NDA      ID1       ID2
     2.53923161E-02    2     1000022        23   # BR(~chi_40 -> ~chi_10   Z )
     1.50949976E-02    2     1000023        23   # BR(~chi_40 -> ~chi_20   Z )
     9.87633570E-02    2     1000024       -24   # BR(~chi_40 -> ~chi_1+   W-)
     9.87633570E-02    2    -1000024        24   # BR(~chi_40 -> ~chi_1-   W+)
     8.31337179E-02    2     1000022        25   # BR(~chi_40 -> ~chi_10   h )
     1.41767588E-02    2     1000023        25   # BR(~chi_40 -> ~chi_20   h )
     9.96748441E-05    2     1000002        -2   # BR(~chi_40 -> ~u_L      ub)
     9.96748441E-05    2    -1000002         2   # BR(~chi_40 -> ~u_L*     u )
     9.64195551E-06    2     2000002        -2   # BR(~chi_40 -> ~u_R      ub)
     9.64195551E-06    2    -2000002         2   # BR(~chi_40 -> ~u_R*     u )
     1.37768190E-04    2     1000001        -1   # BR(~chi_40 -> ~d_L      db)
     1.37768190E-04    2    -1000001         1   # BR(~chi_40 -> ~d_L*     d )
     2.54005741E-06    2     2000001        -1   # BR(~chi_40 -> ~d_R      db)
     2.54005741E-06    2    -2000001         1   # BR(~chi_40 -> ~d_R*     d )
     9.96748419E-05    2     1000004        -4   # BR(~chi_40 -> ~c_L      cb)
     9.96748419E-05    2    -1000004         4   # BR(~chi_40 -> ~c_L*     c )
     9.64195450E-06    2     2000004        -4   # BR(~chi_40 -> ~c_R      cb)
     9.64195450E-06    2    -2000004         4   # BR(~chi_40 -> ~c_R*     c )
     1.37768190E-04    2     1000003        -3   # BR(~chi_40 -> ~s _L      sb)
     1.37768190E-04    2    -1000003         3   # BR(~chi_40 -> ~s _L*     s )
     2.54005741E-06    2     2000003        -3   # BR(~chi_40 -> ~s _R      sb)
     2.54005741E-06    2    -2000003         3   # BR(~chi_40 -> ~s _R*     s )
     2.19962546E-01    2     1000006        -6   # BR(~chi_40 -> ~t_1      tb)
     2.19962546E-01    2    -1000006         6   # BR(~chi_40 -> ~t_1*     t )
     1.03882302E-01    2     2000006        -6   # BR(~chi_40 -> ~t_2      tb)
     1.03882302E-01    2    -2000006         6   # BR(~chi_40 -> ~t_2*     t )
     4.12310918E-03    2     1000005        -5   # BR(~chi_40 -> ~b_1      bb)
     4.12310918E-03    2    -1000005         5   # BR(~chi_40 -> ~b_1*     b )
     2.04137763E-03    2     2000005        -5   # BR(~chi_40 -> ~b_2      bb)
     2.04137763E-03    2    -2000005         5   # BR(~chi_40 -> ~b_2*     b )
     1.89444868E-05    2     1000011       -11   # BR(~chi_40 -> ~e_L-     e+)
     1.89444868E-05    2    -1000011        11   # BR(~chi_40 -> ~e_L+     e-)
     1.89444868E-05    2     1000013       -13   # BR(~chi_40 -> ~mu_L-    mu+)
     1.89444868E-05    2    -1000013        13   # BR(~chi_40 -> ~mu_L+    mu-)
     1.09702760E-03    2     1000015       -15   # BR(~chi_40 -> ~tau_1-   tau+)
     1.09702760E-03    2    -1000015        15   # BR(~chi_40 -> ~tau_1+   tau-)
     5.59446714E-04    2     2000015       -15   # BR(~chi_40 -> ~tau_2-   tau+)
     5.59446714E-04    2    -2000015        15   # BR(~chi_40 -> ~tau_2+   tau-)
     5.11509579E-05    2     1000012       -12   # BR(~chi_40 -> ~nu_eL    nu_eb)
     5.11509579E-05    2    -1000012        12   # BR(~chi_40 -> ~nu_eL*   nu_e )
     5.11509579E-05    2     1000014       -14   # BR(~chi_40 -> ~nu_muL   nu_mub)
     5.11509579E-05    2    -1000014        14   # BR(~chi_40 -> ~nu_muL*  nu_mu )
     3.24973415E-05    2     1000016       -16   # BR(~chi_40 -> ~nu_tau1  nu_taub)
     3.24973415E-05    2    -1000016        16   # BR(~chi_40 -> ~nu_tau1* nu_tau )
#
#         PDG            Width
DECAY        25     4.45514316E-03   # h decays
#          BR         NDA      ID1       ID2
     6.25543897E-01    2           5        -5   # BR(h -> b       bb     )
     5.85352645E-02    2         -15        15   # BR(h -> tau+    tau-   )
     2.07192513E-04    2         -13        13   # BR(h -> mu+     mu-    )
     2.25824003E-04    2           3        -3   # BR(h -> s       sb     )
     1.95081594E-02    2           4        -4   # BR(h -> c       cb     )
     7.21535636E-02    2          21        21   # BR(h -> g       g      )
     2.14287520E-03    2          22        22   # BR(h -> gam     gam    )
     1.44619981E-03    2          22        23   # BR(h -> Z       gam    )
     1.95655193E-01    2          24       -24   # BR(h -> W+      W-     )
     2.45818314E-02    2          23        23   # BR(h -> Z       Z      )
#
#         PDG            Width
DECAY        35     5.16780370E+00   # H decays
#          BR         NDA      ID1       ID2
     2.37989029E-01    2           5        -5   # BR(H -> b       bb     )
     5.50531818E-02    2         -15        15   # BR(H -> tau+    tau-   )
     1.94860024E-04    2         -13        13   # BR(H -> mu+     mu-    )
     7.93604215E-05    2           3        -3   # BR(H -> s       sb     )
     5.85909730E-06    2           4        -4   # BR(H -> c       cb     )
     5.76601871E-01    2           6        -6   # BR(H -> t       tb     )
     3.34999653E-04    2          21        21   # BR(H -> g       g      )
     1.84623094E-06    2          22        22   # BR(H -> gam     gam    )
     4.17136669E-07    2          23        22   # BR(H -> Z       gam    )
     3.10449660E-04    2          24       -24   # BR(H -> W+      W-     )
     1.54906087E-04    2          23        23   # BR(H -> Z       Z      )
     1.18633994E-03    2          25        25   # BR(H -> h       h      )
     4.58069156E-03    2     1000024  -1000024   # BR(H -> ~chi_1+ ~chi_1-)
     2.28808331E-03    2     1000022   1000022   # BR(H -> ~chi_10 ~chi_10)
     2.07317649E-04    2     1000023   1000023   # BR(H -> ~chi_20 ~chi_20)
     1.53947901E-03    2     1000022   1000023   # BR(H -> ~chi_10 ~chi_20)
     1.61313994E-04    2     1000002  -1000002   # BR(H -> ~u_L    ~u_L*  )
     1.77373565E-05    2     2000002  -2000002   # BR(H -> ~u_R    ~u_R*  )
     1.61313994E-04    2     1000004  -1000004   # BR(H -> ~c_L    ~c_L*  )
     1.77373565E-05    2     2000004  -2000004   # BR(H -> ~c_R    ~c_R*  )
     2.36285941E-04    2     1000001  -1000001   # BR(H -> ~d_L    ~d_L*  )
     5.09964551E-06    2     2000001  -2000001   # BR(H -> ~d_R    ~d_R*  )
     2.36285941E-04    2     1000003  -1000003   # BR(H -> ~s_L    ~s_L*  )
     5.09964551E-06    2     2000003  -2000003   # BR(H -> ~s_R    ~s_R*  )
     1.25654542E-05    2     1000005  -1000005   # BR(H -> ~b_1    ~b_1*  )
     3.06569519E-02    2     1000005  -2000005   # BR(H -> ~b_1    ~b_2*  )
     3.06569519E-02    2     2000005  -1000005   # BR(H -> ~b_2    ~b_1*  )
     2.29529521E-05    2     1000011  -1000011   # BR(H -> ~e_L-   ~e_L+  )
     2.29529521E-05    2     1000013  -1000013   # BR(H -> ~mu_L-  ~mu_L+ )
     2.93753844E-08    2     1000015  -1000015   # BR(H -> ~tau_1- ~tau_1+)
     2.85541539E-02    2     1000015  -2000015   # BR(H -> ~tau_1- ~tau_2+)
     2.85541539E-02    2     2000015  -1000015   # BR(H -> ~tau_2- ~tau_1+)
     7.48610356E-05    2     1000012  -1000012   # BR(H -> ~nu_eL  ~nu_eL*   )
     7.48610356E-05    2     1000014  -1000014   # BR(H -> ~nu_muL ~nu_muL*  )
#
#         PDG            Width
DECAY        36     5.17482389E+00   # A decays
#          BR         NDA      ID1       ID2
     2.37888879E-01    2           5        -5   # BR(A -> b       bb     )
     5.49856426E-02    2         -15        15   # BR(A -> tau+    tau-   )
     1.94620718E-04    2         -13        13   # BR(A -> mu+     mu-    )
     7.93936402E-05    2           3        -3   # BR(A -> s       sb     )
     5.87533611E-06    2           4        -4   # BR(A -> c       cb     )
     5.77223502E-01    2           6        -6   # BR(A -> t       tb     )
     4.67637687E-04    2          21        21   # BR(A -> g       g      )
     1.73568049E-06    2          22        22   # BR(A -> gam     gam    )
     6.08880207E-07    2          23        22   # BR(A -> Z       gam    )
     3.14247655E-04    2          23        25   # BR(A -> Z       h      )
     5.85844765E-03    2     1000024  -1000024   # BR(A -> ~chi_1+ ~chi_1-)
     2.92640584E-03    2     1000022   1000022   # BR(A -> ~chi_10 ~chi_10)
     2.33288236E-04    2     1000023   1000023   # BR(A -> ~chi_20 ~chi_20)
     1.48292836E-03    2     1000022   1000023   # BR(A -> ~chi_10 ~chi_20)
     3.06523618E-02    2     1000005  -2000005   # BR(A -> ~b_1    ~b_2*  )
     3.06523618E-02    2    -1000005   2000005   # BR(A -> ~b_1*   ~b_2   )
     2.85160314E-02    2     1000015  -2000015   # BR(A -> ~tau_1- ~tau_2+)
     2.85160314E-02    2    -1000015   2000015   # BR(A -> ~tau_1+ ~tau_2-)
#
#         PDG            Width
DECAY        37     5.88877675E+00   # H+ decays
#          BR         NDA      ID1       ID2
     2.97115323E-04    2           4        -5   # BR(H+ -> c       bb     )
     4.83369839E-02    2         -15        16   # BR(H+ -> tau+    nu_tau )
     1.71087907E-04    2         -13        14   # BR(H+ -> mu+     nu_mu  )
     2.97106694E-06    2           2        -5   # BR(H+ -> u       bb     )
     3.48746868E-06    2           2        -3   # BR(H+ -> u       sb     )
     7.35959886E-05    2           4        -3   # BR(H+ -> c       sb     )
     6.75288090E-01    2           6        -5   # BR(H+ -> t       bb     )
     2.76604649E-04    2          24        25   # BR(H+ -> W+      h      )
     5.12151700E-13    2          24        36   # BR(H+ -> W+      A      )
     6.13060991E-10    2     1000024   1000022   # BR(H+ -> ~chi_1+ ~chi_10)
     2.65486234E-03    2     1000024   1000023   # BR(H+ -> ~chi_1+ ~chi_20)
     7.90790653E-05    2    -1000011   1000012   # BR(H+ -> ~e_L+   ~nu_eL )
     7.90790653E-05    2    -1000013   1000014   # BR(H+ -> ~mu_L+  ~nu_muL)
     5.01595045E-02    2    -1000015   1000016   # BR(H+ -> ~tau_1+ ~nu_tauL)
     3.44853509E-04    2     1000002  -1000001   # BR(H+ -> ~u_L    ~d_L*  )
     3.44853509E-04    2     1000004  -1000003   # BR(H+ -> ~c_L    ~s_L*  )
     2.21887831E-01    2     1000006  -1000005   # BR(H+ -> ~t_1    ~b_1*  )
