#
#                              ======================
#                              | THE SUSYHIT OUTPUT |
#                              ======================
#
#
#              ------------------------------------------------------
#              |     This is the output of the SUSY-HIT package     |
#              |  created by A.Djouadi, M.Muehlleitner and M.Spira. |
#              |  In case of problems with SUSY-HIT email to        |
#              |           margarete.muehlleitner@cern.ch           |
#              |           michael.spira@psi.ch                     |
#              |           abdelhak.djouadi@cern.ch                 |
#              ------------------------------------------------------
#
#              ------------------------------------------------------
#              |  SUSY Les Houches Accord - MSSM Spectrum + Decays  |
#              |              based on the decay programs           |
#              |                                                    |
#              |                     SDECAY 1.3b                    |
#              |                                                    |
#              |  Authors: M.Muhlleitner, A.Djouadi and Y.Mambrini  |
#              |  Ref.:    Comput.Phys.Commun.168(2005)46           |
#              |           [hep-ph/0311167]                         |
#              |                                                    |
#              |                     HDECAY 3.4                     |
#              |                                                    |
#              |  By: A.Djouadi,J.Kalinowski,M.Muhlleitner,M.Spira  |
#              |  Ref.:    Comput.Phys.Commun.108(1998)56           |
#              |           [hep-ph/9704448]                         |
#              |                                                    |
#              |                                                    |
#              |  If not stated otherwise all DRbar couplings and   |
#              |  soft SUSY breaking masses are given at the scale  |
#              |  Q=  0.27418970E+04
#              |                                                    |
#              ------------------------------------------------------
#
#
BLOCK DCINFO  # Decay Program information
     1   SDECAY/HDECAY # decay calculator
     2   1.3b  /3.4    # version number
#
BLOCK SPINFO  # Spectrum calculator information
     1     SOFTSUSY    # spectrum calculator               
     2     3.4.0       # version number                    
#
BLOCK MODSEL  # Model selection
     1     0   #  nonUniversal                                     
#
BLOCK SMINPUTS  # Standard Model inputs
         1     1.27908970E+02   # alpha_em^-1(M_Z)^MSbar
         2     1.16637870E-05   # G_F [GeV^-2]
         3     1.18400000E-01   # alpha_S(M_Z)^MSbar
         4     9.11876000E+01   # M_Z pole mass
         5     4.18000000E+00   # mb(mb)^MSbar
         6     1.73200000E+02   # mt pole mass
         7     1.77700000E+00   # mtau pole mass
#
BLOCK MINPAR  # Input parameters - minimal models
         3     3.24900000E+01   # tanb                
#
BLOCK EXTPAR  # Input parameters - non-minimal models
         0    -1.00000000E+00   # Set                 
         1     1.56750000E+02   # M_1(MX)             
         2     1.23506000E+03   # M_2(MX)             
         3     1.32451000E+03   # M_3(MX)             
        11    -2.88963000E+03   # At(MX)              
        12    -2.74340000E+02   # Ab(MX)              
        13     2.68512000E+03   # Atau(MX)            
        23    -1.74160000E+02   # mu(MX)              
        26     1.35556000E+03   # mA(pole)            
        31     3.74274000E+03   # meL(MX)             
        32     3.74274000E+03   # mmuL(MX)            
        33     2.16734000E+03   # mtauL(MX)           
        34     1.14250000E+02   # meR(MX)             
        35     1.14250000E+02   # mmuR(MX)            
        36     3.94397000E+03   # mtauR(MX)           
        41     3.00719000E+03   # mqL1(MX)            
        42     3.00719000E+03   # mqL2(MX)            
        43     2.97479000E+03   # mqL3(MX)            
        44     1.83015000E+03   # muR(MX)             
        45     1.83015000E+03   # mcR(MX)             
        46     2.52480000E+03   # mtR(MX)             
        47     2.34890000E+02   # mdR(MX)             
        48     2.34890000E+02   # msR(MX)             
        49     2.33175000E+03   # mbR(MX)             
#
BLOCK MASS  # Mass Spectrum
# PDG code           mass       particle
        24     8.03858504E+01   # W+
        25     1.25111161E+02   # h
        35     1.35558314E+03   # H
        36     1.35556000E+03   # A
        37     1.35836393E+03   # H+
         5     4.81876030E+00   # b-quark pole mass calculated from mb(mb)_Msbar
   1000001     3.05354408E+03   # ~d_L
   2000001     4.72156285E+02   # ~d_R
   1000002     3.05264143E+03   # ~u_L
   2000002     1.88164827E+03   # ~u_R
   1000003     3.05354408E+03   # ~s_L
   2000003     4.72156285E+02   # ~s_R
   1000004     3.05264143E+03   # ~c_L
   2000004     1.88164827E+03   # ~c_R
   1000005     2.36534023E+03   # ~b_1
   2000005     2.98429753E+03   # ~b_2
   1000006     2.50013480E+03   # ~t_1
   2000006     2.99790904E+03   # ~t_2
   1000011     3.74976599E+03   # ~e_L
   2000011     1.94452293E+02   # ~e_R
   1000012     3.74859068E+03   # ~nu_eL
   1000013     3.74976599E+03   # ~mu_L
   2000013     1.94452293E+02   # ~mu_R
   1000014     3.74859068E+03   # ~nu_muL
   1000015     2.17122574E+03   # ~tau_1
   2000015     3.94237255E+03   # ~tau_2
   1000016     2.16945287E+03   # ~nu_tauL
   1000021     1.50980280E+03   # ~g
   1000022     1.36248581E+02   # ~chi_10
   1000023    -1.88619232E+02   # ~chi_20
   1000025     2.00468416E+02   # ~chi_30
   1000035     1.28340055E+03   # ~chi_40
   1000024     1.83147939E+02   # ~chi_1+
   1000037     1.28357107E+03   # ~chi_2+
#
BLOCK NMIX  # Neutralino Mixing Matrix
  1  1     8.26293937E-01   # N_11
  1  2    -2.19360123E-02   # N_12
  1  3    -4.54472281E-01   # N_13
  1  4    -3.31982057E-01   # N_14
  2  1    -9.41929288E-02   # N_21
  2  2     3.98334453E-02   # N_22
  2  3    -6.93866563E-01   # N_23
  2  4     7.12804448E-01   # N_24
  3  1     5.55301503E-01   # N_31
  3  2     4.38952254E-02   # N_32
  3  3     5.58531170E-01   # N_33
  3  4     6.14618892E-01   # N_34
  4  1    -2.50246505E-03   # N_41
  4  2     9.98000660E-01   # N_42
  4  3    -6.86078238E-03   # N_43
  4  4    -6.27801732E-02   # N_44
#
BLOCK UMIX  # Chargino Mixing Matrix U
  1  1     9.73582693E-03   # U_11
  1  2     9.99952606E-01   # U_12
  2  1    -9.99952606E-01   # U_21
  2  2     9.73582693E-03   # U_22
#
BLOCK VMIX  # Chargino Mixing Matrix V
  1  1     8.88743606E-02   # V_11
  1  2    -9.96042844E-01   # V_12
  2  1    -9.96042844E-01   # V_21
  2  2    -8.88743606E-02   # V_22
#
BLOCK STOPMIX  # Stop Mixing Matrix
  1  1     1.56361318E-01   # cos(theta_t)
  1  2     9.87699923E-01   # sin(theta_t)
  2  1    -9.87699923E-01   # -sin(theta_t)
  2  2     1.56361318E-01   # cos(theta_t)
#
BLOCK SBOTMIX  # Sbottom Mixing Matrix
  1  1    -3.62929012E-03   # cos(theta_b)
  1  2     9.99993414E-01   # sin(theta_b)
  2  1    -9.99993414E-01   # -sin(theta_b)
  2  2    -3.62929012E-03   # cos(theta_b)
#
BLOCK STAUMIX  # Stau Mixing Matrix
  1  1     9.99999111E-01   # cos(theta_tau)
  1  2    -1.33341637E-03   # sin(theta_tau)
  2  1     1.33341637E-03   # -sin(theta_tau)
  2  2     9.99999111E-01   # cos(theta_tau)
#
BLOCK ALPHA  # Higgs mixing
          -3.21790084E-02   # Mixing angle in the neutral Higgs boson sector
#
BLOCK HMIX Q=  2.74189700E+03  # DRbar Higgs Parameters
         1    -1.77558914E+02   # mu(Q)MSSM           
         2     3.14683568E+01   # tan                 
         3     2.41992159E+02   # higgs               
         4     1.68599126E+06   # mA^2(Q)MSSM         
#
BLOCK GAUGE Q=  2.74189700E+03  # The gauge couplings
     1     3.65660740E-01   # gprime(Q) DRbar
     2     6.39771276E-01   # g(Q) DRbar
     3     1.02797345E+00   # g3(Q) DRbar
#
BLOCK AU Q=  2.74189700E+03  # The trilinear couplings
  1  1     0.00000000E+00   # A_u(Q) DRbar
  2  2     0.00000000E+00   # A_c(Q) DRbar
  3  3    -2.88962999E+03   # A_t(Q) DRbar
#
BLOCK AD Q=  2.74189700E+03  # The trilinear couplings
  1  1     0.00000000E+00   # A_d(Q) DRbar
  2  2     0.00000000E+00   # A_s(Q) DRbar
  3  3    -2.74339996E+02   # A_b(Q) DRbar
#
BLOCK AE Q=  2.74189700E+03  # The trilinear couplings
  1  1     0.00000000E+00   # A_e(Q) DRbar
  2  2     0.00000000E+00   # A_mu(Q) DRbar
  3  3     2.68512000E+03   # A_tau(Q) DRbar
#
BLOCK Yu Q=  2.74189700E+03  # The Yukawa couplings
  1  1     0.00000000E+00   # y_u(Q) DRbar
  2  2     0.00000000E+00   # y_c(Q) DRbar
  3  3     8.24005232E-01   # y_t(Q) DRbar
#
BLOCK Yd Q=  2.74189700E+03  # The Yukawa couplings
  1  1     0.00000000E+00   # y_d(Q) DRbar
  2  2     0.00000000E+00   # y_s(Q) DRbar
  3  3     4.29237203E-01   # y_b(Q) DRbar
#
BLOCK Ye Q=  2.74189700E+03  # The Yukawa couplings
  1  1     0.00000000E+00   # y_e(Q) DRbar
  2  2     0.00000000E+00   # y_mu(Q) DRbar
  3  3     3.19504142E-01   # y_tau(Q) DRbar
#
BLOCK MSOFT Q=  2.74189700E+03  # The soft SUSY breaking masses at the scale Q
         1     1.56750000E+02   # M_1(Q)              
         2     1.23506000E+03   # M_2(Q)              
         3     1.32451000E+03   # M_3(Q)              
        21     1.86181244E+06   # mH1^2(Q)            
        22     1.18778034E+05   # mH2^2(Q)            
        31     3.74274000E+03   # meL(Q)              
        32     3.74274000E+03   # mmuL(Q)             
        33     2.16734000E+03   # mtauL(Q)            
        34     1.14250000E+02   # meR(Q)              
        35     1.14250000E+02   # mmuR(Q)             
        36     3.94397000E+03   # mtauR(Q)            
        41     3.00719000E+03   # mqL1(Q)             
        42     3.00719000E+03   # mqL2(Q)             
        43     2.97478999E+03   # mqL3(Q)             
        44     1.83015000E+03   # muR(Q)              
        45     1.83015000E+03   # mcR(Q)              
        46     2.52479999E+03   # mtR(Q)              
        47     2.34889976E+02   # mdR(Q)              
        48     2.34889976E+02   # msR(Q)              
        49     2.33175000E+03   # mbR(Q)              
#
Block HiggsBoundsInputHiggsCouplingsFermions
# ScalarNormEffCoupSq PseudoSNormEffCoupSq NP   IP1 IP2 IP2
    1.02608156E+00    0.00000000E+00        3  25   5   5  # h0-b-b eff. coupling^2, normalised to SM
    9.90231398E+02    0.00000000E+00        3  35   5   5  # H0-b-b eff. coupling^2, normalised to SM
    0.00000000E+00    9.90257480E+02        3  36   5   5  # A0-b-b eff. coupling^2, normalised to SM
#
    9.99973662E-01    0.00000000E+00        3  25   6   6  # h0-t-t eff. coupling^2, normalised to SM
    1.03617653E-03    0.00000000E+00        3  35   6   6  # H0-t-t eff. coupling^2, normalised to SM
    0.00000000E+00    1.00983837E-03        3  36   6   6  # A0-t-t eff. coupling^2, normalised to SM
#
    1.02608156E+00    0.00000000E+00        3  25  15  15  # h0-tau-tau eff. coupling^2, normalised to SM
    9.90231398E+02    0.00000000E+00        3  35  15  15  # H0-tau-tau eff. coupling^2, normalised to SM
    0.00000000E+00    9.90257480E+02        3  36  15  15  # A0-tau-tau eff. coupling^2, normalised to SM
#
Block HiggsBoundsInputHiggsCouplingsBosons
    9.99999830E-01        3  25  24  24  # h0-W-W eff. coupling^2, normalised to SM
    1.69533627E-07        3  35  24  24  # H0-W-W eff. coupling^2, normalised to SM
    0.00000000E+00        3  36  24  24  # A0-W-W eff. coupling^2, normalised to SM
#
    9.99999830E-01        3  25  23  23  # h0-Z-Z eff. coupling^2, normalised to SM
    1.69533627E-07        3  35  23  23  # H0-Z-Z eff. coupling^2, normalised to SM
    0.00000000E+00        3  36  23  23  # A0-Z-Z eff. coupling^2, normalised to SM
#
    8.93031567E-01        3  25  21  21  # h0-g-g eff. coupling^2, normalised to SM
    3.17363684E-08        3  35  21  21  # H0-g-g eff. coupling^2, normalised to SM
    1.28233190E-07        3  36  21  21  # A0-g-g eff. coupling^2, normalised to SM
#
    0.00000000E+00        3  25  25  23  # h0-h0-Z eff. coupling^2, normalised to SM
    0.00000000E+00        3  35  25  23  # H0-h0-Z eff. coupling^2, normalised to SM
    1.69533627E-07        3  36  25  23  # A0-h0-Z eff. coupling^2, normalised to SM
    0.00000000E+00        3  35  35  23  # H0-H0-Z eff. coupling^2, normalised to SM
    9.99999830E-01        3  36  35  23  # A0-H0-Z eff. coupling^2, normalised to SM
    0.00000000E+00        3  36  36  23  # A0-A0-Z eff. coupling^2, normalised to SM
#
    0.00000000E+00        4  25  21  21  23  # h0-g-g-Z eff. coupling^2, normalised to SM
    0.00000000E+00        4  35  21  21  23  # H0-g-g-Z eff. coupling^2, normalised to SM
    0.00000000E+00        4  36  21  21  23  # A0-g-g-Z eff. coupling^2, normalised to SM
#
#
#
#                             =================
#                             |The decay table|
#                             =================
#
# - The QCD corrections to the decays gluino -> squark  + quark
#                                     squark -> gaugino + quark_prime
#                                     squark -> squark_prime + Higgs
#                                     squark -> gluino  + quark
#   are included.
#
# - The multi-body decays for the inos, stops and sbottoms are included.
#
# - The loop induced decays for the gluino, neutralinos and stops
#   are included.
#
# - The SUSY decays of the top quark are included.
#
#
#         PDG            Width
DECAY         6     1.44170103E+00   # top decays
#          BR         NDA      ID1       ID2
     1.00000000E+00    2           5        24   # BR(t ->  b    W+)
#
#         PDG            Width
DECAY   1000021     4.76629738E+01   # gluino decays
#          BR         NDA      ID1       ID2
     2.50000000E-01    2     2000001        -1   # BR(~g -> ~d_R  db)
     2.50000000E-01    2    -2000001         1   # BR(~g -> ~d_R* d )
     2.50000000E-01    2     2000003        -3   # BR(~g -> ~s_R  sb)
     2.50000000E-01    2    -2000003         3   # BR(~g -> ~s_R* s )
#
#         PDG            Width
DECAY   1000006     1.29838867E+02   # stop1 decays
#          BR         NDA      ID1       ID2
     6.47519139E-02    2     1000022         6   # BR(~t_1 -> ~chi_10 t )
     1.33232471E-01    2     1000023         6   # BR(~t_1 -> ~chi_20 t )
     1.02712021E-01    2     1000025         6   # BR(~t_1 -> ~chi_30 t )
     9.36228237E-05    2     1000035         6   # BR(~t_1 -> ~chi_40 t )
     2.56256486E-01    2     1000024         5   # BR(~t_1 -> ~chi_1+ b )
     1.54984741E-04    2     1000037         5   # BR(~t_1 -> ~chi_2+ b )
     4.42798487E-01    2     1000021         6   # BR(~t_1 -> ~g      t )
     1.45848582E-08    2     1000005        24   # BR(~t_1 -> ~b_1    W+)
#
#         PDG            Width
DECAY   2000006     1.76439585E+02   # stop2 decays
#          BR         NDA      ID1       ID2
     2.06769967E-02    2     1000022         6   # BR(~t_2 -> ~chi_10 t )
     1.12165556E-01    2     1000023         6   # BR(~t_2 -> ~chi_20 t )
     9.36103214E-02    2     1000025         6   # BR(~t_2 -> ~chi_30 t )
     4.71884502E-02    2     1000035         6   # BR(~t_2 -> ~chi_40 t )
     6.20420217E-02    2     1000024         5   # BR(~t_2 -> ~chi_1+ b )
     9.25935288E-02    2     1000037         5   # BR(~t_2 -> ~chi_2+ b )
     5.11596535E-01    2     1000021         6   # BR(~t_2 -> ~g      t )
     2.83387662E-02    2     1000006        25   # BR(~t_2 -> ~t_1    h )
     3.17229471E-02    2     1000006        23   # BR(~t_2 -> ~t_1    Z )
     6.48764964E-05    2     1000005        24   # BR(~t_2 -> ~b_1    W+)
#
#         PDG            Width
DECAY   1000005     6.49846809E+01   # sbottom1 decays
#          BR         NDA      ID1       ID2
     4.22033569E-02    2     1000022         5   # BR(~b_1 -> ~chi_10 b )
     6.35434248E-02    2     1000023         5   # BR(~b_1 -> ~chi_20 b )
     4.73984525E-02    2     1000025         5   # BR(~b_1 -> ~chi_30 b )
     6.77032222E-07    2     1000035         5   # BR(~b_1 -> ~chi_40 b )
     1.30379228E-01    2    -1000024         6   # BR(~b_1 -> ~chi_1- t )
     1.20181690E-06    2    -1000037         6   # BR(~b_1 -> ~chi_2- t )
     7.16473659E-01    2     1000021         5   # BR(~b_1 -> ~g      b )
#
#         PDG            Width
DECAY   2000005     1.78247365E+02   # sbottom2 decays
#          BR         NDA      ID1       ID2
     1.47027765E-02    2     1000022         5   # BR(~b_2 -> ~chi_10 b )
     2.95671783E-02    2     1000023         5   # BR(~b_2 -> ~chi_20 b )
     1.93007089E-02    2     1000025         5   # BR(~b_2 -> ~chi_30 b )
     4.51481840E-02    2     1000035         5   # BR(~b_2 -> ~chi_40 b )
     2.21160486E-01    2    -1000024         6   # BR(~b_2 -> ~chi_1- t )
     9.20711312E-02    2    -1000037         6   # BR(~b_2 -> ~chi_2- t )
     5.19622568E-01    2     1000021         5   # BR(~b_2 -> ~g      b )
     3.55546955E-05    2     1000005        25   # BR(~b_2 -> ~b_1    h )
     3.17080545E-05    2     1000005        23   # BR(~b_2 -> ~b_1    Z )
     5.83597045E-02    2     1000006       -24   # BR(~b_2 -> ~t_1    W-)
#
#         PDG            Width
DECAY   1000002     1.58029954E+02   # sup_L decays
#          BR         NDA      ID1       ID2
     1.38554220E-03    2     1000022         2   # BR(~u_L -> ~chi_10 u)
     3.60389020E-05    2     1000023         2   # BR(~u_L -> ~chi_20 u)
     1.68394829E-03    2     1000025         2   # BR(~u_L -> ~chi_30 u)
     5.13222277E-02    2     1000035         2   # BR(~u_L -> ~chi_40 u)
     1.18881673E-03    2     1000024         1   # BR(~u_L -> ~chi_1+ d)
     1.02328279E-01    2     1000037         1   # BR(~u_L -> ~chi_2+ d)
     8.42055147E-01    2     1000021         2   # BR(~u_L -> ~g      u)
#
#         PDG            Width
DECAY   2000002     2.24101148E+01   # sup_R decays
#          BR         NDA      ID1       ID2
     1.27604566E-01    2     1000022         2   # BR(~u_R -> ~chi_10 u)
     1.64326822E-03    2     1000023         2   # BR(~u_R -> ~chi_20 u)
     5.69702134E-02    2     1000025         2   # BR(~u_R -> ~chi_30 u)
     3.44661534E-07    2     1000035         2   # BR(~u_R -> ~chi_40 u)
     8.13781607E-01    2     1000021         2   # BR(~u_R -> ~g      u)
#
#         PDG            Width
DECAY   1000001     1.58069114E+02   # sdown_L decays
#          BR         NDA      ID1       ID2
     2.42826425E-03    2     1000022         1   # BR(~d_L -> ~chi_10 d)
     2.51139342E-04    2     1000023         1   # BR(~d_L -> ~chi_20 d)
     2.87963479E-04    2     1000025         1   # BR(~d_L -> ~chi_30 d)
     5.14359862E-02    2     1000035         1   # BR(~d_L -> ~chi_40 d)
     1.42669983E-05    2    -1000024         2   # BR(~d_L -> ~chi_1- u)
     1.03164480E-01    2    -1000037         2   # BR(~d_L -> ~chi_2- u)
     8.42417900E-01    2     1000021         1   # BR(~d_L -> ~g      d)
#
#         PDG            Width
DECAY   2000001     2.28394524E-01   # sdown_R decays
#          BR         NDA      ID1       ID2
     7.28652561E-01    2     1000022         1   # BR(~d_R -> ~chi_10 d)
     7.96366348E-03    2     1000023         1   # BR(~d_R -> ~chi_20 d)
     2.63383775E-01    2     1000025         1   # BR(~d_R -> ~chi_30 d)
#
#         PDG            Width
DECAY   1000004     1.23447200E+02   # scharm_L decays
#          BR         NDA      ID1       ID2
     1.84078935E-03    2     1000022         4   # BR(~c_L -> ~chi_10 c)
     4.78673617E-05    2     1000023         4   # BR(~c_L -> ~chi_20 c)
     2.23651205E-03    2     1000025         4   # BR(~c_L -> ~chi_30 c)
     6.78966195E-02    2     1000035         4   # BR(~c_L -> ~chi_40 c)
     1.57904654E-03    2     1000024         3   # BR(~c_L -> ~chi_1+ s)
     1.35374958E-01    2     1000037         3   # BR(~c_L -> ~chi_2+ s)
     7.91024207E-01    2     1000021         4   # BR(~c_L -> ~g      c)
#
#         PDG            Width
DECAY   2000004     1.77681212E+01   # scharm_R decays
#          BR         NDA      ID1       ID2
     1.69174138E-01    2     1000022         4   # BR(~c_R -> ~chi_10 c)
     2.17718567E-03    2     1000023         4   # BR(~c_R -> ~chi_20 c)
     7.54698180E-02    2     1000025         4   # BR(~c_R -> ~chi_30 c)
     4.48471459E-07    2     1000035         4   # BR(~c_R -> ~chi_40 c)
     7.53178410E-01    2     1000021         4   # BR(~c_R -> ~g      c)
#
#         PDG            Width
DECAY   1000003     1.23459863E+02   # sstrange_L decays
#          BR         NDA      ID1       ID2
     3.22657059E-03    2     1000022         3   # BR(~s_L -> ~chi_10 s)
     3.33613531E-04    2     1000023         3   # BR(~s_L -> ~chi_20 s)
     3.82508322E-04    2     1000025         3   # BR(~s_L -> ~chi_30 s)
     6.80569477E-02    2     1000035         3   # BR(~s_L -> ~chi_40 s)
     1.89527941E-05    2    -1000024         4   # BR(~s_L -> ~chi_1- c)
     1.36500759E-01    2    -1000037         4   # BR(~s_L -> ~chi_2- c)
     7.91480648E-01    2     1000021         3   # BR(~s_L -> ~g      s)
#
#         PDG            Width
DECAY   2000003     2.19724242E-01   # sstrange_R decays
#          BR         NDA      ID1       ID2
     7.28842043E-01    2     1000022         3   # BR(~s_R -> ~chi_10 s)
     7.95981783E-03    2     1000023         3   # BR(~s_R -> ~chi_20 s)
     2.63198139E-01    2     1000025         3   # BR(~s_R -> ~chi_30 s)
#
#         PDG            Width
DECAY   1000011     4.06886753E+01   # selectron_L decays
#          BR         NDA      ID1       ID2
     7.58922751E-02    2     1000022        11   # BR(~e_L -> ~chi_10 e-)
     7.31960153E-05    2     1000023        11   # BR(~e_L -> ~chi_20 e-)
     4.86940137E-02    2     1000025        11   # BR(~e_L -> ~chi_30 e-)
     2.90453744E-01    2     1000035        11   # BR(~e_L -> ~chi_40 e-)
     7.07915388E-05    2    -1000024        12   # BR(~e_L -> ~chi_1- nu_e)
     5.84815980E-01    2    -1000037        12   # BR(~e_L -> ~chi_2- nu_e)
#
#         PDG            Width
DECAY   2000011     1.83060580E-01   # selectron_R decays
#          BR         NDA      ID1       ID2
     9.99824906E-01    2     1000022        11   # BR(~e_R -> ~chi_10 e-)
     1.75094355E-04    2     1000023        11   # BR(~e_R -> ~chi_20 e-)
#
#         PDG            Width
DECAY   1000013     4.06886752E+01   # smuon_L decays
#          BR         NDA      ID1       ID2
     7.58922751E-02    2     1000022        13   # BR(~mu_L -> ~chi_10 mu-)
     7.31960152E-05    2     1000023        13   # BR(~mu_L -> ~chi_20 mu-)
     4.86940136E-02    2     1000025        13   # BR(~mu_L -> ~chi_30 mu-)
     2.90453743E-01    2     1000035        13   # BR(~mu_L -> ~chi_40 mu-)
     7.07915388E-05    2    -1000024        14   # BR(~mu_L -> ~chi_1- nu_mu)
     5.84815980E-01    2    -1000037        14   # BR(~mu_L -> ~chi_2- nu_mu)
#
#         PDG            Width
DECAY   2000013     1.83060158E-01   # smuon_R decays
#          BR         NDA      ID1       ID2
     9.99824935E-01    2     1000022        13   # BR(~mu_R -> ~chi_10 mu-)
     1.75065151E-04    2     1000023        13   # BR(~mu_R -> ~chi_20 mu-)
#
#         PDG            Width
DECAY   1000015     1.84606489E+01   # stau_1 decays
#          BR         NDA      ID1       ID2
     1.45483074E-01    2     1000022        15   # BR(~tau_1 -> ~chi_10  tau-)
     1.13303168E-01    2     1000023        15   # BR(~tau_1 -> ~chi_20  tau-)
     1.34573948E-01    2     1000025        15   # BR(~tau_1 -> ~chi_30  tau-)
     2.01306105E-01    2     1000035        15   # BR(~tau_1 -> ~chi_40  tau-)
     1.02151298E-04    2    -1000024        16   # BR(~tau_1 -> ~chi_1-  nu_tau)
     4.05231554E-01    2    -1000037        16   # BR(~tau_1 -> ~chi_2-  nu_tau)
#
#         PDG            Width
DECAY   2000015     4.01256813E+01   # stau_2 decays
#          BR         NDA      ID1       ID2
     3.96979752E-01    2     1000022        15   # BR(~tau_2 -> ~chi_10  tau-)
     1.00293698E-01    2     1000023        15   # BR(~tau_2 -> ~chi_20  tau-)
     2.22376859E-01    2     1000025        15   # BR(~tau_2 -> ~chi_30  tau-)
     1.48133538E-05    2     1000035        15   # BR(~tau_2 -> ~chi_40  tau-)
     1.98644823E-01    2    -1000024        16   # BR(~tau_2 -> ~chi_1-  nu_tau)
     2.45432544E-05    2    -1000037        16   # BR(~tau_2 -> ~chi_2-  nu_tau)
     4.02225924E-02    2     1000016       -37   # BR(~tau_2 -> ~nu_tauL H-)
     5.77767687E-04    2     1000016       -24   # BR(~tau_2 -> ~nu_tauL W-)
     3.10509123E-04    2     1000015        25   # BR(~tau_2 -> ~tau_1   h)
     2.01277255E-02    2     1000015        35   # BR(~tau_2 -> ~tau_1   H)
     2.01300049E-02    2     1000015        36   # BR(~tau_2 -> ~tau_1   A)
     2.96910942E-04    2     1000015        23   # BR(~tau_2 -> ~tau_1   Z)
#
#         PDG            Width
DECAY   1000012     4.07047256E+01   # snu_eL decays
#          BR         NDA      ID1       ID2
     9.13348319E-02    2     1000022        12   # BR(~nu_eL -> ~chi_10 nu_e)
     3.27314900E-03    2     1000023        12   # BR(~nu_eL -> ~chi_20 nu_e)
     2.78841982E-02    2     1000025        12   # BR(~nu_eL -> ~chi_30 nu_e)
     2.91868282E-01    2     1000035        12   # BR(~nu_eL -> ~chi_40 nu_e)
     5.89494710E-03    2     1000024        11   # BR(~nu_eL -> ~chi_1+ e-)
     5.79744592E-01    2     1000037        11   # BR(~nu_eL -> ~chi_2+ e-)
#
#         PDG            Width
DECAY   1000014     4.07047256E+01   # snu_muL decays
#          BR         NDA      ID1       ID2
     9.13348320E-02    2     1000022        14   # BR(~nu_muL -> ~chi_10 nu_mu)
     3.27314900E-03    2     1000023        14   # BR(~nu_muL -> ~chi_20 nu_mu)
     2.78841982E-02    2     1000025        14   # BR(~nu_muL -> ~chi_30 nu_mu)
     2.91868283E-01    2     1000035        14   # BR(~nu_muL -> ~chi_40 nu_mu)
     5.89494710E-03    2     1000024        13   # BR(~nu_muL -> ~chi_1+ mu-)
     5.79744591E-01    2     1000037        13   # BR(~nu_muL -> ~chi_2+ mu-)
#
#         PDG            Width
DECAY   1000016     1.84782850E+01   # snu_tauL decays
#          BR         NDA      ID1       ID2
     1.15829008E-01    2     1000022        16   # BR(~nu_tauL -> ~chi_10 nu_tau)
     4.13087779E-03    2     1000023        16   # BR(~nu_tauL -> ~chi_20 nu_tau)
     3.51449343E-02    2     1000025        16   # BR(~nu_tauL -> ~chi_30 nu_tau)
     2.01752026E-01    2     1000035        16   # BR(~nu_tauL -> ~chi_40 nu_tau)
     2.42482475E-01    2     1000024        15   # BR(~nu_tauL -> ~chi_1+ tau-)
     4.00660679E-01    2     1000037        15   # BR(~nu_tauL -> ~chi_2+ tau-)
#
#         PDG            Width
DECAY   1000024     7.75757290E-05   # chargino1+ decays
#           BR         NDA      ID1       ID2       ID3
     3.33580510E-01    3     1000022         2        -1   # BR(~chi_1+ -> ~chi_10 u    db)
     3.33580510E-01    3     1000022         4        -3   # BR(~chi_1+ -> ~chi_10 c    sb)
     1.11195123E-01    3     1000022       -11        12   # BR(~chi_1+ -> ~chi_10 e+   nu_e)
     1.11195123E-01    3     1000022       -13        14   # BR(~chi_1+ -> ~chi_10 mu+  nu_mu)
     1.10448733E-01    3     1000022       -15        16   # BR(~chi_1+ -> ~chi_10 tau+ nu_tau)
#
#         PDG            Width
DECAY   1000037     1.00369900E+01   # chargino2+ decays
#          BR         NDA      ID1       ID2
     2.54863975E-01    2     1000024        23   # BR(~chi_2+ -> ~chi_1+  Z )
     4.54929854E-02    2     1000022        24   # BR(~chi_2+ -> ~chi_10  W+)
     2.50462410E-01    2     1000023        24   # BR(~chi_2+ -> ~chi_20  W+)
     2.00711521E-01    2     1000025        24   # BR(~chi_2+ -> ~chi_30  W+)
     2.48469109E-01    2     1000024        25   # BR(~chi_2+ -> ~chi_1+  h )
#
#         PDG            Width
DECAY   1000022     0.00000000E+00   # neutralino1 decays
#
#         PDG            Width
DECAY   1000023     9.71360141E-05   # neutralino2 decays
#          BR         NDA      ID1       ID2
     6.95550239E-04    2     1000022        22   # BR(~chi_20 -> ~chi_10 gam)
#           BR         NDA      ID1       ID2       ID3
     1.19349277E-01    3     1000022        -2         2   # BR(~chi_20 -> ~chi_10 ub      u)
     1.54860689E-01    3     1000022        -1         1   # BR(~chi_20 -> ~chi_10 db      d)
     1.19349277E-01    3     1000022        -4         4   # BR(~chi_20 -> ~chi_10 cb      c)
     1.54860689E-01    3     1000022        -3         3   # BR(~chi_20 -> ~chi_10 sb      s)
     1.43522126E-01    3     1000022        -5         5   # BR(~chi_20 -> ~chi_10 bb      b)
     2.92160807E-02    3     1000022       -11        11   # BR(~chi_20 -> ~chi_10 e+      e-)
     2.92160807E-02    3     1000022       -13        13   # BR(~chi_20 -> ~chi_10 mu+     mu-)
     3.53039151E-02    3     1000022       -15        15   # BR(~chi_20 -> ~chi_10 tau+    tau-)
     7.11684339E-02    3     1000022       -12        12   # BR(~chi_20 -> ~chi_10 nu_eb   nu_e)
     7.11684339E-02    3     1000022       -14        14   # BR(~chi_20 -> ~chi_10 nu_mub  nu_mu)
     7.11779489E-02    3     1000022       -16        16   # BR(~chi_20 -> ~chi_10 nu_taub nu_tau)
     1.94385272E-05    3     1000024        -2         1   # BR(~chi_20 -> ~chi_1+ ub      d)
     1.94385272E-05    3    -1000024        -1         2   # BR(~chi_20 -> ~chi_1- db      u)
     1.94385272E-05    3     1000024        -4         3   # BR(~chi_20 -> ~chi_1+ cb      s)
     1.94385272E-05    3    -1000024        -3         4   # BR(~chi_20 -> ~chi_1- sb      c)
     6.47952876E-06    3     1000024       -12        11   # BR(~chi_20 -> ~chi_1+ nu_eb   e-)
     6.47952876E-06    3    -1000024        12       -11   # BR(~chi_20 -> ~chi_1- nu_e    e+)
     6.47952876E-06    3     1000024       -14        13   # BR(~chi_20 -> ~chi_1+ nu_mub  mu-)
     6.47952876E-06    3    -1000024        14       -13   # BR(~chi_20 -> ~chi_1- nu_mu   mu+)
     3.91420607E-06    3     1000024       -16        15   # BR(~chi_20 -> ~chi_1+ nu_taub tau-)
     3.91420607E-06    3    -1000024        16       -15   # BR(~chi_20 -> ~chi_1- nu_tau  tau+)
#
#         PDG            Width
DECAY   1000025     2.11523241E-03   # neutralino3 decays
#           BR         NDA      ID1       ID2       ID3
     7.09425589E-04    3        -1       1        1000022   # BR(~chi_30 -> db  d  ~chi_10)
     1.21041073E-05    3        -1       1        1000023   # BR(~chi_30 -> db  d  ~chi_20)
     5.66840784E-04    3        -2       2        1000022   # BR(~chi_30 -> ub  u  ~chi_10)
     9.49304666E-06    3        -2       2        1000023   # BR(~chi_30 -> ub  u  ~chi_20)
     7.25452196E-04    3        -3       3        1000022   # BR(~chi_30 -> sb  s  ~chi_10)
     1.21003252E-05    3        -3       3        1000023   # BR(~chi_30 -> sb  s  ~chi_20)
     5.67975411E-04    3        -4       4        1000022   # BR(~chi_30 -> cb  c  ~chi_10)
     8.58770880E-06    3        -4       4        1000023   # BR(~chi_30 -> cb  c  ~chi_20)
     6.88245883E-04    3        -5       5        1000022   # BR(~chi_30 -> bb  b  ~chi_10)
     1.36240348E-06    3        -5       5        1000023   # BR(~chi_30 -> bb  b  ~chi_20)
     4.97297599E-01    3        -11       11        1000022   # BR(~chi_30 -> e+  e-  ~chi_10)
     8.41562369E-05    3        -11       11        1000023   # BR(~chi_30 -> e+  e-  ~chi_20)
     3.28833841E-04    3        -12       12        1000022   # BR(~chi_30 -> nu_eb  nu_e  ~chi_10)
     5.48308542E-06    3        -12       12        1000023   # BR(~chi_30 -> nu_eb  nu_e  ~chi_20)
     4.96777561E-01    3        -13       13        1000022   # BR(~chi_30 -> mu+  mu-  ~chi_10)
     8.43642518E-05    3        -13       13        1000023   # BR(~chi_30 -> mu+  mu-  ~chi_20)
     3.27344643E-04    3        -14       14        1000022   # BR(~chi_30 -> nu_mub  nu_mu  ~chi_10)
     5.41075294E-06    3        -14       14        1000023   # BR(~chi_30 -> nu_mub  nu_mu  ~chi_20)
     1.61930196E-04    3        -15       15        1000022   # BR(~chi_30 -> tau+  tau-  ~chi_10)
     2.40077638E-06    3        -15       15        1000023   # BR(~chi_30 -> tau+  tau-  ~chi_20)
     3.32029708E-04    3        -16       16        1000022   # BR(~chi_30 -> nu_taub  nu_tau  ~chi_10)
     5.40697085E-06    3        -16       16        1000023   # BR(~chi_30 -> nu_taub  nu_tau  ~chi_20)
     2.18462992E-04    3        2       -1        -1000024   # BR(~chi_30 -> u  db  ~chi_1-)
     2.12014527E-04    3        4       -3        -1000024   # BR(~chi_30 -> c  sb  ~chi_1-)
     7.23513875E-05    3        12       -11        -1000024   # BR(~chi_30 -> nu_e  e+  ~chi_1-)
     7.35332907E-05    3        14       -13        -1000024   # BR(~chi_30 -> nu_mu  mu+  ~chi_1-)
     6.81958158E-05    3        16       -15        -1000024   # BR(~chi_30 -> nu_tau  tau+  ~chi_1-)
     2.16576675E-04    3        -2       1        1000024   # BR(~chi_30 -> ub  d  ~chi_1+)
     2.10038385E-04    3        -4       3        1000024   # BR(~chi_30 -> cb  s  ~chi_1+)
     7.33725519E-05    3        -12       11        1000024   # BR(~chi_30 -> nu_eb  e-  ~chi_1+)
     7.33583691E-05    3        -14       13        1000024   # BR(~chi_30 -> nu_mub  mu-  ~chi_1+)
     6.79878008E-05    3        -16       15        1000024   # BR(~chi_30 -> nu_taub  tau-  ~chi_1+)
#
#         PDG            Width
DECAY   1000035     1.00392235E+01   # neutralino4 decays
#          BR         NDA      ID1       ID2
     2.08319661E-02    2     1000022        23   # BR(~chi_40 -> ~chi_10   Z )
     1.56275483E-01    2     1000023        23   # BR(~chi_40 -> ~chi_20   Z )
     7.70774048E-02    2     1000025        23   # BR(~chi_40 -> ~chi_30   Z )
     2.49526543E-01    2     1000024       -24   # BR(~chi_40 -> ~chi_1+   W-)
     2.49526543E-01    2    -1000024        24   # BR(~chi_40 -> ~chi_1-   W+)
     2.53206792E-02    2     1000022        25   # BR(~chi_40 -> ~chi_10   h )
     9.60574870E-02    2     1000023        25   # BR(~chi_40 -> ~chi_20   h )
     1.25373671E-01    2     1000025        25   # BR(~chi_40 -> ~chi_30   h )
     5.22666707E-07    2     2000001        -1   # BR(~chi_40 -> ~d_R      db)
     5.22666707E-07    2    -2000001         1   # BR(~chi_40 -> ~d_R*     d )
     5.22666707E-07    2     2000003        -3   # BR(~chi_40 -> ~s _R      sb)
     5.22666707E-07    2    -2000003         3   # BR(~chi_40 -> ~s _R*     s )
     2.03288559E-06    2     2000011       -11   # BR(~chi_40 -> ~e_R-     e+)
     2.03288559E-06    2    -2000011        11   # BR(~chi_40 -> ~e_R+     e-)
     2.03288559E-06    2     2000013       -13   # BR(~chi_40 -> ~mu_R-    mu+)
     2.03288559E-06    2    -2000013        13   # BR(~chi_40 -> ~mu_R+    mu-)
#
#         PDG            Width
DECAY        25     4.07506534E-03   # h decays
#          BR         NDA      ID1       ID2
     5.95505999E-01    2           5        -5   # BR(h -> b       bb     )
     6.52200102E-02    2         -15        15   # BR(h -> tau+    tau-   )
     2.30837990E-04    2         -13        13   # BR(h -> mu+     mu-    )
     2.52005752E-04    2           3        -3   # BR(h -> s       sb     )
     2.12976429E-02    2           4        -4   # BR(h -> c       cb     )
     7.86918931E-02    2          21        21   # BR(h -> g       g      )
     2.29196956E-03    2          22        22   # BR(h -> gam     gam    )
     1.54788703E-03    2          22        23   # BR(h -> Z       gam    )
     2.08858825E-01    2          24       -24   # BR(h -> W+      W-     )
     2.61029295E-02    2          23        23   # BR(h -> Z       Z      )
#
#         PDG            Width
DECAY        35     2.13945049E+01   # H decays
#          BR         NDA      ID1       ID2
     7.88230046E-01    2           5        -5   # BR(H -> b       bb     )
     1.31764284E-01    2         -15        15   # BR(H -> tau+    tau-   )
     4.63282487E-04    2         -13        13   # BR(H -> mu+     mu-    )
     3.39596566E-04    2           3        -3   # BR(H -> s       sb     )
     3.01051408E-08    2           4        -4   # BR(H -> c       cb     )
     2.81412338E-03    2           6        -6   # BR(H -> t       tb     )
     4.42754070E-05    2          21        21   # BR(H -> g       g      )
     2.29996836E-08    2          22        22   # BR(H -> gam     gam    )
     1.93364914E-08    2          23        22   # BR(H -> Z       gam    )
     6.23291574E-06    2          24       -24   # BR(H -> W+      W-     )
     3.09398086E-06    2          23        23   # BR(H -> Z       Z      )
     2.39249341E-05    2          25        25   # BR(H -> h       h      )
     3.81104926E-03    2     1000024  -1000024   # BR(H -> ~chi_1+ ~chi_1-)
     2.35552804E-02    2     1000022   1000022   # BR(H -> ~chi_10 ~chi_10)
     1.74530489E-03    2     1000023   1000023   # BR(H -> ~chi_20 ~chi_20)
     1.00577158E-02    2     1000025   1000025   # BR(H -> ~chi_30 ~chi_30)
     1.89026434E-02    2     1000022   1000023   # BR(H -> ~chi_10 ~chi_20)
     5.53367958E-03    2     1000022   1000025   # BR(H -> ~chi_10 ~chi_30)
     1.27038747E-02    2     1000023   1000025   # BR(H -> ~chi_20 ~chi_30)
     1.51814619E-07    2     2000001  -2000001   # BR(H -> ~d_R    ~d_R*  )
     1.51814619E-07    2     2000003  -2000003   # BR(H -> ~s_R    ~s_R*  )
     6.08123743E-07    2     2000011  -2000011   # BR(H -> ~e_R-   ~e_R+  )
     6.08123743E-07    2     2000013  -2000013   # BR(H -> ~mu_R-  ~mu_R+ )
#
#         PDG            Width
DECAY        36     2.14035901E+01   # A decays
#          BR         NDA      ID1       ID2
     7.87935899E-01    2           5        -5   # BR(A -> b       bb     )
     1.31710457E-01    2         -15        15   # BR(A -> tau+    tau-   )
     4.63090093E-04    2         -13        13   # BR(A -> mu+     mu-    )
     3.39480591E-04    2           3        -3   # BR(A -> s       sb     )
     2.95958025E-08    2           4        -4   # BR(A -> c       cb     )
     2.87821489E-03    2           6        -6   # BR(A -> t       tb     )
     8.89441579E-05    2          21        21   # BR(A -> g       g      )
     1.32893929E-08    2          22        22   # BR(A -> gam     gam    )
     4.48196998E-08    2          23        22   # BR(A -> Z       gam    )
     6.22301866E-06    2          23        25   # BR(A -> Z       h      )
     4.05254836E-03    2     1000024  -1000024   # BR(A -> ~chi_1+ ~chi_1-)
     2.23477134E-02    2     1000022   1000022   # BR(A -> ~chi_10 ~chi_10)
     2.15679061E-03    2     1000023   1000023   # BR(A -> ~chi_20 ~chi_20)
     9.57022465E-03    2     1000025   1000025   # BR(A -> ~chi_30 ~chi_30)
     2.10226380E-02    2     1000022   1000023   # BR(A -> ~chi_10 ~chi_20)
     4.91952651E-03    2     1000022   1000025   # BR(A -> ~chi_10 ~chi_30)
     1.25081620E-02    2     1000023   1000025   # BR(A -> ~chi_20 ~chi_30)
#
#         PDG            Width
DECAY        37     2.11602349E+01   # H+ decays
#          BR         NDA      ID1       ID2
     1.33561784E-03    2           4        -5   # BR(H+ -> c       bb     )
     1.33500779E-01    2         -15        16   # BR(H+ -> tau+    nu_tau )
     4.69384805E-04    2         -13        14   # BR(H+ -> mu+     nu_mu  )
     1.33561068E-05    2           2        -5   # BR(H+ -> u       bb     )
     1.71582912E-05    2           2        -3   # BR(H+ -> u       sb     )
     3.37755643E-04    2           4        -3   # BR(H+ -> c       sb     )
     7.89752719E-01    2           6        -5   # BR(H+ -> t       bb     )
     6.35447152E-06    2          24        25   # BR(H+ -> W+      h      )
     1.07553023E-11    2          24        36   # BR(H+ -> W+      A      )
     4.67350887E-02    2     1000024   1000022   # BR(H+ -> ~chi_1+ ~chi_10)
     2.89780372E-06    2     1000024   1000023   # BR(H+ -> ~chi_1+ ~chi_20)
     2.78288885E-02    2     1000024   1000025   # BR(H+ -> ~chi_1+ ~chi_30)
