#
#                              ======================
#                              | THE SUSYHIT OUTPUT |
#                              ======================
#
#
#              ------------------------------------------------------
#              |     This is the output of the SUSY-HIT package     |
#              |  created by A.Djouadi, M.Muehlleitner and M.Spira. |
#              |  In case of problems with SUSY-HIT email to        |
#              |           margarete.muehlleitner@cern.ch           |
#              |           michael.spira@psi.ch                     |
#              |           abdelhak.djouadi@cern.ch                 |
#              ------------------------------------------------------
#
#              ------------------------------------------------------
#              |  SUSY Les Houches Accord - MSSM Spectrum + Decays  |
#              |              based on the decay programs           |
#              |                                                    |
#              |                     SDECAY 1.3b                    |
#              |                                                    |
#              |  Authors: M.Muhlleitner, A.Djouadi and Y.Mambrini  |
#              |  Ref.:    Comput.Phys.Commun.168(2005)46           |
#              |           [hep-ph/0311167]                         |
#              |                                                    |
#              |                     HDECAY 3.4                     |
#              |                                                    |
#              |  By: A.Djouadi,J.Kalinowski,M.Muhlleitner,M.Spira  |
#              |  Ref.:    Comput.Phys.Commun.108(1998)56           |
#              |           [hep-ph/9704448]                         |
#              |                                                    |
#              |                                                    |
#              |  If not stated otherwise all DRbar couplings and   |
#              |  soft SUSY breaking masses are given at the scale  |
#              |  Q=  0.32563740E+04
#              |                                                    |
#              ------------------------------------------------------
#
#
BLOCK DCINFO  # Decay Program information
     1   SDECAY/HDECAY # decay calculator
     2   1.3b  /3.4    # version number
#
BLOCK SPINFO  # Spectrum calculator information
     1     SOFTSUSY    # spectrum calculator               
     2     3.4.0       # version number                    
#
BLOCK MODSEL  # Model selection
     1     0   #  nonUniversal                                     
#
BLOCK SMINPUTS  # Standard Model inputs
         1     1.27908970E+02   # alpha_em^-1(M_Z)^MSbar
         2     1.16637870E-05   # G_F [GeV^-2]
         3     1.18400000E-01   # alpha_S(M_Z)^MSbar
         4     9.11876000E+01   # M_Z pole mass
         5     4.18000000E+00   # mb(mb)^MSbar
         6     1.73200000E+02   # mt pole mass
         7     1.77700000E+00   # mtau pole mass
#
BLOCK MINPAR  # Input parameters - minimal models
         3     4.17600000E+01   # tanb                
#
BLOCK EXTPAR  # Input parameters - non-minimal models
         0    -1.00000000E+00   # Set                 
         1     2.41557000E+03   # M_1(MX)             
         2    -3.78981000E+03   # M_2(MX)             
         3     3.51515000E+03   # M_3(MX)             
        11     4.29641000E+03   # At(MX)              
        12     2.20724000E+03   # Ab(MX)              
        13     2.26288000E+03   # Atau(MX)            
        23     2.72130000E+02   # mu(MX)              
        26     2.52099000E+03   # mA(pole)            
        31     3.09383000E+03   # meL(MX)             
        32     3.09383000E+03   # mmuL(MX)            
        33     2.28065000E+03   # mtauL(MX)           
        34     2.06541000E+03   # meR(MX)             
        35     2.06541000E+03   # mmuR(MX)            
        36     2.74439000E+03   # mtauR(MX)           
        41     7.84660000E+02   # mqL1(MX)            
        42     7.84660000E+02   # mqL2(MX)            
        43     2.80086000E+03   # mqL3(MX)            
        44     2.15394000E+03   # muR(MX)             
        45     2.15394000E+03   # mcR(MX)             
        46     3.78549000E+03   # mtR(MX)             
        47     3.99762000E+03   # mdR(MX)             
        48     3.99762000E+03   # msR(MX)             
        49     2.18883000E+03   # mbR(MX)             
#
BLOCK MASS  # Mass Spectrum
# PDG code           mass       particle
        24     8.03959652E+01   # W+
        25     1.26867872E+02   # h
        35     2.52099517E+03   # H
        36     2.52098993E+03   # A
        37     2.52272166E+03   # H+
         5     4.81876030E+00   # b-quark pole mass calculated from mb(mb)_Msbar
   1000001     1.06245925E+03   # ~d_L
   2000001     4.09262736E+03   # ~d_R
   1000002     1.05950566E+03   # ~u_L
   2000002     2.29567079E+03   # ~u_R
   1000003     1.06245925E+03   # ~s_L
   2000003     4.09262736E+03   # ~s_R
   1000004     1.05950566E+03   # ~c_L
   2000004     2.29567079E+03   # ~c_R
   1000005     2.30469394E+03   # ~b_1
   2000005     2.90837045E+03   # ~b_2
   1000006     2.90123444E+03   # ~t_1
   2000006     3.80716415E+03   # ~t_2
   1000011     3.12173693E+03   # ~e_L
   2000011     2.08272102E+03   # ~e_R
   1000012     3.12041852E+03   # ~nu_eL
   1000013     3.12173693E+03   # ~mu_L
   2000013     2.08272102E+03   # ~mu_R
   1000014     3.12041852E+03   # ~nu_muL
   1000015     2.30400838E+03   # ~tau_1
   2000015     2.74188701E+03   # ~tau_2
   1000016     2.30237251E+03   # ~nu_tauL
   1000021     3.59451433E+03   # ~g
   1000022    -2.86665309E+02   # ~chi_10
   1000023     2.87648788E+02   # ~chi_20
   1000025     2.38049927E+03   # ~chi_30
   1000035    -3.74190163E+03   # ~chi_40
   1000024     2.87515528E+02   # ~chi_1+
   1000037     3.74206686E+03   # ~chi_2+
#
BLOCK NMIX  # Neutralino Mixing Matrix
  1  1    -1.12401380E-02   # N_11
  1  2    -1.57170827E-02   # N_12
  1  3     7.07717461E-01   # N_13
  1  4     7.06231285E-01   # N_14
  2  1    -1.50525268E-02   # N_21
  2  2    -1.42042022E-02   # N_22
  2  3    -7.06489653E-01   # N_23
  2  4     7.07420690E-01   # N_24
  3  1     9.99823512E-01   # N_31
  3  2    -2.33278935E-04   # N_32
  3  3    -2.67991441E-03   # N_33
  3  4     1.85932148E-02   # N_34
  4  1    -1.57268847E-04   # N_41
  4  2     9.99775555E-01   # N_42
  4  3     1.08775096E-03   # N_43
  4  4     2.11573281E-02   # N_44
#
BLOCK UMIX  # Chargino Mixing Matrix U
  1  1    -1.53986118E-03   # U_11
  1  2     9.99998814E-01   # U_12
  2  1    -9.99998814E-01   # U_21
  2  2    -1.53986118E-03   # U_22
#
BLOCK VMIX  # Chargino Mixing Matrix V
  1  1     2.99265307E-02   # V_11
  1  2     9.99552101E-01   # V_12
  2  1     9.99552101E-01   # V_21
  2  2    -2.99265307E-02   # V_22
#
BLOCK STOPMIX  # Stop Mixing Matrix
  1  1     9.95406190E-01   # cos(theta_t)
  1  2    -9.57419287E-02   # sin(theta_t)
  2  1     9.57419287E-02   # -sin(theta_t)
  2  2     9.95406190E-01   # cos(theta_t)
#
BLOCK SBOTMIX  # Sbottom Mixing Matrix
  1  1     6.49444843E-03   # cos(theta_b)
  1  2     9.99978911E-01   # sin(theta_b)
  2  1    -9.99978911E-01   # -sin(theta_b)
  2  2     6.49444843E-03   # cos(theta_b)
#
BLOCK STAUMIX  # Stau Mixing Matrix
  1  1     9.99974832E-01   # cos(theta_tau)
  1  2     7.09474218E-03   # sin(theta_tau)
  2  1    -7.09474218E-03   # -sin(theta_tau)
  2  2     9.99974832E-01   # cos(theta_tau)
#
BLOCK ALPHA  # Higgs mixing
          -2.46693058E-02   # Mixing angle in the neutral Higgs boson sector
#
BLOCK HMIX Q=  3.25637400E+03  # DRbar Higgs Parameters
         1     2.78517590E+02   # mu(Q)MSSM           
         2     4.06872282E+01   # tan                 
         3     2.42923313E+02   # higgs               
         4     6.17126840E+06   # mA^2(Q)MSSM         
#
BLOCK GAUGE Q=  3.25637400E+03  # The gauge couplings
     1     3.65421646E-01   # gprime(Q) DRbar
     2     6.37332685E-01   # g(Q) DRbar
     3     1.00691867E+00   # g3(Q) DRbar
#
BLOCK AU Q=  3.25637400E+03  # The trilinear couplings
  1  1     0.00000000E+00   # A_u(Q) DRbar
  2  2     0.00000000E+00   # A_c(Q) DRbar
  3  3     4.29641002E+03   # A_t(Q) DRbar
#
BLOCK AD Q=  3.25637400E+03  # The trilinear couplings
  1  1     0.00000000E+00   # A_d(Q) DRbar
  2  2     0.00000000E+00   # A_s(Q) DRbar
  3  3     2.20724001E+03   # A_b(Q) DRbar
#
BLOCK AE Q=  3.25637400E+03  # The trilinear couplings
  1  1     0.00000000E+00   # A_e(Q) DRbar
  2  2     0.00000000E+00   # A_mu(Q) DRbar
  3  3     2.26288000E+03   # A_tau(Q) DRbar
#
BLOCK Yu Q=  3.25637400E+03  # The Yukawa couplings
  1  1     0.00000000E+00   # y_u(Q) DRbar
  2  2     0.00000000E+00   # y_c(Q) DRbar
  3  3     8.30158593E-01   # y_t(Q) DRbar
#
BLOCK Yd Q=  3.25637400E+03  # The Yukawa couplings
  1  1     0.00000000E+00   # y_d(Q) DRbar
  2  2     0.00000000E+00   # y_s(Q) DRbar
  3  3     5.20394099E-01   # y_b(Q) DRbar
#
BLOCK Ye Q=  3.25637400E+03  # The Yukawa couplings
  1  1     0.00000000E+00   # y_e(Q) DRbar
  2  2     0.00000000E+00   # y_mu(Q) DRbar
  3  3     4.09314544E-01   # y_tau(Q) DRbar
#
BLOCK MSOFT Q=  3.25637400E+03  # The soft SUSY breaking masses at the scale Q
         1     2.41557000E+03   # M_1(Q)              
         2    -3.78981000E+03   # M_2(Q)              
         3     3.51515000E+03   # M_3(Q)              
        21     6.36597765E+06   # mH1^2(Q)            
        22     7.69247852E+04   # mH2^2(Q)            
        31     3.09383000E+03   # meL(Q)              
        32     3.09383000E+03   # mmuL(Q)             
        33     2.28065000E+03   # mtauL(Q)            
        34     2.06541000E+03   # meR(Q)              
        35     2.06541000E+03   # mmuR(Q)             
        36     2.74439000E+03   # mtauR(Q)            
        41     7.84659949E+02   # mqL1(Q)             
        42     7.84659949E+02   # mqL2(Q)             
        43     2.80085998E+03   # mqL3(Q)             
        44     2.15393998E+03   # muR(Q)              
        45     2.15393998E+03   # mcR(Q)              
        46     3.78548998E+03   # mtR(Q)              
        47     3.99761999E+03   # mdR(Q)              
        48     3.99761999E+03   # msR(Q)              
        49     2.18882998E+03   # mbR(Q)              
#
Block HiggsBoundsInputHiggsCouplingsFermions
# ScalarNormEffCoupSq PseudoSNormEffCoupSq NP   IP1 IP2 IP2
    1.00786933E+00    0.00000000E+00        3  25   5   5  # h0-b-b eff. coupling^2, normalised to SM
    1.65544267E+03    0.00000000E+00        3  35   5   5  # H0-b-b eff. coupling^2, normalised to SM
    0.00000000E+00    1.65545054E+03        3  36   5   5  # A0-b-b eff. coupling^2, normalised to SM
#
    9.99995246E-01    0.00000000E+00        3  25   6   6  # h0-t-t eff. coupling^2, normalised to SM
    6.08818748E-04    0.00000000E+00        3  35   6   6  # H0-t-t eff. coupling^2, normalised to SM
    0.00000000E+00    6.04065163E-04        3  36   6   6  # A0-t-t eff. coupling^2, normalised to SM
#
    1.00786933E+00    0.00000000E+00        3  25  15  15  # h0-tau-tau eff. coupling^2, normalised to SM
    1.65544267E+03    0.00000000E+00        3  35  15  15  # H0-tau-tau eff. coupling^2, normalised to SM
    0.00000000E+00    1.65545054E+03        3  36  15  15  # A0-tau-tau eff. coupling^2, normalised to SM
#
Block HiggsBoundsInputHiggsCouplingsBosons
    9.99999991E-01        3  25  24  24  # h0-W-W eff. coupling^2, normalised to SM
    9.31528229E-09        3  35  24  24  # H0-W-W eff. coupling^2, normalised to SM
    0.00000000E+00        3  36  24  24  # A0-W-W eff. coupling^2, normalised to SM
#
    9.99999991E-01        3  25  23  23  # h0-Z-Z eff. coupling^2, normalised to SM
    9.31528229E-09        3  35  23  23  # H0-Z-Z eff. coupling^2, normalised to SM
    0.00000000E+00        3  36  23  23  # A0-Z-Z eff. coupling^2, normalised to SM
#
    8.88154320E-01        3  25  21  21  # h0-g-g eff. coupling^2, normalised to SM
    7.57454243E-12        3  35  21  21  # H0-g-g eff. coupling^2, normalised to SM
    2.74016126E-11        3  36  21  21  # A0-g-g eff. coupling^2, normalised to SM
#
    0.00000000E+00        3  25  25  23  # h0-h0-Z eff. coupling^2, normalised to SM
    0.00000000E+00        3  35  25  23  # H0-h0-Z eff. coupling^2, normalised to SM
    9.31528229E-09        3  36  25  23  # A0-h0-Z eff. coupling^2, normalised to SM
    0.00000000E+00        3  35  35  23  # H0-H0-Z eff. coupling^2, normalised to SM
    9.99999991E-01        3  36  35  23  # A0-H0-Z eff. coupling^2, normalised to SM
    0.00000000E+00        3  36  36  23  # A0-A0-Z eff. coupling^2, normalised to SM
#
    0.00000000E+00        4  25  21  21  23  # h0-g-g-Z eff. coupling^2, normalised to SM
    0.00000000E+00        4  35  21  21  23  # H0-g-g-Z eff. coupling^2, normalised to SM
    0.00000000E+00        4  36  21  21  23  # A0-g-g-Z eff. coupling^2, normalised to SM
#
#
#
#                             =================
#                             |The decay table|
#                             =================
#
# - The QCD corrections to the decays gluino -> squark  + quark
#                                     squark -> gaugino + quark_prime
#                                     squark -> squark_prime + Higgs
#                                     squark -> gluino  + quark
#   are included.
#
# - The multi-body decays for the inos, stops and sbottoms are included.
#
# - The loop induced decays for the gluino, neutralinos and stops
#   are included.
#
# - The SUSY decays of the top quark are included.
#
#
#         PDG            Width
DECAY         6     1.43028216E+00   # top decays
#          BR         NDA      ID1       ID2
     1.00000000E+00    2           5        24   # BR(t ->  b    W+)
#
#         PDG            Width
DECAY   1000021     3.27453407E+02   # gluino decays
#          BR         NDA      ID1       ID2
     8.99940221E-02    2     1000001        -1   # BR(~g -> ~d_L  db)
     8.99940221E-02    2    -1000001         1   # BR(~g -> ~d_L* d )
     9.00897130E-02    2     1000002        -2   # BR(~g -> ~u_L  ub)
     9.00897130E-02    2    -1000002         2   # BR(~g -> ~u_L* u )
     3.78818677E-02    2     2000002        -2   # BR(~g -> ~u_R  ub)
     3.78818677E-02    2    -2000002         2   # BR(~g -> ~u_R* u )
     8.99940221E-02    2     1000003        -3   # BR(~g -> ~s_L  sb)
     8.99940221E-02    2    -1000003         3   # BR(~g -> ~s_L* s )
     9.00897092E-02    2     1000004        -4   # BR(~g -> ~c_L  cb)
     9.00897092E-02    2    -1000004         4   # BR(~g -> ~c_L* c )
     3.78818498E-02    2     2000004        -4   # BR(~g -> ~c_R  cb)
     3.78818498E-02    2    -2000004         4   # BR(~g -> ~c_R* c )
     3.75073481E-02    2     1000005        -5   # BR(~g -> ~b_1  bb)
     3.75073481E-02    2    -1000005         5   # BR(~g -> ~b_1* b )
     1.30113952E-02    2     2000005        -5   # BR(~g -> ~b_2  bb)
     1.30113952E-02    2    -2000005         5   # BR(~g -> ~b_2* b )
     1.35500727E-02    2     1000006        -6   # BR(~g -> ~t_1  tb)
     1.35500727E-02    2    -1000006         6   # BR(~g -> ~t_1* t )
#
#         PDG            Width
DECAY   1000006     5.45428476E+01   # stop1 decays
#          BR         NDA      ID1       ID2
     3.53710048E-01    2     1000022         6   # BR(~t_1 -> ~chi_10 t )
     3.56502128E-01    2     1000023         6   # BR(~t_1 -> ~chi_20 t )
     7.32119555E-04    2     1000025         6   # BR(~t_1 -> ~chi_30 t )
     2.88484382E-01    2     1000024         5   # BR(~t_1 -> ~chi_1+ b )
     5.71322085E-04    2     1000005        24   # BR(~t_1 -> ~b_1    W+)
#
#         PDG            Width
DECAY   2000006     1.54754993E+02   # stop2 decays
#          BR         NDA      ID1       ID2
     1.65647149E-01    2     1000022         6   # BR(~t_2 -> ~chi_10 t )
     1.65815708E-01    2     1000023         6   # BR(~t_2 -> ~chi_20 t )
     2.12947282E-02    2     1000025         6   # BR(~t_2 -> ~chi_30 t )
     3.29839960E-01    2     1000024         5   # BR(~t_2 -> ~chi_1+ b )
     4.12214922E-06    2     1000037         5   # BR(~t_2 -> ~chi_2+ b )
     1.02427668E-02    2     1000021         6   # BR(~t_2 -> ~g      t )
     8.55104836E-02    2     1000006        25   # BR(~t_2 -> ~t_1    h )
     7.58775387E-02    2     1000006        23   # BR(~t_2 -> ~t_1    Z )
     2.18152502E-05    2     1000005        24   # BR(~t_2 -> ~b_1    W+)
     1.45745729E-01    2     2000005        24   # BR(~t_2 -> ~b_2    W+)
#
#         PDG            Width
DECAY   1000005     2.39244983E+01   # sbottom1 decays
#          BR         NDA      ID1       ID2
     2.52008172E-01    2     1000022         5   # BR(~b_1 -> ~chi_10 b )
     2.51022615E-01    2     1000023         5   # BR(~b_1 -> ~chi_20 b )
     4.96969213E-01    2    -1000024         6   # BR(~b_1 -> ~chi_1- t )
#
#         PDG            Width
DECAY   2000005     5.42324175E+01   # sbottom2 decays
#          BR         NDA      ID1       ID2
     1.41932507E-01    2     1000022         5   # BR(~b_2 -> ~chi_10 b )
     1.41444018E-01    2     1000023         5   # BR(~b_2 -> ~chi_20 b )
     8.65274080E-04    2     1000025         5   # BR(~b_2 -> ~chi_30 b )
     7.15140649E-01    2    -1000024         6   # BR(~b_2 -> ~chi_1- t )
     3.10446753E-04    2     1000005        25   # BR(~b_2 -> ~b_1    h )
     3.07104656E-04    2     1000005        23   # BR(~b_2 -> ~b_1    Z )
#
#         PDG            Width
DECAY   1000002     9.18126724E-03   # sup_L decays
#          BR         NDA      ID1       ID2
     1.32979476E-01    2     1000022         2   # BR(~u_L -> ~chi_10 u)
     1.21429234E-01    2     1000023         2   # BR(~u_L -> ~chi_20 u)
     7.45591290E-01    2     1000024         1   # BR(~u_L -> ~chi_1+ d)
#
#         PDG            Width
DECAY   2000002     4.66683480E-02   # sup_R decays
#           BR         NDA      ID1       ID2
     1.42303150E-02    2     1000022         2   # BR(~u_R -> ~chi_10 u)
     2.55151316E-02    2     1000023         2   # BR(~u_R -> ~chi_20 u)
#           BR         NDA      ID1       ID2       ID3
     1.85755450E-01    3        2       -1        1000001   # BR(~u_R -> u  db  ~d_L)
     4.15892159E-02    3        2       1        -1000001   # BR(~u_R -> u  d  ~d_L*)
     1.87353964E-01    3        2       -2        1000002   # BR(~u_R -> u  ub  ~u_L)
     4.27056042E-02    3        2       2        -1000002   # BR(~u_R -> u  u  ~u_L*)
     1.85110473E-01    3        2       -3        1000003   # BR(~u_R -> u  sb  ~s_L)
     4.21763376E-02    3        2       3        -1000003   # BR(~u_R -> u  s  ~s_L*)
     1.90008868E-01    3        2       -4        1000004   # BR(~u_R -> u  cb  ~c_L)
     4.21463386E-02    3        2       4        -1000004   # BR(~u_R -> u  c  ~c_L*)
     2.32084495E-05    3        2       -11        2000011   # BR(~u_R -> u  e+  ~e_R-)
     2.79375649E-05    3        2       11        -2000011   # BR(~u_R -> u  e-  ~e_R+)
     2.34955820E-05    3        2       -13        2000013   # BR(~u_R -> u  mu+  ~mu_R-)
     2.72197336E-05    3        2       13        -2000013   # BR(~u_R -> u  mu-  ~mu_R+)
     7.54537100E-03    3        2       23        1000022   # BR(~u_R -> u  Z  ~chi_10)
     3.33073714E-03    3        2       25        1000022   # BR(~u_R -> u  h  ~chi_10)
     3.64936852E-03    3        2       23        1000023   # BR(~u_R -> u  Z  ~chi_20)
     7.15388511E-03    3        2       25        1000023   # BR(~u_R -> u  h  ~chi_20)
     6.38162722E-03    3        2       -24        1000024   # BR(~u_R -> u  W-  ~chi_1+)
     1.52454507E-02    3        2       24        -1000024   # BR(~u_R -> u  W+  ~chi_1-)
#
#         PDG            Width
DECAY   1000001     1.21699976E-03   # sdown_L decays
#          BR         NDA      ID1       ID2
     5.80758907E-01    2     1000022         1   # BR(~d_L -> ~chi_10 d)
     4.04296000E-01    2     1000023         1   # BR(~d_L -> ~chi_20 d)
     1.49450931E-02    2    -1000024         2   # BR(~d_L -> ~chi_1- u)
#
#         PDG            Width
DECAY   2000001     1.71081312E+01   # sdown_R decays
#          BR         NDA      ID1       ID2
     1.68208059E-05    2     1000022         1   # BR(~d_R -> ~chi_10 d)
     3.01644387E-05    2     1000023         1   # BR(~d_R -> ~chi_20 d)
     5.95683033E-02    2     1000025         1   # BR(~d_R -> ~chi_30 d)
     9.50941304E-11    2     1000035         1   # BR(~d_R -> ~chi_40 d)
     9.40384711E-01    2     1000021         1   # BR(~d_R -> ~g      d)
#
#         PDG            Width
DECAY   1000004     8.82544209E-03   # scharm_L decays
#          BR         NDA      ID1       ID2
     1.32979477E-01    2     1000022         4   # BR(~c_L -> ~chi_10 c)
     1.21428645E-01    2     1000023         4   # BR(~c_L -> ~chi_20 c)
     7.45591878E-01    2     1000024         3   # BR(~c_L -> ~chi_1+ s)
#
#         PDG            Width
DECAY   2000004     4.67875504E-02   # scharm_R decays
#           BR         NDA      ID1       ID2
     1.41852786E-02    2     1000022         4   # BR(~c_R -> ~chi_10 c)
     2.54342437E-02    2     1000023         4   # BR(~c_R -> ~chi_20 c)
#           BR         NDA      ID1       ID2       ID3
     1.87577677E-01    3        4       -1        1000001   # BR(~c_R -> c  db  ~d_L)
     4.17675211E-02    3        4       1        -1000001   # BR(~c_R -> c  d  ~d_L*)
     1.86902283E-01    3        4       -2        1000002   # BR(~c_R -> c  ub  ~u_L)
     4.17461479E-02    3        4       2        -1000002   # BR(~c_R -> c  u  ~u_L*)
     1.84720079E-01    3        4       -3        1000003   # BR(~c_R -> c  sb  ~s_L)
     4.22355944E-02    3        4       3        -1000003   # BR(~c_R -> c  s  ~s_L*)
     1.89550424E-01    3        4       -4        1000004   # BR(~c_R -> c  cb  ~c_L)
     4.23809322E-02    3        4       4        -1000004   # BR(~c_R -> c  c  ~c_L*)
     2.34934291E-05    3        4       -11        2000011   # BR(~c_R -> c  e+  ~e_R-)
     2.74517471E-05    3        4       11        -2000011   # BR(~c_R -> c  e-  ~e_R+)
     2.34079363E-05    3        4       -13        2000013   # BR(~c_R -> c  mu+  ~mu_R-)
     2.73833528E-05    3        4       13        -2000013   # BR(~c_R -> c  mu-  ~mu_R+)
     7.52251394E-03    3        4       23        1000022   # BR(~c_R -> c  Z  ~chi_10)
     3.32203757E-03    3        4       25        1000022   # BR(~c_R -> c  h  ~chi_10)
     3.63686490E-03    3        4       23        1000023   # BR(~c_R -> c  Z  ~chi_20)
     7.18930564E-03    3        4       25        1000023   # BR(~c_R -> c  h  ~chi_20)
     6.51027885E-03    3        4       -24        1000024   # BR(~c_R -> c  W-  ~chi_1+)
     1.52170822E-02    3        4       24        -1000024   # BR(~c_R -> c  W+  ~chi_1-)
#
#         PDG            Width
DECAY   1000003     1.16999164E-03   # sstrange_L decays
#          BR         NDA      ID1       ID2
     5.80760108E-01    2     1000022         3   # BR(~s_L -> ~chi_10 s)
     4.04294873E-01    2     1000023         3   # BR(~s_L -> ~chi_20 s)
     1.49450190E-02    2    -1000024         4   # BR(~s_L -> ~chi_1- c)
#
#         PDG            Width
DECAY   2000003     1.25627333E+01   # sstrange_R decays
#          BR         NDA      ID1       ID2
     2.40599961E-05    2     1000022         3   # BR(~s_R -> ~chi_10 s)
     4.31461103E-05    2     1000023         3   # BR(~s_R -> ~chi_20 s)
     8.41710647E-02    2     1000025         3   # BR(~s_R -> ~chi_30 s)
     1.28015296E-10    2     1000035         3   # BR(~s_R -> ~chi_40 s)
     9.15761729E-01    2     1000021         3   # BR(~s_R -> ~g      s)
#
#         PDG            Width
DECAY   1000011     7.38030088E-01   # selectron_L decays
#          BR         NDA      ID1       ID2
     8.25290717E-03    2     1000022        11   # BR(~e_L -> ~chi_10 e-)
     8.76073210E-03    2     1000023        11   # BR(~e_L -> ~chi_20 e-)
     9.82906681E-01    2     1000025        11   # BR(~e_L -> ~chi_30 e-)
     7.96798606E-05    2    -1000024        12   # BR(~e_L -> ~chi_1- nu_e)
#
#         PDG            Width
DECAY   2000011     6.25635893E-03   # selectron_R decays
#           BR         NDA      ID1       ID2
     2.15074228E-01    2     1000022        11   # BR(~e_R -> ~chi_10 e-)
     3.85610287E-01    2     1000023        11   # BR(~e_R -> ~chi_20 e-)
#           BR         NDA      ID1       ID2       ID3
     6.58785732E-03    3        11       -1        1000001   # BR(~e_R- -> e-  db  ~d_L)
     3.14176348E-03    3        11       1        -1000001   # BR(~e_R- -> e-  d  ~d_L*)
     6.63644789E-03    3        11       -2        1000002   # BR(~e_R- -> e-  ub  ~u_L)
     3.12194364E-03    3        11       2        -1000002   # BR(~e_R- -> e-  u  ~u_L*)
     6.63405033E-03    3        11       -3        1000003   # BR(~e_R- -> e-  sb  ~s_L)
     3.13888641E-03    3        11       3        -1000003   # BR(~e_R- -> e-  s  ~s_L*)
     6.76607600E-03    3        11       -4        1000004   # BR(~e_R- -> e-  cb  ~c_L)
     3.11570999E-03    3        11       4        -1000004   # BR(~e_R- -> e-  c  ~c_L*)
     6.08932455E-02    3        11       23        1000022   # BR(~e_R- -> e-  Z  ~chi_10)
     2.63188225E-02    3        11       25        1000022   # BR(~e_R- -> e-  h  ~chi_10)
     2.65937428E-02    3        11       23        1000023   # BR(~e_R- -> e-  Z  ~chi_20)
     6.10786568E-02    3        11       25        1000023   # BR(~e_R- -> e-  h  ~chi_20)
     4.33462982E-02    3        11       -24        1000024   # BR(~e_R- -> e-  W-  ~chi_1+)
     1.41941984E-01    3        11       24        -1000024   # BR(~e_R- -> e-  W+  ~chi_1-)
#
#         PDG            Width
DECAY   1000013     7.38030079E-01   # smuon_L decays
#          BR         NDA      ID1       ID2
     8.25290725E-03    2     1000022        13   # BR(~mu_L -> ~chi_10 mu-)
     8.76073219E-03    2     1000023        13   # BR(~mu_L -> ~chi_20 mu-)
     9.82906681E-01    2     1000025        13   # BR(~mu_L -> ~chi_30 mu-)
     7.96798616E-05    2    -1000024        14   # BR(~mu_L -> ~chi_1- nu_mu)
#
#         PDG            Width
DECAY   2000013     6.25125591E-03   # smuon_R decays
#           BR         NDA      ID1       ID2
     2.15249796E-01    2     1000022        13   # BR(~mu_R -> ~chi_10 mu-)
     3.85925066E-01    2     1000023        13   # BR(~mu_R -> ~chi_20 mu-)
#           BR         NDA      ID1       ID2       ID3
     6.59323512E-03    3        13       -1        1000001   # BR(~mu_R- -> mu-  db  ~d_L)
     3.14432816E-03    3        13       1        -1000001   # BR(~mu_R- -> mu-  d  ~d_L*)
     6.64522467E-03    3        13       -2        1000002   # BR(~mu_R- -> mu-  ub  ~u_L)
     3.11633379E-03    3        13       2        -1000002   # BR(~mu_R- -> mu-  u  ~u_L*)
     6.63946583E-03    3        13       -3        1000003   # BR(~mu_R- -> mu-  sb  ~s_L)
     3.14144874E-03    3        13       3        -1000003   # BR(~mu_R- -> mu-  s  ~s_L*)
     6.61595055E-03    3        13       -4        1000004   # BR(~mu_R- -> mu-  cb  ~c_L)
     3.11825340E-03    3        13       4        -1000004   # BR(~mu_R- -> mu-  c  ~c_L*)
     6.09429538E-02    3        13       23        1000022   # BR(~mu_R- -> mu-  Z  ~chi_10)
     2.63403070E-02    3        13       25        1000022   # BR(~mu_R- -> mu-  h  ~chi_10)
     2.66154517E-02    3        13       23        1000023   # BR(~mu_R- -> mu-  Z  ~chi_20)
     6.11285165E-02    3        13       25        1000023   # BR(~mu_R- -> mu-  h  ~chi_20)
     4.27258144E-02    3        13       -24        1000024   # BR(~mu_R- -> mu-  W-  ~chi_1+)
     1.42057854E-01    3        13       24        -1000024   # BR(~mu_R- -> mu-  W+  ~chi_1-)
#
#         PDG            Width
DECAY   1000015     7.45284029E+00   # stau_1 decays
#          BR         NDA      ID1       ID2
     5.00940900E-01    2     1000022        15   # BR(~tau_1 -> ~chi_10  tau-)
     4.98969125E-01    2     1000023        15   # BR(~tau_1 -> ~chi_20  tau-)
     8.99749908E-05    2    -1000024        16   # BR(~tau_1 -> ~chi_1-  nu_tau)
#
#         PDG            Width
DECAY   2000015     1.87974388E+01   # stau_2 decays
#          BR         NDA      ID1       ID2
     2.38259764E-01    2     1000022        15   # BR(~tau_2 -> ~chi_10  tau-)
     2.37552325E-01    2     1000023        15   # BR(~tau_2 -> ~chi_20  tau-)
     4.69699334E-02    2     1000025        15   # BR(~tau_2 -> ~chi_30  tau-)
     4.75503864E-01    2    -1000024        16   # BR(~tau_2 -> ~chi_1-  nu_tau)
     8.40555225E-04    2     1000016       -24   # BR(~tau_2 -> ~nu_tauL W-)
     4.50542490E-04    2     1000015        25   # BR(~tau_2 -> ~tau_1   h)
     4.23016017E-04    2     1000015        23   # BR(~tau_2 -> ~tau_1   Z)
#
#         PDG            Width
DECAY   1000012     7.48237091E-01   # snu_eL decays
#          BR         NDA      ID1       ID2
     1.42439779E-03    2     1000022        12   # BR(~nu_eL -> ~chi_10 nu_e)
     5.14607859E-04    2     1000023        12   # BR(~nu_eL -> ~chi_20 nu_e)
     9.68389237E-01    2     1000025        12   # BR(~nu_eL -> ~chi_30 nu_e)
     2.96717574E-02    2     1000024        11   # BR(~nu_eL -> ~chi_1+ e-)
#
#         PDG            Width
DECAY   1000014     7.48237091E-01   # snu_muL decays
#          BR         NDA      ID1       ID2
     1.42439779E-03    2     1000022        14   # BR(~nu_muL -> ~chi_10 nu_mu)
     5.14607859E-04    2     1000023        14   # BR(~nu_muL -> ~chi_20 nu_mu)
     9.68389237E-01    2     1000025        14   # BR(~nu_muL -> ~chi_30 nu_mu)
     2.96717574E-02    2     1000024        13   # BR(~nu_muL -> ~chi_1+ mu-)
#
#         PDG            Width
DECAY   1000016     7.45380408E+00   # snu_tauL decays
#          BR         NDA      ID1       ID2
     1.04003107E-04    2     1000022        16   # BR(~nu_tauL -> ~chi_10 nu_tau)
     3.75706093E-05    2     1000023        16   # BR(~nu_tauL -> ~chi_20 nu_tau)
     9.99858426E-01    2     1000024        15   # BR(~nu_tauL -> ~chi_1+ tau-)
#
#         PDG            Width
DECAY   1000024     1.60781290E-12   # chargino1+ decays
#           BR         NDA      ID1       ID2       ID3
     1.60885680E-01    3     1000022       -11        12   # BR(~chi_1+ -> ~chi_10 e+   nu_e)
     1.49190720E-01    3     1000022       -13        14   # BR(~chi_1+ -> ~chi_10 mu+  nu_mu)
     5.62224920E-01    2     1000022       211             # BR(~chi_1+ -> ~chi_10 pi+)
     1.26637930E-01    3     1000022       211        111   # BR(~chi_1+ -> ~chi_10 pi+ pi0)
     5.30376550E-04    4     1000022       211        111       111 # BR(~chi_1+ -> ~chi_10 pi+ pi0 pi0)
     5.30376550E-04    4     1000022       211        211      -211 # BR(~chi_1+ -> ~chi_10 pi+ pi+ pi-)
#
#         PDG            Width
DECAY   1000037     2.16586104E+02   # chargino2+ decays
#          BR         NDA      ID1       ID2
     1.69710115E-01    2     1000002        -1   # BR(~chi_2+ -> ~u_L     db)
     1.69698790E-01    2    -1000001         2   # BR(~chi_2+ -> ~d_L*    u )
     1.69710115E-01    2     1000004        -3   # BR(~chi_2+ -> ~c_L     sb)
     1.69698784E-01    2    -1000003         4   # BR(~chi_2+ -> ~s_L*     c )
     3.27434952E-02    2     1000006        -5   # BR(~chi_2+ -> ~t_1     bb)
     2.17694029E-06    2    -1000005         6   # BR(~chi_2+ -> ~b_1*    t )
     3.17420163E-02    2    -2000005         6   # BR(~chi_2+ -> ~b_2*    t )
     6.47337264E-03    2     1000012       -11   # BR(~chi_2+ -> ~nu_eL   e+  )
     6.47337264E-03    2     1000014       -13   # BR(~chi_2+ -> ~nu_muL mu+ )
     2.69359555E-02    2     1000016       -15   # BR(~chi_2+ -> ~nu_tau1 tau+)
     6.45418598E-03    2    -1000011        12   # BR(~chi_2+ -> ~e_L+    nu_e)
     6.45418598E-03    2    -1000013        14   # BR(~chi_2+ -> ~mu_L+   nu_mu)
     2.69115380E-02    2    -1000015        16   # BR(~chi_2+ -> ~tau_1+  nu_tau)
     9.78405465E-07    2    -2000015        16   # BR(~chi_2+ -> ~tau_2+  nu_tau)
     3.44184941E-02    2     1000024        23   # BR(~chi_2+ -> ~chi_1+  Z )
     3.32815904E-02    2     1000022        24   # BR(~chi_2+ -> ~chi_10  W+)
     3.33989895E-02    2     1000023        24   # BR(~chi_2+ -> ~chi_20  W+)
     2.58793016E-06    2     1000025        24   # BR(~chi_2+ -> ~chi_30  W+)
     3.45287498E-02    2     1000024        25   # BR(~chi_2+ -> ~chi_1+  h )
     1.03475351E-02    2     1000024        35   # BR(~chi_2+ -> ~chi_1+  H )
     1.03476771E-02    2     1000024        36   # BR(~chi_2+ -> ~chi_1+  A )
     1.03515034E-02    2     1000022        37   # BR(~chi_2+ -> ~chi_10  H+)
     1.03137909E-02    2     1000023        37   # BR(~chi_2+ -> ~chi_20  H+)
#
#         PDG            Width
DECAY   1000022     0.00000000E+00   # neutralino1 decays
#
#         PDG            Width
DECAY   1000023     2.09353640E-12   # neutralino2 decays
#          BR         NDA      ID1       ID2
     6.90135623E-01    2     1000022        22   # BR(~chi_20 -> ~chi_10 gam)
#           BR         NDA      ID1       ID2       ID3
     5.17504712E-02    3     1000022        -2         2   # BR(~chi_20 -> ~chi_10 ub      u)
     6.72087427E-02    3     1000022        -1         1   # BR(~chi_20 -> ~chi_10 db      d)
     6.72087427E-02    3     1000022        -3         3   # BR(~chi_20 -> ~chi_10 sb      s)
     1.54619513E-02    3     1000022       -11        11   # BR(~chi_20 -> ~chi_10 e+      e-)
     1.54619513E-02    3     1000022       -13        13   # BR(~chi_20 -> ~chi_10 mu+     mu-)
     3.09206235E-02    3     1000022       -12        12   # BR(~chi_20 -> ~chi_10 nu_eb   nu_e)
     3.09206235E-02    3     1000022       -14        14   # BR(~chi_20 -> ~chi_10 nu_mub  nu_mu)
     3.09206253E-02    3     1000022       -16        16   # BR(~chi_20 -> ~chi_10 nu_taub nu_tau)
     2.66130232E-06    3     1000024       -12        11   # BR(~chi_20 -> ~chi_1+ nu_eb   e-)
     2.66130232E-06    3    -1000024        12       -11   # BR(~chi_20 -> ~chi_1- nu_e    e+)
     2.66130232E-06    3     1000024       -14        13   # BR(~chi_20 -> ~chi_1+ nu_mub  mu-)
     2.66130232E-06    3    -1000024        14       -13   # BR(~chi_20 -> ~chi_1- nu_mu   mu+)
#
#         PDG            Width
DECAY   1000025     1.02329207E+01   # neutralino3 decays
#          BR         NDA      ID1       ID2
     9.18871017E-02    2     1000022        23   # BR(~chi_30 -> ~chi_10   Z )
     5.16836136E-02    2     1000023        23   # BR(~chi_30 -> ~chi_20   Z )
     1.39120984E-01    2     1000024       -24   # BR(~chi_30 -> ~chi_1+   W-)
     1.39120984E-01    2    -1000024        24   # BR(~chi_30 -> ~chi_1-   W+)
     5.55528909E-02    2     1000022        25   # BR(~chi_30 -> ~chi_10   h )
     1.00000384E-01    2     1000023        25   # BR(~chi_30 -> ~chi_20   h )
     3.31008791E-02    2     1000002        -2   # BR(~chi_30 -> ~u_L      ub)
     3.31008791E-02    2    -1000002         2   # BR(~chi_30 -> ~u_L*     u )
     4.37066572E-03    2     2000002        -2   # BR(~chi_30 -> ~u_R      ub)
     4.37066572E-03    2    -2000002         2   # BR(~chi_30 -> ~u_R*     u )
     3.31718729E-02    2     1000001        -1   # BR(~chi_30 -> ~d_L      db)
     3.31718729E-02    2    -1000001         1   # BR(~chi_30 -> ~d_L*     d )
     3.31008699E-02    2     1000004        -4   # BR(~chi_30 -> ~c_L      cb)
     3.31008699E-02    2    -1000004         4   # BR(~chi_30 -> ~c_L*     c )
     4.36997352E-03    2     2000004        -4   # BR(~chi_30 -> ~c_R      cb)
     4.36997352E-03    2    -2000004         4   # BR(~chi_30 -> ~c_R*     c )
     3.31718729E-02    2     1000003        -3   # BR(~chi_30 -> ~s _L      sb)
     3.31718729E-02    2    -1000003         3   # BR(~chi_30 -> ~s _L*     s )
     8.06711046E-04    2     1000005        -5   # BR(~chi_30 -> ~b_1      bb)
     8.06711046E-04    2    -1000005         5   # BR(~chi_30 -> ~b_1*     b )
     3.39816293E-02    2     2000011       -11   # BR(~chi_30 -> ~e_R-     e+)
     3.39816293E-02    2    -2000011        11   # BR(~chi_30 -> ~e_R+     e-)
     3.39816293E-02    2     2000013       -13   # BR(~chi_30 -> ~mu_R-    mu+)
     3.39816293E-02    2    -2000013        13   # BR(~chi_30 -> ~mu_R+    mu-)
     6.16630841E-04    2     1000015       -15   # BR(~chi_30 -> ~tau_1-   tau+)
     6.16630841E-04    2    -1000015        15   # BR(~chi_30 -> ~tau_1+   tau-)
     6.44286695E-04    2     1000016       -16   # BR(~chi_30 -> ~nu_tau1  nu_taub)
     6.44286695E-04    2    -1000016        16   # BR(~chi_30 -> ~nu_tau1* nu_tau )
#
#         PDG            Width
DECAY   1000035     2.16568730E+02   # neutralino4 decays
#          BR         NDA      ID1       ID2
     1.54161068E-02    2     1000022        23   # BR(~chi_40 -> ~chi_10   Z )
     1.89923149E-02    2     1000023        23   # BR(~chi_40 -> ~chi_20   Z )
     2.57088376E-06    2     1000025        23   # BR(~chi_40 -> ~chi_30   Z )
     3.33643518E-02    2     1000024       -24   # BR(~chi_40 -> ~chi_1+   W-)
     3.33643518E-02    2    -1000024        24   # BR(~chi_40 -> ~chi_1-   W+)
     1.90124782E-02    2     1000022        25   # BR(~chi_40 -> ~chi_10   h )
     6.85736128E-03    2     1000022        35   # BR(~chi_40 -> ~chi_10   H )
     3.51458193E-03    2     1000022        36   # BR(~chi_40 -> ~chi_10   A )
     1.54785938E-02    2     1000023        25   # BR(~chi_40 -> ~chi_20   h )
     3.49621087E-03    2     1000023        35   # BR(~chi_40 -> ~chi_20   H )
     6.83790476E-03    2     1000023        36   # BR(~chi_40 -> ~chi_20   A )
     1.15970414E-07    2     1000025        25   # BR(~chi_40 -> ~chi_30   h )
     1.03248495E-02    2     1000024       -37   # BR(~chi_40 -> ~chi_1+   H-)
     1.03248495E-02    2    -1000024        37   # BR(~chi_40 -> ~chi_1-   H+)
     8.48899797E-02    2     1000002        -2   # BR(~chi_40 -> ~u_L      ub)
     8.48899797E-02    2    -1000002         2   # BR(~chi_40 -> ~u_L*     u )
     5.69294168E-10    2     2000002        -2   # BR(~chi_40 -> ~u_R      ub)
     5.69294168E-10    2    -2000002         2   # BR(~chi_40 -> ~u_R*     u )
     8.48186853E-02    2     1000001        -1   # BR(~chi_40 -> ~d_L      db)
     8.48186853E-02    2    -1000001         1   # BR(~chi_40 -> ~d_L*     d )
     8.48899767E-02    2     1000004        -4   # BR(~chi_40 -> ~c_L      cb)
     8.48899767E-02    2    -1000004         4   # BR(~chi_40 -> ~c_L*     c )
     5.69293960E-10    2     2000004        -4   # BR(~chi_40 -> ~c_R      cb)
     5.69293960E-10    2    -2000004         4   # BR(~chi_40 -> ~c_R*     c )
     8.48186853E-02    2     1000003        -3   # BR(~chi_40 -> ~s _L      sb)
     8.48186853E-02    2    -1000003         3   # BR(~chi_40 -> ~s _L*     s )
     1.58373617E-02    2     1000006        -6   # BR(~chi_40 -> ~t_1      tb)
     1.58373617E-02    2    -1000006         6   # BR(~chi_40 -> ~t_1*     t )
     1.10638869E-06    2     1000005        -5   # BR(~chi_40 -> ~b_1      bb)
     1.10638869E-06    2    -1000005         5   # BR(~chi_40 -> ~b_1*     b )
     1.64057320E-02    2     2000005        -5   # BR(~chi_40 -> ~b_2      bb)
     1.64057320E-02    2    -2000005         5   # BR(~chi_40 -> ~b_2*     b )
     3.22388296E-03    2     1000011       -11   # BR(~chi_40 -> ~e_L-     e+)
     3.22388296E-03    2    -1000011        11   # BR(~chi_40 -> ~e_L+     e-)
     5.40821760E-10    2     2000011       -11   # BR(~chi_40 -> ~e_R-     e+)
     5.40821760E-10    2    -2000011        11   # BR(~chi_40 -> ~e_R+     e-)
     3.22388296E-03    2     1000013       -13   # BR(~chi_40 -> ~mu_L-    mu+)
     3.22388296E-03    2    -1000013        13   # BR(~chi_40 -> ~mu_L+    mu-)
     5.40821760E-10    2     2000013       -13   # BR(~chi_40 -> ~mu_R-    mu+)
     5.40821760E-10    2    -2000013        13   # BR(~chi_40 -> ~mu_R+    mu-)
     1.34464180E-02    2     1000015       -15   # BR(~chi_40 -> ~tau_1-   tau+)
     1.34464180E-02    2    -1000015        15   # BR(~chi_40 -> ~tau_1+   tau-)
     4.89039451E-07    2     2000015       -15   # BR(~chi_40 -> ~tau_2-   tau+)
     4.89039451E-07    2    -2000015        15   # BR(~chi_40 -> ~tau_2+   tau-)
     3.23752896E-03    2     1000012       -12   # BR(~chi_40 -> ~nu_eL    nu_eb)
     3.23752896E-03    2    -1000012        12   # BR(~chi_40 -> ~nu_eL*   nu_e )
     3.23752896E-03    2     1000014       -14   # BR(~chi_40 -> ~nu_muL   nu_mub)
     3.23752896E-03    2    -1000014        14   # BR(~chi_40 -> ~nu_muL*  nu_mu )
     1.34754187E-02    2     1000016       -16   # BR(~chi_40 -> ~nu_tau1  nu_taub)
     1.34754187E-02    2    -1000016        16   # BR(~chi_40 -> ~nu_tau1* nu_tau )
#
#         PDG            Width
DECAY        25     4.38721527E-03   # h decays
#          BR         NDA      ID1       ID2
     5.75152269E-01    2           5        -5   # BR(h -> b       bb     )
     6.03382740E-02    2         -15        15   # BR(h -> tau+    tau-   )
     2.13562750E-04    2         -13        13   # BR(h -> mu+     mu-    )
     2.32341142E-04    2           3        -3   # BR(h -> s       sb     )
     2.00055297E-02    2           4        -4   # BR(h -> c       cb     )
     7.59737248E-02    2          21        21   # BR(h -> g       g      )
     2.28626108E-03    2          22        22   # BR(h -> gam     gam    )
     1.67690243E-03    2          22        23   # BR(h -> Z       gam    )
     2.34045591E-01    2          24       -24   # BR(h -> W+      W-     )
     3.00755448E-02    2          23        23   # BR(h -> Z       Z      )
#
#         PDG            Width
DECAY        35     5.31208900E+01   # H decays
#          BR         NDA      ID1       ID2
     8.30063256E-01    2           5        -5   # BR(H -> b       bb     )
     1.67433385E-01    2         -15        15   # BR(H -> tau+    tau-   )
     5.88471277E-04    2         -13        13   # BR(H -> mu+     mu-    )
     3.41926271E-04    2           3        -3   # BR(H -> s       sb     )
     1.21376608E-08    2           4        -4   # BR(H -> c       cb     )
     1.18717727E-03    2           6        -6   # BR(H -> t       tb     )
     1.99970428E-05    2          21        21   # BR(H -> g       g      )
     4.49307457E-09    2          22        22   # BR(H -> gam     gam    )
     1.08674820E-08    2          23        22   # BR(H -> Z       gam    )
     9.01092709E-07    2          24       -24   # BR(H -> W+      W-     )
     4.49305355E-07    2          23        23   # BR(H -> Z       Z      )
     3.29285288E-06    2          25        25   # BR(H -> h       h      )
     3.33474020E-04    2     1000024  -1000024   # BR(H -> ~chi_1+ ~chi_1-)
     1.83879855E-05    2     1000022   1000022   # BR(H -> ~chi_10 ~chi_10)
     6.66340832E-06    2     1000023   1000023   # BR(H -> ~chi_20 ~chi_20)
     9.71131783E-07    2     1000022   1000023   # BR(H -> ~chi_10 ~chi_20)
     3.29793997E-07    2     1000002  -1000002   # BR(H -> ~u_L    ~u_L*  )
     3.29793997E-07    2     1000004  -1000004   # BR(H -> ~c_L    ~c_L*  )
     4.80507671E-07    2     1000001  -1000001   # BR(H -> ~d_L    ~d_L*  )
     4.80507671E-07    2     1000003  -1000003   # BR(H -> ~s_L    ~s_L*  )
#
#         PDG            Width
DECAY        36     5.31239187E+01   # A decays
#          BR         NDA      ID1       ID2
     8.30036480E-01    2           5        -5   # BR(A -> b       bb     )
     1.67424609E-01    2         -15        15   # BR(A -> tau+    tau-   )
     5.88439275E-04    2         -13        13   # BR(A -> mu+     mu-    )
     3.41922398E-04    2           3        -3   # BR(A -> s       sb     )
     1.21534058E-08    2           4        -4   # BR(A -> c       cb     )
     1.19281348E-03    2           6        -6   # BR(A -> t       tb     )
     3.80317640E-05    2          21        21   # BR(A -> g       g      )
     1.02475522E-08    2          22        22   # BR(A -> gam     gam    )
     2.50201041E-08    2          23        22   # BR(A -> Z       gam    )
     9.11341918E-07    2          23        25   # BR(A -> Z       h      )
     3.49979568E-04    2     1000024  -1000024   # BR(A -> ~chi_1+ ~chi_1-)
     1.75742923E-05    2     1000022   1000022   # BR(A -> ~chi_10 ~chi_10)
     7.75793914E-06    2     1000023   1000023   # BR(A -> ~chi_20 ~chi_20)
     1.43362503E-06    2     1000022   1000023   # BR(A -> ~chi_10 ~chi_20)
#
#         PDG            Width
DECAY        37     5.09921644E+01   # H+ decays
#          BR         NDA      ID1       ID2
     1.38419810E-03    2           4        -5   # BR(H+ -> c       bb     )
     1.74543699E-01    2         -15        16   # BR(H+ -> tau+    nu_tau )
     6.13460400E-04    2         -13        14   # BR(H+ -> mu+     nu_mu  )
     1.38419582E-05    2           2        -5   # BR(H+ -> u       bb     )
     1.78153335E-05    2           2        -3   # BR(H+ -> u       sb     )
     3.50671950E-04    2           4        -3   # BR(H+ -> c       sb     )
     8.22879902E-01    2           6        -5   # BR(H+ -> t       bb     )
     9.52252270E-07    2          24        25   # BR(H+ -> W+      h      )
     4.01713292E-13    2          24        36   # BR(H+ -> W+      A      )
     8.11653421E-05    2     1000024   1000022   # BR(H+ -> ~chi_1+ ~chi_10)
     1.12624591E-04    2     1000024   1000023   # BR(H+ -> ~chi_1+ ~chi_20)
     8.34580928E-07    2     1000002  -1000001   # BR(H+ -> ~u_L    ~d_L*  )
     8.34580928E-07    2     1000004  -1000003   # BR(H+ -> ~c_L    ~s_L*  )
