#  ISAJET SUSY parameters in SUSY Les Houches Accord 2 format
#  Created by ISALHA 2.0 Last revision: C. Balazs 21 Apr 2009
Block SPINFO   # Program information
     1   ISASUGRA from ISAJET          # Spectrum Calculator
     2   7.80   29-OCT-2009 12:50:36   # Version number
Block MODSEL   # Model selection
     1     2   # Minimal gauge mediated (GMSB) model               
Block SMINPUTS   # Standard Model inputs
     1     1.27836258E+02   # alpha_em^(-1)
     2     1.16570000E-05   # G_Fermi
     3     1.17200002E-01   # alpha_s(M_Z)
     4     9.11699982E+01   # m_{Z}(pole)
     5     4.19999981E+00   # m_{b}(m_{b})
     6     1.72500000E+02   # m_{top}(pole)
     7     1.77699995E+00   # m_{tau}(pole)
Block MINPAR   # SUSY breaking input parameters
     1     9.00000000E+04   # Lambda scale of soft SSB
     2     2.50000000E+05   # M_mess overall messenger scale
     3     2.00000000E+00   # tan(beta)
     4     1.00000000E+00   # sign(mu)
     5     3.00000000E+00   # N_5 messenger index
     6     1.00000000E+00   # c_grav gravitino mass factor
    51     3.00000000E+00   # N5_1  U(1)_Y messenger index
    52     3.00000000E+00   # N5_2 SU(2)_L messenger index
    53     3.00000000E+00   # N5_3 SU(3)_C messenger index
   101     1.00000000E+00   # Rsl
   102     0.00000000E+00   # dmH_d^2
   103     0.00000000E+00   # dmH_u^2
   104     0.00000000E+00   # d_Y
Block MASS   # Scalar and gaugino mass spectrum
#  PDG code   mass                 particle
        24     8.04229965E+01   #  W^+
        25     9.07992325E+01   #  h^0            
        35     1.27120056E+03   #  H^0            
        36     1.26036182E+03   #  A^0            
        37     1.27113318E+03   #  H^+            
   1000001     1.88953552E+03   #  dnl            
   1000002     1.88844531E+03   #  upl            
   1000003     1.88953552E+03   #  stl            
   1000004     1.88844580E+03   #  chl            
   1000005     1.80787793E+03   #  b1             
   1000006     1.62833325E+03   #  t1             
   1000011     5.79021912E+02   #  el-            
   1000012     5.71525024E+02   #  nuel           
   1000013     5.79021912E+02   #  mul-           
   1000014     5.71525024E+02   #  numl           
   1000015     2.82715240E+02   #  tau1           
   1000016     5.64405579E+02   #  nutl           
   1000021     1.93818567E+03   #  glss           
   1000022     3.73326782E+02   #  z1ss           
   1000023     7.04492188E+02   #  z2ss           
   1000024     7.04232910E+02   #  w1ss           
   1000025    -9.52397278E+02   #  z3ss           
   1000035     9.76219604E+02   #  z4ss           
   1000037     9.74686279E+02   #  w2ss           
   1000039     5.41265877E-09   #  gvss
   2000001     1.80971631E+03   #  dnr            
   2000002     1.81642029E+03   #  upr            
   2000003     1.80971631E+03   #  str            
   2000004     1.81642078E+03   #  chr            
   2000005     1.81470166E+03   #  b2             
   2000006     1.83673401E+03   #  t2             
   2000011     2.74336243E+02   #  er-            
   2000013     2.74336273E+02   #  mur-           
   2000015     5.75023560E+02   #  tau2           
Block ALPHA   # Effective Higgs mixing parameter
         -4.67620611E-01   # alpha
Block STOPMIX   # stop mixing matrix
  1  1     2.21920311E-01   # O_{11}
  1  2     9.75064814E-01   # O_{12}
  2  1    -9.75064814E-01   # O_{21}
  2  2     2.21920311E-01   # O_{22}
Block SBOTMIX   # sbottom mixing matrix
  1  1     3.18711460E-01   # O_{11}
  1  2     9.47851777E-01   # O_{12}
  2  1    -9.47851777E-01   # O_{21}
  2  2     3.18711460E-01   # O_{22}
Block STAUMIX   # stau mixing matrix
  1  1     1.25093339E-02   # O_{11}
  1  2     9.99921739E-01   # O_{12}
  2  1    -9.99921739E-01   # O_{21}
  2  2     1.25093339E-02   # O_{22}
Block NMIX   # neutralino mixing matrix
  1  1     9.97358024E-01   #
  1  2    -1.22759510E-02   #
  1  3     5.73231131E-02   #
  1  4    -4.28994708E-02   #
  2  1    -3.15270573E-02   #
  2  2    -9.60732043E-01   #
  2  3     2.04111680E-01   #
  2  4    -1.85306340E-01   #
  3  1     1.00008771E-02   #
  3  2    -1.39580285E-02   #
  3  3    -7.06486285E-01   #
  3  4    -7.07518280E-01   #
  4  1    -6.46763891E-02   #
  4  2     2.76854515E-01   #
  4  3     6.75225496E-01   #
  4  4    -6.80616856E-01   #
Block UMIX   # chargino U mixing matrix
  1  1    -9.57907200E-01   # U_{11}
  1  2     2.87078023E-01   # U_{12}
  2  1    -2.87078023E-01   # U_{21}
  2  2    -9.57907200E-01   # U_{22}
Block VMIX   # chargino V mixing matrix
  1  1    -9.65356827E-01   # V_{11}
  1  2     2.60933429E-01   # V_{12}
  2  1    -2.60933429E-01   # V_{21}
  2  2    -9.65356827E-01   # V_{22}
Block GAUGE Q=  1.65207959E+03   #
     1     3.57524991E-01   # g`
     2     6.52378619E-01   # g_2
     3     1.21927989E+00   # g_3
Block YU Q=  1.65207959E+03   #
  3  3     9.44623888E-01   # y_t
Block YD Q=  1.65207959E+03   #
  3  3     2.92241350E-02   # y_b
Block YE Q=  1.65207959E+03   #
  3  3     2.24666763E-02   # y_tau
Block HMIX Q=  1.65207959E+03   # Higgs mixing parameters
     1     9.49560242E+02   # mu(Q)
     2     2.00000000E+00   # tan(beta)(M_GUT)
     3     2.50660690E+02   # Higgs vev at Q
     4     1.58851188E+06   # m_A^2(Q)
Block MSOFT Q=  1.65207959E+03   # DRbar SUSY breaking parameters
     1     3.83848236E+02   # M_1(Q)          
     2     7.09270813E+02   # M_2(Q)          
     3     1.83087427E+03   # M_3(Q)          
    31     5.72094116E+02   # MeL(Q)          
    32     5.72094116E+02   # MmuL(Q)         
    33     5.65166443E+02   # MtauL(Q)        
    34     2.74442688E+02   # MeR(Q)          
    35     2.74442688E+02   # MmuR(Q)         
    36     2.72198395E+02   # MtauR(Q)        
    41     1.79603503E+03   # MqL1(Q)         
    42     1.79603503E+03   # MqL2(Q)         
    43     1.73177209E+03   # MqL3(Q)         
    44     1.72564795E+03   # MuR(Q)          
    45     1.72564795E+03   # McR(Q)          
    46     1.57605444E+03   # MtR(Q)          
    47     1.71881482E+03   # MdR(Q)          
    48     1.71881482E+03   # MsR(Q)          
    49     1.72134180E+03   # MbR(Q)          
Block AU Q=  1.65207959E+03   #
  1  1    -5.19234436E+02   # A_u
  2  2    -5.19234436E+02   # A_c
  3  3    -5.19234436E+02   # A_t
Block AD Q=  1.65207959E+03   #
  1  1    -5.96277222E+02   # A_d
  2  2    -5.96277222E+02   # A_s
  3  3    -5.96277222E+02   # A_b
Block AE Q=  1.65207959E+03   #
  1  1    -6.71197510E+01   # A_e
  2  2    -6.71197510E+01   # A_mu
  3  3    -6.71197510E+01   # A_tau
#  ISAJET decay tables in SUSY Les Houches accord format
#  Created by ISALHD. Last revision: C. Balazs, 2005 May 25
Block DCINFO                           # Program information
     1   ISASUGRA from ISAJET          # Spectrum Calculator
     2   7.80   29-OCT-2009 12:50:36   # Version number
#         PDG         Width
DECAY         6  1.14680779E+00   # TP    decays
#          BR          NDA       ID1       ID2       ID3       ID4
      3.33333343E-01    3            2        -1         5             # TP     -->  UP     DB     BT          
      3.33333343E-01    3            4        -3         5             # TP     -->  CH     SB     BT          
      1.11111112E-01    3          -11        12         5             # TP     -->  E+     NUE    BT          
      1.11111112E-01    3          -13        14         5             # TP     -->  MU+    NUM    BT          
      1.11111112E-01    3          -15        16         5             # TP     -->  TAU+   NUT    BT          
#         PDG         Width
DECAY   1000021  6.78539610E+00   # GLSS  decays
#          BR          NDA       ID1       ID2       ID3       ID4
      2.50506075E-03    3      1000024         5        -6             # GLSS   -->  W1SS+  BT     TB          
      2.50506075E-03    3     -1000024         6        -5             # GLSS   -->  W1SS-  TP     BB          
      5.85389091E-04    3      1000037         5        -6             # GLSS   -->  W2SS+  BT     TB          
      5.85389091E-04    3     -1000037         6        -5             # GLSS   -->  W2SS-  TP     BB          
      2.06399349E-07    2      1000022        21                       # GLSS   -->  Z1SS   GL                 
      1.87268946E-04    3      1000022         6        -6             # GLSS   -->  Z1SS   TP     TB          
      2.46672562E-06    2      1000023        21                       # GLSS   -->  Z2SS   GL                 
      2.65110796E-03    3      1000023         6        -6             # GLSS   -->  Z2SS   TP     TB          
      7.68091777E-05    2      1000025        21                       # GLSS   -->  Z3SS   GL                 
      3.28893191E-03    3      1000025         6        -6             # GLSS   -->  Z3SS   TP     TB          
      6.39103455E-05    2      1000035        21                       # GLSS   -->  Z4SS   GL                 
      5.01631806E-03    3      1000035         6        -6             # GLSS   -->  Z4SS   TP     TB          
      7.90616497E-03    2     -1000002         2                       # GLSS   -->  UBL    UP                 
      7.90616497E-03    2      1000002        -2                       # GLSS   -->  UPL    UB                 
      7.56769767E-03    2     -1000001         1                       # GLSS   -->  DBL    DN                 
      7.56769767E-03    2      1000001        -1                       # GLSS   -->  DNL    DB                 
      4.56132479E-02    2     -2000002         2                       # GLSS   -->  UBR    UP                 
      4.56132479E-02    2      2000002        -2                       # GLSS   -->  UPR    UB                 
      5.05930074E-02    2     -2000001         1                       # GLSS   -->  DBR    DN                 
      5.05930074E-02    2      2000001        -1                       # GLSS   -->  DNR    DB                 
      7.56763620E-03    2     -1000003         3                       # GLSS   -->  SBL    ST                 
      7.56763620E-03    2      1000003        -3                       # GLSS   -->  STL    SB                 
      5.05929515E-02    2     -2000003         3                       # GLSS   -->  SBR    ST                 
      5.05929515E-02    2      2000003        -3                       # GLSS   -->  STR    SB                 
      7.90317915E-03    2     -1000004         4                       # GLSS   -->  CBL    CH                 
      7.90317915E-03    2      1000004        -4                       # GLSS   -->  CHL    CB                 
      4.56102639E-02    2     -2000004         4                       # GLSS   -->  CBR    CH                 
      4.56102639E-02    2      2000004        -4                       # GLSS   -->  CHR    CB                 
      5.07180765E-02    2     -1000005         5                       # GLSS   -->  BB1    BT                 
      5.07180765E-02    2      1000005        -5                       # GLSS   -->  BT1    BB                 
      4.80143949E-02    2     -2000005         5                       # GLSS   -->  BB2    BT                 
      4.80143949E-02    2      2000005        -5                       # GLSS   -->  BT2    BB                 
      1.69179305E-01    2     -1000006         6                       # GLSS   -->  TB1    TP                 
      1.69179305E-01    2      1000006        -6                       # GLSS   -->  TP1    TB                 
      1.58404234E-07    2      1000039        21                       # GLSS   -->  GVSS   GL                 
#         PDG         Width
DECAY   1000002  1.75802135E+01   # UPL   decays
#          BR          NDA       ID1       ID2       ID3       ID4
      1.21295433E-02    2      1000022         2                       # UPL    -->  Z1SS   UP                 
      3.12996000E-01    2      1000023         2                       # UPL    -->  Z2SS   UP                 
      3.69646004E-05    2      1000025         2                       # UPL    -->  Z3SS   UP                 
      1.70504674E-02    2      1000035         2                       # UPL    -->  Z4SS   UP                 
      6.24650240E-01    2      1000024         1                       # UPL    -->  W1SS+  DN                 
      3.31367664E-02    2      1000037         1                       # UPL    -->  W2SS+  DN                 
#         PDG         Width
DECAY   1000001  1.75426083E+01   # DNL   decays
#          BR          NDA       ID1       ID2       ID3       ID4
      1.59203075E-02    2      1000022         1                       # DNL    -->  Z1SS   DN                 
      3.06504786E-01    2      1000023         1                       # DNL    -->  Z2SS   DN                 
      6.29022616E-05    2      1000025         1                       # DNL    -->  Z3SS   DN                 
      2.03084890E-02    2      1000035         1                       # DNL    -->  Z4SS   DN                 
      6.16950810E-01    2     -1000024         2                       # DNL    -->  W1SS-  UP                 
      4.02527004E-02    2     -1000037         2                       # DNL    -->  W2SS-  UP                 
#         PDG         Width
DECAY   1000003  1.75425930E+01   # STL   decays
#          BR          NDA       ID1       ID2       ID3       ID4
      1.59203205E-02    2      1000022         3                       # STL    -->  Z1SS   ST                 
      3.06505054E-01    2      1000023         3                       # STL    -->  Z2SS   ST                 
      6.29023198E-05    2      1000025         3                       # STL    -->  Z3SS   ST                 
      2.03085076E-02    2      1000035         3                       # STL    -->  Z4SS   ST                 
      6.16950512E-01    2     -1000024         4                       # STL    -->  W1SS-  CH                 
      4.02526557E-02    2     -1000037         4                       # STL    -->  W2SS-  CH                 
#         PDG         Width
DECAY   1000004  1.75802116E+01   # CHL   decays
#          BR          NDA       ID1       ID2       ID3       ID4
      1.21295340E-02    2      1000022         4                       # CHL    -->  Z1SS   CH                 
      3.12995642E-01    2      1000023         4                       # CHL    -->  Z2SS   CH                 
      3.69645568E-05    2      1000025         4                       # CHL    -->  Z3SS   CH                 
      1.70504451E-02    2      1000035         4                       # CHL    -->  Z4SS   CH                 
      6.24650598E-01    2      1000024         3                       # CHL    -->  W1SS+  ST                 
      3.31367962E-02    2      1000037         3                       # CHL    -->  W2SS+  ST                 
#         PDG         Width
DECAY   1000005  4.12847519E+00   # BT1   decays
#          BR          NDA       ID1       ID2       ID3       ID4
      2.11284608E-01    2      1000022         5                       # BT1    -->  Z1SS   BT                 
      1.33229136E-01    2      1000023         5                       # BT1    -->  Z2SS   BT                 
      1.53856107E-03    2      1000025         5                       # BT1    -->  Z3SS   BT                 
      2.42594560E-03    2      1000035         5                       # BT1    -->  Z4SS   BT                 
      2.79386252E-01    2     -1000024         6                       # BT1    -->  W1SS-  TP                 
      3.49755555E-01    2     -1000037         6                       # BT1    -->  W2SS-  TP                 
      2.23799199E-02    2          -24   1000006                       # BT1    -->  W-     TP1                
#         PDG         Width
DECAY   1000006  2.67162399E+01   # TP1   decays
#          BR          NDA       ID1       ID2       ID3       ID4
      1.19878188E-01    2      1000022         6                       # TP1    -->  Z1SS   TP                 
      5.31540401E-02    2      1000023         6                       # TP1    -->  Z2SS   TP                 
      2.26962060E-01    2      1000025         6                       # TP1    -->  Z3SS   TP                 
      1.51468441E-01    2      1000035         6                       # TP1    -->  Z4SS   TP                 
      1.10805146E-01    2      1000024         5                       # TP1    -->  W1SS+  BT                 
      3.37732136E-01    2      1000037         5                       # TP1    -->  W2SS+  BT                 
#         PDG         Width
DECAY   2000002  3.75852537E+00   # UPR   decays
#          BR          NDA       ID1       ID2       ID3       ID4
      9.96847510E-01    2      1000022         2                       # UPR    -->  Z1SS   UP                 
      7.83764583E-04    2      1000023         2                       # UPR    -->  Z2SS   UP                 
      5.74467267E-05    2      1000025         2                       # UPR    -->  Z3SS   UP                 
      2.31119827E-03    2      1000035         2                       # UPR    -->  Z4SS   UP                 
#         PDG         Width
DECAY   2000001  9.35537100E-01   # DNR   decays
#          BR          NDA       ID1       ID2       ID3       ID4
      9.96861756E-01    2      1000022         1                       # DNR    -->  Z1SS   DN                 
      7.82229123E-04    2      1000023         1                       # DNR    -->  Z2SS   DN                 
      5.71620731E-05    2      1000025         1                       # DNR    -->  Z3SS   DN                 
      2.29882193E-03    2      1000035         1                       # DNR    -->  Z4SS   DN                 
#         PDG         Width
DECAY   2000003  9.35537100E-01   # STR   decays
#          BR          NDA       ID1       ID2       ID3       ID4
      9.96861756E-01    2      1000022         3                       # STR    -->  Z1SS   ST                 
      7.82229123E-04    2      1000023         3                       # STR    -->  Z2SS   ST                 
      5.71620731E-05    2      1000025         3                       # STR    -->  Z3SS   ST                 
      2.29882193E-03    2      1000035         3                       # STR    -->  Z4SS   ST                 
#         PDG         Width
DECAY   2000004  3.75852203E+00   # CHR   decays
#          BR          NDA       ID1       ID2       ID3       ID4
      9.96847510E-01    2      1000022         4                       # CHR    -->  Z1SS   CH                 
      7.83764466E-04    2      1000023         4                       # CHR    -->  Z2SS   CH                 
      5.74466976E-05    2      1000025         4                       # CHR    -->  Z3SS   CH                 
      2.31119711E-03    2      1000035         4                       # CHR    -->  Z4SS   CH                 
#         PDG         Width
DECAY   2000005  2.92871666E+01   # BT2   decays
#          BR          NDA       ID1       ID2       ID3       ID4
      1.11309057E-02    2      1000022         5                       # BT2    -->  Z1SS   BT                 
      1.52734354E-01    2      1000023         5                       # BT2    -->  Z2SS   BT                 
      3.90170608E-04    2      1000025         5                       # BT2    -->  Z3SS   BT                 
      1.12252738E-02    2      1000035         5                       # BT2    -->  Z4SS   BT                 
      3.23794812E-01    2     -1000024         6                       # BT2    -->  W1SS-  TP                 
      4.68839794E-01    2     -1000037         6                       # BT2    -->  W2SS-  TP                 
      3.18847522E-02    2          -24   1000006                       # BT2    -->  W-     TP1                
#         PDG         Width
DECAY   2000006  3.32760468E+01   # TP2   decays
#          BR          NDA       ID1       ID2       ID3       ID4
      2.50058860E-01    2      1000024         5                       # TP2    -->  W1SS+  BT                 
      7.44506270E-02    2      1000037         5                       # TP2    -->  W2SS+  BT                 
      2.04786994E-02    2           23   1000006                       # TP2    -->  Z0     TP1                
      2.47687791E-02    2           25   1000006                       # TP2    -->  HL0    TP1                
      8.24132562E-03    2      1000022         6                       # TP2    -->  Z1SS   TP                 
      1.35220051E-01    2      1000023         6                       # TP2    -->  Z2SS   TP                 
      2.22576454E-01    2      1000025         6                       # TP2    -->  Z3SS   TP                 
      2.64205277E-01    2      1000035         6                       # TP2    -->  Z4SS   TP                 
#         PDG         Width
DECAY   1000011  2.38959029E-01   # EL-   decays
#          BR          NDA       ID1       ID2       ID3       ID4
      9.99999583E-01    2      1000022        11                       # EL-    -->  Z1SS   E-                 
      2.50121758E-07    3      1000015        11       -15             # EL-    -->  TAU1-  E-     TAU+        
      2.08002788E-07    3     -1000015        11        15             # EL-    -->  TAU1+  E-     TAU-        
      1.07032747E-08    2           11   1000039                       # EL-    -->  E-     GVSS               
#         PDG         Width
DECAY   1000013  2.38958970E-01   # MUL-  decays
#          BR          NDA       ID1       ID2       ID3       ID4
      9.99999583E-01    2      1000022        13                       # MUL-   -->  Z1SS   MU-                
      2.50121815E-07    3      1000015        13       -15             # MUL-   -->  TAU1-  MU-    TAU+        
      2.08002845E-07    3     -1000015        13        15             # MUL-   -->  TAU1+  MU-    TAU-        
      1.07032774E-08    2           13   1000039                       # MUL-   -->  MU-    GVSS               
#         PDG         Width
DECAY   1000015  7.09647202E-11   # TAU1- decays
#          BR          NDA       ID1       ID2       ID3       ID4
      1.00000000E+00    2           15   1000039                       # TAU1-  -->  TAU-   GVSS               
#         PDG         Width
DECAY   1000012  2.48370185E-01   # NUEL  decays
#          BR          NDA       ID1       ID2       ID3       ID4
      9.99999166E-01    2      1000022        12                       # NUEL   -->  Z1SS   NUE                
      1.53590818E-07    3      1000015        12       -15             # NUEL   -->  TAU1-  NUE    TAU+        
      1.39039642E-07    3     -1000015        12        15             # NUEL   -->  TAU1+  NUE    TAU-        
      5.40986605E-07    3     -1000015        11        16             # NUEL   -->  TAU1+  E-     NUT         
      9.64810098E-09    2           12   1000039                       # NUEL   -->  NUE    GVSS               
#         PDG         Width
DECAY   1000014  2.48370185E-01   # NUML  decays
#          BR          NDA       ID1       ID2       ID3       ID4
      9.99999166E-01    2      1000022        14                       # NUML   -->  Z1SS   NUM                
      1.53590818E-07    3      1000015        14       -15             # NUML   -->  TAU1-  NUM    TAU+        
      1.39039642E-07    3     -1000015        14        15             # NUML   -->  TAU1+  NUM    TAU-        
      5.40987230E-07    3     -1000015        13        16             # NUML   -->  TAU1+  MU-    NUT         
      9.64810098E-09    2           14   1000039                       # NUML   -->  NUM    GVSS               
#         PDG         Width
DECAY   1000016  2.42778704E-01   # NUTL  decays
#          BR          NDA       ID1       ID2       ID3       ID4
      9.72470164E-01    2      1000022        16                       # NUTL   -->  Z1SS   NUT                
      2.75296215E-02    2           24   1000015                       # NUTL   -->  W+     TAU1-              
      1.37624966E-07    3     -1000015        16        15             # NUTL   -->  TAU1+  NUT    TAU-        
      1.24140826E-07    3      1000015        16       -15             # NUTL   -->  TAU1-  NUT    TAU+        
      9.27066690E-09    2           16   1000039                       # NUTL   -->  NUT    GVSS               
#         PDG         Width
DECAY   2000011  6.10634043E-11   # ER-   decays
#          BR          NDA       ID1       ID2       ID3       ID4
      1.00000000E+00    2           11   1000039                       # ER-    -->  E-     GVSS               
#         PDG         Width
DECAY   2000013  6.10634182E-11   # MUR-  decays
#          BR          NDA       ID1       ID2       ID3       ID4
      1.00000000E+00    2           13   1000039                       # MUR-   -->  MU-    GVSS               
#         PDG         Width
DECAY   2000015  2.41156086E-01   # TAU2- decays
#          BR          NDA       ID1       ID2       ID3       ID4
      9.64650512E-01    2      1000022        15                       # TAU2-  -->  Z1SS   TAU-               
      1.49513055E-02    2           23   1000015                       # TAU2-  -->  Z0     TAU1-              
      2.03981567E-02    2           25   1000015                       # TAU2-  -->  HL0    TAU1-              
#         PDG         Width
DECAY   1000022  1.14285052E+00   # Z1SS  decays
#          BR          NDA       ID1       ID2       ID3       ID4
      1.74863726E-01    2      2000011       -11                       # Z1SS   -->  ER-    E+                 
      1.74863726E-01    2     -2000011        11                       # Z1SS   -->  ER+    E-                 
      1.74863577E-01    2      2000013       -13                       # Z1SS   -->  MUR-   MU+                
      1.74863577E-01    2     -2000013        13                       # Z1SS   -->  MUR+   MU-                
      1.50272697E-01    2      1000015       -15                       # Z1SS   -->  TAU1-  TAU+               
      1.50272697E-01    2     -1000015        15                       # Z1SS   -->  TAU1+  TAU-               
      1.87926869E-10    2      1000039        22                       # Z1SS   -->  GVSS   GM                 
      4.20651925E-12    3      1000039        11       -11             # Z1SS   -->  GVSS   E-     E+          
      4.74351669E-11    2      1000039        23                       # Z1SS   -->  GVSS   Z0                 
      1.51542851E-14    2      1000039        25                       # Z1SS   -->  GVSS   HL0                
#         PDG         Width
DECAY   1000023  1.97769833E+00   # Z2SS  decays
#          BR          NDA       ID1       ID2       ID3       ID4
      8.90168472E-09    2      1000022        22                       # Z2SS   -->  Z1SS   GM                 
      3.34075070E-04    2      1000022        23                       # Z2SS   -->  Z1SS   Z0                 
      5.86580420E-08    3      1000022         2        -2             # Z2SS   -->  Z1SS   UP     UB          
      7.38865751E-08    3      1000022         1        -1             # Z2SS   -->  Z1SS   DN     DB          
      7.38865751E-08    3      1000022         3        -3             # Z2SS   -->  Z1SS   ST     SB          
      5.86579816E-08    3      1000022         4        -4             # Z2SS   -->  Z1SS   CH     CB          
      8.87270275E-08    3      1000022         5        -5             # Z2SS   -->  Z1SS   BT     BB          
      3.81126103E-11    3      1000022        15       -15             # Z2SS   -->  Z1SS   TAU-   TAU+        
      5.03510460E-02    2      1000022        25                       # Z2SS   -->  Z1SS   HL0                
      7.55105242E-02    2      1000011       -11                       # Z2SS   -->  EL-    E+                 
      7.55105242E-02    2     -1000011        11                       # Z2SS   -->  EL+    E-                 
      7.55105019E-02    2      1000013       -13                       # Z2SS   -->  MUL-   MU+                
      7.55105019E-02    2     -1000013        13                       # Z2SS   -->  MUL+   MU-                
      6.48055400E-04    2      2000011       -11                       # Z2SS   -->  ER-    E+                 
      6.48055400E-04    2     -2000011        11                       # Z2SS   -->  ER+    E-                 
      6.48055400E-04    2      2000013       -13                       # Z2SS   -->  MUR-   MU+                
      6.48055400E-04    2     -2000013        13                       # Z2SS   -->  MUR+   MU-                
      8.88974755E-04    2      1000015       -15                       # Z2SS   -->  TAU1-  TAU+               
      8.88974755E-04    2     -1000015        15                       # Z2SS   -->  TAU1+  TAU-               
      7.98958391E-02    2      2000015       -15                       # Z2SS   -->  TAU2-  TAU+               
      7.98958391E-02    2     -2000015        15                       # Z2SS   -->  TAU2+  TAU-               
      7.79813975E-02    2      1000012       -12                       # Z2SS   -->  NUEL   ANUE               
      7.79813975E-02    2     -1000012        12                       # Z2SS   -->  ANUEL  NUE                
      7.79813975E-02    2      1000014       -14                       # Z2SS   -->  NUML   ANUM               
      7.79813975E-02    2     -1000014        14                       # Z2SS   -->  ANUML  NUM                
      8.55924785E-02    2      1000016       -16                       # Z2SS   -->  NUTL   ANUT               
      8.55924785E-02    2     -1000016        16                       # Z2SS   -->  ANUTL  NUT                
      8.29180724E-10    2      1000039        22                       # Z2SS   -->  GVSS   GM                 
      1.94331704E-11    3      1000039        11       -11             # Z2SS   -->  GVSS   E-     E+          
      2.30939579E-09    2      1000039        23                       # Z2SS   -->  GVSS   Z0                 
      8.68807457E-12    2      1000039        25                       # Z2SS   -->  GVSS   HL0                
#         PDG         Width
DECAY   1000025  5.84515429E+00   # Z3SS  decays
#          BR          NDA       ID1       ID2       ID3       ID4
      4.19019628E-08    2      1000022        22                       # Z3SS   -->  Z1SS   GM                 
      3.15430356E-07    2      1000023        22                       # Z3SS   -->  Z2SS   GM                 
      2.86759585E-01    2      1000024       -24                       # Z3SS   -->  W1SS+  W-                 
      2.86759585E-01    2     -1000024        24                       # Z3SS   -->  W1SS-  W+                 
      1.43816769E-01    2      1000022        23                       # Z3SS   -->  Z1SS   Z0                 
      2.77042866E-01    2      1000023        23                       # Z3SS   -->  Z2SS   Z0                 
      1.53107541E-10    3      1000022         2        -2             # Z3SS   -->  Z1SS   UP     UB          
      4.59913496E-11    3      1000022         1        -1             # Z3SS   -->  Z1SS   DN     DB          
      4.59913496E-11    3      1000022         3        -3             # Z3SS   -->  Z1SS   ST     SB          
      1.53107374E-10    3      1000022         4        -4             # Z3SS   -->  Z1SS   CH     CB          
      1.19615562E-08    3      1000022         5        -5             # Z3SS   -->  Z1SS   BT     BB          
      1.05749964E-09    3      1000022        15       -15             # Z3SS   -->  Z1SS   TAU-   TAU+        
      1.61351106E-11    3      1000023         2        -2             # Z3SS   -->  Z2SS   UP     UB          
      2.66273167E-11    3      1000023         1        -1             # Z3SS   -->  Z2SS   DN     DB          
      2.66273167E-11    3      1000023         3        -3             # Z3SS   -->  Z2SS   ST     SB          
      1.61350915E-11    3      1000023         4        -4             # Z3SS   -->  Z2SS   CH     CB          
      1.15747323E-09    3      1000023         5        -5             # Z3SS   -->  Z2SS   BT     BB          
      4.75710547E-11    3      1000023        15       -15             # Z3SS   -->  Z2SS   TAU-   TAU+        
      3.22059193E-03    2      1000022        25                       # Z3SS   -->  Z1SS   HL0                
      7.63773278E-04    2      1000023        25                       # Z3SS   -->  Z2SS   HL0                
      9.75638886E-06    2      1000011       -11                       # Z3SS   -->  EL-    E+                 
      9.75638886E-06    2     -1000011        11                       # Z3SS   -->  EL+    E-                 
      9.75638886E-06    2      1000013       -13                       # Z3SS   -->  MUL-   MU+                
      9.75638886E-06    2     -1000013        13                       # Z3SS   -->  MUL+   MU-                
      3.48523899E-05    2      2000011       -11                       # Z3SS   -->  ER-    E+                 
      3.48523899E-05    2     -2000011        11                       # Z3SS   -->  ER+    E-                 
      3.48523899E-05    2      2000013       -13                       # Z3SS   -->  MUR-   MU+                
      3.48523899E-05    2     -2000013        13                       # Z3SS   -->  MUR+   MU-                
      3.83762439E-04    2      1000015       -15                       # Z3SS   -->  TAU1-  TAU+               
      3.83762439E-04    2     -1000015        15                       # Z3SS   -->  TAU1+  TAU-               
      1.84384815E-04    2      2000015       -15                       # Z3SS   -->  TAU2-  TAU+               
      1.84384815E-04    2     -2000015        15                       # Z3SS   -->  TAU2+  TAU-               
      5.31454498E-05    2      1000012       -12                       # Z3SS   -->  NUEL   ANUE               
      5.31454498E-05    2     -1000012        12                       # Z3SS   -->  ANUEL  NUE                
      5.31454498E-05    2      1000014       -14                       # Z3SS   -->  NUML   ANUM               
      5.31454498E-05    2     -1000014        14                       # Z3SS   -->  ANUML  NUM                
      5.46367410E-05    2      1000016       -16                       # Z3SS   -->  NUTL   ANUT               
      5.46367410E-05    2     -1000016        16                       # Z3SS   -->  ANUTL  NUT                
      2.19509723E-14    2      1000039        22                       # Z3SS   -->  GVSS   GM                 
      5.25428196E-16    3      1000039        11       -11             # Z3SS   -->  GVSS   E-     E+          
      2.56399013E-10    2      1000039        23                       # Z3SS   -->  GVSS   Z0                 
      2.29209873E-09    2      1000039        25                       # Z3SS   -->  GVSS   HL0                
#         PDG         Width
DECAY   1000035  7.63499594E+00   # Z4SS  decays
#          BR          NDA       ID1       ID2       ID3       ID4
      7.02466636E-08    2      1000022        22                       # Z4SS   -->  Z1SS   GM                 
      2.26930252E-09    2      1000023        22                       # Z4SS   -->  Z2SS   GM                 
      1.39494238E-09    2      1000025        22                       # Z4SS   -->  Z3SS   GM                 
      2.79458523E-01    2      1000024       -24                       # Z4SS   -->  W1SS+  W-                 
      2.79458523E-01    2     -1000024        24                       # Z4SS   -->  W1SS-  W+                 
      5.90878041E-13    3     -1000037         2        -1             # Z4SS   -->  W2SS-  UP     DB          
      1.96959338E-13    3     -1000037        12       -11             # Z4SS   -->  W2SS-  NUE    E+          
      1.96959338E-13    3     -1000037        14       -13             # Z4SS   -->  W2SS-  NUM    MU+         
      5.90878041E-13    3      1000037         1        -2             # Z4SS   -->  W2SS+  DN     UB          
      1.96959338E-13    3      1000037        11       -12             # Z4SS   -->  W2SS+  E-     ANUE        
      1.96959338E-13    3      1000037        13       -14             # Z4SS   -->  W2SS+  MU-    ANUM        
      2.32027518E-03    2      1000022        23                       # Z4SS   -->  Z1SS   Z0                 
      6.95283234E-04    2      1000023        23                       # Z4SS   -->  Z2SS   Z0                 
      2.95991178E-08    3      1000022         2        -2             # Z4SS   -->  Z1SS   UP     UB          
      2.76610166E-08    3      1000022         1        -1             # Z4SS   -->  Z1SS   DN     DB          
      2.76610166E-08    3      1000022         3        -3             # Z4SS   -->  Z1SS   ST     SB          
      2.95990805E-08    3      1000022         4        -4             # Z4SS   -->  Z1SS   CH     CB          
      4.20434141E-08    3      1000022         5        -5             # Z4SS   -->  Z1SS   BT     BB          
      8.13931145E-10    3      1000022        15       -15             # Z4SS   -->  Z1SS   TAU-   TAU+        
      2.65140390E-08    3      1000023         2        -2             # Z4SS   -->  Z2SS   UP     UB          
      3.06311563E-08    3      1000023         1        -1             # Z4SS   -->  Z2SS   DN     DB          
      3.06311563E-08    3      1000023         3        -3             # Z4SS   -->  Z2SS   ST     SB          
      2.65140017E-08    3      1000023         4        -4             # Z4SS   -->  Z2SS   CH     CB          
      3.84711178E-08    3      1000023         5        -5             # Z4SS   -->  Z2SS   BT     BB          
      3.99290323E-11    3      1000023        15       -15             # Z4SS   -->  Z2SS   TAU-   TAU+        
      1.17382903E-07    3      1000025         2        -2             # Z4SS   -->  Z3SS   UP     UB          
      1.51373015E-07    3      1000025         1        -1             # Z4SS   -->  Z3SS   DN     DB          
      1.51373015E-07    3      1000025         3        -3             # Z4SS   -->  Z3SS   ST     SB          
      1.17382903E-07    3      1000025         4        -4             # Z4SS   -->  Z3SS   CH     CB          
      9.23156023E-08    3      1000025         5        -5             # Z4SS   -->  Z3SS   BT     BB          
      3.43380044E-08    3      1000025        11       -11             # Z4SS   -->  Z3SS   E-     E+          
      3.43380044E-08    3      1000025        13       -13             # Z4SS   -->  Z3SS   MU-    MU+         
      3.17432587E-08    3      1000025        15       -15             # Z4SS   -->  Z3SS   TAU-   TAU+        
      6.83218246E-08    3      1000025        12       -12             # Z4SS   -->  Z3SS   NUE    ANUE        
      6.83218246E-08    3      1000025        14       -14             # Z4SS   -->  Z3SS   NUM    ANUM        
      6.83218246E-08    3      1000025        16       -16             # Z4SS   -->  Z3SS   NUT    ANUT        
      1.03952594E-01    2      1000022        25                       # Z4SS   -->  Z1SS   HL0                
      2.18168527E-01    2      1000023        25                       # Z4SS   -->  Z2SS   HL0                
      6.58384711E-03    2      1000011       -11                       # Z4SS   -->  EL-    E+                 
      6.58384711E-03    2     -1000011        11                       # Z4SS   -->  EL+    E-                 
      6.58384711E-03    2      1000013       -13                       # Z4SS   -->  MUL-   MU+                
      6.58384711E-03    2     -1000013        13                       # Z4SS   -->  MUL+   MU-                
      1.15383836E-03    2      2000011       -11                       # Z4SS   -->  ER-    E+                 
      1.15383836E-03    2     -2000011        11                       # Z4SS   -->  ER+    E-                 
      1.15383836E-03    2      2000013       -13                       # Z4SS   -->  MUR-   MU+                
      1.15383836E-03    2     -2000013        13                       # Z4SS   -->  MUR+   MU-                
      1.33584219E-03    2      1000015       -15                       # Z4SS   -->  TAU1-  TAU+               
      1.33584219E-03    2     -1000015        15                       # Z4SS   -->  TAU1+  TAU-               
      6.83096889E-03    2      2000015       -15                       # Z4SS   -->  TAU2-  TAU+               
      6.83096889E-03    2     -2000015        15                       # Z4SS   -->  TAU2+  TAU-               
      1.13451919E-02    2      1000012       -12                       # Z4SS   -->  NUEL   ANUE               
      1.13451919E-02    2     -1000012        12                       # Z4SS   -->  ANUEL  NUE                
      1.13451919E-02    2      1000014       -14                       # Z4SS   -->  NUML   ANUM               
      1.13451919E-02    2     -1000014        14                       # Z4SS   -->  ANUML  NUM                
      1.16400439E-02    2      1000016       -16                       # Z4SS   -->  NUTL   ANUT               
      1.16400439E-02    2     -1000016        16                       # Z4SS   -->  ANUTL  NUT                
      2.68261854E-11    2      1000039        22                       # Z4SS   -->  GVSS   GM                 
      6.43222238E-13    3      1000039        11       -11             # Z4SS   -->  GVSS   E-     E+          
      2.15764095E-09    2      1000039        23                       # Z4SS   -->  GVSS   Z0                 
      2.02569517E-10    2      1000039        25                       # Z4SS   -->  GVSS   HL0                
#         PDG         Width
DECAY   1000024  1.94448793E+00   # W1SS+ decays
#          BR          NDA       ID1       ID2       ID3       ID4
      1.33548255E-07    3      1000022         2        -1             # W1SS+  -->  Z1SS   UP     DB          
      1.33548184E-07    3      1000022         4        -3             # W1SS+  -->  Z1SS   CH     SB          
      3.68449923E-11    3      1000022       -15        16             # W1SS+  -->  Z1SS   TAU+   NUT         
      3.75499092E-02    2      1000022        24                       # W1SS+  -->  Z1SS   W+                 
      1.65563166E-01    2      1000012       -11                       # W1SS+  -->  NUEL   E+                 
      1.65563107E-01    2      1000014       -13                       # W1SS+  -->  NUML   MU+                
      1.81820035E-01    2      1000016       -15                       # W1SS+  -->  NUTL   TAU+               
      1.46830261E-01    2     -1000011        12                       # W1SS+  -->  EL+    NUE                
      1.46830261E-01    2     -1000013        14                       # W1SS+  -->  MUL+   NUM                
      5.23731112E-04    2     -1000015        16                       # W1SS+  -->  TAU1+  NUT                
      1.55319229E-01    2     -2000015        16                       # W1SS+  -->  TAU2+  NUT                
#         PDG         Width
DECAY   1000037  7.20078802E+00   # W2SS+ decays
#          BR          NDA       ID1       ID2       ID3       ID4
      4.51498607E-08    3      1000022         2        -1             # W2SS+  -->  Z1SS   UP     DB          
      4.51498359E-08    3      1000022         4        -3             # W2SS+  -->  Z1SS   CH     SB          
      7.82731990E-10    3      1000022       -15        16             # W2SS+  -->  Z1SS   TAU+   NUT         
      9.81066823E-02    2      1000022        24                       # W2SS+  -->  Z1SS   W+                 
      2.01330703E-08    3      1000023         2        -1             # W2SS+  -->  Z2SS   UP     DB          
      2.01330579E-08    3      1000023         4        -3             # W2SS+  -->  Z2SS   CH     SB          
      6.98396618E-11    3      1000023       -15        16             # W2SS+  -->  Z2SS   TAU+   NUT         
      2.73546845E-01    2      1000023        24                       # W2SS+  -->  Z2SS   W+                 
      3.08071179E-07    3      1000025         2        -1             # W2SS+  -->  Z3SS   UP     DB          
      3.08071179E-07    3      1000025         4        -3             # W2SS+  -->  Z3SS   CH     SB          
      1.02690031E-07    3      1000025       -11        12             # W2SS+  -->  Z3SS   E+     NUE         
      1.02690031E-07    3      1000025       -13        14             # W2SS+  -->  Z3SS   MU+    NUM         
      1.02690031E-07    3      1000025       -15        16             # W2SS+  -->  Z3SS   TAU+   NUT         
      1.67029146E-02    2      1000012       -11                       # W2SS+  -->  NUEL   E+                 
      1.67029146E-02    2      1000014       -13                       # W2SS+  -->  NUML   MU+                
      1.74014010E-02    2      1000016       -15                       # W2SS+  -->  NUTL   TAU+               
      1.96621120E-02    2     -1000011        12                       # W2SS+  -->  EL+    NUE                
      1.96621120E-02    2     -1000013        14                       # W2SS+  -->  MUL+   NUM                
      4.34571848E-04    2     -1000015        16                       # W2SS+  -->  TAU1+  NUT                
      2.00140048E-02    2     -2000015        16                       # W2SS+  -->  TAU2+  NUT                
      2.69997537E-01    2      1000024        23                       # W2SS+  -->  W1SS+  Z0                 
      3.58037049E-08    3      1000024         1        -1             # W2SS+  -->  W1SS+  DN     DB          
      3.58036623E-08    3      1000024         3        -3             # W2SS+  -->  W1SS+  ST     SB          
      4.25484181E-08    3      1000024         2        -2             # W2SS+  -->  W1SS+  UP     UB          
      4.25484181E-08    3      1000024         4        -4             # W2SS+  -->  W1SS+  CH     CB          
      2.47767583E-01    2      1000024        25                       # W2SS+  -->  W1SS+  HL0                
#         PDG         Width
DECAY        25  3.10585927E-03   # HL0   decays
#          BR          NDA       ID1       ID2       ID3       ID4
      5.04732833E-09    2           11       -11                       # HL0    -->  E-     E+                 
      2.13105581E-04    2           13       -13                       # HL0    -->  MU-    MU+                
      6.08969852E-02    2           15       -15                       # HL0    -->  TAU-   TAU+               
      6.35828201E-06    2            1        -1                       # HL0    -->  DN     DB                 
      2.56906240E-03    2            3        -3                       # HL0    -->  ST     SB                 
      8.70620012E-01    2            5        -5                       # HL0    -->  BT     BB                 
      1.99454371E-06    2            2        -2                       # HL0    -->  UP     UB                 
      3.89586687E-02    2            4        -4                       # HL0    -->  CH     CB                 
      1.03346037E-03    2           22        22                       # HL0    -->  GM     GM                 
      2.54644770E-02    2           21        21                       # HL0    -->  GL     GL                 
      1.30855660E-05    3           24        11       -12             # HL0    -->  W+     E-     ANUE        
      1.30855660E-05    3           24        13       -14             # HL0    -->  W+     MU-    ANUM        
      1.30855660E-05    3           24        15       -16             # HL0    -->  W+     TAU-   ANUT        
      3.92566981E-05    3           24        -2         1             # HL0    -->  W+     UB     DN          
      3.92566981E-05    3           24        -4         3             # HL0    -->  W+     CB     ST          
      1.30855660E-05    3          -24       -11        12             # HL0    -->  W-     E+     NUE         
      1.30855660E-05    3          -24       -13        14             # HL0    -->  W-     MU+    NUM         
      1.30855660E-05    3          -24       -15        16             # HL0    -->  W-     TAU+   NUT         
      3.92566981E-05    3          -24         2        -1             # HL0    -->  W-     UP     DB          
      3.92566981E-05    3          -24         4        -3             # HL0    -->  W-     CH     SB          
#         PDG         Width
DECAY        35  1.43886471E+01   # HH0   decays
#          BR          NDA       ID1       ID2       ID3       ID4
      5.98154651E-11    2           11       -11                       # HH0    -->  E-     E+                 
      2.52551672E-06    2           13       -13                       # HH0    -->  MU-    MU+                
      7.23338278E-04    2           15       -15                       # HH0    -->  TAU-   TAU+               
      7.31358796E-08    2            1        -1                       # HH0    -->  DN     DB                 
      2.95505961E-05    2            3        -3                       # HH0    -->  ST     SB                 
      4.30408027E-03    2            5        -5                       # HH0    -->  BT     BB                 
      1.49182477E-09    2            2        -2                       # HH0    -->  UP     UB                 
      2.04455464E-05    2            4        -4                       # HH0    -->  CH     CB                 
      9.88414645E-01    2            6        -6                       # HH0    -->  TP     TB                 
      3.18078582E-06    2           22        22                       # HH0    -->  GM     GM                 
      5.30133955E-04    2           21        21                       # HH0    -->  GL     GL                 
      7.15913658E-04    2           24       -24                       # HH0    -->  W+     W-                 
      3.64962529E-04    2           23        23                       # HH0    -->  Z0     Z0                 
      1.25483726E-04    2      1000022   1000022                       # HH0    -->  Z1SS   Z1SS               
      3.89625842E-04    2      1000022   1000023                       # HH0    -->  Z1SS   Z2SS               
      2.47696508E-03    2           25        25                       # HH0    -->  HL0    HL0                
      9.62575650E-05    2      1000011  -1000011                       # HH0    -->  EL-    EL+                
      1.57765957E-04    2      2000011  -2000011                       # HH0    -->  ER-    ER+                
      9.62552222E-05    2      1000013  -1000013                       # HH0    -->  MUL-   MUL+               
      1.57761518E-04    2      2000013  -2000013                       # HH0    -->  MUR-   MUR+               
      1.51772241E-04    2      1000015  -1000015                       # HH0    -->  TAU1-  TAU1+              
      1.00753809E-04    2      2000015  -2000015                       # HH0    -->  TAU2-  TAU2+              
      2.70950277E-05    2      1000015  -2000015                       # HH0    -->  TAU1-  TAU2+              
      2.70950277E-05    2      2000015  -1000015                       # HH0    -->  TAU2-  TAU1+              
      3.55451833E-04    2      1000012  -1000012                       # HH0    -->  NUEL   ANUEL              
      3.55451833E-04    2      1000014  -1000014                       # HH0    -->  NUML   ANUML              
      3.73572577E-04    2      1000016  -1000016                       # HH0    -->  NUTL   ANUTL              
#         PDG         Width
DECAY        36  1.50083141E+01   # HA0   decays
#          BR          NDA       ID1       ID2       ID3       ID4
      5.70843130E-11    2           11       -11                       # HA0    -->  E-     E+                 
      2.41020257E-06    2           13       -13                       # HA0    -->  MU-    MU+                
      6.90316258E-04    2           15       -15                       # HA0    -->  TAU-   TAU+               
      6.98012599E-08    2            1        -1                       # HA0    -->  DN     DB                 
      2.82032415E-05    2            3        -3                       # HA0    -->  ST     SB                 
      4.10794839E-03    2            5        -5                       # HA0    -->  BT     BB                 
      1.39588197E-09    2            2        -2                       # HA0    -->  UP     UB                 
      1.91495619E-05    2            4        -4                       # HA0    -->  CH     CB                 
      9.85402107E-01    2            6        -6                       # HA0    -->  TP     TB                 
      3.50896607E-06    2           22        22                       # HA0    -->  GM     GM                 
      5.09426405E-04    2           21        21                       # HA0    -->  GL     GL                 
      8.88081384E-04    2      1000022   1000022                       # HA0    -->  Z1SS   Z1SS               
      7.62440264E-03    2      1000022   1000023                       # HA0    -->  Z1SS   Z2SS               
      6.72657101E-04    2           25        23                       # HA0    -->  HL0    Z0                 
      2.89222986E-12    2      1000011  -2000011                       # HA0    -->  EL-    ER+                
      2.89222986E-12    2      2000011  -1000011                       # HA0    -->  ER-    EL+                
      1.22115168E-07    2      1000013  -2000013                       # HA0    -->  MUL-   MUR+               
      1.22115168E-07    2      2000013  -1000013                       # HA0    -->  MUR-   MUL+               
      2.57363881E-05    2      1000015  -2000015                       # HA0    -->  TAU1-  TAU2+              
      2.57363881E-05    2      2000015  -1000015                       # HA0    -->  TAU2-  TAU1+              
#         PDG         Width
DECAY        37  1.37401066E+01   # H+    decays
#          BR          NDA       ID1       ID2       ID3       ID4
      6.28860644E-11    2           12       -11                       # H+     -->  NUE    E+                 
      2.65516292E-06    2           14       -13                       # H+     -->  NUM    MU+                
      7.60476396E-04    2           16       -15                       # H+     -->  NUT    TAU+               
      7.22276567E-08    2            2        -1                       # H+     -->  UP     DB                 
      4.80190101E-05    2            4        -3                       # H+     -->  CH     SB                 
      9.88571465E-01    2            6        -5                       # H+     -->  TP     BB                 
      8.52618273E-03    2      1000024   1000022                       # H+     -->  W1SS+  Z1SS               
      7.46928039E-04    2           25        24                       # H+     -->  HL0    W+                 
      4.24111466E-04    2     -1000011   1000012                       # H+     -->  EL+    NUEL               
      4.24107799E-04    2     -1000013   1000014                       # H+     -->  MUL+   NUML               
      5.18961497E-05    2     -1000015   1000016                       # H+     -->  TAU1+  NUTL               
      4.44156467E-04    2     -2000015   1000016                       # H+     -->  TAU2+  NUTL               
