#
#                              ======================
#                              | THE SUSYHIT OUTPUT |
#                              ======================
#
#
#              ------------------------------------------------------
#              |     This is the output of the SUSY-HIT package     |
#              |  created by A.Djouadi, M.Muehlleitner and M.Spira. |
#              |  In case of problems with SUSY-HIT email to        |
#              |           margarete.muehlleitner@cern.ch           |
#              |           michael.spira@psi.ch                     |
#              |           abdelhak.djouadi@cern.ch                 |
#              ------------------------------------------------------
#
#              ------------------------------------------------------
#              |  SUSY Les Houches Accord - MSSM Spectrum + Decays  |
#              |              based on the decay programs           |
#              |                                                    |
#              |                     SDECAY 1.3b                    |
#              |                                                    |
#              |  Authors: M.Muhlleitner, A.Djouadi and Y.Mambrini  |
#              |  Ref.:    Comput.Phys.Commun.168(2005)46           |
#              |           [hep-ph/0311167]                         |
#              |                                                    |
#              |                     HDECAY 3.4                     |
#              |                                                    |
#              |  By: A.Djouadi,J.Kalinowski,M.Muhlleitner,M.Spira  |
#              |  Ref.:    Comput.Phys.Commun.108(1998)56           |
#              |           [hep-ph/9704448]                         |
#              |                                                    |
#              |                                                    |
#              |  If not stated otherwise all DRbar couplings and   |
#              |  soft SUSY breaking masses are given at the scale  |
#              |  Q=  0.35118660E+04
#              |                                                    |
#              ------------------------------------------------------
#
#
BLOCK DCINFO  # Decay Program information
     1   SDECAY/HDECAY # decay calculator
     2   1.3b  /3.4    # version number
#
BLOCK SPINFO  # Spectrum calculator information
     1     SOFTSUSY    # spectrum calculator               
     2     3.4.0       # version number                    
#
BLOCK MODSEL  # Model selection
     1     0   #  nonUniversal                                     
#
BLOCK SMINPUTS  # Standard Model inputs
         1     1.27908970E+02   # alpha_em^-1(M_Z)^MSbar
         2     1.16637870E-05   # G_F [GeV^-2]
         3     1.18400000E-01   # alpha_S(M_Z)^MSbar
         4     9.11876000E+01   # M_Z pole mass
         5     4.18000000E+00   # mb(mb)^MSbar
         6     1.73200000E+02   # mt pole mass
         7     1.77700000E+00   # mtau pole mass
#
BLOCK MINPAR  # Input parameters - minimal models
         3     2.27600000E+01   # tanb                
#
BLOCK EXTPAR  # Input parameters - non-minimal models
         0    -1.00000000E+00   # Set                 
         1     1.90018000E+03   # M_1(MX)             
         2    -9.85880000E+02   # M_2(MX)             
         3     1.16477000E+03   # M_3(MX)             
        11    -4.32075000E+03   # At(MX)              
        12     1.92303000E+03   # Ab(MX)              
        13     1.74869000E+03   # Atau(MX)            
        23    -2.40430000E+02   # mu(MX)              
        26     2.06330000E+03   # mA(pole)            
        31     1.02595000E+03   # meL(MX)             
        32     1.02595000E+03   # mmuL(MX)            
        33     8.21140000E+02   # mtauL(MX)           
        34     1.04831000E+03   # meR(MX)             
        35     1.04831000E+03   # mmuR(MX)            
        36     6.23440000E+02   # mtauR(MX)           
        41     2.29015000E+03   # mqL1(MX)            
        42     2.29015000E+03   # mqL2(MX)            
        43     3.78709000E+03   # mqL3(MX)            
        44     3.25902000E+03   # muR(MX)             
        45     3.25902000E+03   # mcR(MX)             
        46     3.25582000E+03   # mtR(MX)             
        47     6.24560000E+02   # mdR(MX)             
        48     6.24560000E+02   # msR(MX)             
        49     1.56652000E+03   # mbR(MX)             
#
BLOCK MASS  # Mass Spectrum
# PDG code           mass       particle
        24     8.03792455E+01   # W+
        25     1.27400221E+02   # h
        35     2.06332329E+03   # H
        36     2.06330000E+03   # A
        37     2.06506752E+03   # H+
         5     4.81876030E+00   # b-quark pole mass calculated from mb(mb)_Msbar
   1000001     2.34234353E+03   # ~d_L
   2000001     7.64843517E+02   # ~d_R
   1000002     2.34115165E+03   # ~u_L
   2000002     3.29649275E+03   # ~u_R
   1000003     2.34234353E+03   # ~s_L
   2000003     7.64843517E+02   # ~s_R
   1000004     2.34115165E+03   # ~c_L
   2000004     3.29649275E+03   # ~c_R
   1000005     1.62156005E+03   # ~b_1
   2000005     3.78517620E+03   # ~b_2
   1000006     3.20423602E+03   # ~t_1
   2000006     3.79923695E+03   # ~t_2
   1000011     1.03853344E+03   # ~e_L
   2000011     1.08148757E+03   # ~e_R
   1000012     1.03522148E+03   # ~nu_eL
   1000013     1.03853344E+03   # ~mu_L
   2000013     1.08148757E+03   # ~mu_R
   1000014     1.03522148E+03   # ~nu_muL
   1000015     6.65429879E+02   # ~tau_1
   2000015     8.32757437E+02   # ~tau_2
   1000016     8.28282711E+02   # ~nu_tauL
   1000021     1.35569557E+03   # ~g
   1000022    -2.48205807E+02   # ~chi_10
   1000023     2.53514933E+02   # ~chi_20
   1000025    -1.01964687E+03   # ~chi_30
   1000035     1.85857872E+03   # ~chi_40
   1000024     2.50136014E+02   # ~chi_1+
   1000037     1.01982980E+03   # ~chi_2+
#
BLOCK NMIX  # Neutralino Mixing Matrix
  1  1     1.51571789E-02   # N_11
  1  2     7.49675736E-02   # N_12
  1  3     7.09810746E-01   # N_13
  1  4    -7.00227697E-01   # N_14
  2  1    -1.83735943E-02   # N_21
  2  2    -4.21277252E-02   # N_22
  2  3     7.03992316E-01   # N_23
  2  4     7.08718904E-01   # N_24
  3  1    -1.27819651E-03   # N_31
  3  2     9.96295494E-01   # N_32
  3  3    -2.36414068E-02   # N_33
  3  4     8.26724758E-02   # N_34
  4  1     9.99715478E-01   # N_41
  4  2    -6.37054487E-04   # N_42
  4  3     2.14653313E-03   # N_43
  4  4     2.37476185E-02   # N_44
#
BLOCK UMIX  # Chargino Mixing Matrix U
  1  1     3.34944140E-02   # U_11
  1  2     9.99438905E-01   # U_12
  2  1    -9.99438905E-01   # U_21
  2  2     3.34944140E-02   # U_22
#
BLOCK VMIX  # Chargino Mixing Matrix V
  1  1    -1.17182735E-01   # V_11
  1  2    -9.93110370E-01   # V_12
  2  1     9.93110370E-01   # V_21
  2  2    -1.17182735E-01   # V_22
#
BLOCK STOPMIX  # Stop Mixing Matrix
  1  1     1.48066186E-01   # cos(theta_t)
  1  2     9.88977454E-01   # sin(theta_t)
  2  1    -9.88977454E-01   # -sin(theta_t)
  2  2     1.48066186E-01   # cos(theta_t)
#
BLOCK SBOTMIX  # Sbottom Mixing Matrix
  1  1    -1.41865406E-03   # cos(theta_b)
  1  2     9.99998994E-01   # sin(theta_b)
  2  1    -9.99998994E-01   # -sin(theta_b)
  2  2    -1.41865406E-03   # cos(theta_b)
#
BLOCK STAUMIX  # Stau Mixing Matrix
  1  1    -5.22471851E-02   # cos(theta_tau)
  1  2     9.98634183E-01   # sin(theta_tau)
  2  1    -9.98634183E-01   # -sin(theta_tau)
  2  2    -5.22471851E-02   # cos(theta_tau)
#
BLOCK ALPHA  # Higgs mixing
          -4.60741532E-02   # Mixing angle in the neutral Higgs boson sector
#
BLOCK HMIX Q=  3.51186600E+03  # DRbar Higgs Parameters
         1    -2.44685015E+02   # mu(Q)MSSM           
         2     2.18157122E+01   # tan                 
         3     2.41506555E+02   # higgs               
         4     4.32870443E+06   # mA^2(Q)MSSM         
#
BLOCK GAUGE Q=  3.51186600E+03  # The gauge couplings
     1     3.66311393E-01   # gprime(Q) DRbar
     2     6.41482191E-01   # g(Q) DRbar
     3     1.02389673E+00   # g3(Q) DRbar
#
BLOCK AU Q=  3.51186600E+03  # The trilinear couplings
  1  1     0.00000000E+00   # A_u(Q) DRbar
  2  2     0.00000000E+00   # A_c(Q) DRbar
  3  3    -4.32074999E+03   # A_t(Q) DRbar
#
BLOCK AD Q=  3.51186600E+03  # The trilinear couplings
  1  1     0.00000000E+00   # A_d(Q) DRbar
  2  2     0.00000000E+00   # A_s(Q) DRbar
  3  3     1.92303000E+03   # A_b(Q) DRbar
#
BLOCK AE Q=  3.51186600E+03  # The trilinear couplings
  1  1     0.00000000E+00   # A_e(Q) DRbar
  2  2     0.00000000E+00   # A_mu(Q) DRbar
  3  3     1.74869000E+03   # A_tau(Q) DRbar
#
BLOCK Yu Q=  3.51186600E+03  # The Yukawa couplings
  1  1     0.00000000E+00   # y_u(Q) DRbar
  2  2     0.00000000E+00   # y_c(Q) DRbar
  3  3     8.16381413E-01   # y_t(Q) DRbar
#
BLOCK Yd Q=  3.51186600E+03  # The Yukawa couplings
  1  1     0.00000000E+00   # y_d(Q) DRbar
  2  2     0.00000000E+00   # y_s(Q) DRbar
  3  3     2.98253842E-01   # y_b(Q) DRbar
#
BLOCK Ye Q=  3.51186600E+03  # The Yukawa couplings
  1  1     0.00000000E+00   # y_e(Q) DRbar
  2  2     0.00000000E+00   # y_mu(Q) DRbar
  3  3     2.28560937E-01   # y_tau(Q) DRbar
#
BLOCK MSOFT Q=  3.51186600E+03  # The soft SUSY breaking masses at the scale Q
         1     1.90018000E+03   # M_1(Q)              
         2    -9.85880000E+02   # M_2(Q)              
         3     1.16477000E+03   # M_3(Q)              
        21     4.23875571E+06   # mH1^2(Q)            
        22     2.03061102E+05   # mH2^2(Q)            
        31     1.02595000E+03   # meL(Q)              
        32     1.02595000E+03   # mmuL(Q)             
        33     8.21140000E+02   # mtauL(Q)            
        34     1.04831000E+03   # meR(Q)              
        35     1.04831000E+03   # mmuR(Q)             
        36     6.23440000E+02   # mtauR(Q)            
        41     2.29015000E+03   # mqL1(Q)             
        42     2.29015000E+03   # mqL2(Q)             
        43     3.78708999E+03   # mqL3(Q)             
        44     3.25902000E+03   # muR(Q)              
        45     3.25902000E+03   # mcR(Q)              
        46     3.25581999E+03   # mtR(Q)              
        47     6.24559989E+02   # mdR(Q)              
        48     6.24559989E+02   # msR(Q)              
        49     1.56652000E+03   # mbR(Q)              
#
Block HiggsBoundsInputHiggsCouplingsFermions
# ScalarNormEffCoupSq PseudoSNormEffCoupSq NP   IP1 IP2 IP2
    1.01171398E+00    0.00000000E+00        3  25   5   5  # h0-b-b eff. coupling^2, normalised to SM
    4.75913585E+02    0.00000000E+00        3  35   5   5  # H0-b-b eff. coupling^2, normalised to SM
    0.00000000E+00    4.75925299E+02        3  36   5   5  # A0-b-b eff. coupling^2, normalised to SM
#
    9.99975387E-01    0.00000000E+00        3  25   6   6  # h0-t-t eff. coupling^2, normalised to SM
    2.12578315E-03    0.00000000E+00        3  35   6   6  # H0-t-t eff. coupling^2, normalised to SM
    0.00000000E+00    2.10117008E-03        3  36   6   6  # A0-t-t eff. coupling^2, normalised to SM
#
    1.01171398E+00    0.00000000E+00        3  25  15  15  # h0-tau-tau eff. coupling^2, normalised to SM
    4.75913585E+02    0.00000000E+00        3  35  15  15  # H0-tau-tau eff. coupling^2, normalised to SM
    0.00000000E+00    4.75925299E+02        3  36  15  15  # A0-tau-tau eff. coupling^2, normalised to SM
#
Block HiggsBoundsInputHiggsCouplingsBosons
    9.99999928E-01        3  25  24  24  # h0-W-W eff. coupling^2, normalised to SM
    7.16610374E-08        3  35  24  24  # H0-W-W eff. coupling^2, normalised to SM
    0.00000000E+00        3  36  24  24  # A0-W-W eff. coupling^2, normalised to SM
#
    9.99999928E-01        3  25  23  23  # h0-Z-Z eff. coupling^2, normalised to SM
    7.16610374E-08        3  35  23  23  # H0-Z-Z eff. coupling^2, normalised to SM
    0.00000000E+00        3  36  23  23  # A0-Z-Z eff. coupling^2, normalised to SM
#
    8.88481712E-01        3  25  21  21  # h0-g-g eff. coupling^2, normalised to SM
    2.62992331E-12        3  35  21  21  # H0-g-g eff. coupling^2, normalised to SM
    7.52223706E-11        3  36  21  21  # A0-g-g eff. coupling^2, normalised to SM
#
    0.00000000E+00        3  25  25  23  # h0-h0-Z eff. coupling^2, normalised to SM
    0.00000000E+00        3  35  25  23  # H0-h0-Z eff. coupling^2, normalised to SM
    7.16610374E-08        3  36  25  23  # A0-h0-Z eff. coupling^2, normalised to SM
    0.00000000E+00        3  35  35  23  # H0-H0-Z eff. coupling^2, normalised to SM
    9.99999928E-01        3  36  35  23  # A0-H0-Z eff. coupling^2, normalised to SM
    0.00000000E+00        3  36  36  23  # A0-A0-Z eff. coupling^2, normalised to SM
#
    0.00000000E+00        4  25  21  21  23  # h0-g-g-Z eff. coupling^2, normalised to SM
    0.00000000E+00        4  35  21  21  23  # H0-g-g-Z eff. coupling^2, normalised to SM
    0.00000000E+00        4  36  21  21  23  # A0-g-g-Z eff. coupling^2, normalised to SM
#
#
#
#                             =================
#                             |The decay table|
#                             =================
#
# - The QCD corrections to the decays gluino -> squark  + quark
#                                     squark -> gaugino + quark_prime
#                                     squark -> squark_prime + Higgs
#                                     squark -> gluino  + quark
#   are included.
#
# - The multi-body decays for the inos, stops and sbottoms are included.
#
# - The loop induced decays for the gluino, neutralinos and stops
#   are included.
#
# - The SUSY decays of the top quark are included.
#
#
#         PDG            Width
DECAY         6     1.44971959E+00   # top decays
#          BR         NDA      ID1       ID2
     1.00000000E+00    2           5        24   # BR(t ->  b    W+)
#
#         PDG            Width
DECAY   1000021     2.43197024E+01   # gluino decays
#          BR         NDA      ID1       ID2
     2.50000000E-01    2     2000001        -1   # BR(~g -> ~d_R  db)
     2.50000000E-01    2    -2000001         1   # BR(~g -> ~d_R* d )
     2.50000000E-01    2     2000003        -3   # BR(~g -> ~s_R  sb)
     2.50000000E-01    2    -2000003         3   # BR(~g -> ~s_R* s )
#
#         PDG            Width
DECAY   1000006     2.07489629E+02   # stop1 decays
#          BR         NDA      ID1       ID2
     9.73637896E-02    2     1000022         6   # BR(~t_1 -> ~chi_10 t )
     9.99723869E-02    2     1000023         6   # BR(~t_1 -> ~chi_20 t )
     4.45348531E-03    2     1000025         6   # BR(~t_1 -> ~chi_30 t )
     1.57119826E-02    2     1000035         6   # BR(~t_1 -> ~chi_40 t )
     1.90336427E-01    2     1000024         5   # BR(~t_1 -> ~chi_1+ b )
     8.85853608E-03    2     1000037         5   # BR(~t_1 -> ~chi_2+ b )
     5.83301575E-01    2     1000021         6   # BR(~t_1 -> ~g      t )
     1.81675404E-06    2     1000005        24   # BR(~t_1 -> ~b_1    W+)
#
#         PDG            Width
DECAY   2000006     2.73269115E+02   # stop2 decays
#          BR         NDA      ID1       ID2
     9.07281482E-02    2     1000022         6   # BR(~t_2 -> ~chi_10 t )
     9.23652365E-02    2     1000023         6   # BR(~t_2 -> ~chi_20 t )
     4.66498417E-02    2     1000025         6   # BR(~t_2 -> ~chi_30 t )
     1.75106071E-03    2     1000035         6   # BR(~t_2 -> ~chi_40 t )
     3.41853716E-02    2     1000024         5   # BR(~t_2 -> ~chi_1+ b )
     9.03622736E-02    2     1000037         5   # BR(~t_2 -> ~chi_2+ b )
     5.79245839E-01    2     1000021         6   # BR(~t_2 -> ~g      t )
     3.05463392E-02    2     1000006        25   # BR(~t_2 -> ~t_1    h )
     1.42734846E-03    2     1000005        37   # BR(~t_2 -> ~b_1    H+)
     3.26019674E-02    2     1000006        23   # BR(~t_2 -> ~t_1    Z )
     1.36573363E-04    2     1000005        24   # BR(~t_2 -> ~b_1    W+)
#
#         PDG            Width
DECAY   1000005     1.35719049E+01   # sbottom1 decays
#          BR         NDA      ID1       ID2
     1.01655125E-01    2     1000022         5   # BR(~b_1 -> ~chi_10 b )
     9.97371254E-02    2     1000023         5   # BR(~b_1 -> ~chi_20 b )
     3.57507222E-05    2     1000025         5   # BR(~b_1 -> ~chi_30 b )
     1.96473878E-01    2    -1000024         6   # BR(~b_1 -> ~chi_1- t )
     6.66983469E-05    2    -1000037         6   # BR(~b_1 -> ~chi_2- t )
     6.02031422E-01    2     1000021         5   # BR(~b_1 -> ~g      b )
#
#         PDG            Width
DECAY   2000005     2.73529355E+02   # sbottom2 decays
#          BR         NDA      ID1       ID2
     1.25190108E-02    2     1000022         5   # BR(~b_2 -> ~chi_10 b )
     1.21143192E-02    2     1000023         5   # BR(~b_2 -> ~chi_20 b )
     4.83993207E-02    2     1000025         5   # BR(~b_2 -> ~chi_30 b )
     1.18934227E-03    2     1000035         5   # BR(~b_2 -> ~chi_40 b )
     1.78694203E-01    2    -1000024         6   # BR(~b_2 -> ~chi_1- t )
     9.97851699E-02    2    -1000037         6   # BR(~b_2 -> ~chi_2- t )
     5.84855806E-01    2     1000021         5   # BR(~b_2 -> ~g      b )
     7.71503840E-05    2     1000005        25   # BR(~b_2 -> ~b_1    h )
     7.07875655E-04    2     1000005        35   # BR(~b_2 -> ~b_1    H )
     7.08018862E-04    2     1000005        36   # BR(~b_2 -> ~b_1    A )
     7.06694883E-05    2     1000005        23   # BR(~b_2 -> ~b_1    Z )
     6.08791136E-02    2     1000006       -24   # BR(~b_2 -> ~t_1    W-)
#
#         PDG            Width
DECAY   1000002     9.67480803E+01   # sup_L decays
#          BR         NDA      ID1       ID2
     5.64309833E-04    2     1000022         2   # BR(~u_L -> ~chi_10 u)
     1.93627438E-04    2     1000023         2   # BR(~u_L -> ~chi_20 u)
     6.23366739E-02    2     1000025         2   # BR(~u_L -> ~chi_30 u)
     4.79284610E-04    2     1000035         2   # BR(~u_L -> ~chi_40 u)
     2.55610946E-03    2     1000024         1   # BR(~u_L -> ~chi_1+ d)
     1.23917348E-01    2     1000037         1   # BR(~u_L -> ~chi_2+ d)
     8.09952647E-01    2     1000021         2   # BR(~u_L -> ~g      u)
#
#         PDG            Width
DECAY   2000002     1.75950986E+02   # sup_R decays
#          BR         NDA      ID1       ID2
     9.76494335E-06    2     1000022         2   # BR(~u_R -> ~chi_10 u)
     1.43421566E-05    2     1000023         2   # BR(~u_R -> ~chi_20 u)
     5.75338657E-08    2     1000025         2   # BR(~u_R -> ~chi_30 u)
     2.00800912E-02    2     1000035         2   # BR(~u_R -> ~chi_40 u)
     9.79895744E-01    2     1000021         2   # BR(~u_R -> ~g      u)
#
#         PDG            Width
DECAY   1000001     9.68063182E+01   # sdown_L decays
#          BR         NDA      ID1       ID2
     4.83731544E-04    2     1000022         1   # BR(~d_L -> ~chi_10 d)
     1.38801108E-04    2     1000023         1   # BR(~d_L -> ~chi_20 d)
     6.24217980E-02    2     1000025         1   # BR(~d_L -> ~chi_30 d)
     4.87362414E-04    2     1000035         1   # BR(~d_L -> ~chi_40 d)
     2.08819917E-04    2    -1000024         2   # BR(~d_L -> ~chi_1- u)
     1.25550397E-01    2    -1000037         2   # BR(~d_L -> ~chi_2- u)
     8.10709090E-01    2     1000021         1   # BR(~d_L -> ~g      d)
#
#         PDG            Width
DECAY   2000001     2.10694698E-04   # sdown_R decays
#           BR         NDA      ID1       ID2
     3.99817940E-01    2     1000022         1   # BR(~d_R -> ~chi_10 d)
     5.81583623E-01    2     1000023         1   # BR(~d_R -> ~chi_20 d)
#           BR         NDA      ID1       ID2       ID3
     2.06844312E-06    3        1       -15        1000015   # BR(~d_R -> d  tau+  ~tau_1-)
     1.38888165E-05    3        1       15        -1000015   # BR(~d_R -> d  tau-  ~tau_1+)
     2.89086534E-03    3        1       23        1000022   # BR(~d_R -> d  Z  ~chi_10)
     1.24943818E-03    3        1       25        1000022   # BR(~d_R -> d  h  ~chi_10)
     1.34588104E-03    3        1       23        1000023   # BR(~d_R -> d  Z  ~chi_20)
     2.77591228E-03    3        1       25        1000023   # BR(~d_R -> d  h  ~chi_20)
     6.38127115E-04    3        1       -24        1000024   # BR(~d_R -> d  W-  ~chi_1+)
     9.68225596E-03    3        1       24        -1000024   # BR(~d_R -> d  W+  ~chi_1-)
#
#         PDG            Width
DECAY   1000004     7.65580841E+01   # scharm_L decays
#          BR         NDA      ID1       ID2
     7.41713973E-04    2     1000022         4   # BR(~c_L -> ~chi_10 c)
     2.54489190E-04    2     1000023         4   # BR(~c_L -> ~chi_20 c)
     8.15409313E-02    2     1000025         4   # BR(~c_L -> ~chi_30 c)
     6.15580250E-04    2     1000035         4   # BR(~c_L -> ~chi_40 c)
     3.35963972E-03    2     1000024         3   # BR(~c_L -> ~chi_1+ s)
     1.62092946E-01    2     1000037         3   # BR(~c_L -> ~chi_2+ s)
     7.51394699E-01    2     1000021         4   # BR(~c_L -> ~g      c)
#
#         PDG            Width
DECAY   2000004     1.30211587E+02   # scharm_R decays
#          BR         NDA      ID1       ID2
     1.36451849E-05    2     1000022         4   # BR(~c_R -> ~chi_10 c)
     2.00408791E-05    2     1000023         4   # BR(~c_R -> ~chi_20 c)
     8.02649288E-08    2     1000025         4   # BR(~c_R -> ~chi_30 c)
     2.79357435E-02    2     1000035         4   # BR(~c_R -> ~chi_40 c)
     9.72030490E-01    2     1000021         4   # BR(~c_R -> ~g      c)
#
#         PDG            Width
DECAY   1000003     7.65809594E+01   # sstrange_L decays
#          BR         NDA      ID1       ID2
     6.35989871E-04    2     1000022         3   # BR(~s_L -> ~chi_10 s)
     1.82482970E-04    2     1000023         3   # BR(~s_L -> ~chi_20 s)
     8.16767893E-02    2     1000025         3   # BR(~s_L -> ~chi_30 s)
     6.26180541E-04    2     1000035         3   # BR(~s_L -> ~chi_40 s)
     2.74543732E-04    2    -1000024         4   # BR(~s_L -> ~chi_1- c)
     1.64278033E-01    2    -1000037         4   # BR(~s_L -> ~chi_2- c)
     7.52325981E-01    2     1000021         3   # BR(~s_L -> ~g      s)
#
#         PDG            Width
DECAY   2000003     2.08735419E-04   # sstrange_R decays
#           BR         NDA      ID1       ID2
     3.99737330E-01    2     1000022         3   # BR(~s_R -> ~chi_10 s)
     5.81425797E-01    2     1000023         3   # BR(~s_R -> ~chi_20 s)
#           BR         NDA      ID1       ID2       ID3
     2.08785841E-06    3        3       -15        1000015   # BR(~s_R -> s  tau+  ~tau_1-)
     1.40220573E-05    3        3       15        -1000015   # BR(~s_R -> s  tau-  ~tau_1+)
     2.92705476E-03    3        3       23        1000022   # BR(~s_R -> s  Z  ~chi_10)
     1.26116594E-03    3        3       25        1000022   # BR(~s_R -> s  h  ~chi_10)
     1.35851406E-03    3        3       23        1000023   # BR(~s_R -> s  Z  ~chi_20)
     2.80436355E-03    3        3       25        1000023   # BR(~s_R -> s  h  ~chi_20)
     6.42871253E-04    3        3       -24        1000024   # BR(~s_R -> s  W-  ~chi_1+)
     9.82679420E-03    3        3       24        -1000024   # BR(~s_R -> s  W+  ~chi_1-)
#
#         PDG            Width
DECAY   1000011     6.15937499E-02   # selectron_L decays
#          BR         NDA      ID1       ID2
     4.29059270E-01    2     1000022        11   # BR(~e_L -> ~chi_10 e-)
     1.68999885E-01    2     1000023        11   # BR(~e_L -> ~chi_20 e-)
     8.88554434E-02    2     1000025        11   # BR(~e_L -> ~chi_30 e-)
     1.37410362E-01    2    -1000024        12   # BR(~e_L -> ~chi_1- nu_e)
     1.75675039E-01    2    -1000037        12   # BR(~e_L -> ~chi_2- nu_e)
#
#         PDG            Width
DECAY   2000011     3.15910521E-03   # selectron_R decays
#           BR         NDA      ID1       ID2
     3.76838985E-01    2     1000022        11   # BR(~e_R -> ~chi_10 e-)
     5.51082578E-01    2     1000023        11   # BR(~e_R -> ~chi_20 e-)
#           BR         NDA      ID1       ID2       ID3
     1.32759111E-04    3        11       -1        2000001   # BR(~e_R- -> e-  db  ~d_R)
     5.29042210E-04    3        11       1        -2000001   # BR(~e_R- -> e-  d  ~d_R*)
     1.31575232E-04    3        11       -3        2000003   # BR(~e_R- -> e-  sb  ~s_R)
     5.32239318E-04    3        11       3        -2000003   # BR(~e_R- -> e-  s  ~s_R*)
     2.44775007E-08    3        11       -11        1000011   # BR(~e_R- -> e-  e+  ~e_L-)
     9.56441715E-09    3        11       11        -1000011   # BR(~e_R- -> e-  e-  ~e_L+)
     4.14864309E-08    3        11       -12        1000012   # BR(~e_R- -> e-  nu_eb  ~nu_eL)
     1.09822237E-08    3        11       12        -1000012   # BR(~e_R- -> e-  nu_e  ~nu_eL*)
     2.45395436E-08    3        11       -13        1000013   # BR(~e_R- -> e-  mu+  ~mu_L-)
     9.60683422E-09    3        11       13        -1000013   # BR(~e_R- -> e-  mu-  ~mu_L+)
     4.15307473E-08    3        11       -14        1000014   # BR(~e_R- -> e-  nu_mub  ~nu_muL)
     1.07891310E-08    3        11       14        -1000014   # BR(~e_R- -> e-  nu_mu  ~nu_muL*)
     1.22667647E-03    3        11       -15        1000015   # BR(~e_R- -> e-  tau+  ~tau_1-)
     5.47306876E-03    3        11       15        -1000015   # BR(~e_R- -> e-  tau-  ~tau_1+)
     1.37814340E-04    3        11       -15        2000015   # BR(~e_R- -> e-  tau+  ~tau_2-)
     3.33195614E-05    3        11       15        -2000015   # BR(~e_R- -> e-  tau-  ~tau_2+)
     1.34731189E-04    3        11       -16        1000016   # BR(~e_R- -> e-  nu_taub  ~nu_tau1)
     4.26070014E-05    3        11       16        -1000016   # BR(~e_R- -> e-  nu_tau  ~nu_tau1*)
     9.73946671E-03    3        11       23        1000022   # BR(~e_R- -> e-  Z  ~chi_10)
     4.61016619E-03    3        11       25        1000022   # BR(~e_R- -> e-  h  ~chi_10)
     4.44334680E-03    3        11       23        1000023   # BR(~e_R- -> e-  Z  ~chi_20)
     1.02424572E-02    3        11       25        1000023   # BR(~e_R- -> e-  h  ~chi_20)
     3.50637262E-03    3        11       -24        1000024   # BR(~e_R- -> e-  W-  ~chi_1+)
     3.11626215E-02    3        11       24        -1000024   # BR(~e_R- -> e-  W+  ~chi_1-)
#
#         PDG            Width
DECAY   1000013     6.15936618E-02   # smuon_L decays
#          BR         NDA      ID1       ID2
     4.29059874E-01    2     1000022        13   # BR(~mu_L -> ~chi_10 mu-)
     1.69000123E-01    2     1000023        13   # BR(~mu_L -> ~chi_20 mu-)
     8.88541544E-02    2     1000025        13   # BR(~mu_L -> ~chi_30 mu-)
     1.37410559E-01    2    -1000024        14   # BR(~mu_L -> ~chi_1- nu_mu)
     1.75675290E-01    2    -1000037        14   # BR(~mu_L -> ~chi_2- nu_mu)
#
#         PDG            Width
DECAY   2000013     3.15946015E-03   # smuon_R decays
#           BR         NDA      ID1       ID2
     3.76796641E-01    2     1000022        13   # BR(~mu_R -> ~chi_10 mu-)
     5.51020655E-01    2     1000023        13   # BR(~mu_R -> ~chi_20 mu-)
#           BR         NDA      ID1       ID2       ID3
     1.32744197E-04    3        13       -1        2000001   # BR(~mu_R- -> mu-  db  ~d_R)
     5.33951980E-04    3        13       1        -2000001   # BR(~mu_R- -> mu-  d  ~d_R*)
     1.31652238E-04    3        13       -3        2000003   # BR(~mu_R- -> mu-  sb  ~s_R)
     5.28476361E-04    3        13       3        -2000003   # BR(~mu_R- -> mu-  s  ~s_R*)
     2.45763505E-08    3        13       -11        1000011   # BR(~mu_R- -> mu-  e+  ~e_L-)
     9.64911680E-09    3        13       11        -1000011   # BR(~mu_R- -> mu-  e-  ~e_L+)
     4.14374589E-08    3        13       -12        1000012   # BR(~mu_R- -> mu-  nu_eb  ~nu_eL)
     1.09756092E-08    3        13       12        -1000012   # BR(~mu_R- -> mu-  nu_e  ~nu_eL*)
     2.44348707E-08    3        13       -13        1000013   # BR(~mu_R- -> mu-  mu+  ~mu_L-)
     9.58106720E-09    3        13       13        -1000013   # BR(~mu_R- -> mu-  mu-  ~mu_L+)
     4.15640628E-08    3        13       -14        1000014   # BR(~mu_R- -> mu-  nu_mub  ~nu_muL)
     1.09971319E-08    3        13       14        -1000014   # BR(~mu_R- -> mu-  nu_mu  ~nu_muL*)
     1.22653866E-03    3        13       -15        1000015   # BR(~mu_R- -> mu-  tau+  ~tau_1-)
     5.46707323E-03    3        13       15        -1000015   # BR(~mu_R- -> mu-  tau-  ~tau_1+)
     1.36998088E-04    3        13       -15        2000015   # BR(~mu_R- -> mu-  tau+  ~tau_2-)
     3.33917806E-05    3        13       15        -2000015   # BR(~mu_R- -> mu-  tau-  ~tau_2+)
     1.34877473E-04    3        13       -16        1000016   # BR(~mu_R- -> mu-  nu_taub  ~nu_tau1)
     4.27604697E-05    3        13       16        -1000016   # BR(~mu_R- -> mu-  nu_tau  ~nu_tau1*)
     9.77097307E-03    3        13       23        1000022   # BR(~mu_R- -> mu-  Z  ~chi_10)
     4.60996478E-03    3        13       25        1000022   # BR(~mu_R- -> mu-  h  ~chi_10)
     4.44284762E-03    3        13       23        1000023   # BR(~mu_R- -> mu-  Z  ~chi_20)
     1.02413066E-02    3        13       25        1000023   # BR(~mu_R- -> mu-  h  ~chi_20)
     3.50597871E-03    3        13       -24        1000024   # BR(~mu_R- -> mu-  W-  ~chi_1+)
     3.12429957E-02    3        13       24        -1000024   # BR(~mu_R- -> mu-  W+  ~chi_1-)
#
#         PDG            Width
DECAY   1000015     1.02599530E+00   # stau_1 decays
#          BR         NDA      ID1       ID2
     2.57167116E-01    2     1000022        15   # BR(~tau_1 -> ~chi_10  tau-)
     2.42842839E-01    2     1000023        15   # BR(~tau_1 -> ~chi_20  tau-)
     4.99990045E-01    2    -1000024        16   # BR(~tau_1 -> ~chi_1-  nu_tau)
#
#         PDG            Width
DECAY   2000015     7.69164840E-01   # stau_2 decays
#          BR         NDA      ID1       ID2
     4.86976350E-01    2     1000022        15   # BR(~tau_2 -> ~chi_10  tau-)
     4.73168516E-01    2     1000023        15   # BR(~tau_2 -> ~chi_20  tau-)
     1.61634429E-03    2    -1000024        16   # BR(~tau_2 -> ~chi_1-  nu_tau)
     1.97660402E-02    2     1000015        25   # BR(~tau_2 -> ~tau_1   h)
     1.84727493E-02    2     1000015        23   # BR(~tau_2 -> ~tau_1   Z)
#
#         PDG            Width
DECAY   1000012     1.34521029E-01   # snu_eL decays
#          BR         NDA      ID1       ID2
     1.23048393E-01    2     1000022        12   # BR(~nu_eL -> ~chi_10 nu_e)
     2.78579744E-02    2     1000023        12   # BR(~nu_eL -> ~chi_20 nu_e)
     2.79250628E-02    2     1000025        12   # BR(~nu_eL -> ~chi_30 nu_e)
     7.67040597E-01    2     1000024        11   # BR(~nu_eL -> ~chi_1+ e-)
     5.41279724E-02    2     1000037        11   # BR(~nu_eL -> ~chi_2+ e-)
#
#         PDG            Width
DECAY   1000014     1.34520853E-01   # snu_muL decays
#          BR         NDA      ID1       ID2
     1.23048555E-01    2     1000022        14   # BR(~nu_muL -> ~chi_10 nu_mu)
     2.78580110E-02    2     1000023        14   # BR(~nu_muL -> ~chi_20 nu_mu)
     2.79250994E-02    2     1000025        14   # BR(~nu_muL -> ~chi_30 nu_mu)
     7.67041586E-01    2     1000024        13   # BR(~nu_muL -> ~chi_1+ mu-)
     5.41267489E-02    2     1000037        13   # BR(~nu_muL -> ~chi_2+ mu-)
#
#         PDG            Width
DECAY   1000016     8.30228868E-01   # snu_tauL decays
#          BR         NDA      ID1       ID2
     1.48769186E-02    2     1000022        16   # BR(~nu_tauL -> ~chi_10 nu_tau)
     3.35712191E-03    2     1000023        16   # BR(~nu_tauL -> ~chi_20 nu_tau)
     9.47204722E-01    2     1000024        15   # BR(~nu_tauL -> ~chi_1+ tau-)
     3.45612375E-02    2    -1000015       -24   # BR(~nu_tauL -> ~tau_1+ W-)
#
#         PDG            Width
DECAY   1000024     1.82253355E-11   # chargino1+ decays
#           BR         NDA      ID1       ID2       ID3
     5.99886977E-01    3     1000022         2        -1   # BR(~chi_1+ -> ~chi_10 u    db)
     1.99972976E-01    3     1000022       -11        12   # BR(~chi_1+ -> ~chi_10 e+   nu_e)
     1.99972976E-01    3     1000022       -13        14   # BR(~chi_1+ -> ~chi_10 mu+  nu_mu)
     1.67071456E-04    3     1000022       -15        16   # BR(~chi_1+ -> ~chi_10 tau+ nu_tau)
#
#         PDG            Width
DECAY   1000037     9.18412731E+00   # chargino2+ decays
#          BR         NDA      ID1       ID2
     5.19268713E-02    2     1000016       -15   # BR(~chi_2+ -> ~nu_tau1 tau+)
     2.43433743E-04    2    -1000015        16   # BR(~chi_2+ -> ~tau_1+  nu_tau)
     5.03376325E-02    2    -2000015        16   # BR(~chi_2+ -> ~tau_2+  nu_tau)
     2.27773970E-01    2     1000024        23   # BR(~chi_2+ -> ~chi_1+  Z )
     2.20977459E-01    2     1000022        24   # BR(~chi_2+ -> ~chi_10  W+)
     2.24703483E-01    2     1000023        24   # BR(~chi_2+ -> ~chi_20  W+)
     2.24037150E-01    2     1000024        25   # BR(~chi_2+ -> ~chi_1+  h )
#
#         PDG            Width
DECAY   1000022     0.00000000E+00   # neutralino1 decays
#
#         PDG            Width
DECAY   1000023     4.67478181E-09   # neutralino2 decays
#          BR         NDA      ID1       ID2
     4.43679262E-02    2     1000022        22   # BR(~chi_20 -> ~chi_10 gam)
#           BR         NDA      ID1       ID2       ID3
     1.05467249E-01    3     1000022        -2         2   # BR(~chi_20 -> ~chi_10 ub      u)
     1.36887032E-01    3     1000022        -1         1   # BR(~chi_20 -> ~chi_10 db      d)
     1.05467249E-01    3     1000022        -4         4   # BR(~chi_20 -> ~chi_10 cb      c)
     1.36887032E-01    3     1000022        -3         3   # BR(~chi_20 -> ~chi_10 sb      s)
     3.14369199E-02    3     1000022       -11        11   # BR(~chi_20 -> ~chi_10 e+      e-)
     3.14369199E-02    3     1000022       -13        13   # BR(~chi_20 -> ~chi_10 mu+     mu-)
     1.19945880E-02    3     1000022       -15        15   # BR(~chi_20 -> ~chi_10 tau+    tau-)
     6.28623219E-02    3     1000022       -12        12   # BR(~chi_20 -> ~chi_10 nu_eb   nu_e)
     6.28623219E-02    3     1000022       -14        14   # BR(~chi_20 -> ~chi_10 nu_mub  nu_mu)
     6.28633396E-02    3     1000022       -16        16   # BR(~chi_20 -> ~chi_10 nu_taub nu_tau)
     3.77034619E-02    3     1000024        -2         1   # BR(~chi_20 -> ~chi_1+ ub      d)
     3.77034619E-02    3    -1000024        -1         2   # BR(~chi_20 -> ~chi_1- db      u)
     3.77034619E-02    3     1000024        -4         3   # BR(~chi_20 -> ~chi_1+ cb      s)
     3.77034619E-02    3    -1000024        -3         4   # BR(~chi_20 -> ~chi_1- sb      c)
     1.25679242E-02    3     1000024       -12        11   # BR(~chi_20 -> ~chi_1+ nu_eb   e-)
     1.25679242E-02    3    -1000024        12       -11   # BR(~chi_20 -> ~chi_1- nu_e    e+)
     1.25679242E-02    3     1000024       -14        13   # BR(~chi_20 -> ~chi_1+ nu_mub  mu-)
     1.25679242E-02    3    -1000024        14       -13   # BR(~chi_20 -> ~chi_1- nu_mu   mu+)
     3.19077863E-03    3     1000024       -16        15   # BR(~chi_20 -> ~chi_1+ nu_taub tau-)
     3.19077863E-03    3    -1000024        16       -15   # BR(~chi_20 -> ~chi_1- nu_tau  tau+)
#
#         PDG            Width
DECAY   1000025     9.17814954E+00   # neutralino3 decays
#          BR         NDA      ID1       ID2
     5.37218789E-02    2     1000022        23   # BR(~chi_30 -> ~chi_10   Z )
     1.73802801E-01    2     1000023        23   # BR(~chi_30 -> ~chi_20   Z )
     2.24869726E-01    2     1000024       -24   # BR(~chi_30 -> ~chi_1+   W-)
     2.24869726E-01    2    -1000024        24   # BR(~chi_30 -> ~chi_1-   W+)
     1.68595354E-01    2     1000022        25   # BR(~chi_30 -> ~chi_10   h )
     5.17098716E-02    2     1000023        25   # BR(~chi_30 -> ~chi_20   h )
     3.11373154E-08    2     2000001        -1   # BR(~chi_30 -> ~d_R      db)
     3.11373154E-08    2    -2000001         1   # BR(~chi_30 -> ~d_R*     d )
     3.11373154E-08    2     2000003        -3   # BR(~chi_30 -> ~s _R      sb)
     3.11373154E-08    2    -2000003         3   # BR(~chi_30 -> ~s _R*     s )
     1.20701316E-04    2     1000015       -15   # BR(~chi_30 -> ~tau_1-   tau+)
     1.20701316E-04    2    -1000015        15   # BR(~chi_30 -> ~tau_1+   tau-)
     2.49465061E-02    2     2000015       -15   # BR(~chi_30 -> ~tau_2-   tau+)
     2.49465061E-02    2    -2000015        15   # BR(~chi_30 -> ~tau_2+   tau-)
     2.61480519E-02    2     1000016       -16   # BR(~chi_30 -> ~nu_tau1  nu_taub)
     2.61480519E-02    2    -1000016        16   # BR(~chi_30 -> ~nu_tau1* nu_tau )
#
#         PDG            Width
DECAY   1000035     3.31742762E+01   # neutralino4 decays
#          BR         NDA      ID1       ID2
     1.96800586E-02    2     1000022        23   # BR(~chi_40 -> ~chi_10   Z )
     1.40398710E-02    2     1000023        23   # BR(~chi_40 -> ~chi_20   Z )
     8.60970581E-05    2     1000025        23   # BR(~chi_40 -> ~chi_30   Z )
     3.28182516E-02    2     1000024       -24   # BR(~chi_40 -> ~chi_1+   W-)
     3.28182516E-02    2    -1000024        24   # BR(~chi_40 -> ~chi_1-   W+)
     9.34298792E-05    2     1000037       -24   # BR(~chi_40 -> ~chi_2+   W-)
     9.34298792E-05    2    -1000037        24   # BR(~chi_40 -> ~chi_2-   W+)
     1.47482310E-02    2     1000022        25   # BR(~chi_40 -> ~chi_10   h )
     2.15584766E-02    2     1000023        25   # BR(~chi_40 -> ~chi_20   h )
     9.27724292E-06    2     1000025        25   # BR(~chi_40 -> ~chi_30   h )
     3.30297175E-02    2     2000001        -1   # BR(~chi_40 -> ~d_R      db)
     3.30297175E-02    2    -2000001         1   # BR(~chi_40 -> ~d_R*     d )
     3.30297175E-02    2     2000003        -3   # BR(~chi_40 -> ~s _R      sb)
     3.30297175E-02    2    -2000003         3   # BR(~chi_40 -> ~s _R*     s )
     2.84088391E-03    2     1000005        -5   # BR(~chi_40 -> ~b_1      bb)
     2.84088391E-03    2    -1000005         5   # BR(~chi_40 -> ~b_1*     b )
     1.76366447E-02    2     1000011       -11   # BR(~chi_40 -> ~e_L-     e+)
     1.76366447E-02    2    -1000011        11   # BR(~chi_40 -> ~e_L+     e-)
     6.53879412E-02    2     2000011       -11   # BR(~chi_40 -> ~e_R-     e+)
     6.53879412E-02    2    -2000011        11   # BR(~chi_40 -> ~e_R+     e-)
     1.76366447E-02    2     1000013       -13   # BR(~chi_40 -> ~mu_L-    mu+)
     1.76366447E-02    2    -1000013        13   # BR(~chi_40 -> ~mu_L+    mu-)
     6.53879412E-02    2     2000013       -13   # BR(~chi_40 -> ~mu_R-    mu+)
     6.53879412E-02    2    -2000013        13   # BR(~chi_40 -> ~mu_R+    mu-)
     1.13383525E-01    2     1000015       -15   # BR(~chi_40 -> ~tau_1-   tau+)
     1.13383525E-01    2    -1000015        15   # BR(~chi_40 -> ~tau_1+   tau-)
     2.40054089E-02    2     2000015       -15   # BR(~chi_40 -> ~tau_2-   tau+)
     2.40054089E-02    2    -2000015        15   # BR(~chi_40 -> ~tau_2+   tau-)
     1.78181225E-02    2     1000012       -12   # BR(~chi_40 -> ~nu_eL    nu_eb)
     1.78181225E-02    2    -1000012        12   # BR(~chi_40 -> ~nu_eL*   nu_e )
     1.78181225E-02    2     1000014       -14   # BR(~chi_40 -> ~nu_muL   nu_mub)
     1.78181225E-02    2    -1000014        14   # BR(~chi_40 -> ~nu_muL*  nu_mu )
     2.40526434E-02    2     1000016       -16   # BR(~chi_40 -> ~nu_tau1  nu_taub)
     2.40526434E-02    2    -1000016        16   # BR(~chi_40 -> ~nu_tau1* nu_tau )
#
#         PDG            Width
DECAY        25     4.36103936E-03   # h decays
#          BR         NDA      ID1       ID2
     5.54675637E-01    2           5        -5   # BR(h -> b       bb     )
     6.11695500E-02    2         -15        15   # BR(h -> tau+    tau-   )
     2.16516736E-04    2         -13        13   # BR(h -> mu+     mu-    )
     2.35557781E-04    2           3        -3   # BR(h -> s       sb     )
     2.01930325E-02    2           4        -4   # BR(h -> c       cb     )
     7.74011590E-02    2          21        21   # BR(h -> g       g      )
     2.34299643E-03    2          22        22   # BR(h -> gam     gam    )
     1.76412649E-03    2          22        23   # BR(h -> Z       gam    )
     2.49749310E-01    2          24       -24   # BR(h -> W+      W-     )
     3.22521142E-02    2          23        23   # BR(h -> Z       Z      )
#
#         PDG            Width
DECAY        35     2.92503674E+01   # H decays
#          BR         NDA      ID1       ID2
     3.95155077E-01    2           5        -5   # BR(H -> b       bb     )
     6.72475892E-02    2         -15        15   # BR(H -> tau+    tau-   )
     2.39446601E-04    2         -13        13   # BR(H -> mu+     mu-    )
     1.72224206E-04    2           3        -3   # BR(H -> s       sb     )
     6.47528273E-08    2           4        -4   # BR(H -> c       cb     )
     6.28050620E-03    2           6        -6   # BR(H -> t       tb     )
     7.44022705E-06    2          21        21   # BR(H -> g       g      )
     1.02544377E-07    2          22        22   # BR(H -> gam     gam    )
     5.44851971E-09    2          23        22   # BR(H -> Z       gam    )
     6.88045712E-06    2          24       -24   # BR(H -> W+      W-     )
     3.42765648E-06    2          23        23   # BR(H -> Z       Z      )
     2.38575264E-05    2          25        25   # BR(H -> h       h      )
     7.28230174E-03    2     1000024  -1000024   # BR(H -> ~chi_1+ ~chi_1-)
     1.59623635E-06    2     1000037  -1000037   # BR(H -> ~chi_2+ ~chi_2-)
     1.62372750E-01    2     1000024  -1000037   # BR(H -> ~chi_1+ ~chi_2-)
     1.62372750E-01    2     1000037  -1000024   # BR(H -> ~chi_2+ ~chi_1-)
     1.11975407E-03    2     1000022   1000022   # BR(H -> ~chi_10 ~chi_10)
     3.07537582E-04    2     1000023   1000023   # BR(H -> ~chi_20 ~chi_20)
     8.22161900E-07    2     1000025   1000025   # BR(H -> ~chi_30 ~chi_30)
     2.16898044E-04    2     1000022   1000023   # BR(H -> ~chi_10 ~chi_20)
     6.17828430E-02    2     1000022   1000025   # BR(H -> ~chi_10 ~chi_30)
     1.01597905E-01    2     1000023   1000025   # BR(H -> ~chi_20 ~chi_30)
     1.40838261E-07    2     2000001  -2000001   # BR(H -> ~d_R    ~d_R*  )
     1.40838261E-07    2     2000003  -2000003   # BR(H -> ~s_R    ~s_R*  )
     2.17255592E-04    2     1000015  -1000015   # BR(H -> ~tau_1- ~tau_1+)
     1.45956400E-04    2     2000015  -2000015   # BR(H -> ~tau_2- ~tau_2+)
     1.67214204E-02    2     1000015  -2000015   # BR(H -> ~tau_1- ~tau_2+)
     1.67214204E-02    2     2000015  -1000015   # BR(H -> ~tau_2- ~tau_1+)
     1.88677548E-06    2     1000016  -1000016   # BR(H -> ~nu_tauL ~nu_tauL*)
#
#         PDG            Width
DECAY        36     2.92387410E+01   # A decays
#          BR         NDA      ID1       ID2
     3.95342837E-01    2           5        -5   # BR(A -> b       bb     )
     6.72754537E-02    2         -15        15   # BR(A -> tau+    tau-   )
     2.39545088E-04    2         -13        13   # BR(A -> mu+     mu-    )
     1.72320701E-04    2           3        -3   # BR(A -> s       sb     )
     6.46176479E-08    2           4        -4   # BR(A -> c       cb     )
     6.33219585E-03    2           6        -6   # BR(A -> t       tb     )
     3.98045478E-05    2          21        21   # BR(A -> g       g      )
     2.33448260E-07    2          22        22   # BR(A -> gam     gam    )
     2.90808707E-08    2          23        22   # BR(A -> Z       gam    )
     6.94293033E-06    2          23        25   # BR(A -> Z       h      )
     8.15536655E-03    2     1000024  -1000024   # BR(A -> ~chi_1+ ~chi_1-)
     1.34535044E-04    2     1000037  -1000037   # BR(A -> ~chi_2+ ~chi_2-)
     1.61778645E-01    2     1000024  -1000037   # BR(A -> ~chi_1+ ~chi_2-)
     1.61778645E-01    2     1000037  -1000024   # BR(A -> ~chi_2+ ~chi_1-)
     1.42575478E-03    2     1000022   1000022   # BR(A -> ~chi_10 ~chi_10)
     2.72070298E-04    2     1000023   1000023   # BR(A -> ~chi_20 ~chi_20)
     6.79375620E-05    2     1000025   1000025   # BR(A -> ~chi_30 ~chi_30)
     1.19451305E-04    2     1000022   1000023   # BR(A -> ~chi_10 ~chi_20)
     1.02319488E-01    2     1000022   1000025   # BR(A -> ~chi_10 ~chi_30)
     6.07152107E-02    2     1000023   1000025   # BR(A -> ~chi_20 ~chi_30)
     1.69117351E-02    2     1000015  -2000015   # BR(A -> ~tau_1- ~tau_2+)
     1.69117351E-02    2    -1000015   2000015   # BR(A -> ~tau_1+ ~tau_2-)
#
#         PDG            Width
DECAY        37     2.92090669E+01   # H+ decays
#          BR         NDA      ID1       ID2
     6.66239354E-04    2           4        -5   # BR(H+ -> c       bb     )
     6.74014902E-02    2         -15        16   # BR(H+ -> tau+    nu_tau )
     2.39993860E-04    2         -13        14   # BR(H+ -> mu+     nu_mu  )
     6.66237655E-06    2           2        -5   # BR(H+ -> u       bb     )
     8.62229880E-06    2           2        -3   # BR(H+ -> u       sb     )
     1.69774975E-04    2           4        -3   # BR(H+ -> c       sb     )
     4.01150082E-01    2           6        -5   # BR(H+ -> t       bb     )
     6.97728547E-06    2          24        25   # BR(H+ -> W+      h      )
     7.76635419E-13    2          24        36   # BR(H+ -> W+      A      )
     6.87761737E-04    2     1000024   1000022   # BR(H+ -> ~chi_1+ ~chi_10)
     2.05468597E-03    2     1000024   1000023   # BR(H+ -> ~chi_1+ ~chi_20)
     1.63844942E-01    2     1000024   1000025   # BR(H+ -> ~chi_1+ ~chi_30)
     1.67126858E-01    2     1000037   1000022   # BR(H+ -> ~chi_2+ ~chi_10)
     1.62663819E-01    2     1000037   1000023   # BR(H+ -> ~chi_2+ ~chi_20)
     4.70327038E-11    2     1000037   1000025   # BR(H+ -> ~chi_2+ ~chi_30)
     3.39139986E-02    2    -1000015   1000016   # BR(H+ -> ~tau_1+ ~nu_tauL)
     5.80920528E-05    2    -2000015   1000016   # BR(H+ -> ~tau_2+ ~nu_tauL)
