#
#                              ======================
#                              | THE SUSYHIT OUTPUT |
#                              ======================
#
#
#              ------------------------------------------------------
#              |     This is the output of the SUSY-HIT package     |
#              |  created by A.Djouadi, M.Muehlleitner and M.Spira. |
#              |  In case of problems with SUSY-HIT email to        |
#              |           margarete.muehlleitner@cern.ch           |
#              |           michael.spira@psi.ch                     |
#              |           abdelhak.djouadi@cern.ch                 |
#              ------------------------------------------------------
#
#              ------------------------------------------------------
#              |  SUSY Les Houches Accord - MSSM Spectrum + Decays  |
#              |              based on the decay programs           |
#              |                                                    |
#              |                     SDECAY 1.3b                    |
#              |                                                    |
#              |  Authors: M.Muhlleitner, A.Djouadi and Y.Mambrini  |
#              |  Ref.:    Comput.Phys.Commun.168(2005)46           |
#              |           [hep-ph/0311167]                         |
#              |                                                    |
#              |                     HDECAY 3.4                     |
#              |                                                    |
#              |  By: A.Djouadi,J.Kalinowski,M.Muhlleitner,M.Spira  |
#              |  Ref.:    Comput.Phys.Commun.108(1998)56           |
#              |           [hep-ph/9704448]                         |
#              |                                                    |
#              |                                                    |
#              |  If not stated otherwise all DRbar couplings and   |
#              |  soft SUSY breaking masses are given at the scale  |
#              |  Q=  0.31515050E+04
#              |                                                    |
#              ------------------------------------------------------
#
#
BLOCK DCINFO  # Decay Program information
     1   SDECAY/HDECAY # decay calculator
     2   1.3b  /3.4    # version number
#
BLOCK SPINFO  # Spectrum calculator information
     1     SOFTSUSY    # spectrum calculator               
     2     3.4.0       # version number                    
#
BLOCK MODSEL  # Model selection
     1     0   #  nonUniversal                                     
#
BLOCK SMINPUTS  # Standard Model inputs
         1     1.27908970E+02   # alpha_em^-1(M_Z)^MSbar
         2     1.16637870E-05   # G_F [GeV^-2]
         3     1.18400000E-01   # alpha_S(M_Z)^MSbar
         4     9.11876000E+01   # M_Z pole mass
         5     4.18000000E+00   # mb(mb)^MSbar
         6     1.73200000E+02   # mt pole mass
         7     1.77700000E+00   # mtau pole mass
#
BLOCK MINPAR  # Input parameters - minimal models
         3     2.87300000E+01   # tanb                
#
BLOCK EXTPAR  # Input parameters - non-minimal models
         0    -1.00000000E+00   # Set                 
         1     2.45170000E+02   # M_1(MX)             
         2    -2.39590000E+02   # M_2(MX)             
         3     2.99435000E+03   # M_3(MX)             
        11    -2.61516000E+03   # At(MX)              
        12    -3.52332000E+03   # Ab(MX)              
        13    -2.88830000E+03   # Atau(MX)            
        23     5.21260000E+02   # mu(MX)              
        26     1.05930000E+03   # mA(pole)            
        31     2.64592000E+03   # meL(MX)             
        32     2.64592000E+03   # mmuL(MX)            
        33     2.42805000E+03   # mtauL(MX)           
        34     3.21865000E+03   # meR(MX)             
        35     3.21865000E+03   # mmuR(MX)            
        36     1.03325000E+03   # mtauR(MX)           
        41     8.55450000E+02   # mqL1(MX)            
        42     8.55450000E+02   # mqL2(MX)            
        43     3.70655000E+03   # mqL3(MX)            
        44     3.24648000E+03   # muR(MX)             
        45     3.24648000E+03   # mcR(MX)             
        46     2.67637000E+03   # mtR(MX)             
        47     1.94711000E+03   # mdR(MX)             
        48     1.94711000E+03   # msR(MX)             
        49     3.23149000E+03   # mbR(MX)             
#
BLOCK MASS  # Mass Spectrum
# PDG code           mass       particle
        24     8.03704856E+01   # W+
        25     1.25062317E+02   # h
        35     1.05931401E+03   # H
        36     1.05930000E+03   # A
        37     1.06276232E+03   # H+
         5     4.81876030E+00   # b-quark pole mass calculated from mb(mb)_Msbar
   1000001     1.07071643E+03   # ~d_L
   2000001     2.08593059E+03   # ~d_R
   1000002     1.06773499E+03   # ~u_L
   2000002     3.34248878E+03   # ~u_R
   1000003     1.07071643E+03   # ~s_L
   2000003     2.08593059E+03   # ~s_R
   1000004     1.06773499E+03   # ~c_L
   2000004     3.34248878E+03   # ~c_R
   1000005     3.32020395E+03   # ~b_1
   2000005     3.76209394E+03   # ~b_2
   1000006     2.74076203E+03   # ~t_1
   2000006     3.76724452E+03   # ~t_2
   1000011     2.64925645E+03   # ~e_L
   2000011     3.22515223E+03   # ~e_R
   1000012     2.64775586E+03   # ~nu_eL
   1000013     2.64925645E+03   # ~mu_L
   2000013     3.22515223E+03   # ~mu_R
   1000014     2.64775586E+03   # ~nu_muL
   1000015     1.03389172E+03   # ~tau_1
   2000015     2.42545705E+03   # ~tau_2
   1000016     2.42380253E+03   # ~nu_tauL
   1000021     3.11159473E+03   # ~g
   1000022     2.40078980E+02   # ~chi_10
   1000023    -2.48460875E+02   # ~chi_20
   1000025     5.47576806E+02   # ~chi_30
   1000035    -5.50828251E+02   # ~chi_40
   1000024     2.48533719E+02   # ~chi_1+
   1000037     5.54094890E+02   # ~chi_2+
#
BLOCK NMIX  # Neutralino Mixing Matrix
  1  1     9.93648219E-01   # N_11
  1  2     8.31106934E-03   # N_12
  1  3     1.01411691E-01   # N_13
  1  4    -4.80605098E-02   # N_14
  2  1     6.09553648E-03   # N_21
  2  2     9.81613597E-01   # N_22
  2  3    -1.75560627E-01   # N_23
  2  4    -7.46730001E-02   # N_24
  3  1     1.05853235E-01   # N_31
  3  2    -7.15960932E-02   # N_32
  3  3    -6.96829054E-01   # N_33
  3  4     7.05760839E-01   # N_34
  4  1    -3.76982043E-02   # N_41
  4  2     1.76747480E-01   # N_42
  4  3     6.87985032E-01   # N_43
  4  4     7.02862553E-01   # N_44
#
BLOCK UMIX  # Chargino Mixing Matrix U
  1  1     9.69287101E-01   # U_11
  1  2    -2.45931933E-01   # U_12
  2  1     2.45931933E-01   # U_21
  2  2     9.69287101E-01   # U_22
#
BLOCK VMIX  # Chargino Mixing Matrix V
  1  1    -9.94540705E-01   # V_11
  1  2    -1.04349345E-01   # V_12
  2  1    -1.04349345E-01   # V_21
  2  2     9.94540705E-01   # V_22
#
BLOCK STOPMIX  # Stop Mixing Matrix
  1  1     5.78962609E-02   # cos(theta_t)
  1  2     9.98322605E-01   # sin(theta_t)
  2  1    -9.98322605E-01   # -sin(theta_t)
  2  2     5.78962609E-02   # cos(theta_t)
#
BLOCK SBOTMIX  # Sbottom Mixing Matrix
  1  1     1.29903935E-02   # cos(theta_b)
  1  2     9.99915621E-01   # sin(theta_b)
  2  1    -9.99915621E-01   # -sin(theta_b)
  2  2     1.29903935E-02   # cos(theta_b)
#
BLOCK STAUMIX  # Stau Mixing Matrix
  1  1     6.51677482E-03   # cos(theta_tau)
  1  2     9.99978766E-01   # sin(theta_tau)
  2  1    -9.99978766E-01   # -sin(theta_tau)
  2  2     6.51677482E-03   # cos(theta_tau)
#
BLOCK ALPHA  # Higgs mixing
          -3.67895711E-02   # Mixing angle in the neutral Higgs boson sector
#
BLOCK HMIX Q=  3.15150500E+03  # DRbar Higgs Parameters
         1     5.30440527E+02   # mu(Q)MSSM           
         2     2.76766505E+01   # tan                 
         3     2.41312979E+02   # higgs               
         4     1.05255509E+06   # mA^2(Q)MSSM         
#
BLOCK GAUGE Q=  3.15150500E+03  # The gauge couplings
     1     3.65240601E-01   # gprime(Q) DRbar
     2     6.42767226E-01   # g(Q) DRbar
     3     1.01112060E+00   # g3(Q) DRbar
#
BLOCK AU Q=  3.15150500E+03  # The trilinear couplings
  1  1     0.00000000E+00   # A_u(Q) DRbar
  2  2     0.00000000E+00   # A_c(Q) DRbar
  3  3    -2.61515998E+03   # A_t(Q) DRbar
#
BLOCK AD Q=  3.15150500E+03  # The trilinear couplings
  1  1     0.00000000E+00   # A_d(Q) DRbar
  2  2     0.00000000E+00   # A_s(Q) DRbar
  3  3    -3.52331999E+03   # A_b(Q) DRbar
#
BLOCK AE Q=  3.15150500E+03  # The trilinear couplings
  1  1     0.00000000E+00   # A_e(Q) DRbar
  2  2     0.00000000E+00   # A_mu(Q) DRbar
  3  3    -2.88830000E+03   # A_tau(Q) DRbar
#
BLOCK Yu Q=  3.15150500E+03  # The Yukawa couplings
  1  1     0.00000000E+00   # y_u(Q) DRbar
  2  2     0.00000000E+00   # y_c(Q) DRbar
  3  3     8.19377387E-01   # y_t(Q) DRbar
#
BLOCK Yd Q=  3.15150500E+03  # The Yukawa couplings
  1  1     0.00000000E+00   # y_d(Q) DRbar
  2  2     0.00000000E+00   # y_s(Q) DRbar
  3  3     3.60304250E-01   # y_b(Q) DRbar
#
BLOCK Ye Q=  3.15150500E+03  # The Yukawa couplings
  1  1     0.00000000E+00   # y_e(Q) DRbar
  2  2     0.00000000E+00   # y_mu(Q) DRbar
  3  3     2.82159373E-01   # y_tau(Q) DRbar
#
BLOCK MSOFT Q=  3.15150500E+03  # The soft SUSY breaking masses at the scale Q
         1     2.45170000E+02   # M_1(Q)              
         2    -2.39590000E+02   # M_2(Q)              
         3     2.99435000E+03   # M_3(Q)              
        21     9.10944386E+05   # mH1^2(Q)            
        22    -5.97258883E+04   # mH2^2(Q)            
        31     2.64592000E+03   # meL(Q)              
        32     2.64592000E+03   # mmuL(Q)             
        33     2.42805000E+03   # mtauL(Q)            
        34     3.21865000E+03   # meR(Q)              
        35     3.21865000E+03   # mmuR(Q)             
        36     1.03325000E+03   # mtauR(Q)            
        41     8.55449965E+02   # mqL1(Q)             
        42     8.55449965E+02   # mqL2(Q)             
        43     3.70654998E+03   # mqL3(Q)             
        44     3.24647999E+03   # muR(Q)              
        45     3.24647999E+03   # mcR(Q)              
        46     2.67636997E+03   # mtR(Q)              
        47     1.94710998E+03   # mdR(Q)              
        48     1.94710998E+03   # msR(Q)              
        49     3.23148999E+03   # mbR(Q)              
#
Block HiggsBoundsInputHiggsCouplingsFermions
# ScalarNormEffCoupSq PseudoSNormEffCoupSq NP   IP1 IP2 IP2
    1.03764109E+00    0.00000000E+00        3  25   5   5  # h0-b-b eff. coupling^2, normalised to SM
    7.65959342E+02    0.00000000E+00        3  35   5   5  # H0-b-b eff. coupling^2, normalised to SM
    0.00000000E+00    7.65996983E+02        3  36   5   5  # A0-b-b eff. coupling^2, normalised to SM
#
    9.99950860E-01    0.00000000E+00        3  25   6   6  # h0-t-t eff. coupling^2, normalised to SM
    1.35462817E-03    0.00000000E+00        3  35   6   6  # H0-t-t eff. coupling^2, normalised to SM
    0.00000000E+00    1.30548817E-03        3  36   6   6  # A0-t-t eff. coupling^2, normalised to SM
#
    1.03764109E+00    0.00000000E+00        3  25  15  15  # h0-tau-tau eff. coupling^2, normalised to SM
    7.65959342E+02    0.00000000E+00        3  35  15  15  # H0-tau-tau eff. coupling^2, normalised to SM
    0.00000000E+00    7.65996983E+02        3  36  15  15  # A0-tau-tau eff. coupling^2, normalised to SM
#
Block HiggsBoundsInputHiggsCouplingsBosons
    9.99999546E-01        3  25  24  24  # h0-W-W eff. coupling^2, normalised to SM
    4.53928297E-07        3  35  24  24  # H0-W-W eff. coupling^2, normalised to SM
    0.00000000E+00        3  36  24  24  # A0-W-W eff. coupling^2, normalised to SM
#
    9.99999546E-01        3  25  23  23  # h0-Z-Z eff. coupling^2, normalised to SM
    4.53928297E-07        3  35  23  23  # H0-Z-Z eff. coupling^2, normalised to SM
    0.00000000E+00        3  36  23  23  # A0-Z-Z eff. coupling^2, normalised to SM
#
    8.88667336E-01        3  25  21  21  # h0-g-g eff. coupling^2, normalised to SM
    8.05037683E-05        3  35  21  21  # H0-g-g eff. coupling^2, normalised to SM
    3.12884268E-04        3  36  21  21  # A0-g-g eff. coupling^2, normalised to SM
#
    0.00000000E+00        3  25  25  23  # h0-h0-Z eff. coupling^2, normalised to SM
    0.00000000E+00        3  35  25  23  # H0-h0-Z eff. coupling^2, normalised to SM
    4.53928297E-07        3  36  25  23  # A0-h0-Z eff. coupling^2, normalised to SM
    0.00000000E+00        3  35  35  23  # H0-H0-Z eff. coupling^2, normalised to SM
    9.99999546E-01        3  36  35  23  # A0-H0-Z eff. coupling^2, normalised to SM
    0.00000000E+00        3  36  36  23  # A0-A0-Z eff. coupling^2, normalised to SM
#
    0.00000000E+00        4  25  21  21  23  # h0-g-g-Z eff. coupling^2, normalised to SM
    0.00000000E+00        4  35  21  21  23  # H0-g-g-Z eff. coupling^2, normalised to SM
    0.00000000E+00        4  36  21  21  23  # A0-g-g-Z eff. coupling^2, normalised to SM
#
#
#
#                             =================
#                             |The decay table|
#                             =================
#
# - The QCD corrections to the decays gluino -> squark  + quark
#                                     squark -> gaugino + quark_prime
#                                     squark -> squark_prime + Higgs
#                                     squark -> gluino  + quark
#   are included.
#
# - The multi-body decays for the inos, stops and sbottoms are included.
#
# - The loop induced decays for the gluino, neutralinos and stops
#   are included.
#
# - The SUSY decays of the top quark are included.
#
#
#         PDG            Width
DECAY         6     1.45592961E+00   # top decays
#          BR         NDA      ID1       ID2
     1.00000000E+00    2           5        24   # BR(t ->  b    W+)
#
#         PDG            Width
DECAY   1000021     2.34677672E+02   # gluino decays
#          BR         NDA      ID1       ID2
     1.03326477E-01    2     1000001        -1   # BR(~g -> ~d_L  db)
     1.03326477E-01    2    -1000001         1   # BR(~g -> ~d_L* d )
     4.03040136E-02    2     2000001        -1   # BR(~g -> ~d_R  db)
     4.03040136E-02    2    -2000001         1   # BR(~g -> ~d_R* d )
     1.03480895E-01    2     1000002        -2   # BR(~g -> ~u_L  ub)
     1.03480895E-01    2    -1000002         2   # BR(~g -> ~u_L* u )
     1.03326477E-01    2     1000003        -3   # BR(~g -> ~s_L  sb)
     1.03326477E-01    2    -1000003         3   # BR(~g -> ~s_L* s )
     4.03040136E-02    2     2000003        -3   # BR(~g -> ~s_R  sb)
     4.03040136E-02    2    -2000003         3   # BR(~g -> ~s_R* s )
     1.03480886E-01    2     1000004        -4   # BR(~g -> ~c_L  cb)
     1.03480886E-01    2    -1000004         4   # BR(~g -> ~c_L* c )
     5.77723724E-03    2     1000006        -6   # BR(~g -> ~t_1  tb)
     5.77723724E-03    2    -1000006         6   # BR(~g -> ~t_1* t )
#
#         PDG            Width
DECAY   1000006     7.34959495E+01   # stop1 decays
#          BR         NDA      ID1       ID2
     8.63398686E-02    2     1000022         6   # BR(~t_1 -> ~chi_10 t )
     9.24319643E-04    2     1000023         6   # BR(~t_1 -> ~chi_20 t )
     2.24953720E-01    2     1000025         6   # BR(~t_1 -> ~chi_30 t )
     2.29779748E-01    2     1000035         6   # BR(~t_1 -> ~chi_40 t )
     1.72481823E-03    2     1000024         5   # BR(~t_1 -> ~chi_1+ b )
     4.56277526E-01    2     1000037         5   # BR(~t_1 -> ~chi_2+ b )
#
#         PDG            Width
DECAY   2000006     1.34909913E+02   # stop2 decays
#          BR         NDA      ID1       ID2
     4.80883107E-03    2     1000022         6   # BR(~t_2 -> ~chi_10 t )
     1.12635079E-01    2     1000023         6   # BR(~t_2 -> ~chi_20 t )
     1.80117489E-01    2     1000025         6   # BR(~t_2 -> ~chi_30 t )
     1.76009125E-01    2     1000035         6   # BR(~t_2 -> ~chi_40 t )
     2.32105504E-01    2     1000024         5   # BR(~t_2 -> ~chi_1+ b )
     6.48446491E-02    2     1000037         5   # BR(~t_2 -> ~chi_2+ b )
     1.42419756E-01    2     1000021         6   # BR(~t_2 -> ~g      t )
     4.20176072E-02    2     1000006        25   # BR(~t_2 -> ~t_1    h )
     4.45928957E-02    2     1000006        23   # BR(~t_2 -> ~t_1    Z )
     4.49064343E-04    2     1000005        24   # BR(~t_2 -> ~b_1    W+)
#
#         PDG            Width
DECAY   1000005     2.08237785E+01   # sbottom1 decays
#          BR         NDA      ID1       ID2
     9.67973199E-02    2     1000022         5   # BR(~b_1 -> ~chi_10 b )
     1.49501461E-02    2     1000023         5   # BR(~b_1 -> ~chi_20 b )
     1.89058794E-01    2     1000025         5   # BR(~b_1 -> ~chi_30 b )
     1.82714365E-01    2     1000035         5   # BR(~b_1 -> ~chi_40 b )
     2.91647717E-02    2    -1000024         6   # BR(~b_1 -> ~chi_1- t )
     3.59146866E-01    2    -1000037         6   # BR(~b_1 -> ~chi_2- t )
     1.28147877E-01    2     1000021         5   # BR(~b_1 -> ~g      b )
     1.98605835E-05    2     1000006       -24   # BR(~b_1 -> ~t_1    W-)
#
#         PDG            Width
DECAY   2000005     1.35767925E+02   # sbottom2 decays
#          BR         NDA      ID1       ID2
     4.25579689E-03    2     1000022         5   # BR(~b_2 -> ~chi_10 b )
     1.10291957E-01    2     1000023         5   # BR(~b_2 -> ~chi_20 b )
     3.44200936E-02    2     1000025         5   # BR(~b_2 -> ~chi_30 b )
     3.64208476E-02    2     1000035         5   # BR(~b_2 -> ~chi_40 b )
     2.14018766E-01    2    -1000024         6   # BR(~b_2 -> ~chi_1- t )
     3.64581964E-01    2    -1000037         6   # BR(~b_2 -> ~chi_2- t )
     1.49969180E-01    2     1000021         5   # BR(~b_2 -> ~g      b )
     2.32337045E-04    2     1000005        25   # BR(~b_2 -> ~b_1    h )
     2.19039444E-04    2     1000005        23   # BR(~b_2 -> ~b_1    Z )
     8.55900194E-02    2     1000006       -24   # BR(~b_2 -> ~t_1    W-)
#
#         PDG            Width
DECAY   1000002     1.22271929E+01   # sup_L decays
#          BR         NDA      ID1       ID2
     1.29066094E-02    2     1000022         2   # BR(~u_L -> ~chi_10 u)
     3.20359282E-01    2     1000023         2   # BR(~u_L -> ~chi_20 u)
     5.36410525E-04    2     1000025         2   # BR(~u_L -> ~chi_30 u)
     5.75852022E-03    2     1000035         2   # BR(~u_L -> ~chi_40 u)
     6.56117028E-01    2     1000024         1   # BR(~u_L -> ~chi_1+ d)
     4.32214988E-03    2     1000037         1   # BR(~u_L -> ~chi_2+ d)
#
#         PDG            Width
DECAY   2000002     1.19855746E+01   # sup_R decays
#          BR         NDA      ID1       ID2
     6.12499317E-01    2     1000022         2   # BR(~u_R -> ~chi_10 u)
     2.30339043E-05    2     1000023         2   # BR(~u_R -> ~chi_20 u)
     6.66352433E-03    2     1000025         2   # BR(~u_R -> ~chi_30 u)
     8.44616276E-04    2     1000035         2   # BR(~u_R -> ~chi_40 u)
     3.79969508E-01    2     1000021         2   # BR(~u_R -> ~g      u)
#
#         PDG            Width
DECAY   1000001     1.20892979E+01   # sdown_L decays
#          BR         NDA      ID1       ID2
     1.09745177E-02    2     1000022         1   # BR(~d_L -> ~chi_10 d)
     3.23555518E-01    2     1000023         1   # BR(~d_L -> ~chi_20 d)
     1.72631629E-03    2     1000025         1   # BR(~d_L -> ~chi_30 d)
     6.89209695E-03    2     1000035         1   # BR(~d_L -> ~chi_40 d)
     6.32405973E-01    2    -1000024         2   # BR(~d_L -> ~chi_1- u)
     2.44455779E-02    2    -1000037         2   # BR(~d_L -> ~chi_2- u)
#
#         PDG            Width
DECAY   2000001     1.19348183E+00   # sdown_R decays
#          BR         NDA      ID1       ID2
     9.88688911E-01    2     1000022         1   # BR(~d_R -> ~chi_10 d)
     3.71374913E-05    2     1000023         1   # BR(~d_R -> ~chi_20 d)
     1.00069536E-02    2     1000025         1   # BR(~d_R -> ~chi_30 d)
     1.26699816E-03    2     1000035         1   # BR(~d_R -> ~chi_40 d)
#
#         PDG            Width
DECAY   1000004     1.18350216E+01   # scharm_L decays
#          BR         NDA      ID1       ID2
     1.29075689E-02    2     1000022         4   # BR(~c_L -> ~chi_10 c)
     3.20366872E-01    2     1000023         4   # BR(~c_L -> ~chi_20 c)
     5.35087049E-04    2     1000025         4   # BR(~c_L -> ~chi_30 c)
     5.74402076E-03    2     1000035         4   # BR(~c_L -> ~chi_40 c)
     6.56135374E-01    2     1000024         3   # BR(~c_L -> ~chi_1+ s)
     4.31107699E-03    2     1000037         3   # BR(~c_L -> ~chi_2+ s)
#
#         PDG            Width
DECAY   2000004     1.10250338E+01   # scharm_R decays
#          BR         NDA      ID1       ID2
     6.98873039E-01    2     1000022         4   # BR(~c_R -> ~chi_10 c)
     2.62806904E-05    2     1000023         4   # BR(~c_R -> ~chi_20 c)
     7.58934324E-03    2     1000025         4   # BR(~c_R -> ~chi_30 c)
     9.61948646E-04    2     1000035         4   # BR(~c_R -> ~chi_40 c)
     2.92549388E-01    2     1000021         4   # BR(~c_R -> ~g      c)
#
#         PDG            Width
DECAY   1000003     1.17024520E+01   # sstrange_L decays
#          BR         NDA      ID1       ID2
     1.09760189E-02    2     1000022         3   # BR(~s_L -> ~chi_10 s)
     3.23583384E-01    2     1000023         3   # BR(~s_L -> ~chi_20 s)
     1.72219455E-03    2     1000025         3   # BR(~s_L -> ~chi_30 s)
     6.87529656E-03    2     1000035         3   # BR(~s_L -> ~chi_40 s)
     6.32458499E-01    2    -1000024         4   # BR(~s_L -> ~chi_1- c)
     2.43846075E-02    2    -1000037         4   # BR(~s_L -> ~chi_2- c)
#
#         PDG            Width
DECAY   2000003     1.19616229E+00   # sstrange_R decays
#          BR         NDA      ID1       ID2
     9.88707764E-01    2     1000022         3   # BR(~s_R -> ~chi_10 s)
     3.71362192E-05    2     1000023         3   # BR(~s_R -> ~chi_20 s)
     9.99023874E-03    2     1000025         3   # BR(~s_R -> ~chi_30 s)
     1.26486123E-03    2     1000035         3   # BR(~s_R -> ~chi_40 s)
#
#         PDG            Width
DECAY   1000011     3.54411699E+01   # selectron_L decays
#          BR         NDA      ID1       ID2
     9.91903009E-02    2     1000022        11   # BR(~e_L -> ~chi_10 e-)
     2.92880559E-01    2     1000023        11   # BR(~e_L -> ~chi_20 e-)
     3.68875640E-05    2     1000025        11   # BR(~e_L -> ~chi_30 e-)
     6.78465860E-03    2     1000035        11   # BR(~e_L -> ~chi_40 e-)
     5.67126953E-01    2    -1000024        12   # BR(~e_L -> ~chi_1- nu_e)
     3.39806414E-02    2    -1000037        12   # BR(~e_L -> ~chi_2- nu_e)
#
#         PDG            Width
DECAY   2000011     1.69195075E+01   # selectron_R decays
#          BR         NDA      ID1       ID2
     9.87915049E-01    2     1000022        11   # BR(~e_R -> ~chi_10 e-)
     3.71478972E-05    2     1000023        11   # BR(~e_R -> ~chi_20 e-)
     1.06925869E-02    2     1000025        11   # BR(~e_R -> ~chi_30 e-)
     1.35521659E-03    2     1000035        11   # BR(~e_R -> ~chi_40 e-)
#
#         PDG            Width
DECAY   1000013     3.54411699E+01   # smuon_L decays
#          BR         NDA      ID1       ID2
     9.91903007E-02    2     1000022        13   # BR(~mu_L -> ~chi_10 mu-)
     2.92880558E-01    2     1000023        13   # BR(~mu_L -> ~chi_20 mu-)
     3.68875639E-05    2     1000025        13   # BR(~mu_L -> ~chi_30 mu-)
     6.78465859E-03    2     1000035        13   # BR(~mu_L -> ~chi_40 mu-)
     5.67126954E-01    2    -1000024        14   # BR(~mu_L -> ~chi_1- nu_mu)
     3.39806415E-02    2    -1000037        14   # BR(~mu_L -> ~chi_2- nu_mu)
#
#         PDG            Width
DECAY   2000013     1.69195075E+01   # smuon_R decays
#          BR         NDA      ID1       ID2
     9.87915049E-01    2     1000022        13   # BR(~mu_R -> ~chi_10 mu-)
     3.71478972E-05    2     1000023        13   # BR(~mu_R -> ~chi_20 mu-)
     1.06925869E-02    2     1000025        13   # BR(~mu_R -> ~chi_30 mu-)
     1.35521659E-03    2     1000035        13   # BR(~mu_R -> ~chi_40 mu-)
#
#         PDG            Width
DECAY   1000015     6.63181816E+00   # stau_1 decays
#          BR         NDA      ID1       ID2
     7.33717186E-01    2     1000022        15   # BR(~tau_1 -> ~chi_10  tau-)
     7.59720948E-03    2     1000023        15   # BR(~tau_1 -> ~chi_20  tau-)
     6.67061156E-02    2     1000025        15   # BR(~tau_1 -> ~chi_30  tau-)
     6.01537977E-02    2     1000035        15   # BR(~tau_1 -> ~chi_40  tau-)
     1.48546767E-02    2    -1000024        16   # BR(~tau_1 -> ~chi_1-  nu_tau)
     1.16971015E-01    2    -1000037        16   # BR(~tau_1 -> ~chi_2-  nu_tau)
#
#         PDG            Width
DECAY   2000015     3.87108585E+01   # stau_2 decays
#          BR         NDA      ID1       ID2
     8.37730457E-02    2     1000022        15   # BR(~tau_2 -> ~chi_10  tau-)
     2.47292566E-01    2     1000023        15   # BR(~tau_2 -> ~chi_20  tau-)
     4.36041238E-02    2     1000025        15   # BR(~tau_2 -> ~chi_30  tau-)
     4.80839340E-02    2     1000035        15   # BR(~tau_2 -> ~chi_40  tau-)
     4.73026892E-01    2    -1000024        16   # BR(~tau_2 -> ~chi_1-  nu_tau)
     2.86148623E-02    2    -1000037        16   # BR(~tau_2 -> ~chi_2-  nu_tau)
     2.78078217E-03    2     1000015        25   # BR(~tau_2 -> ~tau_1   h)
     3.50119160E-02    2     1000015        35   # BR(~tau_2 -> ~tau_1   H)
     3.50289635E-02    2     1000015        36   # BR(~tau_2 -> ~tau_1   A)
     2.78291496E-03    2     1000015        23   # BR(~tau_2 -> ~tau_1   Z)
#
#         PDG            Width
DECAY   1000012     3.54700879E+01   # snu_eL decays
#          BR         NDA      ID1       ID2
     9.33873805E-02    2     1000022        12   # BR(~nu_eL -> ~chi_10 nu_e)
     2.88371129E-01    2     1000023        12   # BR(~nu_eL -> ~chi_20 nu_e)
     4.87894788E-03    2     1000025        12   # BR(~nu_eL -> ~chi_30 nu_e)
     1.10271797E-02    2     1000035        12   # BR(~nu_eL -> ~chi_40 nu_e)
     5.96226845E-01    2     1000024        11   # BR(~nu_eL -> ~chi_1+ e-)
     6.10851792E-03    2     1000037        11   # BR(~nu_eL -> ~chi_2+ e-)
#
#         PDG            Width
DECAY   1000014     3.54700878E+01   # snu_muL decays
#          BR         NDA      ID1       ID2
     9.33873807E-02    2     1000022        14   # BR(~nu_muL -> ~chi_10 nu_mu)
     2.88371130E-01    2     1000023        14   # BR(~nu_muL -> ~chi_20 nu_mu)
     4.87894789E-03    2     1000025        14   # BR(~nu_muL -> ~chi_30 nu_mu)
     1.10271798E-02    2     1000035        14   # BR(~nu_muL -> ~chi_40 nu_mu)
     5.96226844E-01    2     1000024        13   # BR(~nu_muL -> ~chi_1+ mu-)
     6.10851791E-03    2     1000037        13   # BR(~nu_muL -> ~chi_2+ mu-)
#
#         PDG            Width
DECAY   1000016     3.87207819E+01   # snu_tauL decays
#          BR         NDA      ID1       ID2
     7.80607039E-02    2     1000022        16   # BR(~nu_tauL -> ~chi_10 nu_tau)
     2.40988381E-01    2     1000023        16   # BR(~nu_tauL -> ~chi_20 nu_tau)
     4.02094377E-03    2     1000025        16   # BR(~nu_tauL -> ~chi_30 nu_tau)
     9.08598561E-03    2     1000035        16   # BR(~nu_tauL -> ~chi_40 nu_tau)
     5.04145796E-01    2     1000024        15   # BR(~nu_tauL -> ~chi_1+ tau-)
     8.86846253E-02    2     1000037        15   # BR(~nu_tauL -> ~chi_2+ tau-)
     6.96056387E-02    2    -1000015       -37   # BR(~nu_tauL -> ~tau_1+ H-)
     5.40792536E-03    2    -1000015       -24   # BR(~nu_tauL -> ~tau_1+ W-)
#
#         PDG            Width
DECAY   1000024     2.48731520E-11   # chargino1+ decays
#           BR         NDA      ID1       ID2       ID3
     3.57196506E-01    3     1000022         2        -1   # BR(~chi_1+ -> ~chi_10 u    db)
     1.31824406E-07    3     1000023         2        -1   # BR(~chi_1+ -> ~chi_20 u    db)
     3.57196506E-01    3     1000022         4        -3   # BR(~chi_1+ -> ~chi_10 c    sb)
     1.02906504E-01    3     1000022       -11        12   # BR(~chi_1+ -> ~chi_10 e+   nu_e)
     4.37247976E-08    3     1000023       -11        12   # BR(~chi_1+ -> ~chi_20 e+   nu_e)
     1.02906504E-01    3     1000022       -13        14   # BR(~chi_1+ -> ~chi_10 mu+  nu_mu)
     4.37247976E-08    3     1000023       -13        14   # BR(~chi_1+ -> ~chi_20 mu+  nu_mu)
     7.97937619E-02    3     1000022       -15        16   # BR(~chi_1+ -> ~chi_10 tau+ nu_tau)
#
#         PDG            Width
DECAY   1000037     2.89402210E+00   # chargino2+ decays
#          BR         NDA      ID1       ID2
     3.02955735E-01    2     1000024        23   # BR(~chi_2+ -> ~chi_1+  Z )
     1.16424747E-01    2     1000022        24   # BR(~chi_2+ -> ~chi_10  W+)
     3.06403992E-01    2     1000023        24   # BR(~chi_2+ -> ~chi_20  W+)
     2.74215526E-01    2     1000024        25   # BR(~chi_2+ -> ~chi_1+  h )
#
#         PDG            Width
DECAY   1000022     0.00000000E+00   # neutralino1 decays
#
#         PDG            Width
DECAY   1000023     1.81932505E-11   # neutralino2 decays
#          BR         NDA      ID1       ID2
     7.87960437E-02    2     1000022        22   # BR(~chi_20 -> ~chi_10 gam)
#           BR         NDA      ID1       ID2       ID3
     1.37279670E-01    3     1000022        -2         2   # BR(~chi_20 -> ~chi_10 ub      u)
     1.75142403E-01    3     1000022        -1         1   # BR(~chi_20 -> ~chi_10 db      d)
     1.37279670E-01    3     1000022        -4         4   # BR(~chi_20 -> ~chi_10 cb      c)
     1.75142403E-01    3     1000022        -3         3   # BR(~chi_20 -> ~chi_10 sb      s)
     3.43533506E-02    3     1000022       -11        11   # BR(~chi_20 -> ~chi_10 e+      e-)
     3.43533506E-02    3     1000022       -13        13   # BR(~chi_20 -> ~chi_10 mu+     mu-)
     2.17205594E-02    3     1000022       -15        15   # BR(~chi_20 -> ~chi_10 tau+    tau-)
     6.88542582E-02    3     1000022       -12        12   # BR(~chi_20 -> ~chi_10 nu_eb   nu_e)
     6.88542582E-02    3     1000022       -14        14   # BR(~chi_20 -> ~chi_10 nu_mub  nu_mu)
     6.82240339E-02    3     1000022       -16        16   # BR(~chi_20 -> ~chi_10 nu_taub nu_tau)
#
#         PDG            Width
DECAY   1000025     2.87895057E+00   # neutralino3 decays
#          BR         NDA      ID1       ID2
     1.46026778E-02    2     1000022        23   # BR(~chi_30 -> ~chi_10   Z )
     2.51928239E-01    2     1000023        23   # BR(~chi_30 -> ~chi_20   Z )
     3.02870244E-01    2     1000024       -24   # BR(~chi_30 -> ~chi_1+   W-)
     3.02870244E-01    2    -1000024        24   # BR(~chi_30 -> ~chi_1-   W+)
     9.17994081E-02    2     1000022        25   # BR(~chi_30 -> ~chi_10   h )
     3.59291869E-02    2     1000023        25   # BR(~chi_30 -> ~chi_20   h )
#
#         PDG            Width
DECAY   1000035     2.96367267E+00   # neutralino4 decays
#          BR         NDA      ID1       ID2
     9.36019464E-02    2     1000022        23   # BR(~chi_40 -> ~chi_10   Z )
     4.80203458E-02    2     1000023        23   # BR(~chi_40 -> ~chi_20   Z )
     3.05350529E-01    2     1000024       -24   # BR(~chi_40 -> ~chi_1+   W-)
     3.05350529E-01    2    -1000024        24   # BR(~chi_40 -> ~chi_1-   W+)
     1.11660578E-02    2     1000022        25   # BR(~chi_40 -> ~chi_10   h )
     2.36510592E-01    2     1000023        25   # BR(~chi_40 -> ~chi_20   h )
#
#         PDG            Width
DECAY        25     4.23595873E-03   # h decays
#          BR         NDA      ID1       ID2
     6.11223300E-01    2           5        -5   # BR(h -> b       bb     )
     6.34257446E-02    2         -15        15   # BR(h -> tau+    tau-   )
     2.24496597E-04    2         -13        13   # BR(h -> mu+     mu-    )
     2.44158860E-04    2           3        -3   # BR(h -> s       sb     )
     2.04818104E-02    2           4        -4   # BR(h -> c       cb     )
     7.54303436E-02    2          21        21   # BR(h -> g       g      )
     2.22295590E-03    2          22        22   # BR(h -> gam     gam    )
     1.48178904E-03    2          22        23   # BR(h -> Z       gam    )
     2.00306550E-01    2          24       -24   # BR(h -> W+      W-     )
     2.49588510E-02    2          23        23   # BR(h -> Z       Z      )
#
#         PDG            Width
DECAY        35     1.85657013E+01   # H decays
#          BR         NDA      ID1       ID2
     5.67773065E-01    2           5        -5   # BR(H -> b       bb     )
     9.14917813E-02    2         -15        15   # BR(H -> tau+    tau-   )
     3.22920553E-04    2         -13        13   # BR(H -> mu+     mu-    )
     1.96757543E-04    2           3        -3   # BR(H -> s       sb     )
     3.67705555E-08    2           4        -4   # BR(H -> c       cb     )
     3.28200777E-03    2           6        -6   # BR(H -> t       tb     )
     4.82951274E-05    2          21        21   # BR(H -> g       g      )
     1.47976730E-07    2          22        22   # BR(H -> gam     gam    )
     2.00453356E-08    2          23        22   # BR(H -> Z       gam    )
     9.05057708E-06    2          24       -24   # BR(H -> W+      W-     )
     4.47477012E-06    2          23        23   # BR(H -> Z       Z      )
     4.12364298E-05    2          25        25   # BR(H -> h       h      )
     2.05139403E-02    2     1000024  -1000024   # BR(H -> ~chi_1+ ~chi_1-)
     9.32983300E-02    2     1000024  -1000037   # BR(H -> ~chi_1+ ~chi_2-)
     9.32983300E-02    2     1000037  -1000024   # BR(H -> ~chi_2+ ~chi_1-)
     9.33824975E-04    2     1000022   1000022   # BR(H -> ~chi_10 ~chi_10)
     1.01272924E-02    2     1000023   1000023   # BR(H -> ~chi_20 ~chi_20)
     7.81617417E-03    2     1000022   1000023   # BR(H -> ~chi_10 ~chi_20)
     7.93941914E-03    2     1000022   1000025   # BR(H -> ~chi_10 ~chi_30)
     1.76590793E-02    2     1000022   1000035   # BR(H -> ~chi_10 ~chi_40)
     5.64566369E-02    2     1000023   1000025   # BR(H -> ~chi_20 ~chi_30)
     2.87871795E-02    2     1000023   1000035   # BR(H -> ~chi_20 ~chi_40)
#
#         PDG            Width
DECAY        36     1.85401205E+01   # A decays
#          BR         NDA      ID1       ID2
     5.68611190E-01    2           5        -5   # BR(A -> b       bb     )
     9.16223168E-02    2         -15        15   # BR(A -> tau+    tau-   )
     3.23377664E-04    2         -13        13   # BR(A -> mu+     mu-    )
     1.97055757E-04    2           3        -3   # BR(A -> s       sb     )
     3.58096584E-08    2           4        -4   # BR(A -> c       cb     )
     3.44702707E-03    2           6        -6   # BR(A -> t       tb     )
     9.53240654E-05    2          21        21   # BR(A -> g       g      )
     1.47908953E-07    2          22        22   # BR(A -> gam     gam    )
     4.25698977E-08    2          23        22   # BR(A -> Z       gam    )
     8.94579954E-06    2          23        25   # BR(A -> Z       h      )
     2.48011561E-02    2     1000024  -1000024   # BR(A -> ~chi_1+ ~chi_1-)
     9.05254301E-02    2     1000024  -1000037   # BR(A -> ~chi_1+ ~chi_2-)
     9.05254301E-02    2     1000037  -1000024   # BR(A -> ~chi_2+ ~chi_1-)
     1.26122371E-03    2     1000022   1000022   # BR(A -> ~chi_10 ~chi_10)
     1.22206978E-02    2     1000023   1000023   # BR(A -> ~chi_20 ~chi_20)
     6.19987418E-03    2     1000022   1000023   # BR(A -> ~chi_10 ~chi_20)
     1.89326791E-02    2     1000022   1000025   # BR(A -> ~chi_10 ~chi_30)
     7.28313510E-03    2     1000022   1000035   # BR(A -> ~chi_10 ~chi_40)
     3.12260705E-02    2     1000023   1000025   # BR(A -> ~chi_20 ~chi_30)
     5.27188399E-02    2     1000023   1000035   # BR(A -> ~chi_20 ~chi_40)
#
#         PDG            Width
DECAY        37     1.77670805E+01   # H+ decays
#          BR         NDA      ID1       ID2
     9.40412253E-04    2           4        -5   # BR(H+ -> c       bb     )
     9.59212747E-02    2         -15        16   # BR(H+ -> tau+    nu_tau )
     3.38550669E-04    2         -13        14   # BR(H+ -> mu+     nu_mu  )
     9.40404211E-06    2           2        -5   # BR(H+ -> u       bb     )
     1.02756863E-05    2           2        -3   # BR(H+ -> u       sb     )
     2.02292191E-04    2           4        -3   # BR(H+ -> c       sb     )
     5.53284756E-01    2           6        -5   # BR(H+ -> t       bb     )
     9.47989772E-06    2          24        25   # BR(H+ -> W+      h      )
     3.67203757E-11    2          24        36   # BR(H+ -> W+      A      )
     1.48787944E-02    2     1000024   1000022   # BR(H+ -> ~chi_1+ ~chi_10)
     4.92024147E-07    2     1000024   1000023   # BR(H+ -> ~chi_1+ ~chi_20)
     9.81045701E-02    2     1000024   1000025   # BR(H+ -> ~chi_1+ ~chi_30)
     1.01692715E-01    2     1000024   1000035   # BR(H+ -> ~chi_1+ ~chi_40)
     2.68072371E-02    2     1000037   1000022   # BR(H+ -> ~chi_2+ ~chi_10)
     1.07799746E-01    2     1000037   1000023   # BR(H+ -> ~chi_2+ ~chi_20)
