#
#                              ======================
#                              | THE SUSYHIT OUTPUT |
#                              ======================
#
#
#              ------------------------------------------------------
#              |     This is the output of the SUSY-HIT package     |
#              |  created by A.Djouadi, M.Muehlleitner and M.Spira. |
#              |  In case of problems with SUSY-HIT email to        |
#              |           margarete.muehlleitner@cern.ch           |
#              |           michael.spira@psi.ch                     |
#              |           abdelhak.djouadi@cern.ch                 |
#              ------------------------------------------------------
#
#              ------------------------------------------------------
#              |  SUSY Les Houches Accord - MSSM Spectrum + Decays  |
#              |              based on the decay programs           |
#              |                                                    |
#              |                     SDECAY 1.3b                    |
#              |                                                    |
#              |  Authors: M.Muhlleitner, A.Djouadi and Y.Mambrini  |
#              |  Ref.:    Comput.Phys.Commun.168(2005)46           |
#              |           [hep-ph/0311167]                         |
#              |                                                    |
#              |                     HDECAY 3.4                     |
#              |                                                    |
#              |  By: A.Djouadi,J.Kalinowski,M.Muhlleitner,M.Spira  |
#              |  Ref.:    Comput.Phys.Commun.108(1998)56           |
#              |           [hep-ph/9704448]                         |
#              |                                                    |
#              |                                                    |
#              |  If not stated otherwise all DRbar couplings and   |
#              |  soft SUSY breaking masses are given at the scale  |
#              |  Q=  0.35678130E+04
#              |                                                    |
#              ------------------------------------------------------
#
#
BLOCK DCINFO  # Decay Program information
     1   SDECAY/HDECAY # decay calculator
     2   1.3b  /3.4    # version number
#
BLOCK SPINFO  # Spectrum calculator information
     1     SOFTSUSY    # spectrum calculator               
     2     3.4.0       # version number                    
#
BLOCK MODSEL  # Model selection
     1     0   #  nonUniversal                                     
#
BLOCK SMINPUTS  # Standard Model inputs
         1     1.27908970E+02   # alpha_em^-1(M_Z)^MSbar
         2     1.16637870E-05   # G_F [GeV^-2]
         3     1.18400000E-01   # alpha_S(M_Z)^MSbar
         4     9.11876000E+01   # M_Z pole mass
         5     4.18000000E+00   # mb(mb)^MSbar
         6     1.73200000E+02   # mt pole mass
         7     1.77700000E+00   # mtau pole mass
#
BLOCK MINPAR  # Input parameters - minimal models
         3     1.28100000E+01   # tanb                
#
BLOCK EXTPAR  # Input parameters - non-minimal models
         0    -1.00000000E+00   # Set                 
         1     3.48502000E+03   # M_1(MX)             
         2     1.96506000E+03   # M_2(MX)             
         3     3.05903000E+03   # M_3(MX)             
        11    -5.42699000E+03   # At(MX)              
        12    -2.81256000E+03   # Ab(MX)              
        13    -1.11845000E+03   # Atau(MX)            
        23    -2.24430000E+02   # mu(MX)              
        26     3.47854000E+03   # mA(pole)            
        31     2.46687000E+03   # meL(MX)             
        32     2.46687000E+03   # mmuL(MX)            
        33     1.72000000E+03   # mtauL(MX)           
        34     2.67375000E+03   # meR(MX)             
        35     2.67375000E+03   # mmuR(MX)            
        36     2.04288000E+03   # mtauR(MX)           
        41     1.15043000E+03   # mqL1(MX)            
        42     1.15043000E+03   # mqL2(MX)            
        43     3.98888000E+03   # mqL3(MX)            
        44     2.17273000E+03   # muR(MX)             
        45     2.17273000E+03   # mcR(MX)             
        46     3.19225000E+03   # mtR(MX)             
        47     7.08540000E+02   # mdR(MX)             
        48     7.08540000E+02   # msR(MX)             
        49     2.09094000E+03   # mbR(MX)             
#
BLOCK MASS  # Mass Spectrum
# PDG code           mass       particle
        24     8.03778478E+01   # W+
        25     1.27810922E+02   # h
        35     3.47858624E+03   # H
        36     3.47853993E+03   # A
        37     3.47986320E+03   # H+
         5     4.81876030E+00   # b-quark pole mass calculated from mb(mb)_Msbar
   1000001     1.39148179E+03   # ~d_L
   2000001     9.93165513E+02   # ~d_R
   1000002     1.38931142E+03   # ~u_L
   2000002     2.32217481E+03   # ~u_R
   1000003     1.39148179E+03   # ~s_L
   2000003     9.93165513E+02   # ~s_R
   1000004     1.38931142E+03   # ~c_L
   2000004     2.32217481E+03   # ~c_R
   1000005     2.24302552E+03   # ~b_1
   2000005     4.02846311E+03   # ~b_2
   1000006     3.20754969E+03   # ~t_1
   2000006     4.04264315E+03   # ~t_2
   1000011     2.48559538E+03   # ~e_L
   2000011     2.69429433E+03   # ~e_R
   1000012     2.48403972E+03   # ~nu_eL
   1000013     2.48559538E+03   # ~mu_L
   2000013     2.69429433E+03   # ~mu_R
   1000014     2.48403972E+03   # ~nu_muL
   1000015     1.74583408E+03   # ~tau_1
   2000015     2.06583679E+03   # ~tau_2
   1000016     1.74375178E+03   # ~nu_tauL
   1000021     3.15224689E+03   # ~g
   1000022     2.35107822E+02   # ~chi_10
   1000023    -2.38861364E+02   # ~chi_20
   1000025     1.97013910E+03   # ~chi_30
   1000035     3.41663771E+03   # ~chi_40
   1000024     2.37333882E+02   # ~chi_1+
   1000037     1.97031049E+03   # ~chi_2+
#
BLOCK NMIX  # Neutralino Mixing Matrix
  1  1    -9.02085265E-03   # N_11
  1  2     2.88629337E-02   # N_12
  1  3     7.09858139E-01   # N_13
  1  4     7.03695231E-01   # N_14
  2  1    -9.27143258E-03   # N_21
  2  2     2.70707023E-02   # N_22
  2  3    -7.04343228E-01   # N_23
  2  4     7.09282620E-01   # N_24
  3  1     1.28310332E-03   # N_31
  3  2     9.99216450E-01   # N_32
  3  3    -1.42273366E-03   # N_33
  3  4    -3.95324612E-02   # N_34
  4  1     9.99915506E-01   # N_41
  4  2    -7.70810611E-04   # N_42
  4  3    -1.24930122E-04   # N_43
  4  4     1.29758176E-02   # N_44
#
BLOCK UMIX  # Chargino Mixing Matrix U
  1  1     2.02744721E-03   # U_11
  1  2     9.99997945E-01   # U_12
  2  1    -9.99997945E-01   # U_21
  2  2     2.02744721E-03   # U_22
#
BLOCK VMIX  # Chargino Mixing Matrix V
  1  1     5.60000505E-02   # V_11
  1  2    -9.98430766E-01   # V_12
  2  1    -9.98430766E-01   # V_21
  2  2    -5.60000505E-02   # V_22
#
BLOCK STOPMIX  # Stop Mixing Matrix
  1  1     1.27943875E-01   # cos(theta_t)
  1  2     9.91781410E-01   # sin(theta_t)
  2  1    -9.91781410E-01   # -sin(theta_t)
  2  2     1.27943875E-01   # cos(theta_t)
#
BLOCK SBOTMIX  # Sbottom Mixing Matrix
  1  1     5.51735917E-05   # cos(theta_b)
  1  2     9.99999998E-01   # sin(theta_b)
  2  1    -9.99999998E-01   # -sin(theta_b)
  2  2     5.51735917E-05   # cos(theta_b)
#
BLOCK STAUMIX  # Stau Mixing Matrix
  1  1     9.99997180E-01   # cos(theta_tau)
  1  2    -2.37486674E-03   # sin(theta_tau)
  2  1     2.37486674E-03   # -sin(theta_tau)
  2  2     9.99997180E-01   # cos(theta_tau)
#
BLOCK ALPHA  # Higgs mixing
          -8.18700579E-02   # Mixing angle in the neutral Higgs boson sector
#
BLOCK HMIX Q=  3.56781300E+03  # DRbar Higgs Parameters
         1    -2.27641692E+02   # mu(Q)MSSM           
         2     1.22111905E+01   # tan                 
         3     2.42025509E+02   # higgs               
         4     1.19239446E+07   # mA^2(Q)MSSM         
#
BLOCK GAUGE Q=  3.56781300E+03  # The gauge couplings
     1     3.65897563E-01   # gprime(Q) DRbar
     2     6.39199688E-01   # g(Q) DRbar
     3     1.00927468E+00   # g3(Q) DRbar
#
BLOCK AU Q=  3.56781300E+03  # The trilinear couplings
  1  1     0.00000000E+00   # A_u(Q) DRbar
  2  2     0.00000000E+00   # A_c(Q) DRbar
  3  3    -5.42698998E+03   # A_t(Q) DRbar
#
BLOCK AD Q=  3.56781300E+03  # The trilinear couplings
  1  1     0.00000000E+00   # A_d(Q) DRbar
  2  2     0.00000000E+00   # A_s(Q) DRbar
  3  3    -2.81255999E+03   # A_b(Q) DRbar
#
BLOCK AE Q=  3.56781300E+03  # The trilinear couplings
  1  1     0.00000000E+00   # A_e(Q) DRbar
  2  2     0.00000000E+00   # A_mu(Q) DRbar
  3  3    -1.11845000E+03   # A_tau(Q) DRbar
#
BLOCK Yu Q=  3.56781300E+03  # The Yukawa couplings
  1  1     0.00000000E+00   # y_u(Q) DRbar
  2  2     0.00000000E+00   # y_c(Q) DRbar
  3  3     8.11017895E-01   # y_t(Q) DRbar
#
BLOCK Yd Q=  3.56781300E+03  # The Yukawa couplings
  1  1     0.00000000E+00   # y_d(Q) DRbar
  2  2     0.00000000E+00   # y_s(Q) DRbar
  3  3     1.61723965E-01   # y_b(Q) DRbar
#
BLOCK Ye Q=  3.56781300E+03  # The Yukawa couplings
  1  1     0.00000000E+00   # y_e(Q) DRbar
  2  2     0.00000000E+00   # y_mu(Q) DRbar
  3  3     1.24356681E-01   # y_tau(Q) DRbar
#
BLOCK MSOFT Q=  3.56781300E+03  # The soft SUSY breaking masses at the scale Q
         1     3.48502000E+03   # M_1(Q)              
         2     1.96506000E+03   # M_2(Q)              
         3     3.05903000E+03   # M_3(Q)              
        21     1.19115313E+07   # mH1^2(Q)            
        22     2.42982472E+05   # mH2^2(Q)            
        31     2.46687000E+03   # meL(Q)              
        32     2.46687000E+03   # mmuL(Q)             
        33     1.72000000E+03   # mtauL(Q)            
        34     2.67375000E+03   # meR(Q)              
        35     2.67375000E+03   # mmuR(Q)             
        36     2.04288000E+03   # mtauR(Q)            
        41     1.15042997E+03   # mqL1(Q)             
        42     1.15042997E+03   # mqL2(Q)             
        43     3.98887998E+03   # mqL3(Q)             
        44     2.17272998E+03   # muR(Q)              
        45     2.17272998E+03   # mcR(Q)              
        46     3.19224995E+03   # mtR(Q)              
        47     7.08539946E+02   # mdR(Q)              
        48     7.08539946E+02   # msR(Q)              
        49     2.09093998E+03   # mbR(Q)              
#
Block HiggsBoundsInputHiggsCouplingsFermions
# ScalarNormEffCoupSq PseudoSNormEffCoupSq NP   IP1 IP2 IP2
    1.00391852E+00    0.00000000E+00        3  25   5   5  # h0-b-b eff. coupling^2, normalised to SM
    1.49109255E+02    0.00000000E+00        3  35   5   5  # H0-b-b eff. coupling^2, normalised to SM
    0.00000000E+00    1.49113173E+02        3  36   5   5  # A0-b-b eff. coupling^2, normalised to SM
#
    9.99973721E-01    0.00000000E+00        3  25   6   6  # h0-t-t eff. coupling^2, normalised to SM
    6.73259446E-03    0.00000000E+00        3  35   6   6  # H0-t-t eff. coupling^2, normalised to SM
    0.00000000E+00    6.70631559E-03        3  36   6   6  # A0-t-t eff. coupling^2, normalised to SM
#
    1.00391852E+00    0.00000000E+00        3  25  15  15  # h0-tau-tau eff. coupling^2, normalised to SM
    1.49109255E+02    0.00000000E+00        3  35  15  15  # H0-tau-tau eff. coupling^2, normalised to SM
    0.00000000E+00    1.49113173E+02        3  36  15  15  # A0-tau-tau eff. coupling^2, normalised to SM
#
Block HiggsBoundsInputHiggsCouplingsBosons
    9.99999974E-01        3  25  24  24  # h0-W-W eff. coupling^2, normalised to SM
    2.56936189E-08        3  35  24  24  # H0-W-W eff. coupling^2, normalised to SM
    0.00000000E+00        3  36  24  24  # A0-W-W eff. coupling^2, normalised to SM
#
    9.99999974E-01        3  25  23  23  # h0-Z-Z eff. coupling^2, normalised to SM
    2.56936189E-08        3  35  23  23  # H0-Z-Z eff. coupling^2, normalised to SM
    0.00000000E+00        3  36  23  23  # A0-Z-Z eff. coupling^2, normalised to SM
#
    8.87050239E-01        3  25  21  21  # h0-g-g eff. coupling^2, normalised to SM
    1.91887739E-14        3  35  21  21  # H0-g-g eff. coupling^2, normalised to SM
    4.64623368E-13        3  36  21  21  # A0-g-g eff. coupling^2, normalised to SM
#
    0.00000000E+00        3  25  25  23  # h0-h0-Z eff. coupling^2, normalised to SM
    0.00000000E+00        3  35  25  23  # H0-h0-Z eff. coupling^2, normalised to SM
    2.56936189E-08        3  36  25  23  # A0-h0-Z eff. coupling^2, normalised to SM
    0.00000000E+00        3  35  35  23  # H0-H0-Z eff. coupling^2, normalised to SM
    9.99999974E-01        3  36  35  23  # A0-H0-Z eff. coupling^2, normalised to SM
    0.00000000E+00        3  36  36  23  # A0-A0-Z eff. coupling^2, normalised to SM
#
    0.00000000E+00        4  25  21  21  23  # h0-g-g-Z eff. coupling^2, normalised to SM
    0.00000000E+00        4  35  21  21  23  # H0-g-g-Z eff. coupling^2, normalised to SM
    0.00000000E+00        4  36  21  21  23  # A0-g-g-Z eff. coupling^2, normalised to SM
#
#
#
#                             =================
#                             |The decay table|
#                             =================
#
# - The QCD corrections to the decays gluino -> squark  + quark
#                                     squark -> gaugino + quark_prime
#                                     squark -> squark_prime + Higgs
#                                     squark -> gluino  + quark
#   are included.
#
# - The multi-body decays for the inos, stops and sbottoms are included.
#
# - The loop induced decays for the gluino, neutralinos and stops
#   are included.
#
# - The SUSY decays of the top quark are included.
#
#
#         PDG            Width
DECAY         6     1.43948372E+00   # top decays
#          BR         NDA      ID1       ID2
     1.00000000E+00    2           5        24   # BR(t ->  b    W+)
#
#         PDG            Width
DECAY   1000021     3.19491059E+02   # gluino decays
#          BR         NDA      ID1       ID2
     6.64099440E-02    2     1000001        -1   # BR(~g -> ~d_L  db)
     6.64099440E-02    2    -1000001         1   # BR(~g -> ~d_L* d )
     8.31149213E-02    2     2000001        -1   # BR(~g -> ~d_R  db)
     8.31149213E-02    2    -2000001         1   # BR(~g -> ~d_R* d )
     6.65101781E-02    2     1000002        -2   # BR(~g -> ~u_L  ub)
     6.65101781E-02    2    -1000002         2   # BR(~g -> ~u_L* u )
     2.14246433E-02    2     2000002        -2   # BR(~g -> ~u_R  ub)
     2.14246433E-02    2    -2000002         2   # BR(~g -> ~u_R* u )
     6.64099440E-02    2     1000003        -3   # BR(~g -> ~s_L  sb)
     6.64099440E-02    2    -1000003         3   # BR(~g -> ~s_L* s )
     8.31149213E-02    2     2000003        -3   # BR(~g -> ~s_R  sb)
     8.31149213E-02    2    -2000003         3   # BR(~g -> ~s_R* s )
     6.65101681E-02    2     1000004        -4   # BR(~g -> ~c_L  cb)
     6.65101681E-02    2    -1000004         4   # BR(~g -> ~c_L* c )
     2.14246153E-02    2     2000004        -4   # BR(~g -> ~c_R  cb)
     2.14246153E-02    2    -2000004         4   # BR(~g -> ~c_R* c )
     2.50806647E-02    2     1000005        -5   # BR(~g -> ~b_1  bb)
     2.50806647E-02    2    -1000005         5   # BR(~g -> ~b_1* b )
#
#         PDG            Width
DECAY   1000006     8.27264440E+01   # stop1 decays
#          BR         NDA      ID1       ID2
     2.48260703E-01    2     1000022         6   # BR(~t_1 -> ~chi_10 t )
     2.53106011E-01    2     1000023         6   # BR(~t_1 -> ~chi_20 t )
     2.12683753E-04    2     1000025         6   # BR(~t_1 -> ~chi_30 t )
     4.98019776E-01    2     1000024         5   # BR(~t_1 -> ~chi_1+ b )
     4.00825591E-04    2     1000037         5   # BR(~t_1 -> ~chi_2+ b )
     1.65052606E-09    2     1000005        24   # BR(~t_1 -> ~b_1    W+)
#
#         PDG            Width
DECAY   2000006     1.47786835E+02   # stop2 decays
#          BR         NDA      ID1       ID2
     1.74470317E-01    2     1000022         6   # BR(~t_2 -> ~chi_10 t )
     1.76886372E-01    2     1000023         6   # BR(~t_2 -> ~chi_20 t )
     6.50830981E-02    2     1000025         6   # BR(~t_2 -> ~chi_30 t )
     3.25354242E-04    2     1000035         6   # BR(~t_2 -> ~chi_40 t )
     1.64087934E-02    2     1000024         5   # BR(~t_2 -> ~chi_1+ b )
     1.29082931E-01    2     1000037         5   # BR(~t_2 -> ~chi_2+ b )
     2.12062247E-01    2     1000021         6   # BR(~t_2 -> ~g      t )
     1.09069523E-01    2     1000006        25   # BR(~t_2 -> ~t_1    h )
     1.16611084E-01    2     1000006        23   # BR(~t_2 -> ~t_1    Z )
     2.78324084E-07    2     1000005        24   # BR(~t_2 -> ~b_1    W+)
#
#         PDG            Width
DECAY   1000005     2.26867784E+00   # sbottom1 decays
#          BR         NDA      ID1       ID2
     2.53607630E-01    2     1000022         5   # BR(~b_1 -> ~chi_10 b )
     2.49514608E-01    2     1000023         5   # BR(~b_1 -> ~chi_20 b )
     1.18990749E-07    2     1000025         5   # BR(~b_1 -> ~chi_30 b )
     4.96877540E-01    2    -1000024         6   # BR(~b_1 -> ~chi_1- t )
     1.02558522E-07    2    -1000037         6   # BR(~b_1 -> ~chi_2- t )
#
#         PDG            Width
DECAY   2000005     1.47938528E+02   # sbottom2 decays
#          BR         NDA      ID1       ID2
     7.19428860E-03    2     1000022         5   # BR(~b_2 -> ~chi_10 b )
     7.07136833E-03    2     1000023         5   # BR(~b_2 -> ~chi_20 b )
     6.39300373E-02    2     1000025         5   # BR(~b_2 -> ~chi_30 b )
     3.19954679E-04    2     1000035         5   # BR(~b_2 -> ~chi_40 b )
     3.51431515E-01    2    -1000024         6   # BR(~b_2 -> ~chi_1- t )
     1.28937079E-01    2    -1000037         6   # BR(~b_2 -> ~chi_2- t )
     2.21190779E-01    2     1000021         5   # BR(~b_2 -> ~g      b )
     2.91945941E-09    2     1000005        25   # BR(~b_2 -> ~b_1    h )
     1.42768991E-07    2     1000005        23   # BR(~b_2 -> ~b_1    Z )
     2.19924832E-01    2     1000006       -24   # BR(~b_2 -> ~t_1    W-)
#
#         PDG            Width
DECAY   1000002     4.15338639E-02   # sup_L decays
#          BR         NDA      ID1       ID2
     9.64137932E-02    2     1000022         2   # BR(~u_L -> ~chi_10 u)
     8.36274419E-02    2     1000023         2   # BR(~u_L -> ~chi_20 u)
     8.19958765E-01    2     1000024         1   # BR(~u_L -> ~chi_1+ d)
#
#         PDG            Width
DECAY   2000002     7.19171798E-02   # sup_R decays
#           BR         NDA      ID1       ID2
     6.04462759E-03    2     1000022         2   # BR(~u_R -> ~chi_10 u)
     6.38099851E-03    2     1000023         2   # BR(~u_R -> ~chi_20 u)
#           BR         NDA      ID1       ID2       ID3
     5.93863666E-02    3        2       -1        1000001   # BR(~u_R -> u  db  ~d_L)
     2.15164166E-02    3        2       1        -1000001   # BR(~u_R -> u  d  ~d_L*)
     7.38404929E-02    3        2       -1        2000001   # BR(~u_R -> u  db  ~d_R)
     2.52957639E-01    3        2       1        -2000001   # BR(~u_R -> u  d  ~d_R*)
     5.98049036E-02    3        2       -2        1000002   # BR(~u_R -> u  ub  ~u_L)
     2.17486281E-02    3        2       2        -1000002   # BR(~u_R -> u  u  ~u_L*)
     6.01650400E-02    3        2       -3        1000003   # BR(~u_R -> u  sb  ~s_L)
     2.14163014E-02    3        2       3        -1000003   # BR(~u_R -> u  s  ~s_L*)
     7.40587996E-02    3        2       -3        2000003   # BR(~u_R -> u  sb  ~s_R)
     2.54056125E-01    3        2       3        -2000003   # BR(~u_R -> u  s  ~s_R*)
     6.03124318E-02    3        2       -4        1000004   # BR(~u_R -> u  cb  ~c_L)
     2.19822302E-02    3        2       4        -1000004   # BR(~u_R -> u  c  ~c_L*)
     3.09091653E-07    3        2       -5        1000005   # BR(~u_R -> u  bb  ~b_1)
     5.88259998E-07    3        2       5        -1000005   # BR(~u_R -> u  b  ~b_1*)
     1.39118359E-05    3        2       -15        1000015   # BR(~u_R -> u  tau+  ~tau_1-)
     4.89465801E-06    3        2       15        -1000015   # BR(~u_R -> u  tau-  ~tau_1+)
     5.25993930E-07    3        2       -15        2000015   # BR(~u_R -> u  tau+  ~tau_2-)
     1.24858900E-06    3        2       15        -2000015   # BR(~u_R -> u  tau-  ~tau_2+)
     1.47071952E-05    3        2       -16        1000016   # BR(~u_R -> u  nu_taub  ~nu_tau1)
     5.30151490E-06    3        2       16        -1000016   # BR(~u_R -> u  nu_tau  ~nu_tau1*)
     7.77769654E-04    3        2       23        1000022   # BR(~u_R -> u  Z  ~chi_10)
     7.55076884E-04    3        2       25        1000022   # BR(~u_R -> u  h  ~chi_10)
     8.85226593E-04    3        2       23        1000023   # BR(~u_R -> u  Z  ~chi_20)
     6.65418196E-04    3        2       25        1000023   # BR(~u_R -> u  h  ~chi_20)
     3.48525903E-09    3        2       23        1000025   # BR(~u_R -> u  Z  ~chi_30)
     6.45575927E-08    3        2       25        1000025   # BR(~u_R -> u  h  ~chi_30)
     3.85818800E-04    3        2       -24        1000024   # BR(~u_R -> u  W-  ~chi_1+)
     2.81796367E-03    3        2       24        -1000024   # BR(~u_R -> u  W+  ~chi_1-)
     8.31386884E-08    3        2       -24        1000037   # BR(~u_R -> u  W-  ~chi_2+)
     8.70487416E-08    3        2       24        -1000037   # BR(~u_R -> u  W+  ~chi_2-)
#
#         PDG            Width
DECAY   1000001     9.65814710E-03   # sdown_L decays
#          BR         NDA      ID1       ID2
     5.27342856E-01    2     1000022         1   # BR(~d_L -> ~chi_10 d)
     4.68027493E-01    2     1000023         1   # BR(~d_L -> ~chi_20 d)
     4.62965099E-03    2    -1000024         2   # BR(~d_L -> ~chi_1- u)
#
#         PDG            Width
DECAY   2000001     9.44317786E-05   # sdown_R decays
#           BR         NDA      ID1       ID2
     4.68134144E-01    2     1000022         1   # BR(~d_R -> ~chi_10 d)
     4.92625814E-01    2     1000023         1   # BR(~d_R -> ~chi_20 d)
#           BR         NDA      ID1       ID2       ID3
     4.48313064E-03    3        1       23        1000022   # BR(~d_R -> d  Z  ~chi_10)
     4.52633643E-03    3        1       25        1000022   # BR(~d_R -> d  h  ~chi_10)
     4.83650744E-03    3        1       23        1000023   # BR(~d_R -> d  Z  ~chi_20)
     4.05287294E-03    3        1       25        1000023   # BR(~d_R -> d  h  ~chi_20)
     3.95915449E-04    3        1       -24        1000024   # BR(~d_R -> d  W-  ~chi_1+)
     2.09452795E-02    3        1       24        -1000024   # BR(~d_R -> d  W+  ~chi_1-)
#
#         PDG            Width
DECAY   1000004     4.07064259E-02   # scharm_L decays
#          BR         NDA      ID1       ID2
     9.64149184E-02    2     1000022         4   # BR(~c_L -> ~chi_10 c)
     8.36263905E-02    2     1000023         4   # BR(~c_L -> ~chi_20 c)
     8.19958691E-01    2     1000024         3   # BR(~c_L -> ~chi_1+ s)
#
#         PDG            Width
DECAY   2000004     7.20486363E-02   # scharm_R decays
#           BR         NDA      ID1       ID2
     6.08290960E-03    2     1000022         4   # BR(~c_R -> ~chi_10 c)
     6.42126063E-03    2     1000023         4   # BR(~c_R -> ~chi_20 c)
#           BR         NDA      ID1       ID2       ID3
     5.96860707E-02    3        4       -1        1000001   # BR(~c_R -> c  db  ~d_L)
     2.11995685E-02    3        4       1        -1000001   # BR(~c_R -> c  d  ~d_L*)
     7.42956463E-02    3        4       -1        2000001   # BR(~c_R -> c  db  ~d_R)
     2.52926369E-01    3        4       1        -2000001   # BR(~c_R -> c  d  ~d_R*)
     5.95736466E-02    3        4       -2        1000002   # BR(~c_R -> c  ub  ~u_L)
     2.15729274E-02    3        4       2        -1000002   # BR(~c_R -> c  u  ~u_L*)
     6.03703307E-02    3        4       -3        1000003   # BR(~c_R -> c  sb  ~s_L)
     2.14063732E-02    3        4       3        -1000003   # BR(~c_R -> c  s  ~s_L*)
     7.45787883E-02    3        4       -3        2000003   # BR(~c_R -> c  sb  ~s_R)
     2.53620345E-01    3        4       3        -2000003   # BR(~c_R -> c  s  ~s_R*)
     6.04536077E-02    3        4       -4        1000004   # BR(~c_R -> c  cb  ~c_L)
     2.15076937E-02    3        4       4        -1000004   # BR(~c_R -> c  c  ~c_L*)
     3.09277193E-07    3        4       -5        1000005   # BR(~c_R -> c  bb  ~b_1)
     5.84979843E-07    3        4       5        -1000005   # BR(~c_R -> c  b  ~b_1*)
     1.39516867E-05    3        4       -15        1000015   # BR(~c_R -> c  tau+  ~tau_1-)
     4.86060553E-06    3        4       15        -1000015   # BR(~c_R -> c  tau-  ~tau_1+)
     5.26255623E-07    3        4       -15        2000015   # BR(~c_R -> c  tau+  ~tau_2-)
     1.23726144E-06    3        4       15        -2000015   # BR(~c_R -> c  tau-  ~tau_2+)
     1.45832045E-05    3        4       -16        1000016   # BR(~c_R -> c  nu_taub  ~nu_tau1)
     5.23576877E-06    3        4       16        -1000016   # BR(~c_R -> c  nu_tau  ~nu_tau1*)
     7.76322812E-04    3        4       23        1000022   # BR(~c_R -> c  Z  ~chi_10)
     7.53282821E-04    3        4       25        1000022   # BR(~c_R -> c  h  ~chi_10)
     8.85041038E-04    3        4       23        1000023   # BR(~c_R -> c  Z  ~chi_20)
     6.64204105E-04    3        4       25        1000023   # BR(~c_R -> c  h  ~chi_20)
     3.47487493E-09    3        4       23        1000025   # BR(~c_R -> c  Z  ~chi_30)
     6.45910906E-08    3        4       25        1000025   # BR(~c_R -> c  h  ~chi_30)
     3.84309841E-04    3        4       -24        1000024   # BR(~c_R -> c  W-  ~chi_1+)
     2.79977541E-03    3        4       24        -1000024   # BR(~c_R -> c  W+  ~chi_1-)
     8.21750458E-08    3        4       -24        1000037   # BR(~c_R -> c  W-  ~chi_2+)
     8.72174731E-08    3        4       24        -1000037   # BR(~c_R -> c  W+  ~chi_2-)
#
#         PDG            Width
DECAY   1000003     9.46650437E-03   # sstrange_L decays
#          BR         NDA      ID1       ID2
     5.27348878E-01    2     1000022         3   # BR(~s_L -> ~chi_10 s)
     4.68021491E-01    2     1000023         3   # BR(~s_L -> ~chi_20 s)
     4.62963051E-03    2    -1000024         4   # BR(~s_L -> ~chi_1- c)
#
#         PDG            Width
DECAY   2000003     9.11839560E-05   # sstrange_R decays
#           BR         NDA      ID1       ID2
     4.67458526E-01    2     1000022         3   # BR(~s_R -> ~chi_10 s)
     4.91904040E-01    2     1000023         3   # BR(~s_R -> ~chi_20 s)
#           BR         NDA      ID1       ID2       ID3
     4.64281238E-03    3        3       23        1000022   # BR(~s_R -> s  Z  ~chi_10)
     4.68755710E-03    3        3       25        1000022   # BR(~s_R -> s  h  ~chi_10)
     5.00877589E-03    3        3       23        1000023   # BR(~s_R -> s  Z  ~chi_20)
     4.19722961E-03    3        3       25        1000023   # BR(~s_R -> s  h  ~chi_20)
     4.09743135E-04    3        3       -24        1000024   # BR(~s_R -> s  W-  ~chi_1+)
     2.16913160E-02    3        3       24        -1000024   # BR(~s_R -> s  W+  ~chi_1-)
#
#         PDG            Width
DECAY   1000011     4.19674218E+00   # selectron_L decays
#          BR         NDA      ID1       ID2
     1.32785203E-03    2     1000022        11   # BR(~e_L -> ~chi_10 e-)
     1.11914993E-03    2     1000023        11   # BR(~e_L -> ~chi_20 e-)
     3.32620743E-01    2     1000025        11   # BR(~e_L -> ~chi_30 e-)
     1.94296572E-05    2    -1000024        12   # BR(~e_L -> ~chi_1- nu_e)
     6.64912826E-01    2    -1000037        12   # BR(~e_L -> ~chi_2- nu_e)
#
#         PDG            Width
DECAY   2000011     5.41932710E-03   # selectron_R decays
#           BR         NDA      ID1       ID2
     2.12243697E-01    2     1000022        11   # BR(~e_R -> ~chi_10 e-)
     2.24088094E-01    2     1000023        11   # BR(~e_R -> ~chi_20 e-)
#           BR         NDA      ID1       ID2       ID3
     5.63095739E-03    3        11       -1        1000001   # BR(~e_R- -> e-  db  ~d_L)
     2.17628495E-03    3        11       1        -1000001   # BR(~e_R- -> e-  d  ~d_L*)
     1.89728352E-02    3        11       -1        2000001   # BR(~e_R- -> e-  db  ~d_R)
     5.87619079E-02    3        11       1        -2000001   # BR(~e_R- -> e-  d  ~d_R*)
     5.44237309E-03    3        11       -2        1000002   # BR(~e_R- -> e-  ub  ~u_L)
     2.07165941E-03    3        11       2        -1000002   # BR(~e_R- -> e-  u  ~u_L*)
     2.14546931E-04    3        11       -2        2000002   # BR(~e_R- -> e-  ub  ~u_R)
     3.94200232E-04    3        11       2        -2000002   # BR(~e_R- -> e-  u  ~u_R*)
     5.53998669E-03    3        11       -3        1000003   # BR(~e_R- -> e-  sb  ~s_L)
     2.18827906E-03    3        11       3        -1000003   # BR(~e_R- -> e-  s  ~s_L*)
     1.89137873E-02    3        11       -3        2000003   # BR(~e_R- -> e-  sb  ~s_R)
     5.99373306E-02    3        11       3        -2000003   # BR(~e_R- -> e-  s  ~s_R*)
     5.52411756E-03    3        11       -4        1000004   # BR(~e_R- -> e-  cb  ~c_L)
     2.05209979E-03    3        11       4        -1000004   # BR(~e_R- -> e-  c  ~c_L*)
     2.14713004E-04    3        11       -4        2000004   # BR(~e_R- -> e-  cb  ~c_R)
     3.95362738E-04    3        11       4        -2000004   # BR(~e_R- -> e-  c  ~c_R*)
     1.25604155E-04    3        11       -5        1000005   # BR(~e_R- -> e-  bb  ~b_1)
     2.36136328E-04    3        11       5        -1000005   # BR(~e_R- -> e-  b  ~b_1*)
     4.92145971E-06    3        11       -11        1000011   # BR(~e_R- -> e-  e+  ~e_L-)
     2.77359158E-06    3        11       11        -1000011   # BR(~e_R- -> e-  e-  ~e_L+)
     5.20525878E-06    3        11       -12        1000012   # BR(~e_R- -> e-  nu_eb  ~nu_eL)
     2.94907462E-06    3        11       12        -1000012   # BR(~e_R- -> e-  nu_e  ~nu_eL*)
     4.90854298E-06    3        11       -13        1000013   # BR(~e_R- -> e-  mu+  ~mu_L-)
     2.80680603E-06    3        11       13        -1000013   # BR(~e_R- -> e-  mu-  ~mu_L+)
     5.14934778E-06    3        11       -14        1000014   # BR(~e_R- -> e-  nu_mub  ~nu_muL)
     2.98302717E-06    3        11       14        -1000014   # BR(~e_R- -> e-  nu_mu  ~nu_muL*)
     4.43782033E-03    3        11       -15        1000015   # BR(~e_R- -> e-  tau+  ~tau_1-)
     1.91167645E-03    3        11       15        -1000015   # BR(~e_R- -> e-  tau-  ~tau_1+)
     1.52899056E-03    3        11       -15        2000015   # BR(~e_R- -> e-  tau+  ~tau_2-)
     3.09669442E-03    3        11       15        -2000015   # BR(~e_R- -> e-  tau-  ~tau_2+)
     4.60223189E-03    3        11       -16        1000016   # BR(~e_R- -> e-  nu_taub  ~nu_tau1)
     2.05486766E-03    3        11       16        -1000016   # BR(~e_R- -> e-  nu_tau  ~nu_tau1*)
     4.08740782E-02    3        11       23        1000022   # BR(~e_R- -> e-  Z  ~chi_10)
     4.36345685E-02    3        11       25        1000022   # BR(~e_R- -> e-  h  ~chi_10)
     4.71183959E-02    3        11       23        1000023   # BR(~e_R- -> e-  Z  ~chi_20)
     3.95621072E-02    3        11       25        1000023   # BR(~e_R- -> e-  h  ~chi_20)
     1.27120948E-06    3        11       23        1000025   # BR(~e_R- -> e-  Z  ~chi_30)
     6.04023329E-05    3        11       25        1000025   # BR(~e_R- -> e-  h  ~chi_30)
     3.01365828E-02    3        11       -24        1000024   # BR(~e_R- -> e-  W-  ~chi_1+)
     1.55683534E-01    3        11       24        -1000024   # BR(~e_R- -> e-  W+  ~chi_1-)
     6.86930301E-05    3        11       -24        1000037   # BR(~e_R- -> e-  W-  ~chi_2+)
     7.24148944E-05    3        11       24        -1000037   # BR(~e_R- -> e-  W+  ~chi_2-)
#
#         PDG            Width
DECAY   1000013     4.19674215E+00   # smuon_L decays
#          BR         NDA      ID1       ID2
     1.32785204E-03    2     1000022        13   # BR(~mu_L -> ~chi_10 mu-)
     1.11914994E-03    2     1000023        13   # BR(~mu_L -> ~chi_20 mu-)
     3.32620737E-01    2     1000025        13   # BR(~mu_L -> ~chi_30 mu-)
     1.94296574E-05    2    -1000024        14   # BR(~mu_L -> ~chi_1- nu_mu)
     6.64912831E-01    2    -1000037        14   # BR(~mu_L -> ~chi_2- nu_mu)
#
#         PDG            Width
DECAY   2000013     5.42151387E-03   # smuon_R decays
#           BR         NDA      ID1       ID2
     2.12158089E-01    2     1000022        13   # BR(~mu_R -> ~chi_10 mu-)
     2.23997708E-01    2     1000023        13   # BR(~mu_R -> ~chi_20 mu-)
#           BR         NDA      ID1       ID2       ID3
     5.62868614E-03    3        13       -1        1000001   # BR(~mu_R- -> mu-  db  ~d_L)
     2.17300929E-03    3        13       1        -1000001   # BR(~mu_R- -> mu-  d  ~d_L*)
     1.89651825E-02    3        13       -1        2000001   # BR(~mu_R- -> mu-  db  ~d_R)
     5.87382063E-02    3        13       1        -2000001   # BR(~mu_R- -> mu-  d  ~d_R*)
     5.43482885E-03    3        13       -2        1000002   # BR(~mu_R- -> mu-  ub  ~u_L)
     2.07082381E-03    3        13       2        -1000002   # BR(~mu_R- -> mu-  u  ~u_L*)
     2.14460394E-04    3        13       -2        2000002   # BR(~mu_R- -> mu-  ub  ~u_R)
     3.94317907E-04    3        13       2        -2000002   # BR(~mu_R- -> mu-  u  ~u_R*)
     5.53775213E-03    3        13       -3        1000003   # BR(~mu_R- -> mu-  sb  ~s_L)
     2.18739641E-03    3        13       3        -1000003   # BR(~mu_R- -> mu-  s  ~s_L*)
     1.89061584E-02    3        13       -3        2000003   # BR(~mu_R- -> mu-  sb  ~s_R)
     6.02433209E-02    3        13       3        -2000003   # BR(~mu_R- -> mu-  s  ~s_R*)
     5.52188940E-03    3        13       -4        1000004   # BR(~mu_R- -> mu-  cb  ~c_L)
     2.05127207E-03    3        13       4        -1000004   # BR(~mu_R- -> mu-  c  ~c_L*)
     2.14626399E-04    3        13       -4        2000004   # BR(~mu_R- -> mu-  cb  ~c_R)
     3.89798874E-04    3        13       4        -2000004   # BR(~mu_R- -> mu-  c  ~c_R*)
     1.25439133E-04    3        13       -5        1000005   # BR(~mu_R- -> mu-  bb  ~b_1)
     2.36041082E-04    3        13       5        -1000005   # BR(~mu_R- -> mu-  b  ~b_1*)
     4.90545642E-06    3        13       -11        1000011   # BR(~mu_R- -> mu-  e+  ~e_L-)
     2.79626694E-06    3        13       11        -1000011   # BR(~mu_R- -> mu-  e-  ~e_L+)
     5.20574155E-06    3        13       -12        1000012   # BR(~mu_R- -> mu-  nu_eb  ~nu_eL)
     2.94788511E-06    3        13       12        -1000012   # BR(~mu_R- -> mu-  nu_e  ~nu_eL*)
     4.92242585E-06    3        13       -13        1000013   # BR(~mu_R- -> mu-  mu+  ~mu_L-)
     2.81747873E-06    3        13       13        -1000013   # BR(~mu_R- -> mu-  mu-  ~mu_L+)
     5.20113029E-06    3        13       -14        1000014   # BR(~mu_R- -> mu-  nu_mub  ~nu_muL)
     2.98643523E-06    3        13       14        -1000014   # BR(~mu_R- -> mu-  nu_mu  ~nu_muL*)
     4.43603034E-03    3        13       -15        1000015   # BR(~mu_R- -> mu-  tau+  ~tau_1-)
     1.91090538E-03    3        13       15        -1000015   # BR(~mu_R- -> mu-  tau-  ~tau_1+)
     1.52870585E-03    3        13       -15        2000015   # BR(~mu_R- -> mu-  tau+  ~tau_2-)
     3.12956868E-03    3        13       15        -2000015   # BR(~mu_R- -> mu-  tau-  ~tau_2+)
     4.60037558E-03    3        13       -16        1000016   # BR(~mu_R- -> mu-  nu_taub  ~nu_tau1)
     2.05403883E-03    3        13       16        -1000016   # BR(~mu_R- -> mu-  nu_tau  ~nu_tau1*)
     4.08575917E-02    3        13       23        1000022   # BR(~mu_R- -> mu-  Z  ~chi_10)
     4.36686146E-02    3        13       25        1000022   # BR(~mu_R- -> mu-  h  ~chi_10)
     4.70993907E-02    3        13       23        1000023   # BR(~mu_R- -> mu-  Z  ~chi_20)
     3.95461499E-02    3        13       25        1000023   # BR(~mu_R- -> mu-  h  ~chi_20)
     1.27073363E-06    3        13       23        1000025   # BR(~mu_R- -> mu-  Z  ~chi_30)
     6.03779697E-05    3        13       25        1000025   # BR(~mu_R- -> mu-  h  ~chi_30)
     3.01244272E-02    3        13       -24        1000024   # BR(~mu_R- -> mu-  W-  ~chi_1+)
     1.55620740E-01    3        13       24        -1000024   # BR(~mu_R- -> mu-  W+  ~chi_1-)
     6.86376554E-05    3        13       -24        1000037   # BR(~mu_R- -> mu-  W-  ~chi_2+)
     7.23856859E-05    3        13       24        -1000037   # BR(~mu_R- -> mu-  W+  ~chi_2-)
#
#         PDG            Width
DECAY   1000015     5.24716341E-01   # stau_1 decays
#          BR         NDA      ID1       ID2
     5.05037477E-01    2     1000022        15   # BR(~tau_1 -> ~chi_10  tau-)
     4.94801052E-01    2     1000023        15   # BR(~tau_1 -> ~chi_20  tau-)
     1.61470836E-04    2    -1000024        16   # BR(~tau_1 -> ~chi_1-  nu_tau)
#
#         PDG            Width
DECAY   2000015     1.24097811E+00   # stau_2 decays
#          BR         NDA      ID1       ID2
     2.51931229E-01    2     1000022        15   # BR(~tau_2 -> ~chi_10  tau-)
     2.48274572E-01    2     1000023        15   # BR(~tau_2 -> ~chi_20  tau-)
     5.51505385E-07    2     1000025        15   # BR(~tau_2 -> ~chi_30  tau-)
     4.98693916E-01    2    -1000024        16   # BR(~tau_2 -> ~chi_1-  nu_tau)
     8.46976998E-07    2    -1000037        16   # BR(~tau_2 -> ~chi_2-  nu_tau)
     5.43618232E-04    2     1000016       -24   # BR(~tau_2 -> ~nu_tauL W-)
     2.88178667E-04    2     1000015        25   # BR(~tau_2 -> ~tau_1   h)
     2.67086914E-04    2     1000015        23   # BR(~tau_2 -> ~tau_1   Z)
#
#         PDG            Width
DECAY   1000012     4.23732931E+00   # snu_eL decays
#          BR         NDA      ID1       ID2
     2.70934592E-03    2     1000022        12   # BR(~nu_eL -> ~chi_10 nu_e)
     2.45171339E-03    2     1000023        12   # BR(~nu_eL -> ~chi_20 nu_e)
     3.26873310E-01    2     1000025        12   # BR(~nu_eL -> ~chi_30 nu_e)
     1.46717200E-02    2     1000024        11   # BR(~nu_eL -> ~chi_1+ e-)
     6.53293911E-01    2     1000037        11   # BR(~nu_eL -> ~chi_2+ e-)
#
#         PDG            Width
DECAY   1000014     4.23732923E+00   # snu_muL decays
#          BR         NDA      ID1       ID2
     2.70934597E-03    2     1000022        14   # BR(~nu_muL -> ~chi_10 nu_mu)
     2.45171344E-03    2     1000023        14   # BR(~nu_muL -> ~chi_20 nu_mu)
     3.26873315E-01    2     1000025        14   # BR(~nu_muL -> ~chi_30 nu_mu)
     1.46717202E-02    2     1000024        13   # BR(~nu_muL -> ~chi_1+ mu-)
     6.53293905E-01    2     1000037        13   # BR(~nu_muL -> ~chi_2+ mu-)
#
#         PDG            Width
DECAY   1000016     5.74748809E-01   # snu_tauL decays
#          BR         NDA      ID1       ID2
     1.37621262E-02    2     1000022        16   # BR(~nu_tauL -> ~chi_10 nu_tau)
     1.24458839E-02    2     1000023        16   # BR(~nu_tauL -> ~chi_20 nu_tau)
     9.73791990E-01    2     1000024        15   # BR(~nu_tauL -> ~chi_1+ tau-)
#
#         PDG            Width
DECAY   1000024     5.81478348E-11   # chargino1+ decays
#           BR         NDA      ID1       ID2       ID3
     3.74120077E-01    3     1000022         2        -1   # BR(~chi_1+ -> ~chi_10 u    db)
     3.74120077E-01    3     1000022         4        -3   # BR(~chi_1+ -> ~chi_10 c    sb)
     1.24706274E-01    3     1000022       -11        12   # BR(~chi_1+ -> ~chi_10 e+   nu_e)
     1.24706274E-01    3     1000022       -13        14   # BR(~chi_1+ -> ~chi_10 mu+  nu_mu)
     2.34729771E-03    3     1000022       -15        16   # BR(~chi_1+ -> ~chi_10 tau+ nu_tau)
#
#         PDG            Width
DECAY   1000037     3.99988640E+01   # chargino2+ decays
#          BR         NDA      ID1       ID2
     1.53499728E-01    2     1000002        -1   # BR(~chi_2+ -> ~u_L     db)
     1.53042274E-01    2    -1000001         2   # BR(~chi_2+ -> ~d_L*    u )
     1.53499704E-01    2     1000004        -3   # BR(~chi_2+ -> ~c_L     sb)
     1.53041879E-01    2    -1000003         4   # BR(~chi_2+ -> ~s_L*     c )
     9.37580431E-03    2     1000016       -15   # BR(~chi_2+ -> ~nu_tau1 tau+)
     9.24364296E-03    2    -1000015        16   # BR(~chi_2+ -> ~tau_1+  nu_tau)
     9.29340696E-02    2     1000024        23   # BR(~chi_2+ -> ~chi_1+  Z )
     8.94419423E-02    2     1000022        24   # BR(~chi_2+ -> ~chi_10  W+)
     9.08541842E-02    2     1000023        24   # BR(~chi_2+ -> ~chi_20  W+)
     9.50667711E-02    2     1000024        25   # BR(~chi_2+ -> ~chi_1+  h )
#
#         PDG            Width
DECAY   1000022     0.00000000E+00   # neutralino1 decays
#
#         PDG            Width
DECAY   1000023     7.05486131E-10   # neutralino2 decays
#          BR         NDA      ID1       ID2
     1.21632262E-01    2     1000022        22   # BR(~chi_20 -> ~chi_10 gam)
#           BR         NDA      ID1       ID2       ID3
     1.23430999E-01    3     1000022        -2         2   # BR(~chi_20 -> ~chi_10 ub      u)
     1.60261554E-01    3     1000022        -1         1   # BR(~chi_20 -> ~chi_10 db      d)
     1.23430999E-01    3     1000022        -4         4   # BR(~chi_20 -> ~chi_10 cb      c)
     1.60261554E-01    3     1000022        -3         3   # BR(~chi_20 -> ~chi_10 sb      s)
     3.68443244E-02    3     1000022       -11        11   # BR(~chi_20 -> ~chi_10 e+      e-)
     3.68443244E-02    3     1000022       -13        13   # BR(~chi_20 -> ~chi_10 mu+     mu-)
     5.65352148E-04    3     1000022       -15        15   # BR(~chi_20 -> ~chi_10 tau+    tau-)
     7.36768725E-02    3     1000022       -12        12   # BR(~chi_20 -> ~chi_10 nu_eb   nu_e)
     7.36768725E-02    3     1000022       -14        14   # BR(~chi_20 -> ~chi_10 nu_mub  nu_mu)
     7.36770469E-02    3     1000022       -16        16   # BR(~chi_20 -> ~chi_10 nu_taub nu_tau)
     4.70935724E-03    3     1000024        -2         1   # BR(~chi_20 -> ~chi_1+ ub      d)
     4.70935724E-03    3    -1000024        -1         2   # BR(~chi_20 -> ~chi_1- db      u)
     1.56978127E-03    3     1000024       -12        11   # BR(~chi_20 -> ~chi_1+ nu_eb   e-)
     1.56978127E-03    3    -1000024        12       -11   # BR(~chi_20 -> ~chi_1- nu_e    e+)
     1.56978127E-03    3     1000024       -14        13   # BR(~chi_20 -> ~chi_1+ nu_mub  mu-)
     1.56978127E-03    3    -1000024        14       -13   # BR(~chi_20 -> ~chi_1- nu_mu   mu+)
#
#         PDG            Width
DECAY   1000025     3.99850419E+01   # neutralino3 decays
#          BR         NDA      ID1       ID2
     4.27861809E-02    2     1000022        23   # BR(~chi_30 -> ~chi_10   Z )
     4.99812977E-02    2     1000023        23   # BR(~chi_30 -> ~chi_20   Z )
     9.06842660E-02    2     1000024       -24   # BR(~chi_30 -> ~chi_1+   W-)
     9.06842660E-02    2    -1000024        24   # BR(~chi_30 -> ~chi_1-   W+)
     5.04128237E-02    2     1000022        25   # BR(~chi_30 -> ~chi_10   h )
     4.38084429E-02    2     1000023        25   # BR(~chi_30 -> ~chi_20   h )
     7.69024433E-02    2     1000002        -2   # BR(~chi_30 -> ~u_L      ub)
     7.69024433E-02    2    -1000002         2   # BR(~chi_30 -> ~u_L*     u )
     7.63580924E-02    2     1000001        -1   # BR(~chi_30 -> ~d_L      db)
     7.63580924E-02    2    -1000001         1   # BR(~chi_30 -> ~d_L*     d )
     4.03263774E-08    2     2000001        -1   # BR(~chi_30 -> ~d_R      db)
     4.03263774E-08    2    -2000001         1   # BR(~chi_30 -> ~d_R*     d )
     7.69022465E-02    2     1000004        -4   # BR(~chi_30 -> ~c_L      cb)
     7.69022465E-02    2    -1000004         4   # BR(~chi_30 -> ~c_L*     c )
     7.63580924E-02    2     1000003        -3   # BR(~chi_30 -> ~s _L      sb)
     7.63580924E-02    2    -1000003         3   # BR(~chi_30 -> ~s _L*     s )
     4.03263774E-08    2     2000003        -3   # BR(~chi_30 -> ~s _R      sb)
     4.03263774E-08    2    -2000003         3   # BR(~chi_30 -> ~s _R*     s )
     4.61661021E-03    2     1000015       -15   # BR(~chi_30 -> ~tau_1-   tau+)
     4.61661021E-03    2    -1000015        15   # BR(~chi_30 -> ~tau_1+   tau-)
     4.68379586E-03    2     1000016       -16   # BR(~chi_30 -> ~nu_tau1  nu_taub)
     4.68379586E-03    2    -1000016        16   # BR(~chi_30 -> ~nu_tau1* nu_tau )
#
#         PDG            Width
DECAY   1000035     5.95781457E+01   # neutralino4 decays
#          BR         NDA      ID1       ID2
     1.82075690E-02    2     1000022        23   # BR(~chi_40 -> ~chi_10   Z )
     1.77796169E-02    2     1000023        23   # BR(~chi_40 -> ~chi_20   Z )
     1.71035492E-05    2     1000025        23   # BR(~chi_40 -> ~chi_30   Z )
     3.45084239E-02    2     1000024       -24   # BR(~chi_40 -> ~chi_1+   W-)
     3.45084239E-02    2    -1000024        24   # BR(~chi_40 -> ~chi_1-   W+)
     2.79538904E-04    2     1000037       -24   # BR(~chi_40 -> ~chi_2+   W-)
     2.79538904E-04    2    -1000037        24   # BR(~chi_40 -> ~chi_2-   W+)
     1.79209353E-02    2     1000022        25   # BR(~chi_40 -> ~chi_10   h )
     1.91659036E-02    2     1000023        25   # BR(~chi_40 -> ~chi_20   h )
     2.41683141E-04    2     1000025        25   # BR(~chi_40 -> ~chi_30   h )
     8.43091928E-03    2     1000002        -2   # BR(~chi_40 -> ~u_L      ub)
     8.43091928E-03    2    -1000002         2   # BR(~chi_40 -> ~u_L*     u )
     5.71357196E-02    2     2000002        -2   # BR(~chi_40 -> ~u_R      ub)
     5.71357196E-02    2    -2000002         2   # BR(~chi_40 -> ~u_R*     u )
     8.55777946E-03    2     1000001        -1   # BR(~chi_40 -> ~d_L      db)
     8.55777946E-03    2    -1000001         1   # BR(~chi_40 -> ~d_L*     d )
     4.08110766E-02    2     2000001        -1   # BR(~chi_40 -> ~d_R      db)
     4.08110766E-02    2    -2000001         1   # BR(~chi_40 -> ~d_R*     d )
     8.43091836E-03    2     1000004        -4   # BR(~chi_40 -> ~c_L      cb)
     8.43091836E-03    2    -1000004         4   # BR(~chi_40 -> ~c_L*     c )
     5.71356784E-02    2     2000004        -4   # BR(~chi_40 -> ~c_R      cb)
     5.71356784E-02    2    -2000004         4   # BR(~chi_40 -> ~c_R*     c )
     8.55777946E-03    2     1000003        -3   # BR(~chi_40 -> ~s _L      sb)
     8.55777946E-03    2    -1000003         3   # BR(~chi_40 -> ~s _L*     s )
     4.08110766E-02    2     2000003        -3   # BR(~chi_40 -> ~s _R      sb)
     4.08110766E-02    2    -2000003         3   # BR(~chi_40 -> ~s _R*     s )
     1.43850086E-03    2     1000006        -6   # BR(~chi_40 -> ~t_1      tb)
     1.43850086E-03    2    -1000006         6   # BR(~chi_40 -> ~t_1*     t )
     1.64815660E-02    2     1000005        -5   # BR(~chi_40 -> ~b_1      bb)
     1.64815660E-02    2    -1000005         5   # BR(~chi_40 -> ~b_1*     b )
     8.43787518E-03    2     1000011       -11   # BR(~chi_40 -> ~e_L-     e+)
     8.43787518E-03    2    -1000011        11   # BR(~chi_40 -> ~e_L+     e-)
     2.18370674E-02    2     2000011       -11   # BR(~chi_40 -> ~e_R-     e+)
     2.18370674E-02    2    -2000011        11   # BR(~chi_40 -> ~e_R+     e-)
     8.43787518E-03    2     1000013       -13   # BR(~chi_40 -> ~mu_L-    mu+)
     8.43787518E-03    2    -1000013        13   # BR(~chi_40 -> ~mu_L+    mu-)
     2.18370674E-02    2     2000013       -13   # BR(~chi_40 -> ~mu_R-    mu+)
     2.18370674E-02    2    -2000013        13   # BR(~chi_40 -> ~mu_R+    mu-)
     2.07893548E-02    2     1000015       -15   # BR(~chi_40 -> ~tau_1-   tau+)
     2.07893548E-02    2    -1000015        15   # BR(~chi_40 -> ~tau_1+   tau-)
     6.14644691E-02    2     2000015       -15   # BR(~chi_40 -> ~tau_2-   tau+)
     6.14644691E-02    2    -2000015        15   # BR(~chi_40 -> ~tau_2+   tau-)
     8.50733699E-03    2     1000012       -12   # BR(~chi_40 -> ~nu_eL    nu_eb)
     8.50733699E-03    2    -1000012        12   # BR(~chi_40 -> ~nu_eL*   nu_e )
     8.50733699E-03    2     1000014       -14   # BR(~chi_40 -> ~nu_muL   nu_mub)
     8.50733699E-03    2    -1000014        14   # BR(~chi_40 -> ~nu_muL*  nu_mu )
     2.09362338E-02    2     1000016       -16   # BR(~chi_40 -> ~nu_tau1  nu_taub)
     2.09362338E-02    2    -1000016        16   # BR(~chi_40 -> ~nu_tau1* nu_tau )
#
#         PDG            Width
DECAY        25     4.44730689E-03   # h decays
#          BR         NDA      ID1       ID2
     5.50265720E-01    2           5        -5   # BR(h -> b       bb     )
     5.97259024E-02    2         -15        15   # BR(h -> tau+    tau-   )
     2.11395434E-04    2         -13        13   # BR(h -> mu+     mu-    )
     2.29767216E-04    2           3        -3   # BR(h -> s       sb     )
     1.98525841E-02    2           4        -4   # BR(h -> c       cb     )
     7.65678838E-02    2          21        21   # BR(h -> g       g      )
     2.32507969E-03    2          22        22   # BR(h -> gam     gam    )
     1.79070071E-03    2          22        23   # BR(h -> Z       gam    )
     2.55820998E-01    2          24       -24   # BR(h -> W+      W-     )
     3.32099687E-02    2          23        23   # BR(h -> Z       Z      )
#
#         PDG            Width
DECAY        35     2.74786511E+01   # H decays
#          BR         NDA      ID1       ID2
     2.09852136E-01    2           5        -5   # BR(H -> b       bb     )
     3.94763845E-02    2         -15        15   # BR(H -> tau+    tau-   )
     1.39179092E-04    2         -13        13   # BR(H -> mu+     mu-    )
     8.88879474E-05    2           3        -3   # BR(H -> s       sb     )
     3.43001398E-07    2           4        -4   # BR(H -> c       cb     )
     3.38028457E-02    2           6        -6   # BR(H -> t       tb     )
     8.13055625E-06    2          21        21   # BR(H -> g       g      )
     7.73081690E-09    2          22        22   # BR(H -> gam     gam    )
     1.61985685E-08    2          23        22   # BR(H -> Z       gam    )
     1.26610900E-05    2          24       -24   # BR(H -> W+      W-     )
     6.31863240E-06    2          23        23   # BR(H -> Z       Z      )
     4.62919888E-05    2          25        25   # BR(H -> h       h      )
     3.27049956E-03    2     1000024  -1000024   # BR(H -> ~chi_1+ ~chi_1-)
     2.37333800E-01    2     1000024  -1000037   # BR(H -> ~chi_1+ ~chi_2-)
     2.37333800E-01    2     1000037  -1000024   # BR(H -> ~chi_2+ ~chi_1-)
     6.93946170E-04    2     1000022   1000022   # BR(H -> ~chi_10 ~chi_10)
     4.44120287E-04    2     1000023   1000023   # BR(H -> ~chi_20 ~chi_20)
     4.20025045E-06    2     1000022   1000023   # BR(H -> ~chi_10 ~chi_20)
     1.25529796E-01    2     1000022   1000025   # BR(H -> ~chi_10 ~chi_30)
     1.11928308E-01    2     1000023   1000025   # BR(H -> ~chi_20 ~chi_30)
     5.60917112E-06    2     1000002  -1000002   # BR(H -> ~u_L    ~u_L*  )
     5.60917112E-06    2     1000004  -1000004   # BR(H -> ~c_L    ~c_L*  )
     8.21170633E-06    2     1000001  -1000001   # BR(H -> ~d_L    ~d_L*  )
     3.42775143E-07    2     2000001  -2000001   # BR(H -> ~d_R    ~d_R*  )
     8.21170633E-06    2     1000003  -1000003   # BR(H -> ~s_L    ~s_L*  )
     3.42775143E-07    2     2000003  -2000003   # BR(H -> ~s_R    ~s_R*  )
#
#         PDG            Width
DECAY        36     2.74813690E+01   # A decays
#          BR         NDA      ID1       ID2
     2.09874928E-01    2           5        -5   # BR(A -> b       bb     )
     3.94730287E-02    2         -15        15   # BR(A -> tau+    tau-   )
     1.39167121E-04    2         -13        13   # BR(A -> mu+     mu-    )
     8.89222377E-05    2           3        -3   # BR(A -> s       sb     )
     3.44795635E-07    2           4        -4   # BR(A -> c       cb     )
     3.38813612E-02    2           6        -6   # BR(A -> t       tb     )
     4.00018998E-05    2          21        21   # BR(A -> g       g      )
     2.78782822E-08    2          22        22   # BR(A -> gam     gam    )
     4.58308842E-08    2          23        22   # BR(A -> Z       gam    )
     1.28352173E-05    2          23        25   # BR(A -> Z       h      )
     3.29300113E-03    2     1000024  -1000024   # BR(A -> ~chi_1+ ~chi_1-)
     2.37314842E-01    2     1000024  -1000037   # BR(A -> ~chi_1+ ~chi_2-)
     2.37314842E-01    2     1000037  -1000024   # BR(A -> ~chi_2+ ~chi_1-)
     5.10307127E-04    2     1000022   1000022   # BR(A -> ~chi_10 ~chi_10)
     6.30189270E-04    2     1000023   1000023   # BR(A -> ~chi_20 ~chi_20)
     1.19161993E-05    2     1000022   1000023   # BR(A -> ~chi_10 ~chi_20)
     1.13889419E-01    2     1000022   1000025   # BR(A -> ~chi_10 ~chi_30)
     1.23524820E-01    2     1000023   1000025   # BR(A -> ~chi_20 ~chi_30)
#
#         PDG            Width
DECAY        37     2.73520182E+01   # H+ decays
#          BR         NDA      ID1       ID2
     3.48693915E-04    2           4        -5   # BR(H+ -> c       bb     )
     3.96747881E-02    2         -15        16   # BR(H+ -> tau+    nu_tau )
     1.39878449E-04    2         -13        14   # BR(H+ -> mu+     nu_mu  )
     3.48693050E-06    2           2        -5   # BR(H+ -> u       bb     )
     4.47008908E-06    2           2        -3   # BR(H+ -> u       sb     )
     8.83172523E-05    2           4        -3   # BR(H+ -> c       sb     )
     2.40710131E-01    2           6        -5   # BR(H+ -> t       bb     )
     1.29166605E-05    2          24        25   # BR(H+ -> W+      h      )
     1.95174850E-13    2          24        36   # BR(H+ -> W+      A      )
     2.58572410E-04    2     1000024   1000022   # BR(H+ -> ~chi_1+ ~chi_10)
     3.09431009E-04    2     1000024   1000023   # BR(H+ -> ~chi_1+ ~chi_20)
     2.39454693E-01    2     1000024   1000025   # BR(H+ -> ~chi_1+ ~chi_30)
     2.41497815E-01    2     1000037   1000022   # BR(H+ -> ~chi_2+ ~chi_10)
     2.37469326E-01    2     1000037   1000023   # BR(H+ -> ~chi_2+ ~chi_20)
     1.37396706E-05    2     1000002  -1000001   # BR(H+ -> ~u_L    ~d_L*  )
     1.37396706E-05    2     1000004  -1000003   # BR(H+ -> ~c_L    ~s_L*  )
