#
#                              ======================
#                              | THE SUSYHIT OUTPUT |
#                              ======================
#
#
#              ------------------------------------------------------
#              |     This is the output of the SUSY-HIT package     |
#              |  created by A.Djouadi, M.Muehlleitner and M.Spira. |
#              |  In case of problems with SUSY-HIT email to        |
#              |           margarete.muehlleitner@cern.ch           |
#              |           michael.spira@psi.ch                     |
#              |           abdelhak.djouadi@cern.ch                 |
#              ------------------------------------------------------
#
#              ------------------------------------------------------
#              |  SUSY Les Houches Accord - MSSM Spectrum + Decays  |
#              |              based on the decay programs           |
#              |                                                    |
#              |                     SDECAY 1.3b                    |
#              |                                                    |
#              |  Authors: M.Muhlleitner, A.Djouadi and Y.Mambrini  |
#              |  Ref.:    Comput.Phys.Commun.168(2005)46           |
#              |           [hep-ph/0311167]                         |
#              |                                                    |
#              |                     HDECAY 3.4                     |
#              |                                                    |
#              |  By: A.Djouadi,J.Kalinowski,M.Muhlleitner,M.Spira  |
#              |  Ref.:    Comput.Phys.Commun.108(1998)56           |
#              |           [hep-ph/9704448]                         |
#              |                                                    |
#              |                                                    |
#              |  If not stated otherwise all DRbar couplings and   |
#              |  soft SUSY breaking masses are given at the scale  |
#              |  Q=  0.15620460E+04
#              |                                                    |
#              ------------------------------------------------------
#
#
BLOCK DCINFO  # Decay Program information
     1   SDECAY/HDECAY # decay calculator
     2   1.3b  /3.4    # version number
#
BLOCK SPINFO  # Spectrum calculator information
     1     SOFTSUSY    # spectrum calculator               
     2     3.4.0       # version number                    
#
BLOCK MODSEL  # Model selection
     1     0   #  nonUniversal                                     
#
BLOCK SMINPUTS  # Standard Model inputs
         1     1.27908970E+02   # alpha_em^-1(M_Z)^MSbar
         2     1.16637870E-05   # G_F [GeV^-2]
         3     1.18400000E-01   # alpha_S(M_Z)^MSbar
         4     9.11876000E+01   # M_Z pole mass
         5     4.18000000E+00   # mb(mb)^MSbar
         6     1.73200000E+02   # mt pole mass
         7     1.77700000E+00   # mtau pole mass
#
BLOCK MINPAR  # Input parameters - minimal models
         3     1.46600000E+01   # tanb                
#
BLOCK EXTPAR  # Input parameters - non-minimal models
         0    -1.00000000E+00   # Set                 
         1    -2.88572000E+03   # M_1(MX)             
         2    -2.15920000E+02   # M_2(MX)             
         3     2.98780000E+03   # M_3(MX)             
        11    -3.37228000E+03   # At(MX)              
        12     5.55060000E+02   # Ab(MX)              
        13     1.45672000E+03   # Atau(MX)            
        23     3.82672000E+03   # mu(MX)              
        26     1.02217000E+03   # mA(pole)            
        31     3.20782000E+03   # meL(MX)             
        32     3.20782000E+03   # mmuL(MX)            
        33     2.51500000E+03   # mtauL(MX)           
        34     3.51069000E+03   # meR(MX)             
        35     3.51069000E+03   # mmuR(MX)            
        36     2.92439000E+03   # mtauR(MX)           
        41     3.52011000E+03   # mqL1(MX)            
        42     3.52011000E+03   # mqL2(MX)            
        43     7.53140000E+02   # mqL3(MX)            
        44     3.77462000E+03   # muR(MX)             
        45     3.77462000E+03   # mcR(MX)             
        46     3.25925000E+03   # mtR(MX)             
        47     3.09565000E+03   # mdR(MX)             
        48     3.09565000E+03   # msR(MX)             
        49     3.88689000E+03   # mbR(MX)             
#
BLOCK MASS  # Mass Spectrum
# PDG code           mass       particle
        24     8.03748692E+01   # W+
        25     1.27190182E+02   # h
        35     1.02128884E+03   # H
        36     1.02217022E+03   # A
        37     1.02492406E+03   # H+
         5     4.81876030E+00   # b-quark pole mass calculated from mb(mb)_Msbar
   1000001     3.55382857E+03   # ~d_L
   2000001     3.13090583E+03   # ~d_R
   1000002     3.55308315E+03   # ~u_L
   2000002     3.79979977E+03   # ~u_R
   1000003     3.55382857E+03   # ~s_L
   2000003     3.13090583E+03   # ~s_R
   1000004     3.55308315E+03   # ~c_L
   2000004     3.79979977E+03   # ~c_R
   1000005     7.25833364E+02   # ~b_1
   2000005     3.90831523E+03   # ~b_2
   1000006     7.16614945E+02   # ~t_1
   2000006     3.24435318E+03   # ~t_2
   1000011     3.21494382E+03   # ~e_L
   2000011     3.51240826E+03   # ~e_R
   1000012     3.21363128E+03   # ~nu_eL
   1000013     3.21494382E+03   # ~mu_L
   2000013     3.51240826E+03   # ~mu_R
   1000014     3.21363128E+03   # ~nu_muL
   1000015     2.51994293E+03   # ~tau_1
   2000015     2.92602850E+03   # ~tau_2
   1000016     2.51916594E+03   # ~nu_tauL
   1000021     3.11087087E+03   # ~g
   1000022    -2.34456002E+02   # ~chi_10
   1000023    -2.90204339E+03   # ~chi_20
   1000025     3.85374405E+03   # ~chi_30
   1000035    -3.85425204E+03   # ~chi_40
   1000024     2.34616015E+02   # ~chi_1+
   1000037     3.85457195E+03   # ~chi_2+
#
BLOCK NMIX  # Neutralino Mixing Matrix
  1  1     4.54315449E-05   # N_11
  1  2     9.99787230E-01   # N_12
  1  3    -2.06217578E-02   # N_13
  1  4     4.86586192E-04   # N_14
  2  1     9.99513094E-01   # N_21
  2  2     4.66296921E-04   # N_22
  2  3     2.52417481E-02   # N_23
  2  4     1.83360824E-02   # N_24
  3  1     4.88916913E-03   # N_31
  3  2    -1.49262030E-02   # N_32
  3  3    -7.06959611E-01   # N_33
  3  4     7.07079496E-01   # N_34
  4  1    -3.08167026E-02   # N_41
  4  2     1.42297842E-02   # N_42
  4  3     7.06502446E-01   # N_43
  4  4     7.06896130E-01   # N_44
#
BLOCK UMIX  # Chargino Mixing Matrix U
  1  1     9.99574843E-01   # U_11
  1  2    -2.91570579E-02   # U_12
  2  1     2.91570579E-02   # U_21
  2  2     9.99574843E-01   # U_22
#
BLOCK VMIX  # Chargino Mixing Matrix V
  1  1    -9.99999759E-01   # V_11
  1  2     6.94032789E-04   # V_12
  2  1     6.94032789E-04   # V_21
  2  2     9.99999759E-01   # V_22
#
BLOCK STOPMIX  # Stop Mixing Matrix
  1  1     9.98577198E-01   # cos(theta_t)
  1  2     5.33252251E-02   # sin(theta_t)
  2  1    -5.33252251E-02   # -sin(theta_t)
  2  2     9.98577198E-01   # cos(theta_t)
#
BLOCK SBOTMIX  # Sbottom Mixing Matrix
  1  1     9.99972549E-01   # cos(theta_b)
  1  2     7.40953753E-03   # sin(theta_b)
  2  1    -7.40953753E-03   # -sin(theta_b)
  2  2     9.99972549E-01   # cos(theta_b)
#
BLOCK STAUMIX  # Stau Mixing Matrix
  1  1     9.99107063E-01   # cos(theta_tau)
  1  2     4.22501676E-02   # sin(theta_tau)
  2  1    -4.22501676E-02   # -sin(theta_tau)
  2  2     9.99107063E-01   # cos(theta_tau)
#
BLOCK ALPHA  # Higgs mixing
          -7.16680830E-02   # Mixing angle in the neutral Higgs boson sector
#
BLOCK HMIX Q=  1.56204600E+03  # DRbar Higgs Parameters
         1     3.86534583E+03   # mu(Q)MSSM           
         2     1.41146630E+01   # tan                 
         3     2.44390337E+02   # higgs               
         4     2.70101039E+06   # mA^2(Q)MSSM         
#
BLOCK GAUGE Q=  1.56204600E+03  # The gauge couplings
     1     3.62170923E-01   # gprime(Q) DRbar
     2     6.38746724E-01   # g(Q) DRbar
     3     1.02265529E+00   # g3(Q) DRbar
#
BLOCK AU Q=  1.56204600E+03  # The trilinear couplings
  1  1     0.00000000E+00   # A_u(Q) DRbar
  2  2     0.00000000E+00   # A_c(Q) DRbar
  3  3    -3.37227999E+03   # A_t(Q) DRbar
#
BLOCK AD Q=  1.56204600E+03  # The trilinear couplings
  1  1     0.00000000E+00   # A_d(Q) DRbar
  2  2     0.00000000E+00   # A_s(Q) DRbar
  3  3     5.55060001E+02   # A_b(Q) DRbar
#
BLOCK AE Q=  1.56204600E+03  # The trilinear couplings
  1  1     0.00000000E+00   # A_e(Q) DRbar
  2  2     0.00000000E+00   # A_mu(Q) DRbar
  3  3     1.45672000E+03   # A_tau(Q) DRbar
#
BLOCK Yu Q=  1.56204600E+03  # The Yukawa couplings
  1  1     0.00000000E+00   # y_u(Q) DRbar
  2  2     0.00000000E+00   # y_c(Q) DRbar
  3  3     8.28019026E-01   # y_t(Q) DRbar
#
BLOCK Yd Q=  1.56204600E+03  # The Yukawa couplings
  1  1     0.00000000E+00   # y_d(Q) DRbar
  2  2     0.00000000E+00   # y_s(Q) DRbar
  3  3     1.68376594E-01   # y_b(Q) DRbar
#
BLOCK Ye Q=  1.56204600E+03  # The Yukawa couplings
  1  1     0.00000000E+00   # y_e(Q) DRbar
  2  2     0.00000000E+00   # y_mu(Q) DRbar
  3  3     1.44413690E-01   # y_tau(Q) DRbar
#
BLOCK MSOFT Q=  1.56204600E+03  # The soft SUSY breaking masses at the scale Q
         1    -2.88572000E+03   # M_1(Q)              
         2    -2.15920000E+02   # M_2(Q)              
         3     2.98780000E+03   # M_3(Q)              
        21    -1.39047510E+07   # mH1^2(Q)            
        22    -1.49833500E+07   # mH2^2(Q)            
        31     3.20782000E+03   # meL(Q)              
        32     3.20782000E+03   # mmuL(Q)             
        33     2.51500000E+03   # mtauL(Q)            
        34     3.51069000E+03   # meR(Q)              
        35     3.51069000E+03   # mmuR(Q)             
        36     2.92439000E+03   # mtauR(Q)            
        41     3.52011000E+03   # mqL1(Q)             
        42     3.52011000E+03   # mqL2(Q)             
        43     7.53139978E+02   # mqL3(Q)             
        44     3.77462000E+03   # muR(Q)              
        45     3.77462000E+03   # mcR(Q)              
        46     3.25924999E+03   # mtR(Q)              
        47     3.09565000E+03   # mdR(Q)              
        48     3.09565000E+03   # msR(Q)              
        49     3.88689000E+03   # mbR(Q)              
#
Block HiggsBoundsInputHiggsCouplingsFermions
# ScalarNormEffCoupSq PseudoSNormEffCoupSq NP   IP1 IP2 IP2
    1.02665233E+00    0.00000000E+00        3  25   5   5  # h0-b-b eff. coupling^2, normalised to SM
    1.99197059E+02    0.00000000E+00        3  35   5   5  # H0-b-b eff. coupling^2, normalised to SM
    0.00000000E+00    1.99223712E+02        3  36   5   5  # A0-b-b eff. coupling^2, normalised to SM
#
    9.99866219E-01    0.00000000E+00        3  25   6   6  # h0-t-t eff. coupling^2, normalised to SM
    5.15326376E-03    0.00000000E+00        3  35   6   6  # H0-t-t eff. coupling^2, normalised to SM
    0.00000000E+00    5.01948283E-03        3  36   6   6  # A0-t-t eff. coupling^2, normalised to SM
#
    1.02665233E+00    0.00000000E+00        3  25  15  15  # h0-tau-tau eff. coupling^2, normalised to SM
    1.99197059E+02    0.00000000E+00        3  35  15  15  # H0-tau-tau eff. coupling^2, normalised to SM
    0.00000000E+00    1.99223712E+02        3  36  15  15  # A0-tau-tau eff. coupling^2, normalised to SM
#
Block HiggsBoundsInputHiggsCouplingsBosons
    9.99999120E-01        3  25  24  24  # h0-W-W eff. coupling^2, normalised to SM
    8.79767374E-07        3  35  24  24  # H0-W-W eff. coupling^2, normalised to SM
    0.00000000E+00        3  36  24  24  # A0-W-W eff. coupling^2, normalised to SM
#
    9.99999120E-01        3  25  23  23  # h0-Z-Z eff. coupling^2, normalised to SM
    8.79767374E-07        3  35  23  23  # H0-Z-Z eff. coupling^2, normalised to SM
    0.00000000E+00        3  36  23  23  # A0-Z-Z eff. coupling^2, normalised to SM
#
    8.80606716E-01        3  25  21  21  # h0-g-g eff. coupling^2, normalised to SM
    7.31172050E-05        3  35  21  21  # H0-g-g eff. coupling^2, normalised to SM
    2.82421259E-04        3  36  21  21  # A0-g-g eff. coupling^2, normalised to SM
#
    0.00000000E+00        3  25  25  23  # h0-h0-Z eff. coupling^2, normalised to SM
    0.00000000E+00        3  35  25  23  # H0-h0-Z eff. coupling^2, normalised to SM
    8.79767374E-07        3  36  25  23  # A0-h0-Z eff. coupling^2, normalised to SM
    0.00000000E+00        3  35  35  23  # H0-H0-Z eff. coupling^2, normalised to SM
    9.99999120E-01        3  36  35  23  # A0-H0-Z eff. coupling^2, normalised to SM
    0.00000000E+00        3  36  36  23  # A0-A0-Z eff. coupling^2, normalised to SM
#
    0.00000000E+00        4  25  21  21  23  # h0-g-g-Z eff. coupling^2, normalised to SM
    0.00000000E+00        4  35  21  21  23  # H0-g-g-Z eff. coupling^2, normalised to SM
    0.00000000E+00        4  36  21  21  23  # A0-g-g-Z eff. coupling^2, normalised to SM
#
#
#
#                             =================
#                             |The decay table|
#                             =================
#
# - The QCD corrections to the decays gluino -> squark  + quark
#                                     squark -> gaugino + quark_prime
#                                     squark -> squark_prime + Higgs
#                                     squark -> gluino  + quark
#   are included.
#
# - The multi-body decays for the inos, stops and sbottoms are included.
#
# - The loop induced decays for the gluino, neutralinos and stops
#   are included.
#
# - The SUSY decays of the top quark are included.
#
#
#         PDG            Width
DECAY         6     1.43757724E+00   # top decays
#          BR         NDA      ID1       ID2
     1.00000000E+00    2           5        24   # BR(t ->  b    W+)
#
#         PDG            Width
DECAY   1000021     1.05506378E+02   # gluino decays
#          BR         NDA      ID1       ID2
     2.51050664E-01    2     1000005        -5   # BR(~g -> ~b_1  bb)
     2.51050664E-01    2    -1000005         5   # BR(~g -> ~b_1* b )
     2.48949336E-01    2     1000006        -6   # BR(~g -> ~t_1  tb)
     2.48949336E-01    2    -1000006         6   # BR(~g -> ~t_1* t )
#
#         PDG            Width
DECAY   1000006     6.60713231E+00   # stop1 decays
#          BR         NDA      ID1       ID2
     3.00165834E-01    2     1000022         6   # BR(~t_1 -> ~chi_10 t )
     6.99834166E-01    2     1000024         5   # BR(~t_1 -> ~chi_1+ b )
#
#         PDG            Width
DECAY   2000006     1.97398259E+02   # stop2 decays
#          BR         NDA      ID1       ID2
     1.80365665E-04    2     1000022         6   # BR(~t_2 -> ~chi_10 t )
     1.25805424E-03    2     1000023         6   # BR(~t_2 -> ~chi_20 t )
     0.00000000E+00    2     1000025         6   # BR(~t_2 -> ~chi_30 t )
     3.62869933E-04    2     1000024         5   # BR(~t_2 -> ~chi_1+ b )
     1.32406175E-01    2     1000006        25   # BR(~t_2 -> ~t_1    h )
     1.15609464E-01    2     1000006        35   # BR(~t_2 -> ~t_1    H )
     1.17120043E-01    2     1000006        36   # BR(~t_2 -> ~t_1    A )
     2.32941845E-01    2     1000005        37   # BR(~t_2 -> ~b_1    H+)
     1.35777574E-01    2     1000006        23   # BR(~t_2 -> ~t_1    Z )
     2.64343609E-01    2     1000005        24   # BR(~t_2 -> ~b_1    W+)
#
#         PDG            Width
DECAY   1000005     6.43262889E+00   # sbottom1 decays
#          BR         NDA      ID1       ID2
     3.67228224E-01    2     1000022         5   # BR(~b_1 -> ~chi_10 b )
     6.32771776E-01    2    -1000024         6   # BR(~b_1 -> ~chi_1- t )
#
#         PDG            Width
DECAY   2000005     3.35626851E+01   # sbottom2 decays
#          BR         NDA      ID1       ID2
     3.92412274E-08    2     1000022         5   # BR(~b_2 -> ~chi_10 b )
     1.35814697E-02    2     1000023         5   # BR(~b_2 -> ~chi_20 b )
     2.52327142E-05    2     1000025         5   # BR(~b_2 -> ~chi_30 b )
     2.45131539E-05    2     1000035         5   # BR(~b_2 -> ~chi_40 b )
     7.29556067E-08    2    -1000024         6   # BR(~b_2 -> ~chi_1- t )
     8.67484956E-01    2     1000021         5   # BR(~b_2 -> ~g      b )
     3.02011325E-02    2     1000005        25   # BR(~b_2 -> ~b_1    h )
     1.32272288E-03    2     1000005        35   # BR(~b_2 -> ~b_1    H )
     1.31082444E-03    2     1000005        36   # BR(~b_2 -> ~b_1    A )
     2.61861238E-03    2     1000006       -37   # BR(~b_2 -> ~t_1    H-)
     2.82926516E-02    2     1000005        23   # BR(~b_2 -> ~b_1    Z )
     5.51326451E-02    2     1000006       -24   # BR(~b_2 -> ~t_1    W-)
     5.12712703E-06    2     2000006       -24   # BR(~b_2 -> ~t_2    W-)
#
#         PDG            Width
DECAY   1000002     5.48589829E+01   # sup_L decays
#          BR         NDA      ID1       ID2
     2.47563330E-01    2     1000022         2   # BR(~u_L -> ~chi_10 u)
     1.02783398E-03    2     1000023         2   # BR(~u_L -> ~chi_20 u)
     4.95323286E-01    2     1000024         1   # BR(~u_L -> ~chi_1+ d)
     2.56085549E-01    2     1000021         2   # BR(~u_L -> ~g      u)
#
#         PDG            Width
DECAY   2000002     3.14735858E+01   # sup_R decays
#          BR         NDA      ID1       ID2
     5.45598951E-10    2     1000022         2   # BR(~u_R -> ~chi_10 u)
     4.74578707E-02    2     1000023         2   # BR(~u_R -> ~chi_20 u)
     9.52542129E-01    2     1000021         2   # BR(~u_R -> ~g      u)
#
#         PDG            Width
DECAY   1000001     5.48853503E+01   # sdown_L decays
#          BR         NDA      ID1       ID2
     2.47488663E-01    2     1000022         1   # BR(~d_L -> ~chi_10 d)
     1.01914103E-03    2     1000023         1   # BR(~d_L -> ~chi_20 d)
     4.94770165E-01    2    -1000024         2   # BR(~d_L -> ~chi_1- u)
     2.56722031E-01    2     1000021         1   # BR(~d_L -> ~g      d)
#
#         PDG            Width
DECAY   2000001     1.12753752E+00   # sdown_R decays
#           BR         NDA      ID1       ID2
     3.14978801E-09    2     1000022         1   # BR(~d_R -> ~chi_10 d)
#           BR         NDA      ID1       ID2       ID3
     3.13089360E-01    3        1       -5        1000005   # BR(~d_R -> d  bb  ~b_1)
     1.89058011E-01    3        1       5        -1000005   # BR(~d_R -> d  b  ~b_1*)
     3.07448750E-01    3        1       -6        1000006   # BR(~d_R -> d  tb  ~t_1)
     1.84925110E-01    3        1       6        -1000006   # BR(~d_R -> d  t  ~t_1*)
     1.22213229E-03    3        1       -15        1000015   # BR(~d_R -> d  tau+  ~tau_1-)
     1.23579036E-03    3        1       15        -1000015   # BR(~d_R -> d  tau-  ~tau_1+)
     3.61788405E-07    3        1       -15        2000015   # BR(~d_R -> d  tau+  ~tau_2-)
     3.29186385E-07    3        1       15        -2000015   # BR(~d_R -> d  tau-  ~tau_2+)
     1.23312970E-03    3        1       -16        1000016   # BR(~d_R -> d  nu_taub  ~nu_tau1)
     1.22603460E-03    3        1       16        -1000016   # BR(~d_R -> d  nu_tau  ~nu_tau1*)
     2.53800867E-05    3        1       23        1000022   # BR(~d_R -> d  Z  ~chi_10)
     1.94698621E-05    3        1       25        1000022   # BR(~d_R -> d  h  ~chi_10)
     9.04271460E-05    3        1       35        1000022   # BR(~d_R -> d  H  ~chi_10)
     5.39848999E-05    3        1       36        1000022   # BR(~d_R -> d  A  ~chi_10)
     6.05372318E-07    3        1       23        1000023   # BR(~d_R -> d  Z  ~chi_20)
     8.70347980E-10    3        1       25        1000023   # BR(~d_R -> d  h  ~chi_20)
     4.15338730E-05    3        1       -24        1000024   # BR(~d_R -> d  W-  ~chi_1+)
     4.13467395E-05    3        1       24        -1000024   # BR(~d_R -> d  W+  ~chi_1-)
     1.45165901E-04    3        1       -37        1000024   # BR(~d_R -> d  H-  ~chi_1+)
     1.43072845E-04    3        1       37        -1000024   # BR(~d_R -> d  H+  ~chi_1-)
#
#         PDG            Width
DECAY   1000004     5.36764347E+01   # scharm_L decays
#          BR         NDA      ID1       ID2
     2.66202043E-01    2     1000022         4   # BR(~c_L -> ~chi_10 c)
     1.06764363E-03    2     1000023         4   # BR(~c_L -> ~chi_20 c)
     5.32615154E-01    2     1000024         3   # BR(~c_L -> ~chi_1+ s)
     2.00115159E-01    2     1000021         4   # BR(~c_L -> ~g      c)
#
#         PDG            Width
DECAY   2000004     2.44515585E+01   # scharm_R decays
#          BR         NDA      ID1       ID2
     7.38347334E-10    2     1000022         4   # BR(~c_R -> ~chi_10 c)
     6.25313628E-02    2     1000023         4   # BR(~c_R -> ~chi_20 c)
     9.37468636E-01    2     1000021         4   # BR(~c_R -> ~g      c)
#
#         PDG            Width
DECAY   1000003     5.36922992E+01   # sstrange_L decays
#          BR         NDA      ID1       ID2
     2.66171161E-01    2     1000022         3   # BR(~s_L -> ~chi_10 s)
     1.05884522E-03    2     1000023         3   # BR(~s_L -> ~chi_20 s)
     5.32118851E-01    2    -1000024         4   # BR(~s_L -> ~chi_1- c)
     2.00651143E-01    2     1000021         3   # BR(~s_L -> ~g      s)
#
#         PDG            Width
DECAY   2000003     1.12506751E+00   # sstrange_R decays
#           BR         NDA      ID1       ID2
     3.29356887E-09    2     1000022         3   # BR(~s_R -> ~chi_10 s)
#           BR         NDA      ID1       ID2       ID3
     3.13696730E-01    3        3       -5        1000005   # BR(~s_R -> s  bb  ~b_1)
     1.89473073E-01    3        3       5        -1000005   # BR(~s_R -> s  b  ~b_1*)
     3.06114962E-01    3        3       -6        1000006   # BR(~s_R -> s  tb  ~t_1)
     1.85224439E-01    3        3       6        -1000006   # BR(~s_R -> s  t  ~t_1*)
     1.22481538E-03    3        3       -15        1000015   # BR(~s_R -> s  tau+  ~tau_1-)
     1.23850345E-03    3        3       15        -1000015   # BR(~s_R -> s  tau-  ~tau_1+)
     3.62582685E-07    3        3       -15        2000015   # BR(~s_R -> s  tau+  ~tau_2-)
     3.29677993E-07    3        3       15        -2000015   # BR(~s_R -> s  tau-  ~tau_2+)
     1.23583695E-03    3        3       -16        1000016   # BR(~s_R -> s  nu_taub  ~nu_tau1)
     1.22872626E-03    3        3       16        -1000016   # BR(~s_R -> s  nu_tau  ~nu_tau1*)
     2.54358069E-05    3        3       23        1000022   # BR(~s_R -> s  Z  ~chi_10)
     1.95126068E-05    3        3       25        1000022   # BR(~s_R -> s  h  ~chi_10)
     9.06256724E-05    3        3       35        1000022   # BR(~s_R -> s  H  ~chi_10)
     5.41034197E-05    3        3       36        1000022   # BR(~s_R -> s  A  ~chi_10)
     6.06719145E-07    3        3       23        1000023   # BR(~s_R -> s  Z  ~chi_20)
     8.72240988E-10    3        3       25        1000023   # BR(~s_R -> s  h  ~chi_20)
     4.16250575E-05    3        3       -24        1000024   # BR(~s_R -> s  W-  ~chi_1+)
     4.14375132E-05    3        3       24        -1000024   # BR(~s_R -> s  W+  ~chi_1-)
     1.45484602E-04    3        3       -37        1000024   # BR(~s_R -> s  H-  ~chi_1+)
     1.43386951E-04    3        3       37        -1000024   # BR(~s_R -> s  H+  ~chi_1-)
#
#         PDG            Width
DECAY   1000011     3.88443702E+01   # selectron_L decays
#          BR         NDA      ID1       ID2
     3.32206860E-01    2     1000022        11   # BR(~e_L -> ~chi_10 e-)
     3.70559433E-03    2     1000023        11   # BR(~e_L -> ~chi_20 e-)
     6.64087546E-01    2    -1000024        12   # BR(~e_L -> ~chi_1- nu_e)
#
#         PDG            Width
DECAY   2000011     1.84436744E+00   # selectron_R decays
#           BR         NDA      ID1       ID2
     2.03320451E-08    2     1000022        11   # BR(~e_R -> ~chi_10 e-)
     9.99999980E-01    2     1000023        11   # BR(~e_R -> ~chi_20 e-)
#
#         PDG            Width
DECAY   1000013     3.88443702E+01   # smuon_L decays
#          BR         NDA      ID1       ID2
     3.32206860E-01    2     1000022        13   # BR(~mu_L -> ~chi_10 mu-)
     3.70559410E-03    2     1000023        13   # BR(~mu_L -> ~chi_20 mu-)
     6.64087546E-01    2    -1000024        14   # BR(~mu_L -> ~chi_1- nu_mu)
#
#         PDG            Width
DECAY   2000013     1.84436741E+00   # smuon_R decays
#           BR         NDA      ID1       ID2
     2.03320455E-08    2     1000022        13   # BR(~mu_R -> ~chi_10 mu-)
     9.99999980E-01    2     1000023        13   # BR(~mu_R -> ~chi_20 mu-)
#
#         PDG            Width
DECAY   1000015     3.00942272E+01   # stau_1 decays
#          BR         NDA      ID1       ID2
     3.33454333E-01    2     1000022        15   # BR(~tau_1 -> ~chi_10  tau-)
     6.66545667E-01    2    -1000024        16   # BR(~tau_1 -> ~chi_1-  nu_tau)
#
#         PDG            Width
DECAY   2000015     9.79609294E-01   # stau_2 decays
#          BR         NDA      ID1       ID2
     1.52144755E-02    2     1000022        15   # BR(~tau_2 -> ~chi_10  tau-)
     4.15070350E-03    2     1000023        15   # BR(~tau_2 -> ~chi_20  tau-)
     3.04111141E-02    2    -1000024        16   # BR(~tau_2 -> ~chi_1-  nu_tau)
     4.67944871E-01    2     1000016       -24   # BR(~tau_2 -> ~nu_tauL W-)
     2.48015933E-01    2     1000015        25   # BR(~tau_2 -> ~tau_1   h)
     2.34262903E-01    2     1000015        23   # BR(~tau_2 -> ~tau_1   Z)
#
#         PDG            Width
DECAY   1000012     3.88472691E+01   # snu_eL decays
#          BR         NDA      ID1       ID2
     3.32009333E-01    2     1000022        12   # BR(~nu_eL -> ~chi_10 nu_e)
     3.66514011E-03    2     1000023        12   # BR(~nu_eL -> ~chi_20 nu_e)
     6.64325527E-01    2     1000024        11   # BR(~nu_eL -> ~chi_1+ e-)
#
#         PDG            Width
DECAY   1000014     3.88472690E+01   # snu_muL decays
#          BR         NDA      ID1       ID2
     3.32009333E-01    2     1000022        14   # BR(~nu_muL -> ~chi_10 nu_mu)
     3.66514012E-03    2     1000023        14   # BR(~nu_muL -> ~chi_20 nu_mu)
     6.64325527E-01    2     1000024        13   # BR(~nu_muL -> ~chi_1+ mu-)
#
#         PDG            Width
DECAY   1000016     3.01381024E+01   # snu_tauL decays
#          BR         NDA      ID1       ID2
     3.33222906E-01    2     1000022        16   # BR(~nu_tauL -> ~chi_10 nu_tau)
     6.66777094E-01    2     1000024        15   # BR(~nu_tauL -> ~chi_1+ tau-)
#
#         PDG            Width
DECAY   1000024     3.06606340E-15   # chargino1+ decays
#           BR         NDA      ID1       ID2       ID3
     1.99938750E-02    3     1000022       -11        12   # BR(~chi_1+ -> ~chi_10 e+   nu_e)
     1.93765450E-03    3     1000022       -13        14   # BR(~chi_1+ -> ~chi_10 mu+  nu_mu)
     9.78068470E-01    2     1000022       211             # BR(~chi_1+ -> ~chi_10 pi+)
#
#         PDG            Width
DECAY   1000037     1.28462984E+02   # chargino2+ decays
#          BR         NDA      ID1       ID2
     4.03812220E-09    2     1000002        -1   # BR(~chi_2+ -> ~u_L     db)
     7.09392974E-06    2    -1000001         2   # BR(~chi_2+ -> ~d_L*    u )
     4.03811898E-09    2     1000004        -3   # BR(~chi_2+ -> ~c_L     sb)
     7.09383877E-06    2    -1000003         4   # BR(~chi_2+ -> ~s_L*     c )
     2.51998945E-02    2     1000006        -5   # BR(~chi_2+ -> ~t_1     bb)
     5.20353875E-02    2     2000006        -5   # BR(~chi_2+ -> ~t_2     bb)
     5.69039889E-01    2    -1000005         6   # BR(~chi_2+ -> ~b_1*    t )
     5.45336717E-09    2     1000012       -11   # BR(~chi_2+ -> ~nu_eL   e+  )
     5.45336717E-09    2     1000014       -13   # BR(~chi_2+ -> ~nu_muL mu+ )
     2.04105945E-03    2     1000016       -15   # BR(~chi_2+ -> ~nu_tau1 tau+)
     9.58899053E-06    2    -1000011        12   # BR(~chi_2+ -> ~e_L+    nu_e)
     9.58899053E-06    2    -1000013        14   # BR(~chi_2+ -> ~mu_L+   nu_mu)
     1.53114087E-05    2    -1000015        16   # BR(~chi_2+ -> ~tau_1+  nu_tau)
     1.12702074E-03    2    -2000015        16   # BR(~chi_2+ -> ~tau_2+  nu_tau)
     6.04189376E-02    2     1000024        23   # BR(~chi_2+ -> ~chi_1+  Z )
     5.88741291E-02    2     1000022        24   # BR(~chi_2+ -> ~chi_10  W+)
     1.09728728E-02    2     1000023        24   # BR(~chi_2+ -> ~chi_20  W+)
     5.96487781E-02    2     1000024        25   # BR(~chi_2+ -> ~chi_1+  h )
     5.35406741E-02    2     1000024        35   # BR(~chi_2+ -> ~chi_1+  H )
     5.35128917E-02    2     1000024        36   # BR(~chi_2+ -> ~chi_1+  A )
     5.35397695E-02    2     1000022        37   # BR(~chi_2+ -> ~chi_10  H+)
#
#         PDG            Width
DECAY   1000022     0.00000000E+00   # neutralino1 decays
#
#         PDG            Width
DECAY   1000023     2.76213416E+00   # neutralino2 decays
#          BR         NDA      ID1       ID2
     7.84723362E-04    2     1000022        23   # BR(~chi_20 -> ~chi_10   Z )
     1.24749339E-03    2     1000024       -24   # BR(~chi_20 -> ~chi_1+   W-)
     1.24749339E-03    2    -1000024        24   # BR(~chi_20 -> ~chi_1-   W+)
     5.82122946E-04    2     1000022        25   # BR(~chi_20 -> ~chi_10   h )
     2.80608856E-03    2     1000022        35   # BR(~chi_20 -> ~chi_10   H )
     1.68458934E-03    2     1000022        36   # BR(~chi_20 -> ~chi_10   A )
     4.48329536E-03    2     1000024       -37   # BR(~chi_20 -> ~chi_1+   H-)
     4.48329536E-03    2    -1000024        37   # BR(~chi_20 -> ~chi_1-   H+)
     2.07508251E-01    2     1000006        -6   # BR(~chi_20 -> ~t_1      tb)
     2.07508251E-01    2    -1000006         6   # BR(~chi_20 -> ~t_1*     t )
     2.00481069E-01    2     1000005        -5   # BR(~chi_20 -> ~b_1      bb)
     2.00481069E-01    2    -1000005         5   # BR(~chi_20 -> ~b_1*     b )
     4.18256371E-02    2     1000015       -15   # BR(~chi_20 -> ~tau_1-   tau+)
     4.18256371E-02    2    -1000015        15   # BR(~chi_20 -> ~tau_1+   tau-)
     4.15254920E-02    2     1000016       -16   # BR(~chi_20 -> ~nu_tau1  nu_taub)
     4.15254920E-02    2    -1000016        16   # BR(~chi_20 -> ~nu_tau1* nu_tau )
#
#         PDG            Width
DECAY   1000025     1.28418142E+02   # neutralino3 decays
#          BR         NDA      ID1       ID2
     2.87950476E-02    2     1000022        23   # BR(~chi_30 -> ~chi_10   Z )
     1.09211219E-02    2     1000023        23   # BR(~chi_30 -> ~chi_20   Z )
     5.88862184E-02    2     1000024       -24   # BR(~chi_30 -> ~chi_1+   W-)
     5.88862184E-02    2    -1000024        24   # BR(~chi_30 -> ~chi_1-   W+)
     3.04863888E-02    2     1000022        25   # BR(~chi_30 -> ~chi_10   h )
     1.95684016E-02    2     1000022        35   # BR(~chi_30 -> ~chi_10   H )
     3.38549547E-02    2     1000022        36   # BR(~chi_30 -> ~chi_10   A )
     2.87044929E-04    2     1000023        25   # BR(~chi_30 -> ~chi_20   h )
     5.34899335E-02    2     1000024       -37   # BR(~chi_30 -> ~chi_1+   H-)
     5.34899335E-02    2    -1000024        37   # BR(~chi_30 -> ~chi_1-   H+)
     8.18028454E-07    2     1000002        -2   # BR(~chi_30 -> ~u_L      ub)
     8.18028454E-07    2    -1000002         2   # BR(~chi_30 -> ~u_L*     u )
     2.11002239E-09    2     2000002        -2   # BR(~chi_30 -> ~u_R      ub)
     2.11002239E-09    2    -2000002         2   # BR(~chi_30 -> ~u_R*     u )
     1.04334081E-06    2     1000001        -1   # BR(~chi_30 -> ~d_L      db)
     1.04334081E-06    2    -1000001         1   # BR(~chi_30 -> ~d_L*     d )
     7.09528393E-08    2     2000001        -1   # BR(~chi_30 -> ~d_R      db)
     7.09528393E-08    2    -2000001         1   # BR(~chi_30 -> ~d_R*     d )
     8.18017958E-07    2     1000004        -4   # BR(~chi_30 -> ~c_L      cb)
     8.18017958E-07    2    -1000004         4   # BR(~chi_30 -> ~c_L*     c )
     2.10918566E-09    2     2000004        -4   # BR(~chi_30 -> ~c_R      cb)
     2.10918566E-09    2    -2000004         4   # BR(~chi_30 -> ~c_R*     c )
     1.04334081E-06    2     1000003        -3   # BR(~chi_30 -> ~s _L      sb)
     1.04334081E-06    2    -1000003         3   # BR(~chi_30 -> ~s _L*     s )
     7.09528393E-08    2     2000003        -3   # BR(~chi_30 -> ~s _R      sb)
     7.09528393E-08    2    -2000003         3   # BR(~chi_30 -> ~s _R*     s )
     2.87938005E-01    2     1000006        -6   # BR(~chi_30 -> ~t_1      tb)
     2.87938005E-01    2    -1000006         6   # BR(~chi_30 -> ~t_1*     t )
     2.43037904E-02    2     2000006        -6   # BR(~chi_30 -> ~t_2      tb)
     2.43037904E-02    2    -2000006         6   # BR(~chi_30 -> ~t_2*     t )
     1.18325173E-02    2     1000005        -5   # BR(~chi_30 -> ~b_1      bb)
     1.18325173E-02    2    -1000005         5   # BR(~chi_30 -> ~b_1*     b )
     8.31574295E-07    2     1000011       -11   # BR(~chi_30 -> ~e_L-     e+)
     8.31574295E-07    2    -1000011        11   # BR(~chi_30 -> ~e_L+     e-)
     5.36534293E-08    2     2000011       -11   # BR(~chi_30 -> ~e_R-     e+)
     5.36534293E-08    2    -2000011        11   # BR(~chi_30 -> ~e_R+     e-)
     8.31574295E-07    2     1000013       -13   # BR(~chi_30 -> ~mu_L-    mu+)
     8.31574295E-07    2    -1000013        13   # BR(~chi_30 -> ~mu_L+    mu-)
     5.36534293E-08    2     2000013       -13   # BR(~chi_30 -> ~mu_R-    mu+)
     5.36534293E-08    2    -2000013        13   # BR(~chi_30 -> ~mu_R+    mu-)
     1.01568354E-03    2     1000015       -15   # BR(~chi_30 -> ~tau_1-   tau+)
     1.01568354E-03    2    -1000015        15   # BR(~chi_30 -> ~tau_1+   tau-)
     5.61936773E-04    2     2000015       -15   # BR(~chi_30 -> ~tau_2-   tau+)
     5.61936773E-04    2    -2000015        15   # BR(~chi_30 -> ~tau_2+   tau-)
     1.76989928E-06    2     1000012       -12   # BR(~chi_30 -> ~nu_eL    nu_eb)
     1.76989928E-06    2    -1000012        12   # BR(~chi_30 -> ~nu_eL*   nu_e )
     1.76989928E-06    2     1000014       -14   # BR(~chi_30 -> ~nu_muL   nu_mub)
     1.76989928E-06    2    -1000014        14   # BR(~chi_30 -> ~nu_muL*  nu_mu )
     6.25579950E-06    2     1000016       -16   # BR(~chi_30 -> ~nu_tau1  nu_taub)
     6.25579950E-06    2    -1000016        16   # BR(~chi_30 -> ~nu_tau1* nu_tau )
#
#         PDG            Width
DECAY   1000035     1.27822935E+02   # neutralino4 decays
#          BR         NDA      ID1       ID2
     3.17788091E-02    2     1000022        23   # BR(~chi_40 -> ~chi_10   Z )
     2.82189014E-04    2     1000023        23   # BR(~chi_40 -> ~chi_20   Z )
     5.91632986E-02    2     1000024       -24   # BR(~chi_40 -> ~chi_1+   W-)
     5.91632986E-02    2    -1000024        24   # BR(~chi_40 -> ~chi_1-   W+)
     2.93173527E-02    2     1000022        25   # BR(~chi_40 -> ~chi_10   h )
     3.40135419E-02    2     1000022        35   # BR(~chi_40 -> ~chi_10   H )
     1.96563562E-02    2     1000022        36   # BR(~chi_40 -> ~chi_10   A )
     1.10466373E-02    2     1000023        25   # BR(~chi_40 -> ~chi_20   h )
     5.36316673E-02    2     1000024       -37   # BR(~chi_40 -> ~chi_1+   H-)
     5.36316673E-02    2    -1000024        37   # BR(~chi_40 -> ~chi_1-   H+)
     2.97057918E-07    2     1000002        -2   # BR(~chi_40 -> ~u_L      ub)
     2.97057918E-07    2    -1000002         2   # BR(~chi_40 -> ~u_L*     u )
     8.57537914E-08    2     2000002        -2   # BR(~chi_40 -> ~u_R      ub)
     8.57537914E-08    2    -2000002         2   # BR(~chi_40 -> ~u_R*     u )
     1.68310434E-06    2     1000001        -1   # BR(~chi_40 -> ~d_L      db)
     1.68310434E-06    2    -1000001         1   # BR(~chi_40 -> ~d_L*     d )
     2.83520225E-06    2     2000001        -1   # BR(~chi_40 -> ~d_R      db)
     2.83520225E-06    2    -2000001         1   # BR(~chi_40 -> ~d_R*     d )
     2.97054119E-07    2     1000004        -4   # BR(~chi_40 -> ~c_L      cb)
     2.97054119E-07    2    -1000004         4   # BR(~chi_40 -> ~c_L*     c )
     8.57204081E-08    2     2000004        -4   # BR(~chi_40 -> ~c_R      cb)
     8.57204081E-08    2    -2000004         4   # BR(~chi_40 -> ~c_R*     c )
     1.68310434E-06    2     1000003        -3   # BR(~chi_40 -> ~s _L      sb)
     1.68310434E-06    2    -1000003         3   # BR(~chi_40 -> ~s _L*     s )
     2.83520225E-06    2     2000003        -3   # BR(~chi_40 -> ~s _R      sb)
     2.83520225E-06    2    -2000003         3   # BR(~chi_40 -> ~s _R*     s )
     2.84859511E-01    2     1000006        -6   # BR(~chi_40 -> ~t_1      tb)
     2.84859511E-01    2    -1000006         6   # BR(~chi_40 -> ~t_1*     t )
     2.57619214E-02    2     2000006        -6   # BR(~chi_40 -> ~t_2      tb)
     2.57619214E-02    2    -2000006         6   # BR(~chi_40 -> ~t_2*     t )
     1.18979894E-02    2     1000005        -5   # BR(~chi_40 -> ~b_1      bb)
     1.18979894E-02    2    -1000005         5   # BR(~chi_40 -> ~b_1*     b )
     5.95729805E-08    2     1000011       -11   # BR(~chi_40 -> ~e_L-     e+)
     5.95729805E-08    2    -1000011        11   # BR(~chi_40 -> ~e_L+     e-)
     2.14732199E-06    2     2000011       -11   # BR(~chi_40 -> ~e_R-     e+)
     2.14732199E-06    2    -2000011        11   # BR(~chi_40 -> ~e_R+     e-)
     5.95729805E-08    2     1000013       -13   # BR(~chi_40 -> ~mu_L-    mu+)
     5.95729805E-08    2    -1000013        13   # BR(~chi_40 -> ~mu_L+    mu-)
     2.14732199E-06    2     2000013       -13   # BR(~chi_40 -> ~mu_R-    mu+)
     2.14732199E-06    2    -2000013        13   # BR(~chi_40 -> ~mu_R+    mu-)
     1.01142037E-03    2     1000015       -15   # BR(~chi_40 -> ~tau_1-   tau+)
     1.01142037E-03    2    -1000015        15   # BR(~chi_40 -> ~tau_1+   tau-)
     5.80929773E-04    2     2000015       -15   # BR(~chi_40 -> ~tau_2-   tau+)
     5.80929773E-04    2    -2000015        15   # BR(~chi_40 -> ~tau_2+   tau-)
     5.71318025E-06    2     1000012       -12   # BR(~chi_40 -> ~nu_eL    nu_eb)
     5.71318025E-06    2    -1000012        12   # BR(~chi_40 -> ~nu_eL*   nu_e )
     5.71318025E-06    2     1000014       -14   # BR(~chi_40 -> ~nu_muL   nu_mub)
     5.71318025E-06    2    -1000014        14   # BR(~chi_40 -> ~nu_muL*  nu_mu )
     2.01771823E-05    2     1000016       -16   # BR(~chi_40 -> ~nu_tau1  nu_taub)
     2.01771823E-05    2    -1000016        16   # BR(~chi_40 -> ~nu_tau1* nu_tau )
#
#         PDG            Width
DECAY        25     4.98457562E-03   # h decays
#          BR         NDA      ID1       ID2
     6.15739393E-01    2           5        -5   # BR(h -> b       bb     )
     5.42340396E-02    2         -15        15   # BR(h -> tau+    tau-   )
     1.91956519E-04    2         -13        13   # BR(h -> mu+     mu-    )
     2.08106934E-04    2           3        -3   # BR(h -> s       sb     )
     1.76416879E-02    2           4        -4   # BR(h -> c       cb     )
     6.70881448E-02    2          21        21   # BR(h -> g       g      )
     2.03499512E-03    2          22        22   # BR(h -> gam     gam    )
     1.51591661E-03    2          22        23   # BR(h -> Z       gam    )
     2.13828468E-01    2          24       -24   # BR(h -> W+      W-     )
     2.75172908E-02    2          23        23   # BR(h -> Z       Z      )
#
#         PDG            Width
DECAY        35     3.09565677E+00   # H decays
#          BR         NDA      ID1       ID2
     7.86456377E-01    2           5        -5   # BR(H -> b       bb     )
     1.37214675E-01    2         -15        15   # BR(H -> tau+    tau-   )
     4.84325246E-04    2         -13        13   # BR(H -> mu+     mu-    )
     2.74963721E-04    2           3        -3   # BR(H -> s       sb     )
     8.13316029E-07    2           4        -4   # BR(H -> c       cb     )
     7.19064305E-02    2           6        -6   # BR(H -> t       tb     )
     2.00705473E-04    2          21        21   # BR(H -> g       g      )
     2.60575214E-07    2          22        22   # BR(H -> gam     gam    )
     1.08486000E-07    2          23        22   # BR(H -> Z       gam    )
     9.40183316E-05    2          24       -24   # BR(H -> W+      W-     )
     4.64486212E-05    2          23        23   # BR(H -> Z       Z      )
     8.41977382E-04    2          25        25   # BR(H -> h       h      )
     1.65229548E-03    2     1000024  -1000024   # BR(H -> ~chi_1+ ~chi_1-)
     8.26600919E-04    2     1000022   1000022   # BR(H -> ~chi_10 ~chi_10)
#
#         PDG            Width
DECAY        36     3.11396584E+00   # A decays
#          BR         NDA      ID1       ID2
     7.82666723E-01    2           5        -5   # BR(A -> b       bb     )
     1.36545474E-01    2         -15        15   # BR(A -> tau+    tau-   )
     4.81957406E-04    2         -13        13   # BR(A -> mu+     mu-    )
     2.73686416E-04    2           3        -3   # BR(A -> s       sb     )
     7.95324840E-07    2           4        -4   # BR(A -> c       cb     )
     7.63968816E-02    2           6        -6   # BR(A -> t       tb     )
     3.93279824E-04    2          21        21   # BR(A -> g       g      )
     3.85177324E-07    2          22        22   # BR(A -> gam     gam    )
     2.54680443E-07    2          23        22   # BR(A -> Z       gam    )
     9.21438395E-05    2          23        25   # BR(A -> Z       h      )
     2.09885665E-03    2     1000024  -1000024   # BR(A -> ~chi_1+ ~chi_1-)
     1.04956149E-03    2     1000022   1000022   # BR(A -> ~chi_10 ~chi_10)
#
#         PDG            Width
DECAY        37     2.50184378E+00   # H+ decays
#          BR         NDA      ID1       ID2
     1.25934007E-03    2           4        -5   # BR(H+ -> c       bb     )
     1.70411714E-01    2         -15        16   # BR(H+ -> tau+    nu_tau )
     6.01493280E-04    2         -13        14   # BR(H+ -> mu+     nu_mu  )
     1.25932703E-05    2           2        -5   # BR(H+ -> u       bb     )
     1.70094221E-05    2           2        -3   # BR(H+ -> u       sb     )
     3.35744939E-04    2           4        -3   # BR(H+ -> c       sb     )
     8.27245792E-01    2           6        -5   # BR(H+ -> t       bb     )
     1.16312324E-04    2          24        25   # BR(H+ -> W+      h      )
     8.30469607E-11    2          24        36   # BR(H+ -> W+      A      )
     4.94318836E-13    2     1000024   1000022   # BR(H+ -> ~chi_1+ ~chi_10)
