#
#                              ======================
#                              | THE SUSYHIT OUTPUT |
#                              ======================
#
#
#              ------------------------------------------------------
#              |     This is the output of the SUSY-HIT package     |
#              |  created by A.Djouadi, M.Muehlleitner and M.Spira. |
#              |  In case of problems with SUSY-HIT email to        |
#              |           margarete.muehlleitner@cern.ch           |
#              |           michael.spira@psi.ch                     |
#              |           abdelhak.djouadi@cern.ch                 |
#              ------------------------------------------------------
#
#              ------------------------------------------------------
#              |  SUSY Les Houches Accord - MSSM Spectrum + Decays  |
#              |              based on the decay programs           |
#              |                                                    |
#              |                     SDECAY 1.3b                    |
#              |                                                    |
#              |  Authors: M.Muhlleitner, A.Djouadi and Y.Mambrini  |
#              |  Ref.:    Comput.Phys.Commun.168(2005)46           |
#              |           [hep-ph/0311167]                         |
#              |                                                    |
#              |                     HDECAY 3.4                     |
#              |                                                    |
#              |  By: A.Djouadi,J.Kalinowski,M.Muhlleitner,M.Spira  |
#              |  Ref.:    Comput.Phys.Commun.108(1998)56           |
#              |           [hep-ph/9704448]                         |
#              |                                                    |
#              |                                                    |
#              |  If not stated otherwise all DRbar couplings and   |
#              |  soft SUSY breaking masses are given at the scale  |
#              |  Q=  0.91187600E+02
#              |                                                    |
#              ------------------------------------------------------
#
#
BLOCK DCINFO  # Decay Program information
     1   SDECAY/HDECAY # decay calculator
     2   1.3b  /3.4    # version number
#
BLOCK SPINFO  # Spectrum calculator information
     1   SuSpect     # RGE +Spectrum calculator            
     2   2.41         # version number                     
#
BLOCK MODSEL  # Model selection
     1     0   # #general MSSM low scale                           
#
BLOCK SMINPUTS  # Standard Model inputs
         1     1.27934000E+02   # alpha_em^-1(M_Z)^MSbar
         2     1.16639000E-05   # G_F [GeV^-2]
         3     1.17200000E-01   # alpha_S(M_Z)^MSbar
         4     9.11870000E+01   # M_Z pole mass
         5     4.25000000E+00   # mb(mb)^MSbar
         6     1.75000000E+02   # mt pole mass
         7     1.77700000E+00   # mtau pole mass
#
BLOCK MINPAR  # Input parameters - minimal models
#
BLOCK EXTPAR  # Input parameters - non-minimal models
         0     9.11876000E+01   # EWSB                
         1     7.58500000E+02   # M_1                 
         2     2.50000000E+03   # M_2                 
         3     1.50000000E+03   # M_3                 
        11     0.00000000E+00   # A_t                 
        12     0.00000000E+00   # A_b                 
        13     0.00000000E+00   # A_tau               
        14     0.00000000E+00   # A_u                 
        15     0.00000000E+00   # A_d                 
        16     0.00000000E+00   # A_e                 
        23    -7.50000000E+02   # mu(EWSB)            
        25     1.50000000E+00   # tanbeta(in)         
        26     2.00000000E+03   # MA_pole             
        31     2.50000000E+03   # M_eL                
        32     2.50000000E+03   # M_muL               
        33     2.50000000E+03   # M_tauL              
        34     2.50000000E+03   # M_eR                
        35     2.50000000E+03   # M_muR               
        36     2.50000000E+03   # M_tauR              
        41     2.50000000E+03   # M_q1L               
        42     2.50000000E+03   # M_q2L               
        43     2.50000000E+03   # M_q3L               
        44     2.50000000E+03   # M_uR                
        45     2.50000000E+03   # M_cR                
        46     2.50000000E+03   # M_tR                
        47     2.50000000E+03   # M_dR                
        48     2.50000000E+03   # M_sR                
        49     2.50000000E+03   # M_bR                
#
BLOCK MASS  # Mass Spectrum
# PDG code           mass       particle
        24     8.05513649E+01   # W+
        25     1.26000000E+02   # h
        35     2.00413401E+03   # H
        36     2.00000000E+03   # A
        37     2.00186749E+03   # H+
         5     4.87877839E+00   # b-quark pole mass calculated from mb(mb)_Msbar
   1000001     2.50026773E+03   # ~d_L
   2000001     2.50005077E+03   # ~d_R
   1000002     2.49978302E+03   # ~u_L
   2000002     2.49989845E+03   # ~u_R
   1000003     2.50026773E+03   # ~s_L
   2000003     2.50005077E+03   # ~s_R
   1000004     2.49978302E+03   # ~c_L
   2000004     2.49989845E+03   # ~c_R
   1000005     2.49953798E+03   # ~b_1
   2000005     2.50078334E+03   # ~b_2
   1000006     2.48905915E+03   # ~t_1
   2000006     2.52033268E+03   # ~t_2
   1000011     2.50016619E+03   # ~e_L
   2000011     2.50015231E+03   # ~e_R
   1000012     2.49968146E+03   # ~nu_eL
   1000013     2.50016619E+03   # ~mu_L
   2000013     2.50015231E+03   # ~mu_R
   1000014     2.49968146E+03   # ~nu_muL
   1000015     2.49976041E+03   # ~tau_1
   2000015     2.50055930E+03   # ~tau_2
   1000016     2.49968146E+03   # ~nu_tauL
   1000021     1.50000000E+03   # ~g
   1000022     7.44798898E+02   # ~chi_10
   1000023    -7.53122309E+02   # ~chi_20
   1000025     7.64821213E+02   # ~chi_30
   1000035     2.50200220E+03   # ~chi_40
   1000024     7.51724745E+02   # ~chi_1+
   1000037     2.50200170E+03   # ~chi_2+
   1000039     2.30640000E-07   # ~gravitino
#
BLOCK NMIX  # Neutralino Mixing Matrix
  1  1     5.02645325E-01   # N_11
  1  2    -6.99938914E-03   # N_12
  1  3    -6.21808987E-01   # N_13
  1  4    -6.00543312E-01   # N_14
  2  1     2.88480503E-02   # N_21
  2  2    -2.39127342E-02   # N_22
  2  3     7.06316590E-01   # N_23
  2  4    -7.06903703E-01   # N_24
  3  1     8.64011026E-01   # N_31
  3  2     5.61494271E-03   # N_32
  3  3     3.38167412E-01   # N_33
  3  4     3.72956058E-01   # N_34
  4  1     6.43536362E-04   # N_41
  4  2    -9.99673778E-01   # N_42
  4  3    -1.06423590E-02   # N_43
  4  4     2.32091349E-02   # N_44
#
BLOCK UMIX  # Chargino Mixing Matrix U
  1  1    -1.50367071E-02   # U_11
  1  2     9.99886942E-01   # U_12
  2  1     9.99886942E-01   # U_21
  2  2     1.50367071E-02   # U_22
#
BLOCK VMIX  # Chargino Mixing Matrix V
  1  1     3.28213253E-02   # V_11
  1  2    -9.99461235E-01   # V_12
  2  1     9.99461235E-01   # V_21
  2  2     3.28213253E-02   # V_22
#
BLOCK STOPMIX  # Stop Mixing Matrix
  1  1     7.08408066E-01   # cos(theta_t)
  1  2    -7.05803097E-01   # sin(theta_t)
  2  1     7.05803097E-01   # -sin(theta_t)
  2  2     7.08408066E-01   # cos(theta_t)
#
BLOCK SBOTMIX  # Sbottom Mixing Matrix
  1  1    -6.42567743E-01   # cos(theta_b)
  1  2     7.66228879E-01   # sin(theta_b)
  2  1    -7.66228879E-01   # -sin(theta_b)
  2  2    -6.42567743E-01   # cos(theta_b)
#
BLOCK STAUMIX  # Stau Mixing Matrix
  1  1    -7.00936314E-01   # cos(theta_tau)
  1  2     7.13223866E-01   # sin(theta_tau)
  2  1    -7.13223866E-01   # -sin(theta_tau)
  2  2    -7.00936314E-01   # cos(theta_tau)
#
BLOCK ALPHA  # Higgs mixing
          -5.89965581E-01   # Mixing angle in the neutral Higgs boson sector
#
BLOCK HMIX Q=  9.11876000E+01  # DRbar Higgs Parameters
         1    -7.50000000E+02   # mu(Q)               
         2     1.49999979E+00   # tanbeta(Q)          
         3     2.51787916E+02   # vev(Q)              
         4     4.12542528E+06   # MA^2(Q)             
#
BLOCK GAUGE Q=  9.11876000E+01  # The gauge couplings
     1     3.53460253E-01   # gprime(Q) DRbar
     2     6.30536823E-01   # g(Q) DRbar
     3     1.09629675E+00   # g3(Q) DRbar
#
BLOCK AU Q=  9.11876000E+01  # The trilinear couplings
  1  1     0.00000000E+00   # A_u(Q) DRbar
  2  2     0.00000000E+00   # A_c(Q) DRbar
  3  3     0.00000000E+00   # A_t(Q) DRbar
#
BLOCK AD Q=  9.11876000E+01  # The trilinear couplings
  1  1     0.00000000E+00   # A_d(Q) DRbar
  2  2     0.00000000E+00   # A_s(Q) DRbar
  3  3     0.00000000E+00   # A_b(Q) DRbar
#
BLOCK AE Q=  9.11876000E+01  # The trilinear couplings
  1  1     0.00000000E+00   # A_e(Q) DRbar
  2  2     0.00000000E+00   # A_mu(Q) DRbar
  3  3     0.00000000E+00   # A_tau(Q) DRbar
#
BLOCK Yu Q=  9.11876000E+01  # The Yukawa couplings
  1  1     0.00000000E+00   # y_u(Q) DRbar
  2  2     0.00000000E+00   # y_c(Q) DRbar
  3  3     1.05752190E+00   # y_t(Q) DRbar
#
BLOCK Yd Q=  9.11876000E+01  # The Yukawa couplings
  1  1     0.00000000E+00   # y_d(Q) DRbar
  2  2     0.00000000E+00   # y_s(Q) DRbar
  3  3     2.75955135E-02   # y_b(Q) DRbar
#
BLOCK Ye Q=  9.11876000E+01  # The Yukawa couplings
  1  1     0.00000000E+00   # y_e(Q) DRbar
  2  2     0.00000000E+00   # y_mu(Q) DRbar
  3  3     1.79746232E-02   # y_tau(Q) DRbar
#
BLOCK MSOFT Q=  9.11876000E+01  # The soft SUSY breaking masses at the scale Q
         1     7.58500000E+02   # M_1                 
         2     2.50000000E+03   # M_2                 
         3     1.50000000E+03   # M_3                 
        14     0.00000000E+00   # A_u                 
        15     0.00000000E+00   # A_d                 
        16     0.00000000E+00   # A_e                 
        21     2.31577195E+06   # M^2_Hd              
        22    -5.81115722E+05   # M^2_Hu              
        31     2.50000000E+03   # M_eL                
        32     2.50000000E+03   # M_muL               
        33     2.50000000E+03   # M_tauL              
        34     2.50000000E+03   # M_eR                
        35     2.50000000E+03   # M_muR               
        36     2.50000000E+03   # M_tauR              
        41     2.50000000E+03   # M_q1L               
        42     2.50000000E+03   # M_q2L               
        43     2.50000000E+03   # M_q3L               
        44     2.50000000E+03   # M_uR                
        45     2.50000000E+03   # M_cR                
        46     2.50000000E+03   # M_tR                
        47     2.50000000E+03   # M_dR                
        48     2.50000000E+03   # M_sR                
        49     2.50000000E+03   # M_bR                
#
#
#
#                             =================
#                             |The decay table|
#                             =================
#
# - The QCD corrections to the decays gluino -> squark  + quark
#                                     squark -> gaugino + quark_prime
#                                     squark -> squark_prime + Higgs
#                                     squark -> gluino  + quark
#   are included.
#
# - The multi-body decays for the inos, stops and sbottoms are included.
#
# - The loop induced decays for the gluino, neutralinos and stops
#   are included.
#
# - The SUSY decays of the top quark are included.
#
# - Possible decays of the NLSP in GMSB models are included.
#
#
#         PDG            Width
DECAY         6     1.44439424E+00   # top decays
#          BR         NDA      ID1       ID2
     1.00000000E+00    2           5        24   # BR(t ->  b    W+)
#
#         PDG            Width
DECAY   1000021     3.26058967E-03   # gluino decays
#          BR         NDA      ID1       ID2
     1.74462311E-02    2     1000022        21   # BR(~g -> ~chi_10 g)
     2.37698118E-02    2     1000023        21   # BR(~g -> ~chi_20 g)
     6.37447667E-03    2     1000025        21   # BR(~g -> ~chi_30 g)
#          BR         NDA      ID1       ID2
     5.04054266E-08    2     1000039        21   # BR(~g -> ~G      g)
#           BR         NDA      ID1       ID2       ID3
     2.62195745E-03    3     1000022         1        -1   # BR(~g -> ~chi_10 d  db)
     2.13631431E-05    3     1000023         1        -1   # BR(~g -> ~chi_20 d  db)
     6.74713618E-03    3     1000025         1        -1   # BR(~g -> ~chi_30 d  db)
     8.57791349E-03    3     1000022         2        -2   # BR(~g -> ~chi_10 u  ub)
     1.77200479E-05    3     1000023         2        -2   # BR(~g -> ~chi_20 u  ub)
     2.33646142E-02    3     1000025         2        -2   # BR(~g -> ~chi_30 u  ub)
     2.62195745E-03    3     1000022         3        -3   # BR(~g -> ~chi_10 s  sb)
     2.13631431E-05    3     1000023         3        -3   # BR(~g -> ~chi_20 s  sb)
     6.74713618E-03    3     1000025         3        -3   # BR(~g -> ~chi_30 s  sb)
     8.57791349E-03    3     1000022         4        -4   # BR(~g -> ~chi_10 c  cb)
     1.77200479E-05    3     1000023         4        -4   # BR(~g -> ~chi_20 c  cb)
     2.33646142E-02    3     1000025         4        -4   # BR(~g -> ~chi_30 c  cb)
     2.83587160E-03    3     1000022         5        -5   # BR(~g -> ~chi_10 b  bb)
     2.39410785E-04    3     1000023         5        -5   # BR(~g -> ~chi_20 b  bb)
     6.76171811E-03    3     1000025         5        -5   # BR(~g -> ~chi_30 b  bb)
     1.35945826E-01    3     1000022         6        -6   # BR(~g -> ~chi_10 t  tb)
     1.48318823E-01    3     1000023         6        -6   # BR(~g -> ~chi_20 t  tb)
     8.25804631E-02    3     1000025         6        -6   # BR(~g -> ~chi_30 t  tb)
     3.41380034E-05    3     1000024         1        -2   # BR(~g -> ~chi_1+ d  ub)
     3.41380034E-05    3    -1000024         2        -1   # BR(~g -> ~chi_1- u  db)
     3.41380034E-05    3     1000024         3        -4   # BR(~g -> ~chi_1+ s  cb)
     3.41380034E-05    3    -1000024         4        -3   # BR(~g -> ~chi_1- c  sb)
     2.46444678E-01    3     1000024         5        -6   # BR(~g -> ~chi_1+ b  tb)
     2.46444678E-01    3    -1000024         6        -5   # BR(~g -> ~chi_1- t  bb)
#
#         PDG            Width
DECAY   1000006     1.04437975E+02   # stop1 decays
#          BR         NDA      ID1       ID2
     9.52108793E-02    2     1000022         6   # BR(~t_1 -> ~chi_10 t )
     1.45595011E-01    2     1000023         6   # BR(~t_1 -> ~chi_20 t )
     8.91462061E-02    2     1000025         6   # BR(~t_1 -> ~chi_30 t )
     1.50076057E-01    2     1000024         5   # BR(~t_1 -> ~chi_1+ b )
     5.19971846E-01    2     1000021         6   # BR(~t_1 -> ~g      t )
#
#         PDG            Width
DECAY   2000006     1.24896069E+02   # stop2 decays
#          BR         NDA      ID1       ID2
     1.20635628E-01    2     1000022         6   # BR(~t_2 -> ~chi_10 t )
     1.43861888E-01    2     1000023         6   # BR(~t_2 -> ~chi_20 t )
     2.76517870E-02    2     1000025         6   # BR(~t_2 -> ~chi_30 t )
     1.42281374E-01    2     1000024         5   # BR(~t_2 -> ~chi_1+ b )
     1.67617250E-05    2     1000037         5   # BR(~t_2 -> ~chi_2+ b )
     5.65552561E-01    2     1000021         6   # BR(~t_2 -> ~g      t )
#
#         PDG            Width
DECAY   1000005     7.80503123E+01   # sbottom1 decays
#          BR         NDA      ID1       ID2
     3.54702026E-03    2     1000022         5   # BR(~b_1 -> ~chi_10 b )
     3.63468074E-05    2     1000023         5   # BR(~b_1 -> ~chi_20 b )
     6.09078565E-03    2     1000025         5   # BR(~b_1 -> ~chi_30 b )
     1.86818677E-01    2    -1000024         6   # BR(~b_1 -> ~chi_1- t )
     8.03507170E-01    2     1000021         5   # BR(~b_1 -> ~g      b )
#
#         PDG            Width
DECAY   2000005     8.22722575E+01   # sbottom2 decays
#          BR         NDA      ID1       ID2
     1.19707539E-03    2     1000022         5   # BR(~b_2 -> ~chi_10 b )
     3.32407148E-04    2     1000023         5   # BR(~b_2 -> ~chi_20 b )
     6.44454911E-03    2     1000025         5   # BR(~b_2 -> ~chi_30 b )
     2.25167883E-01    2    -1000024         6   # BR(~b_2 -> ~chi_1- t )
     7.66858086E-01    2     1000021         5   # BR(~b_2 -> ~g      b )
#
#         PDG            Width
DECAY   1000002     6.31760814E+01   # sup_L decays
#          BR         NDA      ID1       ID2
     9.61154672E-04    2     1000022         2   # BR(~u_L -> ~chi_10 u)
     4.34702969E-05    2     1000023         2   # BR(~u_L -> ~chi_20 u)
     3.51642028E-03    2     1000025         2   # BR(~u_L -> ~chi_30 u)
     2.73171846E-04    2     1000024         1   # BR(~u_L -> ~chi_1+ d)
     9.95205783E-01    2     1000021         2   # BR(~u_L -> ~g      u)
#
#         PDG            Width
DECAY   2000002     6.73405067E+01   # sup_R decays
#          BR         NDA      ID1       ID2
     1.68455728E-02    2     1000022         2   # BR(~u_R -> ~chi_10 u)
     5.52685973E-05    2     1000023         2   # BR(~u_R -> ~chi_20 u)
     4.92980642E-02    2     1000025         2   # BR(~u_R -> ~chi_30 u)
     9.33801094E-01    2     1000021         2   # BR(~u_R -> ~g      u)
#
#         PDG            Width
DECAY   1000001     6.31985498E+01   # sdown_L decays
#          BR         NDA      ID1       ID2
     1.29555140E-03    2     1000022         1   # BR(~d_L -> ~chi_10 d)
     1.08791661E-04    2     1000023         1   # BR(~d_L -> ~chi_20 d)
     3.05930163E-03    2     1000025         1   # BR(~d_L -> ~chi_30 d)
     5.73312248E-05    2    -1000024         2   # BR(~d_L -> ~chi_1- u)
     9.95479024E-01    2     1000021         1   # BR(~d_L -> ~g      d)
#
#         PDG            Width
DECAY   2000001     6.40096538E+01   # sdown_R decays
#          BR         NDA      ID1       ID2
     4.43091171E-03    2     1000022         1   # BR(~d_R -> ~chi_10 d)
     1.45373749E-05    2     1000023         1   # BR(~d_R -> ~chi_20 d)
     1.29669474E-02    2     1000025         1   # BR(~d_R -> ~chi_30 d)
     9.82587604E-01    2     1000021         1   # BR(~d_R -> ~g      d)
#
#         PDG            Width
DECAY   1000004     6.31760814E+01   # scharm_L decays
#          BR         NDA      ID1       ID2
     9.61154672E-04    2     1000022         4   # BR(~c_L -> ~chi_10 c)
     4.34702969E-05    2     1000023         4   # BR(~c_L -> ~chi_20 c)
     3.51642028E-03    2     1000025         4   # BR(~c_L -> ~chi_30 c)
     2.73171846E-04    2     1000024         3   # BR(~c_L -> ~chi_1+ s)
     9.95205783E-01    2     1000021         4   # BR(~c_L -> ~g      c)
#
#         PDG            Width
DECAY   2000004     6.73405067E+01   # scharm_R decays
#          BR         NDA      ID1       ID2
     1.68455728E-02    2     1000022         4   # BR(~c_R -> ~chi_10 c)
     5.52685973E-05    2     1000023         4   # BR(~c_R -> ~chi_20 c)
     4.92980642E-02    2     1000025         4   # BR(~c_R -> ~chi_30 c)
     9.33801094E-01    2     1000021         4   # BR(~c_R -> ~g      c)
#
#         PDG            Width
DECAY   1000003     6.31985498E+01   # sstrange_L decays
#          BR         NDA      ID1       ID2
     1.29555140E-03    2     1000022         3   # BR(~s_L -> ~chi_10 s)
     1.08791661E-04    2     1000023         3   # BR(~s_L -> ~chi_20 s)
     3.05930163E-03    2     1000025         3   # BR(~s_L -> ~chi_30 s)
     5.73312248E-05    2    -1000024         4   # BR(~s_L -> ~chi_1- c)
     9.95479024E-01    2     1000021         3   # BR(~s_L -> ~g      s)
#
#         PDG            Width
DECAY   2000003     6.40096538E+01   # sstrange_R decays
#          BR         NDA      ID1       ID2
     4.43091171E-03    2     1000022         3   # BR(~s_R -> ~chi_10 s)
     1.45373749E-05    2     1000023         3   # BR(~s_R -> ~chi_20 s)
     1.29669474E-02    2     1000025         3   # BR(~s_R -> ~chi_30 s)
     9.82587604E-01    2     1000021         3   # BR(~s_R -> ~g      s)
#
#         PDG            Width
DECAY   1000011     2.57417739E+00   # selectron_L decays
#          BR         NDA      ID1       ID2
     2.40805538E-01    2     1000022        11   # BR(~e_L -> ~chi_10 e-)
     1.90311329E-04    2     1000023        11   # BR(~e_L -> ~chi_20 e-)
     7.57567055E-01    2     1000025        11   # BR(~e_L -> ~chi_30 e-)
     1.43709526E-03    2    -1000024        12   # BR(~e_L -> ~chi_1- nu_e)
#
#         PDG            Width
DECAY   2000011     1.02385932E+01   # selectron_R decays
#          BR         NDA      ID1       ID2
     2.54665663E-01    2     1000022        11   # BR(~e_R -> ~chi_10 e-)
     8.35173543E-04    2     1000023        11   # BR(~e_R -> ~chi_20 e-)
     7.44499164E-01    2     1000025        11   # BR(~e_R -> ~chi_30 e-)
#
#         PDG            Width
DECAY   1000013     2.57417739E+00   # smuon_L decays
#          BR         NDA      ID1       ID2
     2.40805538E-01    2     1000022        13   # BR(~mu_L -> ~chi_10 mu-)
     1.90311329E-04    2     1000023        13   # BR(~mu_L -> ~chi_20 mu-)
     7.57567055E-01    2     1000025        13   # BR(~mu_L -> ~chi_30 mu-)
     1.43709526E-03    2    -1000024        14   # BR(~mu_L -> ~chi_1- nu_mu)
#
#         PDG            Width
DECAY   2000013     1.02385932E+01   # smuon_R decays
#          BR         NDA      ID1       ID2
     2.54665663E-01    2     1000022        13   # BR(~mu_R -> ~chi_10 mu-)
     8.35173543E-04    2     1000023        13   # BR(~mu_R -> ~chi_20 mu-)
     7.44499164E-01    2     1000025        13   # BR(~mu_R -> ~chi_30 mu-)
#
#         PDG            Width
DECAY   1000015     6.47922759E+00   # stau_1 decays
#          BR         NDA      ID1       ID2
     2.61538456E-01    2     1000022        15   # BR(~tau_1 -> ~chi_10  tau-)
     2.91636541E-04    2     1000023        15   # BR(~tau_1 -> ~chi_20  tau-)
     7.37927952E-01    2     1000025        15   # BR(~tau_1 -> ~chi_30  tau-)
     2.41955445E-04    2    -1000024        16   # BR(~tau_1 -> ~chi_1-  nu_tau)
     3.26051228E-10    2     1000039        15   # BR(~tau_1 -> ~G       tau-)
#
#         PDG            Width
DECAY   2000015     6.37343692E+00   # stau_2 decays
#          BR         NDA      ID1       ID2
     2.42109880E-01    2     1000022        15   # BR(~tau_2 -> ~chi_10  tau-)
     3.20401330E-03    2     1000023        15   # BR(~tau_2 -> ~chi_20  tau-)
     7.52265503E-01    2     1000025        15   # BR(~tau_2 -> ~chi_30  tau-)
     2.42060377E-03    2    -1000024        16   # BR(~tau_2 -> ~chi_1-  nu_tau)
#
#         PDG            Width
DECAY   1000012     2.57644632E+00   # snu_eL decays
#          BR         NDA      ID1       ID2
     2.65661653E-01    2     1000022        12   # BR(~nu_eL -> ~chi_10 nu_e)
     5.09650514E-03    2     1000023        12   # BR(~nu_eL -> ~chi_20 nu_e)
     7.22402852E-01    2     1000025        12   # BR(~nu_eL -> ~chi_30 nu_e)
     6.83899022E-03    2     1000024        11   # BR(~nu_eL -> ~chi_1+ e-)
#
#         PDG            Width
DECAY   1000014     2.57644632E+00   # snu_muL decays
#          BR         NDA      ID1       ID2
     2.65661653E-01    2     1000022        14   # BR(~nu_muL -> ~chi_10 nu_mu)
     5.09650514E-03    2     1000023        14   # BR(~nu_muL -> ~chi_20 nu_mu)
     7.22402852E-01    2     1000025        14   # BR(~nu_muL -> ~chi_30 nu_mu)
     6.83899022E-03    2     1000024        13   # BR(~nu_muL -> ~chi_1+ mu-)
#
#         PDG            Width
DECAY   1000016     2.58974995E+00   # snu_tauL decays
#          BR         NDA      ID1       ID2
     2.64296941E-01    2     1000022        16   # BR(~nu_tauL -> ~chi_10 nu_tau)
     5.07032424E-03    2     1000023        16   # BR(~nu_tauL -> ~chi_20 nu_tau)
     7.18691846E-01    2     1000025        16   # BR(~nu_tauL -> ~chi_30 nu_tau)
     1.19408889E-02    2     1000024        15   # BR(~nu_tauL -> ~chi_1+ tau-)
#
#         PDG            Width
DECAY   1000024     1.29925091E-08   # chargino1+ decays
#          BR         NDA      ID1       ID2
     1.91258254E-04    2     1000039        24   # BR(~chi_1+ -> ~G       W+)
#           BR         NDA      ID1       ID2       ID3
     3.43591864E-01    3     1000022         2        -1   # BR(~chi_1+ -> ~chi_10 u    db)
     3.43591864E-01    3     1000022         4        -3   # BR(~chi_1+ -> ~chi_10 c    sb)
     1.14533279E-01    3     1000022       -11        12   # BR(~chi_1+ -> ~chi_10 e+   nu_e)
     1.14533279E-01    3     1000022       -13        14   # BR(~chi_1+ -> ~chi_10 mu+  nu_mu)
     8.35584558E-02    3     1000022       -15        16   # BR(~chi_1+ -> ~chi_10 tau+ nu_tau)
#
#         PDG            Width
DECAY   1000037     9.50352316E+00   # chargino2+ decays
#          BR         NDA      ID1       ID2
     4.61075831E-04    2     1000002        -1   # BR(~chi_2+ -> ~u_L     db)
     3.58721048E-04    2    -1000001         2   # BR(~chi_2+ -> ~d_L*    u )
     4.61075831E-04    2     1000004        -3   # BR(~chi_2+ -> ~c_L     sb)
     3.58721048E-04    2    -1000003         4   # BR(~chi_2+ -> ~s_L*    c )
     2.72180093E-04    2     1000006        -5   # BR(~chi_2+ -> ~t_1     bb)
     3.57440452E-06    2     1000012       -11   # BR(~chi_2+ -> ~nu_eL   e+  )
     3.57440452E-06    2     1000014       -13   # BR(~chi_2+ -> ~nu_muL  mu+ )
     2.29744498E-06    2     1000016       -15   # BR(~chi_2+ -> ~nu_tau1 tau+)
     2.23926478E-06    2    -1000011        12   # BR(~chi_2+ -> ~e_L+    nu_e)
     2.23926478E-06    2    -1000013        14   # BR(~chi_2+ -> ~mu_L+   nu_mu)
     1.64154772E-06    2    -1000015        16   # BR(~chi_2+ -> ~tau_1+  nu_tau)
     7.02938510E-07    2    -2000015        16   # BR(~chi_2+ -> ~tau_2+  nu_tau)
     2.53038064E-01    2     1000024        23   # BR(~chi_2+ -> ~chi_1+  Z )
     1.77820943E-01    2     1000022        24   # BR(~chi_2+ -> ~chi_10  W+)
     2.46033777E-01    2     1000023        24   # BR(~chi_2+ -> ~chi_20  W+)
     7.05116975E-02    2     1000025        24   # BR(~chi_2+ -> ~chi_30  W+)
     2.50667475E-01    2     1000024        25   # BR(~chi_2+ -> ~chi_1+  h )
     2.22338676E-10    2     1000039        24   # BR(~chi_2+ -> ~G       W+)
     9.13357353E-16    2     1000039        37   # BR(~chi_2+ -> ~G       H+)
#
#         PDG            Width
DECAY   1000022     2.86752415E-12   # neutralino1 decays
#          BR         NDA      ID1       ID2
     3.27376337E-01    2     1000039        22   # BR(~chi_10 -> ~G        gam)
     1.22823625E-01    2     1000039        23   # BR(~chi_10 -> ~G        Z)
     5.49800038E-01    2     1000039        25   # BR(~chi_10 -> ~G        h)
#
#         PDG            Width
DECAY   1000023     2.40696074E-08   # neutralino2 decays
#          BR         NDA      ID1       ID2
     1.25245479E-02    2     1000022        22   # BR(~chi_20 -> ~chi_10 gam)
#          BR         NDA      ID1       ID2
     3.95348796E-08    2     1000039        22   # BR(~chi_20 -> ~G        gam)
     9.88605507E-05    2     1000039        23   # BR(~chi_20 -> ~G        Z)
     3.67702209E-06    2     1000039        25   # BR(~chi_20 -> ~G        h)
#           BR         NDA      ID1       ID2       ID3
     1.37731974E-01    3     1000022        -2         2   # BR(~chi_20 -> ~chi_10 ub      u)
     1.78233163E-01    3     1000022        -1         1   # BR(~chi_20 -> ~chi_10 db      d)
     1.37731974E-01    3     1000022        -4         4   # BR(~chi_20 -> ~chi_10 cb      c)
     1.78233163E-01    3     1000022        -3         3   # BR(~chi_20 -> ~chi_10 sb      s)
     4.06564768E-02    3     1000022       -11        11   # BR(~chi_20 -> ~chi_10 e+      e-)
     4.06564768E-02    3     1000022       -13        13   # BR(~chi_20 -> ~chi_10 mu+     mu-)
     3.01906223E-02    3     1000022       -15        15   # BR(~chi_20 -> ~chi_10 tau+    tau-)
     8.11643515E-02    3     1000022       -12        12   # BR(~chi_20 -> ~chi_10 nu_eb   nu_e)
     8.11643515E-02    3     1000022       -14        14   # BR(~chi_20 -> ~chi_10 nu_mub  nu_mu)
     8.11643515E-02    3     1000022       -16        16   # BR(~chi_20 -> ~chi_10 nu_taub nu_tau)
     8.36195071E-05    3     1000024        -2         1   # BR(~chi_20 -> ~chi_1+ ub      d)
     8.36195071E-05    3    -1000024        -1         2   # BR(~chi_20 -> ~chi_1- db      u)
     8.36195071E-05    3     1000024        -4         3   # BR(~chi_20 -> ~chi_1+ cb      s)
     8.36195071E-05    3    -1000024        -3         4   # BR(~chi_20 -> ~chi_1- sb      c)
     2.78731813E-05    3     1000024       -12        11   # BR(~chi_20 -> ~chi_1+ nu_eb   e-)
     2.78731813E-05    3    -1000024        12       -11   # BR(~chi_20 -> ~chi_1- nu_e    e+)
     2.78731813E-05    3     1000024       -14        13   # BR(~chi_20 -> ~chi_1+ nu_mub  mu-)
     2.78731813E-05    3    -1000024        14       -13   # BR(~chi_20 -> ~chi_1- nu_mu   mu+)
#
#         PDG            Width
DECAY   1000025     1.37518347E-06   # neutralino3 decays
#          BR         NDA      ID1       ID2
     7.93145730E-01    2     1000022        22   # BR(~chi_30 -> ~chi_10 gam)
     1.42099341E-02    2     1000023        22   # BR(~chi_30 -> ~chi_20 gam)
#          BR         NDA      ID1       ID2
     2.35656165E-06    2     1000039        22   # BR(~chi_30 -> ~G        gam)
     7.07532020E-07    2     1000039        23   # BR(~chi_30 -> ~G        Z)
     4.57576189E-07    2     1000039        25   # BR(~chi_30 -> ~G        h)
#           BR         NDA      ID1       ID2       ID3
     1.45848635E-04    3     1000022        -2         2   # BR(~chi_30 -> ~chi_10 ub      u)
     1.94314883E-04    3     1000022        -1         1   # BR(~chi_30 -> ~chi_10 db      d)
     1.45848635E-04    3     1000022        -4         4   # BR(~chi_30 -> ~chi_10 cb      c)
     1.94314883E-04    3     1000022        -3         3   # BR(~chi_30 -> ~chi_10 sb      s)
     9.40366932E-05    3     1000022        -5         5   # BR(~chi_30 -> ~chi_10 bb      b)
     4.89127247E-05    3     1000022       -11        11   # BR(~chi_30 -> ~chi_10 e+      e-)
     4.89127247E-05    3     1000022       -13        13   # BR(~chi_30 -> ~chi_10 mu+     mu-)
     4.35821762E-05    3     1000022       -15        15   # BR(~chi_30 -> ~chi_10 tau+    tau-)
     8.61212523E-05    3     1000022       -12        12   # BR(~chi_30 -> ~chi_10 nu_eb   nu_e)
     8.61212523E-05    3     1000022       -14        14   # BR(~chi_30 -> ~chi_10 nu_mub  nu_mu)
     8.61212523E-05    3     1000022       -16        16   # BR(~chi_30 -> ~chi_10 nu_taub nu_tau)
     4.46818429E-03    3     1000023        -2         2   # BR(~chi_30 -> ~chi_20 ub      u)
     5.78244415E-03    3     1000023        -1         1   # BR(~chi_30 -> ~chi_20 db      d)
     4.46818429E-03    3     1000023        -4         4   # BR(~chi_30 -> ~chi_20 cb      c)
     5.78244415E-03    3     1000023        -3         3   # BR(~chi_30 -> ~chi_20 sb      s)
     5.32507749E-04    3     1000023        -5         5   # BR(~chi_30 -> ~chi_20 bb      b)
     1.31917863E-03    3     1000023       -11        11   # BR(~chi_30 -> ~chi_20 e+      e-)
     1.31917863E-03    3     1000023       -13        13   # BR(~chi_30 -> ~chi_20 mu+     mu-)
     1.15034200E-03    3     1000023       -15        15   # BR(~chi_30 -> ~chi_20 tau+    tau-)
     2.63282943E-03    3     1000023       -12        12   # BR(~chi_30 -> ~chi_20 nu_eb   nu_e)
     2.63282943E-03    3     1000023       -14        14   # BR(~chi_30 -> ~chi_20 nu_mub  nu_mu)
     2.63282943E-03    3     1000023       -16        16   # BR(~chi_30 -> ~chi_20 nu_taub nu_tau)
     2.67132063E-02    3     1000024        -2         1   # BR(~chi_30 -> ~chi_1+ ub      d)
     2.67132063E-02    3    -1000024        -1         2   # BR(~chi_30 -> ~chi_1- db      u)
     2.67132063E-02    3     1000024        -4         3   # BR(~chi_30 -> ~chi_1+ cb      s)
     2.67132063E-02    3    -1000024        -3         4   # BR(~chi_30 -> ~chi_1- sb      c)
     8.90375147E-03    3     1000024       -12        11   # BR(~chi_30 -> ~chi_1+ nu_eb   e-)
     8.90375147E-03    3    -1000024        12       -11   # BR(~chi_30 -> ~chi_1- nu_e    e+)
     8.90375147E-03    3     1000024       -14        13   # BR(~chi_30 -> ~chi_1+ nu_mub  mu-)
     8.90375147E-03    3    -1000024        14       -13   # BR(~chi_30 -> ~chi_1- nu_mu   mu+)
     8.13894789E-03    3     1000024       -16        15   # BR(~chi_30 -> ~chi_1+ nu_taub tau-)
     8.13894789E-03    3    -1000024        16       -15   # BR(~chi_30 -> ~chi_1- nu_tau  tau+)
#
#         PDG            Width
DECAY   1000035     9.50122266E+00   # neutralino4 decays
#          BR         NDA      ID1       ID2
     1.65266118E-01    2     1000022        23   # BR(~chi_40 -> ~chi_10   Z )
     3.05320503E-02    2     1000023        23   # BR(~chi_40 -> ~chi_20   Z )
     5.78186030E-02    2     1000025        23   # BR(~chi_40 -> ~chi_30   Z )
     2.46718724E-01    2     1000024       -24   # BR(~chi_40 -> ~chi_1+   W-)
     2.46718724E-01    2    -1000024        24   # BR(~chi_40 -> ~chi_1-   W+)
     1.69113566E-02    2     1000022        25   # BR(~chi_40 -> ~chi_10   h )
     2.20029903E-01    2     1000023        25   # BR(~chi_40 -> ~chi_20   h )
     1.43478509E-02    2     1000025        25   # BR(~chi_40 -> ~chi_30   h )
     4.56472121E-04    2     1000002        -2   # BR(~chi_40 -> ~u_L      ub)
     4.56472121E-04    2    -1000002         2   # BR(~chi_40 -> ~u_L*     u )
     1.00132039E-10    2     2000002        -2   # BR(~chi_40 -> ~u_R      ub)
     1.00132039E-10    2    -2000002         2   # BR(~chi_40 -> ~u_R*     u )
     3.55847105E-04    2     1000001        -1   # BR(~chi_40 -> ~d_L      db)
     3.55847105E-04    2    -1000001         1   # BR(~chi_40 -> ~d_L*     d )
     2.31981802E-11    2     2000001        -1   # BR(~chi_40 -> ~d_R      db)
     2.31981802E-11    2    -2000001         1   # BR(~chi_40 -> ~d_R*     d )
     4.56472121E-04    2     1000004        -4   # BR(~chi_40 -> ~c_L      cb)
     4.56472121E-04    2    -1000004         4   # BR(~chi_40 -> ~c_L*     c )
     1.00132039E-10    2     2000004        -4   # BR(~chi_40 -> ~c_R      cb)
     1.00132039E-10    2    -2000004         4   # BR(~chi_40 -> ~c_R*     c )
     3.55847105E-04    2     1000003        -3   # BR(~chi_40 -> ~s_L      sb)
     3.55847105E-04    2    -1000003         3   # BR(~chi_40 -> ~s_L*     s )
     2.31981802E-11    2     2000003        -3   # BR(~chi_40 -> ~s_R      sb)
     2.31981802E-11    2    -2000003         3   # BR(~chi_40 -> ~s_R*     s )
     1.11922732E-06    2     1000011       -11   # BR(~chi_40 -> ~e_L-     e+)
     1.11922732E-06    2    -1000011        11   # BR(~chi_40 -> ~e_L+     e-)
     5.92271659E-13    2     2000011       -11   # BR(~chi_40 -> ~e_R-     e+)
     5.92271659E-13    2    -2000011        11   # BR(~chi_40 -> ~e_R+     e-)
     1.11922732E-06    2     1000013       -13   # BR(~chi_40 -> ~mu_L-    mu+)
     1.11922732E-06    2    -1000013        13   # BR(~chi_40 -> ~mu_L+    mu-)
     5.92271659E-13    2     2000013       -13   # BR(~chi_40 -> ~mu_R-    mu+)
     5.92271659E-13    2    -2000013        13   # BR(~chi_40 -> ~mu_R+    mu-)
     4.99374243E-07    2     1000015       -15   # BR(~chi_40 -> ~tau_1-   tau+)
     4.99374243E-07    2    -1000015        15   # BR(~chi_40 -> ~tau_1+   tau-)
     1.79045705E-06    2     1000012       -12   # BR(~chi_40 -> ~nu_eL    nu_eb)
     1.79045705E-06    2    -1000012        12   # BR(~chi_40 -> ~nu_eL*   nu_e )
     1.79045705E-06    2     1000014       -14   # BR(~chi_40 -> ~nu_muL   nu_mub)
     1.79045705E-06    2    -1000014        14   # BR(~chi_40 -> ~nu_muL*  nu_mu )
     1.79045705E-06    2     1000016       -16   # BR(~chi_40 -> ~nu_tau1  nu_taub)
     1.79045705E-06    2    -1000016        16   # BR(~chi_40 -> ~nu_tau1* nu_tau )
     5.32452064E-11    2     1000039        22   # BR(~chi_40 -> ~G        gam)
     1.69123545E-10    2     1000039        23   # BR(~chi_40 -> ~G        Z)
     1.97462113E-14    2     1000039        25   # BR(~chi_40 -> ~G        h)
     8.71870938E-16    2     1000039        35   # BR(~chi_40 -> ~G        H)
     3.06446847E-17    2     1000039        36   # BR(~chi_40 -> ~G        A)
#
#         PDG            Width
DECAY        25     4.20662876E-03   # h decays
#          BR         NDA      ID1       ID2
     6.00963825E-01    2           5        -5   # BR(h -> b       bb     )
     6.23682655E-02    2         -15        15   # BR(h -> tau+    tau-   )
     2.20756469E-04    2         -13        13   # BR(h -> mu+     mu-    )
     4.67091650E-04    2           3        -3   # BR(h -> s       sb     )
     2.01716262E-02    2           4        -4   # BR(h -> c       cb     )
     6.67678869E-02    2          21        21   # BR(h -> g       g      )
     2.30326845E-03    2          22        22   # BR(h -> gam     gam    )
     1.63201972E-03    2          22        23   # BR(h -> Z       gam    )
     2.16945979E-01    2          24       -24   # BR(h -> W+      W-     )
     2.81592813E-02    2          23        23   # BR(h -> Z       Z      )
#
#         PDG            Width
DECAY        35     3.94852919E+01   # H decays
#          BR         NDA      ID1       ID2
     1.42405825E-03    2           5        -5   # BR(H -> b       bb     )
     2.36062212E-04    2         -15        15   # BR(H -> tau+    tau-   )
     8.34567805E-07    2         -13        13   # BR(H -> mu+     mu-    )
     1.06874567E-06    2           3        -3   # BR(H -> s       sb     )
     9.63533131E-06    2           4        -4   # BR(H -> c       cb     )
     9.77987161E-01    2           6        -6   # BR(H -> t       tb     )
     7.86308839E-04    2          21        21   # BR(H -> g       g      )
     2.67368310E-06    2          22        22   # BR(H -> gam     gam    )
     1.15119300E-06    2          23        22   # BR(H -> Z       gam    )
     2.55285342E-04    2          24       -24   # BR(H -> W+      W-     )
     1.27294879E-04    2          23        23   # BR(H -> Z       Z      )
     8.35603615E-04    2          25        25   # BR(H -> h       h      )
     1.01493070E-23    2          36        36   # BR(H -> A       A      )
     3.30026338E-11    2          23        36   # BR(H -> Z       A      )
     3.98299298E-12    2          24       -37   # BR(H -> W+      H-     )
     3.98299298E-12    2         -24        37   # BR(H -> W-      H+     )
     4.46900975E-05    2     1000024  -1000024   # BR(H -> ~chi_1+ ~chi_1-)
     7.01826760E-03    2     1000022   1000022   # BR(H -> ~chi_10 ~chi_10)
     7.15721099E-06    2     1000023   1000023   # BR(H -> ~chi_20 ~chi_20)
     5.70478666E-03    2     1000025   1000025   # BR(H -> ~chi_30 ~chi_30)
     5.53427687E-05    2     1000022   1000023   # BR(H -> ~chi_10 ~chi_20)
     3.89162243E-03    2     1000022   1000025   # BR(H -> ~chi_10 ~chi_30)
     1.61099525E-03    2     1000023   1000025   # BR(H -> ~chi_20 ~chi_30)
#
#         PDG            Width
DECAY        36     3.99832219E+01   # A decays
#          BR         NDA      ID1       ID2
     1.42439194E-03    2           5        -5   # BR(A -> b       bb     )
     2.33253248E-04    2         -15        15   # BR(A -> tau+    tau-   )
     8.24634494E-07    2         -13        13   # BR(A -> mu+     mu-    )
     1.08737203E-06    2           3        -3   # BR(A -> s       sb     )
     9.52891338E-06    2           4        -4   # BR(A -> c       cb     )
     9.78836212E-01    2           6        -6   # BR(A -> t       tb     )
     9.33514314E-04    2          21        21   # BR(A -> g       g      )
     3.15878356E-06    2          22        22   # BR(A -> gam     gam    )
     1.34136035E-06    2          23        22   # BR(A -> Z       gam    )
     2.48414751E-04    2          23        25   # BR(A -> Z       h      )
     3.56925395E-04    2     1000024  -1000024   # BR(A -> ~chi_1+ ~chi_1-)
     7.22951837E-04    2     1000022   1000022   # BR(A -> ~chi_10 ~chi_10)
     4.13869274E-04    2     1000023   1000023   # BR(A -> ~chi_20 ~chi_20)
     3.12285342E-04    2     1000025   1000025   # BR(A -> ~chi_30 ~chi_30)
     4.21952840E-03    2     1000022   1000023   # BR(A -> ~chi_10 ~chi_20)
     5.55257722E-04    2     1000022   1000025   # BR(A -> ~chi_10 ~chi_30)
     1.17274552E-02    2     1000023   1000025   # BR(A -> ~chi_20 ~chi_30)
#
#         PDG            Width
DECAY        37     3.91586601E+01   # H+ decays
#          BR         NDA      ID1       ID2
     2.29325443E-06    2           4        -5   # BR(H+ -> c       bb     )
     2.38387235E-04    2         -15        16   # BR(H+ -> tau+    nu_tau )
     8.42784991E-07    2         -13        14   # BR(H+ -> mu+     nu_mu  )
     1.45812745E-08    2           2        -5   # BR(H+ -> u       bb     )
     5.22023422E-08    2           2        -3   # BR(H+ -> u       sb     )
     1.04015143E-05    2           4        -3   # BR(H+ -> c       sb     )
     9.81208241E-01    2           6        -5   # BR(H+ -> t       bb     )
     2.54718381E-04    2          24        25   # BR(H+ -> W+      h      )
     7.62690435E-13    2          24        36   # BR(H+ -> W+      A      )
     4.38752569E-03    2     1000024   1000022   # BR(H+ -> ~chi_1+ ~chi_10)
     2.73249623E-05    2     1000024   1000023   # BR(H+ -> ~chi_1+ ~chi_20)
     1.38701989E-02    2     1000024   1000025   # BR(H+ -> ~chi_1+ ~chi_30)
