#
#                              ======================
#                              | THE SUSYHIT OUTPUT |
#                              ======================
#
#
#              ------------------------------------------------------
#              |     This is the output of the SUSY-HIT package     |
#              |  created by A.Djouadi, M.Muehlleitner and M.Spira. |
#              |  In case of problems with SUSY-HIT email to        |
#              |           margarete.muehlleitner@cern.ch           |
#              |           michael.spira@psi.ch                     |
#              |           abdelhak.djouadi@cern.ch                 |
#              ------------------------------------------------------
#
#              ------------------------------------------------------
#              |  SUSY Les Houches Accord - MSSM Spectrum + Decays  |
#              |              based on the decay programs           |
#              |                                                    |
#              |                     SDECAY 1.3b                    |
#              |                                                    |
#              |  Authors: M.Muhlleitner, A.Djouadi and Y.Mambrini  |
#              |  Ref.:    Comput.Phys.Commun.168(2005)46           |
#              |           [hep-ph/0311167]                         |
#              |                                                    |
#              |                     HDECAY 3.4                     |
#              |                                                    |
#              |  By: A.Djouadi,J.Kalinowski,M.Muhlleitner,M.Spira  |
#              |  Ref.:    Comput.Phys.Commun.108(1998)56           |
#              |           [hep-ph/9704448]                         |
#              |                                                    |
#              |                                                    |
#              |  If not stated otherwise all DRbar couplings and   |
#              |  soft SUSY breaking masses are given at the scale  |
#              |  Q=  0.23674830E+04
#              |                                                    |
#              ------------------------------------------------------
#
#
BLOCK DCINFO  # Decay Program information
     1   SDECAY/HDECAY # decay calculator
     2   1.3b  /3.4    # version number
#
BLOCK SPINFO  # Spectrum calculator information
     1     SOFTSUSY    # spectrum calculator               
     2     3.4.0       # version number                    
#
BLOCK MODSEL  # Model selection
     1     0   #  nonUniversal                                     
#
BLOCK SMINPUTS  # Standard Model inputs
         1     1.27908970E+02   # alpha_em^-1(M_Z)^MSbar
         2     1.16637870E-05   # G_F [GeV^-2]
         3     1.18400000E-01   # alpha_S(M_Z)^MSbar
         4     9.11876000E+01   # M_Z pole mass
         5     4.18000000E+00   # mb(mb)^MSbar
         6     1.73200000E+02   # mt pole mass
         7     1.77700000E+00   # mtau pole mass
#
BLOCK MINPAR  # Input parameters - minimal models
         3     2.54600000E+01   # tanb                
#
BLOCK EXTPAR  # Input parameters - non-minimal models
         0    -1.00000000E+00   # Set                 
         1    -5.47150000E+02   # M_1(MX)             
         2     1.96370000E+02   # M_2(MX)             
         3     1.64920000E+03   # M_3(MX)             
        11    -2.77453000E+03   # At(MX)              
        12    -1.11450000E+03   # Ab(MX)              
        13     2.66759000E+03   # Atau(MX)            
        23     6.56310000E+02   # mu(MX)              
        26     1.58771000E+03   # mA(pole)            
        31     2.77284000E+03   # meL(MX)             
        32     2.77284000E+03   # mmuL(MX)            
        33     3.52833000E+03   # mtauL(MX)           
        34     5.74390000E+02   # meR(MX)             
        35     5.74390000E+02   # mmuR(MX)            
        36     3.82678000E+03   # mtauR(MX)           
        41     2.97372000E+03   # mqL1(MX)            
        42     2.97372000E+03   # mqL2(MX)            
        43     2.48948000E+03   # mqL3(MX)            
        44     3.71309000E+03   # muR(MX)             
        45     3.71309000E+03   # mcR(MX)             
        46     2.24978000E+03   # mtR(MX)             
        47     5.74070000E+02   # mdR(MX)             
        48     5.74070000E+02   # msR(MX)             
        49     1.55568000E+03   # mbR(MX)             
#
BLOCK MASS  # Mass Spectrum
# PDG code           mass       particle
        24     8.03780147E+01   # W+
        25     1.25795641E+02   # h
        35     1.58772483E+03   # H
        36     1.58771000E+03   # A
        37     1.58998342E+03   # H+
         5     4.81876030E+00   # b-quark pole mass calculated from mb(mb)_Msbar
   1000001     3.02081557E+03   # ~d_L
   2000001     7.25822456E+02   # ~d_R
   1000002     3.01990287E+03   # ~u_L
   2000002     3.75164656E+03   # ~u_R
   1000003     3.02081557E+03   # ~s_L
   2000003     7.25822456E+02   # ~s_R
   1000004     3.01990287E+03   # ~c_L
   2000004     3.75164656E+03   # ~c_R
   1000005     1.63228429E+03   # ~b_1
   2000005     2.50954722E+03   # ~b_2
   1000006     2.22927866E+03   # ~t_1
   2000006     2.53703280E+03   # ~t_2
   1000011     2.77786875E+03   # ~e_L
   2000011     5.86644791E+02   # ~e_R
   1000012     2.77639974E+03   # ~nu_eL
   1000013     2.77786875E+03   # ~mu_L
   2000013     5.86644791E+02   # ~mu_R
   1000014     2.77639974E+03   # ~nu_muL
   1000015     3.53381649E+03   # ~tau_1
   2000015     3.82856970E+03   # ~tau_2
   1000016     3.53262656E+03   # ~nu_tauL
   1000021     1.82973144E+03   # ~g
   1000022     2.08550518E+02   # ~chi_10
   1000023    -5.36032462E+02   # ~chi_20
   1000025     6.83954333E+02   # ~chi_30
   1000035    -6.85581855E+02   # ~chi_40
   1000024     2.08730187E+02   # ~chi_1+
   1000037     6.86818927E+02   # ~chi_2+
#
BLOCK NMIX  # Neutralino Mixing Matrix
  1  1     2.90714972E-03   # N_11
  1  2     9.90616380E-01   # N_12
  1  3    -1.29310142E-01   # N_13
  1  4     4.41545338E-02   # N_14
  2  1     9.77744556E-01   # N_21
  2  2     1.29174145E-02   # N_22
  2  3     1.64975545E-01   # N_23
  2  4     1.28964310E-01   # N_24
  3  1    -2.63170803E-02   # N_31
  3  2     1.22592216E-01   # N_32
  3  3     6.97724022E-01   # N_33
  3  4    -7.05308265E-01   # N_34
  4  1    -2.08121463E-01   # N_41
  4  2     5.90209798E-02   # N_42
  4  3     6.85013244E-01   # N_43
  4  4     6.95671500E-01   # N_44
#
BLOCK UMIX  # Chargino Mixing Matrix U
  1  1     9.83328659E-01   # U_11
  1  2    -1.81837150E-01   # U_12
  2  1     1.81837150E-01   # U_21
  2  2     9.83328659E-01   # U_22
#
BLOCK VMIX  # Chargino Mixing Matrix V
  1  1     9.98066449E-01   # V_11
  1  2    -6.21559532E-02   # V_12
  2  1     6.21559532E-02   # V_21
  2  2     9.98066449E-01   # V_22
#
BLOCK STOPMIX  # Stop Mixing Matrix
  1  1     2.91748088E-01   # cos(theta_t)
  1  2     9.56495192E-01   # sin(theta_t)
  2  1    -9.56495192E-01   # -sin(theta_t)
  2  2     2.91748088E-01   # cos(theta_t)
#
BLOCK SBOTMIX  # Sbottom Mixing Matrix
  1  1     1.05706174E-02   # cos(theta_b)
  1  2     9.99944129E-01   # sin(theta_b)
  2  1    -9.99944129E-01   # -sin(theta_b)
  2  2     1.05706174E-02   # cos(theta_b)
#
BLOCK STAUMIX  # Stau Mixing Matrix
  1  1     9.99938213E-01   # cos(theta_tau)
  1  2     1.11162126E-02   # sin(theta_tau)
  2  1    -1.11162126E-02   # -sin(theta_tau)
  2  2     9.99938213E-01   # cos(theta_tau)
#
BLOCK ALPHA  # Higgs mixing
          -4.11010265E-02   # Mixing angle in the neutral Higgs boson sector
#
BLOCK HMIX Q=  2.36748300E+03  # DRbar Higgs Parameters
         1     6.66362677E+02   # mu(Q)MSSM           
         2     2.45226246E+01   # tan                 
         3     2.41819246E+02   # higgs               
         4     2.57679815E+06   # mA^2(Q)MSSM         
#
BLOCK GAUGE Q=  2.36748300E+03  # The gauge couplings
     1     3.64439629E-01   # gprime(Q) DRbar
     2     6.41922944E-01   # g(Q) DRbar
     3     1.02642825E+00   # g3(Q) DRbar
#
BLOCK AU Q=  2.36748300E+03  # The trilinear couplings
  1  1     0.00000000E+00   # A_u(Q) DRbar
  2  2     0.00000000E+00   # A_c(Q) DRbar
  3  3    -2.77452999E+03   # A_t(Q) DRbar
#
BLOCK AD Q=  2.36748300E+03  # The trilinear couplings
  1  1     0.00000000E+00   # A_d(Q) DRbar
  2  2     0.00000000E+00   # A_s(Q) DRbar
  3  3    -1.11450000E+03   # A_b(Q) DRbar
#
BLOCK AE Q=  2.36748300E+03  # The trilinear couplings
  1  1     0.00000000E+00   # A_e(Q) DRbar
  2  2     0.00000000E+00   # A_mu(Q) DRbar
  3  3     2.66759000E+03   # A_tau(Q) DRbar
#
BLOCK Yu Q=  2.36748300E+03  # The Yukawa couplings
  1  1     0.00000000E+00   # y_u(Q) DRbar
  2  2     0.00000000E+00   # y_c(Q) DRbar
  3  3     8.28081496E-01   # y_t(Q) DRbar
#
BLOCK Yd Q=  2.36748300E+03  # The Yukawa couplings
  1  1     0.00000000E+00   # y_d(Q) DRbar
  2  2     0.00000000E+00   # y_s(Q) DRbar
  3  3     3.20646516E-01   # y_b(Q) DRbar
#
BLOCK Ye Q=  2.36748300E+03  # The Yukawa couplings
  1  1     0.00000000E+00   # y_e(Q) DRbar
  2  2     0.00000000E+00   # y_mu(Q) DRbar
  3  3     2.52288349E-01   # y_tau(Q) DRbar
#
BLOCK MSOFT Q=  2.36748300E+03  # The soft SUSY breaking masses at the scale Q
         1    -5.47150000E+02   # M_1(Q)              
         2     1.96370000E+02   # M_2(Q)              
         3     1.64920000E+03   # M_3(Q)              
        21     2.10294691E+06   # mH1^2(Q)            
        22    -3.14569304E+05   # mH2^2(Q)            
        31     2.77284000E+03   # meL(Q)              
        32     2.77284000E+03   # mmuL(Q)             
        33     3.52833000E+03   # mtauL(Q)            
        34     5.74390000E+02   # meR(Q)              
        35     5.74390000E+02   # mmuR(Q)             
        36     3.82678000E+03   # mtauR(Q)            
        41     2.97372000E+03   # mqL1(Q)             
        42     2.97372000E+03   # mqL2(Q)             
        43     2.48947999E+03   # mqL3(Q)             
        44     3.71309000E+03   # muR(Q)              
        45     3.71309000E+03   # mcR(Q)              
        46     2.24977999E+03   # mtR(Q)              
        47     5.74069989E+02   # mdR(Q)              
        48     5.74069989E+02   # msR(Q)              
        49     1.55568000E+03   # mbR(Q)              
#
Block HiggsBoundsInputHiggsCouplingsFermions
# ScalarNormEffCoupSq PseudoSNormEffCoupSq NP   IP1 IP2 IP2
    1.01698901E+00    0.00000000E+00        3  25   5   5  # h0-b-b eff. coupling^2, normalised to SM
    6.01342128E+02    0.00000000E+00        3  35   5   5  # H0-b-b eff. coupling^2, normalised to SM
    0.00000000E+00    6.01359117E+02        3  36   5   5  # A0-b-b eff. coupling^2, normalised to SM
#
    9.99971749E-01    0.00000000E+00        3  25   6   6  # h0-t-t eff. coupling^2, normalised to SM
    1.69115090E-03    0.00000000E+00        3  35   6   6  # H0-t-t eff. coupling^2, normalised to SM
    0.00000000E+00    1.66289987E-03        3  36   6   6  # A0-t-t eff. coupling^2, normalised to SM
#
    1.01698901E+00    0.00000000E+00        3  25  15  15  # h0-tau-tau eff. coupling^2, normalised to SM
    6.01342128E+02    0.00000000E+00        3  35  15  15  # H0-tau-tau eff. coupling^2, normalised to SM
    0.00000000E+00    6.01359117E+02        3  36  15  15  # A0-tau-tau eff. coupling^2, normalised to SM
#
Block HiggsBoundsInputHiggsCouplingsBosons
    9.99999881E-01        3  25  24  24  # h0-W-W eff. coupling^2, normalised to SM
    1.18982388E-07        3  35  24  24  # H0-W-W eff. coupling^2, normalised to SM
    0.00000000E+00        3  36  24  24  # A0-W-W eff. coupling^2, normalised to SM
#
    9.99999881E-01        3  25  23  23  # h0-Z-Z eff. coupling^2, normalised to SM
    1.18982388E-07        3  35  23  23  # H0-Z-Z eff. coupling^2, normalised to SM
    0.00000000E+00        3  36  23  23  # A0-Z-Z eff. coupling^2, normalised to SM
#
    8.91181491E-01        3  25  21  21  # h0-g-g eff. coupling^2, normalised to SM
    3.49700237E-10        3  35  21  21  # H0-g-g eff. coupling^2, normalised to SM
    3.49576298E-09        3  36  21  21  # A0-g-g eff. coupling^2, normalised to SM
#
    0.00000000E+00        3  25  25  23  # h0-h0-Z eff. coupling^2, normalised to SM
    0.00000000E+00        3  35  25  23  # H0-h0-Z eff. coupling^2, normalised to SM
    1.18982388E-07        3  36  25  23  # A0-h0-Z eff. coupling^2, normalised to SM
    0.00000000E+00        3  35  35  23  # H0-H0-Z eff. coupling^2, normalised to SM
    9.99999881E-01        3  36  35  23  # A0-H0-Z eff. coupling^2, normalised to SM
    0.00000000E+00        3  36  36  23  # A0-A0-Z eff. coupling^2, normalised to SM
#
    0.00000000E+00        4  25  21  21  23  # h0-g-g-Z eff. coupling^2, normalised to SM
    0.00000000E+00        4  35  21  21  23  # H0-g-g-Z eff. coupling^2, normalised to SM
    0.00000000E+00        4  36  21  21  23  # A0-g-g-Z eff. coupling^2, normalised to SM
#
#
#
#                             =================
#                             |The decay table|
#                             =================
#
# - The QCD corrections to the decays gluino -> squark  + quark
#                                     squark -> gaugino + quark_prime
#                                     squark -> squark_prime + Higgs
#                                     squark -> gluino  + quark
#   are included.
#
# - The multi-body decays for the inos, stops and sbottoms are included.
#
# - The loop induced decays for the gluino, neutralinos and stops
#   are included.
#
# - The SUSY decays of the top quark are included.
#
#
#         PDG            Width
DECAY         6     1.45176792E+00   # top decays
#          BR         NDA      ID1       ID2
     1.00000000E+00    2           5        24   # BR(t ->  b    W+)
#
#         PDG            Width
DECAY   1000021     4.86987614E+01   # gluino decays
#          BR         NDA      ID1       ID2
     2.41409078E-01    2     2000001        -1   # BR(~g -> ~d_R  db)
     2.41409078E-01    2    -2000001         1   # BR(~g -> ~d_R* d )
     2.41409078E-01    2     2000003        -3   # BR(~g -> ~s_R  sb)
     2.41409078E-01    2    -2000003         3   # BR(~g -> ~s_R* s )
     1.71818436E-02    2     1000005        -5   # BR(~g -> ~b_1  bb)
     1.71818436E-02    2    -1000005         5   # BR(~g -> ~b_1* b )
#
#         PDG            Width
DECAY   1000006     6.87673612E+01   # stop1 decays
#          BR         NDA      ID1       ID2
     1.73250918E-02    2     1000022         6   # BR(~t_1 -> ~chi_10 t )
     5.51795070E-02    2     1000023         6   # BR(~t_1 -> ~chi_20 t )
     1.62582043E-01    2     1000025         6   # BR(~t_1 -> ~chi_30 t )
     1.96037708E-01    2     1000035         6   # BR(~t_1 -> ~chi_40 t )
     3.55183590E-02    2     1000024         5   # BR(~t_1 -> ~chi_1+ b )
     3.24858266E-01    2     1000037         5   # BR(~t_1 -> ~chi_2+ b )
     2.08404676E-01    2     1000021         6   # BR(~t_1 -> ~g      t )
     9.43481124E-05    2     1000005        24   # BR(~t_1 -> ~b_1    W+)
#
#         PDG            Width
DECAY   2000006     1.00135341E+02   # stop2 decays
#          BR         NDA      ID1       ID2
     8.71947665E-02    2     1000022         6   # BR(~t_2 -> ~chi_10 t )
     1.99132669E-02    2     1000023         6   # BR(~t_2 -> ~chi_20 t )
     1.60353401E-01    2     1000025         6   # BR(~t_2 -> ~chi_30 t )
     1.28419133E-01    2     1000035         6   # BR(~t_2 -> ~chi_40 t )
     1.79227906E-01    2     1000024         5   # BR(~t_2 -> ~chi_1+ b )
     7.32157437E-02    2     1000037         5   # BR(~t_2 -> ~chi_2+ b )
     2.76651438E-01    2     1000021         6   # BR(~t_2 -> ~g      t )
     3.02660539E-02    2     1000006        25   # BR(~t_2 -> ~t_1    h )
     4.26556445E-02    2     1000006        23   # BR(~t_2 -> ~t_1    Z )
     2.10264695E-03    2     1000005        24   # BR(~t_2 -> ~b_1    W+)
#
#         PDG            Width
DECAY   1000005     5.27266447E+00   # sbottom1 decays
#          BR         NDA      ID1       ID2
     1.27257541E-02    2     1000022         5   # BR(~b_1 -> ~chi_10 b )
     1.53558554E-01    2     1000023         5   # BR(~b_1 -> ~chi_20 b )
     2.08374602E-01    2     1000025         5   # BR(~b_1 -> ~chi_30 b )
     2.05134114E-01    2     1000035         5   # BR(~b_1 -> ~chi_40 b )
     2.45652302E-02    2    -1000024         6   # BR(~b_1 -> ~chi_1- t )
     3.95641745E-01    2    -1000037         6   # BR(~b_1 -> ~chi_2- t )
#
#         PDG            Width
DECAY   2000005     1.02184104E+02   # sbottom2 decays
#          BR         NDA      ID1       ID2
     9.79380705E-02    2     1000022         5   # BR(~b_2 -> ~chi_10 b )
     3.84306884E-03    2     1000023         5   # BR(~b_2 -> ~chi_20 b )
     2.24967107E-02    2     1000025         5   # BR(~b_2 -> ~chi_30 b )
     2.11656311E-02    2     1000035         5   # BR(~b_2 -> ~chi_40 b )
     1.90650434E-01    2    -1000024         6   # BR(~b_2 -> ~chi_1- t )
     2.91739956E-01    2    -1000037         6   # BR(~b_2 -> ~chi_2- t )
     3.01116595E-01    2     1000021         5   # BR(~b_2 -> ~g      b )
     1.14868855E-03    2     1000005        25   # BR(~b_2 -> ~b_1    h )
     1.06330307E-03    2     1000005        23   # BR(~b_2 -> ~b_1    Z )
     6.88375417E-02    2     1000006       -24   # BR(~b_2 -> ~t_1    W-)
#
#         PDG            Width
DECAY   1000002     1.23723857E+02   # sup_L decays
#          BR         NDA      ID1       ID2
     9.34082425E-02    2     1000022         2   # BR(~u_L -> ~chi_10 u)
     3.53475922E-03    2     1000023         2   # BR(~u_L -> ~chi_20 u)
     1.19823616E-03    2     1000025         2   # BR(~u_L -> ~chi_30 u)
     3.33806602E-05    2     1000035         2   # BR(~u_L -> ~chi_40 u)
     1.89423638E-01    2     1000024         1   # BR(~u_L -> ~chi_1+ d)
     6.68724543E-04    2     1000037         1   # BR(~u_L -> ~chi_2+ d)
     7.11733019E-01    2     1000021         2   # BR(~u_L -> ~g      u)
#
#         PDG            Width
DECAY   2000002     1.66786400E+02   # sup_R decays
#          BR         NDA      ID1       ID2
     4.27808483E-07    2     1000022         2   # BR(~u_R -> ~chi_10 u)
     4.67775398E-02    2     1000023         2   # BR(~u_R -> ~chi_20 u)
     3.30219981E-05    2     1000025         2   # BR(~u_R -> ~chi_30 u)
     2.06453057E-03    2     1000035         2   # BR(~u_R -> ~chi_40 u)
     9.51124480E-01    2     1000021         2   # BR(~u_R -> ~g      u)
#
#         PDG            Width
DECAY   1000001     1.23755313E+02   # sdown_L decays
#          BR         NDA      ID1       ID2
     9.32067202E-02    2     1000022         1   # BR(~d_L -> ~chi_10 d)
     2.67256080E-03    2     1000023         1   # BR(~d_L -> ~chi_20 d)
     1.40995915E-03    2     1000025         1   # BR(~d_L -> ~chi_30 d)
     8.38534092E-04    2     1000035         1   # BR(~d_L -> ~chi_40 d)
     1.83882103E-01    2    -1000024         2   # BR(~d_L -> ~chi_1- u)
     5.72399444E-03    2    -1000037         2   # BR(~d_L -> ~chi_2- u)
     7.12266129E-01    2     1000021         1   # BR(~d_L -> ~g      d)
#
#         PDG            Width
DECAY   2000001     8.77344173E-02   # sdown_R decays
#          BR         NDA      ID1       ID2
     3.54987855E-05    2     1000022         1   # BR(~d_R -> ~chi_10 d)
     9.97252598E-01    2     1000023         1   # BR(~d_R -> ~chi_20 d)
     4.59694136E-05    2     1000025         1   # BR(~d_R -> ~chi_30 d)
     2.66593381E-03    2     1000035         1   # BR(~d_R -> ~chi_40 d)
#
#         PDG            Width
DECAY   1000004     1.04780337E+02   # scharm_L decays
#          BR         NDA      ID1       ID2
     1.14952878E-01    2     1000022         4   # BR(~c_L -> ~chi_10 c)
     4.34191183E-03    2     1000023         4   # BR(~c_L -> ~chi_20 c)
     1.47076847E-03    2     1000025         4   # BR(~c_L -> ~chi_30 c)
     4.09725874E-05    2     1000035         4   # BR(~c_L -> ~chi_40 c)
     2.33114104E-01    2     1000024         3   # BR(~c_L -> ~chi_1+ s)
     8.20811410E-04    2     1000037         3   # BR(~c_L -> ~chi_2+ s)
     6.45258553E-01    2     1000021         4   # BR(~c_L -> ~g      c)
#
#         PDG            Width
DECAY   2000004     1.30243989E+02   # scharm_R decays
#          BR         NDA      ID1       ID2
     5.68250124E-07    2     1000022         4   # BR(~c_R -> ~chi_10 c)
     6.20623882E-02    2     1000023         4   # BR(~c_R -> ~chi_20 c)
     4.37934534E-05    2     1000025         4   # BR(~c_R -> ~chi_30 c)
     2.73794821E-03    2     1000035         4   # BR(~c_R -> ~chi_40 c)
     9.35155302E-01    2     1000021         4   # BR(~c_R -> ~g      c)
#
#         PDG            Width
DECAY   1000003     1.04786833E+02   # sstrange_L decays
#          BR         NDA      ID1       ID2
     1.14726078E-01    2     1000022         3   # BR(~s_L -> ~chi_10 s)
     3.28344356E-03    2     1000023         3   # BR(~s_L -> ~chi_20 s)
     1.73096966E-03    2     1000025         3   # BR(~s_L -> ~chi_30 s)
     1.02943808E-03    2     1000035         3   # BR(~s_L -> ~chi_40 s)
     2.26336062E-01    2    -1000024         4   # BR(~s_L -> ~chi_1- c)
     7.02709731E-03    2    -1000037         4   # BR(~s_L -> ~chi_2- c)
     6.45866911E-01    2     1000021         3   # BR(~s_L -> ~g      s)
#
#         PDG            Width
DECAY   2000003     8.44177688E-02   # sstrange_R decays
#          BR         NDA      ID1       ID2
     3.59134331E-05    2     1000022         3   # BR(~s_R -> ~chi_10 s)
     9.97378582E-01    2     1000023         3   # BR(~s_R -> ~chi_20 s)
     4.38921502E-05    2     1000025         3   # BR(~s_R -> ~chi_30 s)
     2.54161221E-03    2     1000035         3   # BR(~s_R -> ~chi_40 s)
#
#         PDG            Width
DECAY   1000011     3.70765738E+01   # selectron_L decays
#          BR         NDA      ID1       ID2
     2.98968556E-01    2     1000022        11   # BR(~e_L -> ~chi_10 e-)
     9.18407215E-02    2     1000023        11   # BR(~e_L -> ~chi_20 e-)
     3.14048305E-03    2     1000025        11   # BR(~e_L -> ~chi_30 e-)
     9.47100977E-04    2     1000035        11   # BR(~e_L -> ~chi_40 e-)
     5.87201888E-01    2    -1000024        12   # BR(~e_L -> ~chi_1- nu_e)
     1.79012500E-02    2    -1000037        12   # BR(~e_L -> ~chi_2- nu_e)
#
#         PDG            Width
DECAY   2000011     8.08102522E-02   # selectron_R decays
#           BR         NDA      ID1       ID2
     2.47458187E-04    2     1000022        11   # BR(~e_R -> ~chi_10 e-)
     9.99752542E-01    2     1000023        11   # BR(~e_R -> ~chi_20 e-)
#
#         PDG            Width
DECAY   1000013     3.70765737E+01   # smuon_L decays
#          BR         NDA      ID1       ID2
     2.98968556E-01    2     1000022        13   # BR(~mu_L -> ~chi_10 mu-)
     9.18407213E-02    2     1000023        13   # BR(~mu_L -> ~chi_20 mu-)
     3.14048305E-03    2     1000025        13   # BR(~mu_L -> ~chi_30 mu-)
     9.47100975E-04    2     1000035        13   # BR(~mu_L -> ~chi_40 mu-)
     5.87201889E-01    2    -1000024        14   # BR(~mu_L -> ~chi_1- nu_mu)
     1.79012500E-02    2    -1000037        14   # BR(~mu_L -> ~chi_2- nu_mu)
#
#         PDG            Width
DECAY   2000013     8.08100601E-02   # smuon_R decays
#           BR         NDA      ID1       ID2
     2.47458757E-04    2     1000022        13   # BR(~mu_R -> ~chi_10 mu-)
     9.99752541E-01    2     1000023        13   # BR(~mu_R -> ~chi_20 mu-)
#
#         PDG            Width
DECAY   1000015     5.16841601E+01   # stau_1 decays
#          BR         NDA      ID1       ID2
     2.75858975E-01    2     1000022        15   # BR(~tau_1 -> ~chi_10  tau-)
     8.88779578E-02    2     1000023        15   # BR(~tau_1 -> ~chi_20  tau-)
     4.17545620E-02    2     1000025        15   # BR(~tau_1 -> ~chi_30  tau-)
     3.81484014E-02    2     1000035        15   # BR(~tau_1 -> ~chi_40  tau-)
     5.39004025E-01    2    -1000024        16   # BR(~tau_1 -> ~chi_1-  nu_tau)
     1.63560786E-02    2    -1000037        16   # BR(~tau_1 -> ~chi_2-  nu_tau)
#
#         PDG            Width
DECAY   2000015     2.85509551E+01   # stau_2 decays
#          BR         NDA      ID1       ID2
     2.03149753E-03    2     1000022        15   # BR(~tau_2 -> ~chi_10  tau-)
     6.54965942E-01    2     1000023        15   # BR(~tau_2 -> ~chi_20  tau-)
     7.85441316E-02    2     1000025        15   # BR(~tau_2 -> ~chi_30  tau-)
     1.04160315E-01    2     1000035        15   # BR(~tau_2 -> ~chi_40  tau-)
     4.00379223E-03    2    -1000024        16   # BR(~tau_2 -> ~chi_1-  nu_tau)
     1.55382854E-01    2    -1000037        16   # BR(~tau_2 -> ~chi_2-  nu_tau)
     4.50866517E-04    2     1000016       -24   # BR(~tau_2 -> ~nu_tauL W-)
     2.39788374E-04    2     1000015        25   # BR(~tau_2 -> ~tau_1   h)
     2.20812529E-04    2     1000015        23   # BR(~tau_2 -> ~tau_1   Z)
#
#         PDG            Width
DECAY   1000012     3.71049173E+01   # snu_eL decays
#          BR         NDA      ID1       ID2
     2.96595367E-01    2     1000022        12   # BR(~nu_eL -> ~chi_10 nu_e)
     8.35613914E-02    2     1000023        12   # BR(~nu_eL -> ~chi_20 nu_e)
     5.11862366E-03    2     1000025        12   # BR(~nu_eL -> ~chi_30 nu_e)
     8.48965525E-03    2     1000035        12   # BR(~nu_eL -> ~chi_40 nu_e)
     6.04146329E-01    2     1000024        11   # BR(~nu_eL -> ~chi_1+ e-)
     2.08863293E-03    2     1000037        11   # BR(~nu_eL -> ~chi_2+ e-)
#
#         PDG            Width
DECAY   1000014     3.71049173E+01   # snu_muL decays
#          BR         NDA      ID1       ID2
     2.96595368E-01    2     1000022        14   # BR(~nu_muL -> ~chi_10 nu_mu)
     8.35613915E-02    2     1000023        14   # BR(~nu_muL -> ~chi_20 nu_mu)
     5.11862367E-03    2     1000025        14   # BR(~nu_muL -> ~chi_30 nu_mu)
     8.48965527E-03    2     1000035        14   # BR(~nu_muL -> ~chi_40 nu_mu)
     6.04146329E-01    2     1000024        13   # BR(~nu_muL -> ~chi_1+ mu-)
     2.08863293E-03    2     1000037        13   # BR(~nu_muL -> ~chi_2+ mu-)
#
#         PDG            Width
DECAY   1000016     5.17026206E+01   # snu_tauL decays
#          BR         NDA      ID1       ID2
     2.72007742E-01    2     1000022        16   # BR(~nu_tauL -> ~chi_10 nu_tau)
     7.85784327E-02    2     1000023        16   # BR(~nu_tauL -> ~chi_20 nu_tau)
     4.90773827E-03    2     1000025        16   # BR(~nu_tauL -> ~chi_30 nu_tau)
     8.14187595E-03    2     1000035        16   # BR(~nu_tauL -> ~chi_40 nu_tau)
     5.56902784E-01    2     1000024        15   # BR(~nu_tauL -> ~chi_1+ tau-)
     7.94614269E-02    2     1000037        15   # BR(~nu_tauL -> ~chi_2+ tau-)
#
#         PDG            Width
DECAY   1000024     5.59255290E-15   # chargino1+ decays
#           BR         NDA      ID1       ID2       ID3
     1.95609100E-02    3     1000022       -11        12   # BR(~chi_1+ -> ~chi_10 e+   nu_e)
     3.34535970E-03    3     1000022       -13        14   # BR(~chi_1+ -> ~chi_10 mu+  nu_mu)
     9.77093730E-01    2     1000022       211             # BR(~chi_1+ -> ~chi_10 pi+)
#
#         PDG            Width
DECAY   1000037     4.19754603E+00   # chargino2+ decays
#          BR         NDA      ID1       ID2
     3.28461674E-01    2     1000024        23   # BR(~chi_2+ -> ~chi_1+  Z )
     3.25816483E-01    2     1000022        24   # BR(~chi_2+ -> ~chi_10  W+)
     3.96856892E-02    2     1000023        24   # BR(~chi_2+ -> ~chi_20  W+)
     3.06036154E-01    2     1000024        25   # BR(~chi_2+ -> ~chi_1+  h )
#
#         PDG            Width
DECAY   1000022     0.00000000E+00   # neutralino1 decays
#
#         PDG            Width
DECAY   1000023     6.96290766E-02   # neutralino2 decays
#          BR         NDA      ID1       ID2
     2.91490814E-01    2     1000022        23   # BR(~chi_20 -> ~chi_10   Z )
     3.37153200E-01    2     1000024       -24   # BR(~chi_20 -> ~chi_1+   W-)
     3.37153200E-01    2    -1000024        24   # BR(~chi_20 -> ~chi_1-   W+)
     3.42027867E-02    2     1000022        25   # BR(~chi_20 -> ~chi_10   h )
#
#         PDG            Width
DECAY   1000025     4.21466926E+00   # neutralino3 decays
#          BR         NDA      ID1       ID2
     6.68374010E-02    2     1000022        23   # BR(~chi_30 -> ~chi_10   Z )
     2.96900190E-02    2     1000023        23   # BR(~chi_30 -> ~chi_20   Z )
     3.27550942E-01    2     1000024       -24   # BR(~chi_30 -> ~chi_1+   W-)
     3.27550942E-01    2    -1000024        24   # BR(~chi_30 -> ~chi_1-   W+)
     2.48138430E-01    2     1000022        25   # BR(~chi_30 -> ~chi_10   h )
     1.49282150E-04    2     1000023        25   # BR(~chi_30 -> ~chi_20   h )
     2.07462636E-05    2     2000011       -11   # BR(~chi_30 -> ~e_R-     e+)
     2.07462636E-05    2    -2000011        11   # BR(~chi_30 -> ~e_R+     e-)
     2.07462636E-05    2     2000013       -13   # BR(~chi_30 -> ~mu_R-    mu+)
     2.07462636E-05    2    -2000013        13   # BR(~chi_30 -> ~mu_R+    mu-)
#
#         PDG            Width
DECAY   1000035     4.12085739E+00   # neutralino4 decays
#          BR         NDA      ID1       ID2
     2.60288802E-01    2     1000022        23   # BR(~chi_40 -> ~chi_10   Z )
     1.11280970E-03    2     1000023        23   # BR(~chi_40 -> ~chi_20   Z )
     3.23897869E-01    2     1000024       -24   # BR(~chi_40 -> ~chi_1+   W-)
     3.23897869E-01    2    -1000024        24   # BR(~chi_40 -> ~chi_1-   W+)
     5.94576623E-02    2     1000022        25   # BR(~chi_40 -> ~chi_10   h )
     2.58829277E-02    2     1000023        25   # BR(~chi_40 -> ~chi_20   h )
     1.36551526E-03    2     2000011       -11   # BR(~chi_40 -> ~e_R-     e+)
     1.36551526E-03    2    -2000011        11   # BR(~chi_40 -> ~e_R+     e-)
     1.36551526E-03    2     2000013       -13   # BR(~chi_40 -> ~mu_R-    mu+)
     1.36551526E-03    2    -2000013        13   # BR(~chi_40 -> ~mu_R+    mu-)
#
#         PDG            Width
DECAY        25     4.35759010E-03   # h decays
#          BR         NDA      ID1       ID2
     6.03138110E-01    2           5        -5   # BR(h -> b       bb     )
     6.07697956E-02    2         -15        15   # BR(h -> tau+    tau-   )
     2.15094675E-04    2         -13        13   # BR(h -> mu+     mu-    )
     2.34200392E-04    2           3        -3   # BR(h -> s       sb     )
     2.00042187E-02    2           4        -4   # BR(h -> c       cb     )
     7.47133886E-02    2          21        21   # BR(h -> g       g      )
     2.22417568E-03    2          22        22   # BR(h -> gam     gam    )
     1.53749982E-03    2          22        23   # BR(h -> Z       gam    )
     2.10592095E-01    2          24       -24   # BR(h -> W+      W-     )
     2.65714216E-02    2          23        23   # BR(h -> Z       Z      )
#
#         PDG            Width
DECAY        35     2.74216532E+01   # H decays
#          BR         NDA      ID1       ID2
     4.21401628E-01    2           5        -5   # BR(H -> b       bb     )
     7.18205667E-02    2         -15        15   # BR(H -> tau+    tau-   )
     2.53244901E-04    2         -13        13   # BR(H -> mu+     mu-    )
     1.51293719E-04    2           3        -3   # BR(H -> s       sb     )
     4.38803355E-08    2           4        -4   # BR(H -> c       cb     )
     4.17706405E-03    2           6        -6   # BR(H -> t       tb     )
     1.58612529E-05    2          21        21   # BR(H -> g       g      )
     1.46978708E-07    2          22        22   # BR(H -> gam     gam    )
     8.31476174E-09    2          23        22   # BR(H -> Z       gam    )
     5.51631267E-06    2          24       -24   # BR(H -> W+      W-     )
     2.74292286E-06    2          23        23   # BR(H -> Z       Z      )
     2.22391703E-05    2          25        25   # BR(H -> h       h      )
     1.41016369E-02    2     1000024  -1000024   # BR(H -> ~chi_1+ ~chi_1-)
     1.77993957E-04    2     1000037  -1000037   # BR(H -> ~chi_2+ ~chi_2-)
     1.50670420E-01    2     1000024  -1000037   # BR(H -> ~chi_1+ ~chi_2-)
     1.50670420E-01    2     1000037  -1000024   # BR(H -> ~chi_2+ ~chi_1-)
     7.00177616E-03    2     1000022   1000022   # BR(H -> ~chi_10 ~chi_10)
     1.48904863E-03    2     1000023   1000023   # BR(H -> ~chi_20 ~chi_20)
     5.35897128E-04    2     1000025   1000025   # BR(H -> ~chi_30 ~chi_30)
     9.30313053E-04    2     1000035   1000035   # BR(H -> ~chi_40 ~chi_40)
     1.10629416E-02    2     1000022   1000023   # BR(H -> ~chi_10 ~chi_20)
     5.48621915E-02    2     1000022   1000025   # BR(H -> ~chi_10 ~chi_30)
     8.22386706E-02    2     1000022   1000035   # BR(H -> ~chi_10 ~chi_40)
     1.56949814E-02    2     1000023   1000025   # BR(H -> ~chi_20 ~chi_30)
     7.16115909E-03    2     1000023   1000035   # BR(H -> ~chi_20 ~chi_40)
     5.55107257E-03    2     1000025   1000035   # BR(H -> ~chi_30 ~chi_40)
     9.36029090E-08    2     2000001  -2000001   # BR(H -> ~d_R    ~d_R*  )
     9.36029090E-08    2     2000003  -2000003   # BR(H -> ~s_R    ~s_R*  )
     4.67072710E-07    2     2000011  -2000011   # BR(H -> ~e_R-   ~e_R+  )
     4.67072710E-07    2     2000013  -2000013   # BR(H -> ~mu_R-  ~mu_R+ )
#
#         PDG            Width
DECAY        36     2.74184462E+01   # A decays
#          BR         NDA      ID1       ID2
     4.21483780E-01    2           5        -5   # BR(A -> b       bb     )
     7.18306904E-02    2         -15        15   # BR(A -> tau+    tau-   )
     2.53279342E-04    2         -13        13   # BR(A -> mu+     mu-    )
     1.51332643E-04    2           3        -3   # BR(A -> s       sb     )
     4.35481626E-08    2           4        -4   # BR(A -> c       cb     )
     4.25147246E-03    2           6        -6   # BR(A -> t       tb     )
     5.01509275E-05    2          21        21   # BR(A -> g       g      )
     2.79467608E-07    2          22        22   # BR(A -> gam     gam    )
     3.03901118E-08    2          23        22   # BR(A -> Z       gam    )
     5.53664143E-06    2          23        25   # BR(A -> Z       h      )
     1.60103651E-02    2     1000024  -1000024   # BR(A -> ~chi_1+ ~chi_1-)
     1.15430425E-03    2     1000037  -1000037   # BR(A -> ~chi_2+ ~chi_2-)
     1.49136857E-01    2     1000024  -1000037   # BR(A -> ~chi_1+ ~chi_2-)
     1.49136857E-01    2     1000037  -1000024   # BR(A -> ~chi_2+ ~chi_1-)
     7.95459389E-03    2     1000022   1000022   # BR(A -> ~chi_10 ~chi_10)
     2.40813852E-03    2     1000023   1000023   # BR(A -> ~chi_20 ~chi_20)
     2.45434682E-03    2     1000025   1000025   # BR(A -> ~chi_30 ~chi_30)
     3.09914432E-03    2     1000035   1000035   # BR(A -> ~chi_40 ~chi_40)
     8.36293622E-03    2     1000022   1000023   # BR(A -> ~chi_10 ~chi_20)
     8.64356211E-02    2     1000022   1000025   # BR(A -> ~chi_10 ~chi_30)
     5.18822712E-02    2     1000022   1000035   # BR(A -> ~chi_10 ~chi_40)
     7.80777587E-03    2     1000023   1000025   # BR(A -> ~chi_20 ~chi_30)
     1.46814285E-02    2     1000023   1000035   # BR(A -> ~chi_20 ~chi_40)
     1.44876531E-03    2     1000025   1000035   # BR(A -> ~chi_30 ~chi_40)
#
#         PDG            Width
DECAY        37     2.63167984E+01   # H+ decays
#          BR         NDA      ID1       ID2
     6.73531099E-04    2           4        -5   # BR(H+ -> c       bb     )
     7.49447550E-02    2         -15        16   # BR(H+ -> tau+    nu_tau )
     2.64259720E-04    2         -13        14   # BR(H+ -> mu+     nu_mu  )
     6.73528369E-06    2           2        -5   # BR(H+ -> u       bb     )
     7.87826428E-06    2           2        -3   # BR(H+ -> u       sb     )
     1.55111547E-04    2           4        -3   # BR(H+ -> c       sb     )
     4.02356618E-01    2           6        -5   # BR(H+ -> t       bb     )
     5.80675692E-06    2          24        25   # BR(H+ -> W+      h      )
     3.03237433E-12    2          24        36   # BR(H+ -> W+      A      )
     8.30349318E-08    2     1000024   1000022   # BR(H+ -> ~chi_1+ ~chi_10)
     2.06376423E-02    2     1000024   1000023   # BR(H+ -> ~chi_1+ ~chi_20)
     1.60026748E-01    2     1000024   1000025   # BR(H+ -> ~chi_1+ ~chi_30)
     1.44953111E-01    2     1000024   1000035   # BR(H+ -> ~chi_1+ ~chi_40)
     1.65479851E-01    2     1000037   1000022   # BR(H+ -> ~chi_2+ ~chi_10)
     2.58582600E-02    2     1000037   1000023   # BR(H+ -> ~chi_2+ ~chi_20)
     4.17923495E-04    2     1000037   1000025   # BR(H+ -> ~chi_2+ ~chi_30)
     4.21168518E-03    2     1000037   1000035   # BR(H+ -> ~chi_2+ ~chi_40)
