#
#                              ======================
#                              | THE SUSYHIT OUTPUT |
#                              ======================
#
#
#              ------------------------------------------------------
#              |     This is the output of the SUSY-HIT package     |
#              |  created by A.Djouadi, M.Muehlleitner and M.Spira. |
#              |  In case of problems with SUSY-HIT email to        |
#              |           margarete.muehlleitner@cern.ch           |
#              |           michael.spira@psi.ch                     |
#              |           abdelhak.djouadi@cern.ch                 |
#              ------------------------------------------------------
#
#              ------------------------------------------------------
#              |  SUSY Les Houches Accord - MSSM Spectrum + Decays  |
#              |              based on the decay programs           |
#              |                                                    |
#              |                     SDECAY 1.3b                    |
#              |                                                    |
#              |  Authors: M.Muhlleitner, A.Djouadi and Y.Mambrini  |
#              |  Ref.:    Comput.Phys.Commun.168(2005)46           |
#              |           [hep-ph/0311167]                         |
#              |                                                    |
#              |                     HDECAY 3.4                     |
#              |                                                    |
#              |  By: A.Djouadi,J.Kalinowski,M.Muhlleitner,M.Spira  |
#              |  Ref.:    Comput.Phys.Commun.108(1998)56           |
#              |           [hep-ph/9704448]                         |
#              |                                                    |
#              |                                                    |
#              |  If not stated otherwise all DRbar couplings and   |
#              |  soft SUSY breaking masses are given at the scale  |
#              |  Q=  0.25746010E+04
#              |                                                    |
#              ------------------------------------------------------
#
#
BLOCK DCINFO  # Decay Program information
     1   SDECAY/HDECAY # decay calculator
     2   1.3b  /3.4    # version number
#
BLOCK SPINFO  # Spectrum calculator information
     1     SOFTSUSY    # spectrum calculator               
     2     3.4.0       # version number                    
#
BLOCK MODSEL  # Model selection
     1     0   #  nonUniversal                                     
#
BLOCK SMINPUTS  # Standard Model inputs
         1     1.27908970E+02   # alpha_em^-1(M_Z)^MSbar
         2     1.16637870E-05   # G_F [GeV^-2]
         3     1.18400000E-01   # alpha_S(M_Z)^MSbar
         4     9.11876000E+01   # M_Z pole mass
         5     4.18000000E+00   # mb(mb)^MSbar
         6     1.73200000E+02   # mt pole mass
         7     1.77700000E+00   # mtau pole mass
#
BLOCK MINPAR  # Input parameters - minimal models
         3     1.24000000E+01   # tanb                
#
BLOCK EXTPAR  # Input parameters - non-minimal models
         0    -1.00000000E+00   # Set                 
         1    -4.71600000E+01   # M_1(MX)             
         2    -2.36391000E+03   # M_2(MX)             
         3     1.07813000E+03   # M_3(MX)             
        11    -4.74978000E+03   # At(MX)              
        12     7.01530000E+02   # Ab(MX)              
        13    -8.98880000E+02   # Atau(MX)            
        23     2.51330000E+02   # mu(MX)              
        26     1.36465000E+03   # mA(pole)            
        31     1.82060000E+02   # meL(MX)             
        32     1.82060000E+02   # mmuL(MX)            
        33     3.98040000E+02   # mtauL(MX)           
        34     1.53182000E+03   # meR(MX)             
        35     1.53182000E+03   # mmuR(MX)            
        36     2.73359000E+03   # mtauR(MX)           
        41     2.52030000E+02   # mqL1(MX)            
        42     2.52030000E+02   # mqL2(MX)            
        43     2.58832000E+03   # mqL3(MX)            
        44     2.57416000E+03   # muR(MX)             
        45     2.57416000E+03   # mcR(MX)             
        46     2.56714000E+03   # mtR(MX)             
        47     3.16150000E+02   # mdR(MX)             
        48     3.16150000E+02   # msR(MX)             
        49     1.84850000E+03   # mbR(MX)             
#
BLOCK MASS  # Mass Spectrum
# PDG code           mass       particle
        24     8.03812506E+01   # W+
        25     1.27148228E+02   # h
        35     1.36475479E+03   # H
        36     1.36464996E+03   # A
        37     1.36725391E+03   # H+
         5     4.81876030E+00   # b-quark pole mass calculated from mb(mb)_Msbar
   1000001     4.93366214E+02   # ~d_L
   2000001     4.79373503E+02   # ~d_R
   1000002     4.87157155E+02   # ~u_L
   2000002     2.60697278E+03   # ~u_R
   1000003     4.93366214E+02   # ~s_L
   2000003     4.79373503E+02   # ~s_R
   1000004     4.87157155E+02   # ~c_L
   2000004     2.60697278E+03   # ~c_R
   1000005     1.88841301E+03   # ~b_1
   2000005     2.58587673E+03   # ~b_2
   1000006     2.40692096E+03   # ~t_1
   2000006     2.67701964E+03   # ~t_2
   1000011     2.83633766E+02   # ~e_L
   2000011     1.53766501E+03   # ~e_R
   1000012     2.73021772E+02   # ~nu_eL
   1000013     2.83633766E+02   # ~mu_L
   2000013     1.53766501E+03   # ~mu_R
   1000014     2.73021772E+02   # ~nu_muL
   1000015     4.55225555E+02   # ~tau_1
   2000015     2.73770212E+03   # ~tau_2
   1000016     4.48543605E+02   # ~nu_tauL
   1000021     1.19911830E+03   # ~g
   1000022    -4.62790207E+01   # ~chi_10
   1000023    -2.65464197E+02   # ~chi_20
   1000025     2.67568217E+02   # ~chi_30
   1000035    -2.34570198E+03   # ~chi_40
   1000024     2.63227399E+02   # ~chi_1+
   1000037     2.34586164E+03   # ~chi_2+
#
BLOCK NMIX  # Neutralino Mixing Matrix
  1  1     9.85799518E-01   # N_11
  1  2    -4.58038814E-05   # N_12
  1  3     1.67181931E-01   # N_13
  1  4     1.57959196E-02   # N_14
  2  1    -1.29462130E-01   # N_21
  2  2    -2.46089816E-02   # N_22
  2  3     6.96755163E-01   # N_23
  2  4     7.05100133E-01   # N_24
  3  1     1.06950596E-01   # N_31
  3  2    -2.31826883E-02   # N_32
  3  3    -6.97553925E-01   # N_33
  3  4     7.08126158E-01   # N_34
  4  1    -6.61753711E-04   # N_41
  4  2     9.99428316E-01   # N_42
  4  3     9.83479579E-04   # N_43
  4  4     3.37881038E-02   # N_44
#
BLOCK UMIX  # Chargino Mixing Matrix U
  1  1    -1.44793452E-03   # U_11
  1  2     9.99998952E-01   # U_12
  2  1    -9.99998952E-01   # U_21
  2  2    -1.44793452E-03   # U_22
#
BLOCK VMIX  # Chargino Mixing Matrix V
  1  1     4.80039196E-02   # V_11
  1  2     9.98847147E-01   # V_12
  2  1     9.98847147E-01   # V_21
  2  2    -4.80039196E-02   # V_22
#
BLOCK STOPMIX  # Stop Mixing Matrix
  1  1     5.81016010E-01   # cos(theta_t)
  1  2     8.13892128E-01   # sin(theta_t)
  2  1    -8.13892128E-01   # -sin(theta_t)
  2  2     5.81016010E-01   # cos(theta_t)
#
BLOCK SBOTMIX  # Sbottom Mixing Matrix
  1  1     1.72570643E-03   # cos(theta_b)
  1  2     9.99998511E-01   # sin(theta_b)
  2  1    -9.99998511E-01   # -sin(theta_b)
  2  2     1.72570643E-03   # cos(theta_b)
#
BLOCK STAUMIX  # Stau Mixing Matrix
  1  1     9.99999569E-01   # cos(theta_tau)
  1  2     9.28439451E-04   # sin(theta_tau)
  2  1    -9.28439451E-04   # -sin(theta_tau)
  2  2     9.99999569E-01   # cos(theta_tau)
#
BLOCK ALPHA  # Higgs mixing
          -8.52001756E-02   # Mixing angle in the neutral Higgs boson sector
#
BLOCK HMIX Q=  2.57460100E+03  # DRbar Higgs Parameters
         1     2.54721937E+02   # mu(Q)MSSM           
         2     1.18544675E+01   # tan                 
         3     2.42246186E+02   # higgs               
         4     1.76979036E+06   # mA^2(Q)MSSM         
#
BLOCK GAUGE Q=  2.57460100E+03  # The gauge couplings
     1     3.65271987E-01   # gprime(Q) DRbar
     2     6.41355893E-01   # g(Q) DRbar
     3     1.03852622E+00   # g3(Q) DRbar
#
BLOCK AU Q=  2.57460100E+03  # The trilinear couplings
  1  1     0.00000000E+00   # A_u(Q) DRbar
  2  2     0.00000000E+00   # A_c(Q) DRbar
  3  3    -4.74977999E+03   # A_t(Q) DRbar
#
BLOCK AD Q=  2.57460100E+03  # The trilinear couplings
  1  1     0.00000000E+00   # A_d(Q) DRbar
  2  2     0.00000000E+00   # A_s(Q) DRbar
  3  3     7.01530001E+02   # A_b(Q) DRbar
#
BLOCK AE Q=  2.57460100E+03  # The trilinear couplings
  1  1     0.00000000E+00   # A_e(Q) DRbar
  2  2     0.00000000E+00   # A_mu(Q) DRbar
  3  3    -8.98880000E+02   # A_tau(Q) DRbar
#
BLOCK Yu Q=  2.57460100E+03  # The Yukawa couplings
  1  1     0.00000000E+00   # y_u(Q) DRbar
  2  2     0.00000000E+00   # y_c(Q) DRbar
  3  3     8.22463108E-01   # y_t(Q) DRbar
#
BLOCK Yd Q=  2.57460100E+03  # The Yukawa couplings
  1  1     0.00000000E+00   # y_d(Q) DRbar
  2  2     0.00000000E+00   # y_s(Q) DRbar
  3  3     1.60544659E-01   # y_b(Q) DRbar
#
BLOCK Ye Q=  2.57460100E+03  # The Yukawa couplings
  1  1     0.00000000E+00   # y_e(Q) DRbar
  2  2     0.00000000E+00   # y_mu(Q) DRbar
  3  3     1.20108304E-01   # y_tau(Q) DRbar
#
BLOCK MSOFT Q=  2.57460100E+03  # The soft SUSY breaking masses at the scale Q
         1    -4.71600000E+01   # M_1(Q)              
         2    -2.36391000E+03   # M_2(Q)              
         3     1.07813000E+03   # M_3(Q)              
        21     1.72889262E+06   # mH1^2(Q)            
        22     4.74426186E+04   # mH2^2(Q)            
        31     1.82060000E+02   # meL(Q)              
        32     1.82060000E+02   # mmuL(Q)             
        33     3.98040000E+02   # mtauL(Q)            
        34     1.53182000E+03   # meR(Q)              
        35     1.53182000E+03   # mmuR(Q)             
        36     2.73359000E+03   # mtauR(Q)            
        41     2.52029984E+02   # mqL1(Q)             
        42     2.52029984E+02   # mqL2(Q)             
        43     2.58831999E+03   # mqL3(Q)             
        44     2.57416000E+03   # muR(Q)              
        45     2.57416000E+03   # mcR(Q)              
        46     2.56713999E+03   # mtR(Q)              
        47     3.16149987E+02   # mdR(Q)              
        48     3.16149987E+02   # msR(Q)              
        49     1.84850000E+03   # mbR(Q)              
#
Block HiggsBoundsInputHiggsCouplingsFermions
# ScalarNormEffCoupSq PseudoSNormEffCoupSq NP   IP1 IP2 IP2
    1.02488105E+00    0.00000000E+00        3  25   5   5  # h0-b-b eff. coupling^2, normalised to SM
    1.40503519E+02    0.00000000E+00        3  35   5   5  # H0-b-b eff. coupling^2, normalised to SM
    0.00000000E+00    1.40528400E+02        3  36   5   5  # A0-b-b eff. coupling^2, normalised to SM
#
    9.99822946E-01    0.00000000E+00        3  25   6   6  # h0-t-t eff. coupling^2, normalised to SM
    7.29305288E-03    0.00000000E+00        3  35   6   6  # H0-t-t eff. coupling^2, normalised to SM
    0.00000000E+00    7.11599934E-03        3  36   6   6  # A0-t-t eff. coupling^2, normalised to SM
#
    1.02488105E+00    0.00000000E+00        3  25  15  15  # h0-tau-tau eff. coupling^2, normalised to SM
    1.40503519E+02    0.00000000E+00        3  35  15  15  # H0-tau-tau eff. coupling^2, normalised to SM
    0.00000000E+00    1.40528400E+02        3  36  15  15  # A0-tau-tau eff. coupling^2, normalised to SM
#
Block HiggsBoundsInputHiggsCouplingsBosons
    9.99998912E-01        3  25  24  24  # h0-W-W eff. coupling^2, normalised to SM
    1.08792366E-06        3  35  24  24  # H0-W-W eff. coupling^2, normalised to SM
    0.00000000E+00        3  36  24  24  # A0-W-W eff. coupling^2, normalised to SM
#
    9.99998912E-01        3  25  23  23  # h0-Z-Z eff. coupling^2, normalised to SM
    1.08792366E-06        3  35  23  23  # H0-Z-Z eff. coupling^2, normalised to SM
    0.00000000E+00        3  36  23  23  # A0-Z-Z eff. coupling^2, normalised to SM
#
    8.88576226E-01        3  25  21  21  # h0-g-g eff. coupling^2, normalised to SM
    3.80337289E-09        3  35  21  21  # H0-g-g eff. coupling^2, normalised to SM
    5.34249950E-08        3  36  21  21  # A0-g-g eff. coupling^2, normalised to SM
#
    0.00000000E+00        3  25  25  23  # h0-h0-Z eff. coupling^2, normalised to SM
    0.00000000E+00        3  35  25  23  # H0-h0-Z eff. coupling^2, normalised to SM
    1.08792366E-06        3  36  25  23  # A0-h0-Z eff. coupling^2, normalised to SM
    0.00000000E+00        3  35  35  23  # H0-H0-Z eff. coupling^2, normalised to SM
    9.99998912E-01        3  36  35  23  # A0-H0-Z eff. coupling^2, normalised to SM
    0.00000000E+00        3  36  36  23  # A0-A0-Z eff. coupling^2, normalised to SM
#
    0.00000000E+00        4  25  21  21  23  # h0-g-g-Z eff. coupling^2, normalised to SM
    0.00000000E+00        4  35  21  21  23  # H0-g-g-Z eff. coupling^2, normalised to SM
    0.00000000E+00        4  36  21  21  23  # A0-g-g-Z eff. coupling^2, normalised to SM
#
#
#
#                             =================
#                             |The decay table|
#                             =================
#
# - The QCD corrections to the decays gluino -> squark  + quark
#                                     squark -> gaugino + quark_prime
#                                     squark -> squark_prime + Higgs
#                                     squark -> gluino  + quark
#   are included.
#
# - The multi-body decays for the inos, stops and sbottoms are included.
#
# - The loop induced decays for the gluino, neutralinos and stops
#   are included.
#
# - The SUSY decays of the top quark are included.
#
#
#         PDG            Width
DECAY         6     1.44905857E+00   # top decays
#          BR         NDA      ID1       ID2
     1.00000000E+00    2           5        24   # BR(t ->  b    W+)
#
#         PDG            Width
DECAY   1000021     1.12059459E+02   # gluino decays
#          BR         NDA      ID1       ID2
     8.24228460E-02    2     1000001        -1   # BR(~g -> ~d_L  db)
     8.24228460E-02    2    -1000001         1   # BR(~g -> ~d_L* d )
     8.43119970E-02    2     2000001        -1   # BR(~g -> ~d_R  db)
     8.43119970E-02    2    -2000001         1   # BR(~g -> ~d_R* d )
     8.32651907E-02    2     1000002        -2   # BR(~g -> ~u_L  ub)
     8.32651907E-02    2    -1000002         2   # BR(~g -> ~u_L* u )
     8.24228460E-02    2     1000003        -3   # BR(~g -> ~s_L  sb)
     8.24228460E-02    2    -1000003         3   # BR(~g -> ~s_L* s )
     8.43119970E-02    2     2000003        -3   # BR(~g -> ~s_R  sb)
     8.43119970E-02    2    -2000003         3   # BR(~g -> ~s_R* s )
     8.32651233E-02    2     1000004        -4   # BR(~g -> ~c_L  cb)
     8.32651233E-02    2    -1000004         4   # BR(~g -> ~c_L* c )
#
#         PDG            Width
DECAY   1000006     1.38125682E+02   # stop1 decays
#          BR         NDA      ID1       ID2
     2.59620679E-02    2     1000022         6   # BR(~t_1 -> ~chi_10 t )
     1.19003256E-01    2     1000023         6   # BR(~t_1 -> ~chi_20 t )
     1.05169310E-01    2     1000025         6   # BR(~t_1 -> ~chi_30 t )
     1.46235298E-01    2     1000024         5   # BR(~t_1 -> ~chi_1+ b )
     1.41760011E-04    2     1000037         5   # BR(~t_1 -> ~chi_2+ b )
     6.03484789E-01    2     1000021         6   # BR(~t_1 -> ~g      t )
     3.51901290E-06    2     1000005        24   # BR(~t_1 -> ~b_1    W+)
#
#         PDG            Width
DECAY   2000006     1.52514969E+02   # stop2 decays
#          BR         NDA      ID1       ID2
     1.62763134E-02    2     1000022         6   # BR(~t_2 -> ~chi_10 t )
     1.08949821E-01    2     1000023         6   # BR(~t_2 -> ~chi_20 t )
     1.23884053E-01    2     1000025         6   # BR(~t_2 -> ~chi_30 t )
     2.09182532E-03    2     1000035         6   # BR(~t_2 -> ~chi_40 t )
     9.22957837E-02    2     1000024         5   # BR(~t_2 -> ~chi_1+ b )
     4.67338698E-03    2     1000037         5   # BR(~t_2 -> ~chi_2+ b )
     5.89681145E-01    2     1000021         6   # BR(~t_2 -> ~g      t )
     6.72198972E-03    2     1000006        25   # BR(~t_2 -> ~t_1    h )
     5.37492239E-02    2     1000006        23   # BR(~t_2 -> ~t_1    Z )
     1.96069867E-05    2     1000005        24   # BR(~t_2 -> ~b_1    W+)
     1.65685065E-03    2     2000005        24   # BR(~t_2 -> ~b_2    W+)
#
#         PDG            Width
DECAY   1000005     4.14399528E+01   # sbottom1 decays
#          BR         NDA      ID1       ID2
     2.67648693E-02    2     1000022         5   # BR(~b_1 -> ~chi_10 b )
     1.13220172E-02    2     1000023         5   # BR(~b_1 -> ~chi_20 b )
     1.12028032E-02    2     1000025         5   # BR(~b_1 -> ~chi_30 b )
     2.20679377E-02    2    -1000024         6   # BR(~b_1 -> ~chi_1- t )
     9.28642373E-01    2     1000021         5   # BR(~b_1 -> ~g      b )
#
#         PDG            Width
DECAY   2000005     1.33656509E+02   # sbottom2 decays
#          BR         NDA      ID1       ID2
     3.04031620E-03    2     1000022         5   # BR(~b_2 -> ~chi_10 b )
     4.71837285E-03    2     1000023         5   # BR(~b_2 -> ~chi_20 b )
     4.87707211E-03    2     1000025         5   # BR(~b_2 -> ~chi_30 b )
     2.48096832E-03    2     1000035         5   # BR(~b_2 -> ~chi_40 b )
     2.52076779E-01    2    -1000024         6   # BR(~b_2 -> ~chi_1- t )
     3.64829518E-03    2    -1000037         6   # BR(~b_2 -> ~chi_2- t )
     6.82094116E-01    2     1000021         5   # BR(~b_2 -> ~g      b )
     1.27750687E-05    2     1000005        25   # BR(~b_2 -> ~b_1    h )
     1.24267766E-05    2     1000005        23   # BR(~b_2 -> ~b_1    Z )
     4.70388790E-02    2     1000006       -24   # BR(~b_2 -> ~t_1    W-)
#
#         PDG            Width
DECAY   1000002     7.74427958E-02   # sup_L decays
#          BR         NDA      ID1       ID2
     9.06943772E-01    2     1000022         2   # BR(~u_L -> ~chi_10 u)
     3.17028630E-02    2     1000023         2   # BR(~u_L -> ~chi_20 u)
     1.07155314E-04    2     1000025         2   # BR(~u_L -> ~chi_30 u)
     6.12462095E-02    2     1000024         1   # BR(~u_L -> ~chi_1+ d)
#
#         PDG            Width
DECAY   2000002     1.44060425E+02   # sup_R decays
#          BR         NDA      ID1       ID2
     3.99613871E-02    2     1000022         2   # BR(~u_R -> ~chi_10 u)
     6.76210411E-04    2     1000023         2   # BR(~u_R -> ~chi_20 u)
     4.61341083E-04    2     1000025         2   # BR(~u_R -> ~chi_30 u)
     6.81564405E-10    2     1000035         2   # BR(~u_R -> ~chi_40 u)
     9.58901061E-01    2     1000021         2   # BR(~u_R -> ~g      u)
#
#         PDG            Width
DECAY   1000001     7.31488707E-02   # sdown_L decays
#          BR         NDA      ID1       ID2
     9.73173419E-01    2     1000022         1   # BR(~d_L -> ~chi_10 d)
     1.41554770E-08    2     1000023         1   # BR(~d_L -> ~chi_20 d)
     2.67656294E-02    2     1000025         1   # BR(~d_L -> ~chi_30 d)
     6.09371026E-05    2    -1000024         2   # BR(~d_L -> ~chi_1- u)
#
#         PDG            Width
DECAY   2000001     2.80588033E-01   # sdown_R decays
#          BR         NDA      ID1       ID2
     9.85995221E-01    2     1000022         1   # BR(~d_R -> ~chi_10 d)
     8.37124224E-03    2     1000023         1   # BR(~d_R -> ~chi_20 d)
     5.63353724E-03    2     1000025         1   # BR(~d_R -> ~chi_30 d)
#
#         PDG            Width
DECAY   1000004     7.55205697E-02   # scharm_L decays
#          BR         NDA      ID1       ID2
     9.07350244E-01    2     1000022         4   # BR(~c_L -> ~chi_10 c)
     3.15614034E-02    2     1000023         4   # BR(~c_L -> ~chi_20 c)
     1.06666532E-04    2     1000025         4   # BR(~c_L -> ~chi_30 c)
     6.09816859E-02    2     1000024         3   # BR(~c_L -> ~chi_1+ s)
#
#         PDG            Width
DECAY   2000004     9.88688660E+01   # scharm_R decays
#          BR         NDA      ID1       ID2
     6.04213708E-02    2     1000022         4   # BR(~c_R -> ~chi_10 c)
     1.02121966E-03    2     1000023         4   # BR(~c_R -> ~chi_20 c)
     6.96715130E-04    2     1000025         4   # BR(~c_R -> ~chi_30 c)
     9.87614110E-10    2     1000035         4   # BR(~c_R -> ~chi_40 c)
     9.37860693E-01    2     1000021         4   # BR(~c_R -> ~g      c)
#
#         PDG            Width
DECAY   1000003     7.14045628E-02   # sstrange_L decays
#          BR         NDA      ID1       ID2
     9.73300860E-01    2     1000022         3   # BR(~s_L -> ~chi_10 s)
     1.40895562E-08    2     1000023         3   # BR(~s_L -> ~chi_20 s)
     2.66384680E-02    2     1000025         3   # BR(~s_L -> ~chi_30 s)
     6.06576537E-05    2    -1000024         4   # BR(~s_L -> ~chi_1- c)
#
#         PDG            Width
DECAY   2000003     2.73503370E-01   # sstrange_R decays
#          BR         NDA      ID1       ID2
     9.86065171E-01    2     1000022         3   # BR(~s_R -> ~chi_10 s)
     8.32978442E-03    2     1000023         3   # BR(~s_R -> ~chi_20 s)
     5.60504430E-03    2     1000025         3   # BR(~s_R -> ~chi_30 s)
#
#         PDG            Width
DECAY   1000011     3.46737668E-01   # selectron_L decays
#          BR         NDA      ID1       ID2
     9.99444165E-01    2     1000022        11   # BR(~e_L -> ~chi_10 e-)
     4.97837398E-04    2     1000023        11   # BR(~e_L -> ~chi_20 e-)
     5.77279715E-05    2     1000025        11   # BR(~e_L -> ~chi_30 e-)
     2.70045473E-07    2    -1000024        12   # BR(~e_L -> ~chi_1- nu_e)
#
#         PDG            Width
DECAY   2000011     8.13511866E+00   # selectron_R decays
#          BR         NDA      ID1       ID2
     9.73376305E-01    2     1000022        11   # BR(~e_R -> ~chi_10 e-)
     1.58304885E-02    2     1000023        11   # BR(~e_R -> ~chi_20 e-)
     1.07932064E-02    2     1000025        11   # BR(~e_R -> ~chi_30 e-)
#
#         PDG            Width
DECAY   1000013     3.46737563E-01   # smuon_L decays
#          BR         NDA      ID1       ID2
     9.99444175E-01    2     1000022        13   # BR(~mu_L -> ~chi_10 mu-)
     4.97828565E-04    2     1000023        13   # BR(~mu_L -> ~chi_20 mu-)
     5.77266667E-05    2     1000025        13   # BR(~mu_L -> ~chi_30 mu-)
     2.70045555E-07    2    -1000024        14   # BR(~mu_L -> ~chi_1- nu_mu)
#
#         PDG            Width
DECAY   2000013     8.13511859E+00   # smuon_R decays
#          BR         NDA      ID1       ID2
     9.73376305E-01    2     1000022        13   # BR(~mu_R -> ~chi_10 mu-)
     1.58304885E-02    2     1000023        13   # BR(~mu_R -> ~chi_20 mu-)
     1.07932063E-02    2     1000025        13   # BR(~mu_R -> ~chi_30 mu-)
#
#         PDG            Width
DECAY   1000015     6.42461989E-01   # stau_1 decays
#          BR         NDA      ID1       ID2
     9.00498073E-01    2     1000022        15   # BR(~tau_1 -> ~chi_10  tau-)
     5.54978970E-02    2     1000023        15   # BR(~tau_1 -> ~chi_20  tau-)
     4.39972729E-02    2     1000025        15   # BR(~tau_1 -> ~chi_30  tau-)
     6.75754531E-06    2    -1000024        16   # BR(~tau_1 -> ~chi_1-  nu_tau)
#
#         PDG            Width
DECAY   2000015     1.61945497E+01   # stau_2 decays
#          BR         NDA      ID1       ID2
     8.72967595E-01    2     1000022        15   # BR(~tau_2 -> ~chi_10  tau-)
     3.78794003E-02    2     1000023        15   # BR(~tau_2 -> ~chi_20  tau-)
     3.32523041E-02    2     1000025        15   # BR(~tau_2 -> ~chi_30  tau-)
     9.64395418E-08    2     1000035        15   # BR(~tau_2 -> ~chi_40  tau-)
     4.76232330E-02    2    -1000024        16   # BR(~tau_2 -> ~chi_1-  nu_tau)
     1.40613333E-07    2    -1000037        16   # BR(~tau_2 -> ~chi_2-  nu_tau)
     3.48796144E-03    2     1000016       -37   # BR(~tau_2 -> ~nu_tauL H-)
     6.35646244E-04    2     1000016       -24   # BR(~tau_2 -> ~nu_tauL W-)
     3.42533637E-04    2     1000015        25   # BR(~tau_2 -> ~tau_1   h)
     1.74180865E-03    2     1000015        35   # BR(~tau_2 -> ~tau_1   H)
     1.74329562E-03    2     1000015        36   # BR(~tau_2 -> ~tau_1   A)
     3.25985302E-04    2     1000015        23   # BR(~tau_2 -> ~tau_1   Z)
#
#         PDG            Width
DECAY   1000012     3.32289015E-01   # snu_eL decays
#          BR         NDA      ID1       ID2
     9.99861705E-01    2     1000022        12   # BR(~nu_eL -> ~chi_10 nu_e)
     2.41816731E-05    2     1000023        12   # BR(~nu_eL -> ~chi_20 nu_e)
     3.71894355E-05    2     1000025        12   # BR(~nu_eL -> ~chi_30 nu_e)
     7.69237489E-05    2     1000024        11   # BR(~nu_eL -> ~chi_1+ e-)
#
#         PDG            Width
DECAY   1000014     3.32289013E-01   # snu_muL decays
#          BR         NDA      ID1       ID2
     9.99861710E-01    2     1000022        14   # BR(~nu_muL -> ~chi_10 nu_mu)
     2.41816732E-05    2     1000023        14   # BR(~nu_muL -> ~chi_20 nu_mu)
     3.71894357E-05    2     1000025        14   # BR(~nu_muL -> ~chi_30 nu_mu)
     7.69191083E-05    2     1000024        13   # BR(~nu_muL -> ~chi_1+ mu-)
#
#         PDG            Width
DECAY   1000016     6.32774669E-01   # snu_tauL decays
#          BR         NDA      ID1       ID2
     8.95036092E-01    2     1000022        16   # BR(~nu_tauL -> ~chi_10 nu_tau)
     2.95462439E-03    2     1000023        16   # BR(~nu_tauL -> ~chi_20 nu_tau)
     8.51078556E-03    2     1000025        16   # BR(~nu_tauL -> ~chi_30 nu_tau)
     9.34984985E-02    2     1000024        15   # BR(~nu_tauL -> ~chi_1+ tau-)
#
#         PDG            Width
DECAY   1000024     1.41477803E-01   # chargino1+ decays
#          BR         NDA      ID1       ID2
     1.00000000E+00    2     1000022        24   # BR(~chi_1+ -> ~chi_10  W+)
#
#         PDG            Width
DECAY   1000037     1.83405138E+02   # chargino2+ decays
#          BR         NDA      ID1       ID2
     1.38300674E-01    2     1000002        -1   # BR(~chi_2+ -> ~u_L     db)
     1.38303506E-01    2    -1000001         2   # BR(~chi_2+ -> ~d_L*    u )
     1.38300673E-01    2     1000004        -3   # BR(~chi_2+ -> ~c_L     sb)
     1.38303500E-01    2    -1000003         4   # BR(~chi_2+ -> ~s_L*     c )
     3.19680798E-08    2    -1000005         6   # BR(~chi_2+ -> ~b_1*    t )
     5.08091059E-02    2     1000012       -11   # BR(~chi_2+ -> ~nu_eL   e+  )
     5.08091059E-02    2     1000014       -13   # BR(~chi_2+ -> ~nu_muL mu+ )
     4.84659964E-02    2     1000016       -15   # BR(~chi_2+ -> ~nu_tau1 tau+)
     5.08155789E-02    2    -1000011        12   # BR(~chi_2+ -> ~e_L+    nu_e)
     5.08155789E-02    2    -1000013        14   # BR(~chi_2+ -> ~mu_L+   nu_mu)
     4.84671283E-02    2    -1000015        16   # BR(~chi_2+ -> ~tau_1+  nu_tau)
     2.54026208E-02    2     1000024        23   # BR(~chi_2+ -> ~chi_1+  Z )
     1.14072203E-05    2     1000022        24   # BR(~chi_2+ -> ~chi_10  W+)
     2.45033028E-02    2     1000023        24   # BR(~chi_2+ -> ~chi_20  W+)
     2.45056213E-02    2     1000025        24   # BR(~chi_2+ -> ~chi_30  W+)
     2.49694596E-02    2     1000024        25   # BR(~chi_2+ -> ~chi_1+  h )
     1.18185220E-02    2     1000024        35   # BR(~chi_2+ -> ~chi_1+  H )
     1.18143130E-02    2     1000024        36   # BR(~chi_2+ -> ~chi_1+  A )
     6.28393660E-04    2     1000022        37   # BR(~chi_2+ -> ~chi_10  H+)
     1.14666698E-02    2     1000023        37   # BR(~chi_2+ -> ~chi_20  H+)
     1.14888097E-02    2     1000025        37   # BR(~chi_2+ -> ~chi_30  H+)
#
#         PDG            Width
DECAY   1000022     0.00000000E+00   # neutralino1 decays
#
#         PDG            Width
DECAY   1000023     1.24720756E-01   # neutralino2 decays
#          BR         NDA      ID1       ID2
     5.29272051E-01    2     1000022        23   # BR(~chi_20 -> ~chi_10   Z )
     4.70727949E-01    2     1000022        25   # BR(~chi_20 -> ~chi_10   h )
#
#         PDG            Width
DECAY   1000025     1.12343202E-01   # neutralino3 decays
#          BR         NDA      ID1       ID2
     7.00890653E-01    2     1000022        23   # BR(~chi_30 -> ~chi_10   Z )
     2.99109347E-01    2     1000022        25   # BR(~chi_30 -> ~chi_10   h )
#
#         PDG            Width
DECAY   1000035     1.83510089E+02   # neutralino4 decays
#          BR         NDA      ID1       ID2
     3.12230579E-06    2     1000022        23   # BR(~chi_40 -> ~chi_10   Z )
     1.18168491E-02    2     1000023        23   # BR(~chi_40 -> ~chi_20   Z )
     1.33333468E-02    2     1000025        23   # BR(~chi_40 -> ~chi_30   Z )
     2.49522101E-02    2     1000024       -24   # BR(~chi_40 -> ~chi_1+   W-)
     2.49522101E-02    2    -1000024        24   # BR(~chi_40 -> ~chi_1-   W+)
     8.12986067E-06    2     1000022        25   # BR(~chi_40 -> ~chi_10   h )
     3.32800604E-04    2     1000022        35   # BR(~chi_40 -> ~chi_10   H )
     2.97373560E-04    2     1000022        36   # BR(~chi_40 -> ~chi_10   A )
     1.32270664E-02    2     1000023        25   # BR(~chi_40 -> ~chi_20   h )
     8.51115853E-03    2     1000023        35   # BR(~chi_40 -> ~chi_20   H )
     2.99909131E-03    2     1000023        36   # BR(~chi_40 -> ~chi_20   A )
     1.16810881E-02    2     1000025        25   # BR(~chi_40 -> ~chi_30   h )
     2.98734006E-03    2     1000025        35   # BR(~chi_40 -> ~chi_30   H )
     8.52630390E-03    2     1000025        36   # BR(~chi_40 -> ~chi_30   A )
     1.17631956E-02    2     1000024       -37   # BR(~chi_40 -> ~chi_1+   H-)
     1.17631956E-02    2    -1000024        37   # BR(~chi_40 -> ~chi_1-   H+)
     6.91682134E-02    2     1000002        -2   # BR(~chi_40 -> ~u_L      ub)
     6.91682134E-02    2    -1000002         2   # BR(~chi_40 -> ~u_L*     u )
     6.90450671E-02    2     1000001        -1   # BR(~chi_40 -> ~d_L      db)
     6.90450671E-02    2    -1000001         1   # BR(~chi_40 -> ~d_L*     d )
     4.38512015E-09    2     2000001        -1   # BR(~chi_40 -> ~d_R      db)
     4.38512015E-09    2    -2000001         1   # BR(~chi_40 -> ~d_R*     d )
     6.91682103E-02    2     1000004        -4   # BR(~chi_40 -> ~c_L      cb)
     6.91682103E-02    2    -1000004         4   # BR(~chi_40 -> ~c_L*     c )
     6.90450671E-02    2     1000003        -3   # BR(~chi_40 -> ~s _L      sb)
     6.90450671E-02    2    -1000003         3   # BR(~chi_40 -> ~s _L*     s )
     4.38512015E-09    2     2000003        -3   # BR(~chi_40 -> ~s _R      sb)
     4.38512015E-09    2    -2000003         3   # BR(~chi_40 -> ~s _R*     s )
     1.89451466E-08    2     1000005        -5   # BR(~chi_40 -> ~b_1      bb)
     1.89451466E-08    2    -1000005         5   # BR(~chi_40 -> ~b_1*     b )
     2.53433324E-02    2     1000011       -11   # BR(~chi_40 -> ~e_L-     e+)
     2.53433324E-02    2    -1000011        11   # BR(~chi_40 -> ~e_L+     e-)
     4.83232942E-09    2     2000011       -11   # BR(~chi_40 -> ~e_R-     e+)
     4.83232942E-09    2    -2000011        11   # BR(~chi_40 -> ~e_R+     e-)
     2.53433324E-02    2     1000013       -13   # BR(~chi_40 -> ~mu_L-    mu+)
     2.53433324E-02    2    -1000013        13   # BR(~chi_40 -> ~mu_L+    mu-)
     4.83232942E-09    2     2000013       -13   # BR(~chi_40 -> ~mu_R-    mu+)
     4.83232942E-09    2    -2000013        13   # BR(~chi_40 -> ~mu_R+    mu-)
     2.41719468E-02    2     1000015       -15   # BR(~chi_40 -> ~tau_1-   tau+)
     2.41719468E-02    2    -1000015        15   # BR(~chi_40 -> ~tau_1+   tau-)
     2.54369271E-02    2     1000012       -12   # BR(~chi_40 -> ~nu_eL    nu_eb)
     2.54369271E-02    2    -1000012        12   # BR(~chi_40 -> ~nu_eL*   nu_e )
     2.54369271E-02    2     1000014       -14   # BR(~chi_40 -> ~nu_muL   nu_mub)
     2.54369271E-02    2    -1000014        14   # BR(~chi_40 -> ~nu_muL*  nu_mu )
     2.42636980E-02    2     1000016       -16   # BR(~chi_40 -> ~nu_tau1  nu_taub)
     2.42636980E-02    2    -1000016        16   # BR(~chi_40 -> ~nu_tau1* nu_tau )
#
#         PDG            Width
DECAY        25     4.41563868E-03   # h decays
#          BR         NDA      ID1       ID2
     5.67503973E-01    2           5        -5   # BR(h -> b       bb     )
     6.11064830E-02    2         -15        15   # BR(h -> tau+    tau-   )
     2.16299560E-04    2         -13        13   # BR(h -> mu+     mu-    )
     2.34802501E-04    2           3        -3   # BR(h -> s       sb     )
     1.99086070E-02    2           4        -4   # BR(h -> c       cb     )
     7.59995317E-02    2          21        21   # BR(h -> g       g      )
     2.28149885E-03    2          22        22   # BR(h -> gam     gam    )
     1.70557958E-03    2          22        23   # BR(h -> Z       gam    )
     2.40086168E-01    2          24       -24   # BR(h -> W+      W-     )
     3.09068742E-02    2          23        23   # BR(h -> Z       Z      )
     5.01823240E-05    2     1000022   1000022   # BR(h -> ~chi_10 ~chi_10)
#
#         PDG            Width
DECAY        35     4.81224961E+00   # H decays
#          BR         NDA      ID1       ID2
     5.01928373E-01    2           5        -5   # BR(H -> b       bb     )
     8.44068497E-02    2         -15        15   # BR(H -> tau+    tau-   )
     2.99964395E-04    2         -13        13   # BR(H -> mu+     mu-    )
     1.78871234E-04    2           3        -3   # BR(H -> s       sb     )
     9.47477811E-07    2           4        -4   # BR(H -> c       cb     )
     8.86485052E-02    2           6        -6   # BR(H -> t       tb     )
     7.33955039E-05    2          21        21   # BR(H -> g       g      )
     1.11675030E-07    2          22        22   # BR(H -> gam     gam    )
     9.33764755E-08    2          23        22   # BR(H -> Z       gam    )
     1.81510215E-04    2          24       -24   # BR(H -> W+      W-     )
     9.01079794E-05    2          23        23   # BR(H -> Z       Z      )
     7.26477338E-04    2          25        25   # BR(H -> h       h      )
     4.34343920E-03    2     1000024  -1000024   # BR(H -> ~chi_1+ ~chi_1-)
     1.87854311E-02    2     1000022   1000022   # BR(H -> ~chi_10 ~chi_10)
     2.14130630E-03    2     1000023   1000023   # BR(H -> ~chi_20 ~chi_20)
     4.88586161E-03    2     1000025   1000025   # BR(H -> ~chi_30 ~chi_30)
     1.67291991E-01    2     1000022   1000023   # BR(H -> ~chi_10 ~chi_20)
     1.16391956E-01    2     1000022   1000025   # BR(H -> ~chi_10 ~chi_30)
     8.78823105E-03    2     1000023   1000025   # BR(H -> ~chi_20 ~chi_30)
     1.01810154E-04    2     1000002  -1000002   # BR(H -> ~u_L    ~u_L*  )
     1.01810154E-04    2     1000004  -1000004   # BR(H -> ~c_L    ~c_L*  )
     1.47432580E-04    2     1000001  -1000001   # BR(H -> ~d_L    ~d_L*  )
     4.63011153E-06    2     2000001  -2000001   # BR(H -> ~d_R    ~d_R*  )
     1.47432580E-04    2     1000003  -1000003   # BR(H -> ~s_L    ~s_L*  )
     4.63011153E-06    2     2000003  -2000003   # BR(H -> ~s_R    ~s_R*  )
     2.74034168E-05    2     1000011  -1000011   # BR(H -> ~e_L-   ~e_L+  )
     2.74034168E-05    2     1000013  -1000013   # BR(H -> ~mu_L-  ~mu_L+ )
     2.01625355E-05    2     1000015  -1000015   # BR(H -> ~tau_1- ~tau_1+)
     8.99487396E-05    2     1000012  -1000012   # BR(H -> ~nu_eL  ~nu_eL*   )
     8.99487396E-05    2     1000014  -1000014   # BR(H -> ~nu_muL ~nu_muL*  )
     7.39642813E-05    2     1000016  -1000016   # BR(H -> ~nu_tauL ~nu_tauL*)
#
#         PDG            Width
DECAY        36     4.81998789E+00   # A decays
#          BR         NDA      ID1       ID2
     5.01280810E-01    2           5        -5   # BR(A -> b       bb     )
     8.42801975E-02    2         -15        15   # BR(A -> tau+    tau-   )
     2.99512140E-04    2         -13        13   # BR(A -> mu+     mu-    )
     1.78696624E-04    2           3        -3   # BR(A -> s       sb     )
     9.31390146E-07    2           4        -4   # BR(A -> c       cb     )
     9.05962557E-02    2           6        -6   # BR(A -> t       tb     )
     2.74407053E-04    2          21        21   # BR(A -> g       g      )
     2.55106349E-07    2          22        22   # BR(A -> gam     gam    )
     2.26205445E-07    2          23        22   # BR(A -> Z       gam    )
     1.80865474E-04    2          23        25   # BR(A -> Z       h      )
     5.04314343E-03    2     1000024  -1000024   # BR(A -> ~chi_1+ ~chi_1-)
     1.82489264E-02    2     1000022   1000022   # BR(A -> ~chi_10 ~chi_10)
     1.78557079E-03    2     1000023   1000023   # BR(A -> ~chi_20 ~chi_20)
     8.14563582E-03    2     1000025   1000025   # BR(A -> ~chi_30 ~chi_30)
     1.20894264E-01    2     1000022   1000023   # BR(A -> ~chi_10 ~chi_20)
     1.62044902E-01    2     1000022   1000025   # BR(A -> ~chi_10 ~chi_30)
     6.74540066E-03    2     1000023   1000025   # BR(A -> ~chi_20 ~chi_30)
#
#         PDG            Width
DECAY        37     4.72289450E+00   # H+ decays
#          BR         NDA      ID1       ID2
     8.40010499E-04    2           4        -5   # BR(H+ -> c       bb     )
     8.61769580E-02    2         -15        16   # BR(H+ -> tau+    nu_tau )
     3.06252780E-04    2         -13        14   # BR(H+ -> mu+     nu_mu  )
     8.40004552E-06    2           2        -5   # BR(H+ -> u       bb     )
     9.10928817E-06    2           2        -3   # BR(H+ -> u       sb     )
     1.80209259E-04    2           4        -3   # BR(H+ -> c       sb     )
     5.85153489E-01    2           6        -5   # BR(H+ -> t       bb     )
     1.86241184E-04    2          24        25   # BR(H+ -> W+      h      )
     3.32908480E-11    2          24        36   # BR(H+ -> W+      A      )
     3.16279627E-01    2     1000024   1000022   # BR(H+ -> ~chi_1+ ~chi_10)
     8.86075996E-03    2     1000024   1000023   # BR(H+ -> ~chi_1+ ~chi_20)
     1.19749916E-03    2     1000024   1000025   # BR(H+ -> ~chi_1+ ~chi_30)
     1.08754230E-04    2    -1000011   1000012   # BR(H+ -> ~e_L+   ~nu_eL )
     1.08754230E-04    2    -1000013   1000014   # BR(H+ -> ~mu_L+  ~nu_muL)
     8.60336960E-05    2    -1000015   1000016   # BR(H+ -> ~tau_1+ ~nu_tauL)
     2.48950796E-04    2     1000002  -1000001   # BR(H+ -> ~u_L    ~d_L*  )
     2.48950796E-04    2     1000004  -1000003   # BR(H+ -> ~c_L    ~s_L*  )
