#
#                              ======================
#                              | THE SUSYHIT OUTPUT |
#                              ======================
#
#
#              ------------------------------------------------------
#              |     This is the output of the SUSY-HIT package     |
#              |  created by A.Djouadi, M.Muehlleitner and M.Spira. |
#              |  In case of problems with SUSY-HIT email to        |
#              |           margarete.muehlleitner@cern.ch           |
#              |           michael.spira@psi.ch                     |
#              |           abdelhak.djouadi@cern.ch                 |
#              ------------------------------------------------------
#
#              ------------------------------------------------------
#              |  SUSY Les Houches Accord - MSSM Spectrum + Decays  |
#              |              based on the decay programs           |
#              |                                                    |
#              |                     SDECAY 1.3b                    |
#              |                                                    |
#              |  Authors: M.Muhlleitner, A.Djouadi and Y.Mambrini  |
#              |  Ref.:    Comput.Phys.Commun.168(2005)46           |
#              |           [hep-ph/0311167]                         |
#              |                                                    |
#              |                     HDECAY 3.4                     |
#              |                                                    |
#              |  By: A.Djouadi,J.Kalinowski,M.Muhlleitner,M.Spira  |
#              |  Ref.:    Comput.Phys.Commun.108(1998)56           |
#              |           [hep-ph/9704448]                         |
#              |                                                    |
#              |                                                    |
#              |  If not stated otherwise all DRbar couplings and   |
#              |  soft SUSY breaking masses are given at the scale  |
#              |  Q=  0.12681100E+04
#              |                                                    |
#              ------------------------------------------------------
#
#
BLOCK DCINFO  # Decay Program information
     1   SDECAY/HDECAY # decay calculator
     2   1.3b  /3.4    # version number
#
BLOCK SPINFO  # Spectrum calculator information
     1   TSUSY    # spectrum calculator                    
     2   .7         # version number                       
#
BLOCK MODSEL  # Model selection
     1     0   #  # nonUniversal                                   
#
BLOCK SMINPUTS  # Standard Model inputs
         1     1.27956800E+02   # alpha_em^-1(M_Z)^MSbar
         2     1.16637900E-05   # G_F [GeV^-2]
         3     1.19300000E-01   # alpha_S(M_Z)^MSbar
         4     9.11876000E+01   # M_Z pole mass
         5     4.16000000E+00   # mb(mb)^MSbar
         6     1.73200000E+02   # mt pole mass
         7     1.77700000E+00   # mtau pole mass
#
BLOCK MINPAR  # Input parameters - minimal models
         3     2.12500000E+01   # tanb                
#
BLOCK EXTPAR  # Input parameters - non-minimal models
         1    -1.28477000E+03   # M_1(MX)             
         2     2.50440000E+02   # M_2(MX)             
         3     2.55817000E+03   # M_3(MX)             
        11     2.05608000E+03   # At(MX)              
        12     1.55875000E+03   # Ab(MX)              
        13    -3.31804000E+03   # Atau(MX)            
        23     3.96350000E+02   # mu(MX)              
        26     3.70568000E+03   # mA(pole)            
        31     8.98370000E+02   # meL(MX)             
        32     8.98370000E+02   # mmuL(MX)            
        33     3.70692000E+03   # mtauL(MX)           
        34     8.44600000E+02   # meR(MX)             
        35     8.44600000E+02   # mmuR(MX)            
        36     3.50190000E+03   # mtauR(MX)           
        41     1.44429000E+03   # mqL1(MX)            
        42     1.44429000E+03   # mqL2(MX)            
        43     1.52139000E+03   # mqL3(MX)            
        44     3.31984000E+03   # muR(MX)             
        45     3.31984000E+03   # mcR(MX)             
        46     1.06128000E+03   # mtR(MX)             
        47     6.20460000E+02   # mdR(MX)             
        48     6.20460000E+02   # msR(MX)             
        49     6.30130000E+02   # mbR(MX)             
#
BLOCK MASS  # Mass Spectrum
# PDG code           mass       particle
        24     8.04113700E+01   # W+
        25     1.23658200E+02   # h
        35     3.70632000E+03   # H
        36     3.70568100E+03   # A
        37     3.70677200E+03   # H+
         5     4.80992877E+00   # b-quark pole mass calculated from mb(mb)_Msbar
   1000001     1.45758500E+03   # ~d_L
   2000001     5.56549400E+02   # ~d_R
   1000002     1.45550600E+03   # ~u_L
   2000002     3.34191500E+03   # ~u_R
   1000003     1.45758500E+03   # ~s_L
   2000003     5.56549400E+02   # ~s_R
   1000004     1.45550600E+03   # ~c_L
   2000004     3.34191500E+03   # ~c_R
   1000005     5.81661400E+02   # ~b_1
   2000005     1.51741700E+03   # ~b_2
   1000006     1.01818100E+03   # ~t_1
   2000006     1.54751500E+03   # ~t_2
   1000011     9.17004600E+02   # ~e_L
   2000011     8.19108900E+02   # ~e_R
   1000012     9.13283500E+02   # ~nu_eL
   1000013     9.17004600E+02   # ~mu_L
   2000013     8.19108900E+02   # ~mu_R
   1000014     9.13283500E+02   # ~nu_muL
   1000015     3.50100100E+03   # ~tau_1
   2000015     3.71973500E+03   # ~tau_2
   1000016     3.71854700E+03   # ~nu_tauL
   1000021     2.53136200E+03   # ~g
   1000022     2.47631200E+02   # ~chi_10
   1000023    -4.04992700E+02   # ~chi_20
   1000025     4.24955100E+02   # ~chi_30
   1000035    -1.28006200E+03   # ~chi_40
   1000024     2.48388600E+02   # ~chi_1+
   1000037     4.27300500E+02   # ~chi_2+
#
BLOCK NMIX  # Neutralino Mixing Matrix
  1  1     5.95871000E-03   # N_11
  1  2     9.34080900E-01   # N_12
  1  3    -3.00683200E-01   # N_13
  1  4     1.92475900E-01   # N_14
  2  1     3.41223300E-02   # N_21
  2  2     7.99376200E-02   # N_22
  2  3     7.01683100E-01   # N_23
  2  4     7.07167900E-01   # N_24
  3  1    -1.84837100E-02   # N_31
  3  2     3.47993300E-01   # N_32
  3  3     6.45852900E-01   # N_33
  3  4    -6.79288600E-01   # N_34
  4  1     9.99229000E-01   # N_41
  4  2    -1.86280600E-03   # N_42
  4  3    -1.02215100E-02   # N_43
  4  4    -3.78620900E-02   # N_44
#
BLOCK UMIX  # Chargino Mixing Matrix U
  1  1     9.11560200E-01   # U_11
  1  2    -4.11166600E-01   # U_12
  2  1     4.11166600E-01   # U_21
  2  2     9.11560200E-01   # U_22
#
BLOCK VMIX  # Chargino Mixing Matrix V
  1  1     9.63897400E-01   # V_11
  1  2    -2.66273800E-01   # V_12
  2  1     2.66273800E-01   # V_21
  2  2     9.63897400E-01   # V_22
#
BLOCK STOPMIX  # Stop Mixing Matrix
  1  1    -2.38181700E-01   # cos(theta_t)
  1  2     9.71220612E-01   # sin(theta_t)
  2  1    -9.71220612E-01   # -sin(theta_t)
  2  2    -2.38181700E-01   # cos(theta_t)
#
BLOCK SBOTMIX  # Sbottom Mixing Matrix
  1  1     7.80920000E-03   # cos(theta_b)
  1  2     9.99969508E-01   # sin(theta_b)
  2  1    -9.99969508E-01   # -sin(theta_b)
  2  2     7.80920000E-03   # cos(theta_b)
#
BLOCK STAUMIX  # Stau Mixing Matrix
  1  1     1.28764400E-02   # cos(theta_tau)
  1  2     9.99917095E-01   # sin(theta_tau)
  2  1    -9.99917095E-01   # -sin(theta_tau)
  2  2     1.28764400E-02   # cos(theta_tau)
#
BLOCK ALPHA  # Higgs mixing
          -4.87714300E-02   # Mixing angle in the neutral Higgs boson sector
#
BLOCK HMIX Q=  1.26811000E+03  # DRbar Higgs Parameters
         1     3.96350000E+02   # mu(Q)MSSM           
         2     2.05204200E+01   # tan                 
         3     2.42938200E+02   # higgs               
         4     1.38538500E+07   # mA^2(Q)MSSM         
#
BLOCK GAUGE Q=  1.26811000E+03  # The gauge couplings
     1     3.62445200E-01   # gprime(Q) DRbar
     2     6.42445100E-01   # g(Q) DRbar
     3     1.03920500E+00   # g3(Q) DRbar
#
BLOCK AU Q=  1.26811000E+03  # The trilinear couplings
  1  1     0.00000000E+00   # A_u(Q) DRbar
  2  2     0.00000000E+00   # A_c(Q) DRbar
  3  3     2.05608000E+03   # A_t(Q) DRbar
#
BLOCK AD Q=  1.26811000E+03  # The trilinear couplings
  1  1     0.00000000E+00   # A_d(Q) DRbar
  2  2     0.00000000E+00   # A_s(Q) DRbar
  3  3     1.55875000E+03   # A_b(Q) DRbar
#
BLOCK AE Q=  1.26811000E+03  # The trilinear couplings
  1  1     0.00000000E+00   # A_e(Q) DRbar
  2  2     0.00000000E+00   # A_mu(Q) DRbar
  3  3    -3.31804000E+03   # A_tau(Q) DRbar
#
BLOCK Yu Q=  1.26811000E+03  # The Yukawa couplings
  1  1     0.00000000E+00   # y_u(Q) DRbar
  2  2     0.00000000E+00   # y_c(Q) DRbar
  3  3     8.59034500E-01   # y_t(Q) DRbar
#
BLOCK Yd Q=  1.26811000E+03  # The Yukawa couplings
  1  1     0.00000000E+00   # y_d(Q) DRbar
  2  2     0.00000000E+00   # y_s(Q) DRbar
  3  3     2.64271100E-01   # y_b(Q) DRbar
#
BLOCK Ye Q=  1.26811000E+03  # The Yukawa couplings
  1  1     0.00000000E+00   # y_e(Q) DRbar
  2  2     0.00000000E+00   # y_mu(Q) DRbar
  3  3     2.10700400E-01   # y_tau(Q) DRbar
#
BLOCK MSOFT Q=  1.26811000E+03  # The soft SUSY breaking masses at the scale Q
         1    -1.28477000E+03   # M_1(Q)              
         2     2.50440000E+02   # M_2(Q)              
         3     2.55817000E+03   # M_3(Q)              
        21     1.34654900E+07   # mH1^2(Q)            
        22    -6.69683200E+04   # mH2^2(Q)            
        31     8.98370000E+02   # meL(Q)              
        32     8.98370000E+02   # mmuL(Q)             
        33     3.70692000E+03   # mtauL(Q)            
        34     8.44600000E+02   # meR(Q)              
        35     8.44600000E+02   # mmuR(Q)             
        36     3.50190000E+03   # mtauR(Q)            
        41     1.44429000E+03   # mqL1(Q)             
        42     1.44429000E+03   # mqL2(Q)             
        43     1.52139000E+03   # mqL3(Q)             
        44     3.31984000E+03   # muR(Q)              
        45     3.31984000E+03   # mcR(Q)              
        46     1.06128000E+03   # mtR(Q)              
        47     6.20460000E+02   # mdR(Q)              
        48     6.20460000E+02   # msR(Q)              
        49     6.30130000E+02   # mbR(Q)              
#
#
#
#                             =================
#                             |The decay table|
#                             =================
#
# - The QCD corrections to the decays gluino -> squark  + quark
#                                     squark -> gaugino + quark_prime
#                                     squark -> squark_prime + Higgs
#                                     squark -> gluino  + quark
#   are included.
#
# - The multi-body decays for the inos, stops and sbottoms are included.
#
# - The loop induced decays for the gluino, neutralinos and stops
#   are included.
#
# - The SUSY decays of the top quark are included.
#
#
#         PDG            Width
DECAY         6     1.45262548E+00   # top decays
#          BR         NDA      ID1       ID2
     1.00000000E+00    2           5        24   # BR(t ->  b    W+)
#
#         PDG            Width
DECAY   1000021     3.00301918E+02   # gluino decays
#          BR         NDA      ID1       ID2
     3.72443581E-02    2     1000001        -1   # BR(~g -> ~d_L  db)
     3.72443581E-02    2    -1000001         1   # BR(~g -> ~d_L* d )
     7.54913527E-02    2     2000001        -1   # BR(~g -> ~d_R  db)
     7.54913527E-02    2    -2000001         1   # BR(~g -> ~d_R* d )
     3.73497564E-02    2     1000002        -2   # BR(~g -> ~u_L  ub)
     3.73497564E-02    2    -1000002         2   # BR(~g -> ~u_L* u )
     3.72443581E-02    2     1000003        -3   # BR(~g -> ~s_L  sb)
     3.72443581E-02    2    -1000003         3   # BR(~g -> ~s_L* s )
     7.54913527E-02    2     2000003        -3   # BR(~g -> ~s_R  sb)
     7.54913527E-02    2    -2000003         3   # BR(~g -> ~s_R* s )
     4.05745283E-02    2     1000004        -4   # BR(~g -> ~c_L  cb)
     4.05745283E-02    2    -1000004         4   # BR(~g -> ~c_L* c )
     7.41182693E-02    2     1000005        -5   # BR(~g -> ~b_1  bb)
     7.41182693E-02    2    -1000005         5   # BR(~g -> ~b_1* b )
     3.41495535E-02    2     2000005        -5   # BR(~g -> ~b_2  bb)
     3.41495535E-02    2    -2000005         5   # BR(~g -> ~b_2* b )
     6.22010516E-02    2     1000006        -6   # BR(~g -> ~t_1  tb)
     6.22010516E-02    2    -1000006         6   # BR(~g -> ~t_1* t )
     2.93602152E-02    2     2000006        -6   # BR(~g -> ~t_2  tb)
     2.93602152E-02    2    -2000006         6   # BR(~g -> ~t_2* t )
#
#         PDG            Width
DECAY   1000006     1.97271141E+01   # stop1 decays
#          BR         NDA      ID1       ID2
     4.83365139E-03    2     1000022         6   # BR(~t_1 -> ~chi_10 t )
     2.21656023E-01    2     1000023         6   # BR(~t_1 -> ~chi_20 t )
     2.67629113E-01    2     1000025         6   # BR(~t_1 -> ~chi_30 t )
     5.67940518E-03    2     1000024         5   # BR(~t_1 -> ~chi_1+ b )
     5.00167819E-01    2     1000037         5   # BR(~t_1 -> ~chi_2+ b )
     3.39886777E-05    2     1000005        24   # BR(~t_1 -> ~b_1    W+)
#
#         PDG            Width
DECAY   2000006     5.89817262E+01   # stop2 decays
#          BR         NDA      ID1       ID2
     1.08361708E-01    2     1000022         6   # BR(~t_2 -> ~chi_10 t )
     1.72418378E-01    2     1000023         6   # BR(~t_2 -> ~chi_20 t )
     1.38913232E-01    2     1000025         6   # BR(~t_2 -> ~chi_30 t )
     3.05141603E-04    2     1000035         6   # BR(~t_2 -> ~chi_40 t )
     2.18583616E-01    2     1000024         5   # BR(~t_2 -> ~chi_1+ b )
     2.47995576E-02    2     1000037         5   # BR(~t_2 -> ~chi_2+ b )
     1.44783721E-01    2     1000006        25   # BR(~t_2 -> ~t_1    h )
     1.90399581E-01    2     1000006        23   # BR(~t_2 -> ~t_1    Z )
     1.43506658E-03    2     1000005        24   # BR(~t_2 -> ~b_1    W+)
#
#         PDG            Width
DECAY   1000005     3.04052609E-01   # sbottom1 decays
#          BR         NDA      ID1       ID2
     1.74764107E-01    2     1000022         5   # BR(~b_1 -> ~chi_10 b )
     3.47344118E-01    2     1000023         5   # BR(~b_1 -> ~chi_20 b )
     2.37499422E-01    2     1000025         5   # BR(~b_1 -> ~chi_30 b )
     2.40392352E-01    2    -1000024         6   # BR(~b_1 -> ~chi_1- t )
#
#         PDG            Width
DECAY   2000005     5.80263507E+01   # sbottom2 decays
#          BR         NDA      ID1       ID2
     9.13496684E-02    2     1000022         5   # BR(~b_2 -> ~chi_10 b )
     1.59568214E-02    2     1000023         5   # BR(~b_2 -> ~chi_20 b )
     2.43727241E-02    2     1000025         5   # BR(~b_2 -> ~chi_30 b )
     3.21742885E-04    2     1000035         5   # BR(~b_2 -> ~chi_40 b )
     1.83970287E-01    2    -1000024         6   # BR(~b_2 -> ~chi_1- t )
     3.36708850E-01    2    -1000037         6   # BR(~b_2 -> ~chi_2- t )
     6.77362300E-04    2     1000005        25   # BR(~b_2 -> ~b_1    h )
     7.29209965E-04    2     1000005        23   # BR(~b_2 -> ~b_1    Z )
     3.45913334E-01    2     1000006       -24   # BR(~b_2 -> ~t_1    W-)
#
#         PDG            Width
DECAY   1000002     1.70178974E+01   # sup_L decays
#          BR         NDA      ID1       ID2
     2.93980390E-01    2     1000022         2   # BR(~u_L -> ~chi_10 u)
     2.28520886E-03    2     1000023         2   # BR(~u_L -> ~chi_20 u)
     3.58097503E-02    2     1000025         2   # BR(~u_L -> ~chi_30 u)
     8.27807432E-04    2     1000035         2   # BR(~u_L -> ~chi_40 u)
     6.24395331E-01    2     1000024         1   # BR(~u_L -> ~chi_1+ d)
     4.27015123E-02    2     1000037         1   # BR(~u_L -> ~chi_2+ d)
#
#         PDG            Width
DECAY   2000002     5.32551285E+01   # sup_R decays
#          BR         NDA      ID1       ID2
     4.88382176E-06    2     1000022         2   # BR(~u_R -> ~chi_10 u)
     1.57793518E-04    2     1000023         2   # BR(~u_R -> ~chi_20 u)
     4.61854191E-05    2     1000025         2   # BR(~u_R -> ~chi_30 u)
     1.04516202E-01    2     1000035         2   # BR(~u_R -> ~chi_40 u)
     8.95274936E-01    2     1000021         2   # BR(~u_R -> ~g      u)
#
#         PDG            Width
DECAY   1000001     1.69185105E+01   # sdown_L decays
#          BR         NDA      ID1       ID2
     2.94733166E-01    2     1000022         1   # BR(~d_L -> ~chi_10 d)
     1.66915313E-03    2     1000023         1   # BR(~d_L -> ~chi_20 d)
     3.75574323E-02    2     1000025         1   # BR(~d_L -> ~chi_30 d)
     8.82179540E-04    2     1000035         1   # BR(~d_L -> ~chi_40 d)
     5.62553482E-01    2    -1000024         2   # BR(~d_L -> ~chi_1- u)
     1.02604588E-01    2    -1000037         2   # BR(~d_L -> ~chi_2- u)
#
#         PDG            Width
DECAY   2000001     1.29317415E-04   # sdown_R decays
#          BR         NDA      ID1       ID2
     6.25177966E-02    2     1000022         1   # BR(~d_R -> ~chi_10 d)
     7.58979328E-01    2     1000023         1   # BR(~d_R -> ~chi_20 d)
     1.78502876E-01    2     1000025         1   # BR(~d_R -> ~chi_30 d)
#
#         PDG            Width
DECAY   1000004     1.67443896E+01   # scharm_L decays
#          BR         NDA      ID1       ID2
     2.94315562E-01    2     1000022         4   # BR(~c_L -> ~chi_10 c)
     2.26512104E-03    2     1000023         4   # BR(~c_L -> ~chi_20 c)
     3.54445445E-02    2     1000025         4   # BR(~c_L -> ~chi_30 c)
     6.33956079E-04    2     1000035         4   # BR(~c_L -> ~chi_40 c)
     6.25081849E-01    2     1000024         3   # BR(~c_L -> ~chi_1+ s)
     4.22589676E-02    2     1000037         3   # BR(~c_L -> ~chi_2+ s)
#
#         PDG            Width
DECAY   2000004     4.04441754E+01   # scharm_R decays
#          BR         NDA      ID1       ID2
     6.74099373E-06    2     1000022         4   # BR(~c_R -> ~chi_10 c)
     2.16984295E-04    2     1000023         4   # BR(~c_R -> ~chi_20 c)
     6.34776055E-05    2     1000025         4   # BR(~c_R -> ~chi_30 c)
     1.39547161E-01    2     1000035         4   # BR(~c_R -> ~chi_40 c)
     8.60165637E-01    2     1000021         4   # BR(~c_R -> ~g      c)
#
#         PDG            Width
DECAY   1000003     1.66364529E+01   # sstrange_L decays
#          BR         NDA      ID1       ID2
     2.95279040E-01    2     1000022         3   # BR(~s_L -> ~chi_10 s)
     1.65568886E-03    2     1000023         3   # BR(~s_L -> ~chi_20 s)
     3.72016611E-02    2     1000025         3   # BR(~s_L -> ~chi_30 s)
     6.77863611E-04    2     1000035         3   # BR(~s_L -> ~chi_40 s)
     5.63570462E-01    2    -1000024         4   # BR(~s_L -> ~chi_1- c)
     1.01615284E-01    2    -1000037         4   # BR(~s_L -> ~chi_2- c)
#
#         PDG            Width
DECAY   2000003     1.09885461E-04   # sstrange_R decays
#          BR         NDA      ID1       ID2
     6.71814878E-02    2     1000022         3   # BR(~s_R -> ~chi_10 s)
     7.58080262E-01    2     1000023         3   # BR(~s_R -> ~chi_20 s)
     1.74738250E-01    2     1000025         3   # BR(~s_R -> ~chi_30 s)
#
#         PDG            Width
DECAY   1000011     9.28452095E+00   # selectron_L decays
#          BR         NDA      ID1       ID2
     3.06270162E-01    2     1000022        11   # BR(~e_L -> ~chi_10 e-)
     2.58487695E-03    2     1000023        11   # BR(~e_L -> ~chi_20 e-)
     2.84911922E-02    2     1000025        11   # BR(~e_L -> ~chi_30 e-)
     5.78625199E-01    2    -1000024        12   # BR(~e_L -> ~chi_1- nu_e)
     8.40285702E-02    2    -1000037        12   # BR(~e_L -> ~chi_2- nu_e)
#
#         PDG            Width
DECAY   2000011     3.75241233E-03   # selectron_R decays
#          BR         NDA      ID1       ID2
     3.34448825E-02    2     1000022        11   # BR(~e_R -> ~chi_10 e-)
     7.58343705E-01    2     1000023        11   # BR(~e_R -> ~chi_20 e-)
     2.08211413E-01    2     1000025        11   # BR(~e_R -> ~chi_30 e-)
#
#         PDG            Width
DECAY   1000013     9.28452085E+00   # smuon_L decays
#          BR         NDA      ID1       ID2
     3.06270155E-01    2     1000022        13   # BR(~mu_L -> ~chi_10 mu-)
     2.58487688E-03    2     1000023        13   # BR(~mu_L -> ~chi_20 mu-)
     2.84911912E-02    2     1000025        13   # BR(~mu_L -> ~chi_30 mu-)
     5.78625205E-01    2    -1000024        14   # BR(~mu_L -> ~chi_1- nu_mu)
     8.40285711E-02    2    -1000037        14   # BR(~mu_L -> ~chi_2- nu_mu)
#
#         PDG            Width
DECAY   2000013     3.75241211E-03   # smuon_R decays
#          BR         NDA      ID1       ID2
     3.34448831E-02    2     1000022        13   # BR(~mu_R -> ~chi_10 mu-)
     7.58343705E-01    2     1000023        13   # BR(~mu_R -> ~chi_20 mu-)
     2.08211412E-01    2     1000025        13   # BR(~mu_R -> ~chi_30 mu-)
#
#         PDG            Width
DECAY   1000015     1.97696491E+01   # stau_1 decays
#          BR         NDA      ID1       ID2
     1.65429579E-02    2     1000022        15   # BR(~tau_1 -> ~chi_10  tau-)
     7.56532775E-02    2     1000023        15   # BR(~tau_1 -> ~chi_20  tau-)
     6.17026148E-02    2     1000025        15   # BR(~tau_1 -> ~chi_30  tau-)
     6.93501079E-01    2     1000035        15   # BR(~tau_1 -> ~chi_40  tau-)
     3.09267190E-02    2    -1000024        16   # BR(~tau_1 -> ~chi_1-  nu_tau)
     1.21673352E-01    2    -1000037        16   # BR(~tau_1 -> ~chi_2-  nu_tau)
#
#         PDG            Width
DECAY   2000015     5.22803253E+01   # stau_2 decays
#          BR         NDA      ID1       ID2
     2.59051502E-01    2     1000022        15   # BR(~tau_2 -> ~chi_10  tau-)
     3.31593267E-02    2     1000023        15   # BR(~tau_2 -> ~chi_20  tau-)
     5.87429033E-02    2     1000025        15   # BR(~tau_2 -> ~chi_30  tau-)
     7.17279161E-02    2     1000035        15   # BR(~tau_2 -> ~chi_40  tau-)
     4.79221896E-01    2    -1000024        16   # BR(~tau_2 -> ~chi_1-  nu_tau)
     9.79707324E-02    2    -1000037        16   # BR(~tau_2 -> ~chi_2-  nu_tau)
     6.64109238E-05    2     1000015        25   # BR(~tau_2 -> ~tau_1   h)
     5.93123297E-05    2     1000015        23   # BR(~tau_2 -> ~tau_1   Z)
#
#         PDG            Width
DECAY   1000012     9.39171945E+00   # snu_eL decays
#          BR         NDA      ID1       ID2
     2.96854126E-01    2     1000022        12   # BR(~nu_eL -> ~chi_10 nu_e)
     9.48939930E-04    2     1000023        12   # BR(~nu_eL -> ~chi_20 nu_e)
     3.14839065E-02    2     1000025        12   # BR(~nu_eL -> ~chi_30 nu_e)
     6.36172630E-01    2     1000024        11   # BR(~nu_eL -> ~chi_1+ e-)
     3.45403976E-02    2     1000037        11   # BR(~nu_eL -> ~chi_2+ e-)
#
#         PDG            Width
DECAY   1000014     9.39171925E+00   # snu_muL decays
#          BR         NDA      ID1       ID2
     2.96854132E-01    2     1000022        14   # BR(~nu_muL -> ~chi_10 nu_mu)
     9.48939951E-04    2     1000023        14   # BR(~nu_muL -> ~chi_20 nu_mu)
     3.14839072E-02    2     1000025        14   # BR(~nu_muL -> ~chi_30 nu_mu)
     6.36172624E-01    2     1000024        13   # BR(~nu_muL -> ~chi_1+ mu-)
     3.45403968E-02    2     1000037        13   # BR(~nu_muL -> ~chi_2+ mu-)
#
#         PDG            Width
DECAY   1000016     5.23058201E+01   # snu_tauL decays
#          BR         NDA      ID1       ID2
     2.50594943E-01    2     1000022        16   # BR(~nu_tauL -> ~chi_10 nu_tau)
     1.04959571E-03    2     1000023        16   # BR(~nu_tauL -> ~chi_20 nu_tau)
     3.65228237E-02    2     1000025        16   # BR(~nu_tauL -> ~chi_30 nu_tau)
     7.25519419E-02    2     1000035        16   # BR(~nu_tauL -> ~chi_40 nu_tau)
     5.48040774E-01    2     1000024        15   # BR(~nu_tauL -> ~chi_1+ tau-)
     9.11182866E-02    2     1000037        15   # BR(~nu_tauL -> ~chi_2+ tau-)
     1.21635447E-04    2    -1000015       -24   # BR(~nu_tauL -> ~tau_1+ W-)
#
#         PDG            Width
DECAY   1000024     9.69634730E-13   # chargino1+ decays
#           BR         NDA      ID1       ID2       ID3
     1.49883620E-01    3     1000022       -11        12   # BR(~chi_1+ -> ~chi_10 e+   nu_e)
     1.36327650E-01    3     1000022       -13        14   # BR(~chi_1+ -> ~chi_10 mu+  nu_mu)
     6.56686550E-01    2     1000022       211             # BR(~chi_1+ -> ~chi_10 pi+)
     5.67895600E-02    3     1000022       211        111   # BR(~chi_1+ -> ~chi_10 pi+ pi0)
     1.56309760E-04    4     1000022       211        111       111 # BR(~chi_1+ -> ~chi_10 pi+ pi0 pi0)
     1.56309760E-04    4     1000022       211        211      -211 # BR(~chi_1+ -> ~chi_10 pi+ pi+ pi-)
#
#         PDG            Width
DECAY   1000037     1.40250674E+00   # chargino2+ decays
#          BR         NDA      ID1       ID2
     3.65900308E-01    2     1000024        23   # BR(~chi_2+ -> ~chi_1+  Z )
     3.91420904E-01    2     1000022        24   # BR(~chi_2+ -> ~chi_10  W+)
     2.42678788E-01    2     1000024        25   # BR(~chi_2+ -> ~chi_1+  h )
#
#         PDG            Width
DECAY   1000022     0.00000000E+00   # neutralino1 decays
#
#         PDG            Width
DECAY   1000023     1.21629953E+00   # neutralino2 decays
#          BR         NDA      ID1       ID2
     2.92745139E-01    2     1000022        23   # BR(~chi_20 -> ~chi_10   Z )
     3.50572097E-01    2     1000024       -24   # BR(~chi_20 -> ~chi_1+   W-)
     3.50572097E-01    2    -1000024        24   # BR(~chi_20 -> ~chi_1-   W+)
     6.11066700E-03    2     1000022        25   # BR(~chi_20 -> ~chi_10   h )
#
#         PDG            Width
DECAY   1000025     1.61715260E+00   # neutralino3 decays
#          BR         NDA      ID1       ID2
     2.28408539E-02    2     1000022        23   # BR(~chi_30 -> ~chi_10   Z )
     3.84057312E-01    2     1000024       -24   # BR(~chi_30 -> ~chi_1+   W-)
     3.84057312E-01    2    -1000024        24   # BR(~chi_30 -> ~chi_1-   W+)
     2.09044523E-01    2     1000022        25   # BR(~chi_30 -> ~chi_10   h )
#
#         PDG            Width
DECAY   1000035     1.44350946E+01   # neutralino4 decays
#          BR         NDA      ID1       ID2
     4.49848119E-03    2     1000022        23   # BR(~chi_40 -> ~chi_10   Z )
     1.33971504E-02    2     1000023        23   # BR(~chi_40 -> ~chi_20   Z )
     3.43546091E-02    2     1000025        23   # BR(~chi_40 -> ~chi_30   Z )
     6.67260359E-03    2     1000024       -24   # BR(~chi_40 -> ~chi_1+   W-)
     6.67260359E-03    2    -1000024        24   # BR(~chi_40 -> ~chi_1-   W+)
     4.47212934E-02    2     1000037       -24   # BR(~chi_40 -> ~chi_2+   W-)
     4.47212934E-02    2    -1000037        24   # BR(~chi_40 -> ~chi_2-   W+)
     2.56041512E-03    2     1000022        25   # BR(~chi_40 -> ~chi_10   h )
     4.07638641E-02    2     1000023        25   # BR(~chi_40 -> ~chi_20   h )
     1.05236398E-02    2     1000025        25   # BR(~chi_40 -> ~chi_30   h )
     5.33608174E-02    2     2000001        -1   # BR(~chi_40 -> ~d_R      db)
     5.33608174E-02    2    -2000001         1   # BR(~chi_40 -> ~d_R*     d )
     5.33608174E-02    2     2000003        -3   # BR(~chi_40 -> ~s _R      sb)
     5.33608174E-02    2    -2000003         3   # BR(~chi_40 -> ~s _R*     s )
     2.35665891E-02    2     1000006        -6   # BR(~chi_40 -> ~t_1      tb)
     2.35665891E-02    2    -1000006         6   # BR(~chi_40 -> ~t_1*     t )
     4.85704000E-02    2     1000005        -5   # BR(~chi_40 -> ~b_1      bb)
     4.85704000E-02    2    -1000005         5   # BR(~chi_40 -> ~b_1*     b )
     1.36186593E-02    2     1000011       -11   # BR(~chi_40 -> ~e_L-     e+)
     1.36186593E-02    2    -1000011        11   # BR(~chi_40 -> ~e_L+     e-)
     8.06940167E-02    2     2000011       -11   # BR(~chi_40 -> ~e_R-     e+)
     8.06940167E-02    2    -2000011        11   # BR(~chi_40 -> ~e_R+     e-)
     1.36186593E-02    2     1000013       -13   # BR(~chi_40 -> ~mu_L-    mu+)
     1.36186593E-02    2    -1000013        13   # BR(~chi_40 -> ~mu_L+    mu-)
     8.06940167E-02    2     2000013       -13   # BR(~chi_40 -> ~mu_R-    mu+)
     8.06940167E-02    2    -2000013        13   # BR(~chi_40 -> ~mu_R+    mu-)
     1.40365236E-02    2     1000012       -12   # BR(~chi_40 -> ~nu_eL    nu_eb)
     1.40365236E-02    2    -1000012        12   # BR(~chi_40 -> ~nu_eL*   nu_e )
     1.36186593E-02    2     1000014       -14   # BR(~chi_40 -> ~nu_muL   nu_mub)
     1.36186593E-02    2    -1000014        14   # BR(~chi_40 -> ~nu_muL*  nu_mu )
#
#         PDG            Width
DECAY        25     3.89638165E-03   # h decays
#          BR         NDA      ID1       ID2
     6.31817701E-01    2           5        -5   # BR(h -> b       bb     )
     6.59025214E-02    2         -15        15   # BR(h -> tau+    tau-   )
     2.33276809E-04    2         -13        13   # BR(h -> mu+     mu-    )
     4.36058984E-04    2           3        -3   # BR(h -> s       sb     )
     1.89948538E-02    2           4        -4   # BR(h -> c       cb     )
     7.11637138E-02    2          21        21   # BR(h -> g       g      )
     2.32213941E-03    2          22        22   # BR(h -> gam     gam    )
     1.41986479E-03    2          22        23   # BR(h -> Z       gam    )
     1.85050910E-01    2          24       -24   # BR(h -> W+      W-     )
     2.26589597E-02    2          23        23   # BR(h -> Z       Z      )
#
#         PDG            Width
DECAY        35     7.91708351E+01   # H decays
#          BR         NDA      ID1       ID2
     1.76525433E-01    2           5        -5   # BR(H -> b       bb     )
     4.08541294E-02    2         -15        15   # BR(H -> tau+    tau-   )
     1.44434077E-04    2         -13        13   # BR(H -> mu+     mu-    )
     1.49993950E-04    2           3        -3   # BR(H -> s       sb     )
     3.81433005E-08    2           4        -4   # BR(H -> c       cb     )
     4.38249797E-03    2           6        -6   # BR(H -> t       tb     )
     4.44260255E-06    2          21        21   # BR(H -> g       g      )
     4.81685530E-08    2          22        22   # BR(H -> gam     gam    )
     1.29606890E-09    2          23        22   # BR(H -> Z       gam    )
     1.28047327E-06    2          24       -24   # BR(H -> W+      W-     )
     6.39719727E-07    2          23        23   # BR(H -> Z       Z      )
     7.12773993E-06    2          25        25   # BR(H -> h       h      )
     1.45047790E-15    2          23        36   # BR(H -> Z       A      )
     5.70230391E-02    2     1000024  -1000024   # BR(H -> ~chi_1+ ~chi_1-)
     1.82231280E-02    2     1000037  -1000037   # BR(H -> ~chi_2+ ~chi_2-)
     1.54650158E-01    2     1000024  -1000037   # BR(H -> ~chi_1+ ~chi_2-)
     1.54650158E-01    2     1000037  -1000024   # BR(H -> ~chi_2+ ~chi_1-)
     2.83683406E-02    2     1000022   1000022   # BR(H -> ~chi_10 ~chi_10)
     7.59733258E-04    2     1000023   1000023   # BR(H -> ~chi_20 ~chi_20)
     1.75750100E-02    2     1000025   1000025   # BR(H -> ~chi_30 ~chi_30)
     6.27766002E-06    2     1000035   1000035   # BR(H -> ~chi_40 ~chi_40)
     8.66548763E-02    2     1000022   1000023   # BR(H -> ~chi_10 ~chi_20)
     4.09034077E-02    2     1000022   1000025   # BR(H -> ~chi_10 ~chi_30)
     3.36161465E-03    2     1000022   1000035   # BR(H -> ~chi_10 ~chi_40)
     1.75310088E-02    2     1000023   1000025   # BR(H -> ~chi_20 ~chi_30)
     2.12873722E-02    2     1000023   1000035   # BR(H -> ~chi_20 ~chi_40)
     1.79623077E-02    2     1000025   1000035   # BR(H -> ~chi_30 ~chi_40)
     6.72877112E-07    2     1000002  -1000002   # BR(H -> ~u_L    ~u_L*  )
     6.72877112E-07    2     1000004  -1000004   # BR(H -> ~c_L    ~c_L*  )
     3.88137305E-03    2     1000006  -1000006   # BR(H -> ~t_1    ~t_1*  )
     3.29601068E-03    2     2000006  -2000006   # BR(H -> ~t_2    ~t_2*  )
     1.40220155E-02    2     1000006  -2000006   # BR(H -> ~t_1    ~t_2*  )
     1.40220155E-02    2     2000006  -1000006   # BR(H -> ~t_2    ~t_1*  )
     9.84105942E-07    2     1000001  -1000001   # BR(H -> ~d_L    ~d_L*  )
     4.60546150E-08    2     2000001  -2000001   # BR(H -> ~d_R    ~d_R*  )
     9.84105942E-07    2     1000003  -1000003   # BR(H -> ~s_L    ~s_L*  )
     4.60546150E-08    2     2000003  -2000003   # BR(H -> ~s_R    ~s_R*  )
     3.18088788E-05    2     1000005  -1000005   # BR(H -> ~b_1    ~b_1*  )
     8.97889902E-06    2     2000005  -2000005   # BR(H -> ~b_2    ~b_2*  )
     6.18533015E-02    2     1000005  -2000005   # BR(H -> ~b_1    ~b_2*  )
     6.18533015E-02    2     2000005  -1000005   # BR(H -> ~b_2    ~b_1*  )
     1.96152043E-07    2     1000011  -1000011   # BR(H -> ~e_L-   ~e_L+  )
     1.29932672E-07    2     2000011  -2000011   # BR(H -> ~e_R-   ~e_R+  )
     1.96152043E-07    2     1000013  -1000013   # BR(H -> ~mu_L-  ~mu_L+ )
     1.29932672E-07    2     2000013  -2000013   # BR(H -> ~mu_R-  ~mu_R+ )
     3.18561792E-07    2     1000012  -1000012   # BR(H -> ~nu_eL  ~nu_eL*   )
     3.18561792E-07    2     1000014  -1000014   # BR(H -> ~nu_muL ~nu_muL*  )
     0.00000000E+00    2     1000016  -1000016   # BR(H -> ~nu_tauL ~nu_tauL*)
#
#         PDG            Width
DECAY        36     7.91895550E+01   # A decays
#          BR         NDA      ID1       ID2
     1.76471276E-01    2           5        -5   # BR(A -> b       bb     )
     4.08377781E-02    2         -15        15   # BR(A -> tau+    tau-   )
     1.44376137E-04    2         -13        13   # BR(A -> mu+     mu-    )
     1.49961165E-04    2           3        -3   # BR(A -> s       sb     )
     3.83692216E-08    2           4        -4   # BR(A -> c       cb     )
     4.39077157E-03    2           6        -6   # BR(A -> t       tb     )
     1.07703390E-05    2          21        21   # BR(A -> g       g      )
     2.59220544E-09    2          22        22   # BR(A -> gam     gam    )
     1.11172266E-08    2          23        22   # BR(A -> Z       gam    )
     1.27651608E-06    2          23        25   # BR(A -> Z       h      )
     6.54113608E-02    2     1000024  -1000024   # BR(A -> ~chi_1+ ~chi_1-)
     2.64734988E-02    2     1000037  -1000037   # BR(A -> ~chi_2+ ~chi_2-)
     1.46252061E-01    2     1000024  -1000037   # BR(A -> ~chi_1+ ~chi_2-)
     1.46252061E-01    2     1000037  -1000024   # BR(A -> ~chi_2+ ~chi_1-)
     3.27142062E-02    2     1000022   1000022   # BR(A -> ~chi_10 ~chi_10)
     6.55066207E-04    2     1000023   1000023   # BR(A -> ~chi_20 ~chi_20)
     2.27703078E-02    2     1000025   1000025   # BR(A -> ~chi_30 ~chi_30)
     5.77955437E-06    2     1000035   1000035   # BR(A -> ~chi_40 ~chi_40)
     6.84185338E-02    2     1000022   1000023   # BR(A -> ~chi_10 ~chi_20)
     5.27165722E-02    2     1000022   1000025   # BR(A -> ~chi_10 ~chi_30)
     3.61329318E-03    2     1000022   1000035   # BR(A -> ~chi_10 ~chi_40)
     1.44469373E-02    2     1000023   1000025   # BR(A -> ~chi_20 ~chi_30)
     2.07841795E-02    2     1000023   1000035   # BR(A -> ~chi_20 ~chi_40)
     1.81794161E-02    2     1000025   1000035   # BR(A -> ~chi_30 ~chi_40)
     1.77899115E-02    2     1000006  -2000006   # BR(A -> ~t_1    ~t_2*  )
     1.77899115E-02    2    -1000006   2000006   # BR(A -> ~t_1*   ~t_2   )
     6.18603206E-02    2     1000005  -2000005   # BR(A -> ~b_1    ~b_2*  )
     6.18603206E-02    2    -1000005   2000005   # BR(A -> ~b_1*   ~b_2   )
#
#         PDG            Width
DECAY        37     7.79620316E+01   # H+ decays
#          BR         NDA      ID1       ID2
     2.60963422E-04    2           4        -5   # BR(H+ -> c       bb     )
     4.14929873E-02    2         -15        16   # BR(H+ -> tau+    nu_tau )
     1.46692535E-04    2         -13        14   # BR(H+ -> mu+     nu_mu  )
     1.67016415E-06    2           2        -5   # BR(H+ -> u       bb     )
     7.29253782E-06    2           2        -3   # BR(H+ -> u       sb     )
     1.50027067E-04    2           4        -3   # BR(H+ -> c       sb     )
     1.67364194E-01    2           6        -5   # BR(H+ -> t       bb     )
     1.29829063E-06    2          24        25   # BR(H+ -> W+      h      )
     2.60883294E-14    2          24        36   # BR(H+ -> W+      A      )
     1.08275208E-06    2     1000024   1000022   # BR(H+ -> ~chi_1+ ~chi_10)
     1.74518986E-01    2     1000024   1000023   # BR(H+ -> ~chi_1+ ~chi_20)
     1.84132534E-01    2     1000024   1000025   # BR(H+ -> ~chi_1+ ~chi_30)
     6.51721285E-03    2     1000024   1000035   # BR(H+ -> ~chi_1+ ~chi_40)
     2.06437638E-01    2     1000037   1000022   # BR(H+ -> ~chi_2+ ~chi_10)
     1.95119365E-02    2     1000037   1000023   # BR(H+ -> ~chi_2+ ~chi_20)
     8.64778758E-04    2     1000037   1000025   # BR(H+ -> ~chi_2+ ~chi_30)
     3.61731420E-02    2     1000037   1000035   # BR(H+ -> ~chi_2+ ~chi_40)
     7.80636439E-07    2    -1000011   1000012   # BR(H+ -> ~e_L+   ~nu_eL )
     7.80636439E-07    2    -1000013   1000014   # BR(H+ -> ~mu_L+  ~nu_muL)
     1.66535060E-06    2     1000002  -1000001   # BR(H+ -> ~u_L    ~d_L*  )
     1.66535060E-06    2     1000004  -1000003   # BR(H+ -> ~c_L    ~s_L*  )
     2.27814352E-03    2     1000006  -1000005   # BR(H+ -> ~t_1    ~b_1*  )
     1.62415540E-03    2     2000006  -2000005   # BR(H+ -> ~t_2    ~b_2*  )
     3.43666587E-02    2     1000006  -2000005   # BR(H+ -> ~t_1    ~b_2*  )
     1.24143715E-01    2     2000006  -1000005   # BR(H+ -> ~t_2    ~b_1*  )
