#
#                              ======================
#                              | THE SUSYHIT OUTPUT |
#                              ======================
#
#
#              ------------------------------------------------------
#              |     This is the output of the SUSY-HIT package     |
#              |  created by A.Djouadi, M.Muehlleitner and M.Spira. |
#              |  In case of problems with SUSY-HIT email to        |
#              |           margarete.muehlleitner@cern.ch           |
#              |           michael.spira@psi.ch                     |
#              |           abdelhak.djouadi@cern.ch                 |
#              ------------------------------------------------------
#
#              ------------------------------------------------------
#              |  SUSY Les Houches Accord - MSSM Spectrum + Decays  |
#              |              based on the decay programs           |
#              |                                                    |
#              |                     SDECAY 1.3b                    |
#              |                                                    |
#              |  Authors: M.Muhlleitner, A.Djouadi and Y.Mambrini  |
#              |  Ref.:    Comput.Phys.Commun.168(2005)46           |
#              |           [hep-ph/0311167]                         |
#              |                                                    |
#              |                     HDECAY 3.4                     |
#              |                                                    |
#              |  By: A.Djouadi,J.Kalinowski,M.Muhlleitner,M.Spira  |
#              |  Ref.:    Comput.Phys.Commun.108(1998)56           |
#              |           [hep-ph/9704448]                         |
#              |                                                    |
#              |                                                    |
#              |  If not stated otherwise all DRbar couplings and   |
#              |  soft SUSY breaking masses are given at the scale  |
#              |  Q=  0.80782363E+03
#              |                                                    |
#              ------------------------------------------------------
#
#
BLOCK DCINFO  # Decay Program information
     1   SDECAY/HDECAY # decay calculator
     2   1.3b  /3.4    # version number
#
BLOCK SPINFO  # Spectrum calculator information
     1    SOFTSUSY    # spectrum calculator                
     2    3.3.10       # version number                    
#
BLOCK MODSEL  # Model selection
     1     0   #  nonUniversal                                     
#
BLOCK SMINPUTS  # Standard Model inputs
         1     1.27908953E+02   # alpha_em^-1(M_Z)^MSbar
         2     1.16637000E-05   # G_F [GeV^-2]
         3     1.18400000E-01   # alpha_S(M_Z)^MSbar
         4     9.11876000E+01   # M_Z pole mass
         5     4.19000000E+00   # mb(mb)^MSbar
         6     1.73300000E+02   # mt pole mass
         7     1.77700000E+00   # mtau pole mass
#
BLOCK MINPAR  # Input parameters - minimal models
         3     3.00000000E+01   # tanb                
#
BLOCK EXTPAR  # Input parameters - non-minimal models
         0    -1.00000000E+00   # Set                 
         1     3.00000000E+03   # M_1(MX)             
         2     1.37990000E+03   # M_2(MX)             
         3     1.70000000E+03   # M_3(MX)             
        11     1.93649179E+03   # At(MX)              
        12     0.00000000E+00   # Ab(MX)              
        13     0.00000000E+00   # Atau(MX)            
        23     4.59900000E+02   # mu(MX)              
        26     2.50000000E+03   # mA(pole)            
        31     3.00000000E+03   # meL(MX)             
        32     3.00000000E+03   # mmuL(MX)            
        33     3.00000000E+03   # mtauL(MX)           
        34     3.00000000E+03   # meR(MX)             
        35     3.00000000E+03   # mmuR(MX)            
        36     3.00000000E+03   # mtauR(MX)           
        41     3.00000000E+03   # mqL1(MX)            
        42     3.00000000E+03   # mqL2(MX)            
        43     7.99900000E+02   # mqL3(MX)            
        44     3.00000000E+03   # muR(MX)             
        45     3.00000000E+03   # mcR(MX)             
        46     8.67815498E+02   # mtR(MX)             
        47     3.00000000E+03   # mdR(MX)             
        48     3.00000000E+03   # msR(MX)             
        49     3.00000000E+03   # mbR(MX)             
#
BLOCK MASS  # Mass Spectrum
# PDG code           mass       particle
        24     8.04211404E+01   # W+
        25     1.24148276E+02   # h
        35     2.49996879E+03   # H
        36     2.49999993E+03   # A
        37     2.50165311E+03   # H+
         5     4.82997438E+00   # b-quark pole mass calculated from mb(mb)_Msbar
   1000001     3.00829911E+03   # ~d_L
   2000001     3.00612432E+03   # ~d_R
   1000002     3.00739773E+03   # ~u_L
   2000002     3.00371815E+03   # ~u_R
   1000003     3.00829911E+03   # ~s_L
   2000003     3.00612432E+03   # ~s_R
   1000004     3.00739773E+03   # ~c_L
   2000004     3.00371815E+03   # ~c_R
   1000005     7.94450447E+02   # ~b_1
   2000005     3.00978809E+03   # ~b_2
   1000006     6.04300919E+02   # ~t_1
   2000006     9.80086239E+02   # ~t_2
   1000011     3.00089539E+03   # ~e_L
   2000011     2.99814525E+03   # ~e_R
   1000012     2.99953366E+03   # ~nu_eL
   1000013     3.00089539E+03   # ~mu_L
   2000013     2.99814525E+03   # ~mu_R
   1000014     2.99953366E+03   # ~nu_muL
   1000015     2.99945692E+03   # ~tau_1
   2000015     3.00750375E+03   # ~tau_2
   1000016     3.00217598E+03   # ~nu_tauL
   1000021     1.80831438E+03   # ~g
   1000022     4.63467117E+02   # ~chi_10
   1000023    -4.67115896E+02   # ~chi_20
   1000025     1.42105996E+03   # ~chi_30
   1000035     3.03744892E+03   # ~chi_40
   1000024     4.64828168E+02   # ~chi_1+
   1000037     1.42123920E+03   # ~chi_2+
#
BLOCK NMIX  # Neutralino Mixing Matrix
  1  1     1.22183812E-02   # N_11
  1  2    -5.96406339E-02   # N_12
  1  3     7.07757549E-01   # N_13
  1  4    -7.03827364E-01   # N_14
  2  1    -8.48211492E-03   # N_21
  2  2     2.88372118E-02   # N_22
  2  3     7.06110893E-01   # N_23
  2  4     7.07462985E-01   # N_24
  3  1     1.83288741E-03   # N_31
  3  2     9.97802925E-01   # N_32
  3  3     2.18946344E-02   # N_33
  3  4    -6.25027010E-02   # N_34
  4  1     9.99887696E-01   # N_41
  4  2    -8.55643960E-04   # N_42
  4  3    -2.69877130E-03   # N_43
  4  4     1.47166265E-02   # N_44
#
BLOCK UMIX  # Chargino Mixing Matrix U
  1  1    -3.09423323E-02   # U_11
  1  2     9.99521171E-01   # U_12
  2  1    -9.99521171E-01   # U_21
  2  2    -3.09423323E-02   # U_22
#
BLOCK VMIX  # Chargino Mixing Matrix V
  1  1    -8.83543340E-02   # V_11
  1  2     9.96089108E-01   # V_12
  2  1    -9.96089108E-01   # V_21
  2  2    -8.83543340E-02   # V_22
#
BLOCK STOPMIX  # Stop Mixing Matrix
  1  1     7.27084385E-01   # cos(theta_t)
  1  2    -6.86548103E-01   # sin(theta_t)
  2  1     6.86548103E-01   # -sin(theta_t)
  2  2     7.27084385E-01   # cos(theta_t)
#
BLOCK SBOTMIX  # Sbottom Mixing Matrix
  1  1     9.99994979E-01   # cos(theta_b)
  1  2     3.16890751E-03   # sin(theta_b)
  2  1    -3.16890751E-03   # -sin(theta_b)
  2  2     9.99994979E-01   # cos(theta_b)
#
BLOCK STAUMIX  # Stau Mixing Matrix
  1  1     7.04931324E-01   # cos(theta_tau)
  1  2     7.09275566E-01   # sin(theta_tau)
  2  1    -7.09275566E-01   # -sin(theta_tau)
  2  2     7.04931324E-01   # cos(theta_tau)
#
BLOCK ALPHA  # Higgs mixing
          -3.43215402E-02   # Mixing angle in the neutral Higgs boson sector
#
BLOCK HMIX Q=  8.07823627E+02  # DRbar Higgs Parameters
         1     4.59900000E+02   # mu(Q)MSSM           
         2     2.92150281E+01   # tan                 
         3     2.44574950E+02   # higgs               
         4     6.19584794E+06   # mA^2(Q)MSSM         
#
BLOCK GAUGE Q=  8.07823627E+02  # The gauge couplings
     1     3.60687194E-01   # gprime(Q) DRbar
     2     6.36663235E-01   # g(Q) DRbar
     3     1.04871588E+00   # g3(Q) DRbar
#
BLOCK AU Q=  8.07823627E+02  # The trilinear couplings
  1  1     1.93649179E+03   # A_u(Q) DRbar
  2  2     1.93649179E+03   # A_c(Q) DRbar
  3  3     1.93649179E+03   # A_t(Q) DRbar
#
BLOCK AD Q=  8.07823627E+02  # The trilinear couplings
  1  1     1.73588887E-07   # A_d(Q) DRbar
  2  2     1.73620314E-07   # A_s(Q) DRbar
  3  3     3.18404260E-07   # A_b(Q) DRbar
#
BLOCK AE Q=  8.07823627E+02  # The trilinear couplings
  1  1     0.00000000E+00   # A_e(Q) DRbar
  2  2     5.99488201E-08   # A_mu(Q) DRbar
  3  3     6.14678587E-08   # A_tau(Q) DRbar
#
BLOCK Yu Q=  8.07823627E+02  # The Yukawa couplings
  1  1     0.00000000E+00   # y_u(Q) DRbar
  2  2     0.00000000E+00   # y_c(Q) DRbar
  3  3     8.83939797E-01   # y_t(Q) DRbar
#
BLOCK Yd Q=  8.07823627E+02  # The Yukawa couplings
  1  1     0.00000000E+00   # y_d(Q) DRbar
  2  2     0.00000000E+00   # y_s(Q) DRbar
  3  3     3.77840439E-01   # y_b(Q) DRbar
#
BLOCK Ye Q=  8.07823627E+02  # The Yukawa couplings
  1  1     0.00000000E+00   # y_e(Q) DRbar
  2  2     0.00000000E+00   # y_mu(Q) DRbar
  3  3     3.01863593E-01   # y_tau(Q) DRbar
#
BLOCK MSOFT Q=  8.07823627E+02  # The soft SUSY breaking masses at the scale Q
         1     3.00000000E+03   # M_1(Q)              
         2     1.37990000E+03   # M_2(Q)              
         3     1.70000000E+03   # M_3(Q)              
        21     5.98136423E+06   # mH1^2(Q)            
        22    -1.78681886E+05   # mH2^2(Q)            
        31     3.00000000E+03   # meL(Q)              
        32     3.00000000E+03   # mmuL(Q)             
        33     3.00000000E+03   # mtauL(Q)            
        34     3.00000000E+03   # meR(Q)              
        35     3.00000000E+03   # mmuR(Q)             
        36     3.00000000E+03   # mtauR(Q)            
        41     3.00000000E+03   # mqL1(Q)             
        42     3.00000000E+03   # mqL2(Q)             
        43     7.99899999E+02   # mqL3(Q)             
        44     3.00000000E+03   # muR(Q)              
        45     3.00000000E+03   # mcR(Q)              
        46     8.67815497E+02   # mtR(Q)              
        47     3.00000000E+03   # mdR(Q)              
        48     3.00000000E+03   # msR(Q)              
        49     3.00000000E+03   # mbR(Q)              
#
#
#
#                             =================
#                             |The decay table|
#                             =================
#
# - The QCD corrections to the decays gluino -> squark  + quark
#                                     squark -> gaugino + quark_prime
#                                     squark -> squark_prime + Higgs
#                                     squark -> gluino  + quark
#   are included.
#
# - The multi-body decays for the inos, stops and sbottoms are included.
#
# - The loop induced decays for the gluino, neutralinos and stops
#   are included.
#
# - The SUSY decays of the top quark are included.
#
#
#         PDG            Width
DECAY         6     1.42904482E+00   # top decays
#          BR         NDA      ID1       ID2
     1.00000000E+00    2           5        24   # BR(t ->  b    W+)
#
#         PDG            Width
DECAY   1000021     7.30964943E+01   # gluino decays
#          BR         NDA      ID1       ID2
     1.65781856E-01    2     1000005        -5   # BR(~g -> ~b_1  bb)
     1.65781856E-01    2    -1000005         5   # BR(~g -> ~b_1* b )
     2.39838512E-01    2     1000006        -6   # BR(~g -> ~t_1  tb)
     2.39838512E-01    2    -1000006         6   # BR(~g -> ~t_1* t )
     9.43796318E-02    2     2000006        -6   # BR(~g -> ~t_2  tb)
     9.43796318E-02    2    -2000006         6   # BR(~g -> ~t_2* t )
#
#         PDG            Width
DECAY   1000006     7.97493816E-01   # stop1 decays
#          BR         NDA      ID1       ID2
     1.00000000E+00    2     1000024         5   # BR(~t_1 -> ~chi_1+ b )
#
#         PDG            Width
DECAY   2000006     3.68828996E+01   # stop2 decays
#          BR         NDA      ID1       ID2
     9.03717859E-02    2     1000022         6   # BR(~t_2 -> ~chi_10 t )
     1.37095601E-01    2     1000023         6   # BR(~t_2 -> ~chi_20 t )
     0.00000000E+00    2     1000025         6   # BR(~t_2 -> ~chi_30 t )
     1.62726527E-01    2     1000024         5   # BR(~t_2 -> ~chi_1+ b )
     1.41116238E-03    2     1000006        25   # BR(~t_2 -> ~t_1    h )
     4.05297003E-01    2     1000006        23   # BR(~t_2 -> ~t_1    Z )
     2.03097920E-01    2     1000005        24   # BR(~t_2 -> ~b_1    W+)
#
#         PDG            Width
DECAY   1000005     1.31403617E+01   # sbottom1 decays
#          BR         NDA      ID1       ID2
     3.59983731E-02    2     1000022         5   # BR(~b_1 -> ~chi_10 b )
     3.49347191E-02    2     1000023         5   # BR(~b_1 -> ~chi_20 b )
     3.10744302E-01    2    -1000024         6   # BR(~b_1 -> ~chi_1- t )
     6.18322605E-01    2     1000006       -24   # BR(~b_1 -> ~t_1    W-)
#
#         PDG            Width
DECAY   2000005     1.00525880E+02   # sbottom2 decays
#          BR         NDA      ID1       ID2
     3.79205710E-02    2     1000022         5   # BR(~b_2 -> ~chi_10 b )
     3.77529117E-02    2     1000023         5   # BR(~b_2 -> ~chi_20 b )
     3.11357028E-05    2     1000025         5   # BR(~b_2 -> ~chi_30 b )
     7.52321206E-02    2    -1000024         6   # BR(~b_2 -> ~chi_1- t )
     6.17499353E-05    2    -1000037         6   # BR(~b_2 -> ~chi_2- t )
     8.45307472E-01    2     1000021         5   # BR(~b_2 -> ~g      b )
     8.62978682E-04    2     1000005        25   # BR(~b_2 -> ~b_1    h )
     1.09094743E-03    2     1000005        23   # BR(~b_2 -> ~b_1    Z )
     1.00710702E-03    2     1000006       -24   # BR(~b_2 -> ~t_1    W-)
     7.33006370E-04    2     2000006       -24   # BR(~b_2 -> ~t_2    W-)
#
#         PDG            Width
DECAY   1000002     1.06029850E+02   # sup_L decays
#          BR         NDA      ID1       ID2
     3.43734250E-04    2     1000022         2   # BR(~u_L -> ~chi_10 u)
     7.75090251E-05    2     1000023         2   # BR(~u_L -> ~chi_20 u)
     6.63020473E-02    2     1000025         2   # BR(~u_L -> ~chi_30 u)
     1.63220181E-03    2     1000024         1   # BR(~u_L -> ~chi_1+ d)
     1.32038362E-01    2     1000037         1   # BR(~u_L -> ~chi_2+ d)
     7.99606146E-01    2     1000021         2   # BR(~u_L -> ~g      u)
#
#         PDG            Width
DECAY   2000002     8.44448497E+01   # sup_R decays
#          BR         NDA      ID1       ID2
     1.11690082E-05    2     1000022         2   # BR(~u_R -> ~chi_10 u)
     5.37860258E-06    2     1000023         2   # BR(~u_R -> ~chi_20 u)
     1.59747619E-07    2     1000025         2   # BR(~u_R -> ~chi_30 u)
     9.99983293E-01    2     1000021         2   # BR(~u_R -> ~g      u)
#
#         PDG            Width
DECAY   1000001     1.06069705E+02   # sdown_L decays
#          BR         NDA      ID1       ID2
     4.01278805E-04    2     1000022         1   # BR(~d_L -> ~chi_10 d)
     9.68116010E-05    2     1000023         1   # BR(~d_L -> ~chi_20 d)
     6.62280174E-02    2     1000025         1   # BR(~d_L -> ~chi_30 d)
     2.00173700E-04    2    -1000024         2   # BR(~d_L -> ~chi_1- u)
     1.32985782E-01    2    -1000037         2   # BR(~d_L -> ~chi_2- u)
     8.00087937E-01    2     1000021         1   # BR(~d_L -> ~g      d)
#
#         PDG            Width
DECAY   2000001     8.46652595E+01   # sdown_R decays
#          BR         NDA      ID1       ID2
     2.78748504E-06    2     1000022         1   # BR(~d_R -> ~chi_10 d)
     1.34235667E-06    2     1000023         1   # BR(~d_R -> ~chi_20 d)
     3.99018654E-08    2     1000025         1   # BR(~d_R -> ~chi_30 d)
     9.99995830E-01    2     1000021         1   # BR(~d_R -> ~g      d)
#
#         PDG            Width
DECAY   1000004     1.06029850E+02   # scharm_L decays
#          BR         NDA      ID1       ID2
     3.43734250E-04    2     1000022         4   # BR(~c_L -> ~chi_10 c)
     7.75090251E-05    2     1000023         4   # BR(~c_L -> ~chi_20 c)
     6.63020473E-02    2     1000025         4   # BR(~c_L -> ~chi_30 c)
     1.63220181E-03    2     1000024         3   # BR(~c_L -> ~chi_1+ s)
     1.32038362E-01    2     1000037         3   # BR(~c_L -> ~chi_2+ s)
     7.99606146E-01    2     1000021         4   # BR(~c_L -> ~g      c)
#
#         PDG            Width
DECAY   2000004     8.44448497E+01   # scharm_R decays
#          BR         NDA      ID1       ID2
     1.11690082E-05    2     1000022         4   # BR(~c_R -> ~chi_10 c)
     5.37860258E-06    2     1000023         4   # BR(~c_R -> ~chi_20 c)
     1.59747619E-07    2     1000025         4   # BR(~c_R -> ~chi_30 c)
     9.99983293E-01    2     1000021         4   # BR(~c_R -> ~g      c)
#
#         PDG            Width
DECAY   1000003     1.06069705E+02   # sstrange_L decays
#          BR         NDA      ID1       ID2
     4.01278805E-04    2     1000022         3   # BR(~s_L -> ~chi_10 s)
     9.68116010E-05    2     1000023         3   # BR(~s_L -> ~chi_20 s)
     6.62280174E-02    2     1000025         3   # BR(~s_L -> ~chi_30 s)
     2.00173700E-04    2    -1000024         4   # BR(~s_L -> ~chi_1- c)
     1.32985782E-01    2    -1000037         4   # BR(~s_L -> ~chi_2- c)
     8.00087937E-01    2     1000021         3   # BR(~s_L -> ~g      s)
#
#         PDG            Width
DECAY   2000003     8.46652595E+01   # sstrange_R decays
#          BR         NDA      ID1       ID2
     2.78748504E-06    2     1000022         3   # BR(~s_R -> ~chi_10 s)
     1.34235667E-06    2     1000023         3   # BR(~s_R -> ~chi_20 s)
     3.99018654E-08    2     1000025         3   # BR(~s_R -> ~chi_30 s)
     9.99995830E-01    2     1000021         3   # BR(~s_R -> ~g      s)
#
#         PDG            Width
DECAY   1000011     2.18722707E+01   # selectron_L decays
#          BR         NDA      ID1       ID2
     1.46499101E-03    2     1000022        11   # BR(~e_L -> ~chi_10 e-)
     3.04191233E-04    2     1000023        11   # BR(~e_L -> ~chi_20 e-)
     3.32138059E-01    2     1000025        11   # BR(~e_L -> ~chi_30 e-)
     1.00906396E-03    2    -1000024        12   # BR(~e_L -> ~chi_1- nu_e)
     6.65083695E-01    2    -1000037        12   # BR(~e_L -> ~chi_2- nu_e)
#
#         PDG            Width
DECAY   2000011     3.30181752E-03   # selectron_R decays
#          BR         NDA      ID1       ID2
     6.68559950E-01    2     1000022        11   # BR(~e_R -> ~chi_10 e-)
     3.21947546E-01    2     1000023        11   # BR(~e_R -> ~chi_20 e-)
     9.49250398E-03    2     1000025        11   # BR(~e_R -> ~chi_30 e-)
#
#         PDG            Width
DECAY   1000013     2.18722707E+01   # smuon_L decays
#          BR         NDA      ID1       ID2
     1.46499101E-03    2     1000022        13   # BR(~mu_L -> ~chi_10 mu-)
     3.04191233E-04    2     1000023        13   # BR(~mu_L -> ~chi_20 mu-)
     3.32138059E-01    2     1000025        13   # BR(~mu_L -> ~chi_30 mu-)
     1.00906396E-03    2    -1000024        14   # BR(~mu_L -> ~chi_1- nu_mu)
     6.65083695E-01    2    -1000037        14   # BR(~mu_L -> ~chi_2- nu_mu)
#
#         PDG            Width
DECAY   2000013     3.30181752E-03   # smuon_R decays
#          BR         NDA      ID1       ID2
     6.68559950E-01    2     1000022        13   # BR(~mu_R -> ~chi_10 mu-)
     3.21947546E-01    2     1000023        13   # BR(~mu_R -> ~chi_20 mu-)
     9.49250398E-03    2     1000025        13   # BR(~mu_R -> ~chi_30 mu-)
#
#         PDG            Width
DECAY   1000015     1.88407022E+01   # stau_1 decays
#          BR         NDA      ID1       ID2
     1.57938882E-01    2     1000022        15   # BR(~tau_1 -> ~chi_10  tau-)
     1.27492420E-01    2     1000023        15   # BR(~tau_1 -> ~chi_20  tau-)
     1.85846818E-01    2     1000025        15   # BR(~tau_1 -> ~chi_30  tau-)
     1.56677929E-01    2    -1000024        16   # BR(~tau_1 -> ~chi_1-  nu_tau)
     3.72043951E-01    2    -1000037        16   # BR(~tau_1 -> ~chi_2-  nu_tau)
#
#         PDG            Width
DECAY   2000015     1.86323918E+01   # stau_2 decays
#          BR         NDA      ID1       ID2
     1.21050964E-01    2     1000022        15   # BR(~tau_2 -> ~chi_10  tau-)
     1.48991894E-01    2     1000023        15   # BR(~tau_2 -> ~chi_20  tau-)
     2.02909229E-01    2     1000025        15   # BR(~tau_2 -> ~chi_30  tau-)
     1.20821542E-01    2    -1000024        16   # BR(~tau_2 -> ~chi_1-  nu_tau)
     4.06226371E-01    2    -1000037        16   # BR(~tau_2 -> ~chi_2-  nu_tau)
#
#         PDG            Width
DECAY   1000012     2.19043337E+01   # snu_eL decays
#          BR         NDA      ID1       ID2
     2.33086177E-03    2     1000022        12   # BR(~nu_eL -> ~chi_10 nu_e)
     5.94972852E-04    2     1000023        12   # BR(~nu_eL -> ~chi_20 nu_e)
     3.29951018E-01    2     1000025        12   # BR(~nu_eL -> ~chi_30 nu_e)
     8.21137029E-03    2     1000024        11   # BR(~nu_eL -> ~chi_1+ e-)
     6.58911777E-01    2     1000037        11   # BR(~nu_eL -> ~chi_2+ e-)
#
#         PDG            Width
DECAY   1000014     2.19043337E+01   # snu_muL decays
#          BR         NDA      ID1       ID2
     2.33086177E-03    2     1000022        14   # BR(~nu_muL -> ~chi_10 nu_mu)
     5.94972852E-04    2     1000023        14   # BR(~nu_muL -> ~chi_20 nu_mu)
     3.29951018E-01    2     1000025        14   # BR(~nu_muL -> ~chi_30 nu_mu)
     8.21137029E-03    2     1000024        13   # BR(~nu_muL -> ~chi_1+ mu-)
     6.58911777E-01    2     1000037        13   # BR(~nu_muL -> ~chi_2+ mu-)
#
#         PDG            Width
DECAY   1000016     2.71283970E+01   # snu_tauL decays
#          BR         NDA      ID1       ID2
     1.88383221E-03    2     1000022        16   # BR(~nu_tauL -> ~chi_10 nu_tau)
     4.80865318E-04    2     1000023        16   # BR(~nu_tauL -> ~chi_20 nu_tau)
     2.66919298E-01    2     1000025        16   # BR(~nu_tauL -> ~chi_30 nu_tau)
     1.97551968E-01    2     1000024        15   # BR(~nu_tauL -> ~chi_1+ tau-)
     5.33164037E-01    2     1000037        15   # BR(~nu_tauL -> ~chi_2+ tau-)
#
#         PDG            Width
DECAY   1000024     4.94001521E-12   # chargino1+ decays
#           BR         NDA      ID1       ID2       ID3
     3.74999961E-01    3     1000022         2        -1   # BR(~chi_1+ -> ~chi_10 u    db)
     3.74999961E-01    3     1000022         4        -3   # BR(~chi_1+ -> ~chi_10 c    sb)
     1.25000039E-01    3     1000022       -11        12   # BR(~chi_1+ -> ~chi_10 e+   nu_e)
     1.25000039E-01    3     1000022       -13        14   # BR(~chi_1+ -> ~chi_10 mu+  nu_mu)
#
#         PDG            Width
DECAY   1000037     3.16519527E+01   # chargino2+ decays
#          BR         NDA      ID1       ID2
     2.85057349E-01    2     1000006        -5   # BR(~chi_2+ -> ~t_1     bb)
     6.74112254E-02    2     2000006        -5   # BR(~chi_2+ -> ~t_2     bb)
     2.92115014E-01    2    -1000005         6   # BR(~chi_2+ -> ~b_1*    t )
     8.94377276E-02    2     1000024        23   # BR(~chi_2+ -> ~chi_1+  Z )
     8.77579169E-02    2     1000022        24   # BR(~chi_2+ -> ~chi_10  W+)
     8.78237903E-02    2     1000023        24   # BR(~chi_2+ -> ~chi_20  W+)
     9.03969767E-02    2     1000024        25   # BR(~chi_2+ -> ~chi_1+  h )
#
#         PDG            Width
DECAY   1000022     0.00000000E+00   # neutralino1 decays
#
#         PDG            Width
DECAY   1000023     7.09972671E-10   # neutralino2 decays
#          BR         NDA      ID1       ID2
     8.08746966E-02    2     1000022        22   # BR(~chi_20 -> ~chi_10 gam)
#           BR         NDA      ID1       ID2       ID3
     1.05329386E-01    3     1000022        -2         2   # BR(~chi_20 -> ~chi_10 ub      u)
     1.36541522E-01    3     1000022        -1         1   # BR(~chi_20 -> ~chi_10 db      d)
     1.05329386E-01    3     1000022        -4         4   # BR(~chi_20 -> ~chi_10 cb      c)
     1.36541522E-01    3     1000022        -3         3   # BR(~chi_20 -> ~chi_10 sb      s)
     3.12621710E-02    3     1000022       -11        11   # BR(~chi_20 -> ~chi_10 e+      e-)
     3.12621710E-02    3     1000022       -13        13   # BR(~chi_20 -> ~chi_10 mu+     mu-)
     1.19344625E-04    3     1000022       -15        15   # BR(~chi_20 -> ~chi_10 tau+    tau-)
     6.24752840E-02    3     1000022       -12        12   # BR(~chi_20 -> ~chi_10 nu_eb   nu_e)
     6.24752840E-02    3     1000022       -14        14   # BR(~chi_20 -> ~chi_10 nu_mub  nu_mu)
     6.24752836E-02    3     1000022       -16        16   # BR(~chi_20 -> ~chi_10 nu_taub nu_tau)
     3.46333168E-02    3     1000024        -2         1   # BR(~chi_20 -> ~chi_1+ ub      d)
     3.46333168E-02    3    -1000024        -1         2   # BR(~chi_20 -> ~chi_1- db      u)
     3.46333168E-02    3     1000024        -4         3   # BR(~chi_20 -> ~chi_1+ cb      s)
     3.46333168E-02    3    -1000024        -3         4   # BR(~chi_20 -> ~chi_1- sb      c)
     1.15444455E-02    3     1000024       -12        11   # BR(~chi_20 -> ~chi_1+ nu_eb   e-)
     1.15444455E-02    3    -1000024        12       -11   # BR(~chi_20 -> ~chi_1- nu_e    e+)
     1.15444455E-02    3     1000024       -14        13   # BR(~chi_20 -> ~chi_1+ nu_mub  mu-)
     1.15444455E-02    3    -1000024        14       -13   # BR(~chi_20 -> ~chi_1- nu_mu   mu+)
     3.01450449E-04    3     1000024       -16        15   # BR(~chi_20 -> ~chi_1+ nu_taub tau-)
     3.01450449E-04    3    -1000024        16       -15   # BR(~chi_20 -> ~chi_1- nu_tau  tau+)
#
#         PDG            Width
DECAY   1000025     3.16049081E+01   # neutralino3 decays
#          BR         NDA      ID1       ID2
     1.70177534E-02    2     1000022        23   # BR(~chi_30 -> ~chi_10   Z )
     7.27408289E-02    2     1000023        23   # BR(~chi_30 -> ~chi_20   Z )
     8.76547485E-02    2     1000024       -24   # BR(~chi_30 -> ~chi_1+   W-)
     8.76547485E-02    2    -1000024        24   # BR(~chi_30 -> ~chi_1-   W+)
     7.29806044E-02    2     1000022        25   # BR(~chi_30 -> ~chi_10   h )
     1.63122865E-02    2     1000023        25   # BR(~chi_30 -> ~chi_20   h )
     1.36067341E-01    2     1000006        -6   # BR(~chi_30 -> ~t_1      tb)
     1.36067341E-01    2    -1000006         6   # BR(~chi_30 -> ~t_1*     t )
     2.94038709E-02    2     2000006        -6   # BR(~chi_30 -> ~t_2      tb)
     2.94038709E-02    2    -2000006         6   # BR(~chi_30 -> ~t_2*     t )
     1.57348303E-01    2     1000005        -5   # BR(~chi_30 -> ~b_1      bb)
     1.57348303E-01    2    -1000005         5   # BR(~chi_30 -> ~b_1*     b )
#
#         PDG            Width
DECAY   1000035     3.07859335E+01   # neutralino4 decays
#          BR         NDA      ID1       ID2
     1.94025199E-02    2     1000022        23   # BR(~chi_40 -> ~chi_10   Z )
     4.11276529E-02    2     1000023        23   # BR(~chi_40 -> ~chi_20   Z )
     1.03363684E-04    2     1000025        23   # BR(~chi_40 -> ~chi_30   Z )
     5.78193600E-02    2     1000024       -24   # BR(~chi_40 -> ~chi_1+   W-)
     5.78193600E-02    2    -1000024        24   # BR(~chi_40 -> ~chi_1-   W+)
     1.07201871E-03    2     1000037       -24   # BR(~chi_40 -> ~chi_2+   W-)
     1.07201871E-03    2    -1000037        24   # BR(~chi_40 -> ~chi_2-   W+)
     4.36435154E-02    2     1000022        25   # BR(~chi_40 -> ~chi_10   h )
     3.16437085E-03    2     1000022        35   # BR(~chi_40 -> ~chi_10   H )
     2.26554606E-04    2     1000022        36   # BR(~chi_40 -> ~chi_10   A )
     2.07283340E-02    2     1000023        25   # BR(~chi_40 -> ~chi_20   h )
     2.09819716E-04    2     1000023        35   # BR(~chi_40 -> ~chi_20   H )
     3.09187372E-03    2     1000023        36   # BR(~chi_40 -> ~chi_20   A )
     8.54138777E-04    2     1000025        25   # BR(~chi_40 -> ~chi_30   h )
     3.28532236E-03    2     1000024       -37   # BR(~chi_40 -> ~chi_1+   H-)
     3.28532236E-03    2    -1000024        37   # BR(~chi_40 -> ~chi_1-   H+)
     1.00425726E-05    2     1000002        -2   # BR(~chi_40 -> ~u_L      ub)
     1.00425726E-05    2    -1000002         2   # BR(~chi_40 -> ~u_L*     u )
     2.02040062E-04    2     2000002        -2   # BR(~chi_40 -> ~u_R      ub)
     2.02040062E-04    2    -2000002         2   # BR(~chi_40 -> ~u_R*     u )
     9.64980634E-06    2     1000001        -1   # BR(~chi_40 -> ~d_L      db)
     9.64980634E-06    2    -1000001         1   # BR(~chi_40 -> ~d_L*     d )
     4.38713730E-05    2     2000001        -1   # BR(~chi_40 -> ~d_R      db)
     4.38713730E-05    2    -2000001         1   # BR(~chi_40 -> ~d_R*     d )
     1.00425726E-05    2     1000004        -4   # BR(~chi_40 -> ~c_L      cb)
     1.00425726E-05    2    -1000004         4   # BR(~chi_40 -> ~c_L*     c )
     2.02040062E-04    2     2000004        -4   # BR(~chi_40 -> ~c_R      cb)
     2.02040062E-04    2    -2000004         4   # BR(~chi_40 -> ~c_R*     c )
     9.64980634E-06    2     1000003        -3   # BR(~chi_40 -> ~s_L      sb)
     9.64980634E-06    2    -1000003         3   # BR(~chi_40 -> ~s_L*     s )
     4.38713730E-05    2     2000003        -3   # BR(~chi_40 -> ~s_R      sb)
     4.38713730E-05    2    -2000003         3   # BR(~chi_40 -> ~s_R*     s )
     1.95520586E-01    2     1000006        -6   # BR(~chi_40 -> ~t_1      tb)
     1.95520586E-01    2    -1000006         6   # BR(~chi_40 -> ~t_1*     t )
     1.53914955E-01    2     2000006        -6   # BR(~chi_40 -> ~t_2      tb)
     1.53914955E-01    2    -2000006         6   # BR(~chi_40 -> ~t_2*     t )
     2.09050018E-02    2     1000005        -5   # BR(~chi_40 -> ~b_1      bb)
     2.09050018E-02    2    -1000005         5   # BR(~chi_40 -> ~b_1*     b )
     4.08340458E-05    2     2000005        -5   # BR(~chi_40 -> ~b_2      bb)
     4.08340458E-05    2    -2000005         5   # BR(~chi_40 -> ~b_2*     b )
     3.64196836E-05    2     1000011       -11   # BR(~chi_40 -> ~e_L-     e+)
     3.64196836E-05    2    -1000011        11   # BR(~chi_40 -> ~e_L+     e-)
     1.68780020E-04    2     2000011       -11   # BR(~chi_40 -> ~e_R-     e+)
     1.68780020E-04    2    -2000011        11   # BR(~chi_40 -> ~e_R+     e-)
     3.64196836E-05    2     1000013       -13   # BR(~chi_40 -> ~mu_L-    mu+)
     3.64196836E-05    2    -1000013        13   # BR(~chi_40 -> ~mu_L+    mu-)
     1.68780020E-04    2     2000013       -13   # BR(~chi_40 -> ~mu_R-    mu+)
     1.68780020E-04    2    -2000013        13   # BR(~chi_40 -> ~mu_R+    mu-)
     9.49695761E-05    2     1000015       -15   # BR(~chi_40 -> ~tau_1-   tau+)
     9.49695761E-05    2    -1000015        15   # BR(~chi_40 -> ~tau_1+   tau-)
     6.40478929E-05    2     2000015       -15   # BR(~chi_40 -> ~tau_2-   tau+)
     6.40478929E-05    2    -2000015        15   # BR(~chi_40 -> ~tau_2+   tau-)
     3.94034009E-05    2     1000012       -12   # BR(~chi_40 -> ~nu_eL    nu_eb)
     3.94034009E-05    2    -1000012        12   # BR(~chi_40 -> ~nu_eL*   nu_e )
     3.94034009E-05    2     1000014       -14   # BR(~chi_40 -> ~nu_muL   nu_mub)
     3.94034009E-05    2    -1000014        14   # BR(~chi_40 -> ~nu_muL*  nu_mu )
     3.41325739E-05    2     1000016       -16   # BR(~chi_40 -> ~nu_tau1  nu_taub)
     3.41325739E-05    2    -1000016        16   # BR(~chi_40 -> ~nu_tau1* nu_tau )
#
#         PDG            Width
DECAY        25     4.01763929E-03   # h decays
#          BR         NDA      ID1       ID2
     6.36703866E-01    2           5        -5   # BR(h -> b       bb     )
     6.43585357E-02    2         -15        15   # BR(h -> tau+    tau-   )
     2.27809306E-04    2         -13        13   # BR(h -> mu+     mu-    )
     4.50689214E-04    2           3        -3   # BR(h -> s       sb     )
     1.95312292E-02    2           4        -4   # BR(h -> c       cb     )
     6.23549174E-02    2          21        21   # BR(h -> g       g      )
     2.33963333E-03    2          22        22   # BR(h -> gam     gam    )
     1.44106844E-03    2          22        23   # BR(h -> Z       gam    )
     1.89198011E-01    2          24       -24   # BR(h -> W+      W-     )
     2.33942401E-02    2          23        23   # BR(h -> Z       Z      )
#
#         PDG            Width
DECAY        35     4.05417656E+01   # H decays
#          BR         NDA      ID1       ID2
     4.51229687E-01    2           5        -5   # BR(H -> b       bb     )
     1.09075298E-01    2         -15        15   # BR(H -> tau+    tau-   )
     3.85621140E-04    2         -13        13   # BR(H -> mu+     mu-    )
     4.49157877E-04    2           3        -3   # BR(H -> s       sb     )
     2.78045363E-08    2           4        -4   # BR(H -> c       cb     )
     2.99611786E-03    2           6        -6   # BR(H -> t       tb     )
     4.67883664E-05    2          21        21   # BR(H -> g       g      )
     2.17842656E-07    2          22        22   # BR(H -> gam     gam    )
     5.83413877E-09    2          23        22   # BR(H -> Z       gam    )
     1.41059549E-06    2          24       -24   # BR(H -> W+      W-     )
     7.04047841E-07    2          23        23   # BR(H -> Z       Z      )
     8.93497517E-06    2          25        25   # BR(H -> h       h      )
     3.18431461E-03    2     1000024  -1000024   # BR(H -> ~chi_1+ ~chi_1-)
     1.03555200E-01    2     1000024  -1000037   # BR(H -> ~chi_1+ ~chi_2-)
     1.03555200E-01    2     1000037  -1000024   # BR(H -> ~chi_2+ ~chi_1-)
     8.57017653E-04    2     1000022   1000022   # BR(H -> ~chi_10 ~chi_10)
     2.47897021E-04    2     1000023   1000023   # BR(H -> ~chi_20 ~chi_20)
     1.58026255E-04    2     1000022   1000023   # BR(H -> ~chi_10 ~chi_20)
     3.16910242E-02    2     1000022   1000025   # BR(H -> ~chi_10 ~chi_30)
     7.18644198E-02    2     1000023   1000025   # BR(H -> ~chi_20 ~chi_30)
     6.81004832E-02    2     1000006  -1000006   # BR(H -> ~t_1    ~t_1*  )
     5.21974342E-02    2     2000006  -2000006   # BR(H -> ~t_2    ~t_2*  )
     1.94920930E-04    2     1000006  -2000006   # BR(H -> ~t_1    ~t_2*  )
     1.94920930E-04    2     2000006  -1000006   # BR(H -> ~t_2    ~t_1*  )
     5.17006364E-06    2     1000005  -1000005   # BR(H -> ~b_1    ~b_1*  )
#
#         PDG            Width
DECAY        36     4.06679928E+01   # A decays
#          BR         NDA      ID1       ID2
     4.49857378E-01    2           5        -5   # BR(A -> b       bb     )
     1.08739109E-01    2         -15        15   # BR(A -> tau+    tau-   )
     3.84431815E-04    2         -13        13   # BR(A -> mu+     mu-    )
     4.47806750E-04    2           3        -3   # BR(A -> s       sb     )
     2.78049979E-08    2           4        -4   # BR(A -> c       cb     )
     3.00656289E-03    2           6        -6   # BR(A -> t       tb     )
     3.08297080E-05    2          21        21   # BR(A -> g       g      )
     1.51052049E-08    2          22        22   # BR(A -> gam     gam    )
     2.39781871E-08    2          23        22   # BR(A -> Z       gam    )
     1.39894545E-06    2          23        25   # BR(A -> Z       h      )
     3.86453948E-03    2     1000024  -1000024   # BR(A -> ~chi_1+ ~chi_1-)
     1.02791303E-01    2     1000024  -1000037   # BR(A -> ~chi_1+ ~chi_2-)
     1.02791303E-01    2     1000037  -1000024   # BR(A -> ~chi_2+ ~chi_1-)
     1.13534411E-03    2     1000022   1000022   # BR(A -> ~chi_10 ~chi_10)
     2.50361250E-04    2     1000023   1000023   # BR(A -> ~chi_20 ~chi_20)
     8.92867324E-05    2     1000022   1000023   # BR(A -> ~chi_10 ~chi_20)
     7.15285289E-02    2     1000022   1000025   # BR(A -> ~chi_10 ~chi_30)
     3.14125086E-02    2     1000023   1000025   # BR(A -> ~chi_20 ~chi_30)
     6.18346203E-02    2     1000006  -2000006   # BR(A -> ~t_1    ~t_2*  )
     6.18346203E-02    2    -1000006   2000006   # BR(A -> ~t_1*   ~t_2   )
#
#         PDG            Width
DECAY        37     3.89102667E+01   # H+ decays
#          BR         NDA      ID1       ID2
     6.83012478E-04    2           4        -5   # BR(H+ -> c       bb     )
     1.13726427E-01    2         -15        16   # BR(H+ -> tau+    nu_tau )
     4.02063773E-04    2         -13        14   # BR(H+ -> mu+     nu_mu  )
     4.37127216E-06    2           2        -5   # BR(H+ -> u       bb     )
     2.23927566E-05    2           2        -3   # BR(H+ -> u       sb     )
     4.60592236E-04    2           4        -3   # BR(H+ -> c       sb     )
     4.29045256E-01    2           6        -5   # BR(H+ -> t       bb     )
     1.46637530E-06    2          24        25   # BR(H+ -> W+      h      )
     4.17402522E-13    2          24        36   # BR(H+ -> W+      A      )
     1.14676567E-04    2     1000024   1000022   # BR(H+ -> ~chi_1+ ~chi_10)
     7.22467023E-04    2     1000024   1000023   # BR(H+ -> ~chi_1+ ~chi_20)
     1.08747787E-01    2     1000024   1000025   # BR(H+ -> ~chi_1+ ~chi_30)
     1.09411426E-01    2     1000037   1000022   # BR(H+ -> ~chi_2+ ~chi_10)
     1.08125499E-01    2     1000037   1000023   # BR(H+ -> ~chi_2+ ~chi_20)
     6.40390078E-02    2     1000006  -1000005   # BR(H+ -> ~t_1    ~b_1*  )
     6.44935559E-02    2     2000006  -1000005   # BR(H+ -> ~t_2    ~b_1*  )
