#
#                              ======================
#                              | THE SUSYHIT OUTPUT |
#                              ======================
#
#
#              ------------------------------------------------------
#              |     This is the output of the SUSY-HIT package     |
#              |  created by A.Djouadi, M.Muehlleitner and M.Spira. |
#              |  In case of problems with SUSY-HIT email to        |
#              |           margarete.muehlleitner@cern.ch           |
#              |           michael.spira@psi.ch                     |
#              |           abdelhak.djouadi@cern.ch                 |
#              ------------------------------------------------------
#
#              ------------------------------------------------------
#              |  SUSY Les Houches Accord - MSSM Spectrum + Decays  |
#              |              based on the decay programs           |
#              |                                                    |
#              |                     SDECAY 1.3b                    |
#              |                                                    |
#              |  Authors: M.Muhlleitner, A.Djouadi and Y.Mambrini  |
#              |  Ref.:    Comput.Phys.Commun.168(2005)46           |
#              |           [hep-ph/0311167]                         |
#              |                                                    |
#              |                     HDECAY 3.4                     |
#              |                                                    |
#              |  By: A.Djouadi,J.Kalinowski,M.Muhlleitner,M.Spira  |
#              |  Ref.:    Comput.Phys.Commun.108(1998)56           |
#              |           [hep-ph/9704448]                         |
#              |                                                    |
#              |                                                    |
#              |  If not stated otherwise all DRbar couplings and   |
#              |  soft SUSY breaking masses are given at the scale  |
#              |  Q=  0.23082190E+04
#              |                                                    |
#              ------------------------------------------------------
#
#
BLOCK DCINFO  # Decay Program information
     1   SDECAY/HDECAY # decay calculator
     2   1.3b  /3.4    # version number
#
BLOCK SPINFO  # Spectrum calculator information
     1     SOFTSUSY    # spectrum calculator               
     2     3.4.0       # version number                    
#
BLOCK MODSEL  # Model selection
     1     0   #  nonUniversal                                     
#
BLOCK SMINPUTS  # Standard Model inputs
         1     1.27908970E+02   # alpha_em^-1(M_Z)^MSbar
         2     1.16637870E-05   # G_F [GeV^-2]
         3     1.18400000E-01   # alpha_S(M_Z)^MSbar
         4     9.11876000E+01   # M_Z pole mass
         5     4.18000000E+00   # mb(mb)^MSbar
         6     1.73200000E+02   # mt pole mass
         7     1.77700000E+00   # mtau pole mass
#
BLOCK MINPAR  # Input parameters - minimal models
         3     1.25100000E+01   # tanb                
#
BLOCK EXTPAR  # Input parameters - non-minimal models
         0    -1.00000000E+00   # Set                 
         1     6.50050000E+02   # M_1(MX)             
         2    -1.19260000E+02   # M_2(MX)             
         3     1.08679000E+03   # M_3(MX)             
        11    -2.80102000E+03   # At(MX)              
        12     3.69244000E+03   # Ab(MX)              
        13     1.41849000E+03   # Atau(MX)            
        23     1.80680000E+02   # mu(MX)              
        26     3.00462000E+03   # mA(pole)            
        31     1.96894000E+03   # meL(MX)             
        32     1.96894000E+03   # mmuL(MX)            
        33     2.68372000E+03   # mtauL(MX)           
        34     1.06184000E+03   # meR(MX)             
        35     1.06184000E+03   # mmuR(MX)            
        36     2.78001000E+03   # mtauR(MX)           
        41     2.97179000E+03   # mqL1(MX)            
        42     2.97179000E+03   # mqL2(MX)            
        43     3.99277000E+03   # mqL3(MX)            
        44     4.40180000E+02   # muR(MX)             
        45     4.40180000E+02   # mcR(MX)             
        46     1.33031000E+03   # mtR(MX)             
        47     3.66990000E+02   # mdR(MX)             
        48     3.66990000E+02   # msR(MX)             
        49     7.62960000E+02   # mbR(MX)             
#
BLOCK MASS  # Mass Spectrum
# PDG code           mass       particle
        24     8.03969874E+01   # W+
        25     1.25291258E+02   # h
        35     3.00466530E+03   # H
        36     3.00461988E+03   # A
        37     3.00602705E+03   # H+
         5     4.81876030E+00   # b-quark pole mass calculated from mb(mb)_Msbar
   1000001     3.00964134E+03   # ~d_L
   2000001     5.07799704E+02   # ~d_R
   1000002     3.00873717E+03   # ~u_L
   2000002     5.59240963E+02   # ~u_R
   1000003     3.00964134E+03   # ~s_L
   2000003     5.07799704E+02   # ~s_R
   1000004     3.00873717E+03   # ~c_L
   2000004     5.59240963E+02   # ~c_R
   1000005     8.53346931E+02   # ~b_1
   2000005     4.02018488E+03   # ~b_2
   1000006     1.37515975E+03   # ~t_1
   2000006     4.02365435E+03   # ~t_2
   1000011     1.97218860E+03   # ~e_L
   2000011     1.06918667E+03   # ~e_R
   1000012     1.97028738E+03   # ~nu_eL
   1000013     1.97218860E+03   # ~mu_L
   2000013     1.06918667E+03   # ~mu_R
   1000014     1.97028738E+03   # ~nu_muL
   1000015     2.68816933E+03   # ~tau_1
   2000015     2.78344483E+03   # ~tau_2
   1000016     2.68668325E+03   # ~nu_tauL
   1000021     1.22283641E+03   # ~g
   1000022    -1.10152596E+02   # ~chi_10
   1000023     1.96929006E+02   # ~chi_20
   1000025    -2.21105119E+02   # ~chi_30
   1000035     6.38618830E+02   # ~chi_40
   1000024     1.12391496E+02   # ~chi_1+
   1000037     2.29422456E+02   # ~chi_2+
#
BLOCK NMIX  # Neutralino Mixing Matrix
  1  1     1.29318820E-02   # N_11
  1  2     8.29678231E-01   # N_12
  1  3    -4.94686722E-01   # N_13
  1  4    -2.58363787E-01   # N_14
  2  1    -7.63576068E-02   # N_21
  2  2    -1.84506189E-01   # N_22
  2  3    -6.79941237E-01   # N_23
  2  4     7.05554318E-01   # N_24
  3  1    -3.15890484E-02   # N_31
  3  2     5.26805632E-01   # N_32
  3  3     5.40509030E-01   # N_33
  3  4     6.55231216E-01   # N_34
  4  1     9.96496068E-01   # N_41
  4  2    -8.20521393E-03   # N_42
  4  3    -2.85473172E-02   # N_43
  4  4     7.81876640E-02   # N_44
#
BLOCK UMIX  # Chargino Mixing Matrix U
  1  1     7.60031744E-01   # U_11
  1  2    -6.49885950E-01   # U_12
  2  1     6.49885950E-01   # U_21
  2  2     7.60031744E-01   # U_22
#
BLOCK VMIX  # Chargino Mixing Matrix V
  1  1    -9.41686883E-01   # V_11
  1  2    -3.36490438E-01   # V_12
  2  1    -3.36490438E-01   # V_21
  2  2     9.41686883E-01   # V_22
#
BLOCK STOPMIX  # Stop Mixing Matrix
  1  1     2.96453900E-02   # cos(theta_t)
  1  2     9.99560479E-01   # sin(theta_t)
  2  1    -9.99560479E-01   # -sin(theta_t)
  2  2     2.96453900E-02   # cos(theta_t)
#
BLOCK SBOTMIX  # Sbottom Mixing Matrix
  1  1    -2.16026850E-04   # cos(theta_b)
  1  2     9.99999977E-01   # sin(theta_b)
  2  1    -9.99999977E-01   # -sin(theta_b)
  2  2    -2.16026850E-04   # cos(theta_b)
#
BLOCK STAUMIX  # Stau Mixing Matrix
  1  1     9.99996476E-01   # cos(theta_tau)
  1  2     2.65480462E-03   # sin(theta_tau)
  2  1    -2.65480462E-03   # -sin(theta_tau)
  2  2     9.99996476E-01   # cos(theta_tau)
#
BLOCK ALPHA  # Higgs mixing
          -8.36171539E-02   # Mixing angle in the neutral Higgs boson sector
#
BLOCK HMIX Q=  2.30821900E+03  # DRbar Higgs Parameters
         1     1.83228717E+02   # mu(Q)MSSM           
         2     1.19615097E+01   # tan                 
         3     2.40796471E+02   # higgs               
         4     9.01802722E+06   # mA^2(Q)MSSM         
#
BLOCK GAUGE Q=  2.30821900E+03  # The gauge couplings
     1     3.65235144E-01   # gprime(Q) DRbar
     2     6.44307651E-01   # g(Q) DRbar
     3     1.03878768E+00   # g3(Q) DRbar
#
BLOCK AU Q=  2.30821900E+03  # The trilinear couplings
  1  1     0.00000000E+00   # A_u(Q) DRbar
  2  2     0.00000000E+00   # A_c(Q) DRbar
  3  3    -2.80101999E+03   # A_t(Q) DRbar
#
BLOCK AD Q=  2.30821900E+03  # The trilinear couplings
  1  1     0.00000000E+00   # A_d(Q) DRbar
  2  2     0.00000000E+00   # A_s(Q) DRbar
  3  3     3.69244000E+03   # A_b(Q) DRbar
#
BLOCK AE Q=  2.30821900E+03  # The trilinear couplings
  1  1     0.00000000E+00   # A_e(Q) DRbar
  2  2     0.00000000E+00   # A_mu(Q) DRbar
  3  3     1.41849000E+03   # A_tau(Q) DRbar
#
BLOCK Yu Q=  2.30821900E+03  # The Yukawa couplings
  1  1     0.00000000E+00   # y_u(Q) DRbar
  2  2     0.00000000E+00   # y_c(Q) DRbar
  3  3     8.37581576E-01   # y_t(Q) DRbar
#
BLOCK Yd Q=  2.30821900E+03  # The Yukawa couplings
  1  1     0.00000000E+00   # y_d(Q) DRbar
  2  2     0.00000000E+00   # y_s(Q) DRbar
  3  3     1.65352507E-01   # y_b(Q) DRbar
#
BLOCK Ye Q=  2.30821900E+03  # The Yukawa couplings
  1  1     0.00000000E+00   # y_e(Q) DRbar
  2  2     0.00000000E+00   # y_mu(Q) DRbar
  3  3     1.23261752E-01   # y_tau(Q) DRbar
#
BLOCK MSOFT Q=  2.30821900E+03  # The soft SUSY breaking masses at the scale Q
         1     6.50050000E+02   # M_1(Q)              
         2    -1.19260000E+02   # M_2(Q)              
         3     1.08679000E+03   # M_3(Q)              
        21     8.91684473E+06   # mH1^2(Q)            
        22     1.20487218E+04   # mH2^2(Q)            
        31     1.96894000E+03   # meL(Q)              
        32     1.96894000E+03   # mmuL(Q)             
        33     2.68372000E+03   # mtauL(Q)            
        34     1.06184000E+03   # meR(Q)              
        35     1.06184000E+03   # mmuR(Q)             
        36     2.78001000E+03   # mtauR(Q)            
        41     2.97179000E+03   # mqL1(Q)             
        42     2.97179000E+03   # mqL2(Q)             
        43     3.99277000E+03   # mqL3(Q)             
        44     4.40179993E+02   # muR(Q)              
        45     4.40179993E+02   # mcR(Q)              
        46     1.33030999E+03   # mtR(Q)              
        47     3.66989991E+02   # mdR(Q)              
        48     3.66989991E+02   # msR(Q)              
        49     7.62959996E+02   # mbR(Q)              
#
Block HiggsBoundsInputHiggsCouplingsFermions
# ScalarNormEffCoupSq PseudoSNormEffCoupSq NP   IP1 IP2 IP2
    1.00502107E+00    0.00000000E+00        3  25   5   5  # h0-b-b eff. coupling^2, normalised to SM
    1.43072693E+02    0.00000000E+00        3  35   5   5  # H0-b-b eff. coupling^2, normalised to SM
    0.00000000E+00    1.43077714E+02        3  36   5   5  # A0-b-b eff. coupling^2, normalised to SM
#
    9.99964907E-01    0.00000000E+00        3  25   6   6  # h0-t-t eff. coupling^2, normalised to SM
    7.02430195E-03    0.00000000E+00        3  35   6   6  # H0-t-t eff. coupling^2, normalised to SM
    0.00000000E+00    6.98920866E-03        3  36   6   6  # A0-t-t eff. coupling^2, normalised to SM
#
    1.00502107E+00    0.00000000E+00        3  25  15  15  # h0-tau-tau eff. coupling^2, normalised to SM
    1.43072693E+02    0.00000000E+00        3  35  15  15  # H0-tau-tau eff. coupling^2, normalised to SM
    0.00000000E+00    1.43077714E+02        3  36  15  15  # A0-tau-tau eff. coupling^2, normalised to SM
#
Block HiggsBoundsInputHiggsCouplingsBosons
    9.99999956E-01        3  25  24  24  # h0-W-W eff. coupling^2, normalised to SM
    4.39419710E-08        3  35  24  24  # H0-W-W eff. coupling^2, normalised to SM
    0.00000000E+00        3  36  24  24  # A0-W-W eff. coupling^2, normalised to SM
#
    9.99999956E-01        3  25  23  23  # h0-Z-Z eff. coupling^2, normalised to SM
    4.39419710E-08        3  35  23  23  # H0-Z-Z eff. coupling^2, normalised to SM
    0.00000000E+00        3  36  23  23  # A0-Z-Z eff. coupling^2, normalised to SM
#
    8.94002452E-01        3  25  21  21  # h0-g-g eff. coupling^2, normalised to SM
    9.44134414E-14        3  35  21  21  # H0-g-g eff. coupling^2, normalised to SM
    1.79037966E-12        3  36  21  21  # A0-g-g eff. coupling^2, normalised to SM
#
    0.00000000E+00        3  25  25  23  # h0-h0-Z eff. coupling^2, normalised to SM
    0.00000000E+00        3  35  25  23  # H0-h0-Z eff. coupling^2, normalised to SM
    4.39419710E-08        3  36  25  23  # A0-h0-Z eff. coupling^2, normalised to SM
    0.00000000E+00        3  35  35  23  # H0-H0-Z eff. coupling^2, normalised to SM
    9.99999956E-01        3  36  35  23  # A0-H0-Z eff. coupling^2, normalised to SM
    0.00000000E+00        3  36  36  23  # A0-A0-Z eff. coupling^2, normalised to SM
#
    0.00000000E+00        4  25  21  21  23  # h0-g-g-Z eff. coupling^2, normalised to SM
    0.00000000E+00        4  35  21  21  23  # H0-g-g-Z eff. coupling^2, normalised to SM
    0.00000000E+00        4  36  21  21  23  # A0-g-g-Z eff. coupling^2, normalised to SM
#
#
#
#                             =================
#                             |The decay table|
#                             =================
#
# - The QCD corrections to the decays gluino -> squark  + quark
#                                     squark -> gaugino + quark_prime
#                                     squark -> squark_prime + Higgs
#                                     squark -> gluino  + quark
#   are included.
#
# - The multi-body decays for the inos, stops and sbottoms are included.
#
# - The loop induced decays for the gluino, neutralinos and stops
#   are included.
#
# - The SUSY decays of the top quark are included.
#
#
#         PDG            Width
DECAY         6     1.46171307E+00   # top decays
#          BR         NDA      ID1       ID2
     1.00000000E+00    2           5        24   # BR(t ->  b    W+)
#
#         PDG            Width
DECAY   1000021     7.00659495E+01   # gluino decays
#          BR         NDA      ID1       ID2
     1.16760962E-01    2     2000001        -1   # BR(~g -> ~d_R  db)
     1.16760962E-01    2    -2000001         1   # BR(~g -> ~d_R* d )
     1.06632447E-01    2     2000002        -2   # BR(~g -> ~u_R  ub)
     1.06632447E-01    2    -2000002         2   # BR(~g -> ~u_R* u )
     1.16760962E-01    2     2000003        -3   # BR(~g -> ~s_R  sb)
     1.16760962E-01    2    -2000003         3   # BR(~g -> ~s_R* s )
     1.06632313E-01    2     2000004        -4   # BR(~g -> ~c_R  cb)
     1.06632313E-01    2    -2000004         4   # BR(~g -> ~c_R* c )
     5.32133166E-02    2     1000005        -5   # BR(~g -> ~b_1  bb)
     5.32133166E-02    2    -1000005         5   # BR(~g -> ~b_1* b )
#
#         PDG            Width
DECAY   1000006     3.79364799E+01   # stop1 decays
#          BR         NDA      ID1       ID2
     2.91284761E-02    2     1000022         6   # BR(~t_1 -> ~chi_10 t )
     2.31367810E-01    2     1000023         6   # BR(~t_1 -> ~chi_20 t )
     2.05578258E-01    2     1000025         6   # BR(~t_1 -> ~chi_30 t )
     5.38653411E-02    2     1000035         6   # BR(~t_1 -> ~chi_40 t )
     4.94950561E-02    2     1000024         5   # BR(~t_1 -> ~chi_1+ b )
     4.30565058E-01    2     1000037         5   # BR(~t_1 -> ~chi_2+ b )
     4.02075384E-10    2     1000005        24   # BR(~t_1 -> ~b_1    W+)
#
#         PDG            Width
DECAY   2000006     3.22093706E+02   # stop2 decays
#          BR         NDA      ID1       ID2
     4.81702616E-02    2     1000022         6   # BR(~t_2 -> ~chi_10 t )
     8.87669428E-02    2     1000023         6   # BR(~t_2 -> ~chi_20 t )
     8.62671021E-02    2     1000025         6   # BR(~t_2 -> ~chi_30 t )
     2.81377310E-03    2     1000035         6   # BR(~t_2 -> ~chi_40 t )
     9.66626958E-02    2     1000024         5   # BR(~t_2 -> ~chi_1+ b )
     1.31227745E-02    2     1000037         5   # BR(~t_2 -> ~chi_2+ b )
     5.85484550E-01    2     1000021         6   # BR(~t_2 -> ~g      t )
     3.72902299E-02    2     1000006        25   # BR(~t_2 -> ~t_1    h )
     1.36478941E-03    2     1000005        37   # BR(~t_2 -> ~b_1    H+)
     4.00516404E-02    2     1000006        23   # BR(~t_2 -> ~t_1    Z )
     5.24038467E-06    2     1000005        24   # BR(~t_2 -> ~b_1    W+)
#
#         PDG            Width
DECAY   1000005     9.02622904E-01   # sbottom1 decays
#          BR         NDA      ID1       ID2
     1.21516492E-01    2     1000022         5   # BR(~b_1 -> ~chi_10 b )
     2.15911891E-01    2     1000023         5   # BR(~b_1 -> ~chi_20 b )
     1.31323240E-01    2     1000025         5   # BR(~b_1 -> ~chi_30 b )
     1.07319813E-01    2     1000035         5   # BR(~b_1 -> ~chi_40 b )
     1.91830963E-01    2    -1000024         6   # BR(~b_1 -> ~chi_1- t )
     2.32097602E-01    2    -1000037         6   # BR(~b_1 -> ~chi_2- t )
#
#         PDG            Width
DECAY   2000005     3.23059780E+02   # sbottom2 decays
#          BR         NDA      ID1       ID2
     3.67700735E-02    2     1000022         5   # BR(~b_2 -> ~chi_10 b )
     4.59340838E-03    2     1000023         5   # BR(~b_2 -> ~chi_20 b )
     1.64596670E-02    2     1000025         5   # BR(~b_2 -> ~chi_30 b )
     1.89042687E-03    2     1000035         5   # BR(~b_2 -> ~chi_40 b )
     7.84565172E-02    2    -1000024         6   # BR(~b_2 -> ~chi_1- t )
     1.96198928E-01    2    -1000037         6   # BR(~b_2 -> ~chi_2- t )
     5.86660037E-01    2     1000021         5   # BR(~b_2 -> ~g      b )
     3.15928415E-06    2     1000005        25   # BR(~b_2 -> ~b_1    h )
     6.79017449E-04    2     1000005        35   # BR(~b_2 -> ~b_1    H )
     6.79123596E-04    2     1000005        36   # BR(~b_2 -> ~b_1    A )
     2.67690636E-06    2     1000005        23   # BR(~b_2 -> ~b_1    Z )
     7.76069644E-02    2     1000006       -24   # BR(~b_2 -> ~t_1    W-)
#
#         PDG            Width
DECAY   1000002     1.99458885E+02   # sup_L decays
#          BR         NDA      ID1       ID2
     4.15424754E-02    2     1000022         2   # BR(~u_L -> ~chi_10 u)
     2.36114906E-03    2     1000023         2   # BR(~u_L -> ~chi_20 u)
     1.61499449E-02    2     1000025         2   # BR(~u_L -> ~chi_30 u)
     1.78189303E-03    2     1000035         2   # BR(~u_L -> ~chi_40 u)
     1.06394177E-01    2     1000024         1   # BR(~u_L -> ~chi_1+ d)
     1.34708372E-02    2     1000037         1   # BR(~u_L -> ~chi_2+ d)
     8.18299524E-01    2     1000021         2   # BR(~u_L -> ~g      u)
#
#         PDG            Width
DECAY   2000002     7.19294190E-03   # sup_R decays
#           BR         NDA      ID1       ID2
     2.89003903E-02    2     1000022         2   # BR(~u_R -> ~chi_10 u)
     8.38005753E-01    2     1000023         2   # BR(~u_R -> ~chi_20 u)
     1.33093857E-01    2     1000025         2   # BR(~u_R -> ~chi_30 u)
#
#         PDG            Width
DECAY   1000001     1.99489222E+02   # sdown_L decays
#          BR         NDA      ID1       ID2
     4.10622614E-02    2     1000022         1   # BR(~d_L -> ~chi_10 d)
     1.72611093E-03    2     1000023         1   # BR(~d_L -> ~chi_20 d)
     1.69014336E-02    2     1000025         1   # BR(~d_L -> ~chi_30 d)
     2.12187885E-03    2     1000035         1   # BR(~d_L -> ~chi_40 d)
     6.93162555E-02    2    -1000024         2   # BR(~d_L -> ~chi_1- u)
     5.02565212E-02    2    -1000037         2   # BR(~d_L -> ~chi_2- u)
     8.18615539E-01    2     1000021         1   # BR(~d_L -> ~g      d)
#
#         PDG            Width
DECAY   2000001     1.54193309E-03   # sdown_R decays
#           BR         NDA      ID1       ID2
     3.02336594E-02    2     1000022         1   # BR(~d_R -> ~chi_10 d)
     8.39041695E-01    2     1000023         1   # BR(~d_R -> ~chi_20 d)
     1.30724646E-01    2     1000025         1   # BR(~d_R -> ~chi_30 d)
#
#         PDG            Width
DECAY   1000004     1.57561022E+02   # scharm_L decays
#          BR         NDA      ID1       ID2
     5.44541160E-02    2     1000022         4   # BR(~c_L -> ~chi_10 c)
     3.09394340E-03    2     1000023         4   # BR(~c_L -> ~chi_20 c)
     2.11602927E-02    2     1000025         4   # BR(~c_L -> ~chi_30 c)
     2.33210776E-03    2     1000035         4   # BR(~c_L -> ~chi_40 c)
     1.39460859E-01    2     1000024         3   # BR(~c_L -> ~chi_1+ s)
     1.76495070E-02    2     1000037         3   # BR(~c_L -> ~chi_2+ s)
     7.61849174E-01    2     1000021         4   # BR(~c_L -> ~g      c)
#
#         PDG            Width
DECAY   2000004     7.04326490E-03   # scharm_R decays
#           BR         NDA      ID1       ID2
     2.89399604E-02    2     1000022         4   # BR(~c_R -> ~chi_10 c)
     8.38021940E-01    2     1000023         4   # BR(~c_R -> ~chi_20 c)
     1.33038100E-01    2     1000025         4   # BR(~c_R -> ~chi_30 c)
#
#         PDG            Width
DECAY   1000003     1.57562468E+02   # sstrange_L decays
#          BR         NDA      ID1       ID2
     5.38321677E-02    2     1000022         3   # BR(~s_L -> ~chi_10 s)
     2.26213455E-03    2     1000023         3   # BR(~s_L -> ~chi_20 s)
     2.21480233E-02    2     1000025         3   # BR(~s_L -> ~chi_30 s)
     2.77746632E-03    2     1000035         3   # BR(~s_L -> ~chi_40 s)
     9.08719577E-02    2    -1000024         4   # BR(~s_L -> ~chi_1- c)
     6.58553205E-02    2    -1000037         4   # BR(~s_L -> ~chi_2- c)
     7.62252930E-01    2     1000021         3   # BR(~s_L -> ~g      s)
#
#         PDG            Width
DECAY   2000003     1.50209959E-03   # sstrange_R decays
#           BR         NDA      ID1       ID2
     3.02772010E-02    2     1000022         3   # BR(~s_R -> ~chi_10 s)
     8.39063475E-01    2     1000023         3   # BR(~s_R -> ~chi_20 s)
     1.30659324E-01    2     1000025         3   # BR(~s_R -> ~chi_30 s)
#
#         PDG            Width
DECAY   1000011     2.62047507E+01   # selectron_L decays
#          BR         NDA      ID1       ID2
     2.16372169E-01    2     1000022        11   # BR(~e_L -> ~chi_10 e-)
     1.58060343E-02    2     1000023        11   # BR(~e_L -> ~chi_20 e-)
     7.84750705E-02    2     1000025        11   # BR(~e_L -> ~chi_30 e-)
     7.71690072E-02    2     1000035        11   # BR(~e_L -> ~chi_40 e-)
     3.56716443E-01    2    -1000024        12   # BR(~e_L -> ~chi_1- nu_e)
     2.55461276E-01    2    -1000037        12   # BR(~e_L -> ~chi_2- nu_e)
#
#         PDG            Width
DECAY   2000011     2.36860796E+00   # selectron_R decays
#          BR         NDA      ID1       ID2
     3.92211685E-04    2     1000022        11   # BR(~e_R -> ~chi_10 e-)
     1.30374437E-02    2     1000023        11   # BR(~e_R -> ~chi_20 e-)
     2.19066341E-03    2     1000025        11   # BR(~e_R -> ~chi_30 e-)
     9.84379681E-01    2     1000035        11   # BR(~e_R -> ~chi_40 e-)
#
#         PDG            Width
DECAY   1000013     2.62047506E+01   # smuon_L decays
#          BR         NDA      ID1       ID2
     2.16372168E-01    2     1000022        13   # BR(~mu_L -> ~chi_10 mu-)
     1.58060342E-02    2     1000023        13   # BR(~mu_L -> ~chi_20 mu-)
     7.84750703E-02    2     1000025        13   # BR(~mu_L -> ~chi_30 mu-)
     7.71690069E-02    2     1000035        13   # BR(~mu_L -> ~chi_40 mu-)
     3.56716444E-01    2    -1000024        14   # BR(~mu_L -> ~chi_1- nu_mu)
     2.55461277E-01    2    -1000037        14   # BR(~mu_L -> ~chi_2- nu_mu)
#
#         PDG            Width
DECAY   2000013     2.36860785E+00   # smuon_R decays
#          BR         NDA      ID1       ID2
     3.92211696E-04    2     1000022        13   # BR(~mu_R -> ~chi_10 mu-)
     1.30374440E-02    2     1000023        13   # BR(~mu_R -> ~chi_20 mu-)
     2.19066347E-03    2     1000025        13   # BR(~mu_R -> ~chi_30 mu-)
     9.84379681E-01    2     1000035        13   # BR(~mu_R -> ~chi_40 mu-)
#
#         PDG            Width
DECAY   1000015     3.70439494E+01   # stau_1 decays
#          BR         NDA      ID1       ID2
     2.14757392E-01    2     1000022        15   # BR(~tau_1 -> ~chi_10  tau-)
     2.53759666E-02    2     1000023        15   # BR(~tau_1 -> ~chi_20  tau-)
     8.27496938E-02    2     1000025        15   # BR(~tau_1 -> ~chi_30  tau-)
     8.26846390E-02    2     1000035        15   # BR(~tau_1 -> ~chi_40  tau-)
     3.45281995E-01    2    -1000024        16   # BR(~tau_1 -> ~chi_1-  nu_tau)
     2.49150314E-01    2    -1000037        16   # BR(~tau_1 -> ~chi_2-  nu_tau)
#
#         PDG            Width
DECAY   2000015     1.49359484E+01   # stau_2 decays
#          BR         NDA      ID1       ID2
     1.34617688E-02    2     1000022        15   # BR(~tau_2 -> ~chi_10  tau-)
     3.15948852E-02    2     1000023        15   # BR(~tau_2 -> ~chi_20  tau-)
     1.75461876E-02    2     1000025        15   # BR(~tau_2 -> ~chi_30  tau-)
     8.81582880E-01    2     1000035        15   # BR(~tau_2 -> ~chi_40  tau-)
     2.29497791E-02    2    -1000024        16   # BR(~tau_2 -> ~chi_1-  nu_tau)
     3.28641172E-02    2    -1000037        16   # BR(~tau_2 -> ~chi_2-  nu_tau)
     3.57062658E-07    2     1000016       -24   # BR(~tau_2 -> ~nu_tauL W-)
     2.47391525E-08    2     1000015        23   # BR(~tau_2 -> ~tau_1   Z)
#
#         PDG            Width
DECAY   1000012     2.62494037E+01   # snu_eL decays
#          BR         NDA      ID1       ID2
     2.08299693E-01    2     1000022        12   # BR(~nu_eL -> ~chi_10 nu_e)
     6.05869984E-03    2     1000023        12   # BR(~nu_eL -> ~chi_20 nu_e)
     8.96651046E-02    2     1000025        12   # BR(~nu_eL -> ~chi_30 nu_e)
     8.15311460E-02    2     1000035        12   # BR(~nu_eL -> ~chi_40 nu_e)
     5.46146261E-01    2     1000024        11   # BR(~nu_eL -> ~chi_1+ e-)
     6.82990954E-02    2     1000037        11   # BR(~nu_eL -> ~chi_2+ e-)
#
#         PDG            Width
DECAY   1000014     2.62494036E+01   # snu_muL decays
#          BR         NDA      ID1       ID2
     2.08299694E-01    2     1000022        14   # BR(~nu_muL -> ~chi_10 nu_mu)
     6.05869986E-03    2     1000023        14   # BR(~nu_muL -> ~chi_20 nu_mu)
     8.96651050E-02    2     1000025        14   # BR(~nu_muL -> ~chi_30 nu_mu)
     8.15311462E-02    2     1000035        14   # BR(~nu_muL -> ~chi_40 nu_mu)
     5.46146260E-01    2     1000024        13   # BR(~nu_muL -> ~chi_1+ mu-)
     6.82990952E-02    2     1000037        13   # BR(~nu_muL -> ~chi_2+ mu-)
#
#         PDG            Width
DECAY   1000016     3.70748372E+01   # snu_tauL decays
#          BR         NDA      ID1       ID2
     2.01684961E-01    2     1000022        16   # BR(~nu_tauL -> ~chi_10 nu_tau)
     5.90402335E-03    2     1000023        16   # BR(~nu_tauL -> ~chi_20 nu_tau)
     8.75902227E-02    2     1000025        16   # BR(~nu_tauL -> ~chi_30 nu_tau)
     8.74869494E-02    2     1000035        16   # BR(~nu_tauL -> ~chi_40 nu_tau)
     5.38092103E-01    2     1000024        15   # BR(~nu_tauL -> ~chi_1+ tau-)
     7.92417403E-02    2     1000037        15   # BR(~nu_tauL -> ~chi_2+ tau-)
#
#         PDG            Width
DECAY   1000024     1.75757671E-10   # chargino1+ decays
#           BR         NDA      ID1       ID2       ID3
     3.73980002E-01    3     1000022         2        -1   # BR(~chi_1+ -> ~chi_10 u    db)
     3.73980002E-01    3     1000022         4        -3   # BR(~chi_1+ -> ~chi_10 c    sb)
     1.24758262E-01    3     1000022       -11        12   # BR(~chi_1+ -> ~chi_10 e+   nu_e)
     1.24758262E-01    3     1000022       -13        14   # BR(~chi_1+ -> ~chi_10 mu+  nu_mu)
     2.52347363E-03    3     1000022       -15        16   # BR(~chi_1+ -> ~chi_10 tau+ nu_tau)
#
#         PDG            Width
DECAY   1000037     2.67992007E-01   # chargino2+ decays
#          BR         NDA      ID1       ID2
     3.52382433E-01    2     1000024        23   # BR(~chi_2+ -> ~chi_1+  Z )
     6.47617567E-01    2     1000022        24   # BR(~chi_2+ -> ~chi_10  W+)
#
#         PDG            Width
DECAY   1000022     0.00000000E+00   # neutralino1 decays
#
#         PDG            Width
DECAY   1000023     4.63418515E-02   # neutralino2 decays
#          BR         NDA      ID1       ID2
     5.00000000E-01    2     1000024       -24   # BR(~chi_20 -> ~chi_1+   W-)
     5.00000000E-01    2    -1000024        24   # BR(~chi_20 -> ~chi_1-   W+)
#
#         PDG            Width
DECAY   1000025     3.71200855E-01   # neutralino3 decays
#          BR         NDA      ID1       ID2
     4.64869231E-02    2     1000022        23   # BR(~chi_30 -> ~chi_10   Z )
     4.76756538E-01    2     1000024       -24   # BR(~chi_30 -> ~chi_1+   W-)
     4.76756538E-01    2    -1000024        24   # BR(~chi_30 -> ~chi_1-   W+)
#
#         PDG            Width
DECAY   1000035     2.51955240E+00   # neutralino4 decays
#          BR         NDA      ID1       ID2
     3.56430689E-02    2     1000022        23   # BR(~chi_40 -> ~chi_10   Z )
     3.35086275E-02    2     1000023        23   # BR(~chi_40 -> ~chi_20   Z )
     9.70845339E-02    2     1000025        23   # BR(~chi_40 -> ~chi_30   Z )
     4.40881496E-02    2     1000024       -24   # BR(~chi_40 -> ~chi_1+   W-)
     4.40881496E-02    2    -1000024        24   # BR(~chi_40 -> ~chi_1-   W+)
     1.20621875E-01    2     1000037       -24   # BR(~chi_40 -> ~chi_2+   W-)
     1.20621875E-01    2    -1000037        24   # BR(~chi_40 -> ~chi_2-   W+)
     1.13349080E-02    2     1000022        25   # BR(~chi_40 -> ~chi_10   h )
     1.49989474E-01    2     1000023        25   # BR(~chi_40 -> ~chi_20   h )
     1.56835231E-02    2     1000025        25   # BR(~chi_40 -> ~chi_30   h )
     5.07421739E-02    2     2000002        -2   # BR(~chi_40 -> ~u_R      ub)
     5.07421739E-02    2    -2000002         2   # BR(~chi_40 -> ~u_R*     u )
     3.10960677E-02    2     2000001        -1   # BR(~chi_40 -> ~d_R      db)
     3.10960677E-02    2    -2000001         1   # BR(~chi_40 -> ~d_R*     d )
     5.07335986E-02    2     2000004        -4   # BR(~chi_40 -> ~c_R      cb)
     5.07335986E-02    2    -2000004         4   # BR(~chi_40 -> ~c_R*     c )
     3.10960677E-02    2     2000003        -3   # BR(~chi_40 -> ~s _R      sb)
     3.10960677E-02    2    -2000003         3   # BR(~chi_40 -> ~s _R*     s )
#
#         PDG            Width
DECAY        25     4.06476556E-03   # h decays
#          BR         NDA      ID1       ID2
     5.90960441E-01    2           5        -5   # BR(h -> b       bb     )
     6.41248979E-02    2         -15        15   # BR(h -> tau+    tau-   )
     2.26977618E-04    2         -13        13   # BR(h -> mu+     mu-    )
     2.47635573E-04    2           3        -3   # BR(h -> s       sb     )
     2.13760962E-02    2           4        -4   # BR(h -> c       cb     )
     7.92716849E-02    2          21        21   # BR(h -> g       g      )
     2.26931893E-03    2          22        22   # BR(h -> gam     gam    )
     1.57752734E-03    2          22        23   # BR(h -> Z       gam    )
     2.13182830E-01    2          24       -24   # BR(h -> W+      W-     )
     2.67625911E-02    2          23        23   # BR(h -> Z       Z      )
#
#         PDG            Width
DECAY        35     4.75611770E+01   # H decays
#          BR         NDA      ID1       ID2
     1.00150104E-01    2           5        -5   # BR(H -> b       bb     )
     1.87504324E-02    2         -15        15   # BR(H -> tau+    tau-   )
     6.63329140E-05    2         -13        13   # BR(H -> mu+     mu-    )
     4.06826005E-05    2           3        -3   # BR(H -> s       sb     )
     1.82071171E-07    2           4        -4   # BR(H -> c       cb     )
     1.78936842E-02    2           6        -6   # BR(H -> t       tb     )
     5.60958503E-06    2          21        21   # BR(H -> g       g      )
     2.79365765E-08    2          22        22   # BR(H -> gam     gam    )
     9.94400302E-09    2          23        22   # BR(H -> Z       gam    )
     8.05295663E-06    2          24       -24   # BR(H -> W+      W-     )
     4.01757061E-06    2          23        23   # BR(H -> Z       Z      )
     3.04785535E-05    2          25        25   # BR(H -> h       h      )
     2.11767834E-01    2     1000024  -1000024   # BR(H -> ~chi_1+ ~chi_1-)
     4.84321541E-02    2     1000037  -1000037   # BR(H -> ~chi_2+ ~chi_2-)
     1.34504822E-01    2     1000024  -1000037   # BR(H -> ~chi_1+ ~chi_2-)
     1.34504822E-01    2     1000037  -1000024   # BR(H -> ~chi_2+ ~chi_1-)
     9.52866974E-02    2     1000022   1000022   # BR(H -> ~chi_10 ~chi_10)
     4.12377414E-03    2     1000023   1000023   # BR(H -> ~chi_20 ~chi_20)
     5.39828303E-02    2     1000025   1000025   # BR(H -> ~chi_30 ~chi_30)
     5.59974682E-05    2     1000035   1000035   # BR(H -> ~chi_40 ~chi_40)
     5.04027848E-02    2     1000022   1000023   # BR(H -> ~chi_10 ~chi_20)
     1.14221926E-02    2     1000022   1000025   # BR(H -> ~chi_10 ~chi_30)
     1.68159778E-02    2     1000022   1000035   # BR(H -> ~chi_10 ~chi_40)
     4.71659741E-02    2     1000023   1000025   # BR(H -> ~chi_20 ~chi_30)
     2.68669083E-02    2     1000023   1000035   # BR(H -> ~chi_20 ~chi_40)
     2.76943455E-02    2     1000025   1000035   # BR(H -> ~chi_30 ~chi_40)
     1.07699280E-06    2     2000002  -2000002   # BR(H -> ~u_R    ~u_R*  )
     1.07699280E-06    2     2000004  -2000004   # BR(H -> ~c_R    ~c_R*  )
     1.92606911E-05    2     1000006  -1000006   # BR(H -> ~t_1    ~t_1*  )
     2.73022439E-07    2     2000001  -2000001   # BR(H -> ~d_R    ~d_R*  )
     2.73022439E-07    2     2000003  -2000003   # BR(H -> ~s_R    ~s_R*  )
     8.66395155E-08    2     1000005  -1000005   # BR(H -> ~b_1    ~b_1*  )
     6.11377881E-07    2     2000011  -2000011   # BR(H -> ~e_R-   ~e_R+  )
     6.11377881E-07    2     2000013  -2000013   # BR(H -> ~mu_R-  ~mu_R+ )
#
#         PDG            Width
DECAY        36     4.75651439E+01   # A decays
#          BR         NDA      ID1       ID2
     1.00164110E-01    2           5        -5   # BR(A -> b       bb     )
     1.87492691E-02    2         -15        15   # BR(A -> tau+    tau-   )
     6.63287053E-05    2         -13        13   # BR(A -> mu+     mu-    )
     4.07000977E-05    2           3        -3   # BR(A -> s       sb     )
     1.82821506E-07    2           4        -4   # BR(A -> c       cb     )
     1.79576192E-02    2           6        -6   # BR(A -> t       tb     )
     2.44242573E-05    2          21        21   # BR(A -> g       g      )
     2.62961181E-08    2          22        22   # BR(A -> gam     gam    )
     2.69891750E-08    2          23        22   # BR(A -> Z       gam    )
     8.15773643E-06    2          23        25   # BR(A -> Z       h      )
     1.85131728E-01    2     1000024  -1000024   # BR(A -> ~chi_1+ ~chi_1-)
     2.20142199E-02    2     1000037  -1000037   # BR(A -> ~chi_2+ ~chi_2-)
     1.61029100E-01    2     1000024  -1000037   # BR(A -> ~chi_1+ ~chi_2-)
     1.61029100E-01    2     1000037  -1000024   # BR(A -> ~chi_2+ ~chi_1-)
     8.04183250E-02    2     1000022   1000022   # BR(A -> ~chi_10 ~chi_10)
     5.94406970E-03    2     1000023   1000023   # BR(A -> ~chi_20 ~chi_20)
     3.67176078E-02    2     1000025   1000025   # BR(A -> ~chi_30 ~chi_30)
     1.73897990E-04    2     1000035   1000035   # BR(A -> ~chi_40 ~chi_40)
     7.63556820E-02    2     1000022   1000023   # BR(A -> ~chi_10 ~chi_20)
     5.35349484E-03    2     1000022   1000025   # BR(A -> ~chi_10 ~chi_30)
     1.22966858E-02    2     1000022   1000035   # BR(A -> ~chi_10 ~chi_40)
     5.74575690E-02    2     1000023   1000025   # BR(A -> ~chi_20 ~chi_30)
     4.06154272E-02    2     1000023   1000035   # BR(A -> ~chi_20 ~chi_40)
     1.84522466E-02    2     1000025   1000035   # BR(A -> ~chi_30 ~chi_40)
#
#         PDG            Width
DECAY        37     4.75948874E+01   # H+ decays
#          BR         NDA      ID1       ID2
     1.66951200E-04    2           4        -5   # BR(H+ -> c       bb     )
     1.87463276E-02    2         -15        16   # BR(H+ -> tau+    nu_tau )
     6.63182991E-05    2         -13        14   # BR(H+ -> mu+     nu_mu  )
     1.66950711E-06    2           2        -5   # BR(H+ -> u       bb     )
     2.03436547E-06    2           2        -3   # BR(H+ -> u       sb     )
     4.02177204E-05    2           4        -3   # BR(H+ -> c       sb     )
     1.16813567E-01    2           6        -5   # BR(H+ -> t       bb     )
     8.16921002E-06    2          24        25   # BR(H+ -> W+      h      )
     1.52509001E-13    2          24        36   # BR(H+ -> W+      A      )
     4.53191740E-05    2     1000024   1000022   # BR(H+ -> ~chi_1+ ~chi_10)
     2.03666443E-01    2     1000024   1000023   # BR(H+ -> ~chi_1+ ~chi_20)
     2.20230509E-01    2     1000024   1000025   # BR(H+ -> ~chi_1+ ~chi_30)
     2.35226937E-02    2     1000024   1000035   # BR(H+ -> ~chi_1+ ~chi_40)
     3.13161511E-01    2     1000037   1000022   # BR(H+ -> ~chi_2+ ~chi_10)
     5.40849158E-02    2     1000037   1000023   # BR(H+ -> ~chi_2+ ~chi_20)
     3.16407652E-03    2     1000037   1000025   # BR(H+ -> ~chi_2+ ~chi_30)
     4.39486537E-02    2     1000037   1000035   # BR(H+ -> ~chi_2+ ~chi_40)
     2.33062246E-03    2     1000006  -1000005   # BR(H+ -> ~t_1    ~b_1*  )
