#
#                              ======================
#                              | THE SUSYHIT OUTPUT |
#                              ======================
#
#
#              ------------------------------------------------------
#              |     This is the output of the SUSY-HIT package     |
#              |  created by A.Djouadi, M.Muehlleitner and M.Spira. |
#              |  In case of problems with SUSY-HIT email to        |
#              |           margarete.muehlleitner@cern.ch           |
#              |           michael.spira@psi.ch                     |
#              |           abdelhak.djouadi@cern.ch                 |
#              ------------------------------------------------------
#
#              ------------------------------------------------------
#              |  SUSY Les Houches Accord - MSSM Spectrum + Decays  |
#              |              based on the decay programs           |
#              |                                                    |
#              |                     SDECAY 1.3b                    |
#              |                                                    |
#              |  Authors: M.Muhlleitner, A.Djouadi and Y.Mambrini  |
#              |  Ref.:    Comput.Phys.Commun.168(2005)46           |
#              |           [hep-ph/0311167]                         |
#              |                                                    |
#              |                     HDECAY 3.4                     |
#              |                                                    |
#              |  By: A.Djouadi,J.Kalinowski,M.Muhlleitner,M.Spira  |
#              |  Ref.:    Comput.Phys.Commun.108(1998)56           |
#              |           [hep-ph/9704448]                         |
#              |                                                    |
#              |                                                    |
#              |  If not stated otherwise all DRbar couplings and   |
#              |  soft SUSY breaking masses are given at the scale  |
#              |  Q=  0.34085210E+04
#              |                                                    |
#              ------------------------------------------------------
#
#
BLOCK DCINFO  # Decay Program information
     1   SDECAY/HDECAY # decay calculator
     2   1.3b  /3.4    # version number
#
BLOCK SPINFO  # Spectrum calculator information
     1     SOFTSUSY    # spectrum calculator               
     2     3.4.0       # version number                    
#
BLOCK MODSEL  # Model selection
     1     0   #  nonUniversal                                     
#
BLOCK SMINPUTS  # Standard Model inputs
         1     1.27908970E+02   # alpha_em^-1(M_Z)^MSbar
         2     1.16637870E-05   # G_F [GeV^-2]
         3     1.18400000E-01   # alpha_S(M_Z)^MSbar
         4     9.11876000E+01   # M_Z pole mass
         5     4.18000000E+00   # mb(mb)^MSbar
         6     1.73200000E+02   # mt pole mass
         7     1.77700000E+00   # mtau pole mass
#
BLOCK MINPAR  # Input parameters - minimal models
         3     1.37100000E+01   # tanb                
#
BLOCK EXTPAR  # Input parameters - non-minimal models
         0    -1.00000000E+00   # Set                 
         1     2.19069000E+03   # M_1(MX)             
         2     1.23480000E+02   # M_2(MX)             
         3     1.06647000E+03   # M_3(MX)             
        11     2.52213000E+03   # At(MX)              
        12     2.47887000E+03   # Ab(MX)              
        13     1.02800000E+02   # Atau(MX)            
        23    -2.06394000E+03   # mu(MX)              
        26     8.78530000E+02   # mA(pole)            
        31     3.52674000E+03   # meL(MX)             
        32     3.52674000E+03   # mmuL(MX)            
        33     1.50564000E+03   # mtauL(MX)           
        34     3.39483000E+03   # meR(MX)             
        35     3.39483000E+03   # mmuR(MX)            
        36     1.45423000E+03   # mtauR(MX)           
        41     3.25003000E+03   # mqL1(MX)            
        42     3.25003000E+03   # mqL2(MX)            
        43     3.60725000E+03   # mqL3(MX)            
        44     3.16530000E+03   # muR(MX)             
        45     3.16530000E+03   # mcR(MX)             
        46     3.21740000E+03   # mtR(MX)             
        47     3.93378000E+03   # mdR(MX)             
        48     3.93378000E+03   # msR(MX)             
        49     2.71878000E+03   # mbR(MX)             
#
BLOCK MASS  # Mass Spectrum
# PDG code           mass       particle
        24     8.03862506E+01   # W+
        25     1.24345265E+02   # h
        35     8.78642859E+02   # H
        36     8.78530088E+02   # A
        37     8.82648143E+02   # H+
         5     4.81876030E+00   # b-quark pole mass calculated from mb(mb)_Msbar
   1000001     3.29252636E+03   # ~d_L
   2000001     3.97341493E+03   # ~d_R
   1000002     3.29168957E+03   # ~u_L
   2000002     3.20385522E+03   # ~u_R
   1000003     3.29252636E+03   # ~s_L
   2000003     3.97341493E+03   # ~s_R
   1000004     3.29168957E+03   # ~c_L
   2000004     3.20385522E+03   # ~c_R
   1000005     2.75392748E+03   # ~b_1
   2000005     3.62111118E+03   # ~b_2
   1000006     3.20638454E+03   # ~t_1
   2000006     3.62959280E+03   # ~t_2
   1000011     3.53446545E+03   # ~e_L
   2000011     3.40192492E+03   # ~e_R
   1000012     3.53323450E+03   # ~nu_eL
   1000013     3.53446545E+03   # ~mu_L
   2000013     3.40192492E+03   # ~mu_R
   1000014     3.53323450E+03   # ~nu_muL
   1000015     1.46371789E+03   # ~tau_1
   2000015     1.51680922E+03   # ~tau_2
   1000016     1.50869042E+03   # ~nu_tauL
   1000021     1.29486450E+03   # ~g
   1000022     1.36158185E+02   # ~chi_10
   1000023     2.09745058E+03   # ~chi_20
   1000025    -2.11033280E+03   # ~chi_30
   1000035     2.17785078E+03   # ~chi_40
   1000024     1.36314923E+02   # ~chi_1+
   1000037     2.11180003E+03   # ~chi_2+
#
BLOCK NMIX  # Neutralino Mixing Matrix
  1  1     7.58656700E-05   # N_11
  1  2     9.99317332E-01   # N_12
  1  3     3.69397082E-02   # N_13
  1  4    -5.66756993E-04   # N_14
  2  1    -3.10296387E-01   # N_21
  2  2    -2.44914774E-02   # N_22
  2  3     6.73483793E-01   # N_23
  2  4     6.70474385E-01   # N_24
  3  1    -7.84881445E-03   # N_31
  3  2     2.65203940E-02   # N_32
  3  3    -7.06582344E-01   # N_33
  3  4     7.07090133E-01   # N_34
  4  1     9.50607460E-01   # N_41
  4  2    -7.85526887E-03   # N_42
  4  3     2.14001005E-01   # N_43
  4  4     2.24693841E-01   # N_44
#
BLOCK UMIX  # Chargino Mixing Matrix U
  1  1     9.98635907E-01   # U_11
  1  2     5.22142218E-02   # U_12
  2  1    -5.22142218E-02   # U_21
  2  2     9.98635907E-01   # U_22
#
BLOCK VMIX  # Chargino Mixing Matrix V
  1  1     9.99999673E-01   # V_11
  1  2     8.08394172E-04   # V_12
  2  1     8.08394172E-04   # V_21
  2  2    -9.99999673E-01   # V_22
#
BLOCK STOPMIX  # Stop Mixing Matrix
  1  1    -1.25953782E-01   # cos(theta_t)
  1  2     9.92036111E-01   # sin(theta_t)
  2  1    -9.92036111E-01   # -sin(theta_t)
  2  2    -1.25953782E-01   # cos(theta_t)
#
BLOCK SBOTMIX  # Sbottom Mixing Matrix
  1  1    -1.32155208E-02   # cos(theta_b)
  1  2     9.99912671E-01   # sin(theta_b)
  2  1    -9.99912671E-01   # -sin(theta_b)
  2  2    -1.32155208E-02   # cos(theta_b)
#
BLOCK STAUMIX  # Stau Mixing Matrix
  1  1    -3.32891945E-01   # cos(theta_tau)
  1  2     9.42964980E-01   # sin(theta_tau)
  2  1    -9.42964980E-01   # -sin(theta_tau)
  2  2    -3.32891945E-01   # cos(theta_tau)
#
BLOCK ALPHA  # Higgs mixing
          -7.85607352E-02   # Mixing angle in the neutral Higgs boson sector
#
BLOCK HMIX Q=  3.40852100E+03  # DRbar Higgs Parameters
         1    -2.09789789E+03   # mu(Q)MSSM           
         2     1.30603135E+01   # tan                 
         3     2.42414122E+02   # higgs               
         4     7.31164250E+05   # mA^2(Q)MSSM         
#
BLOCK GAUGE Q=  3.40852100E+03  # The gauge couplings
     1     3.65126632E-01   # gprime(Q) DRbar
     2     6.42303689E-01   # g(Q) DRbar
     3     1.02050661E+00   # g3(Q) DRbar
#
BLOCK AU Q=  3.40852100E+03  # The trilinear couplings
  1  1     0.00000000E+00   # A_u(Q) DRbar
  2  2     0.00000000E+00   # A_c(Q) DRbar
  3  3     2.52213001E+03   # A_t(Q) DRbar
#
BLOCK AD Q=  3.40852100E+03  # The trilinear couplings
  1  1     0.00000000E+00   # A_d(Q) DRbar
  2  2     0.00000000E+00   # A_s(Q) DRbar
  3  3     2.47887000E+03   # A_b(Q) DRbar
#
BLOCK AE Q=  3.40852100E+03  # The trilinear couplings
  1  1     0.00000000E+00   # A_e(Q) DRbar
  2  2     0.00000000E+00   # A_mu(Q) DRbar
  3  3     1.02800000E+02   # A_tau(Q) DRbar
#
BLOCK Yu Q=  3.40852100E+03  # The Yukawa couplings
  1  1     0.00000000E+00   # y_u(Q) DRbar
  2  2     0.00000000E+00   # y_c(Q) DRbar
  3  3     8.28254361E-01   # y_t(Q) DRbar
#
BLOCK Yd Q=  3.40852100E+03  # The Yukawa couplings
  1  1     0.00000000E+00   # y_d(Q) DRbar
  2  2     0.00000000E+00   # y_s(Q) DRbar
  3  3     1.87159455E-01   # y_b(Q) DRbar
#
BLOCK Ye Q=  3.40852100E+03  # The Yukawa couplings
  1  1     0.00000000E+00   # y_e(Q) DRbar
  2  2     0.00000000E+00   # y_mu(Q) DRbar
  3  3     1.33802806E-01   # y_tau(Q) DRbar
#
BLOCK MSOFT Q=  3.40852100E+03  # The soft SUSY breaking masses at the scale Q
         1     2.19069000E+03   # M_1(Q)              
         2     1.23480000E+02   # M_2(Q)              
         3     1.06647000E+03   # M_3(Q)              
        21    -3.70235161E+06   # mH1^2(Q)            
        22    -4.17711499E+06   # mH2^2(Q)            
        31     3.52674000E+03   # meL(Q)              
        32     3.52674000E+03   # mmuL(Q)             
        33     1.50564000E+03   # mtauL(Q)            
        34     3.39483000E+03   # meR(Q)              
        35     3.39483000E+03   # mmuR(Q)             
        36     1.45423000E+03   # mtauR(Q)            
        41     3.25003000E+03   # mqL1(Q)             
        42     3.25003000E+03   # mqL2(Q)             
        43     3.60725000E+03   # mqL3(Q)             
        44     3.16530000E+03   # muR(Q)              
        45     3.16530000E+03   # mcR(Q)              
        46     3.21740000E+03   # mtR(Q)              
        47     3.93378000E+03   # mdR(Q)              
        48     3.93378000E+03   # msR(Q)              
        49     2.71878000E+03   # mbR(Q)              
#
Block HiggsBoundsInputHiggsCouplingsFermions
# ScalarNormEffCoupSq PseudoSNormEffCoupSq NP   IP1 IP2 IP2
    1.05672824E+00    0.00000000E+00        3  25   5   5  # h0-b-b eff. coupling^2, normalised to SM
    1.70515060E+02    0.00000000E+00        3  35   5   5  # H0-b-b eff. coupling^2, normalised to SM
    0.00000000E+00    1.70571789E+02        3  36   5   5  # A0-b-b eff. coupling^2, normalised to SM
#
    9.99667423E-01    0.00000000E+00        3  25   6   6  # h0-t-t eff. coupling^2, normalised to SM
    6.19521113E-03    0.00000000E+00        3  35   6   6  # H0-t-t eff. coupling^2, normalised to SM
    0.00000000E+00    5.86263419E-03        3  36   6   6  # A0-t-t eff. coupling^2, normalised to SM
#
    1.05672824E+00    0.00000000E+00        3  25  15  15  # h0-tau-tau eff. coupling^2, normalised to SM
    1.70515060E+02    0.00000000E+00        3  35  15  15  # H0-tau-tau eff. coupling^2, normalised to SM
    0.00000000E+00    1.70571789E+02        3  36  15  15  # A0-tau-tau eff. coupling^2, normalised to SM
#
Block HiggsBoundsInputHiggsCouplingsBosons
    9.99995412E-01        3  25  24  24  # h0-W-W eff. coupling^2, normalised to SM
    4.58815860E-06        3  35  24  24  # H0-W-W eff. coupling^2, normalised to SM
    0.00000000E+00        3  36  24  24  # A0-W-W eff. coupling^2, normalised to SM
#
    9.99995412E-01        3  25  23  23  # h0-Z-Z eff. coupling^2, normalised to SM
    4.58815860E-06        3  35  23  23  # H0-Z-Z eff. coupling^2, normalised to SM
    0.00000000E+00        3  36  23  23  # A0-Z-Z eff. coupling^2, normalised to SM
#
    8.85427300E-01        3  25  21  21  # h0-g-g eff. coupling^2, normalised to SM
    4.42694803E-05        3  35  21  21  # H0-g-g eff. coupling^2, normalised to SM
    3.51618151E-04        3  36  21  21  # A0-g-g eff. coupling^2, normalised to SM
#
    0.00000000E+00        3  25  25  23  # h0-h0-Z eff. coupling^2, normalised to SM
    0.00000000E+00        3  35  25  23  # H0-h0-Z eff. coupling^2, normalised to SM
    4.58815860E-06        3  36  25  23  # A0-h0-Z eff. coupling^2, normalised to SM
    0.00000000E+00        3  35  35  23  # H0-H0-Z eff. coupling^2, normalised to SM
    9.99995412E-01        3  36  35  23  # A0-H0-Z eff. coupling^2, normalised to SM
    0.00000000E+00        3  36  36  23  # A0-A0-Z eff. coupling^2, normalised to SM
#
    0.00000000E+00        4  25  21  21  23  # h0-g-g-Z eff. coupling^2, normalised to SM
    0.00000000E+00        4  35  21  21  23  # H0-g-g-Z eff. coupling^2, normalised to SM
    0.00000000E+00        4  36  21  21  23  # A0-g-g-Z eff. coupling^2, normalised to SM
#
#
#
#                             =================
#                             |The decay table|
#                             =================
#
# - The QCD corrections to the decays gluino -> squark  + quark
#                                     squark -> gaugino + quark_prime
#                                     squark -> squark_prime + Higgs
#                                     squark -> gluino  + quark
#   are included.
#
# - The multi-body decays for the inos, stops and sbottoms are included.
#
# - The loop induced decays for the gluino, neutralinos and stops
#   are included.
#
# - The SUSY decays of the top quark are included.
#
#
#         PDG            Width
DECAY         6     1.45311896E+00   # top decays
#          BR         NDA      ID1       ID2
     1.00000000E+00    2           5        24   # BR(t ->  b    W+)
#
#         PDG            Width
DECAY   1000021     1.33840657E-03   # gluino decays
#          BR         NDA      ID1       ID2
     6.10663500E-07    2     1000022        21   # BR(~g -> ~chi_10 g)
#           BR         NDA      ID1       ID2       ID3
     6.43443485E-02    3     1000022         1        -1   # BR(~g -> ~chi_10 d  db)
     6.44179666E-02    3     1000022         2        -2   # BR(~g -> ~chi_10 u  ub)
     6.43443485E-02    3     1000022         3        -3   # BR(~g -> ~chi_10 s  sb)
     6.44179666E-02    3     1000022         4        -4   # BR(~g -> ~chi_10 c  cb)
     4.31206958E-02    3     1000022         5        -5   # BR(~g -> ~chi_10 b  bb)
     3.24322184E-02    3     1000022         6        -6   # BR(~g -> ~chi_10 t  tb)
     1.28757011E-01    3     1000024         1        -2   # BR(~g -> ~chi_1+ d  ub)
     1.28757011E-01    3    -1000024         2        -1   # BR(~g -> ~chi_1- u  db)
     1.28757011E-01    3     1000024         3        -4   # BR(~g -> ~chi_1+ s  cb)
     1.28757011E-01    3    -1000024         4        -3   # BR(~g -> ~chi_1- c  sb)
     7.59468996E-02    3     1000024         5        -6   # BR(~g -> ~chi_1+ b  tb)
     7.59468996E-02    3    -1000024         6        -5   # BR(~g -> ~chi_1- t  bb)
#
#         PDG            Width
DECAY   1000006     1.51847872E+02   # stop1 decays
#          BR         NDA      ID1       ID2
     1.38217769E-03    2     1000022         6   # BR(~t_1 -> ~chi_10 t )
     4.11983894E-02    2     1000023         6   # BR(~t_1 -> ~chi_20 t )
     4.38019694E-02    2     1000025         6   # BR(~t_1 -> ~chi_30 t )
     2.01085015E-02    2     1000035         6   # BR(~t_1 -> ~chi_40 t )
     2.78528489E-03    2     1000024         5   # BR(~t_1 -> ~chi_1+ b )
     9.09654282E-02    2     1000037         5   # BR(~t_1 -> ~chi_2+ b )
     7.99751680E-01    2     1000021         6   # BR(~t_1 -> ~g      t )
     6.56869436E-06    2     1000005        24   # BR(~t_1 -> ~b_1    W+)
#
#         PDG            Width
DECAY   2000006     2.25890978E+02   # stop2 decays
#          BR         NDA      ID1       ID2
     6.43124514E-02    2     1000022         6   # BR(~t_2 -> ~chi_10 t )
     4.44243922E-02    2     1000023         6   # BR(~t_2 -> ~chi_20 t )
     4.89978455E-02    2     1000025         6   # BR(~t_2 -> ~chi_30 t )
     3.64768058E-03    2     1000035         6   # BR(~t_2 -> ~chi_40 t )
     1.29414827E-01    2     1000024         5   # BR(~t_2 -> ~chi_1+ b )
     6.35840271E-03    2     1000037         5   # BR(~t_2 -> ~chi_2+ b )
     6.78688030E-01    2     1000021         6   # BR(~t_2 -> ~g      t )
     1.17756416E-02    2     1000006        25   # BR(~t_2 -> ~t_1    h )
     1.06383324E-02    2     1000006        23   # BR(~t_2 -> ~t_1    Z )
     1.74239689E-03    2     1000005        24   # BR(~t_2 -> ~b_1    W+)
#
#         PDG            Width
DECAY   1000005     9.31988542E+01   # sbottom1 decays
#          BR         NDA      ID1       ID2
     9.75172412E-05    2     1000022         5   # BR(~b_1 -> ~chi_10 b )
     1.97562181E-03    2     1000023         5   # BR(~b_1 -> ~chi_20 b )
     1.74686860E-03    2     1000025         5   # BR(~b_1 -> ~chi_30 b )
     2.31102387E-03    2     1000035         5   # BR(~b_1 -> ~chi_40 b )
     1.93255088E-04    2    -1000024         6   # BR(~b_1 -> ~chi_1- t )
     3.22510383E-03    2    -1000037         6   # BR(~b_1 -> ~chi_2- t )
     9.90450610E-01    2     1000021         5   # BR(~b_1 -> ~g      b )
#
#         PDG            Width
DECAY   2000005     2.24144847E+02   # sbottom2 decays
#          BR         NDA      ID1       ID2
     6.59947439E-02    2     1000022         5   # BR(~b_2 -> ~chi_10 b )
     2.25780912E-03    2     1000023         5   # BR(~b_2 -> ~chi_20 b )
     2.48187000E-03    2     1000025         5   # BR(~b_2 -> ~chi_30 b )
     1.19707630E-03    2     1000035         5   # BR(~b_2 -> ~chi_40 b )
     1.31179080E-01    2    -1000024         6   # BR(~b_2 -> ~chi_1- t )
     9.58640728E-02    2    -1000037         6   # BR(~b_2 -> ~chi_2- t )
     6.78918543E-01    2     1000021         5   # BR(~b_2 -> ~g      b )
     9.33404045E-04    2     1000005        25   # BR(~b_2 -> ~b_1    h )
     8.89882242E-04    2     1000005        23   # BR(~b_2 -> ~b_1    Z )
     2.02835180E-02    2     1000006       -24   # BR(~b_2 -> ~t_1    W-)
#
#         PDG            Width
DECAY   1000002     2.03352487E+02   # sup_L decays
#          BR         NDA      ID1       ID2
     6.39560065E-02    2     1000022         2   # BR(~u_L -> ~chi_10 u)
     1.58279968E-04    2     1000023         2   # BR(~u_L -> ~chi_20 u)
     1.40603585E-05    2     1000025         2   # BR(~u_L -> ~chi_30 u)
     6.07328085E-04    2     1000035         2   # BR(~u_L -> ~chi_40 u)
     1.28082124E-01    2     1000024         1   # BR(~u_L -> ~chi_1+ d)
     2.92688507E-08    2     1000037         1   # BR(~u_L -> ~chi_2+ d)
     8.07182172E-01    2     1000021         2   # BR(~u_L -> ~g      u)
#
#         PDG            Width
DECAY   2000002     1.58685509E+02   # sup_R decays
#          BR         NDA      ID1       ID2
     2.63988341E-10    2     1000022         2   # BR(~u_R -> ~chi_10 u)
     1.45779284E-03    2     1000023         2   # BR(~u_R -> ~chi_20 u)
     9.15710246E-07    2     1000025         2   # BR(~u_R -> ~chi_30 u)
     1.21387624E-02    2     1000035         2   # BR(~u_R -> ~chi_40 u)
     9.86402529E-01    2     1000021         2   # BR(~u_R -> ~g      u)
#
#         PDG            Width
DECAY   1000001     2.03385671E+02   # sdown_L decays
#          BR         NDA      ID1       ID2
     6.39584396E-02    2     1000022         1   # BR(~d_L -> ~chi_10 d)
     2.68738440E-05    2     1000023         1   # BR(~d_L -> ~chi_20 d)
     1.76142506E-05    2     1000025         1   # BR(~d_L -> ~chi_30 d)
     7.23783046E-04    2     1000035         1   # BR(~d_L -> ~chi_40 d)
     1.27745224E-01    2    -1000024         2   # BR(~d_L -> ~chi_1- u)
     1.22203218E-04    2    -1000037         2   # BR(~d_L -> ~chi_2- u)
     8.07405862E-01    2     1000021         1   # BR(~d_L -> ~g      d)
#
#         PDG            Width
DECAY   2000001     2.22669341E+02   # sdown_R decays
#          BR         NDA      ID1       ID2
     5.85221732E-11    2     1000022         1   # BR(~d_R -> ~chi_10 d)
     5.11747493E-04    2     1000023         1   # BR(~d_R -> ~chi_20 d)
     3.24328430E-07    2     1000025         1   # BR(~d_R -> ~chi_30 d)
     4.51866729E-03    2     1000035         1   # BR(~d_R -> ~chi_40 d)
     9.94969261E-01    2     1000021         1   # BR(~d_R -> ~g      d)
#
#         PDG            Width
DECAY   1000004     1.70465945E+02   # scharm_L decays
#          BR         NDA      ID1       ID2
     7.88667464E-02    2     1000022         4   # BR(~c_L -> ~chi_10 c)
     1.93946630E-04    2     1000023         4   # BR(~c_L -> ~chi_20 c)
     1.72262846E-05    2     1000025         4   # BR(~c_L -> ~chi_30 c)
     7.43480075E-04    2     1000035         4   # BR(~c_L -> ~chi_40 c)
     1.57943248E-01    2     1000024         3   # BR(~c_L -> ~chi_1+ s)
     3.58586873E-08    2     1000037         3   # BR(~c_L -> ~chi_2+ s)
     7.62235316E-01    2     1000021         4   # BR(~c_L -> ~g      c)
#
#         PDG            Width
DECAY   2000004     1.26120086E+02   # scharm_R decays
#          BR         NDA      ID1       ID2
     3.43457955E-10    2     1000022         4   # BR(~c_R -> ~chi_10 c)
     1.88281823E-03    2     1000023         4   # BR(~c_R -> ~chi_20 c)
     1.18249305E-06    2     1000025         4   # BR(~c_R -> ~chi_30 c)
     1.56603710E-02    2     1000035         4   # BR(~c_R -> ~chi_40 c)
     9.82455628E-01    2     1000021         4   # BR(~c_R -> ~g      c)
#
#         PDG            Width
DECAY   1000003     1.70482547E+02   # sstrange_L decays
#          BR         NDA      ID1       ID2
     7.88747492E-02    2     1000022         3   # BR(~s_L -> ~chi_10 s)
     3.29319679E-05    2     1000023         3   # BR(~s_L -> ~chi_20 s)
     2.15819711E-05    2     1000025         3   # BR(~s_L -> ~chi_30 s)
     8.86108067E-04    2     1000035         3   # BR(~s_L -> ~chi_40 s)
     1.57537688E-01    2    -1000024         4   # BR(~s_L -> ~chi_1- c)
     1.49727685E-04    2    -1000037         4   # BR(~s_L -> ~chi_2- c)
     7.62497213E-01    2     1000021         3   # BR(~s_L -> ~g      s)
#
#         PDG            Width
DECAY   2000003     1.76531502E+02   # sstrange_R decays
#          BR         NDA      ID1       ID2
     7.61756928E-11    2     1000022         3   # BR(~s_R -> ~chi_10 s)
     6.64652284E-04    2     1000023         3   # BR(~s_R -> ~chi_20 s)
     4.21216327E-07    2     1000025         3   # BR(~s_R -> ~chi_30 s)
     5.86710607E-03    2     1000035         3   # BR(~s_R -> ~chi_40 s)
     9.93467820E-01    2     1000021         3   # BR(~s_R -> ~g      s)
#
#         PDG            Width
DECAY   1000011     4.51512216E+01   # selectron_L decays
#          BR         NDA      ID1       ID2
     3.19881836E-01    2     1000022        11   # BR(~e_L -> ~chi_10 e-)
     5.44083039E-03    2     1000023        11   # BR(~e_L -> ~chi_20 e-)
     6.47283945E-05    2     1000025        11   # BR(~e_L -> ~chi_30 e-)
     3.50564198E-02    2     1000035        11   # BR(~e_L -> ~chi_40 e-)
     6.38831956E-01    2    -1000024        12   # BR(~e_L -> ~chi_1- nu_e)
     7.24229163E-04    2    -1000037        12   # BR(~e_L -> ~chi_2- nu_e)
#
#         PDG            Width
DECAY   2000011     6.34771937E+00   # selectron_R decays
#          BR         NDA      ID1       ID2
     1.63099356E-08    2     1000022        11   # BR(~e_R -> ~chi_10 e-)
     1.05173551E-01    2     1000023        11   # BR(~e_R -> ~chi_20 e-)
     6.62785803E-05    2     1000025        11   # BR(~e_R -> ~chi_30 e-)
     8.94760154E-01    2     1000035        11   # BR(~e_R -> ~chi_40 e-)
#
#         PDG            Width
DECAY   1000013     4.51512216E+01   # smuon_L decays
#          BR         NDA      ID1       ID2
     3.19881836E-01    2     1000022        13   # BR(~mu_L -> ~chi_10 mu-)
     5.44083038E-03    2     1000023        13   # BR(~mu_L -> ~chi_20 mu-)
     6.47283943E-05    2     1000025        13   # BR(~mu_L -> ~chi_30 mu-)
     3.50564196E-02    2     1000035        13   # BR(~mu_L -> ~chi_40 mu-)
     6.38831957E-01    2    -1000024        14   # BR(~mu_L -> ~chi_1- nu_mu)
     7.24229164E-04    2    -1000037        14   # BR(~mu_L -> ~chi_2- nu_mu)
#
#         PDG            Width
DECAY   2000013     6.34771933E+00   # smuon_R decays
#          BR         NDA      ID1       ID2
     1.63099357E-08    2     1000022        13   # BR(~mu_R -> ~chi_10 mu-)
     1.05173551E-01    2     1000023        13   # BR(~mu_R -> ~chi_20 mu-)
     6.62785804E-05    2     1000025        13   # BR(~mu_R -> ~chi_30 mu-)
     8.94760154E-01    2     1000035        13   # BR(~mu_R -> ~chi_40 mu-)
#
#         PDG            Width
DECAY   1000015     2.08083498E+00   # stau_1 decays
#          BR         NDA      ID1       ID2
     3.33685865E-01    2     1000022        15   # BR(~tau_1 -> ~chi_10  tau-)
     6.66314135E-01    2    -1000024        16   # BR(~tau_1 -> ~chi_1-  nu_tau)
#
#         PDG            Width
DECAY   2000015     1.61764103E+01   # stau_2 decays
#          BR         NDA      ID1       ID2
     3.33691585E-01    2     1000022        15   # BR(~tau_2 -> ~chi_10  tau-)
     6.66308415E-01    2    -1000024        16   # BR(~tau_2 -> ~chi_1-  nu_tau)
#
#         PDG            Width
DECAY   1000012     4.51699196E+01   # snu_eL decays
#          BR         NDA      ID1       ID2
     3.19582227E-01    2     1000022        12   # BR(~nu_eL -> ~chi_10 nu_e)
     3.10624436E-03    2     1000023        12   # BR(~nu_eL -> ~chi_20 nu_e)
     1.27495537E-04    2     1000025        12   # BR(~nu_eL -> ~chi_30 nu_e)
     3.70953939E-02    2     1000035        12   # BR(~nu_eL -> ~chi_40 nu_e)
     6.40088466E-01    2     1000024        11   # BR(~nu_eL -> ~chi_1+ e-)
     1.73331507E-07    2     1000037        11   # BR(~nu_eL -> ~chi_2+ e-)
#
#         PDG            Width
DECAY   1000014     4.51699195E+01   # snu_muL decays
#          BR         NDA      ID1       ID2
     3.19582228E-01    2     1000022        14   # BR(~nu_muL -> ~chi_10 nu_mu)
     3.10624437E-03    2     1000023        14   # BR(~nu_muL -> ~chi_20 nu_mu)
     1.27495537E-04    2     1000025        14   # BR(~nu_muL -> ~chi_30 nu_mu)
     3.70953939E-02    2     1000035        14   # BR(~nu_muL -> ~chi_40 nu_mu)
     6.40088465E-01    2     1000024        13   # BR(~nu_muL -> ~chi_1+ mu-)
     1.73331506E-07    2     1000037        13   # BR(~nu_muL -> ~chi_2+ mu-)
#
#         PDG            Width
DECAY   1000016     1.82646918E+01   # snu_tauL decays
#          BR         NDA      ID1       ID2
     3.32992580E-01    2     1000022        16   # BR(~nu_tauL -> ~chi_10 nu_tau)
     6.67007420E-01    2     1000024        15   # BR(~nu_tauL -> ~chi_1+ tau-)
#
#         PDG            Width
DECAY   1000024     2.68046040E-15   # chargino1+ decays
#           BR         NDA      ID1       ID2       ID3
     2.06090750E-02    3     1000022       -11        12   # BR(~chi_1+ -> ~chi_10 e+   nu_e)
     1.76164390E-03    3     1000022       -13        14   # BR(~chi_1+ -> ~chi_10 mu+  nu_mu)
     9.77629280E-01    2     1000022       211             # BR(~chi_1+ -> ~chi_10 pi+)
#
#         PDG            Width
DECAY   1000037     2.16073312E+01   # chargino2+ decays
#          BR         NDA      ID1       ID2
     4.16108321E-03    2     1000016       -15   # BR(~chi_2+ -> ~nu_tau1 tau+)
     3.46119964E-03    2    -1000015        16   # BR(~chi_2+ -> ~tau_1+  nu_tau)
     1.31970215E-03    2    -2000015        16   # BR(~chi_2+ -> ~tau_2+  nu_tau)
     1.91107551E-01    2     1000024        23   # BR(~chi_2+ -> ~chi_1+  Z )
     1.86181047E-01    2     1000022        24   # BR(~chi_2+ -> ~chi_10  W+)
     1.94590705E-01    2     1000024        25   # BR(~chi_2+ -> ~chi_1+  h )
     1.39770757E-01    2     1000024        35   # BR(~chi_2+ -> ~chi_1+  H )
     1.39688843E-01    2     1000024        36   # BR(~chi_2+ -> ~chi_1+  A )
     1.39719112E-01    2     1000022        37   # BR(~chi_2+ -> ~chi_10  H+)
#
#         PDG            Width
DECAY   1000022     0.00000000E+00   # neutralino1 decays
#
#         PDG            Width
DECAY   1000023     1.97230345E+01   # neutralino2 decays
#          BR         NDA      ID1       ID2
     9.62971180E-02    2     1000022        23   # BR(~chi_20 -> ~chi_10   Z )
     1.81569436E-01    2     1000024       -24   # BR(~chi_20 -> ~chi_1+   W-)
     1.81569436E-01    2    -1000024        24   # BR(~chi_20 -> ~chi_1-   W+)
     9.24535928E-02    2     1000022        25   # BR(~chi_20 -> ~chi_10   h )
     9.10046309E-02    2     1000022        35   # BR(~chi_20 -> ~chi_10   H )
     4.88405431E-02    2     1000022        36   # BR(~chi_20 -> ~chi_10   A )
     1.39531181E-01    2     1000024       -37   # BR(~chi_20 -> ~chi_1+   H-)
     1.39531181E-01    2    -1000024        37   # BR(~chi_20 -> ~chi_1-   H+)
     9.94072337E-03    2     1000015       -15   # BR(~chi_20 -> ~tau_1-   tau+)
     9.94072337E-03    2    -1000015        15   # BR(~chi_20 -> ~tau_1+   tau-)
     3.48802219E-03    2     2000015       -15   # BR(~chi_20 -> ~tau_2-   tau+)
     3.48802219E-03    2    -2000015        15   # BR(~chi_20 -> ~tau_2+   tau-)
     1.17269472E-03    2     1000016       -16   # BR(~chi_20 -> ~nu_tau1  nu_taub)
     1.17269472E-03    2    -1000016        16   # BR(~chi_20 -> ~nu_tau1* nu_tau )
#
#         PDG            Width
DECAY   1000025     2.14042902E+01   # neutralino3 decays
#          BR         NDA      ID1       ID2
     9.34454785E-02    2     1000022        23   # BR(~chi_30 -> ~chi_10   Z )
     1.87865310E-01    2     1000024       -24   # BR(~chi_30 -> ~chi_1+   W-)
     1.87865310E-01    2    -1000024        24   # BR(~chi_30 -> ~chi_1-   W+)
     1.00992716E-01    2     1000022        25   # BR(~chi_30 -> ~chi_10   h )
     4.88214109E-02    2     1000022        35   # BR(~chi_30 -> ~chi_10   H )
     9.12901076E-02    2     1000022        36   # BR(~chi_30 -> ~chi_10   A )
     1.40407854E-01    2     1000024       -37   # BR(~chi_30 -> ~chi_1+   H-)
     1.40407854E-01    2    -1000024        37   # BR(~chi_30 -> ~chi_1-   H+)
     2.15084472E-03    2     1000015       -15   # BR(~chi_30 -> ~tau_1-   tau+)
     2.15084472E-03    2    -1000015        15   # BR(~chi_30 -> ~tau_1+   tau-)
     2.25471709E-03    2     2000015       -15   # BR(~chi_30 -> ~tau_2-   tau+)
     2.25471709E-03    2    -2000015        15   # BR(~chi_30 -> ~tau_2+   tau-)
     4.64173539E-05    2     1000016       -16   # BR(~chi_30 -> ~nu_tau1  nu_taub)
     4.64173539E-05    2    -1000016        16   # BR(~chi_30 -> ~nu_tau1* nu_tau )
#
#         PDG            Width
DECAY   1000035     6.50390941E+00   # neutralino4 decays
#          BR         NDA      ID1       ID2
     3.30886442E-02    2     1000022        23   # BR(~chi_40 -> ~chi_10   Z )
     6.35396169E-02    2     1000024       -24   # BR(~chi_40 -> ~chi_1+   W-)
     6.35396169E-02    2    -1000024        24   # BR(~chi_40 -> ~chi_1-   W+)
     3.35267497E-02    2     1000022        25   # BR(~chi_40 -> ~chi_10   h )
     2.45002198E-02    2     1000022        35   # BR(~chi_40 -> ~chi_10   H )
     1.26588489E-02    2     1000022        36   # BR(~chi_40 -> ~chi_10   A )
     3.70945253E-02    2     1000024       -37   # BR(~chi_40 -> ~chi_1+   H-)
     3.70945253E-02    2    -1000024        37   # BR(~chi_40 -> ~chi_1-   H+)
     2.17649604E-01    2     1000015       -15   # BR(~chi_40 -> ~tau_1-   tau+)
     2.17649604E-01    2    -1000015        15   # BR(~chi_40 -> ~tau_1+   tau-)
     7.39646883E-02    2     2000015       -15   # BR(~chi_40 -> ~tau_2-   tau+)
     7.39646883E-02    2    -2000015        15   # BR(~chi_40 -> ~tau_2+   tau-)
     5.58643343E-02    2     1000016       -16   # BR(~chi_40 -> ~nu_tau1  nu_taub)
     5.58643343E-02    2    -1000016        16   # BR(~chi_40 -> ~nu_tau1* nu_tau )
#
#         PDG            Width
DECAY        25     3.97757195E-03   # h decays
#          BR         NDA      ID1       ID2
     6.05713656E-01    2           5        -5   # BR(h -> b       bb     )
     6.83929974E-02    2         -15        15   # BR(h -> tau+    tau-   )
     2.42061498E-04    2         -13        13   # BR(h -> mu+     mu-    )
     2.64833491E-04    2           3        -3   # BR(h -> s       sb     )
     2.17057240E-02    2           4        -4   # BR(h -> c       cb     )
     7.88285666E-02    2          21        21   # BR(h -> g       g      )
     2.30976287E-03    2          22        22   # BR(h -> gam     gam    )
     1.48008604E-03    2          22        23   # BR(h -> Z       gam    )
     1.96773843E-01    2          24       -24   # BR(h -> W+      W-     )
     2.42884690E-02    2          23        23   # BR(h -> Z       Z      )
#
#         PDG            Width
DECAY        35     2.75745843E+00   # H decays
#          BR         NDA      ID1       ID2
     7.93132550E-01    2           5        -5   # BR(H -> b       bb     )
     1.13364693E-01    2         -15        15   # BR(H -> tau+    tau-   )
     3.99121309E-04    2         -13        13   # BR(H -> mu+     mu-    )
     3.20559091E-04    2           3        -3   # BR(H -> s       sb     )
     9.66505838E-07    2           4        -4   # BR(H -> c       cb     )
     8.13038358E-02    2           6        -6   # BR(H -> t       tb     )
     1.59251078E-04    2          21        21   # BR(H -> g       g      )
     1.49513143E-07    2          22        22   # BR(H -> gam     gam    )
     1.31777114E-07    2          23        22   # BR(H -> Z       gam    )
     3.45845704E-04    2          24       -24   # BR(H -> W+      W-     )
     1.70209260E-04    2          23        23   # BR(H -> Z       Z      )
     1.38844713E-03    2          25        25   # BR(H -> h       h      )
     6.27626270E-03    2     1000024  -1000024   # BR(H -> ~chi_1+ ~chi_1-)
     3.13797742E-03    2     1000022   1000022   # BR(H -> ~chi_10 ~chi_10)
#
#         PDG            Width
DECAY        36     2.77519719E+00   # A decays
#          BR         NDA      ID1       ID2
     7.88362174E-01    2           5        -5   # BR(A -> b       bb     )
     1.12664808E-01    2         -15        15   # BR(A -> tau+    tau-   )
     3.96651042E-04    2         -13        13   # BR(A -> mu+     mu-    )
     3.18712472E-04    2           3        -3   # BR(A -> s       sb     )
     9.16974732E-07    2           4        -4   # BR(A -> c       cb     )
     8.70743285E-02    2           6        -6   # BR(A -> t       tb     )
     4.45915674E-04    2          21        21   # BR(A -> g       g      )
     3.44422869E-07    2          22        22   # BR(A -> gam     gam    )
     2.80704122E-07    2          23        22   # BR(A -> Z       gam    )
     3.34450389E-04    2          23        25   # BR(A -> Z       h      )
     6.93504235E-03    2     1000024  -1000024   # BR(A -> ~chi_1+ ~chi_1-)
     3.46637498E-03    2     1000022   1000022   # BR(A -> ~chi_10 ~chi_10)
#
#         PDG            Width
DECAY        37     2.74740352E+00   # H+ decays
#          BR         NDA      ID1       ID2
     1.37872224E-03    2           4        -5   # BR(H+ -> c       bb     )
     1.14338024E-01    2         -15        16   # BR(H+ -> tau+    nu_tau )
     4.02541787E-04    2         -13        14   # BR(H+ -> mu+     nu_mu  )
     1.37870412E-05    2           2        -5   # BR(H+ -> u       bb     )
     1.60916610E-05    2           2        -3   # BR(H+ -> u       sb     )
     3.17620446E-04    2           4        -3   # BR(H+ -> c       sb     )
     8.83187655E-01    2           6        -5   # BR(H+ -> t       bb     )
     3.45556519E-04    2          24        25   # BR(H+ -> W+      h      )
     5.64283144E-10    2          24        36   # BR(H+ -> W+      A      )
     1.58284826E-10    2     1000024   1000022   # BR(H+ -> ~chi_1+ ~chi_10)
