#
#                              ======================
#                              | THE SUSYHIT OUTPUT |
#                              ======================
#
#
#              ------------------------------------------------------
#              |     This is the output of the SUSY-HIT package     |
#              |  created by A.Djouadi, M.Muehlleitner and M.Spira. |
#              |  In case of problems with SUSY-HIT email to        |
#              |           margarete.muehlleitner@cern.ch           |
#              |           michael.spira@psi.ch                     |
#              |           abdelhak.djouadi@cern.ch                 |
#              ------------------------------------------------------
#
#              ------------------------------------------------------
#              |  SUSY Les Houches Accord - MSSM Spectrum + Decays  |
#              |              based on the decay programs           |
#              |                                                    |
#              |                     SDECAY 1.3b                    |
#              |                                                    |
#              |  Authors: M.Muhlleitner, A.Djouadi and Y.Mambrini  |
#              |  Ref.:    Comput.Phys.Commun.168(2005)46           |
#              |           [hep-ph/0311167]                         |
#              |                                                    |
#              |                     HDECAY 3.4                     |
#              |                                                    |
#              |  By: A.Djouadi,J.Kalinowski,M.Muhlleitner,M.Spira  |
#              |  Ref.:    Comput.Phys.Commun.108(1998)56           |
#              |           [hep-ph/9704448]                         |
#              |                                                    |
#              |                                                    |
#              |  If not stated otherwise all DRbar couplings and   |
#              |  soft SUSY breaking masses are given at the scale  |
#              |  Q=  0.24931200E+04
#              |                                                    |
#              ------------------------------------------------------
#
#
BLOCK DCINFO  # Decay Program information
     1   SDECAY/HDECAY # decay calculator
     2   1.3b  /3.4    # version number
#
BLOCK SPINFO  # Spectrum calculator information
     1     SOFTSUSY    # spectrum calculator               
     2     3.4.0       # version number                    
#
BLOCK MODSEL  # Model selection
     1     0   #  nonUniversal                                     
#
BLOCK SMINPUTS  # Standard Model inputs
         1     1.27908970E+02   # alpha_em^-1(M_Z)^MSbar
         2     1.16637870E-05   # G_F [GeV^-2]
         3     1.18400000E-01   # alpha_S(M_Z)^MSbar
         4     9.11876000E+01   # M_Z pole mass
         5     4.18000000E+00   # mb(mb)^MSbar
         6     1.73200000E+02   # mt pole mass
         7     1.77700000E+00   # mtau pole mass
#
BLOCK MINPAR  # Input parameters - minimal models
         3     2.58100000E+01   # tanb                
#
BLOCK EXTPAR  # Input parameters - non-minimal models
         0    -1.00000000E+00   # Set                 
         1    -2.67261000E+03   # M_1(MX)             
         2     1.12270000E+03   # M_2(MX)             
         3     2.47737000E+03   # M_3(MX)             
        11    -3.21725000E+03   # At(MX)              
        12    -2.05518000E+03   # Ab(MX)              
        13     7.29300000E+01   # Atau(MX)            
        23     1.89880000E+02   # mu(MX)              
        26     3.19220000E+03   # mA(pole)            
        31     4.04410000E+02   # meL(MX)             
        32     4.04410000E+02   # mmuL(MX)            
        33     2.46375000E+03   # mtauL(MX)           
        34     1.31020000E+03   # meR(MX)             
        35     1.31020000E+03   # mmuR(MX)            
        36     1.97805000E+03   # mtauR(MX)           
        41     3.41390000E+03   # mqL1(MX)            
        42     3.41390000E+03   # mqL2(MX)            
        43     2.57977000E+03   # mqL3(MX)            
        44     3.51163000E+03   # muR(MX)             
        45     3.51163000E+03   # mcR(MX)             
        46     2.40885000E+03   # mtR(MX)             
        47     1.81487000E+03   # mdR(MX)             
        48     1.81487000E+03   # msR(MX)             
        49     2.00379000E+03   # mbR(MX)             
#
BLOCK MASS  # Mass Spectrum
# PDG code           mass       particle
        24     8.03806995E+01   # W+
        25     1.25866611E+02   # h
        35     3.19220968E+03   # H
        36     3.19220001E+03   # A
        37     3.19345367E+03   # H+
         5     4.81876030E+00   # b-quark pole mass calculated from mb(mb)_Msbar
   1000001     3.47783892E+03   # ~d_L
   2000001     1.91882702E+03   # ~d_R
   1000002     3.47707904E+03   # ~u_L
   2000002     3.56935940E+03   # ~u_R
   1000003     3.47783892E+03   # ~s_L
   2000003     1.91882702E+03   # ~s_R
   1000004     3.47707904E+03   # ~c_L
   2000004     3.56935940E+03   # ~c_R
   1000005     2.09622348E+03   # ~b_1
   2000005     2.63085900E+03   # ~b_2
   1000006     2.40633165E+03   # ~t_1
   2000006     2.66986003E+03   # ~t_2
   1000011     4.47980191E+02   # ~e_L
   2000011     1.32154756E+03   # ~e_R
   1000012     4.40622302E+02   # ~nu_eL
   1000013     4.47980191E+02   # ~mu_L
   2000013     1.32154756E+03   # ~mu_R
   1000014     4.40622302E+02   # ~nu_muL
   1000015     1.98317057E+03   # ~tau_1
   2000015     2.47153673E+03   # ~tau_2
   1000016     2.46993545E+03   # ~nu_tauL
   1000021     2.64765444E+03   # ~g
   1000022     1.95435810E+02   # ~chi_10
   1000023    -2.00500984E+02   # ~chi_20
   1000025     1.16310884E+03   # ~chi_30
   1000035    -2.64050705E+03   # ~chi_40
   1000024     1.97577540E+02   # ~chi_1+
   1000037     1.16328795E+03   # ~chi_2+
#
BLOCK NMIX  # Neutralino Mixing Matrix
  1  1    -1.11649538E-02   # N_11
  1  2    -6.00762301E-02   # N_12
  1  3     7.11057444E-01   # N_13
  1  4    -7.00473769E-01   # N_14
  2  1     1.21167072E-02   # N_21
  2  2     3.99908989E-02   # N_22
  2  3     7.02981208E-01   # N_23
  2  4     7.09979813E-01   # N_24
  3  1    -8.12230492E-04   # N_31
  3  2     9.97392328E-01   # N_32
  3  3     1.46427880E-02   # N_33
  3  4    -7.06645148E-02   # N_34
  4  1     9.99863925E-01   # N_41
  4  2    -3.45240867E-04   # N_42
  4  3    -5.67077775E-04   # N_43
  4  4    -1.64830136E-02   # N_44
#
BLOCK UMIX  # Chargino Mixing Matrix U
  1  1    -2.07435549E-02   # U_11
  1  2     9.99784829E-01   # U_12
  2  1    -9.99784829E-01   # U_21
  2  2    -2.07435549E-02   # U_22
#
BLOCK VMIX  # Chargino Mixing Matrix V
  1  1    -1.00154707E-01   # V_11
  1  2     9.94971876E-01   # V_12
  2  1    -9.94971876E-01   # V_21
  2  2    -1.00154707E-01   # V_22
#
BLOCK STOPMIX  # Stop Mixing Matrix
  1  1     3.73969036E-01   # cos(theta_t)
  1  2     9.27441190E-01   # sin(theta_t)
  2  1    -9.27441190E-01   # -sin(theta_t)
  2  2     3.73969036E-01   # cos(theta_t)
#
BLOCK SBOTMIX  # Sbottom Mixing Matrix
  1  1     6.26200147E-03   # cos(theta_b)
  1  2     9.99980393E-01   # sin(theta_b)
  2  1    -9.99980393E-01   # -sin(theta_b)
  2  2     6.26200147E-03   # cos(theta_b)
#
BLOCK STAUMIX  # Stau Mixing Matrix
  1  1     3.91011909E-03   # cos(theta_tau)
  1  2     9.99992355E-01   # sin(theta_tau)
  2  1    -9.99992355E-01   # -sin(theta_tau)
  2  2     3.91011909E-03   # cos(theta_tau)
#
BLOCK ALPHA  # Higgs mixing
          -4.02727758E-02   # Mixing angle in the neutral Higgs boson sector
#
BLOCK HMIX Q=  2.49312000E+03  # DRbar Higgs Parameters
         1     1.92854305E+02   # mu(Q)MSSM           
         2     2.48738700E+01   # tan                 
         3     2.42269125E+02   # higgs               
         4     1.02910535E+07   # mA^2(Q)MSSM         
#
BLOCK GAUGE Q=  2.49312000E+03  # The gauge couplings
     1     3.64919409E-01   # gprime(Q) DRbar
     2     6.40233125E-01   # g(Q) DRbar
     3     1.01683144E+00   # g3(Q) DRbar
#
BLOCK AU Q=  2.49312000E+03  # The trilinear couplings
  1  1     0.00000000E+00   # A_u(Q) DRbar
  2  2     0.00000000E+00   # A_c(Q) DRbar
  3  3    -3.21724999E+03   # A_t(Q) DRbar
#
BLOCK AD Q=  2.49312000E+03  # The trilinear couplings
  1  1     0.00000000E+00   # A_d(Q) DRbar
  2  2     0.00000000E+00   # A_s(Q) DRbar
  3  3    -2.05518000E+03   # A_b(Q) DRbar
#
BLOCK AE Q=  2.49312000E+03  # The trilinear couplings
  1  1     0.00000000E+00   # A_e(Q) DRbar
  2  2     0.00000000E+00   # A_mu(Q) DRbar
  3  3     7.29300009E+01   # A_tau(Q) DRbar
#
BLOCK Yu Q=  2.49312000E+03  # The Yukawa couplings
  1  1     0.00000000E+00   # y_u(Q) DRbar
  2  2     0.00000000E+00   # y_c(Q) DRbar
  3  3     8.23163328E-01   # y_t(Q) DRbar
#
BLOCK Yd Q=  2.49312000E+03  # The Yukawa couplings
  1  1     0.00000000E+00   # y_d(Q) DRbar
  2  2     0.00000000E+00   # y_s(Q) DRbar
  3  3     3.31766679E-01   # y_b(Q) DRbar
#
BLOCK Ye Q=  2.49312000E+03  # The Yukawa couplings
  1  1     0.00000000E+00   # y_e(Q) DRbar
  2  2     0.00000000E+00   # y_mu(Q) DRbar
  3  3     2.55952415E-01   # y_tau(Q) DRbar
#
BLOCK MSOFT Q=  2.49312000E+03  # The soft SUSY breaking masses at the scale Q
         1    -2.67261000E+03   # M_1(Q)              
         2     1.12270000E+03   # M_2(Q)              
         3     2.47737000E+03   # M_3(Q)              
        21     1.01665003E+07   # mH1^2(Q)            
        22     1.07943267E+05   # mH2^2(Q)            
        31     4.04410000E+02   # meL(Q)              
        32     4.04410000E+02   # mmuL(Q)             
        33     2.46375000E+03   # mtauL(Q)            
        34     1.31020000E+03   # meR(Q)              
        35     1.31020000E+03   # mmuR(Q)             
        36     1.97805000E+03   # mtauR(Q)            
        41     3.41390000E+03   # mqL1(Q)             
        42     3.41390000E+03   # mqL2(Q)             
        43     2.57976999E+03   # mqL3(Q)             
        44     3.51163000E+03   # muR(Q)              
        45     3.51163000E+03   # mcR(Q)              
        46     2.40884998E+03   # mtR(Q)              
        47     1.81486999E+03   # mdR(Q)              
        48     1.81486999E+03   # msR(Q)              
        49     2.00378999E+03   # mbR(Q)              
#
Block HiggsBoundsInputHiggsCouplingsFermions
# ScalarNormEffCoupSq PseudoSNormEffCoupSq NP   IP1 IP2 IP2
    1.00456123E+00    0.00000000E+00        3  25   5   5  # h0-b-b eff. coupling^2, normalised to SM
    6.18704848E+02    0.00000000E+00        3  35   5   5  # H0-b-b eff. coupling^2, normalised to SM
    0.00000000E+00    6.18709409E+02        3  36   5   5  # A0-b-b eff. coupling^2, normalised to SM
#
    9.99992628E-01    0.00000000E+00        3  25   6   6  # h0-t-t eff. coupling^2, normalised to SM
    1.62363981E-03    0.00000000E+00        3  35   6   6  # H0-t-t eff. coupling^2, normalised to SM
    0.00000000E+00    1.61626765E-03        3  36   6   6  # A0-t-t eff. coupling^2, normalised to SM
#
    1.00456123E+00    0.00000000E+00        3  25  15  15  # h0-tau-tau eff. coupling^2, normalised to SM
    6.18704848E+02    0.00000000E+00        3  35  15  15  # H0-tau-tau eff. coupling^2, normalised to SM
    0.00000000E+00    6.18709409E+02        3  36  15  15  # A0-tau-tau eff. coupling^2, normalised to SM
#
Block HiggsBoundsInputHiggsCouplingsBosons
    9.99999992E-01        3  25  24  24  # h0-W-W eff. coupling^2, normalised to SM
    8.38744714E-09        3  35  24  24  # H0-W-W eff. coupling^2, normalised to SM
    0.00000000E+00        3  36  24  24  # A0-W-W eff. coupling^2, normalised to SM
#
    9.99999992E-01        3  25  23  23  # h0-Z-Z eff. coupling^2, normalised to SM
    8.38744714E-09        3  35  23  23  # H0-Z-Z eff. coupling^2, normalised to SM
    0.00000000E+00        3  36  23  23  # A0-Z-Z eff. coupling^2, normalised to SM
#
    8.89576232E-01        3  25  21  21  # h0-g-g eff. coupling^2, normalised to SM
    3.02571468E-14        3  35  21  21  # H0-g-g eff. coupling^2, normalised to SM
    8.84498482E-13        3  36  21  21  # A0-g-g eff. coupling^2, normalised to SM
#
    0.00000000E+00        3  25  25  23  # h0-h0-Z eff. coupling^2, normalised to SM
    0.00000000E+00        3  35  25  23  # H0-h0-Z eff. coupling^2, normalised to SM
    8.38744714E-09        3  36  25  23  # A0-h0-Z eff. coupling^2, normalised to SM
    0.00000000E+00        3  35  35  23  # H0-H0-Z eff. coupling^2, normalised to SM
    9.99999992E-01        3  36  35  23  # A0-H0-Z eff. coupling^2, normalised to SM
    0.00000000E+00        3  36  36  23  # A0-A0-Z eff. coupling^2, normalised to SM
#
    0.00000000E+00        4  25  21  21  23  # h0-g-g-Z eff. coupling^2, normalised to SM
    0.00000000E+00        4  35  21  21  23  # H0-g-g-Z eff. coupling^2, normalised to SM
    0.00000000E+00        4  36  21  21  23  # A0-g-g-Z eff. coupling^2, normalised to SM
#
#
#
#                             =================
#                             |The decay table|
#                             =================
#
# - The QCD corrections to the decays gluino -> squark  + quark
#                                     squark -> gaugino + quark_prime
#                                     squark -> squark_prime + Higgs
#                                     squark -> gluino  + quark
#   are included.
#
# - The multi-body decays for the inos, stops and sbottoms are included.
#
# - The loop induced decays for the gluino, neutralinos and stops
#   are included.
#
# - The SUSY decays of the top quark are included.
#
#
#         PDG            Width
DECAY         6     1.44401423E+00   # top decays
#          BR         NDA      ID1       ID2
     1.00000000E+00    2           5        24   # BR(t ->  b    W+)
#
#         PDG            Width
DECAY   1000021     2.94784246E+01   # gluino decays
#          BR         NDA      ID1       ID2
     1.83312714E-01    2     2000001        -1   # BR(~g -> ~d_R  db)
     1.83312714E-01    2    -2000001         1   # BR(~g -> ~d_R* d )
     1.83312714E-01    2     2000003        -3   # BR(~g -> ~s_R  sb)
     1.83312714E-01    2    -2000003         3   # BR(~g -> ~s_R* s )
     1.23666576E-01    2     1000005        -5   # BR(~g -> ~b_1  bb)
     1.23666576E-01    2    -1000005         5   # BR(~g -> ~b_1* b )
     1.56607481E-04    2     2000005        -5   # BR(~g -> ~b_2  bb)
     1.56607481E-04    2    -2000005         5   # BR(~g -> ~b_2* b )
     9.55138873E-03    2     1000006        -6   # BR(~g -> ~t_1  tb)
     9.55138873E-03    2    -1000006         6   # BR(~g -> ~t_1* t )
#
#         PDG            Width
DECAY   1000006     6.30994971E+01   # stop1 decays
#          BR         NDA      ID1       ID2
     2.51587315E-01    2     1000022         6   # BR(~t_1 -> ~chi_10 t )
     2.59534102E-01    2     1000023         6   # BR(~t_1 -> ~chi_20 t )
     6.17750596E-03    2     1000025         6   # BR(~t_1 -> ~chi_30 t )
     4.71030169E-01    2     1000024         5   # BR(~t_1 -> ~chi_1+ b )
     1.16612593E-02    2     1000037         5   # BR(~t_1 -> ~chi_2+ b )
     9.64894859E-06    2     1000005        24   # BR(~t_1 -> ~b_1    W+)
#
#         PDG            Width
DECAY   2000006     6.92016993E+01   # stop2 decays
#          BR         NDA      ID1       ID2
     2.44975500E-01    2     1000022         6   # BR(~t_2 -> ~chi_10 t )
     2.51062791E-01    2     1000023         6   # BR(~t_2 -> ~chi_20 t )
     9.96119299E-02    2     1000025         6   # BR(~t_2 -> ~chi_30 t )
     1.18121001E-01    2     1000024         5   # BR(~t_2 -> ~chi_1+ b )
     1.94694527E-01    2     1000037         5   # BR(~t_2 -> ~chi_2+ b )
     3.25839178E-02    2     1000006        25   # BR(~t_2 -> ~t_1    h )
     5.86298668E-02    2     1000006        23   # BR(~t_2 -> ~t_1    Z )
     3.20465671E-04    2     1000005        24   # BR(~t_2 -> ~b_1    W+)
#
#         PDG            Width
DECAY   1000005     8.95504497E+00   # sbottom1 decays
#          BR         NDA      ID1       ID2
     2.55021686E-01    2     1000022         5   # BR(~b_1 -> ~chi_10 b )
     2.48517209E-01    2     1000023         5   # BR(~b_1 -> ~chi_20 b )
     9.22296701E-06    2     1000025         5   # BR(~b_1 -> ~chi_30 b )
     4.96434272E-01    2    -1000024         6   # BR(~b_1 -> ~chi_1- t )
     1.76098280E-05    2    -1000037         6   # BR(~b_1 -> ~chi_2- t )
#
#         PDG            Width
DECAY   2000005     6.69668958E+01   # sbottom2 decays
#          BR         NDA      ID1       ID2
     4.34903652E-02    2     1000022         5   # BR(~b_2 -> ~chi_10 b )
     4.22769914E-02    2     1000023         5   # BR(~b_2 -> ~chi_20 b )
     1.03201873E-01    2     1000025         5   # BR(~b_2 -> ~chi_30 b )
     5.13781159E-01    2    -1000024         6   # BR(~b_2 -> ~chi_1- t )
     2.11723047E-01    2    -1000037         6   # BR(~b_2 -> ~chi_2- t )
     1.66519463E-04    2     1000005        25   # BR(~b_2 -> ~b_1    h )
     1.61207384E-04    2     1000005        23   # BR(~b_2 -> ~b_1    Z )
     8.51988375E-02    2     1000006       -24   # BR(~b_2 -> ~t_1    W-)
#
#         PDG            Width
DECAY   1000002     7.64708568E+01   # sup_L decays
#          BR         NDA      ID1       ID2
     6.79451709E-04    2     1000022         2   # BR(~u_L -> ~chi_10 u)
     3.14065354E-04    2     1000023         2   # BR(~u_L -> ~chi_20 u)
     1.39412204E-01    2     1000025         2   # BR(~u_L -> ~chi_30 u)
     1.16787056E-03    2     1000035         2   # BR(~u_L -> ~chi_40 u)
     3.52315088E-03    2     1000024         1   # BR(~u_L -> ~chi_1+ d)
     2.77537381E-01    2     1000037         1   # BR(~u_L -> ~chi_2+ d)
     5.77365877E-01    2     1000021         2   # BR(~u_L -> ~g      u)
#
#         PDG            Width
DECAY   2000002     5.36158851E+01   # sup_R decays
#          BR         NDA      ID1       ID2
     1.85340025E-05    2     1000022         2   # BR(~u_R -> ~chi_10 u)
     2.18223700E-05    2     1000023         2   # BR(~u_R -> ~chi_20 u)
     7.92566161E-08    2     1000025         2   # BR(~u_R -> ~chi_30 u)
     3.13567122E-02    2     1000035         2   # BR(~u_R -> ~chi_40 u)
     9.68602852E-01    2     1000021         2   # BR(~u_R -> ~g      u)
#
#         PDG            Width
DECAY   1000001     7.64880319E+01   # sdown_L decays
#          BR         NDA      ID1       ID2
     5.89923113E-04    2     1000022         1   # BR(~d_L -> ~chi_10 d)
     2.49407456E-04    2     1000023         1   # BR(~d_L -> ~chi_20 d)
     1.39513633E-01    2     1000025         1   # BR(~d_L -> ~chi_30 d)
     1.17776684E-03    2     1000035         1   # BR(~d_L -> ~chi_40 d)
     1.51131905E-04    2    -1000024         2   # BR(~d_L -> ~chi_1- u)
     2.80259314E-01    2    -1000037         2   # BR(~d_L -> ~chi_2- u)
     5.78058824E-01    2     1000021         1   # BR(~d_L -> ~g      d)
#
#         PDG            Width
DECAY   2000001     5.54388724E-04   # sdown_R decays
#           BR         NDA      ID1       ID2
     2.46977473E-01    2     1000022         1   # BR(~d_R -> ~chi_10 d)
     2.90570253E-01    2     1000023         1   # BR(~d_R -> ~chi_20 d)
#           BR         NDA      ID1       ID2       ID3
     5.04826285E-02    3        1       -11        1000011   # BR(~d_R -> d  e+  ~e_L-)
     1.08524934E-02    3        1       11        -1000011   # BR(~d_R -> d  e-  ~e_L+)
     2.12432171E-03    3        1       -11        2000011   # BR(~d_R -> d  e+  ~e_R-)
     5.50931119E-03    3        1       11        -2000011   # BR(~d_R -> d  e-  ~e_R+)
     5.12654727E-02    3        1       -12        1000012   # BR(~d_R -> d  nu_eb  ~nu_eL)
     1.12500484E-02    3        1       12        -1000012   # BR(~d_R -> d  nu_e  ~nu_eL*)
     4.98873783E-02    3        1       -13        1000013   # BR(~d_R -> d  mu+  ~mu_L-)
     1.08602497E-02    3        1       13        -1000013   # BR(~d_R -> d  mu-  ~mu_L+)
     2.17374551E-03    3        1       -13        2000013   # BR(~d_R -> d  mu+  ~mu_R-)
     5.62691820E-03    3        1       13        -2000013   # BR(~d_R -> d  mu-  ~mu_R+)
     5.07369627E-02    3        1       -14        1000014   # BR(~d_R -> d  nu_mub  ~nu_muL)
     1.11652704E-02    3        1       14        -1000014   # BR(~d_R -> d  nu_mu  ~nu_muL*)
     2.86279271E-02    3        1       23        1000022   # BR(~d_R -> d  Z  ~chi_10)
     1.97929711E-02    3        1       25        1000022   # BR(~d_R -> d  h  ~chi_10)
     2.07778396E-02    3        1       23        1000023   # BR(~d_R -> d  Z  ~chi_20)
     2.86676105E-02    3        1       25        1000023   # BR(~d_R -> d  h  ~chi_20)
     5.14007568E-06    3        1       23        1000025   # BR(~d_R -> d  Z  ~chi_30)
     1.85808252E-05    3        1       25        1000025   # BR(~d_R -> d  h  ~chi_30)
     1.51695005E-02    3        1       -24        1000024   # BR(~d_R -> d  W-  ~chi_1+)
     8.74097865E-02    3        1       24        -1000024   # BR(~d_R -> d  W+  ~chi_1-)
     6.22054501E-06    3        1       -24        1000037   # BR(~d_R -> d  W-  ~chi_2+)
     4.18965953E-05    3        1       24        -1000037   # BR(~d_R -> d  W+  ~chi_2-)
#
#         PDG            Width
DECAY   1000004     6.73847547E+01   # scharm_L decays
#          BR         NDA      ID1       ID2
     8.08772755E-04    2     1000022         4   # BR(~c_L -> ~chi_10 c)
     3.73828965E-04    2     1000023         4   # BR(~c_L -> ~chi_20 c)
     1.65027058E-01    2     1000025         4   # BR(~c_L -> ~chi_30 c)
     1.35554466E-03    2     1000035         4   # BR(~c_L -> ~chi_40 c)
     4.19365776E-03    2     1000024         3   # BR(~c_L -> ~chi_1+ s)
     3.28530448E-01    2     1000037         3   # BR(~c_L -> ~chi_2+ s)
     4.99710690E-01    2     1000021         4   # BR(~c_L -> ~g      c)
#
#         PDG            Width
DECAY   2000004     4.13317743E+01   # scharm_R decays
#          BR         NDA      ID1       ID2
     2.51990189E-05    2     1000022         4   # BR(~c_R -> ~chi_10 c)
     2.96689277E-05    2     1000023         4   # BR(~c_R -> ~chi_20 c)
     1.07184560E-07    2     1000025         4   # BR(~c_R -> ~chi_30 c)
     4.16730886E-02    2     1000035         4   # BR(~c_R -> ~chi_40 c)
     9.58271936E-01    2     1000021         4   # BR(~c_R -> ~g      c)
#
#         PDG            Width
DECAY   1000003     6.73833831E+01   # sstrange_L decays
#          BR         NDA      ID1       ID2
     7.02372032E-04    2     1000022         3   # BR(~s_L -> ~chi_10 s)
     2.96938311E-04    2     1000023         3   # BR(~s_L -> ~chi_20 s)
     1.65186946E-01    2     1000025         3   # BR(~s_L -> ~chi_30 s)
     1.36739058E-03    2     1000035         3   # BR(~s_L -> ~chi_40 s)
     1.79937431E-04    2    -1000024         4   # BR(~s_L -> ~chi_1- c)
     3.31832224E-01    2    -1000037         4   # BR(~s_L -> ~chi_2- c)
     5.00434191E-01    2     1000021         3   # BR(~s_L -> ~g      s)
#
#         PDG            Width
DECAY   2000003     5.56510679E-04   # sstrange_R decays
#           BR         NDA      ID1       ID2
     2.47816452E-01    2     1000022         3   # BR(~s_R -> ~chi_10 s)
     2.91546143E-01    2     1000023         3   # BR(~s_R -> ~chi_20 s)
#           BR         NDA      ID1       ID2       ID3
     5.02901401E-02    3        3       -11        1000011   # BR(~s_R -> s  e+  ~e_L-)
     1.08111133E-02    3        3       11        -1000011   # BR(~s_R -> s  e-  ~e_L+)
     2.11622174E-03    3        3       -11        2000011   # BR(~s_R -> s  e+  ~e_R-)
     5.48830438E-03    3        3       11        -2000011   # BR(~s_R -> s  e-  ~e_R+)
     5.10699993E-02    3        3       -12        1000012   # BR(~s_R -> s  nu_eb  ~nu_eL)
     1.12071524E-02    3        3       12        -1000012   # BR(~s_R -> s  nu_e  ~nu_eL*)
     4.96971595E-02    3        3       -13        1000013   # BR(~s_R -> s  mu+  ~mu_L-)
     1.08188400E-02    3        3       13        -1000013   # BR(~s_R -> s  mu-  ~mu_L+)
     2.16545710E-03    3        3       -13        2000013   # BR(~s_R -> s  mu+  ~mu_R-)
     5.55389162E-03    3        3       13        -2000013   # BR(~s_R -> s  mu-  ~mu_R+)
     5.05435045E-02    3        3       -14        1000014   # BR(~s_R -> s  nu_mub  ~nu_muL)
     1.11226976E-02    3        3       14        -1000014   # BR(~s_R -> s  nu_mu  ~nu_muL*)
     2.85187699E-02    3        3       23        1000022   # BR(~s_R -> s  Z  ~chi_10)
     1.97175012E-02    3        3       25        1000022   # BR(~s_R -> s  h  ~chi_10)
     2.06986145E-02    3        3       23        1000023   # BR(~s_R -> s  Z  ~chi_20)
     2.85583019E-02    3        3       25        1000023   # BR(~s_R -> s  h  ~chi_20)
     5.12065645E-06    3        3       23        1000025   # BR(~s_R -> s  Z  ~chi_30)
     1.85099772E-05    3        3       25        1000025   # BR(~s_R -> s  h  ~chi_30)
     1.51116597E-02    3        3       -24        1000024   # BR(~s_R -> s  W-  ~chi_1+)
     8.70764961E-02    3        3       24        -1000024   # BR(~s_R -> s  W+  ~chi_1-)
     6.19664659E-06    3        3       -24        1000037   # BR(~s_R -> s  W-  ~chi_2+)
     4.17530173E-05    3        3       24        -1000037   # BR(~s_R -> s  W+  ~chi_2-)
#
#         PDG            Width
DECAY   1000011     8.87477275E-03   # selectron_L decays
#          BR         NDA      ID1       ID2
     5.95609183E-01    2     1000022        11   # BR(~e_L -> ~chi_10 e-)
     2.89473060E-01    2     1000023        11   # BR(~e_L -> ~chi_20 e-)
     1.14917757E-01    2    -1000024        12   # BR(~e_L -> ~chi_1- nu_e)
#
#         PDG            Width
DECAY   2000011     2.18608440E-03   # selectron_R decays
#           BR         NDA      ID1       ID2
     3.82012198E-01    2     1000022        11   # BR(~e_R -> ~chi_10 e-)
     4.48861441E-01    2     1000023        11   # BR(~e_R -> ~chi_20 e-)
#           BR         NDA      ID1       ID2       ID3
     1.65716384E-02    3        11       -11        1000011   # BR(~e_R- -> e-  e+  ~e_L-)
     1.67386035E-03    3        11       11        -1000011   # BR(~e_R- -> e-  e-  ~e_L+)
     1.65739255E-02    3        11       -12        1000012   # BR(~e_R- -> e-  nu_eb  ~nu_eL)
     2.01094707E-03    3        11       12        -1000012   # BR(~e_R- -> e-  nu_e  ~nu_eL*)
     1.64783208E-02    3        11       -13        1000013   # BR(~e_R- -> e-  mu+  ~mu_L-)
     1.68136235E-03    3        11       13        -1000013   # BR(~e_R- -> e-  mu-  ~mu_L+)
     1.65469366E-02    3        11       -14        1000014   # BR(~e_R- -> e-  nu_mub  ~nu_muL)
     2.04484329E-03    3        11       14        -1000014   # BR(~e_R- -> e-  nu_mu  ~nu_muL*)
     1.29564989E-02    3        11       23        1000022   # BR(~e_R- -> e-  Z  ~chi_10)
     8.93332390E-03    3        11       25        1000022   # BR(~e_R- -> e-  h  ~chi_10)
     8.74119957E-03    3        11       23        1000023   # BR(~e_R- -> e-  Z  ~chi_20)
     1.39043122E-02    3        11       25        1000023   # BR(~e_R- -> e-  h  ~chi_20)
     2.28234555E-09    3        11       23        1000025   # BR(~e_R- -> e-  Z  ~chi_30)
     2.83319346E-09    3        11       25        1000025   # BR(~e_R- -> e-  h  ~chi_30)
     3.46752395E-03    3        11       -24        1000024   # BR(~e_R- -> e-  W-  ~chi_1+)
     4.75416229E-02    3        11       24        -1000024   # BR(~e_R- -> e-  W+  ~chi_1-)
     1.46641182E-08    3        11       -24        1000037   # BR(~e_R- -> e-  W-  ~chi_2+)
     2.53983789E-08    3        11       24        -1000037   # BR(~e_R- -> e-  W+  ~chi_2-)
#
#         PDG            Width
DECAY   1000013     8.87477140E-03   # smuon_L decays
#          BR         NDA      ID1       ID2
     5.95609172E-01    2     1000022        13   # BR(~mu_L -> ~chi_10 mu-)
     2.89473054E-01    2     1000023        13   # BR(~mu_L -> ~chi_20 mu-)
     1.14917774E-01    2    -1000024        14   # BR(~mu_L -> ~chi_1- nu_mu)
#
#         PDG            Width
DECAY   2000013     2.18592067E-03   # smuon_R decays
#           BR         NDA      ID1       ID2
     3.82040806E-01    2     1000022        13   # BR(~mu_R -> ~chi_10 mu-)
     4.48895053E-01    2     1000023        13   # BR(~mu_R -> ~chi_20 mu-)
#           BR         NDA      ID1       ID2       ID3
     1.65728795E-02    3        13       -11        1000011   # BR(~mu_R- -> mu-  e+  ~e_L-)
     1.68148829E-03    3        13       11        -1000011   # BR(~mu_R- -> mu-  e-  ~e_L+)
     1.65751670E-02    3        13       -12        1000012   # BR(~mu_R- -> mu-  nu_eb  ~nu_eL)
     2.00556226E-03    3        13       12        -1000012   # BR(~mu_R- -> mu-  nu_e  ~nu_eL*)
     1.64795550E-02    3        13       -13        1000013   # BR(~mu_R- -> mu-  mu+  ~mu_L-)
     1.67398573E-03    3        13       13        -1000013   # BR(~mu_R- -> mu-  mu-  ~mu_L+)
     1.63711340E-02    3        13       -14        1000014   # BR(~mu_R- -> mu-  nu_mub  ~nu_muL)
     2.04499645E-03    3        13       14        -1000014   # BR(~mu_R- -> mu-  nu_mu  ~nu_muL*)
     1.29615866E-02    3        13       23        1000022   # BR(~mu_R- -> mu-  Z  ~chi_10)
     8.93399303E-03    3        13       25        1000022   # BR(~mu_R- -> mu-  h  ~chi_10)
     8.74185431E-03    3        13       23        1000023   # BR(~mu_R- -> mu-  Z  ~chi_20)
     1.39053537E-02    3        13       25        1000023   # BR(~mu_R- -> mu-  h  ~chi_20)
     2.28256225E-09    3        13       23        1000025   # BR(~mu_R- -> mu-  Z  ~chi_30)
     2.82434770E-09    3        13       25        1000025   # BR(~mu_R- -> mu-  h  ~chi_30)
     3.47986096E-03    3        13       -24        1000024   # BR(~mu_R- -> mu-  W-  ~chi_1+)
     4.76366785E-02    3        13       24        -1000024   # BR(~mu_R- -> mu-  W+  ~chi_1-)
     1.46062025E-08    3        13       -24        1000037   # BR(~mu_R- -> mu-  W-  ~chi_2+)
     2.54007389E-08    3        13       24        -1000037   # BR(~mu_R- -> mu-  W+  ~chi_2-)
#
#         PDG            Width
DECAY   1000015     5.06998497E+00   # stau_1 decays
#          BR         NDA      ID1       ID2
     2.53295070E-01    2     1000022        15   # BR(~tau_1 -> ~chi_10  tau-)
     2.46952125E-01    2     1000023        15   # BR(~tau_1 -> ~chi_20  tau-)
     1.37276381E-05    2     1000025        15   # BR(~tau_1 -> ~chi_30  tau-)
     4.99712707E-01    2    -1000024        16   # BR(~tau_1 -> ~chi_1-  nu_tau)
     2.63701421E-05    2    -1000037        16   # BR(~tau_1 -> ~chi_2-  nu_tau)
#
#         PDG            Width
DECAY   2000015     2.15386870E+01   # stau_2 decays
#          BR         NDA      ID1       ID2
     7.66306474E-02    2     1000022        15   # BR(~tau_2 -> ~chi_10  tau-)
     7.39979435E-02    2     1000023        15   # BR(~tau_2 -> ~chi_20  tau-)
     2.81880847E-01    2     1000025        15   # BR(~tau_2 -> ~chi_30  tau-)
     3.39865870E-04    2    -1000024        16   # BR(~tau_2 -> ~chi_1-  nu_tau)
     5.66850092E-01    2    -1000037        16   # BR(~tau_2 -> ~chi_2-  nu_tau)
     1.51597596E-04    2     1000015        25   # BR(~tau_2 -> ~tau_1   h)
     1.49007038E-04    2     1000015        23   # BR(~tau_2 -> ~tau_1   Z)
#
#         PDG            Width
DECAY   1000012     2.75865167E-02   # snu_eL decays
#          BR         NDA      ID1       ID2
     1.21231811E-01    2     1000022        12   # BR(~nu_eL -> ~chi_10 nu_e)
     4.48205582E-02    2     1000023        12   # BR(~nu_eL -> ~chi_20 nu_e)
     8.33947630E-01    2     1000024        11   # BR(~nu_eL -> ~chi_1+ e-)
#
#         PDG            Width
DECAY   1000014     2.75865126E-02   # snu_muL decays
#          BR         NDA      ID1       ID2
     1.21231830E-01    2     1000022        14   # BR(~nu_muL -> ~chi_10 nu_mu)
     4.48205649E-02    2     1000023        14   # BR(~nu_muL -> ~chi_20 nu_mu)
     8.33947605E-01    2     1000024        13   # BR(~nu_muL -> ~chi_1+ mu-)
#
#         PDG            Width
DECAY   1000016     2.15707461E+01   # snu_tauL decays
#          BR         NDA      ID1       ID2
     1.33012178E-03    2     1000022        16   # BR(~nu_tauL -> ~chi_10 nu_tau)
     5.04320728E-04    2     1000023        16   # BR(~nu_tauL -> ~chi_20 nu_tau)
     2.81557368E-01    2     1000025        16   # BR(~nu_tauL -> ~chi_30 nu_tau)
     1.56505417E-01    2     1000024        15   # BR(~nu_tauL -> ~chi_1+ tau-)
     5.59812868E-01    2     1000037        15   # BR(~nu_tauL -> ~chi_2+ tau-)
     2.89904325E-04    2    -1000015       -24   # BR(~nu_tauL -> ~tau_1+ W-)
#
#         PDG            Width
DECAY   1000024     4.83160899E-11   # chargino1+ decays
#           BR         NDA      ID1       ID2       ID3
     3.74467975E-01    3     1000022         2        -1   # BR(~chi_1+ -> ~chi_10 u    db)
     3.74467975E-01    3     1000022         4        -3   # BR(~chi_1+ -> ~chi_10 c    sb)
     1.24856500E-01    3     1000022       -11        12   # BR(~chi_1+ -> ~chi_10 e+   nu_e)
     1.24856500E-01    3     1000022       -13        14   # BR(~chi_1+ -> ~chi_10 mu+  nu_mu)
     1.35104877E-03    3     1000022       -15        16   # BR(~chi_1+ -> ~chi_10 tau+ nu_tau)
#
#         PDG            Width
DECAY   1000037     2.32589149E+01   # chargino2+ decays
#          BR         NDA      ID1       ID2
     1.48109137E-01    2     1000012       -11   # BR(~chi_2+ -> ~nu_eL   e+  )
     1.48109137E-01    2     1000014       -13   # BR(~chi_2+ -> ~nu_muL mu+ )
     1.47863128E-01    2    -1000011        12   # BR(~chi_2+ -> ~e_L+    nu_e)
     1.47863128E-01    2    -1000013        14   # BR(~chi_2+ -> ~mu_L+   nu_mu)
     1.04024279E-01    2     1000024        23   # BR(~chi_2+ -> ~chi_1+  Z )
     1.00402165E-01    2     1000022        24   # BR(~chi_2+ -> ~chi_10  W+)
     1.02762748E-01    2     1000023        24   # BR(~chi_2+ -> ~chi_20  W+)
     1.00866279E-01    2     1000024        25   # BR(~chi_2+ -> ~chi_1+  h )
#
#         PDG            Width
DECAY   1000022     0.00000000E+00   # neutralino1 decays
#
#         PDG            Width
DECAY   1000023     3.37997539E-09   # neutralino2 decays
#          BR         NDA      ID1       ID2
     5.85028009E-02    2     1000022        22   # BR(~chi_20 -> ~chi_10 gam)
#           BR         NDA      ID1       ID2       ID3
     1.13835869E-01    3     1000022        -2         2   # BR(~chi_20 -> ~chi_10 ub      u)
     1.47708773E-01    3     1000022        -1         1   # BR(~chi_20 -> ~chi_10 db      d)
     1.13835869E-01    3     1000022        -4         4   # BR(~chi_20 -> ~chi_10 cb      c)
     1.47708773E-01    3     1000022        -3         3   # BR(~chi_20 -> ~chi_10 sb      s)
     3.38901070E-02    3     1000022       -11        11   # BR(~chi_20 -> ~chi_10 e+      e-)
     3.38901070E-02    3     1000022       -13        13   # BR(~chi_20 -> ~chi_10 mu+     mu-)
     1.10604228E-02    3     1000022       -15        15   # BR(~chi_20 -> ~chi_10 tau+    tau-)
     6.77819798E-02    3     1000022       -12        12   # BR(~chi_20 -> ~chi_10 nu_eb   nu_e)
     6.77819798E-02    3     1000022       -14        14   # BR(~chi_20 -> ~chi_10 nu_mub  nu_mu)
     6.77724540E-02    3     1000022       -16        16   # BR(~chi_20 -> ~chi_10 nu_taub nu_tau)
     2.50776366E-02    3     1000024        -2         1   # BR(~chi_20 -> ~chi_1+ ub      d)
     2.50776366E-02    3    -1000024        -1         2   # BR(~chi_20 -> ~chi_1- db      u)
     2.50776366E-02    3     1000024        -4         3   # BR(~chi_20 -> ~chi_1+ cb      s)
     2.50776366E-02    3    -1000024        -3         4   # BR(~chi_20 -> ~chi_1- sb      c)
     8.36006100E-03    3     1000024       -12        11   # BR(~chi_20 -> ~chi_1+ nu_eb   e-)
     8.36006100E-03    3    -1000024        12       -11   # BR(~chi_20 -> ~chi_1- nu_e    e+)
     8.36006100E-03    3     1000024       -14        13   # BR(~chi_20 -> ~chi_1+ nu_mub  mu-)
     8.36006100E-03    3    -1000024        14       -13   # BR(~chi_20 -> ~chi_1- nu_mu   mu+)
     1.24003634E-03    3     1000024       -16        15   # BR(~chi_20 -> ~chi_1+ nu_taub tau-)
     1.24003634E-03    3    -1000024        16       -15   # BR(~chi_20 -> ~chi_1- nu_tau  tau+)
#
#         PDG            Width
DECAY   1000025     2.32559602E+01   # neutralino3 decays
#          BR         NDA      ID1       ID2
     3.10090921E-02    2     1000022        23   # BR(~chi_30 -> ~chi_10   Z )
     7.28934200E-02    2     1000023        23   # BR(~chi_30 -> ~chi_20   Z )
     1.02424756E-01    2     1000024       -24   # BR(~chi_30 -> ~chi_1+   W-)
     1.02424756E-01    2    -1000024        24   # BR(~chi_30 -> ~chi_1-   W+)
     6.91885602E-02    2     1000022        25   # BR(~chi_30 -> ~chi_10   h )
     3.01605728E-02    2     1000023        25   # BR(~chi_30 -> ~chi_20   h )
     7.34999950E-02    2     1000011       -11   # BR(~chi_30 -> ~e_L-     e+)
     7.34999950E-02    2    -1000011        11   # BR(~chi_30 -> ~e_L+     e-)
     7.34999950E-02    2     1000013       -13   # BR(~chi_30 -> ~mu_L-    mu+)
     7.34999950E-02    2    -1000013        13   # BR(~chi_30 -> ~mu_L+    mu-)
     7.44747159E-02    2     1000012       -12   # BR(~chi_30 -> ~nu_eL    nu_eb)
     7.44747159E-02    2    -1000012        12   # BR(~chi_30 -> ~nu_eL*   nu_e )
     7.44747159E-02    2     1000014       -14   # BR(~chi_30 -> ~nu_muL   nu_mub)
     7.44747159E-02    2    -1000014        14   # BR(~chi_30 -> ~nu_muL*  nu_mu )
#
#         PDG            Width
DECAY   1000035     4.11449347E+01   # neutralino4 decays
#          BR         NDA      ID1       ID2
     2.04022488E-02    2     1000022        23   # BR(~chi_40 -> ~chi_10   Z )
     1.82624765E-02    2     1000023        23   # BR(~chi_40 -> ~chi_20   Z )
     1.04204921E-04    2     1000025        23   # BR(~chi_40 -> ~chi_30   Z )
     3.76043478E-02    2     1000024       -24   # BR(~chi_40 -> ~chi_1+   W-)
     3.76043478E-02    2    -1000024        24   # BR(~chi_40 -> ~chi_1-   W+)
     1.18454222E-04    2     1000037       -24   # BR(~chi_40 -> ~chi_2+   W-)
     1.18454222E-04    2    -1000037        24   # BR(~chi_40 -> ~chi_2-   W+)
     1.92421609E-02    2     1000022        25   # BR(~chi_40 -> ~chi_10   h )
     2.26820400E-02    2     1000023        25   # BR(~chi_40 -> ~chi_20   h )
     1.90932605E-05    2     1000025        25   # BR(~chi_40 -> ~chi_30   h )
     1.23726147E-02    2     2000001        -1   # BR(~chi_40 -> ~d_R      db)
     1.23726147E-02    2    -2000001         1   # BR(~chi_40 -> ~d_R*     d )
     1.23726147E-02    2     2000003        -3   # BR(~chi_40 -> ~s _R      sb)
     1.23726147E-02    2    -2000003         3   # BR(~chi_40 -> ~s _R*     s )
     4.36375088E-03    2     1000006        -6   # BR(~chi_40 -> ~t_1      tb)
     4.36375088E-03    2    -1000006         6   # BR(~chi_40 -> ~t_1*     t )
     7.74572427E-03    2     1000005        -5   # BR(~chi_40 -> ~b_1      bb)
     7.74572427E-03    2    -1000005         5   # BR(~chi_40 -> ~b_1*     b )
     6.65358148E-07    2     2000005        -5   # BR(~chi_40 -> ~b_2      bb)
     6.65358148E-07    2    -2000005         5   # BR(~chi_40 -> ~b_2*     b )
     4.00334144E-02    2     1000011       -11   # BR(~chi_40 -> ~e_L-     e+)
     4.00334144E-02    2    -1000011        11   # BR(~chi_40 -> ~e_L+     e-)
     9.54841588E-02    2     2000011       -11   # BR(~chi_40 -> ~e_R-     e+)
     9.54841588E-02    2    -2000011        11   # BR(~chi_40 -> ~e_R+     e-)
     4.00334144E-02    2     1000013       -13   # BR(~chi_40 -> ~mu_L-    mu+)
     4.00334144E-02    2    -1000013        13   # BR(~chi_40 -> ~mu_L+    mu-)
     9.54841588E-02    2     2000013       -13   # BR(~chi_40 -> ~mu_R-    mu+)
     9.54841588E-02    2    -2000013        13   # BR(~chi_40 -> ~mu_R+    mu-)
     3.22981361E-02    2     1000015       -15   # BR(~chi_40 -> ~tau_1-   tau+)
     3.22981361E-02    2    -1000015        15   # BR(~chi_40 -> ~tau_1+   tau-)
     6.51285693E-04    2     2000015       -15   # BR(~chi_40 -> ~tau_2-   tau+)
     6.51285693E-04    2    -2000015        15   # BR(~chi_40 -> ~tau_2+   tau-)
     4.02080721E-02    2     1000012       -12   # BR(~chi_40 -> ~nu_eL    nu_eb)
     4.02080721E-02    2    -1000012        12   # BR(~chi_40 -> ~nu_eL*   nu_e )
     4.02080721E-02    2     1000014       -14   # BR(~chi_40 -> ~nu_muL   nu_mub)
     4.02080721E-02    2    -1000014        14   # BR(~chi_40 -> ~nu_muL*  nu_mu )
     6.65003589E-04    2     1000016       -16   # BR(~chi_40 -> ~nu_tau1  nu_taub)
     6.65003589E-04    2    -1000016        16   # BR(~chi_40 -> ~nu_tau1* nu_tau )
#
#         PDG            Width
DECAY        25     4.21654694E-03   # h decays
#          BR         NDA      ID1       ID2
     5.88692359E-01    2           5        -5   # BR(h -> b       bb     )
     6.20712353E-02    2         -15        15   # BR(h -> tau+    tau-   )
     2.19687684E-04    2         -13        13   # BR(h -> mu+     mu-    )
     2.39489443E-04    2           3        -3   # BR(h -> s       sb     )
     2.06831563E-02    2           4        -4   # BR(h -> c       cb     )
     7.72722284E-02    2          21        21   # BR(h -> g       g      )
     2.29838796E-03    2          22        22   # BR(h -> gam     gam    )
     1.59900712E-03    2          22        23   # BR(h -> Z       gam    )
     2.19223415E-01    2          24       -24   # BR(h -> W+      W-     )
     2.77010340E-02    2          23        23   # BR(h -> Z       Z      )
#
#         PDG            Width
DECAY        35     5.72376462E+01   # H decays
#          BR         NDA      ID1       ID2
     3.87439648E-01    2           5        -5   # BR(H -> b       bb     )
     7.08182813E-02    2         -15        15   # BR(H -> tau+    tau-   )
     2.41389857E-04    2         -13        13   # BR(H -> mu+     mu-    )
     1.52620300E-04    2           3        -3   # BR(H -> s       sb     )
     3.68560298E-08    2           4        -4   # BR(H -> c       cb     )
     3.62670101E-03    2           6        -6   # BR(H -> t       tb     )
     3.42722550E-06    2          21        21   # BR(H -> g       g      )
     3.06076176E-08    2          22        22   # BR(H -> gam     gam    )
     2.22958788E-09    2          23        22   # BR(H -> Z       gam    )
     1.53243963E-06    2          24       -24   # BR(H -> W+      W-     )
     7.64638968E-07    2          23        23   # BR(H -> Z       Z      )
     5.73840854E-06    2          25        25   # BR(H -> h       h      )
     4.54993843E-03    2     1000024  -1000024   # BR(H -> ~chi_1+ ~chi_1-)
     4.17920563E-05    2     1000037  -1000037   # BR(H -> ~chi_2+ ~chi_2-)
     1.75036052E-01    2     1000024  -1000037   # BR(H -> ~chi_1+ ~chi_2-)
     1.75036052E-01    2     1000037  -1000024   # BR(H -> ~chi_2+ ~chi_1-)
     6.29880518E-04    2     1000022   1000022   # BR(H -> ~chi_10 ~chi_10)
     2.76960135E-04    2     1000023   1000023   # BR(H -> ~chi_20 ~chi_20)
     2.10091554E-05    2     1000025   1000025   # BR(H -> ~chi_30 ~chi_30)
     6.53459875E-05    2     1000022   1000023   # BR(H -> ~chi_10 ~chi_20)
     7.72588326E-02    2     1000022   1000025   # BR(H -> ~chi_10 ~chi_30)
     3.85646695E-03    2     1000022   1000035   # BR(H -> ~chi_10 ~chi_40)
     9.87154421E-02    2     1000023   1000025   # BR(H -> ~chi_20 ~chi_30)
     2.21986119E-03    2     1000023   1000035   # BR(H -> ~chi_20 ~chi_40)
     2.36306714E-07    2     1000011  -1000011   # BR(H -> ~e_L-   ~e_L+  )
     8.94494101E-08    2     2000011  -2000011   # BR(H -> ~e_R-   ~e_R+  )
     2.36306714E-07    2     1000013  -1000013   # BR(H -> ~mu_L-  ~mu_L+ )
     8.94494101E-08    2     2000013  -2000013   # BR(H -> ~mu_R-  ~mu_R+ )
     7.70901861E-07    2     1000012  -1000012   # BR(H -> ~nu_eL  ~nu_eL*   )
     7.70901861E-07    2     1000014  -1000014   # BR(H -> ~nu_muL ~nu_muL*  )
#
#         PDG            Width
DECAY        36     5.72387617E+01   # A decays
#          BR         NDA      ID1       ID2
     3.87452789E-01    2           5        -5   # BR(A -> b       bb     )
     7.08172991E-02    2         -15        15   # BR(A -> tau+    tau-   )
     2.41386244E-04    2         -13        13   # BR(A -> mu+     mu-    )
     1.52635387E-04    2           3        -3   # BR(A -> s       sb     )
     3.70279305E-08    2           4        -4   # BR(A -> c       cb     )
     3.63776324E-03    2           6        -6   # BR(A -> t       tb     )
     1.85294780E-05    2          21        21   # BR(A -> g       g      )
     6.67862565E-08    2          22        22   # BR(A -> gam     gam    )
     1.55669454E-08    2          23        22   # BR(A -> Z       gam    )
     1.55309801E-06    2          23        25   # BR(A -> Z       h      )
     4.77658299E-03    2     1000024  -1000024   # BR(A -> ~chi_1+ ~chi_1-)
     1.96698524E-04    2     1000037  -1000037   # BR(A -> ~chi_2+ ~chi_2-)
     1.74837120E-01    2     1000024  -1000037   # BR(A -> ~chi_1+ ~chi_2-)
     1.74837120E-01    2     1000037  -1000024   # BR(A -> ~chi_2+ ~chi_1-)
     7.49427978E-04    2     1000022   1000022   # BR(A -> ~chi_10 ~chi_10)
     2.39148487E-04    2     1000023   1000023   # BR(A -> ~chi_20 ~chi_20)
     9.84228936E-05    2     1000025   1000025   # BR(A -> ~chi_30 ~chi_30)
     3.16864454E-05    2     1000022   1000023   # BR(A -> ~chi_10 ~chi_20)
     1.00340251E-01    2     1000022   1000025   # BR(A -> ~chi_10 ~chi_30)
     2.30537912E-03    2     1000022   1000035   # BR(A -> ~chi_10 ~chi_40)
     7.54949889E-02    2     1000023   1000025   # BR(A -> ~chi_20 ~chi_30)
     3.77109862E-03    2     1000023   1000035   # BR(A -> ~chi_20 ~chi_40)
#
#         PDG            Width
DECAY        37     5.62656399E+01   # H+ decays
#          BR         NDA      ID1       ID2
     6.34050199E-04    2           4        -5   # BR(H+ -> c       bb     )
     7.20703866E-02    2         -15        16   # BR(H+ -> tau+    nu_tau )
     2.45657489E-04    2         -13        14   # BR(H+ -> mu+     nu_mu  )
     6.34049481E-06    2           2        -5   # BR(H+ -> u       bb     )
     7.76877805E-06    2           2        -3   # BR(H+ -> u       sb     )
     1.52949268E-04    2           4        -3   # BR(H+ -> c       sb     )
     3.80365011E-01    2           6        -5   # BR(H+ -> t       bb     )
     1.58269780E-06    2          24        25   # BR(H+ -> W+      h      )
     7.24125113E-14    2          24        36   # BR(H+ -> W+      A      )
     4.83356821E-04    2     1000024   1000022   # BR(H+ -> ~chi_1+ ~chi_10)
     1.06659029E-03    2     1000024   1000023   # BR(H+ -> ~chi_1+ ~chi_20)
     1.78960873E-01    2     1000024   1000025   # BR(H+ -> ~chi_1+ ~chi_30)
     6.19253077E-03    2     1000024   1000035   # BR(H+ -> ~chi_1+ ~chi_40)
     1.82400993E-01    2     1000037   1000022   # BR(H+ -> ~chi_2+ ~chi_10)
     1.77410021E-01    2     1000037   1000023   # BR(H+ -> ~chi_2+ ~chi_20)
     6.48994587E-11    2     1000037   1000025   # BR(H+ -> ~chi_2+ ~chi_30)
     9.43816688E-07    2    -1000011   1000012   # BR(H+ -> ~e_L+   ~nu_eL )
     9.43816688E-07    2    -1000013   1000014   # BR(H+ -> ~mu_L+  ~nu_muL)
