#
#                              ======================
#                              | THE SUSYHIT OUTPUT |
#                              ======================
#
#
#              ------------------------------------------------------
#              |     This is the output of the SUSY-HIT package     |
#              |  created by A.Djouadi, M.Muehlleitner and M.Spira. |
#              |  In case of problems with SUSY-HIT email to        |
#              |           margarete.muehlleitner@cern.ch           |
#              |           michael.spira@psi.ch                     |
#              |           abdelhak.djouadi@cern.ch                 |
#              ------------------------------------------------------
#
#              ------------------------------------------------------
#              |  SUSY Les Houches Accord - MSSM Spectrum + Decays  |
#              |              based on the decay programs           |
#              |                                                    |
#              |                     SDECAY 1.3b                    |
#              |                                                    |
#              |  Authors: M.Muhlleitner, A.Djouadi and Y.Mambrini  |
#              |  Ref.:    Comput.Phys.Commun.168(2005)46           |
#              |           [hep-ph/0311167]                         |
#              |                                                    |
#              |                     HDECAY 3.4                     |
#              |                                                    |
#              |  By: A.Djouadi,J.Kalinowski,M.Muhlleitner,M.Spira  |
#              |  Ref.:    Comput.Phys.Commun.108(1998)56           |
#              |           [hep-ph/9704448]                         |
#              |                                                    |
#              |                                                    |
#              |  If not stated otherwise all DRbar couplings and   |
#              |  soft SUSY breaking masses are given at the scale  |
#              |  Q=  0.24145900E+04
#              |                                                    |
#              ------------------------------------------------------
#
#
BLOCK DCINFO  # Decay Program information
     1   SDECAY/HDECAY # decay calculator
     2   1.3b  /3.4    # version number
#
BLOCK SPINFO  # Spectrum calculator information
     1     SOFTSUSY    # spectrum calculator               
     2     3.4.0       # version number                    
#
BLOCK MODSEL  # Model selection
     1     0   #  nonUniversal                                     
#
BLOCK SMINPUTS  # Standard Model inputs
         1     1.27908970E+02   # alpha_em^-1(M_Z)^MSbar
         2     1.16637870E-05   # G_F [GeV^-2]
         3     1.18400000E-01   # alpha_S(M_Z)^MSbar
         4     9.11876000E+01   # M_Z pole mass
         5     4.18000000E+00   # mb(mb)^MSbar
         6     1.73200000E+02   # mt pole mass
         7     1.77700000E+00   # mtau pole mass
#
BLOCK MINPAR  # Input parameters - minimal models
         3     2.21700000E+01   # tanb                
#
BLOCK EXTPAR  # Input parameters - non-minimal models
         0    -1.00000000E+00   # Set                 
         1     1.09963000E+03   # M_1(MX)             
         2     4.15170000E+02   # M_2(MX)             
         3     3.02033000E+03   # M_3(MX)             
        11    -3.38815000E+03   # At(MX)              
        12    -2.54966000E+03   # Ab(MX)              
        13     1.74837000E+03   # Atau(MX)            
        23     2.44493000E+03   # mu(MX)              
        26     1.59454000E+03   # mA(pole)            
        31     1.64753000E+03   # meL(MX)             
        32     1.64753000E+03   # mmuL(MX)            
        33     1.39928000E+03   # mtauL(MX)           
        34     1.96603000E+03   # meR(MX)             
        35     1.96603000E+03   # mmuR(MX)            
        36     3.10321000E+03   # mtauR(MX)           
        41     9.05360000E+02   # mqL1(MX)            
        42     9.05360000E+02   # mqL2(MX)            
        43     1.47173000E+03   # mqL3(MX)            
        44     2.50920000E+02   # muR(MX)             
        45     2.50920000E+02   # mcR(MX)             
        46     3.95771000E+03   # mtR(MX)             
        47     3.34330000E+03   # mdR(MX)             
        48     3.34330000E+03   # msR(MX)             
        49     7.79810000E+02   # mbR(MX)             
#
BLOCK MASS  # Mass Spectrum
# PDG code           mass       particle
        24     8.03722554E+01   # W+
        25     1.25386023E+02   # h
        35     1.59448880E+03   # H
        36     1.59454000E+03   # A
        37     1.59658657E+03   # H+
         5     4.81876030E+00   # b-quark pole mass calculated from mb(mb)_Msbar
   1000001     1.03648023E+03   # ~d_L
   2000001     3.41462072E+03   # ~d_R
   1000002     1.03346780E+03   # ~u_L
   2000002     5.09251812E+02   # ~u_R
   1000003     1.03648023E+03   # ~s_L
   2000003     3.41462072E+03   # ~s_R
   1000004     1.03346780E+03   # ~c_L
   2000004     5.09251812E+02   # ~c_R
   1000005     9.05280009E+02   # ~b_1
   2000005     1.59498768E+03   # ~b_2
   1000006     1.59138429E+03   # ~t_1
   2000006     3.97552389E+03   # ~t_2
   1000011     1.65422218E+03   # ~e_L
   2000011     1.96689189E+03   # ~e_R
   1000012     1.65201492E+03   # ~nu_eL
   1000013     1.65422218E+03   # ~mu_L
   2000013     1.96689189E+03   # ~mu_R
   1000014     1.65201492E+03   # ~nu_muL
   1000015     1.40573017E+03   # ~tau_1
   2000015     3.10177018E+03   # ~tau_2
   1000016     1.40359150E+03   # ~nu_tauL
   1000021     3.06694811E+03   # ~g
   1000022     4.31360698E+02   # ~chi_10
   1000023     1.08263345E+03   # ~chi_20
   1000025    -2.46996585E+03   # ~chi_30
   1000035     2.47094708E+03   # ~chi_40
   1000024     4.31525871E+02   # ~chi_1+
   1000037     2.47163259E+03   # ~chi_2+
#
BLOCK NMIX  # Neutralino Mixing Matrix
  1  1    -6.21584123E-04   # N_11
  1  2     9.99433630E-01   # N_12
  1  3    -3.28696559E-02   # N_13
  1  4     7.18457674E-03   # N_14
  2  1     9.99695166E-01   # N_21
  2  2     1.42905867E-03   # N_22
  2  3     2.22114371E-02   # N_23
  2  4    -1.06857171E-02   # N_24
  3  1    -8.17004407E-03   # N_31
  3  2     1.81555509E-02   # N_32
  3  3     7.06763211E-01   # N_33
  3  4     7.07169986E-01   # N_34
  4  1    -2.32903137E-02   # N_41
  4  2     2.82975715E-02   # N_42
  4  3     7.06337031E-01   # N_43
  4  4    -7.06926310E-01   # N_44
#
BLOCK UMIX  # Chargino Mixing Matrix U
  1  1     9.98920663E-01   # U_11
  1  2    -4.64490025E-02   # U_12
  2  1     4.64490025E-02   # U_21
  2  2     9.98920663E-01   # U_22
#
BLOCK VMIX  # Chargino Mixing Matrix V
  1  1     9.99948450E-01   # V_11
  1  2    -1.01536653E-02   # V_12
  2  1     1.01536653E-02   # V_21
  2  2     9.99948450E-01   # V_22
#
BLOCK STOPMIX  # Stop Mixing Matrix
  1  1     9.99304366E-01   # cos(theta_t)
  1  2     3.72932178E-02   # sin(theta_t)
  2  1    -3.72932178E-02   # -sin(theta_t)
  2  2     9.99304366E-01   # cos(theta_t)
#
BLOCK SBOTMIX  # Sbottom Mixing Matrix
  1  1     6.43253123E-02   # cos(theta_b)
  1  2     9.97928983E-01   # sin(theta_b)
  2  1    -9.97928983E-01   # -sin(theta_b)
  2  2     6.43253123E-02   # cos(theta_b)
#
BLOCK STAUMIX  # Stau Mixing Matrix
  1  1     9.99928922E-01   # cos(theta_tau)
  1  2     1.19227072E-02   # sin(theta_tau)
  2  1    -1.19227072E-02   # -sin(theta_tau)
  2  2     9.99928922E-01   # cos(theta_tau)
#
BLOCK ALPHA  # Higgs mixing
          -4.72272308E-02   # Mixing angle in the neutral Higgs boson sector
#
BLOCK HMIX Q=  2.41459000E+03  # DRbar Higgs Parameters
         1     2.47445895E+03   # mu(Q)MSSM           
         2     2.12886706E+01   # tan                 
         3     2.43214049E+02   # higgs               
         4     3.24779940E+06   # mA^2(Q)MSSM         
#
BLOCK GAUGE Q=  2.41459000E+03  # The gauge couplings
     1     3.64225633E-01   # gprime(Q) DRbar
     2     6.40269074E-01   # g(Q) DRbar
     3     1.01912669E+00   # g3(Q) DRbar
#
BLOCK AU Q=  2.41459000E+03  # The trilinear couplings
  1  1     0.00000000E+00   # A_u(Q) DRbar
  2  2     0.00000000E+00   # A_c(Q) DRbar
  3  3    -3.38814999E+03   # A_t(Q) DRbar
#
BLOCK AD Q=  2.41459000E+03  # The trilinear couplings
  1  1     0.00000000E+00   # A_d(Q) DRbar
  2  2     0.00000000E+00   # A_s(Q) DRbar
  3  3    -2.54966000E+03   # A_b(Q) DRbar
#
BLOCK AE Q=  2.41459000E+03  # The trilinear couplings
  1  1     0.00000000E+00   # A_e(Q) DRbar
  2  2     0.00000000E+00   # A_mu(Q) DRbar
  3  3     1.74837000E+03   # A_tau(Q) DRbar
#
BLOCK Yu Q=  2.41459000E+03  # The Yukawa couplings
  1  1     0.00000000E+00   # y_u(Q) DRbar
  2  2     0.00000000E+00   # y_c(Q) DRbar
  3  3     8.17942958E-01   # y_t(Q) DRbar
#
BLOCK Yd Q=  2.41459000E+03  # The Yukawa couplings
  1  1     0.00000000E+00   # y_d(Q) DRbar
  2  2     0.00000000E+00   # y_s(Q) DRbar
  3  3     2.31028552E-01   # y_b(Q) DRbar
#
BLOCK Ye Q=  2.41459000E+03  # The Yukawa couplings
  1  1     0.00000000E+00   # y_e(Q) DRbar
  2  2     0.00000000E+00   # y_mu(Q) DRbar
  3  3     2.20641151E-01   # y_tau(Q) DRbar
#
BLOCK MSOFT Q=  2.41459000E+03  # The soft SUSY breaking masses at the scale Q
         1     1.09963000E+03   # M_1(Q)              
         2     4.15170000E+02   # M_2(Q)              
         3     3.02033000E+03   # M_3(Q)              
        21    -3.65415399E+06   # mH1^2(Q)            
        22    -6.14674881E+06   # mH2^2(Q)            
        31     1.64753000E+03   # meL(Q)              
        32     1.64753000E+03   # mmuL(Q)             
        33     1.39928000E+03   # mtauL(Q)            
        34     1.96603000E+03   # meR(Q)              
        35     1.96603000E+03   # mmuR(Q)             
        36     3.10321000E+03   # mtauR(Q)            
        41     9.05359978E+02   # mqL1(Q)             
        42     9.05359978E+02   # mqL2(Q)             
        43     1.47172997E+03   # mqL3(Q)             
        44     2.50919920E+02   # muR(Q)              
        45     2.50919920E+02   # mcR(Q)              
        46     3.95770998E+03   # mtR(Q)              
        47     3.34329999E+03   # mdR(Q)              
        48     3.34329999E+03   # msR(Q)              
        49     7.79809973E+02   # mbR(Q)              
#
Block HiggsBoundsInputHiggsCouplingsFermions
# ScalarNormEffCoupSq PseudoSNormEffCoupSq NP   IP1 IP2 IP2
    1.01231658E+00    0.00000000E+00        3  25   5   5  # h0-b-b eff. coupling^2, normalised to SM
    4.53195179E+02    0.00000000E+00        3  35   5   5  # H0-b-b eff. coupling^2, normalised to SM
    0.00000000E+00    4.53207496E+02        3  36   5   5  # A0-b-b eff. coupling^2, normalised to SM
#
    9.99972824E-01    0.00000000E+00        3  25   6   6  # h0-t-t eff. coupling^2, normalised to SM
    2.23367131E-03    0.00000000E+00        3  35   6   6  # H0-t-t eff. coupling^2, normalised to SM
    0.00000000E+00    2.20649484E-03        3  36   6   6  # A0-t-t eff. coupling^2, normalised to SM
#
    1.01231658E+00    0.00000000E+00        3  25  15  15  # h0-tau-tau eff. coupling^2, normalised to SM
    4.53195179E+02    0.00000000E+00        3  35  15  15  # H0-tau-tau eff. coupling^2, normalised to SM
    0.00000000E+00    4.53207496E+02        3  36  15  15  # A0-tau-tau eff. coupling^2, normalised to SM
#
Block HiggsBoundsInputHiggsCouplingsBosons
    9.99999917E-01        3  25  24  24  # h0-W-W eff. coupling^2, normalised to SM
    8.31700422E-08        3  35  24  24  # H0-W-W eff. coupling^2, normalised to SM
    0.00000000E+00        3  36  24  24  # A0-W-W eff. coupling^2, normalised to SM
#
    9.99999917E-01        3  25  23  23  # h0-Z-Z eff. coupling^2, normalised to SM
    8.31700422E-08        3  35  23  23  # H0-Z-Z eff. coupling^2, normalised to SM
    0.00000000E+00        3  36  23  23  # A0-Z-Z eff. coupling^2, normalised to SM
#
    8.73888475E-01        3  25  21  21  # h0-g-g eff. coupling^2, normalised to SM
    3.98266599E-10        3  35  21  21  # H0-g-g eff. coupling^2, normalised to SM
    2.67035046E-09        3  36  21  21  # A0-g-g eff. coupling^2, normalised to SM
#
    0.00000000E+00        3  25  25  23  # h0-h0-Z eff. coupling^2, normalised to SM
    0.00000000E+00        3  35  25  23  # H0-h0-Z eff. coupling^2, normalised to SM
    8.31700422E-08        3  36  25  23  # A0-h0-Z eff. coupling^2, normalised to SM
    0.00000000E+00        3  35  35  23  # H0-H0-Z eff. coupling^2, normalised to SM
    9.99999917E-01        3  36  35  23  # A0-H0-Z eff. coupling^2, normalised to SM
    0.00000000E+00        3  36  36  23  # A0-A0-Z eff. coupling^2, normalised to SM
#
    0.00000000E+00        4  25  21  21  23  # h0-g-g-Z eff. coupling^2, normalised to SM
    0.00000000E+00        4  35  21  21  23  # H0-g-g-Z eff. coupling^2, normalised to SM
    0.00000000E+00        4  36  21  21  23  # A0-g-g-Z eff. coupling^2, normalised to SM
#
#
#
#                             =================
#                             |The decay table|
#                             =================
#
# - The QCD corrections to the decays gluino -> squark  + quark
#                                     squark -> gaugino + quark_prime
#                                     squark -> squark_prime + Higgs
#                                     squark -> gluino  + quark
#   are included.
#
# - The multi-body decays for the inos, stops and sbottoms are included.
#
# - The loop induced decays for the gluino, neutralinos and stops
#   are included.
#
# - The SUSY decays of the top quark are included.
#
#
#         PDG            Width
DECAY         6     1.44455511E+00   # top decays
#          BR         NDA      ID1       ID2
     1.00000000E+00    2           5        24   # BR(t ->  b    W+)
#
#         PDG            Width
DECAY   1000021     4.41195130E+02   # gluino decays
#          BR         NDA      ID1       ID2
     5.66737289E-02    2     1000001        -1   # BR(~g -> ~d_L  db)
     5.66737289E-02    2    -1000001         1   # BR(~g -> ~d_L* d )
     5.67585898E-02    2     1000002        -2   # BR(~g -> ~u_L  ub)
     5.67585898E-02    2    -1000002         2   # BR(~g -> ~u_L* u )
     6.83026199E-02    2     2000002        -2   # BR(~g -> ~u_R  ub)
     6.83026199E-02    2    -2000002         2   # BR(~g -> ~u_R* u )
     5.66737289E-02    2     1000003        -3   # BR(~g -> ~s_L  sb)
     5.66737289E-02    2    -1000003         3   # BR(~g -> ~s_L* s )
     5.67585853E-02    2     1000004        -4   # BR(~g -> ~c_L  cb)
     5.67585853E-02    2    -1000004         4   # BR(~g -> ~c_L* c )
     6.83026188E-02    2     2000004        -4   # BR(~g -> ~c_R  cb)
     6.83026188E-02    2    -2000004         4   # BR(~g -> ~c_R* c )
     5.99911877E-02    2     1000005        -5   # BR(~g -> ~b_1  bb)
     5.99911877E-02    2    -1000005         5   # BR(~g -> ~b_1* b )
     3.84741027E-02    2     2000005        -5   # BR(~g -> ~b_2  bb)
     3.84741027E-02    2    -2000005         5   # BR(~g -> ~b_2* b )
     3.80648381E-02    2     1000006        -6   # BR(~g -> ~t_1  tb)
     3.80648381E-02    2    -1000006         6   # BR(~g -> ~t_1* t )
#
#         PDG            Width
DECAY   1000006     1.97928416E+01   # stop1 decays
#          BR         NDA      ID1       ID2
     2.72830331E-01    2     1000022         6   # BR(~t_1 -> ~chi_10 t )
     3.77768184E-03    2     1000023         6   # BR(~t_1 -> ~chi_20 t )
     5.62656037E-01    2     1000024         5   # BR(~t_1 -> ~chi_1+ b )
     1.60735950E-01    2     1000005        24   # BR(~t_1 -> ~b_1    W+)
#
#         PDG            Width
DECAY   2000006     1.70044931E+02   # stop2 decays
#          BR         NDA      ID1       ID2
     5.47480405E-05    2     1000022         6   # BR(~t_2 -> ~chi_10 t )
     4.65961582E-02    2     1000023         6   # BR(~t_2 -> ~chi_20 t )
     5.76662347E-02    2     1000025         6   # BR(~t_2 -> ~chi_30 t )
     5.86527875E-02    2     1000035         6   # BR(~t_2 -> ~chi_40 t )
     1.10285883E-04    2     1000024         5   # BR(~t_2 -> ~chi_1+ b )
     1.17023828E-01    2     1000037         5   # BR(~t_2 -> ~chi_2+ b )
     2.03674755E-01    2     1000021         6   # BR(~t_2 -> ~g      t )
     1.00568587E-01    2     1000006        25   # BR(~t_2 -> ~t_1    h )
     3.12966066E-02    2     1000006        35   # BR(~t_2 -> ~t_1    H )
     3.14961285E-02    2     1000006        36   # BR(~t_2 -> ~t_1    A )
     6.88964006E-04    2     1000005        37   # BR(~t_2 -> ~b_1    H+)
     6.22110006E-02    2     2000005        37   # BR(~t_2 -> ~b_2    H+)
     9.83783265E-02    2     1000006        23   # BR(~t_2 -> ~t_1    Z )
     1.14250754E-03    2     1000005        24   # BR(~t_2 -> ~b_1    W+)
     1.90439082E-01    2     2000005        24   # BR(~t_2 -> ~b_2    W+)
#
#         PDG            Width
DECAY   1000005     3.97775012E-02   # sbottom1 decays
#          BR         NDA      ID1       ID2
     3.64083538E-01    2     1000022         5   # BR(~b_1 -> ~chi_10 b )
     6.35916462E-01    2    -1000024         6   # BR(~b_1 -> ~chi_1- t )
#
#         PDG            Width
DECAY   2000005     1.94727144E+01   # sbottom2 decays
#          BR         NDA      ID1       ID2
     2.84930857E-01    2     1000022         5   # BR(~b_2 -> ~chi_10 b )
     3.41720791E-03    2     1000023         5   # BR(~b_2 -> ~chi_20 b )
     5.52598630E-01    2    -1000024         6   # BR(~b_2 -> ~chi_1- t )
     7.46913751E-02    2     1000005        25   # BR(~b_2 -> ~b_1    h )
     8.43619294E-02    2     1000005        23   # BR(~b_2 -> ~b_1    Z )
#
#         PDG            Width
DECAY   1000002     8.92396482E+00   # sup_L decays
#          BR         NDA      ID1       ID2
     3.33123560E-01    2     1000022         2   # BR(~u_L -> ~chi_10 u)
     6.66876440E-01    2     1000024         1   # BR(~u_L -> ~chi_1+ d)
#
#         PDG            Width
DECAY   2000002     4.02006153E-08   # sup_R decays
#          BR         NDA      ID1       ID2
     1.00000000E+00    2     1000022         2   # BR(~u_R -> ~chi_10 u)
#
#         PDG            Width
DECAY   1000001     8.95973184E+00   # sdown_L decays
#          BR         NDA      ID1       ID2
     3.33684999E-01    2     1000022         1   # BR(~d_L -> ~chi_10 d)
     6.66315001E-01    2    -1000024         2   # BR(~d_L -> ~chi_1- u)
#
#         PDG            Width
DECAY   2000001     1.16574802E+01   # sdown_R decays
#          BR         NDA      ID1       ID2
     6.12003282E-08    2     1000022         1   # BR(~d_R -> ~chi_10 d)
     1.32743163E-01    2     1000023         1   # BR(~d_R -> ~chi_20 d)
     2.53342887E-06    2     1000025         1   # BR(~d_R -> ~chi_30 d)
     2.05525017E-05    2     1000035         1   # BR(~d_R -> ~chi_40 d)
     8.67233690E-01    2     1000021         1   # BR(~d_R -> ~g      d)
#
#         PDG            Width
DECAY   1000004     8.61497372E+00   # scharm_L decays
#          BR         NDA      ID1       ID2
     3.33122432E-01    2     1000022         4   # BR(~c_L -> ~chi_10 c)
     6.66877568E-01    2     1000024         3   # BR(~c_L -> ~chi_1+ s)
#
#         PDG            Width
DECAY   2000004     3.68320397E-08   # scharm_R decays
#          BR         NDA      ID1       ID2
     1.00000000E+00    2     1000022         4   # BR(~c_R -> ~chi_10 c)
#
#         PDG            Width
DECAY   1000003     8.65076481E+00   # sstrange_L decays
#          BR         NDA      ID1       ID2
     3.33686242E-01    2     1000022         3   # BR(~s_L -> ~chi_10 s)
     6.66313758E-01    2    -1000024         4   # BR(~s_L -> ~chi_1- c)
#
#         PDG            Width
DECAY   2000003     8.64748277E+00   # sstrange_R decays
#          BR         NDA      ID1       ID2
     8.66438876E-08    2     1000022         3   # BR(~s_R -> ~chi_10 s)
     1.87250905E-01    2     1000023         3   # BR(~s_R -> ~chi_20 s)
     3.51373149E-06    2     1000025         3   # BR(~s_R -> ~chi_30 s)
     2.85044446E-05    2     1000035         3   # BR(~s_R -> ~chi_40 s)
     8.12716990E-01    2     1000021         3   # BR(~s_R -> ~g      s)
#
#         PDG            Width
DECAY   1000011     1.82573815E+01   # selectron_L decays
#          BR         NDA      ID1       ID2
     3.20342962E-01    2     1000022        11   # BR(~e_L -> ~chi_10 e-)
     3.92470814E-02    2     1000023        11   # BR(~e_L -> ~chi_20 e-)
     6.40409956E-01    2    -1000024        12   # BR(~e_L -> ~chi_1- nu_e)
#
#         PDG            Width
DECAY   2000011     5.04101631E+00   # selectron_R decays
#          BR         NDA      ID1       ID2
     7.21022035E-07    2     1000022        11   # BR(~e_R -> ~chi_10 e-)
     9.99999279E-01    2     1000023        11   # BR(~e_R -> ~chi_20 e-)
#
#         PDG            Width
DECAY   1000013     1.82573814E+01   # smuon_L decays
#          BR         NDA      ID1       ID2
     3.20342961E-01    2     1000022        13   # BR(~mu_L -> ~chi_10 mu-)
     3.92470806E-02    2     1000023        13   # BR(~mu_L -> ~chi_20 mu-)
     6.40409959E-01    2    -1000024        14   # BR(~mu_L -> ~chi_1- nu_mu)
#
#         PDG            Width
DECAY   2000013     5.04101625E+00   # smuon_R decays
#          BR         NDA      ID1       ID2
     7.21022039E-07    2     1000022        13   # BR(~mu_R -> ~chi_10 mu-)
     9.99999279E-01    2     1000023        13   # BR(~mu_R -> ~chi_20 mu-)
#
#         PDG            Width
DECAY   1000015     1.43936408E+01   # stau_1 decays
#          BR         NDA      ID1       ID2
     3.26332406E-01    2     1000022        15   # BR(~tau_1 -> ~chi_10  tau-)
     2.14623581E-02    2     1000023        15   # BR(~tau_1 -> ~chi_20  tau-)
     6.52205236E-01    2    -1000024        16   # BR(~tau_1 -> ~chi_1-  nu_tau)
#
#         PDG            Width
DECAY   2000015     1.67043163E+01   # stau_2 decays
#          BR         NDA      ID1       ID2
     1.24706192E-05    2     1000022        15   # BR(~tau_2 -> ~chi_10  tau-)
     7.55291927E-01    2     1000023        15   # BR(~tau_2 -> ~chi_20  tau-)
     1.20518645E-02    2     1000025        15   # BR(~tau_2 -> ~chi_30  tau-)
     1.20896608E-02    2     1000035        15   # BR(~tau_2 -> ~chi_40  tau-)
     2.44292343E-05    2    -1000024        16   # BR(~tau_2 -> ~chi_1-  nu_tau)
     2.39857803E-02    2    -1000037        16   # BR(~tau_2 -> ~chi_2-  nu_tau)
     1.64287549E-02    2     1000016       -37   # BR(~tau_2 -> ~nu_tauL H-)
     8.03111833E-02    2     1000016       -24   # BR(~tau_2 -> ~nu_tauL W-)
     4.22369870E-02    2     1000015        25   # BR(~tau_2 -> ~tau_1   h)
     8.21467574E-03    2     1000015        35   # BR(~tau_2 -> ~tau_1   H)
     8.21117948E-03    2     1000015        36   # BR(~tau_2 -> ~tau_1   A)
     4.11410876E-02    2     1000015        23   # BR(~tau_2 -> ~tau_1   Z)
#
#         PDG            Width
DECAY   1000012     1.82484891E+01   # snu_eL decays
#          BR         NDA      ID1       ID2
     3.20399646E-01    2     1000022        12   # BR(~nu_eL -> ~chi_10 nu_e)
     3.86662237E-02    2     1000023        12   # BR(~nu_eL -> ~chi_20 nu_e)
     6.40934130E-01    2     1000024        11   # BR(~nu_eL -> ~chi_1+ e-)
#
#         PDG            Width
DECAY   1000014     1.82484890E+01   # snu_muL decays
#          BR         NDA      ID1       ID2
     3.20399648E-01    2     1000022        14   # BR(~nu_muL -> ~chi_10 nu_mu)
     3.86662239E-02    2     1000023        14   # BR(~nu_muL -> ~chi_20 nu_mu)
     6.40934128E-01    2     1000024        13   # BR(~nu_muL -> ~chi_1+ mu-)
#
#         PDG            Width
DECAY   1000016     1.43801316E+01   # snu_tauL decays
#          BR         NDA      ID1       ID2
     3.26244786E-01    2     1000022        16   # BR(~nu_tauL -> ~chi_10 nu_tau)
     2.10127678E-02    2     1000023        16   # BR(~nu_tauL -> ~chi_20 nu_tau)
     6.52742447E-01    2     1000024        15   # BR(~nu_tauL -> ~chi_1+ tau-)
#
#         PDG            Width
DECAY   1000024     3.68842150E-15   # chargino1+ decays
#           BR         NDA      ID1       ID2       ID3
     1.94873540E-02    3     1000022       -11        12   # BR(~chi_1+ -> ~chi_10 e+   nu_e)
     2.25329140E-03    3     1000022       -13        14   # BR(~chi_1+ -> ~chi_10 mu+  nu_mu)
     9.78259350E-01    2     1000022       211             # BR(~chi_1+ -> ~chi_10 pi+)
#
#         PDG            Width
DECAY   1000037     4.24650051E+01   # chargino2+ decays
#          BR         NDA      ID1       ID2
     4.94751543E-05    2     1000002        -1   # BR(~chi_2+ -> ~u_L     db)
     1.03282758E-03    2    -1000001         2   # BR(~chi_2+ -> ~d_L*    u )
     4.94751536E-05    2     1000004        -3   # BR(~chi_2+ -> ~c_L     sb)
     1.03282735E-03    2    -1000003         4   # BR(~chi_2+ -> ~s_L*     c )
     3.20484236E-02    2     1000006        -5   # BR(~chi_2+ -> ~t_1     bb)
     7.64233482E-02    2    -1000005         6   # BR(~chi_2+ -> ~b_1*    t )
     3.80227897E-01    2    -2000005         6   # BR(~chi_2+ -> ~b_2*    t )
     7.48985933E-06    2     1000012       -11   # BR(~chi_2+ -> ~nu_eL   e+  )
     7.48985933E-06    2     1000014       -13   # BR(~chi_2+ -> ~nu_muL mu+ )
     1.29194747E-02    2     1000016       -15   # BR(~chi_2+ -> ~nu_tau1 tau+)
     1.56064191E-04    2    -1000011        12   # BR(~chi_2+ -> ~e_L+    nu_e)
     1.56064191E-04    2    -1000013        14   # BR(~chi_2+ -> ~mu_L+   nu_mu)
     1.94752160E-04    2    -1000015        16   # BR(~chi_2+ -> ~tau_1+  nu_tau)
     1.18546958E-01    2     1000024        23   # BR(~chi_2+ -> ~chi_1+  Z )
     1.15353743E-01    2     1000022        24   # BR(~chi_2+ -> ~chi_10  W+)
     3.60745140E-02    2     1000023        24   # BR(~chi_2+ -> ~chi_20  W+)
     1.21386897E-01    2     1000024        25   # BR(~chi_2+ -> ~chi_1+  h )
     3.47748657E-02    2     1000024        35   # BR(~chi_2+ -> ~chi_1+  H )
     3.48159648E-02    2     1000024        36   # BR(~chi_2+ -> ~chi_1+  A )
     3.47414485E-02    2     1000022        37   # BR(~chi_2+ -> ~chi_10  H+)
#
#         PDG            Width
DECAY   1000022     0.00000000E+00   # neutralino1 decays
#
#         PDG            Width
DECAY   1000023     9.74440463E+00   # neutralino2 decays
#          BR         NDA      ID1       ID2
     1.09905193E-05    2     1000022        23   # BR(~chi_20 -> ~chi_10   Z )
     1.11563714E-04    2     1000024       -24   # BR(~chi_20 -> ~chi_1+   W-)
     1.11563714E-04    2    -1000024        24   # BR(~chi_20 -> ~chi_1-   W+)
     1.00595073E-04    2     1000022        25   # BR(~chi_20 -> ~chi_10   h )
     2.15289069E-04    2     1000002        -2   # BR(~chi_20 -> ~u_L      ub)
     2.15289069E-04    2    -1000002         2   # BR(~chi_20 -> ~u_L*     u )
     2.45066825E-01    2     2000002        -2   # BR(~chi_20 -> ~u_R      ub)
     2.45066825E-01    2    -2000002         2   # BR(~chi_20 -> ~u_R*     u )
     1.85058161E-04    2     1000001        -1   # BR(~chi_20 -> ~d_L      db)
     1.85058161E-04    2    -1000001         1   # BR(~chi_20 -> ~d_L*     d )
     2.15190363E-04    2     1000004        -4   # BR(~chi_20 -> ~c_L      cb)
     2.15190363E-04    2    -1000004         4   # BR(~chi_20 -> ~c_L*     c )
     2.45066447E-01    2     2000004        -4   # BR(~chi_20 -> ~c_R      cb)
     2.45066447E-01    2    -2000004         4   # BR(~chi_20 -> ~c_R*     c )
     1.85058161E-04    2     1000003        -3   # BR(~chi_20 -> ~s _L      sb)
     1.85058161E-04    2    -1000003         3   # BR(~chi_20 -> ~s _L*     s )
     8.89877580E-03    2     1000005        -5   # BR(~chi_20 -> ~b_1      bb)
     8.89877580E-03    2    -1000005         5   # BR(~chi_20 -> ~b_1*     b )
#
#         PDG            Width
DECAY   1000025     4.19861578E+01   # neutralino3 decays
#          BR         NDA      ID1       ID2
     8.49502437E-02    2     1000022        23   # BR(~chi_30 -> ~chi_10   Z )
     3.30307678E-02    2     1000023        23   # BR(~chi_30 -> ~chi_20   Z )
     1.16683318E-01    2     1000024       -24   # BR(~chi_30 -> ~chi_1+   W-)
     1.16683318E-01    2    -1000024        24   # BR(~chi_30 -> ~chi_1-   W+)
     3.56499800E-02    2     1000022        25   # BR(~chi_30 -> ~chi_10   h )
     8.73067601E-03    2     1000022        35   # BR(~chi_30 -> ~chi_10   H )
     2.63161325E-02    2     1000022        36   # BR(~chi_30 -> ~chi_10   A )
     4.40467631E-03    2     1000023        25   # BR(~chi_30 -> ~chi_20   h )
     3.49414079E-02    2     1000024       -37   # BR(~chi_30 -> ~chi_1+   H-)
     3.49414079E-02    2    -1000024        37   # BR(~chi_30 -> ~chi_1-   H+)
     6.68444685E-05    2     1000002        -2   # BR(~chi_30 -> ~u_L      ub)
     6.68444685E-05    2    -1000002         2   # BR(~chi_30 -> ~u_L*     u )
     1.25048696E-05    2     2000002        -2   # BR(~chi_30 -> ~u_R      ub)
     1.25048696E-05    2    -2000002         2   # BR(~chi_30 -> ~u_R*     u )
     9.38840952E-05    2     1000001        -1   # BR(~chi_30 -> ~d_L      db)
     9.38840952E-05    2    -1000001         1   # BR(~chi_30 -> ~d_L*     d )
     6.68444539E-05    2     1000004        -4   # BR(~chi_30 -> ~c_L      cb)
     6.68444539E-05    2    -1000004         4   # BR(~chi_30 -> ~c_L*     c )
     1.25048691E-05    2     2000004        -4   # BR(~chi_30 -> ~c_R      cb)
     1.25048691E-05    2    -2000004         4   # BR(~chi_30 -> ~c_R*     c )
     9.38840952E-05    2     1000003        -3   # BR(~chi_30 -> ~s _L      sb)
     9.38840952E-05    2    -1000003         3   # BR(~chi_30 -> ~s _L*     s )
     1.94014943E-01    2     1000006        -6   # BR(~chi_30 -> ~t_1      tb)
     1.94014943E-01    2    -1000006         6   # BR(~chi_30 -> ~t_1*     t )
     3.47748413E-02    2     1000005        -5   # BR(~chi_30 -> ~b_1      bb)
     3.47748413E-02    2    -1000005         5   # BR(~chi_30 -> ~b_1*     b )
     1.61099758E-02    2     2000005        -5   # BR(~chi_30 -> ~b_2      bb)
     1.61099758E-02    2    -2000005         5   # BR(~chi_30 -> ~b_2*     b )
     6.65544360E-06    2     1000011       -11   # BR(~chi_30 -> ~e_L-     e+)
     6.65544360E-06    2    -1000011        11   # BR(~chi_30 -> ~e_L+     e-)
     1.38725296E-06    2     2000011       -11   # BR(~chi_30 -> ~e_R-     e+)
     1.38725296E-06    2    -2000011        11   # BR(~chi_30 -> ~e_R+     e-)
     6.65544360E-06    2     1000013       -13   # BR(~chi_30 -> ~mu_L-    mu+)
     6.65544360E-06    2    -1000013        13   # BR(~chi_30 -> ~mu_L+    mu-)
     1.38725296E-06    2     2000013       -13   # BR(~chi_30 -> ~mu_R-    mu+)
     1.38725296E-06    2    -2000013        13   # BR(~chi_30 -> ~mu_R+    mu-)
     6.50503379E-03    2     1000015       -15   # BR(~chi_30 -> ~tau_1-   tau+)
     6.50503379E-03    2    -1000015        15   # BR(~chi_30 -> ~tau_1+   tau-)
     1.90490733E-05    2     1000012       -12   # BR(~chi_30 -> ~nu_eL    nu_eb)
     1.90490733E-05    2    -1000012        12   # BR(~chi_30 -> ~nu_eL*   nu_e )
     1.90490733E-05    2     1000014       -14   # BR(~chi_30 -> ~nu_muL   nu_mub)
     1.90490733E-05    2    -1000014        14   # BR(~chi_30 -> ~nu_muL*  nu_mu )
     2.85921485E-05    2     1000016       -16   # BR(~chi_30 -> ~nu_tau1  nu_taub)
     2.85921485E-05    2    -1000016        16   # BR(~chi_30 -> ~nu_tau1* nu_tau )
#
#         PDG            Width
DECAY   1000035     4.26900899E+01   # neutralino4 decays
#          BR         NDA      ID1       ID2
     3.44397061E-02    2     1000022        23   # BR(~chi_40 -> ~chi_10   Z )
     4.02603248E-03    2     1000023        23   # BR(~chi_40 -> ~chi_20   Z )
     1.14778483E-01    2     1000024       -24   # BR(~chi_40 -> ~chi_1+   W-)
     1.14778483E-01    2    -1000024        24   # BR(~chi_40 -> ~chi_1-   W+)
     8.57941551E-02    2     1000022        25   # BR(~chi_40 -> ~chi_10   h )
     2.58293136E-02    2     1000022        35   # BR(~chi_40 -> ~chi_10   H )
     8.58160632E-03    2     1000022        36   # BR(~chi_40 -> ~chi_10   A )
     3.44181971E-02    2     1000023        25   # BR(~chi_40 -> ~chi_20   h )
     3.43926620E-02    2     1000024       -37   # BR(~chi_40 -> ~chi_1+   H-)
     3.43926620E-02    2    -1000024        37   # BR(~chi_40 -> ~chi_1-   H+)
     1.36055439E-04    2     1000002        -2   # BR(~chi_40 -> ~u_L      ub)
     1.36055439E-04    2    -1000002         2   # BR(~chi_40 -> ~u_L*     u )
     9.99885419E-05    2     2000002        -2   # BR(~chi_40 -> ~u_R      ub)
     9.99885419E-05    2    -2000002         2   # BR(~chi_40 -> ~u_R*     u )
     2.54683021E-04    2     1000001        -1   # BR(~chi_40 -> ~d_L      db)
     2.54683021E-04    2    -1000001         1   # BR(~chi_40 -> ~d_L*     d )
     1.36055409E-04    2     1000004        -4   # BR(~chi_40 -> ~c_L      cb)
     1.36055409E-04    2    -1000004         4   # BR(~chi_40 -> ~c_L*     c )
     9.99885380E-05    2     2000004        -4   # BR(~chi_40 -> ~c_R      cb)
     9.99885380E-05    2    -2000004         4   # BR(~chi_40 -> ~c_R*     c )
     2.54683021E-04    2     1000003        -3   # BR(~chi_40 -> ~s _L      sb)
     2.54683021E-04    2    -1000003         3   # BR(~chi_40 -> ~s _L*     s )
     1.96677486E-01    2     1000006        -6   # BR(~chi_40 -> ~t_1      tb)
     1.96677486E-01    2    -1000006         6   # BR(~chi_40 -> ~t_1*     t )
     3.40001961E-02    2     1000005        -5   # BR(~chi_40 -> ~b_1      bb)
     3.40001961E-02    2    -1000005         5   # BR(~chi_40 -> ~b_1*     b )
     1.59787106E-02    2     2000005        -5   # BR(~chi_40 -> ~b_2      bb)
     1.59787106E-02    2    -2000005         5   # BR(~chi_40 -> ~b_2*     b )
     8.13772680E-06    2     1000011       -11   # BR(~chi_40 -> ~e_L-     e+)
     8.13772680E-06    2    -1000011        11   # BR(~chi_40 -> ~e_L+     e-)
     1.11225327E-05    2     2000011       -11   # BR(~chi_40 -> ~e_R-     e+)
     1.11225327E-05    2    -2000011        11   # BR(~chi_40 -> ~e_R+     e-)
     8.13772680E-06    2     1000013       -13   # BR(~chi_40 -> ~mu_L-    mu+)
     8.13772680E-06    2    -1000013        13   # BR(~chi_40 -> ~mu_L+    mu-)
     1.11225327E-05    2     2000013       -13   # BR(~chi_40 -> ~mu_R-    mu+)
     1.11225327E-05    2    -2000013        13   # BR(~chi_40 -> ~mu_R+    mu-)
     6.38993306E-03    2     1000015       -15   # BR(~chi_40 -> ~tau_1-   tau+)
     6.38993306E-03    2    -1000015        15   # BR(~chi_40 -> ~tau_1+   tau-)
     6.22963842E-05    2     1000012       -12   # BR(~chi_40 -> ~nu_eL    nu_eb)
     6.22963842E-05    2    -1000012        12   # BR(~chi_40 -> ~nu_eL*   nu_e )
     6.22963842E-05    2     1000014       -14   # BR(~chi_40 -> ~nu_muL   nu_mub)
     6.22963842E-05    2    -1000014        14   # BR(~chi_40 -> ~nu_muL*  nu_mu )
     9.34558630E-05    2     1000016       -16   # BR(~chi_40 -> ~nu_tau1  nu_taub)
     9.34558630E-05    2    -1000016        16   # BR(~chi_40 -> ~nu_tau1* nu_tau )
#
#         PDG            Width
DECAY        25     5.29749163E-03   # h decays
#          BR         NDA      ID1       ID2
     6.83698932E-01    2           5        -5   # BR(h -> b       bb     )
     4.95881323E-02    2         -15        15   # BR(h -> tau+    tau-   )
     1.75524285E-04    2         -13        13   # BR(h -> mu+     mu-    )
     1.91087645E-04    2           3        -3   # BR(h -> s       sb     )
     1.64119698E-02    2           4        -4   # BR(h -> c       cb     )
     6.02720696E-02    2          21        21   # BR(h -> g       g      )
     1.80546979E-03    2          22        22   # BR(h -> gam     gam    )
     1.21956750E-03    2          22        23   # BR(h -> Z       gam    )
     1.65859202E-01    2          24       -24   # BR(h -> W+      W-     )
     2.07780455E-02    2          23        23   # BR(h -> Z       Z      )
#
#         PDG            Width
DECAY        35     9.17898117E+00   # H decays
#          BR         NDA      ID1       ID2
     8.21611284E-01    2           5        -5   # BR(H -> b       bb     )
     1.58058072E-01    2         -15        15   # BR(H -> tau+    tau-   )
     5.59784627E-04    2         -13        13   # BR(H -> mu+     mu-    )
     2.68738776E-04    2           3        -3   # BR(H -> s       sb     )
     1.73774764E-07    2           4        -4   # BR(H -> c       cb     )
     1.65486585E-02    2           6        -6   # BR(H -> t       tb     )
     5.23050384E-05    2          21        21   # BR(H -> g       g      )
     1.15395428E-07    2          22        22   # BR(H -> gam     gam    )
     2.16172284E-08    2          23        22   # BR(H -> Z       gam    )
     1.16689046E-05    2          24       -24   # BR(H -> W+      W-     )
     5.80244774E-06    2          23        23   # BR(H -> Z       Z      )
     7.54286838E-05    2          25        25   # BR(H -> h       h      )
     1.84613694E-03    2     1000024  -1000024   # BR(H -> ~chi_1+ ~chi_1-)
     9.24574078E-04    2     1000022   1000022   # BR(H -> ~chi_10 ~chi_10)
     3.16341853E-05    2     1000022   1000023   # BR(H -> ~chi_10 ~chi_20)
     2.80051344E-06    2     2000002  -2000002   # BR(H -> ~u_R    ~u_R*  )
     2.80051344E-06    2     2000004  -2000004   # BR(H -> ~c_R    ~c_R*  )
#
#         PDG            Width
DECAY        36     9.19734347E+00   # A decays
#          BR         NDA      ID1       ID2
     8.20030568E-01    2           5        -5   # BR(A -> b       bb     )
     1.57752717E-01    2         -15        15   # BR(A -> tau+    tau-   )
     5.58700390E-04    2         -13        13   # BR(A -> mu+     mu-    )
     2.68260377E-04    2           3        -3   # BR(A -> s       sb     )
     1.72895385E-07    2           4        -4   # BR(A -> c       cb     )
     1.68806677E-02    2           6        -6   # BR(A -> t       tb     )
     1.35202021E-04    2          21        21   # BR(A -> g       g      )
     2.52559146E-07    2          22        22   # BR(A -> gam     gam    )
     8.76445594E-08    2          23        22   # BR(A -> Z       gam    )
     1.16913859E-05    2          23        25   # BR(A -> Z       h      )
     2.71561581E-03    2     1000024  -1000024   # BR(A -> ~chi_1+ ~chi_1-)
     1.35964376E-03    2     1000022   1000022   # BR(A -> ~chi_10 ~chi_10)
     2.86419855E-04    2     1000022   1000023   # BR(A -> ~chi_10 ~chi_20)
#
#         PDG            Width
DECAY        37     5.94185751E+00   # H+ decays
#          BR         NDA      ID1       ID2
     1.23000146E-03    2           4        -5   # BR(H+ -> c       bb     )
     2.44497305E-01    2         -15        16   # BR(H+ -> tau+    nu_tau )
     8.65916870E-04    2         -13        14   # BR(H+ -> mu+     nu_mu  )
     1.22999621E-05    2           2        -5   # BR(H+ -> u       bb     )
     2.07455961E-05    2           2        -3   # BR(H+ -> u       sb     )
     4.08592527E-04    2           4        -3   # BR(H+ -> c       sb     )
     7.52445726E-01    2           6        -5   # BR(H+ -> t       bb     )
     1.82086812E-05    2          24        25   # BR(H+ -> W+      h      )
     7.94121967E-12    2          24        36   # BR(H+ -> W+      A      )
     6.15508984E-10    2     1000024   1000022   # BR(H+ -> ~chi_1+ ~chi_10)
     5.01202952E-04    2     1000024   1000023   # BR(H+ -> ~chi_1+ ~chi_20)
