#
#                              ======================
#                              | THE SUSYHIT OUTPUT |
#                              ======================
#
#
#              ------------------------------------------------------
#              |     This is the output of the SUSY-HIT package     |
#              |  created by A.Djouadi, M.Muehlleitner and M.Spira. |
#              |  In case of problems with SUSY-HIT email to        |
#              |           margarete.muehlleitner@cern.ch           |
#              |           michael.spira@psi.ch                     |
#              |           abdelhak.djouadi@cern.ch                 |
#              ------------------------------------------------------
#
#              ------------------------------------------------------
#              |  SUSY Les Houches Accord - MSSM Spectrum + Decays  |
#              |              based on the decay programs           |
#              |                                                    |
#              |                     SDECAY 1.3b                    |
#              |                                                    |
#              |  Authors: M.Muhlleitner, A.Djouadi and Y.Mambrini  |
#              |  Ref.:    Comput.Phys.Commun.168(2005)46           |
#              |           [hep-ph/0311167]                         |
#              |                                                    |
#              |                     HDECAY 3.4                     |
#              |                                                    |
#              |  By: A.Djouadi,J.Kalinowski,M.Muhlleitner,M.Spira  |
#              |  Ref.:    Comput.Phys.Commun.108(1998)56           |
#              |           [hep-ph/9704448]                         |
#              |                                                    |
#              |                                                    |
#              |  If not stated otherwise all DRbar couplings and   |
#              |  soft SUSY breaking masses are given at the scale  |
#              |  Q=  0.22649280E+04
#              |                                                    |
#              ------------------------------------------------------
#
#
BLOCK DCINFO  # Decay Program information
     1   SDECAY/HDECAY # decay calculator
     2   1.3b  /3.4    # version number
#
BLOCK SPINFO  # Spectrum calculator information
     1     SOFTSUSY    # spectrum calculator               
     2     3.4.0       # version number                    
#
BLOCK MODSEL  # Model selection
     1     0   #  nonUniversal                                     
#
BLOCK SMINPUTS  # Standard Model inputs
         1     1.27908970E+02   # alpha_em^-1(M_Z)^MSbar
         2     1.16637870E-05   # G_F [GeV^-2]
         3     1.18400000E-01   # alpha_S(M_Z)^MSbar
         4     9.11876000E+01   # M_Z pole mass
         5     4.18000000E+00   # mb(mb)^MSbar
         6     1.73200000E+02   # mt pole mass
         7     1.77700000E+00   # mtau pole mass
#
BLOCK MINPAR  # Input parameters - minimal models
         3     4.20200000E+01   # tanb                
#
BLOCK EXTPAR  # Input parameters - non-minimal models
         0    -1.00000000E+00   # Set                 
         1    -3.95919000E+03   # M_1(MX)             
         2    -4.35940000E+02   # M_2(MX)             
         3     3.42639000E+03   # M_3(MX)             
        11    -3.45751000E+03   # At(MX)              
        12    -1.66874000E+03   # Ab(MX)              
        13     3.13082000E+03   # Atau(MX)            
        23     2.50853000E+03   # mu(MX)              
        26     3.91403000E+03   # mA(pole)            
        31     5.51920000E+02   # meL(MX)             
        32     5.51920000E+02   # mmuL(MX)            
        33     3.60146000E+03   # mtauL(MX)           
        34     2.22101000E+03   # meR(MX)             
        35     2.22101000E+03   # mmuR(MX)            
        36     4.47390000E+02   # mtauR(MX)           
        41     3.69840000E+02   # mqL1(MX)            
        42     3.69840000E+02   # mqL2(MX)            
        43     1.29699000E+03   # mqL3(MX)            
        44     1.05164000E+03   # muR(MX)             
        45     1.05164000E+03   # mcR(MX)             
        46     3.95127000E+03   # mtR(MX)             
        47     1.09269000E+03   # mdR(MX)             
        48     1.09269000E+03   # msR(MX)             
        49     2.03908000E+03   # mbR(MX)             
#
BLOCK MASS  # Mass Spectrum
# PDG code           mass       particle
        24     8.03698188E+01   # W+
        25     1.25264337E+02   # h
        35     3.91406019E+03   # H
        36     3.91403000E+03   # A
        37     3.91486598E+03   # H+
         5     4.81876030E+00   # b-quark pole mass calculated from mb(mb)_Msbar
   1000001     4.81545463E+02   # ~d_L
   2000001     1.16614608E+03   # ~d_R
   1000002     4.74787469E+02   # ~u_L
   2000002     1.13190398E+03   # ~u_R
   1000003     4.81545463E+02   # ~s_L
   2000003     1.16614608E+03   # ~s_R
   1000004     4.74787469E+02   # ~c_L
   2000004     1.13190398E+03   # ~c_R
   1000005     1.39872270E+03   # ~b_1
   2000005     2.11345398E+03   # ~b_2
   1000006     1.40222124E+03   # ~t_1
   2000006     3.98714881E+03   # ~t_2
   1000011     5.66336924E+02   # ~e_L
   2000011     2.22289138E+03   # ~e_R
   1000012     5.60634912E+02   # ~nu_eL
   1000013     5.66336924E+02   # ~mu_L
   2000013     2.22289138E+03   # ~mu_R
   1000014     5.60634912E+02   # ~nu_muL
   1000015     4.76795315E+02   # ~tau_1
   2000015     3.60905119E+03   # ~tau_2
   1000016     3.60752774E+03   # ~nu_tauL
   1000021     3.41526980E+03   # ~g
   1000022    -4.43773563E+02   # ~chi_10
   1000023    -2.52827110E+03   # ~chi_20
   1000025     2.52853028E+03   # ~chi_30
   1000035    -3.92543499E+03   # ~chi_40
   1000024     4.43938427E+02   # ~chi_1+
   1000037     2.53028295E+03   # ~chi_2+
#
BLOCK NMIX  # Neutralino Mixing Matrix
  1  1    -1.71852380E-05   # N_11
  1  2     9.99495679E-01   # N_12
  1  3    -3.14341628E-02   # N_13
  1  4    -4.50344989E-03   # N_14
  2  1     2.13276489E-02   # N_21
  2  2     2.54075112E-02   # N_22
  2  3     7.06590889E-01   # N_23
  2  4     7.06844329E-01   # N_24
  3  1     4.84572039E-03   # N_31
  3  2    -1.90436143E-02   # N_32
  3  3    -7.06827793E-01   # N_33
  3  4     7.07112672E-01   # N_34
  4  1     9.99760796E-01   # N_41
  4  2    -4.32529338E-04   # N_42
  4  3    -1.16481590E-02   # N_43
  4  4    -1.85063021E-02   # N_44
#
BLOCK UMIX  # Chargino Mixing Matrix U
  1  1     9.99011837E-01   # U_11
  1  2    -4.44449126E-02   # U_12
  2  1     4.44449126E-02   # U_21
  2  2     9.99011837E-01   # U_22
#
BLOCK VMIX  # Chargino Mixing Matrix V
  1  1    -9.99979749E-01   # V_11
  1  2    -6.36410764E-03   # V_12
  2  1    -6.36410764E-03   # V_21
  2  2     9.99979749E-01   # V_22
#
BLOCK STOPMIX  # Stop Mixing Matrix
  1  1     9.99365889E-01   # cos(theta_t)
  1  2     3.56064587E-02   # sin(theta_t)
  2  1    -3.56064587E-02   # -sin(theta_t)
  2  2     9.99365889E-01   # cos(theta_t)
#
BLOCK SBOTMIX  # Sbottom Mixing Matrix
  1  1     9.97350930E-01   # cos(theta_b)
  1  2     7.27401019E-02   # sin(theta_b)
  2  1    -7.27401019E-02   # -sin(theta_b)
  2  2     9.97350930E-01   # cos(theta_b)
#
BLOCK STAUMIX  # Stau Mixing Matrix
  1  1     1.35220898E-02   # cos(theta_tau)
  1  2     9.99908572E-01   # sin(theta_tau)
  2  1    -9.99908572E-01   # -sin(theta_tau)
  2  2     1.35220898E-02   # cos(theta_tau)
#
BLOCK ALPHA  # Higgs mixing
          -2.45271177E-02   # Mixing angle in the neutral Higgs boson sector
#
BLOCK HMIX Q=  2.26492800E+03  # DRbar Higgs Parameters
         1     2.53090866E+03   # mu(Q)MSSM           
         2     4.07753814E+01   # tan                 
         3     2.43415622E+02   # higgs               
         4     1.69964003E+07   # mA^2(Q)MSSM         
#
BLOCK GAUGE Q=  2.26492800E+03  # The gauge couplings
     1     3.64136165E-01   # gprime(Q) DRbar
     2     6.40114425E-01   # g(Q) DRbar
     3     1.01878585E+00   # g3(Q) DRbar
#
BLOCK AU Q=  2.26492800E+03  # The trilinear couplings
  1  1     0.00000000E+00   # A_u(Q) DRbar
  2  2     0.00000000E+00   # A_c(Q) DRbar
  3  3    -3.45750999E+03   # A_t(Q) DRbar
#
BLOCK AD Q=  2.26492800E+03  # The trilinear couplings
  1  1     0.00000000E+00   # A_d(Q) DRbar
  2  2     0.00000000E+00   # A_s(Q) DRbar
  3  3    -1.66873999E+03   # A_b(Q) DRbar
#
BLOCK AE Q=  2.26492800E+03  # The trilinear couplings
  1  1     0.00000000E+00   # A_e(Q) DRbar
  2  2     0.00000000E+00   # A_mu(Q) DRbar
  3  3     3.13082000E+03   # A_tau(Q) DRbar
#
BLOCK Yu Q=  2.26492800E+03  # The Yukawa couplings
  1  1     0.00000000E+00   # y_u(Q) DRbar
  2  2     0.00000000E+00   # y_c(Q) DRbar
  3  3     8.16436476E-01   # y_t(Q) DRbar
#
BLOCK Yd Q=  2.26492800E+03  # The Yukawa couplings
  1  1     0.00000000E+00   # y_d(Q) DRbar
  2  2     0.00000000E+00   # y_s(Q) DRbar
  3  3     3.92155609E-01   # y_b(Q) DRbar
#
BLOCK Ye Q=  2.26492800E+03  # The Yukawa couplings
  1  1     0.00000000E+00   # y_e(Q) DRbar
  2  2     0.00000000E+00   # y_mu(Q) DRbar
  3  3     4.07489468E-01   # y_tau(Q) DRbar
#
BLOCK MSOFT Q=  2.26492800E+03  # The soft SUSY breaking masses at the scale Q
         1    -3.95919000E+03   # M_1(Q)              
         2    -4.35940000E+02   # M_2(Q)              
         3     3.42639000E+03   # M_3(Q)              
        21     9.19299443E+06   # mH1^2(Q)            
        22    -6.45543796E+06   # mH2^2(Q)            
        31     5.51920000E+02   # meL(Q)              
        32     5.51920000E+02   # mmuL(Q)             
        33     3.60146000E+03   # mtauL(Q)            
        34     2.22101000E+03   # meR(Q)              
        35     2.22101000E+03   # mmuR(Q)             
        36     4.47390003E+02   # mtauR(Q)            
        41     3.69839939E+02   # mqL1(Q)             
        42     3.69839939E+02   # mqL2(Q)             
        43     1.29698996E+03   # mqL3(Q)             
        44     1.05163998E+03   # muR(Q)              
        45     1.05163998E+03   # mcR(Q)              
        46     3.95126998E+03   # mtR(Q)              
        47     1.09268998E+03   # mdR(Q)              
        48     1.09268998E+03   # msR(Q)              
        49     2.03907999E+03   # mbR(Q)              
#
Block HiggsBoundsInputHiggsCouplingsFermions
# ScalarNormEffCoupSq PseudoSNormEffCoupSq NP   IP1 IP2 IP2
    1.00060608E+00    0.00000000E+00        3  25   5   5  # h0-b-b eff. coupling^2, normalised to SM
    1.66263112E+03    0.00000000E+00        3  35   5   5  # H0-b-b eff. coupling^2, normalised to SM
    0.00000000E+00    1.66263173E+03        3  36   5   5  # A0-b-b eff. coupling^2, normalised to SM
#
    9.99999635E-01    0.00000000E+00        3  25   6   6  # h0-t-t eff. coupling^2, normalised to SM
    6.01820631E-04    0.00000000E+00        3  35   6   6  # H0-t-t eff. coupling^2, normalised to SM
    0.00000000E+00    6.01456103E-04        3  36   6   6  # A0-t-t eff. coupling^2, normalised to SM
#
    1.00060608E+00    0.00000000E+00        3  25  15  15  # h0-tau-tau eff. coupling^2, normalised to SM
    1.66263112E+03    0.00000000E+00        3  35  15  15  # H0-tau-tau eff. coupling^2, normalised to SM
    0.00000000E+00    1.66263173E+03        3  36  15  15  # A0-tau-tau eff. coupling^2, normalised to SM
#
Block HiggsBoundsInputHiggsCouplingsBosons
    1.00000000E+00        3  25  24  24  # h0-W-W eff. coupling^2, normalised to SM
    5.52161344E-11        3  35  24  24  # H0-W-W eff. coupling^2, normalised to SM
    0.00000000E+00        3  36  24  24  # A0-W-W eff. coupling^2, normalised to SM
#
    1.00000000E+00        3  25  23  23  # h0-Z-Z eff. coupling^2, normalised to SM
    5.52161344E-11        3  35  23  23  # H0-Z-Z eff. coupling^2, normalised to SM
    0.00000000E+00        3  36  23  23  # A0-Z-Z eff. coupling^2, normalised to SM
#
    8.88561806E-01        3  25  21  21  # h0-g-g eff. coupling^2, normalised to SM
    3.31471332E-14        3  35  21  21  # H0-g-g eff. coupling^2, normalised to SM
    3.81999429E-13        3  36  21  21  # A0-g-g eff. coupling^2, normalised to SM
#
    0.00000000E+00        3  25  25  23  # h0-h0-Z eff. coupling^2, normalised to SM
    0.00000000E+00        3  35  25  23  # H0-h0-Z eff. coupling^2, normalised to SM
    5.52161344E-11        3  36  25  23  # A0-h0-Z eff. coupling^2, normalised to SM
    0.00000000E+00        3  35  35  23  # H0-H0-Z eff. coupling^2, normalised to SM
    1.00000000E+00        3  36  35  23  # A0-H0-Z eff. coupling^2, normalised to SM
    0.00000000E+00        3  36  36  23  # A0-A0-Z eff. coupling^2, normalised to SM
#
    0.00000000E+00        4  25  21  21  23  # h0-g-g-Z eff. coupling^2, normalised to SM
    0.00000000E+00        4  35  21  21  23  # H0-g-g-Z eff. coupling^2, normalised to SM
    0.00000000E+00        4  36  21  21  23  # A0-g-g-Z eff. coupling^2, normalised to SM
#
#
#
#                             =================
#                             |The decay table|
#                             =================
#
# - The QCD corrections to the decays gluino -> squark  + quark
#                                     squark -> gaugino + quark_prime
#                                     squark -> squark_prime + Higgs
#                                     squark -> gluino  + quark
#   are included.
#
# - The multi-body decays for the inos, stops and sbottoms are included.
#
# - The loop induced decays for the gluino, neutralinos and stops
#   are included.
#
# - The SUSY decays of the top quark are included.
#
#
#         PDG            Width
DECAY         6     1.44396661E+00   # top decays
#          BR         NDA      ID1       ID2
     1.00000000E+00    2           5        24   # BR(t ->  b    W+)
#
#         PDG            Width
DECAY   1000021     6.25135204E+02   # gluino decays
#          BR         NDA      ID1       ID2
     5.48583625E-02    2     1000001        -1   # BR(~g -> ~d_L  db)
     5.48583625E-02    2    -1000001         1   # BR(~g -> ~d_L* d )
     4.45667252E-02    2     2000001        -1   # BR(~g -> ~d_R  db)
     4.45667252E-02    2    -2000001         1   # BR(~g -> ~d_R* d )
     5.49204056E-02    2     1000002        -2   # BR(~g -> ~u_L  ub)
     5.49204056E-02    2    -1000002         2   # BR(~g -> ~u_L* u )
     4.52500114E-02    2     2000002        -2   # BR(~g -> ~u_R  ub)
     4.52500114E-02    2    -2000002         2   # BR(~g -> ~u_R* u )
     5.48583625E-02    2     1000003        -3   # BR(~g -> ~s_L  sb)
     5.48583625E-02    2    -1000003         3   # BR(~g -> ~s_L* s )
     4.45667252E-02    2     2000003        -3   # BR(~g -> ~s_R  sb)
     4.45667252E-02    2    -2000003         3   # BR(~g -> ~s_R* s )
     5.49204051E-02    2     1000004        -4   # BR(~g -> ~c_L  cb)
     5.49204051E-02    2    -1000004         4   # BR(~g -> ~c_L* c )
     4.52500087E-02    2     2000004        -4   # BR(~g -> ~c_R  cb)
     4.52500087E-02    2    -2000004         4   # BR(~g -> ~c_R* c )
     3.96706268E-02    2     1000005        -5   # BR(~g -> ~b_1  bb)
     3.96706268E-02    2    -1000005         5   # BR(~g -> ~b_1* b )
     2.18894233E-02    2     2000005        -5   # BR(~g -> ~b_2  bb)
     2.18894233E-02    2    -2000005         5   # BR(~g -> ~b_2* b )
     3.92489434E-02    2     1000006        -6   # BR(~g -> ~t_1  tb)
     3.92489434E-02    2    -1000006         6   # BR(~g -> ~t_1* t )
#
#         PDG            Width
DECAY   1000006     1.36799422E+01   # stop1 decays
#          BR         NDA      ID1       ID2
     3.24252932E-01    2     1000022         6   # BR(~t_1 -> ~chi_10 t )
     6.75747068E-01    2     1000024         5   # BR(~t_1 -> ~chi_1+ b )
#
#         PDG            Width
DECAY   2000006     1.21494387E+02   # stop2 decays
#          BR         NDA      ID1       ID2
     2.48235670E-04    2     1000022         6   # BR(~t_2 -> ~chi_10 t )
     7.61816734E-02    2     1000023         6   # BR(~t_2 -> ~chi_20 t )
     7.75905085E-02    2     1000025         6   # BR(~t_2 -> ~chi_30 t )
     4.98940465E-04    2     1000024         5   # BR(~t_2 -> ~chi_1+ b )
     1.55046542E-01    2     1000037         5   # BR(~t_2 -> ~chi_2+ b )
     1.18792900E-01    2     1000021         6   # BR(~t_2 -> ~g      t )
     1.47470303E-01    2     1000006        25   # BR(~t_2 -> ~t_1    h )
     1.43878539E-01    2     1000006        23   # BR(~t_2 -> ~t_1    Z )
     2.79473907E-01    2     1000005        24   # BR(~t_2 -> ~b_1    W+)
     8.18452163E-04    2     2000005        24   # BR(~t_2 -> ~b_2    W+)
#
#         PDG            Width
DECAY   1000005     1.34360030E+01   # sbottom1 decays
#          BR         NDA      ID1       ID2
     3.42669070E-01    2     1000022         5   # BR(~b_1 -> ~chi_10 b )
     6.57330930E-01    2    -1000024         6   # BR(~b_1 -> ~chi_1- t )
#
#         PDG            Width
DECAY   2000005     1.08512258E+01   # sbottom2 decays
#          BR         NDA      ID1       ID2
     1.50738733E-03    2     1000022         5   # BR(~b_2 -> ~chi_10 b )
     2.95847576E-03    2    -1000024         6   # BR(~b_2 -> ~chi_1- t )
     2.39772094E-01    2     1000005        25   # BR(~b_2 -> ~b_1    h )
     2.56971666E-01    2     1000005        23   # BR(~b_2 -> ~b_1    Z )
     4.98790377E-01    2     1000006       -24   # BR(~b_2 -> ~t_1    W-)
#
#         PDG            Width
DECAY   1000002     1.03870446E-01   # sup_L decays
#          BR         NDA      ID1       ID2
     3.35367984E-01    2     1000022         2   # BR(~u_L -> ~chi_10 u)
     6.64632016E-01    2     1000024         1   # BR(~u_L -> ~chi_1+ d)
#
#         PDG            Width
DECAY   2000002     5.13662746E-03   # sup_R decays
#           BR         NDA      ID1       ID2
     1.13269881E-07    2     1000022         2   # BR(~u_R -> ~chi_10 u)
#           BR         NDA      ID1       ID2       ID3
     2.31396964E-01    3        2       -1        1000001   # BR(~u_R -> u  db  ~d_L)
     1.29197612E-02    3        2       1        -1000001   # BR(~u_R -> u  d  ~d_L*)
     2.41948635E-01    3        2       -2        1000002   # BR(~u_R -> u  ub  ~u_L)
     1.32421517E-02    3        2       2        -1000002   # BR(~u_R -> u  u  ~u_L*)
     2.30520903E-01    3        2       -3        1000003   # BR(~u_R -> u  sb  ~s_L)
     1.28605784E-02    3        2       3        -1000003   # BR(~u_R -> u  s  ~s_L*)
     2.41130978E-01    3        2       -4        1000004   # BR(~u_R -> u  cb  ~c_L)
     1.33026973E-02    3        2       4        -1000004   # BR(~u_R -> u  c  ~c_L*)
     2.18489663E-04    3        2       -11        1000011   # BR(~u_R -> u  e+  ~e_L-)
     1.01445940E-05    3        2       11        -1000011   # BR(~u_R -> u  e-  ~e_L+)
     2.28223676E-04    3        2       -12        1000012   # BR(~u_R -> u  nu_eb  ~nu_eL)
     1.04385612E-05    3        2       12        -1000012   # BR(~u_R -> u  nu_e  ~nu_eL*)
     2.19930297E-04    3        2       -13        1000013   # BR(~u_R -> u  mu+  ~mu_L-)
     1.00106540E-05    3        2       13        -1000013   # BR(~u_R -> u  mu-  ~mu_L+)
     2.26549426E-04    3        2       -14        1000014   # BR(~u_R -> u  nu_mub  ~nu_muL)
     1.05466087E-05    3        2       14        -1000014   # BR(~u_R -> u  nu_mu  ~nu_muL*)
     6.95378442E-05    3        2       -15        1000015   # BR(~u_R -> u  tau+  ~tau_1-)
     1.67310167E-03    3        2       15        -1000015   # BR(~u_R -> u  tau-  ~tau_1+)
     2.21078910E-08    3        2       23        1000022   # BR(~u_R -> u  Z  ~chi_10)
     9.97814236E-08    3        2       25        1000022   # BR(~u_R -> u  h  ~chi_10)
     1.09036523E-07    3        2       -24        1000024   # BR(~u_R -> u  W-  ~chi_1+)
     1.47869396E-08    3        2       24        -1000024   # BR(~u_R -> u  W+  ~chi_1-)
#
#         PDG            Width
DECAY   1000001     1.48838731E-01   # sdown_L decays
#          BR         NDA      ID1       ID2
     3.35385889E-01    2     1000022         1   # BR(~d_L -> ~chi_10 d)
     6.64614111E-01    2    -1000024         2   # BR(~d_L -> ~chi_1- u)
#
#         PDG            Width
DECAY   2000001     6.20101822E-03   # sdown_R decays
#           BR         NDA      ID1       ID2
     2.46406929E-08    2     1000022         1   # BR(~d_R -> ~chi_10 d)
#           BR         NDA      ID1       ID2       ID3
     2.33751934E-01    3        1       -1        1000001   # BR(~d_R -> d  db  ~d_L)
     1.32489532E-02    3        1       1        -1000001   # BR(~d_R -> d  d  ~d_L*)
     2.40283119E-01    3        1       -2        1000002   # BR(~d_R -> d  ub  ~u_L)
     1.37795112E-02    3        1       2        -1000002   # BR(~d_R -> d  u  ~u_L*)
     1.34045728E-08    3        1       -2        2000002   # BR(~d_R -> d  ub  ~u_R)
     1.19688408E-07    3        1       2        -2000002   # BR(~d_R -> d  u  ~u_R*)
     2.32236054E-01    3        1       -3        1000003   # BR(~d_R -> d  sb  ~s_L)
     1.31060734E-02    3        1       3        -1000003   # BR(~d_R -> d  s  ~s_L*)
     2.39251030E-01    3        1       -4        1000004   # BR(~d_R -> d  cb  ~c_L)
     1.36635625E-02    3        1       4        -1000004   # BR(~d_R -> d  c  ~c_L*)
     1.33555486E-08    3        1       -4        2000004   # BR(~d_R -> d  cb  ~c_R)
     1.19061092E-07    3        1       4        -2000004   # BR(~d_R -> d  c  ~c_R*)
     5.66906897E-05    3        1       -11        1000011   # BR(~d_R -> d  e+  ~e_L-)
     2.73874377E-06    3        1       11        -1000011   # BR(~d_R -> d  e-  ~e_L+)
     5.90596555E-05    3        1       -12        1000012   # BR(~d_R -> d  nu_eb  ~nu_eL)
     2.81002238E-06    3        1       12        -1000012   # BR(~d_R -> d  nu_e  ~nu_eL*)
     5.70728850E-05    3        1       -13        1000013   # BR(~d_R -> d  mu+  ~mu_L-)
     2.70278193E-06    3        1       13        -1000013   # BR(~d_R -> d  mu-  ~mu_L+)
     5.86210179E-05    3        1       -14        1000014   # BR(~d_R -> d  nu_mub  ~nu_muL)
     2.84001746E-06    3        1       14        -1000014   # BR(~d_R -> d  nu_mu  ~nu_muL*)
     1.81034785E-05    3        1       -15        1000015   # BR(~d_R -> d  tau+  ~tau_1-)
     4.18769935E-04    3        1       15        -1000015   # BR(~d_R -> d  tau-  ~tau_1+)
     5.72712395E-09    3        1       23        1000022   # BR(~d_R -> d  Z  ~chi_10)
     2.54893623E-08    3        1       25        1000022   # BR(~d_R -> d  h  ~chi_10)
     2.87194770E-08    3        1       -24        1000024   # BR(~d_R -> d  W-  ~chi_1+)
     3.85597964E-09    3        1       24        -1000024   # BR(~d_R -> d  W+  ~chi_1-)
#
#         PDG            Width
DECAY   1000004     9.20020752E-02   # scharm_L decays
#          BR         NDA      ID1       ID2
     3.35111700E-01    2     1000022         4   # BR(~c_L -> ~chi_10 c)
     6.64888300E-01    2     1000024         3   # BR(~c_L -> ~chi_1+ s)
#
#         PDG            Width
DECAY   2000004     5.14285489E-03   # scharm_R decays
#           BR         NDA      ID1       ID2
     1.09158642E-07    2     1000022         4   # BR(~c_R -> ~chi_10 c)
#           BR         NDA      ID1       ID2       ID3
     2.30708435E-01    3        4       -1        1000001   # BR(~c_R -> c  db  ~d_L)
     1.26703944E-02    3        4       1        -1000001   # BR(~c_R -> c  d  ~d_L*)
     2.42083440E-01    3        4       -2        1000002   # BR(~c_R -> c  ub  ~u_L)
     1.32780336E-02    3        4       2        -1000002   # BR(~c_R -> c  u  ~u_L*)
     2.31583435E-01    3        4       -3        1000003   # BR(~c_R -> c  sb  ~s_L)
     1.28669779E-02    3        4       3        -1000003   # BR(~c_R -> c  s  ~s_L*)
     2.40858439E-01    3        4       -4        1000004   # BR(~c_R -> c  cb  ~c_L)
     1.32817280E-02    3        4       4        -1000004   # BR(~c_R -> c  c  ~c_L*)
     2.17583429E-04    3        4       -11        1000011   # BR(~c_R -> c  e+  ~e_L-)
     1.02773656E-05    3        4       11        -1000011   # BR(~c_R -> c  e-  ~e_L+)
     2.27850100E-04    3        4       -12        1000012   # BR(~c_R -> c  nu_eb  ~nu_eL)
     1.03592268E-05    3        4       12        -1000012   # BR(~c_R -> c  nu_e  ~nu_eL*)
     2.18244540E-04    3        4       -13        1000013   # BR(~c_R -> c  mu+  ~mu_L-)
     1.00146711E-05    3        4       13        -1000013   # BR(~c_R -> c  mu-  ~mu_L+)
     2.27052877E-04    3        4       -14        1000014   # BR(~c_R -> c  nu_mub  ~nu_muL)
     1.04772546E-05    3        4       14        -1000014   # BR(~c_R -> c  nu_mu  ~nu_muL*)
     6.96403083E-05    3        4       -15        1000015   # BR(~c_R -> c  tau+  ~tau_1-)
     1.66726462E-03    3        4       15        -1000015   # BR(~c_R -> c  tau-  ~tau_1+)
     2.21277875E-08    3        4       23        1000022   # BR(~c_R -> c  Z  ~chi_10)
     9.91414324E-08    3        4       25        1000022   # BR(~c_R -> c  h  ~chi_10)
     1.08599214E-07    3        4       -24        1000024   # BR(~c_R -> c  W-  ~chi_1+)
     1.47429787E-08    3        4       24        -1000024   # BR(~c_R -> c  W+  ~chi_1-)
#
#         PDG            Width
DECAY   1000003     1.32721225E-01   # sstrange_L decays
#          BR         NDA      ID1       ID2
     3.35620461E-01    2     1000022         3   # BR(~s_L -> ~chi_10 s)
     6.64379539E-01    2    -1000024         4   # BR(~s_L -> ~chi_1- c)
#
#         PDG            Width
DECAY   2000003     6.19651021E-03   # sstrange_R decays
#           BR         NDA      ID1       ID2
     2.38276465E-08    2     1000022         3   # BR(~s_R -> ~chi_10 s)
#           BR         NDA      ID1       ID2       ID3
     2.33502399E-01    3        3       -1        1000001   # BR(~s_R -> s  db  ~d_L)
     1.32200218E-02    3        3       1        -1000001   # BR(~s_R -> s  d  ~d_L*)
     2.40102888E-01    3        3       -2        1000002   # BR(~s_R -> s  ub  ~u_L)
     1.37895359E-02    3        3       2        -1000002   # BR(~s_R -> s  u  ~u_L*)
     1.32853812E-08    3        3       -2        2000002   # BR(~s_R -> s  ub  ~u_R)
     1.18920162E-07    3        3       2        -2000002   # BR(~s_R -> s  u  ~u_R*)
     2.32356593E-01    3        3       -3        1000003   # BR(~s_R -> s  sb  ~s_L)
     1.32974847E-02    3        3       3        -1000003   # BR(~s_R -> s  s  ~s_L*)
     2.39425088E-01    3        3       -4        1000004   # BR(~s_R -> s  cb  ~c_L)
     1.36257340E-02    3        3       4        -1000004   # BR(~s_R -> s  c  ~c_L*)
     1.34141633E-08    3        3       -4        2000004   # BR(~s_R -> s  cb  ~c_R)
     1.19039584E-07    3        3       4        -2000004   # BR(~s_R -> s  c  ~c_R*)
     5.67319326E-05    3        3       -11        1000011   # BR(~s_R -> s  e+  ~e_L-)
     2.74073622E-06    3        3       11        -1000011   # BR(~s_R -> s  e-  ~e_L+)
     5.91026219E-05    3        3       -12        1000012   # BR(~s_R -> s  nu_eb  ~nu_eL)
     2.81206670E-06    3        3       12        -1000012   # BR(~s_R -> s  nu_e  ~nu_eL*)
     5.71144060E-05    3        3       -13        1000013   # BR(~s_R -> s  mu+  ~mu_L-)
     2.70474823E-06    3        3       13        -1000013   # BR(~s_R -> s  mu-  ~mu_L+)
     5.86636651E-05    3        3       -14        1000014   # BR(~s_R -> s  nu_mub  ~nu_muL)
     2.84208359E-06    3        3       14        -1000014   # BR(~s_R -> s  nu_mu  ~nu_muL*)
     1.81166489E-05    3        3       -15        1000015   # BR(~s_R -> s  tau+  ~tau_1-)
     4.19074594E-04    3        3       15        -1000015   # BR(~s_R -> s  tau-  ~tau_1+)
     5.73129048E-09    3        3       23        1000022   # BR(~s_R -> s  Z  ~chi_10)
     2.55046784E-08    3        3       25        1000022   # BR(~s_R -> s  h  ~chi_10)
     2.87565087E-08    3        3       -24        1000024   # BR(~s_R -> s  W-  ~chi_1+)
     3.85878489E-09    3        3       24        -1000024   # BR(~s_R -> s  W+  ~chi_1-)
#
#         PDG            Width
DECAY   1000011     1.02840767E+00   # selectron_L decays
#          BR         NDA      ID1       ID2
     3.34070300E-01    2     1000022        11   # BR(~e_L -> ~chi_10 e-)
     6.65929700E-01    2    -1000024        12   # BR(~e_L -> ~chi_1- nu_e)
#
#         PDG            Width
DECAY   2000011     1.88484009E-03   # selectron_R decays
#           BR         NDA      ID1       ID2
     1.69400995E-06    2     1000022        11   # BR(~e_R -> ~chi_10 e-)
#           BR         NDA      ID1       ID2       ID3
     2.72357322E-02    3        11       -1        1000001   # BR(~e_R- -> e-  db  ~d_L)
     3.25942770E-03    3        11       1        -1000001   # BR(~e_R- -> e-  d  ~d_L*)
     2.74155883E-03    3        11       -1        2000001   # BR(~e_R- -> e-  db  ~d_R)
     1.46914320E-02    3        11       1        -2000001   # BR(~e_R- -> e-  d  ~d_R*)
     2.76251552E-02    3        11       -2        1000002   # BR(~e_R- -> e-  ub  ~u_L)
     3.38400060E-03    3        11       2        -1000002   # BR(~e_R- -> e-  u  ~u_L*)
     1.27034649E-02    3        11       -2        2000002   # BR(~e_R- -> e-  ub  ~u_R)
     6.69340601E-02    3        11       2        -2000002   # BR(~e_R- -> e-  u  ~u_R*)
     2.69879658E-02    3        11       -3        1000003   # BR(~e_R- -> e-  sb  ~s_L)
     3.24022183E-03    3        11       3        -1000003   # BR(~e_R- -> e-  s  ~s_L*)
     2.79334041E-03    3        11       -3        2000003   # BR(~e_R- -> e-  sb  ~s_R)
     1.47757893E-02    3        11       3        -2000003   # BR(~e_R- -> e-  s  ~s_R*)
     2.80220058E-02    3        11       -4        1000004   # BR(~e_R- -> e-  cb  ~c_L)
     3.41970655E-03    3        11       4        -1000004   # BR(~e_R- -> e-  c  ~c_L*)
     1.24344766E-02    3        11       -4        2000004   # BR(~e_R- -> e-  cb  ~c_R)
     6.72152511E-02    3        11       4        -2000004   # BR(~e_R- -> e-  c  ~c_R*)
     1.24917759E-03    3        11       -5        1000005   # BR(~e_R- -> e-  bb  ~b_1)
     3.82180962E-04    3        11       5        -1000005   # BR(~e_R- -> e-  b  ~b_1*)
     9.45385239E-08    3        11       -5        2000005   # BR(~e_R- -> e-  bb  ~b_2)
     3.02757779E-07    3        11       5        -2000005   # BR(~e_R- -> e-  b  ~b_2*)
     8.89200101E-04    3        11       -6        1000006   # BR(~e_R- -> e-  tb  ~t_1)
     2.51888742E-04    3        11       6        -1000006   # BR(~e_R- -> e-  t  ~t_1*)
     6.84991797E-02    3        11       -11        1000011   # BR(~e_R- -> e-  e+  ~e_L-)
     8.87502345E-03    3        11       11        -1000011   # BR(~e_R- -> e-  e-  ~e_L+)
     6.90297286E-02    3        11       -12        1000012   # BR(~e_R- -> e-  nu_eb  ~nu_eL)
     8.85539313E-03    3        11       12        -1000012   # BR(~e_R- -> e-  nu_e  ~nu_eL*)
     6.71887237E-02    3        11       -13        1000013   # BR(~e_R- -> e-  mu+  ~mu_L-)
     8.96946117E-03    3        11       13        -1000013   # BR(~e_R- -> e-  mu-  ~mu_L+)
     6.84779577E-02    3        11       -14        1000014   # BR(~e_R- -> e-  nu_mub  ~nu_muL)
     8.88828717E-03    3        11       14        -1000014   # BR(~e_R- -> e-  nu_mu  ~nu_muL*)
     3.98118654E-02    3        11       -15        1000015   # BR(~e_R- -> e-  tau+  ~tau_1-)
     3.30882181E-01    3        11       15        -1000015   # BR(~e_R- -> e-  tau-  ~tau_1+)
     3.46591736E-05    3        11       23        1000022   # BR(~e_R- -> e-  Z  ~chi_10)
     7.47755742E-05    3        11       25        1000022   # BR(~e_R- -> e-  h  ~chi_10)
     1.44866401E-04    3        11       -24        1000024   # BR(~e_R- -> e-  W-  ~chi_1+)
     2.97701647E-05    3        11       24        -1000024   # BR(~e_R- -> e-  W+  ~chi_1-)
#
#         PDG            Width
DECAY   1000013     1.02840751E+00   # smuon_L decays
#          BR         NDA      ID1       ID2
     3.34070196E-01    2     1000022        13   # BR(~mu_L -> ~chi_10 mu-)
     6.65929804E-01    2    -1000024        14   # BR(~mu_L -> ~chi_1- nu_mu)
#
#         PDG            Width
DECAY   2000013     1.88497742E-03   # smuon_R decays
#           BR         NDA      ID1       ID2
     1.69388652E-06    2     1000022        13   # BR(~mu_R -> ~chi_10 mu-)
#           BR         NDA      ID1       ID2       ID3
     2.72337480E-02    3        13       -1        1000001   # BR(~mu_R- -> mu-  db  ~d_L)
     3.25919023E-03    3        13       1        -1000001   # BR(~mu_R- -> mu-  d  ~d_L*)
     2.74135910E-03    3        13       -1        2000001   # BR(~mu_R- -> mu-  db  ~d_R)
     1.46903616E-02    3        13       1        -2000001   # BR(~mu_R- -> mu-  d  ~d_R*)
     2.76231425E-02    3        13       -2        1000002   # BR(~mu_R- -> mu-  ub  ~u_L)
     3.45473634E-03    3        13       2        -1000002   # BR(~mu_R- -> mu-  u  ~u_L*)
     1.27025394E-02    3        13       -2        2000002   # BR(~mu_R- -> mu-  ub  ~u_R)
     6.69291836E-02    3        13       2        -2000002   # BR(~mu_R- -> mu-  u  ~u_R*)
     2.69859996E-02    3        13       -3        1000003   # BR(~mu_R- -> mu-  sb  ~s_L)
     3.23998576E-03    3        13       3        -1000003   # BR(~mu_R- -> mu-  s  ~s_L*)
     2.79313690E-03    3        13       -3        2000003   # BR(~mu_R- -> mu-  sb  ~s_R)
     1.47747128E-02    3        13       3        -2000003   # BR(~mu_R- -> mu-  s  ~s_R*)
     2.80199643E-02    3        13       -4        1000004   # BR(~mu_R- -> mu-  cb  ~c_L)
     3.41945740E-03    3        13       4        -1000004   # BR(~mu_R- -> mu-  c  ~c_L*)
     1.24335707E-02    3        13       -4        2000004   # BR(~mu_R- -> mu-  cb  ~c_R)
     6.72103541E-02    3        13       4        -2000004   # BR(~mu_R- -> mu-  c  ~c_R*)
     1.24903353E-03    3        13       -5        1000005   # BR(~mu_R- -> mu-  bb  ~b_1)
     3.82153119E-04    3        13       5        -1000005   # BR(~mu_R- -> mu-  b  ~b_1*)
     9.35395820E-08    3        13       -5        2000005   # BR(~mu_R- -> mu-  bb  ~b_2)
     3.00412086E-07    3        13       5        -2000005   # BR(~mu_R- -> mu-  b  ~b_2*)
     8.89135318E-04    3        13       -6        1000006   # BR(~mu_R- -> mu-  tb  ~t_1)
     2.53796143E-04    3        13       6        -1000006   # BR(~mu_R- -> mu-  t  ~t_1*)
     6.84941891E-02    3        13       -11        1000011   # BR(~mu_R- -> mu-  e+  ~e_L-)
     8.96880769E-03    3        13       11        -1000011   # BR(~mu_R- -> mu-  e-  ~e_L+)
     6.90246995E-02    3        13       -12        1000012   # BR(~mu_R- -> mu-  nu_eb  ~nu_eL)
     8.85474797E-03    3        13       12        -1000012   # BR(~mu_R- -> mu-  nu_e  ~nu_eL*)
     6.71838286E-02    3        13       -13        1000013   # BR(~mu_R- -> mu-  mu+  ~mu_L-)
     8.87437685E-03    3        13       13        -1000013   # BR(~mu_R- -> mu-  mu-  ~mu_L+)
     6.84729687E-02    3        13       -14        1000014   # BR(~mu_R- -> mu-  nu_mub  ~nu_muL)
     8.88763961E-03    3        13       14        -1000014   # BR(~mu_R- -> mu-  nu_mu  ~nu_muL*)
     3.98089649E-02    3        13       -15        1000015   # BR(~mu_R- -> mu-  tau+  ~tau_1-)
     3.30858074E-01    3        13       15        -1000015   # BR(~mu_R- -> mu-  tau-  ~tau_1+)
     3.46566485E-05    3        13       23        1000022   # BR(~mu_R- -> mu-  Z  ~chi_10)
     7.47701264E-05    3        13       25        1000022   # BR(~mu_R- -> mu-  h  ~chi_10)
     1.44855846E-04    3        13       -24        1000024   # BR(~mu_R- -> mu-  W-  ~chi_1+)
     2.97717094E-05    3        13       24        -1000024   # BR(~mu_R- -> mu-  W+  ~chi_1-)
#
#         PDG            Width
DECAY   1000015     1.80975822E-04   # stau_1 decays
#          BR         NDA      ID1       ID2
     3.35512153E-01    2     1000022        15   # BR(~tau_1 -> ~chi_10  tau-)
     6.64487847E-01    2    -1000024        16   # BR(~tau_1 -> ~chi_1-  nu_tau)
#
#         PDG            Width
DECAY   2000015     5.11622963E+01   # stau_2 decays
#          BR         NDA      ID1       ID2
     2.78559428E-01    2     1000022        15   # BR(~tau_2 -> ~chi_10  tau-)
     3.02879898E-02    2     1000023        15   # BR(~tau_2 -> ~chi_20  tau-)
     3.02310549E-02    2     1000025        15   # BR(~tau_2 -> ~chi_30  tau-)
     5.56127917E-01    2    -1000024        16   # BR(~tau_2 -> ~chi_1-  nu_tau)
     4.18242170E-04    2    -1000037        16   # BR(~tau_2 -> ~chi_2-  nu_tau)
     5.27941600E-02    2     1000015        25   # BR(~tau_2 -> ~tau_1   h)
     5.15812079E-02    2     1000015        23   # BR(~tau_2 -> ~tau_1   Z)
#
#         PDG            Width
DECAY   1000012     9.54072673E-01   # snu_eL decays
#          BR         NDA      ID1       ID2
     3.33677075E-01    2     1000022        12   # BR(~nu_eL -> ~chi_10 nu_e)
     6.66322925E-01    2     1000024        11   # BR(~nu_eL -> ~chi_1+ e-)
#
#         PDG            Width
DECAY   1000014     9.54072348E-01   # snu_muL decays
#          BR         NDA      ID1       ID2
     3.33677188E-01    2     1000022        14   # BR(~nu_muL -> ~chi_10 nu_mu)
     6.66322812E-01    2     1000024        13   # BR(~nu_muL -> ~chi_1+ mu-)
#
#         PDG            Width
DECAY   1000016     5.09956442E+01   # snu_tauL decays
#          BR         NDA      ID1       ID2
     2.79394688E-01    2     1000022        16   # BR(~nu_tauL -> ~chi_10 nu_tau)
     1.31557853E-05    2     1000023        16   # BR(~nu_tauL -> ~chi_20 nu_tau)
     3.54643672E-05    2     1000025        16   # BR(~nu_tauL -> ~chi_30 nu_tau)
     5.59758412E-01    2     1000024        15   # BR(~nu_tauL -> ~chi_1+ tau-)
     6.02044654E-02    2     1000037        15   # BR(~nu_tauL -> ~chi_2+ tau-)
     1.00593815E-01    2    -1000015       -24   # BR(~nu_tauL -> ~tau_1+ W-)
#
#         PDG            Width
DECAY   1000024     3.65059900E-15   # chargino1+ decays
#           BR         NDA      ID1       ID2       ID3
     1.95061100E-02    3     1000022       -11        12   # BR(~chi_1+ -> ~chi_10 e+   nu_e)
     2.23319740E-03    3     1000022       -13        14   # BR(~chi_1+ -> ~chi_10 mu+  nu_mu)
     9.78260690E-01    2     1000022       211             # BR(~chi_1+ -> ~chi_10 pi+)
#
#         PDG            Width
DECAY   1000037     4.90214523E+01   # chargino2+ decays
#          BR         NDA      ID1       ID2
     2.36156583E-05    2     1000002        -1   # BR(~chi_2+ -> ~u_L     db)
     1.14940738E-03    2    -1000001         2   # BR(~chi_2+ -> ~d_L*    u )
     2.36156582E-05    2     1000004        -3   # BR(~chi_2+ -> ~c_L     sb)
     1.14940735E-03    2    -1000003         4   # BR(~chi_2+ -> ~s_L*     c )
     1.14271784E-01    2     1000006        -5   # BR(~chi_2+ -> ~t_1     bb)
     4.89494363E-01    2    -1000005         6   # BR(~chi_2+ -> ~b_1*    t )
     1.78060430E-02    2    -2000005         6   # BR(~chi_2+ -> ~b_2*    t )
     7.70458328E-06    2     1000012       -11   # BR(~chi_2+ -> ~nu_eL   e+  )
     7.70458328E-06    2     1000014       -13   # BR(~chi_2+ -> ~nu_muL mu+ )
     3.74973814E-04    2    -1000011        12   # BR(~chi_2+ -> ~e_L+    nu_e)
     3.74973814E-04    2    -1000013        14   # BR(~chi_2+ -> ~mu_L+   nu_mu)
     7.89866502E-02    2    -1000015        16   # BR(~chi_2+ -> ~tau_1+  nu_tau)
     9.81438444E-02    2     1000024        23   # BR(~chi_2+ -> ~chi_1+  Z )
     9.56028927E-02    2     1000022        24   # BR(~chi_2+ -> ~chi_10  W+)
     1.02583019E-01    2     1000024        25   # BR(~chi_2+ -> ~chi_1+  h )
#
#         PDG            Width
DECAY   1000022     0.00000000E+00   # neutralino1 decays
#
#         PDG            Width
DECAY   1000023     4.83916971E+01   # neutralino2 decays
#          BR         NDA      ID1       ID2
     3.57609549E-02    2     1000022        23   # BR(~chi_20 -> ~chi_10   Z )
     9.66706449E-02    2     1000024       -24   # BR(~chi_20 -> ~chi_1+   W-)
     9.66706449E-02    2    -1000024        24   # BR(~chi_20 -> ~chi_1-   W+)
     6.73744381E-02    2     1000022        25   # BR(~chi_20 -> ~chi_10   h )
     2.55951229E-04    2     1000002        -2   # BR(~chi_20 -> ~u_L      ub)
     2.55951229E-04    2    -1000002         2   # BR(~chi_20 -> ~u_L*     u )
     5.32171683E-05    2     2000002        -2   # BR(~chi_20 -> ~u_R      ub)
     5.32171683E-05    2    -2000002         2   # BR(~chi_20 -> ~u_R*     u )
     1.34393945E-04    2     1000001        -1   # BR(~chi_20 -> ~d_L      db)
     1.34393945E-04    2    -1000001         1   # BR(~chi_20 -> ~d_L*     d )
     1.29008912E-05    2     2000001        -1   # BR(~chi_20 -> ~d_R      db)
     1.29008912E-05    2    -2000001         1   # BR(~chi_20 -> ~d_R*     d )
     2.55951221E-04    2     1000004        -4   # BR(~chi_20 -> ~c_L      cb)
     2.55951221E-04    2    -1000004         4   # BR(~chi_20 -> ~c_L*     c )
     5.32171549E-05    2     2000004        -4   # BR(~chi_20 -> ~c_R      cb)
     5.32171549E-05    2    -2000004         4   # BR(~chi_20 -> ~c_R*     c )
     1.34393945E-04    2     1000003        -3   # BR(~chi_20 -> ~s _L      sb)
     1.34393945E-04    2    -1000003         3   # BR(~chi_20 -> ~s _L*     s )
     1.29008912E-05    2     2000003        -3   # BR(~chi_20 -> ~s _R      sb)
     1.29008912E-05    2    -2000003         3   # BR(~chi_20 -> ~s _R*     s )
     2.42010266E-01    2     1000006        -6   # BR(~chi_20 -> ~t_1      tb)
     2.42010266E-01    2    -1000006         6   # BR(~chi_20 -> ~t_1*     t )
     5.75093982E-02    2     1000005        -5   # BR(~chi_20 -> ~b_1      bb)
     5.75093982E-02    2    -1000005         5   # BR(~chi_20 -> ~b_1*     b )
     1.09137659E-02    2     2000005        -5   # BR(~chi_20 -> ~b_2      bb)
     1.09137659E-02    2    -2000005         5   # BR(~chi_20 -> ~b_2*     b )
     1.35366699E-04    2     1000011       -11   # BR(~chi_20 -> ~e_L-     e+)
     1.35366699E-04    2    -1000011        11   # BR(~chi_20 -> ~e_L+     e-)
     3.22984822E-06    2     2000011       -11   # BR(~chi_20 -> ~e_R-     e+)
     3.22984822E-06    2    -2000011        11   # BR(~chi_20 -> ~e_R+     e-)
     1.35366699E-04    2     1000013       -13   # BR(~chi_20 -> ~mu_L-    mu+)
     1.35366699E-04    2    -1000013        13   # BR(~chi_20 -> ~mu_L+    mu-)
     3.22984822E-06    2     2000013       -13   # BR(~chi_20 -> ~mu_R-    mu+)
     3.22984822E-06    2    -2000013        13   # BR(~chi_20 -> ~mu_R+    mu-)
     4.01041825E-02    2     1000015       -15   # BR(~chi_20 -> ~tau_1-   tau+)
     4.01041825E-02    2    -1000015        15   # BR(~chi_20 -> ~tau_1+   tau-)
     1.69634597E-05    2     1000012       -12   # BR(~chi_20 -> ~nu_eL    nu_eb)
     1.69634597E-05    2    -1000012        12   # BR(~chi_20 -> ~nu_eL*   nu_e )
     1.69634597E-05    2     1000014       -14   # BR(~chi_20 -> ~nu_muL   nu_mub)
     1.69634597E-05    2    -1000014        14   # BR(~chi_20 -> ~nu_muL*  nu_mu )
#
#         PDG            Width
DECAY   1000025     4.89054123E+01   # neutralino3 decays
#          BR         NDA      ID1       ID2
     6.29057243E-02    2     1000022        23   # BR(~chi_30 -> ~chi_10   Z )
     9.56948816E-02    2     1000024       -24   # BR(~chi_30 -> ~chi_1+   W-)
     9.56948816E-02    2    -1000024        24   # BR(~chi_30 -> ~chi_1-   W+)
     3.61549480E-02    2     1000022        25   # BR(~chi_30 -> ~chi_10   h )
     9.59277600E-05    2     1000002        -2   # BR(~chi_30 -> ~u_L      ub)
     9.59277600E-05    2    -1000002         2   # BR(~chi_30 -> ~u_L*     u )
     2.71883263E-06    2     2000002        -2   # BR(~chi_30 -> ~u_R      ub)
     2.71883263E-06    2    -2000002         2   # BR(~chi_30 -> ~u_R*     u )
     1.16126452E-04    2     1000001        -1   # BR(~chi_30 -> ~d_L      db)
     1.16126452E-04    2    -1000001         1   # BR(~chi_30 -> ~d_L*     d )
     6.59103896E-07    2     2000001        -1   # BR(~chi_30 -> ~d_R      db)
     6.59103896E-07    2    -2000001         1   # BR(~chi_30 -> ~d_R*     d )
     9.59277570E-05    2     1000004        -4   # BR(~chi_30 -> ~c_L      cb)
     9.59277570E-05    2    -1000004         4   # BR(~chi_30 -> ~c_L*     c )
     2.71883194E-06    2     2000004        -4   # BR(~chi_30 -> ~c_R      cb)
     2.71883194E-06    2    -2000004         4   # BR(~chi_30 -> ~c_R*     c )
     1.16126452E-04    2     1000003        -3   # BR(~chi_30 -> ~s _L      sb)
     1.16126452E-04    2    -1000003         3   # BR(~chi_30 -> ~s _L*     s )
     6.59103896E-07    2     2000003        -3   # BR(~chi_30 -> ~s _R      sb)
     6.59103896E-07    2    -2000003         3   # BR(~chi_30 -> ~s _R*     s )
     2.46865763E-01    2     1000006        -6   # BR(~chi_30 -> ~t_1      tb)
     2.46865763E-01    2    -1000006         6   # BR(~chi_30 -> ~t_1*     t )
     5.68843915E-02    2     1000005        -5   # BR(~chi_30 -> ~b_1      bb)
     5.68843915E-02    2    -1000005         5   # BR(~chi_30 -> ~b_1*     b )
     1.08008648E-02    2     2000005        -5   # BR(~chi_30 -> ~b_2      bb)
     1.08008648E-02    2    -2000005         5   # BR(~chi_30 -> ~b_2*     b )
     2.52160867E-05    2     1000011       -11   # BR(~chi_30 -> ~e_L-     e+)
     2.52160867E-05    2    -1000011        11   # BR(~chi_30 -> ~e_L+     e-)
     1.65225652E-07    2     2000011       -11   # BR(~chi_30 -> ~e_R-     e+)
     1.65225652E-07    2    -2000011        11   # BR(~chi_30 -> ~e_R+     e-)
     2.52160867E-05    2     1000013       -13   # BR(~chi_30 -> ~mu_L-    mu+)
     2.52160867E-05    2    -1000013        13   # BR(~chi_30 -> ~mu_L+    mu-)
     1.65225652E-07    2     2000013       -13   # BR(~chi_30 -> ~mu_R-    mu+)
     1.65225652E-07    2    -2000013        13   # BR(~chi_30 -> ~mu_R+    mu-)
     3.96515918E-02    2     1000015       -15   # BR(~chi_30 -> ~tau_1-   tau+)
     3.96515918E-02    2    -1000015        15   # BR(~chi_30 -> ~tau_1+   tau-)
     4.52719761E-05    2     1000012       -12   # BR(~chi_30 -> ~nu_eL    nu_eb)
     4.52719761E-05    2    -1000012        12   # BR(~chi_30 -> ~nu_eL*   nu_e )
     4.52719761E-05    2     1000014       -14   # BR(~chi_30 -> ~nu_muL   nu_mub)
     4.52719761E-05    2    -1000014        14   # BR(~chi_30 -> ~nu_muL*  nu_mu )
#
#         PDG            Width
DECAY   1000035     1.34817798E+02   # neutralino4 decays
#          BR         NDA      ID1       ID2
     1.12040383E-05    2     1000022        23   # BR(~chi_40 -> ~chi_10   Z )
     6.90314793E-04    2     1000023        23   # BR(~chi_40 -> ~chi_20   Z )
     1.31684437E-02    2     1000025        23   # BR(~chi_40 -> ~chi_30   Z )
     3.44057231E-05    2     1000024       -24   # BR(~chi_40 -> ~chi_1+   W-)
     3.44057231E-05    2    -1000024        24   # BR(~chi_40 -> ~chi_1-   W+)
     1.34725782E-02    2     1000037       -24   # BR(~chi_40 -> ~chi_2+   W-)
     1.34725782E-02    2    -1000037        24   # BR(~chi_40 -> ~chi_2-   W+)
     1.87351003E-05    2     1000022        25   # BR(~chi_40 -> ~chi_10   h )
     1.43969976E-02    2     1000023        25   # BR(~chi_40 -> ~chi_20   h )
     7.36456048E-04    2     1000025        25   # BR(~chi_40 -> ~chi_30   h )
     5.88666978E-03    2     1000002        -2   # BR(~chi_40 -> ~u_L      ub)
     5.88666978E-03    2    -1000002         2   # BR(~chi_40 -> ~u_L*     u )
     8.21845151E-02    2     2000002        -2   # BR(~chi_40 -> ~u_R      ub)
     8.21845151E-02    2    -2000002         2   # BR(~chi_40 -> ~u_R*     u )
     5.93579883E-03    2     1000001        -1   # BR(~chi_40 -> ~d_L      db)
     5.93579883E-03    2    -1000001         1   # BR(~chi_40 -> ~d_L*     d )
     2.03212964E-02    2     2000001        -1   # BR(~chi_40 -> ~d_R      db)
     2.03212964E-02    2    -2000001         1   # BR(~chi_40 -> ~d_R*     d )
     5.88666975E-03    2     1000004        -4   # BR(~chi_40 -> ~c_L      cb)
     5.88666975E-03    2    -1000004         4   # BR(~chi_40 -> ~c_L*     c )
     8.21845123E-02    2     2000004        -4   # BR(~chi_40 -> ~c_R      cb)
     8.21845123E-02    2    -2000004         4   # BR(~chi_40 -> ~c_R*     c )
     5.93579883E-03    2     1000003        -3   # BR(~chi_40 -> ~s _L      sb)
     5.93579883E-03    2    -1000003         3   # BR(~chi_40 -> ~s _L*     s )
     2.03212964E-02    2     2000003        -3   # BR(~chi_40 -> ~s _R      sb)
     2.03212964E-02    2    -2000003         3   # BR(~chi_40 -> ~s _R*     s )
     5.57993265E-03    2     1000006        -6   # BR(~chi_40 -> ~t_1      tb)
     5.57993265E-03    2    -1000006         6   # BR(~chi_40 -> ~t_1*     t )
     4.87386368E-03    2     1000005        -5   # BR(~chi_40 -> ~b_1      bb)
     4.87386368E-03    2    -1000005         5   # BR(~chi_40 -> ~b_1*     b )
     1.29428689E-02    2     2000005        -5   # BR(~chi_40 -> ~b_2      bb)
     1.29428689E-02    2    -2000005         5   # BR(~chi_40 -> ~b_2*     b )
     1.83738138E-02    2     1000011       -11   # BR(~chi_40 -> ~e_L-     e+)
     1.83738138E-02    2    -1000011        11   # BR(~chi_40 -> ~e_L+     e-)
     3.54282497E-02    2     2000011       -11   # BR(~chi_40 -> ~e_R-     e+)
     3.54282497E-02    2    -2000011        11   # BR(~chi_40 -> ~e_R+     e-)
     1.83738138E-02    2     1000013       -13   # BR(~chi_40 -> ~mu_L-    mu+)
     1.83738138E-02    2    -1000013        13   # BR(~chi_40 -> ~mu_L+    mu-)
     3.54282497E-02    2     2000013       -13   # BR(~chi_40 -> ~mu_R-    mu+)
     3.54282497E-02    2    -2000013        13   # BR(~chi_40 -> ~mu_R+    mu-)
     7.45103200E-02    2     1000015       -15   # BR(~chi_40 -> ~tau_1-   tau+)
     7.45103200E-02    2    -1000015        15   # BR(~chi_40 -> ~tau_1+   tau-)
     4.59007942E-04    2     2000015       -15   # BR(~chi_40 -> ~tau_2-   tau+)
     4.59007942E-04    2    -2000015        15   # BR(~chi_40 -> ~tau_2+   tau-)
     1.84454955E-02    2     1000012       -12   # BR(~chi_40 -> ~nu_eL    nu_eb)
     1.84454955E-02    2    -1000012        12   # BR(~chi_40 -> ~nu_eL*   nu_e )
     1.84454955E-02    2     1000014       -14   # BR(~chi_40 -> ~nu_muL   nu_mub)
     1.84454955E-02    2    -1000014        14   # BR(~chi_40 -> ~nu_muL*  nu_mu )
     4.64271713E-04    2     1000016       -16   # BR(~chi_40 -> ~nu_tau1  nu_taub)
     4.64271713E-04    2    -1000016        16   # BR(~chi_40 -> ~nu_tau1* nu_tau )
#
#         PDG            Width
DECAY        25     5.79536209E-03   # h decays
#          BR         NDA      ID1       ID2
     7.13386063E-01    2           5        -5   # BR(h -> b       bb     )
     4.47692226E-02    2         -15        15   # BR(h -> tau+    tau-   )
     1.58469780E-04    2         -13        13   # BR(h -> mu+     mu-    )
     1.72859031E-04    2           3        -3   # BR(h -> s       sb     )
     1.49907538E-02    2           4        -4   # BR(h -> c       cb     )
     5.53950080E-02    2          21        21   # BR(h -> g       g      )
     1.64218567E-03    2          22        22   # BR(h -> gam     gam    )
     1.10273097E-03    2          22        23   # BR(h -> Z       gam    )
     1.49674622E-01    2          24       -24   # BR(h -> W+      W-     )
     1.87080860E-02    2          23        23   # BR(h -> Z       Z      )
#
#         PDG            Width
DECAY        35     9.56687898E+01   # H decays
#          BR         NDA      ID1       ID2
     6.63133622E-01    2           5        -5   # BR(H -> b       bb     )
     1.45923560E-01    2         -15        15   # BR(H -> tau+    tau-   )
     5.59319355E-04    2         -13        13   # BR(H -> mu+     mu-    )
     6.85021000E-05    2           3        -3   # BR(H -> s       sb     )
     9.75838552E-09    2           4        -4   # BR(H -> c       cb     )
     9.63267638E-04    2           6        -6   # BR(H -> t       tb     )
     4.90773728E-06    2          21        21   # BR(H -> g       g      )
     1.20362989E-09    2          22        22   # BR(H -> gam     gam    )
     4.99798559E-09    2          23        22   # BR(H -> Z       gam    )
     1.11407781E-08    2          24       -24   # BR(H -> W+      W-     )
     5.56104510E-09    2          23        23   # BR(H -> Z       Z      )
     5.56172054E-07    2          25        25   # BR(H -> h       h      )
     6.37061048E-04    2     1000024  -1000024   # BR(H -> ~chi_1+ ~chi_1-)
     5.35141071E-02    2     1000024  -1000037   # BR(H -> ~chi_1+ ~chi_2-)
     5.35141071E-02    2     1000037  -1000024   # BR(H -> ~chi_2+ ~chi_1-)
     3.18389659E-04    2     1000022   1000022   # BR(H -> ~chi_10 ~chi_10)
     2.11381183E-02    2     1000022   1000023   # BR(H -> ~chi_10 ~chi_20)
     3.24064454E-02    2     1000022   1000025   # BR(H -> ~chi_10 ~chi_30)
     2.09139689E-07    2     1000002  -1000002   # BR(H -> ~u_L    ~u_L*  )
     3.15661205E-08    2     2000002  -2000002   # BR(H -> ~u_R    ~u_R*  )
     2.09139689E-07    2     1000004  -1000004   # BR(H -> ~c_L    ~c_L*  )
     3.15661205E-08    2     2000004  -2000004   # BR(H -> ~c_R    ~c_R*  )
     1.17954110E-03    2     1000006  -1000006   # BR(H -> ~t_1    ~t_1*  )
     3.06854148E-07    2     1000001  -1000001   # BR(H -> ~d_L    ~d_L*  )
     7.76875407E-09    2     2000001  -2000001   # BR(H -> ~d_R    ~d_R*  )
     3.06854148E-07    2     1000003  -1000003   # BR(H -> ~s_L    ~s_L*  )
     7.76875407E-09    2     2000003  -2000003   # BR(H -> ~s_R    ~s_R*  )
     4.26976893E-04    2     1000005  -1000005   # BR(H -> ~b_1    ~b_1*  )
     1.30879661E-02    2     1000005  -2000005   # BR(H -> ~b_1    ~b_2*  )
     1.30879661E-02    2     2000005  -1000005   # BR(H -> ~b_2    ~b_1*  )
     4.27300019E-08    2     1000011  -1000011   # BR(H -> ~e_L-   ~e_L+  )
     4.27300019E-08    2     1000013  -1000013   # BR(H -> ~mu_L-  ~mu_L+ )
     3.40781445E-05    2     1000015  -1000015   # BR(H -> ~tau_1- ~tau_1+)
     1.39543268E-07    2     1000012  -1000012   # BR(H -> ~nu_eL  ~nu_eL*   )
     1.39543268E-07    2     1000014  -1000014   # BR(H -> ~nu_muL ~nu_muL*  )
#
#         PDG            Width
DECAY        36     9.55779025E+01   # A decays
#          BR         NDA      ID1       ID2
     6.63851033E-01    2           5        -5   # BR(A -> b       bb     )
     1.46061369E-01    2         -15        15   # BR(A -> tau+    tau-   )
     5.59847101E-04    2         -13        13   # BR(A -> mu+     mu-    )
     6.85697216E-05    2           3        -3   # BR(A -> s       sb     )
     9.85245934E-09    2           4        -4   # BR(A -> c       cb     )
     9.68356697E-04    2           6        -6   # BR(A -> t       tb     )
     1.66759066E-05    2          21        21   # BR(A -> g       g      )
     3.33707148E-09    2          22        22   # BR(A -> gam     gam    )
     1.31996333E-08    2          23        22   # BR(A -> Z       gam    )
     1.13141248E-08    2          23        25   # BR(A -> Z       h      )
     6.62885130E-04    2     1000024  -1000024   # BR(A -> ~chi_1+ ~chi_1-)
     5.35506022E-02    2     1000024  -1000037   # BR(A -> ~chi_1+ ~chi_2-)
     5.35506022E-02    2     1000037  -1000024   # BR(A -> ~chi_2+ ~chi_1-)
     3.31275696E-04    2     1000022   1000022   # BR(A -> ~chi_10 ~chi_10)
     3.24469091E-02    2     1000022   1000023   # BR(A -> ~chi_10 ~chi_20)
     2.11488172E-02    2     1000022   1000025   # BR(A -> ~chi_10 ~chi_30)
     1.33915098E-02    2     1000005  -2000005   # BR(A -> ~b_1    ~b_2*  )
     1.33915098E-02    2    -1000005   2000005   # BR(A -> ~b_1*   ~b_2   )
#
#         PDG            Width
DECAY        37     7.94865559E+01   # H+ decays
#          BR         NDA      ID1       ID2
     6.20757083E-04    2           4        -5   # BR(H+ -> c       bb     )
     1.75667706E-01    2         -15        16   # BR(H+ -> tau+    nu_tau )
     6.73326952E-04    2         -13        14   # BR(H+ -> mu+     nu_mu  )
     6.20756628E-06    2           2        -5   # BR(H+ -> u       bb     )
     4.12706687E-06    2           2        -3   # BR(H+ -> u       sb     )
     8.12445773E-05    2           4        -3   # BR(H+ -> c       sb     )
     3.70153270E-01    2           6        -5   # BR(H+ -> t       bb     )
     1.36182791E-08    2          24        25   # BR(H+ -> W+      h      )
     6.75974987E-15    2          24        36   # BR(H+ -> W+      A      )
     2.57536870E-11    2     1000024   1000022   # BR(H+ -> ~chi_1+ ~chi_10)
     6.47398743E-02    2     1000024   1000023   # BR(H+ -> ~chi_1+ ~chi_20)
     6.46446500E-02    2     1000024   1000025   # BR(H+ -> ~chi_1+ ~chi_30)
     6.46551039E-02    2     1000037   1000022   # BR(H+ -> ~chi_2+ ~chi_10)
     2.02503707E-07    2    -1000011   1000012   # BR(H+ -> ~e_L+   ~nu_eL )
     2.02503707E-07    2    -1000013   1000014   # BR(H+ -> ~mu_L+  ~nu_muL)
     6.15145165E-07    2     1000002  -1000001   # BR(H+ -> ~u_L    ~d_L*  )
     6.15145165E-07    2     1000004  -1000003   # BR(H+ -> ~c_L    ~s_L*  )
     1.55349971E-04    2     1000006  -1000005   # BR(H+ -> ~t_1    ~b_1*  )
     2.58596734E-01    2     1000006  -2000005   # BR(H+ -> ~t_1    ~b_2*  )
