#
#                              ======================
#                              | THE SUSYHIT OUTPUT |
#                              ======================
#
#
#              ------------------------------------------------------
#              |     This is the output of the SUSY-HIT package     |
#              |  created by A.Djouadi, M.Muehlleitner and M.Spira. |
#              |  In case of problems with SUSY-HIT email to        |
#              |           margarete.muehlleitner@cern.ch           |
#              |           michael.spira@psi.ch                     |
#              |           abdelhak.djouadi@cern.ch                 |
#              ------------------------------------------------------
#
#              ------------------------------------------------------
#              |  SUSY Les Houches Accord - MSSM Spectrum + Decays  |
#              |              based on the decay programs           |
#              |                                                    |
#              |                     SDECAY 1.3b                    |
#              |                                                    |
#              |  Authors: M.Muhlleitner, A.Djouadi and Y.Mambrini  |
#              |  Ref.:    Comput.Phys.Commun.168(2005)46           |
#              |           [hep-ph/0311167]                         |
#              |                                                    |
#              |                     HDECAY 3.4                     |
#              |                                                    |
#              |  By: A.Djouadi,J.Kalinowski,M.Muhlleitner,M.Spira  |
#              |  Ref.:    Comput.Phys.Commun.108(1998)56           |
#              |           [hep-ph/9704448]                         |
#              |                                                    |
#              |                                                    |
#              |  If not stated otherwise all DRbar couplings and   |
#              |  soft SUSY breaking masses are given at the scale  |
#              |  Q=  0.31621370E+04
#              |                                                    |
#              ------------------------------------------------------
#
#
BLOCK DCINFO  # Decay Program information
     1   SDECAY/HDECAY # decay calculator
     2   1.3b  /3.4    # version number
#
BLOCK SPINFO  # Spectrum calculator information
     1     SOFTSUSY    # spectrum calculator               
     2     3.4.0       # version number                    
#
BLOCK MODSEL  # Model selection
     1     0   #  nonUniversal                                     
#
BLOCK SMINPUTS  # Standard Model inputs
         1     1.27908970E+02   # alpha_em^-1(M_Z)^MSbar
         2     1.16637870E-05   # G_F [GeV^-2]
         3     1.18400000E-01   # alpha_S(M_Z)^MSbar
         4     9.11876000E+01   # M_Z pole mass
         5     4.18000000E+00   # mb(mb)^MSbar
         6     1.73200000E+02   # mt pole mass
         7     1.77700000E+00   # mtau pole mass
#
BLOCK MINPAR  # Input parameters - minimal models
         3     7.51000000E+00   # tanb                
#
BLOCK EXTPAR  # Input parameters - non-minimal models
         0    -1.00000000E+00   # Set                 
         1     7.22100000E+02   # M_1(MX)             
         2    -3.95974000E+03   # M_2(MX)             
         3     1.52658000E+03   # M_3(MX)             
        11     4.56155000E+03   # At(MX)              
        12    -1.47517000E+03   # Ab(MX)              
        13    -6.93400000E+01   # Atau(MX)            
        23    -2.78430000E+02   # mu(MX)              
        26     7.61880000E+02   # mA(pole)            
        31     3.96940000E+03   # meL(MX)             
        32     3.96940000E+03   # mmuL(MX)            
        33     3.77111000E+03   # mtauL(MX)           
        34     2.56688000E+03   # meR(MX)             
        35     2.56688000E+03   # mmuR(MX)            
        36     3.29887000E+03   # mtauR(MX)           
        41     1.20273000E+03   # mqL1(MX)            
        42     1.20273000E+03   # mqL2(MX)            
        43     2.98251000E+03   # mqL3(MX)            
        44     3.08490000E+03   # muR(MX)             
        45     3.08490000E+03   # mcR(MX)             
        46     3.35360000E+03   # mtR(MX)             
        47     1.92447000E+03   # mdR(MX)             
        48     1.92447000E+03   # msR(MX)             
        49     1.99590000E+02   # mbR(MX)             
#
BLOCK MASS  # Mass Spectrum
# PDG code           mass       particle
        24     8.04075273E+01   # W+
        25     1.25277887E+02   # h
        35     7.62398286E+02   # H
        36     7.61880218E+02   # A
        37     7.66150233E+02   # H+
         5     4.81876030E+00   # b-quark pole mass calculated from mb(mb)_Msbar
   1000001     1.34798009E+03   # ~d_L
   2000001     1.99663948E+03   # ~d_R
   1000002     1.34588698E+03   # ~u_L
   2000002     3.12911648E+03   # ~u_R
   1000003     1.34798009E+03   # ~s_L
   2000003     1.99663948E+03   # ~s_R
   1000004     1.34588698E+03   # ~c_L
   2000004     3.12911648E+03   # ~c_R
   1000005     5.04010286E+02   # ~b_1
   2000005     3.01220318E+03   # ~b_2
   1000006     2.98158846E+03   # ~t_1
   2000006     3.32179002E+03   # ~t_2
   1000011     3.99196079E+03   # ~e_L
   2000011     2.57415033E+03   # ~e_R
   1000012     3.99088329E+03   # ~nu_eL
   1000013     3.99196079E+03   # ~mu_L
   2000013     2.57415033E+03   # ~mu_R
   1000014     3.99088329E+03   # ~nu_muL
   1000015     3.30511785E+03   # ~tau_1
   2000015     3.79442918E+03   # ~tau_2
   1000016     3.79331160E+03   # ~nu_tauL
   1000021     1.69055984E+03   # ~g
   1000022     2.90806300E+02   # ~chi_10
   1000023    -2.91904693E+02   # ~chi_20
   1000025     7.17289896E+02   # ~chi_30
   1000035    -3.92245727E+03   # ~chi_40
   1000024     2.91625036E+02   # ~chi_1+
   1000037     3.92262264E+03   # ~chi_2+
#
BLOCK NMIX  # Neutralino Mixing Matrix
  1  1    -6.21755323E-02   # N_11
  1  2    -1.12407011E-02   # N_12
  1  3     7.07375319E-01   # N_13
  1  4     7.04008528E-01   # N_14
  2  1    -3.48335166E-02   # N_21
  2  2    -1.72500655E-02   # N_22
  2  3    -7.06558788E-01   # N_23
  2  4     7.06585976E-01   # N_24
  3  1     9.97457159E-01   # N_31
  3  2    -1.09059734E-03   # N_32
  3  3     1.94179927E-02   # N_33
  3  4     6.85636040E-02   # N_34
  4  1    -2.11997957E-04   # N_41
  4  2     9.99787424E-01   # N_42
  4  3    -4.21650996E-03   # N_43
  4  4     2.01812691E-02   # N_44
#
BLOCK UMIX  # Chargino Mixing Matrix U
  1  1     5.96230640E-03   # U_11
  1  2     9.99982225E-01   # U_12
  2  1    -9.99982225E-01   # U_21
  2  2     5.96230640E-03   # U_22
#
BLOCK VMIX  # Chargino Mixing Matrix V
  1  1    -2.85424717E-02   # V_11
  1  2    -9.99592581E-01   # V_12
  2  1     9.99592581E-01   # V_21
  2  2    -2.85424717E-02   # V_22
#
BLOCK STOPMIX  # Stop Mixing Matrix
  1  1     9.53319264E-01   # cos(theta_t)
  1  2    -3.01964205E-01   # sin(theta_t)
  2  1     3.01964205E-01   # -sin(theta_t)
  2  2     9.53319264E-01   # cos(theta_t)
#
BLOCK SBOTMIX  # Sbottom Mixing Matrix
  1  1    -8.79766148E-05   # cos(theta_b)
  1  2     9.99999996E-01   # sin(theta_b)
  2  1    -9.99999996E-01   # -sin(theta_b)
  2  2    -8.79766148E-05   # cos(theta_b)
#
BLOCK STAUMIX  # Stau Mixing Matrix
  1  1    -1.02169693E-03   # cos(theta_tau)
  1  2     9.99999478E-01   # sin(theta_tau)
  2  1    -9.99999478E-01   # -sin(theta_tau)
  2  2    -1.02169693E-03   # cos(theta_tau)
#
BLOCK ALPHA  # Higgs mixing
          -1.45093908E-01   # Mixing angle in the neutral Higgs boson sector
#
BLOCK HMIX Q=  3.16213700E+03  # DRbar Higgs Parameters
         1    -2.83030101E+02   # mu(Q)MSSM           
         2     7.13271063E+00   # tan                 
         3     2.42523075E+02   # higgs               
         4     6.00095818E+05   # mA^2(Q)MSSM         
#
BLOCK GAUGE Q=  3.16213700E+03  # The gauge couplings
     1     3.65352587E-01   # gprime(Q) DRbar
     2     6.37674621E-01   # g(Q) DRbar
     3     1.02298899E+00   # g3(Q) DRbar
#
BLOCK AU Q=  3.16213700E+03  # The trilinear couplings
  1  1     0.00000000E+00   # A_u(Q) DRbar
  2  2     0.00000000E+00   # A_c(Q) DRbar
  3  3     4.56155001E+03   # A_t(Q) DRbar
#
BLOCK AD Q=  3.16213700E+03  # The trilinear couplings
  1  1     0.00000000E+00   # A_d(Q) DRbar
  2  2     0.00000000E+00   # A_s(Q) DRbar
  3  3    -1.47517000E+03   # A_b(Q) DRbar
#
BLOCK AE Q=  3.16213700E+03  # The trilinear couplings
  1  1     0.00000000E+00   # A_e(Q) DRbar
  2  2     0.00000000E+00   # A_mu(Q) DRbar
  3  3    -6.93399999E+01   # A_tau(Q) DRbar
#
BLOCK Yu Q=  3.16213700E+03  # The Yukawa couplings
  1  1     0.00000000E+00   # y_u(Q) DRbar
  2  2     0.00000000E+00   # y_c(Q) DRbar
  3  3     8.43492247E-01   # y_t(Q) DRbar
#
BLOCK Yd Q=  3.16213700E+03  # The Yukawa couplings
  1  1     0.00000000E+00   # y_d(Q) DRbar
  2  2     0.00000000E+00   # y_s(Q) DRbar
  3  3     9.84928110E-02   # y_b(Q) DRbar
#
BLOCK Ye Q=  3.16213700E+03  # The Yukawa couplings
  1  1     0.00000000E+00   # y_e(Q) DRbar
  2  2     0.00000000E+00   # y_mu(Q) DRbar
  3  3     7.38674996E-02   # y_tau(Q) DRbar
#
BLOCK MSOFT Q=  3.16213700E+03  # The soft SUSY breaking masses at the scale Q
         1     7.22100000E+02   # M_1(Q)              
         2    -3.95974000E+03   # M_2(Q)              
         3     1.52658000E+03   # M_3(Q)              
        21     4.28627748E+05   # mH1^2(Q)            
        22     9.34012755E+04   # mH2^2(Q)            
        31     3.96940000E+03   # meL(Q)              
        32     3.96940000E+03   # mmuL(Q)             
        33     3.77111000E+03   # mtauL(Q)            
        34     2.56688000E+03   # meR(Q)              
        35     2.56688000E+03   # mmuR(Q)             
        36     3.29887000E+03   # mtauR(Q)            
        41     1.20272999E+03   # mqL1(Q)             
        42     1.20272999E+03   # mqL2(Q)             
        43     2.98251000E+03   # mqL3(Q)             
        44     3.08490000E+03   # muR(Q)              
        45     3.08490000E+03   # mcR(Q)              
        46     3.35360000E+03   # mtR(Q)              
        47     1.92447000E+03   # mdR(Q)              
        48     1.92447000E+03   # msR(Q)              
        49     1.99589956E+02   # mbR(Q)              
#
Block HiggsBoundsInputHiggsCouplingsFermions
# ScalarNormEffCoupSq PseudoSNormEffCoupSq NP   IP1 IP2 IP2
    1.08445465E+00    0.00000000E+00        3  25   5   5  # h0-b-b eff. coupling^2, normalised to SM
    5.07911063E+01    0.00000000E+00        3  35   5   5  # H0-b-b eff. coupling^2, normalised to SM
    0.00000000E+00    5.08755609E+01        3  36   5   5  # A0-b-b eff. coupling^2, normalised to SM
#
    9.98339976E-01    0.00000000E+00        3  25   6   6  # h0-t-t eff. coupling^2, normalised to SM
    2.13158270E-02    0.00000000E+00        3  35   6   6  # H0-t-t eff. coupling^2, normalised to SM
    0.00000000E+00    1.96558029E-02        3  36   6   6  # A0-t-t eff. coupling^2, normalised to SM
#
    1.08445465E+00    0.00000000E+00        3  25  15  15  # h0-tau-tau eff. coupling^2, normalised to SM
    5.07911063E+01    0.00000000E+00        3  35  15  15  # H0-tau-tau eff. coupling^2, normalised to SM
    0.00000000E+00    5.08755609E+01        3  36  15  15  # A0-tau-tau eff. coupling^2, normalised to SM
#
Block HiggsBoundsInputHiggsCouplingsBosons
    9.99966330E-01        3  25  24  24  # h0-W-W eff. coupling^2, normalised to SM
    3.36703192E-05        3  35  24  24  # H0-W-W eff. coupling^2, normalised to SM
    0.00000000E+00        3  36  24  24  # A0-W-W eff. coupling^2, normalised to SM
#
    9.99966330E-01        3  25  23  23  # h0-Z-Z eff. coupling^2, normalised to SM
    3.36703192E-05        3  35  23  23  # H0-Z-Z eff. coupling^2, normalised to SM
    0.00000000E+00        3  36  23  23  # A0-Z-Z eff. coupling^2, normalised to SM
#
    8.80072112E-01        3  25  21  21  # h0-g-g eff. coupling^2, normalised to SM
    4.00782890E-04        3  35  21  21  # H0-g-g eff. coupling^2, normalised to SM
    1.26767610E-03        3  36  21  21  # A0-g-g eff. coupling^2, normalised to SM
#
    0.00000000E+00        3  25  25  23  # h0-h0-Z eff. coupling^2, normalised to SM
    0.00000000E+00        3  35  25  23  # H0-h0-Z eff. coupling^2, normalised to SM
    3.36703192E-05        3  36  25  23  # A0-h0-Z eff. coupling^2, normalised to SM
    0.00000000E+00        3  35  35  23  # H0-H0-Z eff. coupling^2, normalised to SM
    9.99966330E-01        3  36  35  23  # A0-H0-Z eff. coupling^2, normalised to SM
    0.00000000E+00        3  36  36  23  # A0-A0-Z eff. coupling^2, normalised to SM
#
    0.00000000E+00        4  25  21  21  23  # h0-g-g-Z eff. coupling^2, normalised to SM
    0.00000000E+00        4  35  21  21  23  # H0-g-g-Z eff. coupling^2, normalised to SM
    0.00000000E+00        4  36  21  21  23  # A0-g-g-Z eff. coupling^2, normalised to SM
#
#
#
#                             =================
#                             |The decay table|
#                             =================
#
# - The QCD corrections to the decays gluino -> squark  + quark
#                                     squark -> gaugino + quark_prime
#                                     squark -> squark_prime + Higgs
#                                     squark -> gluino  + quark
#   are included.
#
# - The multi-body decays for the inos, stops and sbottoms are included.
#
# - The loop induced decays for the gluino, neutralinos and stops
#   are included.
#
# - The SUSY decays of the top quark are included.
#
#
#         PDG            Width
DECAY         6     1.43130338E+00   # top decays
#          BR         NDA      ID1       ID2
     1.00000000E+00    2           5        24   # BR(t ->  b    W+)
#
#         PDG            Width
DECAY   1000021     4.95220698E+01   # gluino decays
#          BR         NDA      ID1       ID2
     4.69074234E-02    2     1000001        -1   # BR(~g -> ~d_L  db)
     4.69074234E-02    2    -1000001         1   # BR(~g -> ~d_L* d )
     4.74169746E-02    2     1000002        -2   # BR(~g -> ~u_L  ub)
     4.74169746E-02    2    -1000002         2   # BR(~g -> ~u_L* u )
     4.69074234E-02    2     1000003        -3   # BR(~g -> ~s_L  sb)
     4.69074234E-02    2    -1000003         3   # BR(~g -> ~s_L* s )
     4.74165711E-02    2     1000004        -4   # BR(~g -> ~c_L  cb)
     4.74165711E-02    2    -1000004         4   # BR(~g -> ~c_L* c )
     3.11351608E-01    2     1000005        -5   # BR(~g -> ~b_1  bb)
     3.11351608E-01    2    -1000005         5   # BR(~g -> ~b_1* b )
#
#         PDG            Width
DECAY   1000006     1.17994392E+02   # stop1 decays
#          BR         NDA      ID1       ID2
     1.72137497E-01    2     1000022         6   # BR(~t_1 -> ~chi_10 t )
     1.72600931E-01    2     1000023         6   # BR(~t_1 -> ~chi_20 t )
     1.27215363E-02    2     1000025         6   # BR(~t_1 -> ~chi_30 t )
     4.08105202E-02    2     1000024         5   # BR(~t_1 -> ~chi_1+ b )
     6.00654843E-01    2     1000021         6   # BR(~t_1 -> ~g      t )
     1.07376882E-03    2     1000005        37   # BR(~t_1 -> ~b_1    H+)
     9.04050675E-07    2     1000005        24   # BR(~t_1 -> ~b_1    W+)
#
#         PDG            Width
DECAY   2000006     2.20576919E+02   # stop2 decays
#          BR         NDA      ID1       ID2
     1.04080270E-01    2     1000022         6   # BR(~t_2 -> ~chi_10 t )
     1.04959519E-01    2     1000023         6   # BR(~t_2 -> ~chi_20 t )
     2.81205698E-02    2     1000025         6   # BR(~t_2 -> ~chi_30 t )
     1.88259163E-01    2     1000024         5   # BR(~t_2 -> ~chi_1+ b )
     4.73338917E-01    2     1000021         6   # BR(~t_2 -> ~g      t )
     2.41305264E-02    2     1000006        25   # BR(~t_2 -> ~t_1    h )
     2.41287038E-05    2     1000005        37   # BR(~t_2 -> ~b_1    H+)
     2.91887984E-02    2     1000006        23   # BR(~t_2 -> ~t_1    Z )
     6.82878354E-08    2     1000005        24   # BR(~t_2 -> ~b_1    W+)
     4.78980398E-02    2     2000005        24   # BR(~t_2 -> ~b_2    W+)
#
#         PDG            Width
DECAY   1000005     6.39060786E-02   # sbottom1 decays
#          BR         NDA      ID1       ID2
     3.48521673E-01    2     1000022         5   # BR(~b_1 -> ~chi_10 b )
     3.38909221E-01    2     1000023         5   # BR(~b_1 -> ~chi_20 b )
     3.12569106E-01    2    -1000024         6   # BR(~b_1 -> ~chi_1- t )
#
#         PDG            Width
DECAY   2000005     1.21094750E+02   # sbottom2 decays
#          BR         NDA      ID1       ID2
     2.35753629E-03    2     1000022         5   # BR(~b_2 -> ~chi_10 b )
     2.36277631E-03    2     1000023         5   # BR(~b_2 -> ~chi_20 b )
     3.28762928E-03    2     1000025         5   # BR(~b_2 -> ~chi_30 b )
     3.42886964E-01    2    -1000024         6   # BR(~b_2 -> ~chi_1- t )
     6.48026683E-01    2     1000021         5   # BR(~b_2 -> ~g      b )
     1.14325003E-06    2     1000005        25   # BR(~b_2 -> ~b_1    h )
     5.38492979E-04    2     1000005        35   # BR(~b_2 -> ~b_1    H )
     5.38257678E-04    2     1000005        36   # BR(~b_2 -> ~b_1    A )
     5.16710106E-07    2     1000005        23   # BR(~b_2 -> ~b_1    Z )
#
#         PDG            Width
DECAY   1000002     1.12769604E-01   # sup_L decays
#          BR         NDA      ID1       ID2
     2.31588972E-02    2     1000022         2   # BR(~u_L -> ~chi_10 u)
     2.47457408E-02    2     1000023         2   # BR(~u_L -> ~chi_20 u)
     8.81511859E-01    2     1000025         2   # BR(~u_L -> ~chi_30 u)
     7.05835030E-02    2     1000024         1   # BR(~u_L -> ~chi_1+ d)
#
#         PDG            Width
DECAY   2000002     1.31059084E+02   # sup_R decays
#          BR         NDA      ID1       ID2
     2.06173845E-04    2     1000022         2   # BR(~u_R -> ~chi_10 u)
     6.47044708E-05    2     1000023         2   # BR(~u_R -> ~chi_20 u)
     4.85535166E-02    2     1000025         2   # BR(~u_R -> ~chi_30 u)
     9.51175605E-01    2     1000021         2   # BR(~u_R -> ~g      u)
#
#         PDG            Width
DECAY   1000001     1.03005918E-01   # sdown_L decays
#          BR         NDA      ID1       ID2
     1.90882211E-05    2     1000022         1   # BR(~d_L -> ~chi_10 d)
     5.33462033E-03    2     1000023         1   # BR(~d_L -> ~chi_20 d)
     9.91268476E-01    2     1000025         1   # BR(~d_L -> ~chi_30 d)
     3.37781540E-03    2    -1000024         2   # BR(~d_L -> ~chi_1- u)
#
#         PDG            Width
DECAY   2000001     1.35694455E+01   # sdown_R decays
#          BR         NDA      ID1       ID2
     3.06260034E-04    2     1000022         1   # BR(~d_R -> ~chi_10 d)
     9.60966871E-05    2     1000023         1   # BR(~d_R -> ~chi_20 d)
     6.26735802E-02    2     1000025         1   # BR(~d_R -> ~chi_30 d)
     9.36924063E-01    2     1000021         1   # BR(~d_R -> ~g      d)
#
#         PDG            Width
DECAY   1000004     1.13633537E-01   # scharm_L decays
#          BR         NDA      ID1       ID2
     2.32627966E-02    2     1000022         4   # BR(~c_L -> ~chi_10 c)
     2.48565068E-02    2     1000023         4   # BR(~c_L -> ~chi_20 c)
     8.80980860E-01    2     1000025         4   # BR(~c_L -> ~chi_30 c)
     7.08998363E-02    2     1000024         3   # BR(~c_L -> ~chi_1+ s)
#
#         PDG            Width
DECAY   2000004     9.37429775E+01   # scharm_R decays
#          BR         NDA      ID1       ID2
     2.99356905E-04    2     1000022         4   # BR(~c_R -> ~chi_10 c)
     9.39480180E-05    2     1000023         4   # BR(~c_R -> ~chi_20 c)
     7.03702219E-02    2     1000025         4   # BR(~c_R -> ~chi_30 c)
     9.29236473E-01    2     1000021         4   # BR(~c_R -> ~g      c)
#
#         PDG            Width
DECAY   1000003     1.03751014E-01   # sstrange_L decays
#          BR         NDA      ID1       ID2
     1.91842757E-05    2     1000022         3   # BR(~s_L -> ~chi_10 s)
     5.36141040E-03    2     1000023         3   # BR(~s_L -> ~chi_20 s)
     9.91224624E-01    2     1000025         3   # BR(~s_L -> ~chi_30 s)
     3.39478181E-03    2    -1000024         4   # BR(~s_L -> ~chi_1- c)
#
#         PDG            Width
DECAY   2000003     9.77885442E+00   # sstrange_R decays
#          BR         NDA      ID1       ID2
     4.46240330E-04    2     1000022         3   # BR(~s_R -> ~chi_10 s)
     1.40017381E-04    2     1000023         3   # BR(~s_R -> ~chi_20 s)
     9.09324962E-02    2     1000025         3   # BR(~s_R -> ~chi_30 s)
     9.08481246E-01    2     1000021         3   # BR(~s_R -> ~g      s)
#
#         PDG            Width
DECAY   1000011     5.03550808E+00   # selectron_L decays
#          BR         NDA      ID1       ID2
     6.96780488E-03    2     1000022        11   # BR(~e_L -> ~chi_10 e-)
     4.39189187E-03    2     1000023        11   # BR(~e_L -> ~chi_20 e-)
     9.76991342E-01    2     1000025        11   # BR(~e_L -> ~chi_30 e-)
     3.81819144E-03    2     1000035        11   # BR(~e_L -> ~chi_40 e-)
     2.25554815E-04    2    -1000024        12   # BR(~e_L -> ~chi_1- nu_e)
     7.60521500E-03    2    -1000037        12   # BR(~e_L -> ~chi_2- nu_e)
#
#         PDG            Width
DECAY   2000011     1.16394986E+01   # selectron_R decays
#          BR         NDA      ID1       ID2
     4.42554087E-03    2     1000022        11   # BR(~e_R -> ~chi_10 e-)
     1.38879129E-03    2     1000023        11   # BR(~e_R -> ~chi_20 e-)
     9.94185668E-01    2     1000025        11   # BR(~e_R -> ~chi_30 e-)
#
#         PDG            Width
DECAY   1000013     5.03550805E+00   # smuon_L decays
#          BR         NDA      ID1       ID2
     6.96780491E-03    2     1000022        13   # BR(~mu_L -> ~chi_10 mu-)
     4.39189189E-03    2     1000023        13   # BR(~mu_L -> ~chi_20 mu-)
     9.76991346E-01    2     1000025        13   # BR(~mu_L -> ~chi_30 mu-)
     3.81818697E-03    2     1000035        13   # BR(~mu_L -> ~chi_40 mu-)
     2.25554816E-04    2    -1000024        14   # BR(~mu_L -> ~chi_1- nu_mu)
     7.60521504E-03    2    -1000037        14   # BR(~mu_L -> ~chi_2- nu_mu)
#
#         PDG            Width
DECAY   2000013     1.16394985E+01   # smuon_R decays
#          BR         NDA      ID1       ID2
     4.42554087E-03    2     1000022        13   # BR(~mu_R -> ~chi_10 mu-)
     1.38879129E-03    2     1000023        13   # BR(~mu_R -> ~chi_20 mu-)
     9.94185668E-01    2     1000025        13   # BR(~mu_R -> ~chi_30 mu-)
#
#         PDG            Width
DECAY   1000015     1.66524751E+01   # stau_1 decays
#          BR         NDA      ID1       ID2
     1.46323611E-02    2     1000022        15   # BR(~tau_1 -> ~chi_10  tau-)
     1.18479913E-02    2     1000023        15   # BR(~tau_1 -> ~chi_20  tau-)
     9.52307424E-01    2     1000025        15   # BR(~tau_1 -> ~chi_30  tau-)
     2.12122234E-02    2    -1000024        16   # BR(~tau_1 -> ~chi_1-  nu_tau)
#
#         PDG            Width
DECAY   2000015     5.10578446E+00   # stau_2 decays
#          BR         NDA      ID1       ID2
     4.63985742E-02    2     1000022        15   # BR(~tau_2 -> ~chi_10  tau-)
     4.39104664E-02    2     1000023        15   # BR(~tau_2 -> ~chi_20  tau-)
     9.09392370E-01    2     1000025        15   # BR(~tau_2 -> ~chi_30  tau-)
     2.02899041E-04    2    -1000024        16   # BR(~tau_2 -> ~chi_1-  nu_tau)
     4.76357105E-05    2     1000015        25   # BR(~tau_2 -> ~tau_1   h)
     4.80548827E-05    2     1000015        23   # BR(~tau_2 -> ~tau_1   Z)
#
#         PDG            Width
DECAY   1000012     5.04722224E+00   # snu_eL decays
#          BR         NDA      ID1       ID2
     1.88124843E-03    2     1000022        12   # BR(~nu_eL -> ~chi_10 nu_e)
     2.31971200E-05    2     1000023        12   # BR(~nu_eL -> ~chi_20 nu_e)
     9.81892256E-01    2     1000025        12   # BR(~nu_eL -> ~chi_30 nu_e)
     3.69591550E-03    2     1000035        12   # BR(~nu_eL -> ~chi_40 nu_e)
     5.15558312E-03    2     1000024        11   # BR(~nu_eL -> ~chi_1+ e-)
     7.35179945E-03    2     1000037        11   # BR(~nu_eL -> ~chi_2+ e-)
#
#         PDG            Width
DECAY   1000014     5.04722220E+00   # snu_muL decays
#          BR         NDA      ID1       ID2
     1.88124844E-03    2     1000022        14   # BR(~nu_muL -> ~chi_10 nu_mu)
     2.31971203E-05    2     1000023        14   # BR(~nu_muL -> ~chi_20 nu_mu)
     9.81892265E-01    2     1000025        14   # BR(~nu_muL -> ~chi_30 nu_mu)
     3.69591554E-03    2     1000035        14   # BR(~nu_muL -> ~chi_40 nu_mu)
     5.15558316E-03    2     1000024        13   # BR(~nu_muL -> ~chi_1+ mu-)
     7.35179055E-03    2     1000037        13   # BR(~nu_muL -> ~chi_2+ mu-)
#
#         PDG            Width
DECAY   1000016     5.11813009E+00   # snu_tauL decays
#          BR         NDA      ID1       ID2
     1.76133128E-03    2     1000022        16   # BR(~nu_tauL -> ~chi_10 nu_tau)
     2.17182683E-05    2     1000023        16   # BR(~nu_tauL -> ~chi_20 nu_tau)
     9.13797252E-01    2     1000025        16   # BR(~nu_tauL -> ~chi_30 nu_tau)
     8.43263633E-02    2     1000024        15   # BR(~nu_tauL -> ~chi_1+ tau-)
     9.33353343E-05    2    -1000015       -24   # BR(~nu_tauL -> ~tau_1+ W-)
#
#         PDG            Width
DECAY   1000024     1.34891310E-12   # chargino1+ decays
#           BR         NDA      ID1       ID2       ID3
     1.58222020E-01    3     1000022       -11        12   # BR(~chi_1+ -> ~chi_10 e+   nu_e)
     1.45867300E-01    3     1000022       -13        14   # BR(~chi_1+ -> ~chi_10 mu+  nu_mu)
     5.95604080E-01    2     1000022       211             # BR(~chi_1+ -> ~chi_10 pi+)
     9.95995560E-02    3     1000022       211        111   # BR(~chi_1+ -> ~chi_10 pi+ pi0)
     3.53524220E-04    4     1000022       211        111       111 # BR(~chi_1+ -> ~chi_10 pi+ pi0 pi0)
     3.53524220E-04    4     1000022       211        211      -211 # BR(~chi_1+ -> ~chi_10 pi+ pi+ pi-)
#
#         PDG            Width
DECAY   1000037     2.19552442E+02   # chargino2+ decays
#          BR         NDA      ID1       ID2
     1.63306881E-01    2     1000002        -1   # BR(~chi_2+ -> ~u_L     db)
     1.63299088E-01    2    -1000001         2   # BR(~chi_2+ -> ~d_L*    u )
     1.63306881E-01    2     1000004        -3   # BR(~chi_2+ -> ~c_L     sb)
     1.63299079E-01    2    -1000003         4   # BR(~chi_2+ -> ~s_L*     c )
     3.42649955E-02    2     1000006        -5   # BR(~chi_2+ -> ~t_1     bb)
     1.97994612E-03    2     2000006        -5   # BR(~chi_2+ -> ~t_2     bb)
     1.45583681E-07    2    -1000005         6   # BR(~chi_2+ -> ~b_1*    t )
     3.54614002E-02    2    -2000005         6   # BR(~chi_2+ -> ~b_2*    t )
     3.03582698E-04    2     1000016       -15   # BR(~chi_2+ -> ~nu_tau1 tau+)
     6.66200195E-10    2    -1000015        16   # BR(~chi_2+ -> ~tau_1+  nu_tau)
     2.98710056E-04    2    -2000015        16   # BR(~chi_2+ -> ~tau_2+  nu_tau)
     3.70998222E-02    2     1000024        23   # BR(~chi_2+ -> ~chi_1+  Z )
     3.57124898E-02    2     1000022        24   # BR(~chi_2+ -> ~chi_10  W+)
     3.59497436E-02    2     1000023        24   # BR(~chi_2+ -> ~chi_20  W+)
     2.26824285E-04    2     1000025        24   # BR(~chi_2+ -> ~chi_30  W+)
     3.75479455E-02    2     1000024        25   # BR(~chi_2+ -> ~chi_1+  h )
     3.19428010E-02    2     1000024        35   # BR(~chi_2+ -> ~chi_1+  H )
     3.20006025E-02    2     1000024        36   # BR(~chi_2+ -> ~chi_1+  A )
     3.20099277E-02    2     1000022        37   # BR(~chi_2+ -> ~chi_10  H+)
     3.19622361E-02    2     1000023        37   # BR(~chi_2+ -> ~chi_20  H+)
     2.68966494E-05    2     1000025        37   # BR(~chi_2+ -> ~chi_30  H+)
#
#         PDG            Width
DECAY   1000022     0.00000000E+00   # neutralino1 decays
#
#         PDG            Width
DECAY   1000023     3.07799850E-12   # neutralino2 decays
#          BR         NDA      ID1       ID2
     6.34354451E-01    2     1000022        22   # BR(~chi_20 -> ~chi_10 gam)
#           BR         NDA      ID1       ID2       ID3
     6.09589246E-02    3     1000022        -2         2   # BR(~chi_20 -> ~chi_10 ub      u)
     7.91594592E-02    3     1000022        -1         1   # BR(~chi_20 -> ~chi_10 db      d)
     7.91594592E-02    3     1000022        -3         3   # BR(~chi_20 -> ~chi_10 sb      s)
     1.82055463E-02    3     1000022       -11        11   # BR(~chi_20 -> ~chi_10 e+      e-)
     1.82055463E-02    3     1000022       -13        13   # BR(~chi_20 -> ~chi_10 mu+     mu-)
     3.64065733E-02    3     1000022       -12        12   # BR(~chi_20 -> ~chi_10 nu_eb   nu_e)
     3.64065733E-02    3     1000022       -14        14   # BR(~chi_20 -> ~chi_10 nu_mub  nu_mu)
     3.64065735E-02    3     1000022       -16        16   # BR(~chi_20 -> ~chi_10 nu_taub nu_tau)
     2.21068164E-04    3     1000024        -2         1   # BR(~chi_20 -> ~chi_1+ ub      d)
     2.21068164E-04    3    -1000024        -1         2   # BR(~chi_20 -> ~chi_1- db      u)
     7.36891864E-05    3     1000024       -12        11   # BR(~chi_20 -> ~chi_1+ nu_eb   e-)
     7.36891864E-05    3    -1000024        12       -11   # BR(~chi_20 -> ~chi_1- nu_e    e+)
     7.36891864E-05    3     1000024       -14        13   # BR(~chi_20 -> ~chi_1+ nu_mub  mu-)
     7.36891864E-05    3    -1000024        14       -13   # BR(~chi_20 -> ~chi_1- nu_mu   mu+)
#
#         PDG            Width
DECAY   1000025     1.66391779E+00   # neutralino3 decays
#          BR         NDA      ID1       ID2
     5.25103248E-02    2     1000022        23   # BR(~chi_30 -> ~chi_10   Z )
     1.51723680E-01    2     1000023        23   # BR(~chi_30 -> ~chi_20   Z )
     2.00133896E-01    2     1000024       -24   # BR(~chi_30 -> ~chi_1+   W-)
     2.00133896E-01    2    -1000024        24   # BR(~chi_30 -> ~chi_1-   W+)
     1.54171063E-01    2     1000022        25   # BR(~chi_30 -> ~chi_10   h )
     4.66066022E-02    2     1000023        25   # BR(~chi_30 -> ~chi_20   h )
     9.73602690E-02    2     1000005        -5   # BR(~chi_30 -> ~b_1      bb)
     9.73602690E-02    2    -1000005         5   # BR(~chi_30 -> ~b_1*     b )
#
#         PDG            Width
DECAY   1000035     2.19530877E+02   # neutralino4 decays
#          BR         NDA      ID1       ID2
     2.58076214E-02    2     1000022        23   # BR(~chi_40 -> ~chi_10   Z )
     1.11171760E-02    2     1000023        23   # BR(~chi_40 -> ~chi_20   Z )
     1.72142400E-04    2     1000025        23   # BR(~chi_40 -> ~chi_30   Z )
     3.59518452E-02    2     1000024       -24   # BR(~chi_40 -> ~chi_1+   W-)
     3.59518452E-02    2    -1000024        24   # BR(~chi_40 -> ~chi_1-   W+)
     1.08737106E-02    2     1000022        25   # BR(~chi_40 -> ~chi_10   h )
     1.81963409E-02    2     1000022        35   # BR(~chi_40 -> ~chi_10   H )
     1.40029098E-02    2     1000022        36   # BR(~chi_40 -> ~chi_10   A )
     2.65842485E-02    2     1000023        25   # BR(~chi_40 -> ~chi_20   h )
     1.37477446E-02    2     1000023        35   # BR(~chi_40 -> ~chi_20   H )
     1.80112428E-02    2     1000023        36   # BR(~chi_40 -> ~chi_20   A )
     6.59439524E-05    2     1000025        25   # BR(~chi_40 -> ~chi_30   h )
     1.87731380E-05    2     1000025        35   # BR(~chi_40 -> ~chi_30   H )
     8.55743304E-06    2     1000025        36   # BR(~chi_40 -> ~chi_30   A )
     3.19814219E-02    2     1000024       -37   # BR(~chi_40 -> ~chi_1+   H-)
     3.19814219E-02    2    -1000024        37   # BR(~chi_40 -> ~chi_1-   H+)
     8.16813817E-02    2     1000002        -2   # BR(~chi_40 -> ~u_L      ub)
     8.16813817E-02    2    -1000002         2   # BR(~chi_40 -> ~u_L*     u )
     3.70015498E-10    2     2000002        -2   # BR(~chi_40 -> ~u_R      ub)
     3.70015498E-10    2    -2000002         2   # BR(~chi_40 -> ~u_R*     u )
     8.16270595E-02    2     1000001        -1   # BR(~chi_40 -> ~d_L      db)
     8.16270595E-02    2    -1000001         1   # BR(~chi_40 -> ~d_L*     d )
     3.78541193E-10    2     2000001        -1   # BR(~chi_40 -> ~d_R      db)
     3.78541193E-10    2    -2000001         1   # BR(~chi_40 -> ~d_R*     d )
     8.16813774E-02    2     1000004        -4   # BR(~chi_40 -> ~c_L      cb)
     8.16813774E-02    2    -1000004         4   # BR(~chi_40 -> ~c_L*     c )
     3.70014896E-10    2     2000004        -4   # BR(~chi_40 -> ~c_R      cb)
     3.70014896E-10    2    -2000004         4   # BR(~chi_40 -> ~c_R*     c )
     8.16270595E-02    2     1000003        -3   # BR(~chi_40 -> ~s _L      sb)
     8.16270595E-02    2    -1000003         3   # BR(~chi_40 -> ~s _L*     s )
     3.78541193E-10    2     2000003        -3   # BR(~chi_40 -> ~s _R      sb)
     3.78541193E-10    2    -2000003         3   # BR(~chi_40 -> ~s _R*     s )
     1.66706461E-02    2     1000006        -6   # BR(~chi_40 -> ~t_1      tb)
     1.66706461E-02    2    -1000006         6   # BR(~chi_40 -> ~t_1*     t )
     9.35000737E-04    2     2000006        -6   # BR(~chi_40 -> ~t_2      tb)
     9.35000737E-04    2    -2000006         6   # BR(~chi_40 -> ~t_2*     t )
     7.34208872E-08    2     1000005        -5   # BR(~chi_40 -> ~b_1      bb)
     7.34208872E-08    2    -1000005         5   # BR(~chi_40 -> ~b_1*     b )
     1.82404959E-02    2     2000005        -5   # BR(~chi_40 -> ~b_2      bb)
     1.82404959E-02    2    -2000005         5   # BR(~chi_40 -> ~b_2*     b )
     6.91191527E-10    2     2000011       -11   # BR(~chi_40 -> ~e_R-     e+)
     6.91191527E-10    2    -2000011        11   # BR(~chi_40 -> ~e_R+     e-)
     6.91191527E-10    2     2000013       -13   # BR(~chi_40 -> ~mu_R-    mu+)
     6.91191527E-10    2    -2000013        13   # BR(~chi_40 -> ~mu_R+    mu-)
     5.11979157E-10    2     1000015       -15   # BR(~chi_40 -> ~tau_1-   tau+)
     5.11979157E-10    2    -1000015        15   # BR(~chi_40 -> ~tau_1+   tau-)
     1.48886095E-04    2     2000015       -15   # BR(~chi_40 -> ~tau_2-   tau+)
     1.48886095E-04    2    -2000015        15   # BR(~chi_40 -> ~tau_2+   tau-)
     1.51543432E-04    2     1000016       -16   # BR(~chi_40 -> ~nu_tau1  nu_taub)
     1.51543432E-04    2    -1000016        16   # BR(~chi_40 -> ~nu_tau1* nu_tau )
#
#         PDG            Width
DECAY        25     4.27318202E-03   # h decays
#          BR         NDA      ID1       ID2
     6.07301904E-01    2           5        -5   # BR(h -> b       bb     )
     6.58027812E-02    2         -15        15   # BR(h -> tau+    tau-   )
     2.32917224E-04    2         -13        13   # BR(h -> mu+     mu-    )
     2.54107498E-04    2           3        -3   # BR(h -> s       sb     )
     2.02987359E-02    2           4        -4   # BR(h -> c       cb     )
     7.47918842E-02    2          21        21   # BR(h -> g       g      )
     2.22903447E-03    2          22        22   # BR(h -> gam     gam    )
     1.49940259E-03    2          22        23   # BR(h -> Z       gam    )
     2.02175076E-01    2          24       -24   # BR(h -> W+      W-     )
     2.54141576E-02    2          23        23   # BR(h -> Z       Z      )
#
#         PDG            Width
DECAY        35     1.29124508E+00   # H decays
#          BR         NDA      ID1       ID2
     4.22119298E-01    2           5        -5   # BR(H -> b       bb     )
     6.19503471E-02    2         -15        15   # BR(H -> tau+    tau-   )
     2.19044050E-04    2         -13        13   # BR(H -> mu+     mu-    )
     1.71689696E-04    2           3        -3   # BR(H -> s       sb     )
     6.30096535E-06    2           4        -4   # BR(H -> c       cb     )
     4.94956382E-01    2           6        -6   # BR(H -> t       tb     )
     9.44348445E-04    2          21        21   # BR(H -> g       g      )
     3.04218026E-06    2          22        22   # BR(H -> gam     gam    )
     7.33479127E-07    2          23        22   # BR(H -> Z       gam    )
     3.48131049E-03    2          24       -24   # BR(H -> W+      W-     )
     1.70516888E-03    2          23        23   # BR(H -> Z       Z      )
     1.27820873E-02    2          25        25   # BR(H -> h       h      )
     3.11262837E-14    2          23        36   # BR(H -> Z       A      )
     1.00336634E-03    2     1000024  -1000024   # BR(H -> ~chi_1+ ~chi_1-)
     4.21960615E-04    2     1000022   1000022   # BR(H -> ~chi_10 ~chi_10)
     9.07442749E-07    2     1000023   1000023   # BR(H -> ~chi_20 ~chi_20)
     2.34013061E-04    2     1000022   1000023   # BR(H -> ~chi_10 ~chi_20)
#
#         PDG            Width
DECAY        36     1.34451518E+00   # A decays
#          BR         NDA      ID1       ID2
     4.06049546E-01    2           5        -5   # BR(A -> b       bb     )
     5.95557371E-02    2         -15        15   # BR(A -> tau+    tau-   )
     2.10572615E-04    2         -13        13   # BR(A -> mu+     mu-    )
     1.65300154E-04    2           3        -3   # BR(A -> s       sb     )
     5.62776158E-06    2           4        -4   # BR(A -> c       cb     )
     5.25851612E-01    2           6        -6   # BR(A -> t       tb     )
     1.61228231E-03    2          21        21   # BR(A -> g       g      )
     4.65701691E-06    2          22        22   # BR(A -> gam     gam    )
     1.31685384E-06    2          23        22   # BR(A -> Z       gam    )
     3.19366598E-03    2          23        25   # BR(A -> Z       h      )
     2.61884054E-03    2     1000024  -1000024   # BR(A -> ~chi_1+ ~chi_1-)
     5.47094816E-04    2     1000022   1000022   # BR(A -> ~chi_10 ~chi_10)
     3.75703249E-06    2     1000023   1000023   # BR(A -> ~chi_20 ~chi_20)
     1.79990421E-04    2     1000022   1000023   # BR(A -> ~chi_10 ~chi_20)
#
#         PDG            Width
DECAY        37     1.29375309E+00   # H+ decays
#          BR         NDA      ID1       ID2
     7.00332097E-04    2           4        -5   # BR(H+ -> c       bb     )
     6.22393727E-02    2         -15        16   # BR(H+ -> tau+    nu_tau )
     2.20061182E-04    2         -13        14   # BR(H+ -> mu+     nu_mu  )
     7.00311644E-06    2           2        -5   # BR(H+ -> u       bb     )
     8.58276940E-06    2           2        -3   # BR(H+ -> u       sb     )
     1.74545926E-04    2           4        -3   # BR(H+ -> c       sb     )
     9.29390067E-01    2           6        -5   # BR(H+ -> t       bb     )
     3.41549819E-03    2          24        25   # BR(H+ -> W+      h      )
     1.43453050E-09    2          24        36   # BR(H+ -> W+      A      )
     2.79956216E-03    2     1000024   1000022   # BR(H+ -> ~chi_1+ ~chi_10)
     1.04497371E-03    2     1000024   1000023   # BR(H+ -> ~chi_1+ ~chi_20)
