#
#                              ======================
#                              | THE SUSYHIT OUTPUT |
#                              ======================
#
#
#              ------------------------------------------------------
#              |     This is the output of the SUSY-HIT package     |
#              |  created by A.Djouadi, M.Muehlleitner and M.Spira. |
#              |  In case of problems with SUSY-HIT email to        |
#              |           margarete.muehlleitner@cern.ch           |
#              |           michael.spira@psi.ch                     |
#              |           abdelhak.djouadi@cern.ch                 |
#              ------------------------------------------------------
#
#              ------------------------------------------------------
#              |  SUSY Les Houches Accord - MSSM Spectrum + Decays  |
#              |              based on the decay programs           |
#              |                                                    |
#              |                     SDECAY 1.3b                    |
#              |                                                    |
#              |  Authors: M.Muhlleitner, A.Djouadi and Y.Mambrini  |
#              |  Ref.:    Comput.Phys.Commun.168(2005)46           |
#              |           [hep-ph/0311167]                         |
#              |                                                    |
#              |                     HDECAY 3.4                     |
#              |                                                    |
#              |  By: A.Djouadi,J.Kalinowski,M.Muhlleitner,M.Spira  |
#              |  Ref.:    Comput.Phys.Commun.108(1998)56           |
#              |           [hep-ph/9704448]                         |
#              |                                                    |
#              |                                                    |
#              |  If not stated otherwise all DRbar couplings and   |
#              |  soft SUSY breaking masses are given at the scale  |
#              |  Q=  0.35139890E+04
#              |                                                    |
#              ------------------------------------------------------
#
#
BLOCK DCINFO  # Decay Program information
     1   SDECAY/HDECAY # decay calculator
     2   1.3b  /3.4    # version number
#
BLOCK SPINFO  # Spectrum calculator information
     1     SOFTSUSY    # spectrum calculator               
     2     3.4.0       # version number                    
#
BLOCK MODSEL  # Model selection
     1     0   #  nonUniversal                                     
#
BLOCK SMINPUTS  # Standard Model inputs
         1     1.27908970E+02   # alpha_em^-1(M_Z)^MSbar
         2     1.16637870E-05   # G_F [GeV^-2]
         3     1.18400000E-01   # alpha_S(M_Z)^MSbar
         4     9.11876000E+01   # M_Z pole mass
         5     4.18000000E+00   # mb(mb)^MSbar
         6     1.73200000E+02   # mt pole mass
         7     1.77700000E+00   # mtau pole mass
#
BLOCK MINPAR  # Input parameters - minimal models
         3     5.16300000E+01   # tanb                
#
BLOCK EXTPAR  # Input parameters - non-minimal models
         0    -1.00000000E+00   # Set                 
         1     3.92130000E+02   # M_1(MX)             
         2    -2.02370000E+02   # M_2(MX)             
         3     1.72244000E+03   # M_3(MX)             
        11    -2.55258000E+03   # At(MX)              
        12    -6.29400000E+01   # Ab(MX)              
        13     3.69470000E+02   # Atau(MX)            
        23     1.02789000E+03   # mu(MX)              
        26     3.14331000E+03   # mA(pole)            
        31     7.52700000E+02   # meL(MX)             
        32     7.52700000E+02   # mmuL(MX)            
        33     3.16213000E+03   # mtauL(MX)           
        34     2.89077000E+03   # meR(MX)             
        35     2.89077000E+03   # mmuR(MX)            
        36     1.01324000E+03   # mtauR(MX)           
        41     2.82863000E+03   # mqL1(MX)            
        42     2.82863000E+03   # mqL2(MX)            
        43     3.24029000E+03   # mqL3(MX)            
        44     1.28553000E+03   # muR(MX)             
        45     1.28553000E+03   # mcR(MX)             
        46     3.80701000E+03   # mtR(MX)             
        47     1.05526000E+03   # mdR(MX)             
        48     1.05526000E+03   # msR(MX)             
        49     2.74298000E+03   # mbR(MX)             
#
BLOCK MASS  # Mass Spectrum
# PDG code           mass       particle
        24     8.03678706E+01   # W+
        25     1.25400561E+02   # h
        35     3.14331117E+03   # H
        36     3.14331010E+03   # A
        37     3.14474653E+03   # H+
         5     4.81876030E+00   # b-quark pole mass calculated from mb(mb)_Msbar
   1000001     2.89209999E+03   # ~d_L
   2000001     1.19550159E+03   # ~d_R
   1000002     2.89113866E+03   # ~u_L
   2000002     1.41141417E+03   # ~u_R
   1000003     2.89209999E+03   # ~s_L
   2000003     1.19550159E+03   # ~s_R
   1000004     2.89113866E+03   # ~c_L
   2000004     1.41141417E+03   # ~c_R
   1000005     2.76726036E+03   # ~b_1
   2000005     3.25621716E+03   # ~b_2
   1000006     3.25230840E+03   # ~t_1
   2000006     3.80627034E+03   # ~t_2
   1000011     7.58494549E+02   # ~e_L
   2000011     2.89242108E+03   # ~e_R
   1000012     7.53991984E+02   # ~nu_eL
   1000013     7.58494549E+02   # ~mu_L
   2000013     2.89242108E+03   # ~mu_R
   1000014     7.53991984E+02   # ~nu_muL
   1000015     9.75030623E+02   # ~tau_1
   2000015     3.15913484E+03   # ~tau_2
   1000016     3.15763937E+03   # ~nu_tauL
   1000021     1.91252260E+03   # ~g
   1000022    -2.17523071E+02   # ~chi_10
   1000023     3.84198394E+02   # ~chi_20
   1000025     1.06855906E+03   # ~chi_30
   1000035    -1.06877807E+03   # ~chi_40
   1000024     2.17688683E+02   # ~chi_1+
   1000037     1.07100871E+03   # ~chi_2+
#
BLOCK NMIX  # Neutralino Mixing Matrix
  1  1     8.70076135E-04   # N_11
  1  2     9.96975270E-01   # N_12
  1  3    -7.64770064E-02   # N_13
  1  4    -1.38138094E-02   # N_14
  2  1     9.98702254E-01   # N_21
  2  2     2.52448650E-03   # N_22
  2  3     4.75402149E-02   # N_23
  2  4    -1.80931778E-02   # N_24
  3  1     4.64494636E-02   # N_31
  3  2    -4.42800426E-02   # N_32
  3  3    -7.04402440E-01   # N_33
  3  4     7.06893859E-01   # N_34
  4  1    -2.08685995E-02   # N_41
  4  2     6.38217492E-02   # N_42
  4  3     7.04065621E-01   # N_43
  4  4     7.06953243E-01   # N_44
#
BLOCK UMIX  # Chargino Mixing Matrix U
  1  1     9.94160554E-01   # U_11
  1  2    -1.07911043E-01   # U_12
  2  1     1.07911043E-01   # U_21
  2  2     9.94160554E-01   # U_22
#
BLOCK VMIX  # Chargino Mixing Matrix V
  1  1    -9.99810481E-01   # V_11
  1  2    -1.94679892E-02   # V_12
  2  1    -1.94679892E-02   # V_21
  2  2     9.99810481E-01   # V_22
#
BLOCK STOPMIX  # Stop Mixing Matrix
  1  1     9.95380256E-01   # cos(theta_t)
  1  2     9.60111763E-02   # sin(theta_t)
  2  1    -9.60111763E-02   # -sin(theta_t)
  2  2     9.95380256E-01   # cos(theta_t)
#
BLOCK SBOTMIX  # Sbottom Mixing Matrix
  1  1     3.75999984E-02   # cos(theta_b)
  1  2     9.99292870E-01   # sin(theta_b)
  2  1    -9.99292870E-01   # -sin(theta_b)
  2  2     3.75999984E-02   # cos(theta_b)
#
BLOCK STAUMIX  # Stau Mixing Matrix
  1  1     1.05937885E-02   # cos(theta_tau)
  1  2     9.99943884E-01   # sin(theta_tau)
  2  1    -9.99943884E-01   # -sin(theta_tau)
  2  2     1.05937885E-02   # cos(theta_tau)
#
BLOCK ALPHA  # Higgs mixing
          -1.96893669E-02   # Mixing angle in the neutral Higgs boson sector
#
BLOCK HMIX Q=  3.51398900E+03  # DRbar Higgs Parameters
         1     1.05260375E+03   # mu(Q)MSSM           
         2     5.08767488E+01   # tan                 
         3     2.41787623E+02   # higgs               
         4     9.84221328E+06   # mA^2(Q)MSSM         
#
BLOCK GAUGE Q=  3.51398900E+03  # The gauge couplings
     1     3.65831944E-01   # gprime(Q) DRbar
     2     6.42457613E-01   # g(Q) DRbar
     3     1.01763980E+00   # g3(Q) DRbar
#
BLOCK AU Q=  3.51398900E+03  # The trilinear couplings
  1  1     0.00000000E+00   # A_u(Q) DRbar
  2  2     0.00000000E+00   # A_c(Q) DRbar
  3  3    -2.55257998E+03   # A_t(Q) DRbar
#
BLOCK AD Q=  3.51398900E+03  # The trilinear couplings
  1  1     0.00000000E+00   # A_d(Q) DRbar
  2  2     0.00000000E+00   # A_s(Q) DRbar
  3  3    -6.29399898E+01   # A_b(Q) DRbar
#
BLOCK AE Q=  3.51398900E+03  # The trilinear couplings
  1  1     0.00000000E+00   # A_e(Q) DRbar
  2  2     0.00000000E+00   # A_mu(Q) DRbar
  3  3     3.69470004E+02   # A_tau(Q) DRbar
#
BLOCK Yu Q=  3.51398900E+03  # The Yukawa couplings
  1  1     0.00000000E+00   # y_u(Q) DRbar
  2  2     0.00000000E+00   # y_c(Q) DRbar
  3  3     8.14473635E-01   # y_t(Q) DRbar
#
BLOCK Yd Q=  3.51398900E+03  # The Yukawa couplings
  1  1     0.00000000E+00   # y_d(Q) DRbar
  2  2     0.00000000E+00   # y_s(Q) DRbar
  3  3     6.13624320E-01   # y_b(Q) DRbar
#
BLOCK Ye Q=  3.51398900E+03  # The Yukawa couplings
  1  1     0.00000000E+00   # y_e(Q) DRbar
  2  2     0.00000000E+00   # y_mu(Q) DRbar
  3  3     5.20461458E-01   # y_tau(Q) DRbar
#
BLOCK MSOFT Q=  3.51398900E+03  # The soft SUSY breaking masses at the scale Q
         1     3.92130000E+02   # M_1(Q)              
         2    -2.02370000E+02   # M_2(Q)              
         3     1.72244000E+03   # M_3(Q)              
        21     9.13200970E+06   # mH1^2(Q)            
        22    -8.14920328E+05   # mH2^2(Q)            
        31     7.52700000E+02   # meL(Q)              
        32     7.52700000E+02   # mmuL(Q)             
        33     3.16213000E+03   # mtauL(Q)            
        34     2.89077000E+03   # meR(Q)              
        35     2.89077000E+03   # mmuR(Q)             
        36     1.01324000E+03   # mtauR(Q)            
        41     2.82863000E+03   # mqL1(Q)             
        42     2.82863000E+03   # mqL2(Q)             
        43     3.24028999E+03   # mqL3(Q)             
        44     1.28552999E+03   # muR(Q)              
        45     1.28552999E+03   # mcR(Q)              
        46     3.80700999E+03   # mtR(Q)              
        47     1.05525999E+03   # mdR(Q)              
        48     1.05525999E+03   # msR(Q)              
        49     2.74297999E+03   # mbR(Q)              
#
Block HiggsBoundsInputHiggsCouplingsFermions
# ScalarNormEffCoupSq PseudoSNormEffCoupSq NP   IP1 IP2 IP2
    1.00372290E+00    0.00000000E+00        3  25   5   5  # h0-b-b eff. coupling^2, normalised to SM
    2.58843985E+03    0.00000000E+00        3  35   5   5  # H0-b-b eff. coupling^2, normalised to SM
    0.00000000E+00    2.58844357E+03        3  36   5   5  # A0-b-b eff. coupling^2, normalised to SM
#
    9.99998562E-01    0.00000000E+00        3  25   6   6  # h0-t-t eff. coupling^2, normalised to SM
    3.87770826E-04    0.00000000E+00        3  35   6   6  # H0-t-t eff. coupling^2, normalised to SM
    0.00000000E+00    3.86332548E-04        3  36   6   6  # A0-t-t eff. coupling^2, normalised to SM
#
    1.00372290E+00    0.00000000E+00        3  25  15  15  # h0-tau-tau eff. coupling^2, normalised to SM
    2.58843985E+03    0.00000000E+00        3  35  15  15  # H0-tau-tau eff. coupling^2, normalised to SM
    0.00000000E+00    2.58844357E+03        3  36  15  15  # A0-tau-tau eff. coupling^2, normalised to SM
#
Block HiggsBoundsInputHiggsCouplingsBosons
    9.99999999E-01        3  25  24  24  # h0-W-W eff. coupling^2, normalised to SM
    1.33615583E-09        3  35  24  24  # H0-W-W eff. coupling^2, normalised to SM
    0.00000000E+00        3  36  24  24  # A0-W-W eff. coupling^2, normalised to SM
#
    9.99999999E-01        3  25  23  23  # h0-Z-Z eff. coupling^2, normalised to SM
    1.33615583E-09        3  35  23  23  # H0-Z-Z eff. coupling^2, normalised to SM
    0.00000000E+00        3  36  23  23  # A0-Z-Z eff. coupling^2, normalised to SM
#
    8.89944259E-01        3  25  21  21  # h0-g-g eff. coupling^2, normalised to SM
    2.28293437E-12        3  35  21  21  # H0-g-g eff. coupling^2, normalised to SM
    5.63969023E-12        3  36  21  21  # A0-g-g eff. coupling^2, normalised to SM
#
    0.00000000E+00        3  25  25  23  # h0-h0-Z eff. coupling^2, normalised to SM
    0.00000000E+00        3  35  25  23  # H0-h0-Z eff. coupling^2, normalised to SM
    1.33615583E-09        3  36  25  23  # A0-h0-Z eff. coupling^2, normalised to SM
    0.00000000E+00        3  35  35  23  # H0-H0-Z eff. coupling^2, normalised to SM
    9.99999999E-01        3  36  35  23  # A0-H0-Z eff. coupling^2, normalised to SM
    0.00000000E+00        3  36  36  23  # A0-A0-Z eff. coupling^2, normalised to SM
#
    0.00000000E+00        4  25  21  21  23  # h0-g-g-Z eff. coupling^2, normalised to SM
    0.00000000E+00        4  35  21  21  23  # H0-g-g-Z eff. coupling^2, normalised to SM
    0.00000000E+00        4  36  21  21  23  # A0-g-g-Z eff. coupling^2, normalised to SM
#
#
#
#                             =================
#                             |The decay table|
#                             =================
#
# - The QCD corrections to the decays gluino -> squark  + quark
#                                     squark -> gaugino + quark_prime
#                                     squark -> squark_prime + Higgs
#                                     squark -> gluino  + quark
#   are included.
#
# - The multi-body decays for the inos, stops and sbottoms are included.
#
# - The loop induced decays for the gluino, neutralinos and stops
#   are included.
#
# - The SUSY decays of the top quark are included.
#
#
#         PDG            Width
DECAY         6     1.45464546E+00   # top decays
#          BR         NDA      ID1       ID2
     1.00000000E+00    2           5        24   # BR(t ->  b    W+)
#
#         PDG            Width
DECAY   1000021     4.63521189E+01   # gluino decays
#          BR         NDA      ID1       ID2
     1.60395771E-01    2     2000001        -1   # BR(~g -> ~d_R  db)
     1.60395771E-01    2    -2000001         1   # BR(~g -> ~d_R* d )
     8.96043914E-02    2     2000002        -2   # BR(~g -> ~u_R  ub)
     8.96043914E-02    2    -2000002         2   # BR(~g -> ~u_R* u )
     1.60395771E-01    2     2000003        -3   # BR(~g -> ~s_R  sb)
     1.60395771E-01    2    -2000003         3   # BR(~g -> ~s_R* s )
     8.96040673E-02    2     2000004        -4   # BR(~g -> ~c_R  cb)
     8.96040673E-02    2    -2000004         4   # BR(~g -> ~c_R* c )
#
#         PDG            Width
DECAY   1000006     1.70775931E+02   # stop1 decays
#          BR         NDA      ID1       ID2
     7.55602072E-02    2     1000022         6   # BR(~t_1 -> ~chi_10 t )
     3.54666031E-03    2     1000023         6   # BR(~t_1 -> ~chi_20 t )
     9.77191587E-02    2     1000025         6   # BR(~t_1 -> ~chi_30 t )
     1.01701014E-01    2     1000035         6   # BR(~t_1 -> ~chi_40 t )
     1.54402865E-01    2     1000024         5   # BR(~t_1 -> ~chi_1+ b )
     1.13479462E-01    2     1000037         5   # BR(~t_1 -> ~chi_2+ b )
     4.49973404E-01    2     1000021         6   # BR(~t_1 -> ~g      t )
     3.61722888E-03    2     1000005        24   # BR(~t_1 -> ~b_1    W+)
#
#         PDG            Width
DECAY   2000006     2.20756178E+02   # stop2 decays
#          BR         NDA      ID1       ID2
     1.01511689E-03    2     1000022         6   # BR(~t_2 -> ~chi_10 t )
     3.91457127E-02    2     1000023         6   # BR(~t_2 -> ~chi_20 t )
     9.77756521E-02    2     1000025         6   # BR(~t_2 -> ~chi_30 t )
     9.45057432E-02    2     1000035         6   # BR(~t_2 -> ~chi_40 t )
     2.05820042E-03    2     1000024         5   # BR(~t_2 -> ~chi_1+ b )
     1.91542980E-01    2     1000037         5   # BR(~t_2 -> ~chi_2+ b )
     5.19252130E-01    2     1000021         6   # BR(~t_2 -> ~g      t )
     1.31445692E-02    2     1000006        25   # BR(~t_2 -> ~t_1    h )
     1.40686864E-02    2     1000006        23   # BR(~t_2 -> ~t_1    Z )
     2.14822706E-04    2     1000005        24   # BR(~t_2 -> ~b_1    W+)
     2.72763857E-02    2     2000005        24   # BR(~t_2 -> ~b_2    W+)
#
#         PDG            Width
DECAY   1000005     7.30596029E+01   # sbottom1 decays
#          BR         NDA      ID1       ID2
     3.04295436E-03    2     1000022         5   # BR(~b_1 -> ~chi_10 b )
     2.24973301E-02    2     1000023         5   # BR(~b_1 -> ~chi_20 b )
     1.01388540E-01    2     1000025         5   # BR(~b_1 -> ~chi_30 b )
     1.01224685E-01    2     1000035         5   # BR(~b_1 -> ~chi_40 b )
     6.00472317E-03    2    -1000024         6   # BR(~b_1 -> ~chi_1- t )
     1.97881987E-01    2    -1000037         6   # BR(~b_1 -> ~chi_2- t )
     5.67959781E-01    2     1000021         5   # BR(~b_1 -> ~g      b )
#
#         PDG            Width
DECAY   2000005     1.70939225E+02   # sbottom2 decays
#          BR         NDA      ID1       ID2
     7.71409996E-02    2     1000022         5   # BR(~b_2 -> ~chi_10 b )
     2.77737564E-03    2     1000023         5   # BR(~b_2 -> ~chi_20 b )
     5.68757269E-02    2     1000025         5   # BR(~b_2 -> ~chi_30 b )
     5.69237574E-02    2     1000035         5   # BR(~b_2 -> ~chi_40 b )
     1.50985508E-01    2    -1000024         6   # BR(~b_2 -> ~chi_1- t )
     2.02479866E-01    2    -1000037         6   # BR(~b_2 -> ~chi_2- t )
     4.48936201E-01    2     1000021         5   # BR(~b_2 -> ~g      b )
     1.98656976E-03    2     1000005        25   # BR(~b_2 -> ~b_1    h )
     1.89399574E-03    2     1000005        23   # BR(~b_2 -> ~b_1    Z )
#
#         PDG            Width
DECAY   1000002     1.06858847E+02   # sup_L decays
#          BR         NDA      ID1       ID2
     1.04601093E-01    2     1000022         2   # BR(~u_L -> ~chi_10 u)
     3.79281829E-03    2     1000023         2   # BR(~u_L -> ~chi_20 u)
     1.00268538E-04    2     1000025         2   # BR(~u_L -> ~chi_30 u)
     2.85646309E-04    2     1000035         2   # BR(~u_L -> ~chi_40 u)
     2.10320657E-01    2     1000024         1   # BR(~u_L -> ~chi_1+ d)
     6.03459987E-05    2     1000037         1   # BR(~u_L -> ~chi_2+ d)
     6.80839171E-01    2     1000021         2   # BR(~u_L -> ~g      u)
#
#         PDG            Width
DECAY   2000002     2.84003300E+00   # sup_R decays
#          BR         NDA      ID1       ID2
     8.42131163E-07    2     1000022         2   # BR(~u_R -> ~chi_10 u)
     9.99438282E-01    2     1000023         2   # BR(~u_R -> ~chi_20 u)
     4.66762588E-04    2     1000025         2   # BR(~u_R -> ~chi_30 u)
     9.41129763E-05    2     1000035         2   # BR(~u_R -> ~chi_40 u)
#
#         PDG            Width
DECAY   1000001     1.06902172E+02   # sdown_L decays
#          BR         NDA      ID1       ID2
     1.04525972E-01    2     1000022         1   # BR(~d_L -> ~chi_10 d)
     3.59590690E-03    2     1000023         1   # BR(~d_L -> ~chi_20 d)
     2.24799529E-04    2     1000025         1   # BR(~d_L -> ~chi_30 d)
     3.66307620E-04    2     1000035         1   # BR(~d_L -> ~chi_40 d)
     2.07938724E-01    2    -1000024         2   # BR(~d_L -> ~chi_1- u)
     1.85438836E-03    2    -1000037         2   # BR(~d_L -> ~chi_2- u)
     6.81493901E-01    2     1000021         1   # BR(~d_L -> ~g      d)
#
#         PDG            Width
DECAY   2000001     5.69634017E-01   # sdown_R decays
#          BR         NDA      ID1       ID2
     8.81046733E-07    2     1000022         1   # BR(~d_R -> ~chi_10 d)
     9.99863361E-01    2     1000023         1   # BR(~d_R -> ~chi_20 d)
     1.13018575E-04    2     1000025         1   # BR(~d_R -> ~chi_30 d)
     2.27396951E-05    2     1000035         1   # BR(~d_R -> ~chi_40 d)
#
#         PDG            Width
DECAY   1000004     8.58443274E+01   # scharm_L decays
#          BR         NDA      ID1       ID2
     1.35933963E-01    2     1000022         4   # BR(~c_L -> ~chi_10 c)
     4.92340227E-03    2     1000023         4   # BR(~c_L -> ~chi_20 c)
     1.29637757E-04    2     1000025         4   # BR(~c_L -> ~chi_30 c)
     3.69313211E-04    2     1000035         4   # BR(~c_L -> ~chi_40 c)
     2.73321266E-01    2     1000024         3   # BR(~c_L -> ~chi_1+ s)
     7.80205399E-05    2     1000037         3   # BR(~c_L -> ~chi_2+ s)
     5.85244398E-01    2     1000021         4   # BR(~c_L -> ~g      c)
#
#         PDG            Width
DECAY   2000004     2.85783817E+00   # scharm_R decays
#          BR         NDA      ID1       ID2
     8.43318966E-07    2     1000022         4   # BR(~c_R -> ~chi_10 c)
     9.99447103E-01    2     1000023         4   # BR(~c_R -> ~chi_20 c)
     4.59421850E-04    2     1000025         4   # BR(~c_R -> ~chi_30 c)
     9.26314641E-05    2     1000035         4   # BR(~c_R -> ~chi_40 c)
#
#         PDG            Width
DECAY   1000003     8.58530385E+01   # sstrange_L decays
#          BR         NDA      ID1       ID2
     1.35876417E-01    2     1000022         3   # BR(~s_L -> ~chi_10 s)
     4.66917487E-03    2     1000023         3   # BR(~s_L -> ~chi_20 s)
     2.90731498E-04    2     1000025         3   # BR(~s_L -> ~chi_30 s)
     4.73742170E-04    2     1000035         3   # BR(~s_L -> ~chi_40 s)
     2.70305321E-01    2    -1000024         4   # BR(~s_L -> ~chi_1- c)
     2.39822816E-03    2    -1000037         4   # BR(~s_L -> ~chi_2- c)
     5.85986385E-01    2     1000021         3   # BR(~s_L -> ~g      s)
#
#         PDG            Width
DECAY   2000003     5.67381533E-01   # sstrange_R decays
#          BR         NDA      ID1       ID2
     8.82323483E-07    2     1000022         3   # BR(~s_R -> ~chi_10 s)
     9.99868465E-01    2     1000023         3   # BR(~s_R -> ~chi_20 s)
     1.08769474E-04    2     1000025         3   # BR(~s_R -> ~chi_30 s)
     2.18834809E-05    2     1000035         3   # BR(~s_R -> ~chi_40 s)
#
#         PDG            Width
DECAY   1000011     8.35478339E+00   # selectron_L decays
#          BR         NDA      ID1       ID2
     3.12363932E-01    2     1000022        11   # BR(~e_L -> ~chi_10 e-)
     6.72171290E-02    2     1000023        11   # BR(~e_L -> ~chi_20 e-)
     6.20418939E-01    2    -1000024        12   # BR(~e_L -> ~chi_1- nu_e)
#
#         PDG            Width
DECAY   2000011     1.48548053E+01   # selectron_R decays
#          BR         NDA      ID1       ID2
     7.76079158E-07    2     1000022        11   # BR(~e_R -> ~chi_10 e-)
     9.97994462E-01    2     1000023        11   # BR(~e_R -> ~chi_20 e-)
     1.66810186E-03    2     1000025        11   # BR(~e_R -> ~chi_30 e-)
     3.36659976E-04    2     1000035        11   # BR(~e_R -> ~chi_40 e-)
#
#         PDG            Width
DECAY   1000013     8.35478323E+00   # smuon_L decays
#          BR         NDA      ID1       ID2
     3.12363924E-01    2     1000022        13   # BR(~mu_L -> ~chi_10 mu-)
     6.72171255E-02    2     1000023        13   # BR(~mu_L -> ~chi_20 mu-)
     6.20418951E-01    2    -1000024        14   # BR(~mu_L -> ~chi_1- nu_mu)
#
#         PDG            Width
DECAY   2000013     1.48548053E+01   # smuon_R decays
#          BR         NDA      ID1       ID2
     7.76079158E-07    2     1000022        13   # BR(~mu_R -> ~chi_10 mu-)
     9.97994462E-01    2     1000023        13   # BR(~mu_R -> ~chi_20 mu-)
     1.66810186E-03    2     1000025        13   # BR(~mu_R -> ~chi_30 mu-)
     3.36659975E-04    2     1000035        13   # BR(~mu_R -> ~chi_40 mu-)
#
#         PDG            Width
DECAY   1000015     3.80898513E+00   # stau_1 decays
#          BR         NDA      ID1       ID2
     9.14728315E-03    2     1000022        15   # BR(~tau_1 -> ~chi_10  tau-)
     9.72647470E-01    2     1000023        15   # BR(~tau_1 -> ~chi_20  tau-)
     1.82052471E-02    2    -1000024        16   # BR(~tau_1 -> ~chi_1-  nu_tau)
#
#         PDG            Width
DECAY   2000015     5.76095143E+01   # stau_2 decays
#          BR         NDA      ID1       ID2
     2.23166392E-01    2     1000022        15   # BR(~tau_2 -> ~chi_10  tau-)
     7.18346902E-02    2     1000023        15   # BR(~tau_2 -> ~chi_20  tau-)
     1.15270571E-01    2     1000025        15   # BR(~tau_2 -> ~chi_30  tau-)
     1.15572754E-01    2     1000035        15   # BR(~tau_2 -> ~chi_40  tau-)
     4.39960507E-01    2    -1000024        16   # BR(~tau_2 -> ~chi_1-  nu_tau)
     4.78218251E-03    2    -1000037        16   # BR(~tau_2 -> ~chi_2-  nu_tau)
     1.45931354E-02    2     1000015        25   # BR(~tau_2 -> ~tau_1   h)
     1.48197670E-02    2     1000015        23   # BR(~tau_2 -> ~tau_1   Z)
#
#         PDG            Width
DECAY   1000012     8.32766185E+00   # snu_eL decays
#          BR         NDA      ID1       ID2
     3.10235187E-01    2     1000022        12   # BR(~nu_eL -> ~chi_10 nu_e)
     6.53125120E-02    2     1000023        12   # BR(~nu_eL -> ~chi_20 nu_e)
     6.24452301E-01    2     1000024        11   # BR(~nu_eL -> ~chi_1+ e-)
#
#         PDG            Width
DECAY   1000014     8.32766160E+00   # snu_muL decays
#          BR         NDA      ID1       ID2
     3.10235196E-01    2     1000022        14   # BR(~nu_muL -> ~chi_10 nu_mu)
     6.53125139E-02    2     1000023        14   # BR(~nu_muL -> ~chi_20 nu_mu)
     6.24452290E-01    2     1000024        13   # BR(~nu_muL -> ~chi_1+ mu-)
#
#         PDG            Width
DECAY   1000016     5.76009041E+01   # snu_tauL decays
#          BR         NDA      ID1       ID2
     2.21374515E-01    2     1000022        16   # BR(~nu_tauL -> ~chi_10 nu_tau)
     7.00243969E-02    2     1000023        16   # BR(~nu_tauL -> ~chi_20 nu_tau)
     8.82844566E-04    2     1000025        16   # BR(~nu_tauL -> ~chi_30 nu_tau)
     1.01130890E-03    2     1000035        16   # BR(~nu_tauL -> ~chi_40 nu_tau)
     4.49120486E-01    2     1000024        15   # BR(~nu_tauL -> ~chi_1+ tau-)
     2.28792615E-01    2     1000037        15   # BR(~nu_tauL -> ~chi_2+ tau-)
     2.87938329E-02    2    -1000015       -24   # BR(~nu_tauL -> ~tau_1+ W-)
#
#         PDG            Width
DECAY   1000024     3.74027510E-15   # chargino1+ decays
#           BR         NDA      ID1       ID2       ID3
     1.94631880E-02    3     1000022       -11        12   # BR(~chi_1+ -> ~chi_10 e+   nu_e)
     2.28213340E-03    3     1000022       -13        14   # BR(~chi_1+ -> ~chi_10 mu+  nu_mu)
     9.78254680E-01    2     1000022       211             # BR(~chi_1+ -> ~chi_10 pi+)
#
#         PDG            Width
DECAY   1000037     6.99169030E+00   # chargino2+ decays
#          BR         NDA      ID1       ID2
     6.06401869E-05    2     1000012       -11   # BR(~chi_2+ -> ~nu_eL   e+  )
     6.06401869E-05    2     1000014       -13   # BR(~chi_2+ -> ~nu_muL mu+ )
     1.81955621E-03    2    -1000011        12   # BR(~chi_2+ -> ~e_L+    nu_e)
     1.81955621E-03    2    -1000013        14   # BR(~chi_2+ -> ~mu_L+   nu_mu)
     1.19211650E-02    2    -1000015        16   # BR(~chi_2+ -> ~tau_1+  nu_tau)
     2.99795590E-01    2     1000024        23   # BR(~chi_2+ -> ~chi_1+  Z )
     2.93512021E-01    2     1000022        24   # BR(~chi_2+ -> ~chi_10  W+)
     9.48454373E-02    2     1000023        24   # BR(~chi_2+ -> ~chi_20  W+)
     2.96165394E-01    2     1000024        25   # BR(~chi_2+ -> ~chi_1+  h )
#
#         PDG            Width
DECAY   1000022     0.00000000E+00   # neutralino1 decays
#
#         PDG            Width
DECAY   1000023     2.13706031E-04   # neutralino2 decays
#          BR         NDA      ID1       ID2
     2.49141924E-01    2     1000022        23   # BR(~chi_20 -> ~chi_10   Z )
     3.65941842E-01    2     1000024       -24   # BR(~chi_20 -> ~chi_1+   W-)
     3.65941842E-01    2    -1000024        24   # BR(~chi_20 -> ~chi_1-   W+)
     1.89743925E-02    2     1000022        25   # BR(~chi_20 -> ~chi_10   h )
#
#         PDG            Width
DECAY   1000025     6.94854143E+00   # neutralino3 decays
#          BR         NDA      ID1       ID2
     2.02741917E-01    2     1000022        23   # BR(~chi_30 -> ~chi_10   Z )
     1.65626042E-02    2     1000023        23   # BR(~chi_30 -> ~chi_20   Z )
     2.95130621E-01    2     1000024       -24   # BR(~chi_30 -> ~chi_1+   W-)
     2.95130621E-01    2    -1000024        24   # BR(~chi_30 -> ~chi_1-   W+)
     9.55467631E-02    2     1000022        25   # BR(~chi_30 -> ~chi_10   h )
     8.16727719E-02    2     1000023        25   # BR(~chi_30 -> ~chi_20   h )
     2.47061207E-05    2     1000011       -11   # BR(~chi_30 -> ~e_L-     e+)
     2.47061207E-05    2    -1000011        11   # BR(~chi_30 -> ~e_L+     e-)
     2.47061207E-05    2     1000013       -13   # BR(~chi_30 -> ~mu_L-    mu+)
     2.47061207E-05    2    -1000013        13   # BR(~chi_30 -> ~mu_L+    mu-)
     5.76161805E-03    2     1000015       -15   # BR(~chi_30 -> ~tau_1-   tau+)
     5.76161805E-03    2    -1000015        15   # BR(~chi_30 -> ~tau_1+   tau-)
     3.98160144E-04    2     1000012       -12   # BR(~chi_30 -> ~nu_eL    nu_eb)
     3.98160144E-04    2    -1000012        12   # BR(~chi_30 -> ~nu_eL*   nu_e )
     3.98160144E-04    2     1000014       -14   # BR(~chi_30 -> ~nu_muL   nu_mub)
     3.98160144E-04    2    -1000014        14   # BR(~chi_30 -> ~nu_muL*  nu_mu )
#
#         PDG            Width
DECAY   1000035     6.98333100E+00   # neutralino4 decays
#          BR         NDA      ID1       ID2
     9.87346739E-02    2     1000022        23   # BR(~chi_40 -> ~chi_10   Z )
     7.90905619E-02    2     1000023        23   # BR(~chi_40 -> ~chi_20   Z )
     2.94646028E-01    2     1000024       -24   # BR(~chi_40 -> ~chi_1+   W-)
     2.94646028E-01    2    -1000024        24   # BR(~chi_40 -> ~chi_1-   W+)
     2.02260076E-01    2     1000022        25   # BR(~chi_40 -> ~chi_10   h )
     1.64733298E-02    2     1000023        25   # BR(~chi_40 -> ~chi_20   h )
     2.08804080E-04    2     1000011       -11   # BR(~chi_40 -> ~e_L-     e+)
     2.08804080E-04    2    -1000011        11   # BR(~chi_40 -> ~e_L+     e-)
     2.08804080E-04    2     1000013       -13   # BR(~chi_40 -> ~mu_L-    mu+)
     2.08804080E-04    2    -1000013        13   # BR(~chi_40 -> ~mu_L+    mu-)
     5.74837284E-03    2     1000015       -15   # BR(~chi_40 -> ~tau_1-   tau+)
     5.74837284E-03    2    -1000015        15   # BR(~chi_40 -> ~tau_1+   tau-)
     4.54335137E-04    2     1000012       -12   # BR(~chi_40 -> ~nu_eL    nu_eb)
     4.54335137E-04    2    -1000012        12   # BR(~chi_40 -> ~nu_eL*   nu_e )
     4.54335137E-04    2     1000014       -14   # BR(~chi_40 -> ~nu_muL   nu_mub)
     4.54335137E-04    2    -1000014        14   # BR(~chi_40 -> ~nu_muL*  nu_mu )
#
#         PDG            Width
DECAY        25     4.42067040E-03   # h decays
#          BR         NDA      ID1       ID2
     6.20282470E-01    2           5        -5   # BR(h -> b       bb     )
     5.89392049E-02    2         -15        15   # BR(h -> tau+    tau-   )
     2.08642060E-04    2         -13        13   # BR(h -> mu+     mu-    )
     2.27426663E-04    2           3        -3   # BR(h -> s       sb     )
     1.96695517E-02    2           4        -4   # BR(h -> c       cb     )
     7.29123394E-02    2          21        21   # BR(h -> g       g      )
     2.15627840E-03    2          22        22   # BR(h -> gam     gam    )
     1.46313697E-03    2          22        23   # BR(h -> Z       gam    )
     1.99196715E-01    2          24       -24   # BR(h -> W+      W-     )
     2.49442344E-02    2          23        23   # BR(h -> Z       Z      )
#
#         PDG            Width
DECAY        35     1.37521887E+02   # H decays
#          BR         NDA      ID1       ID2
     6.28960163E-01    2           5        -5   # BR(H -> b       bb     )
     1.24597583E-01    2         -15        15   # BR(H -> tau+    tau-   )
     4.64037956E-04    2         -13        13   # BR(H -> mu+     mu-    )
     1.81278386E-04    2           3        -3   # BR(H -> s       sb     )
     3.61481537E-09    2           4        -4   # BR(H -> c       cb     )
     3.55596551E-04    2           6        -6   # BR(H -> t       tb     )
     1.16003948E-05    2          21        21   # BR(H -> g       g      )
     1.60331244E-08    2          22        22   # BR(H -> gam     gam    )
     6.91108279E-09    2          23        22   # BR(H -> Z       gam    )
     9.69960227E-08    2          24       -24   # BR(H -> W+      W-     )
     4.83962754E-08    2          23        23   # BR(H -> Z       Z      )
     4.73288344E-07    2          25        25   # BR(H -> h       h      )
     2.20580765E-03    2     1000024  -1000024   # BR(H -> ~chi_1+ ~chi_1-)
     3.50322599E-05    2     1000037  -1000037   # BR(H -> ~chi_2+ ~chi_2-)
     7.37245644E-02    2     1000024  -1000037   # BR(H -> ~chi_1+ ~chi_2-)
     7.37245644E-02    2     1000037  -1000024   # BR(H -> ~chi_2+ ~chi_1-)
     1.10069008E-03    2     1000022   1000022   # BR(H -> ~chi_10 ~chi_10)
     1.11641887E-04    2     1000023   1000023   # BR(H -> ~chi_20 ~chi_20)
     1.74298668E-04    2     1000025   1000025   # BR(H -> ~chi_30 ~chi_30)
     2.21436929E-04    2     1000035   1000035   # BR(H -> ~chi_40 ~chi_40)
     7.31672699E-04    2     1000022   1000023   # BR(H -> ~chi_10 ~chi_20)
     3.67527616E-02    2     1000022   1000025   # BR(H -> ~chi_10 ~chi_30)
     3.56757381E-02    2     1000022   1000035   # BR(H -> ~chi_10 ~chi_40)
     8.76658251E-03    2     1000023   1000025   # BR(H -> ~chi_20 ~chi_30)
     1.14724584E-02    2     1000023   1000035   # BR(H -> ~chi_20 ~chi_40)
     7.31126846E-04    2     1000025   1000035   # BR(H -> ~chi_30 ~chi_40)
     9.49337578E-09    2     2000002  -2000002   # BR(H -> ~u_R    ~u_R*  )
     9.49337578E-09    2     2000004  -2000004   # BR(H -> ~c_R    ~c_R*  )
     3.50220323E-09    2     2000001  -2000001   # BR(H -> ~d_R    ~d_R*  )
     3.50220323E-09    2     2000003  -2000003   # BR(H -> ~s_R    ~s_R*  )
     2.17915139E-08    2     1000011  -1000011   # BR(H -> ~e_L-   ~e_L+  )
     2.17915139E-08    2     1000013  -1000013   # BR(H -> ~mu_L-  ~mu_L+ )
     5.06994431E-07    2     1000015  -1000015   # BR(H -> ~tau_1- ~tau_1+)
     7.12464678E-08    2     1000012  -1000012   # BR(H -> ~nu_eL  ~nu_eL*   )
     7.12464678E-08    2     1000014  -1000014   # BR(H -> ~nu_muL ~nu_muL*  )
#
#         PDG            Width
DECAY        36     1.37524493E+02   # A decays
#          BR         NDA      ID1       ID2
     6.28958251E-01    2           5        -5   # BR(A -> b       bb     )
     1.24595516E-01    2         -15        15   # BR(A -> tau+    tau-   )
     4.64029653E-04    2         -13        13   # BR(A -> mu+     mu-    )
     1.81280134E-04    2           3        -3   # BR(A -> s       sb     )
     3.63471096E-09    2           4        -4   # BR(A -> c       cb     )
     3.57071385E-04    2           6        -6   # BR(A -> t       tb     )
     1.82324411E-05    2          21        21   # BR(A -> g       g      )
     7.17470381E-10    2          22        22   # BR(A -> gam     gam    )
     1.27071183E-08    2          23        22   # BR(A -> Z       gam    )
     9.82982951E-08    2          23        25   # BR(A -> Z       h      )
     2.21738857E-03    2     1000024  -1000024   # BR(A -> ~chi_1+ ~chi_1-)
     4.21050675E-05    2     1000037  -1000037   # BR(A -> ~chi_2+ ~chi_2-)
     7.37144547E-02    2     1000024  -1000037   # BR(A -> ~chi_1+ ~chi_2-)
     7.37144547E-02    2     1000037  -1000024   # BR(A -> ~chi_2+ ~chi_1-)
     1.10632815E-03    2     1000022   1000022   # BR(A -> ~chi_10 ~chi_10)
     1.22345294E-04    2     1000023   1000023   # BR(A -> ~chi_20 ~chi_20)
     3.50762337E-04    2     1000025   1000025   # BR(A -> ~chi_30 ~chi_30)
     3.80626355E-04    2     1000035   1000035   # BR(A -> ~chi_40 ~chi_40)
     7.13601770E-04    2     1000022   1000023   # BR(A -> ~chi_10 ~chi_20)
     3.57593257E-02    2     1000022   1000025   # BR(A -> ~chi_10 ~chi_30)
     3.66713904E-02    2     1000022   1000035   # BR(A -> ~chi_10 ~chi_40)
     1.14969423E-02    2     1000023   1000025   # BR(A -> ~chi_20 ~chi_30)
     8.74143999E-03    2     1000023   1000035   # BR(A -> ~chi_20 ~chi_40)
     3.94338481E-04    2     1000025   1000035   # BR(A -> ~chi_30 ~chi_40)
#
#         PDG            Width
DECAY        37     1.25021743E+02   # H+ decays
#          BR         NDA      ID1       ID2
     9.94649902E-04    2           4        -5   # BR(H+ -> c       bb     )
     1.37118274E-01    2         -15        16   # BR(H+ -> tau+    nu_tau )
     5.10668014E-04    2         -13        14   # BR(H+ -> mu+     nu_mu  )
     9.94648833E-06    2           2        -5   # BR(H+ -> u       bb     )
     9.97753155E-06    2           2        -3   # BR(H+ -> u       sb     )
     1.96391947E-04    2           4        -3   # BR(H+ -> c       sb     )
     5.91343238E-01    2           6        -5   # BR(H+ -> t       bb     )
     1.08338933E-07    2          24        25   # BR(H+ -> W+      h      )
     6.43530689E-14    2          24        36   # BR(H+ -> W+      A      )
     1.30595072E-09    2     1000024   1000022   # BR(H+ -> ~chi_1+ ~chi_10)
     1.59713106E-03    2     1000024   1000023   # BR(H+ -> ~chi_1+ ~chi_20)
     8.09982746E-02    2     1000024   1000025   # BR(H+ -> ~chi_1+ ~chi_30)
     8.14988401E-02    2     1000024   1000035   # BR(H+ -> ~chi_1+ ~chi_40)
     8.26792751E-02    2     1000037   1000022   # BR(H+ -> ~chi_2+ ~chi_10)
     2.23943581E-02    2     1000037   1000023   # BR(H+ -> ~chi_2+ ~chi_20)
     4.64977505E-04    2     1000037   1000025   # BR(H+ -> ~chi_2+ ~chi_30)
     1.83699740E-04    2     1000037   1000035   # BR(H+ -> ~chi_2+ ~chi_40)
     9.42826374E-08    2    -1000011   1000012   # BR(H+ -> ~e_L+   ~nu_eL )
     9.42826374E-08    2    -1000013   1000014   # BR(H+ -> ~mu_L+  ~nu_muL)
