#
#                              ======================
#                              | THE SUSYHIT OUTPUT |
#                              ======================
#
#
#              ------------------------------------------------------
#              |     This is the output of the SUSY-HIT package     |
#              |  created by A.Djouadi, M.Muehlleitner and M.Spira. |
#              |  In case of problems with SUSY-HIT email to        |
#              |           margarete.muehlleitner@cern.ch           |
#              |           michael.spira@psi.ch                     |
#              |           abdelhak.djouadi@cern.ch                 |
#              ------------------------------------------------------
#
#              ------------------------------------------------------
#              |  SUSY Les Houches Accord - MSSM Spectrum + Decays  |
#              |              based on the decay programs           |
#              |                                                    |
#              |                     SDECAY 1.3b                    |
#              |                                                    |
#              |  Authors: M.Muhlleitner, A.Djouadi and Y.Mambrini  |
#              |  Ref.:    Comput.Phys.Commun.168(2005)46           |
#              |           [hep-ph/0311167]                         |
#              |                                                    |
#              |                     HDECAY 3.4                     |
#              |                                                    |
#              |  By: A.Djouadi,J.Kalinowski,M.Muhlleitner,M.Spira  |
#              |  Ref.:    Comput.Phys.Commun.108(1998)56           |
#              |           [hep-ph/9704448]                         |
#              |                                                    |
#              |                                                    |
#              |  If not stated otherwise all DRbar couplings and   |
#              |  soft SUSY breaking masses are given at the scale  |
#              |  Q=  0.39072660E+04
#              |                                                    |
#              ------------------------------------------------------
#
#
BLOCK DCINFO  # Decay Program information
     1   SDECAY/HDECAY # decay calculator
     2   1.3b  /3.4    # version number
#
BLOCK SPINFO  # Spectrum calculator information
     1     SOFTSUSY    # spectrum calculator               
     2     3.4.0       # version number                    
#
BLOCK MODSEL  # Model selection
     1     0   #  nonUniversal                                     
#
BLOCK SMINPUTS  # Standard Model inputs
         1     1.27908970E+02   # alpha_em^-1(M_Z)^MSbar
         2     1.16637870E-05   # G_F [GeV^-2]
         3     1.18400000E-01   # alpha_S(M_Z)^MSbar
         4     9.11876000E+01   # M_Z pole mass
         5     4.18000000E+00   # mb(mb)^MSbar
         6     1.73200000E+02   # mt pole mass
         7     1.77700000E+00   # mtau pole mass
#
BLOCK MINPAR  # Input parameters - minimal models
         3     6.52000000E+00   # tanb                
#
BLOCK EXTPAR  # Input parameters - non-minimal models
         0    -1.00000000E+00   # Set                 
         1     4.21100000E+01   # M_1(MX)             
         2    -1.27956000E+03   # M_2(MX)             
         3     1.61658000E+03   # M_3(MX)             
        11    -6.85128000E+03   # At(MX)              
        12    -2.44659000E+03   # Ab(MX)              
        13     3.91087000E+03   # Atau(MX)            
        23    -2.23680000E+02   # mu(MX)              
        26     1.89784000E+03   # mA(pole)            
        31     1.01063000E+03   # meL(MX)             
        32     1.01063000E+03   # mmuL(MX)            
        33     2.68698000E+03   # mtauL(MX)           
        34     3.30472000E+03   # meR(MX)             
        35     3.30472000E+03   # mmuR(MX)            
        36     3.19343000E+03   # mtauR(MX)           
        41     1.35897000E+03   # mqL1(MX)            
        42     1.35897000E+03   # mqL2(MX)            
        43     3.91793000E+03   # mqL3(MX)            
        44     3.44553000E+03   # muR(MX)             
        45     3.44553000E+03   # mcR(MX)             
        46     3.89964000E+03   # mtR(MX)             
        47     3.60065000E+03   # mdR(MX)             
        48     3.60065000E+03   # msR(MX)             
        49     2.05920000E+02   # mbR(MX)             
#
BLOCK MASS  # Mass Spectrum
# PDG code           mass       particle
        24     8.03767880E+01   # W+
        25     1.27010276E+02   # h
        35     1.89814676E+03   # H
        36     1.89784002E+03   # A
        37     1.89977356E+03   # H+
         5     4.81876030E+00   # b-quark pole mass calculated from mb(mb)_Msbar
   1000001     1.49603464E+03   # ~d_L
   2000001     3.65138782E+03   # ~d_R
   1000002     1.49419229E+03   # ~u_L
   2000002     3.49564843E+03   # ~u_R
   1000003     1.49603464E+03   # ~s_L
   2000003     3.65138782E+03   # ~s_R
   1000004     1.49419229E+03   # ~c_L
   2000004     3.49564843E+03   # ~c_R
   1000005     5.50129620E+02   # ~b_1
   2000005     3.90070955E+03   # ~b_2
   1000006     3.72302339E+03   # ~t_1
   2000006     3.98121775E+03   # ~t_2
   1000011     1.03288066E+03   # ~e_L
   2000011     3.30996214E+03   # ~e_R
   1000012     1.02975346E+03   # ~nu_eL
   1000013     1.03288066E+03   # ~mu_L
   2000013     3.30996214E+03   # ~mu_R
   1000014     1.02975346E+03   # ~nu_muL
   1000015     2.69565136E+03   # ~tau_1
   2000015     3.19810435E+03   # ~tau_2
   1000016     2.69424970E+03   # ~nu_tauL
   1000021     1.82364164E+03   # ~g
   1000022     4.28379887E+01   # ~chi_10
   1000023    -2.34466151E+02   # ~chi_20
   1000025     2.38162826E+02   # ~chi_30
   1000035    -1.29994214E+03   # ~chi_40
   1000024     2.31454344E+02   # ~chi_1+
   1000037     1.30011022E+03   # ~chi_2+
#
BLOCK NMIX  # Neutralino Mixing Matrix
  1  1     9.83018511E-01   # N_11
  1  2    -1.33908931E-03   # N_12
  1  3    -1.83444078E-01   # N_13
  1  4    -4.59183675E-03   # N_14
  2  1     1.27253225E-01   # N_21
  2  2     5.88272917E-02   # N_22
  2  3     6.99032411E-01   # N_23
  2  4    -7.01212988E-01   # N_24
  3  1     1.32198531E-01   # N_31
  3  2    -3.01792928E-02   # N_32
  3  3     6.90853897E-01   # N_33
  3  4     7.10164524E-01   # N_34
  4  1    -2.18473724E-03   # N_41
  4  2     9.97810988E-01   # N_42
  4  3    -2.05633629E-02   # N_43
  4  4     6.28140761E-02   # N_44
#
BLOCK UMIX  # Chargino Mixing Matrix U
  1  1     2.90561077E-02   # U_11
  1  2     9.99577782E-01   # U_12
  2  1    -9.99577782E-01   # U_21
  2  2     2.90561077E-02   # U_22
#
BLOCK VMIX  # Chargino Mixing Matrix V
  1  1    -8.88785322E-02   # V_11
  1  2    -9.96042472E-01   # V_12
  2  1     9.96042472E-01   # V_21
  2  2    -8.88785322E-02   # V_22
#
BLOCK STOPMIX  # Stop Mixing Matrix
  1  1     5.54956173E-01   # cos(theta_t)
  1  2     8.31879586E-01   # sin(theta_t)
  2  1    -8.31879586E-01   # -sin(theta_t)
  2  2     5.54956173E-01   # cos(theta_t)
#
BLOCK SBOTMIX  # Sbottom Mixing Matrix
  1  1     1.83723784E-04   # cos(theta_b)
  1  2     9.99999983E-01   # sin(theta_b)
  2  1    -9.99999983E-01   # -sin(theta_b)
  2  2     1.83723784E-04   # cos(theta_b)
#
BLOCK STAUMIX  # Stau Mixing Matrix
  1  1     9.99994954E-01   # cos(theta_tau)
  1  2    -3.17678683E-03   # sin(theta_tau)
  2  1     3.17678683E-03   # -sin(theta_tau)
  2  2     9.99994954E-01   # cos(theta_tau)
#
BLOCK ALPHA  # Higgs mixing
          -1.61295416E-01   # Mixing angle in the neutral Higgs boson sector
#
BLOCK HMIX Q=  3.90726600E+03  # DRbar Higgs Parameters
         1    -2.26991782E+02   # mu(Q)MSSM           
         2     6.18721804E+00   # tan                 
         3     2.40985139E+02   # higgs               
         4     3.60285210E+06   # mA^2(Q)MSSM         
#
BLOCK GAUGE Q=  3.90726600E+03  # The gauge couplings
     1     3.66167935E-01   # gprime(Q) DRbar
     2     6.41413739E-01   # g(Q) DRbar
     3     1.01620128E+00   # g3(Q) DRbar
#
BLOCK AU Q=  3.90726600E+03  # The trilinear couplings
  1  1     0.00000000E+00   # A_u(Q) DRbar
  2  2     0.00000000E+00   # A_c(Q) DRbar
  3  3    -6.85127998E+03   # A_t(Q) DRbar
#
BLOCK AD Q=  3.90726600E+03  # The trilinear couplings
  1  1     0.00000000E+00   # A_d(Q) DRbar
  2  2     0.00000000E+00   # A_s(Q) DRbar
  3  3    -2.44659000E+03   # A_b(Q) DRbar
#
BLOCK AE Q=  3.90726600E+03  # The trilinear couplings
  1  1     0.00000000E+00   # A_e(Q) DRbar
  2  2     0.00000000E+00   # A_mu(Q) DRbar
  3  3     3.91087000E+03   # A_tau(Q) DRbar
#
BLOCK Yu Q=  3.90726600E+03  # The Yukawa couplings
  1  1     0.00000000E+00   # y_u(Q) DRbar
  2  2     0.00000000E+00   # y_c(Q) DRbar
  3  3     8.21111773E-01   # y_t(Q) DRbar
#
BLOCK Yd Q=  3.90726600E+03  # The Yukawa couplings
  1  1     0.00000000E+00   # y_d(Q) DRbar
  2  2     0.00000000E+00   # y_s(Q) DRbar
  3  3     8.39265476E-02   # y_b(Q) DRbar
#
BLOCK Ye Q=  3.90726600E+03  # The Yukawa couplings
  1  1     0.00000000E+00   # y_e(Q) DRbar
  2  2     0.00000000E+00   # y_mu(Q) DRbar
  3  3     6.43615880E-02   # y_tau(Q) DRbar
#
BLOCK MSOFT Q=  3.90726600E+03  # The soft SUSY breaking masses at the scale Q
         1     4.21100000E+01   # M_1(Q)              
         2    -1.27956000E+03   # M_2(Q)              
         3     1.61658000E+03   # M_3(Q)              
        21     3.43164127E+06   # mH1^2(Q)            
        22     3.66663833E+05   # mH2^2(Q)            
        31     1.01063000E+03   # meL(Q)              
        32     1.01063000E+03   # mmuL(Q)             
        33     2.68698000E+03   # mtauL(Q)            
        34     3.30472000E+03   # meR(Q)              
        35     3.30472000E+03   # mmuR(Q)             
        36     3.19343000E+03   # mtauR(Q)            
        41     1.35896999E+03   # mqL1(Q)             
        42     1.35896999E+03   # mqL2(Q)             
        43     3.91792999E+03   # mqL3(Q)             
        44     3.44553000E+03   # muR(Q)              
        45     3.44553000E+03   # mcR(Q)              
        46     3.89963997E+03   # mtR(Q)              
        47     3.60065000E+03   # mdR(Q)              
        48     3.60065000E+03   # msR(Q)              
        49     2.05919927E+02   # mbR(Q)              
#
Block HiggsBoundsInputHiggsCouplingsFermions
# ScalarNormEffCoupSq PseudoSNormEffCoupSq NP   IP1 IP2 IP2
    1.01312832E+00    0.00000000E+00        3  25   5   5  # h0-b-b eff. coupling^2, normalised to SM
    3.82685388E+01    0.00000000E+00        3  35   5   5  # H0-b-b eff. coupling^2, normalised to SM
    0.00000000E+00    3.82816671E+01        3  36   5   5  # A0-b-b eff. coupling^2, normalised to SM
#
    9.99657060E-01    0.00000000E+00        3  25   6   6  # h0-t-t eff. coupling^2, normalised to SM
    2.64651046E-02    0.00000000E+00        3  35   6   6  # H0-t-t eff. coupling^2, normalised to SM
    0.00000000E+00    2.61221644E-02        3  36   6   6  # A0-t-t eff. coupling^2, normalised to SM
#
    1.01312832E+00    0.00000000E+00        3  25  15  15  # h0-tau-tau eff. coupling^2, normalised to SM
    3.82685388E+01    0.00000000E+00        3  35  15  15  # H0-tau-tau eff. coupling^2, normalised to SM
    0.00000000E+00    3.82816671E+01        3  36  15  15  # A0-tau-tau eff. coupling^2, normalised to SM
#
Block HiggsBoundsInputHiggsCouplingsBosons
    9.99998882E-01        3  25  24  24  # h0-W-W eff. coupling^2, normalised to SM
    1.11842034E-06        3  35  24  24  # H0-W-W eff. coupling^2, normalised to SM
    0.00000000E+00        3  36  24  24  # A0-W-W eff. coupling^2, normalised to SM
#
    9.99998882E-01        3  25  23  23  # h0-Z-Z eff. coupling^2, normalised to SM
    1.11842034E-06        3  35  23  23  # H0-Z-Z eff. coupling^2, normalised to SM
    0.00000000E+00        3  36  23  23  # A0-Z-Z eff. coupling^2, normalised to SM
#
    8.85804673E-01        3  25  21  21  # h0-g-g eff. coupling^2, normalised to SM
    4.14560997E-10        3  35  21  21  # H0-g-g eff. coupling^2, normalised to SM
    1.24115063E-09        3  36  21  21  # A0-g-g eff. coupling^2, normalised to SM
#
    0.00000000E+00        3  25  25  23  # h0-h0-Z eff. coupling^2, normalised to SM
    0.00000000E+00        3  35  25  23  # H0-h0-Z eff. coupling^2, normalised to SM
    1.11842034E-06        3  36  25  23  # A0-h0-Z eff. coupling^2, normalised to SM
    0.00000000E+00        3  35  35  23  # H0-H0-Z eff. coupling^2, normalised to SM
    9.99998882E-01        3  36  35  23  # A0-H0-Z eff. coupling^2, normalised to SM
    0.00000000E+00        3  36  36  23  # A0-A0-Z eff. coupling^2, normalised to SM
#
    0.00000000E+00        4  25  21  21  23  # h0-g-g-Z eff. coupling^2, normalised to SM
    0.00000000E+00        4  35  21  21  23  # H0-g-g-Z eff. coupling^2, normalised to SM
    0.00000000E+00        4  36  21  21  23  # A0-g-g-Z eff. coupling^2, normalised to SM
#
#
#
#                             =================
#                             |The decay table|
#                             =================
#
# - The QCD corrections to the decays gluino -> squark  + quark
#                                     squark -> gaugino + quark_prime
#                                     squark -> squark_prime + Higgs
#                                     squark -> gluino  + quark
#   are included.
#
# - The multi-body decays for the inos, stops and sbottoms are included.
#
# - The loop induced decays for the gluino, neutralinos and stops
#   are included.
#
# - The SUSY decays of the top quark are included.
#
#
#         PDG            Width
DECAY         6     1.44952082E+00   # top decays
#          BR         NDA      ID1       ID2
     1.00000000E+00    2           5        24   # BR(t ->  b    W+)
#
#         PDG            Width
DECAY   1000021     4.91072586E+01   # gluino decays
#          BR         NDA      ID1       ID2
     3.87946502E-02    2     1000001        -1   # BR(~g -> ~d_L  db)
     3.87946502E-02    2    -1000001         1   # BR(~g -> ~d_L* d )
     3.91886788E-02    2     1000002        -2   # BR(~g -> ~u_L  ub)
     3.91886788E-02    2    -1000002         2   # BR(~g -> ~u_L* u )
     3.87946502E-02    2     1000003        -3   # BR(~g -> ~s_L  sb)
     3.87946502E-02    2    -1000003         3   # BR(~g -> ~s_L* s )
     3.91882846E-02    2     1000004        -4   # BR(~g -> ~c_L  cb)
     3.91882846E-02    2    -1000004         4   # BR(~g -> ~c_L* c )
     3.44033736E-01    2     1000005        -5   # BR(~g -> ~b_1  bb)
     3.44033736E-01    2    -1000005         5   # BR(~g -> ~b_1* b )
#
#         PDG            Width
DECAY   1000006     2.23254334E+02   # stop1 decays
#          BR         NDA      ID1       ID2
     2.73481383E-02    2     1000022         6   # BR(~t_1 -> ~chi_10 t )
     1.10940948E-01    2     1000023         6   # BR(~t_1 -> ~chi_20 t )
     1.02879387E-01    2     1000025         6   # BR(~t_1 -> ~chi_30 t )
     2.23586338E-02    2     1000035         6   # BR(~t_1 -> ~chi_40 t )
     1.39259425E-01    2     1000024         5   # BR(~t_1 -> ~chi_1+ b )
     4.41071690E-02    2     1000037         5   # BR(~t_1 -> ~chi_2+ b )
     5.52921191E-01    2     1000021         6   # BR(~t_1 -> ~g      t )
     1.83685134E-04    2     1000005        37   # BR(~t_1 -> ~b_1    H+)
     1.42245828E-06    2     1000005        24   # BR(~t_1 -> ~b_1    W+)
#
#         PDG            Width
DECAY   2000006     2.38333554E+02   # stop2 decays
#          BR         NDA      ID1       ID2
     1.30674989E-02    2     1000022         6   # BR(~t_2 -> ~chi_10 t )
     1.07873423E-01    2     1000023         6   # BR(~t_2 -> ~chi_20 t )
     1.21030070E-01    2     1000025         6   # BR(~t_2 -> ~chi_30 t )
     3.26378149E-02    2     1000035         6   # BR(~t_2 -> ~chi_40 t )
     8.45543841E-02    2     1000024         5   # BR(~t_2 -> ~chi_1+ b )
     6.39330820E-02    2     1000037         5   # BR(~t_2 -> ~chi_2+ b )
     5.41427201E-01    2     1000021         6   # BR(~t_2 -> ~g      t )
     5.18640280E-03    2     1000006        25   # BR(~t_2 -> ~t_1    h )
     4.90189125E-04    2     1000005        37   # BR(~t_2 -> ~b_1    H+)
     2.97948536E-02    2     1000006        23   # BR(~t_2 -> ~t_1    Z )
     3.69274381E-06    2     1000005        24   # BR(~t_2 -> ~b_1    W+)
     1.38726252E-06    2     2000005        24   # BR(~t_2 -> ~b_2    W+)
#
#         PDG            Width
DECAY   1000005     4.08294699E-01   # sbottom1 decays
#          BR         NDA      ID1       ID2
     7.68756807E-01    2     1000022         5   # BR(~b_1 -> ~chi_10 b )
     7.08566660E-02    2     1000023         5   # BR(~b_1 -> ~chi_20 b )
     6.82819859E-02    2     1000025         5   # BR(~b_1 -> ~chi_30 b )
     9.21045408E-02    2    -1000024         6   # BR(~b_1 -> ~chi_1- t )
#
#         PDG            Width
DECAY   2000005     2.27139095E+02   # sbottom2 decays
#          BR         NDA      ID1       ID2
     2.57540258E-03    2     1000022         5   # BR(~b_2 -> ~chi_10 b )
     1.25087516E-03    2     1000023         5   # BR(~b_2 -> ~chi_20 b )
     1.35310759E-03    2     1000025         5   # BR(~b_2 -> ~chi_30 b )
     5.53398480E-02    2     1000035         5   # BR(~b_2 -> ~chi_40 b )
     2.26085746E-01    2    -1000024         6   # BR(~b_2 -> ~chi_1- t )
     1.12686601E-01    2    -1000037         6   # BR(~b_2 -> ~chi_2- t )
     5.74496181E-01    2     1000021         5   # BR(~b_2 -> ~g      b )
     2.20605855E-06    2     1000005        25   # BR(~b_2 -> ~b_1    h )
     3.47135288E-04    2     1000005        35   # BR(~b_2 -> ~b_1    H )
     3.47218392E-04    2     1000005        36   # BR(~b_2 -> ~b_1    A )
     2.70472608E-06    2     1000005        23   # BR(~b_2 -> ~b_1    Z )
     2.55129744E-02    2     1000006       -24   # BR(~b_2 -> ~t_1    W-)
#
#         PDG            Width
DECAY   1000002     1.43592448E+00   # sup_L decays
#          BR         NDA      ID1       ID2
     1.44189412E-01    2     1000022         2   # BR(~u_L -> ~chi_10 u)
     2.75274219E-02    2     1000023         2   # BR(~u_L -> ~chi_20 u)
     1.00554141E-04    2     1000025         2   # BR(~u_L -> ~chi_30 u)
     2.55743760E-01    2     1000035         2   # BR(~u_L -> ~chi_40 u)
     6.31444398E-02    2     1000024         1   # BR(~u_L -> ~chi_1+ d)
     5.09294412E-01    2     1000037         1   # BR(~u_L -> ~chi_2+ d)
#
#         PDG            Width
DECAY   2000002     1.48107620E+02   # sup_R decays
#          BR         NDA      ID1       ID2
     5.20492066E-02    2     1000022         2   # BR(~u_R -> ~chi_10 u)
     8.65466518E-04    2     1000023         2   # BR(~u_R -> ~chi_20 u)
     9.33788245E-04    2     1000025         2   # BR(~u_R -> ~chi_30 u)
     1.91831183E-07    2     1000035         2   # BR(~u_R -> ~chi_40 u)
     9.46151347E-01    2     1000021         2   # BR(~u_R -> ~g      u)
#
#         PDG            Width
DECAY   1000001     1.36977359E+00   # sdown_L decays
#          BR         NDA      ID1       ID2
     1.55721234E-01    2     1000022         1   # BR(~d_L -> ~chi_10 d)
     5.01935571E-03    2     1000023         1   # BR(~d_L -> ~chi_20 d)
     1.28092442E-02    2     1000025         1   # BR(~d_L -> ~chi_30 d)
     2.72914980E-01    2     1000035         1   # BR(~d_L -> ~chi_40 d)
     7.08345859E-03    2    -1000024         2   # BR(~d_L -> ~chi_1- u)
     5.46451727E-01    2    -1000037         2   # BR(~d_L -> ~chi_2- u)
#
#         PDG            Width
DECAY   2000001     1.57741663E+02   # sdown_R decays
#          BR         NDA      ID1       ID2
     1.27738076E-02    2     1000022         1   # BR(~d_R -> ~chi_10 d)
     2.12537554E-04    2     1000023         1   # BR(~d_R -> ~chi_20 d)
     2.29320877E-04    2     1000025         1   # BR(~d_R -> ~chi_30 d)
     4.83223440E-08    2     1000035         1   # BR(~d_R -> ~chi_40 d)
     9.86784286E-01    2     1000021         1   # BR(~d_R -> ~g      d)
#
#         PDG            Width
DECAY   1000004     1.41826410E+00   # scharm_L decays
#          BR         NDA      ID1       ID2
     1.48468930E-01    2     1000022         4   # BR(~c_L -> ~chi_10 c)
     2.82859870E-02    2     1000023         4   # BR(~c_L -> ~chi_20 c)
     1.03321574E-04    2     1000025         4   # BR(~c_L -> ~chi_30 c)
     2.53475005E-01    2     1000035         4   # BR(~c_L -> ~chi_40 c)
     6.48864419E-02    2     1000024         3   # BR(~c_L -> ~chi_1+ s)
     5.04780315E-01    2     1000037         3   # BR(~c_L -> ~chi_2+ s)
#
#         PDG            Width
DECAY   2000004     1.09734809E+02   # scharm_R decays
#          BR         NDA      ID1       ID2
     7.29649737E-02    2     1000022         4   # BR(~c_R -> ~chi_10 c)
     1.21211154E-03    2     1000023         4   # BR(~c_R -> ~chi_20 c)
     1.30777638E-03    2     1000025         4   # BR(~c_R -> ~chi_30 c)
     2.67695802E-07    2     1000035         4   # BR(~c_R -> ~chi_40 c)
     9.24514871E-01    2     1000021         4   # BR(~c_R -> ~g      c)
#
#         PDG            Width
DECAY   1000003     1.35067693E+00   # sstrange_L decays
#          BR         NDA      ID1       ID2
     1.60625712E-01    2     1000022         3   # BR(~s_L -> ~chi_10 s)
     5.16676904E-03    2     1000023         3   # BR(~s_L -> ~chi_20 s)
     1.31849910E-02    2     1000025         3   # BR(~s_L -> ~chi_30 s)
     2.71048938E-01    2     1000035         3   # BR(~s_L -> ~chi_40 s)
     7.29168610E-03    2    -1000024         4   # BR(~s_L -> ~chi_1- c)
     5.42681904E-01    2    -1000037         4   # BR(~s_L -> ~chi_2- c)
#
#         PDG            Width
DECAY   2000003     1.14854186E+02   # sstrange_R decays
#          BR         NDA      ID1       ID2
     1.82051064E-02    2     1000022         3   # BR(~s_R -> ~chi_10 s)
     3.02648225E-04    2     1000023         3   # BR(~s_R -> ~chi_20 s)
     3.26542334E-04    2     1000025         3   # BR(~s_R -> ~chi_30 s)
     6.85913895E-08    2     1000035         3   # BR(~s_R -> ~chi_40 s)
     9.81165634E-01    2     1000021         3   # BR(~s_R -> ~g      s)
#
#         PDG            Width
DECAY   1000011     1.40021216E+00   # selectron_L decays
#          BR         NDA      ID1       ID2
     9.42909485E-01    2     1000022        11   # BR(~e_L -> ~chi_10 e-)
     4.69412127E-02    2     1000023        11   # BR(~e_L -> ~chi_20 e-)
     5.55109213E-03    2     1000025        11   # BR(~e_L -> ~chi_30 e-)
     4.59820972E-03    2    -1000024        12   # BR(~e_L -> ~chi_1- nu_e)
#
#         PDG            Width
DECAY   2000011     1.76463032E+01   # selectron_R decays
#          BR         NDA      ID1       ID2
     9.66647079E-01    2     1000022        11   # BR(~e_R -> ~chi_10 e-)
     1.60419907E-02    2     1000023        11   # BR(~e_R -> ~chi_20 e-)
     1.73075142E-02    2     1000025        11   # BR(~e_R -> ~chi_30 e-)
     3.41649620E-06    2     1000035        11   # BR(~e_R -> ~chi_40 e-)
#
#         PDG            Width
DECAY   1000013     1.40021213E+00   # smuon_L decays
#          BR         NDA      ID1       ID2
     9.42909486E-01    2     1000022        13   # BR(~mu_L -> ~chi_10 mu-)
     4.69412126E-02    2     1000023        13   # BR(~mu_L -> ~chi_20 mu-)
     5.55109211E-03    2     1000025        13   # BR(~mu_L -> ~chi_30 mu-)
     4.59820981E-03    2    -1000024        14   # BR(~mu_L -> ~chi_1- nu_mu)
#
#         PDG            Width
DECAY   2000013     1.76463032E+01   # smuon_R decays
#          BR         NDA      ID1       ID2
     9.66647079E-01    2     1000022        13   # BR(~mu_R -> ~chi_10 mu-)
     1.60419907E-02    2     1000023        13   # BR(~mu_R -> ~chi_20 mu-)
     1.73075142E-02    2     1000025        13   # BR(~mu_R -> ~chi_30 mu-)
     3.41649620E-06    2     1000035        13   # BR(~mu_R -> ~chi_40 mu-)
#
#         PDG            Width
DECAY   1000015     2.33378073E+01   # stau_1 decays
#          BR         NDA      ID1       ID2
     1.48447137E-01    2     1000022        15   # BR(~tau_1 -> ~chi_10  tau-)
     1.26232696E-02    2     1000023        15   # BR(~tau_1 -> ~chi_20  tau-)
     5.39697753E-03    2     1000025        15   # BR(~tau_1 -> ~chi_30  tau-)
     2.76490894E-01    2     1000035        15   # BR(~tau_1 -> ~chi_40  tau-)
     8.03760968E-04    2    -1000024        16   # BR(~tau_1 -> ~chi_1-  nu_tau)
     5.56237960E-01    2    -1000037        16   # BR(~tau_1 -> ~chi_2-  nu_tau)
#
#         PDG            Width
DECAY   2000015     1.75805817E+01   # stau_2 decays
#          BR         NDA      ID1       ID2
     9.37877150E-01    2     1000022        15   # BR(~tau_2 -> ~chi_10  tau-)
     2.28017157E-02    2     1000023        15   # BR(~tau_2 -> ~chi_20  tau-)
     2.38951201E-02    2     1000025        15   # BR(~tau_2 -> ~chi_30  tau-)
     2.24625994E-05    2     1000035        15   # BR(~tau_2 -> ~chi_40  tau-)
     1.47948548E-02    2    -1000024        16   # BR(~tau_2 -> ~chi_1-  nu_tau)
     3.84897652E-05    2    -1000037        16   # BR(~tau_2 -> ~chi_2-  nu_tau)
     2.79800904E-04    2     1000016       -24   # BR(~tau_2 -> ~nu_tauL W-)
     1.49042907E-04    2     1000015        25   # BR(~tau_2 -> ~tau_1   h)
     1.41362916E-04    2     1000015        23   # BR(~tau_2 -> ~tau_1   Z)
#
#         PDG            Width
DECAY   1000012     1.43175560E+00   # snu_eL decays
#          BR         NDA      ID1       ID2
     9.28141559E-01    2     1000022        12   # BR(~nu_eL -> ~chi_10 nu_e)
     5.05274104E-04    2     1000023        12   # BR(~nu_eL -> ~chi_20 nu_e)
     2.94317130E-02    2     1000025        12   # BR(~nu_eL -> ~chi_30 nu_e)
     4.19214536E-02    2     1000024        11   # BR(~nu_eL -> ~chi_1+ e-)
#
#         PDG            Width
DECAY   1000014     1.43175560E+00   # snu_muL decays
#          BR         NDA      ID1       ID2
     9.28141560E-01    2     1000022        14   # BR(~nu_muL -> ~chi_10 nu_mu)
     5.05274105E-04    2     1000023        14   # BR(~nu_muL -> ~chi_20 nu_mu)
     2.94317130E-02    2     1000025        14   # BR(~nu_muL -> ~chi_30 nu_mu)
     4.19214526E-02    2     1000024        13   # BR(~nu_muL -> ~chi_1+ mu-)
#
#         PDG            Width
DECAY   1000016     2.33536526E+01   # snu_tauL decays
#          BR         NDA      ID1       ID2
     1.49319915E-01    2     1000022        16   # BR(~nu_tauL -> ~chi_10 nu_tau)
     8.87937664E-05    2     1000023        16   # BR(~nu_tauL -> ~chi_20 nu_tau)
     5.18765387E-03    2     1000025        16   # BR(~nu_tauL -> ~chi_30 nu_tau)
     2.77373461E-01    2     1000035        16   # BR(~nu_tauL -> ~chi_40 nu_tau)
     1.67072373E-02    2     1000024        15   # BR(~nu_tauL -> ~chi_1+ tau-)
     5.51322939E-01    2     1000037        15   # BR(~nu_tauL -> ~chi_2+ tau-)
#
#         PDG            Width
DECAY   1000024     1.12844700E-01   # chargino1+ decays
#          BR         NDA      ID1       ID2
     1.00000000E+00    2     1000022        24   # BR(~chi_1+ -> ~chi_10  W+)
#
#         PDG            Width
DECAY   1000037     1.40796819E+01   # chargino2+ decays
#          BR         NDA      ID1       ID2
     1.19710042E-05    2    -1000005         6   # BR(~chi_2+ -> ~b_1*    t )
     5.20636378E-02    2     1000012       -11   # BR(~chi_2+ -> ~nu_eL   e+  )
     5.20636378E-02    2     1000014       -13   # BR(~chi_2+ -> ~nu_muL mu+ )
     5.13655059E-02    2    -1000011        12   # BR(~chi_2+ -> ~e_L+    nu_e)
     5.13655059E-02    2    -1000013        14   # BR(~chi_2+ -> ~mu_L+   nu_mu)
     1.99993704E-01    2     1000024        23   # BR(~chi_2+ -> ~chi_1+  Z )
     8.40907866E-04    2     1000022        24   # BR(~chi_2+ -> ~chi_10  W+)
     1.95195224E-01    2     1000023        24   # BR(~chi_2+ -> ~chi_20  W+)
     1.94048806E-01    2     1000025        24   # BR(~chi_2+ -> ~chi_30  W+)
     2.03051100E-01    2     1000024        25   # BR(~chi_2+ -> ~chi_1+  h )
#
#         PDG            Width
DECAY   1000022     0.00000000E+00   # neutralino1 decays
#
#         PDG            Width
DECAY   1000023     7.49269965E-02   # neutralino2 decays
#          BR         NDA      ID1       ID2
     6.84567515E-01    2     1000022        23   # BR(~chi_20 -> ~chi_10   Z )
     3.15432485E-01    2     1000022        25   # BR(~chi_20 -> ~chi_10   h )
#
#         PDG            Width
DECAY   1000025     1.05037926E-01   # neutralino3 decays
#          BR         NDA      ID1       ID2
     6.22878241E-01    2     1000022        23   # BR(~chi_30 -> ~chi_10   Z )
     3.77121759E-01    2     1000022        25   # BR(~chi_30 -> ~chi_10   h )
#
#         PDG            Width
DECAY   1000035     1.40740674E+01   # neutralino4 decays
#          BR         NDA      ID1       ID2
     8.36108229E-04    2     1000022        23   # BR(~chi_40 -> ~chi_10   Z )
     4.08267000E-02    2     1000023        23   # BR(~chi_40 -> ~chi_20   Z )
     1.58081206E-01    2     1000025        23   # BR(~chi_40 -> ~chi_30   Z )
     1.95554871E-01    2     1000024       -24   # BR(~chi_40 -> ~chi_1+   W-)
     1.95554871E-01    2    -1000024        24   # BR(~chi_40 -> ~chi_1-   W+)
     2.42154776E-05    2     1000022        25   # BR(~chi_40 -> ~chi_10   h )
     1.62034321E-01    2     1000023        25   # BR(~chi_40 -> ~chi_20   h )
     4.03297144E-02    2     1000025        25   # BR(~chi_40 -> ~chi_30   h )
     6.31999299E-06    2     1000005        -5   # BR(~chi_40 -> ~b_1      bb)
     6.31999299E-06    2    -1000005         5   # BR(~chi_40 -> ~b_1*     b )
     2.55123916E-02    2     1000011       -11   # BR(~chi_40 -> ~e_L-     e+)
     2.55123916E-02    2    -1000011        11   # BR(~chi_40 -> ~e_L+     e-)
     2.55123916E-02    2     1000013       -13   # BR(~chi_40 -> ~mu_L-    mu+)
     2.55123916E-02    2    -1000013        13   # BR(~chi_40 -> ~mu_L+    mu-)
     2.61739467E-02    2     1000012       -12   # BR(~chi_40 -> ~nu_eL    nu_eb)
     2.61739467E-02    2    -1000012        12   # BR(~chi_40 -> ~nu_eL*   nu_e )
     2.61739467E-02    2     1000014       -14   # BR(~chi_40 -> ~nu_muL   nu_mub)
     2.61739467E-02    2    -1000014        14   # BR(~chi_40 -> ~nu_muL*  nu_mu )
#
#         PDG            Width
DECAY        25     4.42889566E-03   # h decays
#          BR         NDA      ID1       ID2
     5.56910376E-01    2           5        -5   # BR(h -> b       bb     )
     6.01422524E-02    2         -15        15   # BR(h -> tau+    tau-   )
     2.12867287E-04    2         -13        13   # BR(h -> mu+     mu-    )
     2.31626773E-04    2           3        -3   # BR(h -> s       sb     )
     1.98284191E-02    2           4        -4   # BR(h -> c       cb     )
     7.54100834E-02    2          21        21   # BR(h -> g       g      )
     2.28865137E-03    2          22        22   # BR(h -> gam     gam    )
     1.68036564E-03    2          22        23   # BR(h -> Z       gam    )
     2.36034446E-01    2          24       -24   # BR(h -> W+      W-     )
     3.03078967E-02    2          23        23   # BR(h -> Z       Z      )
     1.69530160E-02    2     1000022   1000022   # BR(h -> ~chi_10 ~chi_10)
#
#         PDG            Width
DECAY        35     1.21856920E+01   # H decays
#          BR         NDA      ID1       ID2
     7.20812262E-02    2           5        -5   # BR(H -> b       bb     )
     1.23213209E-02    2         -15        15   # BR(H -> tau+    tau-   )
     4.33699159E-05    2         -13        13   # BR(H -> mu+     mu-    )
     2.93687793E-05    2           3        -3   # BR(H -> s       sb     )
     1.80105718E-06    2           4        -4   # BR(H -> c       cb     )
     1.73852427E-01    2           6        -6   # BR(H -> t       tb     )
     1.36109802E-04    2          21        21   # BR(H -> g       g      )
     8.51327828E-07    2          22        22   # BR(H -> gam     gam    )
     1.80552611E-07    2          23        22   # BR(H -> Z       gam    )
     2.00337038E-04    2          24       -24   # BR(H -> W+      W-     )
     9.97529573E-05    2          23        23   # BR(H -> Z       Z      )
     7.03727124E-04    2          25        25   # BR(H -> h       h      )
     2.40076642E-16    2          23        36   # BR(H -> Z       A      )
     8.30837572E-03    2     1000024  -1000024   # BR(H -> ~chi_1+ ~chi_1-)
     1.82403273E-01    2     1000024  -1000037   # BR(H -> ~chi_1+ ~chi_2-)
     1.82403273E-01    2     1000037  -1000024   # BR(H -> ~chi_2+ ~chi_1-)
     1.21366783E-02    2     1000022   1000022   # BR(H -> ~chi_10 ~chi_10)
     3.50717376E-05    2     1000023   1000023   # BR(H -> ~chi_20 ~chi_20)
     7.74505364E-03    2     1000025   1000025   # BR(H -> ~chi_30 ~chi_30)
     5.91375546E-02    2     1000022   1000023   # BR(H -> ~chi_10 ~chi_20)
     1.02662771E-01    2     1000022   1000025   # BR(H -> ~chi_10 ~chi_30)
     6.09782540E-03    2     1000022   1000035   # BR(H -> ~chi_10 ~chi_40)
     2.76671623E-03    2     1000023   1000025   # BR(H -> ~chi_20 ~chi_30)
     3.71044810E-02    2     1000023   1000035   # BR(H -> ~chi_20 ~chi_40)
     1.39723802E-01    2     1000025   1000035   # BR(H -> ~chi_30 ~chi_40)
     4.65135561E-06    2     1000005  -1000005   # BR(H -> ~b_1    ~b_1*  )
#
#         PDG            Width
DECAY        36     1.21945715E+01   # A decays
#          BR         NDA      ID1       ID2
     7.20952630E-02    2           5        -5   # BR(A -> b       bb     )
     1.23146314E-02    2         -15        15   # BR(A -> tau+    tau-   )
     4.33462504E-05    2         -13        13   # BR(A -> mu+     mu-    )
     2.94076087E-05    2           3        -3   # BR(A -> s       sb     )
     1.79251908E-06    2           4        -4   # BR(A -> c       cb     )
     1.75493601E-01    2           6        -6   # BR(A -> t       tb     )
     2.35099838E-04    2          21        21   # BR(A -> g       g      )
     1.20160567E-06    2          22        22   # BR(A -> gam     gam    )
     2.65868595E-07    2          23        22   # BR(A -> Z       gam    )
     2.01558631E-04    2          23        25   # BR(A -> Z       h      )
     1.09087895E-02    2     1000024  -1000024   # BR(A -> ~chi_1+ ~chi_1-)
     1.80927512E-01    2     1000024  -1000037   # BR(A -> ~chi_1+ ~chi_2-)
     1.80927512E-01    2     1000037  -1000024   # BR(A -> ~chi_2+ ~chi_1-)
     1.19590391E-02    2     1000022   1000022   # BR(A -> ~chi_10 ~chi_10)
     7.20022380E-05    2     1000023   1000023   # BR(A -> ~chi_20 ~chi_20)
     4.21581711E-03    2     1000025   1000025   # BR(A -> ~chi_30 ~chi_30)
     1.13076698E-01    2     1000022   1000023   # BR(A -> ~chi_10 ~chi_20)
     5.11054859E-02    2     1000022   1000025   # BR(A -> ~chi_10 ~chi_30)
     4.70202378E-03    2     1000022   1000035   # BR(A -> ~chi_10 ~chi_40)
     4.46758611E-03    2     1000023   1000025   # BR(A -> ~chi_20 ~chi_30)
     1.41349449E-01    2     1000023   1000035   # BR(A -> ~chi_20 ~chi_40)
     3.58719190E-02    2     1000025   1000035   # BR(A -> ~chi_30 ~chi_40)
#
#         PDG            Width
DECAY        37     1.21071479E+01   # H+ decays
#          BR         NDA      ID1       ID2
     1.19509594E-04    2           4        -5   # BR(H+ -> c       bb     )
     1.24161901E-02    2         -15        16   # BR(H+ -> tau+    nu_tau )
     4.37037268E-05    2         -13        14   # BR(H+ -> mu+     nu_mu  )
     1.19506350E-06    2           2        -5   # BR(H+ -> u       bb     )
     1.47886195E-06    2           2        -3   # BR(H+ -> u       sb     )
     3.08390644E-05    2           4        -3   # BR(H+ -> c       sb     )
     2.43972132E-01    2           6        -5   # BR(H+ -> t       bb     )
     2.03962853E-04    2          24        25   # BR(H+ -> W+      h      )
     2.93464209E-12    2          24        36   # BR(H+ -> W+      A      )
     1.82549033E-01    2     1000024   1000022   # BR(H+ -> ~chi_1+ ~chi_10)
     5.92976545E-03    2     1000024   1000023   # BR(H+ -> ~chi_1+ ~chi_20)
     3.49393201E-04    2     1000024   1000025   # BR(H+ -> ~chi_1+ ~chi_30)
     1.84396702E-01    2     1000024   1000035   # BR(H+ -> ~chi_1+ ~chi_40)
     1.09352655E-02    2     1000037   1000022   # BR(H+ -> ~chi_2+ ~chi_10)
     1.82145243E-01    2     1000037   1000023   # BR(H+ -> ~chi_2+ ~chi_20)
     1.76905587E-01    2     1000037   1000025   # BR(H+ -> ~chi_2+ ~chi_30)
