#
#                              ======================
#                              | THE SUSYHIT OUTPUT |
#                              ======================
#
#
#              ------------------------------------------------------
#              |     This is the output of the SUSY-HIT package     |
#              |  created by A.Djouadi, M.Muehlleitner and M.Spira. |
#              |  In case of problems with SUSY-HIT email to        |
#              |           margarete.muehlleitner@cern.ch           |
#              |           michael.spira@psi.ch                     |
#              |           abdelhak.djouadi@cern.ch                 |
#              ------------------------------------------------------
#
#              ------------------------------------------------------
#              |  SUSY Les Houches Accord - MSSM Spectrum + Decays  |
#              |              based on the decay programs           |
#              |                                                    |
#              |                     SDECAY 1.3b                    |
#              |                                                    |
#              |  Authors: M.Muhlleitner, A.Djouadi and Y.Mambrini  |
#              |  Ref.:    Comput.Phys.Commun.168(2005)46           |
#              |           [hep-ph/0311167]                         |
#              |                                                    |
#              |                     HDECAY 3.4                     |
#              |                                                    |
#              |  By: A.Djouadi,J.Kalinowski,M.Muhlleitner,M.Spira  |
#              |  Ref.:    Comput.Phys.Commun.108(1998)56           |
#              |           [hep-ph/9704448]                         |
#              |                                                    |
#              |                                                    |
#              |  If not stated otherwise all DRbar couplings and   |
#              |  soft SUSY breaking masses are given at the scale  |
#              |  Q=  0.14529450E+04
#              |                                                    |
#              ------------------------------------------------------
#
#
BLOCK DCINFO  # Decay Program information
     1   SDECAY/HDECAY # decay calculator
     2   1.3b  /3.4    # version number
#
BLOCK SPINFO  # Spectrum calculator information
     1     SOFTSUSY    # spectrum calculator               
     2     3.4.0       # version number                    
#
BLOCK MODSEL  # Model selection
     1     0   #  nonUniversal                                     
#
BLOCK SMINPUTS  # Standard Model inputs
         1     1.27908970E+02   # alpha_em^-1(M_Z)^MSbar
         2     1.16637870E-05   # G_F [GeV^-2]
         3     1.18400000E-01   # alpha_S(M_Z)^MSbar
         4     9.11876000E+01   # M_Z pole mass
         5     4.18000000E+00   # mb(mb)^MSbar
         6     1.73200000E+02   # mt pole mass
         7     1.77700000E+00   # mtau pole mass
#
BLOCK MINPAR  # Input parameters - minimal models
         3     1.05000000E+01   # tanb                
#
BLOCK EXTPAR  # Input parameters - non-minimal models
         0    -1.00000000E+00   # Set                 
         1     3.60093000E+03   # M_1(MX)             
         2     2.85310000E+02   # M_2(MX)             
         3     2.03010000E+03   # M_3(MX)             
        11    -3.74420000E+03   # At(MX)              
        12     3.27002000E+03   # Ab(MX)              
        13     4.89050000E+02   # Atau(MX)            
        23    -2.47561000E+03   # mu(MX)              
        26     3.37588000E+03   # mA(pole)            
        31     2.92959000E+03   # meL(MX)             
        32     2.92959000E+03   # mmuL(MX)            
        33     3.09354000E+03   # mtauL(MX)           
        34     1.84248000E+03   # meR(MX)             
        35     1.84248000E+03   # mmuR(MX)            
        36     3.60669000E+03   # mtauR(MX)           
        41     2.84822000E+03   # mqL1(MX)            
        42     2.84822000E+03   # mqL2(MX)            
        43     8.73570000E+02   # mqL3(MX)            
        44     7.85080000E+02   # muR(MX)             
        45     7.85080000E+02   # mcR(MX)             
        46     2.45104000E+03   # mtR(MX)             
        47     2.80175000E+03   # mdR(MX)             
        48     2.80175000E+03   # msR(MX)             
        49     1.77399000E+03   # mbR(MX)             
#
BLOCK MASS  # Mass Spectrum
# PDG code           mass       particle
        24     8.03780144E+01   # W+
        25     1.27284756E+02   # h
        35     3.37739461E+03   # H
        36     3.37588182E+03   # A
        37     3.37719823E+03   # H+
         5     4.81876030E+00   # b-quark pole mass calculated from mb(mb)_Msbar
   1000001     2.88301749E+03   # ~d_L
   2000001     2.83226784E+03   # ~d_R
   1000002     2.88208695E+03   # ~u_L
   2000002     8.36533580E+02   # ~u_R
   1000003     2.88301749E+03   # ~s_L
   2000003     2.83226784E+03   # ~s_R
   1000004     2.88208695E+03   # ~c_L
   2000004     8.36533580E+02   # ~c_R
   1000005     9.59865850E+02   # ~b_1
   2000005     1.82635283E+03   # ~b_2
   1000006     9.42273499E+02   # ~t_1
   2000006     2.47913713E+03   # ~t_2
   1000011     2.93495381E+03   # ~e_L
   2000011     1.83903525E+03   # ~e_R
   1000012     2.93356872E+03   # ~nu_eL
   1000013     2.93495381E+03   # ~mu_L
   2000013     1.83903525E+03   # ~mu_R
   1000014     2.93356872E+03   # ~nu_muL
   1000015     3.09934053E+03   # ~tau_1
   2000015     3.60802959E+03   # ~tau_2
   1000016     3.09811101E+03   # ~nu_tauL
   1000021     2.12545969E+03   # ~g
   1000022     3.08315387E+02   # ~chi_10
   1000023     2.49956144E+03   # ~chi_20
   1000025    -2.50081719E+03   # ~chi_30
   1000035     3.59414887E+03   # ~chi_40
   1000024     3.08477070E+02   # ~chi_1+
   1000037     2.50176533E+03   # ~chi_2+
#
BLOCK NMIX  # Neutralino Mixing Matrix
  1  1     5.90359047E-06   # N_11
  1  2     9.99493245E-01   # N_12
  1  3     3.18124970E-02   # N_13
  1  4     1.10368903E-03   # N_14
  2  1    -2.53505864E-02   # N_21
  2  2    -2.32721066E-02   # N_22
  2  3     7.06655093E-01   # N_23
  2  4     7.06720834E-01   # N_24
  3  1    -5.54258478E-03   # N_31
  3  2     2.17125750E-02   # N_32
  3  3    -7.06703968E-01   # N_33
  3  4     7.07154400E-01   # N_34
  4  1     9.99663257E-01   # N_41
  4  2    -4.75678543E-04   # N_42
  4  3     1.40016815E-02   # N_43
  4  4     2.18425996E-02   # N_44
#
BLOCK UMIX  # Chargino Mixing Matrix U
  1  1     9.98988781E-01   # U_11
  1  2     4.49601643E-02   # U_12
  2  1    -4.49601643E-02   # U_21
  2  2     9.98988781E-01   # U_22
#
BLOCK VMIX  # Chargino Mixing Matrix V
  1  1     9.99998784E-01   # V_11
  1  2    -1.55923701E-03   # V_12
  2  1    -1.55923701E-03   # V_21
  2  2    -9.99998784E-01   # V_22
#
BLOCK STOPMIX  # Stop Mixing Matrix
  1  1     9.95141534E-01   # cos(theta_t)
  1  2     9.84546967E-02   # sin(theta_t)
  2  1    -9.84546967E-02   # -sin(theta_t)
  2  2     9.95141534E-01   # cos(theta_t)
#
BLOCK SBOTMIX  # Sbottom Mixing Matrix
  1  1     9.99464675E-01   # cos(theta_b)
  1  2    -3.27164091E-02   # sin(theta_b)
  2  1     3.27164091E-02   # -sin(theta_b)
  2  2     9.99464675E-01   # cos(theta_b)
#
BLOCK STAUMIX  # Stau Mixing Matrix
  1  1     9.99911579E-01   # cos(theta_tau)
  1  2    -1.32979014E-02   # sin(theta_tau)
  2  1     1.32979014E-02   # -sin(theta_tau)
  2  2     9.99911579E-01   # cos(theta_tau)
#
BLOCK ALPHA  # Higgs mixing
          -9.88118090E-02   # Mixing angle in the neutral Higgs boson sector
#
BLOCK HMIX Q=  1.45294500E+03  # DRbar Higgs Parameters
         1    -2.50192031E+03   # mu(Q)MSSM           
         2     1.01102469E+01   # tan                 
         3     2.43690288E+02   # higgs               
         4     1.12222260E+07   # mA^2(Q)MSSM         
#
BLOCK GAUGE Q=  1.45294500E+03  # The gauge couplings
     1     3.62555203E-01   # gprime(Q) DRbar
     2     6.39371987E-01   # g(Q) DRbar
     3     1.03537391E+00   # g3(Q) DRbar
#
BLOCK AU Q=  1.45294500E+03  # The trilinear couplings
  1  1     0.00000000E+00   # A_u(Q) DRbar
  2  2     0.00000000E+00   # A_c(Q) DRbar
  3  3    -3.74420000E+03   # A_t(Q) DRbar
#
BLOCK AD Q=  1.45294500E+03  # The trilinear couplings
  1  1     0.00000000E+00   # A_d(Q) DRbar
  2  2     0.00000000E+00   # A_s(Q) DRbar
  3  3     3.27002000E+03   # A_b(Q) DRbar
#
BLOCK AE Q=  1.45294500E+03  # The trilinear couplings
  1  1     0.00000000E+00   # A_e(Q) DRbar
  2  2     0.00000000E+00   # A_mu(Q) DRbar
  3  3     4.89050000E+02   # A_tau(Q) DRbar
#
BLOCK Yu Q=  1.45294500E+03  # The Yukawa couplings
  1  1     0.00000000E+00   # y_u(Q) DRbar
  2  2     0.00000000E+00   # y_c(Q) DRbar
  3  3     8.33338567E-01   # y_t(Q) DRbar
#
BLOCK Yd Q=  1.45294500E+03  # The Yukawa couplings
  1  1     0.00000000E+00   # y_d(Q) DRbar
  2  2     0.00000000E+00   # y_s(Q) DRbar
  3  3     1.60606823E-01   # y_b(Q) DRbar
#
BLOCK Ye Q=  1.45294500E+03  # The Yukawa couplings
  1  1     0.00000000E+00   # y_e(Q) DRbar
  2  2     0.00000000E+00   # y_mu(Q) DRbar
  3  3     1.03638101E-01   # y_tau(Q) DRbar
#
BLOCK MSOFT Q=  1.45294500E+03  # The soft SUSY breaking masses at the scale Q
         1     3.60093000E+03   # M_1(Q)              
         2     2.85310000E+02   # M_2(Q)              
         3     2.03010000E+03   # M_3(Q)              
        21     5.16821079E+06   # mH1^2(Q)            
        22    -6.18558428E+06   # mH2^2(Q)            
        31     2.92959000E+03   # meL(Q)              
        32     2.92959000E+03   # mmuL(Q)             
        33     3.09354000E+03   # mtauL(Q)            
        34     1.84248000E+03   # meR(Q)              
        35     1.84248000E+03   # mmuR(Q)             
        36     3.60669000E+03   # mtauR(Q)            
        41     2.84822000E+03   # mqL1(Q)             
        42     2.84822000E+03   # mqL2(Q)             
        43     8.73569990E+02   # mqL3(Q)             
        44     7.85079995E+02   # muR(Q)              
        45     7.85079995E+02   # mcR(Q)              
        46     2.45103999E+03   # mtR(Q)              
        47     2.80175000E+03   # mdR(Q)              
        48     2.80175000E+03   # msR(Q)              
        49     1.77399000E+03   # mbR(Q)              
#
Block HiggsBoundsInputHiggsCouplingsFermions
# ScalarNormEffCoupSq PseudoSNormEffCoupSq NP   IP1 IP2 IP2
    1.00451265E+00    0.00000000E+00        3  25   5   5  # h0-b-b eff. coupling^2, normalised to SM
    1.02212580E+02    0.00000000E+00        3  35   5   5  # H0-b-b eff. coupling^2, normalised to SM
    0.00000000E+00    1.02217092E+02        3  36   5   5  # A0-b-b eff. coupling^2, normalised to SM
#
    9.99955852E-01    0.00000000E+00        3  25   6   6  # h0-t-t eff. coupling^2, normalised to SM
    9.82724734E-03    0.00000000E+00        3  35   6   6  # H0-t-t eff. coupling^2, normalised to SM
    0.00000000E+00    9.78309964E-03        3  36   6   6  # A0-t-t eff. coupling^2, normalised to SM
#
    1.00451265E+00    0.00000000E+00        3  25  15  15  # h0-tau-tau eff. coupling^2, normalised to SM
    1.02212580E+02    0.00000000E+00        3  35  15  15  # H0-tau-tau eff. coupling^2, normalised to SM
    0.00000000E+00    1.02217092E+02        3  36  15  15  # A0-tau-tau eff. coupling^2, normalised to SM
#
Block HiggsBoundsInputHiggsCouplingsBosons
    9.99999950E-01        3  25  24  24  # h0-W-W eff. coupling^2, normalised to SM
    4.96948049E-08        3  35  24  24  # H0-W-W eff. coupling^2, normalised to SM
    0.00000000E+00        3  36  24  24  # A0-W-W eff. coupling^2, normalised to SM
#
    9.99999950E-01        3  25  23  23  # h0-Z-Z eff. coupling^2, normalised to SM
    4.96948049E-08        3  35  23  23  # H0-Z-Z eff. coupling^2, normalised to SM
    0.00000000E+00        3  36  23  23  # A0-Z-Z eff. coupling^2, normalised to SM
#
    8.65458752E-01        3  25  21  21  # h0-g-g eff. coupling^2, normalised to SM
    8.26469051E-15        3  35  21  21  # H0-g-g eff. coupling^2, normalised to SM
    8.69955103E-13        3  36  21  21  # A0-g-g eff. coupling^2, normalised to SM
#
    0.00000000E+00        3  25  25  23  # h0-h0-Z eff. coupling^2, normalised to SM
    0.00000000E+00        3  35  25  23  # H0-h0-Z eff. coupling^2, normalised to SM
    4.96948049E-08        3  36  25  23  # A0-h0-Z eff. coupling^2, normalised to SM
    0.00000000E+00        3  35  35  23  # H0-H0-Z eff. coupling^2, normalised to SM
    9.99999950E-01        3  36  35  23  # A0-H0-Z eff. coupling^2, normalised to SM
    0.00000000E+00        3  36  36  23  # A0-A0-Z eff. coupling^2, normalised to SM
#
    0.00000000E+00        4  25  21  21  23  # h0-g-g-Z eff. coupling^2, normalised to SM
    0.00000000E+00        4  35  21  21  23  # H0-g-g-Z eff. coupling^2, normalised to SM
    0.00000000E+00        4  36  21  21  23  # A0-g-g-Z eff. coupling^2, normalised to SM
#
#
#
#                             =================
#                             |The decay table|
#                             =================
#
# - The QCD corrections to the decays gluino -> squark  + quark
#                                     squark -> gaugino + quark_prime
#                                     squark -> squark_prime + Higgs
#                                     squark -> gluino  + quark
#   are included.
#
# - The multi-body decays for the inos, stops and sbottoms are included.
#
# - The loop induced decays for the gluino, neutralinos and stops
#   are included.
#
# - The SUSY decays of the top quark are included.
#
#
#         PDG            Width
DECAY         6     1.44025241E+00   # top decays
#          BR         NDA      ID1       ID2
     1.00000000E+00    2           5        24   # BR(t ->  b    W+)
#
#         PDG            Width
DECAY   1000021     1.13873479E+02   # gluino decays
#          BR         NDA      ID1       ID2
     1.27272543E-01    2     2000002        -2   # BR(~g -> ~u_R  ub)
     1.27272543E-01    2    -2000002         2   # BR(~g -> ~u_R* u )
     1.27272508E-01    2     2000004        -4   # BR(~g -> ~c_R  cb)
     1.27272508E-01    2    -2000004         4   # BR(~g -> ~c_R* c )
     1.17565814E-01    2     1000005        -5   # BR(~g -> ~b_1  bb)
     1.17565814E-01    2    -1000005         5   # BR(~g -> ~b_1* b )
     1.29451878E-02    2     2000005        -5   # BR(~g -> ~b_2  bb)
     1.29451878E-02    2    -2000005         5   # BR(~g -> ~b_2* b )
     1.14943947E-01    2     1000006        -6   # BR(~g -> ~t_1  tb)
     1.14943947E-01    2    -1000006         6   # BR(~g -> ~t_1* t )
#
#         PDG            Width
DECAY   1000006     8.82280251E+00   # stop1 decays
#          BR         NDA      ID1       ID2
     3.13962621E-01    2     1000022         6   # BR(~t_1 -> ~chi_10 t )
     6.86037379E-01    2     1000024         5   # BR(~t_1 -> ~chi_1+ b )
#
#         PDG            Width
DECAY   2000006     1.21756677E+02   # stop2 decays
#          BR         NDA      ID1       ID2
     7.37968910E-04    2     1000022         6   # BR(~t_2 -> ~chi_10 t )
     1.49277788E-03    2     1000024         5   # BR(~t_2 -> ~chi_1+ b )
     6.32550019E-02    2     1000021         6   # BR(~t_2 -> ~g      t )
     2.26698211E-01    2     1000006        25   # BR(~t_2 -> ~t_1    h )
     2.41544412E-01    2     1000006        23   # BR(~t_2 -> ~t_1    Z )
     4.66195291E-01    2     1000005        24   # BR(~t_2 -> ~b_1    W+)
     7.63378574E-05    2     2000005        24   # BR(~t_2 -> ~b_2    W+)
#
#         PDG            Width
DECAY   1000005     8.89564648E+00   # sbottom1 decays
#          BR         NDA      ID1       ID2
     3.52480925E-01    2     1000022         5   # BR(~b_1 -> ~chi_10 b )
     6.47519075E-01    2    -1000024         6   # BR(~b_1 -> ~chi_1- t )
#
#         PDG            Width
DECAY   2000005     3.17201858E+00   # sbottom2 decays
#          BR         NDA      ID1       ID2
     1.01274328E-03    2     1000022         5   # BR(~b_2 -> ~chi_10 b )
     1.98422754E-03    2    -1000024         6   # BR(~b_2 -> ~chi_1- t )
     2.50570482E-01    2     1000005        25   # BR(~b_2 -> ~b_1    h )
     2.47025913E-01    2     1000005        23   # BR(~b_2 -> ~b_1    Z )
     4.99406634E-01    2     1000006       -24   # BR(~b_2 -> ~t_1    W-)
#
#         PDG            Width
DECAY   1000002     7.85251212E+01   # sup_L decays
#          BR         NDA      ID1       ID2
     1.38963261E-01    2     1000022         2   # BR(~u_L -> ~chi_10 u)
     7.19114830E-06    2     1000023         2   # BR(~u_L -> ~chi_20 u)
     3.87588690E-06    2     1000025         2   # BR(~u_L -> ~chi_30 u)
     2.78200705E-01    2     1000024         1   # BR(~u_L -> ~chi_1+ d)
     4.39324877E-08    2     1000037         1   # BR(~u_L -> ~chi_2+ d)
     5.82824923E-01    2     1000021         2   # BR(~u_L -> ~g      u)
#
#         PDG            Width
DECAY   2000002     2.11449275E-10   # sup_R decays
#           BR         NDA      ID1       ID2
     2.46244755E-01    2     1000022         2   # BR(~u_R -> ~chi_10 u)
#           BR         NDA      ID1       ID2       ID3
     1.49808979E-01    3        2       23        1000022   # BR(~u_R -> u  Z  ~chi_10)
     7.26793696E-02    3        2       25        1000022   # BR(~u_R -> u  h  ~chi_10)
     5.25421523E-01    3        2       -24        1000024   # BR(~u_R -> u  W-  ~chi_1+)
     5.84537356E-03    3        2       24        -1000024   # BR(~u_R -> u  W+  ~chi_1-)
#
#         PDG            Width
DECAY   1000001     7.85802171E+01   # sdown_L decays
#          BR         NDA      ID1       ID2
     1.38913425E-01    2     1000022         1   # BR(~d_L -> ~chi_10 d)
     3.12920519E-06    2     1000023         1   # BR(~d_L -> ~chi_20 d)
     4.71809085E-06    2     1000025         1   # BR(~d_L -> ~chi_30 d)
     2.77540697E-01    2    -1000024         2   # BR(~d_L -> ~chi_1- u)
     3.66549884E-05    2    -1000037         2   # BR(~d_L -> ~chi_2- u)
     5.83501376E-01    2     1000021         1   # BR(~d_L -> ~g      d)
#
#         PDG            Width
DECAY   2000001     4.12496253E+01   # sdown_R decays
#          BR         NDA      ID1       ID2
     1.29440748E-12    2     1000022         1   # BR(~d_R -> ~chi_10 d)
     1.25440970E-06    2     1000023         1   # BR(~d_R -> ~chi_20 d)
     5.95481776E-08    2     1000025         1   # BR(~d_R -> ~chi_30 d)
     9.99998686E-01    2     1000021         1   # BR(~d_R -> ~g      d)
#
#         PDG            Width
DECAY   1000004     6.84498855E+01   # scharm_L decays
#          BR         NDA      ID1       ID2
     1.67149362E-01    2     1000022         4   # BR(~c_L -> ~chi_10 c)
     8.28233599E-06    2     1000023         4   # BR(~c_L -> ~chi_20 c)
     4.46349606E-06    2     1000025         4   # BR(~c_L -> ~chi_30 c)
     3.34628306E-01    2     1000024         3   # BR(~c_L -> ~chi_1+ s)
     5.05889521E-08    2     1000037         3   # BR(~c_L -> ~chi_2+ s)
     4.98209536E-01    2     1000021         4   # BR(~c_L -> ~g      c)
#
#         PDG            Width
DECAY   2000004     2.10424734E-10   # scharm_R decays
#           BR         NDA      ID1       ID2
     2.40509434E-01    2     1000022         4   # BR(~c_R -> ~chi_10 c)
#           BR         NDA      ID1       ID2       ID3
     1.50904314E-01    3        4       23        1000022   # BR(~c_R -> c  Z  ~chi_10)
     7.29334415E-02    3        4       25        1000022   # BR(~c_R -> c  h  ~chi_10)
     5.29833153E-01    3        4       -24        1000024   # BR(~c_R -> c  W-  ~chi_1+)
     5.81965807E-03    3        4       24        -1000024   # BR(~c_R -> c  W+  ~chi_1-)
#
#         PDG            Width
DECAY   1000003     6.84814492E+01   # sstrange_L decays
#          BR         NDA      ID1       ID2
     1.67128121E-01    2     1000022         3   # BR(~s_L -> ~chi_10 s)
     3.60519565E-06    2     1000023         3   # BR(~s_L -> ~chi_20 s)
     5.43514009E-06    2     1000025         3   # BR(~s_L -> ~chi_30 s)
     3.33911449E-01    2    -1000024         4   # BR(~s_L -> ~chi_1- c)
     4.22216815E-05    2    -1000037         4   # BR(~s_L -> ~chi_2- c)
     4.98909168E-01    2     1000021         3   # BR(~s_L -> ~g      s)
#
#         PDG            Width
DECAY   2000003     3.07368615E+01   # sstrange_R decays
#          BR         NDA      ID1       ID2
     1.82229561E-12    2     1000022         3   # BR(~s_R -> ~chi_10 s)
     1.68288419E-06    2     1000023         3   # BR(~s_R -> ~chi_20 s)
     7.98772100E-08    2     1000025         3   # BR(~s_R -> ~chi_30 s)
     9.99998237E-01    2     1000021         3   # BR(~s_R -> ~g      s)
#
#         PDG            Width
DECAY   1000011     3.49637100E+01   # selectron_L decays
#          BR         NDA      ID1       ID2
     3.33514909E-01    2     1000022        11   # BR(~e_L -> ~chi_10 e-)
     3.65033754E-05    2     1000023        11   # BR(~e_L -> ~chi_20 e-)
     8.83423612E-06    2     1000025        11   # BR(~e_L -> ~chi_30 e-)
     6.66336596E-01    2    -1000024        12   # BR(~e_L -> ~chi_1- nu_e)
     1.03157166E-04    2    -1000037        12   # BR(~e_L -> ~chi_2- nu_e)
#
#         PDG            Width
DECAY   2000011     2.93509218E-04   # selectron_R decays
#           BR         NDA      ID1       ID2
     1.07881340E-06    2     1000022        11   # BR(~e_R -> ~chi_10 e-)
#           BR         NDA      ID1       ID2       ID3
     5.91225043E-02    3        11       -2        2000002   # BR(~e_R- -> e-  ub  ~u_R)
     4.24927029E-01    3        11       2        -2000002   # BR(~e_R- -> e-  u  ~u_R*)
     5.89351167E-02    3        11       -4        2000004   # BR(~e_R- -> e-  cb  ~c_R)
     4.25369945E-01    3        11       4        -2000004   # BR(~e_R- -> e-  c  ~c_R*)
     1.48359906E-02    3        11       -5        1000005   # BR(~e_R- -> e-  bb  ~b_1)
     2.46619171E-03    3        11       5        -1000005   # BR(~e_R- -> e-  b  ~b_1*)
     8.27026837E-12    3        11       -5        2000005   # BR(~e_R- -> e-  bb  ~b_2)
     3.25693349E-11    3        11       5        -2000005   # BR(~e_R- -> e-  b  ~b_2*)
     1.13516026E-02    3        11       -6        1000006   # BR(~e_R- -> e-  tb  ~t_1)
     2.58404150E-03    3        11       6        -1000006   # BR(~e_R- -> e-  t  ~t_1*)
     7.31425069E-05    3        11       23        1000022   # BR(~e_R- -> e-  Z  ~chi_10)
     5.22504885E-05    3        11       25        1000022   # BR(~e_R- -> e-  h  ~chi_10)
     2.57112879E-04    3        11       -24        1000024   # BR(~e_R- -> e-  W-  ~chi_1+)
     2.39931136E-05    3        11       24        -1000024   # BR(~e_R- -> e-  W+  ~chi_1-)
#
#         PDG            Width
DECAY   1000013     3.49637100E+01   # smuon_L decays
#          BR         NDA      ID1       ID2
     3.33514908E-01    2     1000022        13   # BR(~mu_L -> ~chi_10 mu-)
     3.65033742E-05    2     1000023        13   # BR(~mu_L -> ~chi_20 mu-)
     8.83423582E-06    2     1000025        13   # BR(~mu_L -> ~chi_30 mu-)
     6.66336597E-01    2    -1000024        14   # BR(~mu_L -> ~chi_1- nu_mu)
     1.03157167E-04    2    -1000037        14   # BR(~mu_L -> ~chi_2- nu_mu)
#
#         PDG            Width
DECAY   2000013     2.93525182E-04   # smuon_R decays
#           BR         NDA      ID1       ID2
     1.07875471E-06    2     1000022        13   # BR(~mu_R -> ~chi_10 mu-)
#           BR         NDA      ID1       ID2       ID3
     5.90818132E-02    3        13       -2        2000002   # BR(~mu_R- -> mu-  ub  ~u_R)
     4.24903918E-01    3        13       2        -2000002   # BR(~mu_R- -> mu-  u  ~u_R*)
     5.89319112E-02    3        13       -4        2000004   # BR(~mu_R- -> mu-  cb  ~c_R)
     4.25346810E-01    3        13       4        -2000004   # BR(~mu_R- -> mu-  c  ~c_R*)
     1.48661861E-02    3        13       -5        1000005   # BR(~mu_R- -> mu-  bb  ~b_1)
     2.46605758E-03    3        13       5        -1000005   # BR(~mu_R- -> mu-  b  ~b_1*)
     8.43607345E-12    3        13       -5        2000005   # BR(~mu_R- -> mu-  bb  ~b_2)
     3.25634752E-11    3        13       5        -2000005   # BR(~mu_R- -> mu-  b  ~b_2*)
     1.14102646E-02    3        13       -6        1000006   # BR(~mu_R- -> mu-  tb  ~t_1)
     2.58437792E-03    3        13       6        -1000006   # BR(~mu_R- -> mu-  t  ~t_1*)
     7.31010533E-05    3        13       23        1000022   # BR(~mu_R- -> mu-  Z  ~chi_10)
     5.22476466E-05    3        13       25        1000022   # BR(~mu_R- -> mu-  h  ~chi_10)
     2.58499115E-04    3        13       -24        1000024   # BR(~mu_R- -> mu-  W-  ~chi_1+)
     2.37349312E-05    3        13       24        -1000024   # BR(~mu_R- -> mu-  W+  ~chi_1-)
#
#         PDG            Width
DECAY   1000015     3.70917940E+01   # stau_1 decays
#          BR         NDA      ID1       ID2
     3.32777736E-01    2     1000022        15   # BR(~tau_1 -> ~chi_10  tau-)
     1.14563484E-03    2     1000023        15   # BR(~tau_1 -> ~chi_20  tau-)
     1.09613867E-03    2     1000025        15   # BR(~tau_1 -> ~chi_30  tau-)
     6.64829333E-01    2    -1000024        16   # BR(~tau_1 -> ~chi_1-  nu_tau)
     1.51157597E-04    2    -1000037        16   # BR(~tau_1 -> ~chi_2-  nu_tau)
#
#         PDG            Width
DECAY   2000015     6.09312659E-01   # stau_2 decays
#          BR         NDA      ID1       ID2
     8.54290485E-04    2     1000022        15   # BR(~tau_2 -> ~chi_10  tau-)
     1.76598038E-01    2     1000023        15   # BR(~tau_2 -> ~chi_20  tau-)
     1.71574357E-01    2     1000025        15   # BR(~tau_2 -> ~chi_30  tau-)
     1.81175838E-03    2     1000035        15   # BR(~tau_2 -> ~chi_40  tau-)
     1.70691803E-03    2    -1000024        16   # BR(~tau_2 -> ~chi_1-  nu_tau)
     3.42874658E-01    2    -1000037        16   # BR(~tau_2 -> ~chi_2-  nu_tau)
     1.49721656E-01    2     1000016       -24   # BR(~tau_2 -> ~nu_tauL W-)
     7.93764173E-02    2     1000015        25   # BR(~tau_2 -> ~tau_1   h)
     7.54819071E-02    2     1000015        23   # BR(~tau_2 -> ~tau_1   Z)
#
#         PDG            Width
DECAY   1000012     3.49888620E+01   # snu_eL decays
#          BR         NDA      ID1       ID2
     3.33106392E-01    2     1000022        12   # BR(~nu_eL -> ~chi_10 nu_e)
     2.02618145E-06    2     1000023        12   # BR(~nu_eL -> ~chi_20 nu_e)
     1.57293812E-05    2     1000025        12   # BR(~nu_eL -> ~chi_30 nu_e)
     6.66875729E-01    2     1000024        11   # BR(~nu_eL -> ~chi_1+ e-)
     1.23301279E-07    2     1000037        11   # BR(~nu_eL -> ~chi_2+ e-)
#
#         PDG            Width
DECAY   1000014     3.49888619E+01   # snu_muL decays
#          BR         NDA      ID1       ID2
     3.33106393E-01    2     1000022        14   # BR(~nu_muL -> ~chi_10 nu_mu)
     2.02618146E-06    2     1000023        14   # BR(~nu_muL -> ~chi_20 nu_mu)
     1.57293812E-05    2     1000025        14   # BR(~nu_muL -> ~chi_30 nu_mu)
     6.66875728E-01    2     1000024        13   # BR(~nu_muL -> ~chi_1+ mu-)
     1.23301275E-07    2     1000037        13   # BR(~nu_muL -> ~chi_2+ mu-)
#
#         PDG            Width
DECAY   1000016     3.71185467E+01   # snu_tauL decays
#          BR         NDA      ID1       ID2
     3.32372499E-01    2     1000022        16   # BR(~nu_tauL -> ~chi_10 nu_tau)
     3.27367849E-06    2     1000023        16   # BR(~nu_tauL -> ~chi_20 nu_tau)
     2.54539993E-05    2     1000025        16   # BR(~nu_tauL -> ~chi_30 nu_tau)
     6.65444122E-01    2     1000024        15   # BR(~nu_tauL -> ~chi_1+ tau-)
     2.15465151E-03    2     1000037        15   # BR(~nu_tauL -> ~chi_2+ tau-)
#
#         PDG            Width
DECAY   1000024     3.26519430E-15   # chargino1+ decays
#           BR         NDA      ID1       ID2       ID3
     1.97796290E-02    3     1000022       -11        12   # BR(~chi_1+ -> ~chi_10 e+   nu_e)
     2.03501660E-03    3     1000022       -13        14   # BR(~chi_1+ -> ~chi_10 mu+  nu_mu)
     9.78185350E-01    2     1000022       211             # BR(~chi_1+ -> ~chi_10 pi+)
#
#         PDG            Width
DECAY   1000037     5.38769039E+01   # chargino2+ decays
#          BR         NDA      ID1       ID2
     3.25989041E-02    2     1000006        -5   # BR(~chi_2+ -> ~t_1     bb)
     3.04649998E-04    2     2000006        -5   # BR(~chi_2+ -> ~t_2     bb)
     6.91892040E-01    2    -1000005         6   # BR(~chi_2+ -> ~b_1*    t )
     7.13153904E-03    2    -2000005         6   # BR(~chi_2+ -> ~b_2*    t )
     9.05734457E-02    2     1000024        23   # BR(~chi_2+ -> ~chi_1+  Z )
     8.82774509E-02    2     1000022        24   # BR(~chi_2+ -> ~chi_10  W+)
     8.92219700E-02    2     1000024        25   # BR(~chi_2+ -> ~chi_1+  h )
#
#         PDG            Width
DECAY   1000022     0.00000000E+00   # neutralino1 decays
#
#         PDG            Width
DECAY   1000023     5.50556390E+01   # neutralino2 decays
#          BR         NDA      ID1       ID2
     4.12646082E-02    2     1000022        23   # BR(~chi_20 -> ~chi_10   Z )
     8.63608365E-02    2     1000024       -24   # BR(~chi_20 -> ~chi_1+   W-)
     8.63608365E-02    2    -1000024        24   # BR(~chi_20 -> ~chi_1-   W+)
     4.57819522E-02    2     1000022        25   # BR(~chi_20 -> ~chi_10   h )
     7.65907208E-05    2     2000002        -2   # BR(~chi_20 -> ~u_R      ub)
     7.65907208E-05    2    -2000002         2   # BR(~chi_20 -> ~u_R*     u )
     7.65907114E-05    2     2000004        -4   # BR(~chi_20 -> ~c_R      cb)
     7.65907114E-05    2    -2000004         4   # BR(~chi_20 -> ~c_R*     c )
     3.53397290E-01    2     1000006        -6   # BR(~chi_20 -> ~t_1      tb)
     3.53397290E-01    2    -1000006         6   # BR(~chi_20 -> ~t_1*     t )
     1.27277558E-02    2     1000005        -5   # BR(~chi_20 -> ~b_1      bb)
     1.27277558E-02    2    -1000005         5   # BR(~chi_20 -> ~b_1*     b )
     3.80555154E-03    2     2000005        -5   # BR(~chi_20 -> ~b_2      bb)
     3.80555154E-03    2    -2000005         5   # BR(~chi_20 -> ~b_2*     b )
     1.60523950E-05    2     2000011       -11   # BR(~chi_20 -> ~e_R-     e+)
     1.60523950E-05    2    -2000011        11   # BR(~chi_20 -> ~e_R+     e-)
     1.60523950E-05    2     2000013       -13   # BR(~chi_20 -> ~mu_R-    mu+)
     1.60523950E-05    2    -2000013        13   # BR(~chi_20 -> ~mu_R+    mu-)
#
#         PDG            Width
DECAY   1000025     5.30892024E+01   # neutralino3 decays
#          BR         NDA      ID1       ID2
     4.91521245E-02    2     1000022        23   # BR(~chi_30 -> ~chi_10   Z )
     8.96919229E-02    2     1000024       -24   # BR(~chi_30 -> ~chi_1+   W-)
     8.96919229E-02    2    -1000024        24   # BR(~chi_30 -> ~chi_1-   W+)
     4.30531412E-02    2     1000022        25   # BR(~chi_30 -> ~chi_10   h )
     3.79970622E-06    2     2000002        -2   # BR(~chi_30 -> ~u_R      ub)
     3.79970622E-06    2    -2000002         2   # BR(~chi_30 -> ~u_R*     u )
     3.79970576E-06    2     2000004        -4   # BR(~chi_30 -> ~c_R      cb)
     3.79970576E-06    2    -2000004         4   # BR(~chi_30 -> ~c_R*     c )
     3.47046952E-01    2     1000006        -6   # BR(~chi_30 -> ~t_1      tb)
     3.47046952E-01    2    -1000006         6   # BR(~chi_30 -> ~t_1*     t )
     1.31825565E-02    2     1000005        -5   # BR(~chi_30 -> ~b_1      bb)
     1.31825565E-02    2    -1000005         5   # BR(~chi_30 -> ~b_1*     b )
     3.96674006E-03    2     2000005        -5   # BR(~chi_30 -> ~b_2      bb)
     3.96674006E-03    2    -2000005         5   # BR(~chi_30 -> ~b_2*     b )
     7.98051336E-07    2     2000011       -11   # BR(~chi_30 -> ~e_R-     e+)
     7.98051336E-07    2    -2000011        11   # BR(~chi_30 -> ~e_R+     e-)
     7.98051336E-07    2     2000013       -13   # BR(~chi_30 -> ~mu_R-    mu+)
     7.98051336E-07    2    -2000013        13   # BR(~chi_30 -> ~mu_R+    mu-)
#
#         PDG            Width
DECAY   1000035     8.73267838E+01   # neutralino4 decays
#          BR         NDA      ID1       ID2
     2.98384991E-05    2     1000022        23   # BR(~chi_40 -> ~chi_10   Z )
     7.33755095E-04    2     1000023        23   # BR(~chi_40 -> ~chi_20   Z )
     1.49924331E-02    2     1000025        23   # BR(~chi_40 -> ~chi_30   Z )
     6.70416069E-05    2     1000024       -24   # BR(~chi_40 -> ~chi_1+   W-)
     6.70416069E-05    2    -1000024        24   # BR(~chi_40 -> ~chi_1-   W+)
     1.53294504E-02    2     1000037       -24   # BR(~chi_40 -> ~chi_2+   W-)
     1.53294504E-02    2    -1000037        24   # BR(~chi_40 -> ~chi_2-   W+)
     4.51682139E-05    2     1000022        25   # BR(~chi_40 -> ~chi_10   h )
     1.59436849E-02    2     1000023        25   # BR(~chi_40 -> ~chi_20   h )
     7.51610083E-04    2     1000025        25   # BR(~chi_40 -> ~chi_30   h )
     1.11892225E-03    2     1000002        -2   # BR(~chi_40 -> ~u_L      ub)
     1.11892225E-03    2    -1000002         2   # BR(~chi_40 -> ~u_L*     u )
     1.23412493E-01    2     2000002        -2   # BR(~chi_40 -> ~u_R      ub)
     1.23412493E-01    2    -2000002         2   # BR(~chi_40 -> ~u_R*     u )
     1.12765941E-03    2     1000001        -1   # BR(~chi_40 -> ~d_L      db)
     1.12765941E-03    2    -1000001         1   # BR(~chi_40 -> ~d_L*     d )
     5.06148350E-03    2     2000001        -1   # BR(~chi_40 -> ~d_R      db)
     5.06148350E-03    2    -2000001         1   # BR(~chi_40 -> ~d_R*     d )
     1.11891998E-03    2     1000004        -4   # BR(~chi_40 -> ~c_L      cb)
     1.11891998E-03    2    -1000004         4   # BR(~chi_40 -> ~c_L*     c )
     1.23412489E-01    2     2000004        -4   # BR(~chi_40 -> ~c_R      cb)
     1.23412489E-01    2    -2000004         4   # BR(~chi_40 -> ~c_R*     c )
     1.12765941E-03    2     1000003        -3   # BR(~chi_40 -> ~s _L      sb)
     1.12765941E-03    2    -1000003         3   # BR(~chi_40 -> ~s _L*     s )
     5.06148350E-03    2     2000003        -3   # BR(~chi_40 -> ~s _R      sb)
     5.06148350E-03    2    -2000003         3   # BR(~chi_40 -> ~s _R*     s )
     7.94449155E-03    2     1000006        -6   # BR(~chi_40 -> ~t_1      tb)
     7.94449155E-03    2    -1000006         6   # BR(~chi_40 -> ~t_1*     t )
     3.87416661E-02    2     2000006        -6   # BR(~chi_40 -> ~t_2      tb)
     3.87416661E-02    2    -2000006         6   # BR(~chi_40 -> ~t_2*     t )
     7.75745632E-03    2     1000005        -5   # BR(~chi_40 -> ~b_1      bb)
     7.75745632E-03    2    -1000005         5   # BR(~chi_40 -> ~b_1*     b )
     1.97447912E-02    2     2000005        -5   # BR(~chi_40 -> ~b_2      bb)
     1.97447912E-02    2    -2000005         5   # BR(~chi_40 -> ~b_2*     b )
     2.97986061E-03    2     1000011       -11   # BR(~chi_40 -> ~e_L-     e+)
     2.97986061E-03    2    -1000011        11   # BR(~chi_40 -> ~e_L+     e-)
     5.86097077E-02    2     2000011       -11   # BR(~chi_40 -> ~e_R-     e+)
     5.86097077E-02    2    -2000011        11   # BR(~chi_40 -> ~e_R+     e-)
     2.97986061E-03    2     1000013       -13   # BR(~chi_40 -> ~mu_L-    mu+)
     2.97986061E-03    2    -1000013        13   # BR(~chi_40 -> ~mu_L+    mu-)
     5.86097077E-02    2     2000013       -13   # BR(~chi_40 -> ~mu_R-    mu+)
     5.86097077E-02    2    -2000013        13   # BR(~chi_40 -> ~mu_R+    mu-)
     1.76557941E-03    2     1000015       -15   # BR(~chi_40 -> ~tau_1-   tau+)
     1.76557941E-03    2    -1000015        15   # BR(~chi_40 -> ~tau_1+   tau-)
     3.00118363E-03    2     1000012       -12   # BR(~chi_40 -> ~nu_eL    nu_eb)
     3.00118363E-03    2    -1000012        12   # BR(~chi_40 -> ~nu_eL*   nu_e )
     3.00118363E-03    2     1000014       -14   # BR(~chi_40 -> ~nu_muL   nu_mub)
     3.00118363E-03    2    -1000014        14   # BR(~chi_40 -> ~nu_muL*  nu_mu )
     1.77866460E-03    2     1000016       -16   # BR(~chi_40 -> ~nu_tau1  nu_taub)
     1.77866460E-03    2    -1000016        16   # BR(~chi_40 -> ~nu_tau1* nu_tau )
#
#         PDG            Width
DECAY        25     3.96237748E-03   # h decays
#          BR         NDA      ID1       ID2
     5.15560119E-01    2           5        -5   # BR(h -> b       bb     )
     6.67978824E-02    2         -15        15   # BR(h -> tau+    tau-   )
     2.36430136E-04    2         -13        13   # BR(h -> mu+     mu-    )
     2.57243530E-04    2           3        -3   # BR(h -> s       sb     )
     2.22080685E-02    2           4        -4   # BR(h -> c       cb     )
     8.38513159E-02    2          21        21   # BR(h -> g       g      )
     2.57427085E-03    2          22        22   # BR(h -> gam     gam    )
     1.92264172E-03    2          22        23   # BR(h -> Z       gam    )
     2.71581560E-01    2          24       -24   # BR(h -> W+      W-     )
     3.50104684E-02    2          23        23   # BR(h -> Z       Z      )
#
#         PDG            Width
DECAY        35     1.86168945E+01   # H decays
#          BR         NDA      ID1       ID2
     2.44080460E-01    2           5        -5   # BR(H -> b       bb     )
     3.86361677E-02    2         -15        15   # BR(H -> tau+    tau-   )
     1.36696708E-04    2         -13        13   # BR(H -> mu+     mu-    )
     9.62731554E-05    2           3        -3   # BR(H -> s       sb     )
     7.20264164E-07    2           4        -4   # BR(H -> c       cb     )
     7.09477707E-02    2           6        -6   # BR(H -> t       tb     )
     6.97613650E-06    2          21        21   # BR(H -> g       g      )
     8.35766909E-08    2          22        22   # BR(H -> gam     gam    )
     4.05114833E-08    2          23        22   # BR(H -> Z       gam    )
     3.30745431E-05    2          24       -24   # BR(H -> W+      W-     )
     1.65051800E-05    2          23        23   # BR(H -> Z       Z      )
     1.06437003E-04    2          25        25   # BR(H -> h       h      )
     4.58241827E-13    2          23        36   # BR(H -> Z       A      )
     2.94693476E-03    2     1000024  -1000024   # BR(H -> ~chi_1+ ~chi_1-)
     1.34833379E-01    2     1000024  -1000037   # BR(H -> ~chi_1+ ~chi_2-)
     1.34833379E-01    2     1000037  -1000024   # BR(H -> ~chi_2+ ~chi_1-)
     1.47399495E-03    2     1000022   1000022   # BR(H -> ~chi_10 ~chi_10)
     5.99056057E-02    2     1000022   1000023   # BR(H -> ~chi_10 ~chi_20)
     7.51607352E-02    2     1000022   1000025   # BR(H -> ~chi_10 ~chi_30)
     3.19876405E-06    2     2000002  -2000002   # BR(H -> ~u_R    ~u_R*  )
     3.19876405E-06    2     2000004  -2000004   # BR(H -> ~c_R    ~c_R*  )
     7.92678912E-02    2     1000006  -1000006   # BR(H -> ~t_1    ~t_1*  )
     6.95360540E-04    2     1000005  -1000005   # BR(H -> ~b_1    ~b_1*  )
     7.84075583E-02    2     1000005  -2000005   # BR(H -> ~b_1    ~b_2*  )
     7.84075583E-02    2     2000005  -1000005   # BR(H -> ~b_2    ~b_1*  )
#
#         PDG            Width
DECAY        36     1.71237687E+01   # A decays
#          BR         NDA      ID1       ID2
     2.65293069E-01    2           5        -5   # BR(A -> b       bb     )
     4.19881711E-02    2         -15        15   # BR(A -> tau+    tau-   )
     1.48556098E-04    2         -13        13   # BR(A -> mu+     mu-    )
     1.04703263E-04    2           3        -3   # BR(A -> s       sb     )
     7.86476327E-07    2           4        -4   # BR(A -> c       cb     )
     7.72778225E-02    2           6        -6   # BR(A -> t       tb     )
     7.76699293E-05    2          21        21   # BR(A -> g       g      )
     8.32336673E-08    2          22        22   # BR(A -> gam     gam    )
     9.33950459E-08    2          23        22   # BR(A -> Z       gam    )
     3.64040360E-05    2          23        25   # BR(A -> Z       h      )
     3.26795350E-03    2     1000024  -1000024   # BR(A -> ~chi_1+ ~chi_1-)
     1.46161112E-01    2     1000024  -1000037   # BR(A -> ~chi_1+ ~chi_2-)
     1.46161112E-01    2     1000037  -1000024   # BR(A -> ~chi_2+ ~chi_1-)
     1.63447149E-03    2     1000022   1000022   # BR(A -> ~chi_10 ~chi_10)
     8.18666478E-02    2     1000022   1000023   # BR(A -> ~chi_10 ~chi_20)
     6.45734556E-02    2     1000022   1000025   # BR(A -> ~chi_10 ~chi_30)
     8.57039447E-02    2     1000005  -2000005   # BR(A -> ~b_1    ~b_2*  )
     8.57039447E-02    2    -1000005   2000005   # BR(A -> ~b_1*   ~b_2   )
#
#         PDG            Width
DECAY        37     2.26985416E+01   # H+ decays
#          BR         NDA      ID1       ID2
     3.91540975E-04    2           4        -5   # BR(H+ -> c       bb     )
     3.16882078E-02    2         -15        16   # BR(H+ -> tau+    nu_tau )
     1.12114350E-04    2         -13        14   # BR(H+ -> mu+     nu_mu  )
     3.91539654E-06    2           2        -5   # BR(H+ -> u       bb     )
     3.95120296E-06    2           2        -3   # BR(H+ -> u       sb     )
     7.83408103E-05    2           4        -3   # BR(H+ -> c       sb     )
     2.90007188E-01    2           6        -5   # BR(H+ -> t       bb     )
     2.75089478E-05    2          24        25   # BR(H+ -> W+      h      )
     2.29150337E-13    2          24        36   # BR(H+ -> W+      A      )
     2.66934277E-11    2     1000024   1000022   # BR(H+ -> ~chi_1+ ~chi_10)
     1.11326837E-01    2     1000024   1000023   # BR(H+ -> ~chi_1+ ~chi_20)
     1.10847247E-01    2     1000024   1000025   # BR(H+ -> ~chi_1+ ~chi_30)
     1.10914100E-01    2     1000037   1000022   # BR(H+ -> ~chi_2+ ~chi_10)
     5.70586465E-02    2     1000006  -1000005   # BR(H+ -> ~t_1    ~b_1*  )
     2.87540403E-01    2     1000006  -2000005   # BR(H+ -> ~t_1    ~b_2*  )
