#
#                              ======================
#                              | THE SUSYHIT OUTPUT |
#                              ======================
#
#
#              ------------------------------------------------------
#              |     This is the output of the SUSY-HIT package     |
#              |  created by A.Djouadi, M.Muehlleitner and M.Spira. |
#              |  In case of problems with SUSY-HIT email to        |
#              |           margarete.muehlleitner@cern.ch           |
#              |           michael.spira@psi.ch                     |
#              |           abdelhak.djouadi@cern.ch                 |
#              ------------------------------------------------------
#
#              ------------------------------------------------------
#              |  SUSY Les Houches Accord - MSSM Spectrum + Decays  |
#              |              based on the decay programs           |
#              |                                                    |
#              |                     SDECAY 1.3b                    |
#              |                                                    |
#              |  Authors: M.Muhlleitner, A.Djouadi and Y.Mambrini  |
#              |  Ref.:    Comput.Phys.Commun.168(2005)46           |
#              |           [hep-ph/0311167]                         |
#              |                                                    |
#              |                     HDECAY 3.4                     |
#              |                                                    |
#              |  By: A.Djouadi,J.Kalinowski,M.Muhlleitner,M.Spira  |
#              |  Ref.:    Comput.Phys.Commun.108(1998)56           |
#              |           [hep-ph/9704448]                         |
#              |                                                    |
#              |                                                    |
#              |  If not stated otherwise all DRbar couplings and   |
#              |  soft SUSY breaking masses are given at the scale  |
#              |  Q=  0.20458820E+04
#              |                                                    |
#              ------------------------------------------------------
#
#
BLOCK DCINFO  # Decay Program information
     1   SDECAY/HDECAY # decay calculator
     2   1.3b  /3.4    # version number
#
BLOCK SPINFO  # Spectrum calculator information
     1     SOFTSUSY    # spectrum calculator               
     2     3.4.0       # version number                    
#
BLOCK MODSEL  # Model selection
     1     0   #  nonUniversal                                     
#
BLOCK SMINPUTS  # Standard Model inputs
         1     1.27908970E+02   # alpha_em^-1(M_Z)^MSbar
         2     1.16637870E-05   # G_F [GeV^-2]
         3     1.18400000E-01   # alpha_S(M_Z)^MSbar
         4     9.11876000E+01   # M_Z pole mass
         5     4.18000000E+00   # mb(mb)^MSbar
         6     1.73200000E+02   # mt pole mass
         7     1.77700000E+00   # mtau pole mass
#
BLOCK MINPAR  # Input parameters - minimal models
         3     3.49400000E+01   # tanb                
#
BLOCK EXTPAR  # Input parameters - non-minimal models
         0    -1.00000000E+00   # Set                 
         1    -5.48800000E+01   # M_1(MX)             
         2    -1.81493000E+03   # M_2(MX)             
         3     6.42440000E+02   # M_3(MX)             
        11    -3.04555000E+03   # At(MX)              
        12    -2.48293000E+03   # Ab(MX)              
        13     2.86288000E+03   # Atau(MX)            
        23     1.18790000E+02   # mu(MX)              
        26     2.36833000E+03   # mA(pole)            
        31     1.66649000E+03   # meL(MX)             
        32     1.66649000E+03   # mmuL(MX)            
        33     3.59860000E+03   # mtauL(MX)           
        34     3.54868000E+03   # meR(MX)             
        35     3.54868000E+03   # mmuR(MX)            
        36     1.47938000E+03   # mtauR(MX)           
        41     2.03580000E+03   # mqL1(MX)            
        42     2.03580000E+03   # mqL2(MX)            
        43     1.90071000E+03   # mqL3(MX)            
        44     1.31456000E+03   # muR(MX)             
        45     1.31456000E+03   # mcR(MX)             
        46     2.20429000E+03   # mtR(MX)             
        47     1.47338000E+03   # mdR(MX)             
        48     1.47338000E+03   # msR(MX)             
        49     5.43900000E+02   # mbR(MX)             
#
BLOCK MASS  # Mass Spectrum
# PDG code           mass       particle
        24     8.03904592E+01   # W+
        25     1.26164043E+02   # h
        35     2.36833663E+03   # H
        36     2.36833001E+03   # A
        37     2.36986046E+03   # H+
         5     4.81876030E+00   # b-quark pole mass calculated from mb(mb)_Msbar
   1000001     2.07291532E+03   # ~d_L
   2000001     1.49826104E+03   # ~d_R
   1000002     2.07152617E+03   # ~u_L
   2000002     1.33746782E+03   # ~u_R
   1000003     2.07291532E+03   # ~s_L
   2000003     1.49826104E+03   # ~s_R
   1000004     2.07152617E+03   # ~c_L
   2000004     1.33746782E+03   # ~c_R
   1000005     5.84379459E+02   # ~b_1
   2000005     1.90508457E+03   # ~b_2
   1000006     1.86785052E+03   # ~t_1
   2000006     2.19741962E+03   # ~t_2
   1000011     1.68238247E+03   # ~e_L
   2000011     3.55294829E+03   # ~e_R
   1000012     1.68019719E+03   # ~nu_eL
   1000013     1.68238247E+03   # ~mu_L
   2000013     3.55294829E+03   # ~mu_R
   1000014     1.68019719E+03   # ~nu_muL
   1000015     1.48278659E+03   # ~tau_1
   2000015     3.60310870E+03   # ~tau_2
   1000016     3.60190859E+03   # ~nu_tauL
   1000021     7.73328001E+02   # ~g
   1000022    -4.83763508E+01   # ~chi_10
   1000023     1.31890724E+02   # ~chi_20
   1000025    -1.35025963E+02   # ~chi_30
   1000035    -1.83709197E+03   # ~chi_40
   1000024     1.25003069E+02   # ~chi_1+
   1000037     1.83724934E+03   # ~chi_2+
#
BLOCK NMIX  # Neutralino Mixing Matrix
  1  1     9.15234182E-01   # N_11
  1  2    -5.46256328E-03   # N_12
  1  3     3.78699630E-01   # N_13
  1  4     1.37488698E-01   # N_14
  2  1     1.73042306E-01   # N_21
  2  2    -2.93853195E-02   # N_22
  2  3    -6.77834434E-01   # N_23
  2  4     7.13956121E-01   # N_24
  3  1    -3.63870140E-01   # N_31
  3  2    -3.08121774E-02   # N_32
  3  3     6.30178235E-01   # N_33
  3  4     6.85218595E-01   # N_34
  4  1    -1.12824323E-03   # N_41
  4  2     9.99078212E-01   # N_42
  4  3     1.56889902E-03   # N_43
  4  4     4.28834758E-02   # N_44
#
BLOCK UMIX  # Chargino Mixing Matrix U
  1  1    -2.22927067E-03   # U_11
  1  2     9.99997515E-01   # U_12
  2  1    -9.99997515E-01   # U_21
  2  2    -2.22927067E-03   # U_22
#
BLOCK VMIX  # Chargino Mixing Matrix V
  1  1     6.06802258E-02   # V_11
  1  2     9.98157257E-01   # V_12
  2  1     9.98157257E-01   # V_21
  2  2    -6.06802258E-02   # V_22
#
BLOCK STOPMIX  # Stop Mixing Matrix
  1  1     9.40939546E-01   # cos(theta_t)
  1  2     3.38574616E-01   # sin(theta_t)
  2  1    -3.38574616E-01   # -sin(theta_t)
  2  2     9.40939546E-01   # cos(theta_t)
#
BLOCK SBOTMIX  # Sbottom Mixing Matrix
  1  1     4.47970849E-03   # cos(theta_b)
  1  2     9.99989966E-01   # sin(theta_b)
  2  1    -9.99989966E-01   # -sin(theta_b)
  2  2     4.47970849E-03   # cos(theta_b)
#
BLOCK STAUMIX  # Stau Mixing Matrix
  1  1     2.03628921E-04   # cos(theta_tau)
  1  2     9.99999979E-01   # sin(theta_tau)
  2  1    -9.99999979E-01   # -sin(theta_tau)
  2  2     2.03628921E-04   # cos(theta_tau)
#
BLOCK ALPHA  # Higgs mixing
          -2.95648684E-02   # Mixing angle in the neutral Higgs boson sector
#
BLOCK HMIX Q=  2.04588200E+03  # DRbar Higgs Parameters
         1     1.20811849E+02   # mu(Q)MSSM           
         2     3.39492709E+01   # tan                 
         3     2.42615684E+02   # higgs               
         4     5.54347225E+06   # mA^2(Q)MSSM         
#
BLOCK GAUGE Q=  2.04588200E+03  # The gauge couplings
     1     3.64462169E-01   # gprime(Q) DRbar
     2     6.39768546E-01   # g(Q) DRbar
     3     1.04890872E+00   # g3(Q) DRbar
#
BLOCK AU Q=  2.04588200E+03  # The trilinear couplings
  1  1     0.00000000E+00   # A_u(Q) DRbar
  2  2     0.00000000E+00   # A_c(Q) DRbar
  3  3    -3.04555000E+03   # A_t(Q) DRbar
#
BLOCK AD Q=  2.04588200E+03  # The trilinear couplings
  1  1     0.00000000E+00   # A_d(Q) DRbar
  2  2     0.00000000E+00   # A_s(Q) DRbar
  3  3    -2.48293000E+03   # A_b(Q) DRbar
#
BLOCK AE Q=  2.04588200E+03  # The trilinear couplings
  1  1     0.00000000E+00   # A_e(Q) DRbar
  2  2     0.00000000E+00   # A_mu(Q) DRbar
  3  3     2.86288000E+03   # A_tau(Q) DRbar
#
BLOCK Yu Q=  2.04588200E+03  # The Yukawa couplings
  1  1     0.00000000E+00   # y_u(Q) DRbar
  2  2     0.00000000E+00   # y_c(Q) DRbar
  3  3     8.32460850E-01   # y_t(Q) DRbar
#
BLOCK Yd Q=  2.04588200E+03  # The Yukawa couplings
  1  1     0.00000000E+00   # y_d(Q) DRbar
  2  2     0.00000000E+00   # y_s(Q) DRbar
  3  3     4.46216301E-01   # y_b(Q) DRbar
#
BLOCK Ye Q=  2.04588200E+03  # The Yukawa couplings
  1  1     0.00000000E+00   # y_e(Q) DRbar
  2  2     0.00000000E+00   # y_mu(Q) DRbar
  3  3     3.45798837E-01   # y_tau(Q) DRbar
#
BLOCK MSOFT Q=  2.04588200E+03  # The soft SUSY breaking masses at the scale Q
         1    -5.48800000E+01   # M_1(Q)              
         2    -1.81493000E+03   # M_2(Q)              
         3     6.42440000E+02   # M_3(Q)              
        21     5.66044124E+06   # mH1^2(Q)            
        22     5.32634069E+04   # mH2^2(Q)            
        31     1.66649000E+03   # meL(Q)              
        32     1.66649000E+03   # mmuL(Q)             
        33     3.59860000E+03   # mtauL(Q)            
        34     3.54868000E+03   # meR(Q)              
        35     3.54868000E+03   # mmuR(Q)             
        36     1.47938000E+03   # mtauR(Q)            
        41     2.03580000E+03   # mqL1(Q)             
        42     2.03580000E+03   # mqL2(Q)             
        43     1.90071000E+03   # mqL3(Q)             
        44     1.31456000E+03   # muR(Q)              
        45     1.31456000E+03   # mcR(Q)              
        46     2.20429000E+03   # mtR(Q)              
        47     1.47338000E+03   # mdR(Q)              
        48     1.47338000E+03   # msR(Q)              
        49     5.43899995E+02   # mbR(Q)              
#
Block HiggsBoundsInputHiggsCouplingsFermions
# ScalarNormEffCoupSq PseudoSNormEffCoupSq NP   IP1 IP2 IP2
    1.00800552E+00    0.00000000E+00        3  25   5   5  # h0-b-b eff. coupling^2, normalised to SM
    1.15254499E+03    0.00000000E+00        3  35   5   5  # H0-b-b eff. coupling^2, normalised to SM
    0.00000000E+00    1.15255299E+03        3  36   5   5  # A0-b-b eff. coupling^2, normalised to SM
#
    9.99993054E-01    0.00000000E+00        3  25   6   6  # h0-t-t eff. coupling^2, normalised to SM
    8.74584967E-04    0.00000000E+00        3  35   6   6  # H0-t-t eff. coupling^2, normalised to SM
    0.00000000E+00    8.67639063E-04        3  36   6   6  # A0-t-t eff. coupling^2, normalised to SM
#
    1.00800552E+00    0.00000000E+00        3  25  15  15  # h0-tau-tau eff. coupling^2, normalised to SM
    1.15254499E+03    0.00000000E+00        3  35  15  15  # H0-tau-tau eff. coupling^2, normalised to SM
    0.00000000E+00    1.15255299E+03        3  36  15  15  # A0-tau-tau eff. coupling^2, normalised to SM
#
Block HiggsBoundsInputHiggsCouplingsBosons
    9.99999986E-01        3  25  24  24  # h0-W-W eff. coupling^2, normalised to SM
    1.38460783E-08        3  35  24  24  # H0-W-W eff. coupling^2, normalised to SM
    0.00000000E+00        3  36  24  24  # A0-W-W eff. coupling^2, normalised to SM
#
    9.99999986E-01        3  25  23  23  # h0-Z-Z eff. coupling^2, normalised to SM
    1.38460783E-08        3  35  23  23  # H0-Z-Z eff. coupling^2, normalised to SM
    0.00000000E+00        3  36  23  23  # A0-Z-Z eff. coupling^2, normalised to SM
#
    8.88147297E-01        3  25  21  21  # h0-g-g eff. coupling^2, normalised to SM
    5.52147907E-12        3  35  21  21  # H0-g-g eff. coupling^2, normalised to SM
    3.35866959E-11        3  36  21  21  # A0-g-g eff. coupling^2, normalised to SM
#
    0.00000000E+00        3  25  25  23  # h0-h0-Z eff. coupling^2, normalised to SM
    0.00000000E+00        3  35  25  23  # H0-h0-Z eff. coupling^2, normalised to SM
    1.38460783E-08        3  36  25  23  # A0-h0-Z eff. coupling^2, normalised to SM
    0.00000000E+00        3  35  35  23  # H0-H0-Z eff. coupling^2, normalised to SM
    9.99999986E-01        3  36  35  23  # A0-H0-Z eff. coupling^2, normalised to SM
    0.00000000E+00        3  36  36  23  # A0-A0-Z eff. coupling^2, normalised to SM
#
    0.00000000E+00        4  25  21  21  23  # h0-g-g-Z eff. coupling^2, normalised to SM
    0.00000000E+00        4  35  21  21  23  # H0-g-g-Z eff. coupling^2, normalised to SM
    0.00000000E+00        4  36  21  21  23  # A0-g-g-Z eff. coupling^2, normalised to SM
#
#
#
#                             =================
#                             |The decay table|
#                             =================
#
# - The QCD corrections to the decays gluino -> squark  + quark
#                                     squark -> gaugino + quark_prime
#                                     squark -> squark_prime + Higgs
#                                     squark -> gluino  + quark
#   are included.
#
# - The multi-body decays for the inos, stops and sbottoms are included.
#
# - The loop induced decays for the gluino, neutralinos and stops
#   are included.
#
# - The SUSY decays of the top quark are included.
#
#
#         PDG            Width
DECAY         6     1.44148243E+00   # top decays
#          BR         NDA      ID1       ID2
     1.00000000E+00    2           5        24   # BR(t ->  b    W+)
#
#         PDG            Width
DECAY   1000021     3.56746119E+00   # gluino decays
#          BR         NDA      ID1       ID2
     5.00000000E-01    2     1000005        -5   # BR(~g -> ~b_1  bb)
     5.00000000E-01    2    -1000005         5   # BR(~g -> ~b_1* b )
#
#         PDG            Width
DECAY   1000006     1.11456392E+02   # stop1 decays
#          BR         NDA      ID1       ID2
     3.98980968E-03    2     1000022         6   # BR(~t_1 -> ~chi_10 t )
     1.06662968E-01    2     1000023         6   # BR(~t_1 -> ~chi_20 t )
     1.16836118E-01    2     1000025         6   # BR(~t_1 -> ~chi_30 t )
     7.80248691E-02    2     1000024         5   # BR(~t_1 -> ~chi_1+ b )
     1.32700714E-04    2     1000037         5   # BR(~t_1 -> ~chi_2+ b )
     6.93876654E-01    2     1000021         6   # BR(~t_1 -> ~g      t )
     4.76880023E-04    2     1000005        24   # BR(~t_1 -> ~b_1    W+)
#
#         PDG            Width
DECAY   2000006     1.77717781E+02   # stop2 decays
#          BR         NDA      ID1       ID2
     2.87652093E-02    2     1000022         6   # BR(~t_2 -> ~chi_10 t )
     9.18955502E-02    2     1000023         6   # BR(~t_2 -> ~chi_20 t )
     7.46451461E-02    2     1000025         6   # BR(~t_2 -> ~chi_30 t )
     2.99305702E-04    2     1000035         6   # BR(~t_2 -> ~chi_40 t )
     1.60055110E-01    2     1000024         5   # BR(~t_2 -> ~chi_1+ b )
     6.33799554E-04    2     1000037         5   # BR(~t_2 -> ~chi_2+ b )
     5.22914811E-01    2     1000021         6   # BR(~t_2 -> ~g      t )
     2.48241289E-02    2     1000006        25   # BR(~t_2 -> ~t_1    h )
     3.72190531E-02    2     1000006        23   # BR(~t_2 -> ~t_1    Z )
     6.90913688E-05    2     1000005        24   # BR(~t_2 -> ~b_1    W+)
     5.86787951E-02    2     2000005        24   # BR(~t_2 -> ~b_2    W+)
#
#         PDG            Width
DECAY   1000005     4.15762614E+00   # sbottom1 decays
#          BR         NDA      ID1       ID2
     1.48130118E-01    2     1000022         5   # BR(~b_1 -> ~chi_10 b )
     2.32378671E-01    2     1000023         5   # BR(~b_1 -> ~chi_20 b )
     2.07035743E-01    2     1000025         5   # BR(~b_1 -> ~chi_30 b )
     4.12455467E-01    2    -1000024         6   # BR(~b_1 -> ~chi_1- t )
#
#         PDG            Width
DECAY   2000005     1.10956750E+02   # sbottom2 decays
#          BR         NDA      ID1       ID2
     1.18626345E-02    2     1000022         5   # BR(~b_2 -> ~chi_10 b )
     3.12726915E-02    2     1000023         5   # BR(~b_2 -> ~chi_20 b )
     2.69061586E-02    2     1000025         5   # BR(~b_2 -> ~chi_30 b )
     3.42119365E-04    2     1000035         5   # BR(~b_2 -> ~chi_40 b )
     2.29929741E-01    2    -1000024         6   # BR(~b_2 -> ~chi_1- t )
     6.99070902E-01    2     1000021         5   # BR(~b_2 -> ~g      b )
     3.17043054E-04    2     1000005        25   # BR(~b_2 -> ~b_1    h )
     2.98709504E-04    2     1000005        23   # BR(~b_2 -> ~b_1    Z )
#
#         PDG            Width
DECAY   1000002     1.17600920E+02   # sup_L decays
#          BR         NDA      ID1       ID2
     1.96082465E-03    2     1000022         2   # BR(~u_L -> ~chi_10 u)
     8.29722504E-07    2     1000023         2   # BR(~u_L -> ~chi_20 u)
     6.85923297E-04    2     1000025         2   # BR(~u_L -> ~chi_30 u)
     3.26343696E-03    2     1000035         2   # BR(~u_L -> ~chi_40 u)
     5.06645288E-04    2     1000024         1   # BR(~u_L -> ~chi_1+ d)
     6.50956732E-03    2     1000037         1   # BR(~u_L -> ~chi_2+ d)
     9.87072773E-01    2     1000021         2   # BR(~u_L -> ~g      u)
#
#         PDG            Width
DECAY   2000002     4.78327772E+01   # sup_R decays
#          BR         NDA      ID1       ID2
     5.25863539E-02    2     1000022         2   # BR(~u_R -> ~chi_10 u)
     1.85049280E-03    2     1000023         2   # BR(~u_R -> ~chi_20 u)
     8.17491663E-03    2     1000025         2   # BR(~u_R -> ~chi_30 u)
     9.37388237E-01    2     1000021         2   # BR(~u_R -> ~g      u)
#
#         PDG            Width
DECAY   1000001     1.17678316E+02   # sdown_L decays
#          BR         NDA      ID1       ID2
     2.22365255E-03    2     1000022         1   # BR(~d_L -> ~chi_10 d)
     2.66350573E-04    2     1000023         1   # BR(~d_L -> ~chi_20 d)
     1.00721313E-04    2     1000025         1   # BR(~d_L -> ~chi_30 d)
     3.29799449E-03    2     1000035         1   # BR(~d_L -> ~chi_40 d)
     6.83829442E-07    2    -1000024         2   # BR(~d_L -> ~chi_1- u)
     6.59716801E-03    2    -1000037         2   # BR(~d_L -> ~chi_2- u)
     9.87513429E-01    2     1000021         1   # BR(~d_L -> ~g      d)
#
#         PDG            Width
DECAY   2000001     6.18408595E+01   # sdown_R decays
#          BR         NDA      ID1       ID2
     1.14287644E-02    2     1000022         1   # BR(~d_R -> ~chi_10 d)
     4.03458508E-04    2     1000023         1   # BR(~d_R -> ~chi_20 d)
     1.78268588E-03    2     1000025         1   # BR(~d_R -> ~chi_30 d)
     9.86385091E-01    2     1000021         1   # BR(~d_R -> ~g      d)
#
#         PDG            Width
DECAY   1000004     9.10909361E+01   # scharm_L decays
#          BR         NDA      ID1       ID2
     2.62077179E-03    2     1000022         4   # BR(~c_L -> ~chi_10 c)
     1.10848762E-06    2     1000023         4   # BR(~c_L -> ~chi_20 c)
     9.16361931E-04    2     1000025         4   # BR(~c_L -> ~chi_30 c)
     4.21200843E-03    2     1000035         4   # BR(~c_L -> ~chi_40 c)
     6.76888166E-04    2     1000024         3   # BR(~c_L -> ~chi_1+ s)
     8.40169355E-03    2     1000037         3   # BR(~c_L -> ~chi_2+ s)
     9.83171168E-01    2     1000021         4   # BR(~c_L -> ~g      c)
#
#         PDG            Width
DECAY   2000004     3.77175703E+01   # scharm_R decays
#          BR         NDA      ID1       ID2
     6.95903318E-02    2     1000022         4   # BR(~c_R -> ~chi_10 c)
     2.44589771E-03    2     1000023         4   # BR(~c_R -> ~chi_20 c)
     1.08047844E-02    2     1000025         4   # BR(~c_R -> ~chi_30 c)
     9.17158986E-01    2     1000021         4   # BR(~c_R -> ~g      c)
#
#         PDG            Width
DECAY   1000003     9.11370887E+01   # sstrange_L decays
#          BR         NDA      ID1       ID2
     2.97249037E-03    2     1000022         3   # BR(~s_L -> ~chi_10 s)
     3.55889362E-04    2     1000023         3   # BR(~s_L -> ~chi_20 s)
     1.34578680E-04    2     1000025         3   # BR(~s_L -> ~chi_30 s)
     4.25814106E-03    2     1000035         3   # BR(~s_L -> ~chi_40 s)
     9.13741446E-07    2    -1000024         4   # BR(~s_L -> ~chi_1- c)
     8.51741394E-03    2    -1000037         4   # BR(~s_L -> ~chi_2- c)
     9.83760573E-01    2     1000021         3   # BR(~s_L -> ~g      s)
#
#         PDG            Width
DECAY   2000003     4.79376718E+01   # sstrange_R decays
#          BR         NDA      ID1       ID2
     1.53423380E-02    2     1000022         3   # BR(~s_R -> ~chi_10 s)
     5.41103878E-04    2     1000023         3   # BR(~s_R -> ~chi_20 s)
     2.39079587E-03    2     1000025         3   # BR(~s_R -> ~chi_30 s)
     9.81725762E-01    2     1000021         3   # BR(~s_R -> ~g      s)
#
#         PDG            Width
DECAY   1000011     2.23603179E+00   # selectron_L decays
#          BR         NDA      ID1       ID2
     8.14047309E-01    2     1000022        11   # BR(~e_L -> ~chi_10 e-)
     1.44865057E-02    2     1000023        11   # BR(~e_L -> ~chi_20 e-)
     1.71436073E-01    2     1000025        11   # BR(~e_L -> ~chi_30 e-)
     3.01120137E-05    2    -1000024        12   # BR(~e_L -> ~chi_1- nu_e)
#
#         PDG            Width
DECAY   2000011     1.87636310E+01   # selectron_R decays
#          BR         NDA      ID1       ID2
     8.37993161E-01    2     1000022        11   # BR(~e_R -> ~chi_10 e-)
     2.98843557E-02    2     1000023        11   # BR(~e_R -> ~chi_20 e-)
     1.32121800E-01    2     1000025        11   # BR(~e_R -> ~chi_30 e-)
     6.83805886E-07    2     1000035        11   # BR(~e_R -> ~chi_40 e-)
#
#         PDG            Width
DECAY   1000013     2.23603177E+00   # smuon_L decays
#          BR         NDA      ID1       ID2
     8.14047309E-01    2     1000022        13   # BR(~mu_L -> ~chi_10 mu-)
     1.44865057E-02    2     1000023        13   # BR(~mu_L -> ~chi_20 mu-)
     1.71436073E-01    2     1000025        13   # BR(~mu_L -> ~chi_30 mu-)
     3.01120139E-05    2    -1000024        14   # BR(~mu_L -> ~chi_1- nu_mu)
#
#         PDG            Width
DECAY   2000013     1.87636310E+01   # smuon_R decays
#          BR         NDA      ID1       ID2
     8.37993161E-01    2     1000022        13   # BR(~mu_R -> ~chi_10 mu-)
     2.98843557E-02    2     1000023        13   # BR(~mu_R -> ~chi_20 mu-)
     1.32121800E-01    2     1000025        13   # BR(~mu_R -> ~chi_30 mu-)
     6.83805885E-07    2     1000035        13   # BR(~mu_R -> ~chi_40 mu-)
#
#         PDG            Width
DECAY   1000015     1.47571570E+01   # stau_1 decays
#          BR         NDA      ID1       ID2
     4.78145669E-01    2     1000022        15   # BR(~tau_1 -> ~chi_10  tau-)
     1.23751447E-01    2     1000023        15   # BR(~tau_1 -> ~chi_20  tau-)
     1.62458748E-01    2     1000025        15   # BR(~tau_1 -> ~chi_30  tau-)
     2.35644135E-01    2    -1000024        16   # BR(~tau_1 -> ~chi_1-  nu_tau)
#
#         PDG            Width
DECAY   2000015     3.74294655E+01   # stau_2 decays
#          BR         NDA      ID1       ID2
     1.37090907E-01    2     1000022        15   # BR(~tau_2 -> ~chi_10  tau-)
     1.06816687E-01    2     1000023        15   # BR(~tau_2 -> ~chi_20  tau-)
     1.12861253E-01    2     1000025        15   # BR(~tau_2 -> ~chi_30  tau-)
     2.13973209E-01    2     1000035        15   # BR(~tau_2 -> ~chi_40  tau-)
     3.51188944E-06    2    -1000024        16   # BR(~tau_2 -> ~chi_1-  nu_tau)
     4.29235290E-01    2    -1000037        16   # BR(~tau_2 -> ~chi_2-  nu_tau)
     9.54348033E-06    2     1000015        25   # BR(~tau_2 -> ~tau_1   h)
     9.59914851E-06    2     1000015        23   # BR(~tau_2 -> ~tau_1   Z)
#
#         PDG            Width
DECAY   1000012     2.26643507E+00   # snu_eL decays
#          BR         NDA      ID1       ID2
     8.36409525E-01    2     1000022        12   # BR(~nu_eL -> ~chi_10 nu_e)
     4.88166666E-02    2     1000023        12   # BR(~nu_eL -> ~chi_20 nu_e)
     9.27918572E-02    2     1000025        12   # BR(~nu_eL -> ~chi_30 nu_e)
     2.19819508E-02    2     1000024        11   # BR(~nu_eL -> ~chi_1+ e-)
#
#         PDG            Width
DECAY   1000014     2.26643507E+00   # snu_muL decays
#          BR         NDA      ID1       ID2
     8.36409526E-01    2     1000022        14   # BR(~nu_muL -> ~chi_10 nu_mu)
     4.88166667E-02    2     1000023        14   # BR(~nu_muL -> ~chi_20 nu_mu)
     9.27918572E-02    2     1000025        14   # BR(~nu_muL -> ~chi_30 nu_mu)
     2.19819507E-02    2     1000024        13   # BR(~nu_muL -> ~chi_1+ mu-)
#
#         PDG            Width
DECAY   1000016     3.74376865E+01   # snu_tauL decays
#          BR         NDA      ID1       ID2
     1.08689935E-01    2     1000022        16   # BR(~nu_tauL -> ~chi_10 nu_tau)
     6.39702551E-03    2     1000023        16   # BR(~nu_tauL -> ~chi_20 nu_tau)
     1.21653004E-02    2     1000025        16   # BR(~nu_tauL -> ~chi_30 nu_tau)
     2.14305746E-01    2     1000035        16   # BR(~nu_tauL -> ~chi_40 nu_tau)
     2.31203561E-01    2     1000024        15   # BR(~nu_tauL -> ~chi_1+ tau-)
     4.27219799E-01    2     1000037        15   # BR(~nu_tauL -> ~chi_2+ tau-)
     1.86324673E-05    2    -1000015       -24   # BR(~nu_tauL -> ~tau_1+ W-)
#
#         PDG            Width
DECAY   1000024     9.82457833E-04   # chargino1+ decays
#           BR         NDA      ID1       ID2       ID3
     3.33369216E-01    3     1000022         2        -1   # BR(~chi_1+ -> ~chi_10 u    db)
     3.33369216E-01    3     1000022         4        -3   # BR(~chi_1+ -> ~chi_10 c    sb)
     1.11118547E-01    3     1000022       -11        12   # BR(~chi_1+ -> ~chi_10 e+   nu_e)
     1.11118547E-01    3     1000022       -13        14   # BR(~chi_1+ -> ~chi_10 mu+  nu_mu)
     1.11024475E-01    3     1000022       -15        16   # BR(~chi_1+ -> ~chi_10 tau+ nu_tau)
#
#         PDG            Width
DECAY   1000037     1.51847485E+01   # chargino2+ decays
#          BR         NDA      ID1       ID2
     9.82692040E-06    2    -1000005         6   # BR(~chi_2+ -> ~b_1*    t )
     1.31454281E-02    2     1000012       -11   # BR(~chi_2+ -> ~nu_eL   e+  )
     1.31454281E-02    2     1000014       -13   # BR(~chi_2+ -> ~nu_muL mu+ )
     1.28452738E-02    2    -1000011        12   # BR(~chi_2+ -> ~e_L+    nu_e)
     1.28452738E-02    2    -1000013        14   # BR(~chi_2+ -> ~mu_L+   nu_mu)
     6.00336146E-08    2    -1000015        16   # BR(~chi_2+ -> ~tau_1+  nu_tau)
     2.39865879E-01    2     1000024        23   # BR(~chi_2+ -> ~chi_1+  Z )
     6.13009600E-03    2     1000022        24   # BR(~chi_2+ -> ~chi_10  W+)
     2.35364856E-01    2     1000023        24   # BR(~chi_2+ -> ~chi_20  W+)
     2.25534128E-01    2     1000025        24   # BR(~chi_2+ -> ~chi_30  W+)
     2.41113750E-01    2     1000024        25   # BR(~chi_2+ -> ~chi_1+  h )
#
#         PDG            Width
DECAY   1000022     0.00000000E+00   # neutralino1 decays
#
#         PDG            Width
DECAY   1000023     4.29419448E-04   # neutralino2 decays
#          BR         NDA      ID1       ID2
     4.56553994E-04    2     1000022        22   # BR(~chi_20 -> ~chi_10 gam)
#           BR         NDA      ID1       ID2       ID3
     1.16942862E-01    3     1000022        -2         2   # BR(~chi_20 -> ~chi_10 ub      u)
     1.51612319E-01    3     1000022        -1         1   # BR(~chi_20 -> ~chi_10 db      d)
     1.16942862E-01    3     1000022        -4         4   # BR(~chi_20 -> ~chi_10 cb      c)
     1.51612319E-01    3     1000022        -3         3   # BR(~chi_20 -> ~chi_10 sb      s)
     1.49468027E-01    3     1000022        -5         5   # BR(~chi_20 -> ~chi_10 bb      b)
     3.47691571E-02    3     1000022       -11        11   # BR(~chi_20 -> ~chi_10 e+      e-)
     3.47691571E-02    3     1000022       -13        13   # BR(~chi_20 -> ~chi_10 mu+     mu-)
     3.46071879E-02    3     1000022       -15        15   # BR(~chi_20 -> ~chi_10 tau+    tau-)
     6.95904272E-02    3     1000022       -12        12   # BR(~chi_20 -> ~chi_10 nu_eb   nu_e)
     6.95904272E-02    3     1000022       -14        14   # BR(~chi_20 -> ~chi_10 nu_mub  nu_mu)
     6.95621081E-02    3     1000022       -16        16   # BR(~chi_20 -> ~chi_10 nu_taub nu_tau)
     1.31640775E-05    3     1000024        -2         1   # BR(~chi_20 -> ~chi_1+ ub      d)
     1.31640775E-05    3    -1000024        -1         2   # BR(~chi_20 -> ~chi_1- db      u)
     1.31640775E-05    3     1000024        -4         3   # BR(~chi_20 -> ~chi_1+ cb      s)
     1.31640775E-05    3    -1000024        -3         4   # BR(~chi_20 -> ~chi_1- sb      c)
     4.38811537E-06    3     1000024       -12        11   # BR(~chi_20 -> ~chi_1+ nu_eb   e-)
     4.38811537E-06    3    -1000024        12       -11   # BR(~chi_20 -> ~chi_1- nu_e    e+)
     4.38811537E-06    3     1000024       -14        13   # BR(~chi_20 -> ~chi_1+ nu_mub  mu-)
     4.38811537E-06    3    -1000024        14       -13   # BR(~chi_20 -> ~chi_1- nu_mu   mu+)
     3.19161756E-06    3     1000024       -16        15   # BR(~chi_20 -> ~chi_1+ nu_taub tau-)
     3.19161756E-06    3    -1000024        16       -15   # BR(~chi_20 -> ~chi_1- nu_tau  tau+)
#
#         PDG            Width
DECAY   1000025     5.37671923E-04   # neutralino3 decays
#          BR         NDA      ID1       ID2
     3.13961165E-04    2     1000022        22   # BR(~chi_30 -> ~chi_10 gam)
     3.66004024E-08    2     1000023        22   # BR(~chi_30 -> ~chi_20 gam)
#           BR         NDA      ID1       ID2       ID3
     1.16744311E-01    3     1000022        -2         2   # BR(~chi_30 -> ~chi_10 ub      u)
     1.51145237E-01    3     1000022        -1         1   # BR(~chi_30 -> ~chi_10 db      d)
     1.16744311E-01    3     1000022        -4         4   # BR(~chi_30 -> ~chi_10 cb      c)
     1.51145237E-01    3     1000022        -3         3   # BR(~chi_30 -> ~chi_10 sb      s)
     1.51729975E-01    3     1000022        -5         5   # BR(~chi_30 -> ~chi_10 bb      b)
     3.46082948E-02    3     1000022       -11        11   # BR(~chi_30 -> ~chi_10 e+      e-)
     3.46082948E-02    3     1000022       -13        13   # BR(~chi_30 -> ~chi_10 mu+     mu-)
     3.44238005E-02    3     1000022       -15        15   # BR(~chi_30 -> ~chi_10 tau+    tau-)
     6.94116901E-02    3     1000022       -12        12   # BR(~chi_30 -> ~chi_10 nu_eb   nu_e)
     6.94116901E-02    3     1000022       -14        14   # BR(~chi_30 -> ~chi_10 nu_mub  nu_mu)
     6.93597781E-02    3     1000022       -16        16   # BR(~chi_30 -> ~chi_10 nu_taub nu_tau)
     5.48405816E-08    3     1000023        -2         2   # BR(~chi_30 -> ~chi_20 ub      u)
     7.11668424E-08    3     1000023        -1         1   # BR(~chi_30 -> ~chi_20 db      d)
     5.48405816E-08    3     1000023        -4         4   # BR(~chi_30 -> ~chi_20 cb      c)
     7.11668424E-08    3     1000023        -3         3   # BR(~chi_30 -> ~chi_20 sb      s)
     1.63314074E-08    3     1000023       -11        11   # BR(~chi_30 -> ~chi_20 e+      e-)
     1.63314074E-08    3     1000023       -13        13   # BR(~chi_30 -> ~chi_20 mu+     mu-)
     3.26407336E-08    3     1000023       -12        12   # BR(~chi_30 -> ~chi_20 nu_eb   nu_e)
     3.26407336E-08    3     1000023       -14        14   # BR(~chi_30 -> ~chi_20 nu_mub  nu_mu)
     3.26435536E-08    3     1000023       -16        16   # BR(~chi_30 -> ~chi_20 nu_taub nu_tau)
     5.97660614E-05    3     1000024        -2         1   # BR(~chi_30 -> ~chi_1+ ub      d)
     5.97660614E-05    3    -1000024        -1         2   # BR(~chi_30 -> ~chi_1- db      u)
     5.97660614E-05    3     1000024        -4         3   # BR(~chi_30 -> ~chi_1+ cb      s)
     5.97660614E-05    3    -1000024        -3         4   # BR(~chi_30 -> ~chi_1- sb      c)
     1.99212367E-05    3     1000024       -12        11   # BR(~chi_30 -> ~chi_1+ nu_eb   e-)
     1.99212367E-05    3    -1000024        12       -11   # BR(~chi_30 -> ~chi_1- nu_e    e+)
     1.99212367E-05    3     1000024       -14        13   # BR(~chi_30 -> ~chi_1+ nu_mub  mu-)
     1.99212367E-05    3    -1000024        14       -13   # BR(~chi_30 -> ~chi_1- nu_mu   mu+)
     1.71254971E-05    3     1000024       -16        15   # BR(~chi_30 -> ~chi_1+ nu_taub tau-)
     1.71254971E-05    3    -1000024        16       -15   # BR(~chi_30 -> ~chi_1- nu_tau  tau+)
#
#         PDG            Width
DECAY   1000035     1.51858242E+01   # neutralino4 decays
#          BR         NDA      ID1       ID2
     3.71512860E-03    2     1000022        23   # BR(~chi_40 -> ~chi_10   Z )
     1.30688234E-01    2     1000023        23   # BR(~chi_40 -> ~chi_20   Z )
     1.05143351E-01    2     1000025        23   # BR(~chi_40 -> ~chi_30   Z )
     2.34056268E-01    2     1000024       -24   # BR(~chi_40 -> ~chi_1+   W-)
     2.34056268E-01    2    -1000024        24   # BR(~chi_40 -> ~chi_1-   W+)
     2.75887159E-03    2     1000022        25   # BR(~chi_40 -> ~chi_10   h )
     1.10724566E-01    2     1000023        25   # BR(~chi_40 -> ~chi_20   h )
     1.26962377E-01    2     1000025        25   # BR(~chi_40 -> ~chi_30   h )
     1.17061576E-07    2     2000002        -2   # BR(~chi_40 -> ~u_R      ub)
     1.17061576E-07    2    -2000002         2   # BR(~chi_40 -> ~u_R*     u )
     1.49952885E-08    2     2000001        -1   # BR(~chi_40 -> ~d_R      db)
     1.49952885E-08    2    -2000001         1   # BR(~chi_40 -> ~d_R*     d )
     1.17061140E-07    2     2000004        -4   # BR(~chi_40 -> ~c_R      cb)
     1.17061140E-07    2    -2000004         4   # BR(~chi_40 -> ~c_R*     c )
     1.49952885E-08    2     2000003        -3   # BR(~chi_40 -> ~s _R      sb)
     1.49952885E-08    2    -2000003         3   # BR(~chi_40 -> ~s _R*     s )
     5.21804986E-06    2     1000005        -5   # BR(~chi_40 -> ~b_1      bb)
     5.21804986E-06    2    -1000005         5   # BR(~chi_40 -> ~b_1*     b )
     6.39020017E-03    2     1000011       -11   # BR(~chi_40 -> ~e_L-     e+)
     6.39020017E-03    2    -1000011        11   # BR(~chi_40 -> ~e_L+     e-)
     6.39020017E-03    2     1000013       -13   # BR(~chi_40 -> ~mu_L-    mu+)
     6.39020017E-03    2    -1000013        13   # BR(~chi_40 -> ~mu_L+    mu-)
     7.95100585E-08    2     1000015       -15   # BR(~chi_40 -> ~tau_1-   tau+)
     7.95100585E-08    2    -1000015        15   # BR(~chi_40 -> ~tau_1+   tau-)
     6.58075282E-03    2     1000012       -12   # BR(~chi_40 -> ~nu_eL    nu_eb)
     6.58075282E-03    2    -1000012        12   # BR(~chi_40 -> ~nu_eL*   nu_e )
     6.58075282E-03    2     1000014       -14   # BR(~chi_40 -> ~nu_muL   nu_mub)
     6.58075282E-03    2    -1000014        14   # BR(~chi_40 -> ~nu_muL*  nu_mu )
#
#         PDG            Width
DECAY        25     5.41337545E-03   # h decays
#          BR         NDA      ID1       ID2
     4.68320152E-01    2           5        -5   # BR(h -> b       bb     )
     4.86310700E-02    2         -15        15   # BR(h -> tau+    tau-   )
     1.72137265E-04    2         -13        13   # BR(h -> mu+     mu-    )
     1.87519686E-04    2           3        -3   # BR(h -> s       sb     )
     1.61409490E-02    2           4        -4   # BR(h -> c       cb     )
     6.05628465E-02    2          21        21   # BR(h -> g       g      )
     1.80725268E-03    2          22        22   # BR(h -> gam     gam    )
     1.27869349E-03    2          22        23   # BR(h -> Z       gam    )
     1.76061277E-01    2          24       -24   # BR(h -> W+      W-     )
     2.23779126E-02    2          23        23   # BR(h -> Z       Z      )
     2.04460190E-01    2     1000022   1000022   # BR(h -> ~chi_10 ~chi_10)
#
#         PDG            Width
DECAY        35     4.60956972E+01   # H decays
#          BR         NDA      ID1       ID2
     7.11607307E-01    2           5        -5   # BR(H -> b       bb     )
     1.23508898E-01    2         -15        15   # BR(H -> tau+    tau-   )
     4.39839951E-04    2         -13        13   # BR(H -> mu+     mu-    )
     2.73429674E-04    2           3        -3   # BR(H -> s       sb     )
     1.90381322E-08    2           4        -4   # BR(H -> c       cb     )
     1.85797999E-03    2           6        -6   # BR(H -> t       tb     )
     1.44063720E-05    2          21        21   # BR(H -> g       g      )
     6.61739562E-09    2          22        22   # BR(H -> gam     gam    )
     7.89588527E-09    2          23        22   # BR(H -> Z       gam    )
     1.27865148E-06    2          24       -24   # BR(H -> W+      W-     )
     6.37409336E-07    2          23        23   # BR(H -> Z       Z      )
     5.11407041E-06    2          25        25   # BR(H -> h       h      )
     1.58012269E-03    2     1000024  -1000024   # BR(H -> ~chi_1+ ~chi_1-)
     3.28069965E-02    2     1000024  -1000037   # BR(H -> ~chi_1+ ~chi_2-)
     3.28069965E-02    2     1000037  -1000024   # BR(H -> ~chi_2+ ~chi_1-)
     1.56239205E-02    2     1000022   1000022   # BR(H -> ~chi_10 ~chi_10)
     2.74497544E-03    2     1000023   1000023   # BR(H -> ~chi_20 ~chi_20)
     4.85918492E-03    2     1000025   1000025   # BR(H -> ~chi_30 ~chi_30)
     1.68296670E-02    2     1000022   1000023   # BR(H -> ~chi_10 ~chi_20)
     1.45216375E-02    2     1000022   1000025   # BR(H -> ~chi_10 ~chi_30)
     4.59643000E-03    2     1000022   1000035   # BR(H -> ~chi_10 ~chi_40)
     7.57195091E-03    2     1000023   1000025   # BR(H -> ~chi_20 ~chi_30)
     1.74480450E-02    2     1000023   1000035   # BR(H -> ~chi_20 ~chi_40)
     1.08834318E-02    2     1000025   1000035   # BR(H -> ~chi_30 ~chi_40)
     1.77161304E-05    2     1000005  -1000005   # BR(H -> ~b_1    ~b_1*  )
#
#         PDG            Width
DECAY        36     4.60979630E+01   # A decays
#          BR         NDA      ID1       ID2
     7.11596748E-01    2           5        -5   # BR(A -> b       bb     )
     1.23503615E-01    2         -15        15   # BR(A -> tau+    tau-   )
     4.39820141E-04    2         -13        13   # BR(A -> mu+     mu-    )
     2.73434217E-04    2           3        -3   # BR(A -> s       sb     )
     1.90602353E-08    2           4        -4   # BR(A -> c       cb     )
     1.86995549E-03    2           6        -6   # BR(A -> t       tb     )
     3.55290019E-05    2          21        21   # BR(A -> g       g      )
     5.59485342E-09    2          22        22   # BR(A -> gam     gam    )
     2.36614151E-08    2          23        22   # BR(A -> Z       gam    )
     1.29242192E-06    2          23        25   # BR(A -> Z       h      )
     1.59095441E-03    2     1000024  -1000024   # BR(A -> ~chi_1+ ~chi_1-)
     3.28036542E-02    2     1000024  -1000037   # BR(A -> ~chi_1+ ~chi_2-)
     3.28036542E-02    2     1000037  -1000024   # BR(A -> ~chi_2+ ~chi_1-)
     1.49927394E-02    2     1000022   1000022   # BR(A -> ~chi_10 ~chi_10)
     3.14749636E-03    2     1000023   1000023   # BR(A -> ~chi_20 ~chi_20)
     4.32973901E-03    2     1000025   1000025   # BR(A -> ~chi_30 ~chi_30)
     1.94849895E-02    2     1000022   1000023   # BR(A -> ~chi_10 ~chi_20)
     1.25611655E-02    2     1000022   1000025   # BR(A -> ~chi_10 ~chi_30)
     5.19933813E-03    2     1000022   1000035   # BR(A -> ~chi_10 ~chi_40)
     7.63419129E-03    2     1000023   1000025   # BR(A -> ~chi_20 ~chi_30)
     1.26571746E-02    2     1000023   1000035   # BR(A -> ~chi_20 ~chi_40)
     1.50744607E-02    2     1000025   1000035   # BR(A -> ~chi_30 ~chi_40)
#
#         PDG            Width
DECAY        37     4.34927041E+01   # H+ decays
#          BR         NDA      ID1       ID2
     1.16880260E-03    2           4        -5   # BR(H+ -> c       bb     )
     1.30986203E-01    2         -15        16   # BR(H+ -> tau+    nu_tau )
     4.66467075E-04    2         -13        14   # BR(H+ -> mu+     nu_mu  )
     1.16880042E-05    2           2        -5   # BR(H+ -> u       bb     )
     1.44908848E-05    2           2        -3   # BR(H+ -> u       sb     )
     2.85243929E-04    2           4        -3   # BR(H+ -> c       sb     )
     6.95497652E-01    2           6        -5   # BR(H+ -> t       bb     )
     1.37389220E-06    2          24        25   # BR(H+ -> W+      h      )
     2.53921543E-13    2          24        36   # BR(H+ -> W+      A      )
     5.41787716E-02    2     1000024   1000022   # BR(H+ -> ~chi_1+ ~chi_10)
     8.56297728E-04    2     1000024   1000023   # BR(H+ -> ~chi_1+ ~chi_20)
     1.14128376E-02    2     1000024   1000025   # BR(H+ -> ~chi_1+ ~chi_30)
     3.49772303E-02    2     1000024   1000035   # BR(H+ -> ~chi_1+ ~chi_40)
     1.04313951E-02    2     1000037   1000022   # BR(H+ -> ~chi_2+ ~chi_10)
     3.20592122E-02    2     1000037   1000023   # BR(H+ -> ~chi_2+ ~chi_20)
     2.76523345E-02    2     1000037   1000025   # BR(H+ -> ~chi_2+ ~chi_30)
