#
#                              ======================
#                              | THE SUSYHIT OUTPUT |
#                              ======================
#
#
#              ------------------------------------------------------
#              |     This is the output of the SUSY-HIT package     |
#              |  created by A.Djouadi, M.Muehlleitner and M.Spira. |
#              |  In case of problems with SUSY-HIT email to        |
#              |           margarete.muehlleitner@cern.ch           |
#              |           michael.spira@psi.ch                     |
#              |           abdelhak.djouadi@cern.ch                 |
#              ------------------------------------------------------
#
#              ------------------------------------------------------
#              |  SUSY Les Houches Accord - MSSM Spectrum + Decays  |
#              |              based on the decay programs           |
#              |                                                    |
#              |                     SDECAY 1.3b                    |
#              |                                                    |
#              |  Authors: M.Muhlleitner, A.Djouadi and Y.Mambrini  |
#              |  Ref.:    Comput.Phys.Commun.168(2005)46           |
#              |           [hep-ph/0311167]                         |
#              |                                                    |
#              |                     HDECAY 3.4                     |
#              |                                                    |
#              |  By: A.Djouadi,J.Kalinowski,M.Muhlleitner,M.Spira  |
#              |  Ref.:    Comput.Phys.Commun.108(1998)56           |
#              |           [hep-ph/9704448]                         |
#              |                                                    |
#              |                                                    |
#              |  If not stated otherwise all DRbar couplings and   |
#              |  soft SUSY breaking masses are given at the scale  |
#              |  Q=  0.30431190E+04
#              |                                                    |
#              ------------------------------------------------------
#
#
BLOCK DCINFO  # Decay Program information
     1   SDECAY/HDECAY # decay calculator
     2   1.3b  /3.4    # version number
#
BLOCK SPINFO  # Spectrum calculator information
     1     SOFTSUSY    # spectrum calculator               
     2     3.4.0       # version number                    
#
BLOCK MODSEL  # Model selection
     1     0   #  nonUniversal                                     
#
BLOCK SMINPUTS  # Standard Model inputs
         1     1.27908970E+02   # alpha_em^-1(M_Z)^MSbar
         2     1.16637870E-05   # G_F [GeV^-2]
         3     1.18400000E-01   # alpha_S(M_Z)^MSbar
         4     9.11876000E+01   # M_Z pole mass
         5     4.18000000E+00   # mb(mb)^MSbar
         6     1.73200000E+02   # mt pole mass
         7     1.77700000E+00   # mtau pole mass
#
BLOCK MINPAR  # Input parameters - minimal models
         3     3.44800000E+01   # tanb                
#
BLOCK EXTPAR  # Input parameters - non-minimal models
         0    -1.00000000E+00   # Set                 
         1     3.28570000E+02   # M_1(MX)             
         2     1.92864000E+03   # M_2(MX)             
         3     2.76664000E+03   # M_3(MX)             
        11    -3.36472000E+03   # At(MX)              
        12    -2.70915000E+03   # Ab(MX)              
        13     3.97520000E+03   # Atau(MX)            
        23     6.51980000E+02   # mu(MX)              
        26     6.89250000E+02   # mA(pole)            
        31     4.26940000E+02   # meL(MX)             
        32     4.26940000E+02   # mmuL(MX)            
        33     2.02454000E+03   # mtauL(MX)           
        34     5.14110000E+02   # meR(MX)             
        35     5.14110000E+02   # mmuR(MX)            
        36     2.55431000E+03   # mtauR(MX)           
        41     3.37706000E+03   # mqL1(MX)            
        42     3.37706000E+03   # mqL2(MX)            
        43     2.67731000E+03   # mqL3(MX)            
        44     9.15830000E+02   # muR(MX)             
        45     9.15830000E+02   # mcR(MX)             
        46     3.45671000E+03   # mtR(MX)             
        47     2.16191000E+03   # mdR(MX)             
        48     2.16191000E+03   # msR(MX)             
        49     4.01020000E+02   # mbR(MX)             
#
BLOCK MASS  # Mass Spectrum
# PDG code           mass       particle
        24     8.03853503E+01   # W+
        25     1.25274006E+02   # h
        35     6.89290573E+02   # H
        36     6.89249992E+02   # A
        37     6.94170771E+02   # H+
         5     4.81876030E+00   # b-quark pole mass calculated from mb(mb)_Msbar
   1000001     3.46847583E+03   # ~d_L
   2000001     2.28244845E+03   # ~d_R
   1000002     3.46771900E+03   # ~u_L
   2000002     1.10887602E+03   # ~u_R
   1000003     3.46847583E+03   # ~s_L
   2000003     2.28244845E+03   # ~s_R
   1000004     3.46771900E+03   # ~c_L
   2000004     1.10887602E+03   # ~c_R
   1000005     6.73172118E+02   # ~b_1
   2000005     2.76063173E+03   # ~b_2
   1000006     2.75378147E+03   # ~t_1
   2000006     3.47857782E+03   # ~t_2
   1000011     4.98684030E+02   # ~e_L
   2000011     5.06925079E+02   # ~e_R
   1000012     4.92160917E+02   # ~nu_eL
   1000013     4.98684030E+02   # ~mu_L
   2000013     5.06925079E+02   # ~mu_R
   1000014     4.92160917E+02   # ~nu_muL
   1000015     2.03829754E+03   # ~tau_1
   2000015     2.53621564E+03   # ~tau_2
   1000016     2.03657490E+03   # ~nu_tauL
   1000021     2.91162008E+03   # ~g
   1000022     3.18501937E+02   # ~chi_10
   1000023     6.74055142E+02   # ~chi_20
   1000025    -6.75876543E+02   # ~chi_30
   1000035     1.95586093E+03   # ~chi_40
   1000024     6.72578144E+02   # ~chi_1+
   1000037     1.95602834E+03   # ~chi_2+
#
BLOCK NMIX  # Neutralino Mixing Matrix
  1  1     9.95476328E-01   # N_11
  1  2    -2.16819874E-03   # N_12
  1  3     8.50116753E-02   # N_13
  1  4    -4.23697236E-02   # N_14
  2  1    -9.01144695E-02   # N_21
  2  2    -4.47060496E-02   # N_22
  2  3     7.03391719E-01   # N_23
  2  4    -7.03648237E-01   # N_24
  3  1    -3.00782049E-02   # N_31
  3  2     2.06597157E-02   # N_32
  3  3     7.05493818E-01   # N_33
  3  4     7.07776059E-01   # N_34
  4  1    -1.25038450E-03   # N_41
  4  2     9.98784183E-01   # N_42
  4  3     1.70756464E-02   # N_43
  4  4    -4.62278558E-02   # N_44
#
BLOCK UMIX  # Chargino Mixing Matrix U
  1  1    -2.42214202E-02   # U_11
  1  2     9.99706618E-01   # U_12
  2  1    -9.99706618E-01   # U_21
  2  2    -2.42214202E-02   # U_22
#
BLOCK VMIX  # Chargino Mixing Matrix V
  1  1    -6.54989397E-02   # V_11
  1  2     9.97852639E-01   # V_12
  2  1    -9.97852639E-01   # V_21
  2  2    -6.54989397E-02   # V_22
#
BLOCK STOPMIX  # Stop Mixing Matrix
  1  1     9.94158087E-01   # cos(theta_t)
  1  2     1.07933767E-01   # sin(theta_t)
  2  1    -1.07933767E-01   # -sin(theta_t)
  2  2     9.94158087E-01   # cos(theta_t)
#
BLOCK SBOTMIX  # Sbottom Mixing Matrix
  1  1     7.71199056E-03   # cos(theta_b)
  1  2     9.99970262E-01   # sin(theta_b)
  2  1    -9.99970262E-01   # -sin(theta_b)
  2  2     7.71199056E-03   # cos(theta_b)
#
BLOCK STAUMIX  # Stau Mixing Matrix
  1  1     9.99892445E-01   # cos(theta_tau)
  1  2     1.46662344E-02   # sin(theta_tau)
  2  1    -1.46662344E-02   # -sin(theta_tau)
  2  2     9.99892445E-01   # cos(theta_tau)
#
BLOCK ALPHA  # Higgs mixing
          -3.13624150E-02   # Mixing angle in the neutral Higgs boson sector
#
BLOCK HMIX Q=  3.04311900E+03  # DRbar Higgs Parameters
         1     6.64129554E+02   # mu(Q)MSSM           
         2     3.33991030E+01   # tan                 
         3     2.42451228E+02   # higgs               
         4     8.87304629E+05   # mA^2(Q)MSSM         
#
BLOCK GAUGE Q=  3.04311900E+03  # The gauge couplings
     1     3.65716684E-01   # gprime(Q) DRbar
     2     6.37852388E-01   # g(Q) DRbar
     3     1.01265858E+00   # g3(Q) DRbar
#
BLOCK AU Q=  3.04311900E+03  # The trilinear couplings
  1  1     0.00000000E+00   # A_u(Q) DRbar
  2  2     0.00000000E+00   # A_c(Q) DRbar
  3  3    -3.36471998E+03   # A_t(Q) DRbar
#
BLOCK AD Q=  3.04311900E+03  # The trilinear couplings
  1  1     0.00000000E+00   # A_d(Q) DRbar
  2  2     0.00000000E+00   # A_s(Q) DRbar
  3  3    -2.70914999E+03   # A_b(Q) DRbar
#
BLOCK AE Q=  3.04311900E+03  # The trilinear couplings
  1  1     0.00000000E+00   # A_e(Q) DRbar
  2  2     0.00000000E+00   # A_mu(Q) DRbar
  3  3     3.97520000E+03   # A_tau(Q) DRbar
#
BLOCK Yu Q=  3.04311900E+03  # The Yukawa couplings
  1  1     0.00000000E+00   # y_u(Q) DRbar
  2  2     0.00000000E+00   # y_c(Q) DRbar
  3  3     8.16230546E-01   # y_t(Q) DRbar
#
BLOCK Yd Q=  3.04311900E+03  # The Yukawa couplings
  1  1     0.00000000E+00   # y_d(Q) DRbar
  2  2     0.00000000E+00   # y_s(Q) DRbar
  3  3     4.23163513E-01   # y_b(Q) DRbar
#
BLOCK Ye Q=  3.04311900E+03  # The Yukawa couplings
  1  1     0.00000000E+00   # y_e(Q) DRbar
  2  2     0.00000000E+00   # y_mu(Q) DRbar
  3  3     3.53458684E-01   # y_tau(Q) DRbar
#
BLOCK MSOFT Q=  3.04311900E+03  # The soft SUSY breaking masses at the scale Q
         1     3.28570000E+02   # M_1(Q)              
         2     1.92864000E+03   # M_2(Q)              
         3     2.76664000E+03   # M_3(Q)              
        21     6.17481645E+04   # mH1^2(Q)            
        22    -2.69897384E+05   # mH2^2(Q)            
        31     4.26940000E+02   # meL(Q)              
        32     4.26940000E+02   # mmuL(Q)             
        33     2.02454000E+03   # mtauL(Q)            
        34     5.14110000E+02   # meR(Q)              
        35     5.14110000E+02   # mmuR(Q)             
        36     2.55431000E+03   # mtauR(Q)            
        41     3.37705999E+03   # mqL1(Q)             
        42     3.37705999E+03   # mqL2(Q)             
        43     2.67730998E+03   # mqL3(Q)             
        44     9.15829973E+02   # muR(Q)              
        45     9.15829973E+02   # mcR(Q)              
        46     3.45670998E+03   # mtR(Q)              
        47     2.16190999E+03   # mdR(Q)              
        48     2.16190999E+03   # msR(Q)              
        49     4.01019915E+02   # mbR(Q)              
#
Block HiggsBoundsInputHiggsCouplingsFermions
# ScalarNormEffCoupSq PseudoSNormEffCoupSq NP   IP1 IP2 IP2
    1.09783067E+00    0.00000000E+00        3  25   5   5  # h0-b-b eff. coupling^2, normalised to SM
    1.11540225E+03    0.00000000E+00        3  35   5   5  # H0-b-b eff. coupling^2, normalised to SM
    0.00000000E+00    1.11550008E+03        3  36   5   5  # A0-b-b eff. coupling^2, normalised to SM
#
    9.99912299E-01    0.00000000E+00        3  25   6   6  # h0-t-t eff. coupling^2, normalised to SM
    9.84160095E-04    0.00000000E+00        3  35   6   6  # H0-t-t eff. coupling^2, normalised to SM
    0.00000000E+00    8.96458922E-04        3  36   6   6  # A0-t-t eff. coupling^2, normalised to SM
#
    1.09783067E+00    0.00000000E+00        3  25  15  15  # h0-tau-tau eff. coupling^2, normalised to SM
    1.11540225E+03    0.00000000E+00        3  35  15  15  # H0-tau-tau eff. coupling^2, normalised to SM
    0.00000000E+00    1.11550008E+03        3  36  15  15  # A0-tau-tau eff. coupling^2, normalised to SM
#
Block HiggsBoundsInputHiggsCouplingsBosons
    9.99997954E-01        3  25  24  24  # h0-W-W eff. coupling^2, normalised to SM
    2.04613793E-06        3  35  24  24  # H0-W-W eff. coupling^2, normalised to SM
    0.00000000E+00        3  36  24  24  # A0-W-W eff. coupling^2, normalised to SM
#
    9.99997954E-01        3  25  23  23  # h0-Z-Z eff. coupling^2, normalised to SM
    2.04613793E-06        3  35  23  23  # H0-Z-Z eff. coupling^2, normalised to SM
    0.00000000E+00        3  36  23  23  # A0-Z-Z eff. coupling^2, normalised to SM
#
    8.79298637E-01        3  25  21  21  # h0-g-g eff. coupling^2, normalised to SM
    1.26885834E-03        3  35  21  21  # H0-g-g eff. coupling^2, normalised to SM
    2.10338006E-03        3  36  21  21  # A0-g-g eff. coupling^2, normalised to SM
#
    0.00000000E+00        3  25  25  23  # h0-h0-Z eff. coupling^2, normalised to SM
    0.00000000E+00        3  35  25  23  # H0-h0-Z eff. coupling^2, normalised to SM
    2.04613793E-06        3  36  25  23  # A0-h0-Z eff. coupling^2, normalised to SM
    0.00000000E+00        3  35  35  23  # H0-H0-Z eff. coupling^2, normalised to SM
    9.99997954E-01        3  36  35  23  # A0-H0-Z eff. coupling^2, normalised to SM
    0.00000000E+00        3  36  36  23  # A0-A0-Z eff. coupling^2, normalised to SM
#
    0.00000000E+00        4  25  21  21  23  # h0-g-g-Z eff. coupling^2, normalised to SM
    0.00000000E+00        4  35  21  21  23  # H0-g-g-Z eff. coupling^2, normalised to SM
    0.00000000E+00        4  36  21  21  23  # A0-g-g-Z eff. coupling^2, normalised to SM
#
#
#
#                             =================
#                             |The decay table|
#                             =================
#
# - The QCD corrections to the decays gluino -> squark  + quark
#                                     squark -> gaugino + quark_prime
#                                     squark -> squark_prime + Higgs
#                                     squark -> gluino  + quark
#   are included.
#
# - The multi-body decays for the inos, stops and sbottoms are included.
#
# - The loop induced decays for the gluino, neutralinos and stops
#   are included.
#
# - The SUSY decays of the top quark are included.
#
#
#         PDG            Width
DECAY         6     1.43308796E+00   # top decays
#          BR         NDA      ID1       ID2
     1.00000000E+00    2           5        24   # BR(t ->  b    W+)
#
#         PDG            Width
DECAY   1000021     1.48440337E+02   # gluino decays
#          BR         NDA      ID1       ID2
     2.81545210E-02    2     2000001        -1   # BR(~g -> ~d_R  db)
     2.81545210E-02    2    -2000001         1   # BR(~g -> ~d_R* d )
     1.38491132E-01    2     2000002        -2   # BR(~g -> ~u_R  ub)
     1.38491132E-01    2    -2000002         2   # BR(~g -> ~u_R* u )
     2.81545210E-02    2     2000003        -3   # BR(~g -> ~s_R  sb)
     2.81545210E-02    2    -2000003         3   # BR(~g -> ~s_R* s )
     1.38491115E-01    2     2000004        -4   # BR(~g -> ~c_R  cb)
     1.38491115E-01    2    -2000004         4   # BR(~g -> ~c_R* c )
     1.64721023E-01    2     1000005        -5   # BR(~g -> ~b_1  bb)
     1.64721023E-01    2    -1000005         5   # BR(~g -> ~b_1* b )
     1.98768722E-03    2     2000005        -5   # BR(~g -> ~b_2  bb)
     1.98768722E-03    2    -2000005         5   # BR(~g -> ~b_2* b )
#
#         PDG            Width
DECAY   1000006     5.84258042E+01   # stop1 decays
#          BR         NDA      ID1       ID2
     1.06556650E-02    2     1000022         6   # BR(~t_1 -> ~chi_10 t )
     2.68484412E-01    2     1000023         6   # BR(~t_1 -> ~chi_20 t )
     2.77838203E-01    2     1000025         6   # BR(~t_1 -> ~chi_30 t )
     4.55220096E-02    2     1000035         6   # BR(~t_1 -> ~chi_40 t )
     1.60467411E-01    2     1000024         5   # BR(~t_1 -> ~chi_1+ b )
     9.05278632E-02    2     1000037         5   # BR(~t_1 -> ~chi_2+ b )
     1.35600029E-01    2     1000005        37   # BR(~t_1 -> ~b_1    H+)
     1.09044082E-02    2     1000005        24   # BR(~t_1 -> ~b_1    W+)
#
#         PDG            Width
DECAY   2000006     1.38949695E+02   # stop2 decays
#          BR         NDA      ID1       ID2
     5.62957592E-02    2     1000022         6   # BR(~t_2 -> ~chi_10 t )
     1.52963343E-01    2     1000023         6   # BR(~t_2 -> ~chi_20 t )
     1.51611369E-01    2     1000025         6   # BR(~t_2 -> ~chi_30 t )
     1.72867587E-03    2     1000035         6   # BR(~t_2 -> ~chi_40 t )
     3.00205892E-01    2     1000024         5   # BR(~t_2 -> ~chi_1+ b )
     3.45806035E-03    2     1000037         5   # BR(~t_2 -> ~chi_2+ b )
     1.08308763E-01    2     1000021         6   # BR(~t_2 -> ~g      t )
     5.49882090E-02    2     1000006        25   # BR(~t_2 -> ~t_1    h )
     4.67823938E-04    2     1000006        35   # BR(~t_2 -> ~t_1    H )
     4.98995671E-04    2     1000006        36   # BR(~t_2 -> ~t_1    A )
     1.29750265E-03    2     1000005        37   # BR(~t_2 -> ~b_1    H+)
     8.01116755E-04    2     2000005        37   # BR(~t_2 -> ~b_2    H+)
     5.72681396E-02    2     1000006        23   # BR(~t_2 -> ~t_1    Z )
     1.17023434E-04    2     1000005        24   # BR(~t_2 -> ~b_1    W+)
     1.09989327E-01    2     2000005        24   # BR(~t_2 -> ~b_2    W+)
#
#         PDG            Width
DECAY   1000005     2.48274467E-01   # sbottom1 decays
#          BR         NDA      ID1       ID2
     1.00000000E+00    2     1000022         5   # BR(~b_1 -> ~chi_10 b )
#
#         PDG            Width
DECAY   2000005     5.81441685E+01   # sbottom2 decays
#          BR         NDA      ID1       ID2
     7.98362052E-03    2     1000022         5   # BR(~b_2 -> ~chi_10 b )
     7.41388614E-02    2     1000023         5   # BR(~b_2 -> ~chi_20 b )
     7.45726119E-02    2     1000025         5   # BR(~b_2 -> ~chi_30 b )
     4.75986410E-02    2     1000035         5   # BR(~b_2 -> ~chi_40 b )
     5.49053204E-01    2    -1000024         6   # BR(~b_2 -> ~chi_1- t )
     9.56575270E-02    2    -1000037         6   # BR(~b_2 -> ~chi_2- t )
     5.82674303E-03    2     1000005        25   # BR(~b_2 -> ~b_1    h )
     6.96655891E-02    2     1000005        35   # BR(~b_2 -> ~b_1    H )
     6.97364601E-02    2     1000005        36   # BR(~b_2 -> ~b_1    A )
     5.76674185E-03    2     1000005        23   # BR(~b_2 -> ~b_1    Z )
#
#         PDG            Width
DECAY   1000002     4.19646213E+01   # sup_L decays
#          BR         NDA      ID1       ID2
     1.10775419E-02    2     1000022         2   # BR(~u_L -> ~chi_10 u)
     1.13326672E-03    2     1000023         2   # BR(~u_L -> ~chi_20 u)
     6.56741943E-05    2     1000025         2   # BR(~u_L -> ~chi_30 u)
     1.49322877E-01    2     1000035         2   # BR(~u_L -> ~chi_40 u)
     2.53625929E-03    2     1000024         1   # BR(~u_L -> ~chi_1+ d)
     2.98184591E-01    2     1000037         1   # BR(~u_L -> ~chi_2+ d)
     5.37679790E-01    2     1000021         2   # BR(~u_L -> ~g      u)
#
#         PDG            Width
DECAY   2000002     2.26002466E+00   # sup_R decays
#          BR         NDA      ID1       ID2
     9.95700874E-01    2     1000022         2   # BR(~u_R -> ~chi_10 u)
     3.87061837E-03    2     1000023         2   # BR(~u_R -> ~chi_20 u)
     4.28507486E-04    2     1000025         2   # BR(~u_R -> ~chi_30 u)
#
#         PDG            Width
DECAY   1000001     4.19785502E+01   # sdown_L decays
#          BR         NDA      ID1       ID2
     1.15930263E-02    2     1000022         1   # BR(~d_L -> ~chi_10 d)
     2.23182223E-04    2     1000023         1   # BR(~d_L -> ~chi_20 d)
     2.05974929E-04    2     1000025         1   # BR(~d_L -> ~chi_30 d)
     1.49509478E-01    2     1000035         1   # BR(~d_L -> ~chi_40 d)
     3.46809438E-04    2    -1000024         2   # BR(~d_L -> ~chi_1- u)
     2.99381039E-01    2    -1000037         2   # BR(~d_L -> ~chi_2- u)
     5.38740490E-01    2     1000021         1   # BR(~d_L -> ~g      d)
#
#         PDG            Width
DECAY   2000001     1.28084492E+00   # sdown_R decays
#          BR         NDA      ID1       ID2
     9.92155005E-01    2     1000022         1   # BR(~d_R -> ~chi_10 d)
     7.05922975E-03    2     1000023         1   # BR(~d_R -> ~chi_20 d)
     7.85646136E-04    2     1000025         1   # BR(~d_R -> ~chi_30 d)
     1.18728223E-07    2     1000035         1   # BR(~d_R -> ~chi_40 d)
#
#         PDG            Width
DECAY   1000004     3.65703459E+01   # scharm_L decays
#          BR         NDA      ID1       ID2
     1.33477987E-02    2     1000022         4   # BR(~c_L -> ~chi_10 c)
     1.36264720E-03    2     1000023         4   # BR(~c_L -> ~chi_20 c)
     7.89662738E-05    2     1000025         4   # BR(~c_L -> ~chi_30 c)
     1.77913524E-01    2     1000035         4   # BR(~c_L -> ~chi_40 c)
     3.04964087E-03    2     1000024         3   # BR(~c_L -> ~chi_1+ s)
     3.55277177E-01    2     1000037         3   # BR(~c_L -> ~chi_2+ s)
     4.48970246E-01    2     1000021         4   # BR(~c_L -> ~g      c)
#
#         PDG            Width
DECAY   2000004     2.19727730E+00   # scharm_R decays
#          BR         NDA      ID1       ID2
     9.95720365E-01    2     1000022         4   # BR(~c_R -> ~chi_10 c)
     3.85309040E-03    2     1000023         4   # BR(~c_R -> ~chi_20 c)
     4.26544930E-04    2     1000025         4   # BR(~c_R -> ~chi_30 c)
#
#         PDG            Width
DECAY   1000003     3.65678321E+01   # sstrange_L decays
#          BR         NDA      ID1       ID2
     1.39744907E-02    2     1000022         3   # BR(~s_L -> ~chi_10 s)
     2.68462695E-04    2     1000023         3   # BR(~s_L -> ~chi_20 s)
     2.47761778E-04    2     1000025         3   # BR(~s_L -> ~chi_30 s)
     1.78207687E-01    2     1000035         3   # BR(~s_L -> ~chi_40 s)
     4.17175428E-04    2    -1000024         4   # BR(~s_L -> ~chi_1- c)
     3.56846024E-01    2    -1000037         4   # BR(~s_L -> ~chi_2- c)
     4.50038398E-01    2     1000021         3   # BR(~s_L -> ~g      s)
#
#         PDG            Width
DECAY   2000003     1.29599554E+00   # sstrange_R decays
#          BR         NDA      ID1       ID2
     9.92169926E-01    2     1000022         3   # BR(~s_R -> ~chi_10 s)
     7.04581335E-03    2     1000023         3   # BR(~s_R -> ~chi_20 s)
     7.84145521E-04    2     1000025         3   # BR(~s_R -> ~chi_30 s)
     1.14940314E-07    2     1000035         3   # BR(~s_R -> ~chi_40 s)
#
#         PDG            Width
DECAY   1000011     2.28735929E-01   # selectron_L decays
#          BR         NDA      ID1       ID2
     1.00000000E+00    2     1000022        11   # BR(~e_L -> ~chi_10 e-)
#
#         PDG            Width
DECAY   2000011     9.79278162E-01   # selectron_R decays
#          BR         NDA      ID1       ID2
     1.00000000E+00    2     1000022        11   # BR(~e_R -> ~chi_10 e-)
#
#         PDG            Width
DECAY   1000013     2.28735870E-01   # smuon_L decays
#          BR         NDA      ID1       ID2
     1.00000000E+00    2     1000022        13   # BR(~mu_L -> ~chi_10 mu-)
#
#         PDG            Width
DECAY   2000013     9.79277930E-01   # smuon_R decays
#          BR         NDA      ID1       ID2
     1.00000000E+00    2     1000022        13   # BR(~mu_R -> ~chi_10 mu-)
#
#         PDG            Width
DECAY   1000015     6.79359566E+00   # stau_1 decays
#          BR         NDA      ID1       ID2
     3.80326989E-01    2     1000022        15   # BR(~tau_1 -> ~chi_10  tau-)
     3.01433537E-01    2     1000023        15   # BR(~tau_1 -> ~chi_20  tau-)
     2.93451443E-01    2     1000025        15   # BR(~tau_1 -> ~chi_30  tau-)
     7.59630517E-03    2     1000035        15   # BR(~tau_1 -> ~chi_40  tau-)
     2.01737132E-03    2    -1000024        16   # BR(~tau_1 -> ~chi_1-  nu_tau)
     1.51743556E-02    2    -1000037        16   # BR(~tau_1 -> ~chi_2-  nu_tau)
#
#         PDG            Width
DECAY   2000015     2.41326094E+01   # stau_2 decays
#          BR         NDA      ID1       ID2
     5.38158324E-01    2     1000022        15   # BR(~tau_2 -> ~chi_10  tau-)
     1.15605687E-01    2     1000023        15   # BR(~tau_2 -> ~chi_20  tau-)
     1.12854707E-01    2     1000025        15   # BR(~tau_2 -> ~chi_30  tau-)
     5.50473257E-05    2     1000035        15   # BR(~tau_2 -> ~chi_40  tau-)
     2.25291925E-01    2    -1000024        16   # BR(~tau_2 -> ~chi_1-  nu_tau)
     1.10139418E-04    2    -1000037        16   # BR(~tau_2 -> ~chi_2-  nu_tau)
     3.92186819E-03    2     1000016       -24   # BR(~tau_2 -> ~nu_tauL W-)
     2.02038781E-03    2     1000015        25   # BR(~tau_2 -> ~tau_1   h)
     1.98191408E-03    2     1000015        23   # BR(~tau_2 -> ~tau_1   Z)
#
#         PDG            Width
DECAY   1000012     2.20850589E-01   # snu_eL decays
#          BR         NDA      ID1       ID2
     1.00000000E+00    2     1000022        12   # BR(~nu_eL -> ~chi_10 nu_e)
#
#         PDG            Width
DECAY   1000014     2.20850589E-01   # snu_muL decays
#          BR         NDA      ID1       ID2
     1.00000000E+00    2     1000022        14   # BR(~nu_muL -> ~chi_10 nu_mu)
#
#         PDG            Width
DECAY   1000016     6.80394844E+00   # snu_tauL decays
#          BR         NDA      ID1       ID2
     3.78421747E-01    2     1000022        16   # BR(~nu_tauL -> ~chi_10 nu_tau)
     4.65509673E-05    2     1000023        16   # BR(~nu_tauL -> ~chi_20 nu_tau)
     1.37823921E-03    2     1000025        16   # BR(~nu_tauL -> ~chi_30 nu_tau)
     7.30496609E-03    2     1000035        16   # BR(~nu_tauL -> ~chi_40 nu_tau)
     5.98338462E-01    2     1000024        15   # BR(~nu_tauL -> ~chi_1+ tau-)
     1.45100346E-02    2     1000037        15   # BR(~nu_tauL -> ~chi_2+ tau-)
#
#         PDG            Width
DECAY   1000024     3.86008226E-01   # chargino1+ decays
#          BR         NDA      ID1       ID2
     6.52826141E-03    2     1000012       -11   # BR(~chi_1+ -> ~nu_eL   e+  )
     6.52826141E-03    2     1000014       -13   # BR(~chi_1+ -> ~nu_muL  mu+ )
     8.38673494E-04    2    -1000011        12   # BR(~chi_1+ -> ~e_L+    nu_e)
     8.38673494E-04    2    -1000013        14   # BR(~chi_1+ -> ~mu_L+   nu_mu)
     9.85266130E-01    2     1000022        24   # BR(~chi_1+ -> ~chi_10  W+)
#
#         PDG            Width
DECAY   1000037     5.41989276E+01   # chargino2+ decays
#          BR         NDA      ID1       ID2
     2.46049681E-05    2    -1000005         6   # BR(~chi_2+ -> ~b_1*    t )
     1.27600004E-01    2     1000012       -11   # BR(~chi_2+ -> ~nu_eL   e+  )
     1.27600004E-01    2     1000014       -13   # BR(~chi_2+ -> ~nu_muL mu+ )
     1.27613052E-01    2    -1000011        12   # BR(~chi_2+ -> ~e_L+    nu_e)
     1.27613052E-01    2    -1000013        14   # BR(~chi_2+ -> ~mu_L+   nu_mu)
     7.40741597E-02    2     1000024        23   # BR(~chi_2+ -> ~chi_1+  Z )
     4.35847932E-05    2     1000022        24   # BR(~chi_2+ -> ~chi_10  W+)
     7.14199917E-02    2     1000023        24   # BR(~chi_2+ -> ~chi_20  W+)
     7.18170107E-02    2     1000025        24   # BR(~chi_2+ -> ~chi_30  W+)
     7.35653398E-02    2     1000024        25   # BR(~chi_2+ -> ~chi_1+  h )
     4.95007194E-02    2     1000024        35   # BR(~chi_2+ -> ~chi_1+  H )
     4.98133165E-02    2     1000024        36   # BR(~chi_2+ -> ~chi_1+  A )
     6.21944201E-04    2     1000022        37   # BR(~chi_2+ -> ~chi_10  H+)
     4.93358397E-02    2     1000023        37   # BR(~chi_2+ -> ~chi_20  H+)
     4.93573778E-02    2     1000025        37   # BR(~chi_2+ -> ~chi_30  H+)
#
#         PDG            Width
DECAY   1000022     0.00000000E+00   # neutralino1 decays
#
#         PDG            Width
DECAY   1000023     4.28400947E-01   # neutralino2 decays
#          BR         NDA      ID1       ID2
     1.05160690E-01    2     1000022        23   # BR(~chi_20 -> ~chi_10   Z )
     8.44804123E-01    2     1000022        25   # BR(~chi_20 -> ~chi_10   h )
     6.05913042E-03    2     1000011       -11   # BR(~chi_20 -> ~e_L-     e+)
     6.05913042E-03    2    -1000011        11   # BR(~chi_20 -> ~e_L+     e-)
     6.41603101E-03    2     2000011       -11   # BR(~chi_20 -> ~e_R-     e+)
     6.41603101E-03    2    -2000011        11   # BR(~chi_20 -> ~e_R+     e-)
     6.05913042E-03    2     1000013       -13   # BR(~chi_20 -> ~mu_L-    mu+)
     6.05913042E-03    2    -1000013        13   # BR(~chi_20 -> ~mu_L+    mu-)
     6.41603101E-03    2     2000013       -13   # BR(~chi_20 -> ~mu_R-    mu+)
     6.41603101E-03    2    -2000013        13   # BR(~chi_20 -> ~mu_R+    mu-)
     3.36351937E-05    2     1000012       -12   # BR(~chi_20 -> ~nu_eL    nu_eb)
     3.36351937E-05    2    -1000012        12   # BR(~chi_20 -> ~nu_eL*   nu_e )
     3.36351937E-05    2     1000014       -14   # BR(~chi_20 -> ~nu_muL   nu_mub)
     3.36351937E-05    2    -1000014        14   # BR(~chi_20 -> ~nu_muL*  nu_mu )
#
#         PDG            Width
DECAY   1000025     3.88855601E-01   # neutralino3 decays
#          BR         NDA      ID1       ID2
     8.95363659E-01    2     1000022        23   # BR(~chi_30 -> ~chi_10   Z )
     9.69389114E-02    2     1000022        25   # BR(~chi_30 -> ~chi_10   h )
     8.51013298E-06    2     1000011       -11   # BR(~chi_30 -> ~e_L-     e+)
     8.51013298E-06    2    -1000011        11   # BR(~chi_30 -> ~e_L+     e-)
     8.00720188E-04    2     2000011       -11   # BR(~chi_30 -> ~e_R-     e+)
     8.00720188E-04    2    -2000011        11   # BR(~chi_30 -> ~e_R+     e-)
     8.51013298E-06    2     1000013       -13   # BR(~chi_30 -> ~mu_L-    mu+)
     8.51013298E-06    2    -1000013        13   # BR(~chi_30 -> ~mu_L+    mu-)
     8.00720188E-04    2     2000013       -13   # BR(~chi_30 -> ~mu_R-    mu+)
     8.00720188E-04    2    -2000013        13   # BR(~chi_30 -> ~mu_R+    mu-)
     1.11512710E-03    2     1000012       -12   # BR(~chi_30 -> ~nu_eL    nu_eb)
     1.11512710E-03    2    -1000012        12   # BR(~chi_30 -> ~nu_eL*   nu_e )
     1.11512710E-03    2     1000014       -14   # BR(~chi_30 -> ~nu_muL   nu_mub)
     1.11512710E-03    2    -1000014        14   # BR(~chi_30 -> ~nu_muL*  nu_mu )
#
#         PDG            Width
DECAY   1000035     5.42316060E+01   # neutralino4 decays
#          BR         NDA      ID1       ID2
     1.06036861E-05    2     1000022        23   # BR(~chi_40 -> ~chi_10   Z )
     1.29250445E-02    2     1000023        23   # BR(~chi_40 -> ~chi_20   Z )
     6.06891224E-02    2     1000025        23   # BR(~chi_40 -> ~chi_30   Z )
     7.22248962E-02    2     1000024       -24   # BR(~chi_40 -> ~chi_1+   W-)
     7.22248962E-02    2    -1000024        24   # BR(~chi_40 -> ~chi_1-   W+)
     3.16284933E-05    2     1000022        25   # BR(~chi_40 -> ~chi_10   h )
     4.20265355E-04    2     1000022        35   # BR(~chi_40 -> ~chi_10   H )
     2.02541095E-04    2     1000022        36   # BR(~chi_40 -> ~chi_10   A )
     6.06722427E-02    2     1000023        25   # BR(~chi_40 -> ~chi_20   h )
     4.08307691E-02    2     1000023        35   # BR(~chi_40 -> ~chi_20   H )
     8.37213400E-03    2     1000023        36   # BR(~chi_40 -> ~chi_20   A )
     1.26480504E-02    2     1000025        25   # BR(~chi_40 -> ~chi_30   h )
     8.41216248E-03    2     1000025        35   # BR(~chi_40 -> ~chi_30   H )
     4.12751619E-02    2     1000025        36   # BR(~chi_40 -> ~chi_30   A )
     4.94828047E-02    2     1000024       -37   # BR(~chi_40 -> ~chi_1+   H-)
     4.94828047E-02    2    -1000024        37   # BR(~chi_40 -> ~chi_1-   H+)
     9.24997643E-08    2     2000002        -2   # BR(~chi_40 -> ~u_R      ub)
     9.24997643E-08    2    -2000002         2   # BR(~chi_40 -> ~u_R*     u )
     9.24996782E-08    2     2000004        -4   # BR(~chi_40 -> ~c_R      cb)
     9.24996782E-08    2    -2000004         4   # BR(~chi_40 -> ~c_R*     c )
     1.17809482E-05    2     1000005        -5   # BR(~chi_40 -> ~b_1      bb)
     1.17809482E-05    2    -1000005         5   # BR(~chi_40 -> ~b_1*     b )
     6.35521590E-02    2     1000011       -11   # BR(~chi_40 -> ~e_L-     e+)
     6.35521590E-02    2    -1000011        11   # BR(~chi_40 -> ~e_L+     e-)
     1.30554590E-07    2     2000011       -11   # BR(~chi_40 -> ~e_R-     e+)
     1.30554590E-07    2    -2000011        11   # BR(~chi_40 -> ~e_R+     e-)
     6.35521590E-02    2     1000013       -13   # BR(~chi_40 -> ~mu_L-    mu+)
     6.35521590E-02    2    -1000013        13   # BR(~chi_40 -> ~mu_L+    mu-)
     1.30554590E-07    2     2000013       -13   # BR(~chi_40 -> ~mu_R-    mu+)
     1.30554590E-07    2    -2000013        13   # BR(~chi_40 -> ~mu_R+    mu-)
     6.39654455E-02    2     1000012       -12   # BR(~chi_40 -> ~nu_eL    nu_eb)
     6.39654455E-02    2    -1000012        12   # BR(~chi_40 -> ~nu_eL*   nu_e )
     6.39654455E-02    2     1000014       -14   # BR(~chi_40 -> ~nu_muL   nu_mub)
     6.39654455E-02    2    -1000014        14   # BR(~chi_40 -> ~nu_muL*  nu_mu )
#
#         PDG            Width
DECAY        25     4.66887704E-03   # h decays
#          BR         NDA      ID1       ID2
     6.39480915E-01    2           5        -5   # BR(h -> b       bb     )
     6.08316897E-02    2         -15        15   # BR(h -> tau+    tau-   )
     2.14447155E-04    2         -13        13   # BR(h -> mu+     mu-    )
     2.33912671E-04    2           3        -3   # BR(h -> s       sb     )
     1.86071815E-02    2           4        -4   # BR(h -> c       cb     )
     6.84167734E-02    2          21        21   # BR(h -> g       g      )
     2.03069177E-03    2          22        22   # BR(h -> gam     gam    )
     1.37071116E-03    2          22        23   # BR(h -> Z       gam    )
     1.85563898E-01    2          24       -24   # BR(h -> W+      W-     )
     2.32497788E-02    2          23        23   # BR(h -> Z       Z      )
#
#         PDG            Width
DECAY        35     1.16536195E+01   # H decays
#          BR         NDA      ID1       ID2
     8.66971427E-01    2           5        -5   # BR(H -> b       bb     )
     1.29782412E-01    2         -15        15   # BR(H -> tau+    tau-   )
     4.17906150E-04    2         -13        13   # BR(H -> mu+     mu-    )
     3.32149986E-04    2           3        -3   # BR(H -> s       sb     )
     2.96168227E-08    2           4        -4   # BR(H -> c       cb     )
     2.17441291E-03    2           6        -6   # BR(H -> t       tb     )
     1.73935094E-04    2          21        21   # BR(H -> g       g      )
     5.97598063E-08    2          22        22   # BR(H -> gam     gam    )
     5.33515088E-08    2          23        22   # BR(H -> Z       gam    )
     1.70621509E-05    2          24       -24   # BR(H -> W+      W-     )
     8.32077970E-06    2          23        23   # BR(H -> Z       Z      )
     6.61496918E-05    2          25        25   # BR(H -> h       h      )
     5.60812157E-05    2     1000022   1000022   # BR(H -> ~chi_10 ~chi_10)
#
#         PDG            Width
DECAY        36     1.16626236E+01   # A decays
#          BR         NDA      ID1       ID2
     8.66411317E-01    2           5        -5   # BR(A -> b       bb     )
     1.29689694E-01    2         -15        15   # BR(A -> tau+    tau-   )
     4.17598286E-04    2         -13        13   # BR(A -> mu+     mu-    )
     3.31929808E-04    2           3        -3   # BR(A -> s       sb     )
     2.72013390E-08    2           4        -4   # BR(A -> c       cb     )
     2.50144470E-03    2           6        -6   # BR(A -> t       tb     )
     2.23761486E-04    2          21        21   # BR(A -> g       g      )
     7.61636990E-08    2          22        22   # BR(A -> gam     gam    )
     6.59644313E-08    2          23        22   # BR(A -> Z       gam    )
     1.60736038E-05    2          23        25   # BR(A -> Z       h      )
     4.08011858E-04    2     1000022   1000022   # BR(A -> ~chi_10 ~chi_10)
#
#         PDG            Width
DECAY        37     9.75394218E+00   # H+ decays
#          BR         NDA      ID1       ID2
     1.47979053E-03    2           4        -5   # BR(H+ -> c       bb     )
     1.56174880E-01    2         -15        16   # BR(H+ -> tau+    nu_tau )
     5.02879976E-04    2         -13        14   # BR(H+ -> mu+     nu_mu  )
     1.47976239E-05    2           2        -5   # BR(H+ -> u       bb     )
     1.98617743E-05    2           2        -3   # BR(H+ -> u       sb     )
     3.90969592E-04    2           4        -3   # BR(H+ -> c       sb     )
     8.41396883E-01    2           6        -5   # BR(H+ -> t       bb     )
     1.99371259E-05    2          24        25   # BR(H+ -> W+      h      )
     3.86049291E-10    2          24        36   # BR(H+ -> W+      A      )
