#
#                              ======================
#                              | THE SUSYHIT OUTPUT |
#                              ======================
#
#
#              ------------------------------------------------------
#              |     This is the output of the SUSY-HIT package     |
#              |  created by A.Djouadi, M.Muehlleitner and M.Spira. |
#              |  In case of problems with SUSY-HIT email to        |
#              |           margarete.muehlleitner@cern.ch           |
#              |           michael.spira@psi.ch                     |
#              |           abdelhak.djouadi@cern.ch                 |
#              ------------------------------------------------------
#
#              ------------------------------------------------------
#              |  SUSY Les Houches Accord - MSSM Spectrum + Decays  |
#              |              based on the decay programs           |
#              |                                                    |
#              |                     SDECAY 1.3b                    |
#              |                                                    |
#              |  Authors: M.Muhlleitner, A.Djouadi and Y.Mambrini  |
#              |  Ref.:    Comput.Phys.Commun.168(2005)46           |
#              |           [hep-ph/0311167]                         |
#              |                                                    |
#              |                     HDECAY 3.4                     |
#              |                                                    |
#              |  By: A.Djouadi,J.Kalinowski,M.Muhlleitner,M.Spira  |
#              |  Ref.:    Comput.Phys.Commun.108(1998)56           |
#              |           [hep-ph/9704448]                         |
#              |                                                    |
#              |                                                    |
#              |  If not stated otherwise all DRbar couplings and   |
#              |  soft SUSY breaking masses are given at the scale  |
#              |  Q=  0.12482890E+04
#              |                                                    |
#              ------------------------------------------------------
#
#
BLOCK DCINFO  # Decay Program information
     1   SDECAY/HDECAY # decay calculator
     2   1.3b  /3.4    # version number
#
BLOCK SPINFO  # Spectrum calculator information
     1     SOFTSUSY    # spectrum calculator               
     2     3.4.0       # version number                    
#
BLOCK MODSEL  # Model selection
     1     0   #  nonUniversal                                     
#
BLOCK SMINPUTS  # Standard Model inputs
         1     1.27908970E+02   # alpha_em^-1(M_Z)^MSbar
         2     1.16637870E-05   # G_F [GeV^-2]
         3     1.18400000E-01   # alpha_S(M_Z)^MSbar
         4     9.11876000E+01   # M_Z pole mass
         5     4.18000000E+00   # mb(mb)^MSbar
         6     1.73200000E+02   # mt pole mass
         7     1.77700000E+00   # mtau pole mass
#
BLOCK MINPAR  # Input parameters - minimal models
         3     2.18900000E+01   # tanb                
#
BLOCK EXTPAR  # Input parameters - non-minimal models
         0    -1.00000000E+00   # Set                 
         1     3.37010000E+02   # M_1(MX)             
         2     1.87868000E+03   # M_2(MX)             
         3     2.76230000E+03   # M_3(MX)             
        11     2.03720000E+03   # At(MX)              
        12    -2.88131000E+03   # Ab(MX)              
        13     3.34687000E+03   # Atau(MX)            
        23    -3.60610000E+02   # mu(MX)              
        26     4.90230000E+02   # mA(pole)            
        31     1.29771000E+03   # meL(MX)             
        32     1.29771000E+03   # mmuL(MX)            
        33     3.63942000E+03   # mtauL(MX)           
        34     2.70941000E+03   # meR(MX)             
        35     2.70941000E+03   # mmuR(MX)            
        36     4.86310000E+02   # mtauR(MX)           
        41     1.85305000E+03   # mqL1(MX)            
        42     1.85305000E+03   # mqL2(MX)            
        43     1.12069000E+03   # mqL3(MX)            
        44     1.87163000E+03   # muR(MX)             
        45     1.87163000E+03   # mcR(MX)             
        46     1.39857000E+03   # mtR(MX)             
        47     2.68373000E+03   # mdR(MX)             
        48     2.68373000E+03   # msR(MX)             
        49     6.22300000E+02   # mbR(MX)             
#
BLOCK MASS  # Mass Spectrum
# PDG code           mass       particle
        24     8.04048671E+01   # W+
        25     1.25491019E+02   # h
        35     4.90302376E+02   # H
        36     4.90230005E+02   # A
        37     4.96876690E+02   # H+
         5     4.81876030E+00   # b-quark pole mass calculated from mb(mb)_Msbar
   1000001     1.87044360E+03   # ~d_L
   2000001     2.70510643E+03   # ~d_R
   1000002     1.86886018E+03   # ~u_L
   2000002     1.88021912E+03   # ~u_R
   1000003     1.87044360E+03   # ~s_L
   2000003     2.70510643E+03   # ~s_R
   1000004     1.86886018E+03   # ~c_L
   2000004     1.88021912E+03   # ~c_R
   1000005     5.03041550E+02   # ~b_1
   2000005     1.07406533E+03   # ~b_2
   1000006     1.02029658E+03   # ~t_1
   2000006     1.39242259E+03   # ~t_2
   1000011     1.30671552E+03   # ~e_L
   2000011     2.71270482E+03   # ~e_R
   1000012     1.30400798E+03   # ~nu_eL
   1000013     1.30671552E+03   # ~mu_L
   2000013     2.71270482E+03   # ~mu_R
   1000014     1.30400798E+03   # ~nu_muL
   1000015     5.10488603E+02   # ~tau_1
   2000015     3.64350564E+03   # ~tau_2
   1000016     3.64231207E+03   # ~nu_tauL
   1000021     2.71298420E+03   # ~g
   1000022     3.20096698E+02   # ~chi_10
   1000023    -3.74122462E+02   # ~chi_20
   1000025     3.87681020E+02   # ~chi_30
   1000035     1.87870718E+03   # ~chi_40
   1000024     3.71468145E+02   # ~chi_1+
   1000037     1.87887333E+03   # ~chi_2+
#
BLOCK NMIX  # Neutralino Mixing Matrix
  1  1     8.58031037E-01   # N_11
  1  2    -1.56007709E-02   # N_12
  1  3    -3.91219835E-01   # N_13
  1  4    -3.32394939E-01   # N_14
  2  1    -4.60902286E-02   # N_21
  2  2     2.58862335E-02   # N_22
  2  3    -7.03922342E-01   # N_23
  2  4     7.08307087E-01   # N_24
  3  1     5.11523987E-01   # N_31
  3  2     3.10024635E-02   # N_32
  3  3     5.92790961E-01   # N_33
  3  4     6.21273639E-01   # N_34
  4  1    -1.28065663E-03   # N_41
  4  2     9.99062243E-01   # N_42
  4  3    -6.26528840E-03   # N_43
  4  4    -4.28221901E-02   # N_44
#
BLOCK UMIX  # Chargino Mixing Matrix U
  1  1     8.87232040E-03   # U_11
  1  2     9.99960640E-01   # U_12
  2  1    -9.99960640E-01   # U_21
  2  2     8.87232040E-03   # U_22
#
BLOCK VMIX  # Chargino Mixing Matrix V
  1  1     6.05685554E-02   # V_11
  1  2    -9.98164040E-01   # V_12
  2  1    -9.98164040E-01   # V_21
  2  2    -6.05685554E-02   # V_22
#
BLOCK STOPMIX  # Stop Mixing Matrix
  1  1     9.25928157E-01   # cos(theta_t)
  1  2    -3.77699680E-01   # sin(theta_t)
  2  1     3.77699680E-01   # -sin(theta_t)
  2  2     9.25928157E-01   # cos(theta_t)
#
BLOCK SBOTMIX  # Sbottom Mixing Matrix
  1  1    -1.36530336E-02   # cos(theta_b)
  1  2     9.99906793E-01   # sin(theta_b)
  2  1    -9.99906793E-01   # -sin(theta_b)
  2  2    -1.36530336E-02   # cos(theta_b)
#
BLOCK STAUMIX  # Stau Mixing Matrix
  1  1    -1.48253814E-03   # cos(theta_tau)
  1  2     9.99998901E-01   # sin(theta_tau)
  2  1    -9.99998901E-01   # -sin(theta_tau)
  2  2    -1.48253814E-03   # cos(theta_tau)
#
BLOCK ALPHA  # Higgs mixing
          -5.15260802E-02   # Mixing angle in the neutral Higgs boson sector
#
BLOCK HMIX Q=  1.24828900E+03  # DRbar Higgs Parameters
         1    -3.65170715E+02   # mu(Q)MSSM           
         2     2.11736876E+01   # tan                 
         3     2.44160486E+02   # higgs               
         4     2.19858042E+05   # mA^2(Q)MSSM         
#
BLOCK GAUGE Q=  1.24828900E+03  # The gauge couplings
     1     3.62560426E-01   # gprime(Q) DRbar
     2     6.37723551E-01   # g(Q) DRbar
     3     1.03392862E+00   # g3(Q) DRbar
#
BLOCK AU Q=  1.24828900E+03  # The trilinear couplings
  1  1     0.00000000E+00   # A_u(Q) DRbar
  2  2     0.00000000E+00   # A_c(Q) DRbar
  3  3     2.03720000E+03   # A_t(Q) DRbar
#
BLOCK AD Q=  1.24828900E+03  # The trilinear couplings
  1  1     0.00000000E+00   # A_d(Q) DRbar
  2  2     0.00000000E+00   # A_s(Q) DRbar
  3  3    -2.88131000E+03   # A_b(Q) DRbar
#
BLOCK AE Q=  1.24828900E+03  # The trilinear couplings
  1  1     0.00000000E+00   # A_e(Q) DRbar
  2  2     0.00000000E+00   # A_mu(Q) DRbar
  3  3     3.34687000E+03   # A_tau(Q) DRbar
#
BLOCK Yu Q=  1.24828900E+03  # The Yukawa couplings
  1  1     0.00000000E+00   # y_u(Q) DRbar
  2  2     0.00000000E+00   # y_c(Q) DRbar
  3  3     8.57357626E-01   # y_t(Q) DRbar
#
BLOCK Yd Q=  1.24828900E+03  # The Yukawa couplings
  1  1     0.00000000E+00   # y_d(Q) DRbar
  2  2     0.00000000E+00   # y_s(Q) DRbar
  3  3     3.02314609E-01   # y_b(Q) DRbar
#
BLOCK Ye Q=  1.24828900E+03  # The Yukawa couplings
  1  1     0.00000000E+00   # y_e(Q) DRbar
  2  2     0.00000000E+00   # y_mu(Q) DRbar
  3  3     2.13040543E-01   # y_tau(Q) DRbar
#
BLOCK MSOFT Q=  1.24828900E+03  # The soft SUSY breaking masses at the scale Q
         1     3.37010000E+02   # M_1(Q)              
         2     1.87868000E+03   # M_2(Q)              
         3     2.76230000E+03   # M_3(Q)              
        21     1.13600351E+05   # mH1^2(Q)            
        22    -1.00305181E+05   # mH2^2(Q)            
        31     1.29771000E+03   # meL(Q)              
        32     1.29771000E+03   # mmuL(Q)             
        33     3.63942000E+03   # mtauL(Q)            
        34     2.70941000E+03   # meR(Q)              
        35     2.70941000E+03   # mmuR(Q)             
        36     4.86310000E+02   # mtauR(Q)            
        41     1.85305000E+03   # mqL1(Q)             
        42     1.85305000E+03   # mqL2(Q)             
        43     1.12068999E+03   # mqL3(Q)             
        44     1.87163000E+03   # muR(Q)              
        45     1.87163000E+03   # mcR(Q)              
        46     1.39856999E+03   # mtR(Q)              
        47     2.68373000E+03   # mdR(Q)              
        48     2.68373000E+03   # msR(Q)              
        49     6.22299992E+02   # mbR(Q)              
#
Block HiggsBoundsInputHiggsCouplingsFermions
# ScalarNormEffCoupSq PseudoSNormEffCoupSq NP   IP1 IP2 IP2
    1.19187432E+00    0.00000000E+00        3  25   5   5  # h0-b-b eff. coupling^2, normalised to SM
    4.48133172E+02    0.00000000E+00        3  35   5   5  # H0-b-b eff. coupling^2, normalised to SM
    0.00000000E+00    4.48325047E+02        3  36   5   5  # A0-b-b eff. coupling^2, normalised to SM
#
    9.99572020E-01    0.00000000E+00        3  25   6   6  # h0-t-t eff. coupling^2, normalised to SM
    2.65850487E-03    0.00000000E+00        3  35   6   6  # H0-t-t eff. coupling^2, normalised to SM
    0.00000000E+00    2.23052450E-03        3  36   6   6  # A0-t-t eff. coupling^2, normalised to SM
#
    1.19187432E+00    0.00000000E+00        3  25  15  15  # h0-tau-tau eff. coupling^2, normalised to SM
    4.48133172E+02    0.00000000E+00        3  35  15  15  # H0-tau-tau eff. coupling^2, normalised to SM
    0.00000000E+00    4.48325047E+02        3  36  15  15  # A0-tau-tau eff. coupling^2, normalised to SM
#
Block HiggsBoundsInputHiggsCouplingsBosons
    9.99981228E-01        3  25  24  24  # h0-W-W eff. coupling^2, normalised to SM
    1.87723371E-05        3  35  24  24  # H0-W-W eff. coupling^2, normalised to SM
    0.00000000E+00        3  36  24  24  # A0-W-W eff. coupling^2, normalised to SM
#
    9.99981228E-01        3  25  23  23  # h0-Z-Z eff. coupling^2, normalised to SM
    1.87723371E-05        3  35  23  23  # H0-Z-Z eff. coupling^2, normalised to SM
    0.00000000E+00        3  36  23  23  # A0-Z-Z eff. coupling^2, normalised to SM
#
    8.61129018E-01        3  25  21  21  # h0-g-g eff. coupling^2, normalised to SM
    9.68892816E-04        3  35  21  21  # H0-g-g eff. coupling^2, normalised to SM
    1.11322844E-03        3  36  21  21  # A0-g-g eff. coupling^2, normalised to SM
#
    0.00000000E+00        3  25  25  23  # h0-h0-Z eff. coupling^2, normalised to SM
    0.00000000E+00        3  35  25  23  # H0-h0-Z eff. coupling^2, normalised to SM
    1.87723371E-05        3  36  25  23  # A0-h0-Z eff. coupling^2, normalised to SM
    0.00000000E+00        3  35  35  23  # H0-H0-Z eff. coupling^2, normalised to SM
    9.99981228E-01        3  36  35  23  # A0-H0-Z eff. coupling^2, normalised to SM
    0.00000000E+00        3  36  36  23  # A0-A0-Z eff. coupling^2, normalised to SM
#
    0.00000000E+00        4  25  21  21  23  # h0-g-g-Z eff. coupling^2, normalised to SM
    0.00000000E+00        4  35  21  21  23  # H0-g-g-Z eff. coupling^2, normalised to SM
    0.00000000E+00        4  36  21  21  23  # A0-g-g-Z eff. coupling^2, normalised to SM
#
#
#
#                             =================
#                             |The decay table|
#                             =================
#
# - The QCD corrections to the decays gluino -> squark  + quark
#                                     squark -> gaugino + quark_prime
#                                     squark -> squark_prime + Higgs
#                                     squark -> gluino  + quark
#   are included.
#
# - The multi-body decays for the inos, stops and sbottoms are included.
#
# - The loop induced decays for the gluino, neutralinos and stops
#   are included.
#
# - The SUSY decays of the top quark are included.
#
#
#         PDG            Width
DECAY         6     1.43164128E+00   # top decays
#          BR         NDA      ID1       ID2
     1.00000000E+00    2           5        24   # BR(t ->  b    W+)
#
#         PDG            Width
DECAY   1000021     2.36193639E+02   # gluino decays
#          BR         NDA      ID1       ID2
     3.03204286E-02    2     1000001        -1   # BR(~g -> ~d_L  db)
     3.03204286E-02    2    -1000001         1   # BR(~g -> ~d_L* d )
     3.70400869E-06    2     2000001        -1   # BR(~g -> ~d_R  db)
     3.70400869E-06    2    -2000001         1   # BR(~g -> ~d_R* d )
     3.04134759E-02    2     1000002        -2   # BR(~g -> ~u_L  ub)
     3.04134759E-02    2    -1000002         2   # BR(~g -> ~u_L* u )
     2.97474144E-02    2     2000002        -2   # BR(~g -> ~u_R  ub)
     2.97474144E-02    2    -2000002         2   # BR(~g -> ~u_R* u )
     3.03204286E-02    2     1000003        -3   # BR(~g -> ~s_L  sb)
     3.03204286E-02    2    -1000003         3   # BR(~g -> ~s_L* s )
     3.70400869E-06    2     2000003        -3   # BR(~g -> ~s_R  sb)
     3.70400869E-06    2    -2000003         3   # BR(~g -> ~s_R* s )
     3.04134356E-02    2     1000004        -4   # BR(~g -> ~c_L  cb)
     3.04134356E-02    2    -1000004         4   # BR(~g -> ~c_L* c )
     2.97473736E-02    2     2000004        -4   # BR(~g -> ~c_R  cb)
     2.97473736E-02    2    -2000004         4   # BR(~g -> ~c_R* c )
     1.01144284E-01    2     1000005        -5   # BR(~g -> ~b_1  bb)
     1.01144284E-01    2    -1000005         5   # BR(~g -> ~b_1* b )
     7.75189992E-02    2     2000005        -5   # BR(~g -> ~b_2  bb)
     7.75189992E-02    2    -2000005         5   # BR(~g -> ~b_2* b )
     8.78794932E-02    2     1000006        -6   # BR(~g -> ~t_1  tb)
     8.78794932E-02    2    -1000006         6   # BR(~g -> ~t_1* t )
     5.24872586E-02    2     2000006        -6   # BR(~g -> ~t_2  tb)
     5.24872586E-02    2    -2000006         6   # BR(~g -> ~t_2* t )
#
#         PDG            Width
DECAY   1000006     1.55155752E+01   # stop1 decays
#          BR         NDA      ID1       ID2
     5.76814459E-02    2     1000022         6   # BR(~t_1 -> ~chi_10 t )
     2.91738259E-01    2     1000023         6   # BR(~t_1 -> ~chi_20 t )
     3.18342381E-01    2     1000025         6   # BR(~t_1 -> ~chi_30 t )
     1.57837852E-01    2     1000024         5   # BR(~t_1 -> ~chi_1+ b )
     1.71550241E-01    2     1000005        37   # BR(~t_1 -> ~b_1    H+)
     2.84982089E-03    2     1000005        24   # BR(~t_1 -> ~b_1    W+)
#
#         PDG            Width
DECAY   2000006     6.54033652E+01   # stop2 decays
#          BR         NDA      ID1       ID2
     6.96201799E-02    2     1000022         6   # BR(~t_2 -> ~chi_10 t )
     1.40350521E-01    2     1000023         6   # BR(~t_2 -> ~chi_20 t )
     9.16033313E-02    2     1000025         6   # BR(~t_2 -> ~chi_30 t )
     2.42849730E-01    2     1000024         5   # BR(~t_2 -> ~chi_1+ b )
     7.46004464E-02    2     1000006        25   # BR(~t_2 -> ~t_1    h )
     1.24564446E-02    2     1000005        37   # BR(~t_2 -> ~b_1    H+)
     1.46739795E-01    2     1000006        23   # BR(~t_2 -> ~t_1    Z )
     4.44763868E-04    2     1000005        24   # BR(~t_2 -> ~b_1    W+)
     2.21334788E-01    2     2000005        24   # BR(~t_2 -> ~b_2    W+)
#
#         PDG            Width
DECAY   1000005     2.84059876E-01   # sbottom1 decays
#          BR         NDA      ID1       ID2
     4.60760037E-01    2     1000022         5   # BR(~b_1 -> ~chi_10 b )
     3.18277631E-01    2     1000023         5   # BR(~b_1 -> ~chi_20 b )
     2.20962333E-01    2     1000025         5   # BR(~b_1 -> ~chi_30 b )
#
#         PDG            Width
DECAY   2000005     1.84259210E+01   # sbottom2 decays
#          BR         NDA      ID1       ID2
     1.90331295E-02    2     1000022         5   # BR(~b_2 -> ~chi_10 b )
     4.09096892E-02    2     1000023         5   # BR(~b_2 -> ~chi_20 b )
     2.94113658E-02    2     1000025         5   # BR(~b_2 -> ~chi_30 b )
     6.14255069E-01    2    -1000024         6   # BR(~b_2 -> ~chi_1- t )
     1.60899988E-03    2     1000005        25   # BR(~b_2 -> ~b_1    h )
     1.46428050E-01    2     1000005        35   # BR(~b_2 -> ~b_1    H )
     1.46516789E-01    2     1000005        36   # BR(~b_2 -> ~b_1    A )
     1.83690788E-03    2     1000005        23   # BR(~b_2 -> ~b_1    Z )
#
#         PDG            Width
DECAY   1000002     3.19500740E-01   # sup_L decays
#          BR         NDA      ID1       ID2
     4.80206455E-01    2     1000022         2   # BR(~u_L -> ~chi_10 u)
     6.39564963E-03    2     1000023         2   # BR(~u_L -> ~chi_20 u)
     3.53701242E-01    2     1000025         2   # BR(~u_L -> ~chi_30 u)
     1.59696653E-01    2     1000024         1   # BR(~u_L -> ~chi_1+ d)
#
#         PDG            Width
DECAY   2000002     4.07637132E+00   # sup_R decays
#          BR         NDA      ID1       ID2
     7.41540302E-01    2     1000022         2   # BR(~u_R -> ~chi_10 u)
     2.09389750E-03    2     1000023         2   # BR(~u_R -> ~chi_20 u)
     2.56365801E-01    2     1000025         2   # BR(~u_R -> ~chi_30 u)
     5.81969327E-12    2     1000035         2   # BR(~u_R -> ~chi_40 u)
#
#         PDG            Width
DECAY   1000001     2.65142062E-01   # sdown_L decays
#          BR         NDA      ID1       ID2
     8.51129243E-01    2     1000022         1   # BR(~d_L -> ~chi_10 d)
     3.14294153E-02    2     1000023         1   # BR(~d_L -> ~chi_20 d)
     1.13308261E-01    2     1000025         1   # BR(~d_L -> ~chi_30 d)
     4.13308053E-03    2    -1000024         2   # BR(~d_L -> ~chi_1- u)
#
#         PDG            Width
DECAY   2000001     1.46445886E+00   # sdown_R decays
#          BR         NDA      ID1       ID2
     7.38702427E-01    2     1000022         1   # BR(~d_R -> ~chi_10 d)
     2.11013998E-03    2     1000023         1   # BR(~d_R -> ~chi_20 d)
     2.59186972E-01    2     1000025         1   # BR(~d_R -> ~chi_30 d)
     4.61065482E-07    2     1000035         1   # BR(~d_R -> ~chi_40 d)
#
#         PDG            Width
DECAY   1000004     3.20487094E-01   # scharm_L decays
#          BR         NDA      ID1       ID2
     4.80306390E-01    2     1000022         4   # BR(~c_L -> ~chi_10 c)
     6.39475325E-03    2     1000023         4   # BR(~c_L -> ~chi_20 c)
     3.53621680E-01    2     1000025         4   # BR(~c_L -> ~chi_30 c)
     1.59677177E-01    2     1000024         3   # BR(~c_L -> ~chi_1+ s)
#
#         PDG            Width
DECAY   2000004     4.09093713E+00   # scharm_R decays
#          BR         NDA      ID1       ID2
     7.41623138E-01    2     1000022         4   # BR(~c_R -> ~chi_10 c)
     2.09340243E-03    2     1000023         4   # BR(~c_R -> ~chi_20 c)
     2.56283460E-01    2     1000025         4   # BR(~c_R -> ~chi_30 c)
#
#         PDG            Width
DECAY   1000003     2.66014405E-01   # sstrange_L decays
#          BR         NDA      ID1       ID2
     8.51181477E-01    2     1000022         3   # BR(~s_L -> ~chi_10 s)
     3.14204014E-02    2     1000023         3   # BR(~s_L -> ~chi_20 s)
     1.13266161E-01    2     1000025         3   # BR(~s_L -> ~chi_30 s)
     4.13196080E-03    2    -1000024         4   # BR(~s_L -> ~chi_1- c)
#
#         PDG            Width
DECAY   2000003     1.52300126E+00   # sstrange_R decays
#          BR         NDA      ID1       ID2
     7.38789105E-01    2     1000022         3   # BR(~s_R -> ~chi_10 s)
     2.10962536E-03    2     1000023         3   # BR(~s_R -> ~chi_20 s)
     2.59100816E-01    2     1000025         3   # BR(~s_R -> ~chi_30 s)
     4.53653460E-07    2     1000035         3   # BR(~s_R -> ~chi_40 s)
#
#         PDG            Width
DECAY   1000011     1.49755095E+00   # selectron_L decays
#          BR         NDA      ID1       ID2
     6.95477991E-01    2     1000022        11   # BR(~e_L -> ~chi_10 e-)
     2.99165787E-07    2     1000023        11   # BR(~e_L -> ~chi_20 e-)
     3.04052165E-01    2     1000025        11   # BR(~e_L -> ~chi_30 e-)
     4.69544449E-04    2    -1000024        12   # BR(~e_L -> ~chi_1- nu_e)
#
#         PDG            Width
DECAY   2000011     1.37479687E+01   # selectron_R decays
#          BR         NDA      ID1       ID2
     7.38774514E-01    2     1000022        11   # BR(~e_R -> ~chi_10 e-)
     2.10970877E-03    2     1000023        11   # BR(~e_R -> ~chi_20 e-)
     2.59115319E-01    2     1000025        11   # BR(~e_R -> ~chi_30 e-)
     4.58313199E-07    2     1000035        11   # BR(~e_R -> ~chi_40 e-)
#
#         PDG            Width
DECAY   1000013     1.49755092E+00   # smuon_L decays
#          BR         NDA      ID1       ID2
     6.95477991E-01    2     1000022        13   # BR(~mu_L -> ~chi_10 mu-)
     2.99165787E-07    2     1000023        13   # BR(~mu_L -> ~chi_20 mu-)
     3.04052165E-01    2     1000025        13   # BR(~mu_L -> ~chi_30 mu-)
     4.69544456E-04    2    -1000024        14   # BR(~mu_L -> ~chi_1- nu_mu)
#
#         PDG            Width
DECAY   2000013     1.37479686E+01   # smuon_R decays
#          BR         NDA      ID1       ID2
     7.38774514E-01    2     1000022        13   # BR(~mu_R -> ~chi_10 mu-)
     2.10970877E-03    2     1000023        13   # BR(~mu_R -> ~chi_20 mu-)
     2.59115319E-01    2     1000025        13   # BR(~mu_R -> ~chi_30 mu-)
     4.58313195E-07    2     1000035        13   # BR(~mu_R -> ~chi_40 mu-)
#
#         PDG            Width
DECAY   1000015     1.05682818E+00   # stau_1 decays
#          BR         NDA      ID1       ID2
     7.11496065E-01    2     1000022        15   # BR(~tau_1 -> ~chi_10  tau-)
     4.75908258E-02    2     1000023        15   # BR(~tau_1 -> ~chi_20  tau-)
     1.44365130E-01    2     1000025        15   # BR(~tau_1 -> ~chi_30  tau-)
     9.65479794E-02    2    -1000024        16   # BR(~tau_1 -> ~chi_1-  nu_tau)
#
#         PDG            Width
DECAY   2000015     3.44547037E+01   # stau_2 decays
#          BR         NDA      ID1       ID2
     1.08191070E-01    2     1000022        15   # BR(~tau_2 -> ~chi_10  tau-)
     4.63415255E-02    2     1000023        15   # BR(~tau_2 -> ~chi_20  tau-)
     7.62028706E-02    2     1000025        15   # BR(~tau_2 -> ~chi_30  tau-)
     2.29789995E-01    2     1000035        15   # BR(~tau_2 -> ~chi_40  tau-)
     5.87995750E-05    2    -1000024        16   # BR(~tau_2 -> ~chi_1-  nu_tau)
     4.61017848E-01    2    -1000037        16   # BR(~tau_2 -> ~chi_2-  nu_tau)
     1.01561895E-03    2     1000015        25   # BR(~tau_2 -> ~tau_1   h)
     3.81975026E-02    2     1000015        35   # BR(~tau_2 -> ~tau_1   H)
     3.82508302E-02    2     1000015        36   # BR(~tau_2 -> ~tau_1   A)
     9.33939576E-04    2     1000015        23   # BR(~tau_2 -> ~tau_1   Z)
#
#         PDG            Width
DECAY   1000012     1.52127525E+00   # snu_eL decays
#          BR         NDA      ID1       ID2
     7.76071799E-01    2     1000022        12   # BR(~nu_eL -> ~chi_10 nu_e)
     7.92371176E-03    2     1000023        12   # BR(~nu_eL -> ~chi_20 nu_e)
     1.94523602E-01    2     1000025        12   # BR(~nu_eL -> ~chi_30 nu_e)
     2.14808870E-02    2     1000024        11   # BR(~nu_eL -> ~chi_1+ e-)
#
#         PDG            Width
DECAY   1000014     1.52127525E+00   # snu_muL decays
#          BR         NDA      ID1       ID2
     7.76071799E-01    2     1000022        14   # BR(~nu_muL -> ~chi_10 nu_mu)
     7.92371176E-03    2     1000023        14   # BR(~nu_muL -> ~chi_20 nu_mu)
     1.94523602E-01    2     1000025        14   # BR(~nu_muL -> ~chi_30 nu_mu)
     2.14808867E-02    2     1000024        13   # BR(~nu_muL -> ~chi_1+ mu-)
#
#         PDG            Width
DECAY   1000016     3.44606832E+01   # snu_tauL decays
#          BR         NDA      ID1       ID2
     1.06691375E-01    2     1000022        16   # BR(~nu_tauL -> ~chi_10 nu_tau)
     1.13581434E-03    2     1000023        16   # BR(~nu_tauL -> ~chi_20 nu_tau)
     2.82121159E-02    2     1000025        16   # BR(~nu_tauL -> ~chi_30 nu_tau)
     2.30233592E-01    2     1000035        16   # BR(~nu_tauL -> ~chi_40 nu_tau)
     9.65283636E-02    2     1000024        15   # BR(~nu_tauL -> ~chi_1+ tau-)
     4.58913302E-01    2     1000037        15   # BR(~nu_tauL -> ~chi_2+ tau-)
     7.64711832E-02    2    -1000015       -37   # BR(~nu_tauL -> ~tau_1+ H-)
     1.81425402E-03    2    -1000015       -24   # BR(~nu_tauL -> ~tau_1+ W-)
#
#         PDG            Width
DECAY   1000024     1.23266152E-04   # chargino1+ decays
#           BR         NDA      ID1       ID2       ID3
     3.33174205E-01    3     1000022         2        -1   # BR(~chi_1+ -> ~chi_10 u    db)
     3.33174205E-01    3     1000022         4        -3   # BR(~chi_1+ -> ~chi_10 c    sb)
     1.11072496E-01    3     1000022       -11        12   # BR(~chi_1+ -> ~chi_10 e+   nu_e)
     1.11072496E-01    3     1000022       -13        14   # BR(~chi_1+ -> ~chi_10 mu+  nu_mu)
     1.11506597E-01    3     1000022       -15        16   # BR(~chi_1+ -> ~chi_10 tau+ nu_tau)
#
#         PDG            Width
DECAY   1000037     5.62817521E+01   # chargino2+ decays
#          BR         NDA      ID1       ID2
     5.38237022E-05    2     1000002        -1   # BR(~chi_2+ -> ~u_L     db)
     3.86097604E-05    2    -1000001         2   # BR(~chi_2+ -> ~d_L*    u )
     5.37874854E-05    2     1000004        -3   # BR(~chi_2+ -> ~c_L     sb)
     3.80220415E-05    2    -1000003         4   # BR(~chi_2+ -> ~s_L*     c )
     1.83718687E-01    2     1000006        -5   # BR(~chi_2+ -> ~t_1     bb)
     7.48999518E-03    2     2000006        -5   # BR(~chi_2+ -> ~t_2     bb)
     3.01018419E-05    2    -1000005         6   # BR(~chi_2+ -> ~b_1*    t )
     1.74460213E-01    2    -2000005         6   # BR(~chi_2+ -> ~b_2*    t )
     3.61478057E-02    2     1000012       -11   # BR(~chi_2+ -> ~nu_eL   e+  )
     3.61478057E-02    2     1000014       -13   # BR(~chi_2+ -> ~nu_muL mu+ )
     3.59982894E-02    2    -1000011        12   # BR(~chi_2+ -> ~e_L+    nu_e)
     3.59982894E-02    2    -1000013        14   # BR(~chi_2+ -> ~mu_L+   nu_mu)
     2.54245801E-07    2    -1000015        16   # BR(~chi_2+ -> ~tau_1+  nu_tau)
     6.27778419E-02    2     1000024        23   # BR(~chi_2+ -> ~chi_1+  Z )
     1.17816895E-02    2     1000022        24   # BR(~chi_2+ -> ~chi_10  W+)
     6.12488855E-02    2     1000023        24   # BR(~chi_2+ -> ~chi_20  W+)
     4.93518068E-02    2     1000025        24   # BR(~chi_2+ -> ~chi_30  W+)
     6.39088012E-02    2     1000024        25   # BR(~chi_2+ -> ~chi_1+  h )
     6.03231691E-02    2     1000024        35   # BR(~chi_2+ -> ~chi_1+  H )
     6.01855379E-02    2     1000024        36   # BR(~chi_2+ -> ~chi_1+  A )
     1.79597219E-02    2     1000022        37   # BR(~chi_2+ -> ~chi_10  H+)
     5.96019653E-02    2     1000023        37   # BR(~chi_2+ -> ~chi_20  H+)
     4.26848970E-02    2     1000025        37   # BR(~chi_2+ -> ~chi_30  H+)
#
#         PDG            Width
DECAY   1000022     0.00000000E+00   # neutralino1 decays
#
#         PDG            Width
DECAY   1000023     1.22802538E-04   # neutralino2 decays
#          BR         NDA      ID1       ID2
     4.00619632E-04    2     1000022        22   # BR(~chi_20 -> ~chi_10 gam)
#           BR         NDA      ID1       ID2       ID3
     1.17210380E-01    3     1000022        -2         2   # BR(~chi_20 -> ~chi_10 ub      u)
     1.52010906E-01    3     1000022        -1         1   # BR(~chi_20 -> ~chi_10 db      d)
     1.17210380E-01    3     1000022        -4         4   # BR(~chi_20 -> ~chi_10 cb      c)
     1.52010906E-01    3     1000022        -3         3   # BR(~chi_20 -> ~chi_10 sb      s)
     1.47256345E-01    3     1000022        -5         5   # BR(~chi_20 -> ~chi_10 bb      b)
     3.48469823E-02    3     1000022       -11        11   # BR(~chi_20 -> ~chi_10 e+      e-)
     3.48469823E-02    3     1000022       -13        13   # BR(~chi_20 -> ~chi_10 mu+     mu-)
     3.51469153E-02    3     1000022       -15        15   # BR(~chi_20 -> ~chi_10 tau+    tau-)
     6.96931621E-02    3     1000022       -12        12   # BR(~chi_20 -> ~chi_10 nu_eb   nu_e)
     6.96931621E-02    3     1000022       -14        14   # BR(~chi_20 -> ~chi_10 nu_mub  nu_mu)
     6.96709787E-02    3     1000022       -16        16   # BR(~chi_20 -> ~chi_10 nu_taub nu_tau)
     4.22814066E-07    3     1000024        -2         1   # BR(~chi_20 -> ~chi_1+ ub      d)
     4.22814066E-07    3    -1000024        -1         2   # BR(~chi_20 -> ~chi_1- db      u)
     4.22814066E-07    3     1000024        -4         3   # BR(~chi_20 -> ~chi_1+ cb      s)
     4.22814066E-07    3    -1000024        -3         4   # BR(~chi_20 -> ~chi_1- sb      c)
     1.40939684E-07    3     1000024       -12        11   # BR(~chi_20 -> ~chi_1+ nu_eb   e-)
     1.40939684E-07    3    -1000024        12       -11   # BR(~chi_20 -> ~chi_1- nu_e    e+)
     1.40939684E-07    3     1000024       -14        13   # BR(~chi_20 -> ~chi_1+ nu_mub  mu-)
     1.40939684E-07    3    -1000024        14       -13   # BR(~chi_20 -> ~chi_1- nu_mu   mu+)
     1.26369666E-08    3     1000024       -16        15   # BR(~chi_20 -> ~chi_1+ nu_taub tau-)
     1.26369666E-08    3    -1000024        16       -15   # BR(~chi_20 -> ~chi_1- nu_tau  tau+)
#
#         PDG            Width
DECAY   1000025     7.37270585E-06   # neutralino3 decays
#          BR         NDA      ID1       ID2
     4.32748627E-02    2     1000022        22   # BR(~chi_30 -> ~chi_10 gam)
     3.18866112E-02    2     1000023        22   # BR(~chi_30 -> ~chi_20 gam)
#           BR         NDA      ID1       ID2       ID3
     6.98811911E-02    3     1000022        -2         2   # BR(~chi_30 -> ~chi_10 ub      u)
     8.89469714E-02    3     1000022        -1         1   # BR(~chi_30 -> ~chi_10 db      d)
     6.98811911E-02    3     1000022        -4         4   # BR(~chi_30 -> ~chi_10 cb      c)
     8.89469714E-02    3     1000022        -3         3   # BR(~chi_30 -> ~chi_10 sb      s)
     1.23174128E-01    3     1000022        -5         5   # BR(~chi_30 -> ~chi_10 bb      b)
     1.92509064E-02    3     1000022       -11        11   # BR(~chi_30 -> ~chi_10 e+      e-)
     1.92509064E-02    3     1000022       -13        13   # BR(~chi_30 -> ~chi_10 mu+     mu-)
     2.36752729E-02    3     1000022       -15        15   # BR(~chi_30 -> ~chi_10 tau+    tau-)
     4.19936312E-02    3     1000022       -12        12   # BR(~chi_30 -> ~chi_10 nu_eb   nu_e)
     4.19936312E-02    3     1000022       -14        14   # BR(~chi_30 -> ~chi_10 nu_mub  nu_mu)
     4.09818097E-02    3     1000022       -16        16   # BR(~chi_30 -> ~chi_10 nu_taub nu_tau)
     5.19445576E-03    3     1000023        -2         2   # BR(~chi_30 -> ~chi_20 ub      u)
     6.73773147E-03    3     1000023        -1         1   # BR(~chi_30 -> ~chi_20 db      d)
     5.19445576E-03    3     1000023        -4         4   # BR(~chi_30 -> ~chi_20 cb      c)
     6.73773147E-03    3     1000023        -3         3   # BR(~chi_30 -> ~chi_20 sb      s)
     1.73241644E-03    3     1000023        -5         5   # BR(~chi_30 -> ~chi_20 bb      b)
     1.54479075E-03    3     1000023       -11        11   # BR(~chi_30 -> ~chi_20 e+      e-)
     1.54479075E-03    3     1000023       -13        13   # BR(~chi_30 -> ~chi_20 mu+     mu-)
     1.45170330E-03    3     1000023       -15        15   # BR(~chi_30 -> ~chi_20 tau+    tau-)
     3.08737752E-03    3     1000023       -12        12   # BR(~chi_30 -> ~chi_20 nu_eb   nu_e)
     3.08737752E-03    3     1000023       -14        14   # BR(~chi_30 -> ~chi_20 nu_mub  nu_mu)
     3.08772248E-03    3     1000023       -16        16   # BR(~chi_30 -> ~chi_20 nu_taub nu_tau)
     4.31388483E-02    3     1000024        -2         1   # BR(~chi_30 -> ~chi_1+ ub      d)
     4.31388483E-02    3    -1000024        -1         2   # BR(~chi_30 -> ~chi_1- db      u)
     4.31388483E-02    3     1000024        -4         3   # BR(~chi_30 -> ~chi_1+ cb      s)
     4.31388483E-02    3    -1000024        -3         4   # BR(~chi_30 -> ~chi_1- sb      c)
     1.43783910E-02    3     1000024       -12        11   # BR(~chi_30 -> ~chi_1+ nu_eb   e-)
     1.43783910E-02    3    -1000024        12       -11   # BR(~chi_30 -> ~chi_1- nu_e    e+)
     1.43783910E-02    3     1000024       -14        13   # BR(~chi_30 -> ~chi_1+ nu_mub  mu-)
     1.43783910E-02    3    -1000024        14       -13   # BR(~chi_30 -> ~chi_1- nu_mu   mu+)
     1.36962024E-02    3     1000024       -16        15   # BR(~chi_30 -> ~chi_1+ nu_taub tau-)
     1.36962024E-02    3    -1000024        16       -15   # BR(~chi_30 -> ~chi_1- nu_tau  tau+)
#
#         PDG            Width
DECAY   1000035     5.62692151E+01   # neutralino4 decays
#          BR         NDA      ID1       ID2
     4.83293844E-03    2     1000022        23   # BR(~chi_40 -> ~chi_10   Z )
     4.04247495E-02    2     1000023        23   # BR(~chi_40 -> ~chi_20   Z )
     1.74974873E-02    2     1000025        23   # BR(~chi_40 -> ~chi_30   Z )
     6.12612593E-02    2     1000024       -24   # BR(~chi_40 -> ~chi_1+   W-)
     6.12612593E-02    2    -1000024        24   # BR(~chi_40 -> ~chi_1-   W+)
     7.51206629E-03    2     1000022        25   # BR(~chi_40 -> ~chi_10   h )
     1.28577206E-02    2     1000022        35   # BR(~chi_40 -> ~chi_10   H )
     5.23259385E-03    2     1000022        36   # BR(~chi_40 -> ~chi_10   A )
     2.25827898E-02    2     1000023        25   # BR(~chi_40 -> ~chi_20   h )
     1.52544629E-02    2     1000023        35   # BR(~chi_40 -> ~chi_20   H )
     4.44839582E-02    2     1000023        36   # BR(~chi_40 -> ~chi_20   A )
     3.36916634E-02    2     1000025        25   # BR(~chi_40 -> ~chi_30   h )
     3.24149640E-02    2     1000025        35   # BR(~chi_40 -> ~chi_30   H )
     1.06464103E-02    2     1000025        36   # BR(~chi_40 -> ~chi_30   A )
     5.99463349E-02    2     1000024       -37   # BR(~chi_40 -> ~chi_1+   H-)
     5.99463349E-02    2    -1000024        37   # BR(~chi_40 -> ~chi_1-   H+)
     2.60900955E-05    2     1000002        -2   # BR(~chi_40 -> ~u_L      ub)
     2.60900955E-05    2    -1000002         2   # BR(~chi_40 -> ~u_L*     u )
     1.85507671E-05    2     1000001        -1   # BR(~chi_40 -> ~d_L      db)
     1.85507671E-05    2    -1000001         1   # BR(~chi_40 -> ~d_L*     d )
     2.57979854E-05    2     1000004        -4   # BR(~chi_40 -> ~c_L      cb)
     2.57979854E-05    2    -1000004         4   # BR(~chi_40 -> ~c_L*     c )
     1.85507671E-05    2     1000003        -3   # BR(~chi_40 -> ~s _L      sb)
     1.85507671E-05    2    -1000003         3   # BR(~chi_40 -> ~s _L*     s )
     8.78430617E-02    2     1000006        -6   # BR(~chi_40 -> ~t_1      tb)
     8.78430617E-02    2    -1000006         6   # BR(~chi_40 -> ~t_1*     t )
     3.31677949E-03    2     2000006        -6   # BR(~chi_40 -> ~t_2      tb)
     3.31677949E-03    2    -2000006         6   # BR(~chi_40 -> ~t_2*     t )
     1.55946490E-05    2     1000005        -5   # BR(~chi_40 -> ~b_1      bb)
     1.55946490E-05    2    -1000005         5   # BR(~chi_40 -> ~b_1*     b )
     9.16789812E-02    2     2000005        -5   # BR(~chi_40 -> ~b_2      bb)
     9.16789812E-02    2    -2000005         5   # BR(~chi_40 -> ~b_2*     b )
     1.79371038E-02    2     1000011       -11   # BR(~chi_40 -> ~e_L-     e+)
     1.79371038E-02    2    -1000011        11   # BR(~chi_40 -> ~e_L+     e-)
     1.79371038E-02    2     1000013       -13   # BR(~chi_40 -> ~mu_L-    mu+)
     1.79371038E-02    2    -1000013        13   # BR(~chi_40 -> ~mu_L+    mu-)
     2.49474153E-07    2     1000015       -15   # BR(~chi_40 -> ~tau_1-   tau+)
     2.49474153E-07    2    -1000015        15   # BR(~chi_40 -> ~tau_1+   tau-)
     1.81293199E-02    2     1000012       -12   # BR(~chi_40 -> ~nu_eL    nu_eb)
     1.81293199E-02    2    -1000012        12   # BR(~chi_40 -> ~nu_eL*   nu_e )
     1.81293199E-02    2     1000014       -14   # BR(~chi_40 -> ~nu_muL   nu_mub)
     1.81293199E-02    2    -1000014        14   # BR(~chi_40 -> ~nu_muL*  nu_mu )
#
#         PDG            Width
DECAY        25     4.51553909E-03   # h decays
#          BR         NDA      ID1       ID2
     6.17091553E-01    2           5        -5   # BR(h -> b       bb     )
     6.86348074E-02    2         -15        15   # BR(h -> tau+    tau-   )
     2.43306530E-04    2         -13        13   # BR(h -> mu+     mu-    )
     2.65448997E-04    2           3        -3   # BR(h -> s       sb     )
     1.92592411E-02    2           4        -4   # BR(h -> c       cb     )
     7.03657707E-02    2          21        21   # BR(h -> g       g      )
     2.12260185E-03    2          22        22   # BR(h -> gam     gam    )
     1.44570801E-03    2          22        23   # BR(h -> Z       gam    )
     1.95876537E-01    2          24       -24   # BR(h -> W+      W-     )
     2.46950253E-02    2          23        23   # BR(h -> Z       Z      )
#
#         PDG            Width
DECAY        35     4.73368192E+00   # H decays
#          BR         NDA      ID1       ID2
     8.94234080E-01    2           5        -5   # BR(H -> b       bb     )
     9.73639393E-02    2         -15        15   # BR(H -> tau+    tau-   )
     3.50421971E-04    2         -13        13   # BR(H -> mu+     mu-    )
     2.97152049E-04    2           3        -3   # BR(H -> s       sb     )
     1.48202971E-07    2           4        -4   # BR(H -> c       cb     )
     6.74153245E-03    2           6        -6   # BR(H -> t       tb     )
     2.61303295E-04    2          21        21   # BR(H -> g       g      )
     1.08545286E-07    2          22        22   # BR(H -> gam     gam    )
     8.25689198E-08    2          23        22   # BR(H -> Z       gam    )
     1.27900627E-04    2          24       -24   # BR(H -> W+      W-     )
     6.09703204E-05    2          23        23   # BR(H -> Z       Z      )
     5.62360433E-04    2          25        25   # BR(H -> h       h      )
#
#         PDG            Width
DECAY        36     4.74932621E+00   # A decays
#          BR         NDA      ID1       ID2
     8.91645479E-01    2           5        -5   # BR(A -> b       bb     )
     9.70753018E-02    2         -15        15   # BR(A -> tau+    tau-   )
     3.49363589E-04    2         -13        13   # BR(A -> mu+     mu-    )
     2.96309536E-04    2           3        -3   # BR(A -> s       sb     )
     1.25050177E-07    2           4        -4   # BR(A -> c       cb     )
     1.02445631E-02    2           6        -6   # BR(A -> t       tb     )
     2.79104315E-04    2          21        21   # BR(A -> g       g      )
     1.97321616E-07    2          22        22   # BR(A -> gam     gam    )
     6.58784862E-08    2          23        22   # BR(A -> Z       gam    )
     1.09490597E-04    2          23        25   # BR(A -> Z       h      )
#
#         PDG            Width
DECAY        37     4.44363543E+00   # H+ decays
#          BR         NDA      ID1       ID2
     1.65808173E-03    2           4        -5   # BR(H+ -> c       bb     )
     1.05160191E-01    2         -15        16   # BR(H+ -> tau+    nu_tau )
     3.78459975E-04    2         -13        14   # BR(H+ -> mu+     nu_mu  )
     1.65802254E-05    2           2        -5   # BR(H+ -> u       bb     )
     1.59058823E-05    2           2        -3   # BR(H+ -> u       sb     )
     3.13202201E-04    2           4        -3   # BR(H+ -> c       sb     )
     8.92330956E-01    2           6        -5   # BR(H+ -> t       bb     )
     1.26618586E-04    2          24        25   # BR(H+ -> W+      h      )
     3.78082120E-09    2          24        36   # BR(H+ -> W+      A      )
