#
#                              ======================
#                              | THE SUSYHIT OUTPUT |
#                              ======================
#
#
#              ------------------------------------------------------
#              |     This is the output of the SUSY-HIT package     |
#              |  created by A.Djouadi, M.Muehlleitner and M.Spira. |
#              |  In case of problems with SUSY-HIT email to        |
#              |           margarete.muehlleitner@cern.ch           |
#              |           michael.spira@psi.ch                     |
#              |           abdelhak.djouadi@cern.ch                 |
#              ------------------------------------------------------
#
#              ------------------------------------------------------
#              |  SUSY Les Houches Accord - MSSM Spectrum + Decays  |
#              |              based on the decay programs           |
#              |                                                    |
#              |                     SDECAY 1.3b                    |
#              |                                                    |
#              |  Authors: M.Muhlleitner, A.Djouadi and Y.Mambrini  |
#              |  Ref.:    Comput.Phys.Commun.168(2005)46           |
#              |           [hep-ph/0311167]                         |
#              |                                                    |
#              |                     HDECAY 3.4                     |
#              |                                                    |
#              |  By: A.Djouadi,J.Kalinowski,M.Muhlleitner,M.Spira  |
#              |  Ref.:    Comput.Phys.Commun.108(1998)56           |
#              |           [hep-ph/9704448]                         |
#              |                                                    |
#              |                                                    |
#              |  If not stated otherwise all DRbar couplings and   |
#              |  soft SUSY breaking masses are given at the scale  |
#              |  Q=  0.16584800E+04
#              |                                                    |
#              ------------------------------------------------------
#
#
BLOCK DCINFO  # Decay Program information
     1   SDECAY/HDECAY # decay calculator
     2   1.3b  /3.4    # version number
#
BLOCK SPINFO  # Spectrum calculator information
     1     SOFTSUSY    # spectrum calculator               
     2     3.4.0       # version number                    
#
BLOCK MODSEL  # Model selection
     1     0   #  nonUniversal                                     
#
BLOCK SMINPUTS  # Standard Model inputs
         1     1.27908970E+02   # alpha_em^-1(M_Z)^MSbar
         2     1.16637870E-05   # G_F [GeV^-2]
         3     1.18400000E-01   # alpha_S(M_Z)^MSbar
         4     9.11876000E+01   # M_Z pole mass
         5     4.18000000E+00   # mb(mb)^MSbar
         6     1.73200000E+02   # mt pole mass
         7     1.77700000E+00   # mtau pole mass
#
BLOCK MINPAR  # Input parameters - minimal models
         3     2.62400000E+01   # tanb                
#
BLOCK EXTPAR  # Input parameters - non-minimal models
         0    -1.00000000E+00   # Set                 
         1    -1.94384000E+03   # M_1(MX)             
         2     1.86496000E+03   # M_2(MX)             
         3     2.65048000E+03   # M_3(MX)             
        11    -4.06201000E+03   # At(MX)              
        12    -7.61240000E+02   # Ab(MX)              
        13    -1.18282000E+03   # Atau(MX)            
        23    -2.73710000E+02   # mu(MX)              
        26     3.09167000E+03   # mA(pole)            
        31     3.77900000E+03   # meL(MX)             
        32     3.77900000E+03   # mmuL(MX)            
        33     2.75230000E+02   # mtauL(MX)           
        34     2.24223000E+03   # meR(MX)             
        35     2.24223000E+03   # mmuR(MX)            
        36     1.31577000E+03   # mtauR(MX)           
        41     1.48396000E+03   # mqL1(MX)            
        42     1.48396000E+03   # mqL2(MX)            
        43     3.56800000E+03   # mqL3(MX)            
        44     1.30735000E+03   # muR(MX)             
        45     1.30735000E+03   # mcR(MX)             
        46     7.74960000E+02   # mtR(MX)             
        47     3.57014000E+03   # mdR(MX)             
        48     3.57014000E+03   # msR(MX)             
        49     1.07320000E+03   # mbR(MX)             
#
BLOCK MASS  # Mass Spectrum
# PDG code           mass       particle
        24     8.03828712E+01   # W+
        25     1.27900759E+02   # h
        35     3.09168144E+03   # H
        36     3.09166982E+03   # A
        37     3.09304086E+03   # H+
         5     4.81876030E+00   # b-quark pole mass calculated from mb(mb)_Msbar
   1000001     1.54973790E+03   # ~d_L
   2000001     3.60166300E+03   # ~d_R
   1000002     1.54781403E+03   # ~u_L
   2000002     1.35949515E+03   # ~u_R
   1000003     1.54973790E+03   # ~s_L
   2000003     3.60166300E+03   # ~s_R
   1000004     1.54781403E+03   # ~c_L
   2000004     1.35949515E+03   # ~c_R
   1000005     1.12557699E+03   # ~b_1
   2000005     3.59307515E+03   # ~b_2
   1000006     8.86290060E+02   # ~t_1
   2000006     3.59933602E+03   # ~t_2
   1000011     3.78545248E+03   # ~e_L
   2000011     2.24696167E+03   # ~e_R
   1000012     3.78431077E+03   # ~nu_eL
   1000013     3.78545248E+03   # ~mu_L
   2000013     2.24696167E+03   # ~mu_R
   1000014     3.78431077E+03   # ~nu_muL
   1000015     3.19973335E+02   # ~tau_1
   2000015     1.32216819E+03   # ~tau_2
   1000016     3.10135718E+02   # ~nu_tauL
   1000021     2.68648029E+03   # ~g
   1000022     2.83210014E+02   # ~chi_10
   1000023    -2.85766339E+02   # ~chi_20
   1000025     1.88724029E+03   # ~chi_30
   1000035    -1.92611176E+03   # ~chi_40
   1000024     2.84781813E+02   # ~chi_1+
   1000037     1.88740804E+03   # ~chi_2+
#
BLOCK NMIX  # Neutralino Mixing Matrix
  1  1     1.38368324E-02   # N_11
  1  2     3.27734785E-02   # N_12
  1  3     7.08656311E-01   # N_13
  1  4     7.04656422E-01   # N_14
  2  1     2.01461008E-02   # N_21
  2  2     2.64258218E-02   # N_22
  2  3    -7.05525199E-01   # N_23
  2  4     7.07905364E-01   # N_24
  3  1    -4.88948978E-04   # N_31
  3  2     9.99113271E-01   # N_32
  3  3    -4.58292054E-03   # N_33
  3  4    -4.18500922E-02   # N_34
  4  1     9.99701174E-01   # N_41
  4  2    -4.97491652E-04   # N_42
  4  3     4.40709932E-03   # N_43
  4  4    -2.40393918E-02   # N_44
#
BLOCK UMIX  # Chargino Mixing Matrix U
  1  1     6.49454755E-03   # U_11
  1  2     9.99978910E-01   # U_12
  2  1    -9.99978910E-01   # U_21
  2  2     6.49454755E-03   # U_22
#
BLOCK VMIX  # Chargino Mixing Matrix V
  1  1     5.92357932E-02   # V_11
  1  2    -9.98244019E-01   # V_12
  2  1    -9.98244019E-01   # V_21
  2  2    -5.92357932E-02   # V_22
#
BLOCK STOPMIX  # Stop Mixing Matrix
  1  1     4.82980452E-02   # cos(theta_t)
  1  2     9.98832968E-01   # sin(theta_t)
  2  1    -9.98832968E-01   # -sin(theta_t)
  2  2     4.82980452E-02   # cos(theta_t)
#
BLOCK SBOTMIX  # Sbottom Mixing Matrix
  1  1    -1.20777707E-03   # cos(theta_b)
  1  2     9.99999271E-01   # sin(theta_b)
  2  1    -9.99999271E-01   # -sin(theta_b)
  2  2    -1.20777707E-03   # cos(theta_b)
#
BLOCK STAUMIX  # Stau Mixing Matrix
  1  1     9.99981851E-01   # cos(theta_tau)
  1  2    -6.02475482E-03   # sin(theta_tau)
  2  1     6.02475482E-03   # -sin(theta_tau)
  2  2     9.99981851E-01   # cos(theta_tau)
#
BLOCK ALPHA  # Higgs mixing
          -3.94343379E-02   # Mixing angle in the neutral Higgs boson sector
#
BLOCK HMIX Q=  1.65848000E+03  # DRbar Higgs Parameters
         1    -2.77173377E+02   # mu(Q)MSSM           
         2     2.54114041E+01   # tan                 
         3     2.43244120E+02   # higgs               
         4     9.21493591E+06   # mA^2(Q)MSSM         
#
BLOCK GAUGE Q=  1.65848000E+03  # The gauge couplings
     1     3.63586650E-01   # gprime(Q) DRbar
     2     6.37921736E-01   # g(Q) DRbar
     3     1.02804337E+00   # g3(Q) DRbar
#
BLOCK AU Q=  1.65848000E+03  # The trilinear couplings
  1  1     0.00000000E+00   # A_u(Q) DRbar
  2  2     0.00000000E+00   # A_c(Q) DRbar
  3  3    -4.06200999E+03   # A_t(Q) DRbar
#
BLOCK AD Q=  1.65848000E+03  # The trilinear couplings
  1  1     0.00000000E+00   # A_d(Q) DRbar
  2  2     0.00000000E+00   # A_s(Q) DRbar
  3  3    -7.61239998E+02   # A_b(Q) DRbar
#
BLOCK AE Q=  1.65848000E+03  # The trilinear couplings
  1  1     0.00000000E+00   # A_e(Q) DRbar
  2  2     0.00000000E+00   # A_mu(Q) DRbar
  3  3    -1.18282000E+03   # A_tau(Q) DRbar
#
BLOCK Yu Q=  1.65848000E+03  # The Yukawa couplings
  1  1     0.00000000E+00   # y_u(Q) DRbar
  2  2     0.00000000E+00   # y_c(Q) DRbar
  3  3     8.26519701E-01   # y_t(Q) DRbar
#
BLOCK Yd Q=  1.65848000E+03  # The Yukawa couplings
  1  1     0.00000000E+00   # y_d(Q) DRbar
  2  2     0.00000000E+00   # y_s(Q) DRbar
  3  3     3.45001161E-01   # y_b(Q) DRbar
#
BLOCK Ye Q=  1.65848000E+03  # The Yukawa couplings
  1  1     0.00000000E+00   # y_e(Q) DRbar
  2  2     0.00000000E+00   # y_mu(Q) DRbar
  3  3     2.49499206E-01   # y_tau(Q) DRbar
#
BLOCK MSOFT Q=  1.65848000E+03  # The soft SUSY breaking masses at the scale Q
         1    -1.94384000E+03   # M_1(Q)              
         2     1.86496000E+03   # M_2(Q)              
         3     2.65048000E+03   # M_3(Q)              
        21     9.43101212E+06   # mH1^2(Q)            
        22    -3.10680589E+05   # mH2^2(Q)            
        31     3.77900000E+03   # meL(Q)              
        32     3.77900000E+03   # mmuL(Q)             
        33     2.75230000E+02   # mtauL(Q)            
        34     2.24223000E+03   # meR(Q)              
        35     2.24223000E+03   # mmuR(Q)             
        36     1.31577000E+03   # mtauR(Q)            
        41     1.48395999E+03   # mqL1(Q)             
        42     1.48395999E+03   # mqL2(Q)             
        43     3.56799999E+03   # mqL3(Q)             
        44     1.30734999E+03   # muR(Q)              
        45     1.30734999E+03   # mcR(Q)              
        46     7.74959965E+02   # mtR(Q)              
        47     3.57014000E+03   # mdR(Q)              
        48     3.57014000E+03   # msR(Q)              
        49     1.07319999E+03   # mbR(Q)              
#
Block HiggsBoundsInputHiggsCouplingsFermions
# ScalarNormEffCoupSq PseudoSNormEffCoupSq NP   IP1 IP2 IP2
    1.00520198E+00    0.00000000E+00        3  25   5   5  # h0-b-b eff. coupling^2, normalised to SM
    6.45734256E+02    0.00000000E+00        3  35   5   5  # H0-b-b eff. coupling^2, normalised to SM
    0.00000000E+00    6.45739458E+02        3  36   5   5  # A0-b-b eff. coupling^2, normalised to SM
#
    9.99991944E-01    0.00000000E+00        3  25   6   6  # h0-t-t eff. coupling^2, normalised to SM
    1.55666804E-03    0.00000000E+00        3  35   6   6  # H0-t-t eff. coupling^2, normalised to SM
    0.00000000E+00    1.54861220E-03        3  36   6   6  # A0-t-t eff. coupling^2, normalised to SM
#
    1.00520198E+00    0.00000000E+00        3  25  15  15  # h0-tau-tau eff. coupling^2, normalised to SM
    6.45734256E+02    0.00000000E+00        3  35  15  15  # H0-tau-tau eff. coupling^2, normalised to SM
    0.00000000E+00    6.45739458E+02        3  36  15  15  # A0-tau-tau eff. coupling^2, normalised to SM
#
Block HiggsBoundsInputHiggsCouplingsBosons
    9.99999990E-01        3  25  24  24  # h0-W-W eff. coupling^2, normalised to SM
    1.04494676E-08        3  35  24  24  # H0-W-W eff. coupling^2, normalised to SM
    0.00000000E+00        3  36  24  24  # A0-W-W eff. coupling^2, normalised to SM
#
    9.99999990E-01        3  25  23  23  # h0-Z-Z eff. coupling^2, normalised to SM
    1.04494676E-08        3  35  23  23  # H0-Z-Z eff. coupling^2, normalised to SM
    0.00000000E+00        3  36  23  23  # A0-Z-Z eff. coupling^2, normalised to SM
#
    8.83840141E-01        3  25  21  21  # h0-g-g eff. coupling^2, normalised to SM
    6.11654127E-14        3  35  21  21  # H0-g-g eff. coupling^2, normalised to SM
    1.23156401E-12        3  36  21  21  # A0-g-g eff. coupling^2, normalised to SM
#
    0.00000000E+00        3  25  25  23  # h0-h0-Z eff. coupling^2, normalised to SM
    0.00000000E+00        3  35  25  23  # H0-h0-Z eff. coupling^2, normalised to SM
    1.04494676E-08        3  36  25  23  # A0-h0-Z eff. coupling^2, normalised to SM
    0.00000000E+00        3  35  35  23  # H0-H0-Z eff. coupling^2, normalised to SM
    9.99999990E-01        3  36  35  23  # A0-H0-Z eff. coupling^2, normalised to SM
    0.00000000E+00        3  36  36  23  # A0-A0-Z eff. coupling^2, normalised to SM
#
    0.00000000E+00        4  25  21  21  23  # h0-g-g-Z eff. coupling^2, normalised to SM
    0.00000000E+00        4  35  21  21  23  # H0-g-g-Z eff. coupling^2, normalised to SM
    0.00000000E+00        4  36  21  21  23  # A0-g-g-Z eff. coupling^2, normalised to SM
#
#
#
#                             =================
#                             |The decay table|
#                             =================
#
# - The QCD corrections to the decays gluino -> squark  + quark
#                                     squark -> gaugino + quark_prime
#                                     squark -> squark_prime + Higgs
#                                     squark -> gluino  + quark
#   are included.
#
# - The multi-body decays for the inos, stops and sbottoms are included.
#
# - The loop induced decays for the gluino, neutralinos and stops
#   are included.
#
# - The SUSY decays of the top quark are included.
#
#
#         PDG            Width
DECAY         6     1.43350994E+00   # top decays
#          BR         NDA      ID1       ID2
     1.00000000E+00    2           5        24   # BR(t ->  b    W+)
#
#         PDG            Width
DECAY   1000021     2.27379066E+02   # gluino decays
#          BR         NDA      ID1       ID2
     5.12926401E-02    2     1000001        -1   # BR(~g -> ~d_L  db)
     5.12926401E-02    2    -1000001         1   # BR(~g -> ~d_L* d )
     5.14196705E-02    2     1000002        -2   # BR(~g -> ~u_L  ub)
     5.14196705E-02    2    -1000002         2   # BR(~g -> ~u_L* u )
     6.37606747E-02    2     2000002        -2   # BR(~g -> ~u_R  ub)
     6.37606747E-02    2    -2000002         2   # BR(~g -> ~u_R* u )
     5.12926401E-02    2     1000003        -3   # BR(~g -> ~s_L  sb)
     5.12926401E-02    2    -1000003         3   # BR(~g -> ~s_L* s )
     5.14196412E-02    2     1000004        -4   # BR(~g -> ~c_L  cb)
     5.14196412E-02    2    -1000004         4   # BR(~g -> ~c_L* c )
     6.37606522E-02    2     2000004        -4   # BR(~g -> ~c_R  cb)
     6.37606522E-02    2    -2000004         4   # BR(~g -> ~c_R* c )
     7.76708976E-02    2     1000005        -5   # BR(~g -> ~b_1  bb)
     7.76708976E-02    2    -1000005         5   # BR(~g -> ~b_1* b )
     8.93831836E-02    2     1000006        -6   # BR(~g -> ~t_1  tb)
     8.93831836E-02    2    -1000006         6   # BR(~g -> ~t_1* t )
#
#         PDG            Width
DECAY   1000006     1.84546739E+01   # stop1 decays
#          BR         NDA      ID1       ID2
     2.34677659E-01    2     1000022         6   # BR(~t_1 -> ~chi_10 t )
     2.40941886E-01    2     1000023         6   # BR(~t_1 -> ~chi_20 t )
     5.24380455E-01    2     1000024         5   # BR(~t_1 -> ~chi_1+ b )
#
#         PDG            Width
DECAY   2000006     1.75451557E+02   # stop2 decays
#          BR         NDA      ID1       ID2
     1.35981580E-01    2     1000022         6   # BR(~t_2 -> ~chi_10 t )
     1.37184828E-01    2     1000023         6   # BR(~t_2 -> ~chi_20 t )
     4.41269073E-02    2     1000025         6   # BR(~t_2 -> ~chi_30 t )
     1.52797601E-03    2     1000035         6   # BR(~t_2 -> ~chi_40 t )
     4.78589123E-02    2     1000024         5   # BR(~t_2 -> ~chi_1+ b )
     8.74419249E-02    2     1000037         5   # BR(~t_2 -> ~chi_2+ b )
     2.16838633E-01    2     1000021         6   # BR(~t_2 -> ~g      t )
     1.63910580E-01    2     1000006        25   # BR(~t_2 -> ~t_1    h )
     1.64951069E-01    2     1000006        23   # BR(~t_2 -> ~t_1    Z )
     1.77590474E-04    2     1000005        24   # BR(~t_2 -> ~b_1    W+)
#
#         PDG            Width
DECAY   1000005     4.54488189E+00   # sbottom1 decays
#          BR         NDA      ID1       ID2
     2.58429217E-01    2     1000022         5   # BR(~b_1 -> ~chi_10 b )
     2.55496699E-01    2     1000023         5   # BR(~b_1 -> ~chi_20 b )
     4.86074053E-01    2    -1000024         6   # BR(~b_1 -> ~chi_1- t )
     3.05917514E-08    2     1000006       -24   # BR(~b_1 -> ~t_1    W-)
#
#         PDG            Width
DECAY   2000005     1.74754822E+02   # sbottom2 decays
#          BR         NDA      ID1       ID2
     2.42196723E-02    2     1000022         5   # BR(~b_2 -> ~chi_10 b )
     2.39727726E-02    2     1000023         5   # BR(~b_2 -> ~chi_20 b )
     4.35714142E-02    2     1000025         5   # BR(~b_2 -> ~chi_30 b )
     1.53350790E-03    2     1000035         5   # BR(~b_2 -> ~chi_40 b )
     2.73656149E-01    2    -1000024         6   # BR(~b_2 -> ~chi_1- t )
     8.79347300E-02    2    -1000037         6   # BR(~b_2 -> ~chi_2- t )
     2.24168569E-01    2     1000021         5   # BR(~b_2 -> ~g      b )
     1.03434367E-04    2     1000005        25   # BR(~b_2 -> ~b_1    h )
     9.13556240E-05    2     1000005        23   # BR(~b_2 -> ~b_1    Z )
     3.20748395E-01    2     1000006       -24   # BR(~b_2 -> ~t_1    W-)
#
#         PDG            Width
DECAY   1000002     5.41118767E-02   # sup_L decays
#          BR         NDA      ID1       ID2
     1.36529202E-01    2     1000022         2   # BR(~u_L -> ~chi_10 u)
     9.95795469E-02    2     1000023         2   # BR(~u_L -> ~chi_20 u)
     7.63891251E-01    2     1000024         1   # BR(~u_L -> ~chi_1+ d)
#
#         PDG            Width
DECAY   2000002     2.50024458E-03   # sup_R decays
#           BR         NDA      ID1       ID2
     2.25887044E-01    2     1000022         2   # BR(~u_R -> ~chi_10 u)
     4.78071394E-01    2     1000023         2   # BR(~u_R -> ~chi_20 u)
#           BR         NDA      ID1       ID2       ID3
     1.33594930E-03    3        2       -5        1000005   # BR(~u_R -> u  bb  ~b_1)
     6.30618306E-03    3        2       5        -1000005   # BR(~u_R -> u  b  ~b_1*)
     1.66079752E-02    3        2       -6        1000006   # BR(~u_R -> u  tb  ~t_1)
     9.34668561E-02    3        2       6        -1000006   # BR(~u_R -> u  t  ~t_1*)
     2.82148397E-02    3        2       -15        1000015   # BR(~u_R -> u  tau+  ~tau_1-)
     5.64944731E-03    3        2       15        -1000015   # BR(~u_R -> u  tau-  ~tau_1+)
     1.41634144E-08    3        2       -15        2000015   # BR(~u_R -> u  tau+  ~tau_2-)
     2.97594886E-08    3        2       15        -2000015   # BR(~u_R -> u  tau-  ~tau_2+)
     2.97690877E-02    3        2       -16        1000016   # BR(~u_R -> u  nu_taub  ~nu_tau1)
     6.00661237E-03    3        2       16        -1000016   # BR(~u_R -> u  nu_tau  ~nu_tau1*)
     2.14255039E-02    3        2       23        1000022   # BR(~u_R -> u  Z  ~chi_10)
     5.80703190E-03    3        2       25        1000022   # BR(~u_R -> u  h  ~chi_10)
     8.73114583E-03    3        2       23        1000023   # BR(~u_R -> u  Z  ~chi_20)
     1.81770217E-02    3        2       25        1000023   # BR(~u_R -> u  h  ~chi_20)
     9.39628076E-03    3        2       -24        1000024   # BR(~u_R -> u  W-  ~chi_1+)
     4.51475832E-02    3        2       24        -1000024   # BR(~u_R -> u  W+  ~chi_1-)
#
#         PDG            Width
DECAY   1000001     8.87184086E-03   # sdown_L decays
#          BR         NDA      ID1       ID2
     6.04571398E-01    2     1000022         1   # BR(~d_L -> ~chi_10 d)
     3.39346481E-01    2     1000023         1   # BR(~d_L -> ~chi_20 d)
     5.60821206E-02    2    -1000024         2   # BR(~d_L -> ~chi_1- u)
#
#         PDG            Width
DECAY   2000001     5.54021544E+01   # sdown_R decays
#          BR         NDA      ID1       ID2
     6.85008780E-06    2     1000022         1   # BR(~d_R -> ~chi_10 d)
     1.45182365E-05    2     1000023         1   # BR(~d_R -> ~chi_20 d)
     4.60294515E-09    2     1000025         1   # BR(~d_R -> ~chi_30 d)
     1.86476038E-02    2     1000035         1   # BR(~d_R -> ~chi_40 d)
     9.81331023E-01    2     1000021         1   # BR(~d_R -> ~g      d)
#
#         PDG            Width
DECAY   1000004     5.37288826E-02   # scharm_L decays
#          BR         NDA      ID1       ID2
     1.36530352E-01    2     1000022         4   # BR(~c_L -> ~chi_10 c)
     9.95786265E-02    2     1000023         4   # BR(~c_L -> ~chi_20 c)
     7.63891021E-01    2     1000024         3   # BR(~c_L -> ~chi_1+ s)
#
#         PDG            Width
DECAY   2000004     2.47294502E-03   # scharm_R decays
#           BR         NDA      ID1       ID2
     2.25160724E-01    2     1000022         4   # BR(~c_R -> ~chi_10 c)
     4.76525807E-01    2     1000023         4   # BR(~c_R -> ~chi_20 c)
#           BR         NDA      ID1       ID2       ID3
     1.36950073E-03    3        4       -5        1000005   # BR(~c_R -> c  bb  ~b_1)
     6.32322995E-03    3        4       5        -1000005   # BR(~c_R -> c  b  ~b_1*)
     1.67617960E-02    3        4       -6        1000006   # BR(~c_R -> c  tb  ~t_1)
     9.38678370E-02    3        4       6        -1000006   # BR(~c_R -> c  t  ~t_1*)
     2.83993374E-02    3        4       -15        1000015   # BR(~c_R -> c  tau+  ~tau_1-)
     5.61678480E-03    3        4       15        -1000015   # BR(~c_R -> c  tau-  ~tau_1+)
     1.43622279E-08    3        4       -15        2000015   # BR(~c_R -> c  tau+  ~tau_2-)
     2.97875608E-08    3        4       15        -2000015   # BR(~c_R -> c  tau-  ~tau_2+)
     2.98393209E-02    3        4       -16        1000016   # BR(~c_R -> c  nu_taub  ~nu_tau1)
     6.12912939E-03    3        4       16        -1000016   # BR(~c_R -> c  nu_tau  ~nu_tau1*)
     2.15989436E-02    3        4       23        1000022   # BR(~c_R -> c  Z  ~chi_10)
     5.94230761E-03    3        4       25        1000022   # BR(~c_R -> c  h  ~chi_10)
     8.83602338E-03    3        4       23        1000023   # BR(~c_R -> c  Z  ~chi_20)
     1.83275405E-02    3        4       25        1000023   # BR(~c_R -> c  h  ~chi_20)
     9.48181210E-03    3        4       -24        1000024   # BR(~c_R -> c  W-  ~chi_1+)
     4.58198622E-02    3        4       24        -1000024   # BR(~c_R -> c  W+  ~chi_1-)
#
#         PDG            Width
DECAY   1000003     8.80969848E-03   # sstrange_L decays
#          BR         NDA      ID1       ID2
     6.04575430E-01    2     1000022         3   # BR(~s_L -> ~chi_10 s)
     3.39342751E-01    2     1000023         3   # BR(~s_L -> ~chi_20 s)
     5.60818190E-02    2    -1000024         4   # BR(~s_L -> ~chi_1- c)
#
#         PDG            Width
DECAY   2000003     4.08178315E+01   # sstrange_R decays
#          BR         NDA      ID1       ID2
     9.75152842E-06    2     1000022         3   # BR(~s_R -> ~chi_10 s)
     2.06672804E-05    2     1000023         3   # BR(~s_R -> ~chi_20 s)
     6.48796355E-09    2     1000025         3   # BR(~s_R -> ~chi_30 s)
     2.62742813E-02    2     1000035         3   # BR(~s_R -> ~chi_40 s)
     9.73695293E-01    2     1000021         3   # BR(~s_R -> ~g      s)
#
#         PDG            Width
DECAY   1000011     2.87107023E+01   # selectron_L decays
#          BR         NDA      ID1       ID2
     8.72499173E-04    2     1000022        11   # BR(~e_L -> ~chi_10 e-)
     7.58247451E-04    2     1000023        11   # BR(~e_L -> ~chi_20 e-)
     3.00671960E-01    2     1000025        11   # BR(~e_L -> ~chi_30 e-)
     9.50010873E-02    2     1000035        11   # BR(~e_L -> ~chi_40 e-)
     4.45150499E-05    2    -1000024        12   # BR(~e_L -> ~chi_1- nu_e)
     6.02651691E-01    2    -1000037        12   # BR(~e_L -> ~chi_2- nu_e)
#
#         PDG            Width
DECAY   2000011     8.37536717E-01   # selectron_R decays
#           BR         NDA      ID1       ID2
     2.61656558E-03    2     1000022        11   # BR(~e_R -> ~chi_10 e-)
     5.54352442E-03    2     1000023        11   # BR(~e_R -> ~chi_20 e-)
     2.92703634E-07    2     1000025        11   # BR(~e_R -> ~chi_30 e-)
     9.91839617E-01    2     1000035        11   # BR(~e_R -> ~chi_40 e-)
#
#         PDG            Width
DECAY   1000013     2.87107022E+01   # smuon_L decays
#          BR         NDA      ID1       ID2
     8.72499172E-04    2     1000022        13   # BR(~mu_L -> ~chi_10 mu-)
     7.58247450E-04    2     1000023        13   # BR(~mu_L -> ~chi_20 mu-)
     3.00671960E-01    2     1000025        13   # BR(~mu_L -> ~chi_30 mu-)
     9.50010872E-02    2     1000035        13   # BR(~mu_L -> ~chi_40 mu-)
     4.45150499E-05    2    -1000024        14   # BR(~mu_L -> ~chi_1- nu_mu)
     6.02651691E-01    2    -1000037        14   # BR(~mu_L -> ~chi_2- nu_mu)
#
#         PDG            Width
DECAY   2000013     8.37536666E-01   # smuon_R decays
#           BR         NDA      ID1       ID2
     2.61656572E-03    2     1000022        13   # BR(~mu_R -> ~chi_10 mu-)
     5.54352472E-03    2     1000023        13   # BR(~mu_R -> ~chi_20 mu-)
     2.92703638E-07    2     1000025        13   # BR(~mu_R -> ~chi_30 mu-)
     9.91839617E-01    2     1000035        13   # BR(~mu_R -> ~chi_40 mu-)
#
#         PDG            Width
DECAY   1000015     1.77433262E-02   # stau_1 decays
#          BR         NDA      ID1       ID2
     5.36726382E-01    2     1000022        15   # BR(~tau_1 -> ~chi_10  tau-)
     4.62779441E-01    2     1000023        15   # BR(~tau_1 -> ~chi_20  tau-)
     4.94177186E-04    2    -1000024        16   # BR(~tau_1 -> ~chi_1-  nu_tau)
#
#         PDG            Width
DECAY   2000015     3.07036704E+00   # stau_2 decays
#          BR         NDA      ID1       ID2
     2.43997437E-01    2     1000022        15   # BR(~tau_2 -> ~chi_10  tau-)
     2.42162988E-01    2     1000023        15   # BR(~tau_2 -> ~chi_20  tau-)
     4.84822644E-01    2    -1000024        16   # BR(~tau_2 -> ~chi_1-  nu_tau)
     1.42566735E-02    2     1000016       -24   # BR(~tau_2 -> ~nu_tauL W-)
     7.53300831E-03    2     1000015        25   # BR(~tau_2 -> ~tau_1   h)
     7.22724922E-03    2     1000015        23   # BR(~tau_2 -> ~tau_1   Z)
#
#         PDG            Width
DECAY   1000012     2.87207336E+01   # snu_eL decays
#          BR         NDA      ID1       ID2
     3.26660531E-04    2     1000022        12   # BR(~nu_eL -> ~chi_10 nu_e)
     1.17750013E-04    2     1000023        12   # BR(~nu_eL -> ~chi_20 nu_e)
     3.00691643E-01    2     1000025        12   # BR(~nu_eL -> ~chi_30 nu_e)
     9.52312514E-02    2     1000035        12   # BR(~nu_eL -> ~chi_40 nu_e)
     3.70076730E-03    2     1000024        11   # BR(~nu_eL -> ~chi_1+ e-)
     5.99931928E-01    2     1000037        11   # BR(~nu_eL -> ~chi_2+ e-)
#
#         PDG            Width
DECAY   1000014     2.87207335E+01   # snu_muL decays
#          BR         NDA      ID1       ID2
     3.26660532E-04    2     1000022        14   # BR(~nu_muL -> ~chi_10 nu_mu)
     1.17750014E-04    2     1000023        14   # BR(~nu_muL -> ~chi_20 nu_mu)
     3.00691644E-01    2     1000025        14   # BR(~nu_muL -> ~chi_30 nu_mu)
     9.52312516E-02    2     1000035        14   # BR(~nu_muL -> ~chi_40 nu_mu)
     3.70076730E-03    2     1000024        13   # BR(~nu_muL -> ~chi_1+ mu-)
     5.99931927E-01    2     1000037        13   # BR(~nu_muL -> ~chi_2+ mu-)
#
#         PDG            Width
DECAY   1000016     9.85510226E-03   # snu_tauL decays
#          BR         NDA      ID1       ID2
     2.17679274E-03    2     1000022        16   # BR(~nu_tauL -> ~chi_10 nu_tau)
     6.48423898E-04    2     1000023        16   # BR(~nu_tauL -> ~chi_20 nu_tau)
     9.97174783E-01    2     1000024        15   # BR(~nu_tauL -> ~chi_1+ tau-)
#
#         PDG            Width
DECAY   1000024     6.34893566E-12   # chargino1+ decays
#           BR         NDA      ID1       ID2       ID3
     6.00001339E-01    3     1000022         2        -1   # BR(~chi_1+ -> ~chi_10 u    db)
     1.99999331E-01    3     1000022       -11        12   # BR(~chi_1+ -> ~chi_10 e+   nu_e)
     1.99999331E-01    3     1000022       -13        14   # BR(~chi_1+ -> ~chi_10 mu+  nu_mu)
#
#         PDG            Width
DECAY   1000037     3.86171735E+01   # chargino2+ decays
#          BR         NDA      ID1       ID2
     6.47408363E-02    2     1000002        -1   # BR(~chi_2+ -> ~u_L     db)
     6.43145000E-02    2    -1000001         2   # BR(~chi_2+ -> ~d_L*    u )
     6.47408006E-02    2     1000004        -3   # BR(~chi_2+ -> ~c_L     sb)
     6.43139248E-02    2    -1000003         4   # BR(~chi_2+ -> ~s_L*     c )
     2.91796785E-04    2     1000006        -5   # BR(~chi_2+ -> ~t_1     bb)
     1.32034629E-06    2    -1000005         6   # BR(~chi_2+ -> ~b_1*    t )
     1.86649140E-01    2     1000016       -15   # BR(~chi_2+ -> ~nu_tau1 tau+)
     1.86613626E-01    2    -1000015        16   # BR(~chi_2+ -> ~tau_1+  nu_tau)
     3.76391981E-06    2    -2000015        16   # BR(~chi_2+ -> ~tau_2+  nu_tau)
     9.26648756E-02    2     1000024        23   # BR(~chi_2+ -> ~chi_1+  Z )
     8.97743884E-02    2     1000022        24   # BR(~chi_2+ -> ~chi_10  W+)
     9.05920621E-02    2     1000023        24   # BR(~chi_2+ -> ~chi_20  W+)
     9.52989654E-02    2     1000024        25   # BR(~chi_2+ -> ~chi_1+  h )
#
#         PDG            Width
DECAY   1000022     0.00000000E+00   # neutralino1 decays
#
#         PDG            Width
DECAY   1000023     1.01898458E-10   # neutralino2 decays
#          BR         NDA      ID1       ID2
     2.40052781E-01    2     1000022        22   # BR(~chi_20 -> ~chi_10 gam)
#           BR         NDA      ID1       ID2       ID3
     1.25135661E-01    3     1000022        -2         2   # BR(~chi_20 -> ~chi_10 ub      u)
     1.62368913E-01    3     1000022        -1         1   # BR(~chi_20 -> ~chi_10 db      d)
     1.62368913E-01    3     1000022        -3         3   # BR(~chi_20 -> ~chi_10 sb      s)
     3.72623150E-02    3     1000022       -11        11   # BR(~chi_20 -> ~chi_10 e+      e-)
     3.72623150E-02    3     1000022       -13        13   # BR(~chi_20 -> ~chi_10 mu+     mu-)
     7.44973253E-02    3     1000022       -12        12   # BR(~chi_20 -> ~chi_10 nu_eb   nu_e)
     7.44973253E-02    3     1000022       -14        14   # BR(~chi_20 -> ~chi_10 nu_mub  nu_mu)
     7.45201387E-02    3     1000022       -16        16   # BR(~chi_20 -> ~chi_10 nu_taub nu_tau)
     3.61030035E-03    3     1000024        -2         1   # BR(~chi_20 -> ~chi_1+ ub      d)
     3.61030035E-03    3    -1000024        -1         2   # BR(~chi_20 -> ~chi_1- db      u)
     1.20342822E-03    3     1000024       -12        11   # BR(~chi_20 -> ~chi_1+ nu_eb   e-)
     1.20342822E-03    3    -1000024        12       -11   # BR(~chi_20 -> ~chi_1- nu_e    e+)
     1.20342822E-03    3     1000024       -14        13   # BR(~chi_20 -> ~chi_1+ nu_mub  mu-)
     1.20342822E-03    3    -1000024        14       -13   # BR(~chi_20 -> ~chi_1- nu_mu   mu+)
#
#         PDG            Width
DECAY   1000025     3.86079995E+01   # neutralino3 decays
#          BR         NDA      ID1       ID2
     3.61887370E-02    2     1000022        23   # BR(~chi_30 -> ~chi_10   Z )
     5.64193428E-02    2     1000023        23   # BR(~chi_30 -> ~chi_20   Z )
     9.04808420E-02    2     1000024       -24   # BR(~chi_30 -> ~chi_1+   W-)
     9.04808420E-02    2    -1000024        24   # BR(~chi_30 -> ~chi_1-   W+)
     5.77441735E-02    2     1000022        25   # BR(~chi_30 -> ~chi_10   h )
     3.70899111E-02    2     1000023        25   # BR(~chi_30 -> ~chi_20   h )
     3.24024685E-02    2     1000002        -2   # BR(~chi_30 -> ~u_L      ub)
     3.24024685E-02    2    -1000002         2   # BR(~chi_30 -> ~u_L*     u )
     9.57351500E-09    2     2000002        -2   # BR(~chi_30 -> ~u_R      ub)
     9.57351500E-09    2    -2000002         2   # BR(~chi_30 -> ~u_R*     u )
     3.20892511E-02    2     1000001        -1   # BR(~chi_30 -> ~d_L      db)
     3.20892511E-02    2    -1000001         1   # BR(~chi_30 -> ~d_L*     d )
     3.24021820E-02    2     1000004        -4   # BR(~chi_30 -> ~c_L      cb)
     3.24021820E-02    2    -1000004         4   # BR(~chi_30 -> ~c_L*     c )
     9.57348443E-09    2     2000004        -4   # BR(~chi_30 -> ~c_R      cb)
     9.57348443E-09    2    -2000004         4   # BR(~chi_30 -> ~c_R*     c )
     3.20892511E-02    2     1000003        -3   # BR(~chi_30 -> ~s _L      sb)
     3.20892511E-02    2    -1000003         3   # BR(~chi_30 -> ~s _L*     s )
     1.53804756E-04    2     1000006        -6   # BR(~chi_30 -> ~t_1      tb)
     1.53804756E-04    2    -1000006         6   # BR(~chi_30 -> ~t_1*     t )
     6.55710212E-07    2     1000005        -5   # BR(~chi_30 -> ~b_1      bb)
     6.55710212E-07    2    -1000005         5   # BR(~chi_30 -> ~b_1*     b )
     9.31077615E-02    2     1000015       -15   # BR(~chi_30 -> ~tau_1-   tau+)
     9.31077615E-02    2    -1000015        15   # BR(~chi_30 -> ~tau_1+   tau-)
     1.88561431E-06    2     2000015       -15   # BR(~chi_30 -> ~tau_2-   tau+)
     1.88561431E-06    2    -2000015        15   # BR(~chi_30 -> ~tau_2+   tau-)
     9.35507963E-02    2     1000016       -16   # BR(~chi_30 -> ~nu_tau1  nu_taub)
     9.35507963E-02    2    -1000016        16   # BR(~chi_30 -> ~nu_tau1* nu_tau )
#
#         PDG            Width
DECAY   1000035     2.96515984E+01   # neutralino4 decays
#          BR         NDA      ID1       ID2
     2.92342175E-02    2     1000022        23   # BR(~chi_40 -> ~chi_10   Z )
     1.40909435E-02    2     1000023        23   # BR(~chi_40 -> ~chi_20   Z )
     4.21675908E-02    2     1000024       -24   # BR(~chi_40 -> ~chi_1+   W-)
     4.21675908E-02    2    -1000024        24   # BR(~chi_40 -> ~chi_1-   W+)
     1.38090594E-02    2     1000022        25   # BR(~chi_40 -> ~chi_10   h )
     2.96161547E-02    2     1000023        25   # BR(~chi_40 -> ~chi_20   h )
     1.80630600E-03    2     1000002        -2   # BR(~chi_40 -> ~u_L      ub)
     1.80630600E-03    2    -1000002         2   # BR(~chi_40 -> ~u_L*     u )
     5.77367213E-02    2     2000002        -2   # BR(~chi_40 -> ~u_R      ub)
     5.77367213E-02    2    -2000002         2   # BR(~chi_40 -> ~u_R*     u )
     1.80906773E-03    2     1000001        -1   # BR(~chi_40 -> ~d_L      db)
     1.80906773E-03    2    -1000001         1   # BR(~chi_40 -> ~d_L*     d )
     1.80629339E-03    2     1000004        -4   # BR(~chi_40 -> ~c_L      cb)
     1.80629339E-03    2    -1000004         4   # BR(~chi_40 -> ~c_L*     c )
     5.77365647E-02    2     2000004        -4   # BR(~chi_40 -> ~c_R      cb)
     5.77365647E-02    2    -2000004         4   # BR(~chi_40 -> ~c_R*     c )
     1.80906773E-03    2     1000003        -3   # BR(~chi_40 -> ~s _L      sb)
     1.80906773E-03    2    -1000003         3   # BR(~chi_40 -> ~s _L*     s )
     1.38475138E-01    2     1000006        -6   # BR(~chi_40 -> ~t_1      tb)
     1.38475138E-01    2    -1000006         6   # BR(~chi_40 -> ~t_1*     t )
     2.46759772E-02    2     1000005        -5   # BR(~chi_40 -> ~b_1      bb)
     2.46759772E-02    2    -1000005         5   # BR(~chi_40 -> ~b_1*     b )
     4.02915127E-02    2     1000015       -15   # BR(~chi_40 -> ~tau_1-   tau+)
     4.02915127E-02    2    -1000015        15   # BR(~chi_40 -> ~tau_1+   tau-)
     4.77409027E-02    2     2000015       -15   # BR(~chi_40 -> ~tau_2-   tau+)
     4.77409027E-02    2    -2000015        15   # BR(~chi_40 -> ~tau_2+   tau-)
     4.05696698E-02    2     1000016       -16   # BR(~chi_40 -> ~nu_tau1  nu_taub)
     4.05696698E-02    2    -1000016        16   # BR(~chi_40 -> ~nu_tau1* nu_tau )
#
#         PDG            Width
DECAY        25     4.40584265E-03   # h decays
#          BR         NDA      ID1       ID2
     5.43223086E-01    2           5        -5   # BR(h -> b       bb     )
     6.04170759E-02    2         -15        15   # BR(h -> tau+    tau-   )
     2.13810737E-04    2         -13        13   # BR(h -> mu+     mu-    )
     2.32360980E-04    2           3        -3   # BR(h -> s       sb     )
     2.00511059E-02    2           4        -4   # BR(h -> c       cb     )
     7.73098963E-02    2          21        21   # BR(h -> g       g      )
     2.35205023E-03    2          22        22   # BR(h -> gam     gam    )
     1.82151636E-03    2          22        23   # BR(h -> Z       gam    )
     2.60498105E-01    2          24       -24   # BR(h -> W+      W-     )
     3.38809924E-02    2          23        23   # BR(h -> Z       Z      )
#
#         PDG            Width
DECAY        35     4.32097352E+01   # H decays
#          BR         NDA      ID1       ID2
     5.10133306E-01    2           5        -5   # BR(H -> b       bb     )
     1.02317096E-01    2         -15        15   # BR(H -> tau+    tau-   )
     3.41880394E-04    2         -13        13   # BR(H -> mu+     mu-    )
     2.21429684E-04    2           3        -3   # BR(H -> s       sb     )
     4.55257579E-08    2           4        -4   # BR(H -> c       cb     )
     4.47694699E-03    2           6        -6   # BR(H -> t       tb     )
     5.62756018E-06    2          21        21   # BR(H -> g       g      )
     5.80325626E-09    2          22        22   # BR(H -> gam     gam    )
     3.16816446E-09    2          23        22   # BR(H -> Z       gam    )
     2.29691099E-06    2          24       -24   # BR(H -> W+      W-     )
     1.14599878E-06    2          23        23   # BR(H -> Z       Z      )
     7.40115074E-06    2          25        25   # BR(H -> h       h      )
     2.03614739E-03    2     1000024  -1000024   # BR(H -> ~chi_1+ ~chi_1-)
     1.12235759E-01    2     1000024  -1000037   # BR(H -> ~chi_1+ ~chi_2-)
     1.12235759E-01    2     1000037  -1000024   # BR(H -> ~chi_2+ ~chi_1-)
     2.00832371E-04    2     1000022   1000022   # BR(H -> ~chi_10 ~chi_10)
     6.45494150E-05    2     1000023   1000023   # BR(H -> ~chi_20 ~chi_20)
     9.57568781E-06    2     1000022   1000023   # BR(H -> ~chi_10 ~chi_20)
     5.06482055E-02    2     1000022   1000025   # BR(H -> ~chi_10 ~chi_30)
     2.00635684E-02    2     1000022   1000035   # BR(H -> ~chi_10 ~chi_40)
     6.18667872E-02    2     1000023   1000025   # BR(H -> ~chi_20 ~chi_30)
     1.15553631E-02    2     1000023   1000035   # BR(H -> ~chi_20 ~chi_40)
     1.32677461E-07    2     2000002  -2000002   # BR(H -> ~u_R    ~u_R*  )
     1.32677461E-07    2     2000004  -2000004   # BR(H -> ~c_R    ~c_R*  )
     1.31812876E-04    2     1000006  -1000006   # BR(H -> ~t_1    ~t_1*  )
     4.80573065E-07    2     1000005  -1000005   # BR(H -> ~b_1    ~b_1*  )
     4.81192321E-07    2     1000015  -1000015   # BR(H -> ~tau_1- ~tau_1+)
     7.75880545E-07    2     2000015  -2000015   # BR(H -> ~tau_2- ~tau_2+)
     5.72071088E-03    2     1000015  -2000015   # BR(H -> ~tau_1- ~tau_2+)
     5.72071088E-03    2     2000015  -1000015   # BR(H -> ~tau_2- ~tau_1+)
     1.03018367E-06    2     1000016  -1000016   # BR(H -> ~nu_tauL ~nu_tauL*)
#
#         PDG            Width
DECAY        36     4.32063679E+01   # A decays
#          BR         NDA      ID1       ID2
     5.10198784E-01    2           5        -5   # BR(A -> b       bb     )
     1.02325619E-01    2         -15        15   # BR(A -> tau+    tau-   )
     3.41908496E-04    2         -13        13   # BR(A -> mu+     mu-    )
     2.21472053E-04    2           3        -3   # BR(A -> s       sb     )
     4.57131561E-08    2           4        -4   # BR(A -> c       cb     )
     4.49059629E-03    2           6        -6   # BR(A -> t       tb     )
     2.52535525E-05    2          21        21   # BR(A -> g       g      )
     4.44711651E-09    2          22        22   # BR(A -> gam     gam    )
     2.07773926E-08    2          23        22   # BR(A -> Z       gam    )
     2.32722824E-06    2          23        25   # BR(A -> Z       h      )
     2.07180220E-03    2     1000024  -1000024   # BR(A -> ~chi_1+ ~chi_1-)
     1.12229106E-01    2     1000024  -1000037   # BR(A -> ~chi_1+ ~chi_2-)
     1.12229106E-01    2     1000037  -1000024   # BR(A -> ~chi_2+ ~chi_1-)
     1.77664501E-04    2     1000022   1000022   # BR(A -> ~chi_10 ~chi_10)
     7.82979347E-05    2     1000023   1000023   # BR(A -> ~chi_20 ~chi_20)
     1.82021419E-05    2     1000022   1000023   # BR(A -> ~chi_10 ~chi_20)
     6.24114190E-02    2     1000022   1000025   # BR(A -> ~chi_10 ~chi_30)
     1.16931499E-02    2     1000022   1000035   # BR(A -> ~chi_10 ~chi_40)
     5.01142697E-02    2     1000023   1000025   # BR(A -> ~chi_20 ~chi_30)
     1.99275886E-02    2     1000023   1000035   # BR(A -> ~chi_20 ~chi_40)
     5.72168082E-03    2     1000015  -2000015   # BR(A -> ~tau_1- ~tau_2+)
     5.72168082E-03    2    -1000015   2000015   # BR(A -> ~tau_1+ ~tau_2-)
#
#         PDG            Width
DECAY        37     4.35103997E+01   # H+ decays
#          BR         NDA      ID1       ID2
     8.58599191E-04    2           4        -5   # BR(H+ -> c       bb     )
     1.01655672E-01    2         -15        16   # BR(H+ -> tau+    nu_tau )
     3.39669952E-04    2         -13        14   # BR(H+ -> mu+     nu_mu  )
     8.58598171E-06    2           2        -5   # BR(H+ -> u       bb     )
     1.10028448E-05    2           2        -3   # BR(H+ -> u       sb     )
     2.16612926E-04    2           4        -3   # BR(H+ -> c       sb     )
     5.14477400E-01    2           6        -5   # BR(H+ -> t       bb     )
     2.31541194E-06    2          24        25   # BR(H+ -> W+      h      )
     1.46484584E-13    2          24        36   # BR(H+ -> W+      A      )
     3.30287032E-04    2     1000024   1000022   # BR(H+ -> ~chi_1+ ~chi_10)
     5.55069216E-04    2     1000024   1000023   # BR(H+ -> ~chi_1+ ~chi_20)
     1.11800919E-01    2     1000024   1000025   # BR(H+ -> ~chi_1+ ~chi_30)
     3.13314611E-02    2     1000024   1000035   # BR(H+ -> ~chi_1+ ~chi_40)
     1.12647577E-01    2     1000037   1000022   # BR(H+ -> ~chi_2+ ~chi_10)
     1.11425777E-01    2     1000037   1000023   # BR(H+ -> ~chi_2+ ~chi_20)
     5.03999866E-08    2    -1000015   1000016   # BR(H+ -> ~tau_1+ ~nu_tauL)
     1.13750255E-02    2    -2000015   1000016   # BR(H+ -> ~tau_2+ ~nu_tauL)
     2.96397504E-03    2     1000006  -1000005   # BR(H+ -> ~t_1    ~b_1*  )
