#
#                              ======================
#                              | THE SUSYHIT OUTPUT |
#                              ======================
#
#
#              ------------------------------------------------------
#              |     This is the output of the SUSY-HIT package     |
#              |  created by A.Djouadi, M.Muehlleitner and M.Spira. |
#              |  In case of problems with SUSY-HIT email to        |
#              |           margarete.muehlleitner@cern.ch           |
#              |           michael.spira@psi.ch                     |
#              |           abdelhak.djouadi@cern.ch                 |
#              ------------------------------------------------------
#
#              ------------------------------------------------------
#              |  SUSY Les Houches Accord - MSSM Spectrum + Decays  |
#              |              based on the decay programs           |
#              |                                                    |
#              |                     SDECAY 1.3b                    |
#              |                                                    |
#              |  Authors: M.Muhlleitner, A.Djouadi and Y.Mambrini  |
#              |  Ref.:    Comput.Phys.Commun.168(2005)46           |
#              |           [hep-ph/0311167]                         |
#              |                                                    |
#              |                     HDECAY 3.4                     |
#              |                                                    |
#              |  By: A.Djouadi,J.Kalinowski,M.Muhlleitner,M.Spira  |
#              |  Ref.:    Comput.Phys.Commun.108(1998)56           |
#              |           [hep-ph/9704448]                         |
#              |                                                    |
#              |                                                    |
#              |  If not stated otherwise all DRbar couplings and   |
#              |  soft SUSY breaking masses are given at the scale  |
#              |  Q=  0.29234590E+04
#              |                                                    |
#              ------------------------------------------------------
#
#
BLOCK DCINFO  # Decay Program information
     1   SDECAY/HDECAY # decay calculator
     2   1.3b  /3.4    # version number
#
BLOCK SPINFO  # Spectrum calculator information
     1     SOFTSUSY    # spectrum calculator               
     2     3.4.0       # version number                    
#
BLOCK MODSEL  # Model selection
     1     0   #  nonUniversal                                     
#
BLOCK SMINPUTS  # Standard Model inputs
         1     1.27908970E+02   # alpha_em^-1(M_Z)^MSbar
         2     1.16637870E-05   # G_F [GeV^-2]
         3     1.18400000E-01   # alpha_S(M_Z)^MSbar
         4     9.11876000E+01   # M_Z pole mass
         5     4.18000000E+00   # mb(mb)^MSbar
         6     1.73200000E+02   # mt pole mass
         7     1.77700000E+00   # mtau pole mass
#
BLOCK MINPAR  # Input parameters - minimal models
         3     7.36000000E+00   # tanb                
#
BLOCK EXTPAR  # Input parameters - non-minimal models
         0    -1.00000000E+00   # Set                 
         1    -1.15852000E+03   # M_1(MX)             
         2     3.24987000E+03   # M_2(MX)             
         3     9.70440000E+02   # M_3(MX)             
        11    -4.87337000E+03   # At(MX)              
        12     1.74153000E+03   # Ab(MX)              
        13     8.51990000E+02   # Atau(MX)            
        23    -3.96750000E+02   # mu(MX)              
        26     3.13774000E+03   # mA(pole)            
        31     3.74384000E+03   # meL(MX)             
        32     3.74384000E+03   # mmuL(MX)            
        33     3.29145000E+03   # mtauL(MX)           
        34     1.31638000E+03   # meR(MX)             
        35     1.31638000E+03   # mmuR(MX)            
        36     2.16968000E+03   # mtauR(MX)           
        41     3.49179000E+03   # mqL1(MX)            
        42     3.49179000E+03   # mqL2(MX)            
        43     2.60409000E+03   # mqL3(MX)            
        44     3.25737000E+03   # muR(MX)             
        45     3.25737000E+03   # mcR(MX)             
        46     3.28530000E+03   # mtR(MX)             
        47     3.35338000E+03   # mdR(MX)             
        48     3.35338000E+03   # msR(MX)             
        49     2.52524000E+03   # mbR(MX)             
#
BLOCK MASS  # Mass Spectrum
# PDG code           mass       particle
        24     8.03992117E+01   # W+
        25     1.26632460E+02   # h
        35     3.13788689E+03   # H
        36     3.13773973E+03   # A
        37     3.13916676E+03   # H+
         5     4.81876030E+00   # b-quark pole mass calculated from mb(mb)_Msbar
   1000001     3.54664684E+03   # ~d_L
   2000001     3.38852912E+03   # ~d_R
   1000002     3.54592567E+03   # ~u_L
   2000002     3.29102188E+03   # ~u_R
   1000003     3.54664684E+03   # ~s_L
   2000003     3.38852912E+03   # ~s_R
   1000004     3.54592567E+03   # ~c_L
   2000004     3.29102188E+03   # ~c_R
   1000005     2.55822389E+03   # ~b_1
   2000005     2.62066080E+03   # ~b_2
   1000006     2.59834849E+03   # ~t_1
   2000006     3.23194913E+03   # ~t_2
   1000011     3.76201562E+03   # ~e_L
   2000011     1.32829895E+03   # ~e_R
   1000012     3.76088814E+03   # ~nu_eL
   1000013     3.76201562E+03   # ~mu_L
   2000013     1.32829895E+03   # ~mu_R
   1000014     3.76088814E+03   # ~nu_muL
   1000015     2.17638879E+03   # ~tau_1
   2000015     3.31271007E+03   # ~tau_2
   1000016     3.31147465E+03   # ~nu_tauL
   1000021     1.18130251E+03   # ~g
   1000022    -4.15095414E+02   # ~chi_10
   1000023     4.15125784E+02   # ~chi_20
   1000025    -1.15002786E+03   # ~chi_30
   1000035     3.27069374E+03   # ~chi_40
   1000024     4.16196597E+02   # ~chi_1+
   1000037     3.27085805E+03   # ~chi_2+
#
BLOCK NMIX  # Neutralino Mixing Matrix
  1  1     4.76094023E-02   # N_11
  1  2     1.70949008E-02   # N_12
  1  3    -7.06488375E-01   # N_13
  1  4     7.05914503E-01   # N_14
  2  1     1.68111323E-02   # N_21
  2  2     1.65362398E-02   # N_22
  2  3     7.07389586E-01   # N_23
  2  4     7.06430401E-01   # N_24
  3  1     9.98724523E-01   # N_31
  3  2    -8.54296365E-04   # N_32
  3  3     2.17713333E-02   # N_33
  3  4    -4.55478383E-02   # N_34
  4  1    -2.38731816E-04   # N_41
  4  2     9.99716754E-01   # N_42
  4  3     3.98496897E-04   # N_43
  4  4    -2.37948921E-02   # N_44
#
BLOCK UMIX  # Chargino Mixing Matrix U
  1  1    -5.59304256E-04   # U_11
  1  2     9.99999844E-01   # U_12
  2  1    -9.99999844E-01   # U_21
  2  2    -5.59304256E-04   # U_22
#
BLOCK VMIX  # Chargino Mixing Matrix V
  1  1     3.36578263E-02   # V_11
  1  2    -9.99433415E-01   # V_12
  2  1    -9.99433415E-01   # V_21
  2  2    -3.36578263E-02   # V_22
#
BLOCK STOPMIX  # Stop Mixing Matrix
  1  1     9.82297128E-01   # cos(theta_t)
  1  2     1.87329529E-01   # sin(theta_t)
  2  1    -1.87329529E-01   # -sin(theta_t)
  2  2     9.82297128E-01   # cos(theta_t)
#
BLOCK SBOTMIX  # Sbottom Mixing Matrix
  1  1    -3.28511776E-02   # cos(theta_b)
  1  2     9.99460254E-01   # sin(theta_b)
  2  1    -9.99460254E-01   # -sin(theta_b)
  2  2    -3.28511776E-02   # cos(theta_b)
#
BLOCK STAUMIX  # Stau Mixing Matrix
  1  1    -1.03849764E-03   # cos(theta_tau)
  1  2     9.99999461E-01   # sin(theta_tau)
  2  1    -9.99999461E-01   # -sin(theta_tau)
  2  2    -1.03849764E-03   # cos(theta_tau)
#
BLOCK ALPHA  # Higgs mixing
          -1.42073430E-01   # Mixing angle in the neutral Higgs boson sector
#
BLOCK HMIX Q=  2.92345900E+03  # DRbar Higgs Parameters
         1    -4.02517936E+02   # mu(Q)MSSM           
         2     7.00827854E+00   # tan                 
         3     2.42431976E+02   # higgs               
         4     9.67896950E+06   # mA^2(Q)MSSM         
#
BLOCK GAUGE Q=  2.92345900E+03  # The gauge couplings
     1     3.65059270E-01   # gprime(Q) DRbar
     2     6.36287083E-01   # g(Q) DRbar
     3     1.02567714E+00   # g3(Q) DRbar
#
BLOCK AU Q=  2.92345900E+03  # The trilinear couplings
  1  1     0.00000000E+00   # A_u(Q) DRbar
  2  2     0.00000000E+00   # A_c(Q) DRbar
  3  3    -4.87336999E+03   # A_t(Q) DRbar
#
BLOCK AD Q=  2.92345900E+03  # The trilinear couplings
  1  1     0.00000000E+00   # A_d(Q) DRbar
  2  2     0.00000000E+00   # A_s(Q) DRbar
  3  3     1.74153000E+03   # A_b(Q) DRbar
#
BLOCK AE Q=  2.92345900E+03  # The trilinear couplings
  1  1     0.00000000E+00   # A_e(Q) DRbar
  2  2     0.00000000E+00   # A_mu(Q) DRbar
  3  3     8.51990000E+02   # A_tau(Q) DRbar
#
BLOCK Yu Q=  2.92345900E+03  # The Yukawa couplings
  1  1     0.00000000E+00   # y_u(Q) DRbar
  2  2     0.00000000E+00   # y_c(Q) DRbar
  3  3     8.30036082E-01   # y_t(Q) DRbar
#
BLOCK Yd Q=  2.92345900E+03  # The Yukawa couplings
  1  1     0.00000000E+00   # y_d(Q) DRbar
  2  2     0.00000000E+00   # y_s(Q) DRbar
  3  3     9.51407466E-02   # y_b(Q) DRbar
#
BLOCK Ye Q=  2.92345900E+03  # The Yukawa couplings
  1  1     0.00000000E+00   # y_e(Q) DRbar
  2  2     0.00000000E+00   # y_mu(Q) DRbar
  3  3     7.22314609E-02   # y_tau(Q) DRbar
#
BLOCK MSOFT Q=  2.92345900E+03  # The soft SUSY breaking masses at the scale Q
         1    -1.15852000E+03   # M_1(Q)              
         2     3.24987000E+03   # M_2(Q)              
         3     9.70440000E+02   # M_3(Q)              
        21     9.36156282E+06   # mH1^2(Q)            
        22     1.56946647E+05   # mH2^2(Q)            
        31     3.74384000E+03   # meL(Q)              
        32     3.74384000E+03   # mmuL(Q)             
        33     3.29145000E+03   # mtauL(Q)            
        34     1.31638000E+03   # meR(Q)              
        35     1.31638000E+03   # mmuR(Q)             
        36     2.16968000E+03   # mtauR(Q)            
        41     3.49179000E+03   # mqL1(Q)             
        42     3.49179000E+03   # mqL2(Q)             
        43     2.60408999E+03   # mqL3(Q)             
        44     3.25737000E+03   # muR(Q)              
        45     3.25737000E+03   # mcR(Q)              
        46     3.28529999E+03   # mtR(Q)              
        47     3.35338000E+03   # mdR(Q)              
        48     3.35338000E+03   # msR(Q)              
        49     2.52524000E+03   # mbR(Q)              
#
Block HiggsBoundsInputHiggsCouplingsFermions
# ScalarNormEffCoupSq PseudoSNormEffCoupSq NP   IP1 IP2 IP2
    1.00479584E+00    0.00000000E+00        3  25   5   5  # h0-b-b eff. coupling^2, normalised to SM
    4.91111723E+01    0.00000000E+00        3  35   5   5  # H0-b-b eff. coupling^2, normalised to SM
    0.00000000E+00    4.91159681E+01        3  36   5   5  # A0-b-b eff. coupling^2, normalised to SM
#
    9.99902357E-01    0.00000000E+00        3  25   6   6  # h0-t-t eff. coupling^2, normalised to SM
    2.04576206E-02    0.00000000E+00        3  35   6   6  # H0-t-t eff. coupling^2, normalised to SM
    0.00000000E+00    2.03599774E-02        3  36   6   6  # A0-t-t eff. coupling^2, normalised to SM
#
    1.00479584E+00    0.00000000E+00        3  25  15  15  # h0-tau-tau eff. coupling^2, normalised to SM
    4.91111723E+01    0.00000000E+00        3  35  15  15  # H0-tau-tau eff. coupling^2, normalised to SM
    0.00000000E+00    4.91159681E+01        3  36  15  15  # A0-tau-tau eff. coupling^2, normalised to SM
#
Block HiggsBoundsInputHiggsCouplingsBosons
    9.99999883E-01        3  25  24  24  # h0-W-W eff. coupling^2, normalised to SM
    1.16796148E-07        3  35  24  24  # H0-W-W eff. coupling^2, normalised to SM
    0.00000000E+00        3  36  24  24  # A0-W-W eff. coupling^2, normalised to SM
#
    9.99999883E-01        3  25  23  23  # h0-Z-Z eff. coupling^2, normalised to SM
    1.16796148E-07        3  35  23  23  # H0-Z-Z eff. coupling^2, normalised to SM
    0.00000000E+00        3  36  23  23  # A0-Z-Z eff. coupling^2, normalised to SM
#
    8.85481478E-01        3  25  21  21  # h0-g-g eff. coupling^2, normalised to SM
    1.28384594E-12        3  35  21  21  # H0-g-g eff. coupling^2, normalised to SM
    4.42711662E-12        3  36  21  21  # A0-g-g eff. coupling^2, normalised to SM
#
    0.00000000E+00        3  25  25  23  # h0-h0-Z eff. coupling^2, normalised to SM
    0.00000000E+00        3  35  25  23  # H0-h0-Z eff. coupling^2, normalised to SM
    1.16796148E-07        3  36  25  23  # A0-h0-Z eff. coupling^2, normalised to SM
    0.00000000E+00        3  35  35  23  # H0-H0-Z eff. coupling^2, normalised to SM
    9.99999883E-01        3  36  35  23  # A0-H0-Z eff. coupling^2, normalised to SM
    0.00000000E+00        3  36  36  23  # A0-A0-Z eff. coupling^2, normalised to SM
#
    0.00000000E+00        4  25  21  21  23  # h0-g-g-Z eff. coupling^2, normalised to SM
    0.00000000E+00        4  35  21  21  23  # H0-g-g-Z eff. coupling^2, normalised to SM
    0.00000000E+00        4  36  21  21  23  # A0-g-g-Z eff. coupling^2, normalised to SM
#
#
#
#                             =================
#                             |The decay table|
#                             =================
#
# - The QCD corrections to the decays gluino -> squark  + quark
#                                     squark -> gaugino + quark_prime
#                                     squark -> squark_prime + Higgs
#                                     squark -> gluino  + quark
#   are included.
#
# - The multi-body decays for the inos, stops and sbottoms are included.
#
# - The loop induced decays for the gluino, neutralinos and stops
#   are included.
#
# - The SUSY decays of the top quark are included.
#
#
#         PDG            Width
DECAY         6     1.42544930E+00   # top decays
#          BR         NDA      ID1       ID2
     1.00000000E+00    2           5        24   # BR(t ->  b    W+)
#
#         PDG            Width
DECAY   1000021     5.19783740E-04   # gluino decays
#          BR         NDA      ID1       ID2
     2.56430844E-02    2     1000022        21   # BR(~g -> ~chi_10 g)
     2.80350137E-02    2     1000023        21   # BR(~g -> ~chi_20 g)
     1.46537761E-07    2     1000025        21   # BR(~g -> ~chi_30 g)
#           BR         NDA      ID1       ID2       ID3
     8.19195709E-06    3     1000022         1        -1   # BR(~g -> ~chi_10 d  db)
     9.11166335E-06    3     1000023         1        -1   # BR(~g -> ~chi_20 d  db)
     1.35842146E-09    3     1000025         1        -1   # BR(~g -> ~chi_30 d  db)
     4.41277354E-05    3     1000022         2        -2   # BR(~g -> ~chi_10 u  ub)
     2.47285210E-05    3     1000023         2        -2   # BR(~g -> ~chi_20 u  ub)
     5.37680550E-09    3     1000025         2        -2   # BR(~g -> ~chi_30 u  ub)
     8.19195709E-06    3     1000022         3        -3   # BR(~g -> ~chi_10 s  sb)
     9.11166335E-06    3     1000023         3        -3   # BR(~g -> ~chi_20 s  sb)
     1.35842146E-09    3     1000025         3        -3   # BR(~g -> ~chi_30 s  sb)
     4.41277354E-05    3     1000022         4        -4   # BR(~g -> ~chi_10 c  cb)
     2.47285210E-05    3     1000023         4        -4   # BR(~g -> ~chi_20 c  cb)
     5.37680550E-09    3     1000025         4        -4   # BR(~g -> ~chi_30 c  cb)
     7.61239296E-03    3     1000022         5        -5   # BR(~g -> ~chi_10 b  bb)
     7.63719836E-03    3     1000023         5        -5   # BR(~g -> ~chi_20 b  bb)
     4.52393470E-09    3     1000025         5        -5   # BR(~g -> ~chi_30 b  bb)
     1.69071057E-01    3     1000022         6        -6   # BR(~g -> ~chi_10 t  tb)
     2.06550490E-01    3     1000023         6        -6   # BR(~g -> ~chi_20 t  tb)
     3.20801243E-05    3     1000024         1        -2   # BR(~g -> ~chi_1+ d  ub)
     3.20801243E-05    3    -1000024         2        -1   # BR(~g -> ~chi_1- u  db)
     3.20801243E-05    3     1000024         3        -4   # BR(~g -> ~chi_1+ s  cb)
     3.20801243E-05    3    -1000024         4        -3   # BR(~g -> ~chi_1- c  sb)
     2.77574979E-01    3     1000024         5        -6   # BR(~g -> ~chi_1+ b  tb)
     2.77574979E-01    3    -1000024         6        -5   # BR(~g -> ~chi_1- t  bb)
#
#         PDG            Width
DECAY   1000006     1.28389166E+02   # stop1 decays
#          BR         NDA      ID1       ID2
     1.30871449E-01    2     1000022         6   # BR(~t_1 -> ~chi_10 t )
     1.29375319E-01    2     1000023         6   # BR(~t_1 -> ~chi_20 t )
     3.87124788E-03    2     1000025         6   # BR(~t_1 -> ~chi_30 t )
     1.52450631E-02    2     1000024         5   # BR(~t_1 -> ~chi_1+ b )
     7.20636921E-01    2     1000021         6   # BR(~t_1 -> ~g      t )
#
#         PDG            Width
DECAY   2000006     2.80140223E+02   # stop2 decays
#          BR         NDA      ID1       ID2
     7.55982125E-02    2     1000022         6   # BR(~t_2 -> ~chi_10 t )
     7.61498547E-02    2     1000023         6   # BR(~t_2 -> ~chi_20 t )
     1.97472047E-02    2     1000025         6   # BR(~t_2 -> ~chi_30 t )
     1.46014284E-01    2     1000024         5   # BR(~t_2 -> ~chi_1+ b )
     4.71635848E-01    2     1000021         6   # BR(~t_2 -> ~g      t )
     5.14466530E-02    2     1000006        25   # BR(~t_2 -> ~t_1    h )
     5.62780836E-02    2     1000006        23   # BR(~t_2 -> ~t_1    Z )
     1.44911139E-04    2     1000005        24   # BR(~t_2 -> ~b_1    W+)
     1.02984948E-01    2     2000005        24   # BR(~t_2 -> ~b_2    W+)
#
#         PDG            Width
DECAY   1000005     9.02253884E+01   # sbottom1 decays
#          BR         NDA      ID1       ID2
     2.46229728E-03    2     1000022         5   # BR(~b_1 -> ~chi_10 b )
     2.43398277E-03    2     1000023         5   # BR(~b_1 -> ~chi_20 b )
     1.05886002E-02    2     1000025         5   # BR(~b_1 -> ~chi_30 b )
     5.11698651E-03    2    -1000024         6   # BR(~b_1 -> ~chi_1- t )
     9.79398133E-01    2     1000021         5   # BR(~b_1 -> ~g      b )
#
#         PDG            Width
DECAY   2000005     1.27328691E+02   # sbottom2 decays
#          BR         NDA      ID1       ID2
     1.75560204E-03    2     1000022         5   # BR(~b_2 -> ~chi_10 b )
     1.77149774E-03    2     1000023         5   # BR(~b_2 -> ~chi_20 b )
     2.00661290E-03    2     1000025         5   # BR(~b_2 -> ~chi_30 b )
     2.65059351E-01    2    -1000024         6   # BR(~b_2 -> ~chi_1- t )
     7.29406937E-01    2     1000021         5   # BR(~b_2 -> ~g      b )
#
#         PDG            Width
DECAY   1000002     1.95439905E+02   # sup_L decays
#          BR         NDA      ID1       ID2
     4.72847396E-05    2     1000022         2   # BR(~u_L -> ~chi_10 u)
     2.68725615E-05    2     1000023         2   # BR(~u_L -> ~chi_20 u)
     2.05113636E-03    2     1000025         2   # BR(~u_L -> ~chi_30 u)
     1.64656054E-03    2     1000035         2   # BR(~u_L -> ~chi_40 u)
     1.56048349E-04    2     1000024         1   # BR(~u_L -> ~chi_1+ d)
     3.28785684E-03    2     1000037         1   # BR(~u_L -> ~chi_2+ d)
     9.92784241E-01    2     1000021         2   # BR(~u_L -> ~g      u)
#
#         PDG            Width
DECAY   2000002     1.78717984E+02   # sup_R decays
#          BR         NDA      ID1       ID2
     9.22753992E-05    2     1000022         2   # BR(~u_R -> ~chi_10 u)
     1.15051524E-05    2     1000023         2   # BR(~u_R -> ~chi_20 u)
     3.23418068E-02    2     1000025         2   # BR(~u_R -> ~chi_30 u)
     4.23712400E-13    2     1000035         2   # BR(~u_R -> ~chi_40 u)
     9.67554413E-01    2     1000021         2   # BR(~u_R -> ~g      u)
#
#         PDG            Width
DECAY   1000001     1.95470076E+02   # sdown_L decays
#          BR         NDA      ID1       ID2
     4.39770273E-06    2     1000022         1   # BR(~d_L -> ~chi_10 d)
     1.22245343E-05    2     1000023         1   # BR(~d_L -> ~chi_20 d)
     2.08846696E-03    2     1000025         1   # BR(~d_L -> ~chi_30 d)
     1.65444002E-03    2     1000035         1   # BR(~d_L -> ~chi_40 d)
     4.30933304E-08    2    -1000024         2   # BR(~d_L -> ~chi_1- u)
     3.30674223E-03    2    -1000037         2   # BR(~d_L -> ~chi_2- u)
     9.92933685E-01    2     1000021         1   # BR(~d_L -> ~g      d)
#
#         PDG            Width
DECAY   2000001     1.82558838E+02   # sdown_R decays
#          BR         NDA      ID1       ID2
     2.33001315E-05    2     1000022         1   # BR(~d_R -> ~chi_10 d)
     2.90512572E-06    2     1000023         1   # BR(~d_R -> ~chi_20 d)
     8.27974812E-03    2     1000025         1   # BR(~d_R -> ~chi_30 d)
     3.04457576E-12    2     1000035         1   # BR(~d_R -> ~chi_40 d)
     9.91694047E-01    2     1000021         1   # BR(~d_R -> ~g      d)
#
#         PDG            Width
DECAY   1000004     1.57823307E+02   # scharm_L decays
#          BR         NDA      ID1       ID2
     6.04199073E-05    2     1000022         4   # BR(~c_L -> ~chi_10 c)
     3.43374546E-05    2     1000023         4   # BR(~c_L -> ~chi_20 c)
     2.61942555E-03    2     1000025         4   # BR(~c_L -> ~chi_30 c)
     2.01320683E-03    2     1000035         4   # BR(~c_L -> ~chi_40 c)
     1.99396573E-04    2     1000024         3   # BR(~c_L -> ~chi_1+ s)
     4.01995822E-03    2     1000037         3   # BR(~c_L -> ~chi_2+ s)
     9.91053255E-01    2     1000021         4   # BR(~c_L -> ~g      c)
#
#         PDG            Width
DECAY   2000004     1.45375225E+02   # scharm_R decays
#          BR         NDA      ID1       ID2
     1.17111866E-04    2     1000022         4   # BR(~c_R -> ~chi_10 c)
     1.46018311E-05    2     1000023         4   # BR(~c_R -> ~chi_20 c)
     4.10123954E-02    2     1000025         4   # BR(~c_R -> ~chi_30 c)
     4.59751271E-13    2     1000035         4   # BR(~c_R -> ~chi_40 c)
     9.58855891E-01    2     1000021         4   # BR(~c_R -> ~g      c)
#
#         PDG            Width
DECAY   1000003     1.57841002E+02   # sstrange_L decays
#          BR         NDA      ID1       ID2
     5.61956763E-06    2     1000022         3   # BR(~s_L -> ~chi_10 s)
     1.56210181E-05    2     1000023         3   # BR(~s_L -> ~chi_20 s)
     2.66721132E-03    2     1000025         3   # BR(~s_L -> ~chi_30 s)
     2.02314421E-03    2     1000035         3   # BR(~s_L -> ~chi_40 s)
     5.50663496E-08    2    -1000024         4   # BR(~s_L -> ~chi_1- c)
     4.04351790E-03    2    -1000037         4   # BR(~s_L -> ~chi_2- c)
     9.91244831E-01    2     1000021         3   # BR(~s_L -> ~g      s)
#
#         PDG            Width
DECAY   2000003     1.47506133E+02   # sstrange_R decays
#          BR         NDA      ID1       ID2
     2.97644531E-05    2     1000022         3   # BR(~s_R -> ~chi_10 s)
     3.71111526E-06    2     1000023         3   # BR(~s_R -> ~chi_20 s)
     1.05692056E-02    2     1000025         3   # BR(~s_R -> ~chi_30 s)
     3.60263085E-12    2     1000035         3   # BR(~s_R -> ~chi_40 s)
     9.89397319E-01    2     1000021         3   # BR(~s_R -> ~g      s)
#
#         PDG            Width
DECAY   1000011     6.82256726E+00   # selectron_L decays
#          BR         NDA      ID1       ID2
     4.27367339E-03    2     1000022        11   # BR(~e_L -> ~chi_10 e-)
     1.48532691E-03    2     1000023        11   # BR(~e_L -> ~chi_20 e-)
     5.97419579E-01    2     1000025        11   # BR(~e_L -> ~chi_30 e-)
     1.32254127E-01    2     1000035        11   # BR(~e_L -> ~chi_40 e-)
     1.35552920E-06    2    -1000024        12   # BR(~e_L -> ~chi_1- nu_e)
     2.64565939E-01    2    -1000037        12   # BR(~e_L -> ~chi_2- nu_e)
#
#         PDG            Width
DECAY   2000011     4.55144015E-01   # selectron_R decays
#           BR         NDA      ID1       ID2
     2.85602813E-02    2     1000022        11   # BR(~e_R -> ~chi_10 e-)
     3.56087886E-03    2     1000023        11   # BR(~e_R -> ~chi_20 e-)
     9.67878840E-01    2     1000025        11   # BR(~e_R -> ~chi_30 e-)
#
#         PDG            Width
DECAY   1000013     6.82256723E+00   # smuon_L decays
#          BR         NDA      ID1       ID2
     4.27367340E-03    2     1000022        13   # BR(~mu_L -> ~chi_10 mu-)
     1.48532692E-03    2     1000023        13   # BR(~mu_L -> ~chi_20 mu-)
     5.97419580E-01    2     1000025        13   # BR(~mu_L -> ~chi_30 mu-)
     1.32254124E-01    2     1000035        13   # BR(~mu_L -> ~chi_40 mu-)
     1.35552921E-06    2    -1000024        14   # BR(~mu_L -> ~chi_1- nu_mu)
     2.64565940E-01    2    -1000037        14   # BR(~mu_L -> ~chi_2- nu_mu)
#
#         PDG            Width
DECAY   2000013     4.55143926E-01   # smuon_R decays
#           BR         NDA      ID1       ID2
     2.85602865E-02    2     1000022        13   # BR(~mu_R -> ~chi_10 mu-)
     3.56087949E-03    2     1000023        13   # BR(~mu_R -> ~chi_20 mu-)
     9.67878834E-01    2     1000025        13   # BR(~mu_R -> ~chi_30 mu-)
#
#         PDG            Width
DECAY   1000015     6.42701018E+00   # stau_1 decays
#          BR         NDA      ID1       ID2
     2.00677900E-02    2     1000022        15   # BR(~tau_1 -> ~chi_10  tau-)
     1.68033982E-02    2     1000023        15   # BR(~tau_1 -> ~chi_20  tau-)
     9.30504168E-01    2     1000025        15   # BR(~tau_1 -> ~chi_30  tau-)
     3.26246442E-02    2    -1000024        16   # BR(~tau_1 -> ~chi_1-  nu_tau)
#
#         PDG            Width
DECAY   2000015     3.77543463E+00   # stau_2 decays
#          BR         NDA      ID1       ID2
     5.07901893E-02    2     1000022        15   # BR(~tau_2 -> ~chi_10  tau-)
     4.64977495E-02    2     1000023        15   # BR(~tau_2 -> ~chi_20  tau-)
     8.94773546E-01    2     1000025        15   # BR(~tau_2 -> ~chi_30  tau-)
     2.24114183E-03    2     1000035        15   # BR(~tau_2 -> ~chi_40  tau-)
     3.13949658E-06    2    -1000024        16   # BR(~tau_2 -> ~chi_1-  nu_tau)
     4.45526945E-03    2    -1000037        16   # BR(~tau_2 -> ~chi_2-  nu_tau)
     6.31393397E-04    2     1000015        25   # BR(~tau_2 -> ~tau_1   h)
     6.07570673E-04    2     1000015        23   # BR(~tau_2 -> ~tau_1   Z)
#
#         PDG            Width
DECAY   1000012     6.82923995E+00   # snu_eL decays
#          BR         NDA      ID1       ID2
     2.26046716E-04    2     1000022        12   # BR(~nu_eL -> ~chi_10 nu_e)
     1.02767905E-04    2     1000023        12   # BR(~nu_eL -> ~chi_20 nu_e)
     6.00151669E-01    2     1000025        12   # BR(~nu_eL -> ~chi_30 nu_e)
     1.31667456E-01    2     1000035        12   # BR(~nu_eL -> ~chi_40 nu_e)
     4.90256750E-03    2     1000024        11   # BR(~nu_eL -> ~chi_1+ e-)
     2.62949493E-01    2     1000037        11   # BR(~nu_eL -> ~chi_2+ e-)
#
#         PDG            Width
DECAY   1000014     6.82923990E+00   # snu_muL decays
#          BR         NDA      ID1       ID2
     2.26046718E-04    2     1000022        14   # BR(~nu_muL -> ~chi_10 nu_mu)
     1.02767906E-04    2     1000023        14   # BR(~nu_muL -> ~chi_20 nu_mu)
     6.00151673E-01    2     1000025        14   # BR(~nu_muL -> ~chi_30 nu_mu)
     1.31667457E-01    2     1000035        14   # BR(~nu_muL -> ~chi_40 nu_mu)
     4.90256753E-03    2     1000024        13   # BR(~nu_muL -> ~chi_1+ mu-)
     2.62949488E-01    2     1000037        13   # BR(~nu_muL -> ~chi_2+ mu-)
#
#         PDG            Width
DECAY   1000016     3.78869984E+00   # snu_tauL decays
#          BR         NDA      ID1       ID2
     3.56205915E-04    2     1000022        16   # BR(~nu_tauL -> ~chi_10 nu_tau)
     1.61942175E-04    2     1000023        16   # BR(~nu_tauL -> ~chi_20 nu_tau)
     8.96415261E-01    2     1000025        16   # BR(~nu_tauL -> ~chi_30 nu_tau)
     2.10851452E-03    2     1000035        16   # BR(~nu_tauL -> ~chi_40 nu_tau)
     9.56110749E-02    2     1000024        15   # BR(~nu_tauL -> ~chi_1+ tau-)
     4.17577980E-03    2     1000037        15   # BR(~nu_tauL -> ~chi_2+ tau-)
     1.17122133E-03    2    -1000015       -24   # BR(~nu_tauL -> ~tau_1+ W-)
#
#         PDG            Width
DECAY   1000024     1.98500213E-12   # chargino1+ decays
#           BR         NDA      ID1       ID2       ID3
     3.20637556E-01    3     1000022         2        -1   # BR(~chi_1+ -> ~chi_10 u    db)
     2.79362550E-01    3     1000023         2        -1   # BR(~chi_1+ -> ~chi_20 u    db)
     1.06879120E-01    3     1000022       -11        12   # BR(~chi_1+ -> ~chi_10 e+   nu_e)
     9.31208273E-02    3     1000023       -11        12   # BR(~chi_1+ -> ~chi_20 e+   nu_e)
     1.06879120E-01    3     1000022       -13        14   # BR(~chi_1+ -> ~chi_10 mu+  nu_mu)
     9.31208273E-02    3     1000023       -13        14   # BR(~chi_1+ -> ~chi_20 mu+  nu_mu)
#
#         PDG            Width
DECAY   1000037     3.38259729E+01   # chargino2+ decays
#          BR         NDA      ID1       ID2
     1.50703875E-01    2     1000006        -5   # BR(~chi_2+ -> ~t_1     bb)
     3.44076492E-05    2     2000006        -5   # BR(~chi_2+ -> ~t_2     bb)
     1.82504589E-04    2    -1000005         6   # BR(~chi_2+ -> ~b_1*    t )
     1.41808553E-01    2    -2000005         6   # BR(~chi_2+ -> ~b_2*    t )
     1.46854537E-07    2    -1000015        16   # BR(~chi_2+ -> ~tau_1+  nu_tau)
     1.79444637E-01    2     1000024        23   # BR(~chi_2+ -> ~chi_1+  Z )
     1.73633401E-01    2     1000022        24   # BR(~chi_2+ -> ~chi_10  W+)
     1.73643152E-01    2     1000023        24   # BR(~chi_2+ -> ~chi_20  W+)
     3.32974658E-04    2     1000025        24   # BR(~chi_2+ -> ~chi_30  W+)
     1.80216348E-01    2     1000024        25   # BR(~chi_2+ -> ~chi_1+  h )
#
#         PDG            Width
DECAY   1000022     0.00000000E+00   # neutralino1 decays
#
#         PDG            Width
DECAY   1000023     3.62623346E-17   # neutralino2 decays
#          BR         NDA      ID1       ID2
     9.99825129E-01    2     1000022        22   # BR(~chi_20 -> ~chi_10 gam)
#           BR         NDA      ID1       ID2       ID3
     2.49833241E-05    3     1000022       -11        11   # BR(~chi_20 -> ~chi_10 e+      e-)
     4.99626969E-05    3     1000022       -12        12   # BR(~chi_20 -> ~chi_10 nu_eb   nu_e)
     4.99626969E-05    3     1000022       -14        14   # BR(~chi_20 -> ~chi_10 nu_mub  nu_mu)
     4.99626960E-05    3     1000022       -16        16   # BR(~chi_20 -> ~chi_10 nu_taub nu_tau)
#
#         PDG            Width
DECAY   1000025     3.23224394E+00   # neutralino3 decays
#          BR         NDA      ID1       ID2
     2.85222385E-02    2     1000022        23   # BR(~chi_30 -> ~chi_10   Z )
     2.21465177E-01    2     1000023        23   # BR(~chi_30 -> ~chi_20   Z )
     2.42625000E-01    2     1000024       -24   # BR(~chi_30 -> ~chi_1+   W-)
     2.42625000E-01    2    -1000024        24   # BR(~chi_30 -> ~chi_1-   W+)
     2.36051771E-01    2     1000022        25   # BR(~chi_30 -> ~chi_10   h )
     2.87108151E-02    2     1000023        25   # BR(~chi_30 -> ~chi_20   h )
#
#         PDG            Width
DECAY   1000035     3.38299222E+01   # neutralino4 decays
#          BR         NDA      ID1       ID2
     8.64313728E-02    2     1000022        23   # BR(~chi_40 -> ~chi_10   Z )
     9.26745518E-02    2     1000023        23   # BR(~chi_40 -> ~chi_20   Z )
     2.58436850E-04    2     1000025        23   # BR(~chi_40 -> ~chi_30   Z )
     1.73885192E-01    2     1000024       -24   # BR(~chi_40 -> ~chi_1+   W-)
     1.73885192E-01    2    -1000024        24   # BR(~chi_40 -> ~chi_1-   W+)
     9.28734348E-02    2     1000022        25   # BR(~chi_40 -> ~chi_10   h )
     8.70082923E-02    2     1000023        25   # BR(~chi_40 -> ~chi_20   h )
     8.54452945E-05    2     1000025        25   # BR(~chi_40 -> ~chi_30   h )
     7.16243254E-02    2     1000006        -6   # BR(~chi_40 -> ~t_1      tb)
     7.16243254E-02    2    -1000006         6   # BR(~chi_40 -> ~t_1*     t )
     9.54295417E-05    2     1000005        -5   # BR(~chi_40 -> ~b_1      bb)
     9.54295417E-05    2    -1000005         5   # BR(~chi_40 -> ~b_1*     b )
     7.47291884E-02    2     2000005        -5   # BR(~chi_40 -> ~b_2      bb)
     7.47291884E-02    2    -2000005         5   # BR(~chi_40 -> ~b_2*     b )
     1.01872583E-08    2     2000011       -11   # BR(~chi_40 -> ~e_R-     e+)
     1.01872583E-08    2    -2000011        11   # BR(~chi_40 -> ~e_R+     e-)
     1.01872583E-08    2     2000013       -13   # BR(~chi_40 -> ~mu_R-    mu+)
     1.01872583E-08    2    -2000013        13   # BR(~chi_40 -> ~mu_R+    mu-)
     7.78763526E-08    2     1000015       -15   # BR(~chi_40 -> ~tau_1-   tau+)
     7.78763526E-08    2    -1000015        15   # BR(~chi_40 -> ~tau_1+   tau-)
#
#         PDG            Width
DECAY        25     4.23753636E-03   # h decays
#          BR         NDA      ID1       ID2
     5.68093984E-01    2           5        -5   # BR(h -> b       bb     )
     6.21571358E-02    2         -15        15   # BR(h -> tau+    tau-   )
     2.20006320E-04    2         -13        13   # BR(h -> mu+     mu-    )
     2.39542198E-04    2           3        -3   # BR(h -> s       sb     )
     2.06793653E-02    2           4        -4   # BR(h -> c       cb     )
     7.81066594E-02    2          21        21   # BR(h -> g       g      )
     2.34588501E-03    2          22        22   # BR(h -> gam     gam    )
     1.70160587E-03    2          22        23   # BR(h -> Z       gam    )
     2.36191540E-01    2          24       -24   # BR(h -> W+      W-     )
     3.02642754E-02    2          23        23   # BR(h -> Z       Z      )
#
#         PDG            Width
DECAY        35     7.45164503E+00   # H decays
#          BR         NDA      ID1       ID2
     2.28660049E-01    2           5        -5   # BR(H -> b       bb     )
     4.30797628E-02    2         -15        15   # BR(H -> tau+    tau-   )
     1.52235057E-04    2         -13        13   # BR(H -> mu+     mu-    )
     9.50712916E-05    2           3        -3   # BR(H -> s       sb     )
     3.51426850E-06    2           4        -4   # BR(H -> c       cb     )
     3.45693588E-01    2           6        -6   # BR(H -> t       tb     )
     1.59362777E-04    2          21        21   # BR(H -> g       g      )
     4.22835733E-07    2          22        22   # BR(H -> gam     gam    )
     2.49357408E-07    2          23        22   # BR(H -> Z       gam    )
     1.55664666E-04    2          24       -24   # BR(H -> W+      W-     )
     7.76684812E-05    2          23        23   # BR(H -> Z       Z      )
     5.56350206E-04    2          25        25   # BR(H -> h       h      )
     3.53842121E-03    2     1000024  -1000024   # BR(H -> ~chi_1+ ~chi_1-)
     8.09095274E-05    2     1000022   1000022   # BR(H -> ~chi_10 ~chi_10)
     1.16675469E-04    2     1000023   1000023   # BR(H -> ~chi_20 ~chi_20)
     7.35066392E-05    2     1000025   1000025   # BR(H -> ~chi_30 ~chi_30)
     2.17204481E-04    2     1000022   1000023   # BR(H -> ~chi_10 ~chi_20)
     1.16339861E-01    2     1000022   1000025   # BR(H -> ~chi_10 ~chi_30)
     2.60983429E-01    2     1000023   1000025   # BR(H -> ~chi_20 ~chi_30)
     8.02708977E-06    2     2000011  -2000011   # BR(H -> ~e_R-   ~e_R+  )
     8.02708977E-06    2     2000013  -2000013   # BR(H -> ~mu_R-  ~mu_R+ )
#
#         PDG            Width
DECAY        36     7.45840585E+00   # A decays
#          BR         NDA      ID1       ID2
     2.28598521E-01    2           5        -5   # BR(A -> b       bb     )
     4.30429412E-02    2         -15        15   # BR(A -> tau+    tau-   )
     1.52104746E-04    2         -13        13   # BR(A -> mu+     mu-    )
     9.51263966E-05    2           3        -3   # BR(A -> s       sb     )
     3.52656121E-06    2           4        -4   # BR(A -> c       cb     )
     3.46444965E-01    2           6        -6   # BR(A -> t       tb     )
     2.95603595E-04    2          21        21   # BR(A -> g       g      )
     5.22608901E-07    2          22        22   # BR(A -> gam     gam    )
     3.79064083E-07    2          23        22   # BR(A -> Z       gam    )
     1.57575221E-04    2          23        25   # BR(A -> Z       h      )
     3.83925897E-03    2     1000024  -1000024   # BR(A -> ~chi_1+ ~chi_1-)
     1.54478435E-04    2     1000022   1000022   # BR(A -> ~chi_10 ~chi_10)
     7.05711046E-05    2     1000023   1000023   # BR(A -> ~chi_20 ~chi_20)
     5.44982312E-04    2     1000025   1000025   # BR(A -> ~chi_30 ~chi_30)
     1.95776122E-04    2     1000022   1000023   # BR(A -> ~chi_10 ~chi_20)
     2.59819574E-01    2     1000022   1000025   # BR(A -> ~chi_10 ~chi_30)
     1.16584094E-01    2     1000023   1000025   # BR(A -> ~chi_20 ~chi_30)
#
#         PDG            Width
DECAY        37     7.39138603E+00   # H+ decays
#          BR         NDA      ID1       ID2
     3.86211388E-04    2           4        -5   # BR(H+ -> c       bb     )
     4.34529772E-02    2         -15        16   # BR(H+ -> tau+    nu_tau )
     1.53553727E-04    2         -13        14   # BR(H+ -> mu+     nu_mu  )
     3.86205237E-06    2           2        -5   # BR(H+ -> u       bb     )
     4.79876765E-06    2           2        -3   # BR(H+ -> u       sb     )
     9.78675330E-05    2           4        -3   # BR(H+ -> c       sb     )
     5.73167293E-01    2           6        -5   # BR(H+ -> t       bb     )
     1.59312384E-04    2          24        25   # BR(H+ -> W+      h      )
     1.05334824E-12    2          24        36   # BR(H+ -> W+      A      )
     2.90942414E-03    2     1000024   1000022   # BR(H+ -> ~chi_1+ ~chi_10)
     1.12441675E-03    2     1000024   1000023   # BR(H+ -> ~chi_1+ ~chi_20)
     3.78540283E-01    2     1000024   1000025   # BR(H+ -> ~chi_1+ ~chi_30)
