#
#                              ======================
#                              | THE SUSYHIT OUTPUT |
#                              ======================
#
#
#              ------------------------------------------------------
#              |     This is the output of the SUSY-HIT package     |
#              |  created by A.Djouadi, M.Muehlleitner and M.Spira. |
#              |  In case of problems with SUSY-HIT email to        |
#              |           margarete.muehlleitner@cern.ch           |
#              |           michael.spira@psi.ch                     |
#              |           abdelhak.djouadi@cern.ch                 |
#              ------------------------------------------------------
#
#              ------------------------------------------------------
#              |  SUSY Les Houches Accord - MSSM Spectrum + Decays  |
#              |              based on the decay programs           |
#              |                                                    |
#              |                     SDECAY 1.3b                    |
#              |                                                    |
#              |  Authors: M.Muhlleitner, A.Djouadi and Y.Mambrini  |
#              |  Ref.:    Comput.Phys.Commun.168(2005)46           |
#              |           [hep-ph/0311167]                         |
#              |                                                    |
#              |                     HDECAY 3.4                     |
#              |                                                    |
#              |  By: A.Djouadi,J.Kalinowski,M.Muhlleitner,M.Spira  |
#              |  Ref.:    Comput.Phys.Commun.108(1998)56           |
#              |           [hep-ph/9704448]                         |
#              |                                                    |
#              |                                                    |
#              |  If not stated otherwise all DRbar couplings and   |
#              |  soft SUSY breaking masses are given at the scale  |
#              |  Q=  0.90437320E+03
#              |                                                    |
#              ------------------------------------------------------
#
#
BLOCK DCINFO  # Decay Program information
     1   SDECAY/HDECAY # decay calculator
     2   1.3b  /3.4    # version number
#
BLOCK SPINFO  # Spectrum calculator information
     1     SOFTSUSY    # spectrum calculator               
     2     3.4.0       # version number                    
#
BLOCK MODSEL  # Model selection
     1     0   #  nonUniversal                                     
#
BLOCK SMINPUTS  # Standard Model inputs
         1     1.27908970E+02   # alpha_em^-1(M_Z)^MSbar
         2     1.16637870E-05   # G_F [GeV^-2]
         3     1.18400000E-01   # alpha_S(M_Z)^MSbar
         4     9.11876000E+01   # M_Z pole mass
         5     4.18000000E+00   # mb(mb)^MSbar
         6     1.73200000E+02   # mt pole mass
         7     1.77700000E+00   # mtau pole mass
#
BLOCK MINPAR  # Input parameters - minimal models
         3     1.57500000E+01   # tanb                
#
BLOCK EXTPAR  # Input parameters - non-minimal models
         0    -1.00000000E+00   # Set                 
         1     2.41550000E+02   # M_1(MX)             
         2    -1.91376000E+03   # M_2(MX)             
         3     2.45577000E+03   # M_3(MX)             
        11     1.83322000E+03   # At(MX)              
        12    -2.31222000E+03   # Ab(MX)              
        13    -9.87780000E+02   # Atau(MX)            
        23     2.20287000E+03   # mu(MX)              
        26     1.18005000E+03   # mA(pole)            
        31     4.61880000E+02   # meL(MX)             
        32     4.61880000E+02   # mmuL(MX)            
        33     3.57522000E+03   # mtauL(MX)           
        34     1.79542000E+03   # meR(MX)             
        35     1.79542000E+03   # mmuR(MX)            
        36     1.42234000E+03   # mtauR(MX)           
        41     1.68267000E+03   # mqL1(MX)            
        42     1.68267000E+03   # mqL2(MX)            
        43     1.54210000E+03   # mqL3(MX)            
        44     2.24032000E+03   # muR(MX)             
        45     2.24032000E+03   # mcR(MX)             
        46     5.33370000E+02   # mtR(MX)             
        47     2.75738000E+03   # mdR(MX)             
        48     2.75738000E+03   # msR(MX)             
        49     2.11855000E+03   # mbR(MX)             
#
BLOCK MASS  # Mass Spectrum
# PDG code           mass       particle
        24     8.04123384E+01   # W+
        25     1.24949725E+02   # h
        35     1.17806168E+03   # H
        36     1.18005000E+03   # A
        37     1.18238925E+03   # H+
         5     4.81876030E+00   # b-quark pole mass calculated from mb(mb)_Msbar
   1000001     1.66775188E+03   # ~d_L
   2000001     2.75517513E+03   # ~d_R
   1000002     1.66600190E+03   # ~u_L
   2000002     2.24039651E+03   # ~u_R
   1000003     1.66775188E+03   # ~s_L
   2000003     2.75517513E+03   # ~s_R
   1000004     1.66600190E+03   # ~c_L
   2000004     2.24039651E+03   # ~c_R
   1000005     1.50351425E+03   # ~b_1
   2000005     2.11420328E+03   # ~b_2
   1000006     2.65334529E+02   # ~t_1
   2000006     1.52108312E+03   # ~t_2
   1000011     4.57865006E+02   # ~e_L
   2000011     1.79475302E+03   # ~e_R
   1000012     4.50839397E+02   # ~nu_eL
   1000013     4.57865006E+02   # ~mu_L
   2000013     1.79475302E+03   # ~mu_R
   1000014     4.50839397E+02   # ~nu_muL
   1000015     1.42355302E+03   # ~tau_1
   2000015     3.57761482E+03   # ~tau_2
   1000016     3.57637045E+03   # ~nu_tauL
   1000021     2.42485209E+03   # ~g
   1000022     2.42208450E+02   # ~chi_10
   1000023    -1.90880149E+03   # ~chi_20
   1000025     2.21248833E+03   # ~chi_30
   1000035    -2.22047197E+03   # ~chi_40
   1000024     1.90897660E+03   # ~chi_1+
   1000037     2.22114719E+03   # ~chi_2+
#
BLOCK NMIX  # Neutralino Mixing Matrix
  1  1     9.99771238E-01   # N_11
  1  2     1.29910242E-04   # N_12
  1  3     2.11230440E-02   # N_13
  1  4    -3.35735558E-03   # N_14
  2  1     2.22689755E-03   # N_21
  2  2     9.85653240E-01   # N_22
  2  3    -1.28797110E-01   # N_23
  2  4    -1.09059778E-01   # N_24
  3  1    -1.73068250E-02   # N_31
  3  2     1.41284961E-02   # N_32
  3  3     7.06654187E-01   # N_33
  3  4    -7.07206278E-01   # N_34
  4  1    -1.23687686E-02   # N_41
  4  2     1.68190542E-01   # N_42
  4  3     6.95417128E-01   # N_43
  4  4     6.98537024E-01   # N_44
#
BLOCK UMIX  # Chargino Mixing Matrix U
  1  1     9.83336867E-01   # U_11
  1  2    -1.81792757E-01   # U_12
  2  1     1.81792757E-01   # U_21
  2  2     9.83336867E-01   # U_22
#
BLOCK VMIX  # Chargino Mixing Matrix V
  1  1    -9.88144479E-01   # V_11
  1  2    -1.53526832E-01   # V_12
  2  1    -1.53526832E-01   # V_21
  2  2     9.88144479E-01   # V_22
#
BLOCK STOPMIX  # Stop Mixing Matrix
  1  1    -1.25282018E-01   # cos(theta_t)
  1  2     9.92121170E-01   # sin(theta_t)
  2  1    -9.92121170E-01   # -sin(theta_t)
  2  2    -1.25282018E-01   # cos(theta_t)
#
BLOCK SBOTMIX  # Sbottom Mixing Matrix
  1  1     9.99477259E-01   # cos(theta_b)
  1  2     3.23296882E-02   # sin(theta_b)
  2  1    -3.23296882E-02   # -sin(theta_b)
  2  2     9.99477259E-01   # cos(theta_b)
#
BLOCK STAUMIX  # Stau Mixing Matrix
  1  1     5.57769481E-03   # cos(theta_tau)
  1  2     9.99984445E-01   # sin(theta_tau)
  2  1    -9.99984445E-01   # -sin(theta_tau)
  2  2     5.57769481E-03   # cos(theta_tau)
#
BLOCK ALPHA  # Higgs mixing
          -6.73219569E-02   # Mixing angle in the neutral Higgs boson sector
#
BLOCK HMIX Q=  9.04373200E+02  # DRbar Higgs Parameters
         1     2.22265520E+03   # mu(Q)MSSM           
         2     1.52390317E+01   # tan                 
         3     2.45498681E+02   # higgs               
         4     2.37509927E+06   # mA^2(Q)MSSM         
#
BLOCK GAUGE Q=  9.04373200E+02  # The gauge couplings
     1     3.61167545E-01   # gprime(Q) DRbar
     2     6.35646953E-01   # g(Q) DRbar
     3     1.04237899E+00   # g3(Q) DRbar
#
BLOCK AU Q=  9.04373200E+02  # The trilinear couplings
  1  1     0.00000000E+00   # A_u(Q) DRbar
  2  2     0.00000000E+00   # A_c(Q) DRbar
  3  3     1.83322000E+03   # A_t(Q) DRbar
#
BLOCK AD Q=  9.04373200E+02  # The trilinear couplings
  1  1     0.00000000E+00   # A_d(Q) DRbar
  2  2     0.00000000E+00   # A_s(Q) DRbar
  3  3    -2.31222000E+03   # A_b(Q) DRbar
#
BLOCK AE Q=  9.04373200E+02  # The trilinear couplings
  1  1     0.00000000E+00   # A_e(Q) DRbar
  2  2     0.00000000E+00   # A_mu(Q) DRbar
  3  3    -9.87780000E+02   # A_tau(Q) DRbar
#
BLOCK Yu Q=  9.04373200E+02  # The Yukawa couplings
  1  1     0.00000000E+00   # y_u(Q) DRbar
  2  2     0.00000000E+00   # y_c(Q) DRbar
  3  3     8.64184066E-01   # y_t(Q) DRbar
#
BLOCK Yd Q=  9.04373200E+02  # The Yukawa couplings
  1  1     0.00000000E+00   # y_d(Q) DRbar
  2  2     0.00000000E+00   # y_s(Q) DRbar
  3  3     1.73145617E-01   # y_b(Q) DRbar
#
BLOCK Ye Q=  9.04373200E+02  # The Yukawa couplings
  1  1     0.00000000E+00   # y_e(Q) DRbar
  2  2     0.00000000E+00   # y_mu(Q) DRbar
  3  3     1.52540505E-01   # y_tau(Q) DRbar
#
BLOCK MSOFT Q=  9.04373200E+02  # The soft SUSY breaking masses at the scale Q
         1     2.41550000E+02   # M_1(Q)              
         2    -1.91376000E+03   # M_2(Q)              
         3     2.45577000E+03   # M_3(Q)              
        21    -3.48077797E+06   # mH1^2(Q)            
        22    -4.86370681E+06   # mH2^2(Q)            
        31     4.61880000E+02   # meL(Q)              
        32     4.61880000E+02   # mmuL(Q)             
        33     3.57522000E+03   # mtauL(Q)            
        34     1.79542000E+03   # meR(Q)              
        35     1.79542000E+03   # mmuR(Q)             
        36     1.42234000E+03   # mtauR(Q)            
        41     1.68267000E+03   # mqL1(Q)             
        42     1.68267000E+03   # mqL2(Q)             
        43     1.54210000E+03   # mqL3(Q)             
        44     2.24032000E+03   # muR(Q)              
        45     2.24032000E+03   # mcR(Q)              
        46     5.33369995E+02   # mtR(Q)              
        47     2.75738000E+03   # mdR(Q)              
        48     2.75738000E+03   # msR(Q)              
        49     2.11855000E+03   # mbR(Q)              
#
Block HiggsBoundsInputHiggsCouplingsFermions
# ScalarNormEffCoupSq PseudoSNormEffCoupSq NP   IP1 IP2 IP2
    1.05545107E+00    0.00000000E+00        3  25   5   5  # h0-b-b eff. coupling^2, normalised to SM
    2.32172636E+02    0.00000000E+00        3  35   5   5  # H0-b-b eff. coupling^2, normalised to SM
    0.00000000E+00    2.32228087E+02        3  36   5   5  # A0-b-b eff. coupling^2, normalised to SM
#
    9.99761222E-01    0.00000000E+00        3  25   6   6  # h0-t-t eff. coupling^2, normalised to SM
    4.54488982E-03    0.00000000E+00        3  35   6   6  # H0-t-t eff. coupling^2, normalised to SM
    0.00000000E+00    4.30611134E-03        3  36   6   6  # A0-t-t eff. coupling^2, normalised to SM
#
    1.05545107E+00    0.00000000E+00        3  25  15  15  # h0-tau-tau eff. coupling^2, normalised to SM
    2.32172636E+02    0.00000000E+00        3  35  15  15  # H0-tau-tau eff. coupling^2, normalised to SM
    0.00000000E+00    2.32228087E+02        3  36  15  15  # A0-tau-tau eff. coupling^2, normalised to SM
#
Block HiggsBoundsInputHiggsCouplingsBosons
    9.99996778E-01        3  25  24  24  # h0-W-W eff. coupling^2, normalised to SM
    3.22179697E-06        3  35  24  24  # H0-W-W eff. coupling^2, normalised to SM
    0.00000000E+00        3  36  24  24  # A0-W-W eff. coupling^2, normalised to SM
#
    9.99996778E-01        3  25  23  23  # h0-Z-Z eff. coupling^2, normalised to SM
    3.22179697E-06        3  35  23  23  # H0-Z-Z eff. coupling^2, normalised to SM
    0.00000000E+00        3  36  23  23  # A0-Z-Z eff. coupling^2, normalised to SM
#
    8.16584370E-01        3  25  21  21  # h0-g-g eff. coupling^2, normalised to SM
    2.21949240E-05        3  35  21  21  # H0-g-g eff. coupling^2, normalised to SM
    2.40265716E-06        3  36  21  21  # A0-g-g eff. coupling^2, normalised to SM
#
    0.00000000E+00        3  25  25  23  # h0-h0-Z eff. coupling^2, normalised to SM
    0.00000000E+00        3  35  25  23  # H0-h0-Z eff. coupling^2, normalised to SM
    3.22179697E-06        3  36  25  23  # A0-h0-Z eff. coupling^2, normalised to SM
    0.00000000E+00        3  35  35  23  # H0-H0-Z eff. coupling^2, normalised to SM
    9.99996778E-01        3  36  35  23  # A0-H0-Z eff. coupling^2, normalised to SM
    0.00000000E+00        3  36  36  23  # A0-A0-Z eff. coupling^2, normalised to SM
#
    0.00000000E+00        4  25  21  21  23  # h0-g-g-Z eff. coupling^2, normalised to SM
    0.00000000E+00        4  35  21  21  23  # H0-g-g-Z eff. coupling^2, normalised to SM
    0.00000000E+00        4  36  21  21  23  # A0-g-g-Z eff. coupling^2, normalised to SM
#
#
#
#                             =================
#                             |The decay table|
#                             =================
#
# - The QCD corrections to the decays gluino -> squark  + quark
#                                     squark -> gaugino + quark_prime
#                                     squark -> squark_prime + Higgs
#                                     squark -> gluino  + quark
#   are included.
#
# - The multi-body decays for the inos, stops and sbottoms are included.
#
# - The loop induced decays for the gluino, neutralinos and stops
#   are included.
#
# - The SUSY decays of the top quark are included.
#
#
#         PDG            Width
DECAY         6     1.42200295E+00   # top decays
#          BR         NDA      ID1       ID2
     1.00000000E+00    2           5        24   # BR(t ->  b    W+)
#
#         PDG            Width
DECAY   1000021     1.28598203E+02   # gluino decays
#          BR         NDA      ID1       ID2
     4.78897574E-02    2     1000001        -1   # BR(~g -> ~d_L  db)
     4.78897574E-02    2    -1000001         1   # BR(~g -> ~d_L* d )
     4.80702647E-02    2     1000002        -2   # BR(~g -> ~u_L  ub)
     4.80702647E-02    2    -1000002         2   # BR(~g -> ~u_L* u )
     3.69376821E-03    2     2000002        -2   # BR(~g -> ~u_R  ub)
     3.69376821E-03    2    -2000002         2   # BR(~g -> ~u_R* u )
     4.78897574E-02    2     1000003        -3   # BR(~g -> ~s_L  sb)
     4.78897574E-02    2    -1000003         3   # BR(~g -> ~s_L* s )
     4.80701810E-02    2     1000004        -4   # BR(~g -> ~c_L  cb)
     4.80701810E-02    2    -1000004         4   # BR(~g -> ~c_L* c )
     3.69361672E-03    2     2000004        -4   # BR(~g -> ~c_R  cb)
     3.69361672E-03    2    -2000004         4   # BR(~g -> ~c_R* c )
     6.40407849E-02    2     1000005        -5   # BR(~g -> ~b_1  bb)
     6.40407849E-02    2    -1000005         5   # BR(~g -> ~b_1* b )
     9.95542147E-03    2     2000005        -5   # BR(~g -> ~b_2  bb)
     9.95542147E-03    2    -2000005         5   # BR(~g -> ~b_2* b )
     1.68540747E-01    2     1000006        -6   # BR(~g -> ~t_1  tb)
     1.68540747E-01    2    -1000006         6   # BR(~g -> ~t_1* t )
     5.81557011E-02    2     2000006        -6   # BR(~g -> ~t_2  tb)
     5.81557011E-02    2    -2000006         6   # BR(~g -> ~t_2* t )
#
#         PDG            Width
DECAY   1000006     2.17753370E-11   # stop1 decays
#           BR         NDA      ID1       ID2
     9.68895937E-01    2     1000022         4   # BR(~t_1 -> ~chi_10 c )
     7.46989373E-03    2     1000022         2   # BR(~t_1 -> ~chi_10 u )
#           BR         NDA      ID1       ID2       ID3       ID4
     7.69769948E-03    4        4       -3        1000022      5   # BR(~t_1 -> c  sb  ~chi_10  b)
     8.14453528E-03    4        2       -1        1000022      5   # BR(~t_1 -> u  db  ~chi_10  b)
     2.72721383E-03    4        -11       12        1000022      5   # BR(~t_1 -> e+  nu_e  ~chi_10  b)
     2.64161239E-03    4        -13       14        1000022      5   # BR(~t_1 -> mu+  nu_mu  ~chi_10  b)
     2.42310831E-03    4        -15       16        1000022      5   # BR(~t_1 -> tau+  nu_tau  ~chi_10  b)
#
#         PDG            Width
DECAY   2000006     4.13788442E+01   # stop2 decays
#          BR         NDA      ID1       ID2
     6.38011380E-03    2     1000022         6   # BR(~t_2 -> ~chi_10 t )
     3.01473315E-01    2     1000006        25   # BR(~t_2 -> ~t_1    h )
     1.53194302E-01    2     1000006        35   # BR(~t_2 -> ~t_1    H )
     1.60579043E-01    2     1000006        36   # BR(~t_2 -> ~t_1    A )
     3.78373226E-01    2     1000006        23   # BR(~t_2 -> ~t_1    Z )
#
#         PDG            Width
DECAY   1000005     4.14277145E+01   # sbottom1 decays
#          BR         NDA      ID1       ID2
     5.01998166E-03    2     1000022         5   # BR(~b_1 -> ~chi_10 b )
     2.74671615E-01    2     1000006       -37   # BR(~b_1 -> ~t_1    H-)
     7.20308403E-01    2     1000006       -24   # BR(~b_1 -> ~t_1    W-)
#
#         PDG            Width
DECAY   2000005     2.68756594E+00   # sbottom2 decays
#          BR         NDA      ID1       ID2
     4.40550622E-01    2     1000022         5   # BR(~b_2 -> ~chi_10 b )
     3.44227847E-05    2     1000023         5   # BR(~b_2 -> ~chi_20 b )
     6.21181296E-05    2    -1000024         6   # BR(~b_2 -> ~chi_1- t )
     1.43018576E-01    2     1000005        25   # BR(~b_2 -> ~b_1    h )
     1.41211069E-04    2     1000006       -37   # BR(~b_2 -> ~t_1    H-)
     1.36882568E-01    2     1000005        23   # BR(~b_2 -> ~b_1    Z )
     3.40318950E-02    2     1000006       -24   # BR(~b_2 -> ~t_1    W-)
     2.45278587E-01    2     2000006       -24   # BR(~b_2 -> ~t_2    W-)
#
#         PDG            Width
DECAY   1000002     2.29543415E-01   # sup_L decays
#          BR         NDA      ID1       ID2
     1.00000000E+00    2     1000022         2   # BR(~u_L -> ~chi_10 u)
#
#         PDG            Width
DECAY   2000002     4.90813342E+00   # sup_R decays
#          BR         NDA      ID1       ID2
     9.99999330E-01    2     1000022         2   # BR(~u_R -> ~chi_10 u)
     3.95749027E-07    2     1000023         2   # BR(~u_R -> ~chi_20 u)
     2.16725765E-07    2     1000025         2   # BR(~u_R -> ~chi_30 u)
     5.75106800E-08    2     1000035         2   # BR(~u_R -> ~chi_40 u)
#
#         PDG            Width
DECAY   1000001     2.29159998E-01   # sdown_L decays
#          BR         NDA      ID1       ID2
     1.00000000E+00    2     1000022         1   # BR(~d_L -> ~chi_10 d)
#
#         PDG            Width
DECAY   2000001     1.19657952E+01   # sdown_R decays
#          BR         NDA      ID1       ID2
     1.24019814E-01    2     1000022         1   # BR(~d_R -> ~chi_10 d)
     1.72368461E-07    2     1000023         1   # BR(~d_R -> ~chi_20 d)
     4.92034672E-06    2     1000025         1   # BR(~d_R -> ~chi_30 d)
     2.44878329E-06    2     1000035         1   # BR(~d_R -> ~chi_40 d)
     8.75972645E-01    2     1000021         1   # BR(~d_R -> ~g      d)
#
#         PDG            Width
DECAY   1000004     2.30351596E-01   # scharm_L decays
#          BR         NDA      ID1       ID2
     1.00000000E+00    2     1000022         4   # BR(~c_L -> ~chi_10 c)
#
#         PDG            Width
DECAY   2000004     5.04556339E+00   # scharm_R decays
#          BR         NDA      ID1       ID2
     9.99999382E-01    2     1000022         4   # BR(~c_R -> ~chi_10 c)
     3.81636965E-07    2     1000023         4   # BR(~c_R -> ~chi_20 c)
     1.87748537E-07    2     1000025         4   # BR(~c_R -> ~chi_30 c)
     4.89749781E-08    2     1000035         4   # BR(~c_R -> ~chi_40 c)
#
#         PDG            Width
DECAY   1000003     2.29982882E-01   # sstrange_L decays
#          BR         NDA      ID1       ID2
     1.00000000E+00    2     1000022         3   # BR(~s_L -> ~chi_10 s)
#
#         PDG            Width
DECAY   2000003     9.63322617E+00   # sstrange_R decays
#          BR         NDA      ID1       ID2
     1.62321133E-01    2     1000022         3   # BR(~s_R -> ~chi_10 s)
     2.21183712E-07    2     1000023         3   # BR(~s_R -> ~chi_20 s)
     6.23093661E-06    2     1000025         3   # BR(~s_R -> ~chi_30 s)
     3.09951149E-06    2     1000035         3   # BR(~s_R -> ~chi_40 s)
     8.37669316E-01    2     1000021         3   # BR(~s_R -> ~g      s)
#
#         PDG            Width
DECAY   1000011     3.08118428E-01   # selectron_L decays
#          BR         NDA      ID1       ID2
     1.00000000E+00    2     1000022        11   # BR(~e_L -> ~chi_10 e-)
#
#         PDG            Width
DECAY   2000011     8.97467137E+00   # selectron_R decays
#          BR         NDA      ID1       ID2
     1.00000000E+00    2     1000022        11   # BR(~e_R -> ~chi_10 e-)
#
#         PDG            Width
DECAY   1000013     3.08118364E-01   # smuon_L decays
#          BR         NDA      ID1       ID2
     1.00000000E+00    2     1000022        13   # BR(~mu_L -> ~chi_10 mu-)
#
#         PDG            Width
DECAY   2000013     8.97467131E+00   # smuon_R decays
#          BR         NDA      ID1       ID2
     1.00000000E+00    2     1000022        13   # BR(~mu_R -> ~chi_10 mu-)
#
#         PDG            Width
DECAY   1000015     6.96396181E+00   # stau_1 decays
#          BR         NDA      ID1       ID2
     1.00000000E+00    2     1000022        15   # BR(~tau_1 -> ~chi_10  tau-)
#
#         PDG            Width
DECAY   2000015     2.77392910E+01   # stau_2 decays
#          BR         NDA      ID1       ID2
     1.65834099E-01    2     1000022        15   # BR(~tau_2 -> ~chi_10  tau-)
     2.58740034E-01    2     1000023        15   # BR(~tau_2 -> ~chi_20  tau-)
     1.13867389E-02    2     1000025        15   # BR(~tau_2 -> ~chi_30  tau-)
     1.60766028E-02    2     1000035        15   # BR(~tau_2 -> ~chi_40  tau-)
     5.12615533E-01    2    -1000024        16   # BR(~tau_2 -> ~chi_1-  nu_tau)
     1.31274765E-02    2    -1000037        16   # BR(~tau_2 -> ~chi_2-  nu_tau)
     1.02189397E-02    2     1000015        25   # BR(~tau_2 -> ~tau_1   h)
     1.11620013E-03    2     1000015        35   # BR(~tau_2 -> ~tau_1   H)
     1.12637196E-03    2     1000015        36   # BR(~tau_2 -> ~tau_1   A)
     9.75800316E-03    2     1000015        23   # BR(~tau_2 -> ~tau_1   Z)
#
#         PDG            Width
DECAY   1000012     2.95759371E-01   # snu_eL decays
#          BR         NDA      ID1       ID2
     1.00000000E+00    2     1000022        12   # BR(~nu_eL -> ~chi_10 nu_e)
#
#         PDG            Width
DECAY   1000014     2.95759371E-01   # snu_muL decays
#          BR         NDA      ID1       ID2
     1.00000000E+00    2     1000022        14   # BR(~nu_muL -> ~chi_10 nu_mu)
#
#         PDG            Width
DECAY   1000016     2.77167204E+01   # snu_tauL decays
#          BR         NDA      ID1       ID2
     1.65740176E-01    2     1000022        16   # BR(~nu_tauL -> ~chi_10 nu_tau)
     2.57006093E-01    2     1000023        16   # BR(~nu_tauL -> ~chi_20 nu_tau)
     1.13461883E-04    2     1000025        16   # BR(~nu_tauL -> ~chi_30 nu_tau)
     6.01255703E-03    2     1000035        16   # BR(~nu_tauL -> ~chi_40 nu_tau)
     5.18909854E-01    2     1000024        15   # BR(~nu_tauL -> ~chi_1+ tau-)
     3.09907210E-02    2     1000037        15   # BR(~nu_tauL -> ~chi_2+ tau-)
     2.25306616E-03    2    -1000015       -37   # BR(~nu_tauL -> ~tau_1+ H-)
     1.89740703E-02    2    -1000015       -24   # BR(~nu_tauL -> ~tau_1+ W-)
#
#         PDG            Width
DECAY   1000024     4.06834667E+01   # chargino1+ decays
#          BR         NDA      ID1       ID2
     3.22001577E-02    2     1000002        -1   # BR(~chi_1+ -> ~u_L     db)
     3.14685818E-02    2    -1000001         2   # BR(~chi_1+ -> ~d_L*    u )
     3.22001208E-02    2     1000004        -3   # BR(~chi_1+ -> ~c_L     sb)
     3.14679951E-02    2    -1000003         4   # BR(~chi_1+ -> ~s_L*     c )
     5.95791157E-02    2     1000006        -5   # BR(~chi_1+ -> ~t_1     bb)
     6.87472947E-02    2     2000006        -5   # BR(~chi_1+ -> ~t_2     bb)
     9.06522792E-02    2    -1000005         6   # BR(~chi_1+ -> ~b_1*    t )
     1.64174719E-01    2     1000012       -11   # BR(~chi_1+ -> ~nu_eL   e+  )
     1.64174719E-01    2     1000014       -13   # BR(~chi_1+ -> ~nu_muL  mu+ )
     1.61978353E-01    2    -1000011        12   # BR(~chi_1+ -> ~e_L+    nu_e)
     1.61978353E-01    2    -1000013        14   # BR(~chi_1+ -> ~mu_L+   nu_mu)
     8.96280551E-05    2    -1000015        16   # BR(~chi_1+ -> ~tau_1+  nu_tau)
     7.02028515E-04    2     1000022        24   # BR(~chi_1+ -> ~chi_10  W+)
     5.86655725E-04    2     1000022        37   # BR(~chi_1+ -> ~chi_10  H+)
#
#         PDG            Width
DECAY   1000037     6.75884526E+01   # chargino2+ decays
#          BR         NDA      ID1       ID2
     1.77551682E-03    2     1000002        -1   # BR(~chi_2+ -> ~u_L     db)
     2.47624570E-03    2    -1000001         2   # BR(~chi_2+ -> ~d_L*    u )
     1.77551648E-03    2     1000004        -3   # BR(~chi_2+ -> ~c_L     sb)
     2.47623804E-03    2    -1000003         4   # BR(~chi_2+ -> ~s_L*     c )
     6.64636910E-01    2     1000006        -5   # BR(~chi_2+ -> ~t_1     bb)
     1.95320501E-02    2     2000006        -5   # BR(~chi_2+ -> ~t_2     bb)
     1.93892688E-01    2    -1000005         6   # BR(~chi_2+ -> ~b_1*    t )
     2.86195139E-03    2     1000012       -11   # BR(~chi_2+ -> ~nu_eL   e+  )
     2.86195139E-03    2     1000014       -13   # BR(~chi_2+ -> ~nu_muL mu+ )
     4.00196917E-03    2    -1000011        12   # BR(~chi_2+ -> ~e_L+    nu_e)
     4.00196917E-03    2    -1000013        14   # BR(~chi_2+ -> ~mu_L+   nu_mu)
     2.53165374E-03    2    -1000015        16   # BR(~chi_2+ -> ~tau_1+  nu_tau)
     2.23009461E-02    2     1000024        23   # BR(~chi_2+ -> ~chi_1+  Z )
     2.15599095E-02    2     1000022        24   # BR(~chi_2+ -> ~chi_10  W+)
     2.22781713E-02    2     1000023        24   # BR(~chi_2+ -> ~chi_20  W+)
     2.12042130E-02    2     1000024        25   # BR(~chi_2+ -> ~chi_1+  h )
     9.83210044E-03    2     1000022        37   # BR(~chi_2+ -> ~chi_10  H+)
#
#         PDG            Width
DECAY   1000022     0.00000000E+00   # neutralino1 decays
#
#         PDG            Width
DECAY   1000023     4.07006308E+01   # neutralino2 decays
#          BR         NDA      ID1       ID2
     4.94862199E-04    2     1000022        23   # BR(~chi_20 -> ~chi_10   Z )
     1.90531854E-04    2     1000022        25   # BR(~chi_20 -> ~chi_10   h )
     1.99687976E-04    2     1000022        35   # BR(~chi_20 -> ~chi_10   H )
     3.92771934E-04    2     1000022        36   # BR(~chi_20 -> ~chi_10   A )
     1.60061349E-02    2     1000002        -2   # BR(~chi_20 -> ~u_L      ub)
     1.60061349E-02    2    -1000002         2   # BR(~chi_20 -> ~u_L*     u )
     1.57686360E-02    2     1000001        -1   # BR(~chi_20 -> ~d_L      db)
     1.57686360E-02    2    -1000001         1   # BR(~chi_20 -> ~d_L*     d )
     1.60058406E-02    2     1000004        -4   # BR(~chi_20 -> ~c_L      cb)
     1.60058406E-02    2    -1000004         4   # BR(~chi_20 -> ~c_L*     c )
     1.57686360E-02    2     1000003        -3   # BR(~chi_20 -> ~s _L      sb)
     1.57686360E-02    2    -1000003         3   # BR(~chi_20 -> ~s _L*     s )
     3.08602415E-02    2     1000006        -6   # BR(~chi_20 -> ~t_1      tb)
     3.08602415E-02    2    -1000006         6   # BR(~chi_20 -> ~t_1*     t )
     3.93190439E-02    2     2000006        -6   # BR(~chi_20 -> ~t_2      tb)
     3.93190439E-02    2    -2000006         6   # BR(~chi_20 -> ~t_2*     t )
     3.96727406E-02    2     1000005        -5   # BR(~chi_20 -> ~b_1      bb)
     3.96727406E-02    2    -1000005         5   # BR(~chi_20 -> ~b_1*     b )
     8.15365250E-02    2     1000011       -11   # BR(~chi_20 -> ~e_L-     e+)
     8.15365250E-02    2    -1000011        11   # BR(~chi_20 -> ~e_L+     e-)
     8.11112375E-09    2     2000011       -11   # BR(~chi_20 -> ~e_R-     e+)
     8.11112375E-09    2    -2000011        11   # BR(~chi_20 -> ~e_R+     e-)
     8.15365250E-02    2     1000013       -13   # BR(~chi_20 -> ~mu_L-    mu+)
     8.15365250E-02    2    -1000013        13   # BR(~chi_20 -> ~mu_L+    mu-)
     8.11112375E-09    2     2000013       -13   # BR(~chi_20 -> ~mu_R-    mu+)
     8.11112375E-09    2    -2000013        13   # BR(~chi_20 -> ~mu_R+    mu-)
     4.50762661E-05    2     1000015       -15   # BR(~chi_20 -> ~tau_1-   tau+)
     4.50762661E-05    2    -1000015        15   # BR(~chi_20 -> ~tau_1+   tau-)
     8.14208286E-02    2     1000012       -12   # BR(~chi_20 -> ~nu_eL    nu_eb)
     8.14208286E-02    2    -1000012        12   # BR(~chi_20 -> ~nu_eL*   nu_e )
     8.14208286E-02    2     1000014       -14   # BR(~chi_20 -> ~nu_muL   nu_mub)
     8.14208286E-02    2    -1000014        14   # BR(~chi_20 -> ~nu_muL*  nu_mu )
#
#         PDG            Width
DECAY   1000025     6.76339702E+01   # neutralino3 decays
#          BR         NDA      ID1       ID2
     7.78839324E-03    2     1000022        23   # BR(~chi_30 -> ~chi_10   Z )
     2.10101297E-02    2     1000023        23   # BR(~chi_30 -> ~chi_20   Z )
     2.11210278E-02    2     1000024       -24   # BR(~chi_30 -> ~chi_1+   W-)
     2.11210278E-02    2    -1000024        24   # BR(~chi_30 -> ~chi_1-   W+)
     1.45331533E-02    2     1000022        25   # BR(~chi_30 -> ~chi_10   h )
     6.01729542E-03    2     1000022        35   # BR(~chi_30 -> ~chi_10   H )
     4.21438651E-03    2     1000022        36   # BR(~chi_30 -> ~chi_10   A )
     1.32579554E-04    2     1000023        25   # BR(~chi_30 -> ~chi_20   h )
     4.32852022E-06    2     1000002        -2   # BR(~chi_30 -> ~u_L      ub)
     4.32852022E-06    2    -1000002         2   # BR(~chi_30 -> ~u_L*     u )
     1.10786238E-05    2     1000001        -1   # BR(~chi_30 -> ~d_L      db)
     1.10786238E-05    2    -1000001         1   # BR(~chi_30 -> ~d_L*     d )
     4.32850644E-06    2     1000004        -4   # BR(~chi_30 -> ~c_L      cb)
     4.32850644E-06    2    -1000004         4   # BR(~chi_30 -> ~c_L*     c )
     1.10786238E-05    2     1000003        -3   # BR(~chi_30 -> ~s _L      sb)
     1.10786238E-05    2    -1000003         3   # BR(~chi_30 -> ~s _L*     s )
     3.40740125E-01    2     1000006        -6   # BR(~chi_30 -> ~t_1      tb)
     3.40740125E-01    2    -1000006         6   # BR(~chi_30 -> ~t_1*     t )
     1.05543017E-01    2     2000006        -6   # BR(~chi_30 -> ~t_2      tb)
     1.05543017E-01    2    -2000006         6   # BR(~chi_30 -> ~t_2*     t )
     4.22413158E-03    2     1000005        -5   # BR(~chi_30 -> ~b_1      bb)
     4.22413158E-03    2    -1000005         5   # BR(~chi_30 -> ~b_1*     b )
     1.10230558E-04    2     2000005        -5   # BR(~chi_30 -> ~b_2      bb)
     1.10230558E-04    2    -2000005         5   # BR(~chi_30 -> ~b_2*     b )
     1.11100436E-06    2     1000011       -11   # BR(~chi_30 -> ~e_L-     e+)
     1.11100436E-06    2    -1000011        11   # BR(~chi_30 -> ~e_L+     e-)
     2.97349977E-06    2     2000011       -11   # BR(~chi_30 -> ~e_R-     e+)
     2.97349977E-06    2    -2000011        11   # BR(~chi_30 -> ~e_R+     e-)
     1.11100436E-06    2     1000013       -13   # BR(~chi_30 -> ~mu_L-    mu+)
     1.11100436E-06    2    -1000013        13   # BR(~chi_30 -> ~mu_L+    mu-)
     2.97349977E-06    2     2000013       -13   # BR(~chi_30 -> ~mu_R-    mu+)
     2.97349977E-06    2    -2000013        13   # BR(~chi_30 -> ~mu_R+    mu-)
     1.30516381E-03    2     1000015       -15   # BR(~chi_30 -> ~tau_1-   tau+)
     1.30516381E-03    2    -1000015        15   # BR(~chi_30 -> ~tau_1+   tau-)
     3.46760680E-05    2     1000012       -12   # BR(~chi_30 -> ~nu_eL    nu_eb)
     3.46760680E-05    2    -1000012        12   # BR(~chi_30 -> ~nu_eL*   nu_e )
     3.46760680E-05    2     1000014       -14   # BR(~chi_30 -> ~nu_muL   nu_mub)
     3.46760680E-05    2    -1000014        14   # BR(~chi_30 -> ~nu_muL*  nu_mu )
#
#         PDG            Width
DECAY   1000035     6.82280460E+01   # neutralino4 decays
#          BR         NDA      ID1       ID2
     1.43444177E-02    2     1000022        23   # BR(~chi_40 -> ~chi_10   Z )
     1.82933314E-04    2     1000023        23   # BR(~chi_40 -> ~chi_20   Z )
     2.23103670E-02    2     1000024       -24   # BR(~chi_40 -> ~chi_1+   W-)
     2.23103670E-02    2    -1000024        24   # BR(~chi_40 -> ~chi_1-   W+)
     6.97445548E-03    2     1000022        25   # BR(~chi_40 -> ~chi_10   h )
     4.06267034E-03    2     1000022        35   # BR(~chi_40 -> ~chi_10   H )
     5.72820493E-03    2     1000022        36   # BR(~chi_40 -> ~chi_10   A )
     2.09275888E-02    2     1000023        25   # BR(~chi_40 -> ~chi_20   h )
     1.02439444E-03    2     1000002        -2   # BR(~chi_40 -> ~u_L      ub)
     1.02439444E-03    2    -1000002         2   # BR(~chi_40 -> ~u_L*     u )
     1.07732260E-03    2     1000001        -1   # BR(~chi_40 -> ~d_L      db)
     1.07732260E-03    2    -1000001         1   # BR(~chi_40 -> ~d_L*     d )
     1.02439129E-03    2     1000004        -4   # BR(~chi_40 -> ~c_L      cb)
     1.02439129E-03    2    -1000004         4   # BR(~chi_40 -> ~c_L*     c )
     1.07732260E-03    2     1000003        -3   # BR(~chi_40 -> ~s _L      sb)
     1.07732260E-03    2    -1000003         3   # BR(~chi_40 -> ~s _L*     s )
     3.45252658E-01    2     1000006        -6   # BR(~chi_40 -> ~t_1      tb)
     3.45252658E-01    2    -1000006         6   # BR(~chi_40 -> ~t_1*     t )
     8.82616723E-02    2     2000006        -6   # BR(~chi_40 -> ~t_2      tb)
     8.82616723E-02    2    -2000006         6   # BR(~chi_40 -> ~t_2*     t )
     5.66570803E-03    2     1000005        -5   # BR(~chi_40 -> ~b_1      bb)
     5.66570803E-03    2    -1000005         5   # BR(~chi_40 -> ~b_1*     b )
     1.28641103E-04    2     2000005        -5   # BR(~chi_40 -> ~b_2      bb)
     1.28641103E-04    2    -2000005         5   # BR(~chi_40 -> ~b_2*     b )
     1.55730609E-03    2     1000011       -11   # BR(~chi_40 -> ~e_L-     e+)
     1.55730609E-03    2    -1000011        11   # BR(~chi_40 -> ~e_L+     e-)
     1.55298559E-06    2     2000011       -11   # BR(~chi_40 -> ~e_R-     e+)
     1.55298559E-06    2    -2000011        11   # BR(~chi_40 -> ~e_R+     e-)
     1.55730609E-03    2     1000013       -13   # BR(~chi_40 -> ~mu_L-    mu+)
     1.55730609E-03    2    -1000013        13   # BR(~chi_40 -> ~mu_L+    mu-)
     1.55298559E-06    2     2000013       -13   # BR(~chi_40 -> ~mu_R-    mu+)
     1.55298559E-06    2    -2000013        13   # BR(~chi_40 -> ~mu_R+    mu-)
     1.25812935E-03    2     1000015       -15   # BR(~chi_40 -> ~tau_1-   tau+)
     1.25812935E-03    2    -1000015        15   # BR(~chi_40 -> ~tau_1+   tau-)
     1.84577017E-03    2     1000012       -12   # BR(~chi_40 -> ~nu_eL    nu_eb)
     1.84577017E-03    2    -1000012        12   # BR(~chi_40 -> ~nu_eL*   nu_e )
     1.84577017E-03    2     1000014       -14   # BR(~chi_40 -> ~nu_muL   nu_mub)
     1.84577017E-03    2    -1000014        14   # BR(~chi_40 -> ~nu_muL*  nu_mu )
#
#         PDG            Width
DECAY        25     4.66230624E-03   # h decays
#          BR         NDA      ID1       ID2
     6.52440416E-01    2           5        -5   # BR(h -> b       bb     )
     5.86035484E-02    2         -15        15   # BR(h -> tau+    tau-   )
     2.07800793E-04    2         -13        13   # BR(h -> mu+     mu-    )
     2.24676104E-04    2           3        -3   # BR(h -> s       sb     )
     1.85918605E-02    2           4        -4   # BR(h -> c       cb     )
     6.55190994E-02    2          21        21   # BR(h -> g       g      )
     2.03762150E-03    2          22        22   # BR(h -> gam     gam    )
     1.33487361E-03    2          22        23   # BR(h -> Z       gam    )
     1.78680602E-01    2          24       -24   # BR(h -> W+      W-     )
     2.23595021E-02    2          23        23   # BR(h -> Z       Z      )
#
#         PDG            Width
DECAY        35     9.70503126E+00   # H decays
#          BR         NDA      ID1       ID2
     2.85701636E-01    2           5        -5   # BR(H -> b       bb     )
     6.03891134E-02    2         -15        15   # BR(H -> tau+    tau-   )
     2.27627549E-04    2         -13        13   # BR(H -> mu+     mu-    )
     1.15031884E-04    2           3        -3   # BR(H -> s       sb     )
     2.58291808E-07    2           4        -4   # BR(H -> c       cb     )
     2.35971576E-02    2           6        -6   # BR(H -> t       tb     )
     3.67028089E-04    2          21        21   # BR(H -> g       g      )
     8.88371944E-07    2          22        22   # BR(H -> gam     gam    )
     2.70493177E-08    2          23        22   # BR(H -> Z       gam    )
     1.70171553E-04    2          24       -24   # BR(H -> W+      W-     )
     8.43022734E-05    2          23        23   # BR(H -> Z       Z      )
     4.84649135E-04    2          25        25   # BR(H -> h       h      )
     9.69106081E-05    2     1000022   1000022   # BR(H -> ~chi_10 ~chi_10)
     6.28706873E-01    2     1000006  -1000006   # BR(H -> ~t_1    ~t_1*  )
     6.75373849E-06    2     1000011  -1000011   # BR(H -> ~e_L-   ~e_L+  )
     6.75373849E-06    2     1000013  -1000013   # BR(H -> ~mu_L-  ~mu_L+ )
     2.24086142E-05    2     1000012  -1000012   # BR(H -> ~nu_eL  ~nu_eL*   )
     2.24086142E-05    2     1000014  -1000014   # BR(H -> ~nu_muL ~nu_muL*  )
#
#         PDG            Width
DECAY        36     3.60485418E+00   # A decays
#          BR         NDA      ID1       ID2
     7.70627019E-01    2           5        -5   # BR(A -> b       bb     )
     1.62894435E-01    2         -15        15   # BR(A -> tau+    tau-   )
     6.13995658E-04    2         -13        13   # BR(A -> mu+     mu-    )
     3.10314049E-04    2           3        -3   # BR(A -> s       sb     )
     6.65827028E-07    2           4        -4   # BR(A -> c       cb     )
     6.44323711E-02    2           6        -6   # BR(A -> t       tb     )
     3.34849037E-04    2          21        21   # BR(A -> g       g      )
     4.84871572E-07    2          22        22   # BR(A -> gam     gam    )
     2.24789018E-07    2          23        22   # BR(A -> Z       gam    )
     4.57334315E-04    2          23        25   # BR(A -> Z       h      )
     3.28306289E-04    2     1000022   1000022   # BR(A -> ~chi_10 ~chi_10)
#
#         PDG            Width
DECAY        37     2.93530824E+00   # H+ decays
#          BR         NDA      ID1       ID2
     1.22589477E-03    2           4        -5   # BR(H+ -> c       bb     )
     2.00447345E-01    2         -15        16   # BR(H+ -> tau+    nu_tau )
     7.55543288E-04    2         -13        14   # BR(H+ -> mu+     nu_mu  )
     1.22588495E-05    2           2        -5   # BR(H+ -> u       bb     )
     1.90287842E-05    2           2        -3   # BR(H+ -> u       sb     )
     3.75327126E-04    2           4        -3   # BR(H+ -> c       sb     )
     7.96424373E-01    2           6        -5   # BR(H+ -> t       bb     )
     5.67455334E-04    2          24        25   # BR(H+ -> W+      h      )
     3.13329089E-11    2          24        36   # BR(H+ -> W+      A      )
     8.63869842E-05    2    -1000011   1000012   # BR(H+ -> ~e_L+   ~nu_eL )
     8.63869842E-05    2    -1000013   1000014   # BR(H+ -> ~mu_L+  ~nu_muL)
