#
#                              ======================
#                              | THE SUSYHIT OUTPUT |
#                              ======================
#
#
#              ------------------------------------------------------
#              |     This is the output of the SUSY-HIT package     |
#              |  created by A.Djouadi, M.Muehlleitner and M.Spira. |
#              |  In case of problems with SUSY-HIT email to        |
#              |           margarete.muehlleitner@cern.ch           |
#              |           michael.spira@psi.ch                     |
#              |           abdelhak.djouadi@cern.ch                 |
#              ------------------------------------------------------
#
#              ------------------------------------------------------
#              |  SUSY Les Houches Accord - MSSM Spectrum + Decays  |
#              |              based on the decay programs           |
#              |                                                    |
#              |                     SDECAY 1.3b                    |
#              |                                                    |
#              |  Authors: M.Muhlleitner, A.Djouadi and Y.Mambrini  |
#              |  Ref.:    Comput.Phys.Commun.168(2005)46           |
#              |           [hep-ph/0311167]                         |
#              |                                                    |
#              |                     HDECAY 3.4                     |
#              |                                                    |
#              |  By: A.Djouadi,J.Kalinowski,M.Muhlleitner,M.Spira  |
#              |  Ref.:    Comput.Phys.Commun.108(1998)56           |
#              |           [hep-ph/9704448]                         |
#              |                                                    |
#              |                                                    |
#              |  If not stated otherwise all DRbar couplings and   |
#              |  soft SUSY breaking masses are given at the scale  |
#              |  Q=  0.31409910E+04
#              |                                                    |
#              ------------------------------------------------------
#
#
BLOCK DCINFO  # Decay Program information
     1   SDECAY/HDECAY # decay calculator
     2   1.3b  /3.4    # version number
#
BLOCK SPINFO  # Spectrum calculator information
     1     SOFTSUSY    # spectrum calculator               
     2     3.4.0       # version number                    
#
BLOCK MODSEL  # Model selection
     1     0   #  nonUniversal                                     
#
BLOCK SMINPUTS  # Standard Model inputs
         1     1.27908970E+02   # alpha_em^-1(M_Z)^MSbar
         2     1.16637870E-05   # G_F [GeV^-2]
         3     1.18400000E-01   # alpha_S(M_Z)^MSbar
         4     9.11876000E+01   # M_Z pole mass
         5     4.18000000E+00   # mb(mb)^MSbar
         6     1.73200000E+02   # mt pole mass
         7     1.77700000E+00   # mtau pole mass
#
BLOCK MINPAR  # Input parameters - minimal models
         3     1.65100000E+01   # tanb                
#
BLOCK EXTPAR  # Input parameters - non-minimal models
         0    -1.00000000E+00   # Set                 
         1    -5.48400000E+02   # M_1(MX)             
         2     8.89540000E+02   # M_2(MX)             
         3     3.41552000E+03   # M_3(MX)             
        11    -3.40131000E+03   # At(MX)              
        12    -7.87440000E+02   # Ab(MX)              
        13     1.56035000E+03   # Atau(MX)            
        23     1.99780000E+02   # mu(MX)              
        26     2.45080000E+03   # mA(pole)            
        31     2.49480000E+02   # meL(MX)             
        32     2.49480000E+02   # mmuL(MX)            
        33     3.09122000E+03   # mtauL(MX)           
        34     6.89080000E+02   # meR(MX)             
        35     6.89080000E+02   # mmuR(MX)            
        36     1.73686000E+03   # mtauR(MX)           
        41     3.53572000E+03   # mqL1(MX)            
        42     3.53572000E+03   # mqL2(MX)            
        43     3.54446000E+03   # mqL3(MX)            
        44     2.54862000E+03   # muR(MX)             
        45     2.54862000E+03   # mcR(MX)             
        46     2.78156000E+03   # mtR(MX)             
        47     2.18403000E+03   # mdR(MX)             
        48     2.18403000E+03   # msR(MX)             
        49     3.12094000E+03   # mbR(MX)             
#
BLOCK MASS  # Mass Spectrum
# PDG code           mass       particle
        24     8.03807903E+01   # W+
        25     1.25800139E+02   # h
        35     2.45083445E+03   # H
        36     2.45079997E+03   # A
        37     2.45236410E+03   # H+
         5     4.81876030E+00   # b-quark pole mass calculated from mb(mb)_Msbar
   1000001     3.64446462E+03   # ~d_L
   2000001     2.31753215E+03   # ~d_R
   1000002     3.64375384E+03   # ~u_L
   2000002     2.67283186E+03   # ~u_R
   1000003     3.64446462E+03   # ~s_L
   2000003     2.31753215E+03   # ~s_R
   1000004     3.64375384E+03   # ~c_L
   2000004     2.67283186E+03   # ~c_R
   1000005     3.23116320E+03   # ~b_1
   2000005     3.61620824E+03   # ~b_2
   1000006     2.83685634E+03   # ~t_1
   2000006     3.62556970E+03   # ~t_2
   1000011     2.89322441E+02   # ~e_L
   2000011     7.00502970E+02   # ~e_R
   1000012     2.78142741E+02   # ~nu_eL
   1000013     2.89322441E+02   # ~mu_L
   2000013     7.00502970E+02   # ~mu_R
   1000014     2.78142741E+02   # ~nu_muL
   1000015     1.73916790E+03   # ~tau_1
   2000015     3.09700076E+03   # ~tau_2
   1000016     3.09566547E+03   # ~nu_tauL
   1000021     3.54385585E+03   # ~g
   1000022     2.05505992E+02   # ~chi_10
   1000023    -2.08799486E+02   # ~chi_20
   1000025    -5.41468284E+02   # ~chi_30
   1000035     9.30563655E+02   # ~chi_40
   1000024     2.06797071E+02   # ~chi_1+
   1000037     9.30748293E+02   # ~chi_2+
#
BLOCK NMIX  # Neutralino Mixing Matrix
  1  1    -4.37255771E-02   # N_11
  1  2    -8.17926785E-02   # N_12
  1  3     7.09173412E-01   # N_13
  1  4    -6.98907077E-01   # N_14
  2  1     8.75643773E-02   # N_21
  2  2     4.61414546E-02   # N_22
  2  3     7.03903823E-01   # N_23
  2  4     7.03365377E-01   # N_24
  3  1     9.95194900E-01   # N_31
  3  2    -4.88394539E-03   # N_32
  3  3    -3.07048549E-02   # N_33
  3  4    -9.28464873E-02   # N_34
  4  1    -2.76857059E-03   # N_41
  4  2     9.95568717E-01   # N_42
  4  3     2.54890349E-02   # N_43
  4  4    -9.04741573E-02   # N_44
#
BLOCK UMIX  # Chargino Mixing Matrix U
  1  1    -3.60908115E-02   # U_11
  1  2     9.99348514E-01   # U_12
  2  1    -9.99348514E-01   # U_21
  2  2    -3.60908115E-02   # U_22
#
BLOCK VMIX  # Chargino Mixing Matrix V
  1  1    -1.28261947E-01   # V_11
  1  2     9.91740325E-01   # V_12
  2  1    -9.91740325E-01   # V_21
  2  2    -1.28261947E-01   # V_22
#
BLOCK STOPMIX  # Stop Mixing Matrix
  1  1     9.80421404E-02   # cos(theta_t)
  1  2     9.95182264E-01   # sin(theta_t)
  2  1    -9.95182264E-01   # -sin(theta_t)
  2  2     9.80421404E-02   # cos(theta_t)
#
BLOCK SBOTMIX  # Sbottom Mixing Matrix
  1  1     3.62871069E-03   # cos(theta_b)
  1  2     9.99993416E-01   # sin(theta_b)
  2  1    -9.99993416E-01   # -sin(theta_b)
  2  2     3.62871069E-03   # cos(theta_b)
#
BLOCK STAUMIX  # Stau Mixing Matrix
  1  1     4.60619416E-04   # cos(theta_tau)
  1  2     9.99999894E-01   # sin(theta_tau)
  2  1    -9.99999894E-01   # -sin(theta_tau)
  2  2     4.60619416E-04   # cos(theta_tau)
#
BLOCK ALPHA  # Higgs mixing
          -6.35315260E-02   # Mixing angle in the neutral Higgs boson sector
#
BLOCK HMIX Q=  3.14099100E+03  # DRbar Higgs Parameters
         1     2.02745378E+02   # mu(Q)MSSM           
         2     1.57804247E+01   # tan                 
         3     2.41591746E+02   # higgs               
         4     6.05079138E+06   # mA^2(Q)MSSM         
#
BLOCK GAUGE Q=  3.14099100E+03  # The gauge couplings
     1     3.65879483E-01   # gprime(Q) DRbar
     2     6.40902332E-01   # g(Q) DRbar
     3     1.00619847E+00   # g3(Q) DRbar
#
BLOCK AU Q=  3.14099100E+03  # The trilinear couplings
  1  1     0.00000000E+00   # A_u(Q) DRbar
  2  2     0.00000000E+00   # A_c(Q) DRbar
  3  3    -3.40130998E+03   # A_t(Q) DRbar
#
BLOCK AD Q=  3.14099100E+03  # The trilinear couplings
  1  1     0.00000000E+00   # A_d(Q) DRbar
  2  2     0.00000000E+00   # A_s(Q) DRbar
  3  3    -7.87439994E+02   # A_b(Q) DRbar
#
BLOCK AE Q=  3.14099100E+03  # The trilinear couplings
  1  1     0.00000000E+00   # A_e(Q) DRbar
  2  2     0.00000000E+00   # A_mu(Q) DRbar
  3  3     1.56035000E+03   # A_tau(Q) DRbar
#
BLOCK Yu Q=  3.14099100E+03  # The Yukawa couplings
  1  1     0.00000000E+00   # y_u(Q) DRbar
  2  2     0.00000000E+00   # y_c(Q) DRbar
  3  3     8.19081034E-01   # y_t(Q) DRbar
#
BLOCK Yd Q=  3.14099100E+03  # The Yukawa couplings
  1  1     0.00000000E+00   # y_d(Q) DRbar
  2  2     0.00000000E+00   # y_s(Q) DRbar
  3  3     2.10999369E-01   # y_b(Q) DRbar
#
BLOCK Ye Q=  3.14099100E+03  # The Yukawa couplings
  1  1     0.00000000E+00   # y_e(Q) DRbar
  2  2     0.00000000E+00   # y_mu(Q) DRbar
  3  3     1.62192030E-01   # y_tau(Q) DRbar
#
BLOCK MSOFT Q=  3.14099100E+03  # The soft SUSY breaking masses at the scale Q
         1    -5.48400000E+02   # M_1(Q)              
         2     8.89540000E+02   # M_2(Q)              
         3     3.41552000E+03   # M_3(Q)              
        21     5.95491120E+06   # mH1^2(Q)            
        22     1.99769441E+05   # mH2^2(Q)            
        31     2.49479999E+02   # meL(Q)              
        32     2.49479999E+02   # mmuL(Q)             
        33     3.09122000E+03   # mtauL(Q)            
        34     6.89080000E+02   # meR(Q)              
        35     6.89080000E+02   # mmuR(Q)             
        36     1.73686000E+03   # mtauR(Q)            
        41     3.53571999E+03   # mqL1(Q)             
        42     3.53571999E+03   # mqL2(Q)             
        43     3.54445998E+03   # mqL3(Q)             
        44     2.54861999E+03   # muR(Q)              
        45     2.54861999E+03   # mcR(Q)              
        46     2.78155996E+03   # mtR(Q)              
        47     2.18402998E+03   # mdR(Q)              
        48     2.18402998E+03   # msR(Q)              
        49     3.12093999E+03   # mbR(Q)              
#
Block HiggsBoundsInputHiggsCouplingsFermions
# ScalarNormEffCoupSq PseudoSNormEffCoupSq NP   IP1 IP2 IP2
    1.00779470E+00    0.00000000E+00        3  25   5   5  # h0-b-b eff. coupling^2, normalised to SM
    2.49014009E+02    0.00000000E+00        3  35   5   5  # H0-b-b eff. coupling^2, normalised to SM
    0.00000000E+00    2.49021804E+02        3  36   5   5  # A0-b-b eff. coupling^2, normalised to SM
#
    9.99968699E-01    0.00000000E+00        3  25   6   6  # h0-t-t eff. coupling^2, normalised to SM
    4.04701391E-03    0.00000000E+00        3  35   6   6  # H0-t-t eff. coupling^2, normalised to SM
    0.00000000E+00    4.01571262E-03        3  36   6   6  # A0-t-t eff. coupling^2, normalised to SM
#
    1.00779470E+00    0.00000000E+00        3  25  15  15  # h0-tau-tau eff. coupling^2, normalised to SM
    2.49014009E+02    0.00000000E+00        3  35  15  15  # H0-tau-tau eff. coupling^2, normalised to SM
    0.00000000E+00    2.49021804E+02        3  36  15  15  # A0-tau-tau eff. coupling^2, normalised to SM
#
Block HiggsBoundsInputHiggsCouplingsBosons
    9.99999939E-01        3  25  24  24  # h0-W-W eff. coupling^2, normalised to SM
    6.07604473E-08        3  35  24  24  # H0-W-W eff. coupling^2, normalised to SM
    0.00000000E+00        3  36  24  24  # A0-W-W eff. coupling^2, normalised to SM
#
    9.99999939E-01        3  25  23  23  # h0-Z-Z eff. coupling^2, normalised to SM
    6.07604473E-08        3  35  23  23  # H0-Z-Z eff. coupling^2, normalised to SM
    0.00000000E+00        3  36  23  23  # A0-Z-Z eff. coupling^2, normalised to SM
#
    8.89099593E-01        3  25  21  21  # h0-g-g eff. coupling^2, normalised to SM
    1.28670455E-13        3  35  21  21  # H0-g-g eff. coupling^2, normalised to SM
    9.85631960E-12        3  36  21  21  # A0-g-g eff. coupling^2, normalised to SM
#
    0.00000000E+00        3  25  25  23  # h0-h0-Z eff. coupling^2, normalised to SM
    0.00000000E+00        3  35  25  23  # H0-h0-Z eff. coupling^2, normalised to SM
    6.07604473E-08        3  36  25  23  # A0-h0-Z eff. coupling^2, normalised to SM
    0.00000000E+00        3  35  35  23  # H0-H0-Z eff. coupling^2, normalised to SM
    9.99999939E-01        3  36  35  23  # A0-H0-Z eff. coupling^2, normalised to SM
    0.00000000E+00        3  36  36  23  # A0-A0-Z eff. coupling^2, normalised to SM
#
    0.00000000E+00        4  25  21  21  23  # h0-g-g-Z eff. coupling^2, normalised to SM
    0.00000000E+00        4  35  21  21  23  # H0-g-g-Z eff. coupling^2, normalised to SM
    0.00000000E+00        4  36  21  21  23  # A0-g-g-Z eff. coupling^2, normalised to SM
#
#
#
#                             =================
#                             |The decay table|
#                             =================
#
# - The QCD corrections to the decays gluino -> squark  + quark
#                                     squark -> gaugino + quark_prime
#                                     squark -> squark_prime + Higgs
#                                     squark -> gluino  + quark
#   are included.
#
# - The multi-body decays for the inos, stops and sbottoms are included.
#
# - The loop induced decays for the gluino, neutralinos and stops
#   are included.
#
# - The SUSY decays of the top quark are included.
#
#
#         PDG            Width
DECAY         6     1.44703046E+00   # top decays
#          BR         NDA      ID1       ID2
     1.00000000E+00    2           5        24   # BR(t ->  b    W+)
#
#         PDG            Width
DECAY   1000021     7.72801209E+01   # gluino decays
#          BR         NDA      ID1       ID2
     1.39476699E-01    2     2000001        -1   # BR(~g -> ~d_R  db)
     1.39476699E-01    2    -2000001         1   # BR(~g -> ~d_R* d )
     7.91532613E-02    2     2000002        -2   # BR(~g -> ~u_R  ub)
     7.91532613E-02    2    -2000002         2   # BR(~g -> ~u_R* u )
     1.39476699E-01    2     2000003        -3   # BR(~g -> ~s_R  sb)
     1.39476699E-01    2    -2000003         3   # BR(~g -> ~s_R* s )
     7.91531542E-02    2     2000004        -4   # BR(~g -> ~c_R  cb)
     7.91531542E-02    2    -2000004         4   # BR(~g -> ~c_R* c )
     1.22702008E-02    2     1000005        -5   # BR(~g -> ~b_1  bb)
     1.22702008E-02    2    -1000005         5   # BR(~g -> ~b_1* b )
     5.04699848E-02    2     1000006        -6   # BR(~g -> ~t_1  tb)
     5.04699848E-02    2    -1000006         6   # BR(~g -> ~t_1* t )
#
#         PDG            Width
DECAY   1000006     8.07558738E+01   # stop1 decays
#          BR         NDA      ID1       ID2
     2.26776277E-01    2     1000022         6   # BR(~t_1 -> ~chi_10 t )
     2.28405753E-01    2     1000023         6   # BR(~t_1 -> ~chi_20 t )
     8.21121783E-02    2     1000025         6   # BR(~t_1 -> ~chi_30 t )
     4.93759959E-04    2     1000035         6   # BR(~t_1 -> ~chi_40 t )
     4.61219111E-01    2     1000024         5   # BR(~t_1 -> ~chi_1+ b )
     9.92921203E-04    2     1000037         5   # BR(~t_1 -> ~chi_2+ b )
#
#         PDG            Width
DECAY   2000006     1.06668402E+02   # stop2 decays
#          BR         NDA      ID1       ID2
     2.18411151E-01    2     1000022         6   # BR(~t_2 -> ~chi_10 t )
     2.22476606E-01    2     1000023         6   # BR(~t_2 -> ~chi_20 t )
     6.35214432E-03    2     1000025         6   # BR(~t_2 -> ~chi_30 t )
     1.26306645E-01    2     1000035         6   # BR(~t_2 -> ~chi_40 t )
     2.95859163E-02    2     1000024         5   # BR(~t_2 -> ~chi_1+ b )
     2.43856451E-01    2     1000037         5   # BR(~t_2 -> ~chi_2+ b )
     7.38385536E-02    2     1000006        25   # BR(~t_2 -> ~t_1    h )
     7.91424327E-02    2     1000006        23   # BR(~t_2 -> ~t_1    Z )
     3.01011638E-05    2     1000005        24   # BR(~t_2 -> ~b_1    W+)
#
#         PDG            Width
DECAY   1000005     7.46771214E+00   # sbottom1 decays
#          BR         NDA      ID1       ID2
     1.91909559E-01    2     1000022         5   # BR(~b_1 -> ~chi_10 b )
     1.90272309E-01    2     1000023         5   # BR(~b_1 -> ~chi_20 b )
     2.39804223E-01    2     1000025         5   # BR(~b_1 -> ~chi_30 b )
     1.02805265E-04    2     1000035         5   # BR(~b_1 -> ~chi_40 b )
     3.77705696E-01    2    -1000024         6   # BR(~b_1 -> ~chi_1- t )
     2.01325443E-04    2    -1000037         6   # BR(~b_1 -> ~chi_2- t )
     4.08248765E-06    2     1000006       -24   # BR(~b_1 -> ~t_1    W-)
#
#         PDG            Width
DECAY   2000005     1.06456620E+02   # sbottom2 decays
#          BR         NDA      ID1       ID2
     1.57583290E-02    2     1000022         5   # BR(~b_2 -> ~chi_10 b )
     1.49261593E-02    2     1000023         5   # BR(~b_2 -> ~chi_20 b )
     5.04037569E-03    2     1000025         5   # BR(~b_2 -> ~chi_30 b )
     1.20103495E-01    2     1000035         5   # BR(~b_2 -> ~chi_40 b )
     4.41163117E-01    2    -1000024         6   # BR(~b_2 -> ~chi_1- t )
     2.49013457E-01    2    -1000037         6   # BR(~b_2 -> ~chi_2- t )
     2.85548597E-03    2     1000021         5   # BR(~b_2 -> ~g      b )
     1.38949230E-05    2     1000005        25   # BR(~b_2 -> ~b_1    h )
     1.43169640E-05    2     1000005        23   # BR(~b_2 -> ~b_1    Z )
     1.51111370E-01    2     1000006       -24   # BR(~b_2 -> ~t_1    W-)
#
#         PDG            Width
DECAY   1000002     3.87767705E+01   # sup_L decays
#          BR         NDA      ID1       ID2
     2.96175684E-03    2     1000022         2   # BR(~u_L -> ~chi_10 u)
     1.43836752E-03    2     1000023         2   # BR(~u_L -> ~chi_20 u)
     1.19694956E-02    2     1000025         2   # BR(~u_L -> ~chi_30 u)
     3.18683711E-01    2     1000035         2   # BR(~u_L -> ~chi_40 u)
     1.19995420E-02    2     1000024         1   # BR(~u_L -> ~chi_1+ d)
     6.33110314E-01    2     1000037         1   # BR(~u_L -> ~chi_2+ d)
     1.98368127E-02    2     1000021         2   # BR(~u_L -> ~g      u)
#
#         PDG            Width
DECAY   2000002     5.77474480E+00   # sup_R decays
#          BR         NDA      ID1       ID2
     2.04968523E-03    2     1000022         2   # BR(~u_R -> ~chi_10 u)
     8.21698371E-03    2     1000023         2   # BR(~u_R -> ~chi_20 u)
     9.89726888E-01    2     1000025         2   # BR(~u_R -> ~chi_30 u)
     6.44327293E-06    2     1000035         2   # BR(~u_R -> ~chi_40 u)
#
#         PDG            Width
DECAY   1000001     3.87403264E+01   # sdown_L decays
#          BR         NDA      ID1       ID2
     1.97105159E-03    2     1000022         1   # BR(~d_L -> ~chi_10 d)
     3.17236869E-04    2     1000023         1   # BR(~d_L -> ~chi_20 d)
     1.32854664E-02    2     1000025         1   # BR(~d_L -> ~chi_30 d)
     3.19731856E-01    2     1000035         1   # BR(~d_L -> ~chi_40 d)
     9.51143954E-04    2    -1000024         2   # BR(~d_L -> ~chi_1- u)
     6.43612021E-01    2    -1000037         2   # BR(~d_L -> ~chi_2- u)
     2.01312247E-02    2     1000021         1   # BR(~d_L -> ~g      d)
#
#         PDG            Width
DECAY   2000001     1.22772246E+00   # sdown_R decays
#          BR         NDA      ID1       ID2
     2.09999234E-03    2     1000022         1   # BR(~d_R -> ~chi_10 d)
     8.41758960E-03    2     1000023         1   # BR(~d_R -> ~chi_20 d)
     9.89476379E-01    2     1000025         1   # BR(~d_R -> ~chi_30 d)
     6.03871104E-06    2     1000035         1   # BR(~d_R -> ~chi_40 d)
#
#         PDG            Width
DECAY   1000004     4.01915127E+01   # scharm_L decays
#          BR         NDA      ID1       ID2
     2.98888854E-03    2     1000022         4   # BR(~c_L -> ~chi_10 c)
     1.45151652E-03    2     1000023         4   # BR(~c_L -> ~chi_20 c)
     1.20579888E-02    2     1000025         4   # BR(~c_L -> ~chi_30 c)
     3.20477851E-01    2     1000035         4   # BR(~c_L -> ~chi_40 c)
     1.21093807E-02    2     1000024         3   # BR(~c_L -> ~chi_1+ s)
     6.36674376E-01    2     1000037         3   # BR(~c_L -> ~chi_2+ s)
     1.42399985E-02    2     1000021         4   # BR(~c_L -> ~g      c)
#
#         PDG            Width
DECAY   2000004     5.82284105E+00   # scharm_R decays
#          BR         NDA      ID1       ID2
     2.05310606E-03    2     1000022         4   # BR(~c_R -> ~chi_10 c)
     8.23053961E-03    2     1000023         4   # BR(~c_R -> ~chi_20 c)
     9.89709922E-01    2     1000025         4   # BR(~c_R -> ~chi_30 c)
     6.43233638E-06    2     1000035         4   # BR(~c_R -> ~chi_40 c)
#
#         PDG            Width
DECAY   1000003     4.01495526E+01   # sstrange_L decays
#          BR         NDA      ID1       ID2
     1.98936276E-03    2     1000022         3   # BR(~s_L -> ~chi_10 s)
     3.20177967E-04    2     1000023         3   # BR(~s_L -> ~chi_20 s)
     1.33854014E-02    2     1000025         3   # BR(~s_L -> ~chi_30 s)
     3.21572936E-01    2     1000035         3   # BR(~s_L -> ~chi_40 s)
     9.59972828E-04    2    -1000024         4   # BR(~s_L -> ~chi_1- c)
     6.47317392E-01    2    -1000037         4   # BR(~s_L -> ~chi_2- c)
     1.44547570E-02    2     1000021         3   # BR(~s_L -> ~g      s)
#
#         PDG            Width
DECAY   2000003     1.22710193E+00   # sstrange_R decays
#          BR         NDA      ID1       ID2
     2.10355136E-03    2     1000022         3   # BR(~s_R -> ~chi_10 s)
     8.43168749E-03    2     1000023         3   # BR(~s_R -> ~chi_20 s)
     9.89458734E-01    2     1000025         3   # BR(~s_R -> ~chi_30 s)
     6.02750888E-06    2     1000035         3   # BR(~s_R -> ~chi_40 s)
#
#         PDG            Width
DECAY   1000011     6.55232245E-03   # selectron_L decays
#          BR         NDA      ID1       ID2
     5.04760058E-01    2     1000022        11   # BR(~e_L -> ~chi_10 e-)
     3.82801946E-01    2     1000023        11   # BR(~e_L -> ~chi_20 e-)
     1.12437996E-01    2    -1000024        12   # BR(~e_L -> ~chi_1- nu_e)
#
#         PDG            Width
DECAY   2000011     6.28437548E-01   # selectron_R decays
#          BR         NDA      ID1       ID2
     9.48168161E-03    2     1000022        11   # BR(~e_R -> ~chi_10 e-)
     3.77939611E-02    2     1000023        11   # BR(~e_R -> ~chi_20 e-)
     9.52724357E-01    2     1000025        11   # BR(~e_R -> ~chi_30 e-)
#
#         PDG            Width
DECAY   1000013     6.55231595E-03   # smuon_L decays
#          BR         NDA      ID1       ID2
     5.04760011E-01    2     1000022        13   # BR(~mu_L -> ~chi_10 mu-)
     3.82801881E-01    2     1000023        13   # BR(~mu_L -> ~chi_20 mu-)
     1.12438107E-01    2    -1000024        14   # BR(~mu_L -> ~chi_1- nu_mu)
#
#         PDG            Width
DECAY   2000013     6.28437378E-01   # smuon_R decays
#          BR         NDA      ID1       ID2
     9.48168366E-03    2     1000022        13   # BR(~mu_R -> ~chi_10 mu-)
     3.77939693E-02    2     1000023        13   # BR(~mu_R -> ~chi_20 mu-)
     9.52724347E-01    2     1000025        13   # BR(~mu_R -> ~chi_30 mu-)
#
#         PDG            Width
DECAY   1000015     9.33687991E+00   # stau_1 decays
#          BR         NDA      ID1       ID2
     4.95259225E-02    2     1000022        15   # BR(~tau_1 -> ~chi_10  tau-)
     5.43179900E-02    2     1000023        15   # BR(~tau_1 -> ~chi_20  tau-)
     8.01429826E-01    2     1000025        15   # BR(~tau_1 -> ~chi_30  tau-)
     3.29996188E-05    2     1000035        15   # BR(~tau_1 -> ~chi_40  tau-)
     9.46349571E-02    2    -1000024        16   # BR(~tau_1 -> ~chi_1-  nu_tau)
     5.83051611E-05    2    -1000037        16   # BR(~tau_1 -> ~chi_2-  nu_tau)
#
#         PDG            Width
DECAY   2000015     3.69337019E+01   # stau_2 decays
#          BR         NDA      ID1       ID2
     2.57409453E-02    2     1000022        15   # BR(~tau_2 -> ~chi_10  tau-)
     2.46822970E-02    2     1000023        15   # BR(~tau_2 -> ~chi_20  tau-)
     1.02193624E-01    2     1000025        15   # BR(~tau_2 -> ~chi_30  tau-)
     2.80168646E-01    2     1000035        15   # BR(~tau_2 -> ~chi_40  tau-)
     8.78892947E-04    2    -1000024        16   # BR(~tau_2 -> ~chi_1-  nu_tau)
     5.66301260E-01    2    -1000037        16   # BR(~tau_2 -> ~chi_2-  nu_tau)
     1.66258625E-05    2     1000015        25   # BR(~tau_2 -> ~tau_1   h)
     1.77092267E-05    2     1000015        23   # BR(~tau_2 -> ~tau_1   Z)
#
#         PDG            Width
DECAY   1000012     8.23861466E-03   # snu_eL decays
#          BR         NDA      ID1       ID2
     9.18677271E-02    2     1000022        12   # BR(~nu_eL -> ~chi_10 nu_e)
     3.88988730E-04    2     1000023        12   # BR(~nu_eL -> ~chi_20 nu_e)
     9.07743284E-01    2     1000024        11   # BR(~nu_eL -> ~chi_1+ e-)
#
#         PDG            Width
DECAY   1000014     8.23860387E-03   # snu_muL decays
#          BR         NDA      ID1       ID2
     9.18678474E-02    2     1000022        14   # BR(~nu_muL -> ~chi_10 nu_mu)
     3.88989239E-04    2     1000023        14   # BR(~nu_muL -> ~chi_20 nu_mu)
     9.07743163E-01    2     1000024        13   # BR(~nu_muL -> ~chi_1+ mu-)
#
#         PDG            Width
DECAY   1000016     3.69547380E+01   # snu_tauL decays
#          BR         NDA      ID1       ID2
     1.09570850E-03    2     1000022        16   # BR(~nu_tauL -> ~chi_10 nu_tau)
     5.02058620E-06    2     1000023        16   # BR(~nu_tauL -> ~chi_20 nu_tau)
     1.05614261E-01    2     1000025        16   # BR(~nu_tauL -> ~chi_30 nu_tau)
     2.81595432E-01    2     1000035        16   # BR(~nu_tauL -> ~chi_40 nu_tau)
     5.45509695E-02    2     1000024        15   # BR(~nu_tauL -> ~chi_1+ tau-)
     5.57104280E-01    2     1000037        15   # BR(~nu_tauL -> ~chi_2+ tau-)
     3.43290414E-05    2    -1000015       -24   # BR(~nu_tauL -> ~tau_1+ W-)
#
#         PDG            Width
DECAY   1000024     2.43774744E-12   # chargino1+ decays
#           BR         NDA      ID1       ID2       ID3
     5.99536593E-01    3     1000022         2        -1   # BR(~chi_1+ -> ~chi_10 u    db)
     2.00231704E-01    3     1000022       -11        12   # BR(~chi_1+ -> ~chi_10 e+   nu_e)
     2.00231704E-01    3     1000022       -13        14   # BR(~chi_1+ -> ~chi_10 mu+  nu_mu)
#
#         PDG            Width
DECAY   1000037     2.00748749E+01   # chargino2+ decays
#          BR         NDA      ID1       ID2
     1.54527595E-01    2     1000012       -11   # BR(~chi_2+ -> ~nu_eL   e+  )
     1.54527595E-01    2     1000014       -13   # BR(~chi_2+ -> ~nu_muL mu+ )
     1.54394256E-01    2    -1000011        12   # BR(~chi_2+ -> ~e_L+    nu_e)
     1.54394256E-01    2    -1000013        14   # BR(~chi_2+ -> ~mu_L+   nu_mu)
     9.74929370E-02    2     1000024        23   # BR(~chi_2+ -> ~chi_1+  Z )
     9.48678721E-02    2     1000022        24   # BR(~chi_2+ -> ~chi_10  W+)
     9.58135819E-02    2     1000023        24   # BR(~chi_2+ -> ~chi_20  W+)
     3.12416321E-04    2     1000025        24   # BR(~chi_2+ -> ~chi_30  W+)
     9.36694900E-02    2     1000024        25   # BR(~chi_2+ -> ~chi_1+  h )
#
#         PDG            Width
DECAY   1000022     0.00000000E+00   # neutralino1 decays
#
#         PDG            Width
DECAY   1000023     4.34680954E-10   # neutralino2 decays
#          BR         NDA      ID1       ID2
     1.21327382E-01    2     1000022        22   # BR(~chi_20 -> ~chi_10 gam)
#           BR         NDA      ID1       ID2       ID3
     1.03417669E-01    3     1000022        -2         2   # BR(~chi_20 -> ~chi_10 ub      u)
     1.34222106E-01    3     1000022        -1         1   # BR(~chi_20 -> ~chi_10 db      d)
     1.03417669E-01    3     1000022        -4         4   # BR(~chi_20 -> ~chi_10 cb      c)
     1.34222106E-01    3     1000022        -3         3   # BR(~chi_20 -> ~chi_10 sb      s)
     3.07192433E-02    3     1000022       -11        11   # BR(~chi_20 -> ~chi_10 e+      e-)
     3.07192433E-02    3     1000022       -13        13   # BR(~chi_20 -> ~chi_10 mu+     mu-)
     6.16238725E-02    3     1000022       -12        12   # BR(~chi_20 -> ~chi_10 nu_eb   nu_e)
     6.16238725E-02    3     1000022       -14        14   # BR(~chi_20 -> ~chi_10 nu_mub  nu_mu)
     6.16288050E-02    3     1000022       -16        16   # BR(~chi_20 -> ~chi_10 nu_taub nu_tau)
     2.94468742E-02    3     1000024        -2         1   # BR(~chi_20 -> ~chi_1+ ub      d)
     2.94468742E-02    3    -1000024        -1         2   # BR(~chi_20 -> ~chi_1- db      u)
     2.94468742E-02    3     1000024        -4         3   # BR(~chi_20 -> ~chi_1+ cb      s)
     2.94468742E-02    3    -1000024        -3         4   # BR(~chi_20 -> ~chi_1- sb      c)
     9.80926394E-03    3     1000024       -12        11   # BR(~chi_20 -> ~chi_1+ nu_eb   e-)
     9.80926394E-03    3    -1000024        12       -11   # BR(~chi_20 -> ~chi_1- nu_e    e+)
     9.80926394E-03    3     1000024       -14        13   # BR(~chi_20 -> ~chi_1+ nu_mub  mu-)
     9.80926394E-03    3    -1000024        14       -13   # BR(~chi_20 -> ~chi_1- nu_mu   mu+)
     2.67393188E-05    3     1000024       -16        15   # BR(~chi_20 -> ~chi_1+ nu_taub tau-)
     2.67393188E-05    3    -1000024        16       -15   # BR(~chi_20 -> ~chi_1- nu_tau  tau+)
#
#         PDG            Width
DECAY   1000025     2.64526121E+00   # neutralino3 decays
#          BR         NDA      ID1       ID2
     8.39146979E-02    2     1000022        23   # BR(~chi_30 -> ~chi_10   Z )
     2.49078196E-02    2     1000023        23   # BR(~chi_30 -> ~chi_20   Z )
     1.08364447E-01    2     1000024       -24   # BR(~chi_30 -> ~chi_1+   W-)
     1.08364447E-01    2    -1000024        24   # BR(~chi_30 -> ~chi_1-   W+)
     2.00819456E-02    2     1000022        25   # BR(~chi_30 -> ~chi_10   h )
     8.58317462E-02    2     1000023        25   # BR(~chi_30 -> ~chi_20   h )
     6.77271510E-02    2     1000011       -11   # BR(~chi_30 -> ~e_L-     e+)
     6.77271510E-02    2    -1000011        11   # BR(~chi_30 -> ~e_L+     e-)
     6.77271510E-02    2     1000013       -13   # BR(~chi_30 -> ~mu_L-    mu+)
     6.77271510E-02    2    -1000013        13   # BR(~chi_30 -> ~mu_L+    mu-)
     7.44065729E-02    2     1000012       -12   # BR(~chi_30 -> ~nu_eL    nu_eb)
     7.44065729E-02    2    -1000012        12   # BR(~chi_30 -> ~nu_eL*   nu_e )
     7.44065729E-02    2     1000014       -14   # BR(~chi_30 -> ~nu_muL   nu_mub)
     7.44065729E-02    2    -1000014        14   # BR(~chi_30 -> ~nu_muL*  nu_mu )
#
#         PDG            Width
DECAY   1000035     2.00725168E+01   # neutralino4 decays
#          BR         NDA      ID1       ID2
     2.32642169E-02    2     1000022        23   # BR(~chi_40 -> ~chi_10   Z )
     7.34559094E-02    2     1000023        23   # BR(~chi_40 -> ~chi_20   Z )
     2.94859538E-04    2     1000025        23   # BR(~chi_40 -> ~chi_30   Z )
     9.64543596E-02    2     1000024       -24   # BR(~chi_40 -> ~chi_1+   W-)
     9.64543596E-02    2    -1000024        24   # BR(~chi_40 -> ~chi_1-   W+)
     7.01642590E-02    2     1000022        25   # BR(~chi_40 -> ~chi_10   h )
     2.20780116E-02    2     1000023        25   # BR(~chi_40 -> ~chi_20   h )
     1.32012420E-05    2     1000025        25   # BR(~chi_40 -> ~chi_30   h )
     7.63585434E-02    2     1000011       -11   # BR(~chi_40 -> ~e_L-     e+)
     7.63585434E-02    2    -1000011        11   # BR(~chi_40 -> ~e_L+     e-)
     1.77707432E-07    2     2000011       -11   # BR(~chi_40 -> ~e_R-     e+)
     1.77707432E-07    2    -2000011        11   # BR(~chi_40 -> ~e_R+     e-)
     7.63585434E-02    2     1000013       -13   # BR(~chi_40 -> ~mu_L-    mu+)
     7.63585434E-02    2    -1000013        13   # BR(~chi_40 -> ~mu_L+    mu-)
     1.77707432E-07    2     2000013       -13   # BR(~chi_40 -> ~mu_R-    mu+)
     1.77707432E-07    2    -2000013        13   # BR(~chi_40 -> ~mu_R+    mu-)
     7.80964847E-02    2     1000012       -12   # BR(~chi_40 -> ~nu_eL    nu_eb)
     7.80964847E-02    2    -1000012        12   # BR(~chi_40 -> ~nu_eL*   nu_e )
     7.80964847E-02    2     1000014       -14   # BR(~chi_40 -> ~nu_muL   nu_mub)
     7.80964847E-02    2    -1000014        14   # BR(~chi_40 -> ~nu_muL*  nu_mu )
#
#         PDG            Width
DECAY        25     4.17617271E-03   # h decays
#          BR         NDA      ID1       ID2
     5.86529794E-01    2           5        -5   # BR(h -> b       bb     )
     6.28400656E-02    2         -15        15   # BR(h -> tau+    tau-   )
     2.22394805E-04    2         -13        13   # BR(h -> mu+     mu-    )
     2.42467621E-04    2           3        -3   # BR(h -> s       sb     )
     2.08737590E-02    2           4        -4   # BR(h -> c       cb     )
     7.78761687E-02    2          21        21   # BR(h -> g       g      )
     2.31027441E-03    2          22        22   # BR(h -> gam     gam    )
     1.60508844E-03    2          22        23   # BR(h -> Z       gam    )
     2.19758918E-01    2          24       -24   # BR(h -> W+      W-     )
     2.77410700E-02    2          23        23   # BR(h -> Z       Z      )
#
#         PDG            Width
DECAY        35     3.40634719E+01   # H decays
#          BR         NDA      ID1       ID2
     2.06910671E-01    2           5        -5   # BR(H -> b       bb     )
     3.69647497E-02    2         -15        15   # BR(H -> tau+    tau-   )
     1.25795309E-04    2         -13        13   # BR(H -> mu+     mu-    )
     8.29921157E-05    2           3        -3   # BR(H -> s       sb     )
     1.22791410E-07    2           4        -4   # BR(H -> c       cb     )
     1.19985826E-02    2           6        -6   # BR(H -> t       tb     )
     3.53662553E-06    2          21        21   # BR(H -> g       g      )
     1.22826444E-07    2          22        22   # BR(H -> gam     gam    )
     6.38880981E-09    2          23        22   # BR(H -> Z       gam    )
     8.41852854E-06    2          24       -24   # BR(H -> W+      W-     )
     4.19722587E-06    2          23        23   # BR(H -> Z       Z      )
     3.13778331E-05    2          25        25   # BR(H -> h       h      )
     9.22485390E-03    2     1000024  -1000024   # BR(H -> ~chi_1+ ~chi_1-)
     1.27766742E-04    2     1000037  -1000037   # BR(H -> ~chi_2+ ~chi_2-)
     2.17697786E-01    2     1000024  -1000037   # BR(H -> ~chi_1+ ~chi_2-)
     2.17697786E-01    2     1000037  -1000024   # BR(H -> ~chi_2+ ~chi_1-)
     8.76536595E-04    2     1000022   1000022   # BR(H -> ~chi_10 ~chi_10)
     1.91262423E-07    2     1000023   1000023   # BR(H -> ~chi_20 ~chi_20)
     1.70223131E-04    2     1000025   1000025   # BR(H -> ~chi_30 ~chi_30)
     6.48009445E-05    2     1000035   1000035   # BR(H -> ~chi_40 ~chi_40)
     5.85304910E-04    2     1000022   1000023   # BR(H -> ~chi_10 ~chi_20)
     3.55458485E-02    2     1000022   1000025   # BR(H -> ~chi_10 ~chi_30)
     8.83896678E-02    2     1000022   1000035   # BR(H -> ~chi_10 ~chi_40)
     4.21322405E-02    2     1000023   1000025   # BR(H -> ~chi_20 ~chi_30)
     1.30824772E-01    2     1000023   1000035   # BR(H -> ~chi_20 ~chi_40)
     5.19168355E-04    2     1000025   1000035   # BR(H -> ~chi_30 ~chi_40)
     1.29681787E-06    2     1000011  -1000011   # BR(H -> ~e_L-   ~e_L+  )
     7.09435996E-07    2     2000011  -2000011   # BR(H -> ~e_R-   ~e_R+  )
     1.29681787E-06    2     1000013  -1000013   # BR(H -> ~mu_L-  ~mu_L+ )
     7.09435996E-07    2     2000013  -2000013   # BR(H -> ~mu_R-  ~mu_R+ )
     4.23410652E-06    2     1000012  -1000012   # BR(H -> ~nu_eL  ~nu_eL*   )
     4.23410652E-06    2     1000014  -1000014   # BR(H -> ~nu_muL ~nu_muL*  )
#
#         PDG            Width
DECAY        36     3.40632005E+01   # A decays
#          BR         NDA      ID1       ID2
     2.06940384E-01    2           5        -5   # BR(A -> b       bb     )
     3.69657616E-02    2         -15        15   # BR(A -> tau+    tau-   )
     1.25798565E-04    2         -13        13   # BR(A -> mu+     mu-    )
     8.30178697E-05    2           3        -3   # BR(A -> s       sb     )
     1.22966059E-07    2           4        -4   # BR(A -> c       cb     )
     1.20666280E-02    2           6        -6   # BR(A -> t       tb     )
     3.09513854E-05    2          21        21   # BR(A -> g       g      )
     1.79267457E-07    2          22        22   # BR(A -> gam     gam    )
     2.83312446E-08    2          23        22   # BR(A -> Z       gam    )
     8.51308920E-06    2          23        25   # BR(A -> Z       h      )
     1.01934779E-02    2     1000024  -1000024   # BR(A -> ~chi_1+ ~chi_1-)
     7.62393928E-04    2     1000037  -1000037   # BR(A -> ~chi_2+ ~chi_2-)
     2.16874137E-01    2     1000024  -1000037   # BR(A -> ~chi_1+ ~chi_2-)
     2.16874137E-01    2     1000037  -1000024   # BR(A -> ~chi_2+ ~chi_1-)
     1.15885254E-03    2     1000022   1000022   # BR(A -> ~chi_10 ~chi_10)
     1.52787000E-07    2     1000023   1000023   # BR(A -> ~chi_20 ~chi_20)
     9.72243405E-05    2     1000025   1000025   # BR(A -> ~chi_30 ~chi_30)
     3.83204994E-04    2     1000035   1000035   # BR(A -> ~chi_40 ~chi_40)
     4.43935447E-04    2     1000022   1000023   # BR(A -> ~chi_10 ~chi_20)
     4.24276483E-02    2     1000022   1000025   # BR(A -> ~chi_10 ~chi_30)
     1.31810757E-01    2     1000022   1000035   # BR(A -> ~chi_10 ~chi_40)
     3.53954455E-02    2     1000023   1000025   # BR(A -> ~chi_20 ~chi_30)
     8.70925772E-02    2     1000023   1000035   # BR(A -> ~chi_20 ~chi_40)
     2.64670584E-04    2     1000025   1000035   # BR(A -> ~chi_30 ~chi_40)
#
#         PDG            Width
DECAY        37     3.38472258E+01   # H+ decays
#          BR         NDA      ID1       ID2
     3.41276624E-04    2           4        -5   # BR(H+ -> c       bb     )
     3.72253779E-02    2         -15        16   # BR(H+ -> tau+    nu_tau )
     1.26682067E-04    2         -13        14   # BR(H+ -> mu+     nu_mu  )
     3.41275837E-06    2           2        -5   # BR(H+ -> u       bb     )
     4.17729492E-06    2           2        -3   # BR(H+ -> u       sb     )
     8.23404879E-05    2           4        -3   # BR(H+ -> c       sb     )
     2.14464615E-01    2           6        -5   # BR(H+ -> t       bb     )
     8.59197291E-06    2          24        25   # BR(H+ -> W+      h      )
     3.63806461E-13    2          24        36   # BR(H+ -> W+      A      )
     1.41366032E-03    2     1000024   1000022   # BR(H+ -> ~chi_1+ ~chi_10)
     4.94416583E-03    2     1000024   1000023   # BR(H+ -> ~chi_1+ ~chi_20)
     7.54377661E-02    2     1000024   1000025   # BR(H+ -> ~chi_1+ ~chi_30)
     2.20570789E-01    2     1000024   1000035   # BR(H+ -> ~chi_1+ ~chi_40)
     2.25557041E-01    2     1000037   1000022   # BR(H+ -> ~chi_2+ ~chi_10)
     2.19025871E-01    2     1000037   1000023   # BR(H+ -> ~chi_2+ ~chi_20)
     7.83995729E-04    2     1000037   1000025   # BR(H+ -> ~chi_2+ ~chi_30)
     2.59152543E-09    2     1000037   1000035   # BR(H+ -> ~chi_2+ ~chi_40)
     5.11685536E-06    2    -1000011   1000012   # BR(H+ -> ~e_L+   ~nu_eL )
     5.11685536E-06    2    -1000013   1000014   # BR(H+ -> ~mu_L+  ~nu_muL)
