#
#                              ======================
#                              | THE SUSYHIT OUTPUT |
#                              ======================
#
#
#              ------------------------------------------------------
#              |     This is the output of the SUSY-HIT package     |
#              |  created by A.Djouadi, M.Muehlleitner and M.Spira. |
#              |  In case of problems with SUSY-HIT email to        |
#              |           margarete.muehlleitner@cern.ch           |
#              |           michael.spira@psi.ch                     |
#              |           abdelhak.djouadi@cern.ch                 |
#              ------------------------------------------------------
#
#              ------------------------------------------------------
#              |  SUSY Les Houches Accord - MSSM Spectrum + Decays  |
#              |              based on the decay programs           |
#              |                                                    |
#              |                     SDECAY 1.3b                    |
#              |                                                    |
#              |  Authors: M.Muhlleitner, A.Djouadi and Y.Mambrini  |
#              |  Ref.:    Comput.Phys.Commun.168(2005)46           |
#              |           [hep-ph/0311167]                         |
#              |                                                    |
#              |                     HDECAY 3.4                     |
#              |                                                    |
#              |  By: A.Djouadi,J.Kalinowski,M.Muhlleitner,M.Spira  |
#              |  Ref.:    Comput.Phys.Commun.108(1998)56           |
#              |           [hep-ph/9704448]                         |
#              |                                                    |
#              |                                                    |
#              |  If not stated otherwise all DRbar couplings and   |
#              |  soft SUSY breaking masses are given at the scale  |
#              |  Q=  0.24012840E+04
#              |                                                    |
#              ------------------------------------------------------
#
#
BLOCK DCINFO  # Decay Program information
     1   SDECAY/HDECAY # decay calculator
     2   1.3b  /3.4    # version number
#
BLOCK SPINFO  # Spectrum calculator information
     1     SOFTSUSY    # spectrum calculator               
     2     3.4.0       # version number                    
#
BLOCK MODSEL  # Model selection
     1     0   #  nonUniversal                                     
#
BLOCK SMINPUTS  # Standard Model inputs
         1     1.27908970E+02   # alpha_em^-1(M_Z)^MSbar
         2     1.16637870E-05   # G_F [GeV^-2]
         3     1.18400000E-01   # alpha_S(M_Z)^MSbar
         4     9.11876000E+01   # M_Z pole mass
         5     4.18000000E+00   # mb(mb)^MSbar
         6     1.73200000E+02   # mt pole mass
         7     1.77700000E+00   # mtau pole mass
#
BLOCK MINPAR  # Input parameters - minimal models
         3     4.77500000E+01   # tanb                
#
BLOCK EXTPAR  # Input parameters - non-minimal models
         0    -1.00000000E+00   # Set                 
         1    -3.01857000E+03   # M_1(MX)             
         2     1.29388000E+03   # M_2(MX)             
         3     3.75379000E+03   # M_3(MX)             
        11    -7.93789000E+03   # At(MX)              
        12    -3.29691000E+03   # Ab(MX)              
        13     3.49399000E+03   # Atau(MX)            
        23     2.13080000E+02   # mu(MX)              
        26     3.79170000E+03   # mA(pole)            
        31     2.40912000E+03   # meL(MX)             
        32     2.40912000E+03   # mmuL(MX)            
        33     3.96937000E+03   # mtauL(MX)           
        34     3.50630000E+03   # meR(MX)             
        35     3.50630000E+03   # mmuR(MX)            
        36     3.88943000E+03   # mtauR(MX)           
        41     9.39850000E+02   # mqL1(MX)            
        42     9.39850000E+02   # mqL2(MX)            
        43     1.52026000E+03   # mqL3(MX)            
        44     2.47917000E+03   # muR(MX)             
        45     2.47917000E+03   # mcR(MX)             
        46     3.84470000E+03   # mtR(MX)             
        47     2.22438000E+03   # mdR(MX)             
        48     2.22438000E+03   # msR(MX)             
        49     1.99379000E+03   # mbR(MX)             
#
BLOCK MASS  # Mass Spectrum
# PDG code           mass       particle
        24     8.03602843E+01   # W+
        25     1.25461512E+02   # h
        35     3.79171302E+03   # H
        36     3.79170052E+03   # A
        37     3.79330041E+03   # H+
         5     4.81876030E+00   # b-quark pole mass calculated from mb(mb)_Msbar
   1000001     1.02852151E+03   # ~d_L
   2000001     2.30214442E+03   # ~d_R
   1000002     1.02561285E+03   # ~u_L
   2000002     2.55966233E+03   # ~u_R
   1000003     1.02852151E+03   # ~s_L
   2000003     2.30214442E+03   # ~s_R
   1000004     1.02561285E+03   # ~c_L
   2000004     2.55966233E+03   # ~c_R
   1000005     1.57705863E+03   # ~b_1
   2000005     2.05521118E+03   # ~b_2
   1000006     1.54698143E+03   # ~t_1
   2000006     3.81084779E+03   # ~t_2
   1000011     2.41902773E+03   # ~e_L
   2000011     3.51332632E+03   # ~e_R
   1000012     2.41749799E+03   # ~nu_eL
   1000013     2.41902773E+03   # ~mu_L
   2000013     3.51332632E+03   # ~mu_R
   1000014     2.41749799E+03   # ~nu_muL
   1000015     3.89291157E+03   # ~tau_1
   2000015     3.97659061E+03   # ~tau_2
   1000016     3.97550033E+03   # ~nu_tauL
   1000021     3.72229340E+03   # ~g
   1000022     2.20683376E+02   # ~chi_10
   1000023    -2.25472285E+02   # ~chi_20
   1000025     1.30589970E+03   # ~chi_30
   1000035    -2.99912121E+03   # ~chi_40
   1000024     2.22866520E+02   # ~chi_1+
   1000037     1.30606983E+03   # ~chi_2+
#
BLOCK NMIX  # Neutralino Mixing Matrix
  1  1    -9.38153034E-03   # N_11
  1  2    -5.22442358E-02   # N_12
  1  3     7.10521598E-01   # N_13
  1  4    -7.01670568E-01   # N_14
  2  1     1.05202040E-02   # N_21
  2  2     3.60758167E-02   # N_22
  2  3     7.03576706E-01   # N_23
  2  4     7.09625027E-01   # N_24
  3  1    -5.96300560E-04   # N_31
  3  2     9.97982465E-01   # N_32
  3  3     1.17620839E-02   # N_33
  3  4    -6.23882836E-02   # N_34
  4  1     9.99900473E-01   # N_41
  4  2    -2.74585660E-04   # N_42
  4  3    -7.29049371E-04   # N_43
  4  4    -1.40867479E-02   # N_44
#
BLOCK UMIX  # Chargino Mixing Matrix U
  1  1    -1.66651036E-02   # U_11
  1  2     9.99861128E-01   # U_12
  2  1    -9.99861128E-01   # U_21
  2  2    -1.66651036E-02   # U_22
#
BLOCK VMIX  # Chargino Mixing Matrix V
  1  1    -8.83928061E-02   # V_11
  1  2     9.96085695E-01   # V_12
  2  1    -9.96085695E-01   # V_21
  2  2    -8.83928061E-02   # V_22
#
BLOCK STOPMIX  # Stop Mixing Matrix
  1  1     9.95314794E-01   # cos(theta_t)
  1  2     9.66874389E-02   # sin(theta_t)
  2  1    -9.66874389E-02   # -sin(theta_t)
  2  2     9.95314794E-01   # cos(theta_t)
#
BLOCK SBOTMIX  # Sbottom Mixing Matrix
  1  1     9.99843107E-01   # cos(theta_b)
  1  2     1.77133109E-02   # sin(theta_b)
  2  1    -1.77133109E-02   # -sin(theta_b)
  2  2     9.99843107E-01   # cos(theta_b)
#
BLOCK STAUMIX  # Stau Mixing Matrix
  1  1     1.83574138E-02   # cos(theta_tau)
  1  2     9.99831488E-01   # sin(theta_tau)
  2  1    -9.99831488E-01   # -sin(theta_tau)
  2  2     1.83574138E-02   # cos(theta_tau)
#
BLOCK ALPHA  # Higgs mixing
          -2.12208211E-02   # Mixing angle in the neutral Higgs boson sector
#
BLOCK HMIX Q=  2.40128400E+03  # DRbar Higgs Parameters
         1     2.17697238E+02   # mu(Q)MSSM           
         2     4.72065033E+01   # tan                 
         3     2.41330387E+02   # higgs               
         4     1.49555214E+07   # mA^2(Q)MSSM         
#
BLOCK GAUGE Q=  2.40128400E+03  # The gauge couplings
     1     3.64297640E-01   # gprime(Q) DRbar
     2     6.39525132E-01   # g(Q) DRbar
     3     1.01413378E+00   # g3(Q) DRbar
#
BLOCK AU Q=  2.40128400E+03  # The trilinear couplings
  1  1     0.00000000E+00   # A_u(Q) DRbar
  2  2     0.00000000E+00   # A_c(Q) DRbar
  3  3    -7.93788998E+03   # A_t(Q) DRbar
#
BLOCK AD Q=  2.40128400E+03  # The trilinear couplings
  1  1     0.00000000E+00   # A_d(Q) DRbar
  2  2     0.00000000E+00   # A_s(Q) DRbar
  3  3    -3.29690999E+03   # A_b(Q) DRbar
#
BLOCK AE Q=  2.40128400E+03  # The trilinear couplings
  1  1     0.00000000E+00   # A_e(Q) DRbar
  2  2     0.00000000E+00   # A_mu(Q) DRbar
  3  3     3.49399000E+03   # A_tau(Q) DRbar
#
BLOCK Yu Q=  2.40128400E+03  # The Yukawa couplings
  1  1     0.00000000E+00   # y_u(Q) DRbar
  2  2     0.00000000E+00   # y_c(Q) DRbar
  3  3     8.07480059E-01   # y_t(Q) DRbar
#
BLOCK Yd Q=  2.40128400E+03  # The Yukawa couplings
  1  1     0.00000000E+00   # y_d(Q) DRbar
  2  2     0.00000000E+00   # y_s(Q) DRbar
  3  3     6.32681904E-01   # y_b(Q) DRbar
#
BLOCK Ye Q=  2.40128400E+03  # The Yukawa couplings
  1  1     0.00000000E+00   # y_e(Q) DRbar
  2  2     0.00000000E+00   # y_mu(Q) DRbar
  3  3     4.88156397E-01   # y_tau(Q) DRbar
#
BLOCK MSOFT Q=  2.40128400E+03  # The soft SUSY breaking masses at the scale Q
         1    -3.01857000E+03   # M_1(Q)              
         2     1.29388000E+03   # M_2(Q)              
         3     3.75379000E+03   # M_3(Q)              
        21     1.46813988E+07   # mH1^2(Q)            
        22    -2.70048053E+05   # mH2^2(Q)            
        31     2.40912000E+03   # meL(Q)              
        32     2.40912000E+03   # mmuL(Q)             
        33     3.96937000E+03   # mtauL(Q)            
        34     3.50630000E+03   # meR(Q)              
        35     3.50630000E+03   # mmuR(Q)             
        36     3.88943000E+03   # mtauR(Q)            
        41     9.39849968E+02   # mqL1(Q)             
        42     9.39849968E+02   # mqL2(Q)             
        43     1.52025994E+03   # mqL3(Q)             
        44     2.47916999E+03   # muR(Q)              
        45     2.47916999E+03   # mcR(Q)              
        46     3.84469997E+03   # mtR(Q)              
        47     2.22437999E+03   # mdR(Q)              
        48     2.22437999E+03   # msR(Q)              
        49     1.99378997E+03   # mbR(Q)              
#
Block HiggsBoundsInputHiggsCouplingsFermions
# ScalarNormEffCoupSq PseudoSNormEffCoupSq NP   IP1 IP2 IP2
    1.00382425E+00    0.00000000E+00        3  25   5   5  # h0-b-b eff. coupling^2, normalised to SM
    2.22845013E+03    0.00000000E+00        3  35   5   5  # H0-b-b eff. coupling^2, normalised to SM
    0.00000000E+00    2.22845395E+03        3  36   5   5  # A0-b-b eff. coupling^2, normalised to SM
#
    9.99998284E-01    0.00000000E+00        3  25   6   6  # h0-t-t eff. coupling^2, normalised to SM
    4.50457704E-04    0.00000000E+00        3  35   6   6  # H0-t-t eff. coupling^2, normalised to SM
    0.00000000E+00    4.48741603E-04        3  36   6   6  # A0-t-t eff. coupling^2, normalised to SM
#
    1.00382425E+00    0.00000000E+00        3  25  15  15  # h0-tau-tau eff. coupling^2, normalised to SM
    2.22845013E+03    0.00000000E+00        3  35  15  15  # H0-tau-tau eff. coupling^2, normalised to SM
    0.00000000E+00    2.22845395E+03        3  36  15  15  # A0-tau-tau eff. coupling^2, normalised to SM
#
Block HiggsBoundsInputHiggsCouplingsBosons
    9.99999998E-01        3  25  24  24  # h0-W-W eff. coupling^2, normalised to SM
    1.63757121E-09        3  35  24  24  # H0-W-W eff. coupling^2, normalised to SM
    0.00000000E+00        3  36  24  24  # A0-W-W eff. coupling^2, normalised to SM
#
    9.99999998E-01        3  25  23  23  # h0-Z-Z eff. coupling^2, normalised to SM
    1.63757121E-09        3  35  23  23  # H0-Z-Z eff. coupling^2, normalised to SM
    0.00000000E+00        3  36  23  23  # A0-Z-Z eff. coupling^2, normalised to SM
#
    8.61994723E-01        3  25  21  21  # h0-g-g eff. coupling^2, normalised to SM
    1.75220868E-13        3  35  21  21  # H0-g-g eff. coupling^2, normalised to SM
    7.72469117E-13        3  36  21  21  # A0-g-g eff. coupling^2, normalised to SM
#
    0.00000000E+00        3  25  25  23  # h0-h0-Z eff. coupling^2, normalised to SM
    0.00000000E+00        3  35  25  23  # H0-h0-Z eff. coupling^2, normalised to SM
    1.63757121E-09        3  36  25  23  # A0-h0-Z eff. coupling^2, normalised to SM
    0.00000000E+00        3  35  35  23  # H0-H0-Z eff. coupling^2, normalised to SM
    9.99999998E-01        3  36  35  23  # A0-H0-Z eff. coupling^2, normalised to SM
    0.00000000E+00        3  36  36  23  # A0-A0-Z eff. coupling^2, normalised to SM
#
    0.00000000E+00        4  25  21  21  23  # h0-g-g-Z eff. coupling^2, normalised to SM
    0.00000000E+00        4  35  21  21  23  # H0-g-g-Z eff. coupling^2, normalised to SM
    0.00000000E+00        4  36  21  21  23  # A0-g-g-Z eff. coupling^2, normalised to SM
#
#
#
#                             =================
#                             |The decay table|
#                             =================
#
# - The QCD corrections to the decays gluino -> squark  + quark
#                                     squark -> gaugino + quark_prime
#                                     squark -> squark_prime + Higgs
#                                     squark -> gluino  + quark
#   are included.
#
# - The multi-body decays for the inos, stops and sbottoms are included.
#
# - The loop induced decays for the gluino, neutralinos and stops
#   are included.
#
# - The SUSY decays of the top quark are included.
#
#
#         PDG            Width
DECAY         6     1.44173597E+00   # top decays
#          BR         NDA      ID1       ID2
     1.00000000E+00    2           5        24   # BR(t ->  b    W+)
#
#         PDG            Width
DECAY   1000021     4.92379670E+02   # gluino decays
#          BR         NDA      ID1       ID2
     6.50331244E-02    2     1000001        -1   # BR(~g -> ~d_L  db)
     6.50331244E-02    2    -1000001         1   # BR(~g -> ~d_L* d )
     2.90654887E-02    2     2000001        -1   # BR(~g -> ~d_R  db)
     2.90654887E-02    2    -2000001         1   # BR(~g -> ~d_R* d )
     6.50938621E-02    2     1000002        -2   # BR(~g -> ~u_L  ub)
     6.50938621E-02    2    -1000002         2   # BR(~g -> ~u_L* u )
     2.11811901E-02    2     2000002        -2   # BR(~g -> ~u_R  ub)
     2.11811901E-02    2    -2000002         2   # BR(~g -> ~u_R* u )
     6.50331244E-02    2     1000003        -3   # BR(~g -> ~s_L  sb)
     6.50331244E-02    2    -1000003         3   # BR(~g -> ~s_L* s )
     2.90654887E-02    2     2000003        -3   # BR(~g -> ~s_R  sb)
     2.90654887E-02    2    -2000003         3   # BR(~g -> ~s_R* s )
     6.50938600E-02    2     1000004        -4   # BR(~g -> ~c_L  cb)
     6.50938600E-02    2    -1000004         4   # BR(~g -> ~c_L* c )
     2.11811765E-02    2     2000004        -4   # BR(~g -> ~c_R  cb)
     2.11811765E-02    2    -2000004         4   # BR(~g -> ~c_R* c )
     5.12856371E-02    2     1000005        -5   # BR(~g -> ~b_1  bb)
     5.12856371E-02    2    -1000005         5   # BR(~g -> ~b_1* b )
     3.68827422E-02    2     2000005        -5   # BR(~g -> ~b_2  bb)
     3.68827422E-02    2    -2000005         5   # BR(~g -> ~b_2* b )
     5.10843059E-02    2     1000006        -6   # BR(~g -> ~t_1  tb)
     5.10843059E-02    2    -1000006         6   # BR(~g -> ~t_1* t )
#
#         PDG            Width
DECAY   1000006     3.24077586E+01   # stop1 decays
#          BR         NDA      ID1       ID2
     2.84944467E-01    2     1000022         6   # BR(~t_1 -> ~chi_10 t )
     2.94998035E-01    2     1000023         6   # BR(~t_1 -> ~chi_20 t )
     1.20060735E-02    2     1000025         6   # BR(~t_1 -> ~chi_30 t )
     3.77221709E-01    2     1000024         5   # BR(~t_1 -> ~chi_1+ b )
     3.08297162E-02    2     1000037         5   # BR(~t_1 -> ~chi_2+ b )
#
#         PDG            Width
DECAY   2000006     4.66785109E+02   # stop2 decays
#          BR         NDA      ID1       ID2
     5.12613239E-02    2     1000022         6   # BR(~t_2 -> ~chi_10 t )
     5.24385852E-02    2     1000023         6   # BR(~t_2 -> ~chi_20 t )
     1.11401775E-03    2     1000025         6   # BR(~t_2 -> ~chi_30 t )
     2.72008856E-03    2     1000035         6   # BR(~t_2 -> ~chi_40 t )
     1.02578728E-01    2     1000024         5   # BR(~t_2 -> ~chi_1+ b )
     2.22555058E-03    2     1000037         5   # BR(~t_2 -> ~chi_2+ b )
     1.84479526E-01    2     1000006        25   # BR(~t_2 -> ~t_1    h )
     2.06687034E-01    2     1000006        23   # BR(~t_2 -> ~t_1    Z )
     3.96417280E-01    2     1000005        24   # BR(~t_2 -> ~b_1    W+)
     7.78654601E-05    2     2000005        24   # BR(~t_2 -> ~b_2    W+)
#
#         PDG            Width
DECAY   1000005     3.27700805E+01   # sbottom1 decays
#          BR         NDA      ID1       ID2
     1.86736642E-01    2     1000022         5   # BR(~b_1 -> ~chi_10 b )
     1.82047434E-01    2     1000023         5   # BR(~b_1 -> ~chi_20 b )
     1.92636974E-02    2     1000025         5   # BR(~b_1 -> ~chi_30 b )
     5.79272826E-01    2    -1000024         6   # BR(~b_1 -> ~chi_1- t )
     3.26793999E-02    2    -1000037         6   # BR(~b_1 -> ~chi_2- t )
#
#         PDG            Width
DECAY   2000005     3.19962113E+01   # sbottom2 decays
#          BR         NDA      ID1       ID2
     2.51897926E-01    2     1000022         5   # BR(~b_2 -> ~chi_10 b )
     2.47417458E-01    2     1000023         5   # BR(~b_2 -> ~chi_20 b )
     1.08278404E-04    2     1000025         5   # BR(~b_2 -> ~chi_30 b )
     4.92394124E-01    2    -1000024         6   # BR(~b_2 -> ~chi_1- t )
     2.13592370E-04    2    -1000037         6   # BR(~b_2 -> ~chi_2- t )
     1.99561229E-03    2     1000005        25   # BR(~b_2 -> ~b_1    h )
     1.81153033E-03    2     1000005        23   # BR(~b_2 -> ~b_1    Z )
     4.16147939E-03    2     1000006       -24   # BR(~b_2 -> ~t_1    W-)
#
#         PDG            Width
DECAY   1000002     7.90675777E-02   # sup_L decays
#          BR         NDA      ID1       ID2
     1.46239376E-01    2     1000022         2   # BR(~u_L -> ~chi_10 u)
     7.23214436E-02    2     1000023         2   # BR(~u_L -> ~chi_20 u)
     7.81439180E-01    2     1000024         1   # BR(~u_L -> ~chi_1+ d)
#
#         PDG            Width
DECAY   2000002     1.00691668E-01   # sup_R decays
#           BR         NDA      ID1       ID2
     5.15143970E-03    2     1000022         2   # BR(~u_R -> ~chi_10 u)
     6.47375249E-03    2     1000023         2   # BR(~u_R -> ~chi_20 u)
#           BR         NDA      ID1       ID2       ID3
     1.80720018E-01    3        2       -1        1000001   # BR(~u_R -> u  db  ~d_L)
     4.40999749E-02    3        2       1        -1000001   # BR(~u_R -> u  d  ~d_L*)
     2.59912272E-05    3        2       -1        2000001   # BR(~u_R -> u  db  ~d_R)
     6.09206319E-05    3        2       1        -2000001   # BR(~u_R -> u  d  ~d_R*)
     1.81832326E-01    3        2       -2        1000002   # BR(~u_R -> u  ub  ~u_L)
     4.43810310E-02    3        2       2        -1000002   # BR(~u_R -> u  u  ~u_L*)
     1.81832326E-01    3        2       -3        1000003   # BR(~u_R -> u  sb  ~s_L)
     4.36093683E-02    3        2       3        -1000003   # BR(~u_R -> u  s  ~s_L*)
     2.64758751E-05    3        2       -3        2000003   # BR(~u_R -> u  sb  ~s_R)
     6.04757093E-05    3        2       3        -2000003   # BR(~u_R -> u  s  ~s_R*)
     1.80660431E-01    3        2       -4        1000004   # BR(~u_R -> u  cb  ~c_L)
     4.44714058E-02    3        2       4        -1000004   # BR(~u_R -> u  c  ~c_L*)
     2.86101132E-02    3        2       -5        1000005   # BR(~u_R -> u  bb  ~b_1)
     8.99975167E-03    3        2       5        -1000005   # BR(~u_R -> u  b  ~b_1*)
     5.73185464E-04    3        2       -5        2000005   # BR(~u_R -> u  bb  ~b_2)
     1.45165934E-03    3        2       5        -2000005   # BR(~u_R -> u  b  ~b_2*)
     2.78394437E-02    3        2       -6        1000006   # BR(~u_R -> u  tb  ~t_1)
     8.28628646E-03    3        2       6        -1000006   # BR(~u_R -> u  t  ~t_1*)
     4.49024246E-08    3        2       -11        1000011   # BR(~u_R -> u  e+  ~e_L-)
     3.09618470E-08    3        2       11        -1000011   # BR(~u_R -> u  e-  ~e_L+)
     4.81221549E-08    3        2       -12        1000012   # BR(~u_R -> u  nu_eb  ~nu_eL)
     3.22558965E-08    3        2       12        -1000012   # BR(~u_R -> u  nu_e  ~nu_eL*)
     4.40364146E-08    3        2       -13        1000013   # BR(~u_R -> u  mu+  ~mu_L-)
     3.08178431E-08    3        2       13        -1000013   # BR(~u_R -> u  mu-  ~mu_L+)
     4.64507157E-08    3        2       -14        1000014   # BR(~u_R -> u  nu_mub  ~nu_muL)
     3.26223618E-08    3        2       14        -1000014   # BR(~u_R -> u  nu_mu  ~nu_muL*)
     1.62466274E-03    3        2       23        1000022   # BR(~u_R -> u  Z  ~chi_10)
     1.10376561E-03    3        2       25        1000022   # BR(~u_R -> u  h  ~chi_10)
     1.14736405E-03    3        2       23        1000023   # BR(~u_R -> u  Z  ~chi_20)
     1.64303566E-03    3        2       25        1000023   # BR(~u_R -> u  h  ~chi_20)
     9.49711159E-07    3        2       23        1000025   # BR(~u_R -> u  Z  ~chi_30)
     1.24161217E-06    3        2       25        1000025   # BR(~u_R -> u  h  ~chi_30)
     1.10465943E-03    3        2       -24        1000024   # BR(~u_R -> u  W-  ~chi_1+)
     4.20362490E-03    3        2       24        -1000024   # BR(~u_R -> u  W+  ~chi_1-)
     3.68620373E-07    3        2       -24        1000037   # BR(~u_R -> u  W-  ~chi_2+)
     3.64091697E-06    3        2       24        -1000037   # BR(~u_R -> u  W+  ~chi_2-)
#
#         PDG            Width
DECAY   1000001     1.69204188E-02   # sdown_L decays
#          BR         NDA      ID1       ID2
     5.98144245E-01    2     1000022         1   # BR(~d_L -> ~chi_10 d)
     2.71635356E-01    2     1000023         1   # BR(~d_L -> ~chi_20 d)
     1.30220399E-01    2    -1000024         2   # BR(~d_L -> ~chi_1- u)
#
#         PDG            Width
DECAY   2000001     4.44095701E-02   # sdown_R decays
#           BR         NDA      ID1       ID2
     2.63329813E-03    2     1000022         1   # BR(~d_R -> ~chi_10 d)
     3.30871796E-03    2     1000023         1   # BR(~d_R -> ~chi_20 d)
#           BR         NDA      ID1       ID2       ID3
     1.99004403E-01    3        1       -1        1000001   # BR(~d_R -> d  db  ~d_L)
     3.98540224E-02    3        1       1        -1000001   # BR(~d_R -> d  d  ~d_L*)
     1.95660530E-01    3        1       -2        1000002   # BR(~d_R -> d  ub  ~u_L)
     4.01985427E-02    3        1       2        -1000002   # BR(~d_R -> d  u  ~u_L*)
     1.97711889E-01    3        1       -3        1000003   # BR(~d_R -> d  sb  ~s_L)
     3.97369305E-02    3        1       3        -1000003   # BR(~d_R -> d  s  ~s_L*)
     1.96455404E-01    3        1       -4        1000004   # BR(~d_R -> d  cb  ~c_L)
     4.07907574E-02    3        1       4        -1000004   # BR(~d_R -> d  c  ~c_L*)
     1.69004113E-02    3        1       -5        1000005   # BR(~d_R -> d  bb  ~b_1)
     4.63841464E-03    3        1       5        -1000005   # BR(~d_R -> d  b  ~b_1*)
     3.67983747E-05    3        1       -5        2000005   # BR(~d_R -> d  bb  ~b_2)
     1.06958928E-04    3        1       5        -2000005   # BR(~d_R -> d  b  ~b_2*)
     1.54892290E-02    3        1       -6        1000006   # BR(~d_R -> d  tb  ~t_1)
     3.89893439E-03    3        1       6        -1000006   # BR(~d_R -> d  t  ~t_1*)
     5.13965795E-04    3        1       23        1000022   # BR(~d_R -> d  Z  ~chi_10)
     3.59607174E-04    3        1       25        1000022   # BR(~d_R -> d  h  ~chi_10)
     3.53730062E-04    3        1       23        1000023   # BR(~d_R -> d  Z  ~chi_20)
     5.52178279E-04    3        1       25        1000023   # BR(~d_R -> d  h  ~chi_20)
     1.27080717E-07    3        1       23        1000025   # BR(~d_R -> d  Z  ~chi_30)
     3.44497818E-07    3        1       25        1000025   # BR(~d_R -> d  h  ~chi_30)
     2.96377559E-04    3        1       -24        1000024   # BR(~d_R -> d  W-  ~chi_1+)
     1.49753757E-03    3        1       24        -1000024   # BR(~d_R -> d  W+  ~chi_1-)
     9.40135199E-08    3        1       -24        1000037   # BR(~d_R -> d  W-  ~chi_2+)
     7.96382400E-07    3        1       24        -1000037   # BR(~d_R -> d  W+  ~chi_2-)
#
#         PDG            Width
DECAY   1000004     7.57447873E-02   # scharm_L decays
#          BR         NDA      ID1       ID2
     1.46240365E-01    2     1000022         4   # BR(~c_L -> ~chi_10 c)
     7.23201341E-02    2     1000023         4   # BR(~c_L -> ~chi_20 c)
     7.81439501E-01    2     1000024         3   # BR(~c_L -> ~chi_1+ s)
#
#         PDG            Width
DECAY   2000004     1.00728684E-01   # scharm_R decays
#           BR         NDA      ID1       ID2
     5.17114333E-03    2     1000022         4   # BR(~c_R -> ~chi_10 c)
     6.49833510E-03    2     1000023         4   # BR(~c_R -> ~chi_20 c)
#           BR         NDA      ID1       ID2       ID3
     1.79909032E-01    3        4       -1        1000001   # BR(~c_R -> c  db  ~d_L)
     4.39745646E-02    3        4       1        -1000001   # BR(~c_R -> c  d  ~d_L*)
     2.61137136E-05    3        4       -1        2000001   # BR(~c_R -> c  db  ~d_R)
     6.00454585E-05    3        4       1        -2000001   # BR(~c_R -> c  d  ~d_R*)
     1.80276356E-01    3        4       -2        1000002   # BR(~c_R -> c  ub  ~u_L)
     4.41820525E-02    3        4       2        -1000002   # BR(~c_R -> c  u  ~u_L*)
     1.84158070E-01    3        4       -3        1000003   # BR(~c_R -> c  sb  ~s_L)
     4.35933424E-02    3        4       3        -1000003   # BR(~c_R -> c  s  ~s_L*)
     2.62586574E-05    3        4       -3        2000003   # BR(~c_R -> c  sb  ~s_R)
     6.15445349E-05    3        4       3        -2000003   # BR(~c_R -> c  s  ~s_R*)
     1.81745649E-01    3        4       -4        1000004   # BR(~c_R -> c  cb  ~c_L)
     4.39189696E-02    3        4       4        -1000004   # BR(~c_R -> c  c  ~c_L*)
     2.81498764E-02    3        4       -5        1000005   # BR(~c_R -> c  bb  ~b_1)
     9.07924104E-03    3        4       5        -1000005   # BR(~c_R -> c  b  ~b_1*)
     5.78425110E-04    3        4       -5        2000005   # BR(~c_R -> c  bb  ~b_2)
     1.45638753E-03    3        4       5        -2000005   # BR(~c_R -> c  b  ~b_2*)
     2.79413955E-02    3        4       -6        1000006   # BR(~c_R -> c  tb  ~t_1)
     8.36415177E-03    3        4       6        -1000006   # BR(~c_R -> c  t  ~t_1*)
     4.47826759E-08    3        4       -11        1000011   # BR(~c_R -> c  e+  ~e_L-)
     3.05007460E-08    3        4       11        -1000011   # BR(~c_R -> c  e-  ~e_L+)
     4.75862467E-08    3        4       -12        1000012   # BR(~c_R -> c  nu_eb  ~nu_eL)
     3.21705782E-08    3        4       12        -1000012   # BR(~c_R -> c  nu_e  ~nu_eL*)
     4.45424265E-08    3        4       -13        1000013   # BR(~c_R -> c  mu+  ~mu_L-)
     3.03965055E-08    3        4       13        -1000013   # BR(~c_R -> c  mu-  ~mu_L+)
     4.63969132E-08    3        4       -14        1000014   # BR(~c_R -> c  nu_mub  ~nu_muL)
     3.28883479E-08    3        4       14        -1000014   # BR(~c_R -> c  nu_mu  ~nu_muL*)
     1.62138523E-03    3        4       23        1000022   # BR(~c_R -> c  Z  ~chi_10)
     1.10276434E-03    3        4       25        1000022   # BR(~c_R -> c  h  ~chi_10)
     1.15329612E-03    3        4       23        1000023   # BR(~c_R -> c  Z  ~chi_20)
     1.64243187E-03    3        4       25        1000023   # BR(~c_R -> c  h  ~chi_20)
     9.50742096E-07    3        4       23        1000025   # BR(~c_R -> c  Z  ~chi_30)
     1.24105662E-06    3        4       25        1000025   # BR(~c_R -> c  h  ~chi_30)
     1.10584191E-03    3        4       -24        1000024   # BR(~c_R -> c  W-  ~chi_1+)
     4.19681846E-03    3        4       24        -1000024   # BR(~c_R -> c  W+  ~chi_1-)
     3.68028238E-07    3        4       -24        1000037   # BR(~c_R -> c  W-  ~chi_2+)
     3.63908260E-06    3        4       24        -1000037   # BR(~c_R -> c  W+  ~chi_2-)
#
#         PDG            Width
DECAY   1000003     1.62115917E-02   # sstrange_L decays
#          BR         NDA      ID1       ID2
     5.98149394E-01    2     1000022         3   # BR(~s_L -> ~chi_10 s)
     2.71630933E-01    2     1000023         3   # BR(~s_L -> ~chi_20 s)
     1.30219674E-01    2    -1000024         4   # BR(~s_L -> ~chi_1- c)
#
#         PDG            Width
DECAY   2000003     4.44143521E-02   # sstrange_R decays
#           BR         NDA      ID1       ID2
     2.62765587E-03    2     1000022         3   # BR(~s_R -> ~chi_10 s)
     3.30153534E-03    2     1000023         3   # BR(~s_R -> ~chi_20 s)
#           BR         NDA      ID1       ID2       ID3
     1.98978474E-01    3        3       -1        1000001   # BR(~s_R -> s  db  ~d_L)
     4.01964662E-02    3        3       1        -1000001   # BR(~s_R -> s  d  ~d_L*)
     1.95664230E-01    3        3       -2        1000002   # BR(~s_R -> s  ub  ~u_L)
     4.01942147E-02    3        3       2        -1000002   # BR(~s_R -> s  u  ~u_L*)
     1.97546505E-01    3        3       -3        1000003   # BR(~s_R -> s  sb  ~s_L)
     3.98474799E-02    3        3       3        -1000003   # BR(~s_R -> s  s  ~s_L*)
     1.96335185E-01    3        3       -4        1000004   # BR(~s_R -> s  cb  ~c_L)
     4.06535256E-02    3        3       4        -1000004   # BR(~s_R -> s  c  ~c_L*)
     1.68985917E-02    3        3       -5        1000005   # BR(~s_R -> s  bb  ~b_1)
     4.63791523E-03    3        3       5        -1000005   # BR(~s_R -> s  b  ~b_1*)
     3.68664615E-05    3        3       -5        2000005   # BR(~s_R -> s  bb  ~b_2)
     1.06947412E-04    3        3       5        -2000005   # BR(~s_R -> s  b  ~b_2*)
     1.54875613E-02    3        3       -6        1000006   # BR(~s_R -> s  tb  ~t_1)
     3.91247405E-03    3        3       6        -1000006   # BR(~s_R -> s  t  ~t_1*)
     5.13910458E-04    3        3       23        1000022   # BR(~s_R -> s  Z  ~chi_10)
     3.59568456E-04    3        3       25        1000022   # BR(~s_R -> s  h  ~chi_10)
     3.53691977E-04    3        3       23        1000023   # BR(~s_R -> s  Z  ~chi_20)
     5.52118828E-04    3        3       25        1000023   # BR(~s_R -> s  h  ~chi_20)
     1.27067034E-07    3        3       23        1000025   # BR(~s_R -> s  Z  ~chi_30)
     3.43987907E-07    3        3       25        1000025   # BR(~s_R -> s  h  ~chi_30)
     2.96345649E-04    3        3       -24        1000024   # BR(~s_R -> s  W-  ~chi_1+)
     1.49737634E-03    3        3       24        -1000024   # BR(~s_R -> s  W+  ~chi_1-)
     9.39493614E-08    3        3       -24        1000037   # BR(~s_R -> s  W-  ~chi_2+)
     7.95913896E-07    3        3       24        -1000037   # BR(~s_R -> s  W+  ~chi_2-)
#
#         PDG            Width
DECAY   1000011     1.48495896E+01   # selectron_L decays
#          BR         NDA      ID1       ID2
     2.16148034E-03    2     1000022        11   # BR(~e_L -> ~chi_10 e-)
     1.15259643E-03    2     1000023        11   # BR(~e_L -> ~chi_20 e-)
     3.31172598E-01    2     1000025        11   # BR(~e_L -> ~chi_30 e-)
     3.61895941E-04    2    -1000024        12   # BR(~e_L -> ~chi_1- nu_e)
     6.65151429E-01    2    -1000037        12   # BR(~e_L -> ~chi_2- nu_e)
#
#         PDG            Width
DECAY   2000011     1.36884836E+00   # selectron_R decays
#           BR         NDA      ID1       ID2
     1.18344910E-03    2     1000022        11   # BR(~e_R -> ~chi_10 e-)
     1.48764590E-03    2     1000023        11   # BR(~e_R -> ~chi_20 e-)
     3.57947739E-06    2     1000025        11   # BR(~e_R -> ~chi_30 e-)
     9.97325326E-01    2     1000035        11   # BR(~e_R -> ~chi_40 e-)
#
#         PDG            Width
DECAY   1000013     1.48495896E+01   # smuon_L decays
#          BR         NDA      ID1       ID2
     2.16148034E-03    2     1000022        13   # BR(~mu_L -> ~chi_10 mu-)
     1.15259643E-03    2     1000023        13   # BR(~mu_L -> ~chi_20 mu-)
     3.31172596E-01    2     1000025        13   # BR(~mu_L -> ~chi_30 mu-)
     3.61895942E-04    2    -1000024        14   # BR(~mu_L -> ~chi_1- nu_mu)
     6.65151431E-01    2    -1000037        14   # BR(~mu_L -> ~chi_2- nu_mu)
#
#         PDG            Width
DECAY   2000013     1.36884832E+00   # smuon_R decays
#           BR         NDA      ID1       ID2
     1.18344912E-03    2     1000022        13   # BR(~mu_R -> ~chi_10 mu-)
     1.48764595E-03    2     1000023        13   # BR(~mu_R -> ~chi_20 mu-)
     3.57947748E-06    2     1000025        13   # BR(~mu_R -> ~chi_30 mu-)
     9.97325325E-01    2     1000035        13   # BR(~mu_R -> ~chi_40 mu-)
#
#         PDG            Width
DECAY   1000015     4.00773909E+01   # stau_1 decays
#          BR         NDA      ID1       ID2
     2.31547606E-01    2     1000022        15   # BR(~tau_1 -> ~chi_10  tau-)
     2.26154717E-01    2     1000023        15   # BR(~tau_1 -> ~chi_20  tau-)
     9.88931453E-06    2     1000025        15   # BR(~tau_1 -> ~chi_30  tau-)
     8.47029051E-02    2     1000035        15   # BR(~tau_1 -> ~chi_40  tau-)
     4.57565108E-01    2    -1000024        16   # BR(~tau_1 -> ~chi_1-  nu_tau)
     1.97740368E-05    2    -1000037        16   # BR(~tau_1 -> ~chi_2-  nu_tau)
#
#         PDG            Width
DECAY   2000015     5.83492907E+01   # stau_2 decays
#          BR         NDA      ID1       ID2
     1.62654607E-01    2     1000022        15   # BR(~tau_2 -> ~chi_10  tau-)
     1.59626522E-01    2     1000023        15   # BR(~tau_2 -> ~chi_20  tau-)
     2.19711299E-01    2     1000025        15   # BR(~tau_2 -> ~chi_30  tau-)
     1.67276825E-02    2     1000035        15   # BR(~tau_2 -> ~chi_40  tau-)
     3.87507045E-06    2    -1000024        16   # BR(~tau_2 -> ~chi_1-  nu_tau)
     4.41276015E-01    2    -1000037        16   # BR(~tau_2 -> ~chi_2-  nu_tau)
#
#         PDG            Width
DECAY   1000012     1.48837217E+01   # snu_eL decays
#          BR         NDA      ID1       ID2
     1.42938848E-03    2     1000022        12   # BR(~nu_eL -> ~chi_10 nu_e)
     5.87660944E-04    2     1000023        12   # BR(~nu_eL -> ~chi_20 nu_e)
     3.30309808E-01    2     1000025        12   # BR(~nu_eL -> ~chi_30 nu_e)
     1.01512679E-02    2     1000024        11   # BR(~nu_eL -> ~chi_1+ e-)
     6.57521874E-01    2     1000037        11   # BR(~nu_eL -> ~chi_2+ e-)
#
#         PDG            Width
DECAY   1000014     1.48837217E+01   # snu_muL decays
#          BR         NDA      ID1       ID2
     1.42938849E-03    2     1000022        14   # BR(~nu_muL -> ~chi_10 nu_mu)
     5.87660947E-04    2     1000023        14   # BR(~nu_muL -> ~chi_20 nu_mu)
     3.30309810E-01    2     1000025        14   # BR(~nu_muL -> ~chi_30 nu_mu)
     1.01512679E-02    2     1000024        13   # BR(~nu_muL -> ~chi_1+ mu-)
     6.57521873E-01    2     1000037        13   # BR(~nu_muL -> ~chi_2+ mu-)
#
#         PDG            Width
DECAY   1000016     5.83724585E+01   # snu_tauL decays
#          BR         NDA      ID1       ID2
     6.05713469E-04    2     1000022        16   # BR(~nu_tauL -> ~chi_10 nu_tau)
     2.49141605E-04    2     1000023        16   # BR(~nu_tauL -> ~chi_20 nu_tau)
     2.19767840E-01    2     1000025        16   # BR(~nu_tauL -> ~chi_30 nu_tau)
     1.67047484E-02    2     1000035        16   # BR(~nu_tauL -> ~chi_40 nu_tau)
     3.25056539E-01    2     1000024        15   # BR(~nu_tauL -> ~chi_1+ tau-)
     4.37615822E-01    2     1000037        15   # BR(~nu_tauL -> ~chi_2+ tau-)
     1.95098966E-07    2    -1000015       -24   # BR(~nu_tauL -> ~tau_1+ W-)
#
#         PDG            Width
DECAY   1000024     5.30193644E-11   # chargino1+ decays
#           BR         NDA      ID1       ID2       ID3
     3.74326108E-01    3     1000022         2        -1   # BR(~chi_1+ -> ~chi_10 u    db)
     3.74326108E-01    3     1000022         4        -3   # BR(~chi_1+ -> ~chi_10 c    sb)
     1.24771614E-01    3     1000022       -11        12   # BR(~chi_1+ -> ~chi_10 e+   nu_e)
     1.24771614E-01    3     1000022       -13        14   # BR(~chi_1+ -> ~chi_10 mu+  nu_mu)
     1.80455654E-03    3     1000022       -15        16   # BR(~chi_1+ -> ~chi_10 tau+ nu_tau)
#
#         PDG            Width
DECAY   1000037     2.01249574E+01   # chargino2+ decays
#          BR         NDA      ID1       ID2
     1.21053599E-01    2     1000002        -1   # BR(~chi_2+ -> ~u_L     db)
     1.19782832E-01    2    -1000001         2   # BR(~chi_2+ -> ~d_L*    u )
     1.21053509E-01    2     1000004        -3   # BR(~chi_2+ -> ~c_L     sb)
     1.19781358E-01    2    -1000003         4   # BR(~chi_2+ -> ~s_L*     c )
     1.31532692E-01    2     1000024        23   # BR(~chi_2+ -> ~chi_1+  Z )
     1.27110156E-01    2     1000022        24   # BR(~chi_2+ -> ~chi_10  W+)
     1.29652338E-01    2     1000023        24   # BR(~chi_2+ -> ~chi_20  W+)
     1.30033515E-01    2     1000024        25   # BR(~chi_2+ -> ~chi_1+  h )
#
#         PDG            Width
DECAY   1000022     0.00000000E+00   # neutralino1 decays
#
#         PDG            Width
DECAY   1000023     2.48868188E-09   # neutralino2 decays
#          BR         NDA      ID1       ID2
     7.07469702E-02    2     1000022        22   # BR(~chi_20 -> ~chi_10 gam)
#           BR         NDA      ID1       ID2       ID3
     1.17098905E-01    3     1000022        -2         2   # BR(~chi_20 -> ~chi_10 ub      u)
     1.51921242E-01    3     1000022        -1         1   # BR(~chi_20 -> ~chi_10 db      d)
     1.17098905E-01    3     1000022        -4         4   # BR(~chi_20 -> ~chi_10 cb      c)
     1.51921242E-01    3     1000022        -3         3   # BR(~chi_20 -> ~chi_10 sb      s)
     3.48575177E-02    3     1000022       -11        11   # BR(~chi_20 -> ~chi_10 e+      e-)
     3.48575177E-02    3     1000022       -13        13   # BR(~chi_20 -> ~chi_10 mu+     mu-)
     9.08972872E-03    3     1000022       -15        15   # BR(~chi_20 -> ~chi_10 tau+    tau-)
     6.96876530E-02    3     1000022       -12        12   # BR(~chi_20 -> ~chi_10 nu_eb   nu_e)
     6.96876530E-02    3     1000022       -14        14   # BR(~chi_20 -> ~chi_10 nu_mub  nu_mu)
     6.96875181E-02    3     1000022       -16        16   # BR(~chi_20 -> ~chi_10 nu_taub nu_tau)
     1.91869745E-02    3     1000024        -2         1   # BR(~chi_20 -> ~chi_1+ ub      d)
     1.91869745E-02    3    -1000024        -1         2   # BR(~chi_20 -> ~chi_1- db      u)
     1.91869745E-02    3     1000024        -4         3   # BR(~chi_20 -> ~chi_1+ cb      s)
     1.91869745E-02    3    -1000024        -3         4   # BR(~chi_20 -> ~chi_1- sb      c)
     6.39555411E-03    3     1000024       -12        11   # BR(~chi_20 -> ~chi_1+ nu_eb   e-)
     6.39555411E-03    3    -1000024        12       -11   # BR(~chi_20 -> ~chi_1- nu_e    e+)
     6.39555411E-03    3     1000024       -14        13   # BR(~chi_20 -> ~chi_1+ nu_mub  mu-)
     6.39555411E-03    3    -1000024        14       -13   # BR(~chi_20 -> ~chi_1- nu_mu   mu+)
     5.07516927E-04    3     1000024       -16        15   # BR(~chi_20 -> ~chi_1+ nu_taub tau-)
     5.07516927E-04    3    -1000024        16       -15   # BR(~chi_20 -> ~chi_1- nu_tau  tau+)
#
#         PDG            Width
DECAY   1000025     2.01150438E+01   # neutralino3 decays
#          BR         NDA      ID1       ID2
     4.14678905E-02    2     1000022        23   # BR(~chi_30 -> ~chi_10   Z )
     8.99683874E-02    2     1000023        23   # BR(~chi_30 -> ~chi_20   Z )
     1.29323960E-01    2     1000024       -24   # BR(~chi_30 -> ~chi_1+   W-)
     1.29323960E-01    2    -1000024        24   # BR(~chi_30 -> ~chi_1-   W+)
     8.74952375E-02    2     1000022        25   # BR(~chi_30 -> ~chi_10   h )
     4.09509097E-02    2     1000023        25   # BR(~chi_30 -> ~chi_20   h )
     6.07158339E-02    2     1000002        -2   # BR(~chi_30 -> ~u_L      ub)
     6.07158339E-02    2    -1000002         2   # BR(~chi_30 -> ~u_L*     u )
     5.96519453E-02    2     1000001        -1   # BR(~chi_30 -> ~d_L      db)
     5.96519453E-02    2    -1000001         1   # BR(~chi_30 -> ~d_L*     d )
     6.07151033E-02    2     1000004        -4   # BR(~chi_30 -> ~c_L      cb)
     6.07151033E-02    2    -1000004         4   # BR(~chi_30 -> ~c_L*     c )
     5.96519453E-02    2     1000003        -3   # BR(~chi_30 -> ~s _L      sb)
     5.96519453E-02    2    -1000003         3   # BR(~chi_30 -> ~s _L*     s )
#
#         PDG            Width
DECAY   1000035     2.11267030E+01   # neutralino4 decays
#          BR         NDA      ID1       ID2
     4.40264565E-02    2     1000022        23   # BR(~chi_40 -> ~chi_10   Z )
     3.65960381E-02    2     1000023        23   # BR(~chi_40 -> ~chi_20   Z )
     1.72773201E-04    2     1000025        23   # BR(~chi_40 -> ~chi_30   Z )
     7.84701537E-02    2     1000024       -24   # BR(~chi_40 -> ~chi_1+   W-)
     7.84701537E-02    2    -1000024        24   # BR(~chi_40 -> ~chi_1-   W+)
     1.91591844E-04    2     1000037       -24   # BR(~chi_40 -> ~chi_2+   W-)
     1.91591844E-04    2    -1000037        24   # BR(~chi_40 -> ~chi_2-   W+)
     4.10786505E-02    2     1000022        25   # BR(~chi_40 -> ~chi_10   h )
     5.19354262E-02    2     1000023        25   # BR(~chi_40 -> ~chi_20   h )
     3.46348534E-05    2     1000025        25   # BR(~chi_40 -> ~chi_30   h )
     2.40098615E-02    2     1000002        -2   # BR(~chi_40 -> ~u_L      ub)
     2.40098615E-02    2    -1000002         2   # BR(~chi_40 -> ~u_L*     u )
     3.75358676E-02    2     2000002        -2   # BR(~chi_40 -> ~u_R      ub)
     3.75358676E-02    2    -2000002         2   # BR(~chi_40 -> ~u_R*     u )
     2.41131493E-02    2     1000001        -1   # BR(~chi_40 -> ~d_L      db)
     2.41131493E-02    2    -1000001         1   # BR(~chi_40 -> ~d_L*     d )
     2.11902504E-02    2     2000001        -1   # BR(~chi_40 -> ~d_R      db)
     2.11902504E-02    2    -2000001         1   # BR(~chi_40 -> ~d_R*     d )
     2.40098595E-02    2     1000004        -4   # BR(~chi_40 -> ~c_L      cb)
     2.40098595E-02    2    -1000004         4   # BR(~chi_40 -> ~c_L*     c )
     3.75356605E-02    2     2000004        -4   # BR(~chi_40 -> ~c_R      cb)
     3.75356605E-02    2    -2000004         4   # BR(~chi_40 -> ~c_R*     c )
     2.41131493E-02    2     1000003        -3   # BR(~chi_40 -> ~s _L      sb)
     2.41131493E-02    2    -1000003         3   # BR(~chi_40 -> ~s _L*     s )
     2.11902504E-02    2     2000003        -3   # BR(~chi_40 -> ~s _R      sb)
     2.11902504E-02    2    -2000003         3   # BR(~chi_40 -> ~s _R*     s )
     2.33175976E-02    2     1000006        -6   # BR(~chi_40 -> ~t_1      tb)
     2.33175976E-02    2    -1000006         6   # BR(~chi_40 -> ~t_1*     t )
     1.63951615E-02    2     1000005        -5   # BR(~chi_40 -> ~b_1      bb)
     1.63951615E-02    2    -1000005         5   # BR(~chi_40 -> ~b_1*     b )
     3.51423076E-02    2     2000005        -5   # BR(~chi_40 -> ~b_2      bb)
     3.51423076E-02    2    -2000005         5   # BR(~chi_40 -> ~b_2*     b )
     1.14277742E-02    2     1000011       -11   # BR(~chi_40 -> ~e_L-     e+)
     1.14277742E-02    2    -1000011        11   # BR(~chi_40 -> ~e_L+     e-)
     1.14277742E-02    2     1000013       -13   # BR(~chi_40 -> ~mu_L-    mu+)
     1.14277742E-02    2    -1000013        13   # BR(~chi_40 -> ~mu_L+    mu-)
     1.15038007E-02    2     1000012       -12   # BR(~chi_40 -> ~nu_eL    nu_eb)
     1.15038007E-02    2    -1000012        12   # BR(~chi_40 -> ~nu_eL*   nu_e )
     1.15038007E-02    2     1000014       -14   # BR(~chi_40 -> ~nu_muL   nu_mub)
     1.15038007E-02    2    -1000014        14   # BR(~chi_40 -> ~nu_muL*  nu_mu )
#
#         PDG            Width
DECAY        25     4.27199827E-03   # h decays
#          BR         NDA      ID1       ID2
     6.06292810E-01    2           5        -5   # BR(h -> b       bb     )
     6.10230896E-02    2         -15        15   # BR(h -> tau+    tau-   )
     2.15993336E-04    2         -13        13   # BR(h -> mu+     mu-    )
     2.35565948E-04    2           3        -3   # BR(h -> s       sb     )
     2.03620202E-02    2           4        -4   # BR(h -> c       cb     )
     7.43626997E-02    2          21        21   # BR(h -> g       g      )
     2.25471304E-03    2          22        22   # BR(h -> gam     gam    )
     1.52184327E-03    2          22        23   # BR(h -> Z       gam    )
     2.07723150E-01    2          24       -24   # BR(h -> W+      W-     )
     2.60081153E-02    2          23        23   # BR(h -> Z       Z      )
#
#         PDG            Width
DECAY        35     1.78917334E+02   # H decays
#          BR         NDA      ID1       ID2
     5.54087792E-01    2           5        -5   # BR(H -> b       bb     )
     9.67490396E-02    2         -15        15   # BR(H -> tau+    tau-   )
     3.38702513E-04    2         -13        13   # BR(H -> mu+     mu-    )
     1.88072054E-04    2           3        -3   # BR(H -> s       sb     )
     3.79903225E-09    2           4        -4   # BR(H -> c       cb     )
     3.74859913E-04    2           6        -6   # BR(H -> t       tb     )
     5.32933344E-06    2          21        21   # BR(H -> g       g      )
     4.96748987E-09    2          22        22   # BR(H -> gam     gam    )
     4.03845724E-09    2          23        22   # BR(H -> Z       gam    )
     1.60588980E-07    2          24       -24   # BR(H -> W+      W-     )
     8.01558824E-08    2          23        23   # BR(H -> Z       Z      )
     4.37139124E-07    2          25        25   # BR(H -> h       h      )
     1.36267971E-03    2     1000024  -1000024   # BR(H -> ~chi_1+ ~chi_1-)
     1.48256800E-05    2     1000037  -1000037   # BR(H -> ~chi_2+ ~chi_2-)
     6.87450660E-02    2     1000024  -1000037   # BR(H -> ~chi_1+ ~chi_2-)
     6.87450660E-02    2     1000037  -1000024   # BR(H -> ~chi_2+ ~chi_1-)
     1.89759989E-04    2     1000022   1000022   # BR(H -> ~chi_10 ~chi_10)
     8.40750631E-05    2     1000023   1000023   # BR(H -> ~chi_20 ~chi_20)
     7.42790493E-06    2     1000025   1000025   # BR(H -> ~chi_30 ~chi_30)
     1.45125589E-05    2     1000022   1000023   # BR(H -> ~chi_10 ~chi_20)
     3.17747385E-02    2     1000022   1000025   # BR(H -> ~chi_10 ~chi_30)
     2.08061102E-03    2     1000022   1000035   # BR(H -> ~chi_10 ~chi_40)
     3.72634691E-02    2     1000023   1000025   # BR(H -> ~chi_20 ~chi_30)
     1.32527774E-03    2     1000023   1000035   # BR(H -> ~chi_20 ~chi_40)
     7.47571573E-08    2     1000002  -1000002   # BR(H -> ~u_L    ~u_L*  )
     7.47571573E-08    2     1000004  -1000004   # BR(H -> ~c_L    ~c_L*  )
     3.05456782E-06    2     1000006  -1000006   # BR(H -> ~t_1    ~t_1*  )
     1.09699750E-07    2     1000001  -1000001   # BR(H -> ~d_L    ~d_L*  )
     1.09699750E-07    2     1000003  -1000003   # BR(H -> ~s_L    ~s_L*  )
     1.38232730E-04    2     1000005  -1000005   # BR(H -> ~b_1    ~b_1*  )
     6.82531740E-02    2     1000005  -2000005   # BR(H -> ~b_1    ~b_2*  )
     6.82531740E-02    2     2000005  -1000005   # BR(H -> ~b_2    ~b_1*  )
#
#         PDG            Width
DECAY        36     1.78926894E+02   # A decays
#          BR         NDA      ID1       ID2
     5.54075808E-01    2           5        -5   # BR(A -> b       bb     )
     9.67438034E-02    2         -15        15   # BR(A -> tau+    tau-   )
     3.38683889E-04    2         -13        13   # BR(A -> mu+     mu-    )
     1.88067723E-04    2           3        -3   # BR(A -> s       sb     )
     3.81951937E-09    2           4        -4   # BR(A -> c       cb     )
     3.75386342E-04    2           6        -6   # BR(A -> t       tb     )
     1.11890112E-05    2          21        21   # BR(A -> g       g      )
     1.92153721E-08    2          22        22   # BR(A -> gam     gam    )
     8.51104638E-09    2          23        22   # BR(A -> Z       gam    )
     1.62902555E-07    2          23        25   # BR(A -> Z       h      )
     1.40388566E-03    2     1000024  -1000024   # BR(A -> ~chi_1+ ~chi_1-)
     4.44088271E-05    2     1000037  -1000037   # BR(A -> ~chi_2+ ~chi_2-)
     6.87048668E-02    2     1000024  -1000037   # BR(A -> ~chi_1+ ~chi_2-)
     6.87048668E-02    2     1000037  -1000024   # BR(A -> ~chi_2+ ~chi_1-)
     2.09164228E-04    2     1000022   1000022   # BR(A -> ~chi_10 ~chi_10)
     7.82841034E-05    2     1000023   1000023   # BR(A -> ~chi_20 ~chi_20)
     2.22061426E-05    2     1000025   1000025   # BR(A -> ~chi_30 ~chi_30)
     9.56771661E-06    2     1000022   1000023   # BR(A -> ~chi_10 ~chi_20)
     3.78445224E-02    2     1000022   1000025   # BR(A -> ~chi_10 ~chi_30)
     1.36282317E-03    2     1000022   1000035   # BR(A -> ~chi_10 ~chi_40)
     3.11647007E-02    2     1000023   1000025   # BR(A -> ~chi_20 ~chi_30)
     2.04328541E-03    2     1000023   1000035   # BR(A -> ~chi_20 ~chi_40)
     6.83371425E-02    2     1000005  -2000005   # BR(A -> ~b_1    ~b_2*  )
     6.83371425E-02    2    -1000005   2000005   # BR(A -> ~b_1*   ~b_2   )
#
#         PDG            Width
DECAY        37     2.28151349E+02   # H+ decays
#          BR         NDA      ID1       ID2
     6.49283089E-04    2           4        -5   # BR(H+ -> c       bb     )
     7.59030014E-02    2         -15        16   # BR(H+ -> tau+    nu_tau )
     2.65723724E-04    2         -13        14   # BR(H+ -> mu+     nu_mu  )
     6.49282601E-06    2           2        -5   # BR(H+ -> u       bb     )
     7.38340700E-06    2           2        -3   # BR(H+ -> u       sb     )
     1.45330749E-04    2           4        -3   # BR(H+ -> c       sb     )
     3.86232067E-01    2           6        -5   # BR(H+ -> t       bb     )
     1.27967821E-07    2          24        25   # BR(H+ -> W+      h      )
     6.04505847E-14    2          24        36   # BR(H+ -> W+      A      )
     1.14084585E-04    2     1000024   1000022   # BR(H+ -> ~chi_1+ ~chi_10)
     2.36144184E-04    2     1000024   1000023   # BR(H+ -> ~chi_1+ ~chi_20)
     5.41362720E-02    2     1000024   1000025   # BR(H+ -> ~chi_1+ ~chi_30)
     2.67465288E-03    2     1000024   1000035   # BR(H+ -> ~chi_1+ ~chi_40)
     5.49928499E-02    2     1000037   1000022   # BR(H+ -> ~chi_2+ ~chi_10)
     5.37304162E-02    2     1000037   1000023   # BR(H+ -> ~chi_2+ ~chi_20)
     1.95369861E-12    2     1000037   1000025   # BR(H+ -> ~chi_2+ ~chi_30)
     1.43042156E-07    2     1000002  -1000001   # BR(H+ -> ~u_L    ~d_L*  )
     1.43042156E-07    2     1000004  -1000003   # BR(H+ -> ~c_L    ~s_L*  )
     1.44791814E-04    2     1000006  -1000005   # BR(H+ -> ~t_1    ~b_1*  )
     3.70761092E-01    2     1000006  -2000005   # BR(H+ -> ~t_1    ~b_2*  )
