#
#                              ======================
#                              | THE SUSYHIT OUTPUT |
#                              ======================
#
#
#              ------------------------------------------------------
#              |     This is the output of the SUSY-HIT package     |
#              |  created by A.Djouadi, M.Muehlleitner and M.Spira. |
#              |  In case of problems with SUSY-HIT email to        |
#              |           margarete.muehlleitner@cern.ch           |
#              |           michael.spira@psi.ch                     |
#              |           abdelhak.djouadi@cern.ch                 |
#              ------------------------------------------------------
#
#              ------------------------------------------------------
#              |  SUSY Les Houches Accord - MSSM Spectrum + Decays  |
#              |              based on the decay programs           |
#              |                                                    |
#              |                     SDECAY 1.3b                    |
#              |                                                    |
#              |  Authors: M.Muhlleitner, A.Djouadi and Y.Mambrini  |
#              |  Ref.:    Comput.Phys.Commun.168(2005)46           |
#              |           [hep-ph/0311167]                         |
#              |                                                    |
#              |                     HDECAY 3.4                     |
#              |                                                    |
#              |  By: A.Djouadi,J.Kalinowski,M.Muhlleitner,M.Spira  |
#              |  Ref.:    Comput.Phys.Commun.108(1998)56           |
#              |           [hep-ph/9704448]                         |
#              |                                                    |
#              |                                                    |
#              |  If not stated otherwise all DRbar couplings and   |
#              |  soft SUSY breaking masses are given at the scale  |
#              |  Q=  0.23440200E+04
#              |                                                    |
#              ------------------------------------------------------
#
#
BLOCK DCINFO  # Decay Program information
     1   SDECAY/HDECAY # decay calculator
     2   1.3b  /3.4    # version number
#
BLOCK SPINFO  # Spectrum calculator information
     1     SOFTSUSY    # spectrum calculator               
     2     3.4.0       # version number                    
#
BLOCK MODSEL  # Model selection
     1     0   #  nonUniversal                                     
#
BLOCK SMINPUTS  # Standard Model inputs
         1     1.27908970E+02   # alpha_em^-1(M_Z)^MSbar
         2     1.16637870E-05   # G_F [GeV^-2]
         3     1.18400000E-01   # alpha_S(M_Z)^MSbar
         4     9.11876000E+01   # M_Z pole mass
         5     4.18000000E+00   # mb(mb)^MSbar
         6     1.73200000E+02   # mt pole mass
         7     1.77700000E+00   # mtau pole mass
#
BLOCK MINPAR  # Input parameters - minimal models
         3     1.38100000E+01   # tanb                
#
BLOCK EXTPAR  # Input parameters - non-minimal models
         0    -1.00000000E+00   # Set                 
         1    -5.36940000E+02   # M_1(MX)             
         2     3.77559000E+03   # M_2(MX)             
         3     3.56421000E+03   # M_3(MX)             
        11    -4.52893000E+03   # At(MX)              
        12     4.96390000E+02   # Ab(MX)              
        13    -2.34312000E+03   # Atau(MX)            
        23    -2.33760000E+02   # mu(MX)              
        26     1.02452000E+03   # mA(pole)            
        31     1.15187000E+03   # meL(MX)             
        32     1.15187000E+03   # mmuL(MX)            
        33     3.71557000E+03   # mtauL(MX)           
        34     1.85480000E+03   # meR(MX)             
        35     1.85480000E+03   # mmuR(MX)            
        36     9.59600000E+02   # mtauR(MX)           
        41     2.25691000E+03   # mqL1(MX)            
        42     2.25691000E+03   # mqL2(MX)            
        43     1.41846000E+03   # mqL3(MX)            
        44     1.19288000E+03   # muR(MX)             
        45     1.19288000E+03   # mcR(MX)             
        46     3.88037000E+03   # mtR(MX)             
        47     2.21530000E+02   # mdR(MX)             
        48     2.21530000E+02   # msR(MX)             
        49     1.95065000E+03   # mbR(MX)             
#
BLOCK MASS  # Mass Spectrum
# PDG code           mass       particle
        24     8.03854812E+01   # W+
        25     1.27169126E+02   # h
        35     1.02463657E+03   # H
        36     1.02452038E+03   # A
        37     1.02797051E+03   # H+
         5     4.81876030E+00   # b-quark pole mass calculated from mb(mb)_Msbar
   1000001     2.35042129E+03   # ~d_L
   2000001     3.54747175E+02   # ~d_R
   1000002     2.34920789E+03   # ~u_L
   2000002     1.27133129E+03   # ~u_R
   1000003     2.35042129E+03   # ~s_L
   2000003     3.54747175E+02   # ~s_R
   1000004     2.34920789E+03   # ~c_L
   2000004     1.27133129E+03   # ~c_R
   1000005     1.49701357E+03   # ~b_1
   2000005     2.02652681E+03   # ~b_2
   1000006     1.49092607E+03   # ~t_1
   2000006     3.90152182E+03   # ~t_2
   1000011     1.16723223E+03   # ~e_L
   2000011     1.85486003E+03   # ~e_R
   1000012     1.16429514E+03   # ~nu_eL
   1000013     1.16723223E+03   # ~mu_L
   2000013     1.85486003E+03   # ~mu_R
   1000014     1.16429514E+03   # ~nu_muL
   1000015     9.57629664E+02   # ~tau_1
   2000015     3.73144671E+03   # ~tau_2
   1000016     3.73028813E+03   # ~nu_tauL
   1000021     3.54481549E+03   # ~g
   1000022    -2.41571440E+02   # ~chi_10
   1000023     2.44373666E+02   # ~chi_20
   1000025    -5.32974713E+02   # ~chi_30
   1000035     3.72432562E+03   # ~chi_40
   1000024     2.44701465E+02   # ~chi_1+
   1000037     3.72449103E+03   # ~chi_2+
#
BLOCK NMIX  # Neutralino Mixing Matrix
  1  1    -1.12800290E-01   # N_11
  1  2    -1.50663332E-02   # N_12
  1  3     7.05781971E-01   # N_13
  1  4    -6.99228797E-01   # N_14
  2  1     3.63143216E-02   # N_21
  2  2     1.49238482E-02   # N_22
  2  3     7.06341548E-01   # N_23
  2  4     7.06781555E-01   # N_24
  3  1     9.92953831E-01   # N_31
  3  2    -2.02542019E-03   # N_32
  3  3     5.43450683E-02   # N_33
  3  4    -1.05286275E-01   # N_34
  4  1    -2.30339722E-04   # N_41
  4  2     9.99773065E-01   # N_42
  4  3     2.02329791E-04   # N_43
  4  4    -2.13007975E-02   # N_44
#
BLOCK UMIX  # Chargino Mixing Matrix U
  1  1    -2.84343735E-04   # U_11
  1  2     9.99999960E-01   # U_12
  2  1    -9.99999960E-01   # U_21
  2  2    -2.84343735E-04   # U_22
#
BLOCK VMIX  # Chargino Mixing Matrix V
  1  1     3.01266000E-02   # V_11
  1  2    -9.99546091E-01   # V_12
  2  1    -9.99546091E-01   # V_21
  2  2    -3.01266000E-02   # V_22
#
BLOCK STOPMIX  # Stop Mixing Matrix
  1  1     9.98750200E-01   # cos(theta_t)
  1  2     4.99803761E-02   # sin(theta_t)
  2  1    -4.99803761E-02   # -sin(theta_t)
  2  2     9.98750200E-01   # cos(theta_t)
#
BLOCK SBOTMIX  # Sbottom Mixing Matrix
  1  1     9.99989112E-01   # cos(theta_b)
  1  2    -4.66646348E-03   # sin(theta_b)
  2  1     4.66646348E-03   # -sin(theta_b)
  2  2     9.99989112E-01   # cos(theta_b)
#
BLOCK STAUMIX  # Stau Mixing Matrix
  1  1    -1.08551420E-04   # cos(theta_tau)
  1  2     9.99999994E-01   # sin(theta_tau)
  2  1    -9.99999994E-01   # -sin(theta_tau)
  2  2    -1.08551420E-04   # cos(theta_tau)
#
BLOCK ALPHA  # Higgs mixing
          -7.71757242E-02   # Mixing angle in the neutral Higgs boson sector
#
BLOCK HMIX Q=  2.34402000E+03  # DRbar Higgs Parameters
         1    -2.36725100E+02   # mu(Q)MSSM           
         2     1.32375309E+01   # tan                 
         3     2.43271949E+02   # higgs               
         4     9.61152568E+05   # mA^2(Q)MSSM         
#
BLOCK GAUGE Q=  2.34402000E+03  # The gauge couplings
     1     3.64730958E-01   # gprime(Q) DRbar
     2     6.37492778E-01   # g(Q) DRbar
     3     1.01539714E+00   # g3(Q) DRbar
#
BLOCK AU Q=  2.34402000E+03  # The trilinear couplings
  1  1     0.00000000E+00   # A_u(Q) DRbar
  2  2     0.00000000E+00   # A_c(Q) DRbar
  3  3    -4.52892999E+03   # A_t(Q) DRbar
#
BLOCK AD Q=  2.34402000E+03  # The trilinear couplings
  1  1     0.00000000E+00   # A_d(Q) DRbar
  2  2     0.00000000E+00   # A_s(Q) DRbar
  3  3     4.96390004E+02   # A_b(Q) DRbar
#
BLOCK AE Q=  2.34402000E+03  # The trilinear couplings
  1  1     0.00000000E+00   # A_e(Q) DRbar
  2  2     0.00000000E+00   # A_mu(Q) DRbar
  3  3    -2.34312000E+03   # A_tau(Q) DRbar
#
BLOCK Yu Q=  2.34402000E+03  # The Yukawa couplings
  1  1     0.00000000E+00   # y_u(Q) DRbar
  2  2     0.00000000E+00   # y_c(Q) DRbar
  3  3     8.18904562E-01   # y_t(Q) DRbar
#
BLOCK Yd Q=  2.34402000E+03  # The Yukawa couplings
  1  1     0.00000000E+00   # y_d(Q) DRbar
  2  2     0.00000000E+00   # y_s(Q) DRbar
  3  3     1.82100173E-01   # y_b(Q) DRbar
#
BLOCK Ye Q=  2.34402000E+03  # The Yukawa couplings
  1  1     0.00000000E+00   # y_e(Q) DRbar
  2  2     0.00000000E+00   # y_mu(Q) DRbar
  3  3     1.35414177E-01   # y_tau(Q) DRbar
#
BLOCK MSOFT Q=  2.34402000E+03  # The soft SUSY breaking masses at the scale Q
         1    -5.36940000E+02   # M_1(Q)              
         2     3.77559000E+03   # M_2(Q)              
         3     3.56421000E+03   # M_3(Q)              
        21     9.70622955E+05   # mH1^2(Q)            
        22    -1.04702313E+05   # mH2^2(Q)            
        31     1.15187000E+03   # meL(Q)              
        32     1.15187000E+03   # mmuL(Q)             
        33     3.71557000E+03   # mtauL(Q)            
        34     1.85480000E+03   # meR(Q)              
        35     1.85480000E+03   # mmuR(Q)             
        36     9.59600000E+02   # mtauR(Q)            
        41     2.25690999E+03   # mqL1(Q)             
        42     2.25690999E+03   # mqL2(Q)             
        43     1.41845996E+03   # mqL3(Q)             
        44     1.19287998E+03   # muR(Q)              
        45     1.19287998E+03   # mcR(Q)              
        46     3.88036998E+03   # mtR(Q)              
        47     2.21529889E+02   # mdR(Q)              
        48     2.21529889E+02   # msR(Q)              
        49     1.95064999E+03   # mbR(Q)              
#
Block HiggsBoundsInputHiggsCouplingsFermions
# ScalarNormEffCoupSq PseudoSNormEffCoupSq NP   IP1 IP2 IP2
    1.04757312E+00    0.00000000E+00        3  25   5   5  # h0-b-b eff. coupling^2, normalised to SM
    1.75184651E+02    0.00000000E+00        3  35   5   5  # H0-b-b eff. coupling^2, normalised to SM
    0.00000000E+00    1.75232224E+02        3  36   5   5  # A0-b-b eff. coupling^2, normalised to SM
#
    9.99728514E-01    0.00000000E+00        3  25   6   6  # h0-t-t eff. coupling^2, normalised to SM
    5.97819906E-03    0.00000000E+00        3  35   6   6  # H0-t-t eff. coupling^2, normalised to SM
    0.00000000E+00    5.70671293E-03        3  36   6   6  # A0-t-t eff. coupling^2, normalised to SM
#
    1.04757312E+00    0.00000000E+00        3  25  15  15  # h0-tau-tau eff. coupling^2, normalised to SM
    1.75184651E+02    0.00000000E+00        3  35  15  15  # H0-tau-tau eff. coupling^2, normalised to SM
    0.00000000E+00    1.75232224E+02        3  36  15  15  # A0-tau-tau eff. coupling^2, normalised to SM
#
Block HiggsBoundsInputHiggsCouplingsBosons
    9.99996845E-01        3  25  24  24  # h0-W-W eff. coupling^2, normalised to SM
    3.15469050E-06        3  35  24  24  # H0-W-W eff. coupling^2, normalised to SM
    0.00000000E+00        3  36  24  24  # A0-W-W eff. coupling^2, normalised to SM
#
    9.99996845E-01        3  25  23  23  # h0-Z-Z eff. coupling^2, normalised to SM
    3.15469050E-06        3  35  23  23  # H0-Z-Z eff. coupling^2, normalised to SM
    0.00000000E+00        3  36  23  23  # A0-Z-Z eff. coupling^2, normalised to SM
#
    8.89149583E-01        3  25  21  21  # h0-g-g eff. coupling^2, normalised to SM
    2.51412218E-05        3  35  21  21  # H0-g-g eff. coupling^2, normalised to SM
    2.88303327E-04        3  36  21  21  # A0-g-g eff. coupling^2, normalised to SM
#
    0.00000000E+00        3  25  25  23  # h0-h0-Z eff. coupling^2, normalised to SM
    0.00000000E+00        3  35  25  23  # H0-h0-Z eff. coupling^2, normalised to SM
    3.15469050E-06        3  36  25  23  # A0-h0-Z eff. coupling^2, normalised to SM
    0.00000000E+00        3  35  35  23  # H0-H0-Z eff. coupling^2, normalised to SM
    9.99996845E-01        3  36  35  23  # A0-H0-Z eff. coupling^2, normalised to SM
    0.00000000E+00        3  36  36  23  # A0-A0-Z eff. coupling^2, normalised to SM
#
    0.00000000E+00        4  25  21  21  23  # h0-g-g-Z eff. coupling^2, normalised to SM
    0.00000000E+00        4  35  21  21  23  # H0-g-g-Z eff. coupling^2, normalised to SM
    0.00000000E+00        4  36  21  21  23  # A0-g-g-Z eff. coupling^2, normalised to SM
#
#
#
#                             =================
#                             |The decay table|
#                             =================
#
# - The QCD corrections to the decays gluino -> squark  + quark
#                                     squark -> gaugino + quark_prime
#                                     squark -> squark_prime + Higgs
#                                     squark -> gluino  + quark
#   are included.
#
# - The multi-body decays for the inos, stops and sbottoms are included.
#
# - The loop induced decays for the gluino, neutralinos and stops
#   are included.
#
# - The SUSY decays of the top quark are included.
#
#
#         PDG            Width
DECAY         6     1.43146670E+00   # top decays
#          BR         NDA      ID1       ID2
     1.00000000E+00    2           5        24   # BR(t ->  b    W+)
#
#         PDG            Width
DECAY   1000021     4.71292355E+02   # gluino decays
#          BR         NDA      ID1       ID2
     2.40283337E-02    2     1000001        -1   # BR(~g -> ~d_L  db)
     2.40283337E-02    2    -1000001         1   # BR(~g -> ~d_L* d )
     7.49993591E-02    2     2000001        -1   # BR(~g -> ~d_R  db)
     7.49993591E-02    2    -2000001         1   # BR(~g -> ~d_R* d )
     2.40672694E-02    2     1000002        -2   # BR(~g -> ~u_L  ub)
     2.40672694E-02    2    -1000002         2   # BR(~g -> ~u_L* u )
     5.81044088E-02    2     2000002        -2   # BR(~g -> ~u_R  ub)
     5.81044088E-02    2    -2000002         2   # BR(~g -> ~u_R* u )
     2.40283337E-02    2     1000003        -3   # BR(~g -> ~s_L  sb)
     2.40283337E-02    2    -1000003         3   # BR(~g -> ~s_L* s )
     7.49993591E-02    2     2000003        -3   # BR(~g -> ~s_R  sb)
     7.49993591E-02    2    -2000003         3   # BR(~g -> ~s_R* s )
     2.40672556E-02    2     1000004        -4   # BR(~g -> ~c_L  cb)
     2.40672556E-02    2    -1000004         4   # BR(~g -> ~c_L* c )
     5.81044048E-02    2     2000004        -4   # BR(~g -> ~c_R  cb)
     5.81044048E-02    2    -2000004         4   # BR(~g -> ~c_R* c )
     5.16469302E-02    2     1000005        -5   # BR(~g -> ~b_1  bb)
     5.16469302E-02    2    -1000005         5   # BR(~g -> ~b_1* b )
     3.47363888E-02    2     2000005        -5   # BR(~g -> ~b_2  bb)
     3.47363888E-02    2    -2000005         5   # BR(~g -> ~b_2* b )
     5.12179569E-02    2     1000006        -6   # BR(~g -> ~t_1  tb)
     5.12179569E-02    2    -1000006         6   # BR(~g -> ~t_1* t )
#
#         PDG            Width
DECAY   1000006     1.94487608E+01   # stop1 decays
#          BR         NDA      ID1       ID2
     4.62144749E-01    2     1000022         6   # BR(~t_1 -> ~chi_10 t )
     4.67545093E-01    2     1000023         6   # BR(~t_1 -> ~chi_20 t )
     1.72974192E-02    2     1000025         6   # BR(~t_1 -> ~chi_30 t )
     5.30127385E-02    2     1000024         5   # BR(~t_1 -> ~chi_1+ b )
#
#         PDG            Width
DECAY   2000006     2.34892673E+02   # stop2 decays
#          BR         NDA      ID1       ID2
     1.07854864E-01    2     1000022         6   # BR(~t_2 -> ~chi_10 t )
     1.09581227E-01    2     1000023         6   # BR(~t_2 -> ~chi_20 t )
     3.87560473E-02    2     1000025         6   # BR(~t_2 -> ~chi_30 t )
     8.98115988E-07    2     1000035         6   # BR(~t_2 -> ~chi_40 t )
     2.18618952E-01    2     1000024         5   # BR(~t_2 -> ~chi_1+ b )
     8.29069035E-06    2     1000037         5   # BR(~t_2 -> ~chi_2+ b )
     2.27881243E-02    2     1000021         6   # BR(~t_2 -> ~g      t )
     1.24201643E-01    2     1000006        25   # BR(~t_2 -> ~t_1    h )
     1.87190385E-03    2     1000006        35   # BR(~t_2 -> ~t_1    H )
     1.84046394E-03    2     1000006        36   # BR(~t_2 -> ~t_1    A )
     3.66593617E-03    2     1000005        37   # BR(~t_2 -> ~b_1    H+)
     4.74952997E-06    2     2000005        37   # BR(~t_2 -> ~b_2    H+)
     1.26265096E-01    2     1000006        23   # BR(~t_2 -> ~t_1    Z )
     2.44538466E-01    2     1000005        24   # BR(~t_2 -> ~b_1    W+)
     3.33976567E-06    2     2000005        24   # BR(~t_2 -> ~b_2    W+)
#
#         PDG            Width
DECAY   1000005     1.94752230E+01   # sbottom1 decays
#          BR         NDA      ID1       ID2
     2.40108396E-02    2     1000022         5   # BR(~b_1 -> ~chi_10 b )
     2.39851857E-02    2     1000023         5   # BR(~b_1 -> ~chi_20 b )
     8.77161429E-03    2     1000025         5   # BR(~b_1 -> ~chi_30 b )
     9.43232360E-01    2    -1000024         6   # BR(~b_1 -> ~chi_1- t )
#
#         PDG            Width
DECAY   2000005     3.63427151E+00   # sbottom2 decays
#          BR         NDA      ID1       ID2
     1.81806609E-01    2     1000022         5   # BR(~b_2 -> ~chi_10 b )
     1.78675647E-01    2     1000023         5   # BR(~b_2 -> ~chi_20 b )
     2.81361532E-01    2     1000025         5   # BR(~b_2 -> ~chi_30 b )
     3.52321205E-01    2    -1000024         6   # BR(~b_2 -> ~chi_1- t )
     1.49348480E-03    2     1000005        25   # BR(~b_2 -> ~b_1    h )
     1.44059600E-03    2     1000005        23   # BR(~b_2 -> ~b_1    Z )
     2.90092690E-03    2     1000006       -24   # BR(~b_2 -> ~t_1    W-)
#
#         PDG            Width
DECAY   1000002     3.33470324E-01   # sup_L decays
#          BR         NDA      ID1       ID2
     3.72359846E-02    2     1000022         2   # BR(~u_L -> ~chi_10 u)
     1.32793815E-02    2     1000023         2   # BR(~u_L -> ~chi_20 u)
     8.98994724E-01    2     1000025         2   # BR(~u_L -> ~chi_30 u)
     5.04899102E-02    2     1000024         1   # BR(~u_L -> ~chi_1+ d)
#
#         PDG            Width
DECAY   2000002     2.10898863E+00   # sup_R decays
#          BR         NDA      ID1       ID2
     1.72827932E-02    2     1000022         2   # BR(~u_R -> ~chi_10 u)
     1.78812095E-03    2     1000023         2   # BR(~u_R -> ~chi_20 u)
     9.80929086E-01    2     1000025         2   # BR(~u_R -> ~chi_30 u)
#
#         PDG            Width
DECAY   1000001     3.14060737E-01   # sdown_L decays
#          BR         NDA      ID1       ID2
     1.22841520E-03    2     1000022         1   # BR(~d_L -> ~chi_10 d)
     1.89042255E-03    2     1000023         1   # BR(~d_L -> ~chi_20 d)
     9.96876384E-01    2     1000025         1   # BR(~d_L -> ~chi_30 d)
     4.77810824E-06    2    -1000024         2   # BR(~d_L -> ~chi_1- u)
#
#         PDG            Width
DECAY   2000001     9.22114037E-04   # sdown_R decays
#           BR         NDA      ID1       ID2
     9.09469970E-01    2     1000022         1   # BR(~d_R -> ~chi_10 d)
     9.05226051E-02    2     1000023         1   # BR(~d_R -> ~chi_20 d)
#           BR         NDA      ID1       ID2       ID3
     4.28059854E-08    3        1       23        1000022   # BR(~d_R -> d  Z  ~chi_10)
     3.87468345E-07    3        1       23        1000023   # BR(~d_R -> d  Z  ~chi_20)
     2.08303954E-06    3        1       -24        1000024   # BR(~d_R -> d  W-  ~chi_1+)
     4.91186537E-06    3        1       24        -1000024   # BR(~d_R -> d  W+  ~chi_1-)
#
#         PDG            Width
DECAY   1000004     3.33618179E-01   # scharm_L decays
#          BR         NDA      ID1       ID2
     3.72857422E-02    2     1000022         4   # BR(~c_L -> ~chi_10 c)
     1.32969073E-02    2     1000023         4   # BR(~c_L -> ~chi_20 c)
     8.98860857E-01    2     1000025         4   # BR(~c_L -> ~chi_30 c)
     5.05564932E-02    2     1000024         3   # BR(~c_L -> ~chi_1+ s)
#
#         PDG            Width
DECAY   2000004     2.04236113E+00   # scharm_R decays
#          BR         NDA      ID1       ID2
     1.73112217E-02    2     1000022         4   # BR(~c_R -> ~chi_10 c)
     1.79103314E-03    2     1000023         4   # BR(~c_R -> ~chi_20 c)
     9.80897745E-01    2     1000025         4   # BR(~c_R -> ~chi_30 c)
#
#         PDG            Width
DECAY   1000003     3.14164643E-01   # sstrange_L decays
#          BR         NDA      ID1       ID2
     1.23023404E-03    2     1000022         3   # BR(~s_L -> ~chi_10 s)
     1.89319039E-03    2     1000023         3   # BR(~s_L -> ~chi_20 s)
     9.96871790E-01    2     1000025         3   # BR(~s_L -> ~chi_30 s)
     4.78509256E-06    2    -1000024         4   # BR(~s_L -> ~chi_1- c)
#
#         PDG            Width
DECAY   2000003     8.39439346E-04   # sstrange_R decays
#           BR         NDA      ID1       ID2
     9.09495471E-01    2     1000022         3   # BR(~s_R -> ~chi_10 s)
     9.04963686E-02    2     1000023         3   # BR(~s_R -> ~chi_20 s)
#           BR         NDA      ID1       ID2       ID3
     4.70099480E-08    3        3       23        1000022   # BR(~s_R -> s  Z  ~chi_10)
     4.27857000E-07    3        3       23        1000023   # BR(~s_R -> s  Z  ~chi_20)
     2.28557311E-06    3        3       -24        1000024   # BR(~s_R -> s  W-  ~chi_1+)
     5.40003280E-06    3        3       24        -1000024   # BR(~s_R -> s  W+  ~chi_1-)
#
#         PDG            Width
DECAY   1000011     9.80141455E-01   # selectron_L decays
#          BR         NDA      ID1       ID2
     2.79482979E-02    2     1000022        11   # BR(~e_L -> ~chi_10 e-)
     5.60964816E-03    2     1000023        11   # BR(~e_L -> ~chi_20 e-)
     9.66441342E-01    2     1000025        11   # BR(~e_L -> ~chi_30 e-)
     7.11537447E-07    2    -1000024        12   # BR(~e_L -> ~chi_1- nu_e)
#
#         PDG            Width
DECAY   2000011     8.28075493E+00   # selectron_R decays
#          BR         NDA      ID1       ID2
     1.45783352E-02    2     1000022        11   # BR(~e_R -> ~chi_10 e-)
     1.50971019E-03    2     1000023        11   # BR(~e_R -> ~chi_20 e-)
     9.83911955E-01    2     1000025        11   # BR(~e_R -> ~chi_30 e-)
#
#         PDG            Width
DECAY   1000013     9.80141430E-01   # smuon_L decays
#          BR         NDA      ID1       ID2
     2.79482981E-02    2     1000022        13   # BR(~mu_L -> ~chi_10 mu-)
     5.60964820E-03    2     1000023        13   # BR(~mu_L -> ~chi_20 mu-)
     9.66441342E-01    2     1000025        13   # BR(~mu_L -> ~chi_30 mu-)
     7.11537465E-07    2    -1000024        14   # BR(~mu_L -> ~chi_1- nu_mu)
#
#         PDG            Width
DECAY   2000013     8.28075487E+00   # smuon_R decays
#          BR         NDA      ID1       ID2
     1.45783352E-02    2     1000022        13   # BR(~mu_R -> ~chi_10 mu-)
     1.50971019E-03    2     1000023        13   # BR(~mu_R -> ~chi_20 mu-)
     9.83911955E-01    2     1000025        13   # BR(~mu_R -> ~chi_30 mu-)
#
#         PDG            Width
DECAY   1000015     3.05397816E+00   # stau_1 decays
#          BR         NDA      ID1       ID2
     6.84170932E-02    2     1000022        15   # BR(~tau_1 -> ~chi_10  tau-)
     5.17730402E-02    2     1000023        15   # BR(~tau_1 -> ~chi_20  tau-)
     7.79869873E-01    2     1000025        15   # BR(~tau_1 -> ~chi_30  tau-)
     9.99399938E-02    2    -1000024        16   # BR(~tau_1 -> ~chi_1-  nu_tau)
#
#         PDG            Width
DECAY   2000015     6.56189701E+00   # stau_2 decays
#          BR         NDA      ID1       ID2
     1.16914910E-01    2     1000022        15   # BR(~tau_2 -> ~chi_10  tau-)
     1.05520508E-01    2     1000023        15   # BR(~tau_2 -> ~chi_20  tau-)
     7.07465975E-01    2     1000025        15   # BR(~tau_2 -> ~chi_30  tau-)
     3.23431450E-05    2     1000035        15   # BR(~tau_2 -> ~chi_40  tau-)
     4.30723066E-07    2    -1000024        16   # BR(~tau_2 -> ~chi_1-  nu_tau)
     6.37827485E-05    2    -1000037        16   # BR(~tau_2 -> ~chi_2-  nu_tau)
     2.13022110E-05    2     1000015        25   # BR(~tau_2 -> ~tau_1   h)
     3.49792337E-02    2     1000015        35   # BR(~tau_2 -> ~tau_1   H)
     3.49770308E-02    2     1000015        36   # BR(~tau_2 -> ~tau_1   A)
     2.44841278E-05    2     1000015        23   # BR(~tau_2 -> ~tau_1   Z)
#
#         PDG            Width
DECAY   1000012     9.74389147E-01   # snu_eL decays
#          BR         NDA      ID1       ID2
     1.08256245E-02    2     1000022        12   # BR(~nu_eL -> ~chi_10 nu_e)
     1.51207838E-04    2     1000023        12   # BR(~nu_eL -> ~chi_20 nu_e)
     9.81012456E-01    2     1000025        12   # BR(~nu_eL -> ~chi_30 nu_e)
     8.01071126E-03    2     1000024        11   # BR(~nu_eL -> ~chi_1+ e-)
#
#         PDG            Width
DECAY   1000014     9.74389146E-01   # snu_muL decays
#          BR         NDA      ID1       ID2
     1.08256245E-02    2     1000022        14   # BR(~nu_muL -> ~chi_10 nu_mu)
     1.51207838E-04    2     1000023        14   # BR(~nu_muL -> ~chi_20 nu_mu)
     9.81012457E-01    2     1000025        14   # BR(~nu_muL -> ~chi_30 nu_mu)
     8.01071111E-03    2     1000024        13   # BR(~nu_muL -> ~chi_1+ mu-)
#
#         PDG            Width
DECAY   1000016     6.57645063E+00   # snu_tauL decays
#          BR         NDA      ID1       ID2
     5.56472317E-03    2     1000022        16   # BR(~nu_tauL -> ~chi_10 nu_tau)
     7.78738780E-05    2     1000023        16   # BR(~nu_tauL -> ~chi_20 nu_tau)
     7.15205219E-01    2     1000025        16   # BR(~nu_tauL -> ~chi_30 nu_tau)
     2.33914892E-05    2     1000035        16   # BR(~nu_tauL -> ~chi_40 nu_tau)
     2.09276280E-01    2     1000024        15   # BR(~nu_tauL -> ~chi_1+ tau-)
     4.20645521E-05    2     1000037        15   # BR(~nu_tauL -> ~chi_2+ tau-)
     6.97631064E-02    2    -1000015       -37   # BR(~nu_tauL -> ~tau_1+ H-)
     4.73410074E-05    2    -1000015       -24   # BR(~nu_tauL -> ~tau_1+ W-)
#
#         PDG            Width
DECAY   1000024     3.17252284E-10   # chargino1+ decays
#           BR         NDA      ID1       ID2       ID3
     3.66024245E-01    3     1000022         2        -1   # BR(~chi_1+ -> ~chi_10 u    db)
     4.74106875E-06    3     1000023         2        -1   # BR(~chi_1+ -> ~chi_20 u    db)
     3.66024245E-01    3     1000022         4        -3   # BR(~chi_1+ -> ~chi_10 c    sb)
     1.22007039E-01    3     1000022       -11        12   # BR(~chi_1+ -> ~chi_10 e+   nu_e)
     1.58035355E-06    3     1000023       -11        12   # BR(~chi_1+ -> ~chi_20 e+   nu_e)
     1.22007039E-01    3     1000022       -13        14   # BR(~chi_1+ -> ~chi_10 mu+  nu_mu)
     1.58035355E-06    3     1000023       -13        14   # BR(~chi_1+ -> ~chi_20 mu+  nu_mu)
     2.39295311E-02    3     1000022       -15        16   # BR(~chi_1+ -> ~chi_10 tau+ nu_tau)
#
#         PDG            Width
DECAY   1000037     2.30889136E+02   # chargino2+ decays
#          BR         NDA      ID1       ID2
     6.85213241E-02    2     1000002        -1   # BR(~chi_2+ -> ~u_L     db)
     6.84911871E-02    2    -1000001         2   # BR(~chi_2+ -> ~d_L*    u )
     6.85213223E-02    2     1000004        -3   # BR(~chi_2+ -> ~c_L     sb)
     6.84911583E-02    2    -1000003         4   # BR(~chi_2+ -> ~s_L*     c )
     1.36954791E-01    2     1000006        -5   # BR(~chi_2+ -> ~t_1     bb)
     1.36414222E-01    2    -1000005         6   # BR(~chi_2+ -> ~b_1*    t )
     2.01489798E-06    2    -2000005         6   # BR(~chi_2+ -> ~b_2*    t )
     5.30396338E-02    2     1000012       -11   # BR(~chi_2+ -> ~nu_eL   e+  )
     5.30396338E-02    2     1000014       -13   # BR(~chi_2+ -> ~nu_muL mu+ )
     5.30297376E-02    2    -1000011        12   # BR(~chi_2+ -> ~e_L+    nu_e)
     5.30297376E-02    2    -1000013        14   # BR(~chi_2+ -> ~mu_L+   nu_mu)
     1.62340513E-09    2    -1000015        16   # BR(~chi_2+ -> ~tau_1+  nu_tau)
     3.23152451E-02    2     1000024        23   # BR(~chi_2+ -> ~chi_1+  Z )
     3.07928154E-02    2     1000022        24   # BR(~chi_2+ -> ~chi_10  W+)
     3.13688221E-02    2     1000023        24   # BR(~chi_2+ -> ~chi_20  W+)
     5.40135224E-04    2     1000025        24   # BR(~chi_2+ -> ~chi_30  W+)
     3.18440802E-02    2     1000024        25   # BR(~chi_2+ -> ~chi_1+  h )
     2.84141018E-02    2     1000024        35   # BR(~chi_2+ -> ~chi_1+  H )
     2.84010559E-02    2     1000024        36   # BR(~chi_2+ -> ~chi_1+  A )
     2.82772842E-02    2     1000022        37   # BR(~chi_2+ -> ~chi_10  H+)
     2.83341700E-02    2     1000023        37   # BR(~chi_2+ -> ~chi_20  H+)
     1.77525650E-04    2     1000025        37   # BR(~chi_2+ -> ~chi_30  H+)
#
#         PDG            Width
DECAY   1000022     0.00000000E+00   # neutralino1 decays
#
#         PDG            Width
DECAY   1000023     1.56794521E-10   # neutralino2 decays
#          BR         NDA      ID1       ID2
     2.42910410E-01    2     1000022        22   # BR(~chi_20 -> ~chi_10 gam)
#           BR         NDA      ID1       ID2       ID3
     1.26530673E-01    3     1000022        -2         2   # BR(~chi_20 -> ~chi_10 ub      u)
     1.64269100E-01    3     1000022        -1         1   # BR(~chi_20 -> ~chi_10 db      d)
     1.64269100E-01    3     1000022        -3         3   # BR(~chi_20 -> ~chi_10 sb      s)
     3.77563865E-02    3     1000022       -11        11   # BR(~chi_20 -> ~chi_10 e+      e-)
     3.77563865E-02    3     1000022       -13        13   # BR(~chi_20 -> ~chi_10 mu+     mu-)
     7.55027123E-02    3     1000022       -12        12   # BR(~chi_20 -> ~chi_10 nu_eb   nu_e)
     7.55027123E-02    3     1000022       -14        14   # BR(~chi_20 -> ~chi_10 nu_mub  nu_mu)
     7.55025194E-02    3     1000022       -16        16   # BR(~chi_20 -> ~chi_10 nu_taub nu_tau)
#
#         PDG            Width
DECAY   1000025     1.82501754E+00   # neutralino3 decays
#          BR         NDA      ID1       ID2
     1.85704306E-02    2     1000022        23   # BR(~chi_30 -> ~chi_10   Z )
     1.46208692E-01    2     1000023        23   # BR(~chi_30 -> ~chi_20   Z )
     1.64392051E-01    2     1000024       -24   # BR(~chi_30 -> ~chi_1+   W-)
     1.64392051E-01    2    -1000024        24   # BR(~chi_30 -> ~chi_1-   W+)
     1.53125930E-01    2     1000022        25   # BR(~chi_30 -> ~chi_10   h )
     1.33594528E-02    2     1000023        25   # BR(~chi_30 -> ~chi_20   h )
     8.49878482E-02    2     2000001        -1   # BR(~chi_30 -> ~d_R      db)
     8.49878482E-02    2    -2000001         1   # BR(~chi_30 -> ~d_R*     d )
     8.49878482E-02    2     2000003        -3   # BR(~chi_30 -> ~s _R      sb)
     8.49878482E-02    2    -2000003         3   # BR(~chi_30 -> ~s _R*     s )
#
#         PDG            Width
DECAY   1000035     2.30865567E+02   # neutralino4 decays
#          BR         NDA      ID1       ID2
     1.55088886E-02    2     1000022        23   # BR(~chi_40 -> ~chi_10   Z )
     1.64650808E-02    2     1000023        23   # BR(~chi_40 -> ~chi_20   Z )
     3.37743840E-04    2     1000025        23   # BR(~chi_40 -> ~chi_30   Z )
     3.13617794E-02    2     1000024       -24   # BR(~chi_40 -> ~chi_1+   W-)
     3.13617794E-02    2    -1000024        24   # BR(~chi_40 -> ~chi_1-   W+)
     1.60397693E-02    2     1000022        25   # BR(~chi_40 -> ~chi_10   h )
     1.01063342E-02    2     1000022        35   # BR(~chi_40 -> ~chi_10   H )
     1.81550294E-02    2     1000022        36   # BR(~chi_40 -> ~chi_10   A )
     1.55553739E-02    2     1000023        25   # BR(~chi_40 -> ~chi_20   h )
     1.82856154E-02    2     1000023        35   # BR(~chi_40 -> ~chi_20   H )
     1.01307007E-02    2     1000023        36   # BR(~chi_40 -> ~chi_20   A )
     2.20195848E-04    2     1000025        25   # BR(~chi_40 -> ~chi_30   h )
     4.24984253E-05    2     1000025        35   # BR(~chi_40 -> ~chi_30   H )
     1.34864327E-04    2     1000025        36   # BR(~chi_40 -> ~chi_30   A )
     2.83770513E-02    2     1000024       -37   # BR(~chi_40 -> ~chi_1+   H-)
     2.83770513E-02    2    -1000024        37   # BR(~chi_40 -> ~chi_1-   H+)
     3.42712997E-02    2     1000002        -2   # BR(~chi_40 -> ~u_L      ub)
     3.42712997E-02    2    -1000002         2   # BR(~chi_40 -> ~u_L*     u )
     2.25890152E-09    2     2000002        -2   # BR(~chi_40 -> ~u_R      ub)
     2.25890152E-09    2    -2000002         2   # BR(~chi_40 -> ~u_R*     u )
     3.42311468E-02    2     1000001        -1   # BR(~chi_40 -> ~d_L      db)
     3.42311468E-02    2    -1000001         1   # BR(~chi_40 -> ~d_L*     d )
     7.07344986E-10    2     2000001        -1   # BR(~chi_40 -> ~d_R      db)
     7.07344986E-10    2    -2000001         1   # BR(~chi_40 -> ~d_R*     d )
     3.42712854E-02    2     1000004        -4   # BR(~chi_40 -> ~c_L      cb)
     3.42712854E-02    2    -1000004         4   # BR(~chi_40 -> ~c_L*     c )
     2.25890139E-09    2     2000004        -4   # BR(~chi_40 -> ~c_R      cb)
     2.25890139E-09    2    -2000004         4   # BR(~chi_40 -> ~c_R*     c )
     3.42311468E-02    2     1000003        -3   # BR(~chi_40 -> ~s _L      sb)
     3.42311468E-02    2    -1000003         3   # BR(~chi_40 -> ~s _L*     s )
     7.07344986E-10    2     2000003        -3   # BR(~chi_40 -> ~s _R      sb)
     7.07344986E-10    2    -2000003         3   # BR(~chi_40 -> ~s _R*     s )
     6.79526841E-02    2     1000006        -6   # BR(~chi_40 -> ~t_1      tb)
     6.79526841E-02    2    -1000006         6   # BR(~chi_40 -> ~t_1*     t )
     6.87380403E-02    2     1000005        -5   # BR(~chi_40 -> ~b_1      bb)
     6.87380403E-02    2    -1000005         5   # BR(~chi_40 -> ~b_1*     b )
     1.01896777E-06    2     2000005        -5   # BR(~chi_40 -> ~b_2      bb)
     1.01896777E-06    2    -2000005         5   # BR(~chi_40 -> ~b_2*     b )
     2.64968670E-02    2     1000011       -11   # BR(~chi_40 -> ~e_L-     e+)
     2.64968670E-02    2    -1000011        11   # BR(~chi_40 -> ~e_L+     e-)
     1.28081839E-09    2     2000011       -11   # BR(~chi_40 -> ~e_R-     e+)
     1.28081839E-09    2    -2000011        11   # BR(~chi_40 -> ~e_R+     e-)
     2.64968670E-02    2     1000013       -13   # BR(~chi_40 -> ~mu_L-    mu+)
     2.64968670E-02    2    -1000013        13   # BR(~chi_40 -> ~mu_L+    mu-)
     1.28081839E-09    2     2000013       -13   # BR(~chi_40 -> ~mu_R-    mu+)
     1.28081839E-09    2    -2000013        13   # BR(~chi_40 -> ~mu_R+    mu-)
     2.78808687E-09    2     1000015       -15   # BR(~chi_40 -> ~tau_1-   tau+)
     2.78808687E-09    2    -1000015        15   # BR(~chi_40 -> ~tau_1+   tau-)
     2.65398774E-02    2     1000012       -12   # BR(~chi_40 -> ~nu_eL    nu_eb)
     2.65398774E-02    2    -1000012        12   # BR(~chi_40 -> ~nu_eL*   nu_e )
     2.65398774E-02    2     1000014       -14   # BR(~chi_40 -> ~nu_muL   nu_mub)
     2.65398774E-02    2    -1000014        14   # BR(~chi_40 -> ~nu_muL*  nu_mu )
#
#         PDG            Width
DECAY        25     4.41425098E-03   # h decays
#          BR         NDA      ID1       ID2
     5.65511997E-01    2           5        -5   # BR(h -> b       bb     )
     6.24804319E-02    2         -15        15   # BR(h -> tau+    tau-   )
     2.21186681E-04    2         -13        13   # BR(h -> mu+     mu-    )
     2.40651491E-04    2           3        -3   # BR(h -> s       sb     )
     1.99156144E-02    2           4        -4   # BR(h -> c       cb     )
     7.60851050E-02    2          21        21   # BR(h -> g       g      )
     2.29296620E-03    2          22        22   # BR(h -> gam     gam    )
     1.70939684E-03    2          22        23   # BR(h -> Z       gam    )
     2.40548526E-01    2          24       -24   # BR(h -> W+      W-     )
     3.09941246E-02    2          23        23   # BR(h -> Z       Z      )
#
#         PDG            Width
DECAY        35     3.56576358E+00   # H decays
#          BR         NDA      ID1       ID2
     6.62013058E-01    2           5        -5   # BR(H -> b       bb     )
     1.04896749E-01    2         -15        15   # BR(H -> tau+    tau-   )
     3.73626692E-04    2         -13        13   # BR(H -> mu+     mu-    )
     2.81285467E-04    2           3        -3   # BR(H -> s       sb     )
     8.21395316E-07    2           4        -4   # BR(H -> c       cb     )
     7.26851702E-02    2           6        -6   # BR(H -> t       tb     )
     1.03408538E-04    2          21        21   # BR(H -> g       g      )
     1.58861968E-07    2          22        22   # BR(H -> gam     gam    )
     9.86761162E-08    2          23        22   # BR(H -> Z       gam    )
     2.95645111E-04    2          24       -24   # BR(H -> W+      W-     )
     1.46071449E-04    2          23        23   # BR(H -> Z       Z      )
     1.03630042E-03    2          25        25   # BR(H -> h       h      )
     1.48903757E-03    2     1000024  -1000024   # BR(H -> ~chi_1+ ~chi_1-)
     1.45099612E-03    2     1000022   1000022   # BR(H -> ~chi_10 ~chi_10)
     1.94998966E-05    2     1000023   1000023   # BR(H -> ~chi_20 ~chi_20)
     1.06215306E-03    2     1000022   1000023   # BR(H -> ~chi_10 ~chi_20)
     3.89636099E-02    2     1000022   1000025   # BR(H -> ~chi_10 ~chi_30)
     1.15168599E-01    2     1000023   1000025   # BR(H -> ~chi_20 ~chi_30)
     6.85547409E-06    2     2000001  -2000001   # BR(H -> ~d_R    ~d_R*  )
     6.85547409E-06    2     2000003  -2000003   # BR(H -> ~s_R    ~s_R*  )
#
#         PDG            Width
DECAY        36     3.57149947E+00   # A decays
#          BR         NDA      ID1       ID2
     6.61177681E-01    2           5        -5   # BR(A -> b       bb     )
     1.04746028E-01    2         -15        15   # BR(A -> tau+    tau-   )
     3.73085002E-04    2         -13        13   # BR(A -> mu+     mu-    )
     2.80996486E-04    2           3        -3   # BR(A -> s       sb     )
     7.89914863E-07    2           4        -4   # BR(A -> c       cb     )
     7.58879416E-02    2           6        -6   # BR(A -> t       tb     )
     3.49453938E-04    2          21        21   # BR(A -> g       g      )
     3.69905397E-07    2          22        22   # BR(A -> gam     gam    )
     2.36804548E-07    2          23        22   # BR(A -> Z       gam    )
     2.90177667E-04    2          23        25   # BR(A -> Z       h      )
     1.93185047E-03    2     1000024  -1000024   # BR(A -> ~chi_1+ ~chi_1-)
     2.52435791E-03    2     1000022   1000022   # BR(A -> ~chi_10 ~chi_10)
     1.85565659E-05    2     1000023   1000023   # BR(A -> ~chi_20 ~chi_20)
     5.65484168E-04    2     1000022   1000023   # BR(A -> ~chi_10 ~chi_20)
     1.12817343E-01    2     1000022   1000025   # BR(A -> ~chi_10 ~chi_30)
     3.90356478E-02    2     1000023   1000025   # BR(A -> ~chi_20 ~chi_30)
#
#         PDG            Width
DECAY        37     3.53979762E+00   # H+ decays
#          BR         NDA      ID1       ID2
     1.12452788E-03    2           4        -5   # BR(H+ -> c       bb     )
     1.06040017E-01    2         -15        16   # BR(H+ -> tau+    nu_tau )
     3.77693927E-04    2         -13        14   # BR(H+ -> mu+     nu_mu  )
     1.12451643E-05    2           2        -5   # BR(H+ -> u       bb     )
     1.41642960E-05    2           2        -3   # BR(H+ -> u       sb     )
     2.79559915E-04    2           4        -3   # BR(H+ -> c       sb     )
     7.30734025E-01    2           6        -5   # BR(H+ -> t       bb     )
     2.97536905E-04    2          24        25   # BR(H+ -> W+      h      )
     1.81058273E-10    2          24        36   # BR(H+ -> W+      A      )
     5.49170764E-03    2     1000024   1000022   # BR(H+ -> ~chi_1+ ~chi_10)
     1.14466377E-03    2     1000024   1000023   # BR(H+ -> ~chi_1+ ~chi_20)
     1.54484858E-01    2     1000024   1000025   # BR(H+ -> ~chi_1+ ~chi_30)
