#
#                              ======================
#                              | THE SUSYHIT OUTPUT |
#                              ======================
#
#
#              ------------------------------------------------------
#              |     This is the output of the SUSY-HIT package     |
#              |  created by A.Djouadi, M.Muehlleitner and M.Spira. |
#              |  In case of problems with SUSY-HIT email to        |
#              |           margarete.muehlleitner@cern.ch           |
#              |           michael.spira@psi.ch                     |
#              |           abdelhak.djouadi@cern.ch                 |
#              ------------------------------------------------------
#
#              ------------------------------------------------------
#              |  SUSY Les Houches Accord - MSSM Spectrum + Decays  |
#              |              based on the decay programs           |
#              |                                                    |
#              |                     SDECAY 1.3b                    |
#              |                                                    |
#              |  Authors: M.Muhlleitner, A.Djouadi and Y.Mambrini  |
#              |  Ref.:    Comput.Phys.Commun.168(2005)46           |
#              |           [hep-ph/0311167]                         |
#              |                                                    |
#              |                     HDECAY 3.4                     |
#              |                                                    |
#              |  By: A.Djouadi,J.Kalinowski,M.Muhlleitner,M.Spira  |
#              |  Ref.:    Comput.Phys.Commun.108(1998)56           |
#              |           [hep-ph/9704448]                         |
#              |                                                    |
#              |                                                    |
#              |  If not stated otherwise all DRbar couplings and   |
#              |  soft SUSY breaking masses are given at the scale  |
#              |  Q=  0.27579870E+04
#              |                                                    |
#              ------------------------------------------------------
#
#
BLOCK DCINFO  # Decay Program information
     1   SDECAY/HDECAY # decay calculator
     2   1.3b  /3.4    # version number
#
BLOCK SPINFO  # Spectrum calculator information
     1     SOFTSUSY    # spectrum calculator               
     2     3.4.0       # version number                    
#
BLOCK MODSEL  # Model selection
     1     0   #  nonUniversal                                     
#
BLOCK SMINPUTS  # Standard Model inputs
         1     1.27908970E+02   # alpha_em^-1(M_Z)^MSbar
         2     1.16637870E-05   # G_F [GeV^-2]
         3     1.18400000E-01   # alpha_S(M_Z)^MSbar
         4     9.11876000E+01   # M_Z pole mass
         5     4.18000000E+00   # mb(mb)^MSbar
         6     1.73200000E+02   # mt pole mass
         7     1.77700000E+00   # mtau pole mass
#
BLOCK MINPAR  # Input parameters - minimal models
         3     7.28000000E+00   # tanb                
#
BLOCK EXTPAR  # Input parameters - non-minimal models
         0    -1.00000000E+00   # Set                 
         1     1.11600000E+03   # M_1(MX)             
         2    -3.94537000E+03   # M_2(MX)             
         3     9.25730000E+02   # M_3(MX)             
        11    -3.95002000E+03   # At(MX)              
        12     1.81240000E+02   # Ab(MX)              
        13    -1.95256000E+03   # Atau(MX)            
        23    -5.24490000E+02   # mu(MX)              
        26     3.42858000E+03   # mA(pole)            
        31     9.29350000E+02   # meL(MX)             
        32     9.29350000E+02   # mmuL(MX)            
        33     8.91040000E+02   # mtauL(MX)           
        34     1.25352000E+03   # meR(MX)             
        35     1.25352000E+03   # mmuR(MX)            
        36     1.66352000E+03   # mtauR(MX)           
        41     2.34065000E+03   # mqL1(MX)            
        42     2.34065000E+03   # mqL2(MX)            
        43     2.16417000E+03   # mqL3(MX)            
        44     3.88445000E+03   # muR(MX)             
        45     3.88445000E+03   # mcR(MX)             
        46     3.51463000E+03   # mtR(MX)             
        47     3.61674000E+03   # mdR(MX)             
        48     3.61674000E+03   # msR(MX)             
        49     2.56999000E+03   # mbR(MX)             
#
BLOCK MASS  # Mass Spectrum
# PDG code           mass       particle
        24     8.03982770E+01   # W+
        25     1.24158240E+02   # h
        35     3.42872823E+03   # H
        36     3.42857964E+03   # A
        37     3.42992029E+03   # H+
         5     4.81876030E+00   # b-quark pole mass calculated from mb(mb)_Msbar
   1000001     2.39357717E+03   # ~d_L
   2000001     3.65152690E+03   # ~d_R
   1000002     2.39245611E+03   # ~u_L
   2000002     3.92266638E+03   # ~u_R
   1000003     2.39357717E+03   # ~s_L
   2000003     3.65152690E+03   # ~s_R
   1000004     2.39245611E+03   # ~c_L
   2000004     3.92266638E+03   # ~c_R
   1000005     2.19024259E+03   # ~b_1
   2000005     2.60032707E+03   # ~b_2
   1000006     2.18425976E+03   # ~t_1
   2000006     3.48729113E+03   # ~t_2
   1000011     9.61004947E+02   # ~e_L
   2000011     1.25756982E+03   # ~e_R
   1000012     9.57604764E+02   # ~nu_eL
   1000013     9.61004947E+02   # ~mu_L
   2000013     1.25756982E+03   # ~mu_R
   1000014     9.57604764E+02   # ~nu_muL
   1000015     9.23123605E+02   # ~tau_1
   2000015     1.66598772E+03   # ~tau_2
   1000016     9.19598997E+02   # ~nu_tauL
   1000021     1.12226080E+03   # ~g
   1000022     5.43148297E+02   # ~chi_10
   1000023    -5.43764689E+02   # ~chi_20
   1000025     1.10477964E+03   # ~chi_30
   1000035    -3.88783585E+03   # ~chi_40
   1000024     5.43704956E+02   # ~chi_1+
   1000037     3.88800146E+03   # ~chi_2+
#
BLOCK NMIX  # Neutralino Mixing Matrix
  1  1    -4.66854666E-02   # N_11
  1  2    -1.05537892E-02   # N_12
  1  3     7.07024447E-01   # N_13
  1  4     7.05567513E-01   # N_14
  2  1    -2.12622189E-02   # N_21
  2  2    -1.85427626E-02   # N_22
  2  3    -7.06937548E-01   # N_23
  2  4     7.06713087E-01   # N_24
  3  1     9.98683306E-01   # N_31
  3  2    -6.88641353E-04   # N_32
  3  3     1.79992818E-02   # N_33
  3  4     4.80333851E-02   # N_34
  4  1    -1.99279635E-04   # N_41
  4  2     9.99772129E-01   # N_42
  4  3    -5.63567728E-03   # N_43
  4  4     2.05885931E-02   # N_44
#
BLOCK UMIX  # Chargino Mixing Matrix U
  1  1     7.96896580E-03   # U_11
  1  2     9.99968247E-01   # U_12
  2  1    -9.99968247E-01   # U_21
  2  2     7.96896580E-03   # U_22
#
BLOCK VMIX  # Chargino Mixing Matrix V
  1  1    -2.91156852E-02   # V_11
  1  2    -9.99576049E-01   # V_12
  2  1     9.99576049E-01   # V_21
  2  2    -2.91156852E-02   # V_22
#
BLOCK STOPMIX  # Stop Mixing Matrix
  1  1     9.97158918E-01   # cos(theta_t)
  1  2     7.53265707E-02   # sin(theta_t)
  2  1    -7.53265707E-02   # -sin(theta_t)
  2  2     9.97158918E-01   # cos(theta_t)
#
BLOCK SBOTMIX  # Sbottom Mixing Matrix
  1  1     9.99990191E-01   # cos(theta_b)
  1  2    -4.42921029E-03   # sin(theta_b)
  2  1     4.42921029E-03   # -sin(theta_b)
  2  2     9.99990191E-01   # cos(theta_b)
#
BLOCK STAUMIX  # Stau Mixing Matrix
  1  1     9.99998711E-01   # cos(theta_tau)
  1  2    -1.60561463E-03   # sin(theta_tau)
  2  1     1.60561463E-03   # -sin(theta_tau)
  2  2     9.99998711E-01   # cos(theta_tau)
#
BLOCK ALPHA  # Higgs mixing
          -1.43472763E-01   # Mixing angle in the neutral Higgs boson sector
#
BLOCK HMIX Q=  2.75798700E+03  # DRbar Higgs Parameters
         1    -5.32007669E+02   # mu(Q)MSSM           
         2     6.93619861E+00   # tan                 
         3     2.43117776E+02   # higgs               
         4     1.16196297E+07   # mA^2(Q)MSSM         
#
BLOCK GAUGE Q=  2.75798700E+03  # The gauge couplings
     1     3.64944798E-01   # gprime(Q) DRbar
     2     6.37022433E-01   # g(Q) DRbar
     3     1.02861420E+00   # g3(Q) DRbar
#
BLOCK AU Q=  2.75798700E+03  # The trilinear couplings
  1  1     0.00000000E+00   # A_u(Q) DRbar
  2  2     0.00000000E+00   # A_c(Q) DRbar
  3  3    -3.95001999E+03   # A_t(Q) DRbar
#
BLOCK AD Q=  2.75798700E+03  # The trilinear couplings
  1  1     0.00000000E+00   # A_d(Q) DRbar
  2  2     0.00000000E+00   # A_s(Q) DRbar
  3  3     1.81240000E+02   # A_b(Q) DRbar
#
BLOCK AE Q=  2.75798700E+03  # The trilinear couplings
  1  1     0.00000000E+00   # A_e(Q) DRbar
  2  2     0.00000000E+00   # A_mu(Q) DRbar
  3  3    -1.95256000E+03   # A_tau(Q) DRbar
#
BLOCK Yu Q=  2.75798700E+03  # The Yukawa couplings
  1  1     0.00000000E+00   # y_u(Q) DRbar
  2  2     0.00000000E+00   # y_c(Q) DRbar
  3  3     8.32250507E-01   # y_t(Q) DRbar
#
BLOCK Yd Q=  2.75798700E+03  # The Yukawa couplings
  1  1     0.00000000E+00   # y_d(Q) DRbar
  2  2     0.00000000E+00   # y_s(Q) DRbar
  3  3     9.49321454E-02   # y_b(Q) DRbar
#
BLOCK Ye Q=  2.75798700E+03  # The Yukawa couplings
  1  1     0.00000000E+00   # y_e(Q) DRbar
  2  2     0.00000000E+00   # y_mu(Q) DRbar
  3  3     7.21493200E-02   # y_tau(Q) DRbar
#
BLOCK MSOFT Q=  2.75798700E+03  # The soft SUSY breaking masses at the scale Q
         1     1.11600000E+03   # M_1(Q)              
         2    -3.94537000E+03   # M_2(Q)              
         3     9.25730000E+02   # M_3(Q)              
        21     1.11028704E+07   # mH1^2(Q)            
        22     7.06301676E+04   # mH2^2(Q)            
        31     9.29350000E+02   # meL(Q)              
        32     9.29350000E+02   # mmuL(Q)             
        33     8.91040000E+02   # mtauL(Q)            
        34     1.25352000E+03   # meR(Q)              
        35     1.25352000E+03   # mmuR(Q)             
        36     1.66352000E+03   # mtauR(Q)            
        41     2.34065000E+03   # mqL1(Q)             
        42     2.34065000E+03   # mqL2(Q)             
        43     2.16416999E+03   # mqL3(Q)             
        44     3.88445000E+03   # muR(Q)              
        45     3.88445000E+03   # mcR(Q)              
        46     3.51462999E+03   # mtR(Q)              
        47     3.61674000E+03   # mdR(Q)              
        48     3.61674000E+03   # msR(Q)              
        49     2.56999000E+03   # mbR(Q)              
#
Block HiggsBoundsInputHiggsCouplingsFermions
# ScalarNormEffCoupSq PseudoSNormEffCoupSq NP   IP1 IP2 IP2
    1.00400167E+00    0.00000000E+00        3  25   5   5  # h0-b-b eff. coupling^2, normalised to SM
    4.81068495E+01    0.00000000E+00        3  35   5   5  # H0-b-b eff. coupling^2, normalised to SM
    0.00000000E+00    4.81108512E+01        3  36   5   5  # A0-b-b eff. coupling^2, normalised to SM
#
    9.99916824E-01    0.00000000E+00        3  25   6   6  # h0-t-t eff. coupling^2, normalised to SM
    2.08685078E-02    0.00000000E+00        3  35   6   6  # H0-t-t eff. coupling^2, normalised to SM
    0.00000000E+00    2.07853317E-02        3  36   6   6  # A0-t-t eff. coupling^2, normalised to SM
#
    1.00400167E+00    0.00000000E+00        3  25  15  15  # h0-tau-tau eff. coupling^2, normalised to SM
    4.81068495E+01    0.00000000E+00        3  35  15  15  # H0-tau-tau eff. coupling^2, normalised to SM
    0.00000000E+00    4.81108512E+01        3  36  15  15  # A0-tau-tau eff. coupling^2, normalised to SM
#
Block HiggsBoundsInputHiggsCouplingsBosons
    9.99999917E-01        3  25  24  24  # h0-W-W eff. coupling^2, normalised to SM
    8.30482025E-08        3  35  24  24  # H0-W-W eff. coupling^2, normalised to SM
    0.00000000E+00        3  36  24  24  # A0-W-W eff. coupling^2, normalised to SM
#
    9.99999917E-01        3  25  23  23  # h0-Z-Z eff. coupling^2, normalised to SM
    8.30482025E-08        3  35  23  23  # H0-Z-Z eff. coupling^2, normalised to SM
    0.00000000E+00        3  36  23  23  # A0-Z-Z eff. coupling^2, normalised to SM
#
    8.90034256E-01        3  25  21  21  # h0-g-g eff. coupling^2, normalised to SM
    6.34144506E-13        3  35  21  21  # H0-g-g eff. coupling^2, normalised to SM
    2.09565821E-12        3  36  21  21  # A0-g-g eff. coupling^2, normalised to SM
#
    0.00000000E+00        3  25  25  23  # h0-h0-Z eff. coupling^2, normalised to SM
    0.00000000E+00        3  35  25  23  # H0-h0-Z eff. coupling^2, normalised to SM
    8.30482025E-08        3  36  25  23  # A0-h0-Z eff. coupling^2, normalised to SM
    0.00000000E+00        3  35  35  23  # H0-H0-Z eff. coupling^2, normalised to SM
    9.99999917E-01        3  36  35  23  # A0-H0-Z eff. coupling^2, normalised to SM
    0.00000000E+00        3  36  36  23  # A0-A0-Z eff. coupling^2, normalised to SM
#
    0.00000000E+00        4  25  21  21  23  # h0-g-g-Z eff. coupling^2, normalised to SM
    0.00000000E+00        4  35  21  21  23  # H0-g-g-Z eff. coupling^2, normalised to SM
    0.00000000E+00        4  36  21  21  23  # A0-g-g-Z eff. coupling^2, normalised to SM
#
#
#
#                             =================
#                             |The decay table|
#                             =================
#
# - The QCD corrections to the decays gluino -> squark  + quark
#                                     squark -> gaugino + quark_prime
#                                     squark -> squark_prime + Higgs
#                                     squark -> gluino  + quark
#   are included.
#
# - The multi-body decays for the inos, stops and sbottoms are included.
#
# - The loop induced decays for the gluino, neutralinos and stops
#   are included.
#
# - The SUSY decays of the top quark are included.
#
#
#         PDG            Width
DECAY         6     1.42878742E+00   # top decays
#          BR         NDA      ID1       ID2
     1.00000000E+00    2           5        24   # BR(t ->  b    W+)
#
#         PDG            Width
DECAY   1000021     2.42095876E-04   # gluino decays
#          BR         NDA      ID1       ID2
     4.80356107E-02    2     1000022        21   # BR(~g -> ~chi_10 g)
     4.40031405E-02    2     1000023        21   # BR(~g -> ~chi_20 g)
     9.58846725E-09    2     1000025        21   # BR(~g -> ~chi_30 g)
#           BR         NDA      ID1       ID2       ID3
     9.16342779E-06    3     1000022         1        -1   # BR(~g -> ~chi_10 d  db)
     1.49079811E-05    3     1000023         1        -1   # BR(~g -> ~chi_20 d  db)
     8.01612166E-10    3     1000025         1        -1   # BR(~g -> ~chi_30 d  db)
     9.17336682E-05    3     1000022         2        -2   # BR(~g -> ~chi_10 u  ub)
     3.67483530E-05    3     1000023         2        -2   # BR(~g -> ~chi_20 u  ub)
     1.34059738E-09    3     1000025         2        -2   # BR(~g -> ~chi_30 u  ub)
     9.16342779E-06    3     1000022         3        -3   # BR(~g -> ~chi_10 s  sb)
     1.49079811E-05    3     1000023         3        -3   # BR(~g -> ~chi_20 s  sb)
     8.01612166E-10    3     1000025         3        -3   # BR(~g -> ~chi_30 s  sb)
     9.17336682E-05    3     1000022         4        -4   # BR(~g -> ~chi_10 c  cb)
     3.67483530E-05    3     1000023         4        -4   # BR(~g -> ~chi_20 c  cb)
     1.34059738E-09    3     1000025         4        -4   # BR(~g -> ~chi_30 c  cb)
     8.69789205E-03    3     1000022         5        -5   # BR(~g -> ~chi_10 b  bb)
     8.62548995E-03    3     1000023         5        -5   # BR(~g -> ~chi_20 b  bb)
     1.01976279E-09    3     1000025         5        -5   # BR(~g -> ~chi_30 b  bb)
     1.74015156E-01    3     1000022         6        -6   # BR(~g -> ~chi_10 t  tb)
     1.15827029E-01    3     1000023         6        -6   # BR(~g -> ~chi_20 t  tb)
     8.55382097E-05    3     1000024         1        -2   # BR(~g -> ~chi_1+ d  ub)
     8.55382097E-05    3    -1000024         2        -1   # BR(~g -> ~chi_1- u  db)
     8.55382097E-05    3     1000024         3        -4   # BR(~g -> ~chi_1+ s  cb)
     8.55382097E-05    3    -1000024         4        -3   # BR(~g -> ~chi_1- c  sb)
     3.00074203E-01    3     1000024         5        -6   # BR(~g -> ~chi_1+ b  tb)
     3.00074203E-01    3    -1000024         6        -5   # BR(~g -> ~chi_1- t  bb)
#
#         PDG            Width
DECAY   1000006     9.26247160E+01   # stop1 decays
#          BR         NDA      ID1       ID2
     1.39929343E-01    2     1000022         6   # BR(~t_1 -> ~chi_10 t )
     1.41396844E-01    2     1000023         6   # BR(~t_1 -> ~chi_20 t )
     1.96407912E-03    2     1000025         6   # BR(~t_1 -> ~chi_30 t )
     4.50829313E-03    2     1000024         5   # BR(~t_1 -> ~chi_1+ b )
     7.12201441E-01    2     1000021         6   # BR(~t_1 -> ~g      t )
#
#         PDG            Width
DECAY   2000006     3.20735056E+02   # stop2 decays
#          BR         NDA      ID1       ID2
     7.06722683E-02    2     1000022         6   # BR(~t_2 -> ~chi_10 t )
     7.07864179E-02    2     1000023         6   # BR(~t_2 -> ~chi_20 t )
     2.11245826E-02    2     1000025         6   # BR(~t_2 -> ~chi_30 t )
     1.42185303E-01    2     1000024         5   # BR(~t_2 -> ~chi_1+ b )
     4.84811922E-01    2     1000021         6   # BR(~t_2 -> ~g      t )
     5.34691913E-02    2     1000006        25   # BR(~t_2 -> ~t_1    h )
     5.35538487E-02    2     1000006        23   # BR(~t_2 -> ~t_1    Z )
     1.03395672E-01    2     1000005        24   # BR(~t_2 -> ~b_1    W+)
     7.94375981E-07    2     2000005        24   # BR(~t_2 -> ~b_2    W+)
#
#         PDG            Width
DECAY   1000005     9.35480344E+01   # sbottom1 decays
#          BR         NDA      ID1       ID2
     1.85017884E-03    2     1000022         5   # BR(~b_1 -> ~chi_10 b )
     1.86491502E-03    2     1000023         5   # BR(~b_1 -> ~chi_20 b )
     1.92426735E-03    2     1000025         5   # BR(~b_1 -> ~chi_30 b )
     2.79677647E-01    2    -1000024         6   # BR(~b_1 -> ~chi_1- t )
     7.14682992E-01    2     1000021         5   # BR(~b_1 -> ~g      b )
#
#         PDG            Width
DECAY   2000005     9.85393079E+01   # sbottom2 decays
#          BR         NDA      ID1       ID2
     2.19247724E-03    2     1000022         5   # BR(~b_2 -> ~chi_10 b )
     2.16801465E-03    2     1000023         5   # BR(~b_2 -> ~chi_20 b )
     1.04089096E-02    2     1000025         5   # BR(~b_2 -> ~chi_30 b )
     4.29850709E-03    2    -1000024         6   # BR(~b_2 -> ~chi_1- t )
     9.80824386E-01    2     1000021         5   # BR(~b_2 -> ~g      b )
     2.97039566E-05    2     1000005        25   # BR(~b_2 -> ~b_1    h )
     2.56350871E-05    2     1000005        23   # BR(~b_2 -> ~b_1    Z )
     5.23665582E-05    2     1000006       -24   # BR(~b_2 -> ~t_1    W-)
#
#         PDG            Width
DECAY   1000002     1.02365401E+02   # sup_L decays
#          BR         NDA      ID1       ID2
     3.10876434E-05    2     1000022         2   # BR(~u_L -> ~chi_10 u)
     4.18917272E-05    2     1000023         2   # BR(~u_L -> ~chi_20 u)
     2.04248259E-03    2     1000025         2   # BR(~u_L -> ~chi_30 u)
     1.39023245E-04    2     1000024         1   # BR(~u_L -> ~chi_1+ d)
     9.97745515E-01    2     1000021         2   # BR(~u_L -> ~g      u)
#
#         PDG            Width
DECAY   2000002     2.39653550E+02   # sup_R decays
#          BR         NDA      ID1       ID2
     7.83949389E-05    2     1000022         2   # BR(~u_R -> ~chi_10 u)
     1.62593582E-05    2     1000023         2   # BR(~u_R -> ~chi_20 u)
     3.16121319E-02    2     1000025         2   # BR(~u_R -> ~chi_30 u)
     5.31363385E-13    2     1000035         2   # BR(~u_R -> ~chi_40 u)
     9.68293214E-01    2     1000021         2   # BR(~u_R -> ~g      u)
#
#         PDG            Width
DECAY   1000001     1.02451658E+02   # sdown_L decays
#          BR         NDA      ID1       ID2
     2.20142563E-07    2     1000022         1   # BR(~d_L -> ~chi_10 d)
     1.71933815E-05    2     1000023         1   # BR(~d_L -> ~chi_20 d)
     2.07247602E-03    2     1000025         1   # BR(~d_L -> ~chi_30 d)
     1.04116992E-05    2    -1000024         2   # BR(~d_L -> ~chi_1- u)
     9.97899699E-01    2     1000021         1   # BR(~d_L -> ~g      d)
#
#         PDG            Width
DECAY   2000001     2.11845135E+02   # sdown_R decays
#          BR         NDA      ID1       ID2
     2.05083109E-05    2     1000022         1   # BR(~d_R -> ~chi_10 d)
     4.25342956E-06    2     1000023         1   # BR(~d_R -> ~chi_20 d)
     8.10138330E-03    2     1000025         1   # BR(~d_R -> ~chi_30 d)
     9.91873855E-01    2     1000021         1   # BR(~d_R -> ~g      d)
#
#         PDG            Width
DECAY   1000004     8.19328502E+01   # scharm_L decays
#          BR         NDA      ID1       ID2
     4.01902869E-05    2     1000022         4   # BR(~c_L -> ~chi_10 c)
     5.41577501E-05    2     1000023         4   # BR(~c_L -> ~chi_20 c)
     2.63450017E-03    2     1000025         4   # BR(~c_L -> ~chi_30 c)
     1.79729873E-04    2     1000024         3   # BR(~c_L -> ~chi_1+ s)
     9.97091422E-01    2     1000021         4   # BR(~c_L -> ~g      c)
#
#         PDG            Width
DECAY   2000004     1.93448277E+02   # scharm_R decays
#          BR         NDA      ID1       ID2
     1.00137620E-04    2     1000022         4   # BR(~c_R -> ~chi_10 c)
     2.07688509E-05    2     1000023         4   # BR(~c_R -> ~chi_20 c)
     4.03757292E-02    2     1000025         4   # BR(~c_R -> ~chi_30 c)
     5.92199728E-13    2     1000035         4   # BR(~c_R -> ~chi_40 c)
     9.59503364E-01    2     1000021         4   # BR(~c_R -> ~g      c)
#
#         PDG            Width
DECAY   1000003     8.19982929E+01   # sstrange_L decays
#          BR         NDA      ID1       ID2
     2.84612824E-07    2     1000022         3   # BR(~s_L -> ~chi_10 s)
     2.22285324E-05    2     1000023         3   # BR(~s_L -> ~chi_20 s)
     2.67330670E-03    2     1000025         3   # BR(~s_L -> ~chi_30 s)
     1.34608030E-05    2    -1000024         4   # BR(~s_L -> ~chi_1- c)
     9.97290719E-01    2     1000021         3   # BR(~s_L -> ~g      s)
#
#         PDG            Width
DECAY   2000003     1.69847281E+02   # sstrange_R decays
#          BR         NDA      ID1       ID2
     2.63826113E-05    2     1000022         3   # BR(~s_R -> ~chi_10 s)
     5.47175835E-06    2     1000023         3   # BR(~s_R -> ~chi_20 s)
     1.04197386E-02    2     1000025         3   # BR(~s_R -> ~chi_30 s)
     9.89548407E-01    2     1000021         3   # BR(~s_R -> ~g      s)
#
#         PDG            Width
DECAY   1000011     4.41975507E-03   # selectron_L decays
#          BR         NDA      ID1       ID2
     5.65560892E-01    2     1000022        11   # BR(~e_L -> ~chi_10 e-)
     3.82907848E-01    2     1000023        11   # BR(~e_L -> ~chi_20 e-)
     5.15312599E-02    2    -1000024        12   # BR(~e_L -> ~chi_1- nu_e)
#
#         PDG            Width
DECAY   2000011     3.57823432E-01   # selectron_R decays
#          BR         NDA      ID1       ID2
     2.68604531E-02    2     1000022        11   # BR(~e_R -> ~chi_10 e-)
     5.56563394E-03    2     1000023        11   # BR(~e_R -> ~chi_20 e-)
     9.67573913E-01    2     1000025        11   # BR(~e_R -> ~chi_30 e-)
#
#         PDG            Width
DECAY   1000013     4.41975485E-03   # smuon_L decays
#          BR         NDA      ID1       ID2
     5.65560890E-01    2     1000022        13   # BR(~mu_L -> ~chi_10 mu-)
     3.82907847E-01    2     1000023        13   # BR(~mu_L -> ~chi_20 mu-)
     5.15312624E-02    2    -1000024        14   # BR(~mu_L -> ~chi_1- nu_mu)
#
#         PDG            Width
DECAY   2000013     3.57823338E-01   # smuon_R decays
#          BR         NDA      ID1       ID2
     2.68604596E-02    2     1000022        13   # BR(~mu_R -> ~chi_10 mu-)
     5.56563528E-03    2     1000023        13   # BR(~mu_R -> ~chi_20 mu-)
     9.67573905E-01    2     1000025        13   # BR(~mu_R -> ~chi_30 mu-)
#
#         PDG            Width
DECAY   1000015     4.46560836E-02   # stau_1 decays
#          BR         NDA      ID1       ID2
     5.06235451E-01    2     1000022        15   # BR(~tau_1 -> ~chi_10  tau-)
     4.89035475E-01    2     1000023        15   # BR(~tau_1 -> ~chi_20  tau-)
     4.72907446E-03    2    -1000024        16   # BR(~tau_1 -> ~chi_1-  nu_tau)
#
#         PDG            Width
DECAY   2000015     3.06275232E+00   # stau_2 decays
#          BR         NDA      ID1       ID2
     2.75154756E-02    2     1000022        15   # BR(~tau_2 -> ~chi_10  tau-)
     2.35174727E-02    2     1000023        15   # BR(~tau_2 -> ~chi_20  tau-)
     9.02375982E-01    2     1000025        15   # BR(~tau_2 -> ~chi_30  tau-)
     4.49581952E-02    2    -1000024        16   # BR(~tau_2 -> ~chi_1-  nu_tau)
     8.01698543E-04    2     1000016       -24   # BR(~tau_2 -> ~nu_tauL W-)
     4.23788020E-04    2     1000015        25   # BR(~tau_2 -> ~tau_1   h)
     4.07388256E-04    2     1000015        23   # BR(~tau_2 -> ~tau_1   Z)
#
#         PDG            Width
DECAY   1000012     3.54737867E-03   # snu_eL decays
#          BR         NDA      ID1       ID2
     1.31436593E-01    2     1000022        12   # BR(~nu_eL -> ~chi_10 nu_e)
     2.02462976E-02    2     1000023        12   # BR(~nu_eL -> ~chi_20 nu_e)
     8.48317109E-01    2     1000024        11   # BR(~nu_eL -> ~chi_1+ e-)
#
#         PDG            Width
DECAY   1000014     3.54737851E-03   # snu_muL decays
#          BR         NDA      ID1       ID2
     1.31436599E-01    2     1000022        14   # BR(~nu_muL -> ~chi_10 nu_mu)
     2.02462986E-02    2     1000023        14   # BR(~nu_muL -> ~chi_20 nu_mu)
     8.48317102E-01    2     1000024        13   # BR(~nu_muL -> ~chi_1+ mu-)
#
#         PDG            Width
DECAY   1000016     4.33528194E-02   # snu_tauL decays
#          BR         NDA      ID1       ID2
     9.51805988E-03    2     1000022        16   # BR(~nu_tauL -> ~chi_10 nu_tau)
     1.46573818E-03    2     1000023        16   # BR(~nu_tauL -> ~chi_20 nu_tau)
     9.89016202E-01    2     1000024        15   # BR(~nu_tauL -> ~chi_1+ tau-)
#
#         PDG            Width
DECAY   1000024     3.08837510E-13   # chargino1+ decays
#           BR         NDA      ID1       ID2       ID3
     1.00836940E-01    3     1000022       -11        12   # BR(~chi_1+ -> ~chi_10 e+   nu_e)
     8.47421050E-02    3     1000022       -13        14   # BR(~chi_1+ -> ~chi_10 mu+  nu_mu)
     8.06733390E-01    2     1000022       211             # BR(~chi_1+ -> ~chi_10 pi+)
     7.68260200E-03    3     1000022       211        111   # BR(~chi_1+ -> ~chi_10 pi+ pi0)
     2.47819990E-06    4     1000022       211        111       111 # BR(~chi_1+ -> ~chi_10 pi+ pi0 pi0)
     2.47819990E-06    4     1000022       211        211      -211 # BR(~chi_1+ -> ~chi_10 pi+ pi+ pi-)
#
#         PDG            Width
DECAY   1000037     2.29952237E+02   # chargino2+ decays
#          BR         NDA      ID1       ID2
     7.67902867E-02    2     1000002        -1   # BR(~chi_2+ -> ~u_L     db)
     7.67633535E-02    2    -1000001         2   # BR(~chi_2+ -> ~d_L*    u )
     7.67902851E-02    2     1000004        -3   # BR(~chi_2+ -> ~c_L     sb)
     7.67633272E-02    2    -1000003         4   # BR(~chi_2+ -> ~s_L*     c )
     9.58235244E-02    2     1000006        -5   # BR(~chi_2+ -> ~t_1     bb)
     1.09241352E-05    2     2000006        -5   # BR(~chi_2+ -> ~t_2     bb)
     9.43424414E-02    2    -1000005         6   # BR(~chi_2+ -> ~b_1*    t )
     1.94432953E-06    2    -2000005         6   # BR(~chi_2+ -> ~b_2*    t )
     6.01690918E-02    2     1000012       -11   # BR(~chi_2+ -> ~nu_eL   e+  )
     6.01690918E-02    2     1000014       -13   # BR(~chi_2+ -> ~nu_muL mu+ )
     6.07751827E-02    2     1000016       -15   # BR(~chi_2+ -> ~nu_tau1 tau+)
     6.01610005E-02    2    -1000011        12   # BR(~chi_2+ -> ~e_L+    nu_e)
     6.01610005E-02    2    -1000013        14   # BR(~chi_2+ -> ~mu_L+   nu_mu)
     6.07672596E-02    2    -1000015        16   # BR(~chi_2+ -> ~tau_1+  nu_tau)
     2.86151595E-07    2    -2000015        16   # BR(~chi_2+ -> ~tau_2+  nu_tau)
     3.53450927E-02    2     1000024        23   # BR(~chi_2+ -> ~chi_1+  Z )
     3.41677351E-02    2     1000022        24   # BR(~chi_2+ -> ~chi_10  W+)
     3.42657069E-02    2     1000023        24   # BR(~chi_2+ -> ~chi_20  W+)
     8.85371388E-05    2     1000025        24   # BR(~chi_2+ -> ~chi_30  W+)
     3.66439284E-02    2     1000024        25   # BR(~chi_2+ -> ~chi_1+  h )
#
#         PDG            Width
DECAY   1000022     0.00000000E+00   # neutralino1 decays
#
#         PDG            Width
DECAY   1000023     3.10590569E-13   # neutralino2 decays
#          BR         NDA      ID1       ID2
     7.98303430E-01    2     1000022        22   # BR(~chi_20 -> ~chi_10 gam)
#           BR         NDA      ID1       ID2       ID3
     3.36947705E-02    3     1000022        -2         2   # BR(~chi_20 -> ~chi_10 ub      u)
     4.37546225E-02    3     1000022        -1         1   # BR(~chi_20 -> ~chi_10 db      d)
     4.37546225E-02    3     1000022        -3         3   # BR(~chi_20 -> ~chi_10 sb      s)
     1.00622478E-02    3     1000022       -11        11   # BR(~chi_20 -> ~chi_10 e+      e-)
     1.00622478E-02    3     1000022       -13        13   # BR(~chi_20 -> ~chi_10 mu+     mu-)
     2.01224720E-02    3     1000022       -12        12   # BR(~chi_20 -> ~chi_10 nu_eb   nu_e)
     2.01224720E-02    3     1000022       -14        14   # BR(~chi_20 -> ~chi_10 nu_mub  nu_mu)
     2.01224665E-02    3     1000022       -16        16   # BR(~chi_20 -> ~chi_10 nu_taub nu_tau)
     3.24174393E-07    3     1000024       -12        11   # BR(~chi_20 -> ~chi_1+ nu_eb   e-)
     3.24174393E-07    3    -1000024        12       -11   # BR(~chi_20 -> ~chi_1- nu_e    e+)
#
#         PDG            Width
DECAY   1000025     2.56530108E+00   # neutralino3 decays
#          BR         NDA      ID1       ID2
     3.42233538E-02    2     1000022        23   # BR(~chi_30 -> ~chi_10   Z )
     1.54972277E-01    2     1000023        23   # BR(~chi_30 -> ~chi_20   Z )
     1.84585772E-01    2     1000024       -24   # BR(~chi_30 -> ~chi_1+   W-)
     1.84585772E-01    2    -1000024        24   # BR(~chi_30 -> ~chi_1-   W+)
     1.65259067E-01    2     1000022        25   # BR(~chi_30 -> ~chi_10   h )
     3.30698038E-02    2     1000023        25   # BR(~chi_30 -> ~chi_20   h )
     1.68075199E-02    2     1000011       -11   # BR(~chi_30 -> ~e_L-     e+)
     1.68075199E-02    2    -1000011        11   # BR(~chi_30 -> ~e_L+     e-)
     1.68075199E-02    2     1000013       -13   # BR(~chi_30 -> ~mu_L-    mu+)
     1.68075199E-02    2    -1000013        13   # BR(~chi_30 -> ~mu_L+    mu-)
     2.58544912E-02    2     1000015       -15   # BR(~chi_30 -> ~tau_1-   tau+)
     2.58544912E-02    2    -1000015        15   # BR(~chi_30 -> ~tau_1+   tau-)
     1.76386839E-02    2     1000012       -12   # BR(~chi_30 -> ~nu_eL    nu_eb)
     1.76386839E-02    2    -1000012        12   # BR(~chi_30 -> ~nu_eL*   nu_e )
     1.76386839E-02    2     1000014       -14   # BR(~chi_30 -> ~nu_muL   nu_mub)
     1.76386839E-02    2    -1000014        14   # BR(~chi_30 -> ~nu_muL*  nu_mu )
     2.69050781E-02    2     1000016       -16   # BR(~chi_30 -> ~nu_tau1  nu_taub)
     2.69050781E-02    2    -1000016        16   # BR(~chi_30 -> ~nu_tau1* nu_tau )
#
#         PDG            Width
DECAY   1000035     2.29923272E+02   # neutralino4 decays
#          BR         NDA      ID1       ID2
     2.66007755E-02    2     1000022        23   # BR(~chi_40 -> ~chi_10   Z )
     8.67394710E-03    2     1000023        23   # BR(~chi_40 -> ~chi_20   Z )
     7.60130705E-05    2     1000025        23   # BR(~chi_40 -> ~chi_30   Z )
     3.42547447E-02    2     1000024       -24   # BR(~chi_40 -> ~chi_1+   W-)
     3.42547447E-02    2    -1000024        24   # BR(~chi_40 -> ~chi_1-   W+)
     8.81961824E-03    2     1000022        25   # BR(~chi_40 -> ~chi_10   h )
     2.77926535E-02    2     1000023        25   # BR(~chi_40 -> ~chi_20   h )
     1.72663314E-05    2     1000025        25   # BR(~chi_40 -> ~chi_30   h )
     3.84065264E-02    2     1000002        -2   # BR(~chi_40 -> ~u_L      ub)
     3.84065264E-02    2    -1000002         2   # BR(~chi_40 -> ~u_L*     u )
     3.83687809E-02    2     1000001        -1   # BR(~chi_40 -> ~d_L      db)
     3.83687809E-02    2    -1000001         1   # BR(~chi_40 -> ~d_L*     d )
     8.41720404E-12    2     2000001        -1   # BR(~chi_40 -> ~d_R      db)
     8.41720404E-12    2    -2000001         1   # BR(~chi_40 -> ~d_R*     d )
     3.84065133E-02    2     1000004        -4   # BR(~chi_40 -> ~c_L      cb)
     3.84065133E-02    2    -1000004         4   # BR(~chi_40 -> ~c_L*     c )
     3.83687809E-02    2     1000003        -3   # BR(~chi_40 -> ~s _L      sb)
     3.83687809E-02    2    -1000003         3   # BR(~chi_40 -> ~s _L*     s )
     8.41720404E-12    2     2000003        -3   # BR(~chi_40 -> ~s _R      sb)
     8.41720404E-12    2    -2000003         3   # BR(~chi_40 -> ~s _R*     s )
     4.73958801E-02    2     1000006        -6   # BR(~chi_40 -> ~t_1      tb)
     4.73958801E-02    2    -1000006         6   # BR(~chi_40 -> ~t_1*     t )
     4.67425159E-06    2     2000006        -6   # BR(~chi_40 -> ~t_2      tb)
     4.67425159E-06    2    -2000006         6   # BR(~chi_40 -> ~t_2*     t )
     4.76883213E-02    2     1000005        -5   # BR(~chi_40 -> ~b_1      bb)
     4.76883213E-02    2    -1000005         5   # BR(~chi_40 -> ~b_1*     b )
     9.86369078E-07    2     2000005        -5   # BR(~chi_40 -> ~b_2      bb)
     9.86369078E-07    2    -2000005         5   # BR(~chi_40 -> ~b_2*     b )
     3.00640087E-02    2     1000011       -11   # BR(~chi_40 -> ~e_L-     e+)
     3.00640087E-02    2    -1000011        11   # BR(~chi_40 -> ~e_L+     e-)
     1.42640299E-09    2     2000011       -11   # BR(~chi_40 -> ~e_R-     e+)
     1.42640299E-09    2    -2000011        11   # BR(~chi_40 -> ~e_R+     e-)
     3.00640087E-02    2     1000013       -13   # BR(~chi_40 -> ~mu_L-    mu+)
     3.00640087E-02    2    -1000013        13   # BR(~chi_40 -> ~mu_L+    mu-)
     1.42640299E-09    2     2000013       -13   # BR(~chi_40 -> ~mu_R-    mu+)
     1.42640299E-09    2    -2000013        13   # BR(~chi_40 -> ~mu_R+    mu-)
     3.03669704E-02    2     1000015       -15   # BR(~chi_40 -> ~tau_1-   tau+)
     3.03669704E-02    2    -1000015        15   # BR(~chi_40 -> ~tau_1+   tau-)
     1.44210976E-07    2     2000015       -15   # BR(~chi_40 -> ~tau_2-   tau+)
     1.44210976E-07    2    -2000015        15   # BR(~chi_40 -> ~tau_2+   tau-)
     3.01054026E-02    2     1000012       -12   # BR(~chi_40 -> ~nu_eL    nu_eb)
     3.01054026E-02    2    -1000012        12   # BR(~chi_40 -> ~nu_eL*   nu_e )
     3.01054026E-02    2     1000014       -14   # BR(~chi_40 -> ~nu_muL   nu_mub)
     3.01054026E-02    2    -1000014        14   # BR(~chi_40 -> ~nu_muL*  nu_mu )
     3.04087149E-02    2     1000016       -16   # BR(~chi_40 -> ~nu_tau1  nu_taub)
     3.04087149E-02    2    -1000016        16   # BR(~chi_40 -> ~nu_tau1* nu_tau )
#
#         PDG            Width
DECAY        25     3.90196235E-03   # h decays
#          BR         NDA      ID1       ID2
     6.06907587E-01    2           5        -5   # BR(h -> b       bb     )
     6.61254956E-02    2         -15        15   # BR(h -> tau+    tau-   )
     2.34063641E-04    2         -13        13   # BR(h -> mu+     mu-    )
     2.55855958E-04    2           3        -3   # BR(h -> s       sb     )
     2.21051221E-02    2           4        -4   # BR(h -> c       cb     )
     8.02062939E-02    2          21        21   # BR(h -> g       g      )
     2.34608640E-03    2          22        22   # BR(h -> gam     gam    )
     1.48391042E-03    2          22        23   # BR(h -> Z       gam    )
     1.96156852E-01    2          24       -24   # BR(h -> W+      W-     )
     2.41787333E-02    2          23        23   # BR(h -> Z       Z      )
#
#         PDG            Width
DECAY        35     8.13703464E+00   # H decays
#          BR         NDA      ID1       ID2
     2.22934645E-01    2           5        -5   # BR(H -> b       bb     )
     4.13565818E-02    2         -15        15   # BR(H -> tau+    tau-   )
     1.46175484E-04    2         -13        13   # BR(H -> mu+     mu-    )
     9.25459910E-05    2           3        -3   # BR(H -> s       sb     )
     3.54556005E-06    2           4        -4   # BR(H -> c       cb     )
     3.49334192E-01    2           6        -6   # BR(H -> t       tb     )
     1.48780521E-04    2          21        21   # BR(H -> g       g      )
     8.01515908E-07    2          22        22   # BR(H -> gam     gam    )
     2.36241758E-07    2          23        22   # BR(H -> Z       gam    )
     1.32328920E-04    2          24       -24   # BR(H -> W+      W-     )
     6.60379139E-05    2          23        23   # BR(H -> Z       Z      )
     4.69434561E-04    2          25        25   # BR(H -> h       h      )
     2.33601568E-03    2     1000024  -1000024   # BR(H -> ~chi_1+ ~chi_1-)
     4.07246276E-04    2     1000022   1000022   # BR(H -> ~chi_10 ~chi_10)
     5.60842650E-05    2     1000023   1000023   # BR(H -> ~chi_20 ~chi_20)
     2.78898993E-04    2     1000025   1000025   # BR(H -> ~chi_30 ~chi_30)
     3.50314104E-04    2     1000022   1000023   # BR(H -> ~chi_10 ~chi_20)
     2.17957124E-01    2     1000022   1000025   # BR(H -> ~chi_10 ~chi_30)
     1.54277127E-01    2     1000023   1000025   # BR(H -> ~chi_20 ~chi_30)
     1.65677017E-05    2     1000011  -1000011   # BR(H -> ~e_L-   ~e_L+  )
     8.76135974E-06    2     2000011  -2000011   # BR(H -> ~e_R-   ~e_R+  )
     1.65677017E-05    2     1000013  -1000013   # BR(H -> ~mu_L-  ~mu_L+ )
     8.76135974E-06    2     2000013  -2000013   # BR(H -> ~mu_R-  ~mu_R+ )
     1.38020873E-05    2     1000015  -1000015   # BR(H -> ~tau_1- ~tau_1+)
     3.25668919E-06    2     2000015  -2000015   # BR(H -> ~tau_2- ~tau_2+)
     4.71071933E-03    2     1000015  -2000015   # BR(H -> ~tau_1- ~tau_2+)
     4.71071933E-03    2     2000015  -1000015   # BR(H -> ~tau_2- ~tau_1+)
     5.39284429E-05    2     1000012  -1000012   # BR(H -> ~nu_eL  ~nu_eL*   )
     5.39284429E-05    2     1000014  -1000014   # BR(H -> ~nu_muL ~nu_muL*  )
     5.48715879E-05    2     1000016  -1000016   # BR(H -> ~nu_tauL ~nu_tauL*)
#
#         PDG            Width
DECAY        36     8.14712402E+00   # A decays
#          BR         NDA      ID1       ID2
     2.22801152E-01    2           5        -5   # BR(A -> b       bb     )
     4.13070831E-02    2         -15        15   # BR(A -> tau+    tau-   )
     1.46000375E-04    2         -13        13   # BR(A -> mu+     mu-    )
     9.25704344E-05    2           3        -3   # BR(A -> s       sb     )
     3.55964991E-06    2           4        -4   # BR(A -> c       cb     )
     3.49777867E-01    2           6        -6   # BR(A -> t       tb     )
     2.70082656E-04    2          21        21   # BR(A -> g       g      )
     9.73021873E-07    2          22        22   # BR(A -> gam     gam    )
     3.55189830E-07    2          23        22   # BR(A -> Z       gam    )
     1.34004107E-04    2          23        25   # BR(A -> Z       h      )
     3.03823363E-03    2     1000024  -1000024   # BR(A -> ~chi_1+ ~chi_1-)
     2.53144876E-04    2     1000022   1000022   # BR(A -> ~chi_10 ~chi_10)
     1.11376277E-04    2     1000023   1000023   # BR(A -> ~chi_20 ~chi_20)
     9.39415768E-05    2     1000025   1000025   # BR(A -> ~chi_30 ~chi_30)
     3.82365298E-04    2     1000022   1000023   # BR(A -> ~chi_10 ~chi_20)
     1.54345540E-01    2     1000022   1000025   # BR(A -> ~chi_10 ~chi_30)
     2.17833019E-01    2     1000023   1000025   # BR(A -> ~chi_20 ~chi_30)
     4.70436600E-03    2     1000015  -2000015   # BR(A -> ~tau_1- ~tau_2+)
     4.70436600E-03    2    -1000015   2000015   # BR(A -> ~tau_1+ ~tau_2-)
#
#         PDG            Width
DECAY        37     8.07709689E+00   # H+ decays
#          BR         NDA      ID1       ID2
     3.75811427E-04    2           4        -5   # BR(H+ -> c       bb     )
     4.16815008E-02    2         -15        16   # BR(H+ -> tau+    nu_tau )
     1.47323759E-04    2         -13        14   # BR(H+ -> mu+     nu_mu  )
     3.75805298E-06    2           2        -5   # BR(H+ -> u       bb     )
     4.66881630E-06    2           2        -3   # BR(H+ -> u       sb     )
     9.53407767E-05    2           4        -3   # BR(H+ -> c       sb     )
     5.70369425E-01    2           6        -5   # BR(H+ -> t       bb     )
     1.35389358E-04    2          24        25   # BR(H+ -> W+      h      )
     7.05483570E-13    2          24        36   # BR(H+ -> W+      A      )
     3.00368435E-03    2     1000024   1000022   # BR(H+ -> ~chi_1+ ~chi_10)
     7.66604028E-04    2     1000024   1000023   # BR(H+ -> ~chi_1+ ~chi_20)
     3.73714664E-01    2     1000024   1000025   # BR(H+ -> ~chi_1+ ~chi_30)
     6.54666793E-05    2    -1000011   1000012   # BR(H+ -> ~e_L+   ~nu_eL )
     6.54666793E-05    2    -1000013   1000014   # BR(H+ -> ~mu_L+  ~nu_muL)
     6.21607241E-05    2    -1000015   1000016   # BR(H+ -> ~tau_1+ ~nu_tauL)
     9.50873500E-03    2    -2000015   1000016   # BR(H+ -> ~tau_2+ ~nu_tauL)
