#
#                              ======================
#                              | THE SUSYHIT OUTPUT |
#                              ======================
#
#
#              ------------------------------------------------------
#              |     This is the output of the SUSY-HIT package     |
#              |  created by A.Djouadi, M.Muehlleitner and M.Spira. |
#              |  In case of problems with SUSY-HIT email to        |
#              |           margarete.muehlleitner@cern.ch           |
#              |           michael.spira@psi.ch                     |
#              |           abdelhak.djouadi@cern.ch                 |
#              ------------------------------------------------------
#
#              ------------------------------------------------------
#              |  SUSY Les Houches Accord - MSSM Spectrum + Decays  |
#              |              based on the decay programs           |
#              |                                                    |
#              |                     SDECAY 1.3b                    |
#              |                                                    |
#              |  Authors: M.Muhlleitner, A.Djouadi and Y.Mambrini  |
#              |  Ref.:    Comput.Phys.Commun.168(2005)46           |
#              |           [hep-ph/0311167]                         |
#              |                                                    |
#              |                     HDECAY 3.4                     |
#              |                                                    |
#              |  By: A.Djouadi,J.Kalinowski,M.Muhlleitner,M.Spira  |
#              |  Ref.:    Comput.Phys.Commun.108(1998)56           |
#              |           [hep-ph/9704448]                         |
#              |                                                    |
#              |                                                    |
#              |  If not stated otherwise all DRbar couplings and   |
#              |  soft SUSY breaking masses are given at the scale  |
#              |  Q=  0.35708620E+04
#              |                                                    |
#              ------------------------------------------------------
#
#
BLOCK DCINFO  # Decay Program information
     1   SDECAY/HDECAY # decay calculator
     2   1.3b  /3.4    # version number
#
BLOCK SPINFO  # Spectrum calculator information
     1     SOFTSUSY    # spectrum calculator               
     2     3.4.0       # version number                    
#
BLOCK MODSEL  # Model selection
     1     0   #  nonUniversal                                     
#
BLOCK SMINPUTS  # Standard Model inputs
         1     1.27908970E+02   # alpha_em^-1(M_Z)^MSbar
         2     1.16637870E-05   # G_F [GeV^-2]
         3     1.18400000E-01   # alpha_S(M_Z)^MSbar
         4     9.11876000E+01   # M_Z pole mass
         5     4.18000000E+00   # mb(mb)^MSbar
         6     1.73200000E+02   # mt pole mass
         7     1.77700000E+00   # mtau pole mass
#
BLOCK MINPAR  # Input parameters - minimal models
         3     2.87800000E+01   # tanb                
#
BLOCK EXTPAR  # Input parameters - non-minimal models
         0    -1.00000000E+00   # Set                 
         1    -3.56675000E+03   # M_1(MX)             
         2     5.18970000E+02   # M_2(MX)             
         3     2.06937000E+03   # M_3(MX)             
        11    -4.70507000E+03   # At(MX)              
        12    -1.40893000E+03   # Ab(MX)              
        13     5.46660000E+02   # Atau(MX)            
        23     3.24284000E+03   # mu(MX)              
        26     1.94565000E+03   # mA(pole)            
        31     3.71459000E+03   # meL(MX)             
        32     3.71459000E+03   # mmuL(MX)            
        33     3.58381000E+03   # mtauL(MX)           
        34     5.98150000E+02   # meR(MX)             
        35     5.98150000E+02   # mmuR(MX)            
        36     9.27300000E+02   # mtauR(MX)           
        41     3.49290000E+02   # mqL1(MX)            
        42     3.49290000E+02   # mqL2(MX)            
        43     3.69916000E+03   # mqL3(MX)            
        44     4.34390000E+02   # muR(MX)             
        45     4.34390000E+02   # mcR(MX)             
        46     3.44707000E+03   # mtR(MX)             
        47     2.59422000E+03   # mdR(MX)             
        48     2.59422000E+03   # msR(MX)             
        49     3.99219000E+03   # mbR(MX)             
#
BLOCK MASS  # Mass Spectrum
# PDG code           mass       particle
        24     8.03745215E+01   # W+
        25     1.26918633E+02   # h
        35     1.94562232E+03   # H
        36     1.94564992E+03   # A
        37     1.94735846E+03   # H+
         5     4.81876030E+00   # b-quark pole mass calculated from mb(mb)_Msbar
   1000001     6.82988237E+02   # ~d_L
   2000001     2.68117168E+03   # ~d_R
   1000002     6.78379403E+02   # ~u_L
   2000002     7.25759200E+02   # ~u_R
   1000003     6.82988237E+02   # ~s_L
   2000003     2.68117168E+03   # ~s_R
   1000004     6.78379403E+02   # ~c_L
   2000004     7.25759200E+02   # ~c_R
   1000005     3.72239033E+03   # ~b_1
   2000005     4.04367895E+03   # ~b_2
   1000006     3.43013501E+03   # ~t_1
   2000006     3.75455010E+03   # ~t_2
   1000011     3.72325867E+03   # ~e_L
   2000011     6.51642093E+02   # ~e_R
   1000012     3.72209832E+03   # ~nu_eL
   1000013     3.72325867E+03   # ~mu_L
   2000013     6.51642093E+02   # ~mu_R
   1000014     3.72209832E+03   # ~nu_muL
   1000015     9.58899778E+02   # ~tau_1
   2000015     3.59047578E+03   # ~tau_2
   1000016     3.58896422E+03   # ~nu_tauL
   1000021     2.23773038E+03   # ~g
   1000022     5.32206642E+02   # ~chi_10
   1000023    -3.29255216E+03   # ~chi_20
   1000025     3.29718612E+03   # ~chi_30
   1000035    -3.51090654E+03   # ~chi_40
   1000024     5.32372263E+02   # ~chi_1+
   1000037     3.29824333E+03   # ~chi_2+
#
BLOCK NMIX  # Neutralino Mixing Matrix
  1  1     7.51813970E-05   # N_11
  1  2     9.99705442E-01   # N_12
  1  3    -2.38190305E-02   # N_13
  1  4     4.65582001E-03   # N_14
  2  1     1.52151952E-01   # N_21
  2  2     1.33964422E-02   # N_22
  2  3     6.99248598E-01   # N_23
  2  4     6.98370759E-01   # N_24
  3  1    -4.75914680E-03   # N_31
  3  2     2.01344595E-02   # N_32
  3  3     7.06836494E-01   # N_33
  3  4    -7.07074342E-01   # N_34
  4  1     9.88345652E-01   # N_41
  4  2    -2.04142268E-03   # N_42
  4  3    -1.04241173E-01   # N_43
  4  4    -1.10916555E-01   # N_44
#
BLOCK UMIX  # Chargino Mixing Matrix U
  1  1     9.99432621E-01   # U_11
  1  2    -3.36814035E-02   # U_12
  2  1     3.36814035E-02   # U_21
  2  2     9.99432621E-01   # U_22
#
BLOCK VMIX  # Chargino Mixing Matrix V
  1  1     9.99978330E-01   # V_11
  1  2    -6.58327476E-03   # V_12
  2  1     6.58327476E-03   # V_21
  2  2     9.99978330E-01   # V_22
#
BLOCK STOPMIX  # Stop Mixing Matrix
  1  1     3.03337907E-01   # cos(theta_t)
  1  2     9.52883054E-01   # sin(theta_t)
  2  1    -9.52883054E-01   # -sin(theta_t)
  2  2     3.03337907E-01   # cos(theta_t)
#
BLOCK SBOTMIX  # Sbottom Mixing Matrix
  1  1     9.97246620E-01   # cos(theta_b)
  1  2     7.41564488E-02   # sin(theta_b)
  2  1    -7.41564488E-02   # -sin(theta_b)
  2  2     9.97246620E-01   # cos(theta_b)
#
BLOCK STAUMIX  # Stau Mixing Matrix
  1  1     1.36942962E-02   # cos(theta_tau)
  1  2     9.99906229E-01   # sin(theta_tau)
  2  1    -9.99906229E-01   # -sin(theta_tau)
  2  2     1.36942962E-02   # cos(theta_tau)
#
BLOCK ALPHA  # Higgs mixing
          -3.62456238E-02   # Mixing angle in the neutral Higgs boson sector
#
BLOCK HMIX Q=  3.57086200E+03  # DRbar Higgs Parameters
         1     3.29656703E+03   # mu(Q)MSSM           
         2     2.76792669E+01   # tan                 
         3     2.42699885E+02   # higgs               
         4     4.36041962E+06   # mA^2(Q)MSSM         
#
BLOCK GAUGE Q=  3.57086200E+03  # The gauge couplings
     1     3.65728832E-01   # gprime(Q) DRbar
     2     6.39567094E-01   # g(Q) DRbar
     3     1.01728298E+00   # g3(Q) DRbar
#
BLOCK AU Q=  3.57086200E+03  # The trilinear couplings
  1  1     0.00000000E+00   # A_u(Q) DRbar
  2  2     0.00000000E+00   # A_c(Q) DRbar
  3  3    -4.70506998E+03   # A_t(Q) DRbar
#
BLOCK AD Q=  3.57086200E+03  # The trilinear couplings
  1  1     0.00000000E+00   # A_d(Q) DRbar
  2  2     0.00000000E+00   # A_s(Q) DRbar
  3  3    -1.40892999E+03   # A_b(Q) DRbar
#
BLOCK AE Q=  3.57086200E+03  # The trilinear couplings
  1  1     0.00000000E+00   # A_e(Q) DRbar
  2  2     0.00000000E+00   # A_mu(Q) DRbar
  3  3     5.46660002E+02   # A_tau(Q) DRbar
#
BLOCK Yu Q=  3.57086200E+03  # The Yukawa couplings
  1  1     0.00000000E+00   # y_u(Q) DRbar
  2  2     0.00000000E+00   # y_c(Q) DRbar
  3  3     8.08001780E-01   # y_t(Q) DRbar
#
BLOCK Yd Q=  3.57086200E+03  # The Yukawa couplings
  1  1     0.00000000E+00   # y_d(Q) DRbar
  2  2     0.00000000E+00   # y_s(Q) DRbar
  3  3     3.33076898E-01   # y_b(Q) DRbar
#
BLOCK Ye Q=  3.57086200E+03  # The Yukawa couplings
  1  1     0.00000000E+00   # y_e(Q) DRbar
  2  2     0.00000000E+00   # y_mu(Q) DRbar
  3  3     2.88305972E-01   # y_tau(Q) DRbar
#
BLOCK MSOFT Q=  3.57086200E+03  # The soft SUSY breaking masses at the scale Q
         1    -3.56675000E+03   # M_1(Q)              
         2     5.18970000E+02   # M_2(Q)              
         3     2.06937000E+03   # M_3(Q)              
        21    -7.14019120E+06   # mH1^2(Q)            
        22    -1.06607732E+07   # mH2^2(Q)            
        31     3.71459000E+03   # meL(Q)              
        32     3.71459000E+03   # mmuL(Q)             
        33     3.58381000E+03   # mtauL(Q)            
        34     5.98150000E+02   # meR(Q)              
        35     5.98150000E+02   # mmuR(Q)             
        36     9.27300001E+02   # mtauR(Q)            
        41     3.49289943E+02   # mqL1(Q)             
        42     3.49289943E+02   # mqL2(Q)             
        43     3.69915999E+03   # mqL3(Q)             
        44     4.34389954E+02   # muR(Q)              
        45     4.34389954E+02   # mcR(Q)              
        46     3.44706998E+03   # mtR(Q)              
        47     2.59421999E+03   # mdR(Q)              
        48     2.59421999E+03   # msR(Q)              
        49     3.99218999E+03   # mbR(Q)              
#
Block HiggsBoundsInputHiggsCouplingsFermions
# ScalarNormEffCoupSq PseudoSNormEffCoupSq NP   IP1 IP2 IP2
    1.00738765E+00    0.00000000E+00        3  25   5   5  # h0-b-b eff. coupling^2, normalised to SM
    7.66134428E+02    0.00000000E+00        3  35   5   5  # H0-b-b eff. coupling^2, normalised to SM
    0.00000000E+00    7.66141816E+02        3  36   5   5  # A0-b-b eff. coupling^2, normalised to SM
#
    9.99990357E-01    0.00000000E+00        3  25   6   6  # h0-t-t eff. coupling^2, normalised to SM
    1.31488404E-03    0.00000000E+00        3  35   6   6  # H0-t-t eff. coupling^2, normalised to SM
    0.00000000E+00    1.30524138E-03        3  36   6   6  # A0-t-t eff. coupling^2, normalised to SM
#
    1.00738765E+00    0.00000000E+00        3  25  15  15  # h0-tau-tau eff. coupling^2, normalised to SM
    7.66134428E+02    0.00000000E+00        3  35  15  15  # H0-tau-tau eff. coupling^2, normalised to SM
    0.00000000E+00    7.66141816E+02        3  36  15  15  # A0-tau-tau eff. coupling^2, normalised to SM
#
Block HiggsBoundsInputHiggsCouplingsBosons
    9.99999982E-01        3  25  24  24  # h0-W-W eff. coupling^2, normalised to SM
    1.77437492E-08        3  35  24  24  # H0-W-W eff. coupling^2, normalised to SM
    0.00000000E+00        3  36  24  24  # A0-W-W eff. coupling^2, normalised to SM
#
    9.99999982E-01        3  25  23  23  # h0-Z-Z eff. coupling^2, normalised to SM
    1.77437492E-08        3  35  23  23  # H0-Z-Z eff. coupling^2, normalised to SM
    0.00000000E+00        3  36  23  23  # A0-Z-Z eff. coupling^2, normalised to SM
#
    8.84828024E-01        3  25  21  21  # h0-g-g eff. coupling^2, normalised to SM
    2.69084491E-11        3  35  21  21  # H0-g-g eff. coupling^2, normalised to SM
    2.25524904E-10        3  36  21  21  # A0-g-g eff. coupling^2, normalised to SM
#
    0.00000000E+00        3  25  25  23  # h0-h0-Z eff. coupling^2, normalised to SM
    0.00000000E+00        3  35  25  23  # H0-h0-Z eff. coupling^2, normalised to SM
    1.77437492E-08        3  36  25  23  # A0-h0-Z eff. coupling^2, normalised to SM
    0.00000000E+00        3  35  35  23  # H0-H0-Z eff. coupling^2, normalised to SM
    9.99999982E-01        3  36  35  23  # A0-H0-Z eff. coupling^2, normalised to SM
    0.00000000E+00        3  36  36  23  # A0-A0-Z eff. coupling^2, normalised to SM
#
    0.00000000E+00        4  25  21  21  23  # h0-g-g-Z eff. coupling^2, normalised to SM
    0.00000000E+00        4  35  21  21  23  # H0-g-g-Z eff. coupling^2, normalised to SM
    0.00000000E+00        4  36  21  21  23  # A0-g-g-Z eff. coupling^2, normalised to SM
#
#
#
#                             =================
#                             |The decay table|
#                             =================
#
# - The QCD corrections to the decays gluino -> squark  + quark
#                                     squark -> gaugino + quark_prime
#                                     squark -> squark_prime + Higgs
#                                     squark -> gluino  + quark
#   are included.
#
# - The multi-body decays for the inos, stops and sbottoms are included.
#
# - The loop induced decays for the gluino, neutralinos and stops
#   are included.
#
# - The SUSY decays of the top quark are included.
#
#
#         PDG            Width
DECAY         6     1.44128786E+00   # top decays
#          BR         NDA      ID1       ID2
     1.00000000E+00    2           5        24   # BR(t ->  b    W+)
#
#         PDG            Width
DECAY   1000021     2.40474974E+02   # gluino decays
#          BR         NDA      ID1       ID2
     8.39939870E-02    2     1000001        -1   # BR(~g -> ~d_L  db)
     8.39939870E-02    2    -1000001         1   # BR(~g -> ~d_L* d )
     8.42262588E-02    2     1000002        -2   # BR(~g -> ~u_L  ub)
     8.42262588E-02    2    -1000002         2   # BR(~g -> ~u_L* u )
     8.17797639E-02    2     2000002        -2   # BR(~g -> ~u_R  ub)
     8.17797639E-02    2    -2000002         2   # BR(~g -> ~u_R* u )
     8.39939870E-02    2     1000003        -3   # BR(~g -> ~s_L  sb)
     8.39939870E-02    2    -1000003         3   # BR(~g -> ~s_L* s )
     8.42262498E-02    2     1000004        -4   # BR(~g -> ~c_L  cb)
     8.42262498E-02    2    -1000004         4   # BR(~g -> ~c_L* c )
     8.17797536E-02    2     2000004        -4   # BR(~g -> ~c_R  cb)
     8.17797536E-02    2    -2000004         4   # BR(~g -> ~c_R* c )
#
#         PDG            Width
DECAY   1000006     6.93358989E+01   # stop1 decays
#          BR         NDA      ID1       ID2
     1.84615916E-02    2     1000022         6   # BR(~t_1 -> ~chi_10 t )
     3.71562312E-02    2     1000024         5   # BR(~t_1 -> ~chi_1+ b )
     3.33142460E-03    2     1000037         5   # BR(~t_1 -> ~chi_2+ b )
     9.41050753E-01    2     1000021         6   # BR(~t_1 -> ~g      t )
#
#         PDG            Width
DECAY   2000006     1.33202246E+02   # stop2 decays
#          BR         NDA      ID1       ID2
     9.89524355E-02    2     1000022         6   # BR(~t_2 -> ~chi_10 t )
     7.41618342E-03    2     1000023         6   # BR(~t_2 -> ~chi_20 t )
     1.07794309E-02    2     1000025         6   # BR(~t_2 -> ~chi_30 t )
     8.91032290E-05    2     1000035         6   # BR(~t_2 -> ~chi_40 t )
     1.98972065E-01    2     1000024         5   # BR(~t_2 -> ~chi_1+ b )
     4.79966380E-03    2     1000037         5   # BR(~t_2 -> ~chi_2+ b )
     6.05272181E-01    2     1000021         6   # BR(~t_2 -> ~g      t )
     3.06668647E-02    2     1000006        25   # BR(~t_2 -> ~t_1    h )
     4.30520723E-02    2     1000006        23   # BR(~t_2 -> ~t_1    Z )
#
#         PDG            Width
DECAY   1000005     1.38133683E+02   # sbottom1 decays
#          BR         NDA      ID1       ID2
     1.04869896E-01    2     1000022         5   # BR(~b_1 -> ~chi_10 b )
     1.41054008E-03    2     1000023         5   # BR(~b_1 -> ~chi_20 b )
     1.37102047E-03    2     1000025         5   # BR(~b_1 -> ~chi_30 b )
     4.79672703E-05    2     1000035         5   # BR(~b_1 -> ~chi_40 b )
     2.08587650E-01    2    -1000024         6   # BR(~b_1 -> ~chi_1- t )
     1.44772480E-02    2    -1000037         6   # BR(~b_1 -> ~chi_2- t )
     6.03579053E-01    2     1000021         5   # BR(~b_1 -> ~g      b )
     6.56566257E-02    2     1000006       -24   # BR(~b_1 -> ~t_1    W-)
#
#         PDG            Width
DECAY   2000005     1.10919514E+02   # sbottom2 decays
#          BR         NDA      ID1       ID2
     4.59755979E-04    2     1000022         5   # BR(~b_2 -> ~chi_10 b )
     4.43181629E-03    2     1000023         5   # BR(~b_2 -> ~chi_20 b )
     4.54843971E-03    2     1000025         5   # BR(~b_2 -> ~chi_30 b )
     1.37625688E-03    2     1000035         5   # BR(~b_2 -> ~chi_40 b )
     9.14836522E-04    2    -1000024         6   # BR(~b_2 -> ~chi_1- t )
     9.68402661E-03    2    -1000037         6   # BR(~b_2 -> ~chi_2- t )
     9.63040879E-01    2     1000021         5   # BR(~b_2 -> ~g      b )
     3.79114069E-03    2     1000005        25   # BR(~b_2 -> ~b_1    h )
     3.31509915E-03    2     1000005        23   # BR(~b_2 -> ~b_1    Z )
     4.08188573E-03    2     1000006       -24   # BR(~b_2 -> ~t_1    W-)
     4.35586350E-03    2     2000006       -24   # BR(~b_2 -> ~t_2    W-)
#
#         PDG            Width
DECAY   1000002     1.28956621E+00   # sup_L decays
#          BR         NDA      ID1       ID2
     3.33655898E-01    2     1000022         2   # BR(~u_L -> ~chi_10 u)
     6.66344102E-01    2     1000024         1   # BR(~u_L -> ~chi_1+ d)
#
#         PDG            Width
DECAY   2000002     8.98197297E-08   # sup_R decays
#           BR         NDA      ID1       ID2
     2.41732680E-02    2     1000022         2   # BR(~u_R -> ~chi_10 u)
#           BR         NDA      ID1       ID2       ID3
     1.64462753E-01    3        2       -1        1000001   # BR(~u_R -> u  db  ~d_L)
     1.61022529E-02    3        2       1        -1000001   # BR(~u_R -> u  d  ~d_L*)
     2.74739192E-01    3        2       -2        1000002   # BR(~u_R -> u  ub  ~u_L)
     2.67658343E-02    3        2       2        -1000002   # BR(~u_R -> u  u  ~u_L*)
     1.64173284E-01    3        2       -3        1000003   # BR(~u_R -> u  sb  ~s_L)
     1.62892942E-02    3        2       3        -1000003   # BR(~u_R -> u  s  ~s_L*)
     2.70441696E-01    3        2       -4        1000004   # BR(~u_R -> u  cb  ~c_L)
     2.71655237E-02    3        2       4        -1000004   # BR(~u_R -> u  c  ~c_L*)
     2.88500089E-04    3        2       -11        2000011   # BR(~u_R -> u  e+  ~e_R-)
     7.46116697E-03    3        2       11        -2000011   # BR(~u_R -> u  e-  ~e_R+)
     2.96293477E-04    3        2       -13        2000013   # BR(~u_R -> u  mu+  ~mu_R-)
     7.60233862E-03    3        2       13        -2000013   # BR(~u_R -> u  mu-  ~mu_R+)
     1.60120722E-06    3        2       23        1000022   # BR(~u_R -> u  Z  ~chi_10)
     3.92419351E-06    3        2       25        1000022   # BR(~u_R -> u  h  ~chi_10)
     1.95335703E-05    3        2       -24        1000024   # BR(~u_R -> u  W-  ~chi_1+)
     1.35437949E-05    3        2       24        -1000024   # BR(~u_R -> u  W+  ~chi_1-)
#
#         PDG            Width
DECAY   1000001     1.35276485E+00   # sdown_L decays
#          BR         NDA      ID1       ID2
     3.33870989E-01    2     1000022         1   # BR(~d_L -> ~chi_10 d)
     6.66129011E-01    2    -1000024         2   # BR(~d_L -> ~chi_1- u)
#
#         PDG            Width
DECAY   2000001     2.02940814E+01   # sdown_R decays
#          BR         NDA      ID1       ID2
     3.88764146E-10    2     1000022         1   # BR(~d_R -> ~chi_10 d)
     1.00000000E+00    2     1000021         1   # BR(~d_R -> ~g      d)
#
#         PDG            Width
DECAY   1000004     1.22240967E+00   # scharm_L decays
#          BR         NDA      ID1       ID2
     3.33645862E-01    2     1000022         4   # BR(~c_L -> ~chi_10 c)
     6.66354138E-01    2     1000024         3   # BR(~c_L -> ~chi_1+ s)
#
#         PDG            Width
DECAY   2000004     8.93793211E-08   # scharm_R decays
#           BR         NDA      ID1       ID2
     2.31964989E-02    2     1000022         4   # BR(~c_R -> ~chi_10 c)
#           BR         NDA      ID1       ID2       ID3
     1.64836786E-01    3        4       -1        1000001   # BR(~c_R -> c  db  ~d_L)
     1.64322125E-02    3        4       1        -1000001   # BR(~c_R -> c  d  ~d_L*)
     2.75958686E-01    3        4       -2        1000002   # BR(~c_R -> c  ub  ~u_L)
     2.68462545E-02    3        4       2        -1000002   # BR(~c_R -> c  u  ~u_L*)
     1.63885783E-01    3        4       -3        1000003   # BR(~c_R -> c  sb  ~s_L)
     1.62800520E-02    3        4       3        -1000003   # BR(~c_R -> c  s  ~s_L*)
     2.70308609E-01    3        4       -4        1000004   # BR(~c_R -> c  cb  ~c_L)
     2.66650045E-02    3        4       4        -1000004   # BR(~c_R -> c  c  ~c_L*)
     2.88131524E-04    3        4       -11        2000011   # BR(~c_R -> c  e+  ~e_R-)
     7.46761098E-03    3        4       11        -2000011   # BR(~c_R -> c  e-  ~e_R+)
     2.93613776E-04    3        4       -13        2000013   # BR(~c_R -> c  mu+  ~mu_R-)
     7.50195897E-03    3        4       13        -2000013   # BR(~c_R -> c  mu-  ~mu_R+)
     1.61692882E-06    3        4       23        1000022   # BR(~c_R -> c  Z  ~chi_10)
     3.93927807E-06    3        4       25        1000022   # BR(~c_R -> c  h  ~chi_10)
     1.95951365E-05    3        4       -24        1000024   # BR(~c_R -> c  W-  ~chi_1+)
     1.36474521E-05    3        4       24        -1000024   # BR(~c_R -> c  W+  ~chi_1-)
#
#         PDG            Width
DECAY   1000003     1.28336629E+00   # sstrange_L decays
#          BR         NDA      ID1       ID2
     3.33889115E-01    2     1000022         3   # BR(~s_L -> ~chi_10 s)
     6.66110885E-01    2    -1000024         4   # BR(~s_L -> ~chi_1- c)
#
#         PDG            Width
DECAY   2000003     1.35524306E+01   # sstrange_R decays
#          BR         NDA      ID1       ID2
     6.10166231E-10    2     1000022         3   # BR(~s_R -> ~chi_10 s)
     9.99999999E-01    2     1000021         3   # BR(~s_R -> ~g      s)
#
#         PDG            Width
DECAY   1000011     4.36369878E+01   # selectron_L decays
#          BR         NDA      ID1       ID2
     3.32959432E-01    2     1000022        11   # BR(~e_L -> ~chi_10 e-)
     1.66286730E-04    2     1000023        11   # BR(~e_L -> ~chi_20 e-)
     4.90107612E-06    2     1000025        11   # BR(~e_L -> ~chi_30 e-)
     1.35194464E-03    2     1000035        11   # BR(~e_L -> ~chi_40 e-)
     6.65480932E-01    2    -1000024        12   # BR(~e_L -> ~chi_1- nu_e)
     3.65029188E-05    2    -1000037        12   # BR(~e_L -> ~chi_2- nu_e)
#
#         PDG            Width
DECAY   2000011     2.17345399E-09   # selectron_R decays
#           BR         NDA      ID1       ID2
     9.99954912E-01    2     1000022        11   # BR(~e_R -> ~chi_10 e-)
#           BR         NDA      ID1       ID2       ID3
     2.23294352E-06    3        11       23        1000022   # BR(~e_R- -> e-  Z  ~chi_10)
     2.39264325E-05    3        11       -24        1000024   # BR(~e_R- -> e-  W-  ~chi_1+)
     1.89283970E-05    3        11       24        -1000024   # BR(~e_R- -> e-  W+  ~chi_1-)
#
#         PDG            Width
DECAY   1000013     4.36369878E+01   # smuon_L decays
#          BR         NDA      ID1       ID2
     3.32959432E-01    2     1000022        13   # BR(~mu_L -> ~chi_10 mu-)
     1.66286725E-04    2     1000023        13   # BR(~mu_L -> ~chi_20 mu-)
     4.90107595E-06    2     1000025        13   # BR(~mu_L -> ~chi_30 mu-)
     1.35194446E-03    2     1000035        13   # BR(~mu_L -> ~chi_40 mu-)
     6.65480933E-01    2    -1000024        14   # BR(~mu_L -> ~chi_1- nu_mu)
     3.65029188E-05    2    -1000037        14   # BR(~mu_L -> ~chi_2- nu_mu)
#
#         PDG            Width
DECAY   2000013     2.17345311E-09   # smuon_R decays
#           BR         NDA      ID1       ID2
     9.99954839E-01    2     1000022        13   # BR(~mu_R -> ~chi_10 mu-)
#           BR         NDA      ID1       ID2       ID3
     2.23138009E-06    3        13       23        1000022   # BR(~mu_R- -> mu-  Z  ~chi_10)
     2.38887141E-05    3        13       -24        1000024   # BR(~mu_R- -> mu-  W-  ~chi_1+)
     1.90406684E-05    3        13       24        -1000024   # BR(~mu_R- -> mu-  W+  ~chi_1-)
#
#         PDG            Width
DECAY   1000015     4.66934651E-03   # stau_1 decays
#          BR         NDA      ID1       ID2
     3.33544637E-01    2     1000022        15   # BR(~tau_1 -> ~chi_10  tau-)
     6.66455363E-01    2    -1000024        16   # BR(~tau_1 -> ~chi_1-  nu_tau)
#
#         PDG            Width
DECAY   2000015     4.66754428E+01   # stau_2 decays
#          BR         NDA      ID1       ID2
     2.99127563E-01    2     1000022        15   # BR(~tau_2 -> ~chi_10  tau-)
     1.64215948E-03    2     1000023        15   # BR(~tau_2 -> ~chi_20  tau-)
     1.56592924E-03    2     1000025        15   # BR(~tau_2 -> ~chi_30  tau-)
     1.95246611E-04    2     1000035        15   # BR(~tau_2 -> ~chi_40  tau-)
     5.97725507E-01    2    -1000024        16   # BR(~tau_2 -> ~chi_1-  nu_tau)
     2.42383244E-05    2    -1000037        16   # BR(~tau_2 -> ~chi_2-  nu_tau)
     4.90158044E-02    2     1000015        25   # BR(~tau_2 -> ~tau_1   h)
     1.23511508E-03    2     1000015        35   # BR(~tau_2 -> ~tau_1   H)
     1.23440642E-03    2     1000015        36   # BR(~tau_2 -> ~tau_1   A)
     4.82340300E-02    2     1000015        23   # BR(~tau_2 -> ~tau_1   Z)
#
#         PDG            Width
DECAY   1000012     4.36469766E+01   # snu_eL decays
#          BR         NDA      ID1       ID2
     3.32713596E-01    2     1000022        12   # BR(~nu_eL -> ~chi_10 nu_e)
     8.89320280E-05    2     1000023        12   # BR(~nu_eL -> ~chi_20 nu_e)
     8.40110123E-06    2     1000025        12   # BR(~nu_eL -> ~chi_30 nu_e)
     1.35719365E-03    2     1000035        12   # BR(~nu_eL -> ~chi_40 nu_e)
     6.65830489E-01    2     1000024        11   # BR(~nu_eL -> ~chi_1+ e-)
     1.38745765E-06    2     1000037        11   # BR(~nu_eL -> ~chi_2+ e-)
#
#         PDG            Width
DECAY   1000014     4.36469766E+01   # snu_muL decays
#          BR         NDA      ID1       ID2
     3.32713597E-01    2     1000022        14   # BR(~nu_muL -> ~chi_10 nu_mu)
     8.89320281E-05    2     1000023        14   # BR(~nu_muL -> ~chi_20 nu_mu)
     8.40110124E-06    2     1000025        14   # BR(~nu_muL -> ~chi_30 nu_mu)
     1.35719365E-03    2     1000035        14   # BR(~nu_muL -> ~chi_40 nu_mu)
     6.65830489E-01    2     1000024        13   # BR(~nu_muL -> ~chi_1+ mu-)
     1.38745761E-06    2     1000037        13   # BR(~nu_muL -> ~chi_2+ mu-)
#
#         PDG            Width
DECAY   1000016     4.65317712E+01   # snu_tauL decays
#          BR         NDA      ID1       ID2
     2.99975230E-01    2     1000022        16   # BR(~nu_tauL -> ~chi_10 nu_tau)
     4.26429454E-05    2     1000023        16   # BR(~nu_tauL -> ~chi_20 nu_tau)
     3.98906613E-06    2     1000025        16   # BR(~nu_tauL -> ~chi_30 nu_tau)
     1.86914575E-04    2     1000035        16   # BR(~nu_tauL -> ~chi_40 nu_tau)
     6.00448215E-01    2     1000024        15   # BR(~nu_tauL -> ~chi_1+ tau-)
     3.07953046E-03    2     1000037        15   # BR(~nu_tauL -> ~chi_2+ tau-)
     2.47112341E-03    2    -1000015       -37   # BR(~nu_tauL -> ~tau_1+ H-)
     9.37923546E-02    2    -1000015       -24   # BR(~nu_tauL -> ~tau_1+ W-)
#
#         PDG            Width
DECAY   1000024     3.74393130E-15   # chargino1+ decays
#           BR         NDA      ID1       ID2       ID3
     1.94622970E-02    3     1000022       -11        12   # BR(~chi_1+ -> ~chi_10 e+   nu_e)
     2.28267870E-03    3     1000022       -13        14   # BR(~chi_1+ -> ~chi_10 mu+  nu_mu)
     9.78255020E-01    2     1000022       211             # BR(~chi_1+ -> ~chi_10 pi+)
#
#         PDG            Width
DECAY   1000037     2.95121736E+01   # chargino2+ decays
#          BR         NDA      ID1       ID2
     5.20314682E-05    2     1000002        -1   # BR(~chi_2+ -> ~u_L     db)
     1.36034668E-03    2    -1000001         2   # BR(~chi_2+ -> ~d_L*    u )
     5.20314681E-05    2     1000004        -3   # BR(~chi_2+ -> ~c_L     sb)
     1.36034665E-03    2    -1000003         4   # BR(~chi_2+ -> ~s_L*     c )
     7.71824328E-02    2    -1000015        16   # BR(~chi_2+ -> ~tau_1+  nu_tau)
     2.14448247E-01    2     1000024        23   # BR(~chi_2+ -> ~chi_1+  Z )
     2.08198347E-01    2     1000022        24   # BR(~chi_2+ -> ~chi_10  W+)
     2.31377000E-01    2     1000024        25   # BR(~chi_2+ -> ~chi_1+  h )
     8.86409125E-02    2     1000024        35   # BR(~chi_2+ -> ~chi_1+  H )
     8.86824265E-02    2     1000024        36   # BR(~chi_2+ -> ~chi_1+  A )
     8.86458775E-02    2     1000022        37   # BR(~chi_2+ -> ~chi_10  H+)
#
#         PDG            Width
DECAY   1000022     0.00000000E+00   # neutralino1 decays
#
#         PDG            Width
DECAY   1000023     3.03598824E+01   # neutralino2 decays
#          BR         NDA      ID1       ID2
     1.39608619E-01    2     1000022        23   # BR(~chi_20 -> ~chi_10   Z )
     1.96782256E-01    2     1000024       -24   # BR(~chi_20 -> ~chi_1+   W-)
     1.96782256E-01    2    -1000024        24   # BR(~chi_20 -> ~chi_1-   W+)
     6.79331262E-02    2     1000022        25   # BR(~chi_20 -> ~chi_10   h )
     2.44342625E-02    2     1000022        35   # BR(~chi_20 -> ~chi_10   H )
     5.98221035E-02    2     1000022        36   # BR(~chi_20 -> ~chi_10   A )
     8.41833499E-02    2     1000024       -37   # BR(~chi_20 -> ~chi_1+   H-)
     8.41833499E-02    2    -1000024        37   # BR(~chi_20 -> ~chi_1-   H+)
     1.04677560E-03    2     1000002        -2   # BR(~chi_20 -> ~u_L      ub)
     1.04677560E-03    2    -1000002         2   # BR(~chi_20 -> ~u_L*     u )
     7.73842556E-03    2     2000002        -2   # BR(~chi_20 -> ~u_R      ub)
     7.73842556E-03    2    -2000002         2   # BR(~chi_20 -> ~u_R*     u )
     1.41644909E-04    2     1000001        -1   # BR(~chi_20 -> ~d_L      db)
     1.41644909E-04    2    -1000001         1   # BR(~chi_20 -> ~d_L*     d )
     2.49254175E-04    2     2000001        -1   # BR(~chi_20 -> ~d_R      db)
     2.49254175E-04    2    -2000001         1   # BR(~chi_20 -> ~d_R*     d )
     1.04677557E-03    2     1000004        -4   # BR(~chi_20 -> ~c_L      cb)
     1.04677557E-03    2    -1000004         4   # BR(~chi_20 -> ~c_L*     c )
     7.73842536E-03    2     2000004        -4   # BR(~chi_20 -> ~c_R      cb)
     7.73842536E-03    2    -2000004         4   # BR(~chi_20 -> ~c_R*     c )
     1.41644909E-04    2     1000003        -3   # BR(~chi_20 -> ~s _L      sb)
     1.41644909E-04    2    -1000003         3   # BR(~chi_20 -> ~s _L*     s )
     2.49254175E-04    2     2000003        -3   # BR(~chi_20 -> ~s _R      sb)
     2.49254175E-04    2    -2000003         3   # BR(~chi_20 -> ~s _R*     s )
     6.16778660E-03    2     2000011       -11   # BR(~chi_20 -> ~e_R-     e+)
     6.16778660E-03    2    -2000011        11   # BR(~chi_20 -> ~e_R+     e-)
     6.16778660E-03    2     2000013       -13   # BR(~chi_20 -> ~mu_R-    mu+)
     6.16778660E-03    2    -2000013        13   # BR(~chi_20 -> ~mu_R+    mu-)
     4.24475652E-02    2     1000015       -15   # BR(~chi_20 -> ~tau_1-   tau+)
     4.24475652E-02    2    -1000015        15   # BR(~chi_20 -> ~tau_1+   tau-)
#
#         PDG            Width
DECAY   1000025     2.91289846E+01   # neutralino3 decays
#          BR         NDA      ID1       ID2
     6.77629677E-02    2     1000022        23   # BR(~chi_30 -> ~chi_10   Z )
     2.10809520E-01    2     1000024       -24   # BR(~chi_30 -> ~chi_1+   W-)
     2.10809520E-01    2    -1000024        24   # BR(~chi_30 -> ~chi_1-   W+)
     1.61599278E-01    2     1000022        25   # BR(~chi_30 -> ~chi_10   h )
     6.35074662E-02    2     1000022        35   # BR(~chi_30 -> ~chi_10   H )
     2.60462992E-02    2     1000022        36   # BR(~chi_30 -> ~chi_10   A )
     8.95811851E-02    2     1000024       -37   # BR(~chi_30 -> ~chi_1+   H-)
     8.95811851E-02    2    -1000024        37   # BR(~chi_30 -> ~chi_1-   H+)
     2.24748886E-04    2     1000002        -2   # BR(~chi_30 -> ~u_L      ub)
     2.24748886E-04    2    -1000002         2   # BR(~chi_30 -> ~u_L*     u )
     7.90461491E-06    2     2000002        -2   # BR(~chi_30 -> ~u_R      ub)
     7.90461491E-06    2    -2000002         2   # BR(~chi_30 -> ~u_R*     u )
     2.68847211E-04    2     1000001        -1   # BR(~chi_30 -> ~d_L      db)
     2.68847211E-04    2    -1000001         1   # BR(~chi_30 -> ~d_L*     d )
     2.57304067E-07    2     2000001        -1   # BR(~chi_30 -> ~d_R      db)
     2.57304067E-07    2    -2000001         1   # BR(~chi_30 -> ~d_R*     d )
     2.24748880E-04    2     1000004        -4   # BR(~chi_30 -> ~c_L      cb)
     2.24748880E-04    2    -1000004         4   # BR(~chi_30 -> ~c_L*     c )
     7.90461471E-06    2     2000004        -4   # BR(~chi_30 -> ~c_R      cb)
     7.90461471E-06    2    -2000004         4   # BR(~chi_30 -> ~c_R*     c )
     2.68847211E-04    2     1000003        -3   # BR(~chi_30 -> ~s _L      sb)
     2.68847211E-04    2    -1000003         3   # BR(~chi_30 -> ~s _L*     s )
     2.57304067E-07    2     2000003        -3   # BR(~chi_30 -> ~s _R      sb)
     2.57304067E-07    2    -2000003         3   # BR(~chi_30 -> ~s _R*     s )
     6.29966533E-06    2     2000011       -11   # BR(~chi_30 -> ~e_R-     e+)
     6.29966533E-06    2    -2000011        11   # BR(~chi_30 -> ~e_R+     e-)
     6.29966533E-06    2     2000013       -13   # BR(~chi_30 -> ~mu_R-    mu+)
     6.29966533E-06    2    -2000013        13   # BR(~chi_30 -> ~mu_R+    mu-)
     3.91351743E-02    2     1000015       -15   # BR(~chi_30 -> ~tau_1-   tau+)
     3.91351743E-02    2    -1000015        15   # BR(~chi_30 -> ~tau_1+   tau-)
#
#         PDG            Width
DECAY   1000035     1.02317871E+02   # neutralino4 decays
#          BR         NDA      ID1       ID2
     1.15140778E-03    2     1000022        23   # BR(~chi_40 -> ~chi_10   Z )
     6.15216647E-06    2     1000023        23   # BR(~chi_40 -> ~chi_20   Z )
     3.86687071E-03    2     1000025        23   # BR(~chi_40 -> ~chi_30   Z )
     1.67364672E-03    2     1000024       -24   # BR(~chi_40 -> ~chi_1+   W-)
     1.67364672E-03    2    -1000024        24   # BR(~chi_40 -> ~chi_1-   W+)
     3.97375843E-03    2     1000037       -24   # BR(~chi_40 -> ~chi_2+   W-)
     3.97375843E-03    2    -1000037        24   # BR(~chi_40 -> ~chi_2-   W+)
     5.93840567E-04    2     1000022        25   # BR(~chi_40 -> ~chi_10   h )
     1.67735346E-04    2     1000022        35   # BR(~chi_40 -> ~chi_10   H )
     3.45482968E-04    2     1000022        36   # BR(~chi_40 -> ~chi_10   A )
     3.58655484E-03    2     1000023        25   # BR(~chi_40 -> ~chi_20   h )
     2.71061896E-06    2     1000025        25   # BR(~chi_40 -> ~chi_30   h )
     5.13126902E-04    2     1000024       -37   # BR(~chi_40 -> ~chi_1+   H-)
     5.13126902E-04    2    -1000024        37   # BR(~chi_40 -> ~chi_1-   H+)
     6.47659270E-03    2     1000002        -2   # BR(~chi_40 -> ~u_L      ub)
     6.47659270E-03    2    -1000002         2   # BR(~chi_40 -> ~u_L*     u )
     1.04746566E-01    2     2000002        -2   # BR(~chi_40 -> ~u_R      ub)
     1.04746566E-01    2    -2000002         2   # BR(~chi_40 -> ~u_R*     u )
     6.75649189E-03    2     1000001        -1   # BR(~chi_40 -> ~d_L      db)
     6.75649189E-03    2    -1000001         1   # BR(~chi_40 -> ~d_L*     d )
     5.06283249E-03    2     2000001        -1   # BR(~chi_40 -> ~d_R      db)
     5.06283249E-03    2    -2000001         1   # BR(~chi_40 -> ~d_R*     d )
     6.47659259E-03    2     1000004        -4   # BR(~chi_40 -> ~c_L      cb)
     6.47659259E-03    2    -1000004         4   # BR(~chi_40 -> ~c_L*     c )
     1.04746564E-01    2     2000004        -4   # BR(~chi_40 -> ~c_R      cb)
     1.04746564E-01    2    -2000004         4   # BR(~chi_40 -> ~c_R*     c )
     6.75649189E-03    2     1000003        -3   # BR(~chi_40 -> ~s _L      sb)
     6.75649189E-03    2    -1000003         3   # BR(~chi_40 -> ~s _L*     s )
     5.06283249E-03    2     2000003        -3   # BR(~chi_40 -> ~s _R      sb)
     5.06283249E-03    2    -2000003         3   # BR(~chi_40 -> ~s _R*     s )
     8.31542106E-02    2     2000011       -11   # BR(~chi_40 -> ~e_R-     e+)
     8.31542106E-02    2    -2000011        11   # BR(~chi_40 -> ~e_R+     e-)
     8.31542106E-02    2     2000013       -13   # BR(~chi_40 -> ~mu_R-    mu+)
     8.31542106E-02    2    -2000013        13   # BR(~chi_40 -> ~mu_R+    mu-)
     7.65857049E-02    2     1000015       -15   # BR(~chi_40 -> ~tau_1-   tau+)
     7.65857049E-02    2    -1000015        15   # BR(~chi_40 -> ~tau_1+   tau-)
#
#         PDG            Width
DECAY        25     4.74424169E-03   # h decays
#          BR         NDA      ID1       ID2
     6.05154215E-01    2           5        -5   # BR(h -> b       bb     )
     5.57815228E-02    2         -15        15   # BR(h -> tau+    tau-   )
     1.97438629E-04    2         -13        13   # BR(h -> mu+     mu-    )
     2.14364658E-04    2           3        -3   # BR(h -> s       sb     )
     1.85058761E-02    2           4        -4   # BR(h -> c       cb     )
     7.02080635E-02    2          21        21   # BR(h -> g       g      )
     2.12119608E-03    2          22        22   # BR(h -> gam     gam    )
     1.55628582E-03    2          22        23   # BR(h -> Z       gam    )
     2.18278101E-01    2          24       -24   # BR(h -> W+      W-     )
     2.79829366E-02    2          23        23   # BR(h -> Z       Z      )
#
#         PDG            Width
DECAY        35     2.06791850E+01   # H decays
#          BR         NDA      ID1       ID2
     8.47926372E-01    2           5        -5   # BR(H -> b       bb     )
     1.45352560E-01    2         -15        15   # BR(H -> tau+    tau-   )
     5.13693552E-04    2         -13        13   # BR(H -> mu+     mu-    )
     1.56954554E-04    2           3        -3   # BR(H -> s       sb     )
     5.38617152E-08    2           4        -4   # BR(H -> c       cb     )
     5.20705219E-03    2           6        -6   # BR(H -> t       tb     )
     2.37966746E-05    2          21        21   # BR(H -> g       g      )
     2.63077081E-08    2          22        22   # BR(H -> gam     gam    )
     1.20049631E-08    2          23        22   # BR(H -> Z       gam    )
     2.01808200E-06    2          24       -24   # BR(H -> W+      W-     )
     1.00501102E-06    2          23        23   # BR(H -> Z       Z      )
     1.45899771E-05    2          25        25   # BR(H -> h       h      )
     5.22456070E-04    2     1000024  -1000024   # BR(H -> ~chi_1+ ~chi_1-)
     2.61225201E-04    2     1000022   1000022   # BR(H -> ~chi_10 ~chi_10)
     3.12801817E-06    2     1000002  -1000002   # BR(H -> ~u_L    ~u_L*  )
     5.21021848E-07    2     2000002  -2000002   # BR(H -> ~u_R    ~u_R*  )
     3.12801817E-06    2     1000004  -1000004   # BR(H -> ~c_L    ~c_L*  )
     5.21021848E-07    2     2000004  -2000004   # BR(H -> ~c_R    ~c_R*  )
     4.56295060E-06    2     1000001  -1000001   # BR(H -> ~d_L    ~d_L*  )
     4.56295060E-06    2     1000003  -1000003   # BR(H -> ~s_L    ~s_L*  )
     4.35714226E-07    2     2000011  -2000011   # BR(H -> ~e_R-   ~e_R+  )
     4.35714226E-07    2     2000013  -2000013   # BR(H -> ~mu_R-  ~mu_R+ )
     8.89177892E-07    2     1000015  -1000015   # BR(H -> ~tau_1- ~tau_1+)
#
#         PDG            Width
DECAY        36     2.06898880E+01   # A decays
#          BR         NDA      ID1       ID2
     8.47545440E-01    2           5        -5   # BR(A -> b       bb     )
     1.45281334E-01    2         -15        15   # BR(A -> tau+    tau-   )
     5.13440125E-04    2         -13        13   # BR(A -> mu+     mu-    )
     1.56891994E-04    2           3        -3   # BR(A -> s       sb     )
     5.39315382E-08    2           4        -4   # BR(A -> c       cb     )
     5.28166110E-03    2           6        -6   # BR(A -> t       tb     )
     6.88623686E-05    2          21        21   # BR(A -> g       g      )
     8.21660691E-08    2          22        22   # BR(A -> gam     gam    )
     4.42887747E-08    2          23        22   # BR(A -> Z       gam    )
     2.03286372E-06    2          23        25   # BR(A -> Z       h      )
     7.66837649E-04    2     1000024  -1000024   # BR(A -> ~chi_1+ ~chi_1-)
     3.83319143E-04    2     1000022   1000022   # BR(A -> ~chi_10 ~chi_10)
#
#         PDG            Width
DECAY        37     1.75494093E+01   # H+ decays
#          BR         NDA      ID1       ID2
     1.38446053E-03    2           4        -5   # BR(H+ -> c       bb     )
     1.71429934E-01    2         -15        16   # BR(H+ -> tau+    nu_tau )
     6.05852136E-04    2         -13        14   # BR(H+ -> mu+     nu_mu  )
     1.38445672E-05    2           2        -5   # BR(H+ -> u       bb     )
     9.24445614E-06    2           2        -3   # BR(H+ -> u       sb     )
     1.82019843E-04    2           4        -3   # BR(H+ -> c       sb     )
     8.26354333E-01    2           6        -5   # BR(H+ -> t       bb     )
     2.40662968E-06    2          24        25   # BR(H+ -> W+      h      )
     1.09082407E-12    2          24        36   # BR(H+ -> W+      A      )
     1.52015070E-11    2     1000024   1000022   # BR(H+ -> ~chi_1+ ~chi_10)
     8.95256975E-06    2     1000002  -1000001   # BR(H+ -> ~u_L    ~d_L*  )
     8.95256975E-06    2     1000004  -1000003   # BR(H+ -> ~c_L    ~s_L*  )
