#
#                              ======================
#                              | THE SUSYHIT OUTPUT |
#                              ======================
#
#
#              ------------------------------------------------------
#              |     This is the output of the SUSY-HIT package     |
#              |  created by A.Djouadi, M.Muehlleitner and M.Spira. |
#              |  In case of problems with SUSY-HIT email to        |
#              |           margarete.muehlleitner@cern.ch           |
#              |           michael.spira@psi.ch                     |
#              |           abdelhak.djouadi@cern.ch                 |
#              ------------------------------------------------------
#
#              ------------------------------------------------------
#              |  SUSY Les Houches Accord - MSSM Spectrum + Decays  |
#              |              based on the decay programs           |
#              |                                                    |
#              |                     SDECAY 1.3b                    |
#              |                                                    |
#              |  Authors: M.Muhlleitner, A.Djouadi and Y.Mambrini  |
#              |  Ref.:    Comput.Phys.Commun.168(2005)46           |
#              |           [hep-ph/0311167]                         |
#              |                                                    |
#              |                     HDECAY 3.4                     |
#              |                                                    |
#              |  By: A.Djouadi,J.Kalinowski,M.Muhlleitner,M.Spira  |
#              |  Ref.:    Comput.Phys.Commun.108(1998)56           |
#              |           [hep-ph/9704448]                         |
#              |                                                    |
#              |                                                    |
#              |  If not stated otherwise all DRbar couplings and   |
#              |  soft SUSY breaking masses are given at the scale  |
#              |  Q=  0.32569840E+04
#              |                                                    |
#              ------------------------------------------------------
#
#
BLOCK DCINFO  # Decay Program information
     1   SDECAY/HDECAY # decay calculator
     2   1.3b  /3.4    # version number
#
BLOCK SPINFO  # Spectrum calculator information
     1     SOFTSUSY    # spectrum calculator               
     2     3.4.0       # version number                    
#
BLOCK MODSEL  # Model selection
     1     0   #  nonUniversal                                     
#
BLOCK SMINPUTS  # Standard Model inputs
         1     1.27908970E+02   # alpha_em^-1(M_Z)^MSbar
         2     1.16637870E-05   # G_F [GeV^-2]
         3     1.18400000E-01   # alpha_S(M_Z)^MSbar
         4     9.11876000E+01   # M_Z pole mass
         5     4.18000000E+00   # mb(mb)^MSbar
         6     1.73200000E+02   # mt pole mass
         7     1.77700000E+00   # mtau pole mass
#
BLOCK MINPAR  # Input parameters - minimal models
         3     1.43400000E+01   # tanb                
#
BLOCK EXTPAR  # Input parameters - non-minimal models
         0    -1.00000000E+00   # Set                 
         1    -5.25020000E+02   # M_1(MX)             
         2    -1.87754000E+03   # M_2(MX)             
         3     3.42811000E+03   # M_3(MX)             
        11     3.25301000E+03   # At(MX)              
        12     2.86670000E+03   # Ab(MX)              
        13    -3.98573000E+03   # Atau(MX)            
        23     1.30510000E+02   # mu(MX)              
        26     9.73850000E+02   # mA(pole)            
        31     1.35312000E+03   # meL(MX)             
        32     1.35312000E+03   # mmuL(MX)            
        33     3.37956000E+03   # mtauL(MX)           
        34     1.79947000E+03   # meR(MX)             
        35     1.79947000E+03   # mmuR(MX)            
        36     2.34317000E+03   # mtauR(MX)           
        41     3.97456000E+03   # mqL1(MX)            
        42     3.97456000E+03   # mqL2(MX)            
        43     3.23404000E+03   # mqL3(MX)            
        44     2.00210000E+03   # muR(MX)             
        45     2.00210000E+03   # mcR(MX)             
        46     3.27755000E+03   # mtR(MX)             
        47     3.16000000E+02   # mdR(MX)             
        48     3.16000000E+02   # msR(MX)             
        49     3.91102000E+03   # mbR(MX)             
#
BLOCK MASS  # Mass Spectrum
# PDG code           mass       particle
        24     8.03963237E+01   # W+
        25     1.24588007E+02   # h
        35     9.73965512E+02   # H
        36     9.73850096E+02   # A
        37     9.77540449E+02   # H+
         5     4.81876030E+00   # b-quark pole mass calculated from mb(mb)_Msbar
   1000001     4.07610048E+03   # ~d_L
   2000001     6.91073017E+02   # ~d_R
   1000002     4.07547498E+03   # ~u_L
   2000002     2.14485298E+03   # ~u_R
   1000003     4.07610048E+03   # ~s_L
   2000003     6.91073017E+02   # ~s_R
   1000004     4.07547498E+03   # ~c_L
   2000004     2.14485298E+03   # ~c_R
   1000005     3.32569621E+03   # ~b_1
   2000005     4.00213157E+03   # ~b_2
   1000006     3.26155375E+03   # ~t_1
   2000006     3.39055310E+03   # ~t_2
   1000011     1.38039369E+03   # ~e_L
   2000011     1.80501577E+03   # ~e_R
   1000012     1.37781154E+03   # ~nu_eL
   1000013     1.38039369E+03   # ~mu_L
   2000013     1.80501577E+03   # ~mu_R
   1000014     1.37781154E+03   # ~nu_muL
   1000015     2.34583570E+03   # ~tau_1
   2000015     3.38945209E+03   # ~tau_2
   1000016     3.38819402E+03   # ~nu_tauL
   1000021     3.58154226E+03   # ~g
   1000022    -1.34173641E+02   # ~chi_10
   1000023     1.41266585E+02   # ~chi_20
   1000025    -5.19757884E+02   # ~chi_30
   1000035    -1.91802493E+03   # ~chi_40
   1000024     1.38316562E+02   # ~chi_1+
   1000037     1.91819208E+03   # ~chi_2+
#
BLOCK NMIX  # Neutralino Mixing Matrix
  1  1     7.37435810E-02   # N_11
  1  2    -2.83993933E-02   # N_12
  1  3     7.15575200E-01   # N_13
  1  4     6.94051505E-01   # N_14
  2  1     5.08942116E-02   # N_21
  2  2    -2.93696305E-02   # N_22
  2  3    -6.98321482E-01   # N_23
  2  4     7.13368286E-01   # N_24
  3  1     9.95976804E-01   # N_31
  3  2     4.97519930E-03   # N_32
  3  3    -1.72982897E-02   # N_33
  3  4    -8.77850936E-02   # N_34
  4  1    -1.36732446E-03   # N_41
  4  2     9.99152714E-01   # N_42
  4  3    -1.01566019E-04   # N_43
  4  4     4.11336049E-02   # N_44
#
BLOCK UMIX  # Chargino Mixing Matrix U
  1  1     1.31629566E-04   # U_11
  1  2     9.99999991E-01   # U_12
  2  1    -9.99999991E-01   # U_21
  2  2     1.31629566E-04   # U_22
#
BLOCK VMIX  # Chargino Mixing Matrix V
  1  1     5.81860132E-02   # V_11
  1  2     9.98305759E-01   # V_12
  2  1     9.98305759E-01   # V_21
  2  2    -5.81860132E-02   # V_22
#
BLOCK STOPMIX  # Stop Mixing Matrix
  1  1    -6.93000606E-01   # cos(theta_t)
  1  2     7.20937001E-01   # sin(theta_t)
  2  1    -7.20937001E-01   # -sin(theta_t)
  2  2    -6.93000606E-01   # cos(theta_t)
#
BLOCK SBOTMIX  # Sbottom Mixing Matrix
  1  1     9.99999919E-01   # cos(theta_b)
  1  2    -4.02492228E-04   # sin(theta_b)
  2  1     4.02492228E-04   # -sin(theta_b)
  2  2     9.99999919E-01   # cos(theta_b)
#
BLOCK STAUMIX  # Stau Mixing Matrix
  1  1     1.70010460E-03   # cos(theta_tau)
  1  2     9.99998555E-01   # sin(theta_tau)
  2  1    -9.99998555E-01   # -sin(theta_tau)
  2  2     1.70010460E-03   # cos(theta_tau)
#
BLOCK ALPHA  # Higgs mixing
          -7.48921466E-02   # Mixing angle in the neutral Higgs boson sector
#
BLOCK HMIX Q=  3.25698400E+03  # DRbar Higgs Parameters
         1     1.32641225E+02   # mu(Q)MSSM           
         2     1.36660422E+01   # tan                 
         3     2.42174130E+02   # higgs               
         4     8.61861958E+05   # mA^2(Q)MSSM         
#
BLOCK GAUGE Q=  3.25698400E+03  # The gauge couplings
     1     3.65789166E-01   # gprime(Q) DRbar
     2     6.39165762E-01   # g(Q) DRbar
     3     1.00591574E+00   # g3(Q) DRbar
#
BLOCK AU Q=  3.25698400E+03  # The trilinear couplings
  1  1     0.00000000E+00   # A_u(Q) DRbar
  2  2     0.00000000E+00   # A_c(Q) DRbar
  3  3     3.25301002E+03   # A_t(Q) DRbar
#
BLOCK AD Q=  3.25698400E+03  # The trilinear couplings
  1  1     0.00000000E+00   # A_d(Q) DRbar
  2  2     0.00000000E+00   # A_s(Q) DRbar
  3  3     2.86670001E+03   # A_b(Q) DRbar
#
BLOCK AE Q=  3.25698400E+03  # The trilinear couplings
  1  1     0.00000000E+00   # A_e(Q) DRbar
  2  2     0.00000000E+00   # A_mu(Q) DRbar
  3  3    -3.98573000E+03   # A_tau(Q) DRbar
#
BLOCK Yu Q=  3.25698400E+03  # The Yukawa couplings
  1  1     0.00000000E+00   # y_u(Q) DRbar
  2  2     0.00000000E+00   # y_c(Q) DRbar
  3  3     8.32276325E-01   # y_t(Q) DRbar
#
BLOCK Yd Q=  3.25698400E+03  # The Yukawa couplings
  1  1     0.00000000E+00   # y_d(Q) DRbar
  2  2     0.00000000E+00   # y_s(Q) DRbar
  3  3     1.84620409E-01   # y_b(Q) DRbar
#
BLOCK Ye Q=  3.25698400E+03  # The Yukawa couplings
  1  1     0.00000000E+00   # y_e(Q) DRbar
  2  2     0.00000000E+00   # y_mu(Q) DRbar
  3  3     1.39837463E-01   # y_tau(Q) DRbar
#
BLOCK MSOFT Q=  3.25698400E+03  # The soft SUSY breaking masses at the scale Q
         1    -5.25020000E+02   # M_1(Q)              
         2    -1.87754000E+03   # M_2(Q)              
         3     3.42811000E+03   # M_3(Q)              
        21     8.82642334E+05   # mH1^2(Q)            
        22     1.99602912E+05   # mH2^2(Q)            
        31     1.35312000E+03   # meL(Q)              
        32     1.35312000E+03   # mmuL(Q)             
        33     3.37956000E+03   # mtauL(Q)            
        34     1.79947000E+03   # meR(Q)              
        35     1.79947000E+03   # mmuR(Q)             
        36     2.34317000E+03   # mtauR(Q)            
        41     3.97455999E+03   # mqL1(Q)             
        42     3.97455999E+03   # mqL2(Q)             
        43     3.23403999E+03   # mqL3(Q)             
        44     2.00209998E+03   # muR(Q)              
        45     2.00209998E+03   # mcR(Q)              
        46     3.27754998E+03   # mtR(Q)              
        47     3.15999881E+02   # mdR(Q)              
        48     3.15999881E+02   # msR(Q)              
        49     3.91101999E+03   # mbR(Q)              
#
Block HiggsBoundsInputHiggsCouplingsFermions
# ScalarNormEffCoupSq PseudoSNormEffCoupSq NP   IP1 IP2 IP2
    1.05115113E+00    0.00000000E+00        3  25   5   5  # h0-b-b eff. coupling^2, normalised to SM
    1.86709558E+02    0.00000000E+00        3  35   5   5  # H0-b-b eff. coupling^2, normalised to SM
    0.00000000E+00    1.86760709E+02        3  36   5   5  # A0-b-b eff. coupling^2, normalised to SM
#
    9.99726114E-01    0.00000000E+00        3  25   6   6  # h0-t-t eff. coupling^2, normalised to SM
    5.62833121E-03    0.00000000E+00        3  35   6   6  # H0-t-t eff. coupling^2, normalised to SM
    0.00000000E+00    5.35444529E-03        3  36   6   6  # A0-t-t eff. coupling^2, normalised to SM
#
    1.05115113E+00    0.00000000E+00        3  25  15  15  # h0-tau-tau eff. coupling^2, normalised to SM
    1.86709558E+02    0.00000000E+00        3  35  15  15  # H0-tau-tau eff. coupling^2, normalised to SM
    0.00000000E+00    1.86760709E+02        3  36  15  15  # A0-tau-tau eff. coupling^2, normalised to SM
#
Block HiggsBoundsInputHiggsCouplingsBosons
    9.99996584E-01        3  25  24  24  # h0-W-W eff. coupling^2, normalised to SM
    3.41604481E-06        3  35  24  24  # H0-W-W eff. coupling^2, normalised to SM
    0.00000000E+00        3  36  24  24  # A0-W-W eff. coupling^2, normalised to SM
#
    9.99996584E-01        3  25  23  23  # h0-Z-Z eff. coupling^2, normalised to SM
    3.41604481E-06        3  35  23  23  # H0-Z-Z eff. coupling^2, normalised to SM
    0.00000000E+00        3  36  23  23  # A0-Z-Z eff. coupling^2, normalised to SM
#
    8.87350470E-01        3  25  21  21  # h0-g-g eff. coupling^2, normalised to SM
    3.01486360E-05        3  35  21  21  # H0-g-g eff. coupling^2, normalised to SM
    3.14523277E-04        3  36  21  21  # A0-g-g eff. coupling^2, normalised to SM
#
    0.00000000E+00        3  25  25  23  # h0-h0-Z eff. coupling^2, normalised to SM
    0.00000000E+00        3  35  25  23  # H0-h0-Z eff. coupling^2, normalised to SM
    3.41604481E-06        3  36  25  23  # A0-h0-Z eff. coupling^2, normalised to SM
    0.00000000E+00        3  35  35  23  # H0-H0-Z eff. coupling^2, normalised to SM
    9.99996584E-01        3  36  35  23  # A0-H0-Z eff. coupling^2, normalised to SM
    0.00000000E+00        3  36  36  23  # A0-A0-Z eff. coupling^2, normalised to SM
#
    0.00000000E+00        4  25  21  21  23  # h0-g-g-Z eff. coupling^2, normalised to SM
    0.00000000E+00        4  35  21  21  23  # H0-g-g-Z eff. coupling^2, normalised to SM
    0.00000000E+00        4  36  21  21  23  # A0-g-g-Z eff. coupling^2, normalised to SM
#
#
#
#                             =================
#                             |The decay table|
#                             =================
#
# - The QCD corrections to the decays gluino -> squark  + quark
#                                     squark -> gaugino + quark_prime
#                                     squark -> squark_prime + Higgs
#                                     squark -> gluino  + quark
#   are included.
#
# - The multi-body decays for the inos, stops and sbottoms are included.
#
# - The loop induced decays for the gluino, neutralinos and stops
#   are included.
#
# - The SUSY decays of the top quark are included.
#
#
#         PDG            Width
DECAY         6     1.43850544E+00   # top decays
#          BR         NDA      ID1       ID2
     1.00000000E+00    2           5        24   # BR(t ->  b    W+)
#
#         PDG            Width
DECAY   1000021     1.83615573E+02   # gluino decays
#          BR         NDA      ID1       ID2
     1.69389788E-01    2     2000001        -1   # BR(~g -> ~d_R  db)
     1.69389788E-01    2    -2000001         1   # BR(~g -> ~d_R* d )
     7.51711653E-02    2     2000002        -2   # BR(~g -> ~u_R  ub)
     7.51711653E-02    2    -2000002         2   # BR(~g -> ~u_R* u )
     1.69389788E-01    2     2000003        -3   # BR(~g -> ~s_R  sb)
     1.69389788E-01    2    -2000003         3   # BR(~g -> ~s_R* s )
     7.51711372E-02    2     2000004        -4   # BR(~g -> ~c_R  cb)
     7.51711372E-02    2    -2000004         4   # BR(~g -> ~c_R* c )
     3.58076001E-03    2     1000005        -5   # BR(~g -> ~b_1  bb)
     3.58076001E-03    2    -1000005         5   # BR(~g -> ~b_1* b )
     7.21531956E-03    2     1000006        -6   # BR(~g -> ~t_1  tb)
     7.21531956E-03    2    -1000006         6   # BR(~g -> ~t_1* t )
     8.20427595E-05    2     2000006        -6   # BR(~g -> ~t_2  tb)
     8.20427595E-05    2    -2000006         6   # BR(~g -> ~t_2* t )
#
#         PDG            Width
DECAY   1000006     8.27975736E+01   # stop1 decays
#          BR         NDA      ID1       ID2
     2.72512162E-01    2     1000022         6   # BR(~t_1 -> ~chi_10 t )
     2.87308371E-01    2     1000023         6   # BR(~t_1 -> ~chi_20 t )
     3.88666553E-02    2     1000025         6   # BR(~t_1 -> ~chi_30 t )
     2.80933038E-02    2     1000035         6   # BR(~t_1 -> ~chi_40 t )
     3.17600703E-01    2     1000024         5   # BR(~t_1 -> ~chi_1+ b )
     5.56188044E-02    2     1000037         5   # BR(~t_1 -> ~chi_2+ b )
#
#         PDG            Width
DECAY   2000006     8.23811940E+01   # stop2 decays
#          BR         NDA      ID1       ID2
     2.57283253E-01    2     1000022         6   # BR(~t_2 -> ~chi_10 t )
     2.72373932E-01    2     1000023         6   # BR(~t_2 -> ~chi_20 t )
     6.56567765E-02    2     1000025         6   # BR(~t_2 -> ~chi_30 t )
     4.64364532E-02    2     1000035         6   # BR(~t_2 -> ~chi_40 t )
     2.60386612E-01    2     1000024         5   # BR(~t_2 -> ~chi_1+ b )
     9.22166963E-02    2     1000037         5   # BR(~t_2 -> ~chi_2+ b )
     8.98202305E-06    2     1000006        25   # BR(~t_2 -> ~t_1    h )
     5.63729504E-03    2     1000006        23   # BR(~t_2 -> ~t_1    Z )
#
#         PDG            Width
DECAY   1000005     6.61359197E+01   # sbottom1 decays
#          BR         NDA      ID1       ID2
     1.77677156E-02    2     1000022         5   # BR(~b_1 -> ~chi_10 b )
     1.68824264E-02    2     1000023         5   # BR(~b_1 -> ~chi_20 b )
     6.66795537E-03    2     1000025         5   # BR(~b_1 -> ~chi_30 b )
     9.09096709E-02    2     1000035         5   # BR(~b_1 -> ~chi_40 b )
     6.84490209E-01    2    -1000024         6   # BR(~b_1 -> ~chi_1- t )
     1.83282022E-01    2    -1000037         6   # BR(~b_1 -> ~chi_2- t )
#
#         PDG            Width
DECAY   2000005     1.62129416E+01   # sbottom2 decays
#          BR         NDA      ID1       ID2
     8.63270747E-02    2     1000022         5   # BR(~b_2 -> ~chi_10 b )
     8.17875250E-02    2     1000023         5   # BR(~b_2 -> ~chi_20 b )
     1.40044651E-01    2     1000025         5   # BR(~b_2 -> ~chi_30 b )
     2.79623463E-07    2     1000035         5   # BR(~b_2 -> ~chi_40 b )
     1.66358604E-01    2    -1000024         6   # BR(~b_2 -> ~chi_1- t )
     2.32351961E-07    2    -1000037         6   # BR(~b_2 -> ~chi_2- t )
     5.25453101E-01    2     1000021         5   # BR(~b_2 -> ~g      b )
     1.07613513E-05    2     1000005        25   # BR(~b_2 -> ~b_1    h )
     5.98964876E-06    2     1000005        23   # BR(~b_2 -> ~b_1    Z )
     7.19584152E-06    2     1000006       -24   # BR(~b_2 -> ~t_1    W-)
     4.58520347E-06    2     2000006       -24   # BR(~b_2 -> ~t_2    W-)
#
#         PDG            Width
DECAY   1000002     4.48595839E+01   # sup_L decays
#          BR         NDA      ID1       ID2
     7.19856060E-05    2     1000022         2   # BR(~u_L -> ~chi_10 u)
     1.35445936E-04    2     1000023         2   # BR(~u_L -> ~chi_20 u)
     1.29477612E-02    2     1000025         2   # BR(~u_L -> ~chi_30 u)
     2.14346415E-01    2     1000035         2   # BR(~u_L -> ~chi_40 u)
     2.37281547E-03    2     1000024         1   # BR(~u_L -> ~chi_1+ d)
     4.28147917E-01    2     1000037         1   # BR(~u_L -> ~chi_2+ d)
     3.41977659E-01    2     1000021         2   # BR(~u_L -> ~g      u)
#
#         PDG            Width
DECAY   2000002     4.52487477E+00   # sup_R decays
#          BR         NDA      ID1       ID2
     6.07153079E-03    2     1000022         2   # BR(~u_R -> ~chi_10 u)
     2.88959504E-03    2     1000023         2   # BR(~u_R -> ~chi_20 u)
     9.91038786E-01    2     1000025         2   # BR(~u_R -> ~chi_30 u)
     8.78803707E-08    2     1000035         2   # BR(~u_R -> ~chi_40 u)
#
#         PDG            Width
DECAY   1000001     4.48575592E+01   # sdown_L decays
#          BR         NDA      ID1       ID2
     6.32171288E-04    2     1000022         1   # BR(~d_L -> ~chi_10 d)
     5.35206388E-04    2     1000023         1   # BR(~d_L -> ~chi_20 d)
     1.16623323E-02    2     1000025         1   # BR(~d_L -> ~chi_30 d)
     2.14650145E-01    2     1000035         1   # BR(~d_L -> ~chi_40 d)
     1.21456303E-08    2    -1000024         2   # BR(~d_L -> ~chi_1- u)
     4.29762137E-01    2    -1000037         2   # BR(~d_L -> ~chi_2- u)
     3.42757996E-01    2     1000021         1   # BR(~d_L -> ~g      d)
#
#         PDG            Width
DECAY   2000001     8.51197948E-02   # sdown_R decays
#          BR         NDA      ID1       ID2
     2.56404689E-02    2     1000022         1   # BR(~d_R -> ~chi_10 d)
     1.21095977E-02    2     1000023         1   # BR(~d_R -> ~chi_20 d)
     9.62249933E-01    2     1000025         1   # BR(~d_R -> ~chi_30 d)
#
#         PDG            Width
DECAY   1000004     4.20951954E+01   # scharm_L decays
#          BR         NDA      ID1       ID2
     8.06364261E-05    2     1000022         4   # BR(~c_L -> ~chi_10 c)
     1.51716661E-04    2     1000023         4   # BR(~c_L -> ~chi_20 c)
     1.44734418E-02    2     1000025         4   # BR(~c_L -> ~chi_30 c)
     2.37924508E-01    2     1000035         4   # BR(~c_L -> ~chi_40 c)
     2.65790219E-03    2     1000024         3   # BR(~c_L -> ~chi_1+ s)
     4.75243842E-01    2     1000037         3   # BR(~c_L -> ~chi_2+ s)
     2.69467952E-01    2     1000021         4   # BR(~c_L -> ~g      c)
#
#         PDG            Width
DECAY   2000004     4.50077597E+00   # scharm_R decays
#          BR         NDA      ID1       ID2
     6.08403839E-03    2     1000022         4   # BR(~c_R -> ~chi_10 c)
     2.89540876E-03    2     1000023         4   # BR(~c_R -> ~chi_20 c)
     9.91020468E-01    2     1000025         4   # BR(~c_R -> ~chi_30 c)
     8.45965607E-08    2     1000035         4   # BR(~c_R -> ~chi_40 c)
#
#         PDG            Width
DECAY   1000003     4.20818017E+01   # sstrange_L decays
#          BR         NDA      ID1       ID2
     7.08335930E-04    2     1000022         3   # BR(~s_L -> ~chi_10 s)
     5.99663321E-04    2     1000023         3   # BR(~s_L -> ~chi_20 s)
     1.30401171E-02    2     1000025         3   # BR(~s_L -> ~chi_30 s)
     2.38327190E-01    2     1000035         3   # BR(~s_L -> ~chi_40 s)
     1.36086108E-08    2    -1000024         4   # BR(~s_L -> ~chi_1- c)
     4.77166473E-01    2    -1000037         4   # BR(~s_L -> ~chi_2- c)
     2.70158208E-01    2     1000021         3   # BR(~s_L -> ~g      s)
#
#         PDG            Width
DECAY   2000003     7.95313659E-02   # sstrange_R decays
#          BR         NDA      ID1       ID2
     2.58844246E-02    2     1000022         3   # BR(~s_R -> ~chi_10 s)
     1.22243729E-02    2     1000023         3   # BR(~s_R -> ~chi_20 s)
     9.61891203E-01    2     1000025         3   # BR(~s_R -> ~chi_30 s)
#
#         PDG            Width
DECAY   1000011     1.36693805E+00   # selectron_L decays
#          BR         NDA      ID1       ID2
     7.67203230E-04    2     1000022        11   # BR(~e_L -> ~chi_10 e-)
     2.37865802E-07    2     1000023        11   # BR(~e_L -> ~chi_20 e-)
     9.99232420E-01    2     1000025        11   # BR(~e_L -> ~chi_30 e-)
     1.39364866E-07    2    -1000024        12   # BR(~e_L -> ~chi_1- nu_e)
#
#         PDG            Width
DECAY   2000011     8.09340324E+00   # selectron_R decays
#          BR         NDA      ID1       ID2
     6.38568335E-03    2     1000022        11   # BR(~e_R -> ~chi_10 e-)
     3.03788844E-03    2     1000023        11   # BR(~e_R -> ~chi_20 e-)
     9.90576428E-01    2     1000025        11   # BR(~e_R -> ~chi_30 e-)
#
#         PDG            Width
DECAY   1000013     1.36693802E+00   # smuon_L decays
#          BR         NDA      ID1       ID2
     7.67203233E-04    2     1000022        13   # BR(~mu_L -> ~chi_10 mu-)
     2.37865803E-07    2     1000023        13   # BR(~mu_L -> ~chi_20 mu-)
     9.99232420E-01    2     1000025        13   # BR(~mu_L -> ~chi_30 mu-)
     1.39364868E-07    2    -1000024        14   # BR(~mu_L -> ~chi_1- nu_mu)
#
#         PDG            Width
DECAY   2000013     8.09340317E+00   # smuon_R decays
#          BR         NDA      ID1       ID2
     6.38568336E-03    2     1000022        13   # BR(~mu_R -> ~chi_10 mu-)
     3.03788844E-03    2     1000023        13   # BR(~mu_R -> ~chi_20 mu-)
     9.90576428E-01    2     1000025        13   # BR(~mu_R -> ~chi_30 mu-)
#
#         PDG            Width
DECAY   1000015     1.31141036E+01   # stau_1 decays
#          BR         NDA      ID1       ID2
     4.05854313E-02    2     1000022        15   # BR(~tau_1 -> ~chi_10  tau-)
     3.61086919E-02    2     1000023        15   # BR(~tau_1 -> ~chi_20  tau-)
     8.54200029E-01    2     1000025        15   # BR(~tau_1 -> ~chi_30  tau-)
     4.35968639E-07    2     1000035        15   # BR(~tau_1 -> ~chi_40  tau-)
     6.91049346E-02    2    -1000024        16   # BR(~tau_1 -> ~chi_1-  nu_tau)
     4.77167524E-07    2    -1000037        16   # BR(~tau_1 -> ~chi_2-  nu_tau)
#
#         PDG            Width
DECAY   2000015     2.50740515E+01   # stau_2 decays
#          BR         NDA      ID1       ID2
     2.69180583E-02    2     1000022        15   # BR(~tau_2 -> ~chi_10  tau-)
     2.55789672E-02    2     1000023        15   # BR(~tau_2 -> ~chi_20  tau-)
     1.73181515E-01    2     1000025        15   # BR(~tau_2 -> ~chi_30  tau-)
     2.53016796E-01    2     1000035        15   # BR(~tau_2 -> ~chi_40  tau-)
     2.77684724E-07    2    -1000024        16   # BR(~tau_2 -> ~chi_1-  nu_tau)
     5.07604302E-01    2    -1000037        16   # BR(~tau_2 -> ~chi_2-  nu_tau)
     2.19339974E-04    2     1000015        25   # BR(~tau_2 -> ~tau_1   h)
     6.63460688E-03    2     1000015        35   # BR(~tau_2 -> ~tau_1   H)
     6.64265086E-03    2     1000015        36   # BR(~tau_2 -> ~tau_1   A)
     2.03485703E-04    2     1000015        23   # BR(~tau_2 -> ~tau_1   Z)
#
#         PDG            Width
DECAY   1000012     1.39821595E+00   # snu_eL decays
#          BR         NDA      ID1       ID2
     1.95840790E-02    2     1000022        12   # BR(~nu_eL -> ~chi_10 nu_e)
     1.34157576E-02    2     1000023        12   # BR(~nu_eL -> ~chi_20 nu_e)
     9.40428913E-01    2     1000025        12   # BR(~nu_eL -> ~chi_30 nu_e)
     2.65712501E-02    2     1000024        11   # BR(~nu_eL -> ~chi_1+ e-)
#
#         PDG            Width
DECAY   1000014     1.39821595E+00   # snu_muL decays
#          BR         NDA      ID1       ID2
     1.95840790E-02    2     1000022        14   # BR(~nu_muL -> ~chi_10 nu_mu)
     1.34157576E-02    2     1000023        14   # BR(~nu_muL -> ~chi_20 nu_mu)
     9.40428914E-01    2     1000025        14   # BR(~nu_muL -> ~chi_30 nu_mu)
     2.65712498E-02    2     1000024        13   # BR(~nu_muL -> ~chi_1+ mu-)
#
#         PDG            Width
DECAY   1000016     2.50728751E+01   # snu_tauL decays
#          BR         NDA      ID1       ID2
     2.72875690E-03    2     1000022        16   # BR(~nu_tauL -> ~chi_10 nu_tau)
     1.87254283E-03    2     1000023        16   # BR(~nu_tauL -> ~chi_20 nu_tau)
     1.67157272E-01    2     1000025        16   # BR(~nu_tauL -> ~chi_30 nu_tau)
     2.53551885E-01    2     1000035        16   # BR(~nu_tauL -> ~chi_40 nu_tau)
     5.61025352E-02    2     1000024        15   # BR(~nu_tauL -> ~chi_1+ tau-)
     5.05368730E-01    2     1000037        15   # BR(~nu_tauL -> ~chi_2+ tau-)
     1.28240808E-02    2    -1000015       -37   # BR(~nu_tauL -> ~tau_1+ H-)
     3.94196726E-04    2    -1000015       -24   # BR(~nu_tauL -> ~tau_1+ W-)
#
#         PDG            Width
DECAY   1000024     1.31338954E-09   # chargino1+ decays
#           BR         NDA      ID1       ID2       ID3
     3.56659548E-01    3     1000022         2        -1   # BR(~chi_1+ -> ~chi_10 u    db)
     3.56659548E-01    3     1000022         4        -3   # BR(~chi_1+ -> ~chi_10 c    sb)
     1.18888088E-01    3     1000022       -11        12   # BR(~chi_1+ -> ~chi_10 e+   nu_e)
     1.18888088E-01    3     1000022       -13        14   # BR(~chi_1+ -> ~chi_10 mu+  nu_mu)
     4.89047266E-02    3     1000022       -15        16   # BR(~chi_1+ -> ~chi_10 tau+ nu_tau)
#
#         PDG            Width
DECAY   1000037     3.09706385E+01   # chargino2+ decays
#          BR         NDA      ID1       ID2
     5.87763524E-02    2     1000012       -11   # BR(~chi_2+ -> ~nu_eL   e+  )
     5.87763524E-02    2     1000014       -13   # BR(~chi_2+ -> ~nu_muL mu+ )
     5.85053075E-02    2    -1000011        12   # BR(~chi_2+ -> ~e_L+    nu_e)
     5.85053075E-02    2    -1000013        14   # BR(~chi_2+ -> ~mu_L+   nu_mu)
     1.22781149E-01    2     1000024        23   # BR(~chi_2+ -> ~chi_1+  Z )
     1.14410624E-01    2     1000022        24   # BR(~chi_2+ -> ~chi_10  W+)
     1.21049631E-01    2     1000023        24   # BR(~chi_2+ -> ~chi_20  W+)
     3.02724821E-03    2     1000025        24   # BR(~chi_2+ -> ~chi_30  W+)
     1.21681356E-01    2     1000024        25   # BR(~chi_2+ -> ~chi_1+  h )
     7.07211553E-02    2     1000024        35   # BR(~chi_2+ -> ~chi_1+  H )
     7.06835620E-02    2     1000024        36   # BR(~chi_2+ -> ~chi_1+  A )
     7.21285243E-02    2     1000022        37   # BR(~chi_2+ -> ~chi_10  H+)
     6.88853271E-02    2     1000023        37   # BR(~chi_2+ -> ~chi_20  H+)
     6.81038101E-05    2     1000025        37   # BR(~chi_2+ -> ~chi_30  H+)
#
#         PDG            Width
DECAY   1000022     0.00000000E+00   # neutralino1 decays
#
#         PDG            Width
DECAY   1000023     1.52577560E-08   # neutralino2 decays
#          BR         NDA      ID1       ID2
     3.84377802E-02    2     1000022        22   # BR(~chi_20 -> ~chi_10 gam)
#           BR         NDA      ID1       ID2       ID3
     1.29666491E-01    3     1000022        -2         2   # BR(~chi_20 -> ~chi_10 ub      u)
     1.68352212E-01    3     1000022        -1         1   # BR(~chi_20 -> ~chi_10 db      d)
     1.29666491E-01    3     1000022        -4         4   # BR(~chi_20 -> ~chi_10 cb      c)
     1.68352212E-01    3     1000022        -3         3   # BR(~chi_20 -> ~chi_10 sb      s)
     3.86996668E-02    3     1000022       -11        11   # BR(~chi_20 -> ~chi_10 e+      e-)
     3.86996668E-02    3     1000022       -13        13   # BR(~chi_20 -> ~chi_10 mu+     mu-)
     2.49204368E-02    3     1000022       -15        15   # BR(~chi_20 -> ~chi_10 tau+    tau-)
     7.73895598E-02    3     1000022       -12        12   # BR(~chi_20 -> ~chi_10 nu_eb   nu_e)
     7.73895598E-02    3     1000022       -14        14   # BR(~chi_20 -> ~chi_10 nu_mub  nu_mu)
     7.73877726E-02    3     1000022       -16        16   # BR(~chi_20 -> ~chi_10 nu_taub nu_tau)
     5.70943540E-03    3     1000024        -2         1   # BR(~chi_20 -> ~chi_1+ ub      d)
     5.70943540E-03    3    -1000024        -1         2   # BR(~chi_20 -> ~chi_1- db      u)
     5.70943540E-03    3     1000024        -4         3   # BR(~chi_20 -> ~chi_1+ cb      s)
     5.70943540E-03    3    -1000024        -3         4   # BR(~chi_20 -> ~chi_1- sb      c)
     1.90316731E-03    3     1000024       -12        11   # BR(~chi_20 -> ~chi_1+ nu_eb   e-)
     1.90316731E-03    3    -1000024        12       -11   # BR(~chi_20 -> ~chi_1- nu_e    e+)
     1.90316731E-03    3     1000024       -14        13   # BR(~chi_20 -> ~chi_1+ nu_mub  mu-)
     1.90316731E-03    3    -1000024        14       -13   # BR(~chi_20 -> ~chi_1- nu_mu   mu+)
     2.93869830E-04    3     1000024       -16        15   # BR(~chi_20 -> ~chi_1+ nu_taub tau-)
     2.93869830E-04    3    -1000024        16       -15   # BR(~chi_20 -> ~chi_1- nu_tau  tau+)
#
#         PDG            Width
DECAY   1000025     1.09472081E+00   # neutralino3 decays
#          BR         NDA      ID1       ID2
     8.36443265E-02    2     1000022        23   # BR(~chi_30 -> ~chi_10   Z )
     1.73360472E-01    2     1000023        23   # BR(~chi_30 -> ~chi_20   Z )
     2.55605290E-01    2     1000024       -24   # BR(~chi_30 -> ~chi_1+   W-)
     2.55605290E-01    2    -1000024        24   # BR(~chi_30 -> ~chi_1-   W+)
     1.60554107E-01    2     1000022        25   # BR(~chi_30 -> ~chi_10   h )
     7.12305150E-02    2     1000023        25   # BR(~chi_30 -> ~chi_20   h )
#
#         PDG            Width
DECAY   1000035     3.09641631E+01   # neutralino4 decays
#          BR         NDA      ID1       ID2
     5.97270920E-02    2     1000022        23   # BR(~chi_40 -> ~chi_10   Z )
     6.22525239E-02    2     1000023        23   # BR(~chi_40 -> ~chi_20   Z )
     7.70721781E-04    2     1000025        23   # BR(~chi_40 -> ~chi_30   Z )
     1.19441210E-01    2     1000024       -24   # BR(~chi_40 -> ~chi_1+   W-)
     1.19441210E-01    2    -1000024        24   # BR(~chi_40 -> ~chi_1-   W+)
     5.74684683E-02    2     1000022        25   # BR(~chi_40 -> ~chi_10   h )
     4.79703337E-02    2     1000022        35   # BR(~chi_40 -> ~chi_10   H )
     2.46672431E-02    2     1000022        36   # BR(~chi_40 -> ~chi_10   A )
     6.16642091E-02    2     1000023        25   # BR(~chi_40 -> ~chi_20   h )
     2.29018466E-02    2     1000023        35   # BR(~chi_40 -> ~chi_20   H )
     4.62286500E-02    2     1000023        36   # BR(~chi_40 -> ~chi_20   A )
     2.23771035E-03    2     1000025        25   # BR(~chi_40 -> ~chi_30   h )
     6.77029361E-05    2     1000025        35   # BR(~chi_40 -> ~chi_30   H )
     1.73538548E-06    2     1000025        36   # BR(~chi_40 -> ~chi_30   A )
     7.03258058E-02    2     1000024       -37   # BR(~chi_40 -> ~chi_1+   H-)
     7.03258058E-02    2    -1000024        37   # BR(~chi_40 -> ~chi_1-   H+)
     7.87610794E-08    2     2000001        -1   # BR(~chi_40 -> ~d_R      db)
     7.87610794E-08    2    -2000001         1   # BR(~chi_40 -> ~d_R*     d )
     7.87610794E-08    2     2000003        -3   # BR(~chi_40 -> ~s _R      sb)
     7.87610794E-08    2    -2000003         3   # BR(~chi_40 -> ~s _R*     s )
     2.91500184E-02    2     1000011       -11   # BR(~chi_40 -> ~e_L-     e+)
     2.91500184E-02    2    -1000011        11   # BR(~chi_40 -> ~e_L+     e-)
     4.03214146E-09    2     2000011       -11   # BR(~chi_40 -> ~e_R-     e+)
     4.03214146E-09    2    -2000011        11   # BR(~chi_40 -> ~e_R+     e-)
     2.91500184E-02    2     1000013       -13   # BR(~chi_40 -> ~mu_L-    mu+)
     2.91500184E-02    2    -1000013        13   # BR(~chi_40 -> ~mu_L+    mu-)
     4.03214146E-09    2     2000013       -13   # BR(~chi_40 -> ~mu_R-    mu+)
     4.03214146E-09    2    -2000013        13   # BR(~chi_40 -> ~mu_R+    mu-)
     2.94768318E-02    2     1000012       -12   # BR(~chi_40 -> ~nu_eL    nu_eb)
     2.94768318E-02    2    -1000012        12   # BR(~chi_40 -> ~nu_eL*   nu_e )
     2.94768318E-02    2     1000014       -14   # BR(~chi_40 -> ~nu_muL   nu_mub)
     2.94768318E-02    2    -1000014        14   # BR(~chi_40 -> ~nu_muL*  nu_mu )
#
#         PDG            Width
DECAY        25     4.09608209E-03   # h decays
#          BR         NDA      ID1       ID2
     6.11135566E-01    2           5        -5   # BR(h -> b       bb     )
     6.61856514E-02    2         -15        15   # BR(h -> tau+    tau-   )
     2.34301181E-04    2         -13        13   # BR(h -> mu+     mu-    )
     2.55626005E-04    2           3        -3   # BR(h -> s       sb     )
     2.11119824E-02    2           4        -4   # BR(h -> c       cb     )
     7.70751594E-02    2          21        21   # BR(h -> g       g      )
     2.26026689E-03    2          22        22   # BR(h -> gam     gam    )
     1.46980744E-03    2          22        23   # BR(h -> Z       gam    )
     1.95951450E-01    2          24       -24   # BR(h -> W+      W-     )
     2.43201898E-02    2          23        23   # BR(h -> Z       Z      )
#
#         PDG            Width
DECAY        35     3.55913019E+00   # H decays
#          BR         NDA      ID1       ID2
     6.63855070E-01    2           5        -5   # BR(H -> b       bb     )
     1.06203513E-01    2         -15        15   # BR(H -> tau+    tau-   )
     3.77196606E-04    2         -13        13   # BR(H -> mu+     mu-    )
     2.71874172E-04    2           3        -3   # BR(H -> s       sb     )
     7.42184746E-07    2           4        -4   # BR(H -> c       cb     )
     6.47246090E-02    2           6        -6   # BR(H -> t       tb     )
     1.07174000E-04    2          21        21   # BR(H -> g       g      )
     8.21008881E-08    2          22        22   # BR(H -> gam     gam    )
     9.49083535E-08    2          23        22   # BR(H -> Z       gam    )
     2.74346517E-04    2          24       -24   # BR(H -> W+      W-     )
     1.35392462E-04    2          23        23   # BR(H -> Z       Z      )
     1.04657216E-03    2          25        25   # BR(H -> h       h      )
     6.88770557E-03    2     1000024  -1000024   # BR(H -> ~chi_1+ ~chi_1-)
     5.56698659E-03    2     1000022   1000022   # BR(H -> ~chi_10 ~chi_10)
     2.69612602E-03    2     1000023   1000023   # BR(H -> ~chi_20 ~chi_20)
     1.03109657E-07    2     1000022   1000023   # BR(H -> ~chi_10 ~chi_20)
     7.03420195E-02    2     1000022   1000025   # BR(H -> ~chi_10 ~chi_30)
     7.75103925E-02    2     1000023   1000025   # BR(H -> ~chi_20 ~chi_30)
#
#         PDG            Width
DECAY        36     3.57218157E+00   # A decays
#          BR         NDA      ID1       ID2
     6.61656825E-01    2           5        -5   # BR(A -> b       bb     )
     1.05833299E-01    2         -15        15   # BR(A -> tau+    tau-   )
     3.75876522E-04    2         -13        13   # BR(A -> mu+     mu-    )
     2.71032712E-04    2           3        -3   # BR(A -> s       sb     )
     7.09846407E-07    2           4        -4   # BR(A -> c       cb     )
     6.79689052E-02    2           6        -6   # BR(A -> t       tb     )
     3.44879310E-04    2          21        21   # BR(A -> g       g      )
     2.22953647E-07    2          22        22   # BR(A -> gam     gam    )
     2.23219013E-07    2          23        22   # BR(A -> Z       gam    )
     2.68281881E-04    2          23        25   # BR(A -> Z       h      )
     7.47081526E-03    2     1000024  -1000024   # BR(A -> ~chi_1+ ~chi_1-)
     4.50214036E-03    2     1000022   1000022   # BR(A -> ~chi_10 ~chi_10)
     3.97439302E-03    2     1000023   1000023   # BR(A -> ~chi_20 ~chi_20)
     1.79657334E-04    2     1000022   1000023   # BR(A -> ~chi_10 ~chi_20)
     8.10109467E-02    2     1000022   1000025   # BR(A -> ~chi_10 ~chi_30)
     6.61417918E-02    2     1000023   1000025   # BR(A -> ~chi_20 ~chi_30)
#
#         PDG            Width
DECAY        37     3.45723480E+00   # H+ decays
#          BR         NDA      ID1       ID2
     1.13363550E-03    2           4        -5   # BR(H+ -> c       bb     )
     1.09766453E-01    2         -15        16   # BR(H+ -> tau+    nu_tau )
     3.89845455E-04    2         -13        14   # BR(H+ -> mu+     nu_mu  )
     1.13362305E-05    2           2        -5   # BR(H+ -> u       bb     )
     1.39933441E-05    2           2        -3   # BR(H+ -> u       sb     )
     2.76134222E-04    2           4        -3   # BR(H+ -> c       sb     )
     7.28223413E-01    2           6        -5   # BR(H+ -> t       bb     )
     2.82265071E-04    2          24        25   # BR(H+ -> W+      h      )
     2.59431384E-10    2          24        36   # BR(H+ -> W+      A      )
     1.54272825E-04    2     1000024   1000022   # BR(H+ -> ~chi_1+ ~chi_10)
     2.24021643E-05    2     1000024   1000023   # BR(H+ -> ~chi_1+ ~chi_20)
     1.59726249E-01    2     1000024   1000025   # BR(H+ -> ~chi_1+ ~chi_30)
