#
#                              ======================
#                              | THE SUSYHIT OUTPUT |
#                              ======================
#
#
#              ------------------------------------------------------
#              |     This is the output of the SUSY-HIT package     |
#              |  created by A.Djouadi, M.Muehlleitner and M.Spira. |
#              |  In case of problems with SUSY-HIT email to        |
#              |           margarete.muehlleitner@cern.ch           |
#              |           michael.spira@psi.ch                     |
#              |           abdelhak.djouadi@cern.ch                 |
#              ------------------------------------------------------
#
#              ------------------------------------------------------
#              |  SUSY Les Houches Accord - MSSM Spectrum + Decays  |
#              |              based on the decay programs           |
#              |                                                    |
#              |                     SDECAY 1.3b                    |
#              |                                                    |
#              |  Authors: M.Muhlleitner, A.Djouadi and Y.Mambrini  |
#              |  Ref.:    Comput.Phys.Commun.168(2005)46           |
#              |           [hep-ph/0311167]                         |
#              |                                                    |
#              |                     HDECAY 3.4                     |
#              |                                                    |
#              |  By: A.Djouadi,J.Kalinowski,M.Muhlleitner,M.Spira  |
#              |  Ref.:    Comput.Phys.Commun.108(1998)56           |
#              |           [hep-ph/9704448]                         |
#              |                                                    |
#              |                                                    |
#              |  If not stated otherwise all DRbar couplings and   |
#              |  soft SUSY breaking masses are given at the scale  |
#              |  Q=  0.29962620E+04
#              |                                                    |
#              ------------------------------------------------------
#
#
BLOCK DCINFO  # Decay Program information
     1   SDECAY/HDECAY # decay calculator
     2   1.3b  /3.4    # version number
#
BLOCK SPINFO  # Spectrum calculator information
     1     SOFTSUSY    # spectrum calculator               
     2     3.4.0       # version number                    
#
BLOCK MODSEL  # Model selection
     1     0   #  nonUniversal                                     
#
BLOCK SMINPUTS  # Standard Model inputs
         1     1.27908970E+02   # alpha_em^-1(M_Z)^MSbar
         2     1.16637870E-05   # G_F [GeV^-2]
         3     1.18400000E-01   # alpha_S(M_Z)^MSbar
         4     9.11876000E+01   # M_Z pole mass
         5     4.18000000E+00   # mb(mb)^MSbar
         6     1.73200000E+02   # mt pole mass
         7     1.77700000E+00   # mtau pole mass
#
BLOCK MINPAR  # Input parameters - minimal models
         3     1.94000000E+01   # tanb                
#
BLOCK EXTPAR  # Input parameters - non-minimal models
         0    -1.00000000E+00   # Set                 
         1     7.54620000E+02   # M_1(MX)             
         2     1.66292000E+03   # M_2(MX)             
         3     6.05840000E+02   # M_3(MX)             
        11    -4.49309000E+03   # At(MX)              
        12     5.76800000E+02   # Ab(MX)              
        13    -1.35235000E+03   # Atau(MX)            
        23     3.19636000E+03   # mu(MX)              
        26     2.96612000E+03   # mA(pole)            
        31     1.40872000E+03   # meL(MX)             
        32     1.40872000E+03   # mmuL(MX)            
        33     8.46020000E+02   # mtauL(MX)           
        34     2.90286000E+03   # meR(MX)             
        35     2.90286000E+03   # mmuR(MX)            
        36     3.98097000E+03   # mtauR(MX)           
        41     2.27983000E+03   # mqL1(MX)            
        42     2.27983000E+03   # mqL2(MX)            
        43     2.38784000E+03   # mqL3(MX)            
        44     3.34678000E+03   # muR(MX)             
        45     3.34678000E+03   # mcR(MX)             
        46     3.76164000E+03   # mtR(MX)             
        47     1.42870000E+03   # mdR(MX)             
        48     1.42870000E+03   # msR(MX)             
        49     1.71471000E+03   # mbR(MX)             
#
BLOCK MASS  # Mass Spectrum
# PDG code           mass       particle
        24     8.03907164E+01   # W+
        25     1.27603454E+02   # h
        35     2.96608720E+03   # H
        36     2.96612000E+03   # A
        37     2.96726635E+03   # H+
         5     4.81876030E+00   # b-quark pole mass calculated from mb(mb)_Msbar
   1000001     2.31914483E+03   # ~d_L
   2000001     1.45543821E+03   # ~d_R
   1000002     2.31794772E+03   # ~u_L
   2000002     3.37926673E+03   # ~u_R
   1000003     2.31914483E+03   # ~s_L
   2000003     1.45543821E+03   # ~s_R
   1000004     2.31794772E+03   # ~c_L
   2000004     3.37926673E+03   # ~c_R
   1000005     1.73466769E+03   # ~b_1
   2000005     2.41852481E+03   # ~b_2
   1000006     2.40928981E+03   # ~t_1
   2000006     3.73889610E+03   # ~t_2
   1000011     1.43168566E+03   # ~e_L
   2000011     2.90681000E+03   # ~e_R
   1000012     1.42923465E+03   # ~nu_eL
   1000013     1.43168566E+03   # ~mu_L
   2000013     2.90681000E+03   # ~mu_R
   1000014     1.42923465E+03   # ~nu_muL
   1000015     8.78213366E+02   # ~tau_1
   2000015     3.98312484E+03   # ~tau_2
   1000016     8.74930345E+02   # ~nu_tauL
   1000021     7.60278106E+02   # ~g
   1000022     7.48474342E+02   # ~chi_10
   1000023     1.68417115E+03   # ~chi_20
   1000025    -3.23758372E+03   # ~chi_30
   1000035     3.23912625E+03   # ~chi_40
   1000024     1.68433596E+03   # ~chi_1+
   1000037     3.23973024E+03   # ~chi_2+
#
BLOCK NMIX  # Neutralino Mixing Matrix
  1  1     9.99884889E-01   # N_11
  1  2    -4.36736633E-04   # N_12
  1  3     1.45742275E-02   # N_13
  1  4    -4.19650902E-03   # N_14
  2  1     1.00283939E-03   # N_21
  2  2     9.99265311E-01   # N_22
  2  3    -3.35084379E-02   # N_23
  2  4     1.85746271E-02   # N_24
  3  1    -7.33180931E-03   # N_31
  3  2     1.05685847E-02   # N_32
  3  3     7.06943487E-01   # N_33
  3  4     7.07153064E-01   # N_34
  4  1    -1.32456944E-02   # N_41
  4  2     3.68368314E-02   # N_42
  4  3     7.06325479E-01   # N_43
  4  4    -7.06804016E-01   # N_44
#
BLOCK UMIX  # Chargino Mixing Matrix U
  1  1     9.98871398E-01   # U_11
  1  2    -4.74966291E-02   # U_12
  2  1     4.74966291E-02   # U_21
  2  2     9.98871398E-01   # U_22
#
BLOCK VMIX  # Chargino Mixing Matrix V
  1  1     9.99651547E-01   # V_11
  1  2    -2.63966844E-02   # V_12
  2  1     2.63966844E-02   # V_21
  2  2     9.99651547E-01   # V_22
#
BLOCK STOPMIX  # Stop Mixing Matrix
  1  1     9.96744277E-01   # cos(theta_t)
  1  2     8.06278256E-02   # sin(theta_t)
  2  1    -8.06278256E-02   # -sin(theta_t)
  2  2     9.96744277E-01   # cos(theta_t)
#
BLOCK SBOTMIX  # Sbottom Mixing Matrix
  1  1     4.56953628E-02   # cos(theta_b)
  1  2     9.98955421E-01   # sin(theta_b)
  2  1    -9.98955421E-01   # -sin(theta_b)
  2  2     4.56953628E-02   # cos(theta_b)
#
BLOCK STAUMIX  # Stau Mixing Matrix
  1  1     9.99971785E-01   # cos(theta_tau)
  1  2     7.51193743E-03   # sin(theta_tau)
  2  1    -7.51193743E-03   # -sin(theta_tau)
  2  2     9.99971785E-01   # cos(theta_tau)
#
BLOCK ALPHA  # Higgs mixing
          -5.39104955E-02   # Mixing angle in the neutral Higgs boson sector
#
BLOCK HMIX Q=  2.99626200E+03  # DRbar Higgs Parameters
         1     3.24546088E+03   # mu(Q)MSSM           
         2     1.85673166E+01   # tan                 
         3     2.42804871E+02   # higgs               
         4     9.46130398E+06   # mA^2(Q)MSSM         
#
BLOCK GAUGE Q=  2.99626200E+03  # The gauge couplings
     1     3.64715452E-01   # gprime(Q) DRbar
     2     6.37031701E-01   # g(Q) DRbar
     3     1.03605864E+00   # g3(Q) DRbar
#
BLOCK AU Q=  2.99626200E+03  # The trilinear couplings
  1  1     0.00000000E+00   # A_u(Q) DRbar
  2  2     0.00000000E+00   # A_c(Q) DRbar
  3  3    -4.49308999E+03   # A_t(Q) DRbar
#
BLOCK AD Q=  2.99626200E+03  # The trilinear couplings
  1  1     0.00000000E+00   # A_d(Q) DRbar
  2  2     0.00000000E+00   # A_s(Q) DRbar
  3  3     5.76800002E+02   # A_b(Q) DRbar
#
BLOCK AE Q=  2.99626200E+03  # The trilinear couplings
  1  1     0.00000000E+00   # A_e(Q) DRbar
  2  2     0.00000000E+00   # A_mu(Q) DRbar
  3  3    -1.35235000E+03   # A_tau(Q) DRbar
#
BLOCK Yu Q=  2.99626200E+03  # The Yukawa couplings
  1  1     0.00000000E+00   # y_u(Q) DRbar
  2  2     0.00000000E+00   # y_c(Q) DRbar
  3  3     8.18580198E-01   # y_t(Q) DRbar
#
BLOCK Yd Q=  2.99626200E+03  # The Yukawa couplings
  1  1     0.00000000E+00   # y_d(Q) DRbar
  2  2     0.00000000E+00   # y_s(Q) DRbar
  3  3     2.32038343E-01   # y_b(Q) DRbar
#
BLOCK Ye Q=  2.99626200E+03  # The Yukawa couplings
  1  1     0.00000000E+00   # y_e(Q) DRbar
  2  2     0.00000000E+00   # y_mu(Q) DRbar
  3  3     1.99772690E-01   # y_tau(Q) DRbar
#
BLOCK MSOFT Q=  2.99626200E+03  # The soft SUSY breaking masses at the scale Q
         1     7.54620000E+02   # M_1(Q)              
         2     1.66292000E+03   # M_2(Q)              
         3     6.05840000E+02   # M_3(Q)              
        21    -1.87592082E+06   # mH1^2(Q)            
        22    -1.04092909E+07   # mH2^2(Q)            
        31     1.40872000E+03   # meL(Q)              
        32     1.40872000E+03   # mmuL(Q)             
        33     8.46020000E+02   # mtauL(Q)            
        34     2.90286000E+03   # meR(Q)              
        35     2.90286000E+03   # mmuR(Q)             
        36     3.98097000E+03   # mtauR(Q)            
        41     2.27983000E+03   # mqL1(Q)             
        42     2.27983000E+03   # mqL2(Q)             
        43     2.38784000E+03   # mqL3(Q)             
        44     3.34678000E+03   # muR(Q)              
        45     3.34678000E+03   # mcR(Q)              
        46     3.76164000E+03   # mtR(Q)              
        47     1.42870000E+03   # mdR(Q)              
        48     1.42870000E+03   # msR(Q)              
        49     1.71471000E+03   # mbR(Q)              
#
Block HiggsBoundsInputHiggsCouplingsFermions
# ScalarNormEffCoupSq PseudoSNormEffCoupSq NP   IP1 IP2 IP2
    1.00388066E+00    0.00000000E+00        3  25   5   5  # h0-b-b eff. coupling^2, normalised to SM
    3.44741365E+02    0.00000000E+00        3  35   5   5  # H0-b-b eff. coupling^2, normalised to SM
    0.00000000E+00    3.44745246E+02        3  36   5   5  # A0-b-b eff. coupling^2, normalised to SM
#
    9.99988743E-01    0.00000000E+00        3  25   6   6  # h0-t-t eff. coupling^2, normalised to SM
    2.91194925E-03    0.00000000E+00        3  35   6   6  # H0-t-t eff. coupling^2, normalised to SM
    0.00000000E+00    2.90069265E-03        3  36   6   6  # A0-t-t eff. coupling^2, normalised to SM
#
    1.00388066E+00    0.00000000E+00        3  25  15  15  # h0-tau-tau eff. coupling^2, normalised to SM
    3.44741365E+02    0.00000000E+00        3  35  15  15  # H0-tau-tau eff. coupling^2, normalised to SM
    0.00000000E+00    3.44745246E+02        3  36  15  15  # A0-tau-tau eff. coupling^2, normalised to SM
#
Block HiggsBoundsInputHiggsCouplingsBosons
    9.99999989E-01        3  25  24  24  # h0-W-W eff. coupling^2, normalised to SM
    1.08996791E-08        3  35  24  24  # H0-W-W eff. coupling^2, normalised to SM
    0.00000000E+00        3  36  24  24  # A0-W-W eff. coupling^2, normalised to SM
#
    9.99999989E-01        3  25  23  23  # h0-Z-Z eff. coupling^2, normalised to SM
    1.08996791E-08        3  35  23  23  # H0-Z-Z eff. coupling^2, normalised to SM
    0.00000000E+00        3  36  23  23  # A0-Z-Z eff. coupling^2, normalised to SM
#
    8.85223372E-01        3  25  21  21  # h0-g-g eff. coupling^2, normalised to SM
    2.09604895E-14        3  35  21  21  # H0-g-g eff. coupling^2, normalised to SM
    1.43078596E-12        3  36  21  21  # A0-g-g eff. coupling^2, normalised to SM
#
    0.00000000E+00        3  25  25  23  # h0-h0-Z eff. coupling^2, normalised to SM
    0.00000000E+00        3  35  25  23  # H0-h0-Z eff. coupling^2, normalised to SM
    1.08996791E-08        3  36  25  23  # A0-h0-Z eff. coupling^2, normalised to SM
    0.00000000E+00        3  35  35  23  # H0-H0-Z eff. coupling^2, normalised to SM
    9.99999989E-01        3  36  35  23  # A0-H0-Z eff. coupling^2, normalised to SM
    0.00000000E+00        3  36  36  23  # A0-A0-Z eff. coupling^2, normalised to SM
#
    0.00000000E+00        4  25  21  21  23  # h0-g-g-Z eff. coupling^2, normalised to SM
    0.00000000E+00        4  35  21  21  23  # H0-g-g-Z eff. coupling^2, normalised to SM
    0.00000000E+00        4  36  21  21  23  # A0-g-g-Z eff. coupling^2, normalised to SM
#
#
#
#                             =================
#                             |The decay table|
#                             =================
#
# - The QCD corrections to the decays gluino -> squark  + quark
#                                     squark -> gaugino + quark_prime
#                                     squark -> squark_prime + Higgs
#                                     squark -> gluino  + quark
#   are included.
#
# - The multi-body decays for the inos, stops and sbottoms are included.
#
# - The loop induced decays for the gluino, neutralinos and stops
#   are included.
#
# - The SUSY decays of the top quark are included.
#
#
#         PDG            Width
DECAY         6     1.42916445E+00   # top decays
#          BR         NDA      ID1       ID2
     1.00000000E+00    2           5        24   # BR(t ->  b    W+)
#
#         PDG            Width
DECAY   1000021     1.47125560E-12   # gluino decays
#          BR         NDA      ID1       ID2
     6.75672827E-02    2     1000022        21   # BR(~g -> ~chi_10 g)
#           BR         NDA      ID1       ID2       ID3
     4.15905367E-01    3     1000022         1        -1   # BR(~g -> ~chi_10 d  db)
     4.35439369E-02    3     1000022         2        -2   # BR(~g -> ~chi_10 u  ub)
     4.15905367E-01    3     1000022         3        -3   # BR(~g -> ~chi_10 s  sb)
     4.35439369E-02    3     1000022         4        -4   # BR(~g -> ~chi_10 c  cb)
     1.35341090E-02    3     1000022         5        -5   # BR(~g -> ~chi_10 b  bb)
#
#         PDG            Width
DECAY   1000006     1.20508122E+02   # stop1 decays
#          BR         NDA      ID1       ID2
     2.72270184E-03    2     1000022         6   # BR(~t_1 -> ~chi_10 t )
     1.99759148E-02    2     1000023         6   # BR(~t_1 -> ~chi_20 t )
     4.21197156E-02    2     1000024         5   # BR(~t_1 -> ~chi_1+ b )
     9.18749142E-01    2     1000021         6   # BR(~t_1 -> ~g      t )
     1.64325258E-02    2     1000005        24   # BR(~t_1 -> ~b_1    W+)
#
#         PDG            Width
DECAY   2000006     2.93370901E+02   # stop2 decays
#          BR         NDA      ID1       ID2
     2.72593445E-02    2     1000022         6   # BR(~t_2 -> ~chi_10 t )
     7.13688981E-05    2     1000023         6   # BR(~t_2 -> ~chi_20 t )
     4.69371460E-03    2     1000025         6   # BR(~t_2 -> ~chi_30 t )
     5.21994746E-03    2     1000035         6   # BR(~t_2 -> ~chi_40 t )
     1.43226427E-04    2     1000024         5   # BR(~t_2 -> ~chi_1+ b )
     1.05177860E-02    2     1000037         5   # BR(~t_2 -> ~chi_2+ b )
     6.61771088E-01    2     1000021         6   # BR(~t_2 -> ~g      t )
     7.48039789E-02    2     1000006        25   # BR(~t_2 -> ~t_1    h )
     7.36094251E-02    2     1000006        23   # BR(~t_2 -> ~t_1    Z )
     7.28014629E-04    2     1000005        24   # BR(~t_2 -> ~b_1    W+)
     1.41182106E-01    2     2000005        24   # BR(~t_2 -> ~b_2    W+)
#
#         PDG            Width
DECAY   1000005     6.51698174E+01   # sbottom1 decays
#          BR         NDA      ID1       ID2
     1.03776343E-02    2     1000022         5   # BR(~b_1 -> ~chi_10 b )
     1.39091141E-06    2     1000023         5   # BR(~b_1 -> ~chi_20 b )
     9.89620975E-01    2     1000021         5   # BR(~b_1 -> ~g      b )
#
#         PDG            Width
DECAY   2000005     1.21723987E+02   # sbottom2 decays
#          BR         NDA      ID1       ID2
     2.39191369E-03    2     1000022         5   # BR(~b_2 -> ~chi_10 b )
     2.11631583E-02    2     1000023         5   # BR(~b_2 -> ~chi_20 b )
     4.01571419E-02    2    -1000024         6   # BR(~b_2 -> ~chi_1- t )
     9.18768020E-01    2     1000021         5   # BR(~b_2 -> ~g      b )
     8.82821111E-03    2     1000005        25   # BR(~b_2 -> ~b_1    h )
     8.69155531E-03    2     1000005        23   # BR(~b_2 -> ~b_1    Z )
#
#         PDG            Width
DECAY   1000002     1.41545932E+02   # sup_L decays
#          BR         NDA      ID1       ID2
     1.86302077E-03    2     1000022         2   # BR(~u_L -> ~chi_10 u)
     1.43746643E-02    2     1000023         2   # BR(~u_L -> ~chi_20 u)
     2.87480862E-02    2     1000024         1   # BR(~u_L -> ~chi_1+ d)
     9.55014229E-01    2     1000021         2   # BR(~u_L -> ~g      u)
#
#         PDG            Width
DECAY   2000002     2.30005882E+02   # sup_R decays
#          BR         NDA      ID1       ID2
     3.03107673E-02    2     1000022         2   # BR(~u_R -> ~chi_10 u)
     1.90441220E-08    2     1000023         2   # BR(~u_R -> ~chi_20 u)
     1.29755109E-08    2     1000025         2   # BR(~u_R -> ~chi_30 u)
     4.14711220E-08    2     1000035         2   # BR(~u_R -> ~chi_40 u)
     9.69689159E-01    2     1000021         2   # BR(~u_R -> ~g      u)
#
#         PDG            Width
DECAY   1000001     1.41661203E+02   # sdown_L decays
#          BR         NDA      ID1       ID2
     1.88005007E-03    2     1000022         1   # BR(~d_L -> ~chi_10 d)
     1.43921701E-02    2     1000023         1   # BR(~d_L -> ~chi_20 d)
     2.87602397E-02    2    -1000024         2   # BR(~d_L -> ~chi_1- u)
     9.54967540E-01    2     1000021         1   # BR(~d_L -> ~g      d)
#
#         PDG            Width
DECAY   2000001     5.67968042E+01   # sdown_R decays
#          BR         NDA      ID1       ID2
     7.89127914E-03    2     1000022         1   # BR(~d_R -> ~chi_10 d)
     9.92108721E-01    2     1000021         1   # BR(~d_R -> ~g      d)
#
#         PDG            Width
DECAY   1000004     1.11646356E+02   # scharm_L decays
#          BR         NDA      ID1       ID2
     2.43720191E-03    2     1000022         4   # BR(~c_L -> ~chi_10 c)
     1.86571460E-02    2     1000023         4   # BR(~c_L -> ~chi_20 c)
     3.73126536E-02    2     1000024         3   # BR(~c_L -> ~chi_1+ s)
     9.41592999E-01    2     1000021         4   # BR(~c_L -> ~g      c)
#
#         PDG            Width
DECAY   2000004     1.80635750E+02   # scharm_R decays
#          BR         NDA      ID1       ID2
     3.97843959E-02    2     1000022         4   # BR(~c_R -> ~chi_10 c)
     2.50009627E-08    2     1000023         4   # BR(~c_R -> ~chi_20 c)
     1.59421770E-08    2     1000025         4   # BR(~c_R -> ~chi_30 c)
     5.09293659E-08    2     1000035         4   # BR(~c_R -> ~chi_40 c)
     9.60215512E-01    2     1000021         4   # BR(~c_R -> ~g      c)
#
#         PDG            Width
DECAY   1000003     1.11739210E+02   # sstrange_L decays
#          BR         NDA      ID1       ID2
     2.45943603E-03    2     1000022         3   # BR(~s_L -> ~chi_10 s)
     1.86801118E-02    2     1000023         3   # BR(~s_L -> ~chi_20 s)
     3.73286461E-02    2    -1000024         4   # BR(~s_L -> ~chi_1- c)
     9.41531806E-01    2     1000021         3   # BR(~s_L -> ~g      s)
#
#         PDG            Width
DECAY   2000003     4.42841390E+01   # sstrange_R decays
#          BR         NDA      ID1       ID2
     1.04539303E-02    2     1000022         3   # BR(~s_R -> ~chi_10 s)
     9.89546070E-01    2     1000021         3   # BR(~s_R -> ~g      s)
#
#         PDG            Width
DECAY   1000011     9.98595002E-01   # selectron_L decays
#          BR         NDA      ID1       ID2
     1.00000000E+00    2     1000022        11   # BR(~e_L -> ~chi_10 e-)
#
#         PDG            Width
DECAY   2000011     1.34090826E+01   # selectron_R decays
#          BR         NDA      ID1       ID2
     9.99999491E-01    2     1000022        11   # BR(~e_R -> ~chi_10 e-)
     5.09201455E-07    2     1000023        11   # BR(~e_R -> ~chi_20 e-)
#
#         PDG            Width
DECAY   1000013     9.98594981E-01   # smuon_L decays
#          BR         NDA      ID1       ID2
     1.00000000E+00    2     1000022        13   # BR(~mu_L -> ~chi_10 mu-)
#
#         PDG            Width
DECAY   2000013     1.34090825E+01   # smuon_R decays
#          BR         NDA      ID1       ID2
     9.99999491E-01    2     1000022        13   # BR(~mu_R -> ~chi_10 mu-)
     5.09201453E-07    2     1000023        13   # BR(~mu_R -> ~chi_20 mu-)
#
#         PDG            Width
DECAY   1000015     8.69437836E-02   # stau_1 decays
#          BR         NDA      ID1       ID2
     1.00000000E+00    2     1000022        15   # BR(~tau_1 -> ~chi_10  tau-)
#
#         PDG            Width
DECAY   2000015     2.44092203E+01   # stau_2 decays
#          BR         NDA      ID1       ID2
     8.03505497E-01    2     1000022        15   # BR(~tau_2 -> ~chi_10  tau-)
     2.47055504E-05    2     1000023        15   # BR(~tau_2 -> ~chi_20  tau-)
     7.46452370E-03    2     1000025        15   # BR(~tau_2 -> ~chi_30  tau-)
     7.44932885E-03    2     1000035        15   # BR(~tau_2 -> ~chi_40  tau-)
     4.85301544E-05    2    -1000024        16   # BR(~tau_2 -> ~chi_1-  nu_tau)
     1.48394148E-02    2    -1000037        16   # BR(~tau_2 -> ~chi_2-  nu_tau)
     2.53235497E-03    2     1000016       -37   # BR(~tau_2 -> ~nu_tauL H-)
     7.85572468E-02    2     1000016       -24   # BR(~tau_2 -> ~nu_tauL W-)
     4.25938750E-02    2     1000015        25   # BR(~tau_2 -> ~tau_1   h)
     1.25719308E-03    2     1000015        35   # BR(~tau_2 -> ~tau_1   H)
     1.25806866E-03    2     1000015        36   # BR(~tau_2 -> ~tau_1   A)
     4.04692615E-02    2     1000015        23   # BR(~tau_2 -> ~tau_1   Z)
#
#         PDG            Width
DECAY   1000012     9.97351913E-01   # snu_eL decays
#          BR         NDA      ID1       ID2
     1.00000000E+00    2     1000022        12   # BR(~nu_eL -> ~chi_10 nu_e)
#
#         PDG            Width
DECAY   1000014     9.97351913E-01   # snu_muL decays
#          BR         NDA      ID1       ID2
     1.00000000E+00    2     1000022        14   # BR(~nu_muL -> ~chi_10 nu_mu)
#
#         PDG            Width
DECAY   1000016     8.33648452E-02   # snu_tauL decays
#          BR         NDA      ID1       ID2
     1.00000000E+00    2     1000022        16   # BR(~nu_tauL -> ~chi_10 nu_tau)
#
#         PDG            Width
DECAY   1000024     9.33243664E+00   # chargino1+ decays
#          BR         NDA      ID1       ID2
     5.70664855E-02    2     1000012       -11   # BR(~chi_1+ -> ~nu_eL   e+  )
     5.70664855E-02    2     1000014       -13   # BR(~chi_1+ -> ~nu_muL  mu+ )
     3.88271044E-01    2     1000016       -15   # BR(~chi_1+ -> ~nu_tau1 tau+)
     5.59758559E-02    2    -1000011        12   # BR(~chi_1+ -> ~e_L+    nu_e)
     5.59758559E-02    2    -1000013        14   # BR(~chi_1+ -> ~mu_L+   nu_mu)
     3.85460271E-01    2    -1000015        16   # BR(~chi_1+ -> ~tau_1+  nu_tau)
     1.84002386E-04    2     1000022        24   # BR(~chi_1+ -> ~chi_10  W+)
#
#         PDG            Width
DECAY   1000037     3.82328972E+01   # chargino2+ decays
#          BR         NDA      ID1       ID2
     1.66126154E-04    2     1000002        -1   # BR(~chi_2+ -> ~u_L     db)
     5.36700802E-04    2    -1000001         2   # BR(~chi_2+ -> ~d_L*    u )
     1.66126143E-04    2     1000004        -3   # BR(~chi_2+ -> ~c_L     sb)
     5.36700223E-04    2    -1000003         4   # BR(~chi_2+ -> ~s_L*     c )
     2.82601624E-02    2     1000006        -5   # BR(~chi_2+ -> ~t_1     bb)
     7.30173610E-02    2    -1000005         6   # BR(~chi_2+ -> ~b_1*    t )
     3.18656207E-01    2    -2000005         6   # BR(~chi_2+ -> ~b_2*    t )
     1.54594272E-04    2     1000012       -11   # BR(~chi_2+ -> ~nu_eL   e+  )
     1.54594272E-04    2     1000014       -13   # BR(~chi_2+ -> ~nu_muL mu+ )
     2.90450196E-02    2     1000016       -15   # BR(~chi_2+ -> ~nu_tau1 tau+)
     4.99688547E-04    2    -1000011        12   # BR(~chi_2+ -> ~e_L+    nu_e)
     4.99688547E-04    2    -1000013        14   # BR(~chi_2+ -> ~mu_L+   nu_mu)
     5.98366125E-04    2    -1000015        16   # BR(~chi_2+ -> ~tau_1+  nu_tau)
     1.63467794E-01    2     1000024        23   # BR(~chi_2+ -> ~chi_1+  Z )
     5.38197013E-02    2     1000022        24   # BR(~chi_2+ -> ~chi_10  W+)
     1.59629930E-01    2     1000023        24   # BR(~chi_2+ -> ~chi_20  W+)
     1.70791240E-01    2     1000024        25   # BR(~chi_2+ -> ~chi_1+  h )
#
#         PDG            Width
DECAY   1000022     0.00000000E+00   # neutralino1 decays
#
#         PDG            Width
DECAY   1000023     9.32829524E+00   # neutralino2 decays
#          BR         NDA      ID1       ID2
     1.45395318E-05    2     1000022        23   # BR(~chi_20 -> ~chi_10   Z )
     1.66451643E-04    2     1000022        25   # BR(~chi_20 -> ~chi_10   h )
     1.02181094E-08    2     2000001        -1   # BR(~chi_20 -> ~d_R      db)
     1.02181094E-08    2    -2000001         1   # BR(~chi_20 -> ~d_R*     d )
     1.02181094E-08    2     2000003        -3   # BR(~chi_20 -> ~s _R      sb)
     1.02181094E-08    2    -2000003         3   # BR(~chi_20 -> ~s _R*     s )
     2.80233252E-02    2     1000011       -11   # BR(~chi_20 -> ~e_L-     e+)
     2.80233252E-02    2    -1000011        11   # BR(~chi_20 -> ~e_L+     e-)
     2.80233252E-02    2     1000013       -13   # BR(~chi_20 -> ~mu_L-    mu+)
     2.80233252E-02    2    -1000013        13   # BR(~chi_20 -> ~mu_L+    mu-)
     1.93201360E-01    2     1000015       -15   # BR(~chi_20 -> ~tau_1-   tau+)
     1.93201360E-01    2    -1000015        15   # BR(~chi_20 -> ~tau_1+   tau-)
     2.84596268E-02    2     1000012       -12   # BR(~chi_20 -> ~nu_eL    nu_eb)
     2.84596268E-02    2    -1000012        12   # BR(~chi_20 -> ~nu_eL*   nu_e )
     2.84596268E-02    2     1000014       -14   # BR(~chi_20 -> ~nu_muL   nu_mub)
     2.84596268E-02    2    -1000014        14   # BR(~chi_20 -> ~nu_muL*  nu_mu )
     1.93742219E-01    2     1000016       -16   # BR(~chi_20 -> ~nu_tau1  nu_taub)
     1.93742219E-01    2    -1000016        16   # BR(~chi_20 -> ~nu_tau1* nu_tau )
#
#         PDG            Width
DECAY   1000025     3.74329402E+01   # neutralino3 decays
#          BR         NDA      ID1       ID2
     4.35861926E-02    2     1000022        23   # BR(~chi_30 -> ~chi_10   Z )
     1.53031308E-01    2     1000023        23   # BR(~chi_30 -> ~chi_20   Z )
     1.61770033E-01    2     1000024       -24   # BR(~chi_30 -> ~chi_1+   W-)
     1.61770033E-01    2    -1000024        24   # BR(~chi_30 -> ~chi_1-   W+)
     1.42470340E-02    2     1000022        25   # BR(~chi_30 -> ~chi_10   h )
     1.29225397E-02    2     1000023        25   # BR(~chi_30 -> ~chi_20   h )
     1.02020478E-05    2     1000002        -2   # BR(~chi_30 -> ~u_L      ub)
     1.02020478E-05    2    -1000002         2   # BR(~chi_30 -> ~u_L*     u )
     1.73420781E-05    2     1000001        -1   # BR(~chi_30 -> ~d_L      db)
     1.73420781E-05    2    -1000001         1   # BR(~chi_30 -> ~d_L*     d )
     2.53207274E-06    2     2000001        -1   # BR(~chi_30 -> ~d_R      db)
     2.53207274E-06    2    -2000001         1   # BR(~chi_30 -> ~d_R*     d )
     1.02020368E-05    2     1000004        -4   # BR(~chi_30 -> ~c_L      cb)
     1.02020368E-05    2    -1000004         4   # BR(~chi_30 -> ~c_L*     c )
     1.73420781E-05    2     1000003        -3   # BR(~chi_30 -> ~s _L      sb)
     1.73420781E-05    2    -1000003         3   # BR(~chi_30 -> ~s _L*     s )
     2.53207274E-06    2     2000003        -3   # BR(~chi_30 -> ~s _R      sb)
     2.53207274E-06    2    -2000003         3   # BR(~chi_30 -> ~s _R*     s )
     1.62655673E-01    2     1000006        -6   # BR(~chi_30 -> ~t_1      tb)
     1.62655673E-01    2    -1000006         6   # BR(~chi_30 -> ~t_1*     t )
     3.51597508E-02    2     1000005        -5   # BR(~chi_30 -> ~b_1      bb)
     3.51597508E-02    2    -1000005         5   # BR(~chi_30 -> ~b_1*     b )
     1.36452376E-02    2     2000005        -5   # BR(~chi_30 -> ~b_2      bb)
     1.36452376E-02    2    -2000005         5   # BR(~chi_30 -> ~b_2*     b )
     4.58530758E-06    2     1000011       -11   # BR(~chi_30 -> ~e_L-     e+)
     4.58530758E-06    2    -1000011        11   # BR(~chi_30 -> ~e_L+     e-)
     4.62555553E-07    2     2000011       -11   # BR(~chi_30 -> ~e_R-     e+)
     4.62555553E-07    2    -2000011        11   # BR(~chi_30 -> ~e_R+     e-)
     4.58530758E-06    2     1000013       -13   # BR(~chi_30 -> ~mu_L-    mu+)
     4.58530758E-06    2    -1000013        13   # BR(~chi_30 -> ~mu_L+    mu-)
     4.62555553E-07    2     2000013       -13   # BR(~chi_30 -> ~mu_R-    mu+)
     4.62555553E-07    2    -2000013        13   # BR(~chi_30 -> ~mu_R+    mu-)
     1.47234691E-02    2     1000015       -15   # BR(~chi_30 -> ~tau_1-   tau+)
     1.47234691E-02    2    -1000015        15   # BR(~chi_30 -> ~tau_1+   tau-)
     2.46728910E-05    2     1000012       -12   # BR(~chi_30 -> ~nu_eL    nu_eb)
     2.46728910E-05    2    -1000012        12   # BR(~chi_30 -> ~nu_eL*   nu_e )
     2.46728910E-05    2     1000014       -14   # BR(~chi_30 -> ~nu_muL   nu_mub)
     2.46728910E-05    2    -1000014        14   # BR(~chi_30 -> ~nu_muL*  nu_mu )
     3.27060821E-05    2     1000016       -16   # BR(~chi_30 -> ~nu_tau1  nu_taub)
     3.27060821E-05    2    -1000016        16   # BR(~chi_30 -> ~nu_tau1* nu_tau )
#
#         PDG            Width
DECAY   1000035     3.85507793E+01   # neutralino4 decays
#          BR         NDA      ID1       ID2
     1.29572020E-02    2     1000022        23   # BR(~chi_40 -> ~chi_10   Z )
     1.23162019E-02    2     1000023        23   # BR(~chi_40 -> ~chi_20   Z )
     1.55497969E-01    2     1000024       -24   # BR(~chi_40 -> ~chi_1+   W-)
     1.55497969E-01    2    -1000024        24   # BR(~chi_40 -> ~chi_1-   W+)
     4.40087440E-02    2     1000022        25   # BR(~chi_40 -> ~chi_10   h )
     1.56681165E-01    2     1000023        25   # BR(~chi_40 -> ~chi_20   h )
     1.39031222E-04    2     1000002        -2   # BR(~chi_40 -> ~u_L      ub)
     1.39031222E-04    2    -1000002         2   # BR(~chi_40 -> ~u_L*     u )
     1.82631457E-04    2     1000001        -1   # BR(~chi_40 -> ~d_L      db)
     1.82631457E-04    2    -1000001         1   # BR(~chi_40 -> ~d_L*     d )
     8.03230439E-06    2     2000001        -1   # BR(~chi_40 -> ~d_R      db)
     8.03230439E-06    2    -2000001         1   # BR(~chi_40 -> ~d_R*     d )
     1.39031072E-04    2     1000004        -4   # BR(~chi_40 -> ~c_L      cb)
     1.39031072E-04    2    -1000004         4   # BR(~chi_40 -> ~c_L*     c )
     1.82631457E-04    2     1000003        -3   # BR(~chi_40 -> ~s _L      sb)
     1.82631457E-04    2    -1000003         3   # BR(~chi_40 -> ~s _L*     s )
     8.03230439E-06    2     2000003        -3   # BR(~chi_40 -> ~s _R      sb)
     8.03230439E-06    2    -2000003         3   # BR(~chi_40 -> ~s _R*     s )
     1.68218472E-01    2     1000006        -6   # BR(~chi_40 -> ~t_1      tb)
     1.68218472E-01    2    -1000006         6   # BR(~chi_40 -> ~t_1*     t )
     3.38931765E-02    2     1000005        -5   # BR(~chi_40 -> ~b_1      bb)
     3.38931765E-02    2    -1000005         5   # BR(~chi_40 -> ~b_1*     b )
     1.34613566E-02    2     2000005        -5   # BR(~chi_40 -> ~b_2      bb)
     1.34613566E-02    2    -2000005         5   # BR(~chi_40 -> ~b_2*     b )
     9.39593257E-05    2     1000011       -11   # BR(~chi_40 -> ~e_L-     e+)
     9.39593257E-05    2    -1000011        11   # BR(~chi_40 -> ~e_L+     e-)
     1.47825856E-06    2     2000011       -11   # BR(~chi_40 -> ~e_R-     e+)
     1.47825856E-06    2    -2000011        11   # BR(~chi_40 -> ~e_R+     e-)
     9.39593257E-05    2     1000013       -13   # BR(~chi_40 -> ~mu_L-    mu+)
     9.39593257E-05    2    -1000013        13   # BR(~chi_40 -> ~mu_L+    mu-)
     1.47825856E-06    2     2000013       -13   # BR(~chi_40 -> ~mu_R-    mu+)
     1.47825856E-06    2    -2000013        13   # BR(~chi_40 -> ~mu_R+    mu-)
     1.43755207E-02    2     1000015       -15   # BR(~chi_40 -> ~tau_1-   tau+)
     1.43755207E-02    2    -1000015        15   # BR(~chi_40 -> ~tau_1+   tau-)
     2.17006323E-04    2     1000012       -12   # BR(~chi_40 -> ~nu_eL    nu_eb)
     2.17006323E-04    2    -1000012        12   # BR(~chi_40 -> ~nu_eL*   nu_e )
     2.17006323E-04    2     1000014       -14   # BR(~chi_40 -> ~nu_muL   nu_mub)
     2.17006323E-04    2    -1000014        14   # BR(~chi_40 -> ~nu_muL*  nu_mu )
     2.87571511E-04    2     1000016       -16   # BR(~chi_40 -> ~nu_tau1  nu_taub)
     2.87571511E-04    2    -1000016        16   # BR(~chi_40 -> ~nu_tau1* nu_tau )
#
#         PDG            Width
DECAY        25     4.80115901E-03   # h decays
#          BR         NDA      ID1       ID2
     5.90302964E-01    2           5        -5   # BR(h -> b       bb     )
     5.52222560E-02    2         -15        15   # BR(h -> tau+    tau-   )
     1.95460587E-04    2         -13        13   # BR(h -> mu+     mu-    )
     2.12404169E-04    2           3        -3   # BR(h -> s       sb     )
     1.83657031E-02    2           4        -4   # BR(h -> c       cb     )
     7.05101824E-02    2          21        21   # BR(h -> g       g      )
     2.14139520E-03    2          22        22   # BR(h -> gam     gam    )
     1.63076913E-03    2          22        23   # BR(h -> Z       gam    )
     2.31405016E-01    2          24       -24   # BR(h -> W+      W-     )
     3.00138501E-02    2          23        23   # BR(h -> Z       Z      )
#
#         PDG            Width
DECAY        35     1.33686424E+01   # H decays
#          BR         NDA      ID1       ID2
     8.26933519E-01    2           5        -5   # BR(H -> b       bb     )
     1.45891584E-01    2         -15        15   # BR(H -> tau+    tau-   )
     5.21031979E-04    2         -13        13   # BR(H -> mu+     mu-    )
     2.53320982E-04    2           3        -3   # BR(H -> s       sb     )
     2.65535143E-07    2           4        -4   # BR(H -> c       cb     )
     2.60888108E-02    2           6        -6   # BR(H -> t       tb     )
     8.88326225E-06    2          21        21   # BR(H -> g       g      )
     2.77722559E-08    2          22        22   # BR(H -> gam     gam    )
     1.04314217E-08    2          23        22   # BR(H -> Z       gam    )
     6.83544983E-06    2          24       -24   # BR(H -> W+      W-     )
     3.41005046E-06    2          23        23   # BR(H -> Z       Z      )
     3.66182939E-05    2          25        25   # BR(H -> h       h      )
     7.13517358E-05    2     1000022   1000022   # BR(H -> ~chi_10 ~chi_10)
     1.68063717E-04    2     1000022   1000023   # BR(H -> ~chi_10 ~chi_20)
     8.40549433E-08    2     2000001  -2000001   # BR(H -> ~d_R    ~d_R*  )
     8.40549433E-08    2     2000003  -2000003   # BR(H -> ~s_R    ~s_R*  )
     5.30369592E-07    2     1000011  -1000011   # BR(H -> ~e_L-   ~e_L+  )
     5.30369592E-07    2     1000013  -1000013   # BR(H -> ~mu_L-  ~mu_L+ )
     6.16750757E-06    2     1000015  -1000015   # BR(H -> ~tau_1- ~tau_1+)
     1.76535181E-06    2     1000012  -1000012   # BR(H -> ~nu_eL  ~nu_eL*   )
     1.76535181E-06    2     1000014  -1000014   # BR(H -> ~nu_muL ~nu_muL*  )
     5.34009903E-06    2     1000016  -1000016   # BR(H -> ~nu_tauL ~nu_tauL*)
#
#         PDG            Width
DECAY        36     1.33768605E+01   # A decays
#          BR         NDA      ID1       ID2
     8.26525764E-01    2           5        -5   # BR(A -> b       bb     )
     1.45805488E-01    2         -15        15   # BR(A -> tau+    tau-   )
     5.20723724E-04    2         -13        13   # BR(A -> mu+     mu-    )
     2.53222734E-04    2           3        -3   # BR(A -> s       sb     )
     2.66796165E-07    2           4        -4   # BR(A -> c       cb     )
     2.62048204E-02    2           6        -6   # BR(A -> t       tb     )
     7.33522494E-05    2          21        21   # BR(A -> g       g      )
     5.46114491E-08    2          22        22   # BR(A -> gam     gam    )
     6.75047306E-08    2          23        22   # BR(A -> Z       gam    )
     6.91923362E-06    2          23        25   # BR(A -> Z       h      )
     1.01810475E-04    2     1000022   1000022   # BR(A -> ~chi_10 ~chi_10)
     5.07509447E-04    2     1000022   1000023   # BR(A -> ~chi_10 ~chi_20)
#
#         PDG            Width
DECAY        37     1.15808645E+01   # H+ decays
#          BR         NDA      ID1       ID2
     1.34459055E-03    2           4        -5   # BR(H+ -> c       bb     )
     1.68482541E-01    2         -15        16   # BR(H+ -> tau+    nu_tau )
     6.01711619E-04    2         -13        14   # BR(H+ -> mu+     nu_mu  )
     1.34458844E-05    2           2        -5   # BR(H+ -> u       bb     )
     1.46301613E-05    2           2        -3   # BR(H+ -> u       sb     )
     2.88261520E-04    2           4        -3   # BR(H+ -> c       sb     )
     8.28446605E-01    2           6        -5   # BR(H+ -> t       bb     )
     8.00669661E-06    2          24        25   # BR(H+ -> W+      h      )
     2.24902715E-13    2          24        36   # BR(H+ -> W+      A      )
     7.82075967E-04    2     1000024   1000022   # BR(H+ -> ~chi_1+ ~chi_10)
     2.44150352E-06    2    -1000011   1000012   # BR(H+ -> ~e_L+   ~nu_eL )
     2.44150352E-06    2    -1000013   1000014   # BR(H+ -> ~mu_L+  ~nu_muL)
     1.32480195E-05    2    -1000015   1000016   # BR(H+ -> ~tau_1+ ~nu_tauL)
