#=====================================================================
#  ISAJET SUSY parameters in SUSY Les Houches Accord format
#   Created from isa.wig and isa.out by isa2lha.py (b.k.gjelsten@fys.uio.no)
#===================================================================== SPINFO
Block SPINFO   # Program information
     1   ISASUSY FROM ISAJET            # Spectrum Calculator
     2   V7.80   29-OCT-2009 12:50:36   # Version
#===================================================================== MODSEL
Block MODSEL   # Model selection
     1     0   # General MSSM Simulation
#===================================================================== SMINPUTS
Block SMINPUTS   # Standard Model inputs
     1     1.28040973e+02   # alpha_em^{-1}
     3     1.20000000e-01   # alpha_s(m_Z)
     6     1.72500000e+02   # m_{top}(pole)
#===================================================================== MINPAR
Block MINPAR   # SUSY breaking input parameters
     3     5.00000000e+01   # tan(beta)
#===================================================================== MASS
Block MASS   # Scalar and gaugino mass spectrum
# PDG code     mass               particle
        25     1.23125300e+02   # h
        35     1.00658880e+03   # H
        36     1.00000000e+03   # A
        37     1.01125940e+03   # H+
   1000001     3.00058500e+03   # dL
   1000002     2.99952200e+03   # uL
   1000003     3.00058500e+03   # sL
   1000004     2.99952220e+03   # cL
   1000005     2.99771800e+03   # b1
   1000006     2.83293210e+03   # t1
   1000011     3.00037110e+03   # eL
   1000012     2.99930790e+03   # snue
   1000013     3.00037110e+03   # muL
   1000014     2.99930790e+03   # snum
   1000015     9.49737000e+01   # ta1
   1000016     2.99930790e+03   # snut
   1000021     3.00000000e+03   # gl
   1000022     4.18592000e+01   # N1
   1000023     1.12184600e+02   # N2
   1000024     1.06098300e+02   # C1
   1000025    -1.33969100e+02   # N3
   1000035     2.79925100e+02   # N4
   1000037     2.80319200e+02   # C2
   2000001     3.00010690e+03   # dR
   2000002     2.99978590e+03   # uR
   2000003     3.00010690e+03   # sR
   2000004     2.99978610e+03   # cR
   2000005     3.00297410e+03   # b2
   2000006     3.16333860e+03   # t2
   2000011     3.00032100e+03   # eR
   2000013     3.00032100e+03   # muR
   2000015     3.00038550e+03   # ta2
#===================================================================== ALPHA
Block ALPHA   # Effective Higgs mixing parameter
          -2.04551700e-02   # alpha_h
#===================================================================== STOPMIX
Block STOPMIX   # stop mixing matrix
  1  1     7.07389344e-01   # O_{11}
  1  2    -7.06824106e-01   # O_{12}
  2  1     7.06824106e-01   # O_{21}
  2  2     7.07389344e-01   # O_{22}
#===================================================================== SBOTMIX
Block SBOTMIX   # sbottom mixing matrix
  1  1     6.74135756e-01   # O_{11}
  1  2     7.38607462e-01   # O_{12}
  2  1    -7.38607462e-01   # O_{21}
  2  2     6.74135756e-01   # O_{22}
#===================================================================== STAUMIX
Block STAUMIX   # stau mixing matrix
  1  1    -4.32051034e-08   # O_{11}
  1  2     1.00000000e+00   # O_{12}
  2  1    -1.00000000e+00   # O_{21}
  2  2    -4.32051034e-08   # O_{22}
#===================================================================== NMIX
Block NMIX   # neutralino mixing matrix
  1  1     8.89812590e-01   # 
  1  2    -6.33207900e-02   # 
  1  3     4.24343410e-01   # 
  1  4    -1.55424760e-01   # 
  2  1    -4.17669980e-01   # 
  2  2    -3.42890740e-01   # 
  2  3     6.13889930e-01   # 
  2  4    -5.75427770e-01   # 
  3  1     1.71478390e-01   # 
  3  2    -1.49484040e-01   # 
  3  3    -6.48086970e-01   # 
  3  4    -7.26796510e-01   # 
  4  1     6.61861900e-02   # 
  4  2    -9.25241110e-01   # 
  4  3    -1.51839550e-01   # 
  4  4     3.41310980e-01   # 
#===================================================================== UMIX
Block UMIX   # chargino U mixing matrix
  1  1    -2.16252570e-01   # Umix_{11}
  1  2     9.76337430e-01   # Umix_{12}
  2  1    -9.76337430e-01   # Umix_{21}
  2  2    -2.16252570e-01   # Umix_{22}
#===================================================================== VMIX
Block VMIX   # chargino V mixing matrix
  1  1    -4.88629040e-01   # Vmix_{11}
  1  2     8.72491600e-01   # Vmix_{12}
  2  1    -8.72491600e-01   # Vmix_{21}
  2  2    -4.88629040e-01   # Vmix_{22}
#===================================================================== HMIX
Block HMIX  Q= 3.000e+03   # Higgs mixing parameters
     1     1.20000000e+02   # mu(Q)
     2     5.00000000e+01   # tan(beta)(M_{GUT})
     4     1.00000000e+06   # m_A^2(Q)
#===================================================================== MSOFT
Block MSOFT  Q=  3.000e+03   # DRbar SUSY breaking parameters
     1     5.00000000e+01   # M1
     2     2.50000000e+02   # M2
     3     3.00000000e+03   # not M3 but m(gluino) ...
    31     3.00000000e+03   # m_L1 (m_eL)
    32     3.00000000e+03   # m_L2 (m_muL)
    33     3.00000000e+03   # m_L3 (m_tauL)
    34     3.00000000e+03   # m_eR
    35     3.00000000e+03   # m_muR
    36     8.47000000e+01   # m_tauR
    41     3.00000000e+03   # m_Q1
    42     3.00000000e+03   # m_Q2
    43     3.00000000e+03   # m_Q3
    44     3.00000000e+03   # m_uR
    45     3.00000000e+03   # m_cR
    46     3.00000000e+03   # m_tR
    47     3.00000000e+03   # m_dR
    48     3.00000000e+03   # m_sR
    49     3.00000000e+03   # m_bR
#===================================================================== AU
Block AU  Q=  3.000e+03   #
  1  1     7.34850000e+03   # A_u
  2  2     7.34850000e+03   # A_c
  3  3     7.34850000e+03   # A_t
#===================================================================== AD
Block AD  Q=  3.000e+03   #
  1  1     0.00000000e+00   # A_d
  2  2     0.00000000e+00   # A_s
  3  3     0.00000000e+00   # A_b
#===================================================================== AE
Block AE  Q=  3.000e+03   #
  1  1     6.00000000e+03   # A_e
  2  2     6.00000000e+03   # A_mu
  3  3     6.00000000e+03   # A_tau
#=====================================================================
#
#----------------------------------------------------------------------
#           PDG      WIDTH     
DECAY   1000001  3.76954355e+01   # dL decays 
#          BR         NDA          ID1       ID2       ID3       ID4
      1.71580050e-02    2      1000022         1                       
      2.37065480e-02    2      1000023         1                       
      1.09208120e-02    2      1000025         1                       
      2.89292600e-01    2      1000035         1                       
      3.12590970e-02    2     -1000024         2                       
      6.27663020e-01    2     -1000037         2                       
#----------------------------------------------------------------------
#           PDG      WIDTH     
DECAY   1000002  3.77624785e+01   # uL decays 
#          BR         NDA          ID1       ID2       ID3       ID4
      3.32211000e-03    2      1000022         2                       
      5.86494770e-02    2      1000023         2                       
      4.64227330e-03    2      1000025         2                       
      2.73939100e-01    2      1000035         2                       
      1.59258220e-01    2      1000024         1                       
      5.00188770e-01    2      1000037         1                       
#----------------------------------------------------------------------
#           PDG      WIDTH     
DECAY   1000003  3.76954355e+01   # sL decays 
#          BR         NDA          ID1       ID2       ID3       ID4
      1.71580090e-02    2      1000022         3                       
      2.37065540e-02    2      1000023         3                       
      1.09208140e-02    2      1000025         3                       
      2.89292660e-01    2      1000035         3                       
      3.12590930e-02    2     -1000024         4                       
      6.27663020e-01    2     -1000037         4                       
#----------------------------------------------------------------------
#           PDG      WIDTH     
DECAY   1000004  3.77624785e+01   # cL decays 
#          BR         NDA          ID1       ID2       ID3       ID4
      3.32210910e-03    2      1000022         4                       
      5.86494650e-02    2      1000023         4                       
      4.64227330e-03    2      1000025         4                       
      2.73939070e-01    2      1000035         4                       
      1.59258250e-01    2      1000024         3                       
      5.00188830e-01    2      1000037         3                       
#----------------------------------------------------------------------
#           PDG      WIDTH     
DECAY   1000005  8.85963495e+01   # b1 decays 
#          BR         NDA          ID1       ID2       ID3       ID4
      1.33536380e-01    2      1000022         5                       
      1.64136100e-01    2      1000023         5                       
      1.23911030e-01    2      1000025         5                       
      3.13632230e-02    2      1000035         5                       
      4.04388990e-01    2     -1000024         6                       
      1.06102970e-01    2     -1000037         6                       
      3.65613330e-02    2          -24   1000006                       
#----------------------------------------------------------------------
#           PDG      WIDTH     
DECAY   1000006  8.62116390e+01   # t1 decays 
#          BR         NDA          ID1       ID2       ID3       ID4
      1.93652900e-02    2      1000022         6                       
      1.31398280e-01    2      1000023         6                       
      1.63529370e-01    2      1000025         6                       
      1.76025840e-01    2      1000035         6                       
      2.15291740e-01    2      1000024         5                       
      2.94389520e-01    2      1000037         5                       
#----------------------------------------------------------------------
#           PDG      WIDTH     
DECAY   2000001  1.69377252e+00   # dR decays 
#          BR         NDA          ID1       ID2       ID3       ID4
      7.92241510e-01    2      1000022         1                       
      1.74132870e-01    2      1000023         1                       
      2.93166750e-02    2      1000025         1                       
      4.30892970e-03    2      1000035         1                       
#----------------------------------------------------------------------
#           PDG      WIDTH     
DECAY   2000002  6.77439275e+00   # uR decays 
#          BR         NDA          ID1       ID2       ID3       ID4
      7.92241630e-01    2      1000022         2                       
      1.74132820e-01    2      1000023         2                       
      2.93166620e-02    2      1000025         2                       
      4.30891520e-03    2      1000035         2                       
#----------------------------------------------------------------------
#           PDG      WIDTH     
DECAY   2000003  1.69377252e+00   # sR decays 
#          BR         NDA          ID1       ID2       ID3       ID4
      7.92241510e-01    2      1000022         3                       
      1.74132870e-01    2      1000023         3                       
      2.93166750e-02    2      1000025         3                       
      4.30892970e-03    2      1000035         3                       
#----------------------------------------------------------------------
#           PDG      WIDTH     
DECAY   2000004  6.77439275e+00   # cR decays 
#          BR         NDA          ID1       ID2       ID3       ID4
      7.92241630e-01    2      1000022         4                       
      1.74132820e-01    2      1000023         4                       
      2.93166530e-02    2      1000025         4                       
      4.30891520e-03    2      1000035         4                       
#----------------------------------------------------------------------
#           PDG      WIDTH     
DECAY   2000005  9.33762715e+01   # b2 decays 
#          BR         NDA          ID1       ID2       ID3       ID4
      2.34473720e-02    2      1000022         5                       
      1.26184730e-01    2      1000023         5                       
      1.87115620e-01    2      1000025         5                       
      1.03415210e-01    2      1000035         5                       
      2.53507200e-01    2     -1000024         6                       
      2.59381620e-01    2     -1000037         6                       
      4.69483060e-02    2          -24   1000006                       
#----------------------------------------------------------------------
#           PDG      WIDTH     
DECAY   2000006  1.21848273e+02   # t2 decays 
#          BR         NDA          ID1       ID2       ID3       ID4
      3.90540900e-01    2      1000024         5                       
      1.58609820e-02    2      1000037         5                       
      1.47515760e-01    2           23   1000006                       
      2.71841660e-02    2           24   1000005                       
      2.87878200e-02    2           24   2000005                       
      4.66338880e-02    2      1000022         6                       
      1.26975630e-01    2      1000023         6                       
      1.95471030e-01    2      1000025         6                       
      2.10299550e-02    2      1000035         6                       
#----------------------------------------------------------------------
#           PDG      WIDTH     
DECAY   1000011  4.10964036e+01   # eL decays 
#          BR         NDA          ID1       ID2       ID3       ID4
      5.56797830e-02    2      1000022        11                       
      1.00424860e-01    2      1000023        11                       
      9.33876550e-04    2      1000025        11                       
      2.38592400e-01    2      1000035        11                       
      2.86711730e-02    2     -1000024        12                       
      5.75697900e-01    2     -1000037        12                       
#----------------------------------------------------------------------
#           PDG      WIDTH     
DECAY   1000012  4.11323585e+01   # snue decays 
#          BR         NDA          ID1       ID2       ID3       ID4
      9.36180430e-02    2      1000022        12                       
      3.93124250e-03    2      1000023        12                       
      1.81611390e-02    2      1000025        12                       
      2.78906520e-01    2      1000035        12                       
      1.46201860e-01    2      1000024        11                       
      4.59181130e-01    2      1000037        11                       
#----------------------------------------------------------------------
#           PDG      WIDTH     
DECAY   1000013  4.10964036e+01   # muL decays 
#          BR         NDA          ID1       ID2       ID3       ID4
      5.56797830e-02    2      1000022        13                       
      1.00424860e-01    2      1000023        13                       
      9.33876550e-04    2      1000025        13                       
      2.38592400e-01    2      1000035        13                       
      2.86711730e-02    2     -1000024        14                       
      5.75697900e-01    2     -1000037        14                       
#----------------------------------------------------------------------
#           PDG      WIDTH     
DECAY   1000014  4.11323585e+01   # snum decays 
#          BR         NDA          ID1       ID2       ID3       ID4
      9.36180430e-02    2      1000022        14                       
      3.93124250e-03    2      1000023        14                       
      1.81611390e-02    2      1000025        14                       
      2.78906520e-01    2      1000035        14                       
      1.46201860e-01    2      1000024        13                       
      4.59181130e-01    2      1000037        13                       
#----------------------------------------------------------------------
#           PDG      WIDTH     
DECAY   1000015  2.98300476e-01   # ta1 decays 
#          BR         NDA          ID1       ID2       ID3       ID4
      1.00000000e+00    2      1000022        15                       
#----------------------------------------------------------------------
#           PDG      WIDTH     
DECAY   1000016  1.10592110e+02   # snut decays 
#          BR         NDA          ID1       ID2       ID3       ID4
      3.48183660e-02    2      1000022        16                       
      1.46210540e-03    2      1000023        16                       
      6.75448030e-03    2      1000025        16                       
      1.03730750e-01    2      1000035        16                       
      1.82366700e-01    2      1000024        15                       
      1.76971330e-01    2      1000037        15                       
      4.93896280e-01    2           37   1000015                       
#----------------------------------------------------------------------
#           PDG      WIDTH     
DECAY   2000011  1.52449334e+01   # eR decays 
#          BR         NDA          ID1       ID2       ID3       ID4
      7.92241510e-01    2      1000022        11                       
      1.74132910e-01    2      1000023        11                       
      2.93166840e-02    2      1000025        11                       
      4.30894080e-03    2      1000035        11                       
#----------------------------------------------------------------------
#           PDG      WIDTH     
DECAY   2000013  1.52449334e+01   # muR decays 
#          BR         NDA          ID1       ID2       ID3       ID4
      7.92241510e-01    2      1000022        13                       
      1.74132910e-01    2      1000023        13                       
      2.93166840e-02    2      1000025        13                       
      4.30894080e-03    2      1000035        13                       
#----------------------------------------------------------------------
#           PDG      WIDTH     
DECAY   2000015  1.10657185e+02   # ta2 decays 
#          BR         NDA          ID1       ID2       ID3       ID4
      4.49036290e-02    2      1000022        15                       
      8.78692190e-02    2      1000023        15                       
      5.66482470e-02    2      1000025        15                       
      9.16611630e-02    2      1000035        15                       
      1.06479050e-02    2     -1000024        16                       
      2.13802780e-01    2     -1000037        16                       
      2.47438610e-01    2           36   1000015                       
      2.47028560e-01    2           35   1000015                       
#----------------------------------------------------------------------
#           PDG      WIDTH     
DECAY   1000021  3.02467717e+00   # gl decays 
#          BR         NDA          ID1       ID2       ID3       ID4
      6.33482120e-04    3      1000024         1        -2             
      6.33482120e-04    3     -1000024         2        -1             
      6.33482120e-04    3      1000024         3        -4             
      6.33482120e-04    3     -1000024         4        -3             
      1.22455240e-01    3      1000024         5        -6             
      1.22455240e-01    3     -1000024         6        -5             
      1.25347230e-02    3      1000037         1        -2             
      1.25347230e-02    3     -1000037         2        -1             
      1.25347230e-02    3      1000037         3        -4             
      1.25347230e-02    3     -1000037         4        -3             
      1.12876770e-01    3      1000037         5        -6             
      1.12876770e-01    3     -1000037         6        -5             
      8.56773400e-05    2      1000022        21                       
      2.17546660e-03    3      1000022         1        -1             
      2.17546660e-03    3      1000022         3        -3             
      1.88381600e-02    3      1000022         5        -5             
      1.32883000e-02    3      1000022         6        -6             
      5.02856220e-04    2      1000023        21                       
      1.31370920e-03    3      1000023         1        -1             
      1.31370920e-03    3      1000023         3        -3             
      3.60595920e-02    3      1000023         5        -5             
      9.14771710e-02    3      1000023         6        -6             
      8.49219100e-04    2      1000025        21                       
      4.80238260e-04    3      1000025         1        -1             
      4.80238260e-04    3      1000025         3        -3             
      3.91232970e-02    3      1000025         5        -5             
      1.17395950e-01    3      1000025         6        -6             
      5.24295970e-05    2      1000035        21                       
      1.22819500e-02    3      1000035         1        -1             
      1.22819500e-02    3      1000035         3        -3             
      1.42523970e-02    3      1000035         5        -5             
      1.12235280e-01    3      1000035         6        -6             
#----------------------------------------------------------------------
#           PDG      WIDTH     
DECAY   1000023  2.22364865e-02   # N2 decays 
#          BR         NDA          ID1       ID2       ID3       ID4
      5.21013160e-04    3      1000022         2        -2             
      6.71483170e-04    3      1000022         1        -1             
      6.71483170e-04    3      1000022         3        -3             
      5.21013160e-04    3      1000022         4        -4             
      6.48595680e-04    3      1000022         5        -5             
      1.51715460e-04    3      1000022        11       -11             
      1.51715460e-04    3      1000022        13       -13             
      1.51561280e-04    3      1000022        15       -15             
      3.02879140e-04    3      1000022        12       -12             
      3.02879140e-04    3      1000022        14       -14             
      3.02879140e-04    3      1000022        16       -16             
      4.97801420e-01    2      1000015       -15                       
      4.97801420e-01    2     -1000015        15                       
#----------------------------------------------------------------------
#           PDG      WIDTH     
DECAY   1000025  7.63519941e-02   # N3 decays 
#          BR         NDA          ID1       ID2       ID3       ID4
      6.73503750e-05    3     -1000024         2        -1             
      2.24501250e-05    3     -1000024        12       -11             
      2.24501250e-05    3     -1000024        14       -13             
      6.73503750e-05    3      1000024         1        -2             
      2.24501250e-05    3      1000024        11       -12             
      2.24501250e-05    3      1000024        13       -14             
      6.73503750e-05    3     -1000024         4        -3             
      2.24501250e-05    3     -1000024        16       -15             
      6.73503750e-05    3      1000024         3        -4             
      2.24501250e-05    3      1000024        15       -16             
      4.36816640e-03    2      1000022        23                       
      4.97613880e-01    2      1000015       -15                       
      4.97613880e-01    2     -1000015        15                       
#----------------------------------------------------------------------
#           PDG      WIDTH     
DECAY   1000035  1.43283192e+00   # N4 decays 
#          BR         NDA          ID1       ID2       ID3       ID4
      3.42067420e-01    2      1000024       -24                       
      3.42067420e-01    2     -1000024        24                       
      6.44046760e-04    2      1000022        23                       
      3.90447190e-02    2      1000023        23                       
      1.41476660e-01    2      1000025        23                       
      3.77196350e-04    2      1000022        25                       
      1.09010900e-01    2      1000023        25                       
      4.61891810e-03    2      1000025        25                       
      1.03463550e-02    2      1000015       -15                       
      1.03463550e-02    2     -1000015        15                       
#----------------------------------------------------------------------
#           PDG      WIDTH     
DECAY   1000024  1.01734211e-02   # C1 decays 
#          BR         NDA          ID1       ID2       ID3       ID4
      8.60316310e-03    3      1000022         2        -1             
      8.60316310e-03    3      1000022         4        -3             
      2.86690120e-03    3      1000022       -11        12             
      2.86690120e-03    3      1000022       -13        14             
      2.86693170e-03    3      1000022       -15        16             
      9.74192980e-01    2     -1000015        16                       
#----------------------------------------------------------------------
#           PDG      WIDTH     
DECAY   1000037  1.38752451e+00   # C2 decays 
#          BR         NDA          ID1       ID2       ID3       ID4
      1.17836210e-04    2      1000022        24                       
      3.28610990e-01    2      1000023        24                       
      2.41706820e-01    2      1000025        24                       
      1.83734500e-02    2     -1000015        16                       
      2.69562750e-01    2      1000024        23                       
      1.41628180e-01    2      1000024        25                       
#----------------------------------------------------------------------
#           PDG      WIDTH     
DECAY        25  8.27581004e-03   # h decays 
#          BR         NDA          ID1       ID2       ID3       ID4
      1.11691740e-04    2           13       -13                       
      3.19503960e-02    2           15       -15                       
      1.34016760e-03    2            3        -3                       
      4.35103890e-01    2            5        -5                       
      1.88956670e-02    2            4        -4                       
      1.23129200e-03    2           22        22                       
      2.38524560e-02    2           21        21                       
      4.11700220e-03    3           24        11       -12             
      4.11700220e-03    3           24        13       -14             
      4.11700220e-03    3           24        15       -16             
      1.23510070e-02    3           24        -2         1             
      1.23510070e-02    3           24        -4         3             
      4.11700220e-03    3          -24       -11        12             
      4.11700220e-03    3          -24       -13        14             
      4.11700220e-03    3          -24       -15        16             
      1.23510070e-02    3          -24         2        -1             
      1.23510070e-02    3          -24         4        -3             
      5.33991670e-04    3           23        12       -12             
      5.33991670e-04    3           23        14       -14             
      5.33991670e-04    3           23        16       -16             
      2.68752690e-04    3           23        11       -11             
      2.68752690e-04    3           23        13       -13             
      2.68752690e-04    3           23        15       -15             
      9.20723890e-04    3           23         2        -2             
      9.20723890e-04    3           23         4        -4             
      1.18611920e-03    3           23         1        -1             
      1.18611920e-03    3           23         3        -3             
      1.18611920e-03    3           23         5        -5             
      4.05600610e-01    2      1000022   1000022                       
#----------------------------------------------------------------------
#           PDG      WIDTH     
DECAY        35  6.96397397e+01   # H decays 
#          BR         NDA          ID1       ID2       ID3       ID4
      2.59272200e-04    2           13       -13                       
      7.42581490e-02    2           15       -15                       
      3.03943570e-03    2            3        -3                       
      7.49532040e-01    2            5        -5                       
      2.58863060e-04    2            6        -6                       
      6.51493620e-03    2      1000022   1000022                       
      8.46917830e-03    2      1000022   1000023                       
      4.10725550e-03    2      1000022   1000025                       
      5.30906580e-03    2      1000022   1000035                       
      5.24700740e-04    2      1000023   1000023                       
      3.02291130e-04    2      1000023   1000025                       
      1.48280420e-02    2      1000023   1000035                       
      2.84429170e-03    2      1000025   1000025                       
      2.43083670e-02    2      1000025   1000035                       
      1.35466540e-03    2      1000035   1000035                       
      2.54414900e-02    2      1000024  -1000024                       
      2.23067540e-03    2      1000037  -1000037                       
      3.82086630e-02    2      1000024  -1000037                       
      3.82086630e-02    2     -1000024   1000037                       
#----------------------------------------------------------------------
#           PDG      WIDTH     
DECAY        36  6.92040795e+01   # A decays 
#          BR         NDA          ID1       ID2       ID3       ID4
      2.59199090e-04    2           13       -13                       
      7.42381220e-02    2           15       -15                       
      3.03874370e-03    2            3        -3                       
      7.49976100e-01    2            5        -5                       
      2.74956080e-04    2            6        -6                       
      1.06591670e-05    2           21        21                       
      6.75545770e-03    2      1000022   1000022                       
      9.25190000e-03    2      1000022   1000023                       
      3.48880960e-03    2      1000022   1000025                       
      5.51621940e-03    2      1000022   1000035                       
      5.95280900e-04    2      1000023   1000023                       
      3.59801230e-04    2      1000023   1000025                       
      1.82393810e-02    2      1000023   1000035                       
      2.79346180e-03    2      1000025   1000025                       
      1.90475360e-02    2      1000025   1000035                       
      2.34554940e-03    2      1000035   1000035                       
      2.74744030e-02    2      1000024  -1000024                       
      3.95628390e-03    2      1000037  -1000037                       
      3.61891310e-02    2      1000024  -1000037                       
      3.61891310e-02    2     -1000024   1000037                       
#----------------------------------------------------------------------
#           PDG      WIDTH     
DECAY        37  6.27873700e+01   # H+ decays 
#          BR         NDA          ID1       ID2       ID3       ID4
      2.88909420e-04    2           14       -13                       
      8.27475710e-02    2           16       -15                       
      3.11321930e-03    2            4        -3                       
      7.23496320e-01    2            6        -5                       
      1.96632440e-02    2      1000024   1000022                       
      8.90567060e-03    2      1000024   1000023                       
      4.07751600e-03    2      1000024   1000025                       
      4.72138150e-02    2      1000024   1000035                       
      1.40282300e-02    2      1000037   1000022                       
      5.31036290e-02    2      1000037   1000023                       
      4.33475450e-02    2      1000037   1000025                       
      1.44390520e-05    2      1000037   1000035                       
#----------------------------------------------------------------------
#           PDG      WIDTH     
DECAY         6  1.14678979e+00   # t decays 
#          BR         NDA          ID1       ID2       ID3       ID4
      3.33333340e-01    3            2        -1         5             
      3.33333340e-01    3            4        -3         5             
      1.11111110e-01    3           12       -11         5             
      1.11111110e-01    3           14       -13         5             
      1.11111110e-01    3           16       -15         5             
