#
#                              ======================
#                              | THE SUSYHIT OUTPUT |
#                              ======================
#
#
#              ------------------------------------------------------
#              |     This is the output of the SUSY-HIT package     |
#              |  created by A.Djouadi, M.Muehlleitner and M.Spira. |
#              |  In case of problems with SUSY-HIT email to        |
#              |           margarete.muehlleitner@cern.ch           |
#              |           michael.spira@psi.ch                     |
#              |           abdelhak.djouadi@cern.ch                 |
#              ------------------------------------------------------
#
#              ------------------------------------------------------
#              |  SUSY Les Houches Accord - MSSM Spectrum + Decays  |
#              |              based on the decay programs           |
#              |                                                    |
#              |                     SDECAY 1.3b                    |
#              |                                                    |
#              |  Authors: M.Muhlleitner, A.Djouadi and Y.Mambrini  |
#              |  Ref.:    Comput.Phys.Commun.168(2005)46           |
#              |           [hep-ph/0311167]                         |
#              |                                                    |
#              |                     HDECAY 3.4                     |
#              |                                                    |
#              |  By: A.Djouadi,J.Kalinowski,M.Muhlleitner,M.Spira  |
#              |  Ref.:    Comput.Phys.Commun.108(1998)56           |
#              |           [hep-ph/9704448]                         |
#              |                                                    |
#              |                                                    |
#              |  If not stated otherwise all DRbar couplings and   |
#              |  soft SUSY breaking masses are given at the scale  |
#              |  Q=  0.37311970E+04
#              |                                                    |
#              ------------------------------------------------------
#
#
BLOCK DCINFO  # Decay Program information
     1   SDECAY/HDECAY # decay calculator
     2   1.3b  /3.4    # version number
#
BLOCK SPINFO  # Spectrum calculator information
     1     SOFTSUSY    # spectrum calculator               
     2     3.4.0       # version number                    
#
BLOCK MODSEL  # Model selection
     1     0   #  nonUniversal                                     
#
BLOCK SMINPUTS  # Standard Model inputs
         1     1.27908970E+02   # alpha_em^-1(M_Z)^MSbar
         2     1.16637870E-05   # G_F [GeV^-2]
         3     1.18400000E-01   # alpha_S(M_Z)^MSbar
         4     9.11876000E+01   # M_Z pole mass
         5     4.18000000E+00   # mb(mb)^MSbar
         6     1.73200000E+02   # mt pole mass
         7     1.77700000E+00   # mtau pole mass
#
BLOCK MINPAR  # Input parameters - minimal models
         3     2.30700000E+01   # tanb                
#
BLOCK EXTPAR  # Input parameters - non-minimal models
         0    -1.00000000E+00   # Set                 
         1    -6.21300000E+02   # M_1(MX)             
         2     3.84575000E+03   # M_2(MX)             
         3     1.37062000E+03   # M_3(MX)             
        11    -4.09540000E+03   # At(MX)              
        12    -1.74120000E+03   # Ab(MX)              
        13    -3.05947000E+03   # Atau(MX)            
        23     9.44650000E+02   # mu(MX)              
        26     1.62645000E+03   # mA(pole)            
        31     7.35000000E+02   # meL(MX)             
        32     7.35000000E+02   # mmuL(MX)            
        33     2.92756000E+03   # mtauL(MX)           
        34     1.88930000E+03   # meR(MX)             
        35     1.88930000E+03   # mmuR(MX)            
        36     3.70539000E+03   # mtauR(MX)           
        41     2.18464000E+03   # mqL1(MX)            
        42     2.18464000E+03   # mqL2(MX)            
        43     3.67892000E+03   # mqL3(MX)            
        44     3.85120000E+02   # muR(MX)             
        45     3.85120000E+02   # mcR(MX)             
        46     3.78273000E+03   # mtR(MX)             
        47     3.41430000E+03   # mdR(MX)             
        48     3.41430000E+03   # msR(MX)             
        49     7.08330000E+02   # mbR(MX)             
#
BLOCK MASS  # Mass Spectrum
# PDG code           mass       particle
        24     8.03937490E+01   # W+
        25     1.25292620E+02   # h
        35     1.62647322E+03   # H
        36     1.62645000E+03   # A
        37     1.62849055E+03   # H+
         5     4.81876030E+00   # b-quark pole mass calculated from mb(mb)_Msbar
   1000001     2.27786330E+03   # ~d_L
   2000001     3.45687629E+03   # ~d_R
   1000002     2.27665063E+03   # ~u_L
   2000002     6.18950690E+02   # ~u_R
   1000003     2.27786330E+03   # ~s_L
   2000003     3.45687629E+03   # ~s_R
   1000004     2.27665063E+03   # ~c_L
   2000004     6.18950690E+02   # ~c_R
   1000005     8.39152556E+02   # ~b_1
   2000005     3.70840982E+03   # ~b_2
   1000006     3.64781212E+03   # ~t_1
   2000006     3.80996679E+03   # ~t_2
   1000011     8.23350730E+02   # ~e_L
   2000011     1.88362041E+03   # ~e_R
   1000012     8.19348815E+02   # ~nu_eL
   1000013     8.23350730E+02   # ~mu_L
   2000013     1.88362041E+03   # ~mu_R
   1000014     8.19348815E+02   # ~nu_muL
   1000015     2.96165001E+03   # ~tau_1
   2000015     3.69880919E+03   # ~tau_2
   1000016     2.96034572E+03   # ~nu_tauL
   1000021     1.56416791E+03   # ~g
   1000022    -6.03353811E+02   # ~chi_10
   1000023     9.77928868E+02   # ~chi_20
   1000025    -9.81496880E+02   # ~chi_30
   1000035     3.79785737E+03   # ~chi_40
   1000024     9.78208580E+02   # ~chi_1+
   1000037     3.79801734E+03   # ~chi_2+
#
BLOCK NMIX  # Neutralino Mixing Matrix
  1  1     9.96664389E-01   # N_11
  1  2     6.77063184E-04   # N_12
  1  3     7.03242838E-02   # N_13
  1  4     4.14020934E-02   # N_14
  2  1     2.05178310E-02   # N_21
  2  2     2.02673501E-02   # N_22
  2  3    -7.06996510E-01   # N_23
  2  4     7.06628748E-01   # N_24
  3  1    -7.89877574E-02   # N_31
  3  2     1.09940964E-02   # N_32
  3  3     7.03681441E-01   # N_33
  3  4     7.06025845E-01   # N_34
  4  1    -2.22306962E-04   # N_41
  4  2     9.99733918E-01   # N_42
  4  3     6.54673220E-03   # N_43
  4  4    -2.21175254E-02   # N_44
#
BLOCK UMIX  # Chargino Mixing Matrix U
  1  1    -9.30218895E-03   # U_11
  1  2     9.99956734E-01   # U_12
  2  1    -9.99956734E-01   # U_21
  2  2    -9.30218895E-03   # U_22
#
BLOCK VMIX  # Chargino Mixing Matrix V
  1  1    -3.13590691E-02   # V_11
  1  2     9.99508183E-01   # V_12
  2  1    -9.99508183E-01   # V_21
  2  2    -3.13590691E-02   # V_22
#
BLOCK STOPMIX  # Stop Mixing Matrix
  1  1     7.81793717E-01   # cos(theta_t)
  1  2     6.23537155E-01   # sin(theta_t)
  2  1    -6.23537155E-01   # -sin(theta_t)
  2  2     7.81793717E-01   # cos(theta_t)
#
BLOCK SBOTMIX  # Sbottom Mixing Matrix
  1  1     3.85100687E-03   # cos(theta_b)
  1  2     9.99992585E-01   # sin(theta_b)
  2  1    -9.99992585E-01   # -sin(theta_b)
  2  2     3.85100687E-03   # cos(theta_b)
#
BLOCK STAUMIX  # Stau Mixing Matrix
  1  1     9.99959782E-01   # cos(theta_tau)
  1  2     8.96852176E-03   # sin(theta_tau)
  2  1    -8.96852176E-03   # -sin(theta_tau)
  2  2     9.99959782E-01   # cos(theta_tau)
#
BLOCK ALPHA  # Higgs mixing
          -4.56107297E-02   # Mixing angle in the neutral Higgs boson sector
#
BLOCK HMIX Q=  3.73119700E+03  # DRbar Higgs Parameters
         1     9.60951585E+02   # mu(Q)MSSM           
         2     2.20934681E+01   # tan                 
         3     2.42669985E+02   # higgs               
         4     3.02543390E+06   # mA^2(Q)MSSM         
#
BLOCK GAUGE Q=  3.73119700E+03  # The gauge couplings
     1     3.66118959E-01   # gprime(Q) DRbar
     2     6.36425682E-01   # g(Q) DRbar
     3     1.02078094E+00   # g3(Q) DRbar
#
BLOCK AU Q=  3.73119700E+03  # The trilinear couplings
  1  1     0.00000000E+00   # A_u(Q) DRbar
  2  2     0.00000000E+00   # A_c(Q) DRbar
  3  3    -4.09539999E+03   # A_t(Q) DRbar
#
BLOCK AD Q=  3.73119700E+03  # The trilinear couplings
  1  1     0.00000000E+00   # A_d(Q) DRbar
  2  2     0.00000000E+00   # A_s(Q) DRbar
  3  3    -1.74119999E+03   # A_b(Q) DRbar
#
BLOCK AE Q=  3.73119700E+03  # The trilinear couplings
  1  1     0.00000000E+00   # A_e(Q) DRbar
  2  2     0.00000000E+00   # A_mu(Q) DRbar
  3  3    -3.05947000E+03   # A_tau(Q) DRbar
#
BLOCK Yu Q=  3.73119700E+03  # The Yukawa couplings
  1  1     0.00000000E+00   # y_u(Q) DRbar
  2  2     0.00000000E+00   # y_c(Q) DRbar
  3  3     8.11731115E-01   # y_t(Q) DRbar
#
BLOCK Yd Q=  3.73119700E+03  # The Yukawa couplings
  1  1     0.00000000E+00   # y_d(Q) DRbar
  2  2     0.00000000E+00   # y_s(Q) DRbar
  3  3     2.82797172E-01   # y_b(Q) DRbar
#
BLOCK Ye Q=  3.73119700E+03  # The Yukawa couplings
  1  1     0.00000000E+00   # y_e(Q) DRbar
  2  2     0.00000000E+00   # y_mu(Q) DRbar
  3  3     2.31450198E-01   # y_tau(Q) DRbar
#
BLOCK MSOFT Q=  3.73119700E+03  # The soft SUSY breaking masses at the scale Q
         1    -6.21300000E+02   # M_1(Q)              
         2     3.84575000E+03   # M_2(Q)              
         3     1.37062000E+03   # M_3(Q)              
        21     1.61244366E+06   # mH1^2(Q)            
        22    -6.64177588E+05   # mH2^2(Q)            
        31     7.35000000E+02   # meL(Q)              
        32     7.35000000E+02   # mmuL(Q)             
        33     2.92756000E+03   # mtauL(Q)            
        34     1.88930000E+03   # meR(Q)              
        35     1.88930000E+03   # mmuR(Q)             
        36     3.70539000E+03   # mtauR(Q)            
        41     2.18464000E+03   # mqL1(Q)             
        42     2.18464000E+03   # mqL2(Q)             
        43     3.67891999E+03   # mqL3(Q)             
        44     3.85119975E+02   # muR(Q)              
        45     3.85119975E+02   # mcR(Q)              
        46     3.78272999E+03   # mtR(Q)              
        47     3.41430000E+03   # mdR(Q)              
        48     3.41430000E+03   # msR(Q)              
        49     7.08329983E+02   # mbR(Q)              
#
Block HiggsBoundsInputHiggsCouplingsFermions
# ScalarNormEffCoupSq PseudoSNormEffCoupSq NP   IP1 IP2 IP2
    1.01683261E+00    0.00000000E+00        3  25   5   5  # h0-b-b eff. coupling^2, normalised to SM
    4.88104500E+02    0.00000000E+00        3  35   5   5  # H0-b-b eff. coupling^2, normalised to SM
    0.00000000E+00    4.88121333E+02        3  36   5   5  # A0-b-b eff. coupling^2, normalised to SM
#
    9.99965516E-01    0.00000000E+00        3  25   6   6  # h0-t-t eff. coupling^2, normalised to SM
    2.08315544E-03    0.00000000E+00        3  35   6   6  # H0-t-t eff. coupling^2, normalised to SM
    0.00000000E+00    2.04867096E-03        3  36   6   6  # A0-t-t eff. coupling^2, normalised to SM
#
    1.01683261E+00    0.00000000E+00        3  25  15  15  # h0-tau-tau eff. coupling^2, normalised to SM
    4.88104500E+02    0.00000000E+00        3  35  15  15  # H0-tau-tau eff. coupling^2, normalised to SM
    0.00000000E+00    4.88121333E+02        3  36  15  15  # A0-tau-tau eff. coupling^2, normalised to SM
#
Block HiggsBoundsInputHiggsCouplingsBosons
    9.99999856E-01        3  25  24  24  # h0-W-W eff. coupling^2, normalised to SM
    1.43909735E-07        3  35  24  24  # H0-W-W eff. coupling^2, normalised to SM
    0.00000000E+00        3  36  24  24  # A0-W-W eff. coupling^2, normalised to SM
#
    9.99999856E-01        3  25  23  23  # h0-Z-Z eff. coupling^2, normalised to SM
    1.43909735E-07        3  35  23  23  # H0-Z-Z eff. coupling^2, normalised to SM
    0.00000000E+00        3  36  23  23  # A0-Z-Z eff. coupling^2, normalised to SM
#
    8.82889598E-01        3  25  21  21  # h0-g-g eff. coupling^2, normalised to SM
    1.28774391E-10        3  35  21  21  # H0-g-g eff. coupling^2, normalised to SM
    2.02618640E-09        3  36  21  21  # A0-g-g eff. coupling^2, normalised to SM
#
    0.00000000E+00        3  25  25  23  # h0-h0-Z eff. coupling^2, normalised to SM
    0.00000000E+00        3  35  25  23  # H0-h0-Z eff. coupling^2, normalised to SM
    1.43909735E-07        3  36  25  23  # A0-h0-Z eff. coupling^2, normalised to SM
    0.00000000E+00        3  35  35  23  # H0-H0-Z eff. coupling^2, normalised to SM
    9.99999856E-01        3  36  35  23  # A0-H0-Z eff. coupling^2, normalised to SM
    0.00000000E+00        3  36  36  23  # A0-A0-Z eff. coupling^2, normalised to SM
#
    0.00000000E+00        4  25  21  21  23  # h0-g-g-Z eff. coupling^2, normalised to SM
    0.00000000E+00        4  35  21  21  23  # H0-g-g-Z eff. coupling^2, normalised to SM
    0.00000000E+00        4  36  21  21  23  # A0-g-g-Z eff. coupling^2, normalised to SM
#
#
#
#                             =================
#                             |The decay table|
#                             =================
#
# - The QCD corrections to the decays gluino -> squark  + quark
#                                     squark -> gaugino + quark_prime
#                                     squark -> squark_prime + Higgs
#                                     squark -> gluino  + quark
#   are included.
#
# - The multi-body decays for the inos, stops and sbottoms are included.
#
# - The loop induced decays for the gluino, neutralinos and stops
#   are included.
#
# - The SUSY decays of the top quark are included.
#
#
#         PDG            Width
DECAY         6     1.42631226E+00   # top decays
#          BR         NDA      ID1       ID2
     1.00000000E+00    2           5        24   # BR(t ->  b    W+)
#
#         PDG            Width
DECAY   1000021     6.24166340E+01   # gluino decays
#          BR         NDA      ID1       ID2
     1.77373334E-01    2     2000002        -2   # BR(~g -> ~u_R  ub)
     1.77373334E-01    2    -2000002         2   # BR(~g -> ~u_R* u )
     1.77373249E-01    2     2000004        -4   # BR(~g -> ~c_R  cb)
     1.77373249E-01    2    -2000004         4   # BR(~g -> ~c_R* c )
     1.45253417E-01    2     1000005        -5   # BR(~g -> ~b_1  bb)
     1.45253417E-01    2    -1000005         5   # BR(~g -> ~b_1* b )
#
#         PDG            Width
DECAY   1000006     2.05496656E+02   # stop1 decays
#          BR         NDA      ID1       ID2
     1.42031342E-02    2     1000022         6   # BR(~t_1 -> ~chi_10 t )
     9.75315026E-02    2     1000023         6   # BR(~t_1 -> ~chi_20 t )
     1.06421968E-01    2     1000025         6   # BR(~t_1 -> ~chi_30 t )
     9.75395279E-02    2     1000024         5   # BR(~t_1 -> ~chi_1+ b )
     6.80849366E-01    2     1000021         6   # BR(~t_1 -> ~g      t )
     2.32263830E-03    2     1000005        37   # BR(~t_1 -> ~b_1    H+)
     1.13186314E-03    2     1000005        24   # BR(~t_1 -> ~b_1    W+)
#
#         PDG            Width
DECAY   2000006     2.16870527E+02   # stop2 decays
#          BR         NDA      ID1       ID2
     2.81288746E-02    2     1000022         6   # BR(~t_2 -> ~chi_10 t )
     1.01676846E-01    2     1000023         6   # BR(~t_2 -> ~chi_20 t )
     9.31224943E-02    2     1000025         6   # BR(~t_2 -> ~chi_30 t )
     1.27447606E-01    2     1000024         5   # BR(~t_2 -> ~chi_1+ b )
     2.18297051E-06    2     1000037         5   # BR(~t_2 -> ~chi_2+ b )
     6.38072668E-01    2     1000021         6   # BR(~t_2 -> ~g      t )
     3.47577899E-04    2     1000006        25   # BR(~t_2 -> ~t_1    h )
     1.97504214E-03    2     1000005        37   # BR(~t_2 -> ~b_1    H+)
     6.38668111E-03    2     1000006        23   # BR(~t_2 -> ~t_1    Z )
     7.88363763E-04    2     1000005        24   # BR(~t_2 -> ~b_1    W+)
     2.05166365E-03    2     2000005        24   # BR(~t_2 -> ~b_2    W+)
#
#         PDG            Width
DECAY   1000005     1.17377168E-01   # sbottom1 decays
#          BR         NDA      ID1       ID2
     1.00000000E+00    2     1000022         5   # BR(~b_1 -> ~chi_10 b )
#
#         PDG            Width
DECAY   2000005     1.87321230E+02   # sbottom2 decays
#          BR         NDA      ID1       ID2
     2.87522176E-03    2     1000022         5   # BR(~b_2 -> ~chi_10 b )
     1.36461598E-02    2     1000023         5   # BR(~b_2 -> ~chi_20 b )
     1.35472608E-02    2     1000025         5   # BR(~b_2 -> ~chi_30 b )
     2.23236607E-01    2    -1000024         6   # BR(~b_2 -> ~chi_1- t )
     7.39606510E-01    2     1000021         5   # BR(~b_2 -> ~g      b )
     1.17114233E-03    2     1000005        25   # BR(~b_2 -> ~b_1    h )
     2.40315995E-03    2     1000005        35   # BR(~b_2 -> ~b_1    H )
     2.40433297E-03    2     1000005        36   # BR(~b_2 -> ~b_1    A )
     1.10960537E-03    2     1000005        23   # BR(~b_2 -> ~b_1    Z )
#
#         PDG            Width
DECAY   1000002     4.92024271E+01   # sup_L decays
#          BR         NDA      ID1       ID2
     5.69036981E-03    2     1000022         2   # BR(~u_L -> ~chi_10 u)
     6.99191993E-05    2     1000023         2   # BR(~u_L -> ~chi_20 u)
     2.05155406E-06    2     1000025         2   # BR(~u_L -> ~chi_30 u)
     2.34717761E-04    2     1000024         1   # BR(~u_L -> ~chi_1+ d)
     9.94002942E-01    2     1000021         2   # BR(~u_L -> ~g      u)
#
#         PDG            Width
DECAY   2000002     4.05646532E-03   # sup_R decays
#          BR         NDA      ID1       ID2
     1.00000000E+00    2     1000022         2   # BR(~u_R -> ~chi_10 u)
#
#         PDG            Width
DECAY   1000001     4.93094172E+01   # sdown_L decays
#          BR         NDA      ID1       ID2
     5.60208091E-03    2     1000022         1   # BR(~d_L -> ~chi_10 d)
     3.18073555E-05    2     1000023         1   # BR(~d_L -> ~chi_20 d)
     8.12105409E-05    2     1000025         1   # BR(~d_L -> ~chi_30 d)
     2.06295847E-05    2    -1000024         2   # BR(~d_L -> ~chi_1- u)
     9.94264272E-01    2     1000021         1   # BR(~d_L -> ~g      d)
#
#         PDG            Width
DECAY   2000001     1.70349575E+02   # sdown_R decays
#          BR         NDA      ID1       ID2
     1.08576094E-02    2     1000022         1   # BR(~d_R -> ~chi_10 d)
     4.14652281E-06    2     1000023         1   # BR(~d_R -> ~chi_20 d)
     6.13749927E-05    2     1000025         1   # BR(~d_R -> ~chi_30 d)
     9.89076869E-01    2     1000021         1   # BR(~d_R -> ~g      d)
#
#         PDG            Width
DECAY   1000004     3.53881599E+01   # scharm_L decays
#          BR         NDA      ID1       ID2
     8.24244882E-03    2     1000022         4   # BR(~c_L -> ~chi_10 c)
     1.00963713E-04    2     1000023         4   # BR(~c_L -> ~chi_20 c)
     2.96235131E-06    2     1000025         4   # BR(~c_L -> ~chi_30 c)
     3.38933293E-04    2     1000024         3   # BR(~c_L -> ~chi_1+ s)
     9.91314692E-01    2     1000021         4   # BR(~c_L -> ~g      c)
#
#         PDG            Width
DECAY   2000004     3.58994969E-03   # scharm_R decays
#          BR         NDA      ID1       ID2
     1.00000000E+00    2     1000022         4   # BR(~c_R -> ~chi_10 c)
#
#         PDG            Width
DECAY   1000003     3.54610780E+01   # sstrange_L decays
#          BR         NDA      ID1       ID2
     8.11539547E-03    2     1000022         3   # BR(~s_L -> ~chi_10 s)
     4.59349406E-05    2     1000023         3   # BR(~s_L -> ~chi_20 s)
     1.17276976E-04    2     1000025         3   # BR(~s_L -> ~chi_30 s)
     2.97923326E-05    2    -1000024         4   # BR(~s_L -> ~chi_1- c)
     9.91691600E-01    2     1000021         3   # BR(~s_L -> ~g      s)
#
#         PDG            Width
DECAY   2000003     1.22780276E+02   # sstrange_R decays
#          BR         NDA      ID1       ID2
     1.55791486E-02    2     1000022         3   # BR(~s_R -> ~chi_10 s)
     5.94468114E-06    2     1000023         3   # BR(~s_R -> ~chi_20 s)
     8.79898735E-05    2     1000025         3   # BR(~s_R -> ~chi_30 s)
     9.84326917E-01    2     1000021         3   # BR(~s_R -> ~g      s)
#
#         PDG            Width
DECAY   1000011     2.34322624E-01   # selectron_L decays
#          BR         NDA      ID1       ID2
     1.00000000E+00    2     1000022        11   # BR(~e_L -> ~chi_10 e-)
#
#         PDG            Width
DECAY   2000011     8.07199633E+00   # selectron_R decays
#          BR         NDA      ID1       ID2
     9.95599660E-01    2     1000022        11   # BR(~e_R -> ~chi_10 e-)
     2.79556400E-04    2     1000023        11   # BR(~e_R -> ~chi_20 e-)
     4.12078408E-03    2     1000025        11   # BR(~e_R -> ~chi_30 e-)
#
#         PDG            Width
DECAY   1000013     2.34322588E-01   # smuon_L decays
#          BR         NDA      ID1       ID2
     1.00000000E+00    2     1000022        13   # BR(~mu_L -> ~chi_10 mu-)
#
#         PDG            Width
DECAY   2000013     8.07199627E+00   # smuon_R decays
#          BR         NDA      ID1       ID2
     9.95599660E-01    2     1000022        13   # BR(~mu_R -> ~chi_10 mu-)
     2.79556398E-04    2     1000023        13   # BR(~mu_R -> ~chi_20 mu-)
     4.12078406E-03    2     1000025        13   # BR(~mu_R -> ~chi_30 mu-)
#
#         PDG            Width
DECAY   1000015     6.14328695E+00   # stau_1 decays
#          BR         NDA      ID1       ID2
     5.91120729E-01    2     1000022        15   # BR(~tau_1 -> ~chi_10  tau-)
     2.05516253E-01    2     1000023        15   # BR(~tau_1 -> ~chi_20  tau-)
     2.02876354E-01    2     1000025        15   # BR(~tau_1 -> ~chi_30  tau-)
     4.86663998E-04    2    -1000024        16   # BR(~tau_1 -> ~chi_1-  nu_tau)
#
#         PDG            Width
DECAY   2000015     2.57319719E+01   # stau_2 decays
#          BR         NDA      ID1       ID2
     7.22028480E-01    2     1000022        15   # BR(~tau_2 -> ~chi_10  tau-)
     6.64950506E-02    2     1000023        15   # BR(~tau_2 -> ~chi_20  tau-)
     6.98559509E-02    2     1000025        15   # BR(~tau_2 -> ~chi_30  tau-)
     1.32428731E-01    2    -1000024        16   # BR(~tau_2 -> ~chi_1-  nu_tau)
     4.49693276E-03    2     1000016       -24   # BR(~tau_2 -> ~nu_tauL W-)
     2.39219810E-03    2     1000015        25   # BR(~tau_2 -> ~tau_1   h)
     2.30265643E-03    2     1000015        23   # BR(~tau_2 -> ~tau_1   Z)
#
#         PDG            Width
DECAY   1000012     2.26842984E-01   # snu_eL decays
#          BR         NDA      ID1       ID2
     1.00000000E+00    2     1000022        12   # BR(~nu_eL -> ~chi_10 nu_e)
#
#         PDG            Width
DECAY   1000014     2.26842984E-01   # snu_muL decays
#          BR         NDA      ID1       ID2
     1.00000000E+00    2     1000022        14   # BR(~nu_muL -> ~chi_10 nu_mu)
#
#         PDG            Width
DECAY   1000016     6.14595484E+00   # snu_tauL decays
#          BR         NDA      ID1       ID2
     5.84679470E-01    2     1000022        16   # BR(~nu_tauL -> ~chi_10 nu_tau)
     1.10339303E-04    2     1000023        16   # BR(~nu_tauL -> ~chi_20 nu_tau)
     4.89642787E-03    2     1000025        16   # BR(~nu_tauL -> ~chi_30 nu_tau)
     4.10313763E-01    2     1000024        15   # BR(~nu_tauL -> ~chi_1+ tau-)
#
#         PDG            Width
DECAY   1000024     4.36614981E-01   # chargino1+ decays
#          BR         NDA      ID1       ID2
     7.90536986E-04    2     1000012       -11   # BR(~chi_1+ -> ~nu_eL   e+  )
     7.90536986E-04    2     1000014       -13   # BR(~chi_1+ -> ~nu_muL  mu+ )
     6.63951565E-05    2    -1000011        12   # BR(~chi_1+ -> ~e_L+    nu_e)
     6.63951565E-05    2    -1000013        14   # BR(~chi_1+ -> ~mu_L+   nu_mu)
     9.98286136E-01    2     1000022        24   # BR(~chi_1+ -> ~chi_10  W+)
#
#         PDG            Width
DECAY   1000037     1.82369894E+02   # chargino2+ decays
#          BR         NDA      ID1       ID2
     1.00366457E-01    2     1000002        -1   # BR(~chi_2+ -> ~u_L     db)
     1.00337428E-01    2    -1000001         2   # BR(~chi_2+ -> ~d_L*    u )
     1.00366455E-01    2     1000004        -3   # BR(~chi_2+ -> ~c_L     sb)
     1.00337396E-01    2    -1000003         4   # BR(~chi_2+ -> ~s_L*     c )
     8.65254342E-04    2     1000006        -5   # BR(~chi_2+ -> ~t_1     bb)
     2.54796400E-08    2    -1000005         6   # BR(~chi_2+ -> ~b_1*    t )
     7.62039105E-02    2     1000012       -11   # BR(~chi_2+ -> ~nu_eL   e+  )
     7.62039105E-02    2     1000014       -13   # BR(~chi_2+ -> ~nu_muL mu+ )
     1.29113642E-02    2     1000016       -15   # BR(~chi_2+ -> ~nu_tau1 tau+)
     7.61994264E-02    2    -1000011        12   # BR(~chi_2+ -> ~e_L+    nu_e)
     7.61994264E-02    2    -1000013        14   # BR(~chi_2+ -> ~mu_L+   nu_mu)
     1.28859804E-02    2    -1000015        16   # BR(~chi_2+ -> ~tau_1+  nu_tau)
     3.40268266E-08    2    -2000015        16   # BR(~chi_2+ -> ~tau_2+  nu_tau)
     4.21139279E-02    2     1000024        23   # BR(~chi_2+ -> ~chi_1+  Z )
     2.35312472E-04    2     1000022        24   # BR(~chi_2+ -> ~chi_10  W+)
     4.03660051E-02    2     1000023        24   # BR(~chi_2+ -> ~chi_20  W+)
     4.04421823E-02    2     1000025        24   # BR(~chi_2+ -> ~chi_30  W+)
     4.34459173E-02    2     1000024        25   # BR(~chi_2+ -> ~chi_1+  h )
     2.51174111E-02    2     1000024        35   # BR(~chi_2+ -> ~chi_1+  H )
     2.51447545E-02    2     1000024        36   # BR(~chi_2+ -> ~chi_1+  A )
     2.36645154E-04    2     1000022        37   # BR(~chi_2+ -> ~chi_10  H+)
     2.51369518E-02    2     1000023        37   # BR(~chi_2+ -> ~chi_20  H+)
     2.48838234E-02    2     1000025        37   # BR(~chi_2+ -> ~chi_30  H+)
#
#         PDG            Width
DECAY   1000022     0.00000000E+00   # neutralino1 decays
#
#         PDG            Width
DECAY   1000023     6.01290681E-01   # neutralino2 decays
#          BR         NDA      ID1       ID2
     6.81438570E-01    2     1000022        23   # BR(~chi_20 -> ~chi_10   Z )
     4.43142124E-02    2     1000022        25   # BR(~chi_20 -> ~chi_10   h )
     8.83894714E-04    2     2000002        -2   # BR(~chi_20 -> ~u_R      ub)
     8.83894714E-04    2    -2000002         2   # BR(~chi_20 -> ~u_R*     u )
     8.83889493E-04    2     2000004        -4   # BR(~chi_20 -> ~c_R      cb)
     8.83889493E-04    2    -2000004         4   # BR(~chi_20 -> ~c_R*     c )
     1.34742830E-01    2     1000005        -5   # BR(~chi_20 -> ~b_1      bb)
     1.34742830E-01    2    -1000005         5   # BR(~chi_20 -> ~b_1*     b )
     2.85650549E-04    2     1000011       -11   # BR(~chi_20 -> ~e_L-     e+)
     2.85650549E-04    2    -1000011        11   # BR(~chi_20 -> ~e_L+     e-)
     2.85650549E-04    2     1000013       -13   # BR(~chi_20 -> ~mu_L-    mu+)
     2.85650549E-04    2    -1000013        13   # BR(~chi_20 -> ~mu_L+    mu-)
     2.08466446E-05    2     1000012       -12   # BR(~chi_20 -> ~nu_eL    nu_eb)
     2.08466446E-05    2    -1000012        12   # BR(~chi_20 -> ~nu_eL*   nu_e )
     2.08466446E-05    2     1000014       -14   # BR(~chi_20 -> ~nu_muL   nu_mub)
     2.08466446E-05    2    -1000014        14   # BR(~chi_20 -> ~nu_muL*  nu_mu )
#
#         PDG            Width
DECAY   1000025     6.77334501E-01   # neutralino3 decays
#          BR         NDA      ID1       ID2
     4.79281200E-02    2     1000022        23   # BR(~chi_30 -> ~chi_10   Z )
     6.50480177E-01    2     1000022        25   # BR(~chi_30 -> ~chi_10   h )
     1.17814303E-02    2     2000002        -2   # BR(~chi_30 -> ~u_R      ub)
     1.17814303E-02    2    -2000002         2   # BR(~chi_30 -> ~u_R*     u )
     1.17813623E-02    2     2000004        -4   # BR(~chi_30 -> ~c_R      cb)
     1.17813623E-02    2    -2000004         4   # BR(~chi_30 -> ~c_R*     c )
     1.24916582E-01    2     1000005        -5   # BR(~chi_30 -> ~b_1      bb)
     1.24916582E-01    2    -1000005         5   # BR(~chi_30 -> ~b_1*     b )
     3.04059425E-04    2     1000011       -11   # BR(~chi_30 -> ~e_L-     e+)
     3.04059425E-04    2    -1000011        11   # BR(~chi_30 -> ~e_L+     e-)
     3.04059425E-04    2     1000013       -13   # BR(~chi_30 -> ~mu_L-    mu+)
     3.04059425E-04    2    -1000013        13   # BR(~chi_30 -> ~mu_L+    mu-)
     8.54178836E-04    2     1000012       -12   # BR(~chi_30 -> ~nu_eL    nu_eb)
     8.54178836E-04    2    -1000012        12   # BR(~chi_30 -> ~nu_eL*   nu_e )
     8.54178836E-04    2     1000014       -14   # BR(~chi_30 -> ~nu_muL   nu_mub)
     8.54178836E-04    2    -1000014        14   # BR(~chi_30 -> ~nu_muL*  nu_mu )
#
#         PDG            Width
DECAY   1000035     1.82407143E+02   # neutralino4 decays
#          BR         NDA      ID1       ID2
     1.69735872E-04    2     1000022        23   # BR(~chi_40 -> ~chi_10   Z )
     9.54772966E-03    2     1000023        23   # BR(~chi_40 -> ~chi_20   Z )
     3.21502493E-02    2     1000025        23   # BR(~chi_40 -> ~chi_30   Z )
     4.09536876E-02    2     1000024       -24   # BR(~chi_40 -> ~chi_1+   W-)
     4.09536876E-02    2    -1000024        24   # BR(~chi_40 -> ~chi_1-   W+)
     7.49484886E-05    2     1000022        25   # BR(~chi_40 -> ~chi_10   h )
     8.14961753E-05    2     1000022        35   # BR(~chi_40 -> ~chi_10   H )
     1.55558204E-04    2     1000022        36   # BR(~chi_40 -> ~chi_10   A )
     3.36453175E-02    2     1000023        25   # BR(~chi_40 -> ~chi_20   h )
     1.90955901E-02    2     1000023        35   # BR(~chi_40 -> ~chi_20   H )
     6.02831869E-03    2     1000023        36   # BR(~chi_40 -> ~chi_20   A )
     9.68383069E-03    2     1000025        25   # BR(~chi_40 -> ~chi_30   h )
     5.95508275E-03    2     1000025        35   # BR(~chi_40 -> ~chi_30   H )
     1.89646781E-02    2     1000025        36   # BR(~chi_40 -> ~chi_30   A )
     2.51045639E-02    2     1000024       -37   # BR(~chi_40 -> ~chi_1+   H-)
     2.51045639E-02    2    -1000024        37   # BR(~chi_40 -> ~chi_1-   H+)
     5.01845408E-02    2     1000002        -2   # BR(~chi_40 -> ~u_L      ub)
     5.01845408E-02    2    -1000002         2   # BR(~chi_40 -> ~u_L*     u )
     3.35569047E-09    2     2000002        -2   # BR(~chi_40 -> ~u_R      ub)
     3.35569047E-09    2    -2000002         2   # BR(~chi_40 -> ~u_R*     u )
     5.01335689E-02    2     1000001        -1   # BR(~chi_40 -> ~d_L      db)
     5.01335689E-02    2    -1000001         1   # BR(~chi_40 -> ~d_L*     d )
     2.71346462E-11    2     2000001        -1   # BR(~chi_40 -> ~d_R      db)
     2.71346462E-11    2    -2000001         1   # BR(~chi_40 -> ~d_R*     d )
     5.01845247E-02    2     1000004        -4   # BR(~chi_40 -> ~c_L      cb)
     5.01845247E-02    2    -1000004         4   # BR(~chi_40 -> ~c_L*     c )
     3.35569043E-09    2     2000004        -4   # BR(~chi_40 -> ~c_R      cb)
     3.35569043E-09    2    -2000004         4   # BR(~chi_40 -> ~c_R*     c )
     5.01335689E-02    2     1000003        -3   # BR(~chi_40 -> ~s _L      sb)
     5.01335689E-02    2    -1000003         3   # BR(~chi_40 -> ~s _L*     s )
     2.71346462E-11    2     2000003        -3   # BR(~chi_40 -> ~s _R      sb)
     2.71346462E-11    2    -2000003         3   # BR(~chi_40 -> ~s _R*     s )
     8.46273359E-09    2     1000005        -5   # BR(~chi_40 -> ~b_1      bb)
     8.46273359E-09    2    -1000005         5   # BR(~chi_40 -> ~b_1*     b )
     2.72034147E-04    2     2000005        -5   # BR(~chi_40 -> ~b_2      bb)
     2.72034147E-04    2    -2000005         5   # BR(~chi_40 -> ~b_2*     b )
     3.80632989E-02    2     1000011       -11   # BR(~chi_40 -> ~e_L-     e+)
     3.80632989E-02    2    -1000011        11   # BR(~chi_40 -> ~e_L+     e-)
     1.56004432E-09    2     2000011       -11   # BR(~chi_40 -> ~e_R-     e+)
     1.56004432E-09    2    -2000011        11   # BR(~chi_40 -> ~e_R+     e-)
     3.80632989E-02    2     1000013       -13   # BR(~chi_40 -> ~mu_L-    mu+)
     3.80632989E-02    2    -1000013        13   # BR(~chi_40 -> ~mu_L+    mu-)
     1.56004432E-09    2     2000013       -13   # BR(~chi_40 -> ~mu_R-    mu+)
     1.56004432E-09    2    -2000013        13   # BR(~chi_40 -> ~mu_R+    mu-)
     6.43516318E-03    2     1000015       -15   # BR(~chi_40 -> ~tau_1-   tau+)
     6.43516318E-03    2    -1000015        15   # BR(~chi_40 -> ~tau_1+   tau-)
     1.68964934E-08    2     2000015       -15   # BR(~chi_40 -> ~tau_2-   tau+)
     1.68964934E-08    2    -2000015        15   # BR(~chi_40 -> ~tau_2+   tau-)
     3.81192153E-02    2     1000012       -12   # BR(~chi_40 -> ~nu_eL    nu_eb)
     3.81192153E-02    2    -1000012        12   # BR(~chi_40 -> ~nu_eL*   nu_e )
     3.81192153E-02    2     1000014       -14   # BR(~chi_40 -> ~nu_muL   nu_mub)
     3.81192153E-02    2    -1000014        14   # BR(~chi_40 -> ~nu_muL*  nu_mu )
     6.45701657E-03    2     1000016       -16   # BR(~chi_40 -> ~nu_tau1  nu_taub)
     6.45701657E-03    2    -1000016        16   # BR(~chi_40 -> ~nu_tau1* nu_tau )
#
#         PDG            Width
DECAY        25     4.30027014E-03   # h decays
#          BR         NDA      ID1       ID2
     6.12930044E-01    2           5        -5   # BR(h -> b       bb     )
     6.13077820E-02    2         -15        15   # BR(h -> tau+    tau-   )
     2.16932739E-04    2         -13        13   # BR(h -> mu+     mu-    )
     2.36621167E-04    2           3        -3   # BR(h -> s       sb     )
     2.02056215E-02    2           4        -4   # BR(h -> c       cb     )
     7.44656016E-02    2          21        21   # BR(h -> g       g      )
     2.21277714E-03    2          22        22   # BR(h -> gam     gam    )
     1.49113591E-03    2          22        23   # BR(h -> Z       gam    )
     2.01632267E-01    2          24       -24   # BR(h -> W+      W-     )
     2.53012167E-02    2          23        23   # BR(h -> Z       Z      )
#
#         PDG            Width
DECAY        35     1.13927260E+01   # H decays
#          BR         NDA      ID1       ID2
     8.28644905E-01    2           5        -5   # BR(H -> b       bb     )
     1.39309464E-01    2         -15        15   # BR(H -> tau+    tau-   )
     4.72424769E-04    2         -13        13   # BR(H -> mu+     mu-    )
     3.17566976E-04    2           3        -3   # BR(H -> s       sb     )
     1.32813667E-07    2           4        -4   # BR(H -> c       cb     )
     1.26710771E-02    2           6        -6   # BR(H -> t       tb     )
     2.79726525E-05    2          21        21   # BR(H -> g       g      )
     2.48624827E-08    2          22        22   # BR(H -> gam     gam    )
     1.73268796E-08    2          23        22   # BR(H -> Z       gam    )
     1.72767696E-05    2          24       -24   # BR(H -> W+      W-     )
     8.59255346E-06    2          23        23   # BR(H -> Z       Z      )
     6.73428021E-05    2          25        25   # BR(H -> h       h      )
     5.39417499E-04    2     1000022   1000022   # BR(H -> ~chi_10 ~chi_10)
     1.69139417E-02    2     1000022   1000023   # BR(H -> ~chi_10 ~chi_20)
     1.00638400E-03    2     1000022   1000025   # BR(H -> ~chi_10 ~chi_30)
     1.72935812E-06    2     2000002  -2000002   # BR(H -> ~u_R    ~u_R*  )
     1.72935812E-06    2     2000004  -2000004   # BR(H -> ~c_R    ~c_R*  )
#
#         PDG            Width
DECAY        36     1.13899894E+01   # A decays
#          BR         NDA      ID1       ID2
     8.28919877E-01    2           5        -5   # BR(A -> b       bb     )
     1.39346502E-01    2         -15        15   # BR(A -> tau+    tau-   )
     4.72548472E-04    2         -13        13   # BR(A -> mu+     mu-    )
     3.17697001E-04    2           3        -3   # BR(A -> s       sb     )
     1.31844574E-07    2           4        -4   # BR(A -> c       cb     )
     1.28775327E-02    2           6        -6   # BR(A -> t       tb     )
     1.10972504E-04    2          21        21   # BR(A -> g       g      )
     7.73823127E-08    2          22        22   # BR(A -> gam     gam    )
     7.16444532E-08    2          23        22   # BR(A -> Z       gam    )
     1.73557393E-05    2          23        25   # BR(A -> Z       h      )
     1.07833045E-03    2     1000022   1000022   # BR(A -> ~chi_10 ~chi_10)
     1.17281232E-03    2     1000022   1000023   # BR(A -> ~chi_10 ~chi_20)
     1.56860903E-02    2     1000022   1000025   # BR(A -> ~chi_10 ~chi_30)
#
#         PDG            Width
DECAY        37     1.04636906E+01   # H+ decays
#          BR         NDA      ID1       ID2
     1.37336793E-03    2           4        -5   # BR(H+ -> c       bb     )
     1.51872462E-01    2         -15        16   # BR(H+ -> tau+    nu_tau )
     5.15026199E-04    2         -13        14   # BR(H+ -> mu+     nu_mu  )
     1.37336252E-05    2           2        -5   # BR(H+ -> u       bb     )
     1.72783642E-05    2           2        -3   # BR(H+ -> u       sb     )
     3.40228003E-04    2           4        -3   # BR(H+ -> c       sb     )
     8.25597632E-01    2           6        -5   # BR(H+ -> t       bb     )
     1.90052751E-05    2          24        25   # BR(H+ -> W+      h      )
     4.44370756E-12    2          24        36   # BR(H+ -> W+      A      )
     2.02512666E-02    2     1000024   1000022   # BR(H+ -> ~chi_1+ ~chi_10)
