#
#                              ======================
#                              | THE SUSYHIT OUTPUT |
#                              ======================
#
#
#              ------------------------------------------------------
#              |     This is the output of the SUSY-HIT package     |
#              |  created by A.Djouadi, M.Muehlleitner and M.Spira. |
#              |  In case of problems with SUSY-HIT email to        |
#              |           margarete.muehlleitner@cern.ch           |
#              |           michael.spira@psi.ch                     |
#              |           abdelhak.djouadi@cern.ch                 |
#              ------------------------------------------------------
#
#              ------------------------------------------------------
#              |  SUSY Les Houches Accord - MSSM Spectrum + Decays  |
#              |              based on the decay programs           |
#              |                                                    |
#              |                     SDECAY 1.3b                    |
#              |                                                    |
#              |  Authors: M.Muhlleitner, A.Djouadi and Y.Mambrini  |
#              |  Ref.:    Comput.Phys.Commun.168(2005)46           |
#              |           [hep-ph/0311167]                         |
#              |                                                    |
#              |                     HDECAY 3.4                     |
#              |                                                    |
#              |  By: A.Djouadi,J.Kalinowski,M.Muhlleitner,M.Spira  |
#              |  Ref.:    Comput.Phys.Commun.108(1998)56           |
#              |           [hep-ph/9704448]                         |
#              |                                                    |
#              |                                                    |
#              |  If not stated otherwise all DRbar couplings and   |
#              |  soft SUSY breaking masses are given at the scale  |
#              |  Q=  0.35490180E+04
#              |                                                    |
#              ------------------------------------------------------
#
#
BLOCK DCINFO  # Decay Program information
     1   SDECAY/HDECAY # decay calculator
     2   1.3b  /3.4    # version number
#
BLOCK SPINFO  # Spectrum calculator information
     1     SOFTSUSY    # spectrum calculator               
     2     3.4.0       # version number                    
#
BLOCK MODSEL  # Model selection
     1     0   #  nonUniversal                                     
#
BLOCK SMINPUTS  # Standard Model inputs
         1     1.27908970E+02   # alpha_em^-1(M_Z)^MSbar
         2     1.16637870E-05   # G_F [GeV^-2]
         3     1.18400000E-01   # alpha_S(M_Z)^MSbar
         4     9.11876000E+01   # M_Z pole mass
         5     4.18000000E+00   # mb(mb)^MSbar
         6     1.73200000E+02   # mt pole mass
         7     1.77700000E+00   # mtau pole mass
#
BLOCK MINPAR  # Input parameters - minimal models
         3     1.12600000E+01   # tanb                
#
BLOCK EXTPAR  # Input parameters - non-minimal models
         0    -1.00000000E+00   # Set                 
         1     1.53950000E+03   # M_1(MX)             
         2    -3.62284000E+03   # M_2(MX)             
         3     3.79401000E+03   # M_3(MX)             
        11    -4.47252000E+03   # At(MX)              
        12     1.74360000E+03   # Ab(MX)              
        13    -1.90267000E+03   # Atau(MX)            
        23     4.37680000E+02   # mu(MX)              
        26     3.54914000E+03   # mA(pole)            
        31     3.16554000E+03   # meL(MX)             
        32     3.16554000E+03   # mmuL(MX)            
        33     6.69750000E+02   # mtauL(MX)           
        34     2.42076000E+03   # meR(MX)             
        35     2.42076000E+03   # mmuR(MX)            
        36     2.52766000E+03   # mtauR(MX)           
        41     7.64330000E+02   # mqL1(MX)            
        42     7.64330000E+02   # mqL2(MX)            
        43     3.96779000E+03   # mqL3(MX)            
        44     8.79340000E+02   # muR(MX)             
        45     8.79340000E+02   # mcR(MX)             
        46     3.17386000E+03   # mtR(MX)             
        47     1.72631000E+03   # mdR(MX)             
        48     1.72631000E+03   # msR(MX)             
        49     6.53960000E+02   # mbR(MX)             
#
BLOCK MASS  # Mass Spectrum
# PDG code           mass       particle
        24     8.03861112E+01   # W+
        25     1.25390056E+02   # h
        35     3.54918808E+03   # H
        36     3.54913966E+03   # A
        37     3.55043292E+03   # H+
         5     4.81876030E+00   # b-quark pole mass calculated from mb(mb)_Msbar
   1000001     1.08650463E+03   # ~d_L
   2000001     1.90172322E+03   # ~d_R
   1000002     1.08367323E+03   # ~u_L
   2000002     1.12906433E+03   # ~u_R
   1000003     1.08650463E+03   # ~s_L
   2000003     1.90172322E+03   # ~s_R
   1000004     1.08367323E+03   # ~c_L
   2000004     1.12906433E+03   # ~c_R
   1000005     9.47366035E+02   # ~b_1
   2000005     4.05812493E+03   # ~b_2
   1000006     3.22683732E+03   # ~t_1
   2000006     4.06868069E+03   # ~t_2
   1000011     3.19562466E+03   # ~e_L
   2000011     2.42858410E+03   # ~e_R
   1000012     3.19435066E+03   # ~nu_eL
   1000013     3.19562466E+03   # ~mu_L
   2000013     2.42858410E+03   # ~mu_R
   1000014     3.19435066E+03   # ~nu_muL
   1000015     7.45807662E+02   # ~tau_1
   2000015     2.53410895E+03   # ~tau_2
   1000016     7.41525663E+02   # ~nu_tauL
   1000021     3.85407427E+03   # ~g
   1000022     4.57845061E+02   # ~chi_10
   1000023    -4.57899878E+02   # ~chi_20
   1000025     1.50723433E+03   # ~chi_30
   1000035    -3.60314376E+03   # ~chi_40
   1000024     4.58602455E+02   # ~chi_1+
   1000037     3.60331027E+03   # ~chi_2+
#
BLOCK NMIX  # Neutralino Mixing Matrix
  1  1    -3.23141939E-02   # N_11
  1  2    -1.47973695E-02   # N_12
  1  3    -7.06885537E-01   # N_13
  1  4     7.06434476E-01   # N_14
  2  1    -1.43633751E-02   # N_21
  2  2    -1.57906059E-02   # N_22
  2  3     7.07213725E-01   # N_23
  2  4     7.06677506E-01   # N_24
  3  1     9.99374528E-01   # N_31
  3  2    -5.05352559E-04   # N_32
  3  3    -1.26922588E-02   # N_33
  3  4     3.30031036E-02   # N_34
  4  1    -1.99981845E-04   # N_41
  4  2     9.99765692E-01   # N_42
  4  3     7.01036951E-04   # N_43
  4  4     2.16339852E-02   # N_44
#
BLOCK UMIX  # Chargino Mixing Matrix U
  1  1    -9.93809320E-04   # U_11
  1  2     9.99999506E-01   # U_12
  2  1    -9.99999506E-01   # U_21
  2  2    -9.93809320E-04   # U_22
#
BLOCK VMIX  # Chargino Mixing Matrix V
  1  1     3.05970470E-02   # V_11
  1  2     9.99531801E-01   # V_12
  2  1     9.99531801E-01   # V_21
  2  2    -3.05970470E-02   # V_22
#
BLOCK STOPMIX  # Stop Mixing Matrix
  1  1     1.04570825E-01   # cos(theta_t)
  1  2     9.94517442E-01   # sin(theta_t)
  2  1    -9.94517442E-01   # -sin(theta_t)
  2  2     1.04570825E-01   # cos(theta_t)
#
BLOCK SBOTMIX  # Sbottom Mixing Matrix
  1  1     4.32493808E-04   # cos(theta_b)
  1  2     9.99999906E-01   # sin(theta_b)
  2  1    -9.99999906E-01   # -sin(theta_b)
  2  2     4.32493808E-04   # cos(theta_b)
#
BLOCK STAUMIX  # Stau Mixing Matrix
  1  1     9.99998083E-01   # cos(theta_tau)
  1  2     1.95805933E-03   # sin(theta_tau)
  2  1    -1.95805933E-03   # -sin(theta_tau)
  2  2     9.99998083E-01   # cos(theta_tau)
#
BLOCK ALPHA  # Higgs mixing
          -9.31128155E-02   # Mixing angle in the neutral Higgs boson sector
#
BLOCK HMIX Q=  3.54901800E+03  # DRbar Higgs Parameters
         1     4.43900265E+02   # mu(Q)MSSM           
         2     1.07277896E+01   # tan                 
         3     2.42771003E+02   # higgs               
         4     1.23579981E+07   # mA^2(Q)MSSM         
#
BLOCK GAUGE Q=  3.54901800E+03  # The gauge couplings
     1     3.65744251E-01   # gprime(Q) DRbar
     2     6.36801962E-01   # g(Q) DRbar
     3     1.00557126E+00   # g3(Q) DRbar
#
BLOCK AU Q=  3.54901800E+03  # The trilinear couplings
  1  1     0.00000000E+00   # A_u(Q) DRbar
  2  2     0.00000000E+00   # A_c(Q) DRbar
  3  3    -4.47251997E+03   # A_t(Q) DRbar
#
BLOCK AD Q=  3.54901800E+03  # The trilinear couplings
  1  1     0.00000000E+00   # A_d(Q) DRbar
  2  2     0.00000000E+00   # A_s(Q) DRbar
  3  3     1.74360001E+03   # A_b(Q) DRbar
#
BLOCK AE Q=  3.54901800E+03  # The trilinear couplings
  1  1     0.00000000E+00   # A_e(Q) DRbar
  2  2     0.00000000E+00   # A_mu(Q) DRbar
  3  3    -1.90267000E+03   # A_tau(Q) DRbar
#
BLOCK Yu Q=  3.54901800E+03  # The Yukawa couplings
  1  1     0.00000000E+00   # y_u(Q) DRbar
  2  2     0.00000000E+00   # y_c(Q) DRbar
  3  3     8.11854462E-01   # y_t(Q) DRbar
#
BLOCK Yd Q=  3.54901800E+03  # The Yukawa couplings
  1  1     0.00000000E+00   # y_d(Q) DRbar
  2  2     0.00000000E+00   # y_s(Q) DRbar
  3  3     1.41967040E-01   # y_b(Q) DRbar
#
BLOCK Ye Q=  3.54901800E+03  # The Yukawa couplings
  1  1     0.00000000E+00   # y_e(Q) DRbar
  2  2     0.00000000E+00   # y_mu(Q) DRbar
  3  3     1.08403952E-01   # y_tau(Q) DRbar
#
BLOCK MSOFT Q=  3.54901800E+03  # The soft SUSY breaking masses at the scale Q
         1     1.53950000E+03   # M_1(Q)              
         2    -3.62284000E+03   # M_2(Q)              
         3     3.79401000E+03   # M_3(Q)              
        21     1.21125721E+07   # mH1^2(Q)            
        22     1.11659120E+05   # mH2^2(Q)            
        31     3.16554000E+03   # meL(Q)              
        32     3.16554000E+03   # mmuL(Q)             
        33     6.69749999E+02   # mtauL(Q)            
        34     2.42076000E+03   # meR(Q)              
        35     2.42076000E+03   # mmuR(Q)             
        36     2.52766000E+03   # mtauR(Q)            
        41     7.64329927E+02   # mqL1(Q)             
        42     7.64329927E+02   # mqL2(Q)             
        43     3.96778997E+03   # mqL3(Q)             
        44     8.79339936E+02   # muR(Q)              
        45     8.79339936E+02   # mcR(Q)              
        46     3.17385994E+03   # mtR(Q)              
        47     1.72630997E+03   # mdR(Q)              
        48     1.72630997E+03   # msR(Q)              
        49     6.53959915E+02   # mbR(Q)              
#
Block HiggsBoundsInputHiggsCouplingsFermions
# ScalarNormEffCoupSq PseudoSNormEffCoupSq NP   IP1 IP2 IP2
    1.00355530E+00    0.00000000E+00        3  25   5   5  # h0-b-b eff. coupling^2, normalised to SM
    1.15081914E+02    0.00000000E+00        3  35   5   5  # H0-b-b eff. coupling^2, normalised to SM
    0.00000000E+00    1.15085470E+02        3  36   5   5  # A0-b-b eff. coupling^2, normalised to SM
#
    9.99969107E-01    0.00000000E+00        3  25   6   6  # h0-t-t eff. coupling^2, normalised to SM
    8.72008689E-03    0.00000000E+00        3  35   6   6  # H0-t-t eff. coupling^2, normalised to SM
    0.00000000E+00    8.68919424E-03        3  36   6   6  # A0-t-t eff. coupling^2, normalised to SM
#
    1.00355530E+00    0.00000000E+00        3  25  15  15  # h0-tau-tau eff. coupling^2, normalised to SM
    1.15081914E+02    0.00000000E+00        3  35  15  15  # H0-tau-tau eff. coupling^2, normalised to SM
    0.00000000E+00    1.15085470E+02        3  36  15  15  # A0-tau-tau eff. coupling^2, normalised to SM
#
Block HiggsBoundsInputHiggsCouplingsBosons
    9.99999973E-01        3  25  24  24  # h0-W-W eff. coupling^2, normalised to SM
    2.74098557E-08        3  35  24  24  # H0-W-W eff. coupling^2, normalised to SM
    0.00000000E+00        3  36  24  24  # A0-W-W eff. coupling^2, normalised to SM
#
    9.99999973E-01        3  25  23  23  # h0-Z-Z eff. coupling^2, normalised to SM
    2.74098557E-08        3  35  23  23  # H0-Z-Z eff. coupling^2, normalised to SM
    0.00000000E+00        3  36  23  23  # A0-Z-Z eff. coupling^2, normalised to SM
#
    8.88696151E-01        3  25  21  21  # h0-g-g eff. coupling^2, normalised to SM
    3.52912361E-14        3  35  21  21  # H0-g-g eff. coupling^2, normalised to SM
    4.96064311E-13        3  36  21  21  # A0-g-g eff. coupling^2, normalised to SM
#
    0.00000000E+00        3  25  25  23  # h0-h0-Z eff. coupling^2, normalised to SM
    0.00000000E+00        3  35  25  23  # H0-h0-Z eff. coupling^2, normalised to SM
    2.74098557E-08        3  36  25  23  # A0-h0-Z eff. coupling^2, normalised to SM
    0.00000000E+00        3  35  35  23  # H0-H0-Z eff. coupling^2, normalised to SM
    9.99999973E-01        3  36  35  23  # A0-H0-Z eff. coupling^2, normalised to SM
    0.00000000E+00        3  36  36  23  # A0-A0-Z eff. coupling^2, normalised to SM
#
    0.00000000E+00        4  25  21  21  23  # h0-g-g-Z eff. coupling^2, normalised to SM
    0.00000000E+00        4  35  21  21  23  # H0-g-g-Z eff. coupling^2, normalised to SM
    0.00000000E+00        4  36  21  21  23  # A0-g-g-Z eff. coupling^2, normalised to SM
#
#
#
#                             =================
#                             |The decay table|
#                             =================
#
# - The QCD corrections to the decays gluino -> squark  + quark
#                                     squark -> gaugino + quark_prime
#                                     squark -> squark_prime + Higgs
#                                     squark -> gluino  + quark
#   are included.
#
# - The multi-body decays for the inos, stops and sbottoms are included.
#
# - The loop induced decays for the gluino, neutralinos and stops
#   are included.
#
# - The SUSY decays of the top quark are included.
#
#
#         PDG            Width
DECAY         6     1.42833804E+00   # top decays
#          BR         NDA      ID1       ID2
     1.00000000E+00    2           5        24   # BR(t ->  b    W+)
#
#         PDG            Width
DECAY   1000021     5.69054746E+02   # gluino decays
#          BR         NDA      ID1       ID2
     5.90828403E-02    2     1000001        -1   # BR(~g -> ~d_L  db)
     5.90828403E-02    2    -1000001         1   # BR(~g -> ~d_L* d )
     3.99057431E-02    2     2000001        -1   # BR(~g -> ~d_R  db)
     3.99057431E-02    2    -2000001         1   # BR(~g -> ~d_R* d )
     5.91359544E-02    2     1000002        -2   # BR(~g -> ~u_L  ub)
     5.91359544E-02    2    -1000002         2   # BR(~g -> ~u_L* u )
     5.82707605E-02    2     2000002        -2   # BR(~g -> ~u_R  ub)
     5.82707605E-02    2    -2000002         2   # BR(~g -> ~u_R* u )
     5.90828403E-02    2     1000003        -3   # BR(~g -> ~s_L  sb)
     5.90828403E-02    2    -1000003         3   # BR(~g -> ~s_L* s )
     3.99057431E-02    2     2000003        -3   # BR(~g -> ~s_R  sb)
     3.99057431E-02    2    -2000003         3   # BR(~g -> ~s_R* s )
     5.91359525E-02    2     1000004        -4   # BR(~g -> ~c_L  cb)
     5.91359525E-02    2    -1000004         4   # BR(~g -> ~c_L* c )
     5.82707585E-02    2     2000004        -4   # BR(~g -> ~c_R  cb)
     5.82707585E-02    2    -2000004         4   # BR(~g -> ~c_R* c )
     6.14415889E-02    2     1000005        -5   # BR(~g -> ~b_1  bb)
     6.14415889E-02    2    -1000005         5   # BR(~g -> ~b_1* b )
     5.76781831E-03    2     1000006        -6   # BR(~g -> ~t_1  tb)
     5.76781831E-03    2    -1000006         6   # BR(~g -> ~t_1* t )
#
#         PDG            Width
DECAY   1000006     8.48588445E+01   # stop1 decays
#          BR         NDA      ID1       ID2
     2.36808928E-01    2     1000022         6   # BR(~t_1 -> ~chi_10 t )
     2.38203760E-01    2     1000023         6   # BR(~t_1 -> ~chi_20 t )
     5.42223594E-02    2     1000025         6   # BR(~t_1 -> ~chi_30 t )
     4.70764568E-01    2     1000024         5   # BR(~t_1 -> ~chi_1+ b )
     3.84831229E-07    2     1000005        24   # BR(~t_1 -> ~b_1    W+)
#
#         PDG            Width
DECAY   2000006     8.13615358E+01   # stop2 decays
#          BR         NDA      ID1       ID2
     3.18451964E-01    2     1000022         6   # BR(~t_2 -> ~chi_10 t )
     3.17762456E-01    2     1000023         6   # BR(~t_2 -> ~chi_20 t )
     7.65022649E-03    2     1000025         6   # BR(~t_2 -> ~chi_30 t )
     8.71765281E-03    2     1000035         6   # BR(~t_2 -> ~chi_40 t )
     2.98748422E-02    2     1000024         5   # BR(~t_2 -> ~chi_1+ b )
     1.83903960E-02    2     1000037         5   # BR(~t_2 -> ~chi_2+ b )
     1.36830281E-02    2     1000021         6   # BR(~t_2 -> ~g      t )
     1.40526401E-01    2     1000006        25   # BR(~t_2 -> ~t_1    h )
     1.44862264E-01    2     1000006        23   # BR(~t_2 -> ~t_1    Z )
     8.07698646E-05    2     1000005        24   # BR(~t_2 -> ~b_1    W+)
#
#         PDG            Width
DECAY   1000005     4.20767076E-01   # sbottom1 decays
#          BR         NDA      ID1       ID2
     2.65599740E-01    2     1000022         5   # BR(~b_1 -> ~chi_10 b )
     2.65263397E-01    2     1000023         5   # BR(~b_1 -> ~chi_20 b )
     4.69136863E-01    2    -1000024         6   # BR(~b_1 -> ~chi_1- t )
#
#         PDG            Width
DECAY   2000005     8.02343881E+01   # sbottom2 decays
#          BR         NDA      ID1       ID2
     9.89214931E-03    2     1000022         5   # BR(~b_2 -> ~chi_10 b )
     9.92029231E-03    2     1000023         5   # BR(~b_2 -> ~chi_20 b )
     5.58243846E-03    2     1000025         5   # BR(~b_2 -> ~chi_30 b )
     9.13610071E-03    2     1000035         5   # BR(~b_2 -> ~chi_40 b )
     6.43353534E-01    2    -1000024         6   # BR(~b_2 -> ~chi_1- t )
     1.72392340E-02    2    -1000037         6   # BR(~b_2 -> ~chi_2- t )
     2.60688652E-02    2     1000021         5   # BR(~b_2 -> ~g      b )
     4.55152071E-05    2     1000005        25   # BR(~b_2 -> ~b_1    h )
     4.24036436E-05    2     1000005        23   # BR(~b_2 -> ~b_1    Z )
     2.78719467E-01    2     1000006       -24   # BR(~b_2 -> ~t_1    W-)
#
#         PDG            Width
DECAY   1000002     8.16810836E-03   # sup_L decays
#          BR         NDA      ID1       ID2
     1.65927173E-01    2     1000022         2   # BR(~u_L -> ~chi_10 u)
     1.29521503E-01    2     1000023         2   # BR(~u_L -> ~chi_20 u)
     7.04551324E-01    2     1000024         1   # BR(~u_L -> ~chi_1+ d)
#
#         PDG            Width
DECAY   2000002     2.59903760E-03   # sup_R decays
#           BR         NDA      ID1       ID2
     7.80143526E-01    2     1000022         2   # BR(~u_R -> ~chi_10 u)
     1.54120387E-01    2     1000023         2   # BR(~u_R -> ~chi_20 u)
#           BR         NDA      ID1       ID2       ID3
     6.97258092E-07    3        2       -1        1000001   # BR(~u_R -> u  db  ~d_L)
     6.31118225E-08    3        2       1        -1000001   # BR(~u_R -> u  d  ~d_L*)
     9.32960722E-07    3        2       -2        1000002   # BR(~u_R -> u  ub  ~u_L)
     8.63627366E-08    3        2       2        -1000002   # BR(~u_R -> u  u  ~u_L*)
     6.78328008E-07    3        2       -3        1000003   # BR(~u_R -> u  sb  ~s_L)
     6.32118596E-08    3        2       3        -1000003   # BR(~u_R -> u  s  ~s_L*)
     9.45811633E-07    3        2       -4        1000004   # BR(~u_R -> u  cb  ~c_L)
     8.55278122E-08    3        2       4        -1000004   # BR(~u_R -> u  c  ~c_L*)
     8.88905954E-05    3        2       -5        1000005   # BR(~u_R -> u  bb  ~b_1)
     9.29767233E-04    3        2       5        -1000005   # BR(~u_R -> u  b  ~b_1*)
     1.16177619E-03    3        2       -15        1000015   # BR(~u_R -> u  tau+  ~tau_1-)
     4.59439293E-04    3        2       15        -1000015   # BR(~u_R -> u  tau-  ~tau_1+)
     1.23622682E-03    3        2       -16        1000016   # BR(~u_R -> u  nu_taub  ~nu_tau1)
     4.77946144E-04    3        2       16        -1000016   # BR(~u_R -> u  nu_tau  ~nu_tau1*)
     2.87868094E-03    3        2       23        1000022   # BR(~u_R -> u  Z  ~chi_10)
     1.25896601E-02    3        2       25        1000022   # BR(~u_R -> u  h  ~chi_10)
     1.37477811E-02    3        2       23        1000023   # BR(~u_R -> u  Z  ~chi_20)
     1.45215290E-03    3        2       25        1000023   # BR(~u_R -> u  h  ~chi_20)
     7.91023569E-03    3        2       -24        1000024   # BR(~u_R -> u  W-  ~chi_1+)
     2.27999779E-02    3        2       24        -1000024   # BR(~u_R -> u  W+  ~chi_1-)
#
#         PDG            Width
DECAY   1000001     7.61293048E-04   # sdown_L decays
#          BR         NDA      ID1       ID2
     3.01210578E-01    2     1000022         1   # BR(~d_L -> ~chi_10 d)
     6.90776446E-01    2     1000023         1   # BR(~d_L -> ~chi_20 d)
     8.01297645E-03    2    -1000024         2   # BR(~d_L -> ~chi_1- u)
#
#         PDG            Width
DECAY   2000001     1.61705313E-01   # sdown_R decays
#          BR         NDA      ID1       ID2
     6.54306756E-03    2     1000022         1   # BR(~d_R -> ~chi_10 d)
     1.29269201E-03    2     1000023         1   # BR(~d_R -> ~chi_20 d)
     9.92164240E-01    2     1000025         1   # BR(~d_R -> ~chi_30 d)
#
#         PDG            Width
DECAY   1000004     7.82839023E-03   # scharm_L decays
#          BR         NDA      ID1       ID2
     1.65927152E-01    2     1000022         4   # BR(~c_L -> ~chi_10 c)
     1.29521432E-01    2     1000023         4   # BR(~c_L -> ~chi_20 c)
     7.04551416E-01    2     1000024         3   # BR(~c_L -> ~chi_1+ s)
#
#         PDG            Width
DECAY   2000004     2.50240664E-03   # scharm_R decays
#           BR         NDA      ID1       ID2
     7.78102810E-01    2     1000022         4   # BR(~c_R -> ~chi_10 c)
     1.53717177E-01    2     1000023         4   # BR(~c_R -> ~chi_20 c)
#           BR         NDA      ID1       ID2       ID3
     7.15231477E-07    3        4       -1        1000001   # BR(~c_R -> c  db  ~d_L)
     6.52931451E-08    3        4       1        -1000001   # BR(~c_R -> c  d  ~d_L*)
     9.73343004E-07    3        4       -2        1000002   # BR(~c_R -> c  ub  ~u_L)
     8.85347714E-08    3        4       2        -1000002   # BR(~c_R -> c  u  ~u_L*)
     7.05760594E-07    3        4       -3        1000003   # BR(~c_R -> c  sb  ~s_L)
     6.56448066E-08    3        4       3        -1000003   # BR(~c_R -> c  s  ~s_L*)
     9.64071929E-07    3        4       -4        1000004   # BR(~c_R -> c  cb  ~c_L)
     8.98175365E-08    3        4       4        -1000004   # BR(~c_R -> c  c  ~c_L*)
     9.32462358E-05    3        4       -5        1000005   # BR(~c_R -> c  bb  ~b_1)
     9.71424851E-04    3        4       5        -1000005   # BR(~c_R -> c  b  ~b_1*)
     1.20827684E-03    3        4       -15        1000015   # BR(~c_R -> c  tau+  ~tau_1-)
     4.72465178E-04    3        4       15        -1000015   # BR(~c_R -> c  tau-  ~tau_1+)
     1.26789945E-03    3        4       -16        1000016   # BR(~c_R -> c  nu_taub  ~nu_tau1)
     4.99519134E-04    3        4       16        -1000016   # BR(~c_R -> c  nu_tau  ~nu_tau1*)
     2.99363815E-03    3        4       23        1000022   # BR(~c_R -> c  Z  ~chi_10)
     1.30818067E-02    3        4       25        1000022   # BR(~c_R -> c  h  ~chi_10)
     1.42726603E-02    3        4       23        1000023   # BR(~c_R -> c  Z  ~chi_20)
     1.49244329E-03    3        4       25        1000023   # BR(~c_R -> c  h  ~chi_20)
     8.16813688E-03    3        4       -24        1000024   # BR(~c_R -> c  W-  ~chi_1+)
     2.36548285E-02    3        4       24        -1000024   # BR(~c_R -> c  W+  ~chi_1-)
#
#         PDG            Width
DECAY   1000003     7.29726194E-04   # sstrange_L decays
#          BR         NDA      ID1       ID2
     3.01210687E-01    2     1000022         3   # BR(~s_L -> ~chi_10 s)
     6.90776410E-01    2     1000023         3   # BR(~s_L -> ~chi_20 s)
     8.01290292E-03    2    -1000024         4   # BR(~s_L -> ~chi_1- c)
#
#         PDG            Width
DECAY   2000003     1.56558294E-01   # sstrange_R decays
#          BR         NDA      ID1       ID2
     6.65683030E-03    2     1000022         3   # BR(~s_R -> ~chi_10 s)
     1.31516741E-03    2     1000023         3   # BR(~s_R -> ~chi_20 s)
     9.92028002E-01    2     1000025         3   # BR(~s_R -> ~chi_30 s)
#
#         PDG            Width
DECAY   1000011     2.58393366E+00   # selectron_L decays
#          BR         NDA      ID1       ID2
     5.32523816E-03    2     1000022        11   # BR(~e_L -> ~chi_10 e-)
     2.76590993E-03    2     1000023        11   # BR(~e_L -> ~chi_20 e-)
     9.91899399E-01    2     1000025        11   # BR(~e_L -> ~chi_30 e-)
     9.45244421E-06    2    -1000024        12   # BR(~e_L -> ~chi_1- nu_e)
#
#         PDG            Width
DECAY   2000011     4.89516623E+00   # selectron_R decays
#          BR         NDA      ID1       ID2
     2.56480865E-03    2     1000022        11   # BR(~e_R -> ~chi_10 e-)
     5.06726546E-04    2     1000023        11   # BR(~e_R -> ~chi_20 e-)
     9.96928465E-01    2     1000025        11   # BR(~e_R -> ~chi_30 e-)
#
#         PDG            Width
DECAY   1000013     2.58393365E+00   # smuon_L decays
#          BR         NDA      ID1       ID2
     5.32523816E-03    2     1000022        13   # BR(~mu_L -> ~chi_10 mu-)
     2.76590994E-03    2     1000023        13   # BR(~mu_L -> ~chi_20 mu-)
     9.91899399E-01    2     1000025        13   # BR(~mu_L -> ~chi_30 mu-)
     9.45244424E-06    2    -1000024        14   # BR(~mu_L -> ~chi_1- nu_mu)
#
#         PDG            Width
DECAY   2000013     4.89516618E+00   # smuon_R decays
#          BR         NDA      ID1       ID2
     2.56480867E-03    2     1000022        13   # BR(~mu_R -> ~chi_10 mu-)
     5.06726549E-04    2     1000023        13   # BR(~mu_R -> ~chi_20 mu-)
     9.96928465E-01    2     1000025        13   # BR(~mu_R -> ~chi_30 mu-)
#
#         PDG            Width
DECAY   1000015     6.97760095E-02   # stau_1 decays
#          BR         NDA      ID1       ID2
     5.04388073E-01    2     1000022        15   # BR(~tau_1 -> ~chi_10  tau-)
     4.95553190E-01    2     1000023        15   # BR(~tau_1 -> ~chi_20  tau-)
     5.87372259E-05    2    -1000024        16   # BR(~tau_1 -> ~chi_1-  nu_tau)
#
#         PDG            Width
DECAY   2000015     6.81106147E+00   # stau_2 decays
#          BR         NDA      ID1       ID2
     4.25995333E-02    2     1000022        15   # BR(~tau_2 -> ~chi_10  tau-)
     4.10828928E-02    2     1000023        15   # BR(~tau_2 -> ~chi_20  tau-)
     8.25985345E-01    2     1000025        15   # BR(~tau_2 -> ~chi_30  tau-)
     8.13758569E-02    2    -1000024        16   # BR(~tau_2 -> ~chi_1-  nu_tau)
     4.35440217E-03    2     1000016       -24   # BR(~tau_2 -> ~nu_tauL W-)
     2.36176597E-03    2     1000015        25   # BR(~tau_2 -> ~tau_1   h)
     2.24020373E-03    2     1000015        23   # BR(~tau_2 -> ~tau_1   Z)
#
#         PDG            Width
DECAY   1000012     2.59386467E+00   # snu_eL decays
#          BR         NDA      ID1       ID2
     6.74503197E-05    2     1000022        12   # BR(~nu_eL -> ~chi_10 nu_e)
     2.71004175E-04    2     1000023        12   # BR(~nu_eL -> ~chi_20 nu_e)
     9.90739934E-01    2     1000025        12   # BR(~nu_eL -> ~chi_30 nu_e)
     8.92161171E-03    2     1000024        11   # BR(~nu_eL -> ~chi_1+ e-)
#
#         PDG            Width
DECAY   1000014     2.59386467E+00   # snu_muL decays
#          BR         NDA      ID1       ID2
     6.74503197E-05    2     1000022        14   # BR(~nu_muL -> ~chi_10 nu_mu)
     2.71004175E-04    2     1000023        14   # BR(~nu_muL -> ~chi_20 nu_mu)
     9.90739934E-01    2     1000025        14   # BR(~nu_muL -> ~chi_30 nu_mu)
     8.92161169E-03    2     1000024        13   # BR(~nu_muL -> ~chi_1+ mu-)
#
#         PDG            Width
DECAY   1000016     6.84338026E-02   # snu_tauL decays
#          BR         NDA      ID1       ID2
     2.36861929E-04    2     1000022        16   # BR(~nu_tauL -> ~chi_10 nu_tau)
     9.51400630E-04    2     1000023        16   # BR(~nu_tauL -> ~chi_20 nu_tau)
     9.98811737E-01    2     1000024        15   # BR(~nu_tauL -> ~chi_1+ tau-)
#
#         PDG            Width
DECAY   1000024     9.69812130E-13   # chargino1+ decays
#           BR         NDA      ID1       ID2       ID3
     1.49778930E-01    3     1000022       -11        12   # BR(~chi_1+ -> ~chi_10 e+   nu_e)
     1.36232240E-01    3     1000022       -13        14   # BR(~chi_1+ -> ~chi_10 mu+  nu_mu)
     6.57192740E-01    2     1000022       211             # BR(~chi_1+ -> ~chi_10 pi+)
     5.64858750E-02    3     1000022       211        111   # BR(~chi_1+ -> ~chi_10 pi+ pi0)
     1.55106590E-04    4     1000022       211        111       111 # BR(~chi_1+ -> ~chi_10 pi+ pi0 pi0)
     1.55106590E-04    4     1000022       211        211      -211 # BR(~chi_1+ -> ~chi_10 pi+ pi+ pi-)
#
#         PDG            Width
DECAY   1000037     1.96688827E+02   # chargino2+ decays
#          BR         NDA      ID1       ID2
     1.78848514E-01    2     1000002        -1   # BR(~chi_2+ -> ~u_L     db)
     1.78831642E-01    2    -1000001         2   # BR(~chi_2+ -> ~d_L*    u )
     1.78848513E-01    2     1000004        -3   # BR(~chi_2+ -> ~c_L     sb)
     1.78831634E-01    2    -1000003         4   # BR(~chi_2+ -> ~s_L*     c )
     1.78579891E-04    2     1000006        -5   # BR(~chi_2+ -> ~t_1     bb)
     8.45811218E-09    2    -1000005         6   # BR(~chi_2+ -> ~b_1*    t )
     3.38452192E-03    2     1000012       -11   # BR(~chi_2+ -> ~nu_eL   e+  )
     3.38452192E-03    2     1000014       -13   # BR(~chi_2+ -> ~nu_muL mu+ )
     6.77077376E-02    2     1000016       -15   # BR(~chi_2+ -> ~nu_tau1 tau+)
     3.36787816E-03    2    -1000011        12   # BR(~chi_2+ -> ~e_L+    nu_e)
     3.36787816E-03    2    -1000013        14   # BR(~chi_2+ -> ~mu_L+   nu_mu)
     6.77013804E-02    2    -1000015        16   # BR(~chi_2+ -> ~tau_1+  nu_tau)
     8.54173637E-08    2    -2000015        16   # BR(~chi_2+ -> ~tau_2+  nu_tau)
     3.42004024E-02    2     1000024        23   # BR(~chi_2+ -> ~chi_1+  Z )
     3.31096721E-02    2     1000022        24   # BR(~chi_2+ -> ~chi_10  W+)
     3.31072098E-02    2     1000023        24   # BR(~chi_2+ -> ~chi_20  W+)
     2.56596941E-05    2     1000025        24   # BR(~chi_2+ -> ~chi_30  W+)
     3.51041604E-02    2     1000024        25   # BR(~chi_2+ -> ~chi_1+  h )
#
#         PDG            Width
DECAY   1000022     0.00000000E+00   # neutralino1 decays
#
#         PDG            Width
DECAY   1000023     1.93756188E-16   # neutralino2 decays
#          BR         NDA      ID1       ID2
     9.99369462E-01    2     1000022        22   # BR(~chi_20 -> ~chi_10 gam)
#           BR         NDA      ID1       ID2       ID3
     9.00813900E-05    3     1000022       -11        11   # BR(~chi_20 -> ~chi_10 e+      e-)
     1.80152217E-04    3     1000022       -12        12   # BR(~chi_20 -> ~chi_10 nu_eb   nu_e)
     1.80152217E-04    3     1000022       -14        14   # BR(~chi_20 -> ~chi_10 nu_mub  nu_mu)
     1.80152035E-04    3     1000022       -16        16   # BR(~chi_20 -> ~chi_10 nu_taub nu_tau)
#
#         PDG            Width
DECAY   1000025     1.22821512E+01   # neutralino3 decays
#          BR         NDA      ID1       ID2
     1.39464390E-02    2     1000022        23   # BR(~chi_30 -> ~chi_10   Z )
     6.95903356E-02    2     1000023        23   # BR(~chi_30 -> ~chi_20   Z )
     8.09689564E-02    2     1000024       -24   # BR(~chi_30 -> ~chi_1+   W-)
     8.09689564E-02    2    -1000024        24   # BR(~chi_30 -> ~chi_1-   W+)
     7.35256446E-02    2     1000022        25   # BR(~chi_30 -> ~chi_10   h )
     1.43010667E-02    2     1000023        25   # BR(~chi_30 -> ~chi_20   h )
     6.54154252E-03    2     1000002        -2   # BR(~chi_30 -> ~u_L      ub)
     6.54154252E-03    2    -1000002         2   # BR(~chi_30 -> ~u_L*     u )
     8.70303046E-02    2     2000002        -2   # BR(~chi_30 -> ~u_R      ub)
     8.70303046E-02    2    -2000002         2   # BR(~chi_30 -> ~u_R*     u )
     6.53799719E-03    2     1000001        -1   # BR(~chi_30 -> ~d_L      db)
     6.53799719E-03    2    -1000001         1   # BR(~chi_30 -> ~d_L*     d )
     6.54151102E-03    2     1000004        -4   # BR(~chi_30 -> ~c_L      cb)
     6.54151102E-03    2    -1000004         4   # BR(~chi_30 -> ~c_L*     c )
     8.70297546E-02    2     2000004        -4   # BR(~chi_30 -> ~c_R      cb)
     8.70297546E-02    2    -2000004         4   # BR(~chi_30 -> ~c_R*     c )
     6.53799719E-03    2     1000003        -3   # BR(~chi_30 -> ~s _L      sb)
     6.53799719E-03    2    -1000003         3   # BR(~chi_30 -> ~s _L*     s )
     3.97809321E-02    2     1000005        -5   # BR(~chi_30 -> ~b_1      bb)
     3.97809321E-02    2    -1000005         5   # BR(~chi_30 -> ~b_1*     b )
     4.64201122E-02    2     1000015       -15   # BR(~chi_30 -> ~tau_1-   tau+)
     4.64201122E-02    2    -1000015        15   # BR(~chi_30 -> ~tau_1+   tau-)
     4.69291494E-02    2     1000016       -16   # BR(~chi_30 -> ~nu_tau1  nu_taub)
     4.69291494E-02    2    -1000016        16   # BR(~chi_30 -> ~nu_tau1* nu_tau )
#
#         PDG            Width
DECAY   1000035     1.96666893E+02   # neutralino4 decays
#          BR         NDA      ID1       ID2
     1.81817981E-02    2     1000022        23   # BR(~chi_40 -> ~chi_10   Z )
     1.59962039E-02    2     1000023        23   # BR(~chi_40 -> ~chi_20   Z )
     2.24611067E-05    2     1000025        23   # BR(~chi_40 -> ~chi_30   Z )
     3.31271426E-02    2     1000024       -24   # BR(~chi_40 -> ~chi_1+   W-)
     3.31271426E-02    2    -1000024        24   # BR(~chi_40 -> ~chi_1-   W+)
     1.63391506E-02    2     1000022        25   # BR(~chi_40 -> ~chi_10   h )
     1.87340145E-02    2     1000023        25   # BR(~chi_40 -> ~chi_20   h )
     4.82928950E-06    2     1000025        25   # BR(~chi_40 -> ~chi_30   h )
     8.94639388E-02    2     1000002        -2   # BR(~chi_40 -> ~u_L      ub)
     8.94639388E-02    2    -1000002         2   # BR(~chi_40 -> ~u_L*     u )
     2.06417552E-09    2     2000002        -2   # BR(~chi_40 -> ~u_R      ub)
     2.06417552E-09    2    -2000002         2   # BR(~chi_40 -> ~u_R*     u )
     8.93855228E-02    2     1000001        -1   # BR(~chi_40 -> ~d_L      db)
     8.93855228E-02    2    -1000001         1   # BR(~chi_40 -> ~d_L*     d )
     3.31616215E-10    2     2000001        -1   # BR(~chi_40 -> ~d_R      db)
     3.31616215E-10    2    -2000001         1   # BR(~chi_40 -> ~d_R*     d )
     8.94639349E-02    2     1000004        -4   # BR(~chi_40 -> ~c_L      cb)
     8.94639349E-02    2    -1000004         4   # BR(~chi_40 -> ~c_L*     c )
     2.06417542E-09    2     2000004        -4   # BR(~chi_40 -> ~c_R      cb)
     2.06417542E-09    2    -2000004         4   # BR(~chi_40 -> ~c_R*     c )
     8.93855228E-02    2     1000003        -3   # BR(~chi_40 -> ~s _L      sb)
     8.93855228E-02    2    -1000003         3   # BR(~chi_40 -> ~s _L*     s )
     3.31616215E-10    2     2000003        -3   # BR(~chi_40 -> ~s _R      sb)
     3.31616215E-10    2    -2000003         3   # BR(~chi_40 -> ~s _R*     s )
     7.79389711E-05    2     1000006        -6   # BR(~chi_40 -> ~t_1      tb)
     7.79389711E-05    2    -1000006         6   # BR(~chi_40 -> ~t_1*     t )
     4.84505378E-09    2     1000005        -5   # BR(~chi_40 -> ~b_1      bb)
     4.84505378E-09    2    -1000005         5   # BR(~chi_40 -> ~b_1*     b )
     1.68172899E-03    2     1000011       -11   # BR(~chi_40 -> ~e_L-     e+)
     1.68172899E-03    2    -1000011        11   # BR(~chi_40 -> ~e_L+     e-)
     5.80662683E-10    2     2000011       -11   # BR(~chi_40 -> ~e_R-     e+)
     5.80662683E-10    2    -2000011        11   # BR(~chi_40 -> ~e_R+     e-)
     1.68172899E-03    2     1000013       -13   # BR(~chi_40 -> ~mu_L-    mu+)
     1.68172899E-03    2    -1000013        13   # BR(~chi_40 -> ~mu_L+    mu-)
     5.80662683E-10    2     2000013       -13   # BR(~chi_40 -> ~mu_R-    mu+)
     5.80662683E-10    2    -2000013        13   # BR(~chi_40 -> ~mu_R+    mu-)
     3.38290302E-02    2     1000015       -15   # BR(~chi_40 -> ~tau_1-   tau+)
     3.38290302E-02    2    -1000015        15   # BR(~chi_40 -> ~tau_1+   tau-)
     4.31773885E-08    2     2000015       -15   # BR(~chi_40 -> ~tau_2-   tau+)
     4.31773885E-08    2    -2000015        15   # BR(~chi_40 -> ~tau_2+   tau-)
     1.69240378E-03    2     1000012       -12   # BR(~chi_40 -> ~nu_eL    nu_eb)
     1.69240378E-03    2    -1000012        12   # BR(~chi_40 -> ~nu_eL*   nu_e )
     1.69240378E-03    2     1000014       -14   # BR(~chi_40 -> ~nu_muL   nu_mub)
     1.69240378E-03    2    -1000014        14   # BR(~chi_40 -> ~nu_muL*  nu_mu )
     3.38794207E-02    2     1000016       -16   # BR(~chi_40 -> ~nu_tau1  nu_taub)
     3.38794207E-02    2    -1000016        16   # BR(~chi_40 -> ~nu_tau1* nu_tau )
#
#         PDG            Width
DECAY        25     4.11227920E-03   # h decays
#          BR         NDA      ID1       ID2
     5.92739587E-01    2           5        -5   # BR(h -> b       bb     )
     6.33439472E-02    2         -15        15   # BR(h -> tau+    tau-   )
     2.24207128E-04    2         -13        13   # BR(h -> mu+     mu-    )
     2.44563274E-04    2           3        -3   # BR(h -> s       sb     )
     2.11425807E-02    2           4        -4   # BR(h -> c       cb     )
     7.83057904E-02    2          21        21   # BR(h -> g       g      )
     2.32017970E-03    2          22        22   # BR(h -> gam     gam    )
     1.57242130E-03    2          22        23   # BR(h -> Z       gam    )
     2.13326776E-01    2          24       -24   # BR(h -> W+      W-     )
     2.67799476E-02    2          23        23   # BR(h -> Z       Z      )
#
#         PDG            Width
DECAY        35     9.43776687E+00   # H decays
#          BR         NDA      ID1       ID2
     4.66887162E-01    2           5        -5   # BR(H -> b       bb     )
     9.17177086E-02    2         -15        15   # BR(H -> tau+    tau-   )
     3.19888205E-04    2         -13        13   # BR(H -> mu+     mu-    )
     1.82871806E-04    2           3        -3   # BR(H -> s       sb     )
     1.31627607E-06    2           4        -4   # BR(H -> c       cb     )
     1.29759642E-01    2           6        -6   # BR(H -> t       tb     )
     3.48347544E-05    2          21        21   # BR(H -> g       g      )
     8.34733383E-08    2          22        22   # BR(H -> gam     gam    )
     6.82955606E-08    2          23        22   # BR(H -> Z       gam    )
     4.17748654E-05    2          24       -24   # BR(H -> W+      W-     )
     2.08489004E-05    2          23        23   # BR(H -> Z       Z      )
     1.63957482E-04    2          25        25   # BR(H -> h       h      )
     2.68507660E-03    2     1000024  -1000024   # BR(H -> ~chi_1+ ~chi_1-)
     7.36820431E-06    2     1000022   1000022   # BR(H -> ~chi_10 ~chi_10)
     1.11818893E-04    2     1000023   1000023   # BR(H -> ~chi_20 ~chi_20)
     1.23265663E-05    2     1000025   1000025   # BR(H -> ~chi_30 ~chi_30)
     7.76501853E-05    2     1000022   1000023   # BR(H -> ~chi_10 ~chi_20)
     1.02804938E-01    2     1000022   1000025   # BR(H -> ~chi_10 ~chi_30)
     1.96858932E-01    2     1000023   1000025   # BR(H -> ~chi_20 ~chi_30)
     2.72025699E-05    2     1000002  -1000002   # BR(H -> ~u_L    ~u_L*  )
     4.73777936E-06    2     2000002  -2000002   # BR(H -> ~u_R    ~u_R*  )
     2.72025699E-05    2     1000004  -1000004   # BR(H -> ~c_L    ~c_L*  )
     4.73777936E-06    2     2000004  -2000004   # BR(H -> ~c_R    ~c_R*  )
     3.98578200E-05    2     1000001  -1000001   # BR(H -> ~d_L    ~d_L*  )
     3.98578200E-05    2     1000003  -1000003   # BR(H -> ~s_L    ~s_L*  )
     2.46426554E-07    2     1000005  -1000005   # BR(H -> ~b_1    ~b_1*  )
     7.58536065E-06    2     1000015  -1000015   # BR(H -> ~tau_1- ~tau_1+)
     4.06962262E-03    2     1000015  -2000015   # BR(H -> ~tau_1- ~tau_2+)
     4.06962262E-03    2     2000015  -1000015   # BR(H -> ~tau_2- ~tau_1+)
     2.10595857E-05    2     1000016  -1000016   # BR(H -> ~nu_tauL ~nu_tauL*)
#
#         PDG            Width
DECAY        36     9.44073656E+00   # A decays
#          BR         NDA      ID1       ID2
     4.66868122E-01    2           5        -5   # BR(A -> b       bb     )
     9.16905000E-02    2         -15        15   # BR(A -> tau+    tau-   )
     3.19793056E-04    2         -13        13   # BR(A -> mu+     mu-    )
     1.82929380E-04    2           3        -3   # BR(A -> s       sb     )
     1.32335844E-06    2           4        -4   # BR(A -> c       cb     )
     1.30045402E-01    2           6        -6   # BR(A -> t       tb     )
     1.30553257E-04    2          21        21   # BR(A -> g       g      )
     1.63929196E-07    2          22        22   # BR(A -> gam     gam    )
     1.57001173E-07    2          23        22   # BR(A -> Z       gam    )
     4.23510345E-05    2          23        25   # BR(A -> Z       h      )
     2.84173248E-03    2     1000024  -1000024   # BR(A -> ~chi_1+ ~chi_1-)
     1.14711551E-05    2     1000022   1000022   # BR(A -> ~chi_10 ~chi_10)
     8.23940299E-05    2     1000023   1000023   # BR(A -> ~chi_20 ~chi_20)
     1.19068527E-04    2     1000025   1000025   # BR(A -> ~chi_30 ~chi_30)
     8.82100973E-05    2     1000022   1000023   # BR(A -> ~chi_10 ~chi_20)
     1.96595639E-01    2     1000022   1000025   # BR(A -> ~chi_10 ~chi_30)
     1.02842905E-01    2     1000023   1000025   # BR(A -> ~chi_20 ~chi_30)
     4.06864227E-03    2     1000015  -2000015   # BR(A -> ~tau_1- ~tau_2+)
     4.06864227E-03    2    -1000015   2000015   # BR(A -> ~tau_1+ ~tau_2-)
#
#         PDG            Width
DECAY        37     9.30677293E+00   # H+ decays
#          BR         NDA      ID1       ID2
     7.77264426E-04    2           4        -5   # BR(H+ -> c       bb     )
     9.30442039E-02    2         -15        16   # BR(H+ -> tau+    nu_tau )
     3.24514429E-04    2         -13        14   # BR(H+ -> mu+     nu_mu  )
     7.77261604E-06    2           2        -5   # BR(H+ -> u       bb     )
     9.28386300E-06    2           2        -3   # BR(H+ -> u       sb     )
     1.84022412E-04    2           4        -3   # BR(H+ -> c       sb     )
     5.91715595E-01    2           6        -5   # BR(H+ -> t       bb     )
     4.30268595E-05    2          24        25   # BR(H+ -> W+      h      )
     5.11456968E-13    2          24        36   # BR(H+ -> W+      A      )
     1.64136854E-03    2     1000024   1000022   # BR(H+ -> ~chi_1+ ~chi_10)
     7.59795012E-04    2     1000024   1000023   # BR(H+ -> ~chi_1+ ~chi_20)
     3.03006641E-01    2     1000024   1000025   # BR(H+ -> ~chi_1+ ~chi_30)
     2.72826561E-05    2    -1000015   1000016   # BR(H+ -> ~tau_1+ ~nu_tauL)
     8.32468821E-03    2    -2000015   1000016   # BR(H+ -> ~tau_2+ ~nu_tauL)
     6.72703683E-05    2     1000002  -1000001   # BR(H+ -> ~u_L    ~d_L*  )
     6.72703683E-05    2     1000004  -1000003   # BR(H+ -> ~c_L    ~s_L*  )
