#
#                              ======================
#                              | THE SUSYHIT OUTPUT |
#                              ======================
#
#
#              ------------------------------------------------------
#              |     This is the output of the SUSY-HIT package     |
#              |  created by A.Djouadi, M.Muehlleitner and M.Spira. |
#              |  In case of problems with SUSY-HIT email to        |
#              |           margarete.muehlleitner@cern.ch           |
#              |           michael.spira@psi.ch                     |
#              |           abdelhak.djouadi@cern.ch                 |
#              ------------------------------------------------------
#
#              ------------------------------------------------------
#              |  SUSY Les Houches Accord - MSSM Spectrum + Decays  |
#              |              based on the decay programs           |
#              |                                                    |
#              |                     SDECAY 1.3b                    |
#              |                                                    |
#              |  Authors: M.Muhlleitner, A.Djouadi and Y.Mambrini  |
#              |  Ref.:    Comput.Phys.Commun.168(2005)46           |
#              |           [hep-ph/0311167]                         |
#              |                                                    |
#              |                     HDECAY 3.4                     |
#              |                                                    |
#              |  By: A.Djouadi,J.Kalinowski,M.Muhlleitner,M.Spira  |
#              |  Ref.:    Comput.Phys.Commun.108(1998)56           |
#              |           [hep-ph/9704448]                         |
#              |                                                    |
#              |                                                    |
#              |  If not stated otherwise all DRbar couplings and   |
#              |  soft SUSY breaking masses are given at the scale  |
#              |  Q=  0.32709250E+04
#              |                                                    |
#              ------------------------------------------------------
#
#
BLOCK DCINFO  # Decay Program information
     1   SDECAY/HDECAY # decay calculator
     2   1.3b  /3.4    # version number
#
BLOCK SPINFO  # Spectrum calculator information
     1     SOFTSUSY    # spectrum calculator               
     2     3.4.0       # version number                    
#
BLOCK MODSEL  # Model selection
     1     0   #  nonUniversal                                     
#
BLOCK SMINPUTS  # Standard Model inputs
         1     1.27908970E+02   # alpha_em^-1(M_Z)^MSbar
         2     1.16637870E-05   # G_F [GeV^-2]
         3     1.18400000E-01   # alpha_S(M_Z)^MSbar
         4     9.11876000E+01   # M_Z pole mass
         5     4.18000000E+00   # mb(mb)^MSbar
         6     1.73200000E+02   # mt pole mass
         7     1.77700000E+00   # mtau pole mass
#
BLOCK MINPAR  # Input parameters - minimal models
         3     5.77000000E+00   # tanb                
#
BLOCK EXTPAR  # Input parameters - non-minimal models
         0    -1.00000000E+00   # Set                 
         1    -2.38561000E+03   # M_1(MX)             
         2     2.15040000E+02   # M_2(MX)             
         3     2.13882000E+03   # M_3(MX)             
        11     4.75961000E+03   # At(MX)              
        12    -4.10490000E+02   # Ab(MX)              
        13    -1.34784000E+03   # Atau(MX)            
        23    -2.70353000E+03   # mu(MX)              
        26     3.68253000E+03   # mA(pole)            
        31     2.66579000E+03   # meL(MX)             
        32     2.66579000E+03   # mmuL(MX)            
        33     2.91077000E+03   # mtauL(MX)           
        34     6.63210000E+02   # meR(MX)             
        35     6.63210000E+02   # mmuR(MX)            
        36     5.73490000E+02   # mtauR(MX)           
        41     2.79905000E+03   # mqL1(MX)            
        42     2.79905000E+03   # mqL2(MX)            
        43     2.70907000E+03   # mqL3(MX)            
        44     1.88705000E+03   # muR(MX)             
        45     1.88705000E+03   # mcR(MX)             
        46     3.95180000E+03   # mtR(MX)             
        47     3.49460000E+02   # mdR(MX)             
        48     3.49460000E+02   # msR(MX)             
        49     3.83727000E+03   # mbR(MX)             
#
BLOCK MASS  # Mass Spectrum
# PDG code           mass       particle
        24     8.03958591E+01   # W+
        25     1.26677117E+02   # h
        35     3.68264838E+03   # H
        36     3.68252995E+03   # A
        37     3.68368038E+03   # H+
         5     4.81876030E+00   # b-quark pole mass calculated from mb(mb)_Msbar
   1000001     2.88101929E+03   # ~d_L
   2000001     6.67863726E+02   # ~d_R
   1000002     2.88013368E+03   # ~u_L
   2000002     2.00034088E+03   # ~u_R
   1000003     2.88101929E+03   # ~s_L
   2000003     6.67863726E+02   # ~s_R
   1000004     2.88013368E+03   # ~c_L
   2000004     2.00034088E+03   # ~c_R
   1000005     2.77537417E+03   # ~b_1
   2000005     3.89451347E+03   # ~b_2
   1000006     2.76698854E+03   # ~t_1
   2000006     3.92218056E+03   # ~t_2
   1000011     2.66968850E+03   # ~e_L
   2000011     7.15753604E+02   # ~e_R
   1000012     2.66824760E+03   # ~nu_eL
   1000013     2.66968850E+03   # ~mu_L
   2000013     7.15753604E+02   # ~mu_R
   1000014     2.66824760E+03   # ~nu_muL
   1000015     6.32609867E+02   # ~tau_1
   2000015     2.91506789E+03   # ~tau_2
   1000016     2.91370629E+03   # ~nu_tauL
   1000021     2.33068922E+03   # ~g
   1000022     2.37363301E+02   # ~chi_10
   1000023    -2.33740330E+03   # ~chi_20
   1000025     2.75850941E+03   # ~chi_30
   1000035    -2.76180023E+03   # ~chi_40
   1000024     2.37525293E+02   # ~chi_1+
   1000037     2.76001156E+03   # ~chi_2+
#
BLOCK NMIX  # Neutralino Mixing Matrix
  1  1    -1.40475563E-04   # N_11
  1  2     9.99613287E-01   # N_12
  1  3     2.76581145E-02   # N_13
  1  4    -2.87844512E-03   # N_14
  2  1     9.96015583E-01   # N_21
  2  2     2.14768344E-03   # N_22
  2  3    -6.63669362E-02   # N_23
  2  4     5.95296158E-02   # N_24
  3  1     4.86786284E-03   # N_31
  3  2    -1.75194691E-02   # N_32
  3  3     7.06806567E-01   # N_33
  3  4     7.07173140E-01   # N_34
  4  1    -8.90462918E-02   # N_41
  4  2     2.14879533E-02   # N_42
  4  3    -7.03743516E-01   # N_43
  4  4     7.04524016E-01   # N_44
#
BLOCK UMIX  # Chargino Mixing Matrix U
  1  1     9.99235332E-01   # U_11
  1  2     3.90992477E-02   # U_12
  2  1    -3.90992477E-02   # U_21
  2  2     9.99235332E-01   # U_22
#
BLOCK VMIX  # Chargino Mixing Matrix V
  1  1     9.99991692E-01   # V_11
  1  2     4.07633910E-03   # V_12
  2  1     4.07633910E-03   # V_21
  2  2    -9.99991692E-01   # V_22
#
BLOCK STOPMIX  # Stop Mixing Matrix
  1  1     9.95985215E-01   # cos(theta_t)
  1  2    -8.95178837E-02   # sin(theta_t)
  2  1     8.95178837E-02   # -sin(theta_t)
  2  2     9.95985215E-01   # cos(theta_t)
#
BLOCK SBOTMIX  # Sbottom Mixing Matrix
  1  1     9.99989790E-01   # cos(theta_b)
  1  2    -4.51883788E-03   # sin(theta_b)
  2  1     4.51883788E-03   # -sin(theta_b)
  2  2     9.99989790E-01   # cos(theta_b)
#
BLOCK STAUMIX  # Stau Mixing Matrix
  1  1    -3.00122026E-03   # cos(theta_tau)
  1  2     9.99995496E-01   # sin(theta_tau)
  2  1    -9.99995496E-01   # -sin(theta_tau)
  2  2    -3.00122026E-03   # cos(theta_tau)
#
BLOCK ALPHA  # Higgs mixing
          -1.80999559E-01   # Mixing angle in the neutral Higgs boson sector
#
BLOCK HMIX Q=  3.27092500E+03  # DRbar Higgs Parameters
         1    -2.74784133E+03   # mu(Q)MSSM           
         2     5.47333958E+00   # tan                 
         3     2.42357413E+02   # higgs               
         4     1.35941076E+07   # mA^2(Q)MSSM         
#
BLOCK GAUGE Q=  3.27092500E+03  # The gauge couplings
     1     3.65381601E-01   # gprime(Q) DRbar
     2     6.40804511E-01   # g(Q) DRbar
     3     1.01558133E+00   # g3(Q) DRbar
#
BLOCK AU Q=  3.27092500E+03  # The trilinear couplings
  1  1     0.00000000E+00   # A_u(Q) DRbar
  2  2     0.00000000E+00   # A_c(Q) DRbar
  3  3     4.75961001E+03   # A_t(Q) DRbar
#
BLOCK AD Q=  3.27092500E+03  # The trilinear couplings
  1  1     0.00000000E+00   # A_d(Q) DRbar
  2  2     0.00000000E+00   # A_s(Q) DRbar
  3  3    -4.10489995E+02   # A_b(Q) DRbar
#
BLOCK AE Q=  3.27092500E+03  # The trilinear couplings
  1  1     0.00000000E+00   # A_e(Q) DRbar
  2  2     0.00000000E+00   # A_mu(Q) DRbar
  3  3    -1.34784000E+03   # A_tau(Q) DRbar
#
BLOCK Yu Q=  3.27092500E+03  # The Yukawa couplings
  1  1     0.00000000E+00   # y_u(Q) DRbar
  2  2     0.00000000E+00   # y_c(Q) DRbar
  3  3     8.47685967E-01   # y_t(Q) DRbar
#
BLOCK Yd Q=  3.27092500E+03  # The Yukawa couplings
  1  1     0.00000000E+00   # y_d(Q) DRbar
  2  2     0.00000000E+00   # y_s(Q) DRbar
  3  3     7.76623703E-02   # y_b(Q) DRbar
#
BLOCK Ye Q=  3.27092500E+03  # The Yukawa couplings
  1  1     0.00000000E+00   # y_e(Q) DRbar
  2  2     0.00000000E+00   # y_mu(Q) DRbar
  3  3     5.68112144E-02   # y_tau(Q) DRbar
#
BLOCK MSOFT Q=  3.27092500E+03  # The soft SUSY breaking masses at the scale Q
         1    -2.38561000E+03   # M_1(Q)              
         2     2.15040000E+02   # M_2(Q)              
         3     2.13882000E+03   # M_3(Q)              
        21     5.46752036E+06   # mH1^2(Q)            
        22    -6.98942643E+06   # mH2^2(Q)            
        31     2.66579000E+03   # meL(Q)              
        32     2.66579000E+03   # mmuL(Q)             
        33     2.91077000E+03   # mtauL(Q)            
        34     6.63210000E+02   # meR(Q)              
        35     6.63210000E+02   # mmuR(Q)             
        36     5.73490000E+02   # mtauR(Q)            
        41     2.79904999E+03   # mqL1(Q)             
        42     2.79904999E+03   # mqL2(Q)             
        43     2.70906999E+03   # mqL3(Q)             
        44     1.88704999E+03   # muR(Q)              
        45     1.88704999E+03   # mcR(Q)              
        46     3.95179999E+03   # mtR(Q)              
        47     3.49459953E+02   # mdR(Q)              
        48     3.49459953E+02   # msR(Q)              
        49     3.83727000E+03   # mbR(Q)              
#
Block HiggsBoundsInputHiggsCouplingsFermions
# ScalarNormEffCoupSq PseudoSNormEffCoupSq NP   IP1 IP2 IP2
    1.00316496E+00    0.00000000E+00        3  25   5   5  # h0-b-b eff. coupling^2, normalised to SM
    2.99542812E+01    0.00000000E+00        3  35   5   5  # H0-b-b eff. coupling^2, normalised to SM
    0.00000000E+00    2.99574462E+01        3  36   5   5  # A0-b-b eff. coupling^2, normalised to SM
#
    9.99894352E-01    0.00000000E+00        3  25   6   6  # h0-t-t eff. coupling^2, normalised to SM
    3.34863309E-02    0.00000000E+00        3  35   6   6  # H0-t-t eff. coupling^2, normalised to SM
    0.00000000E+00    3.33806825E-02        3  36   6   6  # A0-t-t eff. coupling^2, normalised to SM
#
    1.00316496E+00    0.00000000E+00        3  25  15  15  # h0-tau-tau eff. coupling^2, normalised to SM
    2.99542812E+01    0.00000000E+00        3  35  15  15  # H0-tau-tau eff. coupling^2, normalised to SM
    0.00000000E+00    2.99574462E+01        3  36  15  15  # A0-tau-tau eff. coupling^2, normalised to SM
#
Block HiggsBoundsInputHiggsCouplingsBosons
    9.99999917E-01        3  25  24  24  # h0-W-W eff. coupling^2, normalised to SM
    8.34655211E-08        3  35  24  24  # H0-W-W eff. coupling^2, normalised to SM
    0.00000000E+00        3  36  24  24  # A0-W-W eff. coupling^2, normalised to SM
#
    9.99999917E-01        3  25  23  23  # h0-Z-Z eff. coupling^2, normalised to SM
    8.34655211E-08        3  35  23  23  # H0-Z-Z eff. coupling^2, normalised to SM
    0.00000000E+00        3  36  23  23  # A0-Z-Z eff. coupling^2, normalised to SM
#
    8.88421667E-01        3  25  21  21  # h0-g-g eff. coupling^2, normalised to SM
    1.01575775E-12        3  35  21  21  # H0-g-g eff. coupling^2, normalised to SM
    2.46873158E-12        3  36  21  21  # A0-g-g eff. coupling^2, normalised to SM
#
    0.00000000E+00        3  25  25  23  # h0-h0-Z eff. coupling^2, normalised to SM
    0.00000000E+00        3  35  25  23  # H0-h0-Z eff. coupling^2, normalised to SM
    8.34655211E-08        3  36  25  23  # A0-h0-Z eff. coupling^2, normalised to SM
    0.00000000E+00        3  35  35  23  # H0-H0-Z eff. coupling^2, normalised to SM
    9.99999917E-01        3  36  35  23  # A0-H0-Z eff. coupling^2, normalised to SM
    0.00000000E+00        3  36  36  23  # A0-A0-Z eff. coupling^2, normalised to SM
#
    0.00000000E+00        4  25  21  21  23  # h0-g-g-Z eff. coupling^2, normalised to SM
    0.00000000E+00        4  35  21  21  23  # H0-g-g-Z eff. coupling^2, normalised to SM
    0.00000000E+00        4  36  21  21  23  # A0-g-g-Z eff. coupling^2, normalised to SM
#
#
#
#                             =================
#                             |The decay table|
#                             =================
#
# - The QCD corrections to the decays gluino -> squark  + quark
#                                     squark -> gaugino + quark_prime
#                                     squark -> squark_prime + Higgs
#                                     squark -> gluino  + quark
#   are included.
#
# - The multi-body decays for the inos, stops and sbottoms are included.
#
# - The loop induced decays for the gluino, neutralinos and stops
#   are included.
#
# - The SUSY decays of the top quark are included.
#
#
#         PDG            Width
DECAY         6     1.44591209E+00   # top decays
#          BR         NDA      ID1       ID2
     1.00000000E+00    2           5        24   # BR(t ->  b    W+)
#
#         PDG            Width
DECAY   1000021     8.67321176E+01   # gluino decays
#          BR         NDA      ID1       ID2
     2.30981151E-01    2     2000001        -1   # BR(~g -> ~d_R  db)
     2.30981151E-01    2    -2000001         1   # BR(~g -> ~d_R* d )
     1.90189445E-02    2     2000002        -2   # BR(~g -> ~u_R  ub)
     1.90189445E-02    2    -2000002         2   # BR(~g -> ~u_R* u )
     2.30981151E-01    2     2000003        -3   # BR(~g -> ~s_R  sb)
     2.30981151E-01    2    -2000003         3   # BR(~g -> ~s_R* s )
     1.90187531E-02    2     2000004        -4   # BR(~g -> ~c_R  cb)
     1.90187531E-02    2    -2000004         4   # BR(~g -> ~c_R* c )
#
#         PDG            Width
DECAY   1000006     4.39554798E+01   # stop1 decays
#          BR         NDA      ID1       ID2
     2.49401942E-01    2     1000022         6   # BR(~t_1 -> ~chi_10 t )
     1.68903052E-03    2     1000023         6   # BR(~t_1 -> ~chi_20 t )
     5.03128673E-01    2     1000024         5   # BR(~t_1 -> ~chi_1+ b )
     8.09460823E-08    2     1000037         5   # BR(~t_1 -> ~chi_2+ b )
     2.45780273E-01    2     1000021         6   # BR(~t_1 -> ~g      t )
#
#         PDG            Width
DECAY   2000006     2.03542872E+02   # stop2 decays
#          BR         NDA      ID1       ID2
     5.50719705E-04    2     1000022         6   # BR(~t_2 -> ~chi_10 t )
     1.79833754E-02    2     1000023         6   # BR(~t_2 -> ~chi_20 t )
     3.38117290E-02    2     1000025         6   # BR(~t_2 -> ~chi_30 t )
     3.58337625E-02    2     1000035         6   # BR(~t_2 -> ~chi_40 t )
     1.10647913E-03    2     1000024         5   # BR(~t_2 -> ~chi_1+ b )
     6.96828312E-02    2     1000037         5   # BR(~t_2 -> ~chi_2+ b )
     4.43453950E-01    2     1000021         6   # BR(~t_2 -> ~g      t )
     1.15883659E-01    2     1000006        25   # BR(~t_2 -> ~t_1    h )
     9.62669947E-02    2     1000006        23   # BR(~t_2 -> ~t_1    Z )
     1.85426499E-01    2     1000005        24   # BR(~t_2 -> ~b_1    W+)
#
#         PDG            Width
DECAY   1000005     4.65264693E+01   # sbottom1 decays
#          BR         NDA      ID1       ID2
     2.39939310E-01    2     1000022         5   # BR(~b_1 -> ~chi_10 b )
     7.24134937E-04    2     1000023         5   # BR(~b_1 -> ~chi_20 b )
     4.71488264E-07    2     1000025         5   # BR(~b_1 -> ~chi_30 b )
     4.15795680E-07    2     1000035         5   # BR(~b_1 -> ~chi_40 b )
     4.75758100E-01    2    -1000024         6   # BR(~b_1 -> ~chi_1- t )
     2.83577567E-01    2     1000021         5   # BR(~b_1 -> ~g      b )
#
#         PDG            Width
DECAY   2000005     8.91517307E+01   # sbottom2 decays
#          BR         NDA      ID1       ID2
     9.00665205E-09    2     1000022         5   # BR(~b_2 -> ~chi_10 b )
     1.04733486E-02    2     1000023         5   # BR(~b_2 -> ~chi_20 b )
     6.51258815E-04    2     1000025         5   # BR(~b_2 -> ~chi_30 b )
     6.96780514E-04    2     1000035         5   # BR(~b_2 -> ~chi_40 b )
     1.77657284E-08    2    -1000024         6   # BR(~b_2 -> ~chi_1- t )
     1.29883099E-03    2    -1000037         6   # BR(~b_2 -> ~chi_2- t )
     9.84753634E-01    2     1000021         5   # BR(~b_2 -> ~g      b )
     5.84635996E-04    2     1000005        25   # BR(~b_2 -> ~b_1    h )
     5.19525262E-04    2     1000005        23   # BR(~b_2 -> ~b_1    Z )
     1.02195885E-03    2     1000006       -24   # BR(~b_2 -> ~t_1    W-)
#
#         PDG            Width
DECAY   1000002     5.99386784E+01   # sup_L decays
#          BR         NDA      ID1       ID2
     1.84271323E-01    2     1000022         2   # BR(~u_L -> ~chi_10 u)
     8.24945644E-04    2     1000023         2   # BR(~u_L -> ~chi_20 u)
     3.84690459E-07    2     1000025         2   # BR(~u_L -> ~chi_30 u)
     2.76037884E-08    2     1000035         2   # BR(~u_L -> ~chi_40 u)
     3.68835013E-01    2     1000024         1   # BR(~u_L -> ~chi_1+ d)
     4.53347174E-08    2     1000037         1   # BR(~u_L -> ~chi_2+ d)
     4.46068261E-01    2     1000021         2   # BR(~u_L -> ~g      u)
#
#         PDG            Width
DECAY   2000002     1.48629445E-01   # sup_R decays
#           BR         NDA      ID1       ID2
     5.97987975E-07    2     1000022         2   # BR(~u_R -> ~chi_10 u)
#           BR         NDA      ID1       ID2       ID3
     1.33923665E-01    3        2       -1        2000001   # BR(~u_R -> u  db  ~d_R)
     3.59276051E-01    3        2       1        -2000001   # BR(~u_R -> u  d  ~d_R*)
     1.33540161E-01    3        2       -3        2000003   # BR(~u_R -> u  sb  ~s_R)
     3.58906003E-01    3        2       3        -2000003   # BR(~u_R -> u  s  ~s_R*)
     1.21597709E-03    3        2       -11        2000011   # BR(~u_R -> u  e+  ~e_R-)
     3.22984453E-03    3        2       11        -2000011   # BR(~u_R -> u  e-  ~e_R+)
     1.22647299E-03    3        2       -13        2000013   # BR(~u_R -> u  mu+  ~mu_R-)
     3.27499037E-03    3        2       13        -2000013   # BR(~u_R -> u  mu-  ~mu_R+)
     1.45287497E-03    3        2       -15        1000015   # BR(~u_R -> u  tau+  ~tau_1-)
     3.94719903E-03    3        2       15        -1000015   # BR(~u_R -> u  tau-  ~tau_1+)
     4.94417510E-07    3        2       23        1000022   # BR(~u_R -> u  Z  ~chi_10)
     1.53845693E-06    3        2       25        1000022   # BR(~u_R -> u  h  ~chi_10)
     2.35013998E-06    3        2       -24        1000024   # BR(~u_R -> u  W-  ~chi_1+)
     1.77952626E-06    3        2       24        -1000024   # BR(~u_R -> u  W+  ~chi_1-)
#
#         PDG            Width
DECAY   1000001     5.99860514E+01   # sdown_L decays
#          BR         NDA      ID1       ID2
     1.84204832E-01    2     1000022         1   # BR(~d_L -> ~chi_10 d)
     7.89804750E-04    2     1000023         1   # BR(~d_L -> ~chi_20 d)
     4.81397596E-07    2     1000025         1   # BR(~d_L -> ~chi_30 d)
     1.98180680E-06    2     1000035         1   # BR(~d_L -> ~chi_40 d)
     3.68105062E-01    2    -1000024         2   # BR(~d_L -> ~chi_1- u)
     4.22542370E-06    2    -1000037         2   # BR(~d_L -> ~chi_2- u)
     4.46893613E-01    2     1000021         1   # BR(~d_L -> ~g      d)
#
#         PDG            Width
DECAY   2000001     6.40833167E-09   # sdown_R decays
#           BR         NDA      ID1       ID2
     9.66252390E-01    2     1000022         1   # BR(~d_R -> ~chi_10 d)
#           BR         NDA      ID1       ID2       ID3
     1.45838269E-04    3        1       -15        1000015   # BR(~d_R -> d  tau+  ~tau_1-)
     1.87427877E-03    3        1       15        -1000015   # BR(~d_R -> d  tau-  ~tau_1+)
     6.19084686E-04    3        1       23        1000022   # BR(~d_R -> d  Z  ~chi_10)
     7.10918260E-03    3        1       25        1000022   # BR(~d_R -> d  h  ~chi_10)
     1.15125127E-02    3        1       -24        1000024   # BR(~d_R -> d  W-  ~chi_1+)
     1.24867133E-02    3        1       24        -1000024   # BR(~d_R -> d  W+  ~chi_1-)
#
#         PDG            Width
DECAY   1000004     5.36284200E+01   # scharm_L decays
#          BR         NDA      ID1       ID2
     2.16217003E-01    2     1000022         4   # BR(~c_L -> ~chi_10 c)
     9.37013849E-04    2     1000023         4   # BR(~c_L -> ~chi_20 c)
     4.12842866E-07    2     1000025         4   # BR(~c_L -> ~chi_30 c)
     2.95894106E-08    2     1000035         4   # BR(~c_L -> ~chi_40 c)
     4.32776755E-01    2     1000024         3   # BR(~c_L -> ~chi_1+ s)
     4.86309749E-08    2     1000037         3   # BR(~c_L -> ~chi_2+ s)
     3.50068737E-01    2     1000021         4   # BR(~c_L -> ~g      c)
#
#         PDG            Width
DECAY   2000004     1.48626654E-01   # scharm_R decays
#           BR         NDA      ID1       ID2
     6.09484177E-07    2     1000022         4   # BR(~c_R -> ~chi_10 c)
#           BR         NDA      ID1       ID2       ID3
     1.33892538E-01    3        4       -1        2000001   # BR(~c_R -> c  db  ~d_R)
     3.59693221E-01    3        4       1        -2000001   # BR(~c_R -> c  d  ~d_R*)
     1.33401375E-01    3        4       -3        2000003   # BR(~c_R -> c  sb  ~s_R)
     3.58677252E-01    3        4       3        -2000003   # BR(~c_R -> c  s  ~s_R*)
     1.21505796E-03    3        4       -11        2000011   # BR(~c_R -> c  e+  ~e_R-)
     3.21564124E-03    3        4       11        -2000011   # BR(~c_R -> c  e-  ~e_R+)
     1.22683243E-03    3        4       -13        2000013   # BR(~c_R -> c  mu+  ~mu_R-)
     3.24827335E-03    3        4       13        -2000013   # BR(~c_R -> c  mu-  ~mu_R+)
     1.44529930E-03    3        4       -15        1000015   # BR(~c_R -> c  tau+  ~tau_1-)
     3.97775219E-03    3        4       15        -1000015   # BR(~c_R -> c  tau-  ~tau_1+)
     4.97864937E-07    3        4       23        1000022   # BR(~c_R -> c  Z  ~chi_10)
     1.54191723E-06    3        4       25        1000022   # BR(~c_R -> c  h  ~chi_10)
     2.33625658E-06    3        4       -24        1000024   # BR(~c_R -> c  W-  ~chi_1+)
     1.77249499E-06    3        4       24        -1000024   # BR(~c_R -> c  W+  ~chi_1-)
#
#         PDG            Width
DECAY   1000003     5.36535058E+01   # sstrange_L decays
#          BR         NDA      ID1       ID2
     2.16207414E-01    2     1000022         3   # BR(~s_L -> ~chi_10 s)
     8.97426991E-04    2     1000023         3   # BR(~s_L -> ~chi_20 s)
     5.16992820E-07    2     1000025         3   # BR(~s_L -> ~chi_30 s)
     2.12589755E-06    2     1000035         3   # BR(~s_L -> ~chi_40 s)
     4.32056617E-01    2    -1000024         4   # BR(~s_L -> ~chi_1- c)
     4.53509781E-06    2    -1000037         4   # BR(~s_L -> ~chi_2- c)
     3.50831364E-01    2     1000021         3   # BR(~s_L -> ~g      s)
#
#         PDG            Width
DECAY   2000003     6.15387103E-09   # sstrange_R decays
#           BR         NDA      ID1       ID2
     9.64856612E-01    2     1000022         3   # BR(~s_R -> ~chi_10 s)
#           BR         NDA      ID1       ID2       ID3
     1.50731141E-04    3        3       -15        1000015   # BR(~s_R -> s  tau+  ~tau_1-)
     1.95600459E-03    3        3       15        -1000015   # BR(~s_R -> s  tau-  ~tau_1+)
     6.44683644E-04    3        3       23        1000022   # BR(~s_R -> s  Z  ~chi_10)
     7.40899505E-03    3        3       25        1000022   # BR(~s_R -> s  h  ~chi_10)
     1.19939140E-02    3        3       -24        1000024   # BR(~s_R -> s  W-  ~chi_1+)
     1.29890600E-02    3        3       24        -1000024   # BR(~s_R -> s  W+  ~chi_1-)
#
#         PDG            Width
DECAY   1000011     3.23486058E+01   # selectron_L decays
#          BR         NDA      ID1       ID2
     3.31479891E-01    2     1000022        11   # BR(~e_L -> ~chi_10 e-)
     5.96980362E-03    2     1000023        11   # BR(~e_L -> ~chi_20 e-)
     6.62550305E-01    2    -1000024        12   # BR(~e_L -> ~chi_1- nu_e)
#
#         PDG            Width
DECAY   2000011     6.99910133E-08   # selectron_R decays
#           BR         NDA      ID1       ID2
     8.49139847E-01    2     1000022        11   # BR(~e_R -> ~chi_10 e-)
#           BR         NDA      ID1       ID2       ID3
     1.87981276E-04    3        11       -1        2000001   # BR(~e_R- -> e-  db  ~d_R)
     2.17656514E-03    3        11       1        -2000001   # BR(~e_R- -> e-  d  ~d_R*)
     1.86109607E-04    3        11       -3        2000003   # BR(~e_R- -> e-  sb  ~s_R)
     2.11727182E-03    3        11       3        -2000003   # BR(~e_R- -> e-  s  ~s_R*)
     8.09003861E-03    3        11       -15        1000015   # BR(~e_R- -> e-  tau+  ~tau_1-)
     9.75982441E-02    3        11       15        -1000015   # BR(~e_R- -> e-  tau-  ~tau_1+)
     1.32905634E-03    3        11       23        1000022   # BR(~e_R- -> e-  Z  ~chi_10)
     9.26104609E-03    3        11       25        1000022   # BR(~e_R- -> e-  h  ~chi_10)
     1.43775601E-02    3        11       -24        1000024   # BR(~e_R- -> e-  W-  ~chi_1+)
     1.55362803E-02    3        11       24        -1000024   # BR(~e_R- -> e-  W+  ~chi_1-)
#
#         PDG            Width
DECAY   1000013     3.23486058E+01   # smuon_L decays
#          BR         NDA      ID1       ID2
     3.31479890E-01    2     1000022        13   # BR(~mu_L -> ~chi_10 mu-)
     5.96980329E-03    2     1000023        13   # BR(~mu_L -> ~chi_20 mu-)
     6.62550306E-01    2    -1000024        14   # BR(~mu_L -> ~chi_1- nu_mu)
#
#         PDG            Width
DECAY   2000013     6.99430890E-08   # smuon_R decays
#           BR         NDA      ID1       ID2
     8.49721622E-01    2     1000022        13   # BR(~mu_R -> ~chi_10 mu-)
#           BR         NDA      ID1       ID2       ID3
     1.86565967E-04    3        13       -1        2000001   # BR(~mu_R- -> mu-  db  ~d_R)
     2.15132048E-03    3        13       1        -2000001   # BR(~mu_R- -> mu-  d  ~d_R*)
     1.87295131E-04    3        13       -3        2000003   # BR(~mu_R- -> mu-  sb  ~s_R)
     2.10056493E-03    3        13       3        -2000003   # BR(~mu_R- -> mu-  s  ~s_R*)
     8.13718708E-03    3        13       -15        1000015   # BR(~mu_R- -> mu-  tau+  ~tau_1-)
     9.71175294E-02    3        13       15        -1000015   # BR(~mu_R- -> mu-  tau-  ~tau_1+)
     1.33229746E-03    3        13       23        1000022   # BR(~mu_R- -> mu-  Z  ~chi_10)
     9.24565971E-03    3        13       25        1000022   # BR(~mu_R- -> mu-  h  ~chi_10)
     1.43345113E-02    3        13       -24        1000024   # BR(~mu_R- -> mu-  W-  ~chi_1+)
     1.54854470E-02    3        13       24        -1000024   # BR(~mu_R- -> mu-  W+  ~chi_1-)
#
#         PDG            Width
DECAY   1000015     2.39263681E-04   # stau_1 decays
#          BR         NDA      ID1       ID2
     3.33765741E-01    2     1000022        15   # BR(~tau_1 -> ~chi_10  tau-)
     6.66234259E-01    2    -1000024        16   # BR(~tau_1 -> ~chi_1-  nu_tau)
#
#         PDG            Width
DECAY   2000015     3.58224173E+01   # stau_2 decays
#          BR         NDA      ID1       ID2
     3.27682765E-01    2     1000022        15   # BR(~tau_2 -> ~chi_10  tau-)
     1.37742055E-02    2     1000023        15   # BR(~tau_2 -> ~chi_20  tau-)
     2.92410934E-05    2     1000025        15   # BR(~tau_2 -> ~chi_30  tau-)
     3.00478549E-05    2     1000035        15   # BR(~tau_2 -> ~chi_40  tau-)
     6.54955217E-01    2    -1000024        16   # BR(~tau_2 -> ~chi_1-  nu_tau)
     1.10464451E-05    2    -1000037        16   # BR(~tau_2 -> ~chi_2-  nu_tau)
     1.76938151E-03    2     1000015        25   # BR(~tau_2 -> ~tau_1   h)
     1.74809578E-03    2     1000015        23   # BR(~tau_2 -> ~tau_1   Z)
#
#         PDG            Width
DECAY   1000012     3.23622245E+01   # snu_eL decays
#          BR         NDA      ID1       ID2
     3.31262021E-01    2     1000022        12   # BR(~nu_eL -> ~chi_10 nu_e)
     5.83292653E-03    2     1000023        12   # BR(~nu_eL -> ~chi_20 nu_e)
     6.62905053E-01    2     1000024        11   # BR(~nu_eL -> ~chi_1+ e-)
#
#         PDG            Width
DECAY   1000014     3.23622245E+01   # snu_muL decays
#          BR         NDA      ID1       ID2
     3.31262021E-01    2     1000022        14   # BR(~nu_muL -> ~chi_10 nu_mu)
     5.83292654E-03    2     1000023        14   # BR(~nu_muL -> ~chi_20 nu_mu)
     6.62905052E-01    2     1000024        13   # BR(~nu_muL -> ~chi_1+ mu-)
#
#         PDG            Width
DECAY   1000016     3.58322826E+01   # snu_tauL decays
#          BR         NDA      ID1       ID2
     3.27546261E-01    2     1000022        16   # BR(~nu_tauL -> ~chi_10 nu_tau)
     1.35091165E-02    2     1000023        16   # BR(~nu_tauL -> ~chi_20 nu_tau)
     1.47093235E-06    2     1000025        16   # BR(~nu_tauL -> ~chi_30 nu_tau)
     1.78859539E-05    2     1000035        16   # BR(~nu_tauL -> ~chi_40 nu_tau)
     6.55479416E-01    2     1000024        15   # BR(~nu_tauL -> ~chi_1+ tau-)
     5.51711248E-05    2     1000037        15   # BR(~nu_tauL -> ~chi_2+ tau-)
     3.39067802E-03    2    -1000015       -24   # BR(~nu_tauL -> ~tau_1+ W-)
#
#         PDG            Width
DECAY   1000024     3.30136700E-15   # chargino1+ decays
#           BR         NDA      ID1       ID2       ID3
     1.97458800E-02    3     1000022       -11        12   # BR(~chi_1+ -> ~chi_10 e+   nu_e)
     2.05355180E-03    3     1000022       -13        14   # BR(~chi_1+ -> ~chi_10 mu+  nu_mu)
     9.78200570E-01    2     1000022       211             # BR(~chi_1+ -> ~chi_10 pi+)
#
#         PDG            Width
DECAY   1000037     1.66555892E+01   # chargino2+ decays
#          BR         NDA      ID1       ID2
     4.80910895E-08    2     1000012       -11   # BR(~chi_2+ -> ~nu_eL   e+  )
     4.80910895E-08    2     1000014       -13   # BR(~chi_2+ -> ~nu_muL mu+ )
     4.28888431E-06    2    -1000011        12   # BR(~chi_2+ -> ~e_L+    nu_e)
     4.28888431E-06    2    -1000013        14   # BR(~chi_2+ -> ~mu_L+   nu_mu)
     4.75582351E-03    2    -1000015        16   # BR(~chi_2+ -> ~tau_1+  nu_tau)
     3.10017334E-01    2     1000024        23   # BR(~chi_2+ -> ~chi_1+  Z )
     3.01202640E-01    2     1000022        24   # BR(~chi_2+ -> ~chi_10  W+)
     6.79776547E-02    2     1000023        24   # BR(~chi_2+ -> ~chi_20  W+)
     3.16037875E-01    2     1000024        25   # BR(~chi_2+ -> ~chi_1+  h )
#
#         PDG            Width
DECAY   1000022     0.00000000E+00   # neutralino1 decays
#
#         PDG            Width
DECAY   1000023     3.99242438E+01   # neutralino2 decays
#          BR         NDA      ID1       ID2
     2.79239501E-04    2     1000022        23   # BR(~chi_20 -> ~chi_10   Z )
     7.84270167E-04    2     1000024       -24   # BR(~chi_20 -> ~chi_1+   W-)
     7.84270167E-04    2    -1000024        24   # BR(~chi_20 -> ~chi_1-   W+)
     5.32330658E-04    2     1000022        25   # BR(~chi_20 -> ~chi_10   h )
     1.46930299E-02    2     2000002        -2   # BR(~chi_20 -> ~u_R      ub)
     1.46930299E-02    2    -2000002         2   # BR(~chi_20 -> ~u_R*     u )
     4.17753851E-02    2     2000001        -1   # BR(~chi_20 -> ~d_R      db)
     4.17753851E-02    2    -2000001         1   # BR(~chi_20 -> ~d_R*     d )
     1.46928887E-02    2     2000004        -4   # BR(~chi_20 -> ~c_R      cb)
     1.46928887E-02    2    -2000004         4   # BR(~chi_20 -> ~c_R*     c )
     4.17753851E-02    2     2000003        -3   # BR(~chi_20 -> ~s _R      sb)
     4.17753851E-02    2    -2000003         3   # BR(~chi_20 -> ~s _R*     s )
     1.26686530E-01    2     2000011       -11   # BR(~chi_20 -> ~e_R-     e+)
     1.26686530E-01    2    -2000011        11   # BR(~chi_20 -> ~e_R+     e-)
     1.26686530E-01    2     2000013       -13   # BR(~chi_20 -> ~mu_R-    mu+)
     1.26686530E-01    2    -2000013        13   # BR(~chi_20 -> ~mu_R+    mu-)
     1.32500196E-01    2     1000015       -15   # BR(~chi_20 -> ~tau_1-   tau+)
     1.32500196E-01    2    -1000015        15   # BR(~chi_20 -> ~tau_1+   tau-)
#
#         PDG            Width
DECAY   1000025     1.64829417E+01   # neutralino3 decays
#          BR         NDA      ID1       ID2
     1.88947479E-01    2     1000022        23   # BR(~chi_30 -> ~chi_10   Z )
     6.85569078E-02    2     1000023        23   # BR(~chi_30 -> ~chi_20   Z )
     3.04318354E-01    2     1000024       -24   # BR(~chi_30 -> ~chi_1+   W-)
     3.04318354E-01    2    -1000024        24   # BR(~chi_30 -> ~chi_1-   W+)
     1.28759765E-01    2     1000022        25   # BR(~chi_30 -> ~chi_10   h )
     2.03218114E-04    2     1000023        25   # BR(~chi_30 -> ~chi_20   h )
     3.07129920E-06    2     2000002        -2   # BR(~chi_30 -> ~u_R      ub)
     3.07129920E-06    2    -2000002         2   # BR(~chi_30 -> ~u_R*     u )
     2.97090917E-06    2     2000001        -1   # BR(~chi_30 -> ~d_R      db)
     2.97090917E-06    2    -2000001         1   # BR(~chi_30 -> ~d_R*     d )
     3.07129423E-06    2     2000004        -4   # BR(~chi_30 -> ~c_R      cb)
     3.07129423E-06    2    -2000004         4   # BR(~chi_30 -> ~c_R*     c )
     2.97090917E-06    2     2000003        -3   # BR(~chi_30 -> ~s _R      sb)
     2.97090917E-06    2    -2000003         3   # BR(~chi_30 -> ~s _R*     s )
     2.98281894E-07    2     1000011       -11   # BR(~chi_30 -> ~e_L-     e+)
     2.98281894E-07    2    -1000011        11   # BR(~chi_30 -> ~e_L+     e-)
     9.16221167E-06    2     2000011       -11   # BR(~chi_30 -> ~e_R-     e+)
     9.16221167E-06    2    -2000011        11   # BR(~chi_30 -> ~e_R+     e-)
     2.98281894E-07    2     1000013       -13   # BR(~chi_30 -> ~mu_L-    mu+)
     2.98281894E-07    2    -1000013        13   # BR(~chi_30 -> ~mu_L+    mu-)
     9.16221167E-06    2     2000013       -13   # BR(~chi_30 -> ~mu_R-    mu+)
     9.16221167E-06    2    -2000013        13   # BR(~chi_30 -> ~mu_R+    mu-)
     2.41578893E-03    2     1000015       -15   # BR(~chi_30 -> ~tau_1-   tau+)
     2.41578893E-03    2    -1000015        15   # BR(~chi_30 -> ~tau_1+   tau-)
     5.83356097E-07    2     1000012       -12   # BR(~chi_30 -> ~nu_eL    nu_eb)
     5.83356097E-07    2    -1000012        12   # BR(~chi_30 -> ~nu_eL*   nu_e )
     5.83356097E-07    2     1000014       -14   # BR(~chi_30 -> ~nu_muL   nu_mub)
     5.83356097E-07    2    -1000014        14   # BR(~chi_30 -> ~nu_muL*  nu_mu )
#
#         PDG            Width
DECAY   1000035     1.67414467E+01   # neutralino4 decays
#          BR         NDA      ID1       ID2
     1.21699148E-01    2     1000022        23   # BR(~chi_40 -> ~chi_10   Z )
     2.26471825E-04    2     1000023        23   # BR(~chi_40 -> ~chi_20   Z )
     2.97591044E-01    2     1000024       -24   # BR(~chi_40 -> ~chi_1+   W-)
     2.97591044E-01    2    -1000024        24   # BR(~chi_40 -> ~chi_1-   W+)
     1.86491051E-01    2     1000022        25   # BR(~chi_40 -> ~chi_10   h )
     6.53674787E-02    2     1000023        25   # BR(~chi_40 -> ~chi_20   h )
     1.01835425E-03    2     2000002        -2   # BR(~chi_40 -> ~u_R      ub)
     1.01835425E-03    2    -2000002         2   # BR(~chi_40 -> ~u_R*     u )
     9.80252254E-04    2     2000001        -1   # BR(~chi_40 -> ~d_R      db)
     9.80252254E-04    2    -2000001         1   # BR(~chi_40 -> ~d_R*     d )
     1.01835262E-03    2     2000004        -4   # BR(~chi_40 -> ~c_R      cb)
     1.01835262E-03    2    -2000004         4   # BR(~chi_40 -> ~c_R*     c )
     9.80252254E-04    2     2000003        -3   # BR(~chi_40 -> ~s _R      sb)
     9.80252254E-04    2    -2000003         3   # BR(~chi_40 -> ~s _R*     s )
     1.24315506E-06    2     1000011       -11   # BR(~chi_40 -> ~e_L-     e+)
     1.24315506E-06    2    -1000011        11   # BR(~chi_40 -> ~e_L+     e-)
     3.02318120E-03    2     2000011       -11   # BR(~chi_40 -> ~e_R-     e+)
     3.02318120E-03    2    -2000011        11   # BR(~chi_40 -> ~e_R+     e-)
     1.24315506E-06    2     1000013       -13   # BR(~chi_40 -> ~mu_L-    mu+)
     1.24315506E-06    2    -1000013        13   # BR(~chi_40 -> ~mu_L+    mu-)
     3.02318120E-03    2     2000013       -13   # BR(~chi_40 -> ~mu_R-    mu+)
     3.02318120E-03    2    -2000013        13   # BR(~chi_40 -> ~mu_R+    mu-)
     5.45521382E-03    2     1000015       -15   # BR(~chi_40 -> ~tau_1-   tau+)
     5.45521382E-03    2    -1000015        15   # BR(~chi_40 -> ~tau_1+   tau-)
     7.80340220E-06    2     1000012       -12   # BR(~chi_40 -> ~nu_eL    nu_eb)
     7.80340220E-06    2    -1000012        12   # BR(~chi_40 -> ~nu_eL*   nu_e )
     7.80340220E-06    2     1000014       -14   # BR(~chi_40 -> ~nu_muL   nu_mub)
     7.80340220E-06    2    -1000014        14   # BR(~chi_40 -> ~nu_muL*  nu_mu )
#
#         PDG            Width
DECAY        25     4.18852963E-03   # h decays
#          BR         NDA      ID1       ID2
     5.61473861E-01    2           5        -5   # BR(h -> b       bb     )
     6.28040551E-02    2         -15        15   # BR(h -> tau+    tau-   )
     2.22296243E-04    2         -13        13   # BR(h -> mu+     mu-    )
     2.42087145E-04    2           3        -3   # BR(h -> s       sb     )
     2.09270777E-02    2           4        -4   # BR(h -> c       cb     )
     7.92345551E-02    2          21        21   # BR(h -> g       g      )
     2.37023256E-03    2          22        22   # BR(h -> gam     gam    )
     1.72793899E-03    2          22        23   # BR(h -> Z       gam    )
     2.40213489E-01    2          24       -24   # BR(h -> W+      W-     )
     3.07844065E-02    2          23        23   # BR(h -> Z       Z      )
#
#         PDG            Width
DECAY        35     1.44075231E+01   # H decays
#          BR         NDA      ID1       ID2
     9.01192650E-02    2           5        -5   # BR(H -> b       bb     )
     1.59175123E-02    2         -15        15   # BR(H -> tau+    tau-   )
     5.62883459E-05    2         -13        13   # BR(H -> mu+     mu-    )
     4.03382015E-05    2           3        -3   # BR(H -> s       sb     )
     3.41914944E-06    2           4        -4   # BR(H -> c       cb     )
     3.37243467E-01    2           6        -6   # BR(H -> t       tb     )
     1.41965948E-04    2          21        21   # BR(H -> g       g      )
     3.52727169E-07    2          22        22   # BR(H -> gam     gam    )
     2.28504372E-07    2          23        22   # BR(H -> Z       gam    )
     9.31083939E-05    2          24       -24   # BR(H -> W+      W-     )
     4.64713294E-05    2          23        23   # BR(H -> Z       Z      )
     3.48552721E-04    2          25        25   # BR(H -> h       h      )
     3.00992552E-03    2     1000024  -1000024   # BR(H -> ~chi_1+ ~chi_1-)
     1.83251768E-01    2     1000024  -1000037   # BR(H -> ~chi_1+ ~chi_2-)
     1.83251768E-01    2     1000037  -1000024   # BR(H -> ~chi_2+ ~chi_1-)
     1.50533347E-03    2     1000022   1000022   # BR(H -> ~chi_10 ~chi_10)
     2.02944845E-03    2     1000022   1000023   # BR(H -> ~chi_10 ~chi_20)
     1.04976292E-01    2     1000022   1000025   # BR(H -> ~chi_10 ~chi_30)
     7.70857639E-02    2     1000022   1000035   # BR(H -> ~chi_10 ~chi_40)
     3.29971440E-06    2     2000001  -2000001   # BR(H -> ~d_R    ~d_R*  )
     3.29971440E-06    2     2000003  -2000003   # BR(H -> ~s_R    ~s_R*  )
     9.78712467E-06    2     2000011  -2000011   # BR(H -> ~e_R-   ~e_R+  )
     9.78712467E-06    2     2000013  -2000013   # BR(H -> ~mu_R-  ~mu_R+ )
     7.92205971E-06    2     1000015  -1000015   # BR(H -> ~tau_1- ~tau_1+)
     4.22317592E-04    2     1000015  -2000015   # BR(H -> ~tau_1- ~tau_2+)
     4.22317592E-04    2     2000015  -1000015   # BR(H -> ~tau_2- ~tau_1+)
#
#         PDG            Width
DECAY        36     1.44223404E+01   # A decays
#          BR         NDA      ID1       ID2
     9.01154084E-02    2           5        -5   # BR(A -> b       bb     )
     1.59023398E-02    2         -15        15   # BR(A -> tau+    tau-   )
     5.62346391E-05    2         -13        13   # BR(A -> mu+     mu-    )
     4.03939580E-05    2           3        -3   # BR(A -> s       sb     )
     3.43639546E-06    2           4        -4   # BR(A -> c       cb     )
     3.37715743E-01    2           6        -6   # BR(A -> t       tb     )
     2.21067058E-04    2          21        21   # BR(A -> g       g      )
     4.56458672E-07    2          22        22   # BR(A -> gam     gam    )
     3.05105201E-07    2          23        22   # BR(A -> Z       gam    )
     9.43301079E-05    2          23        25   # BR(A -> Z       h      )
     3.30008296E-03    2     1000024  -1000024   # BR(A -> ~chi_1+ ~chi_1-)
     1.83030469E-01    2     1000024  -1000037   # BR(A -> ~chi_1+ ~chi_2-)
     1.83030469E-01    2     1000037  -1000024   # BR(A -> ~chi_2+ ~chi_1-)
     1.65028306E-03    2     1000022   1000022   # BR(A -> ~chi_10 ~chi_10)
     2.67385398E-03    2     1000022   1000023   # BR(A -> ~chi_10 ~chi_20)
     7.85463309E-02    2     1000022   1000025   # BR(A -> ~chi_10 ~chi_30)
     1.02775909E-01    2     1000022   1000035   # BR(A -> ~chi_10 ~chi_40)
     4.21444170E-04    2     1000015  -2000015   # BR(A -> ~tau_1- ~tau_2+)
     4.21444170E-04    2    -1000015   2000015   # BR(A -> ~tau_1+ ~tau_2-)
#
#         PDG            Width
DECAY        37     1.43367595E+01   # H+ decays
#          BR         NDA      ID1       ID2
     1.54681430E-04    2           4        -5   # BR(H+ -> c       bb     )
     1.60022638E-02    2         -15        16   # BR(H+ -> tau+    nu_tau )
     5.65879952E-05    2         -13        14   # BR(H+ -> mu+     nu_mu  )
     1.54675734E-06    2           2        -5   # BR(H+ -> u       bb     )
     2.03101375E-06    2           2        -3   # BR(H+ -> u       sb     )
     4.32928689E-05    2           4        -3   # BR(H+ -> c       sb     )
     4.26217097E-01    2           6        -5   # BR(H+ -> t       bb     )
     9.50215304E-05    2          24        25   # BR(H+ -> W+      h      )
     1.84945354E-13    2          24        36   # BR(H+ -> W+      A      )
     1.23211407E-11    2     1000024   1000022   # BR(H+ -> ~chi_1+ ~chi_10)
     4.74558428E-03    2     1000024   1000023   # BR(H+ -> ~chi_1+ ~chi_20)
     1.85154402E-01    2     1000024   1000025   # BR(H+ -> ~chi_1+ ~chi_30)
     1.81724737E-01    2     1000024   1000035   # BR(H+ -> ~chi_1+ ~chi_40)
     1.84947691E-01    2     1000037   1000022   # BR(H+ -> ~chi_2+ ~chi_10)
     8.55063711E-04    2    -1000015   1000016   # BR(H+ -> ~tau_1+ ~nu_tauL)
