#=====================================================================
#  ISAJET SUSY parameters in SUSY Les Houches Accord format
#   Created from isa.wig and isa.out by isa2lha.py (b.k.gjelsten@fys.uio.no)
#===================================================================== SPINFO
Block SPINFO   # Program information
     1   ISASUSY FROM ISAJET            # Spectrum Calculator
     2   V7.80   29-OCT-2009 12:50:36   # Version
#===================================================================== MODSEL
Block MODSEL   # Model selection
     1     0   # General MSSM Simulation
#===================================================================== SMINPUTS
Block SMINPUTS   # Standard Model inputs
     1     1.28040973e+02   # alpha_em^{-1}
     3     1.20000000e-01   # alpha_s(m_Z)
     6     1.72500000e+02   # m_{top}(pole)
#===================================================================== MINPAR
Block MINPAR   # SUSY breaking input parameters
     3     6.00000000e+00   # tan(beta)
#===================================================================== MASS
Block MASS   # Scalar and gaugino mass spectrum
# PDG code     mass               particle
        25     1.19696900e+02   # h
        35     1.00709610e+03   # H
        36     1.00000000e+03   # A
        37     1.00966180e+03   # H+
   1000001     3.00055370e+03   # dL
   1000002     2.99954740e+03   # uL
   1000003     3.00055370e+03   # sL
   1000004     2.99954790e+03   # cL
   1000005     2.99887080e+03   # b1
   1000006     2.83507520e+03   # t1
   1000011     3.00035110e+03   # eL
   1000012     2.99934470e+03   # snue
   1000013     3.00035110e+03   # muL
   1000014     2.99934470e+03   # snum
   1000015     1.92396700e+02   # ta1
   1000016     2.99934470e+03   # snut
   1000021     3.00000000e+03   # gl
   1000022     9.80980000e+01   # N1
   1000023     2.86644400e+02   # N2
   1000024     2.86468000e+02   # C1
   1000025    -5.53592400e+02   # N3
   1000035     5.68850000e+02   # N4
   1000037     5.68657800e+02   # C2
   2000001     3.00010130e+03   # dR
   2000002     2.99979740e+03   # uR
   2000003     3.00010130e+03   # sR
   2000004     2.99979760e+03   # cR
   2000005     3.00178590e+03   # b2
   2000006     3.16145290e+03   # t2
   2000011     1.92400400e+02   # eR
   2000013     1.92400400e+02   # muR
   2000015     3.00036500e+03   # ta2
#===================================================================== ALPHA
Block ALPHA   # Effective Higgs mixing parameter
          -1.68787110e-01   # alpha_h
#===================================================================== STOPMIX
Block STOPMIX   # stop mixing matrix
  1  1     7.07377130e-01   # O_{11}
  1  2    -7.06836329e-01   # O_{12}
  2  1     7.06836329e-01   # O_{21}
  2  2     7.07377130e-01   # O_{22}
#===================================================================== SBOTMIX
Block SBOTMIX   # sbottom mixing matrix
  1  1     6.49735990e-01   # O_{11}
  1  2     7.60159946e-01   # O_{12}
  2  1    -7.60159946e-01   # O_{21}
  2  2     6.49735990e-01   # O_{22}
#===================================================================== STAUMIX
Block STAUMIX   # stau mixing matrix
  1  1    -4.32051034e-08   # O_{11}
  1  2    -1.00000000e+00   # O_{12}
  2  1     1.00000000e+00   # O_{21}
  2  2    -4.32051034e-08   # O_{22}
#===================================================================== NMIX
Block NMIX   # neutralino mixing matrix
  1  1     9.95677650e-01   # 
  1  2    -1.70652500e-02   # 
  1  3     8.65663400e-02   # 
  1  4    -2.90053600e-02   # 
  2  1    -3.81339200e-02   # 
  2  2    -9.69620590e-01   # 
  2  3     2.04171720e-01   # 
  2  4    -1.29213470e-01   # 
  3  1     3.94686300e-02   # 
  3  2    -5.49848600e-02   # 
  3  3    -7.02262940e-01   # 
  3  4    -7.08693270e-01   # 
  4  1    -7.49285400e-02   # 
  4  2     2.37743420e-01   # 
  4  3     6.76496390e-01   # 
  4  4    -6.92976770e-01   # 
#===================================================================== UMIX
Block UMIX   # chargino U mixing matrix
  1  1    -9.56532480e-01   # Umix_{11}
  1  2     2.91625740e-01   # Umix_{12}
  2  1    -2.91625740e-01   # Umix_{21}
  2  2    -9.56532480e-01   # Umix_{22}
#===================================================================== VMIX
Block VMIX   # chargino V mixing matrix
  1  1    -9.82681750e-01   # Vmix_{11}
  1  2     1.85301240e-01   # Vmix_{12}
  2  1    -1.85301240e-01   # Vmix_{21}
  2  2    -9.82681750e-01   # Vmix_{22}
#===================================================================== HMIX
Block HMIX  Q= 3.000e+03   # Higgs mixing parameters
     1     5.50000000e+02   # mu(Q)
     2     6.00000000e+00   # tan(beta)(M_{GUT})
     4     1.00000000e+06   # m_A^2(Q)
#===================================================================== MSOFT
Block MSOFT  Q=  3.000e+03   # DRbar SUSY breaking parameters
     1     1.00000000e+02   # M1
     2     3.00000000e+02   # M2
     3     3.00000000e+03   # not M3 but m(gluino) ...
    31     3.00000000e+03   # m_L1 (m_eL)
    32     3.00000000e+03   # m_L2 (m_muL)
    33     3.00000000e+03   # m_L3 (m_tauL)
    34     1.87600000e+02   # m_eR
    35     1.87600000e+02   # m_muR
    36     1.87800000e+02   # m_tauR
    41     3.00000000e+03   # m_Q1
    42     3.00000000e+03   # m_Q2
    43     3.00000000e+03   # m_Q3
    44     3.00000000e+03   # m_uR
    45     3.00000000e+03   # m_cR
    46     3.00000000e+03   # m_tR
    47     3.00000000e+03   # m_dR
    48     3.00000000e+03   # m_sR
    49     3.00000000e+03   # m_bR
#===================================================================== AU
Block AU  Q=  3.000e+03   #
  1  1     7.34850000e+03   # A_u
  2  2     7.34850000e+03   # A_c
  3  3     7.34850000e+03   # A_t
#===================================================================== AD
Block AD  Q=  3.000e+03   #
  1  1     0.00000000e+00   # A_d
  2  2     0.00000000e+00   # A_s
  3  3     0.00000000e+00   # A_b
#===================================================================== AE
Block AE  Q=  3.000e+03   #
  1  1     3.30000000e+03   # A_e
  2  2     3.30000000e+03   # A_mu
  3  3     3.30000000e+03   # A_tau
#=====================================================================
#
#----------------------------------------------------------------------
#           PDG      WIDTH     
DECAY   1000001  3.74701127e+01   # dL decays 
#          BR         NDA          ID1       ID2       ID3       ID4
      1.33842980e-02    2      1000022         1                       
      3.06678620e-01    2      1000023         1                       
      1.21743140e-03    2      1000025         1                       
      1.98110010e-02    2      1000035         1                       
      6.05619970e-01    2     -1000024         2                       
      5.32886460e-02    2     -1000037         2                       
#----------------------------------------------------------------------
#           PDG      WIDTH     
DECAY   1000002  3.75299350e+01   # uL decays 
#          BR         NDA          ID1       ID2       ID3       ID4
      9.17801910e-03    2      1000022         2                       
      3.15022650e-01    2      1000023         2                       
      7.15792880e-04    2      1000025         2                       
      1.56896770e-02    2      1000035         2                       
      6.37922290e-01    2      1000024         1                       
      2.14716070e-02    2      1000037         1                       
#----------------------------------------------------------------------
#           PDG      WIDTH     
DECAY   1000003  3.74701127e+01   # sL decays 
#          BR         NDA          ID1       ID2       ID3       ID4
      1.33843010e-02    2      1000022         3                       
      3.06678680e-01    2      1000023         3                       
      1.21743160e-03    2      1000025         3                       
      1.98110040e-02    2      1000035         3                       
      6.05619910e-01    2     -1000024         4                       
      5.32886390e-02    2     -1000037         4                       
#----------------------------------------------------------------------
#           PDG      WIDTH     
DECAY   1000004  3.75299350e+01   # cL decays 
#          BR         NDA          ID1       ID2       ID3       ID4
      9.17801730e-03    2      1000022         4                       
      3.15022590e-01    2      1000023         4                       
      7.15792760e-04    2      1000025         4                       
      1.56896750e-02    2      1000035         4                       
      6.37922350e-01    2      1000024         3                       
      2.14716120e-02    2      1000037         3                       
#----------------------------------------------------------------------
#           PDG      WIDTH     
DECAY   1000005  3.47206837e+01   # b1 decays 
#          BR         NDA          ID1       ID2       ID3       ID4
      3.75634620e-02    2      1000022         5                       
      1.53770490e-01    2      1000023         5                       
      3.58030600e-03    2      1000025         5                       
      2.76146670e-03    2      1000035         5                       
      3.15276950e-01    2     -1000024         6                       
      4.02380380e-01    2     -1000037         6                       
      8.46668850e-02    2          -24   1000006                       
#----------------------------------------------------------------------
#           PDG      WIDTH     
DECAY   1000006  6.81627538e+01   # t1 decays 
#          BR         NDA          ID1       ID2       ID3       ID4
      4.39761800e-02    2      1000022         6                       
      5.36477640e-02    2      1000023         6                       
      2.13178410e-01    2      1000025         6                       
      2.85847250e-01    2      1000035         6                       
      9.94574350e-02    2      1000024         5                       
      3.03892910e-01    2      1000037         5                       
#----------------------------------------------------------------------
#           PDG      WIDTH     
DECAY   2000001  1.69094412e+00   # dR decays 
#          BR         NDA          ID1       ID2       ID3       ID4
      9.91879400e-01    2      1000022         1                       
      1.43155470e-03    2      1000023         1                       
      1.45735300e-03    2      1000025         1                       
      5.23169520e-03    2      1000035         1                       
#----------------------------------------------------------------------
#           PDG      WIDTH     
DECAY   2000002  6.76318575e+00   # uR decays 
#          BR         NDA          ID1       ID2       ID3       ID4
      9.91879520e-01    2      1000022         2                       
      1.43155020e-03    2      1000023         2                       
      1.45733270e-03    2      1000025         2                       
      5.23161840e-03    2      1000035         2                       
#----------------------------------------------------------------------
#           PDG      WIDTH     
DECAY   2000003  1.69094412e+00   # sR decays 
#          BR         NDA          ID1       ID2       ID3       ID4
      9.91879400e-01    2      1000022         3                       
      1.43155470e-03    2      1000023         3                       
      1.45735300e-03    2      1000025         3                       
      5.23169520e-03    2      1000035         3                       
#----------------------------------------------------------------------
#           PDG      WIDTH     
DECAY   2000004  6.76318575e+00   # cR decays 
#          BR         NDA          ID1       ID2       ID3       ID4
      9.91879520e-01    2      1000022         4                       
      1.43155000e-03    2      1000023         4                       
      1.45733270e-03    2      1000025         4                       
      5.23161700e-03    2      1000035         4                       
#----------------------------------------------------------------------
#           PDG      WIDTH     
DECAY   2000005  4.68937019e+01   # b2 decays 
#          BR         NDA          ID1       ID2       ID3       ID4
      1.88021190e-02    2      1000022         5                       
      1.32085770e-01    2      1000023         5                       
      8.08469210e-03    2      1000025         5                       
      2.29716640e-02    2      1000035         5                       
      2.71641110e-01    2     -1000024         6                       
      4.54575390e-01    2     -1000037         6                       
      9.18392240e-02    2          -24   1000006                       
#----------------------------------------------------------------------
#           PDG      WIDTH     
DECAY   2000006  1.01806595e+02   # t2 decays 
#          BR         NDA          ID1       ID2       ID3       ID4
      1.86938150e-01    2      1000024         5                       
      1.23678620e-01    2      1000037         5                       
      1.69978840e-01    2           23   1000006                       
      2.81333760e-02    2           24   1000005                       
      3.58738270e-02    2           24   2000005                       
      4.02828190e-02    2      1000022         6                       
      9.34458970e-02    2      1000023         6                       
      1.92303000e-01    2      1000025         6                       
      1.29365490e-01    2      1000035         6                       
#----------------------------------------------------------------------
#           PDG      WIDTH     
DECAY   1000011  4.08642205e+01   # eL decays 
#          BR         NDA          ID1       ID2       ID3       ID4
      8.66877730e-02    2      1000022        11                       
      2.97751960e-01    2      1000023        11                       
      3.19621730e-04    2      1000025        11                       
      1.10978240e-02    2      1000035        11                       
      5.55283670e-01    2     -1000024        12                       
      4.88591750e-02    2     -1000037        12                       
#----------------------------------------------------------------------
#           PDG      WIDTH     
DECAY   1000012  4.08946878e+01   # snue decays 
#          BR         NDA          ID1       ID2       ID3       ID4
      9.80992470e-02    2      1000022        12                       
      2.72779460e-01    2      1000023        12                       
      1.69352210e-03    2      1000025        12                       
      2.23211700e-02    2      1000035        12                       
      5.85402850e-01    2      1000024        11                       
      1.97037230e-02    2      1000037        11                       
#----------------------------------------------------------------------
#           PDG      WIDTH     
DECAY   1000013  4.08642205e+01   # muL decays 
#          BR         NDA          ID1       ID2       ID3       ID4
      8.66877730e-02    2      1000022        13                       
      2.97751960e-01    2      1000023        13                       
      3.19621730e-04    2      1000025        13                       
      1.10978240e-02    2      1000035        13                       
      5.55283670e-01    2     -1000024        14                       
      4.88591750e-02    2     -1000037        14                       
#----------------------------------------------------------------------
#           PDG      WIDTH     
DECAY   1000014  4.08946878e+01   # snum decays 
#          BR         NDA          ID1       ID2       ID3       ID4
      9.80992470e-02    2      1000022        14                       
      2.72779460e-01    2      1000023        14                       
      1.69352210e-03    2      1000025        14                       
      2.23211700e-02    2      1000035        14                       
      5.85402850e-01    2      1000024        13                       
      1.97037230e-02    2      1000037        13                       
#----------------------------------------------------------------------
#           PDG      WIDTH     
DECAY   1000015  5.31020573e-01   # ta1 decays 
#          BR         NDA          ID1       ID2       ID3       ID4
      1.00000000e+00    2      1000022        15                       
#----------------------------------------------------------------------
#           PDG      WIDTH     
DECAY   1000016  4.13520136e+01   # snut decays 
#          BR         NDA          ID1       ID2       ID3       ID4
      9.70178920e-02    2      1000022        16                       
      2.69772590e-01    2      1000023        16                       
      1.67485430e-03    2      1000025        16                       
      2.20751220e-02    2      1000035        16                       
      5.79390650e-01    2      1000024        15                       
      2.40201390e-02    2      1000037        15                       
      6.04870780e-03    2           37   1000015                       
#----------------------------------------------------------------------
#           PDG      WIDTH     
DECAY   2000011  5.31320633e-01   # eR decays 
#          BR         NDA          ID1       ID2       ID3       ID4
      1.00000000e+00    2      1000022        11                       
#----------------------------------------------------------------------
#           PDG      WIDTH     
DECAY   2000013  5.31320633e-01   # muR decays 
#          BR         NDA          ID1       ID2       ID3       ID4
      1.00000000e+00    2      1000022        13                       
#----------------------------------------------------------------------
#           PDG      WIDTH     
DECAY   2000015  4.13208613e+01   # ta2 decays 
#          BR         NDA          ID1       ID2       ID3       ID4
      8.57706140e-02    2      1000022        15                       
      2.94680740e-01    2      1000023        15                       
      2.76933840e-03    2      1000025        15                       
      1.32455550e-02    2      1000035        15                       
      5.49152970e-01    2     -1000024        16                       
      4.83197610e-02    2     -1000037        16                       
      3.03335320e-03    2           36   1000015                       
      3.02782520e-03    2           35   1000015                       
#----------------------------------------------------------------------
#           PDG      WIDTH     
DECAY   1000021  1.92119089e+00   # gl decays 
#          BR         NDA          ID1       ID2       ID3       ID4
      1.89215090e-02    3      1000024         1        -2             
      1.89215090e-02    3     -1000024         2        -1             
      1.89215090e-02    3      1000024         3        -4             
      1.89215090e-02    3     -1000024         4        -3             
      5.74199450e-02    3      1000024         5        -6             
      5.74199450e-02    3     -1000024         6        -5             
      1.58339840e-03    3      1000037         1        -2             
      1.58339840e-03    3     -1000037         2        -1             
      1.58339840e-03    3      1000037         3        -4             
      1.58339840e-03    3     -1000037         4        -3             
      1.44648430e-01    3      1000037         5        -6             
      1.44648430e-01    3     -1000037         6        -5             
      3.32383390e-05    2      1000022        21                       
      3.79771200e-03    3      1000022         1        -1             
      3.79771200e-03    3      1000022         3        -3             
      3.76857170e-03    3      1000022         5        -5             
      2.98800360e-02    3      1000022         6        -6             
      1.69042600e-04    2      1000023        21                       
      2.03838330e-02    3      1000023         1        -1             
      2.03838330e-02    3      1000023         3        -3             
      2.02723130e-02    3      1000023         5        -5             
      3.88596280e-02    3      1000023         6        -6             
      1.13030600e-03    2      1000025        21                       
      6.81180100e-05    3      1000025         1        -1             
      6.81180100e-05    3      1000025         3        -3             
      1.00188210e-03    3      1000025         5        -5             
      1.58275050e-01    3      1000025         6        -6             
      8.69244630e-04    2      1000035        21                       
      1.32544890e-03    3      1000035         1        -1             
      1.32544890e-03    3      1000035         3        -3             
      2.19289870e-03    3      1000035         5        -5             
      2.06241250e-01    3      1000035         6        -6             
#----------------------------------------------------------------------
#           PDG      WIDTH     
DECAY   1000023  1.45022694e-02   # N2 decays 
#          BR         NDA          ID1       ID2       ID3       ID4
      8.41830970e-02    2      1000022        23                       
      7.66422990e-01    2      1000022        25                       
      2.20685660e-02    2      2000011       -11                       
      2.20685660e-02    2     -2000011        11                       
      2.20685450e-02    2      2000013       -13                       
      2.20685450e-02    2     -2000013        13                       
      3.05597800e-02    2      1000015       -15                       
      3.05597800e-02    2     -1000015        15                       
#----------------------------------------------------------------------
#           PDG      WIDTH     
DECAY   1000025  3.81454651e+00   # N3 decays 
#          BR         NDA          ID1       ID2       ID3       ID4
      3.04396930e-01    2      1000024       -24                       
      3.04396930e-01    2     -1000024        24                       
      8.53303150e-02    2      1000022        23                       
      2.68091290e-01    2      1000023        23                       
      1.93716340e-02    2      1000022        25                       
      1.16557920e-02    2      1000023        25                       
      4.44414120e-04    2      2000011       -11                       
      4.44414120e-04    2     -2000011        11                       
      4.44414120e-04    2      2000013       -13                       
      4.44414120e-04    2     -2000013        13                       
      2.48961270e-03    2      1000015       -15                       
      2.48961270e-03    2     -1000015        15                       
#----------------------------------------------------------------------
#           PDG      WIDTH     
DECAY   1000035  3.91459498e+00   # N4 decays 
#          BR         NDA          ID1       ID2       ID3       ID4
      3.23386580e-01    2      1000024       -24                       
      3.23386580e-01    2     -1000024        24                       
      2.14761550e-02    2      1000022        23                       
      1.70856300e-02    2      1000023        23                       
      7.19212890e-02    2      1000022        25                       
      2.29200590e-01    2      1000023        25                       
      1.62718030e-03    2      2000011       -11                       
      1.62718030e-03    2     -2000011        11                       
      1.62718030e-03    2      2000013       -13                       
      1.62718030e-03    2     -2000013        13                       
      3.51727730e-03    2      1000015       -15                       
      3.51727730e-03    2     -1000015        15                       
#----------------------------------------------------------------------
#           PDG      WIDTH     
DECAY   1000024  1.37935370e-02   # C1 decays 
#          BR         NDA          ID1       ID2       ID3       ID4
      9.80459090e-01    2      1000022        24                       
      1.95409750e-02    2     -1000015        16                       
#----------------------------------------------------------------------
#           PDG      WIDTH     
DECAY   1000037  3.85746938e+00   # C2 decays 
#          BR         NDA          ID1       ID2       ID3       ID4
      8.82795160e-02    2      1000022        24                       
      3.37212980e-01    2      1000023        24                       
      3.88327750e-03    2     -1000015        16                       
      3.16342770e-01    2      1000024        23                       
      2.54281520e-01    2      1000024        25                       
#----------------------------------------------------------------------
#           PDG      WIDTH     
DECAY        25  4.56259531e-03   # h decays 
#          BR         NDA          ID1       ID2       ID3       ID4
      1.96536030e-04    2           13       -13                       
      5.62167650e-02    2           15       -15                       
      2.35918680e-03    2            3        -3                       
      7.69015430e-01    2            5        -5                       
      3.34363470e-02    2            4        -4                       
      1.89925060e-03    2           22        22                       
      3.96485140e-02    2           21        21                       
      4.94086650e-03    3           24        11       -12             
      4.94086650e-03    3           24        13       -14             
      4.94086650e-03    3           24        15       -16             
      1.48225990e-02    3           24        -2         1             
      1.48225990e-02    3           24        -4         3             
      4.94086650e-03    3          -24       -11        12             
      4.94086650e-03    3          -24       -13        14             
      4.94086650e-03    3          -24       -15        16             
      1.48225990e-02    3          -24         2        -1             
      1.48225990e-02    3          -24         4        -3             
      5.67111420e-04    3           23        12       -12             
      5.67111420e-04    3           23        14       -14             
      5.67111420e-04    3           23        16       -16             
      2.85421470e-04    3           23        11       -11             
      2.85421470e-04    3           23        13       -13             
      2.85421470e-04    3           23        15       -15             
      9.77829680e-04    3           23         2        -2             
      9.77829680e-04    3           23         4        -4             
      1.25968570e-03    3           23         1        -1             
      1.25968570e-03    3           23         3        -3             
      1.25968570e-03    3           23         5        -5             
#----------------------------------------------------------------------
#           PDG      WIDTH     
DECAY        35  7.51138348e+00   # H decays 
#          BR         NDA          ID1       ID2       ID3       ID4
      3.45897530e-05    2           13       -13                       
      9.90685080e-03    2           15       -15                       
      4.05492350e-04    2            3        -3                       
      9.99894440e-02    2            5        -5                       
      1.66417000e-01    2            6        -6                       
      8.76383490e-05    2           21        21                       
      5.63791250e-04    2           24       -24                       
      2.86248570e-04    2           23        23                       
      2.19593970e-03    2      1000022   1000022                       
      1.38111810e-02    2      1000022   1000023                       
      6.22741470e-02    2      1000022   1000025                       
      1.74314710e-02    2      1000022   1000035                       
      1.82023760e-02    2      1000023   1000023                       
      1.59375670e-01    2      1000023   1000025                       
      1.77393610e-02    2      1000023   1000035                       
      4.01011030e-02    2      1000024  -1000024                       
      1.94381190e-01    2      1000024  -1000037                       
      1.94381190e-01    2     -1000024   1000037                       
      2.22365580e-03    2           25        25                       
      6.52101440e-05    2      2000011  -2000011                       
      6.51966770e-05    2      2000013  -2000013                       
      6.14108500e-05    2      1000015  -1000015                       
#----------------------------------------------------------------------
#           PDG      WIDTH     
DECAY        36  7.29970721e+00   # A decays 
#          BR         NDA          ID1       ID2       ID3       ID4
      3.53851390e-05    2           13       -13                       
      1.01347830e-02    2           15       -15                       
      4.14840880e-04    2            3        -3                       
      1.02384670e-01    2            5        -5                       
      1.81020470e-01    2            6        -6                       
      1.07728560e-04    2           21        21                       
      2.92712800e-03    2      1000022   1000022                       
      2.24788920e-02    2      1000022   1000023                       
      2.26863270e-02    2      1000022   1000025                       
      5.09893220e-02    2      1000022   1000035                       
      4.21518010e-02    2      1000023   1000023                       
      2.48417310e-02    2      1000023   1000025                       
      1.21552200e-01    2      1000023   1000035                       
      9.19024870e-02    2      1000024  -1000024                       
      1.62907290e-01    2      1000024  -1000037                       
      1.62907290e-01    2     -1000024   1000037                       
      5.57786090e-04    2           25        23                       
#----------------------------------------------------------------------
#           PDG      WIDTH     
DECAY        37  7.22518606e+00   # H+ decays 
#          BR         NDA          ID1       ID2       ID3       ID4
      3.60954550e-05    2           14       -13                       
      1.03382280e-02    2           16       -15                       
      3.92301210e-04    2            4        -3                       
      2.55678060e-01    2            6        -5                       
      3.55424320e-02    2      1000024   1000022                       
      6.50766960e-05    2      1000024   1000023                       
      2.09379970e-01    2      1000024   1000025                       
      2.01359170e-01    2      1000024   1000035                       
      6.21352340e-02    2      1000037   1000022                       
      2.24496840e-01    2      1000037   1000023                       
      5.76529360e-04    2           25        24                       
#----------------------------------------------------------------------
#           PDG      WIDTH     
DECAY         6  1.14678979e+00   # t decays 
#          BR         NDA          ID1       ID2       ID3       ID4
      3.33333340e-01    3            2        -1         5             
      3.33333340e-01    3            4        -3         5             
      1.11111110e-01    3           12       -11         5             
      1.11111110e-01    3           14       -13         5             
      1.11111110e-01    3           16       -15         5             
