#
#                              ======================
#                              | THE SUSYHIT OUTPUT |
#                              ======================
#
#
#              ------------------------------------------------------
#              |     This is the output of the SUSY-HIT package     |
#              |  created by A.Djouadi, M.Muehlleitner and M.Spira. |
#              |  In case of problems with SUSY-HIT email to        |
#              |           margarete.muehlleitner@cern.ch           |
#              |           michael.spira@psi.ch                     |
#              |           abdelhak.djouadi@cern.ch                 |
#              ------------------------------------------------------
#
#              ------------------------------------------------------
#              |  SUSY Les Houches Accord - MSSM Spectrum + Decays  |
#              |              based on the decay programs           |
#              |                                                    |
#              |                     SDECAY 1.3b                    |
#              |                                                    |
#              |  Authors: M.Muhlleitner, A.Djouadi and Y.Mambrini  |
#              |  Ref.:    Comput.Phys.Commun.168(2005)46           |
#              |           [hep-ph/0311167]                         |
#              |                                                    |
#              |                     HDECAY 3.4                     |
#              |                                                    |
#              |  By: A.Djouadi,J.Kalinowski,M.Muhlleitner,M.Spira  |
#              |  Ref.:    Comput.Phys.Commun.108(1998)56           |
#              |           [hep-ph/9704448]                         |
#              |                                                    |
#              |                                                    |
#              |  If not stated otherwise all DRbar couplings and   |
#              |  soft SUSY breaking masses are given at the scale  |
#              |  Q=  0.18171490E+04
#              |                                                    |
#              ------------------------------------------------------
#
#
BLOCK DCINFO  # Decay Program information
     1   SDECAY/HDECAY # decay calculator
     2   1.3b  /3.4    # version number
#
BLOCK SPINFO  # Spectrum calculator information
     1     SOFTSUSY    # spectrum calculator               
     2     3.4.0       # version number                    
#
BLOCK MODSEL  # Model selection
     1     0   #  nonUniversal                                     
#
BLOCK SMINPUTS  # Standard Model inputs
         1     1.27908970E+02   # alpha_em^-1(M_Z)^MSbar
         2     1.16637870E-05   # G_F [GeV^-2]
         3     1.18400000E-01   # alpha_S(M_Z)^MSbar
         4     9.11876000E+01   # M_Z pole mass
         5     4.18000000E+00   # mb(mb)^MSbar
         6     1.73200000E+02   # mt pole mass
         7     1.77700000E+00   # mtau pole mass
#
BLOCK MINPAR  # Input parameters - minimal models
         3     6.66000000E+00   # tanb                
#
BLOCK EXTPAR  # Input parameters - non-minimal models
         0    -1.00000000E+00   # Set                 
         1     3.31497000E+03   # M_1(MX)             
         2     3.45319000E+03   # M_2(MX)             
         3     2.26835000E+03   # M_3(MX)             
        11     3.53403000E+03   # At(MX)              
        12    -4.61540000E+02   # Ab(MX)              
        13     2.29045000E+03   # Atau(MX)            
        23     2.95140000E+02   # mu(MX)              
        26     2.72569000E+03   # mA(pole)            
        31     1.17357000E+03   # meL(MX)             
        32     1.17357000E+03   # mmuL(MX)            
        33     2.65967000E+03   # mtauL(MX)           
        34     1.02111000E+03   # meR(MX)             
        35     1.02111000E+03   # mmuR(MX)            
        36     3.03126000E+03   # mtauR(MX)           
        41     1.69367000E+03   # mqL1(MX)            
        42     1.69367000E+03   # mqL2(MX)            
        43     2.48625000E+03   # mqL3(MX)            
        44     3.97213000E+03   # muR(MX)             
        45     3.97213000E+03   # mcR(MX)             
        46     1.33437000E+03   # mtR(MX)             
        47     2.04584000E+03   # mdR(MX)             
        48     2.04584000E+03   # msR(MX)             
        49     5.95390000E+02   # mbR(MX)             
#
BLOCK MASS  # Mass Spectrum
# PDG code           mass       particle
        24     8.04162630E+01   # W+
        25     1.25539013E+02   # h
        35     2.72586050E+03   # H
        36     2.72568966E+03   # A
        37     2.72725588E+03   # H+
         5     4.81876030E+00   # b-quark pole mass calculated from mb(mb)_Msbar
   1000001     1.76854652E+03   # ~d_L
   2000001     2.11028796E+03   # ~d_R
   1000002     1.76699218E+03   # ~u_L
   2000002     4.00798629E+03   # ~u_R
   1000003     1.76854652E+03   # ~s_L
   2000003     2.11028796E+03   # ~s_R
   1000004     1.76699218E+03   # ~c_L
   2000004     4.00798629E+03   # ~c_R
   1000005     6.90758711E+02   # ~b_1
   2000005     2.51633008E+03   # ~b_2
   1000006     1.36510548E+03   # ~t_1
   2000006     2.53045092E+03   # ~t_2
   1000011     1.18075132E+03   # ~e_L
   2000011     1.00489869E+03   # ~e_R
   1000012     1.17793045E+03   # ~nu_eL
   1000013     1.18075132E+03   # ~mu_L
   2000013     1.00489869E+03   # ~mu_R
   1000014     1.17793045E+03   # ~nu_muL
   1000015     2.67304621E+03   # ~tau_1
   2000015     3.03014702E+03   # ~tau_2
   1000016     2.67160788E+03   # ~nu_tauL
   1000021     2.35154603E+03   # ~g
   1000022     3.04499485E+02   # ~chi_10
   1000023    -3.06315586E+02   # ~chi_20
   1000025     3.29810993E+03   # ~chi_30
   1000035     3.40881477E+03   # ~chi_40
   1000024     3.05497161E+02   # ~chi_1+
   1000037     3.40897030E+03   # ~chi_2+
#
BLOCK NMIX  # Neutralino Mixing Matrix
  1  1     1.20398782E-02   # N_11
  1  2    -1.98807729E-02   # N_12
  1  3     7.07964332E-01   # N_13
  1  4    -7.05865640E-01   # N_14
  2  1    -7.35630024E-03   # N_21
  2  2     1.21786465E-02   # N_22
  2  3     7.06219109E-01   # N_23
  2  4     7.07850363E-01   # N_24
  3  1     9.99793957E-01   # N_31
  3  2     1.49198859E-02   # N_32
  3  3    -3.24868988E-03   # N_33
  3  4     1.33748146E-02   # N_34
  4  1    -1.45934515E-02   # N_41
  4  2     9.99616843E-01   # N_42
  4  3     5.52467208E-03   # N_43
  4  4    -2.28621243E-02   # N_44
#
BLOCK UMIX  # Chargino Mixing Matrix U
  1  1    -7.74614690E-03   # U_11
  1  2     9.99969998E-01   # U_12
  2  1    -9.99969998E-01   # U_21
  2  2    -7.74614690E-03   # U_22
#
BLOCK VMIX  # Chargino Mixing Matrix V
  1  1    -3.20568062E-02   # V_11
  1  2     9.99486049E-01   # V_12
  2  1    -9.99486049E-01   # V_21
  2  2    -3.20568062E-02   # V_22
#
BLOCK STOPMIX  # Stop Mixing Matrix
  1  1    -1.13418992E-01   # cos(theta_t)
  1  2     9.93547247E-01   # sin(theta_t)
  2  1    -9.93547247E-01   # -sin(theta_t)
  2  2    -1.13418992E-01   # cos(theta_t)
#
BLOCK SBOTMIX  # Sbottom Mixing Matrix
  1  1     9.26263612E-04   # cos(theta_b)
  1  2     9.99999571E-01   # sin(theta_b)
  2  1    -9.99999571E-01   # -sin(theta_b)
  2  2     9.26263612E-04   # cos(theta_b)
#
BLOCK STAUMIX  # Stau Mixing Matrix
  1  1     9.99999950E-01   # cos(theta_tau)
  1  2    -3.16227762E-04   # sin(theta_tau)
  2  1     3.16227762E-04   # -sin(theta_tau)
  2  2     9.99999950E-01   # cos(theta_tau)
#
BLOCK ALPHA  # Higgs mixing
          -1.56338162E-01   # Mixing angle in the neutral Higgs boson sector
#
BLOCK HMIX Q=  1.81714900E+03  # DRbar Higgs Parameters
         1     2.99360234E+02   # mu(Q)MSSM           
         2     6.36480661E+00   # tan                 
         3     2.43723666E+02   # higgs               
         4     7.31514496E+06   # mA^2(Q)MSSM         
#
BLOCK GAUGE Q=  1.81714900E+03  # The gauge couplings
     1     3.63678574E-01   # gprime(Q) DRbar
     2     6.36989402E-01   # g(Q) DRbar
     3     1.02762439E+00   # g3(Q) DRbar
#
BLOCK AU Q=  1.81714900E+03  # The trilinear couplings
  1  1     0.00000000E+00   # A_u(Q) DRbar
  2  2     0.00000000E+00   # A_c(Q) DRbar
  3  3     3.53403001E+03   # A_t(Q) DRbar
#
BLOCK AD Q=  1.81714900E+03  # The trilinear couplings
  1  1     0.00000000E+00   # A_d(Q) DRbar
  2  2     0.00000000E+00   # A_s(Q) DRbar
  3  3    -4.61539998E+02   # A_b(Q) DRbar
#
BLOCK AE Q=  1.81714900E+03  # The trilinear couplings
  1  1     0.00000000E+00   # A_e(Q) DRbar
  2  2     0.00000000E+00   # A_mu(Q) DRbar
  3  3     2.29045000E+03   # A_tau(Q) DRbar
#
BLOCK Yu Q=  1.81714900E+03  # The Yukawa couplings
  1  1     0.00000000E+00   # y_u(Q) DRbar
  2  2     0.00000000E+00   # y_c(Q) DRbar
  3  3     8.65140472E-01   # y_t(Q) DRbar
#
BLOCK Yd Q=  1.81714900E+03  # The Yukawa couplings
  1  1     0.00000000E+00   # y_d(Q) DRbar
  2  2     0.00000000E+00   # y_s(Q) DRbar
  3  3     8.65602575E-02   # y_b(Q) DRbar
#
BLOCK Ye Q=  1.81714900E+03  # The Yukawa couplings
  1  1     0.00000000E+00   # y_e(Q) DRbar
  2  2     0.00000000E+00   # y_mu(Q) DRbar
  3  3     6.59595396E-02   # y_tau(Q) DRbar
#
BLOCK MSOFT Q=  1.81714900E+03  # The soft SUSY breaking masses at the scale Q
         1     3.31497000E+03   # M_1(Q)              
         2     3.45319000E+03   # M_2(Q)              
         3     2.26835000E+03   # M_3(Q)              
        21     7.10384444E+06   # mH1^2(Q)            
        22     1.74564858E+05   # mH2^2(Q)            
        31     1.17357000E+03   # meL(Q)              
        32     1.17357000E+03   # mmuL(Q)             
        33     2.65967000E+03   # mtauL(Q)            
        34     1.02111000E+03   # meR(Q)              
        35     1.02111000E+03   # mmuR(Q)             
        36     3.03126000E+03   # mtauR(Q)            
        41     1.69367000E+03   # mqL1(Q)             
        42     1.69367000E+03   # mqL2(Q)             
        43     2.48625000E+03   # mqL3(Q)             
        44     3.97213000E+03   # muR(Q)              
        45     3.97213000E+03   # mcR(Q)              
        46     1.33436999E+03   # mtR(Q)              
        47     2.04584000E+03   # mdR(Q)              
        48     2.04584000E+03   # msR(Q)              
        49     5.95389989E+02   # mbR(Q)              
#
Block HiggsBoundsInputHiggsCouplingsFermions
# ScalarNormEffCoupSq PseudoSNormEffCoupSq NP   IP1 IP2 IP2
    1.00635115E+00    0.00000000E+00        3  25   5   5  # h0-b-b eff. coupling^2, normalised to SM
    4.05044120E+01    0.00000000E+00        3  35   5   5  # H0-b-b eff. coupling^2, normalised to SM
    0.00000000E+00    4.05107632E+01        3  36   5   5  # A0-b-b eff. coupling^2, normalised to SM
#
    9.99843223E-01    0.00000000E+00        3  25   6   6  # h0-t-t eff. coupling^2, normalised to SM
    2.48415747E-02    0.00000000E+00        3  35   6   6  # H0-t-t eff. coupling^2, normalised to SM
    0.00000000E+00    2.46847979E-02        3  36   6   6  # A0-t-t eff. coupling^2, normalised to SM
#
    1.00635115E+00    0.00000000E+00        3  25  15  15  # h0-tau-tau eff. coupling^2, normalised to SM
    4.05044120E+01    0.00000000E+00        3  35  15  15  # H0-tau-tau eff. coupling^2, normalised to SM
    0.00000000E+00    4.05107632E+01        3  36  15  15  # A0-tau-tau eff. coupling^2, normalised to SM
#
Block HiggsBoundsInputHiggsCouplingsBosons
    9.99999752E-01        3  25  24  24  # h0-W-W eff. coupling^2, normalised to SM
    2.48160433E-07        3  35  24  24  # H0-W-W eff. coupling^2, normalised to SM
    0.00000000E+00        3  36  24  24  # A0-W-W eff. coupling^2, normalised to SM
#
    9.99999752E-01        3  25  23  23  # h0-Z-Z eff. coupling^2, normalised to SM
    2.48160433E-07        3  35  23  23  # H0-Z-Z eff. coupling^2, normalised to SM
    0.00000000E+00        3  36  23  23  # A0-Z-Z eff. coupling^2, normalised to SM
#
    8.83300833E-01        3  25  21  21  # h0-g-g eff. coupling^2, normalised to SM
    9.48313294E-12        3  35  21  21  # H0-g-g eff. coupling^2, normalised to SM
    2.20305170E-11        3  36  21  21  # A0-g-g eff. coupling^2, normalised to SM
#
    0.00000000E+00        3  25  25  23  # h0-h0-Z eff. coupling^2, normalised to SM
    0.00000000E+00        3  35  25  23  # H0-h0-Z eff. coupling^2, normalised to SM
    2.48160433E-07        3  36  25  23  # A0-h0-Z eff. coupling^2, normalised to SM
    0.00000000E+00        3  35  35  23  # H0-H0-Z eff. coupling^2, normalised to SM
    9.99999752E-01        3  36  35  23  # A0-H0-Z eff. coupling^2, normalised to SM
    0.00000000E+00        3  36  36  23  # A0-A0-Z eff. coupling^2, normalised to SM
#
    0.00000000E+00        4  25  21  21  23  # h0-g-g-Z eff. coupling^2, normalised to SM
    0.00000000E+00        4  35  21  21  23  # H0-g-g-Z eff. coupling^2, normalised to SM
    0.00000000E+00        4  36  21  21  23  # A0-g-g-Z eff. coupling^2, normalised to SM
#
#
#
#                             =================
#                             |The decay table|
#                             =================
#
# - The QCD corrections to the decays gluino -> squark  + quark
#                                     squark -> gaugino + quark_prime
#                                     squark -> squark_prime + Higgs
#                                     squark -> gluino  + quark
#   are included.
#
# - The multi-body decays for the inos, stops and sbottoms are included.
#
# - The loop induced decays for the gluino, neutralinos and stops
#   are included.
#
# - The SUSY decays of the top quark are included.
#
#
#         PDG            Width
DECAY         6     1.42784167E+00   # top decays
#          BR         NDA      ID1       ID2
     1.00000000E+00    2           5        24   # BR(t ->  b    W+)
#
#         PDG            Width
DECAY   1000021     9.99257723E+01   # gluino decays
#          BR         NDA      ID1       ID2
     4.61675505E-02    2     1000001        -1   # BR(~g -> ~d_L  db)
     4.61675505E-02    2    -1000001         1   # BR(~g -> ~d_L* d )
     9.27207688E-03    2     2000001        -1   # BR(~g -> ~d_R  db)
     9.27207688E-03    2    -2000001         1   # BR(~g -> ~d_R* d )
     4.63790405E-02    2     1000002        -2   # BR(~g -> ~u_L  ub)
     4.63790405E-02    2    -1000002         2   # BR(~g -> ~u_L* u )
     4.61675505E-02    2     1000003        -3   # BR(~g -> ~s_L  sb)
     4.61675505E-02    2    -1000003         3   # BR(~g -> ~s_L* s )
     9.27207688E-03    2     2000003        -3   # BR(~g -> ~s_R  sb)
     9.27207688E-03    2    -2000003         3   # BR(~g -> ~s_R* s )
     4.63789113E-02    2     1000004        -4   # BR(~g -> ~c_L  cb)
     4.63789113E-02    2    -1000004         4   # BR(~g -> ~c_L* c )
     1.91346118E-01    2     1000005        -5   # BR(~g -> ~b_1  bb)
     1.91346118E-01    2    -1000005         5   # BR(~g -> ~b_1* b )
     1.05016675E-01    2     1000006        -6   # BR(~g -> ~t_1  tb)
     1.05016675E-01    2    -1000006         6   # BR(~g -> ~t_1* t )
#
#         PDG            Width
DECAY   1000006     3.56068506E+01   # stop1 decays
#          BR         NDA      ID1       ID2
     2.49836939E-01    2     1000022         6   # BR(~t_1 -> ~chi_10 t )
     2.44855472E-01    2     1000023         6   # BR(~t_1 -> ~chi_20 t )
     5.05307391E-01    2     1000024         5   # BR(~t_1 -> ~chi_1+ b )
     1.97874818E-07    2     1000005        24   # BR(~t_1 -> ~b_1    W+)
#
#         PDG            Width
DECAY   2000006     8.49000743E+01   # stop2 decays
#          BR         NDA      ID1       ID2
     2.12784326E-01    2     1000022         6   # BR(~t_2 -> ~chi_10 t )
     2.15287150E-01    2     1000023         6   # BR(~t_2 -> ~chi_20 t )
     0.00000000E+00    2     1000025         6   # BR(~t_2 -> ~chi_30 t )
     1.23194037E-02    2     1000024         5   # BR(~t_2 -> ~chi_1+ b )
     9.14575725E-03    2     1000021         6   # BR(~t_2 -> ~g      t )
     2.75242059E-01    2     1000006        25   # BR(~t_2 -> ~t_1    h )
     2.75141640E-01    2     1000006        23   # BR(~t_2 -> ~t_1    Z )
     7.96639161E-05    2     1000005        24   # BR(~t_2 -> ~b_1    W+)
#
#         PDG            Width
DECAY   1000005     1.20395699E-01   # sbottom1 decays
#          BR         NDA      ID1       ID2
     2.78474371E-01    2     1000022         5   # BR(~b_1 -> ~chi_10 b )
     2.75210979E-01    2     1000023         5   # BR(~b_1 -> ~chi_20 b )
     4.46314649E-01    2    -1000024         6   # BR(~b_1 -> ~chi_1- t )
#
#         PDG            Width
DECAY   2000005     8.32147925E+01   # sbottom2 decays
#          BR         NDA      ID1       ID2
     2.25063666E-03    2     1000022         5   # BR(~b_2 -> ~chi_10 b )
     2.20405864E-03    2     1000023         5   # BR(~b_2 -> ~chi_20 b )
     4.32321290E-01    2    -1000024         6   # BR(~b_2 -> ~chi_1- t )
     2.71739274E-02    2     1000021         5   # BR(~b_2 -> ~g      b )
     4.42501181E-05    2     1000005        25   # BR(~b_2 -> ~b_1    h )
     4.15849020E-05    2     1000005        23   # BR(~b_2 -> ~b_1    Z )
     5.35964252E-01    2     1000006       -24   # BR(~b_2 -> ~t_1    W-)
#
#         PDG            Width
DECAY   1000002     1.65063164E-02   # sup_L decays
#          BR         NDA      ID1       ID2
     1.24755956E-01    2     1000022         2   # BR(~u_L -> ~chi_10 u)
     4.68138124E-02    2     1000023         2   # BR(~u_L -> ~chi_20 u)
     8.28430231E-01    2     1000024         1   # BR(~u_L -> ~chi_1+ d)
#
#         PDG            Width
DECAY   2000002     1.39028618E+02   # sup_R decays
#          BR         NDA      ID1       ID2
     9.27856720E-06    2     1000022         2   # BR(~u_R -> ~chi_10 u)
     3.46337024E-06    2     1000023         2   # BR(~u_R -> ~chi_20 u)
     6.94079212E-03    2     1000025         2   # BR(~u_R -> ~chi_30 u)
     1.09123297E-06    2     1000035         2   # BR(~u_R -> ~chi_40 u)
     9.93045375E-01    2     1000021         2   # BR(~u_R -> ~g      u)
#
#         PDG            Width
DECAY   1000001     5.30172226E-03   # sdown_L decays
#          BR         NDA      ID1       ID2
     6.17739942E-01    2     1000022         1   # BR(~d_L -> ~chi_10 d)
     2.31522108E-01    2     1000023         1   # BR(~d_L -> ~chi_20 d)
     1.50737950E-01    2    -1000024         2   # BR(~d_L -> ~chi_1- u)
#
#         PDG            Width
DECAY   2000001     1.15712584E-01   # sdown_R decays
#           BR         NDA      ID1       ID2
     1.44816307E-03    2     1000022         1   # BR(~d_R -> ~chi_10 d)
     5.40352244E-04    2     1000023         1   # BR(~d_R -> ~chi_20 d)
#           BR         NDA      ID1       ID2       ID3
     2.80185602E-03    3        1       -1        1000001   # BR(~d_R -> d  db  ~d_L)
     1.94058410E-03    3        1       1        -1000001   # BR(~d_R -> d  d  ~d_L*)
     2.86563474E-03    3        1       -2        1000002   # BR(~d_R -> d  ub  ~u_L)
     1.97420188E-03    3        1       2        -1000002   # BR(~d_R -> d  u  ~u_L*)
     2.78604098E-03    3        1       -3        1000003   # BR(~d_R -> d  sb  ~s_L)
     1.91016390E-03    3        1       3        -1000003   # BR(~d_R -> d  s  ~s_L*)
     2.84601717E-03    3        1       -4        1000004   # BR(~d_R -> d  cb  ~c_L)
     1.98491808E-03    3        1       4        -1000004   # BR(~d_R -> d  c  ~c_L*)
     2.57975399E-01    3        1       -5        1000005   # BR(~d_R -> d  bb  ~b_1)
     6.22974595E-01    3        1       5        -1000005   # BR(~d_R -> d  b  ~b_1*)
     3.73407961E-02    3        1       -6        1000006   # BR(~d_R -> d  tb  ~t_1)
     5.93124773E-02    3        1       6        -1000006   # BR(~d_R -> d  t  ~t_1*)
     2.01533828E-05    3        1       -11        1000011   # BR(~d_R -> d  e+  ~e_L-)
     5.13479157E-06    3        1       11        -1000011   # BR(~d_R -> d  e-  ~e_L+)
     3.80831527E-05    3        1       -11        2000011   # BR(~d_R -> d  e+  ~e_R-)
     1.66481461E-04    3        1       11        -2000011   # BR(~d_R -> d  e-  ~e_R+)
     2.01516544E-05    3        1       -12        1000012   # BR(~d_R -> d  nu_eb  ~nu_eL)
     5.06988938E-06    3        1       12        -1000012   # BR(~d_R -> d  nu_e  ~nu_eL*)
     2.00289366E-05    3        1       -13        1000013   # BR(~d_R -> d  mu+  ~mu_L-)
     5.04819770E-06    3        1       13        -1000013   # BR(~d_R -> d  mu-  ~mu_L+)
     3.84729115E-05    3        1       -13        2000013   # BR(~d_R -> d  mu+  ~mu_R-)
     1.66550598E-04    3        1       13        -2000013   # BR(~d_R -> d  mu-  ~mu_R+)
     2.00470850E-05    3        1       -14        1000014   # BR(~d_R -> d  nu_mub  ~nu_muL)
     5.12830999E-06    3        1       14        -1000014   # BR(~d_R -> d  nu_mu  ~nu_muL*)
     4.40799076E-05    3        1       23        1000022   # BR(~d_R -> d  Z  ~chi_10)
     1.41376153E-04    3        1       25        1000022   # BR(~d_R -> d  h  ~chi_10)
     1.54252886E-04    3        1       23        1000023   # BR(~d_R -> d  Z  ~chi_20)
     4.06040540E-05    3        1       25        1000023   # BR(~d_R -> d  h  ~chi_20)
     6.69123422E-05    3        1       -24        1000024   # BR(~d_R -> d  W-  ~chi_1+)
     3.41224772E-04    3        1       24        -1000024   # BR(~d_R -> d  W+  ~chi_1-)
#
#         PDG            Width
DECAY   1000004     1.66515488E-02   # scharm_L decays
#          BR         NDA      ID1       ID2
     1.24756616E-01    2     1000022         4   # BR(~c_L -> ~chi_10 c)
     4.68134407E-02    2     1000023         4   # BR(~c_L -> ~chi_20 c)
     8.28429943E-01    2     1000024         3   # BR(~c_L -> ~chi_1+ s)
#
#         PDG            Width
DECAY   2000004     9.75373050E+01   # scharm_R decays
#          BR         NDA      ID1       ID2
     1.37716092E-05    2     1000022         4   # BR(~c_R -> ~chi_10 c)
     5.14042545E-06    2     1000023         4   # BR(~c_R -> ~chi_20 c)
     1.00142798E-02    2     1000025         4   # BR(~c_R -> ~chi_30 c)
     1.56643971E-06    2     1000035         4   # BR(~c_R -> ~chi_40 c)
     9.89965242E-01    2     1000021         4   # BR(~c_R -> ~g      c)
#
#         PDG            Width
DECAY   1000003     5.34870928E-03   # sstrange_L decays
#          BR         NDA      ID1       ID2
     6.17742594E-01    2     1000022         3   # BR(~s_L -> ~chi_10 s)
     2.31520040E-01    2     1000023         3   # BR(~s_L -> ~chi_20 s)
     1.50737366E-01    2    -1000024         4   # BR(~s_L -> ~chi_1- c)
#
#         PDG            Width
DECAY   2000003     1.15724360E-01   # sstrange_R decays
#           BR         NDA      ID1       ID2
     1.48196815E-03    2     1000022         3   # BR(~s_R -> ~chi_10 s)
     5.52958557E-04    2     1000023         3   # BR(~s_R -> ~chi_20 s)
#           BR         NDA      ID1       ID2       ID3
     2.80450891E-03    3        3       -1        1000001   # BR(~s_R -> s  db  ~d_L)
     1.95187944E-03    3        3       1        -1000001   # BR(~s_R -> s  d  ~d_L*)
     2.83751838E-03    3        3       -2        1000002   # BR(~s_R -> s  ub  ~u_L)
     1.99145624E-03    3        3       2        -1000002   # BR(~s_R -> s  u  ~u_L*)
     2.78567105E-03    3        3       -3        1000003   # BR(~s_R -> s  sb  ~s_L)
     1.94038662E-03    3        3       3        -1000003   # BR(~s_R -> s  s  ~s_L*)
     2.83941945E-03    3        3       -4        1000004   # BR(~s_R -> s  cb  ~c_L)
     1.93278234E-03    3        3       4        -1000004   # BR(~s_R -> s  c  ~c_L*)
     2.57966429E-01    3        3       -5        1000005   # BR(~s_R -> s  bb  ~b_1)
     6.22937122E-01    3        3       5        -1000005   # BR(~s_R -> s  b  ~b_1*)
     3.73724252E-02    3        3       -6        1000006   # BR(~s_R -> s  tb  ~t_1)
     5.93081697E-02    3        3       6        -1000006   # BR(~s_R -> s  t  ~t_1*)
     2.01513320E-05    3        3       -11        1000011   # BR(~s_R -> s  e+  ~e_L-)
     5.11594964E-06    3        3       11        -1000011   # BR(~s_R -> s  e-  ~e_L+)
     3.80792772E-05    3        3       -11        2000011   # BR(~s_R -> s  e+  ~e_R-)
     1.65116488E-04    3        3       11        -2000011   # BR(~s_R -> s  e-  ~e_R+)
     2.01496037E-05    3        3       -12        1000012   # BR(~s_R -> s  nu_eb  ~nu_eL)
     5.09884002E-06    3        3       12        -1000012   # BR(~s_R -> s  nu_e  ~nu_eL*)
     2.00268983E-05    3        3       -13        1000013   # BR(~s_R -> s  mu+  ~mu_L-)
     5.04768398E-06    3        3       13        -1000013   # BR(~s_R -> s  mu-  ~mu_L+)
     3.83212315E-05    3        3       -13        2000013   # BR(~s_R -> s  mu+  ~mu_R-)
     1.66801527E-04    3        3       13        -2000013   # BR(~s_R -> s  mu-  ~mu_R+)
     2.00450449E-05    3        3       -14        1000014   # BR(~s_R -> s  nu_mub  ~nu_muL)
     5.12778812E-06    3        3       14        -1000014   # BR(~s_R -> s  nu_mu  ~nu_muL*)
     4.40754218E-05    3        3       23        1000022   # BR(~s_R -> s  Z  ~chi_10)
     1.41361766E-04    3        3       25        1000022   # BR(~s_R -> s  h  ~chi_10)
     1.54237189E-04    3        3       23        1000023   # BR(~s_R -> s  Z  ~chi_20)
     4.05999220E-05    3        3       25        1000023   # BR(~s_R -> s  h  ~chi_20)
     6.69055329E-05    3        3       -24        1000024   # BR(~s_R -> s  W-  ~chi_1+)
     3.41043147E-04    3        3       24        -1000024   # BR(~s_R -> s  W+  ~chi_1-)
#
#         PDG            Width
DECAY   1000011     1.46438498E-03   # selectron_L decays
#          BR         NDA      ID1       ID2
     4.79769462E-01    2     1000022        11   # BR(~e_L -> ~chi_10 e-)
     1.80224488E-01    2     1000023        11   # BR(~e_L -> ~chi_20 e-)
     3.40006050E-01    2    -1000024        12   # BR(~e_L -> ~chi_1- nu_e)
#
#         PDG            Width
DECAY   2000011     9.01400646E-04   # selectron_R decays
#           BR         NDA      ID1       ID2
     7.01438832E-01    2     1000022        11   # BR(~e_R -> ~chi_10 e-)
     2.61224106E-01    2     1000023        11   # BR(~e_R -> ~chi_20 e-)
#           BR         NDA      ID1       ID2       ID3
     2.76702708E-05    3        11       -5        1000005   # BR(~e_R- -> e-  bb  ~b_1)
     4.19580352E-04    3        11       5        -1000005   # BR(~e_R- -> e-  b  ~b_1*)
     1.85577857E-03    3        11       23        1000022   # BR(~e_R- -> e-  Z  ~chi_10)
     6.40081636E-03    3        11       25        1000022   # BR(~e_R- -> e-  h  ~chi_10)
     6.41801182E-03    3        11       23        1000023   # BR(~e_R- -> e-  Z  ~chi_20)
     1.88628664E-03    3        11       25        1000023   # BR(~e_R- -> e-  h  ~chi_20)
     1.82216421E-03    3        11       -24        1000024   # BR(~e_R- -> e-  W-  ~chi_1+)
     1.85067540E-02    3        11       24        -1000024   # BR(~e_R- -> e-  W+  ~chi_1-)
#
#         PDG            Width
DECAY   1000013     1.46438496E-03   # smuon_L decays
#          BR         NDA      ID1       ID2
     4.79769459E-01    2     1000022        13   # BR(~mu_L -> ~chi_10 mu-)
     1.80224487E-01    2     1000023        13   # BR(~mu_L -> ~chi_20 mu-)
     3.40006054E-01    2    -1000024        14   # BR(~mu_L -> ~chi_1- nu_mu)
#
#         PDG            Width
DECAY   2000013     9.01416964E-04   # smuon_R decays
#           BR         NDA      ID1       ID2
     7.01426114E-01    2     1000022        13   # BR(~mu_R -> ~chi_10 mu-)
     2.61219371E-01    2     1000023        13   # BR(~mu_R -> ~chi_20 mu-)
#           BR         NDA      ID1       ID2       ID3
     2.72393365E-05    3        13       -5        1000005   # BR(~mu_R- -> mu-  bb  ~b_1)
     4.17720117E-04    3        13       5        -1000005   # BR(~mu_R- -> mu-  b  ~b_1*)
     1.86073711E-03    3        13       23        1000022   # BR(~mu_R- -> mu-  Z  ~chi_10)
     6.40014580E-03    3        13       25        1000022   # BR(~mu_R- -> mu-  h  ~chi_10)
     6.41833938E-03    3        13       23        1000023   # BR(~mu_R- -> mu-  Z  ~chi_20)
     1.88625250E-03    3        13       25        1000023   # BR(~mu_R- -> mu-  h  ~chi_20)
     1.82213123E-03    3        13       -24        1000024   # BR(~mu_R- -> mu-  W-  ~chi_1+)
     1.85219501E-02    3        13       24        -1000024   # BR(~mu_R- -> mu-  W+  ~chi_1-)
#
#         PDG            Width
DECAY   1000015     2.29034753E-01   # stau_1 decays
#          BR         NDA      ID1       ID2
     5.00914919E-01    2     1000022        15   # BR(~tau_1 -> ~chi_10  tau-)
     4.93625345E-01    2     1000023        15   # BR(~tau_1 -> ~chi_20  tau-)
     5.45973526E-03    2    -1000024        16   # BR(~tau_1 -> ~chi_1-  nu_tau)
#
#         PDG            Width
DECAY   2000015     5.17070127E-01   # stau_2 decays
#          BR         NDA      ID1       ID2
     2.53532085E-01    2     1000022        15   # BR(~tau_2 -> ~chi_10  tau-)
     2.49436787E-01    2     1000023        15   # BR(~tau_2 -> ~chi_20  tau-)
     4.96958479E-01    2    -1000024        16   # BR(~tau_2 -> ~chi_1-  nu_tau)
     3.42939835E-05    2     1000016       -24   # BR(~tau_2 -> ~nu_tauL W-)
     2.12824823E-05    2     1000015        25   # BR(~tau_2 -> ~tau_1   h)
     1.70721532E-05    2     1000015        23   # BR(~tau_2 -> ~tau_1   Z)
#
#         PDG            Width
DECAY   1000012     1.25733334E-02   # snu_eL decays
#          BR         NDA      ID1       ID2
     2.35701451E-01    2     1000022        12   # BR(~nu_eL -> ~chi_10 nu_e)
     8.81799876E-02    2     1000023        12   # BR(~nu_eL -> ~chi_20 nu_e)
     6.76118561E-01    2     1000024        11   # BR(~nu_eL -> ~chi_1+ e-)
#
#         PDG            Width
DECAY   1000014     1.25733332E-02   # snu_muL decays
#          BR         NDA      ID1       ID2
     2.35701454E-01    2     1000022        14   # BR(~nu_muL -> ~chi_10 nu_mu)
     8.81799887E-02    2     1000023        14   # BR(~nu_muL -> ~chi_20 nu_mu)
     6.76118557E-01    2     1000024        13   # BR(~nu_muL -> ~chi_1+ mu-)
#
#         PDG            Width
DECAY   1000016     2.57117067E-01   # snu_tauL decays
#          BR         NDA      ID1       ID2
     2.92449268E-02    2     1000022        16   # BR(~nu_tauL -> ~chi_10 nu_tau)
     1.09563527E-02    2     1000023        16   # BR(~nu_tauL -> ~chi_20 nu_tau)
     9.59798721E-01    2     1000024        15   # BR(~nu_tauL -> ~chi_1+ tau-)
#
#         PDG            Width
DECAY   1000024     3.74883590E-12   # chargino1+ decays
#           BR         NDA      ID1       ID2       ID3
     1.53449410E-01    3     1000022       -11        12   # BR(~chi_1+ -> ~chi_10 e+   nu_e)
     1.45233650E-01    3     1000022       -13        14   # BR(~chi_1+ -> ~chi_10 mu+  nu_mu)
     3.90912340E-01    2     1000022       211             # BR(~chi_1+ -> ~chi_10 pi+)
     2.17814890E-01    3     1000022       211        111   # BR(~chi_1+ -> ~chi_10 pi+ pi0)
     4.62948580E-02    4     1000022       211        111       111 # BR(~chi_1+ -> ~chi_10 pi+ pi0 pi0)
     4.62948580E-02    4     1000022       211        211      -211 # BR(~chi_1+ -> ~chi_10 pi+ pi+ pi-)
#
#         PDG            Width
DECAY   1000037     1.78788044E+02   # chargino2+ decays
#          BR         NDA      ID1       ID2
     1.18978046E-01    2     1000002        -1   # BR(~chi_2+ -> ~u_L     db)
     1.18941031E-01    2    -1000001         2   # BR(~chi_2+ -> ~d_L*    u )
     1.18978045E-01    2     1000004        -3   # BR(~chi_2+ -> ~c_L     sb)
     1.18941004E-01    2    -1000003         4   # BR(~chi_2+ -> ~s_L*     c )
     3.99248889E-03    2     1000006        -5   # BR(~chi_2+ -> ~t_1     bb)
     4.54421716E-02    2     2000006        -5   # BR(~chi_2+ -> ~t_2     bb)
     3.96417115E-09    2    -1000005         6   # BR(~chi_2+ -> ~b_1*    t )
     4.63365881E-02    2    -2000005         6   # BR(~chi_2+ -> ~b_2*    t )
     5.96160574E-02    2     1000012       -11   # BR(~chi_2+ -> ~nu_eL   e+  )
     5.96160574E-02    2     1000014       -13   # BR(~chi_2+ -> ~nu_muL mu+ )
     1.14435056E-02    2     1000016       -15   # BR(~chi_2+ -> ~nu_tau1 tau+)
     5.95962325E-02    2    -1000011        12   # BR(~chi_2+ -> ~e_L+    nu_e)
     5.95962325E-02    2    -1000013        14   # BR(~chi_2+ -> ~mu_L+   nu_mu)
     1.14154171E-02    2    -1000015        16   # BR(~chi_2+ -> ~tau_1+  nu_tau)
     8.00483060E-10    2    -2000015        16   # BR(~chi_2+ -> ~tau_2+  nu_tau)
     3.78072321E-02    2     1000024        23   # BR(~chi_2+ -> ~chi_1+  Z )
     3.65906188E-02    2     1000022        24   # BR(~chi_2+ -> ~chi_10  W+)
     3.67734167E-02    2     1000023        24   # BR(~chi_2+ -> ~chi_20  W+)
     5.14782761E-06    2     1000025        24   # BR(~chi_2+ -> ~chi_30  W+)
     4.04191794E-02    2     1000024        25   # BR(~chi_2+ -> ~chi_1+  h )
     3.88161804E-03    2     1000024        35   # BR(~chi_2+ -> ~chi_1+  H )
     3.88663286E-03    2     1000024        36   # BR(~chi_2+ -> ~chi_1+  A )
     3.88738361E-03    2     1000022        37   # BR(~chi_2+ -> ~chi_10  H+)
     3.85588933E-03    2     1000023        37   # BR(~chi_2+ -> ~chi_20  H+)
#
#         PDG            Width
DECAY   1000022     0.00000000E+00   # neutralino1 decays
#
#         PDG            Width
DECAY   1000023     2.20813771E-11   # neutralino2 decays
#          BR         NDA      ID1       ID2
     3.52708939E-01    2     1000022        22   # BR(~chi_20 -> ~chi_10 gam)
#           BR         NDA      ID1       ID2       ID3
     1.04583406E-01    3     1000022        -2         2   # BR(~chi_20 -> ~chi_10 ub      u)
     1.35738166E-01    3     1000022        -1         1   # BR(~chi_20 -> ~chi_10 db      d)
     1.35738166E-01    3     1000022        -3         3   # BR(~chi_20 -> ~chi_10 sb      s)
     3.11722983E-02    3     1000022       -11        11   # BR(~chi_20 -> ~chi_10 e+      e-)
     3.11722983E-02    3     1000022       -13        13   # BR(~chi_20 -> ~chi_10 mu+     mu-)
     6.23276998E-02    3     1000022       -12        12   # BR(~chi_20 -> ~chi_10 nu_eb   nu_e)
     6.23276998E-02    3     1000022       -14        14   # BR(~chi_20 -> ~chi_10 nu_mub  nu_mu)
     6.23274837E-02    3     1000022       -16        16   # BR(~chi_20 -> ~chi_10 nu_taub nu_tau)
     6.57114826E-03    3     1000024        -2         1   # BR(~chi_20 -> ~chi_1+ ub      d)
     6.57114826E-03    3    -1000024        -1         2   # BR(~chi_20 -> ~chi_1- db      u)
     2.19038672E-03    3     1000024       -12        11   # BR(~chi_20 -> ~chi_1+ nu_eb   e-)
     2.19038672E-03    3    -1000024        12       -11   # BR(~chi_20 -> ~chi_1- nu_e    e+)
     2.19038672E-03    3     1000024       -14        13   # BR(~chi_20 -> ~chi_1+ nu_mub  mu-)
     2.19038672E-03    3    -1000024        14       -13   # BR(~chi_20 -> ~chi_1- nu_mu   mu+)
#
#         PDG            Width
DECAY   1000025     8.09683161E+01   # neutralino3 decays
#          BR         NDA      ID1       ID2
     7.08940505E-03    2     1000022        23   # BR(~chi_30 -> ~chi_10   Z )
     1.92103755E-02    2     1000023        23   # BR(~chi_30 -> ~chi_20   Z )
     2.81410802E-02    2     1000024       -24   # BR(~chi_30 -> ~chi_1+   W-)
     2.81410802E-02    2    -1000024        24   # BR(~chi_30 -> ~chi_1-   W+)
     1.95095114E-02    2     1000022        25   # BR(~chi_30 -> ~chi_10   h )
     1.20612493E-03    2     1000022        35   # BR(~chi_30 -> ~chi_10   H )
     6.27365083E-04    2     1000022        36   # BR(~chi_30 -> ~chi_10   A )
     7.16218129E-03    2     1000023        25   # BR(~chi_30 -> ~chi_20   h )
     6.19529232E-04    2     1000023        35   # BR(~chi_30 -> ~chi_20   H )
     1.20095618E-03    2     1000023        36   # BR(~chi_30 -> ~chi_20   A )
     2.01632268E-03    2     1000024       -37   # BR(~chi_30 -> ~chi_1+   H-)
     2.01632268E-03    2    -1000024        37   # BR(~chi_30 -> ~chi_1-   H+)
     5.08989589E-03    2     1000002        -2   # BR(~chi_30 -> ~u_L      ub)
     5.08989589E-03    2    -1000002         2   # BR(~chi_30 -> ~u_L*     u )
     3.71194837E-03    2     1000001        -1   # BR(~chi_30 -> ~d_L      db)
     3.71194837E-03    2    -1000001         1   # BR(~chi_30 -> ~d_L*     d )
     1.20684850E-02    2     2000001        -1   # BR(~chi_30 -> ~d_R      db)
     1.20684850E-02    2    -2000001         1   # BR(~chi_30 -> ~d_R*     d )
     5.08989449E-03    2     1000004        -4   # BR(~chi_30 -> ~c_L      cb)
     5.08989449E-03    2    -1000004         4   # BR(~chi_30 -> ~c_L*     c )
     3.71194837E-03    2     1000003        -3   # BR(~chi_30 -> ~s _L      sb)
     3.71194837E-03    2    -1000003         3   # BR(~chi_30 -> ~s _L*     s )
     1.20684850E-02    2     2000003        -3   # BR(~chi_30 -> ~s _R      sb)
     1.20684850E-02    2    -2000003         3   # BR(~chi_30 -> ~s _R*     s )
     9.73733296E-02    2     1000006        -6   # BR(~chi_30 -> ~t_1      tb)
     9.73733296E-02    2    -1000006         6   # BR(~chi_30 -> ~t_1*     t )
     1.63934890E-03    2     2000006        -6   # BR(~chi_30 -> ~t_2      tb)
     1.63934890E-03    2    -2000006         6   # BR(~chi_30 -> ~t_2*     t )
     3.26474319E-02    2     1000005        -5   # BR(~chi_30 -> ~b_1      bb)
     3.26474319E-02    2    -1000005         5   # BR(~chi_30 -> ~b_1*     b )
     1.32412129E-03    2     2000005        -5   # BR(~chi_30 -> ~b_2      bb)
     1.32412129E-03    2    -2000005         5   # BR(~chi_30 -> ~b_2*     b )
     2.14363857E-02    2     1000011       -11   # BR(~chi_30 -> ~e_L-     e+)
     2.14363857E-02    2    -1000011        11   # BR(~chi_30 -> ~e_L+     e-)
     8.81675266E-02    2     2000011       -11   # BR(~chi_30 -> ~e_R-     e+)
     8.81675266E-02    2    -2000011        11   # BR(~chi_30 -> ~e_R+     e-)
     2.14363857E-02    2     1000013       -13   # BR(~chi_30 -> ~mu_L-    mu+)
     2.14363857E-02    2    -1000013        13   # BR(~chi_30 -> ~mu_L+    mu-)
     8.81675266E-02    2     2000013       -13   # BR(~chi_30 -> ~mu_R-    mu+)
     8.81675266E-02    2    -2000013        13   # BR(~chi_30 -> ~mu_R+    mu-)
     3.32044320E-03    2     1000015       -15   # BR(~chi_30 -> ~tau_1-   tau+)
     3.32044320E-03    2    -1000015        15   # BR(~chi_30 -> ~tau_1+   tau-)
     2.60364300E-03    2     2000015       -15   # BR(~chi_30 -> ~tau_2-   tau+)
     2.60364300E-03    2    -2000015        15   # BR(~chi_30 -> ~tau_2+   tau-)
     1.93350077E-02    2     1000012       -12   # BR(~chi_30 -> ~nu_eL    nu_eb)
     1.93350077E-02    2    -1000012        12   # BR(~chi_30 -> ~nu_eL*   nu_e )
     1.93350077E-02    2     1000014       -14   # BR(~chi_30 -> ~nu_muL   nu_mub)
     1.93350077E-02    2    -1000014        14   # BR(~chi_30 -> ~nu_muL*  nu_mu )
     3.00305788E-03    2     1000016       -16   # BR(~chi_30 -> ~nu_tau1  nu_taub)
     3.00305788E-03    2    -1000016        16   # BR(~chi_30 -> ~nu_tau1* nu_tau )
#
#         PDG            Width
DECAY   1000035     1.78740173E+02   # neutralino4 decays
#          BR         NDA      ID1       ID2
     1.04113009E-02    2     1000022        23   # BR(~chi_40 -> ~chi_10   Z )
     2.80656442E-02    2     1000023        23   # BR(~chi_40 -> ~chi_20   Z )
     2.05937877E-09    2     1000025        23   # BR(~chi_40 -> ~chi_30   Z )
     3.60572942E-02    2     1000024       -24   # BR(~chi_40 -> ~chi_1+   W-)
     3.60572942E-02    2    -1000024        24   # BR(~chi_40 -> ~chi_1-   W+)
     2.98904616E-02    2     1000022        25   # BR(~chi_40 -> ~chi_10   h )
     2.39569028E-03    2     1000022        35   # BR(~chi_40 -> ~chi_10   H )
     1.56632211E-03    2     1000022        36   # BR(~chi_40 -> ~chi_10   A )
     1.11076290E-02    2     1000023        25   # BR(~chi_40 -> ~chi_20   h )
     1.55160771E-03    2     1000023        35   # BR(~chi_40 -> ~chi_20   H )
     2.38655660E-03    2     1000023        36   # BR(~chi_40 -> ~chi_20   A )
     3.80331815E-03    2     1000024       -37   # BR(~chi_40 -> ~chi_1+   H-)
     3.80331815E-03    2    -1000024        37   # BR(~chi_40 -> ~chi_1-   H+)
     5.91835670E-02    2     1000002        -2   # BR(~chi_40 -> ~u_L      ub)
     5.91835670E-02    2    -1000002         2   # BR(~chi_40 -> ~u_L*     u )
     5.97684490E-02    2     1000001        -1   # BR(~chi_40 -> ~d_L      db)
     5.97684490E-02    2    -1000001         1   # BR(~chi_40 -> ~d_L*     d )
     1.31224196E-06    2     2000001        -1   # BR(~chi_40 -> ~d_R      db)
     1.31224196E-06    2    -2000001         1   # BR(~chi_40 -> ~d_R*     d )
     5.91835534E-02    2     1000004        -4   # BR(~chi_40 -> ~c_L      cb)
     5.91835534E-02    2    -1000004         4   # BR(~chi_40 -> ~c_L*     c )
     5.97684490E-02    2     1000003        -3   # BR(~chi_40 -> ~s _L      sb)
     5.97684490E-02    2    -1000003         3   # BR(~chi_40 -> ~s _L*     s )
     1.31224196E-06    2     2000003        -3   # BR(~chi_40 -> ~s _R      sb)
     1.31224196E-06    2    -2000003         3   # BR(~chi_40 -> ~s _R*     s )
     1.96767906E-03    2     1000006        -6   # BR(~chi_40 -> ~t_1      tb)
     1.96767906E-03    2    -1000006         6   # BR(~chi_40 -> ~t_1*     t )
     2.18832163E-02    2     2000006        -6   # BR(~chi_40 -> ~t_2      tb)
     2.18832163E-02    2    -2000006         6   # BR(~chi_40 -> ~t_2*     t )
     3.27609417E-06    2     1000005        -5   # BR(~chi_40 -> ~b_1      bb)
     3.27609417E-06    2    -1000005         5   # BR(~chi_40 -> ~b_1*     b )
     2.40265067E-02    2     2000005        -5   # BR(~chi_40 -> ~b_2      bb)
     2.40265067E-02    2    -2000005         5   # BR(~chi_40 -> ~b_2*     b )
     2.92885302E-02    2     1000011       -11   # BR(~chi_40 -> ~e_L-     e+)
     2.92885302E-02    2    -1000011        11   # BR(~chi_40 -> ~e_L+     e-)
     8.91037757E-06    2     2000011       -11   # BR(~chi_40 -> ~e_R-     e+)
     8.91037757E-06    2    -2000011        11   # BR(~chi_40 -> ~e_R+     e-)
     2.92885302E-02    2     1000013       -13   # BR(~chi_40 -> ~mu_L-    mu+)
     2.92885302E-02    2    -1000013        13   # BR(~chi_40 -> ~mu_L+    mu-)
     8.91037757E-06    2     2000013       -13   # BR(~chi_40 -> ~mu_R-    mu+)
     8.91037757E-06    2    -2000013        13   # BR(~chi_40 -> ~mu_R+    mu-)
     5.60857079E-03    2     1000015       -15   # BR(~chi_40 -> ~tau_1-   tau+)
     5.60857079E-03    2    -1000015        15   # BR(~chi_40 -> ~tau_1+   tau-)
     4.70799106E-07    2     2000015       -15   # BR(~chi_40 -> ~tau_2-   tau+)
     4.70799106E-07    2    -2000015        15   # BR(~chi_40 -> ~tau_2+   tau-)
     3.03209223E-02    2     1000012       -12   # BR(~chi_40 -> ~nu_eL    nu_eb)
     3.03209223E-02    2    -1000012        12   # BR(~chi_40 -> ~nu_eL*   nu_e )
     3.03209223E-02    2     1000014       -14   # BR(~chi_40 -> ~nu_muL   nu_mub)
     3.03209223E-02    2    -1000014        14   # BR(~chi_40 -> ~nu_muL*  nu_mu )
     5.81869212E-03    2     1000016       -16   # BR(~chi_40 -> ~nu_tau1  nu_taub)
     5.81869212E-03    2    -1000016        16   # BR(~chi_40 -> ~nu_tau1* nu_tau )
#
#         PDG            Width
DECAY        25     4.14184897E-03   # h decays
#          BR         NDA      ID1       ID2
     5.92301940E-01    2           5        -5   # BR(h -> b       bb     )
     6.31386845E-02    2         -15        15   # BR(h -> tau+    tau-   )
     2.23482385E-04    2         -13        13   # BR(h -> mu+     mu-    )
     2.43727776E-04    2           3        -3   # BR(h -> s       sb     )
     2.10090146E-02    2           4        -4   # BR(h -> c       cb     )
     7.77839084E-02    2          21        21   # BR(h -> g       g      )
     2.31968444E-03    2          22        22   # BR(h -> gam     gam    )
     1.58360893E-03    2          22        23   # BR(h -> Z       gam    )
     2.14311955E-01    2          24       -24   # BR(h -> W+      W-     )
     2.70839937E-02    2          23        23   # BR(h -> Z       Z      )
#
#         PDG            Width
DECAY        35     4.25744150E+00   # H decays
#          BR         NDA      ID1       ID2
     2.88189157E-01    2           5        -5   # BR(H -> b       bb     )
     5.35216015E-02    2         -15        15   # BR(H -> tau+    tau-   )
     1.88416935E-04    2         -13        13   # BR(H -> mu+     mu-    )
     1.18377728E-04    2           3        -3   # BR(H -> s       sb     )
     6.61129973E-06    2           4        -4   # BR(H -> c       cb     )
     6.48179629E-01    2           6        -6   # BR(H -> t       tb     )
     4.04838052E-04    2          21        21   # BR(H -> g       g      )
     2.32806244E-06    2          22        22   # BR(H -> gam     gam    )
     5.34827285E-07    2          23        22   # BR(H -> Z       gam    )
     3.78981025E-04    2          24       -24   # BR(H -> W+      W-     )
     1.89018464E-04    2          23        23   # BR(H -> Z       Z      )
     1.42349022E-03    2          25        25   # BR(H -> h       h      )
     4.66713290E-03    2     1000024  -1000024   # BR(H -> ~chi_1+ ~chi_1-)
     1.21111094E-03    2     1000022   1000022   # BR(H -> ~chi_10 ~chi_10)
     8.51777080E-04    2     1000023   1000023   # BR(H -> ~chi_20 ~chi_20)
     3.66466675E-04    2     1000022   1000023   # BR(H -> ~chi_10 ~chi_20)
     8.89441360E-06    2     1000005  -1000005   # BR(H -> ~b_1    ~b_1*  )
     2.84163278E-05    2     1000011  -1000011   # BR(H -> ~e_L-   ~e_L+  )
     2.46262783E-05    2     2000011  -2000011   # BR(H -> ~e_R-   ~e_R+  )
     2.84163278E-05    2     1000013  -1000013   # BR(H -> ~mu_L-  ~mu_L+ )
     2.46262783E-05    2     2000013  -2000013   # BR(H -> ~mu_R-  ~mu_R+ )
     9.27745436E-05    2     1000012  -1000012   # BR(H -> ~nu_eL  ~nu_eL*   )
     9.27745436E-05    2     1000014  -1000014   # BR(H -> ~nu_muL ~nu_muL*  )
#
#         PDG            Width
DECAY        36     4.26958525E+00   # A decays
#          BR         NDA      ID1       ID2
     2.87604397E-01    2           5        -5   # BR(A -> b       bb     )
     5.33745040E-02    2         -15        15   # BR(A -> tau+    tau-   )
     1.87898839E-04    2         -13        13   # BR(A -> mu+     mu-    )
     1.18258451E-04    2           3        -3   # BR(A -> s       sb     )
     6.61110512E-06    2           4        -4   # BR(A -> c       cb     )
     6.49119670E-01    2           6        -6   # BR(A -> t       tb     )
     6.15112373E-04    2          21        21   # BR(A -> g       g      )
     2.15434852E-06    2          22        22   # BR(A -> gam     gam    )
     7.74049948E-07    2          23        22   # BR(A -> Z       gam    )
     3.82494911E-04    2          23        25   # BR(A -> Z       h      )
     5.70561161E-03    2     1000024  -1000024   # BR(A -> ~chi_1+ ~chi_1-)
     2.39404910E-03    2     1000022   1000022   # BR(A -> ~chi_10 ~chi_10)
     4.73580525E-04    2     1000023   1000023   # BR(A -> ~chi_20 ~chi_20)
     1.48837930E-05    2     1000022   1000023   # BR(A -> ~chi_10 ~chi_20)
#
#         PDG            Width
DECAY        37     4.16840440E+00   # H+ decays
#          BR         NDA      ID1       ID2
     4.79497906E-04    2           4        -5   # BR(H+ -> c       bb     )
     5.47014926E-02    2         -15        16   # BR(H+ -> tau+    nu_tau )
     1.92570350E-04    2         -13        14   # BR(H+ -> mu+     nu_mu  )
     4.79486318E-06    2           2        -5   # BR(H+ -> u       bb     )
     6.05262950E-06    2           2        -3   # BR(H+ -> u       sb     )
     1.25627924E-04    2           4        -3   # BR(H+ -> c       sb     )
     9.37924670E-01    2           6        -5   # BR(H+ -> t       bb     )
     3.92754345E-04    2          24        25   # BR(H+ -> W+      h      )
     2.97416161E-12    2          24        36   # BR(H+ -> W+      A      )
     1.03031069E-04    2     1000024   1000022   # BR(H+ -> ~chi_1+ ~chi_10)
     7.01679881E-04    2     1000024   1000023   # BR(H+ -> ~chi_1+ ~chi_20)
     1.13979126E-04    2    -1000011   1000012   # BR(H+ -> ~e_L+   ~nu_eL )
     1.13979126E-04    2    -1000013   1000014   # BR(H+ -> ~mu_L+  ~nu_muL)
     5.13987000E-03    2     1000006  -1000005   # BR(H+ -> ~t_1    ~b_1*  )
