#
#                              ======================
#                              | THE SUSYHIT OUTPUT |
#                              ======================
#
#
#              ------------------------------------------------------
#              |     This is the output of the SUSY-HIT package     |
#              |  created by A.Djouadi, M.Muehlleitner and M.Spira. |
#              |  In case of problems with SUSY-HIT email to        |
#              |           margarete.muehlleitner@cern.ch           |
#              |           michael.spira@psi.ch                     |
#              |           abdelhak.djouadi@cern.ch                 |
#              ------------------------------------------------------
#
#              ------------------------------------------------------
#              |  SUSY Les Houches Accord - MSSM Spectrum + Decays  |
#              |              based on the decay programs           |
#              |                                                    |
#              |                     SDECAY 1.3b                    |
#              |                                                    |
#              |  Authors: M.Muhlleitner, A.Djouadi and Y.Mambrini  |
#              |  Ref.:    Comput.Phys.Commun.168(2005)46           |
#              |           [hep-ph/0311167]                         |
#              |                                                    |
#              |                     HDECAY 3.4                     |
#              |                                                    |
#              |  By: A.Djouadi,J.Kalinowski,M.Muhlleitner,M.Spira  |
#              |  Ref.:    Comput.Phys.Commun.108(1998)56           |
#              |           [hep-ph/9704448]                         |
#              |                                                    |
#              |                                                    |
#              |  If not stated otherwise all DRbar couplings and   |
#              |  soft SUSY breaking masses are given at the scale  |
#              |  Q=  0.24984870E+04
#              |                                                    |
#              ------------------------------------------------------
#
#
BLOCK DCINFO  # Decay Program information
     1   SDECAY/HDECAY # decay calculator
     2   1.3b  /3.4    # version number
#
BLOCK SPINFO  # Spectrum calculator information
     1     SOFTSUSY    # spectrum calculator               
     2     3.4.0       # version number                    
#
BLOCK MODSEL  # Model selection
     1     0   #  nonUniversal                                     
#
BLOCK SMINPUTS  # Standard Model inputs
         1     1.27908970E+02   # alpha_em^-1(M_Z)^MSbar
         2     1.16637870E-05   # G_F [GeV^-2]
         3     1.18400000E-01   # alpha_S(M_Z)^MSbar
         4     9.11876000E+01   # M_Z pole mass
         5     4.18000000E+00   # mb(mb)^MSbar
         6     1.73200000E+02   # mt pole mass
         7     1.77700000E+00   # mtau pole mass
#
BLOCK MINPAR  # Input parameters - minimal models
         3     8.42000000E+00   # tanb                
#
BLOCK EXTPAR  # Input parameters - non-minimal models
         0    -1.00000000E+00   # Set                 
         1     4.89100000E+01   # M_1(MX)             
         2     2.15706000E+03   # M_2(MX)             
         3     5.67590000E+02   # M_3(MX)             
        11     4.13112000E+03   # At(MX)              
        12    -5.00640000E+02   # Ab(MX)              
        13    -1.60893000E+03   # Atau(MX)            
        23     1.30080000E+02   # mu(MX)              
        26     3.87216000E+03   # mA(pole)            
        31     3.56024000E+03   # meL(MX)             
        32     3.56024000E+03   # mmuL(MX)            
        33     3.18646000E+03   # mtauL(MX)           
        34     1.66560000E+02   # meR(MX)             
        35     1.66560000E+02   # mmuR(MX)            
        36     9.94160000E+02   # mtauR(MX)           
        41     3.60663000E+03   # mqL1(MX)            
        42     3.60663000E+03   # mqL2(MX)            
        43     2.10656000E+03   # mqL3(MX)            
        44     3.48950000E+02   # muR(MX)             
        45     3.48950000E+02   # mcR(MX)             
        46     2.96730000E+03   # mtR(MX)             
        47     3.59152000E+03   # mdR(MX)             
        48     3.59152000E+03   # msR(MX)             
        49     3.61771000E+03   # mbR(MX)             
#
BLOCK MASS  # Mass Spectrum
# PDG code           mass       particle
        24     8.04178157E+01   # W+
        25     1.27098151E+02   # h
        35     3.87224770E+03   # H
        36     3.87215995E+03   # A
        37     3.87333245E+03   # H+
         5     4.81876030E+00   # b-quark pole mass calculated from mb(mb)_Msbar
   1000001     3.65003446E+03   # ~d_L
   2000001     3.62530926E+03   # ~d_R
   1000002     3.64932308E+03   # ~u_L
   2000002     4.16883617E+02   # ~u_R
   1000003     3.65003446E+03   # ~s_L
   2000003     3.62530926E+03   # ~s_R
   1000004     3.64932308E+03   # ~c_L
   2000004     4.16883617E+02   # ~c_R
   1000005     2.11503288E+03   # ~b_1
   2000005     3.65122149E+03   # ~b_2
   1000006     2.09955105E+03   # ~t_1
   2000006     2.92248497E+03   # ~t_2
   1000011     3.57098293E+03   # ~e_L
   2000011     1.76586145E+02   # ~e_R
   1000012     3.56979672E+03   # ~nu_eL
   1000013     3.57098293E+03   # ~mu_L
   2000013     1.76586145E+02   # ~mu_R
   1000014     3.56979672E+03   # ~nu_muL
   1000015     9.96193487E+02   # ~tau_1
   2000015     3.19823318E+03   # ~tau_2
   1000016     3.19694902E+03   # ~nu_tauL
   1000021     7.08380111E+02   # ~g
   1000022     3.92645619E+01   # ~chi_10
   1000023    -1.39869344E+02   # ~chi_20
   1000025     1.45698818E+02   # ~chi_30
   1000035     2.20696043E+03   # ~chi_40
   1000024     1.34528773E+02   # ~chi_1+
   1000037     2.20711485E+03   # ~chi_2+
#
BLOCK NMIX  # Neutralino Mixing Matrix
  1  1     9.30375062E-01   # N_11
  1  2    -6.38446572E-03   # N_12
  1  3     3.40282513E-01   # N_13
  1  4    -1.36269198E-01   # N_14
  2  1    -1.45202367E-01   # N_21
  2  2     2.11279145E-02   # N_22
  2  3     6.83678191E-01   # N_23
  2  4     7.14880420E-01   # N_24
  3  1    -3.36627215E-01   # N_31
  3  2    -2.91242665E-02   # N_32
  3  3     6.45561192E-01   # N_33
  3  4    -6.84897541E-01   # N_34
  4  1    -7.96781994E-04   # N_41
  4  2     9.99332090E-01   # N_42
  4  3     6.53368774E-03   # N_43
  4  4    -3.59450850E-02   # N_44
#
BLOCK UMIX  # Chargino Mixing Matrix U
  1  1    -9.24235231E-03   # U_11
  1  2     9.99957289E-01   # U_12
  2  1    -9.99957289E-01   # U_21
  2  2    -9.24235231E-03   # U_22
#
BLOCK VMIX  # Chargino Mixing Matrix V
  1  1    -5.08744928E-02   # V_11
  1  2     9.98705055E-01   # V_12
  2  1    -9.98705055E-01   # V_21
  2  2    -5.08744928E-02   # V_22
#
BLOCK STOPMIX  # Stop Mixing Matrix
  1  1     9.90185234E-01   # cos(theta_t)
  1  2    -1.39761233E-01   # sin(theta_t)
  2  1     1.39761233E-01   # -sin(theta_t)
  2  2     9.90185234E-01   # cos(theta_t)
#
BLOCK SBOTMIX  # Sbottom Mixing Matrix
  1  1     9.99999913E-01   # cos(theta_b)
  1  2     4.17133063E-04   # sin(theta_b)
  2  1    -4.17133063E-04   # -sin(theta_b)
  2  2     9.99999913E-01   # cos(theta_b)
#
BLOCK STAUMIX  # Stau Mixing Matrix
  1  1     5.14686556E-04   # cos(theta_tau)
  1  2     9.99999868E-01   # sin(theta_tau)
  2  1    -9.99999868E-01   # -sin(theta_tau)
  2  2     5.14686556E-04   # cos(theta_tau)
#
BLOCK ALPHA  # Higgs mixing
          -1.24215778E-01   # Mixing angle in the neutral Higgs boson sector
#
BLOCK HMIX Q=  2.49848700E+03  # DRbar Higgs Parameters
         1     1.32094709E+02   # mu(Q)MSSM           
         2     8.02194256E+00   # tan                 
         3     2.42104374E+02   # higgs               
         4     1.49844353E+07   # mA^2(Q)MSSM         
#
BLOCK GAUGE Q=  2.49848700E+03  # The gauge couplings
     1     3.66029202E-01   # gprime(Q) DRbar
     2     6.38351674E-01   # g(Q) DRbar
     3     1.04172692E+00   # g3(Q) DRbar
#
BLOCK AU Q=  2.49848700E+03  # The trilinear couplings
  1  1     0.00000000E+00   # A_u(Q) DRbar
  2  2     0.00000000E+00   # A_c(Q) DRbar
  3  3     4.13112000E+03   # A_t(Q) DRbar
#
BLOCK AD Q=  2.49848700E+03  # The trilinear couplings
  1  1     0.00000000E+00   # A_d(Q) DRbar
  2  2     0.00000000E+00   # A_s(Q) DRbar
  3  3    -5.00639998E+02   # A_b(Q) DRbar
#
BLOCK AE Q=  2.49848700E+03  # The trilinear couplings
  1  1     0.00000000E+00   # A_e(Q) DRbar
  2  2     0.00000000E+00   # A_mu(Q) DRbar
  3  3    -1.60893000E+03   # A_tau(Q) DRbar
#
BLOCK Yu Q=  2.49848700E+03  # The Yukawa couplings
  1  1     0.00000000E+00   # y_u(Q) DRbar
  2  2     0.00000000E+00   # y_c(Q) DRbar
  3  3     8.47411654E-01   # y_t(Q) DRbar
#
BLOCK Yd Q=  2.49848700E+03  # The Yukawa couplings
  1  1     0.00000000E+00   # y_d(Q) DRbar
  2  2     0.00000000E+00   # y_s(Q) DRbar
  3  3     1.07872058E-01   # y_b(Q) DRbar
#
BLOCK Ye Q=  2.49848700E+03  # The Yukawa couplings
  1  1     0.00000000E+00   # y_e(Q) DRbar
  2  2     0.00000000E+00   # y_mu(Q) DRbar
  3  3     8.28503788E-02   # y_tau(Q) DRbar
#
BLOCK MSOFT Q=  2.49848700E+03  # The soft SUSY breaking masses at the scale Q
         1     4.89100000E+01   # M_1(Q)              
         2     2.15706000E+03   # M_2(Q)              
         3     5.67590000E+02   # M_3(Q)              
        21     1.46906537E+07   # mH1^2(Q)            
        22     2.90669091E+05   # mH2^2(Q)            
        31     3.56024000E+03   # meL(Q)              
        32     3.56024000E+03   # mmuL(Q)             
        33     3.18646000E+03   # mtauL(Q)            
        34     1.66560000E+02   # meR(Q)              
        35     1.66560000E+02   # mmuR(Q)             
        36     9.94160000E+02   # mtauR(Q)            
        41     3.60663000E+03   # mqL1(Q)             
        42     3.60663000E+03   # mqL2(Q)             
        43     2.10656000E+03   # mqL3(Q)             
        44     3.48949998E+02   # muR(Q)              
        45     3.48949998E+02   # mcR(Q)              
        46     2.96730000E+03   # mtR(Q)              
        47     3.59152000E+03   # mdR(Q)              
        48     3.59152000E+03   # msR(Q)              
        49     3.61771000E+03   # mbR(Q)              
#
Block HiggsBoundsInputHiggsCouplingsFermions
# ScalarNormEffCoupSq PseudoSNormEffCoupSq NP   IP1 IP2 IP2
    1.00317037E+00    0.00000000E+00        3  25   5   5  # h0-b-b eff. coupling^2, normalised to SM
    6.43483921E+01    0.00000000E+00        3  35   5   5  # H0-b-b eff. coupling^2, normalised to SM
    0.00000000E+00    6.43515624E+01        3  36   5   5  # A0-b-b eff. coupling^2, normalised to SM
#
    9.99950734E-01    0.00000000E+00        3  25   6   6  # h0-t-t eff. coupling^2, normalised to SM
    1.55889046E-02    0.00000000E+00        3  35   6   6  # H0-t-t eff. coupling^2, normalised to SM
    0.00000000E+00    1.55396382E-02        3  36   6   6  # A0-t-t eff. coupling^2, normalised to SM
#
    1.00317037E+00    0.00000000E+00        3  25  15  15  # h0-tau-tau eff. coupling^2, normalised to SM
    6.43483921E+01    0.00000000E+00        3  35  15  15  # H0-tau-tau eff. coupling^2, normalised to SM
    0.00000000E+00    6.43515624E+01        3  36  15  15  # A0-tau-tau eff. coupling^2, normalised to SM
#
Block HiggsBoundsInputHiggsCouplingsBosons
    9.99999961E-01        3  25  24  24  # h0-W-W eff. coupling^2, normalised to SM
    3.89873201E-08        3  35  24  24  # H0-W-W eff. coupling^2, normalised to SM
    0.00000000E+00        3  36  24  24  # A0-W-W eff. coupling^2, normalised to SM
#
    9.99999961E-01        3  25  23  23  # h0-Z-Z eff. coupling^2, normalised to SM
    3.89873201E-08        3  35  23  23  # H0-Z-Z eff. coupling^2, normalised to SM
    0.00000000E+00        3  36  23  23  # A0-Z-Z eff. coupling^2, normalised to SM
#
    8.74238781E-01        3  25  21  21  # h0-g-g eff. coupling^2, normalised to SM
    1.11392314E-13        3  35  21  21  # H0-g-g eff. coupling^2, normalised to SM
    4.87434223E-13        3  36  21  21  # A0-g-g eff. coupling^2, normalised to SM
#
    0.00000000E+00        3  25  25  23  # h0-h0-Z eff. coupling^2, normalised to SM
    0.00000000E+00        3  35  25  23  # H0-h0-Z eff. coupling^2, normalised to SM
    3.89873201E-08        3  36  25  23  # A0-h0-Z eff. coupling^2, normalised to SM
    0.00000000E+00        3  35  35  23  # H0-H0-Z eff. coupling^2, normalised to SM
    9.99999961E-01        3  36  35  23  # A0-H0-Z eff. coupling^2, normalised to SM
    0.00000000E+00        3  36  36  23  # A0-A0-Z eff. coupling^2, normalised to SM
#
    0.00000000E+00        4  25  21  21  23  # h0-g-g-Z eff. coupling^2, normalised to SM
    0.00000000E+00        4  35  21  21  23  # H0-g-g-Z eff. coupling^2, normalised to SM
    0.00000000E+00        4  36  21  21  23  # A0-g-g-Z eff. coupling^2, normalised to SM
#
#
#
#                             =================
#                             |The decay table|
#                             =================
#
# - The QCD corrections to the decays gluino -> squark  + quark
#                                     squark -> gaugino + quark_prime
#                                     squark -> squark_prime + Higgs
#                                     squark -> gluino  + quark
#   are included.
#
# - The multi-body decays for the inos, stops and sbottoms are included.
#
# - The loop induced decays for the gluino, neutralinos and stops
#   are included.
#
# - The SUSY decays of the top quark are included.
#
#
#         PDG            Width
DECAY         6     1.43388627E+00   # top decays
#          BR         NDA      ID1       ID2
     1.00000000E+00    2           5        24   # BR(t ->  b    W+)
#
#         PDG            Width
DECAY   1000021     1.02858524E+01   # gluino decays
#          BR         NDA      ID1       ID2
     2.50001314E-01    2     2000002        -2   # BR(~g -> ~u_R  ub)
     2.50001314E-01    2    -2000002         2   # BR(~g -> ~u_R* u )
     2.49998686E-01    2     2000004        -4   # BR(~g -> ~c_R  cb)
     2.49998686E-01    2    -2000004         4   # BR(~g -> ~c_R* c )
#
#         PDG            Width
DECAY   1000006     1.21932154E+02   # stop1 decays
#          BR         NDA      ID1       ID2
     4.54896553E-03    2     1000022         6   # BR(~t_1 -> ~chi_10 t )
     1.19885230E-01    2     1000023         6   # BR(~t_1 -> ~chi_20 t )
     1.17547910E-01    2     1000025         6   # BR(~t_1 -> ~chi_30 t )
     6.39785634E-03    2     1000024         5   # BR(~t_1 -> ~chi_1+ b )
     7.51620038E-01    2     1000021         6   # BR(~t_1 -> ~g      t )
#
#         PDG            Width
DECAY   2000006     3.06192152E+02   # stop2 decays
#          BR         NDA      ID1       ID2
     2.30329108E-02    2     1000022         6   # BR(~t_2 -> ~chi_10 t )
     7.09954972E-02    2     1000023         6   # BR(~t_2 -> ~chi_20 t )
     6.35000811E-02    2     1000025         6   # BR(~t_2 -> ~chi_30 t )
     3.88343883E-05    2     1000035         6   # BR(~t_2 -> ~chi_40 t )
     1.34266678E-01    2     1000024         5   # BR(~t_2 -> ~chi_1+ b )
     7.55073411E-05    2     1000037         5   # BR(~t_2 -> ~chi_2+ b )
     4.87066694E-01    2     1000021         6   # BR(~t_2 -> ~g      t )
     5.86513423E-02    2     1000006        25   # BR(~t_2 -> ~t_1    h )
     5.62082387E-02    2     1000006        23   # BR(~t_2 -> ~t_1    Z )
     1.06164216E-01    2     1000005        24   # BR(~t_2 -> ~b_1    W+)
#
#         PDG            Width
DECAY   1000005     1.26274012E+02   # sbottom1 decays
#          BR         NDA      ID1       ID2
     2.75318146E-03    2     1000022         5   # BR(~b_1 -> ~chi_10 b )
     1.95608447E-03    2     1000023         5   # BR(~b_1 -> ~chi_20 b )
     1.68283822E-03    2     1000025         5   # BR(~b_1 -> ~chi_30 b )
     2.33528721E-01    2    -1000024         6   # BR(~b_1 -> ~chi_1- t )
     7.60079175E-01    2     1000021         5   # BR(~b_1 -> ~g      b )
#
#         PDG            Width
DECAY   2000005     1.98524816E+02   # sbottom2 decays
#          BR         NDA      ID1       ID2
     9.91732024E-03    2     1000022         5   # BR(~b_2 -> ~chi_10 b )
     2.21418131E-03    2     1000023         5   # BR(~b_2 -> ~chi_20 b )
     3.00111510E-03    2     1000025         5   # BR(~b_2 -> ~chi_30 b )
     1.20407945E-07    2     1000035         5   # BR(~b_2 -> ~chi_40 b )
     4.22656065E-03    2    -1000024         6   # BR(~b_2 -> ~chi_1- t )
     2.33163601E-07    2    -1000037         6   # BR(~b_2 -> ~chi_2- t )
     9.80624640E-01    2     1000021         5   # BR(~b_2 -> ~g      b )
     3.94673623E-06    2     1000005        25   # BR(~b_2 -> ~b_1    h )
     4.03037645E-06    2     1000005        23   # BR(~b_2 -> ~b_1    Z )
     7.82827178E-06    2     1000006       -24   # BR(~b_2 -> ~t_1    W-)
     2.37887843E-08    2     2000006       -24   # BR(~b_2 -> ~t_2    W-)
#
#         PDG            Width
DECAY   1000002     2.59011773E+02   # sup_L decays
#          BR         NDA      ID1       ID2
     1.62773615E-03    2     1000022         2   # BR(~u_L -> ~chi_10 u)
     2.42438157E-06    2     1000023         2   # BR(~u_L -> ~chi_20 u)
     4.82415540E-04    2     1000025         2   # BR(~u_L -> ~chi_30 u)
     2.22647913E-02    2     1000035         2   # BR(~u_L -> ~chi_40 u)
     2.85993636E-04    2     1000024         1   # BR(~u_L -> ~chi_1+ d)
     4.44801364E-02    2     1000037         1   # BR(~u_L -> ~chi_2+ d)
     9.30856503E-01    2     1000021         2   # BR(~u_L -> ~g      u)
#
#         PDG            Width
DECAY   2000002     9.47503181E-01   # sup_R decays
#          BR         NDA      ID1       ID2
     8.90811241E-01    2     1000022         2   # BR(~u_R -> ~chi_10 u)
     1.74420920E-02    2     1000023         2   # BR(~u_R -> ~chi_20 u)
     9.17466669E-02    2     1000025         2   # BR(~u_R -> ~chi_30 u)
#
#         PDG            Width
DECAY   1000001     2.59029636E+02   # sdown_L decays
#          BR         NDA      ID1       ID2
     1.87947200E-03    2     1000022         1   # BR(~d_L -> ~chi_10 d)
     1.31997219E-04    2     1000023         1   # BR(~d_L -> ~chi_20 d)
     6.84959689E-05    2     1000025         1   # BR(~d_L -> ~chi_30 d)
     2.22911292E-02    2     1000035         1   # BR(~d_L -> ~chi_40 d)
     9.44009944E-06    2    -1000024         2   # BR(~d_L -> ~chi_1- u)
     4.46172979E-02    2    -1000037         2   # BR(~d_L -> ~chi_2- u)
     9.31002168E-01    2     1000021         1   # BR(~d_L -> ~g      d)
#
#         PDG            Width
DECAY   2000001     2.41348455E+02   # sdown_R decays
#          BR         NDA      ID1       ID2
     7.46795865E-03    2     1000022         1   # BR(~d_R -> ~chi_10 d)
     1.81423488E-04    2     1000023         1   # BR(~d_R -> ~chi_20 d)
     9.74847875E-04    2     1000025         1   # BR(~d_R -> ~chi_30 d)
     2.17222652E-09    2     1000035         1   # BR(~d_R -> ~chi_40 d)
     9.91375768E-01    2     1000021         1   # BR(~d_R -> ~g      d)
#
#         PDG            Width
DECAY   1000004     2.13012445E+02   # scharm_L decays
#          BR         NDA      ID1       ID2
     2.04057805E-03    2     1000022         4   # BR(~c_L -> ~chi_10 c)
     3.03891568E-06    2     1000023         4   # BR(~c_L -> ~chi_20 c)
     6.04695219E-04    2     1000025         4   # BR(~c_L -> ~chi_30 c)
     2.78906239E-02    2     1000035         4   # BR(~c_L -> ~chi_40 c)
     3.58489533E-04    2     1000024         3   # BR(~c_L -> ~chi_1+ s)
     5.57193097E-02    2     1000037         3   # BR(~c_L -> ~chi_2+ s)
     9.13383265E-01    2     1000021         4   # BR(~c_L -> ~g      c)
#
#         PDG            Width
DECAY   2000004     9.42483872E-01   # scharm_R decays
#          BR         NDA      ID1       ID2
     8.91086625E-01    2     1000022         4   # BR(~c_R -> ~chi_10 c)
     1.74003666E-02    2     1000023         4   # BR(~c_R -> ~chi_20 c)
     9.15130086E-02    2     1000025         4   # BR(~c_R -> ~chi_30 c)
#
#         PDG            Width
DECAY   1000003     2.13018796E+02   # sstrange_L decays
#          BR         NDA      ID1       ID2
     2.35625355E-03    2     1000022         3   # BR(~s_L -> ~chi_10 s)
     1.65462447E-04    2     1000023         3   # BR(~s_L -> ~chi_20 s)
     8.58612576E-05    2     1000025         3   # BR(~s_L -> ~chi_30 s)
     2.79248126E-02    2     1000035         3   # BR(~s_L -> ~chi_40 s)
     1.18335057E-05    2    -1000024         4   # BR(~s_L -> ~chi_1- c)
     5.58934359E-02    2    -1000037         4   # BR(~s_L -> ~chi_2- c)
     9.13562341E-01    2     1000021         3   # BR(~s_L -> ~g      s)
#
#         PDG            Width
DECAY   2000003     1.95226616E+02   # sstrange_R decays
#          BR         NDA      ID1       ID2
     9.51851856E-03    2     1000022         3   # BR(~s_R -> ~chi_10 s)
     2.31211084E-04    2     1000023         3   # BR(~s_R -> ~chi_20 s)
     1.24236588E-03    2     1000025         3   # BR(~s_R -> ~chi_30 s)
     2.76627416E-09    2     1000035         3   # BR(~s_R -> ~chi_40 s)
     9.89007902E-01    2     1000021         3   # BR(~s_R -> ~g      s)
#
#         PDG            Width
DECAY   1000011     2.13622368E+01   # selectron_L decays
#          BR         NDA      ID1       ID2
     1.88202789E-01    2     1000022        11   # BR(~e_L -> ~chi_10 e-)
     2.60759890E-03    2     1000023        11   # BR(~e_L -> ~chi_20 e-)
     3.33264359E-02    2     1000025        11   # BR(~e_L -> ~chi_30 e-)
     2.58239225E-01    2     1000035        11   # BR(~e_L -> ~chi_40 e-)
     1.15431045E-04    2    -1000024        12   # BR(~e_L -> ~chi_1- nu_e)
     5.17508521E-01    2    -1000037        12   # BR(~e_L -> ~chi_2- nu_e)
#
#         PDG            Width
DECAY   2000011     7.49871521E-01   # selectron_R decays
#          BR         NDA      ID1       ID2
     9.81828307E-01    2     1000022        11   # BR(~e_R -> ~chi_10 e-)
     3.67482957E-03    2     1000023        11   # BR(~e_R -> ~chi_20 e-)
     1.44968638E-02    2     1000025        11   # BR(~e_R -> ~chi_30 e-)
#
#         PDG            Width
DECAY   1000013     2.13622368E+01   # smuon_L decays
#          BR         NDA      ID1       ID2
     1.88202789E-01    2     1000022        13   # BR(~mu_L -> ~chi_10 mu-)
     2.60759890E-03    2     1000023        13   # BR(~mu_L -> ~chi_20 mu-)
     3.33264359E-02    2     1000025        13   # BR(~mu_L -> ~chi_30 mu-)
     2.58239224E-01    2     1000035        13   # BR(~mu_L -> ~chi_40 mu-)
     1.15431045E-04    2    -1000024        14   # BR(~mu_L -> ~chi_1- nu_mu)
     5.17508522E-01    2    -1000037        14   # BR(~mu_L -> ~chi_2- nu_mu)
#
#         PDG            Width
DECAY   2000013     7.49870847E-01   # smuon_R decays
#          BR         NDA      ID1       ID2
     9.81828411E-01    2     1000022        13   # BR(~mu_R -> ~chi_10 mu-)
     3.67481393E-03    2     1000023        13   # BR(~mu_R -> ~chi_20 mu-)
     1.44967750E-02    2     1000025        13   # BR(~mu_R -> ~chi_30 mu-)
#
#         PDG            Width
DECAY   1000015     5.52861203E+00   # stau_1 decays
#          BR         NDA      ID1       ID2
     8.31713669E-01    2     1000022        15   # BR(~tau_1 -> ~chi_10  tau-)
     3.04890863E-02    2     1000023        15   # BR(~tau_1 -> ~chi_20  tau-)
     1.14080501E-01    2     1000025        15   # BR(~tau_1 -> ~chi_30  tau-)
     2.37167434E-02    2    -1000024        16   # BR(~tau_1 -> ~chi_1-  nu_tau)
#
#         PDG            Width
DECAY   2000015     1.53899444E+01   # stau_2 decays
#          BR         NDA      ID1       ID2
     2.37211520E-01    2     1000022        15   # BR(~tau_2 -> ~chi_10  tau-)
     1.64651445E-02    2     1000023        15   # BR(~tau_2 -> ~chi_20  tau-)
     5.31887630E-02    2     1000025        15   # BR(~tau_2 -> ~chi_30  tau-)
     2.30613988E-01    2     1000035        15   # BR(~tau_2 -> ~chi_40  tau-)
     1.41334962E-04    2    -1000024        16   # BR(~tau_2 -> ~chi_1-  nu_tau)
     4.62108955E-01    2    -1000037        16   # BR(~tau_2 -> ~chi_2-  nu_tau)
     1.36462860E-04    2     1000015        25   # BR(~tau_2 -> ~tau_1   h)
     1.33831544E-04    2     1000015        23   # BR(~tau_2 -> ~tau_1   Z)
#
#         PDG            Width
DECAY   1000012     2.13704971E+01   # snu_eL decays
#          BR         NDA      ID1       ID2
     1.97289884E-01    2     1000022        12   # BR(~nu_eL -> ~chi_10 nu_e)
     7.35535884E-03    2     1000023        12   # BR(~nu_eL -> ~chi_20 nu_e)
     1.81276887E-02    2     1000025        12   # BR(~nu_eL -> ~chi_30 nu_e)
     2.58313644E-01    2     1000035        12   # BR(~nu_eL -> ~chi_40 nu_e)
     3.49498056E-03    2     1000024        11   # BR(~nu_eL -> ~chi_1+ e-)
     5.15418444E-01    2     1000037        11   # BR(~nu_eL -> ~chi_2+ e-)
#
#         PDG            Width
DECAY   1000014     2.13704971E+01   # snu_muL decays
#          BR         NDA      ID1       ID2
     1.97289884E-01    2     1000022        14   # BR(~nu_muL -> ~chi_10 nu_mu)
     7.35535885E-03    2     1000023        14   # BR(~nu_muL -> ~chi_20 nu_mu)
     1.81276887E-02    2     1000025        14   # BR(~nu_muL -> ~chi_30 nu_mu)
     2.58313644E-01    2     1000035        14   # BR(~nu_muL -> ~chi_40 nu_mu)
     3.49498057E-03    2     1000024        13   # BR(~nu_muL -> ~chi_1+ mu-)
     5.15418443E-01    2     1000037        13   # BR(~nu_muL -> ~chi_2+ mu-)
#
#         PDG            Width
DECAY   1000016     1.53985461E+01   # snu_tauL decays
#          BR         NDA      ID1       ID2
     2.45191836E-01    2     1000022        16   # BR(~nu_tauL -> ~chi_10 nu_tau)
     9.13484671E-03    2     1000023        16   # BR(~nu_tauL -> ~chi_20 nu_tau)
     2.25118778E-02    2     1000025        16   # BR(~nu_tauL -> ~chi_30 nu_tau)
     2.30476411E-01    2     1000035        16   # BR(~nu_tauL -> ~chi_40 nu_tau)
     3.25884227E-02    2     1000024        15   # BR(~nu_tauL -> ~chi_1+ tau-)
     4.59837940E-01    2     1000037        15   # BR(~nu_tauL -> ~chi_2+ tau-)
     2.58665562E-04    2    -1000015       -24   # BR(~nu_tauL -> ~tau_1+ W-)
#
#         PDG            Width
DECAY   1000024     2.39474187E-02   # chargino1+ decays
#          BR         NDA      ID1       ID2
     1.00000000E+00    2     1000022        24   # BR(~chi_1+ -> ~chi_10  W+)
#
#         PDG            Width
DECAY   1000037     1.82850138E+01   # chargino2+ decays
#          BR         NDA      ID1       ID2
     1.32150575E-02    2     1000006        -5   # BR(~chi_2+ -> ~t_1     bb)
     1.45515880E-07    2    -1000015        16   # BR(~chi_2+ -> ~tau_1+  nu_tau)
     2.51064195E-01    2     1000024        23   # BR(~chi_2+ -> ~chi_1+  Z )
     7.17232966E-03    2     1000022        24   # BR(~chi_2+ -> ~chi_10  W+)
     2.46256763E-01    2     1000023        24   # BR(~chi_2+ -> ~chi_20  W+)
     2.32756992E-01    2     1000025        24   # BR(~chi_2+ -> ~chi_30  W+)
     2.49534517E-01    2     1000024        25   # BR(~chi_2+ -> ~chi_1+  h )
#
#         PDG            Width
DECAY   1000022     0.00000000E+00   # neutralino1 decays
#
#         PDG            Width
DECAY   1000023     7.43480978E-03   # neutralino2 decays
#          BR         NDA      ID1       ID2
     1.00000000E+00    2     1000022        23   # BR(~chi_20 -> ~chi_10   Z )
#
#         PDG            Width
DECAY   1000025     1.06901045E-02   # neutralino3 decays
#          BR         NDA      ID1       ID2
     1.00000000E+00    2     1000022        23   # BR(~chi_30 -> ~chi_10   Z )
#
#         PDG            Width
DECAY   1000035     1.82349440E+01   # neutralino4 decays
#          BR         NDA      ID1       ID2
     1.36500091E-03    2     1000022        23   # BR(~chi_40 -> ~chi_10   Z )
     1.71506653E-01    2     1000023        23   # BR(~chi_40 -> ~chi_20   Z )
     7.84780017E-02    2     1000025        23   # BR(~chi_40 -> ~chi_30   Z )
     2.44520041E-01    2     1000024       -24   # BR(~chi_40 -> ~chi_1+   W-)
     2.44520041E-01    2    -1000024        24   # BR(~chi_40 -> ~chi_1-   W+)
     6.27198775E-03    2     1000022        25   # BR(~chi_40 -> ~chi_10   h )
     8.19896365E-02    2     1000023        25   # BR(~chi_40 -> ~chi_20   h )
     1.61578112E-01    2     1000025        25   # BR(~chi_40 -> ~chi_30   h )
     2.45968435E-07    2     2000002        -2   # BR(~chi_40 -> ~u_R      ub)
     2.45968435E-07    2    -2000002         2   # BR(~chi_40 -> ~u_R*     u )
     2.45968425E-07    2     2000004        -4   # BR(~chi_40 -> ~c_R      cb)
     2.45968425E-07    2    -2000004         4   # BR(~chi_40 -> ~c_R*     c )
     4.88416485E-03    2     1000005        -5   # BR(~chi_40 -> ~b_1      bb)
     4.88416485E-03    2    -1000005         5   # BR(~chi_40 -> ~b_1*     b )
     2.02186455E-07    2     2000011       -11   # BR(~chi_40 -> ~e_R-     e+)
     2.02186455E-07    2    -2000011        11   # BR(~chi_40 -> ~e_R+     e-)
     2.02186455E-07    2     2000013       -13   # BR(~chi_40 -> ~mu_R-    mu+)
     2.02186455E-07    2    -2000013        13   # BR(~chi_40 -> ~mu_R+    mu-)
     2.02279018E-07    2     1000015       -15   # BR(~chi_40 -> ~tau_1-   tau+)
     2.02279018E-07    2    -1000015        15   # BR(~chi_40 -> ~tau_1+   tau-)
#
#         PDG            Width
DECAY        25     8.51657444E-03   # h decays
#          BR         NDA      ID1       ID2
     2.86562952E-01    2           5        -5   # BR(h -> b       bb     )
     3.09904287E-02    2         -15        15   # BR(h -> tau+    tau-   )
     1.09690386E-04    2         -13        13   # BR(h -> mu+     mu-    )
     1.19346420E-04    2           3        -3   # BR(h -> s       sb     )
     1.03201854E-02    2           4        -4   # BR(h -> c       cb     )
     3.90390011E-02    2          21        21   # BR(h -> g       g      )
     1.17962658E-03    2          22        22   # BR(h -> gam     gam    )
     8.81655135E-04    2          22        23   # BR(h -> Z       gam    )
     1.23169693E-01    2          24       -24   # BR(h -> W+      W-     )
     1.59284538E-02    2          23        23   # BR(h -> Z       Z      )
     4.91698967E-01    2     1000022   1000022   # BR(h -> ~chi_10 ~chi_10)
#
#         PDG            Width
DECAY        35     3.29881296E+01   # H decays
#          BR         NDA      ID1       ID2
     8.15514586E-02    2           5        -5   # BR(H -> b       bb     )
     1.56222634E-02    2         -15        15   # BR(H -> tau+    tau-   )
     5.52383620E-05    2         -13        13   # BR(H -> mu+     mu-    )
     3.34655369E-05    2           3        -3   # BR(H -> s       sb     )
     7.26234257E-07    2           4        -4   # BR(H -> c       cb     )
     7.16784566E-02    2           6        -6   # BR(H -> t       tb     )
     2.50235089E-05    2          21        21   # BR(H -> g       g      )
     1.63574470E-07    2          22        22   # BR(H -> gam     gam    )
     4.19579189E-08    2          23        22   # BR(H -> Z       gam    )
     2.20887151E-05    2          24       -24   # BR(H -> W+      W-     )
     1.10255732E-05    2          23        23   # BR(H -> Z       Z      )
     8.10228282E-05    2          25        25   # BR(H -> h       h      )
     2.40792460E-03    2     1000024  -1000024   # BR(H -> ~chi_1+ ~chi_1-)
     2.28597512E-01    2     1000024  -1000037   # BR(H -> ~chi_1+ ~chi_2-)
     2.28597512E-01    2     1000037  -1000024   # BR(H -> ~chi_2+ ~chi_1-)
     2.60029466E-02    2     1000022   1000022   # BR(H -> ~chi_10 ~chi_10)
     5.67150528E-03    2     1000023   1000023   # BR(H -> ~chi_20 ~chi_20)
     6.94174261E-03    2     1000025   1000025   # BR(H -> ~chi_30 ~chi_30)
     6.25483133E-02    2     1000022   1000023   # BR(H -> ~chi_10 ~chi_20)
     2.66146042E-02    2     1000022   1000025   # BR(H -> ~chi_10 ~chi_30)
     2.28019287E-02    2     1000022   1000035   # BR(H -> ~chi_10 ~chi_40)
     1.44548541E-02    2     1000023   1000025   # BR(H -> ~chi_20 ~chi_30)
     1.40960039E-01    2     1000023   1000035   # BR(H -> ~chi_20 ~chi_40)
     6.53086969E-02    2     1000025   1000035   # BR(H -> ~chi_30 ~chi_40)
     2.75876323E-06    2     2000002  -2000002   # BR(H -> ~u_R    ~u_R*  )
     2.75876323E-06    2     2000004  -2000004   # BR(H -> ~c_R    ~c_R*  )
     2.10993971E-06    2     2000011  -2000011   # BR(H -> ~e_R-   ~e_R+  )
     2.10993971E-06    2     2000013  -2000013   # BR(H -> ~mu_R-  ~mu_R+ )
     1.70921938E-06    2     1000015  -1000015   # BR(H -> ~tau_1- ~tau_1+)
#
#         PDG            Width
DECAY        36     3.29868929E+01   # A decays
#          BR         NDA      ID1       ID2
     8.15938192E-02    2           5        -5   # BR(A -> b       bb     )
     1.56232787E-02    2         -15        15   # BR(A -> tau+    tau-   )
     5.52419055E-05    2         -13        13   # BR(A -> mu+     mu-    )
     3.35042465E-05    2           3        -3   # BR(A -> s       sb     )
     7.30682979E-07    2           4        -4   # BR(A -> c       cb     )
     7.18146222E-02    2           6        -6   # BR(A -> t       tb     )
     5.23427464E-05    2          21        21   # BR(A -> g       g      )
     2.14098498E-07    2          22        22   # BR(A -> gam     gam    )
     6.96623873E-08    2          23        22   # BR(A -> Z       gam    )
     2.24076854E-05    2          23        25   # BR(A -> Z       h      )
     2.64913105E-03    2     1000024  -1000024   # BR(A -> ~chi_1+ ~chi_1-)
     2.28456802E-01    2     1000024  -1000037   # BR(A -> ~chi_1+ ~chi_2-)
     2.28456802E-01    2     1000037  -1000024   # BR(A -> ~chi_2+ ~chi_1-)
     3.17757143E-02    2     1000022   1000022   # BR(A -> ~chi_10 ~chi_10)
     3.37369132E-03    2     1000023   1000023   # BR(A -> ~chi_20 ~chi_20)
     1.18926340E-02    2     1000025   1000025   # BR(A -> ~chi_30 ~chi_30)
     3.41314560E-02    2     1000022   1000023   # BR(A -> ~chi_10 ~chi_20)
     4.83611197E-02    2     1000022   1000025   # BR(A -> ~chi_10 ~chi_30)
     2.81122655E-02    2     1000022   1000035   # BR(A -> ~chi_10 ~chi_40)
     1.27484841E-02    2     1000023   1000025   # BR(A -> ~chi_20 ~chi_30)
     7.40341774E-02    2     1000023   1000035   # BR(A -> ~chi_20 ~chi_40)
     1.26811491E-01    2     1000025   1000035   # BR(A -> ~chi_30 ~chi_40)
#
#         PDG            Width
DECAY        37     3.28986386E+01   # H+ decays
#          BR         NDA      ID1       ID2
     1.35162348E-04    2           4        -5   # BR(H+ -> c       bb     )
     1.56699334E-02    2         -15        16   # BR(H+ -> tau+    nu_tau )
     5.54068704E-05    2         -13        14   # BR(H+ -> mu+     nu_mu  )
     1.35161070E-06    2           2        -5   # BR(H+ -> u       bb     )
     1.68056867E-06    2           2        -3   # BR(H+ -> u       sb     )
     3.37816075E-05    2           4        -3   # BR(H+ -> c       sb     )
     1.51210532E-01    2           6        -5   # BR(H+ -> t       bb     )
     2.24966230E-05    2          24        25   # BR(H+ -> W+      h      )
     8.86316465E-14    2          24        36   # BR(H+ -> W+      A      )
     1.22381501E-01    2     1000024   1000022   # BR(H+ -> ~chi_1+ ~chi_10)
     1.19423139E-03    2     1000024   1000023   # BR(H+ -> ~chi_1+ ~chi_20)
     1.99078006E-02    2     1000024   1000025   # BR(H+ -> ~chi_1+ ~chi_30)
     2.29510731E-01    2     1000024   1000035   # BR(H+ -> ~chi_1+ ~chi_40)
     5.11390891E-02    2     1000037   1000022   # BR(H+ -> ~chi_2+ ~chi_10)
     2.15607902E-01    2     1000037   1000023   # BR(H+ -> ~chi_2+ ~chi_20)
     1.93128400E-01    2     1000037   1000025   # BR(H+ -> ~chi_2+ ~chi_30)
