#
#                              ======================
#                              | THE SUSYHIT OUTPUT |
#                              ======================
#
#
#              ------------------------------------------------------
#              |     This is the output of the SUSY-HIT package     |
#              |  created by A.Djouadi, M.Muehlleitner and M.Spira. |
#              |  In case of problems with SUSY-HIT email to        |
#              |           margarete.muehlleitner@cern.ch           |
#              |           michael.spira@psi.ch                     |
#              |           abdelhak.djouadi@cern.ch                 |
#              ------------------------------------------------------
#
#              ------------------------------------------------------
#              |  SUSY Les Houches Accord - MSSM Spectrum + Decays  |
#              |              based on the decay programs           |
#              |                                                    |
#              |                     SDECAY 1.3b                    |
#              |                                                    |
#              |  Authors: M.Muhlleitner, A.Djouadi and Y.Mambrini  |
#              |  Ref.:    Comput.Phys.Commun.168(2005)46           |
#              |           [hep-ph/0311167]                         |
#              |                                                    |
#              |                     HDECAY 3.4                     |
#              |                                                    |
#              |  By: A.Djouadi,J.Kalinowski,M.Muhlleitner,M.Spira  |
#              |  Ref.:    Comput.Phys.Commun.108(1998)56           |
#              |           [hep-ph/9704448]                         |
#              |                                                    |
#              |                                                    |
#              |  If not stated otherwise all DRbar couplings and   |
#              |  soft SUSY breaking masses are given at the scale  |
#              |  Q=  0.35262770E+04
#              |                                                    |
#              ------------------------------------------------------
#
#
BLOCK DCINFO  # Decay Program information
     1   SDECAY/HDECAY # decay calculator
     2   1.3b  /3.4    # version number
#
BLOCK SPINFO  # Spectrum calculator information
     1     SOFTSUSY    # spectrum calculator               
     2     3.4.0       # version number                    
#
BLOCK MODSEL  # Model selection
     1     0   #  nonUniversal                                     
#
BLOCK SMINPUTS  # Standard Model inputs
         1     1.27908970E+02   # alpha_em^-1(M_Z)^MSbar
         2     1.16637870E-05   # G_F [GeV^-2]
         3     1.18400000E-01   # alpha_S(M_Z)^MSbar
         4     9.11876000E+01   # M_Z pole mass
         5     4.18000000E+00   # mb(mb)^MSbar
         6     1.73200000E+02   # mt pole mass
         7     1.77700000E+00   # mtau pole mass
#
BLOCK MINPAR  # Input parameters - minimal models
         3     5.22900000E+01   # tanb                
#
BLOCK EXTPAR  # Input parameters - non-minimal models
         0    -1.00000000E+00   # Set                 
         1     7.34600000E+01   # M_1(MX)             
         2     1.43138000E+03   # M_2(MX)             
         3     3.28504000E+03   # M_3(MX)             
        11     3.65207000E+03   # At(MX)              
        12     2.57295000E+03   # Ab(MX)              
        13    -4.83060000E+02   # Atau(MX)            
        23     1.14490000E+02   # mu(MX)              
        26     3.30137000E+03   # mA(pole)            
        31     3.23361000E+03   # meL(MX)             
        32     3.23361000E+03   # mmuL(MX)            
        33     1.67985000E+03   # mtauL(MX)           
        34     2.36800000E+02   # meR(MX)             
        35     2.36800000E+02   # mmuR(MX)            
        36     2.04134000E+03   # mtauR(MX)           
        41     1.73138000E+03   # mqL1(MX)            
        42     1.73138000E+03   # mqL2(MX)            
        43     3.47701000E+03   # mqL3(MX)            
        44     1.83626000E+03   # muR(MX)             
        45     1.83626000E+03   # mcR(MX)             
        46     3.57415000E+03   # mtR(MX)             
        47     1.71297000E+03   # mdR(MX)             
        48     1.71297000E+03   # msR(MX)             
        49     1.98491000E+03   # mbR(MX)             
#
BLOCK MASS  # Mass Spectrum
# PDG code           mass       particle
        24     8.03834689E+01   # W+
        25     1.26314979E+02   # h
        35     3.30137255E+03   # H
        36     3.30137001E+03   # A
        37     3.30256233E+03   # H+
         5     4.81876030E+00   # b-quark pole mass calculated from mb(mb)_Msbar
   1000001     1.91676032E+03   # ~d_L
   2000001     1.88553581E+03   # ~d_R
   1000002     1.91519192E+03   # ~u_L
   2000002     1.99424716E+03   # ~u_R
   1000003     1.91676032E+03   # ~s_L
   2000003     1.88553581E+03   # ~s_R
   1000004     1.91519192E+03   # ~c_L
   2000004     1.99424716E+03   # ~c_R
   1000005     2.09191853E+03   # ~b_1
   2000005     3.53995017E+03   # ~b_2
   1000006     3.50233301E+03   # ~t_1
   2000006     3.64310289E+03   # ~t_2
   1000011     3.24113092E+03   # ~e_L
   2000011     3.04388271E+02   # ~e_R
   1000012     3.23983124E+03   # ~nu_eL
   1000013     3.24113092E+03   # ~mu_L
   2000013     3.04388271E+02   # ~mu_R
   1000014     3.23983124E+03   # ~nu_muL
   1000015     1.67562970E+03   # ~tau_1
   2000015     2.02262118E+03   # ~tau_2
   1000016     1.67347964E+03   # ~nu_tauL
   1000021     3.34967200E+03   # ~g
   1000022     6.03628748E+01   # ~chi_10
   1000023    -1.28311212E+02   # ~chi_20
   1000025     1.35704362E+02   # ~chi_30
   1000035     1.46705512E+03   # ~chi_40
   1000024     1.21557876E+02   # ~chi_1+
   1000037     1.46722373E+03   # ~chi_2+
#
BLOCK NMIX  # Neutralino Mixing Matrix
  1  1     8.75109517E-01   # N_11
  1  2    -1.27078057E-02   # N_12
  1  3     4.30801593E-01   # N_13
  1  4    -2.20072334E-01   # N_14
  2  1    -1.53589365E-01   # N_21
  2  2     3.49035934E-02   # N_22
  2  3     6.79216135E-01   # N_23
  2  4     7.16838537E-01   # N_24
  3  1    -4.58901360E-01   # N_31
  3  2    -3.97965619E-02   # N_32
  3  3     5.94176770E-01   # N_33
  3  4    -6.59378299E-01   # N_34
  4  1    -1.78379900E-03   # N_41
  4  2     9.98517143E-01   # N_42
  4  3     5.42169130E-03   # N_43
  4  4    -5.41381457E-02   # N_44
#
BLOCK UMIX  # Chargino Mixing Matrix U
  1  1    -7.67643162E-03   # U_11
  1  2     9.99970536E-01   # U_12
  2  1    -9.99970536E-01   # U_21
  2  2    -7.67643162E-03   # U_22
#
BLOCK VMIX  # Chargino Mixing Matrix V
  1  1    -7.66187538E-02   # V_11
  1  2     9.97060463E-01   # V_12
  2  1    -9.97060463E-01   # V_21
  2  2    -7.66187538E-02   # V_22
#
BLOCK STOPMIX  # Stop Mixing Matrix
  1  1     8.51256131E-01   # cos(theta_t)
  1  2    -5.24750416E-01   # sin(theta_t)
  2  1     5.24750416E-01   # -sin(theta_t)
  2  2     8.51256131E-01   # cos(theta_t)
#
BLOCK SBOTMIX  # Sbottom Mixing Matrix
  1  1     1.02880505E-03   # cos(theta_b)
  1  2     9.99999471E-01   # sin(theta_b)
  2  1    -9.99999471E-01   # -sin(theta_b)
  2  2     1.02880505E-03   # cos(theta_b)
#
BLOCK STAUMIX  # Stau Mixing Matrix
  1  1     9.99957071E-01   # cos(theta_tau)
  1  2     9.26585976E-03   # sin(theta_tau)
  2  1    -9.26585976E-03   # -sin(theta_tau)
  2  2     9.99957071E-01   # cos(theta_tau)
#
BLOCK ALPHA  # Higgs mixing
          -1.93333325E-02   # Mixing angle in the neutral Higgs boson sector
#
BLOCK HMIX Q=  3.52627700E+03  # DRbar Higgs Parameters
         1     1.18142729E+02   # mu(Q)MSSM           
         2     5.18393283E+01   # tan                 
         3     2.41739131E+02   # higgs               
         4     1.13176058E+07   # mA^2(Q)MSSM         
#
BLOCK GAUGE Q=  3.52627700E+03  # The gauge couplings
     1     3.66263725E-01   # gprime(Q) DRbar
     2     6.40283629E-01   # g(Q) DRbar
     3     1.00714958E+00   # g3(Q) DRbar
#
BLOCK AU Q=  3.52627700E+03  # The trilinear couplings
  1  1     0.00000000E+00   # A_u(Q) DRbar
  2  2     0.00000000E+00   # A_c(Q) DRbar
  3  3     3.65207003E+03   # A_t(Q) DRbar
#
BLOCK AD Q=  3.52627700E+03  # The trilinear couplings
  1  1     0.00000000E+00   # A_d(Q) DRbar
  2  2     0.00000000E+00   # A_s(Q) DRbar
  3  3     2.57295002E+03   # A_b(Q) DRbar
#
BLOCK AE Q=  3.52627700E+03  # The trilinear couplings
  1  1     0.00000000E+00   # A_e(Q) DRbar
  2  2     0.00000000E+00   # A_mu(Q) DRbar
  3  3    -4.83059991E+02   # A_tau(Q) DRbar
#
BLOCK Yu Q=  3.52627700E+03  # The Yukawa couplings
  1  1     0.00000000E+00   # y_u(Q) DRbar
  2  2     0.00000000E+00   # y_c(Q) DRbar
  3  3     8.26463887E-01   # y_t(Q) DRbar
#
BLOCK Yd Q=  3.52627700E+03  # The Yukawa couplings
  1  1     0.00000000E+00   # y_d(Q) DRbar
  2  2     0.00000000E+00   # y_s(Q) DRbar
  3  3     6.86708995E-01   # y_b(Q) DRbar
#
BLOCK Ye Q=  3.52627700E+03  # The Yukawa couplings
  1  1     0.00000000E+00   # y_e(Q) DRbar
  2  2     0.00000000E+00   # y_mu(Q) DRbar
  3  3     5.38610334E-01   # y_tau(Q) DRbar
#
BLOCK MSOFT Q=  3.52627700E+03  # The soft SUSY breaking masses at the scale Q
         1     7.34600000E+01   # M_1(Q)              
         2     1.43138000E+03   # M_2(Q)              
         3     3.28504000E+03   # M_3(Q)              
        21     1.13747488E+07   # mH1^2(Q)            
        22     2.44176027E+05   # mH2^2(Q)            
        31     3.23361000E+03   # meL(Q)              
        32     3.23361000E+03   # mmuL(Q)             
        33     1.67985000E+03   # mtauL(Q)            
        34     2.36800000E+02   # meR(Q)              
        35     2.36800000E+02   # mmuR(Q)             
        36     2.04134000E+03   # mtauR(Q)            
        41     1.73137998E+03   # mqL1(Q)             
        42     1.73137998E+03   # mqL2(Q)             
        43     3.47700998E+03   # mqL3(Q)             
        44     1.83625998E+03   # muR(Q)              
        45     1.83625998E+03   # mcR(Q)              
        46     3.57414998E+03   # mtR(Q)              
        47     1.71296998E+03   # mdR(Q)              
        48     1.71296998E+03   # msR(Q)              
        49     1.98490997E+03   # mbR(Q)              
#
Block HiggsBoundsInputHiggsCouplingsFermions
# ScalarNormEffCoupSq PseudoSNormEffCoupSq NP   IP1 IP2 IP2
    1.00470749E+00    0.00000000E+00        3  25   5   5  # h0-b-b eff. coupling^2, normalised to SM
    2.68731125E+03    0.00000000E+00        3  35   5   5  # H0-b-b eff. coupling^2, normalised to SM
    0.00000000E+00    2.68731596E+03        3  36   5   5  # A0-b-b eff. coupling^2, normalised to SM
#
    9.99998248E-01    0.00000000E+00        3  25   6   6  # h0-t-t eff. coupling^2, normalised to SM
    3.73870250E-04    0.00000000E+00        3  35   6   6  # H0-t-t eff. coupling^2, normalised to SM
    0.00000000E+00    3.72118506E-04        3  36   6   6  # A0-t-t eff. coupling^2, normalised to SM
#
    1.00470749E+00    0.00000000E+00        3  25  15  15  # h0-tau-tau eff. coupling^2, normalised to SM
    2.68731125E+03    0.00000000E+00        3  35  15  15  # H0-tau-tau eff. coupling^2, normalised to SM
    0.00000000E+00    2.68731596E+03        3  36  15  15  # A0-tau-tau eff. coupling^2, normalised to SM
#
Block HiggsBoundsInputHiggsCouplingsBosons
    9.99999998E-01        3  25  24  24  # h0-W-W eff. coupling^2, normalised to SM
    2.05674301E-09        3  35  24  24  # H0-W-W eff. coupling^2, normalised to SM
    0.00000000E+00        3  36  24  24  # A0-W-W eff. coupling^2, normalised to SM
#
    9.99999998E-01        3  25  23  23  # h0-Z-Z eff. coupling^2, normalised to SM
    2.05674301E-09        3  35  23  23  # H0-Z-Z eff. coupling^2, normalised to SM
    0.00000000E+00        3  36  23  23  # A0-Z-Z eff. coupling^2, normalised to SM
#
    8.89056617E-01        3  25  21  21  # h0-g-g eff. coupling^2, normalised to SM
    1.48400097E-12        3  35  21  21  # H0-g-g eff. coupling^2, normalised to SM
    3.73273854E-12        3  36  21  21  # A0-g-g eff. coupling^2, normalised to SM
#
    0.00000000E+00        3  25  25  23  # h0-h0-Z eff. coupling^2, normalised to SM
    0.00000000E+00        3  35  25  23  # H0-h0-Z eff. coupling^2, normalised to SM
    2.05674301E-09        3  36  25  23  # A0-h0-Z eff. coupling^2, normalised to SM
    0.00000000E+00        3  35  35  23  # H0-H0-Z eff. coupling^2, normalised to SM
    9.99999998E-01        3  36  35  23  # A0-H0-Z eff. coupling^2, normalised to SM
    0.00000000E+00        3  36  36  23  # A0-A0-Z eff. coupling^2, normalised to SM
#
    0.00000000E+00        4  25  21  21  23  # h0-g-g-Z eff. coupling^2, normalised to SM
    0.00000000E+00        4  35  21  21  23  # H0-g-g-Z eff. coupling^2, normalised to SM
    0.00000000E+00        4  36  21  21  23  # A0-g-g-Z eff. coupling^2, normalised to SM
#
#
#
#                             =================
#                             |The decay table|
#                             =================
#
# - The QCD corrections to the decays gluino -> squark  + quark
#                                     squark -> gaugino + quark_prime
#                                     squark -> squark_prime + Higgs
#                                     squark -> gluino  + quark
#   are included.
#
# - The multi-body decays for the inos, stops and sbottoms are included.
#
# - The loop induced decays for the gluino, neutralinos and stops
#   are included.
#
# - The SUSY decays of the top quark are included.
#
#
#         PDG            Width
DECAY         6     1.44411787E+00   # top decays
#          BR         NDA      ID1       ID2
     1.00000000E+00    2           5        24   # BR(t ->  b    W+)
#
#         PDG            Width
DECAY   1000021     2.66704940E+02   # gluino decays
#          BR         NDA      ID1       ID2
     5.72575148E-02    2     1000001        -1   # BR(~g -> ~d_L  db)
     5.72575148E-02    2    -1000001         1   # BR(~g -> ~d_L* d )
     5.90733277E-02    2     2000001        -1   # BR(~g -> ~d_R  db)
     5.90733277E-02    2    -2000001         1   # BR(~g -> ~d_R* d )
     5.73487530E-02    2     1000002        -2   # BR(~g -> ~u_L  ub)
     5.73487530E-02    2    -1000002         2   # BR(~g -> ~u_L* u )
     5.27510701E-02    2     2000002        -2   # BR(~g -> ~u_R  ub)
     5.27510701E-02    2    -2000002         2   # BR(~g -> ~u_R* u )
     5.72575148E-02    2     1000003        -3   # BR(~g -> ~s_L  sb)
     5.72575148E-02    2    -1000003         3   # BR(~g -> ~s_L* s )
     5.90733277E-02    2     2000003        -3   # BR(~g -> ~s_R  sb)
     5.90733277E-02    2    -2000003         3   # BR(~g -> ~s_R* s )
     5.73487341E-02    2     1000004        -4   # BR(~g -> ~c_L  cb)
     5.73487341E-02    2    -1000004         4   # BR(~g -> ~c_L* c )
     5.27510496E-02    2     2000004        -4   # BR(~g -> ~c_R  cb)
     5.27510496E-02    2    -2000004         4   # BR(~g -> ~c_R* c )
     4.71387081E-02    2     1000005        -5   # BR(~g -> ~b_1  bb)
     4.71387081E-02    2    -1000005         5   # BR(~g -> ~b_1* b )
#
#         PDG            Width
DECAY   1000006     1.06613939E+02   # stop1 decays
#          BR         NDA      ID1       ID2
     1.55939867E-02    2     1000022         6   # BR(~t_1 -> ~chi_10 t )
     2.08379702E-01    2     1000023         6   # BR(~t_1 -> ~chi_20 t )
     2.31074597E-01    2     1000025         6   # BR(~t_1 -> ~chi_30 t )
     7.48453428E-02    2     1000035         6   # BR(~t_1 -> ~chi_40 t )
     3.22298662E-01    2     1000024         5   # BR(~t_1 -> ~chi_1+ b )
     1.47756065E-01    2     1000037         5   # BR(~t_1 -> ~chi_2+ b )
     5.16445050E-05    2     1000005        24   # BR(~t_1 -> ~b_1    W+)
#
#         PDG            Width
DECAY   2000006     1.17220108E+02   # stop2 decays
#          BR         NDA      ID1       ID2
     8.50324415E-02    2     1000022         6   # BR(~t_2 -> ~chi_10 t )
     2.35554392E-01    2     1000023         6   # BR(~t_2 -> ~chi_20 t )
     1.63553387E-01    2     1000025         6   # BR(~t_2 -> ~chi_30 t )
     1.74953976E-02    2     1000035         6   # BR(~t_2 -> ~chi_40 t )
     4.06323105E-01    2     1000024         5   # BR(~t_2 -> ~chi_1+ b )
     3.42961859E-02    2     1000037         5   # BR(~t_2 -> ~chi_2+ b )
     4.80832399E-02    2     1000021         6   # BR(~t_2 -> ~g      t )
     1.41530279E-03    2     1000006        25   # BR(~t_2 -> ~t_1    h )
     5.15441205E-03    2     1000006        23   # BR(~t_2 -> ~t_1    Z )
     2.27500552E-05    2     1000005        24   # BR(~t_2 -> ~b_1    W+)
     3.06938575E-03    2     2000005        24   # BR(~t_2 -> ~b_2    W+)
#
#         PDG            Width
DECAY   1000005     3.99533434E+01   # sbottom1 decays
#          BR         NDA      ID1       ID2
     1.14886373E-01    2     1000022         5   # BR(~b_1 -> ~chi_10 b )
     2.25572611E-01    2     1000023         5   # BR(~b_1 -> ~chi_20 b )
     1.78378287E-01    2     1000025         5   # BR(~b_1 -> ~chi_30 b )
     2.88330362E-06    2     1000035         5   # BR(~b_1 -> ~chi_40 b )
     4.81154463E-01    2    -1000024         6   # BR(~b_1 -> ~chi_1- t )
     5.38200386E-06    2    -1000037         6   # BR(~b_1 -> ~chi_2- t )
#
#         PDG            Width
DECAY   2000005     1.13188823E+02   # sbottom2 decays
#          BR         NDA      ID1       ID2
     5.84422293E-02    2     1000022         5   # BR(~b_2 -> ~chi_10 b )
     1.35557984E-01    2     1000023         5   # BR(~b_2 -> ~chi_20 b )
     1.03624351E-01    2     1000025         5   # BR(~b_2 -> ~chi_30 b )
     8.72994061E-02    2     1000035         5   # BR(~b_2 -> ~chi_40 b )
     4.19468051E-01    2    -1000024         6   # BR(~b_2 -> ~chi_1- t )
     1.77123977E-01    2    -1000037         6   # BR(~b_2 -> ~chi_2- t )
     1.84115972E-02    2     1000021         5   # BR(~b_2 -> ~g      b )
     3.54304300E-05    2     1000005        25   # BR(~b_2 -> ~b_1    h )
     3.69734678E-05    2     1000005        23   # BR(~b_2 -> ~b_1    Z )
#
#         PDG            Width
DECAY   1000002     4.47570461E+00   # sup_L decays
#          BR         NDA      ID1       ID2
     4.16055619E-02    2     1000022         2   # BR(~u_L -> ~chi_10 u)
     5.48911195E-05    2     1000023         2   # BR(~u_L -> ~chi_20 u)
     2.81594273E-02    2     1000025         2   # BR(~u_L -> ~chi_30 u)
     3.03829566E-01    2     1000035         2   # BR(~u_L -> ~chi_40 u)
     2.04406731E-02    2     1000024         1   # BR(~u_L -> ~chi_1+ d)
     6.05909881E-01    2     1000037         1   # BR(~u_L -> ~chi_2+ d)
#
#         PDG            Width
DECAY   2000002     4.72944402E+00   # sup_R decays
#          BR         NDA      ID1       ID2
     7.67032445E-01    2     1000022         2   # BR(~u_R -> ~chi_10 u)
     2.34871610E-02    2     1000023         2   # BR(~u_R -> ~chi_20 u)
     2.09479712E-01    2     1000025         2   # BR(~u_R -> ~chi_30 u)
     6.82620199E-07    2     1000035         2   # BR(~u_R -> ~chi_40 u)
#
#         PDG            Width
DECAY   1000001     4.41502876E+00   # sdown_L decays
#          BR         NDA      ID1       ID2
     5.72758516E-02    2     1000022         1   # BR(~d_L -> ~chi_10 d)
     7.27137757E-03    2     1000023         1   # BR(~d_L -> ~chi_20 d)
     4.01224843E-03    2     1000025         1   # BR(~d_L -> ~chi_30 d)
     3.10082670E-01    2     1000035         1   # BR(~d_L -> ~chi_40 d)
     2.08167959E-04    2    -1000024         2   # BR(~d_L -> ~chi_1- u)
     6.21149685E-01    2    -1000037         2   # BR(~d_L -> ~chi_2- u)
#
#         PDG            Width
DECAY   2000001     1.12080688E+00   # sdown_R decays
#          BR         NDA      ID1       ID2
     7.67186437E-01    2     1000022         1   # BR(~d_R -> ~chi_10 d)
     2.34741128E-02    2     1000023         1   # BR(~d_R -> ~chi_20 d)
     2.09338943E-01    2     1000025         1   # BR(~d_R -> ~chi_30 d)
     5.06937970E-07    2     1000035         1   # BR(~d_R -> ~chi_40 d)
#
#         PDG            Width
DECAY   1000004     4.38040401E+00   # scharm_L decays
#          BR         NDA      ID1       ID2
     4.22864463E-02    2     1000022         4   # BR(~c_L -> ~chi_10 c)
     5.57598511E-05    2     1000023         4   # BR(~c_L -> ~chi_20 c)
     2.86035404E-02    2     1000025         4   # BR(~c_L -> ~chi_30 c)
     3.03345334E-01    2     1000035         4   # BR(~c_L -> ~chi_40 c)
     2.07652440E-02    2     1000024         3   # BR(~c_L -> ~chi_1+ s)
     6.04943675E-01    2     1000037         3   # BR(~c_L -> ~chi_2+ s)
#
#         PDG            Width
DECAY   2000004     4.71412920E+00   # scharm_R decays
#          BR         NDA      ID1       ID2
     7.67134160E-01    2     1000022         4   # BR(~c_R -> ~chi_10 c)
     2.34780361E-02    2     1000023         4   # BR(~c_R -> ~chi_20 c)
     2.09387131E-01    2     1000025         4   # BR(~c_R -> ~chi_30 c)
     6.72254227E-07    2     1000035         4   # BR(~c_R -> ~chi_40 c)
#
#         PDG            Width
DECAY   1000003     4.31984572E+00   # sstrange_L decays
#          BR         NDA      ID1       ID2
     5.82316352E-02    2     1000022         3   # BR(~s_L -> ~chi_10 s)
     7.38880033E-03    2     1000023         3   # BR(~s_L -> ~chi_20 s)
     4.07681978E-03    2     1000025         3   # BR(~s_L -> ~chi_30 s)
     3.09705776E-01    2     1000035         3   # BR(~s_L -> ~chi_40 s)
     2.11540030E-04    2    -1000024         4   # BR(~s_L -> ~chi_1- c)
     6.20385429E-01    2    -1000037         4   # BR(~s_L -> ~chi_2- c)
#
#         PDG            Width
DECAY   2000003     1.11381887E+00   # sstrange_R decays
#          BR         NDA      ID1       ID2
     7.67290504E-01    2     1000022         3   # BR(~s_R -> ~chi_10 s)
     2.34647706E-02    2     1000023         3   # BR(~s_R -> ~chi_20 s)
     2.09244228E-01    2     1000025         3   # BR(~s_R -> ~chi_30 s)
     4.97496844E-07    2     1000035         3   # BR(~s_R -> ~chi_40 s)
#
#         PDG            Width
DECAY   1000011     2.94098333E+01   # selectron_L decays
#          BR         NDA      ID1       ID2
     1.06900849E-01    2     1000022        11   # BR(~e_L -> ~chi_10 e-)
     1.25630551E-03    2     1000023        11   # BR(~e_L -> ~chi_20 e-)
     4.09271412E-02    2     1000025        11   # BR(~e_L -> ~chi_30 e-)
     2.82707424E-01    2     1000035        11   # BR(~e_L -> ~chi_40 e-)
     5.28171665E-05    2    -1000024        12   # BR(~e_L -> ~chi_1- nu_e)
     5.68155464E-01    2    -1000037        12   # BR(~e_L -> ~chi_2- nu_e)
#
#         PDG            Width
DECAY   2000011     1.39386165E+00   # selectron_R decays
#          BR         NDA      ID1       ID2
     8.23820781E-01    2     1000022        11   # BR(~e_R -> ~chi_10 e-)
     1.85928146E-02    2     1000023        11   # BR(~e_R -> ~chi_20 e-)
     1.57586404E-01    2     1000025        11   # BR(~e_R -> ~chi_30 e-)
#
#         PDG            Width
DECAY   1000013     2.94098332E+01   # smuon_L decays
#          BR         NDA      ID1       ID2
     1.06900849E-01    2     1000022        13   # BR(~mu_L -> ~chi_10 mu-)
     1.25630551E-03    2     1000023        13   # BR(~mu_L -> ~chi_20 mu-)
     4.09271411E-02    2     1000025        13   # BR(~mu_L -> ~chi_30 mu-)
     2.82707423E-01    2     1000035        13   # BR(~mu_L -> ~chi_40 mu-)
     5.28171666E-05    2    -1000024        14   # BR(~mu_L -> ~chi_1- nu_mu)
     5.68155464E-01    2    -1000037        14   # BR(~mu_L -> ~chi_2- nu_mu)
#
#         PDG            Width
DECAY   2000013     1.39386126E+00   # smuon_R decays
#          BR         NDA      ID1       ID2
     8.23820797E-01    2     1000022        13   # BR(~mu_R -> ~chi_10 mu-)
     1.85928132E-02    2     1000023        13   # BR(~mu_R -> ~chi_20 mu-)
     1.57586389E-01    2     1000025        13   # BR(~mu_R -> ~chi_30 mu-)
#
#         PDG            Width
DECAY   1000015     1.29453019E+01   # stau_1 decays
#          BR         NDA      ID1       ID2
     2.66223671E-01    2     1000022        15   # BR(~tau_1 -> ~chi_10  tau-)
     3.41119463E-01    2     1000023        15   # BR(~tau_1 -> ~chi_20  tau-)
     3.06349012E-01    2     1000025        15   # BR(~tau_1 -> ~chi_30  tau-)
     2.86220899E-02    2     1000035        15   # BR(~tau_1 -> ~chi_40  tau-)
     2.50010862E-04    2    -1000024        16   # BR(~tau_1 -> ~chi_1-  nu_tau)
     5.74357529E-02    2    -1000037        16   # BR(~tau_1 -> ~chi_2-  nu_tau)
#
#         PDG            Width
DECAY   2000015     3.39586420E+01   # stau_2 decays
#          BR         NDA      ID1       ID2
     3.05503455E-01    2     1000022        15   # BR(~tau_2 -> ~chi_10  tau-)
     1.65183660E-01    2     1000023        15   # BR(~tau_2 -> ~chi_20  tau-)
     1.87337803E-01    2     1000025        15   # BR(~tau_2 -> ~chi_30  tau-)
     1.36829829E-05    2     1000035        15   # BR(~tau_2 -> ~chi_40  tau-)
     3.41164996E-01    2    -1000024        16   # BR(~tau_2 -> ~chi_1-  nu_tau)
     2.69562232E-05    2    -1000037        16   # BR(~tau_2 -> ~chi_2-  nu_tau)
     3.81625271E-04    2     1000016       -24   # BR(~tau_2 -> ~nu_tauL W-)
     1.99258276E-04    2     1000015        25   # BR(~tau_2 -> ~tau_1   h)
     1.88563814E-04    2     1000015        23   # BR(~tau_2 -> ~tau_1   Z)
#
#         PDG            Width
DECAY   1000012     2.94251636E+01   # snu_eL decays
#          BR         NDA      ID1       ID2
     1.18219496E-01    2     1000022        12   # BR(~nu_eL -> ~chi_10 nu_e)
     6.74546590E-03    2     1000023        12   # BR(~nu_eL -> ~chi_20 nu_e)
     2.21924000E-02    2     1000025        12   # BR(~nu_eL -> ~chi_30 nu_e)
     2.83486460E-01    2     1000035        12   # BR(~nu_eL -> ~chi_40 nu_e)
     5.25684298E-03    2     1000024        11   # BR(~nu_eL -> ~chi_1+ e-)
     5.64099336E-01    2     1000037        11   # BR(~nu_eL -> ~chi_2+ e-)
#
#         PDG            Width
DECAY   1000014     2.94251635E+01   # snu_muL decays
#          BR         NDA      ID1       ID2
     1.18219496E-01    2     1000022        14   # BR(~nu_muL -> ~chi_10 nu_mu)
     6.74546591E-03    2     1000023        14   # BR(~nu_muL -> ~chi_20 nu_mu)
     2.21924000E-02    2     1000025        14   # BR(~nu_muL -> ~chi_30 nu_mu)
     2.83486460E-01    2     1000035        14   # BR(~nu_muL -> ~chi_40 nu_mu)
     5.25684297E-03    2     1000024        13   # BR(~nu_muL -> ~chi_1+ mu-)
     5.64099335E-01    2     1000037        13   # BR(~nu_muL -> ~chi_2+ mu-)
#
#         PDG            Width
DECAY   1000016     1.29555580E+01   # snu_tauL decays
#          BR         NDA      ID1       ID2
     1.38426950E-01    2     1000022        16   # BR(~nu_tauL -> ~chi_10 nu_tau)
     7.84539625E-03    2     1000023        16   # BR(~nu_tauL -> ~chi_20 nu_tau)
     2.57845653E-02    2     1000025        16   # BR(~nu_tauL -> ~chi_30 nu_tau)
     2.82004159E-02    2     1000035        16   # BR(~nu_tauL -> ~chi_40 nu_tau)
     7.43700838E-01    2     1000024        15   # BR(~nu_tauL -> ~chi_1+ tau-)
     5.60418344E-02    2     1000037        15   # BR(~nu_tauL -> ~chi_2+ tau-)
#
#         PDG            Width
DECAY   1000024     2.11085815E-04   # chargino1+ decays
#           BR         NDA      ID1       ID2       ID3
     3.33423235E-01    3     1000022         2        -1   # BR(~chi_1+ -> ~chi_10 u    db)
     3.33423235E-01    3     1000022         4        -3   # BR(~chi_1+ -> ~chi_10 c    sb)
     1.11139870E-01    3     1000022       -11        12   # BR(~chi_1+ -> ~chi_10 e+   nu_e)
     1.11139870E-01    3     1000022       -13        14   # BR(~chi_1+ -> ~chi_10 mu+  nu_mu)
     1.10873790E-01    3     1000022       -15        16   # BR(~chi_1+ -> ~chi_10 tau+ nu_tau)
#
#         PDG            Width
DECAY   1000037     1.16876459E+01   # chargino2+ decays
#          BR         NDA      ID1       ID2
     2.53824723E-01    2     1000024        23   # BR(~chi_2+ -> ~chi_1+  Z )
     1.83372544E-02    2     1000022        24   # BR(~chi_2+ -> ~chi_10  W+)
     2.50827613E-01    2     1000023        24   # BR(~chi_2+ -> ~chi_20  W+)
     2.24810905E-01    2     1000025        24   # BR(~chi_2+ -> ~chi_30  W+)
     2.52199504E-01    2     1000024        25   # BR(~chi_2+ -> ~chi_1+  h )
#
#         PDG            Width
DECAY   1000022     0.00000000E+00   # neutralino1 decays
#
#         PDG            Width
DECAY   1000023     1.93791168E-04   # neutralino2 decays
#          BR         NDA      ID1       ID2
     8.53079931E-04    2     1000022        22   # BR(~chi_20 -> ~chi_10 gam)
#           BR         NDA      ID1       ID2       ID3
     1.17682332E-01    3     1000022        -2         2   # BR(~chi_20 -> ~chi_10 ub      u)
     1.52728955E-01    3     1000022        -1         1   # BR(~chi_20 -> ~chi_10 db      d)
     1.17682332E-01    3     1000022        -4         4   # BR(~chi_20 -> ~chi_10 cb      c)
     1.52728955E-01    3     1000022        -3         3   # BR(~chi_20 -> ~chi_10 sb      s)
     1.45500420E-01    3     1000022        -5         5   # BR(~chi_20 -> ~chi_10 bb      b)
     3.35140576E-02    3     1000022       -11        11   # BR(~chi_20 -> ~chi_10 e+      e-)
     3.35140576E-02    3     1000022       -13        13   # BR(~chi_20 -> ~chi_10 mu+     mu-)
     3.49914501E-02    3     1000022       -15        15   # BR(~chi_20 -> ~chi_10 tau+    tau-)
     7.02078404E-02    3     1000022       -12        12   # BR(~chi_20 -> ~chi_10 nu_eb   nu_e)
     7.02078404E-02    3     1000022       -14        14   # BR(~chi_20 -> ~chi_10 nu_mub  nu_mu)
     7.02335852E-02    3     1000022       -16        16   # BR(~chi_20 -> ~chi_10 nu_taub nu_tau)
     2.66838025E-05    3     1000024        -2         1   # BR(~chi_20 -> ~chi_1+ ub      d)
     2.66838025E-05    3    -1000024        -1         2   # BR(~chi_20 -> ~chi_1- db      u)
     2.66838025E-05    3     1000024        -4         3   # BR(~chi_20 -> ~chi_1+ cb      s)
     2.66838025E-05    3    -1000024        -3         4   # BR(~chi_20 -> ~chi_1- sb      c)
     8.89465900E-06    3     1000024       -12        11   # BR(~chi_20 -> ~chi_1+ nu_eb   e-)
     8.89465900E-06    3    -1000024        12       -11   # BR(~chi_20 -> ~chi_1- nu_e    e+)
     8.89465900E-06    3     1000024       -14        13   # BR(~chi_20 -> ~chi_1+ nu_mub  mu-)
     8.89465900E-06    3    -1000024        14       -13   # BR(~chi_20 -> ~chi_1- nu_mu   mu+)
     6.39058027E-06    3     1000024       -16        15   # BR(~chi_20 -> ~chi_1+ nu_taub tau-)
     6.39058027E-06    3    -1000024        16       -15   # BR(~chi_20 -> ~chi_1- nu_tau  tau+)
#
#         PDG            Width
DECAY   1000025     8.38486229E-05   # neutralino3 decays
#          BR         NDA      ID1       ID2
     1.52149416E-03    2     1000022        22   # BR(~chi_30 -> ~chi_10 gam)
     2.14246762E-06    2     1000023        22   # BR(~chi_30 -> ~chi_20 gam)
#           BR         NDA      ID1       ID2       ID3
     1.18344850E-01    3     1000022        -2         2   # BR(~chi_30 -> ~chi_10 ub      u)
     1.53164309E-01    3     1000022        -1         1   # BR(~chi_30 -> ~chi_10 db      d)
     1.18344850E-01    3     1000022        -4         4   # BR(~chi_30 -> ~chi_10 cb      c)
     1.53164309E-01    3     1000022        -3         3   # BR(~chi_30 -> ~chi_10 sb      s)
     1.49250488E-01    3     1000022        -5         5   # BR(~chi_30 -> ~chi_10 bb      b)
     2.40637110E-02    3     1000022       -11        11   # BR(~chi_30 -> ~chi_10 e+      e-)
     2.40637110E-02    3     1000022       -13        13   # BR(~chi_30 -> ~chi_10 mu+     mu-)
     3.50912288E-02    3     1000022       -15        15   # BR(~chi_30 -> ~chi_10 tau+    tau-)
     7.04711674E-02    3     1000022       -12        12   # BR(~chi_30 -> ~chi_10 nu_eb   nu_e)
     7.04711674E-02    3     1000022       -14        14   # BR(~chi_30 -> ~chi_10 nu_mub  nu_mu)
     7.06103886E-02    3     1000022       -16        16   # BR(~chi_30 -> ~chi_10 nu_taub nu_tau)
     2.25330606E-05    3     1000023        -2         2   # BR(~chi_30 -> ~chi_20 ub      u)
     2.92571644E-05    3     1000023        -1         1   # BR(~chi_30 -> ~chi_20 db      d)
     2.25330606E-05    3     1000023        -4         4   # BR(~chi_30 -> ~chi_20 cb      c)
     2.92571644E-05    3     1000023        -3         3   # BR(~chi_30 -> ~chi_20 sb      s)
     6.84135988E-06    3     1000023       -11        11   # BR(~chi_30 -> ~chi_20 e+      e-)
     6.84135988E-06    3     1000023       -13        13   # BR(~chi_30 -> ~chi_20 mu+     mu-)
     4.54013120E-06    3     1000023       -15        15   # BR(~chi_30 -> ~chi_20 tau+    tau-)
     1.34451504E-05    3     1000023       -12        12   # BR(~chi_30 -> ~chi_20 nu_eb   nu_e)
     1.34451504E-05    3     1000023       -14        14   # BR(~chi_30 -> ~chi_20 nu_mub  nu_mu)
     1.34437659E-05    3     1000023       -16        16   # BR(~chi_30 -> ~chi_20 nu_taub nu_tau)
     1.89455731E-03    3     1000024        -2         1   # BR(~chi_30 -> ~chi_1+ ub      d)
     1.89455731E-03    3    -1000024        -1         2   # BR(~chi_30 -> ~chi_1- db      u)
     1.89455731E-03    3     1000024        -4         3   # BR(~chi_30 -> ~chi_1+ cb      s)
     1.89455731E-03    3    -1000024        -3         4   # BR(~chi_30 -> ~chi_1- sb      c)
     6.31497797E-04    3     1000024       -12        11   # BR(~chi_30 -> ~chi_1+ nu_eb   e-)
     6.31497797E-04    3    -1000024        12       -11   # BR(~chi_30 -> ~chi_1- nu_e    e+)
     6.31497797E-04    3     1000024       -14        13   # BR(~chi_30 -> ~chi_1+ nu_mub  mu-)
     6.31497797E-04    3    -1000024        14       -13   # BR(~chi_30 -> ~chi_1- nu_mu   mu+)
     5.84912998E-04    3     1000024       -16        15   # BR(~chi_30 -> ~chi_1+ nu_taub tau-)
     5.84912998E-04    3    -1000024        16       -15   # BR(~chi_30 -> ~chi_1- nu_tau  tau+)
#
#         PDG            Width
DECAY   1000035     1.16887028E+01   # neutralino4 decays
#          BR         NDA      ID1       ID2
     8.03256044E-03    2     1000022        23   # BR(~chi_40 -> ~chi_10   Z )
     1.54786724E-01    2     1000023        23   # BR(~chi_40 -> ~chi_20   Z )
     9.05552545E-02    2     1000025        23   # BR(~chi_40 -> ~chi_30   Z )
     2.47800358E-01    2     1000024       -24   # BR(~chi_40 -> ~chi_1+   W-)
     2.47800358E-01    2    -1000024        24   # BR(~chi_40 -> ~chi_1-   W+)
     1.09652681E-02    2     1000022        25   # BR(~chi_40 -> ~chi_10   h )
     1.00931495E-01    2     1000023        25   # BR(~chi_40 -> ~chi_20   h )
     1.39124078E-01    2     1000025        25   # BR(~chi_40 -> ~chi_30   h )
     9.76043828E-07    2     2000011       -11   # BR(~chi_40 -> ~e_R-     e+)
     9.76043828E-07    2    -2000011        11   # BR(~chi_40 -> ~e_R+     e-)
     9.76043828E-07    2     2000013       -13   # BR(~chi_40 -> ~mu_R-    mu+)
     9.76043828E-07    2    -2000013        13   # BR(~chi_40 -> ~mu_R+    mu-)
#
#         PDG            Width
DECAY        25     4.57436590E-03   # h decays
#          BR         NDA      ID1       ID2
     5.36378208E-01    2           5        -5   # BR(h -> b       bb     )
     5.74270244E-02    2         -15        15   # BR(h -> tau+    tau-   )
     2.03270087E-04    2         -13        13   # BR(h -> mu+     mu-    )
     2.21402485E-04    2           3        -3   # BR(h -> s       sb     )
     1.91199014E-02    2           4        -4   # BR(h -> c       cb     )
     7.19627265E-02    2          21        21   # BR(h -> g       g      )
     2.14618336E-03    2          22        22   # BR(h -> gam     gam    )
     1.53282169E-03    2          22        23   # BR(h -> Z       gam    )
     2.11969867E-01    2          24       -24   # BR(h -> W+      W-     )
     2.69747859E-02    2          23        23   # BR(h -> Z       Z      )
     7.20638089E-02    2     1000022   1000022   # BR(h -> ~chi_10 ~chi_10)
#
#         PDG            Width
DECAY        35     1.43172966E+02   # H decays
#          BR         NDA      ID1       ID2
     6.56323888E-01    2           5        -5   # BR(H -> b       bb     )
     1.25795238E-01    2         -15        15   # BR(H -> tau+    tau-   )
     4.49136915E-04    2         -13        13   # BR(H -> mu+     mu-    )
     2.64299320E-04    2           3        -3   # BR(H -> s       sb     )
     3.49332308E-09    2           4        -4   # BR(H -> c       cb     )
     3.43964336E-04    2           6        -6   # BR(H -> t       tb     )
     1.10570460E-05    2          21        21   # BR(H -> g       g      )
     1.50629343E-09    2          22        22   # BR(H -> gam     gam    )
     6.82487484E-09    2          23        22   # BR(H -> Z       gam    )
     1.66217174E-07    2          24       -24   # BR(H -> W+      W-     )
     8.29432893E-08    2          23        23   # BR(H -> Z       Z      )
     5.37259835E-07    2          25        25   # BR(H -> h       h      )
     1.13389330E-03    2     1000024  -1000024   # BR(H -> ~chi_1+ ~chi_1-)
     7.16447779E-07    2     1000037  -1000037   # BR(H -> ~chi_2+ ~chi_2-)
     6.24404456E-02    2     1000024  -1000037   # BR(H -> ~chi_1+ ~chi_2-)
     6.24404456E-02    2     1000037  -1000024   # BR(H -> ~chi_2+ ~chi_1-)
     8.22755362E-03    2     1000022   1000022   # BR(H -> ~chi_10 ~chi_10)
     1.27755929E-03    2     1000023   1000023   # BR(H -> ~chi_20 ~chi_20)
     2.77614273E-03    2     1000025   1000025   # BR(H -> ~chi_30 ~chi_30)
     3.60007451E-07    2     1000035   1000035   # BR(H -> ~chi_40 ~chi_40)
     7.84902312E-03    2     1000022   1000023   # BR(H -> ~chi_10 ~chi_20)
     3.58527464E-03    2     1000022   1000025   # BR(H -> ~chi_10 ~chi_30)
     1.10885330E-02    2     1000022   1000035   # BR(H -> ~chi_10 ~chi_40)
     4.33370538E-03    2     1000023   1000025   # BR(H -> ~chi_20 ~chi_30)
     3.14110492E-02    2     1000023   1000035   # BR(H -> ~chi_20 ~chi_40)
     2.02468881E-02    2     1000025   1000035   # BR(H -> ~chi_30 ~chi_40)
     1.39824354E-08    2     2000011  -2000011   # BR(H -> ~e_R-   ~e_R+  )
     1.39824354E-08    2     2000013  -2000013   # BR(H -> ~mu_R-  ~mu_R+ )
#
#         PDG            Width
DECAY        36     1.43174519E+02   # A decays
#          BR         NDA      ID1       ID2
     6.56325947E-01    2           5        -5   # BR(A -> b       bb     )
     1.25794146E-01    2         -15        15   # BR(A -> tau+    tau-   )
     4.49132492E-04    2         -13        13   # BR(A -> mu+     mu-    )
     2.64303662E-04    2           3        -3   # BR(A -> s       sb     )
     3.50915962E-09    2           4        -4   # BR(A -> c       cb     )
     3.44784788E-04    2           6        -6   # BR(A -> t       tb     )
     1.75359664E-05    2          21        21   # BR(A -> g       g      )
     2.05942327E-08    2          22        22   # BR(A -> gam     gam    )
     1.24642202E-08    2          23        22   # BR(A -> Z       gam    )
     1.68489999E-07    2          23        25   # BR(A -> Z       h      )
     1.14889703E-03    2     1000024  -1000024   # BR(A -> ~chi_1+ ~chi_1-)
     7.46964853E-06    2     1000037  -1000037   # BR(A -> ~chi_2+ ~chi_2-)
     6.24277537E-02    2     1000024  -1000037   # BR(A -> ~chi_1+ ~chi_2-)
     6.24277537E-02    2     1000037  -1000024   # BR(A -> ~chi_2+ ~chi_1-)
     8.57012706E-03    2     1000022   1000022   # BR(A -> ~chi_10 ~chi_10)
     1.18466678E-03    2     1000023   1000023   # BR(A -> ~chi_20 ~chi_20)
     3.04523750E-03    2     1000025   1000025   # BR(A -> ~chi_30 ~chi_30)
     3.74274780E-06    2     1000035   1000035   # BR(A -> ~chi_40 ~chi_40)
     7.05610583E-03    2     1000022   1000023   # BR(A -> ~chi_10 ~chi_20)
     4.00044050E-03    2     1000022   1000025   # BR(A -> ~chi_10 ~chi_30)
     1.19582535E-02    2     1000022   1000035   # BR(A -> ~chi_10 ~chi_40)
     4.19562982E-03    2     1000023   1000025   # BR(A -> ~chi_20 ~chi_30)
     2.65786006E-02    2     1000023   1000035   # BR(A -> ~chi_20 ~chi_40)
     2.41992668E-02    2     1000025   1000035   # BR(A -> ~chi_30 ~chi_40)
#
#         PDG            Width
DECAY        37     1.40967138E+02   # H+ decays
#          BR         NDA      ID1       ID2
     1.09376296E-03    2           4        -5   # BR(H+ -> c       bb     )
     1.27810079E-01    2         -15        16   # BR(H+ -> tau+    nu_tau )
     4.56330131E-04    2         -13        14   # BR(H+ -> mu+     nu_mu  )
     1.09376189E-05    2           2        -5   # BR(H+ -> u       bb     )
     1.34324025E-05    2           2        -3   # BR(H+ -> u       sb     )
     2.64393886E-04    2           4        -3   # BR(H+ -> c       sb     )
     6.50281137E-01    2           6        -5   # BR(H+ -> t       bb     )
     1.71402480E-07    2          24        25   # BR(H+ -> W+      h      )
     2.24913041E-14    2          24        36   # BR(H+ -> W+      A      )
     2.10153990E-02    2     1000024   1000022   # BR(H+ -> ~chi_1+ ~chi_10)
     1.58401463E-04    2     1000024   1000023   # BR(H+ -> ~chi_1+ ~chi_20)
     7.69341069E-03    2     1000024   1000025   # BR(H+ -> ~chi_1+ ~chi_30)
     6.35357936E-02    2     1000024   1000035   # BR(H+ -> ~chi_1+ ~chi_40)
     2.34604667E-02    2     1000037   1000022   # BR(H+ -> ~chi_2+ ~chi_10)
     5.89236470E-02    2     1000037   1000023   # BR(H+ -> ~chi_2+ ~chi_20)
     4.52826376E-02    2     1000037   1000025   # BR(H+ -> ~chi_2+ ~chi_30)
     1.95526510E-12    2     1000037   1000035   # BR(H+ -> ~chi_2+ ~chi_40)
