#
#                              ======================
#                              | THE SUSYHIT OUTPUT |
#                              ======================
#
#
#              ------------------------------------------------------
#              |     This is the output of the SUSY-HIT package     |
#              |  created by A.Djouadi, M.Muehlleitner and M.Spira. |
#              |  In case of problems with SUSY-HIT email to        |
#              |           margarete.muehlleitner@cern.ch           |
#              |           michael.spira@psi.ch                     |
#              |           abdelhak.djouadi@cern.ch                 |
#              ------------------------------------------------------
#
#              ------------------------------------------------------
#              |  SUSY Les Houches Accord - MSSM Spectrum + Decays  |
#              |              based on the decay programs           |
#              |                                                    |
#              |                     SDECAY 1.3b                    |
#              |                                                    |
#              |  Authors: M.Muhlleitner, A.Djouadi and Y.Mambrini  |
#              |  Ref.:    Comput.Phys.Commun.168(2005)46           |
#              |           [hep-ph/0311167]                         |
#              |                                                    |
#              |                     HDECAY 3.4                     |
#              |                                                    |
#              |  By: A.Djouadi,J.Kalinowski,M.Muhlleitner,M.Spira  |
#              |  Ref.:    Comput.Phys.Commun.108(1998)56           |
#              |           [hep-ph/9704448]                         |
#              |                                                    |
#              |                                                    |
#              |  If not stated otherwise all DRbar couplings and   |
#              |  soft SUSY breaking masses are given at the scale  |
#              |  Q=  0.27056180E+04
#              |                                                    |
#              ------------------------------------------------------
#
#
BLOCK DCINFO  # Decay Program information
     1   SDECAY/HDECAY # decay calculator
     2   1.3b  /3.4    # version number
#
BLOCK SPINFO  # Spectrum calculator information
     1     SOFTSUSY    # spectrum calculator               
     2     3.4.0       # version number                    
#
BLOCK MODSEL  # Model selection
     1     0   #  nonUniversal                                     
#
BLOCK SMINPUTS  # Standard Model inputs
         1     1.27908970E+02   # alpha_em^-1(M_Z)^MSbar
         2     1.16637870E-05   # G_F [GeV^-2]
         3     1.18400000E-01   # alpha_S(M_Z)^MSbar
         4     9.11876000E+01   # M_Z pole mass
         5     4.18000000E+00   # mb(mb)^MSbar
         6     1.73200000E+02   # mt pole mass
         7     1.77700000E+00   # mtau pole mass
#
BLOCK MINPAR  # Input parameters - minimal models
         3     4.08900000E+01   # tanb                
#
BLOCK EXTPAR  # Input parameters - non-minimal models
         0    -1.00000000E+00   # Set                 
         1     2.80582000E+03   # M_1(MX)             
         2     1.05399000E+03   # M_2(MX)             
         3     1.94717000E+03   # M_3(MX)             
        11    -2.67140000E+03   # At(MX)              
        12     2.74272000E+03   # Ab(MX)              
        13     8.66050000E+02   # Atau(MX)            
        23     4.76690000E+02   # mu(MX)              
        26     2.55869000E+03   # mA(pole)            
        31     2.70037000E+03   # meL(MX)             
        32     2.70037000E+03   # mmuL(MX)            
        33     3.93943000E+03   # mtauL(MX)           
        34     1.96425000E+03   # meR(MX)             
        35     1.96425000E+03   # mmuR(MX)            
        36     5.13840000E+02   # mtauR(MX)           
        41     1.86339000E+03   # mqL1(MX)            
        42     1.86339000E+03   # mqL2(MX)            
        43     3.96815000E+03   # mqL3(MX)            
        44     6.05910000E+02   # muR(MX)             
        45     6.05910000E+02   # mcR(MX)             
        46     1.84122000E+03   # mtR(MX)             
        47     1.72617000E+03   # mdR(MX)             
        48     1.72617000E+03   # msR(MX)             
        49     3.32705000E+03   # mbR(MX)             
#
BLOCK MASS  # Mass Spectrum
# PDG code           mass       particle
        24     8.03811522E+01   # W+
        25     1.24023312E+02   # h
        35     2.55869422E+03   # H
        36     2.55869001E+03   # A
        37     2.56007745E+03   # H+
         5     4.81876030E+00   # b-quark pole mass calculated from mb(mb)_Msbar
   1000001     1.96447974E+03   # ~d_L
   2000001     1.82539584E+03   # ~d_R
   1000002     1.96301326E+03   # ~u_L
   2000002     7.95898918E+02   # ~u_R
   1000003     1.96447974E+03   # ~s_L
   2000003     1.82539584E+03   # ~s_R
   1000004     1.96301326E+03   # ~c_L
   2000004     7.95898918E+02   # ~c_R
   1000005     3.36238299E+03   # ~b_1
   2000005     3.99184999E+03   # ~b_2
   1000006     1.91008473E+03   # ~t_1
   2000006     3.99535885E+03   # ~t_2
   1000011     2.70989748E+03   # ~e_L
   2000011     1.97508032E+03   # ~e_R
   1000012     2.70841451E+03   # ~nu_eL
   1000013     2.70989748E+03   # ~mu_L
   2000013     1.97508032E+03   # ~mu_R
   1000014     2.70841451E+03   # ~nu_muL
   1000015     5.17156725E+02   # ~tau_1
   2000015     3.94449925E+03   # ~tau_2
   1000016     3.94336253E+03   # ~nu_tauL
   1000021     2.09083195E+03   # ~g
   1000022     4.92252474E+02   # ~chi_10
   1000023    -5.00303348E+02   # ~chi_20
   1000025     1.09815692E+03   # ~chi_30
   1000035     2.75847364E+03   # ~chi_40
   1000024     4.94943665E+02   # ~chi_1+
   1000037     1.09835921E+03   # ~chi_2+
#
BLOCK NMIX  # Neutralino Mixing Matrix
  1  1     1.43220728E-02   # N_11
  1  2    -9.37765110E-02   # N_12
  1  3     7.07852560E-01   # N_13
  1  4    -6.99961140E-01   # N_14
  2  1    -9.54774914E-03   # N_21
  2  2     3.41676592E-02   # N_22
  2  3     7.05071825E-01   # N_23
  2  4     7.08247932E-01   # N_24
  3  1     2.51573195E-03   # N_31
  3  2     9.95006453E-01   # N_32
  3  3     4.24985780E-02   # N_33
  3  4    -9.02756915E-02   # N_34
  4  1     9.99848683E-01   # N_41
  4  2    -8.33997472E-04   # N_42
  4  3    -3.51351365E-03   # N_43
  4  4     1.70167523E-02   # N_44
#
BLOCK UMIX  # Chargino Mixing Matrix U
  1  1    -6.03978701E-02   # U_11
  1  2     9.98174382E-01   # U_12
  2  1    -9.98174382E-01   # U_21
  2  2    -6.03978701E-02   # U_22
#
BLOCK VMIX  # Chargino Mixing Matrix V
  1  1    -1.28290462E-01   # V_11
  1  2     9.91736637E-01   # V_12
  2  1    -9.91736637E-01   # V_21
  2  2    -1.28290462E-01   # V_22
#
BLOCK STOPMIX  # Stop Mixing Matrix
  1  1     3.23641677E-02   # cos(theta_t)
  1  2     9.99476143E-01   # sin(theta_t)
  2  1    -9.99476143E-01   # -sin(theta_t)
  2  2     3.23641677E-02   # cos(theta_t)
#
BLOCK SBOTMIX  # Sbottom Mixing Matrix
  1  1     8.51315357E-03   # cos(theta_b)
  1  2     9.99963762E-01   # sin(theta_b)
  2  1    -9.99963762E-01   # -sin(theta_b)
  2  2     8.51315357E-03   # cos(theta_b)
#
BLOCK STAUMIX  # Stau Mixing Matrix
  1  1     2.24907321E-03   # cos(theta_tau)
  1  2     9.99997471E-01   # sin(theta_tau)
  2  1    -9.99997471E-01   # -sin(theta_tau)
  2  2     2.24907321E-03   # cos(theta_tau)
#
BLOCK ALPHA  # Higgs mixing
          -2.50839590E-02   # Mixing angle in the neutral Higgs boson sector
#
BLOCK HMIX Q=  2.70561800E+03  # DRbar Higgs Parameters
         1     4.87335716E+02   # mu(Q)MSSM           
         2     3.99949627E+01   # tan                 
         3     2.42363880E+02   # higgs               
         4     6.99121087E+06   # mA^2(Q)MSSM         
#
BLOCK GAUGE Q=  2.70561800E+03  # The gauge couplings
     1     3.65297605E-01   # gprime(Q) DRbar
     2     6.38924757E-01   # g(Q) DRbar
     3     1.02264294E+00   # g3(Q) DRbar
#
BLOCK AU Q=  2.70561800E+03  # The trilinear couplings
  1  1     0.00000000E+00   # A_u(Q) DRbar
  2  2     0.00000000E+00   # A_c(Q) DRbar
  3  3    -2.67139999E+03   # A_t(Q) DRbar
#
BLOCK AD Q=  2.70561800E+03  # The trilinear couplings
  1  1     0.00000000E+00   # A_d(Q) DRbar
  2  2     0.00000000E+00   # A_s(Q) DRbar
  3  3     2.74272001E+03   # A_b(Q) DRbar
#
BLOCK AE Q=  2.70561800E+03  # The trilinear couplings
  1  1     0.00000000E+00   # A_e(Q) DRbar
  2  2     0.00000000E+00   # A_mu(Q) DRbar
  3  3     8.66050002E+02   # A_tau(Q) DRbar
#
BLOCK Yu Q=  2.70561800E+03  # The Yukawa couplings
  1  1     0.00000000E+00   # y_u(Q) DRbar
  2  2     0.00000000E+00   # y_c(Q) DRbar
  3  3     8.20722680E-01   # y_t(Q) DRbar
#
BLOCK Yd Q=  2.70561800E+03  # The Yukawa couplings
  1  1     0.00000000E+00   # y_d(Q) DRbar
  2  2     0.00000000E+00   # y_s(Q) DRbar
  3  3     5.39884203E-01   # y_b(Q) DRbar
#
BLOCK Ye Q=  2.70561800E+03  # The Yukawa couplings
  1  1     0.00000000E+00   # y_e(Q) DRbar
  2  2     0.00000000E+00   # y_mu(Q) DRbar
  3  3     4.19932852E-01   # y_tau(Q) DRbar
#
BLOCK MSOFT Q=  2.70561800E+03  # The soft SUSY breaking masses at the scale Q
         1     2.80582000E+03   # M_1(Q)              
         2     1.05399000E+03   # M_2(Q)              
         3     1.94717000E+03   # M_3(Q)              
        21     6.40873177E+06   # mH1^2(Q)            
        22    -1.55819907E+05   # mH2^2(Q)            
        31     2.70037000E+03   # meL(Q)              
        32     2.70037000E+03   # mmuL(Q)             
        33     3.93943000E+03   # mtauL(Q)            
        34     1.96425000E+03   # meR(Q)              
        35     1.96425000E+03   # mmuR(Q)             
        36     5.13840002E+02   # mtauR(Q)            
        41     1.86338999E+03   # mqL1(Q)             
        42     1.86338999E+03   # mqL2(Q)             
        43     3.96814999E+03   # mqL3(Q)             
        44     6.05909982E+02   # muR(Q)              
        45     6.05909982E+02   # mcR(Q)              
        46     1.84121998E+03   # mtR(Q)              
        47     1.72616999E+03   # mdR(Q)              
        48     1.72616999E+03   # msR(Q)              
        49     3.32705000E+03   # mbR(Q)              
#
Block HiggsBoundsInputHiggsCouplingsFermions
# ScalarNormEffCoupSq PseudoSNormEffCoupSq NP   IP1 IP2 IP2
    1.00689245E+00    0.00000000E+00        3  25   5   5  # h0-b-b eff. coupling^2, normalised to SM
    1.59959015E+03    0.00000000E+00        3  35   5   5  # H0-b-b eff. coupling^2, normalised to SM
    0.00000000E+00    1.59959704E+03        3  36   5   5  # A0-b-b eff. coupling^2, normalised to SM
#
    9.99995691E-01    0.00000000E+00        3  25   6   6  # h0-t-t eff. coupling^2, normalised to SM
    6.29466314E-04    0.00000000E+00        3  35   6   6  # H0-t-t eff. coupling^2, normalised to SM
    0.00000000E+00    6.25157445E-04        3  36   6   6  # A0-t-t eff. coupling^2, normalised to SM
#
    1.00689245E+00    0.00000000E+00        3  25  15  15  # h0-tau-tau eff. coupling^2, normalised to SM
    1.59959015E+03    0.00000000E+00        3  35  15  15  # H0-tau-tau eff. coupling^2, normalised to SM
    0.00000000E+00    1.59959704E+03        3  36  15  15  # A0-tau-tau eff. coupling^2, normalised to SM
#
Block HiggsBoundsInputHiggsCouplingsBosons
    9.99999993E-01        3  25  24  24  # h0-W-W eff. coupling^2, normalised to SM
    7.39920624E-09        3  35  24  24  # H0-W-W eff. coupling^2, normalised to SM
    0.00000000E+00        3  36  24  24  # A0-W-W eff. coupling^2, normalised to SM
#
    9.99999993E-01        3  25  23  23  # h0-Z-Z eff. coupling^2, normalised to SM
    7.39920624E-09        3  35  23  23  # H0-Z-Z eff. coupling^2, normalised to SM
    0.00000000E+00        3  36  23  23  # A0-Z-Z eff. coupling^2, normalised to SM
#
    8.90708802E-01        3  25  21  21  # h0-g-g eff. coupling^2, normalised to SM
    6.18239547E-12        3  35  21  21  # H0-g-g eff. coupling^2, normalised to SM
    2.22449769E-11        3  36  21  21  # A0-g-g eff. coupling^2, normalised to SM
#
    0.00000000E+00        3  25  25  23  # h0-h0-Z eff. coupling^2, normalised to SM
    0.00000000E+00        3  35  25  23  # H0-h0-Z eff. coupling^2, normalised to SM
    7.39920624E-09        3  36  25  23  # A0-h0-Z eff. coupling^2, normalised to SM
    0.00000000E+00        3  35  35  23  # H0-H0-Z eff. coupling^2, normalised to SM
    9.99999993E-01        3  36  35  23  # A0-H0-Z eff. coupling^2, normalised to SM
    0.00000000E+00        3  36  36  23  # A0-A0-Z eff. coupling^2, normalised to SM
#
    0.00000000E+00        4  25  21  21  23  # h0-g-g-Z eff. coupling^2, normalised to SM
    0.00000000E+00        4  35  21  21  23  # H0-g-g-Z eff. coupling^2, normalised to SM
    0.00000000E+00        4  36  21  21  23  # A0-g-g-Z eff. coupling^2, normalised to SM
#
#
#
#                             =================
#                             |The decay table|
#                             =================
#
# - The QCD corrections to the decays gluino -> squark  + quark
#                                     squark -> gaugino + quark_prime
#                                     squark -> squark_prime + Higgs
#                                     squark -> gluino  + quark
#   are included.
#
# - The multi-body decays for the inos, stops and sbottoms are included.
#
# - The loop induced decays for the gluino, neutralinos and stops
#   are included.
#
# - The SUSY decays of the top quark are included.
#
#
#         PDG            Width
DECAY         6     1.43809813E+00   # top decays
#          BR         NDA      ID1       ID2
     1.00000000E+00    2           5        24   # BR(t ->  b    W+)
#
#         PDG            Width
DECAY   1000021     7.02062702E+01   # gluino decays
#          BR         NDA      ID1       ID2
     4.19290812E-03    2     1000001        -1   # BR(~g -> ~d_L  db)
     4.19290812E-03    2    -1000001         1   # BR(~g -> ~d_L* d )
     1.72566734E-02    2     2000001        -1   # BR(~g -> ~d_R  db)
     1.72566734E-02    2    -2000001         1   # BR(~g -> ~d_R* d )
     4.28769841E-03    2     1000002        -2   # BR(~g -> ~u_L  ub)
     4.28769841E-03    2    -1000002         2   # BR(~g -> ~u_L* u )
     2.23155910E-01    2     2000002        -2   # BR(~g -> ~u_R  ub)
     2.23155910E-01    2    -2000002         2   # BR(~g -> ~u_R* u )
     4.19290812E-03    2     1000003        -3   # BR(~g -> ~s_L  sb)
     4.19290812E-03    2    -1000003         3   # BR(~g -> ~s_L* s )
     1.72566734E-02    2     2000003        -3   # BR(~g -> ~s_R  sb)
     1.72566734E-02    2    -2000003         3   # BR(~g -> ~s_R* s )
     4.28737856E-03    2     1000004        -4   # BR(~g -> ~c_L  cb)
     4.28737856E-03    2    -1000004         4   # BR(~g -> ~c_L* c )
     2.23155857E-01    2     2000004        -4   # BR(~g -> ~c_R  cb)
     2.23155857E-01    2    -2000004         4   # BR(~g -> ~c_R* c )
     2.21399254E-03    2     1000006        -6   # BR(~g -> ~t_1  tb)
     2.21399254E-03    2    -1000006         6   # BR(~g -> ~t_1* t )
#
#         PDG            Width
DECAY   1000006     4.39453434E+01   # stop1 decays
#          BR         NDA      ID1       ID2
     2.44324479E-01    2     1000022         6   # BR(~t_1 -> ~chi_10 t )
     2.50146460E-01    2     1000023         6   # BR(~t_1 -> ~chi_20 t )
     1.30272823E-03    2     1000025         6   # BR(~t_1 -> ~chi_30 t )
     5.01445166E-01    2     1000024         5   # BR(~t_1 -> ~chi_1+ b )
     2.78116753E-03    2     1000037         5   # BR(~t_1 -> ~chi_2+ b )
#
#         PDG            Width
DECAY   2000006     2.50664805E+02   # stop2 decays
#          BR         NDA      ID1       ID2
     1.01009900E-01    2     1000022         6   # BR(~t_2 -> ~chi_10 t )
     1.03247848E-01    2     1000023         6   # BR(~t_2 -> ~chi_20 t )
     5.70451919E-02    2     1000025         6   # BR(~t_2 -> ~chi_30 t )
     6.33855120E-04    2     1000035         6   # BR(~t_2 -> ~chi_40 t )
     9.01344659E-02    2     1000024         5   # BR(~t_2 -> ~chi_1+ b )
     1.10154144E-01    2     1000037         5   # BR(~t_2 -> ~chi_2+ b )
     4.61087308E-01    2     1000021         6   # BR(~t_2 -> ~g      t )
     3.69347765E-02    2     1000006        25   # BR(~t_2 -> ~t_1    h )
     3.94719787E-02    2     1000006        23   # BR(~t_2 -> ~t_1    Z )
     2.80532096E-04    2     1000005        24   # BR(~t_2 -> ~b_1    W+)
#
#         PDG            Width
DECAY   1000005     1.07591212E+02   # sbottom1 decays
#          BR         NDA      ID1       ID2
     8.71304602E-02    2     1000022         5   # BR(~b_1 -> ~chi_10 b )
     8.60760001E-02    2     1000023         5   # BR(~b_1 -> ~chi_20 b )
     1.81537275E-04    2     1000025         5   # BR(~b_1 -> ~chi_30 b )
     1.96997921E-03    2     1000035         5   # BR(~b_1 -> ~chi_40 b )
     1.72017204E-01    2    -1000024         6   # BR(~b_1 -> ~chi_1- t )
     3.63494074E-04    2    -1000037         6   # BR(~b_1 -> ~chi_2- t )
     6.52256114E-01    2     1000021         5   # BR(~b_1 -> ~g      b )
     5.21124827E-06    2     1000006       -24   # BR(~b_1 -> ~t_1    W-)
#
#         PDG            Width
DECAY   2000005     2.51619511E+02   # sbottom2 decays
#          BR         NDA      ID1       ID2
     4.51901621E-02    2     1000022         5   # BR(~b_2 -> ~chi_10 b )
     4.44221466E-02    2     1000023         5   # BR(~b_2 -> ~chi_20 b )
     5.46277695E-02    2     1000025         5   # BR(~b_2 -> ~chi_30 b )
     6.45470712E-04    2     1000035         5   # BR(~b_2 -> ~chi_40 b )
     2.02082943E-01    2    -1000024         6   # BR(~b_2 -> ~chi_1- t )
     1.13184477E-01    2    -1000037         6   # BR(~b_2 -> ~chi_2- t )
     4.63476136E-01    2     1000021         5   # BR(~b_2 -> ~g      b )
     1.43517545E-04    2     1000005        25   # BR(~b_2 -> ~b_1    h )
     1.40937963E-04    2     1000005        23   # BR(~b_2 -> ~b_1    Z )
     7.60864397E-02    2     1000006       -24   # BR(~b_2 -> ~t_1    W-)
#
#         PDG            Width
DECAY   1000002     1.11942374E+01   # sup_L decays
#          BR         NDA      ID1       ID2
     5.04944729E-03    2     1000022         2   # BR(~u_L -> ~chi_10 u)
     6.34614155E-04    2     1000023         2   # BR(~u_L -> ~chi_20 u)
     3.26472853E-01    2     1000025         2   # BR(~u_L -> ~chi_30 u)
     2.00216691E-02    2     1000024         1   # BR(~u_L -> ~chi_1+ d)
     6.47821416E-01    2     1000037         1   # BR(~u_L -> ~chi_2+ d)
#
#         PDG            Width
DECAY   2000002     2.18243816E-04   # sup_R decays
#           BR         NDA      ID1       ID2
     6.96101038E-01    2     1000022         2   # BR(~u_R -> ~chi_10 u)
     2.96953670E-01    2     1000023         2   # BR(~u_R -> ~chi_20 u)
#           BR         NDA      ID1       ID2       ID3
     2.02328757E-04    3        2       -15        1000015   # BR(~u_R -> u  tau+  ~tau_1-)
     2.77794812E-03    3        2       15        -1000015   # BR(~u_R -> u  tau-  ~tau_1+)
     5.27758367E-04    3        2       23        1000022   # BR(~u_R -> u  Z  ~chi_10)
     4.66038405E-04    3        2       25        1000022   # BR(~u_R -> u  h  ~chi_10)
     6.77224228E-04    3        2       23        1000023   # BR(~u_R -> u  Z  ~chi_20)
     1.80532034E-04    3        2       25        1000023   # BR(~u_R -> u  h  ~chi_20)
     1.18812072E-04    3        2       -24        1000024   # BR(~u_R -> u  W-  ~chi_1+)
     1.99464987E-03    3        2       24        -1000024   # BR(~u_R -> u  W+  ~chi_1-)
#
#         PDG            Width
DECAY   1000001     1.11380691E+01   # sdown_L decays
#          BR         NDA      ID1       ID2
     5.70659259E-03    2     1000022         1   # BR(~d_L -> ~chi_10 d)
     7.90077967E-04    2     1000023         1   # BR(~d_L -> ~chi_20 d)
     3.28145298E-01    2     1000025         1   # BR(~d_L -> ~chi_30 d)
     4.46387115E-03    2    -1000024         2   # BR(~d_L -> ~chi_1- u)
     6.60894160E-01    2    -1000037         2   # BR(~d_L -> ~chi_2- u)
#
#         PDG            Width
DECAY   2000001     8.94017321E-02   # sdown_R decays
#           BR         NDA      ID1       ID2
     2.08519835E-03    2     1000022         1   # BR(~d_R -> ~chi_10 d)
     9.21963013E-04    2     1000023         1   # BR(~d_R -> ~chi_20 d)
#           BR         NDA      ID1       ID2       ID3
     1.49415450E-01    3        1       -2        2000002   # BR(~d_R -> d  ub  ~u_R)
     3.47700199E-01    3        1       2        -2000002   # BR(~d_R -> d  u  ~u_R*)
     1.52815831E-01    3        1       -4        2000004   # BR(~d_R -> d  cb  ~c_R)
     3.45485476E-01    3        1       4        -2000004   # BR(~d_R -> d  c  ~c_R*)
     1.33789354E-04    3        1       -15        1000015   # BR(~d_R -> d  tau+  ~tau_1-)
     7.06697718E-04    3        1       15        -1000015   # BR(~d_R -> d  tau-  ~tau_1+)
     4.19354291E-05    3        1       23        1000022   # BR(~d_R -> d  Z  ~chi_10)
     1.25400255E-04    3        1       25        1000022   # BR(~d_R -> d  h  ~chi_10)
     1.40332852E-04    3        1       23        1000023   # BR(~d_R -> d  Z  ~chi_20)
     3.91099805E-05    3        1       25        1000023   # BR(~d_R -> d  h  ~chi_20)
     3.45798671E-08    3        1       23        1000025   # BR(~d_R -> d  Z  ~chi_30)
     1.57692694E-06    3        1       25        1000025   # BR(~d_R -> d  h  ~chi_30)
     6.25222786E-05    3        1       -24        1000024   # BR(~d_R -> d  W-  ~chi_1+)
     3.21067605E-04    3        1       24        -1000024   # BR(~d_R -> d  W+  ~chi_1-)
     1.52469082E-06    3        1       -24        1000037   # BR(~d_R -> d  W-  ~chi_2+)
     1.89101482E-06    3        1       24        -1000037   # BR(~d_R -> d  W+  ~chi_2-)
#
#         PDG            Width
DECAY   1000004     1.14230865E+01   # scharm_L decays
#          BR         NDA      ID1       ID2
     5.07993690E-03    2     1000022         4   # BR(~c_L -> ~chi_10 c)
     6.38408985E-04    2     1000023         4   # BR(~c_L -> ~chi_20 c)
     3.26421169E-01    2     1000025         4   # BR(~c_L -> ~chi_30 c)
     2.01422014E-02    2     1000024         3   # BR(~c_L -> ~chi_1+ s)
     6.47718284E-01    2     1000037         3   # BR(~c_L -> ~chi_2+ s)
#
#         PDG            Width
DECAY   2000004     2.11041902E-04   # scharm_R decays
#           BR         NDA      ID1       ID2
     6.95992310E-01    2     1000022         4   # BR(~c_R -> ~chi_10 c)
     2.96801122E-01    2     1000023         4   # BR(~c_R -> ~chi_20 c)
#           BR         NDA      ID1       ID2       ID3
     2.08314081E-04    3        4       -15        1000015   # BR(~c_R -> c  tau+  ~tau_1-)
     2.89520703E-03    3        4       15        -1000015   # BR(~c_R -> c  tau-  ~tau_1+)
     5.43920419E-04    3        4       23        1000022   # BR(~c_R -> c  Z  ~chi_10)
     4.82747733E-04    3        4       25        1000022   # BR(~c_R -> c  h  ~chi_10)
     7.00477007E-04    3        4       23        1000023   # BR(~c_R -> c  Z  ~chi_20)
     1.86526939E-04    3        4       25        1000023   # BR(~c_R -> c  h  ~chi_20)
     1.22771827E-04    3        4       -24        1000024   # BR(~c_R -> c  W-  ~chi_1+)
     2.06660381E-03    3        4       24        -1000024   # BR(~c_R -> c  W+  ~chi_1-)
#
#         PDG            Width
DECAY   1000003     1.13658578E+01   # sstrange_L decays
#          BR         NDA      ID1       ID2
     5.74154412E-03    2     1000022         3   # BR(~s_L -> ~chi_10 s)
     7.94870809E-04    2     1000023         3   # BR(~s_L -> ~chi_20 s)
     3.28124247E-01    2     1000025         3   # BR(~s_L -> ~chi_30 s)
     4.49112043E-03    2    -1000024         4   # BR(~s_L -> ~chi_1- c)
     6.60848218E-01    2    -1000037         4   # BR(~s_L -> ~chi_2- c)
#
#         PDG            Width
DECAY   2000003     8.94497941E-02   # sstrange_R decays
#           BR         NDA      ID1       ID2
     2.12334861E-03    2     1000022         3   # BR(~s_R -> ~chi_10 s)
     9.38776553E-04    2     1000023         3   # BR(~s_R -> ~chi_20 s)
#           BR         NDA      ID1       ID2       ID3
     1.49335168E-01    3        3       -2        2000002   # BR(~s_R -> s  ub  ~u_R)
     3.47513377E-01    3        3       2        -2000002   # BR(~s_R -> s  u  ~u_R*)
     1.52733722E-01    3        3       -4        2000004   # BR(~s_R -> s  cb  ~c_R)
     3.45780561E-01    3        3       4        -2000004   # BR(~s_R -> s  c  ~c_R*)
     1.33728648E-04    3        3       -15        1000015   # BR(~s_R -> s  tau+  ~tau_1-)
     7.06318004E-04    3        3       15        -1000015   # BR(~s_R -> s  tau-  ~tau_1+)
     4.17608563E-05    3        3       23        1000022   # BR(~s_R -> s  Z  ~chi_10)
     1.25455851E-04    3        3       25        1000022   # BR(~s_R -> s  h  ~chi_10)
     1.40257450E-04    3        3       23        1000023   # BR(~s_R -> s  Z  ~chi_20)
     3.90889664E-05    3        3       25        1000023   # BR(~s_R -> s  h  ~chi_20)
     3.45612869E-08    3        3       23        1000025   # BR(~s_R -> s  Z  ~chi_30)
     1.57607965E-06    3        3       25        1000025   # BR(~s_R -> s  h  ~chi_30)
     6.24383774E-05    3        3       -24        1000024   # BR(~s_R -> s  W-  ~chi_1+)
     3.20973349E-04    3        3       24        -1000024   # BR(~s_R -> s  W+  ~chi_1-)
     1.52498954E-06    3        3       -24        1000037   # BR(~s_R -> s  W-  ~chi_2+)
     1.88999876E-06    3        3       24        -1000037   # BR(~s_R -> s  W+  ~chi_2-)
#
#         PDG            Width
DECAY   1000011     2.31059722E+01   # selectron_L decays
#          BR         NDA      ID1       ID2
     3.26219763E-03    2     1000022        11   # BR(~e_L -> ~chi_10 e-)
     3.66216318E-04    2     1000023        11   # BR(~e_L -> ~chi_20 e-)
     3.30308534E-01    2     1000025        11   # BR(~e_L -> ~chi_30 e-)
     3.24662674E-03    2    -1000024        12   # BR(~e_L -> ~chi_1- nu_e)
     6.62816425E-01    2    -1000037        12   # BR(~e_L -> ~chi_2- nu_e)
#
#         PDG            Width
DECAY   2000011     5.99743608E-03   # selectron_R decays
#           BR         NDA      ID1       ID2
     3.15487793E-01    2     1000022        11   # BR(~e_R -> ~chi_10 e-)
     1.39596206E-01    2     1000023        11   # BR(~e_R -> ~chi_20 e-)
#           BR         NDA      ID1       ID2       ID3
     1.15077509E-12    3        11       -1        1000001   # BR(~e_R- -> e-  db  ~d_L)
     5.83115844E-13    3        11       1        -1000001   # BR(~e_R- -> e-  d  ~d_L*)
     1.00101109E-06    3        11       -1        2000001   # BR(~e_R- -> e-  db  ~d_R)
     2.07021798E-06    3        11       1        -2000001   # BR(~e_R- -> e-  d  ~d_R*)
     2.10006407E-12    3        11       -2        1000002   # BR(~e_R- -> e-  ub  ~u_L)
     1.04157842E-12    3        11       2        -1000002   # BR(~e_R- -> e-  u  ~u_L*)
     2.35517308E-02    3        11       -2        2000002   # BR(~e_R- -> e-  ub  ~u_R)
     8.80776373E-02    3        11       2        -2000002   # BR(~e_R- -> e-  u  ~u_R*)
     1.14142108E-12    3        11       -3        1000003   # BR(~e_R- -> e-  sb  ~s_L)
     5.91286002E-13    3        11       3        -1000003   # BR(~e_R- -> e-  s  ~s_L*)
     1.00704700E-06    3        11       -3        2000003   # BR(~e_R- -> e-  sb  ~s_R)
     2.10906791E-06    3        11       3        -2000003   # BR(~e_R- -> e-  s  ~s_R*)
     1.98684902E-12    3        11       -4        1000004   # BR(~e_R- -> e-  cb  ~c_L)
     9.85004245E-13    3        11       4        -1000004   # BR(~e_R- -> e-  c  ~c_L*)
     2.34016667E-02    3        11       -4        2000004   # BR(~e_R- -> e-  cb  ~c_R)
     8.85178254E-02    3        11       4        -2000004   # BR(~e_R- -> e-  c  ~c_R*)
     3.19269764E-02    3        11       -15        1000015   # BR(~e_R- -> e-  tau+  ~tau_1-)
     1.43983193E-01    3        11       15        -1000015   # BR(~e_R- -> e-  tau-  ~tau_1+)
     8.08212032E-03    3        11       23        1000022   # BR(~e_R- -> e-  Z  ~chi_10)
     2.53958521E-02    3        11       25        1000022   # BR(~e_R- -> e-  h  ~chi_10)
     2.78552364E-02    3        11       23        1000023   # BR(~e_R- -> e-  Z  ~chi_20)
     7.82467697E-03    3        11       25        1000023   # BR(~e_R- -> e-  h  ~chi_20)
     1.50202518E-05    3        11       23        1000025   # BR(~e_R- -> e-  Z  ~chi_30)
     4.37653685E-04    3        11       25        1000025   # BR(~e_R- -> e-  h  ~chi_30)
     1.35094395E-02    3        11       -24        1000024   # BR(~e_R- -> e-  W-  ~chi_1+)
     6.13878989E-02    3        11       24        -1000024   # BR(~e_R- -> e-  W+  ~chi_1-)
     4.18762279E-04    3        11       -24        1000037   # BR(~e_R- -> e-  W-  ~chi_2+)
     5.24123969E-04    3        11       24        -1000037   # BR(~e_R- -> e-  W+  ~chi_2-)
#
#         PDG            Width
DECAY   1000013     2.31059721E+01   # smuon_L decays
#          BR         NDA      ID1       ID2
     3.26219762E-03    2     1000022        13   # BR(~mu_L -> ~chi_10 mu-)
     3.66216318E-04    2     1000023        13   # BR(~mu_L -> ~chi_20 mu-)
     3.30308533E-01    2     1000025        13   # BR(~mu_L -> ~chi_30 mu-)
     3.24662674E-03    2    -1000024        14   # BR(~mu_L -> ~chi_1- nu_mu)
     6.62816426E-01    2    -1000037        14   # BR(~mu_L -> ~chi_2- nu_mu)
#
#         PDG            Width
DECAY   2000013     5.99820318E-03   # smuon_R decays
#           BR         NDA      ID1       ID2
     3.15447444E-01    2     1000022        13   # BR(~mu_R -> ~chi_10 mu-)
     1.39578353E-01    2     1000023        13   # BR(~mu_R -> ~chi_20 mu-)
#           BR         NDA      ID1       ID2       ID3
     1.13148885E-12    3        13       -1        1000001   # BR(~mu_R- -> mu-  db  ~d_L)
     5.74572067E-13    3        13       1        -1000001   # BR(~mu_R- -> mu-  d  ~d_L*)
     1.00286700E-06    3        13       -1        2000001   # BR(~mu_R- -> mu-  db  ~d_R)
     2.09712803E-06    3        13       1        -2000001   # BR(~mu_R- -> mu-  d  ~d_R*)
     2.09045936E-12    3        13       -2        1000002   # BR(~mu_R- -> mu-  ub  ~u_L)
     1.04926423E-12    3        13       2        -1000002   # BR(~mu_R- -> mu-  u  ~u_L*)
     2.35487188E-02    3        13       -2        2000002   # BR(~mu_R- -> mu-  ub  ~u_R)
     8.80663733E-02    3        13       2        -2000002   # BR(~mu_R- -> mu-  u  ~u_R*)
     1.14209202E-12    3        13       -3        1000003   # BR(~mu_R- -> mu-  sb  ~s_L)
     5.86442289E-13    3        13       3        -1000003   # BR(~mu_R- -> mu-  s  ~s_L*)
     1.00298370E-06    3        13       -3        2000003   # BR(~mu_R- -> mu-  sb  ~s_R)
     2.10112923E-06    3        13       3        -2000003   # BR(~mu_R- -> mu-  s  ~s_R*)
     1.95942012E-12    3        13       -4        1000004   # BR(~mu_R- -> mu-  cb  ~c_L)
     9.79309941E-13    3        13       4        -1000004   # BR(~mu_R- -> mu-  c  ~c_L*)
     2.33986739E-02    3        13       -4        2000004   # BR(~mu_R- -> mu-  cb  ~c_R)
     8.85065051E-02    3        13       4        -2000004   # BR(~mu_R- -> mu-  c  ~c_R*)
     3.19245605E-02    3        13       -15        1000015   # BR(~mu_R- -> mu-  tau+  ~tau_1-)
     1.43964780E-01    3        13       15        -1000015   # BR(~mu_R- -> mu-  tau-  ~tau_1+)
     7.96988675E-03    3        13       23        1000022   # BR(~mu_R- -> mu-  Z  ~chi_10)
     2.53926043E-02    3        13       25        1000022   # BR(~mu_R- -> mu-  h  ~chi_10)
     2.78516741E-02    3        13       23        1000023   # BR(~mu_R- -> mu-  Z  ~chi_20)
     7.87585859E-03    3        13       25        1000023   # BR(~mu_R- -> mu-  h  ~chi_20)
     1.50184976E-05    3        13       23        1000025   # BR(~mu_R- -> mu-  Z  ~chi_30)
     4.37414326E-04    3        13       25        1000025   # BR(~mu_R- -> mu-  h  ~chi_30)
     1.34862053E-02    3        13       -24        1000024   # BR(~mu_R- -> mu-  W-  ~chi_1+)
     6.15867768E-02    3        13       24        -1000024   # BR(~mu_R- -> mu-  W+  ~chi_1-)
     4.18708724E-04    3        13       -24        1000037   # BR(~mu_R- -> mu-  W-  ~chi_2+)
     5.24240328E-04    3        13       24        -1000037   # BR(~mu_R- -> mu-  W+  ~chi_2-)
#
#         PDG            Width
DECAY   1000015     2.44439101E-02   # stau_1 decays
#          BR         NDA      ID1       ID2
     3.26877801E-01    2     1000022        15   # BR(~tau_1 -> ~chi_10  tau-)
     1.50356512E-01    2     1000023        15   # BR(~tau_1 -> ~chi_20  tau-)
     5.22765687E-01    2    -1000024        16   # BR(~tau_1 -> ~chi_1-  nu_tau)
#
#         PDG            Width
DECAY   2000015     5.62528056E+01   # stau_2 decays
#          BR         NDA      ID1       ID2
     1.21385460E-01    2     1000022        15   # BR(~tau_2 -> ~chi_10  tau-)
     1.18648721E-01    2     1000023        15   # BR(~tau_2 -> ~chi_20  tau-)
     2.41015651E-01    2     1000025        15   # BR(~tau_2 -> ~chi_30  tau-)
     2.42224392E-02    2     1000035        15   # BR(~tau_2 -> ~chi_40  tau-)
     1.91536311E-03    2    -1000024        16   # BR(~tau_2 -> ~chi_1-  nu_tau)
     4.82907747E-01    2    -1000037        16   # BR(~tau_2 -> ~chi_2-  nu_tau)
     1.68148024E-03    2     1000015        25   # BR(~tau_2 -> ~tau_1   h)
     3.26442554E-03    2     1000015        35   # BR(~tau_2 -> ~tau_1   H)
     3.26420459E-03    2     1000015        36   # BR(~tau_2 -> ~tau_1   A)
     1.69450778E-03    2     1000015        23   # BR(~tau_2 -> ~tau_1   Z)
#
#         PDG            Width
DECAY   1000012     2.31452780E+01   # snu_eL decays
#          BR         NDA      ID1       ID2
     4.61931850E-03    2     1000022        12   # BR(~nu_eL -> ~chi_10 nu_e)
     6.96093382E-04    2     1000023        12   # BR(~nu_eL -> ~chi_20 nu_e)
     3.27525978E-01    2     1000025        12   # BR(~nu_eL -> ~chi_30 nu_e)
     1.46140010E-02    2     1000024        11   # BR(~nu_eL -> ~chi_1+ e-)
     6.52544609E-01    2     1000037        11   # BR(~nu_eL -> ~chi_2+ e-)
#
#         PDG            Width
DECAY   1000014     2.31452779E+01   # snu_muL decays
#          BR         NDA      ID1       ID2
     4.61931851E-03    2     1000022        14   # BR(~nu_muL -> ~chi_10 nu_mu)
     6.96093384E-04    2     1000023        14   # BR(~nu_muL -> ~chi_20 nu_mu)
     3.27525979E-01    2     1000025        14   # BR(~nu_muL -> ~chi_30 nu_mu)
     1.46140010E-02    2     1000024        13   # BR(~nu_muL -> ~chi_1+ mu-)
     6.52544608E-01    2     1000037        13   # BR(~nu_muL -> ~chi_2+ mu-)
#
#         PDG            Width
DECAY   1000016     5.62636848E+01   # snu_tauL decays
#          BR         NDA      ID1       ID2
     2.86746893E-03    2     1000022        16   # BR(~nu_tauL -> ~chi_10 nu_tau)
     4.32627233E-04    2     1000023        16   # BR(~nu_tauL -> ~chi_20 nu_tau)
     2.39065436E-01    2     1000025        16   # BR(~nu_tauL -> ~chi_30 nu_tau)
     2.43244608E-02    2     1000035        16   # BR(~nu_tauL -> ~chi_40 nu_tau)
     2.46392585E-01    2     1000024        15   # BR(~nu_tauL -> ~chi_1+ tau-)
     4.77113609E-01    2     1000037        15   # BR(~nu_tauL -> ~chi_2+ tau-)
     6.51910770E-03    2    -1000015       -37   # BR(~nu_tauL -> ~tau_1+ H-)
     3.28470507E-03    2    -1000015       -24   # BR(~nu_tauL -> ~tau_1+ W-)
#
#         PDG            Width
DECAY   1000024     1.54882408E-10   # chargino1+ decays
#           BR         NDA      ID1       ID2       ID3
     3.69930384E-01    3     1000022         2        -1   # BR(~chi_1+ -> ~chi_10 u    db)
     3.69930384E-01    3     1000022         4        -3   # BR(~chi_1+ -> ~chi_10 c    sb)
     1.23308333E-01    3     1000022       -11        12   # BR(~chi_1+ -> ~chi_10 e+   nu_e)
     1.23308333E-01    3     1000022       -13        14   # BR(~chi_1+ -> ~chi_10 mu+  nu_mu)
     1.35225657E-02    3     1000022       -15        16   # BR(~chi_1+ -> ~chi_10 tau+ nu_tau)
#
#         PDG            Width
DECAY   1000037     8.27718598E+00   # chargino2+ decays
#          BR         NDA      ID1       ID2
     4.57822349E-04    2    -1000015        16   # BR(~chi_2+ -> ~tau_1+  nu_tau)
     2.54257495E-01    2     1000024        23   # BR(~chi_2+ -> ~chi_1+  Z )
     2.46583609E-01    2     1000022        24   # BR(~chi_2+ -> ~chi_10  W+)
     2.48135716E-01    2     1000023        24   # BR(~chi_2+ -> ~chi_20  W+)
     2.50565358E-01    2     1000024        25   # BR(~chi_2+ -> ~chi_1+  h )
#
#         PDG            Width
DECAY   1000022     0.00000000E+00   # neutralino1 decays
#
#         PDG            Width
DECAY   1000023     3.87324223E-08   # neutralino2 decays
#          BR         NDA      ID1       ID2
     4.20289232E-03    2     1000022        22   # BR(~chi_20 -> ~chi_10 gam)
#           BR         NDA      ID1       ID2       ID3
     1.01264216E-01    3     1000022        -2         2   # BR(~chi_20 -> ~chi_10 ub      u)
     1.31454702E-01    3     1000022        -1         1   # BR(~chi_20 -> ~chi_10 db      d)
     1.01264216E-01    3     1000022        -4         4   # BR(~chi_20 -> ~chi_10 cb      c)
     1.31454702E-01    3     1000022        -3         3   # BR(~chi_20 -> ~chi_10 sb      s)
     3.02064103E-02    3     1000022       -11        11   # BR(~chi_20 -> ~chi_10 e+      e-)
     3.02064103E-02    3     1000022       -13        13   # BR(~chi_20 -> ~chi_10 mu+     mu-)
     2.81224394E-02    3     1000022       -15        15   # BR(~chi_20 -> ~chi_10 tau+    tau-)
     6.04007159E-02    3     1000022       -12        12   # BR(~chi_20 -> ~chi_10 nu_eb   nu_e)
     6.04007159E-02    3     1000022       -14        14   # BR(~chi_20 -> ~chi_10 nu_mub  nu_mu)
     6.04004837E-02    3     1000022       -16        16   # BR(~chi_20 -> ~chi_10 nu_taub nu_tau)
     4.50228588E-02    3     1000024        -2         1   # BR(~chi_20 -> ~chi_1+ ub      d)
     4.50228588E-02    3    -1000024        -1         2   # BR(~chi_20 -> ~chi_1- db      u)
     4.50228588E-02    3     1000024        -4         3   # BR(~chi_20 -> ~chi_1+ cb      s)
     4.50228588E-02    3    -1000024        -3         4   # BR(~chi_20 -> ~chi_1- sb      c)
     1.50076109E-02    3     1000024       -12        11   # BR(~chi_20 -> ~chi_1+ nu_eb   e-)
     1.50076109E-02    3    -1000024        12       -11   # BR(~chi_20 -> ~chi_1- nu_e    e+)
     1.50076109E-02    3     1000024       -14        13   # BR(~chi_20 -> ~chi_1+ nu_mub  mu-)
     1.50076109E-02    3    -1000024        14       -13   # BR(~chi_20 -> ~chi_1- nu_mu   mu+)
     1.02501085E-02    3     1000024       -16        15   # BR(~chi_20 -> ~chi_1+ nu_taub tau-)
     1.02501085E-02    3    -1000024        16       -15   # BR(~chi_20 -> ~chi_1- nu_tau  tau+)
#
#         PDG            Width
DECAY   1000025     8.27406521E+00   # neutralino3 decays
#          BR         NDA      ID1       ID2
     2.98203002E-02    2     1000022        23   # BR(~chi_30 -> ~chi_10   Z )
     2.20716805E-01    2     1000023        23   # BR(~chi_30 -> ~chi_20   Z )
     2.52334078E-01    2     1000024       -24   # BR(~chi_30 -> ~chi_1+   W-)
     2.52334078E-01    2    -1000024        24   # BR(~chi_30 -> ~chi_1-   W+)
     2.16837391E-01    2     1000022        25   # BR(~chi_30 -> ~chi_10   h )
     2.74982643E-02    2     1000023        25   # BR(~chi_30 -> ~chi_20   h )
     6.86559401E-07    2     2000002        -2   # BR(~chi_30 -> ~u_R      ub)
     6.86559401E-07    2    -2000002         2   # BR(~chi_30 -> ~u_R*     u )
     6.86552770E-07    2     2000004        -4   # BR(~chi_30 -> ~c_R      cb)
     6.86552770E-07    2    -2000004         4   # BR(~chi_30 -> ~c_R*     c )
     2.28168949E-04    2     1000015       -15   # BR(~chi_30 -> ~tau_1-   tau+)
     2.28168949E-04    2    -1000015        15   # BR(~chi_30 -> ~tau_1+   tau-)
#
#         PDG            Width
DECAY   1000035     6.85554817E+01   # neutralino4 decays
#          BR         NDA      ID1       ID2
     8.00463972E-03    2     1000022        23   # BR(~chi_40 -> ~chi_10   Z )
     1.89171480E-02    2     1000023        23   # BR(~chi_40 -> ~chi_20   Z )
     1.14116598E-04    2     1000025        23   # BR(~chi_40 -> ~chi_30   Z )
     2.54154685E-02    2     1000024       -24   # BR(~chi_40 -> ~chi_1+   W-)
     2.54154685E-02    2    -1000024        24   # BR(~chi_40 -> ~chi_1-   W+)
     7.53506200E-04    2     1000037       -24   # BR(~chi_40 -> ~chi_2+   W-)
     7.53506200E-04    2    -1000037        24   # BR(~chi_40 -> ~chi_2-   W+)
     1.83077872E-02    2     1000022        25   # BR(~chi_40 -> ~chi_10   h )
     8.19839311E-03    2     1000023        25   # BR(~chi_40 -> ~chi_20   h )
     6.41911217E-04    2     1000025        25   # BR(~chi_40 -> ~chi_30   h )
     2.09085688E-03    2     1000002        -2   # BR(~chi_40 -> ~u_L      ub)
     2.09085688E-03    2    -1000002         2   # BR(~chi_40 -> ~u_L*     u )
     1.14575574E-01    2     2000002        -2   # BR(~chi_40 -> ~u_R      ub)
     1.14575574E-01    2    -2000002         2   # BR(~chi_40 -> ~u_R*     u )
     2.12135990E-03    2     1000001        -1   # BR(~chi_40 -> ~d_L      db)
     2.12135990E-03    2    -1000001         1   # BR(~chi_40 -> ~d_L*     d )
     1.09013475E-02    2     2000001        -1   # BR(~chi_40 -> ~d_R      db)
     1.09013475E-02    2    -2000001         1   # BR(~chi_40 -> ~d_R*     d )
     2.09085388E-03    2     1000004        -4   # BR(~chi_40 -> ~c_L      cb)
     2.09085388E-03    2    -1000004         4   # BR(~chi_40 -> ~c_L*     c )
     1.14575566E-01    2     2000004        -4   # BR(~chi_40 -> ~c_R      cb)
     1.14575566E-01    2    -2000004         4   # BR(~chi_40 -> ~c_R*     c )
     2.12135990E-03    2     1000003        -3   # BR(~chi_40 -> ~s _L      sb)
     2.12135990E-03    2    -1000003         3   # BR(~chi_40 -> ~s _L*     s )
     1.09013475E-02    2     2000003        -3   # BR(~chi_40 -> ~s _R      sb)
     1.09013475E-02    2    -2000003         3   # BR(~chi_40 -> ~s _R*     s )
     3.70922534E-02    2     1000006        -6   # BR(~chi_40 -> ~t_1      tb)
     3.70922534E-02    2    -1000006         6   # BR(~chi_40 -> ~t_1*     t )
     3.24397762E-05    2     1000011       -11   # BR(~chi_40 -> ~e_L-     e+)
     3.24397762E-05    2    -1000011        11   # BR(~chi_40 -> ~e_L+     e-)
     2.53616814E-02    2     2000011       -11   # BR(~chi_40 -> ~e_R-     e+)
     2.53616814E-02    2    -2000011        11   # BR(~chi_40 -> ~e_R+     e-)
     3.24397762E-05    2     1000013       -13   # BR(~chi_40 -> ~mu_L-    mu+)
     3.24397762E-05    2    -1000013        13   # BR(~chi_40 -> ~mu_L+    mu-)
     2.53616814E-02    2     2000013       -13   # BR(~chi_40 -> ~mu_R-    mu+)
     2.53616814E-02    2    -2000013        13   # BR(~chi_40 -> ~mu_R+    mu-)
     9.94109985E-02    2     1000015       -15   # BR(~chi_40 -> ~tau_1-   tau+)
     9.94109985E-02    2    -1000015        15   # BR(~chi_40 -> ~tau_1+   tau-)
     3.46335425E-05    2     1000012       -12   # BR(~chi_40 -> ~nu_eL    nu_eb)
     3.46335425E-05    2    -1000012        12   # BR(~chi_40 -> ~nu_eL*   nu_e )
     3.46335425E-05    2     1000014       -14   # BR(~chi_40 -> ~nu_muL   nu_mub)
     3.46335425E-05    2    -1000014        14   # BR(~chi_40 -> ~nu_muL*  nu_mu )
#
#         PDG            Width
DECAY        25     3.98854627E-03   # h decays
#          BR         NDA      ID1       ID2
     6.18359487E-01    2           5        -5   # BR(h -> b       bb     )
     6.48030631E-02    2         -15        15   # BR(h -> tau+    tau-   )
     2.29375665E-04    2         -13        13   # BR(h -> mu+     mu-    )
     2.50641375E-04    2           3        -3   # BR(h -> s       sb     )
     2.16081025E-02    2           4        -4   # BR(h -> c       cb     )
     7.82424242E-02    2          21        21   # BR(h -> g       g      )
     2.28514289E-03    2          22        22   # BR(h -> gam     gam    )
     1.43297185E-03    2          22        23   # BR(h -> Z       gam    )
     1.89537606E-01    2          24       -24   # BR(h -> W+      W-     )
     2.32511851E-02    2          23        23   # BR(h -> Z       Z      )
#
#         PDG            Width
DECAY        35     7.48627119E+01   # H decays
#          BR         NDA      ID1       ID2
     6.26164729E-01    2           5        -5   # BR(H -> b       bb     )
     1.10984364E-01    2         -15        15   # BR(H -> tau+    tau-   )
     3.88499543E-04    2         -13        13   # BR(H -> mu+     mu-    )
     2.14830334E-04    2           3        -3   # BR(H -> s       sb     )
     9.01967253E-09    2           4        -4   # BR(H -> c       cb     )
     8.82634598E-04    2           6        -6   # BR(H -> t       tb     )
     1.37774285E-05    2          21        21   # BR(H -> g       g      )
     3.10416580E-08    2          22        22   # BR(H -> gam     gam    )
     7.32062487E-09    2          23        22   # BR(H -> Z       gam    )
     5.31101905E-07    2          24       -24   # BR(H -> W+      W-     )
     2.64833945E-07    2          23        23   # BR(H -> Z       Z      )
     1.88627306E-06    2          25        25   # BR(H -> h       h      )
     3.63799307E-03    2     1000024  -1000024   # BR(H -> ~chi_1+ ~chi_1-)
     1.25496036E-04    2     1000037  -1000037   # BR(H -> ~chi_2+ ~chi_2-)
     8.53080878E-02    2     1000024  -1000037   # BR(H -> ~chi_1+ ~chi_2-)
     8.53080878E-02    2     1000037  -1000024   # BR(H -> ~chi_2+ ~chi_1-)
     1.11715323E-03    2     1000022   1000022   # BR(H -> ~chi_10 ~chi_10)
     1.82091630E-04    2     1000023   1000023   # BR(H -> ~chi_20 ~chi_20)
     6.25179164E-05    2     1000025   1000025   # BR(H -> ~chi_30 ~chi_30)
     2.85134974E-04    2     1000022   1000023   # BR(H -> ~chi_10 ~chi_20)
     3.14490352E-02    2     1000022   1000025   # BR(H -> ~chi_10 ~chi_30)
     5.38725258E-02    2     1000023   1000025   # BR(H -> ~chi_20 ~chi_30)
     6.16256679E-08    2     2000002  -2000002   # BR(H -> ~u_R    ~u_R*  )
     6.16256679E-08    2     2000004  -2000004   # BR(H -> ~c_R    ~c_R*  )
     1.89479166E-07    2     1000015  -1000015   # BR(H -> ~tau_1- ~tau_1+)
#
#         PDG            Width
DECAY        36     7.48572666E+01   # A decays
#          BR         NDA      ID1       ID2
     6.26225392E-01    2           5        -5   # BR(A -> b       bb     )
     1.10992952E-01    2         -15        15   # BR(A -> tau+    tau-   )
     3.88528866E-04    2         -13        13   # BR(A -> mu+     mu-    )
     2.14856123E-04    2           3        -3   # BR(A -> s       sb     )
     9.04132924E-09    2           4        -4   # BR(A -> c       cb     )
     8.87448958E-04    2           6        -6   # BR(A -> t       tb     )
     2.61356854E-05    2          21        21   # BR(A -> g       g      )
     8.10758704E-08    2          22        22   # BR(A -> gam     gam    )
     1.73442791E-08    2          23        22   # BR(A -> Z       gam    )
     5.37472987E-07    2          23        25   # BR(A -> Z       h      )
     4.48394358E-03    2     1000024  -1000024   # BR(A -> ~chi_1+ ~chi_1-)
     5.91487787E-04    2     1000037  -1000037   # BR(A -> ~chi_2+ ~chi_2-)
     8.46175554E-02    2     1000024  -1000037   # BR(A -> ~chi_1+ ~chi_2-)
     8.46175554E-02    2     1000037  -1000024   # BR(A -> ~chi_2+ ~chi_1-)
     1.44798772E-03    2     1000022   1000022   # BR(A -> ~chi_10 ~chi_10)
     1.94397113E-04    2     1000023   1000023   # BR(A -> ~chi_20 ~chi_20)
     2.93951303E-04    2     1000025   1000025   # BR(A -> ~chi_30 ~chi_30)
     1.92886301E-04    2     1000022   1000023   # BR(A -> ~chi_10 ~chi_20)
     5.33809860E-02    2     1000022   1000025   # BR(A -> ~chi_10 ~chi_30)
     3.14432910E-02    2     1000023   1000025   # BR(A -> ~chi_20 ~chi_30)
#
#         PDG            Width
DECAY        37     7.27609724E+01   # H+ decays
#          BR         NDA      ID1       ID2
     1.03588399E-03    2           4        -5   # BR(H+ -> c       bb     )
     1.14252655E-01    2         -15        16   # BR(H+ -> tau+    nu_tau )
     3.99939401E-04    2         -13        14   # BR(H+ -> mu+     nu_mu  )
     1.03588233E-05    2           2        -5   # BR(H+ -> u       bb     )
     1.10542075E-05    2           2        -3   # BR(H+ -> u       sb     )
     2.17589259E-04    2           4        -3   # BR(H+ -> c       sb     )
     6.15843805E-01    2           6        -5   # BR(H+ -> t       bb     )
     5.54338639E-07    2          24        25   # BR(H+ -> W+      h      )
     9.29490249E-14    2          24        36   # BR(H+ -> W+      A      )
     8.23112329E-05    2     1000024   1000022   # BR(H+ -> ~chi_1+ ~chi_10)
     1.01643855E-03    2     1000024   1000023   # BR(H+ -> ~chi_1+ ~chi_20)
     8.89983601E-02    2     1000024   1000025   # BR(H+ -> ~chi_1+ ~chi_30)
     9.01966733E-02    2     1000037   1000022   # BR(H+ -> ~chi_2+ ~chi_10)
     8.79343750E-02    2     1000037   1000023   # BR(H+ -> ~chi_2+ ~chi_20)
     2.02227619E-09    2     1000037   1000025   # BR(H+ -> ~chi_2+ ~chi_30)
