#
#                              ======================
#                              | THE SUSYHIT OUTPUT |
#                              ======================
#
#
#              ------------------------------------------------------
#              |     This is the output of the SUSY-HIT package     |
#              |  created by A.Djouadi, M.Muehlleitner and M.Spira. |
#              |  In case of problems with SUSY-HIT email to        |
#              |           margarete.muehlleitner@cern.ch           |
#              |           michael.spira@psi.ch                     |
#              |           abdelhak.djouadi@cern.ch                 |
#              ------------------------------------------------------
#
#              ------------------------------------------------------
#              |  SUSY Les Houches Accord - MSSM Spectrum + Decays  |
#              |              based on the decay programs           |
#              |                                                    |
#              |                     SDECAY 1.3b                    |
#              |                                                    |
#              |  Authors: M.Muhlleitner, A.Djouadi and Y.Mambrini  |
#              |  Ref.:    Comput.Phys.Commun.168(2005)46           |
#              |           [hep-ph/0311167]                         |
#              |                                                    |
#              |                     HDECAY 3.4                     |
#              |                                                    |
#              |  By: A.Djouadi,J.Kalinowski,M.Muhlleitner,M.Spira  |
#              |  Ref.:    Comput.Phys.Commun.108(1998)56           |
#              |           [hep-ph/9704448]                         |
#              |                                                    |
#              |                                                    |
#              |  If not stated otherwise all DRbar couplings and   |
#              |  soft SUSY breaking masses are given at the scale  |
#              |  Q=  0.20102980E+04
#              |                                                    |
#              ------------------------------------------------------
#
#
BLOCK DCINFO  # Decay Program information
     1   SDECAY/HDECAY # decay calculator
     2   1.3b  /3.4    # version number
#
BLOCK SPINFO  # Spectrum calculator information
     1     SOFTSUSY    # spectrum calculator               
     2     3.4.0       # version number                    
#
BLOCK MODSEL  # Model selection
     1     0   #  nonUniversal                                     
#
BLOCK SMINPUTS  # Standard Model inputs
         1     1.27908970E+02   # alpha_em^-1(M_Z)^MSbar
         2     1.16637870E-05   # G_F [GeV^-2]
         3     1.18400000E-01   # alpha_S(M_Z)^MSbar
         4     9.11876000E+01   # M_Z pole mass
         5     4.18000000E+00   # mb(mb)^MSbar
         6     1.73200000E+02   # mt pole mass
         7     1.77700000E+00   # mtau pole mass
#
BLOCK MINPAR  # Input parameters - minimal models
         3     1.13900000E+01   # tanb                
#
BLOCK EXTPAR  # Input parameters - non-minimal models
         0    -1.00000000E+00   # Set                 
         1    -9.87530000E+02   # M_1(MX)             
         2     4.14080000E+02   # M_2(MX)             
         3     2.46342000E+03   # M_3(MX)             
        11    -3.88511000E+03   # At(MX)              
        12     3.84525000E+03   # Ab(MX)              
        13     1.74698000E+03   # Atau(MX)            
        23     3.95918000E+03   # mu(MX)              
        26     1.34618000E+03   # mA(pole)            
        31     8.78080000E+02   # meL(MX)             
        32     8.78080000E+02   # mmuL(MX)            
        33     2.18045000E+03   # mtauL(MX)           
        34     9.46900000E+02   # meR(MX)             
        35     9.46900000E+02   # mmuR(MX)            
        36     2.88780000E+03   # mtauR(MX)           
        41     6.65260000E+02   # mqL1(MX)            
        42     6.65260000E+02   # mqL2(MX)            
        43     2.57866000E+03   # mqL3(MX)            
        44     2.10680000E+03   # muR(MX)             
        45     2.10680000E+03   # mcR(MX)             
        46     1.57642000E+03   # mtR(MX)             
        47     1.79952000E+03   # mdR(MX)             
        48     1.79952000E+03   # msR(MX)             
        49     2.90072000E+03   # mbR(MX)             
#
BLOCK MASS  # Mass Spectrum
# PDG code           mass       particle
        24     8.03753746E+01   # W+
        25     1.26971947E+02   # h
        35     1.34561371E+03   # H
        36     1.34617902E+03   # A
        37     1.34860912E+03   # H+
         5     4.81876030E+00   # b-quark pole mass calculated from mb(mb)_Msbar
   1000001     7.88212763E+02   # ~d_L
   2000001     1.88138918E+03   # ~d_R
   1000002     7.84413325E+02   # ~u_L
   2000002     2.18208434E+03   # ~u_R
   1000003     7.88212763E+02   # ~s_L
   2000003     1.88138918E+03   # ~s_R
   1000004     7.84413325E+02   # ~c_L
   2000004     2.18208434E+03   # ~c_R
   1000005     2.59108155E+03   # ~b_1
   2000005     2.95608700E+03   # ~b_2
   1000006     1.56458412E+03   # ~t_1
   2000006     2.61212873E+03   # ~t_2
   1000011     8.81131703E+02   # ~e_L
   2000011     9.58709971E+02   # ~e_R
   1000012     8.77479661E+02   # ~nu_eL
   1000013     8.81131703E+02   # ~mu_L
   2000013     9.58709971E+02   # ~mu_R
   1000014     8.77479661E+02   # ~nu_muL
   1000015     2.18342004E+03   # ~tau_1
   2000015     2.89134497E+03   # ~tau_2
   1000016     2.18208932E+03   # ~nu_tauL
   1000021     2.51360738E+03   # ~g
   1000022     4.30162421E+02   # ~chi_10
   1000023    -9.77223641E+02   # ~chi_20
   1000025     3.97566643E+03   # ~chi_30
   1000035    -3.97624059E+03   # ~chi_40
   1000024     4.30326630E+02   # ~chi_1+
   1000037     3.97682375E+03   # ~chi_2+
#
BLOCK NMIX  # Neutralino Mixing Matrix
  1  1     2.17404168E-04   # N_11
  1  2     9.99800518E-01   # N_12
  1  3    -1.95570057E-02   # N_13
  1  4     4.04986480E-03   # N_14
  2  1     9.99930035E-01   # N_21
  2  2     4.42390932E-06   # N_22
  2  3     1.17010614E-02   # N_23
  2  4     1.73480862E-03   # N_24
  3  1    -7.04568760E-03   # N_31
  3  2     1.66936294E-02   # N_32
  3  3     7.06921684E-01   # N_33
  3  4    -7.07059696E-01   # N_34
  4  1    -9.49923370E-03   # N_41
  4  2     1.09657584E-02   # N_42
  4  3     7.06924565E-01   # N_43
  4  4     7.07140138E-01   # N_44
#
BLOCK UMIX  # Chargino Mixing Matrix U
  1  1     9.99617467E-01   # U_11
  1  2    -2.76571832E-02   # U_12
  2  1     2.76571832E-02   # U_21
  2  2     9.99617467E-01   # U_22
#
BLOCK VMIX  # Chargino Mixing Matrix V
  1  1     9.99983586E-01   # V_11
  1  2    -5.72953447E-03   # V_12
  2  1     5.72953447E-03   # V_21
  2  2     9.99983586E-01   # V_22
#
BLOCK STOPMIX  # Stop Mixing Matrix
  1  1     1.41739614E-01   # cos(theta_t)
  1  2     9.89903976E-01   # sin(theta_t)
  2  1    -9.89903976E-01   # -sin(theta_t)
  2  2     1.41739614E-01   # cos(theta_t)
#
BLOCK SBOTMIX  # Sbottom Mixing Matrix
  1  1     9.99092379E-01   # cos(theta_b)
  1  2     4.25959884E-02   # sin(theta_b)
  2  1    -4.25959884E-02   # -sin(theta_b)
  2  2     9.99092379E-01   # cos(theta_b)
#
BLOCK STAUMIX  # Stau Mixing Matrix
  1  1     9.99784120E-01   # cos(theta_tau)
  1  2     2.07777139E-02   # sin(theta_tau)
  2  1    -2.07777139E-02   # -sin(theta_tau)
  2  2     9.99784120E-01   # cos(theta_tau)
#
BLOCK ALPHA  # Higgs mixing
          -9.22806976E-02   # Mixing angle in the neutral Higgs boson sector
#
BLOCK HMIX Q=  2.01029800E+03  # DRbar Higgs Parameters
         1     4.00366997E+03   # mu(Q)MSSM           
         2     1.09245869E+01   # tan                 
         3     2.43640395E+02   # higgs               
         4     1.82045237E+06   # mA^2(Q)MSSM         
#
BLOCK GAUGE Q=  2.01029800E+03  # The gauge couplings
     1     3.63711427E-01   # gprime(Q) DRbar
     2     6.39785355E-01   # g(Q) DRbar
     3     1.02640602E+00   # g3(Q) DRbar
#
BLOCK AU Q=  2.01029800E+03  # The trilinear couplings
  1  1     0.00000000E+00   # A_u(Q) DRbar
  2  2     0.00000000E+00   # A_c(Q) DRbar
  3  3    -3.88510999E+03   # A_t(Q) DRbar
#
BLOCK AD Q=  2.01029800E+03  # The trilinear couplings
  1  1     0.00000000E+00   # A_d(Q) DRbar
  2  2     0.00000000E+00   # A_s(Q) DRbar
  3  3     3.84525000E+03   # A_b(Q) DRbar
#
BLOCK AE Q=  2.01029800E+03  # The trilinear couplings
  1  1     0.00000000E+00   # A_e(Q) DRbar
  2  2     0.00000000E+00   # A_mu(Q) DRbar
  3  3     1.74698000E+03   # A_tau(Q) DRbar
#
BLOCK Yu Q=  2.01029800E+03  # The Yukawa couplings
  1  1     0.00000000E+00   # y_u(Q) DRbar
  2  2     0.00000000E+00   # y_c(Q) DRbar
  3  3     8.21689589E-01   # y_t(Q) DRbar
#
BLOCK Yd Q=  2.01029800E+03  # The Yukawa couplings
  1  1     0.00000000E+00   # y_d(Q) DRbar
  2  2     0.00000000E+00   # y_s(Q) DRbar
  3  3     1.38191097E-01   # y_b(Q) DRbar
#
BLOCK Ye Q=  2.01029800E+03  # The Yukawa couplings
  1  1     0.00000000E+00   # y_e(Q) DRbar
  2  2     0.00000000E+00   # y_mu(Q) DRbar
  3  3     1.13308447E-01   # y_tau(Q) DRbar
#
BLOCK MSOFT Q=  2.01029800E+03  # The soft SUSY breaking masses at the scale Q
         1    -9.87530000E+02   # M_1(Q)              
         2     4.14080000E+02   # M_2(Q)              
         3     2.46342000E+03   # M_3(Q)              
        21    -1.41994141E+07   # mH1^2(Q)            
        22    -1.59022092E+07   # mH2^2(Q)            
        31     8.78080000E+02   # meL(Q)              
        32     8.78080000E+02   # mmuL(Q)             
        33     2.18045000E+03   # mtauL(Q)            
        34     9.46900000E+02   # meR(Q)              
        35     9.46900000E+02   # mmuR(Q)             
        36     2.88780000E+03   # mtauR(Q)            
        41     6.65259985E+02   # mqL1(Q)             
        42     6.65259985E+02   # mqL2(Q)             
        43     2.57865999E+03   # mqL3(Q)             
        44     2.10680000E+03   # muR(Q)              
        45     2.10680000E+03   # mcR(Q)              
        46     1.57641998E+03   # mtR(Q)              
        47     1.79951999E+03   # mdR(Q)              
        48     1.79951999E+03   # msR(Q)              
        49     2.90072000E+03   # mbR(Q)              
#
Block HiggsBoundsInputHiggsCouplingsFermions
# ScalarNormEffCoupSq PseudoSNormEffCoupSq NP   IP1 IP2 IP2
    1.02193302E+00    0.00000000E+00        3  25   5   5  # h0-b-b eff. coupling^2, normalised to SM
    1.19324666E+02    0.00000000E+00        3  35   5   5  # H0-b-b eff. coupling^2, normalised to SM
    0.00000000E+00    1.19346599E+02        3  36   5   5  # A0-b-b eff. coupling^2, normalised to SM
#
    9.99816224E-01    0.00000000E+00        3  25   6   6  # h0-t-t eff. coupling^2, normalised to SM
    8.56273264E-03    0.00000000E+00        3  35   6   6  # H0-t-t eff. coupling^2, normalised to SM
    0.00000000E+00    8.37895683E-03        3  36   6   6  # A0-t-t eff. coupling^2, normalised to SM
#
    1.02193302E+00    0.00000000E+00        3  25  15  15  # h0-tau-tau eff. coupling^2, normalised to SM
    1.19324666E+02    0.00000000E+00        3  35  15  15  # H0-tau-tau eff. coupling^2, normalised to SM
    0.00000000E+00    1.19346599E+02        3  36  15  15  # A0-tau-tau eff. coupling^2, normalised to SM
#
Block HiggsBoundsInputHiggsCouplingsBosons
    9.99999003E-01        3  25  24  24  # h0-W-W eff. coupling^2, normalised to SM
    9.96879049E-07        3  35  24  24  # H0-W-W eff. coupling^2, normalised to SM
    0.00000000E+00        3  36  24  24  # A0-W-W eff. coupling^2, normalised to SM
#
    9.99999003E-01        3  25  23  23  # h0-Z-Z eff. coupling^2, normalised to SM
    9.96879049E-07        3  35  23  23  # H0-Z-Z eff. coupling^2, normalised to SM
    0.00000000E+00        3  36  23  23  # A0-Z-Z eff. coupling^2, normalised to SM
#
    8.76300835E-01        3  25  21  21  # h0-g-g eff. coupling^2, normalised to SM
    9.20177870E-09        3  35  21  21  # H0-g-g eff. coupling^2, normalised to SM
    8.20460649E-08        3  36  21  21  # A0-g-g eff. coupling^2, normalised to SM
#
    0.00000000E+00        3  25  25  23  # h0-h0-Z eff. coupling^2, normalised to SM
    0.00000000E+00        3  35  25  23  # H0-h0-Z eff. coupling^2, normalised to SM
    9.96879049E-07        3  36  25  23  # A0-h0-Z eff. coupling^2, normalised to SM
    0.00000000E+00        3  35  35  23  # H0-H0-Z eff. coupling^2, normalised to SM
    9.99999003E-01        3  36  35  23  # A0-H0-Z eff. coupling^2, normalised to SM
    0.00000000E+00        3  36  36  23  # A0-A0-Z eff. coupling^2, normalised to SM
#
    0.00000000E+00        4  25  21  21  23  # h0-g-g-Z eff. coupling^2, normalised to SM
    0.00000000E+00        4  35  21  21  23  # H0-g-g-Z eff. coupling^2, normalised to SM
    0.00000000E+00        4  36  21  21  23  # A0-g-g-Z eff. coupling^2, normalised to SM
#
#
#
#                             =================
#                             |The decay table|
#                             =================
#
# - The QCD corrections to the decays gluino -> squark  + quark
#                                     squark -> gaugino + quark_prime
#                                     squark -> squark_prime + Higgs
#                                     squark -> gluino  + quark
#   are included.
#
# - The multi-body decays for the inos, stops and sbottoms are included.
#
# - The loop induced decays for the gluino, neutralinos and stops
#   are included.
#
# - The SUSY decays of the top quark are included.
#
#
#         PDG            Width
DECAY         6     1.44223354E+00   # top decays
#          BR         NDA      ID1       ID2
     1.00000000E+00    2           5        24   # BR(t ->  b    W+)
#
#         PDG            Width
DECAY   1000021     2.10498527E+02   # gluino decays
#          BR         NDA      ID1       ID2
     9.88093649E-02    2     1000001        -1   # BR(~g -> ~d_L  db)
     9.88093649E-02    2    -1000001         1   # BR(~g -> ~d_L* d )
     2.35052823E-02    2     2000001        -1   # BR(~g -> ~d_R  db)
     2.35052823E-02    2    -2000001         1   # BR(~g -> ~d_R* d )
     9.90167410E-02    2     1000002        -2   # BR(~g -> ~u_L  ub)
     9.90167410E-02    2    -1000002         2   # BR(~g -> ~u_L* u )
     7.37803976E-03    2     2000002        -2   # BR(~g -> ~u_R  ub)
     7.37803976E-03    2    -2000002         2   # BR(~g -> ~u_R* u )
     9.88093649E-02    2     1000003        -3   # BR(~g -> ~s_L  sb)
     9.88093649E-02    2    -1000003         3   # BR(~g -> ~s_L* s )
     2.35052823E-02    2     2000003        -3   # BR(~g -> ~s_R  sb)
     2.35052823E-02    2    -2000003         3   # BR(~g -> ~s_R* s )
     9.90167311E-02    2     1000004        -4   # BR(~g -> ~c_L  cb)
     9.90167311E-02    2    -1000004         4   # BR(~g -> ~c_L* c )
     7.37796334E-03    2     2000004        -4   # BR(~g -> ~c_R  cb)
     7.37796334E-03    2    -2000004         4   # BR(~g -> ~c_R* c )
     4.25812305E-02    2     1000006        -6   # BR(~g -> ~t_1  tb)
     4.25812305E-02    2    -1000006         6   # BR(~g -> ~t_1* t )
#
#         PDG            Width
DECAY   1000006     1.58260101E+00   # stop1 decays
#          BR         NDA      ID1       ID2
     7.41313810E-02    2     1000022         6   # BR(~t_1 -> ~chi_10 t )
     7.73114015E-01    2     1000023         6   # BR(~t_1 -> ~chi_20 t )
     1.52754604E-01    2     1000024         5   # BR(~t_1 -> ~chi_1+ b )
#
#         PDG            Width
DECAY   2000006     8.65239839E+01   # stop2 decays
#          BR         NDA      ID1       ID2
     1.12645480E-01    2     1000022         6   # BR(~t_2 -> ~chi_10 t )
     4.45949956E-03    2     1000023         6   # BR(~t_2 -> ~chi_20 t )
     0.00000000E+00    2     1000025         6   # BR(~t_2 -> ~chi_30 t )
     2.27521796E-01    2     1000024         5   # BR(~t_2 -> ~chi_1+ b )
     3.13165002E-01    2     1000006        25   # BR(~t_2 -> ~t_1    h )
     3.42208222E-01    2     1000006        23   # BR(~t_2 -> ~t_1    Z )
#
#         PDG            Width
DECAY   1000005     8.63113773E+01   # sbottom1 decays
#          BR         NDA      ID1       ID2
     1.15382129E-01    2     1000022         5   # BR(~b_1 -> ~chi_10 b )
     3.26409011E-03    2     1000023         5   # BR(~b_1 -> ~chi_20 b )
     2.28444011E-01    2    -1000024         6   # BR(~b_1 -> ~chi_1- t )
     5.84076206E-03    2     1000021         5   # BR(~b_1 -> ~g      b )
     6.47069009E-01    2     1000006       -24   # BR(~b_1 -> ~t_1    W-)
#
#         PDG            Width
DECAY   2000005     1.49317550E+01   # sbottom2 decays
#          BR         NDA      ID1       ID2
     1.03558395E-03    2     1000022         5   # BR(~b_2 -> ~chi_10 b )
     9.16145193E-02    2     1000023         5   # BR(~b_2 -> ~chi_20 b )
     2.05500968E-03    2    -1000024         6   # BR(~b_2 -> ~chi_1- t )
     8.47983081E-01    2     1000021         5   # BR(~b_2 -> ~g      b )
     1.23065115E-02    2     1000005        25   # BR(~b_2 -> ~b_1    h )
     4.56868548E-05    2     1000006       -37   # BR(~b_2 -> ~t_1    H-)
     1.14584575E-02    2     1000005        23   # BR(~b_2 -> ~b_1    Z )
     1.47454531E-02    2     1000006       -24   # BR(~b_2 -> ~t_1    W-)
     1.87556971E-02    2     2000006       -24   # BR(~b_2 -> ~t_2    W-)
#
#         PDG            Width
DECAY   1000002     4.87918479E+00   # sup_L decays
#          BR         NDA      ID1       ID2
     3.33415307E-01    2     1000022         2   # BR(~u_L -> ~chi_10 u)
     6.66584693E-01    2     1000024         1   # BR(~u_L -> ~chi_1+ d)
#
#         PDG            Width
DECAY   2000002     3.21148629E+00   # sup_R decays
#          BR         NDA      ID1       ID2
     6.80757470E-08    2     1000022         2   # BR(~u_R -> ~chi_10 u)
     9.99999932E-01    2     1000023         2   # BR(~u_R -> ~chi_20 u)
#
#         PDG            Width
DECAY   1000001     4.93944743E+00   # sdown_L decays
#          BR         NDA      ID1       ID2
     3.33539477E-01    2     1000022         1   # BR(~d_L -> ~chi_10 d)
     6.66460523E-01    2    -1000024         2   # BR(~d_L -> ~chi_1- u)
#
#         PDG            Width
DECAY   2000001     5.84616637E-01   # sdown_R decays
#          BR         NDA      ID1       ID2
     7.92779387E-08    2     1000022         1   # BR(~d_R -> ~chi_10 d)
     9.99999921E-01    2     1000023         1   # BR(~d_R -> ~chi_20 d)
#
#         PDG            Width
DECAY   1000004     4.68250178E+00   # scharm_L decays
#          BR         NDA      ID1       ID2
     3.33412715E-01    2     1000022         4   # BR(~c_L -> ~chi_10 c)
     6.66587285E-01    2     1000024         3   # BR(~c_L -> ~chi_1+ s)
#
#         PDG            Width
DECAY   2000004     3.26192026E+00   # scharm_R decays
#          BR         NDA      ID1       ID2
     6.83277211E-08    2     1000022         4   # BR(~c_R -> ~chi_10 c)
     9.99999932E-01    2     1000023         4   # BR(~c_R -> ~chi_20 c)
#
#         PDG            Width
DECAY   1000003     4.74163309E+00   # sstrange_L decays
#          BR         NDA      ID1       ID2
     3.33542825E-01    2     1000022         3   # BR(~s_L -> ~chi_10 s)
     6.66457175E-01    2    -1000024         4   # BR(~s_L -> ~chi_1- c)
#
#         PDG            Width
DECAY   2000003     5.86599156E-01   # sstrange_R decays
#          BR         NDA      ID1       ID2
     7.96283351E-08    2     1000022         3   # BR(~s_R -> ~chi_10 s)
     9.99999920E-01    2     1000023         3   # BR(~s_R -> ~chi_20 s)
#
#         PDG            Width
DECAY   1000011     6.23849478E+00   # selectron_L decays
#          BR         NDA      ID1       ID2
     3.33575904E-01    2     1000022        11   # BR(~e_L -> ~chi_10 e-)
     6.66424096E-01    2    -1000024        12   # BR(~e_L -> ~chi_1- nu_e)
#
#         PDG            Width
DECAY   2000011     1.71936242E-05   # selectron_R decays
#           BR         NDA      ID1       ID2
     8.84857667E-03    2     1000022        11   # BR(~e_R -> ~chi_10 e-)
#           BR         NDA      ID1       ID2       ID3
     1.07848117E-01    3        11       -1        1000001   # BR(~e_R- -> e-  db  ~d_L)
     9.16444364E-02    3        11       1        -1000001   # BR(~e_R- -> e-  d  ~d_L*)
     1.16770029E-01    3        11       -2        1000002   # BR(~e_R- -> e-  ub  ~u_L)
     9.88971249E-02    3        11       2        -1000002   # BR(~e_R- -> e-  u  ~u_L*)
     1.10506079E-01    3        11       -3        1000003   # BR(~e_R- -> e-  sb  ~s_L)
     9.22609440E-02    3        11       3        -1000003   # BR(~e_R- -> e-  s  ~s_L*)
     1.18788219E-01    3        11       -4        1000004   # BR(~e_R- -> e-  cb  ~c_L)
     1.00217382E-01    3        11       4        -1000004   # BR(~e_R- -> e-  c  ~c_L*)
     1.83754162E-02    3        11       -11        1000011   # BR(~e_R- -> e-  e+  ~e_L-)
     1.66282569E-02    3        11       11        -1000011   # BR(~e_R- -> e-  e-  ~e_L+)
     2.13974666E-02    3        11       -12        1000012   # BR(~e_R- -> e-  nu_eb  ~nu_eL)
     1.97497628E-02    3        11       12        -1000012   # BR(~e_R- -> e-  nu_e  ~nu_eL*)
     1.83544782E-02    3        11       -13        1000013   # BR(~e_R- -> e-  mu+  ~mu_L-)
     1.68847473E-02    3        11       13        -1000013   # BR(~e_R- -> e-  mu-  ~mu_L+)
     2.18639186E-02    3        11       -14        1000014   # BR(~e_R- -> e-  nu_mub  ~nu_muL)
     1.97549973E-02    3        11       14        -1000014   # BR(~e_R- -> e-  nu_mu  ~nu_muL*)
     1.34229990E-04    3        11       23        1000022   # BR(~e_R- -> e-  Z  ~chi_10)
     1.65916154E-04    3        11       25        1000022   # BR(~e_R- -> e-  h  ~chi_10)
     6.11796552E-04    3        11       -24        1000024   # BR(~e_R- -> e-  W-  ~chi_1+)
     2.98104689E-04    3        11       24        -1000024   # BR(~e_R- -> e-  W+  ~chi_1-)
#
#         PDG            Width
DECAY   1000013     6.23849468E+00   # smuon_L decays
#          BR         NDA      ID1       ID2
     3.33575893E-01    2     1000022        13   # BR(~mu_L -> ~chi_10 mu-)
     6.66424107E-01    2    -1000024        14   # BR(~mu_L -> ~chi_1- nu_mu)
#
#         PDG            Width
DECAY   2000013     1.71668346E-05   # smuon_R decays
#           BR         NDA      ID1       ID2
     8.86238497E-03    2     1000022        13   # BR(~mu_R -> ~chi_10 mu-)
#           BR         NDA      ID1       ID2       ID3
     1.09332911E-01    3        13       -1        1000001   # BR(~mu_R- -> mu-  db  ~d_L)
     9.12981360E-02    3        13       1        -1000001   # BR(~mu_R- -> mu-  d  ~d_L*)
     1.17068758E-01    3        13       -2        1000002   # BR(~mu_R- -> mu-  ub  ~u_L)
     9.86087441E-02    3        13       2        -1000002   # BR(~mu_R- -> mu-  u  ~u_L*)
     1.09845527E-01    3        13       -3        1000003   # BR(~mu_R- -> mu-  sb  ~s_L)
     9.21020116E-02    3        13       3        -1000003   # BR(~mu_R- -> mu-  s  ~s_L*)
     1.17703703E-01    3        13       -4        1000004   # BR(~mu_R- -> mu-  cb  ~c_L)
     1.00414552E-01    3        13       4        -1000004   # BR(~mu_R- -> mu-  c  ~c_L*)
     1.83044811E-02    3        13       -11        1000011   # BR(~mu_R- -> mu-  e+  ~e_L-)
     1.69227471E-02    3        13       11        -1000011   # BR(~mu_R- -> mu-  e-  ~e_L+)
     2.16562930E-02    3        13       -12        1000012   # BR(~mu_R- -> mu-  nu_eb  ~nu_eL)
     1.97386419E-02    3        13       12        -1000012   # BR(~mu_R- -> mu-  nu_e  ~nu_eL*)
     1.83825386E-02    3        13       -13        1000013   # BR(~mu_R- -> mu-  mu+  ~mu_L-)
     1.66041094E-02    3        13       13        -1000013   # BR(~mu_R- -> mu-  mu-  ~mu_L+)
     2.21089099E-02    3        13       -14        1000014   # BR(~mu_R- -> mu-  nu_mub  ~nu_muL)
     1.98347574E-02    3        13       14        -1000014   # BR(~mu_R- -> mu-  nu_mu  ~nu_muL*)
     1.34223930E-04    3        13       23        1000022   # BR(~mu_R- -> mu-  Z  ~chi_10)
     1.65942066E-04    3        13       25        1000022   # BR(~mu_R- -> mu-  h  ~chi_10)
     6.12751287E-04    3        13       -24        1000024   # BR(~mu_R- -> mu-  W-  ~chi_1+)
     2.97876698E-04    3        13       24        -1000024   # BR(~mu_R- -> mu-  W+  ~chi_1-)
#
#         PDG            Width
DECAY   1000015     2.64595615E+01   # stau_1 decays
#          BR         NDA      ID1       ID2
     3.10299754E-01    2     1000022        15   # BR(~tau_1 -> ~chi_10  tau-)
     6.95314617E-02    2     1000023        15   # BR(~tau_1 -> ~chi_20  tau-)
     6.20168784E-01    2    -1000024        16   # BR(~tau_1 -> ~chi_1-  nu_tau)
#
#         PDG            Width
DECAY   2000015     1.29911940E+01   # stau_2 decays
#          BR         NDA      ID1       ID2
     2.18586987E-04    2     1000022        15   # BR(~tau_2 -> ~chi_10  tau-)
     9.18645258E-01    2     1000023        15   # BR(~tau_2 -> ~chi_20  tau-)
     4.36607093E-04    2    -1000024        16   # BR(~tau_2 -> ~chi_1-  nu_tau)
     3.95822344E-02    2     1000016       -24   # BR(~tau_2 -> ~nu_tauL W-)
     2.09965154E-02    2     1000015        25   # BR(~tau_2 -> ~tau_1   h)
     2.01207979E-02    2     1000015        23   # BR(~tau_2 -> ~tau_1   Z)
#
#         PDG            Width
DECAY   1000012     6.18222646E+00   # snu_eL decays
#          BR         NDA      ID1       ID2
     3.33304394E-01    2     1000022        12   # BR(~nu_eL -> ~chi_10 nu_e)
     6.66695606E-01    2     1000024        11   # BR(~nu_eL -> ~chi_1+ e-)
#
#         PDG            Width
DECAY   1000014     6.18222625E+00   # snu_muL decays
#          BR         NDA      ID1       ID2
     3.33304405E-01    2     1000022        14   # BR(~nu_muL -> ~chi_10 nu_mu)
     6.66695595E-01    2     1000024        13   # BR(~nu_muL -> ~chi_1+ mu-)
#
#         PDG            Width
DECAY   1000016     2.64509033E+01   # snu_tauL decays
#          BR         NDA      ID1       ID2
     3.10093035E-01    2     1000022        16   # BR(~nu_tauL -> ~chi_10 nu_tau)
     6.93666937E-02    2     1000023        16   # BR(~nu_tauL -> ~chi_20 nu_tau)
     6.20540271E-01    2     1000024        15   # BR(~nu_tauL -> ~chi_1+ tau-)
#
#         PDG            Width
DECAY   1000024     3.57055400E-15   # chargino1+ decays
#           BR         NDA      ID1       ID2       ID3
     1.95500510E-02    3     1000022       -11        12   # BR(~chi_1+ -> ~chi_10 e+   nu_e)
     2.19108450E-03    3     1000022       -13        14   # BR(~chi_1+ -> ~chi_10 mu+  nu_mu)
     9.78258860E-01    2     1000022       211             # BR(~chi_1+ -> ~chi_10 pi+)
#
#         PDG            Width
DECAY   1000037     1.30929291E+02   # chargino2+ decays
#          BR         NDA      ID1       ID2
     1.08062080E-05    2     1000002        -1   # BR(~chi_2+ -> ~u_L     db)
     2.51602927E-04    2    -1000001         2   # BR(~chi_2+ -> ~d_L*    u )
     1.08062080E-05    2     1000004        -3   # BR(~chi_2+ -> ~c_L     sb)
     2.51602924E-04    2    -1000003         4   # BR(~chi_2+ -> ~s_L*     c )
     4.28154682E-01    2     1000006        -5   # BR(~chi_2+ -> ~t_1     bb)
     9.66368267E-03    2     2000006        -5   # BR(~chi_2+ -> ~t_2     bb)
     2.00479117E-01    2    -1000005         6   # BR(~chi_2+ -> ~b_1*    t )
     3.33936637E-03    2    -2000005         6   # BR(~chi_2+ -> ~b_2*    t )
     3.67413396E-06    2     1000012       -11   # BR(~chi_2+ -> ~nu_eL   e+  )
     3.67413396E-06    2     1000014       -13   # BR(~chi_2+ -> ~nu_muL mu+ )
     1.89528146E-03    2     1000016       -15   # BR(~chi_2+ -> ~nu_tau1 tau+)
     8.55384432E-05    2    -1000011        12   # BR(~chi_2+ -> ~e_L+    nu_e)
     8.55384432E-05    2    -1000013        14   # BR(~chi_2+ -> ~mu_L+   nu_mu)
     3.46826762E-05    2    -1000015        16   # BR(~chi_2+ -> ~tau_1+  nu_tau)
     8.66560828E-04    2    -2000015        16   # BR(~chi_2+ -> ~tau_2+  nu_tau)
     5.98643631E-02    2     1000024        23   # BR(~chi_2+ -> ~chi_1+  Z )
     5.82757005E-02    2     1000022        24   # BR(~chi_2+ -> ~chi_10  W+)
     1.75554251E-02    2     1000023        24   # BR(~chi_2+ -> ~chi_20  W+)
     6.40651730E-02    2     1000024        25   # BR(~chi_2+ -> ~chi_1+  h )
     4.61318692E-02    2     1000024        35   # BR(~chi_2+ -> ~chi_1+  H )
     4.61460931E-02    2     1000024        36   # BR(~chi_2+ -> ~chi_1+  A )
     4.61668029E-02    2     1000022        37   # BR(~chi_2+ -> ~chi_10  H+)
     1.66579567E-02    2     1000023        37   # BR(~chi_2+ -> ~chi_20  H+)
#
#         PDG            Width
DECAY   1000022     0.00000000E+00   # neutralino1 decays
#
#         PDG            Width
DECAY   1000023     4.24050300E-01   # neutralino2 decays
#          BR         NDA      ID1       ID2
     2.00501427E-05    2     1000022        23   # BR(~chi_20 -> ~chi_10   Z )
     3.65677849E-05    2     1000024       -24   # BR(~chi_20 -> ~chi_1+   W-)
     3.65677849E-05    2    -1000024        24   # BR(~chi_20 -> ~chi_1-   W+)
     7.73249807E-06    2     1000022        25   # BR(~chi_20 -> ~chi_10   h )
     6.69201546E-02    2     1000002        -2   # BR(~chi_20 -> ~u_L      ub)
     6.69201546E-02    2    -1000002         2   # BR(~chi_20 -> ~u_L*     u )
     6.46126728E-02    2     1000001        -1   # BR(~chi_20 -> ~d_L      db)
     6.46126728E-02    2    -1000001         1   # BR(~chi_20 -> ~d_L*     d )
     6.69184088E-02    2     1000004        -4   # BR(~chi_20 -> ~c_L      cb)
     6.69184088E-02    2    -1000004         4   # BR(~chi_20 -> ~c_L*     c )
     6.46126728E-02    2     1000003        -3   # BR(~chi_20 -> ~s _L      sb)
     6.46126728E-02    2    -1000003         3   # BR(~chi_20 -> ~s _L*     s )
     5.30105352E-02    2     1000011       -11   # BR(~chi_20 -> ~e_L-     e+)
     5.30105352E-02    2    -1000011        11   # BR(~chi_20 -> ~e_L+     e-)
     8.54181087E-03    2     2000011       -11   # BR(~chi_20 -> ~e_R-     e+)
     8.54181087E-03    2    -2000011        11   # BR(~chi_20 -> ~e_R+     e-)
     5.30105352E-02    2     1000013       -13   # BR(~chi_20 -> ~mu_L-    mu+)
     5.30105352E-02    2    -1000013        13   # BR(~chi_20 -> ~mu_L+    mu-)
     8.54181087E-03    2     2000013       -13   # BR(~chi_20 -> ~mu_R-    mu+)
     8.54181087E-03    2    -2000013        13   # BR(~chi_20 -> ~mu_R+    mu-)
     5.68904699E-02    2     1000012       -12   # BR(~chi_20 -> ~nu_eL    nu_eb)
     5.68904699E-02    2    -1000012        12   # BR(~chi_20 -> ~nu_eL*   nu_e )
     5.68904699E-02    2     1000014       -14   # BR(~chi_20 -> ~nu_muL   nu_mub)
     5.68904699E-02    2    -1000014        14   # BR(~chi_20 -> ~nu_muL*  nu_mu )
#
#         PDG            Width
DECAY   1000025     1.30820545E+02   # neutralino3 decays
#          BR         NDA      ID1       ID2
     1.80555407E-02    2     1000022        23   # BR(~chi_30 -> ~chi_10   Z )
     1.16347730E-02    2     1000023        23   # BR(~chi_30 -> ~chi_20   Z )
     5.82720702E-02    2     1000024       -24   # BR(~chi_30 -> ~chi_1+   W-)
     5.82720702E-02    2    -1000024        24   # BR(~chi_30 -> ~chi_1-   W+)
     4.43025262E-02    2     1000022        25   # BR(~chi_30 -> ~chi_10   h )
     2.44278561E-02    2     1000022        35   # BR(~chi_30 -> ~chi_10   H )
     2.16104889E-02    2     1000022        36   # BR(~chi_30 -> ~chi_10   A )
     6.30294013E-03    2     1000023        25   # BR(~chi_30 -> ~chi_20   h )
     2.99014706E-03    2     1000023        35   # BR(~chi_30 -> ~chi_20   H )
     1.36944461E-02    2     1000023        36   # BR(~chi_30 -> ~chi_20   A )
     4.61266072E-02    2     1000024       -37   # BR(~chi_30 -> ~chi_1+   H-)
     4.61266072E-02    2    -1000024        37   # BR(~chi_30 -> ~chi_1-   H+)
     3.88430250E-05    2     1000002        -2   # BR(~chi_30 -> ~u_L      ub)
     3.88430250E-05    2    -1000002         2   # BR(~chi_30 -> ~u_L*     u )
     2.49992137E-06    2     2000002        -2   # BR(~chi_30 -> ~u_R      ub)
     2.49992137E-06    2    -2000002         2   # BR(~chi_30 -> ~u_R*     u )
     5.34825983E-05    2     1000001        -1   # BR(~chi_30 -> ~d_L      db)
     5.34825983E-05    2    -1000001         1   # BR(~chi_30 -> ~d_L*     d )
     7.69294984E-07    2     2000001        -1   # BR(~chi_30 -> ~d_R      db)
     7.69294984E-07    2    -2000001         1   # BR(~chi_30 -> ~d_R*     d )
     3.88430245E-05    2     1000004        -4   # BR(~chi_30 -> ~c_L      cb)
     3.88430245E-05    2    -1000004         4   # BR(~chi_30 -> ~c_L*     c )
     2.49992085E-06    2     2000004        -4   # BR(~chi_30 -> ~c_R      cb)
     2.49992085E-06    2    -2000004         4   # BR(~chi_30 -> ~c_R*     c )
     5.34825983E-05    2     1000003        -3   # BR(~chi_30 -> ~s _L      sb)
     5.34825983E-05    2    -1000003         3   # BR(~chi_30 -> ~s _L*     s )
     7.69294984E-07    2     2000003        -3   # BR(~chi_30 -> ~s _R      sb)
     7.69294984E-07    2    -2000003         3   # BR(~chi_30 -> ~s _R*     s )
     2.23584959E-01    2     1000006        -6   # BR(~chi_30 -> ~t_1      tb)
     2.23584959E-01    2    -1000006         6   # BR(~chi_30 -> ~t_1*     t )
     9.42471745E-02    2     2000006        -6   # BR(~chi_30 -> ~t_2      tb)
     9.42471745E-02    2    -2000006         6   # BR(~chi_30 -> ~t_2*     t )
     2.85946972E-03    2     1000005        -5   # BR(~chi_30 -> ~b_1      bb)
     2.85946972E-03    2    -1000005         5   # BR(~chi_30 -> ~b_1*     b )
     1.74375679E-03    2     2000005        -5   # BR(~chi_30 -> ~b_2      bb)
     1.74375679E-03    2    -2000005         5   # BR(~chi_30 -> ~b_2*     b )
     9.00587169E-06    2     1000011       -11   # BR(~chi_30 -> ~e_L-     e+)
     9.00587169E-06    2    -1000011        11   # BR(~chi_30 -> ~e_L+     e-)
     3.52198634E-06    2     2000011       -11   # BR(~chi_30 -> ~e_R-     e+)
     3.52198634E-06    2    -2000011        11   # BR(~chi_30 -> ~e_R+     e-)
     9.00587169E-06    2     1000013       -13   # BR(~chi_30 -> ~mu_L-    mu+)
     9.00587169E-06    2    -1000013        13   # BR(~chi_30 -> ~mu_L+    mu-)
     3.52198634E-06    2     2000013       -13   # BR(~chi_30 -> ~mu_R-    mu+)
     3.52198634E-06    2    -2000013        13   # BR(~chi_30 -> ~mu_R+    mu-)
     9.46135428E-04    2     1000015       -15   # BR(~chi_30 -> ~tau_1-   tau+)
     9.46135428E-04    2    -1000015        15   # BR(~chi_30 -> ~tau_1+   tau-)
     4.33304543E-04    2     2000015       -15   # BR(~chi_30 -> ~tau_2-   tau+)
     4.33304543E-04    2    -2000015        15   # BR(~chi_30 -> ~tau_2+   tau-)
     2.39880480E-05    2     1000012       -12   # BR(~chi_30 -> ~nu_eL    nu_eb)
     2.39880480E-05    2    -1000012        12   # BR(~chi_30 -> ~nu_eL*   nu_e )
     2.39880480E-05    2     1000014       -14   # BR(~chi_30 -> ~nu_muL   nu_mub)
     2.39880480E-05    2    -1000014        14   # BR(~chi_30 -> ~nu_muL*  nu_mu )
     1.29424952E-05    2     1000016       -16   # BR(~chi_30 -> ~nu_tau1  nu_taub)
     1.29424952E-05    2    -1000016        16   # BR(~chi_30 -> ~nu_tau1* nu_tau )
#
#         PDG            Width
DECAY   1000035     1.29999114E+02   # neutralino4 decays
#          BR         NDA      ID1       ID2
     4.21057893E-02    2     1000022        23   # BR(~chi_40 -> ~chi_10   Z )
     6.45559485E-03    2     1000023        23   # BR(~chi_40 -> ~chi_20   Z )
     5.86821461E-02    2     1000024       -24   # BR(~chi_40 -> ~chi_1+   W-)
     5.86821461E-02    2    -1000024        24   # BR(~chi_40 -> ~chi_1-   W+)
     1.99309752E-02    2     1000022        25   # BR(~chi_40 -> ~chi_10   h )
     2.18009766E-02    2     1000022        35   # BR(~chi_40 -> ~chi_10   H )
     2.46461423E-02    2     1000022        36   # BR(~chi_40 -> ~chi_10   A )
     1.19565805E-02    2     1000023        25   # BR(~chi_40 -> ~chi_20   h )
     1.38124467E-02    2     1000023        35   # BR(~chi_40 -> ~chi_20   H )
     3.01735751E-03    2     1000023        36   # BR(~chi_40 -> ~chi_20   A )
     4.64105676E-02    2     1000024       -37   # BR(~chi_40 -> ~chi_1+   H-)
     4.64105676E-02    2    -1000024        37   # BR(~chi_40 -> ~chi_1-   H+)
     1.39237283E-05    2     1000002        -2   # BR(~chi_40 -> ~u_L      ub)
     1.39237283E-05    2    -1000002         2   # BR(~chi_40 -> ~u_L*     u )
     4.57470477E-06    2     2000002        -2   # BR(~chi_40 -> ~u_R      ub)
     4.57470477E-06    2    -2000002         2   # BR(~chi_40 -> ~u_R*     u )
     2.69891246E-05    2     1000001        -1   # BR(~chi_40 -> ~d_L      db)
     2.69891246E-05    2    -1000001         1   # BR(~chi_40 -> ~d_L*     d )
     1.40764922E-06    2     2000001        -1   # BR(~chi_40 -> ~d_R      db)
     1.40764922E-06    2    -2000001         1   # BR(~chi_40 -> ~d_R*     d )
     1.39237281E-05    2     1000004        -4   # BR(~chi_40 -> ~c_L      cb)
     1.39237281E-05    2    -1000004         4   # BR(~chi_40 -> ~c_L*     c )
     4.57470382E-06    2     2000004        -4   # BR(~chi_40 -> ~c_R      cb)
     4.57470382E-06    2    -2000004         4   # BR(~chi_40 -> ~c_R*     c )
     2.69891246E-05    2     1000003        -3   # BR(~chi_40 -> ~s _L      sb)
     2.69891246E-05    2    -1000003         3   # BR(~chi_40 -> ~s _L*     s )
     1.40764922E-06    2     2000003        -3   # BR(~chi_40 -> ~s _R      sb)
     1.40764922E-06    2    -2000003         3   # BR(~chi_40 -> ~s _R*     s )
     2.14132502E-01    2     1000006        -6   # BR(~chi_40 -> ~t_1      tb)
     2.14132502E-01    2    -1000006         6   # BR(~chi_40 -> ~t_1*     t )
     1.02745564E-01    2     2000006        -6   # BR(~chi_40 -> ~t_2      tb)
     1.02745564E-01    2    -2000006         6   # BR(~chi_40 -> ~t_2*     t )
     2.87551580E-03    2     1000005        -5   # BR(~chi_40 -> ~b_1      bb)
     2.87551580E-03    2    -1000005         5   # BR(~chi_40 -> ~b_1*     b )
     1.75568837E-03    2     2000005        -5   # BR(~chi_40 -> ~b_2      bb)
     1.75568837E-03    2    -2000005         5   # BR(~chi_40 -> ~b_2*     b )
     1.74401351E-06    2     1000011       -11   # BR(~chi_40 -> ~e_L-     e+)
     1.74401351E-06    2    -1000011        11   # BR(~chi_40 -> ~e_L+     e-)
     6.44364800E-06    2     2000011       -11   # BR(~chi_40 -> ~e_R-     e+)
     6.44364800E-06    2    -2000011        11   # BR(~chi_40 -> ~e_R+     e-)
     1.74401351E-06    2     1000013       -13   # BR(~chi_40 -> ~mu_L-    mu+)
     1.74401351E-06    2    -1000013        13   # BR(~chi_40 -> ~mu_L+    mu-)
     6.44364800E-06    2     2000013       -13   # BR(~chi_40 -> ~mu_R-    mu+)
     6.44364800E-06    2    -2000013        13   # BR(~chi_40 -> ~mu_R+    mu-)
     9.49667387E-04    2     1000015       -15   # BR(~chi_40 -> ~tau_1-   tau+)
     9.49667387E-04    2    -1000015        15   # BR(~chi_40 -> ~tau_1+   tau-)
     4.36918882E-04    2     2000015       -15   # BR(~chi_40 -> ~tau_2-   tau+)
     4.36918882E-04    2    -2000015        15   # BR(~chi_40 -> ~tau_2+   tau-)
     1.50934948E-05    2     1000012       -12   # BR(~chi_40 -> ~nu_eL    nu_eb)
     1.50934948E-05    2    -1000012        12   # BR(~chi_40 -> ~nu_eL*   nu_e )
     1.50934948E-05    2     1000014       -14   # BR(~chi_40 -> ~nu_muL   nu_mub)
     1.50934948E-05    2    -1000014        14   # BR(~chi_40 -> ~nu_muL*  nu_mu )
     8.14532088E-06    2     1000016       -16   # BR(~chi_40 -> ~nu_tau1  nu_taub)
     8.14532088E-06    2    -1000016        16   # BR(~chi_40 -> ~nu_tau1* nu_tau )
#
#         PDG            Width
DECAY        25     4.66861259E-03   # h decays
#          BR         NDA      ID1       ID2
     5.96732789E-01    2           5        -5   # BR(h -> b       bb     )
     5.75261182E-02    2         -15        15   # BR(h -> tau+    tau-   )
     2.03571739E-04    2         -13        13   # BR(h -> mu+     mu-    )
     2.20360558E-04    2           3        -3   # BR(h -> s       sb     )
     1.88087324E-02    2           4        -4   # BR(h -> c       cb     )
     7.10894457E-02    2          21        21   # BR(h -> g       g      )
     2.16185497E-03    2          22        22   # BR(h -> gam     gam    )
     1.58877651E-03    2          22        23   # BR(h -> Z       gam    )
     2.23048958E-01    2          24       -24   # BR(h -> W+      W-     )
     2.86193922E-02    2          23        23   # BR(h -> Z       Z      )
#
#         PDG            Width
DECAY        35     2.73513768E+00   # H decays
#          BR         NDA      ID1       ID2
     6.94675713E-01    2           5        -5   # BR(H -> b       bb     )
     1.20205105E-01    2         -15        15   # BR(H -> tau+    tau-   )
     4.16848205E-04    2         -13        13   # BR(H -> mu+     mu-    )
     1.69966293E-04    2           3        -3   # BR(H -> s       sb     )
     1.93378195E-06    2           4        -4   # BR(H -> c       cb     )
     1.80578015E-01    2           6        -6   # BR(H -> t       tb     )
     1.71663797E-04    2          21        21   # BR(H -> g       g      )
     7.56640619E-07    2          22        22   # BR(H -> gam     gam    )
     1.98368396E-07    2          23        22   # BR(H -> Z       gam    )
     2.80313525E-04    2          24       -24   # BR(H -> W+      W-     )
     1.39132455E-04    2          23        23   # BR(H -> Z       Z      )
     1.28623600E-03    2          25        25   # BR(H -> h       h      )
     1.38263539E-03    2     1000024  -1000024   # BR(H -> ~chi_1+ ~chi_1-)
     6.91481944E-04    2     1000022   1000022   # BR(H -> ~chi_10 ~chi_10)
#
#         PDG            Width
DECAY        36     2.75275389E+00   # A decays
#          BR         NDA      ID1       ID2
     6.90796063E-01    2           5        -5   # BR(A -> b       bb     )
     1.19508959E-01    2         -15        15   # BR(A -> tau+    tau-   )
     4.14431962E-04    2         -13        13   # BR(A -> mu+     mu-    )
     1.69081144E-04    2           3        -3   # BR(A -> s       sb     )
     1.89807888E-06    2           4        -4   # BR(A -> c       cb     )
     1.84551222E-01    2           6        -6   # BR(A -> t       tb     )
     5.11739650E-04    2          21        21   # BR(A -> g       g      )
     1.27766930E-06    2          22        22   # BR(A -> gam     gam    )
     4.35592543E-07    2          23        22   # BR(A -> Z       gam    )
     2.78272539E-04    2          23        25   # BR(A -> Z       h      )
     2.51132487E-03    2     1000024  -1000024   # BR(A -> ~chi_1+ ~chi_1-)
     1.25529406E-03    2     1000022   1000022   # BR(A -> ~chi_10 ~chi_10)
#
#         PDG            Width
DECAY        37     2.45726983E+00   # H+ decays
#          BR         NDA      ID1       ID2
     1.12405399E-03    2           4        -5   # BR(H+ -> c       bb     )
     1.34121463E-01    2         -15        16   # BR(H+ -> tau+    nu_tau )
     4.65105048E-04    2         -13        14   # BR(H+ -> mu+     nu_mu  )
     1.12404450E-05    2           2        -5   # BR(H+ -> u       bb     )
     9.45925303E-06    2           2        -3   # BR(H+ -> u       sb     )
     1.88224202E-04    2           4        -3   # BR(H+ -> c       sb     )
     8.63765991E-01    2           6        -5   # BR(H+ -> t       bb     )
     3.14463506E-04    2          24        25   # BR(H+ -> W+      h      )
     4.52971712E-11    2          24        36   # BR(H+ -> W+      A      )
     8.45301809E-11    2     1000024   1000022   # BR(H+ -> ~chi_1+ ~chi_10)
