#
#                              ======================
#                              | THE SUSYHIT OUTPUT |
#                              ======================
#
#
#              ------------------------------------------------------
#              |     This is the output of the SUSY-HIT package     |
#              |  created by A.Djouadi, M.Muehlleitner and M.Spira. |
#              |  In case of problems with SUSY-HIT email to        |
#              |           margarete.muehlleitner@cern.ch           |
#              |           michael.spira@psi.ch                     |
#              |           abdelhak.djouadi@cern.ch                 |
#              ------------------------------------------------------
#
#              ------------------------------------------------------
#              |  SUSY Les Houches Accord - MSSM Spectrum + Decays  |
#              |              based on the decay programs           |
#              |                                                    |
#              |                     SDECAY 1.3b                    |
#              |                                                    |
#              |  Authors: M.Muhlleitner, A.Djouadi and Y.Mambrini  |
#              |  Ref.:    Comput.Phys.Commun.168(2005)46           |
#              |           [hep-ph/0311167]                         |
#              |                                                    |
#              |                     HDECAY 3.4                     |
#              |                                                    |
#              |  By: A.Djouadi,J.Kalinowski,M.Muhlleitner,M.Spira  |
#              |  Ref.:    Comput.Phys.Commun.108(1998)56           |
#              |           [hep-ph/9704448]                         |
#              |                                                    |
#              |                                                    |
#              |  If not stated otherwise all DRbar couplings and   |
#              |  soft SUSY breaking masses are given at the scale  |
#              |  Q=  0.39414620E+04
#              |                                                    |
#              ------------------------------------------------------
#
#
BLOCK DCINFO  # Decay Program information
     1   SDECAY/HDECAY # decay calculator
     2   1.3b  /3.4    # version number
#
BLOCK SPINFO  # Spectrum calculator information
     1     SOFTSUSY    # spectrum calculator               
     2     3.4.0       # version number                    
#
BLOCK MODSEL  # Model selection
     1     0   #  nonUniversal                                     
#
BLOCK SMINPUTS  # Standard Model inputs
         1     1.27908970E+02   # alpha_em^-1(M_Z)^MSbar
         2     1.16637870E-05   # G_F [GeV^-2]
         3     1.18400000E-01   # alpha_S(M_Z)^MSbar
         4     9.11876000E+01   # M_Z pole mass
         5     4.18000000E+00   # mb(mb)^MSbar
         6     1.73200000E+02   # mt pole mass
         7     1.77700000E+00   # mtau pole mass
#
BLOCK MINPAR  # Input parameters - minimal models
         3     6.42000000E+00   # tanb                
#
BLOCK EXTPAR  # Input parameters - non-minimal models
         0    -1.00000000E+00   # Set                 
         1    -6.54940000E+02   # M_1(MX)             
         2     1.99080000E+02   # M_2(MX)             
         3     2.25885000E+03   # M_3(MX)             
        11     3.87937000E+03   # At(MX)              
        12    -1.90506000E+03   # Ab(MX)              
        13    -1.81087000E+03   # Atau(MX)            
        23     1.95290000E+02   # mu(MX)              
        26     2.74040000E+03   # mA(pole)            
        31     3.70984000E+03   # meL(MX)             
        32     3.70984000E+03   # mmuL(MX)            
        33     3.25839000E+03   # mtauL(MX)           
        34     4.11000000E+02   # meR(MX)             
        35     4.11000000E+02   # mmuR(MX)            
        36     3.82444000E+03   # mtauR(MX)           
        41     8.71280000E+02   # mqL1(MX)            
        42     8.71280000E+02   # mqL2(MX)            
        43     3.88325000E+03   # mqL3(MX)            
        44     3.52648000E+03   # muR(MX)             
        45     3.52648000E+03   # mcR(MX)             
        46     3.99836000E+03   # mtR(MX)             
        47     3.49053000E+03   # mdR(MX)             
        48     3.49053000E+03   # msR(MX)             
        49     1.06719000E+03   # mbR(MX)             
#
BLOCK MASS  # Mass Spectrum
# PDG code           mass       particle
        24     8.03855675E+01   # W+
        25     1.24689448E+02   # h
        35     2.74062881E+03   # H
        36     2.74039987E+03   # A
        37     2.74195424E+03   # H+
         5     4.81876030E+00   # b-quark pole mass calculated from mb(mb)_Msbar
   1000001     1.09789261E+03   # ~d_L
   2000001     3.56638786E+03   # ~d_R
   1000002     1.09517052E+03   # ~u_L
   2000002     3.59336694E+03   # ~u_R
   1000003     1.09789261E+03   # ~s_L
   2000003     3.56638786E+03   # ~s_R
   1000004     1.09517052E+03   # ~c_L
   2000004     3.59336694E+03   # ~c_R
   1000005     1.26816592E+03   # ~b_1
   2000005     3.91609328E+03   # ~b_2
   1000006     3.87669631E+03   # ~t_1
   2000006     4.01499629E+03   # ~t_2
   1000011     3.71320551E+03   # ~e_L
   2000011     4.92910431E+02   # ~e_R
   1000012     3.71207384E+03   # ~nu_eL
   1000013     3.71320551E+03   # ~mu_L
   2000013     4.92910431E+02   # ~mu_R
   1000014     3.71207384E+03   # ~nu_muL
   1000015     3.26002857E+03   # ~tau_1
   2000015     3.83606578E+03   # ~tau_2
   1000016     3.25878877E+03   # ~nu_tauL
   1000021     2.45271016E+03   # ~g
   1000022     1.47127108E+02   # ~chi_10
   1000023    -2.07959009E+02   # ~chi_20
   1000025     2.74615324E+02   # ~chi_30
   1000035    -6.45505774E+02   # ~chi_40
   1000024     1.48903163E+02   # ~chi_1+
   1000037     2.76891125E+02   # ~chi_2+
#
BLOCK NMIX  # Neutralino Mixing Matrix
  1  1    -2.96701028E-02   # N_11
  1  2    -6.74807083E-01   # N_12
  1  3     5.79006170E-01   # N_13
  1  4    -4.56625602E-01   # N_14
  2  1     5.84841365E-02   # N_21
  2  2     1.11652680E-01   # N_22
  2  3     6.92957399E-01   # N_23
  2  4     7.09875572E-01   # N_24
  3  1    -2.79825853E-02   # N_31
  3  2     7.29473234E-01   # N_32
  3  3     4.29456471E-01   # N_33
  3  4    -5.31651121E-01   # N_34
  4  1     9.97454894E-01   # N_41
  4  2    -6.15462335E-03   # N_42
  4  3    -1.13594512E-02   # N_43
  4  4    -7.01200241E-02   # N_44
#
BLOCK UMIX  # Chargino Mixing Matrix U
  1  1    -6.07283827E-01   # U_11
  1  2     7.94484961E-01   # U_12
  2  1    -7.94484961E-01   # U_21
  2  2    -6.07283827E-01   # U_22
#
BLOCK VMIX  # Chargino Mixing Matrix V
  1  1    -7.65953247E-01   # V_11
  1  2     6.42896278E-01   # V_12
  2  1    -6.42896278E-01   # V_21
  2  2    -7.65953247E-01   # V_22
#
BLOCK STOPMIX  # Stop Mixing Matrix
  1  1     8.36128019E-01   # cos(theta_t)
  1  2    -5.48534352E-01   # sin(theta_t)
  2  1     5.48534352E-01   # -sin(theta_t)
  2  2     8.36128019E-01   # cos(theta_t)
#
BLOCK SBOTMIX  # Sbottom Mixing Matrix
  1  1     5.43584164E-04   # cos(theta_b)
  1  2     9.99999852E-01   # sin(theta_b)
  2  1    -9.99999852E-01   # -sin(theta_b)
  2  2     5.43584164E-04   # cos(theta_b)
#
BLOCK STAUMIX  # Stau Mixing Matrix
  1  1     9.99999159E-01   # cos(theta_tau)
  1  2     1.29691915E-03   # sin(theta_tau)
  2  1    -1.29691915E-03   # -sin(theta_tau)
  2  2     9.99999159E-01   # cos(theta_tau)
#
BLOCK ALPHA  # Higgs mixing
          -1.63569883E-01   # Mixing angle in the neutral Higgs boson sector
#
BLOCK HMIX Q=  3.94146200E+03  # DRbar Higgs Parameters
         1     1.98544791E+02   # mu(Q)MSSM           
         2     6.07812960E+00   # tan                 
         3     2.40071621E+02   # higgs               
         4     7.44255902E+06   # mA^2(Q)MSSM         
#
BLOCK GAUGE Q=  3.94146200E+03  # The gauge couplings
     1     3.66279288E-01   # gprime(Q) DRbar
     2     6.45137915E-01   # g(Q) DRbar
     3     1.01087116E+00   # g3(Q) DRbar
#
BLOCK AU Q=  3.94146200E+03  # The trilinear couplings
  1  1     0.00000000E+00   # A_u(Q) DRbar
  2  2     0.00000000E+00   # A_c(Q) DRbar
  3  3     3.87937002E+03   # A_t(Q) DRbar
#
BLOCK AD Q=  3.94146200E+03  # The trilinear couplings
  1  1     0.00000000E+00   # A_d(Q) DRbar
  2  2     0.00000000E+00   # A_s(Q) DRbar
  3  3    -1.90505999E+03   # A_b(Q) DRbar
#
BLOCK AE Q=  3.94146200E+03  # The trilinear couplings
  1  1     0.00000000E+00   # A_e(Q) DRbar
  2  2     0.00000000E+00   # A_mu(Q) DRbar
  3  3    -1.81087000E+03   # A_tau(Q) DRbar
#
BLOCK Yu Q=  3.94146200E+03  # The Yukawa couplings
  1  1     0.00000000E+00   # y_u(Q) DRbar
  2  2     0.00000000E+00   # y_c(Q) DRbar
  3  3     8.40375606E-01   # y_t(Q) DRbar
#
BLOCK Yd Q=  3.94146200E+03  # The Yukawa couplings
  1  1     0.00000000E+00   # y_d(Q) DRbar
  2  2     0.00000000E+00   # y_s(Q) DRbar
  3  3     8.15228945E-02   # y_b(Q) DRbar
#
BLOCK Ye Q=  3.94146200E+03  # The Yukawa couplings
  1  1     0.00000000E+00   # y_e(Q) DRbar
  2  2     0.00000000E+00   # y_mu(Q) DRbar
  3  3     6.33855033E-02   # y_tau(Q) DRbar
#
BLOCK MSOFT Q=  3.94146200E+03  # The soft SUSY breaking masses at the scale Q
         1    -6.54940000E+02   # M_1(Q)              
         2     1.99080000E+02   # M_2(Q)              
         3     2.25885000E+03   # M_3(Q)              
        21     7.29379311E+06   # mH1^2(Q)            
        22     5.27883919E+05   # mH2^2(Q)            
        31     3.70984000E+03   # meL(Q)              
        32     3.70984000E+03   # mmuL(Q)             
        33     3.25839000E+03   # mtauL(Q)            
        34     4.11000001E+02   # meR(Q)              
        35     4.11000001E+02   # mmuR(Q)             
        36     3.82444000E+03   # mtauR(Q)            
        41     8.71279972E+02   # mqL1(Q)             
        42     8.71279972E+02   # mqL2(Q)             
        43     3.88324999E+03   # mqL3(Q)             
        44     3.52647999E+03   # muR(Q)              
        45     3.52647999E+03   # mcR(Q)              
        46     3.99835999E+03   # mtR(Q)              
        47     3.49052999E+03   # mdR(Q)              
        48     3.49052999E+03   # msR(Q)              
        49     1.06718998E+03   # mbR(Q)              
#
Block HiggsBoundsInputHiggsCouplingsFermions
# ScalarNormEffCoupSq PseudoSNormEffCoupSq NP   IP1 IP2 IP2
    1.00616508E+00    0.00000000E+00        3  25   5   5  # h0-b-b eff. coupling^2, normalised to SM
    3.69374944E+01    0.00000000E+00        3  35   5   5  # H0-b-b eff. coupling^2, normalised to SM
    0.00000000E+00    3.69436594E+01        3  36   5   5  # A0-b-b eff. coupling^2, normalised to SM
#
    9.99833122E-01    0.00000000E+00        3  25   6   6  # h0-t-t eff. coupling^2, normalised to SM
    2.72351223E-02    0.00000000E+00        3  35   6   6  # H0-t-t eff. coupling^2, normalised to SM
    0.00000000E+00    2.70682443E-02        3  36   6   6  # A0-t-t eff. coupling^2, normalised to SM
#
    1.00616508E+00    0.00000000E+00        3  25  15  15  # h0-tau-tau eff. coupling^2, normalised to SM
    3.69374944E+01    0.00000000E+00        3  35  15  15  # H0-tau-tau eff. coupling^2, normalised to SM
    0.00000000E+00    3.69436594E+01        3  36  15  15  # A0-tau-tau eff. coupling^2, normalised to SM
#
Block HiggsBoundsInputHiggsCouplingsBosons
    9.99999744E-01        3  25  24  24  # h0-W-W eff. coupling^2, normalised to SM
    2.56435559E-07        3  35  24  24  # H0-W-W eff. coupling^2, normalised to SM
    0.00000000E+00        3  36  24  24  # A0-W-W eff. coupling^2, normalised to SM
#
    9.99999744E-01        3  25  23  23  # h0-Z-Z eff. coupling^2, normalised to SM
    2.56435559E-07        3  35  23  23  # H0-Z-Z eff. coupling^2, normalised to SM
    0.00000000E+00        3  36  23  23  # A0-Z-Z eff. coupling^2, normalised to SM
#
    8.90207191E-01        3  25  21  21  # h0-g-g eff. coupling^2, normalised to SM
    8.87089837E-12        3  35  21  21  # H0-g-g eff. coupling^2, normalised to SM
    2.42733521E-11        3  36  21  21  # A0-g-g eff. coupling^2, normalised to SM
#
    0.00000000E+00        3  25  25  23  # h0-h0-Z eff. coupling^2, normalised to SM
    0.00000000E+00        3  35  25  23  # H0-h0-Z eff. coupling^2, normalised to SM
    2.56435559E-07        3  36  25  23  # A0-h0-Z eff. coupling^2, normalised to SM
    0.00000000E+00        3  35  35  23  # H0-H0-Z eff. coupling^2, normalised to SM
    9.99999744E-01        3  36  35  23  # A0-H0-Z eff. coupling^2, normalised to SM
    0.00000000E+00        3  36  36  23  # A0-A0-Z eff. coupling^2, normalised to SM
#
    0.00000000E+00        4  25  21  21  23  # h0-g-g-Z eff. coupling^2, normalised to SM
    0.00000000E+00        4  35  21  21  23  # H0-g-g-Z eff. coupling^2, normalised to SM
    0.00000000E+00        4  36  21  21  23  # A0-g-g-Z eff. coupling^2, normalised to SM
#
#
#
#                             =================
#                             |The decay table|
#                             =================
#
# - The QCD corrections to the decays gluino -> squark  + quark
#                                     squark -> gaugino + quark_prime
#                                     squark -> squark_prime + Higgs
#                                     squark -> gluino  + quark
#   are included.
#
# - The multi-body decays for the inos, stops and sbottoms are included.
#
# - The loop induced decays for the gluino, neutralinos and stops
#   are included.
#
# - The SUSY decays of the top quark are included.
#
#
#         PDG            Width
DECAY         6     1.46600240E+00   # top decays
#          BR         NDA      ID1       ID2
     1.00000000E+00    2           5        24   # BR(t ->  b    W+)
#
#         PDG            Width
DECAY   1000021     1.58961312E+02   # gluino decays
#          BR         NDA      ID1       ID2
     1.04139056E-01    2     1000001        -1   # BR(~g -> ~d_L  db)
     1.04139056E-01    2    -1000001         1   # BR(~g -> ~d_L* d )
     1.04397689E-01    2     1000002        -2   # BR(~g -> ~u_L  ub)
     1.04397689E-01    2    -1000002         2   # BR(~g -> ~u_L* u )
     1.04139056E-01    2     1000003        -3   # BR(~g -> ~s_L  sb)
     1.04139056E-01    2    -1000003         3   # BR(~g -> ~s_L* s )
     1.04397662E-01    2     1000004        -4   # BR(~g -> ~c_L  cb)
     1.04397662E-01    2    -1000004         4   # BR(~g -> ~c_L* c )
     8.29265373E-02    2     1000005        -5   # BR(~g -> ~b_1  bb)
     8.29265373E-02    2    -1000005         5   # BR(~g -> ~b_1* b )
#
#         PDG            Width
DECAY   1000006     1.75138444E+02   # stop1 decays
#          BR         NDA      ID1       ID2
     4.76177687E-02    2     1000022         6   # BR(~t_1 -> ~chi_10 t )
     1.47061975E-01    2     1000023         6   # BR(~t_1 -> ~chi_20 t )
     1.81413628E-01    2     1000025         6   # BR(~t_1 -> ~chi_30 t )
     1.25787730E-02    2     1000035         6   # BR(~t_1 -> ~chi_40 t )
     7.27794395E-03    2     1000024         5   # BR(~t_1 -> ~chi_1+ b )
     2.14256167E-01    2     1000037         5   # BR(~t_1 -> ~chi_2+ b )
     3.89762448E-01    2     1000021         6   # BR(~t_1 -> ~g      t )
     3.12962569E-05    2     1000005        24   # BR(~t_1 -> ~b_1    W+)
#
#         PDG            Width
DECAY   2000006     2.08980528E+02   # stop2 decays
#          BR         NDA      ID1       ID2
     1.06844375E-01    2     1000022         6   # BR(~t_2 -> ~chi_10 t )
     1.43232026E-01    2     1000023         6   # BR(~t_2 -> ~chi_20 t )
     3.49420210E-02    2     1000025         6   # BR(~t_2 -> ~chi_30 t )
     3.70890066E-02    2     1000035         6   # BR(~t_2 -> ~chi_40 t )
     1.99611871E-01    2     1000024         5   # BR(~t_2 -> ~chi_1+ b )
     3.68244095E-02    2     1000037         5   # BR(~t_2 -> ~chi_2+ b )
     4.36695768E-01    2     1000021         6   # BR(~t_2 -> ~g      t )
     5.53818309E-04    2     1000006        25   # BR(~t_2 -> ~t_1    h )
     5.72389706E-06    2     1000005        37   # BR(~t_2 -> ~b_1    H+)
     2.82816638E-03    2     1000006        23   # BR(~t_2 -> ~t_1    Z )
     1.28498328E-05    2     1000005        24   # BR(~t_2 -> ~b_1    W+)
     1.35996416E-03    2     2000005        24   # BR(~t_2 -> ~b_2    W+)
#
#         PDG            Width
DECAY   1000005     7.26315146E-01   # sbottom1 decays
#          BR         NDA      ID1       ID2
     7.67457762E-02    2     1000022         5   # BR(~b_1 -> ~chi_10 b )
     1.08299583E-01    2     1000023         5   # BR(~b_1 -> ~chi_20 b )
     3.90242353E-02    2     1000025         5   # BR(~b_1 -> ~chi_30 b )
     5.65555473E-01    2     1000035         5   # BR(~b_1 -> ~chi_40 b )
     1.37201633E-01    2    -1000024         6   # BR(~b_1 -> ~chi_1- t )
     7.31732996E-02    2    -1000037         6   # BR(~b_1 -> ~chi_2- t )
#
#         PDG            Width
DECAY   2000005     1.82271218E+02   # sbottom2 decays
#          BR         NDA      ID1       ID2
     4.06623210E-02    2     1000022         5   # BR(~b_2 -> ~chi_10 b )
     2.25187587E-03    2     1000023         5   # BR(~b_2 -> ~chi_20 b )
     4.80768559E-02    2     1000025         5   # BR(~b_2 -> ~chi_30 b )
     3.19890512E-03    2     1000035         5   # BR(~b_2 -> ~chi_40 b )
     1.88460454E-01    2    -1000024         6   # BR(~b_2 -> ~chi_1- t )
     2.87135260E-01    2    -1000037         6   # BR(~b_2 -> ~chi_2- t )
     4.30170203E-01    2     1000021         5   # BR(~b_2 -> ~g      b )
     2.11898317E-05    2     1000005        25   # BR(~b_2 -> ~b_1    h )
     2.29354977E-05    2     1000005        23   # BR(~b_2 -> ~b_1    Z )
#
#         PDG            Width
DECAY   1000002     1.29008679E+01   # sup_L decays
#          BR         NDA      ID1       ID2
     1.59935914E-01    2     1000022         2   # BR(~u_L -> ~chi_10 u)
     5.01617312E-03    2     1000023         2   # BR(~u_L -> ~chi_20 u)
     1.65170748E-01    2     1000025         2   # BR(~u_L -> ~chi_30 u)
     5.11701043E-03    2     1000035         2   # BR(~u_L -> ~chi_40 u)
     4.04988648E-01    2     1000024         1   # BR(~u_L -> ~chi_1+ d)
     2.59771507E-01    2     1000037         1   # BR(~u_L -> ~chi_2+ d)
#
#         PDG            Width
DECAY   2000002     8.90297920E+01   # sup_R decays
#          BR         NDA      ID1       ID2
     8.03847904E-05    2     1000022         2   # BR(~u_R -> ~chi_10 u)
     3.11400104E-04    2     1000023         2   # BR(~u_R -> ~chi_20 u)
     7.09605213E-05    2     1000025         2   # BR(~u_R -> ~chi_30 u)
     8.56006441E-02    2     1000035         2   # BR(~u_R -> ~chi_40 u)
     9.13936611E-01    2     1000021         2   # BR(~u_R -> ~g      u)
#
#         PDG            Width
DECAY   1000001     1.27466892E+01   # sdown_L decays
#          BR         NDA      ID1       ID2
     1.56969418E-01    2     1000022         1   # BR(~d_L -> ~chi_10 d)
     3.41982679E-03    2     1000023         1   # BR(~d_L -> ~chi_20 d)
     1.72615123E-01    2     1000025         1   # BR(~d_L -> ~chi_30 d)
     5.94557783E-03    2     1000035         1   # BR(~d_L -> ~chi_40 d)
     2.58314174E-01    2    -1000024         2   # BR(~d_L -> ~chi_1- u)
     4.02735881E-01    2    -1000037         2   # BR(~d_L -> ~chi_2- u)
#
#         PDG            Width
DECAY   2000001     8.05300994E+01   # sdown_R decays
#          BR         NDA      ID1       ID2
     2.20443310E-05    2     1000022         1   # BR(~d_R -> ~chi_10 d)
     8.53928896E-05    2     1000023         1   # BR(~d_R -> ~chi_20 d)
     1.94575785E-05    2     1000025         1   # BR(~d_R -> ~chi_30 d)
     2.34529672E-02    2     1000035         1   # BR(~d_R -> ~chi_40 d)
     9.76420138E-01    2     1000021         1   # BR(~d_R -> ~g      d)
#
#         PDG            Width
DECAY   1000004     1.26494706E+01   # scharm_L decays
#          BR         NDA      ID1       ID2
     1.60011230E-01    2     1000022         4   # BR(~c_L -> ~chi_10 c)
     5.01593687E-03    2     1000023         4   # BR(~c_L -> ~chi_20 c)
     1.65080807E-01    2     1000025         4   # BR(~c_L -> ~chi_30 c)
     5.09060406E-03    2     1000035         4   # BR(~c_L -> ~chi_40 c)
     4.05174419E-01    2     1000024         3   # BR(~c_L -> ~chi_1+ s)
     2.59627003E-01    2     1000037         3   # BR(~c_L -> ~chi_2+ s)
#
#         PDG            Width
DECAY   2000004     6.35565957E+01   # scharm_R decays
#          BR         NDA      ID1       ID2
     1.17685772E-04    2     1000022         4   # BR(~c_R -> ~chi_10 c)
     4.55727595E-04    2     1000023         4   # BR(~c_R -> ~chi_20 c)
     1.03808053E-04    2     1000025         4   # BR(~c_R -> ~chi_30 c)
     1.24979348E-01    2     1000035         4   # BR(~c_R -> ~chi_40 c)
     8.74343431E-01    2     1000021         4   # BR(~c_R -> ~g      c)
#
#         PDG            Width
DECAY   1000003     1.24979031E+01   # sstrange_L decays
#          BR         NDA      ID1       ID2
     1.57068569E-01    2     1000022         3   # BR(~s_L -> ~chi_10 s)
     3.42021531E-03    2     1000023         3   # BR(~s_L -> ~chi_20 s)
     1.72548883E-01    2     1000025         3   # BR(~s_L -> ~chi_30 s)
     5.91606421E-03    2     1000035         3   # BR(~s_L -> ~chi_40 s)
     2.58472534E-01    2    -1000024         4   # BR(~s_L -> ~chi_1- c)
     4.02573734E-01    2    -1000037         4   # BR(~s_L -> ~chi_2- c)
#
#         PDG            Width
DECAY   2000003     5.56811181E+01   # sstrange_R decays
#          BR         NDA      ID1       ID2
     3.33289468E-05    2     1000022         3   # BR(~s_R -> ~chi_10 s)
     1.29056766E-04    2     1000023         3   # BR(~s_R -> ~chi_20 s)
     2.93949909E-05    2     1000025         3   # BR(~s_R -> ~chi_30 s)
     3.53604725E-02    2     1000035         3   # BR(~s_R -> ~chi_40 s)
     9.64447747E-01    2     1000021         3   # BR(~s_R -> ~g      s)
#
#         PDG            Width
DECAY   1000011     5.04245897E+01   # selectron_L decays
#          BR         NDA      ID1       ID2
     1.45386117E-01    2     1000022        11   # BR(~e_L -> ~chi_10 e-)
     6.35716797E-03    2     1000023        11   # BR(~e_L -> ~chi_20 e-)
     1.53546788E-01    2     1000025        11   # BR(~e_L -> ~chi_30 e-)
     8.99647764E-02    2     1000035        11   # BR(~e_L -> ~chi_40 e-)
     2.24144160E-01    2    -1000024        12   # BR(~e_L -> ~chi_1- nu_e)
     3.80600991E-01    2    -1000037        12   # BR(~e_L -> ~chi_2- nu_e)
#
#         PDG            Width
DECAY   2000011     8.98268640E-03   # selectron_R decays
#           BR         NDA      ID1       ID2
     2.13959552E-01    2     1000022        11   # BR(~e_R -> ~chi_10 e-)
     6.76965707E-01    2     1000023        11   # BR(~e_R -> ~chi_20 e-)
     1.09074741E-01    2     1000025        11   # BR(~e_R -> ~chi_30 e-)
#
#         PDG            Width
DECAY   1000013     5.04245897E+01   # smuon_L decays
#          BR         NDA      ID1       ID2
     1.45386116E-01    2     1000022        13   # BR(~mu_L -> ~chi_10 mu-)
     6.35716797E-03    2     1000023        13   # BR(~mu_L -> ~chi_20 mu-)
     1.53546788E-01    2     1000025        13   # BR(~mu_L -> ~chi_30 mu-)
     8.99647763E-02    2     1000035        13   # BR(~mu_L -> ~chi_40 mu-)
     2.24144160E-01    2    -1000024        14   # BR(~mu_L -> ~chi_1- nu_mu)
     3.80600991E-01    2    -1000037        14   # BR(~mu_L -> ~chi_2- nu_mu)
#
#         PDG            Width
DECAY   2000013     8.98268516E-03   # smuon_R decays
#           BR         NDA      ID1       ID2
     2.13959558E-01    2     1000022        13   # BR(~mu_R -> ~chi_10 mu-)
     6.76965707E-01    2     1000023        13   # BR(~mu_R -> ~chi_20 mu-)
     1.09074735E-01    2     1000025        13   # BR(~mu_R -> ~chi_30 mu-)
#
#         PDG            Width
DECAY   1000015     4.43613493E+01   # stau_1 decays
#          BR         NDA      ID1       ID2
     1.46953669E-01    2     1000022        15   # BR(~tau_1 -> ~chi_10  tau-)
     9.12345490E-03    2     1000023        15   # BR(~tau_1 -> ~chi_20  tau-)
     1.53767145E-01    2     1000025        15   # BR(~tau_1 -> ~chi_30  tau-)
     8.81249686E-02    2     1000035        15   # BR(~tau_1 -> ~chi_40  tau-)
     2.23545247E-01    2    -1000024        16   # BR(~tau_1 -> ~chi_1-  nu_tau)
     3.78485516E-01    2    -1000037        16   # BR(~tau_1 -> ~chi_2-  nu_tau)
#
#         PDG            Width
DECAY   2000015     1.99515033E+01   # stau_2 decays
#          BR         NDA      ID1       ID2
     5.92965271E-03    2     1000022        15   # BR(~tau_2 -> ~chi_10  tau-)
     1.08422473E-02    2     1000023        15   # BR(~tau_2 -> ~chi_20  tau-)
     3.69261709E-03    2     1000025        15   # BR(~tau_2 -> ~chi_30  tau-)
     9.64124055E-01    2     1000035        15   # BR(~tau_2 -> ~chi_40  tau-)
     9.47704575E-03    2    -1000024        16   # BR(~tau_2 -> ~chi_1-  nu_tau)
     5.80413624E-03    2    -1000037        16   # BR(~tau_2 -> ~chi_2-  nu_tau)
     6.38241432E-05    2     1000016       -24   # BR(~tau_2 -> ~nu_tauL W-)
     3.41065845E-05    2     1000015        25   # BR(~tau_2 -> ~tau_1   h)
     3.23153524E-05    2     1000015        23   # BR(~tau_2 -> ~tau_1   Z)
#
#         PDG            Width
DECAY   1000012     5.04446959E+01   # snu_eL decays
#          BR         NDA      ID1       ID2
     1.31474692E-01    2     1000022        12   # BR(~nu_eL -> ~chi_10 nu_e)
     1.86312066E-03    2     1000023        12   # BR(~nu_eL -> ~chi_20 nu_e)
     1.67406501E-01    2     1000025        12   # BR(~nu_eL -> ~chi_30 nu_e)
     9.38924831E-02    2     1000035        12   # BR(~nu_eL -> ~chi_40 nu_e)
     3.56321603E-01    2     1000024        11   # BR(~nu_eL -> ~chi_1+ e-)
     2.49041601E-01    2     1000037        11   # BR(~nu_eL -> ~chi_2+ e-)
#
#         PDG            Width
DECAY   1000014     5.04446959E+01   # snu_muL decays
#          BR         NDA      ID1       ID2
     1.31474692E-01    2     1000022        14   # BR(~nu_muL -> ~chi_10 nu_mu)
     1.86312066E-03    2     1000023        14   # BR(~nu_muL -> ~chi_20 nu_mu)
     1.67406501E-01    2     1000025        14   # BR(~nu_muL -> ~chi_30 nu_mu)
     9.38924832E-02    2     1000035        14   # BR(~nu_muL -> ~chi_40 nu_mu)
     3.56321603E-01    2     1000024        13   # BR(~nu_muL -> ~chi_1+ mu-)
     2.49041601E-01    2     1000037        13   # BR(~nu_muL -> ~chi_2+ mu-)
#
#         PDG            Width
DECAY   1000016     4.43847850E+01   # snu_tauL decays
#          BR         NDA      ID1       ID2
     1.31055857E-01    2     1000022        16   # BR(~nu_tauL -> ~chi_10 nu_tau)
     1.85544431E-03    2     1000023        16   # BR(~nu_tauL -> ~chi_20 nu_tau)
     1.66483021E-01    2     1000025        16   # BR(~nu_tauL -> ~chi_30 nu_tau)
     9.19508088E-02    2     1000035        16   # BR(~nu_tauL -> ~chi_40 nu_tau)
     3.58863381E-01    2     1000024        15   # BR(~nu_tauL -> ~chi_1+ tau-)
     2.49791488E-01    2     1000037        15   # BR(~nu_tauL -> ~chi_2+ tau-)
#
#         PDG            Width
DECAY   1000024     2.58352548E-11   # chargino1+ decays
#           BR         NDA      ID1       ID2       ID3
     6.00760527E-01    3     1000022         2        -1   # BR(~chi_1+ -> ~chi_10 u    db)
     1.99619736E-01    3     1000022       -11        12   # BR(~chi_1+ -> ~chi_10 e+   nu_e)
     1.99619736E-01    3     1000022       -13        14   # BR(~chi_1+ -> ~chi_10 mu+  nu_mu)
#
#         PDG            Width
DECAY   1000037     5.41583755E-01   # chargino2+ decays
#          BR         NDA      ID1       ID2
     4.05852718E-01    2     1000024        23   # BR(~chi_2+ -> ~chi_1+  Z )
     5.93094951E-01    2     1000022        24   # BR(~chi_2+ -> ~chi_10  W+)
     1.05233096E-03    2     1000024        25   # BR(~chi_2+ -> ~chi_1+  h )
#
#         PDG            Width
DECAY   1000022     0.00000000E+00   # neutralino1 decays
#
#         PDG            Width
DECAY   1000023     1.36849418E-03   # neutralino2 decays
#          BR         NDA      ID1       ID2
     1.29750773E-04    2     1000022        22   # BR(~chi_20 -> ~chi_10 gam)
#           BR         NDA      ID1       ID2       ID3
     3.43049718E-02    3     1000022        -2         2   # BR(~chi_20 -> ~chi_10 ub      u)
     4.43866110E-02    3     1000022        -1         1   # BR(~chi_20 -> ~chi_10 db      d)
     3.43049718E-02    3     1000022        -4         4   # BR(~chi_20 -> ~chi_10 cb      c)
     4.43866110E-02    3     1000022        -3         3   # BR(~chi_20 -> ~chi_10 sb      s)
     4.18303320E-02    3     1000022        -5         5   # BR(~chi_20 -> ~chi_10 bb      b)
     1.01781365E-02    3     1000022       -11        11   # BR(~chi_20 -> ~chi_10 e+      e-)
     1.01781365E-02    3     1000022       -13        13   # BR(~chi_20 -> ~chi_10 mu+     mu-)
     1.01010493E-02    3     1000022       -15        15   # BR(~chi_20 -> ~chi_10 tau+    tau-)
     2.03500820E-02    3     1000022       -12        12   # BR(~chi_20 -> ~chi_10 nu_eb   nu_e)
     2.03500820E-02    3     1000022       -14        14   # BR(~chi_20 -> ~chi_10 nu_mub  nu_mu)
     2.03504173E-02    3     1000022       -16        16   # BR(~chi_20 -> ~chi_10 nu_taub nu_tau)
     1.18269593E-01    3     1000024        -2         1   # BR(~chi_20 -> ~chi_1+ ub      d)
     1.18269593E-01    3    -1000024        -1         2   # BR(~chi_20 -> ~chi_1- db      u)
     1.18269593E-01    3     1000024        -4         3   # BR(~chi_20 -> ~chi_1+ cb      s)
     1.18269593E-01    3    -1000024        -3         4   # BR(~chi_20 -> ~chi_1- sb      c)
     3.94020822E-02    3     1000024       -12        11   # BR(~chi_20 -> ~chi_1+ nu_eb   e-)
     3.94020822E-02    3    -1000024        12       -11   # BR(~chi_20 -> ~chi_1- nu_e    e+)
     3.94020822E-02    3     1000024       -14        13   # BR(~chi_20 -> ~chi_1+ nu_mub  mu-)
     3.94020822E-02    3    -1000024        14       -13   # BR(~chi_20 -> ~chi_1- nu_mu   mu+)
     3.92310733E-02    3     1000024       -16        15   # BR(~chi_20 -> ~chi_1+ nu_taub tau-)
     3.92310733E-02    3    -1000024        16       -15   # BR(~chi_20 -> ~chi_1- nu_tau  tau+)
#
#         PDG            Width
DECAY   1000025     6.83407386E-01   # neutralino3 decays
#          BR         NDA      ID1       ID2
     1.65185816E-04    2     1000022        23   # BR(~chi_30 -> ~chi_10   Z )
     4.99889069E-01    2     1000024       -24   # BR(~chi_30 -> ~chi_1+   W-)
     4.99889069E-01    2    -1000024        24   # BR(~chi_30 -> ~chi_1-   W+)
     5.66754843E-05    2     1000022        25   # BR(~chi_30 -> ~chi_10   h )
#
#         PDG            Width
DECAY   1000035     2.45420780E+00   # neutralino4 decays
#          BR         NDA      ID1       ID2
     4.43692482E-02    2     1000022        23   # BR(~chi_40 -> ~chi_10   Z )
     4.76486144E-02    2     1000023        23   # BR(~chi_40 -> ~chi_20   Z )
     3.25499364E-02    2     1000025        23   # BR(~chi_40 -> ~chi_30   Z )
     7.98610693E-02    2     1000024       -24   # BR(~chi_40 -> ~chi_1+   W-)
     7.98610693E-02    2    -1000024        24   # BR(~chi_40 -> ~chi_1-   W+)
     4.62395078E-02    2     1000037       -24   # BR(~chi_40 -> ~chi_2+   W-)
     4.62395078E-02    2    -1000037        24   # BR(~chi_40 -> ~chi_2-   W+)
     3.49888203E-02    2     1000022        25   # BR(~chi_40 -> ~chi_10   h )
     9.23908447E-02    2     1000023        25   # BR(~chi_40 -> ~chi_20   h )
     1.02562077E-02    2     1000025        25   # BR(~chi_40 -> ~chi_30   h )
     1.21398794E-01    2     2000011       -11   # BR(~chi_40 -> ~e_R-     e+)
     1.21398794E-01    2    -2000011        11   # BR(~chi_40 -> ~e_R+     e-)
     1.21398794E-01    2     2000013       -13   # BR(~chi_40 -> ~mu_R-    mu+)
     1.21398794E-01    2    -2000013        13   # BR(~chi_40 -> ~mu_R+    mu-)
#
#         PDG            Width
DECAY        25     4.02345105E-03   # h decays
#          BR         NDA      ID1       ID2
     6.03646127E-01    2           5        -5   # BR(h -> b       bb     )
     6.45445450E-02    2         -15        15   # BR(h -> tau+    tau-   )
     2.28465345E-04    2         -13        13   # BR(h -> mu+     mu-    )
     2.49497557E-04    2           3        -3   # BR(h -> s       sb     )
     2.15094428E-02    2           4        -4   # BR(h -> c       cb     )
     7.87825575E-02    2          21        21   # BR(h -> g       g      )
     2.41896481E-03    2          22        22   # BR(h -> gam     gam    )
     1.50953306E-03    2          22        23   # BR(h -> Z       gam    )
     2.02033343E-01    2          24       -24   # BR(h -> W+      W-     )
     2.50775244E-02    2          23        23   # BR(h -> Z       Z      )
#
#         PDG            Width
DECAY        35     4.14768869E+01   # H decays
#          BR         NDA      ID1       ID2
     2.77496723E-02    2           5        -5   # BR(H -> b       bb     )
     5.05521624E-03    2         -15        15   # BR(H -> tau+    tau-   )
     1.78732972E-05    2         -13        13   # BR(H -> mu+     mu-    )
     1.12340882E-05    2           3        -3   # BR(H -> s       sb     )
     7.47498820E-07    2           4        -4   # BR(H -> c       cb     )
     7.32965620E-02    2           6        -6   # BR(H -> t       tb     )
     4.12098194E-05    2          21        21   # BR(H -> g       g      )
     4.24632656E-07    2          22        22   # BR(H -> gam     gam    )
     6.04324503E-08    2          23        22   # BR(H -> Z       gam    )
     4.08573190E-05    2          24       -24   # BR(H -> W+      W-     )
     2.03781599E-05    2          23        23   # BR(H -> Z       Z      )
     1.48121730E-04    2          25        25   # BR(H -> h       h      )
     1.58670186E-01    2     1000024  -1000024   # BR(H -> ~chi_1+ ~chi_1-)
     4.30989461E-02    2     1000037  -1000037   # BR(H -> ~chi_2+ ~chi_2-)
     1.73810958E-01    2     1000024  -1000037   # BR(H -> ~chi_1+ ~chi_2-)
     1.73810958E-01    2     1000037  -1000024   # BR(H -> ~chi_2+ ~chi_1-)
     5.90509220E-02    2     1000022   1000022   # BR(H -> ~chi_10 ~chi_10)
     2.23132875E-03    2     1000023   1000023   # BR(H -> ~chi_20 ~chi_20)
     3.32023467E-02    2     1000025   1000025   # BR(H -> ~chi_30 ~chi_30)
     5.74987754E-05    2     1000035   1000035   # BR(H -> ~chi_40 ~chi_40)
     6.57874860E-02    2     1000022   1000023   # BR(H -> ~chi_10 ~chi_20)
     5.89770519E-03    2     1000022   1000025   # BR(H -> ~chi_10 ~chi_30)
     1.64032345E-02    2     1000022   1000035   # BR(H -> ~chi_10 ~chi_40)
     1.06673859E-01    2     1000023   1000025   # BR(H -> ~chi_20 ~chi_30)
     4.46544415E-02    2     1000023   1000035   # BR(H -> ~chi_20 ~chi_40)
     1.01694528E-02    2     1000025   1000035   # BR(H -> ~chi_30 ~chi_40)
     1.83025135E-05    2     1000002  -1000002   # BR(H -> ~u_L    ~u_L*  )
     1.83025135E-05    2     1000004  -1000004   # BR(H -> ~c_L    ~c_L*  )
     2.67412573E-05    2     1000001  -1000001   # BR(H -> ~d_L    ~d_L*  )
     2.67412573E-05    2     1000003  -1000003   # BR(H -> ~s_L    ~s_L*  )
     6.11252928E-07    2     1000005  -1000005   # BR(H -> ~b_1    ~b_1*  )
     3.81005449E-06    2     2000011  -2000011   # BR(H -> ~e_R-   ~e_R+  )
     3.81005449E-06    2     2000013  -2000013   # BR(H -> ~mu_R-  ~mu_R+ )
#
#         PDG            Width
DECAY        36     4.14845647E+01   # A decays
#          BR         NDA      ID1       ID2
     2.77685270E-02    2           5        -5   # BR(A -> b       bb     )
     5.05471068E-03    2         -15        15   # BR(A -> tau+    tau-   )
     1.78714797E-05    2         -13        13   # BR(A -> mu+     mu-    )
     1.12544846E-05    2           3        -3   # BR(A -> s       sb     )
     7.49595763E-07    2           4        -4   # BR(A -> c       cb     )
     7.36018260E-02    2           6        -6   # BR(A -> t       tb     )
     6.81292533E-05    2          21        21   # BR(A -> g       g      )
     3.00011038E-07    2          22        22   # BR(A -> gam     gam    )
     8.57889608E-08    2          23        22   # BR(A -> Z       gam    )
     4.13490640E-05    2          23        25   # BR(A -> Z       h      )
     2.45462456E-01    2     1000024  -1000024   # BR(A -> ~chi_1+ ~chi_1-)
     1.28565327E-01    2     1000037  -1000037   # BR(A -> ~chi_2+ ~chi_2-)
     8.76908387E-02    2     1000024  -1000037   # BR(A -> ~chi_1+ ~chi_2-)
     8.76908387E-02    2     1000037  -1000024   # BR(A -> ~chi_2+ ~chi_1-)
     1.00763586E-01    2     1000022   1000022   # BR(A -> ~chi_10 ~chi_10)
     1.15514222E-03    2     1000023   1000023   # BR(A -> ~chi_20 ~chi_20)
     7.91526045E-02    2     1000025   1000025   # BR(A -> ~chi_30 ~chi_30)
     4.40149961E-09    2     1000035   1000035   # BR(A -> ~chi_40 ~chi_40)
     2.84457598E-02    2     1000022   1000023   # BR(A -> ~chi_10 ~chi_20)
     5.75502193E-03    2     1000022   1000025   # BR(A -> ~chi_10 ~chi_30)
     2.94126215E-02    2     1000022   1000035   # BR(A -> ~chi_10 ~chi_40)
     5.75691631E-02    2     1000023   1000025   # BR(A -> ~chi_20 ~chi_30)
     2.41664178E-02    2     1000023   1000035   # BR(A -> ~chi_20 ~chi_40)
     1.76054151E-02    2     1000025   1000035   # BR(A -> ~chi_30 ~chi_40)
#
#         PDG            Width
DECAY        37     4.13694557E+01   # H+ decays
#          BR         NDA      ID1       ID2
     4.55617838E-05    2           4        -5   # BR(H+ -> c       bb     )
     5.07165028E-03    2         -15        16   # BR(H+ -> tau+    nu_tau )
     1.79313715E-05    2         -13        14   # BR(H+ -> mu+     nu_mu  )
     4.55605088E-07    2           2        -5   # BR(H+ -> u       bb     )
     5.63882794E-07    2           2        -3   # BR(H+ -> u       sb     )
     1.18197759E-05    2           4        -3   # BR(H+ -> c       sb     )
     9.95682140E-02    2           6        -5   # BR(H+ -> t       bb     )
     4.15661140E-05    2          24        25   # BR(H+ -> W+      h      )
     2.88513424E-13    2          24        36   # BR(H+ -> W+      A      )
     7.34277538E-04    2     1000024   1000022   # BR(H+ -> ~chi_1+ ~chi_10)
     1.38771933E-01    2     1000024   1000023   # BR(H+ -> ~chi_1+ ~chi_20)
     2.42487342E-01    2     1000024   1000025   # BR(H+ -> ~chi_1+ ~chi_30)
     4.14933428E-02    2     1000024   1000035   # BR(H+ -> ~chi_1+ ~chi_40)
     3.12590603E-01    2     1000037   1000022   # BR(H+ -> ~chi_2+ ~chi_10)
     1.31604697E-01    2     1000037   1000023   # BR(H+ -> ~chi_2+ ~chi_20)
     6.44621196E-04    2     1000037   1000025   # BR(H+ -> ~chi_2+ ~chi_30)
     2.68261133E-02    2     1000037   1000035   # BR(H+ -> ~chi_2+ ~chi_40)
     4.46536324E-05    2     1000002  -1000001   # BR(H+ -> ~u_L    ~d_L*  )
     4.46536324E-05    2     1000004  -1000003   # BR(H+ -> ~c_L    ~s_L*  )
