#
#                              ======================
#                              | THE SUSYHIT OUTPUT |
#                              ======================
#
#
#              ------------------------------------------------------
#              |     This is the output of the SUSY-HIT package     |
#              |  created by A.Djouadi, M.Muehlleitner and M.Spira. |
#              |  In case of problems with SUSY-HIT email to        |
#              |           margarete.muehlleitner@cern.ch           |
#              |           michael.spira@psi.ch                     |
#              |           abdelhak.djouadi@cern.ch                 |
#              ------------------------------------------------------
#
#              ------------------------------------------------------
#              |  SUSY Les Houches Accord - MSSM Spectrum + Decays  |
#              |              based on the decay programs           |
#              |                                                    |
#              |                     SDECAY 1.3b                    |
#              |                                                    |
#              |  Authors: M.Muhlleitner, A.Djouadi and Y.Mambrini  |
#              |  Ref.:    Comput.Phys.Commun.168(2005)46           |
#              |           [hep-ph/0311167]                         |
#              |                                                    |
#              |                     HDECAY 3.4                     |
#              |                                                    |
#              |  By: A.Djouadi,J.Kalinowski,M.Muhlleitner,M.Spira  |
#              |  Ref.:    Comput.Phys.Commun.108(1998)56           |
#              |           [hep-ph/9704448]                         |
#              |                                                    |
#              |                                                    |
#              |  If not stated otherwise all DRbar couplings and   |
#              |  soft SUSY breaking masses are given at the scale  |
#              |  Q=  0.23892860E+04
#              |                                                    |
#              ------------------------------------------------------
#
#
BLOCK DCINFO  # Decay Program information
     1   SDECAY/HDECAY # decay calculator
     2   1.3b  /3.4    # version number
#
BLOCK SPINFO  # Spectrum calculator information
     1     SOFTSUSY    # spectrum calculator               
     2     3.4.0       # version number                    
#
BLOCK MODSEL  # Model selection
     1     0   #  nonUniversal                                     
#
BLOCK SMINPUTS  # Standard Model inputs
         1     1.27908970E+02   # alpha_em^-1(M_Z)^MSbar
         2     1.16637870E-05   # G_F [GeV^-2]
         3     1.18400000E-01   # alpha_S(M_Z)^MSbar
         4     9.11876000E+01   # M_Z pole mass
         5     4.18000000E+00   # mb(mb)^MSbar
         6     1.73200000E+02   # mt pole mass
         7     1.77700000E+00   # mtau pole mass
#
BLOCK MINPAR  # Input parameters - minimal models
         3     5.34400000E+01   # tanb                
#
BLOCK EXTPAR  # Input parameters - non-minimal models
         0    -1.00000000E+00   # Set                 
         1    -4.82500000E+01   # M_1(MX)             
         2    -3.57352000E+03   # M_2(MX)             
         3     1.78714000E+03   # M_3(MX)             
        11    -2.85034000E+03   # At(MX)              
        12     3.10518000E+03   # Ab(MX)              
        13    -1.66025000E+03   # Atau(MX)            
        23     2.37480000E+02   # mu(MX)              
        26     1.07227000E+03   # mA(pole)            
        31     1.32970000E+02   # meL(MX)             
        32     1.32970000E+02   # mmuL(MX)            
        33     2.87279000E+03   # mtauL(MX)           
        34     1.92140000E+03   # meR(MX)             
        35     1.92140000E+03   # mmuR(MX)            
        36     2.14066000E+03   # mtauR(MX)           
        41     3.18821000E+03   # mqL1(MX)            
        42     3.18821000E+03   # mqL2(MX)            
        43     1.57902000E+03   # mqL3(MX)            
        44     2.95078000E+03   # muR(MX)             
        45     2.95078000E+03   # mcR(MX)             
        46     3.60916000E+03   # mtR(MX)             
        47     3.06270000E+03   # mdR(MX)             
        48     3.06270000E+03   # msR(MX)             
        49     7.54500000E+02   # mbR(MX)             
#
BLOCK MASS  # Mass Spectrum
# PDG code           mass       particle
        24     8.03869979E+01   # W+
        25     1.24243884E+02   # h
        35     1.07227085E+03   # H
        36     1.07226993E+03   # A
        37     1.07540715E+03   # H+
         5     4.81876030E+00   # b-quark pole mass calculated from mb(mb)_Msbar
   1000001     3.24757656E+03   # ~d_L
   2000001     3.10652107E+03   # ~d_R
   1000002     3.24674225E+03   # ~u_L
   2000002     2.99736800E+03   # ~u_R
   1000003     3.24757656E+03   # ~s_L
   2000003     3.10652107E+03   # ~s_R
   1000004     3.24674225E+03   # ~c_L
   2000004     2.99736800E+03   # ~c_R
   1000005     8.18361453E+02   # ~b_1
   2000005     1.64004394E+03   # ~b_2
   1000006     1.63989811E+03   # ~t_1
   2000006     3.61579797E+03   # ~t_2
   1000011     2.04965749E+02   # ~e_L
   2000011     1.92190418E+03   # ~e_R
   1000012     1.88971833E+02   # ~nu_eL
   1000013     2.04965749E+02   # ~mu_L
   2000013     1.92190418E+03   # ~mu_R
   1000014     1.88971833E+02   # ~nu_muL
   1000015     2.12440201E+03   # ~tau_1
   2000015     2.88337883E+03   # ~tau_2
   1000016     2.88193171E+03   # ~nu_tauL
   1000021     1.98028242E+03   # ~g
   1000022    -4.65323357E+01   # ~chi_10
   1000023    -2.51936257E+02   # ~chi_20
   1000025     2.52241441E+02   # ~chi_30
   1000035    -3.54833488E+03   # ~chi_40
   1000024     2.48443720E+02   # ~chi_1+
   1000037     3.54850057E+03   # ~chi_2+
#
BLOCK NMIX  # Neutralino Mixing Matrix
  1  1     9.83514972E-01   # N_11
  1  2    -7.20096412E-04   # N_12
  1  3     1.78289892E-01   # N_13
  1  4     3.01744069E-02   # N_14
  2  1    -1.47411320E-01   # N_21
  2  2    -1.65893468E-02   # N_22
  2  3     6.93847998E-01   # N_23
  2  4     7.04676985E-01   # N_24
  3  1     1.04729059E-01   # N_31
  3  2    -1.50546693E-02   # N_32
  3  3    -6.97700782E-01   # N_33
  3  4     7.08532850E-01   # N_34
  4  1    -1.60610909E-04   # N_41
  4  2     9.99748784E-01   # N_42
  4  3     1.13550170E-03   # N_43
  4  4     2.23842103E-02   # N_44
#
BLOCK UMIX  # Chargino Mixing Matrix U
  1  1    -1.61272188E-03   # U_11
  1  2     9.99998700E-01   # U_12
  2  1    -9.99998700E-01   # U_21
  2  2    -1.61272188E-03   # U_22
#
BLOCK VMIX  # Chargino Mixing Matrix V
  1  1     3.17004803E-02   # V_11
  1  2     9.99497413E-01   # V_12
  2  1     9.99497413E-01   # V_21
  2  2    -3.17004803E-02   # V_22
#
BLOCK STOPMIX  # Stop Mixing Matrix
  1  1     9.99188350E-01   # cos(theta_t)
  1  2     4.02820211E-02   # sin(theta_t)
  2  1    -4.02820211E-02   # -sin(theta_t)
  2  2     9.99188350E-01   # cos(theta_t)
#
BLOCK SBOTMIX  # Sbottom Mixing Matrix
  1  1     1.06138483E-02   # cos(theta_b)
  1  2     9.99943672E-01   # sin(theta_b)
  2  1    -9.99943672E-01   # -sin(theta_b)
  2  2     1.06138483E-02   # cos(theta_b)
#
BLOCK STAUMIX  # Stau Mixing Matrix
  1  1     6.63729522E-03   # cos(theta_tau)
  1  2     9.99977973E-01   # sin(theta_tau)
  2  1    -9.99977973E-01   # -sin(theta_tau)
  2  2     6.63729522E-03   # cos(theta_tau)
#
BLOCK ALPHA  # Higgs mixing
          -1.92199214E-02   # Mixing angle in the neutral Higgs boson sector
#
BLOCK HMIX Q=  2.38928600E+03  # DRbar Higgs Parameters
         1     2.42897620E+02   # mu(Q)MSSM           
         2     5.29652847E+01   # tan                 
         3     2.43338649E+02   # higgs               
         4     1.68973614E+06   # mA^2(Q)MSSM         
#
BLOCK GAUGE Q=  2.38928600E+03  # The gauge couplings
     1     3.64618122E-01   # gprime(Q) DRbar
     2     6.37503009E-01   # g(Q) DRbar
     3     1.02340625E+00   # g3(Q) DRbar
#
BLOCK AU Q=  2.38928600E+03  # The trilinear couplings
  1  1     0.00000000E+00   # A_u(Q) DRbar
  2  2     0.00000000E+00   # A_c(Q) DRbar
  3  3    -2.85033999E+03   # A_t(Q) DRbar
#
BLOCK AD Q=  2.38928600E+03  # The trilinear couplings
  1  1     0.00000000E+00   # A_d(Q) DRbar
  2  2     0.00000000E+00   # A_s(Q) DRbar
  3  3     3.10518001E+03   # A_b(Q) DRbar
#
BLOCK AE Q=  2.38928600E+03  # The trilinear couplings
  1  1     0.00000000E+00   # A_e(Q) DRbar
  2  2     0.00000000E+00   # A_mu(Q) DRbar
  3  3    -1.66025000E+03   # A_tau(Q) DRbar
#
BLOCK Yu Q=  2.38928600E+03  # The Yukawa couplings
  1  1     0.00000000E+00   # y_u(Q) DRbar
  2  2     0.00000000E+00   # y_c(Q) DRbar
  3  3     8.26687903E-01   # y_t(Q) DRbar
#
BLOCK Yd Q=  2.38928600E+03  # The Yukawa couplings
  1  1     0.00000000E+00   # y_d(Q) DRbar
  2  2     0.00000000E+00   # y_s(Q) DRbar
  3  3     6.75053985E-01   # y_b(Q) DRbar
#
BLOCK Ye Q=  2.38928600E+03  # The Yukawa couplings
  1  1     0.00000000E+00   # y_e(Q) DRbar
  2  2     0.00000000E+00   # y_mu(Q) DRbar
  3  3     5.32649863E-01   # y_tau(Q) DRbar
#
BLOCK MSOFT Q=  2.38928600E+03  # The soft SUSY breaking masses at the scale Q
         1    -4.82500000E+01   # M_1(Q)              
         2    -3.57352000E+03   # M_2(Q)              
         3     1.78714000E+03   # M_3(Q)              
        21     1.30109194E+06   # mH1^2(Q)            
        22    -1.32718285E+04   # mH2^2(Q)            
        31     1.32970000E+02   # meL(Q)              
        32     1.32970000E+02   # mmuL(Q)             
        33     2.87279000E+03   # mtauL(Q)            
        34     1.92140000E+03   # meR(Q)              
        35     1.92140000E+03   # mmuR(Q)             
        36     2.14066000E+03   # mtauR(Q)            
        41     3.18821000E+03   # mqL1(Q)             
        42     3.18821000E+03   # mqL2(Q)             
        43     1.57901999E+03   # mqL3(Q)             
        44     2.95078000E+03   # muR(Q)              
        45     2.95078000E+03   # mcR(Q)              
        46     3.60915999E+03   # mtR(Q)              
        47     3.06270000E+03   # mdR(Q)              
        48     3.06270000E+03   # msR(Q)              
        49     7.54499994E+02   # mbR(Q)              
#
Block HiggsBoundsInputHiggsCouplingsFermions
# ScalarNormEffCoupSq PseudoSNormEffCoupSq NP   IP1 IP2 IP2
    1.03654257E+00    0.00000000E+00        3  25   5   5  # h0-b-b eff. coupling^2, normalised to SM
    2.80528484E+03    0.00000000E+00        3  35   5   5  # H0-b-b eff. coupling^2, normalised to SM
    0.00000000E+00    2.80532138E+03        3  36   5   5  # A0-b-b eff. coupling^2, normalised to SM
#
    9.99986974E-01    0.00000000E+00        3  25   6   6  # h0-t-t eff. coupling^2, normalised to SM
    3.69491558E-04    0.00000000E+00        3  35   6   6  # H0-t-t eff. coupling^2, normalised to SM
    0.00000000E+00    3.56465397E-04        3  36   6   6  # A0-t-t eff. coupling^2, normalised to SM
#
    1.03654257E+00    0.00000000E+00        3  25  15  15  # h0-tau-tau eff. coupling^2, normalised to SM
    2.80528484E+03    0.00000000E+00        3  35  15  15  # H0-tau-tau eff. coupling^2, normalised to SM
    0.00000000E+00    2.80532138E+03        3  36  15  15  # A0-tau-tau eff. coupling^2, normalised to SM
#
Block HiggsBoundsInputHiggsCouplingsBosons
    9.99999883E-01        3  25  24  24  # h0-W-W eff. coupling^2, normalised to SM
    1.16877201E-07        3  35  24  24  # H0-W-W eff. coupling^2, normalised to SM
    0.00000000E+00        3  36  24  24  # A0-W-W eff. coupling^2, normalised to SM
#
    9.99999883E-01        3  25  23  23  # h0-Z-Z eff. coupling^2, normalised to SM
    1.16877201E-07        3  35  23  23  # H0-Z-Z eff. coupling^2, normalised to SM
    0.00000000E+00        3  36  23  23  # A0-Z-Z eff. coupling^2, normalised to SM
#
    8.91579776E-01        3  25  21  21  # h0-g-g eff. coupling^2, normalised to SM
    8.98424145E-04        3  35  21  21  # H0-g-g eff. coupling^2, normalised to SM
    1.55576213E-03        3  36  21  21  # A0-g-g eff. coupling^2, normalised to SM
#
    0.00000000E+00        3  25  25  23  # h0-h0-Z eff. coupling^2, normalised to SM
    0.00000000E+00        3  35  25  23  # H0-h0-Z eff. coupling^2, normalised to SM
    1.16877201E-07        3  36  25  23  # A0-h0-Z eff. coupling^2, normalised to SM
    0.00000000E+00        3  35  35  23  # H0-H0-Z eff. coupling^2, normalised to SM
    9.99999883E-01        3  36  35  23  # A0-H0-Z eff. coupling^2, normalised to SM
    0.00000000E+00        3  36  36  23  # A0-A0-Z eff. coupling^2, normalised to SM
#
    0.00000000E+00        4  25  21  21  23  # h0-g-g-Z eff. coupling^2, normalised to SM
    0.00000000E+00        4  35  21  21  23  # H0-g-g-Z eff. coupling^2, normalised to SM
    0.00000000E+00        4  36  21  21  23  # A0-g-g-Z eff. coupling^2, normalised to SM
#
#
#
#                             =================
#                             |The decay table|
#                             =================
#
# - The QCD corrections to the decays gluino -> squark  + quark
#                                     squark -> gaugino + quark_prime
#                                     squark -> squark_prime + Higgs
#                                     squark -> gluino  + quark
#   are included.
#
# - The multi-body decays for the inos, stops and sbottoms are included.
#
# - The loop induced decays for the gluino, neutralinos and stops
#   are included.
#
# - The SUSY decays of the top quark are included.
#
#
#         PDG            Width
DECAY         6     1.43144524E+00   # top decays
#          BR         NDA      ID1       ID2
     1.00000000E+00    2           5        24   # BR(t ->  b    W+)
#
#         PDG            Width
DECAY   1000021     3.67867890E+01   # gluino decays
#          BR         NDA      ID1       ID2
     3.94138008E-01    2     1000005        -5   # BR(~g -> ~b_1  bb)
     3.94138008E-01    2    -1000005         5   # BR(~g -> ~b_1* b )
     5.73738065E-02    2     2000005        -5   # BR(~g -> ~b_2  bb)
     5.73738065E-02    2    -2000005         5   # BR(~g -> ~b_2* b )
     4.84881858E-02    2     1000006        -6   # BR(~g -> ~t_1  tb)
     4.84881858E-02    2    -1000006         6   # BR(~g -> ~t_1* t )
#
#         PDG            Width
DECAY   1000006     3.52503548E+01   # stop1 decays
#          BR         NDA      ID1       ID2
     6.67473464E-03    2     1000022         6   # BR(~t_1 -> ~chi_10 t )
     2.94165121E-01    2     1000023         6   # BR(~t_1 -> ~chi_20 t )
     2.93398684E-01    2     1000025         6   # BR(~t_1 -> ~chi_30 t )
     4.02092702E-01    2     1000024         5   # BR(~t_1 -> ~chi_1+ b )
     3.66875877E-03    2     1000005        24   # BR(~t_1 -> ~b_1    W+)
#
#         PDG            Width
DECAY   2000006     2.51185718E+02   # stop2 decays
#          BR         NDA      ID1       ID2
     3.28429702E-02    2     1000022         6   # BR(~t_2 -> ~chi_10 t )
     9.61788546E-02    2     1000023         6   # BR(~t_2 -> ~chi_20 t )
     9.77953911E-02    2     1000025         6   # BR(~t_2 -> ~chi_30 t )
     1.93954483E-01    2     1000024         5   # BR(~t_2 -> ~chi_1+ b )
     1.06280592E-10    2     1000037         5   # BR(~t_2 -> ~chi_2+ b )
     3.85962506E-01    2     1000021         6   # BR(~t_2 -> ~g      t )
     4.79937120E-02    2     1000006        25   # BR(~t_2 -> ~t_1    h )
     1.71851777E-04    2     1000006        35   # BR(~t_2 -> ~t_1    H )
     1.74717417E-04    2     1000006        36   # BR(~t_2 -> ~t_1    A )
     3.17154626E-06    2     1000005        37   # BR(~t_2 -> ~b_1    H+)
     3.47364160E-04    2     2000005        37   # BR(~t_2 -> ~b_2    H+)
     4.91116746E-02    2     1000006        23   # BR(~t_2 -> ~t_1    Z )
     1.83491600E-05    2     1000005        24   # BR(~t_2 -> ~b_1    W+)
     9.54449544E-02    2     2000005        24   # BR(~t_2 -> ~b_2    W+)
#
#         PDG            Width
DECAY   1000005     1.20394120E+01   # sbottom1 decays
#          BR         NDA      ID1       ID2
     5.87591923E-02    2     1000022         5   # BR(~b_1 -> ~chi_10 b )
     2.43372214E-01    2     1000023         5   # BR(~b_1 -> ~chi_20 b )
     2.45703339E-01    2     1000025         5   # BR(~b_1 -> ~chi_30 b )
     4.52165255E-01    2    -1000024         6   # BR(~b_1 -> ~chi_1- t )
#
#         PDG            Width
DECAY   2000005     3.53524020E+01   # sbottom2 decays
#          BR         NDA      ID1       ID2
     1.93884794E-02    2     1000022         5   # BR(~b_2 -> ~chi_10 b )
     1.93311857E-01    2     1000023         5   # BR(~b_2 -> ~chi_20 b )
     1.95687956E-01    2     1000025         5   # BR(~b_2 -> ~chi_30 b )
     5.87796596E-01    2    -1000024         6   # BR(~b_2 -> ~chi_1- t )
     1.93367928E-03    2     1000005        25   # BR(~b_2 -> ~b_1    h )
     1.88143301E-03    2     1000005        23   # BR(~b_2 -> ~b_1    Z )
#
#         PDG            Width
DECAY   1000002     9.07764951E+01   # sup_L decays
#          BR         NDA      ID1       ID2
     4.83304018E-03    2     1000022         2   # BR(~u_L -> ~chi_10 u)
     2.73850926E-04    2     1000023         2   # BR(~u_L -> ~chi_20 u)
     3.30755128E-06    2     1000025         2   # BR(~u_L -> ~chi_30 u)
     2.75631763E-04    2     1000024         1   # BR(~u_L -> ~chi_1+ d)
     9.94614170E-01    2     1000021         2   # BR(~u_L -> ~g      u)
#
#         PDG            Width
DECAY   2000002     7.38474523E+01   # sup_R decays
#          BR         NDA      ID1       ID2
     8.82137960E-02    2     1000022         2   # BR(~u_R -> ~chi_10 u)
     1.95770854E-03    2     1000023         2   # BR(~u_R -> ~chi_20 u)
     9.88113183E-04    2     1000025         2   # BR(~u_R -> ~chi_30 u)
     9.08840382E-01    2     1000021         2   # BR(~u_R -> ~g      u)
#
#         PDG            Width
DECAY   1000001     9.08283858E+01   # sdown_L decays
#          BR         NDA      ID1       ID2
     4.90635044E-03    2     1000022         1   # BR(~d_L -> ~chi_10 d)
     1.81714664E-05    2     1000023         1   # BR(~d_L -> ~chi_20 d)
     1.68093147E-04    2     1000025         1   # BR(~d_L -> ~chi_30 d)
     7.13157543E-07    2    -1000024         2   # BR(~d_L -> ~chi_1- u)
     9.94906672E-01    2     1000021         1   # BR(~d_L -> ~g      d)
#
#         PDG            Width
DECAY   2000001     7.89445397E+01   # sdown_R decays
#          BR         NDA      ID1       ID2
     2.14051323E-02    2     1000022         1   # BR(~d_R -> ~chi_10 d)
     4.75444051E-04    2     1000023         1   # BR(~d_R -> ~chi_20 d)
     2.39971165E-04    2     1000025         1   # BR(~d_R -> ~chi_30 d)
     9.77879452E-01    2     1000021         1   # BR(~d_R -> ~g      d)
#
#         PDG            Width
DECAY   1000004     7.16548010E+01   # scharm_L decays
#          BR         NDA      ID1       ID2
     6.38819003E-03    2     1000022         4   # BR(~c_L -> ~chi_10 c)
     3.61496167E-04    2     1000023         4   # BR(~c_L -> ~chi_20 c)
     4.36611618E-06    2     1000025         4   # BR(~c_L -> ~chi_30 c)
     3.63854611E-04    2     1000024         3   # BR(~c_L -> ~chi_1+ s)
     9.92882093E-01    2     1000021         4   # BR(~c_L -> ~g      c)
#
#         PDG            Width
DECAY   2000004     5.99259741E+01   # scharm_R decays
#          BR         NDA      ID1       ID2
     1.13692431E-01    2     1000022         4   # BR(~c_R -> ~chi_10 c)
     2.51931472E-03    2     1000023         4   # BR(~c_R -> ~chi_20 c)
     1.27156971E-03    2     1000025         4   # BR(~c_R -> ~chi_30 c)
     8.82516685E-01    2     1000021         4   # BR(~c_R -> ~g      c)
#
#         PDG            Width
DECAY   1000003     7.16891057E+01   # sstrange_L decays
#          BR         NDA      ID1       ID2
     6.48564709E-03    2     1000022         3   # BR(~s_L -> ~chi_10 s)
     2.39892724E-05    2     1000023         3   # BR(~s_L -> ~chi_20 s)
     2.21909722E-04    2     1000025         3   # BR(~s_L -> ~chi_30 s)
     9.41502343E-07    2    -1000024         4   # BR(~s_L -> ~chi_1- c)
     9.93267512E-01    2     1000021         3   # BR(~s_L -> ~g      s)
#
#         PDG            Width
DECAY   2000003     6.26549962E+01   # sstrange_R decays
#          BR         NDA      ID1       ID2
     2.81760281E-02    2     1000022         3   # BR(~s_R -> ~chi_10 s)
     6.24946374E-04    2     1000023         3   # BR(~s_R -> ~chi_20 s)
     3.15428946E-04    2     1000025         3   # BR(~s_R -> ~chi_30 s)
     9.70883597E-01    2     1000021         3   # BR(~s_R -> ~g      s)
#
#         PDG            Width
DECAY   1000011     2.35258336E-01   # selectron_L decays
#          BR         NDA      ID1       ID2
     1.00000000E+00    2     1000022        11   # BR(~e_L -> ~chi_10 e-)
#
#         PDG            Width
DECAY   2000011     1.01435657E+01   # selectron_R decays
#          BR         NDA      ID1       ID2
     9.68345544E-01    2     1000022        11   # BR(~e_R -> ~chi_10 e-)
     2.10370119E-02    2     1000023        11   # BR(~e_R -> ~chi_20 e-)
     1.06174438E-02    2     1000025        11   # BR(~e_R -> ~chi_30 e-)
#
#         PDG            Width
DECAY   1000013     2.35258197E-01   # smuon_L decays
#          BR         NDA      ID1       ID2
     1.00000000E+00    2     1000022        13   # BR(~mu_L -> ~chi_10 mu-)
#
#         PDG            Width
DECAY   2000013     1.01435657E+01   # smuon_R decays
#          BR         NDA      ID1       ID2
     9.68345544E-01    2     1000022        13   # BR(~mu_R -> ~chi_10 mu-)
     2.10370119E-02    2     1000023        13   # BR(~mu_R -> ~chi_20 mu-)
     1.06174438E-02    2     1000025        13   # BR(~mu_R -> ~chi_30 mu-)
#
#         PDG            Width
DECAY   1000015     3.45477202E+01   # stau_1 decays
#          BR         NDA      ID1       ID2
     3.25746339E-01    2     1000022        15   # BR(~tau_1 -> ~chi_10  tau-)
     1.69105970E-01    2     1000023        15   # BR(~tau_1 -> ~chi_20  tau-)
     1.67502546E-01    2     1000025        15   # BR(~tau_1 -> ~chi_30  tau-)
     3.37645145E-01    2    -1000024        16   # BR(~tau_1 -> ~chi_1-  nu_tau)
#
#         PDG            Width
DECAY   2000015     1.99171196E+01   # stau_2 decays
#          BR         NDA      ID1       ID2
     2.09679377E-01    2     1000022        15   # BR(~tau_2 -> ~chi_10  tau-)
     3.93703739E-01    2     1000023        15   # BR(~tau_2 -> ~chi_20  tau-)
     3.93328568E-01    2     1000025        15   # BR(~tau_2 -> ~chi_30  tau-)
     1.78373560E-05    2    -1000024        16   # BR(~tau_2 -> ~chi_1-  nu_tau)
     1.67224859E-03    2     1000015        25   # BR(~tau_2 -> ~tau_1   h)
     1.59823029E-03    2     1000015        23   # BR(~tau_2 -> ~tau_1   Z)
#
#         PDG            Width
DECAY   1000012     2.13853632E-01   # snu_eL decays
#          BR         NDA      ID1       ID2
     1.00000000E+00    2     1000022        12   # BR(~nu_eL -> ~chi_10 nu_e)
#
#         PDG            Width
DECAY   1000014     2.13853632E-01   # snu_muL decays
#          BR         NDA      ID1       ID2
     1.00000000E+00    2     1000022        14   # BR(~nu_muL -> ~chi_10 nu_mu)
#
#         PDG            Width
DECAY   1000016     1.99217743E+01   # snu_tauL decays
#          BR         NDA      ID1       ID2
     1.85429571E-01    2     1000022        16   # BR(~nu_tauL -> ~chi_10 nu_tau)
     2.64130486E-03    2     1000023        16   # BR(~nu_tauL -> ~chi_20 nu_tau)
     3.23543247E-03    2     1000025        16   # BR(~nu_tauL -> ~chi_30 nu_tau)
     8.05595494E-01    2     1000024        15   # BR(~nu_tauL -> ~chi_1+ tau-)
     3.09819809E-03    2    -1000015       -24   # BR(~nu_tauL -> ~tau_1+ W-)
#
#         PDG            Width
DECAY   1000024     1.31105758E-01   # chargino1+ decays
#          BR         NDA      ID1       ID2
     1.36742135E-03    2     1000012       -11   # BR(~chi_1+ -> ~nu_eL   e+  )
     1.36742135E-03    2     1000014       -13   # BR(~chi_1+ -> ~nu_muL  mu+ )
     2.03234511E-06    2    -1000011        12   # BR(~chi_1+ -> ~e_L+    nu_e)
     2.03234511E-06    2    -1000013        14   # BR(~chi_1+ -> ~mu_L+   nu_mu)
     9.97261093E-01    2     1000022        24   # BR(~chi_1+ -> ~chi_10  W+)
#
#         PDG            Width
DECAY   1000037     1.69765102E+02   # chargino2+ decays
#          BR         NDA      ID1       ID2
     6.79716226E-03    2     1000002        -1   # BR(~chi_2+ -> ~u_L     db)
     6.76875873E-03    2    -1000001         2   # BR(~chi_2+ -> ~d_L*    u )
     6.79715687E-03    2     1000004        -3   # BR(~chi_2+ -> ~c_L     sb)
     6.76867239E-03    2    -1000003         4   # BR(~chi_2+ -> ~s_L*     c )
     1.56892927E-01    2     1000006        -5   # BR(~chi_2+ -> ~t_1     bb)
     1.78823535E-05    2    -1000005         6   # BR(~chi_2+ -> ~b_1*    t )
     1.55166925E-01    2    -2000005         6   # BR(~chi_2+ -> ~b_2*    t )
     8.39378088E-02    2     1000012       -11   # BR(~chi_2+ -> ~nu_eL   e+  )
     8.39378088E-02    2     1000014       -13   # BR(~chi_2+ -> ~nu_muL mu+ )
     9.78178905E-03    2     1000016       -15   # BR(~chi_2+ -> ~nu_tau1 tau+)
     8.39377237E-02    2    -1000011        12   # BR(~chi_2+ -> ~e_L+    nu_e)
     8.39377237E-02    2    -1000013        14   # BR(~chi_2+ -> ~mu_L+   nu_mu)
     9.73326261E-07    2    -1000015        16   # BR(~chi_2+ -> ~tau_1+  nu_tau)
     9.75320040E-03    2    -2000015        16   # BR(~chi_2+ -> ~tau_2+  nu_tau)
     4.21050464E-02    2     1000024        23   # BR(~chi_2+ -> ~chi_1+  Z )
     4.42597409E-05    2     1000022        24   # BR(~chi_2+ -> ~chi_10  W+)
     4.05756762E-02    2     1000023        24   # BR(~chi_2+ -> ~chi_20  W+)
     4.08551432E-02    2     1000025        24   # BR(~chi_2+ -> ~chi_30  W+)
     4.18767341E-02    2     1000024        25   # BR(~chi_2+ -> ~chi_1+  h )
     3.50168967E-02    2     1000024        35   # BR(~chi_2+ -> ~chi_1+  H )
     3.50146261E-02    2     1000024        36   # BR(~chi_2+ -> ~chi_1+  A )
     2.19878809E-03    2     1000022        37   # BR(~chi_2+ -> ~chi_10  H+)
     3.37239847E-02    2     1000023        37   # BR(~chi_2+ -> ~chi_20  H+)
     3.40923324E-02    2     1000025        37   # BR(~chi_2+ -> ~chi_30  H+)
#
#         PDG            Width
DECAY   1000022     0.00000000E+00   # neutralino1 decays
#
#         PDG            Width
DECAY   1000023     1.18823424E-01   # neutralino2 decays
#          BR         NDA      ID1       ID2
     4.42794574E-01    2     1000022        23   # BR(~chi_20 -> ~chi_10   Z )
     5.22211764E-01    2     1000022        25   # BR(~chi_20 -> ~chi_10   h )
     4.98823456E-03    2     1000011       -11   # BR(~chi_20 -> ~e_L-     e+)
     4.98823456E-03    2    -1000011        11   # BR(~chi_20 -> ~e_L+     e-)
     4.98823456E-03    2     1000013       -13   # BR(~chi_20 -> ~mu_L-    mu+)
     4.98823456E-03    2    -1000013        13   # BR(~chi_20 -> ~mu_L+    mu-)
     3.76018096E-03    2     1000012       -12   # BR(~chi_20 -> ~nu_eL    nu_eb)
     3.76018096E-03    2    -1000012        12   # BR(~chi_20 -> ~nu_eL*   nu_e )
     3.76018096E-03    2     1000014       -14   # BR(~chi_20 -> ~nu_muL   nu_mub)
     3.76018096E-03    2    -1000014        14   # BR(~chi_20 -> ~nu_muL*  nu_mu )
#
#         PDG            Width
DECAY   1000025     1.08539557E-01   # neutralino3 decays
#          BR         NDA      ID1       ID2
     7.43391122E-01    2     1000022        23   # BR(~chi_30 -> ~chi_10   Z )
     2.31927310E-01    2     1000022        25   # BR(~chi_30 -> ~chi_10   h )
     1.09024469E-03    2     1000011       -11   # BR(~chi_30 -> ~e_L-     e+)
     1.09024469E-03    2    -1000011        11   # BR(~chi_30 -> ~e_L+     e-)
     1.09024469E-03    2     1000013       -13   # BR(~chi_30 -> ~mu_L-    mu+)
     1.09024469E-03    2    -1000013        13   # BR(~chi_30 -> ~mu_L+    mu-)
     5.08014740E-03    2     1000012       -12   # BR(~chi_30 -> ~nu_eL    nu_eb)
     5.08014740E-03    2    -1000012        12   # BR(~chi_30 -> ~nu_eL*   nu_e )
     5.08014740E-03    2     1000014       -14   # BR(~chi_30 -> ~nu_muL   nu_mub)
     5.08014740E-03    2    -1000014        14   # BR(~chi_30 -> ~nu_muL*  nu_mu )
#
#         PDG            Width
DECAY   1000035     1.69803754E+02   # neutralino4 decays
#          BR         NDA      ID1       ID2
     1.89796300E-05    2     1000022        23   # BR(~chi_40 -> ~chi_10   Z )
     1.87800743E-02    2     1000023        23   # BR(~chi_40 -> ~chi_20   Z )
     2.31749526E-02    2     1000025        23   # BR(~chi_40 -> ~chi_30   Z )
     4.09658648E-02    2     1000024       -24   # BR(~chi_40 -> ~chi_1+   W-)
     4.09658648E-02    2    -1000024        24   # BR(~chi_40 -> ~chi_1-   W+)
     8.65185692E-06    2     1000022        25   # BR(~chi_40 -> ~chi_10   h )
     1.13594143E-03    2     1000022        35   # BR(~chi_40 -> ~chi_10   H )
     1.06418430E-03    2     1000022        36   # BR(~chi_40 -> ~chi_10   A )
     2.30715422E-02    2     1000023        25   # BR(~chi_40 -> ~chi_20   h )
     2.01336023E-02    2     1000023        35   # BR(~chi_40 -> ~chi_20   H )
     1.36193781E-02    2     1000023        36   # BR(~chi_40 -> ~chi_20   A )
     1.87496113E-02    2     1000025        25   # BR(~chi_40 -> ~chi_30   h )
     1.37608523E-02    2     1000025        35   # BR(~chi_40 -> ~chi_30   H )
     2.03443358E-02    2     1000025        36   # BR(~chi_40 -> ~chi_30   A )
     3.49737712E-02    2     1000024       -37   # BR(~chi_40 -> ~chi_1+   H-)
     3.49737712E-02    2    -1000024        37   # BR(~chi_40 -> ~chi_1-   H+)
     3.39594981E-03    2     1000002        -2   # BR(~chi_40 -> ~u_L      ub)
     3.39594981E-03    2    -1000002         2   # BR(~chi_40 -> ~u_L*     u )
     1.54702931E-10    2     2000002        -2   # BR(~chi_40 -> ~u_R      ub)
     1.54702931E-10    2    -2000002         2   # BR(~chi_40 -> ~u_R*     u )
     3.37877330E-03    2     1000001        -1   # BR(~chi_40 -> ~d_L      db)
     3.37877330E-03    2    -1000001         1   # BR(~chi_40 -> ~d_L*     d )
     2.58847796E-11    2     2000001        -1   # BR(~chi_40 -> ~d_R      db)
     2.58847796E-11    2    -2000001         1   # BR(~chi_40 -> ~d_R*     d )
     3.39590669E-03    2     1000004        -4   # BR(~chi_40 -> ~c_L      cb)
     3.39590669E-03    2    -1000004         4   # BR(~chi_40 -> ~c_L*     c )
     1.54702379E-10    2     2000004        -4   # BR(~chi_40 -> ~c_R      cb)
     1.54702379E-10    2    -2000004         4   # BR(~chi_40 -> ~c_R*     c )
     3.37877330E-03    2     1000003        -3   # BR(~chi_40 -> ~s _L      sb)
     3.37877330E-03    2    -1000003         3   # BR(~chi_40 -> ~s _L*     s )
     2.58847796E-11    2     2000003        -3   # BR(~chi_40 -> ~s _R      sb)
     2.58847796E-11    2    -2000003         3   # BR(~chi_40 -> ~s _R*     s )
     7.76602128E-02    2     1000006        -6   # BR(~chi_40 -> ~t_1      tb)
     7.76602128E-02    2    -1000006         6   # BR(~chi_40 -> ~t_1*     t )
     9.02038887E-06    2     1000005        -5   # BR(~chi_40 -> ~b_1      bb)
     9.02038887E-06    2    -1000005         5   # BR(~chi_40 -> ~b_1*     b )
     7.83192038E-02    2     2000005        -5   # BR(~chi_40 -> ~b_2      bb)
     7.83192038E-02    2    -2000005         5   # BR(~chi_40 -> ~b_2*     b )
     4.19286481E-02    2     1000011       -11   # BR(~chi_40 -> ~e_L-     e+)
     4.19286481E-02    2    -1000011        11   # BR(~chi_40 -> ~e_L+     e-)
     7.11900628E-10    2     2000011       -11   # BR(~chi_40 -> ~e_R-     e+)
     7.11900628E-10    2    -2000011        11   # BR(~chi_40 -> ~e_R+     e-)
     4.19286481E-02    2     1000013       -13   # BR(~chi_40 -> ~mu_L-    mu+)
     4.19286481E-02    2    -1000013        13   # BR(~chi_40 -> ~mu_L+    mu-)
     7.11900628E-10    2     2000013       -13   # BR(~chi_40 -> ~mu_R-    mu+)
     7.11900628E-10    2    -2000013        13   # BR(~chi_40 -> ~mu_R+    mu-)
     4.87599952E-07    2     1000015       -15   # BR(~chi_40 -> ~tau_1-   tau+)
     4.87599952E-07    2    -1000015        15   # BR(~chi_40 -> ~tau_1+   tau-)
     4.87019528E-03    2     2000015       -15   # BR(~chi_40 -> ~tau_2-   tau+)
     4.87019528E-03    2    -2000015        15   # BR(~chi_40 -> ~tau_2+   tau-)
     4.19861914E-02    2     1000012       -12   # BR(~chi_40 -> ~nu_eL    nu_eb)
     4.19861914E-02    2    -1000012        12   # BR(~chi_40 -> ~nu_eL*   nu_e )
     4.19861914E-02    2     1000014       -14   # BR(~chi_40 -> ~nu_muL   nu_mub)
     4.19861914E-02    2    -1000014        14   # BR(~chi_40 -> ~nu_muL*  nu_mu )
     4.89110723E-03    2     1000016       -16   # BR(~chi_40 -> ~nu_tau1  nu_taub)
     4.89110723E-03    2    -1000016        16   # BR(~chi_40 -> ~nu_tau1* nu_tau )
#
#         PDG            Width
DECAY        25     4.28281188E-03   # h decays
#          BR         NDA      ID1       ID2
     6.23139750E-01    2           5        -5   # BR(h -> b       bb     )
     6.22729396E-02    2         -15        15   # BR(h -> tau+    tau-   )
     2.20733347E-04    2         -13        13   # BR(h -> mu+     mu-    )
     2.40447230E-04    2           3        -3   # BR(h -> s       sb     )
     2.01519842E-02    2           4        -4   # BR(h -> c       cb     )
     7.32869461E-02    2          21        21   # BR(h -> g       g      )
     2.11738720E-03    2          22        22   # BR(h -> gam     gam    )
     1.36198845E-03    2          22        23   # BR(h -> Z       gam    )
     1.80704327E-01    2          24       -24   # BR(h -> W+      W-     )
     2.22695052E-02    2          23        23   # BR(h -> Z       Z      )
     1.42339910E-02    2     1000022   1000022   # BR(h -> ~chi_10 ~chi_10)
#
#         PDG            Width
DECAY        35     4.28186279E+01   # H decays
#          BR         NDA      ID1       ID2
     8.21787925E-01    2           5        -5   # BR(H -> b       bb     )
     1.49573403E-01    2         -15        15   # BR(H -> tau+    tau-   )
     5.70418966E-04    2         -13        13   # BR(H -> mu+     mu-    )
     3.53662784E-04    2           3        -3   # BR(H -> s       sb     )
     4.39382432E-09    2           4        -4   # BR(H -> c       cb     )
     3.93346837E-04    2           6        -6   # BR(H -> t       tb     )
     8.50714943E-05    2          21        21   # BR(H -> g       g      )
     1.70007746E-08    2          22        22   # BR(H -> gam     gam    )
     3.25666378E-08    2          23        22   # BR(H -> Z       gam    )
     1.04882700E-06    2          24       -24   # BR(H -> W+      W-     )
     5.18691663E-07    2          23        23   # BR(H -> Z       Z      )
     4.88780929E-06    2          25        25   # BR(H -> h       h      )
     1.48774809E-04    2     1000024  -1000024   # BR(H -> ~chi_1+ ~chi_1-)
     1.86833384E-03    2     1000022   1000022   # BR(H -> ~chi_10 ~chi_10)
     2.84110294E-04    2     1000023   1000023   # BR(H -> ~chi_20 ~chi_20)
     3.45505326E-04    2     1000025   1000025   # BR(H -> ~chi_30 ~chi_30)
     1.20943471E-02    2     1000022   1000023   # BR(H -> ~chi_10 ~chi_20)
     1.16768597E-02    2     1000022   1000025   # BR(H -> ~chi_10 ~chi_30)
     8.09983138E-04    2     1000023   1000025   # BR(H -> ~chi_20 ~chi_30)
     2.03533783E-07    2     1000011  -1000011   # BR(H -> ~e_L-   ~e_L+  )
     2.03533783E-07    2     1000013  -1000013   # BR(H -> ~mu_L-  ~mu_L+ )
     6.70931004E-07    2     1000012  -1000012   # BR(H -> ~nu_eL  ~nu_eL*   )
     6.70931004E-07    2     1000014  -1000014   # BR(H -> ~nu_muL ~nu_muL*  )
#
#         PDG            Width
DECAY        36     4.28243272E+01   # A decays
#          BR         NDA      ID1       ID2
     8.21719712E-01    2           5        -5   # BR(A -> b       bb     )
     1.49556934E-01    2         -15        15   # BR(A -> tau+    tau-   )
     5.70349646E-04    2         -13        13   # BR(A -> mu+     mu-    )
     3.53629218E-04    2           3        -3   # BR(A -> s       sb     )
     4.27711594E-09    2           4        -4   # BR(A -> c       cb     )
     4.11991326E-04    2           6        -6   # BR(A -> t       tb     )
     1.11931063E-04    2          21        21   # BR(A -> g       g      )
     2.98844003E-08    2          22        22   # BR(A -> gam     gam    )
     4.41407681E-08    2          23        22   # BR(A -> Z       gam    )
     1.03651535E-06    2          23        25   # BR(A -> Z       h      )
     1.88703023E-04    2     1000024  -1000024   # BR(A -> ~chi_1+ ~chi_1-)
     1.85816715E-03    2     1000022   1000022   # BR(A -> ~chi_10 ~chi_10)
     3.37430603E-04    2     1000023   1000023   # BR(A -> ~chi_20 ~chi_20)
     4.79380544E-04    2     1000025   1000025   # BR(A -> ~chi_30 ~chi_30)
     1.16635222E-02    2     1000022   1000023   # BR(A -> ~chi_10 ~chi_20)
     1.21193768E-02    2     1000022   1000025   # BR(A -> ~chi_10 ~chi_30)
     6.27758090E-04    2     1000023   1000025   # BR(A -> ~chi_20 ~chi_30)
#
#         PDG            Width
DECAY        37     3.89633544E+01   # H+ decays
#          BR         NDA      ID1       ID2
     1.37176095E-03    2           4        -5   # BR(H+ -> c       bb     )
     1.64857826E-01    2         -15        16   # BR(H+ -> tau+    nu_tau )
     6.28701039E-04    2         -13        14   # BR(H+ -> mu+     nu_mu  )
     1.37174955E-05    2           2        -5   # BR(H+ -> u       bb     )
     1.94186801E-05    2           2        -3   # BR(H+ -> u       sb     )
     3.82222466E-04    2           4        -3   # BR(H+ -> c       sb     )
     8.02847478E-01    2           6        -5   # BR(H+ -> t       bb     )
     1.15549489E-06    2          24        25   # BR(H+ -> W+      h      )
     1.02304640E-11    2          24        36   # BR(H+ -> W+      A      )
     2.89181870E-02    2     1000024   1000022   # BR(H+ -> ~chi_1+ ~chi_10)
     8.12799794E-04    2     1000024   1000023   # BR(H+ -> ~chi_1+ ~chi_20)
     1.44998428E-04    2     1000024   1000025   # BR(H+ -> ~chi_1+ ~chi_30)
     8.67082916E-07    2    -1000011   1000012   # BR(H+ -> ~e_L+   ~nu_eL )
     8.67082916E-07    2    -1000013   1000014   # BR(H+ -> ~mu_L+  ~nu_muL)
