#
#                              ======================
#                              | THE SUSYHIT OUTPUT |
#                              ======================
#
#
#              ------------------------------------------------------
#              |     This is the output of the SUSY-HIT package     |
#              |  created by A.Djouadi, M.Muehlleitner and M.Spira. |
#              |  In case of problems with SUSY-HIT email to        |
#              |           margarete.muehlleitner@cern.ch           |
#              |           michael.spira@psi.ch                     |
#              |           abdelhak.djouadi@cern.ch                 |
#              ------------------------------------------------------
#
#              ------------------------------------------------------
#              |  SUSY Les Houches Accord - MSSM Spectrum + Decays  |
#              |              based on the decay programs           |
#              |                                                    |
#              |                     SDECAY 1.3b                    |
#              |                                                    |
#              |  Authors: M.Muhlleitner, A.Djouadi and Y.Mambrini  |
#              |  Ref.:    Comput.Phys.Commun.168(2005)46           |
#              |           [hep-ph/0311167]                         |
#              |                                                    |
#              |                     HDECAY 3.4                     |
#              |                                                    |
#              |  By: A.Djouadi,J.Kalinowski,M.Muhlleitner,M.Spira  |
#              |  Ref.:    Comput.Phys.Commun.108(1998)56           |
#              |           [hep-ph/9704448]                         |
#              |                                                    |
#              |                                                    |
#              |  If not stated otherwise all DRbar couplings and   |
#              |  soft SUSY breaking masses are given at the scale  |
#              |  Q=  0.22323280E+04
#              |                                                    |
#              ------------------------------------------------------
#
#
BLOCK DCINFO  # Decay Program information
     1   SDECAY/HDECAY # decay calculator
     2   1.3b  /3.4    # version number
#
BLOCK SPINFO  # Spectrum calculator information
     1     SOFTSUSY    # spectrum calculator               
     2     3.4.0       # version number                    
#
BLOCK MODSEL  # Model selection
     1     0   #  nonUniversal                                     
#
BLOCK SMINPUTS  # Standard Model inputs
         1     1.27908970E+02   # alpha_em^-1(M_Z)^MSbar
         2     1.16637870E-05   # G_F [GeV^-2]
         3     1.18400000E-01   # alpha_S(M_Z)^MSbar
         4     9.11876000E+01   # M_Z pole mass
         5     4.18000000E+00   # mb(mb)^MSbar
         6     1.73200000E+02   # mt pole mass
         7     1.77700000E+00   # mtau pole mass
#
BLOCK MINPAR  # Input parameters - minimal models
         3     3.23900000E+01   # tanb                
#
BLOCK EXTPAR  # Input parameters - non-minimal models
         0    -1.00000000E+00   # Set                 
         1     7.96810000E+02   # M_1(MX)             
         2     3.84643000E+03   # M_2(MX)             
         3     7.89050000E+02   # M_3(MX)             
        11    -3.70206000E+03   # At(MX)              
        12    -1.85086000E+03   # Ab(MX)              
        13    -3.59329000E+03   # Atau(MX)            
        23    -1.28537000E+03   # mu(MX)              
        26     3.70603000E+03   # mA(pole)            
        31     2.09148000E+03   # meL(MX)             
        32     2.09148000E+03   # mmuL(MX)            
        33     3.99731000E+03   # mtauL(MX)           
        34     1.56603000E+03   # meR(MX)             
        35     1.56603000E+03   # mmuR(MX)            
        36     3.29620000E+03   # mtauR(MX)           
        41     3.92499000E+03   # mqL1(MX)            
        42     3.92499000E+03   # mqL2(MX)            
        43     1.83858000E+03   # mqL3(MX)            
        44     9.54500000E+02   # muR(MX)             
        45     9.54500000E+02   # mcR(MX)             
        46     2.71462000E+03   # mtR(MX)             
        47     2.88278000E+03   # mdR(MX)             
        48     2.88278000E+03   # msR(MX)             
        49     7.53020000E+02   # mbR(MX)             
#
BLOCK MASS  # Mass Spectrum
# PDG code           mass       particle
        24     8.04041577E+01   # W+
        25     1.27048712E+02   # h
        35     3.70592669E+03   # H
        36     3.70602997E+03   # A
        37     3.70686795E+03   # H+
         5     4.81876030E+00   # b-quark pole mass calculated from mb(mb)_Msbar
   1000001     3.97316260E+03   # ~d_L
   2000001     2.91204714E+03   # ~d_R
   1000002     3.97249745E+03   # ~u_L
   2000002     1.00082901E+03   # ~u_R
   1000003     3.97316260E+03   # ~s_L
   2000003     2.91204714E+03   # ~s_R
   1000004     3.97249745E+03   # ~c_L
   2000004     1.00082901E+03   # ~c_R
   1000005     8.14581580E+02   # ~b_1
   2000005     1.85563030E+03   # ~b_2
   1000006     1.83898269E+03   # ~t_1
   2000006     2.69063161E+03   # ~t_2
   1000011     2.10346084E+03   # ~e_L
   2000011     1.57028826E+03   # ~e_R
   1000012     2.10165272E+03   # ~nu_eL
   1000013     2.10346084E+03   # ~mu_L
   2000013     1.57028826E+03   # ~mu_R
   1000014     2.10165272E+03   # ~nu_muL
   1000015     3.30042489E+03   # ~tau_1
   2000015     4.00969247E+03   # ~tau_2
   1000016     4.00848066E+03   # ~nu_tauL
   1000021     9.50102680E+02   # ~g
   1000022     7.87966652E+02   # ~chi_10
   1000023     1.32585982E+03   # ~chi_20
   1000025    -1.32684518E+03   # ~chi_30
   1000035     3.84652772E+03   # ~chi_40
   1000024     1.32515962E+03   # ~chi_1+
   1000037     3.84669171E+03   # ~chi_2+
#
BLOCK NMIX  # Neutralino Mixing Matrix
  1  1     9.98268927E-01   # N_11
  1  2    -7.30679987E-04   # N_12
  1  3    -5.09043990E-02   # N_13
  1  4    -2.94509265E-02   # N_14
  2  1     5.68264611E-02   # N_21
  2  2     2.15464541E-02   # N_22
  2  3     7.05686958E-01   # N_23
  2  4     7.05912474E-01   # N_24
  3  1    -1.51590091E-02   # N_31
  3  2     1.11258534E-02   # N_32
  3  3    -7.06654202E-01   # N_33
  3  4     7.07309167E-01   # N_34
  4  1    -3.26432773E-04   # N_41
  4  2     9.99705673E-01   # N_42
  4  3    -7.38228822E-03   # N_43
  4  4    -2.31076492E-02   # N_44
#
BLOCK UMIX  # Chargino Mixing Matrix U
  1  1     1.04926029E-02   # U_11
  1  2     9.99944951E-01   # U_12
  2  1    -9.99944951E-01   # U_21
  2  2     1.04926029E-02   # U_22
#
BLOCK VMIX  # Chargino Mixing Matrix V
  1  1     3.27981378E-02   # V_11
  1  2    -9.99461996E-01   # V_12
  2  1    -9.99461996E-01   # V_21
  2  2    -3.27981378E-02   # V_22
#
BLOCK STOPMIX  # Stop Mixing Matrix
  1  1     9.90591352E-01   # cos(theta_t)
  1  2     1.36853109E-01   # sin(theta_t)
  2  1    -1.36853109E-01   # -sin(theta_t)
  2  2     9.90591352E-01   # cos(theta_t)
#
BLOCK SBOTMIX  # Sbottom Mixing Matrix
  1  1    -3.91917586E-02   # cos(theta_b)
  1  2     9.99231708E-01   # sin(theta_b)
  2  1    -9.99231708E-01   # -sin(theta_b)
  2  2    -3.91917586E-02   # cos(theta_b)
#
BLOCK STAUMIX  # Stau Mixing Matrix
  1  1    -1.25600022E-02   # cos(theta_tau)
  1  2     9.99921120E-01   # sin(theta_tau)
  2  1    -9.99921120E-01   # -sin(theta_tau)
  2  2    -1.25600022E-02   # cos(theta_tau)
#
BLOCK ALPHA  # Higgs mixing
          -3.17102693E-02   # Mixing angle in the neutral Higgs boson sector
#
BLOCK HMIX Q=  2.23232800E+03  # DRbar Higgs Parameters
         1    -1.31605769E+03   # mu(Q)MSSM           
         2     3.15930566E+01   # tan                 
         3     2.43098726E+02   # higgs               
         4     1.42213435E+07   # mA^2(Q)MSSM         
#
BLOCK GAUGE Q=  2.23232800E+03  # The gauge couplings
     1     3.64299684E-01   # gprime(Q) DRbar
     2     6.34472620E-01   # g(Q) DRbar
     3     1.03959060E+00   # g3(Q) DRbar
#
BLOCK AU Q=  2.23232800E+03  # The trilinear couplings
  1  1     0.00000000E+00   # A_u(Q) DRbar
  2  2     0.00000000E+00   # A_c(Q) DRbar
  3  3    -3.70206000E+03   # A_t(Q) DRbar
#
BLOCK AD Q=  2.23232800E+03  # The trilinear couplings
  1  1     0.00000000E+00   # A_d(Q) DRbar
  2  2     0.00000000E+00   # A_s(Q) DRbar
  3  3    -1.85086000E+03   # A_b(Q) DRbar
#
BLOCK AE Q=  2.23232800E+03  # The trilinear couplings
  1  1     0.00000000E+00   # A_e(Q) DRbar
  2  2     0.00000000E+00   # A_mu(Q) DRbar
  3  3    -3.59329000E+03   # A_tau(Q) DRbar
#
BLOCK Yu Q=  2.23232800E+03  # The Yukawa couplings
  1  1     0.00000000E+00   # y_u(Q) DRbar
  2  2     0.00000000E+00   # y_c(Q) DRbar
  3  3     8.29632506E-01   # y_t(Q) DRbar
#
BLOCK Yd Q=  2.23232800E+03  # The Yukawa couplings
  1  1     0.00000000E+00   # y_d(Q) DRbar
  2  2     0.00000000E+00   # y_s(Q) DRbar
  3  3     5.18322381E-01   # y_b(Q) DRbar
#
BLOCK Ye Q=  2.23232800E+03  # The Yukawa couplings
  1  1     0.00000000E+00   # y_e(Q) DRbar
  2  2     0.00000000E+00   # y_mu(Q) DRbar
  3  3     3.13071926E-01   # y_tau(Q) DRbar
#
BLOCK MSOFT Q=  2.23232800E+03  # The soft SUSY breaking masses at the scale Q
         1     7.96810000E+02   # M_1(Q)              
         2     3.84643000E+03   # M_2(Q)              
         3     7.89050000E+02   # M_3(Q)              
        21     1.20535252E+07   # mH1^2(Q)            
        22    -1.60078630E+06   # mH2^2(Q)            
        31     2.09148000E+03   # meL(Q)              
        32     2.09148000E+03   # mmuL(Q)             
        33     3.99731000E+03   # mtauL(Q)            
        34     1.56603000E+03   # meR(Q)              
        35     1.56603000E+03   # mmuR(Q)             
        36     3.29620000E+03   # mtauR(Q)            
        41     3.92499000E+03   # mqL1(Q)             
        42     3.92499000E+03   # mqL2(Q)             
        43     1.83858000E+03   # mqL3(Q)             
        44     9.54499998E+02   # muR(Q)              
        45     9.54499998E+02   # mcR(Q)              
        46     2.71462000E+03   # mtR(Q)              
        47     2.88278000E+03   # mdR(Q)              
        48     2.88278000E+03   # msR(Q)              
        49     7.53019995E+02   # mbR(Q)              
#
Block HiggsBoundsInputHiggsCouplingsFermions
# ScalarNormEffCoupSq PseudoSNormEffCoupSq NP   IP1 IP2 IP2
    1.00432084E+00    0.00000000E+00        3  25   5   5  # h0-b-b eff. coupling^2, normalised to SM
    9.98116904E+02    0.00000000E+00        3  35   5   5  # H0-b-b eff. coupling^2, normalised to SM
    0.00000000E+00    9.98121225E+02        3  36   5   5  # A0-b-b eff. coupling^2, normalised to SM
#
    9.99995671E-01    0.00000000E+00        3  25   6   6  # h0-t-t eff. coupling^2, normalised to SM
    1.00621128E-03    0.00000000E+00        3  35   6   6  # H0-t-t eff. coupling^2, normalised to SM
    0.00000000E+00    1.00188231E-03        3  36   6   6  # A0-t-t eff. coupling^2, normalised to SM
#
    1.00432084E+00    0.00000000E+00        3  25  15  15  # h0-tau-tau eff. coupling^2, normalised to SM
    9.98116904E+02    0.00000000E+00        3  35  15  15  # H0-tau-tau eff. coupling^2, normalised to SM
    0.00000000E+00    9.98121225E+02        3  36  15  15  # A0-tau-tau eff. coupling^2, normalised to SM
#
Block HiggsBoundsInputHiggsCouplingsBosons
    9.99999995E-01        3  25  24  24  # h0-W-W eff. coupling^2, normalised to SM
    4.66613181E-09        3  35  24  24  # H0-W-W eff. coupling^2, normalised to SM
    0.00000000E+00        3  36  24  24  # A0-W-W eff. coupling^2, normalised to SM
#
    9.99999995E-01        3  25  23  23  # h0-Z-Z eff. coupling^2, normalised to SM
    4.66613181E-09        3  35  23  23  # H0-Z-Z eff. coupling^2, normalised to SM
    0.00000000E+00        3  36  23  23  # A0-Z-Z eff. coupling^2, normalised to SM
#
    8.77081096E-01        3  25  21  21  # h0-g-g eff. coupling^2, normalised to SM
    3.03038530E-14        3  35  21  21  # H0-g-g eff. coupling^2, normalised to SM
    3.37461218E-13        3  36  21  21  # A0-g-g eff. coupling^2, normalised to SM
#
    0.00000000E+00        3  25  25  23  # h0-h0-Z eff. coupling^2, normalised to SM
    0.00000000E+00        3  35  25  23  # H0-h0-Z eff. coupling^2, normalised to SM
    4.66613181E-09        3  36  25  23  # A0-h0-Z eff. coupling^2, normalised to SM
    0.00000000E+00        3  35  35  23  # H0-H0-Z eff. coupling^2, normalised to SM
    9.99999995E-01        3  36  35  23  # A0-H0-Z eff. coupling^2, normalised to SM
    0.00000000E+00        3  36  36  23  # A0-A0-Z eff. coupling^2, normalised to SM
#
    0.00000000E+00        4  25  21  21  23  # h0-g-g-Z eff. coupling^2, normalised to SM
    0.00000000E+00        4  35  21  21  23  # H0-g-g-Z eff. coupling^2, normalised to SM
    0.00000000E+00        4  36  21  21  23  # A0-g-g-Z eff. coupling^2, normalised to SM
#
#
#
#                             =================
#                             |The decay table|
#                             =================
#
# - The QCD corrections to the decays gluino -> squark  + quark
#                                     squark -> gaugino + quark_prime
#                                     squark -> squark_prime + Higgs
#                                     squark -> gluino  + quark
#   are included.
#
# - The multi-body decays for the inos, stops and sbottoms are included.
#
# - The loop induced decays for the gluino, neutralinos and stops
#   are included.
#
# - The SUSY decays of the top quark are included.
#
#
#         PDG            Width
DECAY         6     1.41711351E+00   # top decays
#          BR         NDA      ID1       ID2
     1.00000000E+00    2           5        24   # BR(t ->  b    W+)
#
#         PDG            Width
DECAY   1000021     1.65666619E+00   # gluino decays
#          BR         NDA      ID1       ID2
     5.00000000E-01    2     1000005        -5   # BR(~g -> ~b_1  bb)
     5.00000000E-01    2    -1000005         5   # BR(~g -> ~b_1* b )
#
#         PDG            Width
DECAY   1000006     6.77929418E+01   # stop1 decays
#          BR         NDA      ID1       ID2
     4.48708926E-03    2     1000022         6   # BR(~t_1 -> ~chi_10 t )
     3.56963341E-02    2     1000023         6   # BR(~t_1 -> ~chi_20 t )
     4.27852707E-02    2     1000025         6   # BR(~t_1 -> ~chi_30 t )
     3.52524575E-02    2     1000024         5   # BR(~t_1 -> ~chi_1+ b )
     8.37773545E-01    2     1000021         6   # BR(~t_1 -> ~g      t )
     4.40053035E-02    2     1000005        24   # BR(~t_1 -> ~b_1    W+)
#
#         PDG            Width
DECAY   2000006     2.27802882E+02   # stop2 decays
#          BR         NDA      ID1       ID2
     2.20486921E-02    2     1000022         6   # BR(~t_2 -> ~chi_10 t )
     4.69805180E-02    2     1000023         6   # BR(~t_2 -> ~chi_20 t )
     4.45141735E-02    2     1000025         6   # BR(~t_2 -> ~chi_30 t )
     9.09625310E-02    2     1000024         5   # BR(~t_2 -> ~chi_1+ b )
     5.05987401E-01    2     1000021         6   # BR(~t_2 -> ~g      t )
     7.28493840E-02    2     1000006        25   # BR(~t_2 -> ~t_1    h )
     7.47717682E-02    2     1000006        23   # BR(~t_2 -> ~t_1    Z )
     1.13784164E-03    2     1000005        24   # BR(~t_2 -> ~b_1    W+)
     1.40747690E-01    2     2000005        24   # BR(~t_2 -> ~b_2    W+)
#
#         PDG            Width
DECAY   1000005     2.13308451E-03   # sbottom1 decays
#          BR         NDA      ID1       ID2
     1.00000000E+00    2     1000022         5   # BR(~b_1 -> ~chi_10 b )
#
#         PDG            Width
DECAY   2000005     6.96223452E+01   # sbottom2 decays
#          BR         NDA      ID1       ID2
     2.71130610E-03    2     1000022         5   # BR(~b_2 -> ~chi_10 b )
     1.70101600E-02    2     1000023         5   # BR(~b_2 -> ~chi_20 b )
     1.70415478E-02    2     1000025         5   # BR(~b_2 -> ~chi_30 b )
     8.17877858E-02    2    -1000024         6   # BR(~b_2 -> ~chi_1- t )
     8.32163082E-01    2     1000021         5   # BR(~b_2 -> ~g      b )
     2.58900438E-02    2     1000005        25   # BR(~b_2 -> ~b_1    h )
     2.33960743E-02    2     1000005        23   # BR(~b_2 -> ~b_1    Z )
#
#         PDG            Width
DECAY   1000002     2.46562091E+02   # sup_L decays
#          BR         NDA      ID1       ID2
     2.09173811E-03    2     1000022         2   # BR(~u_L -> ~chi_10 u)
     5.19221991E-05    2     1000023         2   # BR(~u_L -> ~chi_20 u)
     3.33977931E-06    2     1000025         2   # BR(~u_L -> ~chi_30 u)
     2.63547955E-04    2     1000035         2   # BR(~u_L -> ~chi_40 u)
     1.06292035E-04    2     1000024         1   # BR(~u_L -> ~chi_1+ d)
     5.25585869E-04    2     1000037         1   # BR(~u_L -> ~chi_2+ d)
     9.96957574E-01    2     1000021         2   # BR(~u_L -> ~g      u)
#
#         PDG            Width
DECAY   2000002     1.01139068E+00   # sup_R decays
#          BR         NDA      ID1       ID2
     3.27558086E-01    2     1000022         2   # BR(~u_R -> ~chi_10 u)
     6.72441914E-01    2     1000021         2   # BR(~u_R -> ~g      u)
#
#         PDG            Width
DECAY   1000001     2.46590018E+02   # sdown_L decays
#          BR         NDA      ID1       ID2
     2.12415642E-03    2     1000022         1   # BR(~d_L -> ~chi_10 d)
     5.62432970E-06    2     1000023         1   # BR(~d_L -> ~chi_20 d)
     9.71617964E-06    2     1000025         1   # BR(~d_L -> ~chi_30 d)
     2.66226864E-04    2     1000035         1   # BR(~d_L -> ~chi_40 d)
     1.08799995E-05    2    -1000024         2   # BR(~d_L -> ~chi_1- u)
     5.31315833E-04    2    -1000037         2   # BR(~d_L -> ~chi_2- u)
     9.97052080E-01    2     1000021         1   # BR(~d_L -> ~g      d)
#
#         PDG            Width
DECAY   2000001     1.63280237E+02   # sdown_R decays
#          BR         NDA      ID1       ID2
     8.67775622E-03    2     1000022         1   # BR(~d_R -> ~chi_10 d)
     2.05835743E-05    2     1000023         1   # BR(~d_R -> ~chi_20 d)
     1.46360668E-06    2     1000025         1   # BR(~d_R -> ~chi_30 d)
     9.91300197E-01    2     1000021         1   # BR(~d_R -> ~g      d)
#
#         PDG            Width
DECAY   1000004     2.03211189E+02   # scharm_L decays
#          BR         NDA      ID1       ID2
     2.61693565E-03    2     1000022         4   # BR(~c_L -> ~chi_10 c)
     6.49762326E-05    2     1000023         4   # BR(~c_L -> ~chi_20 c)
     4.17945276E-06    2     1000025         4   # BR(~c_L -> ~chi_30 c)
     3.04704521E-04    2     1000035         4   # BR(~c_L -> ~chi_40 c)
     1.33015483E-04    2     1000024         3   # BR(~c_L -> ~chi_1+ s)
     6.07675985E-04    2     1000037         3   # BR(~c_L -> ~chi_2+ s)
     9.96268513E-01    2     1000021         4   # BR(~c_L -> ~g      c)
#
#         PDG            Width
DECAY   2000004     8.98093082E-01   # scharm_R decays
#          BR         NDA      ID1       ID2
     3.76613663E-01    2     1000022         4   # BR(~c_R -> ~chi_10 c)
     6.23386337E-01    2     1000021         4   # BR(~c_R -> ~g      c)
#
#         PDG            Width
DECAY   1000003     2.03229310E+02   # sstrange_L decays
#          BR         NDA      ID1       ID2
     2.65755744E-03    2     1000022         3   # BR(~s_L -> ~chi_10 s)
     7.03854259E-06    2     1000023         3   # BR(~s_L -> ~chi_20 s)
     1.21592758E-05    2     1000025         3   # BR(~s_L -> ~chi_30 s)
     3.07903729E-04    2     1000035         3   # BR(~s_L -> ~chi_40 s)
     1.36157197E-05    2    -1000024         4   # BR(~s_L -> ~chi_1- c)
     6.14407412E-04    2    -1000037         4   # BR(~s_L -> ~chi_2- c)
     9.96387318E-01    2     1000021         3   # BR(~s_L -> ~g      s)
#
#         PDG            Width
DECAY   2000003     1.34775339E+02   # sstrange_R decays
#          BR         NDA      ID1       ID2
     1.08510887E-02    2     1000022         3   # BR(~s_R -> ~chi_10 s)
     2.57242421E-05    2     1000023         3   # BR(~s_R -> ~chi_20 s)
     1.82913256E-06    2     1000025         3   # BR(~s_R -> ~chi_30 s)
     9.89121358E-01    2     1000021         3   # BR(~s_R -> ~g      s)
#
#         PDG            Width
DECAY   1000011     2.04954936E+00   # selectron_L decays
#          BR         NDA      ID1       ID2
     9.95280937E-01    2     1000022        11   # BR(~e_L -> ~chi_10 e-)
     4.38117372E-03    2     1000023        11   # BR(~e_L -> ~chi_20 e-)
     8.73883392E-06    2     1000025        11   # BR(~e_L -> ~chi_30 e-)
     3.29150835E-04    2    -1000024        12   # BR(~e_L -> ~chi_1- nu_e)
#
#         PDG            Width
DECAY   2000011     4.62816258E+00   # selectron_R decays
#          BR         NDA      ID1       ID2
     9.99489473E-01    2     1000022        11   # BR(~e_R -> ~chi_10 e-)
     4.76844955E-04    2     1000023        11   # BR(~e_R -> ~chi_20 e-)
     3.36825113E-05    2     1000025        11   # BR(~e_R -> ~chi_30 e-)
#
#         PDG            Width
DECAY   1000013     2.04954935E+00   # smuon_L decays
#          BR         NDA      ID1       ID2
     9.95280937E-01    2     1000022        13   # BR(~mu_L -> ~chi_10 mu-)
     4.38117369E-03    2     1000023        13   # BR(~mu_L -> ~chi_20 mu-)
     8.73883386E-06    2     1000025        13   # BR(~mu_L -> ~chi_30 mu-)
     3.29150837E-04    2    -1000024        14   # BR(~mu_L -> ~chi_1- nu_mu)
#
#         PDG            Width
DECAY   2000013     4.62816251E+00   # smuon_R decays
#          BR         NDA      ID1       ID2
     9.99489473E-01    2     1000022        13   # BR(~mu_R -> ~chi_10 mu-)
     4.76844910E-04    2     1000023        13   # BR(~mu_R -> ~chi_20 mu-)
     3.36825081E-05    2     1000025        13   # BR(~mu_R -> ~chi_30 mu-)
#
#         PDG            Width
DECAY   1000015     2.45438593E+01   # stau_1 decays
#          BR         NDA      ID1       ID2
     6.30032751E-01    2     1000022        15   # BR(~tau_1 -> ~chi_10  tau-)
     9.33819735E-02    2     1000023        15   # BR(~tau_1 -> ~chi_20  tau-)
     9.20558094E-02    2     1000025        15   # BR(~tau_1 -> ~chi_30  tau-)
     1.84529466E-01    2    -1000024        16   # BR(~tau_1 -> ~chi_1-  nu_tau)
#
#         PDG            Width
DECAY   2000015     1.16276081E+01   # stau_2 decays
#          BR         NDA      ID1       ID2
     4.19381695E-01    2     1000022        15   # BR(~tau_2 -> ~chi_10  tau-)
     2.69019251E-01    2     1000023        15   # BR(~tau_2 -> ~chi_20  tau-)
     2.66546842E-01    2     1000025        15   # BR(~tau_2 -> ~chi_30  tau-)
     8.76775507E-03    2     1000035        15   # BR(~tau_2 -> ~chi_40  tau-)
     4.04157413E-05    2    -1000024        16   # BR(~tau_2 -> ~chi_1-  nu_tau)
     1.75185103E-02    2    -1000037        16   # BR(~tau_2 -> ~chi_2-  nu_tau)
     9.56959322E-03    2     1000015        25   # BR(~tau_2 -> ~tau_1   h)
     9.15593805E-03    2     1000015        23   # BR(~tau_2 -> ~tau_1   Z)
#
#         PDG            Width
DECAY   1000012     2.05553445E+00   # snu_eL decays
#          BR         NDA      ID1       ID2
     9.96038766E-01    2     1000022        12   # BR(~nu_eL -> ~chi_10 nu_e)
     1.82223518E-04    2     1000023        12   # BR(~nu_eL -> ~chi_20 nu_e)
     5.82305459E-04    2     1000025        12   # BR(~nu_eL -> ~chi_30 nu_e)
     3.19670464E-03    2     1000024        11   # BR(~nu_eL -> ~chi_1+ e-)
#
#         PDG            Width
DECAY   1000014     2.05553445E+00   # snu_muL decays
#          BR         NDA      ID1       ID2
     9.96038766E-01    2     1000022        14   # BR(~nu_muL -> ~chi_10 nu_mu)
     1.82223518E-04    2     1000023        14   # BR(~nu_muL -> ~chi_20 nu_mu)
     5.82305459E-04    2     1000025        14   # BR(~nu_muL -> ~chi_30 nu_mu)
     3.19670460E-03    2     1000024        13   # BR(~nu_muL -> ~chi_1+ mu-)
#
#         PDG            Width
DECAY   1000016     1.16282264E+01   # snu_tauL decays
#          BR         NDA      ID1       ID2
     4.20200225E-01    2     1000022        16   # BR(~nu_tauL -> ~chi_10 nu_tau)
     1.34458895E-04    2     1000023        16   # BR(~nu_tauL -> ~chi_20 nu_tau)
     4.30359661E-04    2     1000025        16   # BR(~nu_tauL -> ~chi_30 nu_tau)
     8.65069872E-03    2     1000035        16   # BR(~nu_tauL -> ~chi_40 nu_tau)
     5.35604085E-01    2     1000024        15   # BR(~nu_tauL -> ~chi_1+ tau-)
     1.72496681E-02    2     1000037        15   # BR(~nu_tauL -> ~chi_2+ tau-)
     1.77305048E-02    2    -1000015       -24   # BR(~nu_tauL -> ~tau_1+ W-)
#
#         PDG            Width
DECAY   1000024     4.83290050E+00   # chargino1+ decays
#          BR         NDA      ID1       ID2
     8.64400017E-01    2    -1000005         6   # BR(~chi_1+ -> ~b_1*    t )
     1.35599983E-01    2     1000022        24   # BR(~chi_1+ -> ~chi_10  W+)
#
#         PDG            Width
DECAY   1000037     1.13097014E+02   # chargino2+ decays
#          BR         NDA      ID1       ID2
     2.35566084E-01    2     1000006        -5   # BR(~chi_2+ -> ~t_1     bb)
     3.42545323E-03    2     2000006        -5   # BR(~chi_2+ -> ~t_2     bb)
     3.46969601E-04    2    -1000005         6   # BR(~chi_2+ -> ~b_1*    t )
     2.37959990E-01    2    -2000005         6   # BR(~chi_2+ -> ~b_2*    t )
     6.69495545E-02    2     1000012       -11   # BR(~chi_2+ -> ~nu_eL   e+  )
     6.69495545E-02    2     1000014       -13   # BR(~chi_2+ -> ~nu_muL mu+ )
     6.69161331E-02    2    -1000011        12   # BR(~chi_2+ -> ~e_L+    nu_e)
     6.69161331E-02    2    -1000013        14   # BR(~chi_2+ -> ~mu_L+   nu_mu)
     5.16732509E-07    2    -1000015        16   # BR(~chi_2+ -> ~tau_1+  nu_tau)
     6.52784073E-02    2     1000024        23   # BR(~chi_2+ -> ~chi_1+  Z )
     3.47563237E-05    2     1000022        24   # BR(~chi_2+ -> ~chi_10  W+)
     6.23844180E-02    2     1000023        24   # BR(~chi_2+ -> ~chi_20  W+)
     6.30226863E-02    2     1000025        24   # BR(~chi_2+ -> ~chi_30  W+)
     6.42493427E-02    2     1000024        25   # BR(~chi_2+ -> ~chi_1+  h )
#
#         PDG            Width
DECAY   1000022     0.00000000E+00   # neutralino1 decays
#
#         PDG            Width
DECAY   1000023     4.80661862E+00   # neutralino2 decays
#          BR         NDA      ID1       ID2
     9.99768229E-03    2     1000022        23   # BR(~chi_20 -> ~chi_10   Z )
     1.34688261E-01    2     1000022        25   # BR(~chi_20 -> ~chi_10   h )
     5.67033728E-04    2     2000002        -2   # BR(~chi_20 -> ~u_R      ub)
     5.67033728E-04    2    -2000002         2   # BR(~chi_20 -> ~u_R*     u )
     5.67028524E-04    2     2000004        -4   # BR(~chi_20 -> ~c_R      cb)
     5.67028524E-04    2    -2000004         4   # BR(~chi_20 -> ~c_R*     c )
     4.26522966E-01    2     1000005        -5   # BR(~chi_20 -> ~b_1      bb)
     4.26522966E-01    2    -1000005         5   # BR(~chi_20 -> ~b_1*     b )
#
#         PDG            Width
DECAY   1000025     4.79489695E+00   # neutralino3 decays
#          BR         NDA      ID1       ID2
     1.31050633E-01    2     1000022        23   # BR(~chi_30 -> ~chi_10   Z )
     9.52090916E-03    2     1000022        25   # BR(~chi_30 -> ~chi_10   h )
     4.06364852E-05    2     2000002        -2   # BR(~chi_30 -> ~u_R      ub)
     4.06364852E-05    2    -2000002         2   # BR(~chi_30 -> ~u_R*     u )
     4.06361148E-05    2     2000004        -4   # BR(~chi_30 -> ~c_R      cb)
     4.06361148E-05    2    -2000004         4   # BR(~chi_30 -> ~c_R*     c )
     4.29632956E-01    2     1000005        -5   # BR(~chi_30 -> ~b_1      bb)
     4.29632956E-01    2    -1000005         5   # BR(~chi_30 -> ~b_1*     b )
#
#         PDG            Width
DECAY   1000035     1.13240579E+02   # neutralino4 decays
#          BR         NDA      ID1       ID2
     1.31503316E-05    2     1000022        23   # BR(~chi_40 -> ~chi_10   Z )
     1.35914021E-02    2     1000023        23   # BR(~chi_40 -> ~chi_20   Z )
     5.10748211E-02    2     1000025        23   # BR(~chi_40 -> ~chi_30   Z )
     6.35915958E-02    2     1000024       -24   # BR(~chi_40 -> ~chi_1+   W-)
     6.35915958E-02    2    -1000024        24   # BR(~chi_40 -> ~chi_1-   W+)
     2.03933204E-05    2     1000022        25   # BR(~chi_40 -> ~chi_10   h )
     5.04934346E-02    2     1000023        25   # BR(~chi_40 -> ~chi_20   h )
     1.36005887E-02    2     1000025        25   # BR(~chi_40 -> ~chi_30   h )
     1.07392507E-08    2     2000002        -2   # BR(~chi_40 -> ~u_R      ub)
     1.07392507E-08    2    -2000002         2   # BR(~chi_40 -> ~u_R*     u )
     5.67671497E-10    2     2000001        -1   # BR(~chi_40 -> ~d_R      db)
     5.67671497E-10    2    -2000001         1   # BR(~chi_40 -> ~d_R*     d )
     1.07392504E-08    2     2000004        -4   # BR(~chi_40 -> ~c_R      cb)
     1.07392504E-08    2    -2000004         4   # BR(~chi_40 -> ~c_R*     c )
     5.67671497E-10    2     2000003        -3   # BR(~chi_40 -> ~s _R      sb)
     5.67671497E-10    2    -2000003         3   # BR(~chi_40 -> ~s _R*     s )
     1.16511935E-01    2     1000006        -6   # BR(~chi_40 -> ~t_1      tb)
     1.16511935E-01    2    -1000006         6   # BR(~chi_40 -> ~t_1*     t )
     1.67610171E-03    2     2000006        -6   # BR(~chi_40 -> ~t_2      tb)
     1.67610171E-03    2    -2000006         6   # BR(~chi_40 -> ~t_2*     t )
     1.74992429E-04    2     1000005        -5   # BR(~chi_40 -> ~b_1      bb)
     1.74992429E-04    2    -1000005         5   # BR(~chi_40 -> ~b_1*     b )
     1.19966953E-01    2     2000005        -5   # BR(~chi_40 -> ~b_2      bb)
     1.19966953E-01    2    -2000005         5   # BR(~chi_40 -> ~b_2*     b )
     3.33832840E-02    2     1000011       -11   # BR(~chi_40 -> ~e_L-     e+)
     3.33832840E-02    2    -1000011        11   # BR(~chi_40 -> ~e_L+     e-)
     6.63667608E-09    2     2000011       -11   # BR(~chi_40 -> ~e_R-     e+)
     6.63667608E-09    2    -2000011        11   # BR(~chi_40 -> ~e_R+     e-)
     3.33832840E-02    2     1000013       -13   # BR(~chi_40 -> ~mu_L-    mu+)
     3.33832840E-02    2    -1000013        13   # BR(~chi_40 -> ~mu_L+    mu-)
     6.63667608E-09    2     2000013       -13   # BR(~chi_40 -> ~mu_R-    mu+)
     6.63667608E-09    2    -2000013        13   # BR(~chi_40 -> ~mu_R+    mu-)
     2.59719235E-07    2     1000015       -15   # BR(~chi_40 -> ~tau_1-   tau+)
     2.59719235E-07    2    -1000015        15   # BR(~chi_40 -> ~tau_1+   tau-)
     3.34573314E-02    2     1000012       -12   # BR(~chi_40 -> ~nu_eL    nu_eb)
     3.34573314E-02    2    -1000012        12   # BR(~chi_40 -> ~nu_eL*   nu_e )
     3.34573314E-02    2     1000014       -14   # BR(~chi_40 -> ~nu_muL   nu_mub)
     3.34573314E-02    2    -1000014        14   # BR(~chi_40 -> ~nu_muL*  nu_mu )
#
#         PDG            Width
DECAY        25     3.83879558E-03   # h decays
#          BR         NDA      ID1       ID2
     5.09071113E-01    2           5        -5   # BR(h -> b       bb     )
     6.88141054E-02    2         -15        15   # BR(h -> tau+    tau-   )
     2.43589528E-04    2         -13        13   # BR(h -> mu+     mu-    )
     2.65051051E-04    2           3        -3   # BR(h -> s       sb     )
     2.28897588E-02    2           4        -4   # BR(h -> c       cb     )
     8.66505479E-02    2          21        21   # BR(h -> g       g      )
     2.63013317E-03    2          22        22   # BR(h -> gam     gam    )
     1.94685765E-03    2          22        23   # BR(h -> Z       gam    )
     2.72359993E-01    2          24       -24   # BR(h -> W+      W-     )
     3.51288506E-02    2          23        23   # BR(h -> Z       Z      )
#
#         PDG            Width
DECAY        35     7.62189097E+01   # H decays
#          BR         NDA      ID1       ID2
     6.80089121E-01    2           5        -5   # BR(H -> b       bb     )
     1.06039122E-01    2         -15        15   # BR(H -> tau+    tau-   )
     3.90614271E-04    2         -13        13   # BR(H -> mu+     mu-    )
     2.38996095E-04    2           3        -3   # BR(H -> s       sb     )
     1.95275396E-08    2           4        -4   # BR(H -> c       cb     )
     1.92624175E-03    2           6        -6   # BR(H -> t       tb     )
     4.75274671E-06    2          21        21   # BR(H -> g       g      )
     3.86696032E-08    2          22        22   # BR(H -> gam     gam    )
     2.87344259E-09    2          23        22   # BR(H -> Z       gam    )
     1.00274785E-06    2          24       -24   # BR(H -> W+      W-     )
     5.00486314E-07    2          23        23   # BR(H -> Z       Z      )
     3.28448262E-06    2          25        25   # BR(H -> h       h      )
     1.54482618E-04    2     1000024  -1000024   # BR(H -> ~chi_1+ ~chi_1-)
     2.34878052E-04    2     1000022   1000022   # BR(H -> ~chi_10 ~chi_10)
     5.84128449E-06    2     1000023   1000023   # BR(H -> ~chi_20 ~chi_20)
     2.42848338E-05    2     1000025   1000025   # BR(H -> ~chi_30 ~chi_30)
     1.70914770E-02    2     1000022   1000023   # BR(H -> ~chi_10 ~chi_20)
     2.18267017E-02    2     1000022   1000025   # BR(H -> ~chi_10 ~chi_30)
     5.79370579E-05    2     1000023   1000025   # BR(H -> ~chi_20 ~chi_30)
     7.15603872E-08    2     2000002  -2000002   # BR(H -> ~u_R    ~u_R*  )
     7.15603872E-08    2     2000004  -2000004   # BR(H -> ~c_R    ~c_R*  )
     2.45959037E-03    2     1000006  -1000006   # BR(H -> ~t_1    ~t_1*  )
     7.21369852E-04    2     1000005  -1000005   # BR(H -> ~b_1    ~b_1*  )
     8.43647647E-02    2     1000005  -2000005   # BR(H -> ~b_1    ~b_2*  )
     8.43647647E-02    2     2000005  -1000005   # BR(H -> ~b_2    ~b_1*  )
     3.38557083E-08    2     2000011  -2000011   # BR(H -> ~e_R-   ~e_R+  )
     3.38557083E-08    2     2000013  -2000013   # BR(H -> ~mu_R-  ~mu_R+ )
#
#         PDG            Width
DECAY        36     7.60759184E+01   # A decays
#          BR         NDA      ID1       ID2
     6.81411569E-01    2           5        -5   # BR(A -> b       bb     )
     1.06241939E-01    2         -15        15   # BR(A -> tau+    tau-   )
     3.91360989E-04    2         -13        13   # BR(A -> mu+     mu-    )
     2.39468927E-04    2           3        -3   # BR(A -> s       sb     )
     1.96615386E-08    2           4        -4   # BR(A -> c       cb     )
     1.93228226E-03    2           6        -6   # BR(A -> t       tb     )
     1.58917331E-05    2          21        21   # BR(A -> g       g      )
     1.53909434E-08    2          22        22   # BR(A -> gam     gam    )
     1.31513227E-08    2          23        22   # BR(A -> Z       gam    )
     1.01905448E-06    2          23        25   # BR(A -> Z       h      )
     3.04235972E-04    2     1000024  -1000024   # BR(A -> ~chi_1+ ~chi_1-)
     2.66964453E-04    2     1000022   1000022   # BR(A -> ~chi_10 ~chi_10)
     1.05643387E-05    2     1000023   1000023   # BR(A -> ~chi_20 ~chi_20)
     5.66948518E-05    2     1000025   1000025   # BR(A -> ~chi_30 ~chi_30)
     2.18866887E-02    2     1000022   1000023   # BR(A -> ~chi_10 ~chi_20)
     1.71137647E-02    2     1000022   1000025   # BR(A -> ~chi_10 ~chi_30)
     2.70152504E-05    2     1000023   1000025   # BR(A -> ~chi_20 ~chi_30)
     8.50502463E-02    2     1000005  -2000005   # BR(A -> ~b_1    ~b_2*  )
     8.50502463E-02    2    -1000005   2000005   # BR(A -> ~b_1*   ~b_2   )
#
#         PDG            Width
DECAY        37     9.99533549E+01   # H+ decays
#          BR         NDA      ID1       ID2
     1.02616112E-03    2           4        -5   # BR(H+ -> c       bb     )
     8.08805328E-02    2         -15        16   # BR(H+ -> tau+    nu_tau )
     2.97937761E-04    2         -13        14   # BR(H+ -> mu+     nu_mu  )
     1.02616030E-05    2           2        -5   # BR(H+ -> u       bb     )
     9.12173995E-06    2           2        -3   # BR(H+ -> u       sb     )
     1.79557902E-04    2           4        -3   # BR(H+ -> c       sb     )
     6.11380978E-01    2           6        -5   # BR(H+ -> t       bb     )
     7.76459858E-07    2          24        25   # BR(H+ -> W+      h      )
     5.44020840E-15    2          24        36   # BR(H+ -> W+      A      )
     2.98232240E-02    2     1000024   1000022   # BR(H+ -> ~chi_1+ ~chi_10)
     1.39277023E-04    2     1000024   1000023   # BR(H+ -> ~chi_1+ ~chi_20)
     1.42545603E-05    2     1000024   1000025   # BR(H+ -> ~chi_1+ ~chi_30)
     2.67323731E-01    2     1000006  -1000005   # BR(H+ -> ~t_1    ~b_1*  )
     8.20070170E-04    2     1000006  -2000005   # BR(H+ -> ~t_1    ~b_2*  )
     8.09411617E-03    2     2000006  -1000005   # BR(H+ -> ~t_2    ~b_1*  )
