#
#                              ======================
#                              | THE SUSYHIT OUTPUT |
#                              ======================
#
#
#              ------------------------------------------------------
#              |     This is the output of the SUSY-HIT package     |
#              |  created by A.Djouadi, M.Muehlleitner and M.Spira. |
#              |  In case of problems with SUSY-HIT email to        |
#              |           margarete.muehlleitner@cern.ch           |
#              |           michael.spira@psi.ch                     |
#              |           abdelhak.djouadi@cern.ch                 |
#              ------------------------------------------------------
#
#              ------------------------------------------------------
#              |  SUSY Les Houches Accord - MSSM Spectrum + Decays  |
#              |              based on the decay programs           |
#              |                                                    |
#              |                     SDECAY 1.3b                    |
#              |                                                    |
#              |  Authors: M.Muhlleitner, A.Djouadi and Y.Mambrini  |
#              |  Ref.:    Comput.Phys.Commun.168(2005)46           |
#              |           [hep-ph/0311167]                         |
#              |                                                    |
#              |                     HDECAY 3.4                     |
#              |                                                    |
#              |  By: A.Djouadi,J.Kalinowski,M.Muhlleitner,M.Spira  |
#              |  Ref.:    Comput.Phys.Commun.108(1998)56           |
#              |           [hep-ph/9704448]                         |
#              |                                                    |
#              |                                                    |
#              |  If not stated otherwise all DRbar couplings and   |
#              |  soft SUSY breaking masses are given at the scale  |
#              |  Q=  0.32835270E+04
#              |                                                    |
#              ------------------------------------------------------
#
#
BLOCK DCINFO  # Decay Program information
     1   SDECAY/HDECAY # decay calculator
     2   1.3b  /3.4    # version number
#
BLOCK SPINFO  # Spectrum calculator information
     1     SOFTSUSY    # spectrum calculator               
     2     3.4.0       # version number                    
#
BLOCK MODSEL  # Model selection
     1     0   #  nonUniversal                                     
#
BLOCK SMINPUTS  # Standard Model inputs
         1     1.27908970E+02   # alpha_em^-1(M_Z)^MSbar
         2     1.16637870E-05   # G_F [GeV^-2]
         3     1.18400000E-01   # alpha_S(M_Z)^MSbar
         4     9.11876000E+01   # M_Z pole mass
         5     4.18000000E+00   # mb(mb)^MSbar
         6     1.73200000E+02   # mt pole mass
         7     1.77700000E+00   # mtau pole mass
#
BLOCK MINPAR  # Input parameters - minimal models
         3     3.56600000E+01   # tanb                
#
BLOCK EXTPAR  # Input parameters - non-minimal models
         0    -1.00000000E+00   # Set                 
         1     9.43100000E+02   # M_1(MX)             
         2    -6.24990000E+02   # M_2(MX)             
         3     1.24550000E+03   # M_3(MX)             
        11    -2.79210000E+03   # At(MX)              
        12    -4.63910000E+02   # Ab(MX)              
        13    -3.51355000E+03   # Atau(MX)            
        23     2.52795000E+03   # mu(MX)              
        26     3.17939000E+03   # mA(pole)            
        31     8.68690000E+02   # meL(MX)             
        32     8.68690000E+02   # mmuL(MX)            
        33     2.06140000E+03   # mtauL(MX)           
        34     3.98991000E+03   # meR(MX)             
        35     3.98991000E+03   # mmuR(MX)            
        36     1.03310000E+03   # mtauR(MX)           
        41     1.06815000E+03   # mqL1(MX)            
        42     1.06815000E+03   # mqL2(MX)            
        43     3.68171000E+03   # mqL3(MX)            
        44     3.51810000E+03   # muR(MX)             
        45     3.51810000E+03   # mcR(MX)             
        46     2.92549000E+03   # mtR(MX)             
        47     2.02808000E+03   # mdR(MX)             
        48     2.02808000E+03   # msR(MX)             
        49     1.10382000E+03   # mbR(MX)             
#
BLOCK MASS  # Mass Spectrum
# PDG code           mass       particle
        24     8.03768949E+01   # W+
        25     1.24198634E+02   # h
        35     3.17941752E+03   # H
        36     3.17939001E+03   # A
        37     3.18017814E+03   # H+
         5     4.81876030E+00   # b-quark pole mass calculated from mb(mb)_Msbar
   1000001     1.17238564E+03   # ~d_L
   2000001     2.08048498E+03   # ~d_R
   1000002     1.16987113E+03   # ~u_L
   2000002     3.55670684E+03   # ~u_R
   1000003     1.17238564E+03   # ~s_L
   2000003     2.08048498E+03   # ~s_R
   1000004     1.16987113E+03   # ~c_L
   2000004     3.55670684E+03   # ~c_R
   1000005     1.19399987E+03   # ~b_1
   2000005     3.70188214E+03   # ~b_2
   1000006     2.93867943E+03   # ~t_1
   2000006     3.70812575E+03   # ~t_2
   1000011     8.73344405E+02   # ~e_L
   2000011     3.99656069E+03   # ~e_R
   1000012     8.69520405E+02   # ~nu_eL
   1000013     8.73344405E+02   # ~mu_L
   2000013     3.99656069E+03   # ~mu_R
   1000014     8.69520405E+02   # ~nu_muL
   1000015     1.03329804E+03   # ~tau_1
   2000015     2.06018973E+03   # ~tau_2
   1000016     2.05646474E+03   # ~nu_tauL
   1000021     1.41847827E+03   # ~g
   1000022    -6.47938669E+02   # ~chi_10
   1000023     9.31131935E+02   # ~chi_20
   1000025     2.57274168E+03   # ~chi_30
   1000035    -2.57298903E+03   # ~chi_40
   1000024     6.48104714E+02   # ~chi_1+
   1000037     2.57392216E+03   # ~chi_2+
#
BLOCK NMIX  # Neutralino Mixing Matrix
  1  1     1.58267494E-04   # N_11
  1  2     9.99475727E-01   # N_12
  1  3    -3.16383310E-02   # N_13
  1  4    -6.87480350E-03   # N_14
  2  1     9.99763637E-01   # N_21
  2  2     4.28055194E-04   # N_22
  2  3     2.02439387E-02   # N_23
  2  4    -7.91638219E-03   # N_24
  3  1     1.99150762E-02   # N_31
  3  2    -1.75088938E-02   # N_32
  3  3    -7.06657192E-01   # N_33
  3  4     7.07059009E-01   # N_34
  4  1    -8.71975255E-03   # N_41
  4  2     2.72310002E-02   # N_42
  4  3     7.06558428E-01   # N_43
  4  4     7.07076818E-01   # N_44
#
BLOCK UMIX  # Chargino Mixing Matrix U
  1  1     9.98999184E-01   # U_11
  1  2    -4.47284158E-02   # U_12
  2  1     4.47284158E-02   # U_21
  2  2     9.98999184E-01   # U_22
#
BLOCK VMIX  # Chargino Mixing Matrix V
  1  1    -9.99952801E-01   # V_11
  1  2    -9.71579574E-03   # V_12
  2  1    -9.71579574E-03   # V_21
  2  2     9.99952801E-01   # V_22
#
BLOCK STOPMIX  # Stop Mixing Matrix
  1  1     8.12632829E-02   # cos(theta_t)
  1  2     9.96692670E-01   # sin(theta_t)
  2  1    -9.96692670E-01   # -sin(theta_t)
  2  2     8.12632829E-02   # cos(theta_t)
#
BLOCK SBOTMIX  # Sbottom Mixing Matrix
  1  1     1.34354302E-02   # cos(theta_b)
  1  2     9.99909741E-01   # sin(theta_b)
  2  1    -9.99909741E-01   # -sin(theta_b)
  2  2     1.34354302E-02   # cos(theta_b)
#
BLOCK STAUMIX  # Stau Mixing Matrix
  1  1     4.90421522E-02   # cos(theta_tau)
  1  2     9.98796710E-01   # sin(theta_tau)
  2  1    -9.98796710E-01   # -sin(theta_tau)
  2  2     4.90421522E-02   # cos(theta_tau)
#
BLOCK ALPHA  # Higgs mixing
          -2.91063217E-02   # Mixing angle in the neutral Higgs boson sector
#
BLOCK HMIX Q=  3.28352700E+03  # DRbar Higgs Parameters
         1     2.56662635E+03   # mu(Q)MSSM           
         2     3.43926076E+01   # tan                 
         3     2.42695674E+02   # higgs               
         4     9.36516805E+06   # mA^2(Q)MSSM         
#
BLOCK GAUGE Q=  3.28352700E+03  # The gauge couplings
     1     3.65172923E-01   # gprime(Q) DRbar
     2     6.40191499E-01   # g(Q) DRbar
     3     1.02551972E+00   # g3(Q) DRbar
#
BLOCK AU Q=  3.28352700E+03  # The trilinear couplings
  1  1     0.00000000E+00   # A_u(Q) DRbar
  2  2     0.00000000E+00   # A_c(Q) DRbar
  3  3    -2.79209999E+03   # A_t(Q) DRbar
#
BLOCK AD Q=  3.28352700E+03  # The trilinear couplings
  1  1     0.00000000E+00   # A_d(Q) DRbar
  2  2     0.00000000E+00   # A_s(Q) DRbar
  3  3    -4.63909996E+02   # A_b(Q) DRbar
#
BLOCK AE Q=  3.28352700E+03  # The trilinear couplings
  1  1     0.00000000E+00   # A_e(Q) DRbar
  2  2     0.00000000E+00   # A_mu(Q) DRbar
  3  3    -3.51355000E+03   # A_tau(Q) DRbar
#
BLOCK Yu Q=  3.28352700E+03  # The Yukawa couplings
  1  1     0.00000000E+00   # y_u(Q) DRbar
  2  2     0.00000000E+00   # y_c(Q) DRbar
  3  3     8.15439070E-01   # y_t(Q) DRbar
#
BLOCK Yd Q=  3.28352700E+03  # The Yukawa couplings
  1  1     0.00000000E+00   # y_d(Q) DRbar
  2  2     0.00000000E+00   # y_s(Q) DRbar
  3  3     3.70725627E-01   # y_b(Q) DRbar
#
BLOCK Ye Q=  3.28352700E+03  # The Yukawa couplings
  1  1     0.00000000E+00   # y_e(Q) DRbar
  2  2     0.00000000E+00   # y_mu(Q) DRbar
  3  3     3.36118001E-01   # y_tau(Q) DRbar
#
BLOCK MSOFT Q=  3.28352700E+03  # The soft SUSY breaking masses at the scale Q
         1     9.43100000E+02   # M_1(Q)              
         2    -6.24990000E+02   # M_2(Q)              
         3     1.24550000E+03   # M_3(Q)              
        21     3.50949580E+06   # mH1^2(Q)            
        22    -6.39308668E+06   # mH2^2(Q)            
        31     8.68690000E+02   # meL(Q)              
        32     8.68690000E+02   # mmuL(Q)             
        33     2.06140000E+03   # mtauL(Q)            
        34     3.98991000E+03   # meR(Q)              
        35     3.98991000E+03   # mmuR(Q)             
        36     1.03310000E+03   # mtauR(Q)            
        41     1.06814999E+03   # mqL1(Q)             
        42     1.06814999E+03   # mqL2(Q)             
        43     3.68170999E+03   # mqL3(Q)             
        44     3.51810000E+03   # muR(Q)              
        45     3.51810000E+03   # mcR(Q)              
        46     2.92548999E+03   # mtR(Q)              
        47     2.02808000E+03   # mdR(Q)              
        48     2.02808000E+03   # msR(Q)              
        49     1.10381999E+03   # mbR(Q)              
#
Block HiggsBoundsInputHiggsCouplingsFermions
# ScalarNormEffCoupSq PseudoSNormEffCoupSq NP   IP1 IP2 IP2
    1.00264968E+00    0.00000000E+00        3  25   5   5  # h0-b-b eff. coupling^2, normalised to SM
    1.18284881E+03    0.00000000E+00        3  35   5   5  # H0-b-b eff. coupling^2, normalised to SM
    0.00000000E+00    1.18285146E+03        3  36   5   5  # A0-b-b eff. coupling^2, normalised to SM
#
    9.99997760E-01    0.00000000E+00        3  25   6   6  # h0-t-t eff. coupling^2, normalised to SM
    8.47654768E-04    0.00000000E+00        3  35   6   6  # H0-t-t eff. coupling^2, normalised to SM
    0.00000000E+00    8.45414691E-04        3  36   6   6  # A0-t-t eff. coupling^2, normalised to SM
#
    1.00264968E+00    0.00000000E+00        3  25  15  15  # h0-tau-tau eff. coupling^2, normalised to SM
    1.18284881E+03    0.00000000E+00        3  35  15  15  # H0-tau-tau eff. coupling^2, normalised to SM
    0.00000000E+00    1.18285146E+03        3  36  15  15  # A0-tau-tau eff. coupling^2, normalised to SM
#
Block HiggsBoundsInputHiggsCouplingsBosons
    9.99999999E-01        3  25  24  24  # h0-W-W eff. coupling^2, normalised to SM
    1.48190871E-09        3  35  24  24  # H0-W-W eff. coupling^2, normalised to SM
    0.00000000E+00        3  36  24  24  # A0-W-W eff. coupling^2, normalised to SM
#
    9.99999999E-01        3  25  23  23  # h0-Z-Z eff. coupling^2, normalised to SM
    1.48190871E-09        3  35  23  23  # H0-Z-Z eff. coupling^2, normalised to SM
    0.00000000E+00        3  36  23  23  # A0-Z-Z eff. coupling^2, normalised to SM
#
    8.89550718E-01        3  25  21  21  # h0-g-g eff. coupling^2, normalised to SM
    2.80518429E-13        3  35  21  21  # H0-g-g eff. coupling^2, normalised to SM
    1.67854990E-12        3  36  21  21  # A0-g-g eff. coupling^2, normalised to SM
#
    0.00000000E+00        3  25  25  23  # h0-h0-Z eff. coupling^2, normalised to SM
    0.00000000E+00        3  35  25  23  # H0-h0-Z eff. coupling^2, normalised to SM
    1.48190871E-09        3  36  25  23  # A0-h0-Z eff. coupling^2, normalised to SM
    0.00000000E+00        3  35  35  23  # H0-H0-Z eff. coupling^2, normalised to SM
    9.99999999E-01        3  36  35  23  # A0-H0-Z eff. coupling^2, normalised to SM
    0.00000000E+00        3  36  36  23  # A0-A0-Z eff. coupling^2, normalised to SM
#
    0.00000000E+00        4  25  21  21  23  # h0-g-g-Z eff. coupling^2, normalised to SM
    0.00000000E+00        4  35  21  21  23  # H0-g-g-Z eff. coupling^2, normalised to SM
    0.00000000E+00        4  36  21  21  23  # A0-g-g-Z eff. coupling^2, normalised to SM
#
#
#
#                             =================
#                             |The decay table|
#                             =================
#
# - The QCD corrections to the decays gluino -> squark  + quark
#                                     squark -> gaugino + quark_prime
#                                     squark -> squark_prime + Higgs
#                                     squark -> gluino  + quark
#   are included.
#
# - The multi-body decays for the inos, stops and sbottoms are included.
#
# - The loop induced decays for the gluino, neutralinos and stops
#   are included.
#
# - The SUSY decays of the top quark are included.
#
#
#         PDG            Width
DECAY         6     1.44399705E+00   # top decays
#          BR         NDA      ID1       ID2
     1.00000000E+00    2           5        24   # BR(t ->  b    W+)
#
#         PDG            Width
DECAY   1000021     1.41181841E+01   # gluino decays
#          BR         NDA      ID1       ID2
     9.93767320E-02    2     1000001        -1   # BR(~g -> ~d_L  db)
     9.93767320E-02    2    -1000001         1   # BR(~g -> ~d_L* d )
     1.01221155E-01    2     1000002        -2   # BR(~g -> ~u_L  ub)
     1.01221155E-01    2    -1000002         2   # BR(~g -> ~u_L* u )
     9.93767320E-02    2     1000003        -3   # BR(~g -> ~s_L  sb)
     9.93767320E-02    2    -1000003         3   # BR(~g -> ~s_L* s )
     1.01219336E-01    2     1000004        -4   # BR(~g -> ~c_L  cb)
     1.01219336E-01    2    -1000004         4   # BR(~g -> ~c_L* c )
     9.88060446E-02    2     1000005        -5   # BR(~g -> ~b_1  bb)
     9.88060446E-02    2    -1000005         5   # BR(~g -> ~b_1* b )
#
#         PDG            Width
DECAY   1000006     1.06124084E+02   # stop1 decays
#          BR         NDA      ID1       ID2
     4.80780008E-04    2     1000022         6   # BR(~t_1 -> ~chi_10 t )
     5.21895481E-02    2     1000023         6   # BR(~t_1 -> ~chi_20 t )
     8.09581138E-03    2     1000025         6   # BR(~t_1 -> ~chi_30 t )
     9.35737232E-03    2     1000035         6   # BR(~t_1 -> ~chi_40 t )
     9.71749103E-04    2     1000024         5   # BR(~t_1 -> ~chi_1+ b )
     1.97578835E-02    2     1000037         5   # BR(~t_1 -> ~chi_2+ b )
     9.09042554E-01    2     1000021         6   # BR(~t_1 -> ~g      t )
     1.04301453E-04    2     1000005        24   # BR(~t_1 -> ~b_1    W+)
#
#         PDG            Width
DECAY   2000006     2.22379203E+02   # stop2 decays
#          BR         NDA      ID1       ID2
     6.32242361E-02    2     1000022         6   # BR(~t_2 -> ~chi_10 t )
     2.27471874E-03    2     1000023         6   # BR(~t_2 -> ~chi_20 t )
     2.99626267E-02    2     1000025         6   # BR(~t_2 -> ~chi_30 t )
     2.86160085E-02    2     1000035         6   # BR(~t_2 -> ~chi_40 t )
     1.27268273E-01    2     1000024         5   # BR(~t_2 -> ~chi_1+ b )
     1.24720423E-02    2     1000037         5   # BR(~t_2 -> ~chi_2+ b )
     6.69357617E-01    2     1000021         6   # BR(~t_2 -> ~g      t )
     2.35659580E-02    2     1000006        25   # BR(~t_2 -> ~t_1    h )
     2.46119600E-02    2     1000006        23   # BR(~t_2 -> ~t_1    Z )
     1.86465588E-02    2     1000005        24   # BR(~t_2 -> ~b_1    W+)
#
#         PDG            Width
DECAY   1000005     1.18808633E-01   # sbottom1 decays
#          BR         NDA      ID1       ID2
     3.15575980E-02    2     1000022         5   # BR(~b_1 -> ~chi_10 b )
     9.10814624E-01    2     1000023         5   # BR(~b_1 -> ~chi_20 b )
     5.76277782E-02    2    -1000024         6   # BR(~b_1 -> ~chi_1- t )
#
#         PDG            Width
DECAY   2000005     2.23673789E+02   # sbottom2 decays
#          BR         NDA      ID1       ID2
     6.33198930E-02    2     1000022         5   # BR(~b_2 -> ~chi_10 b )
     2.13197564E-03    2     1000023         5   # BR(~b_2 -> ~chi_20 b )
     6.05838183E-03    2     1000025         5   # BR(~b_2 -> ~chi_30 b )
     6.05751978E-03    2     1000035         5   # BR(~b_2 -> ~chi_40 b )
     1.25812936E-01    2    -1000024         6   # BR(~b_2 -> ~chi_1- t )
     5.81408089E-02    2    -1000037         6   # BR(~b_2 -> ~chi_2- t )
     6.72132527E-01    2     1000021         5   # BR(~b_2 -> ~g      b )
     9.80861985E-03    2     1000005        25   # BR(~b_2 -> ~b_1    h )
     9.54165665E-03    2     1000005        23   # BR(~b_2 -> ~b_1    Z )
     4.69956817E-02    2     1000006       -24   # BR(~b_2 -> ~t_1    W-)
#
#         PDG            Width
DECAY   1000002     6.83366776E+00   # sup_L decays
#          BR         NDA      ID1       ID2
     3.32092173E-01    2     1000022         2   # BR(~u_L -> ~chi_10 u)
     3.42792916E-03    2     1000023         2   # BR(~u_L -> ~chi_20 u)
     6.64479898E-01    2     1000024         1   # BR(~u_L -> ~chi_1+ d)
#
#         PDG            Width
DECAY   2000002     2.00678805E+02   # sup_R decays
#          BR         NDA      ID1       ID2
     9.47327818E-10    2     1000022         2   # BR(~u_R -> ~chi_10 u)
     3.51028676E-02    2     1000023         2   # BR(~u_R -> ~chi_20 u)
     3.68292938E-06    2     1000025         2   # BR(~u_R -> ~chi_30 u)
     7.05759062E-07    2     1000035         2   # BR(~u_R -> ~chi_40 u)
     9.64892743E-01    2     1000021         2   # BR(~u_R -> ~g      u)
#
#         PDG            Width
DECAY   1000001     6.86409572E+00   # sdown_L decays
#          BR         NDA      ID1       ID2
     3.32484016E-01    2     1000022         1   # BR(~d_L -> ~chi_10 d)
     3.43851010E-03    2     1000023         1   # BR(~d_L -> ~chi_20 d)
     6.64077474E-01    2    -1000024         2   # BR(~d_L -> ~chi_1- u)
#
#         PDG            Width
DECAY   2000001     4.66228552E+01   # sdown_R decays
#          BR         NDA      ID1       ID2
     5.16095987E-10    2     1000022         1   # BR(~d_R -> ~chi_10 d)
     1.61951996E-02    2     1000023         1   # BR(~d_R -> ~chi_20 d)
     9.83804800E-01    2     1000021         1   # BR(~d_R -> ~g      d)
#
#         PDG            Width
DECAY   1000004     6.89472164E+00   # scharm_L decays
#          BR         NDA      ID1       ID2
     3.32109973E-01    2     1000022         4   # BR(~c_L -> ~chi_10 c)
     3.37257084E-03    2     1000023         4   # BR(~c_L -> ~chi_20 c)
     6.64517456E-01    2     1000024         3   # BR(~c_L -> ~chi_1+ s)
#
#         PDG            Width
DECAY   2000004     1.47610551E+02   # scharm_R decays
#          BR         NDA      ID1       ID2
     1.33037321E-09    2     1000022         4   # BR(~c_R -> ~chi_10 c)
     4.92754989E-02    2     1000023         4   # BR(~c_R -> ~chi_20 c)
     5.12246204E-06    2     1000025         4   # BR(~c_R -> ~chi_30 c)
     9.81611869E-07    2     1000035         4   # BR(~c_R -> ~chi_40 c)
     9.50718396E-01    2     1000021         4   # BR(~c_R -> ~g      c)
#
#         PDG            Width
DECAY   1000003     6.92676024E+00   # sstrange_L decays
#          BR         NDA      ID1       ID2
     3.32504387E-01    2     1000022         3   # BR(~s_L -> ~chi_10 s)
     3.38368540E-03    2     1000023         3   # BR(~s_L -> ~chi_20 s)
     6.64111928E-01    2    -1000024         4   # BR(~s_L -> ~chi_1- c)
#
#         PDG            Width
DECAY   2000003     3.40267421E+01   # sstrange_R decays
#          BR         NDA      ID1       ID2
     7.36249555E-10    2     1000022         3   # BR(~s_R -> ~chi_10 s)
     2.30410185E-02    2     1000023         3   # BR(~s_R -> ~chi_20 s)
     9.76958981E-01    2     1000021         3   # BR(~s_R -> ~g      s)
#
#         PDG            Width
DECAY   1000011     2.15360389E+00   # selectron_L decays
#          BR         NDA      ID1       ID2
     3.33864659E-01    2     1000022        11   # BR(~e_L -> ~chi_10 e-)
     6.66135341E-01    2    -1000024        12   # BR(~e_L -> ~chi_1- nu_e)
#
#         PDG            Width
DECAY   2000011     1.89601220E+01   # selectron_R decays
#          BR         NDA      ID1       ID2
     2.65613677E-08    2     1000022        11   # BR(~e_R -> ~chi_10 e-)
     9.99818706E-01    2     1000023        11   # BR(~e_R -> ~chi_20 e-)
     1.52113911E-04    2     1000025        11   # BR(~e_R -> ~chi_30 e-)
     2.91537957E-05    2     1000035        11   # BR(~e_R -> ~chi_40 e-)
#
#         PDG            Width
DECAY   1000013     2.15360379E+00   # smuon_L decays
#          BR         NDA      ID1       ID2
     3.33864626E-01    2     1000022        13   # BR(~mu_L -> ~chi_10 mu-)
     6.66135374E-01    2    -1000024        14   # BR(~mu_L -> ~chi_1- nu_mu)
#
#         PDG            Width
DECAY   2000013     1.89601220E+01   # smuon_R decays
#          BR         NDA      ID1       ID2
     2.65613677E-08    2     1000022        13   # BR(~mu_R -> ~chi_10 mu-)
     9.99818706E-01    2     1000023        13   # BR(~mu_R -> ~chi_20 mu-)
     1.52113911E-04    2     1000025        13   # BR(~mu_R -> ~chi_30 mu-)
     2.91537957E-05    2     1000035        13   # BR(~mu_R -> ~chi_40 mu-)
#
#         PDG            Width
DECAY   1000015     2.17897899E-01   # stau_1 decays
#          BR         NDA      ID1       ID2
     3.74091148E-02    2     1000022        15   # BR(~tau_1 -> ~chi_10  tau-)
     8.87915183E-01    2     1000023        15   # BR(~tau_1 -> ~chi_20  tau-)
     7.46757022E-02    2    -1000024        16   # BR(~tau_1 -> ~chi_1-  nu_tau)
#
#         PDG            Width
DECAY   2000015     2.77475691E+01   # stau_2 decays
#          BR         NDA      ID1       ID2
     2.44546806E-01    2     1000022        15   # BR(~tau_2 -> ~chi_10  tau-)
     6.27476586E-02    2     1000023        15   # BR(~tau_2 -> ~chi_20  tau-)
     4.88200414E-01    2    -1000024        16   # BR(~tau_2 -> ~chi_1-  nu_tau)
     1.02857377E-01    2     1000015        25   # BR(~tau_2 -> ~tau_1   h)
     1.01647745E-01    2     1000015        23   # BR(~tau_2 -> ~tau_1   Z)
#
#         PDG            Width
DECAY   1000012     2.10052438E+00   # snu_eL decays
#          BR         NDA      ID1       ID2
     3.33365639E-01    2     1000022        12   # BR(~nu_eL -> ~chi_10 nu_e)
     6.66634361E-01    2     1000024        11   # BR(~nu_eL -> ~chi_1+ e-)
#
#         PDG            Width
DECAY   1000014     2.10052417E+00   # snu_muL decays
#          BR         NDA      ID1       ID2
     3.33365673E-01    2     1000022        14   # BR(~nu_muL -> ~chi_10 nu_mu)
     6.66634327E-01    2     1000024        13   # BR(~nu_muL -> ~chi_1+ mu-)
#
#         PDG            Width
DECAY   1000016     2.75801759E+01   # snu_tauL decays
#          BR         NDA      ID1       ID2
     2.46318989E-01    2     1000022        16   # BR(~nu_tauL -> ~chi_10 nu_tau)
     6.23856639E-02    2     1000023        16   # BR(~nu_tauL -> ~chi_20 nu_tau)
     4.93426836E-01    2     1000024        15   # BR(~nu_tauL -> ~chi_1+ tau-)
     1.97868511E-01    2    -1000015       -24   # BR(~nu_tauL -> ~tau_1+ W-)
#
#         PDG            Width
DECAY   1000024     3.79659810E-15   # chargino1+ decays
#           BR         NDA      ID1       ID2       ID3
     1.94408550E-02    3     1000022       -11        12   # BR(~chi_1+ -> ~chi_10 e+   nu_e)
     2.31077010E-03    3     1000022       -13        14   # BR(~chi_1+ -> ~chi_10 mu+  nu_mu)
     9.78248370E-01    2     1000022       211             # BR(~chi_1+ -> ~chi_10 pi+)
#
#         PDG            Width
DECAY   1000037     2.51212423E+01   # chargino2+ decays
#          BR         NDA      ID1       ID2
     7.20117849E-05    2     1000002        -1   # BR(~chi_2+ -> ~u_L     db)
     1.52281719E-03    2    -1000001         2   # BR(~chi_2+ -> ~d_L*    u )
     7.20117838E-05    2     1000004        -3   # BR(~chi_2+ -> ~c_L     sb)
     1.52281679E-03    2    -1000003         4   # BR(~chi_2+ -> ~s_L*     c )
     2.59712531E-01    2    -1000005         6   # BR(~chi_2+ -> ~b_1*    t )
     3.09441816E-05    2     1000012       -11   # BR(~chi_2+ -> ~nu_eL   e+  )
     3.09441816E-05    2     1000014       -13   # BR(~chi_2+ -> ~nu_muL mu+ )
     1.50376093E-02    2     1000016       -15   # BR(~chi_2+ -> ~nu_tau1 tau+)
     6.54338345E-04    2    -1000011        12   # BR(~chi_2+ -> ~e_L+    nu_e)
     6.54338345E-04    2    -1000013        14   # BR(~chi_2+ -> ~mu_L+   nu_mu)
     7.99898508E-02    2    -1000015        16   # BR(~chi_2+ -> ~tau_1+  nu_tau)
     2.67307736E-04    2    -2000015        16   # BR(~chi_2+ -> ~tau_2+  nu_tau)
     1.89276354E-01    2     1000024        23   # BR(~chi_2+ -> ~chi_1+  Z )
     1.84056903E-01    2     1000022        24   # BR(~chi_2+ -> ~chi_10  W+)
     6.63370050E-02    2     1000023        24   # BR(~chi_2+ -> ~chi_20  W+)
     2.00762217E-01    2     1000024        25   # BR(~chi_2+ -> ~chi_1+  h )
#
#         PDG            Width
DECAY   1000022     0.00000000E+00   # neutralino1 decays
#
#         PDG            Width
DECAY   1000023     7.61877019E-02   # neutralino2 decays
#          BR         NDA      ID1       ID2
     1.94535715E-04    2     1000022        23   # BR(~chi_20 -> ~chi_10   Z )
     2.32812004E-04    2     1000024       -24   # BR(~chi_20 -> ~chi_1+   W-)
     2.32812004E-04    2    -1000024        24   # BR(~chi_20 -> ~chi_1-   W+)
     2.24195537E-05    2     1000022        25   # BR(~chi_20 -> ~chi_10   h )
     1.17372349E-01    2     1000011       -11   # BR(~chi_20 -> ~e_L-     e+)
     1.17372349E-01    2    -1000011        11   # BR(~chi_20 -> ~e_L+     e-)
     1.17372349E-01    2     1000013       -13   # BR(~chi_20 -> ~mu_L-    mu+)
     1.17372349E-01    2    -1000013        13   # BR(~chi_20 -> ~mu_L+    mu-)
     1.32457006E-01    2     1000012       -12   # BR(~chi_20 -> ~nu_eL    nu_eb)
     1.32457006E-01    2    -1000012        12   # BR(~chi_20 -> ~nu_eL*   nu_e )
     1.32457006E-01    2     1000014       -14   # BR(~chi_20 -> ~nu_muL   nu_mub)
     1.32457006E-01    2    -1000014        14   # BR(~chi_20 -> ~nu_muL*  nu_mu )
#
#         PDG            Width
DECAY   1000025     2.46824076E+01   # neutralino3 decays
#          BR         NDA      ID1       ID2
     1.36132703E-01    2     1000022        23   # BR(~chi_30 -> ~chi_10   Z )
     1.11956224E-02    2     1000023        23   # BR(~chi_30 -> ~chi_20   Z )
     1.87207020E-01    2     1000024       -24   # BR(~chi_30 -> ~chi_1+   W-)
     1.87207020E-01    2    -1000024        24   # BR(~chi_30 -> ~chi_1-   W+)
     5.84665405E-02    2     1000022        25   # BR(~chi_30 -> ~chi_10   h )
     5.84824653E-02    2     1000023        25   # BR(~chi_30 -> ~chi_20   h )
     7.30324615E-05    2     1000002        -2   # BR(~chi_30 -> ~u_L      ub)
     7.30324615E-05    2    -1000002         2   # BR(~chi_30 -> ~u_L*     u )
     1.75497406E-04    2     1000001        -1   # BR(~chi_30 -> ~d_L      db)
     1.75497406E-04    2    -1000001         1   # BR(~chi_30 -> ~d_L*     d )
     4.31649072E-06    2     2000001        -1   # BR(~chi_30 -> ~d_R      db)
     4.31649072E-06    2    -2000001         1   # BR(~chi_30 -> ~d_R*     d )
     7.30324423E-05    2     1000004        -4   # BR(~chi_30 -> ~c_L      cb)
     7.30324423E-05    2    -1000004         4   # BR(~chi_30 -> ~c_L*     c )
     1.75497406E-04    2     1000003        -3   # BR(~chi_30 -> ~s _L      sb)
     1.75497406E-04    2    -1000003         3   # BR(~chi_30 -> ~s _L*     s )
     4.31649072E-06    2     2000003        -3   # BR(~chi_30 -> ~s _R      sb)
     4.31649072E-06    2    -2000003         3   # BR(~chi_30 -> ~s _R*     s )
     1.31267776E-01    2     1000005        -5   # BR(~chi_30 -> ~b_1      bb)
     1.31267776E-01    2    -1000005         5   # BR(~chi_30 -> ~b_1*     b )
     6.28895352E-06    2     1000011       -11   # BR(~chi_30 -> ~e_L-     e+)
     6.28895352E-06    2    -1000011        11   # BR(~chi_30 -> ~e_L+     e-)
     6.28895352E-06    2     1000013       -13   # BR(~chi_30 -> ~mu_L-    mu+)
     6.28895352E-06    2    -1000013        13   # BR(~chi_30 -> ~mu_L+    mu-)
     4.10006624E-02    2     1000015       -15   # BR(~chi_30 -> ~tau_1-   tau+)
     4.10006624E-02    2    -1000015        15   # BR(~chi_30 -> ~tau_1+   tau-)
     7.56665798E-03    2     2000015       -15   # BR(~chi_30 -> ~tau_2-   tau+)
     7.56665798E-03    2    -2000015        15   # BR(~chi_30 -> ~tau_2+   tau-)
     1.38930672E-04    2     1000012       -12   # BR(~chi_30 -> ~nu_eL    nu_eb)
     1.38930672E-04    2    -1000012        12   # BR(~chi_30 -> ~nu_eL*   nu_e )
     1.38930672E-04    2     1000014       -14   # BR(~chi_30 -> ~nu_muL   nu_mub)
     1.38930672E-04    2    -1000014        14   # BR(~chi_30 -> ~nu_muL*  nu_mu )
     2.30858926E-05    2     1000016       -16   # BR(~chi_30 -> ~nu_tau1  nu_taub)
     2.30858926E-05    2    -1000016        16   # BR(~chi_30 -> ~nu_tau1* nu_tau )
#
#         PDG            Width
DECAY   1000035     2.49162542E+01   # neutralino4 decays
#          BR         NDA      ID1       ID2
     5.59637547E-02    2     1000022        23   # BR(~chi_40 -> ~chi_10   Z )
     5.75282150E-02    2     1000023        23   # BR(~chi_40 -> ~chi_20   Z )
     1.85606089E-01    2     1000024       -24   # BR(~chi_40 -> ~chi_1+   W-)
     1.85606089E-01    2    -1000024        24   # BR(~chi_40 -> ~chi_1-   W+)
     1.44592885E-01    2     1000022        25   # BR(~chi_40 -> ~chi_10   h )
     1.13009587E-02    2     1000023        25   # BR(~chi_40 -> ~chi_20   h )
     2.51314651E-04    2     1000002        -2   # BR(~chi_40 -> ~u_L      ub)
     2.51314651E-04    2    -1000002         2   # BR(~chi_40 -> ~u_L*     u )
     3.19999526E-04    2     1000001        -1   # BR(~chi_40 -> ~d_L      db)
     3.19999526E-04    2    -1000001         1   # BR(~chi_40 -> ~d_L*     d )
     8.20412862E-07    2     2000001        -1   # BR(~chi_40 -> ~d_R      db)
     8.20412862E-07    2    -2000001         1   # BR(~chi_40 -> ~d_R*     d )
     2.51314585E-04    2     1000004        -4   # BR(~chi_40 -> ~c_L      cb)
     2.51314585E-04    2    -1000004         4   # BR(~chi_40 -> ~c_L*     c )
     3.19999526E-04    2     1000003        -3   # BR(~chi_40 -> ~s _L      sb)
     3.19999526E-04    2    -1000003         3   # BR(~chi_40 -> ~s _L*     s )
     8.20412862E-07    2     2000003        -3   # BR(~chi_40 -> ~s _R      sb)
     8.20412862E-07    2    -2000003         3   # BR(~chi_40 -> ~s _R*     s )
     1.29977482E-01    2     1000005        -5   # BR(~chi_40 -> ~b_1      bb)
     1.29977482E-01    2    -1000005         5   # BR(~chi_40 -> ~b_1*     b )
     8.16325362E-05    2     1000011       -11   # BR(~chi_40 -> ~e_L-     e+)
     8.16325362E-05    2    -1000011        11   # BR(~chi_40 -> ~e_L+     e-)
     8.16325362E-05    2     1000013       -13   # BR(~chi_40 -> ~mu_L-    mu+)
     8.16325362E-05    2    -1000013        13   # BR(~chi_40 -> ~mu_L+    mu-)
     4.05197422E-02    2     1000015       -15   # BR(~chi_40 -> ~tau_1-   tau+)
     4.05197422E-02    2    -1000015        15   # BR(~chi_40 -> ~tau_1+   tau-)
     7.52516522E-03    2     2000015       -15   # BR(~chi_40 -> ~tau_2-   tau+)
     7.52516522E-03    2    -2000015        15   # BR(~chi_40 -> ~tau_2+   tau-)
     1.71298898E-04    2     1000012       -12   # BR(~chi_40 -> ~nu_eL    nu_eb)
     1.71298898E-04    2    -1000012        12   # BR(~chi_40 -> ~nu_eL*   nu_e )
     1.71298898E-04    2     1000014       -14   # BR(~chi_40 -> ~nu_muL   nu_mub)
     1.71298898E-04    2    -1000014        14   # BR(~chi_40 -> ~nu_muL*  nu_mu )
     2.84824284E-05    2     1000016       -16   # BR(~chi_40 -> ~nu_tau1  nu_taub)
     2.84824284E-05    2    -1000016        16   # BR(~chi_40 -> ~nu_tau1* nu_tau )
#
#         PDG            Width
DECAY        25     4.64590948E-03   # h decays
#          BR         NDA      ID1       ID2
     6.68487505E-01    2           5        -5   # BR(h -> b       bb     )
     5.54867473E-02    2         -15        15   # BR(h -> tau+    tau-   )
     1.96413414E-04    2         -13        13   # BR(h -> mu+     mu-    )
     2.14473862E-04    2           3        -3   # BR(h -> s       sb     )
     1.85717908E-02    2           4        -4   # BR(h -> c       cb     )
     6.74095404E-02    2          21        21   # BR(h -> g       g      )
     1.97380321E-03    2          22        22   # BR(h -> gam     gam    )
     1.24992350E-03    2          22        23   # BR(h -> Z       gam    )
     1.65998323E-01    2          24       -24   # BR(h -> W+      W-     )
     2.04114795E-02    2          23        23   # BR(h -> Z       Z      )
#
#         PDG            Width
DECAY        35     4.89173871E+01   # H decays
#          BR         NDA      ID1       ID2
     7.84273047E-01    2           5        -5   # BR(H -> b       bb     )
     1.70063749E-01    2         -15        15   # BR(H -> tau+    tau-   )
     6.18592953E-04    2         -13        13   # BR(H -> mu+     mu-    )
     1.65268265E-04    2           3        -3   # BR(H -> s       sb     )
     2.24358694E-08    2           4        -4   # BR(H -> c       cb     )
     2.20755877E-03    2           6        -6   # BR(H -> t       tb     )
     1.20034646E-05    2          21        21   # BR(H -> g       g      )
     4.30227223E-10    2          22        22   # BR(H -> gam     gam    )
     6.55472443E-09    2          23        22   # BR(H -> Z       gam    )
     3.13002592E-07    2          24       -24   # BR(H -> W+      W-     )
     1.56177025E-07    2          23        23   # BR(H -> Z       Z      )
     2.33840573E-06    2          25        25   # BR(H -> h       h      )
     8.49387275E-04    2     1000024  -1000024   # BR(H -> ~chi_1+ ~chi_1-)
     4.24571944E-04    2     1000022   1000022   # BR(H -> ~chi_10 ~chi_10)
     3.36482195E-05    2     1000023   1000023   # BR(H -> ~chi_20 ~chi_20)
     3.24048025E-04    2     1000022   1000023   # BR(H -> ~chi_10 ~chi_20)
     4.94496038E-07    2     1000002  -1000002   # BR(H -> ~u_L    ~u_L*  )
     4.94496038E-07    2     1000004  -1000004   # BR(H -> ~c_L    ~c_L*  )
     7.24117269E-07    2     1000001  -1000001   # BR(H -> ~d_L    ~d_L*  )
     7.24117269E-07    2     1000003  -1000003   # BR(H -> ~s_L    ~s_L*  )
     1.85421693E-06    2     1000005  -1000005   # BR(H -> ~b_1    ~b_1*  )
     1.26422355E-07    2     1000011  -1000011   # BR(H -> ~e_L-   ~e_L+  )
     1.26422355E-07    2     1000013  -1000013   # BR(H -> ~mu_L-  ~mu_L+ )
     6.79556259E-04    2     1000015  -1000015   # BR(H -> ~tau_1- ~tau_1+)
     2.01701808E-02    2     1000015  -2000015   # BR(H -> ~tau_1- ~tau_2+)
     2.01701808E-02    2     2000015  -1000015   # BR(H -> ~tau_2- ~tau_1+)
     4.12849838E-07    2     1000012  -1000012   # BR(H -> ~nu_eL  ~nu_eL*   )
     4.12849838E-07    2     1000014  -1000014   # BR(H -> ~nu_muL ~nu_muL*  )
#
#         PDG            Width
DECAY        36     4.89129382E+01   # A decays
#          BR         NDA      ID1       ID2
     7.84365781E-01    2           5        -5   # BR(A -> b       bb     )
     1.70078327E-01    2         -15        15   # BR(A -> tau+    tau-   )
     6.18645190E-04    2         -13        13   # BR(A -> mu+     mu-    )
     1.65292403E-04    2           3        -3   # BR(A -> s       sb     )
     2.25858574E-08    2           4        -4   # BR(A -> c       cb     )
     2.21889371E-03    2           6        -6   # BR(A -> t       tb     )
     2.93640895E-05    2          21        21   # BR(A -> g       g      )
     1.21239110E-08    2          22        22   # BR(A -> gam     gam    )
     2.22056298E-08    2          23        22   # BR(A -> Z       gam    )
     3.17283182E-07    2          23        25   # BR(A -> Z       h      )
     9.93381456E-04    2     1000024  -1000024   # BR(A -> ~chi_1+ ~chi_1-)
     4.96481338E-04    2     1000022   1000022   # BR(A -> ~chi_10 ~chi_10)
     5.36100501E-05    2     1000023   1000023   # BR(A -> ~chi_20 ~chi_20)
     2.49370258E-04    2     1000022   1000023   # BR(A -> ~chi_10 ~chi_20)
     2.03652395E-02    2     1000015  -2000015   # BR(A -> ~tau_1- ~tau_2+)
     2.03652395E-02    2    -1000015   2000015   # BR(A -> ~tau_1+ ~tau_2-)
#
#         PDG            Width
DECAY        37     3.81756186E+01   # H+ decays
#          BR         NDA      ID1       ID2
     1.21660912E-03    2           4        -5   # BR(H+ -> c       bb     )
     2.17968776E-01    2         -15        16   # BR(H+ -> tau+    nu_tau )
     7.92842554E-04    2         -13        14   # BR(H+ -> mu+     nu_mu  )
     1.21660781E-05    2           2        -5   # BR(H+ -> u       bb     )
     1.05948693E-05    2           2        -3   # BR(H+ -> u       sb     )
     2.08566946E-04    2           4        -3   # BR(H+ -> c       sb     )
     7.25647481E-01    2           6        -5   # BR(H+ -> t       bb     )
     4.07051522E-07    2          24        25   # BR(H+ -> W+      h      )
     1.04813124E-14    2          24        36   # BR(H+ -> W+      A      )
     3.08302663E-11    2     1000024   1000022   # BR(H+ -> ~chi_1+ ~chi_10)
     7.35526633E-04    2     1000024   1000023   # BR(H+ -> ~chi_1+ ~chi_20)
     6.37145525E-07    2    -1000011   1000012   # BR(H+ -> ~e_L+   ~nu_eL )
     6.37145525E-07    2    -1000013   1000014   # BR(H+ -> ~mu_L+  ~nu_muL)
     5.34026639E-02    2    -1000015   1000016   # BR(H+ -> ~tau_1+ ~nu_tauL)
     1.54573296E-06    2     1000002  -1000001   # BR(H+ -> ~u_L    ~d_L*  )
     1.54573296E-06    2     1000004  -1000003   # BR(H+ -> ~c_L    ~s_L*  )
