#
#                              ======================
#                              | THE SUSYHIT OUTPUT |
#                              ======================
#
#
#              ------------------------------------------------------
#              |     This is the output of the SUSY-HIT package     |
#              |  created by A.Djouadi, M.Muehlleitner and M.Spira. |
#              |  In case of problems with SUSY-HIT email to        |
#              |           margarete.muehlleitner@cern.ch           |
#              |           michael.spira@psi.ch                     |
#              |           abdelhak.djouadi@cern.ch                 |
#              ------------------------------------------------------
#
#              ------------------------------------------------------
#              |  SUSY Les Houches Accord - MSSM Spectrum + Decays  |
#              |              based on the decay programs           |
#              |                                                    |
#              |                     SDECAY 1.3b                    |
#              |                                                    |
#              |  Authors: M.Muhlleitner, A.Djouadi and Y.Mambrini  |
#              |  Ref.:    Comput.Phys.Commun.168(2005)46           |
#              |           [hep-ph/0311167]                         |
#              |                                                    |
#              |                     HDECAY 3.4                     |
#              |                                                    |
#              |  By: A.Djouadi,J.Kalinowski,M.Muhlleitner,M.Spira  |
#              |  Ref.:    Comput.Phys.Commun.108(1998)56           |
#              |           [hep-ph/9704448]                         |
#              |                                                    |
#              |                                                    |
#              |  If not stated otherwise all DRbar couplings and   |
#              |  soft SUSY breaking masses are given at the scale  |
#              |  Q=  0.35253410E+04
#              |                                                    |
#              ------------------------------------------------------
#
#
BLOCK DCINFO  # Decay Program information
     1   SDECAY/HDECAY # decay calculator
     2   1.3b  /3.4    # version number
#
BLOCK SPINFO  # Spectrum calculator information
     1     SOFTSUSY    # spectrum calculator               
     2     3.4.0       # version number                    
#
BLOCK MODSEL  # Model selection
     1     0   #  nonUniversal                                     
#
BLOCK SMINPUTS  # Standard Model inputs
         1     1.27908970E+02   # alpha_em^-1(M_Z)^MSbar
         2     1.16637870E-05   # G_F [GeV^-2]
         3     1.18400000E-01   # alpha_S(M_Z)^MSbar
         4     9.11876000E+01   # M_Z pole mass
         5     4.18000000E+00   # mb(mb)^MSbar
         6     1.73200000E+02   # mt pole mass
         7     1.77700000E+00   # mtau pole mass
#
BLOCK MINPAR  # Input parameters - minimal models
         3     2.38800000E+01   # tanb                
#
BLOCK EXTPAR  # Input parameters - non-minimal models
         0    -1.00000000E+00   # Set                 
         1    -3.67003000E+03   # M_1(MX)             
         2    -3.24951000E+03   # M_2(MX)             
         3     1.28372000E+03   # M_3(MX)             
        11     4.93690000E+03   # At(MX)              
        12    -2.21742000E+03   # Ab(MX)              
        13    -1.68645000E+03   # Atau(MX)            
        23    -2.69450000E+02   # mu(MX)              
        26     3.24902000E+03   # mA(pole)            
        31     3.06176000E+03   # meL(MX)             
        32     3.06176000E+03   # mmuL(MX)            
        33     1.06614000E+03   # mtauL(MX)           
        34     2.67099000E+03   # meR(MX)             
        35     2.67099000E+03   # mmuR(MX)            
        36     1.09563000E+03   # mtauR(MX)           
        41     1.34584000E+03   # mqL1(MX)            
        42     1.34584000E+03   # mqL2(MX)            
        43     3.72364000E+03   # mqL3(MX)            
        44     3.19306000E+03   # muR(MX)             
        45     3.19306000E+03   # mcR(MX)             
        46     3.33800000E+03   # mtR(MX)             
        47     3.78309000E+03   # mdR(MX)             
        48     3.78309000E+03   # msR(MX)             
        49     2.94110000E+02   # mbR(MX)             
#
BLOCK MASS  # Mass Spectrum
# PDG code           mass       particle
        24     8.04001904E+01   # W+
        25     1.27516148E+02   # h
        35     3.24903456E+03   # H
        36     3.24901998E+03   # A
        37     3.25017535E+03   # H+
         5     4.81876030E+00   # b-quark pole mass calculated from mb(mb)_Msbar
   1000001     1.47527740E+03   # ~d_L
   2000001     3.82722184E+03   # ~d_R
   1000002     1.47336468E+03   # ~u_L
   2000002     3.23636061E+03   # ~u_R
   1000003     1.47527740E+03   # ~s_L
   2000003     3.82722184E+03   # ~s_R
   1000004     1.47336468E+03   # ~c_L
   2000004     3.23636061E+03   # ~c_R
   1000005     5.05946477E+02   # ~b_1
   2000005     3.72748006E+03   # ~b_2
   1000006     3.26842996E+03   # ~t_1
   2000006     3.74913692E+03   # ~t_2
   1000011     3.09048038E+03   # ~e_L
   2000011     2.69189261E+03   # ~e_R
   1000012     3.08914634E+03   # ~nu_eL
   1000013     3.09048038E+03   # ~mu_L
   2000013     2.69189261E+03   # ~mu_R
   1000014     3.08914634E+03   # ~nu_muL
   1000015     1.11274041E+03   # ~tau_1
   2000015     1.12815660E+03   # ~tau_2
   1000016     1.11064471E+03   # ~nu_tauL
   1000021     1.48237962E+03   # ~g
   1000022    -2.81373253E+02   # ~chi_10
   1000023     2.83983232E+02   # ~chi_20
   1000025    -3.22808651E+03   # ~chi_30
   1000035    -3.61203339E+03   # ~chi_40
   1000024     2.82911824E+02   # ~chi_1+
   1000037     3.22825588E+03   # ~chi_2+
#
BLOCK NMIX  # Neutralino Mixing Matrix
  1  1    -9.84093252E-03   # N_11
  1  2     1.95046371E-02   # N_12
  1  3     7.08661661E-01   # N_13
  1  4    -7.05210164E-01   # N_14
  2  1     7.74182278E-03   # N_21
  2  2    -1.51301241E-02   # N_22
  2  3     7.05539829E-01   # N_23
  2  4     7.08466438E-01   # N_24
  3  1     2.91220918E-03   # N_31
  3  2     9.99691890E-01   # N_32
  3  3    -3.14429379E-03   # N_33
  3  4     2.44490637E-02   # N_34
  4  1     9.99917366E-01   # N_41
  4  2    -2.60244839E-03   # N_42
  4  3     1.52100980E-03   # N_43
  4  4    -1.24969807E-02   # N_44
#
BLOCK UMIX  # Chargino Mixing Matrix U
  1  1     4.45658154E-03   # U_11
  1  2     9.99990069E-01   # U_12
  2  1    -9.99990069E-01   # U_21
  2  2     4.45658154E-03   # U_22
#
BLOCK VMIX  # Chargino Mixing Matrix V
  1  1    -3.46477084E-02   # V_11
  1  2    -9.99399588E-01   # V_12
  2  1     9.99399588E-01   # V_21
  2  2    -3.46477084E-02   # V_22
#
BLOCK STOPMIX  # Stop Mixing Matrix
  1  1    -2.05147567E-01   # cos(theta_t)
  1  2     9.78731054E-01   # sin(theta_t)
  2  1    -9.78731054E-01   # -sin(theta_t)
  2  2    -2.05147567E-01   # cos(theta_t)
#
BLOCK SBOTMIX  # Sbottom Mixing Matrix
  1  1    -6.44701666E-04   # cos(theta_b)
  1  2     9.99999792E-01   # sin(theta_b)
  2  1    -9.99999792E-01   # -sin(theta_b)
  2  2    -6.44701666E-04   # cos(theta_b)
#
BLOCK STAUMIX  # Stau Mixing Matrix
  1  1     9.67220426E-01   # cos(theta_tau)
  1  2    -2.53938275E-01   # sin(theta_tau)
  2  1     2.53938275E-01   # -sin(theta_tau)
  2  2     9.67220426E-01   # cos(theta_tau)
#
BLOCK ALPHA  # Higgs mixing
          -4.37820460E-02   # Mixing angle in the neutral Higgs boson sector
#
BLOCK HMIX Q=  3.52534100E+03  # DRbar Higgs Parameters
         1    -2.74887244E+02   # mu(Q)MSSM           
         2     2.28773882E+01   # tan                 
         3     2.42319333E+02   # higgs               
         4     1.07397679E+07   # mA^2(Q)MSSM         
#
BLOCK GAUGE Q=  3.52534100E+03  # The gauge couplings
     1     3.65820384E-01   # gprime(Q) DRbar
     2     6.38304475E-01   # g(Q) DRbar
     3     1.02197087E+00   # g3(Q) DRbar
#
BLOCK AU Q=  3.52534100E+03  # The trilinear couplings
  1  1     0.00000000E+00   # A_u(Q) DRbar
  2  2     0.00000000E+00   # A_c(Q) DRbar
  3  3     4.93690001E+03   # A_t(Q) DRbar
#
BLOCK AD Q=  3.52534100E+03  # The trilinear couplings
  1  1     0.00000000E+00   # A_d(Q) DRbar
  2  2     0.00000000E+00   # A_s(Q) DRbar
  3  3    -2.21742000E+03   # A_b(Q) DRbar
#
BLOCK AE Q=  3.52534100E+03  # The trilinear couplings
  1  1     0.00000000E+00   # A_e(Q) DRbar
  2  2     0.00000000E+00   # A_mu(Q) DRbar
  3  3    -1.68645000E+03   # A_tau(Q) DRbar
#
BLOCK Yu Q=  3.52534100E+03  # The Yukawa couplings
  1  1     0.00000000E+00   # y_u(Q) DRbar
  2  2     0.00000000E+00   # y_c(Q) DRbar
  3  3     8.30647461E-01   # y_t(Q) DRbar
#
BLOCK Yd Q=  3.52534100E+03  # The Yukawa couplings
  1  1     0.00000000E+00   # y_d(Q) DRbar
  2  2     0.00000000E+00   # y_s(Q) DRbar
  3  3     3.17877697E-01   # y_b(Q) DRbar
#
BLOCK Ye Q=  3.52534100E+03  # The Yukawa couplings
  1  1     0.00000000E+00   # y_e(Q) DRbar
  2  2     0.00000000E+00   # y_mu(Q) DRbar
  3  3     2.37798787E-01   # y_tau(Q) DRbar
#
BLOCK MSOFT Q=  3.52534100E+03  # The soft SUSY breaking masses at the scale Q
         1    -3.67003000E+03   # M_1(Q)              
         2    -3.24951000E+03   # M_2(Q)              
         3     1.28372000E+03   # M_3(Q)              
        21     1.03921065E+07   # mH1^2(Q)            
        22     1.19776269E+05   # mH2^2(Q)            
        31     3.06176000E+03   # meL(Q)              
        32     3.06176000E+03   # mmuL(Q)             
        33     1.06614000E+03   # mtauL(Q)            
        34     2.67099000E+03   # meR(Q)              
        35     2.67099000E+03   # mmuR(Q)             
        36     1.09563000E+03   # mtauR(Q)            
        41     1.34583999E+03   # mqL1(Q)             
        42     1.34583999E+03   # mqL2(Q)             
        43     3.72364000E+03   # mqL3(Q)             
        44     3.19306000E+03   # muR(Q)              
        45     3.19306000E+03   # mcR(Q)              
        46     3.33800000E+03   # mtR(Q)              
        47     3.78309000E+03   # mdR(Q)              
        48     3.78309000E+03   # msR(Q)              
        49     2.94109967E+02   # mbR(Q)              
#
Block HiggsBoundsInputHiggsCouplingsFermions
# ScalarNormEffCoupSq PseudoSNormEffCoupSq NP   IP1 IP2 IP2
    1.00451513E+00    0.00000000E+00        3  25   5   5  # h0-b-b eff. coupling^2, normalised to SM
    5.23370376E+02    0.00000000E+00        3  35   5   5  # H0-b-b eff. coupling^2, normalised to SM
    0.00000000E+00    5.23374891E+02        3  36   5   5  # A0-b-b eff. coupling^2, normalised to SM
#
    9.99991373E-01    0.00000000E+00        3  25   6   6  # h0-t-t eff. coupling^2, normalised to SM
    1.91930325E-03    0.00000000E+00        3  35   6   6  # H0-t-t eff. coupling^2, normalised to SM
    0.00000000E+00    1.91067630E-03        3  36   6   6  # A0-t-t eff. coupling^2, normalised to SM
#
    1.00451513E+00    0.00000000E+00        3  25  15  15  # h0-tau-tau eff. coupling^2, normalised to SM
    5.23370376E+02    0.00000000E+00        3  35  15  15  # H0-tau-tau eff. coupling^2, normalised to SM
    0.00000000E+00    5.23374891E+02        3  36  15  15  # A0-tau-tau eff. coupling^2, normalised to SM
#
Block HiggsBoundsInputHiggsCouplingsBosons
    9.99999990E-01        3  25  24  24  # h0-W-W eff. coupling^2, normalised to SM
    9.71605638E-09        3  35  24  24  # H0-W-W eff. coupling^2, normalised to SM
    0.00000000E+00        3  36  24  24  # A0-W-W eff. coupling^2, normalised to SM
#
    9.99999990E-01        3  25  23  23  # h0-Z-Z eff. coupling^2, normalised to SM
    9.71605638E-09        3  35  23  23  # H0-Z-Z eff. coupling^2, normalised to SM
    0.00000000E+00        3  36  23  23  # A0-Z-Z eff. coupling^2, normalised to SM
#
    8.88852826E-01        3  25  21  21  # h0-g-g eff. coupling^2, normalised to SM
    1.44782036E-14        3  35  21  21  # H0-g-g eff. coupling^2, normalised to SM
    6.82745940E-13        3  36  21  21  # A0-g-g eff. coupling^2, normalised to SM
#
    0.00000000E+00        3  25  25  23  # h0-h0-Z eff. coupling^2, normalised to SM
    0.00000000E+00        3  35  25  23  # H0-h0-Z eff. coupling^2, normalised to SM
    9.71605638E-09        3  36  25  23  # A0-h0-Z eff. coupling^2, normalised to SM
    0.00000000E+00        3  35  35  23  # H0-H0-Z eff. coupling^2, normalised to SM
    9.99999990E-01        3  36  35  23  # A0-H0-Z eff. coupling^2, normalised to SM
    0.00000000E+00        3  36  36  23  # A0-A0-Z eff. coupling^2, normalised to SM
#
    0.00000000E+00        4  25  21  21  23  # h0-g-g-Z eff. coupling^2, normalised to SM
    0.00000000E+00        4  35  21  21  23  # H0-g-g-Z eff. coupling^2, normalised to SM
    0.00000000E+00        4  36  21  21  23  # A0-g-g-Z eff. coupling^2, normalised to SM
#
#
#
#                             =================
#                             |The decay table|
#                             =================
#
# - The QCD corrections to the decays gluino -> squark  + quark
#                                     squark -> gaugino + quark_prime
#                                     squark -> squark_prime + Higgs
#                                     squark -> gluino  + quark
#   are included.
#
# - The multi-body decays for the inos, stops and sbottoms are included.
#
# - The loop induced decays for the gluino, neutralinos and stops
#   are included.
#
# - The SUSY decays of the top quark are included.
#
#
#         PDG            Width
DECAY         6     1.43445901E+00   # top decays
#          BR         NDA      ID1       ID2
     1.00000000E+00    2           5        24   # BR(t ->  b    W+)
#
#         PDG            Width
DECAY   1000021     2.68846140E+01   # gluino decays
#          BR         NDA      ID1       ID2
     4.77263537E-05    2     1000001        -1   # BR(~g -> ~d_L  db)
     4.77263537E-05    2    -1000001         1   # BR(~g -> ~d_L* d )
     7.67951504E-05    2     1000002        -2   # BR(~g -> ~u_L  ub)
     7.67951504E-05    2    -1000002         2   # BR(~g -> ~u_L* u )
     4.77263537E-05    2     1000003        -3   # BR(~g -> ~s_L  sb)
     4.77263537E-05    2    -1000003         3   # BR(~g -> ~s_L* s )
     7.54658908E-05    2     1000004        -4   # BR(~g -> ~c_L  cb)
     7.54658908E-05    2    -1000004         4   # BR(~g -> ~c_L* c )
     4.99752286E-01    2     1000005        -5   # BR(~g -> ~b_1  bb)
     4.99752286E-01    2    -1000005         5   # BR(~g -> ~b_1* b )
#
#         PDG            Width
DECAY   1000006     1.97724053E+02   # stop1 decays
#          BR         NDA      ID1       ID2
     1.10987955E-01    2     1000022         6   # BR(~t_1 -> ~chi_10 t )
     1.12638828E-01    2     1000023         6   # BR(~t_1 -> ~chi_20 t )
     2.17616091E-01    2     1000024         5   # BR(~t_1 -> ~chi_1+ b )
     2.05674782E-06    2     1000037         5   # BR(~t_1 -> ~chi_2+ b )
     5.58753272E-01    2     1000021         6   # BR(~t_1 -> ~g      t )
     1.79722332E-06    2     1000005        24   # BR(~t_1 -> ~b_1    W+)
#
#         PDG            Width
DECAY   2000006     2.29224623E+02   # stop2 decays
#          BR         NDA      ID1       ID2
     1.09375313E-01    2     1000022         6   # BR(~t_2 -> ~chi_10 t )
     1.09961834E-01    2     1000023         6   # BR(~t_2 -> ~chi_20 t )
     4.16777047E-03    2     1000025         6   # BR(~t_2 -> ~chi_30 t )
     3.82518781E-02    2     1000024         5   # BR(~t_2 -> ~chi_1+ b )
     8.64114750E-03    2     1000037         5   # BR(~t_2 -> ~chi_2+ b )
     6.52352068E-01    2     1000021         6   # BR(~t_2 -> ~g      t )
     3.79471978E-02    2     1000006        25   # BR(~t_2 -> ~t_1    h )
     3.92485609E-02    2     1000006        23   # BR(~t_2 -> ~t_1    Z )
     5.42299754E-05    2     1000005        24   # BR(~t_2 -> ~b_1    W+)
#
#         PDG            Width
DECAY   1000005     7.25386339E-01   # sbottom1 decays
#          BR         NDA      ID1       ID2
     3.35770061E-01    2     1000022         5   # BR(~b_1 -> ~chi_10 b )
     3.27267322E-01    2     1000023         5   # BR(~b_1 -> ~chi_20 b )
     3.36962617E-01    2    -1000024         6   # BR(~b_1 -> ~chi_1- t )
#
#         PDG            Width
DECAY   2000005     2.22952753E+02   # sbottom2 decays
#          BR         NDA      ID1       ID2
     1.67157879E-02    2     1000022         5   # BR(~b_2 -> ~chi_10 b )
     1.65553808E-02    2     1000023         5   # BR(~b_2 -> ~chi_20 b )
     4.22760114E-03    2     1000025         5   # BR(~b_2 -> ~chi_30 b )
     9.44471698E-06    2     1000035         5   # BR(~b_2 -> ~chi_40 b )
     2.25585763E-01    2    -1000024         6   # BR(~b_2 -> ~chi_1- t )
     8.11411749E-03    2    -1000037         6   # BR(~b_2 -> ~chi_2- t )
     6.56506942E-01    2     1000021         5   # BR(~b_2 -> ~g      b )
     3.73609441E-05    2     1000005        25   # BR(~b_2 -> ~b_1    h )
     2.95053259E-05    2     1000005        23   # BR(~b_2 -> ~b_1    Z )
     7.22180969E-02    2     1000006       -24   # BR(~b_2 -> ~t_1    W-)
#
#         PDG            Width
DECAY   1000002     1.54809661E-02   # sup_L decays
#          BR         NDA      ID1       ID2
     1.07272293E-01    2     1000022         2   # BR(~u_L -> ~chi_10 u)
     6.42664076E-02    2     1000023         2   # BR(~u_L -> ~chi_20 u)
     8.28461300E-01    2     1000024         1   # BR(~u_L -> ~chi_1+ d)
#
#         PDG            Width
DECAY   2000002     1.50819258E+02   # sup_R decays
#          BR         NDA      ID1       ID2
     4.67837418E-06    2     1000022         2   # BR(~u_R -> ~chi_10 u)
     2.89460860E-06    2     1000023         2   # BR(~u_R -> ~chi_20 u)
     1.32023097E-11    2     1000025         2   # BR(~u_R -> ~chi_30 u)
     9.99992427E-01    2     1000021         2   # BR(~u_R -> ~g      u)
#
#         PDG            Width
DECAY   1000001     4.13452293E-03   # sdown_L decays
#          BR         NDA      ID1       ID2
     5.91996677E-01    2     1000022         1   # BR(~d_L -> ~chi_10 d)
     3.56622945E-01    2     1000023         1   # BR(~d_L -> ~chi_20 d)
     5.13803780E-02    2    -1000024         2   # BR(~d_L -> ~chi_1- u)
#
#         PDG            Width
DECAY   2000001     2.06386659E+02   # sdown_R decays
#          BR         NDA      ID1       ID2
     1.01718272E-06    2     1000022         1   # BR(~d_R -> ~chi_10 d)
     6.29401483E-07    2     1000023         1   # BR(~d_R -> ~chi_20 d)
     7.67649240E-09    2     1000025         1   # BR(~d_R -> ~chi_30 d)
     1.34430091E-04    2     1000035         1   # BR(~d_R -> ~chi_40 d)
     9.99863916E-01    2     1000021         1   # BR(~d_R -> ~g      d)
#
#         PDG            Width
DECAY   1000004     1.60524880E-02   # scharm_L decays
#          BR         NDA      ID1       ID2
     1.07273752E-01    2     1000022         4   # BR(~c_L -> ~chi_10 c)
     6.42654710E-02    2     1000023         4   # BR(~c_L -> ~chi_20 c)
     8.28460777E-01    2     1000024         3   # BR(~c_L -> ~chi_1+ s)
#
#         PDG            Width
DECAY   2000004     1.11972526E+02   # scharm_R decays
#          BR         NDA      ID1       ID2
     6.52440394E-06    2     1000022         4   # BR(~c_R -> ~chi_10 c)
     4.03674651E-06    2     1000023         4   # BR(~c_R -> ~chi_20 c)
     1.48424298E-11    2     1000025         4   # BR(~c_R -> ~chi_30 c)
     9.99989439E-01    2     1000021         4   # BR(~c_R -> ~g      c)
#
#         PDG            Width
DECAY   1000003     4.28868171E-03   # sstrange_L decays
#          BR         NDA      ID1       ID2
     5.92003178E-01    2     1000022         3   # BR(~s_L -> ~chi_10 s)
     3.56616802E-01    2     1000023         3   # BR(~s_L -> ~chi_20 s)
     5.13800200E-02    2    -1000024         4   # BR(~s_L -> ~chi_1- c)
#
#         PDG            Width
DECAY   2000003     1.53233509E+02   # sstrange_R decays
#          BR         NDA      ID1       ID2
     1.41562539E-06    2     1000022         3   # BR(~s_R -> ~chi_10 s)
     8.75939897E-07    2     1000023         3   # BR(~s_R -> ~chi_20 s)
     1.04370020E-08    2     1000025         3   # BR(~s_R -> ~chi_30 s)
     1.76471197E-04    2     1000035         3   # BR(~s_R -> ~chi_40 s)
     9.99821227E-01    2     1000021         3   # BR(~s_R -> ~g      s)
#
#         PDG            Width
DECAY   1000011     4.26525742E-03   # selectron_L decays
#          BR         NDA      ID1       ID2
     5.55170092E-01    2     1000022        11   # BR(~e_L -> ~chi_10 e-)
     3.30130591E-01    2     1000023        11   # BR(~e_L -> ~chi_20 e-)
     1.14699317E-01    2    -1000024        12   # BR(~e_L -> ~chi_1- nu_e)
#
#         PDG            Width
DECAY   2000011     5.80721378E-03   # selectron_R decays
#           BR         NDA      ID1       ID2
     2.33838590E-01    2     1000022        11   # BR(~e_R -> ~chi_10 e-)
     1.44660940E-01    2     1000023        11   # BR(~e_R -> ~chi_20 e-)
#           BR         NDA      ID1       ID2       ID3
     3.00694974E-03    3        11       -1        1000001   # BR(~e_R- -> e-  db  ~d_L)
     1.02250412E-03    3        11       1        -1000001   # BR(~e_R- -> e-  d  ~d_L*)
     3.10269273E-03    3        11       -2        1000002   # BR(~e_R- -> e-  ub  ~u_L)
     1.07156379E-03    3        11       2        -1000002   # BR(~e_R- -> e-  u  ~u_L*)
     2.95460106E-03    3        11       -3        1000003   # BR(~e_R- -> e-  sb  ~s_L)
     1.02419167E-03    3        11       3        -1000003   # BR(~e_R- -> e-  s  ~s_L*)
     3.06980261E-03    3        11       -4        1000004   # BR(~e_R- -> e-  cb  ~c_L)
     1.09531012E-03    3        11       4        -1000004   # BR(~e_R- -> e-  c  ~c_L*)
     2.25529841E-02    3        11       -5        1000005   # BR(~e_R- -> e-  bb  ~b_1)
     1.04871290E-01    3        11       5        -1000005   # BR(~e_R- -> e-  b  ~b_1*)
     2.54579917E-02    3        11       -15        1000015   # BR(~e_R- -> e-  tau+  ~tau_1-)
     1.34661824E-02    3        11       15        -1000015   # BR(~e_R- -> e-  tau-  ~tau_1+)
     2.82665674E-02    3        11       -15        2000015   # BR(~e_R- -> e-  tau+  ~tau_2-)
     9.24849713E-02    3        11       15        -2000015   # BR(~e_R- -> e-  tau-  ~tau_2+)
     2.52720161E-02    3        11       -16        1000016   # BR(~e_R- -> e-  nu_taub  ~nu_tau1)
     7.52357355E-03    3        11       16        -1000016   # BR(~e_R- -> e-  nu_tau  ~nu_tau1*)
     2.37273855E-02    3        11       23        1000022   # BR(~e_R- -> e-  Z  ~chi_10)
     4.41829782E-02    3        11       25        1000022   # BR(~e_R- -> e-  h  ~chi_10)
     4.70432139E-02    3        11       23        1000023   # BR(~e_R- -> e-  Z  ~chi_20)
     2.24341663E-02    3        11       25        1000023   # BR(~e_R- -> e-  h  ~chi_20)
     2.42233204E-02    3        11       -24        1000024   # BR(~e_R- -> e-  W-  ~chi_1+)
     1.23646214E-01    3        11       24        -1000024   # BR(~e_R- -> e-  W+  ~chi_1-)
#
#         PDG            Width
DECAY   1000013     4.26525741E-03   # smuon_L decays
#          BR         NDA      ID1       ID2
     5.55170092E-01    2     1000022        13   # BR(~mu_L -> ~chi_10 mu-)
     3.30130591E-01    2     1000023        13   # BR(~mu_L -> ~chi_20 mu-)
     1.14699317E-01    2    -1000024        14   # BR(~mu_L -> ~chi_1- nu_mu)
#
#         PDG            Width
DECAY   2000013     5.80650677E-03   # smuon_R decays
#           BR         NDA      ID1       ID2
     2.33867061E-01    2     1000022        13   # BR(~mu_R -> ~chi_10 mu-)
     1.44678553E-01    2     1000023        13   # BR(~mu_R -> ~chi_20 mu-)
#           BR         NDA      ID1       ID2       ID3
     3.00731588E-03    3        13       -1        1000001   # BR(~mu_R- -> mu-  db  ~d_L)
     1.02262862E-03    3        13       1        -1000001   # BR(~mu_R- -> mu-  d  ~d_L*)
     3.10307052E-03    3        13       -2        1000002   # BR(~mu_R- -> mu-  ub  ~u_L)
     1.07169426E-03    3        13       2        -1000002   # BR(~mu_R- -> mu-  u  ~u_L*)
     2.95496082E-03    3        13       -3        1000003   # BR(~mu_R- -> mu-  sb  ~s_L)
     1.02431638E-03    3        13       3        -1000003   # BR(~mu_R- -> mu-  s  ~s_L*)
     3.07017639E-03    3        13       -4        1000004   # BR(~mu_R- -> mu-  cb  ~c_L)
     1.09544348E-03    3        13       4        -1000004   # BR(~mu_R- -> mu-  c  ~c_L*)
     2.25557302E-02    3        13       -5        1000005   # BR(~mu_R- -> mu-  bb  ~b_1)
     1.04901281E-01    3        13       5        -1000005   # BR(~mu_R- -> mu-  b  ~b_1*)
     2.54610915E-02    3        13       -15        1000015   # BR(~mu_R- -> mu-  tau+  ~tau_1-)
     1.34678221E-02    3        13       15        -1000015   # BR(~mu_R- -> mu-  tau-  ~tau_1+)
     2.82700092E-02    3        13       -15        2000015   # BR(~mu_R- -> mu-  tau+  ~tau_2-)
     9.24962325E-02    3        13       15        -2000015   # BR(~mu_R- -> mu-  tau-  ~tau_2+)
     2.52750932E-02    3        13       -16        1000016   # BR(~mu_R- -> mu-  nu_taub  ~nu_tau1)
     7.38550762E-03    3        13       16        -1000016   # BR(~mu_R- -> mu-  nu_tau  ~nu_tau1*)
     2.37302746E-02    3        13       23        1000022   # BR(~mu_R- -> mu-  Z  ~chi_10)
     4.41883580E-02    3        13       25        1000022   # BR(~mu_R- -> mu-  h  ~chi_10)
     4.70489420E-02    3        13       23        1000023   # BR(~mu_R- -> mu-  Z  ~chi_20)
     2.24368980E-02    3        13       25        1000023   # BR(~mu_R- -> mu-  h  ~chi_20)
     2.42262699E-02    3        13       -24        1000024   # BR(~mu_R- -> mu-  W-  ~chi_1+)
     1.23661270E-01    3        13       24        -1000024   # BR(~mu_R- -> mu-  W+  ~chi_1-)
#
#         PDG            Width
DECAY   1000015     1.17791614E+00   # stau_1 decays
#          BR         NDA      ID1       ID2
     4.83512428E-01    2     1000022        15   # BR(~tau_1 -> ~chi_10  tau-)
     4.50943471E-01    2     1000023        15   # BR(~tau_1 -> ~chi_20  tau-)
     6.55441008E-02    2    -1000024        16   # BR(~tau_1 -> ~chi_1-  nu_tau)
#
#         PDG            Width
DECAY   2000015     2.14750310E+00   # stau_2 decays
#          BR         NDA      ID1       ID2
     2.52726461E-01    2     1000022        15   # BR(~tau_2 -> ~chi_10  tau-)
     2.64794326E-01    2     1000023        15   # BR(~tau_2 -> ~chi_20  tau-)
     4.82479212E-01    2    -1000024        16   # BR(~tau_2 -> ~chi_1-  nu_tau)
#
#         PDG            Width
DECAY   1000012     4.20543581E-02   # snu_eL decays
#          BR         NDA      ID1       ID2
     1.85112893E-01    2     1000022        12   # BR(~nu_eL -> ~chi_10 nu_e)
     1.12063182E-01    2     1000023        12   # BR(~nu_eL -> ~chi_20 nu_e)
     7.02823925E-01    2     1000024        11   # BR(~nu_eL -> ~chi_1+ e-)
#
#         PDG            Width
DECAY   1000014     4.20543580E-02   # snu_muL decays
#          BR         NDA      ID1       ID2
     1.85112894E-01    2     1000022        14   # BR(~nu_muL -> ~chi_10 nu_mu)
     1.12063182E-01    2     1000023        14   # BR(~nu_muL -> ~chi_20 nu_mu)
     7.02823925E-01    2     1000024        13   # BR(~nu_muL -> ~chi_1+ mu-)
#
#         PDG            Width
DECAY   1000016     1.10582338E+00   # snu_tauL decays
#          BR         NDA      ID1       ID2
     2.25380993E-03    2     1000022        16   # BR(~nu_tauL -> ~chi_10 nu_tau)
     1.36134443E-03    2     1000023        16   # BR(~nu_tauL -> ~chi_20 nu_tau)
     9.96384846E-01    2     1000024        15   # BR(~nu_tauL -> ~chi_1+ tau-)
#
#         PDG            Width
DECAY   1000024     5.71030983E-12   # chargino1+ decays
#           BR         NDA      ID1       ID2       ID3
     6.00000369E-01    3     1000022         2        -1   # BR(~chi_1+ -> ~chi_10 u    db)
     1.99999816E-01    3     1000022       -11        12   # BR(~chi_1+ -> ~chi_10 e+   nu_e)
     1.99999816E-01    3     1000022       -13        14   # BR(~chi_1+ -> ~chi_10 mu+  nu_mu)
#
#         PDG            Width
DECAY   1000037     1.41580842E+02   # chargino2+ decays
#          BR         NDA      ID1       ID2
     1.68196508E-01    2     1000002        -1   # BR(~chi_2+ -> ~u_L     db)
     1.68166502E-01    2    -1000001         2   # BR(~chi_2+ -> ~d_L*    u )
     1.68196506E-01    2     1000004        -3   # BR(~chi_2+ -> ~c_L     sb)
     1.68166473E-01    2    -1000003         4   # BR(~chi_2+ -> ~s_L*     c )
     6.56850971E-07    2    -1000005         6   # BR(~chi_2+ -> ~b_1*    t )
     6.56321761E-04    2     1000012       -11   # BR(~chi_2+ -> ~nu_eL   e+  )
     6.56321761E-04    2     1000014       -13   # BR(~chi_2+ -> ~nu_muL mu+ )
     7.17426001E-02    2     1000016       -15   # BR(~chi_2+ -> ~nu_tau1 tau+)
     6.44827289E-04    2    -1000011        12   # BR(~chi_2+ -> ~e_L+    nu_e)
     6.44827289E-04    2    -1000013        14   # BR(~chi_2+ -> ~mu_L+   nu_mu)
     6.70690902E-02    2    -1000015        16   # BR(~chi_2+ -> ~tau_1+  nu_tau)
     4.65059485E-03    2    -2000015        16   # BR(~chi_2+ -> ~tau_2+  nu_tau)
     4.58079836E-02    2     1000024        23   # BR(~chi_2+ -> ~chi_1+  Z )
     4.41473943E-02    2     1000022        24   # BR(~chi_2+ -> ~chi_10  W+)
     4.45553805E-02    2     1000023        24   # BR(~chi_2+ -> ~chi_20  W+)
     4.66980132E-02    2     1000024        25   # BR(~chi_2+ -> ~chi_1+  h )
#
#         PDG            Width
DECAY   1000022     0.00000000E+00   # neutralino1 decays
#
#         PDG            Width
DECAY   1000023     1.11900229E-10   # neutralino2 decays
#          BR         NDA      ID1       ID2
     2.22056018E-01    2     1000022        22   # BR(~chi_20 -> ~chi_10 gam)
#           BR         NDA      ID1       ID2       ID3
     1.27148424E-01    3     1000022        -2         2   # BR(~chi_20 -> ~chi_10 ub      u)
     1.65118577E-01    3     1000022        -1         1   # BR(~chi_20 -> ~chi_10 db      d)
     1.65118577E-01    3     1000022        -3         3   # BR(~chi_20 -> ~chi_10 sb      s)
     3.79799725E-02    3     1000022       -11        11   # BR(~chi_20 -> ~chi_10 e+      e-)
     3.79799725E-02    3     1000022       -13        13   # BR(~chi_20 -> ~chi_10 mu+     mu-)
     7.59508167E-02    3     1000022       -12        12   # BR(~chi_20 -> ~chi_10 nu_eb   nu_e)
     7.59508167E-02    3     1000022       -14        14   # BR(~chi_20 -> ~chi_10 nu_mub  nu_mu)
     7.59511729E-02    3     1000022       -16        16   # BR(~chi_20 -> ~chi_10 nu_taub nu_tau)
     5.02369759E-03    3     1000024        -2         1   # BR(~chi_20 -> ~chi_1+ ub      d)
     5.02369759E-03    3    -1000024        -1         2   # BR(~chi_20 -> ~chi_1- db      u)
     1.67456450E-03    3     1000024       -12        11   # BR(~chi_20 -> ~chi_1+ nu_eb   e-)
     1.67456450E-03    3    -1000024        12       -11   # BR(~chi_20 -> ~chi_1- nu_e    e+)
     1.67456450E-03    3     1000024       -14        13   # BR(~chi_20 -> ~chi_1+ nu_mub  mu-)
     1.67456450E-03    3    -1000024        14       -13   # BR(~chi_20 -> ~chi_1- nu_mu   mu+)
#
#         PDG            Width
DECAY   1000025     1.41564826E+02   # neutralino3 decays
#          BR         NDA      ID1       ID2
     1.69547731E-02    2     1000022        23   # BR(~chi_30 -> ~chi_10   Z )
     2.86821739E-02    2     1000023        23   # BR(~chi_30 -> ~chi_20   Z )
     4.45886647E-02    2     1000024       -24   # BR(~chi_30 -> ~chi_1+   W-)
     4.45886647E-02    2    -1000024        24   # BR(~chi_30 -> ~chi_1-   W+)
     2.90737951E-02    2     1000022        25   # BR(~chi_30 -> ~chi_10   h )
     1.73208425E-02    2     1000023        25   # BR(~chi_30 -> ~chi_20   h )
     8.42415915E-02    2     1000002        -2   # BR(~chi_30 -> ~u_L      ub)
     8.42415915E-02    2    -1000002         2   # BR(~chi_30 -> ~u_L*     u )
     8.39400447E-02    2     1000001        -1   # BR(~chi_30 -> ~d_L      db)
     8.39400447E-02    2    -1000001         1   # BR(~chi_30 -> ~d_L*     d )
     8.42415773E-02    2     1000004        -4   # BR(~chi_30 -> ~c_L      cb)
     8.42415773E-02    2    -1000004         4   # BR(~chi_30 -> ~c_L*     c )
     8.39400447E-02    2     1000003        -3   # BR(~chi_30 -> ~s _L      sb)
     8.39400447E-02    2    -1000003         3   # BR(~chi_30 -> ~s _L*     s )
     4.90375594E-07    2     1000005        -5   # BR(~chi_30 -> ~b_1      bb)
     4.90375594E-07    2    -1000005         5   # BR(~chi_30 -> ~b_1*     b )
     3.22573796E-04    2     1000011       -11   # BR(~chi_30 -> ~e_L-     e+)
     3.22573796E-04    2    -1000011        11   # BR(~chi_30 -> ~e_L+     e-)
     4.77753980E-08    2     2000011       -11   # BR(~chi_30 -> ~e_R-     e+)
     4.77753980E-08    2    -2000011        11   # BR(~chi_30 -> ~e_R+     e-)
     3.22573796E-04    2     1000013       -13   # BR(~chi_30 -> ~mu_L-    mu+)
     3.22573796E-04    2    -1000013        13   # BR(~chi_30 -> ~mu_L+    mu-)
     4.77753980E-08    2     2000013       -13   # BR(~chi_30 -> ~mu_R-    mu+)
     4.77753980E-08    2    -2000013        13   # BR(~chi_30 -> ~mu_R+    mu-)
     3.36277433E-02    2     1000015       -15   # BR(~chi_30 -> ~tau_1-   tau+)
     3.36277433E-02    2    -1000015        15   # BR(~chi_30 -> ~tau_1+   tau-)
     2.33199020E-03    2     2000015       -15   # BR(~chi_30 -> ~tau_2-   tau+)
     2.33199020E-03    2    -2000015        15   # BR(~chi_30 -> ~tau_2+   tau-)
     3.26531800E-04    2     1000012       -12   # BR(~chi_30 -> ~nu_eL    nu_eb)
     3.26531800E-04    2    -1000012        12   # BR(~chi_30 -> ~nu_eL*   nu_e )
     3.26531800E-04    2     1000014       -14   # BR(~chi_30 -> ~nu_muL   nu_mub)
     3.26531800E-04    2    -1000014        14   # BR(~chi_30 -> ~nu_muL*  nu_mu )
     3.57737542E-02    2     1000016       -16   # BR(~chi_30 -> ~nu_tau1  nu_taub)
     3.57737542E-02    2    -1000016        16   # BR(~chi_30 -> ~nu_tau1* nu_tau )
#
#         PDG            Width
DECAY   1000035     5.51839601E+01   # neutralino4 decays
#          BR         NDA      ID1       ID2
     1.62471945E-02    2     1000022        23   # BR(~chi_40 -> ~chi_10   Z )
     2.67333938E-02    2     1000023        23   # BR(~chi_40 -> ~chi_20   Z )
     2.20429124E-07    2     1000025        23   # BR(~chi_40 -> ~chi_30   Z )
     4.07542338E-02    2     1000024       -24   # BR(~chi_40 -> ~chi_1+   W-)
     4.07542338E-02    2    -1000024        24   # BR(~chi_40 -> ~chi_1-   W+)
     6.22146229E-05    2     1000037       -24   # BR(~chi_40 -> ~chi_2+   W-)
     6.22146229E-05    2    -1000037        24   # BR(~chi_40 -> ~chi_2-   W+)
     2.73578289E-02    2     1000022        25   # BR(~chi_40 -> ~chi_10   h )
     8.56575204E-04    2     1000022        35   # BR(~chi_40 -> ~chi_10   H )
     1.19010991E-04    2     1000022        36   # BR(~chi_40 -> ~chi_10   A )
     1.69243941E-02    2     1000023        25   # BR(~chi_40 -> ~chi_20   h )
     1.12645358E-04    2     1000023        35   # BR(~chi_40 -> ~chi_20   H )
     8.40604985E-04    2     1000023        36   # BR(~chi_40 -> ~chi_20   A )
     6.41895156E-05    2     1000025        25   # BR(~chi_40 -> ~chi_30   h )
     9.35543764E-04    2     1000024       -37   # BR(~chi_40 -> ~chi_1+   H-)
     9.35543764E-04    2    -1000024        37   # BR(~chi_40 -> ~chi_1-   H+)
     9.51568497E-03    2     1000002        -2   # BR(~chi_40 -> ~u_L      ub)
     9.51568497E-03    2    -1000002         2   # BR(~chi_40 -> ~u_L*     u )
     9.06537427E-03    2     2000002        -2   # BR(~chi_40 -> ~u_R      ub)
     9.06537427E-03    2    -2000002         2   # BR(~chi_40 -> ~u_R*     u )
     1.00382922E-02    2     1000001        -1   # BR(~chi_40 -> ~d_L      db)
     1.00382922E-02    2    -1000001         1   # BR(~chi_40 -> ~d_L*     d )
     9.51568404E-03    2     1000004        -4   # BR(~chi_40 -> ~c_L      cb)
     9.51568404E-03    2    -1000004         4   # BR(~chi_40 -> ~c_L*     c )
     9.06530108E-03    2     2000004        -4   # BR(~chi_40 -> ~c_R      cb)
     9.06530108E-03    2    -2000004         4   # BR(~chi_40 -> ~c_R*     c )
     1.00382922E-02    2     1000003        -3   # BR(~chi_40 -> ~s _L      sb)
     1.00382922E-02    2    -1000003         3   # BR(~chi_40 -> ~s _L*     s )
     5.80853814E-03    2     1000006        -6   # BR(~chi_40 -> ~t_1      tb)
     5.80853814E-03    2    -1000006         6   # BR(~chi_40 -> ~t_1*     t )
     5.58207227E-02    2     1000005        -5   # BR(~chi_40 -> ~b_1      bb)
     5.58207227E-02    2    -1000005         5   # BR(~chi_40 -> ~b_1*     b )
     3.09873831E-03    2     1000011       -11   # BR(~chi_40 -> ~e_L-     e+)
     3.09873831E-03    2    -1000011        11   # BR(~chi_40 -> ~e_L+     e-)
     3.44394976E-02    2     2000011       -11   # BR(~chi_40 -> ~e_R-     e+)
     3.44394976E-02    2    -2000011        11   # BR(~chi_40 -> ~e_R+     e-)
     3.09873831E-03    2     1000013       -13   # BR(~chi_40 -> ~mu_L-    mu+)
     3.09873831E-03    2    -1000013        13   # BR(~chi_40 -> ~mu_L+    mu-)
     3.44394976E-02    2     2000013       -13   # BR(~chi_40 -> ~mu_R-    mu+)
     3.44394976E-02    2    -2000013        13   # BR(~chi_40 -> ~mu_R+    mu-)
     4.22212096E-02    2     1000015       -15   # BR(~chi_40 -> ~tau_1-   tau+)
     4.22212096E-02    2    -1000015        15   # BR(~chi_40 -> ~tau_1+   tau-)
     1.35077183E-01    2     2000015       -15   # BR(~chi_40 -> ~tau_2-   tau+)
     1.35077183E-01    2    -2000015        15   # BR(~chi_40 -> ~tau_2+   tau-)
     3.17044281E-03    2     1000012       -12   # BR(~chi_40 -> ~nu_eL    nu_eb)
     3.17044281E-03    2    -1000012        12   # BR(~chi_40 -> ~nu_eL*   nu_e )
     3.17044281E-03    2     1000014       -14   # BR(~chi_40 -> ~nu_muL   nu_mub)
     3.17044281E-03    2    -1000014        14   # BR(~chi_40 -> ~nu_muL*  nu_mu )
     3.60363395E-02    2     1000016       -16   # BR(~chi_40 -> ~nu_tau1  nu_taub)
     3.60363395E-02    2    -1000016        16   # BR(~chi_40 -> ~nu_tau1* nu_tau )
#
#         PDG            Width
DECAY        25     4.36072932E-03   # h decays
#          BR         NDA      ID1       ID2
     5.51976488E-01    2           5        -5   # BR(h -> b       bb     )
     6.08020791E-02    2         -15        15   # BR(h -> tau+    tau-   )
     2.15214634E-04    2         -13        13   # BR(h -> mu+     mu-    )
     2.34027571E-04    2           3        -3   # BR(h -> s       sb     )
     2.02095567E-02    2           4        -4   # BR(h -> c       cb     )
     7.76324774E-02    2          21        21   # BR(h -> g       g      )
     2.35130270E-03    2          22        22   # BR(h -> gam     gam    )
     1.78289425E-03    2          22        23   # BR(h -> Z       gam    )
     2.52092440E-01    2          24       -24   # BR(h -> W+      W-     )
     3.27035200E-02    2          23        23   # BR(h -> Z       Z      )
#
#         PDG            Width
DECAY        35     2.44864859E+01   # H decays
#          BR         NDA      ID1       ID2
     8.18760403E-01    2           5        -5   # BR(H -> b       bb     )
     1.39907059E-01    2         -15        15   # BR(H -> tau+    tau-   )
     5.02774060E-04    2         -13        13   # BR(H -> mu+     mu-    )
     3.25609578E-04    2           3        -3   # BR(H -> s       sb     )
     1.03411696E-07    2           4        -4   # BR(H -> c       cb     )
     1.01793000E-02    2           6        -6   # BR(H -> t       tb     )
     5.97141921E-06    2          21        21   # BR(H -> g       g      )
     2.71044462E-08    2          22        22   # BR(H -> gam     gam    )
     4.55462037E-09    2          23        22   # BR(H -> Z       gam    )
     4.37570823E-06    2          24       -24   # BR(H -> W+      W-     )
     2.18342230E-06    2          23        23   # BR(H -> Z       Z      )
     1.57799358E-05    2          25        25   # BR(H -> h       h      )
     1.27357845E-03    2     1000024  -1000024   # BR(H -> ~chi_1+ ~chi_1-)
     3.02584179E-04    2     1000022   1000022   # BR(H -> ~chi_10 ~chi_10)
     2.16155364E-04    2     1000023   1000023   # BR(H -> ~chi_20 ~chi_20)
     1.48631070E-05    2     1000022   1000023   # BR(H -> ~chi_10 ~chi_20)
     1.35988511E-06    2     1000002  -1000002   # BR(H -> ~u_L    ~u_L*  )
     1.35988511E-06    2     1000004  -1000004   # BR(H -> ~c_L    ~c_L*  )
     1.98238429E-06    2     1000001  -1000001   # BR(H -> ~d_L    ~d_L*  )
     1.98238429E-06    2     1000003  -1000003   # BR(H -> ~s_L    ~s_L*  )
     1.11953330E-06    2     1000005  -1000005   # BR(H -> ~b_1    ~b_1*  )
     3.40611229E-03    2     1000015  -1000015   # BR(H -> ~tau_1- ~tau_1+)
     3.45182911E-03    2     2000015  -2000015   # BR(H -> ~tau_2- ~tau_2+)
     1.08109473E-02    2     1000015  -2000015   # BR(H -> ~tau_1- ~tau_2+)
     1.08109473E-02    2     2000015  -1000015   # BR(H -> ~tau_2- ~tau_1+)
     1.58821026E-06    2     1000016  -1000016   # BR(H -> ~nu_tauL ~nu_tauL*)
#
#         PDG            Width
DECAY        36     2.44909741E+01   # A decays
#          BR         NDA      ID1       ID2
     8.18658652E-01    2           5        -5   # BR(A -> b       bb     )
     1.39882183E-01    2         -15        15   # BR(A -> tau+    tau-   )
     5.02684031E-04    2         -13        13   # BR(A -> mu+     mu-    )
     3.25595075E-04    2           3        -3   # BR(A -> s       sb     )
     1.03881904E-07    2           4        -4   # BR(A -> c       cb     )
     1.02062547E-02    2           6        -6   # BR(A -> t       tb     )
     4.09979343E-05    2          21        21   # BR(A -> g       g      )
     8.28756819E-08    2          22        22   # BR(A -> gam     gam    )
     3.59331843E-08    2          23        22   # BR(A -> Z       gam    )
     4.43390008E-06    2          23        25   # BR(A -> Z       h      )
     1.34306121E-03    2     1000024  -1000024   # BR(A -> ~chi_1+ ~chi_1-)
     3.71276872E-04    2     1000022   1000022   # BR(A -> ~chi_10 ~chi_10)
     1.86976019E-04    2     1000023   1000023   # BR(A -> ~chi_20 ~chi_20)
     3.23978252E-06    2     1000022   1000023   # BR(A -> ~chi_10 ~chi_20)
     1.42372115E-02    2     1000015  -2000015   # BR(A -> ~tau_1- ~tau_2+)
     1.42372115E-02    2    -1000015   2000015   # BR(A -> ~tau_1+ ~tau_2-)
#
#         PDG            Width
DECAY        37     2.43611652E+01   # H+ decays
#          BR         NDA      ID1       ID2
     1.37690529E-03    2           4        -5   # BR(H+ -> c       bb     )
     1.40677556E-01    2         -15        16   # BR(H+ -> tau+    nu_tau )
     5.05542302E-04    2         -13        14   # BR(H+ -> mu+     nu_mu  )
     1.37690374E-05    2           2        -5   # BR(H+ -> u       bb     )
     1.63771587E-05    2           2        -3   # BR(H+ -> u       sb     )
     3.22452376E-04    2           4        -3   # BR(H+ -> c       sb     )
     8.28230684E-01    2           6        -5   # BR(H+ -> t       bb     )
     4.46466435E-06    2          24        25   # BR(H+ -> W+      h      )
     1.11193050E-13    2          24        36   # BR(H+ -> W+      A      )
     5.26161250E-05    2     1000024   1000022   # BR(H+ -> ~chi_1+ ~chi_10)
     1.31357041E-04    2     1000024   1000023   # BR(H+ -> ~chi_1+ ~chi_20)
     1.75939106E-03    2    -1000015   1000016   # BR(H+ -> ~tau_1+ ~nu_tauL)
     2.69022294E-02    2    -2000015   1000016   # BR(H+ -> ~tau_2+ ~nu_tauL)
     3.32784972E-06    2     1000002  -1000001   # BR(H+ -> ~u_L    ~d_L*  )
     3.32784972E-06    2     1000004  -1000003   # BR(H+ -> ~c_L    ~s_L*  )
