#
#                              ======================
#                              | THE SUSYHIT OUTPUT |
#                              ======================
#
#
#              ------------------------------------------------------
#              |     This is the output of the SUSY-HIT package     |
#              |  created by A.Djouadi, M.Muehlleitner and M.Spira. |
#              |  In case of problems with SUSY-HIT email to        |
#              |           margarete.muehlleitner@cern.ch           |
#              |           michael.spira@psi.ch                     |
#              |           abdelhak.djouadi@cern.ch                 |
#              ------------------------------------------------------
#
#              ------------------------------------------------------
#              |  SUSY Les Houches Accord - MSSM Spectrum + Decays  |
#              |              based on the decay programs           |
#              |                                                    |
#              |                     SDECAY 1.3b                    |
#              |                                                    |
#              |  Authors: M.Muhlleitner, A.Djouadi and Y.Mambrini  |
#              |  Ref.:    Comput.Phys.Commun.168(2005)46           |
#              |           [hep-ph/0311167]                         |
#              |                                                    |
#              |                     HDECAY 3.4                     |
#              |                                                    |
#              |  By: A.Djouadi,J.Kalinowski,M.Muhlleitner,M.Spira  |
#              |  Ref.:    Comput.Phys.Commun.108(1998)56           |
#              |           [hep-ph/9704448]                         |
#              |                                                    |
#              |                                                    |
#              |  If not stated otherwise all DRbar couplings and   |
#              |  soft SUSY breaking masses are given at the scale  |
#              |  Q=  0.18474660E+04
#              |                                                    |
#              ------------------------------------------------------
#
#
BLOCK DCINFO  # Decay Program information
     1   SDECAY/HDECAY # decay calculator
     2   1.3b  /3.4    # version number
#
BLOCK SPINFO  # Spectrum calculator information
     1     SOFTSUSY    # spectrum calculator               
     2     3.4.0       # version number                    
#
BLOCK MODSEL  # Model selection
     1     0   #  nonUniversal                                     
#
BLOCK SMINPUTS  # Standard Model inputs
         1     1.27908970E+02   # alpha_em^-1(M_Z)^MSbar
         2     1.16637870E-05   # G_F [GeV^-2]
         3     1.18400000E-01   # alpha_S(M_Z)^MSbar
         4     9.11876000E+01   # M_Z pole mass
         5     4.18000000E+00   # mb(mb)^MSbar
         6     1.73200000E+02   # mt pole mass
         7     1.77700000E+00   # mtau pole mass
#
BLOCK MINPAR  # Input parameters - minimal models
         3     1.52900000E+01   # tanb                
#
BLOCK EXTPAR  # Input parameters - non-minimal models
         0    -1.00000000E+00   # Set                 
         1    -3.33705000E+03   # M_1(MX)             
         2     2.73534000E+03   # M_2(MX)             
         3     2.47570000E+03   # M_3(MX)             
        11     3.26383000E+03   # At(MX)              
        12    -3.73833000E+03   # Ab(MX)              
        13    -2.45632000E+03   # Atau(MX)            
        23    -9.94200000E+01   # mu(MX)              
        26     1.90859000E+03   # mA(pole)            
        31     1.88609000E+03   # meL(MX)             
        32     1.88609000E+03   # mmuL(MX)            
        33     3.35340000E+02   # mtauL(MX)           
        34     3.77800000E+03   # meR(MX)             
        35     3.77800000E+03   # mmuR(MX)            
        36     3.32020000E+03   # mtauR(MX)           
        41     3.68961000E+03   # mqL1(MX)            
        42     3.68961000E+03   # mqL2(MX)            
        43     3.61930000E+03   # mqL3(MX)            
        44     9.92140000E+02   # muR(MX)             
        45     9.92140000E+02   # mcR(MX)             
        46     9.40960000E+02   # mtR(MX)             
        47     1.98454000E+03   # mdR(MX)             
        48     1.98454000E+03   # msR(MX)             
        49     9.13150000E+02   # mbR(MX)             
#
BLOCK MASS  # Mass Spectrum
# PDG code           mass       particle
        24     8.04127104E+01   # W+
        25     1.25453600E+02   # h
        35     1.90863768E+03   # H
        36     1.90858987E+03   # A
        37     1.91057185E+03   # H+
         5     4.81876030E+00   # b-quark pole mass calculated from mb(mb)_Msbar
   1000001     3.73349249E+03   # ~d_L
   2000001     2.05679033E+03   # ~d_R
   1000002     3.73280003E+03   # ~u_L
   2000002     1.05995256E+03   # ~u_R
   1000003     3.73349249E+03   # ~s_L
   2000003     2.05679033E+03   # ~s_R
   1000004     3.73280003E+03   # ~c_L
   2000004     1.05995256E+03   # ~c_R
   1000005     1.00382906E+03   # ~b_1
   2000005     3.65014067E+03   # ~b_2
   1000006     1.03346520E+03   # ~t_1
   2000006     3.65486159E+03   # ~t_2
   1000011     1.89632651E+03   # ~e_L
   2000011     3.78678029E+03   # ~e_R
   1000012     1.89436440E+03   # ~nu_eL
   1000013     1.89632651E+03   # ~mu_L
   2000013     3.78678029E+03   # ~mu_R
   1000014     1.89436440E+03   # ~nu_muL
   1000015     3.31052819E+02   # ~tau_1
   2000015     3.32958247E+03   # ~tau_2
   1000016     3.21278989E+02   # ~nu_tauL
   1000021     2.58612906E+03   # ~g
   1000022     1.04408920E+02   # ~chi_10
   1000023    -1.05477780E+02   # ~chi_20
   1000025     2.76842059E+03   # ~chi_30
   1000035    -3.31734270E+03   # ~chi_40
   1000024     1.05355360E+02   # ~chi_1+
   1000037     2.76858700E+03   # ~chi_2+
#
BLOCK NMIX  # Neutralino Mixing Matrix
  1  1     8.79831756E-03   # N_11
  1  2     1.89836343E-02   # N_12
  1  3     7.08897049E-01   # N_13
  1  4     7.05001550E-01   # N_14
  2  1     1.07402540E-02   # N_21
  2  2     2.03925656E-02   # N_22
  2  3    -7.05310091E-01   # N_23
  2  4     7.08524146E-01   # N_24
  3  1    -2.14527865E-04   # N_31
  3  2     9.99611792E-01   # N_32
  3  3     9.26229227E-04   # N_33
  3  4    -2.78452982E-02   # N_34
  4  1     9.99903591E-01   # N_41
  4  2    -1.71617339E-04   # N_42
  4  3     1.33843592E-03   # N_43
  4  4    -1.38198628E-02   # N_44
#
BLOCK UMIX  # Chargino Mixing Matrix U
  1  1    -1.30714652E-03   # U_11
  1  2     9.99999146E-01   # U_12
  2  1    -9.99999146E-01   # U_21
  2  2    -1.30714652E-03   # U_22
#
BLOCK VMIX  # Chargino Mixing Matrix V
  1  1     3.93783364E-02   # V_11
  1  2    -9.99224373E-01   # V_12
  2  1    -9.99224373E-01   # V_21
  2  2    -3.93783364E-02   # V_22
#
BLOCK STOPMIX  # Stop Mixing Matrix
  1  1    -3.85073305E-02   # cos(theta_t)
  1  2     9.99258318E-01   # sin(theta_t)
  2  1    -9.99258318E-01   # -sin(theta_t)
  2  2    -3.85073305E-02   # cos(theta_t)
#
BLOCK SBOTMIX  # Sbottom Mixing Matrix
  1  1     4.47895329E-04   # cos(theta_b)
  1  2     9.99999900E-01   # sin(theta_b)
  2  1    -9.99999900E-01   # -sin(theta_b)
  2  2     4.47895329E-04   # cos(theta_b)
#
BLOCK STAUMIX  # Stau Mixing Matrix
  1  1     9.99999988E-01   # cos(theta_tau)
  1  2     1.54919333E-04   # sin(theta_tau)
  2  1    -1.54919333E-04   # -sin(theta_tau)
  2  2     9.99999988E-01   # cos(theta_tau)
#
BLOCK ALPHA  # Higgs mixing
          -6.85140912E-02   # Mixing angle in the neutral Higgs boson sector
#
BLOCK HMIX Q=  1.84746600E+03  # DRbar Higgs Parameters
         1    -1.00825791E+02   # mu(Q)MSSM           
         2     1.46668775E+01   # tan                 
         3     2.43692249E+02   # higgs               
         4     3.62224280E+06   # mA^2(Q)MSSM         
#
BLOCK GAUGE Q=  1.84746600E+03  # The gauge couplings
     1     3.63972339E-01   # gprime(Q) DRbar
     2     6.37737764E-01   # g(Q) DRbar
     3     1.02477185E+00   # g3(Q) DRbar
#
BLOCK AU Q=  1.84746600E+03  # The trilinear couplings
  1  1     0.00000000E+00   # A_u(Q) DRbar
  2  2     0.00000000E+00   # A_c(Q) DRbar
  3  3     3.26383001E+03   # A_t(Q) DRbar
#
BLOCK AD Q=  1.84746600E+03  # The trilinear couplings
  1  1     0.00000000E+00   # A_d(Q) DRbar
  2  2     0.00000000E+00   # A_s(Q) DRbar
  3  3    -3.73833000E+03   # A_b(Q) DRbar
#
BLOCK AE Q=  1.84746600E+03  # The trilinear couplings
  1  1     0.00000000E+00   # A_e(Q) DRbar
  2  2     0.00000000E+00   # A_mu(Q) DRbar
  3  3    -2.45632000E+03   # A_tau(Q) DRbar
#
BLOCK Yu Q=  1.84746600E+03  # The Yukawa couplings
  1  1     0.00000000E+00   # y_u(Q) DRbar
  2  2     0.00000000E+00   # y_c(Q) DRbar
  3  3     8.50243336E-01   # y_t(Q) DRbar
#
BLOCK Yd Q=  1.84746600E+03  # The Yukawa couplings
  1  1     0.00000000E+00   # y_d(Q) DRbar
  2  2     0.00000000E+00   # y_s(Q) DRbar
  3  3     1.99134420E-01   # y_b(Q) DRbar
#
BLOCK Ye Q=  1.84746600E+03  # The Yukawa couplings
  1  1     0.00000000E+00   # y_e(Q) DRbar
  2  2     0.00000000E+00   # y_mu(Q) DRbar
  3  3     1.48890347E-01   # y_tau(Q) DRbar
#
BLOCK MSOFT Q=  1.84746600E+03  # The soft SUSY breaking masses at the scale Q
         1    -3.33705000E+03   # M_1(Q)              
         2     2.73534000E+03   # M_2(Q)              
         3     2.47570000E+03   # M_3(Q)              
        21     3.58380447E+06   # mH1^2(Q)            
        22    -1.42132553E+05   # mH2^2(Q)            
        31     1.88609000E+03   # meL(Q)              
        32     1.88609000E+03   # mmuL(Q)             
        33     3.35340000E+02   # mtauL(Q)            
        34     3.77800000E+03   # meR(Q)              
        35     3.77800000E+03   # mmuR(Q)             
        36     3.32020000E+03   # mtauR(Q)            
        41     3.68961000E+03   # mqL1(Q)             
        42     3.68961000E+03   # mqL2(Q)             
        43     3.61930000E+03   # mqL3(Q)             
        44     9.92139992E+02   # muR(Q)              
        45     9.92139992E+02   # mcR(Q)              
        46     9.40959985E+02   # mtR(Q)              
        47     1.98454000E+03   # mdR(Q)              
        48     1.98454000E+03   # msR(Q)              
        49     9.13149991E+02   # mbR(Q)              
#
Block HiggsBoundsInputHiggsCouplingsFermions
# ScalarNormEffCoupSq PseudoSNormEffCoupSq NP   IP1 IP2 IP2
    1.01290722E+00    0.00000000E+00        3  25   5   5  # h0-b-b eff. coupling^2, normalised to SM
    2.15104388E+02    0.00000000E+00        3  35   5   5  # H0-b-b eff. coupling^2, normalised to SM
    0.00000000E+00    2.15117296E+02        3  36   5   5  # A0-b-b eff. coupling^2, normalised to SM
#
    9.99939999E-01    0.00000000E+00        3  25   6   6  # h0-t-t eff. coupling^2, normalised to SM
    4.70862755E-03    0.00000000E+00        3  35   6   6  # H0-t-t eff. coupling^2, normalised to SM
    0.00000000E+00    4.64862668E-03        3  36   6   6  # A0-t-t eff. coupling^2, normalised to SM
#
    1.01290722E+00    0.00000000E+00        3  25  15  15  # h0-tau-tau eff. coupling^2, normalised to SM
    2.15104388E+02    0.00000000E+00        3  35  15  15  # H0-tau-tau eff. coupling^2, normalised to SM
    0.00000000E+00    2.15117296E+02        3  36  15  15  # A0-tau-tau eff. coupling^2, normalised to SM
#
Block HiggsBoundsInputHiggsCouplingsBosons
    9.99999808E-01        3  25  24  24  # h0-W-W eff. coupling^2, normalised to SM
    1.92377410E-07        3  35  24  24  # H0-W-W eff. coupling^2, normalised to SM
    0.00000000E+00        3  36  24  24  # A0-W-W eff. coupling^2, normalised to SM
#
    9.99999808E-01        3  25  23  23  # h0-Z-Z eff. coupling^2, normalised to SM
    1.92377410E-07        3  35  23  23  # H0-Z-Z eff. coupling^2, normalised to SM
    0.00000000E+00        3  36  23  23  # A0-Z-Z eff. coupling^2, normalised to SM
#
    8.93919934E-01        3  25  21  21  # h0-g-g eff. coupling^2, normalised to SM
    4.35073219E-12        3  35  21  21  # H0-g-g eff. coupling^2, normalised to SM
    1.82984218E-10        3  36  21  21  # A0-g-g eff. coupling^2, normalised to SM
#
    0.00000000E+00        3  25  25  23  # h0-h0-Z eff. coupling^2, normalised to SM
    0.00000000E+00        3  35  25  23  # H0-h0-Z eff. coupling^2, normalised to SM
    1.92377410E-07        3  36  25  23  # A0-h0-Z eff. coupling^2, normalised to SM
    0.00000000E+00        3  35  35  23  # H0-H0-Z eff. coupling^2, normalised to SM
    9.99999808E-01        3  36  35  23  # A0-H0-Z eff. coupling^2, normalised to SM
    0.00000000E+00        3  36  36  23  # A0-A0-Z eff. coupling^2, normalised to SM
#
    0.00000000E+00        4  25  21  21  23  # h0-g-g-Z eff. coupling^2, normalised to SM
    0.00000000E+00        4  35  21  21  23  # H0-g-g-Z eff. coupling^2, normalised to SM
    0.00000000E+00        4  36  21  21  23  # A0-g-g-Z eff. coupling^2, normalised to SM
#
#
#
#                             =================
#                             |The decay table|
#                             =================
#
# - The QCD corrections to the decays gluino -> squark  + quark
#                                     squark -> gaugino + quark_prime
#                                     squark -> squark_prime + Higgs
#                                     squark -> gluino  + quark
#   are included.
#
# - The multi-body decays for the inos, stops and sbottoms are included.
#
# - The loop induced decays for the gluino, neutralinos and stops
#   are included.
#
# - The SUSY decays of the top quark are included.
#
#
#         PDG            Width
DECAY         6     1.43135649E+00   # top decays
#          BR         NDA      ID1       ID2
     1.00000000E+00    2           5        24   # BR(t ->  b    W+)
#
#         PDG            Width
DECAY   1000021     1.61601472E+02   # gluino decays
#          BR         NDA      ID1       ID2
     2.25800312E-02    2     2000001        -1   # BR(~g -> ~d_R  db)
     2.25800312E-02    2    -2000001         1   # BR(~g -> ~d_R* d )
     1.15754319E-01    2     2000002        -2   # BR(~g -> ~u_R  ub)
     1.15754319E-01    2    -2000002         2   # BR(~g -> ~u_R* u )
     2.25800312E-02    2     2000003        -3   # BR(~g -> ~s_R  sb)
     2.25800312E-02    2    -2000003         3   # BR(~g -> ~s_R* s )
     1.15754298E-01    2     2000004        -4   # BR(~g -> ~c_R  cb)
     1.15754298E-01    2    -2000004         4   # BR(~g -> ~c_R* c )
     1.12344339E-01    2     1000005        -5   # BR(~g -> ~b_1  bb)
     1.12344339E-01    2    -1000005         5   # BR(~g -> ~b_1* b )
     1.10986983E-01    2     1000006        -6   # BR(~g -> ~t_1  tb)
     1.10986983E-01    2    -1000006         6   # BR(~g -> ~t_1* t )
#
#         PDG            Width
DECAY   1000006     2.81890754E+01   # stop1 decays
#          BR         NDA      ID1       ID2
     2.42781875E-01    2     1000022         6   # BR(~t_1 -> ~chi_10 t )
     2.43579273E-01    2     1000023         6   # BR(~t_1 -> ~chi_20 t )
     5.13638852E-01    2     1000024         5   # BR(~t_1 -> ~chi_1+ b )
#
#         PDG            Width
DECAY   2000006     1.52779722E+02   # stop2 decays
#          BR         NDA      ID1       ID2
     1.70084680E-01    2     1000022         6   # BR(~t_2 -> ~chi_10 t )
     1.71894407E-01    2     1000023         6   # BR(~t_2 -> ~chi_20 t )
     1.73895838E-02    2     1000025         6   # BR(~t_2 -> ~chi_30 t )
     7.22766497E-05    2     1000035         6   # BR(~t_2 -> ~chi_40 t )
     2.04017444E-02    2     1000024         5   # BR(~t_2 -> ~chi_1+ b )
     3.49078890E-02    2     1000037         5   # BR(~t_2 -> ~chi_2+ b )
     3.29686749E-01    2     1000021         6   # BR(~t_2 -> ~g      t )
     1.25276997E-01    2     1000006        25   # BR(~t_2 -> ~t_1    h )
     1.11480844E-04    2     1000006        35   # BR(~t_2 -> ~t_1    H )
     1.09374599E-04    2     1000006        36   # BR(~t_2 -> ~t_1    A )
     1.14790188E-02    2     1000005        37   # BR(~t_2 -> ~b_1    H+)
     1.18554205E-01    2     1000006        23   # BR(~t_2 -> ~t_1    Z )
     3.15942562E-05    2     1000005        24   # BR(~t_2 -> ~b_1    W+)
#
#         PDG            Width
DECAY   1000005     1.50299287E+00   # sbottom1 decays
#          BR         NDA      ID1       ID2
     2.59087404E-01    2     1000022         5   # BR(~b_1 -> ~chi_10 b )
     2.56391389E-01    2     1000023         5   # BR(~b_1 -> ~chi_20 b )
     4.84521207E-01    2    -1000024         6   # BR(~b_1 -> ~chi_1- t )
#
#         PDG            Width
DECAY   2000005     1.50242928E+02   # sbottom2 decays
#          BR         NDA      ID1       ID2
     9.64581774E-03    2     1000022         5   # BR(~b_2 -> ~chi_10 b )
     9.55129685E-03    2     1000023         5   # BR(~b_2 -> ~chi_20 b )
     1.77210746E-02    2     1000025         5   # BR(~b_2 -> ~chi_30 b )
     1.07909979E-04    2     1000035         5   # BR(~b_2 -> ~chi_40 b )
     3.46717300E-01    2    -1000024         6   # BR(~b_2 -> ~chi_1- t )
     3.52815082E-02    2    -1000037         6   # BR(~b_2 -> ~chi_2- t )
     3.35710836E-01    2     1000021         5   # BR(~b_2 -> ~g      b )
     1.60050797E-05    2     1000005        25   # BR(~b_2 -> ~b_1    h )
     5.86411649E-03    2     1000005        35   # BR(~b_2 -> ~b_1    H )
     5.86449286E-03    2     1000005        36   # BR(~b_2 -> ~b_1    A )
     2.20745362E-04    2     1000006       -37   # BR(~b_2 -> ~t_1    H-)
     1.65019884E-05    2     1000005        23   # BR(~b_2 -> ~b_1    Z )
     2.33282396E-01    2     1000006       -24   # BR(~b_2 -> ~t_1    W-)
#
#         PDG            Width
DECAY   1000002     8.98864669E+01   # sup_L decays
#          BR         NDA      ID1       ID2
     6.83497030E-05    2     1000022         2   # BR(~u_L -> ~chi_10 u)
     8.06224678E-05    2     1000023         2   # BR(~u_L -> ~chi_20 u)
     3.31984367E-02    2     1000025         2   # BR(~u_L -> ~chi_30 u)
     2.68840630E-04    2     1000035         2   # BR(~u_L -> ~chi_40 u)
     4.96728080E-04    2     1000024         1   # BR(~u_L -> ~chi_1+ d)
     6.63316225E-02    2     1000037         1   # BR(~u_L -> ~chi_2+ d)
     8.99555400E-01    2     1000021         2   # BR(~u_L -> ~g      u)
#
#         PDG            Width
DECAY   2000002     5.25134416E-04   # sup_R decays
#           BR         NDA      ID1       ID2
     3.67553387E-01    2     1000022         2   # BR(~u_R -> ~chi_10 u)
     5.47494791E-01    2     1000023         2   # BR(~u_R -> ~chi_20 u)
#           BR         NDA      ID1       ID2       ID3
     6.28524793E-06    3        2       -5        1000005   # BR(~u_R -> u  bb  ~b_1)
     3.98278981E-05    3        2       5        -1000005   # BR(~u_R -> u  b  ~b_1*)
     9.98163488E-03    3        2       -15        1000015   # BR(~u_R -> u  tau+  ~tau_1-)
     4.05191497E-04    3        2       15        -1000015   # BR(~u_R -> u  tau-  ~tau_1+)
     1.05418724E-02    3        2       -16        1000016   # BR(~u_R -> u  nu_taub  ~nu_tau1)
     4.50265671E-04    3        2       16        -1000016   # BR(~u_R -> u  nu_tau  ~nu_tau1*)
     1.10684043E-02    3        2       23        1000022   # BR(~u_R -> u  Z  ~chi_10)
     4.57787555E-03    3        2       25        1000022   # BR(~u_R -> u  h  ~chi_10)
     7.64432854E-03    3        2       23        1000023   # BR(~u_R -> u  Z  ~chi_20)
     7.88769480E-03    3        2       25        1000023   # BR(~u_R -> u  h  ~chi_20)
     1.31448250E-03    3        2       -24        1000024   # BR(~u_R -> u  W-  ~chi_1+)
     3.10339591E-02    3        2       24        -1000024   # BR(~u_R -> u  W+  ~chi_1-)
#
#         PDG            Width
DECAY   1000001     8.99276082E+01   # sdown_L decays
#          BR         NDA      ID1       ID2
     4.79793048E-05    2     1000022         1   # BR(~d_L -> ~chi_10 d)
     5.39135016E-05    2     1000023         1   # BR(~d_L -> ~chi_20 d)
     3.32245660E-02    2     1000025         1   # BR(~d_L -> ~chi_30 d)
     2.70477329E-04    2     1000035         1   # BR(~d_L -> ~chi_40 d)
     5.47188754E-07    2    -1000024         2   # BR(~d_L -> ~chi_1- u)
     6.64759727E-02    2    -1000037         2   # BR(~d_L -> ~chi_2- u)
     8.99926544E-01    2     1000021         1   # BR(~d_L -> ~g      d)
#
#         PDG            Width
DECAY   2000001     7.12616970E-02   # sdown_R decays
#           BR         NDA      ID1       ID2
     1.28305615E-03    2     1000022         1   # BR(~d_R -> ~chi_10 d)
     1.91175990E-03    2     1000023         1   # BR(~d_R -> ~chi_20 d)
#           BR         NDA      ID1       ID2       ID3
     6.43262818E-02    3        1       -2        2000002   # BR(~d_R -> d  ub  ~u_R)
     1.69600227E-01    3        1       2        -2000002   # BR(~d_R -> d  u  ~u_R*)
     6.46644719E-02    3        1       -4        2000004   # BR(~d_R -> d  cb  ~c_R)
     1.67691769E-01    3        1       4        -2000004   # BR(~d_R -> d  c  ~c_R*)
     7.77093479E-02    3        1       -5        1000005   # BR(~d_R -> d  bb  ~b_1)
     2.11025006E-01    3        1       5        -1000005   # BR(~d_R -> d  b  ~b_1*)
     6.96054151E-02    3        1       -6        1000006   # BR(~d_R -> d  tb  ~t_1)
     1.70161539E-01    3        1       6        -1000006   # BR(~d_R -> d  t  ~t_1*)
     8.83504079E-09    3        1       -11        1000011   # BR(~d_R -> d  e+  ~e_L-)
     3.11078755E-09    3        1       11        -1000011   # BR(~d_R -> d  e-  ~e_L+)
     9.38624855E-09    3        1       -12        1000012   # BR(~d_R -> d  nu_eb  ~nu_eL)
     3.37095537E-09    3        1       12        -1000012   # BR(~d_R -> d  nu_e  ~nu_eL*)
     8.75252802E-09    3        1       -13        1000013   # BR(~d_R -> d  mu+  ~mu_L-)
     3.12510099E-09    3        1       13        -1000013   # BR(~d_R -> d  mu-  ~mu_L+)
     9.43816985E-09    3        1       -14        1000014   # BR(~d_R -> d  nu_mub  ~nu_muL)
     3.33222488E-09    3        1       14        -1000014   # BR(~d_R -> d  nu_mu  ~nu_muL*)
     3.56699336E-04    3        1       -15        1000015   # BR(~d_R -> d  tau+  ~tau_1-)
     4.64162396E-05    3        1       15        -1000015   # BR(~d_R -> d  tau-  ~tau_1+)
     3.61723073E-04    3        1       -16        1000016   # BR(~d_R -> d  nu_taub  ~nu_tau1)
     4.79359901E-05    3        1       16        -1000016   # BR(~d_R -> d  nu_tau  ~nu_tau1*)
     1.88474322E-04    3        1       23        1000022   # BR(~d_R -> d  Z  ~chi_10)
     1.00710484E-04    3        1       25        1000022   # BR(~d_R -> d  h  ~chi_10)
     3.34766095E-11    3        1       35        1000022   # BR(~d_R -> d  H  ~chi_10)
     2.12007300E-10    3        1       36        1000022   # BR(~d_R -> d  A  ~chi_10)
     1.17260750E-04    3        1       23        1000023   # BR(~d_R -> d  Z  ~chi_20)
     1.68351309E-04    3        1       25        1000023   # BR(~d_R -> d  h  ~chi_20)
     1.94424222E-10    3        1       35        1000023   # BR(~d_R -> d  H  ~chi_20)
     3.00694495E-11    3        1       36        1000023   # BR(~d_R -> d  A  ~chi_20)
     7.11420049E-05    3        1       -24        1000024   # BR(~d_R -> d  W-  ~chi_1+)
     5.62363818E-04    3        1       24        -1000024   # BR(~d_R -> d  W+  ~chi_1-)
     2.85679416E-10    3        1       -37        1000024   # BR(~d_R -> d  H-  ~chi_1+)
     9.42455805E-11    3        1       37        -1000024   # BR(~d_R -> d  H+  ~chi_1-)
#
#         PDG            Width
DECAY   1000004     6.54792960E+01   # scharm_L decays
#          BR         NDA      ID1       ID2
     9.82625659E-05    2     1000022         4   # BR(~c_L -> ~chi_10 c)
     1.15905632E-04    2     1000023         4   # BR(~c_L -> ~chi_20 c)
     4.66539507E-02    2     1000025         4   # BR(~c_L -> ~chi_30 c)
     3.68098079E-04    2     1000035         4   # BR(~c_L -> ~chi_40 c)
     7.14114182E-04    2     1000024         3   # BR(~c_L -> ~chi_1+ s)
     9.32159563E-02    2     1000037         3   # BR(~c_L -> ~chi_2+ s)
     8.58833712E-01    2     1000021         4   # BR(~c_L -> ~g      c)
#
#         PDG            Width
DECAY   2000004     5.14033859E-04   # scharm_R decays
#           BR         NDA      ID1       ID2
     3.66723152E-01    2     1000022         4   # BR(~c_R -> ~chi_10 c)
     5.46251963E-01    2     1000023         4   # BR(~c_R -> ~chi_20 c)
#           BR         NDA      ID1       ID2       ID3
     6.37603913E-06    3        4       -5        1000005   # BR(~c_R -> c  bb  ~b_1)
     4.05226224E-05    3        4       5        -1000005   # BR(~c_R -> c  b  ~b_1*)
     1.01682018E-02    3        4       -15        1000015   # BR(~c_R -> c  tau+  ~tau_1-)
     4.11860028E-04    3        4       15        -1000015   # BR(~c_R -> c  tau-  ~tau_1+)
     1.07380086E-02    3        4       -16        1000016   # BR(~c_R -> c  nu_taub  ~nu_tau1)
     4.66000431E-04    3        4       16        -1000016   # BR(~c_R -> c  nu_tau  ~nu_tau1*)
     1.15206419E-02    3        4       23        1000022   # BR(~c_R -> c  Z  ~chi_10)
     4.68295999E-03    3        4       25        1000022   # BR(~c_R -> c  h  ~chi_10)
     7.89286528E-03    3        4       23        1000023   # BR(~c_R -> c  Z  ~chi_20)
     8.03390657E-03    3        4       25        1000023   # BR(~c_R -> c  h  ~chi_20)
     1.33605985E-03    3        4       -24        1000024   # BR(~c_R -> c  W-  ~chi_1+)
     3.17274820E-02    3        4       24        -1000024   # BR(~c_R -> c  W+  ~chi_1-)
#
#         PDG            Width
DECAY   1000003     6.54973337E+01   # sstrange_L decays
#          BR         NDA      ID1       ID2
     6.89893629E-05    2     1000022         3   # BR(~s_L -> ~chi_10 s)
     7.75215962E-05    2     1000023         3   # BR(~s_L -> ~chi_20 s)
     4.66997778E-02    2     1000025         3   # BR(~s_L -> ~chi_30 s)
     3.70428978E-04    2     1000035         3   # BR(~s_L -> ~chi_40 s)
     7.86796819E-07    2    -1000024         4   # BR(~s_L -> ~chi_1- c)
     9.34367447E-02    2    -1000037         4   # BR(~s_L -> ~chi_2- c)
     8.59345751E-01    2     1000021         3   # BR(~s_L -> ~g      s)
#
#         PDG            Width
DECAY   2000003     7.12565006E-02   # sstrange_R decays
#           BR         NDA      ID1       ID2
     1.30190125E-03    2     1000022         3   # BR(~s_R -> ~chi_10 s)
     1.93982121E-03    2     1000023         3   # BR(~s_R -> ~chi_20 s)
#           BR         NDA      ID1       ID2       ID3
     6.43674607E-02    3        3       -2        2000002   # BR(~s_R -> s  ub  ~u_R)
     1.69612595E-01    3        3       2        -2000002   # BR(~s_R -> s  u  ~u_R*)
     6.46691876E-02    3        3       -4        2000004   # BR(~s_R -> s  cb  ~c_R)
     1.67689964E-01    3        3       4        -2000004   # BR(~s_R -> s  c  ~c_R*)
     7.77234351E-02    3        3       -5        1000005   # BR(~s_R -> s  bb  ~b_1)
     2.11012327E-01    3        3       5        -1000005   # BR(~s_R -> s  b  ~b_1*)
     6.95459356E-02    3        3       -6        1000006   # BR(~s_R -> s  tb  ~t_1)
     1.70117812E-01    3        3       6        -1000006   # BR(~s_R -> s  t  ~t_1*)
     8.83568509E-09    3        3       -11        1000011   # BR(~s_R -> s  e+  ~e_L-)
     3.10904968E-09    3        3       11        -1000011   # BR(~s_R -> s  e-  ~e_L+)
     9.42047385E-09    3        3       -12        1000012   # BR(~s_R -> s  nu_eb  ~nu_eL)
     3.39309394E-09    3        3       12        -1000012   # BR(~s_R -> s  nu_e  ~nu_eL*)
     8.75316631E-09    3        3       -13        1000013   # BR(~s_R -> s  mu+  ~mu_L-)
     3.13304749E-09    3        3       13        -1000013   # BR(~s_R -> s  mu-  ~mu_L+)
     9.29753769E-09    3        3       -14        1000014   # BR(~s_R -> s  nu_mub  ~nu_muL)
     3.36221956E-09    3        3       14        -1000014   # BR(~s_R -> s  nu_mu  ~nu_muL*)
     3.53764215E-04    3        3       -15        1000015   # BR(~s_R -> s  tau+  ~tau_1-)
     4.64196245E-05    3        3       15        -1000015   # BR(~s_R -> s  tau-  ~tau_1+)
     3.61749452E-04    3        3       -16        1000016   # BR(~s_R -> s  nu_taub  ~nu_tau1)
     4.82341958E-05    3        3       16        -1000016   # BR(~s_R -> s  nu_tau  ~nu_tau1*)
     1.88488066E-04    3        3       23        1000022   # BR(~s_R -> s  Z  ~chi_10)
     1.00717828E-04    3        3       25        1000022   # BR(~s_R -> s  h  ~chi_10)
     3.36671038E-11    3        3       35        1000022   # BR(~s_R -> s  H  ~chi_10)
     2.12401674E-10    3        3       36        1000022   # BR(~s_R -> s  A  ~chi_10)
     1.18220793E-04    3        3       23        1000023   # BR(~s_R -> s  Z  ~chi_20)
     1.68363587E-04    3        3       25        1000023   # BR(~s_R -> s  h  ~chi_20)
     1.94438401E-10    3        3       35        1000023   # BR(~s_R -> s  H  ~chi_20)
     3.01207607E-11    3        3       36        1000023   # BR(~s_R -> s  A  ~chi_20)
     7.11471930E-05    3        3       -24        1000024   # BR(~s_R -> s  W-  ~chi_1+)
     5.62404829E-04    3        3       24        -1000024   # BR(~s_R -> s  W+  ~chi_1-)
     2.84675782E-10    3        3       -37        1000024   # BR(~s_R -> s  H-  ~chi_1+)
     9.33542897E-11    3        3       37        -1000024   # BR(~s_R -> s  H+  ~chi_1-)
#
#         PDG            Width
DECAY   1000011     9.78336119E-03   # selectron_L decays
#          BR         NDA      ID1       ID2
     4.49135598E-01    2     1000022        11   # BR(~e_L -> ~chi_10 e-)
     5.48201208E-01    2     1000023        11   # BR(~e_L -> ~chi_20 e-)
     2.66319404E-03    2    -1000024        12   # BR(~e_L -> ~chi_1- nu_e)
#
#         PDG            Width
DECAY   2000011     1.08323465E+00   # selectron_R decays
#           BR         NDA      ID1       ID2
     1.42423996E-03    2     1000022        11   # BR(~e_R -> ~chi_10 e-)
     2.12226401E-03    2     1000023        11   # BR(~e_R -> ~chi_20 e-)
     1.83783226E-07    2     1000025        11   # BR(~e_R -> ~chi_30 e-)
     9.96453312E-01    2     1000035        11   # BR(~e_R -> ~chi_40 e-)
#
#         PDG            Width
DECAY   1000013     9.78336113E-03   # smuon_L decays
#          BR         NDA      ID1       ID2
     4.49135598E-01    2     1000022        13   # BR(~mu_L -> ~chi_10 mu-)
     5.48201208E-01    2     1000023        13   # BR(~mu_L -> ~chi_20 mu-)
     2.66319406E-03    2    -1000024        14   # BR(~mu_L -> ~chi_1- nu_mu)
#
#         PDG            Width
DECAY   2000013     1.08323461E+00   # smuon_R decays
#           BR         NDA      ID1       ID2
     1.42423999E-03    2     1000022        13   # BR(~mu_R -> ~chi_10 mu-)
     2.12226405E-03    2     1000023        13   # BR(~mu_R -> ~chi_20 mu-)
     1.83783231E-07    2     1000025        13   # BR(~mu_R -> ~chi_30 mu-)
     9.96453312E-01    2     1000035        13   # BR(~mu_R -> ~chi_40 mu-)
#
#         PDG            Width
DECAY   1000015     1.19612879E-01   # stau_1 decays
#          BR         NDA      ID1       ID2
     5.03018766E-01    2     1000022        15   # BR(~tau_1 -> ~chi_10  tau-)
     4.96948595E-01    2     1000023        15   # BR(~tau_1 -> ~chi_20  tau-)
     3.26391912E-05    2    -1000024        16   # BR(~tau_1 -> ~chi_1-  nu_tau)
#
#         PDG            Width
DECAY   2000015     3.97929772E+00   # stau_2 decays
#          BR         NDA      ID1       ID2
     1.85423055E-01    2     1000022        15   # BR(~tau_2 -> ~chi_10  tau-)
     1.83707371E-01    2     1000023        15   # BR(~tau_2 -> ~chi_20  tau-)
     8.79956469E-08    2     1000025        15   # BR(~tau_2 -> ~chi_30  tau-)
     2.34985564E-04    2     1000035        15   # BR(~tau_2 -> ~chi_40  tau-)
     3.68277319E-01    2    -1000024        16   # BR(~tau_2 -> ~chi_1-  nu_tau)
     1.36473864E-07    2    -1000037        16   # BR(~tau_2 -> ~chi_2-  nu_tau)
     1.31085335E-01    2     1000016       -37   # BR(~tau_2 -> ~nu_tauL H-)
     1.35188501E-04    2     1000016       -24   # BR(~tau_2 -> ~nu_tauL W-)
     7.51322506E-05    2     1000015        25   # BR(~tau_2 -> ~tau_1   h)
     6.54942754E-02    2     1000015        35   # BR(~tau_2 -> ~tau_1   H)
     6.54975849E-02    2     1000015        36   # BR(~tau_2 -> ~tau_1   A)
     6.95279515E-05    2     1000015        23   # BR(~tau_2 -> ~tau_1   Z)
#
#         PDG            Width
DECAY   1000012     2.66555556E-02   # snu_eL decays
#          BR         NDA      ID1       ID2
     5.57091762E-02    2     1000022        12   # BR(~nu_eL -> ~chi_10 nu_e)
     5.81266659E-02    2     1000023        12   # BR(~nu_eL -> ~chi_20 nu_e)
     8.86164158E-01    2     1000024        11   # BR(~nu_eL -> ~chi_1+ e-)
#
#         PDG            Width
DECAY   1000014     2.66555554E-02   # snu_muL decays
#          BR         NDA      ID1       ID2
     5.57091765E-02    2     1000022        14   # BR(~nu_muL -> ~chi_10 nu_mu)
     5.81266662E-02    2     1000023        14   # BR(~nu_muL -> ~chi_20 nu_mu)
     8.86164157E-01    2     1000024        13   # BR(~nu_muL -> ~chi_1+ mu-)
#
#         PDG            Width
DECAY   1000016     1.16626388E-01   # snu_tauL decays
#          BR         NDA      ID1       ID2
     1.73792714E-03    2     1000022        16   # BR(~nu_tauL -> ~chi_10 nu_tau)
     1.80476819E-03    2     1000023        16   # BR(~nu_tauL -> ~chi_20 nu_tau)
     9.96457305E-01    2     1000024        15   # BR(~nu_tauL -> ~chi_1+ tau-)
#
#         PDG            Width
DECAY   1000024     2.67004500E-12   # chargino1+ decays
#           BR         NDA      ID1       ID2       ID3
     1.64076760E-01    3     1000022       -11        12   # BR(~chi_1+ -> ~chi_10 e+   nu_e)
     1.54356370E-01    3     1000022       -13        14   # BR(~chi_1+ -> ~chi_10 mu+  nu_mu)
     4.63941570E-01    2     1000022       211             # BR(~chi_1+ -> ~chi_10 pi+)
     2.03209960E-01    3     1000022       211        111   # BR(~chi_1+ -> ~chi_10 pi+ pi0)
     7.20766920E-03    4     1000022       211        111       111 # BR(~chi_1+ -> ~chi_10 pi+ pi0 pi0)
     7.20766920E-03    4     1000022       211        211      -211 # BR(~chi_1+ -> ~chi_10 pi+ pi+ pi-)
#
#         PDG            Width
DECAY   1000037     6.19065559E+01   # chargino2+ decays
#          BR         NDA      ID1       ID2
     3.32494405E-03    2     1000006        -5   # BR(~chi_2+ -> ~t_1     bb)
     7.62130945E-10    2    -1000005         6   # BR(~chi_2+ -> ~b_1*    t )
     5.10934376E-02    2     1000012       -11   # BR(~chi_2+ -> ~nu_eL   e+  )
     5.10934376E-02    2     1000014       -13   # BR(~chi_2+ -> ~nu_muL mu+ )
     1.75814840E-01    2     1000016       -15   # BR(~chi_2+ -> ~nu_tau1 tau+)
     5.09861362E-02    2    -1000011        12   # BR(~chi_2+ -> ~e_L+    nu_e)
     5.09861362E-02    2    -1000013        14   # BR(~chi_2+ -> ~mu_L+   nu_mu)
     1.75790883E-01    2    -1000015        16   # BR(~chi_2+ -> ~tau_1+  nu_tau)
     8.53064478E-02    2     1000024        23   # BR(~chi_2+ -> ~chi_1+  Z )
     8.24608637E-02    2     1000022        24   # BR(~chi_2+ -> ~chi_10  W+)
     8.33057833E-02    2     1000023        24   # BR(~chi_2+ -> ~chi_20  W+)
     8.90160375E-02    2     1000024        25   # BR(~chi_2+ -> ~chi_1+  h )
     2.52349659E-02    2     1000024        35   # BR(~chi_2+ -> ~chi_1+  H )
     2.52327095E-02    2     1000024        36   # BR(~chi_2+ -> ~chi_1+  A )
     2.52980101E-02    2     1000022        37   # BR(~chi_2+ -> ~chi_10  H+)
     2.50553674E-02    2     1000023        37   # BR(~chi_2+ -> ~chi_20  H+)
#
#         PDG            Width
DECAY   1000022     0.00000000E+00   # neutralino1 decays
#
#         PDG            Width
DECAY   1000023     2.88560887E-12   # neutralino2 decays
#          BR         NDA      ID1       ID2
     6.62818608E-01    2     1000022        22   # BR(~chi_20 -> ~chi_10 gam)
#           BR         NDA      ID1       ID2       ID3
     5.63920799E-02    3     1000022        -2         2   # BR(~chi_20 -> ~chi_10 ub      u)
     7.31869641E-02    3     1000022        -1         1   # BR(~chi_20 -> ~chi_10 db      d)
     7.31869641E-02    3     1000022        -3         3   # BR(~chi_20 -> ~chi_10 sb      s)
     1.68048749E-02    3     1000022       -11        11   # BR(~chi_20 -> ~chi_10 e+      e-)
     1.68048749E-02    3     1000022       -13        13   # BR(~chi_20 -> ~chi_10 mu+     mu-)
     3.35998959E-02    3     1000022       -12        12   # BR(~chi_20 -> ~chi_10 nu_eb   nu_e)
     3.35998959E-02    3     1000022       -14        14   # BR(~chi_20 -> ~chi_10 nu_mub  nu_mu)
     3.36007831E-02    3     1000022       -16        16   # BR(~chi_20 -> ~chi_10 nu_taub nu_tau)
     1.26466965E-06    3     1000024       -12        11   # BR(~chi_20 -> ~chi_1+ nu_eb   e-)
     1.26466965E-06    3    -1000024        12       -11   # BR(~chi_20 -> ~chi_1- nu_e    e+)
     1.26466965E-06    3     1000024       -14        13   # BR(~chi_20 -> ~chi_1+ nu_mub  mu-)
     1.26466965E-06    3    -1000024        14       -13   # BR(~chi_20 -> ~chi_1- nu_mu   mu+)
#
#         PDG            Width
DECAY   1000025     6.18874408E+01   # neutralino3 decays
#          BR         NDA      ID1       ID2
     4.53253913E-02    2     1000022        23   # BR(~chi_30 -> ~chi_10   Z )
     4.00491331E-02    2     1000023        23   # BR(~chi_30 -> ~chi_20   Z )
     8.28811245E-02    2     1000024       -24   # BR(~chi_30 -> ~chi_1+   W-)
     8.28811245E-02    2    -1000024        24   # BR(~chi_30 -> ~chi_1-   W+)
     4.14846658E-02    2     1000022        25   # BR(~chi_30 -> ~chi_10   h )
     1.61669571E-02    2     1000022        35   # BR(~chi_30 -> ~chi_10   H )
     9.22659516E-03    2     1000022        36   # BR(~chi_30 -> ~chi_10   A )
     4.73943863E-02    2     1000023        25   # BR(~chi_30 -> ~chi_20   h )
     9.09275857E-03    2     1000023        35   # BR(~chi_30 -> ~chi_20   H )
     1.60311546E-02    2     1000023        36   # BR(~chi_30 -> ~chi_20   A )
     2.51534556E-02    2     1000024       -37   # BR(~chi_30 -> ~chi_1+   H-)
     2.51534556E-02    2    -1000024        37   # BR(~chi_30 -> ~chi_1-   H+)
     5.04387622E-09    2     2000002        -2   # BR(~chi_30 -> ~u_R      ub)
     5.04387622E-09    2    -2000002         2   # BR(~chi_30 -> ~u_R*     u )
     3.53633646E-10    2     2000001        -1   # BR(~chi_30 -> ~d_R      db)
     3.53633646E-10    2    -2000001         1   # BR(~chi_30 -> ~d_R*     d )
     5.04387551E-09    2     2000004        -4   # BR(~chi_30 -> ~c_R      cb)
     5.04387551E-09    2    -2000004         4   # BR(~chi_30 -> ~c_R*     c )
     3.53633646E-10    2     2000003        -3   # BR(~chi_30 -> ~s _R      sb)
     3.53633646E-10    2    -2000003         3   # BR(~chi_30 -> ~s _R*     s )
     1.65025706E-03    2     1000006        -6   # BR(~chi_30 -> ~t_1      tb)
     1.65025706E-03    2    -1000006         6   # BR(~chi_30 -> ~t_1*     t )
     1.67043621E-09    2     1000005        -5   # BR(~chi_30 -> ~b_1      bb)
     1.67043621E-09    2    -1000005         5   # BR(~chi_30 -> ~b_1*     b )
     2.54680045E-02    2     1000011       -11   # BR(~chi_30 -> ~e_L-     e+)
     2.54680045E-02    2    -1000011        11   # BR(~chi_30 -> ~e_L+     e-)
     2.54680045E-02    2     1000013       -13   # BR(~chi_30 -> ~mu_L-    mu+)
     2.54680045E-02    2    -1000013        13   # BR(~chi_30 -> ~mu_L+    mu-)
     8.78273197E-02    2     1000015       -15   # BR(~chi_30 -> ~tau_1-   tau+)
     8.78273197E-02    2    -1000015        15   # BR(~chi_30 -> ~tau_1+   tau-)
     2.55737429E-02    2     1000012       -12   # BR(~chi_30 -> ~nu_eL    nu_eb)
     2.55737429E-02    2    -1000012        12   # BR(~chi_30 -> ~nu_eL*   nu_e )
     2.55737429E-02    2     1000014       -14   # BR(~chi_30 -> ~nu_muL   nu_mub)
     2.55737429E-02    2    -1000014        14   # BR(~chi_30 -> ~nu_muL*  nu_mu )
     8.80188150E-02    2     1000016       -16   # BR(~chi_30 -> ~nu_tau1  nu_taub)
     8.80188150E-02    2    -1000016        16   # BR(~chi_30 -> ~nu_tau1* nu_tau )
#
#         PDG            Width
DECAY   1000035     9.30193559E+01   # neutralino4 decays
#          BR         NDA      ID1       ID2
     1.44239765E-02    2     1000022        23   # BR(~chi_40 -> ~chi_10   Z )
     9.87958292E-03    2     1000023        23   # BR(~chi_40 -> ~chi_20   Z )
     4.99682683E-07    2     1000025        23   # BR(~chi_40 -> ~chi_30   Z )
     2.35922683E-02    2     1000024       -24   # BR(~chi_40 -> ~chi_1+   W-)
     2.35922683E-02    2    -1000024        24   # BR(~chi_40 -> ~chi_1-   W+)
     4.95684122E-07    2     1000037       -24   # BR(~chi_40 -> ~chi_2+   W-)
     4.95684122E-07    2    -1000037        24   # BR(~chi_40 -> ~chi_2-   W+)
     9.42750030E-03    2     1000022        25   # BR(~chi_40 -> ~chi_10   h )
     5.43226345E-03    2     1000022        35   # BR(~chi_40 -> ~chi_10   H )
     4.99444791E-03    2     1000022        36   # BR(~chi_40 -> ~chi_10   A )
     1.42300023E-02    2     1000023        25   # BR(~chi_40 -> ~chi_20   h )
     4.93669636E-03    2     1000023        35   # BR(~chi_40 -> ~chi_20   H )
     5.37561099E-03    2     1000023        36   # BR(~chi_40 -> ~chi_20   A )
     2.25415796E-09    2     1000025        25   # BR(~chi_40 -> ~chi_30   h )
     1.03356622E-02    2     1000024       -37   # BR(~chi_40 -> ~chi_1+   H-)
     1.03356622E-02    2    -1000024        37   # BR(~chi_40 -> ~chi_1-   H+)
     9.66911446E-02    2     2000002        -2   # BR(~chi_40 -> ~u_R      ub)
     9.66911446E-02    2    -2000002         2   # BR(~chi_40 -> ~u_R*     u )
     1.14691425E-02    2     2000001        -1   # BR(~chi_40 -> ~d_R      db)
     1.14691425E-02    2    -2000001         1   # BR(~chi_40 -> ~d_R*     d )
     9.66911386E-02    2     2000004        -4   # BR(~chi_40 -> ~c_R      cb)
     9.66911386E-02    2    -2000004         4   # BR(~chi_40 -> ~c_R*     c )
     1.14691425E-02    2     2000003        -3   # BR(~chi_40 -> ~s _R      sb)
     1.14691425E-02    2    -2000003         3   # BR(~chi_40 -> ~s _R*     s )
     1.00834231E-01    2     1000006        -6   # BR(~chi_40 -> ~t_1      tb)
     1.00834231E-01    2    -1000006         6   # BR(~chi_40 -> ~t_1*     t )
     2.58500565E-02    2     1000005        -5   # BR(~chi_40 -> ~b_1      bb)
     2.58500565E-02    2    -1000005         5   # BR(~chi_40 -> ~b_1*     b )
     1.06414932E-02    2     1000011       -11   # BR(~chi_40 -> ~e_L-     e+)
     1.06414932E-02    2    -1000011        11   # BR(~chi_40 -> ~e_L+     e-)
     1.06414932E-02    2     1000013       -13   # BR(~chi_40 -> ~mu_L-    mu+)
     1.06414932E-02    2    -1000013        13   # BR(~chi_40 -> ~mu_L+    mu-)
     2.30137155E-02    2     1000015       -15   # BR(~chi_40 -> ~tau_1-   tau+)
     2.30137155E-02    2    -1000015        15   # BR(~chi_40 -> ~tau_1+   tau-)
     1.06757047E-02    2     1000012       -12   # BR(~chi_40 -> ~nu_eL    nu_eb)
     1.06757047E-02    2    -1000012        12   # BR(~chi_40 -> ~nu_eL*   nu_e )
     1.06757047E-02    2     1000014       -14   # BR(~chi_40 -> ~nu_muL   nu_mub)
     1.06757047E-02    2    -1000014        14   # BR(~chi_40 -> ~nu_muL*  nu_mu )
     2.30683160E-02    2     1000016       -16   # BR(~chi_40 -> ~nu_tau1  nu_taub)
     2.30683160E-02    2    -1000016        16   # BR(~chi_40 -> ~nu_tau1* nu_tau )
#
#         PDG            Width
DECAY        25     4.13576142E-03   # h decays
#          BR         NDA      ID1       ID2
     5.93214493E-01    2           5        -5   # BR(h -> b       bb     )
     6.36061314E-02    2         -15        15   # BR(h -> tau+    tau-   )
     2.25128442E-04    2         -13        13   # BR(h -> mu+     mu-    )
     2.45546797E-04    2           3        -3   # BR(h -> s       sb     )
     2.10304783E-02    2           4        -4   # BR(h -> c       cb     )
     7.82071541E-02    2          21        21   # BR(h -> g       g      )
     2.29837137E-03    2          22        22   # BR(h -> gam     gam    )
     1.57380516E-03    2          22        23   # BR(h -> Z       gam    )
     2.12760367E-01    2          24       -24   # BR(h -> W+      W-     )
     2.68385236E-02    2          23        23   # BR(h -> Z       Z      )
#
#         PDG            Width
DECAY        35     6.33168922E+00   # H decays
#          BR         NDA      ID1       ID2
     7.98481455E-01    2           5        -5   # BR(H -> b       bb     )
     1.36086859E-01    2         -15        15   # BR(H -> tau+    tau-   )
     4.77181376E-04    2         -13        13   # BR(H -> mu+     mu-    )
     3.19364242E-04    2           3        -3   # BR(H -> s       sb     )
     6.19635047E-07    2           4        -4   # BR(H -> c       cb     )
     5.98328088E-02    2           6        -6   # BR(H -> t       tb     )
     2.77730275E-05    2          21        21   # BR(H -> g       g      )
     5.67160352E-08    2          22        22   # BR(H -> gam     gam    )
     4.36296136E-08    2          23        22   # BR(H -> Z       gam    )
     6.74332768E-05    2          24       -24   # BR(H -> W+      W-     )
     3.35780226E-05    2          23        23   # BR(H -> Z       Z      )
     2.45390409E-04    2          25        25   # BR(H -> h       h      )
     3.85926027E-03    2     1000024  -1000024   # BR(H -> ~chi_1+ ~chi_1-)
     2.92419744E-04    2     1000022   1000022   # BR(H -> ~chi_10 ~chi_10)
     2.31370585E-04    2     1000023   1000023   # BR(H -> ~chi_20 ~chi_20)
     3.73020269E-06    2     1000022   1000023   # BR(H -> ~chi_10 ~chi_20)
     7.87705260E-06    2     1000015  -1000015   # BR(H -> ~tau_1- ~tau_1+)
     3.27790436E-05    2     1000016  -1000016   # BR(H -> ~nu_tauL ~nu_tauL*)
#
#         PDG            Width
DECAY        36     6.33598425E+00   # A decays
#          BR         NDA      ID1       ID2
     7.98076031E-01    2           5        -5   # BR(A -> b       bb     )
     1.35999783E-01    2         -15        15   # BR(A -> tau+    tau-   )
     4.76874516E-04    2         -13        13   # BR(A -> mu+     mu-    )
     3.19264872E-04    2           3        -3   # BR(A -> s       sb     )
     6.16936052E-07    2           4        -4   # BR(A -> c       cb     )
     6.04043149E-02    2           6        -6   # BR(A -> t       tb     )
     1.79964474E-04    2          21        21   # BR(A -> g       g      )
     1.61841837E-07    2          22        22   # BR(A -> gam     gam    )
     1.54920158E-07    2          23        22   # BR(A -> Z       gam    )
     6.79054611E-05    2          23        25   # BR(A -> Z       h      )
     3.93995775E-03    2     1000024  -1000024   # BR(A -> ~chi_1+ ~chi_1-)
     2.25231030E-04    2     1000022   1000022   # BR(A -> ~chi_10 ~chi_10)
     3.08282025E-04    2     1000023   1000023   # BR(A -> ~chi_20 ~chi_20)
     1.45756047E-06    2     1000022   1000023   # BR(A -> ~chi_10 ~chi_20)
#
#         PDG            Width
DECAY        37     6.16765970E+00   # H+ decays
#          BR         NDA      ID1       ID2
     1.34291311E-03    2           4        -5   # BR(H+ -> c       bb     )
     1.39856502E-01    2         -15        16   # BR(H+ -> tau+    nu_tau )
     4.90397853E-04    2         -13        14   # BR(H+ -> mu+     nu_mu  )
     1.34290836E-05    2           2        -5   # BR(H+ -> u       bb     )
     1.63908138E-05    2           2        -3   # BR(H+ -> u       sb     )
     3.23228368E-04    2           4        -3   # BR(H+ -> c       sb     )
     8.56242393E-01    2           6        -5   # BR(H+ -> t       bb     )
     7.00871951E-05    2          24        25   # BR(H+ -> W+      h      )
     6.51930971E-12    2          24        36   # BR(H+ -> W+      A      )
     8.09808687E-04    2     1000024   1000022   # BR(H+ -> ~chi_1+ ~chi_10)
     7.97790590E-04    2     1000024   1000023   # BR(H+ -> ~chi_1+ ~chi_20)
     3.70587649E-05    2    -1000015   1000016   # BR(H+ -> ~tau_1+ ~nu_tauL)
