#
#                              ======================
#                              | THE SUSYHIT OUTPUT |
#                              ======================
#
#
#              ------------------------------------------------------
#              |     This is the output of the SUSY-HIT package     |
#              |  created by A.Djouadi, M.Muehlleitner and M.Spira. |
#              |  In case of problems with SUSY-HIT email to        |
#              |           margarete.muehlleitner@cern.ch           |
#              |           michael.spira@psi.ch                     |
#              |           abdelhak.djouadi@cern.ch                 |
#              ------------------------------------------------------
#
#              ------------------------------------------------------
#              |  SUSY Les Houches Accord - MSSM Spectrum + Decays  |
#              |              based on the decay programs           |
#              |                                                    |
#              |                     SDECAY 1.3b                    |
#              |                                                    |
#              |  Authors: M.Muhlleitner, A.Djouadi and Y.Mambrini  |
#              |  Ref.:    Comput.Phys.Commun.168(2005)46           |
#              |           [hep-ph/0311167]                         |
#              |                                                    |
#              |                     HDECAY 3.4                     |
#              |                                                    |
#              |  By: A.Djouadi,J.Kalinowski,M.Muhlleitner,M.Spira  |
#              |  Ref.:    Comput.Phys.Commun.108(1998)56           |
#              |           [hep-ph/9704448]                         |
#              |                                                    |
#              |                                                    |
#              |  If not stated otherwise all DRbar couplings and   |
#              |  soft SUSY breaking masses are given at the scale  |
#              |  Q=  0.28804300E+04
#              |                                                    |
#              ------------------------------------------------------
#
#
BLOCK DCINFO  # Decay Program information
     1   SDECAY/HDECAY # decay calculator
     2   1.3b  /3.4    # version number
#
BLOCK SPINFO  # Spectrum calculator information
     1     SOFTSUSY    # spectrum calculator               
     2     3.4.0       # version number                    
#
BLOCK MODSEL  # Model selection
     1     0   #  nonUniversal                                     
#
BLOCK SMINPUTS  # Standard Model inputs
         1     1.27908970E+02   # alpha_em^-1(M_Z)^MSbar
         2     1.16637870E-05   # G_F [GeV^-2]
         3     1.18400000E-01   # alpha_S(M_Z)^MSbar
         4     9.11876000E+01   # M_Z pole mass
         5     4.18000000E+00   # mb(mb)^MSbar
         6     1.73200000E+02   # mt pole mass
         7     1.77700000E+00   # mtau pole mass
#
BLOCK MINPAR  # Input parameters - minimal models
         3     3.86200000E+01   # tanb                
#
BLOCK EXTPAR  # Input parameters - non-minimal models
         0    -1.00000000E+00   # Set                 
         1    -3.39083000E+03   # M_1(MX)             
         2     2.63664000E+03   # M_2(MX)             
         3     1.27251000E+03   # M_3(MX)             
        11     3.07787000E+03   # At(MX)              
        12     2.13124000E+03   # Ab(MX)              
        13     1.64310000E+02   # Atau(MX)            
        23     6.08390000E+02   # mu(MX)              
        26     3.83703000E+03   # mA(pole)            
        31     3.33721000E+03   # meL(MX)             
        32     3.33721000E+03   # mmuL(MX)            
        33     3.04145000E+03   # mtauL(MX)           
        34     9.34910000E+02   # meR(MX)             
        35     9.34910000E+02   # mmuR(MX)            
        36     1.90597000E+03   # mtauR(MX)           
        41     2.16825000E+03   # mqL1(MX)            
        42     2.16825000E+03   # mqL2(MX)            
        43     2.95646000E+03   # mqL3(MX)            
        44     1.23044000E+03   # muR(MX)             
        45     1.23044000E+03   # mcR(MX)             
        46     2.80400000E+03   # mtR(MX)             
        47     6.05820000E+02   # mdR(MX)             
        48     6.05820000E+02   # msR(MX)             
        49     2.27313000E+03   # mbR(MX)             
#
BLOCK MASS  # Mass Spectrum
# PDG code           mass       particle
        24     8.04022440E+01   # W+
        25     1.24835534E+02   # h
        35     3.83703618E+03   # H
        36     3.83703002E+03   # A
        37     3.83803644E+03   # H+
         5     4.81876030E+00   # b-quark pole mass calculated from mb(mb)_Msbar
   1000001     2.23915791E+03   # ~d_L
   2000001     7.44207202E+02   # ~d_R
   1000002     2.23788940E+03   # ~u_L
   2000002     1.31519172E+03   # ~u_R
   1000003     2.23915791E+03   # ~s_L
   2000003     7.44207202E+02   # ~s_R
   1000004     2.23788940E+03   # ~c_L
   2000004     1.31519172E+03   # ~c_R
   1000005     2.30385407E+03   # ~b_1
   2000005     2.97351472E+03   # ~b_2
   1000006     2.76438633E+03   # ~t_1
   2000006     2.99928098E+03   # ~t_2
   1000011     3.35450786E+03   # ~e_L
   2000011     9.61077807E+02   # ~e_R
   1000012     3.35324204E+03   # ~nu_eL
   1000013     3.35450786E+03   # ~mu_L
   2000013     9.61077807E+02   # ~mu_R
   1000014     3.35324204E+03   # ~nu_muL
   1000015     1.91057155E+03   # ~tau_1
   2000015     3.05616576E+03   # ~tau_2
   1000016     3.05475885E+03   # ~nu_tauL
   1000021     1.43459187E+03   # ~g
   1000022     6.33377776E+02   # ~chi_10
   1000023    -6.35024275E+02   # ~chi_20
   1000025     2.64971009E+03   # ~chi_30
   1000035    -3.33716488E+03   # ~chi_40
   1000024     6.34233289E+02   # ~chi_1+
   1000037     2.64987456E+03   # ~chi_2+
#
BLOCK NMIX  # Neutralino Mixing Matrix
  1  1    -8.06139431E-03   # N_11
  1  2    -2.78321232E-02   # N_12
  1  3     7.07442593E-01   # N_13
  1  4    -7.06176581E-01   # N_14
  2  1     1.12682120E-02   # N_21
  2  2     1.64033314E-02   # N_22
  2  3     7.06720773E-01   # N_23
  2  4     7.07212633E-01   # N_24
  3  1    -2.35104034E-04   # N_31
  3  2     9.99478000E-01   # N_32
  3  3     8.10088951E-03   # N_33
  3  4    -3.12737436E-02   # N_34
  4  1     9.99903988E-01   # N_41
  4  2    -1.74237355E-04   # N_42
  4  3    -2.25881814E-03   # N_43
  4  4    -1.36704549E-02   # N_44
#
BLOCK UMIX  # Chargino Mixing Matrix U
  1  1    -1.14600571E-02   # U_11
  1  2     9.99934331E-01   # U_12
  2  1    -9.99934331E-01   # U_21
  2  2    -1.14600571E-02   # U_22
#
BLOCK VMIX  # Chargino Mixing Matrix V
  1  1    -4.42387698E-02   # V_11
  1  2     9.99020986E-01   # V_12
  2  1    -9.99020986E-01   # V_21
  2  2    -4.42387698E-02   # V_22
#
BLOCK STOPMIX  # Stop Mixing Matrix
  1  1    -3.13511727E-01   # cos(theta_t)
  1  2     9.49584329E-01   # sin(theta_t)
  2  1    -9.49584329E-01   # -sin(theta_t)
  2  2    -3.13511727E-01   # cos(theta_t)
#
BLOCK SBOTMIX  # Sbottom Mixing Matrix
  1  1     1.28608051E-02   # cos(theta_b)
  1  2     9.99917296E-01   # sin(theta_b)
  2  1    -9.99917296E-01   # -sin(theta_b)
  2  2     1.28608051E-02   # cos(theta_b)
#
BLOCK STAUMIX  # Stau Mixing Matrix
  1  1     7.43377008E-03   # cos(theta_tau)
  1  2     9.99972369E-01   # sin(theta_tau)
  2  1    -9.99972369E-01   # -sin(theta_tau)
  2  2     7.43377008E-03   # cos(theta_tau)
#
BLOCK ALPHA  # Higgs mixing
          -2.67029410E-02   # Mixing angle in the neutral Higgs boson sector
#
BLOCK HMIX Q=  2.88043000E+03  # DRbar Higgs Parameters
         1     6.21282833E+02   # mu(Q)MSSM           
         2     3.75094335E+01   # tan                 
         3     2.42868637E+02   # higgs               
         4     1.51507294E+07   # mA^2(Q)MSSM         
#
BLOCK GAUGE Q=  2.88043000E+03  # The gauge couplings
     1     3.65347042E-01   # gprime(Q) DRbar
     2     6.36940581E-01   # g(Q) DRbar
     3     1.02886735E+00   # g3(Q) DRbar
#
BLOCK AU Q=  2.88043000E+03  # The trilinear couplings
  1  1     0.00000000E+00   # A_u(Q) DRbar
  2  2     0.00000000E+00   # A_c(Q) DRbar
  3  3     3.07787001E+03   # A_t(Q) DRbar
#
BLOCK AD Q=  2.88043000E+03  # The trilinear couplings
  1  1     0.00000000E+00   # A_d(Q) DRbar
  2  2     0.00000000E+00   # A_s(Q) DRbar
  3  3     2.13124000E+03   # A_b(Q) DRbar
#
BLOCK AE Q=  2.88043000E+03  # The trilinear couplings
  1  1     0.00000000E+00   # A_e(Q) DRbar
  2  2     0.00000000E+00   # A_mu(Q) DRbar
  3  3     1.64310001E+02   # A_tau(Q) DRbar
#
BLOCK Yu Q=  2.88043000E+03  # The Yukawa couplings
  1  1     0.00000000E+00   # y_u(Q) DRbar
  2  2     0.00000000E+00   # y_c(Q) DRbar
  3  3     8.31996471E-01   # y_t(Q) DRbar
#
BLOCK Yd Q=  2.88043000E+03  # The Yukawa couplings
  1  1     0.00000000E+00   # y_d(Q) DRbar
  2  2     0.00000000E+00   # y_s(Q) DRbar
  3  3     4.73687595E-01   # y_b(Q) DRbar
#
BLOCK Ye Q=  2.88043000E+03  # The Yukawa couplings
  1  1     0.00000000E+00   # y_e(Q) DRbar
  2  2     0.00000000E+00   # y_mu(Q) DRbar
  3  3     3.93129479E-01   # y_tau(Q) DRbar
#
BLOCK MSOFT Q=  2.88043000E+03  # The soft SUSY breaking masses at the scale Q
         1    -3.39083000E+03   # M_1(Q)              
         2     2.63664000E+03   # M_2(Q)              
         3     1.27251000E+03   # M_3(Q)              
        21     1.44459556E+07   # mH1^2(Q)            
        22    -2.46833151E+05   # mH2^2(Q)            
        31     3.33721000E+03   # meL(Q)              
        32     3.33721000E+03   # mmuL(Q)             
        33     3.04145000E+03   # mtauL(Q)            
        34     9.34910000E+02   # meR(Q)              
        35     9.34910000E+02   # mmuR(Q)             
        36     1.90597000E+03   # mtauR(Q)            
        41     2.16825000E+03   # mqL1(Q)             
        42     2.16825000E+03   # mqL2(Q)             
        43     2.95646000E+03   # mqL3(Q)             
        44     1.23044000E+03   # muR(Q)              
        45     1.23044000E+03   # mcR(Q)              
        46     2.80400000E+03   # mtR(Q)              
        47     6.05819991E+02   # mdR(Q)              
        48     6.05819991E+02   # msR(Q)              
        49     2.27313000E+03   # mbR(Q)              
#
Block HiggsBoundsInputHiggsCouplingsFermions
# ScalarNormEffCoupSq PseudoSNormEffCoupSq NP   IP1 IP2 IP2
    1.00370143E+00    0.00000000E+00        3  25   5   5  # h0-b-b eff. coupling^2, normalised to SM
    1.40695390E+03    0.00000000E+00        3  35   5   5  # H0-b-b eff. coupling^2, normalised to SM
    0.00000000E+00    1.40695760E+03        3  36   5   5  # A0-b-b eff. coupling^2, normalised to SM
#
    9.99997369E-01    0.00000000E+00        3  25   6   6  # h0-t-t eff. coupling^2, normalised to SM
    7.13384276E-04    0.00000000E+00        3  35   6   6  # H0-t-t eff. coupling^2, normalised to SM
    0.00000000E+00    7.10753472E-04        3  36   6   6  # A0-t-t eff. coupling^2, normalised to SM
#
    1.00370143E+00    0.00000000E+00        3  25  15  15  # h0-tau-tau eff. coupling^2, normalised to SM
    1.40695390E+03    0.00000000E+00        3  35  15  15  # H0-tau-tau eff. coupling^2, normalised to SM
    0.00000000E+00    1.40695760E+03        3  36  15  15  # A0-tau-tau eff. coupling^2, normalised to SM
#
Block HiggsBoundsInputHiggsCouplingsBosons
    9.99999998E-01        3  25  24  24  # h0-W-W eff. coupling^2, normalised to SM
    2.42994185E-09        3  35  24  24  # H0-W-W eff. coupling^2, normalised to SM
    0.00000000E+00        3  36  24  24  # A0-W-W eff. coupling^2, normalised to SM
#
    9.99999998E-01        3  25  23  23  # h0-Z-Z eff. coupling^2, normalised to SM
    2.42994185E-09        3  35  23  23  # H0-Z-Z eff. coupling^2, normalised to SM
    0.00000000E+00        3  36  23  23  # A0-Z-Z eff. coupling^2, normalised to SM
#
    8.91872690E-01        3  25  21  21  # h0-g-g eff. coupling^2, normalised to SM
    5.51872355E-14        3  35  21  21  # H0-g-g eff. coupling^2, normalised to SM
    3.66567945E-13        3  36  21  21  # A0-g-g eff. coupling^2, normalised to SM
#
    0.00000000E+00        3  25  25  23  # h0-h0-Z eff. coupling^2, normalised to SM
    0.00000000E+00        3  35  25  23  # H0-h0-Z eff. coupling^2, normalised to SM
    2.42994185E-09        3  36  25  23  # A0-h0-Z eff. coupling^2, normalised to SM
    0.00000000E+00        3  35  35  23  # H0-H0-Z eff. coupling^2, normalised to SM
    9.99999998E-01        3  36  35  23  # A0-H0-Z eff. coupling^2, normalised to SM
    0.00000000E+00        3  36  36  23  # A0-A0-Z eff. coupling^2, normalised to SM
#
    0.00000000E+00        4  25  21  21  23  # h0-g-g-Z eff. coupling^2, normalised to SM
    0.00000000E+00        4  35  21  21  23  # H0-g-g-Z eff. coupling^2, normalised to SM
    0.00000000E+00        4  36  21  21  23  # A0-g-g-Z eff. coupling^2, normalised to SM
#
#
#
#                             =================
#                             |The decay table|
#                             =================
#
# - The QCD corrections to the decays gluino -> squark  + quark
#                                     squark -> gaugino + quark_prime
#                                     squark -> squark_prime + Higgs
#                                     squark -> gluino  + quark
#   are included.
#
# - The multi-body decays for the inos, stops and sbottoms are included.
#
# - The loop induced decays for the gluino, neutralinos and stops
#   are included.
#
# - The SUSY decays of the top quark are included.
#
#
#         PDG            Width
DECAY         6     1.42824434E+00   # top decays
#          BR         NDA      ID1       ID2
     1.00000000E+00    2           5        24   # BR(t ->  b    W+)
#
#         PDG            Width
DECAY   1000021     3.40218204E+01   # gluino decays
#          BR         NDA      ID1       ID2
     2.38631575E-01    2     2000001        -1   # BR(~g -> ~d_R  db)
     2.38631575E-01    2    -2000001         1   # BR(~g -> ~d_R* d )
     1.13688895E-02    2     2000002        -2   # BR(~g -> ~u_R  ub)
     1.13688895E-02    2    -2000002         2   # BR(~g -> ~u_R* u )
     2.38631575E-01    2     2000003        -3   # BR(~g -> ~s_R  sb)
     2.38631575E-01    2    -2000003         3   # BR(~g -> ~s_R* s )
     1.13679610E-02    2     2000004        -4   # BR(~g -> ~c_R  cb)
     1.13679610E-02    2    -2000004         4   # BR(~g -> ~c_R* c )
#
#         PDG            Width
DECAY   1000006     1.42076260E+02   # stop1 decays
#          BR         NDA      ID1       ID2
     1.19831272E-01    2     1000022         6   # BR(~t_1 -> ~chi_10 t )
     1.16461936E-01    2     1000023         6   # BR(~t_1 -> ~chi_20 t )
     2.19330356E-01    2     1000024         5   # BR(~t_1 -> ~chi_1+ b )
     1.40006907E-04    2     1000037         5   # BR(~t_1 -> ~chi_2+ b )
     5.44195398E-01    2     1000021         6   # BR(~t_1 -> ~g      t )
     4.10308716E-05    2     1000005        24   # BR(~t_1 -> ~b_1    W+)
#
#         PDG            Width
DECAY   2000006     1.61937765E+02   # stop2 decays
#          BR         NDA      ID1       ID2
     1.14654898E-01    2     1000022         6   # BR(~t_2 -> ~chi_10 t )
     1.17922155E-01    2     1000023         6   # BR(~t_2 -> ~chi_20 t )
     2.82644187E-03    2     1000025         6   # BR(~t_2 -> ~chi_30 t )
     9.57237785E-02    2     1000024         5   # BR(~t_2 -> ~chi_1+ b )
     6.23317608E-03    2     1000037         5   # BR(~t_2 -> ~chi_2+ b )
     6.37918752E-01    2     1000021         6   # BR(~t_2 -> ~g      t )
     1.09725399E-02    2     1000006        25   # BR(~t_2 -> ~t_1    h )
     1.27011271E-02    2     1000006        23   # BR(~t_2 -> ~t_1    Z )
     1.04713260E-03    2     1000005        24   # BR(~t_2 -> ~b_1    W+)
#
#         PDG            Width
DECAY   1000005     6.59459997E+01   # sbottom1 decays
#          BR         NDA      ID1       ID2
     6.67486138E-02    2     1000022         5   # BR(~b_1 -> ~chi_10 b )
     6.64851769E-02    2     1000023         5   # BR(~b_1 -> ~chi_20 b )
     1.31261473E-01    2    -1000024         6   # BR(~b_1 -> ~chi_1- t )
     7.35504737E-01    2     1000021         5   # BR(~b_1 -> ~g      b )
#
#         PDG            Width
DECAY   2000005     1.52097064E+02   # sbottom2 decays
#          BR         NDA      ID1       ID2
     3.98191056E-02    2     1000022         5   # BR(~b_2 -> ~chi_10 b )
     3.97282060E-02    2     1000023         5   # BR(~b_2 -> ~chi_20 b )
     3.34344662E-03    2     1000025         5   # BR(~b_2 -> ~chi_30 b )
     2.42931336E-01    2    -1000024         6   # BR(~b_2 -> ~chi_1- t )
     5.89874105E-03    2    -1000037         6   # BR(~b_2 -> ~chi_2- t )
     6.46245854E-01    2     1000021         5   # BR(~b_2 -> ~g      b )
     6.14385884E-04    2     1000005        25   # BR(~b_2 -> ~b_1    h )
     5.72122020E-04    2     1000005        23   # BR(~b_2 -> ~b_1    Z )
     2.08468027E-02    2     1000006       -24   # BR(~b_2 -> ~t_1    W-)
#
#         PDG            Width
DECAY   1000002     6.31462890E+01   # sup_L decays
#          BR         NDA      ID1       ID2
     1.00377404E-04    2     1000022         2   # BR(~u_L -> ~chi_10 u)
     4.00304283E-05    2     1000023         2   # BR(~u_L -> ~chi_20 u)
     4.55155908E-04    2     1000024         1   # BR(~u_L -> ~chi_1+ d)
     9.99404436E-01    2     1000021         2   # BR(~u_L -> ~g      u)
#
#         PDG            Width
DECAY   2000002     4.17290883E-02   # sup_R decays
#           BR         NDA      ID1       ID2
     2.79567910E-03    2     1000022         2   # BR(~u_R -> ~chi_10 u)
     5.44532085E-03    2     1000023         2   # BR(~u_R -> ~chi_20 u)
#           BR         NDA      ID1       ID2       ID3
     1.77885506E-01    3        2       -1        2000001   # BR(~u_R -> u  db  ~d_R)
     3.20088469E-01    3        2       1        -2000001   # BR(~u_R -> u  d  ~d_R*)
     1.79011819E-01    3        2       -3        2000003   # BR(~u_R -> u  sb  ~s_R)
     3.14361049E-01    3        2       3        -2000003   # BR(~u_R -> u  s  ~s_R*)
     1.67717539E-06    3        2       -11        2000011   # BR(~u_R -> u  e+  ~e_R-)
     1.44630526E-05    3        2       11        -2000011   # BR(~u_R -> u  e-  ~e_R+)
     1.70010903E-06    3        2       -13        2000013   # BR(~u_R -> u  mu+  ~mu_R-)
     1.44122487E-05    3        2       13        -2000013   # BR(~u_R -> u  mu-  ~mu_R+)
     7.21223520E-05    3        2       23        1000022   # BR(~u_R -> u  Z  ~chi_10)
     2.28368277E-05    3        2       25        1000022   # BR(~u_R -> u  h  ~chi_10)
     3.50762516E-05    3        2       23        1000023   # BR(~u_R -> u  Z  ~chi_20)
     6.11803445E-05    3        2       25        1000023   # BR(~u_R -> u  h  ~chi_20)
     1.26794047E-05    3        2       -24        1000024   # BR(~u_R -> u  W-  ~chi_1+)
     1.76009117E-04    3        2       24        -1000024   # BR(~u_R -> u  W+  ~chi_1-)
#
#         PDG            Width
DECAY   1000001     6.32527898E+01   # sdown_L decays
#          BR         NDA      ID1       ID2
     8.03412069E-05    2     1000022         1   # BR(~d_L -> ~chi_10 d)
     2.35777860E-05    2     1000023         1   # BR(~d_L -> ~chi_20 d)
     3.05163740E-05    2    -1000024         2   # BR(~d_L -> ~chi_1- u)
     9.99865565E-01    2     1000021         1   # BR(~d_L -> ~g      d)
#
#         PDG            Width
DECAY   2000001     6.55542178E-06   # sdown_R decays
#           BR         NDA      ID1       ID2
     3.44634386E-01    2     1000022         1   # BR(~d_R -> ~chi_10 d)
     6.55361657E-01    2     1000023         1   # BR(~d_R -> ~chi_20 d)
#           BR         NDA      ID1       ID2       ID3
     1.72620472E-07    3        1       23        1000022   # BR(~d_R -> d  Z  ~chi_10)
     4.86955700E-08    3        1       23        1000023   # BR(~d_R -> d  Z  ~chi_20)
     1.51608857E-07    3        1       -24        1000024   # BR(~d_R -> d  W-  ~chi_1+)
     3.58390364E-06    3        1       24        -1000024   # BR(~d_R -> d  W+  ~chi_1-)
#
#         PDG            Width
DECAY   1000004     4.36477625E+01   # scharm_L decays
#          BR         NDA      ID1       ID2
     1.51064555E-04    2     1000022         4   # BR(~c_L -> ~chi_10 c)
     6.02437189E-05    2     1000023         4   # BR(~c_L -> ~chi_20 c)
     6.84990667E-04    2     1000024         3   # BR(~c_L -> ~chi_1+ s)
     9.99103701E-01    2     1000021         4   # BR(~c_L -> ~g      c)
#
#         PDG            Width
DECAY   2000004     4.18939478E-02   # scharm_R decays
#           BR         NDA      ID1       ID2
     2.84087987E-03    2     1000022         4   # BR(~c_R -> ~chi_10 c)
     5.53319670E-03    2     1000023         4   # BR(~c_R -> ~chi_20 c)
#           BR         NDA      ID1       ID2       ID3
     1.81861591E-01    3        4       -1        2000001   # BR(~c_R -> c  db  ~d_R)
     3.14508436E-01    3        4       1        -2000001   # BR(~c_R -> c  d  ~d_R*)
     1.80193092E-01    3        4       -3        2000003   # BR(~c_R -> c  sb  ~s_R)
     3.14651654E-01    3        4       3        -2000003   # BR(~c_R -> c  s  ~s_R*)
     1.67047995E-06    3        4       -11        2000011   # BR(~c_R -> c  e+  ~e_R-)
     1.44717801E-05    3        4       11        -2000011   # BR(~c_R -> c  e-  ~e_R+)
     1.68456313E-06    3        4       -13        2000013   # BR(~c_R -> c  mu+  ~mu_R-)
     1.44839537E-05    3        4       13        -2000013   # BR(~c_R -> c  mu-  ~mu_R+)
     7.21416853E-05    3        4       23        1000022   # BR(~c_R -> c  Z  ~chi_10)
     2.28126030E-05    3        4       25        1000022   # BR(~c_R -> c  h  ~chi_10)
     3.49859604E-05    3        4       23        1000023   # BR(~c_R -> c  Z  ~chi_20)
     6.10541649E-05    3        4       25        1000023   # BR(~c_R -> c  h  ~chi_20)
     1.25860662E-05    3        4       -24        1000024   # BR(~c_R -> c  W-  ~chi_1+)
     1.75259205E-04    3        4       24        -1000024   # BR(~c_R -> c  W+  ~chi_1-)
#
#         PDG            Width
DECAY   1000003     4.37113196E+01   # sstrange_L decays
#          BR         NDA      ID1       ID2
     1.20937313E-04    2     1000022         3   # BR(~s_L -> ~chi_10 s)
     3.54911369E-05    2     1000023         3   # BR(~s_L -> ~chi_20 s)
     4.59358729E-05    2    -1000024         4   # BR(~s_L -> ~chi_1- c)
     9.99797636E-01    2     1000021         3   # BR(~s_L -> ~g      s)
#
#         PDG            Width
DECAY   2000003     6.29111459E-06   # sstrange_R decays
#           BR         NDA      ID1       ID2
     3.44736220E-01    2     1000022         3   # BR(~s_R -> ~chi_10 s)
     6.55259648E-01    2     1000023         3   # BR(~s_R -> ~chi_20 s)
#           BR         NDA      ID1       ID2       ID3
     1.79411770E-07    3        3       23        1000022   # BR(~s_R -> s  Z  ~chi_10)
     5.07525329E-08    3        3       23        1000023   # BR(~s_R -> s  Z  ~chi_20)
     1.57844844E-07    3        3       -24        1000024   # BR(~s_R -> s  W-  ~chi_1+)
     3.74401065E-06    3        3       24        -1000024   # BR(~s_R -> s  W+  ~chi_1-)
#
#         PDG            Width
DECAY   1000011     5.76250197E+00   # selectron_L decays
#          BR         NDA      ID1       ID2
     2.30132240E-03    2     1000022        11   # BR(~e_L -> ~chi_10 e-)
     1.14189410E-03    2     1000023        11   # BR(~e_L -> ~chi_20 e-)
     3.31796404E-01    2     1000025        11   # BR(~e_L -> ~chi_30 e-)
     8.21454164E-05    2     1000035        11   # BR(~e_L -> ~chi_40 e-)
     5.73721611E-04    2    -1000024        12   # BR(~e_L -> ~chi_1- nu_e)
     6.64104512E-01    2    -1000037        12   # BR(~e_L -> ~chi_2- nu_e)
#
#         PDG            Width
DECAY   2000011     3.13563020E-04   # selectron_R decays
#           BR         NDA      ID1       ID2
     3.38508042E-01    2     1000022        11   # BR(~e_R -> ~chi_10 e-)
     6.56115067E-01    2     1000023        11   # BR(~e_R -> ~chi_20 e-)
#           BR         NDA      ID1       ID2       ID3
     1.37324867E-05    3        11       -1        2000001   # BR(~e_R- -> e-  db  ~d_R)
     2.16868686E-04    3        11       1        -2000001   # BR(~e_R- -> e-  d  ~d_R*)
     1.37261084E-05    3        11       -3        2000003   # BR(~e_R- -> e-  sb  ~s_R)
     2.16157505E-04    3        11       3        -2000003   # BR(~e_R- -> e-  s  ~s_R*)
     7.19504487E-04    3        11       23        1000022   # BR(~e_R- -> e-  Z  ~chi_10)
     2.97586112E-04    3        11       25        1000022   # BR(~e_R- -> e-  h  ~chi_10)
     3.05386777E-04    3        11       23        1000023   # BR(~e_R- -> e-  Z  ~chi_20)
     7.38607505E-04    3        11       25        1000023   # BR(~e_R- -> e-  h  ~chi_20)
     1.39088468E-04    3        11       -24        1000024   # BR(~e_R- -> e-  W-  ~chi_1+)
     2.71623229E-03    3        11       24        -1000024   # BR(~e_R- -> e-  W+  ~chi_1-)
#
#         PDG            Width
DECAY   1000013     5.76250193E+00   # smuon_L decays
#          BR         NDA      ID1       ID2
     2.30132240E-03    2     1000022        13   # BR(~mu_L -> ~chi_10 mu-)
     1.14189410E-03    2     1000023        13   # BR(~mu_L -> ~chi_20 mu-)
     3.31796402E-01    2     1000025        13   # BR(~mu_L -> ~chi_30 mu-)
     8.21438846E-05    2     1000035        13   # BR(~mu_L -> ~chi_40 mu-)
     5.73721615E-04    2    -1000024        14   # BR(~mu_L -> ~chi_1- nu_mu)
     6.64104516E-01    2    -1000037        14   # BR(~mu_L -> ~chi_2- nu_mu)
#
#         PDG            Width
DECAY   2000013     3.13566013E-04   # smuon_R decays
#           BR         NDA      ID1       ID2
     3.38504786E-01    2     1000022        13   # BR(~mu_R -> ~chi_10 mu-)
     6.56108755E-01    2     1000023        13   # BR(~mu_R -> ~chi_20 mu-)
#           BR         NDA      ID1       ID2       ID3
     1.37323556E-05    3        13       -1        2000001   # BR(~mu_R- -> mu-  db  ~d_R)
     2.16866616E-04    3        13       1        -2000001   # BR(~mu_R- -> mu-  d  ~d_R*)
     1.37884842E-05    3        13       -3        2000003   # BR(~mu_R- -> mu-  sb  ~s_R)
     2.15214651E-04    3        13       3        -2000003   # BR(~mu_R- -> mu-  s  ~s_R*)
     7.19370056E-04    3        13       23        1000022   # BR(~mu_R- -> mu-  Z  ~chi_10)
     2.96754100E-04    3        13       25        1000022   # BR(~mu_R- -> mu-  h  ~chi_10)
     3.05409375E-04    3        13       23        1000023   # BR(~mu_R- -> mu-  Z  ~chi_20)
     7.41279318E-04    3        13       25        1000023   # BR(~mu_R- -> mu-  h  ~chi_20)
     1.38940441E-04    3        13       -24        1000024   # BR(~mu_R- -> mu-  W-  ~chi_1+)
     2.72510402E-03    3        13       24        -1000024   # BR(~mu_R- -> mu-  W+  ~chi_1-)
#
#         PDG            Width
DECAY   1000015     9.30472034E+00   # stau_1 decays
#          BR         NDA      ID1       ID2
     2.50532814E-01    2     1000022        15   # BR(~tau_1 -> ~chi_10  tau-)
     2.49562150E-01    2     1000023        15   # BR(~tau_1 -> ~chi_20  tau-)
     4.99905036E-01    2    -1000024        16   # BR(~tau_1 -> ~chi_1-  nu_tau)
#
#         PDG            Width
DECAY   2000015     1.11302254E+01   # stau_2 decays
#          BR         NDA      ID1       ID2
     3.87856434E-01    2     1000022        15   # BR(~tau_2 -> ~chi_10  tau-)
     3.86656833E-01    2     1000023        15   # BR(~tau_2 -> ~chi_20  tau-)
     6.82381480E-02    2     1000025        15   # BR(~tau_2 -> ~chi_30  tau-)
     9.58309262E-05    2    -1000024        16   # BR(~tau_2 -> ~chi_1-  nu_tau)
     1.36521938E-01    2    -1000037        16   # BR(~tau_2 -> ~chi_2-  nu_tau)
     1.04018652E-02    2     1000015        25   # BR(~tau_2 -> ~tau_1   h)
     1.02289501E-02    2     1000015        23   # BR(~tau_2 -> ~tau_1   Z)
#
#         PDG            Width
DECAY   1000012     5.77408099E+00   # snu_eL decays
#          BR         NDA      ID1       ID2
     1.17382931E-03    2     1000022        12   # BR(~nu_eL -> ~chi_10 nu_e)
     2.15240073E-04    2     1000023        12   # BR(~nu_eL -> ~chi_20 nu_e)
     3.30355457E-01    2     1000025        12   # BR(~nu_eL -> ~chi_30 nu_e)
     7.05891458E-05    2     1000035        12   # BR(~nu_eL -> ~chi_40 nu_e)
     8.52852089E-03    2     1000024        11   # BR(~nu_eL -> ~chi_1+ e-)
     6.59656363E-01    2     1000037        11   # BR(~nu_eL -> ~chi_2+ e-)
#
#         PDG            Width
DECAY   1000014     5.77408094E+00   # snu_muL decays
#          BR         NDA      ID1       ID2
     1.17382932E-03    2     1000022        14   # BR(~nu_muL -> ~chi_10 nu_mu)
     2.15240075E-04    2     1000023        14   # BR(~nu_muL -> ~chi_20 nu_mu)
     3.30355460E-01    2     1000025        14   # BR(~nu_muL -> ~chi_30 nu_mu)
     7.05891465E-05    2     1000035        14   # BR(~nu_muL -> ~chi_40 nu_mu)
     8.52852095E-03    2     1000024        13   # BR(~nu_muL -> ~chi_1+ mu-)
     6.59656360E-01    2     1000037        13   # BR(~nu_muL -> ~chi_2+ mu-)
#
#         PDG            Width
DECAY   1000016     1.11331458E+01   # snu_tauL decays
#          BR         NDA      ID1       ID2
     5.46223046E-04    2     1000022        16   # BR(~nu_tauL -> ~chi_10 nu_tau)
     1.00150325E-04    2     1000023        16   # BR(~nu_tauL -> ~chi_20 nu_tau)
     6.78356536E-02    2     1000025        16   # BR(~nu_tauL -> ~chi_30 nu_tau)
     7.76318884E-01    2     1000024        15   # BR(~nu_tauL -> ~chi_1+ tau-)
     1.35421586E-01    2     1000037        15   # BR(~nu_tauL -> ~chi_2+ tau-)
     1.97775038E-02    2    -1000015       -24   # BR(~nu_tauL -> ~tau_1+ W-)
#
#         PDG            Width
DECAY   1000024     1.65868440E-12   # chargino1+ decays
#           BR         NDA      ID1       ID2       ID3
     1.61255260E-01    3     1000022       -11        12   # BR(~chi_1+ -> ~chi_10 e+   nu_e)
     1.49670940E-01    3     1000022       -13        14   # BR(~chi_1+ -> ~chi_10 mu+  nu_mu)
     5.56659750E-01    2     1000022       211             # BR(~chi_1+ -> ~chi_10 pi+)
     1.31278720E-01    3     1000022       211        111   # BR(~chi_1+ -> ~chi_10 pi+ pi0)
     5.67666260E-04    4     1000022       211        111       111 # BR(~chi_1+ -> ~chi_10 pi+ pi0 pi0)
     5.67666260E-04    4     1000022       211        211      -211 # BR(~chi_1+ -> ~chi_10 pi+ pi+ pi-)
#
#         PDG            Width
DECAY   1000037     3.12277065E+01   # chargino2+ decays
#          BR         NDA      ID1       ID2
     8.36243755E-02    2     1000002        -1   # BR(~chi_2+ -> ~u_L     db)
     8.33132110E-02    2    -1000001         2   # BR(~chi_2+ -> ~d_L*    u )
     8.36243422E-02    2     1000004        -3   # BR(~chi_2+ -> ~c_L     sb)
     8.33126762E-02    2    -1000003         4   # BR(~chi_2+ -> ~s_L*     c )
     8.60974756E-07    2    -1000005         6   # BR(~chi_2+ -> ~b_1*    t )
     1.02404630E-08    2    -1000015        16   # BR(~chi_2+ -> ~tau_1+  nu_tau)
     1.67640565E-01    2     1000024        23   # BR(~chi_2+ -> ~chi_1+  Z )
     1.62307986E-01    2     1000022        24   # BR(~chi_2+ -> ~chi_10  W+)
     1.62663222E-01    2     1000023        24   # BR(~chi_2+ -> ~chi_20  W+)
     1.73512751E-01    2     1000024        25   # BR(~chi_2+ -> ~chi_1+  h )
#
#         PDG            Width
DECAY   1000022     0.00000000E+00   # neutralino1 decays
#
#         PDG            Width
DECAY   1000023     1.27495873E-11   # neutralino2 decays
#          BR         NDA      ID1       ID2
     2.99624884E-01    2     1000022        22   # BR(~chi_20 -> ~chi_10 gam)
#           BR         NDA      ID1       ID2       ID3
     1.11604569E-01    3     1000022        -2         2   # BR(~chi_20 -> ~chi_10 ub      u)
     1.44950903E-01    3     1000022        -1         1   # BR(~chi_20 -> ~chi_10 db      d)
     1.44950903E-01    3     1000022        -3         3   # BR(~chi_20 -> ~chi_10 sb      s)
     3.33529912E-02    3     1000022       -11        11   # BR(~chi_20 -> ~chi_10 e+      e-)
     3.33529912E-02    3     1000022       -13        13   # BR(~chi_20 -> ~chi_10 mu+     mu-)
     6.66999044E-02    3     1000022       -12        12   # BR(~chi_20 -> ~chi_10 nu_eb   nu_e)
     6.66999044E-02    3     1000022       -14        14   # BR(~chi_20 -> ~chi_10 nu_mub  nu_mu)
     6.66999082E-02    3     1000022       -16        16   # BR(~chi_20 -> ~chi_10 nu_taub nu_tau)
     9.61891531E-03    3     1000024        -2         1   # BR(~chi_20 -> ~chi_1+ ub      d)
     9.61891531E-03    3    -1000024        -1         2   # BR(~chi_20 -> ~chi_1- db      u)
     3.20630247E-03    3     1000024       -12        11   # BR(~chi_20 -> ~chi_1+ nu_eb   e-)
     3.20630247E-03    3    -1000024        12       -11   # BR(~chi_20 -> ~chi_1- nu_e    e+)
     3.20630247E-03    3     1000024       -14        13   # BR(~chi_20 -> ~chi_1+ nu_mub  mu-)
     3.20630247E-03    3    -1000024        14       -13   # BR(~chi_20 -> ~chi_1- nu_mu   mu+)
#
#         PDG            Width
DECAY   1000025     3.12145765E+01   # neutralino3 decays
#          BR         NDA      ID1       ID2
     4.31691724E-02    2     1000022        23   # BR(~chi_30 -> ~chi_10   Z )
     1.24528934E-01    2     1000023        23   # BR(~chi_30 -> ~chi_20   Z )
     1.62660665E-01    2     1000024       -24   # BR(~chi_30 -> ~chi_1+   W-)
     1.62660665E-01    2    -1000024        24   # BR(~chi_30 -> ~chi_1-   W+)
     1.29356545E-01    2     1000022        25   # BR(~chi_30 -> ~chi_10   h )
     4.38306975E-02    2     1000023        25   # BR(~chi_30 -> ~chi_20   h )
     4.18362725E-02    2     1000002        -2   # BR(~chi_30 -> ~u_L      ub)
     4.18362725E-02    2    -1000002         2   # BR(~chi_30 -> ~u_L*     u )
     9.13196287E-09    2     2000002        -2   # BR(~chi_30 -> ~u_R      ub)
     9.13196287E-09    2    -2000002         2   # BR(~chi_30 -> ~u_R*     u )
     4.16118784E-02    2     1000001        -1   # BR(~chi_30 -> ~d_L      db)
     4.16118784E-02    2    -1000001         1   # BR(~chi_30 -> ~d_L*     d )
     3.39962609E-09    2     2000001        -1   # BR(~chi_30 -> ~d_R      db)
     3.39962609E-09    2    -2000001         1   # BR(~chi_30 -> ~d_R*     d )
     4.18360055E-02    2     1000004        -4   # BR(~chi_30 -> ~c_L      cb)
     4.18360055E-02    2    -1000004         4   # BR(~chi_30 -> ~c_L*     c )
     9.13195989E-09    2     2000004        -4   # BR(~chi_30 -> ~c_R      cb)
     9.13195989E-09    2    -2000004         4   # BR(~chi_30 -> ~c_R*     c )
     4.16118784E-02    2     1000003        -3   # BR(~chi_30 -> ~s _L      sb)
     4.16118784E-02    2    -1000003         3   # BR(~chi_30 -> ~s _L*     s )
     3.39962609E-09    2     2000003        -3   # BR(~chi_30 -> ~s _R      sb)
     3.39962609E-09    2    -2000003         3   # BR(~chi_30 -> ~s _R*     s )
     5.74943536E-07    2     1000005        -5   # BR(~chi_30 -> ~b_1      bb)
     5.74943536E-07    2    -1000005         5   # BR(~chi_30 -> ~b_1*     b )
     9.39686750E-09    2     2000011       -11   # BR(~chi_30 -> ~e_R-     e+)
     9.39686750E-09    2    -2000011        11   # BR(~chi_30 -> ~e_R+     e-)
     9.39686750E-09    2     2000013       -13   # BR(~chi_30 -> ~mu_R-    mu+)
     9.39686750E-09    2    -2000013        13   # BR(~chi_30 -> ~mu_R+    mu-)
     6.93875387E-09    2     1000015       -15   # BR(~chi_30 -> ~tau_1-   tau+)
     6.93875387E-09    2    -1000015        15   # BR(~chi_30 -> ~tau_1+   tau-)
#
#         PDG            Width
DECAY   1000035     9.46896230E+01   # neutralino4 decays
#          BR         NDA      ID1       ID2
     1.43416350E-02    2     1000022        23   # BR(~chi_40 -> ~chi_10   Z )
     7.38952651E-03    2     1000023        23   # BR(~chi_40 -> ~chi_20   Z )
     1.23691183E-06    2     1000025        23   # BR(~chi_40 -> ~chi_30   Z )
     2.10480581E-02    2     1000024       -24   # BR(~chi_40 -> ~chi_1+   W-)
     2.10480581E-02    2    -1000024        24   # BR(~chi_40 -> ~chi_1-   W+)
     1.22838258E-06    2     1000037       -24   # BR(~chi_40 -> ~chi_2+   W-)
     1.22838258E-06    2    -1000037        24   # BR(~chi_40 -> ~chi_2-   W+)
     7.76426757E-03    2     1000022        25   # BR(~chi_40 -> ~chi_10   h )
     1.51044861E-02    2     1000023        25   # BR(~chi_40 -> ~chi_20   h )
     2.10903584E-08    2     1000025        25   # BR(~chi_40 -> ~chi_30   h )
     2.29671008E-03    2     1000002        -2   # BR(~chi_40 -> ~u_L      ub)
     2.29671008E-03    2    -1000002         2   # BR(~chi_40 -> ~u_L*     u )
     8.62113177E-02    2     2000002        -2   # BR(~chi_40 -> ~u_R      ub)
     8.62113177E-02    2    -2000002         2   # BR(~chi_40 -> ~u_R*     u )
     2.30086965E-03    2     1000001        -1   # BR(~chi_40 -> ~d_L      db)
     2.30086965E-03    2    -1000001         1   # BR(~chi_40 -> ~d_L*     d )
     2.72460508E-02    2     2000001        -1   # BR(~chi_40 -> ~d_R      db)
     2.72460508E-02    2    -2000001         1   # BR(~chi_40 -> ~d_R*     d )
     2.29670847E-03    2     1000004        -4   # BR(~chi_40 -> ~c_L      cb)
     2.29670847E-03    2    -1000004         4   # BR(~chi_40 -> ~c_L*     c )
     8.62113088E-02    2     2000004        -4   # BR(~chi_40 -> ~c_R      cb)
     8.62113088E-02    2    -2000004         4   # BR(~chi_40 -> ~c_R*     c )
     2.30086965E-03    2     1000003        -3   # BR(~chi_40 -> ~s _L      sb)
     2.30086965E-03    2    -1000003         3   # BR(~chi_40 -> ~s _L*     s )
     2.72460508E-02    2     2000003        -3   # BR(~chi_40 -> ~s _R      sb)
     2.72460508E-02    2    -2000003         3   # BR(~chi_40 -> ~s _R*     s )
     9.75970618E-03    2     1000006        -6   # BR(~chi_40 -> ~t_1      tb)
     9.75970618E-03    2    -1000006         6   # BR(~chi_40 -> ~t_1*     t )
     1.01807382E-03    2     2000006        -6   # BR(~chi_40 -> ~t_2      tb)
     1.01807382E-03    2    -2000006         6   # BR(~chi_40 -> ~t_2*     t )
     8.54147571E-03    2     1000005        -5   # BR(~chi_40 -> ~b_1      bb)
     8.54147571E-03    2    -1000005         5   # BR(~chi_40 -> ~b_1*     b )
     3.32566599E-04    2     2000005        -5   # BR(~chi_40 -> ~b_2      bb)
     3.32566599E-04    2    -2000005         5   # BR(~chi_40 -> ~b_2*     b )
     7.86917358E-02    2     2000011       -11   # BR(~chi_40 -> ~e_R-     e+)
     7.86917358E-02    2    -2000011        11   # BR(~chi_40 -> ~e_R+     e-)
     7.86917358E-02    2     2000013       -13   # BR(~chi_40 -> ~mu_R-    mu+)
     7.86917358E-02    2    -2000013        13   # BR(~chi_40 -> ~mu_R+    mu-)
     4.22816562E-02    2     1000015       -15   # BR(~chi_40 -> ~tau_1-   tau+)
     4.22816562E-02    2    -1000015        15   # BR(~chi_40 -> ~tau_1+   tau-)
     6.08344216E-04    2     2000015       -15   # BR(~chi_40 -> ~tau_2-   tau+)
     6.08344216E-04    2    -2000015        15   # BR(~chi_40 -> ~tau_2+   tau-)
     6.14946727E-04    2     1000016       -16   # BR(~chi_40 -> ~nu_tau1  nu_taub)
     6.14946727E-04    2    -1000016        16   # BR(~chi_40 -> ~nu_tau1* nu_tau )
#
#         PDG            Width
DECAY        25     4.14470083E-03   # h decays
#          BR         NDA      ID1       ID2
     6.11909640E-01    2           5        -5   # BR(h -> b       bb     )
     6.25717057E-02    2         -15        15   # BR(h -> tau+    tau-   )
     2.21482201E-04    2         -13        13   # BR(h -> mu+     mu-    )
     2.41740008E-04    2           3        -3   # BR(h -> s       sb     )
     2.09032711E-02    2           4        -4   # BR(h -> c       cb     )
     7.68155366E-02    2          21        21   # BR(h -> g       g      )
     2.25883946E-03    2          22        22   # BR(h -> gam     gam    )
     1.48565307E-03    2          22        23   # BR(h -> Z       gam    )
     1.98797455E-01    2          24       -24   # BR(h -> W+      W-     )
     2.47946769E-02    2          23        23   # BR(h -> Z       Z      )
#
#         PDG            Width
DECAY        35     7.40576015E+01   # H decays
#          BR         NDA      ID1       ID2
     7.04782709E-01    2           5        -5   # BR(H -> b       bb     )
     1.44930504E-01    2         -15        15   # BR(H -> tau+    tau-   )
     5.13279824E-04    2         -13        13   # BR(H -> mu+     mu-    )
     2.49980013E-04    2           3        -3   # BR(H -> s       sb     )
     1.46864929E-08    2           4        -4   # BR(H -> c       cb     )
     1.44937355E-03    2           6        -6   # BR(H -> t       tb     )
     7.57057411E-06    2          21        21   # BR(H -> g       g      )
     8.93525279E-09    2          22        22   # BR(H -> gam     gam    )
     5.00541271E-09    2          23        22   # BR(H -> Z       gam    )
     5.96632261E-07    2          24       -24   # BR(H -> W+      W-     )
     2.97805122E-07    2          23        23   # BR(H -> Z       Z      )
     1.99060927E-06    2          25        25   # BR(H -> h       h      )
     7.12735796E-04    2     1000024  -1000024   # BR(H -> ~chi_1+ ~chi_1-)
     4.90559863E-02    2     1000024  -1000037   # BR(H -> ~chi_1+ ~chi_2-)
     4.90559863E-02    2     1000037  -1000024   # BR(H -> ~chi_2+ ~chi_1-)
     9.69088053E-05    2     1000022   1000022   # BR(H -> ~chi_10 ~chi_10)
     2.09183053E-05    2     1000023   1000023   # BR(H -> ~chi_20 ~chi_20)
     2.04097492E-05    2     1000022   1000023   # BR(H -> ~chi_10 ~chi_20)
     1.22713451E-02    2     1000022   1000025   # BR(H -> ~chi_10 ~chi_30)
     3.68291813E-02    2     1000023   1000025   # BR(H -> ~chi_20 ~chi_30)
     4.36812179E-08    2     2000002  -2000002   # BR(H -> ~u_R    ~u_R*  )
     4.36812179E-08    2     2000004  -2000004   # BR(H -> ~c_R    ~c_R*  )
     1.38249254E-08    2     2000001  -2000001   # BR(H -> ~d_R    ~d_R*  )
     1.38249254E-08    2     2000003  -2000003   # BR(H -> ~s_R    ~s_R*  )
     3.89449317E-08    2     2000011  -2000011   # BR(H -> ~e_R-   ~e_R+  )
     3.89449317E-08    2     2000013  -2000013   # BR(H -> ~mu_R-  ~mu_R+ )
     5.02664427E-09    2     1000015  -1000015   # BR(H -> ~tau_1- ~tau_1+)
#
#         PDG            Width
DECAY        36     7.40608463E+01   # A decays
#          BR         NDA      ID1       ID2
     7.04770214E-01    2           5        -5   # BR(A -> b       bb     )
     1.44924435E-01    2         -15        15   # BR(A -> tau+    tau-   )
     5.13257891E-04    2         -13        13   # BR(A -> mu+     mu-    )
     2.49981918E-04    2           3        -3   # BR(A -> s       sb     )
     1.47676900E-08    2           4        -4   # BR(A -> c       cb     )
     1.45141116E-03    2           6        -6   # BR(A -> t       tb     )
     1.95103465E-05    2          21        21   # BR(A -> g       g      )
     3.36470081E-08    2          22        22   # BR(A -> gam     gam    )
     1.56565307E-08    2          23        22   # BR(A -> Z       gam    )
     6.05284163E-07    2          23        25   # BR(A -> Z       h      )
     8.22563903E-04    2     1000024  -1000024   # BR(A -> ~chi_1+ ~chi_1-)
     4.90012734E-02    2     1000024  -1000037   # BR(A -> ~chi_1+ ~chi_2-)
     4.90012734E-02    2     1000037  -1000024   # BR(A -> ~chi_2+ ~chi_1-)
     1.20989574E-04    2     1000022   1000022   # BR(A -> ~chi_10 ~chi_10)
     2.11107999E-05    2     1000023   1000023   # BR(A -> ~chi_20 ~chi_20)
     1.37951445E-05    2     1000022   1000023   # BR(A -> ~chi_10 ~chi_20)
     3.68814975E-02    2     1000022   1000025   # BR(A -> ~chi_10 ~chi_30)
     1.22080162E-02    2     1000023   1000025   # BR(A -> ~chi_20 ~chi_30)
#
#         PDG            Width
DECAY        37     7.04889364E+01   # H+ decays
#          BR         NDA      ID1       ID2
     1.15882388E-03    2           4        -5   # BR(H+ -> c       bb     )
     1.52308179E-01    2         -15        16   # BR(H+ -> tau+    nu_tau )
     5.39407828E-04    2         -13        14   # BR(H+ -> mu+     nu_mu  )
     1.15882302E-05    2           2        -5   # BR(H+ -> u       bb     )
     1.31466434E-05    2           2        -3   # BR(H+ -> u       sb     )
     2.58780759E-04    2           4        -3   # BR(H+ -> c       sb     )
     6.90335315E-01    2           6        -5   # BR(H+ -> t       bb     )
     6.36698925E-07    2          24        25   # BR(H+ -> W+      h      )
     1.92752400E-14    2          24        36   # BR(H+ -> W+      A      )
     8.79476807E-05    2     1000024   1000022   # BR(H+ -> ~chi_1+ ~chi_10)
     2.37004136E-04    2     1000024   1000023   # BR(H+ -> ~chi_1+ ~chi_20)
     5.16559789E-02    2     1000024   1000025   # BR(H+ -> ~chi_1+ ~chi_30)
     5.18129398E-02    2     1000037   1000022   # BR(H+ -> ~chi_2+ ~chi_10)
     5.15802513E-02    2     1000037   1000023   # BR(H+ -> ~chi_2+ ~chi_20)
