#
#                              ======================
#                              | THE SUSYHIT OUTPUT |
#                              ======================
#
#
#              ------------------------------------------------------
#              |     This is the output of the SUSY-HIT package     |
#              |  created by A.Djouadi, M.Muehlleitner and M.Spira. |
#              |  In case of problems with SUSY-HIT email to        |
#              |           margarete.muehlleitner@cern.ch           |
#              |           michael.spira@psi.ch                     |
#              |           abdelhak.djouadi@cern.ch                 |
#              ------------------------------------------------------
#
#              ------------------------------------------------------
#              |  SUSY Les Houches Accord - MSSM Spectrum + Decays  |
#              |              based on the decay programs           |
#              |                                                    |
#              |                     SDECAY 1.3b                    |
#              |                                                    |
#              |  Authors: M.Muhlleitner, A.Djouadi and Y.Mambrini  |
#              |  Ref.:    Comput.Phys.Commun.168(2005)46           |
#              |           [hep-ph/0311167]                         |
#              |                                                    |
#              |                     HDECAY 3.4                     |
#              |                                                    |
#              |  By: A.Djouadi,J.Kalinowski,M.Muhlleitner,M.Spira  |
#              |  Ref.:    Comput.Phys.Commun.108(1998)56           |
#              |           [hep-ph/9704448]                         |
#              |                                                    |
#              |                                                    |
#              |  If not stated otherwise all DRbar couplings and   |
#              |  soft SUSY breaking masses are given at the scale  |
#              |  Q=  0.27894810E+04
#              |                                                    |
#              ------------------------------------------------------
#
#
BLOCK DCINFO  # Decay Program information
     1   SDECAY/HDECAY # decay calculator
     2   1.3b  /3.4    # version number
#
BLOCK SPINFO  # Spectrum calculator information
     1     SOFTSUSY    # spectrum calculator               
     2     3.4.0       # version number                    
#
BLOCK MODSEL  # Model selection
     1     0   #  nonUniversal                                     
#
BLOCK SMINPUTS  # Standard Model inputs
         1     1.27908970E+02   # alpha_em^-1(M_Z)^MSbar
         2     1.16637870E-05   # G_F [GeV^-2]
         3     1.18400000E-01   # alpha_S(M_Z)^MSbar
         4     9.11876000E+01   # M_Z pole mass
         5     4.18000000E+00   # mb(mb)^MSbar
         6     1.73200000E+02   # mt pole mass
         7     1.77700000E+00   # mtau pole mass
#
BLOCK MINPAR  # Input parameters - minimal models
         3     5.11000000E+00   # tanb                
#
BLOCK EXTPAR  # Input parameters - non-minimal models
         0    -1.00000000E+00   # Set                 
         1     3.35613000E+03   # M_1(MX)             
         2    -2.15180000E+02   # M_2(MX)             
         3     3.44779000E+03   # M_3(MX)             
        11     4.44089000E+03   # At(MX)              
        12     1.80092000E+03   # Ab(MX)              
        13    -2.43007000E+03   # Atau(MX)            
        23     1.28576000E+03   # mu(MX)              
        26     3.75014000E+03   # mA(pole)            
        31     1.25914000E+03   # meL(MX)             
        32     1.25914000E+03   # mmuL(MX)            
        33     2.15020000E+02   # mtauL(MX)           
        34     1.34539000E+03   # meR(MX)             
        35     1.34539000E+03   # mmuR(MX)            
        36     1.41074000E+03   # mtauR(MX)           
        41     3.20106000E+03   # mqL1(MX)            
        42     3.20106000E+03   # mqL2(MX)            
        43     2.19938000E+03   # mqL3(MX)            
        44     3.44740000E+02   # muR(MX)             
        45     3.44740000E+02   # mcR(MX)             
        46     3.53900000E+03   # mtR(MX)             
        47     2.37364000E+03   # mdR(MX)             
        48     2.37364000E+03   # msR(MX)             
        49     1.02325000E+03   # mbR(MX)             
#
BLOCK MASS  # Mass Spectrum
# PDG code           mass       particle
        24     8.03919904E+01   # W+
        25     1.24488200E+02   # h
        35     3.75041545E+03   # H
        36     3.75013996E+03   # A
        37     3.75138215E+03   # H+
         5     4.81876030E+00   # b-quark pole mass calculated from mb(mb)_Msbar
   1000001     3.30421382E+03   # ~d_L
   2000001     2.48353540E+03   # ~d_R
   1000002     3.30346156E+03   # ~u_L
   2000002     6.27173701E+02   # ~u_R
   1000003     3.30421382E+03   # ~s_L
   2000003     2.48353540E+03   # ~s_R
   1000004     3.30346156E+03   # ~c_L
   2000004     6.27173701E+02   # ~c_R
   1000005     1.16997091E+03   # ~b_1
   2000005     2.29282911E+03   # ~b_2
   1000006     2.28638495E+03   # ~t_1
   2000006     3.56524221E+03   # ~t_2
   1000011     1.26962035E+03   # ~e_L
   2000011     1.35202932E+03   # ~e_R
   1000012     1.26699063E+03   # ~nu_eL
   1000013     1.26962035E+03   # ~mu_L
   2000013     1.35202932E+03   # ~mu_R
   1000014     1.26699063E+03   # ~nu_muL
   1000015     2.57859842E+02   # ~tau_1
   2000015     1.41727608E+03   # ~tau_2
   1000016     2.46491338E+02   # ~nu_tauL
   1000021     3.50888881E+03   # ~g
   1000022    -2.35239687E+02   # ~chi_10
   1000023    -1.32319054E+03   # ~chi_20
   1000025     1.32379277E+03   # ~chi_30
   1000035     3.30498878E+03   # ~chi_40
   1000024     2.35403167E+02   # ~chi_1+
   1000037     1.32645101E+03   # ~chi_2+
#
BLOCK NMIX  # Neutralino Mixing Matrix
  1  1    -1.99475458E-04   # N_11
  1  2     9.98303975E-01   # N_12
  1  3    -5.81923969E-02   # N_13
  1  4     1.66688868E-03   # N_14
  2  1    -5.15713934E-03   # N_21
  2  2     3.99606956E-02   # N_22
  2  3     7.05811481E-01   # N_23
  2  4     7.07252925E-01   # N_24
  3  1    -1.82628335E-02   # N_31
  3  2    -4.23341560E-02   # N_32
  3  3    -7.05944716E-01   # N_33
  3  4     7.06764704E-01   # N_34
  4  1     9.99819900E-01   # N_41
  4  2    -3.67987899E-04   # N_42
  4  3    -9.26585939E-03   # N_43
  4  4     1.65582426E-02   # N_44
#
BLOCK UMIX  # Chargino Mixing Matrix U
  1  1     9.96619551E-01   # U_11
  1  2    -8.21551608E-02   # U_12
  2  1     8.21551608E-02   # U_21
  2  2     9.96619551E-01   # U_22
#
BLOCK VMIX  # Chargino Mixing Matrix V
  1  1    -9.99997084E-01   # V_11
  1  2     2.41488584E-03   # V_12
  2  1     2.41488584E-03   # V_21
  2  2     9.99997084E-01   # V_22
#
BLOCK STOPMIX  # Stop Mixing Matrix
  1  1     9.97012146E-01   # cos(theta_t)
  1  2    -7.72449398E-02   # sin(theta_t)
  2  1     7.72449398E-02   # -sin(theta_t)
  2  2     9.97012146E-01   # cos(theta_t)
#
BLOCK SBOTMIX  # Sbottom Mixing Matrix
  1  1     2.73853420E-03   # cos(theta_b)
  1  2     9.99996250E-01   # sin(theta_b)
  2  1    -9.99996250E-01   # -sin(theta_b)
  2  2     2.73853420E-03   # cos(theta_b)
#
BLOCK STAUMIX  # Stau Mixing Matrix
  1  1     9.99968888E-01   # cos(theta_tau)
  1  2     7.88815771E-03   # sin(theta_tau)
  2  1    -7.88815771E-03   # -sin(theta_tau)
  2  2     9.99968888E-01   # cos(theta_tau)
#
BLOCK ALPHA  # Higgs mixing
          -2.03436377E-01   # Mixing angle in the neutral Higgs boson sector
#
BLOCK HMIX Q=  2.78948100E+03  # DRbar Higgs Parameters
         1     1.30547317E+03   # mu(Q)MSSM           
         2     4.85580499E+00   # tan                 
         3     2.42254650E+02   # higgs               
         4     1.39774342E+07   # mA^2(Q)MSSM         
#
BLOCK GAUGE Q=  2.78948100E+03  # The gauge couplings
     1     3.65023386E-01   # gprime(Q) DRbar
     2     6.41844183E-01   # g(Q) DRbar
     3     1.01071878E+00   # g3(Q) DRbar
#
BLOCK AU Q=  2.78948100E+03  # The trilinear couplings
  1  1     0.00000000E+00   # A_u(Q) DRbar
  2  2     0.00000000E+00   # A_c(Q) DRbar
  3  3     4.44089002E+03   # A_t(Q) DRbar
#
BLOCK AD Q=  2.78948100E+03  # The trilinear couplings
  1  1     0.00000000E+00   # A_d(Q) DRbar
  2  2     0.00000000E+00   # A_s(Q) DRbar
  3  3     1.80092001E+03   # A_b(Q) DRbar
#
BLOCK AE Q=  2.78948100E+03  # The trilinear couplings
  1  1     0.00000000E+00   # A_e(Q) DRbar
  2  2     0.00000000E+00   # A_mu(Q) DRbar
  3  3    -2.43007000E+03   # A_tau(Q) DRbar
#
BLOCK Yu Q=  2.78948100E+03  # The Yukawa couplings
  1  1     0.00000000E+00   # y_u(Q) DRbar
  2  2     0.00000000E+00   # y_c(Q) DRbar
  3  3     8.53665403E-01   # y_t(Q) DRbar
#
BLOCK Yd Q=  2.78948100E+03  # The Yukawa couplings
  1  1     0.00000000E+00   # y_d(Q) DRbar
  2  2     0.00000000E+00   # y_s(Q) DRbar
  3  3     6.46256307E-02   # y_b(Q) DRbar
#
BLOCK Ye Q=  2.78948100E+03  # The Yukawa couplings
  1  1     0.00000000E+00   # y_e(Q) DRbar
  2  2     0.00000000E+00   # y_mu(Q) DRbar
  3  3     4.99496382E-02   # y_tau(Q) DRbar
#
BLOCK MSOFT Q=  2.78948100E+03  # The soft SUSY breaking masses at the scale Q
         1     3.35613000E+03   # M_1(Q)              
         2    -2.15180000E+02   # M_2(Q)              
         3     3.44779000E+03   # M_3(Q)              
        21     1.17411374E+07   # mH1^2(Q)            
        22    -1.00194286E+06   # mH2^2(Q)            
        31     1.25914000E+03   # meL(Q)              
        32     1.25914000E+03   # mmuL(Q)             
        33     2.15019999E+02   # mtauL(Q)            
        34     1.34539000E+03   # meR(Q)              
        35     1.34539000E+03   # mmuR(Q)             
        36     1.41074000E+03   # mtauR(Q)            
        41     3.20105999E+03   # mqL1(Q)             
        42     3.20105999E+03   # mqL2(Q)             
        43     2.19937998E+03   # mqL3(Q)             
        44     3.44739912E+02   # muR(Q)              
        45     3.44739912E+02   # mcR(Q)              
        46     3.53899999E+03   # mtR(Q)              
        47     2.37363999E+03   # mdR(Q)              
        48     2.37363999E+03   # msR(Q)              
        49     1.02324997E+03   # mbR(Q)              
#
Block HiggsBoundsInputHiggsCouplingsFermions
# ScalarNormEffCoupSq PseudoSNormEffCoupSq NP   IP1 IP2 IP2
    1.00327287E+00    0.00000000E+00        3  25   5   5  # h0-b-b eff. coupling^2, normalised to SM
    2.35755692E+01    0.00000000E+00        3  35   5   5  # H0-b-b eff. coupling^2, normalised to SM
    0.00000000E+00    2.35788421E+01        3  36   5   5  # A0-b-b eff. coupling^2, normalised to SM
#
    9.99861195E-01    0.00000000E+00        3  25   6   6  # h0-t-t eff. coupling^2, normalised to SM
    4.25497091E-02    0.00000000E+00        3  35   6   6  # H0-t-t eff. coupling^2, normalised to SM
    0.00000000E+00    4.24109036E-02        3  36   6   6  # A0-t-t eff. coupling^2, normalised to SM
#
    1.00327287E+00    0.00000000E+00        3  25  15  15  # h0-tau-tau eff. coupling^2, normalised to SM
    2.35755692E+01    0.00000000E+00        3  35  15  15  # H0-tau-tau eff. coupling^2, normalised to SM
    0.00000000E+00    2.35788421E+01        3  36  15  15  # A0-tau-tau eff. coupling^2, normalised to SM
#
Block HiggsBoundsInputHiggsCouplingsBosons
    9.99999887E-01        3  25  24  24  # h0-W-W eff. coupling^2, normalised to SM
    1.13395487E-07        3  35  24  24  # H0-W-W eff. coupling^2, normalised to SM
    0.00000000E+00        3  36  24  24  # A0-W-W eff. coupling^2, normalised to SM
#
    9.99999887E-01        3  25  23  23  # h0-Z-Z eff. coupling^2, normalised to SM
    1.13395487E-07        3  35  23  23  # H0-Z-Z eff. coupling^2, normalised to SM
    0.00000000E+00        3  36  23  23  # A0-Z-Z eff. coupling^2, normalised to SM
#
    8.84896145E-01        3  25  21  21  # h0-g-g eff. coupling^2, normalised to SM
    1.65296809E-12        3  35  21  21  # H0-g-g eff. coupling^2, normalised to SM
    3.21496768E-12        3  36  21  21  # A0-g-g eff. coupling^2, normalised to SM
#
    0.00000000E+00        3  25  25  23  # h0-h0-Z eff. coupling^2, normalised to SM
    0.00000000E+00        3  35  25  23  # H0-h0-Z eff. coupling^2, normalised to SM
    1.13395487E-07        3  36  25  23  # A0-h0-Z eff. coupling^2, normalised to SM
    0.00000000E+00        3  35  35  23  # H0-H0-Z eff. coupling^2, normalised to SM
    9.99999887E-01        3  36  35  23  # A0-H0-Z eff. coupling^2, normalised to SM
    0.00000000E+00        3  36  36  23  # A0-A0-Z eff. coupling^2, normalised to SM
#
    0.00000000E+00        4  25  21  21  23  # h0-g-g-Z eff. coupling^2, normalised to SM
    0.00000000E+00        4  35  21  21  23  # H0-g-g-Z eff. coupling^2, normalised to SM
    0.00000000E+00        4  36  21  21  23  # A0-g-g-Z eff. coupling^2, normalised to SM
#
#
#
#                             =================
#                             |The decay table|
#                             =================
#
# - The QCD corrections to the decays gluino -> squark  + quark
#                                     squark -> gaugino + quark_prime
#                                     squark -> squark_prime + Higgs
#                                     squark -> gluino  + quark
#   are included.
#
# - The multi-body decays for the inos, stops and sbottoms are included.
#
# - The loop induced decays for the gluino, neutralinos and stops
#   are included.
#
# - The SUSY decays of the top quark are included.
#
#
#         PDG            Width
DECAY         6     1.45078199E+00   # top decays
#          BR         NDA      ID1       ID2
     1.00000000E+00    2           5        24   # BR(t ->  b    W+)
#
#         PDG            Width
DECAY   1000021     2.64166180E+02   # gluino decays
#          BR         NDA      ID1       ID2
     1.65589505E-03    2     1000001        -1   # BR(~g -> ~d_L  db)
     1.65589505E-03    2    -1000001         1   # BR(~g -> ~d_L* d )
     3.21488653E-02    2     2000001        -1   # BR(~g -> ~d_R  db)
     3.21488653E-02    2    -2000001         1   # BR(~g -> ~d_R* d )
     1.66772119E-03    2     1000002        -2   # BR(~g -> ~u_L  ub)
     1.66772119E-03    2    -1000002         2   # BR(~g -> ~u_L* u )
     1.20973338E-01    2     2000002        -2   # BR(~g -> ~u_R  ub)
     1.20973338E-01    2    -2000002         2   # BR(~g -> ~u_R* u )
     1.65589505E-03    2     1000003        -3   # BR(~g -> ~s_L  sb)
     1.65589505E-03    2    -1000003         3   # BR(~g -> ~s_L* s )
     3.21488653E-02    2     2000003        -3   # BR(~g -> ~s_R  sb)
     3.21488653E-02    2    -2000003         3   # BR(~g -> ~s_R* s )
     1.66767144E-03    2     1000004        -4   # BR(~g -> ~c_L  cb)
     1.66767144E-03    2    -1000004         4   # BR(~g -> ~c_L* c )
     1.20973336E-01    2     2000004        -4   # BR(~g -> ~c_R  cb)
     1.20973336E-01    2    -2000004         4   # BR(~g -> ~c_R* c )
     1.01323247E-01    2     1000005        -5   # BR(~g -> ~b_1  bb)
     1.01323247E-01    2    -1000005         5   # BR(~g -> ~b_1* b )
     4.23369010E-02    2     2000005        -5   # BR(~g -> ~b_2  bb)
     4.23369010E-02    2    -2000005         5   # BR(~g -> ~b_2* b )
     4.34482647E-02    2     1000006        -6   # BR(~g -> ~t_1  tb)
     4.34482647E-02    2    -1000006         6   # BR(~g -> ~t_1* t )
#
#         PDG            Width
DECAY   1000006     4.17960187E+01   # stop1 decays
#          BR         NDA      ID1       ID2
     2.14759677E-01    2     1000022         6   # BR(~t_1 -> ~chi_10 t )
     1.68047678E-01    2     1000023         6   # BR(~t_1 -> ~chi_20 t )
     1.76409663E-01    2     1000025         6   # BR(~t_1 -> ~chi_30 t )
     4.36072121E-01    2     1000024         5   # BR(~t_1 -> ~chi_1+ b )
     4.17187281E-03    2     1000037         5   # BR(~t_1 -> ~chi_2+ b )
     5.38989186E-04    2     1000005        24   # BR(~t_1 -> ~b_1    W+)
#
#         PDG            Width
DECAY   2000006     1.48225445E+02   # stop2 decays
#          BR         NDA      ID1       ID2
     6.26112320E-04    2     1000022         6   # BR(~t_2 -> ~chi_10 t )
     1.30372027E-01    2     1000023         6   # BR(~t_2 -> ~chi_20 t )
     1.27246681E-01    2     1000025         6   # BR(~t_2 -> ~chi_30 t )
     8.79412507E-04    2     1000035         6   # BR(~t_2 -> ~chi_40 t )
     1.26475677E-03    2     1000024         5   # BR(~t_2 -> ~chi_1+ b )
     2.57243364E-01    2     1000037         5   # BR(~t_2 -> ~chi_2+ b )
     1.30858997E-01    2     1000006        25   # BR(~t_2 -> ~t_1    h )
     1.19709255E-01    2     1000006        23   # BR(~t_2 -> ~t_1    Z )
     6.15008376E-06    2     1000005        24   # BR(~t_2 -> ~b_1    W+)
     2.31793245E-01    2     2000005        24   # BR(~t_2 -> ~b_2    W+)
#
#         PDG            Width
DECAY   1000005     1.55440682E-03   # sbottom1 decays
#          BR         NDA      ID1       ID2
     3.44933399E-01    2     1000022         5   # BR(~b_1 -> ~chi_10 b )
     6.55066601E-01    2    -1000024         6   # BR(~b_1 -> ~chi_1- t )
#
#         PDG            Width
DECAY   2000005     4.19767273E+01   # sbottom2 decays
#          BR         NDA      ID1       ID2
     2.18421601E-01    2     1000022         5   # BR(~b_2 -> ~chi_10 b )
     1.17191080E-03    2     1000023         5   # BR(~b_2 -> ~chi_20 b )
     1.16006837E-03    2     1000025         5   # BR(~b_2 -> ~chi_30 b )
     4.30283652E-01    2    -1000024         6   # BR(~b_2 -> ~chi_1- t )
     3.48417153E-01    2    -1000037         6   # BR(~b_2 -> ~chi_2- t )
     2.64577588E-04    2     1000005        25   # BR(~b_2 -> ~b_1    h )
     2.81036803E-04    2     1000005        23   # BR(~b_2 -> ~b_1    Z )
#
#         PDG            Width
DECAY   1000002     3.90498092E+01   # sup_L decays
#          BR         NDA      ID1       ID2
     3.32278853E-01    2     1000022         2   # BR(~u_L -> ~chi_10 u)
     3.62629193E-04    2     1000023         2   # BR(~u_L -> ~chi_20 u)
     5.00288980E-04    2     1000025         2   # BR(~u_L -> ~chi_30 u)
     6.66855451E-01    2     1000024         1   # BR(~u_L -> ~chi_1+ d)
     2.77793618E-06    2     1000037         1   # BR(~u_L -> ~chi_2+ d)
#
#         PDG            Width
DECAY   2000002     1.20160056E-06   # sup_R decays
#           BR         NDA      ID1       ID2
     3.84850378E-02    2     1000022         2   # BR(~u_R -> ~chi_10 u)
#           BR         NDA      ID1       ID2       ID3
     4.42010445E-01    3        2       -15        1000015   # BR(~u_R -> u  tau+  ~tau_1-)
     8.58438346E-03    3        2       15        -1000015   # BR(~u_R -> u  tau-  ~tau_1+)
     5.01697501E-01    3        2       -16        1000016   # BR(~u_R -> u  nu_taub  ~nu_tau1)
     8.01431049E-03    3        2       16        -1000016   # BR(~u_R -> u  nu_tau  ~nu_tau1*)
     8.42542881E-05    3        2       23        1000022   # BR(~u_R -> u  Z  ~chi_10)
     1.58596797E-04    3        2       25        1000022   # BR(~u_R -> u  h  ~chi_10)
     5.33613265E-04    3        2       -24        1000024   # BR(~u_R -> u  W-  ~chi_1+)
     4.31857321E-04    3        2       24        -1000024   # BR(~u_R -> u  W+  ~chi_1-)
#
#         PDG            Width
DECAY   1000001     3.90055971E+01   # sdown_L decays
#          BR         NDA      ID1       ID2
     3.32773865E-01    2     1000022         1   # BR(~d_L -> ~chi_10 d)
     4.00521276E-04    2     1000023         1   # BR(~d_L -> ~chi_20 d)
     3.60986427E-04    2     1000025         1   # BR(~d_L -> ~chi_30 d)
     6.63244645E-01    2    -1000024         2   # BR(~d_L -> ~chi_1- u)
     3.21998198E-03    2    -1000037         2   # BR(~d_L -> ~chi_2- u)
#
#         PDG            Width
DECAY   2000001     1.25791238E-01   # sdown_R decays
#           BR         NDA      ID1       ID2
     4.51881458E-07    2     1000022         1   # BR(~d_R -> ~chi_10 d)
#           BR         NDA      ID1       ID2       ID3
     7.56483529E-02    3        1       -2        2000002   # BR(~d_R -> d  ub  ~u_R)
     3.59071113E-01    3        1       2        -2000002   # BR(~d_R -> d  u  ~u_R*)
     7.53430852E-02    3        1       -4        2000004   # BR(~d_R -> d  cb  ~c_R)
     3.60112521E-01    3        1       4        -2000004   # BR(~d_R -> d  c  ~c_R*)
     2.71052265E-02    3        1       -5        1000005   # BR(~d_R -> d  bb  ~b_1)
     9.78049041E-02    3        1       5        -1000005   # BR(~d_R -> d  b  ~b_1*)
     1.53651401E-05    3        1       -5        2000005   # BR(~d_R -> d  bb  ~b_2)
     7.13197526E-06    3        1       5        -2000005   # BR(~d_R -> d  b  ~b_2*)
     7.84092766E-08    3        1       -6        1000006   # BR(~d_R -> d  tb  ~t_1)
     4.30642076E-08    3        1       6        -1000006   # BR(~d_R -> d  t  ~t_1*)
     6.01631727E-05    3        1       -11        1000011   # BR(~d_R -> d  e+  ~e_L-)
     2.01691313E-05    3        1       11        -1000011   # BR(~d_R -> d  e-  ~e_L+)
     6.42970059E-05    3        1       -11        2000011   # BR(~d_R -> d  e+  ~e_R-)
     1.82349743E-04    3        1       11        -2000011   # BR(~d_R -> d  e-  ~e_R+)
     6.22579132E-05    3        1       -12        1000012   # BR(~d_R -> d  nu_eb  ~nu_eL)
     2.04990430E-05    3        1       12        -1000012   # BR(~d_R -> d  nu_e  ~nu_eL*)
     6.05511171E-05    3        1       -13        1000013   # BR(~d_R -> d  mu+  ~mu_L-)
     2.04863235E-05    3        1       13        -1000013   # BR(~d_R -> d  mu-  ~mu_L+)
     6.39702742E-05    3        1       -13        2000013   # BR(~d_R -> d  mu+  ~mu_R-)
     1.81236788E-04    3        1       13        -2000013   # BR(~d_R -> d  mu-  ~mu_R+)
     6.17809324E-05    3        1       -14        1000014   # BR(~d_R -> d  nu_mub  ~nu_muL)
     2.09330955E-05    3        1       14        -1000014   # BR(~d_R -> d  nu_mu  ~nu_muL*)
     5.02228938E-04    3        1       -15        1000015   # BR(~d_R -> d  tau+  ~tau_1-)
     1.05102710E-04    3        1       15        -1000015   # BR(~d_R -> d  tau-  ~tau_1+)
     5.24074656E-05    3        1       -15        2000015   # BR(~d_R -> d  tau+  ~tau_2-)
     1.44167434E-04    3        1       15        -2000015   # BR(~d_R -> d  tau-  ~tau_2+)
     5.02356133E-04    3        1       -16        1000016   # BR(~d_R -> d  nu_taub  ~nu_tau1)
     9.92755948E-05    3        1       16        -1000016   # BR(~d_R -> d  nu_tau  ~nu_tau1*)
     3.37304892E-04    3        1       23        1000022   # BR(~d_R -> d  Z  ~chi_10)
     3.77721061E-04    3        1       25        1000022   # BR(~d_R -> d  h  ~chi_10)
     1.22170671E-04    3        1       23        1000023   # BR(~d_R -> d  Z  ~chi_20)
     5.94063632E-06    3        1       25        1000023   # BR(~d_R -> d  h  ~chi_20)
     5.44537131E-06    3        1       23        1000025   # BR(~d_R -> d  Z  ~chi_30)
     1.25946770E-04    3        1       25        1000025   # BR(~d_R -> d  h  ~chi_30)
     7.13173677E-04    3        1       -24        1000024   # BR(~d_R -> d  W-  ~chi_1+)
     7.19708313E-04    3        1       24        -1000024   # BR(~d_R -> d  W+  ~chi_1-)
     8.38850157E-05    3        1       -24        1000037   # BR(~d_R -> d  W-  ~chi_2+)
     1.76196691E-04    3        1       24        -1000037   # BR(~d_R -> d  W+  ~chi_2-)
#
#         PDG            Width
DECAY   1000004     4.01883976E+01   # scharm_L decays
#          BR         NDA      ID1       ID2
     3.32280396E-01    2     1000022         4   # BR(~c_L -> ~chi_10 c)
     3.60815625E-04    2     1000023         4   # BR(~c_L -> ~chi_20 c)
     4.97785375E-04    2     1000025         4   # BR(~c_L -> ~chi_30 c)
     6.66858239E-01    2     1000024         3   # BR(~c_L -> ~chi_1+ s)
     2.76399750E-06    2     1000037         3   # BR(~c_L -> ~chi_2+ s)
#
#         PDG            Width
DECAY   2000004     1.19571853E-06   # scharm_R decays
#           BR         NDA      ID1       ID2
     3.63126538E-02    2     1000022         4   # BR(~c_R -> ~chi_10 c)
#           BR         NDA      ID1       ID2       ID3
     4.42186004E-01    3        4       -15        1000015   # BR(~c_R -> c  tau+  ~tau_1-)
     8.59065049E-03    3        4       15        -1000015   # BR(~c_R -> c  tau-  ~tau_1+)
     5.03638593E-01    3        4       -16        1000016   # BR(~c_R -> c  nu_taub  ~nu_tau1)
     8.05850184E-03    3        4       16        -1000016   # BR(~c_R -> c  nu_tau  ~nu_tau1*)
     8.44764024E-05    3        4       23        1000022   # BR(~c_R -> c  Z  ~chi_10)
     1.60597996E-04    3        4       25        1000022   # BR(~c_R -> c  h  ~chi_10)
     5.35059031E-04    3        4       -24        1000024   # BR(~c_R -> c  W-  ~chi_1+)
     4.33463215E-04    3        4       24        -1000024   # BR(~c_R -> c  W+  ~chi_1-)
#
#         PDG            Width
DECAY   1000003     4.01433949E+01   # sstrange_L decays
#          BR         NDA      ID1       ID2
     3.32780769E-01    2     1000022         3   # BR(~s_L -> ~chi_10 s)
     3.98524708E-04    2     1000023         3   # BR(~s_L -> ~chi_20 s)
     3.59185799E-04    2     1000025         3   # BR(~s_L -> ~chi_30 s)
     6.63257646E-01    2    -1000024         4   # BR(~s_L -> ~chi_1- c)
     3.20387435E-03    2    -1000037         4   # BR(~s_L -> ~chi_2- c)
#
#         PDG            Width
DECAY   2000003     1.25373371E-01   # sstrange_R decays
#           BR         NDA      ID1       ID2
     4.56010678E-07    2     1000022         3   # BR(~s_R -> ~chi_10 s)
#           BR         NDA      ID1       ID2       ID3
     7.59004876E-02    3        3       -2        2000002   # BR(~s_R -> s  ub  ~u_R)
     3.59980748E-01    3        3       2        -2000002   # BR(~s_R -> s  u  ~u_R*)
     7.55942025E-02    3        3       -4        2000004   # BR(~s_R -> s  cb  ~c_R)
     3.58305751E-01    3        3       4        -2000004   # BR(~s_R -> s  c  ~c_R*)
     2.71844010E-02    3        3       -5        1000005   # BR(~s_R -> s  bb  ~b_1)
     9.81069577E-02    3        3       5        -1000005   # BR(~s_R -> s  b  ~b_1*)
     1.54163519E-05    3        3       -5        2000005   # BR(~s_R -> s  bb  ~b_2)
     7.16715195E-06    3        3       5        -2000005   # BR(~s_R -> s  b  ~b_2*)
     7.85860659E-08    3        3       -6        1000006   # BR(~s_R -> s  tb  ~t_1)
     4.33656681E-08    3        3       6        -1000006   # BR(~s_R -> s  t  ~t_1*)
     6.05375762E-05    3        3       -11        1000011   # BR(~s_R -> s  e+  ~e_L-)
     2.03400449E-05    3        3       11        -1000011   # BR(~s_R -> s  e-  ~e_L+)
     6.40702243E-05    3        3       -11        2000011   # BR(~s_R -> s  e+  ~e_R-)
     1.82957511E-04    3        3       11        -2000011   # BR(~s_R -> s  e-  ~e_R+)
     6.24654177E-05    3        3       -12        1000012   # BR(~s_R -> s  nu_eb  ~nu_eL)
     2.05673659E-05    3        3       12        -1000012   # BR(~s_R -> s  nu_e  ~nu_eL*)
     6.07529329E-05    3        3       -13        1000013   # BR(~s_R -> s  mu+  ~mu_L-)
     2.05944849E-05    3        3       13        -1000013   # BR(~s_R -> s  mu-  ~mu_L+)
     6.41834860E-05    3        3       -13        2000013   # BR(~s_R -> s  mu+  ~mu_R-)
     1.81840847E-04    3        3       13        -2000013   # BR(~s_R -> s  mu-  ~mu_R+)
     6.19868473E-05    3        3       -14        1000014   # BR(~s_R -> s  nu_mub  ~nu_muL)
     2.10028651E-05    3        3       14        -1000014   # BR(~s_R -> s  nu_mu  ~nu_muL*)
     5.03902858E-04    3        3       -15        1000015   # BR(~s_R -> s  tau+  ~tau_1-)
     1.01847783E-04    3        3       15        -1000015   # BR(~s_R -> s  tau-  ~tau_1+)
     5.25821388E-05    3        3       -15        2000015   # BR(~s_R -> s  tau+  ~tau_2-)
     1.44647941E-04    3        3       15        -2000015   # BR(~s_R -> s  tau-  ~tau_2+)
     5.04030477E-04    3        3       -16        1000016   # BR(~s_R -> s  nu_taub  ~nu_tau1)
     9.96064786E-05    3        3       16        -1000016   # BR(~s_R -> s  nu_tau  ~nu_tau1*)
     3.38429122E-04    3        3       23        1000022   # BR(~s_R -> s  Z  ~chi_10)
     3.78979998E-04    3        3       25        1000022   # BR(~s_R -> s  h  ~chi_10)
     1.22577864E-04    3        3       23        1000023   # BR(~s_R -> s  Z  ~chi_20)
     5.95588994E-06    3        3       25        1000023   # BR(~s_R -> s  h  ~chi_20)
     5.45713970E-06    3        3       23        1000025   # BR(~s_R -> s  Z  ~chi_30)
     1.26366547E-04    3        3       25        1000025   # BR(~s_R -> s  h  ~chi_30)
     7.15550673E-04    3        3       -24        1000024   # BR(~s_R -> s  W-  ~chi_1+)
     7.22107089E-04    3        3       24        -1000024   # BR(~s_R -> s  W+  ~chi_1-)
     8.41646030E-05    3        3       -24        1000037   # BR(~s_R -> s  W-  ~chi_2+)
     1.76783952E-04    3        3       24        -1000037   # BR(~s_R -> s  W+  ~chi_2-)
#
#         PDG            Width
DECAY   1000011     1.44710060E+01   # selectron_L decays
#          BR         NDA      ID1       ID2
     3.34055723E-01    2     1000022        11   # BR(~e_L -> ~chi_10 e-)
     6.65944277E-01    2    -1000024        12   # BR(~e_L -> ~chi_1- nu_e)
#
#         PDG            Width
DECAY   2000011     2.18488420E-04   # selectron_R decays
#           BR         NDA      ID1       ID2
     1.22754530E-03    2     1000022        11   # BR(~e_R -> ~chi_10 e-)
#           BR         NDA      ID1       ID2       ID3
     2.01081594E-02    3        11       -2        2000002   # BR(~e_R- -> e-  ub  ~u_R)
     2.23078184E-01    3        11       2        -2000002   # BR(~e_R- -> e-  u  ~u_R*)
     1.97452111E-02    3        11       -4        2000004   # BR(~e_R- -> e-  cb  ~c_R)
     2.28492658E-01    3        11       4        -2000004   # BR(~e_R- -> e-  c  ~c_R*)
     2.51317667E-05    3        11       -5        1000005   # BR(~e_R- -> e-  bb  ~b_1)
     9.82569235E-05    3        11       5        -1000005   # BR(~e_R- -> e-  b  ~b_1*)
     1.61724818E-06    3        11       -11        1000011   # BR(~e_R- -> e-  e+  ~e_L-)
     3.85201193E-07    3        11       11        -1000011   # BR(~e_R- -> e-  e-  ~e_L+)
     1.34103217E-06    3        11       -12        1000012   # BR(~e_R- -> e-  nu_eb  ~nu_eL)
     2.56466681E-07    3        11       12        -1000012   # BR(~e_R- -> e-  nu_e  ~nu_eL*)
     1.62493737E-06    3        11       -13        1000013   # BR(~e_R- -> e-  mu+  ~mu_L-)
     3.86006727E-07    3        11       13        -1000013   # BR(~e_R- -> e-  mu-  ~mu_L+)
     1.35425941E-06    3        11       -14        1000014   # BR(~e_R- -> e-  nu_mub  ~nu_muL)
     2.51725011E-07    3        11       14        -1000014   # BR(~e_R- -> e-  nu_mu  ~nu_muL*)
     2.23018684E-01    3        11       -15        1000015   # BR(~e_R- -> e-  tau+  ~tau_1-)
     1.39677883E-02    3        11       15        -1000015   # BR(~e_R- -> e-  tau-  ~tau_1+)
     2.27604740E-01    3        11       -16        1000016   # BR(~e_R- -> e-  nu_taub  ~nu_tau1)
     1.27100557E-02    3        11       16        -1000016   # BR(~e_R- -> e-  nu_tau  ~nu_tau1*)
     4.56033322E-03    3        11       23        1000022   # BR(~e_R- -> e-  Z  ~chi_10)
     5.30462895E-03    3        11       25        1000022   # BR(~e_R- -> e-  h  ~chi_10)
     1.16912374E-02    3        11       -24        1000024   # BR(~e_R- -> e-  W-  ~chi_1+)
     8.36016846E-03    3        11       24        -1000024   # BR(~e_R- -> e-  W+  ~chi_1-)
#
#         PDG            Width
DECAY   1000013     1.44710059E+01   # smuon_L decays
#          BR         NDA      ID1       ID2
     3.34055720E-01    2     1000022        13   # BR(~mu_L -> ~chi_10 mu-)
     6.65944280E-01    2    -1000024        14   # BR(~mu_L -> ~chi_1- nu_mu)
#
#         PDG            Width
DECAY   2000013     2.18466460E-04   # smuon_R decays
#           BR         NDA      ID1       ID2
     1.22766868E-03    2     1000022        13   # BR(~mu_R -> ~chi_10 mu-)
#           BR         NDA      ID1       ID2       ID3
     2.01101808E-02    3        13       -2        2000002   # BR(~mu_R- -> mu-  ub  ~u_R)
     2.23059412E-01    3        13       2        -2000002   # BR(~mu_R- -> mu-  u  ~u_R*)
     1.97471960E-02    3        13       -4        2000004   # BR(~mu_R- -> mu-  cb  ~c_R)
     2.28598020E-01    3        13       4        -2000004   # BR(~mu_R- -> mu-  c  ~c_R*)
     2.52945006E-05    3        13       -5        1000005   # BR(~mu_R- -> mu-  bb  ~b_1)
     9.82759551E-05    3        13       5        -1000005   # BR(~mu_R- -> mu-  b  ~b_1*)
     1.63910745E-06    3        13       -11        1000011   # BR(~mu_R- -> mu-  e+  ~e_L-)
     3.84951539E-07    3        13       11        -1000011   # BR(~mu_R- -> mu-  e-  ~e_L+)
     1.33549105E-06    3        13       -12        1000012   # BR(~mu_R- -> mu-  nu_eb  ~nu_eL)
     2.57916021E-07    3        13       12        -1000012   # BR(~mu_R- -> mu-  nu_e  ~nu_eL*)
     1.61603754E-06    3        13       -13        1000013   # BR(~mu_R- -> mu-  mu+  ~mu_L-)
     3.88924690E-07    3        13       13        -1000013   # BR(~mu_R- -> mu-  mu-  ~mu_L+)
     1.35430400E-06    3        13       -14        1000014   # BR(~mu_R- -> mu-  nu_mub  ~nu_muL)
     2.52020380E-07    3        13       14        -1000014   # BR(~mu_R- -> mu-  nu_mu  ~nu_muL*)
     2.23077721E-01    3        13       -15        1000015   # BR(~mu_R- -> mu-  tau+  ~tau_1-)
     1.35027592E-02    3        13       15        -1000015   # BR(~mu_R- -> mu-  tau-  ~tau_1+)
     2.27938879E-01    3        13       -16        1000016   # BR(~mu_R- -> mu-  nu_taub  ~nu_tau1)
     1.27113334E-02    3        13       16        -1000016   # BR(~mu_R- -> mu-  nu_tau  ~nu_tau1*)
     4.56079162E-03    3        13       23        1000022   # BR(~mu_R- -> mu-  Z  ~chi_10)
     5.30470444E-03    3        13       25        1000022   # BR(~mu_R- -> mu-  h  ~chi_10)
     1.16695258E-02    3        13       -24        1000024   # BR(~mu_R- -> mu-  W-  ~chi_1+)
     8.36100883E-03    3        13       24        -1000024   # BR(~mu_R- -> mu-  W+  ~chi_1-)
#
#         PDG            Width
DECAY   1000015     8.78170552E-02   # stau_1 decays
#          BR         NDA      ID1       ID2
     3.36588346E-01    2     1000022        15   # BR(~tau_1 -> ~chi_10  tau-)
     6.63411654E-01    2    -1000024        16   # BR(~tau_1 -> ~chi_1-  nu_tau)
#
#         PDG            Width
DECAY   2000015     2.07733093E-01   # stau_2 decays
#          BR         NDA      ID1       ID2
     5.79171416E-05    2     1000022        15   # BR(~tau_2 -> ~chi_10  tau-)
     2.81077952E-03    2     1000023        15   # BR(~tau_2 -> ~chi_20  tau-)
     2.93380624E-03    2     1000025        15   # BR(~tau_2 -> ~chi_30  tau-)
     1.13976053E-04    2    -1000024        16   # BR(~tau_2 -> ~chi_1-  nu_tau)
     5.26354729E-03    2    -1000037        16   # BR(~tau_2 -> ~chi_2-  nu_tau)
     4.87891725E-01    2     1000016       -24   # BR(~tau_2 -> ~nu_tauL W-)
     2.53010757E-01    2     1000015        25   # BR(~tau_2 -> ~tau_1   h)
     2.47917492E-01    2     1000015        23   # BR(~tau_2 -> ~tau_1   Z)
#
#         PDG            Width
DECAY   1000012     1.45042293E+01   # snu_eL decays
#          BR         NDA      ID1       ID2
     3.32653114E-01    2     1000022        12   # BR(~nu_eL -> ~chi_10 nu_e)
     6.67346886E-01    2     1000024        11   # BR(~nu_eL -> ~chi_1+ e-)
#
#         PDG            Width
DECAY   1000014     1.45042292E+01   # snu_muL decays
#          BR         NDA      ID1       ID2
     3.32653117E-01    2     1000022        14   # BR(~nu_muL -> ~chi_10 nu_mu)
     6.67346883E-01    2     1000024        13   # BR(~nu_muL -> ~chi_1+ mu-)
#
#         PDG            Width
DECAY   1000016     2.34582853E-02   # snu_tauL decays
#          BR         NDA      ID1       ID2
     3.41604950E-01    2     1000022        16   # BR(~nu_tauL -> ~chi_10 nu_tau)
     6.58395050E-01    2     1000024        15   # BR(~nu_tauL -> ~chi_1+ tau-)
#
#         PDG            Width
DECAY   1000024     3.48038330E-15   # chargino1+ decays
#           BR         NDA      ID1       ID2       ID3
     1.96061860E-02    3     1000022       -11        12   # BR(~chi_1+ -> ~chi_10 e+   nu_e)
     2.14501290E-03    3     1000022       -13        14   # BR(~chi_1+ -> ~chi_10 mu+  nu_mu)
     9.78248800E-01    2     1000022       211             # BR(~chi_1+ -> ~chi_10 pi+)
#
#         PDG            Width
DECAY   1000037     6.93215982E+00   # chargino2+ decays
#          BR         NDA      ID1       ID2
     3.51251904E-08    2     1000012       -11   # BR(~chi_2+ -> ~nu_eL   e+  )
     3.51251904E-08    2     1000014       -13   # BR(~chi_2+ -> ~nu_muL mu+ )
     4.40015430E-03    2     1000016       -15   # BR(~chi_2+ -> ~nu_tau1 tau+)
     3.72122139E-05    2    -1000011        12   # BR(~chi_2+ -> ~e_L+    nu_e)
     3.72122139E-05    2    -1000013        14   # BR(~chi_2+ -> ~mu_L+   nu_mu)
     4.82693138E-03    2    -1000015        16   # BR(~chi_2+ -> ~tau_1+  nu_tau)
     3.34695268E-01    2     1000024        23   # BR(~chi_2+ -> ~chi_1+  Z )
     3.26507175E-01    2     1000022        24   # BR(~chi_2+ -> ~chi_10  W+)
     3.29495976E-01    2     1000024        25   # BR(~chi_2+ -> ~chi_1+  h )
#
#         PDG            Width
DECAY   1000022     0.00000000E+00   # neutralino1 decays
#
#         PDG            Width
DECAY   1000023     6.89478249E+00   # neutralino2 decays
#          BR         NDA      ID1       ID2
     1.78585310E-01    2     1000022        23   # BR(~chi_20 -> ~chi_10   Z )
     3.28201419E-01    2     1000024       -24   # BR(~chi_20 -> ~chi_1+   W-)
     3.28201419E-01    2    -1000024        24   # BR(~chi_20 -> ~chi_1-   W+)
     1.57089443E-01    2     1000022        25   # BR(~chi_20 -> ~chi_10   h )
     1.11768886E-05    2     2000002        -2   # BR(~chi_20 -> ~u_R      ub)
     1.11768886E-05    2    -2000002         2   # BR(~chi_20 -> ~u_R*     u )
     1.11768767E-05    2     2000004        -4   # BR(~chi_20 -> ~c_R      cb)
     1.11768767E-05    2    -2000004         4   # BR(~chi_20 -> ~c_R*     c )
     5.66493245E-04    2     1000005        -5   # BR(~chi_20 -> ~b_1      bb)
     5.66493245E-04    2    -1000005         5   # BR(~chi_20 -> ~b_1*     b )
     3.39300881E-06    2     1000011       -11   # BR(~chi_20 -> ~e_L-     e+)
     3.39300881E-06    2    -1000011        11   # BR(~chi_20 -> ~e_L+     e-)
     3.39300881E-06    2     1000013       -13   # BR(~chi_20 -> ~mu_L-    mu+)
     3.39300881E-06    2    -1000013        13   # BR(~chi_20 -> ~mu_L+    mu-)
     2.68144648E-03    2     1000015       -15   # BR(~chi_20 -> ~tau_1-   tau+)
     2.68144648E-03    2    -1000015        15   # BR(~chi_20 -> ~tau_1+   tau-)
     5.00101824E-06    2     1000012       -12   # BR(~chi_20 -> ~nu_eL    nu_eb)
     5.00101824E-06    2    -1000012        12   # BR(~chi_20 -> ~nu_eL*   nu_e )
     5.00101824E-06    2     1000014       -14   # BR(~chi_20 -> ~nu_muL   nu_mub)
     5.00101824E-06    2    -1000014        14   # BR(~chi_20 -> ~nu_muL*  nu_mu )
     6.74122753E-04    2     1000016       -16   # BR(~chi_20 -> ~nu_tau1  nu_taub)
     6.74122753E-04    2    -1000016        16   # BR(~chi_20 -> ~nu_tau1* nu_tau )
#
#         PDG            Width
DECAY   1000025     6.87723320E+00   # neutralino3 decays
#          BR         NDA      ID1       ID2
     1.58208599E-01    2     1000022        23   # BR(~chi_30 -> ~chi_10   Z )
     3.28862972E-01    2     1000024       -24   # BR(~chi_30 -> ~chi_1+   W-)
     3.28862972E-01    2    -1000024        24   # BR(~chi_30 -> ~chi_1-   W+)
     1.75167951E-01    2     1000022        25   # BR(~chi_30 -> ~chi_10   h )
     1.40657398E-04    2     2000002        -2   # BR(~chi_30 -> ~u_R      ub)
     1.40657398E-04    2    -2000002         2   # BR(~chi_30 -> ~u_R*     u )
     1.40657249E-04    2     2000004        -4   # BR(~chi_30 -> ~c_R      cb)
     1.40657249E-04    2    -2000004         4   # BR(~chi_30 -> ~c_R*     c )
     5.77053886E-04    2     1000005        -5   # BR(~chi_30 -> ~b_1      bb)
     5.77053886E-04    2    -1000005         5   # BR(~chi_30 -> ~b_1*     b )
     7.04552182E-06    2     1000011       -11   # BR(~chi_30 -> ~e_L-     e+)
     7.04552182E-06    2    -1000011        11   # BR(~chi_30 -> ~e_L+     e-)
     7.04552182E-06    2     1000013       -13   # BR(~chi_30 -> ~mu_L-    mu+)
     7.04552182E-06    2    -1000013        13   # BR(~chi_30 -> ~mu_L+    mu-)
     3.19549488E-03    2     1000015       -15   # BR(~chi_30 -> ~tau_1-   tau+)
     3.19549488E-03    2    -1000015        15   # BR(~chi_30 -> ~tau_1+   tau-)
     2.83877980E-06    2     1000012       -12   # BR(~chi_30 -> ~nu_eL    nu_eb)
     2.83877980E-06    2    -1000012        12   # BR(~chi_30 -> ~nu_eL*   nu_e )
     2.83877980E-06    2     1000014       -14   # BR(~chi_30 -> ~nu_muL   nu_mub)
     2.83877980E-06    2    -1000014        14   # BR(~chi_30 -> ~nu_muL*  nu_mu )
     3.75120712E-04    2     1000016       -16   # BR(~chi_30 -> ~nu_tau1  nu_taub)
     3.75120712E-04    2    -1000016        16   # BR(~chi_30 -> ~nu_tau1* nu_tau )
#
#         PDG            Width
DECAY   1000035     1.17277158E+02   # neutralino4 decays
#          BR         NDA      ID1       ID2
     2.58677815E-05    2     1000022        23   # BR(~chi_40 -> ~chi_10   Z )
     1.97460985E-02    2     1000023        23   # BR(~chi_40 -> ~chi_20   Z )
     1.58675251E-03    2     1000025        23   # BR(~chi_40 -> ~chi_30   Z )
     2.78333986E-05    2     1000024       -24   # BR(~chi_40 -> ~chi_1+   W-)
     2.78333986E-05    2    -1000024        24   # BR(~chi_40 -> ~chi_1-   W+)
     2.07231262E-02    2     1000037       -24   # BR(~chi_40 -> ~chi_2+   W-)
     2.07231262E-02    2    -1000037        24   # BR(~chi_40 -> ~chi_2-   W+)
     5.38721468E-06    2     1000022        25   # BR(~chi_40 -> ~chi_10   h )
     1.68860176E-03    2     1000023        25   # BR(~chi_40 -> ~chi_20   h )
     2.14401847E-02    2     1000025        25   # BR(~chi_40 -> ~chi_30   h )
     6.76954816E-09    2     1000002        -2   # BR(~chi_40 -> ~u_L      ub)
     6.76954816E-09    2    -1000002         2   # BR(~chi_40 -> ~u_L*     u )
     9.00698244E-02    2     2000002        -2   # BR(~chi_40 -> ~u_R      ub)
     9.00698244E-02    2    -2000002         2   # BR(~chi_40 -> ~u_R*     u )
     1.80513674E-09    2     1000001        -1   # BR(~chi_40 -> ~d_L      db)
     1.80513674E-09    2    -1000001         1   # BR(~chi_40 -> ~d_L*     d )
     4.67677374E-03    2     2000001        -1   # BR(~chi_40 -> ~d_R      db)
     4.67677374E-03    2    -2000001         1   # BR(~chi_40 -> ~d_R*     d )
     1.47748678E-09    2     1000004        -4   # BR(~chi_40 -> ~c_L      cb)
     1.47748678E-09    2    -1000004         4   # BR(~chi_40 -> ~c_L*     c )
     9.00698227E-02    2     2000004        -4   # BR(~chi_40 -> ~c_R      cb)
     9.00698227E-02    2    -2000004         4   # BR(~chi_40 -> ~c_R*     c )
     1.80513674E-09    2     1000003        -3   # BR(~chi_40 -> ~s _L      sb)
     1.80513674E-09    2    -1000003         3   # BR(~chi_40 -> ~s _L*     s )
     4.67677374E-03    2     2000003        -3   # BR(~chi_40 -> ~s _R      sb)
     4.67677374E-03    2    -2000003         3   # BR(~chi_40 -> ~s _R*     s )
     2.30233147E-03    2     1000006        -6   # BR(~chi_40 -> ~t_1      tb)
     2.30233147E-03    2    -1000006         6   # BR(~chi_40 -> ~t_1*     t )
     1.90430141E-02    2     1000005        -5   # BR(~chi_40 -> ~b_1      bb)
     1.90430141E-02    2    -1000005         5   # BR(~chi_40 -> ~b_1*     b )
     1.68091999E-03    2     2000005        -5   # BR(~chi_40 -> ~b_2      bb)
     1.68091999E-03    2    -2000005         5   # BR(~chi_40 -> ~b_2*     b )
     1.35476331E-02    2     1000011       -11   # BR(~chi_40 -> ~e_L-     e+)
     1.35476331E-02    2    -1000011        11   # BR(~chi_40 -> ~e_L+     e-)
     5.17718856E-02    2     2000011       -11   # BR(~chi_40 -> ~e_R-     e+)
     5.17718856E-02    2    -2000011        11   # BR(~chi_40 -> ~e_R+     e-)
     1.35476331E-02    2     1000013       -13   # BR(~chi_40 -> ~mu_L-    mu+)
     1.35476331E-02    2    -1000013        13   # BR(~chi_40 -> ~mu_L+    mu-)
     5.17718856E-02    2     2000013       -13   # BR(~chi_40 -> ~mu_R-    mu+)
     5.17718856E-02    2    -2000013        13   # BR(~chi_40 -> ~mu_R+    mu-)
     1.84205639E-02    2     1000015       -15   # BR(~chi_40 -> ~tau_1-   tau+)
     1.84205639E-02    2    -1000015        15   # BR(~chi_40 -> ~tau_1+   tau-)
     4.97336937E-02    2     2000015       -15   # BR(~chi_40 -> ~tau_2-   tau+)
     4.97336937E-02    2    -2000015        15   # BR(~chi_40 -> ~tau_2+   tau-)
     1.36022180E-02    2     1000012       -12   # BR(~chi_40 -> ~nu_eL    nu_eb)
     1.36022180E-02    2    -1000012        12   # BR(~chi_40 -> ~nu_eL*   nu_e )
     1.36022180E-02    2     1000014       -14   # BR(~chi_40 -> ~nu_muL   nu_mub)
     1.36022180E-02    2    -1000014        14   # BR(~chi_40 -> ~nu_muL*  nu_mu )
     1.84853913E-02    2     1000016       -16   # BR(~chi_40 -> ~nu_tau1  nu_taub)
     1.84853913E-02    2    -1000016        16   # BR(~chi_40 -> ~nu_tau1* nu_tau )
#
#         PDG            Width
DECAY        25     4.02462478E-03   # h decays
#          BR         NDA      ID1       ID2
     6.10072044E-01    2           5        -5   # BR(h -> b       bb     )
     6.42377089E-02    2         -15        15   # BR(h -> tau+    tau-   )
     2.27376803E-04    2         -13        13   # BR(h -> mu+     mu-    )
     2.48386825E-04    2           3        -3   # BR(h -> s       sb     )
     2.14759097E-02    2           4        -4   # BR(h -> c       cb     )
     7.81492176E-02    2          21        21   # BR(h -> g       g      )
     2.27933776E-03    2          22        22   # BR(h -> gam     gam    )
     1.48222096E-03    2          22        23   # BR(h -> Z       gam    )
     1.97385397E-01    2          24       -24   # BR(h -> W+      W-     )
     2.44424002E-02    2          23        23   # BR(h -> Z       Z      )
#
#         PDG            Width
DECAY        35     4.30176469E+01   # H decays
#          BR         NDA      ID1       ID2
     2.03673220E-02    2           5        -5   # BR(H -> b       bb     )
     4.31869534E-03    2         -15        15   # BR(H -> tau+    tau-   )
     1.51338840E-05    2         -13        13   # BR(H -> mu+     mu-    )
     8.79805910E-06    2           3        -3   # BR(H -> s       sb     )
     1.47836388E-06    2           4        -4   # BR(H -> c       cb     )
     1.45852779E-01    2           6        -6   # BR(H -> t       tb     )
     6.52033930E-05    2          21        21   # BR(H -> g       g      )
     1.33165508E-07    2          22        22   # BR(H -> gam     gam    )
     9.94653812E-08    2          23        22   # BR(H -> Z       gam    )
     4.47531594E-05    2          24       -24   # BR(H -> W+      W-     )
     2.23374511E-05    2          23        23   # BR(H -> Z       Z      )
     1.65897325E-04    2          25        25   # BR(H -> h       h      )
     4.61910843E-03    2     1000024  -1000024   # BR(H -> ~chi_1+ ~chi_1-)
     5.29758690E-05    2     1000037  -1000037   # BR(H -> ~chi_2+ ~chi_2-)
     2.72697191E-01    2     1000024  -1000037   # BR(H -> ~chi_1+ ~chi_2-)
     2.72697191E-01    2     1000037  -1000024   # BR(H -> ~chi_2+ ~chi_1-)
     2.31086050E-03    2     1000022   1000022   # BR(H -> ~chi_10 ~chi_10)
     3.34166399E-04    2     1000023   1000023   # BR(H -> ~chi_20 ~chi_20)
     8.38275559E-05    2     1000025   1000025   # BR(H -> ~chi_30 ~chi_30)
     1.83644907E-01    2     1000022   1000023   # BR(H -> ~chi_10 ~chi_20)
     8.78291827E-02    2     1000022   1000025   # BR(H -> ~chi_10 ~chi_30)
     1.40353898E-05    2     1000022   1000035   # BR(H -> ~chi_10 ~chi_40)
     6.70609032E-04    2     1000023   1000025   # BR(H -> ~chi_20 ~chi_30)
     5.48482697E-06    2     2000002  -2000002   # BR(H -> ~u_R    ~u_R*  )
     5.48482697E-06    2     2000004  -2000004   # BR(H -> ~c_R    ~c_R*  )
     5.85010454E-07    2     1000005  -1000005   # BR(H -> ~b_1    ~b_1*  )
     1.44465665E-03    2     1000005  -2000005   # BR(H -> ~b_1    ~b_2*  )
     1.44465665E-03    2     2000005  -1000005   # BR(H -> ~b_2    ~b_1*  )
     4.97558282E-06    2     1000011  -1000011   # BR(H -> ~e_L-   ~e_L+  )
     3.02464609E-06    2     2000011  -2000011   # BR(H -> ~e_R-   ~e_R+  )
     4.97558282E-06    2     1000013  -1000013   # BR(H -> ~mu_L-  ~mu_L+ )
     3.02464609E-06    2     2000013  -2000013   # BR(H -> ~mu_R-  ~mu_R+ )
     8.77096444E-06    2     1000015  -1000015   # BR(H -> ~tau_1- ~tau_1+)
     1.73169289E-06    2     2000015  -2000015   # BR(H -> ~tau_2- ~tau_2+)
     6.00859087E-04    2     1000015  -2000015   # BR(H -> ~tau_1- ~tau_2+)
     6.00859087E-04    2     2000015  -1000015   # BR(H -> ~tau_2- ~tau_1+)
     1.62120485E-05    2     1000012  -1000012   # BR(H -> ~nu_eL  ~nu_eL*   )
     1.62120485E-05    2     1000014  -1000014   # BR(H -> ~nu_muL ~nu_muL*  )
     2.17999958E-05    2     1000016  -1000016   # BR(H -> ~nu_tauL ~nu_tauL*)
#
#         PDG            Width
DECAY        36     4.30252495E+01   # A decays
#          BR         NDA      ID1       ID2
     2.03915207E-02    2           5        -5   # BR(A -> b       bb     )
     4.31821421E-03    2         -15        15   # BR(A -> tau+    tau-   )
     1.51321937E-05    2         -13        13   # BR(A -> mu+     mu-    )
     8.82337465E-06    2           3        -3   # BR(A -> s       sb     )
     1.48687656E-06    2           4        -4   # BR(A -> c       cb     )
     1.46129128E-01    2           6        -6   # BR(A -> t       tb     )
     9.08915432E-05    2          21        21   # BR(A -> g       g      )
     1.30251411E-07    2          22        22   # BR(A -> gam     gam    )
     1.27282888E-07    2          23        22   # BR(A -> Z       gam    )
     4.53826554E-05    2          23        25   # BR(A -> Z       h      )
     4.80725592E-03    2     1000024  -1000024   # BR(A -> ~chi_1+ ~chi_1-)
     1.87248733E-04    2     1000037  -1000037   # BR(A -> ~chi_2+ ~chi_2-)
     2.72548516E-01    2     1000024  -1000037   # BR(A -> ~chi_1+ ~chi_2-)
     2.72548516E-01    2     1000037  -1000024   # BR(A -> ~chi_2+ ~chi_1-)
     2.40364452E-03    2     1000022   1000022   # BR(A -> ~chi_10 ~chi_10)
     2.87830643E-04    2     1000023   1000023   # BR(A -> ~chi_20 ~chi_20)
     3.86077389E-04    2     1000025   1000025   # BR(A -> ~chi_30 ~chi_30)
     8.76467994E-02    2     1000022   1000023   # BR(A -> ~chi_10 ~chi_20)
     1.83712735E-01    2     1000022   1000025   # BR(A -> ~chi_10 ~chi_30)
     2.55656971E-06    2     1000022   1000035   # BR(A -> ~chi_10 ~chi_40)
     3.76036604E-04    2     1000023   1000025   # BR(A -> ~chi_20 ~chi_30)
     1.44452112E-03    2     1000005  -2000005   # BR(A -> ~b_1    ~b_2*  )
     1.44452112E-03    2    -1000005   2000005   # BR(A -> ~b_1*   ~b_2   )
     6.01452428E-04    2     1000015  -2000015   # BR(A -> ~tau_1- ~tau_2+)
     6.01452428E-04    2    -1000015   2000015   # BR(A -> ~tau_1+ ~tau_2-)
#
#         PDG            Width
DECAY        37     4.31856319E+01   # H+ decays
#          BR         NDA      ID1       ID2
     3.33951544E-05    2           4        -5   # BR(H+ -> c       bb     )
     4.30360231E-03    2         -15        16   # BR(H+ -> tau+    nu_tau )
     1.50809896E-05    2         -13        14   # BR(H+ -> mu+     nu_mu  )
     3.33927400E-07    2           2        -5   # BR(H+ -> u       bb     )
     4.39234561E-07    2           2        -3   # BR(H+ -> u       sb     )
     1.00666632E-05    2           4        -3   # BR(H+ -> c       sb     )
     1.63116553E-01    2           6        -5   # BR(H+ -> t       bb     )
     4.52771548E-05    2          24        25   # BR(H+ -> W+      h      )
     9.01143583E-14    2          24        36   # BR(H+ -> W+      A      )
     8.49455237E-11    2     1000024   1000022   # BR(H+ -> ~chi_1+ ~chi_10)
     2.72838146E-01    2     1000024   1000023   # BR(H+ -> ~chi_1+ ~chi_20)
     2.73504075E-01    2     1000024   1000025   # BR(H+ -> ~chi_1+ ~chi_30)
     1.64890426E-05    2     1000024   1000035   # BR(H+ -> ~chi_1+ ~chi_40)
     2.74387751E-01    2     1000037   1000022   # BR(H+ -> ~chi_2+ ~chi_10)
     4.37395830E-04    2     1000037   1000023   # BR(H+ -> ~chi_2+ ~chi_20)
     1.51142026E-04    2     1000037   1000025   # BR(H+ -> ~chi_2+ ~chi_30)
     1.94628635E-05    2    -1000011   1000012   # BR(H+ -> ~e_L+   ~nu_eL )
     1.94628635E-05    2    -1000013   1000014   # BR(H+ -> ~mu_L+  ~nu_muL)
     2.89463678E-05    2    -1000015   1000016   # BR(H+ -> ~tau_1+ ~nu_tauL)
     1.19630011E-03    2    -2000015   1000016   # BR(H+ -> ~tau_2+ ~nu_tauL)
     9.87608098E-03    2     1000006  -1000005   # BR(H+ -> ~t_1    ~b_1*  )
