#
#                              ======================
#                              | THE SUSYHIT OUTPUT |
#                              ======================
#
#
#              ------------------------------------------------------
#              |     This is the output of the SUSY-HIT package     |
#              |  created by A.Djouadi, M.Muehlleitner and M.Spira. |
#              |  In case of problems with SUSY-HIT email to        |
#              |           margarete.muehlleitner@cern.ch           |
#              |           michael.spira@psi.ch                     |
#              |           abdelhak.djouadi@cern.ch                 |
#              ------------------------------------------------------
#
#              ------------------------------------------------------
#              |  SUSY Les Houches Accord - MSSM Spectrum + Decays  |
#              |              based on the decay programs           |
#              |                                                    |
#              |                     SDECAY 1.3b                    |
#              |                                                    |
#              |  Authors: M.Muhlleitner, A.Djouadi and Y.Mambrini  |
#              |  Ref.:    Comput.Phys.Commun.168(2005)46           |
#              |           [hep-ph/0311167]                         |
#              |                                                    |
#              |                     HDECAY 3.4                     |
#              |                                                    |
#              |  By: A.Djouadi,J.Kalinowski,M.Muhlleitner,M.Spira  |
#              |  Ref.:    Comput.Phys.Commun.108(1998)56           |
#              |           [hep-ph/9704448]                         |
#              |                                                    |
#              |                                                    |
#              |  If not stated otherwise all DRbar couplings and   |
#              |  soft SUSY breaking masses are given at the scale  |
#              |  Q=  0.22729480E+04
#              |                                                    |
#              ------------------------------------------------------
#
#
BLOCK DCINFO  # Decay Program information
     1   SDECAY/HDECAY # decay calculator
     2   1.3b  /3.4    # version number
#
BLOCK SPINFO  # Spectrum calculator information
     1     SOFTSUSY    # spectrum calculator               
     2     3.4.0       # version number                    
#
BLOCK MODSEL  # Model selection
     1     0   #  nonUniversal                                     
#
BLOCK SMINPUTS  # Standard Model inputs
         1     1.27908970E+02   # alpha_em^-1(M_Z)^MSbar
         2     1.16637870E-05   # G_F [GeV^-2]
         3     1.18400000E-01   # alpha_S(M_Z)^MSbar
         4     9.11876000E+01   # M_Z pole mass
         5     4.18000000E+00   # mb(mb)^MSbar
         6     1.73200000E+02   # mt pole mass
         7     1.77700000E+00   # mtau pole mass
#
BLOCK MINPAR  # Input parameters - minimal models
         3     4.54200000E+01   # tanb                
#
BLOCK EXTPAR  # Input parameters - non-minimal models
         0    -1.00000000E+00   # Set                 
         1     1.42602000E+03   # M_1(MX)             
         2    -2.28019000E+03   # M_2(MX)             
         3     2.18854000E+03   # M_3(MX)             
        11     2.62683000E+03   # At(MX)              
        12     2.28741000E+03   # Ab(MX)              
        13    -3.96079000E+03   # Atau(MX)            
        23     1.65850000E+02   # mu(MX)              
        26     2.59116000E+03   # mA(pole)            
        31     2.70739000E+03   # meL(MX)             
        32     2.70739000E+03   # mmuL(MX)            
        33     2.08270000E+02   # mtauL(MX)           
        34     2.44600000E+02   # meR(MX)             
        35     2.44600000E+02   # mmuR(MX)            
        36     2.34007000E+03   # mtauR(MX)           
        41     3.61585000E+03   # mqL1(MX)            
        42     3.61585000E+03   # mqL2(MX)            
        43     2.39175000E+03   # mqL3(MX)            
        44     3.25539000E+03   # muR(MX)             
        45     3.25539000E+03   # mcR(MX)             
        46     2.15786000E+03   # mtR(MX)             
        47     3.32431000E+03   # mdR(MX)             
        48     3.32431000E+03   # msR(MX)             
        49     3.80000000E+02   # mbR(MX)             
#
BLOCK MASS  # Mass Spectrum
# PDG code           mass       particle
        24     8.04041992E+01   # W+
        25     1.24492257E+02   # h
        35     2.59116395E+03   # H
        36     2.59116000E+03   # A
        37     2.59280771E+03   # H+
         5     4.81876030E+00   # b-quark pole mass calculated from mb(mb)_Msbar
   1000001     3.66889231E+03   # ~d_L
   2000001     3.37240407E+03   # ~d_R
   1000002     3.66816725E+03   # ~u_L
   2000002     3.30302716E+03   # ~u_R
   1000003     3.66889231E+03   # ~s_L
   2000003     3.37240407E+03   # ~s_R
   1000004     3.66816725E+03   # ~c_L
   2000004     3.30302716E+03   # ~c_R
   1000005     5.54629683E+02   # ~b_1
   2000005     2.43978572E+03   # ~b_2
   1000006     2.16842309E+03   # ~t_1
   2000006     2.46218036E+03   # ~t_2
   1000011     2.72063687E+03   # ~e_L
   2000011     3.01357631E+02   # ~e_R
   1000012     2.71915062E+03   # ~nu_eL
   1000013     2.72063687E+03   # ~mu_L
   2000013     3.01357631E+02   # ~mu_R
   1000014     2.71915062E+03   # ~nu_muL
   1000015     2.70166584E+02   # ~tau_1
   2000015     2.32971930E+03   # ~tau_2
   1000016     2.58300781E+02   # ~nu_tauL
   1000021     2.38942538E+03   # ~g
   1000022    -1.72925804E+02   # ~chi_10
   1000023     1.74420841E+02   # ~chi_20
   1000025     1.41315028E+03   # ~chi_30
   1000035    -2.32039580E+03   # ~chi_40
   1000024     1.74058739E+02   # ~chi_1+
   1000037     2.32056747E+03   # ~chi_2+
#
BLOCK NMIX  # Neutralino Mixing Matrix
  1  1    -1.91961465E-02   # N_11
  1  2    -2.55155378E-02   # N_12
  1  3     7.08651527E-01   # N_13
  1  4     7.04835782E-01   # N_14
  2  1    -2.58419461E-02   # N_21
  2  2    -2.31135158E-02   # N_22
  2  3    -7.05541231E-01   # N_23
  2  4     7.07820267E-01   # N_24
  3  1     9.99481634E-01   # N_31
  3  2    -6.81287504E-04   # N_32
  3  3    -4.63086027E-03   # N_33
  3  4     3.18520700E-02   # N_34
  4  1    -4.06404899E-04   # N_41
  4  2     9.99406953E-01   # N_42
  4  3     1.77198235E-03   # N_43
  4  4     3.43865722E-02   # N_44
#
BLOCK UMIX  # Chargino Mixing Matrix U
  1  1    -2.51031839E-03   # U_11
  1  2     9.99996849E-01   # U_12
  2  1    -9.99996849E-01   # U_21
  2  2    -2.51031839E-03   # U_22
#
BLOCK VMIX  # Chargino Mixing Matrix V
  1  1     4.86560609E-02   # V_11
  1  2     9.98815592E-01   # V_12
  2  1     9.98815592E-01   # V_21
  2  2    -4.86560609E-02   # V_22
#
BLOCK STOPMIX  # Stop Mixing Matrix
  1  1    -2.64935963E-01   # cos(theta_t)
  1  2     9.64266009E-01   # sin(theta_t)
  2  1    -9.64266009E-01   # -sin(theta_t)
  2  2    -2.64935963E-01   # cos(theta_t)
#
BLOCK SBOTMIX  # Sbottom Mixing Matrix
  1  1     1.97438206E-03   # cos(theta_b)
  1  2     9.99998051E-01   # sin(theta_b)
  2  1    -9.99998051E-01   # -sin(theta_b)
  2  2     1.97438206E-03   # cos(theta_b)
#
BLOCK STAUMIX  # Stau Mixing Matrix
  1  1     9.99993825E-01   # cos(theta_tau)
  1  2     3.51425125E-03   # sin(theta_tau)
  2  1    -3.51425125E-03   # -sin(theta_tau)
  2  2     9.99993825E-01   # cos(theta_tau)
#
BLOCK ALPHA  # Higgs mixing
          -2.25448194E-02   # Mixing angle in the neutral Higgs boson sector
#
BLOCK HMIX Q=  2.27294800E+03  # DRbar Higgs Parameters
         1     1.69413264E+02   # mu(Q)MSSM           
         2     4.45093782E+01   # tan                 
         3     2.43060443E+02   # higgs               
         4     6.71488301E+06   # mA^2(Q)MSSM         
#
BLOCK GAUGE Q=  2.27294800E+03  # The gauge couplings
     1     3.64818983E-01   # gprime(Q) DRbar
     2     6.38330726E-01   # g(Q) DRbar
     3     1.02038030E+00   # g3(Q) DRbar
#
BLOCK AU Q=  2.27294800E+03  # The trilinear couplings
  1  1     0.00000000E+00   # A_u(Q) DRbar
  2  2     0.00000000E+00   # A_c(Q) DRbar
  3  3     2.62683001E+03   # A_t(Q) DRbar
#
BLOCK AD Q=  2.27294800E+03  # The trilinear couplings
  1  1     0.00000000E+00   # A_d(Q) DRbar
  2  2     0.00000000E+00   # A_s(Q) DRbar
  3  3     2.28741001E+03   # A_b(Q) DRbar
#
BLOCK AE Q=  2.27294800E+03  # The trilinear couplings
  1  1     0.00000000E+00   # A_e(Q) DRbar
  2  2     0.00000000E+00   # A_mu(Q) DRbar
  3  3    -3.96079000E+03   # A_tau(Q) DRbar
#
BLOCK Yu Q=  2.27294800E+03  # The Yukawa couplings
  1  1     0.00000000E+00   # y_u(Q) DRbar
  2  2     0.00000000E+00   # y_c(Q) DRbar
  3  3     8.44466917E-01   # y_t(Q) DRbar
#
BLOCK Yd Q=  2.27294800E+03  # The Yukawa couplings
  1  1     0.00000000E+00   # y_d(Q) DRbar
  2  2     0.00000000E+00   # y_s(Q) DRbar
  3  3     5.78854184E-01   # y_b(Q) DRbar
#
BLOCK Ye Q=  2.27294800E+03  # The Yukawa couplings
  1  1     0.00000000E+00   # y_e(Q) DRbar
  2  2     0.00000000E+00   # y_mu(Q) DRbar
  3  3     4.30374553E-01   # y_tau(Q) DRbar
#
BLOCK MSOFT Q=  2.27294800E+03  # The soft SUSY breaking masses at the scale Q
         1     1.42602000E+03   # M_1(Q)              
         2    -2.28019000E+03   # M_2(Q)              
         3     2.18854000E+03   # M_3(Q)              
        21     6.85124384E+06   # mH1^2(Q)            
        22     5.41023020E+04   # mH2^2(Q)            
        31     2.70739000E+03   # meL(Q)              
        32     2.70739000E+03   # mmuL(Q)             
        33     2.08270002E+02   # mtauL(Q)            
        34     2.44600000E+02   # meR(Q)              
        35     2.44600000E+02   # mmuR(Q)             
        36     2.34007000E+03   # mtauR(Q)            
        41     3.61585000E+03   # mqL1(Q)             
        42     3.61585000E+03   # mqL2(Q)             
        43     2.39175000E+03   # mqL3(Q)             
        44     3.25539000E+03   # muR(Q)              
        45     3.25539000E+03   # mcR(Q)              
        46     2.15785999E+03   # mtR(Q)              
        47     3.32431000E+03   # mdR(Q)              
        48     3.32431000E+03   # msR(Q)              
        49     3.79999977E+02   # mbR(Q)              
#
Block HiggsBoundsInputHiggsCouplingsFermions
# ScalarNormEffCoupSq PseudoSNormEffCoupSq NP   IP1 IP2 IP2
    1.00726133E+00    0.00000000E+00        3  25   5   5  # h0-b-b eff. coupling^2, normalised to SM
    1.98107749E+03    0.00000000E+00        3  35   5   5  # H0-b-b eff. coupling^2, normalised to SM
    0.00000000E+00    1.98108475E+03        3  36   5   5  # A0-b-b eff. coupling^2, normalised to SM
#
    9.99996335E-01    0.00000000E+00        3  25   6   6  # h0-t-t eff. coupling^2, normalised to SM
    5.08439293E-04    0.00000000E+00        3  35   6   6  # H0-t-t eff. coupling^2, normalised to SM
    0.00000000E+00    5.04773963E-04        3  36   6   6  # A0-t-t eff. coupling^2, normalised to SM
#
    1.00726133E+00    0.00000000E+00        3  25  15  15  # h0-tau-tau eff. coupling^2, normalised to SM
    1.98107749E+03    0.00000000E+00        3  35  15  15  # H0-tau-tau eff. coupling^2, normalised to SM
    0.00000000E+00    1.98108475E+03        3  36  15  15  # A0-tau-tau eff. coupling^2, normalised to SM
#
Block HiggsBoundsInputHiggsCouplingsBosons
    9.99999993E-01        3  25  24  24  # h0-W-W eff. coupling^2, normalised to SM
    6.62975274E-09        3  35  24  24  # H0-W-W eff. coupling^2, normalised to SM
    0.00000000E+00        3  36  24  24  # A0-W-W eff. coupling^2, normalised to SM
#
    9.99999993E-01        3  25  23  23  # h0-Z-Z eff. coupling^2, normalised to SM
    6.62975274E-09        3  35  23  23  # H0-Z-Z eff. coupling^2, normalised to SM
    0.00000000E+00        3  36  23  23  # A0-Z-Z eff. coupling^2, normalised to SM
#
    8.93783265E-01        3  25  21  21  # h0-g-g eff. coupling^2, normalised to SM
    1.00082843E-11        3  35  21  21  # H0-g-g eff. coupling^2, normalised to SM
    2.65674723E-11        3  36  21  21  # A0-g-g eff. coupling^2, normalised to SM
#
    0.00000000E+00        3  25  25  23  # h0-h0-Z eff. coupling^2, normalised to SM
    0.00000000E+00        3  35  25  23  # H0-h0-Z eff. coupling^2, normalised to SM
    6.62975274E-09        3  36  25  23  # A0-h0-Z eff. coupling^2, normalised to SM
    0.00000000E+00        3  35  35  23  # H0-H0-Z eff. coupling^2, normalised to SM
    9.99999993E-01        3  36  35  23  # A0-H0-Z eff. coupling^2, normalised to SM
    0.00000000E+00        3  36  36  23  # A0-A0-Z eff. coupling^2, normalised to SM
#
    0.00000000E+00        4  25  21  21  23  # h0-g-g-Z eff. coupling^2, normalised to SM
    0.00000000E+00        4  35  21  21  23  # H0-g-g-Z eff. coupling^2, normalised to SM
    0.00000000E+00        4  36  21  21  23  # A0-g-g-Z eff. coupling^2, normalised to SM
#
#
#
#                             =================
#                             |The decay table|
#                             =================
#
# - The QCD corrections to the decays gluino -> squark  + quark
#                                     squark -> gaugino + quark_prime
#                                     squark -> squark_prime + Higgs
#                                     squark -> gluino  + quark
#   are included.
#
# - The multi-body decays for the inos, stops and sbottoms are included.
#
# - The loop induced decays for the gluino, neutralinos and stops
#   are included.
#
# - The SUSY decays of the top quark are included.
#
#
#         PDG            Width
DECAY         6     1.43439845E+00   # top decays
#          BR         NDA      ID1       ID2
     1.00000000E+00    2           5        24   # BR(t ->  b    W+)
#
#         PDG            Width
DECAY   1000021     4.50878829E+01   # gluino decays
#          BR         NDA      ID1       ID2
     4.84559446E-01    2     1000005        -5   # BR(~g -> ~b_1  bb)
     4.84559446E-01    2    -1000005         5   # BR(~g -> ~b_1* b )
     1.54405540E-02    2     1000006        -6   # BR(~g -> ~t_1  tb)
     1.54405540E-02    2    -1000006         6   # BR(~g -> ~t_1* t )
#
#         PDG            Width
DECAY   1000006     6.13806581E+01   # stop1 decays
#          BR         NDA      ID1       ID2
     2.42526263E-01    2     1000022         6   # BR(~t_1 -> ~chi_10 t )
     2.47065425E-01    2     1000023         6   # BR(~t_1 -> ~chi_20 t )
     2.57348843E-02    2     1000025         6   # BR(~t_1 -> ~chi_30 t )
     4.84650284E-01    2     1000024         5   # BR(~t_1 -> ~chi_1+ b )
     2.31440554E-05    2     1000005        24   # BR(~t_1 -> ~b_1    W+)
#
#         PDG            Width
DECAY   2000006     5.75538503E+01   # stop2 decays
#          BR         NDA      ID1       ID2
     2.95437914E-01    2     1000022         6   # BR(~t_2 -> ~chi_10 t )
     2.95781901E-01    2     1000023         6   # BR(~t_2 -> ~chi_20 t )
     5.13100908E-03    2     1000025         6   # BR(~t_2 -> ~chi_30 t )
     2.94015806E-01    2     1000024         5   # BR(~t_2 -> ~chi_1+ b )
     4.15555370E-03    2     1000037         5   # BR(~t_2 -> ~chi_2+ b )
     5.18990166E-02    2     1000006        25   # BR(~t_2 -> ~t_1    h )
     5.30765639E-02    2     1000006        23   # BR(~t_2 -> ~t_1    Z )
     5.02235197E-04    2     1000005        24   # BR(~t_2 -> ~b_1    W+)
#
#         PDG            Width
DECAY   1000005     5.32159080E+00   # sbottom1 decays
#          BR         NDA      ID1       ID2
     2.84323004E-01    2     1000022         5   # BR(~b_1 -> ~chi_10 b )
     2.80743239E-01    2     1000023         5   # BR(~b_1 -> ~chi_20 b )
     4.34933757E-01    2    -1000024         6   # BR(~b_1 -> ~chi_1- t )
#
#         PDG            Width
DECAY   2000005     5.56069827E+01   # sbottom2 decays
#          BR         NDA      ID1       ID2
     1.45481429E-01    2     1000022         5   # BR(~b_2 -> ~chi_10 b )
     1.44171148E-01    2     1000023         5   # BR(~b_2 -> ~chi_20 b )
     2.87194861E-03    2     1000025         5   # BR(~b_2 -> ~chi_30 b )
     1.61769393E-03    2     1000035         5   # BR(~b_2 -> ~chi_40 b )
     6.08437927E-01    2    -1000024         6   # BR(~b_2 -> ~chi_1- t )
     4.02500938E-03    2     1000021         5   # BR(~b_2 -> ~g      b )
     3.21756719E-04    2     1000005        25   # BR(~b_2 -> ~b_1    h )
     2.79360908E-04    2     1000005        23   # BR(~b_2 -> ~b_1    Z )
     9.27937268E-02    2     1000006       -24   # BR(~b_2 -> ~t_1    W-)
#
#         PDG            Width
DECAY   1000002     1.00706196E+02   # sup_L decays
#          BR         NDA      ID1       ID2
     1.19769844E-04    2     1000022         2   # BR(~u_L -> ~chi_10 u)
     1.10616414E-04    2     1000023         2   # BR(~u_L -> ~chi_20 u)
     3.71210729E-03    2     1000025         2   # BR(~u_L -> ~chi_30 u)
     5.14793279E-02    2     1000035         2   # BR(~u_L -> ~chi_40 u)
     6.66316502E-04    2     1000024         1   # BR(~u_L -> ~chi_1+ d)
     1.02832720E-01    2     1000037         1   # BR(~u_L -> ~chi_2+ d)
     8.41079142E-01    2     1000021         2   # BR(~u_L -> ~g      u)
#
#         PDG            Width
DECAY   2000002     5.72857223E+01   # sup_R decays
#          BR         NDA      ID1       ID2
     4.74687988E-05    2     1000022         2   # BR(~u_R -> ~chi_10 u)
     8.60188676E-05    2     1000023         2   # BR(~u_R -> ~chi_20 u)
     8.70059827E-02    2     1000025         2   # BR(~u_R -> ~chi_30 u)
     5.59498721E-09    2     1000035         2   # BR(~u_R -> ~chi_40 u)
     9.12860524E-01    2     1000021         2   # BR(~u_R -> ~g      u)
#
#         PDG            Width
DECAY   1000001     1.00736511E+02   # sdown_L decays
#          BR         NDA      ID1       ID2
     6.72357062E-05    2     1000022         1   # BR(~d_L -> ~chi_10 d)
     4.65601924E-05    2     1000023         1   # BR(~d_L -> ~chi_20 d)
     3.76575916E-03    2     1000025         1   # BR(~d_L -> ~chi_30 d)
     5.15169454E-02    2     1000035         1   # BR(~d_L -> ~chi_40 d)
     1.77346538E-06    2    -1000024         2   # BR(~d_L -> ~chi_1- u)
     1.03119470E-01    2    -1000037         2   # BR(~d_L -> ~chi_2- u)
     8.41482256E-01    2     1000021         1   # BR(~d_L -> ~g      d)
#
#         PDG            Width
DECAY   2000001     5.95705588E+01   # sdown_R decays
#          BR         NDA      ID1       ID2
     1.16617447E-05    2     1000022         1   # BR(~d_R -> ~chi_10 d)
     2.11324843E-05    2     1000023         1   # BR(~d_R -> ~chi_20 d)
     2.17550399E-02    2     1000025         1   # BR(~d_R -> ~chi_30 d)
     1.48338916E-09    2     1000035         1   # BR(~d_R -> ~chi_40 d)
     9.78212164E-01    2     1000021         1   # BR(~d_R -> ~g      d)
#
#         PDG            Width
DECAY   1000004     8.36458577E+01   # scharm_L decays
#          BR         NDA      ID1       ID2
     1.50595494E-04    2     1000022         4   # BR(~c_L -> ~chi_10 c)
     1.39084970E-04    2     1000023         4   # BR(~c_L -> ~chi_20 c)
     4.63990360E-03    2     1000025         4   # BR(~c_L -> ~chi_30 c)
     6.38696539E-02    2     1000035         4   # BR(~c_L -> ~chi_40 c)
     8.37803725E-04    2     1000024         3   # BR(~c_L -> ~chi_1+ s)
     1.27582888E-01    2     1000037         3   # BR(~c_L -> ~chi_2+ s)
     8.02780070E-01    2     1000021         4   # BR(~c_L -> ~g      c)
#
#         PDG            Width
DECAY   2000004     4.66482198E+01   # scharm_R decays
#          BR         NDA      ID1       ID2
     6.10736058E-05    2     1000022         4   # BR(~c_R -> ~chi_10 c)
     1.10671150E-04    2     1000023         4   # BR(~c_R -> ~chi_20 c)
     1.11111170E-01    2     1000025         4   # BR(~c_R -> ~chi_30 c)
     7.06091502E-09    2     1000035         4   # BR(~c_R -> ~chi_40 c)
     8.88717078E-01    2     1000021         4   # BR(~c_R -> ~g      c)
#
#         PDG            Width
DECAY   1000003     8.36604617E+01   # sstrange_L decays
#          BR         NDA      ID1       ID2
     8.45506594E-05    2     1000022         3   # BR(~s_L -> ~chi_10 s)
     5.85501384E-05    2     1000023         3   # BR(~s_L -> ~chi_20 s)
     4.70754787E-03    2     1000025         3   # BR(~s_L -> ~chi_30 s)
     6.39246827E-02    2     1000035         3   # BR(~s_L -> ~chi_40 s)
     2.23016363E-06    2    -1000024         4   # BR(~s_L -> ~chi_1- c)
     1.27955162E-01    2    -1000037         4   # BR(~s_L -> ~chi_2- c)
     8.03267276E-01    2     1000021         3   # BR(~s_L -> ~g      s)
#
#         PDG            Width
DECAY   2000003     4.75462373E+01   # sstrange_R decays
#          BR         NDA      ID1       ID2
     1.52980917E-05    2     1000022         3   # BR(~s_R -> ~chi_10 s)
     2.77216972E-05    2     1000023         3   # BR(~s_R -> ~chi_20 s)
     2.83356417E-02    2     1000025         3   # BR(~s_R -> ~chi_30 s)
     1.91137336E-09    2     1000035         3   # BR(~s_R -> ~chi_40 s)
     9.71621337E-01    2     1000021         3   # BR(~s_R -> ~g      s)
#
#         PDG            Width
DECAY   1000011     4.39968215E+00   # selectron_L decays
#          BR         NDA      ID1       ID2
     3.30970863E-03    2     1000022        11   # BR(~e_L -> ~chi_10 e-)
     3.56734988E-03    2     1000023        11   # BR(~e_L -> ~chi_20 e-)
     4.35016513E-01    2     1000025        11   # BR(~e_L -> ~chi_30 e-)
     1.85919001E-01    2     1000035        11   # BR(~e_L -> ~chi_40 e-)
     3.13304068E-05    2    -1000024        12   # BR(~e_L -> ~chi_1- nu_e)
     3.72156097E-01    2    -1000037        12   # BR(~e_L -> ~chi_2- nu_e)
#
#         PDG            Width
DECAY   2000011     7.35883778E-04   # selectron_R decays
#           BR         NDA      ID1       ID2
     3.59507979E-01    2     1000022        11   # BR(~e_R -> ~chi_10 e-)
     6.40463255E-01    2     1000023        11   # BR(~e_R -> ~chi_20 e-)
#           BR         NDA      ID1       ID2       ID3
     2.47797282E-07    3        11       -15        1000015   # BR(~e_R- -> e-  tau+  ~tau_1-)
     2.60204132E-08    3        11       15        -1000015   # BR(~e_R- -> e-  tau-  ~tau_1+)
     1.16852691E-06    3        11       -16        1000016   # BR(~e_R- -> e-  nu_taub  ~nu_tau1)
     5.09183666E-08    3        11       16        -1000016   # BR(~e_R- -> e-  nu_tau  ~nu_tau1*)
     1.55812648E-06    3        11       23        1000022   # BR(~e_R- -> e-  Z  ~chi_10)
     1.25746759E-09    3        11       25        1000022   # BR(~e_R- -> e-  h  ~chi_10)
     7.39722788E-07    3        11       23        1000023   # BR(~e_R- -> e-  Z  ~chi_20)
     6.68760496E-10    3        11       25        1000023   # BR(~e_R- -> e-  h  ~chi_20)
     1.08665257E-06    3        11       -24        1000024   # BR(~e_R- -> e-  W-  ~chi_1+)
     2.38855653E-05    3        11       24        -1000024   # BR(~e_R- -> e-  W+  ~chi_1-)
#
#         PDG            Width
DECAY   1000013     4.39968211E+00   # smuon_L decays
#          BR         NDA      ID1       ID2
     3.30970866E-03    2     1000022        13   # BR(~mu_L -> ~chi_10 mu-)
     3.56734990E-03    2     1000023        13   # BR(~mu_L -> ~chi_20 mu-)
     4.35016515E-01    2     1000025        13   # BR(~mu_L -> ~chi_30 mu-)
     1.85918995E-01    2     1000035        13   # BR(~mu_L -> ~chi_40 mu-)
     3.13304071E-05    2    -1000024        14   # BR(~mu_L -> ~chi_1- nu_mu)
     3.72156101E-01    2    -1000037        14   # BR(~mu_L -> ~chi_2- nu_mu)
#
#         PDG            Width
DECAY   2000013     7.35883397E-04   # smuon_R decays
#           BR         NDA      ID1       ID2
     3.59507968E-01    2     1000022        13   # BR(~mu_R -> ~chi_10 mu-)
     6.40463231E-01    2     1000023        13   # BR(~mu_R -> ~chi_20 mu-)
#           BR         NDA      ID1       ID2       ID3
     2.45337781E-07    3        13       -15        1000015   # BR(~mu_R- -> mu-  tau+  ~tau_1-)
     2.59375331E-08    3        13       15        -1000015   # BR(~mu_R- -> mu-  tau-  ~tau_1+)
     1.18386962E-06    3        13       -16        1000016   # BR(~mu_R- -> mu-  nu_taub  ~nu_tau1)
     5.08205514E-08    3        13       16        -1000016   # BR(~mu_R- -> mu-  nu_tau  ~nu_tau1*)
     1.55595303E-06    3        13       23        1000022   # BR(~mu_R- -> mu-  Z  ~chi_10)
     1.25485913E-09    3        13       25        1000022   # BR(~mu_R- -> mu-  h  ~chi_10)
     7.41829483E-07    3        13       23        1000023   # BR(~mu_R- -> mu-  Z  ~chi_20)
     6.73938292E-10    3        13       25        1000023   # BR(~mu_R- -> mu-  h  ~chi_20)
     1.08692492E-06    3        13       -24        1000024   # BR(~mu_R- -> mu-  W-  ~chi_1+)
     2.39086791E-05    3        13       24        -1000024   # BR(~mu_R- -> mu-  W+  ~chi_1-)
#
#         PDG            Width
DECAY   1000015     3.44292112E-01   # stau_1 decays
#          BR         NDA      ID1       ID2
     5.08257916E-01    2     1000022        15   # BR(~tau_1 -> ~chi_10  tau-)
     4.91690264E-01    2     1000023        15   # BR(~tau_1 -> ~chi_20  tau-)
     5.18208826E-05    2    -1000024        16   # BR(~tau_1 -> ~chi_1-  nu_tau)
#
#         PDG            Width
DECAY   2000015     2.21085617E+01   # stau_2 decays
#          BR         NDA      ID1       ID2
     1.93028389E-01    2     1000022        15   # BR(~tau_2 -> ~chi_10  tau-)
     1.91513186E-01    2     1000023        15   # BR(~tau_2 -> ~chi_20  tau-)
     2.22711618E-01    2     1000025        15   # BR(~tau_2 -> ~chi_30  tau-)
     7.04616078E-10    2     1000035        15   # BR(~tau_2 -> ~chi_40  tau-)
     3.83959104E-01    2    -1000024        16   # BR(~tau_2 -> ~chi_1-  nu_tau)
     1.42382436E-09    2    -1000037        16   # BR(~tau_2 -> ~chi_2-  nu_tau)
     4.25131879E-03    2     1000016       -24   # BR(~tau_2 -> ~nu_tauL W-)
     2.35399415E-03    2     1000015        25   # BR(~tau_2 -> ~tau_1   h)
     2.18238867E-03    2     1000015        23   # BR(~tau_2 -> ~tau_1   Z)
#
#         PDG            Width
DECAY   1000012     4.41193384E+00   # snu_eL decays
#          BR         NDA      ID1       ID2
     5.24175188E-04    2     1000022        12   # BR(~nu_eL -> ~chi_10 nu_e)
     1.72502886E-04    2     1000023        12   # BR(~nu_eL -> ~chi_20 nu_e)
     4.35292959E-01    2     1000025        12   # BR(~nu_eL -> ~chi_30 nu_e)
     1.84392914E-01    2     1000035        12   # BR(~nu_eL -> ~chi_40 nu_e)
     1.17309560E-02    2     1000024        11   # BR(~nu_eL -> ~chi_1+ e-)
     3.67886492E-01    2     1000037        11   # BR(~nu_eL -> ~chi_2+ e-)
#
#         PDG            Width
DECAY   1000014     4.41193378E+00   # snu_muL decays
#          BR         NDA      ID1       ID2
     5.24175196E-04    2     1000022        14   # BR(~nu_muL -> ~chi_10 nu_mu)
     1.72502889E-04    2     1000023        14   # BR(~nu_muL -> ~chi_20 nu_mu)
     4.35292966E-01    2     1000025        14   # BR(~nu_muL -> ~chi_30 nu_mu)
     1.84392917E-01    2     1000035        14   # BR(~nu_muL -> ~chi_40 nu_mu)
     1.17309561E-02    2     1000024        13   # BR(~nu_muL -> ~chi_1+ mu-)
     3.67886483E-01    2     1000037        13   # BR(~nu_muL -> ~chi_2+ mu-)
#
#         PDG            Width
DECAY   1000016     2.85826438E-01   # snu_tauL decays
#          BR         NDA      ID1       ID2
     2.35930952E-04    2     1000022        16   # BR(~nu_tauL -> ~chi_10 nu_tau)
     7.54791921E-05    2     1000023        16   # BR(~nu_tauL -> ~chi_20 nu_tau)
     9.99688590E-01    2     1000024        15   # BR(~nu_tauL -> ~chi_1+ tau-)
#
#         PDG            Width
DECAY   1000024     1.23403155E-12   # chargino1+ decays
#           BR         NDA      ID1       ID2       ID3
     6.00000002E-01    3     1000022         2        -1   # BR(~chi_1+ -> ~chi_10 u    db)
     1.99999999E-01    3     1000022       -11        12   # BR(~chi_1+ -> ~chi_10 e+   nu_e)
     1.99999999E-01    3     1000022       -13        14   # BR(~chi_1+ -> ~chi_10 mu+  nu_mu)
#
#         PDG            Width
DECAY   1000037     3.67906845E+01   # chargino2+ decays
#          BR         NDA      ID1       ID2
     5.06019590E-04    2     1000006        -5   # BR(~chi_2+ -> ~t_1     bb)
     8.13911635E-08    2    -1000005         6   # BR(~chi_2+ -> ~b_1*    t )
     2.48767301E-01    2     1000016       -15   # BR(~chi_2+ -> ~nu_tau1 tau+)
     2.48760341E-01    2    -1000015        16   # BR(~chi_2+ -> ~tau_1+  nu_tau)
     1.27841781E-01    2     1000024        23   # BR(~chi_2+ -> ~chi_1+  Z )
     1.23542689E-01    2     1000022        24   # BR(~chi_2+ -> ~chi_10  W+)
     1.24624875E-01    2     1000023        24   # BR(~chi_2+ -> ~chi_20  W+)
     3.40283500E-05    2     1000025        24   # BR(~chi_2+ -> ~chi_30  W+)
     1.25922883E-01    2     1000024        25   # BR(~chi_2+ -> ~chi_1+  h )
#
#         PDG            Width
DECAY   1000022     0.00000000E+00   # neutralino1 decays
#
#         PDG            Width
DECAY   1000023     1.19821721E-11   # neutralino2 decays
#          BR         NDA      ID1       ID2
     5.62041868E-01    2     1000022        22   # BR(~chi_20 -> ~chi_10 gam)
#           BR         NDA      ID1       ID2       ID3
     7.31020235E-02    3     1000022        -2         2   # BR(~chi_20 -> ~chi_10 ub      u)
     9.48934276E-02    3     1000022        -1         1   # BR(~chi_20 -> ~chi_10 db      d)
     9.48934276E-02    3     1000022        -3         3   # BR(~chi_20 -> ~chi_10 sb      s)
     2.17985981E-02    3     1000022       -11        11   # BR(~chi_20 -> ~chi_10 e+      e-)
     2.17985981E-02    3     1000022       -13        13   # BR(~chi_20 -> ~chi_10 mu+     mu-)
     4.35930654E-02    3     1000022       -12        12   # BR(~chi_20 -> ~chi_10 nu_eb   nu_e)
     4.35930654E-02    3     1000022       -14        14   # BR(~chi_20 -> ~chi_10 nu_mub  nu_mu)
     4.35948725E-02    3     1000022       -16        16   # BR(~chi_20 -> ~chi_10 nu_taub nu_tau)
     2.07316133E-04    3     1000024        -2         1   # BR(~chi_20 -> ~chi_1+ ub      d)
     2.07316133E-04    3    -1000024        -1         2   # BR(~chi_20 -> ~chi_1- db      u)
     6.91053525E-05    3     1000024       -12        11   # BR(~chi_20 -> ~chi_1+ nu_eb   e-)
     6.91053525E-05    3    -1000024        12       -11   # BR(~chi_20 -> ~chi_1- nu_e    e+)
     6.91053525E-05    3     1000024       -14        13   # BR(~chi_20 -> ~chi_1+ nu_mub  mu-)
     6.91053525E-05    3    -1000024        14       -13   # BR(~chi_20 -> ~chi_1- nu_mu   mu+)
#
#         PDG            Width
DECAY   1000025     2.24709408E+01   # neutralino3 decays
#          BR         NDA      ID1       ID2
     2.56148452E-02    2     1000022        23   # BR(~chi_30 -> ~chi_10   Z )
     1.44567166E-02    2     1000023        23   # BR(~chi_30 -> ~chi_20   Z )
     3.89499095E-02    2     1000024       -24   # BR(~chi_30 -> ~chi_1+   W-)
     3.89499095E-02    2    -1000024        24   # BR(~chi_30 -> ~chi_1-   W+)
     1.47628634E-02    2     1000022        25   # BR(~chi_30 -> ~chi_10   h )
     2.67712108E-02    2     1000023        25   # BR(~chi_30 -> ~chi_20   h )
     3.96772298E-02    2     1000005        -5   # BR(~chi_30 -> ~b_1      bb)
     3.96772298E-02    2    -1000005         5   # BR(~chi_30 -> ~b_1*     b )
     1.51556622E-01    2     2000011       -11   # BR(~chi_30 -> ~e_R-     e+)
     1.51556622E-01    2    -2000011        11   # BR(~chi_30 -> ~e_R+     e-)
     1.51556622E-01    2     2000013       -13   # BR(~chi_30 -> ~mu_R-    mu+)
     1.51556622E-01    2    -2000013        13   # BR(~chi_30 -> ~mu_R+    mu-)
     3.85108946E-02    2     1000015       -15   # BR(~chi_30 -> ~tau_1-   tau+)
     3.85108946E-02    2    -1000015        15   # BR(~chi_30 -> ~tau_1+   tau-)
     3.89459037E-02    2     1000016       -16   # BR(~chi_30 -> ~nu_tau1  nu_taub)
     3.89459037E-02    2    -1000016        16   # BR(~chi_30 -> ~nu_tau1* nu_tau )
#
#         PDG            Width
DECAY   1000035     3.67710356E+01   # neutralino4 decays
#          BR         NDA      ID1       ID2
     5.70965088E-02    2     1000022        23   # BR(~chi_40 -> ~chi_10   Z )
     7.06743398E-02    2     1000023        23   # BR(~chi_40 -> ~chi_20   Z )
     3.28320969E-05    2     1000025        23   # BR(~chi_40 -> ~chi_30   Z )
     1.24413826E-01    2     1000024       -24   # BR(~chi_40 -> ~chi_1+   W-)
     1.24413826E-01    2    -1000024        24   # BR(~chi_40 -> ~chi_1-   W+)
     6.91142620E-02    2     1000022        25   # BR(~chi_40 -> ~chi_10   h )
     5.64961242E-02    2     1000023        25   # BR(~chi_40 -> ~chi_20   h )
     1.80704003E-06    2     1000025        25   # BR(~chi_40 -> ~chi_30   h )
     3.83580313E-08    2     1000005        -5   # BR(~chi_40 -> ~b_1      bb)
     3.83580313E-08    2    -1000005         5   # BR(~chi_40 -> ~b_1*     b )
     2.66737174E-08    2     2000011       -11   # BR(~chi_40 -> ~e_R-     e+)
     2.66737174E-08    2    -2000011        11   # BR(~chi_40 -> ~e_R+     e-)
     2.66737174E-08    2     2000013       -13   # BR(~chi_40 -> ~mu_R-    mu+)
     2.66737174E-08    2    -2000013        13   # BR(~chi_40 -> ~mu_R+    mu-)
     1.24233396E-01    2     1000015       -15   # BR(~chi_40 -> ~tau_1-   tau+)
     1.24233396E-01    2    -1000015        15   # BR(~chi_40 -> ~tau_1+   tau-)
     1.24644750E-01    2     1000016       -16   # BR(~chi_40 -> ~nu_tau1  nu_taub)
     1.24644750E-01    2    -1000016        16   # BR(~chi_40 -> ~nu_tau1* nu_tau )
#
#         PDG            Width
DECAY        25     4.06267330E-03   # h decays
#          BR         NDA      ID1       ID2
     6.13297847E-01    2           5        -5   # BR(h -> b       bb     )
     6.39069650E-02    2         -15        15   # BR(h -> tau+    tau-   )
     2.26163241E-04    2         -13        13   # BR(h -> mu+     mu-    )
     2.47021035E-04    2           3        -3   # BR(h -> s       sb     )
     2.12782115E-02    2           4        -4   # BR(h -> c       cb     )
     7.78126197E-02    2          21        21   # BR(h -> g       g      )
     2.25945405E-03    2          22        22   # BR(h -> gam     gam    )
     1.46951914E-03    2          22        23   # BR(h -> Z       gam    )
     1.95276303E-01    2          24       -24   # BR(h -> W+      W-     )
     2.42258967E-02    2          23        23   # BR(h -> Z       Z      )
#
#         PDG            Width
DECAY        35     6.69128440E+01   # H decays
#          BR         NDA      ID1       ID2
     7.89373812E-01    2           5        -5   # BR(H -> b       bb     )
     1.71091690E-01    2         -15        15   # BR(H -> tau+    tau-   )
     5.72395512E-04    2         -13        13   # BR(H -> mu+     mu-    )
     3.48710942E-04    2           3        -3   # BR(H -> s       sb     )
     8.24039338E-09    2           4        -4   # BR(H -> c       cb     )
     8.06697500E-04    2           6        -6   # BR(H -> t       tb     )
     2.08388931E-05    2          21        21   # BR(H -> g       g      )
     7.50955681E-09    2          22        22   # BR(H -> gam     gam    )
     1.08237923E-08    2          23        22   # BR(H -> Z       gam    )
     5.53022693E-07    2          24       -24   # BR(H -> W+      W-     )
     2.75776607E-07    2          23        23   # BR(H -> Z       Z      )
     2.15319805E-06    2          25        25   # BR(H -> h       h      )
     7.58370028E-04    2     1000024  -1000024   # BR(H -> ~chi_1+ ~chi_1-)
     4.66900070E-03    2     1000024  -1000037   # BR(H -> ~chi_1+ ~chi_2-)
     4.66900070E-03    2     1000037  -1000024   # BR(H -> ~chi_2+ ~chi_1-)
     3.90107701E-05    2     1000022   1000022   # BR(H -> ~chi_10 ~chi_10)
     1.31096828E-05    2     1000023   1000023   # BR(H -> ~chi_20 ~chi_20)
     2.32951197E-06    2     1000022   1000023   # BR(H -> ~chi_10 ~chi_20)
     1.32232807E-02    2     1000022   1000025   # BR(H -> ~chi_10 ~chi_30)
     9.72173482E-04    2     1000022   1000035   # BR(H -> ~chi_10 ~chi_40)
     9.70775044E-03    2     1000023   1000025   # BR(H -> ~chi_20 ~chi_30)
     3.71132574E-03    2     1000023   1000035   # BR(H -> ~chi_20 ~chi_40)
     8.76503740E-06    2     1000005  -1000005   # BR(H -> ~b_1    ~b_1*  )
     5.10336630E-08    2     2000011  -2000011   # BR(H -> ~e_R-   ~e_R+  )
     5.10336630E-08    2     2000013  -2000013   # BR(H -> ~mu_R-  ~mu_R+ )
     8.36828514E-06    2     1000015  -1000015   # BR(H -> ~tau_1- ~tau_1+)
     2.59600948E-07    2     1000016  -1000016   # BR(H -> ~nu_tauL ~nu_tauL*)
#
#         PDG            Width
DECAY        36     6.69154381E+01   # A decays
#          BR         NDA      ID1       ID2
     7.89359752E-01    2           5        -5   # BR(A -> b       bb     )
     1.71085723E-01    2         -15        15   # BR(A -> tau+    tau-   )
     5.72374532E-04    2         -13        13   # BR(A -> mu+     mu-    )
     3.48710653E-04    2           3        -3   # BR(A -> s       sb     )
     8.25624805E-09    2           4        -4   # BR(A -> c       cb     )
     8.10445308E-04    2           6        -6   # BR(A -> t       tb     )
     3.39507943E-05    2          21        21   # BR(A -> g       g      )
     5.76297124E-09    2          22        22   # BR(A -> gam     gam    )
     2.22650101E-08    2          23        22   # BR(A -> Z       gam    )
     5.59630863E-07    2          23        25   # BR(A -> Z       h      )
     7.68706702E-04    2     1000024  -1000024   # BR(A -> ~chi_1+ ~chi_1-)
     4.66777582E-03    2     1000024  -1000037   # BR(A -> ~chi_1+ ~chi_2-)
     4.66777582E-03    2     1000037  -1000024   # BR(A -> ~chi_2+ ~chi_1-)
     3.63145573E-05    2     1000022   1000022   # BR(A -> ~chi_10 ~chi_10)
     1.46135145E-05    2     1000023   1000023   # BR(A -> ~chi_20 ~chi_20)
     3.32872771E-06    2     1000022   1000023   # BR(A -> ~chi_10 ~chi_20)
     9.80553663E-03    2     1000022   1000025   # BR(A -> ~chi_10 ~chi_30)
     3.75673768E-03    2     1000022   1000035   # BR(A -> ~chi_10 ~chi_40)
     1.31239098E-02    2     1000023   1000025   # BR(A -> ~chi_20 ~chi_30)
     9.43748830E-04    2     1000023   1000035   # BR(A -> ~chi_20 ~chi_40)
#
#         PDG            Width
DECAY        37     6.56203671E+01   # H+ decays
#          BR         NDA      ID1       ID2
     1.29740180E-03    2           4        -5   # BR(H+ -> c       bb     )
     1.74573178E-01    2         -15        16   # BR(H+ -> tau+    nu_tau )
     5.84041961E-04    2         -13        14   # BR(H+ -> mu+     nu_mu  )
     1.29739978E-05    2           2        -5   # BR(H+ -> u       bb     )
     1.77848920E-05    2           2        -3   # BR(H+ -> u       sb     )
     3.50068707E-04    2           4        -3   # BR(H+ -> c       sb     )
     7.71057450E-01    2           6        -5   # BR(H+ -> t       bb     )
     5.72248910E-07    2          24        25   # BR(H+ -> W+      h      )
     2.43447859E-13    2          24        36   # BR(H+ -> W+      A      )
     1.82198136E-04    2     1000024   1000022   # BR(H+ -> ~chi_1+ ~chi_10)
     2.55976987E-04    2     1000024   1000023   # BR(H+ -> ~chi_1+ ~chi_20)
     2.33033046E-02    2     1000024   1000025   # BR(H+ -> ~chi_1+ ~chi_30)
     4.84643382E-03    2     1000024   1000035   # BR(H+ -> ~chi_1+ ~chi_40)
     4.89332329E-03    2     1000037   1000022   # BR(H+ -> ~chi_2+ ~chi_10)
     4.81576248E-03    2     1000037   1000023   # BR(H+ -> ~chi_2+ ~chi_20)
     5.89745741E-06    2    -1000015   1000016   # BR(H+ -> ~tau_1+ ~nu_tauL)
     1.38036315E-02    2    -2000015   1000016   # BR(H+ -> ~tau_2+ ~nu_tauL)
