#
#                              ======================
#                              | THE SUSYHIT OUTPUT |
#                              ======================
#
#
#              ------------------------------------------------------
#              |     This is the output of the SUSY-HIT package     |
#              |  created by A.Djouadi, M.Muehlleitner and M.Spira. |
#              |  In case of problems with SUSY-HIT email to        |
#              |           margarete.muehlleitner@cern.ch           |
#              |           michael.spira@psi.ch                     |
#              |           abdelhak.djouadi@cern.ch                 |
#              ------------------------------------------------------
#
#              ------------------------------------------------------
#              |  SUSY Les Houches Accord - MSSM Spectrum + Decays  |
#              |              based on the decay programs           |
#              |                                                    |
#              |                     SDECAY 1.3b                    |
#              |                                                    |
#              |  Authors: M.Muhlleitner, A.Djouadi and Y.Mambrini  |
#              |  Ref.:    Comput.Phys.Commun.168(2005)46           |
#              |           [hep-ph/0311167]                         |
#              |                                                    |
#              |                     HDECAY 3.4                     |
#              |                                                    |
#              |  By: A.Djouadi,J.Kalinowski,M.Muhlleitner,M.Spira  |
#              |  Ref.:    Comput.Phys.Commun.108(1998)56           |
#              |           [hep-ph/9704448]                         |
#              |                                                    |
#              |                                                    |
#              |  If not stated otherwise all DRbar couplings and   |
#              |  soft SUSY breaking masses are given at the scale  |
#              |  Q=  0.26887620E+04
#              |                                                    |
#              ------------------------------------------------------
#
#
BLOCK DCINFO  # Decay Program information
     1   SDECAY/HDECAY # decay calculator
     2   1.3b  /3.4    # version number
#
BLOCK SPINFO  # Spectrum calculator information
     1     SOFTSUSY    # spectrum calculator               
     2     3.4.0       # version number                    
#
BLOCK MODSEL  # Model selection
     1     0   #  nonUniversal                                     
#
BLOCK SMINPUTS  # Standard Model inputs
         1     1.27908970E+02   # alpha_em^-1(M_Z)^MSbar
         2     1.16637870E-05   # G_F [GeV^-2]
         3     1.18400000E-01   # alpha_S(M_Z)^MSbar
         4     9.11876000E+01   # M_Z pole mass
         5     4.18000000E+00   # mb(mb)^MSbar
         6     1.73200000E+02   # mt pole mass
         7     1.77700000E+00   # mtau pole mass
#
BLOCK MINPAR  # Input parameters - minimal models
         3     9.52000000E+00   # tanb                
#
BLOCK EXTPAR  # Input parameters - non-minimal models
         0    -1.00000000E+00   # Set                 
         1     3.79484000E+03   # M_1(MX)             
         2    -3.37884000E+03   # M_2(MX)             
         3     3.02062000E+03   # M_3(MX)             
        11     3.89559000E+03   # At(MX)              
        12     1.05118000E+03   # Ab(MX)              
        13    -1.73004000E+03   # Atau(MX)            
        23     2.50910000E+02   # mu(MX)              
        26     1.00452000E+03   # mA(pole)            
        31     3.93396000E+03   # meL(MX)             
        32     3.93396000E+03   # mmuL(MX)            
        33     2.62404000E+03   # mtauL(MX)           
        34     3.36154000E+03   # meR(MX)             
        35     3.36154000E+03   # mmuR(MX)            
        36     2.70604000E+03   # mtauR(MX)           
        41     6.52420000E+02   # mqL1(MX)            
        42     6.52420000E+02   # mqL2(MX)            
        43     2.06811000E+03   # mqL3(MX)            
        44     1.65939000E+03   # muR(MX)             
        45     1.65939000E+03   # mcR(MX)             
        46     3.49585000E+03   # mtR(MX)             
        47     6.99520000E+02   # mdR(MX)             
        48     6.99520000E+02   # msR(MX)             
        49     1.93114000E+03   # mbR(MX)             
#
BLOCK MASS  # Mass Spectrum
# PDG code           mass       particle
        24     8.04027180E+01   # W+
        25     1.25490603E+02   # h
        35     1.00477172E+03   # H
        36     1.00452023E+03   # A
        37     1.00801451E+03   # H+
         5     4.81876030E+00   # b-quark pole mass calculated from mb(mb)_Msbar
   1000001     8.79126141E+02   # ~d_L
   2000001     8.86525986E+02   # ~d_R
   1000002     8.75608727E+02   # ~u_L
   2000002     1.78262830E+03   # ~u_R
   1000003     8.79126141E+02   # ~s_L
   2000003     8.86525986E+02   # ~s_R
   1000004     8.75608727E+02   # ~c_L
   2000004     1.78262830E+03   # ~c_R
   1000005     2.04666293E+03   # ~b_1
   2000005     2.17625070E+03   # ~b_2
   1000006     2.17103207E+03   # ~t_1
   2000006     3.51074235E+03   # ~t_2
   1000011     3.95128807E+03   # ~e_L
   2000011     3.37214660E+03   # ~e_R
   1000012     3.95019266E+03   # ~nu_eL
   1000013     3.95128807E+03   # ~mu_L
   2000013     3.37214660E+03   # ~mu_R
   1000014     3.95019266E+03   # ~nu_muL
   1000015     2.64788967E+03   # ~tau_1
   2000015     2.71703951E+03   # ~tau_2
   1000016     2.64644608E+03   # ~nu_tauL
   1000021     3.04545784E+03   # ~g
   1000022    -2.62428158E+02   # ~chi_10
   1000023     2.63981089E+02   # ~chi_20
   1000025    -3.34708848E+03   # ~chi_30
   1000035     3.75127032E+03   # ~chi_40
   1000024     2.63711220E+02   # ~chi_1+
   1000037     3.34725418E+03   # ~chi_2+
#
BLOCK NMIX  # Neutralino Mixing Matrix
  1  1    -6.70218612E-03   # N_11
  1  2    -1.61691167E-02   # N_12
  1  3     7.08154580E-01   # N_13
  1  4     7.05840443E-01   # N_14
  2  1    -9.66680930E-03   # N_21
  2  2    -1.72356556E-02   # N_22
  2  3    -7.06053999E-01   # N_23
  2  4     7.07882219E-01   # N_24
  3  1    -1.41688386E-04   # N_31
  3  2     9.99720698E-01   # N_32
  3  3    -7.19547776E-04   # N_33
  3  4     2.36217721E-02   # N_34
  4  1     9.99930804E-01   # N_41
  4  2    -1.33342640E-04   # N_42
  4  3    -2.07935140E-03   # N_43
  4  4     1.15777845E-02   # N_44
#
BLOCK UMIX  # Chargino Mixing Matrix U
  1  1     1.01383218E-03   # U_11
  1  2     9.99999486E-01   # U_12
  2  1    -9.99999486E-01   # U_21
  2  2     1.01383218E-03   # U_22
#
BLOCK VMIX  # Chargino Mixing Matrix V
  1  1     3.34164034E-02   # V_11
  1  2     9.99441516E-01   # V_12
  2  1     9.99441516E-01   # V_21
  2  2    -3.34164034E-02   # V_22
#
BLOCK STOPMIX  # Stop Mixing Matrix
  1  1     9.97507891E-01   # cos(theta_t)
  1  2    -7.05549955E-02   # sin(theta_t)
  2  1     7.05549955E-02   # -sin(theta_t)
  2  2     9.97507891E-01   # cos(theta_t)
#
BLOCK SBOTMIX  # Sbottom Mixing Matrix
  1  1     5.78664596E-03   # cos(theta_b)
  1  2     9.99983257E-01   # sin(theta_b)
  2  1    -9.99983257E-01   # -sin(theta_b)
  2  2     5.78664596E-03   # cos(theta_b)
#
BLOCK STAUMIX  # Stau Mixing Matrix
  1  1     9.99816210E-01   # cos(theta_tau)
  1  2     1.91714950E-02   # sin(theta_tau)
  2  1    -1.91714950E-02   # -sin(theta_tau)
  2  2     9.99816210E-01   # cos(theta_tau)
#
BLOCK ALPHA  # Higgs mixing
          -1.12416978E-01   # Mixing angle in the neutral Higgs boson sector
#
BLOCK HMIX Q=  2.68876200E+03  # DRbar Higgs Parameters
         1     2.54739735E+02   # mu(Q)MSSM           
         2     9.07161653E+00   # tan                 
         3     2.43145665E+02   # higgs               
         4     9.32838077E+05   # mA^2(Q)MSSM         
#
BLOCK GAUGE Q=  2.68876200E+03  # The gauge couplings
     1     3.64844956E-01   # gprime(Q) DRbar
     2     6.37932360E-01   # g(Q) DRbar
     3     1.01667644E+00   # g3(Q) DRbar
#
BLOCK AU Q=  2.68876200E+03  # The trilinear couplings
  1  1     0.00000000E+00   # A_u(Q) DRbar
  2  2     0.00000000E+00   # A_c(Q) DRbar
  3  3     3.89559001E+03   # A_t(Q) DRbar
#
BLOCK AD Q=  2.68876200E+03  # The trilinear couplings
  1  1     0.00000000E+00   # A_d(Q) DRbar
  2  2     0.00000000E+00   # A_s(Q) DRbar
  3  3     1.05118000E+03   # A_b(Q) DRbar
#
BLOCK AE Q=  2.68876200E+03  # The trilinear couplings
  1  1     0.00000000E+00   # A_e(Q) DRbar
  2  2     0.00000000E+00   # A_mu(Q) DRbar
  3  3    -1.73004000E+03   # A_tau(Q) DRbar
#
BLOCK Yu Q=  2.68876200E+03  # The Yukawa couplings
  1  1     0.00000000E+00   # y_u(Q) DRbar
  2  2     0.00000000E+00   # y_c(Q) DRbar
  3  3     8.41423273E-01   # y_t(Q) DRbar
#
BLOCK Yd Q=  2.68876200E+03  # The Yukawa couplings
  1  1     0.00000000E+00   # y_d(Q) DRbar
  2  2     0.00000000E+00   # y_s(Q) DRbar
  3  3     1.22325541E-01   # y_b(Q) DRbar
#
BLOCK Ye Q=  2.68876200E+03  # The Yukawa couplings
  1  1     0.00000000E+00   # y_e(Q) DRbar
  2  2     0.00000000E+00   # y_mu(Q) DRbar
  3  3     9.28416198E-02   # y_tau(Q) DRbar
#
BLOCK MSOFT Q=  2.68876200E+03  # The soft SUSY breaking masses at the scale Q
         1     3.79484000E+03   # M_1(Q)              
         2    -3.37884000E+03   # M_2(Q)              
         3     3.02062000E+03   # M_3(Q)              
        21     8.75601276E+05   # mH1^2(Q)            
        22     2.53099263E+04   # mH2^2(Q)            
        31     3.93396000E+03   # meL(Q)              
        32     3.93396000E+03   # mmuL(Q)             
        33     2.62404000E+03   # mtauL(Q)            
        34     3.36154000E+03   # meR(Q)              
        35     3.36154000E+03   # mmuR(Q)             
        36     2.70604000E+03   # mtauR(Q)            
        41     6.52419964E+02   # mqL1(Q)             
        42     6.52419964E+02   # mqL2(Q)             
        43     2.06810999E+03   # mqL3(Q)             
        44     1.65938999E+03   # muR(Q)              
        45     1.65938999E+03   # mcR(Q)              
        46     3.49584999E+03   # mtR(Q)              
        47     6.99519967E+02   # mdR(Q)              
        48     6.99519967E+02   # msR(Q)              
        49     1.93113999E+03   # mbR(Q)              
#
Block HiggsBoundsInputHiggsCouplingsFermions
# ScalarNormEffCoupSq PseudoSNormEffCoupSq NP   IP1 IP2 IP2
    1.04821040E+00    0.00000000E+00        3  25   5   5  # h0-b-b eff. coupling^2, normalised to SM
    8.22460161E+01    0.00000000E+00        3  35   5   5  # H0-b-b eff. coupling^2, normalised to SM
    0.00000000E+00    8.22942265E+01        3  36   5   5  # A0-b-b eff. coupling^2, normalised to SM
#
    9.99414170E-01    0.00000000E+00        3  25   6   6  # h0-t-t eff. coupling^2, normalised to SM
    1.27373504E-02    0.00000000E+00        3  35   6   6  # H0-t-t eff. coupling^2, normalised to SM
    0.00000000E+00    1.21515207E-02        3  36   6   6  # A0-t-t eff. coupling^2, normalised to SM
#
    1.04821040E+00    0.00000000E+00        3  25  15  15  # h0-tau-tau eff. coupling^2, normalised to SM
    8.22460161E+01    0.00000000E+00        3  35  15  15  # H0-tau-tau eff. coupling^2, normalised to SM
    0.00000000E+00    8.22942265E+01        3  36  15  15  # A0-tau-tau eff. coupling^2, normalised to SM
#
Block HiggsBoundsInputHiggsCouplingsBosons
    9.99993102E-01        3  25  24  24  # h0-W-W eff. coupling^2, normalised to SM
    6.89752751E-06        3  35  24  24  # H0-W-W eff. coupling^2, normalised to SM
    0.00000000E+00        3  36  24  24  # A0-W-W eff. coupling^2, normalised to SM
#
    9.99993102E-01        3  25  23  23  # h0-Z-Z eff. coupling^2, normalised to SM
    6.89752751E-06        3  35  23  23  # H0-Z-Z eff. coupling^2, normalised to SM
    0.00000000E+00        3  36  23  23  # A0-Z-Z eff. coupling^2, normalised to SM
#
    8.86043132E-01        3  25  21  21  # h0-g-g eff. coupling^2, normalised to SM
    9.91449847E-05        3  35  21  21  # H0-g-g eff. coupling^2, normalised to SM
    5.60822467E-04        3  36  21  21  # A0-g-g eff. coupling^2, normalised to SM
#
    0.00000000E+00        3  25  25  23  # h0-h0-Z eff. coupling^2, normalised to SM
    0.00000000E+00        3  35  25  23  # H0-h0-Z eff. coupling^2, normalised to SM
    6.89752751E-06        3  36  25  23  # A0-h0-Z eff. coupling^2, normalised to SM
    0.00000000E+00        3  35  35  23  # H0-H0-Z eff. coupling^2, normalised to SM
    9.99993102E-01        3  36  35  23  # A0-H0-Z eff. coupling^2, normalised to SM
    0.00000000E+00        3  36  36  23  # A0-A0-Z eff. coupling^2, normalised to SM
#
    0.00000000E+00        4  25  21  21  23  # h0-g-g-Z eff. coupling^2, normalised to SM
    0.00000000E+00        4  35  21  21  23  # H0-g-g-Z eff. coupling^2, normalised to SM
    0.00000000E+00        4  36  21  21  23  # A0-g-g-Z eff. coupling^2, normalised to SM
#
#
#
#                             =================
#                             |The decay table|
#                             =================
#
# - The QCD corrections to the decays gluino -> squark  + quark
#                                     squark -> gaugino + quark_prime
#                                     squark -> squark_prime + Higgs
#                                     squark -> gluino  + quark
#   are included.
#
# - The multi-body decays for the inos, stops and sbottoms are included.
#
# - The loop induced decays for the gluino, neutralinos and stops
#   are included.
#
# - The SUSY decays of the top quark are included.
#
#
#         PDG            Width
DECAY         6     1.43267455E+00   # top decays
#          BR         NDA      ID1       ID2
     1.00000000E+00    2           5        24   # BR(t ->  b    W+)
#
#         PDG            Width
DECAY   1000021     4.24742718E+02   # gluino decays
#          BR         NDA      ID1       ID2
     6.27649525E-02    2     1000001        -1   # BR(~g -> ~d_L  db)
     6.27649525E-02    2    -1000001         1   # BR(~g -> ~d_L* d )
     6.25721900E-02    2     2000001        -1   # BR(~g -> ~d_R  db)
     6.25721900E-02    2    -2000001         1   # BR(~g -> ~d_R* d )
     6.28561160E-02    2     1000002        -2   # BR(~g -> ~u_L  ub)
     6.28561160E-02    2    -1000002         2   # BR(~g -> ~u_L* u )
     3.22789594E-02    2     2000002        -2   # BR(~g -> ~u_R  ub)
     3.22789594E-02    2    -2000002         2   # BR(~g -> ~u_R* u )
     6.27649525E-02    2     1000003        -3   # BR(~g -> ~s_L  sb)
     6.27649525E-02    2    -1000003         3   # BR(~g -> ~s_L* s )
     6.25721900E-02    2     2000003        -3   # BR(~g -> ~s_R  sb)
     6.25721900E-02    2    -2000003         3   # BR(~g -> ~s_R* s )
     6.28561126E-02    2     1000004        -4   # BR(~g -> ~c_L  cb)
     6.28561126E-02    2    -1000004         4   # BR(~g -> ~c_L* c )
     3.22789455E-02    2     2000004        -4   # BR(~g -> ~c_R  cb)
     3.22789455E-02    2    -2000004         4   # BR(~g -> ~c_R* c )
     2.25718521E-02    2     1000005        -5   # BR(~g -> ~b_1  bb)
     2.25718521E-02    2    -1000005         5   # BR(~g -> ~b_1* b )
     1.80047757E-02    2     2000005        -5   # BR(~g -> ~b_2  bb)
     1.80047757E-02    2    -2000005         5   # BR(~g -> ~b_2* b )
     1.84789539E-02    2     1000006        -6   # BR(~g -> ~t_1  tb)
     1.84789539E-02    2    -1000006         6   # BR(~g -> ~t_1* t )
#
#         PDG            Width
DECAY   1000006     3.02201435E+01   # stop1 decays
#          BR         NDA      ID1       ID2
     4.82239809E-01    2     1000022         6   # BR(~t_1 -> ~chi_10 t )
     4.88072528E-01    2     1000023         6   # BR(~t_1 -> ~chi_20 t )
     2.96833411E-02    2     1000024         5   # BR(~t_1 -> ~chi_1+ b )
     4.32190328E-06    2     1000005        24   # BR(~t_1 -> ~b_1    W+)
#
#         PDG            Width
DECAY   2000006     1.75170480E+02   # stop2 decays
#          BR         NDA      ID1       ID2
     1.38361734E-01    2     1000022         6   # BR(~t_2 -> ~chi_10 t )
     1.38845397E-01    2     1000023         6   # BR(~t_2 -> ~chi_20 t )
     0.00000000E+00    2     1000025         6   # BR(~t_2 -> ~chi_30 t )
     2.76448216E-01    2     1000024         5   # BR(~t_2 -> ~chi_1+ b )
     1.75899459E-05    2     1000037         5   # BR(~t_2 -> ~chi_2+ b )
     6.48870290E-02    2     1000021         6   # BR(~t_2 -> ~g      t )
     1.01805130E-01    2     1000006        25   # BR(~t_2 -> ~t_1    h )
     2.14769748E-03    2     1000006        35   # BR(~t_2 -> ~t_1    H )
     2.13001539E-03    2     1000006        36   # BR(~t_2 -> ~t_1    A )
     1.39057181E-05    2     1000005        37   # BR(~t_2 -> ~b_1    H+)
     4.18902518E-03    2     2000005        37   # BR(~t_2 -> ~b_2    H+)
     9.24209539E-02    2     1000006        23   # BR(~t_2 -> ~t_1    Z )
     7.38185717E-06    2     1000005        24   # BR(~t_2 -> ~b_1    W+)
     1.78725924E-01    2     2000005        24   # BR(~t_2 -> ~b_2    W+)
#
#         PDG            Width
DECAY   1000005     1.16978210E+00   # sbottom1 decays
#          BR         NDA      ID1       ID2
     2.52902685E-01    2     1000022         5   # BR(~b_1 -> ~chi_10 b )
     2.50983612E-01    2     1000023         5   # BR(~b_1 -> ~chi_20 b )
     4.96113702E-01    2    -1000024         6   # BR(~b_1 -> ~chi_1- t )
#
#         PDG            Width
DECAY   2000005     2.99732337E+01   # sbottom2 decays
#          BR         NDA      ID1       ID2
     1.05824075E-02    2     1000022         5   # BR(~b_2 -> ~chi_10 b )
     1.05360895E-02    2     1000023         5   # BR(~b_2 -> ~chi_20 b )
     9.78878270E-01    2    -1000024         6   # BR(~b_2 -> ~chi_1- t )
     1.17636905E-06    2     1000005        25   # BR(~b_2 -> ~b_1    h )
     2.05676938E-06    2     1000005        23   # BR(~b_2 -> ~b_1    Z )
#
#         PDG            Width
DECAY   1000002     8.86643556E-03   # sup_L decays
#          BR         NDA      ID1       ID2
     1.05087826E-01    2     1000022         2   # BR(~u_L -> ~chi_10 u)
     1.25370607E-01    2     1000023         2   # BR(~u_L -> ~chi_20 u)
     7.69541567E-01    2     1000024         1   # BR(~u_L -> ~chi_1+ d)
#
#         PDG            Width
DECAY   2000002     3.03134256E-02   # sup_R decays
#           BR         NDA      ID1       ID2
     5.98545846E-03    2     1000022         2   # BR(~u_R -> ~chi_10 u)
     1.24453376E-02    2     1000023         2   # BR(~u_R -> ~chi_20 u)
#           BR         NDA      ID1       ID2       ID3
     1.37988364E-01    3        2       -1        1000001   # BR(~u_R -> u  db  ~d_L)
     2.66271457E-02    3        2       1        -1000001   # BR(~u_R -> u  d  ~d_L*)
     2.59182189E-02    3        2       -1        2000001   # BR(~u_R -> u  db  ~d_R)
     1.31532478E-01    3        2       1        -2000001   # BR(~u_R -> u  d  ~d_R*)
     1.39479452E-01    3        2       -2        1000002   # BR(~u_R -> u  ub  ~u_L)
     2.66792678E-02    3        2       2        -1000002   # BR(~u_R -> u  u  ~u_L*)
     1.36546758E-01    3        2       -3        1000003   # BR(~u_R -> u  sb  ~s_L)
     2.66393515E-02    3        2       3        -1000003   # BR(~u_R -> u  s  ~s_L*)
     2.54563773E-02    3        2       -3        2000003   # BR(~u_R -> u  sb  ~s_R)
     1.33947250E-01    3        2       3        -2000003   # BR(~u_R -> u  s  ~s_R*)
     1.39509142E-01    3        2       -4        1000004   # BR(~u_R -> u  cb  ~c_L)
     2.68438813E-02    3        2       4        -1000004   # BR(~u_R -> u  c  ~c_L*)
     7.90375864E-04    3        2       23        1000022   # BR(~u_R -> u  Z  ~chi_10)
     2.80539062E-04    3        2       25        1000022   # BR(~u_R -> u  h  ~chi_10)
     1.21579793E-05    3        2       35        1000022   # BR(~u_R -> u  H  ~chi_10)
     2.01999605E-05    3        2       36        1000022   # BR(~u_R -> u  A  ~chi_10)
     3.49877976E-04    3        2       23        1000023   # BR(~u_R -> u  Z  ~chi_20)
     7.29214846E-04    3        2       25        1000023   # BR(~u_R -> u  h  ~chi_20)
     1.97239338E-05    3        2       35        1000023   # BR(~u_R -> u  H  ~chi_20)
     1.21276297E-05    3        2       36        1000023   # BR(~u_R -> u  A  ~chi_20)
     2.06753274E-04    3        2       -24        1000024   # BR(~u_R -> u  W-  ~chi_1+)
     1.91885274E-03    3        2       24        -1000024   # BR(~u_R -> u  W+  ~chi_1-)
     5.52230559E-05    3        2       -37        1000024   # BR(~u_R -> u  H-  ~chi_1+)
     6.47139001E-06    3        2       37        -1000024   # BR(~u_R -> u  H+  ~chi_1-)
#
#         PDG            Width
DECAY   1000001     1.41629558E-03   # sdown_L decays
#          BR         NDA      ID1       ID2
     4.81869153E-01    2     1000022         1   # BR(~d_L -> ~chi_10 d)
     5.13672342E-01    2     1000023         1   # BR(~d_L -> ~chi_20 d)
     4.45850527E-03    2    -1000024         2   # BR(~d_L -> ~chi_1- u)
#
#         PDG            Width
DECAY   2000001     6.42119624E-05   # sdown_R decays
#           BR         NDA      ID1       ID2
     3.16511873E-01    2     1000022         1   # BR(~d_R -> ~chi_10 d)
     6.56956467E-01    2     1000023         1   # BR(~d_R -> ~chi_20 d)
#           BR         NDA      ID1       ID2       ID3
     1.20859100E-08    3        1       -1        1000001   # BR(~d_R -> d  db  ~d_L)
     1.01482648E-09    3        1       1        -1000001   # BR(~d_R -> d  d  ~d_L*)
     8.43456545E-08    3        1       -2        1000002   # BR(~d_R -> d  ub  ~u_L)
     7.00476956E-09    3        1       2        -1000002   # BR(~d_R -> d  u  ~u_L*)
     1.20746972E-08    3        1       -3        1000003   # BR(~d_R -> d  sb  ~s_L)
     9.97820306E-10    3        1       3        -1000003   # BR(~d_R -> d  s  ~s_L*)
     7.74933488E-08    3        1       -4        1000004   # BR(~d_R -> d  cb  ~c_L)
     6.49925628E-09    3        1       4        -1000004   # BR(~d_R -> d  c  ~c_L*)
     4.48203090E-03    3        1       23        1000022   # BR(~d_R -> d  Z  ~chi_10)
     1.74017419E-03    3        1       25        1000022   # BR(~d_R -> d  h  ~chi_10)
     1.67928211E-03    3        1       23        1000023   # BR(~d_R -> d  Z  ~chi_20)
     4.44278588E-03    3        1       25        1000023   # BR(~d_R -> d  h  ~chi_20)
     7.89681518E-04    3        1       -24        1000024   # BR(~d_R -> d  W-  ~chi_1+)
     1.33975036E-02    3        1       24        -1000024   # BR(~d_R -> d  W+  ~chi_1-)
#
#         PDG            Width
DECAY   1000004     8.50520037E-03   # scharm_L decays
#          BR         NDA      ID1       ID2
     1.05087962E-01    2     1000022         4   # BR(~c_L -> ~chi_10 c)
     1.25369597E-01    2     1000023         4   # BR(~c_L -> ~chi_20 c)
     7.69542442E-01    2     1000024         3   # BR(~c_L -> ~chi_1+ s)
#
#         PDG            Width
DECAY   2000004     3.03028907E-02   # scharm_R decays
#           BR         NDA      ID1       ID2
     5.95350335E-03    2     1000022         4   # BR(~c_R -> ~chi_10 c)
     1.23787705E-02    2     1000023         4   # BR(~c_R -> ~chi_20 c)
#           BR         NDA      ID1       ID2       ID3
     1.38673239E-01    3        4       -1        1000001   # BR(~c_R -> c  db  ~d_L)
     2.69202041E-02    3        4       1        -1000001   # BR(~c_R -> c  d  ~d_L*)
     2.58952193E-02    3        4       -1        2000001   # BR(~c_R -> c  db  ~d_R)
     1.32017108E-01    3        4       1        -2000001   # BR(~c_R -> c  d  ~d_R*)
     1.38191437E-01    3        4       -2        1000002   # BR(~c_R -> c  ub  ~u_L)
     2.70234945E-02    3        4       2        -1000002   # BR(~c_R -> c  u  ~u_L*)
     1.37095832E-01    3        4       -3        1000003   # BR(~c_R -> c  sb  ~s_L)
     2.63618415E-02    3        4       3        -1000003   # BR(~c_R -> c  s  ~s_L*)
     2.52817465E-02    3        4       -3        2000003   # BR(~c_R -> c  sb  ~s_R)
     1.33637416E-01    3        4       3        -2000003   # BR(~c_R -> c  s  ~s_R*)
     1.39115441E-01    3        4       -4        1000004   # BR(~c_R -> c  cb  ~c_L)
     2.70571547E-02    3        4       4        -1000004   # BR(~c_R -> c  c  ~c_L*)
     7.90188641E-04    3        4       23        1000022   # BR(~c_R -> c  Z  ~chi_10)
     2.82012700E-04    3        4       25        1000022   # BR(~c_R -> c  h  ~chi_10)
     1.21618760E-05    3        4       35        1000022   # BR(~c_R -> c  H  ~chi_10)
     2.00746525E-05    3        4       36        1000022   # BR(~c_R -> c  A  ~chi_10)
     3.49966613E-04    3        4       23        1000023   # BR(~c_R -> c  Z  ~chi_20)
     7.26333347E-04    3        4       25        1000023   # BR(~c_R -> c  h  ~chi_20)
     1.97288109E-05    3        4       35        1000023   # BR(~c_R -> c  H  ~chi_20)
     1.21292059E-05    3        4       36        1000023   # BR(~c_R -> c  A  ~chi_20)
     2.05501847E-04    3        4       -24        1000024   # BR(~c_R -> c  W-  ~chi_1+)
     1.91777084E-03    3        4       24        -1000024   # BR(~c_R -> c  W+  ~chi_1-)
     5.52917548E-05    3        4       -37        1000024   # BR(~c_R -> c  H-  ~chi_1+)
     6.43238964E-06    3        4       37        -1000024   # BR(~c_R -> c  H+  ~chi_1-)
#
#         PDG            Width
DECAY   1000003     1.35886037E-03   # sstrange_L decays
#          BR         NDA      ID1       ID2
     4.81871487E-01    2     1000022         3   # BR(~s_L -> ~chi_10 s)
     5.13670040E-01    2     1000023         3   # BR(~s_L -> ~chi_20 s)
     4.45847309E-03    2    -1000024         4   # BR(~s_L -> ~chi_1- c)
#
#         PDG            Width
DECAY   2000003     6.16982168E-05   # sstrange_R decays
#           BR         NDA      ID1       ID2
     3.16177530E-01    2     1000022         3   # BR(~s_R -> ~chi_10 s)
     6.56256391E-01    2     1000023         3   # BR(~s_R -> ~chi_20 s)
#           BR         NDA      ID1       ID2       ID3
     1.24551412E-08    3        3       -1        1000001   # BR(~s_R -> s  db  ~d_L)
     1.06617344E-09    3        3       1        -1000001   # BR(~s_R -> s  d  ~d_L*)
     8.69717194E-08    3        3       -2        1000002   # BR(~s_R -> s  ub  ~u_L)
     7.35240049E-09    3        3       2        -1000002   # BR(~s_R -> s  u  ~u_L*)
     1.26661683E-08    3        3       -3        1000003   # BR(~s_R -> s  sb  ~s_L)
     1.06004684E-09    3        3       3        -1000003   # BR(~s_R -> s  s  ~s_L*)
     8.12114232E-08    3        3       -4        1000004   # BR(~s_R -> s  cb  ~c_L)
     6.96195161E-09    3        3       4        -1000004   # BR(~s_R -> s  c  ~c_L*)
     4.60872315E-03    3        3       23        1000022   # BR(~s_R -> s  Z  ~chi_10)
     1.81107341E-03    3        3       25        1000022   # BR(~s_R -> s  h  ~chi_10)
     1.75385944E-03    3        3       23        1000023   # BR(~s_R -> s  Z  ~chi_20)
     4.62379651E-03    3        3       25        1000023   # BR(~s_R -> s  h  ~chi_20)
     8.24902284E-04    3        3       -24        1000024   # BR(~s_R -> s  W-  ~chi_1+)
     1.39435148E-02    3        3       24        -1000024   # BR(~s_R -> s  W+  ~chi_1-)
#
#         PDG            Width
DECAY   1000011     3.89126510E+00   # selectron_L decays
#          BR         NDA      ID1       ID2
     1.63009789E-03    2     1000022        11   # BR(~e_L -> ~chi_10 e-)
     2.11115179E-03    2     1000023        11   # BR(~e_L -> ~chi_20 e-)
     3.27674662E-01    2     1000025        11   # BR(~e_L -> ~chi_30 e-)
     1.30844166E-02    2     1000035        11   # BR(~e_L -> ~chi_40 e-)
     8.37494236E-06    2    -1000024        12   # BR(~e_L -> ~chi_1- nu_e)
     6.55491296E-01    2    -1000037        12   # BR(~e_L -> ~chi_2- nu_e)
#
#         PDG            Width
DECAY   2000011     1.77780311E-02   # selectron_R decays
#           BR         NDA      ID1       ID2
     4.45816513E-02    2     1000022        11   # BR(~e_R -> ~chi_10 e-)
     9.27313666E-02    2     1000023        11   # BR(~e_R -> ~chi_20 e-)
#           BR         NDA      ID1       ID2       ID3
     1.72876287E-02    3        11       -1        1000001   # BR(~e_R- -> e-  db  ~d_L)
     6.70771691E-03    3        11       1        -1000001   # BR(~e_R- -> e-  d  ~d_L*)
     2.62695007E-02    3        11       -1        2000001   # BR(~e_R- -> e-  db  ~d_R)
     6.77915340E-02    3        11       1        -2000001   # BR(~e_R- -> e-  d  ~d_R*)
     1.69304463E-02    3        11       -2        1000002   # BR(~e_R- -> e-  ub  ~u_L)
     6.60253091E-03    3        11       2        -1000002   # BR(~e_R- -> e-  u  ~u_L*)
     3.26228477E-02    3        11       -2        2000002   # BR(~e_R- -> e-  ub  ~u_R)
     6.26166077E-02    3        11       2        -2000002   # BR(~e_R- -> e-  u  ~u_R*)
     1.72364419E-02    3        11       -3        1000003   # BR(~e_R- -> e-  sb  ~s_L)
     6.61659321E-03    3        11       3        -1000003   # BR(~e_R- -> e-  s  ~s_L*)
     2.65974335E-02    3        11       -3        2000003   # BR(~e_R- -> e-  sb  ~s_R)
     6.75834119E-02    3        11       3        -2000003   # BR(~e_R- -> e-  s  ~s_R*)
     1.69321337E-02    3        11       -4        1000004   # BR(~e_R- -> e-  cb  ~c_L)
     6.66496752E-03    3        11       4        -1000004   # BR(~e_R- -> e-  c  ~c_L*)
     3.27240962E-02    3        11       -4        2000004   # BR(~e_R- -> e-  cb  ~c_R)
     6.31622249E-02    3        11       4        -2000004   # BR(~e_R- -> e-  c  ~c_R*)
     4.52372929E-03    3        11       -5        1000005   # BR(~e_R- -> e-  bb  ~b_1)
     8.03351052E-03    3        11       5        -1000005   # BR(~e_R- -> e-  b  ~b_1*)
     1.34998077E-03    3        11       -5        2000005   # BR(~e_R- -> e-  bb  ~b_2)
     8.02169819E-04    3        11       5        -2000005   # BR(~e_R- -> e-  b  ~b_2*)
     1.76464986E-03    3        11       -6        1000006   # BR(~e_R- -> e-  tb  ~t_1)
     1.17932069E-03    3        11       6        -1000006   # BR(~e_R- -> e-  t  ~t_1*)
     5.70310623E-04    3        11       -15        1000015   # BR(~e_R- -> e-  tau+  ~tau_1-)
     3.77589620E-04    3        11       15        -1000015   # BR(~e_R- -> e-  tau-  ~tau_1+)
     1.01473555E-03    3        11       -15        2000015   # BR(~e_R- -> e-  tau+  ~tau_2-)
     1.48700381E-03    3        11       15        -2000015   # BR(~e_R- -> e-  tau-  ~tau_2+)
     5.67779409E-04    3        11       -16        1000016   # BR(~e_R- -> e-  nu_taub  ~nu_tau1)
     3.75305902E-04    3        11       16        -1000016   # BR(~e_R- -> e-  nu_tau  ~nu_tau1*)
     4.41218713E-02    3        11       23        1000022   # BR(~e_R- -> e-  Z  ~chi_10)
     1.83456761E-02    3        11       25        1000022   # BR(~e_R- -> e-  h  ~chi_10)
     1.38080533E-02    3        11       35        1000022   # BR(~e_R- -> e-  H  ~chi_10)
     1.46832908E-02    3        11       36        1000022   # BR(~e_R- -> e-  A  ~chi_10)
     1.82697397E-02    3        11       23        1000023   # BR(~e_R- -> e-  Z  ~chi_20)
     4.48660482E-02    3        11       25        1000023   # BR(~e_R- -> e-  h  ~chi_20)
     1.44982309E-02    3        11       35        1000023   # BR(~e_R- -> e-  H  ~chi_20)
     1.35976813E-02    3        11       36        1000023   # BR(~e_R- -> e-  A  ~chi_20)
     3.21486669E-02    3        11       -24        1000024   # BR(~e_R- -> e-  W-  ~chi_1+)
     9.56011377E-02    3        11       24        -1000024   # BR(~e_R- -> e-  W+  ~chi_1-)
     4.00876788E-02    3        11       -37        1000024   # BR(~e_R- -> e-  H-  ~chi_1+)
     1.62667057E-02    3        11       37        -1000024   # BR(~e_R- -> e-  H+  ~chi_1-)
#
#         PDG            Width
DECAY   1000013     3.89126507E+00   # smuon_L decays
#          BR         NDA      ID1       ID2
     1.63009790E-03    2     1000022        13   # BR(~mu_L -> ~chi_10 mu-)
     2.11115180E-03    2     1000023        13   # BR(~mu_L -> ~chi_20 mu-)
     3.27674659E-01    2     1000025        13   # BR(~mu_L -> ~chi_30 mu-)
     1.30844148E-02    2     1000035        13   # BR(~mu_L -> ~chi_40 mu-)
     8.37494243E-06    2    -1000024        14   # BR(~mu_L -> ~chi_1- nu_mu)
     6.55491302E-01    2    -1000037        14   # BR(~mu_L -> ~chi_2- nu_mu)
#
#         PDG            Width
DECAY   2000013     1.77768661E-02   # smuon_R decays
#           BR         NDA      ID1       ID2
     4.45845727E-02    2     1000022        13   # BR(~mu_R -> ~chi_10 mu-)
     9.27374432E-02    2     1000023        13   # BR(~mu_R -> ~chi_20 mu-)
#           BR         NDA      ID1       ID2       ID3
     1.72887616E-02    3        13       -1        1000001   # BR(~mu_R- -> mu-  db  ~d_L)
     6.70815650E-03    3        13       1        -1000001   # BR(~mu_R- -> mu-  d  ~d_L*)
     2.62712222E-02    3        13       -1        2000001   # BR(~mu_R- -> mu-  db  ~d_R)
     6.77959767E-02    3        13       1        -2000001   # BR(~mu_R- -> mu-  d  ~d_R*)
     1.69315558E-02    3        13       -2        1000002   # BR(~mu_R- -> mu-  ub  ~u_L)
     6.60296361E-03    3        13       2        -1000002   # BR(~mu_R- -> mu-  u  ~u_L*)
     3.25591698E-02    3        13       -2        2000002   # BR(~mu_R- -> mu-  ub  ~u_R)
     6.26207113E-02    3        13       2        -2000002   # BR(~mu_R- -> mu-  u  ~u_R*)
     1.72375715E-02    3        13       -3        1000003   # BR(~mu_R- -> mu-  sb  ~s_L)
     6.61702683E-03    3        13       3        -1000003   # BR(~mu_R- -> mu-  s  ~s_L*)
     2.65991767E-02    3        13       -3        2000003   # BR(~mu_R- -> mu-  sb  ~s_R)
     6.75878410E-02    3        13       3        -2000003   # BR(~mu_R- -> mu-  s  ~s_R*)
     1.69332434E-02    3        13       -4        1000004   # BR(~mu_R- -> mu-  cb  ~c_L)
     6.66540431E-03    3        13       4        -1000004   # BR(~mu_R- -> mu-  c  ~c_L*)
     3.27262408E-02    3        13       -4        2000004   # BR(~mu_R- -> mu-  cb  ~c_R)
     6.31663643E-02    3        13       4        -2000004   # BR(~mu_R- -> mu-  c  ~c_R*)
     4.52402575E-03    3        13       -5        1000005   # BR(~mu_R- -> mu-  bb  ~b_1)
     8.03403700E-03    3        13       5        -1000005   # BR(~mu_R- -> mu-  b  ~b_1*)
     1.35130680E-03    3        13       -5        2000005   # BR(~mu_R- -> mu-  bb  ~b_2)
     8.02222389E-04    3        13       5        -2000005   # BR(~mu_R- -> mu-  b  ~b_2*)
     1.76476550E-03    3        13       -6        1000006   # BR(~mu_R- -> mu-  tb  ~t_1)
     1.17939799E-03    3        13       6        -1000006   # BR(~mu_R- -> mu-  t  ~t_1*)
     5.72879378E-04    3        13       -15        1000015   # BR(~mu_R- -> mu-  tau+  ~tau_1-)
     3.77614365E-04    3        13       15        -1000015   # BR(~mu_R- -> mu-  tau-  ~tau_1+)
     1.01890851E-03    3        13       -15        2000015   # BR(~mu_R- -> mu-  tau+  ~tau_2-)
     1.49227653E-03    3        13       15        -2000015   # BR(~mu_R- -> mu-  tau-  ~tau_2+)
     5.67816619E-04    3        13       -16        1000016   # BR(~mu_R- -> mu-  nu_taub  ~nu_tau1)
     3.77749372E-04    3        13       16        -1000016   # BR(~mu_R- -> mu-  nu_tau  ~nu_tau1*)
     4.41247628E-02    3        13       23        1000022   # BR(~mu_R- -> mu-  Z  ~chi_10)
     1.83468784E-02    3        13       25        1000022   # BR(~mu_R- -> mu-  h  ~chi_10)
     1.37982701E-02    3        13       35        1000022   # BR(~mu_R- -> mu-  H  ~chi_10)
     1.46842531E-02    3        13       36        1000022   # BR(~mu_R- -> mu-  A  ~chi_10)
     1.82709370E-02    3        13       23        1000023   # BR(~mu_R- -> mu-  Z  ~chi_20)
     4.48689886E-02    3        13       25        1000023   # BR(~mu_R- -> mu-  h  ~chi_20)
     1.44946809E-02    3        13       35        1000023   # BR(~mu_R- -> mu-  H  ~chi_20)
     1.35985724E-02    3        13       36        1000023   # BR(~mu_R- -> mu-  A  ~chi_20)
     3.21507738E-02    3        13       -24        1000024   # BR(~mu_R- -> mu-  W-  ~chi_1+)
     9.56074029E-02    3        13       24        -1000024   # BR(~mu_R- -> mu-  W+  ~chi_1-)
     4.00903060E-02    3        13       -37        1000024   # BR(~mu_R- -> mu-  H-  ~chi_1+)
     1.62677718E-02    3        13       37        -1000024   # BR(~mu_R- -> mu-  H+  ~chi_1-)
#
#         PDG            Width
DECAY   1000015     4.54900927E-01   # stau_1 decays
#          BR         NDA      ID1       ID2
     5.01625929E-01    2     1000022        15   # BR(~tau_1 -> ~chi_10  tau-)
     4.98228282E-01    2     1000023        15   # BR(~tau_1 -> ~chi_20  tau-)
     1.45789052E-04    2    -1000024        16   # BR(~tau_1 -> ~chi_1-  nu_tau)
#
#         PDG            Width
DECAY   2000015     9.16260117E-01   # stau_2 decays
#          BR         NDA      ID1       ID2
     2.50146510E-01    2     1000022        15   # BR(~tau_2 -> ~chi_10  tau-)
     2.50937426E-01    2     1000023        15   # BR(~tau_2 -> ~chi_20  tau-)
     4.98916063E-01    2    -1000024        16   # BR(~tau_2 -> ~chi_1-  nu_tau)
#
#         PDG            Width
DECAY   1000012     3.90191167E+00   # snu_eL decays
#          BR         NDA      ID1       ID2
     6.18156035E-04    2     1000022        12   # BR(~nu_eL -> ~chi_10 nu_e)
     5.56668055E-04    2     1000023        12   # BR(~nu_eL -> ~chi_20 nu_e)
     3.25875531E-01    2     1000025        12   # BR(~nu_eL -> ~chi_30 nu_e)
     1.29252977E-02    2     1000035        12   # BR(~nu_eL -> ~chi_40 nu_e)
     9.07109901E-03    2     1000024        11   # BR(~nu_eL -> ~chi_1+ e-)
     6.50953248E-01    2     1000037        11   # BR(~nu_eL -> ~chi_2+ e-)
#
#         PDG            Width
DECAY   1000014     3.90191162E+00   # snu_muL decays
#          BR         NDA      ID1       ID2
     6.18156042E-04    2     1000022        14   # BR(~nu_muL -> ~chi_10 nu_mu)
     5.56668062E-04    2     1000023        14   # BR(~nu_muL -> ~chi_20 nu_mu)
     3.25875535E-01    2     1000025        14   # BR(~nu_muL -> ~chi_30 nu_mu)
     1.29252979E-02    2     1000035        14   # BR(~nu_muL -> ~chi_40 nu_mu)
     9.07109911E-03    2     1000024        13   # BR(~nu_muL -> ~chi_1+ mu-)
     6.50953244E-01    2     1000037        13   # BR(~nu_muL -> ~chi_2+ mu-)
#
#         PDG            Width
DECAY   1000016     4.71364177E-01   # snu_tauL decays
#          BR         NDA      ID1       ID2
     3.39095855E-03    2     1000022        16   # BR(~nu_tauL -> ~chi_10 nu_tau)
     3.05326134E-03    2     1000023        16   # BR(~nu_tauL -> ~chi_20 nu_tau)
     9.93555780E-01    2     1000024        15   # BR(~nu_tauL -> ~chi_1+ tau-)
#
#         PDG            Width
DECAY   1000024     2.29866776E-12   # chargino1+ decays
#           BR         NDA      ID1       ID2       ID3
     6.00001219E-01    3     1000022         2        -1   # BR(~chi_1+ -> ~chi_10 u    db)
     1.99999391E-01    3     1000022       -11        12   # BR(~chi_1+ -> ~chi_10 e+   nu_e)
     1.99999391E-01    3     1000022       -13        14   # BR(~chi_1+ -> ~chi_10 mu+  nu_mu)
#
#         PDG            Width
DECAY   1000037     2.14400003E+02   # chargino2+ decays
#          BR         NDA      ID1       ID2
     1.56967673E-01    2     1000002        -1   # BR(~chi_2+ -> ~u_L     db)
     1.56960180E-01    2    -1000001         2   # BR(~chi_2+ -> ~d_L*    u )
     1.56967673E-01    2     1000004        -3   # BR(~chi_2+ -> ~c_L     sb)
     1.56960174E-01    2    -1000003         4   # BR(~chi_2+ -> ~s_L*     c )
     6.28489026E-02    2     1000006        -5   # BR(~chi_2+ -> ~t_1     bb)
     2.61293755E-06    2    -1000005         6   # BR(~chi_2+ -> ~b_1*    t )
     6.18832738E-02    2    -2000005         6   # BR(~chi_2+ -> ~b_2*    t )
     8.87278883E-03    2     1000016       -15   # BR(~chi_2+ -> ~nu_tau1 tau+)
     8.84722973E-03    2    -1000015        16   # BR(~chi_2+ -> ~tau_1+  nu_tau)
     2.66132583E-06    2    -2000015        16   # BR(~chi_2+ -> ~tau_2+  nu_tau)
     3.09592344E-02    2     1000024        23   # BR(~chi_2+ -> ~chi_1+  Z )
     2.99341077E-02    2     1000022        24   # BR(~chi_2+ -> ~chi_10  W+)
     3.01147520E-02    2     1000023        24   # BR(~chi_2+ -> ~chi_20  W+)
     3.03734573E-02    2     1000024        25   # BR(~chi_2+ -> ~chi_1+  h )
     2.70966784E-02    2     1000024        35   # BR(~chi_2+ -> ~chi_1+  H )
     2.70749521E-02    2     1000024        36   # BR(~chi_2+ -> ~chi_1+  A )
     2.71387236E-02    2     1000022        37   # BR(~chi_2+ -> ~chi_10  H+)
     2.69949261E-02    2     1000023        37   # BR(~chi_2+ -> ~chi_20  H+)
#
#         PDG            Width
DECAY   1000022     0.00000000E+00   # neutralino1 decays
#
#         PDG            Width
DECAY   1000023     1.23548129E-11   # neutralino2 decays
#          BR         NDA      ID1       ID2
     4.85209794E-01    2     1000022        22   # BR(~chi_20 -> ~chi_10 gam)
#           BR         NDA      ID1       ID2       ID3
     8.60182140E-02    3     1000022        -2         2   # BR(~chi_20 -> ~chi_10 ub      u)
     1.11670330E-01    3     1000022        -1         1   # BR(~chi_20 -> ~chi_10 db      d)
     1.11670330E-01    3     1000022        -3         3   # BR(~chi_20 -> ~chi_10 sb      s)
     2.56634810E-02    3     1000022       -11        11   # BR(~chi_20 -> ~chi_10 e+      e-)
     2.56634810E-02    3     1000022       -13        13   # BR(~chi_20 -> ~chi_10 mu+     mu-)
     5.13167703E-02    3     1000022       -12        12   # BR(~chi_20 -> ~chi_10 nu_eb   nu_e)
     5.13167703E-02    3     1000022       -14        14   # BR(~chi_20 -> ~chi_10 nu_mub  nu_mu)
     5.13167777E-02    3     1000022       -16        16   # BR(~chi_20 -> ~chi_10 nu_taub nu_tau)
     4.62156924E-05    3     1000024        -2         1   # BR(~chi_20 -> ~chi_1+ ub      d)
     4.62156924E-05    3    -1000024        -1         2   # BR(~chi_20 -> ~chi_1- db      u)
     1.54051398E-05    3     1000024       -12        11   # BR(~chi_20 -> ~chi_1+ nu_eb   e-)
     1.54051398E-05    3    -1000024        12       -11   # BR(~chi_20 -> ~chi_1- nu_e    e+)
     1.54051398E-05    3     1000024       -14        13   # BR(~chi_20 -> ~chi_1+ nu_mub  mu-)
     1.54051398E-05    3    -1000024        14       -13   # BR(~chi_20 -> ~chi_1- nu_mu   mu+)
#
#         PDG            Width
DECAY   1000025     2.14385916E+02   # neutralino3 decays
#          BR         NDA      ID1       ID2
     1.63816546E-02    2     1000022        23   # BR(~chi_30 -> ~chi_10   Z )
     1.45719164E-02    2     1000023        23   # BR(~chi_30 -> ~chi_20   Z )
     3.00556818E-02    2     1000024       -24   # BR(~chi_30 -> ~chi_1+   W-)
     3.00556818E-02    2    -1000024        24   # BR(~chi_30 -> ~chi_1-   W+)
     1.40719073E-02    2     1000022        25   # BR(~chi_30 -> ~chi_10   h )
     1.87436518E-02    2     1000022        35   # BR(~chi_30 -> ~chi_10   H )
     8.49879052E-03    2     1000022        36   # BR(~chi_30 -> ~chi_10   A )
     1.62518816E-02    2     1000023        25   # BR(~chi_30 -> ~chi_20   h )
     8.36913658E-03    2     1000023        35   # BR(~chi_30 -> ~chi_20   H )
     1.85929517E-02    2     1000023        36   # BR(~chi_30 -> ~chi_20   A )
     2.70502845E-02    2     1000024       -37   # BR(~chi_30 -> ~chi_1+   H-)
     2.70502845E-02    2    -1000024        37   # BR(~chi_30 -> ~chi_1-   H+)
     7.85236671E-02    2     1000002        -2   # BR(~chi_30 -> ~u_L      ub)
     7.85236671E-02    2    -1000002         2   # BR(~chi_30 -> ~u_L*     u )
     5.45886079E-10    2     2000002        -2   # BR(~chi_30 -> ~u_R      ub)
     5.45886079E-10    2    -2000002         2   # BR(~chi_30 -> ~u_R*     u )
     7.84407868E-02    2     1000001        -1   # BR(~chi_30 -> ~d_L      db)
     7.84407868E-02    2    -1000001         1   # BR(~chi_30 -> ~d_L*     d )
     2.28477373E-10    2     2000001        -1   # BR(~chi_30 -> ~d_R      db)
     2.28477373E-10    2    -2000001         1   # BR(~chi_30 -> ~d_R*     d )
     7.85236641E-02    2     1000004        -4   # BR(~chi_30 -> ~c_L      cb)
     7.85236641E-02    2    -1000004         4   # BR(~chi_30 -> ~c_L*     c )
     5.45885935E-10    2     2000004        -4   # BR(~chi_30 -> ~c_R      cb)
     5.45885935E-10    2    -2000004         4   # BR(~chi_30 -> ~c_R*     c )
     7.84407868E-02    2     1000003        -3   # BR(~chi_30 -> ~s _L      sb)
     7.84407868E-02    2    -1000003         3   # BR(~chi_30 -> ~s _L*     s )
     2.28477373E-10    2     2000003        -3   # BR(~chi_30 -> ~s _R      sb)
     2.28477373E-10    2    -2000003         3   # BR(~chi_30 -> ~s _R*     s )
     3.07922971E-02    2     1000006        -6   # BR(~chi_30 -> ~t_1      tb)
     3.07922971E-02    2    -1000006         6   # BR(~chi_30 -> ~t_1*     t )
     1.32905028E-06    2     1000005        -5   # BR(~chi_30 -> ~b_1      bb)
     1.32905028E-06    2    -1000005         5   # BR(~chi_30 -> ~b_1*     b )
     3.15719877E-02    2     2000005        -5   # BR(~chi_30 -> ~b_2      bb)
     3.15719877E-02    2    -2000005         5   # BR(~chi_30 -> ~b_2*     b )
     4.41902518E-03    2     1000015       -15   # BR(~chi_30 -> ~tau_1-   tau+)
     4.41902518E-03    2    -1000015        15   # BR(~chi_30 -> ~tau_1+   tau-)
     1.32929268E-06    2     2000015       -15   # BR(~chi_30 -> ~tau_2-   tau+)
     1.32929268E-06    2    -2000015        15   # BR(~chi_30 -> ~tau_2+   tau-)
     4.43821378E-03    2     1000016       -16   # BR(~chi_30 -> ~nu_tau1  nu_taub)
     4.43821378E-03    2    -1000016        16   # BR(~chi_30 -> ~nu_tau1* nu_tau )
#
#         PDG            Width
DECAY   1000035     7.87025112E+01   # neutralino4 decays
#          BR         NDA      ID1       ID2
     1.98545206E-02    2     1000022        23   # BR(~chi_40 -> ~chi_10   Z )
     9.66390184E-03    2     1000023        23   # BR(~chi_40 -> ~chi_20   Z )
     1.25636322E-07    2     1000025        23   # BR(~chi_40 -> ~chi_30   Z )
     2.86265173E-02    2     1000024       -24   # BR(~chi_40 -> ~chi_1+   W-)
     2.86265173E-02    2    -1000024        24   # BR(~chi_40 -> ~chi_1-   W+)
     1.24083951E-07    2     1000037       -24   # BR(~chi_40 -> ~chi_2+   W-)
     1.24083951E-07    2    -1000037        24   # BR(~chi_40 -> ~chi_2-   W+)
     1.04928784E-02    2     1000022        25   # BR(~chi_40 -> ~chi_10   h )
     1.41577124E-02    2     1000022        35   # BR(~chi_40 -> ~chi_10   H )
     1.22660750E-02    2     1000022        36   # BR(~chi_40 -> ~chi_10   A )
     2.20080477E-02    2     1000023        25   # BR(~chi_40 -> ~chi_20   h )
     1.21073812E-02    2     1000023        35   # BR(~chi_40 -> ~chi_20   H )
     1.40209892E-02    2     1000023        36   # BR(~chi_40 -> ~chi_20   A )
     5.91791262E-10    2     1000025        25   # BR(~chi_40 -> ~chi_30   h )
     2.62327356E-02    2     1000024       -37   # BR(~chi_40 -> ~chi_1+   H-)
     2.62327356E-02    2    -1000024        37   # BR(~chi_40 -> ~chi_1-   H+)
     8.96955994E-03    2     1000002        -2   # BR(~chi_40 -> ~u_L      ub)
     8.96955994E-03    2    -1000002         2   # BR(~chi_40 -> ~u_L*     u )
     9.68630780E-02    2     2000002        -2   # BR(~chi_40 -> ~u_R      ub)
     9.68630780E-02    2    -2000002         2   # BR(~chi_40 -> ~u_R*     u )
     8.98650966E-03    2     1000001        -1   # BR(~chi_40 -> ~d_L      db)
     8.98650966E-03    2    -1000001         1   # BR(~chi_40 -> ~d_L*     d )
     3.58266557E-02    2     2000001        -1   # BR(~chi_40 -> ~d_R      db)
     3.58266557E-02    2    -2000001         1   # BR(~chi_40 -> ~d_R*     d )
     8.96955974E-03    2     1000004        -4   # BR(~chi_40 -> ~c_L      cb)
     8.96955974E-03    2    -1000004         4   # BR(~chi_40 -> ~c_L*     c )
     9.68630642E-02    2     2000004        -4   # BR(~chi_40 -> ~c_R      cb)
     9.68630642E-02    2    -2000004         4   # BR(~chi_40 -> ~c_R*     c )
     8.98650966E-03    2     1000003        -3   # BR(~chi_40 -> ~s _L      sb)
     8.98650966E-03    2    -1000003         3   # BR(~chi_40 -> ~s _L*     s )
     3.58266557E-02    2     2000003        -3   # BR(~chi_40 -> ~s _R      sb)
     3.58266557E-02    2    -2000003         3   # BR(~chi_40 -> ~s _R*     s )
     5.75917371E-03    2     1000006        -6   # BR(~chi_40 -> ~t_1      tb)
     5.75917371E-03    2    -1000006         6   # BR(~chi_40 -> ~t_1*     t )
     1.69463885E-03    2     2000006        -6   # BR(~chi_40 -> ~t_2      tb)
     1.69463885E-03    2    -2000006         6   # BR(~chi_40 -> ~t_2*     t )
     2.07500664E-02    2     1000005        -5   # BR(~chi_40 -> ~b_1      bb)
     2.07500664E-02    2    -1000005         5   # BR(~chi_40 -> ~b_1*     b )
     4.63606238E-03    2     2000005        -5   # BR(~chi_40 -> ~b_2      bb)
     4.63606238E-03    2    -2000005         5   # BR(~chi_40 -> ~b_2*     b )
     4.64838083E-03    2     2000011       -11   # BR(~chi_40 -> ~e_R-     e+)
     4.64838083E-03    2    -2000011        11   # BR(~chi_40 -> ~e_R+     e-)
     4.64838083E-03    2     2000013       -13   # BR(~chi_40 -> ~mu_R-    mu+)
     4.64838083E-03    2    -2000013        13   # BR(~chi_40 -> ~mu_R+    mu-)
     7.94697578E-03    2     1000015       -15   # BR(~chi_40 -> ~tau_1-   tau+)
     7.94697578E-03    2    -1000015        15   # BR(~chi_40 -> ~tau_1+   tau-)
     2.85153395E-02    2     2000015       -15   # BR(~chi_40 -> ~tau_2-   tau+)
     2.85153395E-02    2    -2000015        15   # BR(~chi_40 -> ~tau_2+   tau-)
     7.96419579E-03    2     1000016       -16   # BR(~chi_40 -> ~nu_tau1  nu_taub)
     7.96419579E-03    2    -1000016        16   # BR(~chi_40 -> ~nu_tau1* nu_tau )
#
#         PDG            Width
DECAY        25     4.22568704E-03   # h decays
#          BR         NDA      ID1       ID2
     5.98663249E-01    2           5        -5   # BR(h -> b       bb     )
     6.44438205E-02    2         -15        15   # BR(h -> tau+    tau-   )
     2.28096257E-04    2         -13        13   # BR(h -> mu+     mu-    )
     2.48334004E-04    2           3        -3   # BR(h -> s       sb     )
     2.05769832E-02    2           4        -4   # BR(h -> c       cb     )
     7.62715854E-02    2          21        21   # BR(h -> g       g      )
     2.26475671E-03    2          22        22   # BR(h -> gam     gam    )
     1.54482601E-03    2          22        23   # BR(h -> Z       gam    )
     2.09370467E-01    2          24       -24   # BR(h -> W+      W-     )
     2.63878823E-02    2          23        23   # BR(h -> Z       Z      )
#
#         PDG            Width
DECAY        35     1.78897294E+00   # H decays
#          BR         NDA      ID1       ID2
     5.90759561E-01    2           5        -5   # BR(H -> b       bb     )
     9.62267057E-02    2         -15        15   # BR(H -> tau+    tau-   )
     3.39627916E-04    2         -13        13   # BR(H -> mu+     mu-    )
     2.35792835E-04    2           3        -3   # BR(H -> s       sb     )
     3.43087320E-06    2           4        -4   # BR(H -> c       cb     )
     3.01958093E-01    2           6        -6   # BR(H -> t       tb     )
     3.92692285E-04    2          21        21   # BR(H -> g       g      )
     9.06451674E-07    2          22        22   # BR(H -> gam     gam    )
     4.03446714E-07    2          23        22   # BR(H -> Z       gam    )
     1.21306229E-03    2          24       -24   # BR(H -> W+      W-     )
     5.99094041E-04    2          23        23   # BR(H -> Z       Z      )
     4.59499626E-03    2          25        25   # BR(H -> h       h      )
     6.06490719E-16    2          23        36   # BR(H -> Z       A      )
     3.21820124E-03    2     1000024  -1000024   # BR(H -> ~chi_1+ ~chi_1-)
     2.86768002E-04    2     1000022   1000022   # BR(H -> ~chi_10 ~chi_10)
     1.65370394E-04    2     1000023   1000023   # BR(H -> ~chi_20 ~chi_20)
     5.29436584E-06    2     1000022   1000023   # BR(H -> ~chi_10 ~chi_20)
#
#         PDG            Width
DECAY        36     1.81069689E+00   # A decays
#          BR         NDA      ID1       ID2
     5.84100113E-01    2           5        -5   # BR(A -> b       bb     )
     9.51051868E-02    2         -15        15   # BR(A -> tau+    tau-   )
     3.35665545E-04    2         -13        13   # BR(A -> mu+     mu-    )
     2.33257964E-04    2           3        -3   # BR(A -> s       sb     )
     3.26267442E-06    2           4        -4   # BR(A -> c       cb     )
     3.13059468E-01    2           6        -6   # BR(A -> t       tb     )
     9.22581613E-04    2          21        21   # BR(A -> g       g      )
     1.43115648E-06    2          22        22   # BR(A -> gam     gam    )
     7.63320931E-07    2          23        22   # BR(A -> Z       gam    )
     1.17763410E-03    2          23        25   # BR(A -> Z       h      )
     4.44976709E-03    2     1000024  -1000024   # BR(A -> ~chi_1+ ~chi_1-)
     2.49495329E-04    2     1000022   1000022   # BR(A -> ~chi_10 ~chi_10)
     3.54021518E-04    2     1000023   1000023   # BR(A -> ~chi_20 ~chi_20)
     7.35179563E-06    2     1000022   1000023   # BR(A -> ~chi_10 ~chi_20)
#
#         PDG            Width
DECAY        37     1.74556299E+00   # H+ decays
#          BR         NDA      ID1       ID2
     9.96531939E-04    2           4        -5   # BR(H+ -> c       bb     )
     9.89971173E-02    2         -15        16   # BR(H+ -> tau+    nu_tau )
     3.49401763E-04    2         -13        14   # BR(H+ -> mu+     nu_mu  )
     9.96517144E-06    2           2        -5   # BR(H+ -> u       bb     )
     1.20852258E-05    2           2        -3   # BR(H+ -> u       sb     )
     2.41118201E-04    2           4        -3   # BR(H+ -> c       sb     )
     8.96557973E-01    2           6        -5   # BR(H+ -> t       bb     )
     1.24215713E-03    2          24        25   # BR(H+ -> W+      h      )
     3.91211942E-10    2          24        36   # BR(H+ -> W+      A      )
     7.90975496E-04    2     1000024   1000022   # BR(H+ -> ~chi_1+ ~chi_10)
     8.02674583E-04    2     1000024   1000023   # BR(H+ -> ~chi_1+ ~chi_20)
