#
#                              ======================
#                              | THE SUSYHIT OUTPUT |
#                              ======================
#
#
#              ------------------------------------------------------
#              |     This is the output of the SUSY-HIT package     |
#              |  created by A.Djouadi, M.Muehlleitner and M.Spira. |
#              |  In case of problems with SUSY-HIT email to        |
#              |           margarete.muehlleitner@cern.ch           |
#              |           michael.spira@psi.ch                     |
#              |           abdelhak.djouadi@cern.ch                 |
#              ------------------------------------------------------
#
#              ------------------------------------------------------
#              |  SUSY Les Houches Accord - MSSM Spectrum + Decays  |
#              |              based on the decay programs           |
#              |                                                    |
#              |                     SDECAY 1.3b                    |
#              |                                                    |
#              |  Authors: M.Muhlleitner, A.Djouadi and Y.Mambrini  |
#              |  Ref.:    Comput.Phys.Commun.168(2005)46           |
#              |           [hep-ph/0311167]                         |
#              |                                                    |
#              |                     HDECAY 3.4                     |
#              |                                                    |
#              |  By: A.Djouadi,J.Kalinowski,M.Muhlleitner,M.Spira  |
#              |  Ref.:    Comput.Phys.Commun.108(1998)56           |
#              |           [hep-ph/9704448]                         |
#              |                                                    |
#              |                                                    |
#              |  If not stated otherwise all DRbar couplings and   |
#              |  soft SUSY breaking masses are given at the scale  |
#              |  Q=  0.25987230E+04
#              |                                                    |
#              ------------------------------------------------------
#
#
BLOCK DCINFO  # Decay Program information
     1   SDECAY/HDECAY # decay calculator
     2   1.3b  /3.4    # version number
#
BLOCK SPINFO  # Spectrum calculator information
     1     SOFTSUSY    # spectrum calculator               
     2     3.4.0       # version number                    
#
BLOCK MODSEL  # Model selection
     1     0   #  nonUniversal                                     
#
BLOCK SMINPUTS  # Standard Model inputs
         1     1.27908970E+02   # alpha_em^-1(M_Z)^MSbar
         2     1.16637870E-05   # G_F [GeV^-2]
         3     1.18400000E-01   # alpha_S(M_Z)^MSbar
         4     9.11876000E+01   # M_Z pole mass
         5     4.18000000E+00   # mb(mb)^MSbar
         6     1.73200000E+02   # mt pole mass
         7     1.77700000E+00   # mtau pole mass
#
BLOCK MINPAR  # Input parameters - minimal models
         3     5.02900000E+01   # tanb                
#
BLOCK EXTPAR  # Input parameters - non-minimal models
         0    -1.00000000E+00   # Set                 
         1    -3.42037000E+03   # M_1(MX)             
         2    -2.78710000E+02   # M_2(MX)             
         3     2.35222000E+03   # M_3(MX)             
        11    -3.41766000E+03   # At(MX)              
        12    -2.64345000E+03   # Ab(MX)              
        13     2.24311000E+03   # Atau(MX)            
        23     3.30598000E+03   # mu(MX)              
        26     3.99415000E+03   # mA(pole)            
        31     1.96224000E+03   # meL(MX)             
        32     1.96224000E+03   # mmuL(MX)            
        33     3.91611000E+03   # mtauL(MX)           
        34     1.47825000E+03   # meR(MX)             
        35     1.47825000E+03   # mmuR(MX)            
        36     3.81581000E+03   # mtauR(MX)           
        41     2.53672000E+03   # mqL1(MX)            
        42     2.53672000E+03   # mqL2(MX)            
        43     2.77109000E+03   # mqL3(MX)            
        44     6.17410000E+02   # muR(MX)             
        45     6.17410000E+02   # mcR(MX)             
        46     2.43699000E+03   # mtR(MX)             
        47     1.72927000E+03   # mdR(MX)             
        48     1.72927000E+03   # msR(MX)             
        49     1.45650000E+03   # mbR(MX)             
#
BLOCK MASS  # Mass Spectrum
# PDG code           mass       particle
        24     8.03754407E+01   # W+
        25     1.25715110E+02   # h
        35     3.99413467E+03   # H
        36     3.99414992E+03   # A
        37     3.99500558E+03   # H+
         5     4.81876030E+00   # b-quark pole mass calculated from mb(mb)_Msbar
   1000001     2.62321813E+03   # ~d_L
   2000001     1.83784099E+03   # ~d_R
   1000002     2.62215837E+03   # ~u_L
   2000002     8.14530088E+02   # ~u_R
   1000003     2.62321813E+03   # ~s_L
   2000003     1.83784099E+03   # ~s_R
   1000004     2.62215837E+03   # ~c_L
   2000004     8.14530088E+02   # ~c_R
   1000005     1.56602528E+03   # ~b_1
   2000005     2.82794068E+03   # ~b_2
   1000006     2.48940682E+03   # ~t_1
   2000006     2.85325168E+03   # ~t_2
   1000011     1.96986819E+03   # ~e_L
   2000011     1.48661042E+03   # ~e_R
   1000012     1.96793079E+03   # ~nu_eL
   1000013     1.96986819E+03   # ~mu_L
   2000013     1.48661042E+03   # ~mu_R
   1000014     1.96793079E+03   # ~nu_muL
   1000015     3.80498568E+03   # ~tau_1
   2000015     3.93292772E+03   # ~tau_2
   1000016     3.92061109E+03   # ~nu_tauL
   1000021     2.46969585E+03   # ~g
   1000022    -3.00957153E+02   # ~chi_10
   1000023    -3.29630846E+03   # ~chi_20
   1000025     3.30876779E+03   # ~chi_30
   1000035    -3.38645513E+03   # ~chi_40
   1000024     3.01120043E+02   # ~chi_1+
   1000037     3.30995140E+03   # ~chi_2+
#
BLOCK NMIX  # Neutralino Mixing Matrix
  1  1    -7.87020282E-06   # N_11
  1  2     9.99722240E-01   # N_12
  1  3    -2.35224672E-02   # N_13
  1  4    -1.46164350E-03   # N_14
  2  1     3.41504362E-01   # N_21
  2  2     1.66323201E-02   # N_22
  2  3     6.65547017E-01   # N_23
  2  4     6.63434477E-01   # N_24
  3  1     4.77709273E-03   # N_31
  3  2    -1.55992902E-02   # N_32
  3  3    -7.06921134E-01   # N_33
  3  4     7.07104202E-01   # N_34
  4  1     9.39868049E-01   # N_41
  4  2    -5.95575366E-03   # N_42
  4  3    -2.38235959E-01   # N_43
  4  4    -2.44655281E-01   # N_44
#
BLOCK UMIX  # Chargino Mixing Matrix U
  1  1     9.99446751E-01   # U_11
  1  2    -3.32594622E-02   # U_12
  2  1     3.32594622E-02   # U_21
  2  2     9.99446751E-01   # U_22
#
BLOCK VMIX  # Chargino Mixing Matrix V
  1  1    -9.99997868E-01   # V_11
  1  2    -2.06489142E-03   # V_12
  2  1    -2.06489142E-03   # V_21
  2  2     9.99997868E-01   # V_22
#
BLOCK STOPMIX  # Stop Mixing Matrix
  1  1     2.67222809E-01   # cos(theta_t)
  1  2     9.63634770E-01   # sin(theta_t)
  2  1    -9.63634770E-01   # -sin(theta_t)
  2  2     2.67222809E-01   # cos(theta_t)
#
BLOCK SBOTMIX  # Sbottom Mixing Matrix
  1  1     4.44682938E-02   # cos(theta_b)
  1  2     9.99010796E-01   # sin(theta_b)
  2  1    -9.99010796E-01   # -sin(theta_b)
  2  2     4.44682938E-02   # cos(theta_b)
#
BLOCK STAUMIX  # Stau Mixing Matrix
  1  1     2.99826965E-01   # cos(theta_tau)
  1  2     9.53993601E-01   # sin(theta_tau)
  2  1    -9.53993601E-01   # -sin(theta_tau)
  2  2     2.99826965E-01   # cos(theta_tau)
#
BLOCK ALPHA  # Higgs mixing
          -2.04455614E-02   # Mixing angle in the neutral Higgs boson sector
#
BLOCK HMIX Q=  2.59872300E+03  # DRbar Higgs Parameters
         1     3.32861294E+03   # mu(Q)MSSM           
         2     4.88972369E+01   # tan                 
         3     2.43177044E+02   # higgs               
         4     1.53030733E+07   # mA^2(Q)MSSM         
#
BLOCK GAUGE Q=  2.59872300E+03  # The gauge couplings
     1     3.64440801E-01   # gprime(Q) DRbar
     2     6.39274932E-01   # g(Q) DRbar
     3     1.02012146E+00   # g3(Q) DRbar
#
BLOCK AU Q=  2.59872300E+03  # The trilinear couplings
  1  1     0.00000000E+00   # A_u(Q) DRbar
  2  2     0.00000000E+00   # A_c(Q) DRbar
  3  3    -3.41765999E+03   # A_t(Q) DRbar
#
BLOCK AD Q=  2.59872300E+03  # The trilinear couplings
  1  1     0.00000000E+00   # A_d(Q) DRbar
  2  2     0.00000000E+00   # A_s(Q) DRbar
  3  3    -2.64345000E+03   # A_b(Q) DRbar
#
BLOCK AE Q=  2.59872300E+03  # The trilinear couplings
  1  1     0.00000000E+00   # A_e(Q) DRbar
  2  2     0.00000000E+00   # A_mu(Q) DRbar
  3  3     2.24311000E+03   # A_tau(Q) DRbar
#
BLOCK Yu Q=  2.59872300E+03  # The Yukawa couplings
  1  1     0.00000000E+00   # y_u(Q) DRbar
  2  2     0.00000000E+00   # y_c(Q) DRbar
  3  3     8.17190056E-01   # y_t(Q) DRbar
#
BLOCK Yd Q=  2.59872300E+03  # The Yukawa couplings
  1  1     0.00000000E+00   # y_d(Q) DRbar
  2  2     0.00000000E+00   # y_s(Q) DRbar
  3  3     4.22636056E-01   # y_b(Q) DRbar
#
BLOCK Ye Q=  2.59872300E+03  # The Yukawa couplings
  1  1     0.00000000E+00   # y_e(Q) DRbar
  2  2     0.00000000E+00   # y_mu(Q) DRbar
  3  3     4.94652294E-01   # y_tau(Q) DRbar
#
BLOCK MSOFT Q=  2.59872300E+03  # The soft SUSY breaking masses at the scale Q
         1    -3.42037000E+03   # M_1(Q)              
         2    -2.78710000E+02   # M_2(Q)              
         3     2.35222000E+03   # M_3(Q)              
        21     5.39850113E+06   # mH1^2(Q)            
        22    -1.09397778E+07   # mH2^2(Q)            
        31     1.96224000E+03   # meL(Q)              
        32     1.96224000E+03   # mmuL(Q)             
        33     3.91611000E+03   # mtauL(Q)            
        34     1.47825000E+03   # meR(Q)              
        35     1.47825000E+03   # mmuR(Q)             
        36     3.81581000E+03   # mtauR(Q)            
        41     2.53671999E+03   # mqL1(Q)             
        42     2.53671999E+03   # mqL2(Q)             
        43     2.77108999E+03   # mqL3(Q)             
        44     6.17409977E+02   # muR(Q)              
        45     6.17409977E+02   # mcR(Q)              
        46     2.43698998E+03   # mtR(Q)              
        47     1.72926999E+03   # mdR(Q)              
        48     1.72926999E+03   # msR(Q)              
        49     1.45649999E+03   # mbR(Q)              
#
Block HiggsBoundsInputHiggsCouplingsFermions
# ScalarNormEffCoupSq PseudoSNormEffCoupSq NP   IP1 IP2 IP2
    9.99741696E-01    0.00000000E+00        3  25   5   5  # h0-b-b eff. coupling^2, normalised to SM
    2.39094003E+03    0.00000000E+00        3  35   5   5  # H0-b-b eff. coupling^2, normalised to SM
    0.00000000E+00    2.39093978E+03        3  36   5   5  # A0-b-b eff. coupling^2, normalised to SM
#
    1.00000011E+00    0.00000000E+00        3  25   6   6  # h0-t-t eff. coupling^2, normalised to SM
    4.18137548E-04    0.00000000E+00        3  35   6   6  # H0-t-t eff. coupling^2, normalised to SM
    0.00000000E+00    4.18245583E-04        3  36   6   6  # A0-t-t eff. coupling^2, normalised to SM
#
    9.99741696E-01    0.00000000E+00        3  25  15  15  # h0-tau-tau eff. coupling^2, normalised to SM
    2.39094003E+03    0.00000000E+00        3  35  15  15  # H0-tau-tau eff. coupling^2, normalised to SM
    0.00000000E+00    2.39093978E+03        3  36  15  15  # A0-tau-tau eff. coupling^2, normalised to SM
#
Block HiggsBoundsInputHiggsCouplingsBosons
    1.00000000E+00        3  25  24  24  # h0-W-W eff. coupling^2, normalised to SM
    6.97734945E-12        3  35  24  24  # H0-W-W eff. coupling^2, normalised to SM
    0.00000000E+00        3  36  24  24  # A0-W-W eff. coupling^2, normalised to SM
#
    1.00000000E+00        3  25  23  23  # h0-Z-Z eff. coupling^2, normalised to SM
    6.97734945E-12        3  35  23  23  # H0-Z-Z eff. coupling^2, normalised to SM
    0.00000000E+00        3  36  23  23  # A0-Z-Z eff. coupling^2, normalised to SM
#
    8.78793686E-01        3  25  21  21  # h0-g-g eff. coupling^2, normalised to SM
    2.76821029E-13        3  35  21  21  # H0-g-g eff. coupling^2, normalised to SM
    5.39368496E-13        3  36  21  21  # A0-g-g eff. coupling^2, normalised to SM
#
    0.00000000E+00        3  25  25  23  # h0-h0-Z eff. coupling^2, normalised to SM
    0.00000000E+00        3  35  25  23  # H0-h0-Z eff. coupling^2, normalised to SM
    6.97734945E-12        3  36  25  23  # A0-h0-Z eff. coupling^2, normalised to SM
    0.00000000E+00        3  35  35  23  # H0-H0-Z eff. coupling^2, normalised to SM
    1.00000000E+00        3  36  35  23  # A0-H0-Z eff. coupling^2, normalised to SM
    0.00000000E+00        3  36  36  23  # A0-A0-Z eff. coupling^2, normalised to SM
#
    0.00000000E+00        4  25  21  21  23  # h0-g-g-Z eff. coupling^2, normalised to SM
    0.00000000E+00        4  35  21  21  23  # H0-g-g-Z eff. coupling^2, normalised to SM
    0.00000000E+00        4  36  21  21  23  # A0-g-g-Z eff. coupling^2, normalised to SM
#
#
#
#                             =================
#                             |The decay table|
#                             =================
#
# - The QCD corrections to the decays gluino -> squark  + quark
#                                     squark -> gaugino + quark_prime
#                                     squark -> squark_prime + Higgs
#                                     squark -> gluino  + quark
#   are included.
#
# - The multi-body decays for the inos, stops and sbottoms are included.
#
# - The loop induced decays for the gluino, neutralinos and stops
#   are included.
#
# - The SUSY decays of the top quark are included.
#
#
#         PDG            Width
DECAY         6     1.43993026E+00   # top decays
#          BR         NDA      ID1       ID2
     1.00000000E+00    2           5        24   # BR(t ->  b    W+)
#
#         PDG            Width
DECAY   1000021     1.14223095E+02   # gluino decays
#          BR         NDA      ID1       ID2
     4.25253884E-02    2     2000001        -1   # BR(~g -> ~d_R  db)
     4.25253884E-02    2    -2000001         1   # BR(~g -> ~d_R* d )
     1.69630784E-01    2     2000002        -2   # BR(~g -> ~u_R  ub)
     1.69630784E-01    2    -2000002         2   # BR(~g -> ~u_R* u )
     4.25253884E-02    2     2000003        -3   # BR(~g -> ~s_R  sb)
     4.25253884E-02    2    -2000003         3   # BR(~g -> ~s_R* s )
     1.69630763E-01    2     2000004        -4   # BR(~g -> ~c_R  cb)
     1.69630763E-01    2    -2000004         4   # BR(~g -> ~c_R* c )
     7.56876761E-02    2     1000005        -5   # BR(~g -> ~b_1  bb)
     7.56876761E-02    2    -1000005         5   # BR(~g -> ~b_1* b )
#
#         PDG            Width
DECAY   1000006     2.35729349E+00   # stop1 decays
#          BR         NDA      ID1       ID2
     2.88919784E-01    2     1000022         6   # BR(~t_1 -> ~chi_10 t )
     5.84309228E-01    2     1000024         5   # BR(~t_1 -> ~chi_1+ b )
     1.26770988E-01    2     1000005        24   # BR(~t_1 -> ~b_1    W+)
#
#         PDG            Width
DECAY   2000006     5.82933007E+01   # stop2 decays
#          BR         NDA      ID1       ID2
     1.79469918E-01    2     1000022         6   # BR(~t_2 -> ~chi_10 t )
     3.62052102E-01    2     1000024         5   # BR(~t_2 -> ~chi_1+ b )
     1.16623857E-01    2     1000021         6   # BR(~t_2 -> ~g      t )
     8.01087678E-02    2     1000006        25   # BR(~t_2 -> ~t_1    h )
     1.05655801E-01    2     1000006        23   # BR(~t_2 -> ~t_1    Z )
     1.56089555E-01    2     1000005        24   # BR(~t_2 -> ~b_1    W+)
#
#         PDG            Width
DECAY   1000005     7.67647652E-02   # sbottom1 decays
#          BR         NDA      ID1       ID2
     3.39480328E-01    2     1000022         5   # BR(~b_1 -> ~chi_10 b )
     6.60519672E-01    2    -1000024         6   # BR(~b_1 -> ~chi_1- t )
#
#         PDG            Width
DECAY   2000005     6.24448075E+01   # sbottom2 decays
#          BR         NDA      ID1       ID2
     1.79233940E-01    2     1000022         5   # BR(~b_2 -> ~chi_10 b )
     3.55317437E-01    2    -1000024         6   # BR(~b_2 -> ~chi_1- t )
     1.40634093E-01    2     1000021         5   # BR(~b_2 -> ~g      b )
     7.85806228E-02    2     1000005        25   # BR(~b_2 -> ~b_1    h )
     7.65054459E-02    2     1000005        23   # BR(~b_2 -> ~b_1    Z )
     1.69728461E-01    2     1000006       -24   # BR(~b_2 -> ~t_1    W-)
#
#         PDG            Width
DECAY   1000002     3.22431710E+01   # sup_L decays
#          BR         NDA      ID1       ID2
     3.06748494E-01    2     1000022         2   # BR(~u_L -> ~chi_10 u)
     6.13820175E-01    2     1000024         1   # BR(~u_L -> ~chi_1+ d)
     7.94313313E-02    2     1000021         2   # BR(~u_L -> ~g      u)
#
#         PDG            Width
DECAY   2000002     1.84959399E-10   # sup_R decays
#           BR         NDA      ID1       ID2
     4.95142175E-01    2     1000022         2   # BR(~u_R -> ~chi_10 u)
#           BR         NDA      ID1       ID2       ID3
     5.22871508E-02    3        2       23        1000022   # BR(~u_R -> u  Z  ~chi_10)
     1.88462983E-01    3        2       25        1000022   # BR(~u_R -> u  h  ~chi_10)
     2.37927892E-01    3        2       -24        1000024   # BR(~u_R -> u  W-  ~chi_1+)
     2.61797996E-02    3        2       24        -1000024   # BR(~u_R -> u  W+  ~chi_1-)
#
#         PDG            Width
DECAY   1000001     3.22670017E+01   # sdown_L decays
#          BR         NDA      ID1       ID2
     3.06646947E-01    2     1000022         1   # BR(~d_L -> ~chi_10 d)
     6.12937156E-01    2    -1000024         2   # BR(~d_L -> ~chi_1- u)
     8.04158968E-02    2     1000021         1   # BR(~d_L -> ~g      d)
#
#         PDG            Width
DECAY   2000001     3.74899851E-02   # sdown_R decays
#           BR         NDA      ID1       ID2
     1.67495294E-09    2     1000022         1   # BR(~d_R -> ~chi_10 d)
#           BR         NDA      ID1       ID2       ID3
     1.14595938E-01    3        1       -2        2000002   # BR(~d_R -> d  ub  ~u_R)
     3.83062302E-01    3        1       2        -2000002   # BR(~d_R -> d  u  ~u_R*)
     1.16519118E-01    3        1       -4        2000004   # BR(~d_R -> d  cb  ~c_R)
     3.84022559E-01    3        1       4        -2000004   # BR(~d_R -> d  c  ~c_R*)
     5.76714020E-04    3        1       -5        1000005   # BR(~d_R -> d  bb  ~b_1)
     1.21635151E-03    3        1       5        -1000005   # BR(~d_R -> d  b  ~b_1*)
     6.77620969E-07    3        1       -11        2000011   # BR(~d_R -> d  e+  ~e_R-)
     2.76473836E-06    3        1       11        -2000011   # BR(~d_R -> d  e-  ~e_R+)
     6.81088562E-07    3        1       -13        2000013   # BR(~d_R -> d  mu+  ~mu_R-)
     2.75940361E-06    3        1       13        -2000013   # BR(~d_R -> d  mu-  ~mu_R+)
     1.79671984E-08    3        1       23        1000022   # BR(~d_R -> d  Z  ~chi_10)
     3.19445313E-08    3        1       25        1000022   # BR(~d_R -> d  h  ~chi_10)
     7.06375315E-08    3        1       -24        1000024   # BR(~d_R -> d  W-  ~chi_1+)
     1.19253182E-08    3        1       24        -1000024   # BR(~d_R -> d  W+  ~chi_1-)
#
#         PDG            Width
DECAY   1000004     3.29802123E+01   # scharm_L decays
#          BR         NDA      ID1       ID2
     3.14571889E-01    2     1000022         4   # BR(~c_L -> ~chi_10 c)
     6.29474878E-01    2     1000024         3   # BR(~c_L -> ~chi_1+ s)
     5.59532327E-02    2     1000021         4   # BR(~c_L -> ~g      c)
#
#         PDG            Width
DECAY   2000004     1.81930607E-10   # scharm_R decays
#           BR         NDA      ID1       ID2
     4.85631904E-01    2     1000022         4   # BR(~c_R -> ~chi_10 c)
#           BR         NDA      ID1       ID2       ID3
     5.33890374E-02    3        4       23        1000022   # BR(~c_R -> c  Z  ~chi_10)
     1.91474104E-01    3        4       25        1000022   # BR(~c_R -> c  h  ~chi_10)
     2.42993747E-01    3        4       -24        1000024   # BR(~c_R -> c  W-  ~chi_1+)
     2.65112071E-02    3        4       24        -1000024   # BR(~c_R -> c  W+  ~chi_1-)
#
#         PDG            Width
DECAY   1000003     3.29950083E+01   # sstrange_L decays
#          BR         NDA      ID1       ID2
     3.14566811E-01    2     1000022         3   # BR(~s_L -> ~chi_10 s)
     6.28766649E-01    2    -1000024         4   # BR(~s_L -> ~chi_1- c)
     5.66665395E-02    2     1000021         3   # BR(~s_L -> ~g      s)
#
#         PDG            Width
DECAY   2000003     3.75085399E-02   # sstrange_R decays
#           BR         NDA      ID1       ID2
     1.68776194E-09    2     1000022         3   # BR(~s_R -> ~chi_10 s)
#           BR         NDA      ID1       ID2       ID3
     1.14539249E-01    3        3       -2        2000002   # BR(~s_R -> s  ub  ~u_R)
     3.82739506E-01    3        3       2        -2000002   # BR(~s_R -> s  u  ~u_R*)
     1.16877384E-01    3        3       -4        2000004   # BR(~s_R -> s  cb  ~c_R)
     3.84045875E-01    3        3       4        -2000004   # BR(~s_R -> s  c  ~c_R*)
     5.75202343E-04    3        3       -5        1000005   # BR(~s_R -> s  bb  ~b_1)
     1.21574980E-03    3        3       5        -1000005   # BR(~s_R -> s  b  ~b_1*)
     6.77925616E-07    3        3       -11        2000011   # BR(~s_R -> s  e+  ~e_R-)
     2.76363730E-06    3        3       11        -2000011   # BR(~s_R -> s  e-  ~e_R+)
     6.80751639E-07    3        3       -13        2000013   # BR(~s_R -> s  mu+  ~mu_R-)
     2.77830063E-06    3        3       13        -2000013   # BR(~s_R -> s  mu-  ~mu_R+)
     1.79583104E-08    3        3       23        1000022   # BR(~s_R -> s  Z  ~chi_10)
     3.19287289E-08    3        3       25        1000022   # BR(~s_R -> s  h  ~chi_10)
     7.05306048E-08    3        3       -24        1000024   # BR(~s_R -> s  W-  ~chi_1+)
     1.19194189E-08    3        3       24        -1000024   # BR(~s_R -> s  W+  ~chi_1-)
#
#         PDG            Width
DECAY   1000011     2.28929595E+01   # selectron_L decays
#          BR         NDA      ID1       ID2
     3.33465344E-01    2     1000022        11   # BR(~e_L -> ~chi_10 e-)
     6.66534656E-01    2    -1000024        12   # BR(~e_L -> ~chi_1- nu_e)
#
#         PDG            Width
DECAY   2000011     6.69559368E-05   # selectron_R decays
#           BR         NDA      ID1       ID2
     6.68414259E-06    2     1000022        11   # BR(~e_R -> ~chi_10 e-)
#           BR         NDA      ID1       ID2       ID3
     5.18191540E-02    3        11       -2        2000002   # BR(~e_R- -> e-  ub  ~u_R)
     4.47876640E-01    3        11       2        -2000002   # BR(~e_R- -> e-  u  ~u_R*)
     5.18221410E-02    3        11       -4        2000004   # BR(~e_R- -> e-  cb  ~c_R)
     4.48309761E-01    3        11       4        -2000004   # BR(~e_R- -> e-  c  ~c_R*)
     2.11870682E-05    3        11       23        1000022   # BR(~e_R- -> e-  Z  ~chi_10)
     4.39572671E-05    3        11       25        1000022   # BR(~e_R- -> e-  h  ~chi_10)
     8.88211006E-05    3        11       -24        1000024   # BR(~e_R- -> e-  W-  ~chi_1+)
     1.16546797E-05    3        11       24        -1000024   # BR(~e_R- -> e-  W+  ~chi_1-)
#
#         PDG            Width
DECAY   1000013     2.28929594E+01   # smuon_L decays
#          BR         NDA      ID1       ID2
     3.33465342E-01    2     1000022        13   # BR(~mu_L -> ~chi_10 mu-)
     6.66534658E-01    2    -1000024        14   # BR(~mu_L -> ~chi_1- nu_mu)
#
#         PDG            Width
DECAY   2000013     6.69379319E-05   # smuon_R decays
#           BR         NDA      ID1       ID2
     6.68594041E-06    2     1000022        13   # BR(~mu_R -> ~chi_10 mu-)
#           BR         NDA      ID1       ID2       ID3
     5.18330923E-02    3        13       -2        2000002   # BR(~mu_R- -> mu-  ub  ~u_R)
     4.47728204E-01    3        13       2        -2000002   # BR(~mu_R- -> mu-  u  ~u_R*)
     5.18360801E-02    3        13       -4        2000004   # BR(~mu_R- -> mu-  cb  ~c_R)
     4.48430347E-01    3        13       4        -2000004   # BR(~mu_R- -> mu-  c  ~c_R*)
     2.11345042E-05    3        13       23        1000022   # BR(~mu_R- -> mu-  Z  ~chi_10)
     4.39690907E-05    3        13       25        1000022   # BR(~mu_R- -> mu-  h  ~chi_10)
     8.87688017E-05    3        13       -24        1000024   # BR(~mu_R- -> mu-  W-  ~chi_1+)
     1.17190654E-05    3        13       24        -1000024   # BR(~mu_R- -> mu-  W+  ~chi_1-)
#
#         PDG            Width
DECAY   1000015     7.75619000E+00   # stau_1 decays
#          BR         NDA      ID1       ID2
     2.07236370E-01    2     1000022        15   # BR(~tau_1 -> ~chi_10  tau-)
     9.29842748E-02    2     1000023        15   # BR(~tau_1 -> ~chi_20  tau-)
     6.98543088E-02    2     1000025        15   # BR(~tau_1 -> ~chi_30  tau-)
     9.08806954E-02    2     1000035        15   # BR(~tau_1 -> ~chi_40  tau-)
     4.14011211E-01    2    -1000024        16   # BR(~tau_1 -> ~chi_1-  nu_tau)
     1.25033140E-01    2    -1000037        16   # BR(~tau_1 -> ~chi_2-  nu_tau)
#
#         PDG            Width
DECAY   2000015     4.48993316E+01   # stau_2 decays
#          BR         NDA      ID1       ID2
     3.15161230E-01    2     1000022        15   # BR(~tau_2 -> ~chi_10  tau-)
     1.60535689E-02    2     1000023        15   # BR(~tau_2 -> ~chi_20  tau-)
     1.84748931E-02    2     1000025        15   # BR(~tau_2 -> ~chi_30  tau-)
     1.21186033E-02    2     1000035        15   # BR(~tau_2 -> ~chi_40  tau-)
     6.29545807E-01    2    -1000024        16   # BR(~tau_2 -> ~chi_1-  nu_tau)
     4.21083820E-03    2    -1000037        16   # BR(~tau_2 -> ~chi_2-  nu_tau)
     1.18694951E-03    2     1000015        25   # BR(~tau_2 -> ~tau_1   h)
     3.24810981E-03    2     1000015        23   # BR(~tau_2 -> ~tau_1   Z)
#
#         PDG            Width
DECAY   1000012     2.28852404E+01   # snu_eL decays
#          BR         NDA      ID1       ID2
     3.33224343E-01    2     1000022        12   # BR(~nu_eL -> ~chi_10 nu_e)
     6.66775657E-01    2     1000024        11   # BR(~nu_eL -> ~chi_1+ e-)
#
#         PDG            Width
DECAY   1000014     2.28852403E+01   # snu_muL decays
#          BR         NDA      ID1       ID2
     3.33224344E-01    2     1000022        14   # BR(~nu_muL -> ~chi_10 nu_mu)
     6.66775656E-01    2     1000024        13   # BR(~nu_muL -> ~chi_1+ mu-)
#
#         PDG            Width
DECAY   1000016     4.94304670E+01   # snu_tauL decays
#          BR         NDA      ID1       ID2
     3.18466554E-01    2     1000022        16   # BR(~nu_tauL -> ~chi_10 nu_tau)
     8.78248300E-04    2     1000023        16   # BR(~nu_tauL -> ~chi_20 nu_tau)
     8.96350466E-06    2     1000025        16   # BR(~nu_tauL -> ~chi_30 nu_tau)
     6.10176830E-03    2     1000035        16   # BR(~nu_tauL -> ~chi_40 nu_tau)
     6.37694565E-01    2     1000024        15   # BR(~nu_tauL -> ~chi_1+ tau-)
     3.18222544E-02    2     1000037        15   # BR(~nu_tauL -> ~chi_2+ tau-)
     5.02764703E-03    2    -1000015       -24   # BR(~nu_tauL -> ~tau_1+ W-)
#
#         PDG            Width
DECAY   1000024     3.40992830E-15   # chargino1+ decays
#           BR         NDA      ID1       ID2       ID3
     1.96571860E-02    3     1000022       -11        12   # BR(~chi_1+ -> ~chi_10 e+   nu_e)
     2.10831080E-03    3     1000022       -13        14   # BR(~chi_1+ -> ~chi_10 mu+  nu_mu)
     9.78234500E-01    2     1000022       211             # BR(~chi_1+ -> ~chi_10 pi+)
#
#         PDG            Width
DECAY   1000037     4.76178470E+01   # chargino2+ decays
#          BR         NDA      ID1       ID2
     4.92224989E-07    2     1000002        -1   # BR(~chi_2+ -> ~u_L     db)
     1.27360577E-04    2    -1000001         2   # BR(~chi_2+ -> ~d_L*    u )
     4.92224923E-07    2     1000004        -3   # BR(~chi_2+ -> ~c_L     sb)
     1.27360302E-04    2    -1000003         4   # BR(~chi_2+ -> ~s_L*     c )
     2.48339168E-01    2     1000006        -5   # BR(~chi_2+ -> ~t_1     bb)
     2.88626151E-02    2     2000006        -5   # BR(~chi_2+ -> ~t_2     bb)
     2.27835481E-01    2    -1000005         6   # BR(~chi_2+ -> ~b_1*    t )
     9.16520547E-02    2    -2000005         6   # BR(~chi_2+ -> ~b_2*    t )
     5.03585348E-07    2     1000012       -11   # BR(~chi_2+ -> ~nu_eL   e+  )
     5.03585348E-07    2     1000014       -13   # BR(~chi_2+ -> ~nu_muL mu+ )
     1.30368610E-04    2    -1000011        12   # BR(~chi_2+ -> ~e_L+    nu_e)
     1.30368610E-04    2    -1000013        14   # BR(~chi_2+ -> ~mu_L+   nu_mu)
     1.33421184E-01    2     1000024        23   # BR(~chi_2+ -> ~chi_1+  Z )
     1.29705672E-01    2     1000022        24   # BR(~chi_2+ -> ~chi_10  W+)
     1.39666375E-01    2     1000024        25   # BR(~chi_2+ -> ~chi_1+  h )
#
#         PDG            Width
DECAY   1000022     0.00000000E+00   # neutralino1 decays
#
#         PDG            Width
DECAY   1000023     5.04269479E+01   # neutralino2 decays
#          BR         NDA      ID1       ID2
     4.84028565E-02    2     1000022        23   # BR(~chi_20 -> ~chi_10   Z )
     1.07340031E-01    2     1000024       -24   # BR(~chi_20 -> ~chi_1+   W-)
     1.07340031E-01    2    -1000024        24   # BR(~chi_20 -> ~chi_1-   W+)
     6.60530775E-02    2     1000022        25   # BR(~chi_20 -> ~chi_10   h )
     3.50927262E-04    2     1000002        -2   # BR(~chi_20 -> ~u_L      ub)
     3.50927262E-04    2    -1000002         2   # BR(~chi_20 -> ~u_L*     u )
     2.26666157E-02    2     2000002        -2   # BR(~chi_20 -> ~u_R      ub)
     2.26666157E-02    2    -2000002         2   # BR(~chi_20 -> ~u_R*     u )
     1.22643967E-04    2     1000001        -1   # BR(~chi_20 -> ~d_L      db)
     1.22643967E-04    2    -1000001         1   # BR(~chi_20 -> ~d_L*     d )
     3.07599569E-03    2     2000001        -1   # BR(~chi_20 -> ~d_R      db)
     3.07599569E-03    2    -2000001         1   # BR(~chi_20 -> ~d_R*     d )
     3.50926472E-04    2     1000004        -4   # BR(~chi_20 -> ~c_L      cb)
     3.50926472E-04    2    -1000004         4   # BR(~chi_20 -> ~c_L*     c )
     2.26666149E-02    2     2000004        -4   # BR(~chi_20 -> ~c_R      cb)
     2.26666149E-02    2    -2000004         4   # BR(~chi_20 -> ~c_R*     c )
     1.22643967E-04    2     1000003        -3   # BR(~chi_20 -> ~s _L      sb)
     1.22643967E-04    2    -1000003         3   # BR(~chi_20 -> ~s _L*     s )
     3.07599569E-03    2     2000003        -3   # BR(~chi_20 -> ~s _R      sb)
     3.07599569E-03    2    -2000003         3   # BR(~chi_20 -> ~s _R*     s )
     9.76917846E-02    2     1000006        -6   # BR(~chi_20 -> ~t_1      tb)
     9.76917846E-02    2    -1000006         6   # BR(~chi_20 -> ~t_1*     t )
     4.20833829E-02    2     2000006        -6   # BR(~chi_20 -> ~t_2      tb)
     4.20833829E-02    2    -2000006         6   # BR(~chi_20 -> ~t_2*     t )
     9.87254428E-02    2     1000005        -5   # BR(~chi_20 -> ~b_1      bb)
     9.87254428E-02    2    -1000005         5   # BR(~chi_20 -> ~b_1*     b )
     1.05396605E-02    2     2000005        -5   # BR(~chi_20 -> ~b_2      bb)
     1.05396605E-02    2    -2000005         5   # BR(~chi_20 -> ~b_2*     b )
     2.45211816E-03    2     1000011       -11   # BR(~chi_20 -> ~e_L-     e+)
     2.45211816E-03    2    -1000011        11   # BR(~chi_20 -> ~e_L+     e-)
     1.27828792E-02    2     2000011       -11   # BR(~chi_20 -> ~e_R-     e+)
     1.27828792E-02    2    -2000011        11   # BR(~chi_20 -> ~e_R+     e-)
     2.45211816E-03    2     1000013       -13   # BR(~chi_20 -> ~mu_L-    mu+)
     2.45211816E-03    2    -1000013        13   # BR(~chi_20 -> ~mu_L+    mu-)
     1.27828792E-02    2     2000013       -13   # BR(~chi_20 -> ~mu_R-    mu+)
     1.27828792E-02    2    -2000013        13   # BR(~chi_20 -> ~mu_R+    mu-)
     1.74468659E-03    2     1000012       -12   # BR(~chi_20 -> ~nu_eL    nu_eb)
     1.74468659E-03    2    -1000012        12   # BR(~chi_20 -> ~nu_eL*   nu_e )
     1.74468659E-03    2     1000014       -14   # BR(~chi_20 -> ~nu_muL   nu_mub)
     1.74468659E-03    2    -1000014        14   # BR(~chi_20 -> ~nu_muL*  nu_mu )
#
#         PDG            Width
DECAY   1000025     4.74659944E+01   # neutralino3 decays
#          BR         NDA      ID1       ID2
     7.51761669E-02    2     1000022        23   # BR(~chi_30 -> ~chi_10   Z )
     1.30059520E-01    2     1000024       -24   # BR(~chi_30 -> ~chi_1+   W-)
     1.30059520E-01    2    -1000024        24   # BR(~chi_30 -> ~chi_1-   W+)
     6.02052274E-02    2     1000022        25   # BR(~chi_30 -> ~chi_10   h )
     1.24643938E-05    2     1000002        -2   # BR(~chi_30 -> ~u_L      ub)
     1.24643938E-05    2    -1000002         2   # BR(~chi_30 -> ~u_L*     u )
     4.73482078E-06    2     2000002        -2   # BR(~chi_30 -> ~u_R      ub)
     4.73482078E-06    2    -2000002         2   # BR(~chi_30 -> ~u_R*     u )
     1.56932056E-05    2     1000001        -1   # BR(~chi_30 -> ~d_L      db)
     1.56932056E-05    2    -1000001         1   # BR(~chi_30 -> ~d_L*     d )
     6.46220690E-07    2     2000001        -1   # BR(~chi_30 -> ~d_R      db)
     6.46220690E-07    2    -2000001         1   # BR(~chi_30 -> ~d_R*     d )
     1.24643669E-05    2     1000004        -4   # BR(~chi_30 -> ~c_L      cb)
     1.24643669E-05    2    -1000004         4   # BR(~chi_30 -> ~c_L*     c )
     4.73482062E-06    2     2000004        -4   # BR(~chi_30 -> ~c_R      cb)
     4.73482062E-06    2    -2000004         4   # BR(~chi_30 -> ~c_R*     c )
     1.56932056E-05    2     1000003        -3   # BR(~chi_30 -> ~s _L      sb)
     1.56932056E-05    2    -1000003         3   # BR(~chi_30 -> ~s _L*     s )
     6.46220690E-07    2     2000003        -3   # BR(~chi_30 -> ~s _R      sb)
     6.46220690E-07    2    -2000003         3   # BR(~chi_30 -> ~s _R*     s )
     1.43304649E-01    2     1000006        -6   # BR(~chi_30 -> ~t_1      tb)
     1.43304649E-01    2    -1000006         6   # BR(~chi_30 -> ~t_1*     t )
     3.37303259E-02    2     2000006        -6   # BR(~chi_30 -> ~t_2      tb)
     3.37303259E-02    2    -2000006         6   # BR(~chi_30 -> ~t_2*     t )
     1.11573735E-01    2     1000005        -5   # BR(~chi_30 -> ~b_1      bb)
     1.11573735E-01    2    -1000005         5   # BR(~chi_30 -> ~b_1*     b )
     1.35093289E-02    2     2000005        -5   # BR(~chi_30 -> ~b_2      bb)
     1.35093289E-02    2    -2000005         5   # BR(~chi_30 -> ~b_2*     b )
     9.78952461E-06    2     1000011       -11   # BR(~chi_30 -> ~e_L-     e+)
     9.78952461E-06    2    -1000011        11   # BR(~chi_30 -> ~e_L+     e-)
     2.67761120E-06    2     2000011       -11   # BR(~chi_30 -> ~e_R-     e+)
     2.67761120E-06    2    -2000011        11   # BR(~chi_30 -> ~e_R+     e-)
     9.78952461E-06    2     1000013       -13   # BR(~chi_30 -> ~mu_L-    mu+)
     9.78952461E-06    2    -1000013        13   # BR(~chi_30 -> ~mu_L+    mu-)
     2.67761120E-06    2     2000013       -13   # BR(~chi_30 -> ~mu_R-    mu+)
     2.67761120E-06    2    -2000013        13   # BR(~chi_30 -> ~mu_R+    mu-)
     1.98662805E-05    2     1000012       -12   # BR(~chi_30 -> ~nu_eL    nu_eb)
     1.98662805E-05    2    -1000012        12   # BR(~chi_30 -> ~nu_eL*   nu_e )
     1.98662805E-05    2     1000014       -14   # BR(~chi_30 -> ~nu_muL   nu_mub)
     1.98662805E-05    2    -1000014        14   # BR(~chi_30 -> ~nu_muL*  nu_mu )
#
#         PDG            Width
DECAY   1000035     8.24679412E+01   # neutralino4 decays
#          BR         NDA      ID1       ID2
     4.10094716E-03    2     1000022        23   # BR(~chi_40 -> ~chi_10   Z )
     9.10452551E-03    2     1000024       -24   # BR(~chi_40 -> ~chi_1+   W-)
     9.10452551E-03    2    -1000024        24   # BR(~chi_40 -> ~chi_1-   W+)
     5.60002110E-03    2     1000022        25   # BR(~chi_40 -> ~chi_10   h )
     1.17275197E-03    2     1000002        -2   # BR(~chi_40 -> ~u_L      ub)
     1.17275197E-03    2    -1000002         2   # BR(~chi_40 -> ~u_L*     u )
     1.08659522E-01    2     2000002        -2   # BR(~chi_40 -> ~u_R      ub)
     1.08659522E-01    2    -2000002         2   # BR(~chi_40 -> ~u_R*     u )
     1.33696907E-03    2     1000001        -1   # BR(~chi_40 -> ~d_L      db)
     1.33696907E-03    2    -1000001         1   # BR(~chi_40 -> ~d_L*     d )
     1.53386404E-02    2     2000001        -1   # BR(~chi_40 -> ~d_R      db)
     1.53386404E-02    2    -2000001         1   # BR(~chi_40 -> ~d_R*     d )
     1.17274997E-03    2     1000004        -4   # BR(~chi_40 -> ~c_L      cb)
     1.17274997E-03    2    -1000004         4   # BR(~chi_40 -> ~c_L*     c )
     1.08659518E-01    2     2000004        -4   # BR(~chi_40 -> ~c_R      cb)
     1.08659518E-01    2    -2000004         4   # BR(~chi_40 -> ~c_R*     c )
     1.33696907E-03    2     1000003        -3   # BR(~chi_40 -> ~s _L      sb)
     1.33696907E-03    2    -1000003         3   # BR(~chi_40 -> ~s _L*     s )
     1.53386404E-02    2     2000003        -3   # BR(~chi_40 -> ~s _R      sb)
     1.53386404E-02    2    -2000003         3   # BR(~chi_40 -> ~s _R*     s )
     3.44027693E-02    2     1000006        -6   # BR(~chi_40 -> ~t_1      tb)
     3.44027693E-02    2    -1000006         6   # BR(~chi_40 -> ~t_1*     t )
     3.68163284E-03    2     2000006        -6   # BR(~chi_40 -> ~t_2      tb)
     3.68163284E-03    2    -2000006         6   # BR(~chi_40 -> ~t_2*     t )
     2.58188728E-02    2     1000005        -5   # BR(~chi_40 -> ~b_1      bb)
     2.58188728E-02    2    -1000005         5   # BR(~chi_40 -> ~b_1*     b )
     2.18920921E-03    2     2000005        -5   # BR(~chi_40 -> ~b_2      bb)
     2.18920921E-03    2    -2000005         5   # BR(~chi_40 -> ~b_2*     b )
     1.02576511E-02    2     1000011       -11   # BR(~chi_40 -> ~e_L-     e+)
     1.02576511E-02    2    -1000011        11   # BR(~chi_40 -> ~e_L+     e-)
     6.24651068E-02    2     2000011       -11   # BR(~chi_40 -> ~e_R-     e+)
     6.24651068E-02    2    -2000011        11   # BR(~chi_40 -> ~e_R+     e-)
     1.02576511E-02    2     1000013       -13   # BR(~chi_40 -> ~mu_L-    mu+)
     1.02576511E-02    2    -1000013        13   # BR(~chi_40 -> ~mu_L+    mu-)
     6.24651068E-02    2     2000013       -13   # BR(~chi_40 -> ~mu_R-    mu+)
     6.24651068E-02    2    -2000013        13   # BR(~chi_40 -> ~mu_R+    mu-)
     1.07456149E-02    2     1000012       -12   # BR(~chi_40 -> ~nu_eL    nu_eb)
     1.07456149E-02    2    -1000012        12   # BR(~chi_40 -> ~nu_eL*   nu_e )
     1.07456149E-02    2     1000014       -14   # BR(~chi_40 -> ~nu_muL   nu_mub)
     1.07456149E-02    2    -1000014        14   # BR(~chi_40 -> ~nu_muL*  nu_mu )
#
#         PDG            Width
DECAY        25     6.29976934E-03   # h decays
#          BR         NDA      ID1       ID2
     7.28097797E-01    2           5        -5   # BR(h -> b       bb     )
     4.12969711E-02    2         -15        15   # BR(h -> tau+    tau-   )
     1.46173576E-04    2         -13        13   # BR(h -> mu+     mu-    )
     1.59408691E-04    2           3        -3   # BR(h -> s       sb     )
     1.38303221E-02    2           4        -4   # BR(h -> c       cb     )
     5.12218321E-02    2          21        21   # BR(h -> g       g      )
     1.53250190E-03    2          22        22   # BR(h -> gam     gam    )
     1.05590287E-03    2          22        23   # BR(h -> Z       gam    )
     1.44460918E-01    2          24       -24   # BR(h -> W+      W-     )
     1.81981724E-02    2          23        23   # BR(h -> Z       Z      )
#
#         PDG            Width
DECAY        35     1.24654565E+02   # H decays
#          BR         NDA      ID1       ID2
     8.01186406E-01    2           5        -5   # BR(H -> b       bb     )
     1.62088055E-01    2         -15        15   # BR(H -> tau+    tau-   )
     5.87749386E-04    2         -13        13   # BR(H -> mu+     mu-    )
     1.27197980E-04    2           3        -3   # BR(H -> s       sb     )
     5.29607607E-09    2           4        -4   # BR(H -> c       cb     )
     5.22910138E-04    2           6        -6   # BR(H -> t       tb     )
     1.17716064E-05    2          21        21   # BR(H -> g       g      )
     9.67606380E-09    2          22        22   # BR(H -> gam     gam    )
     6.31632699E-09    2          23        22   # BR(H -> Z       gam    )
     1.14824232E-09    2          24       -24   # BR(H -> W+      W-     )
     5.73175072E-10    2          23        23   # BR(H -> Z       Z      )
     9.03113948E-08    2          25        25   # BR(H -> h       h      )
     2.90986571E-04    2     1000024  -1000024   # BR(H -> ~chi_1+ ~chi_1-)
     1.15359730E-02    2     1000024  -1000037   # BR(H -> ~chi_1+ ~chi_2-)
     1.15359730E-02    2     1000037  -1000024   # BR(H -> ~chi_2+ ~chi_1-)
     1.45475689E-04    2     1000022   1000022   # BR(H -> ~chi_10 ~chi_10)
     3.43764240E-03    2     1000022   1000023   # BR(H -> ~chi_10 ~chi_20)
     7.92488138E-03    2     1000022   1000025   # BR(H -> ~chi_10 ~chi_30)
     2.61552801E-04    2     1000022   1000035   # BR(H -> ~chi_10 ~chi_40)
     1.84581534E-08    2     2000002  -2000002   # BR(H -> ~u_R    ~u_R*  )
     1.84581534E-08    2     2000004  -2000004   # BR(H -> ~c_R    ~c_R*  )
     1.97755801E-09    2     2000001  -2000001   # BR(H -> ~d_R    ~d_R*  )
     1.97755801E-09    2     2000003  -2000003   # BR(H -> ~s_R    ~s_R*  )
     3.43217589E-04    2     1000005  -1000005   # BR(H -> ~b_1    ~b_1*  )
     3.84276467E-09    2     1000011  -1000011   # BR(H -> ~e_L-   ~e_L+  )
     1.01242781E-08    2     2000011  -2000011   # BR(H -> ~e_R-   ~e_R+  )
     3.84276467E-09    2     1000013  -1000013   # BR(H -> ~mu_L-  ~mu_L+ )
     1.01242781E-08    2     2000013  -2000013   # BR(H -> ~mu_R-  ~mu_R+ )
     1.29633385E-08    2     1000012  -1000012   # BR(H -> ~nu_eL  ~nu_eL*   )
     1.29633385E-08    2     1000014  -1000014   # BR(H -> ~nu_muL ~nu_muL*  )
#
#         PDG            Width
DECAY        36     1.24619909E+02   # A decays
#          BR         NDA      ID1       ID2
     8.01444607E-01    2           5        -5   # BR(A -> b       bb     )
     1.62133860E-01    2         -15        15   # BR(A -> tau+    tau-   )
     5.87915020E-04    2         -13        13   # BR(A -> mu+     mu-    )
     1.27237479E-04    2           3        -3   # BR(A -> s       sb     )
     5.34822776E-09    2           4        -4   # BR(A -> c       cb     )
     5.25669411E-04    2           6        -6   # BR(A -> t       tb     )
     1.64363783E-05    2          21        21   # BR(A -> g       g      )
     3.32242928E-09    2          22        22   # BR(A -> gam     gam    )
     1.27144461E-08    2          23        22   # BR(A -> Z       gam    )
     1.16543540E-09    2          23        25   # BR(A -> Z       h      )
     2.96332076E-04    2     1000024  -1000024   # BR(A -> ~chi_1+ ~chi_1-)
     1.15384798E-02    2     1000024  -1000037   # BR(A -> ~chi_1+ ~chi_2-)
     1.15384798E-02    2     1000037  -1000024   # BR(A -> ~chi_2+ ~chi_1-)
     1.48143323E-04    2     1000022   1000022   # BR(A -> ~chi_10 ~chi_10)
     7.34718883E-03    2     1000022   1000023   # BR(A -> ~chi_10 ~chi_20)
     3.64159281E-03    2     1000022   1000025   # BR(A -> ~chi_10 ~chi_30)
     6.54034714E-04    2     1000022   1000035   # BR(A -> ~chi_10 ~chi_40)
#
#         PDG            Width
DECAY        37     6.47109530E+01   # H+ decays
#          BR         NDA      ID1       ID2
     1.03783065E-03    2           4        -5   # BR(H+ -> c       bb     )
     3.12303164E-01    2         -15        16   # BR(H+ -> tau+    nu_tau )
     1.13244525E-03    2         -13        14   # BR(H+ -> mu+     nu_mu  )
     1.03782993E-05    2           2        -5   # BR(H+ -> u       bb     )
     1.22658348E-05    2           2        -3   # BR(H+ -> u       sb     )
     2.41438767E-04    2           4        -3   # BR(H+ -> c       sb     )
     6.17954928E-01    2           6        -5   # BR(H+ -> t       bb     )
     2.24662050E-09    2          24        25   # BR(H+ -> W+      h      )
     9.32776116E-15    2          24        36   # BR(H+ -> W+      A      )
     1.86030335E-12    2     1000024   1000022   # BR(H+ -> ~chi_1+ ~chi_10)
     2.08549324E-02    2     1000024   1000023   # BR(H+ -> ~chi_1+ ~chi_20)
     2.23641745E-02    2     1000024   1000025   # BR(H+ -> ~chi_1+ ~chi_30)
     1.77160121E-03    2     1000024   1000035   # BR(H+ -> ~chi_1+ ~chi_40)
     2.23167788E-02    2     1000037   1000022   # BR(H+ -> ~chi_2+ ~chi_10)
     2.98648372E-08    2    -1000011   1000012   # BR(H+ -> ~e_L+   ~nu_eL )
     2.98648372E-08    2    -1000013   1000014   # BR(H+ -> ~mu_L+  ~nu_muL)
