#
#                              ======================
#                              | THE SUSYHIT OUTPUT |
#                              ======================
#
#
#              ------------------------------------------------------
#              |     This is the output of the SUSY-HIT package     |
#              |  created by A.Djouadi, M.Muehlleitner and M.Spira. |
#              |  In case of problems with SUSY-HIT email to        |
#              |           margarete.muehlleitner@cern.ch           |
#              |           michael.spira@psi.ch                     |
#              |           abdelhak.djouadi@cern.ch                 |
#              ------------------------------------------------------
#
#              ------------------------------------------------------
#              |  SUSY Les Houches Accord - MSSM Spectrum + Decays  |
#              |              based on the decay programs           |
#              |                                                    |
#              |                     SDECAY 1.3b                    |
#              |                                                    |
#              |  Authors: M.Muhlleitner, A.Djouadi and Y.Mambrini  |
#              |  Ref.:    Comput.Phys.Commun.168(2005)46           |
#              |           [hep-ph/0311167]                         |
#              |                                                    |
#              |                     HDECAY 3.4                     |
#              |                                                    |
#              |  By: A.Djouadi,J.Kalinowski,M.Muhlleitner,M.Spira  |
#              |  Ref.:    Comput.Phys.Commun.108(1998)56           |
#              |           [hep-ph/9704448]                         |
#              |                                                    |
#              |                                                    |
#              |  If not stated otherwise all DRbar couplings and   |
#              |  soft SUSY breaking masses are given at the scale  |
#              |  Q=  0.19507770E+04
#              |                                                    |
#              ------------------------------------------------------
#
#
BLOCK DCINFO  # Decay Program information
     1   SDECAY/HDECAY # decay calculator
     2   1.3b  /3.4    # version number
#
BLOCK SPINFO  # Spectrum calculator information
     1     SOFTSUSY    # spectrum calculator               
     2     3.4.0       # version number                    
#
BLOCK MODSEL  # Model selection
     1     0   #  nonUniversal                                     
#
BLOCK SMINPUTS  # Standard Model inputs
         1     1.27908970E+02   # alpha_em^-1(M_Z)^MSbar
         2     1.16637870E-05   # G_F [GeV^-2]
         3     1.18400000E-01   # alpha_S(M_Z)^MSbar
         4     9.11876000E+01   # M_Z pole mass
         5     4.18000000E+00   # mb(mb)^MSbar
         6     1.73200000E+02   # mt pole mass
         7     1.77700000E+00   # mtau pole mass
#
BLOCK MINPAR  # Input parameters - minimal models
         3     8.65000000E+00   # tanb                
#
BLOCK EXTPAR  # Input parameters - non-minimal models
         0    -1.00000000E+00   # Set                 
         1    -2.81240000E+02   # M_1(MX)             
         2     2.85700000E+02   # M_2(MX)             
         3     3.64562000E+03   # M_3(MX)             
        11    -3.33101000E+03   # At(MX)              
        12    -1.35327000E+03   # Ab(MX)              
        13    -3.48960000E+03   # Atau(MX)            
        23     1.21456000E+03   # mu(MX)              
        26     5.58810000E+02   # mA(pole)            
        31     1.00158000E+03   # meL(MX)             
        32     1.00158000E+03   # mmuL(MX)            
        33     3.72510000E+02   # mtauL(MX)           
        34     2.67427000E+03   # meR(MX)             
        35     2.67427000E+03   # mmuR(MX)            
        36     2.52235000E+03   # mtauR(MX)           
        41     2.42440000E+03   # mqL1(MX)            
        42     2.42440000E+03   # mqL2(MX)            
        43     2.76361000E+03   # mqL3(MX)            
        44     1.35708000E+03   # muR(MX)             
        45     1.35708000E+03   # mcR(MX)             
        46     1.38012000E+03   # mtR(MX)             
        47     2.34321000E+03   # mdR(MX)             
        48     2.34321000E+03   # msR(MX)             
        49     6.30740000E+02   # mbR(MX)             
#
BLOCK MASS  # Mass Spectrum
# PDG code           mass       particle
        24     8.03725239E+01   # W+
        25     1.25418052E+02   # h
        35     5.59218791E+02   # H
        36     5.58810010E+02   # A
        37     5.64521954E+02   # H+
         5     4.81876030E+00   # b-quark pole mass calculated from mb(mb)_Msbar
   1000001     2.47129221E+03   # ~d_L
   2000001     2.38452254E+03   # ~d_R
   1000002     2.47016634E+03   # ~u_L
   2000002     1.36671544E+03   # ~u_R
   1000003     2.47129221E+03   # ~s_L
   2000003     2.38452254E+03   # ~s_R
   1000004     2.47016634E+03   # ~c_L
   2000004     1.36671544E+03   # ~c_R
   1000005     5.69142480E+02   # ~b_1
   2000005     2.78793948E+03   # ~b_2
   1000006     1.36433621E+03   # ~t_1
   2000006     2.79846689E+03   # ~t_2
   1000011     1.00487560E+03   # ~e_L
   2000011     2.67677595E+03   # ~e_R
   1000012     1.00155206E+03   # ~nu_eL
   1000013     1.00487560E+03   # ~mu_L
   2000013     2.67677595E+03   # ~mu_R
   1000014     1.00155206E+03   # ~nu_muL
   1000015     3.79237772E+02   # ~tau_1
   2000015     2.52415268E+03   # ~tau_2
   1000016     3.71169046E+02   # ~nu_tauL
   1000021     3.58425781E+03   # ~g
   1000022    -2.78613174E+02   # ~chi_10
   1000023     3.00708142E+02   # ~chi_20
   1000025    -1.23557567E+03   # ~chi_30
   1000035     1.23767006E+03   # ~chi_40
   1000024     3.00870527E+02   # ~chi_1+
   1000037     1.23886214E+03   # ~chi_2+
#
BLOCK NMIX  # Neutralino Mixing Matrix
  1  1     9.99306153E-01   # N_11
  1  2    -8.55495720E-05   # N_12
  1  3     3.70296013E-02   # N_13
  1  4     4.00185950E-03   # N_14
  2  1     2.51392686E-03   # N_21
  2  2     9.97383585E-01   # N_22
  2  3    -6.81349343E-02   # N_23
  2  4     2.40269825E-02   # N_24
  3  1    -2.89752293E-02   # N_31
  3  2     3.12330391E-02   # N_32
  3  3     7.05572185E-01   # N_33
  3  4     7.07356222E-01   # N_34
  4  1    -2.32664958E-02   # N_41
  4  2     6.51956665E-02   # N_42
  4  3     7.04382233E-01   # N_43
  4  4    -7.06437446E-01   # N_44
#
BLOCK UMIX  # Chargino Mixing Matrix U
  1  1     9.95351748E-01   # U_11
  1  2    -9.63062736E-02   # U_12
  2  1     9.63062736E-02   # U_21
  2  2     9.95351748E-01   # U_22
#
BLOCK VMIX  # Chargino Mixing Matrix V
  1  1     9.99421784E-01   # V_11
  1  2    -3.40014488E-02   # V_12
  2  1     3.40014488E-02   # V_21
  2  2     9.99421784E-01   # V_22
#
BLOCK STOPMIX  # Stop Mixing Matrix
  1  1     8.47438374E-02   # cos(theta_t)
  1  2     9.96402771E-01   # sin(theta_t)
  2  1    -9.96402771E-01   # -sin(theta_t)
  2  2     8.47438374E-02   # cos(theta_t)
#
BLOCK SBOTMIX  # Sbottom Mixing Matrix
  1  1     3.63805148E-03   # cos(theta_b)
  1  2     9.99993382E-01   # sin(theta_b)
  2  1    -9.99993382E-01   # -sin(theta_b)
  2  2     3.63805148E-03   # cos(theta_b)
#
BLOCK STAUMIX  # Stau Mixing Matrix
  1  1     9.99992253E-01   # cos(theta_tau)
  1  2     3.93623424E-03   # sin(theta_tau)
  2  1    -3.93623424E-03   # -sin(theta_tau)
  2  2     9.99992253E-01   # cos(theta_tau)
#
BLOCK ALPHA  # Higgs mixing
          -1.28759392E-01   # Mixing angle in the neutral Higgs boson sector
#
BLOCK HMIX Q=  1.95077700E+03  # DRbar Higgs Parameters
         1     1.22819541E+03   # mu(Q)MSSM           
         2     8.29097930E+00   # tan                 
         3     2.42818377E+02   # higgs               
         4     3.98300028E+05   # mA^2(Q)MSSM         
#
BLOCK GAUGE Q=  1.95077700E+03  # The gauge couplings
     1     3.63725177E-01   # gprime(Q) DRbar
     2     6.41056817E-01   # g(Q) DRbar
     3     1.01790925E+00   # g3(Q) DRbar
#
BLOCK AU Q=  1.95077700E+03  # The trilinear couplings
  1  1     0.00000000E+00   # A_u(Q) DRbar
  2  2     0.00000000E+00   # A_c(Q) DRbar
  3  3    -3.33100999E+03   # A_t(Q) DRbar
#
BLOCK AD Q=  1.95077700E+03  # The trilinear couplings
  1  1     0.00000000E+00   # A_d(Q) DRbar
  2  2     0.00000000E+00   # A_s(Q) DRbar
  3  3    -1.35327000E+03   # A_b(Q) DRbar
#
BLOCK AE Q=  1.95077700E+03  # The trilinear couplings
  1  1     0.00000000E+00   # A_e(Q) DRbar
  2  2     0.00000000E+00   # A_mu(Q) DRbar
  3  3    -3.48960000E+03   # A_tau(Q) DRbar
#
BLOCK Yu Q=  1.95077700E+03  # The Yukawa couplings
  1  1     0.00000000E+00   # y_u(Q) DRbar
  2  2     0.00000000E+00   # y_c(Q) DRbar
  3  3     8.28214978E-01   # y_t(Q) DRbar
#
BLOCK Yd Q=  1.95077700E+03  # The Yukawa couplings
  1  1     0.00000000E+00   # y_d(Q) DRbar
  2  2     0.00000000E+00   # y_s(Q) DRbar
  3  3     1.10789714E-01   # y_b(Q) DRbar
#
BLOCK Ye Q=  1.95077700E+03  # The Yukawa couplings
  1  1     0.00000000E+00   # y_e(Q) DRbar
  2  2     0.00000000E+00   # y_mu(Q) DRbar
  3  3     8.64639550E-02   # y_tau(Q) DRbar
#
BLOCK MSOFT Q=  1.95077700E+03  # The soft SUSY breaking masses at the scale Q
         1    -2.81240000E+02   # M_1(Q)              
         2     2.85700000E+02   # M_2(Q)              
         3     3.64562000E+03   # M_3(Q)              
        21    -1.22636515E+06   # mH1^2(Q)            
        22    -1.49943783E+06   # mH2^2(Q)            
        31     1.00158000E+03   # meL(Q)              
        32     1.00158000E+03   # mmuL(Q)             
        33     3.72510000E+02   # mtauL(Q)            
        34     2.67427000E+03   # meR(Q)              
        35     2.67427000E+03   # mmuR(Q)             
        36     2.52235000E+03   # mtauR(Q)            
        41     2.42439999E+03   # mqL1(Q)             
        42     2.42439999E+03   # mqL2(Q)             
        43     2.76360999E+03   # mqL3(Q)             
        44     1.35707999E+03   # muR(Q)              
        45     1.35707999E+03   # mcR(Q)              
        46     1.38011996E+03   # mtR(Q)              
        47     2.34320999E+03   # mdR(Q)              
        48     2.34320999E+03   # msR(Q)              
        49     6.30739971E+02   # mbR(Q)              
#
Block HiggsBoundsInputHiggsCouplingsFermions
# ScalarNormEffCoupSq PseudoSNormEffCoupSq NP   IP1 IP2 IP2
    1.14984817E+00    0.00000000E+00        3  25   5   5  # h0-b-b eff. coupling^2, normalised to SM
    6.85904896E+01    0.00000000E+00        3  35   5   5  # H0-b-b eff. coupling^2, normalised to SM
    0.00000000E+00    6.87403378E+01        3  36   5   5  # A0-b-b eff. coupling^2, normalised to SM
#
    9.97820084E-01    0.00000000E+00        3  25   6   6  # h0-t-t eff. coupling^2, normalised to SM
    1.67274152E-02    0.00000000E+00        3  35   6   6  # H0-t-t eff. coupling^2, normalised to SM
    0.00000000E+00    1.45474991E-02        3  36   6   6  # A0-t-t eff. coupling^2, normalised to SM
#
    1.14984817E+00    0.00000000E+00        3  25  15  15  # h0-tau-tau eff. coupling^2, normalised to SM
    6.85904896E+01    0.00000000E+00        3  35  15  15  # H0-tau-tau eff. coupling^2, normalised to SM
    0.00000000E+00    6.87403378E+01        3  36  15  15  # A0-tau-tau eff. coupling^2, normalised to SM
#
Block HiggsBoundsInputHiggsCouplingsBosons
    9.99923855E-01        3  25  24  24  # h0-W-W eff. coupling^2, normalised to SM
    7.61446032E-05        3  35  24  24  # H0-W-W eff. coupling^2, normalised to SM
    0.00000000E+00        3  36  24  24  # A0-W-W eff. coupling^2, normalised to SM
#
    9.99923855E-01        3  25  23  23  # h0-Z-Z eff. coupling^2, normalised to SM
    7.61446032E-05        3  35  23  23  # H0-Z-Z eff. coupling^2, normalised to SM
    0.00000000E+00        3  36  23  23  # A0-Z-Z eff. coupling^2, normalised to SM
#
    8.68867526E-01        3  25  21  21  # h0-g-g eff. coupling^2, normalised to SM
    4.44325455E-04        3  35  21  21  # H0-g-g eff. coupling^2, normalised to SM
    1.06956908E-03        3  36  21  21  # A0-g-g eff. coupling^2, normalised to SM
#
    0.00000000E+00        3  25  25  23  # h0-h0-Z eff. coupling^2, normalised to SM
    0.00000000E+00        3  35  25  23  # H0-h0-Z eff. coupling^2, normalised to SM
    7.61446032E-05        3  36  25  23  # A0-h0-Z eff. coupling^2, normalised to SM
    0.00000000E+00        3  35  35  23  # H0-H0-Z eff. coupling^2, normalised to SM
    9.99923855E-01        3  36  35  23  # A0-H0-Z eff. coupling^2, normalised to SM
    0.00000000E+00        3  36  36  23  # A0-A0-Z eff. coupling^2, normalised to SM
#
    0.00000000E+00        4  25  21  21  23  # h0-g-g-Z eff. coupling^2, normalised to SM
    0.00000000E+00        4  35  21  21  23  # H0-g-g-Z eff. coupling^2, normalised to SM
    0.00000000E+00        4  36  21  21  23  # A0-g-g-Z eff. coupling^2, normalised to SM
#
#
#
#                             =================
#                             |The decay table|
#                             =================
#
# - The QCD corrections to the decays gluino -> squark  + quark
#                                     squark -> gaugino + quark_prime
#                                     squark -> squark_prime + Higgs
#                                     squark -> gluino  + quark
#   are included.
#
# - The multi-body decays for the inos, stops and sbottoms are included.
#
# - The loop induced decays for the gluino, neutralinos and stops
#   are included.
#
# - The SUSY decays of the top quark are included.
#
#
#         PDG            Width
DECAY         6     1.44809979E+00   # top decays
#          BR         NDA      ID1       ID2
     1.00000000E+00    2           5        24   # BR(t ->  b    W+)
#
#         PDG            Width
DECAY   1000021     3.57922077E+02   # gluino decays
#          BR         NDA      ID1       ID2
     2.66912942E-02    2     1000001        -1   # BR(~g -> ~d_L  db)
     2.66912942E-02    2    -1000001         1   # BR(~g -> ~d_L* d )
     3.01329053E-02    2     2000001        -1   # BR(~g -> ~d_R  db)
     3.01329053E-02    2    -2000001         1   # BR(~g -> ~d_R* d )
     2.67353788E-02    2     1000002        -2   # BR(~g -> ~u_L  ub)
     2.67353788E-02    2    -1000002         2   # BR(~g -> ~u_L* u )
     7.08310976E-02    2     2000002        -2   # BR(~g -> ~u_R  ub)
     7.08310976E-02    2    -2000002         2   # BR(~g -> ~u_R* u )
     2.66912942E-02    2     1000003        -3   # BR(~g -> ~s_L  sb)
     2.66912942E-02    2    -1000003         3   # BR(~g -> ~s_L* s )
     3.01329053E-02    2     2000003        -3   # BR(~g -> ~s_R  sb)
     3.01329053E-02    2    -2000003         3   # BR(~g -> ~s_R* s )
     2.67353593E-02    2     1000004        -4   # BR(~g -> ~c_L  cb)
     2.67353593E-02    2    -1000004         4   # BR(~g -> ~c_L* c )
     7.08310916E-02    2     2000004        -4   # BR(~g -> ~c_R  cb)
     7.08310916E-02    2    -2000004         4   # BR(~g -> ~c_R* c )
     9.13537492E-02    2     1000005        -5   # BR(~g -> ~b_1  bb)
     9.13537492E-02    2    -1000005         5   # BR(~g -> ~b_1* b )
     1.52380067E-02    2     2000005        -5   # BR(~g -> ~b_2  bb)
     1.52380067E-02    2    -2000005         5   # BR(~g -> ~b_2* b )
     6.94299338E-02    2     1000006        -6   # BR(~g -> ~t_1  tb)
     6.94299338E-02    2    -1000006         6   # BR(~g -> ~t_1* t )
     1.51969840E-02    2     2000006        -6   # BR(~g -> ~t_2  tb)
     1.51969840E-02    2    -2000006         6   # BR(~g -> ~t_2* t )
#
#         PDG            Width
DECAY   1000006     3.60573685E+00   # stop1 decays
#          BR         NDA      ID1       ID2
     7.74729503E-01    2     1000022         6   # BR(~t_1 -> ~chi_10 t )
     2.22012712E-02    2     1000023         6   # BR(~t_1 -> ~chi_20 t )
     4.62107629E-02    2     1000024         5   # BR(~t_1 -> ~chi_1+ b )
     1.56726966E-01    2     1000037         5   # BR(~t_1 -> ~chi_2+ b )
     1.08049921E-04    2     1000005        37   # BR(~t_1 -> ~b_1    H+)
     2.34474088E-05    2     1000005        24   # BR(~t_1 -> ~b_1    W+)
#
#         PDG            Width
DECAY   2000006     1.05049572E+02   # stop2 decays
#          BR         NDA      ID1       ID2
     4.30274053E-03    2     1000022         6   # BR(~t_2 -> ~chi_10 t )
     1.03658412E-01    2     1000023         6   # BR(~t_2 -> ~chi_20 t )
     1.14793053E-01    2     1000025         6   # BR(~t_2 -> ~chi_30 t )
     1.19532611E-01    2     1000035         6   # BR(~t_2 -> ~chi_40 t )
     2.09497219E-01    2     1000024         5   # BR(~t_2 -> ~chi_1+ b )
     7.04060921E-03    2     1000037         5   # BR(~t_2 -> ~chi_2+ b )
     2.05222786E-01    2     1000006        25   # BR(~t_2 -> ~t_1    h )
     9.78614960E-03    2     1000006        35   # BR(~t_2 -> ~t_1    H )
     1.08703015E-02    2     1000006        36   # BR(~t_2 -> ~t_1    A )
     1.10436347E-03    2     1000005        37   # BR(~t_2 -> ~b_1    H+)
     2.12667711E-01    2     1000006        23   # BR(~t_2 -> ~t_1    Z )
     1.52404294E-03    2     1000005        24   # BR(~t_2 -> ~b_1    W+)
#
#         PDG            Width
DECAY   1000005     1.93544261E-01   # sbottom1 decays
#          BR         NDA      ID1       ID2
     9.94107854E-01    2     1000022         5   # BR(~b_1 -> ~chi_10 b )
     2.57584048E-03    2     1000023         5   # BR(~b_1 -> ~chi_20 b )
     3.31630546E-03    2    -1000024         6   # BR(~b_1 -> ~chi_1- t )
#
#         PDG            Width
DECAY   2000005     1.04045497E+02   # sbottom2 decays
#          BR         NDA      ID1       ID2
     3.84329977E-03    2     1000022         5   # BR(~b_2 -> ~chi_10 b )
     1.06353997E-01    2     1000023         5   # BR(~b_2 -> ~chi_20 b )
     2.20128188E-03    2     1000025         5   # BR(~b_2 -> ~chi_30 b )
     2.44511101E-03    2     1000035         5   # BR(~b_2 -> ~chi_40 b )
     2.10468695E-01    2    -1000024         6   # BR(~b_2 -> ~chi_1- t )
     2.36142522E-01    2    -1000037         6   # BR(~b_2 -> ~chi_2- t )
     7.78409025E-04    2     1000005        25   # BR(~b_2 -> ~b_1    h )
     5.40102544E-04    2     1000005        35   # BR(~b_2 -> ~b_1    H )
     5.51025646E-04    2     1000005        36   # BR(~b_2 -> ~b_1    A )
     2.17790812E-02    2     1000006       -37   # BR(~b_2 -> ~t_1    H-)
     7.85440522E-04    2     1000005        23   # BR(~b_2 -> ~b_1    Z )
     4.14111034E-01    2     1000006       -24   # BR(~b_2 -> ~t_1    W-)
#
#         PDG            Width
DECAY   1000002     2.96115244E+01   # sup_L decays
#          BR         NDA      ID1       ID2
     1.18148736E-02    2     1000022         2   # BR(~u_L -> ~chi_10 u)
     3.28290169E-01    2     1000023         2   # BR(~u_L -> ~chi_20 u)
     1.27290620E-04    2     1000025         2   # BR(~u_L -> ~chi_30 u)
     7.07790007E-04    2     1000035         2   # BR(~u_L -> ~chi_40 u)
     6.58617664E-01    2     1000024         1   # BR(~u_L -> ~chi_1+ d)
     4.42213595E-04    2     1000037         1   # BR(~u_L -> ~chi_2+ d)
#
#         PDG            Width
DECAY   2000002     3.01591443E+00   # sup_R decays
#          BR         NDA      ID1       ID2
     9.99942120E-01    2     1000022         2   # BR(~u_R -> ~chi_10 u)
     6.23882055E-06    2     1000023         2   # BR(~u_R -> ~chi_20 u)
     3.17659925E-05    2     1000025         2   # BR(~u_R -> ~chi_30 u)
     1.98755748E-05    2     1000035         2   # BR(~u_R -> ~chi_40 u)
#
#         PDG            Width
DECAY   1000001     2.95509961E+01   # sdown_L decays
#          BR         NDA      ID1       ID2
     1.18658795E-02    2     1000022         1   # BR(~d_L -> ~chi_10 d)
     3.28485334E-01    2     1000023         1   # BR(~d_L -> ~chi_20 d)
     2.59488808E-04    2     1000025         1   # BR(~d_L -> ~chi_30 d)
     9.30402989E-04    2     1000035         1   # BR(~d_L -> ~chi_40 d)
     6.54900244E-01    2    -1000024         2   # BR(~d_L -> ~chi_1- u)
     3.55865109E-03    2    -1000037         2   # BR(~d_L -> ~chi_2- u)
#
#         PDG            Width
DECAY   2000001     1.35352447E+00   # sdown_R decays
#          BR         NDA      ID1       ID2
     9.99230404E-01    2     1000022         1   # BR(~d_R -> ~chi_10 d)
     6.29567632E-06    2     1000023         1   # BR(~d_R -> ~chi_20 d)
     4.64525655E-04    2     1000025         1   # BR(~d_R -> ~chi_30 d)
     2.98774980E-04    2     1000035         1   # BR(~d_R -> ~chi_40 d)
#
#         PDG            Width
DECAY   1000004     2.97254785E+01   # scharm_L decays
#          BR         NDA      ID1       ID2
     1.18163743E-02    2     1000022         4   # BR(~c_L -> ~chi_10 c)
     3.28291801E-01    2     1000023         4   # BR(~c_L -> ~chi_20 c)
     1.26659450E-04    2     1000025         4   # BR(~c_L -> ~chi_30 c)
     7.04267741E-04    2     1000035         4   # BR(~c_L -> ~chi_40 c)
     6.58620888E-01    2     1000024         3   # BR(~c_L -> ~chi_1+ s)
     4.40009041E-04    2     1000037         3   # BR(~c_L -> ~chi_2+ s)
#
#         PDG            Width
DECAY   2000004     2.93329335E+00   # scharm_R decays
#          BR         NDA      ID1       ID2
     9.99944116E-01    2     1000022         4   # BR(~c_R -> ~chi_10 c)
     6.23808621E-06    2     1000023         4   # BR(~c_R -> ~chi_20 c)
     3.05447445E-05    2     1000025         4   # BR(~c_R -> ~chi_30 c)
     1.91011054E-05    2     1000035         4   # BR(~c_R -> ~chi_40 c)
#
#         PDG            Width
DECAY   1000003     2.96650403E+01   # sstrange_L decays
#          BR         NDA      ID1       ID2
     1.18676016E-02    2     1000022         3   # BR(~s_L -> ~chi_10 s)
     3.28492919E-01    2     1000023         3   # BR(~s_L -> ~chi_20 s)
     2.58207665E-04    2     1000025         3   # BR(~s_L -> ~chi_30 s)
     9.25792764E-04    2     1000035         3   # BR(~s_L -> ~chi_40 s)
     6.54914501E-01    2    -1000024         4   # BR(~s_L -> ~chi_1- c)
     3.54097798E-03    2    -1000037         4   # BR(~s_L -> ~chi_2- c)
#
#         PDG            Width
DECAY   2000003     1.35598764E+00   # sstrange_R decays
#          BR         NDA      ID1       ID2
     9.99234461E-01    2     1000022         3   # BR(~s_R -> ~chi_10 s)
     6.29492960E-06    2     1000023         3   # BR(~s_R -> ~chi_20 s)
     4.62060338E-04    2     1000025         3   # BR(~s_R -> ~chi_30 s)
     2.97183355E-04    2     1000035         3   # BR(~s_R -> ~chi_40 s)
#
#         PDG            Width
DECAY   1000011     1.12673040E+01   # selectron_L decays
#          BR         NDA      ID1       ID2
     9.98452292E-02    2     1000022        11   # BR(~e_L -> ~chi_10 e-)
     3.01483372E-01    2     1000023        11   # BR(~e_L -> ~chi_20 e-)
     5.98671399E-01    2    -1000024        12   # BR(~e_L -> ~chi_1- nu_e)
#
#         PDG            Width
DECAY   2000011     1.37796113E+01   # selectron_R decays
#          BR         NDA      ID1       ID2
     9.99119912E-01    2     1000022        11   # BR(~e_R -> ~chi_10 e-)
     6.30021937E-06    2     1000023        11   # BR(~e_R -> ~chi_20 e-)
     5.31633125E-04    2     1000025        11   # BR(~e_R -> ~chi_30 e-)
     3.42154226E-04    2     1000035        11   # BR(~e_R -> ~chi_40 e-)
#
#         PDG            Width
DECAY   1000013     1.12673039E+01   # smuon_L decays
#          BR         NDA      ID1       ID2
     9.98452277E-02    2     1000022        13   # BR(~mu_L -> ~chi_10 mu-)
     3.01483367E-01    2     1000023        13   # BR(~mu_L -> ~chi_20 mu-)
     5.98671406E-01    2    -1000024        14   # BR(~mu_L -> ~chi_1- nu_mu)
#
#         PDG            Width
DECAY   2000013     1.37796113E+01   # smuon_R decays
#          BR         NDA      ID1       ID2
     9.99119912E-01    2     1000022        13   # BR(~mu_R -> ~chi_10 mu-)
     6.30021937E-06    2     1000023        13   # BR(~mu_R -> ~chi_20 mu-)
     5.31633124E-04    2     1000025        13   # BR(~mu_R -> ~chi_30 mu-)
     3.42154225E-04    2     1000035        13   # BR(~mu_R -> ~chi_40 mu-)
#
#         PDG            Width
DECAY   1000015     7.40439449E-01   # stau_1 decays
#          BR         NDA      ID1       ID2
     1.42471481E-01    2     1000022        15   # BR(~tau_1 -> ~chi_10  tau-)
     2.87737965E-01    2     1000023        15   # BR(~tau_1 -> ~chi_20  tau-)
     5.69790553E-01    2    -1000024        16   # BR(~tau_1 -> ~chi_1-  nu_tau)
#
#         PDG            Width
DECAY   2000015     1.48925617E+01   # stau_2 decays
#          BR         NDA      ID1       ID2
     8.69369875E-01    2     1000022        15   # BR(~tau_2 -> ~chi_10  tau-)
     6.10105767E-05    2     1000023        15   # BR(~tau_2 -> ~chi_20  tau-)
     7.70609546E-03    2     1000025        15   # BR(~tau_2 -> ~chi_30  tau-)
     7.53057557E-03    2     1000035        15   # BR(~tau_2 -> ~chi_40  tau-)
     1.10814535E-04    2    -1000024        16   # BR(~tau_2 -> ~chi_1-  nu_tau)
     1.44728544E-02    2    -1000037        16   # BR(~tau_2 -> ~chi_2-  nu_tau)
     4.03120216E-02    2     1000016       -37   # BR(~tau_2 -> ~nu_tauL H-)
     9.88383745E-03    2     1000016       -24   # BR(~tau_2 -> ~nu_tauL W-)
     5.35336369E-03    2     1000015        25   # BR(~tau_2 -> ~tau_1   h)
     1.99831210E-02    2     1000015        35   # BR(~tau_2 -> ~tau_1   H)
     2.01609526E-02    2     1000015        36   # BR(~tau_2 -> ~tau_1   A)
     5.05547790E-03    2     1000015        23   # BR(~tau_2 -> ~tau_1   Z)
#
#         PDG            Width
DECAY   1000012     1.12519833E+01   # snu_eL decays
#          BR         NDA      ID1       ID2
     9.96002911E-02    2     1000022        12   # BR(~nu_eL -> ~chi_10 nu_e)
     2.98787934E-01    2     1000023        12   # BR(~nu_eL -> ~chi_20 nu_e)
     6.01611775E-01    2     1000024        11   # BR(~nu_eL -> ~chi_1+ e-)
#
#         PDG            Width
DECAY   1000014     1.12519832E+01   # snu_muL decays
#          BR         NDA      ID1       ID2
     9.96002927E-02    2     1000022        14   # BR(~nu_muL -> ~chi_10 nu_mu)
     2.98787938E-01    2     1000023        14   # BR(~nu_muL -> ~chi_20 nu_mu)
     6.01611769E-01    2     1000024        13   # BR(~nu_muL -> ~chi_1+ mu-)
#
#         PDG            Width
DECAY   1000016     6.26855197E-01   # snu_tauL decays
#          BR         NDA      ID1       ID2
     1.48332448E-01    2     1000022        16   # BR(~nu_tauL -> ~chi_10 nu_tau)
     2.83509945E-01    2     1000023        16   # BR(~nu_tauL -> ~chi_20 nu_tau)
     5.68157608E-01    2     1000024        15   # BR(~nu_tauL -> ~chi_1+ tau-)
#
#         PDG            Width
DECAY   1000024     2.71507764E-09   # chargino1+ decays
#           BR         NDA      ID1       ID2       ID3
     2.20429357E-02    3     1000022         2        -1   # BR(~chi_1+ -> ~chi_10 u    db)
     6.75156408E-08    3     1000023         2        -1   # BR(~chi_1+ -> ~chi_20 u    db)
     2.20429357E-02    3     1000022         4        -3   # BR(~chi_1+ -> ~chi_10 c    sb)
     5.81684736E-03    3     1000022       -11        12   # BR(~chi_1+ -> ~chi_10 e+   nu_e)
     2.26395336E-08    3     1000023       -11        12   # BR(~chi_1+ -> ~chi_20 e+   nu_e)
     5.81684736E-03    3     1000022       -13        14   # BR(~chi_1+ -> ~chi_10 mu+  nu_mu)
     2.26395336E-08    3     1000023       -13        14   # BR(~chi_1+ -> ~chi_20 mu+  nu_mu)
     9.44280321E-01    3     1000022       -15        16   # BR(~chi_1+ -> ~chi_10 tau+ nu_tau)
#
#         PDG            Width
DECAY   1000037     1.35261861E+01   # chargino2+ decays
#          BR         NDA      ID1       ID2
     2.07011441E-02    2    -1000005         6   # BR(~chi_2+ -> ~b_1*    t )
     5.19436835E-05    2     1000012       -11   # BR(~chi_2+ -> ~nu_eL   e+  )
     5.19436835E-05    2     1000014       -13   # BR(~chi_2+ -> ~nu_muL mu+ )
     5.94057888E-03    2     1000016       -15   # BR(~chi_2+ -> ~nu_tau1 tau+)
     4.06334772E-04    2    -1000011        12   # BR(~chi_2+ -> ~e_L+    nu_e)
     4.06334772E-04    2    -1000013        14   # BR(~chi_2+ -> ~mu_L+   nu_mu)
     2.82098156E-03    2    -1000015        16   # BR(~chi_2+ -> ~tau_1+  nu_tau)
     1.95727242E-01    2     1000024        23   # BR(~chi_2+ -> ~chi_1+  Z )
     5.22132511E-02    2     1000022        24   # BR(~chi_2+ -> ~chi_10  W+)
     1.91941219E-01    2     1000023        24   # BR(~chi_2+ -> ~chi_20  W+)
     2.01025635E-01    2     1000024        25   # BR(~chi_2+ -> ~chi_1+  h )
     9.51602498E-02    2     1000024        35   # BR(~chi_2+ -> ~chi_1+  H )
     9.67925081E-02    2     1000024        36   # BR(~chi_2+ -> ~chi_1+  A )
     3.97185453E-02    2     1000022        37   # BR(~chi_2+ -> ~chi_10  H+)
     9.70420878E-02    2     1000023        37   # BR(~chi_2+ -> ~chi_20  H+)
#
#         PDG            Width
DECAY   1000022     0.00000000E+00   # neutralino1 decays
#
#         PDG            Width
DECAY   1000023     3.08970151E-09   # neutralino2 decays
#          BR         NDA      ID1       ID2
     1.96177253E-01    2     1000022        22   # BR(~chi_20 -> ~chi_10 gam)
#           BR         NDA      ID1       ID2       ID3
     1.55495167E-03    3     1000022        -2         2   # BR(~chi_20 -> ~chi_10 ub      u)
     1.99521634E-03    3     1000022        -1         1   # BR(~chi_20 -> ~chi_10 db      d)
     1.55495167E-03    3     1000022        -4         4   # BR(~chi_20 -> ~chi_10 cb      c)
     1.99521634E-03    3     1000022        -3         3   # BR(~chi_20 -> ~chi_10 sb      s)
     1.86109609E-03    3     1000022        -5         5   # BR(~chi_20 -> ~chi_10 bb      b)
     8.55863384E-04    3     1000022       -11        11   # BR(~chi_20 -> ~chi_10 e+      e-)
     8.55863384E-04    3     1000022       -13        13   # BR(~chi_20 -> ~chi_10 mu+     mu-)
     3.48207225E-01    3     1000022       -15        15   # BR(~chi_20 -> ~chi_10 tau+    tau-)
     1.57823950E-04    3     1000022       -12        12   # BR(~chi_20 -> ~chi_10 nu_eb   nu_e)
     1.57823950E-04    3     1000022       -14        14   # BR(~chi_20 -> ~chi_10 nu_mub  nu_mu)
     4.44626716E-01    3     1000022       -16        16   # BR(~chi_20 -> ~chi_10 nu_taub nu_tau)
#
#         PDG            Width
DECAY   1000025     1.32803911E+01   # neutralino3 decays
#          BR         NDA      ID1       ID2
     2.15897233E-02    2     1000022        23   # BR(~chi_30 -> ~chi_10   Z )
     1.61234352E-01    2     1000023        23   # BR(~chi_30 -> ~chi_20   Z )
     1.94648359E-01    2     1000024       -24   # BR(~chi_30 -> ~chi_1+   W-)
     1.94648359E-01    2    -1000024        24   # BR(~chi_30 -> ~chi_1-   W+)
     3.19265538E-02    2     1000022        25   # BR(~chi_30 -> ~chi_10   h )
     3.51995451E-02    2     1000022        35   # BR(~chi_30 -> ~chi_10   H )
     6.49972115E-03    2     1000022        36   # BR(~chi_30 -> ~chi_10   A )
     3.69591524E-02    2     1000023        25   # BR(~chi_30 -> ~chi_20   h )
     3.01952191E-02    2     1000023        35   # BR(~chi_30 -> ~chi_20   H )
     6.66713007E-02    2     1000023        36   # BR(~chi_30 -> ~chi_20   A )
     9.63273787E-02    2     1000024       -37   # BR(~chi_30 -> ~chi_1+   H-)
     9.63273787E-02    2    -1000024        37   # BR(~chi_30 -> ~chi_1-   H+)
     1.05634385E-02    2     1000005        -5   # BR(~chi_30 -> ~b_1      bb)
     1.05634385E-02    2    -1000005         5   # BR(~chi_30 -> ~b_1*     b )
     4.77003223E-06    2     1000011       -11   # BR(~chi_30 -> ~e_L-     e+)
     4.77003223E-06    2    -1000011        11   # BR(~chi_30 -> ~e_L+     e-)
     4.77003223E-06    2     1000013       -13   # BR(~chi_30 -> ~mu_L-    mu+)
     4.77003223E-06    2    -1000013        13   # BR(~chi_30 -> ~mu_L+    mu-)
     2.85414446E-03    2     1000015       -15   # BR(~chi_30 -> ~tau_1-   tau+)
     2.85414446E-03    2    -1000015        15   # BR(~chi_30 -> ~tau_1+   tau-)
     5.08267330E-05    2     1000012       -12   # BR(~chi_30 -> ~nu_eL    nu_eb)
     5.08267330E-05    2    -1000012        12   # BR(~chi_30 -> ~nu_eL*   nu_e )
     5.08267330E-05    2     1000014       -14   # BR(~chi_30 -> ~nu_muL   nu_mub)
     5.08267330E-05    2    -1000014        14   # BR(~chi_30 -> ~nu_muL*  nu_mu )
     3.57701876E-04    2     1000016       -16   # BR(~chi_30 -> ~nu_tau1  nu_taub)
     3.57701876E-04    2    -1000016        16   # BR(~chi_30 -> ~nu_tau1* nu_tau )
#
#         PDG            Width
DECAY   1000035     1.34089800E+01   # neutralino4 decays
#          BR         NDA      ID1       ID2
     3.25827026E-02    2     1000022        23   # BR(~chi_40 -> ~chi_10   Z )
     3.71537379E-02    2     1000023        23   # BR(~chi_40 -> ~chi_20   Z )
     1.93457292E-01    2     1000024       -24   # BR(~chi_40 -> ~chi_1+   W-)
     1.93457292E-01    2    -1000024        24   # BR(~chi_40 -> ~chi_1-   W+)
     2.10083744E-02    2     1000022        25   # BR(~chi_40 -> ~chi_10   h )
     6.26055595E-03    2     1000022        35   # BR(~chi_40 -> ~chi_10   H )
     3.42384748E-02    2     1000022        36   # BR(~chi_40 -> ~chi_10   A )
     1.65938162E-01    2     1000023        25   # BR(~chi_40 -> ~chi_20   h )
     6.41187685E-02    2     1000023        35   # BR(~chi_40 -> ~chi_20   H )
     2.94593740E-02    2     1000023        36   # BR(~chi_40 -> ~chi_20   A )
     9.61993019E-02    2     1000024       -37   # BR(~chi_40 -> ~chi_1+   H-)
     9.61993019E-02    2    -1000024        37   # BR(~chi_40 -> ~chi_1-   H+)
     1.04130195E-02    2     1000005        -5   # BR(~chi_40 -> ~b_1      bb)
     1.04130195E-02    2    -1000005         5   # BR(~chi_40 -> ~b_1*     b )
     5.92376421E-05    2     1000011       -11   # BR(~chi_40 -> ~e_L-     e+)
     5.92376421E-05    2    -1000011        11   # BR(~chi_40 -> ~e_L+     e-)
     5.92376421E-05    2     1000013       -13   # BR(~chi_40 -> ~mu_L-    mu+)
     5.92376421E-05    2    -1000013        13   # BR(~chi_40 -> ~mu_L+    mu-)
     3.19525701E-03    2     1000015       -15   # BR(~chi_40 -> ~tau_1-   tau+)
     3.19525701E-03    2    -1000015        15   # BR(~chi_40 -> ~tau_1+   tau-)
     1.38134090E-04    2     1000012       -12   # BR(~chi_40 -> ~nu_eL    nu_eb)
     1.38134090E-04    2    -1000012        12   # BR(~chi_40 -> ~nu_eL*   nu_e )
     1.38134090E-04    2     1000014       -14   # BR(~chi_40 -> ~nu_muL   nu_mub)
     1.38134090E-04    2    -1000014        14   # BR(~chi_40 -> ~nu_muL*  nu_mu )
     9.60310562E-04    2     1000016       -16   # BR(~chi_40 -> ~nu_tau1  nu_taub)
     9.60310562E-04    2    -1000016        16   # BR(~chi_40 -> ~nu_tau1* nu_tau )
#
#         PDG            Width
DECAY        25     4.63461571E-03   # h decays
#          BR         NDA      ID1       ID2
     6.30214184E-01    2           5        -5   # BR(h -> b       bb     )
     6.43145054E-02    2         -15        15   # BR(h -> tau+    tau-   )
     2.27804606E-04    2         -13        13   # BR(h -> mu+     mu-    )
     2.46980240E-04    2           3        -3   # BR(h -> s       sb     )
     1.87227815E-02    2           4        -4   # BR(h -> c       cb     )
     6.87464901E-02    2          21        21   # BR(h -> g       g      )
     2.06757388E-03    2          22        22   # BR(h -> gam     gam    )
     1.39797060E-03    2          22        23   # BR(h -> Z       gam    )
     1.90219108E-01    2          24       -24   # BR(h -> W+      W-     )
     2.38426012E-02    2          23        23   # BR(h -> Z       Z      )
#
#         PDG            Width
DECAY        35     9.31609272E-01   # H decays
#          BR         NDA      ID1       ID2
     5.82936729E-01    2           5        -5   # BR(H -> b       bb     )
     8.34580893E-02    2         -15        15   # BR(H -> tau+    tau-   )
     2.98125511E-04    2         -13        13   # BR(H -> mu+     mu-    )
     2.24865792E-04    2           3        -3   # BR(H -> s       sb     )
     5.28635567E-06    2           4        -4   # BR(H -> c       cb     )
     3.09563173E-01    2           6        -6   # BR(H -> t       tb     )
     1.06826835E-03    2          21        21   # BR(H -> g       g      )
     2.95587551E-06    2          22        22   # BR(H -> gam     gam    )
     5.90170033E-07    2          23        22   # BR(H -> Z       gam    )
     4.06231121E-03    2          24       -24   # BR(H -> W+      W-     )
     1.95696606E-03    2          23        23   # BR(H -> Z       Z      )
     1.64214248E-02    2          25        25   # BR(H -> h       h      )
     1.31827793E-14    2          23        36   # BR(H -> Z       A      )
     1.21481935E-06    2     1000022   1000022   # BR(H -> ~chi_10 ~chi_10)
#
#         PDG            Width
DECAY        36     1.00379399E+00   # A decays
#          BR         NDA      ID1       ID2
     5.42173745E-01    2           5        -5   # BR(A -> b       bb     )
     7.75738816E-02    2         -15        15   # BR(A -> tau+    tau-   )
     2.77092017E-04    2         -13        13   # BR(A -> mu+     mu-    )
     2.09265987E-04    2           3        -3   # BR(A -> s       sb     )
     4.30311936E-06    2           4        -4   # BR(A -> c       cb     )
     3.74701882E-01    2           6        -6   # BR(A -> t       tb     )
     1.53700001E-03    2          21        21   # BR(A -> g       g      )
     4.18616512E-06    2          22        22   # BR(A -> gam     gam    )
     1.04214183E-06    2          23        22   # BR(A -> Z       gam    )
     3.38345509E-03    2          23        25   # BR(A -> Z       h      )
     1.34147205E-04    2     1000022   1000022   # BR(A -> ~chi_10 ~chi_10)
#
#         PDG            Width
DECAY        37     9.11834669E-01   # H+ decays
#          BR         NDA      ID1       ID2
     9.27831947E-04    2           4        -5   # BR(H+ -> c       bb     )
     8.62702091E-02    2         -15        16   # BR(H+ -> tau+    nu_tau )
     3.08154962E-04    2         -13        14   # BR(H+ -> mu+     nu_mu  )
     9.27798344E-06    2           2        -5   # BR(H+ -> u       bb     )
     1.15399796E-05    2           2        -3   # BR(H+ -> u       sb     )
     2.31697039E-04    2           4        -3   # BR(H+ -> c       sb     )
     9.08298513E-01    2           6        -5   # BR(H+ -> t       bb     )
     3.94276766E-03    2          24        25   # BR(H+ -> W+      h      )
     8.66956448E-09    2          24        36   # BR(H+ -> W+      A      )
