#
#                              ======================
#                              | THE SUSYHIT OUTPUT |
#                              ======================
#
#
#              ------------------------------------------------------
#              |     This is the output of the SUSY-HIT package     |
#              |  created by A.Djouadi, M.Muehlleitner and M.Spira. |
#              |  In case of problems with SUSY-HIT email to        |
#              |           margarete.muehlleitner@cern.ch           |
#              |           michael.spira@psi.ch                     |
#              |           abdelhak.djouadi@cern.ch                 |
#              ------------------------------------------------------
#
#              ------------------------------------------------------
#              |  SUSY Les Houches Accord - MSSM Spectrum + Decays  |
#              |              based on the decay programs           |
#              |                                                    |
#              |                     SDECAY 1.3b                    |
#              |                                                    |
#              |  Authors: M.Muhlleitner, A.Djouadi and Y.Mambrini  |
#              |  Ref.:    Comput.Phys.Commun.168(2005)46           |
#              |           [hep-ph/0311167]                         |
#              |                                                    |
#              |                     HDECAY 3.4                     |
#              |                                                    |
#              |  By: A.Djouadi,J.Kalinowski,M.Muhlleitner,M.Spira  |
#              |  Ref.:    Comput.Phys.Commun.108(1998)56           |
#              |           [hep-ph/9704448]                         |
#              |                                                    |
#              |                                                    |
#              |  If not stated otherwise all DRbar couplings and   |
#              |  soft SUSY breaking masses are given at the scale  |
#              |  Q=  0.20743350E+04
#              |                                                    |
#              ------------------------------------------------------
#
#
BLOCK DCINFO  # Decay Program information
     1   SDECAY/HDECAY # decay calculator
     2   1.3b  /3.4    # version number
#
BLOCK SPINFO  # Spectrum calculator information
     1     SOFTSUSY    # spectrum calculator               
     2     3.4.0       # version number                    
#
BLOCK MODSEL  # Model selection
     1     0   #  nonUniversal                                     
#
BLOCK SMINPUTS  # Standard Model inputs
         1     1.27908970E+02   # alpha_em^-1(M_Z)^MSbar
         2     1.16637870E-05   # G_F [GeV^-2]
         3     1.18400000E-01   # alpha_S(M_Z)^MSbar
         4     9.11876000E+01   # M_Z pole mass
         5     4.18000000E+00   # mb(mb)^MSbar
         6     1.73200000E+02   # mt pole mass
         7     1.77700000E+00   # mtau pole mass
#
BLOCK MINPAR  # Input parameters - minimal models
         3     1.95500000E+01   # tanb                
#
BLOCK EXTPAR  # Input parameters - non-minimal models
         0    -1.00000000E+00   # Set                 
         1     2.85640000E+02   # M_1(MX)             
         2     1.34612000E+03   # M_2(MX)             
         3     1.82804000E+03   # M_3(MX)             
        11     3.38371000E+03   # At(MX)              
        12    -2.74005000E+03   # Ab(MX)              
        13    -3.49986000E+03   # Atau(MX)            
        23    -2.98570000E+02   # mu(MX)              
        26     1.88406000E+03   # mA(pole)            
        31     2.36285000E+03   # meL(MX)             
        32     2.36285000E+03   # mmuL(MX)            
        33     2.78753000E+03   # mtauL(MX)           
        34     3.57750000E+03   # meR(MX)             
        35     3.57750000E+03   # mmuR(MX)            
        36     3.56367000E+03   # mtauR(MX)           
        41     7.56340000E+02   # mqL1(MX)            
        42     7.56340000E+02   # mqL2(MX)            
        43     3.31195000E+03   # mqL3(MX)            
        44     2.23217000E+03   # muR(MX)             
        45     2.23217000E+03   # mcR(MX)             
        46     1.29902000E+03   # mtR(MX)             
        47     5.59700000E+02   # mdR(MX)             
        48     5.59700000E+02   # msR(MX)             
        49     3.34874000E+03   # mbR(MX)             
#
BLOCK MASS  # Mass Spectrum
# PDG code           mass       particle
        24     8.04011046E+01   # W+
        25     1.26305726E+02   # h
        35     1.88408009E+03   # H
        36     1.88405999E+03   # A
        37     1.88610011E+03   # H+
         5     4.81876030E+00   # b-quark pole mass calculated from mb(mb)_Msbar
   1000001     8.98363083E+02   # ~d_L
   2000001     7.08476618E+02   # ~d_R
   1000002     8.94913235E+02   # ~u_L
   2000002     2.28530972E+03   # ~u_R
   1000003     8.98363083E+02   # ~s_L
   2000003     7.08476618E+02   # ~s_R
   1000004     8.94913235E+02   # ~c_L
   2000004     2.28530972E+03   # ~c_R
   1000005     3.33404613E+03   # ~b_1
   2000005     3.38630099E+03   # ~b_2
   1000006     1.35823417E+03   # ~t_1
   2000006     3.34030941E+03   # ~t_2
   1000011     2.36788590E+03   # ~e_L
   2000011     3.58482216E+03   # ~e_R
   1000012     2.36627188E+03   # ~nu_eL
   1000013     2.36788590E+03   # ~mu_L
   2000013     3.58482216E+03   # ~mu_R
   1000014     2.36627188E+03   # ~nu_muL
   1000015     2.79196414E+03   # ~tau_1
   2000015     3.56954018E+03   # ~tau_2
   1000016     2.79054319E+03   # ~nu_tauL
   1000021     1.92310166E+03   # ~g
   1000022     2.65376424E+02   # ~chi_10
   1000023    -3.15222952E+02   # ~chi_20
   1000025     3.29807204E+02   # ~chi_30
   1000035     1.36013320E+03   # ~chi_40
   1000024     3.11333879E+02   # ~chi_1+
   1000037     1.36029305E+03   # ~chi_2+
#
BLOCK NMIX  # Neutralino Mixing Matrix
  1  1     8.23362135E-01   # N_11
  1  2    -2.38494239E-02   # N_12
  1  3    -4.34629709E-01   # N_13
  1  4    -3.64146970E-01   # N_14
  2  1    -5.58861362E-02   # N_21
  2  2     3.46114605E-02   # N_22
  2  3    -7.01949562E-01   # N_23
  2  4     7.09186575E-01   # N_24
  3  1     5.64752251E-01   # N_31
  3  2     4.26772526E-02   # N_32
  3  3     5.64145822E-01   # N_33
  3  4     6.00810319E-01   # N_34
  4  1    -2.53561417E-03   # N_41
  4  2     9.98204340E-01   # N_42
  4  3    -1.01646145E-02   # N_43
  4  4    -5.89775158E-02   # N_44
#
BLOCK UMIX  # Chargino Mixing Matrix U
  1  1     1.44049136E-02   # U_11
  1  2     9.99896244E-01   # U_12
  2  1    -9.99896244E-01   # U_21
  2  2     1.44049136E-02   # U_22
#
BLOCK VMIX  # Chargino Mixing Matrix V
  1  1     8.34280861E-02   # V_11
  1  2    -9.96513800E-01   # V_12
  2  1    -9.96513800E-01   # V_21
  2  2    -8.34280861E-02   # V_22
#
BLOCK STOPMIX  # Stop Mixing Matrix
  1  1    -5.08186282E-02   # cos(theta_t)
  1  2     9.98707899E-01   # sin(theta_t)
  2  1    -9.98707899E-01   # -sin(theta_t)
  2  2    -5.08186282E-02   # cos(theta_t)
#
BLOCK SBOTMIX  # Sbottom Mixing Matrix
  1  1     9.99842002E-01   # cos(theta_b)
  1  2    -1.77755742E-02   # sin(theta_b)
  2  1     1.77755742E-02   # -sin(theta_b)
  2  2     9.99842002E-01   # cos(theta_b)
#
BLOCK STAUMIX  # Stau Mixing Matrix
  1  1     9.99999694E-01   # cos(theta_tau)
  1  2    -7.82304229E-04   # sin(theta_tau)
  2  1     7.82304229E-04   # -sin(theta_tau)
  2  2     9.99999694E-01   # cos(theta_tau)
#
BLOCK ALPHA  # Higgs mixing
          -5.35854667E-02   # Mixing angle in the neutral Higgs boson sector
#
BLOCK HMIX Q=  2.07433500E+03  # DRbar Higgs Parameters
         1    -3.03328883E+02   # mu(Q)MSSM           
         2     1.87599699E+01   # tan                 
         3     2.42410554E+02   # higgs               
         4     3.49982345E+06   # mA^2(Q)MSSM         
#
BLOCK GAUGE Q=  2.07433500E+03  # The gauge couplings
     1     3.64063762E-01   # gprime(Q) DRbar
     2     6.39711277E-01   # g(Q) DRbar
     3     1.03210800E+00   # g3(Q) DRbar
#
BLOCK AU Q=  2.07433500E+03  # The trilinear couplings
  1  1     0.00000000E+00   # A_u(Q) DRbar
  2  2     0.00000000E+00   # A_c(Q) DRbar
  3  3     3.38371001E+03   # A_t(Q) DRbar
#
BLOCK AD Q=  2.07433500E+03  # The trilinear couplings
  1  1     0.00000000E+00   # A_d(Q) DRbar
  2  2     0.00000000E+00   # A_s(Q) DRbar
  3  3    -2.74005000E+03   # A_b(Q) DRbar
#
BLOCK AE Q=  2.07433500E+03  # The trilinear couplings
  1  1     0.00000000E+00   # A_e(Q) DRbar
  2  2     0.00000000E+00   # A_mu(Q) DRbar
  3  3    -3.49986000E+03   # A_tau(Q) DRbar
#
BLOCK Yu Q=  2.07433500E+03  # The Yukawa couplings
  1  1     0.00000000E+00   # y_u(Q) DRbar
  2  2     0.00000000E+00   # y_c(Q) DRbar
  3  3     8.50577856E-01   # y_t(Q) DRbar
#
BLOCK Yd Q=  2.07433500E+03  # The Yukawa couplings
  1  1     0.00000000E+00   # y_d(Q) DRbar
  2  2     0.00000000E+00   # y_s(Q) DRbar
  3  3     2.57966249E-01   # y_b(Q) DRbar
#
BLOCK Ye Q=  2.07433500E+03  # The Yukawa couplings
  1  1     0.00000000E+00   # y_e(Q) DRbar
  2  2     0.00000000E+00   # y_mu(Q) DRbar
  3  3     1.90874483E-01   # y_tau(Q) DRbar
#
BLOCK MSOFT Q=  2.07433500E+03  # The soft SUSY breaking masses at the scale Q
         1     2.85640000E+02   # M_1(Q)              
         2     1.34612000E+03   # M_2(Q)              
         3     1.82804000E+03   # M_3(Q)              
        21     3.43209713E+06   # mH1^2(Q)            
        22    -1.27209608E+05   # mH2^2(Q)            
        31     2.36285000E+03   # meL(Q)              
        32     2.36285000E+03   # mmuL(Q)             
        33     2.78753000E+03   # mtauL(Q)            
        34     3.57750000E+03   # meR(Q)              
        35     3.57750000E+03   # mmuR(Q)             
        36     3.56367000E+03   # mtauR(Q)            
        41     7.56339992E+02   # mqL1(Q)             
        42     7.56339992E+02   # mqL2(Q)             
        43     3.31195000E+03   # mqL3(Q)             
        44     2.23217000E+03   # muR(Q)              
        45     2.23217000E+03   # mcR(Q)              
        46     1.29901999E+03   # mtR(Q)              
        47     5.59699989E+02   # mdR(Q)              
        48     5.59699989E+02   # msR(Q)              
        49     3.34874000E+03   # mbR(Q)              
#
Block HiggsBoundsInputHiggsCouplingsFermions
# ScalarNormEffCoupSq PseudoSNormEffCoupSq NP   IP1 IP2 IP2
    1.01245296E+00    0.00000000E+00        3  25   5   5  # h0-b-b eff. coupling^2, normalised to SM
    3.51924018E+02    0.00000000E+00        3  35   5   5  # H0-b-b eff. coupling^2, normalised to SM
    0.00000000E+00    3.51936471E+02        3  36   5   5  # A0-b-b eff. coupling^2, normalised to SM
#
    9.99964616E-01    0.00000000E+00        3  25   6   6  # h0-t-t eff. coupling^2, normalised to SM
    2.87680604E-03    0.00000000E+00        3  35   6   6  # H0-t-t eff. coupling^2, normalised to SM
    0.00000000E+00    2.84142191E-03        3  36   6   6  # A0-t-t eff. coupling^2, normalised to SM
#
    1.01245296E+00    0.00000000E+00        3  25  15  15  # h0-tau-tau eff. coupling^2, normalised to SM
    3.51924018E+02    0.00000000E+00        3  35  15  15  # H0-tau-tau eff. coupling^2, normalised to SM
    0.00000000E+00    3.51936471E+02        3  36  15  15  # A0-tau-tau eff. coupling^2, normalised to SM
#
Block HiggsBoundsInputHiggsCouplingsBosons
    9.99999891E-01        3  25  24  24  # h0-W-W eff. coupling^2, normalised to SM
    1.09480607E-07        3  35  24  24  # H0-W-W eff. coupling^2, normalised to SM
    0.00000000E+00        3  36  24  24  # A0-W-W eff. coupling^2, normalised to SM
#
    9.99999891E-01        3  25  23  23  # h0-Z-Z eff. coupling^2, normalised to SM
    1.09480607E-07        3  35  23  23  # H0-Z-Z eff. coupling^2, normalised to SM
    0.00000000E+00        3  36  23  23  # A0-Z-Z eff. coupling^2, normalised to SM
#
    8.92603194E-01        3  25  21  21  # h0-g-g eff. coupling^2, normalised to SM
    5.84363719E-12        3  35  21  21  # H0-g-g eff. coupling^2, normalised to SM
    2.11435827E-10        3  36  21  21  # A0-g-g eff. coupling^2, normalised to SM
#
    0.00000000E+00        3  25  25  23  # h0-h0-Z eff. coupling^2, normalised to SM
    0.00000000E+00        3  35  25  23  # H0-h0-Z eff. coupling^2, normalised to SM
    1.09480607E-07        3  36  25  23  # A0-h0-Z eff. coupling^2, normalised to SM
    0.00000000E+00        3  35  35  23  # H0-H0-Z eff. coupling^2, normalised to SM
    9.99999891E-01        3  36  35  23  # A0-H0-Z eff. coupling^2, normalised to SM
    0.00000000E+00        3  36  36  23  # A0-A0-Z eff. coupling^2, normalised to SM
#
    0.00000000E+00        4  25  21  21  23  # h0-g-g-Z eff. coupling^2, normalised to SM
    0.00000000E+00        4  35  21  21  23  # H0-g-g-Z eff. coupling^2, normalised to SM
    0.00000000E+00        4  36  21  21  23  # A0-g-g-Z eff. coupling^2, normalised to SM
#
#
#
#                             =================
#                             |The decay table|
#                             =================
#
# - The QCD corrections to the decays gluino -> squark  + quark
#                                     squark -> gaugino + quark_prime
#                                     squark -> squark_prime + Higgs
#                                     squark -> gluino  + quark
#   are included.
#
# - The multi-body decays for the inos, stops and sbottoms are included.
#
# - The loop induced decays for the gluino, neutralinos and stops
#   are included.
#
# - The SUSY decays of the top quark are included.
#
#
#         PDG            Width
DECAY         6     1.44074808E+00   # top decays
#          BR         NDA      ID1       ID2
     1.00000000E+00    2           5        24   # BR(t ->  b    W+)
#
#         PDG            Width
DECAY   1000021     1.71638975E+02   # gluino decays
#          BR         NDA      ID1       ID2
     7.28333787E-02    2     1000001        -1   # BR(~g -> ~d_L  db)
     7.28333787E-02    2    -1000001         1   # BR(~g -> ~d_L* d )
     8.90168204E-02    2     2000001        -1   # BR(~g -> ~d_R  db)
     8.90168204E-02    2    -2000001         1   # BR(~g -> ~d_R* d )
     7.31454001E-02    2     1000002        -2   # BR(~g -> ~u_L  ub)
     7.31454001E-02    2    -1000002         2   # BR(~g -> ~u_L* u )
     7.28333787E-02    2     1000003        -3   # BR(~g -> ~s_L  sb)
     7.28333787E-02    2    -1000003         3   # BR(~g -> ~s_L* s )
     8.90168204E-02    2     2000003        -3   # BR(~g -> ~s_R  sb)
     8.90168204E-02    2    -2000003         3   # BR(~g -> ~s_R* s )
     7.31453645E-02    2     1000004        -4   # BR(~g -> ~c_L  cb)
     7.31453645E-02    2    -1000004         4   # BR(~g -> ~c_L* c )
     3.00088373E-02    2     1000006        -6   # BR(~g -> ~t_1  tb)
     3.00088373E-02    2    -1000006         6   # BR(~g -> ~t_1* t )
#
#         PDG            Width
DECAY   1000006     3.69395563E+01   # stop1 decays
#          BR         NDA      ID1       ID2
     1.04388738E-01    2     1000022         6   # BR(~t_1 -> ~chi_10 t )
     2.28198893E-01    2     1000023         6   # BR(~t_1 -> ~chi_20 t )
     1.99798655E-01    2     1000025         6   # BR(~t_1 -> ~chi_30 t )
     4.67613714E-01    2     1000024         5   # BR(~t_1 -> ~chi_1+ b )
#
#         PDG            Width
DECAY   2000006     2.03040112E+02   # stop2 decays
#          BR         NDA      ID1       ID2
     3.43776800E-02    2     1000022         6   # BR(~t_2 -> ~chi_10 t )
     1.17125818E-01    2     1000023         6   # BR(~t_2 -> ~chi_20 t )
     8.24525704E-02    2     1000025         6   # BR(~t_2 -> ~chi_30 t )
     4.64771902E-02    2     1000035         6   # BR(~t_2 -> ~chi_40 t )
     2.43352680E-02    2     1000024         5   # BR(~t_2 -> ~chi_1+ b )
     9.12674009E-02    2     1000037         5   # BR(~t_2 -> ~chi_2+ b )
     4.14276892E-01    2     1000021         6   # BR(~t_2 -> ~g      t )
     1.00851526E-01    2     1000006        25   # BR(~t_2 -> ~t_1    h )
     3.68471898E-05    2     1000006        35   # BR(~t_2 -> ~t_1    H )
     3.79898142E-05    2     1000006        36   # BR(~t_2 -> ~t_1    A )
     8.87608177E-02    2     1000006        23   # BR(~t_2 -> ~t_1    Z )
#
#         PDG            Width
DECAY   1000005     1.98711191E+02   # sbottom1 decays
#          BR         NDA      ID1       ID2
     6.62447475E-03    2     1000022         5   # BR(~b_1 -> ~chi_10 b )
     1.08244493E-02    2     1000023         5   # BR(~b_1 -> ~chi_20 b )
     6.99671898E-03    2     1000025         5   # BR(~b_1 -> ~chi_30 b )
     4.73087705E-02    2     1000035         5   # BR(~b_1 -> ~chi_40 b )
     2.34270332E-01    2    -1000024         6   # BR(~b_1 -> ~chi_1- t )
     9.63251252E-02    2    -1000037         6   # BR(~b_1 -> ~chi_2- t )
     4.22172162E-01    2     1000021         5   # BR(~b_1 -> ~g      b )
     7.64337829E-05    2     1000006       -37   # BR(~b_1 -> ~t_1    H-)
     1.75401534E-01    2     1000006       -24   # BR(~b_1 -> ~t_1    W-)
#
#         PDG            Width
DECAY   2000005     9.86344159E+01   # sbottom2 decays
#          BR         NDA      ID1       ID2
     2.13547348E-02    2     1000022         5   # BR(~b_2 -> ~chi_10 b )
     2.22016153E-02    2     1000023         5   # BR(~b_2 -> ~chi_20 b )
     2.09173207E-02    2     1000025         5   # BR(~b_2 -> ~chi_30 b )
     5.46122060E-05    2     1000035         5   # BR(~b_2 -> ~chi_40 b )
     4.45706379E-02    2    -1000024         6   # BR(~b_2 -> ~chi_1- t )
     1.10155348E-04    2    -1000037         6   # BR(~b_2 -> ~chi_2- t )
     8.90584891E-01    2     1000021         5   # BR(~b_2 -> ~g      b )
     8.68408872E-05    2     1000006       -37   # BR(~b_2 -> ~t_1    H-)
     1.19192291E-04    2     1000006       -24   # BR(~b_2 -> ~t_1    W-)
#
#         PDG            Width
DECAY   1000002     1.58016798E-01   # sup_L decays
#          BR         NDA      ID1       ID2
     3.42467597E-01    2     1000022         2   # BR(~u_L -> ~chi_10 u)
     1.04012377E-02    2     1000023         2   # BR(~u_L -> ~chi_20 u)
     3.94225354E-01    2     1000025         2   # BR(~u_L -> ~chi_30 u)
     2.52905811E-01    2     1000024         1   # BR(~u_L -> ~chi_1+ d)
#
#         PDG            Width
DECAY   2000002     2.08610917E+01   # sup_R decays
#          BR         NDA      ID1       ID2
     1.61100842E-01    2     1000022         2   # BR(~u_R -> ~chi_10 u)
     7.34239576E-04    2     1000023         2   # BR(~u_R -> ~chi_20 u)
     7.47150856E-02    2     1000025         2   # BR(~u_R -> ~chi_30 u)
     6.63003690E-07    2     1000035         2   # BR(~u_R -> ~chi_40 u)
     7.63449170E-01    2     1000021         2   # BR(~u_R -> ~g      u)
#
#         PDG            Width
DECAY   1000001     1.19330151E-01   # sdown_L decays
#          BR         NDA      ID1       ID2
     8.43606516E-01    2     1000022         1   # BR(~d_L -> ~chi_10 d)
     4.91267166E-02    2     1000023         1   # BR(~d_L -> ~chi_20 d)
     9.72250743E-02    2     1000025         1   # BR(~d_L -> ~chi_30 d)
     1.00416936E-02    2    -1000024         2   # BR(~d_L -> ~chi_1- u)
#
#         PDG            Width
DECAY   2000001     2.99434353E-01   # sdown_R decays
#          BR         NDA      ID1       ID2
     7.16867890E-01    2     1000022         1   # BR(~d_R -> ~chi_10 d)
     2.87654764E-03    2     1000023         1   # BR(~d_R -> ~chi_20 d)
     2.80255563E-01    2     1000025         1   # BR(~d_R -> ~chi_30 d)
#
#         PDG            Width
DECAY   1000004     1.54925947E-01   # scharm_L decays
#          BR         NDA      ID1       ID2
     3.42595997E-01    2     1000022         4   # BR(~c_L -> ~chi_10 c)
     1.03999945E-02    2     1000023         4   # BR(~c_L -> ~chi_20 c)
     3.94116161E-01    2     1000025         4   # BR(~c_L -> ~chi_30 c)
     2.52887847E-01    2     1000024         3   # BR(~c_L -> ~chi_1+ s)
#
#         PDG            Width
DECAY   2000004     1.61898731E+01   # scharm_R decays
#          BR         NDA      ID1       ID2
     2.18284825E-01    2     1000022         4   # BR(~c_R -> ~chi_10 c)
     9.94390953E-04    2     1000023         4   # BR(~c_R -> ~chi_20 c)
     1.01173920E-01    2     1000025         4   # BR(~c_R -> ~chi_30 c)
     8.87093386E-07    2     1000035         4   # BR(~c_R -> ~chi_40 c)
     6.79545977E-01    2     1000021         4   # BR(~c_R -> ~g      c)
#
#         PDG            Width
DECAY   1000003     1.17053845E-01   # sstrange_L decays
#          BR         NDA      ID1       ID2
     8.43683953E-01    2     1000022         3   # BR(~s_L -> ~chi_10 s)
     4.91070538E-02    2     1000023         3   # BR(~s_L -> ~chi_20 s)
     9.71709588E-02    2     1000025         3   # BR(~s_L -> ~chi_30 s)
     1.00380349E-02    2    -1000024         4   # BR(~s_L -> ~chi_1- c)
#
#         PDG            Width
DECAY   2000003     2.90075515E-01   # sstrange_R decays
#          BR         NDA      ID1       ID2
     7.17063159E-01    2     1000022         3   # BR(~s_R -> ~chi_10 s)
     2.87530334E-03    2     1000023         3   # BR(~s_R -> ~chi_20 s)
     2.80061537E-01    2     1000025         3   # BR(~s_R -> ~chi_30 s)
#
#         PDG            Width
DECAY   1000011     1.60424901E+01   # selectron_L decays
#          BR         NDA      ID1       ID2
     1.15870654E-01    2     1000022        11   # BR(~e_L -> ~chi_10 e-)
     4.56557529E-06    2     1000023        11   # BR(~e_L -> ~chi_20 e-)
     7.65839792E-02    2     1000025        11   # BR(~e_L -> ~chi_30 e-)
     2.68015929E-01    2     1000035        11   # BR(~e_L -> ~chi_40 e-)
     2.40802759E-04    2    -1000024        12   # BR(~e_L -> ~chi_1- nu_e)
     5.39284069E-01    2    -1000037        12   # BR(~e_L -> ~chi_2- nu_e)
#
#         PDG            Width
DECAY   2000011     1.86625914E+01   # selectron_R decays
#          BR         NDA      ID1       ID2
     6.79234036E-01    2     1000022        11   # BR(~e_R -> ~chi_10 e-)
     3.11513392E-03    2     1000023        11   # BR(~e_R -> ~chi_20 e-)
     3.17646057E-01    2     1000025        11   # BR(~e_R -> ~chi_30 e-)
     4.77276380E-06    2     1000035        11   # BR(~e_R -> ~chi_40 e-)
#
#         PDG            Width
DECAY   1000013     1.60424901E+01   # smuon_L decays
#          BR         NDA      ID1       ID2
     1.15870654E-01    2     1000022        13   # BR(~mu_L -> ~chi_10 mu-)
     4.56557528E-06    2     1000023        13   # BR(~mu_L -> ~chi_20 mu-)
     7.65839792E-02    2     1000025        13   # BR(~mu_L -> ~chi_30 mu-)
     2.68015927E-01    2     1000035        13   # BR(~mu_L -> ~chi_40 mu-)
     2.40802760E-04    2    -1000024        14   # BR(~mu_L -> ~chi_1- nu_mu)
     5.39284071E-01    2    -1000037        14   # BR(~mu_L -> ~chi_2- nu_mu)
#
#         PDG            Width
DECAY   2000013     1.86625913E+01   # smuon_R decays
#          BR         NDA      ID1       ID2
     6.79234036E-01    2     1000022        13   # BR(~mu_R -> ~chi_10 mu-)
     3.11513392E-03    2     1000023        13   # BR(~mu_R -> ~chi_20 mu-)
     3.17646057E-01    2     1000025        13   # BR(~mu_R -> ~chi_30 mu-)
     4.77276380E-06    2     1000035        13   # BR(~mu_R -> ~chi_40 mu-)
#
#         PDG            Width
DECAY   1000015     2.54357111E+01   # stau_1 decays
#          BR         NDA      ID1       ID2
     1.01597359E-01    2     1000022        15   # BR(~tau_1 -> ~chi_10  tau-)
     3.81986252E-02    2     1000023        15   # BR(~tau_1 -> ~chi_20  tau-)
     8.21723962E-02    2     1000025        15   # BR(~tau_1 -> ~chi_30  tau-)
     2.58224147E-01    2     1000035        15   # BR(~tau_1 -> ~chi_40  tau-)
     1.86757237E-04    2    -1000024        16   # BR(~tau_1 -> ~chi_1-  nu_tau)
     5.19620715E-01    2    -1000037        16   # BR(~tau_1 -> ~chi_2-  nu_tau)
#
#         PDG            Width
DECAY   2000015     2.36788221E+01   # stau_2 decays
#          BR         NDA      ID1       ID2
     5.53351495E-01    2     1000022        15   # BR(~tau_2 -> ~chi_10  tau-)
     5.54666871E-02    2     1000023        15   # BR(~tau_2 -> ~chi_20  tau-)
     2.83479245E-01    2     1000025        15   # BR(~tau_2 -> ~chi_30  tau-)
     1.52586118E-05    2     1000035        15   # BR(~tau_2 -> ~chi_40  tau-)
     1.07577644E-01    2    -1000024        16   # BR(~tau_2 -> ~chi_1-  nu_tau)
     2.31437303E-05    2    -1000037        16   # BR(~tau_2 -> ~chi_2-  nu_tau)
     4.28167298E-05    2     1000016       -24   # BR(~tau_2 -> ~nu_tauL W-)
     2.18858680E-05    2     1000015        25   # BR(~tau_2 -> ~tau_1   h)
     2.18234330E-05    2     1000015        23   # BR(~tau_2 -> ~tau_1   Z)
#
#         PDG            Width
DECAY   1000012     1.60588056E+01   # snu_eL decays
#          BR         NDA      ID1       ID2
     1.41812556E-01    2     1000022        12   # BR(~nu_eL -> ~chi_10 nu_e)
     2.55282155E-03    2     1000023        12   # BR(~nu_eL -> ~chi_20 nu_e)
     4.48061495E-02    2     1000025        12   # BR(~nu_eL -> ~chi_30 nu_e)
     2.68751235E-01    2     1000035        12   # BR(~nu_eL -> ~chi_40 nu_e)
     8.06317830E-03    2     1000024        11   # BR(~nu_eL -> ~chi_1+ e-)
     5.34014059E-01    2     1000037        11   # BR(~nu_eL -> ~chi_2+ e-)
#
#         PDG            Width
DECAY   1000014     1.60588055E+01   # snu_muL decays
#          BR         NDA      ID1       ID2
     1.41812557E-01    2     1000022        14   # BR(~nu_muL -> ~chi_10 nu_mu)
     2.55282156E-03    2     1000023        14   # BR(~nu_muL -> ~chi_20 nu_mu)
     4.48061498E-02    2     1000025        14   # BR(~nu_muL -> ~chi_30 nu_mu)
     2.68751236E-01    2     1000035        14   # BR(~nu_muL -> ~chi_40 nu_mu)
     8.06317831E-03    2     1000024        13   # BR(~nu_muL -> ~chi_1+ mu-)
     5.34014057E-01    2     1000037        13   # BR(~nu_muL -> ~chi_2+ mu-)
#
#         PDG            Width
DECAY   1000016     2.54498481E+01   # snu_tauL decays
#          BR         NDA      ID1       ID2
     1.06284471E-01    2     1000022        16   # BR(~nu_tauL -> ~chi_10 nu_tau)
     1.91898025E-03    2     1000023        16   # BR(~nu_tauL -> ~chi_20 nu_tau)
     3.37140640E-02    2     1000025        16   # BR(~nu_tauL -> ~chi_30 nu_tau)
     2.59280108E-01    2     1000035        16   # BR(~nu_tauL -> ~chi_40 nu_tau)
     8.35583432E-02    2     1000024        15   # BR(~nu_tauL -> ~chi_1+ tau-)
     5.15244034E-01    2     1000037        15   # BR(~nu_tauL -> ~chi_2+ tau-)
#
#         PDG            Width
DECAY   1000024     8.07144930E-05   # chargino1+ decays
#           BR         NDA      ID1       ID2       ID3
     3.33590353E-01    3     1000022         2        -1   # BR(~chi_1+ -> ~chi_10 u    db)
     3.33590353E-01    3     1000022         4        -3   # BR(~chi_1+ -> ~chi_10 c    sb)
     1.11208327E-01    3     1000022       -11        12   # BR(~chi_1+ -> ~chi_10 e+   nu_e)
     1.11208327E-01    3     1000022       -13        14   # BR(~chi_1+ -> ~chi_10 mu+  nu_mu)
     1.10402640E-01    3     1000022       -15        16   # BR(~chi_1+ -> ~chi_10 tau+ nu_tau)
#
#         PDG            Width
DECAY   1000037     3.11245928E+01   # chargino2+ decays
#          BR         NDA      ID1       ID2
     1.71374358E-01    2     1000002        -1   # BR(~chi_2+ -> ~u_L     db)
     1.70534452E-01    2    -1000001         2   # BR(~chi_2+ -> ~d_L*    u )
     1.71374318E-01    2     1000004        -3   # BR(~chi_2+ -> ~c_L     sb)
     1.70533808E-01    2    -1000003         4   # BR(~chi_2+ -> ~s_L*     c )
     7.91919173E-02    2     1000024        23   # BR(~chi_2+ -> ~chi_1+  Z )
     1.73133853E-02    2     1000022        24   # BR(~chi_2+ -> ~chi_10  W+)
     7.74310692E-02    2     1000023        24   # BR(~chi_2+ -> ~chi_20  W+)
     5.99025421E-02    2     1000025        24   # BR(~chi_2+ -> ~chi_30  W+)
     8.23441490E-02    2     1000024        25   # BR(~chi_2+ -> ~chi_1+  h )
#
#         PDG            Width
DECAY   1000022     0.00000000E+00   # neutralino1 decays
#
#         PDG            Width
DECAY   1000023     9.43426107E-05   # neutralino2 decays
#          BR         NDA      ID1       ID2
     6.71786184E-04    2     1000022        22   # BR(~chi_20 -> ~chi_10 gam)
#           BR         NDA      ID1       ID2       ID3
     1.18119494E-01    3     1000022        -2         2   # BR(~chi_20 -> ~chi_10 ub      u)
     1.53187929E-01    3     1000022        -1         1   # BR(~chi_20 -> ~chi_10 db      d)
     1.18119494E-01    3     1000022        -4         4   # BR(~chi_20 -> ~chi_10 cb      c)
     1.53187929E-01    3     1000022        -3         3   # BR(~chi_20 -> ~chi_10 sb      s)
     1.40783486E-01    3     1000022        -5         5   # BR(~chi_20 -> ~chi_10 bb      b)
     3.51431552E-02    3     1000022       -11        11   # BR(~chi_20 -> ~chi_10 e+      e-)
     3.51431552E-02    3     1000022       -13        13   # BR(~chi_20 -> ~chi_10 mu+     mu-)
     3.48192294E-02    3     1000022       -15        15   # BR(~chi_20 -> ~chi_10 tau+    tau-)
     7.02686405E-02    3     1000022       -12        12   # BR(~chi_20 -> ~chi_10 nu_eb   nu_e)
     7.02686405E-02    3     1000022       -14        14   # BR(~chi_20 -> ~chi_10 nu_mub  nu_mu)
     7.02662521E-02    3     1000022       -16        16   # BR(~chi_20 -> ~chi_10 nu_taub nu_tau)
     3.73270870E-06    3     1000024        -2         1   # BR(~chi_20 -> ~chi_1+ ub      d)
     3.73270870E-06    3    -1000024        -1         2   # BR(~chi_20 -> ~chi_1- db      u)
     3.73270870E-06    3     1000024        -4         3   # BR(~chi_20 -> ~chi_1+ cb      s)
     3.73270870E-06    3    -1000024        -3         4   # BR(~chi_20 -> ~chi_1- sb      c)
     1.24422828E-06    3     1000024       -12        11   # BR(~chi_20 -> ~chi_1+ nu_eb   e-)
     1.24422828E-06    3    -1000024        12       -11   # BR(~chi_20 -> ~chi_1- nu_e    e+)
     1.24422828E-06    3     1000024       -14        13   # BR(~chi_20 -> ~chi_1+ nu_mub  mu-)
     1.24422828E-06    3    -1000024        14       -13   # BR(~chi_20 -> ~chi_1- nu_mu   mu+)
     4.51339312E-07    3     1000024       -16        15   # BR(~chi_20 -> ~chi_1+ nu_taub tau-)
     4.51339312E-07    3    -1000024        16       -15   # BR(~chi_20 -> ~chi_1- nu_tau  tau+)
#
#         PDG            Width
DECAY   1000025     7.78143537E-06   # neutralino3 decays
#          BR         NDA      ID1       ID2
     5.87108819E-02    2     1000022        22   # BR(~chi_30 -> ~chi_10 gam)
     3.97508974E-02    2     1000023        22   # BR(~chi_30 -> ~chi_20 gam)
#           BR         NDA      ID1       ID2       ID3
     5.03617548E-02    3     1000022        -2         2   # BR(~chi_30 -> ~chi_10 ub      u)
     6.28050265E-02    3     1000022        -1         1   # BR(~chi_30 -> ~chi_10 db      d)
     5.03617548E-02    3     1000022        -4         4   # BR(~chi_30 -> ~chi_10 cb      c)
     6.28050265E-02    3     1000022        -3         3   # BR(~chi_30 -> ~chi_10 sb      s)
     6.09340402E-02    3     1000022        -5         5   # BR(~chi_30 -> ~chi_10 bb      b)
     1.42856468E-02    3     1000022       -11        11   # BR(~chi_30 -> ~chi_10 e+      e-)
     1.42856468E-02    3     1000022       -13        13   # BR(~chi_30 -> ~chi_10 mu+     mu-)
     1.42787353E-02    3     1000022       -15        15   # BR(~chi_30 -> ~chi_10 tau+    tau-)
     2.95615806E-02    3     1000022       -12        12   # BR(~chi_30 -> ~chi_10 nu_eb   nu_e)
     2.95615806E-02    3     1000022       -14        14   # BR(~chi_30 -> ~chi_10 nu_mub  nu_mu)
     2.94906750E-02    3     1000022       -16        16   # BR(~chi_30 -> ~chi_10 nu_taub nu_tau)
     6.52191330E-03    3     1000023        -2         2   # BR(~chi_30 -> ~chi_20 ub      u)
     8.46103534E-03    3     1000023        -1         1   # BR(~chi_30 -> ~chi_20 db      d)
     6.52191330E-03    3     1000023        -4         4   # BR(~chi_30 -> ~chi_20 cb      c)
     8.46103534E-03    3     1000023        -3         3   # BR(~chi_30 -> ~chi_20 sb      s)
     2.67103710E-03    3     1000023        -5         5   # BR(~chi_30 -> ~chi_20 bb      b)
     1.94045640E-03    3     1000023       -11        11   # BR(~chi_30 -> ~chi_20 e+      e-)
     1.94045640E-03    3     1000023       -13        13   # BR(~chi_30 -> ~chi_20 mu+     mu-)
     1.78252715E-03    3     1000023       -15        15   # BR(~chi_30 -> ~chi_20 tau+    tau-)
     3.87876179E-03    3     1000023       -12        12   # BR(~chi_30 -> ~chi_20 nu_eb   nu_e)
     3.87876179E-03    3     1000023       -14        14   # BR(~chi_30 -> ~chi_20 nu_mub  nu_mu)
     3.87881823E-03    3     1000023       -16        16   # BR(~chi_30 -> ~chi_20 nu_taub nu_tau)
     7.25069618E-02    3     1000024        -2         1   # BR(~chi_30 -> ~chi_1+ ub      d)
     7.25069618E-02    3    -1000024        -1         2   # BR(~chi_30 -> ~chi_1- db      u)
     7.25069618E-02    3     1000024        -4         3   # BR(~chi_30 -> ~chi_1+ cb      s)
     7.25069618E-02    3    -1000024        -3         4   # BR(~chi_30 -> ~chi_1- sb      c)
     2.41648466E-02    3     1000024       -12        11   # BR(~chi_30 -> ~chi_1+ nu_eb   e-)
     2.41648466E-02    3    -1000024        12       -11   # BR(~chi_30 -> ~chi_1- nu_e    e+)
     2.41648466E-02    3     1000024       -14        13   # BR(~chi_30 -> ~chi_1+ nu_mub  mu-)
     2.41648466E-02    3    -1000024        14       -13   # BR(~chi_30 -> ~chi_1- nu_mu   mu+)
     2.30914015E-02    3     1000024       -16        15   # BR(~chi_30 -> ~chi_1+ nu_taub tau-)
     2.30914015E-02    3    -1000024        16       -15   # BR(~chi_30 -> ~chi_1- nu_tau  tau+)
#
#         PDG            Width
DECAY   1000035     3.11101245E+01   # neutralino4 decays
#          BR         NDA      ID1       ID2
     6.82652910E-03    2     1000022        23   # BR(~chi_40 -> ~chi_10   Z )
     5.28654388E-02    2     1000023        23   # BR(~chi_40 -> ~chi_20   Z )
     1.94161841E-02    2     1000025        23   # BR(~chi_40 -> ~chi_30   Z )
     7.75331386E-02    2     1000024       -24   # BR(~chi_40 -> ~chi_1+   W-)
     7.75331386E-02    2    -1000024        24   # BR(~chi_40 -> ~chi_1-   W+)
     1.16767009E-02    2     1000022        25   # BR(~chi_40 -> ~chi_10   h )
     2.66612510E-02    2     1000023        25   # BR(~chi_40 -> ~chi_20   h )
     4.36651236E-02    2     1000025        25   # BR(~chi_40 -> ~chi_30   h )
     8.58952724E-02    2     1000002        -2   # BR(~chi_40 -> ~u_L      ub)
     8.58952724E-02    2    -1000002         2   # BR(~chi_40 -> ~u_L*     u )
     8.50603794E-02    2     1000001        -1   # BR(~chi_40 -> ~d_L      db)
     8.50603794E-02    2    -1000001         1   # BR(~chi_40 -> ~d_L*     d )
     1.31197077E-07    2     2000001        -1   # BR(~chi_40 -> ~d_R      db)
     1.31197077E-07    2    -2000001         1   # BR(~chi_40 -> ~d_R*     d )
     8.58949540E-02    2     1000004        -4   # BR(~chi_40 -> ~c_L      cb)
     8.58949540E-02    2    -1000004         4   # BR(~chi_40 -> ~c_L*     c )
     8.50603794E-02    2     1000003        -3   # BR(~chi_40 -> ~s _L      sb)
     8.50603794E-02    2    -1000003         3   # BR(~chi_40 -> ~s _L*     s )
     1.31197077E-07    2     2000003        -3   # BR(~chi_40 -> ~s _R      sb)
     1.31197077E-07    2    -2000003         3   # BR(~chi_40 -> ~s _R*     s )
#
#         PDG            Width
DECAY        25     4.22141816E-03   # h decays
#          BR         NDA      ID1       ID2
     5.75923193E-01    2           5        -5   # BR(h -> b       bb     )
     6.27104406E-02    2         -15        15   # BR(h -> tau+    tau-   )
     2.21969186E-04    2         -13        13   # BR(h -> mu+     mu-    )
     2.41982159E-04    2           3        -3   # BR(h -> s       sb     )
     2.07165777E-02    2           4        -4   # BR(h -> c       cb     )
     7.81178295E-02    2          21        21   # BR(h -> g       g      )
     2.32833555E-03    2          22        22   # BR(h -> gam     gam    )
     1.66066895E-03    2          22        23   # BR(h -> Z       gam    )
     2.28881841E-01    2          24       -24   # BR(h -> W+      W-     )
     2.91971623E-02    2          23        23   # BR(h -> Z       Z      )
#
#         PDG            Width
DECAY        35     1.59924133E+01   # H decays
#          BR         NDA      ID1       ID2
     5.19907165E-01    2           5        -5   # BR(H -> b       bb     )
     8.67852040E-02    2         -15        15   # BR(H -> tau+    tau-   )
     3.07452514E-04    2         -13        13   # BR(H -> mu+     mu-    )
     2.34798812E-04    2           3        -3   # BR(H -> s       sb     )
     1.48226142E-07    2           4        -4   # BR(H -> c       cb     )
     1.43011970E-02    2           6        -6   # BR(H -> t       tb     )
     1.17515902E-05    2          21        21   # BR(H -> g       g      )
     6.36121006E-09    2          22        22   # BR(H -> gam     gam    )
     1.11347620E-08    2          23        22   # BR(H -> Z       gam    )
     1.46104901E-05    2          24       -24   # BR(H -> W+      W-     )
     7.27459892E-06    2          23        23   # BR(H -> Z       Z      )
     5.94112609E-05    2          25        25   # BR(H -> h       h      )
     5.93983651E-03    2     1000024  -1000024   # BR(H -> ~chi_1+ ~chi_1-)
     8.10780003E-02    2     1000024  -1000037   # BR(H -> ~chi_1+ ~chi_2-)
     8.10780003E-02    2     1000037  -1000024   # BR(H -> ~chi_2+ ~chi_1-)
     3.91725242E-02    2     1000022   1000022   # BR(H -> ~chi_10 ~chi_10)
     1.53036045E-03    2     1000023   1000023   # BR(H -> ~chi_20 ~chi_20)
     1.96235524E-02    2     1000025   1000025   # BR(H -> ~chi_30 ~chi_30)
     3.68774568E-02    2     1000022   1000023   # BR(H -> ~chi_10 ~chi_20)
     1.07696514E-02    2     1000022   1000025   # BR(H -> ~chi_10 ~chi_30)
     1.05122874E-02    2     1000022   1000035   # BR(H -> ~chi_10 ~chi_40)
     2.08007166E-02    2     1000023   1000025   # BR(H -> ~chi_20 ~chi_30)
     5.80057023E-02    2     1000023   1000035   # BR(H -> ~chi_20 ~chi_40)
     1.29629844E-02    2     1000025   1000035   # BR(H -> ~chi_30 ~chi_40)
     3.96776245E-06    2     1000002  -1000002   # BR(H -> ~u_L    ~u_L*  )
     3.96776245E-06    2     1000004  -1000004   # BR(H -> ~c_L    ~c_L*  )
     5.60718836E-06    2     1000001  -1000001   # BR(H -> ~d_L    ~d_L*  )
     3.72826123E-07    2     2000001  -2000001   # BR(H -> ~d_R    ~d_R*  )
     5.60718836E-06    2     1000003  -1000003   # BR(H -> ~s_L    ~s_L*  )
     3.72826123E-07    2     2000003  -2000003   # BR(H -> ~s_R    ~s_R*  )
#
#         PDG            Width
DECAY        36     1.60023317E+01   # A decays
#          BR         NDA      ID1       ID2
     5.19640816E-01    2           5        -5   # BR(A -> b       bb     )
     8.67338510E-02    2         -15        15   # BR(A -> tau+    tau-   )
     3.07269486E-04    2         -13        13   # BR(A -> mu+     mu-    )
     2.34706004E-04    2           3        -3   # BR(A -> s       sb     )
     1.47656900E-07    2           4        -4   # BR(A -> c       cb     )
     1.44547792E-02    2           6        -6   # BR(A -> t       tb     )
     7.06392109E-05    2          21        21   # BR(A -> g       g      )
     2.16225361E-08    2          22        22   # BR(A -> gam     gam    )
     5.33188125E-08    2          23        22   # BR(A -> Z       gam    )
     1.47081122E-05    2          23        25   # BR(A -> Z       h      )
     6.42336031E-03    2     1000024  -1000024   # BR(A -> ~chi_1+ ~chi_1-)
     8.08761749E-02    2     1000024  -1000037   # BR(A -> ~chi_1+ ~chi_2-)
     8.08761749E-02    2     1000037  -1000024   # BR(A -> ~chi_2+ ~chi_1-)
     3.55439059E-02    2     1000022   1000022   # BR(A -> ~chi_10 ~chi_10)
     2.13825628E-03    2     1000023   1000023   # BR(A -> ~chi_20 ~chi_20)
     1.77946969E-02    2     1000025   1000025   # BR(A -> ~chi_30 ~chi_30)
     4.30172144E-02    2     1000022   1000023   # BR(A -> ~chi_10 ~chi_20)
     9.16372534E-03    2     1000022   1000025   # BR(A -> ~chi_10 ~chi_30)
     2.30193024E-02    2     1000022   1000035   # BR(A -> ~chi_10 ~chi_40)
     2.11582318E-02    2     1000023   1000025   # BR(A -> ~chi_20 ~chi_30)
     2.17222010E-02    2     1000023   1000035   # BR(A -> ~chi_20 ~chi_40)
     3.68097648E-02    2     1000025   1000035   # BR(A -> ~chi_30 ~chi_40)
#
#         PDG            Width
DECAY        37     1.58646491E+01   # H+ decays
#          BR         NDA      ID1       ID2
     8.71892267E-04    2           4        -5   # BR(H+ -> c       bb     )
     8.75813108E-02    2         -15        16   # BR(H+ -> tau+    nu_tau )
     3.10271757E-04    2         -13        14   # BR(H+ -> mu+     nu_mu  )
     8.71889545E-06    2           2        -5   # BR(H+ -> u       bb     )
     1.18321664E-05    2           2        -3   # BR(H+ -> u       sb     )
     2.33035636E-04    2           4        -3   # BR(H+ -> c       sb     )
     5.30673959E-01    2           6        -5   # BR(H+ -> t       bb     )
     1.49082894E-05    2          24        25   # BR(H+ -> W+      h      )
     2.92855878E-12    2          24        36   # BR(H+ -> W+      A      )
     8.24194218E-02    2     1000024   1000022   # BR(H+ -> ~chi_1+ ~chi_10)
     1.65684916E-04    2     1000024   1000023   # BR(H+ -> ~chi_1+ ~chi_20)
     4.93472704E-02    2     1000024   1000025   # BR(H+ -> ~chi_1+ ~chi_30)
     8.24931023E-02    2     1000024   1000035   # BR(H+ -> ~chi_1+ ~chi_40)
     3.41369533E-02    2     1000037   1000022   # BR(H+ -> ~chi_2+ ~chi_10)
     8.09323264E-02    2     1000037   1000023   # BR(H+ -> ~chi_2+ ~chi_20)
     5.07800546E-02    2     1000037   1000025   # BR(H+ -> ~chi_2+ ~chi_30)
     9.62878098E-06    2     1000002  -1000001   # BR(H+ -> ~u_L    ~d_L*  )
     9.62878098E-06    2     1000004  -1000003   # BR(H+ -> ~c_L    ~s_L*  )
