#
#                              ======================
#                              | THE SUSYHIT OUTPUT |
#                              ======================
#
#
#              ------------------------------------------------------
#              |     This is the output of the SUSY-HIT package     |
#              |  created by A.Djouadi, M.Muehlleitner and M.Spira. |
#              |  In case of problems with SUSY-HIT email to        |
#              |           margarete.muehlleitner@cern.ch           |
#              |           michael.spira@psi.ch                     |
#              |           abdelhak.djouadi@cern.ch                 |
#              ------------------------------------------------------
#
#              ------------------------------------------------------
#              |  SUSY Les Houches Accord - MSSM Spectrum + Decays  |
#              |              based on the decay programs           |
#              |                                                    |
#              |                     SDECAY 1.3b                    |
#              |                                                    |
#              |  Authors: M.Muhlleitner, A.Djouadi and Y.Mambrini  |
#              |  Ref.:    Comput.Phys.Commun.168(2005)46           |
#              |           [hep-ph/0311167]                         |
#              |                                                    |
#              |                     HDECAY 3.4                     |
#              |                                                    |
#              |  By: A.Djouadi,J.Kalinowski,M.Muhlleitner,M.Spira  |
#              |  Ref.:    Comput.Phys.Commun.108(1998)56           |
#              |           [hep-ph/9704448]                         |
#              |                                                    |
#              |                                                    |
#              |  If not stated otherwise all DRbar couplings and   |
#              |  soft SUSY breaking masses are given at the scale  |
#              |  Q=  0.17258780E+04
#              |                                                    |
#              ------------------------------------------------------
#
#
BLOCK DCINFO  # Decay Program information
     1   SDECAY/HDECAY # decay calculator
     2   1.3b  /3.4    # version number
#
BLOCK SPINFO  # Spectrum calculator information
     1     SOFTSUSY    # spectrum calculator               
     2     3.4.0       # version number                    
#
BLOCK MODSEL  # Model selection
     1     0   #  nonUniversal                                     
#
BLOCK SMINPUTS  # Standard Model inputs
         1     1.27908970E+02   # alpha_em^-1(M_Z)^MSbar
         2     1.16637870E-05   # G_F [GeV^-2]
         3     1.18400000E-01   # alpha_S(M_Z)^MSbar
         4     9.11876000E+01   # M_Z pole mass
         5     4.18000000E+00   # mb(mb)^MSbar
         6     1.73200000E+02   # mt pole mass
         7     1.77700000E+00   # mtau pole mass
#
BLOCK MINPAR  # Input parameters - minimal models
         3     1.38900000E+01   # tanb                
#
BLOCK EXTPAR  # Input parameters - non-minimal models
         0    -1.00000000E+00   # Set                 
         1     2.95101000E+03   # M_1(MX)             
         2    -7.27880000E+02   # M_2(MX)             
         3     1.50537000E+03   # M_3(MX)             
        11     2.40919000E+03   # At(MX)              
        12    -3.81748000E+03   # Ab(MX)              
        13    -1.73143000E+03   # Atau(MX)            
        23    -1.81737000E+03   # mu(MX)              
        26     1.01608000E+03   # mA(pole)            
        31     3.33092000E+03   # meL(MX)             
        32     3.33092000E+03   # mmuL(MX)            
        33     9.46840000E+02   # mtauL(MX)           
        34     9.72440000E+02   # meR(MX)             
        35     9.72440000E+02   # mmuR(MX)            
        36     9.21010000E+02   # mtauR(MX)           
        41     3.05048000E+03   # mqL1(MX)            
        42     3.05048000E+03   # mqL2(MX)            
        43     1.05732000E+03   # mqL3(MX)            
        44     1.36828000E+03   # muR(MX)             
        45     1.36828000E+03   # mcR(MX)             
        46     2.81200000E+03   # mtR(MX)             
        47     1.46318000E+03   # mdR(MX)             
        48     1.46318000E+03   # msR(MX)             
        49     2.28379000E+03   # mbR(MX)             
#
BLOCK MASS  # Mass Spectrum
# PDG code           mass       particle
        24     8.04077473E+01   # W+
        25     1.24202646E+02   # h
        35     1.01608210E+03   # H
        36     1.01608000E+03   # A
        37     1.01922403E+03   # H+
         5     4.81876030E+00   # b-quark pole mass calculated from mb(mb)_Msbar
   1000001     3.08619392E+03   # ~d_L
   2000001     1.52570999E+03   # ~d_R
   1000002     3.08530095E+03   # ~u_L
   2000002     1.43581774E+03   # ~u_R
   1000003     3.08619392E+03   # ~s_L
   2000003     1.52570999E+03   # ~s_R
   1000004     3.08530095E+03   # ~c_L
   2000004     1.43581774E+03   # ~c_R
   1000005     1.15045857E+03   # ~b_1
   2000005     2.31419169E+03   # ~b_2
   1000006     1.14973742E+03   # ~t_1
   2000006     2.81700909E+03   # ~t_2
   1000011     3.33805873E+03   # ~e_L
   2000011     9.73918504E+02   # ~e_R
   1000012     3.33678358E+03   # ~nu_eL
   1000013     3.33805873E+03   # ~mu_L
   2000013     9.73918504E+02   # ~mu_R
   1000014     3.33678358E+03   # ~nu_muL
   1000015     9.09617013E+02   # ~tau_1
   2000015     9.66456142E+02   # ~tau_2
   1000016     9.52259051E+02   # ~nu_tauL
   1000021     1.63949175E+03   # ~g
   1000022    -7.57673834E+02   # ~chi_10
   1000023     1.84013994E+03   # ~chi_20
   1000025    -1.84303073E+03   # ~chi_30
   1000035     2.92343679E+03   # ~chi_40
   1000024     7.57839942E+02   # ~chi_1+
   1000037     1.84435937E+03   # ~chi_2+
#
BLOCK NMIX  # Neutralino Mixing Matrix
  1  1     3.42815863E-04   # N_11
  1  2     9.98273427E-01   # N_12
  1  3     5.31858635E-02   # N_13
  1  4    -2.49260984E-02   # N_14
  2  1    -2.54219476E-02   # N_21
  2  2    -1.99894766E-02   # N_22
  2  3     7.06627570E-01   # N_23
  2  4     7.06846251E-01   # N_24
  3  1     6.84862256E-03   # N_31
  3  2    -5.52300800E-02   # N_32
  3  3     7.05462004E-01   # N_33
  3  4    -7.06559336E-01   # N_34
  4  1     9.99653292E-01   # N_41
  4  2    -4.72309173E-04   # N_42
  4  3     1.31187215E-02   # N_43
  4  4     2.28248252E-02   # N_44
#
BLOCK UMIX  # Chargino Mixing Matrix U
  1  1     9.97172317E-01   # U_11
  1  2     7.51489853E-02   # U_12
  2  1    -7.51489853E-02   # U_21
  2  2     9.97172317E-01   # U_22
#
BLOCK VMIX  # Chargino Mixing Matrix V
  1  1    -9.99379282E-01   # V_11
  1  2    -3.52285469E-02   # V_12
  2  1     3.52285469E-02   # V_21
  2  2    -9.99379282E-01   # V_22
#
BLOCK STOPMIX  # Stop Mixing Matrix
  1  1     9.98563742E-01   # cos(theta_t)
  1  2    -5.35766102E-02   # sin(theta_t)
  2  1     5.35766102E-02   # -sin(theta_t)
  2  2     9.98563742E-01   # cos(theta_t)
#
BLOCK SBOTMIX  # Sbottom Mixing Matrix
  1  1     9.99897380E-01   # cos(theta_b)
  1  2    -1.43258322E-02   # sin(theta_b)
  2  1     1.43258322E-02   # -sin(theta_b)
  2  2     9.99897380E-01   # cos(theta_b)
#
BLOCK STAUMIX  # Stau Mixing Matrix
  1  1    -4.36556751E-01   # cos(theta_tau)
  1  2     8.99676721E-01   # sin(theta_tau)
  2  1    -8.99676721E-01   # -sin(theta_tau)
  2  2    -4.36556751E-01   # cos(theta_tau)
#
BLOCK ALPHA  # Higgs mixing
          -7.61979961E-02   # Mixing angle in the neutral Higgs boson sector
#
BLOCK HMIX Q=  1.72587800E+03  # DRbar Higgs Parameters
         1    -1.84453932E+03   # mu(Q)MSSM           
         2     1.33350228E+01   # tan                 
         3     2.43475832E+02   # higgs               
         4     1.45481513E+06   # mA^2(Q)MSSM         
#
BLOCK GAUGE Q=  1.72587800E+03  # The gauge couplings
     1     3.63431519E-01   # gprime(Q) DRbar
     2     6.38149016E-01   # g(Q) DRbar
     3     1.03619967E+00   # g3(Q) DRbar
#
BLOCK AU Q=  1.72587800E+03  # The trilinear couplings
  1  1     0.00000000E+00   # A_u(Q) DRbar
  2  2     0.00000000E+00   # A_c(Q) DRbar
  3  3     2.40919000E+03   # A_t(Q) DRbar
#
BLOCK AD Q=  1.72587800E+03  # The trilinear couplings
  1  1     0.00000000E+00   # A_d(Q) DRbar
  2  2     0.00000000E+00   # A_s(Q) DRbar
  3  3    -3.81748000E+03   # A_b(Q) DRbar
#
BLOCK AE Q=  1.72587800E+03  # The trilinear couplings
  1  1     0.00000000E+00   # A_e(Q) DRbar
  2  2     0.00000000E+00   # A_mu(Q) DRbar
  3  3    -1.73143000E+03   # A_tau(Q) DRbar
#
BLOCK Yu Q=  1.72587800E+03  # The Yukawa couplings
  1  1     0.00000000E+00   # y_u(Q) DRbar
  2  2     0.00000000E+00   # y_c(Q) DRbar
  3  3     8.55232123E-01   # y_t(Q) DRbar
#
BLOCK Yd Q=  1.72587800E+03  # The Yukawa couplings
  1  1     0.00000000E+00   # y_d(Q) DRbar
  2  2     0.00000000E+00   # y_s(Q) DRbar
  3  3     2.16991246E-01   # y_b(Q) DRbar
#
BLOCK Ye Q=  1.72587800E+03  # The Yukawa couplings
  1  1     0.00000000E+00   # y_e(Q) DRbar
  2  2     0.00000000E+00   # y_mu(Q) DRbar
  3  3     1.40960633E-01   # y_tau(Q) DRbar
#
BLOCK MSOFT Q=  1.72587800E+03  # The soft SUSY breaking masses at the scale Q
         1     2.95101000E+03   # M_1(Q)              
         2    -7.27880000E+02   # M_2(Q)              
         3     1.50537000E+03   # M_3(Q)              
        21    -2.41270468E+06   # mH1^2(Q)            
        22    -3.41885987E+06   # mH2^2(Q)            
        31     3.33092000E+03   # meL(Q)              
        32     3.33092000E+03   # mmuL(Q)             
        33     9.46840000E+02   # mtauL(Q)            
        34     9.72440000E+02   # meR(Q)              
        35     9.72440000E+02   # mmuR(Q)             
        36     9.21010000E+02   # mtauR(Q)            
        41     3.05048000E+03   # mqL1(Q)             
        42     3.05048000E+03   # mqL2(Q)             
        43     1.05732000E+03   # mqL3(Q)             
        44     1.36828000E+03   # muR(Q)              
        45     1.36828000E+03   # mcR(Q)              
        46     2.81200000E+03   # mtR(Q)              
        47     1.46318000E+03   # mdR(Q)              
        48     1.46318000E+03   # msR(Q)              
        49     2.28379000E+03   # mbR(Q)              
#
Block HiggsBoundsInputHiggsCouplingsFermions
# ScalarNormEffCoupSq PseudoSNormEffCoupSq NP   IP1 IP2 IP2
    1.03626155E+00    0.00000000E+00        3  25   5   5  # h0-b-b eff. coupling^2, normalised to SM
    1.77786572E+02    0.00000000E+00        3  35   5   5  # H0-b-b eff. coupling^2, normalised to SM
    0.00000000E+00    1.77822833E+02        3  36   5   5  # A0-b-b eff. coupling^2, normalised to SM
#
    9.99796080E-01    0.00000000E+00        3  25   6   6  # h0-t-t eff. coupling^2, normalised to SM
    5.82749433E-03    0.00000000E+00        3  35   6   6  # H0-t-t eff. coupling^2, normalised to SM
    0.00000000E+00    5.62357478E-03        3  36   6   6  # A0-t-t eff. coupling^2, normalised to SM
#
    1.03626155E+00    0.00000000E+00        3  25  15  15  # h0-tau-tau eff. coupling^2, normalised to SM
    1.77786572E+02    0.00000000E+00        3  35  15  15  # H0-tau-tau eff. coupling^2, normalised to SM
    0.00000000E+00    1.77822833E+02        3  36  15  15  # A0-tau-tau eff. coupling^2, normalised to SM
#
Block HiggsBoundsInputHiggsCouplingsBosons
    9.99998184E-01        3  25  24  24  # h0-W-W eff. coupling^2, normalised to SM
    1.81601736E-06        3  35  24  24  # H0-W-W eff. coupling^2, normalised to SM
    0.00000000E+00        3  36  24  24  # A0-W-W eff. coupling^2, normalised to SM
#
    9.99998184E-01        3  25  23  23  # h0-Z-Z eff. coupling^2, normalised to SM
    1.81601736E-06        3  35  23  23  # H0-Z-Z eff. coupling^2, normalised to SM
    0.00000000E+00        3  36  23  23  # A0-Z-Z eff. coupling^2, normalised to SM
#
    8.93449380E-01        3  25  21  21  # h0-g-g eff. coupling^2, normalised to SM
    2.96905180E-05        3  35  21  21  # H0-g-g eff. coupling^2, normalised to SM
    3.01538350E-04        3  36  21  21  # A0-g-g eff. coupling^2, normalised to SM
#
    0.00000000E+00        3  25  25  23  # h0-h0-Z eff. coupling^2, normalised to SM
    0.00000000E+00        3  35  25  23  # H0-h0-Z eff. coupling^2, normalised to SM
    1.81601736E-06        3  36  25  23  # A0-h0-Z eff. coupling^2, normalised to SM
    0.00000000E+00        3  35  35  23  # H0-H0-Z eff. coupling^2, normalised to SM
    9.99998184E-01        3  36  35  23  # A0-H0-Z eff. coupling^2, normalised to SM
    0.00000000E+00        3  36  36  23  # A0-A0-Z eff. coupling^2, normalised to SM
#
    0.00000000E+00        4  25  21  21  23  # h0-g-g-Z eff. coupling^2, normalised to SM
    0.00000000E+00        4  35  21  21  23  # H0-g-g-Z eff. coupling^2, normalised to SM
    0.00000000E+00        4  36  21  21  23  # A0-g-g-Z eff. coupling^2, normalised to SM
#
#
#
#                             =================
#                             |The decay table|
#                             =================
#
# - The QCD corrections to the decays gluino -> squark  + quark
#                                     squark -> gaugino + quark_prime
#                                     squark -> squark_prime + Higgs
#                                     squark -> gluino  + quark
#   are included.
#
# - The multi-body decays for the inos, stops and sbottoms are included.
#
# - The loop induced decays for the gluino, neutralinos and stops
#   are included.
#
# - The SUSY decays of the top quark are included.
#
#
#         PDG            Width
DECAY         6     1.43342400E+00   # top decays
#          BR         NDA      ID1       ID2
     1.00000000E+00    2           5        24   # BR(t ->  b    W+)
#
#         PDG            Width
DECAY   1000021     2.24575506E+01   # gluino decays
#          BR         NDA      ID1       ID2
     1.19300899E-02    2     2000001        -1   # BR(~g -> ~d_R  db)
     1.19300899E-02    2    -2000001         1   # BR(~g -> ~d_R* d )
     3.60864794E-02    2     2000002        -2   # BR(~g -> ~u_R  ub)
     3.60864794E-02    2    -2000002         2   # BR(~g -> ~u_R* u )
     1.19300899E-02    2     2000003        -3   # BR(~g -> ~s_R  sb)
     1.19300899E-02    2    -2000003         3   # BR(~g -> ~s_R* s )
     3.60853403E-02    2     2000004        -4   # BR(~g -> ~c_R  cb)
     3.60853403E-02    2    -2000004         4   # BR(~g -> ~c_R* c )
     2.02279634E-01    2     1000005        -5   # BR(~g -> ~b_1  bb)
     2.02279634E-01    2    -1000005         5   # BR(~g -> ~b_1* b )
     2.01688367E-01    2     1000006        -6   # BR(~g -> ~t_1  tb)
     2.01688367E-01    2    -1000006         6   # BR(~g -> ~t_1* t )
#
#         PDG            Width
DECAY   1000006     4.21769168E+00   # stop1 decays
#          BR         NDA      ID1       ID2
     2.92962873E-01    2     1000022         6   # BR(~t_1 -> ~chi_10 t )
     7.07037127E-01    2     1000024         5   # BR(~t_1 -> ~chi_1+ b )
#
#         PDG            Width
DECAY   2000006     1.63035206E+02   # stop2 decays
#          BR         NDA      ID1       ID2
     2.76929201E-06    2     1000022         6   # BR(~t_2 -> ~chi_10 t )
     3.95563555E-02    2     1000023         6   # BR(~t_2 -> ~chi_20 t )
     4.09549597E-02    2     1000025         6   # BR(~t_2 -> ~chi_30 t )
     5.15551027E-06    2     1000024         5   # BR(~t_2 -> ~chi_1+ b )
     8.19874337E-02    2     1000037         5   # BR(~t_2 -> ~chi_2+ b )
     4.27881406E-01    2     1000021         6   # BR(~t_2 -> ~g      t )
     8.40347712E-02    2     1000006        25   # BR(~t_2 -> ~t_1    h )
     2.74284849E-02    2     1000006        35   # BR(~t_2 -> ~t_1    H )
     2.78559556E-02    2     1000006        36   # BR(~t_2 -> ~t_1    A )
     5.53636347E-02    2     1000005        37   # BR(~t_2 -> ~b_1    H+)
     7.28995499E-02    2     1000006        23   # BR(~t_2 -> ~t_1    Z )
     1.42027851E-01    2     1000005        24   # BR(~t_2 -> ~b_1    W+)
     1.67241773E-06    2     2000005        24   # BR(~t_2 -> ~b_2    W+)
#
#         PDG            Width
DECAY   1000005     3.95685017E+00   # sbottom1 decays
#          BR         NDA      ID1       ID2
     3.76530928E-01    2     1000022         5   # BR(~b_1 -> ~chi_10 b )
     6.23469072E-01    2    -1000024         6   # BR(~b_1 -> ~chi_1- t )
#
#         PDG            Width
DECAY   2000005     3.90615988E+01   # sbottom2 decays
#          BR         NDA      ID1       ID2
     2.43609152E-05    2     1000022         5   # BR(~b_2 -> ~chi_10 b )
     3.75262937E-03    2     1000023         5   # BR(~b_2 -> ~chi_20 b )
     3.71445064E-03    2     1000025         5   # BR(~b_2 -> ~chi_30 b )
     4.83570043E-05    2    -1000024         6   # BR(~b_2 -> ~chi_1- t )
     7.03287712E-03    2    -1000037         6   # BR(~b_2 -> ~chi_2- t )
     8.37377744E-01    2     1000021         5   # BR(~b_2 -> ~g      b )
     9.31192927E-03    2     1000005        25   # BR(~b_2 -> ~b_1    h )
     2.83009518E-02    2     1000005        35   # BR(~b_2 -> ~b_1    H )
     2.82899416E-02    2     1000005        36   # BR(~b_2 -> ~b_1    A )
     5.60342880E-02    2     1000006       -37   # BR(~b_2 -> ~t_1    H-)
     8.86992194E-03    2     1000005        23   # BR(~b_2 -> ~b_1    Z )
     1.72425481E-02    2     1000006       -24   # BR(~b_2 -> ~t_1    W-)
#
#         PDG            Width
DECAY   1000002     1.49525361E+02   # sup_L decays
#          BR         NDA      ID1       ID2
     7.09280082E-02    2     1000022         2   # BR(~u_L -> ~chi_10 u)
     2.07304816E-05    2     1000023         2   # BR(~u_L -> ~chi_20 u)
     9.75729383E-05    2     1000025         2   # BR(~u_L -> ~chi_30 u)
     3.22572868E-05    2     1000035         2   # BR(~u_L -> ~chi_40 u)
     1.42144029E-01    2     1000024         1   # BR(~u_L -> ~chi_1+ d)
     8.31380725E-05    2     1000037         1   # BR(~u_L -> ~chi_2+ d)
     7.86694264E-01    2     1000021         2   # BR(~u_L -> ~g      u)
#
#         PDG            Width
DECAY   2000002     9.29796953E-04   # sup_R decays
#           BR         NDA      ID1       ID2
     2.17458059E-04    2     1000022         2   # BR(~u_R -> ~chi_10 u)
#           BR         NDA      ID1       ID2       ID3
     4.83331332E-01    3        2       -5        1000005   # BR(~u_R -> u  bb  ~b_1)
     3.05808703E-01    3        2       5        -1000005   # BR(~u_R -> u  b  ~b_1*)
     1.14110935E-01    3        2       -6        1000006   # BR(~u_R -> u  tb  ~t_1)
     8.16855764E-02    3        2       6        -1000006   # BR(~u_R -> u  t  ~t_1*)
     5.15306055E-04    3        2       -11        2000011   # BR(~u_R -> u  e+  ~e_R-)
     2.93988918E-03    3        2       11        -2000011   # BR(~u_R -> u  e-  ~e_R+)
     5.00711471E-04    3        2       -13        2000013   # BR(~u_R -> u  mu+  ~mu_R-)
     2.96193700E-03    3        2       13        -2000013   # BR(~u_R -> u  mu-  ~mu_R+)
     9.55122511E-04    3        2       -15        1000015   # BR(~u_R -> u  tau+  ~tau_1-)
     4.44376591E-03    3        2       15        -1000015   # BR(~u_R -> u  tau-  ~tau_1+)
     7.48711854E-04    3        2       -15        2000015   # BR(~u_R -> u  tau+  ~tau_2-)
     6.73233009E-04    3        2       15        -2000015   # BR(~u_R -> u  tau-  ~tau_2+)
     9.02035652E-04    3        2       -16        1000016   # BR(~u_R -> u  nu_taub  ~nu_tau1)
     1.53667959E-04    3        2       16        -1000016   # BR(~u_R -> u  nu_tau  ~nu_tau1*)
     4.35008954E-06    3        2       23        1000022   # BR(~u_R -> u  Z  ~chi_10)
     1.24629361E-05    3        2       25        1000022   # BR(~u_R -> u  h  ~chi_10)
     3.07637059E-05    3        2       -24        1000024   # BR(~u_R -> u  W-  ~chi_1+)
     4.03754819E-06    3        2       24        -1000024   # BR(~u_R -> u  W+  ~chi_1-)
#
#         PDG            Width
DECAY   1000001     1.49571952E+02   # sdown_L decays
#          BR         NDA      ID1       ID2
     7.09135232E-02    2     1000022         1   # BR(~d_L -> ~chi_10 d)
     7.74510201E-06    2     1000023         1   # BR(~d_L -> ~chi_20 d)
     1.07274783E-04    2     1000025         1   # BR(~d_L -> ~chi_30 d)
     3.29043298E-05    2     1000035         1   # BR(~d_L -> ~chi_40 d)
     1.41524923E-01    2    -1000024         2   # BR(~d_L -> ~chi_1- u)
     3.78551398E-04    2    -1000037         2   # BR(~d_L -> ~chi_2- u)
     7.87035078E-01    2     1000021         1   # BR(~d_L -> ~g      d)
#
#         PDG            Width
DECAY   2000001     5.58571277E-03   # sdown_R decays
#           BR         NDA      ID1       ID2
     1.04128030E-05    2     1000022         1   # BR(~d_R -> ~chi_10 d)
#           BR         NDA      ID1       ID2       ID3
     7.87365943E-04    3        1       -2        2000002   # BR(~d_R -> d  ub  ~u_R)
     9.54291819E-04    3        1       2        -2000002   # BR(~d_R -> d  u  ~u_R*)
     7.92736788E-04    3        1       -4        2000004   # BR(~d_R -> d  cb  ~c_R)
     9.65516886E-04    3        1       4        -2000004   # BR(~d_R -> d  c  ~c_R*)
     3.75690639E-01    3        1       -5        1000005   # BR(~d_R -> d  bb  ~b_1)
     2.59698280E-01    3        1       5        -1000005   # BR(~d_R -> d  b  ~b_1*)
     2.04056321E-01    3        1       -6        1000006   # BR(~d_R -> d  tb  ~t_1)
     1.55738405E-01    3        1       6        -1000006   # BR(~d_R -> d  t  ~t_1*)
     4.91324942E-05    3        1       -11        2000011   # BR(~d_R -> d  e+  ~e_R-)
     2.67861965E-04    3        1       11        -2000011   # BR(~d_R -> d  e-  ~e_R+)
     4.89606271E-05    3        1       -13        2000013   # BR(~d_R -> d  mu+  ~mu_R-)
     2.67056339E-04    3        1       13        -2000013   # BR(~d_R -> d  mu-  ~mu_R+)
     8.18498944E-05    3        1       -15        1000015   # BR(~d_R -> d  tau+  ~tau_1-)
     3.64680406E-04    3        1       15        -1000015   # BR(~d_R -> d  tau-  ~tau_1+)
     6.78230363E-05    3        1       -15        2000015   # BR(~d_R -> d  tau+  ~tau_2-)
     6.15480986E-05    3        1       15        -2000015   # BR(~d_R -> d  tau-  ~tau_2+)
     7.88171570E-05    3        1       -16        1000016   # BR(~d_R -> d  nu_taub  ~nu_tau1)
     1.42633543E-05    3        1       16        -1000016   # BR(~d_R -> d  nu_tau  ~nu_tau1*)
     4.61355624E-07    3        1       23        1000022   # BR(~d_R -> d  Z  ~chi_10)
     8.66979775E-07    3        1       25        1000022   # BR(~d_R -> d  h  ~chi_10)
     2.47363239E-06    3        1       -24        1000024   # BR(~d_R -> d  W-  ~chi_1+)
     2.34061445E-07    3        1       24        -1000024   # BR(~d_R -> d  W+  ~chi_1-)
#
#         PDG            Width
DECAY   1000004     1.23585175E+02   # scharm_L decays
#          BR         NDA      ID1       ID2
     8.90025903E-02    2     1000022         4   # BR(~c_L -> ~chi_10 c)
     2.58506575E-05    2     1000023         4   # BR(~c_L -> ~chi_20 c)
     1.21668195E-04    2     1000025         4   # BR(~c_L -> ~chi_30 c)
     3.78288974E-05    2     1000035         4   # BR(~c_L -> ~chi_40 c)
     1.78366580E-01    2     1000024         3   # BR(~c_L -> ~chi_1+ s)
     1.03667223E-04    2     1000037         3   # BR(~c_L -> ~chi_2+ s)
     7.32341815E-01    2     1000021         4   # BR(~c_L -> ~g      c)
#
#         PDG            Width
DECAY   2000004     9.33742915E-04   # scharm_R decays
#           BR         NDA      ID1       ID2
     2.19752437E-04    2     1000022         4   # BR(~c_R -> ~chi_10 c)
#           BR         NDA      ID1       ID2       ID3
     4.81942077E-01    3        4       -5        1000005   # BR(~c_R -> c  bb  ~b_1)
     3.07183054E-01    3        4       5        -1000005   # BR(~c_R -> c  b  ~b_1*)
     1.14078510E-01    3        4       -6        1000006   # BR(~c_R -> c  tb  ~t_1)
     8.17269923E-02    3        4       6        -1000006   # BR(~c_R -> c  t  ~t_1*)
     4.98574064E-04    3        4       -11        2000011   # BR(~c_R -> c  e+  ~e_R-)
     2.94941997E-03    3        4       11        -2000011   # BR(~c_R -> c  e-  ~e_R+)
     5.03136348E-04    3        4       -13        2000013   # BR(~c_R -> c  mu+  ~mu_R-)
     2.94824192E-03    3        4       13        -2000013   # BR(~c_R -> c  mu-  ~mu_R+)
     9.46705979E-04    3        4       -15        1000015   # BR(~c_R -> c  tau+  ~tau_1-)
     4.46686120E-03    3        4       15        -1000015   # BR(~c_R -> c  tau-  ~tau_1+)
     7.53237309E-04    3        4       -15        2000015   # BR(~c_R -> c  tau+  ~tau_2-)
     6.79159103E-04    3        4       15        -2000015   # BR(~c_R -> c  tau-  ~tau_2+)
     8.98084459E-04    3        4       -16        1000016   # BR(~c_R -> c  nu_taub  ~nu_tau1)
     1.54956999E-04    3        4       16        -1000016   # BR(~c_R -> c  nu_tau  ~nu_tau1*)
     4.32228179E-06    3        4       23        1000022   # BR(~c_R -> c  Z  ~chi_10)
     1.23042433E-05    3        4       25        1000022   # BR(~c_R -> c  h  ~chi_10)
     3.06015709E-05    3        4       -24        1000024   # BR(~c_R -> c  W-  ~chi_1+)
     4.00913350E-06    3        4       24        -1000024   # BR(~c_R -> c  W+  ~chi_1-)
#
#         PDG            Width
DECAY   1000003     1.23609695E+02   # sstrange_L decays
#          BR         NDA      ID1       ID2
     8.89941453E-02    2     1000022         3   # BR(~s_L -> ~chi_10 s)
     9.65918956E-06    2     1000023         3   # BR(~s_L -> ~chi_20 s)
     1.33781696E-04    2     1000025         3   # BR(~s_L -> ~chi_30 s)
     3.86023875E-05    2     1000035         3   # BR(~s_L -> ~chi_40 s)
     1.77608969E-01    2    -1000024         4   # BR(~s_L -> ~chi_1- c)
     4.72081340E-04    2    -1000037         4   # BR(~s_L -> ~chi_2- c)
     7.32742761E-01    2     1000021         3   # BR(~s_L -> ~g      s)
#
#         PDG            Width
DECAY   2000003     5.61205237E-03   # sstrange_R decays
#           BR         NDA      ID1       ID2
     1.05893210E-05    2     1000022         3   # BR(~s_R -> ~chi_10 s)
#           BR         NDA      ID1       ID2       ID3
     7.84472366E-04    3        3       -2        2000002   # BR(~s_R -> s  ub  ~u_R)
     9.58027411E-04    3        3       2        -2000002   # BR(~s_R -> s  u  ~u_R*)
     7.86147333E-04    3        3       -4        2000004   # BR(~s_R -> s  cb  ~c_R)
     9.55479324E-04    3        3       4        -2000004   # BR(~s_R -> s  c  ~c_R*)
     3.73927373E-01    3        3       -5        1000005   # BR(~s_R -> s  bb  ~b_1)
     2.62132265E-01    3        3       5        -1000005   # BR(~s_R -> s  b  ~b_1*)
     2.03294611E-01    3        3       -6        1000006   # BR(~s_R -> s  tb  ~t_1)
     1.55853856E-01    3        3       6        -1000006   # BR(~s_R -> s  t  ~t_1*)
     4.86577783E-05    3        3       -11        2000011   # BR(~s_R -> s  e+  ~e_R-)
     2.66604782E-04    3        3       11        -2000011   # BR(~s_R -> s  e-  ~e_R+)
     4.87308354E-05    3        3       -13        2000013   # BR(~s_R -> s  mu+  ~mu_R-)
     2.62791561E-04    3        3       13        -2000013   # BR(~s_R -> s  mu-  ~mu_R+)
     8.19557570E-05    3        3       -15        1000015   # BR(~s_R -> s  tau+  ~tau_1-)
     3.62968816E-04    3        3       15        -1000015   # BR(~s_R -> s  tau-  ~tau_1+)
     6.75047158E-05    3        3       -15        2000015   # BR(~s_R -> s  tau+  ~tau_2-)
     6.12681382E-05    3        3       15        -2000015   # BR(~s_R -> s  tau-  ~tau_2+)
     7.84472366E-05    3        3       -16        1000016   # BR(~s_R -> s  nu_taub  ~nu_tau1)
     1.42258117E-05    3        3       16        -1000016   # BR(~s_R -> s  nu_tau  ~nu_tau1*)
     4.64749762E-07    3        3       23        1000022   # BR(~s_R -> s  Z  ~chi_10)
     8.65084586E-07    3        3       25        1000022   # BR(~s_R -> s  h  ~chi_10)
     2.46113170E-06    3        3       -24        1000024   # BR(~s_R -> s  W-  ~chi_1+)
     2.32962901E-07    3        3       24        -1000024   # BR(~s_R -> s  W+  ~chi_1-)
#
#         PDG            Width
DECAY   1000011     3.66539858E+01   # selectron_L decays
#          BR         NDA      ID1       ID2
     3.30858482E-01    2     1000022        11   # BR(~e_L -> ~chi_10 e-)
     2.12370788E-04    2     1000023        11   # BR(~e_L -> ~chi_20 e-)
     4.69699398E-04    2     1000025        11   # BR(~e_L -> ~chi_30 e-)
     6.48008667E-03    2     1000035        11   # BR(~e_L -> ~chi_40 e-)
     6.59968377E-01    2    -1000024        12   # BR(~e_L -> ~chi_1- nu_e)
     2.01098463E-03    2    -1000037        12   # BR(~e_L -> ~chi_2- nu_e)
#
#         PDG            Width
DECAY   2000011     9.47438227E-08   # selectron_R decays
#           BR         NDA      ID1       ID2
     9.89442400E-01    2     1000022        11   # BR(~e_R -> ~chi_10 e-)
#           BR         NDA      ID1       ID2       ID3
     1.01757558E-03    3        11       -15        1000015   # BR(~e_R- -> e-  tau+  ~tau_1-)
     6.03828285E-03    3        11       15        -1000015   # BR(~e_R- -> e-  tau-  ~tau_1+)
     2.04129403E-08    3        11       -15        2000015   # BR(~e_R- -> e-  tau+  ~tau_2-)
     1.79768976E-08    3        11       15        -2000015   # BR(~e_R- -> e-  tau-  ~tau_2+)
     8.21541687E-06    3        11       -16        1000016   # BR(~e_R- -> e-  nu_taub  ~nu_tau1)
     9.11331182E-07    3        11       16        -1000016   # BR(~e_R- -> e-  nu_tau  ~nu_tau1*)
     1.55989062E-04    3        11       23        1000022   # BR(~e_R- -> e-  Z  ~chi_10)
     6.75600774E-04    3        11       25        1000022   # BR(~e_R- -> e-  h  ~chi_10)
     1.75642058E-03    3        11       -24        1000024   # BR(~e_R- -> e-  W-  ~chi_1+)
     9.04565570E-04    3        11       24        -1000024   # BR(~e_R- -> e-  W+  ~chi_1-)
#
#         PDG            Width
DECAY   1000013     3.66539858E+01   # smuon_L decays
#          BR         NDA      ID1       ID2
     3.30858481E-01    2     1000022        13   # BR(~mu_L -> ~chi_10 mu-)
     2.12370787E-04    2     1000023        13   # BR(~mu_L -> ~chi_20 mu-)
     4.69699396E-04    2     1000025        13   # BR(~mu_L -> ~chi_30 mu-)
     6.48008644E-03    2     1000035        13   # BR(~mu_L -> ~chi_40 mu-)
     6.59968378E-01    2    -1000024        14   # BR(~mu_L -> ~chi_1- nu_mu)
     2.01098463E-03    2    -1000037        14   # BR(~mu_L -> ~chi_2- nu_mu)
#
#         PDG            Width
DECAY   2000013     9.47477369E-08   # smuon_R decays
#           BR         NDA      ID1       ID2
     9.89401375E-01    2     1000022        13   # BR(~mu_R -> ~chi_10 mu-)
#           BR         NDA      ID1       ID2       ID3
     1.01160200E-03    3        13       -15        1000015   # BR(~mu_R- -> mu-  tau+  ~tau_1-)
     6.07887870E-03    3        13       15        -1000015   # BR(~mu_R- -> mu-  tau-  ~tau_1+)
     2.06590686E-08    3        13       -15        2000015   # BR(~mu_R- -> mu-  tau+  ~tau_2-)
     1.79550463E-08    3        13       15        -2000015   # BR(~mu_R- -> mu-  tau-  ~tau_2+)
     8.04694681E-06    3        13       -16        1000016   # BR(~mu_R- -> mu-  nu_taub  ~nu_tau1)
     9.14565380E-07    3        13       16        -1000016   # BR(~mu_R- -> mu-  nu_tau  ~nu_tau1*)
     1.55771531E-04    3        13       23        1000022   # BR(~mu_R- -> mu-  Z  ~chi_10)
     6.76976591E-04    3        13       25        1000022   # BR(~mu_R- -> mu-  h  ~chi_10)
     1.75624247E-03    3        13       -24        1000024   # BR(~mu_R- -> mu-  W-  ~chi_1+)
     9.10153665E-04    3        13       24        -1000024   # BR(~mu_R- -> mu-  W+  ~chi_1-)
#
#         PDG            Width
DECAY   1000015     2.09975086E-01   # stau_1 decays
#          BR         NDA      ID1       ID2
     3.34309010E-01    2     1000022        15   # BR(~tau_1 -> ~chi_10  tau-)
     6.65690990E-01    2    -1000024        16   # BR(~tau_1 -> ~chi_1-  nu_tau)
#
#         PDG            Width
DECAY   2000015     1.38129502E+00   # stau_2 decays
#          BR         NDA      ID1       ID2
     3.34221173E-01    2     1000022        15   # BR(~tau_2 -> ~chi_10  tau-)
     6.65778827E-01    2    -1000024        16   # BR(~tau_2 -> ~chi_1-  nu_tau)
#
#         PDG            Width
DECAY   1000012     3.66747567E+01   # snu_eL decays
#          BR         NDA      ID1       ID2
     3.30258869E-01    2     1000022        12   # BR(~nu_eL -> ~chi_10 nu_e)
     5.42132435E-06    2     1000023        12   # BR(~nu_eL -> ~chi_20 nu_e)
     6.22301667E-04    2     1000025        12   # BR(~nu_eL -> ~chi_30 nu_e)
     6.46281084E-03    2     1000035        12   # BR(~nu_eL -> ~chi_40 nu_e)
     6.62209384E-01    2     1000024        11   # BR(~nu_eL -> ~chi_1+ e-)
     4.41212870E-04    2     1000037        11   # BR(~nu_eL -> ~chi_2+ e-)
#
#         PDG            Width
DECAY   1000014     3.66747567E+01   # snu_muL decays
#          BR         NDA      ID1       ID2
     3.30258869E-01    2     1000022        14   # BR(~nu_muL -> ~chi_10 nu_mu)
     5.42132436E-06    2     1000023        14   # BR(~nu_muL -> ~chi_20 nu_mu)
     6.22301668E-04    2     1000025        14   # BR(~nu_muL -> ~chi_30 nu_mu)
     6.46281085E-03    2     1000035        14   # BR(~nu_muL -> ~chi_40 nu_mu)
     6.62209384E-01    2     1000024        13   # BR(~nu_muL -> ~chi_1+ mu-)
     4.41212869E-04    2     1000037        13   # BR(~nu_muL -> ~chi_2+ mu-)
#
#         PDG            Width
DECAY   1000016     1.55313904E+00   # snu_tauL decays
#          BR         NDA      ID1       ID2
     3.33100772E-01    2     1000022        16   # BR(~nu_tauL -> ~chi_10 nu_tau)
     6.66899228E-01    2     1000024        15   # BR(~nu_tauL -> ~chi_1+ tau-)
#
#         PDG            Width
DECAY   1000024     3.80460280E-15   # chargino1+ decays
#           BR         NDA      ID1       ID2       ID3
     1.94379010E-02    3     1000022       -11        12   # BR(~chi_1+ -> ~chi_10 e+   nu_e)
     2.31497250E-03    3     1000022       -13        14   # BR(~chi_1+ -> ~chi_10 mu+  nu_mu)
     9.78247130E-01    2     1000022       211             # BR(~chi_1+ -> ~chi_10 pi+)
#
#         PDG            Width
DECAY   1000037     2.96461769E+01   # chargino2+ decays
#          BR         NDA      ID1       ID2
     3.28357381E-02    2     1000006        -5   # BR(~chi_2+ -> ~t_1     bb)
     4.81852167E-01    2    -1000005         6   # BR(~chi_2+ -> ~b_1*    t )
     6.73965677E-03    2     1000016       -15   # BR(~chi_2+ -> ~nu_tau1 tau+)
     3.94646196E-03    2    -1000015        16   # BR(~chi_2+ -> ~tau_1+  nu_tau)
     3.55676721E-03    2    -2000015        16   # BR(~chi_2+ -> ~tau_2+  nu_tau)
     1.33449562E-01    2     1000024        23   # BR(~chi_2+ -> ~chi_1+  Z )
     1.29975082E-01    2     1000022        24   # BR(~chi_2+ -> ~chi_10  W+)
     1.32498497E-01    2     1000024        25   # BR(~chi_2+ -> ~chi_1+  h )
     2.49928861E-02    2     1000024        35   # BR(~chi_2+ -> ~chi_1+  H )
     2.53168091E-02    2     1000024        36   # BR(~chi_2+ -> ~chi_1+  A )
     2.48363724E-02    2     1000022        37   # BR(~chi_2+ -> ~chi_10  H+)
#
#         PDG            Width
DECAY   1000022     0.00000000E+00   # neutralino1 decays
#
#         PDG            Width
DECAY   1000023     2.90914698E+01   # neutralino2 decays
#          BR         NDA      ID1       ID2
     1.19523945E-01    2     1000022        23   # BR(~chi_20 -> ~chi_10   Z )
     1.31692143E-01    2     1000024       -24   # BR(~chi_20 -> ~chi_1+   W-)
     1.31692143E-01    2    -1000024        24   # BR(~chi_20 -> ~chi_1-   W+)
     1.52273976E-02    2     1000022        25   # BR(~chi_20 -> ~chi_10   h )
     7.95260671E-04    2     1000022        35   # BR(~chi_20 -> ~chi_10   H )
     2.40989705E-02    2     1000022        36   # BR(~chi_20 -> ~chi_10   A )
     2.43193566E-02    2     1000024       -37   # BR(~chi_20 -> ~chi_1+   H-)
     2.43193566E-02    2    -1000024        37   # BR(~chi_20 -> ~chi_1-   H+)
     2.14248790E-05    2     2000002        -2   # BR(~chi_20 -> ~u_R      ub)
     2.14248790E-05    2    -2000002         2   # BR(~chi_20 -> ~u_R*     u )
     3.44810256E-06    2     2000001        -1   # BR(~chi_20 -> ~d_R      db)
     3.44810256E-06    2    -2000001         1   # BR(~chi_20 -> ~d_R*     d )
     2.14247472E-05    2     2000004        -4   # BR(~chi_20 -> ~c_R      cb)
     2.14247472E-05    2    -2000004         4   # BR(~chi_20 -> ~c_R*     c )
     3.44810256E-06    2     2000003        -3   # BR(~chi_20 -> ~s _R      sb)
     3.44810256E-06    2    -2000003         3   # BR(~chi_20 -> ~s _R*     s )
     2.40529245E-01    2     1000006        -6   # BR(~chi_20 -> ~t_1      tb)
     2.40529245E-01    2    -1000006         6   # BR(~chi_20 -> ~t_1*     t )
     1.64992434E-02    2     1000005        -5   # BR(~chi_20 -> ~b_1      bb)
     1.64992434E-02    2    -1000005         5   # BR(~chi_20 -> ~b_1*     b )
     5.56671288E-05    2     2000011       -11   # BR(~chi_20 -> ~e_R-     e+)
     5.56671288E-05    2    -2000011        11   # BR(~chi_20 -> ~e_R+     e-)
     5.56671288E-05    2     2000013       -13   # BR(~chi_20 -> ~mu_R-    mu+)
     5.56671288E-05    2    -2000013        13   # BR(~chi_20 -> ~mu_R+    mu-)
     3.55241780E-03    2     1000015       -15   # BR(~chi_20 -> ~tau_1-   tau+)
     3.55241780E-03    2    -1000015        15   # BR(~chi_20 -> ~tau_1+   tau-)
     3.42164082E-03    2     2000015       -15   # BR(~chi_20 -> ~tau_2-   tau+)
     3.42164082E-03    2    -2000015        15   # BR(~chi_20 -> ~tau_2+   tau-)
     2.08637606E-06    2     1000016       -16   # BR(~chi_20 -> ~nu_tau1  nu_taub)
     2.08637606E-06    2    -1000016        16   # BR(~chi_20 -> ~nu_tau1* nu_tau )
#
#         PDG            Width
DECAY   1000025     3.00076886E+01   # neutralino3 decays
#          BR         NDA      ID1       ID2
     1.54398617E-02    2     1000022        23   # BR(~chi_30 -> ~chi_10   Z )
     1.28506267E-01    2     1000024       -24   # BR(~chi_30 -> ~chi_1+   W-)
     1.28506267E-01    2    -1000024        24   # BR(~chi_30 -> ~chi_1-   W+)
     1.16178669E-01    2     1000022        25   # BR(~chi_30 -> ~chi_10   h )
     2.35072978E-02    2     1000022        35   # BR(~chi_30 -> ~chi_10   H )
     8.09965981E-04    2     1000022        36   # BR(~chi_30 -> ~chi_10   A )
     2.41125076E-02    2     1000024       -37   # BR(~chi_30 -> ~chi_1+   H-)
     2.41125076E-02    2    -1000024        37   # BR(~chi_30 -> ~chi_1-   H+)
     1.52431648E-06    2     2000002        -2   # BR(~chi_30 -> ~u_R      ub)
     1.52431648E-06    2    -2000002         2   # BR(~chi_30 -> ~u_R*     u )
     2.46284849E-07    2     2000001        -1   # BR(~chi_30 -> ~d_R      db)
     2.46284849E-07    2    -2000001         1   # BR(~chi_30 -> ~d_R*     d )
     1.52430725E-06    2     2000004        -4   # BR(~chi_30 -> ~c_R      cb)
     1.52430725E-06    2    -2000004         4   # BR(~chi_30 -> ~c_R*     c )
     2.46284849E-07    2     2000003        -3   # BR(~chi_30 -> ~s _R      sb)
     2.46284849E-07    2    -2000003         3   # BR(~chi_30 -> ~s _R*     s )
     2.46097943E-01    2     1000006        -6   # BR(~chi_30 -> ~t_1      tb)
     2.46097943E-01    2    -1000006         6   # BR(~chi_30 -> ~t_1*     t )
     1.63218829E-02    2     1000005        -5   # BR(~chi_30 -> ~b_1      bb)
     1.63218829E-02    2    -1000005         5   # BR(~chi_30 -> ~b_1*     b )
     3.93243247E-06    2     2000011       -11   # BR(~chi_30 -> ~e_R-     e+)
     3.93243247E-06    2    -2000011        11   # BR(~chi_30 -> ~e_R+     e-)
     3.93243247E-06    2     2000013       -13   # BR(~chi_30 -> ~mu_R-    mu+)
     3.93243247E-06    2    -2000013        13   # BR(~chi_30 -> ~mu_R+    mu-)
     2.77307970E-03    2     1000015       -15   # BR(~chi_30 -> ~tau_1-   tau+)
     2.77307970E-03    2    -1000015        15   # BR(~chi_30 -> ~tau_1+   tau-)
     3.97529867E-03    2     2000015       -15   # BR(~chi_30 -> ~tau_2-   tau+)
     3.97529867E-03    2    -2000015        15   # BR(~chi_30 -> ~tau_2+   tau-)
     2.33718266E-04    2     1000016       -16   # BR(~chi_30 -> ~nu_tau1  nu_taub)
     2.33718266E-04    2    -1000016        16   # BR(~chi_30 -> ~nu_tau1* nu_tau )
#
#         PDG            Width
DECAY   1000035     8.09090198E+01   # neutralino4 decays
#          BR         NDA      ID1       ID2
     1.29509111E-04    2     1000022        23   # BR(~chi_40 -> ~chi_10   Z )
     1.04336818E-03    2     1000023        23   # BR(~chi_40 -> ~chi_20   Z )
     1.38977030E-02    2     1000025        23   # BR(~chi_40 -> ~chi_30   Z )
     1.77972799E-04    2     1000024       -24   # BR(~chi_40 -> ~chi_1+   W-)
     1.77972799E-04    2    -1000024        24   # BR(~chi_40 -> ~chi_1-   W+)
     1.44974088E-02    2     1000037       -24   # BR(~chi_40 -> ~chi_2+   W-)
     1.44974088E-02    2    -1000037        24   # BR(~chi_40 -> ~chi_2-   W+)
     5.43337612E-05    2     1000022        25   # BR(~chi_40 -> ~chi_10   h )
     5.10424379E-06    2     1000022        35   # BR(~chi_40 -> ~chi_10   H )
     3.37069381E-05    2     1000022        36   # BR(~chi_40 -> ~chi_10   A )
     1.60300421E-02    2     1000023        25   # BR(~chi_40 -> ~chi_20   h )
     7.08668150E-03    2     1000023        35   # BR(~chi_40 -> ~chi_20   H )
     3.41030939E-05    2     1000023        36   # BR(~chi_40 -> ~chi_20   A )
     1.09494017E-03    2     1000025        25   # BR(~chi_40 -> ~chi_30   h )
     3.18079602E-05    2     1000025        35   # BR(~chi_40 -> ~chi_30   H )
     6.92243383E-03    2     1000025        36   # BR(~chi_40 -> ~chi_30   A )
     3.85114070E-05    2     1000024       -37   # BR(~chi_40 -> ~chi_1+   H-)
     3.85114070E-05    2    -1000024        37   # BR(~chi_40 -> ~chi_1-   H+)
     6.69135883E-03    2     1000037       -37   # BR(~chi_40 -> ~chi_2+   H-)
     6.69135883E-03    2    -1000037        37   # BR(~chi_40 -> ~chi_2-   H+)
     7.04194424E-02    2     2000002        -2   # BR(~chi_40 -> ~u_R      ub)
     7.04194424E-02    2    -2000002         2   # BR(~chi_40 -> ~u_R*     u )
     1.62009495E-02    2     2000001        -1   # BR(~chi_40 -> ~d_R      db)
     1.62009495E-02    2    -2000001         1   # BR(~chi_40 -> ~d_R*     d )
     7.04194241E-02    2     2000004        -4   # BR(~chi_40 -> ~c_R      cb)
     7.04194241E-02    2    -2000004         4   # BR(~chi_40 -> ~c_R*     c )
     1.62009495E-02    2     2000003        -3   # BR(~chi_40 -> ~s _R      sb)
     1.62009495E-02    2    -2000003         3   # BR(~chi_40 -> ~s _R*     s )
     7.24711769E-03    2     1000006        -6   # BR(~chi_40 -> ~t_1      tb)
     7.24711769E-03    2    -1000006         6   # BR(~chi_40 -> ~t_1*     t )
     5.66921148E-03    2     1000005        -5   # BR(~chi_40 -> ~b_1      bb)
     5.66921148E-03    2    -1000005         5   # BR(~chi_40 -> ~b_1*     b )
     4.41431768E-03    2     2000005        -5   # BR(~chi_40 -> ~b_2      bb)
     4.41431768E-03    2    -2000005         5   # BR(~chi_40 -> ~b_2*     b )
     7.49878125E-02    2     2000011       -11   # BR(~chi_40 -> ~e_R-     e+)
     7.49878125E-02    2    -2000011        11   # BR(~chi_40 -> ~e_R+     e-)
     7.49878125E-02    2     2000013       -13   # BR(~chi_40 -> ~mu_R-    mu+)
     7.49878125E-02    2    -2000013        13   # BR(~chi_40 -> ~mu_R+    mu-)
     6.62614059E-02    2     1000015       -15   # BR(~chi_40 -> ~tau_1-   tau+)
     6.62614059E-02    2    -1000015        15   # BR(~chi_40 -> ~tau_1+   tau-)
     2.96195817E-02    2     2000015       -15   # BR(~chi_40 -> ~tau_2-   tau+)
     2.96195817E-02    2    -2000015        15   # BR(~chi_40 -> ~tau_2+   tau-)
     1.89848561E-02    2     1000016       -16   # BR(~chi_40 -> ~nu_tau1  nu_taub)
     1.89848561E-02    2    -1000016        16   # BR(~chi_40 -> ~nu_tau1* nu_tau )
#
#         PDG            Width
DECAY        25     3.82313109E-03   # h decays
#          BR         NDA      ID1       ID2
     5.95548221E-01    2           5        -5   # BR(h -> b       bb     )
     6.96274236E-02    2         -15        15   # BR(h -> tau+    tau-   )
     2.46594910E-04    2         -13        13   # BR(h -> mu+     mu-    )
     2.70291745E-04    2           3        -3   # BR(h -> s       sb     )
     2.25646707E-02    2           4        -4   # BR(h -> c       cb     )
     8.21039607E-02    2          21        21   # BR(h -> g       g      )
     2.39575691E-03    2          22        22   # BR(h -> gam     gam    )
     1.52115011E-03    2          22        23   # BR(h -> Z       gam    )
     2.00905089E-01    2          24       -24   # BR(h -> W+      W-     )
     2.48168412E-02    2          23        23   # BR(h -> Z       Z      )
#
#         PDG            Width
DECAY        35     3.78359893E+00   # H decays
#          BR         NDA      ID1       ID2
     8.37796217E-01    2           5        -5   # BR(H -> b       bb     )
     9.43979893E-02    2         -15        15   # BR(H -> tau+    tau-   )
     3.44468739E-04    2         -13        13   # BR(H -> mu+     mu-    )
     3.01900308E-04    2           3        -3   # BR(H -> s       sb     )
     7.49247460E-07    2           4        -4   # BR(H -> c       cb     )
     6.61493824E-02    2           6        -6   # BR(H -> t       tb     )
     1.03195850E-04    2          21        21   # BR(H -> g       g      )
     2.81690833E-07    2          22        22   # BR(H -> gam     gam    )
     9.51128989E-08    2          23        22   # BR(H -> Z       gam    )
     1.56304538E-04    2          24       -24   # BR(H -> W+      W-     )
     7.72135562E-05    2          23        23   # BR(H -> Z       Z      )
     6.72201825E-04    2          25        25   # BR(H -> h       h      )
#
#         PDG            Width
DECAY        36     3.79746477E+00   # A decays
#          BR         NDA      ID1       ID2
     8.34994129E-01    2           5        -5   # BR(A -> b       bb     )
     9.40739024E-02    2         -15        15   # BR(A -> tau+    tau-   )
     3.43280810E-04    2         -13        13   # BR(A -> mu+     mu-    )
     3.00975196E-04    2           3        -3   # BR(A -> s       sb     )
     7.26973246E-07    2           4        -4   # BR(A -> c       cb     )
     6.98052339E-02    2           6        -6   # BR(A -> t       tb     )
     3.27667960E-04    2          21        21   # BR(A -> g       g      )
     4.51942142E-07    2          22        22   # BR(A -> gam     gam    )
     2.21062066E-07    2          23        22   # BR(A -> Z       gam    )
     1.53410513E-04    2          23        25   # BR(A -> Z       h      )
#
#         PDG            Width
DECAY        37     3.91129861E+00   # H+ decays
#          BR         NDA      ID1       ID2
     1.44027109E-03    2           4        -5   # BR(H+ -> c       bb     )
     9.16186118E-02    2         -15        16   # BR(H+ -> tau+    nu_tau )
     3.34321308E-04    2         -13        14   # BR(H+ -> mu+     nu_mu  )
     1.44025673E-05    2           2        -5   # BR(H+ -> u       bb     )
     1.45952643E-05    2           2        -3   # BR(H+ -> u       sb     )
     2.87955071E-04    2           4        -3   # BR(H+ -> c       sb     )
     9.06138594E-01    2           6        -5   # BR(H+ -> t       bb     )
     1.51248603E-04    2          24        25   # BR(H+ -> W+      h      )
     1.02998609E-10    2          24        36   # BR(H+ -> W+      A      )
