#
#                              ======================
#                              | THE SUSYHIT OUTPUT |
#                              ======================
#
#
#              ------------------------------------------------------
#              |     This is the output of the SUSY-HIT package     |
#              |  created by A.Djouadi, M.Muehlleitner and M.Spira. |
#              |  In case of problems with SUSY-HIT email to        |
#              |           margarete.muehlleitner@cern.ch           |
#              |           michael.spira@psi.ch                     |
#              |           abdelhak.djouadi@cern.ch                 |
#              ------------------------------------------------------
#
#              ------------------------------------------------------
#              |  SUSY Les Houches Accord - MSSM Spectrum + Decays  |
#              |              based on the decay programs           |
#              |                                                    |
#              |                     SDECAY 1.3b                    |
#              |                                                    |
#              |  Authors: M.Muhlleitner, A.Djouadi and Y.Mambrini  |
#              |  Ref.:    Comput.Phys.Commun.168(2005)46           |
#              |           [hep-ph/0311167]                         |
#              |                                                    |
#              |                     HDECAY 3.4                     |
#              |                                                    |
#              |  By: A.Djouadi,J.Kalinowski,M.Muhlleitner,M.Spira  |
#              |  Ref.:    Comput.Phys.Commun.108(1998)56           |
#              |           [hep-ph/9704448]                         |
#              |                                                    |
#              |                                                    |
#              |  If not stated otherwise all DRbar couplings and   |
#              |  soft SUSY breaking masses are given at the scale  |
#              |  Q=  0.26766610E+04
#              |                                                    |
#              ------------------------------------------------------
#
#
BLOCK DCINFO  # Decay Program information
     1   SDECAY/HDECAY # decay calculator
     2   1.3b  /3.4    # version number
#
BLOCK SPINFO  # Spectrum calculator information
     1     SOFTSUSY    # spectrum calculator               
     2     3.4.0       # version number                    
#
BLOCK MODSEL  # Model selection
     1     0   #  nonUniversal                                     
#
BLOCK SMINPUTS  # Standard Model inputs
         1     1.27908970E+02   # alpha_em^-1(M_Z)^MSbar
         2     1.16637870E-05   # G_F [GeV^-2]
         3     1.18400000E-01   # alpha_S(M_Z)^MSbar
         4     9.11876000E+01   # M_Z pole mass
         5     4.18000000E+00   # mb(mb)^MSbar
         6     1.73200000E+02   # mt pole mass
         7     1.77700000E+00   # mtau pole mass
#
BLOCK MINPAR  # Input parameters - minimal models
         3     2.63400000E+01   # tanb                
#
BLOCK EXTPAR  # Input parameters - non-minimal models
         0    -1.00000000E+00   # Set                 
         1     2.22070000E+02   # M_1(MX)             
         2     2.23280000E+02   # M_2(MX)             
         3     3.65456000E+03   # M_3(MX)             
        11     3.50526000E+03   # At(MX)              
        12     1.75946000E+03   # Ab(MX)              
        13    -3.66330000E+03   # Atau(MX)            
        23    -1.62184000E+03   # mu(MX)              
        26     3.96199000E+03   # mA(pole)            
        31     7.87540000E+02   # meL(MX)             
        32     7.87540000E+02   # mmuL(MX)            
        33     2.61561000E+03   # mtauL(MX)           
        34     3.96979000E+03   # meR(MX)             
        35     3.96979000E+03   # mmuR(MX)            
        36     5.14330000E+02   # mtauR(MX)           
        41     8.05100000E+02   # mqL1(MX)            
        42     8.05100000E+02   # mqL2(MX)            
        43     1.79731000E+03   # mqL3(MX)            
        44     2.91282000E+03   # muR(MX)             
        45     2.91282000E+03   # mcR(MX)             
        46     3.98304000E+03   # mtR(MX)             
        47     7.56120000E+02   # mdR(MX)             
        48     7.56120000E+02   # msR(MX)             
        49     2.83661000E+03   # mbR(MX)             
#
BLOCK MASS  # Mass Spectrum
# PDG code           mass       particle
        24     8.03786377E+01   # W+
        25     1.26615286E+02   # h
        35     3.96197769E+03   # H
        36     3.96199006E+03   # A
        37     3.96297789E+03   # H+
         5     4.81876030E+00   # b-quark pole mass calculated from mb(mb)_Msbar
   1000001     9.45022038E+02   # ~d_L
   2000001     8.99004918E+02   # ~d_R
   1000002     9.41636224E+02   # ~u_L
   2000002     3.00799006E+03   # ~u_R
   1000003     9.45022038E+02   # ~s_L
   2000003     8.99004918E+02   # ~s_R
   1000004     9.41636224E+02   # ~c_L
   2000004     3.00799006E+03   # ~c_R
   1000005     1.90179501E+03   # ~b_1
   2000005     2.92671066E+03   # ~b_2
   1000006     1.90138341E+03   # ~t_1
   2000006     4.01660689E+03   # ~t_2
   1000011     7.85445961E+02   # ~e_L
   2000011     3.97537704E+03   # ~e_R
   1000012     7.81177885E+02   # ~nu_eL
   1000013     7.85445961E+02   # ~mu_L
   2000013     3.97537704E+03   # ~mu_R
   1000014     7.81177885E+02   # ~nu_muL
   1000015     5.35496111E+02   # ~tau_1
   2000015     2.61794166E+03   # ~tau_2
   1000016     2.61628064E+03   # ~nu_tauL
   1000021     3.66763260E+03   # ~g
   1000022     2.20101152E+02   # ~chi_10
   1000023     2.36011512E+02   # ~chi_20
   1000025    -1.66860983E+03   # ~chi_30
   1000035     1.66915011E+03   # ~chi_40
   1000024     2.36173713E+02   # ~chi_1+
   1000037     1.67054305E+03   # ~chi_2+
#
BLOCK NMIX  # Neutralino Mixing Matrix
  1  1     9.99630222E-01   # N_11
  1  2    -4.80210244E-03   # N_12
  1  3    -2.66530171E-02   # N_13
  1  4    -2.44468870E-03   # N_14
  2  1     6.07434874E-03   # N_21
  2  2     9.98845238E-01   # N_22
  2  3     4.74347333E-02   # N_23
  2  4     4.60862990E-03   # N_24
  3  1    -1.69556114E-02   # N_31
  3  2     3.03804104E-02   # N_32
  3  3    -7.06256698E-01   # N_33
  3  4     7.07100427E-01   # N_34
  4  1     2.03722738E-02   # N_41
  4  2    -3.69074733E-02   # N_42
  4  3     7.05861912E-01   # N_43
  4  4     7.07093890E-01   # N_44
#
BLOCK UMIX  # Chargino Mixing Matrix U
  1  1     9.97736558E-01   # U_11
  1  2     6.72440365E-02   # U_12
  2  1    -6.72440365E-02   # U_21
  2  2     9.97736558E-01   # U_22
#
BLOCK VMIX  # Chargino Mixing Matrix V
  1  1     9.99978715E-01   # V_11
  1  2    -6.52456717E-03   # V_12
  2  1    -6.52456717E-03   # V_21
  2  2    -9.99978715E-01   # V_22
#
BLOCK STOPMIX  # Stop Mixing Matrix
  1  1     9.99215262E-01   # cos(theta_t)
  1  2    -3.96088397E-02   # sin(theta_t)
  2  1     3.96088397E-02   # -sin(theta_t)
  2  2     9.99215262E-01   # cos(theta_t)
#
BLOCK SBOTMIX  # Sbottom Mixing Matrix
  1  1     9.99698497E-01   # cos(theta_b)
  1  2    -2.45543295E-02   # sin(theta_b)
  2  1     2.45543295E-02   # -sin(theta_b)
  2  2     9.99698497E-01   # cos(theta_b)
#
BLOCK STAUMIX  # Stau Mixing Matrix
  1  1    -1.03502078E-02   # cos(theta_tau)
  1  2     9.99946435E-01   # sin(theta_tau)
  2  1    -9.99946435E-01   # -sin(theta_tau)
  2  2    -1.03502078E-02   # cos(theta_tau)
#
BLOCK ALPHA  # Higgs mixing
          -3.93305417E-02   # Mixing angle in the neutral Higgs boson sector
#
BLOCK HMIX Q=  2.67666100E+03  # DRbar Higgs Parameters
         1    -1.65543129E+03   # mu(Q)MSSM           
         2     2.54416865E+01   # tan                 
         3     2.42629851E+02   # higgs               
         4     1.60322284E+07   # mA^2(Q)MSSM         
#
BLOCK GAUGE Q=  2.67666100E+03  # The gauge couplings
     1     3.64513941E-01   # gprime(Q) DRbar
     2     6.42242755E-01   # g(Q) DRbar
     3     1.01212484E+00   # g3(Q) DRbar
#
BLOCK AU Q=  2.67666100E+03  # The trilinear couplings
  1  1     0.00000000E+00   # A_u(Q) DRbar
  2  2     0.00000000E+00   # A_c(Q) DRbar
  3  3     3.50526002E+03   # A_t(Q) DRbar
#
BLOCK AD Q=  2.67666100E+03  # The trilinear couplings
  1  1     0.00000000E+00   # A_d(Q) DRbar
  2  2     0.00000000E+00   # A_s(Q) DRbar
  3  3     1.75946001E+03   # A_b(Q) DRbar
#
BLOCK AE Q=  2.67666100E+03  # The trilinear couplings
  1  1     0.00000000E+00   # A_e(Q) DRbar
  2  2     0.00000000E+00   # A_mu(Q) DRbar
  3  3    -3.66330000E+03   # A_tau(Q) DRbar
#
BLOCK Yu Q=  2.67666100E+03  # The Yukawa couplings
  1  1     0.00000000E+00   # y_u(Q) DRbar
  2  2     0.00000000E+00   # y_c(Q) DRbar
  3  3     8.32208128E-01   # y_t(Q) DRbar
#
BLOCK Yd Q=  2.67666100E+03  # The Yukawa couplings
  1  1     0.00000000E+00   # y_d(Q) DRbar
  2  2     0.00000000E+00   # y_s(Q) DRbar
  3  3     4.04276473E-01   # y_b(Q) DRbar
#
BLOCK Ye Q=  2.67666100E+03  # The Yukawa couplings
  1  1     0.00000000E+00   # y_e(Q) DRbar
  2  2     0.00000000E+00   # y_mu(Q) DRbar
  3  3     2.57447111E-01   # y_tau(Q) DRbar
#
BLOCK MSOFT Q=  2.67666100E+03  # The soft SUSY breaking masses at the scale Q
         1     2.22070000E+02   # M_1(Q)              
         2     2.23280000E+02   # M_2(Q)              
         3     3.65456000E+03   # M_3(Q)              
        21     1.30247791E+07   # mH1^2(Q)            
        22    -2.68714753E+06   # mH2^2(Q)            
        31     7.87540000E+02   # meL(Q)              
        32     7.87540000E+02   # mmuL(Q)             
        33     2.61561000E+03   # mtauL(Q)            
        34     3.96979000E+03   # meR(Q)              
        35     3.96979000E+03   # mmuR(Q)             
        36     5.14330002E+02   # mtauR(Q)            
        41     8.05099961E+02   # mqL1(Q)             
        42     8.05099961E+02   # mqL2(Q)             
        43     1.79730998E+03   # mqL3(Q)             
        44     2.91281999E+03   # muR(Q)              
        45     2.91281999E+03   # mcR(Q)              
        46     3.98303999E+03   # mtR(Q)              
        47     7.56119958E+02   # mdR(Q)              
        48     7.56119958E+02   # msR(Q)              
        49     2.83660999E+03   # mbR(Q)              
#
Block HiggsBoundsInputHiggsCouplingsFermions
# ScalarNormEffCoupSq PseudoSNormEffCoupSq NP   IP1 IP2 IP2
    1.00230094E+00    0.00000000E+00        3  25   5   5  # h0-b-b eff. coupling^2, normalised to SM
    6.47277111E+02    0.00000000E+00        3  35   5   5  # H0-b-b eff. coupling^2, normalised to SM
    0.00000000E+00    6.47279412E+02        3  36   5   5  # A0-b-b eff. coupling^2, normalised to SM
#
    9.99996445E-01    0.00000000E+00        3  25   6   6  # h0-t-t eff. coupling^2, normalised to SM
    1.54848265E-03    0.00000000E+00        3  35   6   6  # H0-t-t eff. coupling^2, normalised to SM
    0.00000000E+00    1.54492787E-03        3  36   6   6  # A0-t-t eff. coupling^2, normalised to SM
#
    1.00230094E+00    0.00000000E+00        3  25  15  15  # h0-tau-tau eff. coupling^2, normalised to SM
    6.47277111E+02    0.00000000E+00        3  35  15  15  # H0-tau-tau eff. coupling^2, normalised to SM
    0.00000000E+00    6.47279412E+02        3  36  15  15  # A0-tau-tau eff. coupling^2, normalised to SM
#
Block HiggsBoundsInputHiggsCouplingsBosons
    9.99999998E-01        3  25  24  24  # h0-W-W eff. coupling^2, normalised to SM
    2.04249532E-09        3  35  24  24  # H0-W-W eff. coupling^2, normalised to SM
    0.00000000E+00        3  36  24  24  # A0-W-W eff. coupling^2, normalised to SM
#
    9.99999998E-01        3  25  23  23  # h0-Z-Z eff. coupling^2, normalised to SM
    2.04249532E-09        3  35  23  23  # H0-Z-Z eff. coupling^2, normalised to SM
    0.00000000E+00        3  36  23  23  # A0-Z-Z eff. coupling^2, normalised to SM
#
    8.92192865E-01        3  25  21  21  # h0-g-g eff. coupling^2, normalised to SM
    1.96169410E-14        3  35  21  21  # H0-g-g eff. coupling^2, normalised to SM
    1.30399298E-13        3  36  21  21  # A0-g-g eff. coupling^2, normalised to SM
#
    0.00000000E+00        3  25  25  23  # h0-h0-Z eff. coupling^2, normalised to SM
    0.00000000E+00        3  35  25  23  # H0-h0-Z eff. coupling^2, normalised to SM
    2.04249532E-09        3  36  25  23  # A0-h0-Z eff. coupling^2, normalised to SM
    0.00000000E+00        3  35  35  23  # H0-H0-Z eff. coupling^2, normalised to SM
    9.99999998E-01        3  36  35  23  # A0-H0-Z eff. coupling^2, normalised to SM
    0.00000000E+00        3  36  36  23  # A0-A0-Z eff. coupling^2, normalised to SM
#
    0.00000000E+00        4  25  21  21  23  # h0-g-g-Z eff. coupling^2, normalised to SM
    0.00000000E+00        4  35  21  21  23  # H0-g-g-Z eff. coupling^2, normalised to SM
    0.00000000E+00        4  36  21  21  23  # A0-g-g-Z eff. coupling^2, normalised to SM
#
#
#
#                             =================
#                             |The decay table|
#                             =================
#
# - The QCD corrections to the decays gluino -> squark  + quark
#                                     squark -> gaugino + quark_prime
#                                     squark -> squark_prime + Higgs
#                                     squark -> gluino  + quark
#   are included.
#
# - The multi-body decays for the inos, stops and sbottoms are included.
#
# - The loop induced decays for the gluino, neutralinos and stops
#   are included.
#
# - The SUSY decays of the top quark are included.
#
#
#         PDG            Width
DECAY         6     1.45318673E+00   # top decays
#          BR         NDA      ID1       ID2
     1.00000000E+00    2           5        24   # BR(t ->  b    W+)
#
#         PDG            Width
DECAY   1000021     4.98254312E+02   # gluino decays
#          BR         NDA      ID1       ID2
     6.52633427E-02    2     1000001        -1   # BR(~g -> ~d_L  db)
     6.52633427E-02    2    -1000001         1   # BR(~g -> ~d_L* d )
     6.61482837E-02    2     2000001        -1   # BR(~g -> ~d_R  db)
     6.61482837E-02    2    -2000001         1   # BR(~g -> ~d_R* d )
     6.53297521E-02    2     1000002        -2   # BR(~g -> ~u_L  ub)
     6.53297521E-02    2    -1000002         2   # BR(~g -> ~u_L* u )
     8.02411708E-03    2     2000002        -2   # BR(~g -> ~u_R  ub)
     8.02411708E-03    2    -2000002         2   # BR(~g -> ~u_R* u )
     6.52633427E-02    2     1000003        -3   # BR(~g -> ~s_L  sb)
     6.52633427E-02    2    -1000003         3   # BR(~g -> ~s_L* s )
     6.61482837E-02    2     2000003        -3   # BR(~g -> ~s_R  sb)
     6.61482837E-02    2    -2000003         3   # BR(~g -> ~s_R* s )
     6.53297502E-02    2     1000004        -4   # BR(~g -> ~c_L  cb)
     6.53297502E-02    2    -1000004         4   # BR(~g -> ~c_L* c )
     8.02409788E-03    2     2000004        -4   # BR(~g -> ~c_R  cb)
     8.02409788E-03    2    -2000004         4   # BR(~g -> ~c_R* c )
     4.00956498E-02    2     1000005        -5   # BR(~g -> ~b_1  bb)
     4.00956498E-02    2    -1000005         5   # BR(~g -> ~b_1* b )
     9.98667700E-03    2     2000005        -5   # BR(~g -> ~b_2  bb)
     9.98667700E-03    2    -2000005         5   # BR(~g -> ~b_2* b )
     4.03867032E-02    2     1000006        -6   # BR(~g -> ~t_1  tb)
     4.03867032E-02    2    -1000006         6   # BR(~g -> ~t_1* t )
#
#         PDG            Width
DECAY   1000006     2.40283580E+01   # stop1 decays
#          BR         NDA      ID1       ID2
     1.06965815E-02    2     1000022         6   # BR(~t_1 -> ~chi_10 t )
     3.08582240E-01    2     1000023         6   # BR(~t_1 -> ~chi_20 t )
     1.79909348E-02    2     1000025         6   # BR(~t_1 -> ~chi_30 t )
     2.01888759E-02    2     1000035         6   # BR(~t_1 -> ~chi_40 t )
     6.29177070E-01    2     1000024         5   # BR(~t_1 -> ~chi_1+ b )
     1.33642974E-02    2     1000037         5   # BR(~t_1 -> ~chi_2+ b )
#
#         PDG            Width
DECAY   2000006     1.52581850E+02   # stop2 decays
#          BR         NDA      ID1       ID2
     6.11429115E-02    2     1000022         6   # BR(~t_2 -> ~chi_10 t )
     2.48857098E-04    2     1000023         6   # BR(~t_2 -> ~chi_20 t )
     1.24325770E-01    2     1000025         6   # BR(~t_2 -> ~chi_30 t )
     1.22800882E-01    2     1000035         6   # BR(~t_2 -> ~chi_40 t )
     4.96020519E-04    2     1000024         5   # BR(~t_2 -> ~chi_1+ b )
     2.47677811E-01    2     1000037         5   # BR(~t_2 -> ~chi_2+ b )
     3.52076580E-02    2     1000021         6   # BR(~t_2 -> ~g      t )
     1.10046894E-01    2     1000006        25   # BR(~t_2 -> ~t_1    h )
     1.01045589E-01    2     1000006        23   # BR(~t_2 -> ~t_1    Z )
     1.96981498E-01    2     1000005        24   # BR(~t_2 -> ~b_1    W+)
     2.61091818E-05    2     2000005        24   # BR(~t_2 -> ~b_2    W+)
#
#         PDG            Width
DECAY   1000005     2.39198219E+01   # sbottom1 decays
#          BR         NDA      ID1       ID2
     1.23537561E-02    2     1000022         5   # BR(~b_1 -> ~chi_10 b )
     3.15828799E-01    2     1000023         5   # BR(~b_1 -> ~chi_20 b )
     6.83692104E-03    2     1000025         5   # BR(~b_1 -> ~chi_30 b )
     6.78624333E-03    2     1000035         5   # BR(~b_1 -> ~chi_40 b )
     6.19591399E-01    2    -1000024         6   # BR(~b_1 -> ~chi_1- t )
     3.86028811E-02    2    -1000037         6   # BR(~b_1 -> ~chi_2- t )
#
#         PDG            Width
DECAY   2000005     1.40740462E+01   # sbottom2 decays
#          BR         NDA      ID1       ID2
     1.20547998E-01    2     1000022         5   # BR(~b_2 -> ~chi_10 b )
     2.73668998E-04    2     1000023         5   # BR(~b_2 -> ~chi_20 b )
     1.54168381E-01    2     1000025         5   # BR(~b_2 -> ~chi_30 b )
     1.53947809E-01    2     1000035         5   # BR(~b_2 -> ~chi_40 b )
     5.31071539E-04    2    -1000024         6   # BR(~b_2 -> ~chi_1- t )
     3.06499741E-01    2    -1000037         6   # BR(~b_2 -> ~chi_2- t )
     6.71685082E-02    2     1000005        25   # BR(~b_2 -> ~b_1    h )
     6.66806415E-02    2     1000005        23   # BR(~b_2 -> ~b_1    Z )
     1.30182180E-01    2     1000006       -24   # BR(~b_2 -> ~t_1    W-)
#
#         PDG            Width
DECAY   1000002     1.07825151E+01   # sup_L decays
#          BR         NDA      ID1       ID2
     1.13923791E-02    2     1000022         2   # BR(~u_L -> ~chi_10 u)
     3.29583108E-01    2     1000023         2   # BR(~u_L -> ~chi_20 u)
     6.59024513E-01    2     1000024         1   # BR(~u_L -> ~chi_1+ d)
#
#         PDG            Width
DECAY   2000002     6.87865844E+00   # sup_R decays
#          BR         NDA      ID1       ID2
     9.99620181E-01    2     1000022         2   # BR(~u_R -> ~chi_10 u)
     3.68547156E-05    2     1000023         2   # BR(~u_R -> ~chi_20 u)
     1.40398416E-04    2     1000025         2   # BR(~u_R -> ~chi_30 u)
     2.02566000E-04    2     1000035         2   # BR(~u_R -> ~chi_40 u)
#
#         PDG            Width
DECAY   1000001     1.07946546E+01   # sdown_L decays
#          BR         NDA      ID1       ID2
     1.26499805E-02    2     1000022         1   # BR(~d_L -> ~chi_10 d)
     3.29138821E-01    2     1000023         1   # BR(~d_L -> ~chi_20 d)
     6.58211199E-01    2    -1000024         2   # BR(~d_L -> ~chi_1- u)
#
#         PDG            Width
DECAY   2000001     4.89431112E-01   # sdown_R decays
#          BR         NDA      ID1       ID2
     9.99963776E-01    2     1000022         1   # BR(~d_R -> ~chi_10 d)
     3.62244156E-05    2     1000023         1   # BR(~d_R -> ~chi_20 d)
#
#         PDG            Width
DECAY   1000004     1.02957209E+01   # scharm_L decays
#          BR         NDA      ID1       ID2
     1.13932158E-02    2     1000022         4   # BR(~c_L -> ~chi_10 c)
     3.29581647E-01    2     1000023         4   # BR(~c_L -> ~chi_20 c)
     6.59025138E-01    2     1000024         3   # BR(~c_L -> ~chi_1+ s)
#
#         PDG            Width
DECAY   2000004     6.98975105E+00   # scharm_R decays
#          BR         NDA      ID1       ID2
     9.99622822E-01    2     1000022         4   # BR(~c_R -> ~chi_10 c)
     3.68515849E-05    2     1000023         4   # BR(~c_R -> ~chi_20 c)
     1.39318818E-04    2     1000025         4   # BR(~c_R -> ~chi_30 c)
     2.01007277E-04    2     1000035         4   # BR(~c_R -> ~chi_40 c)
#
#         PDG            Width
DECAY   1000003     1.03090633E+01   # sstrange_L decays
#          BR         NDA      ID1       ID2
     1.26509897E-02    2     1000022         3   # BR(~s_L -> ~chi_10 s)
     3.29139417E-01    2     1000023         3   # BR(~s_L -> ~chi_20 s)
     6.58209594E-01    2    -1000024         4   # BR(~s_L -> ~chi_1- c)
#
#         PDG            Width
DECAY   2000003     4.66351243E-01   # sstrange_R decays
#          BR         NDA      ID1       ID2
     9.99963778E-01    2     1000022         3   # BR(~s_R -> ~chi_10 s)
     3.62216920E-05    2     1000023         3   # BR(~s_R -> ~chi_20 s)
#
#         PDG            Width
DECAY   1000011     8.85363497E+00   # selectron_L decays
#          BR         NDA      ID1       ID2
     9.78104505E-02    2     1000022        11   # BR(~e_L -> ~chi_10 e-)
     3.02614423E-01    2     1000023        11   # BR(~e_L -> ~chi_20 e-)
     5.99575127E-01    2    -1000024        12   # BR(~e_L -> ~chi_1- nu_e)
#
#         PDG            Width
DECAY   2000011     2.08834990E+01   # selectron_R decays
#          BR         NDA      ID1       ID2
     9.99483374E-01    2     1000022        11   # BR(~e_R -> ~chi_10 e-)
     3.68719490E-05    2     1000023        11   # BR(~e_R -> ~chi_20 e-)
     1.96361627E-04    2     1000025        11   # BR(~e_R -> ~chi_30 e-)
     2.83392534E-04    2     1000035        11   # BR(~e_R -> ~chi_40 e-)
#
#         PDG            Width
DECAY   1000013     8.85363481E+00   # smuon_L decays
#          BR         NDA      ID1       ID2
     9.78104480E-02    2     1000022        13   # BR(~mu_L -> ~chi_10 mu-)
     3.02614415E-01    2     1000023        13   # BR(~mu_L -> ~chi_20 mu-)
     5.99575137E-01    2    -1000024        14   # BR(~mu_L -> ~chi_1- nu_mu)
#
#         PDG            Width
DECAY   2000013     2.08834989E+01   # smuon_R decays
#          BR         NDA      ID1       ID2
     9.99483374E-01    2     1000022        13   # BR(~mu_R -> ~chi_10 mu-)
     3.68719490E-05    2     1000023        13   # BR(~mu_R -> ~chi_20 mu-)
     1.96361627E-04    2     1000025        13   # BR(~mu_R -> ~chi_30 mu-)
     2.83392534E-04    2     1000035        13   # BR(~mu_R -> ~chi_40 mu-)
#
#         PDG            Width
DECAY   1000015     1.96034336E+00   # stau_1 decays
#          BR         NDA      ID1       ID2
     9.96937792E-01    2     1000022        15   # BR(~tau_1 -> ~chi_10  tau-)
     1.04089673E-03    2     1000023        15   # BR(~tau_1 -> ~chi_20  tau-)
     2.02131166E-03    2    -1000024        16   # BR(~tau_1 -> ~chi_1-  nu_tau)
#
#         PDG            Width
DECAY   2000015     3.73503451E+01   # stau_2 decays
#          BR         NDA      ID1       ID2
     8.97713043E-02    2     1000022        15   # BR(~tau_2 -> ~chi_10  tau-)
     2.84245806E-01    2     1000023        15   # BR(~tau_2 -> ~chi_20  tau-)
     1.63322809E-02    2     1000025        15   # BR(~tau_2 -> ~chi_30  tau-)
     1.63217374E-02    2     1000035        15   # BR(~tau_2 -> ~chi_40  tau-)
     5.62909166E-01    2    -1000024        16   # BR(~tau_2 -> ~chi_1-  nu_tau)
     1.02986489E-03    2    -1000037        16   # BR(~tau_2 -> ~chi_2-  nu_tau)
     1.46861465E-02    2     1000015        25   # BR(~tau_2 -> ~tau_1   h)
     1.47036937E-02    2     1000015        23   # BR(~tau_2 -> ~tau_1   Z)
#
#         PDG            Width
DECAY   1000012     8.80348110E+00   # snu_eL decays
#          BR         NDA      ID1       ID2
     1.01013292E-01    2     1000022        12   # BR(~nu_eL -> ~chi_10 nu_e)
     2.97885467E-01    2     1000023        12   # BR(~nu_eL -> ~chi_20 nu_e)
     6.01101241E-01    2     1000024        11   # BR(~nu_eL -> ~chi_1+ e-)
#
#         PDG            Width
DECAY   1000014     8.80348087E+00   # snu_muL decays
#          BR         NDA      ID1       ID2
     1.01013294E-01    2     1000022        14   # BR(~nu_muL -> ~chi_10 nu_mu)
     2.97885475E-01    2     1000023        14   # BR(~nu_muL -> ~chi_20 nu_mu)
     6.01101230E-01    2     1000024        13   # BR(~nu_muL -> ~chi_1+ mu-)
#
#         PDG            Width
DECAY   1000016     3.73512488E+01   # snu_tauL decays
#          BR         NDA      ID1       ID2
     9.27551377E-02    2     1000022        16   # BR(~nu_tauL -> ~chi_10 nu_tau)
     2.80139169E-01    2     1000023        16   # BR(~nu_tauL -> ~chi_20 nu_tau)
     1.61859268E-04    2     1000025        16   # BR(~nu_tauL -> ~chi_30 nu_tau)
     2.37408326E-04    2     1000035        16   # BR(~nu_tauL -> ~chi_40 nu_tau)
     5.65848610E-01    2     1000024        15   # BR(~nu_tauL -> ~chi_1+ tau-)
     3.22616128E-02    2     1000037        15   # BR(~nu_tauL -> ~chi_2+ tau-)
     2.85962025E-02    2    -1000015       -24   # BR(~nu_tauL -> ~tau_1+ W-)
#
#         PDG            Width
DECAY   1000024     1.84835270E-10   # chargino1+ decays
#           BR         NDA      ID1       ID2       ID3
     3.09343485E-01    3     1000022         2        -1   # BR(~chi_1+ -> ~chi_10 u    db)
     1.00248681E-06    3     1000023         2        -1   # BR(~chi_1+ -> ~chi_20 u    db)
     3.09343485E-01    3     1000022         4        -3   # BR(~chi_1+ -> ~chi_10 c    sb)
     1.47499318E-01    3     1000022       -11        12   # BR(~chi_1+ -> ~chi_10 e+   nu_e)
     3.35439008E-07    3     1000023       -11        12   # BR(~chi_1+ -> ~chi_20 e+   nu_e)
     1.47499318E-01    3     1000022       -13        14   # BR(~chi_1+ -> ~chi_10 mu+  nu_mu)
     3.35439008E-07    3     1000023       -13        14   # BR(~chi_1+ -> ~chi_20 mu+  nu_mu)
     8.63127211E-02    3     1000022       -15        16   # BR(~chi_1+ -> ~chi_10 tau+ nu_tau)
#
#         PDG            Width
DECAY   1000037     1.17129369E+01   # chargino2+ decays
#          BR         NDA      ID1       ID2
     3.56081096E-05    2     1000002        -1   # BR(~chi_2+ -> ~u_L     db)
     3.75713152E-03    2    -1000001         2   # BR(~chi_2+ -> ~d_L*    u )
     3.56081069E-05    2     1000004        -3   # BR(~chi_2+ -> ~c_L     sb)
     3.75712686E-03    2    -1000003         4   # BR(~chi_2+ -> ~s_L*     c )
     1.52077677E-05    2     1000012       -11   # BR(~chi_2+ -> ~nu_eL   e+  )
     1.52077677E-05    2     1000014       -13   # BR(~chi_2+ -> ~nu_muL mu+ )
     1.60546917E-03    2    -1000011        12   # BR(~chi_2+ -> ~e_L+    nu_e)
     1.60546917E-03    2    -1000013        14   # BR(~chi_2+ -> ~mu_L+   nu_mu)
     7.50868325E-02    2    -1000015        16   # BR(~chi_2+ -> ~tau_1+  nu_tau)
     2.77484387E-01    2     1000024        23   # BR(~chi_2+ -> ~chi_1+  Z )
     8.25749889E-02    2     1000022        24   # BR(~chi_2+ -> ~chi_10  W+)
     2.72648212E-01    2     1000023        24   # BR(~chi_2+ -> ~chi_20  W+)
     2.81378751E-01    2     1000024        25   # BR(~chi_2+ -> ~chi_1+  h )
#
#         PDG            Width
DECAY   1000022     0.00000000E+00   # neutralino1 decays
#
#         PDG            Width
DECAY   1000023     4.03611878E-11   # neutralino2 decays
#          BR         NDA      ID1       ID2
     6.33207645E-02    2     1000022        22   # BR(~chi_20 -> ~chi_10 gam)
#           BR         NDA      ID1       ID2       ID3
     7.73398189E-02    3     1000022        -2         2   # BR(~chi_20 -> ~chi_10 ub      u)
     9.40090170E-02    3     1000022        -1         1   # BR(~chi_20 -> ~chi_10 db      d)
     7.73398189E-02    3     1000022        -4         4   # BR(~chi_20 -> ~chi_10 cb      c)
     9.40090170E-02    3     1000022        -3         3   # BR(~chi_20 -> ~chi_10 sb      s)
     9.80314232E-03    3     1000022        -5         5   # BR(~chi_20 -> ~chi_10 bb      b)
     1.58079235E-01    3     1000022       -11        11   # BR(~chi_20 -> ~chi_10 e+      e-)
     1.58079235E-01    3     1000022       -13        13   # BR(~chi_20 -> ~chi_10 mu+     mu-)
     3.95583171E-03    3     1000022       -15        15   # BR(~chi_20 -> ~chi_10 tau+    tau-)
     1.30664888E-01    3     1000022       -12        12   # BR(~chi_20 -> ~chi_10 nu_eb   nu_e)
     1.30664888E-01    3     1000022       -14        14   # BR(~chi_20 -> ~chi_10 nu_mub  nu_mu)
     2.73434530E-03    3     1000022       -16        16   # BR(~chi_20 -> ~chi_10 nu_taub nu_tau)
#
#         PDG            Width
DECAY   1000025     1.15516771E+01   # neutralino3 decays
#          BR         NDA      ID1       ID2
     5.24417833E-02    2     1000022        23   # BR(~chi_30 -> ~chi_10   Z )
     1.66399423E-01    2     1000023        23   # BR(~chi_30 -> ~chi_20   Z )
     2.74498222E-01    2     1000024       -24   # BR(~chi_30 -> ~chi_1+   W-)
     2.74498222E-01    2    -1000024        24   # BR(~chi_30 -> ~chi_1-   W+)
     3.82149615E-02    2     1000022        25   # BR(~chi_30 -> ~chi_10   h )
     1.12815696E-01    2     1000023        25   # BR(~chi_30 -> ~chi_20   h )
     3.12096041E-04    2     1000002        -2   # BR(~chi_30 -> ~u_L      ub)
     3.12096041E-04    2    -1000002         2   # BR(~chi_30 -> ~u_L*     u )
     4.73688347E-04    2     1000001        -1   # BR(~chi_30 -> ~d_L      db)
     4.73688347E-04    2    -1000001         1   # BR(~chi_30 -> ~d_L*     d )
     1.88553679E-05    2     2000001        -1   # BR(~chi_30 -> ~d_R      db)
     1.88553679E-05    2    -2000001         1   # BR(~chi_30 -> ~d_R*     d )
     3.12095657E-04    2     1000004        -4   # BR(~chi_30 -> ~c_L      cb)
     3.12095657E-04    2    -1000004         4   # BR(~chi_30 -> ~c_L*     c )
     4.73688347E-04    2     1000003        -3   # BR(~chi_30 -> ~s _L      sb)
     4.73688347E-04    2    -1000003         3   # BR(~chi_30 -> ~s _L*     s )
     1.88553679E-05    2     2000003        -3   # BR(~chi_30 -> ~s _R      sb)
     1.88553679E-05    2    -2000003         3   # BR(~chi_30 -> ~s _R*     s )
     7.73642545E-05    2     1000011       -11   # BR(~chi_30 -> ~e_L-     e+)
     7.73642545E-05    2    -1000011        11   # BR(~chi_30 -> ~e_L+     e-)
     7.73642545E-05    2     1000013       -13   # BR(~chi_30 -> ~mu_L-    mu+)
     7.73642545E-05    2    -1000013        13   # BR(~chi_30 -> ~mu_L+    mu-)
     3.82235835E-02    2     1000015       -15   # BR(~chi_30 -> ~tau_1-   tau+)
     3.82235835E-02    2    -1000015        15   # BR(~chi_30 -> ~tau_1+   tau-)
     2.89127108E-04    2     1000012       -12   # BR(~chi_30 -> ~nu_eL    nu_eb)
     2.89127108E-04    2    -1000012        12   # BR(~chi_30 -> ~nu_eL*   nu_e )
     2.89127108E-04    2     1000014       -14   # BR(~chi_30 -> ~nu_muL   nu_mub)
     2.89127108E-04    2    -1000014        14   # BR(~chi_30 -> ~nu_muL*  nu_mu )
#
#         PDG            Width
DECAY   1000035     1.16579913E+01   # neutralino4 decays
#          BR         NDA      ID1       ID2
     3.61193874E-02    2     1000022        23   # BR(~chi_40 -> ~chi_10   Z )
     1.12160973E-01    2     1000023        23   # BR(~chi_40 -> ~chi_20   Z )
     2.72295917E-01    2     1000024       -24   # BR(~chi_40 -> ~chi_1+   W-)
     2.72295917E-01    2    -1000024        24   # BR(~chi_40 -> ~chi_1-   W+)
     5.51653138E-02    2     1000022        25   # BR(~chi_40 -> ~chi_10   h )
     1.69337592E-01    2     1000023        25   # BR(~chi_40 -> ~chi_20   h )
     4.58005577E-04    2     1000002        -2   # BR(~chi_40 -> ~u_L      ub)
     4.58005577E-04    2    -1000002         2   # BR(~chi_40 -> ~u_L*     u )
     6.91897292E-04    2     1000001        -1   # BR(~chi_40 -> ~d_L      db)
     6.91897292E-04    2    -1000001         1   # BR(~chi_40 -> ~d_L*     d )
     2.69942186E-05    2     2000001        -1   # BR(~chi_40 -> ~d_R      db)
     2.69942186E-05    2    -2000001         1   # BR(~chi_40 -> ~d_R*     d )
     4.58005014E-04    2     1000004        -4   # BR(~chi_40 -> ~c_L      cb)
     4.58005014E-04    2    -1000004         4   # BR(~chi_40 -> ~c_L*     c )
     6.91897292E-04    2     1000003        -3   # BR(~chi_40 -> ~s _L      sb)
     6.91897292E-04    2    -1000003         3   # BR(~chi_40 -> ~s _L*     s )
     2.69942186E-05    2     2000003        -3   # BR(~chi_40 -> ~s _R      sb)
     2.69942186E-05    2    -2000003         3   # BR(~chi_40 -> ~s _R*     s )
     1.14370429E-04    2     1000011       -11   # BR(~chi_40 -> ~e_L-     e+)
     1.14370429E-04    2    -1000011        11   # BR(~chi_40 -> ~e_L+     e-)
     1.14370429E-04    2     1000013       -13   # BR(~chi_40 -> ~mu_L-    mu+)
     1.14370429E-04    2    -1000013        13   # BR(~chi_40 -> ~mu_L+    mu-)
     3.78881666E-02    2     1000015       -15   # BR(~chi_40 -> ~tau_1-   tau+)
     3.78881666E-02    2    -1000015        15   # BR(~chi_40 -> ~tau_1+   tau-)
     4.20874601E-04    2     1000012       -12   # BR(~chi_40 -> ~nu_eL    nu_eb)
     4.20874601E-04    2    -1000012        12   # BR(~chi_40 -> ~nu_eL*   nu_e )
     4.20874601E-04    2     1000014       -14   # BR(~chi_40 -> ~nu_muL   nu_mub)
     4.20874601E-04    2    -1000014        14   # BR(~chi_40 -> ~nu_muL*  nu_mu )
#
#         PDG            Width
DECAY        25     3.92527334E-03   # h decays
#          BR         NDA      ID1       ID2
     5.33414647E-01    2           5        -5   # BR(h -> b       bb     )
     6.69264231E-02    2         -15        15   # BR(h -> tau+    tau-   )
     2.36893121E-04    2         -13        13   # BR(h -> mu+     mu-    )
     2.58365476E-04    2           3        -3   # BR(h -> s       sb     )
     2.23241166E-02    2           4        -4   # BR(h -> c       cb     )
     8.46050434E-02    2          21        21   # BR(h -> g       g      )
     2.52898571E-03    2          22        22   # BR(h -> gam     gam    )
     1.83293539E-03    2          22        23   # BR(h -> Z       gam    )
     2.55268649E-01    2          24       -24   # BR(h -> W+      W-     )
     3.26039411E-02    2          23        23   # BR(h -> Z       Z      )
#
#         PDG            Width
DECAY        35     8.65003518E+01   # H decays
#          BR         NDA      ID1       ID2
     4.80094947E-01    2           5        -5   # BR(H -> b       bb     )
     6.23246376E-02    2         -15        15   # BR(H -> tau+    tau-   )
     2.24780491E-04    2         -13        13   # BR(H -> mu+     mu-    )
     3.92775860E-04    2           3        -3   # BR(H -> s       sb     )
     2.80655151E-08    2           4        -4   # BR(H -> c       cb     )
     2.77079883E-03    2           6        -6   # BR(H -> t       tb     )
     4.37720430E-06    2          21        21   # BR(H -> g       g      )
     8.02587079E-09    2          22        22   # BR(H -> gam     gam    )
     1.28121220E-09    2          23        22   # BR(H -> Z       gam    )
     4.72764309E-07    2          24       -24   # BR(H -> W+      W-     )
     2.35989686E-07    2          23        23   # BR(H -> Z       Z      )
     2.14628427E-06    2          25        25   # BR(H -> h       h      )
     1.72947483E-03    2     1000024  -1000024   # BR(H -> ~chi_1+ ~chi_1-)
     5.04766946E-06    2     1000037  -1000037   # BR(H -> ~chi_2+ ~chi_2-)
     1.28702399E-01    2     1000024  -1000037   # BR(H -> ~chi_1+ ~chi_2-)
     1.28702399E-01    2     1000037  -1000024   # BR(H -> ~chi_2+ ~chi_1-)
     7.95326152E-05    2     1000022   1000022   # BR(H -> ~chi_10 ~chi_10)
     8.53109185E-04    2     1000023   1000023   # BR(H -> ~chi_20 ~chi_20)
     4.35329091E-05    2     1000025   1000025   # BR(H -> ~chi_30 ~chi_30)
     7.45828232E-05    2     1000035   1000035   # BR(H -> ~chi_40 ~chi_40)
     5.21124034E-04    2     1000022   1000023   # BR(H -> ~chi_10 ~chi_20)
     1.83670853E-02    2     1000022   1000025   # BR(H -> ~chi_10 ~chi_30)
     1.91409966E-02    2     1000022   1000035   # BR(H -> ~chi_10 ~chi_40)
     6.25214695E-02    2     1000023   1000025   # BR(H -> ~chi_20 ~chi_30)
     6.46152370E-02    2     1000023   1000035   # BR(H -> ~chi_20 ~chi_40)
     3.93862086E-04    2     1000025   1000035   # BR(H -> ~chi_30 ~chi_40)
     5.32103761E-07    2     1000002  -1000002   # BR(H -> ~u_L    ~u_L*  )
     5.32103761E-07    2     1000004  -1000004   # BR(H -> ~c_L    ~c_L*  )
     3.65805849E-04    2     1000006  -1000006   # BR(H -> ~t_1    ~t_1*  )
     7.80295967E-07    2     1000001  -1000001   # BR(H -> ~d_L    ~d_L*  )
     2.41309897E-08    2     2000001  -2000001   # BR(H -> ~d_R    ~d_R*  )
     7.80295967E-07    2     1000003  -1000003   # BR(H -> ~s_L    ~s_L*  )
     2.41309897E-08    2     2000003  -2000003   # BR(H -> ~s_R    ~s_R*  )
     4.06724162E-05    2     1000005  -1000005   # BR(H -> ~b_1    ~b_1*  )
     1.15037807E-07    2     1000011  -1000011   # BR(H -> ~e_L-   ~e_L+  )
     1.15037807E-07    2     1000013  -1000013   # BR(H -> ~mu_L-  ~mu_L+ )
     1.03994328E-05    2     1000015  -1000015   # BR(H -> ~tau_1- ~tau_1+)
     1.40072035E-02    2     1000015  -2000015   # BR(H -> ~tau_1- ~tau_2+)
     1.40072035E-02    2     2000015  -1000015   # BR(H -> ~tau_2- ~tau_1+)
     3.75252038E-07    2     1000012  -1000012   # BR(H -> ~nu_eL  ~nu_eL*   )
     3.75252038E-07    2     1000014  -1000014   # BR(H -> ~nu_muL ~nu_muL*  )
#
#         PDG            Width
DECAY        36     8.64691438E+01   # A decays
#          BR         NDA      ID1       ID2
     4.80292902E-01    2           5        -5   # BR(A -> b       bb     )
     6.23475963E-02    2         -15        15   # BR(A -> tau+    tau-   )
     2.24863106E-04    2         -13        13   # BR(A -> mu+     mu-    )
     3.92962023E-04    2           3        -3   # BR(A -> s       sb     )
     2.82718042E-08    2           4        -4   # BR(A -> c       cb     )
     2.77876373E-03    2           6        -6   # BR(A -> t       tb     )
     1.12896572E-05    2          21        21   # BR(A -> g       g      )
     9.53427116E-10    2          22        22   # BR(A -> gam     gam    )
     1.02490579E-08    2          23        22   # BR(A -> Z       gam    )
     4.79845055E-07    2          23        25   # BR(A -> Z       h      )
     1.72852974E-03    2     1000024  -1000024   # BR(A -> ~chi_1+ ~chi_1-)
     3.11788978E-06    2     1000037  -1000037   # BR(A -> ~chi_2+ ~chi_2-)
     1.28754231E-01    2     1000024  -1000037   # BR(A -> ~chi_1+ ~chi_2-)
     1.28754231E-01    2     1000037  -1000024   # BR(A -> ~chi_2+ ~chi_1-)
     7.94022803E-05    2     1000022   1000022   # BR(A -> ~chi_10 ~chi_10)
     8.52579620E-04    2     1000023   1000023   # BR(A -> ~chi_20 ~chi_20)
     1.75491608E-04    2     1000025   1000025   # BR(A -> ~chi_30 ~chi_30)
     2.19711677E-04    2     1000035   1000035   # BR(A -> ~chi_40 ~chi_40)
     5.20521949E-04    2     1000022   1000023   # BR(A -> ~chi_10 ~chi_20)
     1.91954776E-02    2     1000022   1000025   # BR(A -> ~chi_10 ~chi_30)
     1.83279530E-02    2     1000022   1000035   # BR(A -> ~chi_10 ~chi_40)
     6.47968851E-02    2     1000023   1000025   # BR(A -> ~chi_20 ~chi_30)
     6.23910179E-02    2     1000023   1000035   # BR(A -> ~chi_20 ~chi_40)
     1.16113953E-04    2     1000025   1000035   # BR(A -> ~chi_30 ~chi_40)
     1.40179201E-02    2     1000015  -2000015   # BR(A -> ~tau_1- ~tau_2+)
     1.40179201E-02    2    -1000015   2000015   # BR(A -> ~tau_1+ ~tau_2-)
#
#         PDG            Width
DECAY        37     9.09316589E+01   # H+ decays
#          BR         NDA      ID1       ID2
     8.49547316E-04    2           4        -5   # BR(H+ -> c       bb     )
     5.93026400E-02    2         -15        16   # BR(H+ -> tau+    nu_tau )
     2.13881153E-04    2         -13        14   # BR(H+ -> mu+     nu_mu  )
     8.49546691E-06    2           2        -5   # BR(H+ -> u       bb     )
     1.87047665E-05    2           2        -3   # BR(H+ -> u       sb     )
     3.68192414E-04    2           4        -3   # BR(H+ -> c       sb     )
     5.07622307E-01    2           6        -5   # BR(H+ -> t       bb     )
     4.56801235E-07    2          24        25   # BR(H+ -> W+      h      )
     1.36122774E-14    2          24        36   # BR(H+ -> W+      A      )
     9.78153393E-04    2     1000024   1000022   # BR(H+ -> ~chi_1+ ~chi_10)
     3.75276802E-08    2     1000024   1000023   # BR(H+ -> ~chi_1+ ~chi_20)
     1.22678663E-01    2     1000024   1000025   # BR(H+ -> ~chi_1+ ~chi_30)
     1.22584384E-01    2     1000024   1000035   # BR(H+ -> ~chi_1+ ~chi_40)
     3.42367269E-02    2     1000037   1000022   # BR(H+ -> ~chi_2+ ~chi_10)
     1.24127226E-01    2     1000037   1000023   # BR(H+ -> ~chi_2+ ~chi_20)
     1.31664737E-04    2     1000037   1000025   # BR(H+ -> ~chi_2+ ~chi_30)
     1.10956132E-04    2     1000037   1000035   # BR(H+ -> ~chi_2+ ~chi_40)
     4.30197975E-07    2    -1000011   1000012   # BR(H+ -> ~e_L+   ~nu_eL )
     4.30197975E-07    2    -1000013   1000014   # BR(H+ -> ~mu_L+  ~nu_muL)
     2.66954244E-02    2    -1000015   1000016   # BR(H+ -> ~tau_1+ ~nu_tauL)
     1.23560263E-06    2     1000002  -1000001   # BR(H+ -> ~u_L    ~d_L*  )
     1.23560263E-06    2     1000004  -1000003   # BR(H+ -> ~c_L    ~s_L*  )
     6.92075232E-05    2     1000006  -1000005   # BR(H+ -> ~t_1    ~b_1*  )
