#
#                              ======================
#                              | THE SUSYHIT OUTPUT |
#                              ======================
#
#
#              ------------------------------------------------------
#              |     This is the output of the SUSY-HIT package     |
#              |  created by A.Djouadi, M.Muehlleitner and M.Spira. |
#              |  In case of problems with SUSY-HIT email to        |
#              |           margarete.muehlleitner@cern.ch           |
#              |           michael.spira@psi.ch                     |
#              |           abdelhak.djouadi@cern.ch                 |
#              ------------------------------------------------------
#
#              ------------------------------------------------------
#              |  SUSY Les Houches Accord - MSSM Spectrum + Decays  |
#              |              based on the decay programs           |
#              |                                                    |
#              |                     SDECAY 1.3b                    |
#              |                                                    |
#              |  Authors: M.Muhlleitner, A.Djouadi and Y.Mambrini  |
#              |  Ref.:    Comput.Phys.Commun.168(2005)46           |
#              |           [hep-ph/0311167]                         |
#              |                                                    |
#              |                     HDECAY 3.4                     |
#              |                                                    |
#              |  By: A.Djouadi,J.Kalinowski,M.Muhlleitner,M.Spira  |
#              |  Ref.:    Comput.Phys.Commun.108(1998)56           |
#              |           [hep-ph/9704448]                         |
#              |                                                    |
#              |                                                    |
#              |  If not stated otherwise all DRbar couplings and   |
#              |  soft SUSY breaking masses are given at the scale  |
#              |  Q=  0.26699620E+04
#              |                                                    |
#              ------------------------------------------------------
#
#
BLOCK DCINFO  # Decay Program information
     1   SDECAY/HDECAY # decay calculator
     2   1.3b  /3.4    # version number
#
BLOCK SPINFO  # Spectrum calculator information
     1     SOFTSUSY    # spectrum calculator               
     2     3.4.0       # version number                    
#
BLOCK MODSEL  # Model selection
     1     0   #  nonUniversal                                     
#
BLOCK SMINPUTS  # Standard Model inputs
         1     1.27908970E+02   # alpha_em^-1(M_Z)^MSbar
         2     1.16637870E-05   # G_F [GeV^-2]
         3     1.18400000E-01   # alpha_S(M_Z)^MSbar
         4     9.11876000E+01   # M_Z pole mass
         5     4.18000000E+00   # mb(mb)^MSbar
         6     1.73200000E+02   # mt pole mass
         7     1.77700000E+00   # mtau pole mass
#
BLOCK MINPAR  # Input parameters - minimal models
         3     3.17800000E+01   # tanb                
#
BLOCK EXTPAR  # Input parameters - non-minimal models
         0    -1.00000000E+00   # Set                 
         1    -3.04670000E+02   # M_1(MX)             
         2     1.81961000E+03   # M_2(MX)             
         3     2.11550000E+03   # M_3(MX)             
        11    -3.90619000E+03   # At(MX)              
        12    -2.98210000E+03   # Ab(MX)              
        13     3.47861000E+03   # Atau(MX)            
        23     1.43160000E+02   # mu(MX)              
        26     2.43556000E+03   # mA(pole)            
        31     2.67401000E+03   # meL(MX)             
        32     2.67401000E+03   # mmuL(MX)            
        33     1.45713000E+03   # mtauL(MX)           
        34     3.29341000E+03   # meR(MX)             
        35     3.29341000E+03   # mmuR(MX)            
        36     5.80080000E+02   # mtauR(MX)           
        41     9.66390000E+02   # mqL1(MX)            
        42     9.66390000E+02   # mqL2(MX)            
        43     1.84838000E+03   # mqL3(MX)            
        44     2.73031000E+03   # muR(MX)             
        45     2.73031000E+03   # mcR(MX)             
        46     3.85616000E+03   # mtR(MX)             
        47     3.83667000E+03   # mdR(MX)             
        48     3.83667000E+03   # msR(MX)             
        49     1.53959000E+03   # mbR(MX)             
#
BLOCK MASS  # Mass Spectrum
# PDG code           mass       particle
        24     8.03769500E+01   # W+
        25     1.26854888E+02   # h
        35     2.43556734E+03   # H
        36     2.43556001E+03   # A
        37     2.43710328E+03   # H+
         5     4.81876030E+00   # b-quark pole mass calculated from mb(mb)_Msbar
   1000001     1.13776822E+03   # ~d_L
   2000001     3.88515684E+03   # ~d_R
   1000002     1.13503779E+03   # ~u_L
   2000002     2.79483347E+03   # ~u_R
   1000003     1.13776822E+03   # ~s_L
   2000003     3.88515684E+03   # ~s_R
   1000004     1.13503779E+03   # ~c_L
   2000004     2.79483347E+03   # ~c_R
   1000005     1.63690301E+03   # ~b_1
   2000005     1.93902707E+03   # ~b_2
   1000006     1.93554501E+03   # ~t_1
   2000006     3.85153049E+03   # ~t_2
   1000011     2.68470282E+03   # ~e_L
   2000011     3.29941911E+03   # ~e_R
   1000012     2.68321635E+03   # ~nu_eL
   1000013     2.68470282E+03   # ~mu_L
   2000013     3.29941911E+03   # ~mu_R
   1000014     2.68321635E+03   # ~nu_muL
   1000015     5.77934475E+02   # ~tau_1
   2000015     1.47089908E+03   # ~tau_2
   1000016     1.46846668E+03   # ~nu_tauL
   1000021     2.24647521E+03   # ~g
   1000022    -1.46149489E+02   # ~chi_10
   1000023     1.50310519E+02   # ~chi_20
   1000025    -3.09491948E+02   # ~chi_30
   1000035     1.81306816E+03   # ~chi_40
   1000024     1.49939092E+02   # ~chi_1+
   1000037     1.81323599E+03   # ~chi_2+
#
BLOCK NMIX  # Neutralino Mixing Matrix
  1  1     1.83681813E-01   # N_11
  1  2     2.67501584E-02   # N_12
  1  3     7.04762274E-01   # N_13
  1  4     6.84730281E-01   # N_14
  2  1     6.97026773E-02   # N_21
  2  2     3.44947333E-02   # N_22
  2  3    -7.04680069E-01   # N_23
  2  4     7.05250063E-01   # N_24
  3  1     9.80510919E-01   # N_31
  3  2    -6.51536885E-03   # N_32
  3  3    -8.19260038E-02   # N_33
  3  4    -1.78448920E-01   # N_34
  4  1    -9.30409182E-04   # N_41
  4  2     9.99025571E-01   # N_42
  4  3     4.92627070E-03   # N_43
  4  4    -4.38494450E-02   # N_44
#
BLOCK UMIX  # Chargino Mixing Matrix U
  1  1    -6.96811711E-03   # U_11
  1  2     9.99975722E-01   # U_12
  2  1    -9.99975722E-01   # U_21
  2  2    -6.96811711E-03   # U_22
#
BLOCK VMIX  # Chargino Mixing Matrix V
  1  1    -6.20418791E-02   # V_11
  1  2     9.98073547E-01   # V_12
  2  1    -9.98073547E-01   # V_21
  2  2    -6.20418791E-02   # V_22
#
BLOCK STOPMIX  # Stop Mixing Matrix
  1  1     9.98701116E-01   # cos(theta_t)
  1  2     5.09517507E-02   # sin(theta_t)
  2  1    -5.09517507E-02   # -sin(theta_t)
  2  2     9.98701116E-01   # cos(theta_t)
#
BLOCK SBOTMIX  # Sbottom Mixing Matrix
  1  1     1.63315930E-02   # cos(theta_b)
  1  2     9.99866631E-01   # sin(theta_b)
  2  1    -9.99866631E-01   # -sin(theta_b)
  2  2     1.63315930E-02   # cos(theta_b)
#
BLOCK STAUMIX  # Stau Mixing Matrix
  1  1     1.04718998E-03   # cos(theta_tau)
  1  2     9.99999452E-01   # sin(theta_tau)
  2  1    -9.99999452E-01   # -sin(theta_tau)
  2  2     1.04718998E-03   # cos(theta_tau)
#
BLOCK ALPHA  # Higgs mixing
          -3.26266015E-02   # Mixing angle in the neutral Higgs boson sector
#
BLOCK HMIX Q=  2.66996200E+03  # DRbar Higgs Parameters
         1     1.45668882E+02   # mu(Q)MSSM           
         2     3.07602648E+01   # tan                 
         3     2.42362933E+02   # higgs               
         4     6.09223346E+06   # mA^2(Q)MSSM         
#
BLOCK GAUGE Q=  2.66996200E+03  # The gauge couplings
     1     3.65039163E-01   # gprime(Q) DRbar
     2     6.40499244E-01   # g(Q) DRbar
     3     1.02126975E+00   # g3(Q) DRbar
#
BLOCK AU Q=  2.66996200E+03  # The trilinear couplings
  1  1     0.00000000E+00   # A_u(Q) DRbar
  2  2     0.00000000E+00   # A_c(Q) DRbar
  3  3    -3.90618999E+03   # A_t(Q) DRbar
#
BLOCK AD Q=  2.66996200E+03  # The trilinear couplings
  1  1     0.00000000E+00   # A_d(Q) DRbar
  2  2     0.00000000E+00   # A_s(Q) DRbar
  3  3    -2.98210000E+03   # A_b(Q) DRbar
#
BLOCK AE Q=  2.66996200E+03  # The trilinear couplings
  1  1     0.00000000E+00   # A_e(Q) DRbar
  2  2     0.00000000E+00   # A_mu(Q) DRbar
  3  3     3.47861000E+03   # A_tau(Q) DRbar
#
BLOCK Yu Q=  2.66996200E+03  # The Yukawa couplings
  1  1     0.00000000E+00   # y_u(Q) DRbar
  2  2     0.00000000E+00   # y_c(Q) DRbar
  3  3     8.19440021E-01   # y_t(Q) DRbar
#
BLOCK Yd Q=  2.66996200E+03  # The Yukawa couplings
  1  1     0.00000000E+00   # y_d(Q) DRbar
  2  2     0.00000000E+00   # y_s(Q) DRbar
  3  3     4.05867394E-01   # y_b(Q) DRbar
#
BLOCK Ye Q=  2.66996200E+03  # The Yukawa couplings
  1  1     0.00000000E+00   # y_e(Q) DRbar
  2  2     0.00000000E+00   # y_mu(Q) DRbar
  3  3     3.16597244E-01   # y_tau(Q) DRbar
#
BLOCK MSOFT Q=  2.66996200E+03  # The soft SUSY breaking masses at the scale Q
         1    -3.04670000E+02   # M_1(Q)              
         2     1.81961000E+03   # M_2(Q)              
         3     2.11550000E+03   # M_3(Q)              
        21     6.01165237E+06   # mH1^2(Q)            
        22     1.49598003E+04   # mH2^2(Q)            
        31     2.67401000E+03   # meL(Q)              
        32     2.67401000E+03   # mmuL(Q)             
        33     1.45713000E+03   # mtauL(Q)            
        34     3.29341000E+03   # meR(Q)              
        35     3.29341000E+03   # mmuR(Q)             
        36     5.80080001E+02   # mtauR(Q)            
        41     9.66389987E+02   # mqL1(Q)             
        42     9.66389987E+02   # mqL2(Q)             
        43     1.84837998E+03   # mqL3(Q)             
        44     2.73031000E+03   # muR(Q)              
        45     2.73031000E+03   # mcR(Q)              
        46     3.85615999E+03   # mtR(Q)              
        47     3.83667000E+03   # mdR(Q)              
        48     3.83667000E+03   # msR(Q)              
        49     1.53958999E+03   # mbR(Q)              
#
Block HiggsBoundsInputHiggsCouplingsFermions
# ScalarNormEffCoupSq PseudoSNormEffCoupSq NP   IP1 IP2 IP2
    1.00792556E+00    0.00000000E+00        3  25   5   5  # h0-b-b eff. coupling^2, normalised to SM
    9.46185965E+02    0.00000000E+00        3  35   5   5  # H0-b-b eff. coupling^2, normalised to SM
    0.00000000E+00    9.46193891E+02        3  36   5   5  # A0-b-b eff. coupling^2, normalised to SM
#
    9.99991624E-01    0.00000000E+00        3  25   6   6  # h0-t-t eff. coupling^2, normalised to SM
    1.06524209E-03    0.00000000E+00        3  35   6   6  # H0-t-t eff. coupling^2, normalised to SM
    0.00000000E+00    1.05686584E-03        3  36   6   6  # A0-t-t eff. coupling^2, normalised to SM
#
    1.00792556E+00    0.00000000E+00        3  25  15  15  # h0-tau-tau eff. coupling^2, normalised to SM
    9.46185965E+02    0.00000000E+00        3  35  15  15  # H0-tau-tau eff. coupling^2, normalised to SM
    0.00000000E+00    9.46193891E+02        3  36  15  15  # A0-tau-tau eff. coupling^2, normalised to SM
#
Block HiggsBoundsInputHiggsCouplingsBosons
    9.99999983E-01        3  25  24  24  # h0-W-W eff. coupling^2, normalised to SM
    1.65312464E-08        3  35  24  24  # H0-W-W eff. coupling^2, normalised to SM
    0.00000000E+00        3  36  24  24  # A0-W-W eff. coupling^2, normalised to SM
#
    9.99999983E-01        3  25  23  23  # h0-Z-Z eff. coupling^2, normalised to SM
    1.65312464E-08        3  35  23  23  # H0-Z-Z eff. coupling^2, normalised to SM
    0.00000000E+00        3  36  23  23  # A0-Z-Z eff. coupling^2, normalised to SM
#
    8.89188099E-01        3  25  21  21  # h0-g-g eff. coupling^2, normalised to SM
    2.61484446E-12        3  35  21  21  # H0-g-g eff. coupling^2, normalised to SM
    1.96118938E-11        3  36  21  21  # A0-g-g eff. coupling^2, normalised to SM
#
    0.00000000E+00        3  25  25  23  # h0-h0-Z eff. coupling^2, normalised to SM
    0.00000000E+00        3  35  25  23  # H0-h0-Z eff. coupling^2, normalised to SM
    1.65312464E-08        3  36  25  23  # A0-h0-Z eff. coupling^2, normalised to SM
    0.00000000E+00        3  35  35  23  # H0-H0-Z eff. coupling^2, normalised to SM
    9.99999983E-01        3  36  35  23  # A0-H0-Z eff. coupling^2, normalised to SM
    0.00000000E+00        3  36  36  23  # A0-A0-Z eff. coupling^2, normalised to SM
#
    0.00000000E+00        4  25  21  21  23  # h0-g-g-Z eff. coupling^2, normalised to SM
    0.00000000E+00        4  35  21  21  23  # H0-g-g-Z eff. coupling^2, normalised to SM
    0.00000000E+00        4  36  21  21  23  # A0-g-g-Z eff. coupling^2, normalised to SM
#
#
#
#                             =================
#                             |The decay table|
#                             =================
#
# - The QCD corrections to the decays gluino -> squark  + quark
#                                     squark -> gaugino + quark_prime
#                                     squark -> squark_prime + Higgs
#                                     squark -> gluino  + quark
#   are included.
#
# - The multi-body decays for the inos, stops and sbottoms are included.
#
# - The loop induced decays for the gluino, neutralinos and stops
#   are included.
#
# - The SUSY decays of the top quark are included.
#
#
#         PDG            Width
DECAY         6     1.44538319E+00   # top decays
#          BR         NDA      ID1       ID2
     1.00000000E+00    2           5        24   # BR(t ->  b    W+)
#
#         PDG            Width
DECAY   1000021     1.29990046E+02   # gluino decays
#          BR         NDA      ID1       ID2
     1.10424386E-01    2     1000001        -1   # BR(~g -> ~d_L  db)
     1.10424386E-01    2    -1000001         1   # BR(~g -> ~d_L* d )
     1.10789955E-01    2     1000002        -2   # BR(~g -> ~u_L  ub)
     1.10789955E-01    2    -1000002         2   # BR(~g -> ~u_L* u )
     1.10424386E-01    2     1000003        -3   # BR(~g -> ~s_L  sb)
     1.10424386E-01    2    -1000003         3   # BR(~g -> ~s_L* s )
     1.10789908E-01    2     1000004        -4   # BR(~g -> ~c_L  cb)
     1.10789908E-01    2    -1000004         4   # BR(~g -> ~c_L* c )
     3.72638193E-02    2     1000005        -5   # BR(~g -> ~b_1  bb)
     3.72638193E-02    2    -1000005         5   # BR(~g -> ~b_1* b )
     1.11743648E-02    2     2000005        -5   # BR(~g -> ~b_2  bb)
     1.11743648E-02    2    -2000005         5   # BR(~g -> ~b_2* b )
     9.13318007E-03    2     1000006        -6   # BR(~g -> ~t_1  tb)
     9.13318007E-03    2    -1000006         6   # BR(~g -> ~t_1* t )
#
#         PDG            Width
DECAY   1000006     3.21477515E+01   # stop1 decays
#          BR         NDA      ID1       ID2
     3.66371052E-01    2     1000022         6   # BR(~t_1 -> ~chi_10 t )
     3.88266062E-01    2     1000023         6   # BR(~t_1 -> ~chi_20 t )
     3.50960735E-02    2     1000025         6   # BR(~t_1 -> ~chi_30 t )
     2.02234957E-01    2     1000024         5   # BR(~t_1 -> ~chi_1+ b )
     7.25044736E-03    2     1000037         5   # BR(~t_1 -> ~chi_2+ b )
     7.81407683E-04    2     1000005        24   # BR(~t_1 -> ~b_1    W+)
#
#         PDG            Width
DECAY   2000006     2.80620735E+02   # stop2 decays
#          BR         NDA      ID1       ID2
     8.69021109E-02    2     1000022         6   # BR(~t_2 -> ~chi_10 t )
     9.08000462E-02    2     1000023         6   # BR(~t_2 -> ~chi_20 t )
     3.54039396E-02    2     1000025         6   # BR(~t_2 -> ~chi_30 t )
     5.73843126E-04    2     1000035         6   # BR(~t_2 -> ~chi_40 t )
     1.80834608E-01    2     1000024         5   # BR(~t_2 -> ~chi_1+ b )
     1.14913570E-03    2     1000037         5   # BR(~t_2 -> ~chi_2+ b )
     3.24881270E-01    2     1000021         6   # BR(~t_2 -> ~g      t )
     6.96408131E-02    2     1000006        25   # BR(~t_2 -> ~t_1    h )
     7.12979456E-02    2     1000006        23   # BR(~t_2 -> ~t_1    Z )
     4.88740992E-05    2     1000005        24   # BR(~t_2 -> ~b_1    W+)
     1.38467413E-01    2     2000005        24   # BR(~t_2 -> ~b_2    W+)
#
#         PDG            Width
DECAY   1000005     1.13289449E+01   # sbottom1 decays
#          BR         NDA      ID1       ID2
     2.35239634E-01    2     1000022         5   # BR(~b_1 -> ~chi_10 b )
     2.31532065E-01    2     1000023         5   # BR(~b_1 -> ~chi_20 b )
     7.82504847E-02    2     1000025         5   # BR(~b_1 -> ~chi_30 b )
     4.54977816E-01    2    -1000024         6   # BR(~b_1 -> ~chi_1- t )
#
#         PDG            Width
DECAY   2000005     3.17916988E+01   # sbottom2 decays
#          BR         NDA      ID1       ID2
     9.77730016E-02    2     1000022         5   # BR(~b_2 -> ~chi_10 b )
     9.82008290E-02    2     1000023         5   # BR(~b_2 -> ~chi_20 b )
     1.03801631E-02    2     1000025         5   # BR(~b_2 -> ~chi_30 b )
     3.92411779E-03    2     1000035         5   # BR(~b_2 -> ~chi_40 b )
     7.88909643E-01    2    -1000024         6   # BR(~b_2 -> ~chi_1- t )
     4.03978586E-04    2     1000005        25   # BR(~b_2 -> ~b_1    h )
     4.08267064E-04    2     1000005        23   # BR(~b_2 -> ~b_1    Z )
#
#         PDG            Width
DECAY   1000002     1.92594011E-01   # sup_L decays
#          BR         NDA      ID1       ID2
     8.95683114E-02    2     1000022         2   # BR(~u_L -> ~chi_10 u)
     5.36078212E-02    2     1000023         2   # BR(~u_L -> ~chi_20 u)
     6.75689813E-01    2     1000025         2   # BR(~u_L -> ~chi_30 u)
     1.81134054E-01    2     1000024         1   # BR(~u_L -> ~chi_1+ d)
#
#         PDG            Width
DECAY   2000002     3.61246918E+01   # sup_R decays
#          BR         NDA      ID1       ID2
     5.82045772E-03    2     1000022         2   # BR(~u_R -> ~chi_10 u)
     8.37918914E-04    2     1000023         2   # BR(~u_R -> ~chi_20 u)
     1.62921541E-01    2     1000025         2   # BR(~u_R -> ~chi_30 u)
     5.12139472E-08    2     1000035         2   # BR(~u_R -> ~chi_40 u)
     8.30420031E-01    2     1000021         2   # BR(~u_R -> ~g      u)
#
#         PDG            Width
DECAY   1000001     1.52935565E-01   # sdown_L decays
#          BR         NDA      ID1       ID2
     1.97393757E-03    2     1000022         1   # BR(~d_L -> ~chi_10 d)
     1.34139739E-02    2     1000023         1   # BR(~d_L -> ~chi_20 d)
     9.81727674E-01    2     1000025         1   # BR(~d_L -> ~chi_30 d)
     2.88441446E-03    2    -1000024         2   # BR(~d_L -> ~chi_1- u)
#
#         PDG            Width
DECAY   2000001     1.49699566E+02   # sdown_R decays
#          BR         NDA      ID1       ID2
     4.94067094E-04    2     1000022         1   # BR(~d_R -> ~chi_10 d)
     7.11361948E-05    2     1000023         1   # BR(~d_R -> ~chi_20 d)
     1.39508559E-02    2     1000025         1   # BR(~d_R -> ~chi_30 d)
     7.82994904E-09    2     1000035         1   # BR(~d_R -> ~chi_40 d)
     9.85483933E-01    2     1000021         1   # BR(~d_R -> ~g      d)
#
#         PDG            Width
DECAY   1000004     1.89872606E-01   # scharm_L decays
#          BR         NDA      ID1       ID2
     8.96525953E-02    2     1000022         4   # BR(~c_L -> ~chi_10 c)
     5.36560620E-02    2     1000023         4   # BR(~c_L -> ~chi_20 c)
     6.75392928E-01    2     1000025         4   # BR(~c_L -> ~chi_30 c)
     1.81298415E-01    2     1000024         3   # BR(~c_L -> ~chi_1+ s)
#
#         PDG            Width
DECAY   2000004     2.57999369E+01   # scharm_R decays
#          BR         NDA      ID1       ID2
     8.56539843E-03    2     1000022         4   # BR(~c_R -> ~chi_10 c)
     1.23303844E-03    2     1000023         4   # BR(~c_R -> ~chi_20 c)
     2.39431588E-01    2     1000025         4   # BR(~c_R -> ~chi_30 c)
     7.41206516E-08    2     1000035         4   # BR(~c_R -> ~chi_40 c)
     7.50769901E-01    2     1000021         4   # BR(~c_R -> ~g      c)
#
#         PDG            Width
DECAY   1000003     1.50731846E-01   # sstrange_L decays
#          BR         NDA      ID1       ID2
     1.97661385E-03    2     1000022         3   # BR(~s_L -> ~chi_10 s)
     1.34316091E-02    2     1000023         3   # BR(~s_L -> ~chi_20 s)
     9.81703566E-01    2     1000025         3   # BR(~s_L -> ~chi_30 s)
     2.88821107E-03    2    -1000024         4   # BR(~s_L -> ~chi_1- c)
#
#         PDG            Width
DECAY   2000003     9.75173854E+01   # sstrange_R decays
#          BR         NDA      ID1       ID2
     7.89633181E-04    2     1000022         3   # BR(~s_R -> ~chi_10 s)
     1.13689644E-04    2     1000023         3   # BR(~s_R -> ~chi_20 s)
     2.22791457E-02    2     1000025         3   # BR(~s_R -> ~chi_30 s)
     1.24317617E-08    2     1000035         3   # BR(~s_R -> ~chi_40 s)
     9.76817519E-01    2     1000021         3   # BR(~s_R -> ~g      s)
#
#         PDG            Width
DECAY   1000011     1.32145115E+01   # selectron_L decays
#          BR         NDA      ID1       ID2
     1.42374358E-02    2     1000022        11   # BR(~e_L -> ~chi_10 e-)
     4.53838295E-03    2     1000023        11   # BR(~e_L -> ~chi_20 e-)
     2.46219320E-01    2     1000025        11   # BR(~e_L -> ~chi_30 e-)
     2.44541930E-01    2     1000035        11   # BR(~e_L -> ~chi_40 e-)
     8.00073482E-05    2    -1000024        12   # BR(~e_L -> ~chi_1- nu_e)
     4.90382925E-01    2    -1000037        12   # BR(~e_L -> ~chi_2- nu_e)
#
#         PDG            Width
DECAY   2000011     1.71961600E+01   # selectron_R decays
#          BR         NDA      ID1       ID2
     3.41878238E-02    2     1000022        11   # BR(~e_R -> ~chi_10 e-)
     4.92197538E-03    2     1000023        11   # BR(~e_R -> ~chi_20 e-)
     9.60889772E-01    2     1000025        11   # BR(~e_R -> ~chi_30 e-)
     4.29091895E-07    2     1000035        11   # BR(~e_R -> ~chi_40 e-)
#
#         PDG            Width
DECAY   1000013     1.32145114E+01   # smuon_L decays
#          BR         NDA      ID1       ID2
     1.42374358E-02    2     1000022        13   # BR(~mu_L -> ~chi_10 mu-)
     4.53838295E-03    2     1000023        13   # BR(~mu_L -> ~chi_20 mu-)
     2.46219320E-01    2     1000025        13   # BR(~mu_L -> ~chi_30 mu-)
     2.44541928E-01    2     1000035        13   # BR(~mu_L -> ~chi_40 mu-)
     8.00073485E-05    2    -1000024        14   # BR(~mu_L -> ~chi_1- nu_mu)
     4.90382926E-01    2    -1000037        14   # BR(~mu_L -> ~chi_2- nu_mu)
#
#         PDG            Width
DECAY   2000013     1.71961600E+01   # smuon_R decays
#          BR         NDA      ID1       ID2
     3.41878238E-02    2     1000022        13   # BR(~mu_R -> ~chi_10 mu-)
     4.92197538E-03    2     1000023        13   # BR(~mu_R -> ~chi_20 mu-)
     9.60889772E-01    2     1000025        13   # BR(~mu_R -> ~chi_30 mu-)
     4.29091894E-07    2     1000035        13   # BR(~mu_R -> ~chi_40 mu-)
#
#         PDG            Width
DECAY   1000015     3.60781363E+00   # stau_1 decays
#          BR         NDA      ID1       ID2
     1.64362122E-01    2     1000022        15   # BR(~tau_1 -> ~chi_10  tau-)
     1.41545062E-01    2     1000023        15   # BR(~tau_1 -> ~chi_20  tau-)
     4.16220151E-01    2     1000025        15   # BR(~tau_1 -> ~chi_30  tau-)
     2.77872665E-01    2    -1000024        16   # BR(~tau_1 -> ~chi_1-  nu_tau)
#
#         PDG            Width
DECAY   2000015     4.68047291E+00   # stau_2 decays
#          BR         NDA      ID1       ID2
     3.26721505E-01    2     1000022        15   # BR(~tau_2 -> ~chi_10  tau-)
     3.11622454E-01    2     1000023        15   # BR(~tau_2 -> ~chi_20  tau-)
     3.61282903E-01    2     1000025        15   # BR(~tau_2 -> ~chi_30  tau-)
     1.04514064E-04    2    -1000024        16   # BR(~tau_2 -> ~chi_1-  nu_tau)
     1.24773956E-04    2     1000015        25   # BR(~tau_2 -> ~tau_1   h)
     1.43848944E-04    2     1000015        23   # BR(~tau_2 -> ~tau_1   Z)
#
#         PDG            Width
DECAY   1000012     1.32277386E+01   # snu_eL decays
#          BR         NDA      ID1       ID2
     4.99800726E-03    2     1000022        12   # BR(~nu_eL -> ~chi_10 nu_e)
     2.25072398E-05    2     1000023        12   # BR(~nu_eL -> ~chi_20 nu_e)
     2.57566291E-01    2     1000025        12   # BR(~nu_eL -> ~chi_30 nu_e)
     2.44226532E-01    2     1000035        12   # BR(~nu_eL -> ~chi_40 nu_e)
     6.33272820E-03    2     1000024        11   # BR(~nu_eL -> ~chi_1+ e-)
     4.86853934E-01    2     1000037        11   # BR(~nu_eL -> ~chi_2+ e-)
#
#         PDG            Width
DECAY   1000014     1.32277386E+01   # snu_muL decays
#          BR         NDA      ID1       ID2
     4.99800728E-03    2     1000022        14   # BR(~nu_muL -> ~chi_10 nu_mu)
     2.25072399E-05    2     1000023        14   # BR(~nu_muL -> ~chi_20 nu_mu)
     2.57566292E-01    2     1000025        14   # BR(~nu_muL -> ~chi_30 nu_mu)
     2.44226534E-01    2     1000035        14   # BR(~nu_muL -> ~chi_40 nu_mu)
     6.33272821E-03    2     1000024        13   # BR(~nu_muL -> ~chi_1+ mu-)
     4.86853932E-01    2     1000037        13   # BR(~nu_muL -> ~chi_2+ mu-)
#
#         PDG            Width
DECAY   1000016     4.69835046E+00   # snu_tauL decays
#          BR         NDA      ID1       ID2
     7.59415941E-03    2     1000022        16   # BR(~nu_tauL -> ~chi_10 nu_tau)
     3.41705797E-05    2     1000023        16   # BR(~nu_tauL -> ~chi_20 nu_tau)
     3.72225290E-01    2     1000025        16   # BR(~nu_tauL -> ~chi_30 nu_tau)
     6.19868681E-01    2     1000024        15   # BR(~nu_tauL -> ~chi_1+ tau-)
     2.77699080E-04    2    -1000015       -24   # BR(~nu_tauL -> ~tau_1+ W-)
#
#         PDG            Width
DECAY   1000024     8.23424601E-10   # chargino1+ decays
#           BR         NDA      ID1       ID2       ID3
     3.59501560E-01    3     1000022         2        -1   # BR(~chi_1+ -> ~chi_10 u    db)
     3.59501560E-01    3     1000022         4        -3   # BR(~chi_1+ -> ~chi_10 c    sb)
     1.19830924E-01    3     1000022       -11        12   # BR(~chi_1+ -> ~chi_10 e+   nu_e)
     1.19830924E-01    3     1000022       -13        14   # BR(~chi_1+ -> ~chi_10 mu+  nu_mu)
     4.13350308E-02    3     1000022       -15        16   # BR(~chi_1+ -> ~chi_10 tau+ nu_tau)
#
#         PDG            Width
DECAY   1000037     4.88103294E+01   # chargino2+ decays
#          BR         NDA      ID1       ID2
     1.66769423E-01    2     1000002        -1   # BR(~chi_2+ -> ~u_L     db)
     1.66379413E-01    2    -1000001         2   # BR(~chi_2+ -> ~d_L*    u )
     1.66769406E-01    2     1000004        -3   # BR(~chi_2+ -> ~c_L     sb)
     1.66379134E-01    2    -1000003         4   # BR(~chi_2+ -> ~s_L*     c )
     3.46915239E-07    2    -1000005         6   # BR(~chi_2+ -> ~b_1*    t )
     1.78824447E-02    2     1000016       -15   # BR(~chi_2+ -> ~nu_tau1 tau+)
     7.03109079E-07    2    -1000015        16   # BR(~chi_2+ -> ~tau_1+  nu_tau)
     1.77253045E-02    2    -2000015        16   # BR(~chi_2+ -> ~tau_2+  nu_tau)
     7.54923161E-02    2     1000024        23   # BR(~chi_2+ -> ~chi_1+  Z )
     6.99291854E-02    2     1000022        24   # BR(~chi_2+ -> ~chi_10  W+)
     7.36263477E-02    2     1000023        24   # BR(~chi_2+ -> ~chi_20  W+)
     3.50096771E-03    2     1000025        24   # BR(~chi_2+ -> ~chi_30  W+)
     7.55450083E-02    2     1000024        25   # BR(~chi_2+ -> ~chi_1+  h )
#
#         PDG            Width
DECAY   1000022     0.00000000E+00   # neutralino1 decays
#
#         PDG            Width
DECAY   1000023     1.09677986E-09   # neutralino2 decays
#          BR         NDA      ID1       ID2
     1.14904511E-01    2     1000022        22   # BR(~chi_20 -> ~chi_10 gam)
#           BR         NDA      ID1       ID2       ID3
     1.26323168E-01    3     1000022        -2         2   # BR(~chi_20 -> ~chi_10 ub      u)
     1.63903814E-01    3     1000022        -1         1   # BR(~chi_20 -> ~chi_10 db      d)
     1.26323168E-01    3     1000022        -4         4   # BR(~chi_20 -> ~chi_10 cb      c)
     1.63903814E-01    3     1000022        -3         3   # BR(~chi_20 -> ~chi_10 sb      s)
     3.76123536E-02    3     1000022       -11        11   # BR(~chi_20 -> ~chi_10 e+      e-)
     3.76123536E-02    3     1000022       -13        13   # BR(~chi_20 -> ~chi_10 mu+     mu-)
     3.80925391E-03    3     1000022       -15        15   # BR(~chi_20 -> ~chi_10 tau+    tau-)
     7.51995880E-02    3     1000022       -12        12   # BR(~chi_20 -> ~chi_10 nu_eb   nu_e)
     7.51995880E-02    3     1000022       -14        14   # BR(~chi_20 -> ~chi_10 nu_mub  nu_mu)
     7.51997173E-02    3     1000022       -16        16   # BR(~chi_20 -> ~chi_10 nu_taub nu_tau)
     2.60130686E-06    3     1000024        -2         1   # BR(~chi_20 -> ~chi_1+ ub      d)
     2.60130686E-06    3    -1000024        -1         2   # BR(~chi_20 -> ~chi_1- db      u)
     8.67088602E-07    3     1000024       -12        11   # BR(~chi_20 -> ~chi_1+ nu_eb   e-)
     8.67088602E-07    3    -1000024        12       -11   # BR(~chi_20 -> ~chi_1- nu_e    e+)
     8.67088602E-07    3     1000024       -14        13   # BR(~chi_20 -> ~chi_1+ nu_mub  mu-)
     8.67088602E-07    3    -1000024        14       -13   # BR(~chi_20 -> ~chi_1- nu_mu   mu+)
#
#         PDG            Width
DECAY   1000025     4.30473846E-01   # neutralino3 decays
#          BR         NDA      ID1       ID2
     5.52586241E-02    2     1000022        23   # BR(~chi_30 -> ~chi_10   Z )
     1.95984745E-01    2     1000023        23   # BR(~chi_30 -> ~chi_20   Z )
     2.79624554E-01    2     1000024       -24   # BR(~chi_30 -> ~chi_1+   W-)
     2.79624554E-01    2    -1000024        24   # BR(~chi_30 -> ~chi_1-   W+)
     1.78916587E-01    2     1000022        25   # BR(~chi_30 -> ~chi_10   h )
     1.05909376E-02    2     1000023        25   # BR(~chi_30 -> ~chi_20   h )
#
#         PDG            Width
DECAY   1000035     4.87947881E+01   # neutralino4 decays
#          BR         NDA      ID1       ID2
     4.36346135E-02    2     1000022        23   # BR(~chi_40 -> ~chi_10   Z )
     2.93501959E-02    2     1000023        23   # BR(~chi_40 -> ~chi_20   Z )
     2.45341081E-03    2     1000025        23   # BR(~chi_40 -> ~chi_30   Z )
     7.36925558E-02    2     1000024       -24   # BR(~chi_40 -> ~chi_1+   W-)
     7.36925558E-02    2    -1000024        24   # BR(~chi_40 -> ~chi_1-   W+)
     2.78115344E-02    2     1000022        25   # BR(~chi_40 -> ~chi_10   h )
     4.63368835E-02    2     1000023        25   # BR(~chi_40 -> ~chi_20   h )
     1.13587768E-03    2     1000025        25   # BR(~chi_40 -> ~chi_30   h )
     8.35139836E-02    2     1000002        -2   # BR(~chi_40 -> ~u_L      ub)
     8.35139836E-02    2    -1000002         2   # BR(~chi_40 -> ~u_L*     u )
     8.30606033E-02    2     1000001        -1   # BR(~chi_40 -> ~d_L      db)
     8.30606033E-02    2    -1000001         1   # BR(~chi_40 -> ~d_L*     d )
     8.35138451E-02    2     1000004        -4   # BR(~chi_40 -> ~c_L      cb)
     8.35138451E-02    2    -1000004         4   # BR(~chi_40 -> ~c_L*     c )
     8.30606033E-02    2     1000003        -3   # BR(~chi_40 -> ~s _L      sb)
     8.30606033E-02    2    -1000003         3   # BR(~chi_40 -> ~s _L*     s )
     1.10354530E-06    2     1000005        -5   # BR(~chi_40 -> ~b_1      bb)
     1.10354530E-06    2    -1000005         5   # BR(~chi_40 -> ~b_1*     b )
     4.19561026E-07    2     1000015       -15   # BR(~chi_40 -> ~tau_1-   tau+)
     4.19561026E-07    2    -1000015        15   # BR(~chi_40 -> ~tau_1+   tau-)
     8.83178975E-03    2     2000015       -15   # BR(~chi_40 -> ~tau_2-   tau+)
     8.83178975E-03    2    -2000015        15   # BR(~chi_40 -> ~tau_2+   tau-)
     8.96383806E-03    2     1000016       -16   # BR(~chi_40 -> ~nu_tau1  nu_taub)
     8.96383806E-03    2    -1000016        16   # BR(~chi_40 -> ~nu_tau1* nu_tau )
#
#         PDG            Width
DECAY        25     4.40164670E-03   # h decays
#          BR         NDA      ID1       ID2
     5.76272764E-01    2           5        -5   # BR(h -> b       bb     )
     6.01265314E-02    2         -15        15   # BR(h -> tau+    tau-   )
     2.12826472E-04    2         -13        13   # BR(h -> mu+     mu-    )
     2.31615727E-04    2           3        -3   # BR(h -> s       sb     )
     1.99382269E-02    2           4        -4   # BR(h -> c       cb     )
     7.57456535E-02    2          21        21   # BR(h -> g       g      )
     2.28019454E-03    2          22        22   # BR(h -> gam     gam    )
     1.66844475E-03    2          22        23   # BR(h -> Z       gam    )
     2.33593719E-01    2          24       -24   # BR(h -> W+      W-     )
     2.99300238E-02    2          23        23   # BR(h -> Z       Z      )
#
#         PDG            Width
DECAY        35     4.55376382E+01   # H decays
#          BR         NDA      ID1       ID2
     5.90406509E-01    2           5        -5   # BR(H -> b       bb     )
     1.02904692E-01    2         -15        15   # BR(H -> tau+    tau-   )
     3.67391859E-04    2         -13        13   # BR(H -> mu+     mu-    )
     2.32299241E-04    2           3        -3   # BR(H -> s       sb     )
     2.40467405E-08    2           4        -4   # BR(H -> c       cb     )
     2.34920982E-03    2           6        -6   # BR(H -> t       tb     )
     1.15598431E-05    2          21        21   # BR(H -> g       g      )
     1.14735935E-08    2          22        22   # BR(H -> gam     gam    )
     5.97257631E-09    2          23        22   # BR(H -> Z       gam    )
     1.68136094E-06    2          24       -24   # BR(H -> W+      W-     )
     8.38255803E-07    2          23        23   # BR(H -> Z       Z      )
     6.14327035E-06    2          25        25   # BR(H -> h       h      )
     1.69195497E-03    2     1000024  -1000024   # BR(H -> ~chi_1+ ~chi_1-)
     4.37580889E-02    2     1000024  -1000037   # BR(H -> ~chi_1+ ~chi_2-)
     4.37580889E-02    2     1000037  -1000024   # BR(H -> ~chi_2+ ~chi_1-)
     1.20385193E-03    2     1000022   1000022   # BR(H -> ~chi_10 ~chi_10)
     1.67394855E-06    2     1000023   1000023   # BR(H -> ~chi_20 ~chi_20)
     8.92898992E-04    2     1000025   1000025   # BR(H -> ~chi_30 ~chi_30)
     4.92047404E-04    2     1000022   1000023   # BR(H -> ~chi_10 ~chi_20)
     3.10131253E-02    2     1000022   1000025   # BR(H -> ~chi_10 ~chi_30)
     2.75313044E-02    2     1000022   1000035   # BR(H -> ~chi_10 ~chi_40)
     2.90964729E-02    2     1000023   1000025   # BR(H -> ~chi_20 ~chi_30)
     1.59227326E-02    2     1000023   1000035   # BR(H -> ~chi_20 ~chi_40)
     4.33946135E-04    2     1000025   1000035   # BR(H -> ~chi_30 ~chi_40)
     4.64904816E-07    2     1000002  -1000002   # BR(H -> ~u_L    ~u_L*  )
     4.64904816E-07    2     1000004  -1000004   # BR(H -> ~c_L    ~c_L*  )
     6.71554673E-07    2     1000001  -1000001   # BR(H -> ~d_L    ~d_L*  )
     6.71554673E-07    2     1000003  -1000003   # BR(H -> ~s_L    ~s_L*  )
     3.22025323E-07    2     1000015  -1000015   # BR(H -> ~tau_1- ~tau_1+)
     5.39604261E-02    2     1000015  -2000015   # BR(H -> ~tau_1- ~tau_2+)
     5.39604261E-02    2     2000015  -1000015   # BR(H -> ~tau_2- ~tau_1+)
#
#         PDG            Width
DECAY        36     4.55405849E+01   # A decays
#          BR         NDA      ID1       ID2
     5.90391569E-01    2           5        -5   # BR(A -> b       bb     )
     1.02898813E-01    2         -15        15   # BR(A -> tau+    tau-   )
     3.67370076E-04    2         -13        13   # BR(A -> mu+     mu-    )
     2.32302875E-04    2           3        -3   # BR(A -> s       sb     )
     2.40762770E-08    2           4        -4   # BR(A -> c       cb     )
     2.36250580E-03    2           6        -6   # BR(A -> t       tb     )
     3.16558616E-05    2          21        21   # BR(A -> g       g      )
     5.38281926E-08    2          22        22   # BR(A -> gam     gam    )
     2.19397416E-08    2          23        22   # BR(A -> Z       gam    )
     1.69983351E-06    2          23        25   # BR(A -> Z       h      )
     1.74317333E-03    2     1000024  -1000024   # BR(A -> ~chi_1+ ~chi_1-)
     4.37317680E-02    2     1000024  -1000037   # BR(A -> ~chi_1+ ~chi_2-)
     4.37317680E-02    2     1000037  -1000024   # BR(A -> ~chi_2+ ~chi_1-)
     1.07610555E-03    2     1000022   1000022   # BR(A -> ~chi_10 ~chi_10)
     1.93659891E-06    2     1000023   1000023   # BR(A -> ~chi_20 ~chi_20)
     7.18337761E-04    2     1000025   1000025   # BR(A -> ~chi_30 ~chi_30)
     5.58198388E-04    2     1000022   1000023   # BR(A -> ~chi_10 ~chi_20)
     2.82571383E-02    2     1000022   1000025   # BR(A -> ~chi_10 ~chi_30)
     1.60919162E-02    2     1000022   1000035   # BR(A -> ~chi_10 ~chi_40)
     3.20964008E-02    2     1000023   1000025   # BR(A -> ~chi_20 ~chi_30)
     2.76608624E-02    2     1000023   1000035   # BR(A -> ~chi_20 ~chi_40)
     1.32738197E-04    2     1000025   1000035   # BR(A -> ~chi_30 ~chi_40)
     5.39568197E-02    2     1000015  -2000015   # BR(A -> ~tau_1- ~tau_2+)
     5.39568197E-02    2    -1000015   2000015   # BR(A -> ~tau_1+ ~tau_2-)
#
#         PDG            Width
DECAY        37     4.39592552E+01   # H+ decays
#          BR         NDA      ID1       ID2
     9.68199298E-04    2           4        -5   # BR(H+ -> c       bb     )
     1.06667900E-01    2         -15        16   # BR(H+ -> tau+    nu_tau )
     3.80826496E-04    2         -13        14   # BR(H+ -> mu+     nu_mu  )
     9.68197570E-06    2           2        -5   # BR(H+ -> u       bb     )
     1.20339629E-05    2           2        -3   # BR(H+ -> u       sb     )
     2.36888806E-04    2           4        -3   # BR(H+ -> c       sb     )
     5.77013437E-01    2           6        -5   # BR(H+ -> t       bb     )
     1.76602765E-06    2          24        25   # BR(H+ -> W+      h      )
     2.61932416E-13    2          24        36   # BR(H+ -> W+      A      )
     4.03808039E-03    2     1000024   1000022   # BR(H+ -> ~chi_1+ ~chi_10)
     9.74072757E-04    2     1000024   1000023   # BR(H+ -> ~chi_1+ ~chi_20)
     6.05269691E-02    2     1000024   1000025   # BR(H+ -> ~chi_1+ ~chi_30)
     4.55620329E-02    2     1000024   1000035   # BR(H+ -> ~chi_1+ ~chi_40)
     4.53473059E-02    2     1000037   1000022   # BR(H+ -> ~chi_2+ ~chi_10)
     4.53963714E-02    2     1000037   1000023   # BR(H+ -> ~chi_2+ ~chi_20)
     5.88897595E-04    2     1000037   1000025   # BR(H+ -> ~chi_2+ ~chi_30)
     1.12273200E-01    2    -1000015   1000016   # BR(H+ -> ~tau_1+ ~nu_tauL)
     1.16801224E-06    2     1000002  -1000001   # BR(H+ -> ~u_L    ~d_L*  )
     1.16801224E-06    2     1000004  -1000003   # BR(H+ -> ~c_L    ~s_L*  )
