#
#                              ======================
#                              | THE SUSYHIT OUTPUT |
#                              ======================
#
#
#              ------------------------------------------------------
#              |     This is the output of the SUSY-HIT package     |
#              |  created by A.Djouadi, M.Muehlleitner and M.Spira. |
#              |  In case of problems with SUSY-HIT email to        |
#              |           margarete.muehlleitner@cern.ch           |
#              |           michael.spira@psi.ch                     |
#              |           abdelhak.djouadi@cern.ch                 |
#              ------------------------------------------------------
#
#              ------------------------------------------------------
#              |  SUSY Les Houches Accord - MSSM Spectrum + Decays  |
#              |              based on the decay programs           |
#              |                                                    |
#              |                     SDECAY 1.3b                    |
#              |                                                    |
#              |  Authors: M.Muhlleitner, A.Djouadi and Y.Mambrini  |
#              |  Ref.:    Comput.Phys.Commun.168(2005)46           |
#              |           [hep-ph/0311167]                         |
#              |                                                    |
#              |                     HDECAY 3.4                     |
#              |                                                    |
#              |  By: A.Djouadi,J.Kalinowski,M.Muhlleitner,M.Spira  |
#              |  Ref.:    Comput.Phys.Commun.108(1998)56           |
#              |           [hep-ph/9704448]                         |
#              |                                                    |
#              |                                                    |
#              |  If not stated otherwise all DRbar couplings and   |
#              |  soft SUSY breaking masses are given at the scale  |
#              |  Q=  0.27644000E+04
#              |                                                    |
#              ------------------------------------------------------
#
#
BLOCK DCINFO  # Decay Program information
     1   SDECAY/HDECAY # decay calculator
     2   1.3b  /3.4    # version number
#
BLOCK SPINFO  # Spectrum calculator information
     1     SOFTSUSY    # spectrum calculator               
     2     3.4.0       # version number                    
#
BLOCK MODSEL  # Model selection
     1     0   #  nonUniversal                                     
#
BLOCK SMINPUTS  # Standard Model inputs
         1     1.27908970E+02   # alpha_em^-1(M_Z)^MSbar
         2     1.16637870E-05   # G_F [GeV^-2]
         3     1.18400000E-01   # alpha_S(M_Z)^MSbar
         4     9.11876000E+01   # M_Z pole mass
         5     4.18000000E+00   # mb(mb)^MSbar
         6     1.73200000E+02   # mt pole mass
         7     1.77700000E+00   # mtau pole mass
#
BLOCK MINPAR  # Input parameters - minimal models
         3     1.99500000E+01   # tanb                
#
BLOCK EXTPAR  # Input parameters - non-minimal models
         0    -1.00000000E+00   # Set                 
         1     3.64562000E+03   # M_1(MX)             
         2     1.06114000E+03   # M_2(MX)             
         3     9.51610000E+02   # M_3(MX)             
        11    -3.42720000E+03   # At(MX)              
        12    -3.59167000E+03   # Ab(MX)              
        13     3.67492000E+03   # Atau(MX)            
        23    -7.89650000E+02   # mu(MX)              
        26     3.07572000E+03   # mA(pole)            
        31     1.89734000E+03   # meL(MX)             
        32     1.89734000E+03   # mmuL(MX)            
        33     2.06524000E+03   # mtauL(MX)           
        34     3.54770000E+03   # meR(MX)             
        35     3.54770000E+03   # mmuR(MX)            
        36     2.13032000E+03   # mtauR(MX)           
        41     1.47221000E+03   # mqL1(MX)            
        42     1.47221000E+03   # mqL2(MX)            
        43     3.98328000E+03   # mqL3(MX)            
        44     3.24574000E+03   # muR(MX)             
        45     3.24574000E+03   # mcR(MX)             
        46     1.91635000E+03   # mtR(MX)             
        47     9.64950000E+02   # mdR(MX)             
        48     9.64950000E+02   # msR(MX)             
        49     1.16607000E+03   # mbR(MX)             
#
BLOCK MASS  # Mass Spectrum
# PDG code           mass       particle
        24     8.03857887E+01   # W+
        25     1.25263026E+02   # h
        35     3.07574011E+03   # H
        36     3.07571974E+03   # A
        37     3.07684425E+03   # H+
         5     4.81876030E+00   # b-quark pole mass calculated from mb(mb)_Msbar
   1000001     1.52752119E+03   # ~d_L
   2000001     1.03780267E+03   # ~d_R
   1000002     1.52564383E+03   # ~u_L
   2000002     3.28097412E+03   # ~u_R
   1000003     1.52752119E+03   # ~s_L
   2000003     1.03780267E+03   # ~s_R
   1000004     1.52564383E+03   # ~c_L
   2000004     3.28097412E+03   # ~c_R
   1000005     1.22335993E+03   # ~b_1
   2000005     4.00053053E+03   # ~b_2
   1000006     1.91730194E+03   # ~t_1
   2000006     4.00492772E+03   # ~t_2
   1000011     1.90579156E+03   # ~e_L
   2000011     3.55992096E+03   # ~e_R
   1000012     1.90383295E+03   # ~nu_eL
   1000013     1.90579156E+03   # ~mu_L
   2000013     3.55992096E+03   # ~mu_R
   1000014     1.90383295E+03   # ~nu_muL
   1000015     2.07079985E+03   # ~tau_1
   2000015     2.14404154E+03   # ~tau_2
   1000016     2.06985424E+03   # ~nu_tauL
   1000021     1.11529329E+03   # ~g
   1000022     8.06589469E+02   # ~chi_10
   1000023    -8.18546038E+02   # ~chi_20
   1000025     1.10115883E+03   # ~chi_30
   1000035     3.60052690E+03   # ~chi_40
   1000024     8.09066529E+02   # ~chi_1+
   1000037     1.10141905E+03   # ~chi_2+
#
BLOCK NMIX  # Neutralino Mixing Matrix
  1  1    -1.06172624E-02   # N_11
  1  2     1.78762600E-01   # N_12
  1  3     7.00351753E-01   # N_13
  1  4     6.90969340E-01   # N_14
  2  1    -7.56854810E-03   # N_21
  2  2     3.04628695E-02   # N_22
  2  3    -7.05963611E-01   # N_23
  2  4     7.07552196E-01   # N_24
  3  1     2.58567446E-03   # N_31
  3  2     9.83420447E-01   # N_32
  3  3    -1.05438160E-01   # N_33
  3  4    -1.47513843E-01   # N_34
  4  1     9.99911649E-01   # N_41
  4  2    -4.14312624E-04   # N_42
  4  3     2.36553653E-03   # N_43
  4  4     1.30739235E-02   # N_44
#
BLOCK UMIX  # Chargino Mixing Matrix U
  1  1     1.50387470E-01   # U_11
  1  2     9.88627133E-01   # U_12
  2  1    -9.88627133E-01   # U_21
  2  2     1.50387470E-01   # U_22
#
BLOCK VMIX  # Chargino Mixing Matrix V
  1  1     2.10265906E-01   # V_11
  1  2    -9.77644234E-01   # V_12
  2  1    -9.77644234E-01   # V_21
  2  2    -2.10265906E-01   # V_22
#
BLOCK STOPMIX  # Stop Mixing Matrix
  1  1     4.03096293E-02   # cos(theta_t)
  1  2     9.99187237E-01   # sin(theta_t)
  2  1    -9.99187237E-01   # -sin(theta_t)
  2  2     4.03096293E-02   # cos(theta_t)
#
BLOCK SBOTMIX  # Sbottom Mixing Matrix
  1  1    -1.80244067E-03   # cos(theta_b)
  1  2     9.99998376E-01   # sin(theta_b)
  2  1    -9.99998376E-01   # -sin(theta_b)
  2  2    -1.80244067E-03   # cos(theta_b)
#
BLOCK STAUMIX  # Stau Mixing Matrix
  1  1     9.94161791E-01   # cos(theta_tau)
  1  2    -1.07899645E-01   # sin(theta_tau)
  2  1     1.07899645E-01   # -sin(theta_tau)
  2  2     9.94161791E-01   # cos(theta_tau)
#
BLOCK ALPHA  # Higgs mixing
          -5.23883753E-02   # Mixing angle in the neutral Higgs boson sector
#
BLOCK HMIX Q=  2.76440000E+03  # DRbar Higgs Parameters
         1    -8.02052079E+02   # mu(Q)MSSM           
         2     1.91203855E+01   # tan                 
         3     2.42268705E+02   # higgs               
         4     8.97090847E+06   # mA^2(Q)MSSM         
#
BLOCK GAUGE Q=  2.76440000E+03  # The gauge couplings
     1     3.64872892E-01   # gprime(Q) DRbar
     2     6.39416910E-01   # g(Q) DRbar
     3     1.03412841E+00   # g3(Q) DRbar
#
BLOCK AU Q=  2.76440000E+03  # The trilinear couplings
  1  1     0.00000000E+00   # A_u(Q) DRbar
  2  2     0.00000000E+00   # A_c(Q) DRbar
  3  3    -3.42719999E+03   # A_t(Q) DRbar
#
BLOCK AD Q=  2.76440000E+03  # The trilinear couplings
  1  1     0.00000000E+00   # A_d(Q) DRbar
  2  2     0.00000000E+00   # A_s(Q) DRbar
  3  3    -3.59167000E+03   # A_b(Q) DRbar
#
BLOCK AE Q=  2.76440000E+03  # The trilinear couplings
  1  1     0.00000000E+00   # A_e(Q) DRbar
  2  2     0.00000000E+00   # A_mu(Q) DRbar
  3  3     3.67492000E+03   # A_tau(Q) DRbar
#
BLOCK Yu Q=  2.76440000E+03  # The Yukawa couplings
  1  1     0.00000000E+00   # y_u(Q) DRbar
  2  2     0.00000000E+00   # y_c(Q) DRbar
  3  3     8.24097577E-01   # y_t(Q) DRbar
#
BLOCK Yd Q=  2.76440000E+03  # The Yukawa couplings
  1  1     0.00000000E+00   # y_d(Q) DRbar
  2  2     0.00000000E+00   # y_s(Q) DRbar
  3  3     2.57043938E-01   # y_b(Q) DRbar
#
BLOCK Ye Q=  2.76440000E+03  # The Yukawa couplings
  1  1     0.00000000E+00   # y_e(Q) DRbar
  2  2     0.00000000E+00   # y_mu(Q) DRbar
  3  3     1.92249049E-01   # y_tau(Q) DRbar
#
BLOCK MSOFT Q=  2.76440000E+03  # The soft SUSY breaking masses at the scale Q
         1     3.64562000E+03   # M_1(Q)              
         2     1.06114000E+03   # M_2(Q)              
         3     9.51610000E+02   # M_3(Q)              
        21     8.77464642E+06   # mH1^2(Q)            
        22    -5.58848200E+05   # mH2^2(Q)            
        31     1.89734000E+03   # meL(Q)              
        32     1.89734000E+03   # mmuL(Q)             
        33     2.06524000E+03   # mtauL(Q)            
        34     3.54770000E+03   # meR(Q)              
        35     3.54770000E+03   # mmuR(Q)             
        36     2.13032000E+03   # mtauR(Q)            
        41     1.47221000E+03   # mqL1(Q)             
        42     1.47221000E+03   # mqL2(Q)             
        43     3.98328000E+03   # mqL3(Q)             
        44     3.24574000E+03   # muR(Q)              
        45     3.24574000E+03   # mcR(Q)              
        46     1.91634999E+03   # mtR(Q)              
        47     9.64949997E+02   # mdR(Q)              
        48     9.64949997E+02   # msR(Q)              
        49     1.16607000E+03   # mbR(Q)              
#
Block HiggsBoundsInputHiggsCouplingsFermions
# ScalarNormEffCoupSq PseudoSNormEffCoupSq NP   IP1 IP2 IP2
    1.00519914E+00    0.00000000E+00        3  25   5   5  # h0-b-b eff. coupling^2, normalised to SM
    3.65583943E+02    0.00000000E+00        3  35   5   5  # H0-b-b eff. coupling^2, normalised to SM
    0.00000000E+00    3.65589142E+02        3  36   5   5  # A0-b-b eff. coupling^2, normalised to SM
#
    9.99985779E-01    0.00000000E+00        3  25   6   6  # h0-t-t eff. coupling^2, normalised to SM
    2.74953226E-03    0.00000000E+00        3  35   6   6  # H0-t-t eff. coupling^2, normalised to SM
    0.00000000E+00    2.73531100E-03        3  36   6   6  # A0-t-t eff. coupling^2, normalised to SM
#
    1.00519914E+00    0.00000000E+00        3  25  15  15  # h0-tau-tau eff. coupling^2, normalised to SM
    3.65583943E+02    0.00000000E+00        3  35  15  15  # H0-tau-tau eff. coupling^2, normalised to SM
    0.00000000E+00    3.65589142E+02        3  36  15  15  # A0-tau-tau eff. coupling^2, normalised to SM
#
Block HiggsBoundsInputHiggsCouplingsBosons
    9.99999982E-01        3  25  24  24  # h0-W-W eff. coupling^2, normalised to SM
    1.84368101E-08        3  35  24  24  # H0-W-W eff. coupling^2, normalised to SM
    0.00000000E+00        3  36  24  24  # A0-W-W eff. coupling^2, normalised to SM
#
    9.99999982E-01        3  25  23  23  # h0-Z-Z eff. coupling^2, normalised to SM
    1.84368101E-08        3  35  23  23  # H0-Z-Z eff. coupling^2, normalised to SM
    0.00000000E+00        3  36  23  23  # A0-Z-Z eff. coupling^2, normalised to SM
#
    8.92616705E-01        3  25  21  21  # h0-g-g eff. coupling^2, normalised to SM
    6.02378849E-15        3  35  21  21  # H0-g-g eff. coupling^2, normalised to SM
    1.02096034E-12        3  36  21  21  # A0-g-g eff. coupling^2, normalised to SM
#
    0.00000000E+00        3  25  25  23  # h0-h0-Z eff. coupling^2, normalised to SM
    0.00000000E+00        3  35  25  23  # H0-h0-Z eff. coupling^2, normalised to SM
    1.84368101E-08        3  36  25  23  # A0-h0-Z eff. coupling^2, normalised to SM
    0.00000000E+00        3  35  35  23  # H0-H0-Z eff. coupling^2, normalised to SM
    9.99999982E-01        3  36  35  23  # A0-H0-Z eff. coupling^2, normalised to SM
    0.00000000E+00        3  36  36  23  # A0-A0-Z eff. coupling^2, normalised to SM
#
    0.00000000E+00        4  25  21  21  23  # h0-g-g-Z eff. coupling^2, normalised to SM
    0.00000000E+00        4  35  21  21  23  # H0-g-g-Z eff. coupling^2, normalised to SM
    0.00000000E+00        4  36  21  21  23  # A0-g-g-Z eff. coupling^2, normalised to SM
#
#
#
#                             =================
#                             |The decay table|
#                             =================
#
# - The QCD corrections to the decays gluino -> squark  + quark
#                                     squark -> gaugino + quark_prime
#                                     squark -> squark_prime + Higgs
#                                     squark -> gluino  + quark
#   are included.
#
# - The multi-body decays for the inos, stops and sbottoms are included.
#
# - The loop induced decays for the gluino, neutralinos and stops
#   are included.
#
# - The SUSY decays of the top quark are included.
#
#
#         PDG            Width
DECAY         6     1.44010713E+00   # top decays
#          BR         NDA      ID1       ID2
     1.00000000E+00    2           5        24   # BR(t ->  b    W+)
#
#         PDG            Width
DECAY   1000021     7.77334702E-01   # gluino decays
#          BR         NDA      ID1       ID2
     2.50000000E-01    2     2000001        -1   # BR(~g -> ~d_R  db)
     2.50000000E-01    2    -2000001         1   # BR(~g -> ~d_R* d )
     2.50000000E-01    2     2000003        -3   # BR(~g -> ~s_R  sb)
     2.50000000E-01    2    -2000003         3   # BR(~g -> ~s_R* s )
#
#         PDG            Width
DECAY   1000006     8.06708413E+01   # stop1 decays
#          BR         NDA      ID1       ID2
     1.01673353E-01    2     1000022         6   # BR(~t_1 -> ~chi_10 t )
     1.06009336E-01    2     1000023         6   # BR(~t_1 -> ~chi_20 t )
     2.16209235E-03    2     1000025         6   # BR(~t_1 -> ~chi_30 t )
     2.09848256E-01    2     1000024         5   # BR(~t_1 -> ~chi_1+ b )
     4.64613942E-03    2     1000037         5   # BR(~t_1 -> ~chi_2+ b )
     5.75660763E-01    2     1000021         6   # BR(~t_1 -> ~g      t )
     5.92197723E-08    2     1000005        24   # BR(~t_1 -> ~b_1    W+)
#
#         PDG            Width
DECAY   2000006     3.18486848E+02   # stop2 decays
#          BR         NDA      ID1       ID2
     7.46792811E-02    2     1000022         6   # BR(~t_2 -> ~chi_10 t )
     7.76000715E-02    2     1000023         6   # BR(~t_2 -> ~chi_20 t )
     4.67224996E-02    2     1000025         6   # BR(~t_2 -> ~chi_30 t )
     5.07111467E-05    2     1000035         6   # BR(~t_2 -> ~chi_40 t )
     1.72335049E-02    2     1000024         5   # BR(~t_2 -> ~chi_1+ b )
     8.55827293E-02    2     1000037         5   # BR(~t_2 -> ~chi_2+ b )
     6.03125370E-01    2     1000021         6   # BR(~t_2 -> ~g      t )
     4.62779786E-02    2     1000006        25   # BR(~t_2 -> ~t_1    h )
     4.84214461E-02    2     1000006        23   # BR(~t_2 -> ~t_1    Z )
     3.06407255E-04    2     1000005        24   # BR(~t_2 -> ~b_1    W+)
#
#         PDG            Width
DECAY   1000005     2.90747196E+00   # sbottom1 decays
#          BR         NDA      ID1       ID2
     8.68535173E-02    2     1000022         5   # BR(~b_1 -> ~chi_10 b )
     8.40621572E-02    2     1000023         5   # BR(~b_1 -> ~chi_20 b )
     2.08787732E-04    2     1000025         5   # BR(~b_1 -> ~chi_30 b )
     1.48975806E-01    2    -1000024         6   # BR(~b_1 -> ~chi_1- t )
     6.79899732E-01    2     1000021         5   # BR(~b_1 -> ~g      b )
#
#         PDG            Width
DECAY   2000005     3.19057583E+02   # sbottom2 decays
#          BR         NDA      ID1       ID2
     8.96487537E-03    2     1000022         5   # BR(~b_2 -> ~chi_10 b )
     7.59130373E-03    2     1000023         5   # BR(~b_2 -> ~chi_20 b )
     4.22466961E-02    2     1000025         5   # BR(~b_2 -> ~chi_30 b )
     6.68538752E-05    2     1000035         5   # BR(~b_2 -> ~chi_40 b )
     1.49785951E-01    2    -1000024         6   # BR(~b_2 -> ~chi_1- t )
     9.23577180E-02    2    -1000037         6   # BR(~b_2 -> ~chi_2- t )
     6.05089830E-01    2     1000021         5   # BR(~b_2 -> ~g      b )
     1.74965944E-04    2     1000005        25   # BR(~b_2 -> ~b_1    h )
     1.57099264E-04    2     1000005        23   # BR(~b_2 -> ~b_1    Z )
     9.35647066E-02    2     1000006       -24   # BR(~b_2 -> ~t_1    W-)
#
#         PDG            Width
DECAY   1000002     2.98062982E+01   # sup_L decays
#          BR         NDA      ID1       ID2
     3.25116548E-03    2     1000022         2   # BR(~u_L -> ~chi_10 u)
     8.56730428E-05    2     1000023         2   # BR(~u_L -> ~chi_20 u)
     4.50358712E-02    2     1000025         2   # BR(~u_L -> ~chi_30 u)
     9.15949152E-03    2     1000024         1   # BR(~u_L -> ~chi_1+ d)
     8.88377708E-02    2     1000037         1   # BR(~u_L -> ~chi_2+ d)
     8.53630028E-01    2     1000021         2   # BR(~u_L -> ~g      u)
#
#         PDG            Width
DECAY   2000002     1.97452348E+02   # sup_R decays
#          BR         NDA      ID1       ID2
     3.77203077E-06    2     1000022         2   # BR(~u_R -> ~chi_10 u)
     1.90945125E-06    2     1000023         2   # BR(~u_R -> ~chi_20 u)
     1.99586293E-07    2     1000025         2   # BR(~u_R -> ~chi_30 u)
     9.99994119E-01    2     1000021         2   # BR(~u_R -> ~g      u)
#
#         PDG            Width
DECAY   1000001     2.99374706E+01   # sdown_L decays
#          BR         NDA      ID1       ID2
     3.39721019E-03    2     1000022         1   # BR(~d_L -> ~chi_10 d)
     1.03393381E-04    2     1000023         1   # BR(~d_L -> ~chi_20 d)
     4.50409721E-02    2     1000025         1   # BR(~d_L -> ~chi_30 d)
     4.67973340E-03    2    -1000024         2   # BR(~d_L -> ~chi_1- u)
     9.10376904E-02    2    -1000037         2   # BR(~d_L -> ~chi_2- u)
     8.55741000E-01    2     1000021         1   # BR(~d_L -> ~g      d)
#
#         PDG            Width
DECAY   2000001     1.57432127E-05   # sdown_R decays
#           BR         NDA      ID1       ID2
     6.82430735E-01    2     1000022         1   # BR(~d_R -> ~chi_10 d)
     3.16374834E-01    2     1000023         1   # BR(~d_R -> ~chi_20 d)
#           BR         NDA      ID1       ID2       ID3
     8.54272904E-05    3        1       23        1000022   # BR(~d_R -> d  Z  ~chi_10)
     9.02103039E-05    3        1       25        1000022   # BR(~d_R -> d  h  ~chi_10)
     9.76357261E-05    3        1       23        1000023   # BR(~d_R -> d  Z  ~chi_20)
     4.55478824E-05    3        1       25        1000023   # BR(~d_R -> d  h  ~chi_20)
     3.66449982E-05    3        1       -24        1000024   # BR(~d_R -> d  W-  ~chi_1+)
     8.38964719E-04    3        1       24        -1000024   # BR(~d_R -> d  W+  ~chi_1-)
#
#         PDG            Width
DECAY   1000004     2.32476670E+01   # scharm_L decays
#          BR         NDA      ID1       ID2
     4.32792725E-03    2     1000022         4   # BR(~c_L -> ~chi_10 c)
     1.14015570E-04    2     1000023         4   # BR(~c_L -> ~chi_20 c)
     5.92949516E-02    2     1000025         4   # BR(~c_L -> ~chi_30 c)
     1.21924013E-02    2     1000024         3   # BR(~c_L -> ~chi_1+ s)
     1.16964471E-01    2     1000037         3   # BR(~c_L -> ~chi_2+ s)
     8.07106234E-01    2     1000021         4   # BR(~c_L -> ~g      c)
#
#         PDG            Width
DECAY   2000004     1.45612928E+02   # scharm_R decays
#          BR         NDA      ID1       ID2
     5.27886940E-06    2     1000022         4   # BR(~c_R -> ~chi_10 c)
     2.67221046E-06    2     1000023         4   # BR(~c_R -> ~chi_20 c)
     2.79261138E-07    2     1000025         4   # BR(~c_R -> ~chi_30 c)
     9.99991770E-01    2     1000021         4   # BR(~c_R -> ~g      c)
#
#         PDG            Width
DECAY   1000003     2.33306593E+01   # sstrange_L decays
#          BR         NDA      ID1       ID2
     4.52607513E-03    2     1000022         3   # BR(~s_L -> ~chi_10 s)
     1.37712007E-04    2     1000023         3   # BR(~s_L -> ~chi_20 s)
     5.93549260E-02    2     1000025         3   # BR(~s_L -> ~chi_30 s)
     6.23440020E-03    2    -1000024         4   # BR(~s_L -> ~chi_1- c)
     1.19966615E-01    2    -1000037         4   # BR(~s_L -> ~chi_2- c)
     8.09780272E-01    2     1000021         3   # BR(~s_L -> ~g      s)
#
#         PDG            Width
DECAY   2000003     1.58105220E-05   # sstrange_R decays
#           BR         NDA      ID1       ID2
     6.82758551E-01    2     1000022         3   # BR(~s_R -> ~chi_10 s)
     3.16053073E-01    2     1000023         3   # BR(~s_R -> ~chi_20 s)
#           BR         NDA      ID1       ID2       ID3
     8.50952295E-05    3        3       23        1000022   # BR(~s_R -> s  Z  ~chi_10)
     8.96048845E-05    3        3       25        1000022   # BR(~s_R -> s  h  ~chi_10)
     9.73528893E-05    3        3       23        1000023   # BR(~s_R -> s  Z  ~chi_20)
     4.52255782E-05    3        3       25        1000023   # BR(~s_R -> s  h  ~chi_20)
     3.64636917E-05    3        3       -24        1000024   # BR(~s_R -> s  W-  ~chi_1+)
     8.34634048E-04    3        3       24        -1000024   # BR(~s_R -> s  W+  ~chi_1-)
#
#         PDG            Width
DECAY   1000011     1.04514057E+01   # selectron_L decays
#          BR         NDA      ID1       ID2
     1.49048949E-02    2     1000022        11   # BR(~e_L -> ~chi_10 e-)
     3.37123216E-04    2     1000023        11   # BR(~e_L -> ~chi_20 e-)
     3.19224394E-01    2     1000025        11   # BR(~e_L -> ~chi_30 e-)
     2.25429402E-02    2    -1000024        12   # BR(~e_L -> ~chi_1- nu_e)
     6.42990648E-01    2    -1000037        12   # BR(~e_L -> ~chi_2- nu_e)
#
#         PDG            Width
DECAY   2000011     3.51862571E-02   # selectron_R decays
#           BR         NDA      ID1       ID2
     5.43701222E-02    2     1000022        11   # BR(~e_R -> ~chi_10 e-)
     2.75394576E-02    2     1000023        11   # BR(~e_R -> ~chi_20 e-)
#           BR         NDA      ID1       ID2       ID3
     9.12003794E-03    3        11       -1        1000001   # BR(~e_R- -> e-  db  ~d_L)
     5.91623028E-03    3        11       1        -1000001   # BR(~e_R- -> e-  d  ~d_L*)
     3.63266827E-02    3        11       -1        2000001   # BR(~e_R- -> e-  db  ~d_R)
     6.34452250E-02    3        11       1        -2000001   # BR(~e_R- -> e-  d  ~d_R*)
     9.04785066E-03    3        11       -2        1000002   # BR(~e_R- -> e-  ub  ~u_L)
     5.84517981E-03    3        11       2        -1000002   # BR(~e_R- -> e-  u  ~u_L*)
     2.01220607E-04    3        11       -2        2000002   # BR(~e_R- -> e-  ub  ~u_R)
     2.13239503E-04    3        11       2        -2000002   # BR(~e_R- -> e-  u  ~u_R*)
     9.15812099E-03    3        11       -3        1000003   # BR(~e_R- -> e-  sb  ~s_L)
     5.94521887E-03    3        11       3        -1000003   # BR(~e_R- -> e-  s  ~s_L*)
     3.60367968E-02    3        11       -3        2000003   # BR(~e_R- -> e-  sb  ~s_R)
     6.47156073E-02    3        11       3        -2000003   # BR(~e_R- -> e-  s  ~s_R*)
     9.04586125E-03    3        11       -4        1000004   # BR(~e_R- -> e-  cb  ~c_L)
     5.85143226E-03    3        11       4        -1000004   # BR(~e_R- -> e-  c  ~c_L*)
     1.95249525E-04    3        11       -4        2000004   # BR(~e_R- -> e-  cb  ~c_R)
     2.14833876E-04    3        11       4        -2000004   # BR(~e_R- -> e-  c  ~c_R*)
     3.12877836E-02    3        11       -5        1000005   # BR(~e_R- -> e-  bb  ~b_1)
     5.19549434E-02    3        11       5        -1000005   # BR(~e_R- -> e-  b  ~b_1*)
     5.33844788E-02    3        11       -6        1000006   # BR(~e_R- -> e-  tb  ~t_1)
     7.61177862E-02    3        11       6        -1000006   # BR(~e_R- -> e-  t  ~t_1*)
     1.50371208E-02    3        11       -11        1000011   # BR(~e_R- -> e-  e+  ~e_L-)
     1.06416548E-02    3        11       11        -1000011   # BR(~e_R- -> e-  e-  ~e_L+)
     1.53500271E-02    3        11       -12        1000012   # BR(~e_R- -> e-  nu_eb  ~nu_eL)
     1.07297573E-02    3        11       12        -1000012   # BR(~e_R- -> e-  nu_e  ~nu_eL*)
     1.51024873E-02    3        11       -13        1000013   # BR(~e_R- -> e-  mu+  ~mu_L-)
     1.06652435E-02    3        11       13        -1000013   # BR(~e_R- -> e-  mu-  ~mu_L+)
     1.54213617E-02    3        11       -14        1000014   # BR(~e_R- -> e-  nu_mub  ~nu_muL)
     1.08187125E-02    3        11       14        -1000014   # BR(~e_R- -> e-  nu_mu  ~nu_muL*)
     1.13828532E-02    3        11       -15        1000015   # BR(~e_R- -> e-  tau+  ~tau_1-)
     8.49053080E-03    3        11       15        -1000015   # BR(~e_R- -> e-  tau-  ~tau_1+)
     2.85281835E-02    3        11       -15        2000015   # BR(~e_R- -> e-  tau+  ~tau_2-)
     3.80603141E-02    3        11       15        -2000015   # BR(~e_R- -> e-  tau-  ~tau_2+)
     1.12109111E-02    3        11       -16        1000016   # BR(~e_R- -> e-  nu_taub  ~nu_tau1)
     8.09037457E-03    3        11       16        -1000016   # BR(~e_R- -> e-  nu_tau  ~nu_tau1*)
     1.52735768E-02    3        11       23        1000022   # BR(~e_R- -> e-  Z  ~chi_10)
     3.73384414E-02    3        11       25        1000022   # BR(~e_R- -> e-  h  ~chi_10)
     4.38750843E-02    3        11       23        1000023   # BR(~e_R- -> e-  Z  ~chi_20)
     1.48418742E-02    3        11       25        1000023   # BR(~e_R- -> e-  h  ~chi_20)
     5.64623851E-04    3        11       23        1000025   # BR(~e_R- -> e-  Z  ~chi_30)
     2.81717944E-03    3        11       25        1000025   # BR(~e_R- -> e-  h  ~chi_30)
     3.62613163E-02    3        11       -24        1000024   # BR(~e_R- -> e-  W-  ~chi_1+)
     7.62485191E-02    3        11       24        -1000024   # BR(~e_R- -> e-  W+  ~chi_1-)
     2.95399421E-03    3        11       -24        1000037   # BR(~e_R- -> e-  W-  ~chi_2+)
     4.36249867E-03    3        11       24        -1000037   # BR(~e_R- -> e-  W+  ~chi_2-)
#
#         PDG            Width
DECAY   1000013     1.04514056E+01   # smuon_L decays
#          BR         NDA      ID1       ID2
     1.49048948E-02    2     1000022        13   # BR(~mu_L -> ~chi_10 mu-)
     3.37123214E-04    2     1000023        13   # BR(~mu_L -> ~chi_20 mu-)
     3.19224391E-01    2     1000025        13   # BR(~mu_L -> ~chi_30 mu-)
     2.25429403E-02    2    -1000024        14   # BR(~mu_L -> ~chi_1- nu_mu)
     6.42990651E-01    2    -1000037        14   # BR(~mu_L -> ~chi_2- nu_mu)
#
#         PDG            Width
DECAY   2000013     3.51799962E-02   # smuon_R decays
#           BR         NDA      ID1       ID2
     5.43797980E-02    2     1000022        13   # BR(~mu_R -> ~chi_10 mu-)
     2.75443587E-02    2     1000023        13   # BR(~mu_R -> ~chi_20 mu-)
#           BR         NDA      ID1       ID2       ID3
     9.11114370E-03    3        13       -1        1000001   # BR(~mu_R- -> mu-  db  ~d_L)
     5.91927295E-03    3        13       1        -1000001   # BR(~mu_R- -> mu-  d  ~d_L*)
     3.62819823E-02    3        13       -1        2000001   # BR(~mu_R- -> mu-  db  ~d_R)
     6.33627129E-02    3        13       1        -2000001   # BR(~mu_R- -> mu-  d  ~d_R*)
     9.04946089E-03    3        13       -2        1000002   # BR(~mu_R- -> mu-  ub  ~u_L)
     5.84224053E-03    3        13       2        -1000002   # BR(~mu_R- -> mu-  u  ~u_L*)
     1.99312130E-04    3        13       -2        2000002   # BR(~mu_R- -> mu-  ub  ~u_R)
     2.13101217E-04    3        13       2        -2000002   # BR(~mu_R- -> mu-  u  ~u_R*)
     9.16884692E-03    3        13       -3        1000003   # BR(~mu_R- -> mu-  sb  ~s_L)
     5.96390058E-03    3        13       3        -1000003   # BR(~mu_R- -> mu-  s  ~s_L*)
     3.61284860E-02    3        13       -3        2000003   # BR(~mu_R- -> mu-  sb  ~s_R)
     6.47470223E-02    3        13       3        -2000003   # BR(~mu_R- -> mu-  s  ~s_R*)
     9.05201916E-03    3        13       -4        1000004   # BR(~mu_R- -> mu-  cb  ~c_L)
     5.85247362E-03    3        13       4        -1000004   # BR(~mu_R- -> mu-  c  ~c_L*)
     1.98965343E-04    3        13       -4        2000004   # BR(~mu_R- -> mu-  cb  ~c_R)
     2.14167164E-04    3        13       4        -2000004   # BR(~mu_R- -> mu-  c  ~c_R*)
     3.12166037E-02    3        13       -5        1000005   # BR(~mu_R- -> mu-  bb  ~b_1)
     5.19187094E-02    3        13       5        -1000005   # BR(~mu_R- -> mu-  b  ~b_1*)
     5.33598693E-02    3        13       -6        1000006   # BR(~mu_R- -> mu-  tb  ~t_1)
     7.60062617E-02    3        13       6        -1000006   # BR(~mu_R- -> mu-  t  ~t_1*)
     1.51046065E-02    3        13       -11        1000011   # BR(~mu_R- -> mu-  e+  ~e_L-)
     1.06745322E-02    3        13       11        -1000011   # BR(~mu_R- -> mu-  e-  ~e_L+)
     1.54408772E-02    3        13       -12        1000012   # BR(~mu_R- -> mu-  nu_eb  ~nu_eL)
     1.07458795E-02    3        13       12        -1000012   # BR(~mu_R- -> mu-  nu_e  ~nu_eL*)
     1.51560562E-02    3        13       -13        1000013   # BR(~mu_R- -> mu-  mu+  ~mu_L-)
     1.05758966E-02    3        13       13        -1000013   # BR(~mu_R- -> mu-  mu-  ~mu_L+)
     1.54408772E-02    3        13       -14        1000014   # BR(~mu_R- -> mu-  nu_mub  ~nu_muL)
     1.08953963E-02    3        13       14        -1000014   # BR(~mu_R- -> mu-  nu_mu  ~nu_muL*)
     1.14391712E-02    3        13       -15        1000015   # BR(~mu_R- -> mu-  tau+  ~tau_1-)
     8.47242842E-03    3        13       15        -1000015   # BR(~mu_R- -> mu-  tau-  ~tau_1+)
     2.83922714E-02    3        13       -15        2000015   # BR(~mu_R- -> mu-  tau+  ~tau_2-)
     3.79931820E-02    3        13       15        -2000015   # BR(~mu_R- -> mu-  tau-  ~tau_2+)
     1.12262662E-02    3        13       -16        1000016   # BR(~mu_R- -> mu-  nu_taub  ~nu_tau1)
     8.07845453E-03    3        13       16        -1000016   # BR(~mu_R- -> mu-  nu_tau  ~nu_tau1*)
     1.52745895E-02    3        13       23        1000022   # BR(~mu_R- -> mu-  Z  ~chi_10)
     3.73990944E-02    3        13       25        1000022   # BR(~mu_R- -> mu-  h  ~chi_10)
     4.38743651E-02    3        13       23        1000023   # BR(~mu_R- -> mu-  Z  ~chi_20)
     1.48396833E-02    3        13       25        1000023   # BR(~mu_R- -> mu-  h  ~chi_20)
     5.64383233E-04    3        13       23        1000025   # BR(~mu_R- -> mu-  Z  ~chi_30)
     2.82083601E-03    3        13       25        1000025   # BR(~mu_R- -> mu-  h  ~chi_30)
     3.62848248E-02    3        13       -24        1000024   # BR(~mu_R- -> mu-  W-  ~chi_1+)
     7.62564038E-02    3        13       24        -1000024   # BR(~mu_R- -> mu-  W+  ~chi_1-)
     2.95594119E-03    3        13       -24        1000037   # BR(~mu_R- -> mu-  W-  ~chi_2+)
     4.36327505E-03    3        13       24        -1000037   # BR(~mu_R- -> mu-  W+  ~chi_2-)
#
#         PDG            Width
DECAY   1000015     1.41230388E+01   # stau_1 decays
#          BR         NDA      ID1       ID2
     5.58107155E-02    2     1000022        15   # BR(~tau_1 -> ~chi_10  tau-)
     3.75877682E-02    2     1000023        15   # BR(~tau_1 -> ~chi_20  tau-)
     2.91786148E-01    2     1000025        15   # BR(~tau_1 -> ~chi_30  tau-)
     2.82345639E-02    2    -1000024        16   # BR(~tau_1 -> ~chi_1-  nu_tau)
     5.86580805E-01    2    -1000037        16   # BR(~tau_1 -> ~chi_2-  nu_tau)
#
#         PDG            Width
DECAY   2000015     2.41057243E+00   # stau_2 decays
#          BR         NDA      ID1       ID2
     2.06218213E-01    2     1000022        15   # BR(~tau_2 -> ~chi_10  tau-)
     2.44025682E-01    2     1000023        15   # BR(~tau_2 -> ~chi_20  tau-)
     4.46164378E-02    2     1000025        15   # BR(~tau_2 -> ~chi_30  tau-)
     4.15019042E-01    2    -1000024        16   # BR(~tau_2 -> ~chi_1-  nu_tau)
     9.01206249E-02    2    -1000037        16   # BR(~tau_2 -> ~chi_2-  nu_tau)
#
#         PDG            Width
DECAY   1000012     1.05014798E+01   # snu_eL decays
#          BR         NDA      ID1       ID2
     1.69556627E-02    2     1000022        12   # BR(~nu_eL -> ~chi_10 nu_e)
     5.92679959E-04    2     1000023        12   # BR(~nu_eL -> ~chi_20 nu_e)
     3.14826126E-01    2     1000025        12   # BR(~nu_eL -> ~chi_30 nu_e)
     4.37733131E-02    2     1000024        11   # BR(~nu_eL -> ~chi_1+ e-)
     6.23852218E-01    2     1000037        11   # BR(~nu_eL -> ~chi_2+ e-)
#
#         PDG            Width
DECAY   1000014     1.05014797E+01   # snu_muL decays
#          BR         NDA      ID1       ID2
     1.69556629E-02    2     1000022        14   # BR(~nu_muL -> ~chi_10 nu_mu)
     5.92679964E-04    2     1000023        14   # BR(~nu_muL -> ~chi_20 nu_mu)
     3.14826129E-01    2     1000025        14   # BR(~nu_muL -> ~chi_30 nu_mu)
     4.37733131E-02    2     1000024        13   # BR(~nu_muL -> ~chi_1+ mu-)
     6.23852215E-01    2     1000037        13   # BR(~nu_muL -> ~chi_2+ mu-)
#
#         PDG            Width
DECAY   1000016     1.42753497E+01   # snu_tauL decays
#          BR         NDA      ID1       ID2
     1.44899302E-02    2     1000022        16   # BR(~nu_tauL -> ~chi_10 nu_tau)
     5.07701277E-04    2     1000023        16   # BR(~nu_tauL -> ~chi_20 nu_tau)
     2.92285446E-01    2     1000025        16   # BR(~nu_tauL -> ~chi_30 nu_tau)
     1.12302588E-01    2     1000024        15   # BR(~nu_tauL -> ~chi_1+ tau-)
     5.80414335E-01    2     1000037        15   # BR(~nu_tauL -> ~chi_2+ tau-)
#
#         PDG            Width
DECAY   1000024     1.07131839E-10   # chargino1+ decays
#           BR         NDA      ID1       ID2       ID3
     3.72444343E-01    3     1000022         2        -1   # BR(~chi_1+ -> ~chi_10 u    db)
     3.72444343E-01    3     1000022         4        -3   # BR(~chi_1+ -> ~chi_10 c    sb)
     1.24135240E-01    3     1000022       -11        12   # BR(~chi_1+ -> ~chi_10 e+   nu_e)
     1.24135240E-01    3     1000022       -13        14   # BR(~chi_1+ -> ~chi_10 mu+  nu_mu)
     6.84083417E-03    3     1000022       -15        16   # BR(~chi_1+ -> ~chi_10 tau+ nu_tau)
#
#         PDG            Width
DECAY   1000037     4.60344276E+00   # chargino2+ decays
#          BR         NDA      ID1       ID2
     2.56341487E-01    2     1000024        23   # BR(~chi_2+ -> ~chi_1+  Z )
     2.56200497E-01    2     1000022        24   # BR(~chi_2+ -> ~chi_10  W+)
     2.44302614E-01    2     1000023        24   # BR(~chi_2+ -> ~chi_20  W+)
     2.43155402E-01    2     1000024        25   # BR(~chi_2+ -> ~chi_1+  h )
#
#         PDG            Width
DECAY   1000022     0.00000000E+00   # neutralino1 decays
#
#         PDG            Width
DECAY   1000023     4.54158363E-07   # neutralino2 decays
#          BR         NDA      ID1       ID2
     1.59356930E-01    2     1000022        22   # BR(~chi_20 -> ~chi_10 gam)
#           BR         NDA      ID1       ID2       ID3
     6.15735762E-02    3     1000022        -2         2   # BR(~chi_20 -> ~chi_10 ub      u)
     7.99020217E-02    3     1000022        -1         1   # BR(~chi_20 -> ~chi_10 db      d)
     6.15735762E-02    3     1000022        -4         4   # BR(~chi_20 -> ~chi_10 cb      c)
     7.99020217E-02    3     1000022        -3         3   # BR(~chi_20 -> ~chi_10 sb      s)
     9.82362716E-03    3     1000022        -5         5   # BR(~chi_20 -> ~chi_10 bb      b)
     1.83461788E-02    3     1000022       -11        11   # BR(~chi_20 -> ~chi_10 e+      e-)
     1.83461788E-02    3     1000022       -13        13   # BR(~chi_20 -> ~chi_10 mu+     mu-)
     1.61147389E-02    3     1000022       -15        15   # BR(~chi_20 -> ~chi_10 tau+    tau-)
     3.66829224E-02    3     1000022       -12        12   # BR(~chi_20 -> ~chi_10 nu_eb   nu_e)
     3.66829224E-02    3     1000022       -14        14   # BR(~chi_20 -> ~chi_10 nu_mub  nu_mu)
     3.66827385E-02    3     1000022       -16        16   # BR(~chi_20 -> ~chi_10 nu_taub nu_tau)
     6.53005031E-02    3     1000024        -2         1   # BR(~chi_20 -> ~chi_1+ ub      d)
     6.53005031E-02    3    -1000024        -1         2   # BR(~chi_20 -> ~chi_1- db      u)
     6.53005031E-02    3     1000024        -4         3   # BR(~chi_20 -> ~chi_1+ cb      s)
     6.53005031E-02    3    -1000024        -3         4   # BR(~chi_20 -> ~chi_1- sb      c)
     2.17668765E-02    3     1000024       -12        11   # BR(~chi_20 -> ~chi_1+ nu_eb   e-)
     2.17668765E-02    3    -1000024        12       -11   # BR(~chi_20 -> ~chi_1- nu_e    e+)
     2.17668765E-02    3     1000024       -14        13   # BR(~chi_20 -> ~chi_1+ nu_mub  mu-)
     2.17668765E-02    3    -1000024        14       -13   # BR(~chi_20 -> ~chi_1- nu_mu   mu+)
     1.83715245E-02    3     1000024       -16        15   # BR(~chi_20 -> ~chi_1+ nu_taub tau-)
     1.83715245E-02    3    -1000024        16       -15   # BR(~chi_20 -> ~chi_1- nu_tau  tau+)
#
#         PDG            Width
DECAY   1000025     4.60047303E+00   # neutralino3 decays
#          BR         NDA      ID1       ID2
     8.34174969E-03    2     1000022        23   # BR(~chi_30 -> ~chi_10   Z )
     2.29266688E-01    2     1000023        23   # BR(~chi_30 -> ~chi_20   Z )
     2.63214177E-01    2     1000024       -24   # BR(~chi_30 -> ~chi_1+   W-)
     2.63214177E-01    2    -1000024        24   # BR(~chi_30 -> ~chi_1-   W+)
     2.30540736E-01    2     1000022        25   # BR(~chi_30 -> ~chi_10   h )
     5.42239857E-03    2     1000023        25   # BR(~chi_30 -> ~chi_20   h )
     1.83242151E-08    2     2000001        -1   # BR(~chi_30 -> ~d_R      db)
     1.83242151E-08    2    -2000001         1   # BR(~chi_30 -> ~d_R*     d )
     1.83242151E-08    2     2000003        -3   # BR(~chi_30 -> ~s _R      sb)
     1.83242151E-08    2    -2000003         3   # BR(~chi_30 -> ~s _R*     s )
#
#         PDG            Width
DECAY   1000035     6.48875199E+01   # neutralino4 decays
#          BR         NDA      ID1       ID2
     1.08845696E-02    2     1000022        23   # BR(~chi_40 -> ~chi_10   Z )
     2.36942332E-02    2     1000023        23   # BR(~chi_40 -> ~chi_20   Z )
     4.90441199E-04    2     1000025        23   # BR(~chi_40 -> ~chi_30   Z )
     3.20239033E-02    2     1000024       -24   # BR(~chi_40 -> ~chi_1+   W-)
     3.20239033E-02    2    -1000024        24   # BR(~chi_40 -> ~chi_1-   W+)
     2.00642620E-03    2     1000037       -24   # BR(~chi_40 -> ~chi_2+   W-)
     2.00642620E-03    2    -1000037        24   # BR(~chi_40 -> ~chi_2-   W+)
     2.20125666E-02    2     1000022        25   # BR(~chi_40 -> ~chi_10   h )
     1.14509886E-02    2     1000023        25   # BR(~chi_40 -> ~chi_20   h )
     1.52642198E-03    2     1000025        25   # BR(~chi_40 -> ~chi_30   h )
     7.95762860E-03    2     1000002        -2   # BR(~chi_40 -> ~u_L      ub)
     7.95762860E-03    2    -1000002         2   # BR(~chi_40 -> ~u_L*     u )
     5.68056237E-03    2     2000002        -2   # BR(~chi_40 -> ~u_R      ub)
     5.68056237E-03    2    -2000002         2   # BR(~chi_40 -> ~u_R*     u )
     8.01863763E-03    2     1000001        -1   # BR(~chi_40 -> ~d_L      db)
     8.01863763E-03    2    -1000001         1   # BR(~chi_40 -> ~d_L*     d )
     3.99193799E-02    2     2000001        -1   # BR(~chi_40 -> ~d_R      db)
     3.99193799E-02    2    -2000001         1   # BR(~chi_40 -> ~d_R*     d )
     7.95762774E-03    2     1000004        -4   # BR(~chi_40 -> ~c_L      cb)
     7.95762774E-03    2    -1000004         4   # BR(~chi_40 -> ~c_L*     c )
     5.68049812E-03    2     2000004        -4   # BR(~chi_40 -> ~c_R      cb)
     5.68049812E-03    2    -2000004         4   # BR(~chi_40 -> ~c_R*     c )
     8.01863763E-03    2     1000003        -3   # BR(~chi_40 -> ~s _L      sb)
     8.01863763E-03    2    -1000003         3   # BR(~chi_40 -> ~s _L*     s )
     3.99193799E-02    2     2000003        -3   # BR(~chi_40 -> ~s _R      sb)
     3.99193799E-02    2    -2000003         3   # BR(~chi_40 -> ~s _R*     s )
     9.89500329E-02    2     1000006        -6   # BR(~chi_40 -> ~t_1      tb)
     9.89500329E-02    2    -1000006         6   # BR(~chi_40 -> ~t_1*     t )
     3.83241328E-02    2     1000005        -5   # BR(~chi_40 -> ~b_1      bb)
     3.83241328E-02    2    -1000005         5   # BR(~chi_40 -> ~b_1*     b )
     1.90069637E-02    2     1000011       -11   # BR(~chi_40 -> ~e_L-     e+)
     1.90069637E-02    2    -1000011        11   # BR(~chi_40 -> ~e_L+     e-)
     7.39157102E-05    2     2000011       -11   # BR(~chi_40 -> ~e_R-     e+)
     7.39157102E-05    2    -2000011        11   # BR(~chi_40 -> ~e_R+     e-)
     1.90069637E-02    2     1000013       -13   # BR(~chi_40 -> ~mu_L-    mu+)
     1.90069637E-02    2    -1000013        13   # BR(~chi_40 -> ~mu_L+    mu-)
     7.39157102E-05    2     2000013       -13   # BR(~chi_40 -> ~mu_R-    mu+)
     7.39157102E-05    2    -2000013        13   # BR(~chi_40 -> ~mu_R+    mu-)
     1.70069889E-02    2     1000015       -15   # BR(~chi_40 -> ~tau_1-   tau+)
     1.70069889E-02    2    -1000015        15   # BR(~chi_40 -> ~tau_1+   tau-)
     6.06686876E-02    2     2000015       -15   # BR(~chi_40 -> ~tau_2-   tau+)
     6.06686876E-02    2    -2000015        15   # BR(~chi_40 -> ~tau_2+   tau-)
     1.90927455E-02    2     1000012       -12   # BR(~chi_40 -> ~nu_eL    nu_eb)
     1.90927455E-02    2    -1000012        12   # BR(~chi_40 -> ~nu_eL*   nu_e )
     1.90927455E-02    2     1000014       -14   # BR(~chi_40 -> ~nu_muL   nu_mub)
     1.90927455E-02    2    -1000014        14   # BR(~chi_40 -> ~nu_muL*  nu_mu )
     1.64906159E-02    2     1000016       -16   # BR(~chi_40 -> ~nu_tau1  nu_taub)
     1.64906159E-02    2    -1000016        16   # BR(~chi_40 -> ~nu_tau1* nu_tau )
#
#         PDG            Width
DECAY        25     4.00714727E-03   # h decays
#          BR         NDA      ID1       ID2
     5.85540903E-01    2           5        -5   # BR(h -> b       bb     )
     6.50484497E-02    2         -15        15   # BR(h -> tau+    tau-   )
     2.30247237E-04    2         -13        13   # BR(h -> mu+     mu-    )
     2.51352826E-04    2           3        -3   # BR(h -> s       sb     )
     2.16799900E-02    2           4        -4   # BR(h -> c       cb     )
     8.02954808E-02    2          21        21   # BR(h -> g       g      )
     2.36925036E-03    2          22        22   # BR(h -> gam     gam    )
     1.59556192E-03    2          22        23   # BR(h -> Z       gam    )
     2.15936489E-01    2          24       -24   # BR(h -> W+      W-     )
     2.70522759E-02    2          23        23   # BR(h -> Z       Z      )
#
#         PDG            Width
DECAY        35     3.94322119E+01   # H decays
#          BR         NDA      ID1       ID2
     3.22020384E-01    2           5        -5   # BR(H -> b       bb     )
     6.08071225E-02    2         -15        15   # BR(H -> tau+    tau-   )
     2.15277659E-04    2         -13        13   # BR(H -> mu+     mu-    )
     1.61379108E-04    2           3        -3   # BR(H -> s       sb     )
     8.77209007E-08    2           4        -4   # BR(H -> c       cb     )
     8.62543340E-03    2           6        -6   # BR(H -> t       tb     )
     1.89242070E-06    2          21        21   # BR(H -> g       g      )
     2.30453201E-08    2          22        22   # BR(H -> gam     gam    )
     3.24194787E-09    2          23        22   # BR(H -> Z       gam    )
     4.37232056E-06    2          24       -24   # BR(H -> W+      W-     )
     2.18145536E-06    2          23        23   # BR(H -> Z       Z      )
     1.57100916E-05    2          25        25   # BR(H -> h       h      )
     1.88604206E-02    2     1000024  -1000024   # BR(H -> ~chi_1+ ~chi_1-)
     5.59357260E-03    2     1000037  -1000037   # BR(H -> ~chi_2+ ~chi_2-)
     1.90589391E-01    2     1000024  -1000037   # BR(H -> ~chi_1+ ~chi_2-)
     1.90589391E-01    2     1000037  -1000024   # BR(H -> ~chi_2+ ~chi_1-)
     7.51684177E-03    2     1000022   1000022   # BR(H -> ~chi_10 ~chi_10)
     2.13369866E-04    2     1000023   1000023   # BR(H -> ~chi_20 ~chi_20)
     2.77236386E-03    2     1000025   1000025   # BR(H -> ~chi_30 ~chi_30)
     2.68697058E-03    2     1000022   1000023   # BR(H -> ~chi_10 ~chi_20)
     7.82083861E-02    2     1000022   1000025   # BR(H -> ~chi_10 ~chi_30)
     1.11110989E-01    2     1000023   1000025   # BR(H -> ~chi_20 ~chi_30)
     3.80623692E-07    2     1000002  -1000002   # BR(H -> ~u_L    ~u_L*  )
     3.80623692E-07    2     1000004  -1000004   # BR(H -> ~c_L    ~c_L*  )
     5.14061829E-07    2     1000001  -1000001   # BR(H -> ~d_L    ~d_L*  )
     9.97639103E-08    2     2000001  -2000001   # BR(H -> ~d_R    ~d_R*  )
     5.14061829E-07    2     1000003  -1000003   # BR(H -> ~s_L    ~s_L*  )
     9.97639103E-08    2     2000003  -2000003   # BR(H -> ~s_R    ~s_R*  )
     2.44791548E-06    2     1000005  -1000005   # BR(H -> ~b_1    ~b_1*  )
#
#         PDG            Width
DECAY        36     3.94343906E+01   # A decays
#          BR         NDA      ID1       ID2
     3.22030293E-01    2           5        -5   # BR(A -> b       bb     )
     6.08042940E-02    2         -15        15   # BR(A -> tau+    tau-   )
     2.15267356E-04    2         -13        13   # BR(A -> mu+     mu-    )
     1.61402340E-04    2           3        -3   # BR(A -> s       sb     )
     8.80702227E-08    2           4        -4   # BR(A -> c       cb     )
     8.65136590E-03    2           6        -6   # BR(A -> t       tb     )
     2.46349005E-05    2          21        21   # BR(A -> g       g      )
     8.32783808E-09    2          22        22   # BR(A -> gam     gam    )
     2.26896049E-08    2          23        22   # BR(A -> Z       gam    )
     4.43018039E-06    2          23        25   # BR(A -> Z       h      )
     2.24847125E-02    2     1000024  -1000024   # BR(A -> ~chi_1+ ~chi_1-)
     8.53562161E-03    2     1000037  -1000037   # BR(A -> ~chi_2+ ~chi_2-)
     1.87289494E-01    2     1000024  -1000037   # BR(A -> ~chi_1+ ~chi_2-)
     1.87289494E-01    2     1000037  -1000024   # BR(A -> ~chi_2+ ~chi_1-)
     8.43136508E-03    2     1000022   1000022   # BR(A -> ~chi_10 ~chi_10)
     3.67317673E-04    2     1000023   1000023   # BR(A -> ~chi_20 ~chi_20)
     4.24164873E-03    2     1000025   1000025   # BR(A -> ~chi_30 ~chi_30)
     2.62886519E-03    2     1000022   1000023   # BR(A -> ~chi_10 ~chi_20)
     1.02664743E-01    2     1000022   1000025   # BR(A -> ~chi_10 ~chi_30)
     8.41749324E-02    2     1000023   1000025   # BR(A -> ~chi_20 ~chi_30)
#
#         PDG            Width
DECAY        37     3.95132965E+01   # H+ decays
#          BR         NDA      ID1       ID2
     5.45317788E-04    2           4        -5   # BR(H+ -> c       bb     )
     6.07050574E-02    2         -15        16   # BR(H+ -> tau+    nu_tau )
     2.14916026E-04    2         -13        14   # BR(H+ -> mu+     nu_mu  )
     5.45317039E-06    2           2        -5   # BR(H+ -> u       bb     )
     8.05777978E-06    2           2        -3   # BR(H+ -> u       sb     )
     1.58685863E-04    2           4        -3   # BR(H+ -> c       sb     )
     3.32452428E-01    2           6        -5   # BR(H+ -> t       bb     )
     4.42882481E-06    2          24        25   # BR(H+ -> W+      h      )
     5.98732774E-14    2          24        36   # BR(H+ -> W+      A      )
     1.22751107E-04    2     1000024   1000022   # BR(H+ -> ~chi_1+ ~chi_10)
     7.35692961E-03    2     1000024   1000023   # BR(H+ -> ~chi_1+ ~chi_20)
     2.00191257E-01    2     1000024   1000025   # BR(H+ -> ~chi_1+ ~chi_30)
     2.04234263E-01    2     1000037   1000022   # BR(H+ -> ~chi_2+ ~chi_10)
     1.93998560E-01    2     1000037   1000023   # BR(H+ -> ~chi_2+ ~chi_20)
     7.18808503E-08    2     1000037   1000025   # BR(H+ -> ~chi_2+ ~chi_30)
     9.11186237E-07    2     1000002  -1000001   # BR(H+ -> ~u_L    ~d_L*  )
     9.11186237E-07    2     1000004  -1000003   # BR(H+ -> ~c_L    ~s_L*  )
