#
#                              ======================
#                              | THE SUSYHIT OUTPUT |
#                              ======================
#
#
#              ------------------------------------------------------
#              |     This is the output of the SUSY-HIT package     |
#              |  created by A.Djouadi, M.Muehlleitner and M.Spira. |
#              |  In case of problems with SUSY-HIT email to        |
#              |           margarete.muehlleitner@cern.ch           |
#              |           michael.spira@psi.ch                     |
#              |           abdelhak.djouadi@cern.ch                 |
#              ------------------------------------------------------
#
#              ------------------------------------------------------
#              |  SUSY Les Houches Accord - MSSM Spectrum + Decays  |
#              |              based on the decay programs           |
#              |                                                    |
#              |                     SDECAY 1.3b                    |
#              |                                                    |
#              |  Authors: M.Muhlleitner, A.Djouadi and Y.Mambrini  |
#              |  Ref.:    Comput.Phys.Commun.168(2005)46           |
#              |           [hep-ph/0311167]                         |
#              |                                                    |
#              |                     HDECAY 3.4                     |
#              |                                                    |
#              |  By: A.Djouadi,J.Kalinowski,M.Muhlleitner,M.Spira  |
#              |  Ref.:    Comput.Phys.Commun.108(1998)56           |
#              |           [hep-ph/9704448]                         |
#              |                                                    |
#              |                                                    |
#              |  If not stated otherwise all DRbar couplings and   |
#              |  soft SUSY breaking masses are given at the scale  |
#              |  Q=  0.20192940E+04
#              |                                                    |
#              ------------------------------------------------------
#
#
BLOCK DCINFO  # Decay Program information
     1   SDECAY/HDECAY # decay calculator
     2   1.3b  /3.4    # version number
#
BLOCK SPINFO  # Spectrum calculator information
     1     SOFTSUSY    # spectrum calculator               
     2     3.4.0       # version number                    
#
BLOCK MODSEL  # Model selection
     1     0   #  nonUniversal                                     
#
BLOCK SMINPUTS  # Standard Model inputs
         1     1.27908970E+02   # alpha_em^-1(M_Z)^MSbar
         2     1.16637870E-05   # G_F [GeV^-2]
         3     1.18400000E-01   # alpha_S(M_Z)^MSbar
         4     9.11876000E+01   # M_Z pole mass
         5     4.18000000E+00   # mb(mb)^MSbar
         6     1.73200000E+02   # mt pole mass
         7     1.77700000E+00   # mtau pole mass
#
BLOCK MINPAR  # Input parameters - minimal models
         3     1.41400000E+01   # tanb                
#
BLOCK EXTPAR  # Input parameters - non-minimal models
         0    -1.00000000E+00   # Set                 
         1    -1.15170000E+03   # M_1(MX)             
         2     1.48460000E+02   # M_2(MX)             
         3     1.59515000E+03   # M_3(MX)             
        11    -3.23460000E+03   # At(MX)              
        12    -2.92987000E+03   # Ab(MX)              
        13     3.91750000E+02   # Atau(MX)            
        23     4.97760000E+02   # mu(MX)              
        26     9.36120000E+02   # mA(pole)            
        31     2.22005000E+03   # meL(MX)             
        32     2.22005000E+03   # mmuL(MX)            
        33     2.49563000E+03   # mtauL(MX)           
        34     1.91280000E+03   # meR(MX)             
        35     1.91280000E+03   # mmuR(MX)            
        36     2.33992000E+03   # mtauR(MX)           
        41     3.20850000E+03   # mqL1(MX)            
        42     3.20850000E+03   # mqL2(MX)            
        43     1.26793000E+03   # mqL3(MX)            
        44     1.39040000E+03   # muR(MX)             
        45     1.39040000E+03   # mcR(MX)             
        46     3.21632000E+03   # mtR(MX)             
        47     1.06103000E+03   # mdR(MX)             
        48     1.06103000E+03   # msR(MX)             
        49     3.52178000E+03   # mbR(MX)             
#
BLOCK MASS  # Mass Spectrum
# PDG code           mass       particle
        24     8.03774735E+01   # W+
        25     1.27189760E+02   # h
        35     9.36205647E+02   # H
        36     9.36120001E+02   # A
        37     9.39677060E+02   # H+
         5     4.81876030E+00   # b-quark pole mass calculated from mb(mb)_Msbar
   1000001     3.24920676E+03   # ~d_L
   2000001     1.15264368E+03   # ~d_R
   1000002     3.24837050E+03   # ~u_L
   2000002     1.46721198E+03   # ~u_R
   1000003     3.24920676E+03   # ~s_L
   2000003     1.15264368E+03   # ~s_R
   1000004     3.24837050E+03   # ~c_L
   2000004     1.46721198E+03   # ~c_R
   1000005     1.34296037E+03   # ~b_1
   2000005     3.55473989E+03   # ~b_2
   1000006     1.33912107E+03   # ~t_1
   2000006     3.21737175E+03   # ~t_2
   1000011     2.22412487E+03   # ~e_L
   2000011     1.91842294E+03   # ~e_R
   1000012     2.22238377E+03   # ~nu_eL
   1000013     2.22412487E+03   # ~mu_L
   2000013     1.91842294E+03   # ~mu_R
   1000014     2.22238377E+03   # ~nu_muL
   1000015     2.34384127E+03   # ~tau_1
   2000015     2.49986317E+03   # ~tau_2
   1000016     2.49824078E+03   # ~nu_tauL
   1000021     1.73692991E+03   # ~g
   1000022     1.54175039E+02   # ~chi_10
   1000023    -5.14849253E+02   # ~chi_20
   1000025     5.22635029E+02   # ~chi_30
   1000035    -1.14358474E+03   # ~chi_40
   1000024     1.54381378E+02   # ~chi_1+
   1000037     5.26623802E+02   # ~chi_2+
#
BLOCK NMIX  # Neutralino Mixing Matrix
  1  1     2.49950817E-03   # N_11
  1  2     9.82995164E-01   # N_12
  1  3    -1.72604833E-01   # N_13
  1  4     6.26245272E-02   # N_14
  2  1     4.41300340E-02   # N_21
  2  2     7.81157619E-02   # N_22
  2  3     7.01887326E-01   # N_23
  2  4     7.06614923E-01   # N_24
  3  1    -1.93657836E-02   # N_31
  3  2     1.66166188E-01   # N_32
  3  3     6.90844742E-01   # N_33
  3  4    -7.03382759E-01   # N_34
  4  1     9.98834951E-01   # N_41
  4  2    -2.68945057E-03   # N_42
  4  3    -1.71841550E-02   # N_43
  4  4    -4.50134723E-02   # N_44
#
BLOCK UMIX  # Chargino Mixing Matrix U
  1  1     9.70427709E-01   # U_11
  1  2    -2.41391926E-01   # U_12
  2  1     2.41391926E-01   # U_21
  2  2     9.70427709E-01   # U_22
#
BLOCK VMIX  # Chargino Mixing Matrix V
  1  1     9.96125935E-01   # V_11
  1  2    -8.79381672E-02   # V_12
  2  1     8.79381672E-02   # V_21
  2  2     9.96125935E-01   # V_22
#
BLOCK STOPMIX  # Stop Mixing Matrix
  1  1     9.98466350E-01   # cos(theta_t)
  1  2     5.53619718E-02   # sin(theta_t)
  2  1    -5.53619718E-02   # -sin(theta_t)
  2  2     9.98466350E-01   # cos(theta_t)
#
BLOCK SBOTMIX  # Sbottom Mixing Matrix
  1  1     9.99997897E-01   # cos(theta_b)
  1  2     2.05085240E-03   # sin(theta_b)
  2  1    -2.05085240E-03   # -sin(theta_b)
  2  2     9.99997897E-01   # cos(theta_b)
#
BLOCK STAUMIX  # Stau Mixing Matrix
  1  1     1.52637396E-02   # cos(theta_tau)
  1  2     9.99883502E-01   # sin(theta_tau)
  2  1    -9.99883502E-01   # -sin(theta_tau)
  2  2     1.52637396E-02   # cos(theta_tau)
#
BLOCK ALPHA  # Higgs mixing
          -7.55349685E-02   # Mixing angle in the neutral Higgs boson sector
#
BLOCK HMIX Q=  2.01929400E+03  # DRbar Higgs Parameters
         1     5.04055935E+02   # mu(Q)MSSM           
         2     1.35620961E+01   # tan                 
         3     2.41795890E+02   # higgs               
         4     9.88585384E+05   # mA^2(Q)MSSM         
#
BLOCK GAUGE Q=  2.01929400E+03  # The gauge couplings
     1     3.64027799E-01   # gprime(Q) DRbar
     2     6.43398366E-01   # g(Q) DRbar
     3     1.03165262E+00   # g3(Q) DRbar
#
BLOCK AU Q=  2.01929400E+03  # The trilinear couplings
  1  1     0.00000000E+00   # A_u(Q) DRbar
  2  2     0.00000000E+00   # A_c(Q) DRbar
  3  3    -3.23459999E+03   # A_t(Q) DRbar
#
BLOCK AD Q=  2.01929400E+03  # The trilinear couplings
  1  1     0.00000000E+00   # A_d(Q) DRbar
  2  2     0.00000000E+00   # A_s(Q) DRbar
  3  3    -2.92987000E+03   # A_b(Q) DRbar
#
BLOCK AE Q=  2.01929400E+03  # The trilinear couplings
  1  1     0.00000000E+00   # A_e(Q) DRbar
  2  2     0.00000000E+00   # A_mu(Q) DRbar
  3  3     3.91750000E+02   # A_tau(Q) DRbar
#
BLOCK Yu Q=  2.01929400E+03  # The Yukawa couplings
  1  1     0.00000000E+00   # y_u(Q) DRbar
  2  2     0.00000000E+00   # y_c(Q) DRbar
  3  3     8.32191451E-01   # y_t(Q) DRbar
#
BLOCK Yd Q=  2.01929400E+03  # The Yukawa couplings
  1  1     0.00000000E+00   # y_d(Q) DRbar
  2  2     0.00000000E+00   # y_s(Q) DRbar
  3  3     1.83095937E-01   # y_b(Q) DRbar
#
BLOCK Ye Q=  2.01929400E+03  # The Yukawa couplings
  1  1     0.00000000E+00   # y_e(Q) DRbar
  2  2     0.00000000E+00   # y_mu(Q) DRbar
  3  3     1.39510911E-01   # y_tau(Q) DRbar
#
BLOCK MSOFT Q=  2.01929400E+03  # The soft SUSY breaking masses at the scale Q
         1    -1.15170000E+03   # M_1(Q)              
         2     1.48460000E+02   # M_2(Q)              
         3     1.59515000E+03   # M_3(Q)              
        21     6.16611661E+05   # mH1^2(Q)            
        22    -2.60290311E+05   # mH2^2(Q)            
        31     2.22005000E+03   # meL(Q)              
        32     2.22005000E+03   # mmuL(Q)             
        33     2.49563000E+03   # mtauL(Q)            
        34     1.91280000E+03   # meR(Q)              
        35     1.91280000E+03   # mmuR(Q)             
        36     2.33992000E+03   # mtauR(Q)            
        41     3.20850000E+03   # mqL1(Q)             
        42     3.20850000E+03   # mqL2(Q)             
        43     1.26792999E+03   # mqL3(Q)             
        44     1.39040000E+03   # muR(Q)              
        45     1.39040000E+03   # mcR(Q)              
        46     3.21631999E+03   # mtR(Q)              
        47     1.06103000E+03   # mdR(Q)              
        48     1.06103000E+03   # msR(Q)              
        49     3.52178000E+03   # mbR(Q)              
#
Block HiggsBoundsInputHiggsCouplingsFermions
# ScalarNormEffCoupSq PseudoSNormEffCoupSq NP   IP1 IP2 IP2
    1.05312135E+00    0.00000000E+00        3  25   5   5  # h0-b-b eff. coupling^2, normalised to SM
    1.83877329E+02    0.00000000E+00        3  35   5   5  # H0-b-b eff. coupling^2, normalised to SM
    0.00000000E+00    1.83930451E+02        3  36   5   5  # A0-b-b eff. coupling^2, normalised to SM
#
    9.99711188E-01    0.00000000E+00        3  25   6   6  # h0-t-t eff. coupling^2, normalised to SM
    5.72564979E-03    0.00000000E+00        3  35   6   6  # H0-t-t eff. coupling^2, normalised to SM
    0.00000000E+00    5.43683766E-03        3  36   6   6  # A0-t-t eff. coupling^2, normalised to SM
#
    1.05312135E+00    0.00000000E+00        3  25  15  15  # h0-tau-tau eff. coupling^2, normalised to SM
    1.83877329E+02    0.00000000E+00        3  35  15  15  # H0-tau-tau eff. coupling^2, normalised to SM
    0.00000000E+00    1.83930451E+02        3  36  15  15  # A0-tau-tau eff. coupling^2, normalised to SM
#
Block HiggsBoundsInputHiggsCouplingsBosons
    9.99996263E-01        3  25  24  24  # h0-W-W eff. coupling^2, normalised to SM
    3.73744226E-06        3  35  24  24  # H0-W-W eff. coupling^2, normalised to SM
    0.00000000E+00        3  36  24  24  # A0-W-W eff. coupling^2, normalised to SM
#
    9.99996263E-01        3  25  23  23  # h0-Z-Z eff. coupling^2, normalised to SM
    3.73744226E-06        3  35  23  23  # H0-Z-Z eff. coupling^2, normalised to SM
    0.00000000E+00        3  36  23  23  # A0-Z-Z eff. coupling^2, normalised to SM
#
    8.85198172E-01        3  25  21  21  # h0-g-g eff. coupling^2, normalised to SM
    3.53485626E-05        3  35  21  21  # H0-g-g eff. coupling^2, normalised to SM
    3.26298617E-04        3  36  21  21  # A0-g-g eff. coupling^2, normalised to SM
#
    0.00000000E+00        3  25  25  23  # h0-h0-Z eff. coupling^2, normalised to SM
    0.00000000E+00        3  35  25  23  # H0-h0-Z eff. coupling^2, normalised to SM
    3.73744226E-06        3  36  25  23  # A0-h0-Z eff. coupling^2, normalised to SM
    0.00000000E+00        3  35  35  23  # H0-H0-Z eff. coupling^2, normalised to SM
    9.99996263E-01        3  36  35  23  # A0-H0-Z eff. coupling^2, normalised to SM
    0.00000000E+00        3  36  36  23  # A0-A0-Z eff. coupling^2, normalised to SM
#
    0.00000000E+00        4  25  21  21  23  # h0-g-g-Z eff. coupling^2, normalised to SM
    0.00000000E+00        4  35  21  21  23  # H0-g-g-Z eff. coupling^2, normalised to SM
    0.00000000E+00        4  36  21  21  23  # A0-g-g-Z eff. coupling^2, normalised to SM
#
#
#
#                             =================
#                             |The decay table|
#                             =================
#
# - The QCD corrections to the decays gluino -> squark  + quark
#                                     squark -> gaugino + quark_prime
#                                     squark -> squark_prime + Higgs
#                                     squark -> gluino  + quark
#   are included.
#
# - The multi-body decays for the inos, stops and sbottoms are included.
#
# - The loop induced decays for the gluino, neutralinos and stops
#   are included.
#
# - The SUSY decays of the top quark are included.
#
#
#         PDG            Width
DECAY         6     1.45847371E+00   # top decays
#          BR         NDA      ID1       ID2
     1.00000000E+00    2           5        24   # BR(t ->  b    W+)
#
#         PDG            Width
DECAY   1000021     3.69996200E+01   # gluino decays
#          BR         NDA      ID1       ID2
     1.37047134E-01    2     2000001        -1   # BR(~g -> ~d_R  db)
     1.37047134E-01    2    -2000001         1   # BR(~g -> ~d_R* d )
     3.59082509E-02    2     2000002        -2   # BR(~g -> ~u_R  ub)
     3.59082509E-02    2    -2000002         2   # BR(~g -> ~u_R* u )
     1.37047134E-01    2     2000003        -3   # BR(~g -> ~s_R  sb)
     1.37047134E-01    2    -2000003         3   # BR(~g -> ~s_R* s )
     3.59076490E-02    2     2000004        -4   # BR(~g -> ~c_R  cb)
     3.59076490E-02    2    -2000004         4   # BR(~g -> ~c_R* c )
     8.15457798E-02    2     1000005        -5   # BR(~g -> ~b_1  bb)
     8.15457798E-02    2    -1000005         5   # BR(~g -> ~b_1* b )
     7.25440532E-02    2     1000006        -6   # BR(~g -> ~t_1  tb)
     7.25440532E-02    2    -1000006         6   # BR(~g -> ~t_1* t )
#
#         PDG            Width
DECAY   1000006     2.95001573E+01   # stop1 decays
#          BR         NDA      ID1       ID2
     1.72782856E-01    2     1000022         6   # BR(~t_1 -> ~chi_10 t )
     2.24637550E-01    2     1000023         6   # BR(~t_1 -> ~chi_20 t )
     2.15852957E-01    2     1000025         6   # BR(~t_1 -> ~chi_30 t )
     5.40169730E-05    2     1000035         6   # BR(~t_1 -> ~chi_40 t )
     3.66281079E-01    2     1000024         5   # BR(~t_1 -> ~chi_1+ b )
     2.03915409E-02    2     1000037         5   # BR(~t_1 -> ~chi_2+ b )
#
#         PDG            Width
DECAY   2000006     2.53066865E+02   # stop2 decays
#          BR         NDA      ID1       ID2
     1.89841215E-04    2     1000022         6   # BR(~t_2 -> ~chi_10 t )
     8.19762025E-02    2     1000023         6   # BR(~t_2 -> ~chi_20 t )
     8.31011458E-02    2     1000025         6   # BR(~t_2 -> ~chi_30 t )
     2.27556228E-02    2     1000035         6   # BR(~t_2 -> ~chi_40 t )
     3.57207045E-04    2     1000024         5   # BR(~t_2 -> ~chi_1+ b )
     1.65384407E-01    2     1000037         5   # BR(~t_2 -> ~chi_2+ b )
     3.52990802E-01    2     1000021         6   # BR(~t_2 -> ~g      t )
     7.33394857E-02    2     1000006        25   # BR(~t_2 -> ~t_1    h )
     3.92303163E-04    2     1000006        35   # BR(~t_2 -> ~t_1    H )
     4.16262762E-04    2     1000006        36   # BR(~t_2 -> ~t_1    A )
     8.26476501E-04    2     1000005        37   # BR(~t_2 -> ~b_1    H+)
     7.39735513E-02    2     1000006        23   # BR(~t_2 -> ~t_1    Z )
     1.44296692E-01    2     1000005        24   # BR(~t_2 -> ~b_1    W+)
#
#         PDG            Width
DECAY   1000005     2.94203609E+01   # sbottom1 decays
#          BR         NDA      ID1       ID2
     1.77608586E-01    2     1000022         5   # BR(~b_1 -> ~chi_10 b )
     1.15536568E-02    2     1000023         5   # BR(~b_1 -> ~chi_20 b )
     1.43791422E-02    2     1000025         5   # BR(~b_1 -> ~chi_30 b )
     5.18012565E-04    2     1000035         5   # BR(~b_1 -> ~chi_40 b )
     3.35333319E-01    2    -1000024         6   # BR(~b_1 -> ~chi_1- t )
     4.60607284E-01    2    -1000037         6   # BR(~b_1 -> ~chi_2- t )
#
#         PDG            Width
DECAY   2000005     1.25048313E+02   # sbottom2 decays
#          BR         NDA      ID1       ID2
     5.30677056E-04    2     1000022         5   # BR(~b_2 -> ~chi_10 b )
     8.99074297E-03    2     1000023         5   # BR(~b_2 -> ~chi_20 b )
     8.69036715E-03    2     1000025         5   # BR(~b_2 -> ~chi_30 b )
     1.33593422E-02    2     1000035         5   # BR(~b_2 -> ~chi_40 b )
     1.03283484E-03    2    -1000024         6   # BR(~b_2 -> ~chi_1- t )
     1.70618467E-02    2    -1000037         6   # BR(~b_2 -> ~chi_2- t )
     9.30124559E-01    2     1000021         5   # BR(~b_2 -> ~g      b )
     3.36491119E-04    2     1000005        25   # BR(~b_2 -> ~b_1    h )
     4.75493723E-03    2     1000005        35   # BR(~b_2 -> ~b_1    H )
     4.75990028E-03    2     1000005        36   # BR(~b_2 -> ~b_1    A )
     9.44300493E-03    2     1000006       -37   # BR(~b_2 -> ~t_1    H-)
     3.10173504E-04    2     1000005        23   # BR(~b_2 -> ~b_1    Z )
     6.05106848E-04    2     1000006       -24   # BR(~b_2 -> ~t_1    W-)
     1.59774096E-08    2     2000006       -24   # BR(~b_2 -> ~t_2    W-)
#
#         PDG            Width
DECAY   1000002     1.62570844E+02   # sup_L decays
#          BR         NDA      ID1       ID2
     7.61903879E-02    2     1000022         2   # BR(~u_L -> ~chi_10 u)
     5.62852340E-04    2     1000023         2   # BR(~u_L -> ~chi_20 u)
     1.98651575E-03    2     1000025         2   # BR(~u_L -> ~chi_30 u)
     2.10237852E-03    2     1000035         2   # BR(~u_L -> ~chi_40 u)
     1.56327261E-01    2     1000024         1   # BR(~u_L -> ~chi_1+ d)
     1.16238287E-03    2     1000037         1   # BR(~u_L -> ~chi_2+ d)
     7.61668222E-01    2     1000021         2   # BR(~u_L -> ~g      u)
#
#         PDG            Width
DECAY   2000002     5.36424926E-01   # sup_R decays
#          BR         NDA      ID1       ID2
     3.84467372E-05    2     1000022         2   # BR(~u_R -> ~chi_10 u)
     9.45386356E-03    2     1000023         2   # BR(~u_R -> ~chi_20 u)
     1.80517486E-03    2     1000025         2   # BR(~u_R -> ~chi_30 u)
     9.88702515E-01    2     1000035         2   # BR(~u_R -> ~chi_40 u)
#
#         PDG            Width
DECAY   1000001     1.62598896E+02   # sdown_L decays
#          BR         NDA      ID1       ID2
     7.60514412E-02    2     1000022         1   # BR(~d_L -> ~chi_10 d)
     3.66989704E-04    2     1000023         1   # BR(~d_L -> ~chi_20 d)
     2.16936149E-03    2     1000025         1   # BR(~d_L -> ~chi_30 d)
     2.22646360E-03    2     1000035         1   # BR(~d_L -> ~chi_40 d)
     1.48379169E-01    2    -1000024         2   # BR(~d_L -> ~chi_1- u)
     8.75973171E-03    2    -1000037         2   # BR(~d_L -> ~chi_2- u)
     7.62046843E-01    2     1000021         1   # BR(~d_L -> ~g      d)
#
#         PDG            Width
DECAY   2000001     1.20067649E-03   # sdown_R decays
#           BR         NDA      ID1       ID2
     3.38403888E-03    2     1000022         1   # BR(~d_R -> ~chi_10 d)
     7.03468369E-01    2     1000023         1   # BR(~d_R -> ~chi_20 d)
     1.33436143E-01    2     1000025         1   # BR(~d_R -> ~chi_30 d)
     1.59711449E-01    2     1000035         1   # BR(~d_R -> ~chi_40 d)
#
#         PDG            Width
DECAY   1000004     1.33810983E+02   # scharm_L decays
#          BR         NDA      ID1       ID2
     9.62485044E-02    2     1000022         4   # BR(~c_L -> ~chi_10 c)
     7.09823177E-04    2     1000023         4   # BR(~c_L -> ~chi_20 c)
     2.50515166E-03    2     1000025         4   # BR(~c_L -> ~chi_30 c)
     2.64525102E-03    2     1000035         4   # BR(~c_L -> ~chi_40 c)
     1.97482324E-01    2     1000024         3   # BR(~c_L -> ~chi_1+ s)
     1.46583279E-03    2     1000037         3   # BR(~c_L -> ~chi_2+ s)
     6.98943113E-01    2     1000021         4   # BR(~c_L -> ~g      c)
#
#         PDG            Width
DECAY   2000004     5.34581207E-01   # scharm_R decays
#          BR         NDA      ID1       ID2
     3.92997965E-05    2     1000022         4   # BR(~c_R -> ~chi_10 c)
     9.63077254E-03    2     1000023         4   # BR(~c_R -> ~chi_20 c)
     1.83881437E-03    2     1000025         4   # BR(~c_R -> ~chi_30 c)
     9.88491113E-01    2     1000035         4   # BR(~c_R -> ~chi_40 c)
#
#         PDG            Width
DECAY   1000003     1.33814102E+02   # sstrange_L decays
#          BR         NDA      ID1       ID2
     9.60868172E-02    2     1000022         3   # BR(~s_L -> ~chi_10 s)
     4.62884434E-04    2     1000023         3   # BR(~s_L -> ~chi_20 s)
     2.73613135E-03    2     1000025         3   # BR(~s_L -> ~chi_30 s)
     2.80178897E-03    2     1000035         3   # BR(~s_L -> ~chi_40 s)
     1.87468669E-01    2    -1000024         4   # BR(~s_L -> ~chi_1- c)
     1.10481287E-02    2    -1000037         4   # BR(~s_L -> ~chi_2- c)
     6.99395580E-01    2     1000021         3   # BR(~s_L -> ~g      s)
#
#         PDG            Width
DECAY   2000003     1.17171405E-03   # sstrange_R decays
#           BR         NDA      ID1       ID2
     3.47287018E-03    2     1000022         3   # BR(~s_R -> ~chi_10 s)
     7.19180400E-01    2     1000023         3   # BR(~s_R -> ~chi_20 s)
     1.36400884E-01    2     1000025         3   # BR(~s_R -> ~chi_30 s)
     1.40945845E-01    2     1000035         3   # BR(~s_R -> ~chi_40 s)
#
#         PDG            Width
DECAY   1000011     2.86764938E+01   # selectron_L decays
#          BR         NDA      ID1       ID2
     3.06521437E-01    2     1000022        11   # BR(~e_L -> ~chi_10 e-)
     3.03976178E-03    2     1000023        11   # BR(~e_L -> ~chi_20 e-)
     6.86739075E-03    2     1000025        11   # BR(~e_L -> ~chi_30 e-)
     5.46714707E-02    2     1000035        11   # BR(~e_L -> ~chi_40 e-)
     5.95736932E-01    2    -1000024        12   # BR(~e_L -> ~chi_1- nu_e)
     3.31630082E-02    2    -1000037        12   # BR(~e_L -> ~chi_2- nu_e)
#
#         PDG            Width
DECAY   2000011     4.21417872E+00   # selectron_R decays
#          BR         NDA      ID1       ID2
     1.48027258E-05    2     1000022        11   # BR(~e_R -> ~chi_10 e-)
     4.02534918E-03    2     1000023        11   # BR(~e_R -> ~chi_20 e-)
     7.71522175E-04    2     1000025        11   # BR(~e_R -> ~chi_30 e-)
     9.95188326E-01    2     1000035        11   # BR(~e_R -> ~chi_40 e-)
#
#         PDG            Width
DECAY   1000013     2.86764937E+01   # smuon_L decays
#          BR         NDA      ID1       ID2
     3.06521436E-01    2     1000022        13   # BR(~mu_L -> ~chi_10 mu-)
     3.03976177E-03    2     1000023        13   # BR(~mu_L -> ~chi_20 mu-)
     6.86739073E-03    2     1000025        13   # BR(~mu_L -> ~chi_30 mu-)
     5.46714704E-02    2     1000035        13   # BR(~mu_L -> ~chi_40 mu-)
     5.95736933E-01    2    -1000024        14   # BR(~mu_L -> ~chi_1- nu_mu)
     3.31630083E-02    2    -1000037        14   # BR(~mu_L -> ~chi_2- nu_mu)
#
#         PDG            Width
DECAY   2000013     4.21417866E+00   # smuon_R decays
#          BR         NDA      ID1       ID2
     1.48027259E-05    2     1000022        13   # BR(~mu_R -> ~chi_10 mu-)
     4.02534921E-03    2     1000023        13   # BR(~mu_R -> ~chi_20 mu-)
     7.71522181E-04    2     1000025        13   # BR(~mu_R -> ~chi_30 mu-)
     9.95188326E-01    2     1000035        13   # BR(~mu_R -> ~chi_40 mu-)
#
#         PDG            Width
DECAY   1000015     8.83956473E+00   # stau_1 decays
#          BR         NDA      ID1       ID2
     5.00197678E-03    2     1000022        15   # BR(~tau_1 -> ~chi_10  tau-)
     4.79473109E-02    2     1000023        15   # BR(~tau_1 -> ~chi_20  tau-)
     4.36016680E-02    2     1000025        15   # BR(~tau_1 -> ~chi_30  tau-)
     8.09562614E-01    2     1000035        15   # BR(~tau_1 -> ~chi_40  tau-)
     9.76070895E-03    2    -1000024        16   # BR(~tau_1 -> ~chi_1-  nu_tau)
     8.41257211E-02    2    -1000037        16   # BR(~tau_1 -> ~chi_2-  nu_tau)
#
#         PDG            Width
DECAY   2000015     3.34800801E+01   # stau_2 decays
#          BR         NDA      ID1       ID2
     2.95985242E-01    2     1000022        15   # BR(~tau_2 -> ~chi_10  tau-)
     1.61505088E-02    2     1000023        15   # BR(~tau_2 -> ~chi_20  tau-)
     1.97185241E-02    2     1000025        15   # BR(~tau_2 -> ~chi_30  tau-)
     6.08834725E-02    2     1000035        15   # BR(~tau_2 -> ~chi_40  tau-)
     5.73601871E-01    2    -1000024        16   # BR(~tau_2 -> ~chi_1-  nu_tau)
     3.35906480E-02    2    -1000037        16   # BR(~tau_2 -> ~chi_2-  nu_tau)
     3.61863275E-05    2     1000015        25   # BR(~tau_2 -> ~tau_1   h)
     3.35477561E-05    2     1000015        23   # BR(~tau_2 -> ~tau_1   Z)
#
#         PDG            Width
DECAY   1000012     2.87189296E+01   # snu_eL decays
#          BR         NDA      ID1       ID2
     3.04069432E-01    2     1000022        12   # BR(~nu_eL -> ~chi_10 nu_e)
     8.06050644E-04    2     1000023        12   # BR(~nu_eL -> ~chi_20 nu_e)
     8.92165313E-03    2     1000025        12   # BR(~nu_eL -> ~chi_30 nu_e)
     5.55336589E-02    2     1000035        12   # BR(~nu_eL -> ~chi_40 nu_e)
     6.26278846E-01    2     1000024        11   # BR(~nu_eL -> ~chi_1+ e-)
     4.39035949E-03    2     1000037        11   # BR(~nu_eL -> ~chi_2+ e-)
#
#         PDG            Width
DECAY   1000014     2.87189295E+01   # snu_muL decays
#          BR         NDA      ID1       ID2
     3.04069433E-01    2     1000022        14   # BR(~nu_muL -> ~chi_10 nu_mu)
     8.06050646E-04    2     1000023        14   # BR(~nu_muL -> ~chi_20 nu_mu)
     8.92165316E-03    2     1000025        14   # BR(~nu_muL -> ~chi_30 nu_mu)
     5.55336591E-02    2     1000035        14   # BR(~nu_muL -> ~chi_40 nu_mu)
     6.26278845E-01    2     1000024        13   # BR(~nu_muL -> ~chi_1+ mu-)
     4.39035948E-03    2     1000037        13   # BR(~nu_muL -> ~chi_2+ mu-)
#
#         PDG            Width
DECAY   1000016     3.35255120E+01   # snu_tauL decays
#          BR         NDA      ID1       ID2
     2.93397772E-01    2     1000022        16   # BR(~nu_tauL -> ~chi_10 nu_tau)
     7.94672253E-04    2     1000023        16   # BR(~nu_tauL -> ~chi_20 nu_tau)
     8.80235051E-03    2     1000025        16   # BR(~nu_tauL -> ~chi_30 nu_tau)
     6.18156673E-02    2     1000035        16   # BR(~nu_tauL -> ~chi_40 nu_tau)
     6.05964444E-01    2     1000024        15   # BR(~nu_tauL -> ~chi_1+ tau-)
     2.91512393E-02    2     1000037        15   # BR(~nu_tauL -> ~chi_2+ tau-)
     7.38544513E-05    2    -1000015       -24   # BR(~nu_tauL -> ~tau_1+ W-)
#
#         PDG            Width
DECAY   1000024     9.95168000E-15   # chargino1+ decays
#           BR         NDA      ID1       ID2       ID3
     2.19500820E-02    3     1000022       -11        12   # BR(~chi_1+ -> ~chi_10 e+   nu_e)
     6.01579080E-03    3     1000022       -13        14   # BR(~chi_1+ -> ~chi_10 mu+  nu_mu)
     9.72034130E-01    2     1000022       211             # BR(~chi_1+ -> ~chi_10 pi+)
#
#         PDG            Width
DECAY   1000037     3.11299080E+00   # chargino2+ decays
#          BR         NDA      ID1       ID2
     3.50296367E-01    2     1000024        23   # BR(~chi_2+ -> ~chi_1+  Z )
     3.52002630E-01    2     1000022        24   # BR(~chi_2+ -> ~chi_10  W+)
     2.97701003E-01    2     1000024        25   # BR(~chi_2+ -> ~chi_1+  h )
#
#         PDG            Width
DECAY   1000022     0.00000000E+00   # neutralino1 decays
#
#         PDG            Width
DECAY   1000023     3.13452621E+00   # neutralino2 decays
#          BR         NDA      ID1       ID2
     2.73303043E-01    2     1000022        23   # BR(~chi_20 -> ~chi_10   Z )
     3.38174022E-01    2     1000024       -24   # BR(~chi_20 -> ~chi_1+   W-)
     3.38174022E-01    2    -1000024        24   # BR(~chi_20 -> ~chi_1-   W+)
     5.03489134E-02    2     1000022        25   # BR(~chi_20 -> ~chi_10   h )
#
#         PDG            Width
DECAY   1000025     3.22060588E+00   # neutralino3 decays
#          BR         NDA      ID1       ID2
     6.59634525E-02    2     1000022        23   # BR(~chi_30 -> ~chi_10   Z )
     3.47048135E-01    2     1000024       -24   # BR(~chi_30 -> ~chi_1+   W-)
     3.47048135E-01    2    -1000024        24   # BR(~chi_30 -> ~chi_1-   W+)
     2.39940276E-01    2     1000022        25   # BR(~chi_30 -> ~chi_10   h )
#
#         PDG            Width
DECAY   1000035     2.30833889E+00   # neutralino4 decays
#          BR         NDA      ID1       ID2
     6.67148404E-03    2     1000022        23   # BR(~chi_40 -> ~chi_10   Z )
     4.29560563E-02    2     1000023        23   # BR(~chi_40 -> ~chi_20   Z )
     1.93203695E-01    2     1000025        23   # BR(~chi_40 -> ~chi_30   Z )
     1.17611306E-02    2     1000024       -24   # BR(~chi_40 -> ~chi_1+   W-)
     1.17611306E-02    2    -1000024        24   # BR(~chi_40 -> ~chi_1-   W+)
     2.27832671E-01    2     1000037       -24   # BR(~chi_40 -> ~chi_2+   W-)
     2.27832671E-01    2    -1000037        24   # BR(~chi_40 -> ~chi_2-   W+)
     5.33636813E-03    2     1000022        25   # BR(~chi_40 -> ~chi_10   h )
     9.85799336E-05    2     1000022        35   # BR(~chi_40 -> ~chi_10   H )
     1.04475842E-03    2     1000022        36   # BR(~chi_40 -> ~chi_10   A )
     2.30154872E-01    2     1000023        25   # BR(~chi_40 -> ~chi_20   h )
     3.92662070E-02    2     1000025        25   # BR(~chi_40 -> ~chi_30   h )
     1.04018750E-03    2     1000024       -37   # BR(~chi_40 -> ~chi_1+   H-)
     1.04018750E-03    2    -1000024        37   # BR(~chi_40 -> ~chi_1-   H+)
#
#         PDG            Width
DECAY        25     4.55859465E-03   # h decays
#          BR         NDA      ID1       ID2
     5.78192865E-01    2           5        -5   # BR(h -> b       bb     )
     6.08202550E-02    2         -15        15   # BR(h -> tau+    tau-   )
     2.15269431E-04    2         -13        13   # BR(h -> mu+     mu-    )
     2.33760779E-04    2           3        -3   # BR(h -> s       sb     )
     1.92871850E-02    2           4        -4   # BR(h -> c       cb     )
     7.35475094E-02    2          21        21   # BR(h -> g       g      )
     2.24716583E-03    2          22        22   # BR(h -> gam     gam    )
     1.65771193E-03    2          22        23   # BR(h -> Z       gam    )
     2.33711223E-01    2          24       -24   # BR(h -> W+      W-     )
     3.00870546E-02    2          23        23   # BR(h -> Z       Z      )
#
#         PDG            Width
DECAY        35     8.30025842E+00   # H decays
#          BR         NDA      ID1       ID2
     2.79905225E-01    2           5        -5   # BR(H -> b       bb     )
     4.28579022E-02    2         -15        15   # BR(H -> tau+    tau-   )
     1.51438832E-04    2         -13        13   # BR(H -> mu+     mu-    )
     1.07272816E-04    2           3        -3   # BR(H -> s       sb     )
     3.13097198E-07    2           4        -4   # BR(H -> c       cb     )
     2.69592111E-02    2           6        -6   # BR(H -> t       tb     )
     4.88212354E-05    2          21        21   # BR(H -> g       g      )
     8.80718844E-07    2          22        22   # BR(H -> gam     gam    )
     4.12052649E-08    2          23        22   # BR(H -> Z       gam    )
     1.13917137E-04    2          24       -24   # BR(H -> W+      W-     )
     5.61627320E-05    2          23        23   # BR(H -> Z       Z      )
     4.44999022E-04    2          25        25   # BR(H -> h       h      )
     4.38151170E-02    2     1000024  -1000024   # BR(H -> ~chi_1+ ~chi_1-)
     1.96162150E-01    2     1000024  -1000037   # BR(H -> ~chi_1+ ~chi_2-)
     1.96162150E-01    2     1000037  -1000024   # BR(H -> ~chi_2+ ~chi_1-)
     2.17396008E-02    2     1000022   1000022   # BR(H -> ~chi_10 ~chi_10)
     1.40208841E-01    2     1000022   1000023   # BR(H -> ~chi_10 ~chi_20)
     5.12659558E-02    2     1000022   1000025   # BR(H -> ~chi_10 ~chi_30)
#
#         PDG            Width
DECAY        36     8.26118308E+00   # A decays
#          BR         NDA      ID1       ID2
     2.81337723E-01    2           5        -5   # BR(A -> b       bb     )
     4.30697578E-02    2         -15        15   # BR(A -> tau+    tau-   )
     1.52185253E-04    2         -13        13   # BR(A -> mu+     mu-    )
     1.07845956E-04    2           3        -3   # BR(A -> s       sb     )
     3.01415944E-07    2           4        -4   # BR(A -> c       cb     )
     2.87767981E-02    2           6        -6   # BR(A -> t       tb     )
     1.49025744E-04    2          21        21   # BR(A -> g       g      )
     1.60268152E-06    2          22        22   # BR(A -> gam     gam    )
     9.44919347E-08    2          23        22   # BR(A -> Z       gam    )
     1.11736549E-04    2          23        25   # BR(A -> Z       h      )
     5.49350203E-02    2     1000024  -1000024   # BR(A -> ~chi_1+ ~chi_1-)
     1.89803548E-01    2     1000024  -1000037   # BR(A -> ~chi_1+ ~chi_2-)
     1.89803548E-01    2     1000037  -1000024   # BR(A -> ~chi_2+ ~chi_1-)
     2.73127181E-02    2     1000022   1000022   # BR(A -> ~chi_10 ~chi_10)
     5.95543326E-02    2     1000022   1000023   # BR(A -> ~chi_10 ~chi_20)
     1.24883763E-01    2     1000022   1000025   # BR(A -> ~chi_10 ~chi_30)
#
#         PDG            Width
DECAY        37     8.00532770E+00   # H+ decays
#          BR         NDA      ID1       ID2
     4.65434341E-04    2           4        -5   # BR(H+ -> c       bb     )
     4.46151837E-02    2         -15        16   # BR(H+ -> tau+    nu_tau )
     1.57645945E-04    2         -13        14   # BR(H+ -> mu+     nu_mu  )
     4.65428853E-06    2           2        -5   # BR(H+ -> u       bb     )
     5.56024972E-06    2           2        -3   # BR(H+ -> u       sb     )
     1.09740572E-04    2           4        -3   # BR(H+ -> c       sb     )
     2.99214537E-01    2           6        -5   # BR(H+ -> t       bb     )
     1.17492345E-04    2          24        25   # BR(H+ -> W+      h      )
     9.32061220E-11    2          24        36   # BR(H+ -> W+      A      )
     2.37146401E-07    2     1000024   1000022   # BR(H+ -> ~chi_1+ ~chi_10)
     2.20137263E-01    2     1000024   1000023   # BR(H+ -> ~chi_1+ ~chi_20)
     2.13239206E-01    2     1000024   1000025   # BR(H+ -> ~chi_1+ ~chi_30)
     2.21933045E-01    2     1000037   1000022   # BR(H+ -> ~chi_2+ ~chi_10)
