#
#                              ======================
#                              | THE SUSYHIT OUTPUT |
#                              ======================
#
#
#              ------------------------------------------------------
#              |     This is the output of the SUSY-HIT package     |
#              |  created by A.Djouadi, M.Muehlleitner and M.Spira. |
#              |  In case of problems with SUSY-HIT email to        |
#              |           margarete.muehlleitner@cern.ch           |
#              |           michael.spira@psi.ch                     |
#              |           abdelhak.djouadi@cern.ch                 |
#              ------------------------------------------------------
#
#              ------------------------------------------------------
#              |  SUSY Les Houches Accord - MSSM Spectrum + Decays  |
#              |              based on the decay programs           |
#              |                                                    |
#              |                     SDECAY 1.3b                    |
#              |                                                    |
#              |  Authors: M.Muhlleitner, A.Djouadi and Y.Mambrini  |
#              |  Ref.:    Comput.Phys.Commun.168(2005)46           |
#              |           [hep-ph/0311167]                         |
#              |                                                    |
#              |                     HDECAY 3.4                     |
#              |                                                    |
#              |  By: A.Djouadi,J.Kalinowski,M.Muhlleitner,M.Spira  |
#              |  Ref.:    Comput.Phys.Commun.108(1998)56           |
#              |           [hep-ph/9704448]                         |
#              |                                                    |
#              |                                                    |
#              |  If not stated otherwise all DRbar couplings and   |
#              |  soft SUSY breaking masses are given at the scale  |
#              |  Q=  0.33364110E+04
#              |                                                    |
#              ------------------------------------------------------
#
#
BLOCK DCINFO  # Decay Program information
     1   SDECAY/HDECAY # decay calculator
     2   1.3b  /3.4    # version number
#
BLOCK SPINFO  # Spectrum calculator information
     1     SOFTSUSY    # spectrum calculator               
     2     3.4.0       # version number                    
#
BLOCK MODSEL  # Model selection
     1     0   #  nonUniversal                                     
#
BLOCK SMINPUTS  # Standard Model inputs
         1     1.27908970E+02   # alpha_em^-1(M_Z)^MSbar
         2     1.16637870E-05   # G_F [GeV^-2]
         3     1.18400000E-01   # alpha_S(M_Z)^MSbar
         4     9.11876000E+01   # M_Z pole mass
         5     4.18000000E+00   # mb(mb)^MSbar
         6     1.73200000E+02   # mt pole mass
         7     1.77700000E+00   # mtau pole mass
#
BLOCK MINPAR  # Input parameters - minimal models
         3     4.65000000E+00   # tanb                
#
BLOCK EXTPAR  # Input parameters - non-minimal models
         0    -1.00000000E+00   # Set                 
         1     5.97860000E+02   # M_1(MX)             
         2    -5.90630000E+02   # M_2(MX)             
         3     1.93719000E+03   # M_3(MX)             
        11     5.52157000E+03   # At(MX)              
        12    -3.42493000E+03   # Ab(MX)              
        13    -7.97240000E+02   # Atau(MX)            
        23     5.73250000E+02   # mu(MX)              
        26     2.12863000E+03   # mA(pole)            
        31     2.87327000E+03   # meL(MX)             
        32     2.87327000E+03   # mmuL(MX)            
        33     2.11511000E+03   # mtauL(MX)           
        34     1.95244000E+03   # meR(MX)             
        35     1.95244000E+03   # mmuR(MX)            
        36     2.48590000E+03   # mtauR(MX)           
        41     2.96570000E+02   # mqL1(MX)            
        42     2.96570000E+02   # mqL2(MX)            
        43     3.87310000E+03   # mqL3(MX)            
        44     2.20439000E+03   # muR(MX)             
        45     2.20439000E+03   # mcR(MX)             
        46     2.87588000E+03   # mtR(MX)             
        47     1.05913000E+03   # mdR(MX)             
        48     1.05913000E+03   # msR(MX)             
        49     1.79888000E+03   # mbR(MX)             
#
BLOCK MASS  # Mass Spectrum
# PDG code           mass       particle
        24     8.03965529E+01   # W+
        25     1.25283183E+02   # h
        35     2.12917743E+03   # H
        36     2.12862996E+03   # A
        37     2.13047194E+03   # H+
         5     4.81876030E+00   # b-quark pole mass calculated from mb(mb)_Msbar
   1000001     6.28902392E+02   # ~d_L
   2000001     1.21729055E+03   # ~d_R
   1000002     6.24307881E+02   # ~u_L
   2000002     2.28870351E+03   # ~u_R
   1000003     6.28902392E+02   # ~s_L
   2000003     1.21729055E+03   # ~s_R
   1000004     6.24307881E+02   # ~c_L
   2000004     2.28870351E+03   # ~c_R
   1000005     1.91108925E+03   # ~b_1
   2000005     3.86915951E+03   # ~b_2
   1000006     2.83360783E+03   # ~t_1
   2000006     3.88147505E+03   # ~t_2
   1000011     2.87663765E+03   # ~e_L
   2000011     1.96436796E+03   # ~e_R
   1000012     2.87536198E+03   # ~nu_eL
   1000013     2.87663765E+03   # ~mu_L
   2000013     1.96436796E+03   # ~mu_R
   1000014     2.87536198E+03   # ~nu_muL
   1000015     2.11646491E+03   # ~tau_1
   2000015     2.49574928E+03   # ~tau_2
   1000016     2.11485855E+03   # ~nu_tauL
   1000021     2.07822377E+03   # ~g
   1000022     5.56695163E+02   # ~chi_10
   1000023    -5.59812634E+02   # ~chi_20
   1000025     6.31777340E+02   # ~chi_30
   1000035    -6.42446644E+02   # ~chi_40
   1000024     5.61620292E+02   # ~chi_1+
   1000037     6.44253556E+02   # ~chi_2+
#
BLOCK NMIX  # Neutralino Mixing Matrix
  1  1    -7.59827629E-01   # N_11
  1  2    -3.62514792E-02   # N_12
  1  3    -4.68915144E-01   # N_13
  1  4     4.48850078E-01   # N_14
  2  1    -1.39042350E-02   # N_21
  2  2    -6.74271698E-01   # N_22
  2  3     5.48154009E-01   # N_23
  2  4     4.94663049E-01   # N_24
  3  1     6.49822791E-01   # N_31
  3  2    -4.08285999E-02   # N_32
  3  3    -5.26806919E-01   # N_33
  3  4     5.46386161E-01   # N_34
  4  1    -1.41062952E-02   # N_41
  4  2     7.36462174E-01   # N_42
  4  3     4.49577847E-01   # N_43
  4  4     5.05276399E-01   # N_44
#
BLOCK UMIX  # Chargino Mixing Matrix U
  1  1    -6.50070423E-01   # U_11
  1  2     7.59873966E-01   # U_12
  2  1    -7.59873966E-01   # U_21
  2  2    -6.50070423E-01   # U_22
#
BLOCK VMIX  # Chargino Mixing Matrix V
  1  1     7.28944731E-01   # V_11
  1  2     6.84572552E-01   # V_12
  2  1     6.84572552E-01   # V_21
  2  2    -7.28944731E-01   # V_22
#
BLOCK STOPMIX  # Stop Mixing Matrix
  1  1    -1.03997898E-01   # cos(theta_t)
  1  2     9.94577517E-01   # sin(theta_t)
  2  1    -9.94577517E-01   # -sin(theta_t)
  2  2    -1.03997898E-01   # cos(theta_t)
#
BLOCK SBOTMIX  # Sbottom Mixing Matrix
  1  1     1.20706452E-03   # cos(theta_b)
  1  2     9.99999271E-01   # sin(theta_b)
  2  1    -9.99999271E-01   # -sin(theta_b)
  2  2     1.20706452E-03   # cos(theta_b)
#
BLOCK STAUMIX  # Stau Mixing Matrix
  1  1     9.99994257E-01   # cos(theta_tau)
  1  2     3.38909531E-03   # sin(theta_tau)
  2  1    -3.38909531E-03   # -sin(theta_tau)
  2  2     9.99994257E-01   # cos(theta_tau)
#
BLOCK ALPHA  # Higgs mixing
          -2.24462371E-01   # Mixing angle in the neutral Higgs boson sector
#
BLOCK HMIX Q=  3.33641100E+03  # DRbar Higgs Parameters
         1     5.83118367E+02   # mu(Q)MSSM           
         2     4.40265437E+00   # tan                 
         3     2.40926423E+02   # higgs               
         4     4.44056353E+06   # mA^2(Q)MSSM         
#
BLOCK GAUGE Q=  3.33641100E+03  # The gauge couplings
     1     3.65621651E-01   # gprime(Q) DRbar
     2     6.41831430E-01   # g(Q) DRbar
     3     1.02072573E+00   # g3(Q) DRbar
#
BLOCK AU Q=  3.33641100E+03  # The trilinear couplings
  1  1     0.00000000E+00   # A_u(Q) DRbar
  2  2     0.00000000E+00   # A_c(Q) DRbar
  3  3     5.52157001E+03   # A_t(Q) DRbar
#
BLOCK AD Q=  3.33641100E+03  # The trilinear couplings
  1  1     0.00000000E+00   # A_d(Q) DRbar
  2  2     0.00000000E+00   # A_s(Q) DRbar
  3  3    -3.42493000E+03   # A_b(Q) DRbar
#
BLOCK AE Q=  3.33641100E+03  # The trilinear couplings
  1  1     0.00000000E+00   # A_e(Q) DRbar
  2  2     0.00000000E+00   # A_mu(Q) DRbar
  3  3    -7.97240000E+02   # A_tau(Q) DRbar
#
BLOCK Yu Q=  3.33641100E+03  # The Yukawa couplings
  1  1     0.00000000E+00   # y_u(Q) DRbar
  2  2     0.00000000E+00   # y_c(Q) DRbar
  3  3     8.58556134E-01   # y_t(Q) DRbar
#
BLOCK Yd Q=  3.33641100E+03  # The Yukawa couplings
  1  1     0.00000000E+00   # y_d(Q) DRbar
  2  2     0.00000000E+00   # y_s(Q) DRbar
  3  3     5.93366730E-02   # y_b(Q) DRbar
#
BLOCK Ye Q=  3.33641100E+03  # The Yukawa couplings
  1  1     0.00000000E+00   # y_e(Q) DRbar
  2  2     0.00000000E+00   # y_mu(Q) DRbar
  3  3     4.61317322E-02   # y_tau(Q) DRbar
#
BLOCK MSOFT Q=  3.33641100E+03  # The soft SUSY breaking masses at the scale Q
         1     5.97860000E+02   # M_1(Q)              
         2    -5.90630000E+02   # M_2(Q)              
         3     1.93719000E+03   # M_3(Q)              
        21     3.97534521E+06   # mH1^2(Q)            
        22     9.34762831E+04   # mH2^2(Q)            
        31     2.87327000E+03   # meL(Q)              
        32     2.87327000E+03   # mmuL(Q)             
        33     2.11511000E+03   # mtauL(Q)            
        34     1.95244000E+03   # meR(Q)              
        35     1.95244000E+03   # mmuR(Q)             
        36     2.48590000E+03   # mtauR(Q)            
        41     2.96569949E+02   # mqL1(Q)             
        42     2.96569949E+02   # mqL2(Q)             
        43     3.87310000E+03   # mqL3(Q)             
        44     2.20438999E+03   # muR(Q)              
        45     2.20438999E+03   # mcR(Q)              
        46     2.87587999E+03   # mtR(Q)              
        47     1.05912999E+03   # mdR(Q)              
        48     1.05912999E+03   # msR(Q)              
        49     1.79887999E+03   # mbR(Q)              
#
Block HiggsBoundsInputHiggsCouplingsFermions
# ScalarNormEffCoupSq PseudoSNormEffCoupSq NP   IP1 IP2 IP2
    1.00985020E+00    0.00000000E+00        3  25   5   5  # h0-b-b eff. coupling^2, normalised to SM
    1.93735153E+01    0.00000000E+00        3  35   5   5  # H0-b-b eff. coupling^2, normalised to SM
    0.00000000E+00    1.93833655E+01        3  36   5   5  # A0-b-b eff. coupling^2, normalised to SM
#
    9.99491822E-01    0.00000000E+00        3  25   6   6  # h0-t-t eff. coupling^2, normalised to SM
    5.20988063E-02    0.00000000E+00        3  35   6   6  # H0-t-t eff. coupling^2, normalised to SM
    0.00000000E+00    5.15906281E-02        3  36   6   6  # A0-t-t eff. coupling^2, normalised to SM
#
    1.00985020E+00    0.00000000E+00        3  25  15  15  # h0-tau-tau eff. coupling^2, normalised to SM
    1.93735153E+01    0.00000000E+00        3  35  15  15  # H0-tau-tau eff. coupling^2, normalised to SM
    0.00000000E+00    1.93833655E+01        3  36  15  15  # A0-tau-tau eff. coupling^2, normalised to SM
#
Block HiggsBoundsInputHiggsCouplingsBosons
    9.99998754E-01        3  25  24  24  # h0-W-W eff. coupling^2, normalised to SM
    1.24560486E-06        3  35  24  24  # H0-W-W eff. coupling^2, normalised to SM
    0.00000000E+00        3  36  24  24  # A0-W-W eff. coupling^2, normalised to SM
#
    9.99998754E-01        3  25  23  23  # h0-Z-Z eff. coupling^2, normalised to SM
    1.24560486E-06        3  35  23  23  # H0-Z-Z eff. coupling^2, normalised to SM
    0.00000000E+00        3  36  23  23  # A0-Z-Z eff. coupling^2, normalised to SM
#
    8.88332213E-01        3  25  21  21  # h0-g-g eff. coupling^2, normalised to SM
    5.17654858E-10        3  35  21  21  # H0-g-g eff. coupling^2, normalised to SM
    1.00503681E-09        3  36  21  21  # A0-g-g eff. coupling^2, normalised to SM
#
    0.00000000E+00        3  25  25  23  # h0-h0-Z eff. coupling^2, normalised to SM
    0.00000000E+00        3  35  25  23  # H0-h0-Z eff. coupling^2, normalised to SM
    1.24560486E-06        3  36  25  23  # A0-h0-Z eff. coupling^2, normalised to SM
    0.00000000E+00        3  35  35  23  # H0-H0-Z eff. coupling^2, normalised to SM
    9.99998754E-01        3  36  35  23  # A0-H0-Z eff. coupling^2, normalised to SM
    0.00000000E+00        3  36  36  23  # A0-A0-Z eff. coupling^2, normalised to SM
#
    0.00000000E+00        4  25  21  21  23  # h0-g-g-Z eff. coupling^2, normalised to SM
    0.00000000E+00        4  35  21  21  23  # H0-g-g-Z eff. coupling^2, normalised to SM
    0.00000000E+00        4  36  21  21  23  # A0-g-g-Z eff. coupling^2, normalised to SM
#
#
#
#                             =================
#                             |The decay table|
#                             =================
#
# - The QCD corrections to the decays gluino -> squark  + quark
#                                     squark -> gaugino + quark_prime
#                                     squark -> squark_prime + Higgs
#                                     squark -> gluino  + quark
#   are included.
#
# - The multi-body decays for the inos, stops and sbottoms are included.
#
# - The loop induced decays for the gluino, neutralinos and stops
#   are included.
#
# - The SUSY decays of the top quark are included.
#
#
#         PDG            Width
DECAY         6     1.45051884E+00   # top decays
#          BR         NDA      ID1       ID2
     1.00000000E+00    2           5        24   # BR(t ->  b    W+)
#
#         PDG            Width
DECAY   1000021     1.89307074E+02   # gluino decays
#          BR         NDA      ID1       ID2
     9.83958202E-02    2     1000001        -1   # BR(~g -> ~d_L  db)
     9.83958202E-02    2    -1000001         1   # BR(~g -> ~d_L* d )
     5.14535803E-02    2     2000001        -1   # BR(~g -> ~d_R  db)
     5.14535803E-02    2    -2000001         1   # BR(~g -> ~d_R* d )
     9.86848318E-02    2     1000002        -2   # BR(~g -> ~u_L  ub)
     9.86848318E-02    2    -1000002         2   # BR(~g -> ~u_L* u )
     9.83958202E-02    2     1000003        -3   # BR(~g -> ~s_L  sb)
     9.83958202E-02    2    -1000003         3   # BR(~g -> ~s_L* s )
     5.14535803E-02    2     2000003        -3   # BR(~g -> ~s_R  sb)
     5.14535803E-02    2    -2000003         3   # BR(~g -> ~s_R* s )
     9.86848196E-02    2     1000004        -4   # BR(~g -> ~c_L  cb)
     9.86848196E-02    2    -1000004         4   # BR(~g -> ~c_L* c )
     2.93154757E-03    2     1000005        -5   # BR(~g -> ~b_1  bb)
     2.93154757E-03    2    -1000005         5   # BR(~g -> ~b_1* b )
#
#         PDG            Width
DECAY   1000006     1.12457813E+02   # stop1 decays
#          BR         NDA      ID1       ID2
     9.08879281E-02    2     1000022         6   # BR(~t_1 -> ~chi_10 t )
     9.50840542E-02    2     1000023         6   # BR(~t_1 -> ~chi_20 t )
     1.32457796E-01    2     1000025         6   # BR(~t_1 -> ~chi_30 t )
     7.07464237E-02    2     1000035         6   # BR(~t_1 -> ~chi_40 t )
     1.85522599E-01    2     1000024         5   # BR(~t_1 -> ~chi_1+ b )
     1.49961192E-01    2     1000037         5   # BR(~t_1 -> ~chi_2+ b )
     2.75339684E-01    2     1000021         6   # BR(~t_1 -> ~g      t )
     3.23568102E-07    2     1000005        24   # BR(~t_1 -> ~b_1    W+)
#
#         PDG            Width
DECAY   2000006     2.53918037E+02   # stop2 decays
#          BR         NDA      ID1       ID2
     4.95860652E-02    2     1000022         6   # BR(~t_2 -> ~chi_10 t )
     7.09240520E-02    2     1000023         6   # BR(~t_2 -> ~chi_20 t )
     5.81888129E-02    2     1000025         6   # BR(~t_2 -> ~chi_30 t )
     9.54408585E-02    2     1000035         6   # BR(~t_2 -> ~chi_40 t )
     4.82160554E-02    2     1000024         5   # BR(~t_2 -> ~chi_1+ b )
     7.29153710E-02    2     1000037         5   # BR(~t_2 -> ~chi_2+ b )
     4.32491602E-01    2     1000021         6   # BR(~t_2 -> ~g      t )
     9.11734677E-02    2     1000006        25   # BR(~t_2 -> ~t_1    h )
     8.09724764E-02    2     1000006        23   # BR(~t_2 -> ~t_1    Z )
     9.12382600E-05    2     1000005        24   # BR(~t_2 -> ~b_1    W+)
#
#         PDG            Width
DECAY   1000005     1.14059969E+00   # sbottom1 decays
#          BR         NDA      ID1       ID2
     5.00398267E-01    2     1000022         5   # BR(~b_1 -> ~chi_10 b )
     3.02895432E-02    2     1000023         5   # BR(~b_1 -> ~chi_20 b )
     3.57545847E-01    2     1000025         5   # BR(~b_1 -> ~chi_30 b )
     1.82446763E-02    2     1000035         5   # BR(~b_1 -> ~chi_40 b )
     5.66129467E-02    2    -1000024         6   # BR(~b_1 -> ~chi_1- t )
     3.69087204E-02    2    -1000037         6   # BR(~b_1 -> ~chi_2- t )
#
#         PDG            Width
DECAY   2000005     2.47370792E+02   # sbottom2 decays
#          BR         NDA      ID1       ID2
     9.44448023E-04    2     1000022         5   # BR(~b_2 -> ~chi_10 b )
     2.80243362E-02    2     1000023         5   # BR(~b_2 -> ~chi_20 b )
     1.93030765E-03    2     1000025         5   # BR(~b_2 -> ~chi_30 b )
     3.33250712E-02    2     1000035         5   # BR(~b_2 -> ~chi_40 b )
     1.52323407E-01    2    -1000024         6   # BR(~b_2 -> ~chi_1- t )
     1.87157841E-01    2    -1000037         6   # BR(~b_2 -> ~chi_2- t )
     4.37648967E-01    2     1000021         5   # BR(~b_2 -> ~g      b )
     4.88417179E-05    2     1000005        25   # BR(~b_2 -> ~b_1    h )
     4.79406766E-05    2     1000005        23   # BR(~b_2 -> ~b_1    Z )
     1.58548839E-01    2     1000006       -24   # BR(~b_2 -> ~t_1    W-)
#
#         PDG            Width
DECAY   1000002     1.58922556E-01   # sup_L decays
#          BR         NDA      ID1       ID2
     2.36895529E-02    2     1000022         2   # BR(~u_L -> ~chi_10 u)
     3.05113966E-01    2     1000023         2   # BR(~u_L -> ~chi_20 u)
     6.71196481E-01    2     1000024         1   # BR(~u_L -> ~chi_1+ d)
#
#         PDG            Width
DECAY   2000002     1.02752976E+01   # sup_R decays
#          BR         NDA      ID1       ID2
     2.56802707E-01    2     1000022         2   # BR(~u_R -> ~chi_10 u)
     8.58738186E-05    2     1000023         2   # BR(~u_R -> ~chi_20 u)
     1.81196269E-01    2     1000025         2   # BR(~u_R -> ~chi_30 u)
     8.49139325E-05    2     1000035         2   # BR(~u_R -> ~chi_40 u)
     5.61830236E-01    2     1000021         2   # BR(~u_R -> ~g      u)
#
#         PDG            Width
DECAY   1000001     1.51509587E-01   # sdown_L decays
#          BR         NDA      ID1       ID2
     9.98314142E-03    2     1000022         1   # BR(~d_L -> ~chi_10 d)
     3.55635112E-01    2     1000023         1   # BR(~d_L -> ~chi_20 d)
     6.34381746E-01    2    -1000024         2   # BR(~d_L -> ~chi_1- u)
#
#         PDG            Width
DECAY   2000001     4.26184951E-01   # sdown_R decays
#          BR         NDA      ID1       ID2
     6.15156048E-01    2     1000022         1   # BR(~d_R -> ~chi_10 d)
     2.04778124E-04    2     1000023         1   # BR(~d_R -> ~chi_20 d)
     3.84462490E-01    2     1000025         1   # BR(~d_R -> ~chi_30 d)
     1.76684747E-04    2     1000035         1   # BR(~d_R -> ~chi_40 d)
#
#         PDG            Width
DECAY   1000004     1.47396457E-01   # scharm_L decays
#          BR         NDA      ID1       ID2
     2.37347768E-02    2     1000022         4   # BR(~c_L -> ~chi_10 c)
     3.05225984E-01    2     1000023         4   # BR(~c_L -> ~chi_20 c)
     6.71039239E-01    2     1000024         3   # BR(~c_L -> ~chi_1+ s)
#
#         PDG            Width
DECAY   2000004     8.61155009E+00   # scharm_R decays
#          BR         NDA      ID1       ID2
     3.21075830E-01    2     1000022         4   # BR(~c_R -> ~chi_10 c)
     1.07363824E-04    2     1000023         4   # BR(~c_R -> ~chi_20 c)
     2.26410282E-01    2     1000025         4   # BR(~c_R -> ~chi_30 c)
     1.06093430E-04    2     1000035         4   # BR(~c_R -> ~chi_40 c)
     4.52300432E-01    2     1000021         4   # BR(~c_R -> ~g      c)
#
#         PDG            Width
DECAY   1000003     1.40840826E-01   # sstrange_L decays
#          BR         NDA      ID1       ID2
     1.00039825E-02    2     1000022         3   # BR(~s_L -> ~chi_10 s)
     3.55884247E-01    2     1000023         3   # BR(~s_L -> ~chi_20 s)
     6.34111771E-01    2    -1000024         4   # BR(~s_L -> ~chi_1- c)
#
#         PDG            Width
DECAY   2000003     4.22106605E-01   # sstrange_R decays
#          BR         NDA      ID1       ID2
     6.15429081E-01    2     1000022         3   # BR(~s_R -> ~chi_10 s)
     2.04860567E-04    2     1000023         3   # BR(~s_R -> ~chi_20 s)
     3.84189534E-01    2     1000025         3   # BR(~s_R -> ~chi_30 s)
     1.76524705E-04    2     1000035         3   # BR(~s_R -> ~chi_40 s)
#
#         PDG            Width
DECAY   1000011     3.57847438E+01   # selectron_L decays
#          BR         NDA      ID1       ID2
     6.71564144E-02    2     1000022        11   # BR(~e_L -> ~chi_10 e-)
     1.41908672E-01    2     1000023        11   # BR(~e_L -> ~chi_20 e-)
     3.23662491E-02    2     1000025        11   # BR(~e_L -> ~chi_30 e-)
     1.57782958E-01    2     1000035        11   # BR(~e_L -> ~chi_40 e-)
     2.57587592E-01    2    -1000024        12   # BR(~e_L -> ~chi_1- nu_e)
     3.43198115E-01    2    -1000037        12   # BR(~e_L -> ~chi_2- nu_e)
#
#         PDG            Width
DECAY   2000011     8.65202551E+00   # selectron_R decays
#          BR         NDA      ID1       ID2
     5.89710245E-01    2     1000022        11   # BR(~e_R -> ~chi_10 e-)
     1.97083552E-04    2     1000023        11   # BR(~e_R -> ~chi_20 e-)
     4.09901028E-01    2     1000025        11   # BR(~e_R -> ~chi_30 e-)
     1.91643932E-04    2     1000035        11   # BR(~e_R -> ~chi_40 e-)
#
#         PDG            Width
DECAY   1000013     3.57847438E+01   # smuon_L decays
#          BR         NDA      ID1       ID2
     6.71564143E-02    2     1000022        13   # BR(~mu_L -> ~chi_10 mu-)
     1.41908672E-01    2     1000023        13   # BR(~mu_L -> ~chi_20 mu-)
     3.23662490E-02    2     1000025        13   # BR(~mu_L -> ~chi_30 mu-)
     1.57782958E-01    2     1000035        13   # BR(~mu_L -> ~chi_40 mu-)
     2.57587592E-01    2    -1000024        14   # BR(~mu_L -> ~chi_1- nu_mu)
     3.43198115E-01    2    -1000037        14   # BR(~mu_L -> ~chi_2- nu_mu)
#
#         PDG            Width
DECAY   2000013     8.65202545E+00   # smuon_R decays
#          BR         NDA      ID1       ID2
     5.89710245E-01    2     1000022        13   # BR(~mu_R -> ~chi_10 mu-)
     1.97083552E-04    2     1000023        13   # BR(~mu_R -> ~chi_20 mu-)
     4.09901027E-01    2     1000025        13   # BR(~mu_R -> ~chi_30 mu-)
     1.91643932E-04    2     1000035        13   # BR(~mu_R -> ~chi_40 mu-)
#
#         PDG            Width
DECAY   1000015     2.43733941E+01   # stau_1 decays
#          BR         NDA      ID1       ID2
     6.85871106E-02    2     1000022        15   # BR(~tau_1 -> ~chi_10  tau-)
     1.44278190E-01    2     1000023        15   # BR(~tau_1 -> ~chi_20  tau-)
     3.28225408E-02    2     1000025        15   # BR(~tau_1 -> ~chi_30  tau-)
     1.56144723E-01    2     1000035        15   # BR(~tau_1 -> ~chi_40  tau-)
     2.60021199E-01    2    -1000024        16   # BR(~tau_1 -> ~chi_1-  nu_tau)
     3.38146236E-01    2    -1000037        16   # BR(~tau_1 -> ~chi_2-  nu_tau)
#
#         PDG            Width
DECAY   2000015     1.20275998E+01   # stau_2 decays
#          BR         NDA      ID1       ID2
     5.76989305E-01    2     1000022        15   # BR(~tau_2 -> ~chi_10  tau-)
     2.38387507E-03    2     1000023        15   # BR(~tau_2 -> ~chi_20  tau-)
     4.10502182E-01    2     1000025        15   # BR(~tau_2 -> ~chi_30  tau-)
     1.91463516E-03    2     1000035        15   # BR(~tau_2 -> ~chi_40  tau-)
     4.21044805E-03    2    -1000024        16   # BR(~tau_2 -> ~chi_1-  nu_tau)
     3.60056563E-03    2    -1000037        16   # BR(~tau_2 -> ~chi_2-  nu_tau)
     1.96897745E-04    2     1000016       -24   # BR(~tau_2 -> ~nu_tauL W-)
     1.03993458E-04    2     1000015        25   # BR(~tau_2 -> ~tau_1   h)
     9.80972712E-05    2     1000015        23   # BR(~tau_2 -> ~tau_1   Z)
#
#         PDG            Width
DECAY   1000012     3.58038323E+01   # snu_eL decays
#          BR         NDA      ID1       ID2
     4.79510359E-02    2     1000022        12   # BR(~nu_eL -> ~chi_10 nu_e)
     1.35253020E-01    2     1000023        12   # BR(~nu_eL -> ~chi_20 nu_e)
     5.03518026E-02    2     1000025        12   # BR(~nu_eL -> ~chi_30 nu_e)
     1.64645883E-01    2     1000035        12   # BR(~nu_eL -> ~chi_40 nu_e)
     3.23547868E-01    2     1000024        11   # BR(~nu_eL -> ~chi_1+ e-)
     2.78250390E-01    2     1000037        11   # BR(~nu_eL -> ~chi_2+ e-)
#
#         PDG            Width
DECAY   1000014     3.58038322E+01   # snu_muL decays
#          BR         NDA      ID1       ID2
     4.79510360E-02    2     1000022        14   # BR(~nu_muL -> ~chi_10 nu_mu)
     1.35253020E-01    2     1000023        14   # BR(~nu_muL -> ~chi_20 nu_mu)
     5.03518027E-02    2     1000025        14   # BR(~nu_muL -> ~chi_30 nu_mu)
     1.64645884E-01    2     1000035        14   # BR(~nu_muL -> ~chi_40 nu_mu)
     3.23547868E-01    2     1000024        13   # BR(~nu_muL -> ~chi_1+ mu-)
     2.78250390E-01    2     1000037        13   # BR(~nu_muL -> ~chi_2+ mu-)
#
#         PDG            Width
DECAY   1000016     2.43976202E+01   # snu_tauL decays
#          BR         NDA      ID1       ID2
     4.83929103E-02    2     1000022        16   # BR(~nu_tauL -> ~chi_10 nu_tau)
     1.36390505E-01    2     1000023        16   # BR(~nu_tauL -> ~chi_20 nu_tau)
     4.97704728E-02    2     1000025        16   # BR(~nu_tauL -> ~chi_30 nu_tau)
     1.62220567E-01    2     1000035        16   # BR(~nu_tauL -> ~chi_40 nu_tau)
     3.27970822E-01    2     1000024        15   # BR(~nu_tauL -> ~chi_1+ tau-)
     2.75254724E-01    2     1000037        15   # BR(~nu_tauL -> ~chi_2+ tau-)
#
#         PDG            Width
DECAY   1000024     7.94242016E-10   # chargino1+ decays
#           BR         NDA      ID1       ID2       ID3
     3.42304909E-01    3     1000022         2        -1   # BR(~chi_1+ -> ~chi_10 u    db)
     2.23533317E-02    3     1000023         2        -1   # BR(~chi_1+ -> ~chi_20 u    db)
     3.42304909E-01    3     1000022         4        -3   # BR(~chi_1+ -> ~chi_10 c    sb)
     1.09984399E-01    3     1000022       -11        12   # BR(~chi_1+ -> ~chi_10 e+   nu_e)
     7.07725585E-03    3     1000023       -11        12   # BR(~chi_1+ -> ~chi_20 e+   nu_e)
     1.09984399E-01    3     1000022       -13        14   # BR(~chi_1+ -> ~chi_10 mu+  nu_mu)
     7.07725585E-03    3     1000023       -13        14   # BR(~chi_1+ -> ~chi_20 mu+  nu_mu)
     5.89135121E-02    3     1000022       -15        16   # BR(~chi_1+ -> ~chi_10 tau+ nu_tau)
     2.85424033E-08    3     1000023       -15        16   # BR(~chi_1+ -> ~chi_20 tau+ nu_tau)
#
#         PDG            Width
DECAY   1000037     8.43131365E-02   # chargino2+ decays
#          BR         NDA      ID1       ID2
     1.84040397E-01    2     1000002        -1   # BR(~chi_2+ -> ~u_L     db)
     1.36739291E-01    2    -1000001         2   # BR(~chi_2+ -> ~d_L*    u )
     1.84008523E-01    2     1000004        -3   # BR(~chi_2+ -> ~c_L     sb)
     1.36099868E-01    2    -1000003         4   # BR(~chi_2+ -> ~s_L*     c )
     2.29852673E-01    2     1000022        24   # BR(~chi_2+ -> ~chi_10  W+)
     1.29259249E-01    2     1000023        24   # BR(~chi_2+ -> ~chi_20  W+)
#
#         PDG            Width
DECAY   1000022     0.00000000E+00   # neutralino1 decays
#
#         PDG            Width
DECAY   1000023     5.82325660E-11   # neutralino2 decays
#          BR         NDA      ID1       ID2
     5.80640342E-04    2     1000022        22   # BR(~chi_20 -> ~chi_10 gam)
#           BR         NDA      ID1       ID2       ID3
     1.46954552E-01    3     1000022        -2         2   # BR(~chi_20 -> ~chi_10 ub      u)
     1.86348085E-01    3     1000022        -1         1   # BR(~chi_20 -> ~chi_10 db      d)
     1.46954552E-01    3     1000022        -4         4   # BR(~chi_20 -> ~chi_10 cb      c)
     1.86348085E-01    3     1000022        -3         3   # BR(~chi_20 -> ~chi_10 sb      s)
     4.16130575E-02    3     1000022       -11        11   # BR(~chi_20 -> ~chi_10 e+      e-)
     4.16130575E-02    3     1000022       -13        13   # BR(~chi_20 -> ~chi_10 mu+     mu-)
     8.32180136E-02    3     1000022       -12        12   # BR(~chi_20 -> ~chi_10 nu_eb   nu_e)
     8.32180136E-02    3     1000022       -14        14   # BR(~chi_20 -> ~chi_10 nu_mub  nu_mu)
     8.31519449E-02    3     1000022       -16        16   # BR(~chi_20 -> ~chi_10 nu_taub nu_tau)
#
#         PDG            Width
DECAY   1000025     3.41425938E-03   # neutralino3 decays
#           BR         NDA      ID1       ID2       ID3
     4.32040990E-05    3        -1       1        1000022   # BR(~chi_30 -> db  d  ~chi_10)
     4.11685184E-02    3        -1       1        1000023   # BR(~chi_30 -> db  d  ~chi_20)
     1.71785426E-04    3        -2       2        1000022   # BR(~chi_30 -> ub  u  ~chi_10)
     3.41713933E-02    3        -2       2        1000023   # BR(~chi_30 -> ub  u  ~chi_20)
     4.59953339E-05    3        -3       3        1000022   # BR(~chi_30 -> sb  s  ~chi_10)
     4.16283546E-02    3        -3       3        1000023   # BR(~chi_30 -> sb  s  ~chi_20)
     1.81632364E-04    3        -4       4        1000022   # BR(~chi_30 -> cb  c  ~chi_10)
     3.39048640E-02    3        -4       4        1000023   # BR(~chi_30 -> cb  c  ~chi_20)
     2.57569769E-06    3        -5       5        1000022   # BR(~chi_30 -> bb  b  ~chi_10)
     4.05651665E-02    3        -5       5        1000023   # BR(~chi_30 -> bb  b  ~chi_20)
     3.47513141E-07    3        -11       11        1000022   # BR(~chi_30 -> e+  e-  ~chi_10)
     9.44714400E-03    3        -11       11        1000023   # BR(~chi_30 -> e+  e-  ~chi_20)
     1.30628623E-06    3        -12       12        1000022   # BR(~chi_30 -> nu_eb  nu_e  ~chi_10)
     1.89563805E-02    3        -12       12        1000023   # BR(~chi_30 -> nu_eb  nu_e  ~chi_20)
     3.50266300E-07    3        -13       13        1000022   # BR(~chi_30 -> mu+  mu-  ~chi_10)
     9.34404697E-03    3        -13       13        1000023   # BR(~chi_30 -> mu+  mu-  ~chi_20)
     1.30180502E-06    3        -14       14        1000022   # BR(~chi_30 -> nu_mub  nu_mu  ~chi_10)
     1.90366321E-02    3        -14       14        1000023   # BR(~chi_30 -> nu_mub  nu_mu  ~chi_20)
     3.71969396E-07    3        -15       15        1000022   # BR(~chi_30 -> tau+  tau-  ~chi_10)
     9.43542843E-03    3        -15       15        1000023   # BR(~chi_30 -> tau+  tau-  ~chi_20)
     1.41040837E-06    3        -16       16        1000022   # BR(~chi_30 -> nu_taub  nu_tau  ~chi_10)
     1.88711498E-02    3        -16       16        1000023   # BR(~chi_30 -> nu_taub  nu_tau  ~chi_20)
     1.20992565E-01    3        2       -1        -1000024   # BR(~chi_30 -> u  db  ~chi_1-)
     1.19059496E-01    3        4       -3        -1000024   # BR(~chi_30 -> c  sb  ~chi_1-)
     4.04772997E-02    3        12       -11        -1000024   # BR(~chi_30 -> nu_e  e+  ~chi_1-)
     4.01375481E-02    3        14       -13        -1000024   # BR(~chi_30 -> nu_mu  mu+  ~chi_1-)
     4.04099351E-02    3        16       -15        -1000024   # BR(~chi_30 -> nu_tau  tau+  ~chi_1-)
     1.20904698E-01    3        -2       1        1000024   # BR(~chi_30 -> ub  d  ~chi_1+)
     1.19510545E-01    3        -4       3        1000024   # BR(~chi_30 -> cb  s  ~chi_1+)
     4.02752061E-02    3        -12       11        1000024   # BR(~chi_30 -> nu_eb  e-  ~chi_1+)
     4.05270909E-02    3        -14       13        1000024   # BR(~chi_30 -> nu_mub  mu-  ~chi_1+)
     4.07262556E-02    3        -16       15        1000024   # BR(~chi_30 -> nu_taub  tau-  ~chi_1+)
#
#         PDG            Width
DECAY   1000035     4.95986222E-02   # neutralino4 decays
#          BR         NDA      ID1       ID2
     2.73753647E-02    2     1000024       -24   # BR(~chi_40 -> ~chi_1+   W-)
     2.73753647E-02    2    -1000024        24   # BR(~chi_40 -> ~chi_1-   W+)
     1.50038901E-01    2     1000002        -2   # BR(~chi_40 -> ~u_L      ub)
     1.50038901E-01    2    -1000002         2   # BR(~chi_40 -> ~u_L*     u )
     8.65250383E-02    2     1000001        -1   # BR(~chi_40 -> ~d_L      db)
     8.65250383E-02    2    -1000001         1   # BR(~chi_40 -> ~d_L*     d )
     1.49535658E-01    2     1000004        -4   # BR(~chi_40 -> ~c_L      cb)
     1.49535658E-01    2    -1000004         4   # BR(~chi_40 -> ~c_L*     c )
     8.65250383E-02    2     1000003        -3   # BR(~chi_40 -> ~s _L      sb)
     8.65250383E-02    2    -1000003         3   # BR(~chi_40 -> ~s _L*     s )
#
#         PDG            Width
DECAY        25     4.12357965E-03   # h decays
#          BR         NDA      ID1       ID2
     5.96905755E-01    2           5        -5   # BR(h -> b       bb     )
     6.35109862E-02    2         -15        15   # BR(h -> tau+    tau-   )
     2.24802936E-04    2         -13        13   # BR(h -> mu+     mu-    )
     2.45190861E-04    2           3        -3   # BR(h -> s       sb     )
     2.10601530E-02    2           4        -4   # BR(h -> c       cb     )
     7.78779512E-02    2          21        21   # BR(h -> g       g      )
     2.29583802E-03    2          22        22   # BR(h -> gam     gam    )
     1.55391588E-03    2          22        23   # BR(h -> Z       gam    )
     2.09971028E-01    2          24       -24   # BR(h -> W+      W-     )
     2.63543783E-02    2          23        23   # BR(h -> Z       Z      )
#
#         PDG            Width
DECAY        35     2.44575956E+01   # H decays
#          BR         NDA      ID1       ID2
     1.96888985E-02    2           5        -5   # BR(H -> b       bb     )
     3.50918858E-03    2         -15        15   # BR(H -> tau+    tau-   )
     1.23912174E-05    2         -13        13   # BR(H -> mu+     mu-    )
     7.66080573E-06    2           3        -3   # BR(H -> s       sb     )
     1.94999742E-06    2           4        -4   # BR(H -> c       cb     )
     1.89433553E-01    2           6        -6   # BR(H -> t       tb     )
     1.49101204E-04    2          21        21   # BR(H -> g       g      )
     1.31921304E-07    2          22        22   # BR(H -> gam     gam    )
     1.95265430E-07    2          23        22   # BR(H -> Z       gam    )
     1.57259262E-04    2          24       -24   # BR(H -> W+      W-     )
     7.83553427E-05    2          23        23   # BR(H -> Z       Z      )
     5.79313776E-04    2          25        25   # BR(H -> h       h      )
     2.16658964E-15    2          23        36   # BR(H -> Z       A      )
     1.84942616E-01    2     1000024  -1000024   # BR(H -> ~chi_1+ ~chi_1-)
     1.15679663E-01    2     1000037  -1000037   # BR(H -> ~chi_2+ ~chi_2-)
     8.52410268E-02    2     1000024  -1000037   # BR(H -> ~chi_1+ ~chi_2-)
     8.52410268E-02    2     1000037  -1000024   # BR(H -> ~chi_2+ ~chi_1-)
     8.01036725E-03    2     1000022   1000022   # BR(H -> ~chi_10 ~chi_10)
     8.39546035E-02    2     1000023   1000023   # BR(H -> ~chi_20 ~chi_20)
     8.93683764E-03    2     1000025   1000025   # BR(H -> ~chi_30 ~chi_30)
     6.28806405E-02    2     1000035   1000035   # BR(H -> ~chi_40 ~chi_40)
     7.15369620E-02    2     1000022   1000023   # BR(H -> ~chi_10 ~chi_20)
     8.53205339E-06    2     1000022   1000025   # BR(H -> ~chi_10 ~chi_30)
     1.16186593E-03    2     1000022   1000035   # BR(H -> ~chi_10 ~chi_40)
     3.63556884E-05    2     1000023   1000025   # BR(H -> ~chi_20 ~chi_30)
     2.61418109E-03    2     1000023   1000035   # BR(H -> ~chi_20 ~chi_40)
     7.56542956E-02    2     1000025   1000035   # BR(H -> ~chi_30 ~chi_40)
     9.81301717E-05    2     1000002  -1000002   # BR(H -> ~u_L    ~u_L*  )
     9.81301717E-05    2     1000004  -1000004   # BR(H -> ~c_L    ~c_L*  )
     1.43383622E-04    2     1000001  -1000001   # BR(H -> ~d_L    ~d_L*  )
     1.43383622E-04    2     1000003  -1000003   # BR(H -> ~s_L    ~s_L*  )
#
#         PDG            Width
DECAY        36     2.44870229E+01   # A decays
#          BR         NDA      ID1       ID2
     1.96995134E-02    2           5        -5   # BR(A -> b       bb     )
     3.50585804E-03    2         -15        15   # BR(A -> tau+    tau-   )
     1.23794265E-05    2         -13        13   # BR(A -> mu+     mu-    )
     7.68181613E-06    2           3        -3   # BR(A -> s       sb     )
     1.94599641E-06    2           4        -4   # BR(A -> c       cb     )
     1.90754570E-01    2           6        -6   # BR(A -> t       tb     )
     2.07208428E-04    2          21        21   # BR(A -> g       g      )
     2.03961996E-07    2          22        22   # BR(A -> gam     gam    )
     2.53390595E-07    2          23        22   # BR(A -> Z       gam    )
     1.58449251E-04    2          23        25   # BR(A -> Z       h      )
     1.22161277E-01    2     1000024  -1000024   # BR(A -> ~chi_1+ ~chi_1-)
     5.68837735E-02    2     1000037  -1000037   # BR(A -> ~chi_2+ ~chi_2-)
     1.46076842E-01    2     1000024  -1000037   # BR(A -> ~chi_1+ ~chi_2-)
     1.46076842E-01    2     1000037  -1000024   # BR(A -> ~chi_2+ ~chi_1-)
     2.67297089E-02    2     1000022   1000022   # BR(A -> ~chi_10 ~chi_10)
     5.03743928E-02    2     1000023   1000023   # BR(A -> ~chi_20 ~chi_20)
     3.61171042E-02    2     1000025   1000025   # BR(A -> ~chi_30 ~chi_30)
     3.46978577E-02    2     1000035   1000035   # BR(A -> ~chi_40 ~chi_40)
     6.36010168E-02    2     1000022   1000023   # BR(A -> ~chi_10 ~chi_20)
     1.07709915E-04    2     1000022   1000025   # BR(A -> ~chi_10 ~chi_30)
     1.78706641E-02    2     1000022   1000035   # BR(A -> ~chi_10 ~chi_40)
     1.39701056E-02    2     1000023   1000025   # BR(A -> ~chi_20 ~chi_30)
     2.94402457E-03    2     1000023   1000035   # BR(A -> ~chi_20 ~chi_40)
     6.80406163E-02    2     1000025   1000035   # BR(A -> ~chi_30 ~chi_40)
#
#         PDG            Width
DECAY        37     2.43579259E+01   # H+ decays
#          BR         NDA      ID1       ID2
     3.21934214E-05    2           4        -5   # BR(H+ -> c       bb     )
     3.52748892E-03    2         -15        16   # BR(H+ -> tau+    nu_tau )
     1.24558066E-05    2         -13        14   # BR(H+ -> mu+     nu_mu  )
     3.21901964E-07    2           2        -5   # BR(H+ -> u       bb     )
     3.85246693E-07    2           2        -3   # BR(H+ -> u       sb     )
     9.45828769E-06    2           4        -3   # BR(H+ -> c       sb     )
     2.07178287E-01    2           6        -5   # BR(H+ -> t       bb     )
     1.59905280E-04    2          24        25   # BR(H+ -> W+      h      )
     1.14472750E-12    2          24        36   # BR(H+ -> W+      A      )
     1.50636024E-01    2     1000024   1000022   # BR(H+ -> ~chi_1+ ~chi_10)
     8.76619829E-05    2     1000024   1000023   # BR(H+ -> ~chi_1+ ~chi_20)
     1.90809686E-02    2     1000024   1000025   # BR(H+ -> ~chi_1+ ~chi_30)
     2.20834966E-01    2     1000024   1000035   # BR(H+ -> ~chi_1+ ~chi_40)
     1.52351694E-02    2     1000037   1000022   # BR(H+ -> ~chi_2+ ~chi_10)
     2.51011354E-01    2     1000037   1000023   # BR(H+ -> ~chi_2+ ~chi_20)
     1.31664909E-01    2     1000037   1000025   # BR(H+ -> ~chi_2+ ~chi_30)
     5.00203965E-05    2     1000037   1000035   # BR(H+ -> ~chi_2+ ~chi_40)
     2.39215593E-04    2     1000002  -1000001   # BR(H+ -> ~u_L    ~d_L*  )
     2.39215593E-04    2     1000004  -1000003   # BR(H+ -> ~c_L    ~s_L*  )
