#
#                              ======================
#                              | THE SUSYHIT OUTPUT |
#                              ======================
#
#
#              ------------------------------------------------------
#              |     This is the output of the SUSY-HIT package     |
#              |  created by A.Djouadi, M.Muehlleitner and M.Spira. |
#              |  In case of problems with SUSY-HIT email to        |
#              |           margarete.muehlleitner@cern.ch           |
#              |           michael.spira@psi.ch                     |
#              |           abdelhak.djouadi@cern.ch                 |
#              ------------------------------------------------------
#
#              ------------------------------------------------------
#              |  SUSY Les Houches Accord - MSSM Spectrum + Decays  |
#              |              based on the decay programs           |
#              |                                                    |
#              |                     SDECAY 1.3b                    |
#              |                                                    |
#              |  Authors: M.Muhlleitner, A.Djouadi and Y.Mambrini  |
#              |  Ref.:    Comput.Phys.Commun.168(2005)46           |
#              |           [hep-ph/0311167]                         |
#              |                                                    |
#              |                     HDECAY 3.4                     |
#              |                                                    |
#              |  By: A.Djouadi,J.Kalinowski,M.Muhlleitner,M.Spira  |
#              |  Ref.:    Comput.Phys.Commun.108(1998)56           |
#              |           [hep-ph/9704448]                         |
#              |                                                    |
#              |                                                    |
#              |  If not stated otherwise all DRbar couplings and   |
#              |  soft SUSY breaking masses are given at the scale  |
#              |  Q=  0.16062970E+04
#              |                                                    |
#              ------------------------------------------------------
#
#
BLOCK DCINFO  # Decay Program information
     1   SDECAY/HDECAY # decay calculator
     2   1.3b  /3.4    # version number
#
BLOCK SPINFO  # Spectrum calculator information
     1     SOFTSUSY    # spectrum calculator               
     2     3.4.0       # version number                    
#
BLOCK MODSEL  # Model selection
     1     0   #  nonUniversal                                     
#
BLOCK SMINPUTS  # Standard Model inputs
         1     1.27908970E+02   # alpha_em^-1(M_Z)^MSbar
         2     1.16637870E-05   # G_F [GeV^-2]
         3     1.18400000E-01   # alpha_S(M_Z)^MSbar
         4     9.11876000E+01   # M_Z pole mass
         5     4.18000000E+00   # mb(mb)^MSbar
         6     1.73200000E+02   # mt pole mass
         7     1.77700000E+00   # mtau pole mass
#
BLOCK MINPAR  # Input parameters - minimal models
         3     1.93800000E+01   # tanb                
#
BLOCK EXTPAR  # Input parameters - non-minimal models
         0    -1.00000000E+00   # Set                 
         1    -5.08170000E+02   # M_1(MX)             
         2    -3.26955000E+03   # M_2(MX)             
         3     3.78859000E+03   # M_3(MX)             
        11     3.18340000E+03   # At(MX)              
        12    -1.12232000E+03   # Ab(MX)              
        13    -2.19938000E+03   # Atau(MX)            
        23     8.83800000E+02   # mu(MX)              
        26     1.00999000E+03   # mA(pole)            
        31     1.28684000E+03   # meL(MX)             
        32     1.28684000E+03   # mmuL(MX)            
        33     2.27586000E+03   # mtauL(MX)           
        34     3.20328000E+03   # meR(MX)             
        35     3.20328000E+03   # mmuR(MX)            
        36     3.49049000E+03   # mtauR(MX)           
        41     1.13218000E+03   # mqL1(MX)            
        42     1.13218000E+03   # mqL2(MX)            
        43     2.01945000E+03   # mqL3(MX)            
        44     1.58898000E+03   # muR(MX)             
        45     1.58898000E+03   # mcR(MX)             
        46     1.28695000E+03   # mtR(MX)             
        47     1.41426000E+03   # mdR(MX)             
        48     1.41426000E+03   # msR(MX)             
        49     2.08822000E+03   # mbR(MX)             
#
BLOCK MASS  # Mass Spectrum
# PDG code           mass       particle
        24     8.04072800E+01   # W+
        25     1.27957921E+02   # h
        35     1.00997775E+03   # H
        36     1.00999000E+03   # A
        37     1.01308962E+03   # H+
         5     4.81876030E+00   # b-quark pole mass calculated from mb(mb)_Msbar
   1000001     1.01092412E+03   # ~d_L
   2000001     1.34210088E+03   # ~d_R
   1000002     1.00791455E+03   # ~u_L
   2000002     1.52812567E+03   # ~u_R
   1000003     1.01092412E+03   # ~s_L
   2000003     1.34210088E+03   # ~s_R
   1000004     1.00791455E+03   # ~c_L
   2000004     1.52812567E+03   # ~c_R
   1000005     1.96296063E+03   # ~b_1
   2000005     2.06824438E+03   # ~b_2
   1000006     1.11779777E+03   # ~t_1
   2000006     1.99058624E+03   # ~t_2
   1000011     1.28044538E+03   # ~e_L
   2000011     3.20928567E+03   # ~e_R
   1000012     1.27775086E+03   # ~nu_eL
   1000013     1.28044538E+03   # ~mu_L
   2000013     3.20928567E+03   # ~mu_R
   1000014     1.27775086E+03   # ~nu_muL
   1000015     2.27951783E+03   # ~tau_1
   2000015     3.49524906E+03   # ~tau_2
   1000016     2.27788798E+03   # ~nu_tauL
   1000021     3.66542870E+03   # ~g
   1000022    -5.05245027E+02   # ~chi_10
   1000023    -9.07254788E+02   # ~chi_20
   1000025     9.08446016E+02   # ~chi_30
   1000035    -3.22220784E+03   # ~chi_40
   1000024     9.06399925E+02   # ~chi_1+
   1000037     3.22237202E+03   # ~chi_2+
#
BLOCK NMIX  # Neutralino Mixing Matrix
  1  1     9.96827073E-01   # N_11
  1  2    -9.69852466E-04   # N_12
  1  3     7.04666748E-02   # N_13
  1  4     3.70039595E-02   # N_14
  2  1    -7.60047903E-02   # N_21
  2  2    -2.27087515E-02   # N_22
  2  3     7.04516040E-01   # N_23
  2  4     7.05240905E-01   # N_24
  3  1     2.36405970E-02   # N_31
  3  2    -1.41787423E-02   # N_32
  3  3    -7.06155020E-01   # N_33
  3  4     7.07520440E-01   # N_34
  4  1    -4.24156995E-04   # N_41
  4  2     9.99641103E-01   # N_42
  4  3     6.05680566E-03   # N_43
  4  4     2.60921432E-02   # N_44
#
BLOCK UMIX  # Chargino Mixing Matrix U
  1  1    -8.62572426E-03   # U_11
  1  2     9.99962798E-01   # U_12
  2  1    -9.99962798E-01   # U_21
  2  2    -8.62572426E-03   # U_22
#
BLOCK VMIX  # Chargino Mixing Matrix V
  1  1     3.70208361E-02   # V_11
  1  2     9.99314494E-01   # V_12
  2  1     9.99314494E-01   # V_21
  2  2    -3.70208361E-02   # V_22
#
BLOCK STOPMIX  # Stop Mixing Matrix
  1  1    -1.83975521E-01   # cos(theta_t)
  1  2     9.82930825E-01   # sin(theta_t)
  2  1    -9.82930825E-01   # -sin(theta_t)
  2  2    -1.83975521E-01   # cos(theta_t)
#
BLOCK SBOTMIX  # Sbottom Mixing Matrix
  1  1     9.96182453E-01   # cos(theta_b)
  1  2     8.72955917E-02   # sin(theta_b)
  2  1    -8.72955917E-02   # -sin(theta_b)
  2  2     9.96182453E-01   # cos(theta_b)
#
BLOCK STAUMIX  # Stau Mixing Matrix
  1  1     9.99989239E-01   # cos(theta_tau)
  1  2     4.63916848E-03   # sin(theta_tau)
  2  1    -4.63916848E-03   # -sin(theta_tau)
  2  2     9.99989239E-01   # cos(theta_tau)
#
BLOCK ALPHA  # Higgs mixing
          -5.48813763E-02   # Mixing angle in the neutral Higgs boson sector
#
BLOCK HMIX Q=  1.60629700E+03  # DRbar Higgs Parameters
         1     8.95092007E+02   # mu(Q)MSSM           
         2     1.86519358E+01   # tan                 
         3     2.44154985E+02   # higgs               
         4     1.43520873E+06   # mA^2(Q)MSSM         
#
BLOCK GAUGE Q=  1.60629700E+03  # The gauge couplings
     1     3.62956683E-01   # gprime(Q) DRbar
     2     6.35824542E-01   # g(Q) DRbar
     3     1.02274571E+00   # g3(Q) DRbar
#
BLOCK AU Q=  1.60629700E+03  # The trilinear couplings
  1  1     0.00000000E+00   # A_u(Q) DRbar
  2  2     0.00000000E+00   # A_c(Q) DRbar
  3  3     3.18340001E+03   # A_t(Q) DRbar
#
BLOCK AD Q=  1.60629700E+03  # The trilinear couplings
  1  1     0.00000000E+00   # A_d(Q) DRbar
  2  2     0.00000000E+00   # A_s(Q) DRbar
  3  3    -1.12232000E+03   # A_b(Q) DRbar
#
BLOCK AE Q=  1.60629700E+03  # The trilinear couplings
  1  1     0.00000000E+00   # A_e(Q) DRbar
  2  2     0.00000000E+00   # A_mu(Q) DRbar
  3  3    -2.19938000E+03   # A_tau(Q) DRbar
#
BLOCK Yu Q=  1.60629700E+03  # The Yukawa couplings
  1  1     0.00000000E+00   # y_u(Q) DRbar
  2  2     0.00000000E+00   # y_c(Q) DRbar
  3  3     8.48822342E-01   # y_t(Q) DRbar
#
BLOCK Yd Q=  1.60629700E+03  # The Yukawa couplings
  1  1     0.00000000E+00   # y_d(Q) DRbar
  2  2     0.00000000E+00   # y_s(Q) DRbar
  3  3     2.31808057E-01   # y_b(Q) DRbar
#
BLOCK Ye Q=  1.60629700E+03  # The Yukawa couplings
  1  1     0.00000000E+00   # y_e(Q) DRbar
  2  2     0.00000000E+00   # y_mu(Q) DRbar
  3  3     1.86395794E-01   # y_tau(Q) DRbar
#
BLOCK MSOFT Q=  1.60629700E+03  # The soft SUSY breaking masses at the scale Q
         1    -5.08170000E+02   # M_1(Q)              
         2    -3.26955000E+03   # M_2(Q)              
         3     3.78859000E+03   # M_3(Q)              
        21     2.58619388E+05   # mH1^2(Q)            
        22    -7.01198574E+05   # mH2^2(Q)            
        31     1.28684000E+03   # meL(Q)              
        32     1.28684000E+03   # mmuL(Q)             
        33     2.27586000E+03   # mtauL(Q)            
        34     3.20328000E+03   # meR(Q)              
        35     3.20328000E+03   # mmuR(Q)             
        36     3.49049000E+03   # mtauR(Q)            
        41     1.13217999E+03   # mqL1(Q)             
        42     1.13217999E+03   # mqL2(Q)             
        43     2.01944999E+03   # mqL3(Q)             
        44     1.58897999E+03   # muR(Q)              
        45     1.58897999E+03   # mcR(Q)              
        46     1.28694998E+03   # mtR(Q)              
        47     1.41425999E+03   # mdR(Q)              
        48     1.41425999E+03   # msR(Q)              
        49     2.08821999E+03   # mbR(Q)              
#
Block HiggsBoundsInputHiggsCouplingsFermions
# ScalarNormEffCoupSq PseudoSNormEffCoupSq NP   IP1 IP2 IP2
    1.04980419E+00    0.00000000E+00        3  25   5   5  # h0-b-b eff. coupling^2, normalised to SM
    3.47844905E+02    0.00000000E+00        3  35   5   5  # H0-b-b eff. coupling^2, normalised to SM
    0.00000000E+00    3.47894709E+02        3  36   5   5  # A0-b-b eff. coupling^2, normalised to SM
#
    9.99856841E-01    0.00000000E+00        3  25   6   6  # h0-t-t eff. coupling^2, normalised to SM
    3.01759170E-03    0.00000000E+00        3  35   6   6  # H0-t-t eff. coupling^2, normalised to SM
    0.00000000E+00    2.87443291E-03        3  36   6   6  # A0-t-t eff. coupling^2, normalised to SM
#
    1.04980419E+00    0.00000000E+00        3  25  15  15  # h0-tau-tau eff. coupling^2, normalised to SM
    3.47844905E+02    0.00000000E+00        3  35  15  15  # H0-tau-tau eff. coupling^2, normalised to SM
    0.00000000E+00    3.47894709E+02        3  36  15  15  # A0-tau-tau eff. coupling^2, normalised to SM
#
Block HiggsBoundsInputHiggsCouplingsBosons
    9.99998260E-01        3  25  24  24  # h0-W-W eff. coupling^2, normalised to SM
    1.73954774E-06        3  35  24  24  # H0-W-W eff. coupling^2, normalised to SM
    0.00000000E+00        3  36  24  24  # A0-W-W eff. coupling^2, normalised to SM
#
    9.99998260E-01        3  25  23  23  # h0-Z-Z eff. coupling^2, normalised to SM
    1.73954774E-06        3  35  23  23  # H0-Z-Z eff. coupling^2, normalised to SM
    0.00000000E+00        3  36  23  23  # A0-Z-Z eff. coupling^2, normalised to SM
#
    8.62560670E-01        3  25  21  21  # h0-g-g eff. coupling^2, normalised to SM
    2.73741956E-05        3  35  21  21  # H0-g-g eff. coupling^2, normalised to SM
    3.20348323E-04        3  36  21  21  # A0-g-g eff. coupling^2, normalised to SM
#
    0.00000000E+00        3  25  25  23  # h0-h0-Z eff. coupling^2, normalised to SM
    0.00000000E+00        3  35  25  23  # H0-h0-Z eff. coupling^2, normalised to SM
    1.73954774E-06        3  36  25  23  # A0-h0-Z eff. coupling^2, normalised to SM
    0.00000000E+00        3  35  35  23  # H0-H0-Z eff. coupling^2, normalised to SM
    9.99998260E-01        3  36  35  23  # A0-H0-Z eff. coupling^2, normalised to SM
    0.00000000E+00        3  36  36  23  # A0-A0-Z eff. coupling^2, normalised to SM
#
    0.00000000E+00        4  25  21  21  23  # h0-g-g-Z eff. coupling^2, normalised to SM
    0.00000000E+00        4  35  21  21  23  # H0-g-g-Z eff. coupling^2, normalised to SM
    0.00000000E+00        4  36  21  21  23  # A0-g-g-Z eff. coupling^2, normalised to SM
#
#
#
#                             =================
#                             |The decay table|
#                             =================
#
# - The QCD corrections to the decays gluino -> squark  + quark
#                                     squark -> gaugino + quark_prime
#                                     squark -> squark_prime + Higgs
#                                     squark -> gluino  + quark
#   are included.
#
# - The multi-body decays for the inos, stops and sbottoms are included.
#
# - The loop induced decays for the gluino, neutralinos and stops
#   are included.
#
# - The SUSY decays of the top quark are included.
#
#
#         PDG            Width
DECAY         6     1.42302110E+00   # top decays
#          BR         NDA      ID1       ID2
     1.00000000E+00    2           5        24   # BR(t ->  b    W+)
#
#         PDG            Width
DECAY   1000021     6.33231846E+02   # gluino decays
#          BR         NDA      ID1       ID2
     4.97277927E-02    2     1000001        -1   # BR(~g -> ~d_L  db)
     4.97277927E-02    2    -1000001         1   # BR(~g -> ~d_L* d )
     4.36803104E-02    2     2000001        -1   # BR(~g -> ~d_R  db)
     4.36803104E-02    2    -2000001         1   # BR(~g -> ~d_R* d )
     4.97764839E-02    2     1000002        -2   # BR(~g -> ~u_L  ub)
     4.97764839E-02    2    -1000002         2   # BR(~g -> ~u_L* u )
     3.97630099E-02    2     2000002        -2   # BR(~g -> ~u_R  ub)
     3.97630099E-02    2    -2000002         2   # BR(~g -> ~u_R* u )
     4.97277927E-02    2     1000003        -3   # BR(~g -> ~s_L  sb)
     4.97277927E-02    2    -1000003         3   # BR(~g -> ~s_L* s )
     4.36803104E-02    2     2000003        -3   # BR(~g -> ~s_R  sb)
     4.36803104E-02    2    -2000003         3   # BR(~g -> ~s_R* s )
     4.97764822E-02    2     1000004        -4   # BR(~g -> ~c_L  cb)
     4.97764822E-02    2    -1000004         4   # BR(~g -> ~c_L* c )
     3.97630059E-02    2     2000004        -4   # BR(~g -> ~c_R  cb)
     3.97630059E-02    2    -2000004         4   # BR(~g -> ~c_R* c )
     2.97084706E-02    2     1000005        -5   # BR(~g -> ~b_1  bb)
     2.97084706E-02    2    -1000005         5   # BR(~g -> ~b_1* b )
     2.71708490E-02    2     2000005        -5   # BR(~g -> ~b_2  bb)
     2.71708490E-02    2    -2000005         5   # BR(~g -> ~b_2* b )
     4.95352661E-02    2     1000006        -6   # BR(~g -> ~t_1  tb)
     4.95352661E-02    2    -1000006         6   # BR(~g -> ~t_1* t )
     2.76902261E-02    2     2000006        -6   # BR(~g -> ~t_2  tb)
     2.76902261E-02    2    -2000006         6   # BR(~g -> ~t_2* t )
#
#         PDG            Width
DECAY   1000006     4.34548612E+00   # stop1 decays
#          BR         NDA      ID1       ID2
     3.43650060E-01    2     1000022         6   # BR(~t_1 -> ~chi_10 t )
     8.71376864E-02    2     1000023         6   # BR(~t_1 -> ~chi_20 t )
     1.45786689E-01    2     1000025         6   # BR(~t_1 -> ~chi_30 t )
     4.23425564E-01    2     1000024         5   # BR(~t_1 -> ~chi_1+ b )
#
#         PDG            Width
DECAY   2000006     6.62739715E+01   # stop2 decays
#          BR         NDA      ID1       ID2
     4.47073539E-03    2     1000022         6   # BR(~t_2 -> ~chi_10 t )
     1.36133296E-01    2     1000023         6   # BR(~t_2 -> ~chi_20 t )
     1.26228357E-01    2     1000025         6   # BR(~t_2 -> ~chi_30 t )
     2.60595201E-02    2     1000024         5   # BR(~t_2 -> ~chi_1+ b )
     3.13674118E-01    2     1000006        25   # BR(~t_2 -> ~t_1    h )
     3.93433974E-01    2     1000006        23   # BR(~t_2 -> ~t_1    Z )
#
#         PDG            Width
DECAY   1000005     6.63523538E+01   # sbottom1 decays
#          BR         NDA      ID1       ID2
     4.36936405E-03    2     1000022         5   # BR(~b_1 -> ~chi_10 b )
     9.62239922E-03    2     1000023         5   # BR(~b_1 -> ~chi_20 b )
     9.63299409E-03    2     1000025         5   # BR(~b_1 -> ~chi_30 b )
     2.52243256E-01    2    -1000024         6   # BR(~b_1 -> ~chi_1- t )
     7.24131987E-01    2     1000006       -24   # BR(~b_1 -> ~t_1    W-)
#
#         PDG            Width
DECAY   2000005     4.61309408E+00   # sbottom2 decays
#          BR         NDA      ID1       ID2
     2.24501129E-01    2     1000022         5   # BR(~b_2 -> ~chi_10 b )
     1.57528697E-01    2     1000023         5   # BR(~b_2 -> ~chi_20 b )
     1.57917276E-01    2     1000025         5   # BR(~b_2 -> ~chi_30 b )
     3.51607772E-01    2    -1000024         6   # BR(~b_2 -> ~chi_1- t )
     5.66770428E-04    2     1000005        23   # BR(~b_2 -> ~b_1    Z )
     1.07878356E-01    2     1000006       -24   # BR(~b_2 -> ~t_1    W-)
#
#         PDG            Width
DECAY   1000002     8.53773323E-02   # sup_L decays
#          BR         NDA      ID1       ID2
     9.92117829E-01    2     1000022         2   # BR(~u_L -> ~chi_10 u)
     2.55774402E-03    2     1000023         2   # BR(~u_L -> ~chi_20 u)
     1.69668080E-04    2     1000025         2   # BR(~u_L -> ~chi_30 u)
     5.15475894E-03    2     1000024         1   # BR(~u_L -> ~chi_1+ d)
#
#         PDG            Width
DECAY   2000002     2.88610437E+00   # sup_R decays
#          BR         NDA      ID1       ID2
     9.96628707E-01    2     1000022         2   # BR(~u_R -> ~chi_10 u)
     3.07467323E-03    2     1000023         2   # BR(~u_R -> ~chi_20 u)
     2.96620205E-04    2     1000025         2   # BR(~u_R -> ~chi_30 u)
#
#         PDG            Width
DECAY   1000001     8.71388859E-02   # sdown_L decays
#          BR         NDA      ID1       ID2
     9.98928955E-01    2     1000022         1   # BR(~d_L -> ~chi_10 d)
     1.29943870E-04    2     1000023         1   # BR(~d_L -> ~chi_20 d)
     6.52383880E-04    2     1000025         1   # BR(~d_L -> ~chi_30 d)
     2.88717596E-04    2    -1000024         2   # BR(~d_L -> ~chi_1- u)
#
#         PDG            Width
DECAY   2000001     5.91813263E-01   # sdown_R decays
#          BR         NDA      ID1       ID2
     9.97438330E-01    2     1000022         1   # BR(~d_R -> ~chi_10 d)
     2.33660133E-03    2     1000023         1   # BR(~d_R -> ~chi_20 d)
     2.25069069E-04    2     1000025         1   # BR(~d_R -> ~chi_30 d)
#
#         PDG            Width
DECAY   1000004     8.15337106E-02   # scharm_L decays
#          BR         NDA      ID1       ID2
     9.92376723E-01    2     1000022         4   # BR(~c_L -> ~chi_10 c)
     2.47309797E-03    2     1000023         4   # BR(~c_L -> ~chi_20 c)
     1.63988973E-04    2     1000025         4   # BR(~c_L -> ~chi_30 c)
     4.98619054E-03    2     1000024         3   # BR(~c_L -> ~chi_1+ s)
#
#         PDG            Width
DECAY   2000004     2.81574080E+00   # scharm_R decays
#          BR         NDA      ID1       ID2
     9.96642387E-01    2     1000022         4   # BR(~c_R -> ~chi_10 c)
     3.06220275E-03    2     1000023         4   # BR(~c_R -> ~chi_20 c)
     2.95410228E-04    2     1000025         4   # BR(~c_R -> ~chi_30 c)
#
#         PDG            Width
DECAY   1000003     8.32485477E-02   # sstrange_L decays
#          BR         NDA      ID1       ID2
     9.98963841E-01    2     1000022         3   # BR(~s_L -> ~chi_10 s)
     1.25734927E-04    2     1000023         3   # BR(~s_L -> ~chi_20 s)
     6.31017263E-04    2     1000025         3   # BR(~s_L -> ~chi_30 s)
     2.79406934E-04    2    -1000024         4   # BR(~s_L -> ~chi_1- c)
#
#         PDG            Width
DECAY   2000003     5.73608761E-01   # sstrange_R decays
#          BR         NDA      ID1       ID2
     9.97455150E-01    2     1000022         3   # BR(~s_R -> ~chi_10 s)
     2.32126810E-03    2     1000023         3   # BR(~s_R -> ~chi_20 s)
     2.23582302E-04    2     1000025         3   # BR(~s_R -> ~chi_30 s)
#
#         PDG            Width
DECAY   1000011     1.19024126E+00   # selectron_L decays
#          BR         NDA      ID1       ID2
     9.95152867E-01    2     1000022        11   # BR(~e_L -> ~chi_10 e-)
     4.68639734E-03    2     1000023        11   # BR(~e_L -> ~chi_20 e-)
     4.98716149E-07    2     1000025        11   # BR(~e_L -> ~chi_30 e-)
     1.60236915E-04    2    -1000024        12   # BR(~e_L -> ~chi_1- nu_e)
#
#         PDG            Width
DECAY   2000011     1.59873448E+01   # selectron_R decays
#          BR         NDA      ID1       ID2
     9.94356793E-01    2     1000022        11   # BR(~e_R -> ~chi_10 e-)
     5.14561466E-03    2     1000023        11   # BR(~e_R -> ~chi_20 e-)
     4.97592628E-04    2     1000025        11   # BR(~e_R -> ~chi_30 e-)
#
#         PDG            Width
DECAY   1000013     1.19024124E+00   # smuon_L decays
#          BR         NDA      ID1       ID2
     9.95152867E-01    2     1000022        13   # BR(~mu_L -> ~chi_10 mu-)
     4.68639717E-03    2     1000023        13   # BR(~mu_L -> ~chi_20 mu-)
     4.98716131E-07    2     1000025        13   # BR(~mu_L -> ~chi_30 mu-)
     1.60236919E-04    2    -1000024        14   # BR(~mu_L -> ~chi_1- nu_mu)
#
#         PDG            Width
DECAY   2000013     1.59873448E+01   # smuon_R decays
#          BR         NDA      ID1       ID2
     9.94356793E-01    2     1000022        13   # BR(~mu_R -> ~chi_10 mu-)
     5.14561465E-03    2     1000023        13   # BR(~mu_R -> ~chi_20 mu-)
     4.97592628E-04    2     1000025        13   # BR(~mu_R -> ~chi_30 mu-)
#
#         PDG            Width
DECAY   1000015     3.82181660E+00   # stau_1 decays
#          BR         NDA      ID1       ID2
     7.02019190E-01    2     1000022        15   # BR(~tau_1 -> ~chi_10  tau-)
     1.52306858E-01    2     1000023        15   # BR(~tau_1 -> ~chi_20  tau-)
     1.45334923E-01    2     1000025        15   # BR(~tau_1 -> ~chi_30  tau-)
     3.39029397E-04    2    -1000024        16   # BR(~tau_1 -> ~chi_1-  nu_tau)
#
#         PDG            Width
DECAY   2000015     2.25507846E+01   # stau_2 decays
#          BR         NDA      ID1       ID2
     7.74310005E-01    2     1000022        15   # BR(~tau_2 -> ~chi_10  tau-)
     5.03547679E-02    2     1000023        15   # BR(~tau_2 -> ~chi_20  tau-)
     4.68860924E-02    2     1000025        15   # BR(~tau_2 -> ~chi_30  tau-)
     7.20516513E-07    2     1000035        15   # BR(~tau_2 -> ~chi_40  tau-)
     9.31730651E-02    2    -1000024        16   # BR(~tau_2 -> ~chi_1-  nu_tau)
     1.44187451E-06    2    -1000037        16   # BR(~tau_2 -> ~chi_2-  nu_tau)
     1.27079260E-02    2     1000016       -37   # BR(~tau_2 -> ~nu_tauL H-)
     4.79277951E-03    2     1000016       -24   # BR(~tau_2 -> ~nu_tauL W-)
     2.57757193E-03    2     1000015        25   # BR(~tau_2 -> ~tau_1   h)
     6.36482060E-03    2     1000015        35   # BR(~tau_2 -> ~tau_1   H)
     6.37313107E-03    2     1000015        36   # BR(~tau_2 -> ~tau_1   A)
     2.45767817E-03    2     1000015        23   # BR(~tau_2 -> ~tau_1   Z)
#
#         PDG            Width
DECAY   1000012     1.19319138E+00   # snu_eL decays
#          BR         NDA      ID1       ID2
     9.95827488E-01    2     1000022        12   # BR(~nu_eL -> ~chi_10 nu_e)
     4.52711059E-04    2     1000023        12   # BR(~nu_eL -> ~chi_20 nu_e)
     8.06516745E-04    2     1000025        12   # BR(~nu_eL -> ~chi_30 nu_e)
     2.91328378E-03    2     1000024        11   # BR(~nu_eL -> ~chi_1+ e-)
#
#         PDG            Width
DECAY   1000014     1.19319138E+00   # snu_muL decays
#          BR         NDA      ID1       ID2
     9.95827489E-01    2     1000022        14   # BR(~nu_muL -> ~chi_10 nu_mu)
     4.52711059E-04    2     1000023        14   # BR(~nu_muL -> ~chi_20 nu_mu)
     8.06516745E-04    2     1000025        14   # BR(~nu_muL -> ~chi_30 nu_mu)
     2.91328361E-03    2     1000024        13   # BR(~nu_muL -> ~chi_1+ mu-)
#
#         PDG            Width
DECAY   1000016     3.83155647E+00   # snu_tauL decays
#          BR         NDA      ID1       ID2
     7.02209477E-01    2     1000022        16   # BR(~nu_tauL -> ~chi_10 nu_tau)
     7.23644706E-04    2     1000023        16   # BR(~nu_tauL -> ~chi_20 nu_tau)
     1.29482487E-03    2     1000025        16   # BR(~nu_tauL -> ~chi_30 nu_tau)
     2.95772054E-01    2     1000024        15   # BR(~nu_tauL -> ~chi_1+ tau-)
#
#         PDG            Width
DECAY   1000024     4.58802007E-01   # chargino1+ decays
#          BR         NDA      ID1       ID2
     1.00000000E+00    2     1000022        24   # BR(~chi_1+ -> ~chi_10  W+)
#
#         PDG            Width
DECAY   1000037     2.42879792E+02   # chargino2+ decays
#          BR         NDA      ID1       ID2
     1.27682515E-01    2     1000002        -1   # BR(~chi_2+ -> ~u_L     db)
     1.27684079E-01    2    -1000001         2   # BR(~chi_2+ -> ~d_L*    u )
     1.27682515E-01    2     1000004        -3   # BR(~chi_2+ -> ~c_L     sb)
     1.27684071E-01    2    -1000003         4   # BR(~chi_2+ -> ~s_L*     c )
     2.26644545E-03    2     1000006        -5   # BR(~chi_2+ -> ~t_1     bb)
     6.01569016E-02    2     2000006        -5   # BR(~chi_2+ -> ~t_2     bb)
     6.15437190E-02    2    -1000005         6   # BR(~chi_2+ -> ~b_1*    t )
     4.42613698E-04    2    -2000005         6   # BR(~chi_2+ -> ~b_2*    t )
     3.78424670E-02    2     1000012       -11   # BR(~chi_2+ -> ~nu_eL   e+  )
     3.78424670E-02    2     1000014       -13   # BR(~chi_2+ -> ~nu_muL mu+ )
     1.33359349E-02    2     1000016       -15   # BR(~chi_2+ -> ~nu_tau1 tau+)
     3.78319132E-02    2    -1000011        12   # BR(~chi_2+ -> ~e_L+    nu_e)
     3.78319132E-02    2    -1000013        14   # BR(~chi_2+ -> ~mu_L+   nu_mu)
     1.33142685E-02    2    -1000015        16   # BR(~chi_2+ -> ~tau_1+  nu_tau)
     2.48693145E-02    2     1000024        23   # BR(~chi_2+ -> ~chi_1+  Z )
     2.31902656E-05    2     1000022        24   # BR(~chi_2+ -> ~chi_10  W+)
     2.38553620E-02    2     1000023        24   # BR(~chi_2+ -> ~chi_20  W+)
     2.40914658E-02    2     1000025        24   # BR(~chi_2+ -> ~chi_30  W+)
     2.48638788E-02    2     1000024        25   # BR(~chi_2+ -> ~chi_1+  h )
     2.23049750E-02    2     1000024        35   # BR(~chi_2+ -> ~chi_1+  H )
     2.22915633E-02    2     1000024        36   # BR(~chi_2+ -> ~chi_1+  A )
     1.94928165E-04    2     1000022        37   # BR(~chi_2+ -> ~chi_10  H+)
     2.21442857E-02    2     1000023        37   # BR(~chi_2+ -> ~chi_20  H+)
     2.22192135E-02    2     1000025        37   # BR(~chi_2+ -> ~chi_30  H+)
#
#         PDG            Width
DECAY   1000022     0.00000000E+00   # neutralino1 decays
#
#         PDG            Width
DECAY   1000023     4.56092170E-01   # neutralino2 decays
#          BR         NDA      ID1       ID2
     1.02015959E-01    2     1000022        23   # BR(~chi_20 -> ~chi_10   Z )
     8.97984041E-01    2     1000022        25   # BR(~chi_20 -> ~chi_10   h )
#
#         PDG            Width
DECAY   1000025     4.63014007E-01   # neutralino3 decays
#          BR         NDA      ID1       ID2
     9.17397866E-01    2     1000022        23   # BR(~chi_30 -> ~chi_10   Z )
     8.26021339E-02    2     1000022        25   # BR(~chi_30 -> ~chi_10   h )
#
#         PDG            Width
DECAY   1000035     2.42972021E+02   # neutralino4 decays
#          BR         NDA      ID1       ID2
     1.18985638E-05    2     1000022        23   # BR(~chi_40 -> ~chi_10   Z )
     6.89431207E-03    2     1000023        23   # BR(~chi_40 -> ~chi_20   Z )
     1.77732784E-02    2     1000025        23   # BR(~chi_40 -> ~chi_30   Z )
     2.43096095E-02    2     1000024       -24   # BR(~chi_40 -> ~chi_1+   W-)
     2.43096095E-02    2    -1000024        24   # BR(~chi_40 -> ~chi_1-   W+)
     1.17731244E-05    2     1000022        25   # BR(~chi_40 -> ~chi_10   h )
     1.33726373E-04    2     1000022        35   # BR(~chi_40 -> ~chi_10   H )
     6.15202497E-05    2     1000022        36   # BR(~chi_40 -> ~chi_10   A )
     1.78317082E-02    2     1000023        25   # BR(~chi_40 -> ~chi_20   h )
     1.82209139E-02    2     1000023        35   # BR(~chi_40 -> ~chi_20   H )
     3.96776524E-03    2     1000023        36   # BR(~chi_40 -> ~chi_20   A )
     6.97752975E-03    2     1000025        25   # BR(~chi_40 -> ~chi_30   h )
     3.96911274E-03    2     1000025        35   # BR(~chi_40 -> ~chi_30   H )
     1.82679813E-02    2     1000025        36   # BR(~chi_40 -> ~chi_30   A )
     2.22468449E-02    2     1000024       -37   # BR(~chi_40 -> ~chi_1+   H-)
     2.22468449E-02    2    -1000024        37   # BR(~chi_40 -> ~chi_1-   H+)
     6.38440736E-02    2     1000002        -2   # BR(~chi_40 -> ~u_L      ub)
     6.38440736E-02    2    -1000002         2   # BR(~chi_40 -> ~u_L*     u )
     4.92930382E-09    2     2000002        -2   # BR(~chi_40 -> ~u_R      ub)
     4.92930382E-09    2    -2000002         2   # BR(~chi_40 -> ~u_R*     u )
     6.37826837E-02    2     1000001        -1   # BR(~chi_40 -> ~d_L      db)
     6.37826837E-02    2    -1000001         1   # BR(~chi_40 -> ~d_L*     d )
     1.39969388E-09    2     2000001        -1   # BR(~chi_40 -> ~d_R      db)
     1.39969388E-09    2    -2000001         1   # BR(~chi_40 -> ~d_R*     d )
     6.38440697E-02    2     1000004        -4   # BR(~chi_40 -> ~c_L      cb)
     6.38440697E-02    2    -1000004         4   # BR(~chi_40 -> ~c_L*     c )
     4.92930289E-09    2     2000004        -4   # BR(~chi_40 -> ~c_R      cb)
     4.92930289E-09    2    -2000004         4   # BR(~chi_40 -> ~c_R*     c )
     6.37826837E-02    2     1000003        -3   # BR(~chi_40 -> ~s _L      sb)
     6.37826837E-02    2    -1000003         3   # BR(~chi_40 -> ~s _L*     s )
     1.39969388E-09    2     2000003        -3   # BR(~chi_40 -> ~s _R      sb)
     1.39969388E-09    2    -2000003         3   # BR(~chi_40 -> ~s _R*     s )
     1.12190799E-03    2     1000006        -6   # BR(~chi_40 -> ~t_1      tb)
     1.12190799E-03    2    -1000006         6   # BR(~chi_40 -> ~t_1*     t )
     2.94628376E-02    2     2000006        -6   # BR(~chi_40 -> ~t_2      tb)
     2.94628376E-02    2    -2000006         6   # BR(~chi_40 -> ~t_2*     t )
     3.13624766E-02    2     1000005        -5   # BR(~chi_40 -> ~b_1      bb)
     3.13624766E-02    2    -1000005         5   # BR(~chi_40 -> ~b_1*     b )
     2.25950706E-04    2     2000005        -5   # BR(~chi_40 -> ~b_2      bb)
     2.25950706E-04    2    -2000005         5   # BR(~chi_40 -> ~b_2*     b )
     1.88857751E-02    2     1000011       -11   # BR(~chi_40 -> ~e_L-     e+)
     1.88857751E-02    2    -1000011        11   # BR(~chi_40 -> ~e_L+     e-)
     4.00655088E-13    2     2000011       -11   # BR(~chi_40 -> ~e_R-     e+)
     4.00655088E-13    2    -2000011        11   # BR(~chi_40 -> ~e_R+     e-)
     1.88857751E-02    2     1000013       -13   # BR(~chi_40 -> ~mu_L-    mu+)
     1.88857751E-02    2    -1000013        13   # BR(~chi_40 -> ~mu_L+    mu-)
     4.00655088E-13    2     2000013       -13   # BR(~chi_40 -> ~mu_R-    mu+)
     4.00655088E-13    2    -2000013        13   # BR(~chi_40 -> ~mu_R+    mu-)
     6.64551793E-03    2     1000015       -15   # BR(~chi_40 -> ~tau_1-   tau+)
     6.64551793E-03    2    -1000015        15   # BR(~chi_40 -> ~tau_1+   tau-)
     1.89339016E-02    2     1000012       -12   # BR(~chi_40 -> ~nu_eL    nu_eb)
     1.89339016E-02    2    -1000012        12   # BR(~chi_40 -> ~nu_eL*   nu_e )
     1.89339016E-02    2     1000014       -14   # BR(~chi_40 -> ~nu_muL   nu_mub)
     1.89339016E-02    2    -1000014        14   # BR(~chi_40 -> ~nu_muL*  nu_mu )
     6.67121810E-03    2     1000016       -16   # BR(~chi_40 -> ~nu_tau1  nu_taub)
     6.67121810E-03    2    -1000016        16   # BR(~chi_40 -> ~nu_tau1* nu_tau )
#
#         PDG            Width
DECAY        25     4.81055311E-03   # h decays
#          BR         NDA      ID1       ID2
     5.79034604E-01    2           5        -5   # BR(h -> b       bb     )
     5.78550784E-02    2         -15        15   # BR(h -> tau+    tau-   )
     2.04854543E-04    2         -13        13   # BR(h -> mu+     mu-    )
     2.20920585E-04    2           3        -3   # BR(h -> s       sb     )
     1.83683264E-02    2           4        -4   # BR(h -> c       cb     )
     7.00413011E-02    2          21        21   # BR(h -> g       g      )
     2.17105610E-03    2          22        22   # BR(h -> gam     gam    )
     1.67765248E-03    2          22        23   # BR(h -> Z       gam    )
     2.39185224E-01    2          24       -24   # BR(h -> W+      W-     )
     3.12409825E-02    2          23        23   # BR(h -> Z       Z      )
#
#         PDG            Width
DECAY        35     4.74054561E+00   # H decays
#          BR         NDA      ID1       ID2
     8.12027881E-01    2           5        -5   # BR(H -> b       bb     )
     1.59148214E-01    2         -15        15   # BR(H -> tau+    tau-   )
     5.71710885E-04    2         -13        13   # BR(H -> mu+     mu-    )
     3.09729318E-04    2           3        -3   # BR(H -> s       sb     )
     3.08079701E-07    2           4        -4   # BR(H -> c       cb     )
     2.71541977E-02    2           6        -6   # BR(H -> t       tb     )
     7.82732253E-05    2          21        21   # BR(H -> g       g      )
     8.19254134E-08    2          22        22   # BR(H -> gam     gam    )
     5.51793794E-08    2          23        22   # BR(H -> Z       gam    )
     1.17303232E-04    2          24       -24   # BR(H -> W+      W-     )
     5.79393649E-05    2          23        23   # BR(H -> Z       Z      )
     5.34306402E-04    2          25        25   # BR(H -> h       h      )
#
#         PDG            Width
DECAY        36     4.74588242E+00   # A decays
#          BR         NDA      ID1       ID2
     8.11346566E-01    2           5        -5   # BR(A -> b       bb     )
     1.58995512E-01    2         -15        15   # BR(A -> tau+    tau-   )
     5.71154651E-04    2         -13        13   # BR(A -> mu+     mu-    )
     3.09498219E-04    2           3        -3   # BR(A -> s       sb     )
     2.95816490E-07    2           4        -4   # BR(A -> c       cb     )
     2.83940186E-02    2           6        -6   # BR(A -> t       tb     )
     2.67468024E-04    2          21        21   # BR(A -> g       g      )
     2.96459445E-07    2          22        22   # BR(A -> gam     gam    )
     1.43244298E-07    2          23        22   # BR(A -> Z       gam    )
     1.15047283E-04    2          23        25   # BR(A -> Z       h      )
#
#         PDG            Width
DECAY        37     4.24828249E+00   # H+ decays
#          BR         NDA      ID1       ID2
     1.35183108E-03    2           4        -5   # BR(H+ -> c       bb     )
     1.78163715E-01    2         -15        16   # BR(H+ -> tau+    nu_tau )
     6.40011970E-04    2         -13        14   # BR(H+ -> mu+     nu_mu  )
     1.35181798E-05    2           2        -5   # BR(H+ -> u       bb     )
     1.72703787E-05    2           2        -3   # BR(H+ -> u       sb     )
     3.40249574E-04    2           4        -3   # BR(H+ -> c       sb     )
     8.19342890E-01    2           6        -5   # BR(H+ -> t       bb     )
     1.30514226E-04    2          24        25   # BR(H+ -> W+      h      )
     8.83188856E-11    2          24        36   # BR(H+ -> W+      A      )
