#
#                              ======================
#                              | THE SUSYHIT OUTPUT |
#                              ======================
#
#
#              ------------------------------------------------------
#              |     This is the output of the SUSY-HIT package     |
#              |  created by A.Djouadi, M.Muehlleitner and M.Spira. |
#              |  In case of problems with SUSY-HIT email to        |
#              |           margarete.muehlleitner@cern.ch           |
#              |           michael.spira@psi.ch                     |
#              |           abdelhak.djouadi@cern.ch                 |
#              ------------------------------------------------------
#
#              ------------------------------------------------------
#              |  SUSY Les Houches Accord - MSSM Spectrum + Decays  |
#              |              based on the decay programs           |
#              |                                                    |
#              |                     SDECAY 1.3b                    |
#              |                                                    |
#              |  Authors: M.Muhlleitner, A.Djouadi and Y.Mambrini  |
#              |  Ref.:    Comput.Phys.Commun.168(2005)46           |
#              |           [hep-ph/0311167]                         |
#              |                                                    |
#              |                     HDECAY 3.4                     |
#              |                                                    |
#              |  By: A.Djouadi,J.Kalinowski,M.Muhlleitner,M.Spira  |
#              |  Ref.:    Comput.Phys.Commun.108(1998)56           |
#              |           [hep-ph/9704448]                         |
#              |                                                    |
#              |                                                    |
#              |  If not stated otherwise all DRbar couplings and   |
#              |  soft SUSY breaking masses are given at the scale  |
#              |  Q=  0.20547000E+04
#              |                                                    |
#              ------------------------------------------------------
#
#
BLOCK DCINFO  # Decay Program information
     1   SDECAY/HDECAY # decay calculator
     2   1.3b  /3.4    # version number
#
BLOCK SPINFO  # Spectrum calculator information
     1     SOFTSUSY    # spectrum calculator               
     2     3.4.0       # version number                    
#
BLOCK MODSEL  # Model selection
     1     0   #  nonUniversal                                     
#
BLOCK SMINPUTS  # Standard Model inputs
         1     1.27908970E+02   # alpha_em^-1(M_Z)^MSbar
         2     1.16637870E-05   # G_F [GeV^-2]
         3     1.18400000E-01   # alpha_S(M_Z)^MSbar
         4     9.11876000E+01   # M_Z pole mass
         5     4.18000000E+00   # mb(mb)^MSbar
         6     1.73200000E+02   # mt pole mass
         7     1.77700000E+00   # mtau pole mass
#
BLOCK MINPAR  # Input parameters - minimal models
         3     5.41100000E+01   # tanb                
#
BLOCK EXTPAR  # Input parameters - non-minimal models
         0    -1.00000000E+00   # Set                 
         1    -2.04640000E+02   # M_1(MX)             
         2    -1.48735000E+03   # M_2(MX)             
         3     3.84597000E+03   # M_3(MX)             
        11    -3.24816000E+03   # At(MX)              
        12     1.40301000E+03   # Ab(MX)              
        13     4.51780000E+02   # Atau(MX)            
        23     2.41460000E+02   # mu(MX)              
        26     1.98660000E+03   # mA(pole)            
        31     5.97630000E+02   # meL(MX)             
        32     5.97630000E+02   # mmuL(MX)            
        33     2.89620000E+02   # mtauL(MX)           
        34     2.60405000E+03   # meR(MX)             
        35     2.60405000E+03   # mmuR(MX)            
        36     2.09855000E+03   # mtauR(MX)           
        41     3.09989000E+03   # mqL1(MX)            
        42     3.09989000E+03   # mqL2(MX)            
        43     1.78138000E+03   # mqL3(MX)            
        44     1.90520000E+03   # muR(MX)             
        45     1.90520000E+03   # mcR(MX)             
        46     2.37355000E+03   # mtR(MX)             
        47     2.02092000E+03   # mdR(MX)             
        48     2.02092000E+03   # msR(MX)             
        49     6.85800000E+02   # mbR(MX)             
#
BLOCK MASS  # Mass Spectrum
# PDG code           mass       particle
        24     8.03702648E+01   # W+
        25     1.26705773E+02   # h
        35     1.98659786E+03   # H
        36     1.98660000E+03   # A
        37     1.98832796E+03   # H+
         5     4.81876030E+00   # b-quark pole mass calculated from mb(mb)_Msbar
   1000001     3.15733428E+03   # ~d_L
   2000001     2.05371913E+03   # ~d_R
   1000002     3.15646201E+03   # ~u_L
   2000002     1.93386140E+03   # ~u_R
   1000003     3.15733428E+03   # ~s_L
   2000003     2.05371913E+03   # ~s_R
   1000004     3.15646201E+03   # ~c_L
   2000004     1.93386140E+03   # ~c_R
   1000005     5.71286464E+02   # ~b_1
   2000005     1.77901563E+03   # ~b_2
   1000006     1.75836598E+03   # ~t_1
   2000006     2.36780658E+03   # ~t_2
   1000011     6.25648309E+02   # ~e_L
   2000011     2.60698618E+03   # ~e_R
   1000012     6.20353101E+02   # ~nu_eL
   1000013     6.25648309E+02   # ~mu_L
   2000013     2.60698618E+03   # ~mu_R
   1000014     6.20353101E+02   # ~nu_muL
   1000015     3.17051047E+02   # ~tau_1
   2000015     2.09051202E+03   # ~tau_2
   1000016     3.07070422E+02   # ~nu_tauL
   1000021     3.78744195E+03   # ~g
   1000022    -1.89356192E+02   # ~chi_10
   1000023     2.54600866E+02   # ~chi_20
   1000025    -2.64034099E+02   # ~chi_30
   1000035    -1.51459134E+03   # ~chi_40
   1000024     2.50530626E+02   # ~chi_1+
   1000037     1.51475505E+03   # ~chi_2+
#
BLOCK NMIX  # Neutralino Mixing Matrix
  1  1     8.88314011E-01   # N_11
  1  2    -1.59461398E-02   # N_12
  1  3     3.67517319E-01   # N_13
  1  4     2.74909000E-01   # N_14
  2  1     6.92471493E-02   # N_21
  2  2    -3.24876202E-02   # N_22
  2  3    -6.99943765E-01   # N_23
  2  4     7.10090215E-01   # N_24
  3  1    -4.53981995E-01   # N_31
  3  2    -4.02118739E-02   # N_32
  3  3     6.12331284E-01   # N_33
  3  4     6.46013740E-01   # N_34
  4  1    -1.84331163E-03   # N_41
  4  2     9.98535568E-01   # N_42
  4  3     7.75532086E-03   # N_43
  4  4     5.35086614E-02   # N_44
#
BLOCK UMIX  # Chargino Mixing Matrix U
  1  1    -1.09920669E-02   # U_11
  1  2     9.99939585E-01   # U_12
  2  1    -9.99939585E-01   # U_21
  2  2    -1.09920669E-02   # U_22
#
BLOCK VMIX  # Chargino Mixing Matrix V
  1  1     7.57344826E-02   # V_11
  1  2     9.97128020E-01   # V_12
  2  1     9.97128020E-01   # V_21
  2  2    -7.57344826E-02   # V_22
#
BLOCK STOPMIX  # Stop Mixing Matrix
  1  1     9.82669694E-01   # cos(theta_t)
  1  2     1.85365241E-01   # sin(theta_t)
  2  1    -1.85365241E-01   # -sin(theta_t)
  2  2     9.82669694E-01   # cos(theta_t)
#
BLOCK SBOTMIX  # Sbottom Mixing Matrix
  1  1     9.44654244E-03   # cos(theta_b)
  1  2     9.99955380E-01   # sin(theta_b)
  2  1    -9.99955380E-01   # -sin(theta_b)
  2  2     9.44654244E-03   # cos(theta_b)
#
BLOCK STAUMIX  # Stau Mixing Matrix
  1  1     9.99988168E-01   # cos(theta_tau)
  1  2     4.86455137E-03   # sin(theta_tau)
  2  1    -4.86455137E-03   # -sin(theta_tau)
  2  2     9.99988168E-01   # cos(theta_tau)
#
BLOCK ALPHA  # Higgs mixing
          -1.86873237E-02   # Mixing angle in the neutral Higgs boson sector
#
BLOCK HMIX Q=  2.05470000E+03  # DRbar Higgs Parameters
         1     2.46288460E+02   # mu(Q)MSSM           
         2     5.37786990E+01   # tan                 
         3     2.42858625E+02   # higgs               
         4     4.02154902E+06   # mA^2(Q)MSSM         
#
BLOCK GAUGE Q=  2.05470000E+03  # The gauge couplings
     1     3.64184754E-01   # gprime(Q) DRbar
     2     6.39173021E-01   # g(Q) DRbar
     3     1.01502720E+00   # g3(Q) DRbar
#
BLOCK AU Q=  2.05470000E+03  # The trilinear couplings
  1  1     0.00000000E+00   # A_u(Q) DRbar
  2  2     0.00000000E+00   # A_c(Q) DRbar
  3  3    -3.24815999E+03   # A_t(Q) DRbar
#
BLOCK AD Q=  2.05470000E+03  # The trilinear couplings
  1  1     0.00000000E+00   # A_d(Q) DRbar
  2  2     0.00000000E+00   # A_s(Q) DRbar
  3  3     1.40301001E+03   # A_b(Q) DRbar
#
BLOCK AE Q=  2.05470000E+03  # The trilinear couplings
  1  1     0.00000000E+00   # A_e(Q) DRbar
  2  2     0.00000000E+00   # A_mu(Q) DRbar
  3  3     4.51780004E+02   # A_tau(Q) DRbar
#
BLOCK Yu Q=  2.05470000E+03  # The Yukawa couplings
  1  1     0.00000000E+00   # y_u(Q) DRbar
  2  2     0.00000000E+00   # y_c(Q) DRbar
  3  3     8.19957155E-01   # y_t(Q) DRbar
#
BLOCK Yd Q=  2.05470000E+03  # The Yukawa couplings
  1  1     0.00000000E+00   # y_d(Q) DRbar
  2  2     0.00000000E+00   # y_s(Q) DRbar
  3  3     6.99545726E-01   # y_b(Q) DRbar
#
BLOCK Ye Q=  2.05470000E+03  # The Yukawa couplings
  1  1     0.00000000E+00   # y_e(Q) DRbar
  2  2     0.00000000E+00   # y_mu(Q) DRbar
  3  3     5.12321855E-01   # y_tau(Q) DRbar
#
BLOCK MSOFT Q=  2.05470000E+03  # The soft SUSY breaking masses at the scale Q
         1    -2.04640000E+02   # M_1(Q)              
         2    -1.48735000E+03   # M_2(Q)              
         3     3.84597000E+03   # M_3(Q)              
        21     4.02480960E+06   # mH1^2(Q)            
        22    -1.41691114E+04   # mH2^2(Q)            
        31     5.97630000E+02   # meL(Q)              
        32     5.97630000E+02   # mmuL(Q)             
        33     2.89620004E+02   # mtauL(Q)            
        34     2.60405000E+03   # meR(Q)              
        35     2.60405000E+03   # mmuR(Q)             
        36     2.09855000E+03   # mtauR(Q)            
        41     3.09988999E+03   # mqL1(Q)             
        42     3.09988999E+03   # mqL2(Q)             
        43     1.78137997E+03   # mqL3(Q)             
        44     1.90519999E+03   # muR(Q)              
        45     1.90519999E+03   # mcR(Q)              
        46     2.37354997E+03   # mtR(Q)              
        47     2.02091999E+03   # mdR(Q)              
        48     2.02091999E+03   # msR(Q)              
        49     6.85799948E+02   # mbR(Q)              
#
Block HiggsBoundsInputHiggsCouplingsFermions
# ScalarNormEffCoupSq PseudoSNormEffCoupSq NP   IP1 IP2 IP2
    1.01021633E+00    0.00000000E+00        3  25   5   5  # h0-b-b eff. coupling^2, normalised to SM
    2.89213825E+03    0.00000000E+00        3  35   5   5  # H0-b-b eff. coupling^2, normalised to SM
    0.00000000E+00    2.89214847E+03        3  36   5   5  # A0-b-b eff. coupling^2, normalised to SM
#
    9.99996468E-01    0.00000000E+00        3  25   6   6  # h0-t-t eff. coupling^2, normalised to SM
    3.49296151E-04    0.00000000E+00        3  35   6   6  # H0-t-t eff. coupling^2, normalised to SM
    0.00000000E+00    3.45763716E-04        3  36   6   6  # A0-t-t eff. coupling^2, normalised to SM
#
    1.01021633E+00    0.00000000E+00        3  25  15  15  # h0-tau-tau eff. coupling^2, normalised to SM
    2.89213825E+03    0.00000000E+00        3  35  15  15  # H0-tau-tau eff. coupling^2, normalised to SM
    0.00000000E+00    2.89214847E+03        3  36  15  15  # A0-tau-tau eff. coupling^2, normalised to SM
#
Block HiggsBoundsInputHiggsCouplingsBosons
    9.99999991E-01        3  25  24  24  # h0-W-W eff. coupling^2, normalised to SM
    8.97634795E-09        3  35  24  24  # H0-W-W eff. coupling^2, normalised to SM
    0.00000000E+00        3  36  24  24  # A0-W-W eff. coupling^2, normalised to SM
#
    9.99999991E-01        3  25  23  23  # h0-Z-Z eff. coupling^2, normalised to SM
    8.97634795E-09        3  35  23  23  # H0-Z-Z eff. coupling^2, normalised to SM
    0.00000000E+00        3  36  23  23  # A0-Z-Z eff. coupling^2, normalised to SM
#
    8.85993014E-01        3  25  21  21  # h0-g-g eff. coupling^2, normalised to SM
    7.02547215E-10        3  35  21  21  # H0-g-g eff. coupling^2, normalised to SM
    1.09706923E-09        3  36  21  21  # A0-g-g eff. coupling^2, normalised to SM
#
    0.00000000E+00        3  25  25  23  # h0-h0-Z eff. coupling^2, normalised to SM
    0.00000000E+00        3  35  25  23  # H0-h0-Z eff. coupling^2, normalised to SM
    8.97634795E-09        3  36  25  23  # A0-h0-Z eff. coupling^2, normalised to SM
    0.00000000E+00        3  35  35  23  # H0-H0-Z eff. coupling^2, normalised to SM
    9.99999991E-01        3  36  35  23  # A0-H0-Z eff. coupling^2, normalised to SM
    0.00000000E+00        3  36  36  23  # A0-A0-Z eff. coupling^2, normalised to SM
#
    0.00000000E+00        4  25  21  21  23  # h0-g-g-Z eff. coupling^2, normalised to SM
    0.00000000E+00        4  35  21  21  23  # H0-g-g-Z eff. coupling^2, normalised to SM
    0.00000000E+00        4  36  21  21  23  # A0-g-g-Z eff. coupling^2, normalised to SM
#
#
#
#                             =================
#                             |The decay table|
#                             =================
#
# - The QCD corrections to the decays gluino -> squark  + quark
#                                     squark -> gaugino + quark_prime
#                                     squark -> squark_prime + Higgs
#                                     squark -> gluino  + quark
#   are included.
#
# - The multi-body decays for the inos, stops and sbottoms are included.
#
# - The loop induced decays for the gluino, neutralinos and stops
#   are included.
#
# - The SUSY decays of the top quark are included.
#
#
#         PDG            Width
DECAY         6     1.43970257E+00   # top decays
#          BR         NDA      ID1       ID2
     1.00000000E+00    2           5        24   # BR(t ->  b    W+)
#
#         PDG            Width
DECAY   1000021     3.62700704E+02   # gluino decays
#          BR         NDA      ID1       ID2
     9.32718038E-03    2     1000001        -1   # BR(~g -> ~d_L  db)
     9.32718038E-03    2    -1000001         1   # BR(~g -> ~d_L* d )
     4.99530519E-02    2     2000001        -1   # BR(~g -> ~d_R  db)
     4.99530519E-02    2    -2000001         1   # BR(~g -> ~d_R* d )
     9.35067249E-03    2     1000002        -2   # BR(~g -> ~u_L  ub)
     9.35067249E-03    2    -1000002         2   # BR(~g -> ~u_L* u )
     5.47793920E-02    2     2000002        -2   # BR(~g -> ~u_R  ub)
     5.47793920E-02    2    -2000002         2   # BR(~g -> ~u_R* u )
     9.32718038E-03    2     1000003        -3   # BR(~g -> ~s_L  sb)
     9.32718038E-03    2    -1000003         3   # BR(~g -> ~s_L* s )
     4.99530519E-02    2     2000003        -3   # BR(~g -> ~s_R  sb)
     4.99530519E-02    2    -2000003         3   # BR(~g -> ~s_R* s )
     9.35064596E-03    2     1000004        -4   # BR(~g -> ~c_L  cb)
     9.35064596E-03    2    -1000004         4   # BR(~g -> ~c_L* c )
     5.47793820E-02    2     2000004        -4   # BR(~g -> ~c_R  cb)
     5.47793820E-02    2    -2000004         4   # BR(~g -> ~c_R* c )
     9.46831319E-02    2     1000005        -5   # BR(~g -> ~b_1  bb)
     9.46831319E-02    2    -1000005         5   # BR(~g -> ~b_1* b )
     6.06383889E-02    2     2000005        -5   # BR(~g -> ~b_2  bb)
     6.06383889E-02    2    -2000005         5   # BR(~g -> ~b_2* b )
     5.90544721E-02    2     1000006        -6   # BR(~g -> ~t_1  tb)
     5.90544721E-02    2    -1000006         6   # BR(~g -> ~t_1* t )
     3.88034500E-02    2     2000006        -6   # BR(~g -> ~t_2  tb)
     3.88034500E-02    2    -2000006         6   # BR(~g -> ~t_2* t )
#
#         PDG            Width
DECAY   1000006     3.98792165E+01   # stop1 decays
#          BR         NDA      ID1       ID2
     3.36161176E-02    2     1000022         6   # BR(~t_1 -> ~chi_10 t )
     2.70952568E-01    2     1000023         6   # BR(~t_1 -> ~chi_20 t )
     2.50479094E-01    2     1000025         6   # BR(~t_1 -> ~chi_30 t )
     9.17913997E-03    2     1000035         6   # BR(~t_1 -> ~chi_40 t )
     4.06809772E-01    2     1000024         5   # BR(~t_1 -> ~chi_1+ b )
     2.37203469E-02    2     1000037         5   # BR(~t_1 -> ~chi_2+ b )
     5.24296235E-03    2     1000005        24   # BR(~t_1 -> ~b_1    W+)
#
#         PDG            Width
DECAY   2000006     1.14239571E+02   # stop2 decays
#          BR         NDA      ID1       ID2
     6.38250756E-02    2     1000022         6   # BR(~t_2 -> ~chi_10 t )
     1.39009545E-01    2     1000023         6   # BR(~t_2 -> ~chi_20 t )
     1.13788287E-01    2     1000025         6   # BR(~t_2 -> ~chi_30 t )
     2.50443526E-04    2     1000035         6   # BR(~t_2 -> ~chi_40 t )
     2.72902132E-01    2     1000024         5   # BR(~t_2 -> ~chi_1+ b )
     4.69637599E-04    2     1000037         5   # BR(~t_2 -> ~chi_2+ b )
     9.92187740E-02    2     1000006        25   # BR(~t_2 -> ~t_1    h )
     1.08772477E-01    2     1000006        23   # BR(~t_2 -> ~t_1    Z )
     1.86482130E-04    2     1000005        24   # BR(~t_2 -> ~b_1    W+)
     2.01577146E-01    2     2000005        24   # BR(~t_2 -> ~b_2    W+)
#
#         PDG            Width
DECAY   1000005     6.51434415E+00   # sbottom1 decays
#          BR         NDA      ID1       ID2
     1.25776798E-01    2     1000022         5   # BR(~b_1 -> ~chi_10 b )
     2.68466528E-01    2     1000023         5   # BR(~b_1 -> ~chi_20 b )
     2.02937833E-01    2     1000025         5   # BR(~b_1 -> ~chi_30 b )
     4.02818840E-01    2    -1000024         6   # BR(~b_1 -> ~chi_1- t )
#
#         PDG            Width
DECAY   2000005     4.08684062E+01   # sbottom2 decays
#          BR         NDA      ID1       ID2
     6.08985473E-02    2     1000022         5   # BR(~b_2 -> ~chi_10 b )
     1.99824323E-01    2     1000023         5   # BR(~b_2 -> ~chi_20 b )
     1.52981567E-01    2     1000025         5   # BR(~b_2 -> ~chi_30 b )
     1.33613773E-02    2     1000035         5   # BR(~b_2 -> ~chi_40 b )
     5.45183557E-01    2    -1000024         6   # BR(~b_2 -> ~chi_1- t )
     2.20360892E-02    2    -1000037         6   # BR(~b_2 -> ~chi_2- t )
     2.87473465E-03    2     1000005        25   # BR(~b_2 -> ~b_1    h )
     2.83980484E-03    2     1000005        23   # BR(~b_2 -> ~b_1    Z )
#
#         PDG            Width
DECAY   1000002     2.30657421E+01   # sup_L decays
#          BR         NDA      ID1       ID2
     1.26608056E-02    2     1000022         2   # BR(~u_L -> ~chi_10 u)
     2.01718136E-04    2     1000023         2   # BR(~u_L -> ~chi_20 u)
     8.61669211E-03    2     1000025         2   # BR(~u_L -> ~chi_30 u)
     3.24595649E-01    2     1000035         2   # BR(~u_L -> ~chi_40 u)
     6.19165122E-03    2     1000024         1   # BR(~u_L -> ~chi_1+ d)
     6.47733484E-01    2     1000037         1   # BR(~u_L -> ~chi_2+ d)
#
#         PDG            Width
DECAY   2000002     4.48708014E+00   # sup_R decays
#          BR         NDA      ID1       ID2
     7.92060692E-01    2     1000022         2   # BR(~u_R -> ~chi_10 u)
     4.74003247E-03    2     1000023         2   # BR(~u_R -> ~chi_20 u)
     2.03198746E-01    2     1000025         2   # BR(~u_R -> ~chi_30 u)
     5.29242347E-07    2     1000035         2   # BR(~u_R -> ~chi_40 u)
#
#         PDG            Width
DECAY   1000001     2.30175852E+01   # sdown_L decays
#          BR         NDA      ID1       ID2
     1.85423372E-02    2     1000022         1   # BR(~d_L -> ~chi_10 d)
     1.12646797E-03    2     1000023         1   # BR(~d_L -> ~chi_20 d)
     1.14379507E-03    2     1000025         1   # BR(~d_L -> ~chi_30 d)
     3.25921371E-01    2     1000035         1   # BR(~d_L -> ~chi_40 d)
     1.30737152E-04    2    -1000024         2   # BR(~d_L -> ~chi_1- u)
     6.53135292E-01    2    -1000037         2   # BR(~d_L -> ~chi_2- u)
#
#         PDG            Width
DECAY   2000001     1.19064385E+00   # sdown_R decays
#          BR         NDA      ID1       ID2
     7.91714922E-01    2     1000022         1   # BR(~d_R -> ~chi_10 d)
     4.74648753E-03    2     1000023         1   # BR(~d_R -> ~chi_20 d)
     2.03537858E-01    2     1000025         1   # BR(~d_R -> ~chi_30 d)
     7.31879381E-07    2     1000035         1   # BR(~d_R -> ~chi_40 d)
#
#         PDG            Width
DECAY   1000004     2.33342670E+01   # scharm_L decays
#          BR         NDA      ID1       ID2
     1.27370855E-02    2     1000022         4   # BR(~c_L -> ~chi_10 c)
     2.02861905E-04    2     1000023         4   # BR(~c_L -> ~chi_20 c)
     8.66512166E-03    2     1000025         4   # BR(~c_L -> ~chi_30 c)
     3.24541933E-01    2     1000035         4   # BR(~c_L -> ~chi_40 c)
     6.22689531E-03    2     1000024         3   # BR(~c_L -> ~chi_1+ s)
     6.47626103E-01    2     1000037         3   # BR(~c_L -> ~chi_2+ s)
#
#         PDG            Width
DECAY   2000004     4.43213055E+00   # scharm_R decays
#          BR         NDA      ID1       ID2
     7.92134323E-01    2     1000022         4   # BR(~c_R -> ~chi_10 c)
     4.73860315E-03    2     1000023         4   # BR(~c_R -> ~chi_20 c)
     2.03126555E-01    2     1000025         4   # BR(~c_R -> ~chi_30 c)
     5.19712473E-07    2     1000035         4   # BR(~c_R -> ~chi_40 c)
#
#         PDG            Width
DECAY   1000003     2.32852304E+01   # sstrange_L decays
#          BR         NDA      ID1       ID2
     1.86547288E-02    2     1000022         3   # BR(~s_L -> ~chi_10 s)
     1.13289629E-03    2     1000023         3   # BR(~s_L -> ~chi_20 s)
     1.15026543E-03    2     1000025         3   # BR(~s_L -> ~chi_30 s)
     3.25879769E-01    2     1000035         3   # BR(~s_L -> ~chi_40 s)
     1.31486005E-04    2    -1000024         4   # BR(~s_L -> ~chi_1- c)
     6.53050854E-01    2    -1000037         4   # BR(~s_L -> ~chi_2- c)
#
#         PDG            Width
DECAY   2000003     1.17980631E+00   # sstrange_R decays
#          BR         NDA      ID1       ID2
     7.91788067E-01    2     1000022         3   # BR(~s_R -> ~chi_10 s)
     4.74506912E-03    2     1000023         3   # BR(~s_R -> ~chi_20 s)
     2.03466142E-01    2     1000025         3   # BR(~s_R -> ~chi_30 s)
     7.21495329E-07    2     1000035         3   # BR(~s_R -> ~chi_40 s)
#
#         PDG            Width
DECAY   1000011     6.58089630E-01   # selectron_L decays
#          BR         NDA      ID1       ID2
     7.66072598E-01    2     1000022        11   # BR(~e_L -> ~chi_10 e-)
     1.30588893E-04    2     1000023        11   # BR(~e_L -> ~chi_20 e-)
     2.33138594E-01    2     1000025        11   # BR(~e_L -> ~chi_30 e-)
     6.58219218E-04    2    -1000024        12   # BR(~e_L -> ~chi_1- nu_e)
#
#         PDG            Width
DECAY   2000011     1.35841958E+01   # selectron_R decays
#          BR         NDA      ID1       ID2
     7.90764057E-01    2     1000022        11   # BR(~e_R -> ~chi_10 e-)
     4.76418023E-03    2     1000023        11   # BR(~e_R -> ~chi_20 e-)
     2.04470252E-01    2     1000025        11   # BR(~e_R -> ~chi_30 e-)
     1.51020983E-06    2     1000035        11   # BR(~e_R -> ~chi_40 e-)
#
#         PDG            Width
DECAY   1000013     6.58089583E-01   # smuon_L decays
#          BR         NDA      ID1       ID2
     7.66072601E-01    2     1000022        13   # BR(~mu_L -> ~chi_10 mu-)
     1.30588891E-04    2     1000023        13   # BR(~mu_L -> ~chi_20 mu-)
     2.33138591E-01    2     1000025        13   # BR(~mu_L -> ~chi_30 mu-)
     6.58219266E-04    2    -1000024        14   # BR(~mu_L -> ~chi_1- nu_mu)
#
#         PDG            Width
DECAY   2000013     1.35841958E+01   # smuon_R decays
#          BR         NDA      ID1       ID2
     7.90764057E-01    2     1000022        13   # BR(~mu_R -> ~chi_10 mu-)
     4.76418022E-03    2     1000023        13   # BR(~mu_R -> ~chi_20 mu-)
     2.04470252E-01    2     1000025        13   # BR(~mu_R -> ~chi_30 mu-)
     1.51020983E-06    2     1000035        13   # BR(~mu_R -> ~chi_40 mu-)
#
#         PDG            Width
DECAY   1000015     3.92096436E-01   # stau_1 decays
#          BR         NDA      ID1       ID2
     5.59773571E-01    2     1000022        15   # BR(~tau_1 -> ~chi_10  tau-)
     2.60390863E-01    2     1000023        15   # BR(~tau_1 -> ~chi_20  tau-)
     1.79629982E-01    2     1000025        15   # BR(~tau_1 -> ~chi_30  tau-)
     2.05584746E-04    2    -1000024        16   # BR(~tau_1 -> ~chi_1-  nu_tau)
#
#         PDG            Width
DECAY   2000015     3.22827835E+01   # stau_2 decays
#          BR         NDA      ID1       ID2
     3.09661391E-01    2     1000022        15   # BR(~tau_2 -> ~chi_10  tau-)
     1.62523474E-01    2     1000023        15   # BR(~tau_2 -> ~chi_20  tau-)
     1.91309221E-01    2     1000025        15   # BR(~tau_2 -> ~chi_30  tau-)
     1.13199123E-05    2     1000035        15   # BR(~tau_2 -> ~chi_40  tau-)
     3.28406494E-01    2    -1000024        16   # BR(~tau_2 -> ~chi_1-  nu_tau)
     2.22038438E-05    2    -1000037        16   # BR(~tau_2 -> ~chi_2-  nu_tau)
     3.92774619E-03    2     1000016       -24   # BR(~tau_2 -> ~nu_tauL W-)
     2.12896919E-03    2     1000015        25   # BR(~tau_2 -> ~tau_1   h)
     2.00918046E-03    2     1000015        23   # BR(~tau_2 -> ~tau_1   Z)
#
#         PDG            Width
DECAY   1000012     6.75027261E-01   # snu_eL decays
#          BR         NDA      ID1       ID2
     8.37120784E-01    2     1000022        12   # BR(~nu_eL -> ~chi_10 nu_e)
     1.33665463E-02    2     1000023        12   # BR(~nu_eL -> ~chi_20 nu_e)
     1.19505633E-01    2     1000025        12   # BR(~nu_eL -> ~chi_30 nu_e)
     3.00070367E-02    2     1000024        11   # BR(~nu_eL -> ~chi_1+ e-)
#
#         PDG            Width
DECAY   1000014     6.75027260E-01   # snu_muL decays
#          BR         NDA      ID1       ID2
     8.37120786E-01    2     1000022        14   # BR(~nu_muL -> ~chi_10 nu_mu)
     1.33665464E-02    2     1000023        14   # BR(~nu_muL -> ~chi_20 nu_mu)
     1.19505633E-01    2     1000025        14   # BR(~nu_muL -> ~chi_30 nu_mu)
     3.00070342E-02    2     1000024        13   # BR(~nu_muL -> ~chi_1+ mu-)
#
#         PDG            Width
DECAY   1000016     3.16992204E-01   # snu_tauL decays
#          BR         NDA      ID1       ID2
     4.12121487E-01    2     1000022        16   # BR(~nu_tauL -> ~chi_10 nu_tau)
     1.99035111E-03    2     1000023        16   # BR(~nu_tauL -> ~chi_20 nu_tau)
     1.27644666E-02    2     1000025        16   # BR(~nu_tauL -> ~chi_30 nu_tau)
     5.73123695E-01    2     1000024        15   # BR(~nu_tauL -> ~chi_1+ tau-)
#
#         PDG            Width
DECAY   1000024     2.48139541E-04   # chargino1+ decays
#           BR         NDA      ID1       ID2       ID3
     3.33075989E-01    3     1000022         2        -1   # BR(~chi_1+ -> ~chi_10 u    db)
     3.33075989E-01    3     1000022         4        -3   # BR(~chi_1+ -> ~chi_10 c    sb)
     1.11067633E-01    3     1000022       -11        12   # BR(~chi_1+ -> ~chi_10 e+   nu_e)
     1.11067633E-01    3     1000022       -13        14   # BR(~chi_1+ -> ~chi_10 mu+  nu_mu)
     1.11712755E-01    3     1000022       -15        16   # BR(~chi_1+ -> ~chi_10 tau+ nu_tau)
#
#         PDG            Width
DECAY   1000037     4.00591480E+01   # chargino2+ decays
#          BR         NDA      ID1       ID2
     2.95629687E-06    2    -1000005         6   # BR(~chi_2+ -> ~b_1*    t )
     1.05831550E-01    2     1000012       -11   # BR(~chi_2+ -> ~nu_eL   e+  )
     1.05831550E-01    2     1000014       -13   # BR(~chi_2+ -> ~nu_muL mu+ )
     1.40502215E-01    2     1000016       -15   # BR(~chi_2+ -> ~nu_tau1 tau+)
     1.05695053E-01    2    -1000011        12   # BR(~chi_2+ -> ~e_L+    nu_e)
     1.05695053E-01    2    -1000013        14   # BR(~chi_2+ -> ~mu_L+   nu_mu)
     1.40464346E-01    2    -1000015        16   # BR(~chi_2+ -> ~tau_1+  nu_tau)
     7.51619904E-02    2     1000024        23   # BR(~chi_2+ -> ~chi_1+  Z )
     8.98803928E-03    2     1000022        24   # BR(~chi_2+ -> ~chi_10  W+)
     7.35688059E-02    2     1000023        24   # BR(~chi_2+ -> ~chi_20  W+)
     6.39758711E-02    2     1000025        24   # BR(~chi_2+ -> ~chi_30  W+)
     7.42825702E-02    2     1000024        25   # BR(~chi_2+ -> ~chi_1+  h )
#
#         PDG            Width
DECAY   1000022     0.00000000E+00   # neutralino1 decays
#
#         PDG            Width
DECAY   1000023     2.44228454E-04   # neutralino2 decays
#          BR         NDA      ID1       ID2
     7.31594018E-04    2     1000022        22   # BR(~chi_20 -> ~chi_10 gam)
#           BR         NDA      ID1       ID2       ID3
     1.15507560E-01    3     1000022        -2         2   # BR(~chi_20 -> ~chi_10 ub      u)
     1.49847691E-01    3     1000022        -1         1   # BR(~chi_20 -> ~chi_10 db      d)
     1.15507560E-01    3     1000022        -4         4   # BR(~chi_20 -> ~chi_10 cb      c)
     1.49847691E-01    3     1000022        -3         3   # BR(~chi_20 -> ~chi_10 sb      s)
     1.51787186E-01    3     1000022        -5         5   # BR(~chi_20 -> ~chi_10 bb      b)
     3.43684771E-02    3     1000022       -11        11   # BR(~chi_20 -> ~chi_10 e+      e-)
     3.43684771E-02    3     1000022       -13        13   # BR(~chi_20 -> ~chi_10 mu+     mu-)
     4.00766200E-02    3     1000022       -15        15   # BR(~chi_20 -> ~chi_10 tau+    tau-)
     6.89201032E-02    3     1000022       -12        12   # BR(~chi_20 -> ~chi_10 nu_eb   nu_e)
     6.89201032E-02    3     1000022       -14        14   # BR(~chi_20 -> ~chi_10 nu_mub  nu_mu)
     7.01068815E-02    3     1000022       -16        16   # BR(~chi_20 -> ~chi_10 nu_taub nu_tau)
     1.79500249E-06    3     1000024        -2         1   # BR(~chi_20 -> ~chi_1+ ub      d)
     1.79500249E-06    3    -1000024        -1         2   # BR(~chi_20 -> ~chi_1- db      u)
     1.79500249E-06    3     1000024        -4         3   # BR(~chi_20 -> ~chi_1+ cb      s)
     1.79500249E-06    3    -1000024        -3         4   # BR(~chi_20 -> ~chi_1- sb      c)
     5.98402032E-07    3     1000024       -12        11   # BR(~chi_20 -> ~chi_1+ nu_eb   e-)
     5.98402032E-07    3    -1000024        12       -11   # BR(~chi_20 -> ~chi_1- nu_e    e+)
     5.98402032E-07    3     1000024       -14        13   # BR(~chi_20 -> ~chi_1+ nu_mub  mu-)
     5.98402032E-07    3    -1000024        14       -13   # BR(~chi_20 -> ~chi_1- nu_mu   mu+)
     2.40976264E-07    3     1000024       -16        15   # BR(~chi_20 -> ~chi_1+ nu_taub tau-)
     2.40976264E-07    3    -1000024        16       -15   # BR(~chi_20 -> ~chi_1- nu_tau  tau+)
#
#         PDG            Width
DECAY   1000025     3.23821337E-05   # neutralino3 decays
#          BR         NDA      ID1       ID2
     4.57337876E-03    2     1000022        22   # BR(~chi_30 -> ~chi_10 gam)
     1.09130920E-02    2     1000023        22   # BR(~chi_30 -> ~chi_20 gam)
#           BR         NDA      ID1       ID2       ID3
     9.80030225E-02    3     1000022        -2         2   # BR(~chi_30 -> ~chi_10 ub      u)
     1.26308828E-01    3     1000022        -1         1   # BR(~chi_30 -> ~chi_10 db      d)
     9.80030225E-02    3     1000022        -4         4   # BR(~chi_30 -> ~chi_10 cb      c)
     1.26308828E-01    3     1000022        -3         3   # BR(~chi_30 -> ~chi_10 sb      s)
     1.74052199E-01    3     1000022        -5         5   # BR(~chi_30 -> ~chi_10 bb      b)
     2.67669862E-02    3     1000022       -11        11   # BR(~chi_30 -> ~chi_10 e+      e-)
     2.67669862E-02    3     1000022       -13        13   # BR(~chi_30 -> ~chi_10 mu+     mu-)
     7.45467389E-02    3     1000022       -15        15   # BR(~chi_30 -> ~chi_10 tau+    tau-)
     6.10859953E-02    3     1000022       -12        12   # BR(~chi_30 -> ~chi_10 nu_eb   nu_e)
     6.10859953E-02    3     1000022       -14        14   # BR(~chi_30 -> ~chi_10 nu_mub  nu_mu)
     8.51879212E-02    3     1000022       -16        16   # BR(~chi_30 -> ~chi_10 nu_taub nu_tau)
     2.06961687E-04    3     1000023        -2         2   # BR(~chi_30 -> ~chi_20 ub      u)
     2.68543562E-04    3     1000023        -1         1   # BR(~chi_30 -> ~chi_20 db      d)
     2.06961687E-04    3     1000023        -4         4   # BR(~chi_30 -> ~chi_20 cb      c)
     2.68543562E-04    3     1000023        -3         3   # BR(~chi_30 -> ~chi_20 sb      s)
     6.16310458E-05    3     1000023       -11        11   # BR(~chi_30 -> ~chi_20 e+      e-)
     6.16310458E-05    3     1000023       -13        13   # BR(~chi_30 -> ~chi_20 mu+     mu-)
     5.83646169E-05    3     1000023       -15        15   # BR(~chi_30 -> ~chi_20 tau+    tau-)
     1.23106676E-04    3     1000023       -12        12   # BR(~chi_30 -> ~chi_20 nu_eb   nu_e)
     1.23106676E-04    3     1000023       -14        14   # BR(~chi_30 -> ~chi_20 nu_mub  nu_mu)
     1.22182992E-04    3     1000023       -16        16   # BR(~chi_30 -> ~chi_20 nu_taub nu_tau)
     4.19361053E-03    3     1000024        -2         1   # BR(~chi_30 -> ~chi_1+ ub      d)
     4.19361053E-03    3    -1000024        -1         2   # BR(~chi_30 -> ~chi_1- db      u)
     4.19361053E-03    3     1000024        -4         3   # BR(~chi_30 -> ~chi_1+ cb      s)
     4.19361053E-03    3    -1000024        -3         4   # BR(~chi_30 -> ~chi_1- sb      c)
     1.39738862E-03    3     1000024       -12        11   # BR(~chi_30 -> ~chi_1+ nu_eb   e-)
     1.39738862E-03    3    -1000024        12       -11   # BR(~chi_30 -> ~chi_1- nu_e    e+)
     1.39738862E-03    3     1000024       -14        13   # BR(~chi_30 -> ~chi_1+ nu_mub  mu-)
     1.39738862E-03    3    -1000024        14       -13   # BR(~chi_30 -> ~chi_1- nu_mu   mu+)
     1.26598792E-03    3     1000024       -16        15   # BR(~chi_30 -> ~chi_1+ nu_taub tau-)
     1.26598792E-03    3    -1000024        16       -15   # BR(~chi_30 -> ~chi_1- nu_tau  tau+)
#
#         PDG            Width
DECAY   1000035     4.00599447E+01   # neutralino4 decays
#          BR         NDA      ID1       ID2
     3.77688671E-03    2     1000022        23   # BR(~chi_40 -> ~chi_10   Z )
     4.83873931E-02    2     1000023        23   # BR(~chi_40 -> ~chi_20   Z )
     2.28452196E-02    2     1000025        23   # BR(~chi_40 -> ~chi_30   Z )
     7.35555675E-02    2     1000024       -24   # BR(~chi_40 -> ~chi_1+   W-)
     7.35555675E-02    2    -1000024        24   # BR(~chi_40 -> ~chi_1-   W+)
     5.44359312E-03    2     1000022        25   # BR(~chi_40 -> ~chi_10   h )
     2.62298236E-02    2     1000023        25   # BR(~chi_40 -> ~chi_20   h )
     4.23036397E-02    2     1000025        25   # BR(~chi_40 -> ~chi_30   h )
     1.17951287E-06    2     1000005        -5   # BR(~chi_40 -> ~b_1      bb)
     1.17951287E-06    2    -1000005         5   # BR(~chi_40 -> ~b_1*     b )
     5.25770172E-02    2     1000011       -11   # BR(~chi_40 -> ~e_L-     e+)
     5.25770172E-02    2    -1000011        11   # BR(~chi_40 -> ~e_L+     e-)
     5.25770172E-02    2     1000013       -13   # BR(~chi_40 -> ~mu_L-    mu+)
     5.25770172E-02    2    -1000013        13   # BR(~chi_40 -> ~mu_L+    mu-)
     6.98859317E-02    2     1000015       -15   # BR(~chi_40 -> ~tau_1-   tau+)
     6.98859317E-02    2    -1000015        15   # BR(~chi_40 -> ~tau_1+   tau-)
     5.31655231E-02    2     1000012       -12   # BR(~chi_40 -> ~nu_eL    nu_eb)
     5.31655231E-02    2    -1000012        12   # BR(~chi_40 -> ~nu_eL*   nu_e )
     5.31655231E-02    2     1000014       -14   # BR(~chi_40 -> ~nu_muL   nu_mub)
     5.31655231E-02    2    -1000014        14   # BR(~chi_40 -> ~nu_muL*  nu_mu )
     7.05789628E-02    2     1000016       -16   # BR(~chi_40 -> ~nu_tau1  nu_taub)
     7.05789628E-02    2    -1000016        16   # BR(~chi_40 -> ~nu_tau1* nu_tau )
#
#         PDG            Width
DECAY        25     4.52544376E-03   # h decays
#          BR         NDA      ID1       ID2
     5.92091897E-01    2           5        -5   # BR(h -> b       bb     )
     5.85914268E-02    2         -15        15   # BR(h -> tau+    tau-   )
     2.07339962E-04    2         -13        13   # BR(h -> mu+     mu-    )
     2.25495212E-04    2           3        -3   # BR(h -> s       sb     )
     1.93745790E-02    2           4        -4   # BR(h -> c       cb     )
     7.32845532E-02    2          21        21   # BR(h -> g       g      )
     2.19717079E-03    2          22        22   # BR(h -> gam     gam    )
     1.60180102E-03    2          22        23   # BR(h -> Z       gam    )
     2.23834213E-01    2          24       -24   # BR(h -> W+      W-     )
     2.85915234E-02    2          23        23   # BR(h -> Z       Z      )
#
#         PDG            Width
DECAY        35     8.37970329E+01   # H decays
#          BR         NDA      ID1       ID2
     7.65524445E-01    2           5        -5   # BR(H -> b       bb     )
     1.62649833E-01    2         -15        15   # BR(H -> tau+    tau-   )
     5.52040931E-04    2         -13        13   # BR(H -> mu+     mu-    )
     3.04325108E-04    2           3        -3   # BR(H -> s       sb     )
     3.59480378E-09    2           4        -4   # BR(H -> c       cb     )
     3.47947952E-04    2           6        -6   # BR(H -> t       tb     )
     3.40167652E-05    2          21        21   # BR(H -> g       g      )
     1.88043511E-08    2          22        22   # BR(H -> gam     gam    )
     1.50630974E-08    2          23        22   # BR(H -> Z       gam    )
     2.68312547E-07    2          24       -24   # BR(H -> W+      W-     )
     1.33637208E-07    2          23        23   # BR(H -> Z       Z      )
     1.25539044E-06    2          25        25   # BR(H -> h       h      )
     1.04985129E-03    2     1000024  -1000024   # BR(H -> ~chi_1+ ~chi_1-)
     1.39932578E-02    2     1000024  -1000037   # BR(H -> ~chi_1+ ~chi_2-)
     1.39932578E-02    2     1000037  -1000024   # BR(H -> ~chi_2+ ~chi_1-)
     6.39220222E-03    2     1000022   1000022   # BR(H -> ~chi_10 ~chi_10)
     4.14543199E-04    2     1000023   1000023   # BR(H -> ~chi_20 ~chi_20)
     2.89594245E-03    2     1000025   1000025   # BR(H -> ~chi_30 ~chi_30)
     9.51522283E-03    2     1000022   1000023   # BR(H -> ~chi_10 ~chi_20)
     4.96858783E-03    2     1000022   1000025   # BR(H -> ~chi_10 ~chi_30)
     1.37865166E-03    2     1000022   1000035   # BR(H -> ~chi_10 ~chi_40)
     3.24578165E-03    2     1000023   1000025   # BR(H -> ~chi_20 ~chi_30)
     9.96616966E-03    2     1000023   1000035   # BR(H -> ~chi_20 ~chi_40)
     2.70279470E-03    2     1000025   1000035   # BR(H -> ~chi_30 ~chi_40)
     6.82116973E-05    2     1000005  -1000005   # BR(H -> ~b_1    ~b_1*  )
     4.50754431E-08    2     1000011  -1000011   # BR(H -> ~e_L-   ~e_L+  )
     4.50754431E-08    2     1000013  -1000013   # BR(H -> ~mu_L-  ~mu_L+ )
     6.55560139E-07    2     1000015  -1000015   # BR(H -> ~tau_1- ~tau_1+)
     1.47871840E-07    2     1000012  -1000012   # BR(H -> ~nu_eL  ~nu_eL*   )
     1.47871840E-07    2     1000014  -1000014   # BR(H -> ~nu_muL ~nu_muL*  )
     1.80063380E-07    2     1000016  -1000016   # BR(H -> ~nu_tauL ~nu_tauL*)
#
#         PDG            Width
DECAY        36     8.37978444E+01   # A decays
#          BR         NDA      ID1       ID2
     7.65533013E-01    2           5        -5   # BR(A -> b       bb     )
     1.62649491E-01    2         -15        15   # BR(A -> tau+    tau-   )
     5.52038046E-04    2         -13        13   # BR(A -> mu+     mu-    )
     3.04331000E-04    2           3        -3   # BR(A -> s       sb     )
     3.59117649E-09    2           4        -4   # BR(A -> c       cb     )
     3.51776746E-04    2           6        -6   # BR(A -> t       tb     )
     4.25080177E-05    2          21        21   # BR(A -> g       g      )
     6.76068429E-09    2          22        22   # BR(A -> gam     gam    )
     2.38304143E-08    2          23        22   # BR(A -> Z       gam    )
     2.70514274E-07    2          23        25   # BR(A -> Z       h      )
     1.10913461E-03    2     1000024  -1000024   # BR(A -> ~chi_1+ ~chi_1-)
     1.39736037E-02    2     1000024  -1000037   # BR(A -> ~chi_1+ ~chi_2-)
     1.39736037E-02    2     1000037  -1000024   # BR(A -> ~chi_2+ ~chi_1-)
     6.27335766E-03    2     1000022   1000022   # BR(A -> ~chi_10 ~chi_10)
     4.78564520E-04    2     1000023   1000023   # BR(A -> ~chi_20 ~chi_20)
     2.88033736E-03    2     1000025   1000025   # BR(A -> ~chi_30 ~chi_30)
     9.86454558E-03    2     1000022   1000023   # BR(A -> ~chi_10 ~chi_20)
     4.80179777E-03    2     1000022   1000025   # BR(A -> ~chi_10 ~chi_30)
     2.75099313E-03    2     1000022   1000035   # BR(A -> ~chi_10 ~chi_40)
     3.14824178E-03    2     1000023   1000025   # BR(A -> ~chi_20 ~chi_30)
     3.71910810E-03    2     1000023   1000035   # BR(A -> ~chi_20 ~chi_40)
     7.59324950E-03    2     1000025   1000035   # BR(A -> ~chi_30 ~chi_40)
#
#         PDG            Width
DECAY        37     7.70385574E+01   # H+ decays
#          BR         NDA      ID1       ID2
     1.25541309E-03    2           4        -5   # BR(H+ -> c       bb     )
     1.77074083E-01    2         -15        16   # BR(H+ -> tau+    nu_tau )
     6.00995616E-04    2         -13        14   # BR(H+ -> mu+     nu_mu  )
     1.25540985E-05    2           2        -5   # BR(H+ -> u       bb     )
     1.65462622E-05    2           2        -3   # BR(H+ -> u       sb     )
     3.25684315E-04    2           4        -3   # BR(H+ -> c       sb     )
     7.44334329E-01    2           6        -5   # BR(H+ -> t       bb     )
     2.95448700E-07    2          24        25   # BR(H+ -> W+      h      )
     2.62941873E-13    2          24        36   # BR(H+ -> W+      A      )
     2.25506988E-02    2     1000024   1000022   # BR(H+ -> ~chi_1+ ~chi_10)
     4.16758057E-06    2     1000024   1000023   # BR(H+ -> ~chi_1+ ~chi_20)
     7.66069332E-03    2     1000024   1000025   # BR(H+ -> ~chi_1+ ~chi_30)
     1.53507769E-02    2     1000024   1000035   # BR(H+ -> ~chi_1+ ~chi_40)
     4.52774768E-03    2     1000037   1000022   # BR(H+ -> ~chi_2+ ~chi_10)
     1.49779525E-02    2     1000037   1000023   # BR(H+ -> ~chi_2+ ~chi_20)
     1.13075951E-02    2     1000037   1000025   # BR(H+ -> ~chi_2+ ~chi_30)
     1.92548148E-07    2    -1000011   1000012   # BR(H+ -> ~e_L+   ~nu_eL )
     1.92548148E-07    2    -1000013   1000014   # BR(H+ -> ~mu_L+  ~nu_muL)
     8.18385593E-08    2    -1000015   1000016   # BR(H+ -> ~tau_1+ ~nu_tauL)
