#
#                              ======================
#                              | THE SUSYHIT OUTPUT |
#                              ======================
#
#
#              ------------------------------------------------------
#              |     This is the output of the SUSY-HIT package     |
#              |  created by A.Djouadi, M.Muehlleitner and M.Spira. |
#              |  In case of problems with SUSY-HIT email to        |
#              |           margarete.muehlleitner@cern.ch           |
#              |           michael.spira@psi.ch                     |
#              |           abdelhak.djouadi@cern.ch                 |
#              ------------------------------------------------------
#
#              ------------------------------------------------------
#              |  SUSY Les Houches Accord - MSSM Spectrum + Decays  |
#              |              based on the decay programs           |
#              |                                                    |
#              |                     SDECAY 1.3b                    |
#              |                                                    |
#              |  Authors: M.Muhlleitner, A.Djouadi and Y.Mambrini  |
#              |  Ref.:    Comput.Phys.Commun.168(2005)46           |
#              |           [hep-ph/0311167]                         |
#              |                                                    |
#              |                     HDECAY 3.4                     |
#              |                                                    |
#              |  By: A.Djouadi,J.Kalinowski,M.Muhlleitner,M.Spira  |
#              |  Ref.:    Comput.Phys.Commun.108(1998)56           |
#              |           [hep-ph/9704448]                         |
#              |                                                    |
#              |                                                    |
#              |  If not stated otherwise all DRbar couplings and   |
#              |  soft SUSY breaking masses are given at the scale  |
#              |  Q=  0.50009275E+04
#              |                                                    |
#              ------------------------------------------------------
#
#
BLOCK DCINFO  # Decay Program information
     1   SDECAY/HDECAY # decay calculator
     2   1.3b  /3.4    # version number
#
BLOCK SPINFO  # Spectrum calculator information
     1    SOFTSUSY    # spectrum calculator                
     2    3.3.3       # version number                     
#
BLOCK MODSEL  # Model selection
     1     0   #  nonUniversal                                     
#
BLOCK SMINPUTS  # Standard Model inputs
         1     1.27956800E+02   # alpha_em^-1(M_Z)^MSbar
         2     1.16637900E-05   # G_F [GeV^-2]
         3     1.19300000E-01   # alpha_S(M_Z)^MSbar
         4     9.11876000E+01   # M_Z pole mass
         5     4.16000000E+00   # mb(mb)^MSbar
         6     1.73200000E+02   # mt pole mass
         7     1.77700000E+00   # mtau pole mass
#
BLOCK MINPAR  # Input parameters - minimal models
         3     4.00000000E+01   # tanb                
#
BLOCK EXTPAR  # Input parameters - non-minimal models
         0    -1.00000000E+00   # Set                 
         1     6.00000000E+01   # M_1(MX)             
         2     7.00000000E+02   # M_2(MX)             
         3     2.00000000E+03   # M_3(MX)             
        11     4.61100000E+03   # At(MX)              
        12     0.00000000E+00   # Ab(MX)              
        13     0.00000000E+00   # Atau(MX)            
        23     1.67500000E+03   # mu(MX)              
        26     2.00000000E+03   # mA(pole)            
        31     5.00000000E+03   # meL(MX)             
        32     5.00000000E+03   # mmuL(MX)            
        33     5.00000000E+03   # mtauL(MX)           
        34     5.00000000E+03   # meR(MX)             
        35     5.00000000E+03   # mmuR(MX)            
        36     5.00000000E+03   # mtauR(MX)           
        41     9.50000000E+02   # mqL1(MX)            
        42     9.50000000E+02   # mqL2(MX)            
        43     5.00000000E+03   # mqL3(MX)            
        44     5.00000000E+03   # muR(MX)             
        45     5.00000000E+03   # mcR(MX)             
        46     5.00000000E+03   # mtR(MX)             
        47     5.00000000E+03   # mdR(MX)             
        48     5.00000000E+03   # msR(MX)             
        49     5.00000000E+03   # mbR(MX)             
#
BLOCK MASS  # Mass Spectrum
# PDG code           mass       particle
        24     8.03840243E+01   # W+
        25     1.25132383E+02   # h
        35     2.00002395E+03   # H
        36     1.99999829E+03   # A
        37     2.00175661E+03   # H+
         5     4.80992877E+00   # b-quark pole mass calculated from mb(mb)_Msbar
   1000001     1.17583985E+03   # ~d_L
   2000001     5.06183055E+03   # ~d_R
   1000002     1.17325424E+03   # ~u_L
   2000002     5.05841979E+03   # ~u_R
   1000003     1.17583985E+03   # ~s_L
   2000003     5.06183055E+03   # ~s_R
   1000004     1.17325424E+03   # ~c_L
   2000004     5.05841979E+03   # ~c_R
   1000005     5.00564731E+03   # ~b_1
   2000005     5.04498231E+03   # ~b_2
   1000006     4.92519875E+03   # ~t_1
   2000006     5.05506426E+03   # ~t_2
   1000011     5.00829212E+03   # ~e_L
   2000011     5.00894149E+03   # ~e_R
   1000012     5.00735862E+03   # ~nu_eL
   1000013     5.00829212E+03   # ~mu_L
   2000013     5.00894149E+03   # ~mu_R
   1000014     5.00735862E+03   # ~nu_muL
   1000015     4.98281140E+03   # ~tau_1
   2000015     5.00782629E+03   # ~tau_2
   1000016     4.99848044E+03   # ~nu_tauL
   1000021     2.26423655E+03   # ~g
   1000022     5.93536595E+01   # ~chi_10
   1000023     7.26341991E+02   # ~chi_20
   1000025    -1.69672021E+03   # ~chi_30
   1000035     1.69896457E+03   # ~chi_40
   1000024     7.26513812E+02   # ~chi_1+
   1000037     1.69961900E+03   # ~chi_2+
#
BLOCK NMIX  # Neutralino Mixing Matrix
  1  1     9.99656479E-01   # N_11
  1  2    -2.19604514E-04   # N_12
  1  3     2.61600907E-02   # N_13
  1  4    -1.58937392E-03   # N_14
  2  1     1.72785901E-03   # N_21
  2  2     9.98113144E-01   # N_22
  2  3    -5.61407838E-02   # N_23
  2  4     2.48068167E-02   # N_24
  3  1    -1.73582233E-02   # N_31
  3  2     2.21900966E-02   # N_32
  3  3     7.06462463E-01   # N_33
  3  4     7.07189564E-01   # N_34
  4  1    -1.95609628E-02   # N_41
  4  2     5.72512240E-02   # N_42
  4  3     7.05035212E-01   # N_43
  4  4    -7.06586878E-01   # N_44
#
BLOCK UMIX  # Chargino Mixing Matrix U
  1  1     9.96996184E-01   # U_11
  1  2    -7.74506843E-02   # U_12
  2  1     7.74506843E-02   # U_21
  2  2     9.96996184E-01   # U_22
#
BLOCK VMIX  # Chargino Mixing Matrix V
  1  1     9.99383755E-01   # V_11
  1  2    -3.51014378E-02   # V_12
  2  1     3.51014378E-02   # V_21
  2  2     9.99383755E-01   # V_22
#
BLOCK STOPMIX  # Stop Mixing Matrix
  1  1    -5.52494848E-01   # cos(theta_t)
  1  2     8.33516312E-01   # sin(theta_t)
  2  1    -8.33516312E-01   # -sin(theta_t)
  2  2    -5.52494848E-01   # cos(theta_t)
#
BLOCK SBOTMIX  # Sbottom Mixing Matrix
  1  1     9.43110803E-01   # cos(theta_b)
  1  2     3.32478591E-01   # sin(theta_b)
  2  1    -3.32478591E-01   # -sin(theta_b)
  2  2     9.43110803E-01   # cos(theta_b)
#
BLOCK STAUMIX  # Stau Mixing Matrix
  1  1     5.79386500E-01   # cos(theta_tau)
  1  2     8.15052933E-01   # sin(theta_tau)
  2  1    -8.15052933E-01   # -sin(theta_tau)
  2  2     5.79386500E-01   # cos(theta_tau)
#
BLOCK ALPHA  # Higgs mixing
          -2.60058486E-02   # Mixing angle in the neutral Higgs boson sector
#
BLOCK HMIX Q=  5.00092754E+03  # DRbar Higgs Parameters
         1     1.67500000E+03   # mu(Q)MSSM           
         2     3.87238739E+01   # tan                 
         3     2.41551033E+02   # higgs               
         4     4.64442593E+06   # mA^2(Q)MSSM         
#
BLOCK GAUGE Q=  5.00092754E+03  # The gauge couplings
     1     3.65935810E-01   # gprime(Q) DRbar
     2     6.39870814E-01   # g(Q) DRbar
     3     1.00733714E+00   # g3(Q) DRbar
#
BLOCK AU Q=  5.00092754E+03  # The trilinear couplings
  1  1     4.61100002E+03   # A_u(Q) DRbar
  2  2     4.61100002E+03   # A_c(Q) DRbar
  3  3     4.61100002E+03   # A_t(Q) DRbar
#
BLOCK AD Q=  5.00092754E+03  # The trilinear couplings
  1  1     6.78325763E-06   # A_d(Q) DRbar
  2  2     6.78530079E-06   # A_s(Q) DRbar
  3  3     1.33700432E-05   # A_b(Q) DRbar
#
BLOCK AE Q=  5.00092754E+03  # The trilinear couplings
  1  1     3.68057689E-06   # A_e(Q) DRbar
  2  2     3.68136338E-06   # A_mu(Q) DRbar
  3  3     3.90298015E-06   # A_tau(Q) DRbar
#
BLOCK Yu Q=  5.00092754E+03  # The Yukawa couplings
  1  1     0.00000000E+00   # y_u(Q) DRbar
  2  2     0.00000000E+00   # y_c(Q) DRbar
  3  3     8.13791240E-01   # y_t(Q) DRbar
#
BLOCK Yd Q=  5.00092754E+03  # The Yukawa couplings
  1  1     0.00000000E+00   # y_d(Q) DRbar
  2  2     0.00000000E+00   # y_s(Q) DRbar
  3  3     4.60072452E-01   # y_b(Q) DRbar
#
BLOCK Ye Q=  5.00092754E+03  # The Yukawa couplings
  1  1     0.00000000E+00   # y_e(Q) DRbar
  2  2     0.00000000E+00   # y_mu(Q) DRbar
  3  3     4.03589793E-01   # y_tau(Q) DRbar
#
BLOCK MSOFT Q=  5.00092754E+03  # The soft SUSY breaking masses at the scale Q
         1     6.00000000E+01   # M_1(Q)              
         2     7.00000000E+02   # M_2(Q)              
         3     2.00000000E+03   # M_3(Q)              
        21     1.45311949E+06   # mH1^2(Q)            
        22    -2.29108306E+06   # mH2^2(Q)            
        31     5.00000000E+03   # meL(Q)              
        32     5.00000000E+03   # mmuL(Q)             
        33     5.00000000E+03   # mtauL(Q)            
        34     5.00000000E+03   # meR(Q)              
        35     5.00000000E+03   # mmuR(Q)             
        36     5.00000000E+03   # mtauR(Q)            
        41     9.49999971E+02   # mqL1(Q)             
        42     9.49999971E+02   # mqL2(Q)             
        43     4.99999999E+03   # mqL3(Q)             
        44     4.99999999E+03   # muR(Q)              
        45     4.99999999E+03   # mcR(Q)              
        46     4.99999999E+03   # mtR(Q)              
        47     4.99999999E+03   # mdR(Q)              
        48     4.99999999E+03   # msR(Q)              
        49     4.99999999E+03   # mbR(Q)              
#
#
#
#                             =================
#                             |The decay table|
#                             =================
#
# - The QCD corrections to the decays gluino -> squark  + quark
#                                     squark -> gaugino + quark_prime
#                                     squark -> squark_prime + Higgs
#                                     squark -> gluino  + quark
#   are included.
#
# - The multi-body decays for the inos, stops and sbottoms are included.
#
# - The loop induced decays for the gluino, neutralinos and stops
#   are included.
#
# - The SUSY decays of the top quark are included.
#
#
#         PDG            Width
DECAY         6     1.44223145E+00   # top decays
#          BR         NDA      ID1       ID2
     1.00000000E+00    2           5        24   # BR(t ->  b    W+)
#
#         PDG            Width
DECAY   1000021     9.36210565E+01   # gluino decays
#          BR         NDA      ID1       ID2
     1.24797388E-01    2     1000001        -1   # BR(~g -> ~d_L  db)
     1.24797388E-01    2    -1000001         1   # BR(~g -> ~d_L* d )
     1.25202612E-01    2     1000002        -2   # BR(~g -> ~u_L  ub)
     1.25202612E-01    2    -1000002         2   # BR(~g -> ~u_L* u )
     1.24797388E-01    2     1000003        -3   # BR(~g -> ~s_L  sb)
     1.24797388E-01    2    -1000003         3   # BR(~g -> ~s_L* s )
     1.25202612E-01    2     1000004        -4   # BR(~g -> ~c_L  cb)
     1.25202612E-01    2    -1000004         4   # BR(~g -> ~c_L* c )
#
#         PDG            Width
DECAY   1000006     3.14020501E+02   # stop1 decays
#          BR         NDA      ID1       ID2
     2.57397067E-02    2     1000022         6   # BR(~t_1 -> ~chi_10 t )
     1.50400546E-02    2     1000023         6   # BR(~t_1 -> ~chi_20 t )
     7.67351751E-02    2     1000025         6   # BR(~t_1 -> ~chi_30 t )
     8.58492336E-02    2     1000035         6   # BR(~t_1 -> ~chi_40 t )
     3.02543695E-02    2     1000024         5   # BR(~t_1 -> ~chi_1+ b )
     1.32214149E-01    2     1000037         5   # BR(~t_1 -> ~chi_2+ b )
     6.34167311E-01    2     1000021         6   # BR(~t_1 -> ~g      t )
#
#         PDG            Width
DECAY   2000006     3.47506954E+02   # stop2 decays
#          BR         NDA      ID1       ID2
     1.13775791E-02    2     1000022         6   # BR(~t_2 -> ~chi_10 t )
     4.09158913E-02    2     1000023         6   # BR(~t_2 -> ~chi_20 t )
     7.90382504E-02    2     1000025         6   # BR(~t_2 -> ~chi_30 t )
     7.04972270E-02    2     1000035         6   # BR(~t_2 -> ~chi_40 t )
     8.22827830E-02    2     1000024         5   # BR(~t_2 -> ~chi_1+ b )
     7.49647020E-02    2     1000037         5   # BR(~t_2 -> ~chi_2+ b )
     6.39433564E-01    2     1000021         6   # BR(~t_2 -> ~g      t )
     1.63924815E-04    2     1000006        25   # BR(~t_2 -> ~t_1    h )
     1.32607828E-03    2     1000006        23   # BR(~t_2 -> ~t_1    Z )
#
#         PDG            Width
DECAY   1000005     3.28277931E+02   # sbottom1 decays
#          BR         NDA      ID1       ID2
     3.54303870E-03    2     1000022         5   # BR(~b_1 -> ~chi_10 b )
     5.32233165E-02    2     1000023         5   # BR(~b_1 -> ~chi_20 b )
     2.45308598E-02    2     1000025         5   # BR(~b_1 -> ~chi_30 b )
     2.37389775E-02    2     1000035         5   # BR(~b_1 -> ~chi_40 b )
     1.05771980E-01    2    -1000024         6   # BR(~b_1 -> ~chi_1- t )
     1.41599028E-01    2    -1000037         6   # BR(~b_1 -> ~chi_2- t )
     6.47592644E-01    2     1000021         5   # BR(~b_1 -> ~g      b )
     1.55641013E-07    2     1000006       -24   # BR(~b_1 -> ~t_1    W-)
#
#         PDG            Width
DECAY   2000005     2.62104459E+02   # sbottom2 decays
#          BR         NDA      ID1       ID2
     9.39299049E-03    2     1000022         5   # BR(~b_2 -> ~chi_10 b )
     5.67746634E-03    2     1000023         5   # BR(~b_2 -> ~chi_20 b )
     3.28077619E-02    2     1000025         5   # BR(~b_2 -> ~chi_30 b )
     3.36982985E-02    2     1000035         5   # BR(~b_2 -> ~chi_40 b )
     1.13866729E-02    2    -1000024         6   # BR(~b_2 -> ~chi_1- t )
     8.45982812E-02    2    -1000037         6   # BR(~b_2 -> ~chi_2- t )
     8.21937016E-01    2     1000021         5   # BR(~b_2 -> ~g      b )
     5.01512374E-04    2     1000006       -24   # BR(~b_2 -> ~t_1    W-)
#
#         PDG            Width
DECAY   1000002     5.71747148E+00   # sup_L decays
#          BR         NDA      ID1       ID2
     3.04485478E-02    2     1000022         2   # BR(~u_L -> ~chi_10 u)
     3.22903433E-01    2     1000023         2   # BR(~u_L -> ~chi_20 u)
     6.46648019E-01    2     1000024         1   # BR(~u_L -> ~chi_1+ d)
#
#         PDG            Width
DECAY   2000002     2.52079139E+02   # sup_R decays
#          BR         NDA      ID1       ID2
     4.58670351E-02    2     1000022         2   # BR(~u_R -> ~chi_10 u)
     1.31679899E-07    2     1000023         2   # BR(~u_R -> ~chi_20 u)
     1.09284527E-05    2     1000025         2   # BR(~u_R -> ~chi_30 u)
     1.38687862E-05    2     1000035         2   # BR(~u_R -> ~chi_40 u)
     9.54108036E-01    2     1000021         2   # BR(~u_R -> ~g      u)
#
#         PDG            Width
DECAY   1000001     5.74017067E+00   # sdown_L decays
#          BR         NDA      ID1       ID2
     3.05326280E-02    2     1000022         1   # BR(~d_L -> ~chi_10 d)
     3.23620876E-01    2     1000023         1   # BR(~d_L -> ~chi_20 d)
     6.45846496E-01    2    -1000024         2   # BR(~d_L -> ~chi_1- u)
#
#         PDG            Width
DECAY   2000001     2.43729495E+02   # sdown_R decays
#          BR         NDA      ID1       ID2
     1.18677104E-02    2     1000022         1   # BR(~d_R -> ~chi_10 d)
     3.40729023E-08    2     1000023         1   # BR(~d_R -> ~chi_20 d)
     2.82859345E-06    2     1000025         1   # BR(~d_R -> ~chi_30 d)
     3.58963876E-06    2     1000035         1   # BR(~d_R -> ~chi_40 d)
     9.88125837E-01    2     1000021         1   # BR(~d_R -> ~g      d)
#
#         PDG            Width
DECAY   1000004     5.71747148E+00   # scharm_L decays
#          BR         NDA      ID1       ID2
     3.04485478E-02    2     1000022         4   # BR(~c_L -> ~chi_10 c)
     3.22903433E-01    2     1000023         4   # BR(~c_L -> ~chi_20 c)
     6.46648019E-01    2     1000024         3   # BR(~c_L -> ~chi_1+ s)
#
#         PDG            Width
DECAY   2000004     2.52079139E+02   # scharm_R decays
#          BR         NDA      ID1       ID2
     4.58670351E-02    2     1000022         4   # BR(~c_R -> ~chi_10 c)
     1.31679899E-07    2     1000023         4   # BR(~c_R -> ~chi_20 c)
     1.09284527E-05    2     1000025         4   # BR(~c_R -> ~chi_30 c)
     1.38687862E-05    2     1000035         4   # BR(~c_R -> ~chi_40 c)
     9.54108036E-01    2     1000021         4   # BR(~c_R -> ~g      c)
#
#         PDG            Width
DECAY   1000003     5.74017067E+00   # sstrange_L decays
#          BR         NDA      ID1       ID2
     3.05326280E-02    2     1000022         3   # BR(~s_L -> ~chi_10 s)
     3.23620876E-01    2     1000023         3   # BR(~s_L -> ~chi_20 s)
     6.45846496E-01    2    -1000024         4   # BR(~s_L -> ~chi_1- c)
#
#         PDG            Width
DECAY   2000003     2.43729495E+02   # sstrange_R decays
#          BR         NDA      ID1       ID2
     1.18677104E-02    2     1000022         3   # BR(~s_R -> ~chi_10 s)
     3.40729023E-08    2     1000023         3   # BR(~s_R -> ~chi_20 s)
     2.82859345E-06    2     1000025         3   # BR(~s_R -> ~chi_30 s)
     3.58963876E-06    2     1000035         3   # BR(~s_R -> ~chi_40 s)
     9.88125837E-01    2     1000021         3   # BR(~s_R -> ~g      s)
#
#         PDG            Width
DECAY   1000011     6.52621061E+01   # selectron_L decays
#          BR         NDA      ID1       ID2
     1.02043276E-01    2     1000022        11   # BR(~e_L -> ~chi_10 e-)
     2.98998071E-01    2     1000023        11   # BR(~e_L -> ~chi_20 e-)
     3.68317861E-05    2     1000025        11   # BR(~e_L -> ~chi_30 e-)
     5.19346058E-04    2     1000035        11   # BR(~e_L -> ~chi_40 e-)
     5.95466735E-01    2    -1000024        12   # BR(~e_L -> ~chi_1- nu_e)
     2.93573973E-03    2    -1000037        12   # BR(~e_L -> ~chi_2- nu_e)
#
#         PDG            Width
DECAY   2000011     2.66765471E+01   # selectron_R decays
#          BR         NDA      ID1       ID2
     9.99461125E-01    2     1000022        11   # BR(~e_R -> ~chi_10 e-)
     2.86248866E-06    2     1000023        11   # BR(~e_R -> ~chi_20 e-)
     2.36229960E-04    2     1000025        11   # BR(~e_R -> ~chi_30 e-)
     2.99782860E-04    2     1000035        11   # BR(~e_R -> ~chi_40 e-)
#
#         PDG            Width
DECAY   1000013     6.52621061E+01   # smuon_L decays
#          BR         NDA      ID1       ID2
     1.02043276E-01    2     1000022        13   # BR(~mu_L -> ~chi_10 mu-)
     2.98998071E-01    2     1000023        13   # BR(~mu_L -> ~chi_20 mu-)
     3.68317861E-05    2     1000025        13   # BR(~mu_L -> ~chi_30 mu-)
     5.19346058E-04    2     1000035        13   # BR(~mu_L -> ~chi_40 mu-)
     5.95466735E-01    2    -1000024        14   # BR(~mu_L -> ~chi_1- nu_mu)
     2.93573973E-03    2    -1000037        14   # BR(~mu_L -> ~chi_2- nu_mu)
#
#         PDG            Width
DECAY   2000013     2.66765471E+01   # smuon_R decays
#          BR         NDA      ID1       ID2
     9.99461125E-01    2     1000022        13   # BR(~mu_R -> ~chi_10 mu-)
     2.86248866E-06    2     1000023        13   # BR(~mu_R -> ~chi_20 mu-)
     2.36229960E-04    2     1000025        13   # BR(~mu_R -> ~chi_30 mu-)
     2.99782860E-04    2     1000035        13   # BR(~mu_R -> ~chi_40 mu-)
#
#         PDG            Width
DECAY   1000015     6.09858065E+01   # stau_1 decays
#          BR         NDA      ID1       ID2
     3.29757820E-01    2     1000022        15   # BR(~tau_1 -> ~chi_10  tau-)
     1.22646853E-01    2     1000023        15   # BR(~tau_1 -> ~chi_20  tau-)
     9.84085474E-02    2     1000025        15   # BR(~tau_1 -> ~chi_30  tau-)
     9.24682088E-02    2     1000035        15   # BR(~tau_1 -> ~chi_40  tau-)
     2.43061954E-01    2    -1000024        16   # BR(~tau_1 -> ~chi_1-  nu_tau)
     1.13656617E-01    2    -1000037        16   # BR(~tau_1 -> ~chi_2-  nu_tau)
#
#         PDG            Width
DECAY   2000015     6.87430180E+01   # stau_2 decays
#          BR         NDA      ID1       ID2
     1.90940133E-01    2     1000022        15   # BR(~tau_2 -> ~chi_10  tau-)
     1.75852803E-01    2     1000023        15   # BR(~tau_2 -> ~chi_20  tau-)
     9.67933178E-02    2     1000025        15   # BR(~tau_2 -> ~chi_30  tau-)
     1.01721624E-01    2     1000035        15   # BR(~tau_2 -> ~chi_40  tau-)
     3.49803986E-01    2    -1000024        16   # BR(~tau_2 -> ~chi_1-  nu_tau)
     8.48881355E-02    2    -1000037        16   # BR(~tau_2 -> ~chi_2-  nu_tau)
#
#         PDG            Width
DECAY   1000012     6.52712215E+01   # snu_eL decays
#          BR         NDA      ID1       ID2
     1.02166858E-01    2     1000022        12   # BR(~nu_eL -> ~chi_10 nu_e)
     2.97714499E-01    2     1000023        12   # BR(~nu_eL -> ~chi_20 nu_e)
     2.52528917E-04    2     1000025        12   # BR(~nu_eL -> ~chi_30 nu_e)
     1.14586716E-03    2     1000035        12   # BR(~nu_eL -> ~chi_40 nu_e)
     5.98117502E-01    2     1000024        11   # BR(~nu_eL -> ~chi_1+ e-)
     6.02744250E-04    2     1000037        11   # BR(~nu_eL -> ~chi_2+ e-)
#
#         PDG            Width
DECAY   1000014     6.52712215E+01   # snu_muL decays
#          BR         NDA      ID1       ID2
     1.02166858E-01    2     1000022        14   # BR(~nu_muL -> ~chi_10 nu_mu)
     2.97714499E-01    2     1000023        14   # BR(~nu_muL -> ~chi_20 nu_mu)
     2.52528917E-04    2     1000025        14   # BR(~nu_muL -> ~chi_30 nu_mu)
     1.14586716E-03    2     1000035        14   # BR(~nu_muL -> ~chi_40 nu_mu)
     5.98117502E-01    2     1000024        13   # BR(~nu_muL -> ~chi_1+ mu-)
     6.02744250E-04    2     1000037        13   # BR(~nu_muL -> ~chi_2+ mu-)
#
#         PDG            Width
DECAY   1000016     7.78320947E+01   # snu_tauL decays
#          BR         NDA      ID1       ID2
     8.55267416E-02    2     1000022        16   # BR(~nu_tauL -> ~chi_10 nu_tau)
     2.49187314E-01    2     1000023        16   # BR(~nu_tauL -> ~chi_20 nu_tau)
     2.11204306E-04    2     1000025        16   # BR(~nu_tauL -> ~chi_30 nu_tau)
     9.58351283E-04    2     1000035        16   # BR(~nu_tauL -> ~chi_40 nu_tau)
     5.01815745E-01    2     1000024        15   # BR(~nu_tauL -> ~chi_1+ tau-)
     1.62300643E-01    2     1000037        15   # BR(~nu_tauL -> ~chi_2+ tau-)
#
#         PDG            Width
DECAY   1000024     6.60573191E-04   # chargino1+ decays
#          BR         NDA      ID1       ID2
     1.00000000E+00    2     1000022        24   # BR(~chi_1+ -> ~chi_10  W+)
#
#         PDG            Width
DECAY   1000037     1.05270018E+01   # chargino2+ decays
#          BR         NDA      ID1       ID2
     6.68225074E-04    2     1000002        -1   # BR(~chi_2+ -> ~u_L     db)
     3.22751883E-03    2    -1000001         2   # BR(~chi_2+ -> ~d_L*    u )
     6.68225074E-04    2     1000004        -3   # BR(~chi_2+ -> ~c_L     sb)
     3.22751883E-03    2    -1000003         4   # BR(~chi_2+ -> ~s_L*    c )
     2.95116252E-01    2     1000024        23   # BR(~chi_2+ -> ~chi_1+  Z )
     9.97923276E-02    2     1000022        24   # BR(~chi_2+ -> ~chi_10  W+)
     2.75839027E-01    2     1000023        24   # BR(~chi_2+ -> ~chi_20  W+)
     3.21460906E-01    2     1000024        25   # BR(~chi_2+ -> ~chi_1+  h )
#
#         PDG            Width
DECAY   1000022     0.00000000E+00   # neutralino1 decays
#
#         PDG            Width
DECAY   1000023     7.36214623E-04   # neutralino2 decays
#          BR         NDA      ID1       ID2
     3.41011367E-01    2     1000022        23   # BR(~chi_20 -> ~chi_10   Z )
     6.58988633E-01    2     1000022        25   # BR(~chi_20 -> ~chi_10   h )
#
#         PDG            Width
DECAY   1000025     1.05110703E+01   # neutralino3 decays
#          BR         NDA      ID1       ID2
     5.77997675E-02    2     1000022        23   # BR(~chi_30 -> ~chi_10   Z )
     2.66265511E-01    2     1000023        23   # BR(~chi_30 -> ~chi_20   Z )
     2.93770725E-01    2     1000024       -24   # BR(~chi_30 -> ~chi_1+   W-)
     2.93770725E-01    2    -1000024        24   # BR(~chi_30 -> ~chi_1-   W+)
     4.68993400E-02    2     1000022        25   # BR(~chi_30 -> ~chi_10   h )
     4.04143791E-02    2     1000023        25   # BR(~chi_30 -> ~chi_20   h )
     9.63985457E-05    2     1000002        -2   # BR(~chi_30 -> ~u_L      ub)
     9.63985457E-05    2    -1000002         2   # BR(~chi_30 -> ~u_L*     u )
     1.74433323E-04    2     1000001        -1   # BR(~chi_30 -> ~d_L      db)
     1.74433323E-04    2    -1000001         1   # BR(~chi_30 -> ~d_L*     d )
     9.63985457E-05    2     1000004        -4   # BR(~chi_30 -> ~c_L      cb)
     9.63985457E-05    2    -1000004         4   # BR(~chi_30 -> ~c_L*     c )
     1.74433323E-04    2     1000003        -3   # BR(~chi_30 -> ~s_L      sb)
     1.74433323E-04    2    -1000003         3   # BR(~chi_30 -> ~s_L*     s )
#
#         PDG            Width
DECAY   1000035     1.09825049E+01   # neutralino4 decays
#          BR         NDA      ID1       ID2
     4.34028724E-02    2     1000022        23   # BR(~chi_40 -> ~chi_10   Z )
     3.89420860E-02    2     1000023        23   # BR(~chi_40 -> ~chi_20   Z )
     2.92195382E-01    2     1000024       -24   # BR(~chi_40 -> ~chi_1+   W-)
     2.92195382E-01    2    -1000024        24   # BR(~chi_40 -> ~chi_1-   W+)
     5.72382060E-02    2     1000022        25   # BR(~chi_40 -> ~chi_10   h )
     2.69224119E-01    2     1000023        25   # BR(~chi_40 -> ~chi_20   h )
     7.45741465E-04    2     1000002        -2   # BR(~chi_40 -> ~u_L      ub)
     7.45741465E-04    2    -1000002         2   # BR(~chi_40 -> ~u_L*     u )
     9.60453518E-04    2     1000001        -1   # BR(~chi_40 -> ~d_L      db)
     9.60453518E-04    2    -1000001         1   # BR(~chi_40 -> ~d_L*     d )
     7.45741465E-04    2     1000004        -4   # BR(~chi_40 -> ~c_L      cb)
     7.45741465E-04    2    -1000004         4   # BR(~chi_40 -> ~c_L*     c )
     9.60453518E-04    2     1000003        -3   # BR(~chi_40 -> ~s_L      sb)
     9.60453518E-04    2    -1000003         3   # BR(~chi_40 -> ~s_L*     s )
#
#         PDG            Width
DECAY        25     4.15993156E-03   # h decays
#          BR         NDA      ID1       ID2
     6.15219408E-01    2           5        -5   # BR(h -> b       bb     )
     6.31740579E-02    2         -15        15   # BR(h -> tau+    tau-   )
     2.23612326E-04    2         -13        13   # BR(h -> mu+     mu-    )
     4.16942767E-04    2           3        -3   # BR(h -> s       sb     )
     1.79608613E-02    2           4        -4   # BR(h -> c       cb     )
     6.90040447E-02    2          21        21   # BR(h -> g       g      )
     2.27597603E-03    2          22        22   # BR(h -> gam     gam    )
     1.51907483E-03    2          22        23   # BR(h -> Z       gam    )
     2.04616893E-01    2          24       -24   # BR(h -> W+      W-     )
     2.55772019E-02    2          23        23   # BR(h -> Z       Z      )
     1.19278051E-05    2     1000022   1000022   # BR(h -> ~chi_10 ~chi_10)
#
#         PDG            Width
DECAY        35     3.67985599E+01   # H decays
#          BR         NDA      ID1       ID2
     8.21247105E-01    2           5        -5   # BR(H -> b       bb     )
     1.68906114E-01    2         -15        15   # BR(H -> tau+    tau-   )
     5.97146008E-04    2         -13        13   # BR(H -> mu+     mu-    )
     6.74409457E-04    2           3        -3   # BR(H -> s       sb     )
     1.36721208E-08    2           4        -4   # BR(H -> c       cb     )
     1.54230765E-03    2           6        -6   # BR(H -> t       tb     )
     2.82644099E-05    2          21        21   # BR(H -> g       g      )
     3.48778731E-08    2          22        22   # BR(H -> gam     gam    )
     1.50653628E-08    2          23        22   # BR(H -> Z       gam    )
     2.48994836E-06    2          24       -24   # BR(H -> W+      W-     )
     1.24151767E-06    2          23        23   # BR(H -> Z       Z      )
     6.91591906E-06    2          25        25   # BR(H -> h       h      )
     9.82838213E-24    2          36        36   # BR(H -> A       A      )
     4.26719101E-20    2          23        36   # BR(H -> Z       A      )
     8.74601009E-04    2     1000024  -1000024   # BR(H -> ~chi_1+ ~chi_1-)
     8.96875128E-05    2     1000022   1000022   # BR(H -> ~chi_10 ~chi_10)
     4.58125517E-04    2     1000023   1000023   # BR(H -> ~chi_20 ~chi_20)
     5.25261373E-04    2     1000022   1000023   # BR(H -> ~chi_10 ~chi_20)
     3.13377445E-03    2     1000022   1000025   # BR(H -> ~chi_10 ~chi_30)
     1.91249256E-03    2     1000022   1000035   # BR(H -> ~chi_10 ~chi_40)
#
#         PDG            Width
DECAY        36     3.68609164E+01   # A decays
#          BR         NDA      ID1       ID2
     8.19879225E-01    2           5        -5   # BR(A -> b       bb     )
     1.68620390E-01    2         -15        15   # BR(A -> tau+    tau-   )
     5.96133993E-04    2         -13        13   # BR(A -> mu+     mu-    )
     6.73298155E-04    2           3        -3   # BR(A -> s       sb     )
     1.35797986E-08    2           4        -4   # BR(A -> c       cb     )
     1.54904481E-03    2           6        -6   # BR(A -> t       tb     )
     5.31585522E-05    2          21        21   # BR(A -> g       g      )
     5.25429548E-08    2          22        22   # BR(A -> gam     gam    )
     3.38830717E-08    2          23        22   # BR(A -> Z       gam    )
     2.46486972E-06    2          23        25   # BR(A -> Z       h      )
     1.93779713E-03    2     1000024  -1000024   # BR(A -> ~chi_1+ ~chi_1-)
     9.04197707E-05    2     1000022   1000022   # BR(A -> ~chi_10 ~chi_10)
     1.01342420E-03    2     1000023   1000023   # BR(A -> ~chi_20 ~chi_20)
     5.66439013E-04    2     1000022   1000023   # BR(A -> ~chi_10 ~chi_20)
     1.95809845E-03    2     1000022   1000025   # BR(A -> ~chi_10 ~chi_30)
     3.06000564E-03    2     1000022   1000035   # BR(A -> ~chi_10 ~chi_40)
#
#         PDG            Width
DECAY        37     3.36950437E+01   # H+ decays
#          BR         NDA      ID1       ID2
     1.29151903E-03    2           4        -5   # BR(H+ -> c       bb     )
     1.84625567E-01    2         -15        16   # BR(H+ -> tau+    nu_tau )
     6.52718074E-04    2         -13        14   # BR(H+ -> mu+     nu_mu  )
     8.26569953E-06    2           2        -5   # BR(H+ -> u       bb     )
     3.52158854E-05    2           2        -3   # BR(H+ -> u       sb     )
     7.24319084E-04    2           4        -3   # BR(H+ -> c       sb     )
     8.06043948E-01    2           6        -5   # BR(H+ -> t       bb     )
     2.70747121E-06    2          24        25   # BR(H+ -> W+      h      )
     6.55874701E-13    2          24        36   # BR(H+ -> W+      A      )
     1.16252580E-03    2     1000024   1000022   # BR(H+ -> ~chi_1+ ~chi_10)
     4.04355198E-07    2     1000024   1000023   # BR(H+ -> ~chi_1+ ~chi_20)
     5.45280920E-03    2     1000037   1000022   # BR(H+ -> ~chi_2+ ~chi_10)
