#
#                              ======================
#                              | THE SUSYHIT OUTPUT |
#                              ======================
#
#
#              ------------------------------------------------------
#              |     This is the output of the SUSY-HIT package     |
#              |  created by A.Djouadi, M.Muehlleitner and M.Spira. |
#              |  In case of problems with SUSY-HIT email to        |
#              |           margarete.muehlleitner@cern.ch           |
#              |           michael.spira@psi.ch                     |
#              |           abdelhak.djouadi@cern.ch                 |
#              ------------------------------------------------------
#
#              ------------------------------------------------------
#              |  SUSY Les Houches Accord - MSSM Spectrum + Decays  |
#              |              based on the decay programs           |
#              |                                                    |
#              |                     SDECAY 1.3b                    |
#              |                                                    |
#              |  Authors: M.Muhlleitner, A.Djouadi and Y.Mambrini  |
#              |  Ref.:    Comput.Phys.Commun.168(2005)46           |
#              |           [hep-ph/0311167]                         |
#              |                                                    |
#              |                     HDECAY 3.4                     |
#              |                                                    |
#              |  By: A.Djouadi,J.Kalinowski,M.Muhlleitner,M.Spira  |
#              |  Ref.:    Comput.Phys.Commun.108(1998)56           |
#              |           [hep-ph/9704448]                         |
#              |                                                    |
#              |                                                    |
#              |  If not stated otherwise all DRbar couplings and   |
#              |  soft SUSY breaking masses are given at the scale  |
#              |  Q=  0.27759970E+04
#              |                                                    |
#              ------------------------------------------------------
#
#
BLOCK DCINFO  # Decay Program information
     1   SDECAY/HDECAY # decay calculator
     2   1.3b  /3.4    # version number
#
BLOCK SPINFO  # Spectrum calculator information
     1     SOFTSUSY    # spectrum calculator               
     2     3.4.0       # version number                    
#
BLOCK MODSEL  # Model selection
     1     0   #  nonUniversal                                     
#
BLOCK SMINPUTS  # Standard Model inputs
         1     1.27908970E+02   # alpha_em^-1(M_Z)^MSbar
         2     1.16637870E-05   # G_F [GeV^-2]
         3     1.18400000E-01   # alpha_S(M_Z)^MSbar
         4     9.11876000E+01   # M_Z pole mass
         5     4.18000000E+00   # mb(mb)^MSbar
         6     1.73200000E+02   # mt pole mass
         7     1.77700000E+00   # mtau pole mass
#
BLOCK MINPAR  # Input parameters - minimal models
         3     2.43200000E+01   # tanb                
#
BLOCK EXTPAR  # Input parameters - non-minimal models
         0    -1.00000000E+00   # Set                 
         1    -1.76000000E+02   # M_1(MX)             
         2    -1.95760000E+02   # M_2(MX)             
         3     2.18896000E+03   # M_3(MX)             
        11    -2.01595000E+03   # At(MX)              
        12    -2.21000000E+02   # Ab(MX)              
        13    -1.22598000E+03   # Atau(MX)            
        23     2.71380000E+02   # mu(MX)              
        26     2.15694000E+03   # mA(pole)            
        31     2.67772000E+03   # meL(MX)             
        32     2.67772000E+03   # mmuL(MX)            
        33     3.02960000E+02   # mtauL(MX)           
        34     2.40695000E+03   # meR(MX)             
        35     2.40695000E+03   # mmuR(MX)            
        36     3.26896000E+03   # mtauR(MX)           
        41     2.80597000E+03   # mqL1(MX)            
        42     2.80597000E+03   # mqL2(MX)            
        43     2.90956000E+03   # mqL3(MX)            
        44     3.17601000E+03   # muR(MX)             
        45     3.17601000E+03   # mcR(MX)             
        46     2.64418000E+03   # mtR(MX)             
        47     3.95266000E+03   # mdR(MX)             
        48     3.95266000E+03   # msR(MX)             
        49     2.30850000E+02   # mbR(MX)             
#
BLOCK MASS  # Mass Spectrum
# PDG code           mass       particle
        24     8.03805164E+01   # W+
        25     1.24691959E+02   # h
        35     2.15695669E+03   # H
        36     2.15693998E+03   # A
        37     2.15883784E+03   # H+
         5     4.81876030E+00   # b-quark pole mass calculated from mb(mb)_Msbar
   1000001     2.88011518E+03   # ~d_L
   2000001     4.00228108E+03   # ~d_R
   1000002     2.87916716E+03   # ~u_L
   2000002     3.23510910E+03   # ~u_R
   1000003     2.88011518E+03   # ~s_L
   2000003     4.00228108E+03   # ~s_R
   1000004     2.87916716E+03   # ~c_L
   2000004     3.23510910E+03   # ~c_R
   1000005     5.42151567E+02   # ~b_1
   2000005     2.95388952E+03   # ~b_2
   1000006     2.66481555E+03   # ~t_1
   2000006     2.96627756E+03   # ~t_2
   1000011     2.68223257E+03   # ~e_L
   2000011     2.41155766E+03   # ~e_R
   1000012     2.68072732E+03   # ~nu_eL
   1000013     2.68223257E+03   # ~mu_L
   2000013     2.41155766E+03   # ~mu_R
   1000014     2.68072732E+03   # ~nu_muL
   1000015     2.92880326E+02   # ~tau_1
   2000015     3.27062591E+03   # ~tau_2
   1000016     2.81583348E+02   # ~nu_tauL
   1000021     2.40624559E+03   # ~g
   1000022    -1.65932780E+02   # ~chi_10
   1000023    -1.93009978E+02   # ~chi_20
   1000025     2.90859170E+02   # ~chi_30
   1000035    -3.17070549E+02   # ~chi_40
   1000024     1.89115550E+02   # ~chi_1+
   1000037     3.17654956E+02   # ~chi_2+
#
BLOCK NMIX  # Neutralino Mixing Matrix
  1  1     8.78015660E-01   # N_11
  1  2    -2.97310125E-01   # N_12
  1  3     3.27350927E-01   # N_13
  1  4     1.83129900E-01   # N_14
  2  1     4.32639911E-01   # N_21
  2  2     8.27614647E-01   # N_22
  2  3    -2.99148712E-01   # N_23
  2  4    -1.95925375E-01   # N_24
  3  1     6.93696903E-02   # N_31
  3  2    -1.17592328E-01   # N_32
  3  3    -6.90333833E-01   # N_33
  3  4     7.10492146E-01   # N_34
  4  1    -1.92611148E-01   # N_41
  4  2     4.61337979E-01   # N_42
  4  3     5.71656031E-01   # N_43
  4  4     6.50597877E-01   # N_44
#
BLOCK UMIX  # Chargino Mixing Matrix U
  1  1     8.22007949E-01   # U_11
  1  2    -5.69476015E-01   # U_12
  2  1     5.69476015E-01   # U_21
  2  2     8.22007949E-01   # U_22
#
BLOCK VMIX  # Chargino Mixing Matrix V
  1  1    -9.31782893E-01   # V_11
  1  2    -3.63016033E-01   # V_12
  2  1    -3.63016033E-01   # V_21
  2  2     9.31782893E-01   # V_22
#
BLOCK STOPMIX  # Stop Mixing Matrix
  1  1     1.85695930E-01   # cos(theta_t)
  1  2     9.82607257E-01   # sin(theta_t)
  2  1    -9.82607257E-01   # -sin(theta_t)
  2  2     1.85695930E-01   # cos(theta_t)
#
BLOCK SBOTMIX  # Sbottom Mixing Matrix
  1  1     1.84286794E-03   # cos(theta_b)
  1  2     9.99998302E-01   # sin(theta_b)
  2  1    -9.99998302E-01   # -sin(theta_b)
  2  2     1.84286794E-03   # cos(theta_b)
#
BLOCK STAUMIX  # Stau Mixing Matrix
  1  1     9.99999224E-01   # cos(theta_tau)
  1  2     1.24579268E-03   # sin(theta_tau)
  2  1    -1.24579268E-03   # -sin(theta_tau)
  2  2     9.99999224E-01   # cos(theta_tau)
#
BLOCK ALPHA  # Higgs mixing
          -4.29745315E-02   # Mixing angle in the neutral Higgs boson sector
#
BLOCK HMIX Q=  2.77599700E+03  # DRbar Higgs Parameters
         1     2.75814173E+02   # mu(Q)MSSM           
         2     2.33621832E+01   # tan                 
         3     2.40956747E+02   # higgs               
         4     4.57974725E+06   # mA^2(Q)MSSM         
#
BLOCK GAUGE Q=  2.77599700E+03  # The gauge couplings
     1     3.65008733E-01   # gprime(Q) DRbar
     2     6.43780145E-01   # g(Q) DRbar
     3     1.01658195E+00   # g3(Q) DRbar
#
BLOCK AU Q=  2.77599700E+03  # The trilinear couplings
  1  1     0.00000000E+00   # A_u(Q) DRbar
  2  2     0.00000000E+00   # A_c(Q) DRbar
  3  3    -2.01594999E+03   # A_t(Q) DRbar
#
BLOCK AD Q=  2.77599700E+03  # The trilinear couplings
  1  1     0.00000000E+00   # A_d(Q) DRbar
  2  2     0.00000000E+00   # A_s(Q) DRbar
  3  3    -2.20999996E+02   # A_b(Q) DRbar
#
BLOCK AE Q=  2.77599700E+03  # The trilinear couplings
  1  1     0.00000000E+00   # A_e(Q) DRbar
  2  2     0.00000000E+00   # A_mu(Q) DRbar
  3  3    -1.22598000E+03   # A_tau(Q) DRbar
#
BLOCK Yu Q=  2.77599700E+03  # The Yukawa couplings
  1  1     0.00000000E+00   # y_u(Q) DRbar
  2  2     0.00000000E+00   # y_c(Q) DRbar
  3  3     8.28571937E-01   # y_t(Q) DRbar
#
BLOCK Yd Q=  2.77599700E+03  # The Yukawa couplings
  1  1     0.00000000E+00   # y_d(Q) DRbar
  2  2     0.00000000E+00   # y_s(Q) DRbar
  3  3     3.08957790E-01   # y_b(Q) DRbar
#
BLOCK Ye Q=  2.77599700E+03  # The Yukawa couplings
  1  1     0.00000000E+00   # y_e(Q) DRbar
  2  2     0.00000000E+00   # y_mu(Q) DRbar
  3  3     2.29382656E-01   # y_tau(Q) DRbar
#
BLOCK MSOFT Q=  2.77599700E+03  # The soft SUSY breaking masses at the scale Q
         1    -1.76000000E+02   # M_1(Q)              
         2    -1.95760000E+02   # M_2(Q)              
         3     2.18896000E+03   # M_3(Q)              
        21     4.60468818E+06   # mH1^2(Q)            
        22     1.26786519E+05   # mH2^2(Q)            
        31     2.67772000E+03   # meL(Q)              
        32     2.67772000E+03   # mmuL(Q)             
        33     3.02960000E+02   # mtauL(Q)            
        34     2.40695000E+03   # meR(Q)              
        35     2.40695000E+03   # mmuR(Q)             
        36     3.26896000E+03   # mtauR(Q)            
        41     2.80597000E+03   # mqL1(Q)             
        42     2.80597000E+03   # mqL2(Q)             
        43     2.90955999E+03   # mqL3(Q)             
        44     3.17601000E+03   # muR(Q)              
        45     3.17601000E+03   # mcR(Q)              
        46     2.64417998E+03   # mtR(Q)              
        47     3.95266000E+03   # mdR(Q)              
        48     3.95266000E+03   # msR(Q)              
        49     2.30849938E+02   # mbR(Q)              
#
Block HiggsBoundsInputHiggsCouplingsFermions
# ScalarNormEffCoupSq PseudoSNormEffCoupSq NP   IP1 IP2 IP2
    1.00919890E+00    0.00000000E+00        3  25   5   5  # h0-b-b eff. coupling^2, normalised to SM
    5.45782405E+02    0.00000000E+00        3  35   5   5  # H0-b-b eff. coupling^2, normalised to SM
    0.00000000E+00    5.45791604E+02        3  36   5   5  # A0-b-b eff. coupling^2, normalised to SM
#
    9.99983146E-01    0.00000000E+00        3  25   6   6  # h0-t-t eff. coupling^2, normalised to SM
    1.84905538E-03    0.00000000E+00        3  35   6   6  # H0-t-t eff. coupling^2, normalised to SM
    0.00000000E+00    1.83220114E-03        3  36   6   6  # A0-t-t eff. coupling^2, normalised to SM
#
    1.00919890E+00    0.00000000E+00        3  25  15  15  # h0-tau-tau eff. coupling^2, normalised to SM
    5.45782405E+02    0.00000000E+00        3  35  15  15  # H0-tau-tau eff. coupling^2, normalised to SM
    0.00000000E+00    5.45791604E+02        3  36  15  15  # A0-tau-tau eff. coupling^2, normalised to SM
#
Block HiggsBoundsInputHiggsCouplingsBosons
    9.99999961E-01        3  25  24  24  # h0-W-W eff. coupling^2, normalised to SM
    3.85831871E-08        3  35  24  24  # H0-W-W eff. coupling^2, normalised to SM
    0.00000000E+00        3  36  24  24  # A0-W-W eff. coupling^2, normalised to SM
#
    9.99999961E-01        3  25  23  23  # h0-Z-Z eff. coupling^2, normalised to SM
    3.85831871E-08        3  35  23  23  # H0-Z-Z eff. coupling^2, normalised to SM
    0.00000000E+00        3  36  23  23  # A0-Z-Z eff. coupling^2, normalised to SM
#
    8.93622613E-01        3  25  21  21  # h0-g-g eff. coupling^2, normalised to SM
    2.29501392E-12        3  35  21  21  # H0-g-g eff. coupling^2, normalised to SM
    4.79461859E-11        3  36  21  21  # A0-g-g eff. coupling^2, normalised to SM
#
    0.00000000E+00        3  25  25  23  # h0-h0-Z eff. coupling^2, normalised to SM
    0.00000000E+00        3  35  25  23  # H0-h0-Z eff. coupling^2, normalised to SM
    3.85831871E-08        3  36  25  23  # A0-h0-Z eff. coupling^2, normalised to SM
    0.00000000E+00        3  35  35  23  # H0-H0-Z eff. coupling^2, normalised to SM
    9.99999961E-01        3  36  35  23  # A0-H0-Z eff. coupling^2, normalised to SM
    0.00000000E+00        3  36  36  23  # A0-A0-Z eff. coupling^2, normalised to SM
#
    0.00000000E+00        4  25  21  21  23  # h0-g-g-Z eff. coupling^2, normalised to SM
    0.00000000E+00        4  35  21  21  23  # H0-g-g-Z eff. coupling^2, normalised to SM
    0.00000000E+00        4  36  21  21  23  # A0-g-g-Z eff. coupling^2, normalised to SM
#
#
#
#                             =================
#                             |The decay table|
#                             =================
#
# - The QCD corrections to the decays gluino -> squark  + quark
#                                     squark -> gaugino + quark_prime
#                                     squark -> squark_prime + Higgs
#                                     squark -> gluino  + quark
#   are included.
#
# - The multi-body decays for the inos, stops and sbottoms are included.
#
# - The loop induced decays for the gluino, neutralinos and stops
#   are included.
#
# - The SUSY decays of the top quark are included.
#
#
#         PDG            Width
DECAY         6     1.46006711E+00   # top decays
#          BR         NDA      ID1       ID2
     1.00000000E+00    2           5        24   # BR(t ->  b    W+)
#
#         PDG            Width
DECAY   1000021     4.51473982E+01   # gluino decays
#          BR         NDA      ID1       ID2
     5.00000000E-01    2     1000005        -5   # BR(~g -> ~b_1  bb)
     5.00000000E-01    2    -1000005         5   # BR(~g -> ~b_1* b )
#
#         PDG            Width
DECAY   1000006     8.11153618E+01   # stop1 decays
#          BR         NDA      ID1       ID2
     5.82873205E-02    2     1000022         6   # BR(~t_1 -> ~chi_10 t )
     2.45195646E-02    2     1000023         6   # BR(~t_1 -> ~chi_20 t )
     2.09025449E-01    2     1000025         6   # BR(~t_1 -> ~chi_30 t )
     2.20494550E-01    2     1000035         6   # BR(~t_1 -> ~chi_40 t )
     2.26319568E-02    2     1000024         5   # BR(~t_1 -> ~chi_1+ b )
     4.09926865E-01    2     1000037         5   # BR(~t_1 -> ~chi_2+ b )
     5.50989846E-02    2     1000021         6   # BR(~t_1 -> ~g      t )
     1.53089509E-05    2     1000005        24   # BR(~t_1 -> ~b_1    W+)
#
#         PDG            Width
DECAY   2000006     1.01330011E+02   # stop2 decays
#          BR         NDA      ID1       ID2
     2.84130205E-02    2     1000022         6   # BR(~t_2 -> ~chi_10 t )
     1.18942762E-01    2     1000023         6   # BR(~t_2 -> ~chi_20 t )
     2.07745443E-01    2     1000025         6   # BR(~t_2 -> ~chi_30 t )
     1.56531987E-01    2     1000035         6   # BR(~t_2 -> ~chi_40 t )
     2.57820448E-01    2     1000024         5   # BR(~t_2 -> ~chi_1+ b )
     3.96669524E-02    2     1000037         5   # BR(~t_2 -> ~chi_2+ b )
     1.58563979E-01    2     1000021         6   # BR(~t_2 -> ~g      t )
     1.42494762E-02    2     1000006        25   # BR(~t_2 -> ~t_1    h )
     1.17592421E-04    2     1000005        37   # BR(~t_2 -> ~b_1    H+)
     1.74628351E-02    2     1000006        23   # BR(~t_2 -> ~t_1    Z )
     4.85504931E-04    2     1000005        24   # BR(~t_2 -> ~b_1    W+)
#
#         PDG            Width
DECAY   1000005     1.16044654E+00   # sbottom1 decays
#          BR         NDA      ID1       ID2
     2.54741611E-01    2     1000022         5   # BR(~b_1 -> ~chi_10 b )
     9.97366321E-02    2     1000023         5   # BR(~b_1 -> ~chi_20 b )
     2.15097355E-01    2     1000025         5   # BR(~b_1 -> ~chi_30 b )
     1.28473878E-01    2     1000035         5   # BR(~b_1 -> ~chi_40 b )
     1.67622357E-01    2    -1000024         6   # BR(~b_1 -> ~chi_1- t )
     1.34328166E-01    2    -1000037         6   # BR(~b_1 -> ~chi_2- t )
#
#         PDG            Width
DECAY   2000005     1.02967313E+02   # sbottom2 decays
#          BR         NDA      ID1       ID2
     3.09491898E-02    2     1000022         5   # BR(~b_2 -> ~chi_10 b )
     7.00208849E-02    2     1000023         5   # BR(~b_2 -> ~chi_20 b )
     2.74785420E-02    2     1000025         5   # BR(~b_2 -> ~chi_30 b )
     4.61024123E-02    2     1000035         5   # BR(~b_2 -> ~chi_40 b )
     2.06733940E-01    2    -1000024         6   # BR(~b_2 -> ~chi_1- t )
     4.08653239E-01    2    -1000037         6   # BR(~b_2 -> ~chi_2- t )
     1.77998565E-01    2     1000021         5   # BR(~b_2 -> ~g      b )
     2.44310745E-04    2     1000005        25   # BR(~b_2 -> ~b_1    h )
     4.63736471E-05    2     1000005        35   # BR(~b_2 -> ~b_1    H )
     4.63936384E-05    2     1000005        36   # BR(~b_2 -> ~b_1    A )
     2.50483023E-04    2     1000005        23   # BR(~b_2 -> ~b_1    Z )
     3.14756655E-02    2     1000006       -24   # BR(~b_2 -> ~t_1    W-)
#
#         PDG            Width
DECAY   1000002     5.27860354E+01   # sup_L decays
#          BR         NDA      ID1       ID2
     3.66728132E-03    2     1000022         2   # BR(~u_L -> ~chi_10 u)
     1.75349934E-01    2     1000023         2   # BR(~u_L -> ~chi_20 u)
     2.29000163E-03    2     1000025         2   # BR(~u_L -> ~chi_30 u)
     3.77396577E-02    2     1000035         2   # BR(~u_L -> ~chi_40 u)
     3.68312745E-01    2     1000024         1   # BR(~u_L -> ~chi_1+ d)
     5.50801645E-02    2     1000037         1   # BR(~u_L -> ~chi_2+ d)
     3.57560216E-01    2     1000021         2   # BR(~u_L -> ~g      u)
#
#         PDG            Width
DECAY   2000002     5.37854236E+01   # sup_R decays
#          BR         NDA      ID1       ID2
     1.03671238E-01    2     1000022         2   # BR(~u_R -> ~chi_10 u)
     2.51294681E-02    2     1000023         2   # BR(~u_R -> ~chi_20 u)
     6.40640476E-04    2     1000025         2   # BR(~u_R -> ~chi_30 u)
     4.92470354E-03    2     1000035         2   # BR(~u_R -> ~chi_40 u)
     8.65633950E-01    2     1000021         2   # BR(~u_R -> ~g      u)
#
#         PDG            Width
DECAY   1000001     5.27911873E+01   # sdown_L decays
#          BR         NDA      ID1       ID2
     4.56113011E-02    2     1000022         1   # BR(~d_L -> ~chi_10 d)
     1.17983587E-01    2     1000023         1   # BR(~d_L -> ~chi_20 d)
     3.58451561E-03    2     1000025         1   # BR(~d_L -> ~chi_30 d)
     5.17923751E-02    2     1000035         1   # BR(~d_L -> ~chi_40 d)
     2.86711103E-01    2    -1000024         2   # BR(~d_L -> ~chi_1- u)
     1.35582662E-01    2    -1000037         2   # BR(~d_L -> ~chi_2- u)
     3.58734456E-01    2     1000021         1   # BR(~d_L -> ~g      d)
#
#         PDG            Width
DECAY   2000001     1.19909268E+02   # sdown_R decays
#          BR         NDA      ID1       ID2
     1.44988609E-02    2     1000022         1   # BR(~d_R -> ~chi_10 d)
     3.51652313E-03    2     1000023         1   # BR(~d_R -> ~chi_20 d)
     8.99141189E-05    2     1000025         1   # BR(~d_R -> ~chi_30 d)
     6.91886777E-04    2     1000035         1   # BR(~d_R -> ~chi_40 d)
     9.81202815E-01    2     1000021         1   # BR(~d_R -> ~g      d)
#
#         PDG            Width
DECAY   1000004     4.99885294E+01   # scharm_L decays
#          BR         NDA      ID1       ID2
     4.07085942E-03    2     1000022         4   # BR(~c_L -> ~chi_10 c)
     1.94603427E-01    2     1000023         4   # BR(~c_L -> ~chi_20 c)
     2.53947812E-03    2     1000025         4   # BR(~c_L -> ~chi_30 c)
     4.18427367E-02    2     1000035         4   # BR(~c_L -> ~chi_40 c)
     4.08766898E-01    2     1000024         3   # BR(~c_L -> ~chi_1+ s)
     6.10682813E-02    2     1000037         3   # BR(~c_L -> ~chi_2+ s)
     2.87108319E-01    2     1000021         4   # BR(~c_L -> ~g      c)
#
#         PDG            Width
DECAY   2000004     4.29787792E+01   # scharm_R decays
#          BR         NDA      ID1       ID2
     1.35998876E-01    2     1000022         4   # BR(~c_R -> ~chi_10 c)
     3.29590615E-02    2     1000023         4   # BR(~c_R -> ~chi_20 c)
     8.39670340E-04    2     1000025         4   # BR(~c_R -> ~chi_30 c)
     6.45353824E-03    2     1000035         4   # BR(~c_R -> ~chi_40 c)
     8.23748854E-01    2     1000021         4   # BR(~c_R -> ~g      c)
#
#         PDG            Width
DECAY   1000003     4.99705188E+01   # sstrange_L decays
#          BR         NDA      ID1       ID2
     5.06537205E-02    2     1000022         3   # BR(~s_L -> ~chi_10 s)
     1.30997652E-01    2     1000023         3   # BR(~s_L -> ~chi_20 s)
     3.97682310E-03    2     1000025         3   # BR(~s_L -> ~chi_30 s)
     5.74493455E-02    2     1000035         3   # BR(~s_L -> ~chi_40 s)
     3.18346533E-01    2    -1000024         4   # BR(~s_L -> ~chi_1- c)
     1.50390831E-01    2    -1000037         4   # BR(~s_L -> ~chi_2- c)
     2.88185094E-01    2     1000021         3   # BR(~s_L -> ~g      s)
#
#         PDG            Width
DECAY   2000003     9.18147853E+01   # sstrange_R decays
#          BR         NDA      ID1       ID2
     1.97255595E-02    2     1000022         3   # BR(~s_R -> ~chi_10 s)
     4.78354517E-03    2     1000023         3   # BR(~s_R -> ~chi_20 s)
     1.22252875E-04    2     1000025         3   # BR(~s_R -> ~chi_30 s)
     9.40618094E-04    2     1000035         3   # BR(~s_R -> ~chi_40 s)
     9.74428024E-01    2     1000021         3   # BR(~s_R -> ~g      s)
#
#         PDG            Width
DECAY   1000011     3.62058329E+01   # selectron_L decays
#          BR         NDA      ID1       ID2
     1.21846288E-02    2     1000022        11   # BR(~e_L -> ~chi_10 e-)
     3.47945991E-01    2     1000023        11   # BR(~e_L -> ~chi_20 e-)
     1.82689192E-03    2     1000025        11   # BR(~e_L -> ~chi_30 e-)
     3.68197253E-02    2     1000035        11   # BR(~e_L -> ~chi_40 e-)
     4.08645314E-01    2    -1000024        12   # BR(~e_L -> ~chi_1- nu_e)
     1.92577449E-01    2    -1000037        12   # BR(~e_L -> ~chi_2- nu_e)
#
#         PDG            Width
DECAY   2000011     1.26422400E+01   # selectron_R decays
#          BR         NDA      ID1       ID2
     7.72187456E-01    2     1000022        11   # BR(~e_R -> ~chi_10 e-)
     1.86857978E-01    2     1000023        11   # BR(~e_R -> ~chi_20 e-)
     4.72554289E-03    2     1000025        11   # BR(~e_R -> ~chi_30 e-)
     3.62290230E-02    2     1000035        11   # BR(~e_R -> ~chi_40 e-)
#
#         PDG            Width
DECAY   1000013     3.62058329E+01   # smuon_L decays
#          BR         NDA      ID1       ID2
     1.21846288E-02    2     1000022        13   # BR(~mu_L -> ~chi_10 mu-)
     3.47945991E-01    2     1000023        13   # BR(~mu_L -> ~chi_20 mu-)
     1.82689192E-03    2     1000025        13   # BR(~mu_L -> ~chi_30 mu-)
     3.68197252E-02    2     1000035        13   # BR(~mu_L -> ~chi_40 mu-)
     4.08645314E-01    2    -1000024        14   # BR(~mu_L -> ~chi_1- nu_mu)
     1.92577449E-01    2    -1000037        14   # BR(~mu_L -> ~chi_2- nu_mu)
#
#         PDG            Width
DECAY   2000013     1.26422399E+01   # smuon_R decays
#          BR         NDA      ID1       ID2
     7.72187456E-01    2     1000022        13   # BR(~mu_R -> ~chi_10 mu-)
     1.86857978E-01    2     1000023        13   # BR(~mu_R -> ~chi_20 mu-)
     4.72554289E-03    2     1000025        13   # BR(~mu_R -> ~chi_30 mu-)
     3.62290230E-02    2     1000035        13   # BR(~mu_R -> ~chi_40 mu-)
#
#         PDG            Width
DECAY   1000015     1.04774528E+00   # stau_1 decays
#          BR         NDA      ID1       ID2
     3.56282274E-02    2     1000022        15   # BR(~tau_1 -> ~chi_10  tau-)
     4.34587834E-01    2     1000023        15   # BR(~tau_1 -> ~chi_20  tau-)
     1.80820945E-05    2     1000025        15   # BR(~tau_1 -> ~chi_30  tau-)
     5.29765857E-01    2    -1000024        16   # BR(~tau_1 -> ~chi_1-  nu_tau)
#
#         PDG            Width
DECAY   2000015     2.45601474E+01   # stau_2 decays
#          BR         NDA      ID1       ID2
     5.56108761E-01    2     1000022        15   # BR(~tau_2 -> ~chi_10  tau-)
     1.43480962E-01    2     1000023        15   # BR(~tau_2 -> ~chi_20  tau-)
     6.88041107E-02    2     1000025        15   # BR(~tau_2 -> ~chi_30  tau-)
     7.06142321E-02    2     1000035        15   # BR(~tau_2 -> ~chi_40  tau-)
     4.44526541E-02    2    -1000024        16   # BR(~tau_2 -> ~chi_1-  nu_tau)
     9.28691975E-02    2    -1000037        16   # BR(~tau_2 -> ~chi_2-  nu_tau)
     1.04539833E-02    2     1000016       -37   # BR(~tau_2 -> ~nu_tauL H-)
     1.37698334E-03    2     1000016       -24   # BR(~tau_2 -> ~nu_tauL W-)
     6.95321236E-04    2     1000015        25   # BR(~tau_2 -> ~tau_1   h)
     5.21893381E-03    2     1000015        35   # BR(~tau_2 -> ~tau_1   H)
     5.21959387E-03    2     1000015        36   # BR(~tau_2 -> ~tau_1   A)
     7.05266990E-04    2     1000015        23   # BR(~tau_2 -> ~tau_1   Z)
#
#         PDG            Width
DECAY   1000012     3.62374414E+01   # snu_eL decays
#          BR         NDA      ID1       ID2
     1.91340546E-01    2     1000022        12   # BR(~nu_eL -> ~chi_10 nu_e)
     1.02347194E-01    2     1000023        12   # BR(~nu_eL -> ~chi_20 nu_e)
     7.33431796E-03    2     1000025        12   # BR(~nu_eL -> ~chi_30 nu_e)
     9.65187875E-02    2     1000035        12   # BR(~nu_eL -> ~chi_40 nu_e)
     5.24319856E-01    2     1000024        11   # BR(~nu_eL -> ~chi_1+ e-)
     7.81392994E-02    2     1000037        11   # BR(~nu_eL -> ~chi_2+ e-)
#
#         PDG            Width
DECAY   1000014     3.62374414E+01   # snu_muL decays
#          BR         NDA      ID1       ID2
     1.91340546E-01    2     1000022        14   # BR(~nu_muL -> ~chi_10 nu_mu)
     1.02347194E-01    2     1000023        14   # BR(~nu_muL -> ~chi_20 nu_mu)
     7.33431797E-03    2     1000025        14   # BR(~nu_muL -> ~chi_30 nu_mu)
     9.65187877E-02    2     1000035        14   # BR(~nu_muL -> ~chi_40 nu_mu)
     5.24319855E-01    2     1000024        13   # BR(~nu_muL -> ~chi_1+ mu-)
     7.81392993E-02    2     1000037        13   # BR(~nu_muL -> ~chi_2+ mu-)
#
#         PDG            Width
DECAY   1000016     1.06347938E+00   # snu_tauL decays
#          BR         NDA      ID1       ID2
     2.94041855E-01    2     1000022        16   # BR(~nu_tauL -> ~chi_10 nu_tau)
     1.04038673E-01    2     1000023        16   # BR(~nu_tauL -> ~chi_20 nu_tau)
     6.01919472E-01    2     1000024        15   # BR(~nu_tauL -> ~chi_1+ tau-)
#
#         PDG            Width
DECAY   1000024     3.64455914E-06   # chargino1+ decays
#           BR         NDA      ID1       ID2       ID3
     3.30979905E-01    3     1000022         2        -1   # BR(~chi_1+ -> ~chi_10 u    db)
     3.30979905E-01    3     1000022         4        -3   # BR(~chi_1+ -> ~chi_10 c    sb)
     1.10311078E-01    3     1000022       -11        12   # BR(~chi_1+ -> ~chi_10 e+   nu_e)
     1.10311078E-01    3     1000022       -13        14   # BR(~chi_1+ -> ~chi_10 mu+  nu_mu)
     1.17418034E-01    3     1000022       -15        16   # BR(~chi_1+ -> ~chi_10 tau+ nu_tau)
#
#         PDG            Width
DECAY   1000037     5.61366676E-01   # chargino2+ decays
#          BR         NDA      ID1       ID2
     2.44528954E-02    2     1000016       -15   # BR(~chi_2+ -> ~nu_tau1 tau+)
     1.69781809E-02    2    -1000015        16   # BR(~chi_2+ -> ~tau_1+  nu_tau)
     3.28508125E-01    2     1000024        23   # BR(~chi_2+ -> ~chi_1+  Z )
     5.64900022E-03    2     1000022        24   # BR(~chi_2+ -> ~chi_10  W+)
     5.62962710E-01    2     1000023        24   # BR(~chi_2+ -> ~chi_20  W+)
     6.14490889E-02    2     1000024        25   # BR(~chi_2+ -> ~chi_1+  h )
#
#         PDG            Width
DECAY   1000022     0.00000000E+00   # neutralino1 decays
#
#         PDG            Width
DECAY   1000023     1.54340138E-07   # neutralino2 decays
#          BR         NDA      ID1       ID2
     8.62903814E-02    2     1000022        22   # BR(~chi_20 -> ~chi_10 gam)
#           BR         NDA      ID1       ID2       ID3
     1.16762682E-01    3     1000022        -2         2   # BR(~chi_20 -> ~chi_10 ub      u)
     1.52935851E-01    3     1000022        -1         1   # BR(~chi_20 -> ~chi_10 db      d)
     1.16762682E-01    3     1000022        -4         4   # BR(~chi_20 -> ~chi_10 cb      c)
     1.52935851E-01    3     1000022        -3         3   # BR(~chi_20 -> ~chi_10 sb      s)
     1.13263972E-01    3     1000022        -5         5   # BR(~chi_20 -> ~chi_10 bb      b)
     3.39508011E-02    3     1000022       -11        11   # BR(~chi_20 -> ~chi_10 e+      e-)
     3.39508011E-02    3     1000022       -13        13   # BR(~chi_20 -> ~chi_10 mu+     mu-)
     2.14118510E-02    3     1000022       -15        15   # BR(~chi_20 -> ~chi_10 tau+    tau-)
     6.84938106E-02    3     1000022       -12        12   # BR(~chi_20 -> ~chi_10 nu_eb   nu_e)
     6.84938106E-02    3     1000022       -14        14   # BR(~chi_20 -> ~chi_10 nu_mub  nu_mu)
     2.09586053E-04    3     1000022       -16        16   # BR(~chi_20 -> ~chi_10 nu_taub nu_tau)
     6.16049218E-03    3     1000024        -2         1   # BR(~chi_20 -> ~chi_1+ ub      d)
     6.16049218E-03    3    -1000024        -1         2   # BR(~chi_20 -> ~chi_1- db      u)
     6.16049218E-03    3     1000024        -4         3   # BR(~chi_20 -> ~chi_1+ cb      s)
     6.16049218E-03    3    -1000024        -3         4   # BR(~chi_20 -> ~chi_1- sb      c)
     2.05365502E-03    3     1000024       -12        11   # BR(~chi_20 -> ~chi_1+ nu_eb   e-)
     2.05365502E-03    3    -1000024        12       -11   # BR(~chi_20 -> ~chi_1- nu_e    e+)
     2.05365502E-03    3     1000024       -14        13   # BR(~chi_20 -> ~chi_1+ nu_mub  mu-)
     2.05365502E-03    3    -1000024        14       -13   # BR(~chi_20 -> ~chi_1- nu_mu   mu+)
     8.40665639E-04    3     1000024       -16        15   # BR(~chi_20 -> ~chi_1+ nu_taub tau-)
     8.40665639E-04    3    -1000024        16       -15   # BR(~chi_20 -> ~chi_1- nu_tau  tau+)
#
#         PDG            Width
DECAY   1000025     3.25679158E-01   # neutralino3 decays
#          BR         NDA      ID1       ID2
     3.25436482E-01    2     1000022        23   # BR(~chi_30 -> ~chi_10   Z )
     2.60165226E-02    2     1000023        23   # BR(~chi_30 -> ~chi_20   Z )
     3.24085357E-01    2     1000024       -24   # BR(~chi_30 -> ~chi_1+   W-)
     3.24085357E-01    2    -1000024        24   # BR(~chi_30 -> ~chi_1-   W+)
     1.91065818E-05    2     1000022        25   # BR(~chi_30 -> ~chi_10   h )
     1.78587428E-04    2     1000016       -16   # BR(~chi_30 -> ~nu_tau1  nu_taub)
     1.78587428E-04    2    -1000016        16   # BR(~chi_30 -> ~nu_tau1* nu_tau )
#
#         PDG            Width
DECAY   1000035     6.91374929E-01   # neutralino4 decays
#          BR         NDA      ID1       ID2
     3.48832187E-02    2     1000022        23   # BR(~chi_40 -> ~chi_10   Z )
     9.59491237E-03    2     1000023        23   # BR(~chi_40 -> ~chi_20   Z )
     3.94270654E-01    2     1000024       -24   # BR(~chi_40 -> ~chi_1+   W-)
     3.94270654E-01    2    -1000024        24   # BR(~chi_40 -> ~chi_1-   W+)
     1.30478005E-01    2     1000022        25   # BR(~chi_40 -> ~chi_10   h )
     4.50966935E-03    2     1000015       -15   # BR(~chi_40 -> ~tau_1-   tau+)
     4.50966935E-03    2    -1000015        15   # BR(~chi_40 -> ~tau_1+   tau-)
     1.37416085E-02    2     1000016       -16   # BR(~chi_40 -> ~nu_tau1  nu_taub)
     1.37416085E-02    2    -1000016        16   # BR(~chi_40 -> ~nu_tau1* nu_tau )
#
#         PDG            Width
DECAY        25     4.09344600E-03   # h decays
#          BR         NDA      ID1       ID2
     6.09971091E-01    2           5        -5   # BR(h -> b       bb     )
     6.36499103E-02    2         -15        15   # BR(h -> tau+    tau-   )
     2.25244762E-04    2         -13        13   # BR(h -> mu+     mu-    )
     2.45941853E-04    2           3        -3   # BR(h -> s       sb     )
     2.11451611E-02    2           4        -4   # BR(h -> c       cb     )
     7.75884692E-02    2          21        21   # BR(h -> g       g      )
     2.25455960E-03    2          22        22   # BR(h -> gam     gam    )
     1.48377556E-03    2          22        23   # BR(h -> Z       gam    )
     1.98779338E-01    2          24       -24   # BR(h -> W+      W-     )
     2.46565078E-02    2          23        23   # BR(h -> Z       Z      )
#
#         PDG            Width
DECAY        35     4.46186416E+01   # H decays
#          BR         NDA      ID1       ID2
     3.01924811E-01    2           5        -5   # BR(H -> b       bb     )
     5.77972180E-02    2         -15        15   # BR(H -> tau+    tau-   )
     1.94070046E-04    2         -13        13   # BR(H -> mu+     mu-    )
     1.23401629E-04    2           3        -3   # BR(H -> s       sb     )
     3.83621718E-08    2           4        -4   # BR(H -> c       cb     )
     3.72902639E-03    2           6        -6   # BR(H -> t       tb     )
     5.84705122E-06    2          21        21   # BR(H -> g       g      )
     7.29373092E-08    2          22        22   # BR(H -> gam     gam    )
     3.68899483E-09    2          23        22   # BR(H -> Z       gam    )
     2.77663704E-06    2          24       -24   # BR(H -> W+      W-     )
     1.38356629E-06    2          23        23   # BR(H -> Z       Z      )
     1.22512517E-05    2          25        25   # BR(H -> h       h      )
     1.15334159E-01    2     1000024  -1000024   # BR(H -> ~chi_1+ ~chi_1-)
     3.68514837E-02    2     1000037  -1000037   # BR(H -> ~chi_2+ ~chi_2-)
     1.17610216E-01    2     1000024  -1000037   # BR(H -> ~chi_1+ ~chi_2-)
     1.17610216E-01    2     1000037  -1000024   # BR(H -> ~chi_2+ ~chi_1-)
     2.61443913E-02    2     1000022   1000022   # BR(H -> ~chi_10 ~chi_10)
     1.30898393E-02    2     1000023   1000023   # BR(H -> ~chi_20 ~chi_20)
     3.80941077E-03    2     1000025   1000025   # BR(H -> ~chi_30 ~chi_30)
     4.09455657E-02    2     1000035   1000035   # BR(H -> ~chi_40 ~chi_40)
     3.72647509E-02    2     1000022   1000023   # BR(H -> ~chi_10 ~chi_20)
     4.11215734E-02    2     1000022   1000025   # BR(H -> ~chi_10 ~chi_30)
     1.38846025E-02    2     1000022   1000035   # BR(H -> ~chi_10 ~chi_40)
     2.37335495E-02    2     1000023   1000025   # BR(H -> ~chi_20 ~chi_30)
     6.32055826E-03    2     1000023   1000035   # BR(H -> ~chi_20 ~chi_40)
     4.24866248E-02    2     1000025   1000035   # BR(H -> ~chi_30 ~chi_40)
     3.36258773E-08    2     1000005  -1000005   # BR(H -> ~b_1    ~b_1*  )
     4.55682121E-07    2     1000015  -1000015   # BR(H -> ~tau_1- ~tau_1+)
     1.66943186E-06    2     1000016  -1000016   # BR(H -> ~nu_tauL ~nu_tauL*)
#
#         PDG            Width
DECAY        36     4.46225959E+01   # A decays
#          BR         NDA      ID1       ID2
     3.01918573E-01    2           5        -5   # BR(A -> b       bb     )
     5.77927529E-02    2         -15        15   # BR(A -> tau+    tau-   )
     1.94054611E-04    2         -13        13   # BR(A -> mu+     mu-    )
     1.23407930E-04    2           3        -3   # BR(A -> s       sb     )
     3.83591628E-08    2           4        -4   # BR(A -> c       cb     )
     3.76057144E-03    2           6        -6   # BR(A -> t       tb     )
     2.67217103E-05    2          21        21   # BR(A -> g       g      )
     2.71288245E-08    2          22        22   # BR(A -> gam     gam    )
     1.93534485E-08    2          23        22   # BR(A -> Z       gam    )
     2.80366704E-06    2          23        25   # BR(A -> Z       h      )
     1.08036159E-01    2     1000024  -1000024   # BR(A -> ~chi_1+ ~chi_1-)
     2.97212364E-02    2     1000037  -1000037   # BR(A -> ~chi_2+ ~chi_2-)
     1.24818688E-01    2     1000024  -1000037   # BR(A -> ~chi_1+ ~chi_2-)
     1.24818688E-01    2     1000037  -1000024   # BR(A -> ~chi_2+ ~chi_1-)
     2.43247625E-02    2     1000022   1000022   # BR(A -> ~chi_10 ~chi_10)
     1.20841147E-02    2     1000023   1000023   # BR(A -> ~chi_20 ~chi_20)
     4.90210453E-03    2     1000025   1000025   # BR(A -> ~chi_30 ~chi_30)
     3.68598051E-02    2     1000035   1000035   # BR(A -> ~chi_40 ~chi_40)
     3.45017210E-02    2     1000022   1000023   # BR(A -> ~chi_10 ~chi_20)
     4.84033379E-02    2     1000022   1000025   # BR(A -> ~chi_10 ~chi_30)
     1.11263876E-02    2     1000022   1000035   # BR(A -> ~chi_10 ~chi_40)
     2.79589689E-02    2     1000023   1000025   # BR(A -> ~chi_20 ~chi_30)
     5.05676093E-03    2     1000023   1000035   # BR(A -> ~chi_20 ~chi_40)
     4.35682952E-02    2     1000025   1000035   # BR(A -> ~chi_30 ~chi_40)
#
#         PDG            Width
DECAY        37     4.38788270E+01   # H+ decays
#          BR         NDA      ID1       ID2
     4.89983704E-04    2           4        -5   # BR(H+ -> c       bb     )
     5.88240832E-02    2         -15        16   # BR(H+ -> tau+    nu_tau )
     1.97517578E-04    2         -13        14   # BR(H+ -> mu+     nu_mu  )
     4.89982564E-06    2           2        -5   # BR(H+ -> u       bb     )
     6.27426192E-06    2           2        -3   # BR(H+ -> u       sb     )
     1.23533893E-04    2           4        -3   # BR(H+ -> c       sb     )
     2.94310721E-01    2           6        -5   # BR(H+ -> t       bb     )
     2.86225555E-06    2          24        25   # BR(H+ -> W+      h      )
     7.37874179E-13    2          24        36   # BR(H+ -> W+      A      )
     4.65046538E-02    2     1000024   1000022   # BR(H+ -> ~chi_1+ ~chi_10)
     1.31707386E-02    2     1000024   1000023   # BR(H+ -> ~chi_1+ ~chi_20)
     1.42164332E-01    2     1000024   1000025   # BR(H+ -> ~chi_1+ ~chi_30)
     1.47948018E-01    2     1000024   1000035   # BR(H+ -> ~chi_1+ ~chi_40)
     2.90605924E-03    2     1000037   1000022   # BR(H+ -> ~chi_2+ ~chi_10)
     2.42142928E-01    2     1000037   1000023   # BR(H+ -> ~chi_2+ ~chi_20)
     4.59547539E-02    2     1000037   1000025   # BR(H+ -> ~chi_2+ ~chi_30)
     5.24668465E-03    2     1000037   1000035   # BR(H+ -> ~chi_2+ ~chi_40)
     1.95574198E-06    2    -1000015   1000016   # BR(H+ -> ~tau_1+ ~nu_tauL)
