#
#                              ======================
#                              | THE SUSYHIT OUTPUT |
#                              ======================
#
#
#              ------------------------------------------------------
#              |     This is the output of the SUSY-HIT package     |
#              |  created by A.Djouadi, M.Muehlleitner and M.Spira. |
#              |  In case of problems with SUSY-HIT email to        |
#              |           margarete.muehlleitner@cern.ch           |
#              |           michael.spira@psi.ch                     |
#              |           abdelhak.djouadi@cern.ch                 |
#              ------------------------------------------------------
#
#              ------------------------------------------------------
#              |  SUSY Les Houches Accord - MSSM Spectrum + Decays  |
#              |              based on the decay programs           |
#              |                                                    |
#              |                     SDECAY 1.3b                    |
#              |                                                    |
#              |  Authors: M.Muhlleitner, A.Djouadi and Y.Mambrini  |
#              |  Ref.:    Comput.Phys.Commun.168(2005)46           |
#              |           [hep-ph/0311167]                         |
#              |                                                    |
#              |                     HDECAY 3.4                     |
#              |                                                    |
#              |  By: A.Djouadi,J.Kalinowski,M.Muhlleitner,M.Spira  |
#              |  Ref.:    Comput.Phys.Commun.108(1998)56           |
#              |           [hep-ph/9704448]                         |
#              |                                                    |
#              |                                                    |
#              |  If not stated otherwise all DRbar couplings and   |
#              |  soft SUSY breaking masses are given at the scale  |
#              |  Q=  0.23842350E+04
#              |                                                    |
#              ------------------------------------------------------
#
#
BLOCK DCINFO  # Decay Program information
     1   SDECAY/HDECAY # decay calculator
     2   1.3b  /3.4    # version number
#
BLOCK SPINFO  # Spectrum calculator information
     1     SOFTSUSY    # spectrum calculator               
     2     3.4.0       # version number                    
#
BLOCK MODSEL  # Model selection
     1     0   #  nonUniversal                                     
#
BLOCK SMINPUTS  # Standard Model inputs
         1     1.27908970E+02   # alpha_em^-1(M_Z)^MSbar
         2     1.16637870E-05   # G_F [GeV^-2]
         3     1.18400000E-01   # alpha_S(M_Z)^MSbar
         4     9.11876000E+01   # M_Z pole mass
         5     4.18000000E+00   # mb(mb)^MSbar
         6     1.73200000E+02   # mt pole mass
         7     1.77700000E+00   # mtau pole mass
#
BLOCK MINPAR  # Input parameters - minimal models
         3     5.77100000E+01   # tanb                
#
BLOCK EXTPAR  # Input parameters - non-minimal models
         0    -1.00000000E+00   # Set                 
         1    -1.63257000E+03   # M_1(MX)             
         2     1.85595000E+03   # M_2(MX)             
         3     4.92020000E+02   # M_3(MX)             
        11    -3.53086000E+03   # At(MX)              
        12     3.24093000E+03   # Ab(MX)              
        13     6.92600000E+02   # Atau(MX)            
        23     1.10620000E+02   # mu(MX)              
        26     1.40879000E+03   # mA(pole)            
        31     4.63530000E+02   # meL(MX)             
        32     4.63530000E+02   # mmuL(MX)            
        33     3.28911000E+03   # mtauL(MX)           
        34     2.38018000E+03   # meR(MX)             
        35     2.38018000E+03   # mmuR(MX)            
        36     1.40415000E+03   # mtauR(MX)           
        41     1.09447000E+03   # mqL1(MX)            
        42     1.09447000E+03   # mqL2(MX)            
        43     2.01283000E+03   # mqL3(MX)            
        44     1.19836000E+03   # muR(MX)             
        45     1.19836000E+03   # mcR(MX)             
        46     2.82572000E+03   # mtR(MX)             
        47     1.02361000E+03   # mdR(MX)             
        48     1.02361000E+03   # msR(MX)             
        49     2.10015000E+03   # mbR(MX)             
#
BLOCK MASS  # Mass Spectrum
# PDG code           mass       particle
        24     8.03775918E+01   # W+
        25     1.27069948E+02   # h
        35     1.40879446E+03   # H
        36     1.40878980E+03   # A
        37     1.41126609E+03   # H+
         5     4.81876030E+00   # b-quark pole mass calculated from mb(mb)_Msbar
   1000001     1.14184434E+03   # ~d_L
   2000001     1.04715474E+03   # ~d_R
   1000002     1.13924822E+03   # ~u_L
   2000002     1.22382290E+03   # ~u_R
   1000003     1.14184434E+03   # ~s_L
   2000003     1.04715474E+03   # ~s_R
   1000004     1.13924822E+03   # ~c_L
   2000004     1.22382290E+03   # ~c_R
   1000005     1.99427639E+03   # ~b_1
   2000005     2.06584348E+03   # ~b_2
   1000006     1.98147105E+03   # ~t_1
   2000006     2.79714383E+03   # ~t_2
   1000011     5.16737690E+02   # ~e_L
   2000011     2.38458999E+03   # ~e_R
   1000012     5.10430241E+02   # ~nu_eL
   1000013     5.16737690E+02   # ~mu_L
   2000013     2.38458999E+03   # ~mu_R
   1000014     5.10430241E+02   # ~nu_muL
   1000015     1.38915381E+03   # ~tau_1
   2000015     3.29104799E+03   # ~tau_2
   1000016     3.28976565E+03   # ~nu_tauL
   1000021     6.07878231E+02   # ~g
   1000022     1.16220012E+02   # ~chi_10
   1000023    -1.18629393E+02   # ~chi_20
   1000025    -1.60481528E+03   # ~chi_30
   1000035     1.84280021E+03   # ~chi_40
   1000024     1.17549911E+02   # ~chi_1+
   1000037     1.84296955E+03   # ~chi_2+
#
BLOCK NMIX  # Neutralino Mixing Matrix
  1  1    -1.79864274E-02   # N_11
  1  2    -3.26521862E-02   # N_12
  1  3     7.10643017E-01   # N_13
  1  4    -7.02564464E-01   # N_14
  2  1     2.02943847E-02   # N_21
  2  2     2.81445215E-02   # N_22
  2  3     7.03542942E-01   # N_23
  2  4     7.09805151E-01   # N_24
  3  1     9.99632098E-01   # N_31
  3  2    -6.15744986E-04   # N_32
  3  3    -1.49474129E-03   # N_33
  3  4    -2.70749991E-02   # N_34
  4  1    -5.43458759E-04   # N_41
  4  2     9.99070239E-01   # N_42
  4  3     3.40541451E-03   # N_43
  4  4    -4.29740189E-02   # N_44
#
BLOCK UMIX  # Chargino Mixing Matrix U
  1  1    -4.82005544E-03   # U_11
  1  2     9.99988383E-01   # U_12
  2  1    -9.99988383E-01   # U_21
  2  2    -4.82005544E-03   # U_22
#
BLOCK VMIX  # Chargino Mixing Matrix V
  1  1    -6.08220389E-02   # V_11
  1  2     9.98148626E-01   # V_12
  2  1    -9.98148626E-01   # V_21
  2  2    -6.08220389E-02   # V_22
#
BLOCK STOPMIX  # Stop Mixing Matrix
  1  1     9.91420115E-01   # cos(theta_t)
  1  2     1.30714022E-01   # sin(theta_t)
  2  1    -1.30714022E-01   # -sin(theta_t)
  2  2     9.91420115E-01   # cos(theta_t)
#
BLOCK SBOTMIX  # Sbottom Mixing Matrix
  1  1     9.99573879E-01   # cos(theta_b)
  1  2     2.91900740E-02   # sin(theta_b)
  2  1    -2.91900740E-02   # -sin(theta_b)
  2  2     9.99573879E-01   # cos(theta_b)
#
BLOCK STAUMIX  # Stau Mixing Matrix
  1  1     1.19993463E-03   # cos(theta_tau)
  1  2     9.99999280E-01   # sin(theta_tau)
  2  1    -9.99999280E-01   # -sin(theta_tau)
  2  2     1.19993463E-03   # cos(theta_tau)
#
BLOCK ALPHA  # Higgs mixing
          -1.74431438E-02   # Mixing angle in the neutral Higgs boson sector
#
BLOCK HMIX Q=  2.38423500E+03  # DRbar Higgs Parameters
         1     1.14177214E+02   # mu(Q)MSSM           
         2     5.80078756E+01   # tan                 
         3     2.42656472E+02   # higgs               
         4     2.26406530E+06   # mA^2(Q)MSSM         
#
BLOCK GAUGE Q=  2.38423500E+03  # The gauge couplings
     1     3.65200145E-01   # gprime(Q) DRbar
     2     6.41816530E-01   # g(Q) DRbar
     3     1.05097010E+00   # g3(Q) DRbar
#
BLOCK AU Q=  2.38423500E+03  # The trilinear couplings
  1  1     0.00000000E+00   # A_u(Q) DRbar
  2  2     0.00000000E+00   # A_c(Q) DRbar
  3  3    -3.53086000E+03   # A_t(Q) DRbar
#
BLOCK AD Q=  2.38423500E+03  # The trilinear couplings
  1  1     0.00000000E+00   # A_d(Q) DRbar
  2  2     0.00000000E+00   # A_s(Q) DRbar
  3  3     3.24093000E+03   # A_b(Q) DRbar
#
BLOCK AE Q=  2.38423500E+03  # The trilinear couplings
  1  1     0.00000000E+00   # A_e(Q) DRbar
  2  2     0.00000000E+00   # A_mu(Q) DRbar
  3  3     6.92600000E+02   # A_tau(Q) DRbar
#
BLOCK Yu Q=  2.38423500E+03  # The Yukawa couplings
  1  1     0.00000000E+00   # y_u(Q) DRbar
  2  2     0.00000000E+00   # y_c(Q) DRbar
  3  3     8.24389454E-01   # y_t(Q) DRbar
#
BLOCK Yd Q=  2.38423500E+03  # The Yukawa couplings
  1  1     0.00000000E+00   # y_d(Q) DRbar
  2  2     0.00000000E+00   # y_s(Q) DRbar
  3  3     8.09029944E-01   # y_b(Q) DRbar
#
BLOCK Ye Q=  2.38423500E+03  # The Yukawa couplings
  1  1     0.00000000E+00   # y_e(Q) DRbar
  2  2     0.00000000E+00   # y_mu(Q) DRbar
  3  3     5.97685529E-01   # y_tau(Q) DRbar
#
BLOCK MSOFT Q=  2.38423500E+03  # The soft SUSY breaking masses at the scale Q
         1    -1.63257000E+03   # M_1(Q)              
         2     1.85595000E+03   # M_2(Q)              
         3     4.92020000E+02   # M_3(Q)              
        21     2.20372685E+06   # mH1^2(Q)            
        22     6.43608584E+04   # mH2^2(Q)            
        31     4.63530000E+02   # meL(Q)              
        32     4.63530000E+02   # mmuL(Q)             
        33     3.28911000E+03   # mtauL(Q)            
        34     2.38018000E+03   # meR(Q)              
        35     2.38018000E+03   # mmuR(Q)             
        36     1.40415000E+03   # mtauR(Q)            
        41     1.09447000E+03   # mqL1(Q)             
        42     1.09447000E+03   # mqL2(Q)             
        43     2.01283000E+03   # mqL3(Q)             
        44     1.19836000E+03   # muR(Q)              
        45     1.19836000E+03   # mcR(Q)              
        46     2.82572000E+03   # mtR(Q)              
        47     1.02361000E+03   # mdR(Q)              
        48     1.02361000E+03   # msR(Q)              
        49     2.10015000E+03   # mbR(Q)              
#
Block HiggsBoundsInputHiggsCouplingsFermions
# ScalarNormEffCoupSq PseudoSNormEffCoupSq NP   IP1 IP2 IP2
    1.02402001E+00    0.00000000E+00        3  25   5   5  # h0-b-b eff. coupling^2, normalised to SM
    3.36488961E+03    0.00000000E+00        3  35   5   5  # H0-b-b eff. coupling^2, normalised to SM
    0.00000000E+00    3.36491363E+03        3  36   5   5  # A0-b-b eff. coupling^2, normalised to SM
#
    9.99992862E-01    0.00000000E+00        3  25   6   6  # h0-t-t eff. coupling^2, normalised to SM
    3.04322821E-04    0.00000000E+00        3  35   6   6  # H0-t-t eff. coupling^2, normalised to SM
    0.00000000E+00    2.97184448E-04        3  36   6   6  # A0-t-t eff. coupling^2, normalised to SM
#
    1.02402001E+00    0.00000000E+00        3  25  15  15  # h0-tau-tau eff. coupling^2, normalised to SM
    3.36488961E+03    0.00000000E+00        3  35  15  15  # H0-tau-tau eff. coupling^2, normalised to SM
    0.00000000E+00    3.36491363E+03        3  36  15  15  # A0-tau-tau eff. coupling^2, normalised to SM
#
Block HiggsBoundsInputHiggsCouplingsBosons
    9.99999958E-01        3  25  24  24  # h0-W-W eff. coupling^2, normalised to SM
    4.23588807E-08        3  35  24  24  # H0-W-W eff. coupling^2, normalised to SM
    0.00000000E+00        3  36  24  24  # A0-W-W eff. coupling^2, normalised to SM
#
    9.99999958E-01        3  25  23  23  # h0-Z-Z eff. coupling^2, normalised to SM
    4.23588807E-08        3  35  23  23  # H0-Z-Z eff. coupling^2, normalised to SM
    0.00000000E+00        3  36  23  23  # A0-Z-Z eff. coupling^2, normalised to SM
#
    8.85726880E-01        3  25  21  21  # h0-g-g eff. coupling^2, normalised to SM
    2.24938227E-07        3  35  21  21  # H0-g-g eff. coupling^2, normalised to SM
    3.75231288E-07        3  36  21  21  # A0-g-g eff. coupling^2, normalised to SM
#
    0.00000000E+00        3  25  25  23  # h0-h0-Z eff. coupling^2, normalised to SM
    0.00000000E+00        3  35  25  23  # H0-h0-Z eff. coupling^2, normalised to SM
    4.23588807E-08        3  36  25  23  # A0-h0-Z eff. coupling^2, normalised to SM
    0.00000000E+00        3  35  35  23  # H0-H0-Z eff. coupling^2, normalised to SM
    9.99999958E-01        3  36  35  23  # A0-H0-Z eff. coupling^2, normalised to SM
    0.00000000E+00        3  36  36  23  # A0-A0-Z eff. coupling^2, normalised to SM
#
    0.00000000E+00        4  25  21  21  23  # h0-g-g-Z eff. coupling^2, normalised to SM
    0.00000000E+00        4  35  21  21  23  # H0-g-g-Z eff. coupling^2, normalised to SM
    0.00000000E+00        4  36  21  21  23  # A0-g-g-Z eff. coupling^2, normalised to SM
#
#
#
#                             =================
#                             |The decay table|
#                             =================
#
# - The QCD corrections to the decays gluino -> squark  + quark
#                                     squark -> gaugino + quark_prime
#                                     squark -> squark_prime + Higgs
#                                     squark -> gluino  + quark
#   are included.
#
# - The multi-body decays for the inos, stops and sbottoms are included.
#
# - The loop induced decays for the gluino, neutralinos and stops
#   are included.
#
# - The SUSY decays of the top quark are included.
#
#
#         PDG            Width
DECAY         6     1.45130569E+00   # top decays
#          BR         NDA      ID1       ID2
     1.00000000E+00    2           5        24   # BR(t ->  b    W+)
#
#         PDG            Width
DECAY   1000021     1.83103198E-04   # gluino decays
#          BR         NDA      ID1       ID2
     2.27368559E-02    2     1000022        21   # BR(~g -> ~chi_10 g)
     3.32879924E-02    2     1000023        21   # BR(~g -> ~chi_20 g)
#           BR         NDA      ID1       ID2       ID3
     7.46489336E-04    3     1000022         1        -1   # BR(~g -> ~chi_10 d  db)
     3.14381034E-04    3     1000023         1        -1   # BR(~g -> ~chi_20 d  db)
     1.17078213E-03    3     1000022         2        -2   # BR(~g -> ~chi_10 u  ub)
     5.57995057E-04    3     1000023         2        -2   # BR(~g -> ~chi_20 u  ub)
     7.46489336E-04    3     1000022         3        -3   # BR(~g -> ~chi_10 s  sb)
     3.14381034E-04    3     1000023         3        -3   # BR(~g -> ~chi_20 s  sb)
     1.17078213E-03    3     1000022         4        -4   # BR(~g -> ~chi_10 c  cb)
     5.57995057E-04    3     1000023         4        -4   # BR(~g -> ~chi_20 c  cb)
     2.53396481E-01    3     1000022         5        -5   # BR(~g -> ~chi_10 b  bb)
     2.45812449E-01    3     1000023         5        -5   # BR(~g -> ~chi_20 b  bb)
     2.68938995E-02    3     1000022         6        -6   # BR(~g -> ~chi_10 t  tb)
     1.68504535E-02    3     1000023         6        -6   # BR(~g -> ~chi_20 t  tb)
     2.48794689E-03    3     1000024         1        -2   # BR(~g -> ~chi_1+ d  ub)
     2.48794689E-03    3    -1000024         2        -1   # BR(~g -> ~chi_1- u  db)
     2.48794689E-03    3     1000024         3        -4   # BR(~g -> ~chi_1+ s  cb)
     2.48794689E-03    3    -1000024         4        -3   # BR(~g -> ~chi_1- c  sb)
     1.92745393E-01    3     1000024         5        -6   # BR(~g -> ~chi_1+ b  tb)
     1.92745393E-01    3    -1000024         6        -5   # BR(~g -> ~chi_1- t  bb)
#
#         PDG            Width
DECAY   1000006     1.47537922E+02   # stop1 decays
#          BR         NDA      ID1       ID2
     8.78319561E-02    2     1000022         6   # BR(~t_1 -> ~chi_10 t )
     9.00830870E-02    2     1000023         6   # BR(~t_1 -> ~chi_20 t )
     1.81253066E-04    2     1000025         6   # BR(~t_1 -> ~chi_30 t )
     1.76336974E-01    2     1000024         5   # BR(~t_1 -> ~chi_1+ b )
     1.92105174E-03    2     1000037         5   # BR(~t_1 -> ~chi_2+ b )
     6.43645678E-01    2     1000021         6   # BR(~t_1 -> ~g      t )
#
#         PDG            Width
DECAY   2000006     2.80155162E+02   # stop2 decays
#          BR         NDA      ID1       ID2
     6.56957562E-02    2     1000022         6   # BR(~t_2 -> ~chi_10 t )
     6.69333352E-02    2     1000023         6   # BR(~t_2 -> ~chi_20 t )
     1.03656370E-02    2     1000025         6   # BR(~t_2 -> ~chi_30 t )
     5.62851758E-04    2     1000035         6   # BR(~t_2 -> ~chi_40 t )
     1.32303987E-01    2     1000024         5   # BR(~t_2 -> ~chi_1+ b )
     1.13278659E-03    2     1000037         5   # BR(~t_2 -> ~chi_2+ b )
     5.22747506E-01    2     1000021         6   # BR(~t_2 -> ~g      t )
     4.93194694E-02    2     1000006        25   # BR(~t_2 -> ~t_1    h )
     5.18888785E-02    2     1000006        23   # BR(~t_2 -> ~t_1    Z )
     9.89833065E-02    2     1000005        24   # BR(~t_2 -> ~b_1    W+)
     6.64851887E-05    2     2000005        24   # BR(~t_2 -> ~b_2    W+)
#
#         PDG            Width
DECAY   1000005     1.48436708E+02   # sbottom1 decays
#          BR         NDA      ID1       ID2
     8.78845780E-02    2     1000022         5   # BR(~b_1 -> ~chi_10 b )
     8.59469496E-02    2     1000023         5   # BR(~b_1 -> ~chi_20 b )
     2.47706746E-04    2     1000025         5   # BR(~b_1 -> ~chi_30 b )
     1.17222528E-03    2     1000035         5   # BR(~b_1 -> ~chi_40 b )
     1.76921049E-01    2    -1000024         6   # BR(~b_1 -> ~chi_1- t )
     6.47827491E-01    2     1000021         5   # BR(~b_1 -> ~g      b )
#
#         PDG            Width
DECAY   2000005     1.54262755E+02   # sbottom2 decays
#          BR         NDA      ID1       ID2
     8.74203406E-02    2     1000022         5   # BR(~b_2 -> ~chi_10 b )
     8.58122984E-02    2     1000023         5   # BR(~b_2 -> ~chi_20 b )
     1.24010787E-03    2     1000025         5   # BR(~b_2 -> ~chi_30 b )
     2.84351036E-06    2     1000035         5   # BR(~b_2 -> ~chi_40 b )
     1.70870021E-01    2    -1000024         6   # BR(~b_2 -> ~chi_1- t )
     3.80548371E-06    2    -1000037         6   # BR(~b_2 -> ~chi_2- t )
     6.54650146E-01    2     1000021         5   # BR(~b_2 -> ~g      b )
     4.36933543E-07    2     1000006       -24   # BR(~b_2 -> ~t_1    W-)
#
#         PDG            Width
DECAY   1000002     4.77283546E+01   # sup_L decays
#          BR         NDA      ID1       ID2
     1.19742152E-04    2     1000022         2   # BR(~u_L -> ~chi_10 u)
     9.41606377E-05    2     1000023         2   # BR(~u_L -> ~chi_20 u)
     6.80858418E-04    2     1000024         1   # BR(~u_L -> ~chi_1+ d)
     9.99105239E-01    2     1000021         2   # BR(~u_L -> ~g      u)
#
#         PDG            Width
DECAY   2000002     5.68135970E+01   # sup_R decays
#          BR         NDA      ID1       ID2
     1.55367379E-05    2     1000022         2   # BR(~u_R -> ~chi_10 u)
     1.97652749E-05    2     1000023         2   # BR(~u_R -> ~chi_20 u)
     9.99964698E-01    2     1000021         2   # BR(~u_R -> ~g      u)
#
#         PDG            Width
DECAY   1000001     4.79738513E+01   # sdown_L decays
#          BR         NDA      ID1       ID2
     7.85063982E-05    2     1000022         1   # BR(~d_L -> ~chi_10 d)
     5.41510534E-05    2     1000023         1   # BR(~d_L -> ~chi_20 d)
     4.26444237E-06    2    -1000024         2   # BR(~d_L -> ~chi_1- u)
     9.99863078E-01    2     1000021         1   # BR(~d_L -> ~g      d)
#
#         PDG            Width
DECAY   2000001     3.76583789E+01   # sdown_R decays
#          BR         NDA      ID1       ID2
     4.96433445E-06    2     1000022         1   # BR(~d_R -> ~chi_10 d)
     6.31373703E-06    2     1000023         1   # BR(~d_R -> ~chi_20 d)
     9.99988722E-01    2     1000021         1   # BR(~d_R -> ~g      d)
#
#         PDG            Width
DECAY   1000004     3.42001823E+01   # scharm_L decays
#          BR         NDA      ID1       ID2
     1.73845433E-04    2     1000022         4   # BR(~c_L -> ~chi_10 c)
     1.36700831E-04    2     1000023         4   # BR(~c_L -> ~chi_20 c)
     9.88477264E-04    2     1000024         3   # BR(~c_L -> ~chi_1+ s)
     9.98700976E-01    2     1000021         4   # BR(~c_L -> ~g      c)
#
#         PDG            Width
DECAY   2000004     4.06946302E+01   # scharm_R decays
#          BR         NDA      ID1       ID2
     2.25341561E-05    2     1000022         4   # BR(~c_R -> ~chi_10 c)
     2.86663275E-05    2     1000023         4   # BR(~c_R -> ~chi_20 c)
     9.99948800E-01    2     1000021         4   # BR(~c_R -> ~g      c)
#
#         PDG            Width
DECAY   1000003     3.43645789E+01   # sstrange_L decays
#          BR         NDA      ID1       ID2
     1.14011343E-04    2     1000022         3   # BR(~s_L -> ~chi_10 s)
     7.86385558E-05    2     1000023         3   # BR(~s_L -> ~chi_20 s)
     6.19293361E-06    2    -1000024         4   # BR(~s_L -> ~chi_1- c)
     9.99801157E-01    2     1000021         3   # BR(~s_L -> ~g      s)
#
#         PDG            Width
DECAY   2000003     2.69738784E+01   # sstrange_R decays
#          BR         NDA      ID1       ID2
     7.22388926E-06    2     1000022         3   # BR(~s_R -> ~chi_10 s)
     9.18711418E-06    2     1000023         3   # BR(~s_R -> ~chi_20 s)
     9.99983589E-01    2     1000021         3   # BR(~s_R -> ~g      s)
#
#         PDG            Width
DECAY   1000011     6.59226640E-03   # selectron_L decays
#          BR         NDA      ID1       ID2
     5.32492769E-01    2     1000022        11   # BR(~e_L -> ~chi_10 e-)
     4.54087687E-01    2     1000023        11   # BR(~e_L -> ~chi_20 e-)
     1.34195440E-02    2    -1000024        12   # BR(~e_L -> ~chi_1- nu_e)
#
#         PDG            Width
DECAY   2000011     3.79382510E+00   # selectron_R decays
#          BR         NDA      ID1       ID2
     1.07394629E-03    2     1000022        11   # BR(~e_R -> ~chi_10 e-)
     1.36696652E-03    2     1000023        11   # BR(~e_R -> ~chi_20 e-)
     9.97558927E-01    2     1000025        11   # BR(~e_R -> ~chi_30 e-)
     1.59824385E-07    2     1000035        11   # BR(~e_R -> ~chi_40 e-)
#
#         PDG            Width
DECAY   1000013     6.59226579E-03   # smuon_L decays
#          BR         NDA      ID1       ID2
     5.32492768E-01    2     1000022        13   # BR(~mu_L -> ~chi_10 mu-)
     4.54087687E-01    2     1000023        13   # BR(~mu_L -> ~chi_20 mu-)
     1.34195452E-02    2    -1000024        14   # BR(~mu_L -> ~chi_1- nu_mu)
#
#         PDG            Width
DECAY   2000013     3.79382505E+00   # smuon_R decays
#          BR         NDA      ID1       ID2
     1.07394630E-03    2     1000022        13   # BR(~mu_R -> ~chi_10 mu-)
     1.36696653E-03    2     1000023        13   # BR(~mu_R -> ~chi_20 mu-)
     9.97558927E-01    2     1000025        13   # BR(~mu_R -> ~chi_30 mu-)
     1.59824384E-07    2     1000035        13   # BR(~mu_R -> ~chi_40 mu-)
#
#         PDG            Width
DECAY   1000015     1.94687364E+01   # stau_1 decays
#          BR         NDA      ID1       ID2
     2.52653471E-01    2     1000022        15   # BR(~tau_1 -> ~chi_10  tau-)
     2.47495073E-01    2     1000023        15   # BR(~tau_1 -> ~chi_20  tau-)
     4.99851456E-01    2    -1000024        16   # BR(~tau_1 -> ~chi_1-  nu_tau)
#
#         PDG            Width
DECAY   2000015     4.55173619E+01   # stau_2 decays
#          BR         NDA      ID1       ID2
     2.59379842E-01    2     1000022        15   # BR(~tau_2 -> ~chi_10  tau-)
     2.54154519E-01    2     1000023        15   # BR(~tau_2 -> ~chi_20  tau-)
     5.55685778E-02    2     1000025        15   # BR(~tau_2 -> ~chi_30  tau-)
     1.39268492E-01    2     1000035        15   # BR(~tau_2 -> ~chi_40  tau-)
     8.10256587E-06    2    -1000024        16   # BR(~tau_2 -> ~chi_1-  nu_tau)
     2.79167621E-01    2    -1000037        16   # BR(~tau_2 -> ~chi_2-  nu_tau)
     2.02600762E-04    2     1000015        25   # BR(~tau_2 -> ~tau_1   h)
     6.02361487E-03    2     1000015        35   # BR(~tau_2 -> ~tau_1   H)
     6.02331230E-03    2     1000015        36   # BR(~tau_2 -> ~tau_1   A)
     2.03317508E-04    2     1000015        23   # BR(~tau_2 -> ~tau_1   Z)
#
#         PDG            Width
DECAY   1000012     1.53369014E-02   # snu_eL decays
#          BR         NDA      ID1       ID2
     6.16118785E-02    2     1000022        12   # BR(~nu_eL -> ~chi_10 nu_e)
     3.36154356E-02    2     1000023        12   # BR(~nu_eL -> ~chi_20 nu_e)
     9.04772686E-01    2     1000024        11   # BR(~nu_eL -> ~chi_1+ e-)
#
#         PDG            Width
DECAY   1000014     1.53369001E-02   # snu_muL decays
#          BR         NDA      ID1       ID2
     6.16118838E-02    2     1000022        14   # BR(~nu_muL -> ~chi_10 nu_mu)
     3.36154385E-02    2     1000023        14   # BR(~nu_muL -> ~chi_20 nu_mu)
     9.04772678E-01    2     1000024        13   # BR(~nu_muL -> ~chi_1+ mu-)
#
#         PDG            Width
DECAY   1000016     4.55183932E+01   # snu_tauL decays
#          BR         NDA      ID1       ID2
     1.48456210E-04    2     1000022        16   # BR(~nu_tauL -> ~chi_10 nu_tau)
     8.13615154E-05    2     1000023        16   # BR(~nu_tauL -> ~chi_20 nu_tau)
     5.57578000E-02    2     1000025        16   # BR(~nu_tauL -> ~chi_30 nu_tau)
     1.39279233E-01    2     1000035        16   # BR(~nu_tauL -> ~chi_40 nu_tau)
     5.14493795E-01    2     1000024        15   # BR(~nu_tauL -> ~chi_1+ tau-)
     2.77833511E-01    2     1000037        15   # BR(~nu_tauL -> ~chi_2+ tau-)
     1.20108014E-02    2    -1000015       -37   # BR(~nu_tauL -> ~tau_1+ H-)
     3.95042597E-04    2    -1000015       -24   # BR(~nu_tauL -> ~tau_1+ W-)
#
#         PDG            Width
DECAY   1000024     2.79646111E-12   # chargino1+ decays
#           BR         NDA      ID1       ID2       ID3
     5.99993063E-01    3     1000022         2        -1   # BR(~chi_1+ -> ~chi_10 u    db)
     2.00003469E-01    3     1000022       -11        12   # BR(~chi_1+ -> ~chi_10 e+   nu_e)
     2.00003469E-01    3     1000022       -13        14   # BR(~chi_1+ -> ~chi_10 mu+  nu_mu)
#
#         PDG            Width
DECAY   1000037     7.63540544E+01   # chargino2+ decays
#          BR         NDA      ID1       ID2
     1.09613382E-01    2     1000002        -1   # BR(~chi_2+ -> ~u_L     db)
     1.09402375E-01    2    -1000001         2   # BR(~chi_2+ -> ~d_L*    u )
     1.09613372E-01    2     1000004        -3   # BR(~chi_2+ -> ~c_L     sb)
     1.09402203E-01    2    -1000003         4   # BR(~chi_2+ -> ~s_L*     c )
     8.39996099E-02    2     1000012       -11   # BR(~chi_2+ -> ~nu_eL   e+  )
     8.39996099E-02    2     1000014       -13   # BR(~chi_2+ -> ~nu_muL mu+ )
     8.39615478E-02    2    -1000011        12   # BR(~chi_2+ -> ~e_L+    nu_e)
     8.39615478E-02    2    -1000013        14   # BR(~chi_2+ -> ~mu_L+   nu_mu)
     1.99489774E-07    2    -1000015        16   # BR(~chi_2+ -> ~tau_1+  nu_tau)
     4.89760469E-02    2     1000024        23   # BR(~chi_2+ -> ~chi_1+  Z )
     4.72358959E-02    2     1000022        24   # BR(~chi_2+ -> ~chi_10  W+)
     4.82011362E-02    2     1000023        24   # BR(~chi_2+ -> ~chi_20  W+)
     4.22347032E-07    2     1000025        24   # BR(~chi_2+ -> ~chi_30  W+)
     4.90098188E-02    2     1000024        25   # BR(~chi_2+ -> ~chi_1+  h )
     8.18033357E-03    2     1000024        35   # BR(~chi_2+ -> ~chi_1+  H )
     8.18414240E-03    2     1000024        36   # BR(~chi_2+ -> ~chi_1+  A )
     8.22089123E-03    2     1000022        37   # BR(~chi_2+ -> ~chi_10  H+)
     8.03746654E-03    2     1000023        37   # BR(~chi_2+ -> ~chi_20  H+)
#
#         PDG            Width
DECAY   1000022     0.00000000E+00   # neutralino1 decays
#
#         PDG            Width
DECAY   1000023     8.20847767E-11   # neutralino2 decays
#          BR         NDA      ID1       ID2
     2.81423947E-01    2     1000022        22   # BR(~chi_20 -> ~chi_10 gam)
#           BR         NDA      ID1       ID2       ID3
     1.16264560E-01    3     1000022        -2         2   # BR(~chi_20 -> ~chi_10 ub      u)
     1.50818136E-01    3     1000022        -1         1   # BR(~chi_20 -> ~chi_10 db      d)
     1.50818136E-01    3     1000022        -3         3   # BR(~chi_20 -> ~chi_10 sb      s)
     3.45859392E-02    3     1000022       -11        11   # BR(~chi_20 -> ~chi_10 e+      e-)
     3.45859392E-02    3     1000022       -13        13   # BR(~chi_20 -> ~chi_10 mu+     mu-)
     6.91467721E-02    3     1000022       -12        12   # BR(~chi_20 -> ~chi_10 nu_eb   nu_e)
     6.91467721E-02    3     1000022       -14        14   # BR(~chi_20 -> ~chi_10 nu_mub  nu_mu)
     6.91454907E-02    3     1000022       -16        16   # BR(~chi_20 -> ~chi_10 nu_taub nu_tau)
     7.21925566E-03    3     1000024        -2         1   # BR(~chi_20 -> ~chi_1+ ub      d)
     7.21925566E-03    3    -1000024        -1         2   # BR(~chi_20 -> ~chi_1- db      u)
     2.40644910E-03    3     1000024       -12        11   # BR(~chi_20 -> ~chi_1+ nu_eb   e-)
     2.40644910E-03    3    -1000024        12       -11   # BR(~chi_20 -> ~chi_1- nu_e    e+)
     2.40644910E-03    3     1000024       -14        13   # BR(~chi_20 -> ~chi_1+ nu_mub  mu-)
     2.40644910E-03    3    -1000024        14       -13   # BR(~chi_20 -> ~chi_1- nu_mu   mu+)
#
#         PDG            Width
DECAY   1000025     1.78836600E+01   # neutralino3 decays
#          BR         NDA      ID1       ID2
     2.98868937E-02    2     1000022        23   # BR(~chi_30 -> ~chi_10   Z )
     2.45054027E-02    2     1000023        23   # BR(~chi_30 -> ~chi_20   Z )
     5.30288309E-02    2     1000024       -24   # BR(~chi_30 -> ~chi_1+   W-)
     5.30288309E-02    2    -1000024        24   # BR(~chi_30 -> ~chi_1-   W+)
     2.57937852E-02    2     1000022        25   # BR(~chi_30 -> ~chi_10   h )
     4.81516053E-04    2     1000022        35   # BR(~chi_30 -> ~chi_10   H )
     2.18005985E-03    2     1000022        36   # BR(~chi_30 -> ~chi_10   A )
     3.29396318E-02    2     1000023        25   # BR(~chi_30 -> ~chi_20   h )
     2.13298239E-03    2     1000023        35   # BR(~chi_30 -> ~chi_20   H )
     4.52127441E-04    2     1000023        36   # BR(~chi_30 -> ~chi_20   A )
     2.53190546E-03    2     1000024       -37   # BR(~chi_30 -> ~chi_1+   H-)
     2.53190546E-03    2    -1000024        37   # BR(~chi_30 -> ~chi_1-   H+)
     4.72779433E-03    2     1000002        -2   # BR(~chi_30 -> ~u_L      ub)
     4.72779433E-03    2    -1000002         2   # BR(~chi_30 -> ~u_L*     u )
     5.43997128E-02    2     2000002        -2   # BR(~chi_30 -> ~u_R      ub)
     5.43997128E-02    2    -2000002         2   # BR(~chi_30 -> ~u_R*     u )
     4.74579287E-03    2     1000001        -1   # BR(~chi_30 -> ~d_L      db)
     4.74579287E-03    2    -1000001         1   # BR(~chi_30 -> ~d_L*     d )
     2.54329404E-02    2     2000001        -1   # BR(~chi_30 -> ~d_R      db)
     2.54329404E-02    2    -2000001         1   # BR(~chi_30 -> ~d_R*     d )
     4.72777459E-03    2     1000004        -4   # BR(~chi_30 -> ~c_L      cb)
     4.72777459E-03    2    -1000004         4   # BR(~chi_30 -> ~c_L*     c )
     5.43993460E-02    2     2000004        -4   # BR(~chi_30 -> ~c_R      cb)
     5.43993460E-02    2    -2000004         4   # BR(~chi_30 -> ~c_R*     c )
     4.74579287E-03    2     1000003        -3   # BR(~chi_30 -> ~s _L      sb)
     4.74579287E-03    2    -1000003         3   # BR(~chi_30 -> ~s _L*     s )
     2.54329404E-02    2     2000003        -3   # BR(~chi_30 -> ~s _R      sb)
     2.54329404E-02    2    -2000003         3   # BR(~chi_30 -> ~s _R*     s )
     4.76834390E-02    2     1000011       -11   # BR(~chi_30 -> ~e_L-     e+)
     4.76834390E-02    2    -1000011        11   # BR(~chi_30 -> ~e_L+     e-)
     4.76834390E-02    2     1000013       -13   # BR(~chi_30 -> ~mu_L-    mu+)
     4.76834390E-02    2    -1000013        13   # BR(~chi_30 -> ~mu_L+    mu-)
     1.49549756E-02    2     1000015       -15   # BR(~chi_30 -> ~tau_1-   tau+)
     1.49549756E-02    2    -1000015        15   # BR(~chi_30 -> ~tau_1+   tau-)
     4.81595581E-02    2     1000012       -12   # BR(~chi_30 -> ~nu_eL    nu_eb)
     4.81595581E-02    2    -1000012        12   # BR(~chi_30 -> ~nu_eL*   nu_e )
     4.81595581E-02    2     1000014       -14   # BR(~chi_30 -> ~nu_muL   nu_mub)
     4.81595581E-02    2    -1000014        14   # BR(~chi_30 -> ~nu_muL*  nu_mu )
#
#         PDG            Width
DECAY   1000035     7.63381366E+01   # neutralino4 decays
#          BR         NDA      ID1       ID2
     2.03959909E-02    2     1000022        23   # BR(~chi_40 -> ~chi_10   Z )
     2.85536449E-02    2     1000023        23   # BR(~chi_40 -> ~chi_20   Z )
     4.06277036E-07    2     1000025        23   # BR(~chi_40 -> ~chi_30   Z )
     4.78652767E-02    2     1000024       -24   # BR(~chi_40 -> ~chi_1+   W-)
     4.78652767E-02    2    -1000024        24   # BR(~chi_40 -> ~chi_1-   W+)
     2.80810761E-02    2     1000022        25   # BR(~chi_40 -> ~chi_10   h )
     5.25784674E-03    2     1000022        35   # BR(~chi_40 -> ~chi_10   H )
     3.02766469E-03    2     1000022        36   # BR(~chi_40 -> ~chi_10   A )
     2.06887586E-02    2     1000023        25   # BR(~chi_40 -> ~chi_20   h )
     2.94211154E-03    2     1000023        35   # BR(~chi_40 -> ~chi_20   H )
     5.17155421E-03    2     1000023        36   # BR(~chi_40 -> ~chi_20   A )
     7.69218598E-10    2     1000025        25   # BR(~chi_40 -> ~chi_30   h )
     8.10501105E-03    2     1000024       -37   # BR(~chi_40 -> ~chi_1+   H-)
     8.10501105E-03    2    -1000024        37   # BR(~chi_40 -> ~chi_1-   H+)
     5.48906343E-02    2     1000002        -2   # BR(~chi_40 -> ~u_L      ub)
     5.48906343E-02    2    -1000002         2   # BR(~chi_40 -> ~u_L*     u )
     7.66658203E-09    2     2000002        -2   # BR(~chi_40 -> ~u_R      ub)
     7.66658203E-09    2    -2000002         2   # BR(~chi_40 -> ~u_R*     u )
     5.46060105E-02    2     1000001        -1   # BR(~chi_40 -> ~d_L      db)
     5.46060105E-02    2    -1000001         1   # BR(~chi_40 -> ~d_L*     d )
     2.80451402E-09    2     2000001        -1   # BR(~chi_40 -> ~d_R      db)
     2.80451402E-09    2    -2000001         1   # BR(~chi_40 -> ~d_R*     d )
     5.48905490E-02    2     1000004        -4   # BR(~chi_40 -> ~c_L      cb)
     5.48905490E-02    2    -1000004         4   # BR(~chi_40 -> ~c_L*     c )
     7.66656525E-09    2     2000004        -4   # BR(~chi_40 -> ~c_R      cb)
     7.66656525E-09    2    -2000004         4   # BR(~chi_40 -> ~c_R*     c )
     5.46060105E-02    2     1000003        -3   # BR(~chi_40 -> ~s _L      sb)
     5.46060105E-02    2    -1000003         3   # BR(~chi_40 -> ~s _L*     s )
     2.80451402E-09    2     2000003        -3   # BR(~chi_40 -> ~s _R      sb)
     2.80451402E-09    2    -2000003         3   # BR(~chi_40 -> ~s _R*     s )
     4.18813533E-02    2     1000011       -11   # BR(~chi_40 -> ~e_L-     e+)
     4.18813533E-02    2    -1000011        11   # BR(~chi_40 -> ~e_L+     e-)
     4.18813533E-02    2     1000013       -13   # BR(~chi_40 -> ~mu_L-    mu+)
     4.18813533E-02    2    -1000013        13   # BR(~chi_40 -> ~mu_L+    mu-)
     1.02866323E-07    2     1000015       -15   # BR(~chi_40 -> ~tau_1-   tau+)
     1.02866323E-07    2    -1000015        15   # BR(~chi_40 -> ~tau_1+   tau-)
     4.21070751E-02    2     1000012       -12   # BR(~chi_40 -> ~nu_eL    nu_eb)
     4.21070751E-02    2    -1000012        12   # BR(~chi_40 -> ~nu_eL*   nu_e )
     4.21070751E-02    2     1000014       -14   # BR(~chi_40 -> ~nu_muL   nu_mub)
     4.21070751E-02    2    -1000014        14   # BR(~chi_40 -> ~nu_muL*  nu_mu )
#
#         PDG            Width
DECAY        25     4.40129375E-03   # h decays
#          BR         NDA      ID1       ID2
     5.68692889E-01    2           5        -5   # BR(h -> b       bb     )
     6.11915954E-02    2         -15        15   # BR(h -> tau+    tau-   )
     2.16482434E-04    2         -13        13   # BR(h -> mu+     mu-    )
     2.35392121E-04    2           3        -3   # BR(h -> s       sb     )
     1.99670060E-02    2           4        -4   # BR(h -> c       cb     )
     7.59856724E-02    2          21        21   # BR(h -> g       g      )
     2.29455090E-03    2          22        22   # BR(h -> gam     gam    )
     1.69955265E-03    2          22        23   # BR(h -> Z       gam    )
     2.38999285E-01    2          24       -24   # BR(h -> W+      W-     )
     3.07175740E-02    2          23        23   # BR(h -> Z       Z      )
#
#         PDG            Width
DECAY        35     6.94937975E+01   # H decays
#          BR         NDA      ID1       ID2
     8.58458892E-01    2           5        -5   # BR(H -> b       bb     )
     1.39748583E-01    2         -15        15   # BR(H -> tau+    tau-   )
     4.73891623E-04    2         -13        13   # BR(H -> mu+     mu-    )
     3.19409813E-04    2           3        -3   # BR(H -> s       sb     )
     2.81300234E-09    2           4        -4   # BR(H -> c       cb     )
     2.64285355E-04    2           6        -6   # BR(H -> t       tb     )
     5.45457052E-05    2          21        21   # BR(H -> g       g      )
     8.27087099E-09    2          22        22   # BR(H -> gam     gam    )
     2.33369086E-08    2          23        22   # BR(H -> Z       gam    )
     5.39020100E-07    2          24       -24   # BR(H -> W+      W-     )
     2.67689942E-07    2          23        23   # BR(H -> Z       Z      )
     1.92088224E-06    2          25        25   # BR(H -> h       h      )
     6.07711104E-04    2     1000024  -1000024   # BR(H -> ~chi_1+ ~chi_1-)
     4.26019216E-05    2     1000022   1000022   # BR(H -> ~chi_10 ~chi_10)
     2.51659332E-05    2     1000023   1000023   # BR(H -> ~chi_20 ~chi_20)
     1.65182475E-06    2     1000022   1000023   # BR(H -> ~chi_10 ~chi_20)
     5.80994908E-08    2     1000011  -1000011   # BR(H -> ~e_L-   ~e_L+  )
     5.80994908E-08    2     1000013  -1000013   # BR(H -> ~mu_L-  ~mu_L+ )
     1.92014360E-07    2     1000012  -1000012   # BR(H -> ~nu_eL  ~nu_eL*   )
     1.92014360E-07    2     1000014  -1000014   # BR(H -> ~nu_muL ~nu_muL*  )
#
#         PDG            Width
DECAY        36     6.94982760E+01   # A decays
#          BR         NDA      ID1       ID2
     8.58424259E-01    2           5        -5   # BR(A -> b       bb     )
     1.39741008E-01    2         -15        15   # BR(A -> tau+    tau-   )
     4.73863001E-04    2         -13        13   # BR(A -> mu+     mu-    )
     3.19397461E-04    2           3        -3   # BR(A -> s       sb     )
     2.77201812E-09    2           4        -4   # BR(A -> c       cb     )
     2.69874855E-04    2           6        -6   # BR(A -> t       tb     )
     7.04426941E-05    2          21        21   # BR(A -> g       g      )
     4.25745244E-08    2          22        22   # BR(A -> gam     gam    )
     3.26191481E-08    2          23        22   # BR(A -> Z       gam    )
     5.38696866E-07    2          23        25   # BR(A -> Z       h      )
     6.28521514E-04    2     1000024  -1000024   # BR(A -> ~chi_1+ ~chi_1-)
     4.69006481E-05    2     1000022   1000022   # BR(A -> ~chi_10 ~chi_10)
     2.41483995E-05    2     1000023   1000023   # BR(A -> ~chi_20 ~chi_20)
     9.67879940E-07    2     1000022   1000023   # BR(A -> ~chi_10 ~chi_20)
#
#         PDG            Width
DECAY        37     6.77142645E+01   # H+ decays
#          BR         NDA      ID1       ID2
     1.44734170E-03    2           4        -5   # BR(H+ -> c       bb     )
     1.43674750E-01    2         -15        16   # BR(H+ -> tau+    nu_tau )
     4.87202351E-04    2         -13        14   # BR(H+ -> mu+     nu_mu  )
     1.44733453E-05    2           2        -5   # BR(H+ -> u       bb     )
     1.63785973E-05    2           2        -3   # BR(H+ -> u       sb     )
     3.22382973E-04    2           4        -3   # BR(H+ -> c       sb     )
     8.53751077E-01    2           6        -5   # BR(H+ -> t       bb     )
     5.57483639E-07    2          24        25   # BR(H+ -> W+      h      )
     1.80621762E-12    2          24        36   # BR(H+ -> W+      A      )
     1.20461139E-04    2     1000024   1000022   # BR(H+ -> ~chi_1+ ~chi_10)
     1.64908619E-04    2     1000024   1000023   # BR(H+ -> ~chi_1+ ~chi_20)
     2.33537678E-07    2    -1000011   1000012   # BR(H+ -> ~e_L+   ~nu_eL )
     2.33537678E-07    2    -1000013   1000014   # BR(H+ -> ~mu_L+  ~nu_muL)
