#  ISAJET SUSY parameters in SUSY Les Houches Accord 2 format
#  Created by ISALHA 2.0 Last revision: C. Balazs 21 Apr 2009
Block SPINFO   # Program information
     1    ISASUSY from ISAJET          # Spectrum Calculator
     2   7.80   29-OCT-2009 12:50:36   # Version number
Block MODSEL   # Model selection
     1     0   # general MSSM-24 model                             
Block SMINPUTS   # Standard Model inputs
     1     1.28000000E+02   # alpha_em^(-1)
     2     1.16570000E-05   # G_Fermi
     3     1.19999997E-01   # alpha_s(M_Z)
     4     9.11699982E+01   # m_{Z}(pole)
     5     4.51715469E+00   # m_{b}(m_{b})
     6     1.72500000E+02   # m_{top}(pole)
     7     1.77699995E+00   # m_{tau}(pole)
Block MINPAR   # SUSY breaking input parameters.
     3     1.00000000E+01   # tan(beta)
     4     2.50000000E+03   # mu
Block MSOFT   # Non-universal SUSY breaking parameters 
     1     5.50000000E+01   # M_1(Q)          
     2     2.50000000E+03   # M_2(Q)          
     3     2.50000000E+03   # M_3(Q)          
    11     0.00000000E+00   #     At          
    12     0.00000000E+00   #     Ab          
    13     0.00000000E+00   #   Atau          
    23     2.50000000E+03   #    MUE          
    25     1.00000000E+01   #    TB           
    26     2.50000000E+03   #    MA0          
    31     2.05000000E+02   # MeL(Q)          
    32     2.05000000E+02   # MmuL(Q)         
    33     2.50000000E+03   # MtauL(Q)        
    34     2.05000000E+02   # MeR(Q)          
    35     2.05000000E+02   # MmuR(Q)         
    36     2.50000000E+03   # MtauR(Q)        
    41     2.50000000E+03   # MqL1(Q)         
    42     2.50000000E+03   # MqL2(Q)         
    43     2.50000000E+03   # MqL3(Q)         
    44     2.50000000E+03   # MuR(Q)          
    45     2.50000000E+03   # McR(Q)          
    46     2.50000000E+03   # MtR(Q)          
    47     2.50000000E+03   # MdR(Q)          
    48     2.50000000E+03   # MsR(Q)          
    49     2.50000000E+03   # MbR(Q)          
Block MASS   # Scalar and gaugino mass spectrum
#  PDG code   mass                 particle
         6     1.72500000E+02   #  top
        24     8.04229965E+01   #  W^+
        25     1.13288651E+02   #  h^0            
        35     2.51651904E+03   #  H^0            
        36     2.50000000E+03   #  A^0            
        37     2.51772192E+03   #  H^+            
   1000001     2.50068872E+03   #  dnl            
   1000002     2.49943726E+03   #  upl            
   1000003     2.50068872E+03   #  stl            
   1000004     2.49943750E+03   #  chl            
   1000005     2.48715918E+03   #  b1             
   1000006     2.49648804E+03   #  t1             
   1000011     2.10258163E+02   #  el-            
   1000012     2.50000000E+03   #  nuel 
   1000013     2.10258194E+02   #  mul-           
   1000014     2.50000000E+03   #  numl 
   1000015     2.49166235E+03   #  tau1           
   1000016     2.49918506E+03   #  nutl           
   1000021     2.50000000E+03   #  glss           
   1000022     5.48278809E+01   #  z1ss           
   1000023     2.43825977E+03   #  z2ss           
   1000024     2.43827466E+03   #  w1ss           
   1000025    -2.50082617E+03   #  z3ss           
   1000035     2.56273706E+03   #  z4ss           
   1000037     2.56276270E+03   #  w2ss           
   2000001     2.50012598E+03   #  dnr            
   2000002     2.49974805E+03   #  upr            
   2000003     2.50012598E+03   #  str            
   2000004     2.49974829E+03   #  chr            
   2000005     2.51358838E+03   #  b2             
   2000006     2.51009106E+03   #  t2             
   2000011     2.09559509E+02   #  er-            
   2000013     2.09559540E+02   #  mur-           
   2000015     2.50912305E+03   #  tau2           
Block ALPHA   # Effective Higgs mixing parameter
         -9.99947041E-02   # alpha
Block STOPMIX   # stop mixing matrix
  1  1     7.15110242E-01   # O_{11}
  1  2     6.99011683E-01   # O_{12}
  2  1    -6.99011683E-01   # O_{21}
  2  2     7.15110242E-01   # O_{22}
Block SBOTMIX   # sbottom mixing matrix
  1  1     6.99534595E-01   # O_{11}
  1  2     7.14598715E-01   # O_{12}
  2  1    -7.14598715E-01   # O_{21}
  2  2     6.99534595E-01   # O_{22}
Block STAUMIX   # stau mixing matrix
  1  1     7.05910981E-01   # O_{11}
  1  2     7.08300591E-01   # O_{12}
  2  1    -7.08300591E-01   # O_{21}
  2  2     7.05910981E-01   # O_{22}
Block NMIX   # neutralino mixing matrix
  1  1     9.99841988E-01   #
  1  2    -1.27980675E-04   #
  1  3     1.76415090E-02   #
  1  4    -2.14634719E-03   #
  2  1     1.00658592E-02   #
  2  2     7.06954777E-01   #
  2  3    -5.05145669E-01   #
  2  4     4.94915724E-01   #
  3  1    -1.09531078E-02   #
  3  2     1.01850480E-02   #
  3  3     7.06885159E-01   #
  3  4     7.07170248E-01   #
  4  1     9.72388405E-03   #
  4  2    -7.07185388E-01   #
  4  3    -4.94803429E-01   #
  4  4     5.04939616E-01   #
Block UMIX   # chargino U mixing matrix
  1  1    -6.99869037E-01   # U_{11}
  1  2     7.14271188E-01   # U_{12}
  2  1    -7.14271188E-01   # U_{21}
  2  2    -6.99869037E-01   # U_{22}
Block VMIX   # chargino V mixing matrix
  1  1    -7.14271009E-01   # V_{11}
  1  2     6.99869215E-01   # V_{12}
  2  1    -6.99869215E-01   # V_{21}
  2  2    -7.14271009E-01   # V_{22}
Block HMIX Q=  9.11699982E+01   # Higgs mixing parameters
     1     2.50000000E+03   # mu(Q)
     2     1.00000000E+01   # tan(beta)
Block AU   #
  3  3     0.00000000E+00   # A_t
Block AD   #
  3  3     0.00000000E+00   # A_b
Block AE   #
  3  3     0.00000000E+00   # A_tau
#  ISAJET decay tables in SUSY Les Houches accord format 
#  Created by ISALHD. Last revision: C. Balazs, 2005 May 25
#  isajet_helpers.f
Block DCINFO                           # Program information
     1   ISASUGRA from ISAJET          # Spectrum Calculator
     2   7.80   29-OCT-2009 12:50:36   # Version number
#         PDG         Width
DECAY         6  1.14680767E+00   # TP    decays
#          BR          NDA       ID1       ID2       ID3       ID4
      3.33333343E-01    3            2        -1         5             # TP     -->  UP     DB     BT          
      3.33333343E-01    3            4        -3         5             # TP     -->  CH     SB     BT          
      1.11111112E-01    3          -11        12         5             # TP     -->  E+     NUE    BT          
      1.11111112E-01    3          -13        14         5             # TP     -->  MU+    NUM    BT          
      1.11111112E-01    3          -15        16         5             # TP     -->  TAU+   NUT    BT          
#         PDG         Width
DECAY   1000021  3.08527183E-02   # GLSS  decays
#          BR          NDA       ID1       ID2       ID3       ID4
      3.60765080E-05    3      1000024         1        -2             # GLSS   -->  W1SS+  DN     UB          
      3.60765080E-05    3     -1000024         2        -1             # GLSS   -->  W1SS-  UP     DB          
      3.60765080E-05    3      1000024         3        -4             # GLSS   -->  W1SS+  ST     CB          
      3.60765080E-05    3     -1000024         4        -3             # GLSS   -->  W1SS-  CH     SB          
      1.42229837E-03    2      1000022        21                       # GLSS   -->  Z1SS   GL                 
      1.93353400E-01    3      1000022         1        -1             # GLSS   -->  Z1SS   DN     DB          
      1.93353400E-01    3      1000022         3        -3             # GLSS   -->  Z1SS   ST     SB          
      9.11912024E-02    3      1000022         5        -5             # GLSS   -->  Z1SS   BT     BB          
      4.19405699E-01    3      1000022         6        -6             # GLSS   -->  Z1SS   TP     TB          
      4.70516716E-05    3      1000023         1        -1             # GLSS   -->  Z2SS   DN     DB          
      4.70516716E-05    3      1000023         3        -3             # GLSS   -->  Z2SS   ST     SB          
      1.72785265E-04    2     -1000002         2                       # GLSS   -->  UBL    UP                 
      1.72785265E-04    2      1000002        -2                       # GLSS   -->  UPL    UB                 
      3.46289926E-05    2     -2000002         2                       # GLSS   -->  UBR    UP                 
      3.46289926E-05    2      2000002        -2                       # GLSS   -->  UPR    UB                 
      5.03103882E-02    2     -1000005         5                       # GLSS   -->  BB1    BT                 
      5.03103882E-02    2      1000005        -5                       # GLSS   -->  BT1    BB                 
#         PDG         Width
DECAY   1000002  3.89635682E-01   # UPL   decays
#          BR          NDA       ID1       ID2       ID3       ID4
      9.03893888E-01    2      1000022         2                       # UPL    -->  Z1SS   UP                 
      3.17179337E-02    2      1000023         2                       # UPL    -->  Z2SS   UP                 
      6.43881634E-02    2      1000024         1                       # UPL    -->  W1SS+  DN                 
#         PDG         Width
DECAY   1000001  3.91174972E-01   # DNL   decays
#          BR          NDA       ID1       ID2       ID3       ID4
      9.03309762E-01    2      1000022         1                       # DNL    -->  Z1SS   DN                 
      3.25250365E-02    2      1000023         1                       # DNL    -->  Z2SS   DN                 
      1.08834101E-04    2      1000021         1                       # DNL    -->  GLSS   DN                 
      6.40563443E-02    2     -1000024         2                       # DNL    -->  W1SS-  UP                 
#         PDG         Width
DECAY   1000003  3.91168952E-01   # STL   decays
#          BR          NDA       ID1       ID2       ID3       ID4
      9.03323710E-01    2      1000022         3                       # STL    -->  Z1SS   ST                 
      3.25255394E-02    2      1000023         3                       # STL    -->  Z2SS   ST                 
      1.08835782E-04    2      1000021         3                       # STL    -->  GLSS   ST                 
      6.40418977E-02    2     -1000024         4                       # STL    -->  W1SS-  CH                 
#         PDG         Width
DECAY   1000004  3.89632761E-01   # CHL   decays
#          BR          NDA       ID1       ID2       ID3       ID4
      9.03900325E-01    2      1000022         4                       # CHL    -->  Z1SS   CH                 
      3.17105018E-02    2      1000023         4                       # CHL    -->  Z2SS   CH                 
      6.43891469E-02    2      1000024         3                       # CHL    -->  W1SS+  ST                 
#         PDG         Width
DECAY   1000005  9.28490341E-01   # BT1   decays
#          BR          NDA       ID1       ID2       ID3       ID4
      9.93641973E-01    2      1000022         5                       # BT1    -->  Z1SS   BT                 
      6.35805260E-03    2      1000023         5                       # BT1    -->  Z2SS   BT                 
#         PDG         Width
DECAY   1000006  2.98448873E+00   # TP1   decays
#          BR          NDA       ID1       ID2       ID3       ID4
      9.82104599E-01    2      1000022         6                       # TP1    -->  Z1SS   TP                 
      1.78953875E-02    2      1000024         5                       # TP1    -->  W1SS+  BT                 
#         PDG         Width
DECAY   2000002  5.64361620E+00   # UPR   decays
#          BR          NDA       ID1       ID2       ID3       ID4
      1.00000000E+00    2      1000022         2                       # UPR    -->  Z1SS   UP                 
#         PDG         Width
DECAY   2000001  1.41111922E+00   # DNR   decays
#          BR          NDA       ID1       ID2       ID3       ID4
      1.00000000E+00    2      1000022         1                       # DNR    -->  Z1SS   DN                 
#         PDG         Width
DECAY   2000003  1.41111922E+00   # STR   decays
#          BR          NDA       ID1       ID2       ID3       ID4
      1.00000000E+00    2      1000022         3                       # STR    -->  Z1SS   ST                 
#         PDG         Width
DECAY   2000004  5.64361334E+00   # CHR   decays
#          BR          NDA       ID1       ID2       ID3       ID4
      1.00000000E+00    2      1000022         4                       # CHR    -->  Z1SS   CH                 
#         PDG         Width
DECAY   2000005  8.57711673E-01   # BT2   decays
#          BR          NDA       ID1       ID2       ID3       ID4
      9.81909573E-01    2      1000022         5                       # BT2    -->  Z1SS   BT                 
      6.80273911E-03    2      1000023         5                       # BT2    -->  Z2SS   BT                 
      4.13741982E-05    2      1000025         5                       # BT2    -->  Z3SS   BT                 
      1.12463394E-02    2      1000021         5                       # BT2    -->  GLSS   BT                 
#         PDG         Width
DECAY   2000006  3.01845598E+00   # TP2   decays
#          BR          NDA       ID1       ID2       ID3       ID4
      5.73822705E-04    2      1000024         5                       # TP2    -->  W1SS+  BT                 
      9.99426186E-01    2      1000022         6                       # TP2    -->  Z1SS   TP                 
#         PDG         Width
DECAY   1000011  2.32052177E-01   # EL-   decays
#          BR          NDA       ID1       ID2       ID3       ID4
      1.00000000E+00    2      1000022        11                       # EL-    -->  Z1SS   E-                 
#         PDG         Width
DECAY   1000013  2.32052058E-01   # MUL-  decays
#          BR          NDA       ID1       ID2       ID3       ID4
      1.00000000E+00    2      1000022        13                       # MUL-   -->  Z1SS   MU-                
#         PDG         Width
DECAY   1000015  7.96717930E+00   # TAU1- decays
#          BR          NDA       ID1       ID2       ID3       ID4
      9.97647226E-01    2      1000022        15                       # TAU1-  -->  Z1SS   TAU-               
      8.03979638E-04    2      1000023        15                       # TAU1-  -->  Z2SS   TAU-               
      1.54880504E-03    2     -1000024        16                       # TAU1-  -->  W1SS-  NUT                
#         PDG         Width
DECAY   1000012  2.10057914E-01   # NUEL  decays
#          BR          NDA       ID1       ID2       ID3       ID4
      1.00000000E+00    2      1000022        12                       # NUEL   -->  Z1SS   NUE                
#         PDG         Width
DECAY   1000014  2.10057914E-01   # NUML  decays
#          BR          NDA       ID1       ID2       ID3       ID4
      1.00000000E+00    2      1000022        14                       # NUML   -->  Z1SS   NUM                
#         PDG         Width
DECAY   1000016  3.21254706E+00   # NUTL  decays
#          BR          NDA       ID1       ID2       ID3       ID4
      9.88404214E-01    2      1000022        16                       # NUTL   -->  Z1SS   NUT                
      3.73702729E-03    2      1000023        16                       # NUTL   -->  Z2SS   NUT                
      7.85876811E-03    2      1000024        15                       # NUTL   -->  W1SS+  TAU-               
#         PDG         Width
DECAY   2000011  9.24653471E-01   # ER-   decays
#          BR          NDA       ID1       ID2       ID3       ID4
      1.00000000E+00    2      1000022        11                       # ER-    -->  Z1SS   E-                 
#         PDG         Width
DECAY   2000013  9.24653113E-01   # MUR-  decays
#          BR          NDA       ID1       ID2       ID3       ID4
      1.00000000E+00    2      1000022        13                       # MUR-   -->  Z1SS   MU-                
#         PDG         Width
DECAY   2000015  7.94447088E+00   # TAU2- decays
#          BR          NDA       ID1       ID2       ID3       ID4
      9.97786760E-01    2      1000022        15                       # TAU2-  -->  Z1SS   TAU-               
      7.73802924E-04    2      1000023        15                       # TAU2-  -->  Z2SS   TAU-               
      1.43946218E-03    2     -1000024        16                       # TAU2-  -->  W1SS-  NUT                
#         PDG         Width
DECAY   1000023  2.10200348E+01   # Z2SS  decays
#          BR          NDA       ID1       ID2       ID3       ID4
      1.39895296E-02    2      1000022        23                       # Z2SS   -->  Z1SS   Z0                 
      1.08252416E-05    3      1000022         2        -2             # Z2SS   -->  Z1SS   UP     UB          
      1.06585885E-05    3      1000022         1        -1             # Z2SS   -->  Z1SS   DN     DB          
      1.06585885E-05    3      1000022         3        -3             # Z2SS   -->  Z1SS   ST     SB          
      1.08252279E-05    3      1000022         4        -4             # Z2SS   -->  Z1SS   CH     CB          
      2.34988747E-05    3      1000022         5        -5             # Z2SS   -->  Z1SS   BT     BB          
      4.04624479E-05    3      1000022        15       -15             # Z2SS   -->  Z1SS   TAU-   TAU+        
      3.18477760E-05    3      1000022        16       -16             # Z2SS   -->  Z1SS   NUT    ANUT        
      2.30352245E-02    2      1000022        25                       # Z2SS   -->  Z1SS   HL0                
      1.22095697E-01    2      1000011       -11                       # Z2SS   -->  EL-    E+                 
      1.22095697E-01    2     -1000011        11                       # Z2SS   -->  EL+    E-                 
      1.22095697E-01    2      1000013       -13                       # Z2SS   -->  MUL-   MU+                
      1.22095697E-01    2     -1000013        13                       # Z2SS   -->  MUL+   MU-                
      2.94494930E-05    2      2000011       -11                       # Z2SS   -->  ER-    E+                 
      2.94494930E-05    2     -2000011        11                       # Z2SS   -->  ER+    E-                 
      2.94494930E-05    2      2000013       -13                       # Z2SS   -->  MUR-   MU+                
      2.94494930E-05    2     -2000013        13                       # Z2SS   -->  MUR+   MU-                
      1.18583962E-01    2      1000012       -12                       # Z2SS   -->  NUEL   ANUE               
      1.18583977E-01    2     -1000012        12                       # Z2SS   -->  ANUEL  NUE                
      1.18583962E-01    2      1000014       -14                       # Z2SS   -->  NUML   ANUM               
      1.18583977E-01    2     -1000014        14                       # Z2SS   -->  ANUML  NUM                
#         PDG         Width
DECAY   1000025  1.62665296E+00   # Z3SS  decays
#          BR          NDA       ID1       ID2       ID3       ID4
      1.95871165E-04    3     -1000024         2        -1             # Z3SS   -->  W1SS-  UP     DB          
      6.52903909E-05    3     -1000024        12       -11             # Z3SS   -->  W1SS-  NUE    E+          
      6.52903909E-05    3     -1000024        14       -13             # Z3SS   -->  W1SS-  NUM    MU+         
      1.95871165E-04    3      1000024         1        -2             # Z3SS   -->  W1SS+  DN     UB          
      6.52903909E-05    3      1000024        11       -12             # Z3SS   -->  W1SS+  E-     ANUE        
      6.52903909E-05    3      1000024        13       -14             # Z3SS   -->  W1SS+  MU-    ANUM        
      1.95871165E-04    3     -1000024         4        -3             # Z3SS   -->  W1SS-  CH     SB          
      6.52903909E-05    3     -1000024        16       -15             # Z3SS   -->  W1SS-  NUT    TAU+        
      1.95871165E-04    3      1000024         3        -4             # Z3SS   -->  W1SS+  ST     CB          
      6.52903909E-05    3      1000024        15       -16             # Z3SS   -->  W1SS+  TAU-   ANUT        
      6.19308472E-01    2      1000022        23                       # Z3SS   -->  Z1SS   Z0                 
      2.75904691E-04    3      1000022         5        -5             # Z3SS   -->  Z1SS   BT     BB          
      1.19728065E-04    3      1000022        15       -15             # Z3SS   -->  Z1SS   TAU-   TAU+        
      5.03205119E-05    3      1000023         2        -2             # Z3SS   -->  Z2SS   UP     UB          
      6.48886344E-05    3      1000023         1        -1             # Z3SS   -->  Z2SS   DN     DB          
      6.48886344E-05    3      1000023         3        -3             # Z3SS   -->  Z2SS   ST     SB          
      5.03205119E-05    3      1000023         4        -4             # Z3SS   -->  Z2SS   CH     CB          
      6.09186500E-05    3      1000023         5        -5             # Z3SS   -->  Z2SS   BT     BB          
      1.47199544E-05    3      1000023        11       -11             # Z3SS   -->  Z2SS   E-     E+          
      1.47199544E-05    3      1000023        13       -13             # Z3SS   -->  Z2SS   MU-    MU+         
      1.44973847E-05    3      1000023        15       -15             # Z3SS   -->  Z2SS   TAU-   TAU+        
      2.92880795E-05    3      1000023        12       -12             # Z3SS   -->  Z2SS   NUE    ANUE        
      2.92880795E-05    3      1000023        14       -14             # Z3SS   -->  Z2SS   NUM    ANUM        
      2.92880795E-05    3      1000023        16       -16             # Z3SS   -->  Z2SS   NUT    ANUT        
      3.73199284E-01    2      1000022        25                       # Z3SS   -->  Z1SS   HL0                
      3.45416120E-05    2      1000005        -5                       # Z3SS   -->  BT1    BB                 
      3.45416120E-05    2     -1000005         5                       # Z3SS   -->  BB1    BT                 
      5.53404425E-05    2      1000011       -11                       # Z3SS   -->  EL-    E+                 
      5.53404425E-05    2     -1000011        11                       # Z3SS   -->  EL+    E-                 
      5.53404425E-05    2      1000013       -13                       # Z3SS   -->  MUL-   MU+                
      5.53404425E-05    2     -1000013        13                       # Z3SS   -->  MUL+   MU-                
      4.62506083E-04    2      2000011       -11                       # Z3SS   -->  ER-    E+                 
      4.62506083E-04    2     -2000011        11                       # Z3SS   -->  ER+    E-                 
      4.62506083E-04    2      2000013       -13                       # Z3SS   -->  MUR-   MU+                
      4.62506083E-04    2     -2000013        13                       # Z3SS   -->  MUR+   MU-                
      8.39447486E-04    2      1000012       -12                       # Z3SS   -->  NUEL   ANUE               
      8.39447486E-04    2     -1000012        12                       # Z3SS   -->  ANUEL  NUE                
      8.39447486E-04    2      1000014       -14                       # Z3SS   -->  NUML   ANUM               
      8.39447486E-04    2     -1000014        14                       # Z3SS   -->  ANUML  NUM                
#         PDG         Width
DECAY   1000035  2.33948994E+01   # Z4SS  decays
#          BR          NDA       ID1       ID2       ID3       ID4
      2.22097579E-02    2      1000024       -24                       # Z4SS   -->  W1SS+  W-                 
      2.22097579E-02    2     -1000024        24                       # Z4SS   -->  W1SS-  W+                 
      1.38479481E-02    2      1000022        23                       # Z4SS   -->  Z1SS   Z0                 
      2.16317344E-02    2      1000022        25                       # Z4SS   -->  Z1SS   HL0                
      8.19295179E-04    2      1000002        -2                       # Z4SS   -->  UPL    UB                 
      8.19295179E-04    2     -1000002         2                       # Z4SS   -->  UBL    UP                 
      7.95585453E-04    2      1000001        -1                       # Z4SS   -->  DNL    DB                 
      7.95585453E-04    2     -1000001         1                       # Z4SS   -->  DBL    DN                 
      7.95581494E-04    2      1000003        -3                       # Z4SS   -->  STL    SB                 
      7.95581494E-04    2     -1000003         3                       # Z4SS   -->  SBL    ST                 
      8.19105771E-04    2      1000004        -4                       # Z4SS   -->  CHL    CB                 
      8.19105771E-04    2     -1000004         4                       # Z4SS   -->  CBL    CH                 
      3.50973191E-04    2      1000005        -5                       # Z4SS   -->  BT1    BB                 
      3.50973191E-04    2     -1000005         5                       # Z4SS   -->  BB1    BT                 
      3.81914870E-04    2      2000005        -5                       # Z4SS   -->  BT2    BB                 
      3.81914870E-04    2     -2000005         5                       # Z4SS   -->  BB2    BT                 
      1.12044871E-01    2      1000011       -11                       # Z4SS   -->  EL-    E+                 
      1.12044871E-01    2     -1000011        11                       # Z4SS   -->  EL+    E-                 
      1.12044871E-01    2      1000013       -13                       # Z4SS   -->  MUL-   MU+                
      1.12044871E-01    2     -1000013        13                       # Z4SS   -->  MUL+   MU-                
      2.59908174E-05    2      2000011       -11                       # Z4SS   -->  ER-    E+                 
      2.59908174E-05    2     -2000011        11                       # Z4SS   -->  ER+    E-                 
      2.59908174E-05    2      2000013       -13                       # Z4SS   -->  MUR-   MU+                
      2.59908174E-05    2     -2000013        13                       # Z4SS   -->  MUR+   MU-                
      1.23287595E-04    2      1000015       -15                       # Z4SS   -->  TAU1-  TAU+               
      1.23287595E-04    2     -1000015        15                       # Z4SS   -->  TAU1+  TAU-               
      1.31363980E-04    2      2000015       -15                       # Z4SS   -->  TAU2-  TAU+               
      1.31363980E-04    2     -2000015        15                       # Z4SS   -->  TAU2+  TAU-               
      1.15705363E-01    2      1000012       -12                       # Z4SS   -->  NUEL   ANUE               
      1.15705363E-01    2     -1000012        12                       # Z4SS   -->  ANUEL  NUE                
      1.15705363E-01    2      1000014       -14                       # Z4SS   -->  NUML   ANUM               
      1.15705363E-01    2     -1000014        14                       # Z4SS   -->  ANUML  NUM                
      2.80840934E-04    2      1000016       -16                       # Z4SS   -->  NUTL   ANUT               
      2.80840934E-04    2     -1000016        16                       # Z4SS   -->  ANUTL  NUT                
#         PDG         Width
DECAY   1000024  2.10225868E+01   # W1SS+ decays
#          BR          NDA       ID1       ID2       ID3       ID4
      2.14722677E-05    3      1000022         2        -1             # W1SS+  -->  Z1SS   UP     DB          
      2.14722531E-05    3      1000022         4        -3             # W1SS+  -->  Z1SS   CH     SB          
      7.22584737E-05    3      1000022       -15        16             # W1SS+  -->  Z1SS   TAU+   NUT         
      3.68867330E-02    2      1000022        24                       # W1SS+  -->  Z1SS   W+                 
      2.45907769E-01    2      1000012       -11                       # W1SS+  -->  NUEL   E+                 
      2.45907769E-01    2      1000014       -13                       # W1SS+  -->  NUML   MU+                
      2.35591263E-01    2     -1000011        12                       # W1SS+  -->  EL+    NUE                
      2.35591263E-01    2     -1000013        14                       # W1SS+  -->  MUL+   NUM                
#         PDG         Width
DECAY   1000037  2.32704620E+01   # W2SS+ decays
#          BR          NDA       ID1       ID2       ID3       ID4
      3.55482288E-02    2      1000022        24                       # W2SS+  -->  Z1SS   W+                 
      2.23214719E-02    2      1000023        24                       # W2SS+  -->  Z2SS   W+                 
      1.28981601E-05    3      1000025         2        -1             # W2SS+  -->  Z3SS   UP     DB          
      1.28981601E-05    3      1000025         4        -3             # W2SS+  -->  Z3SS   CH     SB          
      1.62285124E-03    2      1000002        -1                       # W2SS+  -->  UPL    DB                 
      1.62498199E-03    2     -1000001         2                       # W2SS+  -->  DBL    UP                 
      1.62282959E-03    2      1000004        -3                       # W2SS+  -->  CHL    SB                 
      1.68993976E-03    2     -1000003         4                       # W2SS+  -->  SBL    CH                 
      9.21805113E-05    2      1000006        -5                       # W2SS+  -->  TP1    BB                 
      2.76651769E-03    2      2000006        -5                       # W2SS+  -->  TP2    BB                 
      2.24451467E-01    2      1000012       -11                       # W2SS+  -->  NUEL   E+                 
      2.24451467E-01    2      1000014       -13                       # W2SS+  -->  NUML   MU+                
      5.53222199E-04    2      1000016       -15                       # W2SS+  -->  NUTL   TAU+               
      2.33336240E-01    2     -1000011        12                       # W2SS+  -->  EL+    NUE                
      2.33336240E-01    2     -1000013        14                       # W2SS+  -->  MUL+   NUM                
      2.53918057E-04    2     -1000015        16                       # W2SS+  -->  TAU1+  NUT                
      2.69571436E-04    2     -2000015        16                       # W2SS+  -->  TAU2+  NUT                
      1.60330888E-02    2      1000024        23                       # W2SS+  -->  W1SS+  Z0                 
#         PDG         Width
DECAY        25  3.96303553E-03   # HL0   decays
#          BR          NDA       ID1       ID2       ID3       ID4
      2.06451063E-04    2           13       -13                       # HL0    -->  MU-    MU+                
      5.90437837E-02    2           15       -15                       # HL0    -->  TAU-   TAU+               
      2.48025381E-03    2            3        -3                       # HL0    -->  ST     SB                 
      8.14805627E-01    2            5        -5                       # HL0    -->  BT     BB                 
      3.68167870E-02    2            4        -4                       # HL0    -->  CH     CB                 
      1.73790893E-03    2           22        22                       # HL0    -->  GM     GM                 
      3.86412032E-02    2           21        21                       # HL0    -->  GL     GL                 
      2.40935548E-03    3           24        11       -12             # HL0    -->  W+     E-     ANUE        
      2.40935548E-03    3           24        13       -14             # HL0    -->  W+     MU-    ANUM        
      2.40935548E-03    3           24        15       -16             # HL0    -->  W+     TAU-   ANUT        
      7.22806714E-03    3           24        -2         1             # HL0    -->  W+     UB     DN          
      7.22806714E-03    3           24        -4         3             # HL0    -->  W+     CB     ST          
      2.40935548E-03    3          -24       -11        12             # HL0    -->  W-     E+     NUE         
      2.40935548E-03    3          -24       -13        14             # HL0    -->  W-     MU+    NUM         
      2.40935548E-03    3          -24       -15        16             # HL0    -->  W-     TAU+   NUT         
      7.22806714E-03    3          -24         2        -1             # HL0    -->  W-     UP     DB          
      7.22806714E-03    3          -24         4        -3             # HL0    -->  W-     CH     SB          
      1.97105168E-04    3           23        12       -12             # HL0    -->  Z0     NUE    ANUE        
      1.97105168E-04    3           23        14       -14             # HL0    -->  Z0     NUM    ANUM        
      1.97105168E-04    3           23        16       -16             # HL0    -->  Z0     NUT    ANUT        
      9.92010391E-05    3           23        11       -11             # HL0    -->  Z0     E-     E+          
      9.92010391E-05    3           23        13       -13             # HL0    -->  Z0     MU-    MU+         
      9.92010391E-05    3           23        15       -15             # HL0    -->  Z0     TAU-   TAU+        
      3.39854363E-04    3           23         2        -2             # HL0    -->  Z0     UP     UB          
      3.39854363E-04    3           23         4        -4             # HL0    -->  Z0     CH     CB          
      4.37816168E-04    3           23         1        -1             # HL0    -->  Z0     DN     DB          
      4.37816168E-04    3           23         3        -3             # HL0    -->  Z0     ST     SB          
      4.37816168E-04    3           23         5        -5             # HL0    -->  Z0     BT     BB          
      1.75030345E-05    2      1000022   1000022                       # HL0    -->  Z1SS   Z1SS               
#         PDG         Width
DECAY        35  6.32050705E+00   # HH0   decays
#          BR          NDA       ID1       ID2       ID3       ID4
      2.85663788E-04    2           13       -13                       # HH0    -->  MU-    MU+                
      8.18182379E-02    2           15       -15                       # HH0    -->  TAU-   TAU+               
      3.32558202E-03    2            3        -3                       # HH0    -->  ST     SB                 
      7.39639580E-01    2            5        -5                       # HH0    -->  BT     BB                 
      1.73870713E-01    2            6        -6                       # HH0    -->  TP     TB                 
      3.17857048E-05    2           21        21                       # HH0    -->  GL     GL                 
      8.66935661E-05    2           24       -24                       # HH0    -->  W+     W-                 
      4.44210564E-05    2           23        23                       # HH0    -->  Z0     Z0                 
      3.03601002E-04    2      1000022   1000022                       # HH0    -->  Z1SS   Z1SS               
      9.26479333E-05    2      1000022   1000023                       # HH0    -->  Z1SS   Z2SS               
      3.31686810E-04    2           25        25                       # HH0    -->  HL0    HL0                
      1.61685457E-05    2      1000011  -1000011                       # HH0    -->  EL-    EL+                
      1.21176554E-05    2      2000011  -2000011                       # HH0    -->  ER-    ER+                
      1.61605822E-05    2      1000013  -1000013                       # HH0    -->  MUL-   MUL+               
      1.21107623E-05    2      2000013  -2000013                       # HH0    -->  MUR-   MUR+               
      5.63926369E-05    2      1000012  -1000012                       # HH0    -->  NUEL   ANUEL              
      5.63926369E-05    2      1000014  -1000014                       # HH0    -->  NUML   ANUML              
#         PDG         Width
DECAY        36  6.29078579E+00   # HA0   decays
#          BR          NDA       ID1       ID2       ID3       ID4
      2.85148853E-04    2           13       -13                       # HA0    -->  MU-    MU+                
      8.16709250E-02    2           15       -15                       # HA0    -->  TAU-   TAU+               
      3.31974030E-03    2            3        -3                       # HA0    -->  ST     SB                 
      7.38869607E-01    2            5        -5                       # HA0    -->  BT     BB                 
      1.75046742E-01    2            6        -6                       # HA0    -->  TP     TB                 
      6.20374485E-05    2           21        21                       # HA0    -->  GL     GL                 
      3.18794715E-04    2      1000022   1000022                       # HA0    -->  Z1SS   Z1SS               
      3.40806320E-04    2      1000022   1000023                       # HA0    -->  Z1SS   Z2SS               
      8.61764129E-05    2           25        23                       # HA0    -->  HL0    Z0                 
#         PDG         Width
DECAY        37  5.85365963E+00   # H+    decays
#          BR          NDA       ID1       ID2       ID3       ID4
      3.08612856E-04    2           14       -13                       # H+     -->  NUM    MU+                
      8.83913711E-02    2           16       -15                       # H+     -->  NUT    TAU+               
      3.32888775E-03    2            4        -3                       # H+     -->  CH     SB                 
      9.06785071E-01    2            6        -5                       # H+     -->  TP     BB                 
      9.49592097E-04    2      1000024   1000022                       # H+     -->  W1SS+  Z1SS               
      9.34576674E-05    2           25        24                       # H+     -->  HL0    W+                 
      7.14916969E-05    2     -1000011   1000012                       # H+     -->  EL+    NUEL               
      7.14793860E-05    2     -1000013   1000014                       # H+     -->  MUL+   NUML               
