#
#                              ======================
#                              | THE SUSYHIT OUTPUT |
#                              ======================
#
#
#              ------------------------------------------------------
#              |     This is the output of the SUSY-HIT package     |
#              |  created by A.Djouadi, M.Muehlleitner and M.Spira. |
#              |  In case of problems with SUSY-HIT email to        |
#              |           margarete.muehlleitner@cern.ch           |
#              |           michael.spira@psi.ch                     |
#              |           abdelhak.djouadi@cern.ch                 |
#              ------------------------------------------------------
#
#              ------------------------------------------------------
#              |  SUSY Les Houches Accord - MSSM Spectrum + Decays  |
#              |              based on the decay programs           |
#              |                                                    |
#              |                     SDECAY 1.3b                    |
#              |                                                    |
#              |  Authors: M.Muhlleitner, A.Djouadi and Y.Mambrini  |
#              |  Ref.:    Comput.Phys.Commun.168(2005)46           |
#              |           [hep-ph/0311167]                         |
#              |                                                    |
#              |                     HDECAY 3.4                     |
#              |                                                    |
#              |  By: A.Djouadi,J.Kalinowski,M.Muhlleitner,M.Spira  |
#              |  Ref.:    Comput.Phys.Commun.108(1998)56           |
#              |           [hep-ph/9704448]                         |
#              |                                                    |
#              |                                                    |
#              |  If not stated otherwise all DRbar couplings and   |
#              |  soft SUSY breaking masses are given at the scale  |
#              |  Q=  0.80320258E+03
#              |                                                    |
#              ------------------------------------------------------
#
#
BLOCK DCINFO  # Decay Program information
     1   SDECAY/HDECAY # decay calculator
     2   1.3b  /3.4    # version number
#
BLOCK SPINFO  # Spectrum calculator information
     1    SOFTSUSY    # spectrum calculator                
     2    3.3.3       # version number                     
#
BLOCK MODSEL  # Model selection
     1     0   #  nonUniversal                                     
#
BLOCK SMINPUTS  # Standard Model inputs
         1     1.27934000E+02   # alpha_em^-1(M_Z)^MSbar
         2     1.16639000E-05   # G_F [GeV^-2]
         3     1.17200000E-01   # alpha_S(M_Z)^MSbar
         4     9.11870000E+01   # M_Z pole mass
         5     4.16000000E+00   # mb(mb)^MSbar
         6     1.73200000E+02   # mt pole mass
         7     1.77710000E+00   # mtau pole mass
#
BLOCK MINPAR  # Input parameters - minimal models
         3     5.00000000E+01   # tanb                
#
BLOCK EXTPAR  # Input parameters - non-minimal models
         0     8.03202584E+02   # MX                  
         1     3.59900000E+02   # M_1(MX)             
         2     2.00000000E+03   # M_2(MX)             
         3     1.70000000E+03   # M_3(MX)             
        11     2.10866811E+03   # At(MX)              
        12     0.00000000E+00   # Ab(MX)              
        13     0.00000000E+00   # Atau(MX)            
        23    -3.91746973E+02   # mu(MX)              
        26     4.00000000E+03   # mA(pole)            
        31     4.00000000E+03   # meL(MX)             
        32     4.00000000E+03   # mmuL(MX)            
        33     4.00000000E+03   # mtauL(MX)           
        34     4.00000000E+03   # meR(MX)             
        35     4.00000000E+03   # mmuR(MX)            
        36     4.00000000E+03   # mtauR(MX)           
        41     4.00000000E+03   # mqL1(MX)            
        42     4.00000000E+03   # mqL2(MX)            
        43     4.59900000E+02   # mqL3(MX)            
        44     4.00000000E+03   # muR(MX)             
        45     4.00000000E+03   # mcR(MX)             
        46     1.49040708E+03   # mtR(MX)             
        47     4.00000000E+03   # mdR(MX)             
        48     4.00000000E+03   # msR(MX)             
        49     4.00000000E+03   # mbR(MX)             
#
BLOCK MASS  # Mass Spectrum
# PDG code           mass       particle
        24     8.04189240E+01   # W+
        25     1.26782103E+02   # h
        35     3.99991719E+03   # H
        36     3.99992626E+03   # A
        37     4.00087468E+03   # H+
         5     4.78066023E+00   # b-quark pole mass calculated from mb(mb)_Msbar
   1000001     4.01117835E+03   # ~d_L
   2000001     4.01146373E+03   # ~d_R
   1000002     4.01054590E+03   # ~u_L
   2000002     4.01259684E+03   # ~u_R
   1000003     4.01117835E+03   # ~s_L
   2000003     4.01146373E+03   # ~s_R
   1000004     4.01054590E+03   # ~c_L
   2000004     4.01259684E+03   # ~c_R
   1000005     6.63825172E+02   # ~b_1
   2000005     4.06305967E+03   # ~b_2
   1000006     6.29904027E+02   # ~t_1
   2000006     1.51273656E+03   # ~t_2
   1000011     4.00100204E+03   # ~e_L
   2000011     4.00294125E+03   # ~e_R
   1000012     3.99991228E+03   # ~nu_eL
   1000013     4.00100204E+03   # ~mu_L
   2000013     4.00294125E+03   # ~mu_R
   1000014     3.99991228E+03   # ~nu_muL
   1000015     4.01790617E+03   # ~tau_1
   2000015     4.03950538E+03   # ~tau_2
   1000016     4.01779063E+03   # ~nu_tauL
   1000021     1.84725304E+03   # ~g
   1000022     3.49859439E+02   # ~chi_10
   1000023    -4.01725360E+02   # ~chi_20
   1000025     4.17164318E+02   # ~chi_30
   1000035     2.05878478E+03   # ~chi_40
   1000024     3.92529068E+02   # ~chi_1+
   1000037     2.05719605E+03   # ~chi_2+
#
BLOCK NMIX  # Neutralino Mixing Matrix
  1  1     8.52772729E-01   # N_11
  1  2    -1.55479048E-02   # N_12
  1  3    -3.93933200E-01   # N_13
  1  4    -3.42569073E-01   # N_14
  2  1    -4.08493904E-02   # N_21
  2  2     2.36977063E-02   # N_22
  2  3    -7.04855867E-01   # N_23
  2  4     7.07776768E-01   # N_24
  3  1     5.20680987E-01   # N_31
  3  2     2.95204166E-02   # N_32
  3  3     5.89871215E-01   # N_33
  3  4     6.16499639E-01   # N_34
  4  1    -1.14481269E-03   # N_41
  4  2     9.99162262E-01   # N_42
  4  3    -6.84034302E-03   # N_43
  4  4    -4.03320311E-02   # N_44
#
BLOCK UMIX  # Chargino Mixing Matrix U
  1  1     7.48857876E-03   # U_11
  1  2     9.99971960E-01   # U_12
  2  1    -9.99971960E-01   # U_21
  2  2     7.48857876E-03   # U_22
#
BLOCK VMIX  # Chargino Mixing Matrix V
  1  1     5.46419686E-02   # V_11
  1  2    -9.98506012E-01   # V_12
  2  1    -9.98506012E-01   # V_21
  2  2    -5.46419686E-02   # V_22
#
BLOCK STOPMIX  # Stop Mixing Matrix
  1  1     9.82365911E-01   # cos(theta_t)
  1  2    -1.86968492E-01   # sin(theta_t)
  2  1     1.86968492E-01   # -sin(theta_t)
  2  2     9.82365911E-01   # cos(theta_t)
#
BLOCK SBOTMIX  # Sbottom Mixing Matrix
  1  1     9.99995198E-01   # cos(theta_b)
  1  2    -3.09902839E-03   # sin(theta_b)
  2  1     3.09902839E-03   # -sin(theta_b)
  2  2     9.99995198E-01   # cos(theta_b)
#
BLOCK STAUMIX  # Stau Mixing Matrix
  1  1     9.80797266E-01   # cos(theta_tau)
  1  2    -1.95030057E-01   # sin(theta_tau)
  2  1     1.95030057E-01   # -sin(theta_tau)
  2  2     9.80797266E-01   # cos(theta_tau)
#
BLOCK ALPHA  # Higgs mixing
          -2.01178910E-02   # Mixing angle in the neutral Higgs boson sector
#
BLOCK HMIX Q=  8.03202584E+02  # DRbar Higgs Parameters
         1    -3.91746987E+02   # mu(Q)MSSM           
         2     4.97610552E+01   # tan                 
         3     2.44540944E+02   # higgs               
         4     1.66031337E+07   # mA^2(Q)MSSM         
#
BLOCK GAUGE Q=  8.03202584E+02  # The gauge couplings
     1     3.60337630E-01   # gprime(Q) DRbar
     2     6.35803913E-01   # g(Q) DRbar
     3     1.04344605E+00   # g3(Q) DRbar
#
BLOCK AU Q=  8.03202584E+02  # The trilinear couplings
  1  1     2.10865209E+03   # A_u(Q) DRbar
  2  2     2.10865209E+03   # A_c(Q) DRbar
  3  3     2.10864766E+03   # A_t(Q) DRbar
#
BLOCK AD Q=  8.03202584E+02  # The trilinear couplings
  1  1    -1.13540975E-02   # A_d(Q) DRbar
  2  2    -1.13541118E-02   # A_s(Q) DRbar
  3  3    -1.27962708E-02   # A_b(Q) DRbar
#
BLOCK AE Q=  8.03202584E+02  # The trilinear couplings
  1  1    -2.24625389E-03   # A_e(Q) DRbar
  2  2    -2.24622870E-03   # A_mu(Q) DRbar
  3  3    -2.23912090E-03   # A_tau(Q) DRbar
#
BLOCK Yu Q=  8.03202584E+02  # The Yukawa couplings
  1  1     0.00000000E+00   # y_u(Q) DRbar
  2  2     0.00000000E+00   # y_c(Q) DRbar
  3  3     8.85222620E-01   # y_t(Q) DRbar
#
BLOCK Yd Q=  8.03202584E+02  # The Yukawa couplings
  1  1     0.00000000E+00   # y_d(Q) DRbar
  2  2     0.00000000E+00   # y_s(Q) DRbar
  3  3     7.67775824E-01   # y_b(Q) DRbar
#
BLOCK Ye Q=  8.03202584E+02  # The Yukawa couplings
  1  1     0.00000000E+00   # y_e(Q) DRbar
  2  2     0.00000000E+00   # y_mu(Q) DRbar
  3  3     4.97099324E-01   # y_tau(Q) DRbar
#
BLOCK MSOFT Q=  8.03202584E+02  # The soft SUSY breaking masses at the scale Q
         1     3.59899452E+02   # M_1(Q)              
         2     1.99999893E+03   # M_2(Q)              
         3     1.70000479E+03   # M_3(Q)              
        21     1.51123212E+07   # mH1^2(Q)            
        22    -1.57581291E+05   # mH2^2(Q)            
        31     4.00000051E+03   # meL(Q)              
        32     4.00000050E+03   # mmuL(Q)             
        33     3.99999918E+03   # mtauL(Q)            
        34     4.00000005E+03   # meR(Q)              
        35     4.00000004E+03   # mmuR(Q)             
        36     3.99999737E+03   # mtauR(Q)            
        41     4.00000216E+03   # mqL1(Q)             
        42     4.00000216E+03   # mqL2(Q)             
        43     4.59895823E+02   # mqL3(Q)             
        44     4.00000164E+03   # muR(Q)              
        45     4.00000164E+03   # mcR(Q)              
        46     1.49040844E+03   # mtR(Q)              
        47     4.00000169E+03   # mdR(Q)              
        48     4.00000169E+03   # msR(Q)              
        49     3.99999750E+03   # mbR(Q)              
#
#
#
#                             =================
#                             |The decay table|
#                             =================
#
# - The QCD corrections to the decays gluino -> squark  + quark
#                                     squark -> gaugino + quark_prime
#                                     squark -> squark_prime + Higgs
#                                     squark -> gluino  + quark
#   are included.
#
# - The multi-body decays for the inos, stops and sbottoms are included.
#
# - The loop induced decays for the gluino, neutralinos and stops
#   are included.
#
# - The SUSY decays of the top quark are included.
#
#
#         PDG            Width
DECAY         6     1.42241443E+00   # top decays
#          BR         NDA      ID1       ID2
     1.00000000E+00    2           5        24   # BR(t ->  b    W+)
#
#         PDG            Width
DECAY   1000021     6.33846786E+01   # gluino decays
#          BR         NDA      ID1       ID2
     2.26804089E-01    2     1000005        -5   # BR(~g -> ~b_1  bb)
     2.26804089E-01    2    -1000005         5   # BR(~g -> ~b_1* b )
     2.49878213E-01    2     1000006        -6   # BR(~g -> ~t_1  tb)
     2.49878213E-01    2    -1000006         6   # BR(~g -> ~t_1* t )
     2.33176978E-02    2     2000006        -6   # BR(~g -> ~t_2  tb)
     2.33176978E-02    2    -2000006         6   # BR(~g -> ~t_2* t )
#
#         PDG            Width
DECAY   1000006     4.51188641E+00   # stop1 decays
#          BR         NDA      ID1       ID2
     9.44119567E-02    2     1000022         6   # BR(~t_1 -> ~chi_10 t )
     1.65639220E-01    2     1000023         6   # BR(~t_1 -> ~chi_20 t )
     1.60922893E-01    2     1000025         6   # BR(~t_1 -> ~chi_30 t )
     5.79025930E-01    2     1000024         5   # BR(~t_1 -> ~chi_1+ b )
#
#         PDG            Width
DECAY   2000006     1.11570042E+02   # stop2 decays
#          BR         NDA      ID1       ID2
     4.28229567E-02    2     1000022         6   # BR(~t_2 -> ~chi_10 t )
     8.83701227E-02    2     1000023         6   # BR(~t_2 -> ~chi_20 t )
     6.64735430E-02    2     1000025         6   # BR(~t_2 -> ~chi_30 t )
     1.75572526E-01    2     1000024         5   # BR(~t_2 -> ~chi_1+ b )
     1.55690805E-01    2     1000006        25   # BR(~t_2 -> ~t_1    h )
     1.61957989E-01    2     1000006        23   # BR(~t_2 -> ~t_1    Z )
     3.09112058E-01    2     1000005        24   # BR(~t_2 -> ~b_1    W+)
#
#         PDG            Width
DECAY   1000005     6.03926767E+00   # sbottom1 decays
#          BR         NDA      ID1       ID2
     1.07581123E-01    2     1000022         5   # BR(~b_1 -> ~chi_10 b )
     2.44990527E-01    2     1000023         5   # BR(~b_1 -> ~chi_20 b )
     1.56586120E-01    2     1000025         5   # BR(~b_1 -> ~chi_30 b )
     4.90842230E-01    2    -1000024         6   # BR(~b_1 -> ~chi_1- t )
#
#         PDG            Width
DECAY   2000005     2.52720534E+02   # sbottom2 decays
#          BR         NDA      ID1       ID2
     3.26325994E-02    2     1000022         5   # BR(~b_2 -> ~chi_10 b )
     8.40343473E-02    2     1000023         5   # BR(~b_2 -> ~chi_20 b )
     6.11852381E-02    2     1000025         5   # BR(~b_2 -> ~chi_30 b )
     6.89255558E-06    2     1000035         5   # BR(~b_2 -> ~chi_40 b )
     1.68719499E-01    2    -1000024         6   # BR(~b_2 -> ~chi_1- t )
     9.25076123E-06    2    -1000037         6   # BR(~b_2 -> ~chi_2- t )
     6.49857248E-01    2     1000021         5   # BR(~b_2 -> ~g      b )
     7.83346719E-04    2     1000005        25   # BR(~b_2 -> ~b_1    h )
     1.02861206E-03    2     1000005        23   # BR(~b_2 -> ~b_1    Z )
     1.70119004E-03    2     1000006       -24   # BR(~b_2 -> ~t_1    W-)
     4.17751722E-05    2     2000006       -24   # BR(~b_2 -> ~t_2    W-)
#
#         PDG            Width
DECAY   1000002     1.86404546E+02   # sup_L decays
#          BR         NDA      ID1       ID2
     1.74064559E-03    2     1000022         2   # BR(~u_L -> ~chi_10 u)
     2.08834971E-05    2     1000023         2   # BR(~u_L -> ~chi_20 u)
     1.33530406E-03    2     1000025         2   # BR(~u_L -> ~chi_30 u)
     4.53604830E-02    2     1000035         2   # BR(~u_L -> ~chi_40 u)
     4.88744904E-04    2     1000024         1   # BR(~u_L -> ~chi_1+ d)
     9.07404819E-02    2     1000037         1   # BR(~u_L -> ~chi_2+ d)
     8.60313457E-01    2     1000021         2   # BR(~u_L -> ~g      u)
#
#         PDG            Width
DECAY   2000002     1.69271743E+02   # sup_R decays
#          BR         NDA      ID1       ID2
     3.75913672E-02    2     1000022         2   # BR(~u_R -> ~chi_10 u)
     8.58501949E-05    2     1000023         2   # BR(~u_R -> ~chi_20 u)
     1.39265848E-02    2     1000025         2   # BR(~u_R -> ~chi_30 u)
     3.75079825E-08    2     1000035         2   # BR(~u_R -> ~chi_40 u)
     9.48396160E-01    2     1000021         2   # BR(~u_R -> ~g      u)
#
#         PDG            Width
DECAY   1000001     1.86422348E+02   # sdown_L decays
#          BR         NDA      ID1       ID2
     2.56400827E-03    2     1000022         1   # BR(~d_L -> ~chi_10 d)
     8.07070298E-05    2     1000023         1   # BR(~d_L -> ~chi_20 d)
     3.86993609E-04    2     1000025         1   # BR(~d_L -> ~chi_30 d)
     4.54128178E-02    2     1000035         1   # BR(~d_L -> ~chi_40 d)
     9.18034594E-06    2    -1000024         2   # BR(~d_L -> ~chi_1- u)
     9.10332226E-02    2    -1000037         2   # BR(~d_L -> ~chi_2- u)
     8.60513070E-01    2     1000021         1   # BR(~d_L -> ~g      d)
#
#         PDG            Width
DECAY   2000001     1.62625689E+02   # sdown_R decays
#          BR         NDA      ID1       ID2
     9.77901620E-03    2     1000022         1   # BR(~d_R -> ~chi_10 d)
     2.23330053E-05    2     1000023         1   # BR(~d_R -> ~chi_20 d)
     3.62284816E-03    2     1000025         1   # BR(~d_R -> ~chi_30 d)
     9.75352098E-09    2     1000035         1   # BR(~d_R -> ~chi_40 d)
     9.86575793E-01    2     1000021         1   # BR(~d_R -> ~g      d)
#
#         PDG            Width
DECAY   1000004     1.86404546E+02   # scharm_L decays
#          BR         NDA      ID1       ID2
     1.74064559E-03    2     1000022         4   # BR(~c_L -> ~chi_10 c)
     2.08834971E-05    2     1000023         4   # BR(~c_L -> ~chi_20 c)
     1.33530406E-03    2     1000025         4   # BR(~c_L -> ~chi_30 c)
     4.53604830E-02    2     1000035         4   # BR(~c_L -> ~chi_40 c)
     4.88744904E-04    2     1000024         3   # BR(~c_L -> ~chi_1+ s)
     9.07404819E-02    2     1000037         3   # BR(~c_L -> ~chi_2+ s)
     8.60313457E-01    2     1000021         4   # BR(~c_L -> ~g      c)
#
#         PDG            Width
DECAY   2000004     1.69271743E+02   # scharm_R decays
#          BR         NDA      ID1       ID2
     3.75913672E-02    2     1000022         4   # BR(~c_R -> ~chi_10 c)
     8.58501949E-05    2     1000023         4   # BR(~c_R -> ~chi_20 c)
     1.39265848E-02    2     1000025         4   # BR(~c_R -> ~chi_30 c)
     3.75079825E-08    2     1000035         4   # BR(~c_R -> ~chi_40 c)
     9.48396160E-01    2     1000021         4   # BR(~c_R -> ~g      c)
#
#         PDG            Width
DECAY   1000003     1.86422348E+02   # sstrange_L decays
#          BR         NDA      ID1       ID2
     2.56400827E-03    2     1000022         3   # BR(~s_L -> ~chi_10 s)
     8.07070298E-05    2     1000023         3   # BR(~s_L -> ~chi_20 s)
     3.86993609E-04    2     1000025         3   # BR(~s_L -> ~chi_30 s)
     4.54128178E-02    2     1000035         3   # BR(~s_L -> ~chi_40 s)
     9.18034594E-06    2    -1000024         4   # BR(~s_L -> ~chi_1- c)
     9.10332226E-02    2    -1000037         4   # BR(~s_L -> ~chi_2- c)
     8.60513070E-01    2     1000021         3   # BR(~s_L -> ~g      s)
#
#         PDG            Width
DECAY   2000003     1.62625689E+02   # sstrange_R decays
#          BR         NDA      ID1       ID2
     9.77901620E-03    2     1000022         3   # BR(~s_R -> ~chi_10 s)
     2.23330053E-05    2     1000023         3   # BR(~s_R -> ~chi_20 s)
     3.62284816E-03    2     1000025         3   # BR(~s_R -> ~chi_30 s)
     9.75352098E-09    2     1000035         3   # BR(~s_R -> ~chi_40 s)
     9.86575793E-01    2     1000021         3   # BR(~s_R -> ~g      s)
#
#         PDG            Width
DECAY   1000011     3.12092558E+01   # selectron_L decays
#          BR         NDA      ID1       ID2
     1.11071453E-01    2     1000022        11   # BR(~e_L -> ~chi_10 e-)
     1.50920682E-07    2     1000023        11   # BR(~e_L -> ~chi_20 e-)
     5.31458246E-02    2     1000025        11   # BR(~e_L -> ~chi_30 e-)
     2.77827325E-01    2     1000035        11   # BR(~e_L -> ~chi_40 e-)
     5.67100375E-05    2    -1000024        12   # BR(~e_L -> ~chi_1- nu_e)
     5.57898537E-01    2    -1000037        12   # BR(~e_L -> ~chi_2- nu_e)
#
#         PDG            Width
DECAY   2000011     2.03296701E+01   # selectron_R decays
#          BR         NDA      ID1       ID2
     7.28508062E-01    2     1000022        11   # BR(~e_R -> ~chi_10 e-)
     1.66343929E-03    2     1000023        11   # BR(~e_R -> ~chi_20 e-)
     2.69827777E-01    2     1000025        11   # BR(~e_R -> ~chi_30 e-)
     7.21166098E-07    2     1000035        11   # BR(~e_R -> ~chi_40 e-)
#
#         PDG            Width
DECAY   1000013     3.12092558E+01   # smuon_L decays
#          BR         NDA      ID1       ID2
     1.11071453E-01    2     1000022        13   # BR(~mu_L -> ~chi_10 mu-)
     1.50920682E-07    2     1000023        13   # BR(~mu_L -> ~chi_20 mu-)
     5.31458246E-02    2     1000025        13   # BR(~mu_L -> ~chi_30 mu-)
     2.77827325E-01    2     1000035        13   # BR(~mu_L -> ~chi_40 mu-)
     5.67100375E-05    2    -1000024        14   # BR(~mu_L -> ~chi_1- nu_mu)
     5.57898537E-01    2    -1000037        14   # BR(~mu_L -> ~chi_2- nu_mu)
#
#         PDG            Width
DECAY   2000013     2.03296701E+01   # smuon_R decays
#          BR         NDA      ID1       ID2
     7.28508062E-01    2     1000022        13   # BR(~mu_R -> ~chi_10 mu-)
     1.66343929E-03    2     1000023        13   # BR(~mu_R -> ~chi_20 mu-)
     2.69827777E-01    2     1000025        13   # BR(~mu_R -> ~chi_30 mu-)
     7.21166098E-07    2     1000035        13   # BR(~mu_R -> ~chi_40 mu-)
#
#         PDG            Width
DECAY   1000015     5.12381060E+01   # stau_1 decays
#          BR         NDA      ID1       ID2
     1.61124545E-01    2     1000022        15   # BR(~tau_1 -> ~chi_10  tau-)
     1.83416191E-01    2     1000023        15   # BR(~tau_1 -> ~chi_20  tau-)
     1.46189245E-01    2     1000025        15   # BR(~tau_1 -> ~chi_30  tau-)
     1.63978634E-01    2     1000035        15   # BR(~tau_1 -> ~chi_40  tau-)
     1.58028289E-02    2    -1000024        16   # BR(~tau_1 -> ~chi_1-  nu_tau)
     3.29488556E-01    2    -1000037        16   # BR(~tau_1 -> ~chi_2-  nu_tau)
#
#         PDG            Width
DECAY   2000015     5.91086136E+01   # stau_2 decays
#          BR         NDA      ID1       ID2
     2.74425989E-01    2     1000022        15   # BR(~tau_2 -> ~chi_10  tau-)
     1.67955117E-01    2     1000023        15   # BR(~tau_2 -> ~chi_20  tau-)
     2.23424757E-01    2     1000025        15   # BR(~tau_2 -> ~chi_30  tau-)
     6.15501904E-03    2     1000035        15   # BR(~tau_2 -> ~chi_40  tau-)
     3.15886809E-01    2    -1000024        16   # BR(~tau_2 -> ~chi_1-  nu_tau)
     1.21523089E-02    2    -1000037        16   # BR(~tau_2 -> ~chi_2-  nu_tau)
#
#         PDG            Width
DECAY   1000012     3.12168201E+01   # snu_eL decays
#          BR         NDA      ID1       ID2
     1.26264044E-01    2     1000022        12   # BR(~nu_eL -> ~chi_10 nu_e)
     1.10815349E-03    2     1000023        12   # BR(~nu_eL -> ~chi_20 nu_e)
     3.55527850E-02    2     1000025        12   # BR(~nu_eL -> ~chi_30 nu_e)
     2.78297283E-01    2     1000035        12   # BR(~nu_eL -> ~chi_40 nu_e)
     3.01776662E-03    2     1000024        11   # BR(~nu_eL -> ~chi_1+ e-)
     5.55759968E-01    2     1000037        11   # BR(~nu_eL -> ~chi_2+ e-)
#
#         PDG            Width
DECAY   1000014     3.12168201E+01   # snu_muL decays
#          BR         NDA      ID1       ID2
     1.26264044E-01    2     1000022        14   # BR(~nu_muL -> ~chi_10 nu_mu)
     1.10815349E-03    2     1000023        14   # BR(~nu_muL -> ~chi_20 nu_mu)
     3.55527850E-02    2     1000025        14   # BR(~nu_muL -> ~chi_30 nu_mu)
     2.78297283E-01    2     1000035        14   # BR(~nu_muL -> ~chi_40 nu_mu)
     3.01776662E-03    2     1000024        13   # BR(~nu_muL -> ~chi_1+ mu-)
     5.55759968E-01    2     1000037        13   # BR(~nu_muL -> ~chi_2+ mu-)
#
#         PDG            Width
DECAY   1000016     5.09005810E+01   # snu_tauL decays
#          BR         NDA      ID1       ID2
     7.77932491E-02    2     1000022        16   # BR(~nu_tauL -> ~chi_10 nu_tau)
     6.82780742E-04    2     1000023        16   # BR(~nu_tauL -> ~chi_20 nu_tau)
     2.19059048E-02    2     1000025        16   # BR(~nu_tauL -> ~chi_30 nu_tau)
     1.72538904E-01    2     1000035        16   # BR(~nu_tauL -> ~chi_40 nu_tau)
     3.82514281E-01    2     1000024        15   # BR(~nu_tauL -> ~chi_1+ tau-)
     3.44564880E-01    2     1000037        15   # BR(~nu_tauL -> ~chi_2+ tau-)
#
#         PDG            Width
DECAY   1000024     4.68304954E-05   # chargino1+ decays
#           BR         NDA      ID1       ID2       ID3
     3.33635561E-01    3     1000022         2        -1   # BR(~chi_1+ -> ~chi_10 u    db)
     3.33635561E-01    3     1000022         4        -3   # BR(~chi_1+ -> ~chi_10 c    sb)
     1.11213537E-01    3     1000022       -11        12   # BR(~chi_1+ -> ~chi_10 e+   nu_e)
     1.11213537E-01    3     1000022       -13        14   # BR(~chi_1+ -> ~chi_10 mu+  nu_mu)
     1.10301804E-01    3     1000022       -15        16   # BR(~chi_1+ -> ~chi_10 tau+ nu_tau)
#
#         PDG            Width
DECAY   1000037     6.19441812E+01   # chargino2+ decays
#          BR         NDA      ID1       ID2
     3.77017988E-01    2     1000006        -5   # BR(~chi_2+ -> ~t_1     bb)
     1.34551091E-03    2     2000006        -5   # BR(~chi_2+ -> ~t_2     bb)
     3.65252986E-01    2    -1000005         6   # BR(~chi_2+ -> ~b_1*    t )
     6.08786967E-02    2     1000024        23   # BR(~chi_2+ -> ~chi_1+  Z )
     1.49121277E-02    2     1000022        24   # BR(~chi_2+ -> ~chi_10  W+)
     5.95354370E-02    2     1000023        24   # BR(~chi_2+ -> ~chi_20  W+)
     5.60997839E-02    2     1000025        24   # BR(~chi_2+ -> ~chi_30  W+)
     6.49574694E-02    2     1000024        25   # BR(~chi_2+ -> ~chi_1+  h )
#
#         PDG            Width
DECAY   1000022     0.00000000E+00   # neutralino1 decays
#
#         PDG            Width
DECAY   1000023     1.02823992E-04   # neutralino2 decays
#          BR         NDA      ID1       ID2
     4.85209350E-03    2     1000022        22   # BR(~chi_20 -> ~chi_10 gam)
#           BR         NDA      ID1       ID2       ID3
     1.17097344E-01    3     1000022        -2         2   # BR(~chi_20 -> ~chi_10 ub      u)
     1.51803425E-01    3     1000022        -1         1   # BR(~chi_20 -> ~chi_10 db      d)
     1.17097344E-01    3     1000022        -4         4   # BR(~chi_20 -> ~chi_10 cb      c)
     1.51803425E-01    3     1000022        -3         3   # BR(~chi_20 -> ~chi_10 sb      s)
     1.43484096E-01    3     1000022        -5         5   # BR(~chi_20 -> ~chi_10 bb      b)
     3.47597051E-02    3     1000022       -11        11   # BR(~chi_20 -> ~chi_10 e+      e-)
     3.47597051E-02    3     1000022       -13        13   # BR(~chi_20 -> ~chi_10 mu+     mu-)
     3.44818387E-02    3     1000022       -15        15   # BR(~chi_20 -> ~chi_10 tau+    tau-)
     6.94729841E-02    3     1000022       -12        12   # BR(~chi_20 -> ~chi_10 nu_eb   nu_e)
     6.94729841E-02    3     1000022       -14        14   # BR(~chi_20 -> ~chi_10 nu_mub  nu_mu)
     6.94729643E-02    3     1000022       -16        16   # BR(~chi_20 -> ~chi_10 nu_taub nu_tau)
     2.44830487E-04    3     1000024        -2         1   # BR(~chi_20 -> ~chi_1+ ub      d)
     2.44830487E-04    3    -1000024        -1         2   # BR(~chi_20 -> ~chi_1- db      u)
     2.44830487E-04    3     1000024        -4         3   # BR(~chi_20 -> ~chi_1+ cb      s)
     2.44830487E-04    3    -1000024        -3         4   # BR(~chi_20 -> ~chi_1- sb      c)
     8.16102264E-05    3     1000024       -12        11   # BR(~chi_20 -> ~chi_1+ nu_eb   e-)
     8.16102264E-05    3    -1000024        12       -11   # BR(~chi_20 -> ~chi_1- nu_e    e+)
     8.16102264E-05    3     1000024       -14        13   # BR(~chi_20 -> ~chi_1+ nu_mub  mu-)
     8.16102264E-05    3    -1000024        14       -13   # BR(~chi_20 -> ~chi_1- nu_mu   mu+)
     6.81640924E-05    3     1000024       -16        15   # BR(~chi_20 -> ~chi_1+ nu_taub tau-)
     6.81640924E-05    3    -1000024        16       -15   # BR(~chi_20 -> ~chi_1- nu_tau  tau+)
#
#         PDG            Width
DECAY   1000025     1.91637442E-05   # neutralino3 decays
#          BR         NDA      ID1       ID2
     1.86130758E-02    2     1000022        22   # BR(~chi_30 -> ~chi_10 gam)
     4.96459123E-05    2     1000023        22   # BR(~chi_30 -> ~chi_20 gam)
#           BR         NDA      ID1       ID2       ID3
     1.80807054E-02    3     1000022        -2         2   # BR(~chi_30 -> ~chi_10 ub      u)
     2.33228156E-02    3     1000022        -1         1   # BR(~chi_30 -> ~chi_10 db      d)
     1.80807054E-02    3     1000022        -4         4   # BR(~chi_30 -> ~chi_10 cb      c)
     2.33228156E-02    3     1000022        -3         3   # BR(~chi_30 -> ~chi_10 sb      s)
     3.34449754E-02    3     1000022        -5         5   # BR(~chi_30 -> ~chi_10 bb      b)
     5.24807514E-03    3     1000022       -11        11   # BR(~chi_30 -> ~chi_10 e+      e-)
     5.24807514E-03    3     1000022       -13        13   # BR(~chi_30 -> ~chi_10 mu+     mu-)
     5.31454420E-03    3     1000022       -15        15   # BR(~chi_30 -> ~chi_10 tau+    tau-)
     1.07171480E-02    3     1000022       -12        12   # BR(~chi_30 -> ~chi_10 nu_eb   nu_e)
     1.07171480E-02    3     1000022       -14        14   # BR(~chi_30 -> ~chi_10 nu_mub  nu_mu)
     1.07168228E-02    3     1000022       -16        16   # BR(~chi_30 -> ~chi_10 nu_taub nu_tau)
     3.73265571E-03    3     1000023        -2         2   # BR(~chi_30 -> ~chi_20 ub      u)
     4.83910541E-03    3     1000023        -1         1   # BR(~chi_30 -> ~chi_20 db      d)
     3.73265571E-03    3     1000023        -4         4   # BR(~chi_30 -> ~chi_20 cb      c)
     4.83910541E-03    3     1000023        -3         3   # BR(~chi_30 -> ~chi_20 sb      s)
     1.90865715E-03    3     1000023        -5         5   # BR(~chi_30 -> ~chi_20 bb      b)
     1.10812848E-03    3     1000023       -11        11   # BR(~chi_30 -> ~chi_20 e+      e-)
     1.10812848E-03    3     1000023       -13        13   # BR(~chi_30 -> ~chi_20 mu+     mu-)
     1.02826148E-03    3     1000023       -15        15   # BR(~chi_30 -> ~chi_20 tau+    tau-)
     2.21449600E-03    3     1000023       -12        12   # BR(~chi_30 -> ~chi_20 nu_eb   nu_e)
     2.21449600E-03    3     1000023       -14        14   # BR(~chi_30 -> ~chi_20 nu_mub  nu_mu)
     2.21449623E-03    3     1000023       -16        16   # BR(~chi_30 -> ~chi_20 nu_taub nu_tau)
     1.31733046E-01    3     1000024        -2         1   # BR(~chi_30 -> ~chi_1+ ub      d)
     1.31733046E-01    3    -1000024        -1         2   # BR(~chi_30 -> ~chi_1- db      u)
     1.31733046E-01    3     1000024        -4         3   # BR(~chi_30 -> ~chi_1+ cb      s)
     1.31733046E-01    3    -1000024        -3         4   # BR(~chi_30 -> ~chi_1- sb      c)
     4.39106030E-02    3     1000024       -12        11   # BR(~chi_30 -> ~chi_1+ nu_eb   e-)
     4.39106030E-02    3    -1000024        12       -11   # BR(~chi_30 -> ~chi_1- nu_e    e+)
     4.39106030E-02    3     1000024       -14        13   # BR(~chi_30 -> ~chi_1+ nu_mub  mu-)
     4.39106030E-02    3    -1000024        14       -13   # BR(~chi_30 -> ~chi_1- nu_mu   mu+)
     4.28043334E-02    3     1000024       -16        15   # BR(~chi_30 -> ~chi_1+ nu_taub tau-)
     4.28043334E-02    3    -1000024        16       -15   # BR(~chi_30 -> ~chi_1- nu_tau  tau+)
#
#         PDG            Width
DECAY   1000035     6.09681756E+01   # neutralino4 decays
#          BR         NDA      ID1       ID2
     5.19084229E-03    2     1000022        23   # BR(~chi_40 -> ~chi_10   Z )
     4.51999116E-02    2     1000023        23   # BR(~chi_40 -> ~chi_20   Z )
     1.75392519E-02    2     1000025        23   # BR(~chi_40 -> ~chi_30   Z )
     5.48680368E-02    2     1000024       -24   # BR(~chi_40 -> ~chi_1+   W-)
     5.48680368E-02    2    -1000024        24   # BR(~chi_40 -> ~chi_1-   W+)
     8.86258415E-03    2     1000022        25   # BR(~chi_40 -> ~chi_10   h )
     2.16987206E-02    2     1000023        25   # BR(~chi_40 -> ~chi_20   h )
     3.53764044E-02    2     1000025        25   # BR(~chi_40 -> ~chi_30   h )
     1.88248196E-01    2     1000006        -6   # BR(~chi_40 -> ~t_1      tb)
     1.88248196E-01    2    -1000006         6   # BR(~chi_40 -> ~t_1*     t )
     5.89727183E-04    2     2000006        -6   # BR(~chi_40 -> ~t_2      tb)
     5.89727183E-04    2    -2000006         6   # BR(~chi_40 -> ~t_2*     t )
     1.89360182E-01    2     1000005        -5   # BR(~chi_40 -> ~b_1      bb)
     1.89360182E-01    2    -1000005         5   # BR(~chi_40 -> ~b_1*     b )
#
#         PDG            Width
DECAY        25     4.06449502E-03   # h decays
#          BR         NDA      ID1       ID2
     5.59718862E-01    2           5        -5   # BR(h -> b       bb     )
     6.47355247E-02    2         -15        15   # BR(h -> tau+    tau-   )
     2.29106425E-04    2         -13        13   # BR(h -> mu+     mu-    )
     4.85317793E-04    2           3        -3   # BR(h -> s       sb     )
     2.10839069E-02    2           4        -4   # BR(h -> c       cb     )
     6.85337074E-02    2          21        21   # BR(h -> g       g      )
     2.47921384E-03    2          22        22   # BR(h -> gam     gam    )
     1.79830761E-03    2          22        23   # BR(h -> Z       gam    )
     2.48881454E-01    2          24       -24   # BR(h -> W+      W-     )
     3.20545993E-02    2          23        23   # BR(h -> Z       Z      )
#
#         PDG            Width
DECAY        35     2.19259834E+02   # H decays
#          BR         NDA      ID1       ID2
     7.56616095E-01    2           5        -5   # BR(H -> b       bb     )
     9.36295204E-02    2         -15        15   # BR(H -> tau+    tau-   )
     3.30976795E-04    2         -13        13   # BR(H -> mu+     mu-    )
     3.91837164E-04    2           3        -3   # BR(H -> s       sb     )
     2.86692417E-09    2           4        -4   # BR(H -> c       cb     )
     2.89626983E-04    2           6        -6   # BR(H -> t       tb     )
     4.26205191E-06    2          21        21   # BR(H -> g       g      )
     5.33566857E-09    2          22        22   # BR(H -> gam     gam    )
     3.63021341E-09    2          23        22   # BR(H -> Z       gam    )
     5.76290872E-08    2          24       -24   # BR(H -> W+      W-     )
     2.87945827E-08    2          23        23   # BR(H -> Z       Z      )
     2.75821638E-07    2          25        25   # BR(H -> h       h      )
     4.38134731E-04    2     1000024  -1000024   # BR(H -> ~chi_1+ ~chi_1-)
     4.00555669E-02    2     1000024  -1000037   # BR(H -> ~chi_1+ ~chi_2-)
     4.00555669E-02    2     1000037  -1000024   # BR(H -> ~chi_2+ ~chi_1-)
     5.27471682E-03    2     1000022   1000022   # BR(H -> ~chi_10 ~chi_10)
     1.43906504E-04    2     1000023   1000023   # BR(H -> ~chi_20 ~chi_20)
     3.25164133E-03    2     1000025   1000025   # BR(H -> ~chi_30 ~chi_30)
     7.17708248E-03    2     1000022   1000023   # BR(H -> ~chi_10 ~chi_20)
     2.48174730E-03    2     1000022   1000025   # BR(H -> ~chi_10 ~chi_30)
     5.61633721E-03    2     1000022   1000035   # BR(H -> ~chi_10 ~chi_40)
     3.00774832E-03    2     1000023   1000025   # BR(H -> ~chi_20 ~chi_30)
     2.19565659E-02    2     1000023   1000035   # BR(H -> ~chi_20 ~chi_40)
     1.24764896E-02    2     1000025   1000035   # BR(H -> ~chi_30 ~chi_40)
     5.76502860E-04    2     1000006  -1000006   # BR(H -> ~t_1    ~t_1*  )
     3.29447576E-04    2     2000006  -2000006   # BR(H -> ~t_2    ~t_2*  )
     2.94601019E-03    2     1000006  -2000006   # BR(H -> ~t_1    ~t_2*  )
     2.94601019E-03    2     2000006  -1000006   # BR(H -> ~t_2    ~t_1*  )
     3.83317203E-06    2     1000005  -1000005   # BR(H -> ~b_1    ~b_1*  )
#
#         PDG            Width
DECAY        36     2.19263701E+02   # A decays
#          BR         NDA      ID1       ID2
     7.56612615E-01    2           5        -5   # BR(A -> b       bb     )
     9.36282476E-02    2         -15        15   # BR(A -> tau+    tau-   )
     3.30972036E-04    2         -13        13   # BR(A -> mu+     mu-    )
     3.91841716E-04    2           3        -3   # BR(A -> s       sb     )
     2.88625076E-09    2           4        -4   # BR(A -> c       cb     )
     2.90273817E-04    2           6        -6   # BR(A -> t       tb     )
     8.57222216E-06    2          21        21   # BR(A -> g       g      )
     1.37465509E-08    2          22        22   # BR(A -> gam     gam    )
     7.28283624E-09    2          23        22   # BR(A -> Z       gam    )
     5.75044420E-08    2          23        25   # BR(A -> Z       h      )
     4.50693734E-04    2     1000024  -1000024   # BR(A -> ~chi_1+ ~chi_1-)
     4.00488420E-02    2     1000024  -1000037   # BR(A -> ~chi_1+ ~chi_2-)
     4.00488420E-02    2     1000037  -1000024   # BR(A -> ~chi_2+ ~chi_1-)
     5.07353708E-03    2     1000022   1000022   # BR(A -> ~chi_10 ~chi_10)
     1.62570560E-04    2     1000023   1000023   # BR(A -> ~chi_20 ~chi_20)
     3.12537174E-03    2     1000025   1000025   # BR(A -> ~chi_30 ~chi_30)
     7.57221331E-03    2     1000022   1000023   # BR(A -> ~chi_10 ~chi_20)
     2.34988316E-03    2     1000022   1000025   # BR(A -> ~chi_10 ~chi_30)
     6.73883001E-03    2     1000022   1000035   # BR(A -> ~chi_10 ~chi_40)
     3.05645404E-03    2     1000023   1000025   # BR(A -> ~chi_20 ~chi_30)
     1.78574621E-02    2     1000023   1000035   # BR(A -> ~chi_20 ~chi_40)
     1.54457211E-02    2     1000025   1000035   # BR(A -> ~chi_30 ~chi_40)
     3.40348770E-03    2     1000006  -2000006   # BR(A -> ~t_1    ~t_2*  )
     3.40348770E-03    2    -1000006   2000006   # BR(A -> ~t_1*   ~t_2   )
#
#         PDG            Width
DECAY        37     2.24777005E+02   # H+ decays
#          BR         NDA      ID1       ID2
     1.21909101E-03    2           4        -5   # BR(H+ -> c       bb     )
     9.13534005E-02    2         -15        16   # BR(H+ -> tau+    nu_tau )
     3.22930544E-04    2         -13        14   # BR(H+ -> mu+     nu_mu  )
     7.80217731E-06    2           2        -5   # BR(H+ -> u       bb     )
     1.83099591E-05    2           2        -3   # BR(H+ -> u       sb     )
     3.76593911E-04    2           4        -3   # BR(H+ -> c       sb     )
     7.61657501E-01    2           6        -5   # BR(H+ -> t       bb     )
     5.61535241E-08    2          24        25   # BR(H+ -> W+      h      )
     4.49256839E-15    2          24        36   # BR(H+ -> W+      A      )
     1.44006148E-02    2     1000024   1000022   # BR(H+ -> ~chi_1+ ~chi_10)
     6.36486480E-06    2     1000024   1000023   # BR(H+ -> ~chi_1+ ~chi_20)
     6.58600590E-03    2     1000024   1000025   # BR(H+ -> ~chi_1+ ~chi_30)
     3.90571413E-02    2     1000024   1000035   # BR(H+ -> ~chi_1+ ~chi_40)
     1.21329938E-02    2     1000037   1000022   # BR(H+ -> ~chi_2+ ~chi_10)
     3.88869284E-02    2     1000037   1000023   # BR(H+ -> ~chi_2+ ~chi_20)
     2.72891027E-02    2     1000037   1000025   # BR(H+ -> ~chi_2+ ~chi_30)
     3.38316469E-04    2     1000006  -1000005   # BR(H+ -> ~t_1    ~b_1*  )
     6.34684690E-03    2     2000006  -1000005   # BR(H+ -> ~t_2    ~b_1*  )
