#
#                              ======================
#                              | THE SUSYHIT OUTPUT |
#                              ======================
#
#
#              ------------------------------------------------------
#              |     This is the output of the SUSY-HIT package     |
#              |  created by A.Djouadi, M.Muehlleitner and M.Spira. |
#              |  In case of problems with SUSY-HIT email to        |
#              |           margarete.muehlleitner@cern.ch           |
#              |           michael.spira@psi.ch                     |
#              |           abdelhak.djouadi@cern.ch                 |
#              ------------------------------------------------------
#
#              ------------------------------------------------------
#              |  SUSY Les Houches Accord - MSSM Spectrum + Decays  |
#              |              based on the decay programs           |
#              |                                                    |
#              |                     SDECAY 1.3b                    |
#              |                                                    |
#              |  Authors: M.Muhlleitner, A.Djouadi and Y.Mambrini  |
#              |  Ref.:    Comput.Phys.Commun.168(2005)46           |
#              |           [hep-ph/0311167]                         |
#              |                                                    |
#              |                     HDECAY 3.4                     |
#              |                                                    |
#              |  By: A.Djouadi,J.Kalinowski,M.Muhlleitner,M.Spira  |
#              |  Ref.:    Comput.Phys.Commun.108(1998)56           |
#              |           [hep-ph/9704448]                         |
#              |                                                    |
#              |                                                    |
#              |  If not stated otherwise all DRbar couplings and   |
#              |  soft SUSY breaking masses are given at the scale  |
#              |  Q=  0.20904430E+04
#              |                                                    |
#              ------------------------------------------------------
#
#
BLOCK DCINFO  # Decay Program information
     1   SDECAY/HDECAY # decay calculator
     2   1.3b  /3.4    # version number
#
BLOCK SPINFO  # Spectrum calculator information
     1     SOFTSUSY    # spectrum calculator               
     2     3.4.0       # version number                    
#
BLOCK MODSEL  # Model selection
     1     0   #  nonUniversal                                     
#
BLOCK SMINPUTS  # Standard Model inputs
         1     1.27908970E+02   # alpha_em^-1(M_Z)^MSbar
         2     1.16637870E-05   # G_F [GeV^-2]
         3     1.18400000E-01   # alpha_S(M_Z)^MSbar
         4     9.11876000E+01   # M_Z pole mass
         5     4.18000000E+00   # mb(mb)^MSbar
         6     1.73200000E+02   # mt pole mass
         7     1.77700000E+00   # mtau pole mass
#
BLOCK MINPAR  # Input parameters - minimal models
         3     1.72900000E+01   # tanb                
#
BLOCK EXTPAR  # Input parameters - non-minimal models
         0    -1.00000000E+00   # Set                 
         1    -3.07566000E+03   # M_1(MX)             
         2     3.88997000E+03   # M_2(MX)             
         3     2.51199000E+03   # M_3(MX)             
        11    -4.05489000E+03   # At(MX)              
        12    -1.75188000E+03   # Ab(MX)              
        13     3.64965000E+03   # Atau(MX)            
        23    -4.53140000E+02   # mu(MX)              
        26     2.56072000E+03   # mA(pole)            
        31     2.50653000E+03   # meL(MX)             
        32     2.50653000E+03   # mmuL(MX)            
        33     8.38870000E+02   # mtauL(MX)           
        34     2.84072000E+03   # meR(MX)             
        35     2.84072000E+03   # mmuR(MX)            
        36     2.70270000E+03   # mtauR(MX)           
        41     1.02784000E+03   # mqL1(MX)            
        42     1.02784000E+03   # mqL2(MX)            
        43     3.59400000E+03   # mqL3(MX)            
        44     1.31996000E+03   # muR(MX)             
        45     1.31996000E+03   # mcR(MX)             
        46     1.21771000E+03   # mtR(MX)             
        47     3.54392000E+03   # mdR(MX)             
        48     3.54392000E+03   # msR(MX)             
        49     1.04730000E+03   # mbR(MX)             
#
BLOCK MASS  # Mass Spectrum
# PDG code           mass       particle
        24     8.03899680E+01   # W+
        25     1.26289257E+02   # h
        35     2.56074500E+03   # H
        36     2.56071941E+03   # A
        37     2.56234597E+03   # H+
         5     4.81876030E+00   # b-quark pole mass calculated from mb(mb)_Msbar
   1000001     1.12871695E+03   # ~d_L
   2000001     3.59041894E+03   # ~d_R
   1000002     1.12605216E+03   # ~u_L
   2000002     1.41218943E+03   # ~u_R
   1000003     1.12871695E+03   # ~s_L
   2000003     3.59041894E+03   # ~s_R
   1000004     1.12605216E+03   # ~c_L
   2000004     1.41218943E+03   # ~c_R
   1000005     1.15118987E+03   # ~b_1
   2000005     3.62742190E+03   # ~b_2
   1000006     1.30342832E+03   # ~t_1
   2000006     3.63378048E+03   # ~t_2
   1000011     2.51626705E+03   # ~e_L
   2000011     2.85034214E+03   # ~e_R
   1000012     2.51473120E+03   # ~nu_eL
   1000013     2.51626705E+03   # ~mu_L
   2000013     2.85034214E+03   # ~mu_R
   1000014     2.51473120E+03   # ~nu_muL
   1000015     8.28260915E+02   # ~tau_1
   2000015     2.71071774E+03   # ~tau_2
   1000016     8.24322301E+02   # ~nu_tauL
   1000021     2.57691967E+03   # ~g
   1000022     4.70021128E+02   # ~chi_10
   1000023    -4.71228239E+02   # ~chi_20
   1000025    -3.04328719E+03   # ~chi_30
   1000035     3.85396637E+03   # ~chi_40
   1000024     4.71026919E+02   # ~chi_1+
   1000037     3.85413118E+03   # ~chi_2+
#
BLOCK NMIX  # Neutralino Mixing Matrix
  1  1     8.47489303E-03   # N_11
  1  2     1.53042975E-02   # N_12
  1  3     7.07567765E-01   # N_13
  1  4     7.06428915E-01   # N_14
  2  1     1.29961413E-02   # N_21
  2  2     1.35459939E-02   # N_22
  2  3    -7.06637192E-01   # N_23
  2  4     7.07327001E-01   # N_24
  3  1     9.99879622E-01   # N_31
  3  2    -1.73710007E-04   # N_32
  3  3     3.18721336E-03   # N_33
  3  4    -1.51839535E-02   # N_34
  4  1    -1.32086430E-04   # N_41
  4  2     9.99791105E-01   # N_42
  4  3    -1.25643335E-03   # N_43
  4  4    -2.03997445E-02   # N_44
#
BLOCK UMIX  # Chargino Mixing Matrix U
  1  1     1.77918442E-03   # U_11
  1  2     9.99998417E-01   # U_12
  2  1    -9.99998417E-01   # U_21
  2  2     1.77918442E-03   # U_22
#
BLOCK VMIX  # Chargino Mixing Matrix V
  1  1     2.88560820E-02   # V_11
  1  2    -9.99583577E-01   # V_12
  2  1    -9.99583577E-01   # V_21
  2  2    -2.88560820E-02   # V_22
#
BLOCK STOPMIX  # Stop Mixing Matrix
  1  1     5.07950682E-02   # cos(theta_t)
  1  2     9.98709097E-01   # sin(theta_t)
  2  1    -9.98709097E-01   # -sin(theta_t)
  2  2     5.07950682E-02   # cos(theta_t)
#
BLOCK SBOTMIX  # Sbottom Mixing Matrix
  1  1    -1.08251095E-03   # cos(theta_b)
  1  2     9.99999414E-01   # sin(theta_b)
  2  1    -9.99999414E-01   # -sin(theta_b)
  2  2    -1.08251095E-03   # cos(theta_b)
#
BLOCK STAUMIX  # Stau Mixing Matrix
  1  1     9.99995774E-01   # cos(theta_tau)
  1  2    -2.90722929E-03   # sin(theta_tau)
  2  1     2.90722929E-03   # -sin(theta_tau)
  2  2     9.99995774E-01   # cos(theta_tau)
#
BLOCK ALPHA  # Higgs mixing
          -6.03437509E-02   # Mixing angle in the neutral Higgs boson sector
#
BLOCK HMIX Q=  2.09044300E+03  # DRbar Higgs Parameters
         1    -4.58974020E+02   # mu(Q)MSSM           
         2     1.66145700E+01   # tan                 
         3     2.43568134E+02   # higgs               
         4     6.36869405E+06   # mA^2(Q)MSSM         
#
BLOCK GAUGE Q=  2.09044300E+03  # The gauge couplings
     1     3.64107037E-01   # gprime(Q) DRbar
     2     6.36380907E-01   # g(Q) DRbar
     3     1.02411674E+00   # g3(Q) DRbar
#
BLOCK AU Q=  2.09044300E+03  # The trilinear couplings
  1  1     0.00000000E+00   # A_u(Q) DRbar
  2  2     0.00000000E+00   # A_c(Q) DRbar
  3  3    -4.05488999E+03   # A_t(Q) DRbar
#
BLOCK AD Q=  2.09044300E+03  # The trilinear couplings
  1  1     0.00000000E+00   # A_d(Q) DRbar
  2  2     0.00000000E+00   # A_s(Q) DRbar
  3  3    -1.75188000E+03   # A_b(Q) DRbar
#
BLOCK AE Q=  2.09044300E+03  # The trilinear couplings
  1  1     0.00000000E+00   # A_e(Q) DRbar
  2  2     0.00000000E+00   # A_mu(Q) DRbar
  3  3     3.64965000E+03   # A_tau(Q) DRbar
#
BLOCK Yu Q=  2.09044300E+03  # The Yukawa couplings
  1  1     0.00000000E+00   # y_u(Q) DRbar
  2  2     0.00000000E+00   # y_c(Q) DRbar
  3  3     8.23021161E-01   # y_t(Q) DRbar
#
BLOCK Yd Q=  2.09044300E+03  # The Yukawa couplings
  1  1     0.00000000E+00   # y_d(Q) DRbar
  2  2     0.00000000E+00   # y_s(Q) DRbar
  3  3     2.24634262E-01   # y_b(Q) DRbar
#
BLOCK Ye Q=  2.09044300E+03  # The Yukawa couplings
  1  1     0.00000000E+00   # y_e(Q) DRbar
  2  2     0.00000000E+00   # y_mu(Q) DRbar
  3  3     1.66481271E-01   # y_tau(Q) DRbar
#
BLOCK MSOFT Q=  2.09044300E+03  # The soft SUSY breaking masses at the scale Q
         1    -3.07566000E+03   # M_1(Q)              
         2     3.88997000E+03   # M_2(Q)              
         3     2.51199000E+03   # M_3(Q)              
        21     6.29099541E+06   # mH1^2(Q)            
        22    -2.25447664E+05   # mH2^2(Q)            
        31     2.50653000E+03   # meL(Q)              
        32     2.50653000E+03   # mmuL(Q)             
        33     8.38870000E+02   # mtauL(Q)            
        34     2.84072000E+03   # meR(Q)              
        35     2.84072000E+03   # mmuR(Q)             
        36     2.70270000E+03   # mtauR(Q)            
        41     1.02783999E+03   # mqL1(Q)             
        42     1.02783999E+03   # mqL2(Q)             
        43     3.59399999E+03   # mqL3(Q)             
        44     1.31995999E+03   # muR(Q)              
        45     1.31995999E+03   # mcR(Q)              
        46     1.21770997E+03   # mtR(Q)              
        47     3.54392000E+03   # mdR(Q)              
        48     3.54392000E+03   # msR(Q)              
        49     1.04729999E+03   # mbR(Q)              
#
Block HiggsBoundsInputHiggsCouplingsFermions
# ScalarNormEffCoupSq PseudoSNormEffCoupSq NP   IP1 IP2 IP2
    1.00759510E+00    0.00000000E+00        3  25   5   5  # h0-b-b eff. coupling^2, normalised to SM
    2.76036341E+02    0.00000000E+00        3  35   5   5  # H0-b-b eff. coupling^2, normalised to SM
    0.00000000E+00    2.76043936E+02        3  36   5   5  # A0-b-b eff. coupling^2, normalised to SM
#
    9.99972486E-01    0.00000000E+00        3  25   6   6  # h0-t-t eff. coupling^2, normalised to SM
    3.65012582E-03    0.00000000E+00        3  35   6   6  # H0-t-t eff. coupling^2, normalised to SM
    0.00000000E+00    3.62261172E-03        3  36   6   6  # A0-t-t eff. coupling^2, normalised to SM
#
    1.00759510E+00    0.00000000E+00        3  25  15  15  # h0-tau-tau eff. coupling^2, normalised to SM
    2.76036341E+02    0.00000000E+00        3  35  15  15  # H0-tau-tau eff. coupling^2, normalised to SM
    0.00000000E+00    2.76043936E+02        3  36  15  15  # A0-tau-tau eff. coupling^2, normalised to SM
#
Block HiggsBoundsInputHiggsCouplingsBosons
    9.99999948E-01        3  25  24  24  # h0-W-W eff. coupling^2, normalised to SM
    5.20463412E-08        3  35  24  24  # H0-W-W eff. coupling^2, normalised to SM
    0.00000000E+00        3  36  24  24  # A0-W-W eff. coupling^2, normalised to SM
#
    9.99999948E-01        3  25  23  23  # h0-Z-Z eff. coupling^2, normalised to SM
    5.20463412E-08        3  35  23  23  # H0-Z-Z eff. coupling^2, normalised to SM
    0.00000000E+00        3  36  23  23  # A0-Z-Z eff. coupling^2, normalised to SM
#
    8.87292226E-01        3  25  21  21  # h0-g-g eff. coupling^2, normalised to SM
    3.78091051E-14        3  35  21  21  # H0-g-g eff. coupling^2, normalised to SM
    6.13983936E-12        3  36  21  21  # A0-g-g eff. coupling^2, normalised to SM
#
    0.00000000E+00        3  25  25  23  # h0-h0-Z eff. coupling^2, normalised to SM
    0.00000000E+00        3  35  25  23  # H0-h0-Z eff. coupling^2, normalised to SM
    5.20463412E-08        3  36  25  23  # A0-h0-Z eff. coupling^2, normalised to SM
    0.00000000E+00        3  35  35  23  # H0-H0-Z eff. coupling^2, normalised to SM
    9.99999948E-01        3  36  35  23  # A0-H0-Z eff. coupling^2, normalised to SM
    0.00000000E+00        3  36  36  23  # A0-A0-Z eff. coupling^2, normalised to SM
#
    0.00000000E+00        4  25  21  21  23  # h0-g-g-Z eff. coupling^2, normalised to SM
    0.00000000E+00        4  35  21  21  23  # H0-g-g-Z eff. coupling^2, normalised to SM
    0.00000000E+00        4  36  21  21  23  # A0-g-g-Z eff. coupling^2, normalised to SM
#
#
#
#                             =================
#                             |The decay table|
#                             =================
#
# - The QCD corrections to the decays gluino -> squark  + quark
#                                     squark -> gaugino + quark_prime
#                                     squark -> squark_prime + Higgs
#                                     squark -> gluino  + quark
#   are included.
#
# - The multi-body decays for the inos, stops and sbottoms are included.
#
# - The loop induced decays for the gluino, neutralinos and stops
#   are included.
#
# - The SUSY decays of the top quark are included.
#
#
#         PDG            Width
DECAY         6     1.42627901E+00   # top decays
#          BR         NDA      ID1       ID2
     1.00000000E+00    2           5        24   # BR(t ->  b    W+)
#
#         PDG            Width
DECAY   1000021     2.46890182E+02   # gluino decays
#          BR         NDA      ID1       ID2
     6.84338922E-02    2     1000001        -1   # BR(~g -> ~d_L  db)
     6.84338922E-02    2    -1000001         1   # BR(~g -> ~d_L* d )
     6.85872187E-02    2     1000002        -2   # BR(~g -> ~u_L  ub)
     6.85872187E-02    2    -1000002         2   # BR(~g -> ~u_L* u )
     5.12966963E-02    2     2000002        -2   # BR(~g -> ~u_R  ub)
     5.12966963E-02    2    -2000002         2   # BR(~g -> ~u_R* u )
     6.84338922E-02    2     1000003        -3   # BR(~g -> ~s_L  sb)
     6.84338922E-02    2    -1000003         3   # BR(~g -> ~s_L* s )
     6.85872027E-02    2     1000004        -4   # BR(~g -> ~c_L  cb)
     6.85872027E-02    2    -1000004         4   # BR(~g -> ~c_L* c )
     5.12966711E-02    2     2000004        -4   # BR(~g -> ~c_R  cb)
     5.12966711E-02    2    -2000004         4   # BR(~g -> ~c_R* c )
     6.67860738E-02    2     1000005        -5   # BR(~g -> ~b_1  bb)
     6.67860738E-02    2    -1000005         5   # BR(~g -> ~b_1* b )
     5.65783530E-02    2     1000006        -6   # BR(~g -> ~t_1  tb)
     5.65783530E-02    2    -1000006         6   # BR(~g -> ~t_1* t )
#
#         PDG            Width
DECAY   1000006     2.59299325E+01   # stop1 decays
#          BR         NDA      ID1       ID2
     2.41703489E-01    2     1000022         6   # BR(~t_1 -> ~chi_10 t )
     2.46742300E-01    2     1000023         6   # BR(~t_1 -> ~chi_20 t )
     5.11554210E-01    2     1000024         5   # BR(~t_1 -> ~chi_1+ b )
     1.04724634E-09    2     1000005        24   # BR(~t_1 -> ~b_1    W+)
#
#         PDG            Width
DECAY   2000006     1.51048659E+02   # stop2 decays
#          BR         NDA      ID1       ID2
     1.55726066E-01    2     1000022         6   # BR(~t_2 -> ~chi_10 t )
     1.55846560E-01    2     1000023         6   # BR(~t_2 -> ~chi_20 t )
     3.11422091E-04    2     1000025         6   # BR(~t_2 -> ~chi_30 t )
     2.35379022E-02    2     1000024         5   # BR(~t_2 -> ~chi_1+ b )
     3.20176619E-01    2     1000021         6   # BR(~t_2 -> ~g      t )
     1.70837692E-01    2     1000006        25   # BR(~t_2 -> ~t_1    h )
     1.73395562E-01    2     1000006        23   # BR(~t_2 -> ~t_1    Z )
     1.68176819E-04    2     1000005        24   # BR(~t_2 -> ~b_1    W+)
#
#         PDG            Width
DECAY   1000005     1.55007680E+00   # sbottom1 decays
#          BR         NDA      ID1       ID2
     2.59194727E-01    2     1000022         5   # BR(~b_1 -> ~chi_10 b )
     2.57969765E-01    2     1000023         5   # BR(~b_1 -> ~chi_20 b )
     4.82835507E-01    2    -1000024         6   # BR(~b_1 -> ~chi_1- t )
#
#         PDG            Width
DECAY   2000005     1.50698295E+02   # sbottom2 decays
#          BR         NDA      ID1       ID2
     1.17120982E-02    2     1000022         5   # BR(~b_2 -> ~chi_10 b )
     1.16743689E-02    2     1000023         5   # BR(~b_2 -> ~chi_20 b )
     3.09867414E-04    2     1000025         5   # BR(~b_2 -> ~chi_30 b )
     3.11778699E-01    2    -1000024         6   # BR(~b_2 -> ~chi_1- t )
     3.28607859E-01    2     1000021         5   # BR(~b_2 -> ~g      b )
     1.02339931E-04    2     1000005        25   # BR(~b_2 -> ~b_1    h )
     8.65646700E-05    2     1000005        23   # BR(~b_2 -> ~b_1    Z )
     3.35728203E-01    2     1000006       -24   # BR(~b_2 -> ~t_1    W-)
#
#         PDG            Width
DECAY   1000002     6.98093951E-03   # sup_L decays
#          BR         NDA      ID1       ID2
     1.29850628E-01    2     1000022         2   # BR(~u_L -> ~chi_10 u)
     1.16211210E-01    2     1000023         2   # BR(~u_L -> ~chi_20 u)
     7.53938163E-01    2     1000024         1   # BR(~u_L -> ~chi_1+ d)
#
#         PDG            Width
DECAY   2000002     9.52948925E-04   # sup_R decays
#           BR         NDA      ID1       ID2
     1.99521120E-01    2     1000022         2   # BR(~u_R -> ~chi_10 u)
     4.68593527E-01    2     1000023         2   # BR(~u_R -> ~chi_20 u)
#           BR         NDA      ID1       ID2       ID3
     4.49656838E-02    3        2       -1        1000001   # BR(~u_R -> u  db  ~d_L)
     1.09974414E-02    3        2       1        -1000001   # BR(~u_R -> u  d  ~d_L*)
     4.65901150E-02    3        2       -2        1000002   # BR(~u_R -> u  ub  ~u_L)
     1.11621932E-02    3        2       2        -1000002   # BR(~u_R -> u  u  ~u_L*)
     4.47054390E-02    3        2       -3        1000003   # BR(~u_R -> u  sb  ~s_L)
     1.08883065E-02    3        2       3        -1000003   # BR(~u_R -> u  s  ~s_L*)
     4.60454898E-02    3        2       -4        1000004   # BR(~u_R -> u  cb  ~c_L)
     1.12639825E-02    3        2       4        -1000004   # BR(~u_R -> u  c  ~c_L*)
     7.51887096E-03    3        2       -5        1000005   # BR(~u_R -> u  bb  ~b_1)
     3.02482108E-02    3        2       5        -1000005   # BR(~u_R -> u  b  ~b_1*)
     1.89516978E-03    3        2       -15        1000015   # BR(~u_R -> u  tau+  ~tau_1-)
     2.52573872E-04    3        2       15        -1000015   # BR(~u_R -> u  tau-  ~tau_1+)
     1.96610747E-03    3        2       -16        1000016   # BR(~u_R -> u  nu_taub  ~nu_tau1)
     2.64966981E-04    3        2       16        -1000016   # BR(~u_R -> u  nu_tau  ~nu_tau1*)
     1.26491564E-02    3        2       23        1000022   # BR(~u_R -> u  Z  ~chi_10)
     3.25557847E-03    3        2       25        1000022   # BR(~u_R -> u  h  ~chi_10)
     4.85639878E-03    3        2       23        1000023   # BR(~u_R -> u  Z  ~chi_20)
     1.08022578E-02    3        2       25        1000023   # BR(~u_R -> u  h  ~chi_20)
     3.34813327E-03    3        2       -24        1000024   # BR(~u_R -> u  W-  ~chi_1+)
     2.82092768E-02    3        2       24        -1000024   # BR(~u_R -> u  W+  ~chi_1-)
#
#         PDG            Width
DECAY   1000001     1.00442869E-03   # sdown_L decays
#          BR         NDA      ID1       ID2
     5.93092122E-01    2     1000022         1   # BR(~d_L -> ~chi_10 d)
     3.86902890E-01    2     1000023         1   # BR(~d_L -> ~chi_20 d)
     2.00049883E-02    2    -1000024         2   # BR(~d_L -> ~chi_1- u)
#
#         PDG            Width
DECAY   2000001     6.58872115E+01   # sdown_R decays
#          BR         NDA      ID1       ID2
     2.11855776E-06    2     1000022         1   # BR(~d_R -> ~chi_10 d)
     4.98110578E-06    2     1000023         1   # BR(~d_R -> ~chi_20 d)
     2.51016570E-03    2     1000025         1   # BR(~d_R -> ~chi_30 d)
     9.97482735E-01    2     1000021         1   # BR(~d_R -> ~g      d)
#
#         PDG            Width
DECAY   1000004     6.82019090E-03   # scharm_L decays
#          BR         NDA      ID1       ID2
     1.29851263E-01    2     1000022         4   # BR(~c_L -> ~chi_10 c)
     1.16210359E-01    2     1000023         4   # BR(~c_L -> ~chi_20 c)
     7.53938377E-01    2     1000024         3   # BR(~c_L -> ~chi_1+ s)
#
#         PDG            Width
DECAY   2000004     9.45685107E-04   # scharm_R decays
#           BR         NDA      ID1       ID2
     1.98825189E-01    2     1000022         4   # BR(~c_R -> ~chi_10 c)
     4.66955093E-01    2     1000023         4   # BR(~c_R -> ~chi_20 c)
#           BR         NDA      ID1       ID2       ID3
     4.52952042E-02    3        4       -1        1000001   # BR(~c_R -> c  db  ~d_L)
     1.07932333E-02    3        4       1        -1000001   # BR(~c_R -> c  d  ~d_L*)
     4.68115652E-02    3        4       -2        1000002   # BR(~c_R -> c  ub  ~u_L)
     1.16222619E-02    3        4       2        -1000002   # BR(~c_R -> c  u  ~u_L*)
     4.50350753E-02    3        4       -3        1000003   # BR(~c_R -> c  sb  ~s_L)
     1.09613654E-02    3        4       3        -1000003   # BR(~c_R -> c  s  ~s_L*)
     4.64160847E-02    3        4       -4        1000004   # BR(~c_R -> c  cb  ~c_L)
     1.12585045E-02    3        4       4        -1000004   # BR(~c_R -> c  c  ~c_L*)
     7.53316294E-03    3        4       -5        1000005   # BR(~c_R -> c  bb  ~b_1)
     3.04498821E-02    3        4       5        -1000005   # BR(~c_R -> c  b  ~b_1*)
     1.91120700E-03    3        4       -15        1000015   # BR(~c_R -> c  tau+  ~tau_1-)
     2.59261776E-04    3        4       15        -1000015   # BR(~c_R -> c  tau-  ~tau_1+)
     1.97190374E-03    3        4       -16        1000016   # BR(~c_R -> c  nu_taub  ~nu_tau1)
     2.71263656E-04    3        4       16        -1000016   # BR(~c_R -> c  nu_tau  ~nu_tau1*)
     1.27029599E-02    3        4       23        1000022   # BR(~c_R -> c  Z  ~chi_10)
     3.28143055E-03    3        4       25        1000022   # BR(~c_R -> c  h  ~chi_10)
     4.90913938E-03    3        4       23        1000023   # BR(~c_R -> c  Z  ~chi_20)
     1.08852301E-02    3        4       25        1000023   # BR(~c_R -> c  h  ~chi_20)
     3.37427329E-03    3        4       -24        1000024   # BR(~c_R -> c  W-  ~chi_1+)
     2.84767094E-02    3        4       24        -1000024   # BR(~c_R -> c  W+  ~chi_1-)
#
#         PDG            Width
DECAY   1000003     9.81428300E-04   # sstrange_L decays
#          BR         NDA      ID1       ID2
     5.93095067E-01    2     1000022         3   # BR(~s_L -> ~chi_10 s)
     3.86900117E-01    2     1000023         3   # BR(~s_L -> ~chi_20 s)
     2.00048163E-02    2    -1000024         4   # BR(~s_L -> ~chi_1- c)
#
#         PDG            Width
DECAY   2000003     4.71355706E+01   # sstrange_R decays
#          BR         NDA      ID1       ID2
     3.09760629E-06    2     1000022         3   # BR(~s_R -> ~chi_10 s)
     7.28297337E-06    2     1000023         3   # BR(~s_R -> ~chi_20 s)
     3.53820796E-03    2     1000025         3   # BR(~s_R -> ~chi_30 s)
     9.96451411E-01    2     1000021         3   # BR(~s_R -> ~g      s)
#
#         PDG            Width
DECAY   1000011     8.04941976E-03   # selectron_L decays
#          BR         NDA      ID1       ID2
     4.76395970E-01    2     1000022        11   # BR(~e_L -> ~chi_10 e-)
     5.16180403E-01    2     1000023        11   # BR(~e_L -> ~chi_20 e-)
     7.42362677E-03    2    -1000024        12   # BR(~e_L -> ~chi_1- nu_e)
#
#         PDG            Width
DECAY   2000011     2.09117558E-02   # selectron_R decays
#           BR         NDA      ID1       ID2
     4.88705827E-02    2     1000022        11   # BR(~e_R -> ~chi_10 e-)
     1.14890215E-01    2     1000023        11   # BR(~e_R -> ~chi_20 e-)
#           BR         NDA      ID1       ID2       ID3
     8.68219779E-03    3        11       -1        1000001   # BR(~e_R- -> e-  db  ~d_L)
     4.39097515E-03    3        11       1        -1000001   # BR(~e_R- -> e-  d  ~d_L*)
     8.71854099E-03    3        11       -2        1000002   # BR(~e_R- -> e-  ub  ~u_L)
     4.33799060E-03    3        11       2        -1000002   # BR(~e_R- -> e-  u  ~u_L*)
     4.41407221E-02    3        11       -2        2000002   # BR(~e_R- -> e-  ub  ~u_R)
     7.77744354E-02    3        11       2        -2000002   # BR(~e_R- -> e-  u  ~u_R*)
     8.56360421E-03    3        11       -3        1000003   # BR(~e_R- -> e-  sb  ~s_L)
     4.34282042E-03    3        11       3        -1000003   # BR(~e_R- -> e-  s  ~s_L*)
     8.67502479E-03    3        11       -4        1000004   # BR(~e_R- -> e-  cb  ~c_L)
     4.30112138E-03    3        11       4        -1000004   # BR(~e_R- -> e-  c  ~c_L*)
     4.29150956E-02    3        11       -4        2000004   # BR(~e_R- -> e-  cb  ~c_R)
     7.67893436E-02    3        11       4        -2000004   # BR(~e_R- -> e-  c  ~c_R*)
     1.69354503E-02    3        11       -5        1000005   # BR(~e_R- -> e-  bb  ~b_1)
     3.28872433E-02    3        11       5        -1000005   # BR(~e_R- -> e-  b  ~b_1*)
     5.12056477E-02    3        11       -6        1000006   # BR(~e_R- -> e-  tb  ~t_1)
     9.13074932E-02    3        11       6        -1000006   # BR(~e_R- -> e-  t  ~t_1*)
     5.74365927E-05    3        11       -11        1000011   # BR(~e_R- -> e-  e+  ~e_L-)
     4.55772346E-05    3        11       11        -1000011   # BR(~e_R- -> e-  e-  ~e_L+)
     5.91342024E-05    3        11       -12        1000012   # BR(~e_R- -> e-  nu_eb  ~nu_eL)
     4.63571787E-05    3        11       12        -1000012   # BR(~e_R- -> e-  nu_e  ~nu_eL*)
     5.76230907E-05    3        11       -13        1000013   # BR(~e_R- -> e-  mu+  ~mu_L-)
     4.53300053E-05    3        11       13        -1000013   # BR(~e_R- -> e-  mu-  ~mu_L+)
     5.91724584E-05    3        11       -14        1000014   # BR(~e_R- -> e-  nu_mub  ~nu_muL)
     4.63485711E-05    3        11       14        -1000014   # BR(~e_R- -> e-  nu_mu  ~nu_muL*)
     4.10434212E-02    3        11       -15        1000015   # BR(~e_R- -> e-  tau+  ~tau_1-)
     1.89161543E-02    3        11       15        -1000015   # BR(~e_R- -> e-  tau-  ~tau_1+)
     4.36606093E-06    3        11       -15        2000015   # BR(~e_R- -> e-  tau+  ~tau_2-)
     5.30371534E-06    3        11       15        -2000015   # BR(~e_R- -> e-  tau-  ~tau_2+)
     4.20428590E-02    3        11       -16        1000016   # BR(~e_R- -> e-  nu_taub  ~nu_tau1)
     1.88932007E-02    3        11       16        -1000016   # BR(~e_R- -> e-  nu_tau  ~nu_tau1*)
     4.31398496E-02    3        11       23        1000022   # BR(~e_R- -> e-  Z  ~chi_10)
     1.31433249E-02    3        11       25        1000022   # BR(~e_R- -> e-  h  ~chi_10)
     1.41135925E-02    3        11       23        1000023   # BR(~e_R- -> e-  Z  ~chi_20)
     4.11041525E-02    3        11       25        1000023   # BR(~e_R- -> e-  h  ~chi_20)
     3.31368636E-02    3        11       -24        1000024   # BR(~e_R- -> e-  W-  ~chi_1+)
     8.43114283E-02    3        11       24        -1000024   # BR(~e_R- -> e-  W+  ~chi_1-)
#
#         PDG            Width
DECAY   1000013     8.04941973E-03   # smuon_L decays
#          BR         NDA      ID1       ID2
     4.76395970E-01    2     1000022        13   # BR(~mu_L -> ~chi_10 mu-)
     5.16180403E-01    2     1000023        13   # BR(~mu_L -> ~chi_20 mu-)
     7.42362680E-03    2    -1000024        14   # BR(~mu_L -> ~chi_1- nu_mu)
#
#         PDG            Width
DECAY   2000013     2.09130234E-02   # smuon_R decays
#           BR         NDA      ID1       ID2
     4.88676204E-02    2     1000022        13   # BR(~mu_R -> ~chi_10 mu-)
     1.14883251E-01    2     1000023        13   # BR(~mu_R -> ~chi_20 mu-)
#           BR         NDA      ID1       ID2       ID3
     8.68119336E-03    3        13       -1        1000001   # BR(~mu_R- -> mu-  db  ~d_L)
     4.39051773E-03    3        13       1        -1000001   # BR(~mu_R- -> mu-  d  ~d_L*)
     8.71801253E-03    3        13       -2        1000002   # BR(~mu_R- -> mu-  ub  ~u_L)
     4.33873182E-03    3        13       2        -1000002   # BR(~mu_R- -> mu-  u  ~u_L*)
     4.41452191E-02    3        13       -2        2000002   # BR(~mu_R- -> mu-  ub  ~u_R)
     7.77792846E-02    3        13       2        -2000002   # BR(~mu_R- -> mu-  u  ~u_R*)
     8.56212880E-03    3        13       -3        1000003   # BR(~mu_R- -> mu-  sb  ~s_L)
     4.34279627E-03    3        13       3        -1000003   # BR(~mu_R- -> mu-  s  ~s_L*)
     8.67497714E-03    3        13       -4        1000004   # BR(~mu_R- -> mu-  cb  ~c_L)
     4.30138666E-03    3        13       4        -1000004   # BR(~mu_R- -> mu-  c  ~c_L*)
     4.29297086E-02    3        13       -4        2000004   # BR(~mu_R- -> mu-  cb  ~c_R)
     7.67846891E-02    3        13       4        -2000004   # BR(~mu_R- -> mu-  c  ~c_R*)
     1.69363364E-02    3        13       -5        1000005   # BR(~mu_R- -> mu-  bb  ~b_1)
     3.28866844E-02    3        13       5        -1000005   # BR(~mu_R- -> mu-  b  ~b_1*)
     5.12025439E-02    3        13       -6        1000006   # BR(~mu_R- -> mu-  tb  ~t_1)
     9.13210856E-02    3        13       6        -1000006   # BR(~mu_R- -> mu-  t  ~t_1*)
     5.71796807E-05    3        13       -11        1000011   # BR(~mu_R- -> mu-  e+  ~e_L-)
     4.52584010E-05    3        13       11        -1000011   # BR(~mu_R- -> mu-  e-  ~e_L+)
     5.91162730E-05    3        13       -12        1000012   # BR(~mu_R- -> mu-  nu_eb  ~nu_eL)
     4.63787555E-05    3        13       12        -1000012   # BR(~mu_R- -> mu-  nu_e  ~nu_eL*)
     5.76148162E-05    3        13       -13        1000013   # BR(~mu_R- -> mu-  mu+  ~mu_L-)
     4.56500230E-05    3        13       13        -1000013   # BR(~mu_R- -> mu-  mu-  ~mu_L+)
     5.91688718E-05    3        13       -14        1000014   # BR(~mu_R- -> mu-  nu_mub  ~nu_muL)
     4.63825809E-05    3        13       14        -1000014   # BR(~mu_R- -> mu-  nu_mu  ~nu_muL*)
     4.10485841E-02    3        13       -15        1000015   # BR(~mu_R- -> mu-  tau+  ~tau_1-)
     1.89159641E-02    3        13       15        -1000015   # BR(~mu_R- -> mu-  tau-  ~tau_1+)
     4.34446987E-06    3        13       -15        2000015   # BR(~mu_R- -> mu-  tau+  ~tau_2-)
     5.27231275E-06    3        13       15        -2000015   # BR(~mu_R- -> mu-  tau-  ~tau_2+)
     4.20422233E-02    3        13       -16        1000016   # BR(~mu_R- -> mu-  nu_taub  ~nu_tau1)
     1.88958809E-02    3        13       16        -1000016   # BR(~mu_R- -> mu-  nu_tau  ~nu_tau1*)
     4.31372348E-02    3        13       23        1000022   # BR(~mu_R- -> mu-  Z  ~chi_10)
     1.31425282E-02    3        13       25        1000022   # BR(~mu_R- -> mu-  h  ~chi_10)
     1.41127370E-02    3        13       23        1000023   # BR(~mu_R- -> mu-  Z  ~chi_20)
     4.11021392E-02    3        13       25        1000023   # BR(~mu_R- -> mu-  h  ~chi_20)
     3.31334206E-02    3        13       -24        1000024   # BR(~mu_R- -> mu-  W-  ~chi_1+)
     8.42967545E-02    3        13       24        -1000024   # BR(~mu_R- -> mu-  W+  ~chi_1-)
#
#         PDG            Width
DECAY   1000015     2.10840846E-01   # stau_1 decays
#          BR         NDA      ID1       ID2
     5.01801599E-01    2     1000022        15   # BR(~tau_1 -> ~chi_10  tau-)
     4.98104947E-01    2     1000023        15   # BR(~tau_1 -> ~chi_20  tau-)
     9.34540144E-05    2    -1000024        16   # BR(~tau_1 -> ~chi_1-  nu_tau)
#
#         PDG            Width
DECAY   2000015     2.97535664E+00   # stau_2 decays
#          BR         NDA      ID1       ID2
     2.36871936E-01    2     1000022        15   # BR(~tau_2 -> ~chi_10  tau-)
     2.36698850E-01    2     1000023        15   # BR(~tau_2 -> ~chi_20  tau-)
     4.72447499E-01    2    -1000024        16   # BR(~tau_2 -> ~chi_1-  nu_tau)
     2.62698418E-02    2     1000016       -24   # BR(~tau_2 -> ~nu_tauL W-)
     1.42150989E-02    2     1000015        25   # BR(~tau_2 -> ~tau_1   h)
     1.34967742E-02    2     1000015        23   # BR(~tau_2 -> ~tau_1   Z)
#
#         PDG            Width
DECAY   1000012     1.70910979E-02   # snu_eL decays
#          BR         NDA      ID1       ID2
     6.03459614E-02    2     1000022        12   # BR(~nu_eL -> ~chi_10 nu_e)
     2.06025684E-02    2     1000023        12   # BR(~nu_eL -> ~chi_20 nu_e)
     9.19051470E-01    2     1000024        11   # BR(~nu_eL -> ~chi_1+ e-)
#
#         PDG            Width
DECAY   1000014     1.70910979E-02   # snu_muL decays
#          BR         NDA      ID1       ID2
     6.03459617E-02    2     1000022        14   # BR(~nu_muL -> ~chi_10 nu_mu)
     2.06025685E-02    2     1000023        14   # BR(~nu_muL -> ~chi_20 nu_mu)
     9.19051470E-01    2     1000024        13   # BR(~nu_muL -> ~chi_1+ mu-)
#
#         PDG            Width
DECAY   1000016     2.09058496E-01   # snu_tauL decays
#          BR         NDA      ID1       ID2
     7.90857195E-04    2     1000022        16   # BR(~nu_tauL -> ~chi_10 nu_tau)
     2.68768437E-04    2     1000023        16   # BR(~nu_tauL -> ~chi_20 nu_tau)
     9.98940374E-01    2     1000024        15   # BR(~nu_tauL -> ~chi_1+ tau-)
#
#         PDG            Width
DECAY   1000024     6.77002575E-13   # chargino1+ decays
#           BR         NDA      ID1       ID2       ID3
     6.00000672E-01    3     1000022         2        -1   # BR(~chi_1+ -> ~chi_10 u    db)
     1.99999664E-01    3     1000022       -11        12   # BR(~chi_1+ -> ~chi_10 e+   nu_e)
     1.99999664E-01    3     1000022       -13        14   # BR(~chi_1+ -> ~chi_10 mu+  nu_mu)
#
#         PDG            Width
DECAY   1000037     2.38088123E+02   # chargino2+ decays
#          BR         NDA      ID1       ID2
     1.57107004E-01    2     1000002        -1   # BR(~chi_2+ -> ~u_L     db)
     1.57100214E-01    2    -1000001         2   # BR(~chi_2+ -> ~d_L*    u )
     1.57107003E-01    2     1000004        -3   # BR(~chi_2+ -> ~c_L     sb)
     1.57100209E-01    2    -1000003         4   # BR(~chi_2+ -> ~s_L*     c )
     2.79778516E-05    2     1000006        -5   # BR(~chi_2+ -> ~t_1     bb)
     2.41416729E-03    2     2000006        -5   # BR(~chi_2+ -> ~t_2     bb)
     3.31835931E-08    2    -1000005         6   # BR(~chi_2+ -> ~b_1*    t )
     1.58015694E-03    2    -2000005         6   # BR(~chi_2+ -> ~b_2*    t )
     2.14881860E-02    2     1000012       -11   # BR(~chi_2+ -> ~nu_eL   e+  )
     2.14881860E-02    2     1000014       -13   # BR(~chi_2+ -> ~nu_muL mu+ )
     5.93322780E-02    2     1000016       -15   # BR(~chi_2+ -> ~nu_tau1 tau+)
     2.14670829E-02    2    -1000011        12   # BR(~chi_2+ -> ~e_L+    nu_e)
     2.14670829E-02    2    -1000013        14   # BR(~chi_2+ -> ~mu_L+   nu_mu)
     5.93262867E-02    2    -1000015        16   # BR(~chi_2+ -> ~tau_1+  nu_tau)
     1.89417729E-07    2    -2000015        16   # BR(~chi_2+ -> ~tau_2+  nu_tau)
     3.08578219E-02    2     1000024        23   # BR(~chi_2+ -> ~chi_1+  Z )
     2.98838626E-02    2     1000022        24   # BR(~chi_2+ -> ~chi_10  W+)
     2.99653100E-02    2     1000023        24   # BR(~chi_2+ -> ~chi_20  W+)
     3.95412687E-07    2     1000025        24   # BR(~chi_2+ -> ~chi_30  W+)
     3.15564250E-02    2     1000024        25   # BR(~chi_2+ -> ~chi_1+  h )
     1.01895679E-02    2     1000024        35   # BR(~chi_2+ -> ~chi_1+  H )
     1.01891253E-02    2     1000024        36   # BR(~chi_2+ -> ~chi_1+  A )
     1.01898830E-02    2     1000022        37   # BR(~chi_2+ -> ~chi_10  H+)
     1.01615518E-02    2     1000023        37   # BR(~chi_2+ -> ~chi_20  H+)
#
#         PDG            Width
DECAY   1000022     0.00000000E+00   # neutralino1 decays
#
#         PDG            Width
DECAY   1000023     3.47105665E-12   # neutralino2 decays
#          BR         NDA      ID1       ID2
     4.82386957E-01    2     1000022        22   # BR(~chi_20 -> ~chi_10 gam)
#           BR         NDA      ID1       ID2       ID3
     8.64837065E-02    3     1000022        -2         2   # BR(~chi_20 -> ~chi_10 ub      u)
     1.12282153E-01    3     1000022        -1         1   # BR(~chi_20 -> ~chi_10 db      d)
     1.12282153E-01    3     1000022        -3         3   # BR(~chi_20 -> ~chi_10 sb      s)
     2.58084223E-02    3     1000022       -11        11   # BR(~chi_20 -> ~chi_10 e+      e-)
     2.58084223E-02    3     1000022       -13        13   # BR(~chi_20 -> ~chi_10 mu+     mu-)
     5.16074980E-02    3     1000022       -12        12   # BR(~chi_20 -> ~chi_10 nu_eb   nu_e)
     5.16074980E-02    3     1000022       -14        14   # BR(~chi_20 -> ~chi_10 nu_mub  nu_mu)
     5.16075815E-02    3     1000022       -16        16   # BR(~chi_20 -> ~chi_10 nu_taub nu_tau)
     3.76828141E-05    3     1000024        -2         1   # BR(~chi_20 -> ~chi_1+ ub      d)
     3.76828141E-05    3    -1000024        -1         2   # BR(~chi_20 -> ~chi_1- db      u)
     1.25609054E-05    3     1000024       -12        11   # BR(~chi_20 -> ~chi_1+ nu_eb   e-)
     1.25609054E-05    3    -1000024        12       -11   # BR(~chi_20 -> ~chi_1- nu_e    e+)
     1.25609054E-05    3     1000024       -14        13   # BR(~chi_20 -> ~chi_1+ nu_mub  mu-)
     1.25609054E-05    3    -1000024        14       -13   # BR(~chi_20 -> ~chi_1- nu_mu   mu+)
#
#         PDG            Width
DECAY   1000025     6.50087914E+01   # neutralino3 decays
#          BR         NDA      ID1       ID2
     2.18321388E-02    2     1000022        23   # BR(~chi_30 -> ~chi_10   Z )
     9.34608965E-03    2     1000023        23   # BR(~chi_30 -> ~chi_20   Z )
     3.02398267E-02    2     1000024       -24   # BR(~chi_30 -> ~chi_1+   W-)
     3.02398267E-02    2    -1000024        24   # BR(~chi_30 -> ~chi_1-   W+)
     9.42556652E-03    2     1000022        25   # BR(~chi_30 -> ~chi_10   h )
     7.91405701E-06    2     1000022        35   # BR(~chi_30 -> ~chi_10   H )
     5.60260956E-04    2     1000022        36   # BR(~chi_30 -> ~chi_10   A )
     2.24673242E-02    2     1000023        25   # BR(~chi_30 -> ~chi_20   h )
     5.31425182E-04    2     1000023        35   # BR(~chi_30 -> ~chi_20   H )
     6.80620653E-06    2     1000023        36   # BR(~chi_30 -> ~chi_20   A )
     5.02159708E-04    2     1000024       -37   # BR(~chi_30 -> ~chi_1+   H-)
     5.02159708E-04    2    -1000024        37   # BR(~chi_30 -> ~chi_1-   H+)
     7.31631533E-03    2     1000002        -2   # BR(~chi_30 -> ~u_L      ub)
     7.31631533E-03    2    -1000002         2   # BR(~chi_30 -> ~u_L*     u )
     9.71597685E-02    2     2000002        -2   # BR(~chi_30 -> ~u_R      ub)
     9.71597685E-02    2    -2000002         2   # BR(~chi_30 -> ~u_R*     u )
     7.33212937E-03    2     1000001        -1   # BR(~chi_30 -> ~d_L      db)
     7.33212937E-03    2    -1000001         1   # BR(~chi_30 -> ~d_L*     d )
     7.31631455E-03    2     1000004        -4   # BR(~chi_30 -> ~c_L      cb)
     7.31631455E-03    2    -1000004         4   # BR(~chi_30 -> ~c_L*     c )
     9.71597489E-02    2     2000004        -4   # BR(~chi_30 -> ~c_R      cb)
     9.71597489E-02    2    -2000004         4   # BR(~chi_30 -> ~c_R*     c )
     7.33212937E-03    2     1000003        -3   # BR(~chi_30 -> ~s _L      sb)
     7.33212937E-03    2    -1000003         3   # BR(~chi_30 -> ~s _L*     s )
     1.09005996E-01    2     1000006        -6   # BR(~chi_30 -> ~t_1      tb)
     1.09005996E-01    2    -1000006         6   # BR(~chi_30 -> ~t_1*     t )
     3.02129663E-02    2     1000005        -5   # BR(~chi_30 -> ~b_1      bb)
     3.02129663E-02    2    -1000005         5   # BR(~chi_30 -> ~b_1*     b )
     3.08669282E-03    2     1000011       -11   # BR(~chi_30 -> ~e_L-     e+)
     3.08669282E-03    2    -1000011        11   # BR(~chi_30 -> ~e_L+     e-)
     1.86086873E-03    2     2000011       -11   # BR(~chi_30 -> ~e_R-     e+)
     1.86086873E-03    2    -2000011        11   # BR(~chi_30 -> ~e_R+     e-)
     3.08669282E-03    2     1000013       -13   # BR(~chi_30 -> ~mu_L-    mu+)
     3.08669282E-03    2    -1000013        13   # BR(~chi_30 -> ~mu_L+    mu-)
     1.86086873E-03    2     2000013       -13   # BR(~chi_30 -> ~mu_R-    mu+)
     1.86086873E-03    2    -2000013        13   # BR(~chi_30 -> ~mu_R+    mu-)
     2.64417167E-02    2     1000015       -15   # BR(~chi_30 -> ~tau_1-   tau+)
     2.64417167E-02    2    -1000015        15   # BR(~chi_30 -> ~tau_1+   tau-)
     5.26967173E-03    2     2000015       -15   # BR(~chi_30 -> ~tau_2-   tau+)
     5.26967173E-03    2    -2000015        15   # BR(~chi_30 -> ~tau_2+   tau-)
     3.10676559E-03    2     1000012       -12   # BR(~chi_30 -> ~nu_eL    nu_eb)
     3.10676559E-03    2    -1000012        12   # BR(~chi_30 -> ~nu_eL*   nu_e )
     3.10676559E-03    2     1000014       -14   # BR(~chi_30 -> ~nu_muL   nu_mub)
     3.10676559E-03    2    -1000014        14   # BR(~chi_30 -> ~nu_muL*  nu_mu )
     2.65138396E-02    2     1000016       -16   # BR(~chi_30 -> ~nu_tau1  nu_taub)
     2.65138396E-02    2    -1000016        16   # BR(~chi_30 -> ~nu_tau1* nu_tau )
#
#         PDG            Width
DECAY   1000035     2.38066525E+02   # neutralino4 decays
#          BR         NDA      ID1       ID2
     1.35202343E-02    2     1000022        23   # BR(~chi_40 -> ~chi_10   Z )
     1.73297349E-02    2     1000023        23   # BR(~chi_40 -> ~chi_20   Z )
     3.98446688E-07    2     1000025        23   # BR(~chi_40 -> ~chi_30   Z )
     2.99494309E-02    2     1000024       -24   # BR(~chi_40 -> ~chi_1+   W-)
     2.99494309E-02    2    -1000024        24   # BR(~chi_40 -> ~chi_1-   W+)
     1.76946137E-02    2     1000022        25   # BR(~chi_40 -> ~chi_10   h )
     7.75318087E-03    2     1000022        35   # BR(~chi_40 -> ~chi_10   H )
     2.45626140E-03    2     1000022        36   # BR(~chi_40 -> ~chi_10   A )
     1.38262031E-02    2     1000023        25   # BR(~chi_40 -> ~chi_20   h )
     2.44265864E-03    2     1000023        35   # BR(~chi_40 -> ~chi_20   H )
     7.73623160E-03    2     1000023        36   # BR(~chi_40 -> ~chi_20   A )
     7.31000360E-09    2     1000025        25   # BR(~chi_40 -> ~chi_30   h )
     1.01689173E-02    2     1000024       -37   # BR(~chi_40 -> ~chi_1+   H-)
     1.01689173E-02    2    -1000024        37   # BR(~chi_40 -> ~chi_1-   H+)
     7.85846043E-02    2     1000002        -2   # BR(~chi_40 -> ~u_L      ub)
     7.85846043E-02    2    -1000002         2   # BR(~chi_40 -> ~u_L*     u )
     7.16141703E-10    2     2000002        -2   # BR(~chi_40 -> ~u_R      ub)
     7.16141703E-10    2    -2000002         2   # BR(~chi_40 -> ~u_R*     u )
     7.85239319E-02    2     1000001        -1   # BR(~chi_40 -> ~d_L      db)
     7.85239319E-02    2    -1000001         1   # BR(~chi_40 -> ~d_L*     d )
     4.42380648E-12    2     2000001        -1   # BR(~chi_40 -> ~d_R      db)
     4.42380648E-12    2    -2000001         1   # BR(~chi_40 -> ~d_R*     d )
     7.85846014E-02    2     1000004        -4   # BR(~chi_40 -> ~c_L      cb)
     7.85846014E-02    2    -1000004         4   # BR(~chi_40 -> ~c_L*     c )
     7.16141657E-10    2     2000004        -4   # BR(~chi_40 -> ~c_R      cb)
     7.16141657E-10    2    -2000004         4   # BR(~chi_40 -> ~c_R*     c )
     7.85239319E-02    2     1000003        -3   # BR(~chi_40 -> ~s _L      sb)
     7.85239319E-02    2    -1000003         3   # BR(~chi_40 -> ~s _L*     s )
     4.42380648E-12    2     2000003        -3   # BR(~chi_40 -> ~s _R      sb)
     4.42380648E-12    2    -2000003         3   # BR(~chi_40 -> ~s _R*     s )
     1.38873844E-05    2     1000006        -6   # BR(~chi_40 -> ~t_1      tb)
     1.38873844E-05    2    -1000006         6   # BR(~chi_40 -> ~t_1*     t )
     7.14229548E-04    2     2000006        -6   # BR(~chi_40 -> ~t_2      tb)
     7.14229548E-04    2    -2000006         6   # BR(~chi_40 -> ~t_2*     t )
     1.69968496E-08    2     1000005        -5   # BR(~chi_40 -> ~b_1      bb)
     1.69968496E-08    2    -1000005         5   # BR(~chi_40 -> ~b_1*     b )
     1.27301969E-03    2     2000005        -5   # BR(~chi_40 -> ~b_2      bb)
     1.27301969E-03    2    -2000005         5   # BR(~chi_40 -> ~b_2*     b )
     1.07266207E-02    2     1000011       -11   # BR(~chi_40 -> ~e_L-     e+)
     1.07266207E-02    2    -1000011        11   # BR(~chi_40 -> ~e_L+     e-)
     1.52873728E-10    2     2000011       -11   # BR(~chi_40 -> ~e_R-     e+)
     1.52873728E-10    2    -2000011        11   # BR(~chi_40 -> ~e_R+     e-)
     1.07266207E-02    2     1000013       -13   # BR(~chi_40 -> ~mu_L-    mu+)
     1.07266207E-02    2    -1000013        13   # BR(~chi_40 -> ~mu_L+    mu-)
     1.52873728E-10    2     2000013       -13   # BR(~chi_40 -> ~mu_R-    mu+)
     1.52873728E-10    2    -2000013        13   # BR(~chi_40 -> ~mu_R+    mu-)
     2.96475717E-02    2     1000015       -15   # BR(~chi_40 -> ~tau_1-   tau+)
     2.96475717E-02    2    -1000015        15   # BR(~chi_40 -> ~tau_1+   tau-)
     9.48264586E-08    2     2000015       -15   # BR(~chi_40 -> ~tau_2-   tau+)
     9.48264586E-08    2    -2000015        15   # BR(~chi_40 -> ~tau_2+   tau-)
     1.07493320E-02    2     1000012       -12   # BR(~chi_40 -> ~nu_eL    nu_eb)
     1.07493320E-02    2    -1000012        12   # BR(~chi_40 -> ~nu_eL*   nu_e )
     1.07493320E-02    2     1000014       -14   # BR(~chi_40 -> ~nu_muL   nu_mub)
     1.07493320E-02    2    -1000014        14   # BR(~chi_40 -> ~nu_muL*  nu_mu )
     2.96840929E-02    2     1000016       -16   # BR(~chi_40 -> ~nu_tau1  nu_taub)
     2.96840929E-02    2    -1000016        16   # BR(~chi_40 -> ~nu_tau1* nu_tau )
#
#         PDG            Width
DECAY        25     4.16608701E-03   # h decays
#          BR         NDA      ID1       ID2
     5.70968798E-01    2           5        -5   # BR(h -> b       bb     )
     6.32342177E-02    2         -15        15   # BR(h -> tau+    tau-   )
     2.23806553E-04    2         -13        13   # BR(h -> mu+     mu-    )
     2.43835735E-04    2           3        -3   # BR(h -> s       sb     )
     2.09896879E-02    2           4        -4   # BR(h -> c       cb     )
     7.88889465E-02    2          21        21   # BR(h -> g       g      )
     2.36097585E-03    2          22        22   # BR(h -> gam     gam    )
     1.67967138E-03    2          22        23   # BR(h -> Z       gam    )
     2.31884467E-01    2          24       -24   # BR(h -> W+      W-     )
     2.95255942E-02    2          23        23   # BR(h -> Z       Z      )
#
#         PDG            Width
DECAY        35     1.00500630E+01   # H decays
#          BR         NDA      ID1       ID2
     8.08505148E-01    2           5        -5   # BR(H -> b       bb     )
     1.50656143E-01    2         -15        15   # BR(H -> tau+    tau-   )
     5.24109084E-04    2         -13        13   # BR(H -> mu+     mu-    )
     3.49015248E-04    2           3        -3   # BR(H -> s       sb     )
     3.89873443E-07    2           4        -4   # BR(H -> c       cb     )
     3.81526706E-02    2           6        -6   # BR(H -> t       tb     )
     8.05685226E-06    2          21        21   # BR(H -> g       g      )
     3.79724651E-08    2          22        22   # BR(H -> gam     gam    )
     1.87942801E-08    2          23        22   # BR(H -> Z       gam    )
     2.78951080E-05    2          24       -24   # BR(H -> W+      W-     )
     1.39099272E-05    2          23        23   # BR(H -> Z       Z      )
     9.32143890E-05    2          25        25   # BR(H -> h       h      )
     1.45256308E-03    2     1000024  -1000024   # BR(H -> ~chi_1+ ~chi_1-)
     1.13094775E-04    2     1000022   1000022   # BR(H -> ~chi_10 ~chi_10)
     3.31141315E-05    2     1000023   1000023   # BR(H -> ~chi_20 ~chi_20)
     4.87189461E-06    2     1000022   1000023   # BR(H -> ~chi_10 ~chi_20)
     8.98216979E-06    2     1000002  -1000002   # BR(H -> ~u_L    ~u_L*  )
     8.98216979E-06    2     1000004  -1000004   # BR(H -> ~c_L    ~c_L*  )
     1.30721586E-05    2     1000001  -1000001   # BR(H -> ~d_L    ~d_L*  )
     1.30721586E-05    2     1000003  -1000003   # BR(H -> ~s_L    ~s_L*  )
     7.47273531E-07    2     1000005  -1000005   # BR(H -> ~b_1    ~b_1*  )
     1.11493864E-05    2     1000015  -1000015   # BR(H -> ~tau_1- ~tau_1+)
     9.74174636E-06    2     1000016  -1000016   # BR(H -> ~nu_tauL ~nu_tauL*)
#
#         PDG            Width
DECAY        36     1.00542415E+01   # A decays
#          BR         NDA      ID1       ID2
     8.08267467E-01    2           5        -5   # BR(A -> b       bb     )
     1.50596392E-01    2         -15        15   # BR(A -> tau+    tau-   )
     5.23900329E-04    2         -13        13   # BR(A -> mu+     mu-    )
     3.48965513E-04    2           3        -3   # BR(A -> s       sb     )
     3.90343543E-07    2           4        -4   # BR(A -> c       cb     )
     3.83142218E-02    2           6        -6   # BR(A -> t       tb     )
     1.02622885E-04    2          21        21   # BR(A -> g       g      )
     8.46488055E-08    2          22        22   # BR(A -> gam     gam    )
     9.35620729E-08    2          23        22   # BR(A -> Z       gam    )
     2.82080750E-05    2          23        25   # BR(A -> Z       h      )
     1.65446884E-03    2     1000024  -1000024   # BR(A -> ~chi_1+ ~chi_1-)
     1.02666820E-04    2     1000022   1000022   # BR(A -> ~chi_10 ~chi_10)
     4.87584286E-05    2     1000023   1000023   # BR(A -> ~chi_20 ~chi_20)
     1.17591168E-05    2     1000022   1000023   # BR(A -> ~chi_10 ~chi_20)
#
#         PDG            Width
DECAY        37     1.00888220E+01   # H+ decays
#          BR         NDA      ID1       ID2
     1.36153776E-03    2           4        -5   # BR(H+ -> c       bb     )
     1.50175538E-01    2         -15        16   # BR(H+ -> tau+    nu_tau )
     5.22436244E-04    2         -13        14   # BR(H+ -> mu+     nu_mu  )
     1.36153498E-05    2           2        -5   # BR(H+ -> u       bb     )
     1.73906764E-05    2           2        -3   # BR(H+ -> u       sb     )
     3.42674290E-04    2           4        -3   # BR(H+ -> c       sb     )
     8.45746654E-01    2           6        -5   # BR(H+ -> t       bb     )
     2.81894460E-05    2          24        25   # BR(H+ -> W+      h      )
     1.48439502E-12    2          24        36   # BR(H+ -> W+      A      )
     3.05306597E-04    2     1000024   1000022   # BR(H+ -> ~chi_1+ ~chi_10)
     4.60797470E-04    2     1000024   1000023   # BR(H+ -> ~chi_1+ ~chi_20)
     2.07264917E-05    2    -1000015   1000016   # BR(H+ -> ~tau_1+ ~nu_tauL)
     2.17389424E-05    2     1000002  -1000001   # BR(H+ -> ~u_L    ~d_L*  )
     2.17389424E-05    2     1000004  -1000003   # BR(H+ -> ~c_L    ~s_L*  )
     9.61656331E-04    2     1000006  -1000005   # BR(H+ -> ~t_1    ~b_1*  )
