#
#                              ======================
#                              | THE SUSYHIT OUTPUT |
#                              ======================
#
#
#              ------------------------------------------------------
#              |     This is the output of the SUSY-HIT package     |
#              |  created by A.Djouadi, M.Muehlleitner and M.Spira. |
#              |  In case of problems with SUSY-HIT email to        |
#              |           margarete.muehlleitner@cern.ch           |
#              |           michael.spira@psi.ch                     |
#              |           abdelhak.djouadi@cern.ch                 |
#              ------------------------------------------------------
#
#              ------------------------------------------------------
#              |  SUSY Les Houches Accord - MSSM Spectrum + Decays  |
#              |              based on the decay programs           |
#              |                                                    |
#              |                     SDECAY 1.3b                    |
#              |                                                    |
#              |  Authors: M.Muhlleitner, A.Djouadi and Y.Mambrini  |
#              |  Ref.:    Comput.Phys.Commun.168(2005)46           |
#              |           [hep-ph/0311167]                         |
#              |                                                    |
#              |                     HDECAY 3.4                     |
#              |                                                    |
#              |  By: A.Djouadi,J.Kalinowski,M.Muhlleitner,M.Spira  |
#              |  Ref.:    Comput.Phys.Commun.108(1998)56           |
#              |           [hep-ph/9704448]                         |
#              |                                                    |
#              |                                                    |
#              |  If not stated otherwise all DRbar couplings and   |
#              |  soft SUSY breaking masses are given at the scale  |
#              |  Q=  0.24078280E+04
#              |                                                    |
#              ------------------------------------------------------
#
#
BLOCK DCINFO  # Decay Program information
     1   SDECAY/HDECAY # decay calculator
     2   1.3b  /3.4    # version number
#
BLOCK SPINFO  # Spectrum calculator information
     1     SOFTSUSY    # spectrum calculator               
     2     3.4.0       # version number                    
#
BLOCK MODSEL  # Model selection
     1     0   #  nonUniversal                                     
#
BLOCK SMINPUTS  # Standard Model inputs
         1     1.27908970E+02   # alpha_em^-1(M_Z)^MSbar
         2     1.16637870E-05   # G_F [GeV^-2]
         3     1.18400000E-01   # alpha_S(M_Z)^MSbar
         4     9.11876000E+01   # M_Z pole mass
         5     4.18000000E+00   # mb(mb)^MSbar
         6     1.73200000E+02   # mt pole mass
         7     1.77700000E+00   # mtau pole mass
#
BLOCK MINPAR  # Input parameters - minimal models
         3     9.91000000E+00   # tanb                
#
BLOCK EXTPAR  # Input parameters - non-minimal models
         0    -1.00000000E+00   # Set                 
         1    -3.60429000E+03   # M_1(MX)             
         2     8.23790000E+02   # M_2(MX)             
         3     2.45727000E+03   # M_3(MX)             
        11     3.24981000E+03   # At(MX)              
        12    -5.78850000E+02   # Ab(MX)              
        13    -3.48655000E+03   # Atau(MX)            
        23     3.19510000E+02   # mu(MX)              
        26     1.40285000E+03   # mA(pole)            
        31     3.36183000E+03   # meL(MX)             
        32     3.36183000E+03   # mmuL(MX)            
        33     1.50367000E+03   # mtauL(MX)           
        34     2.75902000E+03   # meR(MX)             
        35     2.75902000E+03   # mmuR(MX)            
        36     2.71685000E+03   # mtauR(MX)           
        41     3.14078000E+03   # mqL1(MX)            
        42     3.14078000E+03   # mqL2(MX)            
        43     2.56704000E+03   # mqL3(MX)            
        44     3.49582000E+03   # muR(MX)             
        45     3.49582000E+03   # mcR(MX)             
        46     2.25826000E+03   # mtR(MX)             
        47     2.32346000E+03   # mdR(MX)             
        48     2.32346000E+03   # msR(MX)             
        49     2.69340000E+02   # mbR(MX)             
#
BLOCK MASS  # Mass Spectrum
# PDG code           mass       particle
        24     8.03988765E+01   # W+
        25     1.25576269E+02   # h
        35     1.40298084E+03   # H
        36     1.40285000E+03   # A
        37     1.40532999E+03   # H+
         5     4.81876030E+00   # b-quark pole mass calculated from mb(mb)_Msbar
   1000001     3.20761435E+03   # ~d_L
   2000001     2.41097912E+03   # ~d_R
   1000002     3.20679830E+03   # ~u_L
   2000002     3.55207896E+03   # ~u_R
   1000003     3.20761435E+03   # ~s_L
   2000003     2.41097912E+03   # ~s_R
   1000004     3.20679830E+03   # ~c_L
   2000004     3.55207896E+03   # ~c_R
   1000005     5.31902612E+02   # ~b_1
   2000005     2.61418836E+03   # ~b_2
   1000006     2.26969232E+03   # ~t_1
   2000006     2.63804079E+03   # ~t_2
   1000011     3.37040717E+03   # ~e_L
   2000011     2.76668380E+03   # ~e_R
   1000012     3.36916364E+03   # ~nu_eL
   1000013     3.37040717E+03   # ~mu_L
   2000013     2.76668380E+03   # ~mu_R
   1000014     3.36916364E+03   # ~nu_muL
   1000015     1.51275057E+03   # ~tau_1
   2000015     2.72349085E+03   # ~tau_2
   1000016     1.51039423E+03   # ~nu_tauL
   1000021     2.62717466E+03   # ~g
   1000022     3.25340835E+02   # ~chi_10
   1000023    -3.33528825E+02   # ~chi_20
   1000025     8.69293966E+02   # ~chi_30
   1000035    -3.57043436E+03   # ~chi_40
   1000024     3.27286675E+02   # ~chi_1+
   1000037     8.69491875E+02   # ~chi_2+
#
BLOCK NMIX  # Neutralino Mixing Matrix
  1  1    -8.62069151E-03   # N_11
  1  2    -1.13360243E-01   # N_12
  1  3     7.08110345E-01   # N_13
  1  4    -6.96889430E-01   # N_14
  2  1     8.54384997E-03   # N_21
  2  2     4.21082202E-02   # N_22
  2  3     7.04258236E-01   # N_23
  2  4     7.08642532E-01   # N_24
  3  1    -1.12962786E-03   # N_31
  3  2     9.92661224E-01   # N_32
  3  3     5.09907408E-02   # N_33
  3  4    -1.09646531E-01   # N_34
  4  1     9.99925702E-01   # N_41
  4  2    -2.15688252E-04   # N_42
  4  3     1.44935461E-04   # N_43
  4  4    -1.21869695E-02   # N_44
#
BLOCK UMIX  # Chargino Mixing Matrix U
  1  1    -7.22713095E-02   # U_11
  1  2     9.97385010E-01   # U_12
  2  1    -9.97385010E-01   # U_21
  2  2    -7.22713095E-02   # U_22
#
BLOCK VMIX  # Chargino Mixing Matrix V
  1  1    -1.55602528E-01   # V_11
  1  2     9.87819747E-01   # V_12
  2  1    -9.87819747E-01   # V_21
  2  2    -1.55602528E-01   # V_22
#
BLOCK STOPMIX  # Stop Mixing Matrix
  1  1    -2.46750654E-01   # cos(theta_t)
  1  2     9.69079003E-01   # sin(theta_t)
  2  1    -9.69079003E-01   # -sin(theta_t)
  2  2    -2.46750654E-01   # cos(theta_t)
#
BLOCK SBOTMIX  # Sbottom Mixing Matrix
  1  1     1.32067833E-03   # cos(theta_b)
  1  2     9.99999128E-01   # sin(theta_b)
  2  1    -9.99999128E-01   # -sin(theta_b)
  2  2     1.32067833E-03   # cos(theta_b)
#
BLOCK STAUMIX  # Stau Mixing Matrix
  1  1     9.99997410E-01   # cos(theta_tau)
  1  2     2.27595986E-03   # sin(theta_tau)
  2  1    -2.27595986E-03   # -sin(theta_tau)
  2  2     9.99997410E-01   # cos(theta_tau)
#
BLOCK ALPHA  # Higgs mixing
          -1.06708169E-01   # Mixing angle in the neutral Higgs boson sector
#
BLOCK HMIX Q=  2.40782800E+03  # DRbar Higgs Parameters
         1     3.24361722E+02   # mu(Q)MSSM           
         2     9.45211941E+00   # tan                 
         3     2.42074232E+02   # higgs               
         4     1.99513876E+06   # mA^2(Q)MSSM         
#
BLOCK GAUGE Q=  2.40782800E+03  # The gauge couplings
     1     3.64399148E-01   # gprime(Q) DRbar
     2     6.39698649E-01   # g(Q) DRbar
     3     1.01820216E+00   # g3(Q) DRbar
#
BLOCK AU Q=  2.40782800E+03  # The trilinear couplings
  1  1     0.00000000E+00   # A_u(Q) DRbar
  2  2     0.00000000E+00   # A_c(Q) DRbar
  3  3     3.24981001E+03   # A_t(Q) DRbar
#
BLOCK AD Q=  2.40782800E+03  # The trilinear couplings
  1  1     0.00000000E+00   # A_d(Q) DRbar
  2  2     0.00000000E+00   # A_s(Q) DRbar
  3  3    -5.78849997E+02   # A_b(Q) DRbar
#
BLOCK AE Q=  2.40782800E+03  # The trilinear couplings
  1  1     0.00000000E+00   # A_e(Q) DRbar
  2  2     0.00000000E+00   # A_mu(Q) DRbar
  3  3    -3.48655000E+03   # A_tau(Q) DRbar
#
BLOCK Yu Q=  2.40782800E+03  # The Yukawa couplings
  1  1     0.00000000E+00   # y_u(Q) DRbar
  2  2     0.00000000E+00   # y_c(Q) DRbar
  3  3     8.49268493E-01   # y_t(Q) DRbar
#
BLOCK Yd Q=  2.40782800E+03  # The Yukawa couplings
  1  1     0.00000000E+00   # y_d(Q) DRbar
  2  2     0.00000000E+00   # y_s(Q) DRbar
  3  3     1.27099792E-01   # y_b(Q) DRbar
#
BLOCK Ye Q=  2.40782800E+03  # The Yukawa couplings
  1  1     0.00000000E+00   # y_e(Q) DRbar
  2  2     0.00000000E+00   # y_mu(Q) DRbar
  3  3     9.77515155E-02   # y_tau(Q) DRbar
#
BLOCK MSOFT Q=  2.40782800E+03  # The soft SUSY breaking masses at the scale Q
         1    -3.60429000E+03   # M_1(Q)              
         2     8.23790000E+02   # M_2(Q)              
         3     2.45727000E+03   # M_3(Q)              
        21     1.82522131E+06   # mH1^2(Q)            
        22     4.43505768E+04   # mH2^2(Q)            
        31     3.36183000E+03   # meL(Q)              
        32     3.36183000E+03   # mmuL(Q)             
        33     1.50367000E+03   # mtauL(Q)            
        34     2.75902000E+03   # meR(Q)              
        35     2.75902000E+03   # mmuR(Q)             
        36     2.71685000E+03   # mtauR(Q)            
        41     3.14078000E+03   # mqL1(Q)             
        42     3.14078000E+03   # mqL2(Q)             
        43     2.56703999E+03   # mqL3(Q)             
        44     3.49582000E+03   # muR(Q)              
        45     3.49582000E+03   # mcR(Q)              
        46     2.25825999E+03   # mtR(Q)              
        47     2.32345999E+03   # mdR(Q)              
        48     2.32345999E+03   # msR(Q)              
        49     2.69339953E+02   # mbR(Q)              
#
Block HiggsBoundsInputHiggsCouplingsFermions
# ScalarNormEffCoupSq PseudoSNormEffCoupSq NP   IP1 IP2 IP2
    1.02479908E+00    0.00000000E+00        3  25   5   5  # h0-b-b eff. coupling^2, normalised to SM
    8.93177623E+01    0.00000000E+00        3  35   5   5  # H0-b-b eff. coupling^2, normalised to SM
    0.00000000E+00    8.93425613E+01        3  36   5   5  # A0-b-b eff. coupling^2, normalised to SM
#
    9.99722427E-01    0.00000000E+00        3  25   6   6  # h0-t-t eff. coupling^2, normalised to SM
    1.14704466E-02    0.00000000E+00        3  35   6   6  # H0-t-t eff. coupling^2, normalised to SM
    0.00000000E+00    1.11928736E-02        3  36   6   6  # A0-t-t eff. coupling^2, normalised to SM
#
    1.02479908E+00    0.00000000E+00        3  25  15  15  # h0-tau-tau eff. coupling^2, normalised to SM
    8.93177623E+01    0.00000000E+00        3  35  15  15  # H0-tau-tau eff. coupling^2, normalised to SM
    0.00000000E+00    8.93425613E+01        3  36  15  15  # A0-tau-tau eff. coupling^2, normalised to SM
#
Block HiggsBoundsInputHiggsCouplingsBosons
    9.99998300E-01        3  25  24  24  # h0-W-W eff. coupling^2, normalised to SM
    1.70010936E-06        3  35  24  24  # H0-W-W eff. coupling^2, normalised to SM
    0.00000000E+00        3  36  24  24  # A0-W-W eff. coupling^2, normalised to SM
#
    9.99998300E-01        3  25  23  23  # h0-Z-Z eff. coupling^2, normalised to SM
    1.70010936E-06        3  35  23  23  # H0-Z-Z eff. coupling^2, normalised to SM
    0.00000000E+00        3  36  23  23  # A0-Z-Z eff. coupling^2, normalised to SM
#
    8.89170201E-01        3  25  21  21  # h0-g-g eff. coupling^2, normalised to SM
    5.71922065E-09        3  35  21  21  # H0-g-g eff. coupling^2, normalised to SM
    4.48158067E-08        3  36  21  21  # A0-g-g eff. coupling^2, normalised to SM
#
    0.00000000E+00        3  25  25  23  # h0-h0-Z eff. coupling^2, normalised to SM
    0.00000000E+00        3  35  25  23  # H0-h0-Z eff. coupling^2, normalised to SM
    1.70010936E-06        3  36  25  23  # A0-h0-Z eff. coupling^2, normalised to SM
    0.00000000E+00        3  35  35  23  # H0-H0-Z eff. coupling^2, normalised to SM
    9.99998300E-01        3  36  35  23  # A0-H0-Z eff. coupling^2, normalised to SM
    0.00000000E+00        3  36  36  23  # A0-A0-Z eff. coupling^2, normalised to SM
#
    0.00000000E+00        4  25  21  21  23  # h0-g-g-Z eff. coupling^2, normalised to SM
    0.00000000E+00        4  35  21  21  23  # H0-g-g-Z eff. coupling^2, normalised to SM
    0.00000000E+00        4  36  21  21  23  # A0-g-g-Z eff. coupling^2, normalised to SM
#
#
#
#                             =================
#                             |The decay table|
#                             =================
#
# - The QCD corrections to the decays gluino -> squark  + quark
#                                     squark -> gaugino + quark_prime
#                                     squark -> squark_prime + Higgs
#                                     squark -> gluino  + quark
#   are included.
#
# - The multi-body decays for the inos, stops and sbottoms are included.
#
# - The loop induced decays for the gluino, neutralinos and stops
#   are included.
#
# - The SUSY decays of the top quark are included.
#
#
#         PDG            Width
DECAY         6     1.44079087E+00   # top decays
#          BR         NDA      ID1       ID2
     1.00000000E+00    2           5        24   # BR(t ->  b    W+)
#
#         PDG            Width
DECAY   1000021     5.39972556E+01   # gluino decays
#          BR         NDA      ID1       ID2
     1.11428117E-02    2     2000001        -1   # BR(~g -> ~d_R  db)
     1.11428117E-02    2    -2000001         1   # BR(~g -> ~d_R* d )
     1.11428117E-02    2     2000003        -3   # BR(~g -> ~s_R  sb)
     1.11428117E-02    2    -2000003         3   # BR(~g -> ~s_R* s )
     4.42825656E-01    2     1000005        -5   # BR(~g -> ~b_1  bb)
     4.42825656E-01    2    -1000005         5   # BR(~g -> ~b_1* b )
     5.12495773E-05    2     2000005        -5   # BR(~g -> ~b_2  bb)
     5.12495773E-05    2    -2000005         5   # BR(~g -> ~b_2* b )
     3.48374713E-02    2     1000006        -6   # BR(~g -> ~t_1  tb)
     3.48374713E-02    2    -1000006         6   # BR(~g -> ~t_1* t )
#
#         PDG            Width
DECAY   1000006     6.06113097E+01   # stop1 decays
#          BR         NDA      ID1       ID2
     2.40276841E-01    2     1000022         6   # BR(~t_1 -> ~chi_10 t )
     2.48930481E-01    2     1000023         6   # BR(~t_1 -> ~chi_20 t )
     2.22049756E-02    2     1000025         6   # BR(~t_1 -> ~chi_30 t )
     4.44744752E-01    2     1000024         5   # BR(~t_1 -> ~chi_1+ b )
     4.37439240E-02    2     1000037         5   # BR(~t_1 -> ~chi_2+ b )
     8.81858601E-05    2     1000005        37   # BR(~t_1 -> ~b_1    H+)
     1.08413223E-05    2     1000005        24   # BR(~t_1 -> ~b_1    W+)
#
#         PDG            Width
DECAY   2000006     7.46508269E+01   # stop2 decays
#          BR         NDA      ID1       ID2
     2.45296629E-01    2     1000022         6   # BR(~t_2 -> ~chi_10 t )
     2.50123691E-01    2     1000023         6   # BR(~t_2 -> ~chi_20 t )
     1.00320435E-01    2     1000025         6   # BR(~t_2 -> ~chi_30 t )
     7.30278004E-02    2     1000024         5   # BR(~t_2 -> ~chi_1+ b )
     1.87802752E-01    2     1000037         5   # BR(~t_2 -> ~chi_2+ b )
     7.03214861E-02    2     1000006        25   # BR(~t_2 -> ~t_1    h )
     2.48297417E-04    2     1000005        37   # BR(~t_2 -> ~b_1    H+)
     7.26356386E-02    2     1000006        23   # BR(~t_2 -> ~t_1    Z )
     2.23269969E-04    2     1000005        24   # BR(~t_2 -> ~b_1    W+)
#
#         PDG            Width
DECAY   1000005     9.28998658E-02   # sbottom1 decays
#          BR         NDA      ID1       ID2
     3.62085737E-01    2     1000022         5   # BR(~b_1 -> ~chi_10 b )
     3.36048102E-01    2     1000023         5   # BR(~b_1 -> ~chi_20 b )
     3.01866160E-01    2    -1000024         6   # BR(~b_1 -> ~chi_1- t )
#
#         PDG            Width
DECAY   2000005     7.14887878E+01   # sbottom2 decays
#          BR         NDA      ID1       ID2
     7.50125832E-03    2     1000022         5   # BR(~b_2 -> ~chi_10 b )
     5.87838600E-03    2     1000023         5   # BR(~b_2 -> ~chi_20 b )
     1.16112111E-01    2     1000025         5   # BR(~b_2 -> ~chi_30 b )
     4.92162962E-01    2    -1000024         6   # BR(~b_2 -> ~chi_1- t )
     2.46377857E-01    2    -1000037         6   # BR(~b_2 -> ~chi_2- t )
     1.21125708E-04    2     1000005        25   # BR(~b_2 -> ~b_1    h )
     1.59600610E-04    2     1000005        35   # BR(~b_2 -> ~b_1    H )
     1.59872845E-04    2     1000005        36   # BR(~b_2 -> ~b_1    A )
     1.23959650E-04    2     1000005        23   # BR(~b_2 -> ~b_1    Z )
     1.31402866E-01    2     1000006       -24   # BR(~b_2 -> ~t_1    W-)
#
#         PDG            Width
DECAY   1000002     5.74632538E+01   # sup_L decays
#          BR         NDA      ID1       ID2
     2.80257420E-03    2     1000022         2   # BR(~u_L -> ~chi_10 u)
     4.04870851E-04    2     1000023         2   # BR(~u_L -> ~chi_20 u)
     1.83554785E-01    2     1000025         2   # BR(~u_L -> ~chi_30 u)
     1.02599146E-02    2     1000024         1   # BR(~u_L -> ~chi_1+ d)
     3.63668635E-01    2     1000037         1   # BR(~u_L -> ~chi_2+ d)
     4.39309221E-01    2     1000021         2   # BR(~u_L -> ~g      u)
#
#         PDG            Width
DECAY   2000002     5.30617759E+01   # sup_R decays
#          BR         NDA      ID1       ID2
     1.09683391E-05    2     1000022         2   # BR(~u_R -> ~chi_10 u)
     1.07649282E-05    2     1000023         2   # BR(~u_R -> ~chi_20 u)
     1.69786525E-07    2     1000025         2   # BR(~u_R -> ~chi_30 u)
     9.99978097E-01    2     1000021         2   # BR(~u_R -> ~g      u)
#
#         PDG            Width
DECAY   1000001     5.74740787E+01   # sdown_L decays
#          BR         NDA      ID1       ID2
     2.64549033E-03    2     1000022         1   # BR(~d_L -> ~chi_10 d)
     3.47048648E-04    2     1000023         1   # BR(~d_L -> ~chi_20 d)
     1.83741201E-01    2     1000025         1   # BR(~d_L -> ~chi_30 d)
     2.21349071E-03    2    -1000024         2   # BR(~d_L -> ~chi_1- u)
     3.70801601E-01    2    -1000037         2   # BR(~d_L -> ~chi_2- u)
     4.40251169E-01    2     1000021         1   # BR(~d_L -> ~g      d)
#
#         PDG            Width
DECAY   2000001     1.95033562E-01   # sdown_R decays
#           BR         NDA      ID1       ID2
     5.06932717E-04    2     1000022         1   # BR(~d_R -> ~chi_10 d)
     4.97021349E-04    2     1000023         1   # BR(~d_R -> ~chi_20 d)
#           BR         NDA      ID1       ID2       ID3
     2.82833372E-01    3        1       -5        1000005   # BR(~d_R -> d  bb  ~b_1)
     7.15569150E-01    3        1       5        -1000005   # BR(~d_R -> d  b  ~b_1*)
     7.98477957E-06    3        1       -15        1000015   # BR(~d_R -> d  tau+  ~tau_1-)
     2.44721983E-06    3        1       15        -1000015   # BR(~d_R -> d  tau-  ~tau_1+)
     8.18371969E-06    3        1       -16        1000016   # BR(~d_R -> d  nu_taub  ~nu_tau1)
     2.45706428E-06    3        1       16        -1000016   # BR(~d_R -> d  nu_tau  ~nu_tau1*)
     7.28182364E-05    3        1       23        1000022   # BR(~d_R -> d  Z  ~chi_10)
     5.89949745E-05    3        1       25        1000022   # BR(~d_R -> d  h  ~chi_10)
     1.06258635E-06    3        1       35        1000022   # BR(~d_R -> d  H  ~chi_10)
     5.26114578E-06    3        1       36        1000022   # BR(~d_R -> d  A  ~chi_10)
     6.25841003E-05    3        1       23        1000023   # BR(~d_R -> d  Z  ~chi_20)
     7.20235013E-05    3        1       25        1000023   # BR(~d_R -> d  h  ~chi_20)
     5.16680304E-06    3        1       35        1000023   # BR(~d_R -> d  H  ~chi_20)
     1.01756845E-06    3        1       36        1000023   # BR(~d_R -> d  A  ~chi_20)
     4.11462515E-07    3        1       23        1000025   # BR(~d_R -> d  Z  ~chi_30)
     7.55203354E-07    3        1       25        1000025   # BR(~d_R -> d  h  ~chi_30)
     1.67627559E-11    3        1       35        1000025   # BR(~d_R -> d  H  ~chi_30)
     5.04533676E-10    3        1       36        1000025   # BR(~d_R -> d  A  ~chi_30)
     3.52452159E-05    3        1       -24        1000024   # BR(~d_R -> d  W-  ~chi_1+)
     2.42491598E-04    3        1       24        -1000024   # BR(~d_R -> d  W+  ~chi_1-)
     8.89898120E-06    3        1       -37        1000024   # BR(~d_R -> d  H-  ~chi_1+)
     3.36162655E-06    3        1       37        -1000024   # BR(~d_R -> d  H+  ~chi_1-)
     1.90613347E-07    3        1       -24        1000037   # BR(~d_R -> d  W-  ~chi_2+)
     2.16588363E-06    3        1       24        -1000037   # BR(~d_R -> d  W+  ~chi_2-)
     6.39633501E-10    3        1       -37        1000037   # BR(~d_R -> d  H-  ~chi_2+)
     3.40966957E-10    3        1       37        -1000037   # BR(~d_R -> d  H+  ~chi_2-)
#
#         PDG            Width
DECAY   1000004     5.27868873E+01   # scharm_L decays
#          BR         NDA      ID1       ID2
     3.20319928E-03    2     1000022         4   # BR(~c_L -> ~chi_10 c)
     4.62720593E-04    2     1000023         4   # BR(~c_L -> ~chi_20 c)
     2.09082194E-01    2     1000025         4   # BR(~c_L -> ~chi_30 c)
     1.17264068E-02    2     1000024         3   # BR(~c_L -> ~chi_1+ s)
     4.14244647E-01    2     1000037         3   # BR(~c_L -> ~chi_2+ s)
     3.61280832E-01    2     1000021         4   # BR(~c_L -> ~g      c)
#
#         PDG            Width
DECAY   2000004     4.00864162E+01   # scharm_R decays
#          BR         NDA      ID1       ID2
     1.52049315E-05    2     1000022         4   # BR(~c_R -> ~chi_10 c)
     1.49222007E-05    2     1000023         4   # BR(~c_R -> ~chi_20 c)
     2.34662654E-07    2     1000025         4   # BR(~c_R -> ~chi_30 c)
     9.99969638E-01    2     1000021         4   # BR(~c_R -> ~g      c)
#
#         PDG            Width
DECAY   1000003     5.27793516E+01   # sstrange_L decays
#          BR         NDA      ID1       ID2
     3.02464903E-03    2     1000022         3   # BR(~s_L -> ~chi_10 s)
     3.96766184E-04    2     1000023         3   # BR(~s_L -> ~chi_20 s)
     2.09363140E-01    2     1000025         3   # BR(~s_L -> ~chi_30 s)
     2.53069942E-03    2    -1000024         4   # BR(~s_L -> ~chi_1- c)
     4.22507695E-01    2    -1000037         4   # BR(~s_L -> ~chi_2- c)
     3.62177050E-01    2     1000021         3   # BR(~s_L -> ~g      s)
#
#         PDG            Width
DECAY   2000003     1.95057555E-01   # sstrange_R decays
#           BR         NDA      ID1       ID2
     5.19786695E-04    2     1000022         3   # BR(~s_R -> ~chi_10 s)
     5.09596817E-04    2     1000023         3   # BR(~s_R -> ~chi_20 s)
#           BR         NDA      ID1       ID2       ID3
     2.82742187E-01    3        3       -5        1000005   # BR(~s_R -> s  bb  ~b_1)
     7.15634930E-01    3        3       5        -1000005   # BR(~s_R -> s  b  ~b_1*)
     7.98225938E-06    3        3       -15        1000015   # BR(~s_R -> s  tau+  ~tau_1-)
     2.44691879E-06    3        3       15        -1000015   # BR(~s_R -> s  tau-  ~tau_1+)
     8.18271303E-06    3        3       -16        1000016   # BR(~s_R -> s  nu_taub  ~nu_tau1)
     2.46035073E-06    3        3       16        -1000016   # BR(~s_R -> s  nu_tau  ~nu_tau1*)
     7.28092792E-05    3        3       23        1000022   # BR(~s_R -> s  Z  ~chi_10)
     5.89877177E-05    3        3       25        1000022   # BR(~s_R -> s  h  ~chi_10)
     1.04912624E-06    3        3       35        1000022   # BR(~s_R -> s  H  ~chi_10)
     5.28920809E-06    3        3       36        1000022   # BR(~s_R -> s  A  ~chi_10)
     6.25764020E-05    3        3       23        1000023   # BR(~s_R -> s  Z  ~chi_20)
     7.20146419E-05    3        3       25        1000023   # BR(~s_R -> s  h  ~chi_20)
     5.16616749E-06    3        3       35        1000023   # BR(~s_R -> s  H  ~chi_20)
     1.00544683E-06    3        3       36        1000023   # BR(~s_R -> s  A  ~chi_20)
     4.11411901E-07    3        3       23        1000025   # BR(~s_R -> s  Z  ~chi_30)
     7.55110459E-07    3        3       25        1000025   # BR(~s_R -> s  h  ~chi_30)
     1.68504111E-11    3        3       35        1000025   # BR(~s_R -> s  H  ~chi_30)
     5.05035550E-10    3        3       36        1000025   # BR(~s_R -> s  A  ~chi_30)
     3.52829193E-05    3        3       -24        1000024   # BR(~s_R -> s  W-  ~chi_1+)
     2.42461769E-04    3        3       24        -1000024   # BR(~s_R -> s  W+  ~chi_1-)
     8.89788656E-06    3        3       -37        1000024   # BR(~s_R -> s  H-  ~chi_1+)
     3.36121304E-06    3        3       37        -1000024   # BR(~s_R -> s  H+  ~chi_1-)
     1.90589899E-07    3        3       -24        1000037   # BR(~s_R -> s  W-  ~chi_2+)
     2.16623242E-06    3        3       24        -1000037   # BR(~s_R -> s  W+  ~chi_2-)
     6.37606679E-10    3        3       -37        1000037   # BR(~s_R -> s  H-  ~chi_2+)
     3.41181349E-10    3        3       37        -1000037   # BR(~s_R -> s  H+  ~chi_2-)
#
#         PDG            Width
DECAY   1000011     3.59064389E+01   # selectron_L decays
#          BR         NDA      ID1       ID2
     5.24548875E-03    2     1000022        11   # BR(~e_L -> ~chi_10 e-)
     8.26703454E-04    2     1000023        11   # BR(~e_L -> ~chi_20 e-)
     3.27648085E-01    2     1000025        11   # BR(~e_L -> ~chi_30 e-)
     3.91645926E-03    2    -1000024        12   # BR(~e_L -> ~chi_1- nu_e)
     6.62363264E-01    2    -1000037        12   # BR(~e_L -> ~chi_2- nu_e)
#
#         PDG            Width
DECAY   2000011     5.12918381E-03   # selectron_R decays
#           BR         NDA      ID1       ID2
     2.05975558E-01    2     1000022        11   # BR(~e_R -> ~chi_10 e-)
     2.02030868E-01    2     1000023        11   # BR(~e_R -> ~chi_20 e-)
#           BR         NDA      ID1       ID2       ID3
     3.65750199E-05    3        11       -1        2000001   # BR(~e_R- -> e-  db  ~d_R)
     6.83851491E-05    3        11       1        -2000001   # BR(~e_R- -> e-  d  ~d_R*)
     3.59628367E-05    3        11       -3        2000003   # BR(~e_R- -> e-  sb  ~s_R)
     6.90714182E-05    3        11       3        -2000003   # BR(~e_R- -> e-  s  ~s_R*)
     3.29194675E-02    3        11       -5        1000005   # BR(~e_R- -> e-  bb  ~b_1)
     1.36444710E-01    3        11       5        -1000005   # BR(~e_R- -> e-  b  ~b_1*)
     3.13051756E-07    3        11       -5        2000005   # BR(~e_R- -> e-  bb  ~b_2)
     1.76651888E-07    3        11       5        -2000005   # BR(~e_R- -> e-  b  ~b_2*)
     3.07924235E-04    3        11       -6        1000006   # BR(~e_R- -> e-  tb  ~t_1)
     6.29183924E-04    3        11       6        -1000006   # BR(~e_R- -> e-  t  ~t_1*)
     1.26731664E-02    3        11       -15        1000015   # BR(~e_R- -> e-  tau+  ~tau_1-)
     4.76333095E-03    3        11       15        -1000015   # BR(~e_R- -> e-  tau-  ~tau_1+)
     4.39875053E-09    3        11       -15        2000015   # BR(~e_R- -> e-  tau+  ~tau_2-)
     7.61485675E-09    3        11       15        -2000015   # BR(~e_R- -> e-  tau-  ~tau_2+)
     1.26528903E-02    3        11       -16        1000016   # BR(~e_R- -> e-  nu_taub  ~nu_tau1)
     4.75826192E-03    3        11       16        -1000016   # BR(~e_R- -> e-  nu_tau  ~nu_tau1*)
     4.48005001E-02    3        11       23        1000022   # BR(~e_R- -> e-  Z  ~chi_10)
     3.79553565E-02    3        11       25        1000022   # BR(~e_R- -> e-  h  ~chi_10)
     2.17656462E-03    3        11       35        1000022   # BR(~e_R- -> e-  H  ~chi_10)
     8.69729018E-03    3        11       36        1000022   # BR(~e_R- -> e-  A  ~chi_10)
     3.86864669E-02    3        11       23        1000023   # BR(~e_R- -> e-  Z  ~chi_20)
     4.56973290E-02    3        11       25        1000023   # BR(~e_R- -> e-  h  ~chi_20)
     8.68617730E-03    3        11       35        1000023   # BR(~e_R- -> e-  H  ~chi_20)
     2.10072409E-03    3        11       36        1000023   # BR(~e_R- -> e-  A  ~chi_20)
     3.70936209E-04    3        11       23        1000025   # BR(~e_R- -> e-  Z  ~chi_30)
     4.61925345E-04    3        11       25        1000025   # BR(~e_R- -> e-  h  ~chi_30)
     7.51893506E-07    3        11       35        1000025   # BR(~e_R- -> e-  H  ~chi_30)
     1.50466435E-05    3        11       36        1000025   # BR(~e_R- -> e-  A  ~chi_30)
     2.86712283E-02    3        11       -24        1000024   # BR(~e_R- -> e-  W-  ~chi_1+)
     1.45266777E-01    3        11       24        -1000024   # BR(~e_R- -> e-  W+  ~chi_1-)
     1.48510957E-02    3        11       -37        1000024   # BR(~e_R- -> e-  H-  ~chi_1+)
     6.44624978E-03    3        11       37        -1000024   # BR(~e_R- -> e-  H+  ~chi_1-)
     1.45229734E-04    3        11       -24        1000037   # BR(~e_R- -> e-  W-  ~chi_2+)
     1.57350571E-03    3        11       24        -1000037   # BR(~e_R- -> e-  W+  ~chi_2-)
     1.96892924E-05    3        11       -37        1000037   # BR(~e_R- -> e-  H-  ~chi_2+)
     1.12973140E-05    3        11       37        -1000037   # BR(~e_R- -> e-  H+  ~chi_2-)
#
#         PDG            Width
DECAY   1000013     3.59064388E+01   # smuon_L decays
#          BR         NDA      ID1       ID2
     5.24548874E-03    2     1000022        13   # BR(~mu_L -> ~chi_10 mu-)
     8.26703453E-04    2     1000023        13   # BR(~mu_L -> ~chi_20 mu-)
     3.27648084E-01    2     1000025        13   # BR(~mu_L -> ~chi_30 mu-)
     3.91645926E-03    2    -1000024        14   # BR(~mu_L -> ~chi_1- nu_mu)
     6.62363264E-01    2    -1000037        14   # BR(~mu_L -> ~chi_2- nu_mu)
#
#         PDG            Width
DECAY   2000013     5.12898760E-03   # smuon_R decays
#           BR         NDA      ID1       ID2
     2.05983438E-01    2     1000022        13   # BR(~mu_R -> ~chi_10 mu-)
     2.02038597E-01    2     1000023        13   # BR(~mu_R -> ~chi_20 mu-)
#           BR         NDA      ID1       ID2       ID3
     3.65764191E-05    3        13       -1        2000001   # BR(~mu_R- -> mu-  db  ~d_R)
     6.78944905E-05    3        13       1        -2000001   # BR(~mu_R- -> mu-  d  ~d_R*)
     3.60616976E-05    3        13       -3        2000003   # BR(~mu_R- -> mu-  sb  ~s_R)
     6.90740605E-05    3        13       3        -2000003   # BR(~mu_R- -> mu-  s  ~s_R*)
     3.29207269E-02    3        13       -5        1000005   # BR(~mu_R- -> mu-  bb  ~b_1)
     1.36449930E-01    3        13       5        -1000005   # BR(~mu_R- -> mu-  b  ~b_1*)
     3.10509622E-07    3        13       -5        2000005   # BR(~mu_R- -> mu-  bb  ~b_2)
     1.76717136E-07    3        13       5        -2000005   # BR(~mu_R- -> mu-  b  ~b_2*)
     3.11581958E-04    3        13       -6        1000006   # BR(~mu_R- -> mu-  tb  ~t_1)
     6.36733845E-04    3        13       6        -1000006   # BR(~mu_R- -> mu-  t  ~t_1*)
     1.26736513E-02    3        13       -15        1000015   # BR(~mu_R- -> mu-  tau+  ~tau_1-)
     4.76351317E-03    3        13       15        -1000015   # BR(~mu_R- -> mu-  tau-  ~tau_1+)
     4.41354157E-09    3        13       -15        2000015   # BR(~mu_R- -> mu-  tau+  ~tau_2-)
     7.51376353E-09    3        13       15        -2000015   # BR(~mu_R- -> mu-  tau-  ~tau_2+)
     1.26533743E-02    3        13       -16        1000016   # BR(~mu_R- -> mu-  nu_taub  ~nu_tau1)
     4.75844394E-03    3        13       16        -1000016   # BR(~mu_R- -> mu-  nu_tau  ~nu_tau1*)
     4.48256104E-02    3        13       23        1000022   # BR(~mu_R- -> mu-  Z  ~chi_10)
     3.79568084E-02    3        13       25        1000022   # BR(~mu_R- -> mu-  h  ~chi_10)
     2.17664788E-03    3        13       35        1000022   # BR(~mu_R- -> mu-  H  ~chi_10)
     8.69762289E-03    3        13       36        1000022   # BR(~mu_R- -> mu-  A  ~chi_10)
     3.86879469E-02    3        13       23        1000023   # BR(~mu_R- -> mu-  Z  ~chi_20)
     4.56990771E-02    3        13       25        1000023   # BR(~mu_R- -> mu-  h  ~chi_20)
     8.67130191E-03    3        13       35        1000023   # BR(~mu_R- -> mu-  H  ~chi_20)
     2.10080445E-03    3        13       36        1000023   # BR(~mu_R- -> mu-  A  ~chi_20)
     3.70950399E-04    3        13       23        1000025   # BR(~mu_R- -> mu-  Z  ~chi_30)
     4.61943015E-04    3        13       25        1000025   # BR(~mu_R- -> mu-  h  ~chi_30)
     7.39034736E-07    3        13       35        1000025   # BR(~mu_R- -> mu-  H  ~chi_30)
     1.50478040E-05    3        13       36        1000025   # BR(~mu_R- -> mu-  A  ~chi_30)
     2.86723251E-02    3        13       -24        1000024   # BR(~mu_R- -> mu-  W-  ~chi_1+)
     1.45272334E-01    3        13       24        -1000024   # BR(~mu_R- -> mu-  W+  ~chi_1-)
     1.47943426E-02    3        13       -37        1000024   # BR(~mu_R- -> mu-  H-  ~chi_1+)
     6.44649638E-03    3        13       37        -1000024   # BR(~mu_R- -> mu-  H+  ~chi_1-)
     1.45354222E-04    3        13       -24        1000037   # BR(~mu_R- -> mu-  W-  ~chi_2+)
     1.57356590E-03    3        13       24        -1000037   # BR(~mu_R- -> mu-  W+  ~chi_2-)
     1.96900456E-05    3        13       -37        1000037   # BR(~mu_R- -> mu-  H-  ~chi_2+)
     1.12956015E-05    3        13       37        -1000037   # BR(~mu_R- -> mu-  H+  ~chi_2-)
#
#         PDG            Width
DECAY   1000015     8.62199432E+00   # stau_1 decays
#          BR         NDA      ID1       ID2
     2.43363660E-02    2     1000022        15   # BR(~tau_1 -> ~chi_10  tau-)
     1.63780277E-02    2     1000023        15   # BR(~tau_1 -> ~chi_20  tau-)
     3.15329485E-01    2     1000025        15   # BR(~tau_1 -> ~chi_30  tau-)
     6.84368093E-03    2    -1000024        16   # BR(~tau_1 -> ~chi_1-  nu_tau)
     6.37112440E-01    2    -1000037        16   # BR(~tau_1 -> ~chi_2-  nu_tau)
#
#         PDG            Width
DECAY   2000015     1.05123940E+00   # stau_2 decays
#          BR         NDA      ID1       ID2
     2.40169067E-01    2     1000022        15   # BR(~tau_2 -> ~chi_10  tau-)
     2.38233560E-01    2     1000023        15   # BR(~tau_2 -> ~chi_20  tau-)
     1.51429301E-03    2     1000025        15   # BR(~tau_2 -> ~chi_30  tau-)
     4.74845106E-01    2    -1000024        16   # BR(~tau_2 -> ~chi_1-  nu_tau)
     3.01526892E-03    2    -1000037        16   # BR(~tau_2 -> ~chi_2-  nu_tau)
     2.06633887E-02    2     1000016       -24   # BR(~tau_2 -> ~nu_tauL W-)
     1.09878876E-02    2     1000015        25   # BR(~tau_2 -> ~tau_1   h)
     1.05714288E-02    2     1000015        23   # BR(~tau_2 -> ~tau_1   Z)
#
#         PDG            Width
DECAY   1000012     3.59362662E+01   # snu_eL decays
#          BR         NDA      ID1       ID2
     4.40512536E-03    2     1000022        12   # BR(~nu_eL -> ~chi_10 nu_e)
     5.18961819E-04    2     1000023        12   # BR(~nu_eL -> ~chi_20 nu_e)
     3.28070484E-01    2     1000025        12   # BR(~nu_eL -> ~chi_30 nu_e)
     1.81329338E-02    2     1000024        11   # BR(~nu_eL -> ~chi_1+ e-)
     6.48872495E-01    2     1000037        11   # BR(~nu_eL -> ~chi_2+ e-)
#
#         PDG            Width
DECAY   1000014     3.59362661E+01   # snu_muL decays
#          BR         NDA      ID1       ID2
     4.40512537E-03    2     1000022        14   # BR(~nu_muL -> ~chi_10 nu_mu)
     5.18961820E-04    2     1000023        14   # BR(~nu_muL -> ~chi_20 nu_mu)
     3.28070485E-01    2     1000025        14   # BR(~nu_muL -> ~chi_30 nu_mu)
     1.81329338E-02    2     1000024        13   # BR(~nu_muL -> ~chi_1+ mu-)
     6.48872494E-01    2     1000037        13   # BR(~nu_muL -> ~chi_2+ mu-)
#
#         PDG            Width
DECAY   1000016     8.68049639E+00   # snu_tauL decays
#          BR         NDA      ID1       ID2
     7.57507161E-03    2     1000022        16   # BR(~nu_tauL -> ~chi_10 nu_tau)
     8.88840852E-04    2     1000023        16   # BR(~nu_tauL -> ~chi_20 nu_tau)
     3.12530576E-01    2     1000025        16   # BR(~nu_tauL -> ~chi_30 nu_tau)
     6.10058369E-02    2     1000024        15   # BR(~nu_tauL -> ~chi_1+ tau-)
     6.17999674E-01    2     1000037        15   # BR(~nu_tauL -> ~chi_2+ tau-)
#
#         PDG            Width
DECAY   1000024     1.90738332E-11   # chargino1+ decays
#           BR         NDA      ID1       ID2       ID3
     5.99865004E-01    3     1000022         2        -1   # BR(~chi_1+ -> ~chi_10 u    db)
     1.99954633E-01    3     1000022       -11        12   # BR(~chi_1+ -> ~chi_10 e+   nu_e)
     1.99954633E-01    3     1000022       -13        14   # BR(~chi_1+ -> ~chi_10 mu+  nu_mu)
     2.25730535E-04    3     1000022       -15        16   # BR(~chi_1+ -> ~chi_10 tau+ nu_tau)
#
#         PDG            Width
DECAY   1000037     7.39465626E+00   # chargino2+ decays
#          BR         NDA      ID1       ID2
     8.88400257E-05    2    -1000005         6   # BR(~chi_2+ -> ~b_1*    t )
     2.55738198E-01    2     1000024        23   # BR(~chi_2+ -> ~chi_1+  Z )
     2.49750219E-01    2     1000022        24   # BR(~chi_2+ -> ~chi_10  W+)
     2.51792724E-01    2     1000023        24   # BR(~chi_2+ -> ~chi_20  W+)
     2.42630018E-01    2     1000024        25   # BR(~chi_2+ -> ~chi_1+  h )
#
#         PDG            Width
DECAY   1000022     0.00000000E+00   # neutralino1 decays
#
#         PDG            Width
DECAY   1000023     5.22333974E-08   # neutralino2 decays
#          BR         NDA      ID1       ID2
     1.04714927E-02    2     1000022        22   # BR(~chi_20 -> ~chi_10 gam)
#           BR         NDA      ID1       ID2       ID3
     8.05878156E-02    3     1000022        -2         2   # BR(~chi_20 -> ~chi_10 ub      u)
     1.04557141E-01    3     1000022        -1         1   # BR(~chi_20 -> ~chi_10 db      d)
     8.05878156E-02    3     1000022        -4         4   # BR(~chi_20 -> ~chi_10 cb      c)
     1.04557141E-01    3     1000022        -3         3   # BR(~chi_20 -> ~chi_10 sb      s)
     2.39896851E-02    3     1000022       -11        11   # BR(~chi_20 -> ~chi_10 e+      e-)
     2.39896851E-02    3     1000022       -13        13   # BR(~chi_20 -> ~chi_10 mu+     mu-)
     1.76097170E-02    3     1000022       -15        15   # BR(~chi_20 -> ~chi_10 tau+    tau-)
     4.79606659E-02    3     1000022       -12        12   # BR(~chi_20 -> ~chi_10 nu_eb   nu_e)
     4.79606659E-02    3     1000022       -14        14   # BR(~chi_20 -> ~chi_10 nu_mub  nu_mu)
     4.79615736E-02    3     1000022       -16        16   # BR(~chi_20 -> ~chi_10 nu_taub nu_tau)
     7.08229149E-02    3     1000024        -2         1   # BR(~chi_20 -> ~chi_1+ ub      d)
     7.08229149E-02    3    -1000024        -1         2   # BR(~chi_20 -> ~chi_1- db      u)
     7.08229149E-02    3     1000024        -4         3   # BR(~chi_20 -> ~chi_1+ cb      s)
     7.08229149E-02    3    -1000024        -3         4   # BR(~chi_20 -> ~chi_1- sb      c)
     2.36076121E-02    3     1000024       -12        11   # BR(~chi_20 -> ~chi_1+ nu_eb   e-)
     2.36076121E-02    3    -1000024        12       -11   # BR(~chi_20 -> ~chi_1- nu_e    e+)
     2.36076121E-02    3     1000024       -14        13   # BR(~chi_20 -> ~chi_1+ nu_mub  mu-)
     2.36076121E-02    3    -1000024        14       -13   # BR(~chi_20 -> ~chi_1- nu_mu   mu+)
     1.60222471E-02    3     1000024       -16        15   # BR(~chi_20 -> ~chi_1+ nu_taub tau-)
     1.60222471E-02    3    -1000024        16       -15   # BR(~chi_20 -> ~chi_1- nu_tau  tau+)
#
#         PDG            Width
DECAY   1000025     7.38916335E+00   # neutralino3 decays
#          BR         NDA      ID1       ID2
     3.07291869E-02    2     1000022        23   # BR(~chi_30 -> ~chi_10   Z )
     2.22655533E-01    2     1000023        23   # BR(~chi_30 -> ~chi_20   Z )
     2.54716002E-01    2     1000024       -24   # BR(~chi_30 -> ~chi_1+   W-)
     2.54716002E-01    2    -1000024        24   # BR(~chi_30 -> ~chi_1-   W+)
     2.09746549E-01    2     1000022        25   # BR(~chi_30 -> ~chi_10   h )
     2.73414824E-02    2     1000023        25   # BR(~chi_30 -> ~chi_20   h )
     4.76228030E-05    2     1000005        -5   # BR(~chi_30 -> ~b_1      bb)
     4.76228030E-05    2    -1000005         5   # BR(~chi_30 -> ~b_1*     b )
#
#         PDG            Width
DECAY   1000035     5.05120141E+01   # neutralino4 decays
#          BR         NDA      ID1       ID2
     2.00495837E-02    2     1000022        23   # BR(~chi_40 -> ~chi_10   Z )
     2.17350477E-02    2     1000023        23   # BR(~chi_40 -> ~chi_20   Z )
     4.28990236E-04    2     1000025        23   # BR(~chi_40 -> ~chi_30   Z )
     4.04153041E-02    2     1000024       -24   # BR(~chi_40 -> ~chi_1+   W-)
     4.04153041E-02    2    -1000024        24   # BR(~chi_40 -> ~chi_1-   W+)
     6.21040292E-04    2     1000037       -24   # BR(~chi_40 -> ~chi_2+   W-)
     6.21040292E-04    2    -1000037        24   # BR(~chi_40 -> ~chi_2-   W+)
     2.26632512E-02    2     1000022        25   # BR(~chi_40 -> ~chi_10   h )
     1.03760117E-02    2     1000022        35   # BR(~chi_40 -> ~chi_10   H )
     2.44257268E-02    2     1000022        36   # BR(~chi_40 -> ~chi_10   A )
     2.19485406E-02    2     1000023        25   # BR(~chi_40 -> ~chi_20   h )
     2.44011722E-02    2     1000023        35   # BR(~chi_40 -> ~chi_20   H )
     1.01767613E-02    2     1000023        36   # BR(~chi_40 -> ~chi_20   A )
     2.18141944E-04    2     1000025        25   # BR(~chi_40 -> ~chi_30   h )
     2.50701061E-05    2     1000025        35   # BR(~chi_40 -> ~chi_30   H )
     1.77071662E-04    2     1000025        36   # BR(~chi_40 -> ~chi_30   A )
     3.44820645E-02    2     1000024       -37   # BR(~chi_40 -> ~chi_1+   H-)
     3.44820645E-02    2    -1000024        37   # BR(~chi_40 -> ~chi_1-   H+)
     2.02746070E-04    2     1000037       -37   # BR(~chi_40 -> ~chi_2+   H-)
     2.02746070E-04    2    -1000037        37   # BR(~chi_40 -> ~chi_2-   H+)
     5.83371292E-04    2     1000002        -2   # BR(~chi_40 -> ~u_L      ub)
     5.83371292E-04    2    -1000002         2   # BR(~chi_40 -> ~u_L*     u )
     2.99018641E-05    2     2000002        -2   # BR(~chi_40 -> ~u_R      ub)
     2.99018641E-05    2    -2000002         2   # BR(~chi_40 -> ~u_R*     u )
     5.83589341E-04    2     1000001        -1   # BR(~chi_40 -> ~d_L      db)
     5.83589341E-04    2    -1000001         1   # BR(~chi_40 -> ~d_L*     d )
     1.78840050E-02    2     2000001        -1   # BR(~chi_40 -> ~d_R      db)
     1.78840050E-02    2    -2000001         1   # BR(~chi_40 -> ~d_R*     d )
     5.83366262E-04    2     1000004        -4   # BR(~chi_40 -> ~c_L      cb)
     5.83366262E-04    2    -1000004         4   # BR(~chi_40 -> ~c_L*     c )
     2.98027178E-05    2     2000004        -4   # BR(~chi_40 -> ~c_R      cb)
     2.98027178E-05    2    -2000004         4   # BR(~chi_40 -> ~c_R*     c )
     5.83589341E-04    2     1000003        -3   # BR(~chi_40 -> ~s _L      sb)
     5.83589341E-04    2    -1000003         3   # BR(~chi_40 -> ~s _L*     s )
     1.78840050E-02    2     2000003        -3   # BR(~chi_40 -> ~s _R      sb)
     1.78840050E-02    2    -2000003         3   # BR(~chi_40 -> ~s _R*     s )
     7.95353963E-02    2     1000006        -6   # BR(~chi_40 -> ~t_1      tb)
     7.95353963E-02    2    -1000006         6   # BR(~chi_40 -> ~t_1*     t )
     8.04165372E-03    2     2000006        -6   # BR(~chi_40 -> ~t_2      tb)
     8.04165372E-03    2    -2000006         6   # BR(~chi_40 -> ~t_2*     t )
     5.95016727E-02    2     1000005        -5   # BR(~chi_40 -> ~b_1      bb)
     5.95016727E-02    2    -1000005         5   # BR(~chi_40 -> ~b_1*     b )
     3.35616205E-03    2     2000005        -5   # BR(~chi_40 -> ~b_2      bb)
     3.35616205E-03    2    -2000005         5   # BR(~chi_40 -> ~b_2*     b )
     5.53191928E-04    2     1000011       -11   # BR(~chi_40 -> ~e_L-     e+)
     5.53191928E-04    2    -1000011        11   # BR(~chi_40 -> ~e_L+     e-)
     2.98049676E-02    2     2000011       -11   # BR(~chi_40 -> ~e_R-     e+)
     2.98049676E-02    2    -2000011        11   # BR(~chi_40 -> ~e_R+     e-)
     5.53191928E-04    2     1000013       -13   # BR(~chi_40 -> ~mu_L-    mu+)
     5.53191928E-04    2    -1000013        13   # BR(~chi_40 -> ~mu_L+    mu-)
     2.98049676E-02    2     2000013       -13   # BR(~chi_40 -> ~mu_R-    mu+)
     2.98049676E-02    2    -2000013        13   # BR(~chi_40 -> ~mu_R+    mu-)
     3.13988879E-02    2     1000015       -15   # BR(~chi_40 -> ~tau_1-   tau+)
     3.13988879E-02    2    -1000015        15   # BR(~chi_40 -> ~tau_1+   tau-)
     3.26444738E-02    2     2000015       -15   # BR(~chi_40 -> ~tau_2-   tau+)
     3.26444738E-02    2    -2000015        15   # BR(~chi_40 -> ~tau_2+   tau-)
     5.60739495E-04    2     1000012       -12   # BR(~chi_40 -> ~nu_eL    nu_eb)
     5.60739495E-04    2    -1000012        12   # BR(~chi_40 -> ~nu_eL*   nu_e )
     5.60739495E-04    2     1000014       -14   # BR(~chi_40 -> ~nu_muL   nu_mub)
     5.60739495E-04    2    -1000014        14   # BR(~chi_40 -> ~nu_muL*  nu_mu )
     3.14884851E-02    2     1000016       -16   # BR(~chi_40 -> ~nu_tau1  nu_taub)
     3.14884851E-02    2    -1000016        16   # BR(~chi_40 -> ~nu_tau1* nu_tau )
#
#         PDG            Width
DECAY        25     4.21662125E-03   # h decays
#          BR         NDA      ID1       ID2
     5.96533759E-01    2           5        -5   # BR(h -> b       bb     )
     6.31685450E-02    2         -15        15   # BR(h -> tau+    tau-   )
     2.23606423E-04    2         -13        13   # BR(h -> mu+     mu-    )
     2.43750187E-04    2           3        -3   # BR(h -> s       sb     )
     2.06388910E-02    2           4        -4   # BR(h -> c       cb     )
     7.67255397E-02    2          21        21   # BR(h -> g       g      )
     2.28531560E-03    2          22        22   # BR(h -> gam     gam    )
     1.55969098E-03    2          22        23   # BR(h -> Z       gam    )
     2.11894363E-01    2          24       -24   # BR(h -> W+      W-     )
     2.67265390E-02    2          23        23   # BR(h -> Z       Z      )
#
#         PDG            Width
DECAY        35     7.97895553E+00   # H decays
#          BR         NDA      ID1       ID2
     1.90153941E-01    2           5        -5   # BR(H -> b       bb     )
     3.22509877E-02    2         -15        15   # BR(H -> tau+    tau-   )
     1.14673604E-04    2         -13        13   # BR(H -> mu+     mu-    )
     7.87652859E-05    2           3        -3   # BR(H -> s       sb     )
     9.20200448E-07    2           4        -4   # BR(H -> c       cb     )
     8.64089091E-02    2           6        -6   # BR(H -> t       tb     )
     7.26401670E-05    2          21        21   # BR(H -> g       g      )
     9.72537524E-07    2          22        22   # BR(H -> gam     gam    )
     9.52791151E-08    2          23        22   # BR(H -> Z       gam    )
     1.86068989E-04    2          24       -24   # BR(H -> W+      W-     )
     9.24023067E-05    2          23        23   # BR(H -> Z       Z      )
     7.00000684E-04    2          25        25   # BR(H -> h       h      )
     2.22200352E-02    2     1000024  -1000024   # BR(H -> ~chi_1+ ~chi_1-)
     2.20315889E-01    2     1000024  -1000037   # BR(H -> ~chi_1+ ~chi_2-)
     2.20315889E-01    2     1000037  -1000024   # BR(H -> ~chi_2+ ~chi_1-)
     4.86738959E-03    2     1000022   1000022   # BR(H -> ~chi_10 ~chi_10)
     8.61240733E-04    2     1000023   1000023   # BR(H -> ~chi_20 ~chi_20)
     2.42768768E-03    2     1000022   1000023   # BR(H -> ~chi_10 ~chi_20)
     3.82771800E-02    2     1000022   1000025   # BR(H -> ~chi_10 ~chi_30)
     1.80651358E-01    2     1000023   1000025   # BR(H -> ~chi_20 ~chi_30)
     2.95374448E-06    2     1000005  -1000005   # BR(H -> ~b_1    ~b_1*  )
#
#         PDG            Width
DECAY        36     7.97725227E+00   # A decays
#          BR         NDA      ID1       ID2
     1.90294740E-01    2           5        -5   # BR(A -> b       bb     )
     3.22640690E-02    2         -15        15   # BR(A -> tau+    tau-   )
     1.14719293E-04    2         -13        13   # BR(A -> mu+     mu-    )
     7.88606700E-05    2           3        -3   # BR(A -> s       sb     )
     9.06286069E-07    2           4        -4   # BR(A -> c       cb     )
     8.82230370E-02    2           6        -6   # BR(A -> t       tb     )
     2.03190664E-04    2          21        21   # BR(A -> g       g      )
     1.72166177E-06    2          22        22   # BR(A -> gam     gam    )
     1.87661073E-07    2          23        22   # BR(A -> Z       gam    )
     1.86040823E-04    2          23        25   # BR(A -> Z       h      )
     3.45688143E-02    2     1000024  -1000024   # BR(A -> ~chi_1+ ~chi_1-)
     2.13520946E-01    2     1000024  -1000037   # BR(A -> ~chi_1+ ~chi_2-)
     2.13520946E-01    2     1000037  -1000024   # BR(A -> ~chi_2+ ~chi_1-)
     9.45003563E-03    2     1000022   1000022   # BR(A -> ~chi_10 ~chi_10)
     7.24273218E-04    2     1000023   1000023   # BR(A -> ~chi_20 ~chi_20)
     7.75574138E-04    2     1000022   1000023   # BR(A -> ~chi_10 ~chi_20)
     1.79489722E-01    2     1000022   1000025   # BR(A -> ~chi_10 ~chi_30)
     3.65822165E-02    2     1000023   1000025   # BR(A -> ~chi_20 ~chi_30)
#
#         PDG            Width
DECAY        37     7.82184309E+00   # H+ decays
#          BR         NDA      ID1       ID2
     3.13701748E-04    2           4        -5   # BR(H+ -> c       bb     )
     3.29632821E-02    2         -15        16   # BR(H+ -> tau+    nu_tau )
     1.17205439E-04    2         -13        14   # BR(H+ -> mu+     nu_mu  )
     3.13698695E-06    2           2        -5   # BR(H+ -> u       bb     )
     4.01652618E-06    2           2        -3   # BR(H+ -> u       sb     )
     7.99431515E-05    2           4        -3   # BR(H+ -> c       sb     )
     2.72787880E-01    2           6        -5   # BR(H+ -> t       bb     )
     1.91322979E-04    2          24        25   # BR(H+ -> W+      h      )
     1.57535092E-11    2          24        36   # BR(H+ -> W+      A      )
     1.20536994E-03    2     1000024   1000022   # BR(H+ -> ~chi_1+ ~chi_10)
     8.59662886E-03    2     1000024   1000023   # BR(H+ -> ~chi_1+ ~chi_20)
     2.27728917E-01    2     1000024   1000025   # BR(H+ -> ~chi_1+ ~chi_30)
     2.33665664E-01    2     1000037   1000022   # BR(H+ -> ~chi_2+ ~chi_10)
     2.22342931E-01    2     1000037   1000023   # BR(H+ -> ~chi_2+ ~chi_20)
