#
#                              ======================
#                              | THE SUSYHIT OUTPUT |
#                              ======================
#
#
#              ------------------------------------------------------
#              |     This is the output of the SUSY-HIT package     |
#              |  created by A.Djouadi, M.Muehlleitner and M.Spira. |
#              |  In case of problems with SUSY-HIT email to        |
#              |           margarete.muehlleitner@cern.ch           |
#              |           michael.spira@psi.ch                     |
#              |           abdelhak.djouadi@cern.ch                 |
#              ------------------------------------------------------
#
#              ------------------------------------------------------
#              |  SUSY Les Houches Accord - MSSM Spectrum + Decays  |
#              |              based on the decay programs           |
#              |                                                    |
#              |                     SDECAY 1.3b                    |
#              |                                                    |
#              |  Authors: M.Muhlleitner, A.Djouadi and Y.Mambrini  |
#              |  Ref.:    Comput.Phys.Commun.168(2005)46           |
#              |           [hep-ph/0311167]                         |
#              |                                                    |
#              |                     HDECAY 3.4                     |
#              |                                                    |
#              |  By: A.Djouadi,J.Kalinowski,M.Muhlleitner,M.Spira  |
#              |  Ref.:    Comput.Phys.Commun.108(1998)56           |
#              |           [hep-ph/9704448]                         |
#              |                                                    |
#              |                                                    |
#              |  If not stated otherwise all DRbar couplings and   |
#              |  soft SUSY breaking masses are given at the scale  |
#              |  Q=  0.22951560E+04
#              |                                                    |
#              ------------------------------------------------------
#
#
BLOCK DCINFO  # Decay Program information
     1   SDECAY/HDECAY # decay calculator
     2   1.3b  /3.4    # version number
#
BLOCK SPINFO  # Spectrum calculator information
     1     SOFTSUSY    # spectrum calculator               
     2     3.4.0       # version number                    
#
BLOCK MODSEL  # Model selection
     1     0   #  nonUniversal                                     
#
BLOCK SMINPUTS  # Standard Model inputs
         1     1.27908970E+02   # alpha_em^-1(M_Z)^MSbar
         2     1.16637870E-05   # G_F [GeV^-2]
         3     1.18400000E-01   # alpha_S(M_Z)^MSbar
         4     9.11876000E+01   # M_Z pole mass
         5     4.18000000E+00   # mb(mb)^MSbar
         6     1.73200000E+02   # mt pole mass
         7     1.77700000E+00   # mtau pole mass
#
BLOCK MINPAR  # Input parameters - minimal models
         3     5.60000000E+00   # tanb                
#
BLOCK EXTPAR  # Input parameters - non-minimal models
         0    -1.00000000E+00   # Set                 
         1     3.90503000E+03   # M_1(MX)             
         2    -5.36990000E+02   # M_2(MX)             
         3     2.36315000E+03   # M_3(MX)             
        11    -3.97050000E+03   # At(MX)              
        12     2.55714000E+03   # Ab(MX)              
        13    -5.85460000E+02   # Atau(MX)            
        23    -3.95630000E+02   # mu(MX)              
        26     1.96928000E+03   # mA(pole)            
        31     9.75080000E+02   # meL(MX)             
        32     9.75080000E+02   # mmuL(MX)            
        33     9.83250000E+02   # mtauL(MX)           
        34     1.57272000E+03   # meR(MX)             
        35     1.57272000E+03   # mmuR(MX)            
        36     3.82579000E+03   # mtauR(MX)           
        41     6.64810000E+02   # mqL1(MX)            
        42     6.64810000E+02   # mqL2(MX)            
        43     2.23319000E+03   # mqL3(MX)            
        44     3.13378000E+03   # muR(MX)             
        45     3.13378000E+03   # mcR(MX)             
        46     2.36354000E+03   # mtR(MX)             
        47     2.50519000E+03   # mdR(MX)             
        48     2.50519000E+03   # msR(MX)             
        49     8.28650000E+02   # mbR(MX)             
#
BLOCK MASS  # Mass Spectrum
# PDG code           mass       particle
        24     8.03734740E+01   # W+
        25     1.24047473E+02   # h
        35     1.96965001E+03   # H
        36     1.96927996E+03   # A
        37     1.97117341E+03   # H+
         5     4.81876030E+00   # b-quark pole mass calculated from mb(mb)_Msbar
   1000001     8.25568521E+02   # ~d_L
   2000001     2.58123775E+03   # ~d_R
   1000002     8.21991716E+02   # ~u_L
   2000002     3.19129309E+03   # ~u_R
   1000003     8.25568521E+02   # ~s_L
   2000003     2.58123775E+03   # ~s_R
   1000004     8.21991716E+02   # ~c_L
   2000004     3.19129309E+03   # ~c_R
   1000005     9.64677972E+02   # ~b_1
   2000005     2.28320180E+03   # ~b_2
   1000006     2.19837402E+03   # ~t_1
   2000006     2.44377050E+03   # ~t_2
   1000011     9.79658560E+02   # ~e_L
   2000011     1.58006729E+03   # ~e_R
   1000012     9.76394206E+02   # ~nu_eL
   1000013     9.79658560E+02   # ~mu_L
   2000013     1.58006729E+03   # ~mu_R
   1000014     9.76394206E+02   # ~nu_muL
   1000015     9.87738238E+02   # ~tau_1
   2000015     3.83299418E+03   # ~tau_2
   1000016     9.84496986E+02   # ~nu_tauL
   1000021     2.46013987E+03   # ~g
   1000022    -3.84129891E+02   # ~chi_10
   1000023     4.10137091E+02   # ~chi_20
   1000025    -5.73371979E+02   # ~chi_30
   1000035     3.86648973E+03   # ~chi_40
   1000024     3.85799021E+02   # ~chi_1+
   1000037     5.73808305E+02   # ~chi_2+
#
BLOCK NMIX  # Neutralino Mixing Matrix
  1  1     7.75782687E-03   # N_11
  1  2     3.61659328E-01   # N_12
  1  3     6.73071800E-01   # N_13
  1  4    -6.45071081E-01   # N_14
  2  1    -7.16384451E-03   # N_21
  2  2    -4.67243409E-02   # N_22
  2  3     7.04171125E-01   # N_23
  2  4     7.08455038E-01   # N_24
  3  1    -3.16684529E-03   # N_31
  3  2     9.31138727E-01   # N_32
  3  3    -2.26089763E-01   # N_33
  3  4     2.86101486E-01   # N_34
  4  1     9.99939231E-01   # N_41
  4  2    -1.91655719E-04   # N_42
  4  3    -8.93047616E-04   # N_43
  4  4     1.09863183E-02   # N_44
#
BLOCK UMIX  # Chargino Mixing Matrix U
  1  1     3.21618197E-01   # U_11
  1  2     9.46869439E-01   # U_12
  2  1    -9.46869439E-01   # U_21
  2  2     3.21618197E-01   # U_22
#
BLOCK VMIX  # Chargino Mixing Matrix V
  1  1    -4.08214815E-01   # V_11
  1  2    -9.12885899E-01   # V_12
  2  1     9.12885899E-01   # V_21
  2  2    -4.08214815E-01   # V_22
#
BLOCK STOPMIX  # Stop Mixing Matrix
  1  1     8.11858710E-01   # cos(theta_t)
  1  2     5.83853950E-01   # sin(theta_t)
  2  1    -5.83853950E-01   # -sin(theta_t)
  2  2     8.11858710E-01   # cos(theta_t)
#
BLOCK SBOTMIX  # Sbottom Mixing Matrix
  1  1    -2.62144451E-03   # cos(theta_b)
  1  2     9.99996564E-01   # sin(theta_b)
  2  1    -9.99996564E-01   # -sin(theta_b)
  2  2    -2.62144451E-03   # cos(theta_b)
#
BLOCK STAUMIX  # Stau Mixing Matrix
  1  1     9.99999979E-01   # cos(theta_tau)
  1  2    -2.04939014E-04   # sin(theta_tau)
  2  1     2.04939014E-04   # -sin(theta_tau)
  2  2     9.99999979E-01   # cos(theta_tau)
#
BLOCK ALPHA  # Higgs mixing
          -1.85991041E-01   # Mixing angle in the neutral Higgs boson sector
#
BLOCK HMIX Q=  2.29515600E+03  # DRbar Higgs Parameters
         1    -4.00557318E+02   # mu(Q)MSSM           
         2     5.34696342E+00   # tan                 
         3     2.41884353E+02   # higgs               
         4     3.87988893E+06   # mA^2(Q)MSSM         
#
BLOCK GAUGE Q=  2.29515600E+03  # The gauge couplings
     1     3.64454535E-01   # gprime(Q) DRbar
     2     6.42519265E-01   # g(Q) DRbar
     3     1.02398954E+00   # g3(Q) DRbar
#
BLOCK AU Q=  2.29515600E+03  # The trilinear couplings
  1  1     0.00000000E+00   # A_u(Q) DRbar
  2  2     0.00000000E+00   # A_c(Q) DRbar
  3  3    -3.97049999E+03   # A_t(Q) DRbar
#
BLOCK AD Q=  2.29515600E+03  # The trilinear couplings
  1  1     0.00000000E+00   # A_d(Q) DRbar
  2  2     0.00000000E+00   # A_s(Q) DRbar
  3  3     2.55714000E+03   # A_b(Q) DRbar
#
BLOCK AE Q=  2.29515600E+03  # The trilinear couplings
  1  1     0.00000000E+00   # A_e(Q) DRbar
  2  2     0.00000000E+00   # A_mu(Q) DRbar
  3  3    -5.85460000E+02   # A_tau(Q) DRbar
#
BLOCK Yu Q=  2.29515600E+03  # The Yukawa couplings
  1  1     0.00000000E+00   # y_u(Q) DRbar
  2  2     0.00000000E+00   # y_c(Q) DRbar
  3  3     8.36099684E-01   # y_t(Q) DRbar
#
BLOCK Yd Q=  2.29515600E+03  # The Yukawa couplings
  1  1     0.00000000E+00   # y_d(Q) DRbar
  2  2     0.00000000E+00   # y_s(Q) DRbar
  3  3     7.55304345E-02   # y_b(Q) DRbar
#
BLOCK Ye Q=  2.29515600E+03  # The Yukawa couplings
  1  1     0.00000000E+00   # y_e(Q) DRbar
  2  2     0.00000000E+00   # y_mu(Q) DRbar
  3  3     5.58110708E-02   # y_tau(Q) DRbar
#
BLOCK MSOFT Q=  2.29515600E+03  # The soft SUSY breaking masses at the scale Q
         1     3.90503000E+03   # M_1(Q)              
         2    -5.36990000E+02   # M_2(Q)              
         3     2.36315000E+03   # M_3(Q)              
        21     3.58136114E+06   # mH1^2(Q)            
        22     8.76699037E+04   # mH2^2(Q)            
        31     9.75080000E+02   # meL(Q)              
        32     9.75080000E+02   # mmuL(Q)             
        33     9.83250000E+02   # mtauL(Q)            
        34     1.57272000E+03   # meR(Q)              
        35     1.57272000E+03   # mmuR(Q)             
        36     3.82579000E+03   # mtauR(Q)            
        41     6.64809982E+02   # mqL1(Q)             
        42     6.64809982E+02   # mqL2(Q)             
        43     2.23318999E+03   # mqL3(Q)             
        44     3.13378000E+03   # muR(Q)              
        45     3.13378000E+03   # mcR(Q)              
        46     2.36353998E+03   # mtR(Q)              
        47     2.50519000E+03   # mdR(Q)              
        48     2.50519000E+03   # msR(Q)              
        49     8.28649986E+02   # mbR(Q)              
#
Block HiggsBoundsInputHiggsCouplingsFermions
# ScalarNormEffCoupSq PseudoSNormEffCoupSq NP   IP1 IP2 IP2
    1.01184896E+00    0.00000000E+00        3  25   5   5  # h0-b-b eff. coupling^2, normalised to SM
    2.85781689E+01    0.00000000E+00        3  35   5   5  # H0-b-b eff. coupling^2, normalised to SM
    0.00000000E+00    2.85900178E+01        3  36   5   5  # A0-b-b eff. coupling^2, normalised to SM
#
    9.99585556E-01    0.00000000E+00        3  25   6   6  # h0-t-t eff. coupling^2, normalised to SM
    3.53916868E-02    0.00000000E+00        3  35   6   6  # H0-t-t eff. coupling^2, normalised to SM
    0.00000000E+00    3.49772430E-02        3  36   6   6  # A0-t-t eff. coupling^2, normalised to SM
#
    1.01184896E+00    0.00000000E+00        3  25  15  15  # h0-tau-tau eff. coupling^2, normalised to SM
    2.85781689E+01    0.00000000E+00        3  35  15  15  # H0-tau-tau eff. coupling^2, normalised to SM
    0.00000000E+00    2.85900178E+01        3  36  15  15  # A0-tau-tau eff. coupling^2, normalised to SM
#
Block HiggsBoundsInputHiggsCouplingsBosons
    9.99998779E-01        3  25  24  24  # h0-W-W eff. coupling^2, normalised to SM
    1.22071411E-06        3  35  24  24  # H0-W-W eff. coupling^2, normalised to SM
    0.00000000E+00        3  36  24  24  # A0-W-W eff. coupling^2, normalised to SM
#
    9.99998779E-01        3  25  23  23  # h0-Z-Z eff. coupling^2, normalised to SM
    1.22071411E-06        3  35  23  23  # H0-Z-Z eff. coupling^2, normalised to SM
    0.00000000E+00        3  36  23  23  # A0-Z-Z eff. coupling^2, normalised to SM
#
    8.87128728E-01        3  25  21  21  # h0-g-g eff. coupling^2, normalised to SM
    5.37768852E-10        3  35  21  21  # H0-g-g eff. coupling^2, normalised to SM
    1.26993463E-09        3  36  21  21  # A0-g-g eff. coupling^2, normalised to SM
#
    0.00000000E+00        3  25  25  23  # h0-h0-Z eff. coupling^2, normalised to SM
    0.00000000E+00        3  35  25  23  # H0-h0-Z eff. coupling^2, normalised to SM
    1.22071411E-06        3  36  25  23  # A0-h0-Z eff. coupling^2, normalised to SM
    0.00000000E+00        3  35  35  23  # H0-H0-Z eff. coupling^2, normalised to SM
    9.99998779E-01        3  36  35  23  # A0-H0-Z eff. coupling^2, normalised to SM
    0.00000000E+00        3  36  36  23  # A0-A0-Z eff. coupling^2, normalised to SM
#
    0.00000000E+00        4  25  21  21  23  # h0-g-g-Z eff. coupling^2, normalised to SM
    0.00000000E+00        4  35  21  21  23  # H0-g-g-Z eff. coupling^2, normalised to SM
    0.00000000E+00        4  36  21  21  23  # A0-g-g-Z eff. coupling^2, normalised to SM
#
#
#
#                             =================
#                             |The decay table|
#                             =================
#
# - The QCD corrections to the decays gluino -> squark  + quark
#                                     squark -> gaugino + quark_prime
#                                     squark -> squark_prime + Higgs
#                                     squark -> gluino  + quark
#   are included.
#
# - The multi-body decays for the inos, stops and sbottoms are included.
#
# - The loop induced decays for the gluino, neutralinos and stops
#   are included.
#
# - The SUSY decays of the top quark are included.
#
#
#         PDG            Width
DECAY         6     1.45467153E+00   # top decays
#          BR         NDA      ID1       ID2
     1.00000000E+00    2           5        24   # BR(t ->  b    W+)
#
#         PDG            Width
DECAY   1000021     1.87473130E+02   # gluino decays
#          BR         NDA      ID1       ID2
     1.01093276E-01    2     1000001        -1   # BR(~g -> ~d_L  db)
     1.01093276E-01    2    -1000001         1   # BR(~g -> ~d_L* d )
     1.01315245E-01    2     1000002        -2   # BR(~g -> ~u_L  ub)
     1.01315245E-01    2    -1000002         2   # BR(~g -> ~u_L* u )
     1.01093276E-01    2     1000003        -3   # BR(~g -> ~s_L  sb)
     1.01093276E-01    2    -1000003         3   # BR(~g -> ~s_L* s )
     1.01315233E-01    2     1000004        -4   # BR(~g -> ~c_L  cb)
     1.01315233E-01    2    -1000004         4   # BR(~g -> ~c_L* c )
     9.11310290E-02    2     1000005        -5   # BR(~g -> ~b_1  bb)
     9.11310290E-02    2    -1000005         5   # BR(~g -> ~b_1* b )
     2.55190110E-03    2     2000005        -5   # BR(~g -> ~b_2  bb)
     2.55190110E-03    2    -2000005         5   # BR(~g -> ~b_2* b )
     1.50004065E-03    2     1000006        -6   # BR(~g -> ~t_1  tb)
     1.50004065E-03    2    -1000006         6   # BR(~g -> ~t_1* t )
#
#         PDG            Width
DECAY   1000006     5.28264039E+01   # stop1 decays
#          BR         NDA      ID1       ID2
     1.76909423E-01    2     1000022         6   # BR(~t_1 -> ~chi_10 t )
     2.51593258E-01    2     1000023         6   # BR(~t_1 -> ~chi_20 t )
     1.98126593E-01    2     1000025         6   # BR(~t_1 -> ~chi_30 t )
     4.47479782E-02    2     1000024         5   # BR(~t_1 -> ~chi_1+ b )
     3.28320137E-01    2     1000037         5   # BR(~t_1 -> ~chi_2+ b )
     3.02611457E-04    2     1000005        24   # BR(~t_1 -> ~b_1    W+)
#
#         PDG            Width
DECAY   2000006     7.36979400E+01   # stop2 decays
#          BR         NDA      ID1       ID2
     2.33135001E-01    2     1000022         6   # BR(~t_2 -> ~chi_10 t )
     2.28246273E-01    2     1000023         6   # BR(~t_2 -> ~chi_20 t )
     1.31322889E-02    2     1000025         6   # BR(~t_2 -> ~chi_30 t )
     3.75645808E-01    2     1000024         5   # BR(~t_2 -> ~chi_1+ b )
     2.63573273E-03    2     1000037         5   # BR(~t_2 -> ~chi_2+ b )
     9.29303963E-03    2     1000006        25   # BR(~t_2 -> ~t_1    h )
     8.06048059E-02    2     1000006        23   # BR(~t_2 -> ~t_1    Z )
     1.76468676E-04    2     1000005        24   # BR(~t_2 -> ~b_1    W+)
     5.71305827E-02    2     2000005        24   # BR(~t_2 -> ~b_2    W+)
#
#         PDG            Width
DECAY   1000005     1.40997163E-01   # sbottom1 decays
#          BR         NDA      ID1       ID2
     2.53463236E-01    2     1000022         5   # BR(~b_1 -> ~chi_10 b )
     2.58116265E-01    2     1000023         5   # BR(~b_1 -> ~chi_20 b )
     1.45348159E-02    2     1000025         5   # BR(~b_1 -> ~chi_30 b )
     4.49746790E-01    2    -1000024         6   # BR(~b_1 -> ~chi_1- t )
     2.41388925E-02    2    -1000037         6   # BR(~b_1 -> ~chi_2- t )
#
#         PDG            Width
DECAY   2000005     5.45851647E+01   # sbottom2 decays
#          BR         NDA      ID1       ID2
     2.30279404E-02    2     1000022         5   # BR(~b_2 -> ~chi_10 b )
     2.53846121E-03    2     1000023         5   # BR(~b_2 -> ~chi_20 b )
     1.31153209E-01    2     1000025         5   # BR(~b_2 -> ~chi_30 b )
     4.78506576E-01    2    -1000024         6   # BR(~b_2 -> ~chi_1- t )
     3.63068056E-01    2    -1000037         6   # BR(~b_2 -> ~chi_2- t )
     2.78738209E-04    2     1000005        25   # BR(~b_2 -> ~b_1    h )
     2.68854196E-04    2     1000005        23   # BR(~b_2 -> ~b_1    Z )
     1.15816423E-03    2     1000006       -24   # BR(~b_2 -> ~t_1    W-)
#
#         PDG            Width
DECAY   1000002     3.34455156E+00   # sup_L decays
#          BR         NDA      ID1       ID2
     8.43254433E-02    2     1000022         2   # BR(~u_L -> ~chi_10 u)
     1.36548348E-03    2     1000023         2   # BR(~u_L -> ~chi_20 u)
     2.40536066E-01    2     1000025         2   # BR(~u_L -> ~chi_30 u)
     2.12102651E-01    2     1000024         1   # BR(~u_L -> ~chi_1+ d)
     4.61670356E-01    2     1000037         1   # BR(~u_L -> ~chi_2+ d)
#
#         PDG            Width
DECAY   2000002     4.01781768E+01   # sup_R decays
#          BR         NDA      ID1       ID2
     1.04012777E-05    2     1000022         2   # BR(~u_R -> ~chi_10 u)
     8.83455700E-06    2     1000023         2   # BR(~u_R -> ~chi_20 u)
     1.67326529E-06    2     1000025         2   # BR(~u_R -> ~chi_30 u)
     9.99979091E-01    2     1000021         2   # BR(~u_R -> ~g      u)
#
#         PDG            Width
DECAY   1000001     3.24684097E+00   # sdown_L decays
#          BR         NDA      ID1       ID2
     8.62328980E-02    2     1000022         1   # BR(~d_L -> ~chi_10 d)
     1.26491089E-03    2     1000023         1   # BR(~d_L -> ~chi_20 d)
     2.53507735E-01    2     1000025         1   # BR(~d_L -> ~chi_30 d)
     1.36846299E-01    2    -1000024         2   # BR(~d_L -> ~chi_1- u)
     5.22148158E-01    2    -1000037         2   # BR(~d_L -> ~chi_2- u)
#
#         PDG            Width
DECAY   2000001     2.70334244E+00   # sdown_R decays
#           BR         NDA      ID1       ID2
     3.07942580E-05    2     1000022         1   # BR(~d_R -> ~chi_10 d)
     2.60978450E-05    2     1000023         1   # BR(~d_R -> ~chi_20 d)
#           BR         NDA      ID1       ID2       ID3
     1.21715989E-01    3        1       -1        1000001   # BR(~d_R -> d  db  ~d_L)
     8.55755440E-02    3        1       1        -1000001   # BR(~d_R -> d  d  ~d_L*)
     1.20092074E-01    3        1       -2        1000002   # BR(~d_R -> d  ub  ~u_L)
     8.46433647E-02    3        1       2        -1000002   # BR(~d_R -> d  u  ~u_L*)
     1.18645716E-01    3        1       -3        1000003   # BR(~d_R -> d  sb  ~s_L)
     8.50169762E-02    3        1       3        -1000003   # BR(~d_R -> d  s  ~s_L*)
     1.21752981E-01    3        1       -4        1000004   # BR(~d_R -> d  cb  ~c_L)
     8.78911959E-02    3        1       4        -1000004   # BR(~d_R -> d  c  ~c_L*)
     7.35829827E-02    3        1       -5        1000005   # BR(~d_R -> d  bb  ~b_1)
     9.95952255E-02    3        1       5        -1000005   # BR(~d_R -> d  b  ~b_1*)
     4.68938001E-04    3        1       -5        2000005   # BR(~d_R -> d  bb  ~b_2)
     4.58506470E-04    3        1       5        -2000005   # BR(~d_R -> d  b  ~b_2*)
     2.09888320E-04    3        1       -6        1000006   # BR(~d_R -> d  tb  ~t_1)
     2.08789678E-04    3        1       6        -1000006   # BR(~d_R -> d  t  ~t_1*)
     4.94535942E-06    3        1       -11        1000011   # BR(~d_R -> d  e+  ~e_L-)
     1.09364613E-06    3        1       11        -1000011   # BR(~d_R -> d  e-  ~e_L+)
     8.46211699E-07    3        1       -11        2000011   # BR(~d_R -> d  e+  ~e_R-)
     2.85021235E-06    3        1       11        -2000011   # BR(~d_R -> d  e-  ~e_R+)
     5.09221466E-06    3        1       -12        1000012   # BR(~d_R -> d  nu_eb  ~nu_eL)
     1.08817143E-06    3        1       12        -1000012   # BR(~d_R -> d  nu_e  ~nu_eL*)
     4.88210439E-06    3        1       -13        1000013   # BR(~d_R -> d  mu+  ~mu_L-)
     1.08495319E-06    3        1       13        -1000013   # BR(~d_R -> d  mu-  ~mu_L+)
     8.22907216E-07    3        1       -13        2000013   # BR(~d_R -> d  mu+  ~mu_R-)
     2.81340606E-06    3        1       13        -2000013   # BR(~d_R -> d  mu-  ~mu_R+)
     4.92982310E-06    3        1       -14        1000014   # BR(~d_R -> d  nu_mub  ~nu_muL)
     1.09786313E-06    3        1       14        -1000014   # BR(~d_R -> d  nu_mu  ~nu_muL*)
     4.83105648E-06    3        1       -15        1000015   # BR(~d_R -> d  tau+  ~tau_1-)
     1.05765365E-06    3        1       15        -1000015   # BR(~d_R -> d  tau-  ~tau_1+)
     4.89505133E-06    3        1       -16        1000016   # BR(~d_R -> d  nu_taub  ~nu_tau1)
     1.07370785E-06    3        1       16        -1000016   # BR(~d_R -> d  nu_tau  ~nu_tau1*)
     3.95251443E-06    3        1       23        1000022   # BR(~d_R -> d  Z  ~chi_10)
     4.90392923E-06    3        1       25        1000022   # BR(~d_R -> d  h  ~chi_10)
     5.42735533E-10    3        1       35        1000022   # BR(~d_R -> d  H  ~chi_10)
     8.84719584E-09    3        1       36        1000022   # BR(~d_R -> d  A  ~chi_10)
     5.73549239E-06    3        1       23        1000023   # BR(~d_R -> d  Z  ~chi_20)
     4.35423934E-06    3        1       25        1000023   # BR(~d_R -> d  h  ~chi_20)
     6.98875574E-09    3        1       35        1000023   # BR(~d_R -> d  H  ~chi_20)
     3.75350154E-10    3        1       36        1000023   # BR(~d_R -> d  A  ~chi_20)
     4.78148821E-07    3        1       23        1000025   # BR(~d_R -> d  Z  ~chi_30)
     6.37987986E-07    3        1       25        1000025   # BR(~d_R -> d  h  ~chi_30)
     7.97050336E-14    3        1       35        1000025   # BR(~d_R -> d  H  ~chi_30)
     3.92107187E-12    3        1       36        1000025   # BR(~d_R -> d  A  ~chi_30)
     3.66601724E-06    3        1       -24        1000024   # BR(~d_R -> d  W-  ~chi_1+)
     1.54682586E-05    3        1       24        -1000024   # BR(~d_R -> d  W+  ~chi_1-)
     1.14902202E-08    3        1       -37        1000024   # BR(~d_R -> d  H-  ~chi_1+)
     6.00922760E-09    3        1       37        -1000024   # BR(~d_R -> d  H+  ~chi_1-)
     1.65602402E-07    3        1       -24        1000037   # BR(~d_R -> d  W-  ~chi_2+)
     2.13520859E-06    3        1       24        -1000037   # BR(~d_R -> d  W+  ~chi_2-)
     4.08827229E-12    3        1       -37        1000037   # BR(~d_R -> d  H-  ~chi_2+)
     2.40195245E-12    3        1       37        -1000037   # BR(~d_R -> d  H+  ~chi_2-)
#
#         PDG            Width
DECAY   1000004     3.20960962E+00   # scharm_L decays
#          BR         NDA      ID1       ID2
     8.47196076E-02    2     1000022         4   # BR(~c_L -> ~chi_10 c)
     1.37126174E-03    2     1000023         4   # BR(~c_L -> ~chi_20 c)
     2.40060956E-01    2     1000025         4   # BR(~c_L -> ~chi_30 c)
     2.13091079E-01    2     1000024         3   # BR(~c_L -> ~chi_1+ s)
     4.60757096E-01    2     1000037         3   # BR(~c_L -> ~chi_2+ s)
#
#         PDG            Width
DECAY   2000004     2.92237421E+01   # scharm_R decays
#          BR         NDA      ID1       ID2
     1.49933496E-05    2     1000022         4   # BR(~c_R -> ~chi_10 c)
     1.27327239E-05    2     1000023         4   # BR(~c_R -> ~chi_20 c)
     2.40906108E-06    2     1000025         4   # BR(~c_R -> ~chi_30 c)
     9.99969865E-01    2     1000021         4   # BR(~c_R -> ~g      c)
#
#         PDG            Width
DECAY   1000003     3.11534506E+00   # sstrange_L decays
#          BR         NDA      ID1       ID2
     8.66704745E-02    2     1000022         3   # BR(~s_L -> ~chi_10 s)
     1.27077889E-03    2     1000023         3   # BR(~s_L -> ~chi_20 s)
     2.53145854E-01    2     1000025         3   # BR(~s_L -> ~chi_30 s)
     1.37536184E-01    2    -1000024         4   # BR(~s_L -> ~chi_1- c)
     5.21376709E-01    2    -1000037         4   # BR(~s_L -> ~chi_2- c)
#
#         PDG            Width
DECAY   2000003     2.70713246E+00   # sstrange_R decays
#           BR         NDA      ID1       ID2
     3.22218763E-05    2     1000022         3   # BR(~s_R -> ~chi_10 s)
     2.73026442E-05    2     1000023         3   # BR(~s_R -> ~chi_20 s)
#           BR         NDA      ID1       ID2       ID3
     1.20038456E-01    3        3       -1        1000001   # BR(~s_R -> s  db  ~d_L)
     8.74837132E-02    3        3       1        -1000001   # BR(~s_R -> s  d  ~d_L*)
     1.19923943E-01    3        3       -2        1000002   # BR(~s_R -> s  ub  ~u_L)
     8.45248628E-02    3        3       2        -1000002   # BR(~s_R -> s  u  ~u_L*)
     1.18479611E-01    3        3       -3        1000003   # BR(~s_R -> s  sb  ~s_L)
     8.68483545E-02    3        3       3        -1000003   # BR(~s_R -> s  s  ~s_L*)
     1.21582525E-01    3        3       -4        1000004   # BR(~s_R -> s  cb  ~c_L)
     8.68816000E-02    3        3       4        -1000004   # BR(~s_R -> s  c  ~c_L*)
     7.34799655E-02    3        3       -5        1000005   # BR(~s_R -> s  bb  ~b_1)
     9.92710935E-02    3        3       5        -1000005   # BR(~s_R -> s  b  ~b_1*)
     4.64772233E-04    3        3       -5        2000005   # BR(~s_R -> s  bb  ~b_2)
     4.57864555E-04    3        3       5        -2000005   # BR(~s_R -> s  b  ~b_2*)
     2.10255689E-04    3        3       -6        1000006   # BR(~s_R -> s  tb  ~t_1)
     2.08604495E-04    3        3       6        -1000006   # BR(~s_R -> s  t  ~t_1*)
     4.93843585E-06    3        3       -11        1000011   # BR(~s_R -> s  e+  ~e_L-)
     1.09211501E-06    3        3       11        -1000011   # BR(~s_R -> s  e-  ~e_L+)
     8.45026991E-07    3        3       -11        2000011   # BR(~s_R -> s  e+  ~e_R-)
     2.84622200E-06    3        3       11        -2000011   # BR(~s_R -> s  e-  ~e_R+)
     5.08508548E-06    3        3       -12        1000012   # BR(~s_R -> s  nu_eb  ~nu_eL)
     1.08664797E-06    3        3       12        -1000012   # BR(~s_R -> s  nu_e  ~nu_eL*)
     4.87526938E-06    3        3       -13        1000013   # BR(~s_R -> s  mu+  ~mu_L-)
     1.08343424E-06    3        3       13        -1000013   # BR(~s_R -> s  mu-  ~mu_L+)
     8.21755134E-07    3        3       -13        2000013   # BR(~s_R -> s  mu+  ~mu_R-)
     2.80946725E-06    3        3       13        -2000013   # BR(~s_R -> s  mu-  ~mu_R+)
     4.92292127E-06    3        3       -14        1000014   # BR(~s_R -> s  nu_mub  ~nu_muL)
     1.09632611E-06    3        3       14        -1000014   # BR(~s_R -> s  nu_mu  ~nu_muL*)
     4.82429293E-06    3        3       -15        1000015   # BR(~s_R -> s  tau+  ~tau_1-)
     1.05617292E-06    3        3       15        -1000015   # BR(~s_R -> s  tau-  ~tau_1+)
     4.88819819E-06    3        3       -16        1000016   # BR(~s_R -> s  nu_taub  ~nu_tau1)
     1.07216770E-06    3        3       16        -1000016   # BR(~s_R -> s  nu_tau  ~nu_tau1*)
     3.94698085E-06    3        3       23        1000022   # BR(~s_R -> s  Z  ~chi_10)
     4.89706365E-06    3        3       25        1000022   # BR(~s_R -> s  h  ~chi_10)
     5.41975695E-10    3        3       35        1000022   # BR(~s_R -> s  H  ~chi_10)
     8.80562747E-09    3        3       36        1000022   # BR(~s_R -> s  A  ~chi_10)
     5.72746262E-06    3        3       23        1000023   # BR(~s_R -> s  Z  ~chi_20)
     4.34814334E-06    3        3       25        1000023   # BR(~s_R -> s  h  ~chi_20)
     6.96567318E-09    3        3       35        1000023   # BR(~s_R -> s  H  ~chi_20)
     3.75267931E-10    3        3       36        1000023   # BR(~s_R -> s  A  ~chi_20)
     4.77479406E-07    3        3       23        1000025   # BR(~s_R -> s  Z  ~chi_30)
     6.37094794E-07    3        3       25        1000025   # BR(~s_R -> s  h  ~chi_30)
     7.91132325E-14    3        3       35        1000025   # BR(~s_R -> s  H  ~chi_30)
     3.92555597E-12    3        3       36        1000025   # BR(~s_R -> s  A  ~chi_30)
     3.66088476E-06    3        3       -24        1000024   # BR(~s_R -> s  W-  ~chi_1+)
     1.54853893E-05    3        3       24        -1000024   # BR(~s_R -> s  W+  ~chi_1-)
     1.14741338E-08    3        3       -37        1000024   # BR(~s_R -> s  H-  ~chi_1+)
     6.02778040E-09    3        3       37        -1000024   # BR(~s_R -> s  H+  ~chi_1-)
     1.65370555E-07    3        3       -24        1000037   # BR(~s_R -> s  W-  ~chi_2+)
     2.13136966E-06    3        3       24        -1000037   # BR(~s_R -> s  W+  ~chi_2-)
     4.06223195E-12    3        3       -37        1000037   # BR(~s_R -> s  H-  ~chi_2+)
     2.37819910E-12    3        3       37        -1000037   # BR(~s_R -> s  H+  ~chi_2-)
#
#         PDG            Width
DECAY   1000011     5.60219866E+00   # selectron_L decays
#          BR         NDA      ID1       ID2
     6.89117265E-02    2     1000022        11   # BR(~e_L -> ~chi_10 e-)
     1.25988769E-03    2     1000023        11   # BR(~e_L -> ~chi_20 e-)
     2.68081099E-01    2     1000025        11   # BR(~e_L -> ~chi_30 e-)
     1.06053464E-01    2    -1000024        12   # BR(~e_L -> ~chi_1- nu_e)
     5.55693822E-01    2    -1000037        12   # BR(~e_L -> ~chi_2- nu_e)
#
#         PDG            Width
DECAY   2000011     1.02014776E-03   # selectron_R decays
#           BR         NDA      ID1       ID2
     4.36138331E-01    2     1000022        11   # BR(~e_R -> ~chi_10 e-)
     3.65396675E-01    2     1000023        11   # BR(~e_R -> ~chi_20 e-)
#           BR         NDA      ID1       ID2       ID3
     2.17076397E-03    3        11       -1        1000001   # BR(~e_R- -> e-  db  ~d_L)
     1.93717036E-04    3        11       1        -1000001   # BR(~e_R- -> e-  d  ~d_L*)
     2.04803664E-03    3        11       -2        1000002   # BR(~e_R- -> e-  ub  ~u_L)
     2.12253565E-04    3        11       2        -1000002   # BR(~e_R- -> e-  u  ~u_L*)
     2.14841426E-03    3        11       -3        1000003   # BR(~e_R- -> e-  sb  ~s_L)
     1.90913520E-04    3        11       3        -1000003   # BR(~e_R- -> e-  s  ~s_L*)
     2.03794007E-03    3        11       -4        1000004   # BR(~e_R- -> e-  cb  ~c_L)
     2.13439669E-04    3        11       4        -1000004   # BR(~e_R- -> e-  c  ~c_L*)
     3.59889042E-04    3        11       -5        1000005   # BR(~e_R- -> e-  bb  ~b_1)
     3.31069687E-03    3        11       5        -1000005   # BR(~e_R- -> e-  b  ~b_1*)
     2.20811150E-03    3        11       -11        1000011   # BR(~e_R- -> e-  e+  ~e_L-)
     2.44895896E-04    3        11       11        -1000011   # BR(~e_R- -> e-  e-  ~e_L+)
     2.28202236E-03    3        11       -12        1000012   # BR(~e_R- -> e-  nu_eb  ~nu_eL)
     2.45337009E-04    3        11       12        -1000012   # BR(~e_R- -> e-  nu_e  ~nu_eL*)
     2.17399879E-03    3        11       -13        1000013   # BR(~e_R- -> e-  mu+  ~mu_L-)
     2.45258589E-04    3        11       13        -1000013   # BR(~e_R- -> e-  mu-  ~mu_L+)
     2.26124106E-03    3        11       -14        1000014   # BR(~e_R- -> e-  nu_mub  ~nu_muL)
     2.44690043E-04    3        11       14        -1000014   # BR(~e_R- -> e-  nu_mu  ~nu_muL*)
     2.02578496E-03    3        11       -15        1000015   # BR(~e_R- -> e-  tau+  ~tau_1-)
     2.27427838E-04    3        11       15        -1000015   # BR(~e_R- -> e-  tau-  ~tau_1+)
     2.15370761E-03    3        11       -16        1000016   # BR(~e_R- -> e-  nu_taub  ~nu_tau1)
     2.31770347E-04    3        11       16        -1000016   # BR(~e_R- -> e-  nu_tau  ~nu_tau1*)
     1.21766675E-02    3        11       23        1000022   # BR(~e_R- -> e-  Z  ~chi_10)
     2.24653730E-02    3        11       25        1000022   # BR(~e_R- -> e-  h  ~chi_10)
     2.57727371E-02    3        11       23        1000023   # BR(~e_R- -> e-  Z  ~chi_20)
     1.31382928E-02    3        11       25        1000023   # BR(~e_R- -> e-  h  ~chi_20)
     7.40304521E-04    3        11       23        1000025   # BR(~e_R- -> e-  Z  ~chi_30)
     2.15057082E-03    3        11       25        1000025   # BR(~e_R- -> e-  h  ~chi_30)
     2.25682992E-02    3        11       -24        1000024   # BR(~e_R- -> e-  W-  ~chi_1+)
     6.61139520E-02    3        11       24        -1000024   # BR(~e_R- -> e-  W+  ~chi_1-)
     3.99089245E-04    3        11       -24        1000037   # BR(~e_R- -> e-  W-  ~chi_2+)
     5.50939797E-03    3        11       24        -1000037   # BR(~e_R- -> e-  W+  ~chi_2-)
#
#         PDG            Width
DECAY   1000013     5.60219857E+00   # smuon_L decays
#          BR         NDA      ID1       ID2
     6.89117255E-02    2     1000022        13   # BR(~mu_L -> ~chi_10 mu-)
     1.25988766E-03    2     1000023        13   # BR(~mu_L -> ~chi_20 mu-)
     2.68081090E-01    2     1000025        13   # BR(~mu_L -> ~chi_30 mu-)
     1.06053466E-01    2    -1000024        14   # BR(~mu_L -> ~chi_1- nu_mu)
     5.55693831E-01    2    -1000037        14   # BR(~mu_L -> ~chi_2- nu_mu)
#
#         PDG            Width
DECAY   2000013     1.02017486E-03   # smuon_R decays
#           BR         NDA      ID1       ID2
     4.36126740E-01    2     1000022        13   # BR(~mu_R -> ~chi_10 mu-)
     3.65386963E-01    2     1000023        13   # BR(~mu_R -> ~chi_20 mu-)
#           BR         NDA      ID1       ID2       ID3
     2.17070629E-03    3        13       -1        1000001   # BR(~mu_R- -> mu-  db  ~d_L)
     1.93790308E-04    3        13       1        -1000001   # BR(~mu_R- -> mu-  d  ~d_L*)
     2.07846722E-03    3        13       -2        1000002   # BR(~mu_R- -> mu-  ub  ~u_L)
     2.10493327E-04    3        13       2        -1000002   # BR(~mu_R- -> mu-  u  ~u_L*)
     2.14835719E-03    3        13       -3        1000003   # BR(~mu_R- -> mu-  sb  ~s_L)
     1.90908448E-04    3        13       3        -1000003   # BR(~mu_R- -> mu-  s  ~s_L*)
     2.03788594E-03    3        13       -4        1000004   # BR(~mu_R- -> mu-  cb  ~c_L)
     2.13433999E-04    3        13       4        -1000004   # BR(~mu_R- -> mu-  c  ~c_L*)
     3.59879482E-04    3        13       -5        1000005   # BR(~mu_R- -> mu-  bb  ~b_1)
     3.31060892E-03    3        13       5        -1000005   # BR(~mu_R- -> mu-  b  ~b_1*)
     2.20805284E-03    3        13       -11        1000011   # BR(~mu_R- -> mu-  e+  ~e_L-)
     2.46526365E-04    3        13       11        -1000011   # BR(~mu_R- -> mu-  e-  ~e_L+)
     2.28196174E-03    3        13       -12        1000012   # BR(~mu_R- -> mu-  nu_eb  ~nu_eL)
     2.44311058E-04    3        13       12        -1000012   # BR(~mu_R- -> mu-  nu_e  ~nu_eL*)
     2.17394104E-03    3        13       -13        1000013   # BR(~mu_R- -> mu-  mu+  ~mu_L-)
     2.44889391E-04    3        13       13        -1000013   # BR(~mu_R- -> mu-  mu-  ~mu_L+)
     2.26118099E-03    3        13       -14        1000014   # BR(~mu_R- -> mu-  nu_mub  ~nu_muL)
     2.44683544E-04    3        13       14        -1000014   # BR(~mu_R- -> mu-  nu_mu  ~nu_muL*)
     2.02573116E-03    3        13       -15        1000015   # BR(~mu_R- -> mu-  tau+  ~tau_1-)
     2.26696431E-04    3        13       15        -1000015   # BR(~mu_R- -> mu-  tau-  ~tau_1+)
     2.15365040E-03    3        13       -16        1000016   # BR(~mu_R- -> mu-  nu_taub  ~nu_tau1)
     2.31764190E-04    3        13       16        -1000016   # BR(~mu_R- -> mu-  nu_tau  ~nu_tau1*)
     1.21763439E-02    3        13       23        1000022   # BR(~mu_R- -> mu-  Z  ~chi_10)
     2.24647762E-02    3        13       25        1000022   # BR(~mu_R- -> mu-  h  ~chi_10)
     2.57720524E-02    3        13       23        1000023   # BR(~mu_R- -> mu-  Z  ~chi_20)
     1.31379439E-02    3        13       25        1000023   # BR(~mu_R- -> mu-  h  ~chi_20)
     7.40284855E-04    3        13       23        1000025   # BR(~mu_R- -> mu-  Z  ~chi_30)
     2.15051368E-03    3        13       25        1000025   # BR(~mu_R- -> mu-  h  ~chi_30)
     2.25676998E-02    3        13       -24        1000024   # BR(~mu_R- -> mu-  W-  ~chi_1+)
     6.61121957E-02    3        13       24        -1000024   # BR(~mu_R- -> mu-  W+  ~chi_1-)
     3.99078644E-04    3        13       -24        1000037   # BR(~mu_R- -> mu-  W-  ~chi_2+)
     5.50748720E-03    3        13       24        -1000037   # BR(~mu_R- -> mu-  W+  ~chi_2-)
#
#         PDG            Width
DECAY   1000015     5.77591036E+00   # stau_1 decays
#          BR         NDA      ID1       ID2
     7.12034563E-02    2     1000022        15   # BR(~tau_1 -> ~chi_10  tau-)
     4.83115838E-03    2     1000023        15   # BR(~tau_1 -> ~chi_20  tau-)
     2.66914069E-01    2     1000025        15   # BR(~tau_1 -> ~chi_30  tau-)
     1.04344438E-01    2    -1000024        16   # BR(~tau_1 -> ~chi_1-  nu_tau)
     5.52706878E-01    2    -1000037        16   # BR(~tau_1 -> ~chi_2-  nu_tau)
#
#         PDG            Width
DECAY   2000015     4.77544650E-01   # stau_2 decays
#          BR         NDA      ID1       ID2
     2.22941360E-01    2     1000022        15   # BR(~tau_2 -> ~chi_10  tau-)
     2.43198504E-01    2     1000023        15   # BR(~tau_2 -> ~chi_20  tau-)
     2.50428354E-02    2     1000025        15   # BR(~tau_2 -> ~chi_30  tau-)
     4.36248992E-01    2    -1000024        16   # BR(~tau_2 -> ~chi_1-  nu_tau)
     4.98541668E-02    2    -1000037        16   # BR(~tau_2 -> ~chi_2-  nu_tau)
     8.77758341E-03    2     1000016       -37   # BR(~tau_2 -> ~nu_tauL H-)
     2.56140212E-03    2     1000016       -24   # BR(~tau_2 -> ~nu_tauL W-)
     1.28548286E-03    2     1000015        25   # BR(~tau_2 -> ~tau_1   h)
     4.39020687E-03    2     1000015        35   # BR(~tau_2 -> ~tau_1   H)
     4.38684144E-03    2     1000015        36   # BR(~tau_2 -> ~tau_1   A)
     1.31262449E-03    2     1000015        23   # BR(~tau_2 -> ~tau_1   Z)
#
#         PDG            Width
DECAY   1000012     5.68396401E+00   # snu_eL decays
#          BR         NDA      ID1       ID2
     6.43213604E-02    2     1000022        12   # BR(~nu_eL -> ~chi_10 nu_e)
     8.70743997E-04    2     1000023        12   # BR(~nu_eL -> ~chi_20 nu_e)
     2.63535261E-01    2     1000025        12   # BR(~nu_eL -> ~chi_30 nu_e)
     1.67421147E-01    2     1000024        11   # BR(~nu_eL -> ~chi_1+ e-)
     5.03851487E-01    2     1000037        11   # BR(~nu_eL -> ~chi_2+ e-)
#
#         PDG            Width
DECAY   1000014     5.68396382E+00   # snu_muL decays
#          BR         NDA      ID1       ID2
     6.43213625E-02    2     1000022        14   # BR(~nu_muL -> ~chi_10 nu_mu)
     8.70744026E-04    2     1000023        14   # BR(~nu_muL -> ~chi_20 nu_mu)
     2.63535270E-01    2     1000025        14   # BR(~nu_muL -> ~chi_30 nu_mu)
     1.67421147E-01    2     1000024        13   # BR(~nu_muL -> ~chi_1+ mu-)
     5.03851476E-01    2     1000037        13   # BR(~nu_muL -> ~chi_2+ mu-)
#
#         PDG            Width
DECAY   1000016     5.85736372E+00   # snu_tauL decays
#          BR         NDA      ID1       ID2
     6.33136043E-02    2     1000022        16   # BR(~nu_tauL -> ~chi_10 nu_tau)
     8.57973918E-04    2     1000023        16   # BR(~nu_tauL -> ~chi_20 nu_tau)
     2.62324919E-01    2     1000025        16   # BR(~nu_tauL -> ~chi_30 nu_tau)
     1.71386069E-01    2     1000024        15   # BR(~nu_tauL -> ~chi_1+ tau-)
     5.02117433E-01    2     1000037        15   # BR(~nu_tauL -> ~chi_2+ tau-)
#
#         PDG            Width
DECAY   1000024     1.13259504E-11   # chargino1+ decays
#           BR         NDA      ID1       ID2       ID3
     6.00235188E-01    3     1000022         2        -1   # BR(~chi_1+ -> ~chi_10 u    db)
     1.99882406E-01    3     1000022       -11        12   # BR(~chi_1+ -> ~chi_10 e+   nu_e)
     1.99882406E-01    3     1000022       -13        14   # BR(~chi_1+ -> ~chi_10 mu+  nu_mu)
#
#         PDG            Width
DECAY   1000037     2.80996301E+00   # chargino2+ decays
#          BR         NDA      ID1       ID2
     2.85844257E-01    2     1000024        23   # BR(~chi_2+ -> ~chi_1+  Z )
     3.08694402E-01    2     1000022        24   # BR(~chi_2+ -> ~chi_10  W+)
     2.29700686E-01    2     1000023        24   # BR(~chi_2+ -> ~chi_20  W+)
     1.75760655E-01    2     1000024        25   # BR(~chi_2+ -> ~chi_1+  h )
#
#         PDG            Width
DECAY   1000022     0.00000000E+00   # neutralino1 decays
#
#         PDG            Width
DECAY   1000023     2.80376055E-05   # neutralino2 decays
#          BR         NDA      ID1       ID2
     1.85287505E-02    2     1000022        22   # BR(~chi_20 -> ~chi_10 gam)
#           BR         NDA      ID1       ID2       ID3
     4.27318496E-02    3     1000022        -2         2   # BR(~chi_20 -> ~chi_10 ub      u)
     5.53498503E-02    3     1000022        -1         1   # BR(~chi_20 -> ~chi_10 db      d)
     4.27318496E-02    3     1000022        -4         4   # BR(~chi_20 -> ~chi_10 cb      c)
     5.53498503E-02    3     1000022        -3         3   # BR(~chi_20 -> ~chi_10 sb      s)
     4.07892258E-02    3     1000022        -5         5   # BR(~chi_20 -> ~chi_10 bb      b)
     1.26806345E-02    3     1000022       -11        11   # BR(~chi_20 -> ~chi_10 e+      e-)
     1.26806345E-02    3     1000022       -13        13   # BR(~chi_20 -> ~chi_10 mu+     mu-)
     1.23344774E-02    3     1000022       -15        15   # BR(~chi_20 -> ~chi_10 tau+    tau-)
     2.53581122E-02    3     1000022       -12        12   # BR(~chi_20 -> ~chi_10 nu_eb   nu_e)
     2.53581122E-02    3     1000022       -14        14   # BR(~chi_20 -> ~chi_10 nu_mub  nu_mu)
     2.53579867E-02    3     1000022       -16        16   # BR(~chi_20 -> ~chi_10 nu_taub nu_tau)
     1.05433169E-01    3     1000024        -2         1   # BR(~chi_20 -> ~chi_1+ ub      d)
     1.05433169E-01    3    -1000024        -1         2   # BR(~chi_20 -> ~chi_1- db      u)
     1.05433169E-01    3     1000024        -4         3   # BR(~chi_20 -> ~chi_1+ cb      s)
     1.05433169E-01    3    -1000024        -3         4   # BR(~chi_20 -> ~chi_1- sb      c)
     3.51420061E-02    3     1000024       -12        11   # BR(~chi_20 -> ~chi_1+ nu_eb   e-)
     3.51420061E-02    3    -1000024        12       -11   # BR(~chi_20 -> ~chi_1- nu_e    e+)
     3.51420061E-02    3     1000024       -14        13   # BR(~chi_20 -> ~chi_1+ nu_mub  mu-)
     3.51420061E-02    3    -1000024        14       -13   # BR(~chi_20 -> ~chi_1- nu_mu   mu+)
     3.42239831E-02    3     1000024       -16        15   # BR(~chi_20 -> ~chi_1+ nu_taub tau-)
     3.42239831E-02    3    -1000024        16       -15   # BR(~chi_20 -> ~chi_1- nu_tau  tau+)
#
#         PDG            Width
DECAY   1000025     2.80772525E+00   # neutralino3 decays
#          BR         NDA      ID1       ID2
     4.86918150E-03    2     1000022        23   # BR(~chi_30 -> ~chi_10   Z )
     1.93128285E-01    2     1000023        23   # BR(~chi_30 -> ~chi_20   Z )
     3.17207742E-01    2     1000024       -24   # BR(~chi_30 -> ~chi_1+   W-)
     3.17207742E-01    2    -1000024        24   # BR(~chi_30 -> ~chi_1-   W+)
     1.66391243E-01    2     1000022        25   # BR(~chi_30 -> ~chi_10   h )
     1.19580741E-03    2     1000023        25   # BR(~chi_30 -> ~chi_20   h )
#
#         PDG            Width
DECAY   1000035     1.03661441E+02   # neutralino4 decays
#          BR         NDA      ID1       ID2
     7.42879589E-03    2     1000022        23   # BR(~chi_40 -> ~chi_10   Z )
     1.24532432E-02    2     1000023        23   # BR(~chi_40 -> ~chi_20   Z )
     1.47208544E-03    2     1000025        23   # BR(~chi_40 -> ~chi_30   Z )
     1.78345102E-02    2     1000024       -24   # BR(~chi_40 -> ~chi_1+   W-)
     1.78345102E-02    2    -1000024        24   # BR(~chi_40 -> ~chi_1-   W+)
     2.97678637E-03    2     1000037       -24   # BR(~chi_40 -> ~chi_2+   W-)
     2.97678637E-03    2    -1000037        24   # BR(~chi_40 -> ~chi_2-   W+)
     1.15709466E-02    2     1000022        25   # BR(~chi_40 -> ~chi_10   h )
     2.88522305E-03    2     1000022        35   # BR(~chi_40 -> ~chi_10   H )
     1.03564427E-02    2     1000022        36   # BR(~chi_40 -> ~chi_10   A )
     9.56428415E-03    2     1000023        25   # BR(~chi_40 -> ~chi_20   h )
     1.16119758E-02    2     1000023        35   # BR(~chi_40 -> ~chi_20   H )
     3.02822174E-03    2     1000023        36   # BR(~chi_40 -> ~chi_20   A )
     1.62251068E-03    2     1000025        25   # BR(~chi_40 -> ~chi_30   h )
     2.36437354E-04    2     1000025        35   # BR(~chi_40 -> ~chi_30   H )
     1.33808200E-03    2     1000025        36   # BR(~chi_40 -> ~chi_30   A )
     1.30934132E-02    2     1000024       -37   # BR(~chi_40 -> ~chi_1+   H-)
     1.30934132E-02    2    -1000024        37   # BR(~chi_40 -> ~chi_1-   H+)
     1.59153522E-03    2     1000037       -37   # BR(~chi_40 -> ~chi_2+   H-)
     1.59153522E-03    2    -1000037        37   # BR(~chi_40 -> ~chi_2-   H+)
     7.17889184E-03    2     1000002        -2   # BR(~chi_40 -> ~u_L      ub)
     7.17889184E-03    2    -1000002         2   # BR(~chi_40 -> ~u_L*     u )
     1.31934634E-02    2     2000002        -2   # BR(~chi_40 -> ~u_R      ub)
     1.31934634E-02    2    -2000002         2   # BR(~chi_40 -> ~u_R*     u )
     7.20221539E-03    2     1000001        -1   # BR(~chi_40 -> ~d_L      db)
     7.20221539E-03    2    -1000001         1   # BR(~chi_40 -> ~d_L*     d )
     9.81515351E-03    2     2000001        -1   # BR(~chi_40 -> ~d_R      db)
     9.81515351E-03    2    -2000001         1   # BR(~chi_40 -> ~d_R*     d )
     7.17889171E-03    2     1000004        -4   # BR(~chi_40 -> ~c_L      cb)
     7.17889171E-03    2    -1000004         4   # BR(~chi_40 -> ~c_L*     c )
     1.31934327E-02    2     2000004        -4   # BR(~chi_40 -> ~c_R      cb)
     1.31934327E-02    2    -2000004         4   # BR(~chi_40 -> ~c_R*     c )
     7.20221539E-03    2     1000003        -3   # BR(~chi_40 -> ~s _L      sb)
     7.20221539E-03    2    -1000003         3   # BR(~chi_40 -> ~s _L*     s )
     9.81515351E-03    2     2000003        -3   # BR(~chi_40 -> ~s _R      sb)
     9.81515351E-03    2    -2000003         3   # BR(~chi_40 -> ~s _R*     s )
     1.98789195E-02    2     1000006        -6   # BR(~chi_40 -> ~t_1      tb)
     1.98789195E-02    2    -1000006         6   # BR(~chi_40 -> ~t_1*     t )
     3.44681516E-02    2     2000006        -6   # BR(~chi_40 -> ~t_2      tb)
     3.44681516E-02    2    -2000006         6   # BR(~chi_40 -> ~t_2*     t )
     2.88876915E-02    2     1000005        -5   # BR(~chi_40 -> ~b_1      bb)
     2.88876915E-02    2    -1000005         5   # BR(~chi_40 -> ~b_1*     b )
     3.49091325E-03    2     2000005        -5   # BR(~chi_40 -> ~b_2      bb)
     3.49091325E-03    2    -2000005         5   # BR(~chi_40 -> ~b_2*     b )
     2.15614957E-02    2     1000011       -11   # BR(~chi_40 -> ~e_L-     e+)
     2.15614957E-02    2    -1000011        11   # BR(~chi_40 -> ~e_L+     e-)
     6.83838127E-02    2     2000011       -11   # BR(~chi_40 -> ~e_R-     e+)
     6.83838127E-02    2    -2000011        11   # BR(~chi_40 -> ~e_R+     e-)
     2.15614957E-02    2     1000013       -13   # BR(~chi_40 -> ~mu_L-    mu+)
     2.15614957E-02    2    -1000013        13   # BR(~chi_40 -> ~mu_L+    mu-)
     6.83838127E-02    2     2000013       -13   # BR(~chi_40 -> ~mu_R-    mu+)
     6.83838127E-02    2    -2000013        13   # BR(~chi_40 -> ~mu_R+    mu-)
     2.15125558E-02    2     1000015       -15   # BR(~chi_40 -> ~tau_1-   tau+)
     2.15125558E-02    2    -1000015        15   # BR(~chi_40 -> ~tau_1+   tau-)
     2.92871938E-05    2     2000015       -15   # BR(~chi_40 -> ~tau_2-   tau+)
     2.92871938E-05    2    -2000015        15   # BR(~chi_40 -> ~tau_2+   tau-)
     2.16103712E-02    2     1000012       -12   # BR(~chi_40 -> ~nu_eL    nu_eb)
     2.16103712E-02    2    -1000012        12   # BR(~chi_40 -> ~nu_eL*   nu_e )
     2.16103712E-02    2     1000014       -14   # BR(~chi_40 -> ~nu_muL   nu_mub)
     2.16103712E-02    2    -1000014        14   # BR(~chi_40 -> ~nu_muL*  nu_mu )
     2.15613350E-02    2     1000016       -16   # BR(~chi_40 -> ~nu_tau1  nu_taub)
     2.15613350E-02    2    -1000016        16   # BR(~chi_40 -> ~nu_tau1* nu_tau )
#
#         PDG            Width
DECAY        25     3.87056143E-03   # h decays
#          BR         NDA      ID1       ID2
     6.05659303E-01    2           5        -5   # BR(h -> b       bb     )
     6.71218299E-02    2         -15        15   # BR(h -> tau+    tau-   )
     2.37590438E-04    2         -13        13   # BR(h -> mu+     mu-    )
     2.59762814E-04    2           3        -3   # BR(h -> s       sb     )
     2.22611213E-02    2           4        -4   # BR(h -> c       cb     )
     8.05117097E-02    2          21        21   # BR(h -> g       g      )
     2.37910687E-03    2          22        22   # BR(h -> gam     gam    )
     1.47953771E-03    2          22        23   # BR(h -> Z       gam    )
     1.96056265E-01    2          24       -24   # BR(h -> W+      W-     )
     2.40337738E-02    2          23        23   # BR(h -> Z       Z      )
#
#         PDG            Width
DECAY        35     2.38421027E+01   # H decays
#          BR         NDA      ID1       ID2
     2.77061775E-02    2           5        -5   # BR(H -> b       bb     )
     4.85368014E-03    2         -15        15   # BR(H -> tau+    tau-   )
     1.71527948E-05    2         -13        13   # BR(H -> mu+     mu-    )
     1.17606911E-05    2           3        -3   # BR(H -> s       sb     )
     1.27076869E-06    2           4        -4   # BR(H -> c       cb     )
     1.22939616E-01    2           6        -6   # BR(H -> t       tb     )
     9.93767253E-05    2          21        21   # BR(H -> g       g      )
     8.40705231E-07    2          22        22   # BR(H -> gam     gam    )
     1.28403159E-07    2          23        22   # BR(H -> Z       gam    )
     1.24968324E-04    2          24       -24   # BR(H -> W+      W-     )
     6.22392416E-05    2          23        23   # BR(H -> Z       Z      )
     4.61405977E-04    2          25        25   # BR(H -> h       h      )
     3.13340833E-16    2          23        36   # BR(H -> Z       A      )
     5.78315040E-02    2     1000024  -1000024   # BR(H -> ~chi_1+ ~chi_1-)
     1.77175713E-02    2     1000037  -1000037   # BR(H -> ~chi_2+ ~chi_2-)
     2.43623431E-01    2     1000024  -1000037   # BR(H -> ~chi_1+ ~chi_2-)
     2.43623431E-01    2     1000037  -1000024   # BR(H -> ~chi_2+ ~chi_1-)
     2.05466319E-02    2     1000022   1000022   # BR(H -> ~chi_10 ~chi_10)
     6.55812063E-04    2     1000023   1000023   # BR(H -> ~chi_20 ~chi_20)
     9.38849618E-03    2     1000025   1000025   # BR(H -> ~chi_30 ~chi_30)
     2.35301557E-02    2     1000022   1000023   # BR(H -> ~chi_10 ~chi_20)
     4.61244004E-02    2     1000022   1000025   # BR(H -> ~chi_10 ~chi_30)
     1.80401478E-01    2     1000023   1000025   # BR(H -> ~chi_20 ~chi_30)
     5.17537377E-05    2     1000002  -1000002   # BR(H -> ~u_L    ~u_L*  )
     5.17537377E-05    2     1000004  -1000004   # BR(H -> ~c_L    ~c_L*  )
     7.52254741E-05    2     1000001  -1000001   # BR(H -> ~d_L    ~d_L*  )
     7.52254741E-05    2     1000003  -1000003   # BR(H -> ~s_L    ~s_L*  )
     2.31974657E-06    2     1000005  -1000005   # BR(H -> ~b_1    ~b_1*  )
     1.99092135E-06    2     1000011  -1000011   # BR(H -> ~e_L-   ~e_L+  )
     1.99092135E-06    2     1000013  -1000013   # BR(H -> ~mu_L-  ~mu_L+ )
     8.28683034E-06    2     1000012  -1000012   # BR(H -> ~nu_eL  ~nu_eL*   )
     8.28683034E-06    2     1000014  -1000014   # BR(H -> ~nu_muL ~nu_muL*  )
     1.63794335E-06    2     1000016  -1000016   # BR(H -> ~nu_tauL ~nu_tauL*)
#
#         PDG            Width
DECAY        36     2.38393786E+01   # A decays
#          BR         NDA      ID1       ID2
     2.77429839E-02    2           5        -5   # BR(A -> b       bb     )
     4.85535893E-03    2         -15        15   # BR(A -> tau+    tau-   )
     1.71586734E-05    2         -13        13   # BR(A -> mu+     mu-    )
     1.17940607E-05    2           3        -3   # BR(A -> s       sb     )
     1.26738790E-06    2           4        -4   # BR(A -> c       cb     )
     1.24135919E-01    2           6        -6   # BR(A -> t       tb     )
     1.52558689E-04    2          21        21   # BR(A -> g       g      )
     9.50544344E-07    2          22        22   # BR(A -> gam     gam    )
     1.77943626E-07    2          23        22   # BR(A -> Z       gam    )
     1.25984164E-04    2          23        25   # BR(A -> Z       h      )
     1.21337609E-01    2     1000024  -1000024   # BR(A -> ~chi_1+ ~chi_1-)
     7.36296608E-02    2     1000037  -1000037   # BR(A -> ~chi_2+ ~chi_2-)
     1.83841409E-01    2     1000024  -1000037   # BR(A -> ~chi_1+ ~chi_2-)
     1.83841409E-01    2     1000037  -1000024   # BR(A -> ~chi_2+ ~chi_1-)
     5.01746995E-02    2     1000022   1000022   # BR(A -> ~chi_10 ~chi_10)
     3.69815039E-04    2     1000023   1000023   # BR(A -> ~chi_20 ~chi_20)
     3.74281144E-02    2     1000025   1000025   # BR(A -> ~chi_30 ~chi_30)
     7.52210249E-03    2     1000022   1000023   # BR(A -> ~chi_10 ~chi_20)
     1.19612680E-01    2     1000022   1000025   # BR(A -> ~chi_10 ~chi_30)
     6.51983472E-02    2     1000023   1000025   # BR(A -> ~chi_20 ~chi_30)
#
#         PDG            Width
DECAY        37     2.37430962E+01   # H+ decays
#          BR         NDA      ID1       ID2
     4.75085488E-05    2           4        -5   # BR(H+ -> c       bb     )
     4.87973559E-03    2         -15        16   # BR(H+ -> tau+    nu_tau )
     1.72448196E-05    2         -13        14   # BR(H+ -> mu+     nu_mu  )
     4.75063743E-07    2           2        -5   # BR(H+ -> u       bb     )
     5.91060721E-07    2           2        -3   # BR(H+ -> u       sb     )
     1.28536706E-05    2           4        -3   # BR(H+ -> c       sb     )
     1.50314694E-01    2           6        -5   # BR(H+ -> t       bb     )
     1.27049191E-04    2          24        25   # BR(H+ -> W+      h      )
     1.34770333E-12    2          24        36   # BR(H+ -> W+      A      )
     4.69481403E-04    2     1000024   1000022   # BR(H+ -> ~chi_1+ ~chi_10)
     4.13093427E-02    2     1000024   1000023   # BR(H+ -> ~chi_1+ ~chi_20)
     2.72483982E-01    2     1000024   1000025   # BR(H+ -> ~chi_1+ ~chi_30)
     2.90796654E-01    2     1000037   1000022   # BR(H+ -> ~chi_2+ ~chi_10)
     2.39266219E-01    2     1000037   1000023   # BR(H+ -> ~chi_2+ ~chi_20)
     3.50076172E-06    2     1000037   1000025   # BR(H+ -> ~chi_2+ ~chi_30)
     9.44909319E-06    2    -1000011   1000012   # BR(H+ -> ~e_L+   ~nu_eL )
     9.44909319E-06    2    -1000013   1000014   # BR(H+ -> ~mu_L+  ~nu_muL)
     1.25885170E-04    2     1000002  -1000001   # BR(H+ -> ~u_L    ~d_L*  )
     1.25885170E-04    2     1000004  -1000003   # BR(H+ -> ~c_L    ~s_L*  )
