#
#                              ======================
#                              | THE SUSYHIT OUTPUT |
#                              ======================
#
#
#              ------------------------------------------------------
#              |     This is the output of the SUSY-HIT package     |
#              |  created by A.Djouadi, M.Muehlleitner and M.Spira. |
#              |  In case of problems with SUSY-HIT email to        |
#              |           margarete.muehlleitner@cern.ch           |
#              |           michael.spira@psi.ch                     |
#              |           abdelhak.djouadi@cern.ch                 |
#              ------------------------------------------------------
#
#              ------------------------------------------------------
#              |  SUSY Les Houches Accord - MSSM Spectrum + Decays  |
#              |              based on the decay programs           |
#              |                                                    |
#              |                     SDECAY 1.3b                    |
#              |                                                    |
#              |  Authors: M.Muhlleitner, A.Djouadi and Y.Mambrini  |
#              |  Ref.:    Comput.Phys.Commun.168(2005)46           |
#              |           [hep-ph/0311167]                         |
#              |                                                    |
#              |                     HDECAY 3.4                     |
#              |                                                    |
#              |  By: A.Djouadi,J.Kalinowski,M.Muhlleitner,M.Spira  |
#              |  Ref.:    Comput.Phys.Commun.108(1998)56           |
#              |           [hep-ph/9704448]                         |
#              |                                                    |
#              |                                                    |
#              |  If not stated otherwise all DRbar couplings and   |
#              |  soft SUSY breaking masses are given at the scale  |
#              |  Q=  0.24387670E+04
#              |                                                    |
#              ------------------------------------------------------
#
#
BLOCK DCINFO  # Decay Program information
     1   SDECAY/HDECAY # decay calculator
     2   1.3b  /3.4    # version number
#
BLOCK SPINFO  # Spectrum calculator information
     1     SOFTSUSY    # spectrum calculator               
     2     3.4.0       # version number                    
#
BLOCK MODSEL  # Model selection
     1     0   #  nonUniversal                                     
#
BLOCK SMINPUTS  # Standard Model inputs
         1     1.27908970E+02   # alpha_em^-1(M_Z)^MSbar
         2     1.16637870E-05   # G_F [GeV^-2]
         3     1.18400000E-01   # alpha_S(M_Z)^MSbar
         4     9.11876000E+01   # M_Z pole mass
         5     4.18000000E+00   # mb(mb)^MSbar
         6     1.73200000E+02   # mt pole mass
         7     1.77700000E+00   # mtau pole mass
#
BLOCK MINPAR  # Input parameters - minimal models
         3     5.59100000E+01   # tanb                
#
BLOCK EXTPAR  # Input parameters - non-minimal models
         0    -1.00000000E+00   # Set                 
         1     7.35420000E+02   # M_1(MX)             
         2    -1.73053000E+03   # M_2(MX)             
         3     1.04972000E+03   # M_3(MX)             
        11     3.33621000E+03   # At(MX)              
        12    -3.06755000E+03   # Ab(MX)              
        13    -2.77095000E+03   # Atau(MX)            
        23     2.86035000E+03   # mu(MX)              
        26     3.99045000E+03   # mA(pole)            
        31     1.65988000E+03   # meL(MX)             
        32     1.65988000E+03   # mmuL(MX)            
        33     3.38326000E+03   # mtauL(MX)           
        34     2.01349000E+03   # meR(MX)             
        35     2.01349000E+03   # mmuR(MX)            
        36     2.38106000E+03   # mtauR(MX)           
        41     6.38760000E+02   # mqL1(MX)            
        42     6.38760000E+02   # mqL2(MX)            
        43     3.50335000E+03   # mqL3(MX)            
        44     3.79204000E+03   # muR(MX)             
        45     3.79204000E+03   # mcR(MX)             
        46     1.69606000E+03   # mtR(MX)             
        47     2.39047000E+03   # mdR(MX)             
        48     2.39047000E+03   # msR(MX)             
        49     3.40980000E+03   # mbR(MX)             
#
BLOCK MASS  # Mass Spectrum
# PDG code           mass       particle
        24     8.04003892E+01   # W+
        25     1.24479407E+02   # h
        35     3.99040158E+03   # H
        36     3.99044971E+03   # A
        37     3.99142686E+03   # H+
         5     4.81876030E+00   # b-quark pole mass calculated from mb(mb)_Msbar
   1000001     7.66017562E+02   # ~d_L
   2000001     2.42287826E+03   # ~d_R
   1000002     7.62080900E+02   # ~u_L
   2000002     3.82941372E+03   # ~u_R
   1000003     7.66017562E+02   # ~s_L
   2000003     2.42287826E+03   # ~s_R
   1000004     7.62080900E+02   # ~c_L
   2000004     3.82941372E+03   # ~c_R
   1000005     3.42645419E+03   # ~b_1
   2000005     3.53956165E+03   # ~b_2
   1000006     1.76349033E+03   # ~t_1
   2000006     3.53178136E+03   # ~t_2
   1000011     1.67996419E+03   # ~e_L
   2000011     2.01445126E+03   # ~e_R
   1000012     1.67783737E+03   # ~nu_eL
   1000013     1.67996419E+03   # ~mu_L
   2000013     2.01445126E+03   # ~mu_R
   1000014     1.67783737E+03   # ~nu_muL
   1000015     2.38293417E+03   # ~tau_1
   2000015     3.38938778E+03   # ~tau_2
   1000016     3.38635310E+03   # ~nu_tauL
   1000021     1.20119651E+03   # ~g
   1000022     7.31204474E+02   # ~chi_10
   1000023    -1.73847994E+03   # ~chi_20
   1000025     2.88090964E+03   # ~chi_30
   1000035    -2.88236834E+03   # ~chi_40
   1000024     1.73864496E+03   # ~chi_1+
   1000037     2.88329192E+03   # ~chi_2+
#
BLOCK NMIX  # Neutralino Mixing Matrix
  1  1     9.99848775E-01   # N_11
  1  2     1.46182536E-04   # N_12
  1  3     1.68071197E-02   # N_13
  1  4    -4.46387325E-03   # N_14
  2  1     4.27024080E-04   # N_21
  2  2     9.98911972E-01   # N_22
  2  3    -4.03163471E-02   # N_23
  2  4    -2.34367502E-02   # N_24
  3  1     1.50402452E-02   # N_31
  3  2    -1.19432652E-02   # N_32
  3  3    -7.06825330E-01   # N_33
  3  4     7.07127360E-01   # N_34
  4  1    -8.71983265E-03   # N_41
  4  2     4.50800233E-02   # N_42
  4  3     7.06038289E-01   # N_43
  4  4     7.06683585E-01   # N_44
#
BLOCK UMIX  # Chargino Mixing Matrix U
  1  1     9.98313998E-01   # U_11
  1  2    -5.80444725E-02   # U_12
  2  1     5.80444725E-02   # U_21
  2  2     9.98313998E-01   # U_22
#
BLOCK VMIX  # Chargino Mixing Matrix V
  1  1    -9.99413640E-01   # V_11
  1  2    -3.42399852E-02   # V_12
  2  1    -3.42399852E-02   # V_21
  2  2     9.99413640E-01   # V_22
#
BLOCK STOPMIX  # Stop Mixing Matrix
  1  1    -4.81660236E-02   # cos(theta_t)
  1  2     9.98839344E-01   # sin(theta_t)
  2  1    -9.98839344E-01   # -sin(theta_t)
  2  2    -4.81660236E-02   # cos(theta_t)
#
BLOCK SBOTMIX  # Sbottom Mixing Matrix
  1  1     3.50162916E-01   # cos(theta_b)
  1  2     9.36688813E-01   # sin(theta_b)
  2  1    -9.36688813E-01   # -sin(theta_b)
  2  2     3.50162916E-01   # cos(theta_b)
#
BLOCK STAUMIX  # Stau Mixing Matrix
  1  1     4.56111681E-02   # cos(theta_tau)
  1  2     9.98959269E-01   # sin(theta_tau)
  2  1    -9.98959269E-01   # -sin(theta_tau)
  2  2     4.56111681E-02   # cos(theta_tau)
#
BLOCK ALPHA  # Higgs mixing
          -1.83737135E-02   # Mixing angle in the neutral Higgs boson sector
#
BLOCK HMIX Q=  2.43876700E+03  # DRbar Higgs Parameters
         1     2.88558136E+03   # mu(Q)MSSM           
         2     5.45776218E+01   # tan                 
         3     2.43098959E+02   # higgs               
         4     1.60023608E+07   # mA^2(Q)MSSM         
#
BLOCK GAUGE Q=  2.43876700E+03  # The gauge couplings
     1     3.64135628E-01   # gprime(Q) DRbar
     2     6.37532288E-01   # g(Q) DRbar
     3     1.03458318E+00   # g3(Q) DRbar
#
BLOCK AU Q=  2.43876700E+03  # The trilinear couplings
  1  1     0.00000000E+00   # A_u(Q) DRbar
  2  2     0.00000000E+00   # A_c(Q) DRbar
  3  3     3.33621001E+03   # A_t(Q) DRbar
#
BLOCK AD Q=  2.43876700E+03  # The trilinear couplings
  1  1     0.00000000E+00   # A_d(Q) DRbar
  2  2     0.00000000E+00   # A_s(Q) DRbar
  3  3    -3.06755000E+03   # A_b(Q) DRbar
#
BLOCK AE Q=  2.43876700E+03  # The trilinear couplings
  1  1     0.00000000E+00   # A_e(Q) DRbar
  2  2     0.00000000E+00   # A_mu(Q) DRbar
  3  3    -2.77095000E+03   # A_tau(Q) DRbar
#
BLOCK Yu Q=  2.43876700E+03  # The Yukawa couplings
  1  1     0.00000000E+00   # y_u(Q) DRbar
  2  2     0.00000000E+00   # y_c(Q) DRbar
  3  3     8.39734524E-01   # y_t(Q) DRbar
#
BLOCK Yd Q=  2.43876700E+03  # The Yukawa couplings
  1  1     0.00000000E+00   # y_d(Q) DRbar
  2  2     0.00000000E+00   # y_s(Q) DRbar
  3  3     5.05584487E-01   # y_b(Q) DRbar
#
BLOCK Ye Q=  2.43876700E+03  # The Yukawa couplings
  1  1     0.00000000E+00   # y_e(Q) DRbar
  2  2     0.00000000E+00   # y_mu(Q) DRbar
  3  3     5.17670457E-01   # y_tau(Q) DRbar
#
BLOCK MSOFT Q=  2.43876700E+03  # The soft SUSY breaking masses at the scale Q
         1     7.35420000E+02   # M_1(Q)              
         2    -1.73053000E+03   # M_2(Q)              
         3     1.04972000E+03   # M_3(Q)              
        21     8.36335635E+06   # mH1^2(Q)            
        22    -8.32652090E+06   # mH2^2(Q)            
        31     1.65988000E+03   # meL(Q)              
        32     1.65988000E+03   # mmuL(Q)             
        33     3.38326000E+03   # mtauL(Q)            
        34     2.01349000E+03   # meR(Q)              
        35     2.01349000E+03   # mmuR(Q)             
        36     2.38106000E+03   # mtauR(Q)            
        41     6.38759995E+02   # mqL1(Q)             
        42     6.38759995E+02   # mqL2(Q)             
        43     3.50335000E+03   # mqL3(Q)             
        44     3.79204000E+03   # muR(Q)              
        45     3.79204000E+03   # mcR(Q)              
        46     1.69606000E+03   # mtR(Q)              
        47     2.39047000E+03   # mdR(Q)              
        48     2.39047000E+03   # msR(Q)              
        49     3.40980000E+03   # mbR(Q)              
#
Block HiggsBoundsInputHiggsCouplingsFermions
# ScalarNormEffCoupSq PseudoSNormEffCoupSq NP   IP1 IP2 IP2
    1.00581938E+00    0.00000000E+00        3  25   5   5  # h0-b-b eff. coupling^2, normalised to SM
    2.97871098E+03    0.00000000E+00        3  35   5   5  # H0-b-b eff. coupling^2, normalised to SM
    0.00000000E+00    2.97871680E+03        3  36   5   5  # A0-b-b eff. coupling^2, normalised to SM
#
    9.99998046E-01    0.00000000E+00        3  25   6   6  # h0-t-t eff. coupling^2, normalised to SM
    3.37668682E-04    0.00000000E+00        3  35   6   6  # H0-t-t eff. coupling^2, normalised to SM
    0.00000000E+00    3.35715030E-04        3  36   6   6  # A0-t-t eff. coupling^2, normalised to SM
#
    1.00581938E+00    0.00000000E+00        3  25  15  15  # h0-tau-tau eff. coupling^2, normalised to SM
    2.97871098E+03    0.00000000E+00        3  35  15  15  # H0-tau-tau eff. coupling^2, normalised to SM
    0.00000000E+00    2.97871680E+03        3  36  15  15  # A0-tau-tau eff. coupling^2, normalised to SM
#
Block HiggsBoundsInputHiggsCouplingsBosons
    9.99999997E-01        3  25  24  24  # h0-W-W eff. coupling^2, normalised to SM
    2.83402227E-09        3  35  24  24  # H0-W-W eff. coupling^2, normalised to SM
    0.00000000E+00        3  36  24  24  # A0-W-W eff. coupling^2, normalised to SM
#
    9.99999997E-01        3  25  23  23  # h0-Z-Z eff. coupling^2, normalised to SM
    2.83402227E-09        3  35  23  23  # H0-Z-Z eff. coupling^2, normalised to SM
    0.00000000E+00        3  36  23  23  # A0-Z-Z eff. coupling^2, normalised to SM
#
    8.92530931E-01        3  25  21  21  # h0-g-g eff. coupling^2, normalised to SM
    3.96283473E-13        3  35  21  21  # H0-g-g eff. coupling^2, normalised to SM
    7.68545894E-13        3  36  21  21  # A0-g-g eff. coupling^2, normalised to SM
#
    0.00000000E+00        3  25  25  23  # h0-h0-Z eff. coupling^2, normalised to SM
    0.00000000E+00        3  35  25  23  # H0-h0-Z eff. coupling^2, normalised to SM
    2.83402227E-09        3  36  25  23  # A0-h0-Z eff. coupling^2, normalised to SM
    0.00000000E+00        3  35  35  23  # H0-H0-Z eff. coupling^2, normalised to SM
    9.99999997E-01        3  36  35  23  # A0-H0-Z eff. coupling^2, normalised to SM
    0.00000000E+00        3  36  36  23  # A0-A0-Z eff. coupling^2, normalised to SM
#
    0.00000000E+00        4  25  21  21  23  # h0-g-g-Z eff. coupling^2, normalised to SM
    0.00000000E+00        4  35  21  21  23  # H0-g-g-Z eff. coupling^2, normalised to SM
    0.00000000E+00        4  36  21  21  23  # A0-g-g-Z eff. coupling^2, normalised to SM
#
#
#
#                             =================
#                             |The decay table|
#                             =================
#
# - The QCD corrections to the decays gluino -> squark  + quark
#                                     squark -> gaugino + quark_prime
#                                     squark -> squark_prime + Higgs
#                                     squark -> gluino  + quark
#   are included.
#
# - The multi-body decays for the inos, stops and sbottoms are included.
#
# - The loop induced decays for the gluino, neutralinos and stops
#   are included.
#
# - The SUSY decays of the top quark are included.
#
#
#         PDG            Width
DECAY         6     1.43098161E+00   # top decays
#          BR         NDA      ID1       ID2
     1.00000000E+00    2           5        24   # BR(t ->  b    W+)
#
#         PDG            Width
DECAY   1000021     3.26638234E+01   # gluino decays
#          BR         NDA      ID1       ID2
     1.24124870E-01    2     1000001        -1   # BR(~g -> ~d_L  db)
     1.24124870E-01    2    -1000001         1   # BR(~g -> ~d_L* d )
     1.25875410E-01    2     1000002        -2   # BR(~g -> ~u_L  ub)
     1.25875410E-01    2    -1000002         2   # BR(~g -> ~u_L* u )
     1.24124870E-01    2     1000003        -3   # BR(~g -> ~s_L  sb)
     1.24124870E-01    2    -1000003         3   # BR(~g -> ~s_L* s )
     1.25874850E-01    2     1000004        -4   # BR(~g -> ~c_L  cb)
     1.25874850E-01    2    -1000004         4   # BR(~g -> ~c_L* c )
#
#         PDG            Width
DECAY   1000006     2.89146402E+01   # stop1 decays
#          BR         NDA      ID1       ID2
     9.45810025E-02    2     1000022         6   # BR(~t_1 -> ~chi_10 t )
     3.31979506E-06    2     1000024         5   # BR(~t_1 -> ~chi_1+ b )
     9.05415678E-01    2     1000021         6   # BR(~t_1 -> ~g      t )
#
#         PDG            Width
DECAY   2000006     2.18550172E+02   # stop2 decays
#          BR         NDA      ID1       ID2
     2.28887761E-03    2     1000022         6   # BR(~t_2 -> ~chi_10 t )
     3.67430126E-02    2     1000023         6   # BR(~t_2 -> ~chi_20 t )
     1.18838422E-02    2     1000025         6   # BR(~t_2 -> ~chi_30 t )
     1.26060980E-02    2     1000035         6   # BR(~t_2 -> ~chi_40 t )
     7.45937047E-02    2     1000024         5   # BR(~t_2 -> ~chi_1+ b )
     9.21225126E-03    2     1000037         5   # BR(~t_2 -> ~chi_2+ b )
     7.15809356E-01    2     1000021         6   # BR(~t_2 -> ~g      t )
     7.26677863E-02    2     1000006        25   # BR(~t_2 -> ~t_1    h )
     6.33519086E-02    2     1000006        23   # BR(~t_2 -> ~t_1    Z )
     8.43162791E-04    2     1000005        24   # BR(~t_2 -> ~b_1    W+)
#
#         PDG            Width
DECAY   1000005     1.60519499E+02   # sbottom1 decays
#          BR         NDA      ID1       ID2
     1.09272122E-02    2     1000022         5   # BR(~b_1 -> ~chi_10 b )
     7.32939974E-03    2     1000023         5   # BR(~b_1 -> ~chi_20 b )
     4.55542118E-03    2     1000025         5   # BR(~b_1 -> ~chi_30 b )
     4.45909602E-03    2     1000035         5   # BR(~b_1 -> ~chi_40 b )
     1.44814408E-02    2    -1000024         6   # BR(~b_1 -> ~chi_1- t )
     7.42022151E-03    2    -1000037         6   # BR(~b_1 -> ~chi_2- t )
     9.33182958E-01    2     1000021         5   # BR(~b_1 -> ~g      b )
     1.76442506E-02    2     1000006       -24   # BR(~b_1 -> ~t_1    W-)
#
#         PDG            Width
DECAY   2000005     2.10300091E+02   # sbottom2 decays
#          BR         NDA      ID1       ID2
     2.67142223E-03    2     1000022         5   # BR(~b_2 -> ~chi_10 b )
     3.32176405E-02    2     1000023         5   # BR(~b_2 -> ~chi_20 b )
     4.97815110E-03    2     1000025         5   # BR(~b_2 -> ~chi_30 b )
     5.03296538E-03    2     1000035         5   # BR(~b_2 -> ~chi_40 b )
     6.53704806E-02    2    -1000024         6   # BR(~b_2 -> ~chi_1- t )
     2.69225401E-02    2    -1000037         6   # BR(~b_2 -> ~chi_2- t )
     7.47760279E-01    2     1000021         5   # BR(~b_2 -> ~g      b )
     3.76660074E-04    2     1000005        23   # BR(~b_2 -> ~b_1    Z )
     1.13669861E-01    2     1000006       -24   # BR(~b_2 -> ~t_1    W-)
#
#         PDG            Width
DECAY   1000002     7.63810820E-04   # sup_L decays
#          BR         NDA      ID1       ID2
     1.00000000E+00    2     1000022         2   # BR(~u_L -> ~chi_10 u)
#
#         PDG            Width
DECAY   2000002     2.46094440E+02   # sup_R decays
#          BR         NDA      ID1       ID2
     3.28214147E-02    2     1000022         2   # BR(~u_R -> ~chi_10 u)
     4.06655750E-09    2     1000023         2   # BR(~u_R -> ~chi_20 u)
     1.52149949E-06    2     1000025         2   # BR(~u_R -> ~chi_30 u)
     5.10086163E-07    2     1000035         2   # BR(~u_R -> ~chi_40 u)
     9.67176550E-01    2     1000021         2   # BR(~u_R -> ~g      u)
#
#         PDG            Width
DECAY   1000001     9.53419009E-04   # sdown_L decays
#          BR         NDA      ID1       ID2
     1.00000000E+00    2     1000022         1   # BR(~d_L -> ~chi_10 d)
#
#         PDG            Width
DECAY   2000001     1.06512575E+02   # sdown_R decays
#          BR         NDA      ID1       ID2
     1.06376407E-02    2     1000022         1   # BR(~d_R -> ~chi_10 d)
     5.58962083E-10    2     1000023         1   # BR(~d_R -> ~chi_20 d)
     9.89362359E-01    2     1000021         1   # BR(~d_R -> ~g      d)
#
#         PDG            Width
DECAY   1000004     7.03797273E-04   # scharm_L decays
#          BR         NDA      ID1       ID2
     1.00000000E+00    2     1000022         4   # BR(~c_L -> ~chi_10 c)
#
#         PDG            Width
DECAY   2000004     1.85099465E+02   # scharm_R decays
#          BR         NDA      ID1       ID2
     4.50235167E-02    2     1000022         4   # BR(~c_R -> ~chi_10 c)
     5.57530906E-09    2     1000023         4   # BR(~c_R -> ~chi_20 c)
     2.06717120E-06    2     1000025         4   # BR(~c_R -> ~chi_30 c)
     6.93002622E-07    2     1000035         4   # BR(~c_R -> ~chi_40 c)
     9.54973718E-01    2     1000021         4   # BR(~c_R -> ~g      c)
#
#         PDG            Width
DECAY   1000003     8.84151504E-04   # sstrange_L decays
#          BR         NDA      ID1       ID2
     1.00000000E+00    2     1000022         3   # BR(~s_L -> ~chi_10 s)
#
#         PDG            Width
DECAY   2000003     7.94339984E+01   # sstrange_R decays
#          BR         NDA      ID1       ID2
     1.47669503E-02    2     1000022         3   # BR(~s_R -> ~chi_10 s)
     7.67424353E-10    2     1000023         3   # BR(~s_R -> ~chi_20 s)
     9.85233049E-01    2     1000021         3   # BR(~s_R -> ~g      s)
#
#         PDG            Width
DECAY   1000011     1.45607929E+00   # selectron_L decays
#          BR         NDA      ID1       ID2
     1.00000000E+00    2     1000022        11   # BR(~e_L -> ~chi_10 e-)
#
#         PDG            Width
DECAY   2000011     8.00935188E+00   # selectron_R decays
#          BR         NDA      ID1       ID2
     9.99999984E-01    2     1000022        11   # BR(~e_R -> ~chi_10 e-)
     1.57613227E-08    2     1000023        11   # BR(~e_R -> ~chi_20 e-)
#
#         PDG            Width
DECAY   1000013     1.45607927E+00   # smuon_L decays
#          BR         NDA      ID1       ID2
     1.00000000E+00    2     1000022        13   # BR(~mu_L -> ~chi_10 mu-)
#
#         PDG            Width
DECAY   2000013     8.00935182E+00   # smuon_R decays
#          BR         NDA      ID1       ID2
     9.99999984E-01    2     1000022        13   # BR(~mu_R -> ~chi_10 mu-)
     1.57613214E-08    2     1000023        13   # BR(~mu_R -> ~chi_20 mu-)
#
#         PDG            Width
DECAY   1000015     1.03614784E+01   # stau_1 decays
#          BR         NDA      ID1       ID2
     9.94795612E-01    2     1000022        15   # BR(~tau_1 -> ~chi_10  tau-)
     1.71583621E-03    2     1000023        15   # BR(~tau_1 -> ~chi_20  tau-)
     3.48855224E-03    2    -1000024        16   # BR(~tau_1 -> ~chi_1-  nu_tau)
#
#         PDG            Width
DECAY   2000015     3.43294630E+01   # stau_2 decays
#          BR         NDA      ID1       ID2
     1.18912543E-01    2     1000022        15   # BR(~tau_2 -> ~chi_10  tau-)
     2.15516605E-01    2     1000023        15   # BR(~tau_2 -> ~chi_20  tau-)
     2.03092693E-02    2     1000025        15   # BR(~tau_2 -> ~chi_30  tau-)
     2.02541122E-02    2     1000035        15   # BR(~tau_2 -> ~chi_40  tau-)
     4.29259257E-01    2    -1000024        16   # BR(~tau_2 -> ~chi_1-  nu_tau)
     5.49710279E-04    2    -1000037        16   # BR(~tau_2 -> ~chi_2-  nu_tau)
     9.82526717E-02    2     1000015        25   # BR(~tau_2 -> ~tau_1   h)
     9.69458320E-02    2     1000015        23   # BR(~tau_2 -> ~tau_1   Z)
#
#         PDG            Width
DECAY   1000012     1.45102552E+00   # snu_eL decays
#          BR         NDA      ID1       ID2
     1.00000000E+00    2     1000022        12   # BR(~nu_eL -> ~chi_10 nu_e)
#
#         PDG            Width
DECAY   1000014     1.45102552E+00   # snu_muL decays
#          BR         NDA      ID1       ID2
     1.00000000E+00    2     1000022        14   # BR(~nu_muL -> ~chi_10 nu_mu)
#
#         PDG            Width
DECAY   1000016     3.41294264E+01   # snu_tauL decays
#          BR         NDA      ID1       ID2
     1.18851342E-01    2     1000022        16   # BR(~nu_tauL -> ~chi_10 nu_tau)
     2.16984214E-01    2     1000023        16   # BR(~nu_tauL -> ~chi_20 nu_tau)
     1.29066887E-05    2     1000025        16   # BR(~nu_tauL -> ~chi_30 nu_tau)
     7.63065066E-05    2     1000035        16   # BR(~nu_tauL -> ~chi_40 nu_tau)
     4.35553585E-01    2     1000024        15   # BR(~nu_tauL -> ~chi_1+ tau-)
     3.99415598E-02    2     1000037        15   # BR(~nu_tauL -> ~chi_2+ tau-)
     1.88580085E-01    2    -1000015       -24   # BR(~nu_tauL -> ~tau_1+ W-)
#
#         PDG            Width
DECAY   1000024     5.28364780E+01   # chargino1+ decays
#          BR         NDA      ID1       ID2
     2.50274030E-01    2     1000002        -1   # BR(~chi_1+ -> ~u_L     db)
     2.48508264E-01    2    -1000001         2   # BR(~chi_1+ -> ~d_L*    u )
     2.50274022E-01    2     1000004        -3   # BR(~chi_1+ -> ~c_L     sb)
     2.48508133E-01    2    -1000003         4   # BR(~chi_1+ -> ~s_L*     c )
     6.27628166E-04    2     1000012       -11   # BR(~chi_1+ -> ~nu_eL   e+  )
     6.27628166E-04    2     1000014       -13   # BR(~chi_1+ -> ~nu_muL  mu+ )
     5.83932666E-04    2    -1000011        12   # BR(~chi_1+ -> ~e_L+    nu_e)
     5.83932666E-04    2    -1000013        14   # BR(~chi_1+ -> ~mu_L+   nu_mu)
     1.24289560E-05    2     1000022        24   # BR(~chi_1+ -> ~chi_10  W+)
#
#         PDG            Width
DECAY   1000037     4.04017025E+01   # chargino2+ decays
#          BR         NDA      ID1       ID2
     8.49502333E-04    2     1000002        -1   # BR(~chi_2+ -> ~u_L     db)
     2.43751117E-03    2    -1000001         2   # BR(~chi_2+ -> ~d_L*    u )
     8.49502330E-04    2     1000004        -3   # BR(~chi_2+ -> ~c_L     sb)
     2.43751104E-03    2    -1000003         4   # BR(~chi_2+ -> ~s_L*     c )
     5.85123485E-01    2     1000006        -5   # BR(~chi_2+ -> ~t_1     bb)
     1.47962817E-04    2     1000012       -11   # BR(~chi_2+ -> ~nu_eL   e+  )
     1.47962817E-04    2     1000014       -13   # BR(~chi_2+ -> ~nu_muL mu+ )
     4.24109775E-04    2    -1000011        12   # BR(~chi_2+ -> ~e_L+    nu_e)
     4.24109775E-04    2    -1000013        14   # BR(~chi_2+ -> ~mu_L+   nu_mu)
     1.88837022E-02    2    -1000015        16   # BR(~chi_2+ -> ~tau_1+  nu_tau)
     1.10761174E-01    2     1000024        23   # BR(~chi_2+ -> ~chi_1+  Z )
     4.58353179E-02    2     1000022        24   # BR(~chi_2+ -> ~chi_10  W+)
     1.12449857E-01    2     1000023        24   # BR(~chi_2+ -> ~chi_20  W+)
     1.19228292E-01    2     1000024        25   # BR(~chi_2+ -> ~chi_1+  h )
#
#         PDG            Width
DECAY   1000022     0.00000000E+00   # neutralino1 decays
#
#         PDG            Width
DECAY   1000023     5.28308631E+01   # neutralino2 decays
#          BR         NDA      ID1       ID2
     1.08287257E-05    2     1000022        23   # BR(~chi_20 -> ~chi_10   Z )
     1.20326433E-06    2     1000022        25   # BR(~chi_20 -> ~chi_10   h )
     1.25021731E-01    2     1000002        -2   # BR(~chi_20 -> ~u_L      ub)
     1.25021731E-01    2    -1000002         2   # BR(~chi_20 -> ~u_L*     u )
     1.24372652E-01    2     1000001        -1   # BR(~chi_20 -> ~d_L      db)
     1.24372652E-01    2    -1000001         1   # BR(~chi_20 -> ~d_L*     d )
     1.25021666E-01    2     1000004        -4   # BR(~chi_20 -> ~c_L      cb)
     1.25021666E-01    2    -1000004         4   # BR(~chi_20 -> ~c_L*     c )
     1.24372652E-01    2     1000003        -3   # BR(~chi_20 -> ~s _L      sb)
     1.24372652E-01    2    -1000003         3   # BR(~chi_20 -> ~s _L*     s )
     2.90902049E-04    2     1000011       -11   # BR(~chi_20 -> ~e_L-     e+)
     2.90902049E-04    2    -1000011        11   # BR(~chi_20 -> ~e_L+     e-)
     2.90902049E-04    2     1000013       -13   # BR(~chi_20 -> ~mu_L-    mu+)
     2.90902049E-04    2    -1000013        13   # BR(~chi_20 -> ~mu_L+    mu-)
     3.11739400E-04    2     1000012       -12   # BR(~chi_20 -> ~nu_eL    nu_eb)
     3.11739400E-04    2    -1000012        12   # BR(~chi_20 -> ~nu_eL*   nu_e )
     3.11739400E-04    2     1000014       -14   # BR(~chi_20 -> ~nu_muL   nu_mub)
     3.11739400E-04    2    -1000014        14   # BR(~chi_20 -> ~nu_muL*  nu_mu )
#
#         PDG            Width
DECAY   1000025     3.87404202E+01   # neutralino3 decays
#          BR         NDA      ID1       ID2
     1.24220038E-02    2     1000022        23   # BR(~chi_30 -> ~chi_10   Z )
     1.02982534E-01    2     1000023        23   # BR(~chi_30 -> ~chi_20   Z )
     1.12038169E-01    2     1000024       -24   # BR(~chi_30 -> ~chi_1+   W-)
     1.12038169E-01    2    -1000024        24   # BR(~chi_30 -> ~chi_1-   W+)
     3.72134901E-02    2     1000022        25   # BR(~chi_30 -> ~chi_10   h )
     7.64045613E-03    2     1000023        25   # BR(~chi_30 -> ~chi_20   h )
     3.11160121E-05    2     1000002        -2   # BR(~chi_30 -> ~u_L      ub)
     3.11160121E-05    2    -1000002         2   # BR(~chi_30 -> ~u_L*     u )
     8.26187730E-05    2     1000001        -1   # BR(~chi_30 -> ~d_L      db)
     8.26187730E-05    2    -1000001         1   # BR(~chi_30 -> ~d_L*     d )
     1.25489356E-06    2     2000001        -1   # BR(~chi_30 -> ~d_R      db)
     1.25489356E-06    2    -2000001         1   # BR(~chi_30 -> ~d_R*     d )
     3.11160105E-05    2     1000004        -4   # BR(~chi_30 -> ~c_L      cb)
     3.11160105E-05    2    -1000004         4   # BR(~chi_30 -> ~c_L*     c )
     8.26187730E-05    2     1000003        -3   # BR(~chi_30 -> ~s _L      sb)
     8.26187730E-05    2    -1000003         3   # BR(~chi_30 -> ~s _L*     s )
     1.25489356E-06    2     2000003        -3   # BR(~chi_30 -> ~s _R      sb)
     1.25489356E-06    2    -2000003         3   # BR(~chi_30 -> ~s _R*     s )
     2.97660425E-01    2     1000006        -6   # BR(~chi_30 -> ~t_1      tb)
     2.97660425E-01    2    -1000006         6   # BR(~chi_30 -> ~t_1*     t )
     7.36009200E-07    2     1000011       -11   # BR(~chi_30 -> ~e_L-     e+)
     7.36009200E-07    2    -1000011        11   # BR(~chi_30 -> ~e_L+     e-)
     1.15898531E-05    2     2000011       -11   # BR(~chi_30 -> ~e_R-     e+)
     1.15898531E-05    2    -2000011        11   # BR(~chi_30 -> ~e_R+     e-)
     7.36009200E-07    2     1000013       -13   # BR(~chi_30 -> ~mu_L-    mu+)
     7.36009200E-07    2    -1000013        13   # BR(~chi_30 -> ~mu_L+    mu-)
     1.15898531E-05    2     2000013       -13   # BR(~chi_30 -> ~mu_R-    mu+)
     1.15898531E-05    2    -2000013        13   # BR(~chi_30 -> ~mu_R+    mu-)
     9.86217718E-03    2     1000015       -15   # BR(~chi_30 -> ~tau_1-   tau+)
     9.86217718E-03    2    -1000015        15   # BR(~chi_30 -> ~tau_1+   tau-)
     2.76777487E-05    2     1000012       -12   # BR(~chi_30 -> ~nu_eL    nu_eb)
     2.76777487E-05    2    -1000012        12   # BR(~chi_30 -> ~nu_eL*   nu_e )
     2.76777487E-05    2     1000014       -14   # BR(~chi_30 -> ~nu_muL   nu_mub)
     2.76777487E-05    2    -1000014        14   # BR(~chi_30 -> ~nu_muL*  nu_mu )
#
#         PDG            Width
DECAY   1000035     3.95545223E+01   # neutralino4 decays
#          BR         NDA      ID1       ID2
     3.60121528E-02    2     1000022        23   # BR(~chi_40 -> ~chi_10   Z )
     7.18484528E-03    2     1000023        23   # BR(~chi_40 -> ~chi_20   Z )
     1.00546439E-01    2     1000024       -24   # BR(~chi_40 -> ~chi_1+   W-)
     1.00546439E-01    2    -1000024        24   # BR(~chi_40 -> ~chi_1-   W+)
     1.19851985E-02    2     1000022        25   # BR(~chi_40 -> ~chi_10   h )
     1.14378507E-01    2     1000023        25   # BR(~chi_40 -> ~chi_20   h )
     6.97374406E-04    2     1000002        -2   # BR(~chi_40 -> ~u_L      ub)
     6.97374406E-04    2    -1000002         2   # BR(~chi_40 -> ~u_L*     u )
     8.06857046E-04    2     1000001        -1   # BR(~chi_40 -> ~d_L      db)
     8.06857046E-04    2    -1000001         1   # BR(~chi_40 -> ~d_L*     d )
     4.15325358E-07    2     2000001        -1   # BR(~chi_40 -> ~d_R      db)
     4.15325358E-07    2    -2000001         1   # BR(~chi_40 -> ~d_R*     d )
     6.97374371E-04    2     1000004        -4   # BR(~chi_40 -> ~c_L      cb)
     6.97374371E-04    2    -1000004         4   # BR(~chi_40 -> ~c_L*     c )
     8.06857046E-04    2     1000003        -3   # BR(~chi_40 -> ~s _L      sb)
     8.06857046E-04    2    -1000003         3   # BR(~chi_40 -> ~s _L*     s )
     4.15325358E-07    2     2000003        -3   # BR(~chi_40 -> ~s _R      sb)
     4.15325358E-07    2    -2000003         3   # BR(~chi_40 -> ~s _R*     s )
     3.01481492E-01    2     1000006        -6   # BR(~chi_40 -> ~t_1      tb)
     3.01481492E-01    2    -1000006         6   # BR(~chi_40 -> ~t_1*     t )
     1.03272362E-04    2     1000011       -11   # BR(~chi_40 -> ~e_L-     e+)
     1.03272362E-04    2    -1000011        11   # BR(~chi_40 -> ~e_L+     e-)
     3.82483664E-06    2     2000011       -11   # BR(~chi_40 -> ~e_R-     e+)
     3.82483664E-06    2    -2000011        11   # BR(~chi_40 -> ~e_R+     e-)
     1.03272362E-04    2     1000013       -13   # BR(~chi_40 -> ~mu_L-    mu+)
     1.03272362E-04    2    -1000013        13   # BR(~chi_40 -> ~mu_L+    mu-)
     3.82483664E-06    2     2000013       -13   # BR(~chi_40 -> ~mu_R-    mu+)
     3.82483664E-06    2    -2000013        13   # BR(~chi_40 -> ~mu_R+    mu-)
     9.64548710E-03    2     1000015       -15   # BR(~chi_40 -> ~tau_1-   tau+)
     9.64548710E-03    2    -1000015        15   # BR(~chi_40 -> ~tau_1+   tau-)
     1.61370730E-04    2     1000012       -12   # BR(~chi_40 -> ~nu_eL    nu_eb)
     1.61370730E-04    2    -1000012        12   # BR(~chi_40 -> ~nu_eL*   nu_e )
     1.61370730E-04    2     1000014       -14   # BR(~chi_40 -> ~nu_muL   nu_mub)
     1.61370730E-04    2    -1000014        14   # BR(~chi_40 -> ~nu_muL*  nu_mu )
#
#         PDG            Width
DECAY        25     4.64561104E-03   # h decays
#          BR         NDA      ID1       ID2
     6.62136933E-01    2           5        -5   # BR(h -> b       bb     )
     5.58084290E-02    2         -15        15   # BR(h -> tau+    tau-   )
     1.97603446E-04    2         -13        13   # BR(h -> mu+     mu-    )
     2.15177596E-04    2           3        -3   # BR(h -> s       sb     )
     1.86066820E-02    2           4        -4   # BR(h -> c       cb     )
     6.79800926E-02    2          21        21   # BR(h -> g       g      )
     1.99314987E-03    2          22        22   # BR(h -> gam     gam    )
     1.28345491E-03    2          22        23   # BR(h -> Z       gam    )
     1.70626829E-01    2          24       -24   # BR(h -> W+      W-     )
     2.11516488E-02    2          23        23   # BR(h -> Z       Z      )
#
#         PDG            Width
DECAY        35     1.25727178E+02   # H decays
#          BR         NDA      ID1       ID2
     7.67698240E-01    2           5        -5   # BR(H -> b       bb     )
     2.22771069E-01    2         -15        15   # BR(H -> tau+    tau-   )
     8.67140794E-04    2         -13        13   # BR(H -> mu+     mu-    )
     1.31996255E-04    2           3        -3   # BR(H -> s       sb     )
     4.23692730E-09    2           4        -4   # BR(H -> c       cb     )
     4.18330155E-04    2           6        -6   # BR(H -> t       tb     )
     1.39140483E-05    2          21        21   # BR(H -> g       g      )
     1.28391032E-08    2          22        22   # BR(H -> gam     gam    )
     8.20568618E-09    2          23        22   # BR(H -> Z       gam    )
     4.61112151E-07    2          24       -24   # BR(H -> W+      W-     )
     2.30174993E-07    2          23        23   # BR(H -> Z       Z      )
     1.21692296E-06    2          25        25   # BR(H -> h       h      )
     1.09273798E-04    2     1000024  -1000024   # BR(H -> ~chi_1+ ~chi_1-)
     1.73537936E-05    2     1000022   1000022   # BR(H -> ~chi_10 ~chi_10)
     5.26728505E-05    2     1000023   1000023   # BR(H -> ~chi_20 ~chi_20)
     1.41964647E-04    2     1000022   1000023   # BR(H -> ~chi_10 ~chi_20)
     1.19671103E-03    2     1000022   1000025   # BR(H -> ~chi_10 ~chi_30)
     5.02446789E-03    2     1000022   1000035   # BR(H -> ~chi_10 ~chi_40)
     8.34483926E-08    2     1000002  -1000002   # BR(H -> ~u_L    ~u_L*  )
     8.34483926E-08    2     1000004  -1000004   # BR(H -> ~c_L    ~c_L*  )
     1.55443540E-03    2     1000006  -1000006   # BR(H -> ~t_1    ~t_1*  )
     1.22277539E-07    2     1000001  -1000001   # BR(H -> ~d_L    ~d_L*  )
     1.22277539E-07    2     1000003  -1000003   # BR(H -> ~s_L    ~s_L*  )
     1.01070854E-08    2     1000011  -1000011   # BR(H -> ~e_L-   ~e_L+  )
     1.01070854E-08    2     1000013  -1000013   # BR(H -> ~mu_L-  ~mu_L+ )
     3.29371757E-08    2     1000012  -1000012   # BR(H -> ~nu_eL  ~nu_eL*   )
     3.29371757E-08    2     1000014  -1000014   # BR(H -> ~nu_muL ~nu_muL*  )
#
#         PDG            Width
DECAY        36     1.25592923E+02   # A decays
#          BR         NDA      ID1       ID2
     7.68538278E-01    2           5        -5   # BR(A -> b       bb     )
     2.23012478E-01    2         -15        15   # BR(A -> tau+    tau-   )
     8.68079723E-04    2         -13        13   # BR(A -> mu+     mu-    )
     1.32142312E-04    2           3        -3   # BR(A -> s       sb     )
     4.25618793E-09    2           4        -4   # BR(A -> c       cb     )
     4.18333915E-04    2           6        -6   # BR(A -> t       tb     )
     1.93985653E-05    2          21        21   # BR(A -> g       g      )
     2.32977629E-08    2          22        22   # BR(A -> gam     gam    )
     1.48137165E-08    2          23        22   # BR(A -> Z       gam    )
     4.68422105E-07    2          23        25   # BR(A -> Z       h      )
     4.35366092E-04    2     1000024  -1000024   # BR(A -> ~chi_1+ ~chi_1-)
     2.04629602E-05    2     1000022   1000022   # BR(A -> ~chi_10 ~chi_10)
     2.09854290E-04    2     1000023   1000023   # BR(A -> ~chi_20 ~chi_20)
     9.22132038E-05    2     1000022   1000023   # BR(A -> ~chi_10 ~chi_20)
     5.06737469E-03    2     1000022   1000025   # BR(A -> ~chi_10 ~chi_30)
     1.18550786E-03    2     1000022   1000035   # BR(A -> ~chi_10 ~chi_40)
#
#         PDG            Width
DECAY        37     9.77159984E+01   # H+ decays
#          BR         NDA      ID1       ID2
     1.18085931E-03    2           4        -5   # BR(H+ -> c       bb     )
     2.86704819E-01    2         -15        16   # BR(H+ -> tau+    nu_tau )
     1.11600320E-03    2         -13        14   # BR(H+ -> mu+     nu_mu  )
     1.18085850E-05    2           2        -5   # BR(H+ -> u       bb     )
     8.50209362E-06    2           2        -3   # BR(H+ -> u       sb     )
     1.67352276E-04    2           4        -3   # BR(H+ -> c       sb     )
     7.02513504E-01    2           6        -5   # BR(H+ -> t       bb     )
     6.02710448E-07    2          24        25   # BR(H+ -> W+      h      )
     1.19965504E-14    2          24        36   # BR(H+ -> W+      A      )
     3.07573972E-04    2     1000024   1000022   # BR(H+ -> ~chi_1+ ~chi_10)
     5.96182584E-08    2     1000024   1000023   # BR(H+ -> ~chi_1+ ~chi_20)
     7.98829051E-03    2     1000037   1000022   # BR(H+ -> ~chi_2+ ~chi_10)
     5.10154346E-08    2    -1000011   1000012   # BR(H+ -> ~e_L+   ~nu_eL )
     5.10154346E-08    2    -1000013   1000014   # BR(H+ -> ~mu_L+  ~nu_muL)
     2.61515594E-07    2     1000002  -1000001   # BR(H+ -> ~u_L    ~d_L*  )
     2.61515594E-07    2     1000004  -1000003   # BR(H+ -> ~c_L    ~s_L*  )
