#
#                              ======================
#                              | THE SUSYHIT OUTPUT |
#                              ======================
#
#
#              ------------------------------------------------------
#              |     This is the output of the SUSY-HIT package     |
#              |  created by A.Djouadi, M.Muehlleitner and M.Spira. |
#              |  In case of problems with SUSY-HIT email to        |
#              |           margarete.muehlleitner@cern.ch           |
#              |           michael.spira@psi.ch                     |
#              |           abdelhak.djouadi@cern.ch                 |
#              ------------------------------------------------------
#
#              ------------------------------------------------------
#              |  SUSY Les Houches Accord - MSSM Spectrum + Decays  |
#              |              based on the decay programs           |
#              |                                                    |
#              |                     SDECAY 1.3b                    |
#              |                                                    |
#              |  Authors: M.Muhlleitner, A.Djouadi and Y.Mambrini  |
#              |  Ref.:    Comput.Phys.Commun.168(2005)46           |
#              |           [hep-ph/0311167]                         |
#              |                                                    |
#              |                     HDECAY 3.4                     |
#              |                                                    |
#              |  By: A.Djouadi,J.Kalinowski,M.Muhlleitner,M.Spira  |
#              |  Ref.:    Comput.Phys.Commun.108(1998)56           |
#              |           [hep-ph/9704448]                         |
#              |                                                    |
#              |                                                    |
#              |  If not stated otherwise all DRbar couplings and   |
#              |  soft SUSY breaking masses are given at the scale  |
#              |  Q=  0.29489260E+04
#              |                                                    |
#              ------------------------------------------------------
#
#
BLOCK DCINFO  # Decay Program information
     1   SDECAY/HDECAY # decay calculator
     2   1.3b  /3.4    # version number
#
BLOCK SPINFO  # Spectrum calculator information
     1     SOFTSUSY    # spectrum calculator               
     2     3.4.0       # version number                    
#
BLOCK MODSEL  # Model selection
     1     0   #  nonUniversal                                     
#
BLOCK SMINPUTS  # Standard Model inputs
         1     1.27908970E+02   # alpha_em^-1(M_Z)^MSbar
         2     1.16637870E-05   # G_F [GeV^-2]
         3     1.18400000E-01   # alpha_S(M_Z)^MSbar
         4     9.11876000E+01   # M_Z pole mass
         5     4.18000000E+00   # mb(mb)^MSbar
         6     1.73200000E+02   # mt pole mass
         7     1.77700000E+00   # mtau pole mass
#
BLOCK MINPAR  # Input parameters - minimal models
         3     4.19300000E+01   # tanb                
#
BLOCK EXTPAR  # Input parameters - non-minimal models
         0    -1.00000000E+00   # Set                 
         1     2.73055000E+03   # M_1(MX)             
         2     7.79060000E+02   # M_2(MX)             
         3     3.02229000E+03   # M_3(MX)             
        11    -4.11182000E+03   # At(MX)              
        12     1.30124000E+03   # Ab(MX)              
        13     3.01025000E+03   # Atau(MX)            
        23    -2.06050000E+02   # mu(MX)              
        26     2.31612000E+03   # mA(pole)            
        31     2.93957000E+03   # meL(MX)             
        32     2.93957000E+03   # mmuL(MX)            
        33     1.85498000E+03   # mtauL(MX)           
        34     2.18319000E+03   # meR(MX)             
        35     2.18319000E+03   # mmuR(MX)            
        36     3.68420000E+03   # mtauR(MX)           
        41     8.70960000E+02   # mqL1(MX)            
        42     8.70960000E+02   # mqL2(MX)            
        43     2.29702000E+03   # mqL3(MX)            
        44     3.38846000E+03   # muR(MX)             
        45     3.38846000E+03   # mcR(MX)             
        46     3.78564000E+03   # mtR(MX)             
        47     2.30010000E+03   # mdR(MX)             
        48     2.30010000E+03   # msR(MX)             
        49     2.91898000E+03   # mbR(MX)             
#
BLOCK MASS  # Mass Spectrum
# PDG code           mass       particle
        24     8.03650936E+01   # W+
        25     1.27608150E+02   # h
        35     2.31612604E+03   # H
        36     2.31612013E+03   # A
        37     2.31791410E+03   # H+
         5     4.81876030E+00   # b-quark pole mass calculated from mb(mb)_Msbar
   1000001     1.07327987E+03   # ~d_L
   2000001     2.42089867E+03   # ~d_R
   1000002     1.07032952E+03   # ~u_L
   2000002     3.47751332E+03   # ~u_R
   1000003     1.07327987E+03   # ~s_L
   2000003     2.42089867E+03   # ~s_R
   1000004     1.07032952E+03   # ~c_L
   2000004     3.47751332E+03   # ~c_R
   1000005     2.38139597E+03   # ~b_1
   2000005     3.00179278E+03   # ~b_2
   1000006     2.37629505E+03   # ~t_1
   2000006     3.79775518E+03   # ~t_2
   1000011     2.94675999E+03   # ~e_L
   2000011     2.19870474E+03   # ~e_R
   1000012     2.94537870E+03   # ~nu_eL
   1000013     2.94675999E+03   # ~mu_L
   2000013     2.19870474E+03   # ~mu_R
   1000014     2.94537870E+03   # ~nu_muL
   1000015     1.85474362E+03   # ~tau_1
   2000015     3.67843675E+03   # ~tau_2
   1000016     1.85275498E+03   # ~nu_tauL
   1000021     3.11435788E+03   # ~g
   1000022     2.11824138E+02   # ~chi_10
   1000023    -2.20901384E+02   # ~chi_20
   1000025     8.05564158E+02   # ~chi_30
   1000035     2.70178824E+03   # ~chi_40
   1000024     2.15743503E+02   # ~chi_1+
   1000037     8.05790628E+02   # ~chi_2+
#
BLOCK NMIX  # Neutralino Mixing Matrix
  1  1    -1.19550743E-02   # N_11
  1  2     9.14161635E-02   # N_12
  1  3     7.13323671E-01   # N_13
  1  4     6.94744199E-01   # N_14
  2  1    -1.09210084E-02   # N_21
  2  2     5.69216885E-02   # N_22
  2  3    -7.00370390E-01   # N_23
  2  4     7.11422498E-01   # N_24
  3  1     2.44778164E-03   # N_31
  3  2     9.94184334E-01   # N_32
  3  3    -2.54906160E-02   # N_33
  3  4    -1.04602809E-01   # N_34
  4  1     9.99865899E-01   # N_41
  4  2    -7.19113334E-04   # N_42
  4  3     9.41608331E-04   # N_43
  4  4     1.63334047E-02   # N_44
#
BLOCK UMIX  # Chargino Mixing Matrix U
  1  1     3.63690542E-02   # U_11
  1  2     9.99338427E-01   # U_12
  2  1    -9.99338427E-01   # U_21
  2  2     3.63690542E-02   # U_22
#
BLOCK VMIX  # Chargino Mixing Matrix V
  1  1     1.48965470E-01   # V_11
  1  2    -9.88842398E-01   # V_12
  2  1    -9.88842398E-01   # V_21
  2  2    -1.48965470E-01   # V_22
#
BLOCK STOPMIX  # Stop Mixing Matrix
  1  1     9.97788019E-01   # cos(theta_t)
  1  2     6.64760795E-02   # sin(theta_t)
  2  1    -6.64760795E-02   # -sin(theta_t)
  2  2     9.97788019E-01   # cos(theta_t)
#
BLOCK SBOTMIX  # Sbottom Mixing Matrix
  1  1     9.99976647E-01   # cos(theta_b)
  1  2    -6.83413891E-03   # sin(theta_b)
  2  1     6.83413891E-03   # -sin(theta_b)
  2  2     9.99976647E-01   # cos(theta_b)
#
BLOCK STAUMIX  # Stau Mixing Matrix
  1  1     9.99997997E-01   # cos(theta_tau)
  1  2    -2.00149844E-03   # sin(theta_tau)
  2  1     2.00149844E-03   # -sin(theta_tau)
  2  2     9.99997997E-01   # cos(theta_tau)
#
BLOCK ALPHA  # Higgs mixing
          -2.44501080E-02   # Mixing angle in the neutral Higgs boson sector
#
BLOCK HMIX Q=  2.94892600E+03  # DRbar Higgs Parameters
         1    -2.10818581E+02   # mu(Q)MSSM           
         2     4.10749171E+01   # tan                 
         3     2.41698016E+02   # higgs               
         4     5.13531159E+06   # mA^2(Q)MSSM         
#
BLOCK GAUGE Q=  2.94892600E+03  # The gauge couplings
     1     3.65122386E-01   # gprime(Q) DRbar
     2     6.41587092E-01   # g(Q) DRbar
     3     1.01253602E+00   # g3(Q) DRbar
#
BLOCK AU Q=  2.94892600E+03  # The trilinear couplings
  1  1     0.00000000E+00   # A_u(Q) DRbar
  2  2     0.00000000E+00   # A_c(Q) DRbar
  3  3    -4.11181998E+03   # A_t(Q) DRbar
#
BLOCK AD Q=  2.94892600E+03  # The trilinear couplings
  1  1     0.00000000E+00   # A_d(Q) DRbar
  2  2     0.00000000E+00   # A_s(Q) DRbar
  3  3     1.30124001E+03   # A_b(Q) DRbar
#
BLOCK AE Q=  2.94892600E+03  # The trilinear couplings
  1  1     0.00000000E+00   # A_e(Q) DRbar
  2  2     0.00000000E+00   # A_mu(Q) DRbar
  3  3     3.01025000E+03   # A_tau(Q) DRbar
#
BLOCK Yu Q=  2.94892600E+03  # The Yukawa couplings
  1  1     0.00000000E+00   # y_u(Q) DRbar
  2  2     0.00000000E+00   # y_c(Q) DRbar
  3  3     8.15053859E-01   # y_t(Q) DRbar
#
BLOCK Yd Q=  2.94892600E+03  # The Yukawa couplings
  1  1     0.00000000E+00   # y_d(Q) DRbar
  2  2     0.00000000E+00   # y_s(Q) DRbar
  3  3     5.58973826E-01   # y_b(Q) DRbar
#
BLOCK Ye Q=  2.94892600E+03  # The Yukawa couplings
  1  1     0.00000000E+00   # y_e(Q) DRbar
  2  2     0.00000000E+00   # y_mu(Q) DRbar
  3  3     4.14923477E-01   # y_tau(Q) DRbar
#
BLOCK MSOFT Q=  2.94892600E+03  # The soft SUSY breaking masses at the scale Q
         1     2.73055000E+03   # M_1(Q)              
         2     7.79060000E+02   # M_2(Q)              
         3     3.02229000E+03   # M_3(Q)              
        21     5.50689940E+06   # mH1^2(Q)            
        22     9.47319369E+04   # mH2^2(Q)            
        31     2.93957000E+03   # meL(Q)              
        32     2.93957000E+03   # mmuL(Q)             
        33     1.85498000E+03   # mtauL(Q)            
        34     2.18319000E+03   # meR(Q)              
        35     2.18319000E+03   # mmuR(Q)             
        36     3.68420000E+03   # mtauR(Q)            
        41     8.70959968E+02   # mqL1(Q)             
        42     8.70959968E+02   # mqL2(Q)             
        43     2.29701997E+03   # mqL3(Q)             
        44     3.38845999E+03   # muR(Q)              
        45     3.38845999E+03   # mcR(Q)              
        46     3.78563998E+03   # mtR(Q)              
        47     2.30009999E+03   # mdR(Q)              
        48     2.30009999E+03   # msR(Q)              
        49     2.91897999E+03   # mbR(Q)              
#
Block HiggsBoundsInputHiggsCouplingsFermions
# ScalarNormEffCoupSq PseudoSNormEffCoupSq NP   IP1 IP2 IP2
    1.00898741E+00    0.00000000E+00        3  25   5   5  # h0-b-b eff. coupling^2, normalised to SM
    1.68713983E+03    0.00000000E+00        3  35   5   5  # H0-b-b eff. coupling^2, normalised to SM
    0.00000000E+00    1.68714881E+03        3  36   5   5  # A0-b-b eff. coupling^2, normalised to SM
#
    9.99994673E-01    0.00000000E+00        3  25   6   6  # h0-t-t eff. coupling^2, normalised to SM
    5.98042926E-04    0.00000000E+00        3  35   6   6  # H0-t-t eff. coupling^2, normalised to SM
    0.00000000E+00    5.92715943E-04        3  36   6   6  # A0-t-t eff. coupling^2, normalised to SM
#
    1.00898741E+00    0.00000000E+00        3  25  15  15  # h0-tau-tau eff. coupling^2, normalised to SM
    1.68713983E+03    0.00000000E+00        3  35  15  15  # H0-tau-tau eff. coupling^2, normalised to SM
    0.00000000E+00    1.68714881E+03        3  36  15  15  # A0-tau-tau eff. coupling^2, normalised to SM
#
Block HiggsBoundsInputHiggsCouplingsBosons
    9.99999988E-01        3  25  24  24  # h0-W-W eff. coupling^2, normalised to SM
    1.19154962E-08        3  35  24  24  # H0-W-W eff. coupling^2, normalised to SM
    0.00000000E+00        3  36  24  24  # A0-W-W eff. coupling^2, normalised to SM
#
    9.99999988E-01        3  25  23  23  # h0-Z-Z eff. coupling^2, normalised to SM
    1.19154962E-08        3  35  23  23  # H0-Z-Z eff. coupling^2, normalised to SM
    0.00000000E+00        3  36  23  23  # A0-Z-Z eff. coupling^2, normalised to SM
#
    8.88007311E-01        3  25  21  21  # h0-g-g eff. coupling^2, normalised to SM
    2.17151949E-11        3  35  21  21  # H0-g-g eff. coupling^2, normalised to SM
    7.22273714E-11        3  36  21  21  # A0-g-g eff. coupling^2, normalised to SM
#
    0.00000000E+00        3  25  25  23  # h0-h0-Z eff. coupling^2, normalised to SM
    0.00000000E+00        3  35  25  23  # H0-h0-Z eff. coupling^2, normalised to SM
    1.19154962E-08        3  36  25  23  # A0-h0-Z eff. coupling^2, normalised to SM
    0.00000000E+00        3  35  35  23  # H0-H0-Z eff. coupling^2, normalised to SM
    9.99999988E-01        3  36  35  23  # A0-H0-Z eff. coupling^2, normalised to SM
    0.00000000E+00        3  36  36  23  # A0-A0-Z eff. coupling^2, normalised to SM
#
    0.00000000E+00        4  25  21  21  23  # h0-g-g-Z eff. coupling^2, normalised to SM
    0.00000000E+00        4  35  21  21  23  # H0-g-g-Z eff. coupling^2, normalised to SM
    0.00000000E+00        4  36  21  21  23  # A0-g-g-Z eff. coupling^2, normalised to SM
#
#
#
#                             =================
#                             |The decay table|
#                             =================
#
# - The QCD corrections to the decays gluino -> squark  + quark
#                                     squark -> gaugino + quark_prime
#                                     squark -> squark_prime + Higgs
#                                     squark -> gluino  + quark
#   are included.
#
# - The multi-body decays for the inos, stops and sbottoms are included.
#
# - The loop induced decays for the gluino, neutralinos and stops
#   are included.
#
# - The SUSY decays of the top quark are included.
#
#
#         PDG            Width
DECAY         6     1.45083118E+00   # top decays
#          BR         NDA      ID1       ID2
     1.00000000E+00    2           5        24   # BR(t ->  b    W+)
#
#         PDG            Width
DECAY   1000021     2.31082740E+02   # gluino decays
#          BR         NDA      ID1       ID2
     1.03083381E-01    2     1000001        -1   # BR(~g -> ~d_L  db)
     1.03083381E-01    2    -1000001         1   # BR(~g -> ~d_L* d )
     2.07897174E-02    2     2000001        -1   # BR(~g -> ~d_R  db)
     2.07897174E-02    2    -2000001         1   # BR(~g -> ~d_R* d )
     1.03235987E-01    2     1000002        -2   # BR(~g -> ~u_L  ub)
     1.03235987E-01    2    -1000002         2   # BR(~g -> ~u_L* u )
     1.03083381E-01    2     1000003        -3   # BR(~g -> ~s_L  sb)
     1.03083381E-01    2    -1000003         3   # BR(~g -> ~s_L* s )
     2.07897174E-02    2     2000003        -3   # BR(~g -> ~s_R  sb)
     2.07897174E-02    2    -2000003         3   # BR(~g -> ~s_R* s )
     1.03235978E-01    2     1000004        -4   # BR(~g -> ~c_L  cb)
     1.03235978E-01    2    -1000004         4   # BR(~g -> ~c_L* c )
     2.30116454E-02    2     1000005        -5   # BR(~g -> ~b_1  bb)
     2.30116454E-02    2    -1000005         5   # BR(~g -> ~b_1* b )
     7.10790096E-04    2     2000005        -5   # BR(~g -> ~b_2  bb)
     7.10790096E-04    2    -2000005         5   # BR(~g -> ~b_2* b )
     2.20594018E-02    2     1000006        -6   # BR(~g -> ~t_1  tb)
     2.20594018E-02    2    -1000006         6   # BR(~g -> ~t_1* t )
#
#         PDG            Width
DECAY   1000006     6.81580080E+01   # stop1 decays
#          BR         NDA      ID1       ID2
     2.19099485E-01    2     1000022         6   # BR(~t_1 -> ~chi_10 t )
     2.29303870E-01    2     1000023         6   # BR(~t_1 -> ~chi_20 t )
     1.12101864E-01    2     1000025         6   # BR(~t_1 -> ~chi_30 t )
     2.27112013E-01    2     1000024         5   # BR(~t_1 -> ~chi_1+ b )
     2.12382767E-01    2     1000037         5   # BR(~t_1 -> ~chi_2+ b )
#
#         PDG            Width
DECAY   2000006     1.91262617E+02   # stop2 decays
#          BR         NDA      ID1       ID2
     1.24125995E-01    2     1000022         6   # BR(~t_2 -> ~chi_10 t )
     1.30430255E-01    2     1000023         6   # BR(~t_2 -> ~chi_20 t )
     4.76481470E-03    2     1000025         6   # BR(~t_2 -> ~chi_30 t )
     1.12991844E-02    2     1000035         6   # BR(~t_2 -> ~chi_40 t )
     2.50360475E-01    2     1000024         5   # BR(~t_2 -> ~chi_1+ b )
     9.60999692E-03    2     1000037         5   # BR(~t_2 -> ~chi_2+ b )
     1.07922039E-01    2     1000021         6   # BR(~t_2 -> ~g      t )
     9.12102725E-02    2     1000006        25   # BR(~t_2 -> ~t_1    h )
     9.19255624E-02    2     1000006        23   # BR(~t_2 -> ~t_1    Z )
     1.78349456E-01    2     1000005        24   # BR(~t_2 -> ~b_1    W+)
     1.94946618E-06    2     2000005        24   # BR(~t_2 -> ~b_2    W+)
#
#         PDG            Width
DECAY   1000005     6.80971087E+01   # sbottom1 decays
#          BR         NDA      ID1       ID2
     1.10276553E-01    2     1000022         5   # BR(~b_1 -> ~chi_10 b )
     1.05189954E-01    2     1000023         5   # BR(~b_1 -> ~chi_20 b )
     1.10934854E-01    2     1000025         5   # BR(~b_1 -> ~chi_30 b )
     4.39844757E-01    2    -1000024         6   # BR(~b_1 -> ~chi_1- t )
     2.33753883E-01    2    -1000037         6   # BR(~b_1 -> ~chi_2- t )
#
#         PDG            Width
DECAY   2000005     3.69545364E+01   # sbottom2 decays
#          BR         NDA      ID1       ID2
     2.53985361E-01    2     1000022         5   # BR(~b_2 -> ~chi_10 b )
     2.45250171E-01    2     1000023         5   # BR(~b_2 -> ~chi_20 b )
     4.18066465E-04    2     1000025         5   # BR(~b_2 -> ~chi_30 b )
     1.72539038E-03    2     1000035         5   # BR(~b_2 -> ~chi_40 b )
     4.95532034E-01    2    -1000024         6   # BR(~b_2 -> ~chi_1- t )
     8.45964886E-04    2    -1000037         6   # BR(~b_2 -> ~chi_2- t )
     5.99556099E-04    2     1000005        25   # BR(~b_2 -> ~b_1    h )
     5.48787184E-04    2     1000005        23   # BR(~b_2 -> ~b_1    Z )
     1.09466868E-03    2     1000006       -24   # BR(~b_2 -> ~t_1    W-)
#
#         PDG            Width
DECAY   1000002     2.76495972E+00   # sup_L decays
#          BR         NDA      ID1       ID2
     1.20119846E-02    2     1000022         2   # BR(~u_L -> ~chi_10 u)
     4.51504363E-03    2     1000023         2   # BR(~u_L -> ~chi_20 u)
     3.08218737E-01    2     1000025         2   # BR(~u_L -> ~chi_30 u)
     6.68770813E-02    2     1000024         1   # BR(~u_L -> ~chi_1+ d)
     6.08377154E-01    2     1000037         1   # BR(~u_L -> ~chi_2+ d)
#
#         PDG            Width
DECAY   2000002     1.15859569E+01   # sup_R decays
#          BR         NDA      ID1       ID2
     9.55108126E-05    2     1000022         2   # BR(~u_R -> ~chi_10 u)
     7.96555753E-05    2     1000023         2   # BR(~u_R -> ~chi_20 u)
     3.62491364E-06    2     1000025         2   # BR(~u_R -> ~chi_30 u)
     1.08722552E-01    2     1000035         2   # BR(~u_R -> ~chi_40 u)
     8.91098657E-01    2     1000021         2   # BR(~u_R -> ~g      u)
#
#         PDG            Width
DECAY   1000001     2.67444325E+00   # sdown_L decays
#          BR         NDA      ID1       ID2
     1.37564621E-02    2     1000022         1   # BR(~d_L -> ~chi_10 d)
     5.41651941E-03    2     1000023         1   # BR(~d_L -> ~chi_20 d)
     3.23431831E-01    2     1000025         1   # BR(~d_L -> ~chi_30 d)
     4.13394794E-03    2    -1000024         2   # BR(~d_L -> ~chi_1- u)
     6.53261240E-01    2    -1000037         2   # BR(~d_L -> ~chi_2- u)
#
#         PDG            Width
DECAY   2000001     1.14487876E-01   # sdown_R decays
#           BR         NDA      ID1       ID2
     1.73320485E-03    2     1000022         1   # BR(~d_R -> ~chi_10 d)
     1.44447240E-03    2     1000023         1   # BR(~d_R -> ~chi_20 d)
#           BR         NDA      ID1       ID2       ID3
     1.86150715E-01    3        1       -1        1000001   # BR(~d_R -> d  db  ~d_L)
     6.23725431E-02    3        1       1        -1000001   # BR(~d_R -> d  d  ~d_L*)
     1.87845217E-01    3        1       -2        1000002   # BR(~d_R -> d  ub  ~u_L)
     6.19733741E-02    3        1       2        -1000002   # BR(~d_R -> d  u  ~u_L*)
     1.84770657E-01    3        1       -3        1000003   # BR(~d_R -> d  sb  ~s_L)
     6.10370305E-02    3        1       3        -1000003   # BR(~d_R -> d  s  ~s_L*)
     1.87434693E-01    3        1       -4        1000004   # BR(~d_R -> d  cb  ~c_L)
     6.22179415E-02    3        1       4        -1000004   # BR(~d_R -> d  c  ~c_L*)
     1.43692071E-08    3        1       -5        1000005   # BR(~d_R -> d  bb  ~b_1)
     8.56317744E-09    3        1       5        -1000005   # BR(~d_R -> d  b  ~b_1*)
     5.30457914E-07    3        1       -11        2000011   # BR(~d_R -> d  e+  ~e_R-)
     7.08974633E-07    3        1       11        -2000011   # BR(~d_R -> d  e-  ~e_R+)
     5.25863541E-07    3        1       -13        2000013   # BR(~d_R -> d  mu+  ~mu_R-)
     7.17648039E-07    3        1       13        -2000013   # BR(~d_R -> d  mu-  ~mu_R+)
     9.56607843E-06    3        1       -15        1000015   # BR(~d_R -> d  tau+  ~tau_1-)
     6.26162370E-06    3        1       15        -1000015   # BR(~d_R -> d  tau-  ~tau_1+)
     9.87353456E-06    3        1       -16        1000016   # BR(~d_R -> d  nu_taub  ~nu_tau1)
     6.42330021E-06    3        1       16        -1000016   # BR(~d_R -> d  nu_tau  ~nu_tau1*)
     2.96240974E-04    3        1       23        1000022   # BR(~d_R -> d  Z  ~chi_10)
     4.09126289E-04    3        1       25        1000022   # BR(~d_R -> d  h  ~chi_10)
     4.53628818E-04    3        1       23        1000023   # BR(~d_R -> d  Z  ~chi_20)
     2.91035183E-04    3        1       25        1000023   # BR(~d_R -> d  h  ~chi_20)
     2.74046484E-06    3        1       23        1000025   # BR(~d_R -> d  Z  ~chi_30)
     2.19464286E-05    3        1       25        1000025   # BR(~d_R -> d  h  ~chi_30)
     3.34681725E-04    3        1       -24        1000024   # BR(~d_R -> d  W-  ~chi_1+)
     1.12448587E-03    3        1       24        -1000024   # BR(~d_R -> d  W+  ~chi_1-)
     2.18066758E-05    3        1       -24        1000037   # BR(~d_R -> d  W-  ~chi_2+)
     2.98284859E-05    3        1       24        -1000037   # BR(~d_R -> d  W+  ~chi_2-)
#
#         PDG            Width
DECAY   1000004     2.64678358E+00   # scharm_L decays
#          BR         NDA      ID1       ID2
     1.21487284E-02    2     1000022         4   # BR(~c_L -> ~chi_10 c)
     4.56617663E-03    2     1000023         4   # BR(~c_L -> ~chi_20 c)
     3.07899019E-01    2     1000025         4   # BR(~c_L -> ~chi_30 c)
     6.76370022E-02    2     1000024         3   # BR(~c_L -> ~chi_1+ s)
     6.07749074E-01    2     1000037         3   # BR(~c_L -> ~chi_2+ s)
#
#         PDG            Width
DECAY   2000004     8.70150402E+00   # scharm_R decays
#          BR         NDA      ID1       ID2
     1.33661009E-04    2     1000022         4   # BR(~c_R -> ~chi_10 c)
     1.11466005E-04    2     1000023         4   # BR(~c_R -> ~chi_20 c)
     5.05553699E-06    2     1000025         4   # BR(~c_R -> ~chi_30 c)
     1.47989476E-01    2     1000035         4   # BR(~c_R -> ~chi_40 c)
     8.51760341E-01    2     1000021         4   # BR(~c_R -> ~g      c)
#
#         PDG            Width
DECAY   1000003     2.55894403E+00   # sstrange_L decays
#          BR         NDA      ID1       ID2
     1.39214697E-02    2     1000022         3   # BR(~s_L -> ~chi_10 s)
     5.48117062E-03    2     1000023         3   # BR(~s_L -> ~chi_20 s)
     3.23347034E-01    2     1000025         3   # BR(~s_L -> ~chi_30 s)
     4.18341784E-03    2    -1000024         4   # BR(~s_L -> ~chi_1- c)
     6.53066908E-01    2    -1000037         4   # BR(~s_L -> ~chi_2- c)
#
#         PDG            Width
DECAY   2000003     1.14483163E-01   # sstrange_R decays
#           BR         NDA      ID1       ID2
     1.75411743E-03    2     1000022         3   # BR(~s_R -> ~chi_10 s)
     1.46181616E-03    2     1000023         3   # BR(~s_R -> ~chi_20 s)
#           BR         NDA      ID1       ID2       ID3
     1.86210788E-01    3        3       -1        1000001   # BR(~s_R -> s  db  ~d_L)
     6.16143005E-02    3        3       1        -1000001   # BR(~s_R -> s  d  ~d_L*)
     1.87852951E-01    3        3       -2        1000002   # BR(~s_R -> s  ub  ~u_L)
     6.18859562E-02    3        3       2        -1000002   # BR(~s_R -> s  u  ~u_L*)
     1.84778264E-01    3        3       -3        1000003   # BR(~s_R -> s  sb  ~s_L)
     6.24039363E-02    3        3       3        -1000003   # BR(~s_R -> s  s  ~s_L*)
     1.87852951E-01    3        3       -4        1000004   # BR(~s_R -> s  cb  ~c_L)
     6.11696936E-02    3        3       4        -1000004   # BR(~s_R -> s  c  ~c_L*)
     1.44143467E-08    3        3       -5        1000005   # BR(~s_R -> s  bb  ~b_1)
     8.51278018E-09    3        3       5        -1000005   # BR(~s_R -> s  b  ~b_1*)
     5.30191502E-07    3        3       -11        2000011   # BR(~s_R -> s  e+  ~e_R-)
     7.14401995E-07    3        3       11        -2000011   # BR(~s_R -> s  e-  ~e_R+)
     5.23605379E-07    3        3       -13        2000013   # BR(~s_R -> s  mu+  ~mu_R-)
     7.19747760E-07    3        3       13        -2000013   # BR(~s_R -> s  mu-  ~mu_R+)
     9.56647222E-06    3        3       -15        1000015   # BR(~s_R -> s  tau+  ~tau_1-)
     6.20064979E-06    3        3       15        -1000015   # BR(~s_R -> s  tau-  ~tau_1+)
     9.86957356E-06    3        3       -16        1000016   # BR(~s_R -> s  nu_taub  ~nu_tau1)
     6.42356468E-06    3        3       16        -1000016   # BR(~s_R -> s  nu_tau  ~nu_tau1*)
     2.96253171E-04    3        3       23        1000022   # BR(~s_R -> s  Z  ~chi_10)
     4.14637391E-04    3        3       25        1000022   # BR(~s_R -> s  h  ~chi_10)
     4.53647495E-04    3        3       23        1000023   # BR(~s_R -> s  Z  ~chi_20)
     2.91047165E-04    3        3       25        1000023   # BR(~s_R -> s  h  ~chi_20)
     2.74057767E-06    3        3       23        1000025   # BR(~s_R -> s  Z  ~chi_30)
     2.19473322E-05    3        3       25        1000025   # BR(~s_R -> s  h  ~chi_30)
     3.34695506E-04    3        3       -24        1000024   # BR(~s_R -> s  W-  ~chi_1+)
     1.11405029E-03    3        3       24        -1000024   # BR(~s_R -> s  W+  ~chi_1-)
     2.18075735E-05    3        3       -24        1000037   # BR(~s_R -> s  W-  ~chi_2+)
     2.98297139E-05    3        3       24        -1000037   # BR(~s_R -> s  W+  ~chi_2-)
#
#         PDG            Width
DECAY   1000011     3.11156348E+01   # selectron_L decays
#          BR         NDA      ID1       ID2
     2.74756455E-03    2     1000022        11   # BR(~e_L -> ~chi_10 e-)
     9.85852585E-04    2     1000023        11   # BR(~e_L -> ~chi_20 e-)
     3.29050015E-01    2     1000025        11   # BR(~e_L -> ~chi_30 e-)
     3.18020352E-03    2     1000035        11   # BR(~e_L -> ~chi_40 e-)
     1.01485292E-03    2    -1000024        12   # BR(~e_L -> ~chi_1- nu_e)
     6.63021512E-01    2    -1000037        12   # BR(~e_L -> ~chi_2- nu_e)
#
#         PDG            Width
DECAY   2000011     4.99887995E-03   # selectron_R decays
#           BR         NDA      ID1       ID2
     3.27292755E-01    2     1000022        11   # BR(~e_R -> ~chi_10 e-)
     2.72674590E-01    2     1000023        11   # BR(~e_R -> ~chi_20 e-)
#           BR         NDA      ID1       ID2       ID3
     7.14300010E-03    3        11       -1        1000001   # BR(~e_R- -> e-  db  ~d_L)
     2.79662647E-03    3        11       1        -1000001   # BR(~e_R- -> e-  d  ~d_L*)
     6.85093468E-03    3        11       -2        1000002   # BR(~e_R- -> e-  ub  ~u_L)
     2.66879784E-03    3        11       2        -1000002   # BR(~e_R- -> e-  u  ~u_L*)
     7.09819007E-03    3        11       -3        1000003   # BR(~e_R- -> e-  sb  ~s_L)
     2.82803351E-03    3        11       3        -1000003   # BR(~e_R- -> e-  s  ~s_L*)
     6.86493782E-03    3        11       -4        1000004   # BR(~e_R- -> e-  cb  ~c_L)
     2.67860003E-03    3        11       4        -1000004   # BR(~e_R- -> e-  c  ~c_L*)
     1.44146290E-04    3        11       -15        1000015   # BR(~e_R- -> e-  tau+  ~tau_1-)
     8.11081691E-05    3        11       15        -1000015   # BR(~e_R- -> e-  tau-  ~tau_1+)
     1.46964922E-04    3        11       -16        1000016   # BR(~e_R- -> e-  nu_taub  ~nu_tau1)
     8.38867915E-05    3        11       16        -1000016   # BR(~e_R- -> e-  nu_tau  ~nu_tau1*)
     3.43556960E-02    3        11       23        1000022   # BR(~e_R- -> e-  Z  ~chi_10)
     5.02832640E-02    3        11       25        1000022   # BR(~e_R- -> e-  h  ~chi_10)
     5.43441736E-02    3        11       23        1000023   # BR(~e_R- -> e-  Z  ~chi_20)
     3.49538300E-02    3        11       25        1000023   # BR(~e_R- -> e-  h  ~chi_20)
     2.31891946E-04    3        11       23        1000025   # BR(~e_R- -> e-  Z  ~chi_30)
     2.45394971E-03    3        11       25        1000025   # BR(~e_R- -> e-  h  ~chi_30)
     3.31074164E-02    3        11       -24        1000024   # BR(~e_R- -> e-  W-  ~chi_1+)
     1.45286545E-01    3        11       24        -1000024   # BR(~e_R- -> e-  W+  ~chi_1-)
     2.34752587E-03    3        11       -24        1000037   # BR(~e_R- -> e-  W-  ~chi_2+)
     3.28313546E-03    3        11       24        -1000037   # BR(~e_R- -> e-  W+  ~chi_2-)
#
#         PDG            Width
DECAY   1000013     3.11156347E+01   # smuon_L decays
#          BR         NDA      ID1       ID2
     2.74756455E-03    2     1000022        13   # BR(~mu_L -> ~chi_10 mu-)
     9.85852584E-04    2     1000023        13   # BR(~mu_L -> ~chi_20 mu-)
     3.29050014E-01    2     1000025        13   # BR(~mu_L -> ~chi_30 mu-)
     3.18020320E-03    2     1000035        13   # BR(~mu_L -> ~chi_40 mu-)
     1.01485293E-03    2    -1000024        14   # BR(~mu_L -> ~chi_1- nu_mu)
     6.63021513E-01    2    -1000037        14   # BR(~mu_L -> ~chi_2- nu_mu)
#
#         PDG            Width
DECAY   2000013     4.99886163E-03   # smuon_R decays
#           BR         NDA      ID1       ID2
     3.27293954E-01    2     1000022        13   # BR(~mu_R -> ~chi_10 mu-)
     2.72675587E-01    2     1000023        13   # BR(~mu_R -> ~chi_20 mu-)
#           BR         NDA      ID1       ID2       ID3
     7.14302628E-03    3        13       -1        1000001   # BR(~mu_R- -> mu-  db  ~d_L)
     2.82224255E-03    3        13       1        -1000001   # BR(~mu_R- -> mu-  d  ~d_L*)
     6.85095978E-03    3        13       -2        1000002   # BR(~mu_R- -> mu-  ub  ~u_L)
     2.64520224E-03    3        13       2        -1000002   # BR(~mu_R- -> mu-  u  ~u_L*)
     7.09821608E-03    3        13       -3        1000003   # BR(~mu_R- -> mu-  sb  ~s_L)
     2.82244260E-03    3        13       3        -1000003   # BR(~mu_R- -> mu-  s  ~s_L*)
     6.86496297E-03    3        13       -4        1000004   # BR(~mu_R- -> mu-  cb  ~c_L)
     2.67860985E-03    3        13       4        -1000004   # BR(~mu_R- -> mu-  c  ~c_L*)
     1.44146819E-04    3        13       -15        1000015   # BR(~mu_R- -> mu-  tau+  ~tau_1-)
     8.11084663E-05    3        13       15        -1000015   # BR(~mu_R- -> mu-  tau-  ~tau_1+)
     1.49584056E-04    3        13       -16        1000016   # BR(~mu_R- -> mu-  nu_taub  ~nu_tau1)
     8.38870989E-05    3        13       16        -1000016   # BR(~mu_R- -> mu-  nu_tau  ~nu_tau1*)
     3.43558219E-02    3        13       23        1000022   # BR(~mu_R- -> mu-  Z  ~chi_10)
     5.02834482E-02    3        13       25        1000022   # BR(~mu_R- -> mu-  h  ~chi_10)
     5.43443728E-02    3        13       23        1000023   # BR(~mu_R- -> mu-  Z  ~chi_20)
     3.49539581E-02    3        13       25        1000023   # BR(~mu_R- -> mu-  h  ~chi_20)
     2.32813005E-04    3        13       23        1000025   # BR(~mu_R- -> mu-  Z  ~chi_30)
     2.45375866E-03    3        13       25        1000025   # BR(~mu_R- -> mu-  h  ~chi_30)
     3.31075377E-02    3        13       -24        1000024   # BR(~mu_R- -> mu-  W-  ~chi_1+)
     1.45287078E-01    3        13       24        -1000024   # BR(~mu_R- -> mu-  W+  ~chi_1-)
     2.34413370E-03    3        13       -24        1000037   # BR(~mu_R- -> mu-  W-  ~chi_2+)
     3.28314749E-03    3        13       24        -1000037   # BR(~mu_R- -> mu-  W+  ~chi_2-)
#
#         PDG            Width
DECAY   1000015     2.12102050E+01   # stau_1 decays
#          BR         NDA      ID1       ID2
     1.51042973E-01    2     1000022        15   # BR(~tau_1 -> ~chi_10  tau-)
     1.43617987E-01    2     1000023        15   # BR(~tau_1 -> ~chi_20  tau-)
     2.33723243E-01    2     1000025        15   # BR(~tau_1 -> ~chi_30  tau-)
     9.88477302E-04    2    -1000024        16   # BR(~tau_1 -> ~chi_1-  nu_tau)
     4.70627319E-01    2    -1000037        16   # BR(~tau_1 -> ~chi_2-  nu_tau)
#
#         PDG            Width
DECAY   2000015     2.92709950E+01   # stau_2 decays
#          BR         NDA      ID1       ID2
     2.17524448E-01    2     1000022        15   # BR(~tau_2 -> ~chi_10  tau-)
     2.09770813E-01    2     1000023        15   # BR(~tau_2 -> ~chi_20  tau-)
     3.02189140E-04    2     1000025        15   # BR(~tau_2 -> ~chi_30  tau-)
     1.41332081E-01    2     1000035        15   # BR(~tau_2 -> ~chi_40  tau-)
     4.26800123E-01    2    -1000024        16   # BR(~tau_2 -> ~chi_1-  nu_tau)
     6.07480366E-04    2    -1000037        16   # BR(~tau_2 -> ~chi_2-  nu_tau)
     1.78932793E-03    2     1000016       -24   # BR(~tau_2 -> ~nu_tauL W-)
     9.56457682E-04    2     1000015        25   # BR(~tau_2 -> ~tau_1   h)
     9.17080376E-04    2     1000015        23   # BR(~tau_2 -> ~tau_1   Z)
#
#         PDG            Width
DECAY   1000012     3.11524096E+01   # snu_eL decays
#          BR         NDA      ID1       ID2
     3.69618789E-03    2     1000022        12   # BR(~nu_eL -> ~chi_10 nu_e)
     1.52589918E-03    2     1000023        12   # BR(~nu_eL -> ~chi_20 nu_e)
     3.26621992E-01    2     1000025        12   # BR(~nu_eL -> ~chi_30 nu_e)
     3.15954346E-03    2     1000035        12   # BR(~nu_eL -> ~chi_40 nu_e)
     1.69976672E-02    2     1000024        11   # BR(~nu_eL -> ~chi_1+ e-)
     6.47998711E-01    2     1000037        11   # BR(~nu_eL -> ~chi_2+ e-)
#
#         PDG            Width
DECAY   1000014     3.11524096E+01   # snu_muL decays
#          BR         NDA      ID1       ID2
     3.69618790E-03    2     1000022        14   # BR(~nu_muL -> ~chi_10 nu_mu)
     1.52589919E-03    2     1000023        14   # BR(~nu_muL -> ~chi_20 nu_mu)
     3.26621992E-01    2     1000025        14   # BR(~nu_muL -> ~chi_30 nu_mu)
     3.15954346E-03    2     1000035        14   # BR(~nu_muL -> ~chi_40 nu_mu)
     1.69976672E-02    2     1000024        13   # BR(~nu_muL -> ~chi_1+ mu-)
     6.47998710E-01    2     1000037        13   # BR(~nu_muL -> ~chi_2+ mu-)
#
#         PDG            Width
DECAY   1000016     2.12723020E+01   # snu_tauL decays
#          BR         NDA      ID1       ID2
     3.35107237E-03    2     1000022        16   # BR(~nu_tauL -> ~chi_10 nu_tau)
     1.38147607E-03    2     1000023        16   # BR(~nu_tauL -> ~chi_20 nu_tau)
     2.31166427E-01    2     1000025        16   # BR(~nu_tauL -> ~chi_30 nu_tau)
     3.05323346E-01    2     1000024        15   # BR(~nu_tauL -> ~chi_1+ tau-)
     4.58777678E-01    2     1000037        15   # BR(~nu_tauL -> ~chi_2+ tau-)
#
#         PDG            Width
DECAY   1000024     1.04345689E-09   # chargino1+ decays
#           BR         NDA      ID1       ID2       ID3
     3.58483734E-01    3     1000022         2        -1   # BR(~chi_1+ -> ~chi_10 u    db)
     3.58483734E-01    3     1000022         4        -3   # BR(~chi_1+ -> ~chi_10 c    sb)
     1.19484683E-01    3     1000022       -11        12   # BR(~chi_1+ -> ~chi_10 e+   nu_e)
     1.19484683E-01    3     1000022       -13        14   # BR(~chi_1+ -> ~chi_10 mu+  nu_mu)
     4.40631653E-02    3     1000022       -15        16   # BR(~chi_1+ -> ~chi_10 tau+ nu_tau)
#
#         PDG            Width
DECAY   1000037     6.06430217E+00   # chargino2+ decays
#          BR         NDA      ID1       ID2
     2.55931742E-01    2     1000024        23   # BR(~chi_2+ -> ~chi_1+  Z )
     2.46199732E-01    2     1000022        24   # BR(~chi_2+ -> ~chi_10  W+)
     2.55368706E-01    2     1000023        24   # BR(~chi_2+ -> ~chi_20  W+)
     2.42499820E-01    2     1000024        25   # BR(~chi_2+ -> ~chi_1+  h )
#
#         PDG            Width
DECAY   1000022     0.00000000E+00   # neutralino1 decays
#
#         PDG            Width
DECAY   1000023     5.96577111E-08   # neutralino2 decays
#          BR         NDA      ID1       ID2
     1.86538047E-02    2     1000022        22   # BR(~chi_20 -> ~chi_10 gam)
#           BR         NDA      ID1       ID2       ID3
     1.16985265E-01    3     1000022        -2         2   # BR(~chi_20 -> ~chi_10 ub      u)
     1.51738626E-01    3     1000022        -1         1   # BR(~chi_20 -> ~chi_10 db      d)
     1.16985265E-01    3     1000022        -4         4   # BR(~chi_20 -> ~chi_10 cb      c)
     1.51738626E-01    3     1000022        -3         3   # BR(~chi_20 -> ~chi_10 sb      s)
     3.48040513E-02    3     1000022       -11        11   # BR(~chi_20 -> ~chi_10 e+      e-)
     3.48040513E-02    3     1000022       -13        13   # BR(~chi_20 -> ~chi_10 mu+     mu-)
     2.73635177E-02    3     1000022       -15        15   # BR(~chi_20 -> ~chi_10 tau+    tau-)
     6.95771861E-02    3     1000022       -12        12   # BR(~chi_20 -> ~chi_10 nu_eb   nu_e)
     6.95771861E-02    3     1000022       -14        14   # BR(~chi_20 -> ~chi_10 nu_mub  nu_mu)
     6.95781620E-02    3     1000022       -16        16   # BR(~chi_20 -> ~chi_10 nu_taub nu_tau)
     2.41965022E-02    3     1000024        -2         1   # BR(~chi_20 -> ~chi_1+ ub      d)
     2.41965022E-02    3    -1000024        -1         2   # BR(~chi_20 -> ~chi_1- db      u)
     2.41965022E-02    3     1000024        -4         3   # BR(~chi_20 -> ~chi_1+ cb      s)
     2.41965022E-02    3    -1000024        -3         4   # BR(~chi_20 -> ~chi_1- sb      c)
     8.06524351E-03    3     1000024       -12        11   # BR(~chi_20 -> ~chi_1+ nu_eb   e-)
     8.06524351E-03    3    -1000024        12       -11   # BR(~chi_20 -> ~chi_1- nu_e    e+)
     8.06524351E-03    3     1000024       -14        13   # BR(~chi_20 -> ~chi_1+ nu_mub  mu-)
     8.06524351E-03    3    -1000024        14       -13   # BR(~chi_20 -> ~chi_1- nu_mu   mu+)
     4.57363789E-03    3     1000024       -16        15   # BR(~chi_20 -> ~chi_1+ nu_taub tau-)
     4.57363789E-03    3    -1000024        16       -15   # BR(~chi_20 -> ~chi_1- nu_tau  tau+)
#
#         PDG            Width
DECAY   1000025     6.06575541E+00   # neutralino3 decays
#          BR         NDA      ID1       ID2
     6.87731722E-02    2     1000022        23   # BR(~chi_30 -> ~chi_10   Z )
     1.84448118E-01    2     1000023        23   # BR(~chi_30 -> ~chi_20   Z )
     2.57672362E-01    2     1000024       -24   # BR(~chi_30 -> ~chi_1+   W-)
     2.57672362E-01    2    -1000024        24   # BR(~chi_30 -> ~chi_1-   W+)
     1.68724436E-01    2     1000022        25   # BR(~chi_30 -> ~chi_10   h )
     6.27095491E-02    2     1000023        25   # BR(~chi_30 -> ~chi_20   h )
#
#         PDG            Width
DECAY   1000035     1.62683577E+01   # neutralino4 decays
#          BR         NDA      ID1       ID2
     4.42354743E-02    2     1000022        23   # BR(~chi_40 -> ~chi_10   Z )
     5.83625040E-02    2     1000023        23   # BR(~chi_40 -> ~chi_20   Z )
     8.50110728E-04    2     1000025        23   # BR(~chi_40 -> ~chi_30   Z )
     9.68069584E-02    2     1000024       -24   # BR(~chi_40 -> ~chi_1+   W-)
     9.68069584E-02    2    -1000024        24   # BR(~chi_40 -> ~chi_1-   W+)
     3.75295230E-03    2     1000037       -24   # BR(~chi_40 -> ~chi_2+   W-)
     3.75295230E-03    2    -1000037        24   # BR(~chi_40 -> ~chi_2-   W+)
     5.77544390E-02    2     1000022        25   # BR(~chi_40 -> ~chi_10   h )
     5.57050326E-03    2     1000022        35   # BR(~chi_40 -> ~chi_10   H )
     1.35493217E-03    2     1000022        36   # BR(~chi_40 -> ~chi_10   A )
     4.85506366E-02    2     1000023        25   # BR(~chi_40 -> ~chi_20   h )
     1.20992311E-03    2     1000023        35   # BR(~chi_40 -> ~chi_20   H )
     5.37043804E-03    2     1000023        36   # BR(~chi_40 -> ~chi_20   A )
     2.95619155E-03    2     1000025        25   # BR(~chi_40 -> ~chi_30   h )
     6.64898593E-03    2     1000024       -37   # BR(~chi_40 -> ~chi_1+   H-)
     6.64898593E-03    2    -1000024        37   # BR(~chi_40 -> ~chi_1-   H+)
     2.54732489E-02    2     1000002        -2   # BR(~chi_40 -> ~u_L      ub)
     2.54732489E-02    2    -1000002         2   # BR(~chi_40 -> ~u_L*     u )
     2.58098262E-02    2     1000001        -1   # BR(~chi_40 -> ~d_L      db)
     2.58098262E-02    2    -1000001         1   # BR(~chi_40 -> ~d_L*     d )
     5.84800086E-03    2     2000001        -1   # BR(~chi_40 -> ~d_R      db)
     5.84800086E-03    2    -2000001         1   # BR(~chi_40 -> ~d_R*     d )
     2.54732449E-02    2     1000004        -4   # BR(~chi_40 -> ~c_L      cb)
     2.54732449E-02    2    -1000004         4   # BR(~chi_40 -> ~c_L*     c )
     2.58098262E-02    2     1000003        -3   # BR(~chi_40 -> ~s _L      sb)
     2.58098262E-02    2    -1000003         3   # BR(~chi_40 -> ~s _L*     s )
     5.84800086E-03    2     2000003        -3   # BR(~chi_40 -> ~s _R      sb)
     5.84800086E-03    2    -2000003         3   # BR(~chi_40 -> ~s _R*     s )
     1.45309544E-03    2     1000006        -6   # BR(~chi_40 -> ~t_1      tb)
     1.45309544E-03    2    -1000006         6   # BR(~chi_40 -> ~t_1*     t )
     1.83973327E-03    2     1000005        -5   # BR(~chi_40 -> ~b_1      bb)
     1.83973327E-03    2    -1000005         5   # BR(~chi_40 -> ~b_1*     b )
     5.02287806E-02    2     2000011       -11   # BR(~chi_40 -> ~e_R-     e+)
     5.02287806E-02    2    -2000011        11   # BR(~chi_40 -> ~e_R+     e-)
     5.02287806E-02    2     2000013       -13   # BR(~chi_40 -> ~mu_R-    mu+)
     5.02287806E-02    2    -2000013        13   # BR(~chi_40 -> ~mu_R+    mu-)
     3.06990047E-02    2     1000015       -15   # BR(~chi_40 -> ~tau_1-   tau+)
     3.06990047E-02    2    -1000015        15   # BR(~chi_40 -> ~tau_1+   tau-)
     3.09719844E-02    2     1000016       -16   # BR(~chi_40 -> ~nu_tau1  nu_taub)
     3.09719844E-02    2    -1000016        16   # BR(~chi_40 -> ~nu_tau1* nu_tau )
#
#         PDG            Width
DECAY        25     4.35066397E-03   # h decays
#          BR         NDA      ID1       ID2
     5.46334601E-01    2           5        -5   # BR(h -> b       bb     )
     6.12680555E-02    2         -15        15   # BR(h -> tau+    tau-   )
     2.16846724E-04    2         -13        13   # BR(h -> mu+     mu-    )
     2.35822813E-04    2           3        -3   # BR(h -> s       sb     )
     2.02681228E-02    2           4        -4   # BR(h -> c       cb     )
     7.79420361E-02    2          21        21   # BR(h -> g       g      )
     2.36198029E-03    2          22        22   # BR(h -> gam     gam    )
     1.79876799E-03    2          22        23   # BR(h -> Z       gam    )
     2.56433587E-01    2          24       -24   # BR(h -> W+      W-     )
     3.31401796E-02    2          23        23   # BR(h -> Z       Z      )
#
#         PDG            Width
DECAY        35     7.62001941E+01   # H decays
#          BR         NDA      ID1       ID2
     5.97719542E-01    2           5        -5   # BR(H -> b       bb     )
     1.08560578E-01    2         -15        15   # BR(H -> tau+    tau-   )
     3.80271983E-04    2         -13        13   # BR(H -> mu+     mu-    )
     2.68753447E-04    2           3        -3   # BR(H -> s       sb     )
     7.72510866E-09    2           4        -4   # BR(H -> c       cb     )
     7.53256325E-04    2           6        -6   # BR(H -> t       tb     )
     1.54089694E-05    2          21        21   # BR(H -> g       g      )
     3.35196890E-08    2          22        22   # BR(H -> gam     gam    )
     8.05332926E-09    2          23        22   # BR(H -> Z       gam    )
     6.22379611E-07    2          24       -24   # BR(H -> W+      W-     )
     3.10227813E-07    2          23        23   # BR(H -> Z       Z      )
     2.31724599E-06    2          25        25   # BR(H -> h       h      )
     5.47681311E-03    2     1000024  -1000024   # BR(H -> ~chi_1+ ~chi_1-)
     1.49652792E-04    2     1000037  -1000037   # BR(H -> ~chi_2+ ~chi_2-)
     9.47114911E-02    2     1000024  -1000037   # BR(H -> ~chi_1+ ~chi_2-)
     9.47114911E-02    2     1000037  -1000024   # BR(H -> ~chi_2+ ~chi_1-)
     1.24906591E-03    2     1000022   1000022   # BR(H -> ~chi_10 ~chi_10)
     4.47806055E-04    2     1000023   1000023   # BR(H -> ~chi_20 ~chi_20)
     7.40569501E-05    2     1000025   1000025   # BR(H -> ~chi_30 ~chi_30)
     5.56008521E-05    2     1000022   1000023   # BR(H -> ~chi_10 ~chi_20)
     4.70865598E-02    2     1000022   1000025   # BR(H -> ~chi_10 ~chi_30)
     4.83355072E-02    2     1000023   1000025   # BR(H -> ~chi_20 ~chi_30)
     1.72761416E-07    2     1000002  -1000002   # BR(H -> ~u_L    ~u_L*  )
     1.72761416E-07    2     1000004  -1000004   # BR(H -> ~c_L    ~c_L*  )
     2.49620251E-07    2     1000001  -1000001   # BR(H -> ~d_L    ~d_L*  )
     2.49620251E-07    2     1000003  -1000003   # BR(H -> ~s_L    ~s_L*  )
#
#         PDG            Width
DECAY        36     7.62025724E+01   # A decays
#          BR         NDA      ID1       ID2
     5.97714766E-01    2           5        -5   # BR(A -> b       bb     )
     1.08557741E-01    2         -15        15   # BR(A -> tau+    tau-   )
     3.80261161E-04    2         -13        13   # BR(A -> mu+     mu-    )
     2.68757060E-04    2           3        -3   # BR(A -> s       sb     )
     7.72666922E-09    2           4        -4   # BR(A -> c       cb     )
     7.57925661E-04    2           6        -6   # BR(A -> t       tb     )
     2.81011003E-05    2          21        21   # BR(A -> g       g      )
     2.92926462E-09    2          22        22   # BR(A -> gam     gam    )
     1.76738866E-08    2          23        22   # BR(A -> Z       gam    )
     6.28796125E-07    2          23        25   # BR(A -> Z       h      )
     5.54135709E-03    2     1000024  -1000024   # BR(A -> ~chi_1+ ~chi_1-)
     1.93431469E-04    2     1000037  -1000037   # BR(A -> ~chi_2+ ~chi_2-)
     9.46561267E-02    2     1000024  -1000037   # BR(A -> ~chi_1+ ~chi_2-)
     9.46561267E-02    2     1000037  -1000024   # BR(A -> ~chi_2+ ~chi_1-)
     1.17506653E-03    2     1000022   1000022   # BR(A -> ~chi_10 ~chi_10)
     5.13147585E-04    2     1000023   1000023   # BR(A -> ~chi_20 ~chi_20)
     9.60092118E-05    2     1000025   1000025   # BR(A -> ~chi_30 ~chi_30)
     8.56654563E-05    2     1000022   1000023   # BR(A -> ~chi_10 ~chi_20)
     4.96184781E-02    2     1000022   1000025   # BR(A -> ~chi_10 ~chi_30)
     4.57563818E-02    2     1000023   1000025   # BR(A -> ~chi_20 ~chi_30)
#
#         PDG            Width
DECAY        37     7.69191390E+01   # H+ decays
#          BR         NDA      ID1       ID2
     1.01312325E-03    2           4        -5   # BR(H+ -> c       bb     )
     1.07629735E-01    2         -15        16   # BR(H+ -> tau+    nu_tau )
     3.77010499E-04    2         -13        14   # BR(H+ -> mu+     nu_mu  )
     1.01312129E-05    2           2        -5   # BR(H+ -> u       bb     )
     1.33135899E-05    2           2        -3   # BR(H+ -> u       sb     )
     2.62059161E-04    2           4        -3   # BR(H+ -> c       sb     )
     6.01829952E-01    2           6        -5   # BR(H+ -> t       bb     )
     6.25054886E-07    2          24        25   # BR(H+ -> W+      h      )
     3.17696148E-13    2          24        36   # BR(H+ -> W+      A      )
     2.87860650E-04    2     1000024   1000022   # BR(H+ -> ~chi_1+ ~chi_10)
     9.33081903E-04    2     1000024   1000023   # BR(H+ -> ~chi_1+ ~chi_20)
     9.54477496E-02    2     1000024   1000025   # BR(H+ -> ~chi_1+ ~chi_30)
     9.84371467E-02    2     1000037   1000022   # BR(H+ -> ~chi_2+ ~chi_10)
     9.37573787E-02    2     1000037   1000023   # BR(H+ -> ~chi_2+ ~chi_20)
     2.02954930E-09    2     1000037   1000025   # BR(H+ -> ~chi_2+ ~chi_30)
     4.15015609E-07    2     1000002  -1000001   # BR(H+ -> ~u_L    ~d_L*  )
     4.15015609E-07    2     1000004  -1000003   # BR(H+ -> ~c_L    ~s_L*  )
