#
#                              ======================
#                              | THE SUSYHIT OUTPUT |
#                              ======================
#
#
#              ------------------------------------------------------
#              |     This is the output of the SUSY-HIT package     |
#              |  created by A.Djouadi, M.Muehlleitner and M.Spira. |
#              |  In case of problems with SUSY-HIT email to        |
#              |           margarete.muehlleitner@cern.ch           |
#              |           michael.spira@psi.ch                     |
#              |           abdelhak.djouadi@cern.ch                 |
#              ------------------------------------------------------
#
#              ------------------------------------------------------
#              |  SUSY Les Houches Accord - MSSM Spectrum + Decays  |
#              |              based on the decay programs           |
#              |                                                    |
#              |                     SDECAY 1.3b                    |
#              |                                                    |
#              |  Authors: M.Muhlleitner, A.Djouadi and Y.Mambrini  |
#              |  Ref.:    Comput.Phys.Commun.168(2005)46           |
#              |           [hep-ph/0311167]                         |
#              |                                                    |
#              |                     HDECAY 3.4                     |
#              |                                                    |
#              |  By: A.Djouadi,J.Kalinowski,M.Muhlleitner,M.Spira  |
#              |  Ref.:    Comput.Phys.Commun.108(1998)56           |
#              |           [hep-ph/9704448]                         |
#              |                                                    |
#              |                                                    |
#              |  If not stated otherwise all DRbar couplings and   |
#              |  soft SUSY breaking masses are given at the scale  |
#              |  Q=  0.26306520E+04
#              |                                                    |
#              ------------------------------------------------------
#
#
BLOCK DCINFO  # Decay Program information
     1   SDECAY/HDECAY # decay calculator
     2   1.3b  /3.4    # version number
#
BLOCK SPINFO  # Spectrum calculator information
     1     SOFTSUSY    # spectrum calculator               
     2     3.4.0       # version number                    
#
BLOCK MODSEL  # Model selection
     1     0   #  nonUniversal                                     
#
BLOCK SMINPUTS  # Standard Model inputs
         1     1.27908970E+02   # alpha_em^-1(M_Z)^MSbar
         2     1.16637870E-05   # G_F [GeV^-2]
         3     1.18400000E-01   # alpha_S(M_Z)^MSbar
         4     9.11876000E+01   # M_Z pole mass
         5     4.18000000E+00   # mb(mb)^MSbar
         6     1.73200000E+02   # mt pole mass
         7     1.77700000E+00   # mtau pole mass
#
BLOCK MINPAR  # Input parameters - minimal models
         3     2.20300000E+01   # tanb                
#
BLOCK EXTPAR  # Input parameters - non-minimal models
         0    -1.00000000E+00   # Set                 
         1     5.45800000E+01   # M_1(MX)             
         2     1.50690000E+02   # M_2(MX)             
         3     2.58897000E+03   # M_3(MX)             
        11    -1.95326000E+03   # At(MX)              
        12     1.77772000E+03   # Ab(MX)              
        13     6.74760000E+02   # Atau(MX)            
        23     1.55350000E+02   # mu(MX)              
        26     1.23550000E+03   # mA(pole)            
        31     2.46827000E+03   # meL(MX)             
        32     2.46827000E+03   # mmuL(MX)            
        33     3.61795000E+03   # mtauL(MX)           
        34     2.52462000E+03   # meR(MX)             
        35     2.52462000E+03   # mmuR(MX)            
        36     1.82962000E+03   # mtauR(MX)           
        41     2.02234000E+03   # mqL1(MX)            
        42     2.02234000E+03   # mqL2(MX)            
        43     2.25764000E+03   # mqL3(MX)            
        44     1.47020000E+03   # muR(MX)             
        45     1.47020000E+03   # mcR(MX)             
        46     3.05956000E+03   # mtR(MX)             
        47     7.21750000E+02   # mdR(MX)             
        48     7.21750000E+02   # msR(MX)             
        49     1.08224000E+03   # mbR(MX)             
#
BLOCK MASS  # Mass Spectrum
# PDG code           mass       particle
        24     8.03861439E+01   # W+
        25     1.24721092E+02   # h
        35     1.23553580E+03   # H
        36     1.23550000E+03   # A
        37     1.23836784E+03   # H+
         5     4.81876030E+00   # b-quark pole mass calculated from mb(mb)_Msbar
   1000001     2.13241998E+03   # ~d_L
   2000001     9.01523239E+02   # ~d_R
   1000002     2.13103997E+03   # ~u_L
   2000002     1.59153567E+03   # ~u_R
   1000003     2.13241998E+03   # ~s_L
   2000003     9.01523239E+02   # ~s_R
   1000004     2.13103997E+03   # ~c_L
   2000004     1.59153567E+03   # ~c_R
   1000005     1.21856621E+03   # ~b_1
   2000005     2.33838809E+03   # ~b_2
   1000006     2.33738538E+03   # ~t_1
   2000006     3.09610301E+03   # ~t_2
   1000011     2.47266186E+03   # ~e_L
   2000011     2.52840898E+03   # ~e_R
   1000012     2.47105276E+03   # ~nu_eL
   1000013     2.47266186E+03   # ~mu_L
   2000013     2.52840898E+03   # ~mu_R
   1000014     2.47105276E+03   # ~nu_muL
   1000015     1.83058148E+03   # ~tau_1
   2000015     3.62371843E+03   # ~tau_2
   1000016     3.62250931E+03   # ~nu_tauL
   1000021     2.64512006E+03   # ~g
   1000022     4.80529049E+01   # ~chi_10
   1000023     1.14094704E+02   # ~chi_20
   1000025    -1.74771816E+02   # ~chi_30
   1000035     2.28292050E+02   # ~chi_40
   1000024     1.11867428E+02   # ~chi_1+
   1000037     2.29938719E+02   # ~chi_2+
#
BLOCK NMIX  # Neutralino Mixing Matrix
  1  1     9.34977704E-01   # N_11
  1  2    -8.73000933E-02   # N_12
  1  3     3.25544104E-01   # N_13
  1  4    -1.10527930E-01   # N_14
  2  1    -2.96323929E-01   # N_21
  2  2    -6.90391758E-01   # N_22
  2  3     5.34466576E-01   # N_23
  2  4    -3.87165119E-01   # N_24
  3  1    -1.29970599E-01   # N_31
  3  2     1.64422746E-01   # N_32
  3  3     6.61765425E-01   # N_33
  3  4     7.19818954E-01   # N_34
  4  1    -1.45315057E-01   # N_41
  4  2     6.99073011E-01   # N_42
  4  3     4.12835364E-01   # N_43
  4  4    -5.65462131E-01   # N_44
#
BLOCK UMIX  # Chargino Mixing Matrix U
  1  1    -5.85538166E-01   # U_11
  1  2     8.10644840E-01   # U_12
  2  1    -8.10644840E-01   # U_21
  2  2    -5.85538166E-01   # U_22
#
BLOCK VMIX  # Chargino Mixing Matrix V
  1  1    -8.12646716E-01   # V_11
  1  2     5.82756651E-01   # V_12
  2  1    -5.82756651E-01   # V_21
  2  2    -8.12646716E-01   # V_22
#
BLOCK STOPMIX  # Stop Mixing Matrix
  1  1     9.97525044E-01   # cos(theta_t)
  1  2     7.03120658E-02   # sin(theta_t)
  2  1    -7.03120658E-02   # -sin(theta_t)
  2  2     9.97525044E-01   # cos(theta_t)
#
BLOCK SBOTMIX  # Sbottom Mixing Matrix
  1  1     9.94441855E-04   # cos(theta_b)
  1  2     9.99999506E-01   # sin(theta_b)
  2  1    -9.99999506E-01   # -sin(theta_b)
  2  2     9.94441855E-04   # cos(theta_b)
#
BLOCK STAUMIX  # Stau Mixing Matrix
  1  1     4.88582161E-04   # cos(theta_tau)
  1  2     9.99999881E-01   # sin(theta_tau)
  2  1    -9.99999881E-01   # -sin(theta_tau)
  2  2     4.88582161E-04   # cos(theta_tau)
#
BLOCK ALPHA  # Higgs mixing
          -4.79899193E-02   # Mixing angle in the neutral Higgs boson sector
#
BLOCK HMIX Q=  2.63065200E+03  # DRbar Higgs Parameters
         1     1.57781489E+02   # mu(Q)MSSM           
         2     2.11538710E+01   # tan                 
         3     2.40659586E+02   # higgs               
         4     1.55234012E+06   # mA^2(Q)MSSM         
#
BLOCK GAUGE Q=  2.63065200E+03  # The gauge couplings
     1     3.65056572E-01   # gprime(Q) DRbar
     2     6.45163040E-01   # g(Q) DRbar
     3     1.01937055E+00   # g3(Q) DRbar
#
BLOCK AU Q=  2.63065200E+03  # The trilinear couplings
  1  1     0.00000000E+00   # A_u(Q) DRbar
  2  2     0.00000000E+00   # A_c(Q) DRbar
  3  3    -1.95325999E+03   # A_t(Q) DRbar
#
BLOCK AD Q=  2.63065200E+03  # The trilinear couplings
  1  1     0.00000000E+00   # A_d(Q) DRbar
  2  2     0.00000000E+00   # A_s(Q) DRbar
  3  3     1.77772000E+03   # A_b(Q) DRbar
#
BLOCK AE Q=  2.63065200E+03  # The trilinear couplings
  1  1     0.00000000E+00   # A_e(Q) DRbar
  2  2     0.00000000E+00   # A_mu(Q) DRbar
  3  3     6.74760001E+02   # A_tau(Q) DRbar
#
BLOCK Yu Q=  2.63065200E+03  # The Yukawa couplings
  1  1     0.00000000E+00   # y_u(Q) DRbar
  2  2     0.00000000E+00   # y_c(Q) DRbar
  3  3     8.28138618E-01   # y_t(Q) DRbar
#
BLOCK Yd Q=  2.63065200E+03  # The Yukawa couplings
  1  1     0.00000000E+00   # y_d(Q) DRbar
  2  2     0.00000000E+00   # y_s(Q) DRbar
  3  3     2.87466146E-01   # y_b(Q) DRbar
#
BLOCK Ye Q=  2.63065200E+03  # The Yukawa couplings
  1  1     0.00000000E+00   # y_e(Q) DRbar
  2  2     0.00000000E+00   # y_mu(Q) DRbar
  3  3     2.18052568E-01   # y_tau(Q) DRbar
#
BLOCK MSOFT Q=  2.63065200E+03  # The soft SUSY breaking masses at the scale Q
         1     5.45800000E+01   # M_1(Q)              
         2     1.50690000E+02   # M_2(Q)              
         3     2.58897000E+03   # M_3(Q)              
        21     1.53615603E+06   # mH1^2(Q)            
        22     1.44995355E+05   # mH2^2(Q)            
        31     2.46827000E+03   # meL(Q)              
        32     2.46827000E+03   # mmuL(Q)             
        33     3.61795000E+03   # mtauL(Q)            
        34     2.52462000E+03   # meR(Q)              
        35     2.52462000E+03   # mmuR(Q)             
        36     1.82962000E+03   # mtauR(Q)            
        41     2.02233999E+03   # mqL1(Q)             
        42     2.02233999E+03   # mqL2(Q)             
        43     2.25763999E+03   # mqL3(Q)             
        44     1.47019999E+03   # muR(Q)              
        45     1.47019999E+03   # mcR(Q)              
        46     3.05955998E+03   # mtR(Q)              
        47     7.21749976E+02   # mdR(Q)              
        48     7.21749976E+02   # msR(Q)              
        49     1.08223998E+03   # mbR(Q)              
#
Block HiggsBoundsInputHiggsCouplingsFermions
# ScalarNormEffCoupSq PseudoSNormEffCoupSq NP   IP1 IP2 IP2
    1.03208569E+00    0.00000000E+00        3  25   5   5  # h0-b-b eff. coupling^2, normalised to SM
    4.47454173E+02    0.00000000E+00        3  35   5   5  # H0-b-b eff. coupling^2, normalised to SM
    0.00000000E+00    4.47486258E+02        3  36   5   5  # A0-b-b eff. coupling^2, normalised to SM
#
    9.99928298E-01    0.00000000E+00        3  25   6   6  # h0-t-t eff. coupling^2, normalised to SM
    2.30640756E-03    0.00000000E+00        3  35   6   6  # H0-t-t eff. coupling^2, normalised to SM
    0.00000000E+00    2.23470549E-03        3  36   6   6  # A0-t-t eff. coupling^2, normalised to SM
#
    1.03208569E+00    0.00000000E+00        3  25  15  15  # h0-tau-tau eff. coupling^2, normalised to SM
    4.47454173E+02    0.00000000E+00        3  35  15  15  # H0-tau-tau eff. coupling^2, normalised to SM
    0.00000000E+00    4.47486258E+02        3  36  15  15  # A0-tau-tau eff. coupling^2, normalised to SM
#
Block HiggsBoundsInputHiggsCouplingsBosons
    9.99999434E-01        3  25  24  24  # h0-W-W eff. coupling^2, normalised to SM
    5.66126587E-07        3  35  24  24  # H0-W-W eff. coupling^2, normalised to SM
    0.00000000E+00        3  36  24  24  # A0-W-W eff. coupling^2, normalised to SM
#
    9.99999434E-01        3  25  23  23  # h0-Z-Z eff. coupling^2, normalised to SM
    5.66126587E-07        3  35  23  23  # H0-Z-Z eff. coupling^2, normalised to SM
    0.00000000E+00        3  36  23  23  # A0-Z-Z eff. coupling^2, normalised to SM
#
    8.91465254E-01        3  25  21  21  # h0-g-g eff. coupling^2, normalised to SM
    6.21847313E-08        3  35  21  21  # H0-g-g eff. coupling^2, normalised to SM
    6.57309437E-07        3  36  21  21  # A0-g-g eff. coupling^2, normalised to SM
#
    0.00000000E+00        3  25  25  23  # h0-h0-Z eff. coupling^2, normalised to SM
    0.00000000E+00        3  35  25  23  # H0-h0-Z eff. coupling^2, normalised to SM
    5.66126587E-07        3  36  25  23  # A0-h0-Z eff. coupling^2, normalised to SM
    0.00000000E+00        3  35  35  23  # H0-H0-Z eff. coupling^2, normalised to SM
    9.99999434E-01        3  36  35  23  # A0-H0-Z eff. coupling^2, normalised to SM
    0.00000000E+00        3  36  36  23  # A0-A0-Z eff. coupling^2, normalised to SM
#
    0.00000000E+00        4  25  21  21  23  # h0-g-g-Z eff. coupling^2, normalised to SM
    0.00000000E+00        4  35  21  21  23  # H0-g-g-Z eff. coupling^2, normalised to SM
    0.00000000E+00        4  36  21  21  23  # A0-g-g-Z eff. coupling^2, normalised to SM
#
#
#
#                             =================
#                             |The decay table|
#                             =================
#
# - The QCD corrections to the decays gluino -> squark  + quark
#                                     squark -> gaugino + quark_prime
#                                     squark -> squark_prime + Higgs
#                                     squark -> gluino  + quark
#   are included.
#
# - The multi-body decays for the inos, stops and sbottoms are included.
#
# - The loop induced decays for the gluino, neutralinos and stops
#   are included.
#
# - The SUSY decays of the top quark are included.
#
#
#         PDG            Width
DECAY         6     1.46609035E+00   # top decays
#          BR         NDA      ID1       ID2
     1.00000000E+00    2           5        24   # BR(t ->  b    W+)
#
#         PDG            Width
DECAY   1000021     1.90511908E+02   # gluino decays
#          BR         NDA      ID1       ID2
     1.71499062E-02    2     1000001        -1   # BR(~g -> ~d_L  db)
     1.71499062E-02    2    -1000001         1   # BR(~g -> ~d_L* d )
     1.09308383E-01    2     2000001        -1   # BR(~g -> ~d_R  db)
     1.09308383E-01    2    -2000001         1   # BR(~g -> ~d_R* d )
     1.72323941E-02    2     1000002        -2   # BR(~g -> ~u_L  ub)
     1.72323941E-02    2    -1000002         2   # BR(~g -> ~u_L* u )
     5.69523060E-02    2     2000002        -2   # BR(~g -> ~u_R  ub)
     5.69523060E-02    2    -2000002         2   # BR(~g -> ~u_R* u )
     1.71499062E-02    2     1000003        -3   # BR(~g -> ~s_L  sb)
     1.71499062E-02    2    -1000003         3   # BR(~g -> ~s_L* s )
     1.09308383E-01    2     2000003        -3   # BR(~g -> ~s_R  sb)
     1.09308383E-01    2    -2000003         3   # BR(~g -> ~s_R* s )
     1.72323259E-02    2     1000004        -4   # BR(~g -> ~c_L  cb)
     1.72323259E-02    2    -1000004         4   # BR(~g -> ~c_L* c )
     5.69522680E-02    2     2000004        -4   # BR(~g -> ~c_R  cb)
     5.69522680E-02    2    -2000004         4   # BR(~g -> ~c_R* c )
     8.65887976E-02    2     1000005        -5   # BR(~g -> ~b_1  bb)
     8.65887976E-02    2    -1000005         5   # BR(~g -> ~b_1* b )
     6.82131059E-03    2     2000005        -5   # BR(~g -> ~b_2  bb)
     6.82131059E-03    2    -2000005         5   # BR(~g -> ~b_2* b )
     5.30401961E-03    2     1000006        -6   # BR(~g -> ~t_1  tb)
     5.30401961E-03    2    -1000006         6   # BR(~g -> ~t_1* t )
#
#         PDG            Width
DECAY   1000006     6.41360152E+01   # stop1 decays
#          BR         NDA      ID1       ID2
     1.01498967E-02    2     1000022         6   # BR(~t_1 -> ~chi_10 t )
     1.62184001E-01    2     1000023         6   # BR(~t_1 -> ~chi_20 t )
     2.62264535E-01    2     1000025         6   # BR(~t_1 -> ~chi_30 t )
     2.06093974E-01    2     1000035         6   # BR(~t_1 -> ~chi_40 t )
     2.62810805E-01    2     1000024         5   # BR(~t_1 -> ~chi_1+ b )
     9.64487240E-02    2     1000037         5   # BR(~t_1 -> ~chi_2+ b )
     4.80654218E-05    2     1000005        24   # BR(~t_1 -> ~b_1    W+)
#
#         PDG            Width
DECAY   2000006     1.16171115E+02   # stop2 decays
#          BR         NDA      ID1       ID2
     5.67274945E-02    2     1000022         6   # BR(~t_2 -> ~chi_10 t )
     5.42817364E-02    2     1000023         6   # BR(~t_2 -> ~chi_20 t )
     1.82343315E-01    2     1000025         6   # BR(~t_2 -> ~chi_30 t )
     1.28372449E-01    2     1000035         6   # BR(~t_2 -> ~chi_40 t )
     1.04649031E-01    2     1000024         5   # BR(~t_2 -> ~chi_1+ b )
     2.55372532E-01    2     1000037         5   # BR(~t_2 -> ~chi_2+ b )
     9.28665250E-02    2     1000021         6   # BR(~t_2 -> ~g      t )
     3.02054706E-02    2     1000006        25   # BR(~t_2 -> ~t_1    h )
     6.58209950E-07    2     1000005        37   # BR(~t_2 -> ~b_1    H+)
     3.21325536E-02    2     1000006        23   # BR(~t_2 -> ~t_1    Z )
     4.81434646E-07    2     1000005        24   # BR(~t_2 -> ~b_1    W+)
     6.30477531E-02    2     2000005        24   # BR(~t_2 -> ~b_2    W+)
#
#         PDG            Width
DECAY   1000005     4.49975480E+00   # sbottom1 decays
#          BR         NDA      ID1       ID2
     1.86303669E-01    2     1000022         5   # BR(~b_1 -> ~chi_10 b )
     1.39164755E-01    2     1000023         5   # BR(~b_1 -> ~chi_20 b )
     1.89349596E-01    2     1000025         5   # BR(~b_1 -> ~chi_30 b )
     7.34036703E-02    2     1000035         5   # BR(~b_1 -> ~chi_40 b )
     2.76815460E-01    2    -1000024         6   # BR(~b_1 -> ~chi_1- t )
     1.34962850E-01    2    -1000037         6   # BR(~b_1 -> ~chi_2- t )
#
#         PDG            Width
DECAY   2000005     6.40441086E+01   # sbottom2 decays
#          BR         NDA      ID1       ID2
     1.68159166E-02    2     1000022         5   # BR(~b_2 -> ~chi_10 b )
     7.75708041E-02    2     1000023         5   # BR(~b_2 -> ~chi_20 b )
     3.13528794E-02    2     1000025         5   # BR(~b_2 -> ~chi_30 b )
     8.83903287E-02    2     1000035         5   # BR(~b_2 -> ~chi_40 b )
     2.66621495E-01    2    -1000024         6   # BR(~b_2 -> ~chi_1- t )
     5.19203060E-01    2    -1000037         6   # BR(~b_2 -> ~chi_2- t )
     2.07061411E-05    2     1000005        25   # BR(~b_2 -> ~b_1    h )
     2.48094057E-05    2     1000005        23   # BR(~b_2 -> ~b_1    Z )
#
#         PDG            Width
DECAY   1000002     2.60674016E+01   # sup_L decays
#          BR         NDA      ID1       ID2
     2.63916893E-03    2     1000022         2   # BR(~u_L -> ~chi_10 u)
     1.84595725E-01    2     1000023         2   # BR(~u_L -> ~chi_20 u)
     6.44090617E-03    2     1000025         2   # BR(~u_L -> ~chi_30 u)
     1.47086050E-01    2     1000035         2   # BR(~u_L -> ~chi_40 u)
     4.37862492E-01    2     1000024         1   # BR(~u_L -> ~chi_1+ d)
     2.21375658E-01    2     1000037         1   # BR(~u_L -> ~chi_2+ d)
#
#         PDG            Width
DECAY   2000002     3.74675089E+00   # sup_R decays
#          BR         NDA      ID1       ID2
     8.75787339E-01    2     1000022         2   # BR(~u_R -> ~chi_10 u)
     8.72824498E-02    2     1000023         2   # BR(~u_R -> ~chi_20 u)
     1.65672111E-02    2     1000025         2   # BR(~u_R -> ~chi_30 u)
     2.03629999E-02    2     1000035         2   # BR(~u_R -> ~chi_40 u)
#
#         PDG            Width
DECAY   1000001     2.59814343E+01   # sdown_L decays
#          BR         NDA      ID1       ID2
     2.32254371E-02    2     1000022         1   # BR(~d_L -> ~chi_10 d)
     1.33961142E-01    2     1000023         1   # BR(~d_L -> ~chi_20 d)
     1.17921377E-02    2     1000025         1   # BR(~d_L -> ~chi_30 d)
     1.72751816E-01    2     1000035         1   # BR(~d_L -> ~chi_40 d)
     2.28214026E-01    2    -1000024         2   # BR(~d_L -> ~chi_1- u)
     4.30055442E-01    2    -1000037         2   # BR(~d_L -> ~chi_2- u)
#
#         PDG            Width
DECAY   2000001     5.42040189E-01   # sdown_R decays
#          BR         NDA      ID1       ID2
     8.79337481E-01    2     1000022         1   # BR(~d_R -> ~chi_10 d)
     8.60718254E-02    2     1000023         1   # BR(~d_R -> ~chi_20 d)
     1.58489355E-02    2     1000025         1   # BR(~d_R -> ~chi_30 d)
     1.87417580E-02    2     1000035         1   # BR(~d_R -> ~chi_40 d)
#
#         PDG            Width
DECAY   1000004     2.64595276E+01   # scharm_L decays
#          BR         NDA      ID1       ID2
     2.64152307E-03    2     1000022         4   # BR(~c_L -> ~chi_10 c)
     1.84654851E-01    2     1000023         4   # BR(~c_L -> ~chi_20 c)
     6.43985094E-03    2     1000025         4   # BR(~c_L -> ~chi_30 c)
     1.47003474E-01    2     1000035         4   # BR(~c_L -> ~chi_40 c)
     4.38011305E-01    2     1000024         3   # BR(~c_L -> ~chi_1+ s)
     2.21248995E-01    2     1000037         3   # BR(~c_L -> ~chi_2+ s)
#
#         PDG            Width
DECAY   2000004     3.73661735E+00   # scharm_R decays
#          BR         NDA      ID1       ID2
     8.75882024E-01    2     1000022         4   # BR(~c_R -> ~chi_10 c)
     8.72355143E-02    2     1000023         4   # BR(~c_R -> ~chi_20 c)
     1.65496018E-02    2     1000025         4   # BR(~c_R -> ~chi_30 c)
     2.03328602E-02    2     1000035         4   # BR(~c_R -> ~chi_40 c)
#
#         PDG            Width
DECAY   1000003     2.63681793E+01   # sstrange_L decays
#          BR         NDA      ID1       ID2
     2.32509124E-02    2     1000022         3   # BR(~s_L -> ~chi_10 s)
     1.34031499E-01    2     1000023         3   # BR(~s_L -> ~chi_20 s)
     1.17926219E-02    2     1000025         3   # BR(~s_L -> ~chi_30 s)
     1.72690222E-01    2     1000035         3   # BR(~s_L -> ~chi_40 s)
     2.28337976E-01    2    -1000024         4   # BR(~s_L -> ~chi_1- c)
     4.29896769E-01    2    -1000037         4   # BR(~s_L -> ~chi_2- c)
#
#         PDG            Width
DECAY   2000003     5.24976484E-01   # sstrange_R decays
#          BR         NDA      ID1       ID2
     8.79440182E-01    2     1000022         3   # BR(~s_R -> ~chi_10 s)
     8.60169065E-02    2     1000023         3   # BR(~s_R -> ~chi_20 s)
     1.58304062E-02    2     1000025         3   # BR(~s_R -> ~chi_30 s)
     1.87125049E-02    2     1000035         3   # BR(~s_R -> ~chi_40 s)
#
#         PDG            Width
DECAY   1000011     3.36300647E+01   # selectron_L decays
#          BR         NDA      ID1       ID2
     5.93594047E-02    2     1000022        11   # BR(~e_L -> ~chi_10 e-)
     2.23183828E-01    2     1000023        11   # BR(~e_L -> ~chi_20 e-)
     2.48925300E-03    2     1000025        11   # BR(~e_L -> ~chi_30 e-)
     1.13866880E-01    2     1000035        11   # BR(~e_L -> ~chi_40 e-)
     2.07891574E-01    2    -1000024        12   # BR(~e_L -> ~chi_1- nu_e)
     3.93209060E-01    2    -1000037        12   # BR(~e_L -> ~chi_2- nu_e)
#
#         PDG            Width
DECAY   2000011     1.33868720E+01   # selectron_R decays
#          BR         NDA      ID1       ID2
     8.74857697E-01    2     1000022        11   # BR(~e_R -> ~chi_10 e-)
     8.75813540E-02    2     1000023        11   # BR(~e_R -> ~chi_20 e-)
     1.67563281E-02    2     1000025        11   # BR(~e_R -> ~chi_30 e-)
     2.08046206E-02    2     1000035        11   # BR(~e_R -> ~chi_40 e-)
#
#         PDG            Width
DECAY   1000013     3.36300647E+01   # smuon_L decays
#          BR         NDA      ID1       ID2
     5.93594046E-02    2     1000022        13   # BR(~mu_L -> ~chi_10 mu-)
     2.23183828E-01    2     1000023        13   # BR(~mu_L -> ~chi_20 mu-)
     2.48925299E-03    2     1000025        13   # BR(~mu_L -> ~chi_30 mu-)
     1.13866880E-01    2     1000035        13   # BR(~mu_L -> ~chi_40 mu-)
     2.07891574E-01    2    -1000024        14   # BR(~mu_L -> ~chi_1- nu_mu)
     3.93209060E-01    2    -1000037        14   # BR(~mu_L -> ~chi_2- nu_mu)
#
#         PDG            Width
DECAY   2000013     1.33868719E+01   # smuon_R decays
#          BR         NDA      ID1       ID2
     8.74857697E-01    2     1000022        13   # BR(~mu_R -> ~chi_10 mu-)
     8.75813540E-02    2     1000023        13   # BR(~mu_R -> ~chi_20 mu-)
     1.67563281E-02    2     1000025        13   # BR(~mu_R -> ~chi_30 mu-)
     2.08046206E-02    2     1000035        13   # BR(~mu_R -> ~chi_40 mu-)
#
#         PDG            Width
DECAY   1000015     1.30882711E+01   # stau_1 decays
#          BR         NDA      ID1       ID2
     6.61472171E-01    2     1000022        15   # BR(~tau_1 -> ~chi_10  tau-)
     1.02201829E-01    2     1000023        15   # BR(~tau_1 -> ~chi_20  tau-)
     6.91357987E-02    2     1000025        15   # BR(~tau_1 -> ~chi_30  tau-)
     3.69539823E-02    2     1000035        15   # BR(~tau_1 -> ~chi_40  tau-)
     8.64723313E-02    2    -1000024        16   # BR(~tau_1 -> ~chi_1-  nu_tau)
     4.37638873E-02    2    -1000037        16   # BR(~tau_1 -> ~chi_2-  nu_tau)
#
#         PDG            Width
DECAY   2000015     5.30482964E+01   # stau_2 decays
#          BR         NDA      ID1       ID2
     6.19904991E-02    2     1000022        15   # BR(~tau_2 -> ~chi_10  tau-)
     2.26205620E-01    2     1000023        15   # BR(~tau_2 -> ~chi_20  tau-)
     3.05107503E-02    2     1000025        15   # BR(~tau_2 -> ~chi_30  tau-)
     1.17735792E-01    2     1000035        15   # BR(~tau_2 -> ~chi_40  tau-)
     1.93479811E-01    2    -1000024        16   # BR(~tau_2 -> ~chi_1-  nu_tau)
     3.68818342E-01    2    -1000037        16   # BR(~tau_2 -> ~chi_2-  nu_tau)
     2.86597492E-05    2     1000015        25   # BR(~tau_2 -> ~tau_1   h)
     6.00860356E-04    2     1000015        35   # BR(~tau_2 -> ~tau_1   H)
     6.00711661E-04    2     1000015        36   # BR(~tau_2 -> ~tau_1   A)
     2.89531857E-05    2     1000015        23   # BR(~tau_2 -> ~tau_1   Z)
#
#         PDG            Width
DECAY   1000012     3.36669659E+01   # snu_eL decays
#          BR         NDA      ID1       ID2
     1.15354717E-01    2     1000022        12   # BR(~nu_eL -> ~chi_10 nu_e)
     8.26805325E-02    2     1000023        12   # BR(~nu_eL -> ~chi_20 nu_e)
     1.70367475E-02    2     1000025        12   # BR(~nu_eL -> ~chi_30 nu_e)
     1.82349500E-01    2     1000035        12   # BR(~nu_eL -> ~chi_40 nu_e)
     3.99731830E-01    2     1000024        11   # BR(~nu_eL -> ~chi_1+ e-)
     2.02846673E-01    2     1000037        11   # BR(~nu_eL -> ~chi_2+ e-)
#
#         PDG            Width
DECAY   1000014     3.36669658E+01   # snu_muL decays
#          BR         NDA      ID1       ID2
     1.15354717E-01    2     1000022        14   # BR(~nu_muL -> ~chi_10 nu_mu)
     8.26805327E-02    2     1000023        14   # BR(~nu_muL -> ~chi_20 nu_mu)
     1.70367475E-02    2     1000025        14   # BR(~nu_muL -> ~chi_30 nu_mu)
     1.82349500E-01    2     1000035        14   # BR(~nu_muL -> ~chi_40 nu_mu)
     3.99731829E-01    2     1000024        13   # BR(~nu_muL -> ~chi_1+ mu-)
     2.02846673E-01    2     1000037        13   # BR(~nu_muL -> ~chi_2+ mu-)
#
#         PDG            Width
DECAY   1000016     5.30707257E+01   # snu_tauL decays
#          BR         NDA      ID1       ID2
     1.07321684E-01    2     1000022        16   # BR(~nu_tauL -> ~chi_10 nu_tau)
     7.70675165E-02    2     1000023        16   # BR(~nu_tauL -> ~chi_20 nu_tau)
     1.59292348E-02    2     1000025        16   # BR(~nu_tauL -> ~chi_30 nu_tau)
     1.71147262E-01    2     1000035        16   # BR(~nu_tauL -> ~chi_40 nu_tau)
     4.14902726E-01    2     1000024        15   # BR(~nu_tauL -> ~chi_1+ tau-)
     2.12377610E-01    2     1000037        15   # BR(~nu_tauL -> ~chi_2+ tau-)
     1.19758977E-03    2    -1000015       -37   # BR(~nu_tauL -> ~tau_1+ H-)
     5.63772927E-05    2    -1000015       -24   # BR(~nu_tauL -> ~tau_1+ W-)
#
#         PDG            Width
DECAY   1000024     1.54105464E-04   # chargino1+ decays
#           BR         NDA      ID1       ID2       ID3
     3.33612268E-01    3     1000022         2        -1   # BR(~chi_1+ -> ~chi_10 u    db)
     3.33612268E-01    3     1000022         4        -3   # BR(~chi_1+ -> ~chi_10 c    sb)
     1.11037371E-01    3     1000022       -11        12   # BR(~chi_1+ -> ~chi_10 e+   nu_e)
     1.11037371E-01    3     1000022       -13        14   # BR(~chi_1+ -> ~chi_10 mu+  nu_mu)
     1.10700723E-01    3     1000022       -15        16   # BR(~chi_1+ -> ~chi_10 tau+ nu_tau)
#
#         PDG            Width
DECAY   1000037     3.73567839E-01   # chargino2+ decays
#          BR         NDA      ID1       ID2
     3.01788958E-01    2     1000024        23   # BR(~chi_2+ -> ~chi_1+  Z )
     6.95600516E-02    2     1000022        24   # BR(~chi_2+ -> ~chi_10  W+)
     6.28650990E-01    2     1000023        24   # BR(~chi_2+ -> ~chi_20  W+)
#
#         PDG            Width
DECAY   1000022     0.00000000E+00   # neutralino1 decays
#
#         PDG            Width
DECAY   1000023     4.18191591E-05   # neutralino2 decays
#          BR         NDA      ID1       ID2
     1.91503629E-03    2     1000022        22   # BR(~chi_20 -> ~chi_10 gam)
#           BR         NDA      ID1       ID2       ID3
     1.17926873E-01    3     1000022        -2         2   # BR(~chi_20 -> ~chi_10 ub      u)
     1.52615218E-01    3     1000022        -1         1   # BR(~chi_20 -> ~chi_10 db      d)
     1.17926873E-01    3     1000022        -4         4   # BR(~chi_20 -> ~chi_10 cb      c)
     1.52615218E-01    3     1000022        -3         3   # BR(~chi_20 -> ~chi_10 sb      s)
     1.45258522E-01    3     1000022        -5         5   # BR(~chi_20 -> ~chi_10 bb      b)
     3.45738859E-02    3     1000022       -11        11   # BR(~chi_20 -> ~chi_10 e+      e-)
     3.45738859E-02    3     1000022       -13        13   # BR(~chi_20 -> ~chi_10 mu+     mu-)
     3.42799140E-02    3     1000022       -15        15   # BR(~chi_20 -> ~chi_10 tau+    tau-)
     6.93917832E-02    3     1000022       -12        12   # BR(~chi_20 -> ~chi_10 nu_eb   nu_e)
     6.93917832E-02    3     1000022       -14        14   # BR(~chi_20 -> ~chi_10 nu_mub  nu_mu)
     6.95251717E-02    3     1000022       -16        16   # BR(~chi_20 -> ~chi_10 nu_taub nu_tau)
     1.09185595E-06    3     1000024        -2         1   # BR(~chi_20 -> ~chi_1+ ub      d)
     1.09185595E-06    3    -1000024        -1         2   # BR(~chi_20 -> ~chi_1- db      u)
     1.09185595E-06    3     1000024        -4         3   # BR(~chi_20 -> ~chi_1+ cb      s)
     1.09185595E-06    3    -1000024        -3         4   # BR(~chi_20 -> ~chi_1- sb      c)
     3.63845024E-07    3     1000024       -12        11   # BR(~chi_20 -> ~chi_1+ nu_eb   e-)
     3.63845024E-07    3    -1000024        12       -11   # BR(~chi_20 -> ~chi_1- nu_e    e+)
     3.63845024E-07    3     1000024       -14        13   # BR(~chi_20 -> ~chi_1+ nu_mub  mu-)
     3.63845024E-07    3    -1000024        14       -13   # BR(~chi_20 -> ~chi_1- nu_mu   mu+)
     6.88978786E-09    3     1000024       -16        15   # BR(~chi_20 -> ~chi_1+ nu_taub tau-)
     6.88978786E-09    3    -1000024        16       -15   # BR(~chi_20 -> ~chi_1- nu_tau  tau+)
#
#         PDG            Width
DECAY   1000025     4.93533418E-02   # neutralino3 decays
#          BR         NDA      ID1       ID2
     9.96639566E-01    2     1000022        23   # BR(~chi_30 -> ~chi_10   Z )
     3.36043381E-03    2     1000022        25   # BR(~chi_30 -> ~chi_10   h )
#
#         PDG            Width
DECAY   1000035     5.09646154E-01   # neutralino4 decays
#          BR         NDA      ID1       ID2
     3.79817344E-02    2     1000022        23   # BR(~chi_40 -> ~chi_10   Z )
     1.17496962E-05    2     1000023        23   # BR(~chi_40 -> ~chi_20   Z )
     4.58162308E-01    2     1000024       -24   # BR(~chi_40 -> ~chi_1+   W-)
     4.58162308E-01    2    -1000024        24   # BR(~chi_40 -> ~chi_1-   W+)
     4.56818992E-02    2     1000022        25   # BR(~chi_40 -> ~chi_10   h )
#
#         PDG            Width
DECAY        25     5.59434803E-03   # h decays
#          BR         NDA      ID1       ID2
     4.44262702E-01    2           5        -5   # BR(h -> b       bb     )
     4.76275940E-02    2         -15        15   # BR(h -> tau+    tau-   )
     1.68582545E-04    2         -13        13   # BR(h -> mu+     mu-    )
     1.83916330E-04    2           3        -3   # BR(h -> s       sb     )
     1.54742000E-02    2           4        -4   # BR(h -> c       cb     )
     5.67430489E-02    2          21        21   # BR(h -> g       g      )
     1.71534798E-03    2          22        22   # BR(h -> gam     gam    )
     1.08877333E-03    2          22        23   # BR(h -> Z       gam    )
     1.45793790E-01    2          24       -24   # BR(h -> W+      W-     )
     1.81076334E-02    2          23        23   # BR(h -> Z       Z      )
     2.68834412E-01    2     1000022   1000022   # BR(h -> ~chi_10 ~chi_10)
#
#         PDG            Width
DECAY        35     2.42083498E+01   # H decays
#          BR         NDA      ID1       ID2
     2.83206563E-01    2           5        -5   # BR(H -> b       bb     )
     4.72733947E-02    2         -15        15   # BR(H -> tau+    tau-   )
     1.66971484E-04    2         -13        13   # BR(H -> mu+     mu-    )
     1.13904184E-04    2           3        -3   # BR(H -> s       sb     )
     5.47215077E-08    2           4        -4   # BR(H -> c       cb     )
     5.04270394E-03    2           6        -6   # BR(H -> t       tb     )
     1.67756538E-05    2          21        21   # BR(H -> g       g      )
     3.25180466E-07    2          22        22   # BR(H -> gam     gam    )
     9.74886019E-09    2          23        22   # BR(H -> Z       gam    )
     1.38656860E-05    2          24       -24   # BR(H -> W+      W-     )
     6.87407414E-06    2          23        23   # BR(H -> Z       Z      )
     4.94126251E-05    2          25        25   # BR(H -> h       h      )
     1.69535600E-01    2     1000024  -1000024   # BR(H -> ~chi_1+ ~chi_1-)
     3.30991841E-02    2     1000037  -1000037   # BR(H -> ~chi_2+ ~chi_2-)
     1.01078910E-01    2     1000024  -1000037   # BR(H -> ~chi_1+ ~chi_2-)
     1.01078910E-01    2     1000037  -1000024   # BR(H -> ~chi_2+ ~chi_1-)
     1.51758534E-02    2     1000022   1000022   # BR(H -> ~chi_10 ~chi_10)
     3.08466009E-02    2     1000023   1000023   # BR(H -> ~chi_20 ~chi_20)
     1.01208864E-02    2     1000025   1000025   # BR(H -> ~chi_30 ~chi_30)
     3.11111706E-02    2     1000035   1000035   # BR(H -> ~chi_40 ~chi_40)
     4.71265667E-02    2     1000022   1000023   # BR(H -> ~chi_10 ~chi_20)
     2.33945294E-02    2     1000022   1000025   # BR(H -> ~chi_10 ~chi_30)
     9.57999596E-05    2     1000022   1000035   # BR(H -> ~chi_10 ~chi_40)
     1.30250683E-02    2     1000023   1000025   # BR(H -> ~chi_20 ~chi_30)
     7.30617390E-03    2     1000023   1000035   # BR(H -> ~chi_20 ~chi_40)
     8.11138911E-02    2     1000025   1000035   # BR(H -> ~chi_30 ~chi_40)
#
#         PDG            Width
DECAY        36     2.42112149E+01   # A decays
#          BR         NDA      ID1       ID2
     2.83208358E-01    2           5        -5   # BR(A -> b       bb     )
     4.72702133E-02    2         -15        15   # BR(A -> tau+    tau-   )
     1.66958876E-04    2         -13        13   # BR(A -> mu+     mu-    )
     1.13914405E-04    2           3        -3   # BR(A -> s       sb     )
     5.34981360E-08    2           4        -4   # BR(A -> c       cb     )
     5.18656816E-03    2           6        -6   # BR(A -> t       tb     )
     5.45111520E-05    2          21        21   # BR(A -> g       g      )
     4.32313284E-07    2          22        22   # BR(A -> gam     gam    )
     3.06990052E-08    2          23        22   # BR(A -> Z       gam    )
     1.37982937E-05    2          23        25   # BR(A -> Z       h      )
     1.93464160E-01    2     1000024  -1000024   # BR(A -> ~chi_1+ ~chi_1-)
     5.55807183E-02    2     1000037  -1000037   # BR(A -> ~chi_2+ ~chi_2-)
     7.78440805E-02    2     1000024  -1000037   # BR(A -> ~chi_1+ ~chi_2-)
     7.78440805E-02    2     1000037  -1000024   # BR(A -> ~chi_2+ ~chi_1-)
     1.62879282E-02    2     1000022   1000022   # BR(A -> ~chi_10 ~chi_10)
     3.66647849E-02    2     1000023   1000023   # BR(A -> ~chi_20 ~chi_20)
     8.93990729E-03    2     1000025   1000025   # BR(A -> ~chi_30 ~chi_30)
     4.68003870E-02    2     1000035   1000035   # BR(A -> ~chi_40 ~chi_40)
     5.34818311E-02    2     1000022   1000023   # BR(A -> ~chi_10 ~chi_20)
     1.73936909E-02    2     1000022   1000025   # BR(A -> ~chi_10 ~chi_30)
     4.56770876E-07    2     1000022   1000035   # BR(A -> ~chi_10 ~chi_40)
     8.28278668E-03    2     1000023   1000025   # BR(A -> ~chi_20 ~chi_30)
     7.84667343E-03    2     1000023   1000035   # BR(A -> ~chi_20 ~chi_40)
     6.35536751E-02    2     1000025   1000035   # BR(A -> ~chi_30 ~chi_40)
#
#         PDG            Width
DECAY        37     2.39006770E+01   # H+ decays
#          BR         NDA      ID1       ID2
     4.70935793E-04    2           4        -5   # BR(H+ -> c       bb     )
     4.79955381E-02    2         -15        16   # BR(H+ -> tau+    nu_tau )
     1.69520727E-04    2         -13        14   # BR(H+ -> mu+     nu_mu  )
     4.70932716E-06    2           2        -5   # BR(H+ -> u       bb     )
     5.76500858E-06    2           2        -3   # BR(H+ -> u       sb     )
     1.13524679E-04    2           4        -3   # BR(H+ -> c       sb     )
     2.81903795E-01    2           6        -5   # BR(H+ -> t       bb     )
     1.41312738E-05    2          24        25   # BR(H+ -> W+      h      )
     1.06542148E-11    2          24        36   # BR(H+ -> W+      A      )
     7.87265876E-02    2     1000024   1000022   # BR(H+ -> ~chi_1+ ~chi_10)
     1.28051218E-02    2     1000024   1000023   # BR(H+ -> ~chi_1+ ~chi_20)
     8.13625573E-02    2     1000024   1000025   # BR(H+ -> ~chi_1+ ~chi_30)
     1.44734625E-01    2     1000024   1000035   # BR(H+ -> ~chi_1+ ~chi_40)
     3.52208245E-03    2     1000037   1000022   # BR(H+ -> ~chi_2+ ~chi_10)
     2.48439803E-01    2     1000037   1000023   # BR(H+ -> ~chi_2+ ~chi_20)
     9.74604241E-02    2     1000037   1000025   # BR(H+ -> ~chi_2+ ~chi_30)
     2.27088000E-03    2     1000037   1000035   # BR(H+ -> ~chi_2+ ~chi_40)
