#
#                              ======================
#                              | THE SUSYHIT OUTPUT |
#                              ======================
#
#
#              ------------------------------------------------------
#              |     This is the output of the SUSY-HIT package     |
#              |  created by A.Djouadi, M.Muehlleitner and M.Spira. |
#              |  In case of problems with SUSY-HIT email to        |
#              |           margarete.muehlleitner@cern.ch           |
#              |           michael.spira@psi.ch                     |
#              |           abdelhak.djouadi@cern.ch                 |
#              ------------------------------------------------------
#
#              ------------------------------------------------------
#              |  SUSY Les Houches Accord - MSSM Spectrum + Decays  |
#              |              based on the decay programs           |
#              |                                                    |
#              |                     SDECAY 1.3b                    |
#              |                                                    |
#              |  Authors: M.Muhlleitner, A.Djouadi and Y.Mambrini  |
#              |  Ref.:    Comput.Phys.Commun.168(2005)46           |
#              |           [hep-ph/0311167]                         |
#              |                                                    |
#              |                     HDECAY 3.4                     |
#              |                                                    |
#              |  By: A.Djouadi,J.Kalinowski,M.Muhlleitner,M.Spira  |
#              |  Ref.:    Comput.Phys.Commun.108(1998)56           |
#              |           [hep-ph/9704448]                         |
#              |                                                    |
#              |                                                    |
#              |  If not stated otherwise all DRbar couplings and   |
#              |  soft SUSY breaking masses are given at the scale  |
#              |  Q=  0.12668430E+04
#              |                                                    |
#              ------------------------------------------------------
#
#
BLOCK DCINFO  # Decay Program information
     1   SDECAY/HDECAY # decay calculator
     2   1.3b  /3.4    # version number
#
BLOCK SPINFO  # Spectrum calculator information
     1     SOFTSUSY    # spectrum calculator               
     2     3.4.0       # version number                    
#
BLOCK MODSEL  # Model selection
     1     0   #  nonUniversal                                     
#
BLOCK SMINPUTS  # Standard Model inputs
         1     1.27908970E+02   # alpha_em^-1(M_Z)^MSbar
         2     1.16637870E-05   # G_F [GeV^-2]
         3     1.18400000E-01   # alpha_S(M_Z)^MSbar
         4     9.11876000E+01   # M_Z pole mass
         5     4.18000000E+00   # mb(mb)^MSbar
         6     1.73200000E+02   # mt pole mass
         7     1.77700000E+00   # mtau pole mass
#
BLOCK MINPAR  # Input parameters - minimal models
         3     4.50700000E+01   # tanb                
#
BLOCK EXTPAR  # Input parameters - non-minimal models
         0    -1.00000000E+00   # Set                 
         1     2.68345000E+03   # M_1(MX)             
         2     4.00990000E+02   # M_2(MX)             
         3     2.64234000E+03   # M_3(MX)             
        11    -3.28084000E+03   # At(MX)              
        12    -1.96956000E+03   # Ab(MX)              
        13     1.80674000E+03   # Atau(MX)            
        23     3.61943000E+03   # mu(MX)              
        26     3.18207000E+03   # mA(pole)            
        31     5.24900000E+02   # meL(MX)             
        32     5.24900000E+02   # mmuL(MX)            
        33     1.62538000E+03   # mtauL(MX)           
        34     1.77232000E+03   # meR(MX)             
        35     1.77232000E+03   # mmuR(MX)            
        36     2.17426000E+03   # mtauR(MX)           
        41     3.57475000E+03   # mqL1(MX)            
        42     3.57475000E+03   # mqL2(MX)            
        43     7.70730000E+02   # mqL3(MX)            
        44     1.39948000E+03   # muR(MX)             
        45     1.39948000E+03   # mcR(MX)             
        46     2.13767000E+03   # mtR(MX)             
        47     2.04280000E+03   # mdR(MX)             
        48     2.04280000E+03   # msR(MX)             
        49     2.65902000E+03   # mbR(MX)             
#
BLOCK MASS  # Mass Spectrum
# PDG code           mass       particle
        24     8.03764227E+01   # W+
        25     1.25815727E+02   # h
        35     3.18454496E+03   # H
        36     3.18207260E+03   # A
        37     3.18290888E+03   # H+
         5     4.81876030E+00   # b-quark pole mass calculated from mb(mb)_Msbar
   1000001     3.59401326E+03   # ~d_L
   2000001     2.06686606E+03   # ~d_R
   1000002     3.59328010E+03   # ~u_L
   2000002     1.39777687E+03   # ~u_R
   1000003     3.59401326E+03   # ~s_L
   2000003     2.06686606E+03   # ~s_R
   1000004     3.59328010E+03   # ~c_L
   2000004     1.39777687E+03   # ~c_R
   1000005     6.99324402E+02   # ~b_1
   2000005     2.68044332E+03   # ~b_2
   1000006     6.71603029E+02   # ~t_1
   2000006     2.12195887E+03   # ~t_2
   1000011     5.18258040E+02   # ~e_L
   2000011     1.78013142E+03   # ~e_R
   1000012     5.12024726E+02   # ~nu_eL
   1000013     5.18258040E+02   # ~mu_L
   2000013     1.78013142E+03   # ~mu_R
   1000014     5.12024726E+02   # ~nu_muL
   1000015     1.60896206E+03   # ~tau_1
   2000015     2.17255825E+03   # ~tau_2
   1000016     1.61837262E+03   # ~nu_tauL
   1000021     2.67971392E+03   # ~g
   1000022     4.23722185E+02   # ~chi_10
   1000023     2.67064021E+03   # ~chi_20
   1000025    -3.61379790E+03   # ~chi_30
   1000035     3.61527487E+03   # ~chi_40
   1000024     4.23883590E+02   # ~chi_1+
   1000037     3.61510597E+03   # ~chi_2+
#
BLOCK NMIX  # Neutralino Mixing Matrix
  1  1    -1.33223725E-04   # N_11
  1  2     9.99741597E-01   # N_12
  1  3    -2.24549359E-02   # N_13
  1  4     3.53522741E-03   # N_14
  2  1     9.99307924E-01   # N_21
  2  2     8.74937574E-04   # N_22
  2  3     2.94504434E-02   # N_23
  2  4    -2.27063595E-02   # N_24
  3  1    -4.77634358E-03   # N_31
  3  2     1.33762505E-02   # N_32
  3  3     7.06901771E-01   # N_33
  3  4     7.07169109E-01   # N_34
  4  1    -3.68895878E-02   # N_41
  4  2     1.83589252E-02   # N_42
  4  3     7.06341513E-01   # N_43
  4  4    -7.06670910E-01   # N_44
#
BLOCK UMIX  # Chargino Mixing Matrix U
  1  1     9.99496218E-01   # U_11
  1  2    -3.17381592E-02   # U_12
  2  1     3.17381592E-02   # U_21
  2  2     9.99496218E-01   # U_22
#
BLOCK VMIX  # Chargino Mixing Matrix V
  1  1     9.99987463E-01   # V_11
  1  2    -5.00735114E-03   # V_12
  2  1     5.00735114E-03   # V_21
  2  2     9.99987463E-01   # V_22
#
BLOCK STOPMIX  # Stop Mixing Matrix
  1  1     9.92099100E-01   # cos(theta_t)
  1  2     1.25456669E-01   # sin(theta_t)
  2  1    -1.25456669E-01   # -sin(theta_t)
  2  2     9.92099100E-01   # cos(theta_t)
#
BLOCK SBOTMIX  # Sbottom Mixing Matrix
  1  1     9.99288332E-01   # cos(theta_b)
  1  2     3.77204126E-02   # sin(theta_b)
  2  1    -3.77204126E-02   # -sin(theta_b)
  2  2     9.99288332E-01   # cos(theta_b)
#
BLOCK STAUMIX  # Stau Mixing Matrix
  1  1     9.91293312E-01   # cos(theta_tau)
  1  2     1.31672205E-01   # sin(theta_tau)
  2  1    -1.31672205E-01   # -sin(theta_tau)
  2  2     9.91293312E-01   # cos(theta_tau)
#
BLOCK ALPHA  # Higgs mixing
          -2.28410349E-02   # Mixing angle in the neutral Higgs boson sector
#
BLOCK HMIX Q=  1.26684300E+03  # DRbar Higgs Parameters
         1     3.62844597E+03   # mu(Q)MSSM           
         2     4.39769262E+01   # tan                 
         3     2.44202101E+02   # higgs               
         4     1.09694715E+07   # mA^2(Q)MSSM         
#
BLOCK GAUGE Q=  1.26684300E+03  # The gauge couplings
     1     3.62104830E-01   # gprime(Q) DRbar
     2     6.38102186E-01   # g(Q) DRbar
     3     1.03223689E+00   # g3(Q) DRbar
#
BLOCK AU Q=  1.26684300E+03  # The trilinear couplings
  1  1     0.00000000E+00   # A_u(Q) DRbar
  2  2     0.00000000E+00   # A_c(Q) DRbar
  3  3    -3.28084000E+03   # A_t(Q) DRbar
#
BLOCK AD Q=  1.26684300E+03  # The trilinear couplings
  1  1     0.00000000E+00   # A_d(Q) DRbar
  2  2     0.00000000E+00   # A_s(Q) DRbar
  3  3    -1.96956000E+03   # A_b(Q) DRbar
#
BLOCK AE Q=  1.26684300E+03  # The trilinear couplings
  1  1     0.00000000E+00   # A_e(Q) DRbar
  2  2     0.00000000E+00   # A_mu(Q) DRbar
  3  3     1.80674000E+03   # A_tau(Q) DRbar
#
BLOCK Yu Q=  1.26684300E+03  # The Yukawa couplings
  1  1     0.00000000E+00   # y_u(Q) DRbar
  2  2     0.00000000E+00   # y_c(Q) DRbar
  3  3     8.29234538E-01   # y_t(Q) DRbar
#
BLOCK Yd Q=  1.26684300E+03  # The Yukawa couplings
  1  1     0.00000000E+00   # y_d(Q) DRbar
  2  2     0.00000000E+00   # y_s(Q) DRbar
  3  3     4.00892311E-01   # y_b(Q) DRbar
#
BLOCK Ye Q=  1.26684300E+03  # The Yukawa couplings
  1  1     0.00000000E+00   # y_e(Q) DRbar
  2  2     0.00000000E+00   # y_mu(Q) DRbar
  3  3     4.51169685E-01   # y_tau(Q) DRbar
#
BLOCK MSOFT Q=  1.26684300E+03  # The soft SUSY breaking masses at the scale Q
         1     2.68345000E+03   # M_1(Q)              
         2     4.00990000E+02   # M_2(Q)              
         3     2.64234000E+03   # M_3(Q)              
        21    -2.18507875E+06   # mH1^2(Q)            
        22    -1.31181577E+07   # mH2^2(Q)            
        31     5.24900000E+02   # meL(Q)              
        32     5.24900000E+02   # mmuL(Q)             
        33     1.62538000E+03   # mtauL(Q)            
        34     1.77232000E+03   # meR(Q)              
        35     1.77232000E+03   # mmuR(Q)             
        36     2.17426000E+03   # mtauR(Q)            
        41     3.57475000E+03   # mqL1(Q)             
        42     3.57475000E+03   # mqL2(Q)             
        43     7.70729988E+02   # mqL3(Q)             
        44     1.39948000E+03   # muR(Q)              
        45     1.39948000E+03   # mcR(Q)              
        46     2.13766999E+03   # mtR(Q)              
        47     2.04280000E+03   # mdR(Q)              
        48     2.04280000E+03   # msR(Q)              
        49     2.65902000E+03   # mbR(Q)              
#
Block HiggsBoundsInputHiggsCouplingsFermions
# ScalarNormEffCoupSq PseudoSNormEffCoupSq NP   IP1 IP2 IP2
    1.00932324E+00    0.00000000E+00        3  25   5   5  # h0-b-b eff. coupling^2, normalised to SM
    1.93396071E+03    0.00000000E+00        3  35   5   5  # H0-b-b eff. coupling^2, normalised to SM
    0.00000000E+00    1.93397004E+03        3  36   5   5  # A0-b-b eff. coupling^2, normalised to SM
#
    9.99995179E-01    0.00000000E+00        3  25   6   6  # h0-t-t eff. coupling^2, normalised to SM
    5.21891869E-04    0.00000000E+00        3  35   6   6  # H0-t-t eff. coupling^2, normalised to SM
    0.00000000E+00    5.17071092E-04        3  36   6   6  # A0-t-t eff. coupling^2, normalised to SM
#
    1.00932324E+00    0.00000000E+00        3  25  15  15  # h0-tau-tau eff. coupling^2, normalised to SM
    1.93396071E+03    0.00000000E+00        3  35  15  15  # H0-tau-tau eff. coupling^2, normalised to SM
    0.00000000E+00    1.93397004E+03        3  36  15  15  # A0-tau-tau eff. coupling^2, normalised to SM
#
Block HiggsBoundsInputHiggsCouplingsBosons
    9.99999989E-01        3  25  24  24  # h0-W-W eff. coupling^2, normalised to SM
    1.11842637E-08        3  35  24  24  # H0-W-W eff. coupling^2, normalised to SM
    0.00000000E+00        3  36  24  24  # A0-W-W eff. coupling^2, normalised to SM
#
    9.99999989E-01        3  25  23  23  # h0-Z-Z eff. coupling^2, normalised to SM
    1.11842637E-08        3  35  23  23  # H0-Z-Z eff. coupling^2, normalised to SM
    0.00000000E+00        3  36  23  23  # A0-Z-Z eff. coupling^2, normalised to SM
#
    7.85475143E-01        3  25  21  21  # h0-g-g eff. coupling^2, normalised to SM
    6.98904523E-13        3  35  21  21  # H0-g-g eff. coupling^2, normalised to SM
    3.20525570E-12        3  36  21  21  # A0-g-g eff. coupling^2, normalised to SM
#
    0.00000000E+00        3  25  25  23  # h0-h0-Z eff. coupling^2, normalised to SM
    0.00000000E+00        3  35  25  23  # H0-h0-Z eff. coupling^2, normalised to SM
    1.11842637E-08        3  36  25  23  # A0-h0-Z eff. coupling^2, normalised to SM
    0.00000000E+00        3  35  35  23  # H0-H0-Z eff. coupling^2, normalised to SM
    9.99999989E-01        3  36  35  23  # A0-H0-Z eff. coupling^2, normalised to SM
    0.00000000E+00        3  36  36  23  # A0-A0-Z eff. coupling^2, normalised to SM
#
    0.00000000E+00        4  25  21  21  23  # h0-g-g-Z eff. coupling^2, normalised to SM
    0.00000000E+00        4  35  21  21  23  # H0-g-g-Z eff. coupling^2, normalised to SM
    0.00000000E+00        4  36  21  21  23  # A0-g-g-Z eff. coupling^2, normalised to SM
#
#
#
#                             =================
#                             |The decay table|
#                             =================
#
# - The QCD corrections to the decays gluino -> squark  + quark
#                                     squark -> gaugino + quark_prime
#                                     squark -> squark_prime + Higgs
#                                     squark -> gluino  + quark
#   are included.
#
# - The multi-body decays for the inos, stops and sbottoms are included.
#
# - The loop induced decays for the gluino, neutralinos and stops
#   are included.
#
# - The SUSY decays of the top quark are included.
#
#
#         PDG            Width
DECAY         6     1.43460828E+00   # top decays
#          BR         NDA      ID1       ID2
     1.00000000E+00    2           5        24   # BR(t ->  b    W+)
#
#         PDG            Width
DECAY   1000021     1.70541646E+02   # gluino decays
#          BR         NDA      ID1       ID2
     2.76416692E-02    2     2000001        -1   # BR(~g -> ~d_R  db)
     2.76416692E-02    2    -2000001         1   # BR(~g -> ~d_R* d )
     8.92517393E-02    2     2000002        -2   # BR(~g -> ~u_R  ub)
     8.92517393E-02    2    -2000002         2   # BR(~g -> ~u_R* u )
     2.76416692E-02    2     2000003        -3   # BR(~g -> ~s_R  sb)
     2.76416692E-02    2    -2000003         3   # BR(~g -> ~s_R* s )
     8.92517070E-02    2     2000004        -4   # BR(~g -> ~c_R  cb)
     8.92517070E-02    2    -2000004         4   # BR(~g -> ~c_R* c )
     1.23825447E-01    2     1000005        -5   # BR(~g -> ~b_1  bb)
     1.23825447E-01    2    -1000005         5   # BR(~g -> ~b_1* b )
     1.21440765E-01    2     1000006        -6   # BR(~g -> ~t_1  tb)
     1.21440765E-01    2    -1000006         6   # BR(~g -> ~t_1* t )
     2.09470034E-02    2     2000006        -6   # BR(~g -> ~t_2  tb)
     2.09470034E-02    2    -2000006         6   # BR(~g -> ~t_2* t )
#
#         PDG            Width
DECAY   1000006     2.54590456E+00   # stop1 decays
#          BR         NDA      ID1       ID2
     2.37803658E-01    2     1000022         6   # BR(~t_1 -> ~chi_10 t )
     7.62196342E-01    2     1000024         5   # BR(~t_1 -> ~chi_1+ b )
#
#         PDG            Width
DECAY   2000006     1.31653019E+02   # stop2 decays
#          BR         NDA      ID1       ID2
     8.39251670E-04    2     1000022         6   # BR(~t_2 -> ~chi_10 t )
     1.70492142E-03    2     1000024         5   # BR(~t_2 -> ~chi_1+ b )
     2.32245784E-01    2     1000006        25   # BR(~t_2 -> ~t_1    h )
     2.61756918E-01    2     1000006        23   # BR(~t_2 -> ~t_1    Z )
     5.03453125E-01    2     1000005        24   # BR(~t_2 -> ~b_1    W+)
#
#         PDG            Width
DECAY   1000005     2.69428487E+00   # sbottom1 decays
#          BR         NDA      ID1       ID2
     4.20761783E-01    2     1000022         5   # BR(~b_1 -> ~chi_10 b )
     5.79238217E-01    2    -1000024         6   # BR(~b_1 -> ~chi_1- t )
#
#         PDG            Width
DECAY   2000005     2.84435611E+01   # sbottom2 decays
#          BR         NDA      ID1       ID2
     1.14812078E-04    2     1000022         5   # BR(~b_2 -> ~chi_10 b )
     2.39611359E-06    2     1000023         5   # BR(~b_2 -> ~chi_20 b )
     2.27197540E-04    2    -1000024         6   # BR(~b_2 -> ~chi_1- t )
     2.61766159E-01    2     1000005        25   # BR(~b_2 -> ~b_1    h )
     2.49623356E-01    2     1000005        23   # BR(~b_2 -> ~b_1    Z )
     4.87787062E-01    2     1000006       -24   # BR(~b_2 -> ~t_1    W-)
     4.79017474E-04    2     2000006       -24   # BR(~b_2 -> ~t_2    W-)
#
#         PDG            Width
DECAY   1000002     9.88286631E+01   # sup_L decays
#          BR         NDA      ID1       ID2
     1.36518178E-01    2     1000022         2   # BR(~u_L -> ~chi_10 u)
     1.03803919E-03    2     1000023         2   # BR(~u_L -> ~chi_20 u)
     2.73178834E-01    2     1000024         1   # BR(~u_L -> ~chi_1+ d)
     5.89264948E-01    2     1000021         2   # BR(~u_L -> ~g      u)
#
#         PDG            Width
DECAY   2000002     5.16398737E-03   # sup_R decays
#           BR         NDA      ID1       ID2
     9.31206288E-06    2     1000022         2   # BR(~u_R -> ~chi_10 u)
#           BR         NDA      ID1       ID2       ID3
     4.60903528E-01    3        2       -5        1000005   # BR(~u_R -> u  bb  ~b_1)
     7.23162109E-02    3        2       5        -1000005   # BR(~u_R -> u  b  ~b_1*)
     4.01046682E-01    3        2       -6        1000006   # BR(~u_R -> u  tb  ~t_1)
     5.21476876E-02    3        2       6        -1000006   # BR(~u_R -> u  t  ~t_1*)
     2.93377944E-03    3        2       -11        1000011   # BR(~u_R -> u  e+  ~e_L-)
     3.87917293E-04    3        2       11        -1000011   # BR(~u_R -> u  e-  ~e_L+)
     3.04512751E-03    3        2       -12        1000012   # BR(~u_R -> u  nu_eb  ~nu_eL)
     3.87762374E-04    3        2       12        -1000012   # BR(~u_R -> u  nu_e  ~nu_eL*)
     2.99903909E-03    3        2       -13        1000013   # BR(~u_R -> u  mu+  ~mu_L-)
     3.89098550E-04    3        2       13        -1000013   # BR(~u_R -> u  mu-  ~mu_L+)
     3.04144818E-03    3        2       -14        1000014   # BR(~u_R -> u  nu_mub  ~nu_muL)
     3.87956022E-04    3        2       14        -1000014   # BR(~u_R -> u  nu_mu  ~nu_muL*)
     9.87395908E-08    3        2       23        1000022   # BR(~u_R -> u  Z  ~chi_10)
     8.74634207E-07    3        2       25        1000022   # BR(~u_R -> u  h  ~chi_10)
     2.00678260E-06    3        2       -24        1000024   # BR(~u_R -> u  W-  ~chi_1+)
     1.47047223E-06    3        2       24        -1000024   # BR(~u_R -> u  W+  ~chi_1-)
#
#         PDG            Width
DECAY   1000001     9.88821460E+01   # sdown_L decays
#          BR         NDA      ID1       ID2
     1.36488297E-01    2     1000022         1   # BR(~d_L -> ~chi_10 d)
     1.01966670E-03    2     1000023         1   # BR(~d_L -> ~chi_20 d)
     2.72823259E-01    2    -1000024         2   # BR(~d_L -> ~chi_1- u)
     5.89668778E-01    2     1000021         1   # BR(~d_L -> ~g      d)
#
#         PDG            Width
DECAY   2000001     9.14300372E-02   # sdown_R decays
#           BR         NDA      ID1       ID2
     2.11271729E-07    2     1000022         1   # BR(~d_R -> ~chi_10 d)
#           BR         NDA      ID1       ID2       ID3
     9.35688124E-03    3        1       -2        2000002   # BR(~d_R -> d  ub  ~u_R)
     2.17948068E-02    3        1       2        -2000002   # BR(~d_R -> d  u  ~u_R*)
     9.40817730E-03    3        1       -4        2000004   # BR(~d_R -> d  cb  ~c_R)
     2.20244907E-02    3        1       4        -2000004   # BR(~d_R -> d  c  ~c_R*)
     3.72689338E-01    3        1       -5        1000005   # BR(~d_R -> d  bb  ~b_1)
     1.08192016E-01    3        1       5        -1000005   # BR(~d_R -> d  b  ~b_1*)
     3.55539613E-01    3        1       -6        1000006   # BR(~d_R -> d  tb  ~t_1)
     9.90670055E-02    3        1       6        -1000006   # BR(~d_R -> d  t  ~t_1*)
     3.75817413E-04    3        1       -11        1000011   # BR(~d_R -> d  e+  ~e_L-)
     9.70414130E-05    3        1       11        -1000011   # BR(~d_R -> d  e-  ~e_L+)
     6.92704520E-07    3        1       -11        2000011   # BR(~d_R -> d  e+  ~e_R-)
     1.34299409E-06    3        1       11        -2000011   # BR(~d_R -> d  e-  ~e_R+)
     3.79054861E-04    3        1       -12        1000012   # BR(~d_R -> d  nu_eb  ~nu_eL)
     9.77260895E-05    3        1       12        -1000012   # BR(~d_R -> d  nu_e  ~nu_eL*)
     3.82861050E-04    3        1       -13        1000013   # BR(~d_R -> d  mu+  ~mu_L-)
     9.73793763E-05    3        1       13        -1000013   # BR(~d_R -> d  mu-  ~mu_L+)
     7.06069931E-07    3        1       -13        2000013   # BR(~d_R -> d  mu+  ~mu_R-)
     1.33468173E-06    3        1       13        -2000013   # BR(~d_R -> d  mu-  ~mu_R+)
     3.85868814E-04    3        1       -14        1000014   # BR(~d_R -> d  nu_mub  ~nu_muL)
     9.87804476E-05    3        1       14        -1000014   # BR(~d_R -> d  nu_mu  ~nu_muL*)
     2.81395489E-06    3        1       -15        1000015   # BR(~d_R -> d  tau+  ~tau_1-)
     1.54325651E-06    3        1       15        -1000015   # BR(~d_R -> d  tau-  ~tau_1+)
     2.55550591E-06    3        1       -16        1000016   # BR(~d_R -> d  nu_taub  ~nu_tau1)
     1.23865202E-06    3        1       16        -1000016   # BR(~d_R -> d  nu_tau  ~nu_tau1*)
     2.75894014E-08    3        1       23        1000022   # BR(~d_R -> d  Z  ~chi_10)
     1.44613307E-07    3        1       25        1000022   # BR(~d_R -> d  h  ~chi_10)
     3.13343414E-07    3        1       -24        1000024   # BR(~d_R -> d  W-  ~chi_1+)
     2.18516809E-07    3        1       24        -1000024   # BR(~d_R -> d  W+  ~chi_1-)
#
#         PDG            Width
DECAY   1000004     8.25650577E+01   # scharm_L decays
#          BR         NDA      ID1       ID2
     1.71303447E-01    2     1000022         4   # BR(~c_L -> ~chi_10 c)
     1.27356935E-03    2     1000023         4   # BR(~c_L -> ~chi_20 c)
     3.42785475E-01    2     1000024         3   # BR(~c_L -> ~chi_1+ s)
     4.84637508E-01    2     1000021         4   # BR(~c_L -> ~g      c)
#
#         PDG            Width
DECAY   2000004     5.15939748E-03   # scharm_R decays
#           BR         NDA      ID1       ID2
     9.19434282E-06    2     1000022         4   # BR(~c_R -> ~chi_10 c)
#           BR         NDA      ID1       ID2       ID3
     4.61100353E-01    3        4       -5        1000005   # BR(~c_R -> c  bb  ~b_1)
     7.18611042E-02    3        4       5        -1000005   # BR(~c_R -> c  b  ~b_1*)
     4.01035200E-01    3        4       -6        1000006   # BR(~c_R -> c  tb  ~t_1)
     5.23200628E-02    3        4       6        -1000006   # BR(~c_R -> c  t  ~t_1*)
     2.95848499E-03    3        4       -11        1000011   # BR(~c_R -> c  e+  ~e_L-)
     3.88068569E-04    3        4       11        -1000011   # BR(~c_R -> c  e-  ~e_L+)
     3.04861179E-03    3        4       -12        1000012   # BR(~c_R -> c  nu_eb  ~nu_eL)
     3.84172766E-04    3        4       12        -1000012   # BR(~c_R -> c  nu_e  ~nu_eL*)
     3.01837570E-03    3        4       -13        1000013   # BR(~c_R -> c  mu+  ~mu_L-)
     3.89347789E-04    3        4       13        -1000013   # BR(~c_R -> c  mu-  ~mu_L+)
     3.09338446E-03    3        4       -14        1000014   # BR(~c_R -> c  nu_mub  ~nu_muL)
     3.89173350E-04    3        4       14        -1000014   # BR(~c_R -> c  nu_mu  ~nu_muL*)
     9.84126542E-08    3        4       23        1000022   # BR(~c_R -> c  Z  ~chi_10)
     8.76575223E-07    3        4       25        1000022   # BR(~c_R -> c  h  ~chi_10)
     2.01690217E-06    3        4       -24        1000024   # BR(~c_R -> c  W-  ~chi_1+)
     1.47455202E-06    3        4       24        -1000024   # BR(~c_R -> c  W+  ~chi_1-)
#
#         PDG            Width
DECAY   1000003     8.25951962E+01   # sstrange_L decays
#          BR         NDA      ID1       ID2
     1.71295190E-01    2     1000022         3   # BR(~s_L -> ~chi_10 s)
     1.25126670E-03    2     1000023         3   # BR(~s_L -> ~chi_20 s)
     3.42397540E-01    2    -1000024         4   # BR(~s_L -> ~chi_1- c)
     4.85056004E-01    2     1000021         3   # BR(~s_L -> ~g      s)
#
#         PDG            Width
DECAY   2000003     9.13922625E-02   # sstrange_R decays
#           BR         NDA      ID1       ID2
     2.13529574E-07    2     1000022         3   # BR(~s_R -> ~chi_10 s)
#           BR         NDA      ID1       ID2       ID3
     9.36403123E-03    3        3       -2        2000002   # BR(~s_R -> s  ub  ~u_R)
     2.18377349E-02    3        3       2        -2000002   # BR(~s_R -> s  u  ~u_R*)
     9.40013932E-03    3        3       -4        2000004   # BR(~s_R -> s  cb  ~c_R)
     2.15423051E-02    3        3       4        -2000004   # BR(~s_R -> s  c  ~c_R*)
     3.72788670E-01    3        3       -5        1000005   # BR(~s_R -> s  bb  ~b_1)
     1.08235640E-01    3        3       5        -1000005   # BR(~s_R -> s  b  ~b_1*)
     3.55752217E-01    3        3       -6        1000006   # BR(~s_R -> s  tb  ~t_1)
     9.91495314E-02    3        3       6        -1000006   # BR(~s_R -> s  t  ~t_1*)
     3.77187292E-04    3        3       -11        1000011   # BR(~s_R -> s  e+  ~e_L-)
     9.70815227E-05    3        3       11        -1000011   # BR(~s_R -> s  e-  ~e_L+)
     7.04009270E-07    3        3       -11        2000011   # BR(~s_R -> s  e+  ~e_R-)
     1.33293560E-06    3        3       11        -2000011   # BR(~s_R -> s  e-  ~e_R+)
     3.79211534E-04    3        3       -12        1000012   # BR(~s_R -> s  nu_eb  ~nu_eL)
     9.77664822E-05    3        3       12        -1000012   # BR(~s_R -> s  nu_e  ~nu_eL*)
     3.83019296E-04    3        3       -13        1000013   # BR(~s_R -> s  mu+  ~mu_L-)
     9.74196257E-05    3        3       13        -1000013   # BR(~s_R -> s  mu-  ~mu_L+)
     7.06350825E-07    3        3       -13        2000013   # BR(~s_R -> s  mu+  ~mu_R-)
     1.33567106E-06    3        3       13        -2000013   # BR(~s_R -> s  mu-  ~mu_R+)
     3.86028303E-04    3        3       -14        1000014   # BR(~s_R -> s  nu_mub  ~nu_muL)
     9.88212761E-05    3        3       14        -1000014   # BR(~s_R -> s  nu_mu  ~nu_muL*)
     2.85833826E-06    3        3       -15        1000015   # BR(~s_R -> s  tau+  ~tau_1-)
     1.54389438E-06    3        3       15        -1000015   # BR(~s_R -> s  tau-  ~tau_1+)
     2.55656216E-06    3        3       -16        1000016   # BR(~s_R -> s  nu_taub  ~nu_tau1)
     1.23916398E-06    3        3       16        -1000016   # BR(~s_R -> s  nu_tau  ~nu_tau1*)
     2.78732568E-08    3        3       23        1000022   # BR(~s_R -> s  Z  ~chi_10)
     1.44673079E-07    3        3       25        1000022   # BR(~s_R -> s  h  ~chi_10)
     3.13713647E-07    3        3       -24        1000024   # BR(~s_R -> s  W-  ~chi_1+)
     2.18607128E-07    3        3       24        -1000024   # BR(~s_R -> s  W+  ~chi_1-)
#
#         PDG            Width
DECAY   1000011     6.90179685E-01   # selectron_L decays
#          BR         NDA      ID1       ID2
     3.34092573E-01    2     1000022        11   # BR(~e_L -> ~chi_10 e-)
     6.65907427E-01    2    -1000024        12   # BR(~e_L -> ~chi_1- nu_e)
#
#         PDG            Width
DECAY   2000011     7.27048051E-04   # selectron_R decays
#           BR         NDA      ID1       ID2
     2.01752800E-04    2     1000022        11   # BR(~e_R -> ~chi_10 e-)
#           BR         NDA      ID1       ID2       ID3
     2.17303381E-03    3        11       -2        2000002   # BR(~e_R- -> e-  ub  ~u_R)
     6.13315721E-03    3        11       2        -2000002   # BR(~e_R- -> e-  u  ~u_R*)
     2.19187714E-03    3        11       -4        2000004   # BR(~e_R- -> e-  cb  ~c_R)
     6.16107834E-03    3        11       4        -2000004   # BR(~e_R- -> e-  c  ~c_R*)
     3.47322298E-02    3        11       -5        1000005   # BR(~e_R- -> e-  bb  ~b_1)
     8.40192060E-03    3        11       5        -1000005   # BR(~e_R- -> e-  b  ~b_1*)
     2.96596627E-02    3        11       -6        1000006   # BR(~e_R- -> e-  tb  ~t_1)
     1.08267947E-02    3        11       6        -1000006   # BR(~e_R- -> e-  t  ~t_1*)
     1.87814271E-01    3        11       -11        1000011   # BR(~e_R- -> e-  e+  ~e_L-)
     3.60828971E-02    3        11       11        -1000011   # BR(~e_R- -> e-  e-  ~e_L+)
     1.89698604E-01    3        11       -12        1000012   # BR(~e_R- -> e-  nu_eb  ~nu_eL)
     3.73496634E-02    3        11       12        -1000012   # BR(~e_R- -> e-  nu_e  ~nu_eL*)
     1.85228473E-01    3        11       -13        1000013   # BR(~e_R- -> e-  mu+  ~mu_L-)
     3.63689855E-02    3        11       13        -1000013   # BR(~e_R- -> e-  mu-  ~mu_L+)
     1.90166248E-01    3        11       -14        1000014   # BR(~e_R- -> e-  nu_mub  ~nu_muL)
     3.64460093E-02    3        11       14        -1000014   # BR(~e_R- -> e-  nu_mu  ~nu_muL*)
     2.57974696E-05    3        11       -15        1000015   # BR(~e_R- -> e-  tau+  ~tau_1-)
     1.19092541E-05    3        11       15        -1000015   # BR(~e_R- -> e-  tau-  ~tau_1+)
     1.94883955E-05    3        11       -16        1000016   # BR(~e_R- -> e-  nu_taub  ~nu_tau1)
     7.81874044E-06    3        11       16        -1000016   # BR(~e_R- -> e-  nu_tau  ~nu_tau1*)
     8.73257275E-06    3        11       23        1000022   # BR(~e_R- -> e-  Z  ~chi_10)
     6.00359219E-05    3        11       25        1000022   # BR(~e_R- -> e-  h  ~chi_10)
     1.34293737E-04    3        11       -24        1000024   # BR(~e_R- -> e-  W-  ~chi_1+)
     9.52660555E-05    3        11       24        -1000024   # BR(~e_R- -> e-  W+  ~chi_1-)
#
#         PDG            Width
DECAY   1000013     6.90179511E-01   # smuon_L decays
#          BR         NDA      ID1       ID2
     3.34092405E-01    2     1000022        13   # BR(~mu_L -> ~chi_10 mu-)
     6.65907595E-01    2    -1000024        14   # BR(~mu_L -> ~chi_1- nu_mu)
#
#         PDG            Width
DECAY   2000013     7.28098337E-04   # smuon_R decays
#           BR         NDA      ID1       ID2
     2.01461769E-04    2     1000022        13   # BR(~mu_R -> ~chi_10 mu-)
#           BR         NDA      ID1       ID2       ID3
     2.17662906E-03    3        13       -2        2000002   # BR(~mu_R- -> mu-  ub  ~u_R)
     6.08200813E-03    3        13       2        -2000002   # BR(~mu_R- -> mu-  u  ~u_R*)
     2.18844065E-03    3        13       -4        2000004   # BR(~mu_R- -> mu-  cb  ~c_R)
     6.13364950E-03    3        13       4        -2000004   # BR(~mu_R- -> mu-  c  ~c_R*)
     3.53853301E-02    3        13       -5        1000005   # BR(~mu_R- -> mu-  bb  ~b_1)
     8.48237070E-03    3        13       5        -1000005   # BR(~mu_R- -> mu-  b  ~b_1*)
     2.92899996E-02    3        13       -6        1000006   # BR(~mu_R- -> mu-  tb  ~t_1)
     1.08559512E-02    3        13       6        -1000006   # BR(~mu_R- -> mu-  t  ~t_1*)
     1.87474676E-01    3        13       -11        1000011   # BR(~mu_R- -> mu-  e+  ~e_L-)
     3.66420285E-02    3        13       11        -1000011   # BR(~mu_R- -> mu-  e-  ~e_L+)
     1.87653224E-01    3        13       -12        1000012   # BR(~mu_R- -> mu-  nu_eb  ~nu_eL)
     3.68727666E-02    3        13       12        -1000012   # BR(~mu_R- -> mu-  nu_e  ~nu_eL*)
     1.88147662E-01    3        13       -13        1000013   # BR(~mu_R- -> mu-  mu+  ~mu_L-)
     3.65527548E-02    3        13       13        -1000013   # BR(~mu_R- -> mu-  mu-  ~mu_L+)
     1.89397494E-01    3        13       -14        1000014   # BR(~mu_R- -> mu-  nu_mub  ~nu_muL)
     3.61022662E-02    3        13       14        -1000014   # BR(~mu_R- -> mu-  nu_mu  ~nu_muL*)
     2.57794848E-05    3        13       -15        1000015   # BR(~mu_R- -> mu-  tau+  ~tau_1-)
     1.19825847E-05    3        13       15        -1000015   # BR(~mu_R- -> mu-  tau-  ~tau_1+)
     1.93462878E-05    3        13       -16        1000016   # BR(~mu_R- -> mu-  nu_taub  ~nu_tau1)
     7.88176502E-06    3        13       16        -1000016   # BR(~mu_R- -> mu-  nu_tau  ~nu_tau1*)
     8.83589438E-06    3        13       23        1000022   # BR(~mu_R- -> mu-  Z  ~chi_10)
     6.01196264E-05    3        13       25        1000022   # BR(~mu_R- -> mu-  h  ~chi_10)
     1.32962809E-04    3        13       -24        1000024   # BR(~mu_R- -> mu-  W-  ~chi_1+)
     9.43787351E-05    3        13       24        -1000024   # BR(~mu_R- -> mu-  W+  ~chi_1-)
#
#         PDG            Width
DECAY   1000015     1.67245667E+01   # stau_1 decays
#          BR         NDA      ID1       ID2
     3.33539376E-01    2     1000022        15   # BR(~tau_1 -> ~chi_10  tau-)
     6.66460624E-01    2    -1000024        16   # BR(~tau_1 -> ~chi_1-  nu_tau)
#
#         PDG            Width
DECAY   2000015     1.96926209E+01   # stau_2 decays
#          BR         NDA      ID1       ID2
     4.94929494E-03    2     1000022        15   # BR(~tau_2 -> ~chi_10  tau-)
     9.88989027E-03    2    -1000024        16   # BR(~tau_2 -> ~chi_1-  nu_tau)
     4.83119700E-01    2     1000016       -24   # BR(~tau_2 -> ~nu_tauL W-)
     2.49555241E-01    2     1000015        25   # BR(~tau_2 -> ~tau_1   h)
     2.52485874E-01    2     1000015        23   # BR(~tau_2 -> ~tau_1   Z)
#
#         PDG            Width
DECAY   1000012     6.16556628E-01   # snu_eL decays
#          BR         NDA      ID1       ID2
     3.33994452E-01    2     1000022        12   # BR(~nu_eL -> ~chi_10 nu_e)
     6.66005548E-01    2     1000024        11   # BR(~nu_eL -> ~chi_1+ e-)
#
#         PDG            Width
DECAY   1000014     6.16556275E-01   # snu_muL decays
#          BR         NDA      ID1       ID2
     3.33994643E-01    2     1000022        14   # BR(~nu_muL -> ~chi_10 nu_mu)
     6.66005357E-01    2     1000024        13   # BR(~nu_muL -> ~chi_1+ mu-)
#
#         PDG            Width
DECAY   1000016     1.70625561E+01   # snu_tauL decays
#          BR         NDA      ID1       ID2
     3.33177489E-01    2     1000022        16   # BR(~nu_tauL -> ~chi_10 nu_tau)
     6.66822511E-01    2     1000024        15   # BR(~nu_tauL -> ~chi_1+ tau-)
#
#         PDG            Width
DECAY   1000024     3.23271050E-15   # chargino1+ decays
#           BR         NDA      ID1       ID2       ID3
     1.98114690E-02    3     1000022       -11        12   # BR(~chi_1+ -> ~chi_10 e+   nu_e)
     2.01847600E-03    3     1000022       -13        14   # BR(~chi_1+ -> ~chi_10 mu+  nu_mu)
     9.78170060E-01    2     1000022       211             # BR(~chi_1+ -> ~chi_10 pi+)
#
#         PDG            Width
DECAY   1000037     1.52404399E+02   # chargino2+ decays
#          BR         NDA      ID1       ID2
     1.19158452E-09    2     1000002        -1   # BR(~chi_2+ -> ~u_L     db)
     4.47876007E-08    2    -1000001         2   # BR(~chi_2+ -> ~d_L*    u )
     1.19140968E-09    2     1000004        -3   # BR(~chi_2+ -> ~c_L     sb)
     4.46750182E-08    2    -1000003         4   # BR(~chi_2+ -> ~s_L*     c )
     1.11130188E-01    2     1000006        -5   # BR(~chi_2+ -> ~t_1     bb)
     2.06691851E-01    2     2000006        -5   # BR(~chi_2+ -> ~t_2     bb)
     4.49720588E-01    2    -1000005         6   # BR(~chi_2+ -> ~b_1*    t )
     2.21865242E-02    2    -2000005         6   # BR(~chi_2+ -> ~b_2*    t )
     2.31323015E-06    2     1000012       -11   # BR(~chi_2+ -> ~nu_eL   e+  )
     2.31323015E-06    2     1000014       -13   # BR(~chi_2+ -> ~nu_muL mu+ )
     3.06772834E-02    2     1000016       -15   # BR(~chi_2+ -> ~nu_tau1 tau+)
     9.28390204E-05    2    -1000011        12   # BR(~chi_2+ -> ~e_L+    nu_e)
     9.28390204E-05    2    -1000013        14   # BR(~chi_2+ -> ~mu_L+   nu_mu)
     2.34359401E-04    2    -1000015        16   # BR(~chi_2+ -> ~tau_1+  nu_tau)
     1.94723869E-02    2    -2000015        16   # BR(~chi_2+ -> ~tau_2+  nu_tau)
     4.93706870E-02    2     1000024        23   # BR(~chi_2+ -> ~chi_1+  Z )
     4.80653370E-02    2     1000022        24   # BR(~chi_2+ -> ~chi_10  W+)
     1.24829069E-02    2     1000023        24   # BR(~chi_2+ -> ~chi_20  W+)
     4.83622999E-02    2     1000024        25   # BR(~chi_2+ -> ~chi_1+  h )
     4.27234960E-04    2     1000024        35   # BR(~chi_2+ -> ~chi_1+  H )
     5.03732360E-04    2     1000024        36   # BR(~chi_2+ -> ~chi_1+  A )
     4.84224238E-04    2     1000022        37   # BR(~chi_2+ -> ~chi_10  H+)
#
#         PDG            Width
DECAY   1000022     0.00000000E+00   # neutralino1 decays
#
#         PDG            Width
DECAY   1000023     5.12556139E+01   # neutralino2 decays
#          BR         NDA      ID1       ID2
     3.74641515E-05    2     1000022        23   # BR(~chi_20 -> ~chi_10   Z )
     1.46016518E-04    2     1000024       -24   # BR(~chi_20 -> ~chi_1+   W-)
     1.46016518E-04    2    -1000024        24   # BR(~chi_20 -> ~chi_1-   W+)
     9.05581244E-05    2     1000022        25   # BR(~chi_20 -> ~chi_10   h )
     9.24671573E-02    2     2000002        -2   # BR(~chi_20 -> ~u_R      ub)
     9.24671573E-02    2    -2000002         2   # BR(~chi_20 -> ~u_R*     u )
     7.16884991E-03    2     2000001        -1   # BR(~chi_20 -> ~d_R      db)
     7.16884991E-03    2    -2000001         1   # BR(~chi_20 -> ~d_R*     d )
     9.24671217E-02    2     2000004        -4   # BR(~chi_20 -> ~c_R      cb)
     9.24671217E-02    2    -2000004         4   # BR(~chi_20 -> ~c_R*     c )
     7.16884991E-03    2     2000003        -3   # BR(~chi_20 -> ~s _R      sb)
     7.16884991E-03    2    -2000003         3   # BR(~chi_20 -> ~s _R*     s )
     1.25575969E-02    2     1000006        -6   # BR(~chi_20 -> ~t_1      tb)
     1.25575969E-02    2    -1000006         6   # BR(~chi_20 -> ~t_1*     t )
     2.44689445E-02    2     2000006        -6   # BR(~chi_20 -> ~t_2      tb)
     2.44689445E-02    2    -2000006         6   # BR(~chi_20 -> ~t_2*     t )
     1.02751715E-02    2     1000005        -5   # BR(~chi_20 -> ~b_1      bb)
     1.02751715E-02    2    -1000005         5   # BR(~chi_20 -> ~b_1*     b )
     3.15216583E-02    2     1000011       -11   # BR(~chi_20 -> ~e_L-     e+)
     3.15216583E-02    2    -1000011        11   # BR(~chi_20 -> ~e_L+     e-)
     4.19137864E-02    2     2000011       -11   # BR(~chi_20 -> ~e_R-     e+)
     4.19137864E-02    2    -2000011        11   # BR(~chi_20 -> ~e_R+     e-)
     3.15216583E-02    2     1000013       -13   # BR(~chi_20 -> ~mu_L-    mu+)
     3.15216583E-02    2    -1000013        13   # BR(~chi_20 -> ~mu_L+    mu-)
     4.19137864E-02    2     2000013       -13   # BR(~chi_20 -> ~mu_R-    mu+)
     4.19137864E-02    2    -2000013        13   # BR(~chi_20 -> ~mu_R+    mu-)
     1.47339346E-02    2     1000015       -15   # BR(~chi_20 -> ~tau_1-   tau+)
     1.47339346E-02    2    -1000015        15   # BR(~chi_20 -> ~tau_1+   tau-)
     1.52938152E-02    2     2000015       -15   # BR(~chi_20 -> ~tau_2-   tau+)
     1.52938152E-02    2    -2000015        15   # BR(~chi_20 -> ~tau_2+   tau-)
     3.13863712E-02    2     1000012       -12   # BR(~chi_20 -> ~nu_eL    nu_eb)
     3.13863712E-02    2    -1000012        12   # BR(~chi_20 -> ~nu_eL*   nu_e )
     3.13863712E-02    2     1000014       -14   # BR(~chi_20 -> ~nu_muL   nu_mub)
     3.13863712E-02    2    -1000014        14   # BR(~chi_20 -> ~nu_muL*  nu_mu )
     1.35448990E-02    2     1000016       -16   # BR(~chi_20 -> ~nu_tau1  nu_taub)
     1.35448990E-02    2    -1000016        16   # BR(~chi_20 -> ~nu_tau1* nu_tau )
#
#         PDG            Width
DECAY   1000025     1.51887615E+02   # neutralino3 decays
#          BR         NDA      ID1       ID2
     3.23841016E-02    2     1000022        23   # BR(~chi_30 -> ~chi_10   Z )
     1.25446570E-02    2     1000023        23   # BR(~chi_30 -> ~chi_20   Z )
     4.82819395E-02    2     1000024       -24   # BR(~chi_30 -> ~chi_1+   W-)
     4.82819395E-02    2    -1000024        24   # BR(~chi_30 -> ~chi_1-   W+)
     1.76200405E-02    2     1000022        25   # BR(~chi_30 -> ~chi_10   h )
     2.42226076E-06    2     1000022        35   # BR(~chi_30 -> ~chi_10   H )
     4.66401958E-04    2     1000022        36   # BR(~chi_30 -> ~chi_10   A )
     2.22232140E-04    2     1000023        25   # BR(~chi_30 -> ~chi_20   h )
     4.39889548E-04    2     1000024       -37   # BR(~chi_30 -> ~chi_1+   H-)
     4.39889548E-04    2    -1000024        37   # BR(~chi_30 -> ~chi_1-   H+)
     3.28948513E-09    2     1000002        -2   # BR(~chi_30 -> ~u_L      ub)
     3.28948513E-09    2    -1000002         2   # BR(~chi_30 -> ~u_L*     u )
     1.30952339E-06    2     2000002        -2   # BR(~chi_30 -> ~u_R      ub)
     1.30952339E-06    2    -2000002         2   # BR(~chi_30 -> ~u_R*     u )
     4.01646492E-09    2     1000001        -1   # BR(~chi_30 -> ~d_L      db)
     4.01646492E-09    2    -1000001         1   # BR(~chi_30 -> ~d_L*     d )
     2.06120220E-07    2     2000001        -1   # BR(~chi_30 -> ~d_R      db)
     2.06120220E-07    2    -2000001         1   # BR(~chi_30 -> ~d_R*     d )
     3.28075523E-09    2     1000004        -4   # BR(~chi_30 -> ~c_L      cb)
     3.28075523E-09    2    -1000004         4   # BR(~chi_30 -> ~c_L*     c )
     1.30952328E-06    2     2000004        -4   # BR(~chi_30 -> ~c_R      cb)
     1.30952328E-06    2    -2000004         4   # BR(~chi_30 -> ~c_R*     c )
     4.01646492E-09    2     1000003        -3   # BR(~chi_30 -> ~s _L      sb)
     4.01646492E-09    2    -1000003         3   # BR(~chi_30 -> ~s _L*     s )
     2.06120220E-07    2     2000003        -3   # BR(~chi_30 -> ~s _R      sb)
     2.06120220E-07    2    -2000003         3   # BR(~chi_30 -> ~s _R*     s )
     2.22223622E-01    2     1000006        -6   # BR(~chi_30 -> ~t_1      tb)
     2.22223622E-01    2    -1000006         6   # BR(~chi_30 -> ~t_1*     t )
     1.07807115E-01    2     2000006        -6   # BR(~chi_30 -> ~t_2      tb)
     1.07807115E-01    2    -2000006         6   # BR(~chi_30 -> ~t_2*     t )
     5.27513783E-02    2     1000005        -5   # BR(~chi_30 -> ~b_1      bb)
     5.27513783E-02    2    -1000005         5   # BR(~chi_30 -> ~b_1*     b )
     1.15666399E-02    2     2000005        -5   # BR(~chi_30 -> ~b_2      bb)
     1.15666399E-02    2    -2000005         5   # BR(~chi_30 -> ~b_2*     b )
     5.25810995E-06    2     1000011       -11   # BR(~chi_30 -> ~e_L-     e+)
     5.25810995E-06    2    -1000011        11   # BR(~chi_30 -> ~e_L+     e-)
     8.12132984E-07    2     2000011       -11   # BR(~chi_30 -> ~e_R-     e+)
     8.12132984E-07    2    -2000011        11   # BR(~chi_30 -> ~e_R+     e-)
     5.25810995E-06    2     1000013       -13   # BR(~chi_30 -> ~mu_L-    mu+)
     5.25810995E-06    2    -1000013        13   # BR(~chi_30 -> ~mu_L+    mu-)
     8.12132984E-07    2     2000013       -13   # BR(~chi_30 -> ~mu_R-    mu+)
     8.12132984E-07    2    -2000013        13   # BR(~chi_30 -> ~mu_R+    mu-)
     1.53825484E-02    2     1000015       -15   # BR(~chi_30 -> ~tau_1-   tau+)
     1.53825484E-02    2    -1000015        15   # BR(~chi_30 -> ~tau_1+   tau-)
     9.87983829E-03    2     2000015       -15   # BR(~chi_30 -> ~tau_2-   tau+)
     9.87983829E-03    2    -2000015        15   # BR(~chi_30 -> ~tau_2+   tau-)
     1.19732269E-05    2     1000012       -12   # BR(~chi_30 -> ~nu_eL    nu_eb)
     1.19732269E-05    2    -1000012        12   # BR(~chi_30 -> ~nu_eL*   nu_e )
     1.19732269E-05    2     1000014       -14   # BR(~chi_30 -> ~nu_muL   nu_mub)
     1.19732269E-05    2    -1000014        14   # BR(~chi_30 -> ~nu_muL*  nu_mu )
     7.96901700E-06    2     1000016       -16   # BR(~chi_30 -> ~nu_tau1  nu_taub)
     7.96901700E-06    2    -1000016        16   # BR(~chi_30 -> ~nu_tau1* nu_tau )
#
#         PDG            Width
DECAY   1000035     1.51906630E+02   # neutralino4 decays
#          BR         NDA      ID1       ID2
     1.71642963E-02    2     1000022        23   # BR(~chi_40 -> ~chi_10   Z )
     2.15315211E-04    2     1000023        23   # BR(~chi_40 -> ~chi_20   Z )
     4.82003604E-02    2     1000024       -24   # BR(~chi_40 -> ~chi_1+   W-)
     4.82003604E-02    2    -1000024        24   # BR(~chi_40 -> ~chi_1-   W+)
     3.08866535E-02    2     1000022        25   # BR(~chi_40 -> ~chi_10   h )
     4.34137245E-04    2     1000022        35   # BR(~chi_40 -> ~chi_10   H )
     5.42175106E-06    2     1000022        36   # BR(~chi_40 -> ~chi_10   A )
     1.09265709E-02    2     1000023        25   # BR(~chi_40 -> ~chi_20   h )
     4.84455978E-04    2     1000024       -37   # BR(~chi_40 -> ~chi_1+   H-)
     4.84455978E-04    2    -1000024        37   # BR(~chi_40 -> ~chi_1-   H+)
     3.13446556E-09    2     1000002        -2   # BR(~chi_40 -> ~u_L      ub)
     3.13446556E-09    2    -1000002         2   # BR(~chi_40 -> ~u_L*     u )
     7.81593491E-05    2     2000002        -2   # BR(~chi_40 -> ~u_R      ub)
     7.81593491E-05    2    -2000002         2   # BR(~chi_40 -> ~u_R*     u )
     1.45418833E-08    2     1000001        -1   # BR(~chi_40 -> ~d_L      db)
     1.45418833E-08    2    -1000001         1   # BR(~chi_40 -> ~d_L*     d )
     1.23084895E-05    2     2000001        -1   # BR(~chi_40 -> ~d_R      db)
     1.23084895E-05    2    -2000001         1   # BR(~chi_40 -> ~d_R*     d )
     3.12720835E-09    2     1000004        -4   # BR(~chi_40 -> ~c_L      cb)
     3.12720835E-09    2    -1000004         4   # BR(~chi_40 -> ~c_L*     c )
     7.81593425E-05    2     2000004        -4   # BR(~chi_40 -> ~c_R      cb)
     7.81593425E-05    2    -2000004         4   # BR(~chi_40 -> ~c_R*     c )
     1.45418833E-08    2     1000003        -3   # BR(~chi_40 -> ~s _L      sb)
     1.45418833E-08    2    -1000003         3   # BR(~chi_40 -> ~s _L*     s )
     1.23084895E-05    2     2000003        -3   # BR(~chi_40 -> ~s _R      sb)
     1.23084895E-05    2    -2000003         3   # BR(~chi_40 -> ~s _R*     s )
     2.30803763E-01    2     1000006        -6   # BR(~chi_40 -> ~t_1      tb)
     2.30803763E-01    2    -1000006         6   # BR(~chi_40 -> ~t_1*     t )
     1.00799365E-01    2     2000006        -6   # BR(~chi_40 -> ~t_2      tb)
     1.00799365E-01    2    -2000006         6   # BR(~chi_40 -> ~t_2*     t )
     5.26012034E-02    2     1000005        -5   # BR(~chi_40 -> ~b_1      bb)
     5.26012034E-02    2    -1000005         5   # BR(~chi_40 -> ~b_1*     b )
     1.15987499E-02    2     2000005        -5   # BR(~chi_40 -> ~b_2      bb)
     1.15987499E-02    2    -2000005         5   # BR(~chi_40 -> ~b_2*     b )
     3.06541385E-07    2     1000011       -11   # BR(~chi_40 -> ~e_L-     e+)
     3.06541385E-07    2    -1000011        11   # BR(~chi_40 -> ~e_L+     e-)
     4.84835078E-05    2     2000011       -11   # BR(~chi_40 -> ~e_R-     e+)
     4.84835078E-05    2    -2000011        11   # BR(~chi_40 -> ~e_R+     e-)
     3.06541385E-07    2     1000013       -13   # BR(~chi_40 -> ~mu_L-    mu+)
     3.06541385E-07    2    -1000013        13   # BR(~chi_40 -> ~mu_L+    mu-)
     4.84835078E-05    2     2000013       -13   # BR(~chi_40 -> ~mu_R-    mu+)
     4.84835078E-05    2    -2000013        13   # BR(~chi_40 -> ~mu_R+    mu-)
     1.52431413E-02    2     1000015       -15   # BR(~chi_40 -> ~tau_1-   tau+)
     1.52431413E-02    2    -1000015        15   # BR(~chi_40 -> ~tau_1+   tau-)
     9.98372281E-03    2     2000015       -15   # BR(~chi_40 -> ~tau_2-   tau+)
     9.98372281E-03    2    -2000015        15   # BR(~chi_40 -> ~tau_2+   tau-)
     7.14561460E-05    2     1000012       -12   # BR(~chi_40 -> ~nu_eL    nu_eb)
     7.14561460E-05    2    -1000012        12   # BR(~chi_40 -> ~nu_eL*   nu_e )
     7.14561460E-05    2     1000014       -14   # BR(~chi_40 -> ~nu_muL   nu_mub)
     7.14561460E-05    2    -1000014        14   # BR(~chi_40 -> ~nu_muL*  nu_mu )
     4.75769479E-05    2     1000016       -16   # BR(~chi_40 -> ~nu_tau1  nu_taub)
     4.75769479E-05    2    -1000016        16   # BR(~chi_40 -> ~nu_tau1* nu_tau )
#
#         PDG            Width
DECAY        25     7.04003582E-03   # h decays
#          BR         NDA      ID1       ID2
     7.57077232E-01    2           5        -5   # BR(h -> b       bb     )
     3.73283868E-02    2         -15        15   # BR(h -> tau+    tau-   )
     1.32092958E-04    2         -13        13   # BR(h -> mu+     mu-    )
     1.43653412E-04    2           3        -3   # BR(h -> s       sb     )
     1.23839435E-02    2           4        -4   # BR(h -> c       cb     )
     4.34369072E-02    2          21        21   # BR(h -> g       g      )
     1.39319168E-03    2          22        22   # BR(h -> gam     gam    )
     9.53307324E-04    2          22        23   # BR(h -> Z       gam    )
     1.30663588E-01    2          24       -24   # BR(h -> W+      W-     )
     1.64876971E-02    2          23        23   # BR(h -> Z       Z      )
#
#         PDG            Width
DECAY        35     1.61558902E+02   # H decays
#          BR         NDA      ID1       ID2
     4.29228411E-01    2           5        -5   # BR(H -> b       bb     )
     7.43340810E-02    2         -15        15   # BR(H -> tau+    tau-   )
     2.48075965E-04    2         -13        13   # BR(H -> mu+     mu-    )
     8.16622347E-05    2           3        -3   # BR(H -> s       sb     )
     4.18836134E-09    2           4        -4   # BR(H -> c       cb     )
     4.12123261E-04    2           6        -6   # BR(H -> t       tb     )
     5.77626656E-06    2          21        21   # BR(H -> g       g      )
     1.06803673E-07    2          22        22   # BR(H -> gam     gam    )
     3.95698261E-09    2          23        22   # BR(H -> Z       gam    )
     7.18739091E-07    2          24       -24   # BR(H -> W+      W-     )
     3.58626286E-07    2          23        23   # BR(H -> Z       Z      )
     2.36784079E-06    2          25        25   # BR(H -> h       h      )
     6.15488822E-13    2          23        36   # BR(H -> Z       A      )
     1.90915130E-13    2          24       -37   # BR(H -> W+      H-     )
     1.90915130E-13    2         -24        37   # BR(H -> W-      H+     )
     1.49632169E-04    2     1000024  -1000024   # BR(H -> ~chi_1+ ~chi_1-)
     7.48818419E-05    2     1000022   1000022   # BR(H -> ~chi_10 ~chi_10)
     1.30564987E-06    2     1000022   1000023   # BR(H -> ~chi_10 ~chi_20)
     1.16347741E-08    2     2000002  -2000002   # BR(H -> ~u_R    ~u_R*  )
     1.16347741E-08    2     2000004  -2000004   # BR(H -> ~c_R    ~c_R*  )
     2.86948646E-02    2     1000006  -1000006   # BR(H -> ~t_1    ~t_1*  )
     2.33328067E-01    2     1000006  -2000006   # BR(H -> ~t_1    ~t_2*  )
     2.33328067E-01    2     2000006  -1000006   # BR(H -> ~t_2    ~t_1*  )
     1.09243352E-04    2     1000005  -1000005   # BR(H -> ~b_1    ~b_1*  )
     2.65541586E-08    2     1000011  -1000011   # BR(H -> ~e_L-   ~e_L+  )
     2.65541586E-08    2     1000013  -1000013   # BR(H -> ~mu_L-  ~mu_L+ )
     8.66812360E-08    2     1000012  -1000012   # BR(H -> ~nu_eL  ~nu_eL*   )
     8.66812360E-08    2     1000014  -1000014   # BR(H -> ~nu_muL ~nu_muL*  )
#
#         PDG            Width
DECAY        36     1.61883075E+02   # A decays
#          BR         NDA      ID1       ID2
     4.28102863E-01    2           5        -5   # BR(A -> b       bb     )
     7.41280923E-02    2         -15        15   # BR(A -> tau+    tau-   )
     2.47388246E-04    2         -13        13   # BR(A -> mu+     mu-    )
     8.14473573E-05    2           3        -3   # BR(A -> s       sb     )
     4.17693091E-09    2           4        -4   # BR(A -> c       cb     )
     4.10353629E-04    2           6        -6   # BR(A -> t       tb     )
     1.23044746E-05    2          21        21   # BR(A -> g       g      )
     1.13479122E-08    2          22        22   # BR(A -> gam     gam    )
     8.82547060E-09    2          23        22   # BR(A -> Z       gam    )
     7.25282318E-07    2          23        25   # BR(A -> Z       h      )
     1.62914766E-04    2     1000024  -1000024   # BR(A -> ~chi_1+ ~chi_1-)
     8.15223394E-05    2     1000022   1000022   # BR(A -> ~chi_10 ~chi_10)
     1.21693021E-05    2     1000022   1000023   # BR(A -> ~chi_10 ~chi_20)
     2.48380098E-01    2     1000006  -2000006   # BR(A -> ~t_1    ~t_2*  )
     2.48380098E-01    2    -1000006   2000006   # BR(A -> ~t_1*   ~t_2   )
#
#         PDG            Width
DECAY        37     1.33114415E+02   # H+ decays
#          BR         NDA      ID1       ID2
     2.75983594E-04    2           4        -5   # BR(H+ -> c       bb     )
     9.01723321E-02    2         -15        16   # BR(H+ -> tau+    nu_tau )
     3.00932809E-04    2         -13        14   # BR(H+ -> mu+     nu_mu  )
     2.75983298E-06    2           2        -5   # BR(H+ -> u       bb     )
     4.95531322E-06    2           2        -3   # BR(H+ -> u       sb     )
     9.75404805E-05    2           4        -3   # BR(H+ -> c       sb     )
     1.64467795E-01    2           6        -5   # BR(H+ -> t       bb     )
     8.83216729E-07    2          24        25   # BR(H+ -> W+      h      )
     4.04326884E-15    2          24        36   # BR(H+ -> W+      A      )
     1.44390304E-11    2     1000024   1000022   # BR(H+ -> ~chi_1+ ~chi_10)
     1.64285822E-05    2     1000024   1000023   # BR(H+ -> ~chi_1+ ~chi_20)
     1.26388113E-07    2    -1000011   1000012   # BR(H+ -> ~e_L+   ~nu_eL )
     1.26388113E-07    2    -1000013   1000014   # BR(H+ -> ~mu_L+  ~nu_muL)
     1.73188031E-02    2     1000006  -1000005   # BR(H+ -> ~t_1    ~b_1*  )
     7.27341333E-01    2     2000006  -1000005   # BR(H+ -> ~t_2    ~b_1*  )
