#
#                              ======================
#                              | THE SUSYHIT OUTPUT |
#                              ======================
#
#
#              ------------------------------------------------------
#              |     This is the output of the SUSY-HIT package     |
#              |  created by A.Djouadi, M.Muehlleitner and M.Spira. |
#              |  In case of problems with SUSY-HIT email to        |
#              |           margarete.muehlleitner@cern.ch           |
#              |           michael.spira@psi.ch                     |
#              |           abdelhak.djouadi@cern.ch                 |
#              ------------------------------------------------------
#
#              ------------------------------------------------------
#              |  SUSY Les Houches Accord - MSSM Spectrum + Decays  |
#              |              based on the decay programs           |
#              |                                                    |
#              |                     SDECAY 1.3b                    |
#              |                                                    |
#              |  Authors: M.Muhlleitner, A.Djouadi and Y.Mambrini  |
#              |  Ref.:    Comput.Phys.Commun.168(2005)46           |
#              |           [hep-ph/0311167]                         |
#              |                                                    |
#              |                     HDECAY 3.4                     |
#              |                                                    |
#              |  By: A.Djouadi,J.Kalinowski,M.Muhlleitner,M.Spira  |
#              |  Ref.:    Comput.Phys.Commun.108(1998)56           |
#              |           [hep-ph/9704448]                         |
#              |                                                    |
#              |                                                    |
#              |  If not stated otherwise all DRbar couplings and   |
#              |  soft SUSY breaking masses are given at the scale  |
#              |  Q=  0.27702550E+04
#              |                                                    |
#              ------------------------------------------------------
#
#
BLOCK DCINFO  # Decay Program information
     1   SDECAY/HDECAY # decay calculator
     2   1.3b  /3.4    # version number
#
BLOCK SPINFO  # Spectrum calculator information
     1     SOFTSUSY    # spectrum calculator               
     2     3.4.0       # version number                    
#
BLOCK MODSEL  # Model selection
     1     0   #  nonUniversal                                     
#
BLOCK SMINPUTS  # Standard Model inputs
         1     1.27908970E+02   # alpha_em^-1(M_Z)^MSbar
         2     1.16637870E-05   # G_F [GeV^-2]
         3     1.18400000E-01   # alpha_S(M_Z)^MSbar
         4     9.11876000E+01   # M_Z pole mass
         5     4.18000000E+00   # mb(mb)^MSbar
         6     1.73200000E+02   # mt pole mass
         7     1.77700000E+00   # mtau pole mass
#
BLOCK MINPAR  # Input parameters - minimal models
         3     2.19200000E+01   # tanb                
#
BLOCK EXTPAR  # Input parameters - non-minimal models
         0    -1.00000000E+00   # Set                 
         1     2.34294000E+03   # M_1(MX)             
         2     1.44400000E+03   # M_2(MX)             
         3     3.90162000E+03   # M_3(MX)             
        11    -3.38206000E+03   # At(MX)              
        12    -2.24295000E+03   # Ab(MX)              
        13     1.52792000E+03   # Atau(MX)            
        23     2.47880000E+02   # mu(MX)              
        26     2.60728000E+03   # mA(pole)            
        31     3.68272000E+03   # meL(MX)             
        32     3.68272000E+03   # mmuL(MX)            
        33     1.15194000E+03   # mtauL(MX)           
        34     3.12768000E+03   # meR(MX)             
        35     3.12768000E+03   # mmuR(MX)            
        36     2.73700000E+02   # mtauR(MX)           
        41     8.57120000E+02   # mqL1(MX)            
        42     8.57120000E+02   # mqL2(MX)            
        43     2.05572000E+03   # mqL3(MX)            
        44     1.39759000E+03   # muR(MX)             
        45     1.39759000E+03   # mcR(MX)             
        46     3.73039000E+03   # mtR(MX)             
        47     3.57765000E+03   # mdR(MX)             
        48     3.57765000E+03   # msR(MX)             
        49     1.59437000E+03   # mbR(MX)             
#
BLOCK MASS  # Mass Spectrum
# PDG code           mass       particle
        24     8.03757476E+01   # W+
        25     1.25251045E+02   # h
        35     2.60729280E+03   # H
        36     2.60728000E+03   # A
        37     2.60870049E+03   # H+
         5     4.81876030E+00   # b-quark pole mass calculated from mb(mb)_Msbar
   1000001     1.01015915E+03   # ~d_L
   2000001     3.67124555E+03   # ~d_R
   1000002     1.00700146E+03   # ~u_L
   2000002     1.51000016E+03   # ~u_R
   1000003     1.01015915E+03   # ~s_L
   2000003     3.67124555E+03   # ~s_R
   1000004     1.00700146E+03   # ~c_L
   2000004     1.51000016E+03   # ~c_R
   1000005     1.69574671E+03   # ~b_1
   2000005     2.14500893E+03   # ~b_2
   1000006     2.14254016E+03   # ~t_1
   2000006     3.77348113E+03   # ~t_2
   1000011     3.69178158E+03   # ~e_L
   2000011     3.13535037E+03   # ~e_R
   1000012     3.69060914E+03   # ~nu_eL
   1000013     3.69178158E+03   # ~mu_L
   2000013     3.13535037E+03   # ~mu_R
   1000014     3.69060914E+03   # ~nu_muL
   1000015     3.18147151E+02   # ~tau_1
   2000015     1.17422283E+03   # ~tau_2
   1000016     1.17121833E+03   # ~nu_tauL
   1000021     3.90630502E+03   # ~g
   1000022     2.55140706E+02   # ~chi_10
   1000023    -2.60578827E+02   # ~chi_20
   1000025     1.44971016E+03   # ~chi_30
   1000035     2.31168599E+03   # ~chi_40
   1000024     2.57665983E+02   # ~chi_1+
   1000037     1.44989186E+03   # ~chi_2+
#
BLOCK NMIX  # Neutralino Mixing Matrix
  1  1     1.56823458E-02   # N_11
  1  2    -4.84086244E-02   # N_12
  1  3     7.10390003E-01   # N_13
  1  4    -7.01966319E-01   # N_14
  2  1    -1.15006342E-02   # N_21
  2  2     3.13145510E-02   # N_22
  2  3     7.03692800E-01   # N_23
  2  4     7.09720774E-01   # N_24
  3  1     2.98113357E-03   # N_31
  3  2     9.98334891E-01   # N_32
  3  3     1.23680431E-02   # N_33
  3  4    -5.62635733E-02   # N_34
  4  1     9.99806437E-01   # N_41
  4  2    -1.85723117E-03   # N_42
  4  3    -3.08513614E-03   # N_43
  4  4     1.93421907E-02   # N_44
#
BLOCK UMIX  # Chargino Mixing Matrix U
  1  1    -1.75461048E-02   # U_11
  1  2     9.99846055E-01   # U_12
  2  1    -9.99846055E-01   # U_21
  2  2    -1.75461048E-02   # U_22
#
BLOCK VMIX  # Chargino Mixing Matrix V
  1  1    -7.98370569E-02   # V_11
  1  2     9.96807928E-01   # V_12
  2  1    -9.96807928E-01   # V_21
  2  2    -7.98370569E-02   # V_22
#
BLOCK STOPMIX  # Stop Mixing Matrix
  1  1     9.98707941E-01   # cos(theta_t)
  1  2     5.08177979E-02   # sin(theta_t)
  2  1    -5.08177979E-02   # -sin(theta_t)
  2  2     9.98707941E-01   # cos(theta_t)
#
BLOCK SBOTMIX  # Sbottom Mixing Matrix
  1  1     1.05052328E-02   # cos(theta_b)
  1  2     9.99944819E-01   # sin(theta_b)
  2  1    -9.99944819E-01   # -sin(theta_b)
  2  2     1.05052328E-02   # cos(theta_b)
#
BLOCK STAUMIX  # Stau Mixing Matrix
  1  1     5.43577585E-03   # cos(theta_tau)
  1  2     9.99985226E-01   # sin(theta_tau)
  2  1    -9.99985226E-01   # -sin(theta_tau)
  2  2     5.43577585E-03   # cos(theta_tau)
#
BLOCK ALPHA  # Higgs mixing
          -4.76170238E-02   # Mixing angle in the neutral Higgs boson sector
#
BLOCK HMIX Q=  2.77025500E+03  # DRbar Higgs Parameters
         1     2.51542139E+02   # mu(Q)MSSM           
         2     2.10560770E+01   # tan                 
         3     2.42475473E+02   # higgs               
         4     6.95094200E+06   # mA^2(Q)MSSM         
#
BLOCK GAUGE Q=  2.77025500E+03  # The gauge couplings
     1     3.65051782E-01   # gprime(Q) DRbar
     2     6.39379716E-01   # g(Q) DRbar
     3     1.00973399E+00   # g3(Q) DRbar
#
BLOCK AU Q=  2.77025500E+03  # The trilinear couplings
  1  1     0.00000000E+00   # A_u(Q) DRbar
  2  2     0.00000000E+00   # A_c(Q) DRbar
  3  3    -3.38205998E+03   # A_t(Q) DRbar
#
BLOCK AD Q=  2.77025500E+03  # The trilinear couplings
  1  1     0.00000000E+00   # A_d(Q) DRbar
  2  2     0.00000000E+00   # A_s(Q) DRbar
  3  3    -2.24294999E+03   # A_b(Q) DRbar
#
BLOCK AE Q=  2.77025500E+03  # The trilinear couplings
  1  1     0.00000000E+00   # A_e(Q) DRbar
  2  2     0.00000000E+00   # A_mu(Q) DRbar
  3  3     1.52792000E+03   # A_tau(Q) DRbar
#
BLOCK Yu Q=  2.77025500E+03  # The Yukawa couplings
  1  1     0.00000000E+00   # y_u(Q) DRbar
  2  2     0.00000000E+00   # y_c(Q) DRbar
  3  3     8.15962191E-01   # y_t(Q) DRbar
#
BLOCK Yd Q=  2.77025500E+03  # The Yukawa couplings
  1  1     0.00000000E+00   # y_d(Q) DRbar
  2  2     0.00000000E+00   # y_s(Q) DRbar
  3  3     2.78148504E-01   # y_b(Q) DRbar
#
BLOCK Ye Q=  2.77025500E+03  # The Yukawa couplings
  1  1     0.00000000E+00   # y_e(Q) DRbar
  2  2     0.00000000E+00   # y_mu(Q) DRbar
  3  3     2.18714347E-01   # y_tau(Q) DRbar
#
BLOCK MSOFT Q=  2.77025500E+03  # The soft SUSY breaking masses at the scale Q
         1     2.34294000E+03   # M_1(Q)              
         2     1.44400000E+03   # M_2(Q)              
         3     3.90162000E+03   # M_3(Q)              
        21     6.73000108E+06   # mH1^2(Q)            
        22     3.40140297E+04   # mH2^2(Q)            
        31     3.68272000E+03   # meL(Q)              
        32     3.68272000E+03   # mmuL(Q)             
        33     1.15194000E+03   # mtauL(Q)            
        34     3.12768000E+03   # meR(Q)              
        35     3.12768000E+03   # mmuR(Q)             
        36     2.73700003E+02   # mtauR(Q)            
        41     8.57119955E+02   # mqL1(Q)             
        42     8.57119955E+02   # mqL2(Q)             
        43     2.05571996E+03   # mqL3(Q)             
        44     1.39758997E+03   # muR(Q)              
        45     1.39758997E+03   # mcR(Q)              
        46     3.73038997E+03   # mtR(Q)              
        47     3.57764999E+03   # mdR(Q)              
        48     3.57764999E+03   # msR(Q)              
        49     1.59436997E+03   # mbR(Q)              
#
Block HiggsBoundsInputHiggsCouplingsFermions
# ScalarNormEffCoupSq PseudoSNormEffCoupSq NP   IP1 IP2 IP2
    1.00676847E+00    0.00000000E+00        3  25   5   5  # h0-b-b eff. coupling^2, normalised to SM
    4.43351610E+02    0.00000000E+00        3  35   5   5  # H0-b-b eff. coupling^2, normalised to SM
    0.00000000E+00    4.43358379E+02        3  36   5   5  # A0-b-b eff. coupling^2, normalised to SM
#
    9.99984734E-01    0.00000000E+00        3  25   6   6  # h0-t-t eff. coupling^2, normalised to SM
    2.27077804E-03    0.00000000E+00        3  35   6   6  # H0-t-t eff. coupling^2, normalised to SM
    0.00000000E+00    2.25551168E-03        3  36   6   6  # A0-t-t eff. coupling^2, normalised to SM
#
    1.00676847E+00    0.00000000E+00        3  25  15  15  # h0-tau-tau eff. coupling^2, normalised to SM
    4.43351610E+02    0.00000000E+00        3  35  15  15  # H0-tau-tau eff. coupling^2, normalised to SM
    0.00000000E+00    4.43358379E+02        3  36  15  15  # A0-tau-tau eff. coupling^2, normalised to SM
#
Block HiggsBoundsInputHiggsCouplingsBosons
    9.99999974E-01        3  25  24  24  # h0-W-W eff. coupling^2, normalised to SM
    2.57456270E-08        3  35  24  24  # H0-W-W eff. coupling^2, normalised to SM
    0.00000000E+00        3  36  24  24  # A0-W-W eff. coupling^2, normalised to SM
#
    9.99999974E-01        3  25  23  23  # h0-Z-Z eff. coupling^2, normalised to SM
    2.57456270E-08        3  35  23  23  # H0-Z-Z eff. coupling^2, normalised to SM
    0.00000000E+00        3  36  23  23  # A0-Z-Z eff. coupling^2, normalised to SM
#
    8.90849353E-01        3  25  21  21  # h0-g-g eff. coupling^2, normalised to SM
    1.06004013E-13        3  35  21  21  # H0-g-g eff. coupling^2, normalised to SM
    5.40796245E-12        3  36  21  21  # A0-g-g eff. coupling^2, normalised to SM
#
    0.00000000E+00        3  25  25  23  # h0-h0-Z eff. coupling^2, normalised to SM
    0.00000000E+00        3  35  25  23  # H0-h0-Z eff. coupling^2, normalised to SM
    2.57456270E-08        3  36  25  23  # A0-h0-Z eff. coupling^2, normalised to SM
    0.00000000E+00        3  35  35  23  # H0-H0-Z eff. coupling^2, normalised to SM
    9.99999974E-01        3  36  35  23  # A0-H0-Z eff. coupling^2, normalised to SM
    0.00000000E+00        3  36  36  23  # A0-A0-Z eff. coupling^2, normalised to SM
#
    0.00000000E+00        4  25  21  21  23  # h0-g-g-Z eff. coupling^2, normalised to SM
    0.00000000E+00        4  35  21  21  23  # H0-g-g-Z eff. coupling^2, normalised to SM
    0.00000000E+00        4  36  21  21  23  # A0-g-g-Z eff. coupling^2, normalised to SM
#
#
#
#                             =================
#                             |The decay table|
#                             =================
#
# - The QCD corrections to the decays gluino -> squark  + quark
#                                     squark -> gaugino + quark_prime
#                                     squark -> squark_prime + Higgs
#                                     squark -> gluino  + quark
#   are included.
#
# - The multi-body decays for the inos, stops and sbottoms are included.
#
# - The loop induced decays for the gluino, neutralinos and stops
#   are included.
#
# - The SUSY decays of the top quark are included.
#
#
#         PDG            Width
DECAY         6     1.44038861E+00   # top decays
#          BR         NDA      ID1       ID2
     1.00000000E+00    2           5        24   # BR(t ->  b    W+)
#
#         PDG            Width
DECAY   1000021     5.16113189E+02   # gluino decays
#          BR         NDA      ID1       ID2
     6.60833986E-02    2     1000001        -1   # BR(~g -> ~d_L  db)
     6.60833986E-02    2    -1000001         1   # BR(~g -> ~d_L* d )
     1.03409143E-03    2     2000001        -1   # BR(~g -> ~d_R  db)
     1.03409143E-03    2    -2000001         1   # BR(~g -> ~d_R* d )
     6.61425352E-02    2     1000002        -2   # BR(~g -> ~u_L  ub)
     6.61425352E-02    2    -1000002         2   # BR(~g -> ~u_L* u )
     5.49080650E-02    2     2000002        -2   # BR(~g -> ~u_R  ub)
     5.49080650E-02    2    -2000002         2   # BR(~g -> ~u_R* u )
     6.60833986E-02    2     1000003        -3   # BR(~g -> ~s_L  sb)
     6.60833986E-02    2    -1000003         3   # BR(~g -> ~s_L* s )
     1.03409143E-03    2     2000003        -3   # BR(~g -> ~s_R  sb)
     1.03409143E-03    2    -2000003         3   # BR(~g -> ~s_R* s )
     6.61425335E-02    2     1000004        -4   # BR(~g -> ~c_L  cb)
     6.61425335E-02    2    -1000004         4   # BR(~g -> ~c_L* c )
     5.49080612E-02    2     2000004        -4   # BR(~g -> ~c_R  cb)
     5.49080612E-02    2    -2000004         4   # BR(~g -> ~c_R* c )
     4.99653837E-02    2     1000005        -5   # BR(~g -> ~b_1  bb)
     4.99653837E-02    2    -1000005         5   # BR(~g -> ~b_1* b )
     3.70715783E-02    2     2000005        -5   # BR(~g -> ~b_2  bb)
     3.70715783E-02    2    -2000005         5   # BR(~g -> ~b_2* b )
     3.66268631E-02    2     1000006        -6   # BR(~g -> ~t_1  tb)
     3.66268631E-02    2    -1000006         6   # BR(~g -> ~t_1* t )
#
#         PDG            Width
DECAY   1000006     3.83558303E+01   # stop1 decays
#          BR         NDA      ID1       ID2
     3.50435010E-01    2     1000022         6   # BR(~t_1 -> ~chi_10 t )
     3.59195832E-01    2     1000023         6   # BR(~t_1 -> ~chi_20 t )
     6.61210038E-02    2     1000025         6   # BR(~t_1 -> ~chi_30 t )
     9.24333548E-02    2     1000024         5   # BR(~t_1 -> ~chi_1+ b )
     1.30933641E-01    2     1000037         5   # BR(~t_1 -> ~chi_2+ b )
     8.81158736E-04    2     1000005        24   # BR(~t_1 -> ~b_1    W+)
#
#         PDG            Width
DECAY   2000006     1.56311558E+02   # stop2 decays
#          BR         NDA      ID1       ID2
     1.54842307E-01    2     1000022         6   # BR(~t_2 -> ~chi_10 t )
     1.58294612E-01    2     1000023         6   # BR(~t_2 -> ~chi_20 t )
     1.64536118E-03    2     1000025         6   # BR(~t_2 -> ~chi_30 t )
     2.21553720E-02    2     1000035         6   # BR(~t_2 -> ~chi_40 t )
     3.12044975E-01    2     1000024         5   # BR(~t_2 -> ~chi_1+ b )
     3.31346664E-03    2     1000037         5   # BR(~t_2 -> ~chi_2+ b )
     8.62196419E-02    2     1000006        25   # BR(~t_2 -> ~t_1    h )
     8.88697346E-02    2     1000006        23   # BR(~t_2 -> ~t_1    Z )
     3.12625974E-05    2     1000005        24   # BR(~t_2 -> ~b_1    W+)
     1.72583268E-01    2     2000005        24   # BR(~t_2 -> ~b_2    W+)
#
#         PDG            Width
DECAY   1000005     4.92706767E+00   # sbottom1 decays
#          BR         NDA      ID1       ID2
     2.56101621E-01    2     1000022         5   # BR(~b_1 -> ~chi_10 b )
     2.49634508E-01    2     1000023         5   # BR(~b_1 -> ~chi_20 b )
     9.98874966E-07    2     1000025         5   # BR(~b_1 -> ~chi_30 b )
     4.94261005E-01    2    -1000024         6   # BR(~b_1 -> ~chi_1- t )
     1.86738006E-06    2    -1000037         6   # BR(~b_1 -> ~chi_2- t )
#
#         PDG            Width
DECAY   2000005     3.80484478E+01   # sbottom2 decays
#          BR         NDA      ID1       ID2
     4.30248187E-02    2     1000022         5   # BR(~b_2 -> ~chi_10 b )
     4.20307676E-02    2     1000023         5   # BR(~b_2 -> ~chi_20 b )
     6.73587646E-02    2     1000025         5   # BR(~b_2 -> ~chi_30 b )
     7.10774666E-01    2    -1000024         6   # BR(~b_2 -> ~chi_1- t )
     1.35919791E-01    2    -1000037         6   # BR(~b_2 -> ~chi_2- t )
     4.32027602E-04    2     1000005        25   # BR(~b_2 -> ~b_1    h )
     4.59164812E-04    2     1000005        23   # BR(~b_2 -> ~b_1    Z )
#
#         PDG            Width
DECAY   1000002     5.86398534E-02   # sup_L decays
#          BR         NDA      ID1       ID2
     1.32096569E-01    2     1000022         2   # BR(~u_L -> ~chi_10 u)
     5.39902975E-02    2     1000023         2   # BR(~u_L -> ~chi_20 u)
     8.13913133E-01    2     1000024         1   # BR(~u_L -> ~chi_1+ d)
#
#         PDG            Width
DECAY   2000002     2.66750728E-03   # sup_R decays
#           BR         NDA      ID1       ID2
     3.17901927E-01    2     1000022         2   # BR(~u_R -> ~chi_10 u)
     1.70540304E-01    2     1000023         2   # BR(~u_R -> ~chi_20 u)
#           BR         NDA      ID1       ID2       ID3
     6.75911933E-02    3        2       -1        1000001   # BR(~u_R -> u  db  ~d_L)
     6.95668205E-03    3        2       1        -1000001   # BR(~u_R -> u  d  ~d_L*)
     6.85283979E-02    3        2       -2        1000002   # BR(~u_R -> u  ub  ~u_L)
     7.15274525E-03    3        2       2        -1000002   # BR(~u_R -> u  u  ~u_L*)
     6.62453675E-02    3        2       -3        1000003   # BR(~u_R -> u  sb  ~s_L)
     7.01328921E-03    3        2       3        -1000003   # BR(~u_R -> u  s  ~s_L*)
     6.83597010E-02    3        2       -4        1000004   # BR(~u_R -> u  cb  ~c_L)
     7.25883680E-03    3        2       4        -1000004   # BR(~u_R -> u  c  ~c_L*)
     1.73191655E-02    3        2       -15        1000015   # BR(~u_R -> u  tau+  ~tau_1-)
     1.04914428E-01    3        2       15        -1000015   # BR(~u_R -> u  tau-  ~tau_1+)
     1.38170195E-04    3        2       -15        2000015   # BR(~u_R -> u  tau+  ~tau_2-)
     5.03353828E-05    3        2       15        -2000015   # BR(~u_R -> u  tau-  ~tau_2+)
     1.23249898E-04    3        2       -16        1000016   # BR(~u_R -> u  nu_taub  ~nu_tau1)
     3.87852738E-05    3        2       16        -1000016   # BR(~u_R -> u  nu_tau  ~nu_tau1*)
     7.60822667E-03    3        2       23        1000022   # BR(~u_R -> u  Z  ~chi_10)
     1.41896520E-02    3        2       25        1000022   # BR(~u_R -> u  h  ~chi_10)
     1.64097022E-02    3        2       23        1000023   # BR(~u_R -> u  Z  ~chi_20)
     5.88676932E-03    3        2       25        1000023   # BR(~u_R -> u  h  ~chi_20)
     6.54168787E-03    3        2       -24        1000024   # BR(~u_R -> u  W-  ~chi_1+)
     3.92313831E-02    3        2       24        -1000024   # BR(~u_R -> u  W+  ~chi_1-)
#
#         PDG            Width
DECAY   1000001     1.64735217E-02   # sdown_L decays
#          BR         NDA      ID1       ID2
     6.04235036E-01    2     1000022         1   # BR(~d_L -> ~chi_10 d)
     2.55285638E-01    2     1000023         1   # BR(~d_L -> ~chi_20 d)
     1.40479326E-01    2    -1000024         2   # BR(~d_L -> ~chi_1- u)
#
#         PDG            Width
DECAY   2000001     7.75117893E-01   # sdown_R decays
#          BR         NDA      ID1       ID2
     6.60551908E-04    2     1000022         1   # BR(~d_R -> ~chi_10 d)
     3.55106517E-04    2     1000023         1   # BR(~d_R -> ~chi_20 d)
     1.72563980E-05    2     1000025         1   # BR(~d_R -> ~chi_30 d)
     9.98967085E-01    2     1000035         1   # BR(~d_R -> ~chi_40 d)
#
#         PDG            Width
DECAY   1000004     5.60136083E-02   # scharm_L decays
#          BR         NDA      ID1       ID2
     1.32097379E-01    2     1000022         4   # BR(~c_L -> ~chi_10 c)
     5.39893125E-02    2     1000023         4   # BR(~c_L -> ~chi_20 c)
     8.13913308E-01    2     1000024         3   # BR(~c_L -> ~chi_1+ s)
#
#         PDG            Width
DECAY   2000004     2.63392152E-03   # scharm_R decays
#           BR         NDA      ID1       ID2
     3.13561831E-01    2     1000022         4   # BR(~c_R -> ~chi_10 c)
     1.68207071E-01    2     1000023         4   # BR(~c_R -> ~chi_20 c)
#           BR         NDA      ID1       ID2       ID3
     6.84416749E-02    3        4       -1        1000001   # BR(~c_R -> c  db  ~d_L)
     7.04386972E-03    3        4       1        -1000001   # BR(~c_R -> c  d  ~d_L*)
     6.92541516E-02    3        4       -2        1000002   # BR(~c_R -> c  ub  ~u_L)
     7.25686012E-03    3        4       2        -1000002   # BR(~c_R -> c  u  ~u_L*)
     6.70179422E-02    3        4       -3        1000003   # BR(~c_R -> c  sb  ~s_L)
     7.08563254E-03    3        4       3        -1000003   # BR(~c_R -> c  s  ~s_L*)
     6.92503550E-02    3        4       -4        1000004   # BR(~c_R -> c  cb  ~c_L)
     7.25913809E-03    3        4       4        -1000004   # BR(~c_R -> c  c  ~c_L*)
     1.72871514E-02    3        4       -15        1000015   # BR(~c_R -> c  tau+  ~tau_1-)
     1.06650862E-01    3        4       15        -1000015   # BR(~c_R -> c  tau-  ~tau_1+)
     1.39909256E-04    3        4       -15        2000015   # BR(~c_R -> c  tau+  ~tau_2-)
     5.10075943E-05    3        4       15        -2000015   # BR(~c_R -> c  tau-  ~tau_2+)
     1.25630167E-04    3        4       -16        1000016   # BR(~c_R -> c  nu_taub  ~nu_tau1)
     3.95911569E-05    3        4       16        -1000016   # BR(~c_R -> c  nu_tau  ~nu_tau1*)
     7.82445486E-03    3        4       23        1000022   # BR(~c_R -> c  Z  ~chi_10)
     1.44013403E-02    3        4       25        1000022   # BR(~c_R -> c  h  ~chi_10)
     1.67127227E-02    3        4       23        1000023   # BR(~c_R -> c  Z  ~chi_20)
     5.93981252E-03    3        4       25        1000023   # BR(~c_R -> c  h  ~chi_20)
     6.56929217E-03    3        4       -24        1000024   # BR(~c_R -> c  W-  ~chi_1+)
     3.98797000E-02    3        4       24        -1000024   # BR(~c_R -> c  W+  ~chi_1-)
#
#         PDG            Width
DECAY   1000003     1.57381127E-02   # sstrange_L decays
#          BR         NDA      ID1       ID2
     6.04240021E-01    2     1000022         3   # BR(~s_L -> ~chi_10 s)
     2.55281518E-01    2     1000023         3   # BR(~s_L -> ~chi_20 s)
     1.40478462E-01    2    -1000024         4   # BR(~s_L -> ~chi_1- c)
#
#         PDG            Width
DECAY   2000003     7.88309412E-01   # sstrange_R decays
#          BR         NDA      ID1       ID2
     6.68282427E-04    2     1000022         3   # BR(~s_R -> ~chi_10 s)
     3.59252613E-04    2     1000023         3   # BR(~s_R -> ~chi_20 s)
     1.73724451E-05    2     1000025         3   # BR(~s_R -> ~chi_30 s)
     9.98955093E-01    2     1000035         3   # BR(~s_R -> ~chi_40 s)
#
#         PDG            Width
DECAY   1000011     3.40484205E+01   # selectron_L decays
#          BR         NDA      ID1       ID2
     6.79827788E-04    2     1000022        11   # BR(~e_L -> ~chi_10 e-)
     2.67368055E-04    2     1000023        11   # BR(~e_L -> ~chi_20 e-)
     3.15443922E-01    2     1000025        11   # BR(~e_L -> ~chi_30 e-)
     5.27506815E-02    2     1000035        11   # BR(~e_L -> ~chi_40 e-)
     2.68848024E-04    2    -1000024        12   # BR(~e_L -> ~chi_1- nu_e)
     6.30589352E-01    2    -1000037        12   # BR(~e_L -> ~chi_2- nu_e)
#
#         PDG            Width
DECAY   2000011     3.46779049E+00   # selectron_R decays
#          BR         NDA      ID1       ID2
     1.16346538E-03    2     1000022        11   # BR(~e_R -> ~chi_10 e-)
     6.25353385E-04    2     1000023        11   # BR(~e_R -> ~chi_20 e-)
     2.63354521E-05    2     1000025        11   # BR(~e_R -> ~chi_30 e-)
     9.98184846E-01    2     1000035        11   # BR(~e_R -> ~chi_40 e-)
#
#         PDG            Width
DECAY   1000013     3.40484205E+01   # smuon_L decays
#          BR         NDA      ID1       ID2
     6.79827787E-04    2     1000022        13   # BR(~mu_L -> ~chi_10 mu-)
     2.67368055E-04    2     1000023        13   # BR(~mu_L -> ~chi_20 mu-)
     3.15443922E-01    2     1000025        13   # BR(~mu_L -> ~chi_30 mu-)
     5.27506813E-02    2     1000035        13   # BR(~mu_L -> ~chi_40 mu-)
     2.68848025E-04    2    -1000024        14   # BR(~mu_L -> ~chi_1- nu_mu)
     6.30589353E-01    2    -1000037        14   # BR(~mu_L -> ~chi_2- nu_mu)
#
#         PDG            Width
DECAY   2000013     3.46779045E+00   # smuon_R decays
#          BR         NDA      ID1       ID2
     1.16346539E-03    2     1000022        13   # BR(~mu_R -> ~chi_10 mu-)
     6.25353390E-04    2     1000023        13   # BR(~mu_R -> ~chi_20 mu-)
     2.63354523E-05    2     1000025        13   # BR(~mu_R -> ~chi_30 mu-)
     9.98184846E-01    2     1000035        13   # BR(~mu_R -> ~chi_40 mu-)
#
#         PDG            Width
DECAY   1000015     7.15405040E-02   # stau_1 decays
#          BR         NDA      ID1       ID2
     2.72305305E-01    2     1000022        15   # BR(~tau_1 -> ~chi_10  tau-)
     2.26567836E-01    2     1000023        15   # BR(~tau_1 -> ~chi_20  tau-)
     5.01126859E-01    2    -1000024        16   # BR(~tau_1 -> ~chi_1-  nu_tau)
#
#         PDG            Width
DECAY   2000015     1.04704817E+00   # stau_2 decays
#          BR         NDA      ID1       ID2
     4.94419342E-01    2     1000022        15   # BR(~tau_2 -> ~chi_10  tau-)
     4.80764191E-01    2     1000023        15   # BR(~tau_2 -> ~chi_20  tau-)
     2.03343497E-03    2    -1000024        16   # BR(~tau_2 -> ~chi_1-  nu_tau)
     1.12633360E-02    2     1000015        25   # BR(~tau_2 -> ~tau_1   h)
     1.15196966E-02    2     1000015        23   # BR(~tau_2 -> ~tau_1   Z)
#
#         PDG            Width
DECAY   1000012     3.40673054E+01   # snu_eL decays
#          BR         NDA      ID1       ID2
     1.43572645E-03    2     1000022        12   # BR(~nu_eL -> ~chi_10 nu_e)
     6.25857582E-04    2     1000023        12   # BR(~nu_eL -> ~chi_20 nu_e)
     3.12954383E-01    2     1000025        12   # BR(~nu_eL -> ~chi_30 nu_e)
     5.33513257E-02    2     1000035        12   # BR(~nu_eL -> ~chi_40 nu_e)
     5.56125729E-03    2     1000024        11   # BR(~nu_eL -> ~chi_1+ e-)
     6.26071450E-01    2     1000037        11   # BR(~nu_eL -> ~chi_2+ e-)
#
#         PDG            Width
DECAY   1000014     3.40673054E+01   # snu_muL decays
#          BR         NDA      ID1       ID2
     1.43572645E-03    2     1000022        14   # BR(~nu_muL -> ~chi_10 nu_mu)
     6.25857582E-04    2     1000023        14   # BR(~nu_muL -> ~chi_20 nu_mu)
     3.12954383E-01    2     1000025        14   # BR(~nu_muL -> ~chi_30 nu_mu)
     5.33513258E-02    2     1000035        14   # BR(~nu_muL -> ~chi_40 nu_mu)
     5.56125728E-03    2     1000024        13   # BR(~nu_muL -> ~chi_1+ mu-)
     6.26071450E-01    2     1000037        13   # BR(~nu_muL -> ~chi_2+ mu-)
#
#         PDG            Width
DECAY   1000016     1.10738007E+00   # snu_tauL decays
#          BR         NDA      ID1       ID2
     1.28405789E-02    2     1000022        16   # BR(~nu_tauL -> ~chi_10 nu_tau)
     5.57573137E-03    2     1000023        16   # BR(~nu_tauL -> ~chi_20 nu_tau)
     9.60520148E-01    2     1000024        15   # BR(~nu_tauL -> ~chi_1+ tau-)
     2.10635421E-02    2    -1000015       -24   # BR(~nu_tauL -> ~tau_1+ W-)
#
#         PDG            Width
DECAY   1000024     1.10247416E-10   # chargino1+ decays
#           BR         NDA      ID1       ID2       ID3
     3.71971812E-01    3     1000022         2        -1   # BR(~chi_1+ -> ~chi_10 u    db)
     3.71971812E-01    3     1000022         4        -3   # BR(~chi_1+ -> ~chi_10 c    sb)
     1.23987131E-01    3     1000022       -11        12   # BR(~chi_1+ -> ~chi_10 e+   nu_e)
     1.23987131E-01    3     1000022       -13        14   # BR(~chi_1+ -> ~chi_10 mu+  nu_mu)
     8.08211486E-03    3     1000022       -15        16   # BR(~chi_1+ -> ~chi_10 tau+ nu_tau)
#
#         PDG            Width
DECAY   1000037     3.26287951E+01   # chargino2+ decays
#          BR         NDA      ID1       ID2
     1.49794468E-01    2     1000002        -1   # BR(~chi_2+ -> ~u_L     db)
     1.48967614E-01    2    -1000001         2   # BR(~chi_2+ -> ~d_L*    u )
     1.49794429E-01    2     1000004        -3   # BR(~chi_2+ -> ~c_L     sb)
     1.48966973E-01    2    -1000003         4   # BR(~chi_2+ -> ~s_L*     c )
     2.16753813E-02    2     1000016       -15   # BR(~chi_2+ -> ~nu_tau1 tau+)
     5.26357583E-08    2    -1000015        16   # BR(~chi_2+ -> ~tau_1+  nu_tau)
     2.13911115E-02    2    -2000015        16   # BR(~chi_2+ -> ~tau_2+  nu_tau)
     9.11624022E-02    2     1000024        23   # BR(~chi_2+ -> ~chi_1+  Z )
     8.77024629E-02    2     1000022        24   # BR(~chi_2+ -> ~chi_10  W+)
     8.94651702E-02    2     1000023        24   # BR(~chi_2+ -> ~chi_20  W+)
     9.10799357E-02    2     1000024        25   # BR(~chi_2+ -> ~chi_1+  h )
#
#         PDG            Width
DECAY   1000022     0.00000000E+00   # neutralino1 decays
#
#         PDG            Width
DECAY   1000023     4.58282139E-09   # neutralino2 decays
#          BR         NDA      ID1       ID2
     4.68329699E-02    2     1000022        22   # BR(~chi_20 -> ~chi_10 gam)
#           BR         NDA      ID1       ID2       ID3
     1.20253041E-01    3     1000022        -2         2   # BR(~chi_20 -> ~chi_10 ub      u)
     1.56069198E-01    3     1000022        -1         1   # BR(~chi_20 -> ~chi_10 db      d)
     1.20253041E-01    3     1000022        -4         4   # BR(~chi_20 -> ~chi_10 cb      c)
     1.56069198E-01    3     1000022        -3         3   # BR(~chi_20 -> ~chi_10 sb      s)
     3.58425973E-02    3     1000022       -11        11   # BR(~chi_20 -> ~chi_10 e+      e-)
     3.58425973E-02    3     1000022       -13        13   # BR(~chi_20 -> ~chi_10 mu+     mu-)
     1.51583263E-02    3     1000022       -15        15   # BR(~chi_20 -> ~chi_10 tau+    tau-)
     7.16655915E-02    3     1000022       -12        12   # BR(~chi_20 -> ~chi_10 nu_eb   nu_e)
     7.16655915E-02    3     1000022       -14        14   # BR(~chi_20 -> ~chi_10 nu_mub  nu_mu)
     7.16669450E-02    3     1000022       -16        16   # BR(~chi_20 -> ~chi_10 nu_taub nu_tau)
     1.81640356E-02    3     1000024        -2         1   # BR(~chi_20 -> ~chi_1+ ub      d)
     1.81640356E-02    3    -1000024        -1         2   # BR(~chi_20 -> ~chi_1- db      u)
     1.81640356E-02    3     1000024        -4         3   # BR(~chi_20 -> ~chi_1+ cb      s)
     1.81640356E-02    3    -1000024        -3         4   # BR(~chi_20 -> ~chi_1- sb      c)
     6.05461218E-03    3     1000024       -12        11   # BR(~chi_20 -> ~chi_1+ nu_eb   e-)
     6.05461218E-03    3    -1000024        12       -11   # BR(~chi_20 -> ~chi_1- nu_e    e+)
     6.05461218E-03    3     1000024       -14        13   # BR(~chi_20 -> ~chi_1+ nu_mub  mu-)
     6.05461218E-03    3    -1000024        14       -13   # BR(~chi_20 -> ~chi_1- nu_mu   mu+)
     9.03156002E-04    3     1000024       -16        15   # BR(~chi_20 -> ~chi_1+ nu_taub tau-)
     9.03156002E-04    3    -1000024        16       -15   # BR(~chi_20 -> ~chi_1- nu_tau  tau+)
#
#         PDG            Width
DECAY   1000025     3.26144109E+01   # neutralino3 decays
#          BR         NDA      ID1       ID2
     2.61048757E-02    2     1000022        23   # BR(~chi_30 -> ~chi_10   Z )
     6.46238941E-02    2     1000023        23   # BR(~chi_30 -> ~chi_20   Z )
     8.96238347E-02    2     1000024       -24   # BR(~chi_30 -> ~chi_1+   W-)
     8.96238347E-02    2    -1000024        24   # BR(~chi_30 -> ~chi_1-   W+)
     6.35381748E-02    2     1000022        25   # BR(~chi_30 -> ~chi_10   h )
     2.59835112E-02    2     1000023        25   # BR(~chi_30 -> ~chi_20   h )
     7.52016478E-02    2     1000002        -2   # BR(~chi_30 -> ~u_L      ub)
     7.52016478E-02    2    -1000002         2   # BR(~chi_30 -> ~u_L*     u )
     7.41635399E-02    2     1000001        -1   # BR(~chi_30 -> ~d_L      db)
     7.41635399E-02    2    -1000001         1   # BR(~chi_30 -> ~d_L*     d )
     7.52013298E-02    2     1000004        -4   # BR(~chi_30 -> ~c_L      cb)
     7.52013298E-02    2    -1000004         4   # BR(~chi_30 -> ~c_L*     c )
     7.41635399E-02    2     1000003        -3   # BR(~chi_30 -> ~s _L      sb)
     7.41635399E-02    2    -1000003         3   # BR(~chi_30 -> ~s _L*     s )
     9.92352082E-07    2     1000015       -15   # BR(~chi_30 -> ~tau_1-   tau+)
     9.92352082E-07    2    -1000015        15   # BR(~chi_30 -> ~tau_1+   tau-)
     1.06920830E-02    2     2000015       -15   # BR(~chi_30 -> ~tau_2-   tau+)
     1.06920830E-02    2    -2000015        15   # BR(~chi_30 -> ~tau_2+   tau-)
     1.08278046E-02    2     1000016       -16   # BR(~chi_30 -> ~nu_tau1  nu_taub)
     1.08278046E-02    2    -1000016        16   # BR(~chi_30 -> ~nu_tau1* nu_tau )
#
#         PDG            Width
DECAY   1000035     3.55264390E+01   # neutralino4 decays
#          BR         NDA      ID1       ID2
     1.41029486E-02    2     1000022        23   # BR(~chi_40 -> ~chi_10   Z )
     2.73949272E-02    2     1000023        23   # BR(~chi_40 -> ~chi_20   Z )
     2.82032137E-05    2     1000025        23   # BR(~chi_40 -> ~chi_30   Z )
     3.93001393E-02    2     1000024       -24   # BR(~chi_40 -> ~chi_1+   W-)
     3.93001393E-02    2    -1000024        24   # BR(~chi_40 -> ~chi_1-   W+)
     5.92019923E-04    2     1000037       -24   # BR(~chi_40 -> ~chi_2+   W-)
     5.92019923E-04    2    -1000037        24   # BR(~chi_40 -> ~chi_2-   W+)
     2.82430219E-02    2     1000022        25   # BR(~chi_40 -> ~chi_10   h )
     1.52236080E-02    2     1000023        25   # BR(~chi_40 -> ~chi_20   h )
     5.65940973E-04    2     1000025        25   # BR(~chi_40 -> ~chi_30   h )
     9.32621230E-03    2     1000002        -2   # BR(~chi_40 -> ~u_L      ub)
     9.32621230E-03    2    -1000002         2   # BR(~chi_40 -> ~u_L*     u )
     7.66343653E-02    2     2000002        -2   # BR(~chi_40 -> ~u_R      ub)
     7.66343653E-02    2    -2000002         2   # BR(~chi_40 -> ~u_R*     u )
     9.66922097E-03    2     1000001        -1   # BR(~chi_40 -> ~d_L      db)
     9.66922097E-03    2    -1000001         1   # BR(~chi_40 -> ~d_L*     d )
     9.32620974E-03    2     1000004        -4   # BR(~chi_40 -> ~c_L      cb)
     9.32620974E-03    2    -1000004         4   # BR(~chi_40 -> ~c_L*     c )
     7.66342713E-02    2     2000004        -4   # BR(~chi_40 -> ~c_R      cb)
     7.66342713E-02    2    -2000004         4   # BR(~chi_40 -> ~c_R*     c )
     9.66922097E-03    2     1000003        -3   # BR(~chi_40 -> ~s _L      sb)
     9.66922097E-03    2    -1000003         3   # BR(~chi_40 -> ~s _L*     s )
     1.22608147E-02    2     1000005        -5   # BR(~chi_40 -> ~b_1      bb)
     1.22608147E-02    2    -1000005         5   # BR(~chi_40 -> ~b_1*     b )
     2.82780304E-04    2     2000005        -5   # BR(~chi_40 -> ~b_2      bb)
     2.82780304E-04    2    -2000005         5   # BR(~chi_40 -> ~b_2*     b )
     1.65966739E-01    2     1000015       -15   # BR(~chi_40 -> ~tau_1-   tau+)
     1.65966739E-01    2    -1000015        15   # BR(~chi_40 -> ~tau_1+   tau-)
     2.35845332E-02    2     2000015       -15   # BR(~chi_40 -> ~tau_2-   tau+)
     2.35845332E-02    2    -2000015        15   # BR(~chi_40 -> ~tau_2+   tau-)
     2.39741480E-02    2     1000016       -16   # BR(~chi_40 -> ~nu_tau1  nu_taub)
     2.39741480E-02    2    -1000016        16   # BR(~chi_40 -> ~nu_tau1* nu_tau )
#
#         PDG            Width
DECAY        25     4.16408200E-03   # h decays
#          BR         NDA      ID1       ID2
     6.01186921E-01    2           5        -5   # BR(h -> b       bb     )
     6.26782657E-02    2         -15        15   # BR(h -> tau+    tau-   )
     2.21871986E-04    2         -13        13   # BR(h -> mu+     mu-    )
     2.42060397E-04    2           3        -3   # BR(h -> s       sb     )
     2.08612967E-02    2           4        -4   # BR(h -> c       cb     )
     7.71708945E-02    2          21        21   # BR(h -> g       g      )
     2.28102023E-03    2          22        22   # BR(h -> gam     gam    )
     1.53324233E-03    2          22        23   # BR(h -> Z       gam    )
     2.07830459E-01    2          24       -24   # BR(h -> W+      W-     )
     2.59939689E-02    2          23        23   # BR(h -> Z       Z      )
#
#         PDG            Width
DECAY        35     3.20048156E+01   # H decays
#          BR         NDA      ID1       ID2
     4.12472395E-01    2           5        -5   # BR(H -> b       bb     )
     7.28410617E-02    2         -15        15   # BR(H -> tau+    tau-   )
     2.62817549E-04    2         -13        13   # BR(H -> mu+     mu-    )
     1.62308657E-04    2           3        -3   # BR(H -> s       sb     )
     7.73584711E-08    2           4        -4   # BR(H -> c       cb     )
     7.57449657E-03    2           6        -6   # BR(H -> t       tb     )
     4.61887057E-06    2          21        21   # BR(H -> g       g      )
     5.88204356E-08    2          22        22   # BR(H -> gam     gam    )
     4.08839416E-09    2          23        22   # BR(H -> Z       gam    )
     4.57466661E-06    2          24       -24   # BR(H -> W+      W-     )
     2.28130837E-06    2          23        23   # BR(H -> Z       Z      )
     1.75370269E-05    2          25        25   # BR(H -> h       h      )
     4.05119734E-03    2     1000024  -1000024   # BR(H -> ~chi_1+ ~chi_1-)
     1.59555029E-01    2     1000024  -1000037   # BR(H -> ~chi_1+ ~chi_2-)
     1.59555029E-01    2     1000037  -1000024   # BR(H -> ~chi_2+ ~chi_1-)
     9.61432847E-04    2     1000022   1000022   # BR(H -> ~chi_10 ~chi_10)
     4.95328585E-04    2     1000023   1000023   # BR(H -> ~chi_20 ~chi_20)
     9.23040809E-05    2     1000022   1000023   # BR(H -> ~chi_10 ~chi_20)
     6.03035040E-02    2     1000022   1000025   # BR(H -> ~chi_10 ~chi_30)
     1.51548952E-04    2     1000022   1000035   # BR(H -> ~chi_10 ~chi_40)
     9.91728855E-02    2     1000023   1000025   # BR(H -> ~chi_20 ~chi_30)
     2.08335430E-03    2     1000023   1000035   # BR(H -> ~chi_20 ~chi_40)
     2.30437782E-06    2     1000002  -1000002   # BR(H -> ~u_L    ~u_L*  )
     2.30437782E-06    2     1000004  -1000004   # BR(H -> ~c_L    ~c_L*  )
     3.36744591E-06    2     1000001  -1000001   # BR(H -> ~d_L    ~d_L*  )
     3.36744591E-06    2     1000003  -1000003   # BR(H -> ~s_L    ~s_L*  )
     6.32341687E-07    2     1000015  -1000015   # BR(H -> ~tau_1- ~tau_1+)
     1.47943212E-06    2     2000015  -2000015   # BR(H -> ~tau_2- ~tau_2+)
     1.01108115E-02    2     1000015  -2000015   # BR(H -> ~tau_1- ~tau_2+)
     1.01108115E-02    2     2000015  -1000015   # BR(H -> ~tau_2- ~tau_1+)
     1.07606764E-06    2     1000016  -1000016   # BR(H -> ~nu_tauL ~nu_tauL*)
#
#         PDG            Width
DECAY        36     3.20054314E+01   # A decays
#          BR         NDA      ID1       ID2
     4.12497096E-01    2           5        -5   # BR(A -> b       bb     )
     7.28405652E-02    2         -15        15   # BR(A -> tau+    tau-   )
     2.62815230E-04    2         -13        13   # BR(A -> mu+     mu-    )
     1.62333143E-04    2           3        -3   # BR(A -> s       sb     )
     7.75466050E-08    2           4        -4   # BR(A -> c       cb     )
     7.61233827E-03    2           6        -6   # BR(A -> t       tb     )
     3.29892881E-05    2          21        21   # BR(A -> g       g      )
     1.37957902E-07    2          22        22   # BR(A -> gam     gam    )
     2.71962218E-08    2          23        22   # BR(A -> Z       gam    )
     4.62926007E-06    2          23        25   # BR(A -> Z       h      )
     4.39535633E-03    2     1000024  -1000024   # BR(A -> ~chi_1+ ~chi_1-)
     1.59315292E-01    2     1000024  -1000037   # BR(A -> ~chi_1+ ~chi_2-)
     1.59315292E-01    2     1000037  -1000024   # BR(A -> ~chi_2+ ~chi_1-)
     1.20671843E-03    2     1000022   1000022   # BR(A -> ~chi_10 ~chi_10)
     4.25784647E-04    2     1000023   1000023   # BR(A -> ~chi_20 ~chi_20)
     3.37083048E-05    2     1000022   1000023   # BR(A -> ~chi_10 ~chi_20)
     1.00395052E-01    2     1000022   1000025   # BR(A -> ~chi_10 ~chi_30)
     2.24268173E-03    2     1000022   1000035   # BR(A -> ~chi_10 ~chi_40)
     5.89134959E-02    2     1000023   1000025   # BR(A -> ~chi_20 ~chi_30)
     1.20378961E-04    2     1000023   1000035   # BR(A -> ~chi_20 ~chi_40)
     1.01116156E-02    2     1000015  -2000015   # BR(A -> ~tau_1- ~tau_2+)
     1.01116156E-02    2    -1000015   2000015   # BR(A -> ~tau_1+ ~tau_2-)
#
#         PDG            Width
DECAY        37     3.12452108E+01   # H+ decays
#          BR         NDA      ID1       ID2
     6.71503496E-04    2           4        -5   # BR(H+ -> c       bb     )
     7.46534838E-02    2         -15        16   # BR(H+ -> tau+    nu_tau )
     2.69356401E-04    2         -13        14   # BR(H+ -> mu+     nu_mu  )
     6.71502341E-06    2           2        -5   # BR(H+ -> u       bb     )
     8.31547904E-06    2           2        -3   # BR(H+ -> u       sb     )
     1.63750023E-04    2           4        -3   # BR(H+ -> c       sb     )
     4.06322975E-01    2           6        -5   # BR(H+ -> t       bb     )
     4.75362012E-06    2          24        25   # BR(H+ -> W+      h      )
     2.43489480E-13    2          24        36   # BR(H+ -> W+      A      )
     1.70605339E-04    2     1000024   1000022   # BR(H+ -> ~chi_1+ ~chi_10)
     6.19928050E-04    2     1000024   1000023   # BR(H+ -> ~chi_1+ ~chi_20)
     1.64741359E-01    2     1000024   1000025   # BR(H+ -> ~chi_1+ ~chi_30)
     2.38216183E-03    2     1000024   1000035   # BR(H+ -> ~chi_1+ ~chi_40)
     1.66452004E-01    2     1000037   1000022   # BR(H+ -> ~chi_2+ ~chi_10)
     1.62781884E-01    2     1000037   1000023   # BR(H+ -> ~chi_2+ ~chi_20)
     2.07371208E-02    2    -1000015   1000016   # BR(H+ -> ~tau_1+ ~nu_tauL)
     2.60068264E-06    2    -2000015   1000016   # BR(H+ -> ~tau_2+ ~nu_tauL)
     5.74169780E-06    2     1000002  -1000001   # BR(H+ -> ~u_L    ~d_L*  )
     5.74169780E-06    2     1000004  -1000003   # BR(H+ -> ~c_L    ~s_L*  )
