#
#                              ======================
#                              | THE SUSYHIT OUTPUT |
#                              ======================
#
#
#              ------------------------------------------------------
#              |     This is the output of the SUSY-HIT package     |
#              |  created by A.Djouadi, M.Muehlleitner and M.Spira. |
#              |  In case of problems with SUSY-HIT email to        |
#              |           margarete.muehlleitner@cern.ch           |
#              |           michael.spira@psi.ch                     |
#              |           abdelhak.djouadi@cern.ch                 |
#              ------------------------------------------------------
#
#              ------------------------------------------------------
#              |  SUSY Les Houches Accord - MSSM Spectrum + Decays  |
#              |              based on the decay programs           |
#              |                                                    |
#              |                     SDECAY 1.3b                    |
#              |                                                    |
#              |  Authors: M.Muhlleitner, A.Djouadi and Y.Mambrini  |
#              |  Ref.:    Comput.Phys.Commun.168(2005)46           |
#              |           [hep-ph/0311167]                         |
#              |                                                    |
#              |                     HDECAY 3.4                     |
#              |                                                    |
#              |  By: A.Djouadi,J.Kalinowski,M.Muhlleitner,M.Spira  |
#              |  Ref.:    Comput.Phys.Commun.108(1998)56           |
#              |           [hep-ph/9704448]                         |
#              |                                                    |
#              |                                                    |
#              |  If not stated otherwise all DRbar couplings and   |
#              |  soft SUSY breaking masses are given at the scale  |
#              |  Q=  0.28513160E+04
#              |                                                    |
#              ------------------------------------------------------
#
#
BLOCK DCINFO  # Decay Program information
     1   SDECAY/HDECAY # decay calculator
     2   1.3b  /3.4    # version number
#
BLOCK SPINFO  # Spectrum calculator information
     1     SOFTSUSY    # spectrum calculator               
     2     3.4.0       # version number                    
#
BLOCK MODSEL  # Model selection
     1     0   #  nonUniversal                                     
#
BLOCK SMINPUTS  # Standard Model inputs
         1     1.27908970E+02   # alpha_em^-1(M_Z)^MSbar
         2     1.16637870E-05   # G_F [GeV^-2]
         3     1.18400000E-01   # alpha_S(M_Z)^MSbar
         4     9.11876000E+01   # M_Z pole mass
         5     4.18000000E+00   # mb(mb)^MSbar
         6     1.73200000E+02   # mt pole mass
         7     1.77700000E+00   # mtau pole mass
#
BLOCK MINPAR  # Input parameters - minimal models
         3     5.05900000E+01   # tanb                
#
BLOCK EXTPAR  # Input parameters - non-minimal models
         0    -1.00000000E+00   # Set                 
         1    -2.48399000E+03   # M_1(MX)             
         2    -2.80170000E+02   # M_2(MX)             
         3     3.61822000E+03   # M_3(MX)             
        11    -4.06040000E+03   # At(MX)              
        12     2.36275000E+03   # Ab(MX)              
        13     3.79492000E+03   # Atau(MX)            
        23     2.64847000E+03   # mu(MX)              
        26     2.44643000E+03   # mA(pole)            
        31     3.44255000E+03   # meL(MX)             
        32     3.44255000E+03   # mmuL(MX)            
        33     3.36140000E+03   # mtauL(MX)           
        34     2.05843000E+03   # meR(MX)             
        35     2.05843000E+03   # mmuR(MX)            
        36     3.11623000E+03   # mtauR(MX)           
        41     2.31921000E+03   # mqL1(MX)            
        42     2.31921000E+03   # mqL2(MX)            
        43     2.80045000E+03   # mqL3(MX)            
        44     2.60843000E+03   # muR(MX)             
        45     2.60843000E+03   # mcR(MX)             
        46     2.90410000E+03   # mtR(MX)             
        47     2.66791000E+03   # mdR(MX)             
        48     2.66791000E+03   # msR(MX)             
        49     4.12310000E+02   # mbR(MX)             
#
BLOCK MASS  # Mass Spectrum
# PDG code           mass       particle
        24     8.03691300E+01   # W+
        25     1.27418486E+02   # h
        35     2.44639675E+03   # H
        36     2.44642996E+03   # A
        37     2.44765657E+03   # H+
         5     4.81876030E+00   # b-quark pole mass calculated from mb(mb)_Msbar
   1000001     2.43681473E+03   # ~d_L
   2000001     2.77816039E+03   # ~d_R
   1000002     2.43560885E+03   # ~u_L
   2000002     2.71937782E+03   # ~u_R
   1000003     2.43681473E+03   # ~s_L
   2000003     2.77816039E+03   # ~s_R
   1000004     2.43560885E+03   # ~c_L
   2000004     2.71937782E+03   # ~c_R
   1000005     6.36102553E+02   # ~b_1
   2000005     2.88336942E+03   # ~b_2
   1000006     2.81498456E+03   # ~t_1
   2000006     3.02365419E+03   # ~t_2
   1000011     3.44941716E+03   # ~e_L
   2000011     2.07299187E+03   # ~e_R
   1000012     3.44816561E+03   # ~nu_eL
   1000013     3.44941716E+03   # ~mu_L
   2000013     2.07299187E+03   # ~mu_R
   1000014     3.44816561E+03   # ~nu_muL
   1000015     3.10866732E+03   # ~tau_1
   2000015     3.36445526E+03   # ~tau_2
   1000016     3.35859415E+03   # ~nu_tauL
   1000021     3.63329641E+03   # ~g
   1000022    -3.02070460E+02   # ~chi_10
   1000023    -2.45338813E+03   # ~chi_20
   1000025     2.67176777E+03   # ~chi_30
   1000035    -2.67649437E+03   # ~chi_40
   1000024     3.02233446E+02   # ~chi_1+
   1000037     2.67334952E+03   # ~chi_2+
#
BLOCK NMIX  # Neutralino Mixing Matrix
  1  1    -3.16646907E-05   # N_11
  1  2     9.99559817E-01   # N_12
  1  3    -2.95577906E-02   # N_13
  1  4    -2.55116866E-03   # N_14
  2  1     9.87277733E-01   # N_21
  2  2     3.75593099E-03   # N_22
  2  3     1.16635251E-01   # N_23
  2  4     1.08003653E-01   # N_24
  3  1     6.22028899E-03   # N_31
  3  2    -1.90962337E-02   # N_32
  3  3    -7.06818126E-01   # N_33
  3  4     7.07110161E-01   # N_34
  4  1    -1.58883557E-01   # N_41
  4  2     2.23919470E-02   # N_42
  4  3     6.97087292E-01   # N_43
  4  4     6.98801777E-01   # N_44
#
BLOCK UMIX  # Chargino Mixing Matrix U
  1  1     9.99126965E-01   # U_11
  1  2    -4.17768731E-02   # U_12
  2  1     4.17768731E-02   # U_21
  2  2     9.99126965E-01   # U_22
#
BLOCK VMIX  # Chargino Mixing Matrix V
  1  1    -9.99993513E-01   # V_11
  1  2    -3.60201264E-03   # V_12
  2  1    -3.60201264E-03   # V_21
  2  2     9.99993513E-01   # V_22
#
BLOCK STOPMIX  # Stop Mixing Matrix
  1  1     8.25430875E-01   # cos(theta_t)
  1  2     5.64503207E-01   # sin(theta_t)
  2  1    -5.64503207E-01   # -sin(theta_t)
  2  2     8.25430875E-01   # cos(theta_t)
#
BLOCK SBOTMIX  # Sbottom Mixing Matrix
  1  1     2.84366666E-02   # cos(theta_b)
  1  2     9.99595596E-01   # sin(theta_b)
  2  1    -9.99595596E-01   # -sin(theta_b)
  2  2     2.84366666E-02   # cos(theta_b)
#
BLOCK STAUMIX  # Stau Mixing Matrix
  1  1     1.37346111E-01   # cos(theta_tau)
  1  2     9.90523117E-01   # sin(theta_tau)
  2  1    -9.90523117E-01   # -sin(theta_tau)
  2  2     1.37346111E-01   # cos(theta_tau)
#
BLOCK ALPHA  # Higgs mixing
          -2.02653927E-02   # Mixing angle in the neutral Higgs boson sector
#
BLOCK HMIX Q=  2.85131600E+03  # DRbar Higgs Parameters
         1     2.67624548E+03   # mu(Q)MSSM           
         2     4.93545966E+01   # tan                 
         3     2.42825722E+02   # higgs               
         4     6.84228104E+06   # mA^2(Q)MSSM         
#
BLOCK GAUGE Q=  2.85131600E+03  # The gauge couplings
     1     3.64437288E-01   # gprime(Q) DRbar
     2     6.39216825E-01   # g(Q) DRbar
     3     1.00898543E+00   # g3(Q) DRbar
#
BLOCK AU Q=  2.85131600E+03  # The trilinear couplings
  1  1     0.00000000E+00   # A_u(Q) DRbar
  2  2     0.00000000E+00   # A_c(Q) DRbar
  3  3    -4.06039998E+03   # A_t(Q) DRbar
#
BLOCK AD Q=  2.85131600E+03  # The trilinear couplings
  1  1     0.00000000E+00   # A_d(Q) DRbar
  2  2     0.00000000E+00   # A_s(Q) DRbar
  3  3     2.36275001E+03   # A_b(Q) DRbar
#
BLOCK AE Q=  2.85131600E+03  # The trilinear couplings
  1  1     0.00000000E+00   # A_e(Q) DRbar
  2  2     0.00000000E+00   # A_mu(Q) DRbar
  3  3     3.79492000E+03   # A_tau(Q) DRbar
#
BLOCK Yu Q=  2.85131600E+03  # The Yukawa couplings
  1  1     0.00000000E+00   # y_u(Q) DRbar
  2  2     0.00000000E+00   # y_c(Q) DRbar
  3  3     8.12624121E-01   # y_t(Q) DRbar
#
BLOCK Yd Q=  2.85131600E+03  # The Yukawa couplings
  1  1     0.00000000E+00   # y_d(Q) DRbar
  2  2     0.00000000E+00   # y_s(Q) DRbar
  3  3     4.75883946E-01   # y_b(Q) DRbar
#
BLOCK Ye Q=  2.85131600E+03  # The Yukawa couplings
  1  1     0.00000000E+00   # y_e(Q) DRbar
  2  2     0.00000000E+00   # y_mu(Q) DRbar
  3  3     4.97888053E-01   # y_tau(Q) DRbar
#
BLOCK MSOFT Q=  2.85131600E+03  # The soft SUSY breaking masses at the scale Q
         1    -2.48399000E+03   # M_1(Q)              
         2    -2.80170000E+02   # M_2(Q)              
         3     3.61822000E+03   # M_3(Q)              
        21    -9.32386496E+05   # mH1^2(Q)            
        22    -7.01129512E+06   # mH2^2(Q)            
        31     3.44255000E+03   # meL(Q)              
        32     3.44255000E+03   # mmuL(Q)             
        33     3.36140000E+03   # mtauL(Q)            
        34     2.05843000E+03   # meR(Q)              
        35     2.05843000E+03   # mmuR(Q)             
        36     3.11623000E+03   # mtauR(Q)            
        41     2.31920998E+03   # mqL1(Q)             
        42     2.31920998E+03   # mqL2(Q)             
        43     2.80044997E+03   # mqL3(Q)             
        44     2.60842999E+03   # muR(Q)              
        45     2.60842999E+03   # mcR(Q)              
        46     2.90409996E+03   # mtR(Q)              
        47     2.66790999E+03   # mdR(Q)              
        48     2.66790999E+03   # msR(Q)              
        49     4.12309913E+02   # mbR(Q)              
#
Block HiggsBoundsInputHiggsCouplingsFermions
# ScalarNormEffCoupSq PseudoSNormEffCoupSq NP   IP1 IP2 IP2
    1.00065429E+00    0.00000000E+00        3  25   5   5  # h0-b-b eff. coupling^2, normalised to SM
    2.43587555E+03    0.00000000E+00        3  35   5   5  # H0-b-b eff. coupling^2, normalised to SM
    0.00000000E+00    2.43587621E+03        3  36   5   5  # A0-b-b eff. coupling^2, normalised to SM
#
    9.99999731E-01    0.00000000E+00        3  25   6   6  # h0-t-t eff. coupling^2, normalised to SM
    4.10798499E-04    0.00000000E+00        3  35   6   6  # H0-t-t eff. coupling^2, normalised to SM
    0.00000000E+00    4.10529894E-04        3  36   6   6  # A0-t-t eff. coupling^2, normalised to SM
#
    1.00065429E+00    0.00000000E+00        3  25  15  15  # h0-tau-tau eff. coupling^2, normalised to SM
    2.43587555E+03    0.00000000E+00        3  35  15  15  # H0-tau-tau eff. coupling^2, normalised to SM
    0.00000000E+00    2.43587621E+03        3  36  15  15  # A0-tau-tau eff. coupling^2, normalised to SM
#
Block HiggsBoundsInputHiggsCouplingsBosons
    1.00000000E+00        3  25  24  24  # h0-W-W eff. coupling^2, normalised to SM
    4.39220538E-11        3  35  24  24  # H0-W-W eff. coupling^2, normalised to SM
    0.00000000E+00        3  36  24  24  # A0-W-W eff. coupling^2, normalised to SM
#
    1.00000000E+00        3  25  23  23  # h0-Z-Z eff. coupling^2, normalised to SM
    4.39220538E-11        3  35  23  23  # H0-Z-Z eff. coupling^2, normalised to SM
    0.00000000E+00        3  36  23  23  # A0-Z-Z eff. coupling^2, normalised to SM
#
    8.54901313E-01        3  25  21  21  # h0-g-g eff. coupling^2, normalised to SM
    7.36454019E-11        3  35  21  21  # H0-g-g eff. coupling^2, normalised to SM
    6.84941497E-11        3  36  21  21  # A0-g-g eff. coupling^2, normalised to SM
#
    0.00000000E+00        3  25  25  23  # h0-h0-Z eff. coupling^2, normalised to SM
    0.00000000E+00        3  35  25  23  # H0-h0-Z eff. coupling^2, normalised to SM
    4.39220538E-11        3  36  25  23  # A0-h0-Z eff. coupling^2, normalised to SM
    0.00000000E+00        3  35  35  23  # H0-H0-Z eff. coupling^2, normalised to SM
    1.00000000E+00        3  36  35  23  # A0-H0-Z eff. coupling^2, normalised to SM
    0.00000000E+00        3  36  36  23  # A0-A0-Z eff. coupling^2, normalised to SM
#
    0.00000000E+00        4  25  21  21  23  # h0-g-g-Z eff. coupling^2, normalised to SM
    0.00000000E+00        4  35  21  21  23  # H0-g-g-Z eff. coupling^2, normalised to SM
    0.00000000E+00        4  36  21  21  23  # A0-g-g-Z eff. coupling^2, normalised to SM
#
#
#
#                             =================
#                             |The decay table|
#                             =================
#
# - The QCD corrections to the decays gluino -> squark  + quark
#                                     squark -> gaugino + quark_prime
#                                     squark -> squark_prime + Higgs
#                                     squark -> gluino  + quark
#   are included.
#
# - The multi-body decays for the inos, stops and sbottoms are included.
#
# - The loop induced decays for the gluino, neutralinos and stops
#   are included.
#
# - The SUSY decays of the top quark are included.
#
#
#         PDG            Width
DECAY         6     1.43995065E+00   # top decays
#          BR         NDA      ID1       ID2
     1.00000000E+00    2           5        24   # BR(t ->  b    W+)
#
#         PDG            Width
DECAY   1000021     2.25691153E+02   # gluino decays
#          BR         NDA      ID1       ID2
     4.65202611E-02    2     1000001        -1   # BR(~g -> ~d_L  db)
     4.65202611E-02    2    -1000001         1   # BR(~g -> ~d_L* d )
     2.65106632E-02    2     2000001        -1   # BR(~g -> ~d_R  db)
     2.65106632E-02    2    -2000001         1   # BR(~g -> ~d_R* d )
     4.65955610E-02    2     1000002        -2   # BR(~g -> ~u_L  ub)
     4.65955610E-02    2    -1000002         2   # BR(~g -> ~u_L* u )
     2.97279488E-02    2     2000002        -2   # BR(~g -> ~u_R  ub)
     2.97279488E-02    2    -2000002         2   # BR(~g -> ~u_R* u )
     4.65202611E-02    2     1000003        -3   # BR(~g -> ~s_L  sb)
     4.65202611E-02    2    -1000003         3   # BR(~g -> ~s_L* s )
     2.65106632E-02    2     2000003        -3   # BR(~g -> ~s_R  sb)
     2.65106632E-02    2    -2000003         3   # BR(~g -> ~s_R* s )
     4.65955326E-02    2     1000004        -4   # BR(~g -> ~c_L  cb)
     4.65955326E-02    2    -1000004         4   # BR(~g -> ~c_L* c )
     2.97279134E-02    2     2000004        -4   # BR(~g -> ~c_R  cb)
     2.97279134E-02    2    -2000004         4   # BR(~g -> ~c_R* c )
     1.42784734E-01    2     1000005        -5   # BR(~g -> ~b_1  bb)
     1.42784734E-01    2    -1000005         5   # BR(~g -> ~b_1* b )
     2.11772662E-02    2     2000005        -5   # BR(~g -> ~b_2  bb)
     2.11772662E-02    2    -2000005         5   # BR(~g -> ~b_2* b )
     1.92915999E-02    2     1000006        -6   # BR(~g -> ~t_1  tb)
     1.92915999E-02    2    -1000006         6   # BR(~g -> ~t_1* t )
     1.80375951E-02    2     2000006        -6   # BR(~g -> ~t_2  tb)
     1.80375951E-02    2    -2000006         6   # BR(~g -> ~t_2* t )
#
#         PDG            Width
DECAY   1000006     2.94799698E+01   # stop1 decays
#          BR         NDA      ID1       ID2
     2.54514868E-01    2     1000022         6   # BR(~t_1 -> ~chi_10 t )
     1.49310439E-03    2     1000023         6   # BR(~t_1 -> ~chi_20 t )
     5.14003595E-01    2     1000024         5   # BR(~t_1 -> ~chi_1+ b )
     6.47156178E-03    2     1000037         5   # BR(~t_1 -> ~chi_2+ b )
     2.23516871E-01    2     1000005        24   # BR(~t_1 -> ~b_1    W+)
#
#         PDG            Width
DECAY   2000006     2.54830337E+01   # stop2 decays
#          BR         NDA      ID1       ID2
     1.51484737E-01    2     1000022         6   # BR(~t_2 -> ~chi_10 t )
     2.72532718E-02    2     1000023         6   # BR(~t_2 -> ~chi_20 t )
     4.68711314E-02    2     1000025         6   # BR(~t_2 -> ~chi_30 t )
     1.64248164E-02    2     1000035         6   # BR(~t_2 -> ~chi_40 t )
     3.05583588E-01    2     1000024         5   # BR(~t_2 -> ~chi_1+ b )
     5.90286681E-02    2     1000037         5   # BR(~t_2 -> ~chi_2+ b )
     1.97750558E-02    2     1000006        25   # BR(~t_2 -> ~t_1    h )
     1.31304199E-01    2     1000006        23   # BR(~t_2 -> ~t_1    Z )
     1.53187345E-01    2     1000005        24   # BR(~t_2 -> ~b_1    W+)
     8.90871878E-02    2     2000005        24   # BR(~t_2 -> ~b_2    W+)
#
#         PDG            Width
DECAY   1000005     1.38221522E-02   # sbottom1 decays
#          BR         NDA      ID1       ID2
     3.97755386E-01    2     1000022         5   # BR(~b_1 -> ~chi_10 b )
     6.02244614E-01    2    -1000024         6   # BR(~b_1 -> ~chi_1- t )
#
#         PDG            Width
DECAY   2000005     4.53084363E+01   # sbottom2 decays
#          BR         NDA      ID1       ID2
     2.52384374E-01    2     1000022         5   # BR(~b_2 -> ~chi_10 b )
     8.96255181E-04    2     1000023         5   # BR(~b_2 -> ~chi_20 b )
     2.87674384E-03    2     1000025         5   # BR(~b_2 -> ~chi_30 b )
     2.69093525E-03    2     1000035         5   # BR(~b_2 -> ~chi_40 b )
     5.00057787E-01    2    -1000024         6   # BR(~b_2 -> ~chi_1- t )
     9.81930450E-03    2    -1000037         6   # BR(~b_2 -> ~chi_2- t )
     1.12495878E-01    2     1000005        25   # BR(~b_2 -> ~b_1    h )
     1.18778722E-01    2     1000005        23   # BR(~b_2 -> ~b_1    Z )
#
#         PDG            Width
DECAY   1000002     2.87204902E+01   # sup_L decays
#          BR         NDA      ID1       ID2
     3.33145189E-01    2     1000022         2   # BR(~u_L -> ~chi_10 u)
     6.66854811E-01    2     1000024         1   # BR(~u_L -> ~chi_1+ d)
#
#         PDG            Width
DECAY   2000002     2.23505364E-01   # sup_R decays
#           BR         NDA      ID1       ID2
     2.76986556E-08    2     1000022         2   # BR(~u_R -> ~chi_10 u)
     9.99211232E-01    2     1000023         2   # BR(~u_R -> ~chi_20 u)
     1.47811134E-06    2     1000025         2   # BR(~u_R -> ~chi_30 u)
     7.87262551E-04    2     1000035         2   # BR(~u_R -> ~chi_40 u)
#
#         PDG            Width
DECAY   1000001     2.87017905E+01   # sdown_L decays
#          BR         NDA      ID1       ID2
     3.33535839E-01    2     1000022         1   # BR(~d_L -> ~chi_10 d)
     6.66464161E-01    2    -1000024         2   # BR(~d_L -> ~chi_1- u)
#
#         PDG            Width
DECAY   2000001     1.57987464E-01   # sdown_R decays
#           BR         NDA      ID1       ID2
     1.00042266E-08    2     1000022         1   # BR(~d_R -> ~chi_10 d)
#           BR         NDA      ID1       ID2       ID3
     2.06225224E-04    3        1       -1        1000001   # BR(~d_R -> d  db  ~d_L)
     1.10698656E-04    3        1       1        -1000001   # BR(~d_R -> d  d  ~d_L*)
     2.09541942E-04    3        1       -2        1000002   # BR(~d_R -> d  ub  ~u_L)
     1.15895271E-04    3        1       2        -1000002   # BR(~d_R -> d  u  ~u_L*)
     2.41841974E-08    3        1       -2        2000002   # BR(~d_R -> d  ub  ~u_R)
     4.13431536E-08    3        1       2        -2000002   # BR(~d_R -> d  u  ~u_R*)
     2.09573591E-04    3        1       -3        1000003   # BR(~d_R -> d  sb  ~s_L)
     1.12002557E-04    3        1       3        -1000003   # BR(~d_R -> d  s  ~s_L*)
     2.09985015E-04    3        1       -4        1000004   # BR(~d_R -> d  cb  ~c_L)
     1.17161194E-04    3        1       4        -1000004   # BR(~d_R -> d  c  ~c_L*)
     2.46380308E-08    3        1       -4        2000004   # BR(~d_R -> d  cb  ~c_R)
     4.11184523E-08    3        1       4        -2000004   # BR(~d_R -> d  c  ~c_R*)
     2.49013429E-01    3        1       -5        1000005   # BR(~d_R -> d  bb  ~b_1)
     5.86780734E-01    3        1       5        -1000005   # BR(~d_R -> d  b  ~b_1*)
     3.41596724E-02    3        1       -11        2000011   # BR(~d_R -> d  e+  ~e_R-)
     3.46192025E-02    3        1       11        -2000011   # BR(~d_R -> d  e-  ~e_R+)
     3.41584064E-02    3        1       -13        2000013   # BR(~d_R -> d  mu+  ~mu_R-)
     3.41425823E-02    3        1       13        -2000013   # BR(~d_R -> d  mu-  ~mu_R+)
     3.48787167E-03    3        1       23        1000022   # BR(~d_R -> d  Z  ~chi_10)
     5.45783811E-03    3        1       25        1000022   # BR(~d_R -> d  h  ~chi_10)
     6.93029669E-10    3        1       35        1000022   # BR(~d_R -> d  H  ~chi_10)
     9.71342890E-12    3        1       36        1000022   # BR(~d_R -> d  A  ~chi_10)
     2.37594801E-05    3        1       23        1000023   # BR(~d_R -> d  Z  ~chi_20)
     1.58379655E-05    3        1       25        1000023   # BR(~d_R -> d  h  ~chi_20)
     7.96518893E-11    3        1       23        1000025   # BR(~d_R -> d  Z  ~chi_30)
     8.42978275E-03    3        1       -24        1000024   # BR(~d_R -> d  W-  ~chi_1+)
     8.41965537E-03    3        1       24        -1000024   # BR(~d_R -> d  W+  ~chi_1-)
     5.20534971E-10    3        1       -37        1000024   # BR(~d_R -> d  H-  ~chi_1+)
     6.24979967E-10    3        1       37        -1000024   # BR(~d_R -> d  H+  ~chi_1-)
     7.37147094E-10    3        1       -24        1000037   # BR(~d_R -> d  W-  ~chi_2+)
     6.12624556E-10    3        1       24        -1000037   # BR(~d_R -> d  W+  ~chi_2-)
#
#         PDG            Width
DECAY   1000004     2.87818292E+01   # scharm_L decays
#          BR         NDA      ID1       ID2
     3.33145196E-01    2     1000022         4   # BR(~c_L -> ~chi_10 c)
     6.66854804E-01    2     1000024         3   # BR(~c_L -> ~chi_1+ s)
#
#         PDG            Width
DECAY   2000004     2.75537527E-01   # scharm_R decays
#           BR         NDA      ID1       ID2
     2.26713953E-08    2     1000022         4   # BR(~c_R -> ~chi_10 c)
#           BR         NDA      ID1       ID2       ID3
     5.75493297E-05    3        4       -1        1000001   # BR(~c_R -> c  db  ~d_L)
     3.64160922E-05    3        4       1        -1000001   # BR(~c_R -> c  d  ~d_L*)
     6.21730193E-05    3        4       -2        1000002   # BR(~c_R -> c  ub  ~u_L)
     3.98530106E-05    3        4       2        -1000002   # BR(~c_R -> c  u  ~u_L*)
     5.79158859E-05    3        4       -3        1000003   # BR(~c_R -> c  sb  ~s_L)
     3.63652824E-05    3        4       3        -1000003   # BR(~c_R -> c  s  ~s_L*)
     6.19951851E-05    3        4       -4        1000004   # BR(~c_R -> c  cb  ~c_L)
     3.94864544E-05    3        4       4        -1000004   # BR(~c_R -> c  c  ~c_L*)
     2.80680461E-01    3        4       -5        1000005   # BR(~c_R -> c  bb  ~b_1)
     4.57796080E-01    3        4       5        -1000005   # BR(~c_R -> c  b  ~b_1*)
     5.48092311E-02    3        4       -11        2000011   # BR(~c_R -> c  e+  ~e_R-)
     5.51540117E-02    3        4       11        -2000011   # BR(~c_R -> c  e-  ~e_R+)
     5.54479825E-02    3        4       -13        2000013   # BR(~c_R -> c  mu+  ~mu_R-)
     5.51213482E-02    3        4       13        -2000013   # BR(~c_R -> c  mu-  ~mu_R+)
     5.48092311E-03    3        4       23        1000022   # BR(~c_R -> c  Z  ~chi_10)
     8.57995650E-03    3        4       25        1000022   # BR(~c_R -> c  h  ~chi_10)
     8.89751760E-05    3        4       23        1000023   # BR(~c_R -> c  Z  ~chi_20)
     9.29818898E-06    3        4       25        1000023   # BR(~c_R -> c  h  ~chi_20)
     1.32413905E-02    3        4       -24        1000024   # BR(~c_R -> c  W-  ~chi_1+)
     1.31985651E-02    3        4       24        -1000024   # BR(~c_R -> c  W+  ~chi_1-)
#
#         PDG            Width
DECAY   1000003     2.87639349E+01   # sstrange_L decays
#          BR         NDA      ID1       ID2
     3.33536132E-01    2     1000022         3   # BR(~s_L -> ~chi_10 s)
     6.66463868E-01    2    -1000024         4   # BR(~s_L -> ~chi_1- c)
#
#         PDG            Width
DECAY   2000003     1.57987402E-01   # sstrange_R decays
#           BR         NDA      ID1       ID2
     1.01092445E-08    2     1000022         3   # BR(~s_R -> ~chi_10 s)
#           BR         NDA      ID1       ID2       ID3
     2.05225224E-04    3        3       -1        1000001   # BR(~s_R -> s  db  ~d_L)
     1.13515380E-04    3        3       1        -1000001   # BR(~s_R -> s  d  ~d_L*)
     2.10200304E-04    3        3       -2        1000002   # BR(~s_R -> s  ub  ~u_L)
     1.16047227E-04    3        3       2        -1000002   # BR(~s_R -> s  u  ~u_L*)
     2.40974910E-08    3        3       -2        2000002   # BR(~s_R -> s  ub  ~u_R)
     4.08716132E-08    3        3       2        -2000002   # BR(~s_R -> s  u  ~u_R*)
     2.09738242E-04    3        3       -3        1000003   # BR(~s_R -> s  sb  ~s_L)
     1.10698700E-04    3        3       3        -1000003   # BR(~s_R -> s  s  ~s_L*)
     2.09985097E-04    3        3       -4        1000004   # BR(~s_R -> s  cb  ~c_L)
     1.15237036E-04    3        3       4        -1000004   # BR(~s_R -> s  c  ~c_L*)
     2.44354925E-08    3        3       -4        2000004   # BR(~s_R -> s  cb  ~c_R)
     4.17096548E-08    3        3       4        -2000004   # BR(~s_R -> s  c  ~c_R*)
     2.49013525E-01    3        3       -5        1000005   # BR(~s_R -> s  bb  ~b_1)
     5.86780963E-01    3        3       5        -1000005   # BR(~s_R -> s  b  ~b_1*)
     3.41596857E-02    3        3       -11        2000011   # BR(~s_R -> s  e+  ~e_R-)
     3.46192160E-02    3        3       11        -2000011   # BR(~s_R -> s  e-  ~e_R+)
     3.41584197E-02    3        3       -13        2000013   # BR(~s_R -> s  mu+  ~mu_R-)
     3.41425958E-02    3        3       13        -2000013   # BR(~s_R -> s  mu-  ~mu_R+)
     3.48787304E-03    3        3       23        1000022   # BR(~s_R -> s  Z  ~chi_10)
     5.45784022E-03    3        3       25        1000022   # BR(~s_R -> s  h  ~chi_10)
     6.95941565E-10    3        3       35        1000022   # BR(~s_R -> s  H  ~chi_10)
     9.72988971E-12    3        3       36        1000022   # BR(~s_R -> s  A  ~chi_10)
     2.37620213E-05    3        3       23        1000023   # BR(~s_R -> s  Z  ~chi_20)
     1.58835449E-05    3        3       25        1000023   # BR(~s_R -> s  h  ~chi_20)
     8.00127087E-11    3        3       23        1000025   # BR(~s_R -> s  Z  ~chi_30)
     8.42978605E-03    3        3       -24        1000024   # BR(~s_R -> s  W-  ~chi_1+)
     8.41965866E-03    3        3       24        -1000024   # BR(~s_R -> s  W+  ~chi_1-)
     5.21674506E-10    3        3       -37        1000024   # BR(~s_R -> s  H-  ~chi_1+)
     6.22904097E-10    3        3       37        -1000024   # BR(~s_R -> s  H+  ~chi_1-)
     7.35438385E-10    3        3       -24        1000037   # BR(~s_R -> s  W-  ~chi_2+)
     6.15169302E-10    3        3       24        -1000037   # BR(~s_R -> s  W+  ~chi_2-)
#
#         PDG            Width
DECAY   1000011     4.24732696E+01   # selectron_L decays
#          BR         NDA      ID1       ID2
     3.24744488E-01    2     1000022        11   # BR(~e_L -> ~chi_10 e-)
     2.58767131E-02    2     1000023        11   # BR(~e_L -> ~chi_20 e-)
     1.27742386E-05    2     1000025        11   # BR(~e_L -> ~chi_30 e-)
     2.43069453E-04    2     1000035        11   # BR(~e_L -> ~chi_40 e-)
     6.48939200E-01    2    -1000024        12   # BR(~e_L -> ~chi_1- nu_e)
     1.83755404E-04    2    -1000037        12   # BR(~e_L -> ~chi_2- nu_e)
#
#         PDG            Width
DECAY   2000011     6.16872832E-04   # selectron_R decays
#           BR         NDA      ID1       ID2
     1.70575406E-05    2     1000022        11   # BR(~e_R -> ~chi_10 e-)
#           BR         NDA      ID1       ID2       ID3
     2.60864139E-01    3        11       -5        1000005   # BR(~e_R- -> e-  bb  ~b_1)
     7.36067429E-01    3        11       5        -1000005   # BR(~e_R- -> e-  b  ~b_1*)
     3.82364059E-04    3        11       23        1000022   # BR(~e_R- -> e-  Z  ~chi_10)
     7.63933789E-04    3        11       25        1000022   # BR(~e_R- -> e-  h  ~chi_10)
     1.28917981E-03    3        11       -24        1000024   # BR(~e_R- -> e-  W-  ~chi_1+)
     6.15896794E-04    3        11       24        -1000024   # BR(~e_R- -> e-  W+  ~chi_1-)
#
#         PDG            Width
DECAY   1000013     4.24732695E+01   # smuon_L decays
#          BR         NDA      ID1       ID2
     3.24744488E-01    2     1000022        13   # BR(~mu_L -> ~chi_10 mu-)
     2.58767129E-02    2     1000023        13   # BR(~mu_L -> ~chi_20 mu-)
     1.27742384E-05    2     1000025        13   # BR(~mu_L -> ~chi_30 mu-)
     2.43069451E-04    2     1000035        13   # BR(~mu_L -> ~chi_40 mu-)
     6.48939200E-01    2    -1000024        14   # BR(~mu_L -> ~chi_1- nu_mu)
     1.83755404E-04    2    -1000037        14   # BR(~mu_L -> ~chi_2- nu_mu)
#
#         PDG            Width
DECAY   2000013     6.16892772E-04   # smuon_R decays
#           BR         NDA      ID1       ID2
     1.70569891E-05    2     1000022        13   # BR(~mu_R -> ~chi_10 mu-)
#           BR         NDA      ID1       ID2       ID3
     2.60888127E-01    3        13       -5        1000005   # BR(~mu_R- -> mu-  bb  ~b_1)
     7.36043637E-01    3        13       5        -1000005   # BR(~mu_R- -> mu-  b  ~b_1*)
     3.82351700E-04    3        13       23        1000022   # BR(~mu_R- -> mu-  Z  ~chi_10)
     7.63811834E-04    3        13       25        1000022   # BR(~mu_R- -> mu-  h  ~chi_10)
     1.28913814E-03    3        13       -24        1000024   # BR(~mu_R- -> mu-  W-  ~chi_1+)
     6.15876887E-04    3        13       24        -1000024   # BR(~mu_R- -> mu-  W+  ~chi_1-)
#
#         PDG            Width
DECAY   1000015     5.40701173E+00   # stau_1 decays
#          BR         NDA      ID1       ID2
     6.59468206E-02    2     1000022        15   # BR(~tau_1 -> ~chi_10  tau-)
     4.27375346E-01    2     1000023        15   # BR(~tau_1 -> ~chi_20  tau-)
     9.58915431E-02    2     1000025        15   # BR(~tau_1 -> ~chi_30  tau-)
     9.35118672E-02    2     1000035        15   # BR(~tau_1 -> ~chi_40  tau-)
     1.31679527E-01    2    -1000024        16   # BR(~tau_1 -> ~chi_1-  nu_tau)
     1.85594896E-01    2    -1000037        16   # BR(~tau_1 -> ~chi_2-  nu_tau)
#
#         PDG            Width
DECAY   2000015     4.37357094E+01   # stau_2 decays
#          BR         NDA      ID1       ID2
     2.99165320E-01    2     1000022        15   # BR(~tau_2 -> ~chi_10  tau-)
     2.30301824E-02    2     1000023        15   # BR(~tau_2 -> ~chi_20  tau-)
     2.60932953E-02    2     1000025        15   # BR(~tau_2 -> ~chi_30  tau-)
     2.60572779E-02    2     1000035        15   # BR(~tau_2 -> ~chi_40  tau-)
     5.97181929E-01    2    -1000024        16   # BR(~tau_2 -> ~chi_1-  nu_tau)
     1.86802031E-03    2    -1000037        16   # BR(~tau_2 -> ~chi_2-  nu_tau)
     1.32867084E-02    2     1000015        25   # BR(~tau_2 -> ~tau_1   h)
     1.33172672E-02    2     1000015        23   # BR(~tau_2 -> ~tau_1   Z)
#
#         PDG            Width
DECAY   1000012     4.24864824E+01   # snu_eL decays
#          BR         NDA      ID1       ID2
     3.24545510E-01    2     1000022        12   # BR(~nu_eL -> ~chi_10 nu_e)
     2.51407749E-02    2     1000023        12   # BR(~nu_eL -> ~chi_20 nu_e)
     2.70082553E-05    2     1000025        12   # BR(~nu_eL -> ~chi_30 nu_e)
     6.65250658E-04    2     1000035        12   # BR(~nu_eL -> ~chi_40 nu_e)
     6.49620094E-01    2     1000024        11   # BR(~nu_eL -> ~chi_1+ e-)
     1.36212510E-06    2     1000037        11   # BR(~nu_eL -> ~chi_2+ e-)
#
#         PDG            Width
DECAY   1000014     4.24864823E+01   # snu_muL decays
#          BR         NDA      ID1       ID2
     3.24545510E-01    2     1000022        14   # BR(~nu_muL -> ~chi_10 nu_mu)
     2.51407749E-02    2     1000023        14   # BR(~nu_muL -> ~chi_20 nu_mu)
     2.70082553E-05    2     1000025        14   # BR(~nu_muL -> ~chi_30 nu_mu)
     6.65250659E-04    2     1000035        14   # BR(~nu_muL -> ~chi_40 nu_mu)
     6.49620094E-01    2     1000024        13   # BR(~nu_muL -> ~chi_1+ mu-)
     1.36212509E-06    2     1000037        13   # BR(~nu_muL -> ~chi_2+ mu-)
#
#         PDG            Width
DECAY   1000016     4.46040772E+01   # snu_tauL decays
#          BR         NDA      ID1       ID2
     3.00855588E-01    2     1000022        16   # BR(~nu_tauL -> ~chi_10 nu_tau)
     2.08115991E-02    2     1000023        16   # BR(~nu_tauL -> ~chi_20 nu_tau)
     2.11535459E-05    2     1000025        16   # BR(~nu_tauL -> ~chi_30 nu_tau)
     5.20220916E-04    2     1000035        16   # BR(~nu_tauL -> ~chi_40 nu_tau)
     6.02842159E-01    2     1000024        15   # BR(~nu_tauL -> ~chi_1+ tau-)
     4.97727760E-02    2     1000037        15   # BR(~nu_tauL -> ~chi_2+ tau-)
     2.51765037E-02    2    -1000015       -24   # BR(~nu_tauL -> ~tau_1+ W-)
#
#         PDG            Width
DECAY   1000024     3.42151020E-15   # chargino1+ decays
#           BR         NDA      ID1       ID2       ID3
     1.96485000E-02    3     1000022       -11        12   # BR(~chi_1+ -> ~chi_10 e+   nu_e)
     2.11424280E-03    3     1000022       -13        14   # BR(~chi_1+ -> ~chi_10 mu+  nu_mu)
     9.78237260E-01    2     1000022       211             # BR(~chi_1+ -> ~chi_10 pi+)
#
#         PDG            Width
DECAY   1000037     3.23642193E+01   # chargino2+ decays
#          BR         NDA      ID1       ID2
     3.92793222E-07    2     1000002        -1   # BR(~chi_2+ -> ~u_L     db)
     5.23374014E-05    2    -1000001         2   # BR(~chi_2+ -> ~d_L*    u )
     3.92792737E-07    2     1000004        -3   # BR(~chi_2+ -> ~c_L     sb)
     5.23363550E-05    2    -1000003         4   # BR(~chi_2+ -> ~s_L*     c )
     5.01429850E-01    2    -1000005         6   # BR(~chi_2+ -> ~b_1*    t )
     1.61403373E-01    2     1000024        23   # BR(~chi_2+ -> ~chi_1+  Z )
     1.56905649E-01    2     1000022        24   # BR(~chi_2+ -> ~chi_10  W+)
     1.49060430E-02    2     1000023        24   # BR(~chi_2+ -> ~chi_20  W+)
     1.65249625E-01    2     1000024        25   # BR(~chi_2+ -> ~chi_1+  h )
#
#         PDG            Width
DECAY   1000022     0.00000000E+00   # neutralino1 decays
#
#         PDG            Width
DECAY   1000023     6.54828909E+00   # neutralino2 decays
#          BR         NDA      ID1       ID2
     7.02587394E-03    2     1000022        23   # BR(~chi_20 -> ~chi_10   Z )
     1.65475373E-02    2     1000024       -24   # BR(~chi_20 -> ~chi_1+   W-)
     1.65475373E-02    2    -1000024        24   # BR(~chi_20 -> ~chi_1-   W+)
     1.07080247E-02    2     1000022        25   # BR(~chi_20 -> ~chi_10   h )
     2.01923916E-05    2     1000002        -2   # BR(~chi_20 -> ~u_L      ub)
     2.01923916E-05    2    -1000002         2   # BR(~chi_20 -> ~u_L*     u )
     1.62523550E-05    2     1000001        -1   # BR(~chi_20 -> ~d_L      db)
     1.62523550E-05    2    -1000001         1   # BR(~chi_20 -> ~d_L*     d )
     2.01221088E-05    2     1000004        -4   # BR(~chi_20 -> ~c_L      cb)
     2.01221088E-05    2    -1000004         4   # BR(~chi_20 -> ~c_L*     c )
     1.62523550E-05    2     1000003        -3   # BR(~chi_20 -> ~s _L      sb)
     1.62523550E-05    2    -1000003         3   # BR(~chi_20 -> ~s _L*     s )
     3.16594448E-01    2     1000005        -5   # BR(~chi_20 -> ~b_1      bb)
     3.16594448E-01    2    -1000005         5   # BR(~chi_20 -> ~b_1*     b )
     7.89591231E-02    2     2000011       -11   # BR(~chi_20 -> ~e_R-     e+)
     7.89591231E-02    2    -2000011        11   # BR(~chi_20 -> ~e_R+     e-)
     7.89591231E-02    2     2000013       -13   # BR(~chi_20 -> ~mu_R-    mu+)
     7.89591231E-02    2    -2000013        13   # BR(~chi_20 -> ~mu_R+    mu-)
#
#         PDG            Width
DECAY   1000025     3.18791433E+01   # neutralino3 decays
#          BR         NDA      ID1       ID2
     9.59395162E-02    2     1000022        23   # BR(~chi_30 -> ~chi_10   Z )
     1.41361723E-02    2     1000023        23   # BR(~chi_30 -> ~chi_20   Z )
     1.59317849E-01    2     1000024       -24   # BR(~chi_30 -> ~chi_1+   W-)
     1.59317849E-01    2    -1000024        24   # BR(~chi_30 -> ~chi_1-   W+)
     6.84035117E-02    2     1000022        25   # BR(~chi_30 -> ~chi_10   h )
     1.57224388E-05    2     1000023        25   # BR(~chi_30 -> ~chi_20   h )
     4.87307941E-06    2     1000002        -2   # BR(~chi_30 -> ~u_L      ub)
     4.87307941E-06    2    -1000002         2   # BR(~chi_30 -> ~u_L*     u )
     6.18467127E-06    2     1000001        -1   # BR(~chi_30 -> ~d_L      db)
     6.18467127E-06    2    -1000001         1   # BR(~chi_30 -> ~d_L*     d )
     4.87298167E-06    2     1000004        -4   # BR(~chi_30 -> ~c_L      cb)
     4.87298167E-06    2    -1000004         4   # BR(~chi_30 -> ~c_L*     c )
     6.18467127E-06    2     1000003        -3   # BR(~chi_30 -> ~s _L      sb)
     6.18467127E-06    2    -1000003         3   # BR(~chi_30 -> ~s _L*     s )
     2.51409860E-01    2     1000005        -5   # BR(~chi_30 -> ~b_1      bb)
     2.51409860E-01    2    -1000005         5   # BR(~chi_30 -> ~b_1*     b )
     1.35722290E-06    2     2000011       -11   # BR(~chi_30 -> ~e_R-     e+)
     1.35722290E-06    2    -2000011        11   # BR(~chi_30 -> ~e_R+     e-)
     1.35722290E-06    2     2000013       -13   # BR(~chi_30 -> ~mu_R-    mu+)
     1.35722290E-06    2    -2000013        13   # BR(~chi_30 -> ~mu_R+    mu-)
#
#         PDG            Width
DECAY   1000035     3.12592343E+01   # neutralino4 decays
#          BR         NDA      ID1       ID2
     6.77651599E-02    2     1000022        23   # BR(~chi_40 -> ~chi_10   Z )
     3.35278367E-05    2     1000023        23   # BR(~chi_40 -> ~chi_20   Z )
     1.58940809E-01    2     1000024       -24   # BR(~chi_40 -> ~chi_1+   W-)
     1.58940809E-01    2    -1000024        24   # BR(~chi_40 -> ~chi_1-   W+)
     9.91267029E-02    2     1000022        25   # BR(~chi_40 -> ~chi_10   h )
     1.15156163E-02    2     1000023        25   # BR(~chi_40 -> ~chi_20   h )
     9.76887719E-07    2     1000002        -2   # BR(~chi_40 -> ~u_L      ub)
     9.76887719E-07    2    -1000002         2   # BR(~chi_40 -> ~u_L*     u )
     4.39554407E-05    2     1000001        -1   # BR(~chi_40 -> ~d_L      db)
     4.39554407E-05    2    -1000001         1   # BR(~chi_40 -> ~d_L*     d )
     9.76868909E-07    2     1000004        -4   # BR(~chi_40 -> ~c_L      cb)
     9.76868909E-07    2    -1000004         4   # BR(~chi_40 -> ~c_L*     c )
     4.39554407E-05    2     1000003        -3   # BR(~chi_40 -> ~s _L      sb)
     4.39554407E-05    2    -1000003         3   # BR(~chi_40 -> ~s _L*     s )
     2.49920143E-01    2     1000005        -5   # BR(~chi_40 -> ~b_1      bb)
     2.49920143E-01    2    -1000005         5   # BR(~chi_40 -> ~b_1*     b )
     9.14340046E-04    2     2000011       -11   # BR(~chi_40 -> ~e_R-     e+)
     9.14340046E-04    2    -2000011        11   # BR(~chi_40 -> ~e_R+     e-)
     9.14340046E-04    2     2000013       -13   # BR(~chi_40 -> ~mu_R-    mu+)
     9.14340046E-04    2    -2000013        13   # BR(~chi_40 -> ~mu_R+    mu-)
#
#         PDG            Width
DECAY        25     6.47473689E-03   # h decays
#          BR         NDA      ID1       ID2
     7.00841772E-01    2           5        -5   # BR(h -> b       bb     )
     4.07643383E-02    2         -15        15   # BR(h -> tau+    tau-   )
     1.44284206E-04    2         -13        13   # BR(h -> mu+     mu-    )
     1.56880004E-04    2           3        -3   # BR(h -> s       sb     )
     1.36028538E-02    2           4        -4   # BR(h -> c       cb     )
     5.11604306E-02    2          21        21   # BR(h -> g       g      )
     1.58055759E-03    2          22        22   # BR(h -> gam     gam    )
     1.18963198E-03    2          22        23   # BR(h -> Z       gam    )
     1.68788514E-01    2          24       -24   # BR(h -> W+      W-     )
     2.17707381E-02    2          23        23   # BR(h -> Z       Z      )
#
#         PDG            Width
DECAY        35     7.26995886E+01   # H decays
#          BR         NDA      ID1       ID2
     8.23432995E-01    2           5        -5   # BR(H -> b       bb     )
     1.74036283E-01    2         -15        15   # BR(H -> tau+    tau-   )
     6.15566216E-04    2         -13        13   # BR(H -> mu+     mu-    )
     1.81354398E-04    2           3        -3   # BR(H -> s       sb     )
     5.83094978E-09    2           4        -4   # BR(H -> c       cb     )
     5.69735724E-04    2           6        -6   # BR(H -> t       tb     )
     3.92879160E-05    2          21        21   # BR(H -> g       g      )
     1.51409294E-08    2          22        22   # BR(H -> gam     gam    )
     1.33293394E-08    2          23        22   # BR(H -> Z       gam    )
     2.83584671E-09    2          24       -24   # BR(H -> W+      W-     )
     1.41385887E-09    2          23        23   # BR(H -> Z       Z      )
     5.63988517E-07    2          25        25   # BR(H -> h       h      )
     4.54448257E-04    2     1000024  -1000024   # BR(H -> ~chi_1+ ~chi_1-)
     2.27322833E-04    2     1000022   1000022   # BR(H -> ~chi_10 ~chi_10)
     4.42403484E-04    2     1000005  -1000005   # BR(H -> ~b_1    ~b_1*  )
#
#         PDG            Width
DECAY        36     7.26733326E+01   # A decays
#          BR         NDA      ID1       ID2
     8.23764291E-01    2           5        -5   # BR(A -> b       bb     )
     1.74101937E-01    2         -15        15   # BR(A -> tau+    tau-   )
     6.15797141E-04    2         -13        13   # BR(A -> mu+     mu-    )
     1.81427355E-04    2           3        -3   # BR(A -> s       sb     )
     5.88312757E-09    2           4        -4   # BR(A -> c       cb     )
     5.77303335E-04    2           6        -6   # BR(A -> t       tb     )
     3.79052334E-05    2          21        21   # BR(A -> g       g      )
     8.01095415E-09    2          22        22   # BR(A -> gam     gam    )
     2.37420493E-08    2          23        22   # BR(A -> Z       gam    )
     2.86830483E-09    2          23        25   # BR(A -> Z       h      )
     4.80809424E-04    2     1000024  -1000024   # BR(A -> ~chi_1+ ~chi_1-)
     2.40489051E-04    2     1000022   1000022   # BR(A -> ~chi_10 ~chi_10)
#
#         PDG            Width
DECAY        37     3.69436554E+01   # H+ decays
#          BR         NDA      ID1       ID2
     1.10115557E-03    2           4        -5   # BR(H+ -> c       bb     )
     3.42654557E-01    2         -15        16   # BR(H+ -> tau+    nu_tau )
     1.21196639E-03    2         -13        14   # BR(H+ -> mu+     nu_mu  )
     1.10115365E-05    2           2        -5   # BR(H+ -> u       bb     )
     1.78448091E-05    2           2        -3   # BR(H+ -> u       sb     )
     3.51251066E-04    2           4        -3   # BR(H+ -> c       sb     )
     6.54652208E-01    2           6        -5   # BR(H+ -> t       bb     )
     5.65622181E-09    2          24        25   # BR(H+ -> W+      h      )
     9.88722577E-14    2          24        36   # BR(H+ -> W+      A      )
     1.20429230E-11    2     1000024   1000022   # BR(H+ -> ~chi_1+ ~chi_10)
