#
#                          ======================
#                          |    SPICE OUTPUT    |
#                          ======================
#
#          ------------------------------------------------------
#          |         Output in LesHouches Accord Format         |
#          ------------------------------------------------------
#
#          ------------------------------------------------------
#          |    Created by G. Engelhard, J. Feng, I. Galon,     |
#          |  D. Sanford, and F. Yu.  For problems with SPICE   |
#          |  send e-mail to                                    |
#          |          spice@hep.ps.uci.edu                      |
#          |                                                    |
#          |    If you use SPICE, please cite                   |
#          |      arXiv:0904.1415v1 [hep-ph]                    |
#          |                                                    |
#          |    If your model involves flavor-violating slepton |
#          |      3-body decays of sleptons, please cite        |
#          |      arXiv:0904.1416v1 [hep-ph]                    |
#          |                                                    |
#          |    We reprint the original SOFTSUSY and SUSYHIT    |
#          |  headers below.                                    |
#          ------------------------------------------------------
#
#
#
#                          ======================
#                          |   SOFTSUSY HEADER  |
#                          ======================
#
# SOFTSUSY3.0.2
# B.C. Allanach, Comput. Phys. Commun. 143 (2002) 305-331, hep-ph/0104145
#
#
#
#                          ======================
#                          |   SUSYHIT HEADER   |
#                          ======================
#
#
#          ------------------------------------------------------
#          |     This is the output of the SUSY-HIT package     |
#          |  created by A.Djouadi, M.Muehlleitner and M.Spira. |
#          |  In case of problems with SUSY-HIT email to        |
#          |           margarete.muehlleitner@cern.ch           |
#          |           michael.spira@psi.ch                     |
#          |           abdelhak.djouadi@cern.ch                 |
#          ------------------------------------------------------
#
#          ------------------------------------------------------
#          |  SUSY Les Houches Accord - MSSM Spectrum + Decays  |
#          |              based on the decay programs           |
#          |                                                    |
#          |                     SDECAY 1.3                     |
#          |                                                    |
#          |  Authors: M.Muhlleitner, A.Djouadi and Y.Mambrini  |
#          |  Ref.:    Comput.Phys.Commun.168(2005)46           |
#          |           [hep-ph/0311167]                         |
#          |                                                    |
#          |                     HDECAY 3.302                   |
#          |                                                    |
#          |  By: A.Djouadi,J.Kalinowski,M.Muhlleitner,M.Spira  |
#          |  Ref.:    Comput.Phys.Commun.108(1998)56           |
#          |           [hep-ph/9704448]                         |
#          |                                                    |
#          |                                                    |
#          |  If not stated otherwise all DRbar couplings and   |
#          |  soft SUSY breaking masses are given at the scale  |
#          |  Q=  0.97084150E+03                                |
#          |                                                    |
#          ------------------------------------------------------
#
#
BLOCK DCINFO  # Decay Program information
     1   SDECAY/HDECAY # decay calculator
     2   1.3b  /3.4    # version number
BLOCK SPINFO  # Spectrum calculator information
     1    SOFTSUSY    # spectrum calculator                
     2    3.3.5       # version number                     
BLOCK MODSEL  # Model selection
     1     2   #  gmsb                                             
BLOCK SMINPUTS  # Standard Model inputs
         1     1.27916000E+02   # alpha_em^-1(M_Z)^MSbar
         2     1.16637000E-05   # G_F [GeV^-2]
         3     1.18400000E-01   # alpha_S(M_Z)^MSbar
         4     9.11876000E+01   # M_Z pole mass
         5     4.18000000E+00   # mb(mb)^MSbar
         6     1.73500000E+02   # mt pole mass
         7     1.77699000E+00   # mtau pole mass
BLOCK MINPAR  # Input parameters - minimal models
         1     1.40000000E+05   # lambda              
         2     2.50000000E+05   # M_mess              
         3     5.00000000E+00   # tanb                
         4     1.00000000E+00   # sign(mu)            
         5     3.00000000E+00   # N5                  
         6     5.00000000E+03   # cgrav               
BLOCK MASS  # Mass Spectrum
# PDG code           mass       particle
        24     8.03953416e+01
         5     4.93386190e+00   # b-quark pole mass calculated from mb(mb)_Msbar
         6     1.73500000e+02
        25     1.14706551e+02
        35     1.33486877e+03
        36     1.33419965e+03
        37     1.33683651e+03
   1000001     2.86055676e+03
   1000002     2.85969265e+03
   1000003     2.86055535e+03
   1000004     2.85969135e+03
   1000005     2.73048896e+03
   1000006     2.53592894e+03
   2000001     2.73192605e+03
   2000002     2.74188879e+03
   2000003     2.73192550e+03
   2000004     2.74188627e+03
   2000005     2.75697509e+03
   2000006     2.75146589e+03
   1000015     4.39474094e+02
   1000016     8.88427111e+02
   2000013     4.40276697e+02
   1000014     8.88553180e+02
   2000011     4.40278831e+02
   1000012     8.88553602e+02
   1000011     8.88446889e+02
   2000012     0.00000000e+00
   1000013     8.91943758e+02
   2000014     0.00000000e+00
   2000015     8.92095983e+02
   2000016     0.00000000e+00
   1000021     3.00418078e+03
   1000022     6.05534459e+02
   1000023     9.48254532e+02
   1000025    -9.65077533e+02
   1000035     1.18183477e+03
   1000024     9.45973939e+02
   1000037     1.18148114e+03
   1000039     4.14750000e-05
#
BLOCK NMIX  # Neutralino Mixing Matrix
  1  1     9.94268370E-01   # N_11
  1  2    -1.10530400E-02   # N_12
  1  3     8.54303000E-02   # N_13
  1  4    -6.33237905E-02   # N_14
  2  1    -1.03988528E-01   # N_21
  2  2    -2.88146346E-01   # N_22
  2  3     6.76766111E-01   # N_23
  2  4    -6.69436853E-01   # N_24
  3  1    -1.53872282E-02   # N_31
  3  2     2.02887584E-02   # N_32
  3  3     7.06182725E-01   # N_33
  3  4     7.07571593E-01   # N_34
  4  1    -1.94942965E-02   # N_41
  4  2     9.57307620E-01   # N_42
  4  3     1.89724152E-01   # N_43
  4  4    -2.17225319E-01   # N_44
BLOCK UMIX  # Chargino Mixing Matrix U
  1  1    -2.64570581E-01   # U_11
  1  2     9.64366325E-01   # U_12
  2  1    -9.64366325E-01   # U_21
  2  2    -2.64570581E-01   # U_22
BLOCK VMIX  # Chargino Mixing Matrix V
  1  1    -3.02744299E-01   # V_11
  1  2     9.53071818E-01   # V_12
  2  1    -9.53071818E-01   # V_21
  2  2    -3.02744299E-01   # V_22
BLOCK STOPMIX  # Stop Mixing Matrix
  1  1     1.29381974E-01   # cos(theta_t)
  1  2     9.91594829E-01   # sin(theta_t)
  2  1    -9.91594829E-01   # -sin(theta_t)
  2  2     1.29381974E-01   # cos(theta_t)
BLOCK SBOTMIX  # Sbottom Mixing Matrix
  1  1     7.84374395E-02   # cos(theta_b)
  1  2     9.96919038E-01   # sin(theta_b)
  2  1    -9.96919038E-01   # -sin(theta_b)
  2  2     7.84374395E-02   # cos(theta_b)
BLOCK STAUMIX  # Stau Mixing Matrix
  1  1     1.39169493E-02   # cos(theta_tau)
  1  2     9.99903155E-01   # sin(theta_tau)
  2  1    -9.99903155E-01   # -sin(theta_tau)
  2  2     1.39169493E-02   # cos(theta_tau)
BLOCK ALPHA  # Higgs mixing
          -2.09475464E-01   # Mixing angle in the neutral Higgs boson sector
BLOCK HMIX Q=  2.57794553E+03  # DRbar Higgs Parameters
         1     9.52924928E+02   # mu(Q)MSSM           
         2     4.76111549E+00   # tan                 
         3     2.42810660E+02   # higgs               
         4     1.83341238E+06   # mA^2(Q)MSSM         
BLOCK GAUGE Q=  2.57794553E+03  # The gauge couplings
     1     3.65112014E-01   # gprime(Q) DRbar
     2     6.38825489E-01   # g(Q) DRbar
     3     1.01398383E+00   # g3(Q) DRbar
BLOCK Yu Q=  2.57794553E+03  # The Yukawa couplings
  1  1     7.14417212E-06   # y_u(Q) DRbar
  2  2     3.25242145E-03   # y_c(Q) DRbar
  3  3     8.45499981E-01   # y_t(Q) DRbar
BLOCK Yd Q=  2.57794553E+03  # The Yukawa couplings
  1  1     6.77652830E-05   # y_d(Q) DRbar
  2  2     1.48370364E-03   # y_s(Q) DRbar
  3  3     6.50318544E-02   # y_b(Q) DRbar
BLOCK Ye Q=  2.57794553E+03  # The Yukawa couplings
  1  1     1.39697014E-05   # y_e(Q) DRbar
  2  2     2.88849253E-03   # y_mu(Q) DRbar
  3  3     5.00033269E-02   # y_tau(Q) DRbar
BLOCK MSOFT Q=  2.57794553E+03  # The soft SUSY breaking masses at the scale Q
         1     6.22659538E+02   # M_1(Q)              
         2     1.14003671E+03   # M_2(Q)              
         3     2.88445576E+03   # M_3(Q)              
        21     7.53706993E+05   # mH1^2(Q)            
        22    -6.96045155E+05   # mH2^2(Q)            
#         PDG            Width
DECAY         6     1.44573496e+00
#          BR         NDA      ID1       ID2       ID3
     1.00000000e+00    2           5        24
#         PDG            Width
DECAY        25     3.94272503e+18
#          BR         NDA      ID1       ID2       ID3
     9.56118261e-01    2          22        22
     4.38817387e-02    2          22        23
#         PDG            Width
DECAY        35     6.59409945e+30
#          BR         NDA      ID1       ID2       ID3
     5.09232317e-10    2          22        22
     4.62341044e-10    2          23        22
     9.99999999e-01    2          25        25
#         PDG            Width
DECAY        36     3.10019650e+00
#          BR         NDA      ID1       ID2       ID3
     5.22150083e-06    2     1000015  -1000011
     1.03600753e-08    2     2000013  -1000013
     2.32678343e-13    2     2000011  -2000015
     5.22150083e-06    2     1000011  -1000015
     1.03600753e-08    2     1000013  -2000013
     2.32678343e-13    2     2000015  -2000011
     1.12772061e-01    2           5        -5
     2.02175693e-02    2         -15        15
     7.14773554e-05    2         -13        13
     9.12058714e-05    2           3        -3
     8.01142462e-06    2           4        -4
     8.59814366e-01    2           6        -6
     1.33324244e-03    2          21        21
     4.50857567e-06    2          22        22
     1.54805506e-06    2          23        22
     1.45464261e-03    2          23        25
     4.22090361e-03    2     1000022   1000022
#         PDG            Width
DECAY        37     3.02603920e+00
#          BR         NDA      ID1       ID2       ID3
     1.16874153e-05    2    -1000015   1000016
     3.92717858e-08    2    -2000013   1000014
     9.18457109e-13    2    -2000011   1000012
     1.90272446e-04    2           4        -5
     2.07539657e-02    2         -15        16
     7.33737347e-05    2         -13        14
     1.21765633e-06    2           2        -5
     4.45821289e-06    2           2        -3
     9.95551307e-05    2           4        -3
     9.77361274e-01    2           6        -5
     1.50415660e-03    2          24        25
#         PDG            Width
DECAY   1000001     2.29033751e+01
#          BR         NDA      ID1       ID2       ID3
     1.73991792e-02    2     1000022         1
     2.70260447e-02    2     1000023         1
     2.00545265e-04    2     1000025         1
     2.99477695e-01    2     1000035         1
     5.26099747e-02    2    -1000024         2
     6.03286561e-01    2    -1000037         2
#         PDG            Width
DECAY   1000002     2.00689792e+01
#          BR         NDA      ID1       ID2       ID3
     1.44667384e-02    2     1000022         2
     3.64161600e-02    2     1000023         2
     1.14438882e-04    2     1000025         2
     2.92991101e-01    2     1000035         2
     7.04893880e-02    2     1000024         1
     5.85522174e-01    2     1000037         1
#         PDG            Width
DECAY   1000003     2.29033751e+01
#          BR         NDA      ID1       ID2       ID3
     1.73991792e-02    2     1000022         3
     2.70260447e-02    2     1000023         3
     2.00545265e-04    2     1000025         3
     2.99477695e-01    2     1000035         3
     5.26099747e-02    2    -1000024         4
     6.03286561e-01    2    -1000037         4
#         PDG            Width
DECAY   1000004     2.00689792e+01
#          BR         NDA      ID1       ID2       ID3
     1.44667384e-02    2     1000022         4
     3.64161600e-02    2     1000023         4
     1.14438882e-04    2     1000025         4
     2.92991101e-01    2     1000035         4
     7.04893880e-02    2     1000024         3
     5.85522174e-01    2     1000037         3
#         PDG            Width
DECAY   1000005     2.07240997e+00
#          BR         NDA      ID1       ID2       ID3
     6.81691180e-01    2     1000022         5
     6.06731577e-02    2     1000023         5
     3.95654355e-02    2     1000025         5
     8.39262095e-03    2     1000035         5
     1.84587203e-01    2    -1000024         6
     2.50904027e-02    2    -1000037         6
#         PDG            Width
DECAY   1000006     6.38652040e+01
#          BR         NDA      ID1       ID2       ID3
     9.07688749e-02    2     1000022         6
     2.16181833e-01    2     1000023         6
     2.32052743e-01    2     1000025         6
     6.64903300e-03    2     1000035         6
     4.41751274e-01    2     1000024         5
     1.25962420e-02    2     1000037         5
#         PDG            Width
DECAY   2000001     1.50966422e+00
#          BR         NDA      ID1       ID2       ID3
     9.89977737e-01    2     1000022         1
     9.52192724e-03    2     1000023         1
     2.06789662e-04    2     1000025         1
     2.93545988e-04    2     1000035         1
#         PDG            Width
DECAY   2000002     5.79381289e+00
#          BR         NDA      ID1       ID2       ID3
     9.90098124e-01    2     1000022         2
     9.41120339e-03    2     1000023         2
     2.04227084e-04    2     1000025         2
     2.86445806e-04    2     1000035         2
#         PDG            Width
DECAY   2000003     1.50966422e+00
#          BR         NDA      ID1       ID2       ID3
     9.89977737e-01    2     1000022         3
     9.52192724e-03    2     1000023         3
     2.06789662e-04    2     1000025         3
     2.93545988e-04    2     1000035         3
#         PDG            Width
DECAY   2000004     5.79381289e+00
#          BR         NDA      ID1       ID2       ID3
     9.90098124e-01    2     1000022         4
     9.41120339e-03    2     1000023         4
     2.04227084e-04    2     1000025         4
     2.86445806e-04    2     1000035         4
#         PDG            Width
DECAY   2000005     5.46561668e+01
#          BR         NDA      ID1       ID2       ID3
     7.51392968e-03    2     1000022         5
     1.27024447e-02    2     1000023         5
     1.83515636e-03    2     1000025         5
     1.31497015e-01    2     1000035         5
     5.26778581e-01    2    -1000024         6
     3.19260666e-01    2    -1000037         6
     4.12207041e-04    2     1000006       -24
#         PDG            Width
DECAY   2000006     5.48959702e+01
#          BR         NDA      ID1       ID2       ID3
     6.98146917e-03    2     1000022         6
     2.52191771e-01    2     1000023         6
     2.75420835e-01    2     1000025         6
     1.72132365e-01    2     1000035         6
     5.12938558e-03    2     1000024         5
     2.87872253e-01    2     1000037         5
     7.17212830e-05    2     1000006        25
     2.00200105e-04    2     1000006        23
#         PDG            Width
DECAY   1000016     3.81825242e-01
#          BR         NDA      ID1       ID2       ID3
     9.08833243e-01    2     1000022        16
     9.11667574e-02    2     1000015        24
#         PDG            Width
DECAY   2000013     9.98184045e-25
#          BR         NDA      ID1       ID2       ID3
     1.00000000e+00    3     1000015        14       -16
     2.26450375e-20    3    -1000015        13        13
#         PDG            Width
DECAY   1000014     3.47346077e-01
#          BR         NDA      ID1       ID2       ID3
     1.48166737e-20    2     1000022        12
     9.99681978e-01    2     1000022        14
     3.18022081e-04    2     2000013        24
#         PDG            Width
DECAY   2000011     2.36587874e-29
#          BR         NDA      ID1       ID2       ID3
     2.65231346e-18    3     1000015        11       -11
     2.78818629e-16    3     1000015        11       -13
     1.00000000e+00    3     1000015        12       -16
     1.01221784e-17    3    -1000015        11        11
     5.29838730e-16    3    -1000015        11        13
     1.53007890e-19    3     1000015        14       -16
     4.38558097e-16    3     2000013        12       -14
#         PDG            Width
DECAY   1000012     3.47236353e-01
#          BR         NDA      ID1       ID2       ID3
     9.99999993e-01    2     1000022        12
     1.48213871e-20    2     1000022        14
     7.43418759e-09    2     2000011        24
#         PDG            Width
DECAY   1000011     3.56187305e-01
#          BR         NDA      ID1       ID2       ID3
     9.01644058e-01    2     1000022        15
     4.87644684e-02    2     1000015        25
     4.95914739e-02    2     1000015        23
#         PDG            Width
DECAY   1000013     3.26843057e-01
#          BR         NDA      ID1       ID2       ID3
     9.99637405e-01    2     1000022        13
     1.87654153e-04    2     2000013        25
     1.74940842e-04    2     2000013        23
#         PDG            Width
DECAY   2000015     3.26970733e-01
#          BR         NDA      ID1       ID2       ID3
     9.99999992e-01    2     1000022        11
     4.38737736e-09    2     2000011        25
     4.09020175e-09    2     2000011        23
#         PDG            Width
DECAY   1000021     1.95427966e+01
#          BR         NDA      ID1       ID2       ID3
     4.27514673e-02    2     1000001        -1
     4.27514673e-02    2    -1000001         1
     1.24372299e-02    2     2000001        -1
     1.24372299e-02    2    -2000001         1
     1.17966784e-01    2     1000002        -2
     1.17966784e-01    2    -1000002         2
     3.70863368e-02    2     2000002        -2
     3.70863368e-02    2    -2000002         2
     4.27514673e-02    2     1000003        -3
     4.27514673e-02    2    -1000003         3
     1.24372299e-02    2     2000003        -3
     1.24372299e-02    2    -2000003         3
     1.17966784e-01    2     1000004        -4
     1.17966784e-01    2    -1000004         4
     3.70863368e-02    2     2000004        -4
     3.70863368e-02    2    -2000004         4
     4.27153932e-02    2     1000005        -5
     4.27153932e-02    2    -1000005         5
     1.28195393e-02    2     2000005        -5
     1.28195393e-02    2    -2000005         5
     2.39814311e-02    2     1000006        -6
     2.39814311e-02    2    -1000006         6
#         PDG            Width
DECAY   1000022     2.12197609e+00
#          BR         NDA      ID1       ID2       ID3
     1.67579233e-01    2     1000015       -15
     1.67579233e-01    2    -1000015        15
     1.66212203e-01    2     2000013       -13
     1.66212203e-01    2    -2000013        13
     1.66208564e-01    2     2000011       -11
     1.66208564e-01    2    -2000011        11
#         PDG            Width
DECAY   1000023     8.14916368e-01
#          BR         NDA      ID1       ID2       ID3
     2.93411461e-02    2     1000015       -15
     2.93411461e-02    2    -1000015        15
     2.05627741e-02    2     2000013       -13
     2.05627741e-02    2    -2000013        13
     2.05335462e-02    2     2000011       -11
     2.05335462e-02    2    -2000011        11
     4.49419715e-03    2     1000011       -15
     4.49419715e-03    2    -1000011        15
     3.79009132e-03    2     1000013       -13
     3.79009132e-03    2    -1000013        13
     3.76953817e-03    2     2000015       -11
     3.76953817e-03    2    -2000015        11
     1.84500394e-03    2     1000016       -16
     1.84500394e-03    2    -1000016        16
     1.83748869e-03    2     1000014       -14
     1.83748869e-03    2    -1000014        14
     1.83746355e-03    2     1000012       -12
     1.83746355e-03    2    -1000012        12
     1.83315173e-02    2     1000022        23
     8.05645984e-01    2     1000022        25
#         PDG            Width
DECAY   1000025     6.84576103e-01
#          BR         NDA      ID1       ID2       ID3
     1.14492000e-02    2     1000015       -15
     1.14492000e-02    2    -1000015        15
     5.91375474e-04    2     2000013       -13
     5.91375474e-04    2    -2000013        13
     5.55077888e-04    2     2000011       -11
     5.55077888e-04    2    -2000011        11
     4.22725366e-04    2     1000011       -15
     4.22725366e-04    2    -1000011        15
     9.30105771e-06    2     1000013       -13
     9.30105771e-06    2    -1000013        13
     8.00629202e-06    2     2000015       -11
     8.00629202e-06    2    -2000015        11
     5.63150804e-05    2     1000016       -16
     5.63150804e-05    2    -1000016        16
     5.61376218e-05    2     1000014       -14
     5.61376218e-05    2    -1000014        14
     5.61370281e-05    2     1000012       -12
     5.61370281e-05    2    -1000012        12
     9.52893018e-01    2     1000022        23
     2.06984302e-02    2     1000022        25
#         PDG            Width
DECAY   1000035     1.03247354e+01
#          BR         NDA      ID1       ID2       ID3
     9.37922516e-05    2     1000015       -15
     9.37922516e-05    2    -1000015        15
     8.55957590e-05    2     2000013       -13
     8.55957590e-05    2    -2000013        13
     8.55654962e-05    2     2000011       -11
     8.55654962e-05    2    -2000011        11
     3.93574059e-02    2     1000011       -15
     3.93574059e-02    2    -1000011        15
     3.85314275e-02    2     1000013       -13
     3.85314275e-02    2    -1000013        13
     3.84965471e-02    2     2000015       -11
     3.84965471e-02    2    -2000015        11
     4.12128511e-02    2     1000016       -16
     4.12128511e-02    2    -1000016        16
     4.11824578e-02    2     1000014       -14
     4.11824578e-02    2    -1000014        14
     4.11823560e-02    2     1000012       -12
     4.11823560e-02    2    -1000012        12
     1.29018401e-04    2     1000022        23
     8.12131681e-04    2     1000023        23
     1.18644961e-01    2     1000025        23
     1.39620399e-01    2     1000024       -24
     1.39620399e-01    2    -1000024        24
     1.80441359e-03    2     1000022        25
     1.18481980e-01    2     1000023        25
     4.30699978e-04    2     1000025        25
#         PDG            Width
DECAY   1000024     6.32438968e-01
#          BR         NDA      ID1       ID2       ID3
     8.34518298e-03    2     1000016       -15
     7.71364583e-03    2     1000014       -13
     7.71152699e-03    2     1000012       -11
     2.33965702e-02    2    -1000015        16
     7.77603963e-05    2    -2000013        14
     1.81873923e-09    2    -2000011        12
     5.86264455e-03    2    -1000011        16
     5.23365449e-03    2    -1000013        14
     5.20520533e-03    2    -2000015        12
     9.36453807e-01    2     1000022        24
#         PDG            Width
DECAY   1000037     1.04220402e+01
#          BR         NDA      ID1       ID2       ID3
     7.89494037e-02    2     1000016       -15
     7.88786949e-02    2     1000014       -13
     7.88784608e-02    2     1000012       -11
     1.81366734e-05    2    -1000015        16
     6.57968605e-08    2    -2000013        14
     1.54137208e-12    2    -2000011        12
     8.08422294e-02    2    -1000011        16
     7.91593205e-02    2    -1000013        14
     7.90876120e-02    2    -2000015        12
     1.38412340e-01    2     1000024        23
     1.45899627e-03    2     1000022        24
     1.49241258e-01    2     1000023        24
     1.19127413e-01    2     1000025        24
     1.15946069e-01    2     1000024        25
