#
#                              ======================
#                              | THE SUSYHIT OUTPUT |
#                              ======================
#
#
#              ------------------------------------------------------
#              |     This is the output of the SUSY-HIT package     |
#              |  created by A.Djouadi, M.Muehlleitner and M.Spira. |
#              |  In case of problems with SUSY-HIT email to        |
#              |           margarete.muehlleitner@cern.ch           |
#              |           michael.spira@psi.ch                     |
#              |           abdelhak.djouadi@cern.ch                 |
#              ------------------------------------------------------
#
#              ------------------------------------------------------
#              |  SUSY Les Houches Accord - MSSM Spectrum + Decays  |
#              |              based on the decay programs           |
#              |                                                    |
#              |                     SDECAY 1.3b                    |
#              |                                                    |
#              |  Authors: M.Muhlleitner, A.Djouadi and Y.Mambrini  |
#              |  Ref.:    Comput.Phys.Commun.168(2005)46           |
#              |           [hep-ph/0311167]                         |
#              |                                                    |
#              |                     HDECAY 3.4                     |
#              |                                                    |
#              |  By: A.Djouadi,J.Kalinowski,M.Muhlleitner,M.Spira  |
#              |  Ref.:    Comput.Phys.Commun.108(1998)56           |
#              |           [hep-ph/9704448]                         |
#              |                                                    |
#              |                                                    |
#              |  If not stated otherwise all DRbar couplings and   |
#              |  soft SUSY breaking masses are given at the scale  |
#              |  Q=  0.25777530E+04
#              |                                                    |
#              ------------------------------------------------------
#
#
BLOCK DCINFO  # Decay Program information
     1   SDECAY/HDECAY # decay calculator
     2   1.3b  /3.4    # version number
#
BLOCK SPINFO  # Spectrum calculator information
     1     SOFTSUSY    # spectrum calculator               
     2     3.4.0       # version number                    
#
BLOCK MODSEL  # Model selection
     1     0   #  nonUniversal                                     
#
BLOCK SMINPUTS  # Standard Model inputs
         1     1.27908970E+02   # alpha_em^-1(M_Z)^MSbar
         2     1.16637870E-05   # G_F [GeV^-2]
         3     1.18400000E-01   # alpha_S(M_Z)^MSbar
         4     9.11876000E+01   # M_Z pole mass
         5     4.18000000E+00   # mb(mb)^MSbar
         6     1.73200000E+02   # mt pole mass
         7     1.77700000E+00   # mtau pole mass
#
BLOCK MINPAR  # Input parameters - minimal models
         3     6.52000000E+00   # tanb                
#
BLOCK EXTPAR  # Input parameters - non-minimal models
         0    -1.00000000E+00   # Set                 
         1    -3.69439000E+03   # M_1(MX)             
         2     1.84220000E+02   # M_2(MX)             
         3     1.02633000E+03   # M_3(MX)             
        11     3.30286000E+03   # At(MX)              
        12     3.01210000E+02   # Ab(MX)              
        13     3.27880000E+03   # Atau(MX)            
        23    -3.45603000E+03   # mu(MX)              
        26     2.01939000E+03   # mA(pole)            
        31     2.07700000E+02   # meL(MX)             
        32     2.07700000E+02   # mmuL(MX)            
        33     1.36489000E+03   # mtauL(MX)           
        34     2.66485000E+03   # meR(MX)             
        35     2.66485000E+03   # mmuR(MX)            
        36     6.74240000E+02   # mtauR(MX)           
        41     3.35708000E+03   # mqL1(MX)            
        42     3.35708000E+03   # mqL2(MX)            
        43     3.02182000E+03   # mqL3(MX)            
        44     2.59491000E+03   # muR(MX)             
        45     2.59491000E+03   # mcR(MX)             
        46     2.20004000E+03   # mtR(MX)             
        47     3.22185000E+03   # mdR(MX)             
        48     3.22185000E+03   # msR(MX)             
        49     1.34425000E+03   # mbR(MX)             
#
BLOCK MASS  # Mass Spectrum
# PDG code           mass       particle
        24     8.03987199E+01   # W+
        25     1.24389925E+02   # h
        35     2.01946571E+03   # H
        36     2.01938926E+03   # A
        37     2.02130333E+03   # H+
         5     4.81876030E+00   # b-quark pole mass calculated from mb(mb)_Msbar
   1000001     3.39688049E+03   # ~d_L
   2000001     3.25595932E+03   # ~d_R
   1000002     3.39612694E+03   # ~u_L
   2000002     2.63038143E+03   # ~u_R
   1000003     3.39688049E+03   # ~s_L
   2000003     3.25595932E+03   # ~s_R
   1000004     3.39612694E+03   # ~c_L
   2000004     2.63038143E+03   # ~c_R
   1000005     1.39579018E+03   # ~b_1
   2000005     3.02896010E+03   # ~b_2
   1000006     2.19964974E+03   # ~t_1
   2000006     3.04290527E+03   # ~t_2
   1000011     2.21091027E+02   # ~e_L
   2000011     2.67445701E+03   # ~e_R
   1000012     2.07313692E+02   # ~nu_eL
   1000013     2.21091027E+02   # ~mu_L
   2000013     2.67445701E+03   # ~mu_R
   1000014     2.07313692E+02   # ~nu_muL
   1000015     6.86976203E+02   # ~tau_1
   2000015     1.36967405E+03   # ~tau_2
   1000016     1.36667693E+03   # ~nu_tauL
   1000021     1.22744849E+03   # ~g
   1000022     2.00522525E+02   # ~chi_10
   1000023    -3.47844917E+03   # ~chi_20
   1000025     3.48640828E+03   # ~chi_30
   1000035    -3.65198506E+03   # ~chi_40
   1000024     2.00683259E+02   # ~chi_1+
   1000037     3.48779085E+03   # ~chi_2+
#
BLOCK NMIX  # Neutralino Mixing Matrix
  1  1    -1.44812988E-04   # N_11
  1  2     9.99763164E-01   # N_12
  1  3     2.16221749E-02   # N_13
  1  4    -2.46489560E-03   # N_14
  2  1     1.98636381E-01   # N_21
  2  2     1.67319745E-02   # N_22
  2  3    -6.93382330E-01   # N_23
  2  4     6.92448246E-01   # N_24
  3  1     3.66655913E-03   # N_31
  3  2    -1.35448259E-02   # N_32
  3  3     7.06922598E-01   # N_33
  3  4     7.07151706E-01   # N_34
  4  1     9.80066387E-01   # N_41
  4  2    -3.19278094E-03   # N_42
  4  3     1.37890776E-01   # N_43
  4  4    -1.42988869E-01   # N_44
#
BLOCK UMIX  # Chargino Mixing Matrix U
  1  1     9.99532417E-01   # U_11
  1  2     3.05769218E-02   # U_12
  2  1    -3.05769218E-02   # U_21
  2  2     9.99532417E-01   # U_22
#
BLOCK VMIX  # Chargino Mixing Matrix V
  1  1     9.99993916E-01   # V_11
  1  2     3.48812615E-03   # V_12
  2  1     3.48812615E-03   # V_21
  2  2    -9.99993916E-01   # V_22
#
BLOCK STOPMIX  # Stop Mixing Matrix
  1  1    -1.23345217E-01   # cos(theta_t)
  1  2     9.92363823E-01   # sin(theta_t)
  2  1    -9.92363823E-01   # -sin(theta_t)
  2  2    -1.23345217E-01   # cos(theta_t)
#
BLOCK SBOTMIX  # Sbottom Mixing Matrix
  1  1    -7.76927039E-03   # cos(theta_b)
  1  2     9.99969819E-01   # sin(theta_b)
  2  1    -9.99969819E-01   # -sin(theta_b)
  2  2    -7.76927039E-03   # cos(theta_b)
#
BLOCK STAUMIX  # Stau Mixing Matrix
  1  1    -3.12357787E-02   # cos(theta_tau)
  1  2     9.99512044E-01   # sin(theta_tau)
  2  1    -9.99512044E-01   # -sin(theta_tau)
  2  2    -3.12357787E-02   # cos(theta_tau)
#
BLOCK ALPHA  # Higgs mixing
          -1.60529602E-01   # Mixing angle in the neutral Higgs boson sector
#
BLOCK HMIX Q=  2.57775300E+03  # DRbar Higgs Parameters
         1    -3.50890484E+03   # mu(Q)MSSM           
         2     6.20649371E+00   # tan                 
         3     2.43107464E+02   # higgs               
         4     4.05033386E+06   # mA^2(Q)MSSM         
#
BLOCK GAUGE Q=  2.57775300E+03  # The gauge couplings
     1     3.64521015E-01   # gprime(Q) DRbar
     2     6.41458597E-01   # g(Q) DRbar
     3     1.02887123E+00   # g3(Q) DRbar
#
BLOCK AU Q=  2.57775300E+03  # The trilinear couplings
  1  1     0.00000000E+00   # A_u(Q) DRbar
  2  2     0.00000000E+00   # A_c(Q) DRbar
  3  3     3.30286000E+03   # A_t(Q) DRbar
#
BLOCK AD Q=  2.57775300E+03  # The trilinear couplings
  1  1     0.00000000E+00   # A_d(Q) DRbar
  2  2     0.00000000E+00   # A_s(Q) DRbar
  3  3     3.01210002E+02   # A_b(Q) DRbar
#
BLOCK AE Q=  2.57775300E+03  # The trilinear couplings
  1  1     0.00000000E+00   # A_e(Q) DRbar
  2  2     0.00000000E+00   # A_mu(Q) DRbar
  3  3     3.27880000E+03   # A_tau(Q) DRbar
#
BLOCK Yu Q=  2.57775300E+03  # The Yukawa couplings
  1  1     0.00000000E+00   # y_u(Q) DRbar
  2  2     0.00000000E+00   # y_c(Q) DRbar
  3  3     8.49940261E-01   # y_t(Q) DRbar
#
BLOCK Yd Q=  2.57775300E+03  # The Yukawa couplings
  1  1     0.00000000E+00   # y_d(Q) DRbar
  2  2     0.00000000E+00   # y_s(Q) DRbar
  3  3     9.35639966E-02   # y_b(Q) DRbar
#
BLOCK Ye Q=  2.57775300E+03  # The Yukawa couplings
  1  1     0.00000000E+00   # y_e(Q) DRbar
  2  2     0.00000000E+00   # y_mu(Q) DRbar
  3  3     6.35910469E-02   # y_tau(Q) DRbar
#
BLOCK MSOFT Q=  2.57775300E+03  # The soft SUSY breaking masses at the scale Q
         1    -3.69439000E+03   # M_1(Q)              
         2     1.84220000E+02   # M_2(Q)              
         3     1.02633000E+03   # M_3(Q)              
        21    -8.41615570E+06   # mH1^2(Q)            
        22    -1.20884956E+07   # mH2^2(Q)            
        31     2.07700000E+02   # meL(Q)              
        32     2.07700000E+02   # mmuL(Q)             
        33     1.36489000E+03   # mtauL(Q)            
        34     2.66485000E+03   # meR(Q)              
        35     2.66485000E+03   # mmuR(Q)             
        36     6.74240000E+02   # mtauR(Q)            
        41     3.35708000E+03   # mqL1(Q)             
        42     3.35708000E+03   # mqL2(Q)             
        43     3.02182000E+03   # mqL3(Q)             
        44     2.59491000E+03   # muR(Q)              
        45     2.59491000E+03   # mcR(Q)              
        46     2.20004000E+03   # mtR(Q)              
        47     3.22185000E+03   # mdR(Q)              
        48     3.22185000E+03   # msR(Q)              
        49     1.34425000E+03   # mbR(Q)              
#
Block HiggsBoundsInputHiggsCouplingsFermions
# ScalarNormEffCoupSq PseudoSNormEffCoupSq NP   IP1 IP2 IP2
    1.00971691E+00    0.00000000E+00        3  25   5   5  # h0-b-b eff. coupling^2, normalised to SM
    3.85108473E+01    0.00000000E+00        3  35   5   5  # H0-b-b eff. coupling^2, normalised to SM
    0.00000000E+00    3.85205642E+01        3  36   5   5  # A0-b-b eff. coupling^2, normalised to SM
#
    9.99747747E-01    0.00000000E+00        3  25   6   6  # h0-t-t eff. coupling^2, normalised to SM
    2.62124123E-02    0.00000000E+00        3  35   6   6  # H0-t-t eff. coupling^2, normalised to SM
    0.00000000E+00    2.59601598E-02        3  36   6   6  # A0-t-t eff. coupling^2, normalised to SM
#
    1.00971691E+00    0.00000000E+00        3  25  15  15  # h0-tau-tau eff. coupling^2, normalised to SM
    3.85108473E+01    0.00000000E+00        3  35  15  15  # H0-tau-tau eff. coupling^2, normalised to SM
    0.00000000E+00    3.85205642E+01        3  36  15  15  # A0-tau-tau eff. coupling^2, normalised to SM
#
Block HiggsBoundsInputHiggsCouplingsBosons
    9.99999390E-01        3  25  24  24  # h0-W-W eff. coupling^2, normalised to SM
    6.09896455E-07        3  35  24  24  # H0-W-W eff. coupling^2, normalised to SM
    0.00000000E+00        3  36  24  24  # A0-W-W eff. coupling^2, normalised to SM
#
    9.99999390E-01        3  25  23  23  # h0-Z-Z eff. coupling^2, normalised to SM
    6.09896455E-07        3  35  23  23  # H0-Z-Z eff. coupling^2, normalised to SM
    0.00000000E+00        3  36  23  23  # A0-Z-Z eff. coupling^2, normalised to SM
#
    8.87690859E-01        3  25  21  21  # h0-g-g eff. coupling^2, normalised to SM
    1.84494313E-10        3  35  21  21  # H0-g-g eff. coupling^2, normalised to SM
    5.74044480E-10        3  36  21  21  # A0-g-g eff. coupling^2, normalised to SM
#
    0.00000000E+00        3  25  25  23  # h0-h0-Z eff. coupling^2, normalised to SM
    0.00000000E+00        3  35  25  23  # H0-h0-Z eff. coupling^2, normalised to SM
    6.09896455E-07        3  36  25  23  # A0-h0-Z eff. coupling^2, normalised to SM
    0.00000000E+00        3  35  35  23  # H0-H0-Z eff. coupling^2, normalised to SM
    9.99999390E-01        3  36  35  23  # A0-H0-Z eff. coupling^2, normalised to SM
    0.00000000E+00        3  36  36  23  # A0-A0-Z eff. coupling^2, normalised to SM
#
    0.00000000E+00        4  25  21  21  23  # h0-g-g-Z eff. coupling^2, normalised to SM
    0.00000000E+00        4  35  21  21  23  # H0-g-g-Z eff. coupling^2, normalised to SM
    0.00000000E+00        4  36  21  21  23  # A0-g-g-Z eff. coupling^2, normalised to SM
#
#
#
#                             =================
#                             |The decay table|
#                             =================
#
# - The QCD corrections to the decays gluino -> squark  + quark
#                                     squark -> gaugino + quark_prime
#                                     squark -> squark_prime + Higgs
#                                     squark -> gluino  + quark
#   are included.
#
# - The multi-body decays for the inos, stops and sbottoms are included.
#
# - The loop induced decays for the gluino, neutralinos and stops
#   are included.
#
# - The SUSY decays of the top quark are included.
#
#
#         PDG            Width
DECAY         6     1.44873667E+00   # top decays
#          BR         NDA      ID1       ID2
     1.00000000E+00    2           5        24   # BR(t ->  b    W+)
#
#         PDG            Width
DECAY   1000021     1.14475003E-03   # gluino decays
#          BR         NDA      ID1       ID2
     2.08634611E-05    2     1000022        21   # BR(~g -> ~chi_10 g)
#           BR         NDA      ID1       ID2       ID3
     4.78931615E-02    3     1000022         1        -1   # BR(~g -> ~chi_10 d  db)
     4.79328933E-02    3     1000022         2        -2   # BR(~g -> ~chi_10 u  ub)
     4.78931615E-02    3     1000022         3        -3   # BR(~g -> ~chi_10 s  sb)
     4.79328933E-02    3     1000022         4        -4   # BR(~g -> ~chi_10 c  cb)
     7.87859874E-02    3     1000022         5        -5   # BR(~g -> ~chi_10 b  bb)
     6.13132332E-02    3     1000022         6        -6   # BR(~g -> ~chi_10 t  tb)
     9.58079817E-02    3     1000024         1        -2   # BR(~g -> ~chi_1+ d  ub)
     9.58079817E-02    3    -1000024         2        -1   # BR(~g -> ~chi_1- u  db)
     9.58079817E-02    3     1000024         3        -4   # BR(~g -> ~chi_1+ s  cb)
     9.58079817E-02    3    -1000024         4        -3   # BR(~g -> ~chi_1- c  sb)
     1.42497940E-01    3     1000024         5        -6   # BR(~g -> ~chi_1+ b  tb)
     1.42497940E-01    3    -1000024         6        -5   # BR(~g -> ~chi_1- t  bb)
#
#         PDG            Width
DECAY   1000006     5.56835425E+01   # stop1 decays
#          BR         NDA      ID1       ID2
     2.56872003E-03    2     1000022         6   # BR(~t_1 -> ~chi_10 t )
     5.20464046E-03    2     1000024         5   # BR(~t_1 -> ~chi_1+ b )
     9.92203322E-01    2     1000021         6   # BR(~t_1 -> ~g      t )
     2.33173033E-05    2     1000005        24   # BR(~t_1 -> ~b_1    W+)
#
#         PDG            Width
DECAY   2000006     1.87175615E+02   # stop2 decays
#          BR         NDA      ID1       ID2
     6.44326382E-02    2     1000022         6   # BR(~t_2 -> ~chi_10 t )
     1.29767236E-01    2     1000024         5   # BR(~t_2 -> ~chi_1+ b )
     6.42678388E-01    2     1000021         6   # BR(~t_2 -> ~g      t )
     8.18581280E-02    2     1000006        25   # BR(~t_2 -> ~t_1    h )
     7.84858344E-02    2     1000006        23   # BR(~t_2 -> ~t_1    Z )
     2.77777484E-03    2     1000005        24   # BR(~t_2 -> ~b_1    W+)
#
#         PDG            Width
DECAY   1000005     4.02621197E+00   # sbottom1 decays
#          BR         NDA      ID1       ID2
     2.03495991E-04    2     1000022         5   # BR(~b_1 -> ~chi_10 b )
     3.93926678E-04    2    -1000024         6   # BR(~b_1 -> ~chi_1- t )
     9.99402577E-01    2     1000021         5   # BR(~b_1 -> ~g      b )
#
#         PDG            Width
DECAY   2000005     1.83896503E+02   # sbottom2 decays
#          BR         NDA      ID1       ID2
     6.67899932E-02    2     1000022         5   # BR(~b_2 -> ~chi_10 b )
     1.32639761E-01    2    -1000024         6   # BR(~b_2 -> ~chi_1- t )
     6.46152178E-01    2     1000021         5   # BR(~b_2 -> ~g      b )
     1.51119832E-03    2     1000005        25   # BR(~b_2 -> ~b_1    h )
     1.44345198E-03    2     1000005        23   # BR(~b_2 -> ~b_1    Z )
     1.51463417E-01    2     1000006       -24   # BR(~b_2 -> ~t_1    W-)
#
#         PDG            Width
DECAY   1000002     2.18743226E+02   # sup_L decays
#          BR         NDA      ID1       ID2
     6.10451073E-02    2     1000022         2   # BR(~u_L -> ~chi_10 u)
     1.22151965E-01    2     1000024         1   # BR(~u_L -> ~chi_1+ d)
     8.16802928E-01    2     1000021         2   # BR(~u_L -> ~g      u)
#
#         PDG            Width
DECAY   2000002     1.12036933E+02   # sup_R decays
#          BR         NDA      ID1       ID2
     1.10340281E-09    2     1000022         2   # BR(~u_R -> ~chi_10 u)
     9.99999999E-01    2     1000021         2   # BR(~u_R -> ~g      u)
#
#         PDG            Width
DECAY   1000001     2.18792595E+02   # sdown_L decays
#          BR         NDA      ID1       ID2
     6.10518849E-02    2     1000022         1   # BR(~d_L -> ~chi_10 d)
     1.22039400E-01    2    -1000024         2   # BR(~d_L -> ~chi_1- u)
     8.16908715E-01    2     1000021         1   # BR(~d_L -> ~g      d)
#
#         PDG            Width
DECAY   2000001     1.66798316E+02   # sdown_R decays
#          BR         NDA      ID1       ID2
     2.30898451E-10    2     1000022         1   # BR(~d_R -> ~chi_10 d)
     1.00000000E+00    2     1000021         1   # BR(~d_R -> ~g      d)
#
#         PDG            Width
DECAY   1000004     1.85552594E+02   # scharm_L decays
#          BR         NDA      ID1       ID2
     7.43517374E-02    2     1000022         4   # BR(~c_L -> ~chi_10 c)
     1.48778683E-01    2     1000024         3   # BR(~c_L -> ~chi_1+ s)
     7.76869580E-01    2     1000021         4   # BR(~c_L -> ~g      c)
#
#         PDG            Width
DECAY   2000004     9.03908340E+01   # scharm_R decays
#          BR         NDA      ID1       ID2
     1.41732494E-09    2     1000022         4   # BR(~c_R -> ~chi_10 c)
     9.99999999E-01    2     1000021         4   # BR(~c_R -> ~g      c)
#
#         PDG            Width
DECAY   1000003     1.85589236E+02   # sstrange_L decays
#          BR         NDA      ID1       ID2
     7.43619768E-02    2     1000022         3   # BR(~s_L -> ~chi_10 s)
     1.48645452E-01    2    -1000024         4   # BR(~s_L -> ~chi_1- c)
     7.76992571E-01    2     1000021         3   # BR(~s_L -> ~g      s)
#
#         PDG            Width
DECAY   2000003     1.34572141E+02   # sstrange_R decays
#          BR         NDA      ID1       ID2
     2.95801858E-10    2     1000022         3   # BR(~s_R -> ~chi_10 s)
     1.00000000E+00    2     1000021         3   # BR(~s_R -> ~g      s)
#
#         PDG            Width
DECAY   1000011     8.45289700E-02   # selectron_L decays
#          BR         NDA      ID1       ID2
     3.36725259E-01    2     1000022        11   # BR(~e_L -> ~chi_10 e-)
     6.63274741E-01    2    -1000024        12   # BR(~e_L -> ~chi_1- nu_e)
#
#         PDG            Width
DECAY   2000011     4.73082110E-03   # selectron_R decays
#           BR         NDA      ID1       ID2
     6.19758979E-05    2     1000022        11   # BR(~e_R -> ~chi_10 e-)
#           BR         NDA      ID1       ID2       ID3
     4.96214072E-09    3        11       -2        2000002   # BR(~e_R- -> e-  ub  ~u_R)
     9.65942256E-09    3        11       2        -2000002   # BR(~e_R- -> e-  u  ~u_R*)
     5.00716462E-09    3        11       -4        2000004   # BR(~e_R- -> e-  cb  ~c_R)
     9.63913010E-09    3        11       4        -2000004   # BR(~e_R- -> e-  c  ~c_R*)
     5.66138509E-03    3        11       -5        1000005   # BR(~e_R- -> e-  bb  ~b_1)
     1.73743624E-02    3        11       5        -1000005   # BR(~e_R- -> e-  b  ~b_1*)
     2.49407022E-04    3        11       -6        1000006   # BR(~e_R- -> e-  tb  ~t_1)
     5.35467300E-04    3        11       6        -1000006   # BR(~e_R- -> e-  t  ~t_1*)
     1.24940256E-01    3        11       -11        1000011   # BR(~e_R- -> e-  e+  ~e_L-)
     2.27677179E-02    3        11       11        -1000011   # BR(~e_R- -> e-  e-  ~e_L+)
     1.28345585E-01    3        11       -12        1000012   # BR(~e_R- -> e-  nu_eb  ~nu_eL)
     2.24823551E-02    3        11       12        -1000012   # BR(~e_R- -> e-  nu_e  ~nu_eL*)
     1.28977610E-01    3        11       -13        1000013   # BR(~e_R- -> e-  mu+  ~mu_L-)
     2.29727563E-02    3        11       13        -1000013   # BR(~e_R- -> e-  mu-  ~mu_L+)
     1.30110606E-01    3        11       -14        1000014   # BR(~e_R- -> e-  nu_mub  ~nu_muL)
     2.25626795E-02    3        11       14        -1000014   # BR(~e_R- -> e-  nu_mu  ~nu_muL*)
     6.36993016E-02    3        11       -15        1000015   # BR(~e_R- -> e-  tau+  ~tau_1-)
     2.71263693E-01    3        11       15        -1000015   # BR(~e_R- -> e-  tau-  ~tau_1+)
     1.41852754E-02    3        11       -15        2000015   # BR(~e_R- -> e-  tau+  ~tau_2-)
     4.63069720E-03    3        11       15        -2000015   # BR(~e_R- -> e-  tau-  ~tau_2+)
     1.42977294E-02    3        11       -16        1000016   # BR(~e_R- -> e-  nu_taub  ~nu_tau1)
     4.57742949E-03    3        11       16        -1000016   # BR(~e_R- -> e-  nu_tau  ~nu_tau1*)
     1.47350742E-05    3        11       23        1000022   # BR(~e_R- -> e-  Z  ~chi_10)
     4.48632480E-05    3        11       25        1000022   # BR(~e_R- -> e-  h  ~chi_10)
     6.91211934E-07    3        11       35        1000022   # BR(~e_R- -> e-  H  ~chi_10)
     3.07853535E-06    3        11       36        1000022   # BR(~e_R- -> e-  A  ~chi_10)
     1.28075019E-04    3        11       -24        1000024   # BR(~e_R- -> e-  W-  ~chi_1+)
     1.04833810E-04    3        11       24        -1000024   # BR(~e_R- -> e-  W+  ~chi_1-)
     4.93867756E-06    3        11       -37        1000024   # BR(~e_R- -> e-  H-  ~chi_1+)
     2.46532257E-06    3        11       37        -1000024   # BR(~e_R- -> e-  H+  ~chi_1-)
#
#         PDG            Width
DECAY   1000013     8.45285569E-02   # smuon_L decays
#          BR         NDA      ID1       ID2
     3.36722018E-01    2     1000022        13   # BR(~mu_L -> ~chi_10 mu-)
     6.63277982E-01    2    -1000024        14   # BR(~mu_L -> ~chi_1- nu_mu)
#
#         PDG            Width
DECAY   2000013     4.74626177E-03   # smuon_R decays
#           BR         NDA      ID1       ID2
     6.17742759E-05    2     1000022        13   # BR(~mu_R -> ~chi_10 mu-)
#           BR         NDA      ID1       ID2       ID3
     5.02037207E-09    3        13       -2        2000002   # BR(~mu_R- -> mu-  ub  ~u_R)
     9.44301056E-09    3        13       2        -2000002   # BR(~mu_R- -> mu-  u  ~u_R*)
     4.97423049E-09    3        13       -4        2000004   # BR(~mu_R- -> mu-  cb  ~c_R)
     9.37221800E-09    3        13       4        -2000004   # BR(~mu_R- -> mu-  c  ~c_R*)
     5.64296731E-03    3        13       -5        1000005   # BR(~mu_R- -> mu-  bb  ~b_1)
     1.73439654E-02    3        13       5        -1000005   # BR(~mu_R- -> mu-  b  ~b_1*)
     2.48953820E-04    3        13       -6        1000006   # BR(~mu_R- -> mu-  tb  ~t_1)
     5.34757694E-04    3        13       6        -1000006   # BR(~mu_R- -> mu-  t  ~t_1*)
     1.24533797E-01    3        13       -11        1000011   # BR(~mu_R- -> mu-  e+  ~e_L-)
     2.28980206E-02    3        13       11        -1000011   # BR(~mu_R- -> mu-  e-  ~e_L+)
     1.27928047E-01    3        13       -12        1000012   # BR(~mu_R- -> mu-  nu_eb  ~nu_eL)
     2.26009447E-02    3        13       12        -1000012   # BR(~mu_R- -> mu-  nu_e  ~nu_eL*)
     1.28558017E-01    3        13       -13        1000013   # BR(~mu_R- -> mu-  mu+  ~mu_L-)
     2.26936493E-02    3        13       13        -1000013   # BR(~mu_R- -> mu-  mu-  ~mu_L+)
     1.29687327E-01    3        13       -14        1000014   # BR(~mu_R- -> mu-  nu_mub  ~nu_muL)
     2.24892779E-02    3        13       14        -1000014   # BR(~mu_R- -> mu-  nu_mu  ~nu_muL*)
     6.34920733E-02    3        13       -15        1000015   # BR(~mu_R- -> mu-  tau+  ~tau_1-)
     2.73415177E-01    3        13       15        -1000015   # BR(~mu_R- -> mu-  tau-  ~tau_1+)
     1.41391274E-02    3        13       -15        2000015   # BR(~mu_R- -> mu-  tau+  ~tau_2-)
     4.61563248E-03    3        13       15        -2000015   # BR(~mu_R- -> mu-  tau-  ~tau_2+)
     1.42512156E-02    3        13       -16        1000016   # BR(~mu_R- -> mu-  nu_taub  ~nu_tau1)
     4.56253807E-03    3        13       16        -1000016   # BR(~mu_R- -> mu-  nu_tau  ~nu_tau1*)
     1.46721785E-05    3        13       23        1000022   # BR(~mu_R- -> mu-  Z  ~chi_10)
     4.47172976E-05    3        13       25        1000022   # BR(~mu_R- -> mu-  h  ~chi_10)
     6.90374901E-07    3        13       35        1000022   # BR(~mu_R- -> mu-  H  ~chi_10)
     3.07294471E-06    3        13       36        1000022   # BR(~mu_R- -> mu-  A  ~chi_10)
     1.27517198E-04    3        13       -24        1000024   # BR(~mu_R- -> mu-  W-  ~chi_1+)
     1.04669743E-04    3        13       24        -1000024   # BR(~mu_R- -> mu-  W+  ~chi_1-)
     4.93356691E-06    3        13       -37        1000024   # BR(~mu_R- -> mu-  H-  ~chi_1+)
     2.43560102E-06    3        13       37        -1000024   # BR(~mu_R- -> mu-  H+  ~chi_1-)
#
#         PDG            Width
DECAY   1000015     8.28057599E-03   # stau_1 decays
#          BR         NDA      ID1       ID2
     3.33476493E-01    2     1000022        15   # BR(~tau_1 -> ~chi_10  tau-)
     6.66523507E-01    2    -1000024        16   # BR(~tau_1 -> ~chi_1-  nu_tau)
#
#         PDG            Width
DECAY   2000015     1.67453611E+01   # stau_2 decays
#          BR         NDA      ID1       ID2
     3.20008008E-01    2     1000022        15   # BR(~tau_2 -> ~chi_10  tau-)
     6.39775863E-01    2    -1000024        16   # BR(~tau_2 -> ~chi_1-  nu_tau)
     2.04024562E-02    2     1000015        25   # BR(~tau_2 -> ~tau_1   h)
     1.98136725E-02    2     1000015        23   # BR(~tau_2 -> ~tau_1   Z)
#
#         PDG            Width
DECAY   1000012     1.02459281E-02   # snu_eL decays
#          BR         NDA      ID1       ID2
     3.43817757E-01    2     1000022        12   # BR(~nu_eL -> ~chi_10 nu_e)
     6.56182243E-01    2     1000024        11   # BR(~nu_eL -> ~chi_1+ e-)
#
#         PDG            Width
DECAY   1000014     1.02450465E-02   # snu_muL decays
#          BR         NDA      ID1       ID2
     3.43847344E-01    2     1000022        14   # BR(~nu_muL -> ~chi_10 nu_mu)
     6.56152656E-01    2     1000024        13   # BR(~nu_muL -> ~chi_1+ mu-)
#
#         PDG            Width
DECAY   1000016     1.67070488E+01   # snu_tauL decays
#          BR         NDA      ID1       ID2
     3.20454586E-01    2     1000022        16   # BR(~nu_tauL -> ~chi_10 nu_tau)
     6.41059414E-01    2     1000024        15   # BR(~nu_tauL -> ~chi_1+ tau-)
     3.84860006E-02    2    -1000015       -24   # BR(~nu_tauL -> ~tau_1+ W-)
#
#         PDG            Width
DECAY   1000024     3.15087680E-15   # chargino1+ decays
#           BR         NDA      ID1       ID2       ID3
     1.98944450E-02    3     1000022       -11        12   # BR(~chi_1+ -> ~chi_10 e+   nu_e)
     1.97909650E-03    3     1000022       -13        14   # BR(~chi_1+ -> ~chi_10 mu+  nu_mu)
     9.78126460E-01    2     1000022       211             # BR(~chi_1+ -> ~chi_10 pi+)
#
#         PDG            Width
DECAY   1000037     6.15884783E+01   # chargino2+ decays
#          BR         NDA      ID1       ID2
     2.41070037E-08    2     1000002        -1   # BR(~chi_2+ -> ~u_L     db)
     1.82317303E-06    2    -1000001         2   # BR(~chi_2+ -> ~d_L*    u )
     2.41067927E-08    2     1000004        -3   # BR(~chi_2+ -> ~c_L     sb)
     1.82291346E-06    2    -1000003         4   # BR(~chi_2+ -> ~s_L*     c )
     4.35907490E-01    2     1000006        -5   # BR(~chi_2+ -> ~t_1     bb)
     1.91290800E-03    2     2000006        -5   # BR(~chi_2+ -> ~t_2     bb)
     1.06037988E-02    2    -1000005         6   # BR(~chi_2+ -> ~b_1*    t )
     6.76770471E-02    2    -2000005         6   # BR(~chi_2+ -> ~b_2*    t )
     2.80026089E-06    2     1000012       -11   # BR(~chi_2+ -> ~nu_eL   e+  )
     2.80026089E-06    2     1000014       -13   # BR(~chi_2+ -> ~nu_muL mu+ )
     1.63247805E-03    2     1000016       -15   # BR(~chi_2+ -> ~nu_tau1 tau+)
     2.14970378E-04    2    -1000011        12   # BR(~chi_2+ -> ~e_L+    nu_e)
     2.14970378E-04    2    -1000013        14   # BR(~chi_2+ -> ~mu_L+   nu_mu)
     2.06028602E-03    2    -1000015        16   # BR(~chi_2+ -> ~tau_1+  nu_tau)
     1.87827665E-04    2    -2000015        16   # BR(~chi_2+ -> ~tau_2+  nu_tau)
     1.05074689E-01    2     1000024        23   # BR(~chi_2+ -> ~chi_1+  Z )
     1.02257174E-01    2     1000022        24   # BR(~chi_2+ -> ~chi_10  W+)
     1.11296595E-01    2     1000024        25   # BR(~chi_2+ -> ~chi_1+  h )
     5.36742699E-02    2     1000024        35   # BR(~chi_2+ -> ~chi_1+  H )
     5.36547232E-02    2     1000024        36   # BR(~chi_2+ -> ~chi_1+  A )
     5.36214782E-02    2     1000022        37   # BR(~chi_2+ -> ~chi_10  H+)
#
#         PDG            Width
DECAY   1000022     0.00000000E+00   # neutralino1 decays
#
#         PDG            Width
DECAY   1000023     6.29642325E+01   # neutralino2 decays
#          BR         NDA      ID1       ID2
     3.80240151E-02    2     1000022        23   # BR(~chi_20 -> ~chi_10   Z )
     9.58477715E-02    2     1000024       -24   # BR(~chi_20 -> ~chi_1+   W-)
     9.58477715E-02    2    -1000024        24   # BR(~chi_20 -> ~chi_1-   W+)
     6.30421095E-02    2     1000022        25   # BR(~chi_20 -> ~chi_10   h )
     1.35483436E-02    2     1000022        35   # BR(~chi_20 -> ~chi_10   H )
     3.68041088E-02    2     1000022        36   # BR(~chi_20 -> ~chi_10   A )
     5.03598023E-02    2     1000024       -37   # BR(~chi_20 -> ~chi_1+   H-)
     5.03598023E-02    2    -1000024        37   # BR(~chi_20 -> ~chi_1-   H+)
     2.33248077E-06    2     1000002        -2   # BR(~chi_20 -> ~u_L      ub)
     2.33248077E-06    2    -1000002         2   # BR(~chi_20 -> ~u_L*     u )
     1.37956789E-03    2     2000002        -2   # BR(~chi_20 -> ~u_R      ub)
     1.37956789E-03    2    -2000002         2   # BR(~chi_20 -> ~u_R*     u )
     3.38553096E-07    2     1000001        -1   # BR(~chi_20 -> ~d_L      db)
     3.38553096E-07    2    -1000001         1   # BR(~chi_20 -> ~d_L*     d )
     3.00613818E-05    2     2000001        -1   # BR(~chi_20 -> ~d_R      db)
     3.00613818E-05    2    -2000001         1   # BR(~chi_20 -> ~d_R*     d )
     2.33207648E-06    2     1000004        -4   # BR(~chi_20 -> ~c_L      cb)
     2.33207648E-06    2    -1000004         4   # BR(~chi_20 -> ~c_L*     c )
     1.37956603E-03    2     2000004        -4   # BR(~chi_20 -> ~c_R      cb)
     1.37956603E-03    2    -2000004         4   # BR(~chi_20 -> ~c_R*     c )
     3.38553096E-07    2     1000003        -3   # BR(~chi_20 -> ~s _L      sb)
     3.38553096E-07    2    -1000003         3   # BR(~chi_20 -> ~s _L*     s )
     3.00613818E-05    2     2000003        -3   # BR(~chi_20 -> ~s _R      sb)
     3.00613818E-05    2    -2000003         3   # BR(~chi_20 -> ~s _R*     s )
     2.26839441E-01    2     1000006        -6   # BR(~chi_20 -> ~t_1      tb)
     2.26839441E-01    2    -1000006         6   # BR(~chi_20 -> ~t_1*     t )
     2.47443941E-02    2     2000006        -6   # BR(~chi_20 -> ~t_2      tb)
     2.47443941E-02    2    -2000006         6   # BR(~chi_20 -> ~t_2*     t )
     6.30424507E-03    2     1000005        -5   # BR(~chi_20 -> ~b_1      bb)
     6.30424507E-03    2    -1000005         5   # BR(~chi_20 -> ~b_1*     b )
     4.11181508E-04    2     2000005        -5   # BR(~chi_20 -> ~b_2      bb)
     4.11181508E-04    2    -2000005         5   # BR(~chi_20 -> ~b_2*     b )
     1.88393477E-03    2     1000011       -11   # BR(~chi_20 -> ~e_L-     e+)
     1.88393477E-03    2    -1000011        11   # BR(~chi_20 -> ~e_L+     e-)
     9.63177192E-04    2     2000011       -11   # BR(~chi_20 -> ~e_R-     e+)
     9.63177192E-04    2    -2000011        11   # BR(~chi_20 -> ~e_R+     e-)
     1.88393477E-03    2     1000013       -13   # BR(~chi_20 -> ~mu_L-    mu+)
     1.88393477E-03    2    -1000013        13   # BR(~chi_20 -> ~mu_L+    mu-)
     9.63177192E-04    2     2000013       -13   # BR(~chi_20 -> ~mu_R-    mu+)
     9.63177192E-04    2    -2000013        13   # BR(~chi_20 -> ~mu_R+    mu-)
     6.37027220E-03    2     1000015       -15   # BR(~chi_20 -> ~tau_1-   tau+)
     6.37027220E-03    2    -1000015        15   # BR(~chi_20 -> ~tau_1+   tau-)
     2.07198404E-03    2     2000015       -15   # BR(~chi_20 -> ~tau_2-   tau+)
     2.07198404E-03    2    -2000015        15   # BR(~chi_20 -> ~tau_2+   tau-)
     1.03771736E-03    2     1000012       -12   # BR(~chi_20 -> ~nu_eL    nu_eb)
     1.03771736E-03    2    -1000012        12   # BR(~chi_20 -> ~nu_eL*   nu_e )
     1.03771736E-03    2     1000014       -14   # BR(~chi_20 -> ~nu_muL   nu_mub)
     1.03771736E-03    2    -1000014        14   # BR(~chi_20 -> ~nu_muL*  nu_mu )
     7.47362945E-04    2     1000016       -16   # BR(~chi_20 -> ~nu_tau1  nu_taub)
     7.47362945E-04    2    -1000016        16   # BR(~chi_20 -> ~nu_tau1* nu_tau )
#
#         PDG            Width
DECAY   1000025     6.04729781E+01   # neutralino3 decays
#          BR         NDA      ID1       ID2
     6.55196915E-02    2     1000022        23   # BR(~chi_30 -> ~chi_10   Z )
     1.04036776E-01    2     1000024       -24   # BR(~chi_30 -> ~chi_1+   W-)
     1.04036776E-01    2    -1000024        24   # BR(~chi_30 -> ~chi_1-   W+)
     4.49071252E-02    2     1000022        25   # BR(~chi_30 -> ~chi_10   h )
     3.99022846E-02    2     1000022        35   # BR(~chi_30 -> ~chi_10   H )
     1.46829812E-02    2     1000022        36   # BR(~chi_30 -> ~chi_10   A )
     5.44957477E-02    2     1000024       -37   # BR(~chi_30 -> ~chi_1+   H-)
     5.44957477E-02    2    -1000024        37   # BR(~chi_30 -> ~chi_1-   H+)
     1.61851272E-07    2     1000002        -2   # BR(~chi_30 -> ~u_L      ub)
     1.61851272E-07    2    -1000002         2   # BR(~chi_30 -> ~u_L*     u )
     4.96451845E-07    2     2000002        -2   # BR(~chi_30 -> ~u_R      ub)
     4.96451845E-07    2    -2000002         2   # BR(~chi_30 -> ~u_R*     u )
     1.95543986E-07    2     1000001        -1   # BR(~chi_30 -> ~d_L      db)
     1.95543986E-07    2    -1000001         1   # BR(~chi_30 -> ~d_L*     d )
     1.13753247E-08    2     2000001        -1   # BR(~chi_30 -> ~d_R      db)
     1.13753247E-08    2    -2000001         1   # BR(~chi_30 -> ~d_R*     d )
     1.61827909E-07    2     1000004        -4   # BR(~chi_30 -> ~c_L      cb)
     1.61827909E-07    2    -1000004         4   # BR(~chi_30 -> ~c_L*     c )
     4.96451190E-07    2     2000004        -4   # BR(~chi_30 -> ~c_R      cb)
     4.96451190E-07    2    -2000004         4   # BR(~chi_30 -> ~c_R*     c )
     1.95543986E-07    2     1000003        -3   # BR(~chi_30 -> ~s _L      sb)
     1.95543986E-07    2    -1000003         3   # BR(~chi_30 -> ~s _L*     s )
     1.13753247E-08    2     2000003        -3   # BR(~chi_30 -> ~s _R      sb)
     1.13753247E-08    2    -2000003         3   # BR(~chi_30 -> ~s _R*     s )
     2.15421380E-01    2     1000006        -6   # BR(~chi_30 -> ~t_1      tb)
     2.15421380E-01    2    -1000006         6   # BR(~chi_30 -> ~t_1*     t )
     3.57610628E-02    2     2000006        -6   # BR(~chi_30 -> ~t_2      tb)
     3.57610628E-02    2    -2000006         6   # BR(~chi_30 -> ~t_2*     t )
     5.29892033E-03    2     1000005        -5   # BR(~chi_30 -> ~b_1      bb)
     5.29892033E-03    2    -1000005         5   # BR(~chi_30 -> ~b_1*     b )
     4.58652882E-04    2     2000005        -5   # BR(~chi_30 -> ~b_2      bb)
     4.58652882E-04    2    -2000005         5   # BR(~chi_30 -> ~b_2*     b )
     1.53740049E-05    2     1000011       -11   # BR(~chi_30 -> ~e_L-     e+)
     1.53740049E-05    2    -1000011        11   # BR(~chi_30 -> ~e_L+     e-)
     3.47008362E-07    2     2000011       -11   # BR(~chi_30 -> ~e_R-     e+)
     3.47008362E-07    2    -2000011        11   # BR(~chi_30 -> ~e_R+     e-)
     1.53740049E-05    2     1000013       -13   # BR(~chi_30 -> ~mu_L-    mu+)
     1.53740049E-05    2    -1000013        13   # BR(~chi_30 -> ~mu_L+    mu-)
     3.47008362E-07    2     2000013       -13   # BR(~chi_30 -> ~mu_R-    mu+)
     3.47008362E-07    2    -2000013        13   # BR(~chi_30 -> ~mu_R+    mu-)
     1.06205912E-03    2     1000015       -15   # BR(~chi_30 -> ~tau_1-   tau+)
     1.06205912E-03    2    -1000015        15   # BR(~chi_30 -> ~tau_1+   tau-)
     8.48318126E-04    2     2000015       -15   # BR(~chi_30 -> ~tau_2-   tau+)
     8.48318126E-04    2    -2000015        15   # BR(~chi_30 -> ~tau_2+   tau-)
     2.86139383E-05    2     1000012       -12   # BR(~chi_30 -> ~nu_eL    nu_eb)
     2.86139383E-05    2    -1000012        12   # BR(~chi_30 -> ~nu_eL*   nu_e )
     2.86139383E-05    2     1000014       -14   # BR(~chi_30 -> ~nu_muL   nu_mub)
     2.86139383E-05    2    -1000014        14   # BR(~chi_30 -> ~nu_muL*  nu_mu )
     2.06413844E-05    2     1000016       -16   # BR(~chi_30 -> ~nu_tau1  nu_taub)
     2.06413844E-05    2    -1000016        16   # BR(~chi_30 -> ~nu_tau1* nu_tau )
#
#         PDG            Width
DECAY   1000035     7.94289897E+01   # neutralino4 decays
#          BR         NDA      ID1       ID2
     1.36726493E-03    2     1000022        23   # BR(~chi_40 -> ~chi_10   Z )
     2.43564194E-06    2     1000023        23   # BR(~chi_40 -> ~chi_20   Z )
     3.18792906E-03    2     1000025        23   # BR(~chi_40 -> ~chi_30   Z )
     3.12065055E-03    2     1000024       -24   # BR(~chi_40 -> ~chi_1+   W-)
     3.12065055E-03    2    -1000024        24   # BR(~chi_40 -> ~chi_1-   W+)
     3.45248705E-03    2     1000037       -24   # BR(~chi_40 -> ~chi_2+   W-)
     3.45248705E-03    2    -1000037        24   # BR(~chi_40 -> ~chi_2-   W+)
     2.13618512E-03    2     1000022        25   # BR(~chi_40 -> ~chi_10   h )
     3.92140525E-04    2     1000022        35   # BR(~chi_40 -> ~chi_10   H )
     1.12496975E-03    2     1000022        36   # BR(~chi_40 -> ~chi_10   A )
     4.27409174E-03    2     1000023        25   # BR(~chi_40 -> ~chi_20   h )
     5.21004354E-07    2     1000025        25   # BR(~chi_40 -> ~chi_30   h )
     1.51788338E-03    2     1000024       -37   # BR(~chi_40 -> ~chi_1+   H-)
     1.51788338E-03    2    -1000024        37   # BR(~chi_40 -> ~chi_1-   H+)
     1.74684497E-04    2     1000002        -2   # BR(~chi_40 -> ~u_L      ub)
     1.74684497E-04    2    -1000002         2   # BR(~chi_40 -> ~u_L*     u )
     3.52101376E-02    2     2000002        -2   # BR(~chi_40 -> ~u_R      ub)
     3.52101376E-02    2    -2000002         2   # BR(~chi_40 -> ~u_R*     u )
     1.86085641E-04    2     1000001        -1   # BR(~chi_40 -> ~d_L      db)
     1.86085641E-04    2    -1000001         1   # BR(~chi_40 -> ~d_L*     d )
     1.63918686E-03    2     2000001        -1   # BR(~chi_40 -> ~d_R      db)
     1.63918686E-03    2    -2000001         1   # BR(~chi_40 -> ~d_R*     d )
     1.74681377E-04    2     1000004        -4   # BR(~chi_40 -> ~c_L      cb)
     1.74681377E-04    2    -1000004         4   # BR(~chi_40 -> ~c_L*     c )
     3.52101066E-02    2     2000004        -4   # BR(~chi_40 -> ~c_R      cb)
     3.52101066E-02    2    -2000004         4   # BR(~chi_40 -> ~c_R*     c )
     1.86085641E-04    2     1000003        -3   # BR(~chi_40 -> ~s _L      sb)
     1.86085641E-04    2    -1000003         3   # BR(~chi_40 -> ~s _L*     s )
     1.63918686E-03    2     2000003        -3   # BR(~chi_40 -> ~s _R      sb)
     1.63918686E-03    2    -2000003         3   # BR(~chi_40 -> ~s _R*     s )
     5.91741542E-02    2     1000006        -6   # BR(~chi_40 -> ~t_1      tb)
     5.91741542E-02    2    -1000006         6   # BR(~chi_40 -> ~t_1*     t )
     4.64412404E-03    2     2000006        -6   # BR(~chi_40 -> ~t_2      tb)
     4.64412404E-03    2    -2000006         6   # BR(~chi_40 -> ~t_2*     t )
     2.84776210E-02    2     1000005        -5   # BR(~chi_40 -> ~b_1      bb)
     2.84776210E-02    2    -1000005         5   # BR(~chi_40 -> ~b_1*     b )
     1.00691808E-03    2     2000005        -5   # BR(~chi_40 -> ~b_2      bb)
     1.00691808E-03    2    -2000005         5   # BR(~chi_40 -> ~b_2*     b )
     2.86413341E-02    2     1000011       -11   # BR(~chi_40 -> ~e_L-     e+)
     2.86413341E-02    2    -1000011        11   # BR(~chi_40 -> ~e_L+     e-)
     2.51013910E-02    2     2000011       -11   # BR(~chi_40 -> ~e_R-     e+)
     2.51013910E-02    2    -2000011        11   # BR(~chi_40 -> ~e_R+     e-)
     2.86413341E-02    2     1000013       -13   # BR(~chi_40 -> ~mu_L-    mu+)
     2.86413341E-02    2    -1000013        13   # BR(~chi_40 -> ~mu_L+    mu-)
     2.51013910E-02    2     2000013       -13   # BR(~chi_40 -> ~mu_R-    mu+)
     2.51013910E-02    2    -2000013        13   # BR(~chi_40 -> ~mu_R+    mu-)
     1.08515034E-01    2     1000015       -15   # BR(~chi_40 -> ~tau_1-   tau+)
     1.08515034E-01    2    -1000015        15   # BR(~chi_40 -> ~tau_1+   tau-)
     2.14474119E-02    2     2000015       -15   # BR(~chi_40 -> ~tau_2-   tau+)
     2.14474119E-02    2    -2000015        15   # BR(~chi_40 -> ~tau_2+   tau-)
     2.93317385E-02    2     1000012       -12   # BR(~chi_40 -> ~nu_eL    nu_eb)
     2.93317385E-02    2    -1000012        12   # BR(~chi_40 -> ~nu_eL*   nu_e )
     2.93317385E-02    2     1000014       -14   # BR(~chi_40 -> ~nu_muL   nu_mub)
     2.93317385E-02    2    -1000014        14   # BR(~chi_40 -> ~nu_muL*  nu_mu )
     2.18318651E-02    2     1000016       -16   # BR(~chi_40 -> ~nu_tau1  nu_taub)
     2.18318651E-02    2    -1000016        16   # BR(~chi_40 -> ~nu_tau1* nu_tau )
#
#         PDG            Width
DECAY        25     3.82316389E-03   # h decays
#          BR         NDA      ID1       ID2
     5.91997119E-01    2           5        -5   # BR(h -> b       bb     )
     6.80038995E-02    2         -15        15   # BR(h -> tau+    tau-   )
     2.40716170E-04    2         -13        13   # BR(h -> mu+     mu-    )
     2.63066882E-04    2           3        -3   # BR(h -> s       sb     )
     2.25906889E-02    2           4        -4   # BR(h -> c       cb     )
     8.22044537E-02    2          21        21   # BR(h -> g       g      )
     2.38510597E-03    2          22        22   # BR(h -> gam     gam    )
     1.54684645E-03    2          22        23   # BR(h -> Z       gam    )
     2.05355345E-01    2          24       -24   # BR(h -> W+      W-     )
     2.54127586E-02    2          23        23   # BR(h -> Z       Z      )
#
#         PDG            Width
DECAY        35     3.47158781E+00   # H decays
#          BR         NDA      ID1       ID2
     3.02905940E-01    2           5        -5   # BR(H -> b       bb     )
     4.67460512E-02    2         -15        15   # BR(H -> tau+    tau-   )
     1.65910610E-04    2         -13        13   # BR(H -> mu+     mu-    )
     1.16027678E-04    2           3        -3   # BR(H -> s       sb     )
     6.60419243E-06    2           4        -4   # BR(H -> c       cb     )
     6.39818366E-01    2           6        -6   # BR(H -> t       tb     )
     4.63585650E-04    2          21        21   # BR(H -> g       g      )
     1.33333322E-06    2          22        22   # BR(H -> gam     gam    )
     6.45429778E-07    2          23        22   # BR(H -> Z       gam    )
     4.62402565E-04    2          24       -24   # BR(H -> W+      W-     )
     2.30328886E-04    2          23        23   # BR(H -> Z       Z      )
     1.83825467E-03    2          25        25   # BR(H -> h       h      )
     4.07804479E-03    2     1000024  -1000024   # BR(H -> ~chi_1+ ~chi_1-)
     2.03880977E-03    2     1000022   1000022   # BR(H -> ~chi_10 ~chi_10)
     9.63211319E-05    2     1000011  -1000011   # BR(H -> ~e_L-   ~e_L+  )
     9.63211319E-05    2     1000013  -1000013   # BR(H -> ~mu_L-  ~mu_L+ )
     3.07146731E-04    2     1000015  -1000015   # BR(H -> ~tau_1- ~tau_1+)
     3.13953293E-04    2     1000012  -1000012   # BR(H -> ~nu_eL  ~nu_eL*   )
     3.13953293E-04    2     1000014  -1000014   # BR(H -> ~nu_muL ~nu_muL*  )
#
#         PDG            Width
DECAY        36     3.48908119E+00   # A decays
#          BR         NDA      ID1       ID2
     3.01644353E-01    2           5        -5   # BR(A -> b       bb     )
     4.65217567E-02    2         -15        15   # BR(A -> tau+    tau-   )
     1.65113957E-04    2         -13        13   # BR(A -> mu+     mu-    )
     1.15682192E-04    2           3        -3   # BR(A -> s       sb     )
     6.56755347E-06    2           4        -4   # BR(A -> c       cb     )
     6.43444078E-01    2           6        -6   # BR(A -> t       tb     )
     8.13452224E-04    2          21        21   # BR(A -> g       g      )
     1.65557164E-06    2          22        22   # BR(A -> gam     gam    )
     9.41080486E-07    2          23        22   # BR(A -> Z       gam    )
     4.64137917E-04    2          23        25   # BR(A -> Z       h      )
     4.54845787E-03    2     1000024  -1000024   # BR(A -> ~chi_1+ ~chi_1-)
     2.27380393E-03    2     1000022   1000022   # BR(A -> ~chi_10 ~chi_10)
#
#         PDG            Width
DECAY        37     3.46276060E+00   # H+ decays
#          BR         NDA      ID1       ID2
     5.32258470E-04    2           4        -5   # BR(H+ -> c       bb     )
     4.69198013E-02    2         -15        16   # BR(H+ -> tau+    nu_tau )
     1.66526687E-04    2         -13        14   # BR(H+ -> mu+     nu_mu  )
     5.32246481E-06    2           2        -5   # BR(H+ -> u       bb     )
     5.82053621E-06    2           2        -3   # BR(H+ -> u       sb     )
     1.20909419E-04    2           4        -3   # BR(H+ -> c       sb     )
     9.51024256E-01    2           6        -5   # BR(H+ -> t       bb     )
     4.69659112E-04    2          24        25   # BR(H+ -> W+      h      )
     9.75530826E-12    2          24        36   # BR(H+ -> W+      A      )
     2.44136236E-11    2     1000024   1000022   # BR(H+ -> ~chi_1+ ~chi_10)
     3.77722891E-04    2    -1000011   1000012   # BR(H+ -> ~e_L+   ~nu_eL )
     3.77722891E-04    2    -1000013   1000014   # BR(H+ -> ~mu_L+  ~nu_muL)
