BLOCK AD
      3 3 0.000000e+00

BLOCK AE
      3 3 0.000000e+00

BLOCK ALPHA
      -1.984082e-01

BLOCK AU
      3 3 1.829482e+03

BLOCK MASS
      -2000016 5.000000e+03
      -2000015 5.000667e+03
      -2000014 5.000000e+03
      -2000013 5.000178e+03
      -2000012 5.000000e+03
      -2000011 5.000178e+03
      -2000006 8.973284e+02
      -2000005 5.000058e+03
      -2000004 4.999882e+03
      -2000003 5.000060e+03
      -2000002 4.999881e+03
      -2000001 5.000060e+03
      -1000037 2.003851e+03
      -1000024 5.417001e+02
      -1000016 4.999616e+03
      -1000015 4.999717e+03
      -1000014 4.999616e+03
      -1000013 5.000206e+03
      -1000012 4.999616e+03
      -1000011 5.000206e+03
      -1000006 5.498764e+02
      -1000005 7.332285e+02
      -1000004 4.999735e+03
      -1000003 5.000324e+03
      -1000002 4.999735e+03
      -1000001 5.000324e+03
      -37 2.012380e+03
      -6 1.725000e+02
      6 1.725000e+02
      25 1.260000e+02
      35 2.013424e+03
      36 2.000000e+03
      37 2.012380e+03
      1000001 5.000324e+03
      1000002 4.999735e+03
      1000003 5.000324e+03
      1000004 4.999735e+03
      1000005 7.332285e+02
      1000006 5.498764e+02
      1000011 5.000206e+03
      1000012 4.999616e+03
      1000013 5.000206e+03
      1000014 4.999616e+03
      1000015 4.999717e+03
      1000016 4.999616e+03
      1000021 2.000000e+03
      1000022 5.400001e+02
      1000023 -5.450074e+02
      1000024 5.417001e+02
      1000025 2.000000e+03
      1000035 2.005007e+03
      1000037 2.003851e+03
      1000039 1.000000e-03
      2000001 5.000060e+03
      2000002 4.999881e+03
      2000003 5.000060e+03
      2000004 4.999882e+03
      2000005 5.000058e+03
      2000006 8.973284e+02
      2000011 5.000178e+03
      2000012 5.000000e+03
      2000013 5.000178e+03
      2000014 5.000000e+03
      2000015 5.000667e+03
      2000016 5.000000e+03

BLOCK MINPAR
      3 5.000000e+00
      4 5.439870e+02

BLOCK NMIX
      1 1 2.511524e-02
      1 2 -4.569555e-02
      1 3 7.078742e-01
      1 4 -7.044113e-01
      2 1 -9.652500e-03
      2 2 1.756211e-02
      2 3 7.059703e-01
      2 4 7.079576e-01
      3 1 -8.763562e-01
      3 2 -4.816637e-01
      3 3 0.000000e+00
      3 4 -6.000000e-08
      4 1 4.809118e-01
      4 2 -8.749877e-01
      4 3 -2.279844e-02
      4 4 5.099683e-02

BLOCK SBOTMIX
      1 1 9.999956e-01
      1 2 -2.973896e-03
      2 1 2.973896e-03
      2 2 9.999956e-01

BLOCK STAUMIX
      1 1 6.966042e-01
      1 2 7.174556e-01
      2 1 -7.174556e-01
      2 2 6.966042e-01

BLOCK STOPMIX
      1 1 7.081344e-01
      1 2 -7.060777e-01
      2 1 7.060777e-01
      2 2 7.081344e-01

BLOCK UMIX
      1 1 -2.829714e-02
      1 2 9.995996e-01
      2 1 -9.995996e-01
      2 2 -2.829714e-02

BLOCK VMIX
      1 1 -6.331560e-02
      1 2 9.979935e-01
      2 1 -9.979935e-01
      2 2 -6.331560e-02

DECAY -2000016 6.582118e-55

DECAY -2000015 3.426580e+01
   4.471851e-01 2 1000037 -16
   4.021485e-01 2 1000025 -15
   1.430217e-01 2 1000035 -15
   4.815004e-03 2 1000023 -15
   1.425168e-03 2 1000022 -15
   1.404639e-03 2 1000024 -16

DECAY -2000014 6.582118e-55

DECAY -2000013 1.830247e+01
   7.530232e-01 2 1000025 -13
   2.263331e-01 2 1000035 -13
   1.966103e-02 2 -13 1000039
   8.561726e-04 2 1000022 -13
   1.264083e-04 2 1000023 -13

DECAY -2000012 6.582118e-55

DECAY -2000011 1.830247e+01
   7.530232e-01 2 1000025 -11
   2.263331e-01 2 1000035 -11
   1.966103e-02 2 -11 1000039
   8.561726e-04 2 1000022 -11
   1.264083e-04 2 1000023 -11

DECAY -2000006 2.589346e+01
   5.002809e-01 2 23 -1000006
   2.192352e-01 2 -24 -1000005
   1.154756e-01 2 1000023 -6
   1.117321e-01 2 -1000024 -5
   5.327637e-02 2 1000022 -6

DECAY -2000005 1.902841e+02
   9.771399e-01 2 1000021 -5
   8.047303e-03 2 1000025 -5
   3.486805e-03 2 1000024 -6
   2.418526e-03 2 1000035 -5
   1.826629e-03 2 24 -1000006
   1.792660e-03 2 23 -1000005
   1.763947e-03 2 1000022 -5
   1.739288e-03 2 1000023 -5
   1.707272e-03 2 24 -2000006
   6.168761e-05 2 25 -1000005
   1.601517e-05 2 37 -2000006

DECAY -2000004 1.938997e+02
   9.588823e-01 2 1000021 -4
   3.158767e-02 2 1000025 -4
   9.494172e-03 2 1000035 -4
   3.591609e-05 2 1000022 -4

DECAY -2000003 1.879263e+02
   9.894026e-01 2 1000021 -3
   8.148294e-03 2 1000025 -3
   2.449098e-03 2 1000035 -3

DECAY -2000002 1.938997e+02
   9.588823e-01 2 1000021 -2
   3.158767e-02 2 1000025 -2
   9.494170e-03 2 1000035 -2
   3.591608e-05 2 1000022 -2

DECAY -2000001 1.879263e+02
   9.894026e-01 2 1000021 -1
   8.148294e-03 2 1000025 -1
   2.449098e-03 2 1000035 -1

DECAY -1000037 5.779364e+01
   3.188231e-01 2 1000005 -6
   2.192540e-01 2 -1000006 5
   1.167515e-01 2 -2000006 5
   8.734772e-02 2 -1000024 23
   8.646138e-02 2 1000023 -24
   8.587185e-02 2 1000022 -24
   8.549052e-02 2 -1000024 25

DECAY -1000024 1.122328e-11
   6.000000e-01 3 1000022 -2 1
   2.000000e-01 3 1000022 11 -12
   2.000000e-01 3 1000022 13 -14

DECAY -1000016 4.963141e+01
   5.950829e-01 2 -1000037 -15
   3.875956e-01 2 1000035 -16
   8.392455e-03 2 -1000024 -15
   7.246282e-03 2 -16 1000039
   1.466315e-03 2 1000022 -16
   2.164919e-04 2 1000023 -16

DECAY -1000015 3.379605e+01
   4.235185e-01 2 1000037 -16
   4.078831e-01 2 1000025 -15
   1.411370e-01 2 1000035 -15
   1.064282e-02 2 -15 1000039
   7.110277e-03 2 1000022 -15
   6.999952e-03 2 1000024 -16
   2.708310e-03 2 1000023 -15

DECAY -1000014 4.937823e+01
   5.981152e-01 2 -1000037 -13
   3.895729e-01 2 1000035 -14
   7.283249e-03 2 -14 1000039
   3.337326e-03 2 -1000024 -13
   1.473796e-03 2 1000022 -14
   2.175963e-04 2 1000023 -14

DECAY -1000013 4.936342e+01
   6.003690e-01 2 1000037 -14
   2.792042e-01 2 1000025 -13
   1.119838e-01 2 1000035 -13
   7.290001e-03 2 -13 1000039
   6.669022e-04 2 1000024 -14
   4.236107e-04 2 1000022 -13
   6.254338e-05 2 1000023 -13

DECAY -1000012 4.937823e+01
   5.981152e-01 2 -1000037 -11
   3.895729e-01 2 1000035 -12
   7.283249e-03 2 -12 1000039
   3.337326e-03 2 -1000024 -11
   1.473796e-03 2 1000022 -12
   2.175963e-04 2 1000023 -12

DECAY -1000011 4.936342e+01
   6.003690e-01 2 1000037 -12
   2.792042e-01 2 1000025 -11
   1.119838e-01 2 1000035 -11
   7.290001e-03 2 -11 1000039
   6.669022e-04 2 1000024 -12
   4.236107e-04 2 1000022 -11
   6.254338e-05 2 1000023 -11

DECAY -1000006 2.787144e-03
   1.000000e+00 2 -1000024 -5

DECAY -1000005 8.592283e+00
   9.051708e-01 2 24 -1000006
   9.226724e-02 2 1000024 -6
   1.383694e-03 2 1000022 -5
   1.178325e-03 2 1000023 -5

DECAY -1000004 2.309596e+02
   8.049784e-01 2 1000021 -4
   1.278843e-01 2 -1000037 -3
   3.973364e-02 2 1000035 -4
   2.651766e-02 2 1000025 -4
   7.135491e-04 2 -1000024 -3
   1.503140e-04 2 1000022 -4
   2.219288e-05 2 1000023 -4

DECAY -1000003 2.309596e+02
   8.051161e-01 2 1000021 -3
   1.283195e-01 2 1000037 -4
   5.953279e-02 2 1000035 -3
   6.630618e-03 2 1000025 -3
   2.251959e-04 2 1000022 -3
   1.425376e-04 2 1000024 -4
   3.324871e-05 2 1000023 -3

DECAY -1000002 2.309596e+02
   8.049784e-01 2 1000021 -2
   1.278843e-01 2 -1000037 -1
   3.973363e-02 2 1000035 -2
   2.651766e-02 2 1000025 -2
   7.135489e-04 2 -1000024 -1
   1.503140e-04 2 1000022 -2
   2.219288e-05 2 1000023 -2

DECAY -1000001 2.309596e+02
   8.051160e-01 2 1000021 -1
   1.283196e-01 2 1000037 -2
   5.953279e-02 2 1000035 -1
   6.630617e-03 2 1000025 -1
   2.251959e-04 2 1000022 -1
   1.425376e-04 2 1000024 -2
   3.324871e-05 2 1000023 -1

DECAY -37 1.586053e+01
   4.022079e-01 2 -1000006 1000005
   3.253469e-01 2 -2000006 1000005
   2.647726e-01 2 -6 5
   6.518673e-03 2 -16 15
   6.965775e-04 2 -1000024 1000023
   2.492957e-04 2 -4 3
   1.689501e-04 2 25 -24
   2.275955e-05 2 -14 13
   1.636388e-05 2 -1000024 1000022

DECAY -6 1.146810e+00
   3.333333e-01 3 -2 1 -5
   3.333333e-01 3 -4 3 -5
   1.111111e-01 3 -12 11 -5
   1.111111e-01 3 -14 13 -5
   1.111111e-01 3 -16 15 -5

DECAY 6 1.146810e+00
   3.333333e-01 3 2 -1 5
   3.333333e-01 3 4 -3 5
   1.111111e-01 3 12 -11 5
   1.111111e-01 3 14 -13 5
   1.111111e-01 3 16 -15 5

DECAY 25 4.114595e-03
   5.610000e-01 2 5 -5
   6.150000e-02 2 15 -15
   2.140000e-04 2 13 -13
   2.830000e-02 2 4 -4
   8.480000e-02 2 21 21
   2.280000e-03 2 22 22
   1.620000e-03 2 22 23
   3.850000e-02 3 24 -2 1
   3.850000e-02 3 24 -4 3
   3.850000e-02 3 -24 2 -1
   3.850000e-02 3 -24 4 -3
   1.283333e-02 3 24 11 -12
   1.283333e-02 3 24 13 -14
   1.283333e-02 3 24 15 -16
   1.283333e-02 3 -24 -11 12
   1.283333e-02 3 -24 -13 14
   1.283333e-02 3 -24 -15 16
   4.390199e-03 3 23 1 -1
   4.390199e-03 3 23 3 -3
   4.390199e-03 3 23 5 -5
   3.407888e-03 3 23 2 -2
   3.407888e-03 3 23 4 -4
   1.976471e-03 3 23 12 -12
   1.976471e-03 3 23 14 -14
   1.976471e-03 3 23 16 -16
   9.947377e-04 3 23 11 -11
   9.947377e-04 3 23 13 -13
   9.947377e-04 3 23 15 -15

DECAY 35 1.551179e+01
   4.172809e-01 2 1000006 -1000006
   2.783691e-01 2 2000006 -2000006
   2.307280e-01 2 6 -6
   6.184150e-02 2 5 -5
   6.666056e-03 2 15 -15
   2.087640e-03 2 1000024 -1000024
   7.166824e-04 2 1000022 1000022
   6.235776e-04 2 25 25
   6.229196e-04 2 1000022 1000023
   2.713791e-04 2 3 -3
   2.349096e-04 2 1000023 1000023
   1.739145e-04 2 24 -24
   1.698335e-04 2 1000005 -1000005
   1.012418e-04 2 21 21
   8.902484e-05 2 23 23
   2.327420e-05 2 13 -13

DECAY 36 1.650067e+01
   3.553830e-01 2 1000006 -2000006
   3.553830e-01 2 2000006 -1000006
   2.184443e-01 2 6 -6
   5.781626e-02 2 5 -5
   6.227228e-03 2 15 -15
   3.919527e-03 2 1000024 -1000024
   2.106049e-03 2 1000022 1000022
   2.535257e-04 2 3 -3
   1.612656e-04 2 25 23
   1.370179e-04 2 1000023 1000023
   8.880929e-05 2 21 21
   5.840553e-05 2 1000022 1000023
   2.174198e-05 2 13 -13

DECAY 37 1.586053e+01
   4.022079e-01 2 1000006 -1000005
   3.253469e-01 2 2000006 -1000005
   2.647726e-01 2 6 -5
   6.518673e-03 2 16 -15
   6.965775e-04 2 1000024 1000023
   2.492957e-04 2 4 -3
   1.689501e-04 2 25 24
   2.275955e-05 2 14 -13
   1.636388e-05 2 1000024 1000022

DECAY 1000001 2.309596e+02
   8.051160e-01 2 1000021 1
   1.283196e-01 2 -1000037 2
   5.953279e-02 2 1000035 1
   6.630617e-03 2 1000025 1
   2.251959e-04 2 1000022 1
   1.425376e-04 2 -1000024 2
   3.324871e-05 2 1000023 1

DECAY 1000002 2.309596e+02
   8.049784e-01 2 1000021 2
   1.278843e-01 2 1000037 1
   3.973363e-02 2 1000035 2
   2.651766e-02 2 1000025 2
   7.135489e-04 2 1000024 1
   1.503140e-04 2 1000022 2
   2.219288e-05 2 1000023 2

DECAY 1000003 2.309596e+02
   8.051161e-01 2 1000021 3
   1.283195e-01 2 -1000037 4
   5.953279e-02 2 1000035 3
   6.630618e-03 2 1000025 3
   2.251959e-04 2 1000022 3
   1.425376e-04 2 -1000024 4
   3.324871e-05 2 1000023 3

DECAY 1000004 2.309596e+02
   8.049784e-01 2 1000021 4
   1.278843e-01 2 1000037 3
   3.973364e-02 2 1000035 4
   2.651766e-02 2 1000025 4
   7.135491e-04 2 1000024 3
   1.503140e-04 2 1000022 4
   2.219288e-05 2 1000023 4

DECAY 1000005 8.592283e+00
   9.051708e-01 2 -24 1000006
   9.226724e-02 2 -1000024 6
   1.383694e-03 2 1000022 5
   1.178325e-03 2 1000023 5

DECAY 1000006 2.787144e-03
   1.000000e+00 2 1000024 5

DECAY 1000011 4.936342e+01
   6.003690e-01 2 -1000037 12
   2.792042e-01 2 1000025 11
   1.119838e-01 2 1000035 11
   7.290001e-03 2 11 1000039
   6.669022e-04 2 -1000024 12
   4.236107e-04 2 1000022 11
   6.254338e-05 2 1000023 11

DECAY 1000012 4.937823e+01
   5.981152e-01 2 1000037 11
   3.895729e-01 2 1000035 12
   7.283249e-03 2 12 1000039
   3.337326e-03 2 1000024 11
   1.473796e-03 2 1000022 12
   2.175963e-04 2 1000023 12

DECAY 1000013 4.936342e+01
   6.003690e-01 2 -1000037 14
   2.792042e-01 2 1000025 13
   1.119838e-01 2 1000035 13
   7.290001e-03 2 13 1000039
   6.669022e-04 2 -1000024 14
   4.236107e-04 2 1000022 13
   6.254338e-05 2 1000023 13

DECAY 1000014 4.937823e+01
   5.981152e-01 2 1000037 13
   3.895729e-01 2 1000035 14
   7.283249e-03 2 14 1000039
   3.337326e-03 2 1000024 13
   1.473796e-03 2 1000022 14
   2.175963e-04 2 1000023 14

DECAY 1000015 3.379605e+01
   4.235185e-01 2 -1000037 16
   4.078831e-01 2 1000025 15
   1.411370e-01 2 1000035 15
   1.064282e-02 2 15 1000039
   7.110277e-03 2 1000022 15
   6.999952e-03 2 -1000024 16
   2.708310e-03 2 1000023 15

DECAY 1000016 4.963141e+01
   5.950829e-01 2 1000037 15
   3.875956e-01 2 1000035 16
   8.392455e-03 2 1000024 15
   7.246282e-03 2 16 1000039
   1.466315e-03 2 1000022 16
   2.164919e-04 2 1000023 16

DECAY 1000021 9.715447e+01
   2.237749e-01 2 -1000006 6
   2.237749e-01 2 1000006 -6
   1.657963e-01 2 -1000005 5
   1.657963e-01 2 1000005 -5
   1.104098e-01 2 -2000006 6
   1.104098e-01 2 2000006 -6
   3.792022e-05 2 1000039 21

DECAY 1000022 2.298787e-06
   0.714867 2 1000039 23
   0.285133 2 1000039 25

DECAY 1000023 2.368520e-06
   6.753060e-01 2 1000039 25
   3.230690e-01 2 1000039 23
   2.141548e-04 3 1000022 1 -1
   2.141548e-04 3 1000022 3 -3
   1.660751e-04 3 1000022 2 -2
   1.660751e-04 3 1000022 4 -4
   9.666083e-05 3 1000022 12 -12
   9.666083e-05 3 1000022 14 -14
   9.666083e-05 3 1000022 16 -16
   7.066960e-05 3 -1000024 2 -1
   7.066960e-05 3 1000024 1 -2
   7.066960e-05 3 -1000024 4 -3
   7.066960e-05 3 1000024 3 -4
   5.329448e-05 2 1000022 22
   4.858091e-05 3 1000022 11 -11
   4.858091e-05 3 1000022 13 -13
   2.355653e-05 3 -1000024 12 -11
   2.355653e-05 3 -1000024 14 -13
   2.355653e-05 3 1000024 11 -12
   2.355653e-05 3 1000024 13 -14
   2.355653e-05 3 -1000024 16 -15
   2.355653e-05 3 1000024 15 -16

DECAY 1000024 1.122328e-11
   6.000000e-01 3 1000022 2 -1
   2.000000e-01 3 1000022 -11 12
   2.000000e-01 3 1000022 -13 14

DECAY 1000025 2.691082e+01
   1.957283e-01 2 1000006 -6
   1.957283e-01 2 -1000006 6
   1.713775e-01 2 1000024 -24
   1.713775e-01 2 -1000024 24
   9.657166e-02 2 2000006 -6
   9.657166e-02 2 -2000006 6
   3.625407e-02 2 1000005 -5
   3.625407e-02 2 -1000005 5
   1.369027e-04 2 1000039 22

DECAY 1000035 4.834106e+01
   1.822826e-01 2 1000005 -5
   1.822826e-01 2 -1000005 5
   1.185100e-01 2 1000023 23
   1.151658e-01 2 1000022 25
   9.310202e-02 2 1000006 -6
   9.310202e-02 2 -1000006 6
   5.172860e-02 2 2000006 -6
   5.172860e-02 2 -2000006 6
   3.894922e-02 2 1000024 -24
   3.894922e-02 2 -1000024 24
   1.723315e-02 2 1000022 23
   1.688972e-02 2 1000023 25
   7.641079e-05 2 1000039 23

DECAY 1000037 5.779364e+01
   3.188231e-01 2 -1000005 6
   2.192540e-01 2 1000006 -5
   1.167515e-01 2 2000006 -5
   8.734772e-02 2 1000024 23
   8.646138e-02 2 1000023 24
   8.587185e-02 2 1000022 24
   8.549052e-02 2 1000024 25

DECAY 1000039 6.582118e-55

DECAY 2000001 1.879263e+02
   9.894026e-01 2 1000021 1
   8.148294e-03 2 1000025 1
   2.449098e-03 2 1000035 1

DECAY 2000002 1.938997e+02
   9.588823e-01 2 1000021 2
   3.158767e-02 2 1000025 2
   9.494170e-03 2 1000035 2
   3.591608e-05 2 1000022 2

DECAY 2000003 1.879263e+02
   9.894026e-01 2 1000021 3
   8.148294e-03 2 1000025 3
   2.449098e-03 2 1000035 3

DECAY 2000004 1.938997e+02
   9.588823e-01 2 1000021 4
   3.158767e-02 2 1000025 4
   9.494172e-03 2 1000035 4
   3.591609e-05 2 1000022 4

DECAY 2000005 1.902841e+02
   9.771399e-01 2 1000021 5
   8.047303e-03 2 1000025 5
   3.486805e-03 2 -1000024 6
   2.418526e-03 2 1000035 5
   1.826629e-03 2 -24 1000006
   1.792660e-03 2 23 1000005
   1.763947e-03 2 1000022 5
   1.739288e-03 2 1000023 5
   1.707272e-03 2 -24 2000006
   6.168761e-05 2 25 1000005
   1.601517e-05 2 -37 2000006

DECAY 2000006 2.589346e+01
   5.002809e-01 2 23 1000006
   2.192352e-01 2 24 1000005
   1.154756e-01 2 1000023 6
   1.117321e-01 2 1000024 5
   5.327637e-02 2 1000022 6

DECAY 2000011 1.830247e+01
   7.530232e-01 2 1000025 11
   2.263331e-01 2 1000035 11
   1.966103e-02 2 11 1000039
   8.561726e-04 2 1000022 11
   1.264083e-04 2 1000023 11

DECAY 2000012 6.582118e-55

DECAY 2000013 1.830247e+01
   7.530232e-01 2 1000025 13
   2.263331e-01 2 1000035 13
   1.966103e-02 2 13 1000039
   8.561726e-04 2 1000022 13
   1.264083e-04 2 1000023 13

DECAY 2000014 6.582118e-55

DECAY 2000015 3.426580e+01
   4.471851e-01 2 -1000037 16
   4.021485e-01 2 1000025 15
   1.430217e-01 2 1000035 15
   4.815004e-03 2 1000023 15
   1.425168e-03 2 1000022 15
   1.404639e-03 2 -1000024 16

DECAY 2000016 6.582118e-55


BLOCK MSOFT

BLOCK HMIX
    1 543.987


