#
#                              ======================
#                              | THE SUSYHIT OUTPUT |
#                              ======================
#
#
#              ------------------------------------------------------
#              |     This is the output of the SUSY-HIT package     |
#              |  created by A.Djouadi, M.Muehlleitner and M.Spira. |
#              |  In case of problems with SUSY-HIT email to        |
#              |           margarete.muehlleitner@kit.edu           |
#              |           michael.spira@psi.ch                     |
#              |           abdelhak.djouadi@cern.ch                 |
#              ------------------------------------------------------
#
#              ------------------------------------------------------
#              |  SUSY Les Houches Accord - MSSM Spectrum + Decays  |
#              |              based on the decay programs           |
#              |                                                    |
#              |                     SDECAY 1.4                     |
#              |                                                    |
#              |  Authors: M.Muhlleitner, A.Djouadi and Y.Mambrini  |
#              |  Ref.:    Comput.Phys.Commun.168(2005)46           |
#              |           [hep-ph/0311167]                         |
#              |                                                    |
#              |                     HDECAY 3.4                     |
#              |                                                    |
#              |  By: A.Djouadi,J.Kalinowski,M.Muhlleitner,M.Spira  |
#              |  Ref.:    Comput.Phys.Commun.108(1998)56           |
#              |           [hep-ph/9704448]                         |
#              |                                                    |
#              |                                                    |
#              |  If not stated otherwise all DRbar couplings and   |
#              |  soft SUSY breaking masses are given at the scale  |
#              |  Q=  0.50135861E+04
#              |                                                    |
#              ------------------------------------------------------
#
#
BLOCK DCINFO  # Decay Program information
     1   SDECAY/HDECAY # decay calculator
     2   1.4  /3.4    # version number
#
BLOCK SPINFO  # Spectrum calculator information
     1    SOFTSUSY    # spectrum calculator                
     2    3.3.10       # version number                    
#
BLOCK MODSEL  # Model selection
     1     0   #  ewkh                                             
#
BLOCK SMINPUTS  # Standard Model inputs
         1     1.27944000E+02   # alpha_em^-1(M_Z)^MSbar
         2     1.16637000E-05   # G_F [GeV^-2]
         3     1.18500002E-01   # alpha_S(M_Z)^MSbar
         4     9.11876000E+01   # M_Z pole mass
         5     4.17999983E+00   # mb(mb)^MSbar
         6     1.72990311E+02   # mt pole mass
         7     1.77699000E+00   # mtau pole mass
#
BLOCK MINPAR  # Input parameters - minimal models
         1     5.01187289E+03   # m0                  
         2     2.15877577E+03   # m12                 
         3     3.63208923E+01   # tanb                
         5     1.00000000E+02   # A0                  
#
BLOCK EXTPAR  # Input parameters - non-minimal models
         0     5.01358609E+03   # MX                  
#
BLOCK MASS  # Mass Spectrum
# PDG code           mass       particle
        24     8.03821717E+01   # W+
        25     1.24879579E+02   # h
        35     1.80016766E+03   # H
        36     1.80014775E+03   # A
        37     1.80226626E+03   # H+
         5     4.82046057E+00   # b-quark pole mass calculated from mb(mb)_Msbar
   1000001     5.14179311E+03   # ~d_L
   2000001     5.13346560E+03   # ~d_R
   1000002     5.14131018E+03   # ~u_L
   2000002     5.13446769E+03   # ~u_R
   1000003     5.14179311E+03   # ~s_L
   2000003     5.13346560E+03   # ~s_R
   1000004     5.14131018E+03   # ~c_L
   2000004     5.13446769E+03   # ~c_R
   1000005     5.09878381E+03   # ~b_1
   2000005     5.11091285E+03   # ~b_2
   1000006     5.07317182E+03   # ~t_1
   2000006     5.10162903E+03   # ~t_2
   1000011     5.02235343E+03   # ~e_L
   2000011     5.01908791E+03   # ~e_R
   1000012     5.02138040E+03   # ~nu_eL
   1000013     5.02235343E+03   # ~mu_L
   2000013     5.01908791E+03   # ~mu_R
   1000014     5.02138040E+03   # ~nu_muL
   1000015     5.00474536E+03   # ~tau_1
   2000015     5.01535865E+03   # ~tau_2
   1000016     5.01426640E+03   # ~nu_tauL
   1000021     4.34225421E+03   # ~g
   1000022     1.13191057E+02   # ~chi_10
   1000023    -1.67054695E+02   # ~chi_20
   1000025     2.31047295E+02   # ~chi_30
   1000035     2.14278498E+03   # ~chi_40
   1000024     1.18091676E+02   # ~chi_1+
   1000037     2.35813020E+02   # ~chi_2+
#
BLOCK NMIX  # Neutralino Mixing Matrix
  1  1     1.05672742E-02   # N_11
  1  2    -6.01174934E-01   # N_12
  1  3     6.45454831E-01   # N_13
  1  4    -4.71025575E-01   # N_14
  2  1    -1.32786430E-02   # N_21
  2  2     1.62769255E-01   # N_22
  2  3     6.76123183E-01   # N_23
  2  4     7.18461752E-01   # N_24
  3  1     1.19919384E-02   # N_31
  3  2     7.82364438E-01   # N_32
  3  3     3.55304202E-01   # N_33
  3  4    -5.11391242E-01   # N_34
  4  1     9.99784079E-01   # N_41
  4  2    -8.68118435E-04   # N_42
  4  3    -2.10394019E-03   # N_43
  4  4     2.06546856E-02   # N_44
#
BLOCK UMIX  # Chargino Mixing Matrix U
  1  1    -5.14850444E-01   # U_11
  1  2     8.57280013E-01   # U_12
  2  1    -8.57280013E-01   # U_21
  2  2    -5.14850444E-01   # U_22
#
BLOCK VMIX  # Chargino Mixing Matrix V
  1  1    -7.57109538E-01   # V_11
  1  2     6.53287952E-01   # V_12
  2  1    -6.53287952E-01   # V_21
  2  2    -7.57109538E-01   # V_22
#
BLOCK STOPMIX  # Stop Mixing Matrix
  1  1     1.41684023E-01   # cos(theta_t)
  1  2     9.89911934E-01   # sin(theta_t)
  2  1    -9.89911934E-01   # -sin(theta_t)
  2  2     1.41684023E-01   # cos(theta_t)
#
BLOCK SBOTMIX  # Sbottom Mixing Matrix
  1  1     9.96485426E-01   # cos(theta_b)
  1  2     8.37663164E-02   # sin(theta_b)
  2  1    -8.37663164E-02   # -sin(theta_b)
  2  2     9.96485426E-01   # cos(theta_b)
#
BLOCK STAUMIX  # Stau Mixing Matrix
  1  1     8.68564462E-02   # cos(theta_tau)
  1  2     9.96220838E-01   # sin(theta_tau)
  2  1    -9.96220838E-01   # -sin(theta_tau)
  2  2     8.68564462E-02   # cos(theta_tau)
#
BLOCK ALPHA  # Higgs mixing
          -2.86710673E-02   # Mixing angle in the neutral Higgs boson sector
#
BLOCK HMIX Q=  5.01358609E+03  # DRbar Higgs Parameters
         1     1.52496455E+02   # mu(Q)MSSM           
         2     3.51467296E+01   # tan                 
         3     2.39794807E+02   # higgs               
         4     3.31247240E+06   # mA^2(Q)MSSM         
#
BLOCK GAUGE Q=  5.01358609E+03  # The gauge couplings
     1     3.66365690E-01   # gprime(Q) DRbar
     2     6.43800908E-01   # g(Q) DRbar
     3     9.90181430E-01   # g3(Q) DRbar
#
BLOCK AU Q=  5.01358609E+03  # The trilinear couplings
  1  1     1.00000025E+02   # A_u(Q) DRbar
  2  2     1.00000025E+02   # A_c(Q) DRbar
  3  3     1.00000045E+02   # A_t(Q) DRbar
#
BLOCK AD Q=  5.01358609E+03  # The trilinear couplings
  1  1     1.00000011E+02   # A_d(Q) DRbar
  2  2     1.00000011E+02   # A_s(Q) DRbar
  3  3     1.00000022E+02   # A_b(Q) DRbar
#
BLOCK AE Q=  5.01358609E+03  # The trilinear couplings
  1  1     1.00000007E+02   # A_e(Q) DRbar
  2  2     1.00000007E+02   # A_mu(Q) DRbar
  3  3     1.00000007E+02   # A_tau(Q) DRbar
#
BLOCK Yu Q=  5.01358609E+03  # The Yukawa couplings
  1  1     0.00000000E+00   # y_u(Q) DRbar
  2  2     0.00000000E+00   # y_c(Q) DRbar
  3  3     8.16415677E-01   # y_t(Q) DRbar
#
BLOCK Yd Q=  5.01358609E+03  # The Yukawa couplings
  1  1     0.00000000E+00   # y_d(Q) DRbar
  2  2     0.00000000E+00   # y_s(Q) DRbar
  3  3     4.65912927E-01   # y_b(Q) DRbar
#
BLOCK Ye Q=  5.01358609E+03  # The Yukawa couplings
  1  1     0.00000000E+00   # y_e(Q) DRbar
  2  2     0.00000000E+00   # y_mu(Q) DRbar
  3  3     3.63283619E-01   # y_tau(Q) DRbar
#
BLOCK MSOFT Q=  5.01358609E+03  # The soft SUSY breaking masses at the scale Q
         1     2.15877577E+03   # M_1(Q)              
         2     1.62565393E+02   # M_2(Q)              
         3     3.98107084E+03   # M_3(Q)              
        21     3.53089686E+06   # M^2_Hd              
        22     6.27514210E+05   # M^2_Hu              
        31     5.01187289E+03   # M_eL                
        32     5.01187289E+03   # M_muL               
        33     5.01187289E+03   # M_tauL              
        34     5.01187289E+03   # M_eR                
        35     5.01187289E+03   # M_muR               
        36     5.01187289E+03   # M_tauR              
        41     5.01187287E+03   # M_q1L               
        42     5.01187287E+03   # M_q2L               
        43     5.01187286E+03   # M_q3L               
        44     5.01187287E+03   # M_uR                
        45     5.01187287E+03   # M_cR                
        46     5.01187285E+03   # M_tR                
        47     5.01187287E+03   # M_dR                
        48     5.01187287E+03   # M_sR                
        49     5.01187287E+03   # M_bR                
#
#
#
#                             =================
#                             |The decay table|
#                             =================
#
# - The QCD corrections to the decays gluino -> squark  + quark
#                                     squark -> gaugino + quark_prime
#                                     squark -> squark_prime + Higgs
#                                     squark -> gluino  + quark
#   are included.
#
# - The multi-body decays for the inos, stops and sbottoms are included.
#
# - The loop induced decays for the gluino, neutralinos and stops
#   are included.
#
# - The SUSY decays of the top quark are included.
#
#
#         PDG            Width
DECAY         6     1.45391380E+00   # top decays
#          BR         NDA      ID1       ID2
     1.00000000E+00    2           5        24   # BR(t ->  b    W+)
#
#         PDG            Width
DECAY   1000021     4.85286648E-01   # gluino decays
#          BR         NDA      ID1       ID2
     2.29192125E-04    2     1000022        21   # BR(~g -> ~chi_10 g)
     6.23728333E-04    2     1000023        21   # BR(~g -> ~chi_20 g)
     2.68195431E-04    2     1000025        21   # BR(~g -> ~chi_30 g)
     2.41551192E-07    2     1000035        21   # BR(~g -> ~chi_40 g)
#           BR         NDA      ID1       ID2       ID3
     8.25315419E-03    3     1000022         1        -1   # BR(~g -> ~chi_10 d  db)
     5.65051744E-04    3     1000023         1        -1   # BR(~g -> ~chi_20 d  db)
     1.40926015E-02    3     1000025         1        -1   # BR(~g -> ~chi_30 d  db)
     1.35609778E-03    3     1000035         1        -1   # BR(~g -> ~chi_40 d  db)
     8.14990847E-03    3     1000022         2        -2   # BR(~g -> ~chi_10 u  ub)
     5.33084177E-04    3     1000023         2        -2   # BR(~g -> ~chi_20 u  ub)
     1.42675973E-02    3     1000025         2        -2   # BR(~g -> ~chi_30 u  ub)
     4.60160627E-03    3     1000035         2        -2   # BR(~g -> ~chi_40 u  ub)
     8.25315419E-03    3     1000022         3        -3   # BR(~g -> ~chi_10 s  sb)
     5.65051744E-04    3     1000023         3        -3   # BR(~g -> ~chi_20 s  sb)
     1.40926015E-02    3     1000025         3        -3   # BR(~g -> ~chi_30 s  sb)
     1.35609778E-03    3     1000035         3        -3   # BR(~g -> ~chi_40 s  sb)
     8.14990847E-03    3     1000022         4        -4   # BR(~g -> ~chi_10 c  cb)
     5.33084177E-04    3     1000023         4        -4   # BR(~g -> ~chi_20 c  cb)
     1.42675973E-02    3     1000025         4        -4   # BR(~g -> ~chi_30 c  cb)
     4.60160627E-03    3     1000035         4        -4   # BR(~g -> ~chi_40 c  cb)
     3.78029745E-02    3     1000022         5        -5   # BR(~g -> ~chi_10 b  bb)
     3.25232117E-02    3     1000023         5        -5   # BR(~g -> ~chi_20 b  bb)
     2.37091606E-02    3     1000025         5        -5   # BR(~g -> ~chi_30 b  bb)
     1.41051487E-03    3     1000035         5        -5   # BR(~g -> ~chi_40 b  bb)
     4.91430038E-02    3     1000022         6        -6   # BR(~g -> ~chi_10 t  tb)
     1.06641960E-01    3     1000023         6        -6   # BR(~g -> ~chi_20 t  tb)
     7.75300537E-02    3     1000025         6        -6   # BR(~g -> ~chi_30 t  tb)
     4.67386890E-03    3     1000035         6        -6   # BR(~g -> ~chi_40 t  tb)
     1.89941833E-02    3     1000024         1        -2   # BR(~g -> ~chi_1+ d  ub)
     1.89941833E-02    3    -1000024         2        -1   # BR(~g -> ~chi_1- u  db)
     2.68592745E-02    3     1000037         1        -2   # BR(~g -> ~chi_2+ d  ub)
     2.68592745E-02    3    -1000037         2        -1   # BR(~g -> ~chi_2- u  db)
     1.89941833E-02    3     1000024         3        -4   # BR(~g -> ~chi_1+ s  cb)
     1.89941833E-02    3    -1000024         4        -3   # BR(~g -> ~chi_1- c  sb)
     2.68592745E-02    3     1000037         3        -4   # BR(~g -> ~chi_2+ s  cb)
     2.68592745E-02    3    -1000037         4        -3   # BR(~g -> ~chi_2- c  sb)
     8.32368674E-02    3     1000024         5        -6   # BR(~g -> ~chi_1+ b  tb)
     8.32368674E-02    3    -1000024         6        -5   # BR(~g -> ~chi_1- t  bb)
     1.05959063E-01    3     1000037         5        -6   # BR(~g -> ~chi_2+ b  tb)
     1.05959063E-01    3    -1000037         6        -5   # BR(~g -> ~chi_2- t  bb)
#
#         PDG            Width
DECAY   1000006     1.67131931E+02   # stop1 decays
#          BR         NDA      ID1       ID2
     1.33568556E-01    2     1000022         6   # BR(~t_1 -> ~chi_10 t )
     2.20616358E-01    2     1000023         6   # BR(~t_1 -> ~chi_20 t )
     4.77000106E-02    2     1000025         6   # BR(~t_1 -> ~chi_30 t )
     4.22790579E-02    2     1000035         6   # BR(~t_1 -> ~chi_40 t )
     2.78780918E-01    2     1000024         5   # BR(~t_1 -> ~chi_1+ b )
     1.10374837E-01    2     1000037         5   # BR(~t_1 -> ~chi_2+ b )
     1.66680263E-01    2     1000021         6   # BR(~t_1 -> ~g      t )
#
#         PDG            Width
DECAY   2000006     1.69739995E+02   # stop2 decays
#          BR         NDA      ID1       ID2
     8.16165261E-02    2     1000022         6   # BR(~t_2 -> ~chi_10 t )
     1.83577348E-01    2     1000023         6   # BR(~t_2 -> ~chi_20 t )
     2.27011424E-01    2     1000025         6   # BR(~t_2 -> ~chi_30 t )
     7.46153247E-03    2     1000035         6   # BR(~t_2 -> ~chi_40 t )
     1.17513619E-01    2     1000024         5   # BR(~t_2 -> ~chi_1+ b )
     2.45367122E-01    2     1000037         5   # BR(~t_2 -> ~chi_2+ b )
     1.37452428E-01    2     1000021         6   # BR(~t_2 -> ~g      t )
#
#         PDG            Width
DECAY   1000005     1.73264322E+02   # sbottom1 decays
#          BR         NDA      ID1       ID2
     1.02250764E-01    2     1000022         5   # BR(~b_1 -> ~chi_10 b )
     5.68417906E-02    2     1000023         5   # BR(~b_1 -> ~chi_20 b )
     7.85563794E-02    2     1000025         5   # BR(~b_1 -> ~chi_30 b )
     2.92811270E-03    2     1000035         5   # BR(~b_1 -> ~chi_40 b )
     2.35764928E-01    2    -1000024         6   # BR(~b_1 -> ~chi_1- t )
     3.68598707E-01    2    -1000037         6   # BR(~b_1 -> ~chi_2- t )
     1.55059318E-01    2     1000021         5   # BR(~b_1 -> ~g      b )
#
#         PDG            Width
DECAY   2000005     7.33331033E+01   # sbottom2 decays
#          BR         NDA      ID1       ID2
     1.01172872E-01    2     1000022         5   # BR(~b_2 -> ~chi_10 b )
     1.40070988E-01    2     1000023         5   # BR(~b_2 -> ~chi_20 b )
     5.36213409E-02    2     1000025         5   # BR(~b_2 -> ~chi_30 b )
     2.68271309E-02    2     1000035         5   # BR(~b_2 -> ~chi_40 b )
     1.83234867E-01    2    -1000024         6   # BR(~b_2 -> ~chi_1- t )
     1.19608500E-01    2    -1000037         6   # BR(~b_2 -> ~chi_2- t )
     3.75464301E-01    2     1000021         5   # BR(~b_2 -> ~g      b )
#
#         PDG            Width
DECAY   1000002     9.03428606E+01   # sup_L decays
#          BR         NDA      ID1       ID2
     8.01826409E-02    2     1000022         2   # BR(~u_L -> ~chi_10 u)
     5.73048426E-03    2     1000023         2   # BR(~u_L -> ~chi_20 u)
     1.37158147E-01    2     1000025         2   # BR(~u_L -> ~chi_30 u)
     5.48282378E-03    2     1000035         2   # BR(~u_L -> ~chi_40 u)
     2.56035297E-01    2     1000024         1   # BR(~u_L -> ~chi_1+ d)
     1.90132785E-01    2     1000037         1   # BR(~u_L -> ~chi_2+ d)
     3.25277822E-01    2     1000021         2   # BR(~u_L -> ~g      u)
#
#         PDG            Width
DECAY   2000002     3.69429575E+01   # sup_R decays
#          BR         NDA      ID1       ID2
     3.50659204E-05    2     1000022         2   # BR(~u_R -> ~chi_10 u)
     5.53195583E-05    2     1000023         2   # BR(~u_R -> ~chi_20 u)
     4.50439805E-05    2     1000025         2   # BR(~u_R -> ~chi_30 u)
     2.15974966E-01    2     1000035         2   # BR(~u_R -> ~chi_40 u)
     7.83889605E-01    2     1000021         2   # BR(~u_R -> ~g      u)
#
#         PDG            Width
DECAY   1000001     9.03427171E+01   # sdown_L decays
#          BR         NDA      ID1       ID2
     8.12670875E-02    2     1000022         1   # BR(~d_L -> ~chi_10 d)
     6.09702507E-03    2     1000023         1   # BR(~d_L -> ~chi_20 d)
     1.35585426E-01    2     1000025         1   # BR(~d_L -> ~chi_30 d)
     5.58511720E-03    2     1000035         1   # BR(~d_L -> ~chi_40 d)
     1.18409528E-01    2    -1000024         2   # BR(~d_L -> ~chi_1- u)
     3.27442773E-01    2    -1000037         2   # BR(~d_L -> ~chi_2- u)
     3.25613043E-01    2     1000021         1   # BR(~d_L -> ~g      d)
#
#         PDG            Width
DECAY   2000001     3.08920113E+01   # sdown_R decays
#          BR         NDA      ID1       ID2
     1.04815329E-05    2     1000022         1   # BR(~d_R -> ~chi_10 d)
     1.65355287E-05    2     1000023         1   # BR(~d_R -> ~chi_20 d)
     1.34640536E-05    2     1000025         1   # BR(~d_R -> ~chi_30 d)
     6.45464303E-02    2     1000035         1   # BR(~d_R -> ~chi_40 d)
     9.35413089E-01    2     1000021         1   # BR(~d_R -> ~g      d)
#
#         PDG            Width
DECAY   1000004     9.03428606E+01   # scharm_L decays
#          BR         NDA      ID1       ID2
     8.01826409E-02    2     1000022         4   # BR(~c_L -> ~chi_10 c)
     5.73048426E-03    2     1000023         4   # BR(~c_L -> ~chi_20 c)
     1.37158147E-01    2     1000025         4   # BR(~c_L -> ~chi_30 c)
     5.48282378E-03    2     1000035         4   # BR(~c_L -> ~chi_40 c)
     2.56035297E-01    2     1000024         3   # BR(~c_L -> ~chi_1+ s)
     1.90132785E-01    2     1000037         3   # BR(~c_L -> ~chi_2+ s)
     3.25277822E-01    2     1000021         4   # BR(~c_L -> ~g      c)
#
#         PDG            Width
DECAY   2000004     3.69429575E+01   # scharm_R decays
#          BR         NDA      ID1       ID2
     3.50659204E-05    2     1000022         4   # BR(~c_R -> ~chi_10 c)
     5.53195583E-05    2     1000023         4   # BR(~c_R -> ~chi_20 c)
     4.50439805E-05    2     1000025         4   # BR(~c_R -> ~chi_30 c)
     2.15974966E-01    2     1000035         4   # BR(~c_R -> ~chi_40 c)
     7.83889605E-01    2     1000021         4   # BR(~c_R -> ~g      c)
#
#         PDG            Width
DECAY   1000003     9.03427171E+01   # sstrange_L decays
#          BR         NDA      ID1       ID2
     8.12670875E-02    2     1000022         3   # BR(~s_L -> ~chi_10 s)
     6.09702507E-03    2     1000023         3   # BR(~s_L -> ~chi_20 s)
     1.35585426E-01    2     1000025         3   # BR(~s_L -> ~chi_30 s)
     5.58511720E-03    2     1000035         3   # BR(~s_L -> ~chi_40 s)
     1.18409528E-01    2    -1000024         4   # BR(~s_L -> ~chi_1- c)
     3.27442773E-01    2    -1000037         4   # BR(~s_L -> ~chi_2- c)
     3.25613043E-01    2     1000021         3   # BR(~s_L -> ~g      s)
#
#         PDG            Width
DECAY   2000003     3.08920113E+01   # sstrange_R decays
#          BR         NDA      ID1       ID2
     1.04815329E-05    2     1000022         3   # BR(~s_R -> ~chi_10 s)
     1.65355287E-05    2     1000023         3   # BR(~s_R -> ~chi_20 s)
     1.34640536E-05    2     1000025         3   # BR(~s_R -> ~chi_30 s)
     6.45464303E-02    2     1000035         3   # BR(~s_R -> ~chi_40 s)
     9.35413089E-01    2     1000021         3   # BR(~s_R -> ~g      s)
#
#         PDG            Width
DECAY   1000011     6.64050587E+01   # selectron_L decays
#          BR         NDA      ID1       ID2
     1.10341202E-01    2     1000022        11   # BR(~e_L -> ~chi_10 e-)
     7.49554284E-03    2     1000023        11   # BR(~e_L -> ~chi_20 e-)
     1.93388615E-01    2     1000025        11   # BR(~e_L -> ~chi_30 e-)
     6.73281736E-02    2     1000035        11   # BR(~e_L -> ~chi_40 e-)
     1.65128203E-01    2    -1000024        12   # BR(~e_L -> ~chi_1- nu_e)
     4.56318264E-01    2    -1000037        12   # BR(~e_L -> ~chi_2- nu_e)
#
#         PDG            Width
DECAY   2000011     1.79279226E+01   # selectron_R decays
#          BR         NDA      ID1       ID2
     1.66789475E-04    2     1000022        11   # BR(~e_R -> ~chi_10 e-)
     2.63044474E-04    2     1000023        11   # BR(~e_R -> ~chi_20 e-)
     2.14102017E-04    2     1000025        11   # BR(~e_R -> ~chi_30 e-)
     9.99356064E-01    2     1000035        11   # BR(~e_R -> ~chi_40 e-)
#
#         PDG            Width
DECAY   1000013     6.64050587E+01   # smuon_L decays
#          BR         NDA      ID1       ID2
     1.10341202E-01    2     1000022        13   # BR(~mu_L -> ~chi_10 mu-)
     7.49554284E-03    2     1000023        13   # BR(~mu_L -> ~chi_20 mu-)
     1.93388615E-01    2     1000025        13   # BR(~mu_L -> ~chi_30 mu-)
     6.73281736E-02    2     1000035        13   # BR(~mu_L -> ~chi_40 mu-)
     1.65128203E-01    2    -1000024        14   # BR(~mu_L -> ~chi_1- nu_mu)
     4.56318264E-01    2    -1000037        14   # BR(~mu_L -> ~chi_2- nu_mu)
#
#         PDG            Width
DECAY   2000013     1.79279226E+01   # smuon_R decays
#          BR         NDA      ID1       ID2
     1.66789475E-04    2     1000022        13   # BR(~mu_R -> ~chi_10 mu-)
     2.63044474E-04    2     1000023        13   # BR(~mu_R -> ~chi_20 mu-)
     2.14102017E-04    2     1000025        13   # BR(~mu_R -> ~chi_30 mu-)
     9.99356064E-01    2     1000035        13   # BR(~mu_R -> ~chi_40 mu-)
#
#         PDG            Width
DECAY   1000015     4.43354420E+01   # stau_1 decays
#          BR         NDA      ID1       ID2
     1.49822671E-01    2     1000022        15   # BR(~tau_1 -> ~chi_10  tau-)
     1.27992037E-01    2     1000023        15   # BR(~tau_1 -> ~chi_20  tau-)
     2.18839162E-02    2     1000025        15   # BR(~tau_1 -> ~chi_30  tau-)
     3.99610721E-01    2     1000035        15   # BR(~tau_1 -> ~chi_40  tau-)
     2.57869896E-01    2    -1000024        16   # BR(~tau_1 -> ~chi_1-  nu_tau)
     4.28207581E-02    2    -1000037        16   # BR(~tau_1 -> ~chi_2-  nu_tau)
#
#         PDG            Width
DECAY   2000015     7.91720113E+01   # stau_2 decays
#          BR         NDA      ID1       ID2
     1.46819725E-01    2     1000022        15   # BR(~tau_2 -> ~chi_10  tau-)
     8.62389427E-02    2     1000023        15   # BR(~tau_2 -> ~chi_20  tau-)
     1.91562431E-01    2     1000025        15   # BR(~tau_2 -> ~chi_30  tau-)
     5.76243332E-02    2     1000035        15   # BR(~tau_2 -> ~chi_40  tau-)
     1.15695852E-01    2    -1000024        16   # BR(~tau_2 -> ~chi_1-  nu_tau)
     4.02058716E-01    2    -1000037        16   # BR(~tau_2 -> ~chi_2-  nu_tau)
#
#         PDG            Width
DECAY   1000012     6.64212472E+01   # snu_eL decays
#          BR         NDA      ID1       ID2
     1.14795510E-01    2     1000022        12   # BR(~nu_eL -> ~chi_10 nu_e)
     9.02231185E-03    2     1000023        12   # BR(~nu_eL -> ~chi_20 nu_e)
     1.86675435E-01    2     1000025        12   # BR(~nu_eL -> ~chi_30 nu_e)
     6.76990481E-02    2     1000035        12   # BR(~nu_eL -> ~chi_40 nu_e)
     3.56932677E-01    2     1000024        11   # BR(~nu_eL -> ~chi_1+ e-)
     2.64875018E-01    2     1000037        11   # BR(~nu_eL -> ~chi_2+ e-)
#
#         PDG            Width
DECAY   1000014     6.64212472E+01   # snu_muL decays
#          BR         NDA      ID1       ID2
     1.14795510E-01    2     1000022        14   # BR(~nu_muL -> ~chi_10 nu_mu)
     9.02231185E-03    2     1000023        14   # BR(~nu_muL -> ~chi_20 nu_mu)
     1.86675435E-01    2     1000025        14   # BR(~nu_muL -> ~chi_30 nu_mu)
     6.76990481E-02    2     1000035        14   # BR(~nu_muL -> ~chi_40 nu_mu)
     3.56932677E-01    2     1000024        13   # BR(~nu_muL -> ~chi_1+ mu-)
     2.64875018E-01    2     1000037        13   # BR(~nu_muL -> ~chi_2+ mu-)
#
#         PDG            Width
DECAY   1000016     7.94601056E+01   # snu_tauL decays
#          BR         NDA      ID1       ID2
     9.58221294E-02    2     1000022        16   # BR(~nu_tauL -> ~chi_10 nu_tau)
     7.53108017E-03    2     1000023        16   # BR(~nu_tauL -> ~chi_20 nu_tau)
     1.55820326E-01    2     1000025        16   # BR(~nu_tauL -> ~chi_30 nu_tau)
     5.64384964E-02    2     1000035        16   # BR(~nu_tauL -> ~chi_40 nu_tau)
     4.19563162E-01    2     1000024        15   # BR(~nu_tauL -> ~chi_1+ tau-)
     2.64824806E-01    2     1000037        15   # BR(~nu_tauL -> ~chi_2+ tau-)
#
#         PDG            Width
DECAY   1000024     5.92872939E-09   # chargino1+ decays
#           BR         NDA      ID1       ID2       ID3
     3.51580508E-01    3     1000022         2        -1   # BR(~chi_1+ -> ~chi_10 u    db)
     3.51580508E-01    3     1000022         4        -3   # BR(~chi_1+ -> ~chi_10 c    sb)
     1.17194291E-01    3     1000022       -11        12   # BR(~chi_1+ -> ~chi_10 e+   nu_e)
     1.17194291E-01    3     1000022       -13        14   # BR(~chi_1+ -> ~chi_10 mu+  nu_mu)
     6.24504026E-02    3     1000022       -15        16   # BR(~chi_1+ -> ~chi_10 tau+ nu_tau)
#
#         PDG            Width
DECAY   1000037     3.16258384E-01   # chargino2+ decays
#          BR         NDA      ID1       ID2
     3.52135058E-01    2     1000024        23   # BR(~chi_2+ -> ~chi_1+  Z )
     6.47864942E-01    2     1000022        24   # BR(~chi_2+ -> ~chi_10  W+)
#
#         PDG            Width
DECAY   1000022     0.00000000E+00   # neutralino1 decays
#
#         PDG            Width
DECAY   1000023     5.94434656E-04   # neutralino2 decays
#          BR         NDA      ID1       ID2
     1.66211026E-03    2     1000022        22   # BR(~chi_20 -> ~chi_10 gam)
#           BR         NDA      ID1       ID2       ID3
     4.26839876E-02    3     1000022        -2         2   # BR(~chi_20 -> ~chi_10 ub      u)
     5.53647561E-02    3     1000022        -1         1   # BR(~chi_20 -> ~chi_10 db      d)
     4.26839876E-02    3     1000022        -4         4   # BR(~chi_20 -> ~chi_10 cb      c)
     5.53647561E-02    3     1000022        -3         3   # BR(~chi_20 -> ~chi_10 sb      s)
     5.12757146E-02    3     1000022        -5         5   # BR(~chi_20 -> ~chi_10 bb      b)
     1.26979755E-02    3     1000022       -11        11   # BR(~chi_20 -> ~chi_10 e+      e-)
     1.26979755E-02    3     1000022       -13        13   # BR(~chi_20 -> ~chi_10 mu+     mu-)
     1.25809683E-02    3     1000022       -15        15   # BR(~chi_20 -> ~chi_10 tau+    tau-)
     2.53870585E-02    3     1000022       -12        12   # BR(~chi_20 -> ~chi_10 nu_eb   nu_e)
     2.53870585E-02    3     1000022       -14        14   # BR(~chi_20 -> ~chi_10 nu_mub  nu_mu)
     2.53870627E-02    3     1000022       -16        16   # BR(~chi_20 -> ~chi_10 nu_taub nu_tau)
     1.06214982E-01    3     1000024        -2         1   # BR(~chi_20 -> ~chi_1+ ub      d)
     1.06214982E-01    3    -1000024        -1         2   # BR(~chi_20 -> ~chi_1- db      u)
     1.06214982E-01    3     1000024        -4         3   # BR(~chi_20 -> ~chi_1+ cb      s)
     1.06214982E-01    3    -1000024        -3         4   # BR(~chi_20 -> ~chi_1- sb      c)
     3.54051872E-02    3     1000024       -12        11   # BR(~chi_20 -> ~chi_1+ nu_eb   e-)
     3.54051872E-02    3    -1000024        12       -11   # BR(~chi_20 -> ~chi_1- nu_e    e+)
     3.54051872E-02    3     1000024       -14        13   # BR(~chi_20 -> ~chi_1+ nu_mub  mu-)
     3.54051872E-02    3    -1000024        14       -13   # BR(~chi_20 -> ~chi_1- nu_mu   mu+)
     3.51729569E-02    3     1000024       -16        15   # BR(~chi_20 -> ~chi_1+ nu_taub tau-)
     3.51729569E-02    3    -1000024        16       -15   # BR(~chi_20 -> ~chi_1- nu_tau  tau+)
#
#         PDG            Width
DECAY   1000025     4.67834750E-01   # neutralino3 decays
#          BR         NDA      ID1       ID2
     6.31920683E-04    2     1000022        23   # BR(~chi_30 -> ~chi_10   Z )
     4.99684040E-01    2     1000024       -24   # BR(~chi_30 -> ~chi_1+   W-)
     4.99684040E-01    2    -1000024        24   # BR(~chi_30 -> ~chi_1-   W+)
#
#         PDG            Width
DECAY   1000035     5.88942796E+00   # neutralino4 decays
#          BR         NDA      ID1       ID2
     3.81194863E-02    2     1000022        23   # BR(~chi_40 -> ~chi_10   Z )
     1.42244058E-01    2     1000023        23   # BR(~chi_40 -> ~chi_20   Z )
     5.10582278E-02    2     1000025        23   # BR(~chi_40 -> ~chi_30   Z )
     8.40863759E-02    2     1000024       -24   # BR(~chi_40 -> ~chi_1+   W-)
     8.40863759E-02    2    -1000024        24   # BR(~chi_40 -> ~chi_1-   W+)
     1.41188587E-01    2     1000037       -24   # BR(~chi_40 -> ~chi_2+   W-)
     1.41188587E-01    2    -1000037        24   # BR(~chi_40 -> ~chi_2-   W+)
     5.83921219E-02    2     1000022        25   # BR(~chi_40 -> ~chi_10   h )
     1.08060031E-02    2     1000022        35   # BR(~chi_40 -> ~chi_10   H )
     5.56288547E-03    2     1000022        36   # BR(~chi_40 -> ~chi_10   A )
     9.79731360E-02    2     1000023        25   # BR(~chi_40 -> ~chi_20   h )
     4.38233141E-03    2     1000023        35   # BR(~chi_40 -> ~chi_20   H )
     1.22800199E-02    2     1000023        36   # BR(~chi_40 -> ~chi_20   A )
     8.86513073E-02    2     1000025        25   # BR(~chi_40 -> ~chi_30   h )
     3.23202739E-03    2     1000025        35   # BR(~chi_40 -> ~chi_30   H )
     6.64262722E-04    2     1000025        36   # BR(~chi_40 -> ~chi_30   A )
     1.41089936E-02    2     1000024       -37   # BR(~chi_40 -> ~chi_1+   H-)
     1.41089936E-02    2    -1000024        37   # BR(~chi_40 -> ~chi_1-   H+)
     3.93310984E-03    2     1000037       -37   # BR(~chi_40 -> ~chi_2+   H-)
     3.93310984E-03    2    -1000037        37   # BR(~chi_40 -> ~chi_2-   H+)
#
#         PDG            Width
DECAY        25     4.00560955E-03   # h decays
#          BR         NDA      ID1       ID2
     6.07605517E-01    2           5        -5   # BR(h -> b       bb     )
     6.55641461E-02    2         -15        15   # BR(h -> tau+    tau-   )
     2.32076080E-04    2         -13        13   # BR(h -> mu+     mu-    )
     4.55798119E-04    2           3        -3   # BR(h -> s       sb     )
     1.95680878E-02    2           4        -4   # BR(h -> c       cb     )
     7.01346337E-02    2          21        21   # BR(h -> g       g      )
     2.38377567E-03    2          22        22   # BR(h -> gam     gam    )
     1.54218024E-03    2          22        23   # BR(h -> Z       gam    )
     2.06778442E-01    2          24       -24   # BR(h -> W+      W-     )
     2.57353436E-02    2          23        23   # BR(h -> Z       Z      )
#
#         PDG            Width
DECAY        35     5.31533589E+01   # H decays
#          BR         NDA      ID1       ID2
     4.95755377E-01    2           5        -5   # BR(H -> b       bb     )
     8.67012516E-02    2         -15        15   # BR(H -> tau+    tau-   )
     3.06524998E-04    2         -13        13   # BR(H -> mu+     mu-    )
     3.71325396E-04    2           3        -3   # BR(H -> s       sb     )
     1.10809899E-08    2           4        -4   # BR(H -> c       cb     )
     1.17726799E-03    2           6        -6   # BR(H -> t       tb     )
     1.67409500E-05    2          21        21   # BR(H -> g       g      )
     8.44277440E-08    2          22        22   # BR(H -> gam     gam    )
     8.68738913E-09    2          23        22   # BR(H -> Z       gam    )
     1.82718491E-06    2          24       -24   # BR(H -> W+      W-     )
     9.10462072E-07    2          23        23   # BR(H -> Z       Z      )
     5.57161956E-06    2          25        25   # BR(H -> h       h      )
    -3.53569896E-24    2          36        36   # BR(H -> A       A      )
     3.82321878E-20    2          23        36   # BR(H -> Z       A      )
     1.14322600E-01    2     1000024  -1000024   # BR(H -> ~chi_1+ ~chi_1-)
     2.60425563E-02    2     1000037  -1000037   # BR(H -> ~chi_2+ ~chi_2-)
     6.85790620E-02    2     1000024  -1000037   # BR(H -> ~chi_1+ ~chi_2-)
     6.85790620E-02    2     1000037  -1000024   # BR(H -> ~chi_2+ ~chi_1-)
     4.12100903E-02    2     1000022   1000022   # BR(H -> ~chi_10 ~chi_10)
     3.81479563E-03    2     1000023   1000023   # BR(H -> ~chi_20 ~chi_20)
     1.81019390E-02    2     1000025   1000025   # BR(H -> ~chi_30 ~chi_30)
     1.40859576E-02    2     1000022   1000023   # BR(H -> ~chi_10 ~chi_20)
     1.08942178E-02    2     1000022   1000025   # BR(H -> ~chi_10 ~chi_30)
     5.00328175E-02    2     1000023   1000025   # BR(H -> ~chi_20 ~chi_30)
#
#         PDG            Width
DECAY        36     5.31551809E+01   # A decays
#          BR         NDA      ID1       ID2
     4.95754686E-01    2           5        -5   # BR(A -> b       bb     )
     8.66987812E-02    2         -15        15   # BR(A -> tau+    tau-   )
     3.06515074E-04    2         -13        13   # BR(A -> mu+     mu-    )
     3.71334075E-04    2           3        -3   # BR(A -> s       sb     )
     1.10076827E-08    2           4        -4   # BR(A -> c       cb     )
     1.18899178E-03    2           6        -6   # BR(A -> t       tb     )
     3.37887349E-05    2          21        21   # BR(A -> g       g      )
     2.08465806E-08    2          22        22   # BR(A -> gam     gam    )
     2.10882862E-08    2          23        22   # BR(A -> Z       gam    )
     1.80828598E-06    2          23        25   # BR(A -> Z       h      )
     1.23417708E-01    2     1000024  -1000024   # BR(A -> ~chi_1+ ~chi_1-)
     3.48681455E-02    2     1000037  -1000037   # BR(A -> ~chi_2+ ~chi_2-)
     5.96129110E-02    2     1000024  -1000037   # BR(A -> ~chi_1+ ~chi_2-)
     5.96129110E-02    2     1000037  -1000024   # BR(A -> ~chi_2+ ~chi_1-)
     4.55128278E-02    2     1000022   1000022   # BR(A -> ~chi_10 ~chi_10)
     3.49897030E-03    2     1000023   1000023   # BR(A -> ~chi_20 ~chi_20)
     2.28448885E-02    2     1000025   1000025   # BR(A -> ~chi_30 ~chi_30)
     1.13053429E-02    2     1000022   1000023   # BR(A -> ~chi_10 ~chi_20)
     1.15104298E-02    2     1000022   1000025   # BR(A -> ~chi_10 ~chi_30)
     4.34599071E-02    2     1000023   1000025   # BR(A -> ~chi_20 ~chi_30)
#
#         PDG            Width
DECAY        37     5.23291248E+01   # H+ decays
#          BR         NDA      ID1       ID2
     7.85274916E-04    2           4        -5   # BR(H+ -> c       bb     )
     8.81710319E-02    2         -15        16   # BR(H+ -> tau+    nu_tau )
     3.11720071E-04    2         -13        14   # BR(H+ -> mu+     nu_mu  )
     5.02574332E-06    2           2        -5   # BR(H+ -> u       bb     )
     1.80349861E-05    2           2        -3   # BR(H+ -> u       sb     )
     3.70946367E-04    2           4        -3   # BR(H+ -> c       sb     )
     4.89667825E-01    2           6        -5   # BR(H+ -> t       bb     )
     1.84663366E-06    2          24        25   # BR(H+ -> W+      h      )
     1.07191381E-12    2          24        36   # BR(H+ -> W+      A      )
     2.37376024E-04    2     1000024   1000022   # BR(H+ -> ~chi_1+ ~chi_10)
     5.57646065E-02    2     1000024   1000023   # BR(H+ -> ~chi_1+ ~chi_20)
     1.22567284E-01    2     1000024   1000025   # BR(H+ -> ~chi_1+ ~chi_30)
     1.66087103E-01    2     1000037   1000022   # BR(H+ -> ~chi_2+ ~chi_10)
     7.59282323E-02    2     1000037   1000023   # BR(H+ -> ~chi_2+ ~chi_20)
     8.36923065E-05    2     1000037   1000025   # BR(H+ -> ~chi_2+ ~chi_30)
