#
#                              ======================
#                              | THE SUSYHIT OUTPUT |
#                              ======================
#
#
#              ------------------------------------------------------
#              |     This is the output of the SUSY-HIT package     |
#              |  created by A.Djouadi, M.Muehlleitner and M.Spira. |
#              |  In case of problems with SUSY-HIT email to        |
#              |           margarete.muehlleitner@cern.ch           |
#              |           michael.spira@psi.ch                     |
#              |           abdelhak.djouadi@cern.ch                 |
#              ------------------------------------------------------
#
#              ------------------------------------------------------
#              |  SUSY Les Houches Accord - MSSM Spectrum + Decays  |
#              |              based on the decay programs           |
#              |                                                    |
#              |                     SDECAY 1.3b                    |
#              |                                                    |
#              |  Authors: M.Muhlleitner, A.Djouadi and Y.Mambrini  |
#              |  Ref.:    Comput.Phys.Commun.168(2005)46           |
#              |           [hep-ph/0311167]                         |
#              |                                                    |
#              |                     HDECAY 3.4                     |
#              |                                                    |
#              |  By: A.Djouadi,J.Kalinowski,M.Muhlleitner,M.Spira  |
#              |  Ref.:    Comput.Phys.Commun.108(1998)56           |
#              |           [hep-ph/9704448]                         |
#              |                                                    |
#              |                                                    |
#              |  If not stated otherwise all DRbar couplings and   |
#              |  soft SUSY breaking masses are given at the scale  |
#              |  Q=  0.25012340E+04
#              |                                                    |
#              ------------------------------------------------------
#
#
BLOCK DCINFO  # Decay Program information
     1   SDECAY/HDECAY # decay calculator
     2   1.3b  /3.4    # version number
#
BLOCK SPINFO  # Spectrum calculator information
     1     SOFTSUSY    # spectrum calculator               
     2     3.4.0       # version number                    
#
BLOCK MODSEL  # Model selection
     1     0   #  nonUniversal                                     
#
BLOCK SMINPUTS  # Standard Model inputs
         1     1.27908970E+02   # alpha_em^-1(M_Z)^MSbar
         2     1.16637870E-05   # G_F [GeV^-2]
         3     1.18400000E-01   # alpha_S(M_Z)^MSbar
         4     9.11876000E+01   # M_Z pole mass
         5     4.18000000E+00   # mb(mb)^MSbar
         6     1.73200000E+02   # mt pole mass
         7     1.77700000E+00   # mtau pole mass
#
BLOCK MINPAR  # Input parameters - minimal models
         3     1.54400000E+01   # tanb                
#
BLOCK EXTPAR  # Input parameters - non-minimal models
         0    -1.00000000E+00   # Set                 
         1    -3.64056000E+03   # M_1(MX)             
         2    -3.29800000E+02   # M_2(MX)             
         3     3.80245000E+03   # M_3(MX)             
        11    -3.79774000E+03   # At(MX)              
        12    -2.88967000E+03   # Ab(MX)              
        13     2.64080000E+03   # Atau(MX)            
        23     3.31208000E+03   # mu(MX)              
        26     2.76733000E+03   # mA(pole)            
        31     2.08716000E+03   # meL(MX)             
        32     2.08716000E+03   # mmuL(MX)            
        33     3.58301000E+03   # mtauL(MX)           
        34     1.79522000E+03   # meR(MX)             
        35     1.79522000E+03   # mmuR(MX)            
        36     1.37014000E+03   # mtauR(MX)           
        41     7.76210000E+02   # mqL1(MX)            
        42     7.76210000E+02   # mqL2(MX)            
        43     2.18019000E+03   # mqL3(MX)            
        44     1.94570000E+03   # muR(MX)             
        45     1.94570000E+03   # mcR(MX)             
        46     2.87287000E+03   # mtR(MX)             
        47     2.63846000E+03   # mdR(MX)             
        48     2.63846000E+03   # msR(MX)             
        49     2.70640000E+03   # mbR(MX)             
#
BLOCK MASS  # Mass Spectrum
# PDG code           mass       particle
        24     8.03720166E+01   # W+
        25     1.26462685E+02   # h
        35     2.76724768E+03   # H
        36     2.76732993E+03   # A
        37     2.76873146E+03   # H+
         5     4.81876030E+00   # b-quark pole mass calculated from mb(mb)_Msbar
   1000001     8.67380276E+02   # ~d_L
   2000001     2.72376376E+03   # ~d_R
   1000002     8.63799843E+02   # ~u_L
   2000002     2.02955717E+03   # ~u_R
   1000003     8.67380276E+02   # ~s_L
   2000003     2.72376376E+03   # ~s_R
   1000004     8.63799843E+02   # ~c_L
   2000004     2.02955717E+03   # ~c_R
   1000005     2.25395690E+03   # ~b_1
   2000005     2.78986895E+03   # ~b_2
   1000006     2.23655934E+03   # ~t_1
   2000006     2.92106536E+03   # ~t_2
   1000011     2.09215851E+03   # ~e_L
   2000011     1.80739891E+03   # ~e_R
   1000012     2.09035857E+03   # ~nu_eL
   1000013     2.09215851E+03   # ~mu_L
   2000013     1.80739891E+03   # ~mu_R
   1000014     2.09035857E+03   # ~nu_muL
   1000015     1.38338448E+03   # ~tau_1
   2000015     3.59012844E+03   # ~tau_2
   1000016     3.58884362E+03   # ~nu_tauL
   1000021     3.76937016E+03   # ~g
   1000022    -3.48495788E+02   # ~chi_10
   1000023    -3.33173249E+03   # ~chi_20
   1000025     3.33532102E+03   # ~chi_30
   1000035    -3.59316917E+03   # ~chi_40
   1000024     3.48659384E+02   # ~chi_1+
   1000037     3.33634002E+03   # ~chi_2+
#
BLOCK NMIX  # Neutralino Mixing Matrix
  1  1     2.50291406E-05   # N_11
  1  2     9.99733244E-01   # N_12
  1  3    -2.30878559E-02   # N_13
  1  4    -6.24902259E-04   # N_14
  2  1     9.90541065E-02   # N_21
  2  2     1.66897799E-02   # N_22
  2  3     7.03760158E-01   # N_23
  2  4     7.03300345E-01   # N_24
  3  1     4.77168535E-03   # N_31
  3  2    -1.58838978E-02   # N_32
  3  3    -7.06925985E-01   # N_33
  3  4     7.07093052E-01   # N_34
  4  1     9.95070608E-01   # N_41
  4  2    -1.61035883E-03   # N_42
  4  3    -6.66651461E-02   # N_43
  4  4    -7.34006176E-02   # N_44
#
BLOCK UMIX  # Chargino Mixing Matrix U
  1  1     9.99466998E-01   # U_11
  1  2    -3.26453584E-02   # U_12
  2  1     3.26453584E-02   # U_21
  2  2     9.99466998E-01   # U_22
#
BLOCK VMIX  # Chargino Mixing Matrix V
  1  1    -9.99999612E-01   # V_11
  1  2    -8.80828349E-04   # V_12
  2  1    -8.80828349E-04   # V_21
  2  2     9.99999612E-01   # V_22
#
BLOCK STOPMIX  # Stop Mixing Matrix
  1  1     9.86408286E-01   # cos(theta_t)
  1  2     1.64312791E-01   # sin(theta_t)
  2  1    -1.64312791E-01   # -sin(theta_t)
  2  2     9.86408286E-01   # cos(theta_t)
#
BLOCK SBOTMIX  # Sbottom Mixing Matrix
  1  1     9.99199499E-01   # cos(theta_b)
  1  2     4.00045147E-02   # sin(theta_b)
  2  1    -4.00045147E-02   # -sin(theta_b)
  2  2     9.99199499E-01   # cos(theta_b)
#
BLOCK STAUMIX  # Stau Mixing Matrix
  1  1     7.55922606E-03   # cos(theta_tau)
  1  2     9.99971429E-01   # sin(theta_tau)
  2  1    -9.99971429E-01   # -sin(theta_tau)
  2  2     7.55922606E-03   # cos(theta_tau)
#
BLOCK ALPHA  # Higgs mixing
          -6.76444769E-02   # Mixing angle in the neutral Higgs boson sector
#
BLOCK HMIX Q=  2.50123400E+03  # DRbar Higgs Parameters
         1     3.35236732E+03   # mu(Q)MSSM           
         2     1.47903636E+01   # tan                 
         3     2.43408780E+02   # higgs               
         4     7.67891353E+06   # mA^2(Q)MSSM         
#
BLOCK GAUGE Q=  2.50123400E+03  # The gauge couplings
     1     3.64135962E-01   # gprime(Q) DRbar
     2     6.39402203E-01   # g(Q) DRbar
     3     1.01240482E+00   # g3(Q) DRbar
#
BLOCK AU Q=  2.50123400E+03  # The trilinear couplings
  1  1     0.00000000E+00   # A_u(Q) DRbar
  2  2     0.00000000E+00   # A_c(Q) DRbar
  3  3    -3.79773998E+03   # A_t(Q) DRbar
#
BLOCK AD Q=  2.50123400E+03  # The trilinear couplings
  1  1     0.00000000E+00   # A_d(Q) DRbar
  2  2     0.00000000E+00   # A_s(Q) DRbar
  3  3    -2.88967000E+03   # A_b(Q) DRbar
#
BLOCK AE Q=  2.50123400E+03  # The trilinear couplings
  1  1     0.00000000E+00   # A_e(Q) DRbar
  2  2     0.00000000E+00   # A_mu(Q) DRbar
  3  3     2.64080000E+03   # A_tau(Q) DRbar
#
BLOCK Yu Q=  2.50123400E+03  # The Yukawa couplings
  1  1     0.00000000E+00   # y_u(Q) DRbar
  2  2     0.00000000E+00   # y_c(Q) DRbar
  3  3     8.15786126E-01   # y_t(Q) DRbar
#
BLOCK Yd Q=  2.50123400E+03  # The Yukawa couplings
  1  1     0.00000000E+00   # y_d(Q) DRbar
  2  2     0.00000000E+00   # y_s(Q) DRbar
  3  3     1.74737277E-01   # y_b(Q) DRbar
#
BLOCK Ye Q=  2.50123400E+03  # The Yukawa couplings
  1  1     0.00000000E+00   # y_e(Q) DRbar
  2  2     0.00000000E+00   # y_mu(Q) DRbar
  3  3     1.50857627E-01   # y_tau(Q) DRbar
#
BLOCK MSOFT Q=  2.50123400E+03  # The soft SUSY breaking masses at the scale Q
         1    -3.64056000E+03   # M_1(Q)              
         2    -3.29800000E+02   # M_2(Q)              
         3     3.80245000E+03   # M_3(Q)              
        21    -3.67298084E+06   # mH1^2(Q)            
        22    -1.11055976E+07   # mH2^2(Q)            
        31     2.08716000E+03   # meL(Q)              
        32     2.08716000E+03   # mmuL(Q)             
        33     3.58301000E+03   # mtauL(Q)            
        34     1.79522000E+03   # meR(Q)              
        35     1.79522000E+03   # mmuR(Q)             
        36     1.37014000E+03   # mtauR(Q)            
        41     7.76209960E+02   # mqL1(Q)             
        42     7.76209960E+02   # mqL2(Q)             
        43     2.18018997E+03   # mqL3(Q)             
        44     1.94569998E+03   # muR(Q)              
        45     1.94569998E+03   # mcR(Q)              
        46     2.87286997E+03   # mtR(Q)              
        47     2.63845999E+03   # mdR(Q)              
        48     2.63845999E+03   # msR(Q)              
        49     2.70639999E+03   # mbR(Q)              
#
Block HiggsBoundsInputHiggsCouplingsFermions
# ScalarNormEffCoupSq PseudoSNormEffCoupSq NP   IP1 IP2 IP2
    1.00401604E+00    0.00000000E+00        3  25   5   5  # h0-b-b eff. coupling^2, normalised to SM
    2.18750839E+02    0.00000000E+00        3  35   5   5  # H0-b-b eff. coupling^2, normalised to SM
    0.00000000E+00    2.18754855E+02        3  36   5   5  # A0-b-b eff. coupling^2, normalised to SM
#
    9.99981641E-01    0.00000000E+00        3  25   6   6  # h0-t-t eff. coupling^2, normalised to SM
    4.58968575E-03    0.00000000E+00        3  35   6   6  # H0-t-t eff. coupling^2, normalised to SM
    0.00000000E+00    4.57132711E-03        3  36   6   6  # A0-t-t eff. coupling^2, normalised to SM
#
    1.00401604E+00    0.00000000E+00        3  25  15  15  # h0-tau-tau eff. coupling^2, normalised to SM
    2.18750839E+02    0.00000000E+00        3  35  15  15  # H0-tau-tau eff. coupling^2, normalised to SM
    0.00000000E+00    2.18754855E+02        3  36  15  15  # A0-tau-tau eff. coupling^2, normalised to SM
#
Block HiggsBoundsInputHiggsCouplingsBosons
    9.99999982E-01        3  25  24  24  # h0-W-W eff. coupling^2, normalised to SM
    1.83955291E-08        3  35  24  24  # H0-W-W eff. coupling^2, normalised to SM
    0.00000000E+00        3  36  24  24  # A0-W-W eff. coupling^2, normalised to SM
#
    9.99999982E-01        3  25  23  23  # h0-Z-Z eff. coupling^2, normalised to SM
    1.83955291E-08        3  35  23  23  # H0-Z-Z eff. coupling^2, normalised to SM
    0.00000000E+00        3  36  23  23  # A0-Z-Z eff. coupling^2, normalised to SM
#
    8.86959758E-01        3  25  21  21  # h0-g-g eff. coupling^2, normalised to SM
    7.38228492E-14        3  35  21  21  # H0-g-g eff. coupling^2, normalised to SM
    3.00978282E-12        3  36  21  21  # A0-g-g eff. coupling^2, normalised to SM
#
    0.00000000E+00        3  25  25  23  # h0-h0-Z eff. coupling^2, normalised to SM
    0.00000000E+00        3  35  25  23  # H0-h0-Z eff. coupling^2, normalised to SM
    1.83955291E-08        3  36  25  23  # A0-h0-Z eff. coupling^2, normalised to SM
    0.00000000E+00        3  35  35  23  # H0-H0-Z eff. coupling^2, normalised to SM
    9.99999982E-01        3  36  35  23  # A0-H0-Z eff. coupling^2, normalised to SM
    0.00000000E+00        3  36  36  23  # A0-A0-Z eff. coupling^2, normalised to SM
#
    0.00000000E+00        4  25  21  21  23  # h0-g-g-Z eff. coupling^2, normalised to SM
    0.00000000E+00        4  35  21  21  23  # H0-g-g-Z eff. coupling^2, normalised to SM
    0.00000000E+00        4  36  21  21  23  # A0-g-g-Z eff. coupling^2, normalised to SM
#
#
#
#                             =================
#                             |The decay table|
#                             =================
#
# - The QCD corrections to the decays gluino -> squark  + quark
#                                     squark -> gaugino + quark_prime
#                                     squark -> squark_prime + Higgs
#                                     squark -> gluino  + quark
#   are included.
#
# - The multi-body decays for the inos, stops and sbottoms are included.
#
# - The loop induced decays for the gluino, neutralinos and stops
#   are included.
#
# - The SUSY decays of the top quark are included.
#
#
#         PDG            Width
DECAY         6     1.44065683E+00   # top decays
#          BR         NDA      ID1       ID2
     1.00000000E+00    2           5        24   # BR(t ->  b    W+)
#
#         PDG            Width
DECAY   1000021     4.70307966E+02   # gluino decays
#          BR         NDA      ID1       ID2
     7.18027163E-02    2     1000001        -1   # BR(~g -> ~d_L  db)
     7.18027163E-02    2    -1000001         1   # BR(~g -> ~d_L* d )
     1.82796059E-02    2     2000001        -1   # BR(~g -> ~d_R  db)
     1.82796059E-02    2    -2000001         1   # BR(~g -> ~d_R* d )
     7.18688829E-02    2     1000002        -2   # BR(~g -> ~u_L  ub)
     7.18688829E-02    2    -1000002         2   # BR(~g -> ~u_L* u )
     4.03665946E-02    2     2000002        -2   # BR(~g -> ~u_R  ub)
     4.03665946E-02    2    -2000002         2   # BR(~g -> ~u_R* u )
     7.18027163E-02    2     1000003        -3   # BR(~g -> ~s_L  sb)
     7.18027163E-02    2    -1000003         3   # BR(~g -> ~s_L* s )
     1.82796059E-02    2     2000003        -3   # BR(~g -> ~s_R  sb)
     1.82796059E-02    2    -2000003         3   # BR(~g -> ~s_R* s )
     7.18688814E-02    2     1000004        -4   # BR(~g -> ~c_L  cb)
     7.18688814E-02    2    -1000004         4   # BR(~g -> ~c_L* c )
     4.03665861E-02    2     2000004        -4   # BR(~g -> ~c_R  cb)
     4.03665861E-02    2    -2000004         4   # BR(~g -> ~c_R* c )
     3.31127465E-02    2     1000005        -5   # BR(~g -> ~b_1  bb)
     3.31127465E-02    2    -1000005         5   # BR(~g -> ~b_1* b )
     1.64870543E-02    2     2000005        -5   # BR(~g -> ~b_2  bb)
     1.64870543E-02    2    -2000005         5   # BR(~g -> ~b_2* b )
     3.21751616E-02    2     1000006        -6   # BR(~g -> ~t_1  tb)
     3.21751616E-02    2    -1000006         6   # BR(~g -> ~t_1* t )
     1.35894483E-02    2     2000006        -6   # BR(~g -> ~t_2  tb)
     1.35894483E-02    2    -2000006         6   # BR(~g -> ~t_2* t )
#
#         PDG            Width
DECAY   1000006     2.51568721E+01   # stop1 decays
#          BR         NDA      ID1       ID2
     3.30394257E-01    2     1000022         6   # BR(~t_1 -> ~chi_10 t )
     6.69605743E-01    2     1000024         5   # BR(~t_1 -> ~chi_1+ b )
#
#         PDG            Width
DECAY   2000006     5.62297069E+01   # stop2 decays
#          BR         NDA      ID1       ID2
     5.57426492E-03    2     1000022         6   # BR(~t_2 -> ~chi_10 t )
     1.12358927E-02    2     1000024         5   # BR(~t_2 -> ~chi_1+ b )
     2.36040685E-01    2     1000006        25   # BR(~t_2 -> ~t_1    h )
     2.59908324E-01    2     1000006        23   # BR(~t_2 -> ~t_1    Z )
     4.87236804E-01    2     1000005        24   # BR(~t_2 -> ~b_1    W+)
     4.02983104E-06    2     2000005        24   # BR(~t_2 -> ~b_2    W+)
#
#         PDG            Width
DECAY   1000005     2.59368251E+01   # sbottom1 decays
#          BR         NDA      ID1       ID2
     3.36259969E-01    2     1000022         5   # BR(~b_1 -> ~chi_10 b )
     6.63740031E-01    2    -1000024         6   # BR(~b_1 -> ~chi_1- t )
#
#         PDG            Width
DECAY   2000005     1.88120508E+00   # sbottom2 decays
#          BR         NDA      ID1       ID2
     5.64545732E-03    2     1000022         5   # BR(~b_2 -> ~chi_10 b )
     1.11924466E-02    2    -1000024         6   # BR(~b_2 -> ~chi_1- t )
     2.44081900E-01    2     1000005        25   # BR(~b_2 -> ~b_1    h )
     2.39267963E-01    2     1000005        23   # BR(~b_2 -> ~b_1    Z )
     4.99812233E-01    2     1000006       -24   # BR(~b_2 -> ~t_1    W-)
#
#         PDG            Width
DECAY   1000002     7.77917851E+00   # sup_L decays
#          BR         NDA      ID1       ID2
     3.33297933E-01    2     1000022         2   # BR(~u_L -> ~chi_10 u)
     6.66702067E-01    2     1000024         1   # BR(~u_L -> ~chi_1+ d)
#
#         PDG            Width
DECAY   2000002     2.84579979E-02   # sup_R decays
#           BR         NDA      ID1       ID2
     9.96924721E-08    2     1000022         2   # BR(~u_R -> ~chi_10 u)
#           BR         NDA      ID1       ID2       ID3
     2.14245571E-01    3        2       -1        1000001   # BR(~u_R -> u  db  ~d_L)
     3.23142901E-02    3        2       1        -1000001   # BR(~u_R -> u  d  ~d_L*)
     2.18936695E-01    3        2       -2        1000002   # BR(~u_R -> u  ub  ~u_L)
     3.25152881E-02    3        2       2        -1000002   # BR(~u_R -> u  u  ~u_L*)
     2.17334333E-01    3        2       -3        1000003   # BR(~u_R -> u  sb  ~s_L)
     3.24021389E-02    3        2       3        -1000003   # BR(~u_R -> u  s  ~s_L*)
     2.19439190E-01    3        2       -4        1000004   # BR(~u_R -> u  cb  ~c_L)
     3.25658890E-02    3        2       4        -1000004   # BR(~u_R -> u  c  ~c_L*)
     3.62464009E-07    3        2       -11        2000011   # BR(~u_R -> u  e+  ~e_R-)
     1.26481139E-06    3        2       11        -2000011   # BR(~u_R -> u  e-  ~e_R+)
     3.60601615E-07    3        2       -13        2000013   # BR(~u_R -> u  mu+  ~mu_R-)
     1.25771321E-06    3        2       13        -2000013   # BR(~u_R -> u  mu-  ~mu_R+)
     4.55267445E-05    3        2       -15        1000015   # BR(~u_R -> u  tau+  ~tau_1-)
     1.97122089E-04    3        2       15        -1000015   # BR(~u_R -> u  tau-  ~tau_1+)
     1.24931487E-07    3        2       23        1000022   # BR(~u_R -> u  Z  ~chi_10)
     8.81755635E-08    3        2       25        1000022   # BR(~u_R -> u  h  ~chi_10)
     3.69105376E-07    3        2       -24        1000024   # BR(~u_R -> u  W-  ~chi_1+)
     2.90371797E-08    3        2       24        -1000024   # BR(~u_R -> u  W+  ~chi_1-)
#
#         PDG            Width
DECAY   1000001     7.82933002E+00   # sdown_L decays
#          BR         NDA      ID1       ID2
     3.33529723E-01    2     1000022         1   # BR(~d_L -> ~chi_10 d)
     6.66470277E-01    2    -1000024         2   # BR(~d_L -> ~chi_1- u)
#
#         PDG            Width
DECAY   2000001     1.85069547E-01   # sdown_R decays
#           BR         NDA      ID1       ID2
     5.19478275E-09    2     1000022         1   # BR(~d_R -> ~chi_10 d)
#           BR         NDA      ID1       ID2       ID3
     1.96234338E-01    3        1       -1        1000001   # BR(~d_R -> d  db  ~d_L)
     4.81408214E-02    3        1       1        -1000001   # BR(~d_R -> d  d  ~d_L*)
     1.99568220E-01    3        1       -2        1000002   # BR(~d_R -> d  ub  ~u_L)
     4.79657521E-02    3        1       2        -1000002   # BR(~d_R -> d  u  ~u_L*)
     1.35565253E-03    3        1       -2        2000002   # BR(~d_R -> d  ub  ~u_R)
     3.36932797E-03    3        1       2        -2000002   # BR(~d_R -> d  u  ~u_R*)
     1.98817151E-01    3        1       -3        1000003   # BR(~d_R -> d  sb  ~s_L)
     4.79500823E-02    3        1       3        -1000003   # BR(~d_R -> d  s  ~s_L*)
     2.01729569E-01    3        1       -4        1000004   # BR(~d_R -> d  cb  ~c_L)
     4.85239206E-02    3        1       4        -1000004   # BR(~d_R -> d  c  ~c_L*)
     1.32366456E-03    3        1       -4        2000004   # BR(~d_R -> d  cb  ~c_R)
     3.37040864E-03    3        1       4        -2000004   # BR(~d_R -> d  c  ~c_R*)
     5.64058225E-04    3        1       -5        1000005   # BR(~d_R -> d  bb  ~b_1)
     2.46188532E-04    3        1       5        -1000005   # BR(~d_R -> d  b  ~b_1*)
     3.27017605E-04    3        1       -6        1000006   # BR(~d_R -> d  tb  ~t_1)
     1.27697941E-04    3        1       6        -1000006   # BR(~d_R -> d  t  ~t_1*)
     2.00573247E-06    3        1       -11        1000011   # BR(~d_R -> d  e+  ~e_L-)
     9.27489168E-07    3        1       11        -1000011   # BR(~d_R -> d  e-  ~e_L+)
     1.66196981E-05    3        1       -11        2000011   # BR(~d_R -> d  e+  ~e_R-)
     4.04004880E-05    3        1       11        -2000011   # BR(~d_R -> d  e-  ~e_R+)
     2.02437411E-06    3        1       -12        1000012   # BR(~d_R -> d  nu_eb  ~nu_eL)
     9.25381852E-07    3        1       12        -1000012   # BR(~d_R -> d  nu_e  ~nu_eL*)
     2.00492197E-06    3        1       -13        1000013   # BR(~d_R -> d  mu+  ~mu_L-)
     9.18897803E-07    3        1       13        -1000013   # BR(~d_R -> d  mu-  ~mu_L+)
     1.65386475E-05    3        1       -13        2000013   # BR(~d_R -> d  mu+  ~mu_R-)
     4.01784093E-05    3        1       13        -2000013   # BR(~d_R -> d  mu-  ~mu_R+)
     2.01302703E-06    3        1       -14        1000014   # BR(~d_R -> d  nu_mub  ~nu_muL)
     9.01985242E-07    3        1       14        -1000014   # BR(~d_R -> d  nu_mu  ~nu_muL*)
     6.76610508E-05    3        1       -15        1000015   # BR(~d_R -> d  tau+  ~tau_1-)
     1.92695128E-04    3        1       15        -1000015   # BR(~d_R -> d  tau-  ~tau_1+)
     5.82970034E-08    3        1       23        1000022   # BR(~d_R -> d  Z  ~chi_10)
     5.04956118E-08    3        1       25        1000022   # BR(~d_R -> d  h  ~chi_10)
     1.64116682E-07    3        1       -24        1000024   # BR(~d_R -> d  W-  ~chi_1+)
     3.62112520E-08    3        1       24        -1000024   # BR(~d_R -> d  W+  ~chi_1-)
#
#         PDG            Width
DECAY   1000004     7.38398972E+00   # scharm_L decays
#          BR         NDA      ID1       ID2
     3.33296155E-01    2     1000022         4   # BR(~c_L -> ~chi_10 c)
     6.66703845E-01    2     1000024         3   # BR(~c_L -> ~chi_1+ s)
#
#         PDG            Width
DECAY   2000004     2.83903699E-02   # scharm_R decays
#           BR         NDA      ID1       ID2
     9.89080441E-08    2     1000022         4   # BR(~c_R -> ~chi_10 c)
#           BR         NDA      ID1       ID2       ID3
     2.14777053E-01    3        4       -1        1000001   # BR(~c_R -> c  db  ~d_L)
     3.24796754E-02    3        4       1        -1000001   # BR(~c_R -> c  d  ~d_L*)
     2.19120075E-01    3        4       -2        1000002   # BR(~c_R -> c  ub  ~u_L)
     3.28421223E-02    3        4       2        -1000002   # BR(~c_R -> c  u  ~u_L*)
     2.15622411E-01    3        4       -3        1000003   # BR(~c_R -> c  sb  ~s_L)
     3.23229321E-02    3        4       3        -1000003   # BR(~c_R -> c  s  ~s_L*)
     2.19919642E-01    3        4       -4        1000004   # BR(~c_R -> c  cb  ~c_L)
     3.26653017E-02    3        4       4        -1000004   # BR(~c_R -> c  c  ~c_L*)
     3.60157336E-07    3        4       -11        2000011   # BR(~c_R -> c  e+  ~e_R-)
     1.27648918E-06    3        4       11        -2000011   # BR(~c_R -> c  e-  ~e_R+)
     3.63785327E-07    3        4       -13        2000013   # BR(~c_R -> c  mu+  ~mu_R-)
     1.26349181E-06    3        4       13        -2000013   # BR(~c_R -> c  mu-  ~mu_R+)
     4.53604516E-05    3        4       -15        1000015   # BR(~c_R -> c  tau+  ~tau_1-)
     2.01452113E-04    3        4       15        -1000015   # BR(~c_R -> c  tau-  ~tau_1+)
     1.25200905E-07    3        4       23        1000022   # BR(~c_R -> c  Z  ~chi_10)
     8.82376667E-08    3        4       25        1000022   # BR(~c_R -> c  h  ~chi_10)
     3.68822246E-07    3        4       -24        1000024   # BR(~c_R -> c  W-  ~chi_1+)
     2.90559793E-08    3        4       24        -1000024   # BR(~c_R -> c  W+  ~chi_1-)
#
#         PDG            Width
DECAY   1000003     7.43305601E+00   # sstrange_L decays
#          BR         NDA      ID1       ID2
     3.33531231E-01    2     1000022         3   # BR(~s_L -> ~chi_10 s)
     6.66468769E-01    2    -1000024         4   # BR(~s_L -> ~chi_1- c)
#
#         PDG            Width
DECAY   2000003     1.85061338E-01   # sstrange_R decays
#           BR         NDA      ID1       ID2
     5.22942180E-09    2     1000022         3   # BR(~s_R -> ~chi_10 s)
#           BR         NDA      ID1       ID2       ID3
     1.96243043E-01    3        3       -1        1000001   # BR(~s_R -> s  db  ~d_L)
     4.82839912E-02    3        3       1        -1000001   # BR(~s_R -> s  d  ~d_L*)
     1.99577072E-01    3        3       -2        1000002   # BR(~s_R -> s  ub  ~u_L)
     4.79678798E-02    3        3       2        -1000002   # BR(~s_R -> s  u  ~u_L*)
     1.35571267E-03    3        3       -2        2000002   # BR(~s_R -> s  ub  ~u_R)
     3.37844743E-03    3        3       2        -2000002   # BR(~s_R -> s  u  ~u_R*)
     1.98825970E-01    3        3       -3        1000003   # BR(~s_R -> s  sb  ~s_L)
     4.81429569E-02    3        3       3        -1000003   # BR(~s_R -> s  s  ~s_L*)
     2.01738518E-01    3        3       -4        1000004   # BR(~s_R -> s  cb  ~c_L)
     4.81602484E-02    3        3       4        -1000004   # BR(~s_R -> s  c  ~c_L*)
     1.32231834E-03    3        3       -4        2000004   # BR(~s_R -> s  cb  ~c_R)
     3.34948406E-03    3        3       4        -2000004   # BR(~s_R -> s  c  ~c_R*)
     5.64083245E-04    3        3       -5        1000005   # BR(~s_R -> s  bb  ~b_1)
     2.46199452E-04    3        3       5        -1000005   # BR(~s_R -> s  b  ~b_1*)
     3.28010165E-04    3        3       -6        1000006   # BR(~s_R -> s  tb  ~t_1)
     1.27703605E-04    3        3       6        -1000006   # BR(~s_R -> s  t  ~t_1*)
     2.00582145E-06    3        3       -11        1000011   # BR(~s_R -> s  e+  ~e_L-)
     9.27530310E-07    3        3       11        -1000011   # BR(~s_R -> s  e-  ~e_L+)
     1.65199281E-05    3        3       -11        2000011   # BR(~s_R -> s  e+  ~e_R-)
     4.04022801E-05    3        3       11        -2000011   # BR(~s_R -> s  e-  ~e_R+)
     2.02446391E-06    3        3       -12        1000012   # BR(~s_R -> s  nu_eb  ~nu_eL)
     9.25422901E-07    3        3       12        -1000012   # BR(~s_R -> s  nu_e  ~nu_eL*)
     2.00501090E-06    3        3       -13        1000013   # BR(~s_R -> s  mu+  ~mu_L-)
     9.18938564E-07    3        3       13        -1000013   # BR(~s_R -> s  mu-  ~mu_L+)
     1.65393811E-05    3        3       -13        2000013   # BR(~s_R -> s  mu+  ~mu_R-)
     4.01801916E-05    3        3       13        -2000013   # BR(~s_R -> s  mu-  ~mu_R+)
     2.02646325E-06    3        3       -14        1000014   # BR(~s_R -> s  nu_mub  ~nu_muL)
     9.02025253E-07    3        3       14        -1000014   # BR(~s_R -> s  nu_mu  ~nu_muL*)
     6.76640521E-05    3        3       -15        1000015   # BR(~s_R -> s  tau+  ~tau_1-)
     1.95005615E-04    3        3       15        -1000015   # BR(~s_R -> s  tau-  ~tau_1+)
     5.82995894E-08    3        3       23        1000022   # BR(~s_R -> s  Z  ~chi_10)
     5.07474987E-08    3        3       25        1000022   # BR(~s_R -> s  h  ~chi_10)
     1.64123962E-07    3        3       -24        1000024   # BR(~s_R -> s  W-  ~chi_1+)
     3.62128583E-08    3        3       24        -1000024   # BR(~s_R -> s  W+  ~chi_1-)
#
#         PDG            Width
DECAY   1000011     2.41060509E+01   # selectron_L decays
#          BR         NDA      ID1       ID2
     3.33469974E-01    2     1000022        11   # BR(~e_L -> ~chi_10 e-)
     6.66530026E-01    2    -1000024        12   # BR(~e_L -> ~chi_1- nu_e)
#
#         PDG            Width
DECAY   2000011     3.00027557E-05   # selectron_R decays
#           BR         NDA      ID1       ID2
     1.84571212E-04    2     1000022        11   # BR(~e_R -> ~chi_10 e-)
#           BR         NDA      ID1       ID2       ID3
     2.00334932E-01    3        11       -1        1000001   # BR(~e_R- -> e-  db  ~d_L)
     2.79347674E-02    3        11       1        -1000001   # BR(~e_R- -> e-  d  ~d_L*)
     2.06597690E-01    3        11       -2        1000002   # BR(~e_R- -> e-  ub  ~u_L)
     2.79577653E-02    3        11       2        -1000002   # BR(~e_R- -> e-  u  ~u_L*)
     1.98755077E-01    3        11       -3        1000003   # BR(~e_R- -> e-  sb  ~s_L)
     2.78374430E-02    3        11       3        -1000003   # BR(~e_R- -> e-  s  ~s_L*)
     2.04527880E-01    3        11       -4        1000004   # BR(~e_R- -> e-  cb  ~c_L)
     2.83413967E-02    3        11       4        -1000004   # BR(~e_R- -> e-  c  ~c_L*)
     1.26868346E-02    3        11       -15        1000015   # BR(~e_R- -> e-  tau+  ~tau_1-)
     6.42707631E-02    3        11       15        -1000015   # BR(~e_R- -> e-  tau-  ~tau_1+)
     1.19435696E-04    3        11       23        1000022   # BR(~e_R- -> e-  Z  ~chi_10)
     7.77361929E-05    3        11       25        1000022   # BR(~e_R- -> e-  h  ~chi_10)
     3.48634643E-04    3        11       -24        1000024   # BR(~e_R- -> e-  W-  ~chi_1+)
     2.50746968E-05    3        11       24        -1000024   # BR(~e_R- -> e-  W+  ~chi_1-)
#
#         PDG            Width
DECAY   1000013     2.41060508E+01   # smuon_L decays
#          BR         NDA      ID1       ID2
     3.33469973E-01    2     1000022        13   # BR(~mu_L -> ~chi_10 mu-)
     6.66530027E-01    2    -1000024        14   # BR(~mu_L -> ~chi_1- nu_mu)
#
#         PDG            Width
DECAY   2000013     3.00972351E-05   # smuon_R decays
#           BR         NDA      ID1       ID2
     1.83991815E-04    2     1000022        13   # BR(~mu_R -> ~chi_10 mu-)
#           BR         NDA      ID1       ID2       ID3
     1.99722665E-01    3        13       -1        1000001   # BR(~mu_R- -> mu-  db  ~d_L)
     2.74290977E-02    3        13       1        -1000001   # BR(~mu_R- -> mu-  d  ~d_L*)
     2.06374439E-01    3        13       -2        1000002   # BR(~mu_R- -> mu-  ub  ~u_L)
     2.78700020E-02    3        13       2        -1000002   # BR(~mu_R- -> mu-  u  ~u_L*)
     1.99938632E-01    3        13       -3        1000003   # BR(~mu_R- -> mu-  sb  ~s_L)
     2.77500574E-02    3        13       3        -1000003   # BR(~mu_R- -> mu-  s  ~s_L*)
     2.04726447E-01    3        13       -4        1000004   # BR(~mu_R- -> mu-  cb  ~c_L)
     2.87199139E-02    3        13       4        -1000004   # BR(~mu_R- -> mu-  c  ~c_L*)
     1.26466767E-02    3        13       -15        1000015   # BR(~mu_R- -> mu-  tau+  ~tau_1-)
     6.40690082E-02    3        13       15        -1000015   # BR(~mu_R- -> mu-  tau-  ~tau_1+)
     1.19060771E-04    3        13       23        1000022   # BR(~mu_R- -> mu-  Z  ~chi_10)
     7.74921681E-05    3        13       25        1000022   # BR(~mu_R- -> mu-  h  ~chi_10)
     3.47540230E-04    3        13       -24        1000024   # BR(~mu_R- -> mu-  W-  ~chi_1+)
     2.49763807E-05    3        13       24        -1000024   # BR(~mu_R- -> mu-  W+  ~chi_1-)
#
#         PDG            Width
DECAY   1000015     3.44621121E-03   # stau_1 decays
#          BR         NDA      ID1       ID2
     3.33463854E-01    2     1000022        15   # BR(~tau_1 -> ~chi_10  tau-)
     6.66536146E-01    2    -1000024        16   # BR(~tau_1 -> ~chi_1-  nu_tau)
#
#         PDG            Width
DECAY   2000015     4.40311058E+01   # stau_2 decays
#          BR         NDA      ID1       ID2
     3.25167407E-01    2     1000022        15   # BR(~tau_2 -> ~chi_10  tau-)
     3.83812419E-04    2     1000023        15   # BR(~tau_2 -> ~chi_20  tau-)
     3.47589554E-04    2     1000025        15   # BR(~tau_2 -> ~chi_30  tau-)
     6.49919072E-01    2    -1000024        16   # BR(~tau_2 -> ~chi_1-  nu_tau)
     1.46202107E-05    2    -1000037        16   # BR(~tau_2 -> ~chi_2-  nu_tau)
     1.21974864E-02    2     1000015        25   # BR(~tau_2 -> ~tau_1   h)
     1.19700123E-02    2     1000015        23   # BR(~tau_2 -> ~tau_1   Z)
#
#         PDG            Width
DECAY   1000012     2.40995966E+01   # snu_eL decays
#          BR         NDA      ID1       ID2
     3.33220537E-01    2     1000022        12   # BR(~nu_eL -> ~chi_10 nu_e)
     6.66779463E-01    2     1000024        11   # BR(~nu_eL -> ~chi_1+ e-)
#
#         PDG            Width
DECAY   1000014     2.40995965E+01   # snu_muL decays
#          BR         NDA      ID1       ID2
     3.33220538E-01    2     1000022        14   # BR(~nu_muL -> ~chi_10 nu_mu)
     6.66779462E-01    2     1000024        13   # BR(~nu_muL -> ~chi_1+ mu-)
#
#         PDG            Width
DECAY   1000016     4.40105056E+01   # snu_tauL decays
#          BR         NDA      ID1       ID2
     3.25217043E-01    2     1000022        16   # BR(~nu_tauL -> ~chi_10 nu_tau)
     9.98606857E-06    2     1000023        16   # BR(~nu_tauL -> ~chi_20 nu_tau)
     2.13149985E-06    2     1000025        16   # BR(~nu_tauL -> ~chi_30 nu_tau)
     6.50826913E-01    2     1000024        15   # BR(~nu_tauL -> ~chi_1+ tau-)
     6.79754178E-04    2     1000037        15   # BR(~nu_tauL -> ~chi_2+ tau-)
     2.32641725E-02    2    -1000015       -24   # BR(~nu_tauL -> ~tau_1+ W-)
#
#         PDG            Width
DECAY   1000024     3.49561770E-15   # chargino1+ decays
#           BR         NDA      ID1       ID2       ID3
     1.95966080E-02    3     1000022       -11        12   # BR(~chi_1+ -> ~chi_10 e+   nu_e)
     2.15227480E-03    3     1000022       -13        14   # BR(~chi_1+ -> ~chi_10 mu+  nu_mu)
     9.78251120E-01    2     1000022       211             # BR(~chi_1+ -> ~chi_10 pi+)
#
#         PDG            Width
DECAY   1000037     4.56184853E+01   # chargino2+ decays
#          BR         NDA      ID1       ID2
     5.90862878E-07    2     1000002        -1   # BR(~chi_2+ -> ~u_L     db)
     8.10652108E-04    2    -1000001         2   # BR(~chi_2+ -> ~d_L*    u )
     5.90862877E-07    2     1000004        -3   # BR(~chi_2+ -> ~c_L     sb)
     8.10652078E-04    2    -1000003         4   # BR(~chi_2+ -> ~s_L*     c )
     3.17849411E-02    2     1000006        -5   # BR(~chi_2+ -> ~t_1     bb)
     7.70262004E-02    2     2000006        -5   # BR(~chi_2+ -> ~t_2     bb)
     4.22253402E-01    2    -1000005         6   # BR(~chi_2+ -> ~b_1*    t )
     5.26743536E-03    2    -2000005         6   # BR(~chi_2+ -> ~b_2*    t )
     8.51478627E-08    2     1000012       -11   # BR(~chi_2+ -> ~nu_eL   e+  )
     8.51478627E-08    2     1000014       -13   # BR(~chi_2+ -> ~nu_muL mu+ )
     1.16698815E-04    2    -1000011        12   # BR(~chi_2+ -> ~e_L+    nu_e)
     1.16698815E-04    2    -1000013        14   # BR(~chi_2+ -> ~mu_L+   nu_mu)
     1.13162765E-02    2    -1000015        16   # BR(~chi_2+ -> ~tau_1+  nu_tau)
     1.35880856E-01    2     1000024        23   # BR(~chi_2+ -> ~chi_1+  Z )
     1.32174592E-01    2     1000022        24   # BR(~chi_2+ -> ~chi_10  W+)
     1.43968485E-01    2     1000024        25   # BR(~chi_2+ -> ~chi_1+  h )
     1.28443295E-02    2     1000024        35   # BR(~chi_2+ -> ~chi_1+  H )
     1.28390438E-02    2     1000024        36   # BR(~chi_2+ -> ~chi_1+  A )
     1.27883852E-02    2     1000022        37   # BR(~chi_2+ -> ~chi_10  H+)
#
#         PDG            Width
DECAY   1000022     0.00000000E+00   # neutralino1 decays
#
#         PDG            Width
DECAY   1000023     4.42257119E+01   # neutralino2 decays
#          BR         NDA      ID1       ID2
     6.55163734E-02    2     1000022        23   # BR(~chi_20 -> ~chi_10   Z )
     1.34626048E-01    2     1000024       -24   # BR(~chi_20 -> ~chi_1+   W-)
     1.34626048E-01    2    -1000024        24   # BR(~chi_20 -> ~chi_1-   W+)
     7.88333222E-02    2     1000022        25   # BR(~chi_20 -> ~chi_10   h )
     1.11418611E-02    2     1000022        35   # BR(~chi_20 -> ~chi_10   H )
     1.79257735E-03    2     1000022        36   # BR(~chi_20 -> ~chi_10   A )
     1.28718623E-02    2     1000024       -37   # BR(~chi_20 -> ~chi_1+   H-)
     1.28718623E-02    2    -1000024        37   # BR(~chi_20 -> ~chi_1-   H+)
     4.93989107E-04    2     1000002        -2   # BR(~chi_20 -> ~u_L      ub)
     4.93989107E-04    2    -1000002         2   # BR(~chi_20 -> ~u_L*     u )
     1.01599391E-03    2     2000002        -2   # BR(~chi_20 -> ~u_R      ub)
     1.01599391E-03    2    -2000002         2   # BR(~chi_20 -> ~u_R*     u )
     1.75000438E-06    2     1000001        -1   # BR(~chi_20 -> ~d_L      db)
     1.75000438E-06    2    -1000001         1   # BR(~chi_20 -> ~d_L*     d )
     7.18806073E-05    2     2000001        -1   # BR(~chi_20 -> ~d_R      db)
     7.18806073E-05    2    -2000001         1   # BR(~chi_20 -> ~d_R*     d )
     4.93989089E-04    2     1000004        -4   # BR(~chi_20 -> ~c_L      cb)
     4.93989089E-04    2    -1000004         4   # BR(~chi_20 -> ~c_L*     c )
     1.01599347E-03    2     2000004        -4   # BR(~chi_20 -> ~c_R      cb)
     1.01599347E-03    2    -2000004         4   # BR(~chi_20 -> ~c_R*     c )
     1.75000438E-06    2     1000003        -3   # BR(~chi_20 -> ~s _L      sb)
     1.75000438E-06    2    -1000003         3   # BR(~chi_20 -> ~s _L*     s )
     7.18806073E-05    2     2000003        -3   # BR(~chi_20 -> ~s _R      sb)
     7.18806073E-05    2    -2000003         3   # BR(~chi_20 -> ~s _R*     s )
     2.03818214E-01    2     1000006        -6   # BR(~chi_20 -> ~t_1      tb)
     2.03818214E-01    2    -1000006         6   # BR(~chi_20 -> ~t_1*     t )
     4.38618733E-02    2     2000006        -6   # BR(~chi_20 -> ~t_2      tb)
     4.38618733E-02    2    -2000006         6   # BR(~chi_20 -> ~t_2*     t )
     1.01117041E-02    2     1000005        -5   # BR(~chi_20 -> ~b_1      bb)
     1.01117041E-02    2    -1000005         5   # BR(~chi_20 -> ~b_1*     b )
     3.05239377E-03    2     2000005        -5   # BR(~chi_20 -> ~b_2      bb)
     3.05239377E-03    2    -2000005         5   # BR(~chi_20 -> ~b_2*     b )
     3.00290193E-04    2     1000011       -11   # BR(~chi_20 -> ~e_L-     e+)
     3.00290193E-04    2    -1000011        11   # BR(~chi_20 -> ~e_L+     e-)
     9.71083404E-04    2     2000011       -11   # BR(~chi_20 -> ~e_R-     e+)
     9.71083404E-04    2    -2000011        11   # BR(~chi_20 -> ~e_R+     e-)
     3.00290193E-04    2     1000013       -13   # BR(~chi_20 -> ~mu_L-    mu+)
     3.00290193E-04    2    -1000013        13   # BR(~chi_20 -> ~mu_L+    mu-)
     9.71083404E-04    2     2000013       -13   # BR(~chi_20 -> ~mu_R-    mu+)
     9.71083404E-04    2    -2000013        13   # BR(~chi_20 -> ~mu_R+    mu-)
     7.12814113E-03    2     1000015       -15   # BR(~chi_20 -> ~tau_1-   tau+)
     7.12814113E-03    2    -1000015        15   # BR(~chi_20 -> ~tau_1+   tau-)
     8.88611444E-05    2     1000012       -12   # BR(~chi_20 -> ~nu_eL    nu_eb)
     8.88611444E-05    2    -1000012        12   # BR(~chi_20 -> ~nu_eL*   nu_e )
     8.88611444E-05    2     1000014       -14   # BR(~chi_20 -> ~nu_muL   nu_mub)
     8.88611444E-05    2    -1000014        14   # BR(~chi_20 -> ~nu_muL*  nu_mu )
#
#         PDG            Width
DECAY   1000025     4.56012738E+01   # neutralino3 decays
#          BR         NDA      ID1       ID2
     7.16116067E-02    2     1000022        23   # BR(~chi_30 -> ~chi_10   Z )
     1.32171668E-01    2     1000024       -24   # BR(~chi_30 -> ~chi_1+   W-)
     1.32171668E-01    2    -1000024        24   # BR(~chi_30 -> ~chi_1-   W+)
     6.66738575E-02    2     1000022        25   # BR(~chi_30 -> ~chi_10   h )
     1.79089965E-03    2     1000022        35   # BR(~chi_30 -> ~chi_10   H )
     1.09912124E-02    2     1000022        36   # BR(~chi_30 -> ~chi_10   A )
     1.27252024E-02    2     1000024       -37   # BR(~chi_30 -> ~chi_1+   H-)
     1.27252024E-02    2    -1000024        37   # BR(~chi_30 -> ~chi_1-   H+)
     8.54263733E-05    2     1000002        -2   # BR(~chi_30 -> ~u_L      ub)
     8.54263733E-05    2    -1000002         2   # BR(~chi_30 -> ~u_L*     u )
     2.29459247E-06    2     2000002        -2   # BR(~chi_30 -> ~u_R      ub)
     2.29459247E-06    2    -2000002         2   # BR(~chi_30 -> ~u_R*     u )
     1.07214448E-04    2     1000001        -1   # BR(~chi_30 -> ~d_L      db)
     1.07214448E-04    2    -1000001         1   # BR(~chi_30 -> ~d_L*     d )
     1.63318533E-07    2     2000001        -1   # BR(~chi_30 -> ~d_R      db)
     1.63318533E-07    2    -2000001         1   # BR(~chi_30 -> ~d_R*     d )
     8.54263702E-05    2     1000004        -4   # BR(~chi_30 -> ~c_L      cb)
     8.54263702E-05    2    -1000004         4   # BR(~chi_30 -> ~c_L*     c )
     2.29459148E-06    2     2000004        -4   # BR(~chi_30 -> ~c_R      cb)
     2.29459148E-06    2    -2000004         4   # BR(~chi_30 -> ~c_R*     c )
     1.07214448E-04    2     1000003        -3   # BR(~chi_30 -> ~s _L      sb)
     1.07214448E-04    2    -1000003         3   # BR(~chi_30 -> ~s _L*     s )
     1.63318533E-07    2     2000003        -3   # BR(~chi_30 -> ~s _R      sb)
     1.63318533E-07    2    -2000003         3   # BR(~chi_30 -> ~s _R*     s )
     2.29508639E-01    2     1000006        -6   # BR(~chi_30 -> ~t_1      tb)
     2.29508639E-01    2    -1000006         6   # BR(~chi_30 -> ~t_1*     t )
     3.11105783E-02    2     2000006        -6   # BR(~chi_30 -> ~t_2      tb)
     3.11105783E-02    2    -2000006         6   # BR(~chi_30 -> ~t_2*     t )
     9.81244347E-03    2     1000005        -5   # BR(~chi_30 -> ~b_1      bb)
     9.81244347E-03    2    -1000005         5   # BR(~chi_30 -> ~b_1*     b )
     3.01772334E-03    2     2000005        -5   # BR(~chi_30 -> ~b_2      bb)
     3.01772334E-03    2    -2000005         5   # BR(~chi_30 -> ~b_2*     b )
     9.48457963E-06    2     1000011       -11   # BR(~chi_30 -> ~e_L-     e+)
     9.48457963E-06    2    -1000011        11   # BR(~chi_30 -> ~e_L+     e-)
     2.19179114E-06    2     2000011       -11   # BR(~chi_30 -> ~e_R-     e+)
     2.19179114E-06    2    -2000011        11   # BR(~chi_30 -> ~e_R+     e-)
     9.48457963E-06    2     1000013       -13   # BR(~chi_30 -> ~mu_L-    mu+)
     9.48457963E-06    2    -1000013        13   # BR(~chi_30 -> ~mu_L+    mu-)
     2.19179114E-06    2     2000013       -13   # BR(~chi_30 -> ~mu_R-    mu+)
     2.19179114E-06    2    -2000013        13   # BR(~chi_30 -> ~mu_R+    mu-)
     5.66846168E-03    2     1000015       -15   # BR(~chi_30 -> ~tau_1-   tau+)
     5.66846168E-03    2    -1000015        15   # BR(~chi_30 -> ~tau_1+   tau-)
     1.89730887E-05    2     1000012       -12   # BR(~chi_30 -> ~nu_eL    nu_eb)
     1.89730887E-05    2    -1000012        12   # BR(~chi_30 -> ~nu_eL*   nu_e )
     1.89730887E-05    2     1000014       -14   # BR(~chi_30 -> ~nu_muL   nu_mub)
     1.89730887E-05    2    -1000014        14   # BR(~chi_30 -> ~nu_muL*  nu_mu )
#
#         PDG            Width
DECAY   1000035     8.04575164E+01   # neutralino4 decays
#          BR         NDA      ID1       ID2
     4.04897677E-04    2     1000022        23   # BR(~chi_40 -> ~chi_10   Z )
     1.32849733E-05    2     1000023        23   # BR(~chi_40 -> ~chi_20   Z )
     3.97139955E-03    2     1000025        23   # BR(~chi_40 -> ~chi_30   Z )
     8.65527742E-04    2     1000024       -24   # BR(~chi_40 -> ~chi_1+   W-)
     8.65527742E-04    2    -1000024        24   # BR(~chi_40 -> ~chi_1-   W+)
     4.01048604E-03    2     1000037       -24   # BR(~chi_40 -> ~chi_2+   W-)
     4.01048604E-03    2    -1000037        24   # BR(~chi_40 -> ~chi_2-   W+)
     5.17774570E-04    2     1000022        25   # BR(~chi_40 -> ~chi_10   h )
     6.94721877E-05    2     1000022        35   # BR(~chi_40 -> ~chi_10   H )
     1.74703540E-05    2     1000022        36   # BR(~chi_40 -> ~chi_10   A )
     5.63371260E-03    2     1000023        25   # BR(~chi_40 -> ~chi_20   h )
     7.79960047E-06    2     1000025        25   # BR(~chi_40 -> ~chi_30   h )
     8.68163027E-05    2     1000024       -37   # BR(~chi_40 -> ~chi_1+   H-)
     8.68163027E-05    2    -1000024        37   # BR(~chi_40 -> ~chi_1-   H+)
     8.25084213E-03    2     1000002        -2   # BR(~chi_40 -> ~u_L      ub)
     8.25084213E-03    2    -1000002         2   # BR(~chi_40 -> ~u_L*     u )
     7.06023063E-02    2     2000002        -2   # BR(~chi_40 -> ~u_R      ub)
     7.06023063E-02    2    -2000002         2   # BR(~chi_40 -> ~u_R*     u )
     8.52848188E-03    2     1000001        -1   # BR(~chi_40 -> ~d_L      db)
     8.52848188E-03    2    -1000001         1   # BR(~chi_40 -> ~d_L*     d )
     6.97080929E-03    2     2000001        -1   # BR(~chi_40 -> ~d_R      db)
     6.97080929E-03    2    -2000001         1   # BR(~chi_40 -> ~d_R*     d )
     8.25084191E-03    2     1000004        -4   # BR(~chi_40 -> ~c_L      cb)
     8.25084191E-03    2    -1000004         4   # BR(~chi_40 -> ~c_L*     c )
     7.06022867E-02    2     2000004        -4   # BR(~chi_40 -> ~c_R      cb)
     7.06022867E-02    2    -2000004         4   # BR(~chi_40 -> ~c_R*     c )
     8.52848188E-03    2     1000003        -3   # BR(~chi_40 -> ~s _L      sb)
     8.52848188E-03    2    -1000003         3   # BR(~chi_40 -> ~s _L*     s )
     6.97080929E-03    2     2000003        -3   # BR(~chi_40 -> ~s _R      sb)
     6.97080929E-03    2    -2000003         3   # BR(~chi_40 -> ~s _R*     s )
     1.06305033E-02    2     1000006        -6   # BR(~chi_40 -> ~t_1      tb)
     1.06305033E-02    2    -1000006         6   # BR(~chi_40 -> ~t_1*     t )
     1.47347386E-02    2     2000006        -6   # BR(~chi_40 -> ~t_2      tb)
     1.47347386E-02    2    -2000006         6   # BR(~chi_40 -> ~t_2*     t )
     3.60504231E-03    2     1000005        -5   # BR(~chi_40 -> ~b_1      bb)
     3.60504231E-03    2    -1000005         5   # BR(~chi_40 -> ~b_1*     b )
     6.21149042E-03    2     2000005        -5   # BR(~chi_40 -> ~b_2      bb)
     6.21149042E-03    2    -2000005         5   # BR(~chi_40 -> ~b_2*     b )
     1.26681222E-02    2     1000011       -11   # BR(~chi_40 -> ~e_L-     e+)
     1.26681222E-02    2    -1000011        11   # BR(~chi_40 -> ~e_L+     e-)
     6.50871913E-02    2     2000011       -11   # BR(~chi_40 -> ~e_R-     e+)
     6.50871913E-02    2    -2000011        11   # BR(~chi_40 -> ~e_R+     e-)
     1.26681222E-02    2     1000013       -13   # BR(~chi_40 -> ~mu_L-    mu+)
     1.26681222E-02    2    -1000013        13   # BR(~chi_40 -> ~mu_L+    mu-)
     6.50871913E-02    2     2000013       -13   # BR(~chi_40 -> ~mu_R-    mu+)
     6.50871913E-02    2    -2000013        13   # BR(~chi_40 -> ~mu_R+    mu-)
     8.46506561E-02    2     1000015       -15   # BR(~chi_40 -> ~tau_1-   tau+)
     8.46506561E-02    2    -1000015        15   # BR(~chi_40 -> ~tau_1+   tau-)
     6.32191972E-08    2     2000015       -15   # BR(~chi_40 -> ~tau_2-   tau+)
     6.32191972E-08    2    -2000015        15   # BR(~chi_40 -> ~tau_2+   tau-)
     1.28355570E-02    2     1000012       -12   # BR(~chi_40 -> ~nu_eL    nu_eb)
     1.28355570E-02    2    -1000012        12   # BR(~chi_40 -> ~nu_eL*   nu_e )
     1.28355570E-02    2     1000014       -14   # BR(~chi_40 -> ~nu_muL   nu_mub)
     1.28355570E-02    2    -1000014        14   # BR(~chi_40 -> ~nu_muL*  nu_mu )
     1.69802967E-07    2     1000016       -16   # BR(~chi_40 -> ~nu_tau1  nu_taub)
     1.69802967E-07    2    -1000016        16   # BR(~chi_40 -> ~nu_tau1* nu_tau )
#
#         PDG            Width
DECAY        25     4.75742359E-03   # h decays
#          BR         NDA      ID1       ID2
     6.19203537E-01    2           5        -5   # BR(h -> b       bb     )
     5.52476950E-02    2         -15        15   # BR(h -> tau+    tau-   )
     1.95553246E-04    2         -13        13   # BR(h -> mu+     mu-    )
     2.12795190E-04    2           3        -3   # BR(h -> s       sb     )
     1.84011603E-02    2           4        -4   # BR(h -> c       cb     )
     6.93523621E-02    2          21        21   # BR(h -> g       g      )
     2.08088966E-03    2          22        22   # BR(h -> gam     gam    )
     1.49220077E-03    2          22        23   # BR(h -> Z       gam    )
     2.07406460E-01    2          24       -24   # BR(h -> W+      W-     )
     2.64073463E-02    2          23        23   # BR(h -> Z       Z      )
#
#         PDG            Width
DECAY        35     8.24422505E+00   # H decays
#          BR         NDA      ID1       ID2
     7.78604753E-01    2           5        -5   # BR(H -> b       bb     )
     1.53587318E-01    2         -15        15   # BR(H -> tau+    tau-   )
     5.46017476E-04    2         -13        13   # BR(H -> mu+     mu-    )
     2.16208489E-04    2           3        -3   # BR(H -> s       sb     )
     6.39078290E-07    2           4        -4   # BR(H -> c       cb     )
     6.26816889E-02    2           6        -6   # BR(H -> t       tb     )
     1.97753131E-05    2          21        21   # BR(H -> g       g      )
     1.53028946E-08    2          22        22   # BR(H -> gam     gam    )
     3.09242534E-08    2          23        22   # BR(H -> Z       gam    )
     1.51809136E-05    2          24       -24   # BR(H -> W+      W-     )
     7.57192676E-06    2          23        23   # BR(H -> Z       Z      )
     9.83527992E-05    2          25        25   # BR(H -> h       h      )
     2.74633980E-03    2     1000024  -1000024   # BR(H -> ~chi_1+ ~chi_1-)
     1.37303875E-03    2     1000022   1000022   # BR(H -> ~chi_10 ~chi_10)
     2.08816939E-05    2     1000002  -1000002   # BR(H -> ~u_L    ~u_L*  )
     2.08816939E-05    2     1000004  -1000004   # BR(H -> ~c_L    ~c_L*  )
     3.05812084E-05    2     1000001  -1000001   # BR(H -> ~d_L    ~d_L*  )
     3.05812084E-05    2     1000003  -1000003   # BR(H -> ~s_L    ~s_L*  )
     1.43793808E-07    2     1000015  -1000015   # BR(H -> ~tau_1- ~tau_1+)
#
#         PDG            Width
DECAY        36     8.25004672E+00   # A decays
#          BR         NDA      ID1       ID2
     7.78208331E-01    2           5        -5   # BR(A -> b       bb     )
     1.53486559E-01    2         -15        15   # BR(A -> tau+    tau-   )
     5.45658342E-04    2         -13        13   # BR(A -> mu+     mu-    )
     2.16135903E-04    2           3        -3   # BR(A -> s       sb     )
     6.41972223E-07    2           4        -4   # BR(A -> c       cb     )
     6.30371874E-02    2           6        -6   # BR(A -> t       tb     )
     1.26196793E-04    2          21        21   # BR(A -> g       g      )
     1.05257021E-07    2          22        22   # BR(A -> gam     gam    )
     1.24233191E-07    2          23        22   # BR(A -> Z       gam    )
     1.53594389E-05    2          23        25   # BR(A -> Z       h      )
     2.90931402E-03    2     1000024  -1000024   # BR(A -> ~chi_1+ ~chi_1-)
     1.45438661E-03    2     1000022   1000022   # BR(A -> ~chi_10 ~chi_10)
#
#         PDG            Width
DECAY        37     6.84137381E+00   # H+ decays
#          BR         NDA      ID1       ID2
     1.24243725E-03    2           4        -5   # BR(H+ -> c       bb     )
     1.85183945E-01    2         -15        16   # BR(H+ -> tau+    nu_tau )
     6.58345363E-04    2         -13        14   # BR(H+ -> mu+     nu_mu  )
     1.24243431E-05    2           2        -5   # BR(H+ -> u       bb     )
     1.30346594E-05    2           2        -3   # BR(H+ -> u       sb     )
     2.57304036E-04    2           4        -3   # BR(H+ -> c       sb     )
     8.12491278E-01    2           6        -5   # BR(H+ -> t       bb     )
     1.85639328E-05    2          24        25   # BR(H+ -> W+      h      )
     1.03983873E-12    2          24        36   # BR(H+ -> W+      A      )
     1.79176484E-11    2     1000024   1000022   # BR(H+ -> ~chi_1+ ~chi_10)
     6.13334792E-05    2     1000002  -1000001   # BR(H+ -> ~u_L    ~d_L*  )
     6.13334792E-05    2     1000004  -1000003   # BR(H+ -> ~c_L    ~s_L*  )
