#
#                              ======================
#                              | THE SUSYHIT OUTPUT |
#                              ======================
#
#
#              ------------------------------------------------------
#              |     This is the output of the SUSY-HIT package     |
#              |  created by A.Djouadi, M.Muehlleitner and M.Spira. |
#              |  In case of problems with SUSY-HIT email to        |
#              |           margarete.muehlleitner@cern.ch           |
#              |           michael.spira@psi.ch                     |
#              |           abdelhak.djouadi@cern.ch                 |
#              ------------------------------------------------------
#
#              ------------------------------------------------------
#              |  SUSY Les Houches Accord - MSSM Spectrum + Decays  |
#              |              based on the decay programs           |
#              |                                                    |
#              |                     SDECAY 1.3b                    |
#              |                                                    |
#              |  Authors: M.Muhlleitner, A.Djouadi and Y.Mambrini  |
#              |  Ref.:    Comput.Phys.Commun.168(2005)46           |
#              |           [hep-ph/0311167]                         |
#              |                                                    |
#              |                     HDECAY 3.4                     |
#              |                                                    |
#              |  By: A.Djouadi,J.Kalinowski,M.Muhlleitner,M.Spira  |
#              |  Ref.:    Comput.Phys.Commun.108(1998)56           |
#              |           [hep-ph/9704448]                         |
#              |                                                    |
#              |                                                    |
#              |  If not stated otherwise all DRbar couplings and   |
#              |  soft SUSY breaking masses are given at the scale  |
#              |  Q=  0.25060170E+04
#              |                                                    |
#              ------------------------------------------------------
#
#
BLOCK DCINFO  # Decay Program information
     1   SDECAY/HDECAY # decay calculator
     2   1.3b  /3.4    # version number
#
BLOCK SPINFO  # Spectrum calculator information
     1     SOFTSUSY    # spectrum calculator               
     2     3.4.0       # version number                    
#
BLOCK MODSEL  # Model selection
     1     0   #  nonUniversal                                     
#
BLOCK SMINPUTS  # Standard Model inputs
         1     1.27908970E+02   # alpha_em^-1(M_Z)^MSbar
         2     1.16637870E-05   # G_F [GeV^-2]
         3     1.18400000E-01   # alpha_S(M_Z)^MSbar
         4     9.11876000E+01   # M_Z pole mass
         5     4.18000000E+00   # mb(mb)^MSbar
         6     1.73200000E+02   # mt pole mass
         7     1.77700000E+00   # mtau pole mass
#
BLOCK MINPAR  # Input parameters - minimal models
         3     3.54700000E+01   # tanb                
#
BLOCK EXTPAR  # Input parameters - non-minimal models
         0    -1.00000000E+00   # Set                 
         1    -2.54505000E+03   # M_1(MX)             
         2    -3.02541000E+03   # M_2(MX)             
         3     2.96407000E+03   # M_3(MX)             
        11     3.65523000E+03   # At(MX)              
        12    -2.92919000E+03   # Ab(MX)              
        13     2.64613000E+03   # Atau(MX)            
        23     1.99580000E+02   # mu(MX)              
        26     2.50084000E+03   # mA(pole)            
        31     2.53562000E+03   # meL(MX)             
        32     2.53562000E+03   # mmuL(MX)            
        33     1.01869000E+03   # mtauL(MX)           
        34     3.75922000E+03   # meR(MX)             
        35     3.75922000E+03   # mmuR(MX)            
        36     3.96821000E+03   # mtauR(MX)           
        41     2.00935000E+03   # mqL1(MX)            
        42     2.00935000E+03   # mqL2(MX)            
        43     1.61537000E+03   # mqL3(MX)            
        44     1.59927000E+03   # muR(MX)             
        45     1.59927000E+03   # mcR(MX)             
        46     3.88539000E+03   # mtR(MX)             
        47     2.48820000E+02   # mdR(MX)             
        48     2.48820000E+02   # msR(MX)             
        49     2.27150000E+03   # mbR(MX)             
#
BLOCK MASS  # Mass Spectrum
# PDG code           mass       particle
        24     8.03976840E+01   # W+
        25     1.26453619E+02   # h
        35     2.50084707E+03   # H
        36     2.50083983E+03   # A
        37     2.50247980E+03   # H+
         5     4.81876030E+00   # b-quark pole mass calculated from mb(mb)_Msbar
   1000001     2.13459468E+03   # ~d_L
   2000001     5.30356679E+02   # ~d_R
   1000002     2.13321758E+03   # ~u_L
   2000002     1.71166832E+03   # ~u_R
   1000003     2.13459468E+03   # ~s_L
   2000003     5.30356679E+02   # ~s_R
   1000004     2.13321758E+03   # ~c_L
   2000004     1.71166832E+03   # ~c_R
   1000005     1.72719238E+03   # ~b_1
   2000005     2.35750979E+03   # ~b_2
   1000006     1.72549668E+03   # ~t_1
   2000006     3.90184818E+03   # ~t_2
   1000011     2.55732123E+03   # ~e_L
   2000011     3.76611970E+03   # ~e_R
   1000012     2.55575822E+03   # ~nu_eL
   1000013     2.55732123E+03   # ~mu_L
   2000013     3.76611970E+03   # ~mu_R
   1000014     2.55575822E+03   # ~nu_muL
   1000015     1.04689366E+03   # ~tau_1
   2000015     3.96693482E+03   # ~tau_2
   1000016     1.04357584E+03   # ~nu_tauL
   1000021     2.98912366E+03   # ~g
   1000022    -2.08505610E+02   # ~chi_10
   1000023     2.11558121E+02   # ~chi_20
   1000025    -2.51995316E+03   # ~chi_30
   1000035    -2.98463690E+03   # ~chi_40
   1000024     2.10322384E+02   # ~chi_1+
   1000037     2.98480032E+03   # ~chi_2+
#
BLOCK NMIX  # Neutralino Mixing Matrix
  1  1     1.29427049E-02   # N_11
  1  2    -1.94460724E-02   # N_12
  1  3     7.09632379E-01   # N_13
  1  4     7.04184794E-01   # N_14
  2  1     1.16708714E-02   # N_21
  2  2    -1.80884515E-02   # N_22
  2  3    -7.04570683E-01   # N_23
  2  4     7.09307233E-01   # N_24
  3  1     9.99843975E-01   # N_31
  3  2     3.34390226E-03   # N_32
  3  3    -9.58707832E-04   # N_33
  3  4    -1.73183655E-02   # N_34
  4  1    -2.88162032E-03   # N_41
  4  2     9.99641674E-01   # N_42
  4  3     1.05855511E-03   # N_43
  4  4     2.65913372E-02   # N_44
#
BLOCK UMIX  # Chargino Mixing Matrix U
  1  1    -1.49765966E-03   # U_11
  1  2     9.99998879E-01   # U_12
  2  1    -9.99998879E-01   # U_21
  2  2    -1.49765966E-03   # U_22
#
BLOCK VMIX  # Chargino Mixing Matrix V
  1  1     3.75643890E-02   # V_11
  1  2     9.99294209E-01   # V_12
  2  1     9.99294209E-01   # V_21
  2  2    -3.75643890E-02   # V_22
#
BLOCK STOPMIX  # Stop Mixing Matrix
  1  1     9.99122980E-01   # cos(theta_t)
  1  2    -4.18720770E-02   # sin(theta_t)
  2  1     4.18720770E-02   # -sin(theta_t)
  2  2     9.99122980E-01   # cos(theta_t)
#
BLOCK SBOTMIX  # Sbottom Mixing Matrix
  1  1     9.99962709E-01   # cos(theta_b)
  1  2     8.63600656E-03   # sin(theta_b)
  2  1    -8.63600656E-03   # -sin(theta_b)
  2  2     9.99962709E-01   # cos(theta_b)
#
BLOCK STAUMIX  # Stau Mixing Matrix
  1  1     9.99999871E-01   # cos(theta_tau)
  1  2     5.07936988E-04   # sin(theta_tau)
  2  1    -5.07936988E-04   # -sin(theta_tau)
  2  2     9.99999871E-01   # cos(theta_tau)
#
BLOCK ALPHA  # Higgs mixing
          -2.92033276E-02   # Mixing angle in the neutral Higgs boson sector
#
BLOCK HMIX Q=  2.50601700E+03  # DRbar Higgs Parameters
         1     2.03302332E+02   # mu(Q)MSSM           
         2     3.43676282E+01   # tan                 
         3     2.43198899E+02   # higgs               
         4     5.97024057E+06   # mA^2(Q)MSSM         
#
BLOCK GAUGE Q=  2.50601700E+03  # The gauge couplings
     1     3.64613814E-01   # gprime(Q) DRbar
     2     6.38028877E-01   # g(Q) DRbar
     3     1.01740169E+00   # g3(Q) DRbar
#
BLOCK AU Q=  2.50601700E+03  # The trilinear couplings
  1  1     0.00000000E+00   # A_u(Q) DRbar
  2  2     0.00000000E+00   # A_c(Q) DRbar
  3  3     3.65523001E+03   # A_t(Q) DRbar
#
BLOCK AD Q=  2.50601700E+03  # The trilinear couplings
  1  1     0.00000000E+00   # A_d(Q) DRbar
  2  2     0.00000000E+00   # A_s(Q) DRbar
  3  3    -2.92918999E+03   # A_b(Q) DRbar
#
BLOCK AE Q=  2.50601700E+03  # The trilinear couplings
  1  1     0.00000000E+00   # A_e(Q) DRbar
  2  2     0.00000000E+00   # A_mu(Q) DRbar
  3  3     2.64613000E+03   # A_tau(Q) DRbar
#
BLOCK Yu Q=  2.50601700E+03  # The Yukawa couplings
  1  1     0.00000000E+00   # y_u(Q) DRbar
  2  2     0.00000000E+00   # y_c(Q) DRbar
  3  3     8.37521598E-01   # y_t(Q) DRbar
#
BLOCK Yd Q=  2.50601700E+03  # The Yukawa couplings
  1  1     0.00000000E+00   # y_d(Q) DRbar
  2  2     0.00000000E+00   # y_s(Q) DRbar
  3  3     4.36194194E-01   # y_b(Q) DRbar
#
BLOCK Ye Q=  2.50601700E+03  # The Yukawa couplings
  1  1     0.00000000E+00   # y_e(Q) DRbar
  2  2     0.00000000E+00   # y_mu(Q) DRbar
  3  3     3.44685117E-01   # y_tau(Q) DRbar
#
BLOCK MSOFT Q=  2.50601700E+03  # The soft SUSY breaking masses at the scale Q
         1    -2.54505000E+03   # M_1(Q)              
         2    -3.02541000E+03   # M_2(Q)              
         3     2.96407000E+03   # M_3(Q)              
        21     6.22538673E+06   # mH1^2(Q)            
        22    -5.86496191E+04   # mH2^2(Q)            
        31     2.53562000E+03   # meL(Q)              
        32     2.53562000E+03   # mmuL(Q)             
        33     1.01869000E+03   # mtauL(Q)            
        34     3.75922000E+03   # meR(Q)              
        35     3.75922000E+03   # mmuR(Q)             
        36     3.96821000E+03   # mtauR(Q)            
        41     2.00934999E+03   # mqL1(Q)             
        42     2.00934999E+03   # mqL2(Q)             
        43     1.61536998E+03   # mqL3(Q)             
        44     1.59926999E+03   # muR(Q)              
        45     1.59926999E+03   # mcR(Q)              
        46     3.88538999E+03   # mtR(Q)              
        47     2.48819919E+02   # mdR(Q)              
        48     2.48819919E+02   # msR(Q)              
        49     2.27149999E+03   # mbR(Q)              
#
Block HiggsBoundsInputHiggsCouplingsFermions
# ScalarNormEffCoupSq PseudoSNormEffCoupSq NP   IP1 IP2 IP2
    1.00787779E+00    0.00000000E+00        3  25   5   5  # h0-b-b eff. coupling^2, normalised to SM
    1.18112599E+03    0.00000000E+00        3  35   5   5  # H0-b-b eff. coupling^2, normalised to SM
    0.00000000E+00    1.18113387E+03        3  36   5   5  # A0-b-b eff. coupling^2, normalised to SM
#
    9.99993330E-01    0.00000000E+00        3  25   6   6  # h0-t-t eff. coupling^2, normalised to SM
    8.53313770E-04    0.00000000E+00        3  35   6   6  # H0-t-t eff. coupling^2, normalised to SM
    0.00000000E+00    8.46644082E-04        3  36   6   6  # A0-t-t eff. coupling^2, normalised to SM
#
    1.00787779E+00    0.00000000E+00        3  25  15  15  # h0-tau-tau eff. coupling^2, normalised to SM
    1.18112599E+03    0.00000000E+00        3  35  15  15  # H0-tau-tau eff. coupling^2, normalised to SM
    0.00000000E+00    1.18113387E+03        3  36  15  15  # A0-tau-tau eff. coupling^2, normalised to SM
#
Block HiggsBoundsInputHiggsCouplingsBosons
    9.99999987E-01        3  25  24  24  # h0-W-W eff. coupling^2, normalised to SM
    1.30841640E-08        3  35  24  24  # H0-W-W eff. coupling^2, normalised to SM
    0.00000000E+00        3  36  24  24  # A0-W-W eff. coupling^2, normalised to SM
#
    9.99999987E-01        3  25  23  23  # h0-Z-Z eff. coupling^2, normalised to SM
    1.30841640E-08        3  35  23  23  # H0-Z-Z eff. coupling^2, normalised to SM
    0.00000000E+00        3  36  23  23  # A0-Z-Z eff. coupling^2, normalised to SM
#
    8.93494516E-01        3  25  21  21  # h0-g-g eff. coupling^2, normalised to SM
    3.41322199E-12        3  35  21  21  # H0-g-g eff. coupling^2, normalised to SM
    1.90378624E-11        3  36  21  21  # A0-g-g eff. coupling^2, normalised to SM
#
    0.00000000E+00        3  25  25  23  # h0-h0-Z eff. coupling^2, normalised to SM
    0.00000000E+00        3  35  25  23  # H0-h0-Z eff. coupling^2, normalised to SM
    1.30841640E-08        3  36  25  23  # A0-h0-Z eff. coupling^2, normalised to SM
    0.00000000E+00        3  35  35  23  # H0-H0-Z eff. coupling^2, normalised to SM
    9.99999987E-01        3  36  35  23  # A0-H0-Z eff. coupling^2, normalised to SM
    0.00000000E+00        3  36  36  23  # A0-A0-Z eff. coupling^2, normalised to SM
#
    0.00000000E+00        4  25  21  21  23  # h0-g-g-Z eff. coupling^2, normalised to SM
    0.00000000E+00        4  35  21  21  23  # H0-g-g-Z eff. coupling^2, normalised to SM
    0.00000000E+00        4  36  21  21  23  # A0-g-g-Z eff. coupling^2, normalised to SM
#
#
#
#                             =================
#                             |The decay table|
#                             =================
#
# - The QCD corrections to the decays gluino -> squark  + quark
#                                     squark -> gaugino + quark_prime
#                                     squark -> squark_prime + Higgs
#                                     squark -> gluino  + quark
#   are included.
#
# - The multi-body decays for the inos, stops and sbottoms are included.
#
# - The loop induced decays for the gluino, neutralinos and stops
#   are included.
#
# - The SUSY decays of the top quark are included.
#
#
#         PDG            Width
DECAY         6     1.43333211E+00   # top decays
#          BR         NDA      ID1       ID2
     1.00000000E+00    2           5        24   # BR(t ->  b    W+)
#
#         PDG            Width
DECAY   1000021     2.90566640E+02   # gluino decays
#          BR         NDA      ID1       ID2
     2.51297987E-02    2     1000001        -1   # BR(~g -> ~d_L  db)
     2.51297987E-02    2    -1000001         1   # BR(~g -> ~d_L* d )
     9.81650187E-02    2     2000001        -1   # BR(~g -> ~d_R  db)
     9.81650187E-02    2    -2000001         1   # BR(~g -> ~d_R* d )
     2.51973088E-02    2     1000002        -2   # BR(~g -> ~u_L  ub)
     2.51973088E-02    2    -1000002         2   # BR(~g -> ~u_L* u )
     4.72713974E-02    2     2000002        -2   # BR(~g -> ~u_R  ub)
     4.72713974E-02    2    -2000002         2   # BR(~g -> ~u_R* u )
     2.51297987E-02    2     1000003        -3   # BR(~g -> ~s_L  sb)
     2.51297987E-02    2    -1000003         3   # BR(~g -> ~s_L* s )
     9.81650187E-02    2     2000003        -3   # BR(~g -> ~s_R  sb)
     9.81650187E-02    2    -2000003         3   # BR(~g -> ~s_R* s )
     2.51972779E-02    2     1000004        -4   # BR(~g -> ~c_L  cb)
     2.51972779E-02    2    -1000004         4   # BR(~g -> ~c_L* c )
     4.72713775E-02    2     2000004        -4   # BR(~g -> ~c_R  cb)
     4.72713775E-02    2    -2000004         4   # BR(~g -> ~c_R* c )
     4.64551388E-02    2     1000005        -5   # BR(~g -> ~b_1  bb)
     4.64551388E-02    2    -1000005         5   # BR(~g -> ~b_1* b )
     1.50798265E-02    2     2000005        -5   # BR(~g -> ~b_2  bb)
     1.50798265E-02    2    -2000005         5   # BR(~g -> ~b_2* b )
     4.69380382E-02    2     1000006        -6   # BR(~g -> ~t_1  tb)
     4.69380382E-02    2    -1000006         6   # BR(~g -> ~t_1* t )
#
#         PDG            Width
DECAY   1000006     2.93508760E+01   # stop1 decays
#          BR         NDA      ID1       ID2
     3.86532156E-01    2     1000022         6   # BR(~t_1 -> ~chi_10 t )
     3.93896415E-01    2     1000023         6   # BR(~t_1 -> ~chi_20 t )
     2.19571430E-01    2     1000024         5   # BR(~t_1 -> ~chi_1+ b )
#
#         PDG            Width
DECAY   2000006     2.17254067E+02   # stop2 decays
#          BR         NDA      ID1       ID2
     1.22916807E-01    2     1000022         6   # BR(~t_2 -> ~chi_10 t )
     1.24623913E-01    2     1000023         6   # BR(~t_2 -> ~chi_20 t )
     1.43026758E-02    2     1000025         6   # BR(~t_2 -> ~chi_30 t )
     1.03410774E-04    2     1000035         6   # BR(~t_2 -> ~chi_40 t )
     2.47903449E-01    2     1000024         5   # BR(~t_2 -> ~chi_1+ b )
     2.07751490E-04    2     1000037         5   # BR(~t_2 -> ~chi_2+ b )
     1.66700775E-01    2     1000021         6   # BR(~t_2 -> ~g      t )
     8.72784748E-02    2     1000006        25   # BR(~t_2 -> ~t_1    h )
     8.02234959E-02    2     1000006        23   # BR(~t_2 -> ~t_1    Z )
     1.55733539E-01    2     1000005        24   # BR(~t_2 -> ~b_1    W+)
     5.70861840E-06    2     2000005        24   # BR(~t_2 -> ~b_2    W+)
#
#         PDG            Width
DECAY   1000005     2.92232427E+01   # sbottom1 decays
#          BR         NDA      ID1       ID2
     1.09589933E-01    2     1000022         5   # BR(~b_1 -> ~chi_10 b )
     1.07780556E-01    2     1000023         5   # BR(~b_1 -> ~chi_20 b )
     7.82629511E-01    2    -1000024         6   # BR(~b_1 -> ~chi_1- t )
#
#         PDG            Width
DECAY   2000005     1.75945315E+01   # sbottom2 decays
#          BR         NDA      ID1       ID2
     2.51267514E-01    2     1000022         5   # BR(~b_2 -> ~chi_10 b )
     2.47904316E-01    2     1000023         5   # BR(~b_2 -> ~chi_20 b )
     4.93978922E-01    2    -1000024         6   # BR(~b_2 -> ~chi_1- t )
     1.73247350E-03    2     1000005        25   # BR(~b_2 -> ~b_1    h )
     1.72632483E-03    2     1000005        23   # BR(~b_2 -> ~b_1    Z )
     3.39044932E-03    2     1000006       -24   # BR(~b_2 -> ~t_1    W-)
#
#         PDG            Width
DECAY   1000002     2.83025074E-02   # sup_L decays
#          BR         NDA      ID1       ID2
     8.57863138E-02    2     1000022         2   # BR(~u_L -> ~chi_10 u)
     7.48458640E-02    2     1000023         2   # BR(~u_L -> ~chi_20 u)
     8.39367822E-01    2     1000024         1   # BR(~u_L -> ~chi_1+ d)
#
#         PDG            Width
DECAY   2000002     3.25093411E-02   # sup_R decays
#           BR         NDA      ID1       ID2
     2.02571785E-02    2     1000022         2   # BR(~u_R -> ~chi_10 u)
     1.64573119E-02    2     1000023         2   # BR(~u_R -> ~chi_20 u)
#           BR         NDA      ID1       ID2       ID3
     6.00258244E-02    3        2       -1        2000001   # BR(~u_R -> u  db  ~d_R)
     4.17480009E-01    3        2       1        -2000001   # BR(~u_R -> u  d  ~d_R*)
     5.99366193E-02    3        2       -3        2000003   # BR(~u_R -> u  sb  ~s_R)
     4.15542104E-01    3        2       3        -2000003   # BR(~u_R -> u  s  ~s_R*)
     1.66939711E-04    3        2       -15        1000015   # BR(~u_R -> u  tau+  ~tau_1-)
     5.14621319E-05    3        2       15        -1000015   # BR(~u_R -> u  tau-  ~tau_1+)
     1.67970184E-04    3        2       -16        1000016   # BR(~u_R -> u  nu_taub  ~nu_tau1)
     5.18158764E-05    3        2       16        -1000016   # BR(~u_R -> u  nu_tau  ~nu_tau1*)
     1.08079705E-03    3        2       23        1000022   # BR(~u_R -> u  Z  ~chi_10)
     1.35705611E-03    3        2       25        1000022   # BR(~u_R -> u  h  ~chi_10)
     1.57696214E-03    3        2       23        1000023   # BR(~u_R -> u  Z  ~chi_20)
     8.94204528E-04    3        2       25        1000023   # BR(~u_R -> u  h  ~chi_20)
     6.18683718E-04    3        2       -24        1000024   # BR(~u_R -> u  W-  ~chi_1+)
     4.33506172E-03    3        2       24        -1000024   # BR(~u_R -> u  W+  ~chi_1-)
#
#         PDG            Width
DECAY   1000001     7.55736707E-03   # sdown_L decays
#          BR         NDA      ID1       ID2
     5.35283324E-01    2     1000022         1   # BR(~d_L -> ~chi_10 d)
     4.59716863E-01    2     1000023         1   # BR(~d_L -> ~chi_20 d)
     4.99981260E-03    2    -1000024         2   # BR(~d_L -> ~chi_1- u)
#
#         PDG            Width
DECAY   2000001     7.20846718E-05   # sdown_R decays
#           BR         NDA      ID1       ID2
     5.52094253E-01    2     1000022         1   # BR(~d_R -> ~chi_10 d)
     4.44103909E-01    2     1000023         1   # BR(~d_R -> ~chi_20 d)
#           BR         NDA      ID1       ID2       ID3
     3.37630725E-04    3        1       23        1000022   # BR(~d_R -> d  Z  ~chi_10)
     4.25194417E-04    3        1       25        1000022   # BR(~d_R -> d  h  ~chi_10)
     4.55339522E-04    3        1       23        1000023   # BR(~d_R -> d  Z  ~chi_20)
     2.82945035E-04    3        1       25        1000023   # BR(~d_R -> d  h  ~chi_20)
     3.56150612E-05    3        1       -24        1000024   # BR(~d_R -> d  W-  ~chi_1+)
     2.26511401E-03    3        1       24        -1000024   # BR(~d_R -> d  W+  ~chi_1-)
#
#         PDG            Width
DECAY   1000004     2.84814263E-02   # scharm_L decays
#          BR         NDA      ID1       ID2
     8.57872669E-02    2     1000022         4   # BR(~c_L -> ~chi_10 c)
     7.48451313E-02    2     1000023         4   # BR(~c_L -> ~chi_20 c)
     8.39367602E-01    2     1000024         3   # BR(~c_L -> ~chi_1+ s)
#
#         PDG            Width
DECAY   2000004     3.24621177E-02   # scharm_R decays
#           BR         NDA      ID1       ID2
     2.01535242E-02    2     1000022         4   # BR(~c_R -> ~chi_10 c)
     1.63727456E-02    2     1000023         4   # BR(~c_R -> ~chi_20 c)
#           BR         NDA      ID1       ID2       ID3
     6.00392131E-02    3        4       -1        2000001   # BR(~c_R -> c  db  ~d_R)
     4.17656055E-01    3        4       1        -2000001   # BR(~c_R -> c  d  ~d_R*)
     5.99776028E-02    3        4       -3        2000003   # BR(~c_R -> c  sb  ~s_R)
     4.15499695E-01    3        4       3        -2000003   # BR(~c_R -> c  s  ~s_R*)
     1.67299622E-04    3        4       -15        1000015   # BR(~c_R -> c  tau+  ~tau_1-)
     5.15862833E-05    3        4       15        -1000015   # BR(~c_R -> c  tau-  ~tau_1+)
     1.69083239E-04    3        4       -16        1000016   # BR(~c_R -> c  nu_taub  ~nu_tau1)
     5.21007291E-05    3        4       16        -1000016   # BR(~c_R -> c  nu_tau  ~nu_tau1*)
     1.08766780E-03    3        4       23        1000022   # BR(~c_R -> c  Z  ~chi_10)
     1.36248043E-03    3        4       25        1000022   # BR(~c_R -> c  h  ~chi_10)
     1.57919457E-03    3        4       23        1000023   # BR(~c_R -> c  Z  ~chi_20)
     8.95074077E-04    3        4       25        1000023   # BR(~c_R -> c  h  ~chi_20)
     6.21801701E-04    3        4       -24        1000024   # BR(~c_R -> c  W-  ~chi_1+)
     4.31487562E-03    3        4       24        -1000024   # BR(~c_R -> c  W+  ~chi_1-)
#
#         PDG            Width
DECAY   1000003     7.60547456E-03   # sstrange_L decays
#          BR         NDA      ID1       ID2
     5.35288501E-01    2     1000022         3   # BR(~s_L -> ~chi_10 s)
     4.59711703E-01    2     1000023         3   # BR(~s_L -> ~chi_20 s)
     4.99979584E-03    2    -1000024         4   # BR(~s_L -> ~chi_1- c)
#
#         PDG            Width
DECAY   2000003     6.76173973E-05   # sstrange_R decays
#           BR         NDA      ID1       ID2
     5.51960886E-01    2     1000022         3   # BR(~s_R -> ~chi_10 s)
     4.43985334E-01    2     1000023         3   # BR(~s_R -> ~chi_20 s)
#           BR         NDA      ID1       ID2       ID3
     3.59892586E-04    3        3       23        1000022   # BR(~s_R -> s  Z  ~chi_10)
     4.54380104E-04    3        3       25        1000022   # BR(~s_R -> s  h  ~chi_10)
     4.85481567E-04    3        3       23        1000023   # BR(~s_R -> s  Z  ~chi_20)
     3.02880632E-04    3        3       25        1000023   # BR(~s_R -> s  h  ~chi_20)
     3.78615579E-05    3        3       -24        1000024   # BR(~s_R -> s  W-  ~chi_1+)
     2.41328425E-03    3        3       24        -1000024   # BR(~s_R -> s  W+  ~chi_1-)
#
#         PDG            Width
DECAY   1000011     5.74005967E-03   # selectron_L decays
#          BR         NDA      ID1       ID2
     2.58469918E-01    2     1000022        11   # BR(~e_L -> ~chi_10 e-)
     2.32024650E-01    2     1000023        11   # BR(~e_L -> ~chi_20 e-)
     5.01521608E-01    2     1000025        11   # BR(~e_L -> ~chi_30 e-)
     7.98382307E-03    2    -1000024        12   # BR(~e_L -> ~chi_1- nu_e)
#
#         PDG            Width
DECAY   2000011     6.08066106E+00   # selectron_R decays
#          BR         NDA      ID1       ID2
     5.45448036E-04    2     1000022        11   # BR(~e_R -> ~chi_10 e-)
     4.43436138E-04    2     1000023        11   # BR(~e_R -> ~chi_20 e-)
     9.99007352E-01    2     1000025        11   # BR(~e_R -> ~chi_30 e-)
     3.76366089E-06    2     1000035        11   # BR(~e_R -> ~chi_40 e-)
#
#         PDG            Width
DECAY   1000013     5.74004798E-03   # smuon_L decays
#          BR         NDA      ID1       ID2
     2.58470444E-01    2     1000022        13   # BR(~mu_L -> ~chi_10 mu-)
     2.32025122E-01    2     1000023        13   # BR(~mu_L -> ~chi_20 mu-)
     5.01520595E-01    2     1000025        13   # BR(~mu_L -> ~chi_30 mu-)
     7.98383933E-03    2    -1000024        14   # BR(~mu_L -> ~chi_1- nu_mu)
#
#         PDG            Width
DECAY   2000013     6.08066103E+00   # smuon_R decays
#          BR         NDA      ID1       ID2
     5.45448038E-04    2     1000022        13   # BR(~mu_R -> ~chi_10 mu-)
     4.43436139E-04    2     1000023        13   # BR(~mu_R -> ~chi_20 mu-)
     9.99007352E-01    2     1000025        13   # BR(~mu_R -> ~chi_30 mu-)
     3.76366087E-06    2     1000035        13   # BR(~mu_R -> ~chi_40 mu-)
#
#         PDG            Width
DECAY   1000015     2.28042875E+00   # stau_1 decays
#          BR         NDA      ID1       ID2
     5.04219020E-01    2     1000022        15   # BR(~tau_1 -> ~chi_10  tau-)
     4.95770229E-01    2     1000023        15   # BR(~tau_1 -> ~chi_20  tau-)
     1.07515533E-05    2    -1000024        16   # BR(~tau_1 -> ~chi_1-  nu_tau)
#
#         PDG            Width
DECAY   2000015     2.96220051E+01   # stau_2 decays
#          BR         NDA      ID1       ID2
     1.58628795E-01    2     1000022        15   # BR(~tau_2 -> ~chi_10  tau-)
     1.56343134E-01    2     1000023        15   # BR(~tau_2 -> ~chi_20  tau-)
     2.51947164E-01    2     1000025        15   # BR(~tau_2 -> ~chi_30  tau-)
     1.28321537E-06    2     1000035        15   # BR(~tau_2 -> ~chi_40  tau-)
     3.14751979E-01    2    -1000024        16   # BR(~tau_2 -> ~chi_1-  nu_tau)
     3.54116850E-07    2    -1000037        16   # BR(~tau_2 -> ~chi_2-  nu_tau)
     5.89217418E-02    2     1000016       -37   # BR(~tau_2 -> ~nu_tauL H-)
     2.74261938E-04    2     1000016       -24   # BR(~tau_2 -> ~nu_tauL W-)
     1.48247384E-04    2     1000015        25   # BR(~tau_2 -> ~tau_1   h)
     2.94209594E-02    2     1000015        35   # BR(~tau_2 -> ~tau_1   H)
     2.94209309E-02    2     1000015        36   # BR(~tau_2 -> ~tau_1   A)
     1.41148366E-04    2     1000015        23   # BR(~tau_2 -> ~tau_1   Z)
#
#         PDG            Width
DECAY   1000012     4.50121053E-02   # snu_eL decays
#          BR         NDA      ID1       ID2
     1.63461116E-01    2     1000022        12   # BR(~nu_eL -> ~chi_10 nu_e)
     1.39004893E-01    2     1000023        12   # BR(~nu_eL -> ~chi_20 nu_e)
     5.74283950E-02    2     1000025        12   # BR(~nu_eL -> ~chi_30 nu_e)
     6.40105596E-01    2     1000024        11   # BR(~nu_eL -> ~chi_1+ e-)
#
#         PDG            Width
DECAY   1000014     4.50121052E-02   # snu_muL decays
#          BR         NDA      ID1       ID2
     1.63461116E-01    2     1000022        14   # BR(~nu_muL -> ~chi_10 nu_mu)
     1.39004893E-01    2     1000023        14   # BR(~nu_muL -> ~chi_20 nu_mu)
     5.74283952E-02    2     1000025        14   # BR(~nu_muL -> ~chi_30 nu_mu)
     6.40105595E-01    2     1000024        13   # BR(~nu_muL -> ~chi_1+ mu-)
#
#         PDG            Width
DECAY   1000016     2.28666462E+00   # snu_tauL decays
#          BR         NDA      ID1       ID2
     1.22732925E-03    2     1000022        16   # BR(~nu_tauL -> ~chi_10 nu_tau)
     1.04155577E-03    2     1000023        16   # BR(~nu_tauL -> ~chi_20 nu_tau)
     9.97731115E-01    2     1000024        15   # BR(~nu_tauL -> ~chi_1+ tau-)
#
#         PDG            Width
DECAY   1000024     1.30244556E-11   # chargino1+ decays
#           BR         NDA      ID1       ID2       ID3
     5.99998810E-01    3     1000022         2        -1   # BR(~chi_1+ -> ~chi_10 u    db)
     1.99999615E-01    3     1000022       -11        12   # BR(~chi_1+ -> ~chi_10 e+   nu_e)
     1.99999615E-01    3     1000022       -13        14   # BR(~chi_1+ -> ~chi_10 mu+  nu_mu)
     1.95951226E-06    3     1000022       -15        16   # BR(~chi_1+ -> ~chi_10 tau+ nu_tau)
#
#         PDG            Width
DECAY   1000037     1.13146765E+02   # chargino2+ decays
#          BR         NDA      ID1       ID2
     7.49880166E-02    2     1000002        -1   # BR(~chi_2+ -> ~u_L     db)
     7.48943251E-02    2    -1000001         2   # BR(~chi_2+ -> ~d_L*    u )
     7.49880107E-02    2     1000004        -3   # BR(~chi_2+ -> ~c_L     sb)
     7.48942309E-02    2    -1000003         4   # BR(~chi_2+ -> ~s_L*     c )
     1.41026661E-01    2     1000006        -5   # BR(~chi_2+ -> ~t_1     bb)
     1.38959184E-01    2    -1000005         6   # BR(~chi_2+ -> ~b_1*    t )
     3.99824789E-06    2    -2000005         6   # BR(~chi_2+ -> ~b_2*    t )
     7.59427795E-03    2     1000012       -11   # BR(~chi_2+ -> ~nu_eL   e+  )
     7.59427795E-03    2     1000014       -13   # BR(~chi_2+ -> ~nu_muL mu+ )
     8.21849539E-02    2     1000016       -15   # BR(~chi_2+ -> ~nu_tau1 tau+)
     7.55394300E-03    2    -1000011        12   # BR(~chi_2+ -> ~e_L+    nu_e)
     7.55394300E-03    2    -1000013        14   # BR(~chi_2+ -> ~mu_L+   nu_mu)
     8.21546633E-02    2    -1000015        16   # BR(~chi_2+ -> ~tau_1+  nu_tau)
     5.27734392E-02    2     1000024        23   # BR(~chi_2+ -> ~chi_1+  Z )
     5.07809125E-02    2     1000022        24   # BR(~chi_2+ -> ~chi_10  W+)
     5.15289596E-02    2     1000023        24   # BR(~chi_2+ -> ~chi_20  W+)
     6.49783561E-05    2     1000025        24   # BR(~chi_2+ -> ~chi_30  W+)
     5.27048490E-02    2     1000024        25   # BR(~chi_2+ -> ~chi_1+  h )
     4.45065983E-03    2     1000024        35   # BR(~chi_2+ -> ~chi_1+  H )
     4.45084460E-03    2     1000024        36   # BR(~chi_2+ -> ~chi_1+  A )
     4.46409043E-03    2     1000022        37   # BR(~chi_2+ -> ~chi_10  H+)
     4.39078018E-03    2     1000023        37   # BR(~chi_2+ -> ~chi_20  H+)
#
#         PDG            Width
DECAY   1000022     0.00000000E+00   # neutralino1 decays
#
#         PDG            Width
DECAY   1000023     2.67532799E-10   # neutralino2 decays
#          BR         NDA      ID1       ID2
     1.82022043E-01    2     1000022        22   # BR(~chi_20 -> ~chi_10 gam)
#           BR         NDA      ID1       ID2       ID3
     1.15125305E-01    3     1000022        -2         2   # BR(~chi_20 -> ~chi_10 ub      u)
     1.49441476E-01    3     1000022        -1         1   # BR(~chi_20 -> ~chi_10 db      d)
     1.15125305E-01    3     1000022        -4         4   # BR(~chi_20 -> ~chi_10 cb      c)
     1.49441476E-01    3     1000022        -3         3   # BR(~chi_20 -> ~chi_10 sb      s)
     3.43325643E-02    3     1000022       -11        11   # BR(~chi_20 -> ~chi_10 e+      e-)
     3.43325643E-02    3     1000022       -13        13   # BR(~chi_20 -> ~chi_10 mu+     mu-)
     6.86492206E-02    3     1000022       -12        12   # BR(~chi_20 -> ~chi_10 nu_eb   nu_e)
     6.86492206E-02    3     1000022       -14        14   # BR(~chi_20 -> ~chi_10 nu_mub  nu_mu)
     6.86496799E-02    3     1000022       -16        16   # BR(~chi_20 -> ~chi_10 nu_taub nu_tau)
     4.26934339E-03    3     1000024        -2         1   # BR(~chi_20 -> ~chi_1+ ub      d)
     4.26934339E-03    3    -1000024        -1         2   # BR(~chi_20 -> ~chi_1- db      u)
     1.42311460E-03    3     1000024       -12        11   # BR(~chi_20 -> ~chi_1+ nu_eb   e-)
     1.42311460E-03    3    -1000024        12       -11   # BR(~chi_20 -> ~chi_1- nu_e    e+)
     1.42311460E-03    3     1000024       -14        13   # BR(~chi_20 -> ~chi_1+ nu_mub  mu-)
     1.42311460E-03    3    -1000024        14       -13   # BR(~chi_20 -> ~chi_1- nu_mu   mu+)
#
#         PDG            Width
DECAY   1000025     3.00066532E+01   # neutralino3 decays
#          BR         NDA      ID1       ID2
     2.23888800E-02    2     1000022        23   # BR(~chi_30 -> ~chi_10   Z )
     2.83035807E-02    2     1000023        23   # BR(~chi_30 -> ~chi_20   Z )
     5.01514904E-02    2     1000024       -24   # BR(~chi_30 -> ~chi_1+   W-)
     5.01514904E-02    2    -1000024        24   # BR(~chi_30 -> ~chi_1-   W+)
     2.96007718E-02    2     1000022        25   # BR(~chi_30 -> ~chi_10   h )
     2.41470010E-02    2     1000023        25   # BR(~chi_30 -> ~chi_20   h )
     1.56049041E-03    2     1000002        -2   # BR(~chi_30 -> ~u_L      ub)
     1.56049041E-03    2    -1000002         2   # BR(~chi_30 -> ~u_L*     u )
     8.54691606E-02    2     2000002        -2   # BR(~chi_30 -> ~u_R      ub)
     8.54691606E-02    2    -2000002         2   # BR(~chi_30 -> ~u_R*     u )
     1.44532471E-03    2     1000001        -1   # BR(~chi_30 -> ~d_L      db)
     1.44532471E-03    2    -1000001         1   # BR(~chi_30 -> ~d_L*     d )
     6.65068842E-02    2     2000001        -1   # BR(~chi_30 -> ~d_R      db)
     6.65068842E-02    2    -2000001         1   # BR(~chi_30 -> ~d_R*     d )
     1.56047935E-03    2     1000004        -4   # BR(~chi_30 -> ~c_L      cb)
     1.56047935E-03    2    -1000004         4   # BR(~chi_30 -> ~c_L*     c )
     8.54690504E-02    2     2000004        -4   # BR(~chi_30 -> ~c_R      cb)
     8.54690504E-02    2    -2000004         4   # BR(~chi_30 -> ~c_R*     c )
     1.44532471E-03    2     1000003        -3   # BR(~chi_30 -> ~s _L      sb)
     1.44532471E-03    2    -1000003         3   # BR(~chi_30 -> ~s _L*     s )
     6.65068842E-02    2     2000003        -3   # BR(~chi_30 -> ~s _R      sb)
     6.65068842E-02    2    -2000003         3   # BR(~chi_30 -> ~s _R*     s )
     5.38528943E-03    2     1000006        -6   # BR(~chi_30 -> ~t_1      tb)
     5.38528943E-03    2    -1000006         6   # BR(~chi_30 -> ~t_1*     t )
     5.01987916E-03    2     1000005        -5   # BR(~chi_30 -> ~b_1      bb)
     5.01987916E-03    2    -1000005         5   # BR(~chi_30 -> ~b_1*     b )
     1.15223435E-03    2     2000005        -5   # BR(~chi_30 -> ~b_2      bb)
     1.15223435E-03    2    -2000005         5   # BR(~chi_30 -> ~b_2*     b )
     3.84488912E-02    2     1000015       -15   # BR(~chi_30 -> ~tau_1-   tau+)
     3.84488912E-02    2    -1000015        15   # BR(~chi_30 -> ~tau_1+   tau-)
     3.76585002E-02    2     1000016       -16   # BR(~chi_30 -> ~nu_tau1  nu_taub)
     3.76585002E-02    2    -1000016        16   # BR(~chi_30 -> ~nu_tau1* nu_tau )
#
#         PDG            Width
DECAY   1000035     1.13129547E+02   # neutralino4 decays
#          BR         NDA      ID1       ID2
     2.41767120E-02    2     1000022        23   # BR(~chi_40 -> ~chi_10   Z )
     2.87346546E-02    2     1000023        23   # BR(~chi_40 -> ~chi_20   Z )
     4.00592620E-07    2     1000025        23   # BR(~chi_40 -> ~chi_30   Z )
     5.11341341E-02    2     1000024       -24   # BR(~chi_40 -> ~chi_1+   W-)
     5.11341341E-02    2    -1000024        24   # BR(~chi_40 -> ~chi_1-   W+)
     2.83129091E-02    2     1000022        25   # BR(~chi_40 -> ~chi_10   h )
     3.39095612E-03    2     1000022        35   # BR(~chi_40 -> ~chi_10   H )
     1.11322244E-03    2     1000022        36   # BR(~chi_40 -> ~chi_10   A )
     2.43446512E-02    2     1000023        25   # BR(~chi_40 -> ~chi_20   h )
     1.07984968E-03    2     1000023        35   # BR(~chi_40 -> ~chi_20   H )
     3.35051631E-03    2     1000023        36   # BR(~chi_40 -> ~chi_20   A )
     5.26137053E-05    2     1000025        25   # BR(~chi_40 -> ~chi_30   h )
     4.40667020E-03    2     1000024       -37   # BR(~chi_40 -> ~chi_1+   H-)
     4.40667020E-03    2    -1000024        37   # BR(~chi_40 -> ~chi_1-   H+)
     3.74747704E-02    2     1000002        -2   # BR(~chi_40 -> ~u_L      ub)
     3.74747704E-02    2    -1000002         2   # BR(~chi_40 -> ~u_L*     u )
     3.37923325E-07    2     2000002        -2   # BR(~chi_40 -> ~u_R      ub)
     3.37923325E-07    2    -2000002         2   # BR(~chi_40 -> ~u_R*     u )
     3.74573797E-02    2     1000001        -1   # BR(~chi_40 -> ~d_L      db)
     3.74573797E-02    2    -1000001         1   # BR(~chi_40 -> ~d_L*     d )
     1.74465339E-07    2     2000001        -1   # BR(~chi_40 -> ~d_R      db)
     1.74465339E-07    2    -2000001         1   # BR(~chi_40 -> ~d_R*     d )
     3.74747234E-02    2     1000004        -4   # BR(~chi_40 -> ~c_L      cb)
     3.74747234E-02    2    -1000004         4   # BR(~chi_40 -> ~c_L*     c )
     3.37923179E-07    2     2000004        -4   # BR(~chi_40 -> ~c_R      cb)
     3.37923179E-07    2    -2000004         4   # BR(~chi_40 -> ~c_R*     c )
     3.74573797E-02    2     1000003        -3   # BR(~chi_40 -> ~s _L      sb)
     3.74573797E-02    2    -1000003         3   # BR(~chi_40 -> ~s _L*     s )
     1.74465339E-07    2     2000003        -3   # BR(~chi_40 -> ~s _R      sb)
     1.74465339E-07    2    -2000003         3   # BR(~chi_40 -> ~s _R*     s )
     6.90879899E-02    2     1000006        -6   # BR(~chi_40 -> ~t_1      tb)
     6.90879899E-02    2    -1000006         6   # BR(~chi_40 -> ~t_1*     t )
     7.09098796E-02    2     1000005        -5   # BR(~chi_40 -> ~b_1      bb)
     7.09098796E-02    2    -1000005         5   # BR(~chi_40 -> ~b_1*     b )
     2.14737608E-06    2     2000005        -5   # BR(~chi_40 -> ~b_2      bb)
     2.14737608E-06    2    -2000005         5   # BR(~chi_40 -> ~b_2*     b )
     3.75994109E-03    2     1000011       -11   # BR(~chi_40 -> ~e_L-     e+)
     3.75994109E-03    2    -1000011        11   # BR(~chi_40 -> ~e_L+     e-)
     3.75994109E-03    2     1000013       -13   # BR(~chi_40 -> ~mu_L-    mu+)
     3.75994109E-03    2    -1000013        13   # BR(~chi_40 -> ~mu_L+    mu-)
     4.09157027E-02    2     1000015       -15   # BR(~chi_40 -> ~tau_1-   tau+)
     4.09157027E-02    2    -1000015        15   # BR(~chi_40 -> ~tau_1+   tau-)
     3.81038669E-03    2     1000012       -12   # BR(~chi_40 -> ~nu_eL    nu_eb)
     3.81038669E-03    2    -1000012        12   # BR(~chi_40 -> ~nu_eL*   nu_e )
     3.81038669E-03    2     1000014       -14   # BR(~chi_40 -> ~nu_muL   nu_mub)
     3.81038669E-03    2    -1000014        14   # BR(~chi_40 -> ~nu_muL*  nu_mu )
     4.12592997E-02    2     1000016       -16   # BR(~chi_40 -> ~nu_tau1  nu_taub)
     4.12592997E-02    2    -1000016        16   # BR(~chi_40 -> ~nu_tau1* nu_tau )
#
#         PDG            Width
DECAY        25     4.36036345E-03   # h decays
#          BR         NDA      ID1       ID2
     5.85121453E-01    2           5        -5   # BR(h -> b       bb     )
     6.05123208E-02    2         -15        15   # BR(h -> tau+    tau-   )
     2.14172649E-04    2         -13        13   # BR(h -> mu+     mu-    )
     2.33144454E-04    2           3        -3   # BR(h -> s       sb     )
     2.00758714E-02    2           4        -4   # BR(h -> c       cb     )
     7.59297381E-02    2          21        21   # BR(h -> g       g      )
     2.26566302E-03    2          22        22   # BR(h -> gam     gam    )
     1.62827153E-03    2          22        23   # BR(h -> Z       gam    )
     2.25239067E-01    2          24       -24   # BR(h -> W+      W-     )
     2.87802990E-02    2          23        23   # BR(h -> Z       Z      )
#
#         PDG            Width
DECAY        35     3.90715360E+01   # H decays
#          BR         NDA      ID1       ID2
     8.34209664E-01    2           5        -5   # BR(H -> b       bb     )
     1.61559523E-01    2         -15        15   # BR(H -> tau+    tau-   )
     5.62646284E-04    2         -13        13   # BR(H -> mu+     mu-    )
     3.23453402E-04    2           3        -3   # BR(H -> s       sb     )
     2.29693820E-08    2           4        -4   # BR(H -> c       cb     )
     2.24601989E-03    2           6        -6   # BR(H -> t       tb     )
     1.75476985E-05    2          21        21   # BR(H -> g       g      )
     4.10987423E-09    2          22        22   # BR(H -> gam     gam    )
     9.32488669E-09    2          23        22   # BR(H -> Z       gam    )
     1.67967418E-06    2          24       -24   # BR(H -> W+      W-     )
     8.37498891E-07    2          23        23   # BR(H -> Z       Z      )
     6.15564297E-06    2          25        25   # BR(H -> h       h      )
     7.35112752E-04    2     1000024  -1000024   # BR(H -> ~chi_1+ ~chi_1-)
     1.92894068E-04    2     1000022   1000022   # BR(H -> ~chi_10 ~chi_10)
     1.43859177E-04    2     1000023   1000023   # BR(H -> ~chi_20 ~chi_20)
     1.89134551E-08    2     1000022   1000023   # BR(H -> ~chi_10 ~chi_20)
     4.71776640E-08    2     2000001  -2000001   # BR(H -> ~d_R    ~d_R*  )
     4.71776640E-08    2     2000003  -2000003   # BR(H -> ~s_R    ~s_R*  )
     2.33552676E-08    2     1000015  -1000015   # BR(H -> ~tau_1- ~tau_1+)
     4.34185239E-07    2     1000016  -1000016   # BR(H -> ~nu_tauL ~nu_tauL*)
#
#         PDG            Width
DECAY        36     3.90747300E+01   # A decays
#          BR         NDA      ID1       ID2
     8.34168768E-01    2           5        -5   # BR(A -> b       bb     )
     1.61547236E-01    2         -15        15   # BR(A -> tau+    tau-   )
     5.62602392E-04    2         -13        13   # BR(A -> mu+     mu-    )
     3.23447702E-04    2           3        -3   # BR(A -> s       sb     )
     2.29983753E-08    2           4        -4   # BR(A -> c       cb     )
     2.25710255E-03    2           6        -6   # BR(A -> t       tb     )
     4.14386233E-05    2          21        21   # BR(A -> g       g      )
     1.04196227E-08    2          22        22   # BR(A -> gam     gam    )
     2.82438674E-08    2          23        22   # BR(A -> Z       gam    )
     1.69867448E-06    2          23        25   # BR(A -> Z       h      )
     7.52950245E-04    2     1000024  -1000024   # BR(A -> ~chi_1+ ~chi_1-)
     1.76710682E-04    2     1000022   1000022   # BR(A -> ~chi_10 ~chi_10)
     1.66541000E-04    2     1000023   1000023   # BR(A -> ~chi_20 ~chi_20)
     1.44237594E-06    2     1000022   1000023   # BR(A -> ~chi_10 ~chi_20)
#
#         PDG            Width
DECAY        37     3.68772260E+01   # H+ decays
#          BR         NDA      ID1       ID2
     1.38808103E-03    2           4        -5   # BR(H+ -> c       bb     )
     1.71286043E-01    2         -15        16   # BR(H+ -> tau+    nu_tau )
     5.96518638E-04    2         -13        14   # BR(H+ -> mu+     nu_mu  )
     1.38807869E-05    2           2        -5   # BR(H+ -> u       bb     )
     1.71393678E-05    2           2        -3   # BR(H+ -> u       sb     )
     3.37378119E-04    2           4        -3   # BR(H+ -> c       sb     )
     8.26275102E-01    2           6        -5   # BR(H+ -> t       bb     )
     1.80508353E-06    2          24        25   # BR(H+ -> W+      h      )
     4.23105491E-13    2          24        36   # BR(H+ -> W+      A      )
     3.41431063E-05    2     1000024   1000022   # BR(H+ -> ~chi_1+ ~chi_10)
     4.97744434E-05    2     1000024   1000023   # BR(H+ -> ~chi_1+ ~chi_20)
     1.33938773E-07    2    -1000015   1000016   # BR(H+ -> ~tau_1+ ~nu_tauL)
