#
#                              ======================
#                              | THE SUSYHIT OUTPUT |
#                              ======================
#
#
#              ------------------------------------------------------
#              |     This is the output of the SUSY-HIT package     |
#              |  created by A.Djouadi, M.Muehlleitner and M.Spira. |
#              |  In case of problems with SUSY-HIT email to        |
#              |           margarete.muehlleitner@cern.ch           |
#              |           michael.spira@psi.ch                     |
#              |           abdelhak.djouadi@cern.ch                 |
#              ------------------------------------------------------
#
#              ------------------------------------------------------
#              |  SUSY Les Houches Accord - MSSM Spectrum + Decays  |
#              |              based on the decay programs           |
#              |                                                    |
#              |                     SDECAY 1.3b                    |
#              |                                                    |
#              |  Authors: M.Muhlleitner, A.Djouadi and Y.Mambrini  |
#              |  Ref.:    Comput.Phys.Commun.168(2005)46           |
#              |           [hep-ph/0311167]                         |
#              |                                                    |
#              |                     HDECAY 3.4                     |
#              |                                                    |
#              |  By: A.Djouadi,J.Kalinowski,M.Muhlleitner,M.Spira  |
#              |  Ref.:    Comput.Phys.Commun.108(1998)56           |
#              |           [hep-ph/9704448]                         |
#              |                                                    |
#              |                                                    |
#              |  If not stated otherwise all DRbar couplings and   |
#              |  soft SUSY breaking masses are given at the scale  |
#              |  Q=  0.11018540E+04
#              |                                                    |
#              ------------------------------------------------------
#
#
BLOCK DCINFO  # Decay Program information
     1   SDECAY/HDECAY # decay calculator
     2   1.3b  /3.4    # version number
#
BLOCK SPINFO  # Spectrum calculator information
     1     SOFTSUSY    # spectrum calculator               
     2     3.4.0       # version number                    
#
BLOCK MODSEL  # Model selection
     1     0   #  nonUniversal                                     
#
BLOCK SMINPUTS  # Standard Model inputs
         1     1.27908970E+02   # alpha_em^-1(M_Z)^MSbar
         2     1.16637870E-05   # G_F [GeV^-2]
         3     1.18400000E-01   # alpha_S(M_Z)^MSbar
         4     9.11876000E+01   # M_Z pole mass
         5     4.18000000E+00   # mb(mb)^MSbar
         6     1.73200000E+02   # mt pole mass
         7     1.77700000E+00   # mtau pole mass
#
BLOCK MINPAR  # Input parameters - minimal models
         3     1.51200000E+01   # tanb                
#
BLOCK EXTPAR  # Input parameters - non-minimal models
         0    -1.00000000E+00   # Set                 
         1    -3.43530000E+02   # M_1(MX)             
         2    -2.89230000E+03   # M_2(MX)             
         3     1.64369000E+03   # M_3(MX)             
        11    -2.11338000E+03   # At(MX)              
        12     7.82140000E+02   # Ab(MX)              
        13     1.61842000E+03   # Atau(MX)            
        23     3.73248000E+03   # mu(MX)              
        26     6.90500000E+02   # mA(pole)            
        31     2.09793000E+03   # meL(MX)             
        32     2.09793000E+03   # mmuL(MX)            
        33     1.44600000E+03   # mtauL(MX)           
        34     4.78550000E+02   # meR(MX)             
        35     4.78550000E+02   # mmuR(MX)            
        36     1.22231000E+03   # mtauR(MX)           
        41     2.04494000E+03   # mqL1(MX)            
        42     2.04494000E+03   # mqL2(MX)            
        43     5.68900000E+02   # mqL3(MX)            
        44     3.29456000E+03   # muR(MX)             
        45     3.29456000E+03   # mcR(MX)             
        46     2.15316000E+03   # mtR(MX)             
        47     3.90225000E+03   # mdR(MX)             
        48     3.90225000E+03   # msR(MX)             
        49     1.72414000E+03   # mbR(MX)             
#
BLOCK MASS  # Mass Spectrum
# PDG code           mass       particle
        24     8.04018722E+01   # W+
        25     1.24101418E+02   # h
        35     6.87669562E+02   # H
        36     6.90500060E+02   # A
        37     6.93688616E+02   # H+
         5     4.81876030E+00   # b-quark pole mass calculated from mb(mb)_Msbar
   1000001     2.06761649E+03   # ~d_L
   2000001     3.92215580E+03   # ~d_R
   1000002     2.06628729E+03   # ~u_L
   2000002     3.31402296E+03   # ~u_R
   1000003     2.06761649E+03   # ~s_L
   2000003     3.92215580E+03   # ~s_R
   1000004     2.06628729E+03   # ~c_L
   2000004     3.31402296E+03   # ~c_R
   1000005     4.63872008E+02   # ~b_1
   2000005     1.75381462E+03   # ~b_2
   1000006     4.50737494E+02   # ~t_1
   2000006     2.10246278E+03   # ~t_2
   1000011     2.09687566E+03   # ~e_L
   2000011     4.71624911E+02   # ~e_R
   1000012     2.09508006E+03   # ~nu_eL
   1000013     2.09687566E+03   # ~mu_L
   2000013     4.71624911E+02   # ~mu_R
   1000014     2.09508006E+03   # ~nu_muL
   1000015     1.20926696E+03   # ~tau_1
   2000015     1.43974076E+03   # ~tau_2
   1000016     1.43251542E+03   # ~nu_tauL
   1000021     1.76793198E+03   # ~g
   1000022    -3.44895712E+02   # ~chi_10
   1000023    -2.87094012E+03   # ~chi_20
   1000025     3.75007517E+03   # ~chi_30
   1000035    -3.75239963E+03   # ~chi_40
   1000024     2.87110479E+03   # ~chi_1+
   1000037     3.75310656E+03   # ~chi_2+
#
BLOCK NMIX  # Neutralino Mixing Matrix
  1  1     9.99931498E-01   # N_11
  1  2     4.11125755E-05   # N_12
  1  3     1.17044729E-02   # N_13
  1  4     5.54947970E-05   # N_14
  2  1     5.10189930E-04   # N_21
  2  2     9.98316730E-01   # N_22
  2  3    -4.69314211E-02   # N_23
  2  4    -3.40717945E-02   # N_24
  3  1     8.23704862E-03   # N_31
  3  2    -9.10963580E-03   # N_32
  3  3    -7.07024513E-01   # N_33
  3  4     7.07082388E-01   # N_34
  4  1    -8.30001153E-03   # N_41
  4  2     5.72775576E-02   # N_42
  4  3     7.05532979E-01   # N_43
  4  4     7.06309852E-01   # N_44
#
BLOCK UMIX  # Chargino Mixing Matrix U
  1  1     9.97830595E-01   # U_11
  1  2    -6.58339095E-02   # U_12
  2  1     6.58339095E-02   # U_21
  2  2     9.97830595E-01   # U_22
#
BLOCK VMIX  # Chargino Mixing Matrix V
  1  1    -9.98835627E-01   # V_11
  1  2    -4.82430394E-02   # V_12
  2  1    -4.82430394E-02   # V_21
  2  2     9.98835627E-01   # V_22
#
BLOCK STOPMIX  # Stop Mixing Matrix
  1  1     9.96354866E-01   # cos(theta_t)
  1  2     8.53052226E-02   # sin(theta_t)
  2  1    -8.53052226E-02   # -sin(theta_t)
  2  2     9.96354866E-01   # cos(theta_t)
#
BLOCK SBOTMIX  # Sbottom Mixing Matrix
  1  1     9.99436052E-01   # cos(theta_b)
  1  2     3.35794277E-02   # sin(theta_b)
  2  1    -3.35794277E-02   # -sin(theta_b)
  2  2     9.99436052E-01   # cos(theta_b)
#
BLOCK STAUMIX  # Stau Mixing Matrix
  1  1     1.50384465E-01   # cos(theta_tau)
  1  2     9.88627590E-01   # sin(theta_tau)
  2  1    -9.88627590E-01   # -sin(theta_tau)
  2  2     1.50384465E-01   # cos(theta_tau)
#
BLOCK ALPHA  # Higgs mixing
          -6.90259083E-02   # Mixing angle in the neutral Higgs boson sector
#
BLOCK HMIX Q=  1.10185400E+03  # DRbar Higgs Parameters
         1     3.76463256E+03   # mu(Q)MSSM           
         2     1.46059734E+01   # tan                 
         3     2.45265509E+02   # higgs               
         4     3.89628695E+06   # mA^2(Q)MSSM         
#
BLOCK GAUGE Q=  1.10185400E+03  # The gauge couplings
     1     3.61659772E-01   # gprime(Q) DRbar
     2     6.34031049E-01   # g(Q) DRbar
     3     1.04285844E+00   # g3(Q) DRbar
#
BLOCK AU Q=  1.10185400E+03  # The trilinear couplings
  1  1     0.00000000E+00   # A_u(Q) DRbar
  2  2     0.00000000E+00   # A_c(Q) DRbar
  3  3    -2.11338000E+03   # A_t(Q) DRbar
#
BLOCK AD Q=  1.10185400E+03  # The trilinear couplings
  1  1     0.00000000E+00   # A_d(Q) DRbar
  2  2     0.00000000E+00   # A_s(Q) DRbar
  3  3     7.82140000E+02   # A_b(Q) DRbar
#
BLOCK AE Q=  1.10185400E+03  # The trilinear couplings
  1  1     0.00000000E+00   # A_e(Q) DRbar
  2  2     0.00000000E+00   # A_mu(Q) DRbar
  3  3     1.61842000E+03   # A_tau(Q) DRbar
#
BLOCK Yu Q=  1.10185400E+03  # The Yukawa couplings
  1  1     0.00000000E+00   # y_u(Q) DRbar
  2  2     0.00000000E+00   # y_c(Q) DRbar
  3  3     8.41288362E-01   # y_t(Q) DRbar
#
BLOCK Yd Q=  1.10185400E+03  # The Yukawa couplings
  1  1     0.00000000E+00   # y_d(Q) DRbar
  2  2     0.00000000E+00   # y_s(Q) DRbar
  3  3     1.48719735E-01   # y_b(Q) DRbar
#
BLOCK Ye Q=  1.10185400E+03  # The Yukawa couplings
  1  1     0.00000000E+00   # y_e(Q) DRbar
  2  2     0.00000000E+00   # y_mu(Q) DRbar
  3  3     1.43919349E-01   # y_tau(Q) DRbar
#
BLOCK MSOFT Q=  1.10185400E+03  # The soft SUSY breaking masses at the scale Q
         1    -3.43530000E+02   # M_1(Q)              
         2    -2.89230000E+03   # M_2(Q)              
         3     1.64369000E+03   # M_3(Q)              
        21    -1.34590971E+07   # mH1^2(Q)            
        22    -1.39057201E+07   # mH2^2(Q)            
        31     2.09793000E+03   # meL(Q)              
        32     2.09793000E+03   # mmuL(Q)             
        33     1.44600000E+03   # mtauL(Q)            
        34     4.78550000E+02   # meR(Q)              
        35     4.78550000E+02   # mmuR(Q)             
        36     1.22231000E+03   # mtauR(Q)            
        41     2.04494000E+03   # mqL1(Q)             
        42     2.04494000E+03   # mqL2(Q)             
        43     5.68899995E+02   # mqL3(Q)             
        44     3.29456000E+03   # muR(Q)              
        45     3.29456000E+03   # mcR(Q)              
        46     2.15316000E+03   # mtR(Q)              
        47     3.90225000E+03   # mdR(Q)              
        48     3.90225000E+03   # msR(Q)              
        49     1.72414000E+03   # mbR(Q)              
#
Block HiggsBoundsInputHiggsCouplingsFermions
# ScalarNormEffCoupSq PseudoSNormEffCoupSq NP   IP1 IP2 IP2
    1.01959197E+00    0.00000000E+00        3  25   5   5  # h0-b-b eff. coupling^2, normalised to SM
    2.13314867E+02    0.00000000E+00        3  35   5   5  # H0-b-b eff. coupling^2, normalised to SM
    0.00000000E+00    2.13334459E+02        3  36   5   5  # A0-b-b eff. coupling^2, normalised to SM
#
    9.99908163E-01    0.00000000E+00        3  25   6   6  # h0-t-t eff. coupling^2, normalised to SM
    4.77931214E-03    0.00000000E+00        3  35   6   6  # H0-t-t eff. coupling^2, normalised to SM
    0.00000000E+00    4.68747527E-03        3  36   6   6  # A0-t-t eff. coupling^2, normalised to SM
#
    1.01959197E+00    0.00000000E+00        3  25  15  15  # h0-tau-tau eff. coupling^2, normalised to SM
    2.13314867E+02    0.00000000E+00        3  35  15  15  # H0-tau-tau eff. coupling^2, normalised to SM
    0.00000000E+00    2.13334459E+02        3  36  15  15  # A0-tau-tau eff. coupling^2, normalised to SM
#
Block HiggsBoundsInputHiggsCouplingsBosons
    9.99999555E-01        3  25  24  24  # h0-W-W eff. coupling^2, normalised to SM
    4.45483544E-07        3  35  24  24  # H0-W-W eff. coupling^2, normalised to SM
    0.00000000E+00        3  36  24  24  # A0-W-W eff. coupling^2, normalised to SM
#
    9.99999555E-01        3  25  23  23  # h0-Z-Z eff. coupling^2, normalised to SM
    4.45483544E-07        3  35  23  23  # H0-Z-Z eff. coupling^2, normalised to SM
    0.00000000E+00        3  36  23  23  # A0-Z-Z eff. coupling^2, normalised to SM
#
    8.49415099E-01        3  25  21  21  # h0-g-g eff. coupling^2, normalised to SM
    8.11127731E-04        3  35  21  21  # H0-g-g eff. coupling^2, normalised to SM
    4.12461241E-04        3  36  21  21  # A0-g-g eff. coupling^2, normalised to SM
#
    0.00000000E+00        3  25  25  23  # h0-h0-Z eff. coupling^2, normalised to SM
    0.00000000E+00        3  35  25  23  # H0-h0-Z eff. coupling^2, normalised to SM
    4.45483544E-07        3  36  25  23  # A0-h0-Z eff. coupling^2, normalised to SM
    0.00000000E+00        3  35  35  23  # H0-H0-Z eff. coupling^2, normalised to SM
    9.99999555E-01        3  36  35  23  # A0-H0-Z eff. coupling^2, normalised to SM
    0.00000000E+00        3  36  36  23  # A0-A0-Z eff. coupling^2, normalised to SM
#
    0.00000000E+00        4  25  21  21  23  # h0-g-g-Z eff. coupling^2, normalised to SM
    0.00000000E+00        4  35  21  21  23  # H0-g-g-Z eff. coupling^2, normalised to SM
    0.00000000E+00        4  36  21  21  23  # A0-g-g-Z eff. coupling^2, normalised to SM
#
#
#
#                             =================
#                             |The decay table|
#                             =================
#
# - The QCD corrections to the decays gluino -> squark  + quark
#                                     squark -> gaugino + quark_prime
#                                     squark -> squark_prime + Higgs
#                                     squark -> gluino  + quark
#   are included.
#
# - The multi-body decays for the inos, stops and sbottoms are included.
#
# - The loop induced decays for the gluino, neutralinos and stops
#   are included.
#
# - The SUSY decays of the top quark are included.
#
#
#         PDG            Width
DECAY         6     1.41524209E+00   # top decays
#          BR         NDA      ID1       ID2
     1.00000000E+00    2           5        24   # BR(t ->  b    W+)
#
#         PDG            Width
DECAY   1000021     6.29260926E+01   # gluino decays
#          BR         NDA      ID1       ID2
     2.53234335E-01    2     1000005        -5   # BR(~g -> ~b_1  bb)
     2.53234335E-01    2    -1000005         5   # BR(~g -> ~b_1* b )
     8.21611401E-05    2     2000005        -5   # BR(~g -> ~b_2  bb)
     8.21611401E-05    2    -2000005         5   # BR(~g -> ~b_2* b )
     2.46683503E-01    2     1000006        -6   # BR(~g -> ~t_1  tb)
     2.46683503E-01    2    -1000006         6   # BR(~g -> ~t_1* t )
#
#         PDG            Width
DECAY   1000006     2.69461549E-08   # stop1 decays
#          BR         NDA      ID1       ID2
     1.22868787E-01    2     1000022         4   # BR(~t_1 -> ~chi_10 c )
     9.47281069E-04    2     1000022         2   # BR(~t_1 -> ~chi_10 u )
#           BR         NDA      ID1       ID2       ID3
     8.76183932E-01    3     1000022         5        24   # BR(~t_1 -> ~chi_10  b  W+)
#
#         PDG            Width
DECAY   2000006     2.27759443E+02   # stop2 decays
#          BR         NDA      ID1       ID2
     1.98142849E-02    2     1000022         6   # BR(~t_2 -> ~chi_10 t )
     3.50098733E-02    2     1000021         6   # BR(~t_2 -> ~g      t )
     7.59700145E-02    2     1000006        25   # BR(~t_2 -> ~t_1    h )
     1.55444252E-01    2     1000006        35   # BR(~t_2 -> ~t_1    H )
     1.59999645E-01    2     1000006        36   # BR(~t_2 -> ~t_1    A )
     3.15556393E-01    2     1000005        37   # BR(~t_2 -> ~b_1    H+)
     8.10444522E-02    2     1000006        23   # BR(~t_2 -> ~t_1    Z )
     1.57155720E-01    2     1000005        24   # BR(~t_2 -> ~b_1    W+)
     5.36549013E-06    2     2000005        24   # BR(~t_2 -> ~b_2    W+)
#
#         PDG            Width
DECAY   1000005     1.35750152E-02   # sbottom1 decays
#          BR         NDA      ID1       ID2
     1.00000000E+00    2     1000022         5   # BR(~b_1 -> ~chi_10 b )
#
#         PDG            Width
DECAY   2000005     7.46966384E+00   # sbottom2 decays
#          BR         NDA      ID1       ID2
     1.25227792E-01    2     1000022         5   # BR(~b_2 -> ~chi_10 b )
     2.12536974E-01    2     1000005        25   # BR(~b_2 -> ~b_1    h )
     1.35503284E-02    2     1000005        35   # BR(~b_2 -> ~b_1    H )
     1.34939128E-02    2     1000005        36   # BR(~b_2 -> ~b_1    A )
     2.45122077E-02    2     1000006       -37   # BR(~b_2 -> ~t_1    H-)
     2.06446488E-01    2     1000005        23   # BR(~b_2 -> ~b_1    Z )
     4.04232296E-01    2     1000006       -24   # BR(~b_2 -> ~t_1    W-)
#
#         PDG            Width
DECAY   1000002     1.06837703E+01   # sup_L decays
#          BR         NDA      ID1       ID2
     2.51299554E-02    2     1000022         2   # BR(~u_L -> ~chi_10 u)
     9.74870045E-01    2     1000021         2   # BR(~u_L -> ~g      u)
#
#         PDG            Width
DECAY   2000002     1.26306480E+02   # sup_R decays
#          BR         NDA      ID1       ID2
     5.71090008E-02    2     1000022         2   # BR(~u_R -> ~chi_10 u)
     9.79879927E-10    2     1000023         2   # BR(~u_R -> ~chi_20 u)
     9.42890998E-01    2     1000021         2   # BR(~u_R -> ~g      u)
#
#         PDG            Width
DECAY   1000001     1.07637604E+01   # sdown_L decays
#          BR         NDA      ID1       ID2
     2.49396272E-02    2     1000022         1   # BR(~d_L -> ~chi_10 d)
     9.75060373E-01    2     1000021         1   # BR(~d_L -> ~g      d)
#
#         PDG            Width
DECAY   2000001     1.77004429E+02   # sdown_R decays
#          BR         NDA      ID1       ID2
     1.21684851E-02    2     1000022         1   # BR(~d_R -> ~chi_10 d)
     7.02458692E-10    2     1000023         1   # BR(~d_R -> ~chi_20 d)
     6.65159229E-09    2     1000025         1   # BR(~d_R -> ~chi_30 d)
     6.58023235E-09    2     1000035         1   # BR(~d_R -> ~chi_40 d)
     9.87831501E-01    2     1000021         1   # BR(~d_R -> ~g      d)
#
#         PDG            Width
DECAY   1000004     8.84076158E+00   # scharm_L decays
#          BR         NDA      ID1       ID2
     3.19406464E-02    2     1000022         4   # BR(~c_L -> ~chi_10 c)
     9.68059354E-01    2     1000021         4   # BR(~c_L -> ~g      c)
#
#         PDG            Width
DECAY   2000004     1.05361299E+02   # scharm_R decays
#          BR         NDA      ID1       ID2
     7.11760536E-02    2     1000022         4   # BR(~c_R -> ~chi_10 c)
     1.17905857E-09    2     1000023         4   # BR(~c_R -> ~chi_20 c)
     9.28823945E-01    2     1000021         4   # BR(~c_R -> ~g      c)
#
#         PDG            Width
DECAY   1000003     8.90662471E+00   # sstrange_L decays
#          BR         NDA      ID1       ID2
     3.16997917E-02    2     1000022         3   # BR(~s_L -> ~chi_10 s)
     9.68300208E-01    2     1000021         3   # BR(~s_L -> ~g      s)
#
#         PDG            Width
DECAY   2000003     1.45912205E+02   # sstrange_R decays
#          BR         NDA      ID1       ID2
     1.53020353E-02    2     1000022         3   # BR(~s_R -> ~chi_10 s)
     8.71836032E-10    2     1000023         3   # BR(~s_R -> ~chi_20 s)
     7.76787925E-09    2     1000025         3   # BR(~s_R -> ~chi_30 s)
     7.68010004E-09    2     1000035         3   # BR(~s_R -> ~chi_40 s)
     9.84697948E-01    2     1000021         3   # BR(~s_R -> ~g      s)
#
#         PDG            Width
DECAY   1000011     2.58258059E+00   # selectron_L decays
#          BR         NDA      ID1       ID2
     1.00000000E+00    2     1000022        11   # BR(~e_L -> ~chi_10 e-)
#
#         PDG            Width
DECAY   2000011     5.31127189E-01   # selectron_R decays
#          BR         NDA      ID1       ID2
     1.00000000E+00    2     1000022        11   # BR(~e_R -> ~chi_10 e-)
#
#         PDG            Width
DECAY   1000013     2.58258058E+00   # smuon_L decays
#          BR         NDA      ID1       ID2
     1.00000000E+00    2     1000022        13   # BR(~mu_L -> ~chi_10 mu-)
#
#         PDG            Width
DECAY   2000013     5.31126943E-01   # smuon_R decays
#          BR         NDA      ID1       ID2
     1.00000000E+00    2     1000022        13   # BR(~mu_R -> ~chi_10 mu-)
#
#         PDG            Width
DECAY   1000015     5.22228281E+00   # stau_1 decays
#          BR         NDA      ID1       ID2
     1.00000000E+00    2     1000022        15   # BR(~tau_1 -> ~chi_10  tau-)
#
#         PDG            Width
DECAY   2000015     2.61930854E+00   # stau_2 decays
#          BR         NDA      ID1       ID2
     6.77548323E-01    2     1000022        15   # BR(~tau_2 -> ~chi_10  tau-)
     1.63879530E-01    2     1000015        25   # BR(~tau_2 -> ~tau_1   h)
     1.58572147E-01    2     1000015        23   # BR(~tau_2 -> ~tau_1   Z)
#
#         PDG            Width
DECAY   1000012     2.57937920E+00   # snu_eL decays
#          BR         NDA      ID1       ID2
     1.00000000E+00    2     1000022        12   # BR(~nu_eL -> ~chi_10 nu_e)
#
#         PDG            Width
DECAY   1000014     2.57937920E+00   # snu_muL decays
#          BR         NDA      ID1       ID2
     1.00000000E+00    2     1000022        14   # BR(~nu_muL -> ~chi_10 nu_mu)
#
#         PDG            Width
DECAY   1000016     2.44502176E+00   # snu_tauL decays
#          BR         NDA      ID1       ID2
     6.76281845E-01    2     1000022        16   # BR(~nu_tauL -> ~chi_10 nu_tau)
     3.23718155E-01    2    -1000015       -24   # BR(~nu_tauL -> ~tau_1+ W-)
#
#         PDG            Width
DECAY   1000024     1.19420347E+02   # chargino1+ decays
#          BR         NDA      ID1       ID2
     6.52148692E-02    2     1000002        -1   # BR(~chi_1+ -> ~u_L     db)
     6.49063112E-02    2    -1000001         2   # BR(~chi_1+ -> ~d_L*    u )
     6.52148634E-02    2     1000004        -3   # BR(~chi_1+ -> ~c_L     sb)
     6.49062187E-02    2    -1000003         4   # BR(~chi_1+ -> ~s_L*     c )
     2.68802333E-01    2     1000006        -5   # BR(~chi_1+ -> ~t_1     bb)
     1.37677385E-03    2     2000006        -5   # BR(~chi_1+ -> ~t_2     bb)
     2.77711805E-01    2    -1000005         6   # BR(~chi_1+ -> ~b_1*    t )
     3.89510988E-05    2    -2000005         6   # BR(~chi_1+ -> ~b_2*    t )
     2.09643149E-02    2     1000012       -11   # BR(~chi_1+ -> ~nu_eL   e+  )
     2.09643149E-02    2     1000014       -13   # BR(~chi_1+ -> ~nu_muL  mu+ )
     5.41129239E-02    2     1000016       -15   # BR(~chi_1+ -> ~nu_tau1 tau+)
     2.08405005E-02    2    -1000011        12   # BR(~chi_1+ -> ~e_L+    nu_e)
     2.08405005E-02    2    -1000013        14   # BR(~chi_1+ -> ~mu_L+   nu_mu)
     1.76748379E-03    2    -1000015        16   # BR(~chi_1+ -> ~tau_1+  nu_tau)
     5.21817893E-02    2    -2000015        16   # BR(~chi_1+ -> ~tau_2+  nu_tau)
     2.99749078E-05    2     1000022        24   # BR(~chi_1+ -> ~chi_10  W+)
     1.26071419E-04    2     1000022        37   # BR(~chi_1+ -> ~chi_10  H+)
#
#         PDG            Width
DECAY   1000037     1.46041840E+02   # chargino2+ decays
#          BR         NDA      ID1       ID2
     3.37784573E-04    2     1000002        -1   # BR(~chi_2+ -> ~u_L     db)
     6.28329148E-04    2    -1000001         2   # BR(~chi_2+ -> ~d_L*    u )
     3.37784568E-04    2     1000004        -3   # BR(~chi_2+ -> ~c_L     sb)
     6.28329001E-04    2    -1000003         4   # BR(~chi_2+ -> ~s_L*     c )
     2.41183064E-02    2     1000006        -5   # BR(~chi_2+ -> ~t_1     bb)
     2.51571107E-01    2     2000006        -5   # BR(~chi_2+ -> ~t_2     bb)
     5.21182109E-01    2    -1000005         6   # BR(~chi_2+ -> ~b_1*    t )
     1.03928600E-02    2    -2000005         6   # BR(~chi_2+ -> ~b_2*    t )
     1.13335489E-04    2     1000012       -11   # BR(~chi_2+ -> ~nu_eL   e+  )
     1.13335489E-04    2     1000014       -13   # BR(~chi_2+ -> ~nu_muL mu+ )
     4.02407378E-03    2     1000016       -15   # BR(~chi_2+ -> ~nu_tau1 tau+)
     2.10727575E-04    2    -1000011        12   # BR(~chi_2+ -> ~e_L+    nu_e)
     2.10727575E-04    2    -1000013        14   # BR(~chi_2+ -> ~mu_L+   nu_mu)
     3.78048745E-03    2    -1000015        16   # BR(~chi_2+ -> ~tau_1+  nu_tau)
     7.34735225E-04    2    -2000015        16   # BR(~chi_2+ -> ~tau_2+  nu_tau)
     2.69104416E-02    2     1000024        23   # BR(~chi_2+ -> ~chi_1+  Z )
     1.48975969E-02    2     1000022        24   # BR(~chi_2+ -> ~chi_10  W+)
     2.59764409E-02    2     1000023        24   # BR(~chi_2+ -> ~chi_20  W+)
     2.86098133E-02    2     1000024        25   # BR(~chi_2+ -> ~chi_1+  h )
     2.30883604E-02    2     1000024        35   # BR(~chi_2+ -> ~chi_1+  H )
     2.32000495E-02    2     1000024        36   # BR(~chi_2+ -> ~chi_1+  A )
     1.58564520E-02    2     1000022        37   # BR(~chi_2+ -> ~chi_10  H+)
     2.30768136E-02    2     1000023        37   # BR(~chi_2+ -> ~chi_20  H+)
#
#         PDG            Width
DECAY   1000022     0.00000000E+00   # neutralino1 decays
#
#         PDG            Width
DECAY   1000023     1.19393607E+02   # neutralino2 decays
#          BR         NDA      ID1       ID2
     1.81329184E-05    2     1000022        23   # BR(~chi_20 -> ~chi_10   Z )
     1.67008290E-05    2     1000022        25   # BR(~chi_20 -> ~chi_10   h )
     8.40503653E-05    2     1000022        35   # BR(~chi_20 -> ~chi_10   H )
     4.37170575E-05    2     1000022        36   # BR(~chi_20 -> ~chi_10   A )
     3.25773842E-02    2     1000002        -2   # BR(~chi_20 -> ~u_L      ub)
     3.25773842E-02    2    -1000002         2   # BR(~chi_20 -> ~u_L*     u )
     3.24759486E-02    2     1000001        -1   # BR(~chi_20 -> ~d_L      db)
     3.24759486E-02    2    -1000001         1   # BR(~chi_20 -> ~d_L*     d )
     3.25773379E-02    2     1000004        -4   # BR(~chi_20 -> ~c_L      cb)
     3.25773379E-02    2    -1000004         4   # BR(~chi_20 -> ~c_L*     c )
     3.24759486E-02    2     1000003        -3   # BR(~chi_20 -> ~s _L      sb)
     3.24759486E-02    2    -1000003         3   # BR(~chi_20 -> ~s _L*     s )
     1.36954351E-01    2     1000006        -6   # BR(~chi_20 -> ~t_1      tb)
     1.36954351E-01    2    -1000006         6   # BR(~chi_20 -> ~t_1*     t )
     6.87117881E-04    2     2000006        -6   # BR(~chi_20 -> ~t_2      tb)
     6.87117881E-04    2    -2000006         6   # BR(~chi_20 -> ~t_2*     t )
     1.36318419E-01    2     1000005        -5   # BR(~chi_20 -> ~b_1      bb)
     1.36318419E-01    2    -1000005         5   # BR(~chi_20 -> ~b_1*     b )
     1.83007986E-05    2     2000005        -5   # BR(~chi_20 -> ~b_2      bb)
     1.83007986E-05    2    -2000005         5   # BR(~chi_20 -> ~b_2*     b )
     1.04354893E-02    2     1000011       -11   # BR(~chi_20 -> ~e_L-     e+)
     1.04354893E-02    2    -1000011        11   # BR(~chi_20 -> ~e_L+     e-)
     1.54196739E-08    2     2000011       -11   # BR(~chi_20 -> ~e_R-     e+)
     1.54196739E-08    2    -2000011        11   # BR(~chi_20 -> ~e_R+     e-)
     1.04354893E-02    2     1000013       -13   # BR(~chi_20 -> ~mu_L-    mu+)
     1.04354893E-02    2    -1000013        13   # BR(~chi_20 -> ~mu_L+    mu-)
     1.54196739E-08    2     2000013       -13   # BR(~chi_20 -> ~mu_R-    mu+)
     1.54196739E-08    2    -2000013        13   # BR(~chi_20 -> ~mu_R+    mu-)
     8.86458717E-04    2     1000015       -15   # BR(~chi_20 -> ~tau_1-   tau+)
     8.86458717E-04    2    -1000015        15   # BR(~chi_20 -> ~tau_1+   tau-)
     2.61377331E-02    2     2000015       -15   # BR(~chi_20 -> ~tau_2-   tau+)
     2.61377331E-02    2    -2000015        15   # BR(~chi_20 -> ~tau_2+   tau-)
     1.04641737E-02    2     1000012       -12   # BR(~chi_20 -> ~nu_eL    nu_eb)
     1.04641737E-02    2    -1000012        12   # BR(~chi_20 -> ~nu_eL*   nu_e )
     1.04641737E-02    2     1000014       -14   # BR(~chi_20 -> ~nu_muL   nu_mub)
     1.04641737E-02    2    -1000014        14   # BR(~chi_20 -> ~nu_muL*  nu_mu )
     2.70103428E-02    2     1000016       -16   # BR(~chi_20 -> ~nu_tau1  nu_taub)
     2.70103428E-02    2    -1000016        16   # BR(~chi_20 -> ~nu_tau1* nu_tau )
#
#         PDG            Width
DECAY   1000025     1.45501403E+02   # neutralino3 decays
#          BR         NDA      ID1       ID2
     7.78179148E-03    2     1000022        23   # BR(~chi_30 -> ~chi_10   Z )
     2.64417947E-02    2     1000023        23   # BR(~chi_30 -> ~chi_20   Z )
     2.62445872E-02    2     1000024       -24   # BR(~chi_30 -> ~chi_1+   W-)
     2.62445872E-02    2    -1000024        24   # BR(~chi_30 -> ~chi_1-   W+)
     7.77456523E-03    2     1000022        25   # BR(~chi_30 -> ~chi_10   h )
     5.46621966E-03    2     1000022        35   # BR(~chi_30 -> ~chi_10   H )
     1.05483008E-02    2     1000022        36   # BR(~chi_30 -> ~chi_10   A )
     6.44926828E-04    2     1000023        25   # BR(~chi_30 -> ~chi_20   h )
     1.20803661E-04    2     1000023        35   # BR(~chi_30 -> ~chi_20   H )
     2.28665813E-02    2     1000023        36   # BR(~chi_30 -> ~chi_20   A )
     2.28414666E-02    2     1000024       -37   # BR(~chi_30 -> ~chi_1+   H-)
     2.28414666E-02    2    -1000024        37   # BR(~chi_30 -> ~chi_1-   H+)
     4.13554238E-06    2     1000002        -2   # BR(~chi_30 -> ~u_L      ub)
     4.13554238E-06    2    -1000002         2   # BR(~chi_30 -> ~u_L*     u )
     2.91228841E-07    2     2000002        -2   # BR(~chi_30 -> ~u_R      ub)
     2.91228841E-07    2    -2000002         2   # BR(~chi_30 -> ~u_R*     u )
     8.27387745E-06    2     1000001        -1   # BR(~chi_30 -> ~d_L      db)
     8.27387745E-06    2    -1000001         1   # BR(~chi_30 -> ~d_L*     d )
     4.13554141E-06    2     1000004        -4   # BR(~chi_30 -> ~c_L      cb)
     4.13554141E-06    2    -1000004         4   # BR(~chi_30 -> ~c_L*     c )
     2.91227116E-07    2     2000004        -4   # BR(~chi_30 -> ~c_R      cb)
     2.91227116E-07    2    -2000004         4   # BR(~chi_30 -> ~c_R*     c )
     8.27387745E-06    2     1000003        -3   # BR(~chi_30 -> ~s _L      sb)
     8.27387745E-06    2    -1000003         3   # BR(~chi_30 -> ~s _L*     s )
     2.67797557E-01    2     1000006        -6   # BR(~chi_30 -> ~t_1      tb)
     2.67797557E-01    2    -1000006         6   # BR(~chi_30 -> ~t_1*     t )
     1.24741316E-01    2     2000006        -6   # BR(~chi_30 -> ~t_2      tb)
     1.24741316E-01    2    -2000006         6   # BR(~chi_30 -> ~t_2*     t )
     8.22928932E-03    2     1000005        -5   # BR(~chi_30 -> ~b_1      bb)
     8.22928932E-03    2    -1000005         5   # BR(~chi_30 -> ~b_1*     b )
     5.21040011E-03    2     2000005        -5   # BR(~chi_30 -> ~b_2      bb)
     5.21040011E-03    2    -2000005         5   # BR(~chi_30 -> ~b_2*     b )
     4.73707167E-07    2     1000011       -11   # BR(~chi_30 -> ~e_L-     e+)
     4.73707167E-07    2    -1000011        11   # BR(~chi_30 -> ~e_L+     e-)
     4.40756435E-06    2     2000011       -11   # BR(~chi_30 -> ~e_R-     e+)
     4.40756435E-06    2    -2000011        11   # BR(~chi_30 -> ~e_R+     e-)
     4.73707167E-07    2     1000013       -13   # BR(~chi_30 -> ~mu_L-    mu+)
     4.73707167E-07    2    -1000013        13   # BR(~chi_30 -> ~mu_L+    mu-)
     4.40756435E-06    2     2000013       -13   # BR(~chi_30 -> ~mu_R-    mu+)
     4.40756435E-06    2    -2000013        13   # BR(~chi_30 -> ~mu_R+    mu-)
     2.09666373E-03    2     1000015       -15   # BR(~chi_30 -> ~tau_1-   tau+)
     2.09666373E-03    2    -1000015        15   # BR(~chi_30 -> ~tau_1+   tau-)
     1.96460026E-03    2     2000015       -15   # BR(~chi_30 -> ~tau_2-   tau+)
     1.96460026E-03    2    -2000015        15   # BR(~chi_30 -> ~tau_2+   tau-)
     4.64901711E-06    2     1000012       -12   # BR(~chi_30 -> ~nu_eL    nu_eb)
     4.64901711E-06    2    -1000012        12   # BR(~chi_30 -> ~nu_eL*   nu_e )
     4.64901711E-06    2     1000014       -14   # BR(~chi_30 -> ~nu_muL   nu_mub)
     4.64901711E-06    2    -1000014        14   # BR(~chi_30 -> ~nu_muL*  nu_mu )
     7.16689925E-06    2     1000016       -16   # BR(~chi_30 -> ~nu_tau1  nu_taub)
     7.16689925E-06    2    -1000016        16   # BR(~chi_30 -> ~nu_tau1* nu_tau )
#
#         PDG            Width
DECAY   1000035     1.45682445E+02   # neutralino4 decays
#          BR         NDA      ID1       ID2
     7.61329519E-03    2     1000022        23   # BR(~chi_40 -> ~chi_10   Z )
     6.84781818E-04    2     1000023        23   # BR(~chi_40 -> ~chi_20   Z )
     2.66602891E-02    2     1000024       -24   # BR(~chi_40 -> ~chi_1+   W-)
     2.66602891E-02    2    -1000024        24   # BR(~chi_40 -> ~chi_1-   W+)
     8.50604320E-03    2     1000022        25   # BR(~chi_40 -> ~chi_10   h )
     1.04887524E-02    2     1000022        35   # BR(~chi_40 -> ~chi_10   H )
     5.42871699E-03    2     1000022        36   # BR(~chi_40 -> ~chi_10   A )
     2.80496044E-02    2     1000023        25   # BR(~chi_40 -> ~chi_20   h )
     2.29120414E-02    2     1000023        35   # BR(~chi_40 -> ~chi_20   H )
     1.19475607E-04    2     1000023        36   # BR(~chi_40 -> ~chi_20   A )
     2.30067085E-02    2     1000024       -37   # BR(~chi_40 -> ~chi_1+   H-)
     2.30067085E-02    2    -1000024        37   # BR(~chi_40 -> ~chi_1-   H+)
     2.25573574E-04    2     1000002        -2   # BR(~chi_40 -> ~u_L      ub)
     2.25573574E-04    2    -1000002         2   # BR(~chi_40 -> ~u_L*     u )
     2.98080990E-07    2     2000002        -2   # BR(~chi_40 -> ~u_R      ub)
     2.98080990E-07    2    -2000002         2   # BR(~chi_40 -> ~u_R*     u )
     2.51582992E-04    2     1000001        -1   # BR(~chi_40 -> ~d_L      db)
     2.51582992E-04    2    -1000001         1   # BR(~chi_40 -> ~d_L*     d )
     2.25573521E-04    2     1000004        -4   # BR(~chi_40 -> ~c_L      cb)
     2.25573521E-04    2    -1000004         4   # BR(~chi_40 -> ~c_L*     c )
     2.98079244E-07    2     2000004        -4   # BR(~chi_40 -> ~c_R      cb)
     2.98079244E-07    2    -2000004         4   # BR(~chi_40 -> ~c_R*     c )
     2.51582992E-04    2     1000003        -3   # BR(~chi_40 -> ~s _L      sb)
     2.51582992E-04    2    -1000003         3   # BR(~chi_40 -> ~s _L*     s )
     2.59915201E-01    2     1000006        -6   # BR(~chi_40 -> ~t_1      tb)
     2.59915201E-01    2    -1000006         6   # BR(~chi_40 -> ~t_1*     t )
     1.29099837E-01    2     2000006        -6   # BR(~chi_40 -> ~t_2      tb)
     1.29099837E-01    2    -2000006         6   # BR(~chi_40 -> ~t_2*     t )
     8.58749150E-03    2     1000005        -5   # BR(~chi_40 -> ~b_1      bb)
     8.58749150E-03    2    -1000005         5   # BR(~chi_40 -> ~b_1*     b )
     5.26388613E-03    2     2000005        -5   # BR(~chi_40 -> ~b_2      bb)
     5.26388613E-03    2    -2000005         5   # BR(~chi_40 -> ~b_2*     b )
     6.72455453E-05    2     1000011       -11   # BR(~chi_40 -> ~e_L-     e+)
     6.72455453E-05    2    -1000011        11   # BR(~chi_40 -> ~e_L+     e-)
     4.47259068E-06    2     2000011       -11   # BR(~chi_40 -> ~e_R-     e+)
     4.47259068E-06    2    -2000011        11   # BR(~chi_40 -> ~e_R+     e-)
     6.72455453E-05    2     1000013       -13   # BR(~chi_40 -> ~mu_L-    mu+)
     6.72455453E-05    2    -1000013        13   # BR(~chi_40 -> ~mu_L+    mu-)
     4.47259068E-06    2     2000013       -13   # BR(~chi_40 -> ~mu_R-    mu+)
     4.47259068E-06    2    -2000013        13   # BR(~chi_40 -> ~mu_R+    mu-)
     1.95446946E-03    2     1000015       -15   # BR(~chi_40 -> ~tau_1-   tau+)
     1.95446946E-03    2    -1000015        15   # BR(~chi_40 -> ~tau_1+   tau-)
     2.18027327E-03    2     2000015       -15   # BR(~chi_40 -> ~tau_2-   tau+)
     2.18027327E-03    2    -2000015        15   # BR(~chi_40 -> ~tau_2+   tau-)
     9.38119360E-05    2     1000012       -12   # BR(~chi_40 -> ~nu_eL    nu_eb)
     9.38119360E-05    2    -1000012        12   # BR(~chi_40 -> ~nu_eL*   nu_e )
     9.38119360E-05    2     1000014       -14   # BR(~chi_40 -> ~nu_muL   nu_mub)
     9.38119360E-05    2    -1000014        14   # BR(~chi_40 -> ~nu_muL*  nu_mu )
     1.44518700E-04    2     1000016       -16   # BR(~chi_40 -> ~nu_tau1  nu_taub)
     1.44518700E-04    2    -1000016        16   # BR(~chi_40 -> ~nu_tau1* nu_tau )
#
#         PDG            Width
DECAY        25     5.38473583E-03   # h decays
#          BR         NDA      ID1       ID2
     7.16894669E-01    2           5        -5   # BR(h -> b       bb     )
     4.86853187E-02    2         -15        15   # BR(h -> tau+    tau-   )
     1.72317655E-04    2         -13        13   # BR(h -> mu+     mu-    )
     1.87766684E-04    2           3        -3   # BR(h -> s       sb     )
     1.60120994E-02    2           4        -4   # BR(h -> c       cb     )
     5.67015217E-02    2          21        21   # BR(h -> g       g      )
     1.70188059E-03    2          22        22   # BR(h -> gam     gam    )
     1.06970817E-03    2          22        23   # BR(h -> Z       gam    )
     1.41180130E-01    2          24       -24   # BR(h -> W+      W-     )
     1.73945880E-02    2          23        23   # BR(h -> Z       Z      )
#
#         PDG            Width
DECAY        35     2.16986536E+00   # H decays
#          BR         NDA      ID1       ID2
     7.87091536E-01    2           5        -5   # BR(H -> b       bb     )
     1.53935176E-01    2         -15        15   # BR(H -> tau+    tau-   )
     5.40039355E-04    2         -13        13   # BR(H -> mu+     mu-    )
     3.05268539E-04    2           3        -3   # BR(H -> s       sb     )
     7.70918216E-07    2           4        -4   # BR(H -> c       cb     )
     5.64963531E-02    2           6        -6   # BR(H -> t       tb     )
     7.45606754E-04    2          21        21   # BR(H -> g       g      )
     1.63440645E-06    2          22        22   # BR(H -> gam     gam    )
     1.69794059E-07    2          23        22   # BR(H -> Z       gam    )
     1.98018981E-05    2          24       -24   # BR(H -> W+      W-     )
     9.65610105E-06    2          23        23   # BR(H -> Z       Z      )
     8.53986780E-04    2          25        25   # BR(H -> h       h      )
#
#         PDG            Width
DECAY        36     2.20576908E+00   # A decays
#          BR         NDA      ID1       ID2
     7.77259985E-01    2           5        -5   # BR(A -> b       bb     )
     1.52070244E-01    2         -15        15   # BR(A -> tau+    tau-   )
     5.33482676E-04    2         -13        13   # BR(A -> mu+     mu-    )
     3.01468402E-04    2           3        -3   # BR(A -> s       sb     )
     7.53174059E-07    2           4        -4   # BR(A -> c       cb     )
     6.92851562E-02    2           6        -6   # BR(A -> t       tb     )
     5.24598671E-04    2          21        21   # BR(A -> g       g      )
     7.06568214E-07    2          22        22   # BR(A -> gam     gam    )
     2.59651277E-07    2          23        22   # BR(A -> Z       gam    )
     1.86528380E-05    2          23        25   # BR(A -> Z       h      )
     4.69230522E-06    2     1000022   1000022   # BR(A -> ~chi_10 ~chi_10)
#
#         PDG            Width
DECAY        37     1.33219578E+00   # H+ decays
#          BR         NDA      ID1       ID2
     1.11967851E-03    2           4        -5   # BR(H+ -> c       bb     )
     2.52951427E-01    2         -15        16   # BR(H+ -> tau+    nu_tau )
     8.87387198E-04    2         -13        14   # BR(H+ -> mu+     nu_mu  )
     1.11965523E-05    2           2        -5   # BR(H+ -> u       bb     )
     2.49231980E-05    2           2        -3   # BR(H+ -> u       sb     )
     4.91757176E-04    2           4        -3   # BR(H+ -> c       sb     )
     7.44481860E-01    2           6        -5   # BR(H+ -> t       bb     )
     3.17703349E-05    2          24        25   # BR(H+ -> W+      h      )
     3.23701510E-10    2          24        36   # BR(H+ -> W+      A      )
