#
#                              ======================
#                              | THE SUSYHIT OUTPUT |
#                              ======================
#
#
#              ------------------------------------------------------
#              |     This is the output of the SUSY-HIT package     |
#              |  created by A.Djouadi, M.Muehlleitner and M.Spira. |
#              |  In case of problems with SUSY-HIT email to        |
#              |           margarete.muehlleitner@cern.ch           |
#              |           michael.spira@psi.ch                     |
#              |           abdelhak.djouadi@cern.ch                 |
#              ------------------------------------------------------
#
#              ------------------------------------------------------
#              |  SUSY Les Houches Accord - MSSM Spectrum + Decays  |
#              |              based on the decay programs           |
#              |                                                    |
#              |                     SDECAY 1.3b                    |
#              |                                                    |
#              |  Authors: M.Muhlleitner, A.Djouadi and Y.Mambrini  |
#              |  Ref.:    Comput.Phys.Commun.168(2005)46           |
#              |           [hep-ph/0311167]                         |
#              |                                                    |
#              |                     HDECAY 3.4                     |
#              |                                                    |
#              |  By: A.Djouadi,J.Kalinowski,M.Muhlleitner,M.Spira  |
#              |  Ref.:    Comput.Phys.Commun.108(1998)56           |
#              |           [hep-ph/9704448]                         |
#              |                                                    |
#              |                                                    |
#              |  If not stated otherwise all DRbar couplings and   |
#              |  soft SUSY breaking masses are given at the scale  |
#              |  Q=  0.15987020E+04
#              |                                                    |
#              ------------------------------------------------------
#
#
BLOCK DCINFO  # Decay Program information
     1   SDECAY/HDECAY # decay calculator
     2   1.3b  /3.4    # version number
#
BLOCK SPINFO  # Spectrum calculator information
     1     SOFTSUSY    # spectrum calculator               
     2     3.4.0       # version number                    
#
BLOCK MODSEL  # Model selection
     1     0   #  nonUniversal                                     
#
BLOCK SMINPUTS  # Standard Model inputs
         1     1.27908970E+02   # alpha_em^-1(M_Z)^MSbar
         2     1.16637870E-05   # G_F [GeV^-2]
         3     1.18400000E-01   # alpha_S(M_Z)^MSbar
         4     9.11876000E+01   # M_Z pole mass
         5     4.18000000E+00   # mb(mb)^MSbar
         6     1.73200000E+02   # mt pole mass
         7     1.77700000E+00   # mtau pole mass
#
BLOCK MINPAR  # Input parameters - minimal models
         3     3.55400000E+01   # tanb                
#
BLOCK EXTPAR  # Input parameters - non-minimal models
         0    -1.00000000E+00   # Set                 
         1    -5.67100000E+01   # M_1(MX)             
         2     2.05096000E+03   # M_2(MX)             
         3     2.34291000E+03   # M_3(MX)             
        11    -2.72634000E+03   # At(MX)              
        12    -3.66251000E+03   # Ab(MX)              
        13    -3.17080000E+03   # Atau(MX)            
        23    -1.00020000E+02   # mu(MX)              
        26     1.91275000E+03   # mA(pole)            
        31     2.52382000E+03   # meL(MX)             
        32     2.52382000E+03   # mmuL(MX)            
        33     3.41927000E+03   # mtauL(MX)           
        34     4.04650000E+02   # meR(MX)             
        35     4.04650000E+02   # mmuR(MX)            
        36     1.20119000E+03   # mtauR(MX)           
        41     1.81755000E+03   # mqL1(MX)            
        42     1.81755000E+03   # mqL2(MX)            
        43     2.48877000E+03   # mqL3(MX)            
        44     1.61066000E+03   # muR(MX)             
        45     1.61066000E+03   # mcR(MX)             
        46     1.02805000E+03   # mtR(MX)             
        47     2.76006000E+03   # mdR(MX)             
        48     2.76006000E+03   # msR(MX)             
        49     2.49075000E+03   # mbR(MX)             
#
BLOCK MASS  # Mass Spectrum
# PDG code           mass       particle
        24     8.03880960E+01   # W+
        25     1.24683998E+02   # h
        35     1.91275862E+03   # H
        36     1.91274999E+03   # A
        37     1.91492021E+03   # H+
         5     4.81876030E+00   # b-quark pole mass calculated from mb(mb)_Msbar
   1000001     1.88713945E+03   # ~d_L
   2000001     2.80130025E+03   # ~d_R
   1000002     1.88557780E+03   # ~u_L
   2000002     1.66792941E+03   # ~u_R
   1000003     1.88713945E+03   # ~s_L
   2000003     2.80130025E+03   # ~s_R
   1000004     1.88557780E+03   # ~c_L
   2000004     1.66792941E+03   # ~c_R
   1000005     2.52600696E+03   # ~b_1
   2000005     2.53621567E+03   # ~b_2
   1000006     1.06022314E+03   # ~t_1
   2000006     2.53558057E+03   # ~t_2
   1000011     2.53269871E+03   # ~e_L
   2000011     4.10548098E+02   # ~e_R
   1000012     2.53113956E+03   # ~nu_eL
   1000013     2.53269871E+03   # ~mu_L
   2000013     4.10548098E+02   # ~mu_R
   1000014     2.53113956E+03   # ~nu_muL
   1000015     1.21061381E+03   # ~tau_1
   2000015     3.42245411E+03   # ~tau_2
   1000016     3.42120637E+03   # ~nu_tauL
   1000021     2.39990164E+03   # ~g
   1000022    -4.49110761E+01   # ~chi_10
   1000023     1.09343919E+02   # ~chi_20
   1000025    -1.23819583E+02   # ~chi_30
   1000035     2.06988390E+03   # ~chi_40
   1000024     1.05387722E+02   # ~chi_1+
   1000037     2.07005143E+03   # ~chi_2+
#
BLOCK NMIX  # Neutralino Mixing Matrix
  1  1    -8.68644220E-01   # N_11
  1  2    -8.08195091E-03   # N_12
  1  3     4.51739809E-01   # N_13
  1  4    -2.03280709E-01   # N_14
  2  1     1.87425365E-01   # N_21
  2  2     2.75425024E-02   # N_22
  2  3     6.79741341E-01   # N_23
  2  4     7.08565348E-01   # N_24
  3  1     4.58615583E-01   # N_31
  3  2    -2.47420291E-02   # N_32
  3  3     5.77825452E-01   # N_33
  3  4    -6.74668308E-01   # N_34
  4  1    -8.36023923E-04   # N_41
  4  2     9.99281704E-01   # N_42
  4  3    -7.74820993E-04   # N_43
  4  4    -3.78784383E-02   # N_44
#
BLOCK UMIX  # Chargino Mixing Matrix U
  1  1     1.09765755E-03   # U_11
  1  2     9.99999398E-01   # U_12
  2  1    -9.99999398E-01   # U_21
  2  2     1.09765755E-03   # U_22
#
BLOCK VMIX  # Chargino Mixing Matrix V
  1  1     5.35696922E-02   # V_11
  1  2    -9.98564113E-01   # V_12
  2  1    -9.98564113E-01   # V_21
  2  2    -5.35696922E-02   # V_22
#
BLOCK STOPMIX  # Stop Mixing Matrix
  1  1     7.58335980E-02   # cos(theta_t)
  1  2     9.97120487E-01   # sin(theta_t)
  2  1    -9.97120487E-01   # -sin(theta_t)
  2  2     7.58335980E-02   # cos(theta_t)
#
BLOCK SBOTMIX  # Sbottom Mixing Matrix
  1  1     9.99897962E-01   # cos(theta_b)
  1  2     1.42851527E-02   # sin(theta_b)
  2  1    -1.42851527E-02   # -sin(theta_b)
  2  2     9.99897962E-01   # cos(theta_b)
#
BLOCK STAUMIX  # Stau Mixing Matrix
  1  1    -6.29426192E-05   # cos(theta_tau)
  1  2     9.99999998E-01   # sin(theta_tau)
  2  1    -9.99999998E-01   # -sin(theta_tau)
  2  2    -6.29426192E-05   # cos(theta_tau)
#
BLOCK ALPHA  # Higgs mixing
          -2.90261144E-02   # Mixing angle in the neutral Higgs boson sector
#
BLOCK HMIX Q=  1.59870200E+03  # DRbar Higgs Parameters
         1    -1.01464073E+02   # mu(Q)MSSM           
         2     3.46713870E+01   # tan                 
         3     2.43331412E+02   # higgs               
         4     3.53199517E+06   # mA^2(Q)MSSM         
#
BLOCK GAUGE Q=  1.59870200E+03  # The gauge couplings
     1     3.63914589E-01   # gprime(Q) DRbar
     2     6.38766887E-01   # g(Q) DRbar
     3     1.03034085E+00   # g3(Q) DRbar
#
BLOCK AU Q=  1.59870200E+03  # The trilinear couplings
  1  1     0.00000000E+00   # A_u(Q) DRbar
  2  2     0.00000000E+00   # A_c(Q) DRbar
  3  3    -2.72634000E+03   # A_t(Q) DRbar
#
BLOCK AD Q=  1.59870200E+03  # The trilinear couplings
  1  1     0.00000000E+00   # A_d(Q) DRbar
  2  2     0.00000000E+00   # A_s(Q) DRbar
  3  3    -3.66251000E+03   # A_b(Q) DRbar
#
BLOCK AE Q=  1.59870200E+03  # The trilinear couplings
  1  1     0.00000000E+00   # A_e(Q) DRbar
  2  2     0.00000000E+00   # A_mu(Q) DRbar
  3  3    -3.17080000E+03   # A_tau(Q) DRbar
#
BLOCK Yu Q=  1.59870200E+03  # The Yukawa couplings
  1  1     0.00000000E+00   # y_u(Q) DRbar
  2  2     0.00000000E+00   # y_c(Q) DRbar
  3  3     8.30437503E-01   # y_t(Q) DRbar
#
BLOCK Yd Q=  1.59870200E+03  # The Yukawa couplings
  1  1     0.00000000E+00   # y_d(Q) DRbar
  2  2     0.00000000E+00   # y_s(Q) DRbar
  3  3     4.68339897E-01   # y_b(Q) DRbar
#
BLOCK Ye Q=  1.59870200E+03  # The Yukawa couplings
  1  1     0.00000000E+00   # y_e(Q) DRbar
  2  2     0.00000000E+00   # y_mu(Q) DRbar
  3  3     3.53039445E-01   # y_tau(Q) DRbar
#
BLOCK MSOFT Q=  1.59870200E+03  # The soft SUSY breaking masses at the scale Q
         1    -5.67100000E+01   # M_1(Q)              
         2     2.05096000E+03   # M_2(Q)              
         3     2.34291000E+03   # M_3(Q)              
        21     3.58615027E+06   # mH1^2(Q)            
        22    -2.18222008E+04   # mH2^2(Q)            
        31     2.52382000E+03   # meL(Q)              
        32     2.52382000E+03   # mmuL(Q)             
        33     3.41927000E+03   # mtauL(Q)            
        34     4.04650000E+02   # meR(Q)              
        35     4.04650000E+02   # mmuR(Q)             
        36     1.20119000E+03   # mtauR(Q)            
        41     1.81755000E+03   # mqL1(Q)             
        42     1.81755000E+03   # mqL2(Q)             
        43     2.48876999E+03   # mqL3(Q)             
        44     1.61066000E+03   # muR(Q)              
        45     1.61066000E+03   # mcR(Q)              
        46     1.02804998E+03   # mtR(Q)              
        47     2.76006000E+03   # mdR(Q)              
        48     2.76006000E+03   # msR(Q)              
        49     2.49075000E+03   # mbR(Q)              
#
Block HiggsBoundsInputHiggsCouplingsFermions
# ScalarNormEffCoupSq PseudoSNormEffCoupSq NP   IP1 IP2 IP2
    1.01334982E+00    0.00000000E+00        3  25   5   5  # h0-b-b eff. coupling^2, normalised to SM
    1.20209173E+03    0.00000000E+00        3  35   5   5  # H0-b-b eff. coupling^2, normalised to SM
    0.00000000E+00    1.20210508E+03        3  36   5   5  # A0-b-b eff. coupling^2, normalised to SM
#
    9.99988895E-01    0.00000000E+00        3  25   6   6  # h0-t-t eff. coupling^2, normalised to SM
    8.42979403E-04    0.00000000E+00        3  35   6   6  # H0-t-t eff. coupling^2, normalised to SM
    0.00000000E+00    8.31874035E-04        3  36   6   6  # A0-t-t eff. coupling^2, normalised to SM
#
    1.01334982E+00    0.00000000E+00        3  25  15  15  # h0-tau-tau eff. coupling^2, normalised to SM
    1.20209173E+03    0.00000000E+00        3  35  15  15  # H0-tau-tau eff. coupling^2, normalised to SM
    0.00000000E+00    1.20210508E+03        3  36  15  15  # A0-tau-tau eff. coupling^2, normalised to SM
#
Block HiggsBoundsInputHiggsCouplingsBosons
    9.99999963E-01        3  25  24  24  # h0-W-W eff. coupling^2, normalised to SM
    3.68185179E-08        3  35  24  24  # H0-W-W eff. coupling^2, normalised to SM
    0.00000000E+00        3  36  24  24  # A0-W-W eff. coupling^2, normalised to SM
#
    9.99999963E-01        3  25  23  23  # h0-Z-Z eff. coupling^2, normalised to SM
    3.68185179E-08        3  35  23  23  # H0-Z-Z eff. coupling^2, normalised to SM
    0.00000000E+00        3  36  23  23  # A0-Z-Z eff. coupling^2, normalised to SM
#
    8.89972938E-01        3  25  21  21  # h0-g-g eff. coupling^2, normalised to SM
    1.02981270E-10        3  35  21  21  # H0-g-g eff. coupling^2, normalised to SM
    4.74718751E-10        3  36  21  21  # A0-g-g eff. coupling^2, normalised to SM
#
    0.00000000E+00        3  25  25  23  # h0-h0-Z eff. coupling^2, normalised to SM
    0.00000000E+00        3  35  25  23  # H0-h0-Z eff. coupling^2, normalised to SM
    3.68185179E-08        3  36  25  23  # A0-h0-Z eff. coupling^2, normalised to SM
    0.00000000E+00        3  35  35  23  # H0-H0-Z eff. coupling^2, normalised to SM
    9.99999963E-01        3  36  35  23  # A0-H0-Z eff. coupling^2, normalised to SM
    0.00000000E+00        3  36  36  23  # A0-A0-Z eff. coupling^2, normalised to SM
#
    0.00000000E+00        4  25  21  21  23  # h0-g-g-Z eff. coupling^2, normalised to SM
    0.00000000E+00        4  35  21  21  23  # H0-g-g-Z eff. coupling^2, normalised to SM
    0.00000000E+00        4  36  21  21  23  # A0-g-g-Z eff. coupling^2, normalised to SM
#
#
#
#                             =================
#                             |The decay table|
#                             =================
#
# - The QCD corrections to the decays gluino -> squark  + quark
#                                     squark -> gaugino + quark_prime
#                                     squark -> squark_prime + Higgs
#                                     squark -> gluino  + quark
#   are included.
#
# - The multi-body decays for the inos, stops and sbottoms are included.
#
# - The loop induced decays for the gluino, neutralinos and stops
#   are included.
#
# - The SUSY decays of the top quark are included.
#
#
#         PDG            Width
DECAY         6     1.43707767E+00   # top decays
#          BR         NDA      ID1       ID2
     1.00000000E+00    2           5        24   # BR(t ->  b    W+)
#
#         PDG            Width
DECAY   1000021     7.93887945E+01   # gluino decays
#          BR         NDA      ID1       ID2
     4.19663161E-02    2     1000001        -1   # BR(~g -> ~d_L  db)
     4.19663161E-02    2    -1000001         1   # BR(~g -> ~d_L* d )
     4.21915723E-02    2     1000002        -2   # BR(~g -> ~u_L  ub)
     4.21915723E-02    2    -1000002         2   # BR(~g -> ~u_L* u )
     7.69960759E-02    2     2000002        -2   # BR(~g -> ~u_R  ub)
     7.69960759E-02    2    -2000002         2   # BR(~g -> ~u_R* u )
     4.19663161E-02    2     1000003        -3   # BR(~g -> ~s_L  sb)
     4.19663161E-02    2    -1000003         3   # BR(~g -> ~s_L* s )
     4.21913972E-02    2     1000004        -4   # BR(~g -> ~c_L  cb)
     4.21913972E-02    2    -1000004         4   # BR(~g -> ~c_L* c )
     7.69959388E-02    2     2000004        -4   # BR(~g -> ~c_R  cb)
     7.69959388E-02    2    -2000004         4   # BR(~g -> ~c_R* c )
     1.77692384E-01    2     1000006        -6   # BR(~g -> ~t_1  tb)
     1.77692384E-01    2    -1000006         6   # BR(~g -> ~t_1* t )
#
#         PDG            Width
DECAY   1000006     3.01911251E+01   # stop1 decays
#          BR         NDA      ID1       ID2
     7.24086166E-02    2     1000022         6   # BR(~t_1 -> ~chi_10 t )
     2.25158062E-01    2     1000023         6   # BR(~t_1 -> ~chi_20 t )
     2.30351778E-01    2     1000025         6   # BR(~t_1 -> ~chi_30 t )
     4.72081543E-01    2     1000024         5   # BR(~t_1 -> ~chi_1+ b )
#
#         PDG            Width
DECAY   2000006     8.19003106E+01   # stop2 decays
#          BR         NDA      ID1       ID2
     2.48526751E-02    2     1000022         6   # BR(~t_2 -> ~chi_10 t )
     2.12986452E-01    2     1000023         6   # BR(~t_2 -> ~chi_20 t )
     1.84220151E-01    2     1000025         6   # BR(~t_2 -> ~chi_30 t )
     1.34943842E-02    2     1000035         6   # BR(~t_2 -> ~chi_40 t )
     1.34360092E-01    2     1000024         5   # BR(~t_2 -> ~chi_1+ b )
     2.80012321E-02    2     1000037         5   # BR(~t_2 -> ~chi_2+ b )
     1.96766671E-01    2     1000006        25   # BR(~t_2 -> ~t_1    h )
     2.05318344E-01    2     1000006        23   # BR(~t_2 -> ~t_1    Z )
#
#         PDG            Width
DECAY   1000005     8.24222058E+01   # sbottom1 decays
#          BR         NDA      ID1       ID2
     2.95240743E-02    2     1000022         5   # BR(~b_1 -> ~chi_10 b )
     6.17652345E-02    2     1000023         5   # BR(~b_1 -> ~chi_20 b )
     4.65949379E-02    2     1000025         5   # BR(~b_1 -> ~chi_30 b )
     1.34072611E-02    2     1000035         5   # BR(~b_1 -> ~chi_40 b )
     4.13843018E-01    2    -1000024         6   # BR(~b_1 -> ~chi_1- t )
     2.57458788E-02    2    -1000037         6   # BR(~b_1 -> ~chi_2- t )
     1.63636560E-02    2     1000021         5   # BR(~b_1 -> ~g      b )
     3.92755940E-01    2     1000006       -24   # BR(~b_1 -> ~t_1    W-)
#
#         PDG            Width
DECAY   2000005     2.50078011E+01   # sbottom2 decays
#          BR         NDA      ID1       ID2
     1.37692251E-01    2     1000022         5   # BR(~b_2 -> ~chi_10 b )
     2.05136543E-01    2     1000023         5   # BR(~b_2 -> ~chi_20 b )
     1.57492738E-01    2     1000025         5   # BR(~b_2 -> ~chi_30 b )
     8.34005583E-06    2     1000035         5   # BR(~b_2 -> ~chi_40 b )
     4.36987976E-01    2    -1000024         6   # BR(~b_2 -> ~chi_1- t )
     1.60961364E-05    2    -1000037         6   # BR(~b_2 -> ~chi_2- t )
     6.23972294E-02    2     1000021         5   # BR(~b_2 -> ~g      b )
     2.68825344E-04    2     1000006       -24   # BR(~b_2 -> ~t_1    W-)
#
#         PDG            Width
DECAY   1000002     3.27697910E-01   # sup_L decays
#          BR         NDA      ID1       ID2
     6.88595244E-01    2     1000022         2   # BR(~u_L -> ~chi_10 u)
     9.12117499E-02    2     1000023         2   # BR(~u_L -> ~chi_20 u)
     8.88023750E-02    2     1000025         2   # BR(~u_L -> ~chi_30 u)
     1.31390631E-01    2     1000024         1   # BR(~u_L -> ~chi_1+ d)
#
#         PDG            Width
DECAY   2000002     3.86929587E+00   # sup_R decays
#          BR         NDA      ID1       ID2
     7.56108610E-01    2     1000022         2   # BR(~u_R -> ~chi_10 u)
     3.49731029E-02    2     1000023         2   # BR(~u_R -> ~chi_20 u)
     2.08918287E-01    2     1000025         2   # BR(~u_R -> ~chi_30 u)
#
#         PDG            Width
DECAY   1000001     2.79803439E-01   # sdown_L decays
#          BR         NDA      ID1       ID2
     6.63345789E-01    2     1000022         1   # BR(~d_L -> ~chi_10 d)
     1.73821822E-03    2     1000023         1   # BR(~d_L -> ~chi_20 d)
     3.34851336E-01    2     1000025         1   # BR(~d_L -> ~chi_30 d)
     6.46573670E-05    2    -1000024         2   # BR(~d_L -> ~chi_1- u)
#
#         PDG            Width
DECAY   2000001     1.65716271E+01   # sdown_R decays
#          BR         NDA      ID1       ID2
     7.08054261E-02    2     1000022         1   # BR(~d_R -> ~chi_10 d)
     3.29002286E-03    2     1000023         1   # BR(~d_R -> ~chi_20 d)
     1.96844104E-02    2     1000025         1   # BR(~d_R -> ~chi_30 d)
     1.38770641E-08    2     1000035         1   # BR(~d_R -> ~chi_40 d)
     9.06220127E-01    2     1000021         1   # BR(~d_R -> ~g      d)
#
#         PDG            Width
DECAY   1000004     3.32341587E-01   # scharm_L decays
#          BR         NDA      ID1       ID2
     6.88735198E-01    2     1000022         4   # BR(~c_L -> ~chi_10 c)
     9.11727561E-02    2     1000023         4   # BR(~c_L -> ~chi_20 c)
     8.87525426E-02    2     1000025         4   # BR(~c_L -> ~chi_30 c)
     1.31339503E-01    2     1000024         3   # BR(~c_L -> ~chi_1+ s)
#
#         PDG            Width
DECAY   2000004     3.89171178E+00   # scharm_R decays
#          BR         NDA      ID1       ID2
     7.56252887E-01    2     1000022         4   # BR(~c_R -> ~chi_10 c)
     3.49565785E-02    2     1000023         4   # BR(~c_R -> ~chi_20 c)
     2.08790535E-01    2     1000025         4   # BR(~c_R -> ~chi_30 c)
#
#         PDG            Width
DECAY   1000003     2.83770822E-01   # sstrange_L decays
#          BR         NDA      ID1       ID2
     6.63516287E-01    2     1000022         3   # BR(~s_L -> ~chi_10 s)
     1.73756891E-03    2     1000023         3   # BR(~s_L -> ~chi_20 s)
     3.34681509E-01    2     1000025         3   # BR(~s_L -> ~chi_30 s)
     6.46355608E-05    2    -1000024         4   # BR(~s_L -> ~chi_1- c)
#
#         PDG            Width
DECAY   2000003     1.28050756E+01   # sstrange_R decays
#          BR         NDA      ID1       ID2
     9.65950032E-02    2     1000022         3   # BR(~s_R -> ~chi_10 s)
     4.48566069E-03    2     1000023         3   # BR(~s_R -> ~chi_20 s)
     2.68344726E-02    2     1000025         3   # BR(~s_R -> ~chi_30 s)
     1.84540321E-08    2     1000035         3   # BR(~s_R -> ~chi_40 s)
     8.72084845E-01    2     1000021         3   # BR(~s_R -> ~g      s)
#
#         PDG            Width
DECAY   1000011     6.75248554E+00   # selectron_L decays
#          BR         NDA      ID1       ID2
     3.84857665E-01    2     1000022        11   # BR(~e_L -> ~chi_10 e-)
     2.73636961E-02    2     1000023        11   # BR(~e_L -> ~chi_20 e-)
     8.47671191E-02    2     1000025        11   # BR(~e_L -> ~chi_30 e-)
     1.67475059E-01    2     1000035        11   # BR(~e_L -> ~chi_40 e-)
     3.65563904E-06    2    -1000024        12   # BR(~e_L -> ~chi_1- nu_e)
     3.35532805E-01    2    -1000037        12   # BR(~e_L -> ~chi_2- nu_e)
#
#         PDG            Width
DECAY   2000011     2.03508676E+00   # selectron_R decays
#          BR         NDA      ID1       ID2
     7.83009651E-01    2     1000022        11   # BR(~e_R -> ~chi_10 e-)
     3.22321315E-02    2     1000023        11   # BR(~e_R -> ~chi_20 e-)
     1.84758218E-01    2     1000025        11   # BR(~e_R -> ~chi_30 e-)
#
#         PDG            Width
DECAY   1000013     6.75248549E+00   # smuon_L decays
#          BR         NDA      ID1       ID2
     3.84857666E-01    2     1000022        13   # BR(~mu_L -> ~chi_10 mu-)
     2.73636962E-02    2     1000023        13   # BR(~mu_L -> ~chi_20 mu-)
     8.47671194E-02    2     1000025        13   # BR(~mu_L -> ~chi_30 mu-)
     1.67475055E-01    2     1000035        13   # BR(~mu_L -> ~chi_40 mu-)
     3.65563906E-06    2    -1000024        14   # BR(~mu_L -> ~chi_1- nu_mu)
     3.35532807E-01    2    -1000037        14   # BR(~mu_L -> ~chi_2- nu_mu)
#
#         PDG            Width
DECAY   2000013     2.03508647E+00   # smuon_R decays
#          BR         NDA      ID1       ID2
     7.83009655E-01    2     1000022        13   # BR(~mu_R -> ~chi_10 mu-)
     3.22321311E-02    2     1000023        13   # BR(~mu_R -> ~chi_20 mu-)
     1.84758214E-01    2     1000025        13   # BR(~mu_R -> ~chi_30 mu-)
#
#         PDG            Width
DECAY   1000015     1.22475483E+01   # stau_1 decays
#          BR         NDA      ID1       ID2
     4.41779976E-01    2     1000022        15   # BR(~tau_1 -> ~chi_10  tau-)
     1.29377989E-01    2     1000023        15   # BR(~tau_1 -> ~chi_20  tau-)
     1.87448739E-01    2     1000025        15   # BR(~tau_1 -> ~chi_30  tau-)
     2.41393296E-01    2    -1000024        16   # BR(~tau_1 -> ~chi_1-  nu_tau)
#
#         PDG            Width
DECAY   2000015     3.26724573E+01   # stau_2 decays
#          BR         NDA      ID1       ID2
     1.60491267E-01    2     1000022        15   # BR(~tau_2 -> ~chi_10  tau-)
     1.27424954E-01    2     1000023        15   # BR(~tau_2 -> ~chi_20  tau-)
     1.10222751E-01    2     1000025        15   # BR(~tau_2 -> ~chi_30  tau-)
     1.70602443E-01    2     1000035        15   # BR(~tau_2 -> ~chi_40  tau-)
     9.58753512E-07    2    -1000024        16   # BR(~tau_2 -> ~chi_1-  nu_tau)
     3.41958021E-01    2    -1000037        16   # BR(~tau_2 -> ~chi_2-  nu_tau)
     8.55076515E-07    2     1000015        25   # BR(~tau_2 -> ~tau_1   h)
     4.46485566E-02    2     1000015        35   # BR(~tau_2 -> ~tau_1   H)
     4.46491441E-02    2     1000015        36   # BR(~tau_2 -> ~tau_1   A)
     1.04896583E-06    2     1000015        23   # BR(~tau_2 -> ~tau_1   Z)
#
#         PDG            Width
DECAY   1000012     6.76565237E+00   # snu_eL decays
#          BR         NDA      ID1       ID2
     3.59595034E-01    2     1000022        12   # BR(~nu_eL -> ~chi_10 nu_e)
     9.49769698E-03    2     1000023        12   # BR(~nu_eL -> ~chi_20 nu_e)
     1.23625695E-01    2     1000025        12   # BR(~nu_eL -> ~chi_30 nu_e)
     1.66536361E-01    2     1000035        12   # BR(~nu_eL -> ~chi_40 nu_e)
     8.68465477E-03    2     1000024        11   # BR(~nu_eL -> ~chi_1+ e-)
     3.32060558E-01    2     1000037        11   # BR(~nu_eL -> ~chi_2+ e-)
#
#         PDG            Width
DECAY   1000014     6.76565230E+00   # snu_muL decays
#          BR         NDA      ID1       ID2
     3.59595038E-01    2     1000022        14   # BR(~nu_muL -> ~chi_10 nu_mu)
     9.49769708E-03    2     1000023        14   # BR(~nu_muL -> ~chi_20 nu_mu)
     1.23625697E-01    2     1000025        14   # BR(~nu_muL -> ~chi_30 nu_mu)
     1.66536363E-01    2     1000035        14   # BR(~nu_muL -> ~chi_40 nu_mu)
     8.68465483E-03    2     1000024        13   # BR(~nu_muL -> ~chi_1+ mu-)
     3.32060551E-01    2     1000037        13   # BR(~nu_muL -> ~chi_2+ mu-)
#
#         PDG            Width
DECAY   1000016     3.26637935E+01   # snu_tauL decays
#          BR         NDA      ID1       ID2
     1.00703307E-01    2     1000022        16   # BR(~nu_tauL -> ~chi_10 nu_tau)
     2.66354058E-03    2     1000023        16   # BR(~nu_tauL -> ~chi_20 nu_tau)
     3.46862672E-02    2     1000025        16   # BR(~nu_tauL -> ~chi_30 nu_tau)
     1.70767586E-01    2     1000035        16   # BR(~nu_tauL -> ~chi_40 nu_tau)
     2.61654098E-01    2     1000024        15   # BR(~nu_tauL -> ~chi_1+ tau-)
     3.40655521E-01    2     1000037        15   # BR(~nu_tauL -> ~chi_2+ tau-)
     8.88676433E-02    2    -1000015       -37   # BR(~nu_tauL -> ~tau_1+ H-)
     2.03708675E-06    2    -1000015       -24   # BR(~nu_tauL -> ~tau_1+ W-)
#
#         PDG            Width
DECAY   1000024     1.86558356E-04   # chargino1+ decays
#           BR         NDA      ID1       ID2       ID3
     3.33415891E-01    3     1000022         2        -1   # BR(~chi_1+ -> ~chi_10 u    db)
     3.33415891E-01    3     1000022         4        -3   # BR(~chi_1+ -> ~chi_10 c    sb)
     1.11138861E-01    3     1000022       -11        12   # BR(~chi_1+ -> ~chi_10 e+   nu_e)
     1.11138861E-01    3     1000022       -13        14   # BR(~chi_1+ -> ~chi_10 mu+  nu_mu)
     1.10890497E-01    3     1000022       -15        16   # BR(~chi_1+ -> ~chi_10 tau+ nu_tau)
#
#         PDG            Width
DECAY   1000037     1.94032071E+01   # chargino2+ decays
#          BR         NDA      ID1       ID2
     3.87847858E-02    2     1000002        -1   # BR(~chi_2+ -> ~u_L     db)
     3.82831681E-02    2    -1000001         2   # BR(~chi_2+ -> ~d_L*    u )
     3.87847055E-02    2     1000004        -3   # BR(~chi_2+ -> ~c_L     sb)
     3.82818782E-02    2    -1000003         4   # BR(~chi_2+ -> ~s_L*     c )
     2.78954463E-05    2     1000006        -5   # BR(~chi_2+ -> ~t_1     bb)
     5.54207364E-08    2    -1000015        16   # BR(~chi_2+ -> ~tau_1+  nu_tau)
     2.09882273E-01    2     1000024        23   # BR(~chi_2+ -> ~chi_1+  Z )
     2.04276467E-02    2     1000022        24   # BR(~chi_2+ -> ~chi_10  W+)
     2.07915005E-01    2     1000023        24   # BR(~chi_2+ -> ~chi_20  W+)
     1.80447091E-01    2     1000025        24   # BR(~chi_2+ -> ~chi_30  W+)
     2.13043176E-01    2     1000024        25   # BR(~chi_2+ -> ~chi_1+  h )
     3.62284712E-03    2     1000024        35   # BR(~chi_2+ -> ~chi_1+  H )
     3.62307591E-03    2     1000024        36   # BR(~chi_2+ -> ~chi_1+  A )
     1.77674941E-03    2     1000022        37   # BR(~chi_2+ -> ~chi_10  H+)
     3.14155401E-03    2     1000023        37   # BR(~chi_2+ -> ~chi_20  H+)
     1.95809357E-03    2     1000025        37   # BR(~chi_2+ -> ~chi_30  H+)
#
#         PDG            Width
DECAY   1000022     0.00000000E+00   # neutralino1 decays
#
#         PDG            Width
DECAY   1000023     1.25111534E-04   # neutralino2 decays
#          BR         NDA      ID1       ID2
     8.92768002E-04    2     1000022        22   # BR(~chi_20 -> ~chi_10 gam)
#           BR         NDA      ID1       ID2       ID3
     1.17911272E-01    3     1000022        -2         2   # BR(~chi_20 -> ~chi_10 ub      u)
     1.52901220E-01    3     1000022        -1         1   # BR(~chi_20 -> ~chi_10 db      d)
     1.17911272E-01    3     1000022        -4         4   # BR(~chi_20 -> ~chi_10 cb      c)
     1.52901220E-01    3     1000022        -3         3   # BR(~chi_20 -> ~chi_10 sb      s)
     1.44128092E-01    3     1000022        -5         5   # BR(~chi_20 -> ~chi_10 bb      b)
     3.40660929E-02    3     1000022       -11        11   # BR(~chi_20 -> ~chi_10 e+      e-)
     3.40660929E-02    3     1000022       -13        13   # BR(~chi_20 -> ~chi_10 mu+     mu-)
     3.47576550E-02    3     1000022       -15        15   # BR(~chi_20 -> ~chi_10 tau+    tau-)
     7.01509185E-02    3     1000022       -12        12   # BR(~chi_20 -> ~chi_10 nu_eb   nu_e)
     7.01509185E-02    3     1000022       -14        14   # BR(~chi_20 -> ~chi_10 nu_mub  nu_mu)
     7.01465482E-02    3     1000022       -16        16   # BR(~chi_20 -> ~chi_10 nu_taub nu_tau)
     2.85242630E-06    3     1000024        -2         1   # BR(~chi_20 -> ~chi_1+ ub      d)
     2.85242630E-06    3    -1000024        -1         2   # BR(~chi_20 -> ~chi_1- db      u)
     2.85242630E-06    3     1000024        -4         3   # BR(~chi_20 -> ~chi_1+ cb      s)
     2.85242630E-06    3    -1000024        -3         4   # BR(~chi_20 -> ~chi_1- sb      c)
     9.50798168E-07    3     1000024       -12        11   # BR(~chi_20 -> ~chi_1+ nu_eb   e-)
     9.50798168E-07    3    -1000024        12       -11   # BR(~chi_20 -> ~chi_1- nu_e    e+)
     9.50798168E-07    3     1000024       -14        13   # BR(~chi_20 -> ~chi_1+ nu_mub  mu-)
     9.50798168E-07    3    -1000024        14       -13   # BR(~chi_20 -> ~chi_1- nu_mu   mu+)
     3.58055028E-07    3     1000024       -16        15   # BR(~chi_20 -> ~chi_1+ nu_taub tau-)
     3.58055028E-07    3    -1000024        16       -15   # BR(~chi_20 -> ~chi_1- nu_tau  tau+)
#
#         PDG            Width
DECAY   1000025     1.25646409E-04   # neutralino3 decays
#          BR         NDA      ID1       ID2
     9.52376101E-04    2     1000022        22   # BR(~chi_30 -> ~chi_10 gam)
     8.60865831E-06    2     1000023        22   # BR(~chi_30 -> ~chi_20 gam)
#           BR         NDA      ID1       ID2       ID3
     1.15115896E-01    3     1000022        -2         2   # BR(~chi_30 -> ~chi_10 ub      u)
     1.48887923E-01    3     1000022        -1         1   # BR(~chi_30 -> ~chi_10 db      d)
     1.15115896E-01    3     1000022        -4         4   # BR(~chi_30 -> ~chi_10 cb      c)
     1.48887923E-01    3     1000022        -3         3   # BR(~chi_30 -> ~chi_10 sb      s)
     1.44688611E-01    3     1000022        -5         5   # BR(~chi_30 -> ~chi_10 bb      b)
     2.89876891E-02    3     1000022       -11        11   # BR(~chi_30 -> ~chi_10 e+      e-)
     2.89876891E-02    3     1000022       -13        13   # BR(~chi_30 -> ~chi_10 mu+     mu-)
     3.35796338E-02    3     1000022       -15        15   # BR(~chi_30 -> ~chi_10 tau+    tau-)
     6.84044177E-02    3     1000022       -12        12   # BR(~chi_30 -> ~chi_10 nu_eb   nu_e)
     6.84044177E-02    3     1000022       -14        14   # BR(~chi_30 -> ~chi_10 nu_mub  nu_mu)
     6.83685379E-02    3     1000022       -16        16   # BR(~chi_30 -> ~chi_10 nu_taub nu_tau)
     3.87937714E-04    3     1000023        -2         2   # BR(~chi_30 -> ~chi_20 ub      u)
     5.03428914E-04    3     1000023        -1         1   # BR(~chi_30 -> ~chi_20 db      d)
     3.87937714E-04    3     1000023        -4         4   # BR(~chi_30 -> ~chi_20 cb      c)
     5.03428914E-04    3     1000023        -3         3   # BR(~chi_30 -> ~chi_20 sb      s)
     1.54514871E-04    3     1000023        -5         5   # BR(~chi_30 -> ~chi_20 bb      b)
     1.16693476E-04    3     1000023       -11        11   # BR(~chi_30 -> ~chi_20 e+      e-)
     1.16693476E-04    3     1000023       -13        13   # BR(~chi_30 -> ~chi_20 mu+     mu-)
     1.05928378E-04    3     1000023       -15        15   # BR(~chi_30 -> ~chi_20 tau+    tau-)
     2.30921319E-04    3     1000023       -12        12   # BR(~chi_30 -> ~chi_20 nu_eb   nu_e)
     2.30921319E-04    3     1000023       -14        14   # BR(~chi_30 -> ~chi_20 nu_mub  nu_mu)
     2.30926629E-04    3     1000023       -16        16   # BR(~chi_30 -> ~chi_20 nu_taub nu_tau)
     4.46213695E-03    3     1000024        -2         1   # BR(~chi_30 -> ~chi_1+ ub      d)
     4.46213695E-03    3    -1000024        -1         2   # BR(~chi_30 -> ~chi_1- db      u)
     4.46213695E-03    3     1000024        -4         3   # BR(~chi_30 -> ~chi_1+ cb      s)
     4.46213695E-03    3    -1000024        -3         4   # BR(~chi_30 -> ~chi_1- sb      c)
     1.48742282E-03    3     1000024       -12        11   # BR(~chi_30 -> ~chi_1+ nu_eb   e-)
     1.48742282E-03    3    -1000024        12       -11   # BR(~chi_30 -> ~chi_1- nu_e    e+)
     1.48742282E-03    3     1000024       -14        13   # BR(~chi_30 -> ~chi_1+ nu_mub  mu-)
     1.48742282E-03    3    -1000024        14       -13   # BR(~chi_30 -> ~chi_1- nu_mu   mu+)
     1.42140399E-03    3     1000024       -16        15   # BR(~chi_30 -> ~chi_1+ nu_taub tau-)
     1.42140399E-03    3    -1000024        16       -15   # BR(~chi_30 -> ~chi_1- nu_tau  tau+)
#
#         PDG            Width
DECAY   1000035     1.93865050E+01   # neutralino4 decays
#          BR         NDA      ID1       ID2
     9.56662959E-03    2     1000022        23   # BR(~chi_40 -> ~chi_10   Z )
     1.01589820E-01    2     1000023        23   # BR(~chi_40 -> ~chi_20   Z )
     9.88481171E-02    2     1000025        23   # BR(~chi_40 -> ~chi_30   Z )
     2.04611969E-01    2     1000024       -24   # BR(~chi_40 -> ~chi_1+   W-)
     2.04611969E-01    2    -1000024        24   # BR(~chi_40 -> ~chi_1-   W+)
     1.13302890E-02    2     1000022        25   # BR(~chi_40 -> ~chi_10   h )
     6.18288393E-04    2     1000022        35   # BR(~chi_40 -> ~chi_10   H )
     1.20534968E-03    2     1000022        36   # BR(~chi_40 -> ~chi_10   A )
     1.13686116E-01    2     1000023        25   # BR(~chi_40 -> ~chi_20   h )
     2.83304014E-03    2     1000023        35   # BR(~chi_40 -> ~chi_20   H )
     4.26096481E-04    2     1000023        36   # BR(~chi_40 -> ~chi_20   A )
     8.76014507E-02    2     1000025        25   # BR(~chi_40 -> ~chi_30   h )
     1.82144907E-04    2     1000025        35   # BR(~chi_40 -> ~chi_30   H )
     1.86797360E-03    2     1000025        36   # BR(~chi_40 -> ~chi_30   A )
     3.48408331E-03    2     1000024       -37   # BR(~chi_40 -> ~chi_1+   H-)
     3.48408331E-03    2    -1000024        37   # BR(~chi_40 -> ~chi_1-   H+)
     1.93993372E-02    2     1000002        -2   # BR(~chi_40 -> ~u_L      ub)
     1.93993372E-02    2    -1000002         2   # BR(~chi_40 -> ~u_L*     u )
     3.24202381E-08    2     2000002        -2   # BR(~chi_40 -> ~u_R      ub)
     3.24202381E-08    2    -2000002         2   # BR(~chi_40 -> ~u_R*     u )
     1.91053599E-02    2     1000001        -1   # BR(~chi_40 -> ~d_L      db)
     1.91053599E-02    2    -1000001         1   # BR(~chi_40 -> ~d_L*     d )
     1.93986937E-02    2     1000004        -4   # BR(~chi_40 -> ~c_L      cb)
     1.93986937E-02    2    -1000004         4   # BR(~chi_40 -> ~c_L*     c )
     3.24200347E-08    2     2000004        -4   # BR(~chi_40 -> ~c_R      cb)
     3.24200347E-08    2    -2000004         4   # BR(~chi_40 -> ~c_R*     c )
     1.91053599E-02    2     1000003        -3   # BR(~chi_40 -> ~s _L      sb)
     1.91053599E-02    2    -1000003         3   # BR(~chi_40 -> ~s _L*     s )
     1.69986283E-05    2     1000006        -6   # BR(~chi_40 -> ~t_1      tb)
     1.69986283E-05    2    -1000006         6   # BR(~chi_40 -> ~t_1*     t )
     1.81448016E-07    2     2000011       -11   # BR(~chi_40 -> ~e_R-     e+)
     1.81448016E-07    2    -2000011        11   # BR(~chi_40 -> ~e_R+     e-)
     1.81448016E-07    2     2000013       -13   # BR(~chi_40 -> ~mu_R-    mu+)
     1.81448016E-07    2    -2000013        13   # BR(~chi_40 -> ~mu_R+    mu-)
     1.12981903E-07    2     1000015       -15   # BR(~chi_40 -> ~tau_1-   tau+)
     1.12981903E-07    2    -1000015        15   # BR(~chi_40 -> ~tau_1+   tau-)
#
#         PDG            Width
DECAY        25     7.46616753E-03   # h decays
#          BR         NDA      ID1       ID2
     3.24424832E-01    2           5        -5   # BR(h -> b       bb     )
     3.50307926E-02    2         -15        15   # BR(h -> tau+    tau-   )
     1.23999276E-04    2         -13        13   # BR(h -> mu+     mu-    )
     1.35420498E-04    2           3        -3   # BR(h -> s       sb     )
     1.15926459E-02    2           4        -4   # BR(h -> c       cb     )
     4.24441310E-02    2          21        21   # BR(h -> g       g      )
     1.24359622E-03    2          22        22   # BR(h -> gam     gam    )
     8.13142186E-04    2          22        23   # BR(h -> Z       gam    )
     1.08769068E-01    2          24       -24   # BR(h -> W+      W-     )
     1.35047965E-02    2          23        23   # BR(h -> Z       Z      )
     4.61917576E-01    2     1000022   1000022   # BR(h -> ~chi_10 ~chi_10)
#
#         PDG            Width
DECAY        35     3.47631102E+01   # H decays
#          BR         NDA      ID1       ID2
     7.91511100E-01    2           5        -5   # BR(H -> b       bb     )
     1.37914948E-01    2         -15        15   # BR(H -> tau+    tau-   )
     4.89011844E-04    2         -13        13   # BR(H -> mu+     mu-    )
     3.31384230E-04    2           3        -3   # BR(H -> s       sb     )
     2.02425211E-08    2           4        -4   # BR(H -> c       cb     )
     1.95490773E-03    2           6        -6   # BR(H -> t       tb     )
     2.49421727E-05    2          21        21   # BR(H -> g       g      )
     7.41055254E-09    2          22        22   # BR(H -> gam     gam    )
     1.24307775E-08    2          23        22   # BR(H -> Z       gam    )
     2.36602226E-06    2          24       -24   # BR(H -> W+      W-     )
     1.17816190E-06    2          23        23   # BR(H -> Z       Z      )
     8.41114425E-06    2          25        25   # BR(H -> h       h      )
     1.31552363E-03    2     1000024  -1000024   # BR(H -> ~chi_1+ ~chi_1-)
     1.92998712E-02    2     1000022   1000022   # BR(H -> ~chi_10 ~chi_10)
     1.18906411E-03    2     1000023   1000023   # BR(H -> ~chi_20 ~chi_20)
     1.03533488E-02    2     1000025   1000025   # BR(H -> ~chi_30 ~chi_30)
     1.91930227E-02    2     1000022   1000023   # BR(H -> ~chi_10 ~chi_20)
     4.17325079E-03    2     1000022   1000025   # BR(H -> ~chi_10 ~chi_30)
     1.22372202E-02    2     1000023   1000025   # BR(H -> ~chi_20 ~chi_30)
     2.04707704E-07    2     2000011  -2000011   # BR(H -> ~e_R-   ~e_R+  )
     2.04707704E-07    2     2000013  -2000013   # BR(H -> ~mu_R-  ~mu_R+ )
#
#         PDG            Width
DECAY        36     3.47659613E+01   # A decays
#          BR         NDA      ID1       ID2
     7.91474833E-01    2           5        -5   # BR(A -> b       bb     )
     1.37905019E-01    2         -15        15   # BR(A -> tau+    tau-   )
     4.88974947E-04    2         -13        13   # BR(A -> mu+     mu-    )
     3.31378895E-04    2           3        -3   # BR(A -> s       sb     )
     2.01579196E-08    2           4        -4   # BR(A -> c       cb     )
     1.97371794E-03    2           6        -6   # BR(A -> t       tb     )
     5.35458225E-05    2          21        21   # BR(A -> g       g      )
     1.08319209E-08    2          22        22   # BR(A -> gam     gam    )
     3.18894990E-08    2          23        22   # BR(A -> Z       gam    )
     2.38462857E-06    2          23        25   # BR(A -> Z       h      )
     1.32844364E-03    2     1000024  -1000024   # BR(A -> ~chi_1+ ~chi_1-)
     2.03753146E-02    2     1000022   1000022   # BR(A -> ~chi_10 ~chi_10)
     1.06775989E-03    2     1000023   1000023   # BR(A -> ~chi_20 ~chi_20)
     1.20535352E-02    2     1000025   1000025   # BR(A -> ~chi_30 ~chi_30)
     1.65754261E-02    2     1000022   1000023   # BR(A -> ~chi_10 ~chi_20)
     5.16312076E-03    2     1000022   1000025   # BR(A -> ~chi_10 ~chi_30)
     1.12064834E-02    2     1000023   1000025   # BR(A -> ~chi_20 ~chi_30)
#
#         PDG            Width
DECAY        37     3.42001369E+01   # H+ decays
#          BR         NDA      ID1       ID2
     1.32927456E-03    2           4        -5   # BR(H+ -> c       bb     )
     1.40345646E-01    2         -15        16   # BR(H+ -> tau+    nu_tau )
     4.97628770E-04    2         -13        14   # BR(H+ -> mu+     nu_mu  )
     1.32927085E-05    2           2        -5   # BR(H+ -> u       bb     )
     1.68390150E-05    2           2        -3   # BR(H+ -> u       sb     )
     3.31462463E-04    2           4        -3   # BR(H+ -> c       sb     )
     7.89400064E-01    2           6        -5   # BR(H+ -> t       bb     )
     2.43619606E-06    2          24        25   # BR(H+ -> W+      h      )
     1.85047836E-12    2          24        36   # BR(H+ -> W+      A      )
     5.29603663E-02    2     1000024   1000022   # BR(H+ -> ~chi_1+ ~chi_10)
     3.77027384E-03    2     1000024   1000023   # BR(H+ -> ~chi_1+ ~chi_20)
     1.13327164E-02    2     1000024   1000025   # BR(H+ -> ~chi_1+ ~chi_30)
