#
#                              ======================
#                              | THE SUSYHIT OUTPUT |
#                              ======================
#
#
#              ------------------------------------------------------
#              |     This is the output of the SUSY-HIT package     |
#              |  created by A.Djouadi, M.Muehlleitner and M.Spira. |
#              |  In case of problems with SUSY-HIT email to        |
#              |           margarete.muehlleitner@cern.ch           |
#              |           michael.spira@psi.ch                     |
#              |           abdelhak.djouadi@cern.ch                 |
#              ------------------------------------------------------
#
#              ------------------------------------------------------
#              |  SUSY Les Houches Accord - MSSM Spectrum + Decays  |
#              |              based on the decay programs           |
#              |                                                    |
#              |                     SDECAY 1.3b                    |
#              |                                                    |
#              |  Authors: M.Muhlleitner, A.Djouadi and Y.Mambrini  |
#              |  Ref.:    Comput.Phys.Commun.168(2005)46           |
#              |           [hep-ph/0311167]                         |
#              |                                                    |
#              |                     HDECAY 3.4                     |
#              |                                                    |
#              |  By: A.Djouadi,J.Kalinowski,M.Muhlleitner,M.Spira  |
#              |  Ref.:    Comput.Phys.Commun.108(1998)56           |
#              |           [hep-ph/9704448]                         |
#              |                                                    |
#              |                                                    |
#              |  If not stated otherwise all DRbar couplings and   |
#              |  soft SUSY breaking masses are given at the scale  |
#              |  Q=  0.17901520E+04
#              |                                                    |
#              ------------------------------------------------------
#
#
BLOCK DCINFO  # Decay Program information
     1   SDECAY/HDECAY # decay calculator
     2   1.3b  /3.4    # version number
#
BLOCK SPINFO  # Spectrum calculator information
     1     SOFTSUSY    # spectrum calculator               
     2     3.4.0       # version number                    
#
BLOCK MODSEL  # Model selection
     1     0   #  nonUniversal                                     
#
BLOCK SMINPUTS  # Standard Model inputs
         1     1.27908970E+02   # alpha_em^-1(M_Z)^MSbar
         2     1.16637870E-05   # G_F [GeV^-2]
         3     1.18400000E-01   # alpha_S(M_Z)^MSbar
         4     9.11876000E+01   # M_Z pole mass
         5     4.18000000E+00   # mb(mb)^MSbar
         6     1.73200000E+02   # mt pole mass
         7     1.77700000E+00   # mtau pole mass
#
BLOCK MINPAR  # Input parameters - minimal models
         3     1.35900000E+01   # tanb                
#
BLOCK EXTPAR  # Input parameters - non-minimal models
         0    -1.00000000E+00   # Set                 
         1     2.06169000E+03   # M_1(MX)             
         2     2.14290000E+02   # M_2(MX)             
         3     1.48044000E+03   # M_3(MX)             
        11    -2.61022000E+03   # At(MX)              
        12    -3.11000000E+00   # Ab(MX)              
        13     1.63558000E+03   # Atau(MX)            
        23     9.75770000E+02   # mu(MX)              
        26     7.15000000E+02   # mA(pole)            
        31     2.59031000E+03   # meL(MX)             
        32     2.59031000E+03   # mmuL(MX)            
        33     7.95540000E+02   # mtauL(MX)           
        34     1.76322000E+03   # meR(MX)             
        35     1.76322000E+03   # mmuR(MX)            
        36     2.41580000E+02   # mtauR(MX)           
        41     2.70321000E+03   # mqL1(MX)            
        42     2.70321000E+03   # mqL2(MX)            
        43     1.00460000E+03   # mqL3(MX)            
        44     2.42922000E+03   # muR(MX)             
        45     2.42922000E+03   # mcR(MX)             
        46     3.18189000E+03   # mtR(MX)             
        47     9.12270000E+02   # mdR(MX)             
        48     9.12270000E+02   # msR(MX)             
        49     2.87749000E+03   # mbR(MX)             
#
BLOCK MASS  # Mass Spectrum
# PDG code           mass       particle
        24     8.03787264E+01   # W+
        25     1.24910082E+02   # h
        35     7.15128453E+02   # H
        36     7.15000002E+02   # A
        37     7.19632951E+02   # H+
         5     4.81876030E+00   # b-quark pole mass calculated from mb(mb)_Msbar
   1000001     2.74075348E+03   # ~d_L
   2000001     9.96821175E+02   # ~d_R
   1000002     2.73973281E+03   # ~u_L
   2000002     2.46657513E+03   # ~u_R
   1000003     2.74075348E+03   # ~s_L
   2000003     9.96821175E+02   # ~s_R
   1000004     2.73973281E+03   # ~c_L
   2000004     2.46657513E+03   # ~c_R
   1000005     1.09650106E+03   # ~b_1
   2000005     2.90857451E+03   # ~b_2
   1000006     1.09594486E+03   # ~t_1
   2000006     3.19227771E+03   # ~t_2
   1000011     2.59635803E+03   # ~e_L
   2000011     1.76957874E+03   # ~e_R
   1000012     2.59481214E+03   # ~nu_eL
   1000013     2.59635803E+03   # ~mu_L
   2000013     1.76957874E+03   # ~mu_R
   1000014     2.59481214E+03   # ~nu_muL
   1000015     2.58397445E+02   # ~tau_1
   2000015     8.01141197E+02   # ~tau_2
   1000016     7.96377519E+02   # ~nu_tauL
   1000021     1.62006312E+03   # ~g
   1000022     2.26508281E+02   # ~chi_10
   1000023    -9.96365263E+02   # ~chi_20
   1000025     9.97277151E+02   # ~chi_30
   1000035     2.04590492E+03   # ~chi_40
   1000024     2.26676673E+02   # ~chi_1+
   1000037     1.00113056E+03   # ~chi_2+
#
BLOCK NMIX  # Neutralino Mixing Matrix
  1  1    -7.82981050E-04   # N_11
  1  2     9.95993752E-01   # N_12
  1  3    -8.57475315E-02   # N_13
  1  4     2.53612470E-02   # N_14
  2  1    -9.22224526E-03   # N_21
  2  2     4.27029107E-02   # N_22
  2  3     7.05353696E-01   # N_23
  2  4     7.07508003E-01   # N_24
  3  1     3.12537558E-02   # N_31
  3  2     7.85573826E-02   # N_32
  3  3     7.03478152E-01   # N_33
  3  4    -7.05670199E-01   # N_34
  4  1     9.99468629E-01   # N_41
  4  2    -1.28223364E-03   # N_42
  4  3    -1.55567947E-02   # N_43
  4  4     2.86147188E-02   # N_44
#
BLOCK UMIX  # Chargino Mixing Matrix U
  1  1     9.92673687E-01   # U_11
  1  2    -1.20826119E-01   # U_12
  2  1     1.20826119E-01   # U_21
  2  2     9.92673687E-01   # U_22
#
BLOCK VMIX  # Chargino Mixing Matrix V
  1  1     9.99359633E-01   # V_11
  1  2    -3.57816053E-02   # V_12
  2  1     3.57816053E-02   # V_21
  2  2     9.99359633E-01   # V_22
#
BLOCK STOPMIX  # Stop Mixing Matrix
  1  1     9.99051125E-01   # cos(theta_t)
  1  2     4.35528373E-02   # sin(theta_t)
  2  1    -4.35528373E-02   # -sin(theta_t)
  2  2     9.99051125E-01   # cos(theta_t)
#
BLOCK SBOTMIX  # Sbottom Mixing Matrix
  1  1     9.99991707E-01   # cos(theta_b)
  1  2     4.07258287E-03   # sin(theta_b)
  2  1    -4.07258287E-03   # -sin(theta_b)
  2  2     9.99991707E-01   # cos(theta_b)
#
BLOCK STAUMIX  # Stau Mixing Matrix
  1  1     3.51653998E-02   # cos(theta_tau)
  1  2     9.99381506E-01   # sin(theta_tau)
  2  1    -9.99381506E-01   # -sin(theta_tau)
  2  2     3.51653998E-02   # cos(theta_tau)
#
BLOCK ALPHA  # Higgs mixing
          -7.97014320E-02   # Mixing angle in the neutral Higgs boson sector
#
BLOCK HMIX Q=  1.79015200E+03  # DRbar Higgs Parameters
         1     9.87512314E+02   # mu(Q)MSSM           
         2     1.30501943E+01   # tan                 
         3     2.42838162E+02   # higgs               
         4     7.66777376E+05   # mA^2(Q)MSSM         
#
BLOCK GAUGE Q=  1.79015200E+03  # The gauge couplings
     1     3.63590312E-01   # gprime(Q) DRbar
     2     6.42190867E-01   # g(Q) DRbar
     3     1.03584073E+00   # g3(Q) DRbar
#
BLOCK AU Q=  1.79015200E+03  # The trilinear couplings
  1  1     0.00000000E+00   # A_u(Q) DRbar
  2  2     0.00000000E+00   # A_c(Q) DRbar
  3  3    -2.61022000E+03   # A_t(Q) DRbar
#
BLOCK AD Q=  1.79015200E+03  # The trilinear couplings
  1  1     0.00000000E+00   # A_d(Q) DRbar
  2  2     0.00000000E+00   # A_s(Q) DRbar
  3  3    -3.10999891E+00   # A_b(Q) DRbar
#
BLOCK AE Q=  1.79015200E+03  # The trilinear couplings
  1  1     0.00000000E+00   # A_e(Q) DRbar
  2  2     0.00000000E+00   # A_mu(Q) DRbar
  3  3     1.63558000E+03   # A_tau(Q) DRbar
#
BLOCK Yu Q=  1.79015200E+03  # The Yukawa couplings
  1  1     0.00000000E+00   # y_u(Q) DRbar
  2  2     0.00000000E+00   # y_c(Q) DRbar
  3  3     8.34932595E-01   # y_t(Q) DRbar
#
BLOCK Yd Q=  1.79015200E+03  # The Yukawa couplings
  1  1     0.00000000E+00   # y_d(Q) DRbar
  2  2     0.00000000E+00   # y_s(Q) DRbar
  3  3     1.75267099E-01   # y_b(Q) DRbar
#
BLOCK Ye Q=  1.79015200E+03  # The Yukawa couplings
  1  1     0.00000000E+00   # y_e(Q) DRbar
  2  2     0.00000000E+00   # y_mu(Q) DRbar
  3  3     1.34497820E-01   # y_tau(Q) DRbar
#
BLOCK MSOFT Q=  1.79015200E+03  # The soft SUSY breaking masses at the scale Q
         1     2.06169000E+03   # M_1(Q)              
         2     2.14290000E+02   # M_2(Q)              
         3     1.48044000E+03   # M_3(Q)              
        21    -4.89162972E+05   # mH1^2(Q)            
        22    -1.02644183E+06   # mH2^2(Q)            
        31     2.59031000E+03   # meL(Q)              
        32     2.59031000E+03   # mmuL(Q)             
        33     7.95540000E+02   # mtauL(Q)            
        34     1.76322000E+03   # meR(Q)              
        35     1.76322000E+03   # mmuR(Q)             
        36     2.41580000E+02   # mtauR(Q)            
        41     2.70321000E+03   # mqL1(Q)             
        42     2.70321000E+03   # mqL2(Q)             
        43     1.00459999E+03   # mqL3(Q)             
        44     2.42922000E+03   # muR(Q)              
        45     2.42922000E+03   # mcR(Q)              
        46     3.18189000E+03   # mtR(Q)              
        47     9.12269997E+02   # mdR(Q)              
        48     9.12269997E+02   # msR(Q)              
        49     2.87749000E+03   # mbR(Q)              
#
Block HiggsBoundsInputHiggsCouplingsFermions
# ScalarNormEffCoupSq PseudoSNormEffCoupSq NP   IP1 IP2 IP2
    1.08589797E+00    0.00000000E+00        3  25   5   5  # h0-b-b eff. coupling^2, normalised to SM
    1.70221673E+02    0.00000000E+00        3  35   5   5  # H0-b-b eff. coupling^2, normalised to SM
    0.00000000E+00    1.70307571E+02        3  36   5   5  # A0-b-b eff. coupling^2, normalised to SM
#
    9.99495630E-01    0.00000000E+00        3  25   6   6  # h0-t-t eff. coupling^2, normalised to SM
    6.37609918E-03    0.00000000E+00        3  35   6   6  # H0-t-t eff. coupling^2, normalised to SM
    0.00000000E+00    5.87172956E-03        3  36   6   6  # A0-t-t eff. coupling^2, normalised to SM
#
    1.08589797E+00    0.00000000E+00        3  25  15  15  # h0-tau-tau eff. coupling^2, normalised to SM
    1.70221673E+02    0.00000000E+00        3  35  15  15  # H0-tau-tau eff. coupling^2, normalised to SM
    0.00000000E+00    1.70307571E+02        3  36  15  15  # A0-tau-tau eff. coupling^2, normalised to SM
#
Block HiggsBoundsInputHiggsCouplingsBosons
    9.99989608E-01        3  25  24  24  # h0-W-W eff. coupling^2, normalised to SM
    1.03920272E-05        3  35  24  24  # H0-W-W eff. coupling^2, normalised to SM
    0.00000000E+00        3  36  24  24  # A0-W-W eff. coupling^2, normalised to SM
#
    9.99989608E-01        3  25  23  23  # h0-Z-Z eff. coupling^2, normalised to SM
    1.03920272E-05        3  35  23  23  # H0-Z-Z eff. coupling^2, normalised to SM
    0.00000000E+00        3  36  23  23  # A0-Z-Z eff. coupling^2, normalised to SM
#
    8.90798431E-01        3  25  21  21  # h0-g-g eff. coupling^2, normalised to SM
    9.25120449E-05        3  35  21  21  # H0-g-g eff. coupling^2, normalised to SM
    4.11863044E-04        3  36  21  21  # A0-g-g eff. coupling^2, normalised to SM
#
    0.00000000E+00        3  25  25  23  # h0-h0-Z eff. coupling^2, normalised to SM
    0.00000000E+00        3  35  25  23  # H0-h0-Z eff. coupling^2, normalised to SM
    1.03920272E-05        3  36  25  23  # A0-h0-Z eff. coupling^2, normalised to SM
    0.00000000E+00        3  35  35  23  # H0-H0-Z eff. coupling^2, normalised to SM
    9.99989608E-01        3  36  35  23  # A0-H0-Z eff. coupling^2, normalised to SM
    0.00000000E+00        3  36  36  23  # A0-A0-Z eff. coupling^2, normalised to SM
#
    0.00000000E+00        4  25  21  21  23  # h0-g-g-Z eff. coupling^2, normalised to SM
    0.00000000E+00        4  35  21  21  23  # H0-g-g-Z eff. coupling^2, normalised to SM
    0.00000000E+00        4  36  21  21  23  # A0-g-g-Z eff. coupling^2, normalised to SM
#
#
#
#                             =================
#                             |The decay table|
#                             =================
#
# - The QCD corrections to the decays gluino -> squark  + quark
#                                     squark -> gaugino + quark_prime
#                                     squark -> squark_prime + Higgs
#                                     squark -> gluino  + quark
#   are included.
#
# - The multi-body decays for the inos, stops and sbottoms are included.
#
# - The loop induced decays for the gluino, neutralinos and stops
#   are included.
#
# - The SUSY decays of the top quark are included.
#
#
#         PDG            Width
DECAY         6     1.45294793E+00   # top decays
#          BR         NDA      ID1       ID2
     1.00000000E+00    2           5        24   # BR(t ->  b    W+)
#
#         PDG            Width
DECAY   1000021     4.29926097E+01   # gluino decays
#          BR         NDA      ID1       ID2
     1.34215623E-01    2     2000001        -1   # BR(~g -> ~d_R  db)
     1.34215623E-01    2    -2000001         1   # BR(~g -> ~d_R* d )
     1.34215623E-01    2     2000003        -3   # BR(~g -> ~s_R  sb)
     1.34215623E-01    2    -2000003         3   # BR(~g -> ~s_R* s )
     1.19774653E-01    2     1000005        -5   # BR(~g -> ~b_1  bb)
     1.19774653E-01    2    -1000005         5   # BR(~g -> ~b_1* b )
     1.11794100E-01    2     1000006        -6   # BR(~g -> ~t_1  tb)
     1.11794100E-01    2    -1000006         6   # BR(~g -> ~t_1* t )
#
#         PDG            Width
DECAY   1000006     1.21291355E+01   # stop1 decays
#          BR         NDA      ID1       ID2
     3.18030118E-01    2     1000022         6   # BR(~t_1 -> ~chi_10 t )
     6.80485949E-01    2     1000024         5   # BR(~t_1 -> ~chi_1+ b )
     1.48393292E-03    2     1000037         5   # BR(~t_1 -> ~chi_2+ b )
#
#         PDG            Width
DECAY   2000006     2.31275867E+02   # stop2 decays
#          BR         NDA      ID1       ID2
     6.95441165E-07    2     1000022         6   # BR(~t_2 -> ~chi_10 t )
     7.70302264E-02    2     1000023         6   # BR(~t_2 -> ~chi_20 t )
     7.75543421E-02    2     1000025         6   # BR(~t_2 -> ~chi_30 t )
     1.12406168E-02    2     1000035         6   # BR(~t_2 -> ~chi_40 t )
     1.20819077E-06    2     1000024         5   # BR(~t_2 -> ~chi_1+ b )
     1.55518077E-01    2     1000037         5   # BR(~t_2 -> ~chi_2+ b )
     4.25703456E-01    2     1000021         6   # BR(~t_2 -> ~g      t )
     5.89147415E-02    2     1000006        25   # BR(~t_2 -> ~t_1    h )
     4.59744359E-03    2     1000006        35   # BR(~t_2 -> ~t_1    H )
     4.73464816E-03    2     1000006        36   # BR(~t_2 -> ~t_1    A )
     9.43745313E-03    2     1000005        37   # BR(~t_2 -> ~b_1    H+)
     5.93392556E-02    2     1000006        23   # BR(~t_2 -> ~t_1    Z )
     1.15927823E-01    2     1000005        24   # BR(~t_2 -> ~b_1    W+)
     1.21402660E-08    2     2000005        24   # BR(~t_2 -> ~b_2    W+)
#
#         PDG            Width
DECAY   1000005     1.17716314E+01   # sbottom1 decays
#          BR         NDA      ID1       ID2
     3.47920606E-01    2     1000022         5   # BR(~b_1 -> ~chi_10 b )
     8.68523297E-04    2     1000023         5   # BR(~b_1 -> ~chi_20 b )
     9.19149252E-04    2     1000025         5   # BR(~b_1 -> ~chi_30 b )
     6.50291722E-01    2    -1000024         6   # BR(~b_1 -> ~chi_1- t )
#
#         PDG            Width
DECAY   2000005     8.22992502E+01   # sbottom2 decays
#          BR         NDA      ID1       ID2
     1.20779071E-04    2     1000022         5   # BR(~b_2 -> ~chi_10 b )
     8.38454199E-03    2     1000023         5   # BR(~b_2 -> ~chi_20 b )
     8.35308602E-03    2     1000025         5   # BR(~b_2 -> ~chi_30 b )
     5.26964081E-03    2     1000035         5   # BR(~b_2 -> ~chi_40 b )
     2.38113450E-04    2    -1000024         6   # BR(~b_2 -> ~chi_1- t )
     1.64834414E-02    2    -1000037         6   # BR(~b_2 -> ~chi_2- t )
     9.57074124E-01    2     1000021         5   # BR(~b_2 -> ~g      b )
     1.06012854E-03    2     1000005        25   # BR(~b_2 -> ~b_1    h )
     5.66358932E-06    2     1000005        35   # BR(~b_2 -> ~b_1    H )
     5.18232223E-06    2     1000005        36   # BR(~b_2 -> ~b_1    A )
     1.19601075E-05    2     1000006       -37   # BR(~b_2 -> ~t_1    H-)
     1.01519160E-03    2     1000005        23   # BR(~b_2 -> ~b_1    Z )
     1.97814753E-03    2     1000006       -24   # BR(~b_2 -> ~t_1    W-)
#
#         PDG            Width
DECAY   1000002     1.18459088E+02   # sup_L decays
#          BR         NDA      ID1       ID2
     8.90636583E-02    2     1000022         2   # BR(~u_L -> ~chi_10 u)
     1.15528609E-04    2     1000023         2   # BR(~u_L -> ~chi_20 u)
     4.90834974E-04    2     1000025         2   # BR(~u_L -> ~chi_30 u)
     6.37456326E-04    2     1000035         2   # BR(~u_L -> ~chi_40 u)
     1.79383042E-01    2     1000024         1   # BR(~u_L -> ~chi_1+ d)
     1.75795924E-04    2     1000037         1   # BR(~u_L -> ~chi_2+ d)
     7.30133684E-01    2     1000021         2   # BR(~u_L -> ~g      u)
#
#         PDG            Width
DECAY   2000002     6.00833212E+01   # sup_R decays
#          BR         NDA      ID1       ID2
     5.53546550E-08    2     1000022         2   # BR(~u_R -> ~chi_10 u)
     5.50020174E-06    2     1000023         2   # BR(~u_R -> ~chi_20 u)
     6.31251986E-05    2     1000025         2   # BR(~u_R -> ~chi_30 u)
     9.22508330E-03    2     1000035         2   # BR(~u_R -> ~chi_40 u)
     9.90706236E-01    2     1000021         2   # BR(~u_R -> ~g      u)
#
#         PDG            Width
DECAY   1000001     1.18502236E+02   # sdown_L decays
#          BR         NDA      ID1       ID2
     8.91190193E-02    2     1000022         1   # BR(~d_L -> ~chi_10 d)
     1.36030423E-04    2     1000023         1   # BR(~d_L -> ~chi_20 d)
     3.63380440E-04    2     1000025         1   # BR(~d_L -> ~chi_30 d)
     6.56247750E-04    2     1000035         1   # BR(~d_L -> ~chi_40 d)
     1.76995793E-01    2    -1000024         2   # BR(~d_L -> ~chi_1- u)
     2.00500911E-03    2    -1000037         2   # BR(~d_L -> ~chi_2- u)
     7.30724520E-01    2     1000021         1   # BR(~d_L -> ~g      d)
#
#         PDG            Width
DECAY   2000001     1.98608659E-05   # sdown_R decays
#           BR         NDA      ID1       ID2
     1.62388148E-02    2     1000022         1   # BR(~d_R -> ~chi_10 d)
#           BR         NDA      ID1       ID2       ID3
     8.37526425E-02    3        1       -15        1000015   # BR(~d_R -> d  tau+  ~tau_1-)
     8.67635887E-01    3        1       15        -1000015   # BR(~d_R -> d  tau-  ~tau_1+)
     6.48008001E-04    3        1       -15        2000015   # BR(~d_R -> d  tau+  ~tau_2-)
     1.49459747E-04    3        1       15        -2000015   # BR(~d_R -> d  tau-  ~tau_2+)
     5.79179179E-04    3        1       -16        1000016   # BR(~d_R -> d  nu_taub  ~nu_tau1)
     1.07820072E-04    3        1       16        -1000016   # BR(~d_R -> d  nu_tau  ~nu_tau1*)
     2.17080163E-03    3        1       23        1000022   # BR(~d_R -> d  Z  ~chi_10)
     7.70963365E-03    3        1       25        1000022   # BR(~d_R -> d  h  ~chi_10)
     1.38604229E-04    3        1       35        1000022   # BR(~d_R -> d  H  ~chi_10)
     2.35573818E-05    3        1       36        1000022   # BR(~d_R -> d  A  ~chi_10)
     1.53422314E-02    3        1       -24        1000024   # BR(~d_R -> d  W-  ~chi_1+)
     5.21930920E-03    3        1       24        -1000024   # BR(~d_R -> d  W+  ~chi_1-)
     2.11924295E-04    3        1       -37        1000024   # BR(~d_R -> d  H-  ~chi_1+)
     7.21267647E-05    3        1       37        -1000024   # BR(~d_R -> d  H+  ~chi_1-)
#
#         PDG            Width
DECAY   1000004     9.92695360E+01   # scharm_L decays
#          BR         NDA      ID1       ID2
     1.10750909E-01    2     1000022         4   # BR(~c_L -> ~chi_10 c)
     1.43045346E-04    2     1000023         4   # BR(~c_L -> ~chi_20 c)
     6.07739457E-04    2     1000025         4   # BR(~c_L -> ~chi_30 c)
     7.77565345E-04    2     1000035         4   # BR(~c_L -> ~chi_40 c)
     2.23063206E-01    2     1000024         3   # BR(~c_L -> ~chi_1+ s)
     2.17661468E-04    2     1000037         3   # BR(~c_L -> ~chi_2+ s)
     6.64439873E-01    2     1000021         4   # BR(~c_L -> ~g      c)
#
#         PDG            Width
DECAY   2000004     4.59591603E+01   # scharm_R decays
#          BR         NDA      ID1       ID2
     7.56259738E-08    2     1000022         4   # BR(~c_R -> ~chi_10 c)
     7.47254997E-06    2     1000023         4   # BR(~c_R -> ~chi_20 c)
     8.57609752E-05    2     1000025         4   # BR(~c_R -> ~chi_30 c)
     1.22010265E-02    2     1000035         4   # BR(~c_R -> ~chi_40 c)
     9.87705664E-01    2     1000021         4   # BR(~c_R -> ~g      c)
#
#         PDG            Width
DECAY   1000003     9.92849674E+01   # sstrange_L decays
#          BR         NDA      ID1       ID2
     1.10841920E-01    2     1000022         3   # BR(~s_L -> ~chi_10 s)
     1.68464736E-04    2     1000023         3   # BR(~s_L -> ~chi_20 s)
     4.50020452E-04    2     1000025         3   # BR(~s_L -> ~chi_30 s)
     8.00676174E-04    2     1000035         3   # BR(~s_L -> ~chi_40 s)
     2.20138467E-01    2    -1000024         4   # BR(~s_L -> ~chi_1- c)
     2.48300328E-03    2    -1000037         4   # BR(~s_L -> ~chi_2- c)
     6.65117448E-01    2     1000021         3   # BR(~s_L -> ~g      s)
#
#         PDG            Width
DECAY   2000003     1.99372212E-05   # sstrange_R decays
#           BR         NDA      ID1       ID2
     1.61120035E-02    2     1000022         3   # BR(~s_R -> ~chi_10 s)
#           BR         NDA      ID1       ID2       ID3
     8.34318875E-02    3        3       -15        1000015   # BR(~s_R -> s  tau+  ~tau_1-)
     8.68225305E-01    3        3       15        -1000015   # BR(~s_R -> s  tau-  ~tau_1+)
     6.46027841E-04    3        3       -15        2000015   # BR(~s_R -> s  tau+  ~tau_2-)
     1.48962585E-04    3        3       15        -2000015   # BR(~s_R -> s  tau-  ~tau_2+)
     5.76961045E-04    3        3       -16        1000016   # BR(~s_R -> s  nu_taub  ~nu_tau1)
     1.07407144E-04    3        3       16        -1000016   # BR(~s_R -> s  nu_tau  ~nu_tau1*)
     2.16499579E-03    3        3       23        1000022   # BR(~s_R -> s  Z  ~chi_10)
     7.66756802E-03    3        3       25        1000022   # BR(~s_R -> s  h  ~chi_10)
     1.37351137E-04    3        3       35        1000022   # BR(~s_R -> s  H  ~chi_10)
     2.30307922E-05    3        3       36        1000022   # BR(~s_R -> s  A  ~chi_10)
     1.52769534E-02    3        3       -24        1000024   # BR(~s_R -> s  W-  ~chi_1+)
     5.19881877E-03    3        3       24        -1000024   # BR(~s_R -> s  W+  ~chi_1-)
     2.10982261E-04    3        3       -37        1000024   # BR(~s_R -> s  H-  ~chi_1+)
     7.17452037E-05    3        3       37        -1000024   # BR(~s_R -> s  H+  ~chi_1-)
#
#         PDG            Width
DECAY   1000011     3.18646095E+01   # selectron_L decays
#          BR         NDA      ID1       ID2
     3.26268277E-01    2     1000022        11   # BR(~e_L -> ~chi_10 e-)
     3.41463588E-04    2     1000023        11   # BR(~e_L -> ~chi_20 e-)
     2.25039008E-03    2     1000025        11   # BR(~e_L -> ~chi_30 e-)
     1.53105386E-02    2     1000035        11   # BR(~e_L -> ~chi_40 e-)
     6.48756035E-01    2    -1000024        12   # BR(~e_L -> ~chi_1- nu_e)
     7.07329538E-03    2    -1000037        12   # BR(~e_L -> ~chi_2- nu_e)
#
#         PDG            Width
DECAY   2000011     8.99868247E-03   # selectron_R decays
#           BR         NDA      ID1       ID2
     6.13520529E-04    2     1000022        11   # BR(~e_R -> ~chi_10 e-)
#           BR         NDA      ID1       ID2       ID3
     4.57844803E-03    3        11       -1        2000001   # BR(~e_R- -> e-  db  ~d_R)
     9.45371729E-03    3        11       1        -2000001   # BR(~e_R- -> e-  d  ~d_R*)
     4.69246472E-03    3        11       -3        2000003   # BR(~e_R- -> e-  sb  ~s_R)
     9.45794013E-03    3        11       3        -2000003   # BR(~e_R- -> e-  s  ~s_R*)
     1.47421581E-03    3        11       -5        1000005   # BR(~e_R- -> e-  bb  ~b_1)
     7.82458991E-04    3        11       5        -1000005   # BR(~e_R- -> e-  b  ~b_1*)
     1.85971669E-03    3        11       -6        1000006   # BR(~e_R- -> e-  tb  ~t_1)
     9.06654950E-04    3        11       6        -1000006   # BR(~e_R- -> e-  t  ~t_1*)
     8.42967849E-02    3        11       -15        1000015   # BR(~e_R- -> e-  tau+  ~tau_1-)
     2.63394115E-01    3        11       15        -1000015   # BR(~e_R- -> e-  tau-  ~tau_1+)
     1.64590762E-02    3        11       -15        2000015   # BR(~e_R- -> e-  tau+  ~tau_2-)
     7.91271392E-03    3        11       15        -2000015   # BR(~e_R- -> e-  tau-  ~tau_2+)
     1.73080893E-02    3        11       -16        1000016   # BR(~e_R- -> e-  nu_taub  ~nu_tau1)
     7.32151626E-03    3        11       16        -1000016   # BR(~e_R- -> e-  nu_tau  ~nu_tau1*)
     4.12038097E-02    3        11       23        1000022   # BR(~e_R- -> e-  Z  ~chi_10)
     1.07445729E-01    3        11       25        1000022   # BR(~e_R- -> e-  h  ~chi_10)
     1.50322006E-02    3        11       35        1000022   # BR(~e_R- -> e-  H  ~chi_10)
     3.10123178E-03    3        11       36        1000022   # BR(~e_R- -> e-  A  ~chi_10)
     1.52155608E-02    3        11       23        1000023   # BR(~e_R- -> e-  Z  ~chi_20)
     7.75491304E-04    3        11       25        1000023   # BR(~e_R- -> e-  h  ~chi_20)
     2.46969488E-07    3        11       35        1000023   # BR(~e_R- -> e-  H  ~chi_20)
     1.64901918E-05    3        11       36        1000023   # BR(~e_R- -> e-  A  ~chi_20)
     9.06588273E-04    3        11       23        1000025   # BR(~e_R- -> e-  Z  ~chi_30)
     1.64146251E-02    3        11       25        1000025   # BR(~e_R- -> e-  h  ~chi_30)
     1.51733324E-05    3        11       35        1000025   # BR(~e_R- -> e-  H  ~chi_30)
     2.34200952E-07    3        11       36        1000025   # BR(~e_R- -> e-  A  ~chi_30)
     1.50055300E-01    3        11       -24        1000024   # BR(~e_R- -> e-  W-  ~chi_1+)
     1.50510923E-01    3        11       24        -1000024   # BR(~e_R- -> e-  W+  ~chi_1-)
     1.74225505E-02    3        11       -37        1000024   # BR(~e_R- -> e-  H-  ~chi_1+)
     1.81471010E-02    3        11       37        -1000024   # BR(~e_R- -> e-  H+  ~chi_1-)
     1.14939048E-02    3        11       -24        1000037   # BR(~e_R- -> e-  W-  ~chi_2+)
     2.17131786E-02    3        11       24        -1000037   # BR(~e_R- -> e-  W+  ~chi_2-)
     1.08416983E-05    3        11       -37        1000037   # BR(~e_R- -> e-  H-  ~chi_2+)
     7.38652578E-06    3        11       37        -1000037   # BR(~e_R- -> e-  H+  ~chi_2-)
#
#         PDG            Width
DECAY   1000013     3.18646095E+01   # smuon_L decays
#          BR         NDA      ID1       ID2
     3.26268277E-01    2     1000022        13   # BR(~mu_L -> ~chi_10 mu-)
     3.41463587E-04    2     1000023        13   # BR(~mu_L -> ~chi_20 mu-)
     2.25039007E-03    2     1000025        13   # BR(~mu_L -> ~chi_30 mu-)
     1.53105383E-02    2     1000035        13   # BR(~mu_L -> ~chi_40 mu-)
     6.48756036E-01    2    -1000024        14   # BR(~mu_L -> ~chi_1- nu_mu)
     7.07329539E-03    2    -1000037        14   # BR(~mu_L -> ~chi_2- nu_mu)
#
#         PDG            Width
DECAY   2000013     9.02484045E-03   # smuon_R decays
#           BR         NDA      ID1       ID2
     6.11742269E-04    2     1000022        13   # BR(~mu_R -> ~chi_10 mu-)
#           BR         NDA      ID1       ID2       ID3
     4.56517766E-03    3        13       -1        2000001   # BR(~mu_R- -> mu-  db  ~d_R)
     9.42631623E-03    3        13       1        -2000001   # BR(~mu_R- -> mu-  d  ~d_R*)
     4.67886388E-03    3        13       -3        2000003   # BR(~mu_R- -> mu-  sb  ~s_R)
     9.43052682E-03    3        13       3        -2000003   # BR(~mu_R- -> mu-  s  ~s_R*)
     1.46994288E-03    3        13       -5        1000005   # BR(~mu_R- -> mu-  bb  ~b_1)
     7.66318255E-04    3        13       5        -1000005   # BR(~mu_R- -> mu-  b  ~b_1*)
     1.84690246E-03    3        13       -6        1000006   # BR(~mu_R- -> mu-  tb  ~t_1)
     8.98254106E-04    3        13       6        -1000006   # BR(~mu_R- -> mu-  t  ~t_1*)
     8.40524554E-02    3        13       -15        1000015   # BR(~mu_R- -> mu-  tau+  ~tau_1-)
     2.65589183E-01    3        13       15        -1000015   # BR(~mu_R- -> mu-  tau-  ~tau_1+)
     1.64113705E-02    3        13       -15        2000015   # BR(~mu_R- -> mu-  tau+  ~tau_2-)
     7.82905806E-03    3        13       15        -2000015   # BR(~mu_R- -> mu-  tau-  ~tau_2+)
     1.72579228E-02    3        13       -16        1000016   # BR(~mu_R- -> mu-  nu_taub  ~nu_tau1)
     7.30029525E-03    3        13       16        -1000016   # BR(~mu_R- -> mu-  nu_tau  ~nu_tau1*)
     4.10843827E-02    3        13       23        1000022   # BR(~mu_R- -> mu-  Z  ~chi_10)
     1.07134304E-01    3        13       25        1000022   # BR(~mu_R- -> mu-  h  ~chi_10)
     1.49886306E-02    3        13       35        1000022   # BR(~mu_R- -> mu-  H  ~chi_10)
     3.09224302E-03    3        13       36        1000022   # BR(~mu_R- -> mu-  A  ~chi_10)
     1.51714592E-02    3        13       23        1000023   # BR(~mu_R- -> mu-  Z  ~chi_20)
     7.73243585E-04    3        13       25        1000023   # BR(~mu_R- -> mu-  h  ~chi_20)
     2.44791031E-07    3        13       35        1000023   # BR(~mu_R- -> mu-  H  ~chi_20)
     1.64955826E-05    3        13       36        1000023   # BR(~mu_R- -> mu-  A  ~chi_20)
     9.03960579E-04    3        13       23        1000025   # BR(~mu_R- -> mu-  Z  ~chi_30)
     1.63936416E-02    3        13       25        1000025   # BR(~mu_R- -> mu-  h  ~chi_30)
     1.51071923E-05    3        13       35        1000025   # BR(~mu_R- -> mu-  H  ~chi_30)
     2.31250624E-07    3        13       36        1000025   # BR(~mu_R- -> mu-  A  ~chi_30)
     1.49609293E-01    3        13       -24        1000024   # BR(~mu_R- -> mu-  W-  ~chi_1+)
     1.50074675E-01    3        13       24        -1000024   # BR(~mu_R- -> mu-  W+  ~chi_1-)
     1.73720523E-02    3        13       -37        1000024   # BR(~mu_R- -> mu-  H-  ~chi_1+)
     1.80945027E-02    3        13       37        -1000024   # BR(~mu_R- -> mu-  H+  ~chi_1-)
     1.14716709E-02    3        13       -24        1000037   # BR(~mu_R- -> mu-  W-  ~chi_2+)
     2.16513523E-02    3        13       24        -1000037   # BR(~mu_R- -> mu-  W+  ~chi_2-)
     1.07492205E-05    3        13       -37        1000037   # BR(~mu_R- -> mu-  H-  ~chi_2+)
     7.43093469E-06    3        13       37        -1000037   # BR(~mu_R- -> mu-  H+  ~chi_2-)
#
#         PDG            Width
DECAY   1000015     6.14521736E-04   # stau_1 decays
#          BR         NDA      ID1       ID2
     3.36079188E-01    2     1000022        15   # BR(~tau_1 -> ~chi_10  tau-)
     6.63920812E-01    2    -1000024        16   # BR(~tau_1 -> ~chi_1-  nu_tau)
#
#         PDG            Width
DECAY   2000015     8.49757986E+00   # stau_2 decays
#          BR         NDA      ID1       ID2
     3.23692931E-01    2     1000022        15   # BR(~tau_2 -> ~chi_10  tau-)
     6.43118302E-01    2    -1000024        16   # BR(~tau_2 -> ~chi_1-  nu_tau)
     1.66008684E-02    2     1000015        25   # BR(~tau_2 -> ~tau_1   h)
     1.65878982E-02    2     1000015        23   # BR(~tau_2 -> ~tau_1   Z)
#
#         PDG            Width
DECAY   1000012     3.19037040E+01   # snu_eL decays
#          BR         NDA      ID1       ID2
     3.26248809E-01    2     1000022        12   # BR(~nu_eL -> ~chi_10 nu_e)
     5.56994556E-04    2     1000023        12   # BR(~nu_eL -> ~chi_20 nu_e)
     8.97764718E-04    2     1000025        12   # BR(~nu_eL -> ~chi_30 nu_e)
     1.53616631E-02    2     1000035        12   # BR(~nu_eL -> ~chi_40 nu_e)
     6.56315829E-01    2     1000024        11   # BR(~nu_eL -> ~chi_1+ e-)
     6.18938925E-04    2     1000037        11   # BR(~nu_eL -> ~chi_2+ e-)
#
#         PDG            Width
DECAY   1000014     3.19037040E+01   # snu_muL decays
#          BR         NDA      ID1       ID2
     3.26248810E-01    2     1000022        14   # BR(~nu_muL -> ~chi_10 nu_mu)
     5.56994557E-04    2     1000023        14   # BR(~nu_muL -> ~chi_20 nu_mu)
     8.97764720E-04    2     1000025        14   # BR(~nu_muL -> ~chi_30 nu_mu)
     1.53616631E-02    2     1000035        14   # BR(~nu_muL -> ~chi_40 nu_mu)
     6.56315829E-01    2     1000024        13   # BR(~nu_muL -> ~chi_1+ mu-)
     6.18938924E-04    2     1000037        13   # BR(~nu_muL -> ~chi_2+ mu-)
#
#         PDG            Width
DECAY   1000016     8.52651977E+00   # snu_tauL decays
#          BR         NDA      ID1       ID2
     3.21369077E-01    2     1000022        16   # BR(~nu_tauL -> ~chi_10 nu_tau)
     6.46706309E-01    2     1000024        15   # BR(~nu_tauL -> ~chi_1+ tau-)
     3.19246140E-02    2    -1000015       -24   # BR(~nu_tauL -> ~tau_1+ W-)
#
#         PDG            Width
DECAY   1000024     4.08700640E-15   # chargino1+ decays
#           BR         NDA      ID1       ID2       ID3
     1.93586760E-02    3     1000022       -11        12   # BR(~chi_1+ -> ~chi_10 e+   nu_e)
     2.47107980E-03    3     1000022       -13        14   # BR(~chi_1+ -> ~chi_10 mu+  nu_mu)
     9.78170240E-01    2     1000022       211             # BR(~chi_1+ -> ~chi_10 pi+)
#
#         PDG            Width
DECAY   1000037     7.39269425E+00   # chargino2+ decays
#          BR         NDA      ID1       ID2
     3.32299736E-03    2     1000016       -15   # BR(~chi_2+ -> ~nu_tau1 tau+)
     2.00477699E-02    2    -1000015        16   # BR(~chi_2+ -> ~tau_1+  nu_tau)
     1.17828577E-03    2    -2000015        16   # BR(~chi_2+ -> ~tau_2+  nu_tau)
     2.93630105E-01    2     1000024        23   # BR(~chi_2+ -> ~chi_1+  Z )
     2.87911961E-01    2     1000022        24   # BR(~chi_2+ -> ~chi_10  W+)
     2.80654806E-01    2     1000024        25   # BR(~chi_2+ -> ~chi_1+  h )
     3.77050417E-02    2     1000024        35   # BR(~chi_2+ -> ~chi_1+  H )
     3.85168551E-02    2     1000024        36   # BR(~chi_2+ -> ~chi_1+  A )
     3.70321778E-02    2     1000022        37   # BR(~chi_2+ -> ~chi_10  H+)
#
#         PDG            Width
DECAY   1000022     0.00000000E+00   # neutralino1 decays
#
#         PDG            Width
DECAY   1000023     7.33215259E+00   # neutralino2 decays
#          BR         NDA      ID1       ID2
     2.27548152E-01    2     1000022        23   # BR(~chi_20 -> ~chi_10   Z )
     2.89735952E-01    2     1000024       -24   # BR(~chi_20 -> ~chi_1+   W-)
     2.89735952E-01    2    -1000024        24   # BR(~chi_20 -> ~chi_1-   W+)
     6.33954614E-02    2     1000022        25   # BR(~chi_20 -> ~chi_10   h )
     3.68301738E-03    2     1000022        35   # BR(~chi_20 -> ~chi_10   H )
     3.25575451E-02    2     1000022        36   # BR(~chi_20 -> ~chi_10   A )
     3.45469759E-02    2     1000024       -37   # BR(~chi_20 -> ~chi_1+   H-)
     3.45469759E-02    2    -1000024        37   # BR(~chi_20 -> ~chi_1-   H+)
     1.04414983E-02    2     1000015       -15   # BR(~chi_20 -> ~tau_1-   tau+)
     1.04414983E-02    2    -1000015        15   # BR(~chi_20 -> ~tau_1+   tau-)
     1.59998946E-03    2     2000015       -15   # BR(~chi_20 -> ~tau_2-   tau+)
     1.59998946E-03    2    -2000015        15   # BR(~chi_20 -> ~tau_2+   tau-)
     8.34959078E-05    2     1000016       -16   # BR(~chi_20 -> ~nu_tau1  nu_taub)
     8.34959078E-05    2    -1000016        16   # BR(~chi_20 -> ~nu_tau1* nu_tau )
#
#         PDG            Width
DECAY   1000025     7.35768370E+00   # neutralino3 decays
#          BR         NDA      ID1       ID2
     6.82534047E-02    2     1000022        23   # BR(~chi_30 -> ~chi_10   Z )
     2.90300982E-01    2     1000024       -24   # BR(~chi_30 -> ~chi_1+   W-)
     2.90300982E-01    2    -1000024        24   # BR(~chi_30 -> ~chi_1-   W+)
     2.19729175E-01    2     1000022        25   # BR(~chi_30 -> ~chi_10   h )
     3.21873699E-02    2     1000022        35   # BR(~chi_30 -> ~chi_10   H )
     3.71856305E-03    2     1000022        36   # BR(~chi_30 -> ~chi_10   A )
     3.51519555E-02    2     1000024       -37   # BR(~chi_30 -> ~chi_1+   H-)
     3.51519555E-02    2    -1000024        37   # BR(~chi_30 -> ~chi_1-   H+)
     1.27844268E-10    2     2000001        -1   # BR(~chi_30 -> ~d_R      db)
     1.27844268E-10    2    -2000001         1   # BR(~chi_30 -> ~d_R*     d )
     1.27844268E-10    2     2000003        -3   # BR(~chi_30 -> ~s _R      sb)
     1.27844268E-10    2    -2000003         3   # BR(~chi_30 -> ~s _R*     s )
     1.06096886E-02    2     1000015       -15   # BR(~chi_30 -> ~tau_1-   tau+)
     1.06096886E-02    2    -1000015        15   # BR(~chi_30 -> ~tau_1+   tau-)
     1.85792790E-03    2     2000015       -15   # BR(~chi_30 -> ~tau_2-   tau+)
     1.85792790E-03    2    -2000015        15   # BR(~chi_30 -> ~tau_2+   tau-)
     1.35189708E-04    2     1000016       -16   # BR(~chi_30 -> ~nu_tau1  nu_taub)
     1.35189708E-04    2    -1000016        16   # BR(~chi_30 -> ~nu_tau1* nu_tau )
#
#         PDG            Width
DECAY   1000035     2.86454126E+01   # neutralino4 decays
#          BR         NDA      ID1       ID2
     3.47665576E-05    2     1000022        23   # BR(~chi_40 -> ~chi_10   Z )
     4.17084326E-02    2     1000023        23   # BR(~chi_40 -> ~chi_20   Z )
     3.72789919E-03    2     1000025        23   # BR(~chi_40 -> ~chi_30   Z )
     5.74265696E-05    2     1000024       -24   # BR(~chi_40 -> ~chi_1+   W-)
     5.74265696E-05    2    -1000024        24   # BR(~chi_40 -> ~chi_1-   W+)
     4.42486608E-02    2     1000037       -24   # BR(~chi_40 -> ~chi_2+   W-)
     4.42486608E-02    2    -1000037        24   # BR(~chi_40 -> ~chi_2-   W+)
     2.32284371E-05    2     1000022        25   # BR(~chi_40 -> ~chi_10   h )
     1.63714064E-04    2     1000022        35   # BR(~chi_40 -> ~chi_10   H )
     8.62370218E-05    2     1000022        36   # BR(~chi_40 -> ~chi_10   A )
     3.86793231E-03    2     1000023        25   # BR(~chi_40 -> ~chi_20   h )
     2.08558491E-03    2     1000023        35   # BR(~chi_40 -> ~chi_20   H )
     2.26260963E-02    2     1000023        36   # BR(~chi_40 -> ~chi_20   A )
     4.57848856E-02    2     1000025        25   # BR(~chi_40 -> ~chi_30   h )
     2.23123170E-02    2     1000025        35   # BR(~chi_40 -> ~chi_30   H )
     2.05897841E-03    2     1000025        36   # BR(~chi_40 -> ~chi_30   A )
     2.43773882E-04    2     1000024       -37   # BR(~chi_40 -> ~chi_1+   H-)
     2.43773882E-04    2    -1000024        37   # BR(~chi_40 -> ~chi_1-   H+)
     2.40419760E-02    2     1000037       -37   # BR(~chi_40 -> ~chi_2+   H-)
     2.40419760E-02    2    -1000037        37   # BR(~chi_40 -> ~chi_2-   H+)
     3.49136205E-02    2     2000001        -1   # BR(~chi_40 -> ~d_R      db)
     3.49136205E-02    2    -2000001         1   # BR(~chi_40 -> ~d_R*     d )
     3.49136205E-02    2     2000003        -3   # BR(~chi_40 -> ~s _R      sb)
     3.49136205E-02    2    -2000003         3   # BR(~chi_40 -> ~s _R*     s )
     8.42812728E-03    2     1000006        -6   # BR(~chi_40 -> ~t_1      tb)
     8.42812728E-03    2    -1000006         6   # BR(~chi_40 -> ~t_1*     t )
     8.05183996E-03    2     1000005        -5   # BR(~chi_40 -> ~b_1      bb)
     8.05183996E-03    2    -1000005         5   # BR(~chi_40 -> ~b_1*     b )
     1.19048773E-02    2     2000011       -11   # BR(~chi_40 -> ~e_R-     e+)
     1.19048773E-02    2    -2000011        11   # BR(~chi_40 -> ~e_R+     e-)
     1.19048773E-02    2     2000013       -13   # BR(~chi_40 -> ~mu_R-    mu+)
     1.19048773E-02    2    -2000013        13   # BR(~chi_40 -> ~mu_R+    mu-)
     1.81494909E-01    2     1000015       -15   # BR(~chi_40 -> ~tau_1-   tau+)
     1.81494909E-01    2    -1000015        15   # BR(~chi_40 -> ~tau_1+   tau-)
     3.36317392E-02    2     2000015       -15   # BR(~chi_40 -> ~tau_2-   tau+)
     3.36317392E-02    2    -2000015        15   # BR(~chi_40 -> ~tau_2+   tau-)
     3.39245154E-02    2     1000016       -16   # BR(~chi_40 -> ~nu_tau1  nu_taub)
     3.39245154E-02    2    -1000016        16   # BR(~chi_40 -> ~nu_tau1* nu_tau )
#
#         PDG            Width
DECAY        25     4.37052164E-03   # h decays
#          BR         NDA      ID1       ID2
     6.24575513E-01    2           5        -5   # BR(h -> b       bb     )
     6.41804869E-02    2         -15        15   # BR(h -> tau+    tau-   )
     2.27343888E-04    2         -13        13   # BR(h -> mu+     mu-    )
     2.46890722E-04    2           3        -3   # BR(h -> s       sb     )
     1.98227703E-02    2           4        -4   # BR(h -> c       cb     )
     7.29316434E-02    2          21        21   # BR(h -> g       g      )
     2.14944838E-03    2          22        22   # BR(h -> gam     gam    )
     1.41711775E-03    2          22        23   # BR(h -> Z       gam    )
     1.90714766E-01    2          24       -24   # BR(h -> W+      W-     )
     2.37340188E-02    2          23        23   # BR(h -> Z       Z      )
#
#         PDG            Width
DECAY        35     2.14870747E+00   # H decays
#          BR         NDA      ID1       ID2
     7.72539272E-01    2           5        -5   # BR(H -> b       bb     )
     1.14663125E-01    2         -15        15   # BR(H -> tau+    tau-   )
     4.12945105E-04    2         -13        13   # BR(H -> mu+     mu-    )
     2.86881115E-04    2           3        -3   # BR(H -> s       sb     )
     1.07331259E-06    2           4        -4   # BR(H -> c       cb     )
     8.09517857E-02    2           6        -6   # BR(H -> t       tb     )
     2.61556301E-04    2          21        21   # BR(H -> g       g      )
     1.37986940E-06    2          22        22   # BR(H -> gam     gam    )
     1.67441345E-07    2          23        22   # BR(H -> Z       gam    )
     5.27962784E-04    2          24       -24   # BR(H -> W+      W-     )
     2.57904209E-04    2          23        23   # BR(H -> Z       Z      )
     2.23687939E-03    2          25        25   # BR(H -> h       h      )
     1.80368094E-02    2     1000024  -1000024   # BR(H -> ~chi_1+ ~chi_1-)
     9.04174658E-03    2     1000022   1000022   # BR(H -> ~chi_10 ~chi_10)
     7.80511842E-04    2     1000015  -1000015   # BR(H -> ~tau_1- ~tau_1+)
#
#         PDG            Width
DECAY        36     2.21615502E+00   # A decays
#          BR         NDA      ID1       ID2
     7.49461541E-01    2           5        -5   # BR(A -> b       bb     )
     1.11212933E-01    2         -15        15   # BR(A -> tau+    tau-   )
     4.00507967E-04    2         -13        13   # BR(A -> mu+     mu-    )
     2.78375253E-04    2           3        -3   # BR(A -> s       sb     )
     9.66926176E-07    2           4        -4   # BR(A -> c       cb     )
     8.94885622E-02    2           6        -6   # BR(A -> t       tb     )
     5.35015449E-04    2          21        21   # BR(A -> g       g      )
     2.49642980E-06    2          22        22   # BR(A -> gam     gam    )
     2.97847616E-07    2          23        22   # BR(A -> Z       gam    )
     4.85568258E-04    2          23        25   # BR(A -> Z       h      )
     3.20667797E-02    2     1000024  -1000024   # BR(A -> ~chi_1+ ~chi_1-)
     1.60669559E-02    2     1000022   1000022   # BR(A -> ~chi_10 ~chi_10)
#
#         PDG            Width
DECAY        37     1.92650172E+00   # H+ decays
#          BR         NDA      ID1       ID2
     1.35246494E-03    2           4        -5   # BR(H+ -> c       bb     )
     1.28763003E-01    2         -15        16   # BR(H+ -> tau+    nu_tau )
     4.63710460E-04    2         -13        14   # BR(H+ -> mu+     nu_mu  )
     1.35243917E-05    2           2        -5   # BR(H+ -> u       bb     )
     1.60160693E-05    2           2        -3   # BR(H+ -> u       sb     )
     3.16311369E-04    2           4        -3   # BR(H+ -> c       sb     )
     8.68497457E-01    2           6        -5   # BR(H+ -> t       bb     )
     5.77503327E-04    2          24        25   # BR(H+ -> W+      h      )
     1.44707776E-09    2          24        36   # BR(H+ -> W+      A      )
     8.15032552E-09    2     1000024   1000022   # BR(H+ -> ~chi_1+ ~chi_10)
