#
#                              ======================
#                              | THE SUSYHIT OUTPUT |
#                              ======================
#
#
#              ------------------------------------------------------
#              |     This is the output of the SUSY-HIT package     |
#              |  created by A.Djouadi, M.Muehlleitner and M.Spira. |
#              |  In case of problems with SUSY-HIT email to        |
#              |           margarete.muehlleitner@cern.ch           |
#              |           michael.spira@psi.ch                     |
#              |           abdelhak.djouadi@cern.ch                 |
#              ------------------------------------------------------
#
#              ------------------------------------------------------
#              |  SUSY Les Houches Accord - MSSM Spectrum + Decays  |
#              |              based on the decay programs           |
#              |                                                    |
#              |                     SDECAY 1.3b                    |
#              |                                                    |
#              |  Authors: M.Muhlleitner, A.Djouadi and Y.Mambrini  |
#              |  Ref.:    Comput.Phys.Commun.168(2005)46           |
#              |           [hep-ph/0311167]                         |
#              |                                                    |
#              |                     HDECAY 3.4                     |
#              |                                                    |
#              |  By: A.Djouadi,J.Kalinowski,M.Muhlleitner,M.Spira  |
#              |  Ref.:    Comput.Phys.Commun.108(1998)56           |
#              |           [hep-ph/9704448]                         |
#              |                                                    |
#              |                                                    |
#              |  If not stated otherwise all DRbar couplings and   |
#              |  soft SUSY breaking masses are given at the scale  |
#              |  Q=  0.30929470E+04
#              |                                                    |
#              ------------------------------------------------------
#
#
BLOCK DCINFO  # Decay Program information
     1   SDECAY/HDECAY # decay calculator
     2   1.3b  /3.4    # version number
#
BLOCK SPINFO  # Spectrum calculator information
     1     SOFTSUSY    # spectrum calculator               
     2     3.4.0       # version number                    
#
BLOCK MODSEL  # Model selection
     1     0   #  nonUniversal                                     
#
BLOCK SMINPUTS  # Standard Model inputs
         1     1.27908970E+02   # alpha_em^-1(M_Z)^MSbar
         2     1.16637870E-05   # G_F [GeV^-2]
         3     1.18400000E-01   # alpha_S(M_Z)^MSbar
         4     9.11876000E+01   # M_Z pole mass
         5     4.18000000E+00   # mb(mb)^MSbar
         6     1.73200000E+02   # mt pole mass
         7     1.77700000E+00   # mtau pole mass
#
BLOCK MINPAR  # Input parameters - minimal models
         3     3.97000000E+00   # tanb                
#
BLOCK EXTPAR  # Input parameters - non-minimal models
         0    -1.00000000E+00   # Set                 
         1     3.24846000E+03   # M_1(MX)             
         2    -1.87290000E+02   # M_2(MX)             
         3     3.01034000E+03   # M_3(MX)             
        11    -7.09912000E+03   # At(MX)              
        12    -3.30418000E+03   # Ab(MX)              
        13     3.09938000E+03   # Atau(MX)            
        23     6.31630000E+02   # mu(MX)              
        26     1.97029000E+03   # mA(pole)            
        31     2.57005000E+03   # meL(MX)             
        32     2.57005000E+03   # mmuL(MX)            
        33     1.76264000E+03   # mtauL(MX)           
        34     3.87796000E+03   # meR(MX)             
        35     3.87796000E+03   # mmuR(MX)            
        36     2.06206000E+03   # mtauR(MX)           
        41     9.17800000E+02   # mqL1(MX)            
        42     9.17800000E+02   # mqL2(MX)            
        43     2.84134000E+03   # mqL3(MX)            
        44     2.39412000E+03   # muR(MX)             
        45     2.39412000E+03   # mcR(MX)             
        46     3.37912000E+03   # mtR(MX)             
        47     1.15379000E+03   # mdR(MX)             
        48     1.15379000E+03   # msR(MX)             
        49     3.37712000E+03   # mbR(MX)             
#
BLOCK MASS  # Mass Spectrum
# PDG code           mass       particle
        24     8.03677499E+01   # W+
        25     1.25897848E+02   # h
        35     1.97102593E+03   # H
        36     1.97029004E+03   # A
        37     1.97221699E+03   # H+
         5     4.81876030E+00   # b-quark pole mass calculated from mb(mb)_Msbar
   1000001     1.12008937E+03   # ~d_L
   2000001     1.33265129E+03   # ~d_R
   1000002     1.11771968E+03   # ~u_L
   2000002     2.51807668E+03   # ~u_R
   1000003     1.12008937E+03   # ~s_L
   2000003     1.33265129E+03   # ~s_R
   1000004     1.11771968E+03   # ~c_L
   2000004     2.51807668E+03   # ~c_R
   1000005     2.88761566E+03   # ~b_1
   2000005     3.47099934E+03   # ~b_2
   1000006     2.82959988E+03   # ~t_1
   2000006     3.33180892E+03   # ~t_2
   1000011     2.57550483E+03   # ~e_L
   2000011     3.88936790E+03   # ~e_R
   1000012     2.57415830E+03   # ~nu_eL
   1000013     2.57550483E+03   # ~mu_L
   2000013     3.88936790E+03   # ~mu_R
   1000014     2.57415830E+03   # ~nu_muL
   1000015     1.76622066E+03   # ~tau_1
   2000015     2.08122116E+03   # ~tau_2
   1000016     1.76440580E+03   # ~nu_tauL
   1000021     3.09058038E+03   # ~g
   1000022    -2.03443952E+02   # ~chi_10
   1000023    -6.56640093E+02   # ~chi_20
   1000025     6.57678079E+02   # ~chi_30
   1000035     3.20174960E+03   # ~chi_40
   1000024     2.03624813E+02   # ~chi_1+
   1000037     6.62194562E+02   # ~chi_2+
#
BLOCK NMIX  # Neutralino Mixing Matrix
  1  1    -3.20522862E-04   # N_11
  1  2     9.93107948E-01   # N_12
  1  3    -1.17082755E-01   # N_13
  1  4    -5.30361686E-03   # N_14
  2  1    -5.72424861E-03   # N_21
  2  2     8.64278086E-02   # N_22
  2  3     7.01041436E-01   # N_23
  2  4     7.07840640E-01   # N_24
  3  1     1.47312871E-02   # N_31
  3  2     7.91625659E-02   # N_32
  3  3     7.03414339E-01   # N_33
  3  4    -7.06204323E-01   # N_34
  4  1     9.99875052E-01   # N_41
  4  2    -3.53162544E-04   # N_42
  4  3    -6.38758889E-03   # N_43
  4  4     1.44552606E-02   # N_44
#
BLOCK UMIX  # Chargino Mixing Matrix U
  1  1     9.86422032E-01   # U_11
  1  2    -1.64230249E-01   # U_12
  2  1     1.64230249E-01   # U_21
  2  2     9.86422032E-01   # U_22
#
BLOCK VMIX  # Chargino Mixing Matrix V
  1  1    -9.99977178E-01   # V_11
  1  2    -6.75599170E-03   # V_12
  2  1    -6.75599170E-03   # V_21
  2  2     9.99977178E-01   # V_22
#
BLOCK STOPMIX  # Stop Mixing Matrix
  1  1     9.44923407E-01   # cos(theta_t)
  1  2     3.27291544E-01   # sin(theta_t)
  2  1    -3.27291544E-01   # -sin(theta_t)
  2  2     9.44923407E-01   # cos(theta_t)
#
BLOCK SBOTMIX  # Sbottom Mixing Matrix
  1  1     9.99994181E-01   # cos(theta_b)
  1  2     3.41144634E-03   # sin(theta_b)
  2  1    -3.41144634E-03   # -sin(theta_b)
  2  2     9.99994181E-01   # cos(theta_b)
#
BLOCK STAUMIX  # Stau Mixing Matrix
  1  1     9.99999568E-01   # cos(theta_tau)
  1  2    -9.29515903E-04   # sin(theta_tau)
  2  1     9.29515903E-04   # -sin(theta_tau)
  2  2     9.99999568E-01   # cos(theta_tau)
#
BLOCK ALPHA  # Higgs mixing
          -2.60625818E-01   # Mixing angle in the neutral Higgs boson sector
#
BLOCK HMIX Q=  3.09294700E+03  # DRbar Higgs Parameters
         1     6.40203344E+02   # mu(Q)MSSM           
         2     3.77204264E+00   # tan                 
         3     2.40621338E+02   # higgs               
         4     3.85479450E+06   # mA^2(Q)MSSM         
#
BLOCK GAUGE Q=  3.09294700E+03  # The gauge couplings
     1     3.65105100E-01   # gprime(Q) DRbar
     2     6.43434034E-01   # g(Q) DRbar
     3     1.01282037E+00   # g3(Q) DRbar
#
BLOCK AU Q=  3.09294700E+03  # The trilinear couplings
  1  1     0.00000000E+00   # A_u(Q) DRbar
  2  2     0.00000000E+00   # A_c(Q) DRbar
  3  3    -7.09911998E+03   # A_t(Q) DRbar
#
BLOCK AD Q=  3.09294700E+03  # The trilinear couplings
  1  1     0.00000000E+00   # A_d(Q) DRbar
  2  2     0.00000000E+00   # A_s(Q) DRbar
  3  3    -3.30418000E+03   # A_b(Q) DRbar
#
BLOCK AE Q=  3.09294700E+03  # The trilinear couplings
  1  1     0.00000000E+00   # A_e(Q) DRbar
  2  2     0.00000000E+00   # A_mu(Q) DRbar
  3  3     3.09938000E+03   # A_tau(Q) DRbar
#
BLOCK Yu Q=  3.09294700E+03  # The Yukawa couplings
  1  1     0.00000000E+00   # y_u(Q) DRbar
  2  2     0.00000000E+00   # y_c(Q) DRbar
  3  3     8.38322172E-01   # y_t(Q) DRbar
#
BLOCK Yd Q=  3.09294700E+03  # The Yukawa couplings
  1  1     0.00000000E+00   # y_d(Q) DRbar
  2  2     0.00000000E+00   # y_s(Q) DRbar
  3  3     5.20182127E-02   # y_b(Q) DRbar
#
BLOCK Ye Q=  3.09294700E+03  # The Yukawa couplings
  1  1     0.00000000E+00   # y_e(Q) DRbar
  2  2     0.00000000E+00   # y_mu(Q) DRbar
  3  3     3.99804834E-02   # y_tau(Q) DRbar
#
BLOCK MSOFT Q=  3.09294700E+03  # The soft SUSY breaking masses at the scale Q
         1     3.24846000E+03   # M_1(Q)              
         2    -1.87290000E+02   # M_2(Q)              
         3     3.01034000E+03   # M_3(Q)              
        21     3.21311855E+06   # mH1^2(Q)            
        22     3.37969101E+04   # mH2^2(Q)            
        31     2.57005000E+03   # meL(Q)              
        32     2.57005000E+03   # mmuL(Q)             
        33     1.76264000E+03   # mtauL(Q)            
        34     3.87796000E+03   # meR(Q)              
        35     3.87796000E+03   # mmuR(Q)             
        36     2.06206000E+03   # mtauR(Q)            
        41     9.17799967E+02   # mqL1(Q)             
        42     9.17799967E+02   # mqL2(Q)             
        43     2.84133997E+03   # mqL3(Q)             
        44     2.39411999E+03   # muR(Q)              
        45     2.39411999E+03   # mcR(Q)              
        46     3.37911996E+03   # mtR(Q)              
        47     1.15378997E+03   # mdR(Q)              
        48     1.15378997E+03   # msR(Q)              
        49     3.37711999E+03   # mbR(Q)              
#
Block HiggsBoundsInputHiggsCouplingsFermions
# ScalarNormEffCoupSq PseudoSNormEffCoupSq NP   IP1 IP2 IP2
    1.01118548E+00    0.00000000E+00        3  25   5   5  # h0-b-b eff. coupling^2, normalised to SM
    1.42171202E+01    0.00000000E+00        3  35   5   5  # H0-b-b eff. coupling^2, normalised to SM
    0.00000000E+00    1.42283057E+01        3  36   5   5  # A0-b-b eff. coupling^2, normalised to SM
#
    9.99213857E-01    0.00000000E+00        3  25   6   6  # h0-t-t eff. coupling^2, normalised to SM
    7.10685803E-02    0.00000000E+00        3  35   6   6  # H0-t-t eff. coupling^2, normalised to SM
    0.00000000E+00    7.02824372E-02        3  36   6   6  # A0-t-t eff. coupling^2, normalised to SM
#
    1.01118548E+00    0.00000000E+00        3  25  15  15  # h0-tau-tau eff. coupling^2, normalised to SM
    1.42171202E+01    0.00000000E+00        3  35  15  15  # H0-tau-tau eff. coupling^2, normalised to SM
    0.00000000E+00    1.42283057E+01        3  36  15  15  # A0-tau-tau eff. coupling^2, normalised to SM
#
Block HiggsBoundsInputHiggsCouplingsBosons
    9.99997813E-01        3  25  24  24  # h0-W-W eff. coupling^2, normalised to SM
    2.18699554E-06        3  35  24  24  # H0-W-W eff. coupling^2, normalised to SM
    0.00000000E+00        3  36  24  24  # A0-W-W eff. coupling^2, normalised to SM
#
    9.99997813E-01        3  25  23  23  # h0-Z-Z eff. coupling^2, normalised to SM
    2.18699554E-06        3  35  23  23  # H0-Z-Z eff. coupling^2, normalised to SM
    0.00000000E+00        3  36  23  23  # A0-Z-Z eff. coupling^2, normalised to SM
#
    8.79696293E-01        3  25  21  21  # h0-g-g eff. coupling^2, normalised to SM
    2.41502141E-09        3  35  21  21  # H0-g-g eff. coupling^2, normalised to SM
    4.36762611E-09        3  36  21  21  # A0-g-g eff. coupling^2, normalised to SM
#
    0.00000000E+00        3  25  25  23  # h0-h0-Z eff. coupling^2, normalised to SM
    0.00000000E+00        3  35  25  23  # H0-h0-Z eff. coupling^2, normalised to SM
    2.18699554E-06        3  36  25  23  # A0-h0-Z eff. coupling^2, normalised to SM
    0.00000000E+00        3  35  35  23  # H0-H0-Z eff. coupling^2, normalised to SM
    9.99997813E-01        3  36  35  23  # A0-H0-Z eff. coupling^2, normalised to SM
    0.00000000E+00        3  36  36  23  # A0-A0-Z eff. coupling^2, normalised to SM
#
    0.00000000E+00        4  25  21  21  23  # h0-g-g-Z eff. coupling^2, normalised to SM
    0.00000000E+00        4  35  21  21  23  # H0-g-g-Z eff. coupling^2, normalised to SM
    0.00000000E+00        4  36  21  21  23  # A0-g-g-Z eff. coupling^2, normalised to SM
#
#
#
#                             =================
#                             |The decay table|
#                             =================
#
# - The QCD corrections to the decays gluino -> squark  + quark
#                                     squark -> gaugino + quark_prime
#                                     squark -> squark_prime + Higgs
#                                     squark -> gluino  + quark
#   are included.
#
# - The multi-body decays for the inos, stops and sbottoms are included.
#
# - The loop induced decays for the gluino, neutralinos and stops
#   are included.
#
# - The SUSY decays of the top quark are included.
#
#
#         PDG            Width
DECAY         6     1.45907589E+00   # top decays
#          BR         NDA      ID1       ID2
     1.00000000E+00    2           5        24   # BR(t ->  b    W+)
#
#         PDG            Width
DECAY   1000021     2.89120816E+02   # gluino decays
#          BR         NDA      ID1       ID2
     8.20100564E-02    2     1000001        -1   # BR(~g -> ~d_L  db)
     8.20100564E-02    2    -1000001         1   # BR(~g -> ~d_L* d )
     7.20274290E-02    2     2000001        -1   # BR(~g -> ~d_R  db)
     7.20274290E-02    2    -2000001         1   # BR(~g -> ~d_R* d )
     8.21149200E-02    2     1000002        -2   # BR(~g -> ~u_L  ub)
     8.21149200E-02    2    -1000002         2   # BR(~g -> ~u_L* u )
     1.22825970E-02    2     2000002        -2   # BR(~g -> ~u_R  ub)
     1.22825970E-02    2    -2000002         2   # BR(~g -> ~u_R* u )
     8.20100564E-02    2     1000003        -3   # BR(~g -> ~s_L  sb)
     8.20100564E-02    2    -1000003         3   # BR(~g -> ~s_L* s )
     7.20274290E-02    2     2000003        -3   # BR(~g -> ~s_R  sb)
     7.20274290E-02    2    -2000003         3   # BR(~g -> ~s_R* s )
     8.21149124E-02    2     1000004        -4   # BR(~g -> ~c_L  cb)
     8.21149124E-02    2    -1000004         4   # BR(~g -> ~c_L* c )
     1.22825582E-02    2     2000004        -4   # BR(~g -> ~c_R  cb)
     1.22825582E-02    2    -2000004         4   # BR(~g -> ~c_R* c )
     1.82566737E-03    2     1000005        -5   # BR(~g -> ~b_1  bb)
     1.82566737E-03    2    -1000005         5   # BR(~g -> ~b_1* b )
     1.30437411E-03    2     1000006        -6   # BR(~g -> ~t_1  tb)
     1.30437411E-03    2    -1000006         6   # BR(~g -> ~t_1* t )
#
#         PDG            Width
DECAY   1000006     7.00133411E+01   # stop1 decays
#          BR         NDA      ID1       ID2
     1.42951840E-01    2     1000022         6   # BR(~t_1 -> ~chi_10 t )
     2.68555995E-01    2     1000023         6   # BR(~t_1 -> ~chi_20 t )
     2.38714594E-01    2     1000025         6   # BR(~t_1 -> ~chi_30 t )
     2.92395783E-01    2     1000024         5   # BR(~t_1 -> ~chi_1+ b )
     5.73817885E-02    2     1000037         5   # BR(~t_1 -> ~chi_2+ b )
#
#         PDG            Width
DECAY   2000006     1.64878308E+02   # stop2 decays
#          BR         NDA      ID1       ID2
     9.17790974E-03    2     1000022         6   # BR(~t_2 -> ~chi_10 t )
     1.22880044E-01    2     1000023         6   # BR(~t_2 -> ~chi_20 t )
     1.35504398E-01    2     1000025         6   # BR(~t_2 -> ~chi_30 t )
     1.86091003E-02    2     1000024         5   # BR(~t_2 -> ~chi_1+ b )
     2.31995229E-01    2     1000037         5   # BR(~t_2 -> ~chi_2+ b )
     8.24499799E-03    2     1000021         6   # BR(~t_2 -> ~g      t )
     1.04392042E-01    2     1000006        25   # BR(~t_2 -> ~t_1    h )
     1.44611208E-01    2     1000006        23   # BR(~t_2 -> ~t_1    Z )
     2.24585071E-01    2     1000005        24   # BR(~t_2 -> ~b_1    W+)
#
#         PDG            Width
DECAY   1000005     7.14237146E+01   # sbottom1 decays
#          BR         NDA      ID1       ID2
     1.62645851E-01    2     1000022         5   # BR(~b_1 -> ~chi_10 b )
     2.09939520E-03    2     1000023         5   # BR(~b_1 -> ~chi_20 b )
     1.83675126E-03    2     1000025         5   # BR(~b_1 -> ~chi_30 b )
     3.18472597E-01    2    -1000024         6   # BR(~b_1 -> ~chi_1- t )
     5.14945406E-01    2    -1000037         6   # BR(~b_1 -> ~chi_2- t )
#
#         PDG            Width
DECAY   2000005     8.52065943E+00   # sbottom2 decays
#          BR         NDA      ID1       ID2
     1.66553832E-04    2     1000022         5   # BR(~b_2 -> ~chi_10 b )
     1.01032505E-02    2     1000023         5   # BR(~b_2 -> ~chi_20 b )
     1.01936017E-02    2     1000025         5   # BR(~b_2 -> ~chi_30 b )
     5.33720240E-03    2     1000035         5   # BR(~b_2 -> ~chi_40 b )
     3.25747603E-04    2    -1000024         6   # BR(~b_2 -> ~chi_1- t )
     2.00892814E-02    2    -1000037         6   # BR(~b_2 -> ~chi_2- t )
     9.51466929E-01    2     1000021         5   # BR(~b_2 -> ~g      b )
     5.92561891E-04    2     1000005        25   # BR(~b_2 -> ~b_1    h )
     5.25737647E-04    2     1000005        23   # BR(~b_2 -> ~b_1    Z )
     1.19810393E-03    2     1000006       -24   # BR(~b_2 -> ~t_1    W-)
     1.03055154E-06    2     2000006       -24   # BR(~b_2 -> ~t_2    W-)
#
#         PDG            Width
DECAY   1000002     1.32661389E+01   # sup_L decays
#          BR         NDA      ID1       ID2
     3.29560976E-01    2     1000022         2   # BR(~u_L -> ~chi_10 u)
     1.12176952E-03    2     1000023         2   # BR(~u_L -> ~chi_20 u)
     1.03084660E-03    2     1000025         2   # BR(~u_L -> ~chi_30 u)
     6.68272597E-01    2     1000024         1   # BR(~u_L -> ~chi_1+ d)
     1.38102539E-05    2     1000037         1   # BR(~u_L -> ~chi_2+ d)
#
#         PDG            Width
DECAY   2000002     1.85483835E-01   # sup_R decays
#           BR         NDA      ID1       ID2
     3.19526186E-06    2     1000022         2   # BR(~u_R -> ~chi_10 u)
#           BR         NDA      ID1       ID2       ID3
     1.41618811E-01    3        2       -1        1000001   # BR(~u_R -> u  db  ~d_L)
     5.28342540E-02    3        2       1        -1000001   # BR(~u_R -> u  d  ~d_L*)
     3.09601105E-02    3        2       -1        2000001   # BR(~u_R -> u  db  ~d_R)
     7.60227975E-02    3        2       1        -2000001   # BR(~u_R -> u  d  ~d_R*)
     1.41457072E-01    3        2       -2        1000002   # BR(~u_R -> u  ub  ~u_L)
     5.26471757E-02    3        2       2        -1000002   # BR(~u_R -> u  u  ~u_L*)
     1.40173940E-01    3        2       -3        1000003   # BR(~u_R -> u  sb  ~s_L)
     5.18018190E-02    3        2       3        -1000003   # BR(~u_R -> u  s  ~s_L*)
     3.13531366E-02    3        2       -3        2000003   # BR(~u_R -> u  sb  ~s_R)
     7.53974061E-02    3        2       3        -2000003   # BR(~u_R -> u  s  ~s_R*)
     1.41327680E-01    3        2       -4        1000004   # BR(~u_R -> u  cb  ~c_L)
     5.29463931E-02    3        2       4        -1000004   # BR(~u_R -> u  c  ~c_L*)
     2.71069445E-05    3        2       -15        1000015   # BR(~u_R -> u  tau+  ~tau_1-)
     1.23859850E-05    3        2       15        -1000015   # BR(~u_R -> u  tau-  ~tau_1+)
     5.13678189E-06    3        2       -15        2000015   # BR(~u_R -> u  tau+  ~tau_2-)
     9.96151505E-06    3        2       15        -2000015   # BR(~u_R -> u  tau-  ~tau_2+)
     2.73581794E-05    3        2       -16        1000016   # BR(~u_R -> u  nu_taub  ~nu_tau1)
     1.26560895E-05    3        2       16        -1000016   # BR(~u_R -> u  nu_tau  ~nu_tau1*)
     1.22161590E-03    3        2       23        1000022   # BR(~u_R -> u  Z  ~chi_10)
     1.01291846E-03    3        2       25        1000022   # BR(~u_R -> u  h  ~chi_10)
     1.29445243E-08    3        2       35        1000022   # BR(~u_R -> u  H  ~chi_10)
     3.28616239E-08    3        2       36        1000022   # BR(~u_R -> u  A  ~chi_10)
     1.00671846E-03    3        2       23        1000023   # BR(~u_R -> u  Z  ~chi_20)
     9.91299330E-05    3        2       25        1000023   # BR(~u_R -> u  h  ~chi_20)
     1.28216025E-04    3        2       23        1000025   # BR(~u_R -> u  Z  ~chi_30)
     1.00639498E-03    3        2       25        1000025   # BR(~u_R -> u  h  ~chi_30)
     2.35470655E-03    3        2       -24        1000024   # BR(~u_R -> u  W-  ~chi_1+)
     2.33659176E-03    3        2       24        -1000024   # BR(~u_R -> u  W+  ~chi_1-)
     6.03179248E-08    3        2       -37        1000024   # BR(~u_R -> u  H-  ~chi_1+)
     2.74358141E-08    3        2       37        -1000024   # BR(~u_R -> u  H+  ~chi_1-)
     6.43937517E-04    3        2       -24        1000037   # BR(~u_R -> u  W-  ~chi_2+)
     1.55124031E-03    3        2       24        -1000037   # BR(~u_R -> u  W+  ~chi_2-)
#
#         PDG            Width
DECAY   1000001     1.31664158E+01   # sdown_L decays
#          BR         NDA      ID1       ID2
     3.32904362E-01    2     1000022         1   # BR(~d_L -> ~chi_10 d)
     1.19602647E-03    2     1000023         1   # BR(~d_L -> ~chi_20 d)
     9.08044908E-04    2     1000025         1   # BR(~d_L -> ~chi_30 d)
     6.56714935E-01    2    -1000024         2   # BR(~d_L -> ~chi_1- u)
     8.27663094E-03    2    -1000037         2   # BR(~d_L -> ~chi_2- u)
#
#         PDG            Width
DECAY   2000001     1.48832144E-04   # sdown_R decays
#           BR         NDA      ID1       ID2
     5.28201002E-04    2     1000022         1   # BR(~d_R -> ~chi_10 d)
#           BR         NDA      ID1       ID2       ID3
     4.41188297E-02    3        1       -1        1000001   # BR(~d_R -> d  db  ~d_L)
     6.97228418E-03    3        1       1        -1000001   # BR(~d_R -> d  d  ~d_L*)
     4.67728263E-02    3        1       -2        1000002   # BR(~d_R -> d  ub  ~u_L)
     7.26791924E-03    3        1       2        -1000002   # BR(~d_R -> d  u  ~u_L*)
     4.43062893E-02    3        1       -3        1000003   # BR(~d_R -> d  sb  ~s_L)
     6.84327979E-03    3        1       3        -1000003   # BR(~d_R -> d  s  ~s_L*)
     4.62440428E-02    3        1       -4        1000004   # BR(~d_R -> d  cb  ~c_L)
     7.34989078E-03    3        1       4        -1000004   # BR(~d_R -> d  c  ~c_L*)
     1.32195906E-01    3        1       23        1000022   # BR(~d_R -> d  Z  ~chi_10)
     1.10352506E-01    3        1       25        1000022   # BR(~d_R -> d  h  ~chi_10)
     7.25044990E-03    3        1       23        1000023   # BR(~d_R -> d  Z  ~chi_20)
     8.41753650E-04    3        1       25        1000023   # BR(~d_R -> d  h  ~chi_20)
     7.09927288E-04    3        1       23        1000025   # BR(~d_R -> d  Z  ~chi_30)
     7.91966018E-03    3        1       25        1000025   # BR(~d_R -> d  h  ~chi_30)
     2.56617954E-01    3        1       -24        1000024   # BR(~d_R -> d  W-  ~chi_1+)
     2.57007654E-01    3        1       24        -1000024   # BR(~d_R -> d  W+  ~chi_1-)
     3.50992728E-03    3        1       -24        1000037   # BR(~d_R -> d  W-  ~chi_2+)
     1.31906990E-02    3        1       24        -1000037   # BR(~d_R -> d  W+  ~chi_2-)
#
#         PDG            Width
DECAY   1000004     1.28758484E+01   # scharm_L decays
#          BR         NDA      ID1       ID2
     3.29563607E-01    2     1000022         4   # BR(~c_L -> ~chi_10 c)
     1.11666232E-03    2     1000023         4   # BR(~c_L -> ~chi_20 c)
     1.02612745E-03    2     1000025         4   # BR(~c_L -> ~chi_30 c)
     6.68279858E-01    2     1000024         3   # BR(~c_L -> ~chi_1+ s)
     1.37456228E-05    2     1000037         3   # BR(~c_L -> ~chi_2+ s)
#
#         PDG            Width
DECAY   2000004     1.86162696E-01   # scharm_R decays
#           BR         NDA      ID1       ID2
     3.23310041E-06    2     1000022         4   # BR(~c_R -> ~chi_10 c)
#           BR         NDA      ID1       ID2       ID3
     1.41875900E-01    3        4       -1        1000001   # BR(~c_R -> c  db  ~d_L)
     5.26453483E-02    3        4       1        -1000001   # BR(~c_R -> c  d  ~d_L*)
     3.07929575E-02    3        4       -1        2000001   # BR(~c_R -> c  db  ~d_R)
     7.57831740E-02    3        4       1        -2000001   # BR(~c_R -> c  d  ~d_R*)
     1.41607317E-01    3        4       -2        1000002   # BR(~c_R -> c  ub  ~u_L)
     5.31330937E-02    3        4       2        -1000002   # BR(~c_R -> c  u  ~u_L*)
     1.41349478E-01    3        4       -3        1000003   # BR(~c_R -> c  sb  ~s_L)
     5.22328060E-02    3        4       3        -1000003   # BR(~c_R -> c  s  ~s_L*)
     3.11915336E-02    3        4       -3        2000003   # BR(~c_R -> c  sb  ~s_R)
     7.54501320E-02    3        4       3        -2000003   # BR(~c_R -> c  s  ~s_R*)
     1.40087142E-01    3        4       -4        1000004   # BR(~c_R -> c  cb  ~c_L)
     5.24342427E-02    3        4       4        -1000004   # BR(~c_R -> c  c  ~c_L*)
     2.67819499E-05    3        4       -15        1000015   # BR(~c_R -> c  tau+  ~tau_1-)
     1.22570206E-05    3        4       15        -1000015   # BR(~c_R -> c  tau-  ~tau_1+)
     5.18036115E-06    3        4       -15        2000015   # BR(~c_R -> c  tau+  ~tau_2-)
     1.00718353E-05    3        4       15        -2000015   # BR(~c_R -> c  tau-  ~tau_2+)
     2.73089083E-05    3        4       -16        1000016   # BR(~c_R -> c  nu_taub  ~nu_tau1)
     1.26282012E-05    3        4       16        -1000016   # BR(~c_R -> c  nu_tau  ~nu_tau1*)
     1.21716114E-03    3        4       23        1000022   # BR(~c_R -> c  Z  ~chi_10)
     1.00922474E-03    3        4       25        1000022   # BR(~c_R -> c  h  ~chi_10)
     1.29204188E-08    3        4       35        1000022   # BR(~c_R -> c  H  ~chi_10)
     3.26042764E-08    3        4       36        1000022   # BR(~c_R -> c  A  ~chi_10)
     1.00267134E-03    3        4       23        1000023   # BR(~c_R -> c  Z  ~chi_20)
     9.95527051E-05    3        4       25        1000023   # BR(~c_R -> c  h  ~chi_20)
     1.27496005E-04    3        4       23        1000025   # BR(~c_R -> c  Z  ~chi_30)
     1.00148958E-03    3        4       25        1000025   # BR(~c_R -> c  h  ~chi_30)
     2.34611987E-03    3        4       -24        1000024   # BR(~c_R -> c  W-  ~chi_1+)
     2.32807113E-03    3        4       24        -1000024   # BR(~c_R -> c  W+  ~chi_1-)
     6.01248275E-08    3        4       -37        1000024   # BR(~c_R -> c  H-  ~chi_1+)
     2.74770408E-08    3        4       37        -1000024   # BR(~c_R -> c  H+  ~chi_1-)
     6.41911631E-04    3        4       -24        1000037   # BR(~c_R -> c  W-  ~chi_2+)
     1.54558355E-03    3        4       24        -1000037   # BR(~c_R -> c  W+  ~chi_2-)
#
#         PDG            Width
DECAY   1000003     1.27798924E+01   # sstrange_L decays
#          BR         NDA      ID1       ID2
     3.32921179E-01    2     1000022         3   # BR(~s_L -> ~chi_10 s)
     1.19066750E-03    2     1000023         3   # BR(~s_L -> ~chi_20 s)
     9.03953706E-04    2     1000025         3   # BR(~s_L -> ~chi_30 s)
     6.56745823E-01    2    -1000024         4   # BR(~s_L -> ~chi_1- c)
     8.23837728E-03    2    -1000037         4   # BR(~s_L -> ~chi_2- c)
#
#         PDG            Width
DECAY   2000003     1.48765097E-04   # sstrange_R decays
#           BR         NDA      ID1       ID2
     5.17373883E-04    2     1000022         3   # BR(~s_R -> ~chi_10 s)
#           BR         NDA      ID1       ID2       ID3
     4.37394262E-02    3        3       -1        1000001   # BR(~s_R -> s  db  ~d_L)
     6.92165043E-03    3        3       1        -1000001   # BR(~s_R -> s  d  ~d_L*)
     4.64524282E-02    3        3       -2        1000002   # BR(~s_R -> s  ub  ~u_L)
     7.32228204E-03    3        3       2        -1000002   # BR(~s_R -> s  u  ~u_L*)
     4.43262575E-02    3        3       -3        1000003   # BR(~s_R -> s  sb  ~s_L)
     6.97542649E-03    3        3       3        -1000003   # BR(~s_R -> s  s  ~s_L*)
     4.63011830E-02    3        3       -4        1000004   # BR(~s_R -> s  cb  ~c_L)
     7.43050635E-03    3        3       4        -1000004   # BR(~s_R -> s  c  ~c_L*)
     1.32255484E-01    3        3       23        1000022   # BR(~s_R -> s  Z  ~chi_10)
     1.10402240E-01    3        3       25        1000022   # BR(~s_R -> s  h  ~chi_10)
     7.25371757E-03    3        3       23        1000023   # BR(~s_R -> s  Z  ~chi_20)
     8.42133016E-04    3        3       25        1000023   # BR(~s_R -> s  h  ~chi_20)
     7.10247242E-04    3        3       23        1000025   # BR(~s_R -> s  Z  ~chi_30)
     7.92322945E-03    3        3       25        1000025   # BR(~s_R -> s  h  ~chi_30)
     2.56753774E-01    3        3       -24        1000024   # BR(~s_R -> s  W-  ~chi_1+)
     2.57163815E-01    3        3       24        -1000024   # BR(~s_R -> s  W+  ~chi_1-)
     3.51150915E-03    3        3       -24        1000037   # BR(~s_R -> s  W-  ~chi_2+)
     1.31973160E-02    3        3       24        -1000037   # BR(~s_R -> s  W+  ~chi_2-)
#
#         PDG            Width
DECAY   1000011     3.13445388E+01   # selectron_L decays
#          BR         NDA      ID1       ID2
     3.29462350E-01    2     1000022        11   # BR(~e_L -> ~chi_10 e-)
     2.04674693E-03    2     1000023        11   # BR(~e_L -> ~chi_20 e-)
     2.26500264E-03    2     1000025        11   # BR(~e_L -> ~chi_30 e-)
     6.50306036E-01    2    -1000024        12   # BR(~e_L -> ~chi_1- nu_e)
     1.59198645E-02    2    -1000037        12   # BR(~e_L -> ~chi_2- nu_e)
#
#         PDG            Width
DECAY   2000011     2.14762940E+00   # selectron_R decays
#           BR         NDA      ID1       ID2
     9.81417612E-07    2     1000022        11   # BR(~e_R -> ~chi_10 e-)
     2.97053836E-04    2     1000023        11   # BR(~e_R -> ~chi_20 e-)
     1.96697545E-03    2     1000025        11   # BR(~e_R -> ~chi_30 e-)
     9.97734989E-01    2     1000035        11   # BR(~e_R -> ~chi_40 e-)
#
#         PDG            Width
DECAY   1000013     3.13445388E+01   # smuon_L decays
#          BR         NDA      ID1       ID2
     3.29462350E-01    2     1000022        13   # BR(~mu_L -> ~chi_10 mu-)
     2.04674693E-03    2     1000023        13   # BR(~mu_L -> ~chi_20 mu-)
     2.26500264E-03    2     1000025        13   # BR(~mu_L -> ~chi_30 mu-)
     6.50306036E-01    2    -1000024        14   # BR(~mu_L -> ~chi_1- nu_mu)
     1.59198645E-02    2    -1000037        14   # BR(~mu_L -> ~chi_2- nu_mu)
#
#         PDG            Width
DECAY   2000013     2.14762937E+00   # smuon_R decays
#           BR         NDA      ID1       ID2
     9.81417621E-07    2     1000022        13   # BR(~mu_R -> ~chi_10 mu-)
     2.97053838E-04    2     1000023        13   # BR(~mu_R -> ~chi_20 mu-)
     1.96697548E-03    2     1000025        13   # BR(~mu_R -> ~chi_30 mu-)
     9.97734989E-01    2     1000035        13   # BR(~mu_R -> ~chi_40 mu-)
#
#         PDG            Width
DECAY   1000015     2.11735698E+01   # stau_1 decays
#          BR         NDA      ID1       ID2
     3.29784765E-01    2     1000022        15   # BR(~tau_1 -> ~chi_10  tau-)
     2.73370419E-03    2     1000023        15   # BR(~tau_1 -> ~chi_20  tau-)
     2.93051173E-03    2     1000025        15   # BR(~tau_1 -> ~chi_30  tau-)
     6.50854160E-01    2    -1000024        16   # BR(~tau_1 -> ~chi_1-  nu_tau)
     1.36968595E-02    2    -1000037        16   # BR(~tau_1 -> ~chi_2-  nu_tau)
#
#         PDG            Width
DECAY   2000015     1.10110651E-01   # stau_2 decays
#          BR         NDA      ID1       ID2
     9.60871145E-03    2     1000022        15   # BR(~tau_2 -> ~chi_10  tau-)
     2.41497040E-01    2     1000023        15   # BR(~tau_2 -> ~chi_20  tau-)
     2.58003056E-01    2     1000025        15   # BR(~tau_2 -> ~chi_30  tau-)
     1.88886383E-02    2    -1000024        16   # BR(~tau_2 -> ~chi_1-  nu_tau)
     4.70073389E-01    2    -1000037        16   # BR(~tau_2 -> ~chi_2-  nu_tau)
     9.07777982E-04    2     1000016       -24   # BR(~tau_2 -> ~nu_tauL W-)
     5.76930944E-04    2     1000015        25   # BR(~tau_2 -> ~tau_1   h)
     4.44456336E-04    2     1000015        23   # BR(~tau_2 -> ~tau_1   Z)
#
#         PDG            Width
DECAY   1000012     3.13870418E+01   # snu_eL decays
#          BR         NDA      ID1       ID2
     3.29080848E-01    2     1000022        12   # BR(~nu_eL -> ~chi_10 nu_e)
     2.37411944E-03    2     1000023        12   # BR(~nu_eL -> ~chi_20 nu_e)
     1.47934574E-03    2     1000025        12   # BR(~nu_eL -> ~chi_30 nu_e)
     6.67038801E-01    2     1000024        11   # BR(~nu_eL -> ~chi_1+ e-)
     2.68863170E-05    2     1000037        11   # BR(~nu_eL -> ~chi_2+ e-)
#
#         PDG            Width
DECAY   1000014     3.13870418E+01   # snu_muL decays
#          BR         NDA      ID1       ID2
     3.29080849E-01    2     1000022        14   # BR(~nu_muL -> ~chi_10 nu_mu)
     2.37411944E-03    2     1000023        14   # BR(~nu_muL -> ~chi_20 nu_mu)
     1.47934575E-03    2     1000025        14   # BR(~nu_muL -> ~chi_30 nu_mu)
     6.67038800E-01    2     1000024        13   # BR(~nu_muL -> ~chi_1+ mu-)
     2.68863170E-05    2     1000037        13   # BR(~nu_muL -> ~chi_2+ mu-)
#
#         PDG            Width
DECAY   1000016     2.12395122E+01   # snu_tauL decays
#          BR         NDA      ID1       ID2
     3.28615966E-01    2     1000022        16   # BR(~nu_tauL -> ~chi_10 nu_tau)
     2.04184092E-03    2     1000023        16   # BR(~nu_tauL -> ~chi_20 nu_tau)
     1.27156445E-03    2     1000025        16   # BR(~nu_tauL -> ~chi_30 nu_tau)
     6.66150642E-01    2     1000024        15   # BR(~nu_tauL -> ~chi_1+ tau-)
     1.91998695E-03    2     1000037        15   # BR(~nu_tauL -> ~chi_2+ tau-)
#
#         PDG            Width
DECAY   1000024     5.76214820E-15   # chargino1+ decays
#           BR         NDA      ID1       ID2       ID3
     1.96224320E-02    3     1000022       -11        12   # BR(~chi_1+ -> ~chi_10 e+   nu_e)
     3.44712890E-03    3     1000022       -13        14   # BR(~chi_1+ -> ~chi_10 mu+  nu_mu)
     9.76930440E-01    2     1000022       211             # BR(~chi_1+ -> ~chi_10 pi+)
#
#         PDG            Width
DECAY   1000037     2.69220234E+00   # chargino2+ decays
#          BR         NDA      ID1       ID2
     3.42780365E-01    2     1000024        23   # BR(~chi_2+ -> ~chi_1+  Z )
     3.38019825E-01    2     1000022        24   # BR(~chi_2+ -> ~chi_10  W+)
     3.19199809E-01    2     1000024        25   # BR(~chi_2+ -> ~chi_1+  h )
#
#         PDG            Width
DECAY   1000022     0.00000000E+00   # neutralino1 decays
#
#         PDG            Width
DECAY   1000023     2.76389528E+00   # neutralino2 decays
#          BR         NDA      ID1       ID2
     1.58231730E-01    2     1000022        23   # BR(~chi_20 -> ~chi_10   Z )
     3.31926663E-01    2     1000024       -24   # BR(~chi_20 -> ~chi_1+   W-)
     3.31926663E-01    2    -1000024        24   # BR(~chi_20 -> ~chi_1-   W+)
     1.77914944E-01    2     1000022        25   # BR(~chi_20 -> ~chi_10   h )
#
#         PDG            Width
DECAY   1000025     2.68640519E+00   # neutralino3 decays
#          BR         NDA      ID1       ID2
     1.81667498E-01    2     1000022        23   # BR(~chi_30 -> ~chi_10   Z )
     3.39250929E-01    2     1000024       -24   # BR(~chi_30 -> ~chi_1+   W-)
     3.39250929E-01    2    -1000024        24   # BR(~chi_30 -> ~chi_1-   W+)
     1.39830643E-01    2     1000022        25   # BR(~chi_30 -> ~chi_10   h )
#
#         PDG            Width
DECAY   1000035     4.16164514E+01   # neutralino4 decays
#          BR         NDA      ID1       ID2
     1.73358947E-04    2     1000022        23   # BR(~chi_40 -> ~chi_10   Z )
     4.90561034E-02    2     1000023        23   # BR(~chi_40 -> ~chi_20   Z )
     7.41826207E-03    2     1000025        23   # BR(~chi_40 -> ~chi_30   Z )
     1.65403853E-04    2     1000024       -24   # BR(~chi_40 -> ~chi_1+   W-)
     1.65403853E-04    2    -1000024        24   # BR(~chi_40 -> ~chi_1-   W+)
     5.50051450E-02    2     1000037       -24   # BR(~chi_40 -> ~chi_2+   W-)
     5.50051450E-02    2    -1000037        24   # BR(~chi_40 -> ~chi_2-   W+)
     2.29250273E-07    2     1000022        25   # BR(~chi_40 -> ~chi_10   h )
     1.89018262E-04    2     1000022        35   # BR(~chi_40 -> ~chi_10   H )
     2.10198854E-04    2     1000022        36   # BR(~chi_40 -> ~chi_10   A )
     7.71925524E-03    2     1000023        25   # BR(~chi_40 -> ~chi_20   h )
     4.97755160E-03    2     1000023        35   # BR(~chi_40 -> ~chi_20   H )
     7.08166686E-03    2     1000023        36   # BR(~chi_40 -> ~chi_20   A )
     5.30858692E-02    2     1000025        25   # BR(~chi_40 -> ~chi_30   h )
     7.08057080E-03    2     1000025        35   # BR(~chi_40 -> ~chi_30   H )
     4.99601695E-03    2     1000025        36   # BR(~chi_40 -> ~chi_30   A )
     3.90771023E-04    2     1000024       -37   # BR(~chi_40 -> ~chi_1+   H-)
     3.90771023E-04    2    -1000024        37   # BR(~chi_40 -> ~chi_1-   H+)
     1.18108529E-02    2     1000037       -37   # BR(~chi_40 -> ~chi_2+   H-)
     1.18108529E-02    2    -1000037        37   # BR(~chi_40 -> ~chi_2-   H+)
     1.25313168E-02    2     1000002        -2   # BR(~chi_40 -> ~u_L      ub)
     1.25313168E-02    2    -1000002         2   # BR(~chi_40 -> ~u_L*     u )
     3.88326904E-02    2     2000002        -2   # BR(~chi_40 -> ~u_R      ub)
     3.88326904E-02    2    -2000002         2   # BR(~chi_40 -> ~u_R*     u )
     1.26105691E-02    2     1000001        -1   # BR(~chi_40 -> ~d_L      db)
     1.26105691E-02    2    -1000001         1   # BR(~chi_40 -> ~d_L*     d )
     4.46565899E-02    2     2000001        -1   # BR(~chi_40 -> ~d_R      db)
     4.46565899E-02    2    -2000001         1   # BR(~chi_40 -> ~d_R*     d )
     1.25313157E-02    2     1000004        -4   # BR(~chi_40 -> ~c_L      cb)
     1.25313157E-02    2    -1000004         4   # BR(~chi_40 -> ~c_L*     c )
     3.88326063E-02    2     2000004        -4   # BR(~chi_40 -> ~c_R      cb)
     3.88326063E-02    2    -2000004         4   # BR(~chi_40 -> ~c_R*     c )
     1.26105691E-02    2     1000003        -3   # BR(~chi_40 -> ~s _L      sb)
     1.26105691E-02    2    -1000003         3   # BR(~chi_40 -> ~s _L*     s )
     4.46565899E-02    2     2000003        -3   # BR(~chi_40 -> ~s _R      sb)
     4.46565899E-02    2    -2000003         3   # BR(~chi_40 -> ~s _R*     s )
     8.96617257E-04    2     1000006        -6   # BR(~chi_40 -> ~t_1      tb)
     8.96617257E-04    2    -1000006         6   # BR(~chi_40 -> ~t_1*     t )
     5.94054171E-04    2     1000005        -5   # BR(~chi_40 -> ~b_1      bb)
     5.94054171E-04    2    -1000005         5   # BR(~chi_40 -> ~b_1*     b )
     6.34396324E-03    2     1000011       -11   # BR(~chi_40 -> ~e_L-     e+)
     6.34396324E-03    2    -1000011        11   # BR(~chi_40 -> ~e_L+     e-)
     6.34396324E-03    2     1000013       -13   # BR(~chi_40 -> ~mu_L-    mu+)
     6.34396324E-03    2    -1000013        13   # BR(~chi_40 -> ~mu_L+    mu-)
     2.46500304E-02    2     1000015       -15   # BR(~chi_40 -> ~tau_1-   tau+)
     2.46500304E-02    2    -1000015        15   # BR(~chi_40 -> ~tau_1+   tau-)
     6.80189835E-02    2     2000015       -15   # BR(~chi_40 -> ~tau_2-   tau+)
     6.80189835E-02    2    -2000015        15   # BR(~chi_40 -> ~tau_2+   tau-)
     6.38418004E-03    2     1000012       -12   # BR(~chi_40 -> ~nu_eL    nu_eb)
     6.38418004E-03    2    -1000012        12   # BR(~chi_40 -> ~nu_eL*   nu_e )
     6.38418004E-03    2     1000014       -14   # BR(~chi_40 -> ~nu_muL   nu_mub)
     6.38418004E-03    2    -1000014        14   # BR(~chi_40 -> ~nu_muL*  nu_mu )
     2.47555573E-02    2     1000016       -16   # BR(~chi_40 -> ~nu_tau1  nu_taub)
     2.47555573E-02    2    -1000016        16   # BR(~chi_40 -> ~nu_tau1* nu_tau )
#
#         PDG            Width
DECAY        25     4.21378058E-03   # h decays
#          BR         NDA      ID1       ID2
     5.87151111E-01    2           5        -5   # BR(h -> b       bb     )
     6.25391569E-02    2         -15        15   # BR(h -> tau+    tau-   )
     2.21360834E-04    2         -13        13   # BR(h -> mu+     mu-    )
     2.41212936E-04    2           3        -3   # BR(h -> s       sb     )
     2.06847385E-02    2           4        -4   # BR(h -> c       cb     )
     7.69490303E-02    2          21        21   # BR(h -> g       g      )
     2.26500078E-03    2          22        22   # BR(h -> gam     gam    )
     1.60375502E-03    2          22        23   # BR(h -> Z       gam    )
     2.20518856E-01    2          24       -24   # BR(h -> W+      W-     )
     2.78257778E-02    2          23        23   # BR(h -> Z       Z      )
#
#         PDG            Width
DECAY        35     2.48608440E+01   # H decays
#          BR         NDA      ID1       ID2
     1.36124123E-02    2           5        -5   # BR(H -> b       bb     )
     2.34044593E-03    2         -15        15   # BR(H -> tau+    tau-   )
     8.26799374E-06    2         -13        13   # BR(H -> mu+     mu-    )
     5.25864587E-06    2           3        -3   # BR(H -> s       sb     )
     2.44868198E-06    2           4        -4   # BR(H -> c       cb     )
     2.36905592E-01    2           6        -6   # BR(H -> t       tb     )
     2.02813617E-04    2          21        21   # BR(H -> g       g      )
     2.89335634E-07    2          22        22   # BR(H -> gam     gam    )
     2.57696617E-07    2          23        22   # BR(H -> Z       gam    )
     2.15168554E-04    2          24       -24   # BR(H -> W+      W-     )
     1.07162997E-04    2          23        23   # BR(H -> Z       Z      )
     7.45808753E-04    2          25        25   # BR(H -> h       h      )
     9.34473290E-15    2          23        36   # BR(H -> Z       A      )
     1.61979151E-02    2     1000024  -1000024   # BR(H -> ~chi_1+ ~chi_1-)
     6.49164142E-04    2     1000037  -1000037   # BR(H -> ~chi_2+ ~chi_2-)
     2.40299358E-01    2     1000024  -1000037   # BR(H -> ~chi_1+ ~chi_2-)
     2.40299358E-01    2     1000037  -1000024   # BR(H -> ~chi_2+ ~chi_1-)
     8.14392711E-03    2     1000022   1000022   # BR(H -> ~chi_10 ~chi_10)
     1.65018753E-03    2     1000023   1000023   # BR(H -> ~chi_20 ~chi_20)
     3.49278427E-04    2     1000025   1000025   # BR(H -> ~chi_30 ~chi_30)
     1.69619001E-01    2     1000022   1000023   # BR(H -> ~chi_10 ~chi_20)
     6.58416725E-02    2     1000022   1000025   # BR(H -> ~chi_10 ~chi_30)
     2.80421274E-03    2     1000023   1000025   # BR(H -> ~chi_20 ~chi_30)
#
#         PDG            Width
DECAY        36     2.49200760E+01   # A decays
#          BR         NDA      ID1       ID2
     1.36127422E-02    2           5        -5   # BR(A -> b       bb     )
     2.33585340E-03    2         -15        15   # BR(A -> tau+    tau-   )
     8.25174566E-06    2         -13        13   # BR(A -> mu+     mu-    )
     5.27479052E-06    2           3        -3   # BR(A -> s       sb     )
     2.43729396E-06    2           4        -4   # BR(A -> c       cb     )
     2.38725237E-01    2           6        -6   # BR(A -> t       tb     )
     2.71488975E-04    2          21        21   # BR(A -> g       g      )
     2.77477513E-07    2          22        22   # BR(A -> gam     gam    )
     3.26688489E-07    2          23        22   # BR(A -> Z       gam    )
     2.16179725E-04    2          23        25   # BR(A -> Z       h      )
     1.61733924E-02    2     1000024  -1000024   # BR(A -> ~chi_1+ ~chi_1-)
     6.30492852E-04    2     1000037  -1000037   # BR(A -> ~chi_2+ ~chi_2-)
     2.40098277E-01    2     1000024  -1000037   # BR(A -> ~chi_1+ ~chi_2-)
     2.40098277E-01    2     1000037  -1000024   # BR(A -> ~chi_2+ ~chi_1-)
     8.09024917E-03    2     1000022   1000022   # BR(A -> ~chi_10 ~chi_10)
     9.85646530E-04    2     1000023   1000023   # BR(A -> ~chi_20 ~chi_20)
     1.87856656E-03    2     1000025   1000025   # BR(A -> ~chi_30 ~chi_30)
     6.48127966E-02    2     1000022   1000023   # BR(A -> ~chi_10 ~chi_20)
     1.70302981E-01    2     1000022   1000025   # BR(A -> ~chi_10 ~chi_30)
     1.75125169E-03    2     1000023   1000025   # BR(A -> ~chi_20 ~chi_30)
#
#         PDG            Width
DECAY        37     2.47216499E+01   # H+ decays
#          BR         NDA      ID1       ID2
     2.23142059E-05    2           4        -5   # BR(H+ -> c       bb     )
     2.35690474E-03    2         -15        16   # BR(H+ -> tau+    nu_tau )
     8.32611259E-06    2         -13        14   # BR(H+ -> mu+     nu_mu  )
     2.23101889E-07    2           2        -5   # BR(H+ -> u       bb     )
     2.65000127E-07    2           2        -3   # BR(H+ -> u       sb     )
     7.57110794E-06    2           4        -3   # BR(H+ -> c       sb     )
     2.49107813E-01    2           6        -5   # BR(H+ -> t       bb     )
     2.18880538E-04    2          24        25   # BR(H+ -> W+      h      )
     1.41296541E-12    2          24        36   # BR(H+ -> W+      A      )
     3.33293158E-08    2     1000024   1000022   # BR(H+ -> ~chi_1+ ~chi_10)
     2.46183608E-01    2     1000024   1000023   # BR(H+ -> ~chi_1+ ~chi_20)
     2.47732394E-01    2     1000024   1000025   # BR(H+ -> ~chi_1+ ~chi_30)
     2.51925421E-01    2     1000037   1000022   # BR(H+ -> ~chi_2+ ~chi_10)
     1.43195481E-03    2     1000037   1000023   # BR(H+ -> ~chi_2+ ~chi_20)
     1.00429137E-03    2     1000037   1000025   # BR(H+ -> ~chi_2+ ~chi_30)
