#
#                              ======================
#                              | THE SUSYHIT OUTPUT |
#                              ======================
#
#
#              ------------------------------------------------------
#              |     This is the output of the SUSY-HIT package     |
#              |  created by A.Djouadi, M.Muehlleitner and M.Spira. |
#              |  In case of problems with SUSY-HIT email to        |
#              |           margarete.muehlleitner@cern.ch           |
#              |           michael.spira@psi.ch                     |
#              |           abdelhak.djouadi@cern.ch                 |
#              ------------------------------------------------------
#
#              ------------------------------------------------------
#              |  SUSY Les Houches Accord - MSSM Spectrum + Decays  |
#              |              based on the decay programs           |
#              |                                                    |
#              |                     SDECAY 1.3b                    |
#              |                                                    |
#              |  Authors: M.Muhlleitner, A.Djouadi and Y.Mambrini  |
#              |  Ref.:    Comput.Phys.Commun.168(2005)46           |
#              |           [hep-ph/0311167]                         |
#              |                                                    |
#              |                     HDECAY 3.4                     |
#              |                                                    |
#              |  By: A.Djouadi,J.Kalinowski,M.Muhlleitner,M.Spira  |
#              |  Ref.:    Comput.Phys.Commun.108(1998)56           |
#              |           [hep-ph/9704448]                         |
#              |                                                    |
#              |                                                    |
#              |  If not stated otherwise all DRbar couplings and   |
#              |  soft SUSY breaking masses are given at the scale  |
#              |  Q=  0.23664960E+04
#              |                                                    |
#              ------------------------------------------------------
#
#
BLOCK DCINFO  # Decay Program information
     1   SDECAY/HDECAY # decay calculator
     2   1.3b  /3.4    # version number
#
BLOCK SPINFO  # Spectrum calculator information
     1     SOFTSUSY    # spectrum calculator               
     2     3.4.0       # version number                    
#
BLOCK MODSEL  # Model selection
     1     0   #  nonUniversal                                     
#
BLOCK SMINPUTS  # Standard Model inputs
         1     1.27908970E+02   # alpha_em^-1(M_Z)^MSbar
         2     1.16637870E-05   # G_F [GeV^-2]
         3     1.18400000E-01   # alpha_S(M_Z)^MSbar
         4     9.11876000E+01   # M_Z pole mass
         5     4.18000000E+00   # mb(mb)^MSbar
         6     1.73200000E+02   # mt pole mass
         7     1.77700000E+00   # mtau pole mass
#
BLOCK MINPAR  # Input parameters - minimal models
         3     1.96100000E+01   # tanb                
#
BLOCK EXTPAR  # Input parameters - non-minimal models
         0    -1.00000000E+00   # Set                 
         1    -1.17158000E+03   # M_1(MX)             
         2    -2.36060000E+02   # M_2(MX)             
         3     1.26359000E+03   # M_3(MX)             
        11    -3.76069000E+03   # At(MX)              
        12    -1.50158000E+03   # Ab(MX)              
        13     9.83700000E+02   # Atau(MX)            
        23    -1.29254000E+03   # mu(MX)              
        26     3.60172000E+03   # mA(pole)            
        31     7.12720000E+02   # meL(MX)             
        32     7.12720000E+02   # mmuL(MX)            
        33     2.06177000E+03   # mtauL(MX)           
        34     1.43947000E+03   # meR(MX)             
        35     1.43947000E+03   # mmuR(MX)            
        36     3.04818000E+03   # mtauR(MX)           
        41     3.28719000E+03   # mqL1(MX)            
        42     3.28719000E+03   # mqL2(MX)            
        43     1.63698000E+03   # mqL3(MX)            
        44     1.09256000E+03   # muR(MX)             
        45     1.09256000E+03   # mcR(MX)             
        46     3.42217000E+03   # mtR(MX)             
        47     1.55543000E+03   # mdR(MX)             
        48     1.55543000E+03   # msR(MX)             
        49     9.38660000E+02   # mbR(MX)             
#
BLOCK MASS  # Mass Spectrum
# PDG code           mass       particle
        24     8.03772943E+01   # W+
        25     1.27368928E+02   # h
        35     3.60172592E+03   # H
        36     3.60172002E+03   # A
        37     3.60299358E+03   # H+
         5     4.81876030E+00   # b-quark pole mass calculated from mb(mb)_Msbar
   1000001     3.32764128E+03   # ~d_L
   2000001     1.61247962E+03   # ~d_R
   1000002     3.32682003E+03   # ~u_L
   2000002     1.17725865E+03   # ~u_R
   1000003     3.32764128E+03   # ~s_L
   2000003     1.61247962E+03   # ~s_R
   1000004     3.32682003E+03   # ~c_L
   2000004     1.17725865E+03   # ~c_R
   1000005     1.02500752E+03   # ~b_1
   2000005     1.68529132E+03   # ~b_2
   1000006     1.67983912E+03   # ~t_1
   2000006     3.41289400E+03   # ~t_2
   1000011     7.20470359E+02   # ~e_L
   2000011     1.44321648E+03   # ~e_R
   1000012     7.15776079E+02   # ~nu_eL
   1000013     7.20470359E+02   # ~mu_L
   2000013     1.44321648E+03   # ~mu_R
   1000014     7.15776079E+02   # ~nu_muL
   1000015     2.06658006E+03   # ~tau_1
   2000015     3.04881716E+03   # ~tau_2
   1000016     2.06482961E+03   # ~nu_tauL
   1000021     1.42569775E+03   # ~g
   1000022    -2.51104370E+02   # ~chi_10
   1000023    -1.14747467E+03   # ~chi_20
   1000025     1.32561805E+03   # ~chi_30
   1000035    -1.33284115E+03   # ~chi_40
   1000024     2.51269454E+02   # ~chi_1+
   1000037     1.32901398E+03   # ~chi_2+
#
BLOCK NMIX  # Neutralino Mixing Matrix
  1  1    -8.25988191E-04   # N_11
  1  2     9.97944460E-01   # N_12
  1  3     6.24004402E-02   # N_13
  1  4    -1.45725051E-02   # N_14
  2  1     9.82219037E-01   # N_21
  2  2     1.13962484E-02   # N_22
  2  3    -1.40223256E-01   # N_23
  2  4     1.24311413E-01   # N_24
  3  1     1.16818812E-02   # N_31
  3  2    -3.38124535E-02   # N_32
  3  3     7.06066730E-01   # N_33
  3  4     7.07241136E-01   # N_34
  4  1     1.87372930E-01   # N_41
  4  2    -5.32324958E-02   # N_42
  4  3     6.91312807E-01   # N_43
  4  4    -6.95804779E-01   # N_44
#
BLOCK UMIX  # Chargino Mixing Matrix U
  1  1     9.96115161E-01   # U_11
  1  2     8.80601306E-02   # U_12
  2  1    -8.80601306E-02   # U_21
  2  2     9.96115161E-01   # U_22
#
BLOCK VMIX  # Chargino Mixing Matrix V
  1  1    -9.99788376E-01   # V_11
  1  2    -2.05719243E-02   # V_12
  2  1     2.05719243E-02   # V_21
  2  2    -9.99788376E-01   # V_22
#
BLOCK STOPMIX  # Stop Mixing Matrix
  1  1     9.98154515E-01   # cos(theta_t)
  1  2     6.07253175E-02   # sin(theta_t)
  2  1    -6.07253175E-02   # -sin(theta_t)
  2  2     9.98154515E-01   # cos(theta_t)
#
BLOCK SBOTMIX  # Sbottom Mixing Matrix
  1  1    -3.54354937E-02   # cos(theta_b)
  1  2     9.99371966E-01   # sin(theta_b)
  2  1    -9.99371966E-01   # -sin(theta_b)
  2  2    -3.54354937E-02   # cos(theta_b)
#
BLOCK STAUMIX  # Stau Mixing Matrix
  1  1     9.99958343E-01   # cos(theta_tau)
  1  2    -9.12755524E-03   # sin(theta_tau)
  2  1     9.12755524E-03   # -sin(theta_tau)
  2  2     9.99958343E-01   # cos(theta_tau)
#
BLOCK ALPHA  # Higgs mixing
          -5.30787173E-02   # Mixing angle in the neutral Higgs boson sector
#
BLOCK HMIX Q=  2.36649600E+03  # DRbar Higgs Parameters
         1    -1.31357012E+03   # mu(Q)MSSM           
         2     1.88638457E+01   # tan                 
         3     2.42342871E+02   # higgs               
         4     1.29081963E+07   # mA^2(Q)MSSM         
#
BLOCK GAUGE Q=  2.36649600E+03  # The gauge couplings
     1     3.64612477E-01   # gprime(Q) DRbar
     2     6.41977329E-01   # g(Q) DRbar
     3     1.03245239E+00   # g3(Q) DRbar
#
BLOCK AU Q=  2.36649600E+03  # The trilinear couplings
  1  1     0.00000000E+00   # A_u(Q) DRbar
  2  2     0.00000000E+00   # A_c(Q) DRbar
  3  3    -3.76068999E+03   # A_t(Q) DRbar
#
BLOCK AD Q=  2.36649600E+03  # The trilinear couplings
  1  1     0.00000000E+00   # A_d(Q) DRbar
  2  2     0.00000000E+00   # A_s(Q) DRbar
  3  3    -1.50158000E+03   # A_b(Q) DRbar
#
BLOCK AE Q=  2.36649600E+03  # The trilinear couplings
  1  1     0.00000000E+00   # A_e(Q) DRbar
  2  2     0.00000000E+00   # A_mu(Q) DRbar
  3  3     9.83700000E+02   # A_tau(Q) DRbar
#
BLOCK Yu Q=  2.36649600E+03  # The Yukawa couplings
  1  1     0.00000000E+00   # y_u(Q) DRbar
  2  2     0.00000000E+00   # y_c(Q) DRbar
  3  3     8.26290627E-01   # y_t(Q) DRbar
#
BLOCK Yd Q=  2.36649600E+03  # The Yukawa couplings
  1  1     0.00000000E+00   # y_d(Q) DRbar
  2  2     0.00000000E+00   # y_s(Q) DRbar
  3  3     3.01772404E-01   # y_b(Q) DRbar
#
BLOCK Ye Q=  2.36649600E+03  # The Yukawa couplings
  1  1     0.00000000E+00   # y_e(Q) DRbar
  2  2     0.00000000E+00   # y_mu(Q) DRbar
  3  3     1.94221293E-01   # y_tau(Q) DRbar
#
BLOCK MSOFT Q=  2.36649600E+03  # The soft SUSY breaking masses at the scale Q
         1    -1.17158000E+03   # M_1(Q)              
         2    -2.36060000E+02   # M_2(Q)              
         3     1.26359000E+03   # M_3(Q)              
        21     1.12178312E+07   # mH1^2(Q)            
        22    -1.65836493E+06   # mH2^2(Q)            
        31     7.12720000E+02   # meL(Q)              
        32     7.12720000E+02   # mmuL(Q)             
        33     2.06177000E+03   # mtauL(Q)            
        34     1.43947000E+03   # meR(Q)              
        35     1.43947000E+03   # mmuR(Q)             
        36     3.04818000E+03   # mtauR(Q)            
        41     3.28719000E+03   # mqL1(Q)             
        42     3.28719000E+03   # mqL2(Q)             
        43     1.63697999E+03   # mqL3(Q)             
        44     1.09256000E+03   # muR(Q)              
        45     1.09256000E+03   # mcR(Q)              
        46     3.42216999E+03   # mtR(Q)              
        47     1.55543000E+03   # mdR(Q)              
        48     1.55543000E+03   # msR(Q)              
        49     9.38659994E+02   # mbR(Q)              
#
Block HiggsBoundsInputHiggsCouplingsFermions
# ScalarNormEffCoupSq PseudoSNormEffCoupSq NP   IP1 IP2 IP2
    1.00441263E+00    0.00000000E+00        3  25   5   5  # h0-b-b eff. coupling^2, normalised to SM
    3.55840262E+02    0.00000000E+00        3  35   5   5  # H0-b-b eff. coupling^2, normalised to SM
    0.00000000E+00    3.55844675E+02        3  36   5   5  # A0-b-b eff. coupling^2, normalised to SM
#
    9.99987600E-01    0.00000000E+00        3  25   6   6  # h0-t-t eff. coupling^2, normalised to SM
    2.82261533E-03    0.00000000E+00        3  35   6   6  # H0-t-t eff. coupling^2, normalised to SM
    0.00000000E+00    2.81021488E-03        3  36   6   6  # A0-t-t eff. coupling^2, normalised to SM
#
    1.00441263E+00    0.00000000E+00        3  25  15  15  # h0-tau-tau eff. coupling^2, normalised to SM
    3.55840262E+02    0.00000000E+00        3  35  15  15  # H0-tau-tau eff. coupling^2, normalised to SM
    0.00000000E+00    3.55844675E+02        3  36  15  15  # A0-tau-tau eff. coupling^2, normalised to SM
#
Block HiggsBoundsInputHiggsCouplingsBosons
    9.99999986E-01        3  25  24  24  # h0-W-W eff. coupling^2, normalised to SM
    1.36496453E-08        3  35  24  24  # H0-W-W eff. coupling^2, normalised to SM
    0.00000000E+00        3  36  24  24  # A0-W-W eff. coupling^2, normalised to SM
#
    9.99999986E-01        3  25  23  23  # h0-Z-Z eff. coupling^2, normalised to SM
    1.36496453E-08        3  35  23  23  # H0-Z-Z eff. coupling^2, normalised to SM
    0.00000000E+00        3  36  23  23  # A0-Z-Z eff. coupling^2, normalised to SM
#
    8.85730755E-01        3  25  21  21  # h0-g-g eff. coupling^2, normalised to SM
    2.44390206E-16        3  35  21  21  # H0-g-g eff. coupling^2, normalised to SM
    2.43090233E-13        3  36  21  21  # A0-g-g eff. coupling^2, normalised to SM
#
    0.00000000E+00        3  25  25  23  # h0-h0-Z eff. coupling^2, normalised to SM
    0.00000000E+00        3  35  25  23  # H0-h0-Z eff. coupling^2, normalised to SM
    1.36496453E-08        3  36  25  23  # A0-h0-Z eff. coupling^2, normalised to SM
    0.00000000E+00        3  35  35  23  # H0-H0-Z eff. coupling^2, normalised to SM
    9.99999986E-01        3  36  35  23  # A0-H0-Z eff. coupling^2, normalised to SM
    0.00000000E+00        3  36  36  23  # A0-A0-Z eff. coupling^2, normalised to SM
#
    0.00000000E+00        4  25  21  21  23  # h0-g-g-Z eff. coupling^2, normalised to SM
    0.00000000E+00        4  35  21  21  23  # H0-g-g-Z eff. coupling^2, normalised to SM
    0.00000000E+00        4  36  21  21  23  # A0-g-g-Z eff. coupling^2, normalised to SM
#
#
#
#                             =================
#                             |The decay table|
#                             =================
#
# - The QCD corrections to the decays gluino -> squark  + quark
#                                     squark -> gaugino + quark_prime
#                                     squark -> squark_prime + Higgs
#                                     squark -> gluino  + quark
#   are included.
#
# - The multi-body decays for the inos, stops and sbottoms are included.
#
# - The loop induced decays for the gluino, neutralinos and stops
#   are included.
#
# - The SUSY decays of the top quark are included.
#
#
#         PDG            Width
DECAY         6     1.45204641E+00   # top decays
#          BR         NDA      ID1       ID2
     1.00000000E+00    2           5        24   # BR(t ->  b    W+)
#
#         PDG            Width
DECAY   1000021     1.27728479E+01   # gluino decays
#          BR         NDA      ID1       ID2
     1.02493758E-01    2     2000002        -2   # BR(~g -> ~u_R  ub)
     1.02493758E-01    2    -2000002         2   # BR(~g -> ~u_R* u )
     1.02491725E-01    2     2000004        -4   # BR(~g -> ~c_R  cb)
     1.02491725E-01    2    -2000004         4   # BR(~g -> ~c_R* c )
     2.95014518E-01    2     1000005        -5   # BR(~g -> ~b_1  bb)
     2.95014518E-01    2    -1000005         5   # BR(~g -> ~b_1* b )
#
#         PDG            Width
DECAY   1000006     2.93158773E+01   # stop1 decays
#          BR         NDA      ID1       ID2
     2.16868080E-01    2     1000022         6   # BR(~t_1 -> ~chi_10 t )
     6.03220412E-03    2     1000023         6   # BR(~t_1 -> ~chi_20 t )
     4.52402194E-02    2     1000025         6   # BR(~t_1 -> ~chi_30 t )
     4.70971368E-02    2     1000035         6   # BR(~t_1 -> ~chi_40 t )
     4.46475971E-01    2     1000024         5   # BR(~t_1 -> ~chi_1+ b )
     1.50728434E-02    2     1000037         5   # BR(~t_1 -> ~chi_2+ b )
     1.92225718E-01    2     1000021         6   # BR(~t_1 -> ~g      t )
     3.09878270E-02    2     1000005        24   # BR(~t_1 -> ~b_1    W+)
#
#         PDG            Width
DECAY   2000006     2.83462309E+02   # stop2 decays
#          BR         NDA      ID1       ID2
     3.68313890E-04    2     1000022         6   # BR(~t_2 -> ~chi_10 t )
     2.33410889E-02    2     1000023         6   # BR(~t_2 -> ~chi_20 t )
     5.91543966E-02    2     1000025         6   # BR(~t_2 -> ~chi_30 t )
     5.65732306E-02    2     1000035         6   # BR(~t_2 -> ~chi_40 t )
     7.42135369E-04    2     1000024         5   # BR(~t_2 -> ~chi_1+ b )
     1.17040488E-01    2     1000037         5   # BR(~t_2 -> ~chi_2+ b )
     4.57596057E-01    2     1000021         6   # BR(~t_2 -> ~g      t )
     7.09384554E-02    2     1000006        25   # BR(~t_2 -> ~t_1    h )
     7.27449354E-02    2     1000006        23   # BR(~t_2 -> ~t_1    Z )
     3.09633098E-04    2     1000005        24   # BR(~t_2 -> ~b_1    W+)
     1.41191267E-01    2     2000005        24   # BR(~t_2 -> ~b_2    W+)
#
#         PDG            Width
DECAY   1000005     6.26945190E-02   # sbottom1 decays
#          BR         NDA      ID1       ID2
     3.49655741E-01    2     1000022         5   # BR(~b_1 -> ~chi_10 b )
     6.50344259E-01    2    -1000024         6   # BR(~b_1 -> ~chi_1- t )
#
#         PDG            Width
DECAY   2000005     3.15040566E+01   # sbottom2 decays
#          BR         NDA      ID1       ID2
     2.08344731E-01    2     1000022         5   # BR(~b_2 -> ~chi_10 b )
     2.23918998E-03    2     1000023         5   # BR(~b_2 -> ~chi_20 b )
     7.08908453E-03    2     1000025         5   # BR(~b_2 -> ~chi_30 b )
     6.93409462E-03    2     1000035         5   # BR(~b_2 -> ~chi_40 b )
     4.04825383E-01    2    -1000024         6   # BR(~b_2 -> ~chi_1- t )
     9.48455091E-02    2    -1000037         6   # BR(~b_2 -> ~chi_2- t )
     2.44831638E-01    2     1000021         5   # BR(~b_2 -> ~g      b )
     1.58188404E-02    2     1000005        25   # BR(~b_2 -> ~b_1    h )
     1.50715301E-02    2     1000005        23   # BR(~b_2 -> ~b_1    Z )
#
#         PDG            Width
DECAY   1000002     2.02378011E+02   # sup_L decays
#          BR         NDA      ID1       ID2
     6.40720981E-02    2     1000022         2   # BR(~u_L -> ~chi_10 u)
     1.97200055E-03    2     1000023         2   # BR(~u_L -> ~chi_20 u)
     4.61172087E-05    2     1000025         2   # BR(~u_L -> ~chi_30 u)
     1.45058466E-05    2     1000035         2   # BR(~u_L -> ~chi_40 u)
     1.28656633E-01    2     1000024         1   # BR(~u_L -> ~chi_1+ d)
     3.90128052E-05    2     1000037         1   # BR(~u_L -> ~chi_2+ d)
     8.05199632E-01    2     1000021         2   # BR(~u_L -> ~g      u)
#
#         PDG            Width
DECAY   2000002     7.27468907E-03   # sup_R decays
#           BR         NDA      ID1       ID2
     2.32932493E-04    2     1000022         2   # BR(~u_R -> ~chi_10 u)
     9.99767068E-01    2     1000023         2   # BR(~u_R -> ~chi_20 u)
#
#         PDG            Width
DECAY   1000001     2.02404752E+02   # sdown_L decays
#          BR         NDA      ID1       ID2
     6.41201910E-02    2     1000022         1   # BR(~d_L -> ~chi_10 d)
     1.54318025E-03    2     1000023         1   # BR(~d_L -> ~chi_20 d)
     5.99488437E-05    2     1000025         1   # BR(~d_L -> ~chi_30 d)
     3.62003417E-04    2     1000035         1   # BR(~d_L -> ~chi_40 d)
     1.27728783E-01    2    -1000024         2   # BR(~d_L -> ~chi_1- u)
     7.15068411E-04    2    -1000037         2   # BR(~d_L -> ~chi_2- u)
     8.05470825E-01    2     1000021         1   # BR(~d_L -> ~g      d)
#
#         PDG            Width
DECAY   2000001     5.86488913E+00   # sdown_R decays
#          BR         NDA      ID1       ID2
     9.98637355E-08    2     1000022         1   # BR(~d_R -> ~chi_10 d)
     3.68487853E-02    2     1000023         1   # BR(~d_R -> ~chi_20 d)
     2.28128930E-06    2     1000025         1   # BR(~d_R -> ~chi_30 d)
     5.60956256E-04    2     1000035         1   # BR(~d_R -> ~chi_40 d)
     9.62587877E-01    2     1000021         1   # BR(~d_R -> ~g      d)
#
#         PDG            Width
DECAY   1000004     1.66189687E+02   # scharm_L decays
#          BR         NDA      ID1       ID2
     8.07753136E-02    2     1000022         4   # BR(~c_L -> ~chi_10 c)
     2.48091275E-03    2     1000023         4   # BR(~c_L -> ~chi_20 c)
     5.79947103E-05    2     1000025         4   # BR(~c_L -> ~chi_30 c)
     1.82414882E-05    2     1000035         4   # BR(~c_L -> ~chi_40 c)
     1.62196632E-01    2     1000024         3   # BR(~c_L -> ~chi_1+ s)
     4.90601620E-05    2     1000037         3   # BR(~c_L -> ~chi_2+ s)
     7.54421845E-01    2     1000021         4   # BR(~c_L -> ~g      c)
#
#         PDG            Width
DECAY   2000004     6.65637891E-03   # scharm_R decays
#           BR         NDA      ID1       ID2
     2.58450630E-04    2     1000022         4   # BR(~c_R -> ~chi_10 c)
     9.99741549E-01    2     1000023         4   # BR(~c_R -> ~chi_20 c)
#
#         PDG            Width
DECAY   1000003     1.66196654E+02   # sstrange_L decays
#          BR         NDA      ID1       ID2
     8.08430161E-02    2     1000022         3   # BR(~s_L -> ~chi_10 s)
     1.94160070E-03    2     1000023         3   # BR(~s_L -> ~chi_20 s)
     7.53954689E-05    2     1000025         3   # BR(~s_L -> ~chi_30 s)
     4.55269895E-04    2     1000035         3   # BR(~s_L -> ~chi_40 s)
     1.61040875E-01    2    -1000024         4   # BR(~s_L -> ~chi_1- c)
     8.99307121E-04    2    -1000037         4   # BR(~s_L -> ~chi_2- c)
     7.54744535E-01    2     1000021         3   # BR(~s_L -> ~g      s)
#
#         PDG            Width
DECAY   2000003     4.56973206E+00   # sstrange_R decays
#          BR         NDA      ID1       ID2
     1.34712707E-07    2     1000022         3   # BR(~s_R -> ~chi_10 s)
     4.87464361E-02    2     1000023         3   # BR(~s_R -> ~chi_20 s)
     2.97378807E-06    2     1000025         3   # BR(~s_R -> ~chi_30 s)
     7.30600516E-04    2     1000035         3   # BR(~s_R -> ~chi_40 s)
     9.50519855E-01    2     1000021         3   # BR(~s_R -> ~g      s)
#
#         PDG            Width
DECAY   1000011     6.79043204E+00   # selectron_L decays
#          BR         NDA      ID1       ID2
     3.34020989E-01    2     1000022        11   # BR(~e_L -> ~chi_10 e-)
     6.65979011E-01    2    -1000024        12   # BR(~e_L -> ~chi_1- nu_e)
#
#         PDG            Width
DECAY   2000011     1.00238766E+00   # selectron_R decays
#          BR         NDA      ID1       ID2
     4.88614365E-06    2     1000022        11   # BR(~e_R -> ~chi_10 e-)
     9.94183325E-01    2     1000023        11   # BR(~e_R -> ~chi_20 e-)
     2.53989444E-05    2     1000025        11   # BR(~e_R -> ~chi_30 e-)
     5.78639032E-03    2     1000035        11   # BR(~e_R -> ~chi_40 e-)
#
#         PDG            Width
DECAY   1000013     6.79043191E+00   # smuon_L decays
#          BR         NDA      ID1       ID2
     3.34020977E-01    2     1000022        13   # BR(~mu_L -> ~chi_10 mu-)
     6.65979023E-01    2    -1000024        14   # BR(~mu_L -> ~chi_1- nu_mu)
#
#         PDG            Width
DECAY   2000013     1.00238758E+00   # smuon_R decays
#          BR         NDA      ID1       ID2
     4.88614399E-06    2     1000022        13   # BR(~mu_R -> ~chi_10 mu-)
     9.94183327E-01    2     1000023        13   # BR(~mu_R -> ~chi_20 mu-)
     2.53989353E-05    2     1000025        13   # BR(~mu_R -> ~chi_30 mu-)
     5.78638792E-03    2     1000035        13   # BR(~mu_R -> ~chi_40 mu-)
#
#         PDG            Width
DECAY   1000015     2.64186350E+01   # stau_1 decays
#          BR         NDA      ID1       ID2
     3.10061429E-01    2     1000022        15   # BR(~tau_1 -> ~chi_10  tau-)
     5.03907833E-02    2     1000023        15   # BR(~tau_1 -> ~chi_20  tau-)
     1.01909894E-02    2     1000025        15   # BR(~tau_1 -> ~chi_30  tau-)
     9.77837937E-03    2     1000035        15   # BR(~tau_1 -> ~chi_40  tau-)
     6.17973354E-01    2    -1000024        16   # BR(~tau_1 -> ~chi_1-  nu_tau)
     1.60506533E-03    2    -1000037        16   # BR(~tau_1 -> ~chi_2-  nu_tau)
#
#         PDG            Width
DECAY   2000015     1.53226349E+01   # stau_2 decays
#          BR         NDA      ID1       ID2
     2.49430996E-04    2     1000022        15   # BR(~tau_2 -> ~chi_10  tau-)
     7.49820157E-01    2     1000023        15   # BR(~tau_2 -> ~chi_20  tau-)
     4.91664630E-02    2     1000025        15   # BR(~tau_2 -> ~chi_30  tau-)
     7.13705086E-02    2     1000035        15   # BR(~tau_2 -> ~chi_40  tau-)
     4.95576544E-04    2    -1000024        16   # BR(~tau_2 -> ~chi_1-  nu_tau)
     9.77165947E-02    2    -1000037        16   # BR(~tau_2 -> ~chi_2-  nu_tau)
     1.53494505E-02    2     1000016       -24   # BR(~tau_2 -> ~nu_tauL W-)
     8.00396194E-03    2     1000015        25   # BR(~tau_2 -> ~tau_1   h)
     7.82785714E-03    2     1000015        23   # BR(~tau_2 -> ~tau_1   Z)
#
#         PDG            Width
DECAY   1000012     6.75893711E+00   # snu_eL decays
#          BR         NDA      ID1       ID2
     3.32804023E-01    2     1000022        12   # BR(~nu_eL -> ~chi_10 nu_e)
     6.67195977E-01    2     1000024        11   # BR(~nu_eL -> ~chi_1+ e-)
#
#         PDG            Width
DECAY   1000014     6.75893685E+00   # snu_muL decays
#          BR         NDA      ID1       ID2
     3.32804035E-01    2     1000022        14   # BR(~nu_muL -> ~chi_10 nu_mu)
     6.67195965E-01    2     1000024        13   # BR(~nu_muL -> ~chi_1+ mu-)
#
#         PDG            Width
DECAY   1000016     2.64428757E+01   # snu_tauL decays
#          BR         NDA      ID1       ID2
     3.09738003E-01    2     1000022        16   # BR(~nu_tauL -> ~chi_10 nu_tau)
     4.56666104E-02    2     1000023        16   # BR(~nu_tauL -> ~chi_20 nu_tau)
     1.80970088E-04    2     1000025        16   # BR(~nu_tauL -> ~chi_30 nu_tau)
     2.77648015E-03    2     1000035        16   # BR(~nu_tauL -> ~chi_40 nu_tau)
     6.21591737E-01    2     1000024        15   # BR(~nu_tauL -> ~chi_1+ tau-)
     2.00461998E-02    2     1000037        15   # BR(~nu_tauL -> ~chi_2+ tau-)
#
#         PDG            Width
DECAY   1000024     3.67597740E-15   # chargino1+ decays
#           BR         NDA      ID1       ID2       ID3
     1.94927940E-02    3     1000022       -11        12   # BR(~chi_1+ -> ~chi_10 e+   nu_e)
     2.24750770E-03    3     1000022       -13        14   # BR(~chi_1+ -> ~chi_10 mu+  nu_mu)
     9.78259700E-01    2     1000022       211             # BR(~chi_1+ -> ~chi_10 pi+)
#
#         PDG            Width
DECAY   1000037     9.15448063E+00   # chargino2+ decays
#          BR         NDA      ID1       ID2
     6.11529348E-02    2    -1000005         6   # BR(~chi_2+ -> ~b_1*    t )
     1.26946998E-04    2     1000012       -11   # BR(~chi_2+ -> ~nu_eL   e+  )
     1.26946998E-04    2     1000014       -13   # BR(~chi_2+ -> ~nu_muL mu+ )
     2.30116871E-03    2    -1000011        12   # BR(~chi_2+ -> ~e_L+    nu_e)
     2.30116871E-03    2    -1000013        14   # BR(~chi_2+ -> ~mu_L+   nu_mu)
     3.03417021E-01    2     1000024        23   # BR(~chi_2+ -> ~chi_1+  Z )
     2.96195769E-01    2     1000022        24   # BR(~chi_2+ -> ~chi_10  W+)
     3.44238857E-02    2     1000023        24   # BR(~chi_2+ -> ~chi_20  W+)
     2.99954158E-01    2     1000024        25   # BR(~chi_2+ -> ~chi_1+  h )
#
#         PDG            Width
DECAY   1000022     0.00000000E+00   # neutralino1 decays
#
#         PDG            Width
DECAY   1000023     2.50388433E+00   # neutralino2 decays
#          BR         NDA      ID1       ID2
     8.24757261E-03    2     1000022        23   # BR(~chi_20 -> ~chi_10   Z )
     3.25086696E-02    2     1000024       -24   # BR(~chi_20 -> ~chi_1+   W-)
     3.25086696E-02    2    -1000024        24   # BR(~chi_20 -> ~chi_1-   W+)
     2.58694278E-02    2     1000022        25   # BR(~chi_20 -> ~chi_10   h )
     1.76581256E-02    2     1000005        -5   # BR(~chi_20 -> ~b_1      bb)
     1.76581256E-02    2    -1000005         5   # BR(~chi_20 -> ~b_1*     b )
     1.11702884E-01    2     1000011       -11   # BR(~chi_20 -> ~e_L-     e+)
     1.11702884E-01    2    -1000011        11   # BR(~chi_20 -> ~e_L+     e-)
     1.11702884E-01    2     1000013       -13   # BR(~chi_20 -> ~mu_L-    mu+)
     1.11702884E-01    2    -1000013        13   # BR(~chi_20 -> ~mu_L+    mu-)
     1.04684468E-01    2     1000012       -12   # BR(~chi_20 -> ~nu_eL    nu_eb)
     1.04684468E-01    2    -1000012        12   # BR(~chi_20 -> ~nu_eL*   nu_e )
     1.04684468E-01    2     1000014       -14   # BR(~chi_20 -> ~nu_muL   nu_mub)
     1.04684468E-01    2    -1000014        14   # BR(~chi_20 -> ~nu_muL*  nu_mu )
#
#         PDG            Width
DECAY   1000025     9.02573325E+00   # neutralino3 decays
#          BR         NDA      ID1       ID2
     2.21575122E-01    2     1000022        23   # BR(~chi_30 -> ~chi_10   Z )
     2.94331253E-02    2     1000023        23   # BR(~chi_30 -> ~chi_20   Z )
     3.00220016E-01    2     1000024       -24   # BR(~chi_30 -> ~chi_1+   W-)
     3.00220016E-01    2    -1000024        24   # BR(~chi_30 -> ~chi_1-   W+)
     8.31490136E-02    2     1000022        25   # BR(~chi_30 -> ~chi_10   h )
     6.39572559E-05    2     1000023        25   # BR(~chi_30 -> ~chi_20   h )
     3.21249058E-06    2     2000002        -2   # BR(~chi_30 -> ~u_R      ub)
     3.21249058E-06    2    -2000002         2   # BR(~chi_30 -> ~u_R*     u )
     3.21232816E-06    2     2000004        -4   # BR(~chi_30 -> ~c_R      cb)
     3.21232816E-06    2    -2000004         4   # BR(~chi_30 -> ~c_R*     c )
     3.19477627E-02    2     1000005        -5   # BR(~chi_30 -> ~b_1      bb)
     3.19477627E-02    2    -1000005         5   # BR(~chi_30 -> ~b_1*     b )
     1.10399944E-04    2     1000011       -11   # BR(~chi_30 -> ~e_L-     e+)
     1.10399944E-04    2    -1000011        11   # BR(~chi_30 -> ~e_L+     e-)
     1.10399944E-04    2     1000013       -13   # BR(~chi_30 -> ~mu_L-    mu+)
     1.10399944E-04    2    -1000013        13   # BR(~chi_30 -> ~mu_L+    mu-)
     2.47193575E-04    2     1000012       -12   # BR(~chi_30 -> ~nu_eL    nu_eb)
     2.47193575E-04    2    -1000012        12   # BR(~chi_30 -> ~nu_eL*   nu_e )
     2.47193575E-04    2     1000014       -14   # BR(~chi_30 -> ~nu_muL   nu_mub)
     2.47193575E-04    2    -1000014        14   # BR(~chi_30 -> ~nu_muL*  nu_mu )
#
#         PDG            Width
DECAY   1000035     8.98108229E+00   # neutralino4 decays
#          BR         NDA      ID1       ID2
     8.44475267E-02    2     1000022        23   # BR(~chi_40 -> ~chi_10   Z )
     2.09475153E-04    2     1000023        23   # BR(~chi_40 -> ~chi_20   Z )
     2.93154886E-01    2     1000024       -24   # BR(~chi_40 -> ~chi_1+   W-)
     2.93154886E-01    2    -1000024        24   # BR(~chi_40 -> ~chi_1-   W+)
     2.15667018E-01    2     1000022        25   # BR(~chi_40 -> ~chi_10   h )
     2.83005582E-02    2     1000023        25   # BR(~chi_40 -> ~chi_20   h )
     9.02003685E-04    2     2000002        -2   # BR(~chi_40 -> ~u_R      ub)
     9.02003685E-04    2    -2000002         2   # BR(~chi_40 -> ~u_R*     u )
     9.01962369E-04    2     2000004        -4   # BR(~chi_40 -> ~c_R      cb)
     9.01962369E-04    2    -2000004         4   # BR(~chi_40 -> ~c_R*     c )
     3.20142061E-02    2     1000005        -5   # BR(~chi_40 -> ~b_1      bb)
     3.20142061E-02    2    -1000005         5   # BR(~chi_40 -> ~b_1*     b )
     4.31107152E-04    2     1000011       -11   # BR(~chi_40 -> ~e_L-     e+)
     4.31107152E-04    2    -1000011        11   # BR(~chi_40 -> ~e_L+     e-)
     4.31107152E-04    2     1000013       -13   # BR(~chi_40 -> ~mu_L-    mu+)
     4.31107152E-04    2    -1000013        13   # BR(~chi_40 -> ~mu_L+    mu-)
     3.92621955E-03    2     1000012       -12   # BR(~chi_40 -> ~nu_eL    nu_eb)
     3.92621955E-03    2    -1000012        12   # BR(~chi_40 -> ~nu_eL*   nu_e )
     3.92621955E-03    2     1000014       -14   # BR(~chi_40 -> ~nu_muL   nu_mub)
     3.92621955E-03    2    -1000014        14   # BR(~chi_40 -> ~nu_muL*  nu_mu )
#
#         PDG            Width
DECAY        25     4.05715246E-03   # h decays
#          BR         NDA      ID1       ID2
     5.22946624E-01    2           5        -5   # BR(h -> b       bb     )
     6.52718275E-02    2         -15        15   # BR(h -> tau+    tau-   )
     2.31017912E-04    2         -13        13   # BR(h -> mu+     mu-    )
     2.51342048E-04    2           3        -3   # BR(h -> s       sb     )
     2.17015022E-02    2           4        -4   # BR(h -> c       cb     )
     8.30090755E-02    2          21        21   # BR(h -> g       g      )
     2.51661923E-03    2          22        22   # BR(h -> gam     gam    )
     1.89112109E-03    2          22        23   # BR(h -> Z       gam    )
     2.67642362E-01    2          24       -24   # BR(h -> W+      W-     )
     3.45385083E-02    2          23        23   # BR(h -> Z       Z      )
#
#         PDG            Width
DECAY        35     5.94665974E+01   # H decays
#          BR         NDA      ID1       ID2
     2.87397811E-01    2           5        -5   # BR(H -> b       bb     )
     4.41659592E-02    2         -15        15   # BR(H -> tau+    tau-   )
     1.53060316E-04    2         -13        13   # BR(H -> mu+     mu-    )
     1.11085479E-04    2           3        -3   # BR(H -> s       sb     )
     6.84894839E-08    2           4        -4   # BR(H -> c       cb     )
     6.75323090E-03    2           6        -6   # BR(H -> t       tb     )
     4.88144826E-07    2          21        21   # BR(H -> g       g      )
     3.13397739E-08    2          22        22   # BR(H -> gam     gam    )
     2.01458092E-09    2          23        22   # BR(H -> Z       gam    )
     3.45072729E-06    2          24       -24   # BR(H -> W+      W-     )
     1.72222912E-06    2          23        23   # BR(H -> Z       Z      )
     1.01133276E-05    2          25        25   # BR(H -> h       h      )
     3.75997229E-03    2     1000024  -1000024   # BR(H -> ~chi_1+ ~chi_1-)
     3.93630112E-05    2     1000037  -1000037   # BR(H -> ~chi_2+ ~chi_2-)
     1.88906474E-01    2     1000024  -1000037   # BR(H -> ~chi_1+ ~chi_2-)
     1.88906474E-01    2     1000037  -1000024   # BR(H -> ~chi_2+ ~chi_1-)
     1.88262412E-03    2     1000022   1000022   # BR(H -> ~chi_10 ~chi_10)
     1.10979110E-03    2     1000023   1000023   # BR(H -> ~chi_20 ~chi_20)
     1.41040102E-04    2     1000025   1000025   # BR(H -> ~chi_30 ~chi_30)
     1.57403473E-03    2     1000035   1000035   # BR(H -> ~chi_40 ~chi_40)
     5.29305141E-03    2     1000022   1000023   # BR(H -> ~chi_10 ~chi_20)
     1.09623560E-01    2     1000022   1000025   # BR(H -> ~chi_10 ~chi_30)
     7.33476499E-02    2     1000022   1000035   # BR(H -> ~chi_10 ~chi_40)
     2.64379152E-02    2     1000023   1000025   # BR(H -> ~chi_20 ~chi_30)
     9.75931924E-03    2     1000023   1000035   # BR(H -> ~chi_20 ~chi_40)
     3.40894078E-03    2     1000025   1000035   # BR(H -> ~chi_30 ~chi_40)
     2.38283269E-07    2     2000002  -2000002   # BR(H -> ~u_R    ~u_R*  )
     2.38283269E-07    2     2000004  -2000004   # BR(H -> ~c_R    ~c_R*  )
     1.17887387E-03    2     1000006  -1000006   # BR(H -> ~t_1    ~t_1*  )
     3.50524982E-08    2     2000001  -2000001   # BR(H -> ~d_R    ~d_R*  )
     3.50524982E-08    2     2000003  -2000003   # BR(H -> ~s_R    ~s_R*  )
     1.52718014E-04    2     1000005  -1000005   # BR(H -> ~b_1    ~b_1*  )
     8.32581597E-05    2     2000005  -2000005   # BR(H -> ~b_2    ~b_2*  )
     2.28971208E-02    2     1000005  -2000005   # BR(H -> ~b_1    ~b_2*  )
     2.28971208E-02    2     2000005  -1000005   # BR(H -> ~b_2    ~b_1*  )
     3.33702889E-07    2     1000011  -1000011   # BR(H -> ~e_L-   ~e_L+  )
     1.41254328E-07    2     2000011  -2000011   # BR(H -> ~e_R-   ~e_R+  )
     3.33702889E-07    2     1000013  -1000013   # BR(H -> ~mu_L-  ~mu_L+ )
     1.41254328E-07    2     2000013  -2000013   # BR(H -> ~mu_R-  ~mu_R+ )
     1.08898554E-06    2     1000012  -1000012   # BR(H -> ~nu_eL  ~nu_eL*   )
     1.08898554E-06    2     1000014  -1000014   # BR(H -> ~nu_muL ~nu_muL*  )
#
#         PDG            Width
DECAY        36     5.93966796E+01   # A decays
#          BR         NDA      ID1       ID2
     2.87759226E-01    2           5        -5   # BR(A -> b       bb     )
     4.42184704E-02    2         -15        15   # BR(A -> tau+    tau-   )
     1.53242167E-04    2         -13        13   # BR(A -> mu+     mu-    )
     1.11239294E-04    2           3        -3   # BR(A -> s       sb     )
     6.89027528E-08    2           4        -4   # BR(A -> c       cb     )
     6.77121772E-03    2           6        -6   # BR(A -> t       tb     )
     1.54134056E-05    2          21        21   # BR(A -> g       g      )
     7.00070100E-08    2          22        22   # BR(A -> gam     gam    )
     1.51375012E-08    2          23        22   # BR(A -> Z       gam    )
     3.50352208E-06    2          23        25   # BR(A -> Z       h      )
     4.03364663E-03    2     1000024  -1000024   # BR(A -> ~chi_1+ ~chi_1-)
     2.19037397E-04    2     1000037  -1000037   # BR(A -> ~chi_2+ ~chi_2-)
     1.88899161E-01    2     1000024  -1000037   # BR(A -> ~chi_1+ ~chi_2-)
     1.88899161E-01    2     1000037  -1000024   # BR(A -> ~chi_2+ ~chi_1-)
     2.01993432E-03    2     1000022   1000022   # BR(A -> ~chi_10 ~chi_10)
     2.25821014E-03    2     1000023   1000023   # BR(A -> ~chi_20 ~chi_20)
     2.49125559E-04    2     1000025   1000025   # BR(A -> ~chi_30 ~chi_30)
     4.31570080E-03    2     1000035   1000035   # BR(A -> ~chi_40 ~chi_40)
     6.88605088E-03    2     1000022   1000023   # BR(A -> ~chi_10 ~chi_20)
     7.86452065E-02    2     1000022   1000025   # BR(A -> ~chi_10 ~chi_30)
     1.02820573E-01    2     1000022   1000035   # BR(A -> ~chi_10 ~chi_40)
     1.12642379E-02    2     1000023   1000025   # BR(A -> ~chi_20 ~chi_30)
     2.29926891E-02    2     1000023   1000035   # BR(A -> ~chi_20 ~chi_40)
     1.36973303E-03    2     1000025   1000035   # BR(A -> ~chi_30 ~chi_40)
     2.30475333E-02    2     1000005  -2000005   # BR(A -> ~b_1    ~b_2*  )
     2.30475333E-02    2    -1000005   2000005   # BR(A -> ~b_1*   ~b_2   )
#
#         PDG            Width
DECAY        37     6.53320153E+01   # H+ decays
#          BR         NDA      ID1       ID2
     4.87829581E-04    2           4        -5   # BR(H+ -> c       bb     )
     4.02154902E-02    2         -15        16   # BR(H+ -> tau+    nu_tau )
     1.39369563E-04    2         -13        14   # BR(H+ -> mu+     nu_mu  )
     4.87829079E-06    2           2        -5   # BR(H+ -> u       bb     )
     5.06120832E-06    2           2        -3   # BR(H+ -> u       sb     )
     9.96800461E-05    2           4        -3   # BR(H+ -> c       sb     )
     2.95994778E-01    2           6        -5   # BR(H+ -> t       bb     )
     3.18999707E-06    2          24        25   # BR(H+ -> W+      h      )
     6.74772078E-14    2          24        36   # BR(H+ -> W+      A      )
     9.59265212E-10    2     1000024   1000022   # BR(H+ -> ~chi_1+ ~chi_10)
     1.12180729E-02    2     1000024   1000023   # BR(H+ -> ~chi_1+ ~chi_20)
     1.72627422E-01    2     1000024   1000025   # BR(H+ -> ~chi_1+ ~chi_30)
     1.62745871E-01    2     1000024   1000035   # BR(H+ -> ~chi_1+ ~chi_40)
     1.73837332E-01    2     1000037   1000022   # BR(H+ -> ~chi_2+ ~chi_10)
     3.58933521E-02    2     1000037   1000023   # BR(H+ -> ~chi_2+ ~chi_20)
     4.34183644E-04    2     1000037   1000025   # BR(H+ -> ~chi_2+ ~chi_30)
     2.06561850E-03    2     1000037   1000035   # BR(H+ -> ~chi_2+ ~chi_40)
     1.19300842E-06    2    -1000011   1000012   # BR(H+ -> ~e_L+   ~nu_eL )
     1.19300842E-06    2    -1000013   1000014   # BR(H+ -> ~mu_L+  ~nu_muL)
     1.03087031E-01    2     1000006  -1000005   # BR(H+ -> ~t_1    ~b_1*  )
     1.13845431E-03    2     1000006  -2000005   # BR(H+ -> ~t_1    ~b_2*  )
