#
#                              ======================
#                              | THE SUSYHIT OUTPUT |
#                              ======================
#
#
#              ------------------------------------------------------
#              |     This is the output of the SUSY-HIT package     |
#              |  created by A.Djouadi, M.Muehlleitner and M.Spira. |
#              |  In case of problems with SUSY-HIT email to        |
#              |           margarete.muehlleitner@cern.ch           |
#              |           michael.spira@psi.ch                     |
#              |           abdelhak.djouadi@cern.ch                 |
#              ------------------------------------------------------
#
#              ------------------------------------------------------
#              |  SUSY Les Houches Accord - MSSM Spectrum + Decays  |
#              |              based on the decay programs           |
#              |                                                    |
#              |                     SDECAY 1.3b                    |
#              |                                                    |
#              |  Authors: M.Muhlleitner, A.Djouadi and Y.Mambrini  |
#              |  Ref.:    Comput.Phys.Commun.168(2005)46           |
#              |           [hep-ph/0311167]                         |
#              |                                                    |
#              |                     HDECAY 3.4                     |
#              |                                                    |
#              |  By: A.Djouadi,J.Kalinowski,M.Muhlleitner,M.Spira  |
#              |  Ref.:    Comput.Phys.Commun.108(1998)56           |
#              |           [hep-ph/9704448]                         |
#              |                                                    |
#              |                                                    |
#              |  If not stated otherwise all DRbar couplings and   |
#              |  soft SUSY breaking masses are given at the scale  |
#              |  Q=  0.35755750E+04
#              |                                                    |
#              ------------------------------------------------------
#
#
BLOCK DCINFO  # Decay Program information
     1   SDECAY/HDECAY # decay calculator
     2   1.3b  /3.4    # version number
#
BLOCK SPINFO  # Spectrum calculator information
     1     SOFTSUSY    # spectrum calculator               
     2     3.4.0       # version number                    
#
BLOCK MODSEL  # Model selection
     1     0   #  nonUniversal                                     
#
BLOCK SMINPUTS  # Standard Model inputs
         1     1.27908970E+02   # alpha_em^-1(M_Z)^MSbar
         2     1.16637870E-05   # G_F [GeV^-2]
         3     1.18400000E-01   # alpha_S(M_Z)^MSbar
         4     9.11876000E+01   # M_Z pole mass
         5     4.18000000E+00   # mb(mb)^MSbar
         6     1.73200000E+02   # mt pole mass
         7     1.77700000E+00   # mtau pole mass
#
BLOCK MINPAR  # Input parameters - minimal models
         3     8.29000000E+00   # tanb                
#
BLOCK EXTPAR  # Input parameters - non-minimal models
         0    -1.00000000E+00   # Set                 
         1     8.73220000E+02   # M_1(MX)             
         2     3.58047000E+03   # M_2(MX)             
         3     7.24470000E+02   # M_3(MX)             
        11     4.78816000E+03   # At(MX)              
        12    -3.28069000E+03   # Ab(MX)              
        13     2.78533000E+03   # Atau(MX)            
        23    -3.61430000E+03   # mu(MX)              
        26     9.88910000E+02   # mA(pole)            
        31     8.96940000E+02   # meL(MX)             
        32     8.96940000E+02   # mmuL(MX)            
        33     2.88397000E+03   # mtauL(MX)           
        34     9.71600000E+02   # meR(MX)             
        35     9.71600000E+02   # mmuR(MX)            
        36     3.94059000E+03   # mtauR(MX)           
        41     1.12027000E+03   # mqL1(MX)            
        42     1.12027000E+03   # mqL2(MX)            
        43     3.80049000E+03   # mqL3(MX)            
        44     1.06495000E+03   # muR(MX)             
        45     1.06495000E+03   # mcR(MX)             
        46     3.36483000E+03   # mtR(MX)             
        47     1.14600000E+03   # mdR(MX)             
        48     1.14600000E+03   # msR(MX)             
        49     2.19951000E+03   # mbR(MX)             
#
BLOCK MASS  # Mass Spectrum
# PDG code           mass       particle
        24     8.04062551E+01   # W+
        25     1.25936603E+02   # h
        35     9.89097965E+02   # H
        36     9.88910240E+02   # A
        37     9.92093342E+02   # H+
         5     4.81876030E+00   # b-quark pole mass calculated from mb(mb)_Msbar
   1000001     1.21343659E+03   # ~d_L
   2000001     1.18775269E+03   # ~d_R
   1000002     1.21120552E+03   # ~u_L
   2000002     1.10925474E+03   # ~u_R
   1000003     1.21343659E+03   # ~s_L
   2000003     1.18775269E+03   # ~s_R
   1000004     1.21120552E+03   # ~c_L
   2000004     1.10925474E+03   # ~c_R
   1000005     2.22862604E+03   # ~b_1
   2000005     3.81548729E+03   # ~b_2
   1000006     3.32280735E+03   # ~t_1
   2000006     3.83623165E+03   # ~t_2
   1000011     9.59558083E+02   # ~e_L
   2000011     9.80479638E+02   # ~e_R
   1000012     9.56221559E+02   # ~nu_eL
   1000013     9.59558083E+02   # ~mu_L
   2000013     9.80479638E+02   # ~mu_R
   1000014     9.56221559E+02   # ~nu_muL
   1000015     2.91546296E+03   # ~tau_1
   2000015     3.94418633E+03   # ~tau_2
   1000016     2.91420250E+03   # ~nu_tauL
   1000021     8.72955784E+02   # ~g
   1000022     8.54358298E+02   # ~chi_10
   1000023     3.52873401E+03   # ~chi_20
   1000025    -3.66501014E+03   # ~chi_30
   1000035     3.68028385E+03   # ~chi_40
   1000024     3.52892478E+03   # ~chi_1+
   1000037     3.68064665E+03   # ~chi_2+
#
BLOCK NMIX  # Neutralino Mixing Matrix
  1  1     9.99923451E-01   # N_11
  1  2     1.32056647E-05   # N_12
  1  3    -1.23028627E-02   # N_13
  1  4    -1.31613036E-03   # N_14
  2  1     2.31286063E-03   # N_21
  2  2     9.71992262E-01   # N_22
  2  3     1.71878308E-01   # N_23
  2  4     1.60260849E-01   # N_24
  3  1    -7.76833766E-03   # N_31
  3  2     8.45312044E-03   # N_32
  3  3    -7.07012483E-01   # N_33
  3  4     7.07107875E-01   # N_34
  4  1     9.34860471E-03   # N_41
  4  2    -2.34860781E-01   # N_42
  4  3     6.85886168E-01   # N_43
  4  4     6.88703987E-01   # N_44
#
BLOCK UMIX  # Chargino Mixing Matrix U
  1  1     9.48360377E-01   # U_11
  1  2     3.17194887E-01   # U_12
  2  1    -3.17194887E-01   # U_21
  2  2     9.48360377E-01   # U_22
#
BLOCK VMIX  # Chargino Mixing Matrix V
  1  1     9.53599507E-01   # V_11
  1  2    -3.01078031E-01   # V_12
  2  1    -3.01078031E-01   # V_21
  2  2    -9.53599507E-01   # V_22
#
BLOCK STOPMIX  # Stop Mixing Matrix
  1  1    -1.97972164E-01   # cos(theta_t)
  1  2     9.80207642E-01   # sin(theta_t)
  2  1    -9.80207642E-01   # -sin(theta_t)
  2  2    -1.97972164E-01   # cos(theta_t)
#
BLOCK SBOTMIX  # Sbottom Mixing Matrix
  1  1    -6.35136890E-03   # cos(theta_b)
  1  2     9.99979830E-01   # sin(theta_b)
  2  1    -9.99979830E-01   # -sin(theta_b)
  2  2    -6.35136890E-03   # cos(theta_b)
#
BLOCK STAUMIX  # Stau Mixing Matrix
  1  1     9.99969729E-01   # cos(theta_tau)
  1  2    -7.78081510E-03   # sin(theta_tau)
  2  1     7.78081510E-03   # -sin(theta_tau)
  2  2     9.99969729E-01   # cos(theta_tau)
#
BLOCK ALPHA  # Higgs mixing
          -1.28932631E-01   # Mixing angle in the neutral Higgs boson sector
#
BLOCK HMIX Q=  3.57557500E+03  # DRbar Higgs Parameters
         1    -3.67189013E+03   # mu(Q)MSSM           
         2     7.87525332E+00   # tan                 
         3     2.42904397E+02   # higgs               
         4     1.08620432E+06   # mA^2(Q)MSSM         
#
BLOCK GAUGE Q=  3.57557500E+03  # The gauge couplings
     1     3.65805929E-01   # gprime(Q) DRbar
     2     6.35840042E-01   # g(Q) DRbar
     3     1.03401819E+00   # g3(Q) DRbar
#
BLOCK AU Q=  3.57557500E+03  # The trilinear couplings
  1  1     0.00000000E+00   # A_u(Q) DRbar
  2  2     0.00000000E+00   # A_c(Q) DRbar
  3  3     4.78816000E+03   # A_t(Q) DRbar
#
BLOCK AD Q=  3.57557500E+03  # The trilinear couplings
  1  1     0.00000000E+00   # A_d(Q) DRbar
  2  2     0.00000000E+00   # A_s(Q) DRbar
  3  3    -3.28069000E+03   # A_b(Q) DRbar
#
BLOCK AE Q=  3.57557500E+03  # The trilinear couplings
  1  1     0.00000000E+00   # A_e(Q) DRbar
  2  2     0.00000000E+00   # A_mu(Q) DRbar
  3  3     2.78533000E+03   # A_tau(Q) DRbar
#
BLOCK Yu Q=  3.57557500E+03  # The Yukawa couplings
  1  1     0.00000000E+00   # y_u(Q) DRbar
  2  2     0.00000000E+00   # y_c(Q) DRbar
  3  3     8.25225449E-01   # y_t(Q) DRbar
#
BLOCK Yd Q=  3.57557500E+03  # The Yukawa couplings
  1  1     0.00000000E+00   # y_d(Q) DRbar
  2  2     0.00000000E+00   # y_s(Q) DRbar
  3  3     1.10058607E-01   # y_b(Q) DRbar
#
BLOCK Ye Q=  3.57557500E+03  # The Yukawa couplings
  1  1     0.00000000E+00   # y_e(Q) DRbar
  2  2     0.00000000E+00   # y_mu(Q) DRbar
  3  3     7.98701336E-02   # y_tau(Q) DRbar
#
BLOCK MSOFT Q=  3.57557500E+03  # The soft SUSY breaking masses at the scale Q
         1     8.73220000E+02   # M_1(Q)              
         2     3.58047000E+03   # M_2(Q)              
         3     7.24470000E+02   # M_3(Q)              
        21    -1.26405777E+07   # mH1^2(Q)            
        22    -1.32636301E+07   # mH2^2(Q)            
        31     8.96940000E+02   # meL(Q)              
        32     8.96940000E+02   # mmuL(Q)             
        33     2.88397000E+03   # mtauL(Q)            
        34     9.71600000E+02   # meR(Q)              
        35     9.71600000E+02   # mmuR(Q)             
        36     3.94059000E+03   # mtauR(Q)            
        41     1.12027000E+03   # mqL1(Q)             
        42     1.12027000E+03   # mqL2(Q)             
        43     3.80049000E+03   # mqL3(Q)             
        44     1.06495000E+03   # muR(Q)              
        45     1.06495000E+03   # mcR(Q)              
        46     3.36483000E+03   # mtR(Q)              
        47     1.14600000E+03   # mdR(Q)              
        48     1.14600000E+03   # msR(Q)              
        49     2.19951000E+03   # mbR(Q)              
#
Block HiggsBoundsInputHiggsCouplingsFermions
# ScalarNormEffCoupSq PseudoSNormEffCoupSq NP   IP1 IP2 IP2
    1.04182214E+00    0.00000000E+00        3  25   5   5  # h0-b-b eff. coupling^2, normalised to SM
    6.19777927E+01    0.00000000E+00        3  35   5   5  # H0-b-b eff. coupling^2, normalised to SM
    0.00000000E+00    6.20196149E+01        3  36   5   5  # A0-b-b eff. coupling^2, normalised to SM
#
    9.99325663E-01    0.00000000E+00        3  25   6   6  # h0-t-t eff. coupling^2, normalised to SM
    1.67982685E-02    0.00000000E+00        3  35   6   6  # H0-t-t eff. coupling^2, normalised to SM
    0.00000000E+00    1.61239312E-02        3  36   6   6  # A0-t-t eff. coupling^2, normalised to SM
#
    1.04182214E+00    0.00000000E+00        3  25  15  15  # h0-tau-tau eff. coupling^2, normalised to SM
    6.19777927E+01    0.00000000E+00        3  35  15  15  # H0-tau-tau eff. coupling^2, normalised to SM
    0.00000000E+00    6.20196149E+01        3  36  15  15  # A0-tau-tau eff. coupling^2, normalised to SM
#
Block HiggsBoundsInputHiggsCouplingsBosons
    9.99993091E-01        3  25  24  24  # h0-W-W eff. coupling^2, normalised to SM
    6.90917384E-06        3  35  24  24  # H0-W-W eff. coupling^2, normalised to SM
    0.00000000E+00        3  36  24  24  # A0-W-W eff. coupling^2, normalised to SM
#
    9.99993091E-01        3  25  23  23  # h0-Z-Z eff. coupling^2, normalised to SM
    6.90917384E-06        3  35  23  23  # H0-Z-Z eff. coupling^2, normalised to SM
    0.00000000E+00        3  36  23  23  # A0-Z-Z eff. coupling^2, normalised to SM
#
    8.82300313E-01        3  25  21  21  # h0-g-g eff. coupling^2, normalised to SM
    1.87417609E-04        3  35  21  21  # H0-g-g eff. coupling^2, normalised to SM
    8.06178933E-04        3  36  21  21  # A0-g-g eff. coupling^2, normalised to SM
#
    0.00000000E+00        3  25  25  23  # h0-h0-Z eff. coupling^2, normalised to SM
    0.00000000E+00        3  35  25  23  # H0-h0-Z eff. coupling^2, normalised to SM
    6.90917384E-06        3  36  25  23  # A0-h0-Z eff. coupling^2, normalised to SM
    0.00000000E+00        3  35  35  23  # H0-H0-Z eff. coupling^2, normalised to SM
    9.99993091E-01        3  36  35  23  # A0-H0-Z eff. coupling^2, normalised to SM
    0.00000000E+00        3  36  36  23  # A0-A0-Z eff. coupling^2, normalised to SM
#
    0.00000000E+00        4  25  21  21  23  # h0-g-g-Z eff. coupling^2, normalised to SM
    0.00000000E+00        4  35  21  21  23  # H0-g-g-Z eff. coupling^2, normalised to SM
    0.00000000E+00        4  36  21  21  23  # A0-g-g-Z eff. coupling^2, normalised to SM
#
#
#
#                             =================
#                             |The decay table|
#                             =================
#
# - The QCD corrections to the decays gluino -> squark  + quark
#                                     squark -> gaugino + quark_prime
#                                     squark -> squark_prime + Higgs
#                                     squark -> gluino  + quark
#   are included.
#
# - The multi-body decays for the inos, stops and sbottoms are included.
#
# - The loop induced decays for the gluino, neutralinos and stops
#   are included.
#
# - The SUSY decays of the top quark are included.
#
#
#         PDG            Width
DECAY         6     1.42313576E+00   # top decays
#          BR         NDA      ID1       ID2
     1.00000000E+00    2           5        24   # BR(t ->  b    W+)
#
#         PDG            Width
DECAY   1000021     5.60135096E-10   # gluino decays
#          BR         NDA      ID1       ID2
     6.72412380E-04    2     1000022        21   # BR(~g -> ~chi_10 g)
#           BR         NDA      ID1       ID2       ID3
     6.74374250E-02    3     1000022         1        -1   # BR(~g -> ~chi_10 d  db)
     4.31892249E-01    3     1000022         2        -2   # BR(~g -> ~chi_10 u  ub)
     6.74374250E-02    3     1000022         3        -3   # BR(~g -> ~chi_10 s  sb)
     4.31892249E-01    3     1000022         4        -4   # BR(~g -> ~chi_10 c  cb)
     6.68238818E-04    3     1000022         5        -5   # BR(~g -> ~chi_10 b  bb)
#
#         PDG            Width
DECAY   1000006     1.67036870E+02   # stop1 decays
#          BR         NDA      ID1       ID2
     3.91361933E-02    2     1000022         6   # BR(~t_1 -> ~chi_10 t )
     9.60725667E-01    2     1000021         6   # BR(~t_1 -> ~g      t )
     1.02473684E-04    2     1000005        37   # BR(~t_1 -> ~b_1    H+)
     3.56656840E-05    2     1000005        24   # BR(~t_1 -> ~b_1    W+)
#
#         PDG            Width
DECAY   2000006     2.19107358E+02   # stop2 decays
#          BR         NDA      ID1       ID2
     3.80915837E-03    2     1000022         6   # BR(~t_2 -> ~chi_10 t )
     1.07001606E-03    2     1000023         6   # BR(~t_2 -> ~chi_20 t )
     0.00000000E+00    2     1000025         6   # BR(~t_2 -> ~chi_30 t )
     3.42654068E-03    2     1000024         5   # BR(~t_2 -> ~chi_1+ b )
     2.48101770E-05    2     1000037         5   # BR(~t_2 -> ~chi_2+ b )
     8.96382339E-01    2     1000021         6   # BR(~t_2 -> ~g      t )
     4.52304062E-02    2     1000006        25   # BR(~t_2 -> ~t_1    h )
     1.89715188E-03    2     1000005        37   # BR(~t_2 -> ~b_1    H+)
     4.63604171E-02    2     1000006        23   # BR(~t_2 -> ~t_1    Z )
     1.79916009E-03    2     1000005        24   # BR(~t_2 -> ~b_1    W+)
#
#         PDG            Width
DECAY   1000005     9.15538813E+01   # sbottom1 decays
#          BR         NDA      ID1       ID2
     1.04795164E-02    2     1000022         5   # BR(~b_1 -> ~chi_10 b )
     9.89520484E-01    2     1000021         5   # BR(~b_1 -> ~g      b )
#
#         PDG            Width
DECAY   2000005     2.14685478E+02   # sbottom2 decays
#          BR         NDA      ID1       ID2
     2.37027950E-03    2     1000022         5   # BR(~b_2 -> ~chi_10 b )
     1.41539771E-03    2     1000023         5   # BR(~b_2 -> ~chi_20 b )
     1.28979151E-05    2     1000025         5   # BR(~b_2 -> ~chi_30 b )
     2.83533476E-05    2     1000035         5   # BR(~b_2 -> ~chi_40 b )
     1.44218350E-03    2    -1000024         6   # BR(~b_2 -> ~chi_1- t )
     9.05323706E-01    2     1000021         5   # BR(~b_2 -> ~g      b )
     9.99925705E-04    2     1000005        25   # BR(~b_2 -> ~b_1    h )
     1.03724007E-03    2     1000005        35   # BR(~b_2 -> ~b_1    H )
     1.03307213E-03    2     1000005        36   # BR(~b_2 -> ~b_1    A )
     9.55527012E-04    2     1000005        23   # BR(~b_2 -> ~b_1    Z )
     8.53814172E-02    2     1000006       -24   # BR(~b_2 -> ~t_1    W-)
#
#         PDG            Width
DECAY   1000002     2.34238736E+01   # sup_L decays
#          BR         NDA      ID1       ID2
     1.87774242E-03    2     1000022         2   # BR(~u_L -> ~chi_10 u)
     9.98122258E-01    2     1000021         2   # BR(~u_L -> ~g      u)
#
#         PDG            Width
DECAY   2000002     1.38611567E+01   # sup_R decays
#          BR         NDA      ID1       ID2
     3.06330756E-02    2     1000022         2   # BR(~u_R -> ~chi_10 u)
     9.69366924E-01    2     1000021         2   # BR(~u_R -> ~g      u)
#
#         PDG            Width
DECAY   1000001     2.36537393E+01   # sdown_L decays
#          BR         NDA      ID1       ID2
     1.87584147E-03    2     1000022         1   # BR(~d_L -> ~chi_10 d)
     9.98124159E-01    2     1000021         1   # BR(~d_L -> ~g      d)
#
#         PDG            Width
DECAY   2000001     2.11522802E+01   # sdown_R decays
#          BR         NDA      ID1       ID2
     7.53052999E-03    2     1000022         1   # BR(~d_R -> ~chi_10 d)
     9.92469470E-01    2     1000021         1   # BR(~d_R -> ~g      d)
#
#         PDG            Width
DECAY   1000004     1.59099523E+01   # scharm_L decays
#          BR         NDA      ID1       ID2
     2.84227381E-03    2     1000022         4   # BR(~c_L -> ~chi_10 c)
     9.97157726E-01    2     1000021         4   # BR(~c_L -> ~g      c)
#
#         PDG            Width
DECAY   2000004     9.55173115E+00   # scharm_R decays
#          BR         NDA      ID1       ID2
     4.54639643E-02    2     1000022         4   # BR(~c_R -> ~chi_10 c)
     9.54536036E-01    2     1000021         4   # BR(~c_R -> ~g      c)
#
#         PDG            Width
DECAY   1000003     1.60663120E+01   # sstrange_L decays
#          BR         NDA      ID1       ID2
     2.83960915E-03    2     1000022         3   # BR(~s_L -> ~chi_10 s)
     9.97160391E-01    2     1000021         3   # BR(~s_L -> ~g      s)
#
#         PDG            Width
DECAY   2000003     1.44089116E+01   # sstrange_R decays
#          BR         NDA      ID1       ID2
     1.13558236E-02    2     1000022         3   # BR(~s_R -> ~chi_10 s)
     9.88644176E-01    2     1000021         3   # BR(~s_R -> ~g      s)
#
#         PDG            Width
DECAY   1000011     5.48536463E-02   # selectron_L decays
#          BR         NDA      ID1       ID2
     1.00000000E+00    2     1000022        11   # BR(~e_L -> ~chi_10 e-)
#
#         PDG            Width
DECAY   2000011     3.02448870E-01   # selectron_R decays
#          BR         NDA      ID1       ID2
     1.00000000E+00    2     1000022        11   # BR(~e_R -> ~chi_10 e-)
#
#         PDG            Width
DECAY   1000013     5.48536153E-02   # smuon_L decays
#          BR         NDA      ID1       ID2
     1.00000000E+00    2     1000022        13   # BR(~mu_L -> ~chi_10 mu-)
#
#         PDG            Width
DECAY   2000013     3.02448749E-01   # smuon_R decays
#          BR         NDA      ID1       ID2
     1.00000000E+00    2     1000022        13   # BR(~mu_R -> ~chi_10 mu-)
#
#         PDG            Width
DECAY   1000015     3.24323147E+00   # stau_1 decays
#          BR         NDA      ID1       ID2
     1.00000000E+00    2     1000022        15   # BR(~tau_1 -> ~chi_10  tau-)
#
#         PDG            Width
DECAY   2000015     1.95717447E+01   # stau_2 decays
#          BR         NDA      ID1       ID2
     9.74444874E-01    2     1000022        15   # BR(~tau_2 -> ~chi_10  tau-)
     1.72684218E-05    2     1000023        15   # BR(~tau_2 -> ~chi_20  tau-)
     2.40203324E-04    2     1000025        15   # BR(~tau_2 -> ~chi_30  tau-)
     2.08810728E-04    2     1000035        15   # BR(~tau_2 -> ~chi_40  tau-)
     6.79779347E-05    2    -1000024        16   # BR(~tau_2 -> ~chi_1-  nu_tau)
     3.99836261E-04    2    -1000037        16   # BR(~tau_2 -> ~chi_2-  nu_tau)
     1.04986391E-03    2     1000016       -37   # BR(~tau_2 -> ~nu_tauL H-)
     1.09509150E-02    2     1000016       -24   # BR(~tau_2 -> ~nu_tauL W-)
     5.91745586E-03    2     1000015        25   # BR(~tau_2 -> ~tau_1   h)
     5.31783112E-04    2     1000015        35   # BR(~tau_2 -> ~tau_1   H)
     5.38053036E-04    2     1000015        36   # BR(~tau_2 -> ~tau_1   A)
     5.63295863E-03    2     1000015        23   # BR(~tau_2 -> ~tau_1   Z)
#
#         PDG            Width
DECAY   1000012     5.17738099E-02   # snu_eL decays
#          BR         NDA      ID1       ID2
     1.00000000E+00    2     1000022        12   # BR(~nu_eL -> ~chi_10 nu_e)
#
#         PDG            Width
DECAY   1000014     5.17738099E-02   # snu_muL decays
#          BR         NDA      ID1       ID2
     1.00000000E+00    2     1000022        14   # BR(~nu_muL -> ~chi_10 nu_mu)
#
#         PDG            Width
DECAY   1000016     3.24022984E+00   # snu_tauL decays
#          BR         NDA      ID1       ID2
     1.00000000E+00    2     1000022        16   # BR(~nu_tauL -> ~chi_10 nu_tau)
#
#         PDG            Width
DECAY   1000024     1.63352563E+02   # chargino1+ decays
#          BR         NDA      ID1       ID2
     1.78895575E-01    2     1000002        -1   # BR(~chi_1+ -> ~u_L     db)
     1.76760898E-01    2    -1000001         2   # BR(~chi_1+ -> ~d_L*    u )
     1.78895575E-01    2     1000004        -3   # BR(~chi_1+ -> ~c_L     sb)
     1.76760887E-01    2    -1000003         4   # BR(~chi_1+ -> ~s_L*     c )
     1.27161965E-04    2     1000006        -5   # BR(~chi_1+ -> ~t_1     bb)
     3.52949072E-04    2    -1000005         6   # BR(~chi_1+ -> ~b_1*    t )
     6.78277470E-02    2     1000012       -11   # BR(~chi_1+ -> ~nu_eL   e+  )
     6.78277470E-02    2     1000014       -13   # BR(~chi_1+ -> ~nu_muL  mu+ )
     8.00326899E-03    2     1000016       -15   # BR(~chi_1+ -> ~nu_tau1 tau+)
     6.70101925E-02    2    -1000011        12   # BR(~chi_1+ -> ~e_L+    nu_e)
     6.70101925E-02    2    -1000013        14   # BR(~chi_1+ -> ~mu_L+   nu_mu)
     7.87926223E-03    2    -1000015        16   # BR(~chi_1+ -> ~tau_1+  nu_tau)
     1.06325159E-03    2     1000022        24   # BR(~chi_1+ -> ~chi_10  W+)
     1.58529169E-03    2     1000022        37   # BR(~chi_1+ -> ~chi_10  H+)
#
#         PDG            Width
DECAY   1000037     2.66371224E+01   # chargino2+ decays
#          BR         NDA      ID1       ID2
     1.16543987E-01    2     1000002        -1   # BR(~chi_2+ -> ~u_L     db)
     1.29239277E-01    2    -1000001         2   # BR(~chi_2+ -> ~d_L*    u )
     1.16543986E-01    2     1000004        -3   # BR(~chi_2+ -> ~c_L     sb)
     1.29239270E-01    2    -1000003         4   # BR(~chi_2+ -> ~s_L*     c )
     9.25333255E-02    2     1000006        -5   # BR(~chi_2+ -> ~t_1     bb)
     1.78008247E-02    2    -1000005         6   # BR(~chi_2+ -> ~b_1*    t )
     4.38019650E-02    2     1000012       -11   # BR(~chi_2+ -> ~nu_eL   e+  )
     4.38019650E-02    2     1000014       -13   # BR(~chi_2+ -> ~nu_muL mu+ )
     8.12452757E-03    2     1000016       -15   # BR(~chi_2+ -> ~nu_tau1 tau+)
     4.85677751E-02    2    -1000011        12   # BR(~chi_2+ -> ~e_L+    nu_e)
     4.85677751E-02    2    -1000013        14   # BR(~chi_2+ -> ~mu_L+   nu_mu)
     7.71484907E-03    2    -1000015        16   # BR(~chi_2+ -> ~tau_1+  nu_tau)
     1.40160268E-02    2     1000024        23   # BR(~chi_2+ -> ~chi_1+  Z )
     6.79635405E-02    2     1000022        24   # BR(~chi_2+ -> ~chi_10  W+)
     2.68261348E-02    2     1000023        24   # BR(~chi_2+ -> ~chi_20  W+)
     1.16974014E-02    2     1000024        25   # BR(~chi_2+ -> ~chi_1+  h )
     7.70173682E-02    2     1000022        37   # BR(~chi_2+ -> ~chi_10  H+)
#
#         PDG            Width
DECAY   1000022     0.00000000E+00   # neutralino1 decays
#
#         PDG            Width
DECAY   1000023     1.70403152E+02   # neutralino2 decays
#          BR         NDA      ID1       ID2
     2.51188296E-04    2     1000022        23   # BR(~chi_20 -> ~chi_10   Z )
     3.71276465E-04    2     1000022        25   # BR(~chi_20 -> ~chi_10   h )
     7.72167332E-04    2     1000022        35   # BR(~chi_20 -> ~chi_10   H )
     1.69516439E-04    2     1000022        36   # BR(~chi_20 -> ~chi_10   A )
     8.91603408E-02    2     1000002        -2   # BR(~chi_20 -> ~u_L      ub)
     8.91603408E-02    2    -1000002         2   # BR(~chi_20 -> ~u_L*     u )
     3.09712944E-07    2     2000002        -2   # BR(~chi_20 -> ~u_R      ub)
     3.09712944E-07    2    -2000002         2   # BR(~chi_20 -> ~u_R*     u )
     8.89100380E-02    2     1000001        -1   # BR(~chi_20 -> ~d_L      db)
     8.89100380E-02    2    -1000001         1   # BR(~chi_20 -> ~d_L*     d )
     7.49572192E-08    2     2000001        -1   # BR(~chi_20 -> ~d_R      db)
     7.49572192E-08    2    -2000001         1   # BR(~chi_20 -> ~d_R*     d )
     8.91603351E-02    2     1000004        -4   # BR(~chi_20 -> ~c_L      cb)
     8.91603351E-02    2    -1000004         4   # BR(~chi_20 -> ~c_L*     c )
     3.09712928E-07    2     2000004        -4   # BR(~chi_20 -> ~c_R      cb)
     3.09712928E-07    2    -2000004         4   # BR(~chi_20 -> ~c_R*     c )
     8.89100380E-02    2     1000003        -3   # BR(~chi_20 -> ~s _L      sb)
     8.89100380E-02    2    -1000003         3   # BR(~chi_20 -> ~s _L*     s )
     7.49572192E-08    2     2000003        -3   # BR(~chi_20 -> ~s _R      sb)
     7.49572192E-08    2    -2000003         3   # BR(~chi_20 -> ~s _R*     s )
     2.68152623E-06    2     1000006        -6   # BR(~chi_20 -> ~t_1      tb)
     2.68152623E-06    2    -1000006         6   # BR(~chi_20 -> ~t_1*     t )
     1.05089538E-04    2     1000005        -5   # BR(~chi_20 -> ~b_1      bb)
     1.05089538E-04    2    -1000005         5   # BR(~chi_20 -> ~b_1*     b )
     3.38294769E-02    2     1000011       -11   # BR(~chi_20 -> ~e_L-     e+)
     3.38294769E-02    2    -1000011        11   # BR(~chi_20 -> ~e_L+     e-)
     2.51121178E-07    2     2000011       -11   # BR(~chi_20 -> ~e_R-     e+)
     2.51121178E-07    2    -2000011        11   # BR(~chi_20 -> ~e_R+     e-)
     3.38294769E-02    2     1000013       -13   # BR(~chi_20 -> ~mu_L-    mu+)
     3.38294769E-02    2    -1000013        13   # BR(~chi_20 -> ~mu_L+    mu-)
     2.51121178E-07    2     2000013       -13   # BR(~chi_20 -> ~mu_R-    mu+)
     2.51121178E-07    2    -2000013        13   # BR(~chi_20 -> ~mu_R+    mu-)
     3.97843428E-03    2     1000015       -15   # BR(~chi_20 -> ~tau_1-   tau+)
     3.97843428E-03    2    -1000015        15   # BR(~chi_20 -> ~tau_1+   tau-)
     3.36820494E-02    2     1000012       -12   # BR(~chi_20 -> ~nu_eL    nu_eb)
     3.36820494E-02    2    -1000012        12   # BR(~chi_20 -> ~nu_eL*   nu_e )
     3.36820494E-02    2     1000014       -14   # BR(~chi_20 -> ~nu_muL   nu_mub)
     3.36820494E-02    2    -1000014        14   # BR(~chi_20 -> ~nu_muL*  nu_mu )
     3.96664435E-03    2     1000016       -16   # BR(~chi_20 -> ~nu_tau1  nu_taub)
     3.96664435E-03    2    -1000016        16   # BR(~chi_20 -> ~nu_tau1* nu_tau )
#
#         PDG            Width
DECAY   1000025     8.17226938E+00   # neutralino3 decays
#          BR         NDA      ID1       ID2
     1.51875427E-01    2     1000022        23   # BR(~chi_30 -> ~chi_10   Z )
     1.70642208E-02    2     1000023        23   # BR(~chi_30 -> ~chi_20   Z )
     3.64779518E-02    2     1000024       -24   # BR(~chi_30 -> ~chi_1+   W-)
     3.64779518E-02    2    -1000024        24   # BR(~chi_30 -> ~chi_1-   W+)
     1.03785984E-01    2     1000022        25   # BR(~chi_30 -> ~chi_10   h )
     4.94105093E-02    2     1000022        35   # BR(~chi_30 -> ~chi_10   H )
     2.32998716E-01    2     1000022        36   # BR(~chi_30 -> ~chi_10   A )
     3.01408956E-06    2     1000023        25   # BR(~chi_30 -> ~chi_20   h )
     1.00956094E-04    2     1000002        -2   # BR(~chi_30 -> ~u_L      ub)
     1.00956094E-04    2    -1000002         2   # BR(~chi_30 -> ~u_L*     u )
     7.68887011E-05    2     2000002        -2   # BR(~chi_30 -> ~u_R      ub)
     7.68887011E-05    2    -2000002         2   # BR(~chi_30 -> ~u_R*     u )
     2.05646405E-04    2     1000001        -1   # BR(~chi_30 -> ~d_L      db)
     2.05646405E-04    2    -1000001         1   # BR(~chi_30 -> ~d_L*     d )
     1.86574177E-05    2     2000001        -1   # BR(~chi_30 -> ~d_R      db)
     1.86574177E-05    2    -2000001         1   # BR(~chi_30 -> ~d_R*     d )
     1.00956088E-04    2     1000004        -4   # BR(~chi_30 -> ~c_L      cb)
     1.00956088E-04    2    -1000004         4   # BR(~chi_30 -> ~c_L*     c )
     7.68886978E-05    2     2000004        -4   # BR(~chi_30 -> ~c_R      cb)
     7.68886978E-05    2    -2000004         4   # BR(~chi_30 -> ~c_R*     c )
     2.05646405E-04    2     1000003        -3   # BR(~chi_30 -> ~s _L      sb)
     2.05646405E-04    2    -1000003         3   # BR(~chi_30 -> ~s _L*     s )
     1.86574177E-05    2     2000003        -3   # BR(~chi_30 -> ~s _R      sb)
     1.86574177E-05    2    -2000003         3   # BR(~chi_30 -> ~s _R*     s )
     1.50639436E-01    2     1000006        -6   # BR(~chi_30 -> ~t_1      tb)
     1.50639436E-01    2    -1000006         6   # BR(~chi_30 -> ~t_1*     t )
     3.21617142E-02    2     1000005        -5   # BR(~chi_30 -> ~b_1      bb)
     3.21617142E-02    2    -1000005         5   # BR(~chi_30 -> ~b_1*     b )
     1.24176221E-05    2     1000011       -11   # BR(~chi_30 -> ~e_L-     e+)
     1.24176221E-05    2    -1000011        11   # BR(~chi_30 -> ~e_L+     e-)
     6.21039612E-05    2     2000011       -11   # BR(~chi_30 -> ~e_R-     e+)
     6.21039612E-05    2    -2000011        11   # BR(~chi_30 -> ~e_R+     e-)
     1.24176221E-05    2     1000013       -13   # BR(~chi_30 -> ~mu_L-    mu+)
     1.24176221E-05    2    -1000013        13   # BR(~chi_30 -> ~mu_L+    mu-)
     6.21039612E-05    2     2000013       -13   # BR(~chi_30 -> ~mu_R-    mu+)
     6.21039612E-05    2    -2000013        13   # BR(~chi_30 -> ~mu_R+    mu-)
     1.91669452E-03    2     1000015       -15   # BR(~chi_30 -> ~tau_1-   tau+)
     1.91669452E-03    2    -1000015        15   # BR(~chi_30 -> ~tau_1+   tau-)
     1.30781169E-04    2     1000012       -12   # BR(~chi_30 -> ~nu_eL    nu_eb)
     1.30781169E-04    2    -1000012        12   # BR(~chi_30 -> ~nu_eL*   nu_e )
     1.30781169E-04    2     1000014       -14   # BR(~chi_30 -> ~nu_muL   nu_mub)
     1.30781169E-04    2    -1000014        14   # BR(~chi_30 -> ~nu_muL*  nu_mu )
     2.03650144E-05    2     1000016       -16   # BR(~chi_30 -> ~nu_tau1  nu_taub)
     2.03650144E-05    2    -1000016        16   # BR(~chi_30 -> ~nu_tau1* nu_tau )
#
#         PDG            Width
DECAY   1000035     1.77784744E+01   # neutralino4 decays
#          BR         NDA      ID1       ID2
     4.33977278E-02    2     1000022        23   # BR(~chi_40 -> ~chi_10   Z )
     3.68404048E-05    2     1000023        23   # BR(~chi_40 -> ~chi_20   Z )
     5.97416839E-03    2     1000024       -24   # BR(~chi_40 -> ~chi_1+   W-)
     5.97416839E-03    2    -1000024        24   # BR(~chi_40 -> ~chi_1-   W+)
     6.98733733E-02    2     1000022        25   # BR(~chi_40 -> ~chi_10   h )
     1.00440827E-01    2     1000022        35   # BR(~chi_40 -> ~chi_10   H )
     2.13594974E-02    2     1000022        36   # BR(~chi_40 -> ~chi_10   A )
     2.12357920E-02    2     1000023        25   # BR(~chi_40 -> ~chi_20   h )
     5.23113778E-02    2     1000002        -2   # BR(~chi_40 -> ~u_L      ub)
     5.23113778E-02    2    -1000002         2   # BR(~chi_40 -> ~u_L*     u )
     5.14852598E-05    2     2000002        -2   # BR(~chi_40 -> ~u_R      ub)
     5.14852598E-05    2    -2000002         2   # BR(~chi_40 -> ~u_R*     u )
     5.38849308E-02    2     1000001        -1   # BR(~chi_40 -> ~d_L      db)
     5.38849308E-02    2    -1000001         1   # BR(~chi_40 -> ~d_L*     d )
     1.24965527E-05    2     2000001        -1   # BR(~chi_40 -> ~d_R      db)
     1.24965527E-05    2    -2000001         1   # BR(~chi_40 -> ~d_R*     d )
     5.23113750E-02    2     1000004        -4   # BR(~chi_40 -> ~c_L      cb)
     5.23113750E-02    2    -1000004         4   # BR(~chi_40 -> ~c_L*     c )
     5.14852576E-05    2     2000004        -4   # BR(~chi_40 -> ~c_R      cb)
     5.14852576E-05    2    -2000004         4   # BR(~chi_40 -> ~c_R*     c )
     5.38849308E-02    2     1000003        -3   # BR(~chi_40 -> ~s _L      sb)
     5.38849308E-02    2    -1000003         3   # BR(~chi_40 -> ~s _L*     s )
     1.24965527E-05    2     2000003        -3   # BR(~chi_40 -> ~s _R      sb)
     1.24965527E-05    2    -2000003         3   # BR(~chi_40 -> ~s _R*     s )
     5.22950285E-02    2     1000006        -6   # BR(~chi_40 -> ~t_1      tb)
     5.22950285E-02    2    -1000006         6   # BR(~chi_40 -> ~t_1*     t )
     1.38708235E-02    2     1000005        -5   # BR(~chi_40 -> ~b_1      bb)
     1.38708235E-02    2    -1000005         5   # BR(~chi_40 -> ~b_1*     b )
     1.90415470E-02    2     1000011       -11   # BR(~chi_40 -> ~e_L-     e+)
     1.90415470E-02    2    -1000011        11   # BR(~chi_40 -> ~e_L+     e-)
     4.15686051E-05    2     2000011       -11   # BR(~chi_40 -> ~e_R-     e+)
     4.15686051E-05    2    -2000011        11   # BR(~chi_40 -> ~e_R+     e-)
     1.90415470E-02    2     1000013       -13   # BR(~chi_40 -> ~mu_L-    mu+)
     1.90415470E-02    2    -1000013        13   # BR(~chi_40 -> ~mu_L+    mu-)
     4.15686051E-05    2     2000013       -13   # BR(~chi_40 -> ~mu_R-    mu+)
     4.15686051E-05    2    -2000013        13   # BR(~chi_40 -> ~mu_R+    mu-)
     3.87973992E-03    2     1000015       -15   # BR(~chi_40 -> ~tau_1-   tau+)
     3.87973992E-03    2    -1000015        15   # BR(~chi_40 -> ~tau_1+   tau-)
     2.08896227E-02    2     1000012       -12   # BR(~chi_40 -> ~nu_eL    nu_eb)
     2.08896227E-02    2    -1000012        12   # BR(~chi_40 -> ~nu_eL*   nu_e )
     2.08896227E-02    2     1000014       -14   # BR(~chi_40 -> ~nu_muL   nu_mub)
     2.08896227E-02    2    -1000014        14   # BR(~chi_40 -> ~nu_muL*  nu_mu )
     3.34215597E-03    2     1000016       -16   # BR(~chi_40 -> ~nu_tau1  nu_taub)
     3.34215597E-03    2    -1000016        16   # BR(~chi_40 -> ~nu_tau1* nu_tau )
#
#         PDG            Width
DECAY        25     4.17672311E-03   # h decays
#          BR         NDA      ID1       ID2
     5.81433643E-01    2           5        -5   # BR(h -> b       bb     )
     6.50645895E-02    2         -15        15   # BR(h -> tau+    tau-   )
     2.30467115E-04    2         -13        13   # BR(h -> mu+     mu-    )
     2.53167598E-04    2           3        -3   # BR(h -> s       sb     )
     2.08757559E-02    2           4        -4   # BR(h -> c       cb     )
     7.78176320E-02    2          21        21   # BR(h -> g       g      )
     2.32676993E-03    2          22        22   # BR(h -> gam     gam    )
     1.62564410E-03    2          22        23   # BR(h -> Z       gam    )
     2.22165867E-01    2          24       -24   # BR(h -> W+      W-     )
     2.82064630E-02    2          23        23   # BR(h -> Z       Z      )
#
#         PDG            Width
DECAY        35     1.73392794E+00   # H decays
#          BR         NDA      ID1       ID2
     5.12832942E-01    2           5        -5   # BR(H -> b       bb     )
     7.54858004E-02    2         -15        15   # BR(H -> tau+    tau-   )
     2.76337213E-04    2         -13        13   # BR(H -> mu+     mu-    )
     2.91741534E-04    2           3        -3   # BR(H -> s       sb     )
     4.60658541E-06    2           4        -4   # BR(H -> c       cb     )
     4.03597104E-01    2           6        -6   # BR(H -> t       tb     )
     5.52413504E-04    2          21        21   # BR(H -> g       g      )
     1.77608860E-06    2          22        22   # BR(H -> gam     gam    )
     5.64170335E-07    2          23        22   # BR(H -> Z       gam    )
     1.19441125E-03    2          24       -24   # BR(H -> W+      W-     )
     5.89672089E-04    2          23        23   # BR(H -> Z       Z      )
     5.17263130E-03    2          25        25   # BR(H -> h       h      )
     1.44867683E-16    2          23        36   # BR(H -> Z       A      )
#
#         PDG            Width
DECAY        36     1.76746406E+00   # A decays
#          BR         NDA      ID1       ID2
     5.03551894E-01    2           5        -5   # BR(A -> b       bb     )
     7.40896530E-02    2         -15        15   # BR(A -> tau+    tau-   )
     2.71219649E-04    2         -13        13   # BR(A -> mu+     mu-    )
     2.86647723E-04    2           3        -3   # BR(A -> s       sb     )
     4.37670584E-06    2           4        -4   # BR(A -> c       cb     )
     4.19518900E-01    2           6        -6   # BR(A -> t       tb     )
     1.12387983E-03    2          21        21   # BR(A -> g       g      )
     2.60463141E-06    2          22        22   # BR(A -> gam     gam    )
     9.76705378E-07    2          23        22   # BR(A -> Z       gam    )
     1.14984776E-03    2          23        25   # BR(A -> Z       h      )
#
#         PDG            Width
DECAY        37     1.74218970E+00   # H+ decays
#          BR         NDA      ID1       ID2
     8.73029886E-04    2           4        -5   # BR(H+ -> c       bb     )
     7.54064319E-02    2         -15        16   # BR(H+ -> tau+    nu_tau )
     2.76039964E-04    2         -13        14   # BR(H+ -> mu+     nu_mu  )
     8.73014300E-06    2           2        -5   # BR(H+ -> u       bb     )
     1.45182539E-05    2           2        -3   # BR(H+ -> u       sb     )
     2.90018505E-04    2           4        -3   # BR(H+ -> c       sb     )
     9.21945759E-01    2           6        -5   # BR(H+ -> t       bb     )
     1.18547189E-03    2          24        25   # BR(H+ -> W+      h      )
     2.45926316E-10    2          24        36   # BR(H+ -> W+      A      )
