#
#                              ======================
#                              | THE SUSYHIT OUTPUT |
#                              ======================
#
#
#              ------------------------------------------------------
#              |     This is the output of the SUSY-HIT package     |
#              |  created by A.Djouadi, M.Muehlleitner and M.Spira. |
#              |  In case of problems with SUSY-HIT email to        |
#              |           margarete.muehlleitner@cern.ch           |
#              |           michael.spira@psi.ch                     |
#              |           abdelhak.djouadi@cern.ch                 |
#              ------------------------------------------------------
#
#              ------------------------------------------------------
#              |  SUSY Les Houches Accord - MSSM Spectrum + Decays  |
#              |              based on the decay programs           |
#              |                                                    |
#              |                     SDECAY 1.3b                    |
#              |                                                    |
#              |  Authors: M.Muhlleitner, A.Djouadi and Y.Mambrini  |
#              |  Ref.:    Comput.Phys.Commun.168(2005)46           |
#              |           [hep-ph/0311167]                         |
#              |                                                    |
#              |                     HDECAY 3.4                     |
#              |                                                    |
#              |  By: A.Djouadi,J.Kalinowski,M.Muhlleitner,M.Spira  |
#              |  Ref.:    Comput.Phys.Commun.108(1998)56           |
#              |           [hep-ph/9704448]                         |
#              |                                                    |
#              |                                                    |
#              |  If not stated otherwise all DRbar couplings and   |
#              |  soft SUSY breaking masses are given at the scale  |
#              |  Q=  0.22362680E+04
#              |                                                    |
#              ------------------------------------------------------
#
#
BLOCK DCINFO  # Decay Program information
     1   SDECAY/HDECAY # decay calculator
     2   1.3b  /3.4    # version number
#
BLOCK SPINFO  # Spectrum calculator information
     1     SOFTSUSY    # spectrum calculator               
     2     3.4.0       # version number                    
#
BLOCK MODSEL  # Model selection
     1     0   #  nonUniversal                                     
#
BLOCK SMINPUTS  # Standard Model inputs
         1     1.27908970E+02   # alpha_em^-1(M_Z)^MSbar
         2     1.16637870E-05   # G_F [GeV^-2]
         3     1.18400000E-01   # alpha_S(M_Z)^MSbar
         4     9.11876000E+01   # M_Z pole mass
         5     4.18000000E+00   # mb(mb)^MSbar
         6     1.73200000E+02   # mt pole mass
         7     1.77700000E+00   # mtau pole mass
#
BLOCK MINPAR  # Input parameters - minimal models
         3     1.52900000E+01   # tanb                
#
BLOCK EXTPAR  # Input parameters - non-minimal models
         0    -1.00000000E+00   # Set                 
         1    -3.69742000E+03   # M_1(MX)             
         2     2.18510000E+02   # M_2(MX)             
         3     3.22965000E+03   # M_3(MX)             
        11    -3.49808000E+03   # At(MX)              
        12    -3.24690000E+03   # Ab(MX)              
        13    -3.58173000E+03   # Atau(MX)            
        23     2.34159000E+03   # mu(MX)              
        26     6.05240000E+02   # mA(pole)            
        31     3.24500000E+03   # meL(MX)             
        32     3.24500000E+03   # mmuL(MX)            
        33     3.80696000E+03   # mtauL(MX)           
        34     1.03740000E+03   # meR(MX)             
        35     1.03740000E+03   # mmuR(MX)            
        36     3.95313000E+03   # mtauR(MX)           
        41     3.61914000E+03   # mqL1(MX)            
        42     3.61914000E+03   # mqL2(MX)            
        43     3.57689000E+03   # mqL3(MX)            
        44     9.88270000E+02   # muR(MX)             
        45     9.88270000E+02   # mcR(MX)             
        46     1.39796000E+03   # mtR(MX)             
        47     8.82880000E+02   # mdR(MX)             
        48     8.82880000E+02   # msR(MX)             
        49     3.41098000E+03   # mbR(MX)             
#
BLOCK MASS  # Mass Spectrum
# PDG code           mass       particle
        24     8.03770086E+01   # W+
        25     1.25819219E+02   # h
        35     6.05198778E+02   # H
        36     6.05240000E+02   # A
        37     6.10518559E+02   # H+
         5     4.81876030E+00   # b-quark pole mass calculated from mb(mb)_Msbar
   1000001     3.68647146E+03   # ~d_L
   2000001     9.74601636E+02   # ~d_R
   1000002     3.68576065E+03   # ~u_L
   2000002     1.07229639E+03   # ~u_R
   1000003     3.68647146E+03   # ~s_L
   2000003     9.74601636E+02   # ~s_R
   1000004     3.68576065E+03   # ~c_L
   2000004     1.07229639E+03   # ~c_R
   1000005     3.47614699E+03   # ~b_1
   2000005     3.62197570E+03   # ~b_2
   1000006     1.49682388E+03   # ~t_1
   2000006     3.62699300E+03   # ~t_2
   1000011     3.25164419E+03   # ~e_L
   2000011     1.04789379E+03   # ~e_R
   1000012     3.25034372E+03   # ~nu_eL
   1000013     3.25164419E+03   # ~mu_L
   2000013     1.04789379E+03   # ~mu_R
   1000014     3.25034372E+03   # ~nu_muL
   1000015     3.81375782E+03   # ~tau_1
   2000015     3.96000481E+03   # ~tau_2
   1000016     3.81314599E+03   # ~nu_tauL
   1000021     3.32395522E+03   # ~g
   1000022     2.37651885E+02   # ~chi_10
   1000023    -2.36795121E+03   # ~chi_20
   1000025     2.36916704E+03   # ~chi_30
   1000035    -3.66115422E+03   # ~chi_40
   1000024     2.37813161E+02   # ~chi_1+
   1000037     2.37059620E+03   # ~chi_2+
#
BLOCK NMIX  # Neutralino Mixing Matrix
  1  1     9.61022093E-05   # N_11
  1  2     9.99433402E-01   # N_12
  1  3    -3.31859786E-02   # N_13
  1  4     5.61753455E-03   # N_14
  2  1     2.25067421E-02   # N_21
  2  2     1.94910701E-02   # N_22
  2  3     7.06715932E-01   # N_23
  2  4     7.06870664E-01   # N_24
  3  1    -5.60796699E-03   # N_31
  3  2     2.74377142E-02   # N_32
  3  3     7.06617748E-01   # N_33
  3  4    -7.07041074E-01   # N_34
  4  1     9.99730958E-01   # N_41
  4  2    -3.80960944E-04   # N_42
  4  3    -1.19432082E-02   # N_43
  4  4    -1.98803072E-02   # N_44
#
BLOCK UMIX  # Chargino Mixing Matrix U
  1  1     9.98898974E-01   # U_11
  1  2    -4.69131091E-02   # U_12
  2  1     4.69131091E-02   # U_21
  2  2     9.98898974E-01   # U_22
#
BLOCK VMIX  # Chargino Mixing Matrix V
  1  1     9.99968444E-01   # V_11
  1  2    -7.94429667E-03   # V_12
  2  1     7.94429667E-03   # V_21
  2  2     9.99968444E-01   # V_22
#
BLOCK STOPMIX  # Stop Mixing Matrix
  1  1     4.84323273E-02   # cos(theta_t)
  1  2     9.98826466E-01   # sin(theta_t)
  2  1    -9.98826466E-01   # -sin(theta_t)
  2  2     4.84323273E-02   # cos(theta_t)
#
BLOCK SBOTMIX  # Sbottom Mixing Matrix
  1  1     8.15356838E-02   # cos(theta_b)
  1  2     9.96670423E-01   # sin(theta_b)
  2  1    -9.96670423E-01   # -sin(theta_b)
  2  2     8.15356838E-02   # cos(theta_b)
#
BLOCK STAUMIX  # Stau Mixing Matrix
  1  1     9.98208293E-01   # cos(theta_tau)
  1  2     5.98348041E-02   # sin(theta_tau)
  2  1    -5.98348041E-02   # -sin(theta_tau)
  2  2     9.98208293E-01   # cos(theta_tau)
#
BLOCK ALPHA  # Higgs mixing
          -7.14603007E-02   # Mixing angle in the neutral Higgs boson sector
#
BLOCK HMIX Q=  2.23626800E+03  # DRbar Higgs Parameters
         1     2.37047923E+03   # mu(Q)MSSM           
         2     1.46657837E+01   # tan                 
         3     2.43297587E+02   # higgs               
         4     1.02552502E+06   # mA^2(Q)MSSM         
#
BLOCK GAUGE Q=  2.23626800E+03  # The gauge couplings
     1     3.63977297E-01   # gprime(Q) DRbar
     2     6.39236538E-01   # g(Q) DRbar
     3     1.01591005E+00   # g3(Q) DRbar
#
BLOCK AU Q=  2.23626800E+03  # The trilinear couplings
  1  1     0.00000000E+00   # A_u(Q) DRbar
  2  2     0.00000000E+00   # A_c(Q) DRbar
  3  3    -3.49807999E+03   # A_t(Q) DRbar
#
BLOCK AD Q=  2.23626800E+03  # The trilinear couplings
  1  1     0.00000000E+00   # A_d(Q) DRbar
  2  2     0.00000000E+00   # A_s(Q) DRbar
  3  3    -3.24690000E+03   # A_b(Q) DRbar
#
BLOCK AE Q=  2.23626800E+03  # The trilinear couplings
  1  1     0.00000000E+00   # A_e(Q) DRbar
  2  2     0.00000000E+00   # A_mu(Q) DRbar
  3  3    -3.58173000E+03   # A_tau(Q) DRbar
#
BLOCK Yu Q=  2.23626800E+03  # The Yukawa couplings
  1  1     0.00000000E+00   # y_u(Q) DRbar
  2  2     0.00000000E+00   # y_c(Q) DRbar
  3  3     8.21287029E-01   # y_t(Q) DRbar
#
BLOCK Yd Q=  2.23626800E+03  # The Yukawa couplings
  1  1     0.00000000E+00   # y_d(Q) DRbar
  2  2     0.00000000E+00   # y_s(Q) DRbar
  3  3     1.88085218E-01   # y_b(Q) DRbar
#
BLOCK Ye Q=  2.23626800E+03  # The Yukawa couplings
  1  1     0.00000000E+00   # y_e(Q) DRbar
  2  2     0.00000000E+00   # y_mu(Q) DRbar
  3  3     1.50831596E-01   # y_tau(Q) DRbar
#
BLOCK MSOFT Q=  2.23626800E+03  # The soft SUSY breaking masses at the scale Q
         1    -3.69742000E+03   # M_1(Q)              
         2     2.18510000E+02   # M_2(Q)              
         3     3.22965000E+03   # M_3(Q)              
        21    -5.31039332E+06   # mH1^2(Q)            
        22    -5.65360353E+06   # mH2^2(Q)            
        31     3.24500000E+03   # meL(Q)              
        32     3.24500000E+03   # mmuL(Q)             
        33     3.80696000E+03   # mtauL(Q)            
        34     1.03740000E+03   # meR(Q)              
        35     1.03740000E+03   # mmuR(Q)             
        36     3.95313000E+03   # mtauR(Q)            
        41     3.61913999E+03   # mqL1(Q)             
        42     3.61913999E+03   # mqL2(Q)             
        43     3.57688999E+03   # mqL3(Q)             
        44     9.88269981E+02   # muR(Q)              
        45     9.88269981E+02   # mcR(Q)              
        46     1.39795996E+03   # mtR(Q)              
        47     8.82879979E+02   # mdR(Q)              
        48     8.82879979E+02   # msR(Q)              
        49     3.41097999E+03   # mbR(Q)              
#
Block HiggsBoundsInputHiggsCouplingsFermions
# ScalarNormEffCoupSq PseudoSNormEffCoupSq NP   IP1 IP2 IP2
    1.10157823E+00    0.00000000E+00        3  25   5   5  # h0-b-b eff. coupling^2, normalised to SM
    2.14983633E+02    0.00000000E+00        3  35   5   5  # H0-b-b eff. coupling^2, normalised to SM
    0.00000000E+00    2.15085212E+02        3  36   5   5  # A0-b-b eff. coupling^2, normalised to SM
#
    9.99527730E-01    0.00000000E+00        3  25   6   6  # h0-t-t eff. coupling^2, normalised to SM
    5.12158984E-03    0.00000000E+00        3  35   6   6  # H0-t-t eff. coupling^2, normalised to SM
    0.00000000E+00    4.64932011E-03        3  36   6   6  # A0-t-t eff. coupling^2, normalised to SM
#
    1.10157823E+00    0.00000000E+00        3  25  15  15  # h0-tau-tau eff. coupling^2, normalised to SM
    2.14983633E+02    0.00000000E+00        3  35  15  15  # H0-tau-tau eff. coupling^2, normalised to SM
    0.00000000E+00    2.15085212E+02        3  36  15  15  # A0-tau-tau eff. coupling^2, normalised to SM
#
Block HiggsBoundsInputHiggsCouplingsBosons
    9.99988577E-01        3  25  24  24  # h0-W-W eff. coupling^2, normalised to SM
    1.14227104E-05        3  35  24  24  # H0-W-W eff. coupling^2, normalised to SM
    0.00000000E+00        3  36  24  24  # A0-W-W eff. coupling^2, normalised to SM
#
    9.99988577E-01        3  25  23  23  # h0-Z-Z eff. coupling^2, normalised to SM
    1.14227104E-05        3  35  23  23  # H0-Z-Z eff. coupling^2, normalised to SM
    0.00000000E+00        3  36  23  23  # A0-Z-Z eff. coupling^2, normalised to SM
#
    8.79407559E-01        3  25  21  21  # h0-g-g eff. coupling^2, normalised to SM
    1.80336742E-04        3  35  21  21  # H0-g-g eff. coupling^2, normalised to SM
    4.67443034E-04        3  36  21  21  # A0-g-g eff. coupling^2, normalised to SM
#
    0.00000000E+00        3  25  25  23  # h0-h0-Z eff. coupling^2, normalised to SM
    0.00000000E+00        3  35  25  23  # H0-h0-Z eff. coupling^2, normalised to SM
    1.14227104E-05        3  36  25  23  # A0-h0-Z eff. coupling^2, normalised to SM
    0.00000000E+00        3  35  35  23  # H0-H0-Z eff. coupling^2, normalised to SM
    9.99988577E-01        3  36  35  23  # A0-H0-Z eff. coupling^2, normalised to SM
    0.00000000E+00        3  36  36  23  # A0-A0-Z eff. coupling^2, normalised to SM
#
    0.00000000E+00        4  25  21  21  23  # h0-g-g-Z eff. coupling^2, normalised to SM
    0.00000000E+00        4  35  21  21  23  # H0-g-g-Z eff. coupling^2, normalised to SM
    0.00000000E+00        4  36  21  21  23  # A0-g-g-Z eff. coupling^2, normalised to SM
#
#
#
#                             =================
#                             |The decay table|
#                             =================
#
# - The QCD corrections to the decays gluino -> squark  + quark
#                                     squark -> gaugino + quark_prime
#                                     squark -> squark_prime + Higgs
#                                     squark -> gluino  + quark
#   are included.
#
# - The multi-body decays for the inos, stops and sbottoms are included.
#
# - The loop induced decays for the gluino, neutralinos and stops
#   are included.
#
# - The SUSY decays of the top quark are included.
#
#
#         PDG            Width
DECAY         6     1.43968721E+00   # top decays
#          BR         NDA      ID1       ID2
     1.00000000E+00    2           5        24   # BR(t ->  b    W+)
#
#         PDG            Width
DECAY   1000021     2.47923449E+02   # gluino decays
#          BR         NDA      ID1       ID2
     1.07101954E-01    2     2000001        -1   # BR(~g -> ~d_R  db)
     1.07101954E-01    2    -2000001         1   # BR(~g -> ~d_R* d )
     1.02902406E-01    2     2000002        -2   # BR(~g -> ~u_R  ub)
     1.02902406E-01    2    -2000002         2   # BR(~g -> ~u_R* u )
     1.07101954E-01    2     2000003        -3   # BR(~g -> ~s_R  sb)
     1.07101954E-01    2    -2000003         3   # BR(~g -> ~s_R* s )
     1.02902400E-01    2     2000004        -4   # BR(~g -> ~c_R  cb)
     1.02902400E-01    2    -2000004         4   # BR(~g -> ~c_R* c )
     7.99912860E-02    2     1000006        -6   # BR(~g -> ~t_1  tb)
     7.99912860E-02    2    -1000006         6   # BR(~g -> ~t_1* t )
#
#         PDG            Width
DECAY   1000006     5.90275866E-02   # stop1 decays
#          BR         NDA      ID1       ID2
     3.26754405E-01    2     1000022         6   # BR(~t_1 -> ~chi_10 t )
     6.73245595E-01    2     1000024         5   # BR(~t_1 -> ~chi_1+ b )
#
#         PDG            Width
DECAY   2000006     1.18310899E+02   # stop2 decays
#          BR         NDA      ID1       ID2
     1.22425226E-01    2     1000022         6   # BR(~t_2 -> ~chi_10 t )
     6.62841031E-02    2     1000023         6   # BR(~t_2 -> ~chi_20 t )
     6.78445091E-02    2     1000025         6   # BR(~t_2 -> ~chi_30 t )
     2.46283284E-01    2     1000024         5   # BR(~t_2 -> ~chi_1+ b )
     7.45963331E-03    2     1000037         5   # BR(~t_2 -> ~chi_2+ b )
     3.29328168E-02    2     1000021         6   # BR(~t_2 -> ~g      t )
     1.71738011E-01    2     1000006        25   # BR(~t_2 -> ~t_1    h )
     5.47081355E-02    2     1000006        35   # BR(~t_2 -> ~t_1    H )
     5.58787807E-02    2     1000006        36   # BR(~t_2 -> ~t_1    A )
     1.73894589E-01    2     1000006        23   # BR(~t_2 -> ~t_1    Z )
     5.50911378E-04    2     1000005        24   # BR(~t_2 -> ~b_1    W+)
#
#         PDG            Width
DECAY   1000005     3.47561006E+00   # sbottom1 decays
#          BR         NDA      ID1       ID2
     3.65438075E-02    2     1000022         5   # BR(~b_1 -> ~chi_10 b )
     1.00779024E-01    2     1000023         5   # BR(~b_1 -> ~chi_20 b )
     9.90324960E-02    2     1000025         5   # BR(~b_1 -> ~chi_30 b )
     7.26360239E-02    2    -1000024         6   # BR(~b_1 -> ~chi_1- t )
     1.98496005E-01    2    -1000037         6   # BR(~b_1 -> ~chi_2- t )
     4.03505036E-01    2     1000021         5   # BR(~b_1 -> ~g      b )
     2.50999626E-02    2     1000006       -37   # BR(~b_1 -> ~t_1    H-)
     6.39076450E-02    2     1000006       -24   # BR(~b_1 -> ~t_1    W-)
#
#         PDG            Width
DECAY   2000005     1.17517369E+02   # sbottom2 decays
#          BR         NDA      ID1       ID2
     1.22973466E-01    2     1000022         5   # BR(~b_2 -> ~chi_10 b )
     3.57145646E-03    2     1000023         5   # BR(~b_2 -> ~chi_20 b )
     3.64226152E-03    2     1000025         5   # BR(~b_2 -> ~chi_30 b )
     2.44507127E-01    2    -1000024         6   # BR(~b_2 -> ~chi_1- t )
     1.34365803E-01    2    -1000037         6   # BR(~b_2 -> ~chi_2- t )
     4.19052457E-02    2     1000021         5   # BR(~b_2 -> ~g      b )
     2.14129279E-04    2     1000005        25   # BR(~b_2 -> ~b_1    h )
     1.11505509E-01    2     1000006       -37   # BR(~b_2 -> ~t_1    H-)
     2.01700933E-04    2     1000005        23   # BR(~b_2 -> ~b_1    Z )
     3.37113302E-01    2     1000006       -24   # BR(~b_2 -> ~t_1    W-)
#
#         PDG            Width
DECAY   1000002     5.19653050E+01   # sup_L decays
#          BR         NDA      ID1       ID2
     2.71679403E-01    2     1000022         2   # BR(~u_L -> ~chi_10 u)
     5.42416326E-05    2     1000023         2   # BR(~u_L -> ~chi_20 u)
     6.67188997E-05    2     1000025         2   # BR(~u_L -> ~chi_30 u)
     2.07097151E-06    2     1000035         2   # BR(~u_L -> ~chi_40 u)
     5.43915255E-01    2     1000024         1   # BR(~u_L -> ~chi_1+ d)
     1.20873640E-05    2     1000037         1   # BR(~u_L -> ~chi_2+ d)
     1.84270223E-01    2     1000021         2   # BR(~u_L -> ~g      u)
#
#         PDG            Width
DECAY   2000002     4.06491824E-07   # sup_R decays
#           BR         NDA      ID1       ID2
     5.34833257E-02    2     1000022         2   # BR(~u_R -> ~chi_10 u)
#           BR         NDA      ID1       ID2       ID3
     3.99270023E-02    3        2       -1        2000001   # BR(~u_R -> u  db  ~d_R)
     4.24141372E-01    3        2       1        -2000001   # BR(~u_R -> u  d  ~d_R*)
     4.01582493E-02    3        2       -3        2000003   # BR(~u_R -> u  sb  ~s_R)
     4.22640727E-01    3        2       3        -2000003   # BR(~u_R -> u  s  ~s_R*)
     2.61997890E-07    3        2       -11        2000011   # BR(~u_R -> u  e+  ~e_R-)
     3.10535151E-06    3        2       11        -2000011   # BR(~u_R -> u  e-  ~e_R+)
     2.60595647E-07    3        2       -13        2000013   # BR(~u_R -> u  mu+  ~mu_R-)
     3.09575722E-06    3        2       13        -2000013   # BR(~u_R -> u  mu-  ~mu_R+)
     8.46831301E-04    3        2       23        1000022   # BR(~u_R -> u  Z  ~chi_10)
     3.22122100E-03    3        2       25        1000022   # BR(~u_R -> u  h  ~chi_10)
     7.29584170E-04    3        2       35        1000022   # BR(~u_R -> u  H  ~chi_10)
     1.61203734E-03    3        2       36        1000022   # BR(~u_R -> u  A  ~chi_10)
     6.95167734E-03    3        2       -24        1000024   # BR(~u_R -> u  W-  ~chi_1+)
     1.97467686E-03    3        2       24        -1000024   # BR(~u_R -> u  W+  ~chi_1-)
     4.06281235E-03    3        2       -37        1000024   # BR(~u_R -> u  H-  ~chi_1+)
     2.43758900E-04    3        2       37        -1000024   # BR(~u_R -> u  H+  ~chi_1-)
#
#         PDG            Width
DECAY   1000001     5.19662768E+01   # sdown_L decays
#          BR         NDA      ID1       ID2
     2.71706837E-01    2     1000022         1   # BR(~d_L -> ~chi_10 d)
     2.22656935E-05    2     1000023         1   # BR(~d_L -> ~chi_20 d)
     7.79794384E-05    2     1000025         1   # BR(~d_L -> ~chi_30 d)
     2.20634603E-06    2     1000035         1   # BR(~d_L -> ~chi_40 d)
     5.42846874E-01    2    -1000024         2   # BR(~d_L -> ~chi_1- u)
     4.21810449E-04    2    -1000037         2   # BR(~d_L -> ~chi_2- u)
     1.84922027E-01    2     1000021         1   # BR(~d_L -> ~g      d)
#
#         PDG            Width
DECAY   2000001     5.77657133E-09   # sdown_R decays
#           BR         NDA      ID1       ID2
     8.40532342E-01    2     1000022         1   # BR(~d_R -> ~chi_10 d)
#           BR         NDA      ID1       ID2       ID3
     7.77018017E-03    3        1       23        1000022   # BR(~d_R -> d  Z  ~chi_10)
     3.65459003E-02    3        1       25        1000022   # BR(~d_R -> d  h  ~chi_10)
     1.88347021E-03    3        1       35        1000022   # BR(~d_R -> d  H  ~chi_10)
     4.30566829E-03    3        1       36        1000022   # BR(~d_R -> d  A  ~chi_10)
     7.37357813E-02    3        1       -24        1000024   # BR(~d_R -> d  W-  ~chi_1+)
     2.44574146E-02    3        1       24        -1000024   # BR(~d_R -> d  W+  ~chi_1-)
     1.02036306E-02    3        1       -37        1000024   # BR(~d_R -> d  H-  ~chi_1+)
     5.65612335E-04    3        1       37        -1000024   # BR(~d_R -> d  H+  ~chi_1-)
#
#         PDG            Width
DECAY   1000004     5.15933583E+01   # scharm_L decays
#          BR         NDA      ID1       ID2
     2.87648038E-01    2     1000022         4   # BR(~c_L -> ~chi_10 c)
     5.65446766E-05    2     1000023         4   # BR(~c_L -> ~chi_20 c)
     6.95503210E-05    2     1000025         4   # BR(~c_L -> ~chi_30 c)
     1.84006299E-06    2     1000035         4   # BR(~c_L -> ~chi_40 c)
     5.75884860E-01    2     1000024         3   # BR(~c_L -> ~chi_1+ s)
     1.26000438E-05    2     1000037         3   # BR(~c_L -> ~chi_2+ s)
     1.36326567E-01    2     1000021         4   # BR(~c_L -> ~g      c)
#
#         PDG            Width
DECAY   2000004     4.04830652E-07   # scharm_R decays
#           BR         NDA      ID1       ID2
     5.18185538E-02    2     1000022         4   # BR(~c_R -> ~chi_10 c)
#           BR         NDA      ID1       ID2       ID3
     4.01180096E-02    3        4       -1        2000001   # BR(~c_R -> c  db  ~d_R)
     4.23782140E-01    3        4       1        -2000001   # BR(~c_R -> c  d  ~d_R*)
     4.04588929E-02    3        4       -3        2000003   # BR(~c_R -> c  sb  ~s_R)
     4.24127964E-01    3        4       3        -2000003   # BR(~c_R -> c  s  ~s_R*)
     2.58206733E-07    3        4       -11        2000011   # BR(~c_R -> c  e+  ~e_R-)
     3.05955094E-06    3        4       11        -2000011   # BR(~c_R -> c  e-  ~e_R+)
     2.59713536E-07    3        4       -13        2000013   # BR(~c_R -> c  mu+  ~mu_R-)
     3.05757480E-06    3        4       13        -2000013   # BR(~c_R -> c  mu-  ~mu_R+)
     8.52455214E-04    3        4       23        1000022   # BR(~c_R -> c  Z  ~chi_10)
     3.23765010E-03    3        4       25        1000022   # BR(~c_R -> c  h  ~chi_10)
     7.29811339E-04    3        4       35        1000022   # BR(~c_R -> c  H  ~chi_10)
     1.60847504E-03    3        4       36        1000022   # BR(~c_R -> c  A  ~chi_10)
     6.94858452E-03    3        4       -24        1000024   # BR(~c_R -> c  W-  ~chi_1+)
     2.00212112E-03    3        4       24        -1000024   # BR(~c_R -> c  W+  ~chi_1-)
     4.06367451E-03    3        4       -37        1000024   # BR(~c_R -> c  H-  ~chi_1+)
     2.45033323E-04    3        4       37        -1000024   # BR(~c_R -> c  H+  ~chi_1-)
#
#         PDG            Width
DECAY   1000003     5.15834951E+01   # sstrange_L decays
#          BR         NDA      ID1       ID2
     2.87738553E-01    2     1000022         3   # BR(~s_L -> ~chi_10 s)
     2.32161660E-05    2     1000023         3   # BR(~s_L -> ~chi_20 s)
     8.13065766E-05    2     1000025         3   # BR(~s_L -> ~chi_30 s)
     1.96742429E-06    2     1000035         3   # BR(~s_L -> ~chi_40 s)
     5.74876178E-01    2    -1000024         4   # BR(~s_L -> ~chi_1- c)
     4.39797061E-04    2    -1000037         4   # BR(~s_L -> ~chi_2- c)
     1.36838982E-01    2     1000021         3   # BR(~s_L -> ~g      s)
#
#         PDG            Width
DECAY   2000003     5.58362623E-09   # sstrange_R decays
#           BR         NDA      ID1       ID2
     8.35214221E-01    2     1000022         3   # BR(~s_R -> ~chi_10 s)
#           BR         NDA      ID1       ID2       ID3
     8.04244377E-03    3        3       23        1000022   # BR(~s_R -> s  Z  ~chi_10)
     3.78302543E-02    3        3       25        1000022   # BR(~s_R -> s  h  ~chi_10)
     1.95536011E-03    3        3       35        1000022   # BR(~s_R -> s  H  ~chi_10)
     4.44943823E-03    3        3       36        1000022   # BR(~s_R -> s  A  ~chi_10)
     7.61261557E-02    3        3       -24        1000024   # BR(~s_R -> s  W-  ~chi_1+)
     2.53025532E-02    3        3       24        -1000024   # BR(~s_R -> s  W+  ~chi_1-)
     1.04917481E-02    3        3       -37        1000024   # BR(~s_R -> s  H-  ~chi_1+)
     5.87825880E-04    3        3       37        -1000024   # BR(~s_R -> s  H+  ~chi_1-)
#
#         PDG            Width
DECAY   1000011     3.91741375E+01   # selectron_L decays
#          BR         NDA      ID1       ID2
     3.33449471E-01    2     1000022        11   # BR(~e_L -> ~chi_10 e-)
     7.76785917E-05    2     1000023        11   # BR(~e_L -> ~chi_20 e-)
     4.36464420E-05    2     1000025        11   # BR(~e_L -> ~chi_30 e-)
     6.66103254E-01    2    -1000024        12   # BR(~e_L -> ~chi_1- nu_e)
     3.25950173E-04    2    -1000037        12   # BR(~e_L -> ~chi_2- nu_e)
#
#         PDG            Width
DECAY   2000011     6.11658421E-08   # selectron_R decays
#           BR         NDA      ID1       ID2
     7.50445470E-01    2     1000022        11   # BR(~e_R -> ~chi_10 e-)
#           BR         NDA      ID1       ID2       ID3
     2.93317306E-04    3        11       -1        2000001   # BR(~e_R- -> e-  db  ~d_R)
     3.74277525E-03    3        11       1        -2000001   # BR(~e_R- -> e-  d  ~d_R*)
     2.91208285E-04    3        11       -3        2000003   # BR(~e_R- -> e-  sb  ~s_R)
     3.83907083E-03    3        11       3        -2000003   # BR(~e_R- -> e-  s  ~s_R*)
     1.18683889E-02    3        11       23        1000022   # BR(~e_R- -> e-  Z  ~chi_10)
     4.31172025E-02    3        11       25        1000022   # BR(~e_R- -> e-  h  ~chi_10)
     7.36473143E-03    3        11       35        1000022   # BR(~e_R- -> e-  H  ~chi_10)
     1.65419124E-02    3        11       36        1000022   # BR(~e_R- -> e-  A  ~chi_10)
     9.16115892E-02    3        11       -24        1000024   # BR(~e_R- -> e-  W-  ~chi_1+)
     2.73191694E-02    3        11       24        -1000024   # BR(~e_R- -> e-  W+  ~chi_1-)
     4.11422440E-02    3        11       -37        1000024   # BR(~e_R- -> e-  H-  ~chi_1+)
     2.42292095E-03    3        11       37        -1000024   # BR(~e_R- -> e-  H+  ~chi_1-)
#
#         PDG            Width
DECAY   1000013     3.91741375E+01   # smuon_L decays
#          BR         NDA      ID1       ID2
     3.33449471E-01    2     1000022        13   # BR(~mu_L -> ~chi_10 mu-)
     7.76785910E-05    2     1000023        13   # BR(~mu_L -> ~chi_20 mu-)
     4.36464416E-05    2     1000025        13   # BR(~mu_L -> ~chi_30 mu-)
     6.66103254E-01    2    -1000024        14   # BR(~mu_L -> ~chi_1- nu_mu)
     3.25950173E-04    2    -1000037        14   # BR(~mu_L -> ~chi_2- nu_mu)
#
#         PDG            Width
DECAY   2000013     6.11617711E-08   # smuon_R decays
#           BR         NDA      ID1       ID2
     7.50495404E-01    2     1000022        13   # BR(~mu_R -> ~chi_10 mu-)
#           BR         NDA      ID1       ID2       ID3
     2.90181263E-04    3        13       -1        2000001   # BR(~mu_R- -> mu-  db  ~d_R)
     3.79043961E-03    3        13       1        -2000001   # BR(~mu_R- -> mu-  d  ~d_R*)
     2.86535195E-04    3        13       -3        2000003   # BR(~mu_R- -> mu-  sb  ~s_R)
     3.81120422E-03    3        13       3        -2000003   # BR(~mu_R- -> mu-  s  ~s_R*)
     1.18696694E-02    3        13       23        1000022   # BR(~mu_R- -> mu-  Z  ~chi_10)
     4.30710222E-02    3        13       25        1000022   # BR(~mu_R- -> mu-  h  ~chi_10)
     7.33546449E-03    3        13       35        1000022   # BR(~mu_R- -> mu-  H  ~chi_10)
     1.65413784E-02    3        13       36        1000022   # BR(~mu_R- -> mu-  A  ~chi_10)
     9.16176870E-02    3        13       -24        1000024   # BR(~mu_R- -> mu-  W-  ~chi_1+)
     2.73209878E-02    3        13       24        -1000024   # BR(~mu_R- -> mu-  W+  ~chi_1-)
     4.11498875E-02    3        13       -37        1000024   # BR(~mu_R- -> mu-  H-  ~chi_1+)
     2.42013920E-03    3        13       37        -1000024   # BR(~mu_R- -> mu-  H+  ~chi_1-)
#
#         PDG            Width
DECAY   1000015     4.66559711E+01   # stau_1 decays
#          BR         NDA      ID1       ID2
     3.28637075E-01    2     1000022        15   # BR(~tau_1 -> ~chi_10  tau-)
     7.08325692E-03    2     1000023        15   # BR(~tau_1 -> ~chi_20  tau-)
     6.93203832E-03    2     1000025        15   # BR(~tau_1 -> ~chi_30  tau-)
     6.66163519E-04    2     1000035        15   # BR(~tau_1 -> ~chi_40  tau-)
     6.56413489E-01    2    -1000024        16   # BR(~tau_1 -> ~chi_1-  nu_tau)
     2.67976851E-04    2    -1000037        16   # BR(~tau_1 -> ~chi_2-  nu_tau)
#
#         PDG            Width
DECAY   2000015     2.11328082E+00   # stau_2 decays
#          BR         NDA      ID1       ID2
     1.79757606E-02    2     1000022        15   # BR(~tau_2 -> ~chi_10  tau-)
     1.77499301E-01    2     1000023        15   # BR(~tau_2 -> ~chi_20  tau-)
     1.77444798E-01    2     1000025        15   # BR(~tau_2 -> ~chi_30  tau-)
     2.07793502E-01    2     1000035        15   # BR(~tau_2 -> ~chi_40  tau-)
     3.58968508E-02    2    -1000024        16   # BR(~tau_2 -> ~chi_1-  nu_tau)
     3.55482874E-01    2    -1000037        16   # BR(~tau_2 -> ~chi_2-  nu_tau)
     1.49662897E-02    2     1000016       -24   # BR(~tau_2 -> ~nu_tauL W-)
     6.76399670E-03    2     1000015        25   # BR(~tau_2 -> ~tau_1   h)
     6.17662713E-03    2     1000015        23   # BR(~tau_2 -> ~tau_1   Z)
#
#         PDG            Width
DECAY   1000012     3.91968598E+01   # snu_eL decays
#          BR         NDA      ID1       ID2
     3.33047078E-01    2     1000022        12   # BR(~nu_eL -> ~chi_10 nu_e)
     3.30775111E-06    2     1000023        12   # BR(~nu_eL -> ~chi_20 nu_e)
     6.94745029E-05    2     1000025        12   # BR(~nu_eL -> ~chi_30 nu_e)
     6.66870818E-01    2     1000024        11   # BR(~nu_eL -> ~chi_1+ e-)
     9.32092642E-06    2     1000037        11   # BR(~nu_eL -> ~chi_2+ e-)
#
#         PDG            Width
DECAY   1000014     3.91968597E+01   # snu_muL decays
#          BR         NDA      ID1       ID2
     3.33047079E-01    2     1000022        14   # BR(~nu_muL -> ~chi_10 nu_mu)
     3.30775112E-06    2     1000023        14   # BR(~nu_muL -> ~chi_20 nu_mu)
     6.94745030E-05    2     1000025        14   # BR(~nu_muL -> ~chi_30 nu_mu)
     6.66870818E-01    2     1000024        13   # BR(~nu_muL -> ~chi_1+ mu-)
     9.32092634E-06    2     1000037        13   # BR(~nu_muL -> ~chi_2+ mu-)
#
#         PDG            Width
DECAY   1000016     4.68045178E+01   # snu_tauL decays
#          BR         NDA      ID1       ID2
     3.28169865E-01    2     1000022        16   # BR(~nu_tauL -> ~chi_10 nu_tau)
     5.57038375E-06    2     1000023        16   # BR(~nu_tauL -> ~chi_20 nu_tau)
     1.17118963E-04    2     1000025        16   # BR(~nu_tauL -> ~chi_30 nu_tau)
     6.55902477E-04    2     1000035        16   # BR(~nu_tauL -> ~chi_40 nu_tau)
     6.57187035E-01    2     1000024        15   # BR(~nu_tauL -> ~chi_1+ tau-)
     1.38645079E-02    2     1000037        15   # BR(~nu_tauL -> ~chi_2+ tau-)
#
#         PDG            Width
DECAY   1000024     3.21589640E-15   # chargino1+ decays
#           BR         NDA      ID1       ID2       ID3
     1.98267520E-02    3     1000022       -11        12   # BR(~chi_1+ -> ~chi_10 e+   nu_e)
     2.01084680E-03    3     1000022       -13        14   # BR(~chi_1+ -> ~chi_10 mu+  nu_mu)
     9.78162400E-01    2     1000022       211             # BR(~chi_1+ -> ~chi_10 pi+)
#
#         PDG            Width
DECAY   1000037     4.36567663E+01   # chargino2+ decays
#          BR         NDA      ID1       ID2
     3.94124232E-01    2     1000006        -5   # BR(~chi_2+ -> ~t_1     bb)
     1.08191890E-01    2     1000024        23   # BR(~chi_2+ -> ~chi_1+  Z )
     1.05300462E-01    2     1000022        24   # BR(~chi_2+ -> ~chi_10  W+)
     1.12548035E-01    2     1000024        25   # BR(~chi_2+ -> ~chi_1+  h )
     9.31530869E-02    2     1000024        35   # BR(~chi_2+ -> ~chi_1+  H )
     9.32983077E-02    2     1000024        36   # BR(~chi_2+ -> ~chi_1+  A )
     9.33839861E-02    2     1000022        37   # BR(~chi_2+ -> ~chi_10  H+)
#
#         PDG            Width
DECAY   1000022     0.00000000E+00   # neutralino1 decays
#
#         PDG            Width
DECAY   1000023     4.28586681E+01   # neutralino2 decays
#          BR         NDA      ID1       ID2
     7.30851621E-02    2     1000022        23   # BR(~chi_20 -> ~chi_10   Z )
     1.07032749E-01    2     1000024       -24   # BR(~chi_20 -> ~chi_1+   W-)
     1.07032749E-01    2    -1000024        24   # BR(~chi_20 -> ~chi_1-   W+)
     3.82627286E-02    2     1000022        25   # BR(~chi_20 -> ~chi_10   h )
     4.39285782E-02    2     1000022        35   # BR(~chi_20 -> ~chi_10   H )
     5.11537367E-02    2     1000022        36   # BR(~chi_20 -> ~chi_10   A )
     9.48411496E-02    2     1000024       -37   # BR(~chi_20 -> ~chi_1+   H-)
     9.48411496E-02    2    -1000024        37   # BR(~chi_20 -> ~chi_1-   H+)
     6.20449618E-05    2     2000002        -2   # BR(~chi_20 -> ~u_R      ub)
     6.20449618E-05    2    -2000002         2   # BR(~chi_20 -> ~u_R*     u )
     1.69231419E-05    2     2000001        -1   # BR(~chi_20 -> ~d_R      db)
     1.69231419E-05    2    -2000001         1   # BR(~chi_20 -> ~d_R*     d )
     6.20449434E-05    2     2000004        -4   # BR(~chi_20 -> ~c_R      cb)
     6.20449434E-05    2    -2000004         4   # BR(~chi_20 -> ~c_R*     c )
     1.69231419E-05    2     2000003        -3   # BR(~chi_20 -> ~s _R      sb)
     1.69231419E-05    2    -2000003         3   # BR(~chi_20 -> ~s _R*     s )
     1.94657660E-01    2     1000006        -6   # BR(~chi_20 -> ~t_1      tb)
     1.94657660E-01    2    -1000006         6   # BR(~chi_20 -> ~t_1*     t )
     4.77011711E-05    2     2000011       -11   # BR(~chi_20 -> ~e_R-     e+)
     4.77011711E-05    2    -2000011        11   # BR(~chi_20 -> ~e_R+     e-)
     4.77011711E-05    2     2000013       -13   # BR(~chi_20 -> ~mu_R-    mu+)
     4.77011711E-05    2    -2000013        13   # BR(~chi_20 -> ~mu_R+    mu-)
#
#         PDG            Width
DECAY   1000025     4.35487077E+01   # neutralino3 decays
#          BR         NDA      ID1       ID2
     3.64076686E-02    2     1000022        23   # BR(~chi_30 -> ~chi_10   Z )
     1.05525607E-01    2     1000024       -24   # BR(~chi_30 -> ~chi_1+   W-)
     1.05525607E-01    2    -1000024        24   # BR(~chi_30 -> ~chi_1-   W+)
     7.51345848E-02    2     1000022        25   # BR(~chi_30 -> ~chi_10   h )
     4.98462319E-02    2     1000022        35   # BR(~chi_30 -> ~chi_10   H )
     4.29110563E-02    2     1000022        36   # BR(~chi_30 -> ~chi_10   A )
     9.33030643E-02    2     1000024       -37   # BR(~chi_30 -> ~chi_1+   H-)
     9.33030643E-02    2    -1000024        37   # BR(~chi_30 -> ~chi_1-   H+)
     3.79483984E-06    2     2000002        -2   # BR(~chi_30 -> ~u_R      ub)
     3.79483984E-06    2    -2000002         2   # BR(~chi_30 -> ~u_R*     u )
     1.03495176E-06    2     2000001        -1   # BR(~chi_30 -> ~d_R      db)
     1.03495176E-06    2    -2000001         1   # BR(~chi_30 -> ~d_R*     d )
     3.79483871E-06    2     2000004        -4   # BR(~chi_30 -> ~c_R      cb)
     3.79483871E-06    2    -2000004         4   # BR(~chi_30 -> ~c_R*     c )
     1.03495176E-06    2     2000003        -3   # BR(~chi_30 -> ~s _R      sb)
     1.03495176E-06    2    -2000003         3   # BR(~chi_30 -> ~s _R*     s )
     1.99006064E-01    2     1000006        -6   # BR(~chi_30 -> ~t_1      tb)
     1.99006064E-01    2    -1000006         6   # BR(~chi_30 -> ~t_1*     t )
     2.91754807E-06    2     2000011       -11   # BR(~chi_30 -> ~e_R-     e+)
     2.91754807E-06    2    -2000011        11   # BR(~chi_30 -> ~e_R+     e-)
     2.91754807E-06    2     2000013       -13   # BR(~chi_30 -> ~mu_R-    mu+)
     2.91754807E-06    2    -2000013        13   # BR(~chi_30 -> ~mu_R+    mu-)
#
#         PDG            Width
DECAY   1000035     1.17236116E+02   # neutralino4 decays
#          BR         NDA      ID1       ID2
     3.45170924E-05    2     1000022        23   # BR(~chi_40 -> ~chi_10   Z )
     8.45818475E-04    2     1000023        23   # BR(~chi_40 -> ~chi_20   Z )
     1.33673380E-02    2     1000025        23   # BR(~chi_40 -> ~chi_30   Z )
     6.31699039E-05    2     1000024       -24   # BR(~chi_40 -> ~chi_1+   W-)
     6.31699039E-05    2    -1000024        24   # BR(~chi_40 -> ~chi_1-   W+)
     1.38068298E-02    2     1000037       -24   # BR(~chi_40 -> ~chi_2+   W-)
     1.38068298E-02    2    -1000037        24   # BR(~chi_40 -> ~chi_2-   W+)
     3.04570790E-05    2     1000022        25   # BR(~chi_40 -> ~chi_10   h )
     1.46372841E-06    2     1000022        35   # BR(~chi_40 -> ~chi_10   H )
     4.93759465E-06    2     1000022        36   # BR(~chi_40 -> ~chi_10   A )
     1.38542764E-02    2     1000023        25   # BR(~chi_40 -> ~chi_20   h )
     1.61404293E-02    2     1000023        35   # BR(~chi_40 -> ~chi_20   H )
     4.43130507E-04    2     1000023        36   # BR(~chi_40 -> ~chi_20   A )
     8.36711532E-04    2     1000025        25   # BR(~chi_40 -> ~chi_30   h )
     4.38873716E-04    2     1000025        35   # BR(~chi_40 -> ~chi_30   H )
     1.60498515E-02    2     1000025        36   # BR(~chi_40 -> ~chi_30   A )
     6.39332317E-06    2     1000024       -37   # BR(~chi_40 -> ~chi_1+   H-)
     6.39332317E-06    2    -1000024        37   # BR(~chi_40 -> ~chi_1-   H+)
     1.63925938E-02    2     1000037       -37   # BR(~chi_40 -> ~chi_2+   H-)
     1.63925938E-02    2    -1000037        37   # BR(~chi_40 -> ~chi_2-   H+)
     8.76056946E-02    2     2000002        -2   # BR(~chi_40 -> ~u_R      ub)
     8.76056946E-02    2    -2000002         2   # BR(~chi_40 -> ~u_R*     u )
     2.26110141E-02    2     2000001        -1   # BR(~chi_40 -> ~d_R      db)
     2.26110141E-02    2    -2000001         1   # BR(~chi_40 -> ~d_R*     d )
     8.76056910E-02    2     2000004        -4   # BR(~chi_40 -> ~c_R      cb)
     8.76056910E-02    2    -2000004         4   # BR(~chi_40 -> ~c_R*     c )
     2.26110141E-02    2     2000003        -3   # BR(~chi_40 -> ~s _R      sb)
     2.26110141E-02    2    -2000003         3   # BR(~chi_40 -> ~s _R*     s )
     7.56539522E-02    2     1000006        -6   # BR(~chi_40 -> ~t_1      tb)
     7.56539522E-02    2    -1000006         6   # BR(~chi_40 -> ~t_1*     t )
     2.63497452E-04    2     1000005        -5   # BR(~chi_40 -> ~b_1      bb)
     2.63497452E-04    2    -1000005         5   # BR(~chi_40 -> ~b_1*     b )
     3.34290178E-06    2     2000005        -5   # BR(~chi_40 -> ~b_2      bb)
     3.34290178E-06    2    -2000005         5   # BR(~chi_40 -> ~b_2*     b )
     9.16062091E-04    2     1000011       -11   # BR(~chi_40 -> ~e_L-     e+)
     9.16062091E-04    2    -1000011        11   # BR(~chi_40 -> ~e_L+     e-)
     6.93363771E-02    2     2000011       -11   # BR(~chi_40 -> ~e_R-     e+)
     6.93363771E-02    2    -2000011        11   # BR(~chi_40 -> ~e_R+     e-)
     9.16062091E-04    2     1000013       -13   # BR(~chi_40 -> ~mu_L-    mu+)
     9.16062091E-04    2    -1000013        13   # BR(~chi_40 -> ~mu_L+    mu-)
     6.93363771E-02    2     2000013       -13   # BR(~chi_40 -> ~mu_R-    mu+)
     6.93363771E-02    2    -2000013        13   # BR(~chi_40 -> ~mu_R+    mu-)
     9.24012982E-04    2     1000012       -12   # BR(~chi_40 -> ~nu_eL    nu_eb)
     9.24012982E-04    2    -1000012        12   # BR(~chi_40 -> ~nu_eL*   nu_e )
     9.24012982E-04    2     1000014       -14   # BR(~chi_40 -> ~nu_muL   nu_mub)
     9.24012982E-04    2    -1000014        14   # BR(~chi_40 -> ~nu_muL*  nu_mu )
#
#         PDG            Width
DECAY        25     4.63205429E-03   # h decays
#          BR         NDA      ID1       ID2
     6.21690859E-01    2           5        -5   # BR(h -> b       bb     )
     6.19244763E-02    2         -15        15   # BR(h -> tau+    tau-   )
     2.19167853E-04    2         -13        13   # BR(h -> mu+     mu-    )
     2.36055996E-04    2           3        -3   # BR(h -> s       sb     )
     1.88133793E-02    2           4        -4   # BR(h -> c       cb     )
     6.98593878E-02    2          21        21   # BR(h -> g       g      )
     2.09306236E-03    2          22        22   # BR(h -> gam     gam    )
     1.44926889E-03    2          22        23   # BR(h -> Z       gam    )
     1.98645003E-01    2          24       -24   # BR(h -> W+      W-     )
     2.50693393E-02    2          23        23   # BR(h -> Z       Z      )
#
#         PDG            Width
DECAY        35     2.22798629E+00   # H decays
#          BR         NDA      ID1       ID2
     8.27590260E-01    2           5        -5   # BR(H -> b       bb     )
     1.20454724E-01    2         -15        15   # BR(H -> tau+    tau-   )
     4.25107669E-04    2         -13        13   # BR(H -> mu+     mu-    )
     2.64704862E-04    2           3        -3   # BR(H -> s       sb     )
     7.22946757E-07    2           4        -4   # BR(H -> c       cb     )
     4.69474443E-02    2           6        -6   # BR(H -> t       tb     )
     3.07937251E-04    2          21        21   # BR(H -> g       g      )
     6.07694072E-07    2          22        22   # BR(H -> gam     gam    )
     1.52947575E-07    2          23        22   # BR(H -> Z       gam    )
     3.28980097E-04    2          24       -24   # BR(H -> W+      W-     )
     1.59311604E-04    2          23        23   # BR(H -> Z       Z      )
     1.77272485E-03    2          25        25   # BR(H -> h       h      )
     1.16375500E-03    2     1000024  -1000024   # BR(H -> ~chi_1+ ~chi_1-)
     5.83567041E-04    2     1000022   1000022   # BR(H -> ~chi_10 ~chi_10)
#
#         PDG            Width
DECAY        36     2.25953293E+00   # A decays
#          BR         NDA      ID1       ID2
     8.16647276E-01    2           5        -5   # BR(A -> b       bb     )
     1.18841427E-01    2         -15        15   # BR(A -> tau+    tau-   )
     4.19399796E-04    2         -13        13   # BR(A -> mu+     mu-    )
     2.61252281E-04    2           3        -3   # BR(A -> s       sb     )
     6.53059446E-07    2           4        -4   # BR(A -> c       cb     )
     5.83181500E-02    2           6        -6   # BR(A -> t       tb     )
     4.88883752E-04    2          21        21   # BR(A -> g       g      )
     1.02196856E-06    2          22        22   # BR(A -> gam     gam    )
     2.16427595E-07    2          23        22   # BR(A -> Z       gam    )
     2.97742697E-04    2          23        25   # BR(A -> Z       h      )
     3.14853759E-03    2     1000024  -1000024   # BR(A -> ~chi_1+ ~chi_1-)
     1.57543943E-03    2     1000022   1000022   # BR(A -> ~chi_10 ~chi_10)
#
#         PDG            Width
DECAY        37     1.95588001E+00   # H+ decays
#          BR         NDA      ID1       ID2
     1.42752058E-03    2           4        -5   # BR(H+ -> c       bb     )
     1.38489135E-01    2         -15        16   # BR(H+ -> tau+    nu_tau )
     4.88737801E-04    2         -13        14   # BR(H+ -> mu+     nu_mu  )
     1.42748487E-05    2           2        -5   # BR(H+ -> u       bb     )
     1.51122726E-05    2           2        -3   # BR(H+ -> u       sb     )
     2.98178817E-04    2           4        -3   # BR(H+ -> c       sb     )
     8.58906385E-01    2           6        -5   # BR(H+ -> t       bb     )
     3.60653199E-04    2          24        25   # BR(H+ -> W+      h      )
     2.72903728E-09    2          24        36   # BR(H+ -> W+      A      )
     4.10429744E-11    2     1000024   1000022   # BR(H+ -> ~chi_1+ ~chi_10)
