#
#                              ======================
#                              | THE SUSYHIT OUTPUT |
#                              ======================
#
#
#              ------------------------------------------------------
#              |     This is the output of the SUSY-HIT package     |
#              |  created by A.Djouadi, M.Muehlleitner and M.Spira. |
#              |  In case of problems with SUSY-HIT email to        |
#              |           margarete.muehlleitner@cern.ch           |
#              |           michael.spira@psi.ch                     |
#              |           abdelhak.djouadi@cern.ch                 |
#              ------------------------------------------------------
#
#              ------------------------------------------------------
#              |  SUSY Les Houches Accord - MSSM Spectrum + Decays  |
#              |              based on the decay programs           |
#              |                                                    |
#              |                     SDECAY 1.3b                    |
#              |                                                    |
#              |  Authors: M.Muhlleitner, A.Djouadi and Y.Mambrini  |
#              |  Ref.:    Comput.Phys.Commun.168(2005)46           |
#              |           [hep-ph/0311167]                         |
#              |                                                    |
#              |                     HDECAY 3.4                     |
#              |                                                    |
#              |  By: A.Djouadi,J.Kalinowski,M.Muhlleitner,M.Spira  |
#              |  Ref.:    Comput.Phys.Commun.108(1998)56           |
#              |           [hep-ph/9704448]                         |
#              |                                                    |
#              |                                                    |
#              |  If not stated otherwise all DRbar couplings and   |
#              |  soft SUSY breaking masses are given at the scale  |
#              |  Q=  0.16367730E+04
#              |                                                    |
#              ------------------------------------------------------
#
#
BLOCK DCINFO  # Decay Program information
     1   SDECAY/HDECAY # decay calculator
     2   1.3b  /3.4    # version number
#
BLOCK SPINFO  # Spectrum calculator information
     1     SOFTSUSY    # spectrum calculator               
     2     3.4.0       # version number                    
#
BLOCK MODSEL  # Model selection
     1     0   #  nonUniversal                                     
#
BLOCK SMINPUTS  # Standard Model inputs
         1     1.27908970E+02   # alpha_em^-1(M_Z)^MSbar
         2     1.16637870E-05   # G_F [GeV^-2]
         3     1.18400000E-01   # alpha_S(M_Z)^MSbar
         4     9.11876000E+01   # M_Z pole mass
         5     4.18000000E+00   # mb(mb)^MSbar
         6     1.73200000E+02   # mt pole mass
         7     1.77700000E+00   # mtau pole mass
#
BLOCK MINPAR  # Input parameters - minimal models
         3     1.36100000E+01   # tanb                
#
BLOCK EXTPAR  # Input parameters - non-minimal models
         0    -1.00000000E+00   # Set                 
         1     3.42096000E+03   # M_1(MX)             
         2     4.83670000E+02   # M_2(MX)             
         3     1.02285000E+03   # M_3(MX)             
        11     2.28449000E+03   # At(MX)              
        12     2.92545000E+03   # Ab(MX)              
        13    -3.47684000E+03   # Atau(MX)            
        23    -4.10270000E+02   # mu(MX)              
        26     3.40488000E+03   # mA(pole)            
        31     2.49244000E+03   # meL(MX)             
        32     2.49244000E+03   # mmuL(MX)            
        33     1.65016000E+03   # mtauL(MX)           
        34     8.23070000E+02   # meR(MX)             
        35     8.23070000E+02   # mmuR(MX)            
        36     1.63028000E+03   # mtauR(MX)           
        41     1.75584000E+03   # mqL1(MX)            
        42     1.75584000E+03   # mqL2(MX)            
        43     2.09458000E+03   # mqL3(MX)            
        44     1.59179000E+03   # muR(MX)             
        45     1.59179000E+03   # mcR(MX)             
        46     1.27861000E+03   # mtR(MX)             
        47     3.63639000E+03   # mdR(MX)             
        48     3.63639000E+03   # msR(MX)             
        49     5.55480000E+02   # mbR(MX)             
#
BLOCK MASS  # Mass Spectrum
# PDG code           mass       particle
        24     8.04056578E+01   # W+
        25     1.24522589E+02   # h
        35     3.40491587E+03   # H
        36     3.40487990E+03   # A
        37     3.40616748E+03   # H+
         5     4.81876030E+00   # b-quark pole mass calculated from mb(mb)_Msbar
   1000001     1.79029315E+03   # ~d_L
   2000001     3.66842695E+03   # ~d_R
   1000002     1.78869988E+03   # ~u_L
   2000002     1.62098462E+03   # ~u_R
   1000003     1.79029315E+03   # ~s_L
   2000003     3.66842695E+03   # ~s_R
   1000004     1.78869988E+03   # ~c_L
   2000004     1.62098462E+03   # ~c_R
   1000005     6.42459276E+02   # ~b_1
   2000005     2.10339744E+03   # ~b_2
   1000006     1.27683431E+03   # ~t_1
   2000006     2.11647387E+03   # ~t_2
   1000011     2.49628192E+03   # ~e_L
   2000011     8.24751020E+02   # ~e_R
   1000012     2.49471049E+03   # ~nu_eL
   1000013     2.49628192E+03   # ~mu_L
   2000013     8.24751020E+02   # ~mu_R
   1000014     2.49471049E+03   # ~nu_muL
   1000015     1.63501379E+03   # ~tau_1
   2000015     1.65210472E+03   # ~tau_2
   1000016     1.64982570E+03   # ~nu_tauL
   1000021     1.16692469E+03   # ~g
   1000022     4.01470947E+02   # ~chi_10
   1000023    -4.28660055E+02   # ~chi_20
   1000025     5.35703432E+02   # ~chi_30
   1000035     3.39760017E+03   # ~chi_40
   1000024     4.04937898E+02   # ~chi_1+
   1000037     5.36691101E+02   # ~chi_2+
#
BLOCK NMIX  # Neutralino Mixing Matrix
  1  1    -8.47343769E-03   # N_11
  1  2     4.15351432E-01   # N_12
  1  3     6.64247227E-01   # N_13
  1  4     6.21439466E-01   # N_14
  2  1    -8.82152936E-03   # N_21
  2  2     6.43489367E-02   # N_22
  2  3    -7.02961624E-01   # N_23
  2  4     7.08255851E-01   # N_24
  3  1     4.93398297E-03   # N_31
  3  2     9.07382086E-01   # N_32
  3  3    -2.54204862E-01   # N_33
  3  4    -3.34683871E-01   # N_34
  4  1     9.99913015E-01   # N_41
  4  2    -3.89931168E-04   # N_42
  4  3     6.81562632E-04   # N_43
  4  4     1.31660982E-02   # N_44
#
BLOCK UMIX  # Chargino Mixing Matrix U
  1  1     3.68665604E-01   # U_11
  1  2     9.29562087E-01   # U_12
  2  1    -9.29562087E-01   # U_21
  2  2     3.68665604E-01   # U_22
#
BLOCK VMIX  # Chargino Mixing Matrix V
  1  1     4.84662322E-01   # V_11
  1  2    -8.74701339E-01   # V_12
  2  1    -8.74701339E-01   # V_21
  2  2    -4.84662322E-01   # V_22
#
BLOCK STOPMIX  # Stop Mixing Matrix
  1  1    -1.12203223E-01   # cos(theta_t)
  1  2     9.93685281E-01   # sin(theta_t)
  2  1    -9.93685281E-01   # -sin(theta_t)
  2  2    -1.12203223E-01   # cos(theta_t)
#
BLOCK SBOTMIX  # Sbottom Mixing Matrix
  1  1    -5.07189001E-03   # cos(theta_b)
  1  2     9.99987138E-01   # sin(theta_b)
  2  1    -9.99987138E-01   # -sin(theta_b)
  2  2    -5.07189001E-03   # cos(theta_b)
#
BLOCK STAUMIX  # Stau Mixing Matrix
  1  1    -6.36965091E-02   # cos(theta_tau)
  1  2     9.97969316E-01   # sin(theta_tau)
  2  1    -9.97969316E-01   # -sin(theta_tau)
  2  2    -6.36965091E-02   # cos(theta_tau)
#
BLOCK ALPHA  # Higgs mixing
          -7.65792729E-02   # Mixing angle in the neutral Higgs boson sector
#
BLOCK HMIX Q=  1.63677300E+03  # DRbar Higgs Parameters
         1    -4.16208171E+02   # mu(Q)MSSM           
         2     1.30567503E+01   # tan                 
         3     2.42368573E+02   # higgs               
         4     1.15785206E+07   # mA^2(Q)MSSM         
#
BLOCK GAUGE Q=  1.63677300E+03  # The gauge couplings
     1     3.63604145E-01   # gprime(Q) DRbar
     2     6.40902361E-01   # g(Q) DRbar
     3     1.04449196E+00   # g3(Q) DRbar
#
BLOCK AU Q=  1.63677300E+03  # The trilinear couplings
  1  1     0.00000000E+00   # A_u(Q) DRbar
  2  2     0.00000000E+00   # A_c(Q) DRbar
  3  3     2.28449000E+03   # A_t(Q) DRbar
#
BLOCK AD Q=  1.63677300E+03  # The trilinear couplings
  1  1     0.00000000E+00   # A_d(Q) DRbar
  2  2     0.00000000E+00   # A_s(Q) DRbar
  3  3     2.92545000E+03   # A_b(Q) DRbar
#
BLOCK AE Q=  1.63677300E+03  # The trilinear couplings
  1  1     0.00000000E+00   # A_e(Q) DRbar
  2  2     0.00000000E+00   # A_mu(Q) DRbar
  3  3    -3.47684000E+03   # A_tau(Q) DRbar
#
BLOCK Yu Q=  1.63677300E+03  # The Yukawa couplings
  1  1     0.00000000E+00   # y_u(Q) DRbar
  2  2     0.00000000E+00   # y_c(Q) DRbar
  3  3     8.62638836E-01   # y_t(Q) DRbar
#
BLOCK Yd Q=  1.63677300E+03  # The Yukawa couplings
  1  1     0.00000000E+00   # y_d(Q) DRbar
  2  2     0.00000000E+00   # y_s(Q) DRbar
  3  3     1.91933178E-01   # y_b(Q) DRbar
#
BLOCK Ye Q=  1.63677300E+03  # The Yukawa couplings
  1  1     0.00000000E+00   # y_e(Q) DRbar
  2  2     0.00000000E+00   # y_mu(Q) DRbar
  3  3     1.32678543E-01   # y_tau(Q) DRbar
#
BLOCK MSOFT Q=  1.63677300E+03  # The soft SUSY breaking masses at the scale Q
         1     3.42096000E+03   # M_1(Q)              
         2     4.83670000E+02   # M_2(Q)              
         3     1.02285000E+03   # M_3(Q)              
        21     1.13415098E+07   # mH1^2(Q)            
        22    -6.87799633E+04   # mH2^2(Q)            
        31     2.49244000E+03   # meL(Q)              
        32     2.49244000E+03   # mmuL(Q)             
        33     1.65016000E+03   # mtauL(Q)            
        34     8.23070000E+02   # meR(Q)              
        35     8.23070000E+02   # mmuR(Q)             
        36     1.63028000E+03   # mtauR(Q)            
        41     1.75584000E+03   # mqL1(Q)             
        42     1.75584000E+03   # mqL2(Q)             
        43     2.09458000E+03   # mqL3(Q)             
        44     1.59179000E+03   # muR(Q)              
        45     1.59179000E+03   # mcR(Q)              
        46     1.27861000E+03   # mtR(Q)              
        47     3.63639000E+03   # mdR(Q)              
        48     3.63639000E+03   # msR(Q)              
        49     5.55479998E+02   # mbR(Q)              
#
Block HiggsBoundsInputHiggsCouplingsFermions
# ScalarNormEffCoupSq PseudoSNormEffCoupSq NP   IP1 IP2 IP2
    1.00365305E+00    0.00000000E+00        3  25   5   5  # h0-b-b eff. coupling^2, normalised to SM
    1.70475075E+02    0.00000000E+00        3  35   5   5  # H0-b-b eff. coupling^2, normalised to SM
    0.00000000E+00    1.70478728E+02        3  36   5   5  # A0-b-b eff. coupling^2, normalised to SM
#
    9.99978572E-01    0.00000000E+00        3  25   6   6  # h0-t-t eff. coupling^2, normalised to SM
    5.88726265E-03    0.00000000E+00        3  35   6   6  # H0-t-t eff. coupling^2, normalised to SM
    0.00000000E+00    5.86583446E-03        3  36   6   6  # A0-t-t eff. coupling^2, normalised to SM
#
    1.00365305E+00    0.00000000E+00        3  25  15  15  # h0-tau-tau eff. coupling^2, normalised to SM
    1.70475075E+02    0.00000000E+00        3  35  15  15  # H0-tau-tau eff. coupling^2, normalised to SM
    0.00000000E+00    1.70478728E+02        3  36  15  15  # A0-tau-tau eff. coupling^2, normalised to SM
#
Block HiggsBoundsInputHiggsCouplingsBosons
    9.99999980E-01        3  25  24  24  # h0-W-W eff. coupling^2, normalised to SM
    1.95341043E-08        3  35  24  24  # H0-W-W eff. coupling^2, normalised to SM
    0.00000000E+00        3  36  24  24  # A0-W-W eff. coupling^2, normalised to SM
#
    9.99999980E-01        3  25  23  23  # h0-Z-Z eff. coupling^2, normalised to SM
    1.95341043E-08        3  35  23  23  # H0-Z-Z eff. coupling^2, normalised to SM
    0.00000000E+00        3  36  23  23  # A0-Z-Z eff. coupling^2, normalised to SM
#
    8.94180825E-01        3  25  21  21  # h0-g-g eff. coupling^2, normalised to SM
    3.82069969E-14        3  35  21  21  # H0-g-g eff. coupling^2, normalised to SM
    5.06830318E-13        3  36  21  21  # A0-g-g eff. coupling^2, normalised to SM
#
    0.00000000E+00        3  25  25  23  # h0-h0-Z eff. coupling^2, normalised to SM
    0.00000000E+00        3  35  25  23  # H0-h0-Z eff. coupling^2, normalised to SM
    1.95341043E-08        3  36  25  23  # A0-h0-Z eff. coupling^2, normalised to SM
    0.00000000E+00        3  35  35  23  # H0-H0-Z eff. coupling^2, normalised to SM
    9.99999980E-01        3  36  35  23  # A0-H0-Z eff. coupling^2, normalised to SM
    0.00000000E+00        3  36  36  23  # A0-A0-Z eff. coupling^2, normalised to SM
#
    0.00000000E+00        4  25  21  21  23  # h0-g-g-Z eff. coupling^2, normalised to SM
    0.00000000E+00        4  35  21  21  23  # H0-g-g-Z eff. coupling^2, normalised to SM
    0.00000000E+00        4  36  21  21  23  # A0-g-g-Z eff. coupling^2, normalised to SM
#
#
#
#                             =================
#                             |The decay table|
#                             =================
#
# - The QCD corrections to the decays gluino -> squark  + quark
#                                     squark -> gaugino + quark_prime
#                                     squark -> squark_prime + Higgs
#                                     squark -> gluino  + quark
#   are included.
#
# - The multi-body decays for the inos, stops and sbottoms are included.
#
# - The loop induced decays for the gluino, neutralinos and stops
#   are included.
#
# - The SUSY decays of the top quark are included.
#
#
#         PDG            Width
DECAY         6     1.44591373E+00   # top decays
#          BR         NDA      ID1       ID2
     1.00000000E+00    2           5        24   # BR(t ->  b    W+)
#
#         PDG            Width
DECAY   1000021     1.30299940E+01   # gluino decays
#          BR         NDA      ID1       ID2
     5.00000000E-01    2     1000005        -5   # BR(~g -> ~b_1  bb)
     5.00000000E-01    2    -1000005         5   # BR(~g -> ~b_1* b )
#
#         PDG            Width
DECAY   1000006     2.85364470E+01   # stop1 decays
#          BR         NDA      ID1       ID2
     1.86907703E-01    2     1000022         6   # BR(~t_1 -> ~chi_10 t )
     2.41083792E-01    2     1000023         6   # BR(~t_1 -> ~chi_20 t )
     6.56349935E-02    2     1000025         6   # BR(~t_1 -> ~chi_30 t )
     3.68284009E-01    2     1000024         5   # BR(~t_1 -> ~chi_1+ b )
     1.38083448E-01    2     1000037         5   # BR(~t_1 -> ~chi_2+ b )
     6.05376042E-06    2     1000005        24   # BR(~t_1 -> ~b_1    W+)
#
#         PDG            Width
DECAY   2000006     1.33445109E+02   # stop2 decays
#          BR         NDA      ID1       ID2
     9.72076798E-02    2     1000022         6   # BR(~t_2 -> ~chi_10 t )
     1.09367701E-01    2     1000023         6   # BR(~t_2 -> ~chi_20 t )
     6.36675665E-02    2     1000025         6   # BR(~t_2 -> ~chi_30 t )
     5.45459412E-02    2     1000024         5   # BR(~t_2 -> ~chi_1+ b )
     7.32361696E-02    2     1000037         5   # BR(~t_2 -> ~chi_2+ b )
     4.45035507E-01    2     1000021         6   # BR(~t_2 -> ~g      t )
     8.36665041E-02    2     1000006        25   # BR(~t_2 -> ~t_1    h )
     7.24244525E-02    2     1000006        23   # BR(~t_2 -> ~t_1    Z )
     8.48478196E-04    2     1000005        24   # BR(~t_2 -> ~b_1    W+)
#
#         PDG            Width
DECAY   1000005     2.38931942E-01   # sbottom1 decays
#          BR         NDA      ID1       ID2
     3.28027406E-01    2     1000022         5   # BR(~b_1 -> ~chi_10 b )
     2.99044387E-01    2     1000023         5   # BR(~b_1 -> ~chi_20 b )
     1.08494377E-02    2     1000025         5   # BR(~b_1 -> ~chi_30 b )
     3.62078770E-01    2    -1000024         6   # BR(~b_1 -> ~chi_1- t )
#
#         PDG            Width
DECAY   2000005     1.29176991E+02   # sbottom2 decays
#          BR         NDA      ID1       ID2
     1.55662329E-02    2     1000022         5   # BR(~b_2 -> ~chi_10 b )
     5.69882020E-03    2     1000023         5   # BR(~b_2 -> ~chi_20 b )
     4.85189298E-02    2     1000025         5   # BR(~b_2 -> ~chi_30 b )
     1.81432237E-01    2    -1000024         6   # BR(~b_2 -> ~chi_1- t )
     1.54070861E-01    2    -1000037         6   # BR(~b_2 -> ~chi_2- t )
     4.51583339E-01    2     1000021         5   # BR(~b_2 -> ~g      b )
     4.95332307E-04    2     1000005        25   # BR(~b_2 -> ~b_1    h )
     4.45262510E-04    2     1000005        23   # BR(~b_2 -> ~b_1    Z )
     1.42188985E-01    2     1000006       -24   # BR(~b_2 -> ~t_1    W-)
#
#         PDG            Width
DECAY   1000002     6.08205042E+01   # sup_L decays
#          BR         NDA      ID1       ID2
     1.77845201E-02    2     1000022         2   # BR(~u_L -> ~chi_10 u)
     4.02226531E-04    2     1000023         2   # BR(~u_L -> ~chi_20 u)
     7.88606607E-02    2     1000025         2   # BR(~u_L -> ~chi_30 u)
     4.87182141E-02    2     1000024         1   # BR(~u_L -> ~chi_1+ d)
     1.46158814E-01    2     1000037         1   # BR(~u_L -> ~chi_2+ d)
     7.08075564E-01    2     1000021         2   # BR(~u_L -> ~g      u)
#
#         PDG            Width
DECAY   2000002     2.74556858E+01   # sup_R decays
#          BR         NDA      ID1       ID2
     8.35093486E-06    2     1000022         2   # BR(~u_R -> ~chi_10 u)
     8.88905742E-06    2     1000023         2   # BR(~u_R -> ~chi_20 u)
     2.55403813E-06    2     1000025         2   # BR(~u_R -> ~chi_30 u)
     9.99980206E-01    2     1000021         2   # BR(~u_R -> ~g      u)
#
#         PDG            Width
DECAY   1000001     6.08956662E+01   # sdown_L decays
#          BR         NDA      ID1       ID2
     1.80586741E-02    2     1000022         1   # BR(~d_L -> ~chi_10 d)
     4.46139551E-04    2     1000023         1   # BR(~d_L -> ~chi_20 d)
     7.85389036E-02    2     1000025         1   # BR(~d_L -> ~chi_30 d)
     2.81852076E-02    2    -1000024         2   # BR(~d_L -> ~chi_1- u)
     1.65072078E-01    2    -1000037         2   # BR(~d_L -> ~chi_2- u)
     7.09698997E-01    2     1000021         1   # BR(~d_L -> ~g      d)
#
#         PDG            Width
DECAY   2000001     2.16313733E+02   # sdown_R decays
#          BR         NDA      ID1       ID2
     6.72687730E-07    2     1000022         1   # BR(~d_R -> ~chi_10 d)
     7.26645063E-07    2     1000023         1   # BR(~d_R -> ~chi_20 d)
     2.23821756E-07    2     1000025         1   # BR(~d_R -> ~chi_30 d)
     2.03402820E-04    2     1000035         1   # BR(~d_R -> ~chi_40 d)
     9.99794974E-01    2     1000021         1   # BR(~d_R -> ~g      d)
#
#         PDG            Width
DECAY   1000004     5.26565650E+01   # scharm_L decays
#          BR         NDA      ID1       ID2
     2.14261611E-02    2     1000022         4   # BR(~c_L -> ~chi_10 c)
     4.84463842E-04    2     1000023         4   # BR(~c_L -> ~chi_20 c)
     9.48885622E-02    2     1000025         4   # BR(~c_L -> ~chi_30 c)
     5.86921503E-02    2     1000024         3   # BR(~c_L -> ~chi_1+ s)
     1.75863283E-01    2     1000037         3   # BR(~c_L -> ~chi_2+ s)
     6.48645380E-01    2     1000021         4   # BR(~c_L -> ~g      c)
#
#         PDG            Width
DECAY   2000004     2.17753227E+01   # scharm_R decays
#          BR         NDA      ID1       ID2
     1.10099181E-05    2     1000022         4   # BR(~c_R -> ~chi_10 c)
     1.17156766E-05    2     1000023         4   # BR(~c_R -> ~chi_20 c)
     3.36192412E-06    2     1000025         4   # BR(~c_R -> ~chi_30 c)
     9.99973912E-01    2     1000021         4   # BR(~c_R -> ~g      c)
#
#         PDG            Width
DECAY   1000003     5.26952784E+01   # sstrange_L decays
#          BR         NDA      ID1       ID2
     2.17669024E-02    2     1000022         3   # BR(~s_L -> ~chi_10 s)
     5.37613506E-04    2     1000023         3   # BR(~s_L -> ~chi_20 s)
     9.45470747E-02    2     1000025         3   # BR(~s_L -> ~chi_30 s)
     3.39717058E-02    2    -1000024         4   # BR(~s_L -> ~chi_1- c)
     1.98715781E-01    2    -1000037         4   # BR(~s_L -> ~chi_2- c)
     6.50460923E-01    2     1000021         3   # BR(~s_L -> ~g      s)
#
#         PDG            Width
DECAY   2000003     1.71568693E+02   # sstrange_R decays
#          BR         NDA      ID1       ID2
     8.75932201E-07    2     1000022         3   # BR(~s_R -> ~chi_10 s)
     9.46157159E-07    2     1000023         3   # BR(~s_R -> ~chi_20 s)
     2.91399895E-07    2     1000025         3   # BR(~s_R -> ~chi_30 s)
     2.52671272E-04    2     1000035         3   # BR(~s_R -> ~chi_40 s)
     9.99745215E-01    2     1000021         3   # BR(~s_R -> ~g      s)
#
#         PDG            Width
DECAY   1000011     2.80174418E+01   # selectron_L decays
#          BR         NDA      ID1       ID2
     5.82246243E-02    2     1000022        11   # BR(~e_L -> ~chi_10 e-)
     1.20755769E-03    2     1000023        11   # BR(~e_L -> ~chi_20 e-)
     2.74443527E-01    2     1000025        11   # BR(~e_L -> ~chi_30 e-)
     9.38170959E-02    2    -1000024        12   # BR(~e_L -> ~chi_1- nu_e)
     5.72307196E-01    2    -1000037        12   # BR(~e_L -> ~chi_2- nu_e)
#
#         PDG            Width
DECAY   2000011     3.96518214E-04   # selectron_R decays
#           BR         NDA      ID1       ID2
     4.57403177E-01    2     1000022        11   # BR(~e_R -> ~chi_10 e-)
     4.53576725E-01    2     1000023        11   # BR(~e_R -> ~chi_20 e-)
     8.90200982E-02    2     1000025        11   # BR(~e_R -> ~chi_30 e-)
#
#         PDG            Width
DECAY   1000013     2.80174418E+01   # smuon_L decays
#          BR         NDA      ID1       ID2
     5.82246241E-02    2     1000022        13   # BR(~mu_L -> ~chi_10 mu-)
     1.20755769E-03    2     1000023        13   # BR(~mu_L -> ~chi_20 mu-)
     2.74443526E-01    2     1000025        13   # BR(~mu_L -> ~chi_30 mu-)
     9.38170961E-02    2    -1000024        14   # BR(~mu_L -> ~chi_1- nu_mu)
     5.72307196E-01    2    -1000037        14   # BR(~mu_L -> ~chi_2- nu_mu)
#
#         PDG            Width
DECAY   2000013     3.96518190E-04   # smuon_R decays
#           BR         NDA      ID1       ID2
     4.57403180E-01    2     1000022        13   # BR(~mu_R -> ~chi_10 mu-)
     4.53576725E-01    2     1000023        13   # BR(~mu_R -> ~chi_20 mu-)
     8.90200951E-02    2     1000025        13   # BR(~mu_R -> ~chi_30 mu-)
#
#         PDG            Width
DECAY   1000015     1.07640640E+00   # stau_1 decays
#          BR         NDA      ID1       ID2
     2.68474793E-01    2     1000022        15   # BR(~tau_1 -> ~chi_10  tau-)
     2.18816407E-01    2     1000023        15   # BR(~tau_1 -> ~chi_20  tau-)
     1.84213513E-03    2     1000025        15   # BR(~tau_1 -> ~chi_30  tau-)
     5.08025698E-01    2    -1000024        16   # BR(~tau_1 -> ~chi_1-  nu_tau)
     2.84096746E-03    2    -1000037        16   # BR(~tau_1 -> ~chi_2-  nu_tau)
#
#         PDG            Width
DECAY   2000015     1.68851732E+01   # stau_2 decays
#          BR         NDA      ID1       ID2
     6.91551839E-02    2     1000022        15   # BR(~tau_2 -> ~chi_10  tau-)
     1.65867147E-02    2     1000023        15   # BR(~tau_2 -> ~chi_20  tau-)
     2.68606987E-01    2     1000025        15   # BR(~tau_2 -> ~chi_30  tau-)
     8.93511183E-02    2    -1000024        16   # BR(~tau_2 -> ~chi_1-  nu_tau)
     5.56299996E-01    2    -1000037        16   # BR(~tau_2 -> ~chi_2-  nu_tau)
#
#         PDG            Width
DECAY   1000012     2.80695357E+01   # snu_eL decays
#          BR         NDA      ID1       ID2
     6.08281036E-02    2     1000022        12   # BR(~nu_eL -> ~chi_10 nu_e)
     1.64504073E-03    2     1000023        12   # BR(~nu_eL -> ~chi_20 nu_e)
     2.70371456E-01    2     1000025        12   # BR(~nu_eL -> ~chi_30 nu_e)
     1.61728088E-01    2     1000024        11   # BR(~nu_eL -> ~chi_1+ e-)
     5.05427312E-01    2     1000037        11   # BR(~nu_eL -> ~chi_2+ e-)
#
#         PDG            Width
DECAY   1000014     2.80695356E+01   # snu_muL decays
#          BR         NDA      ID1       ID2
     6.08281038E-02    2     1000022        14   # BR(~nu_muL -> ~chi_10 nu_mu)
     1.64504074E-03    2     1000023        14   # BR(~nu_muL -> ~chi_20 nu_mu)
     2.70371457E-01    2     1000025        14   # BR(~nu_muL -> ~chi_30 nu_mu)
     1.61728088E-01    2     1000024        13   # BR(~nu_muL -> ~chi_1+ mu-)
     5.05427311E-01    2     1000037        13   # BR(~nu_muL -> ~chi_2+ mu-)
#
#         PDG            Width
DECAY   1000016     1.70436345E+01   # snu_tauL decays
#          BR         NDA      ID1       ID2
     6.17969649E-02    2     1000022        16   # BR(~nu_tauL -> ~chi_10 nu_tau)
     1.65420613E-03    2     1000023        16   # BR(~nu_tauL -> ~chi_20 nu_tau)
     2.58990076E-01    2     1000025        16   # BR(~nu_tauL -> ~chi_30 nu_tau)
     1.90039608E-01    2     1000024        15   # BR(~nu_tauL -> ~chi_1+ tau-)
     4.87519144E-01    2     1000037        15   # BR(~nu_tauL -> ~chi_2+ tau-)
#
#         PDG            Width
DECAY   1000024     7.67766173E-10   # chargino1+ decays
#           BR         NDA      ID1       ID2       ID3
     3.62639773E-01    3     1000022         2        -1   # BR(~chi_1+ -> ~chi_10 u    db)
     3.62639773E-01    3     1000022         4        -3   # BR(~chi_1+ -> ~chi_10 c    sb)
     1.20841435E-01    3     1000022       -11        12   # BR(~chi_1+ -> ~chi_10 e+   nu_e)
     1.20841435E-01    3     1000022       -13        14   # BR(~chi_1+ -> ~chi_10 mu+  nu_mu)
     3.30375837E-02    3     1000022       -15        16   # BR(~chi_1+ -> ~chi_10 tau+ nu_tau)
#
#         PDG            Width
DECAY   1000037     7.64056525E-01   # chargino2+ decays
#          BR         NDA      ID1       ID2
     3.06221620E-01    2     1000024        23   # BR(~chi_2+ -> ~chi_1+  Z )
     4.07761830E-01    2     1000022        24   # BR(~chi_2+ -> ~chi_10  W+)
     1.82043068E-01    2     1000023        24   # BR(~chi_2+ -> ~chi_20  W+)
     1.03973482E-01    2     1000024        25   # BR(~chi_2+ -> ~chi_1+  h )
#
#         PDG            Width
DECAY   1000022     0.00000000E+00   # neutralino1 decays
#
#         PDG            Width
DECAY   1000023     2.68036220E-05   # neutralino2 decays
#          BR         NDA      ID1       ID2
     1.97480048E-02    2     1000022        22   # BR(~chi_20 -> ~chi_10 gam)
#           BR         NDA      ID1       ID2       ID3
     5.26876111E-02    3     1000022        -2         2   # BR(~chi_20 -> ~chi_10 ub      u)
     6.82970912E-02    3     1000022        -1         1   # BR(~chi_20 -> ~chi_10 db      d)
     5.26876111E-02    3     1000022        -4         4   # BR(~chi_20 -> ~chi_10 cb      c)
     6.82970912E-02    3     1000022        -3         3   # BR(~chi_20 -> ~chi_10 sb      s)
     5.19774544E-02    3     1000022        -5         5   # BR(~chi_20 -> ~chi_10 bb      b)
     1.56467303E-02    3     1000022       -11        11   # BR(~chi_20 -> ~chi_10 e+      e-)
     1.56467303E-02    3     1000022       -13        13   # BR(~chi_20 -> ~chi_10 mu+     mu-)
     1.52610494E-02    3     1000022       -15        15   # BR(~chi_20 -> ~chi_10 tau+    tau-)
     3.12761298E-02    3     1000022       -12        12   # BR(~chi_20 -> ~chi_10 nu_eb   nu_e)
     3.12761298E-02    3     1000022       -14        14   # BR(~chi_20 -> ~chi_10 nu_mub  nu_mu)
     3.12789239E-02    3     1000022       -16        16   # BR(~chi_20 -> ~chi_10 nu_taub nu_tau)
     9.12628616E-02    3     1000024        -2         1   # BR(~chi_20 -> ~chi_1+ ub      d)
     9.12628616E-02    3    -1000024        -1         2   # BR(~chi_20 -> ~chi_1- db      u)
     9.12628616E-02    3     1000024        -4         3   # BR(~chi_20 -> ~chi_1+ cb      s)
     9.12628616E-02    3    -1000024        -3         4   # BR(~chi_20 -> ~chi_1- sb      c)
     3.04207449E-02    3     1000024       -12        11   # BR(~chi_20 -> ~chi_1+ nu_eb   e-)
     3.04207449E-02    3    -1000024        12       -11   # BR(~chi_20 -> ~chi_1- nu_e    e+)
     3.04207449E-02    3     1000024       -14        13   # BR(~chi_20 -> ~chi_1+ nu_mub  mu-)
     3.04207449E-02    3    -1000024        14       -13   # BR(~chi_20 -> ~chi_1- nu_mu   mu+)
     2.95925085E-02    3     1000024       -16        15   # BR(~chi_20 -> ~chi_1+ nu_taub tau-)
     2.95925085E-02    3    -1000024        16       -15   # BR(~chi_20 -> ~chi_1- nu_tau  tau+)
#
#         PDG            Width
DECAY   1000025     7.97774266E-01   # neutralino3 decays
#          BR         NDA      ID1       ID2
     1.12295992E-02    2     1000022        23   # BR(~chi_30 -> ~chi_10   Z )
     7.32932275E-02    2     1000023        23   # BR(~chi_30 -> ~chi_20   Z )
     4.08792267E-01    2     1000024       -24   # BR(~chi_30 -> ~chi_1+   W-)
     4.08792267E-01    2    -1000024        24   # BR(~chi_30 -> ~chi_1-   W+)
     9.78926402E-02    2     1000022        25   # BR(~chi_30 -> ~chi_10   h )
#
#         PDG            Width
DECAY   1000035     1.14245999E+02   # neutralino4 decays
#          BR         NDA      ID1       ID2
     6.38884855E-03    2     1000022        23   # BR(~chi_40 -> ~chi_10   Z )
     1.02072299E-02    2     1000023        23   # BR(~chi_40 -> ~chi_20   Z )
     1.85395254E-03    2     1000025        23   # BR(~chi_40 -> ~chi_30   Z )
     1.31697041E-02    2     1000024       -24   # BR(~chi_40 -> ~chi_1+   W-)
     1.31697041E-02    2    -1000024        24   # BR(~chi_40 -> ~chi_1-   W+)
     4.79527747E-03    2     1000037       -24   # BR(~chi_40 -> ~chi_2+   W-)
     4.79527747E-03    2    -1000037        24   # BR(~chi_40 -> ~chi_2-   W+)
     7.52701227E-03    2     1000022        25   # BR(~chi_40 -> ~chi_10   h )
     8.43425181E-03    2     1000023        25   # BR(~chi_40 -> ~chi_20   h )
     2.86601025E-03    2     1000025        25   # BR(~chi_40 -> ~chi_30   h )
     3.28862243E-03    2     1000002        -2   # BR(~chi_40 -> ~u_L      ub)
     3.28862243E-03    2    -1000002         2   # BR(~chi_40 -> ~u_L*     u )
     6.02909035E-02    2     2000002        -2   # BR(~chi_40 -> ~u_R      ub)
     6.02909035E-02    2    -2000002         2   # BR(~chi_40 -> ~u_R*     u )
     3.31135243E-03    2     1000001        -1   # BR(~chi_40 -> ~d_L      db)
     3.31135243E-03    2    -1000001         1   # BR(~chi_40 -> ~d_L*     d )
     3.28862163E-03    2     1000004        -4   # BR(~chi_40 -> ~c_L      cb)
     3.28862163E-03    2    -1000004         4   # BR(~chi_40 -> ~c_L*     c )
     6.02908930E-02    2     2000004        -4   # BR(~chi_40 -> ~c_R      cb)
     6.02908930E-02    2    -2000004         4   # BR(~chi_40 -> ~c_R*     c )
     3.31135243E-03    2     1000003        -3   # BR(~chi_40 -> ~s _L      sb)
     3.31135243E-03    2    -1000003         3   # BR(~chi_40 -> ~s _L*     s )
     7.63380067E-02    2     1000006        -6   # BR(~chi_40 -> ~t_1      tb)
     7.63380067E-02    2    -1000006         6   # BR(~chi_40 -> ~t_1*     t )
     2.44602251E-03    2     2000006        -6   # BR(~chi_40 -> ~t_2      tb)
     2.44602251E-03    2    -2000006         6   # BR(~chi_40 -> ~t_2*     t )
     2.42369820E-02    2     1000005        -5   # BR(~chi_40 -> ~b_1      bb)
     2.42369820E-02    2    -1000005         5   # BR(~chi_40 -> ~b_1*     b )
     2.48971246E-03    2     2000005        -5   # BR(~chi_40 -> ~b_2      bb)
     2.48971246E-03    2    -2000005         5   # BR(~chi_40 -> ~b_2*     b )
     4.13481812E-03    2     1000011       -11   # BR(~chi_40 -> ~e_L-     e+)
     4.13481812E-03    2    -1000011        11   # BR(~chi_40 -> ~e_L+     e-)
     6.92614824E-02    2     2000011       -11   # BR(~chi_40 -> ~e_R-     e+)
     6.92614824E-02    2    -2000011        11   # BR(~chi_40 -> ~e_R+     e-)
     4.13481812E-03    2     1000013       -13   # BR(~chi_40 -> ~mu_L-    mu+)
     4.13481812E-03    2    -1000013        13   # BR(~chi_40 -> ~mu_L+    mu-)
     6.92614824E-02    2     2000013       -13   # BR(~chi_40 -> ~mu_R-    mu+)
     6.92614824E-02    2    -2000013        13   # BR(~chi_40 -> ~mu_R+    mu-)
     4.60416901E-02    2     1000015       -15   # BR(~chi_40 -> ~tau_1-   tau+)
     4.60416901E-02    2    -1000015        15   # BR(~chi_40 -> ~tau_1+   tau-)
     1.15185979E-02    2     2000015       -15   # BR(~chi_40 -> ~tau_2-   tau+)
     1.15185979E-02    2    -2000015        15   # BR(~chi_40 -> ~tau_2+   tau-)
     4.15845421E-03    2     1000012       -12   # BR(~chi_40 -> ~nu_eL    nu_eb)
     4.15845421E-03    2    -1000012        12   # BR(~chi_40 -> ~nu_eL*   nu_e )
     4.15845421E-03    2     1000014       -14   # BR(~chi_40 -> ~nu_muL   nu_mub)
     4.15845421E-03    2    -1000014        14   # BR(~chi_40 -> ~nu_muL*  nu_mu )
     1.14340992E-02    2     1000016       -16   # BR(~chi_40 -> ~nu_tau1  nu_taub)
     1.14340992E-02    2    -1000016        16   # BR(~chi_40 -> ~nu_tau1* nu_tau )
#
#         PDG            Width
DECAY        25     3.85085609E-03   # h decays
#          BR         NDA      ID1       ID2
     5.91432913E-01    2           5        -5   # BR(h -> b       bb     )
     6.71802922E-02    2         -15        15   # BR(h -> tau+    tau-   )
     2.37793868E-04    2         -13        13   # BR(h -> mu+     mu-    )
     2.59777633E-04    2           3        -3   # BR(h -> s       sb     )
     2.24526157E-02    2           4        -4   # BR(h -> c       cb     )
     8.21702857E-02    2          21        21   # BR(h -> g       g      )
     2.39494522E-03    2          22        22   # BR(h -> gam     gam    )
     1.55469861E-03    2          22        23   # BR(h -> Z       gam    )
     2.06660193E-01    2          24       -24   # BR(h -> W+      W-     )
     2.56564853E-02    2          23        23   # BR(h -> Z       Z      )
#
#         PDG            Width
DECAY        35     5.21497825E+01   # H decays
#          BR         NDA      ID1       ID2
     1.29580336E-01    2           5        -5   # BR(H -> b       bb     )
     2.33228369E-02    2         -15        15   # BR(H -> tau+    tau-   )
     8.21079767E-05    2         -13        13   # BR(H -> mu+     mu-    )
     5.14061259E-05    2           3        -3   # BR(H -> s       sb     )
     1.55128083E-07    2           4        -4   # BR(H -> c       cb     )
     1.52825789E-02    2           6        -6   # BR(H -> t       tb     )
     5.53709866E-06    2          21        21   # BR(H -> g       g      )
     4.17922478E-09    2          22        22   # BR(H -> gam     gam    )
     7.04670752E-09    2          23        22   # BR(H -> Z       gam    )
     4.75588218E-06    2          24       -24   # BR(H -> W+      W-     )
     2.37335777E-06    2          23        23   # BR(H -> Z       Z      )
     1.99968883E-05    2          25        25   # BR(H -> h       h      )
     1.14014090E-01    2     1000024  -1000024   # BR(H -> ~chi_1+ ~chi_1-)
     6.00165079E-02    2     1000037  -1000037   # BR(H -> ~chi_2+ ~chi_2-)
     1.67695190E-01    2     1000024  -1000037   # BR(H -> ~chi_1+ ~chi_2-)
     1.67695190E-01    2     1000037  -1000024   # BR(H -> ~chi_2+ ~chi_1-)
     4.51734177E-02    2     1000022   1000022   # BR(H -> ~chi_10 ~chi_10)
     1.00204352E-03    2     1000023   1000023   # BR(H -> ~chi_20 ~chi_20)
     3.02070814E-02    2     1000025   1000025   # BR(H -> ~chi_30 ~chi_30)
     1.33022945E-02    2     1000022   1000023   # BR(H -> ~chi_10 ~chi_20)
     6.78086617E-02    2     1000022   1000025   # BR(H -> ~chi_10 ~chi_30)
     9.69102960E-02    2     1000023   1000025   # BR(H -> ~chi_20 ~chi_30)
     2.39575051E-07    2     2000002  -2000002   # BR(H -> ~u_R    ~u_R*  )
     2.39575051E-07    2     2000004  -2000004   # BR(H -> ~c_R    ~c_R*  )
     4.11512861E-04    2     1000006  -1000006   # BR(H -> ~t_1    ~t_1*  )
     1.22483639E-03    2     1000006  -2000006   # BR(H -> ~t_1    ~t_2*  )
     1.22483639E-03    2     2000006  -1000006   # BR(H -> ~t_2    ~t_1*  )
     4.98904829E-06    2     1000005  -1000005   # BR(H -> ~b_1    ~b_1*  )
     2.92838058E-02    2     1000005  -2000005   # BR(H -> ~b_1    ~b_2*  )
     2.92838058E-02    2     2000005  -1000005   # BR(H -> ~b_2    ~b_1*  )
     5.14276177E-07    2     2000011  -2000011   # BR(H -> ~e_R-   ~e_R+  )
     5.14276177E-07    2     2000013  -2000013   # BR(H -> ~mu_R-  ~mu_R+ )
     5.01523529E-05    2     1000015  -1000015   # BR(H -> ~tau_1- ~tau_1+)
     5.36953146E-05    2     2000015  -2000015   # BR(H -> ~tau_2- ~tau_2+)
     3.14162856E-03    2     1000015  -2000015   # BR(H -> ~tau_1- ~tau_2+)
     3.14162856E-03    2     2000015  -1000015   # BR(H -> ~tau_2- ~tau_1+)
     7.32463635E-07    2     1000016  -1000016   # BR(H -> ~nu_tauL ~nu_tauL*)
#
#         PDG            Width
DECAY        36     5.21405616E+01   # A decays
#          BR         NDA      ID1       ID2
     1.29624877E-01    2           5        -5   # BR(A -> b       bb     )
     2.33272376E-02    2         -15        15   # BR(A -> tau+    tau-   )
     8.21233839E-05    2         -13        13   # BR(A -> mu+     mu-    )
     5.14369998E-05    2           3        -3   # BR(A -> s       sb     )
     1.56023704E-07    2           4        -4   # BR(A -> c       cb     )
     1.53309349E-02    2           6        -6   # BR(A -> t       tb     )
     2.01697257E-05    2          21        21   # BR(A -> g       g      )
     3.18675914E-09    2          22        22   # BR(A -> gam     gam    )
     2.25567181E-08    2          23        22   # BR(A -> Z       gam    )
     4.82309216E-06    2          23        25   # BR(A -> Z       h      )
     9.70334997E-02    2     1000024  -1000024   # BR(A -> ~chi_1+ ~chi_1-)
     4.33571408E-02    2     1000037  -1000037   # BR(A -> ~chi_2+ ~chi_2-)
     1.84576983E-01    2     1000024  -1000037   # BR(A -> ~chi_1+ ~chi_2-)
     1.84576983E-01    2     1000037  -1000024   # BR(A -> ~chi_2+ ~chi_1-)
     3.58937466E-02    2     1000022   1000022   # BR(A -> ~chi_10 ~chi_10)
     1.45835479E-03    2     1000023   1000023   # BR(A -> ~chi_20 ~chi_20)
     2.23644451E-02    2     1000025   1000025   # BR(A -> ~chi_30 ~chi_30)
     1.90503389E-02    2     1000022   1000023   # BR(A -> ~chi_10 ~chi_20)
     5.63793214E-02    2     1000022   1000025   # BR(A -> ~chi_10 ~chi_30)
     1.19303403E-01    2     1000023   1000025   # BR(A -> ~chi_20 ~chi_30)
     1.29717953E-03    2     1000006  -2000006   # BR(A -> ~t_1    ~t_2*  )
     1.29717953E-03    2    -1000006   2000006   # BR(A -> ~t_1*   ~t_2   )
     2.92907799E-02    2     1000005  -2000005   # BR(A -> ~b_1    ~b_2*  )
     2.92907799E-02    2    -1000005   2000005   # BR(A -> ~b_1*   ~b_2   )
     3.19404006E-03    2     1000015  -2000015   # BR(A -> ~tau_1- ~tau_2+)
     3.19404006E-03    2    -1000015   2000015   # BR(A -> ~tau_1+ ~tau_2-)
#
#         PDG            Width
DECAY        37     5.90486992E+01   # H+ decays
#          BR         NDA      ID1       ID2
     2.00970301E-04    2           4        -5   # BR(H+ -> c       bb     )
     2.06059614E-02    2         -15        16   # BR(H+ -> tau+    nu_tau )
     7.25431494E-05    2         -13        14   # BR(H+ -> mu+     nu_mu  )
     2.00969894E-06    2           2        -5   # BR(H+ -> u       bb     )
     2.27240935E-06    2           2        -3   # BR(H+ -> u       sb     )
     4.48600730E-05    2           4        -3   # BR(H+ -> c       sb     )
     1.32742617E-01    2           6        -5   # BR(H+ -> t       bb     )
     4.26573916E-06    2          24        25   # BR(H+ -> W+      h      )
     7.88550282E-14    2          24        36   # BR(H+ -> W+      A      )
     2.98981254E-04    2     1000024   1000022   # BR(H+ -> ~chi_1+ ~chi_10)
     4.07975614E-02    2     1000024   1000023   # BR(H+ -> ~chi_1+ ~chi_20)
     2.15084309E-01    2     1000024   1000025   # BR(H+ -> ~chi_1+ ~chi_30)
     2.35828258E-01    2     1000037   1000022   # BR(H+ -> ~chi_2+ ~chi_10)
     1.82018652E-01    2     1000037   1000023   # BR(H+ -> ~chi_2+ ~chi_20)
     1.25957606E-06    2     1000037   1000025   # BR(H+ -> ~chi_2+ ~chi_30)
     5.68914928E-03    2    -1000015   1000016   # BR(H+ -> ~tau_1+ ~nu_tauL)
     3.00726379E-05    2    -2000015   1000016   # BR(H+ -> ~tau_2+ ~nu_tauL)
     6.58248819E-04    2     1000006  -1000005   # BR(H+ -> ~t_1    ~b_1*  )
     2.05566121E-03    2     1000006  -2000005   # BR(H+ -> ~t_1    ~b_2*  )
     1.63862347E-01    2     2000006  -1000005   # BR(H+ -> ~t_2    ~b_1*  )
