#
#                              ======================
#                              | THE SUSYHIT OUTPUT |
#                              ======================
#
#
#              ------------------------------------------------------
#              |     This is the output of the SUSY-HIT package     |
#              |  created by A.Djouadi, M.Muehlleitner and M.Spira. |
#              |  In case of problems with SUSY-HIT email to        |
#              |           margarete.muehlleitner@cern.ch           |
#              |           michael.spira@psi.ch                     |
#              |           abdelhak.djouadi@cern.ch                 |
#              ------------------------------------------------------
#
#              ------------------------------------------------------
#              |  SUSY Les Houches Accord - MSSM Spectrum + Decays  |
#              |              based on the decay programs           |
#              |                                                    |
#              |                     SDECAY 1.3b                    |
#              |                                                    |
#              |  Authors: M.Muhlleitner, A.Djouadi and Y.Mambrini  |
#              |  Ref.:    Comput.Phys.Commun.168(2005)46           |
#              |           [hep-ph/0311167]                         |
#              |                                                    |
#              |                     HDECAY 3.4                     |
#              |                                                    |
#              |  By: A.Djouadi,J.Kalinowski,M.Muhlleitner,M.Spira  |
#              |  Ref.:    Comput.Phys.Commun.108(1998)56           |
#              |           [hep-ph/9704448]                         |
#              |                                                    |
#              |                                                    |
#              |  If not stated otherwise all DRbar couplings and   |
#              |  soft SUSY breaking masses are given at the scale  |
#              |  Q=  0.28599210E+04
#              |                                                    |
#              ------------------------------------------------------
#
#
BLOCK DCINFO  # Decay Program information
     1   SDECAY/HDECAY # decay calculator
     2   1.3b  /3.4    # version number
#
BLOCK SPINFO  # Spectrum calculator information
     1     SOFTSUSY    # spectrum calculator               
     2     3.4.0       # version number                    
#
BLOCK MODSEL  # Model selection
     1     0   #  nonUniversal                                     
#
BLOCK SMINPUTS  # Standard Model inputs
         1     1.27908970E+02   # alpha_em^-1(M_Z)^MSbar
         2     1.16637870E-05   # G_F [GeV^-2]
         3     1.18400000E-01   # alpha_S(M_Z)^MSbar
         4     9.11876000E+01   # M_Z pole mass
         5     4.18000000E+00   # mb(mb)^MSbar
         6     1.73200000E+02   # mt pole mass
         7     1.77700000E+00   # mtau pole mass
#
BLOCK MINPAR  # Input parameters - minimal models
         3     1.54200000E+01   # tanb                
#
BLOCK EXTPAR  # Input parameters - non-minimal models
         0    -1.00000000E+00   # Set                 
         1     3.58301000E+03   # M_1(MX)             
         2    -5.75470000E+02   # M_2(MX)             
         3     1.34149000E+03   # M_3(MX)             
        11     3.53529000E+03   # At(MX)              
        12     1.48634000E+03   # Ab(MX)              
        13    -4.06820000E+02   # Atau(MX)            
        23     1.73080000E+02   # mu(MX)              
        26     3.25815000E+03   # mA(pole)            
        31     2.63650000E+02   # meL(MX)             
        32     2.63650000E+02   # mmuL(MX)            
        33     1.40980000E+02   # mtauL(MX)           
        34     3.86502000E+03   # meR(MX)             
        35     3.86502000E+03   # mmuR(MX)            
        36     3.49212000E+03   # mtauR(MX)           
        41     2.01673000E+03   # mqL1(MX)            
        42     2.01673000E+03   # mqL2(MX)            
        43     3.49709000E+03   # mqL3(MX)            
        44     1.56148000E+03   # muR(MX)             
        45     1.56148000E+03   # mcR(MX)             
        46     2.33748000E+03   # mtR(MX)             
        47     2.23460000E+02   # mdR(MX)             
        48     2.23460000E+02   # msR(MX)             
        49     3.15572000E+03   # mbR(MX)             
#
BLOCK MASS  # Mass Spectrum
# PDG code           mass       particle
        24     8.03927148E+01   # W+
        25     1.26298348E+02   # h
        35     3.25818322E+03   # H
        36     3.25814983E+03   # A
        37     3.25953150E+03   # H+
         5     4.81876030E+00   # b-quark pole mass calculated from mb(mb)_Msbar
   1000001     2.07380318E+03   # ~d_L
   2000001     4.68406438E+02   # ~d_R
   1000002     2.07247336E+03   # ~u_L
   2000002     1.63638333E+03   # ~u_R
   1000003     2.07380318E+03   # ~s_L
   2000003     4.68406438E+02   # ~s_R
   1000004     2.07247336E+03   # ~c_L
   2000004     1.63638333E+03   # ~c_R
   1000005     3.19330696E+03   # ~b_1
   2000005     3.50604685E+03   # ~b_2
   1000006     2.32689651E+03   # ~t_1
   2000006     3.51335621E+03   # ~t_2
   1000011     3.01263329E+02   # ~e_L
   2000011     3.87332830E+03   # ~e_R
   1000012     2.90503450E+02   # ~nu_eL
   1000013     3.01263329E+02   # ~mu_L
   2000013     3.87332830E+03   # ~mu_R
   1000014     2.90503450E+02   # ~nu_muL
   1000015     1.95972721E+02   # ~tau_1
   2000015     3.50037415E+03   # ~tau_2
   1000016     1.79237996E+02   # ~nu_tauL
   1000021     1.51491670E+03   # ~g
   1000022    -1.76147597E+02   # ~chi_10
   1000023     1.86486893E+02   # ~chi_20
   1000025    -6.05007963E+02   # ~chi_30
   1000035     3.53774025E+03   # ~chi_40
   1000024     1.80689346E+02   # ~chi_1+
   1000037     6.05279013E+02   # ~chi_2+
#
BLOCK NMIX  # Neutralino Mixing Matrix
  1  1    -7.46224338E-03   # N_11
  1  2    -1.20050015E-01   # N_12
  1  3     7.15416549E-01   # N_13
  1  4     6.88267005E-01   # N_14
  2  1    -9.80077860E-03   # N_21
  2  2    -7.67587057E-02   # N_22
  2  3    -6.97933577E-01   # N_23
  2  4     7.11969640E-01   # N_24
  3  1    -1.50970903E-03   # N_31
  3  2     9.89795975E-01   # N_32
  3  3     3.26461884E-02   # N_33
  3  4     1.38693460E-01   # N_34
  4  1     9.99922987E-01   # N_41
  4  2    -1.53845432E-04   # N_42
  4  3    -1.45250568E-03   # N_43
  4  4     1.23242086E-02   # N_44
#
BLOCK UMIX  # Chargino Mixing Matrix U
  1  1    -4.69121370E-02   # U_11
  1  2     9.98899020E-01   # U_12
  2  1    -9.98899020E-01   # U_21
  2  2    -4.69121370E-02   # U_22
#
BLOCK VMIX  # Chargino Mixing Matrix V
  1  1     1.98005040E-01   # V_11
  1  2     9.80201002E-01   # V_12
  2  1     9.80201002E-01   # V_21
  2  2    -1.98005040E-01   # V_22
#
BLOCK STOPMIX  # Stop Mixing Matrix
  1  1    -6.94978318E-02   # cos(theta_t)
  1  2     9.97582103E-01   # sin(theta_t)
  2  1    -9.97582103E-01   # -sin(theta_t)
  2  2    -6.94978318E-02   # cos(theta_t)
#
BLOCK SBOTMIX  # Sbottom Mixing Matrix
  1  1     1.32374791E-03   # cos(theta_b)
  1  2     9.99999124E-01   # sin(theta_b)
  2  1    -9.99999124E-01   # -sin(theta_b)
  2  2     1.32374791E-03   # cos(theta_b)
#
BLOCK STAUMIX  # Stau Mixing Matrix
  1  1     9.99999910E-01   # cos(theta_tau)
  1  2     4.24264059E-04   # sin(theta_tau)
  2  1    -4.24264059E-04   # -sin(theta_tau)
  2  2     9.99999910E-01   # cos(theta_tau)
#
BLOCK ALPHA  # Higgs mixing
          -6.80227824E-02   # Mixing angle in the neutral Higgs boson sector
#
BLOCK HMIX Q=  2.85992100E+03  # DRbar Higgs Parameters
         1     1.75900954E+02   # mu(Q)MSSM           
         2     1.47108953E+01   # tan                 
         3     2.41307516E+02   # higgs               
         4     1.05001670E+07   # mA^2(Q)MSSM         
#
BLOCK GAUGE Q=  2.85992100E+03  # The gauge couplings
     1     3.65516376E-01   # gprime(Q) DRbar
     2     6.43229139E-01   # g(Q) DRbar
     3     1.02836409E+00   # g3(Q) DRbar
#
BLOCK AU Q=  2.85992100E+03  # The trilinear couplings
  1  1     0.00000000E+00   # A_u(Q) DRbar
  2  2     0.00000000E+00   # A_c(Q) DRbar
  3  3     3.53529001E+03   # A_t(Q) DRbar
#
BLOCK AD Q=  2.85992100E+03  # The trilinear couplings
  1  1     0.00000000E+00   # A_d(Q) DRbar
  2  2     0.00000000E+00   # A_s(Q) DRbar
  3  3     1.48634000E+03   # A_b(Q) DRbar
#
BLOCK AE Q=  2.85992100E+03  # The trilinear couplings
  1  1     0.00000000E+00   # A_e(Q) DRbar
  2  2     0.00000000E+00   # A_mu(Q) DRbar
  3  3    -4.06820000E+02   # A_tau(Q) DRbar
#
BLOCK Yu Q=  2.85992100E+03  # The Yukawa couplings
  1  1     0.00000000E+00   # y_u(Q) DRbar
  2  2     0.00000000E+00   # y_c(Q) DRbar
  3  3     8.39989071E-01   # y_t(Q) DRbar
#
BLOCK Yd Q=  2.85992100E+03  # The Yukawa couplings
  1  1     0.00000000E+00   # y_d(Q) DRbar
  2  2     0.00000000E+00   # y_s(Q) DRbar
  3  3     1.96043029E-01   # y_b(Q) DRbar
#
BLOCK Ye Q=  2.85992100E+03  # The Yukawa couplings
  1  1     0.00000000E+00   # y_e(Q) DRbar
  2  2     0.00000000E+00   # y_mu(Q) DRbar
  3  3     1.47227875E-01   # y_tau(Q) DRbar
#
BLOCK MSOFT Q=  2.85992100E+03  # The soft SUSY breaking masses at the scale Q
         1     3.58301000E+03   # M_1(Q)              
         2    -5.75470000E+02   # M_2(Q)              
         3     1.34149000E+03   # M_3(Q)              
        21     1.05129093E+07   # mH1^2(Q)            
        22     1.79848812E+05   # mH2^2(Q)            
        31     2.63650000E+02   # meL(Q)              
        32     2.63650000E+02   # mmuL(Q)             
        33     1.40980000E+02   # mtauL(Q)            
        34     3.86502000E+03   # meR(Q)              
        35     3.86502000E+03   # mmuR(Q)             
        36     3.49212000E+03   # mtauR(Q)            
        41     2.01673000E+03   # mqL1(Q)             
        42     2.01673000E+03   # mqL2(Q)             
        43     3.49709000E+03   # mqL3(Q)             
        44     1.56148000E+03   # muR(Q)              
        45     1.56148000E+03   # mcR(Q)              
        46     2.33748000E+03   # mtR(Q)              
        47     2.23459974E+02   # mdR(Q)              
        48     2.23459974E+02   # msR(Q)              
        49     3.15572000E+03   # mbR(Q)              
#
Block HiggsBoundsInputHiggsCouplingsFermions
# ScalarNormEffCoupSq PseudoSNormEffCoupSq NP   IP1 IP2 IP2
    1.00442898E+00    0.00000000E+00        3  25   5   5  # h0-b-b eff. coupling^2, normalised to SM
    2.16406012E+02    0.00000000E+00        3  35   5   5  # H0-b-b eff. coupling^2, normalised to SM
    0.00000000E+00    2.16410441E+02        3  36   5   5  # A0-b-b eff. coupling^2, normalised to SM
#
    9.99979534E-01    0.00000000E+00        3  25   6   6  # h0-t-t eff. coupling^2, normalised to SM
    4.64131481E-03    0.00000000E+00        3  35   6   6  # H0-t-t eff. coupling^2, normalised to SM
    0.00000000E+00    4.62084915E-03        3  36   6   6  # A0-t-t eff. coupling^2, normalised to SM
#
    1.00442898E+00    0.00000000E+00        3  25  15  15  # h0-tau-tau eff. coupling^2, normalised to SM
    2.16406012E+02    0.00000000E+00        3  35  15  15  # H0-tau-tau eff. coupling^2, normalised to SM
    0.00000000E+00    2.16410441E+02        3  36  15  15  # A0-tau-tau eff. coupling^2, normalised to SM
#
Block HiggsBoundsInputHiggsCouplingsBosons
    9.99999977E-01        3  25  24  24  # h0-W-W eff. coupling^2, normalised to SM
    2.26107119E-08        3  35  24  24  # H0-W-W eff. coupling^2, normalised to SM
    0.00000000E+00        3  36  24  24  # A0-W-W eff. coupling^2, normalised to SM
#
    9.99999977E-01        3  25  23  23  # h0-Z-Z eff. coupling^2, normalised to SM
    2.26107119E-08        3  35  23  23  # H0-Z-Z eff. coupling^2, normalised to SM
    0.00000000E+00        3  36  23  23  # A0-Z-Z eff. coupling^2, normalised to SM
#
    8.93526361E-01        3  25  21  21  # h0-g-g eff. coupling^2, normalised to SM
    8.39319180E-15        3  35  21  21  # H0-g-g eff. coupling^2, normalised to SM
    6.55362116E-13        3  36  21  21  # A0-g-g eff. coupling^2, normalised to SM
#
    0.00000000E+00        3  25  25  23  # h0-h0-Z eff. coupling^2, normalised to SM
    0.00000000E+00        3  35  25  23  # H0-h0-Z eff. coupling^2, normalised to SM
    2.26107119E-08        3  36  25  23  # A0-h0-Z eff. coupling^2, normalised to SM
    0.00000000E+00        3  35  35  23  # H0-H0-Z eff. coupling^2, normalised to SM
    9.99999977E-01        3  36  35  23  # A0-H0-Z eff. coupling^2, normalised to SM
    0.00000000E+00        3  36  36  23  # A0-A0-Z eff. coupling^2, normalised to SM
#
    0.00000000E+00        4  25  21  21  23  # h0-g-g-Z eff. coupling^2, normalised to SM
    0.00000000E+00        4  35  21  21  23  # H0-g-g-Z eff. coupling^2, normalised to SM
    0.00000000E+00        4  36  21  21  23  # A0-g-g-Z eff. coupling^2, normalised to SM
#
#
#
#                             =================
#                             |The decay table|
#                             =================
#
# - The QCD corrections to the decays gluino -> squark  + quark
#                                     squark -> gaugino + quark_prime
#                                     squark -> squark_prime + Higgs
#                                     squark -> gluino  + quark
#   are included.
#
# - The multi-body decays for the inos, stops and sbottoms are included.
#
# - The loop induced decays for the gluino, neutralinos and stops
#   are included.
#
# - The SUSY decays of the top quark are included.
#
#
#         PDG            Width
DECAY         6     1.45701690E+00   # top decays
#          BR         NDA      ID1       ID2
     1.00000000E+00    2           5        24   # BR(t ->  b    W+)
#
#         PDG            Width
DECAY   1000021     5.64572523E+01   # gluino decays
#          BR         NDA      ID1       ID2
     2.50000000E-01    2     2000001        -1   # BR(~g -> ~d_R  db)
     2.50000000E-01    2    -2000001         1   # BR(~g -> ~d_R* d )
     2.50000000E-01    2     2000003        -3   # BR(~g -> ~s_R  sb)
     2.50000000E-01    2    -2000003         3   # BR(~g -> ~s_R* s )
#
#         PDG            Width
DECAY   1000006     1.04922573E+02   # stop1 decays
#          BR         NDA      ID1       ID2
     1.45769324E-01    2     1000022         6   # BR(~t_1 -> ~chi_10 t )
     1.55438142E-01    2     1000023         6   # BR(~t_1 -> ~chi_20 t )
     2.73363051E-03    2     1000025         6   # BR(~t_1 -> ~chi_30 t )
     3.00529783E-01    2     1000024         5   # BR(~t_1 -> ~chi_1+ b )
     5.71796433E-03    2     1000037         5   # BR(~t_1 -> ~chi_2+ b )
     3.89811156E-01    2     1000021         6   # BR(~t_1 -> ~g      t )
#
#         PDG            Width
DECAY   2000006     2.48459677E+02   # stop2 decays
#          BR         NDA      ID1       ID2
     9.27455289E-02    2     1000022         6   # BR(~t_2 -> ~chi_10 t )
     9.91577662E-02    2     1000023         6   # BR(~t_2 -> ~chi_20 t )
     5.91041172E-02    2     1000025         6   # BR(~t_2 -> ~chi_30 t )
     1.20448876E-02    2     1000024         5   # BR(~t_2 -> ~chi_1+ b )
     1.08688670E-01    2     1000037         5   # BR(~t_2 -> ~chi_2+ b )
     5.25701577E-01    2     1000021         6   # BR(~t_2 -> ~g      t )
     5.44157146E-02    2     1000006        25   # BR(~t_2 -> ~t_1    h )
     4.81408140E-02    2     1000006        23   # BR(~t_2 -> ~t_1    Z )
     9.24065486E-07    2     1000005        24   # BR(~t_2 -> ~b_1    W+)
#
#         PDG            Width
DECAY   1000005     1.12426796E+02   # sbottom1 decays
#          BR         NDA      ID1       ID2
     1.10596108E-02    2     1000022         5   # BR(~b_1 -> ~chi_10 b )
     1.05015783E-02    2     1000023         5   # BR(~b_1 -> ~chi_20 b )
     1.77250084E-05    2     1000025         5   # BR(~b_1 -> ~chi_30 b )
     2.14114464E-02    2    -1000024         6   # BR(~b_1 -> ~chi_1- t )
     3.63380322E-05    2    -1000037         6   # BR(~b_1 -> ~chi_2- t )
     9.56973143E-01    2     1000021         5   # BR(~b_1 -> ~g      b )
     1.58936841E-07    2     1000006       -24   # BR(~b_1 -> ~t_1    W-)
#
#         PDG            Width
DECAY   2000005     2.45290751E+02   # sbottom2 decays
#          BR         NDA      ID1       ID2
     6.38415548E-03    2     1000022         5   # BR(~b_2 -> ~chi_10 b )
     5.62527717E-03    2     1000023         5   # BR(~b_2 -> ~chi_20 b )
     5.42936058E-02    2     1000025         5   # BR(~b_2 -> ~chi_30 b )
     1.90990349E-01    2    -1000024         6   # BR(~b_2 -> ~chi_1- t )
     1.18300211E-01    2    -1000037         6   # BR(~b_2 -> ~chi_2- t )
     5.30429463E-01    2     1000021         5   # BR(~b_2 -> ~g      b )
     3.82130352E-07    2     1000005        25   # BR(~b_2 -> ~b_1    h )
     4.36700315E-07    2     1000005        23   # BR(~b_2 -> ~b_1    Z )
     9.39761201E-02    2     1000006       -24   # BR(~b_2 -> ~t_1    W-)
#
#         PDG            Width
DECAY   1000002     5.90441878E+01   # sup_L decays
#          BR         NDA      ID1       ID2
     2.00429760E-03    2     1000022         2   # BR(~u_L -> ~chi_10 u)
     8.38238249E-04    2     1000023         2   # BR(~u_L -> ~chi_20 u)
     1.13397869E-01    2     1000025         2   # BR(~u_L -> ~chi_30 u)
     1.06449668E-02    2     1000024         1   # BR(~u_L -> ~chi_1+ d)
     2.22511945E-01    2     1000037         1   # BR(~u_L -> ~chi_2+ d)
     6.50602684E-01    2     1000021         2   # BR(~u_L -> ~g      u)
#
#         PDG            Width
DECAY   2000002     2.85855581E+00   # sup_R decays
#           BR         NDA      ID1       ID2
     7.00209188E-05    2     1000022         2   # BR(~u_R -> ~chi_10 u)
     1.20458114E-04    2     1000023         2   # BR(~u_R -> ~chi_20 u)
     2.19733888E-06    2     1000025         2   # BR(~u_R -> ~chi_30 u)
     9.99807324E-01    2     1000021         2   # BR(~u_R -> ~g      u)
#
#         PDG            Width
DECAY   1000001     5.91108709E+01   # sdown_L decays
#          BR         NDA      ID1       ID2
     1.91122719E-03    2     1000022         1   # BR(~d_L -> ~chi_10 d)
     7.60590076E-04    2     1000023         1   # BR(~d_L -> ~chi_20 d)
     1.13502466E-01    2     1000025         1   # BR(~d_L -> ~chi_30 d)
     5.97265448E-04    2    -1000024         2   # BR(~d_L -> ~chi_1- u)
     2.31028114E-01    2    -1000037         2   # BR(~d_L -> ~chi_2- u)
     6.52200337E-01    2     1000021         1   # BR(~d_L -> ~g      d)
#
#         PDG            Width
DECAY   2000001     3.13960053E-05   # sdown_R decays
#           BR         NDA      ID1       ID2
     3.76325774E-01    2     1000022         1   # BR(~d_R -> ~chi_10 d)
     6.23674226E-01    2     1000023         1   # BR(~d_R -> ~chi_20 d)
#
#         PDG            Width
DECAY   1000004     4.67514710E+01   # scharm_L decays
#          BR         NDA      ID1       ID2
     2.65288748E-03    2     1000022         4   # BR(~c_L -> ~chi_10 c)
     1.10936802E-03    2     1000023         4   # BR(~c_L -> ~chi_20 c)
     1.49485071E-01    2     1000025         4   # BR(~c_L -> ~chi_30 c)
     1.40889972E-02    2     1000024         3   # BR(~c_L -> ~chi_1+ s)
     2.93322769E-01    2     1000037         3   # BR(~c_L -> ~chi_2+ s)
     5.39340907E-01    2     1000021         4   # BR(~c_L -> ~g      c)
#
#         PDG            Width
DECAY   2000004     1.87640781E+00   # scharm_R decays
#           BR         NDA      ID1       ID2
     1.12089288E-04    2     1000022         4   # BR(~c_R -> ~chi_10 c)
     1.92803593E-04    2     1000023         4   # BR(~c_R -> ~chi_20 c)
     3.49996475E-06    2     1000025         4   # BR(~c_R -> ~chi_30 c)
     9.99691607E-01    2     1000021         4   # BR(~c_R -> ~g      c)
#
#         PDG            Width
DECAY   1000003     4.67649731E+01   # sstrange_L decays
#          BR         NDA      ID1       ID2
     2.53178025E-03    2     1000022         3   # BR(~s_L -> ~chi_10 s)
     1.00743245E-03    2     1000023         3   # BR(~s_L -> ~chi_20 s)
     1.49746694E-01    2     1000025         3   # BR(~s_L -> ~chi_30 s)
     7.91151207E-04    2    -1000024         4   # BR(~s_L -> ~chi_1- c)
     3.04800291E-01    2    -1000037         4   # BR(~s_L -> ~chi_2- c)
     5.41122651E-01    2     1000021         3   # BR(~s_L -> ~g      s)
#
#         PDG            Width
DECAY   2000003     3.01748727E-05   # sstrange_R decays
#           BR         NDA      ID1       ID2
     3.76365747E-01    2     1000022         3   # BR(~s_R -> ~chi_10 s)
     6.23634253E-01    2     1000023         3   # BR(~s_R -> ~chi_20 s)
#
#         PDG            Width
DECAY   1000011     1.37307149E-02   # selectron_L decays
#          BR         NDA      ID1       ID2
     6.04204125E-01    2     1000022        11   # BR(~e_L -> ~chi_10 e-)
     2.32860254E-01    2     1000023        11   # BR(~e_L -> ~chi_20 e-)
     1.62935621E-01    2    -1000024        12   # BR(~e_L -> ~chi_1- nu_e)
#
#         PDG            Width
DECAY   2000011     5.68910417E-01   # selectron_R decays
#           BR         NDA      ID1       ID2
     2.00703440E-03    2     1000022        11   # BR(~e_R -> ~chi_10 e-)
     3.46034660E-03    2     1000023        11   # BR(~e_R -> ~chi_20 e-)
     7.85138265E-05    2     1000025        11   # BR(~e_R -> ~chi_30 e-)
     9.94454105E-01    2     1000035        11   # BR(~e_R -> ~chi_40 e-)
#
#         PDG            Width
DECAY   1000013     1.37307082E-02   # smuon_L decays
#          BR         NDA      ID1       ID2
     6.04204080E-01    2     1000022        13   # BR(~mu_L -> ~chi_10 mu-)
     2.32860218E-01    2     1000023        13   # BR(~mu_L -> ~chi_20 mu-)
     1.62935702E-01    2    -1000024        14   # BR(~mu_L -> ~chi_1- nu_mu)
#
#         PDG            Width
DECAY   2000013     5.68910389E-01   # smuon_R decays
#           BR         NDA      ID1       ID2
     2.00703450E-03    2     1000022        13   # BR(~mu_R -> ~chi_10 mu-)
     3.46034681E-03    2     1000023        13   # BR(~mu_R -> ~chi_20 mu-)
     7.85138305E-05    2     1000025        13   # BR(~mu_R -> ~chi_30 mu-)
     9.94454105E-01    2     1000035        13   # BR(~mu_R -> ~chi_40 mu-)
#
#         PDG            Width
DECAY   1000015     2.72856028E-03   # stau_1 decays
#          BR         NDA      ID1       ID2
     8.03419111E-01    2     1000022        15   # BR(~tau_1 -> ~chi_10  tau-)
     1.67228195E-01    2     1000023        15   # BR(~tau_1 -> ~chi_20  tau-)
     2.93526946E-02    2    -1000024        16   # BR(~tau_1 -> ~chi_1-  nu_tau)
#
#         PDG            Width
DECAY   2000015     3.01847484E+00   # stau_2 decays
#          BR         NDA      ID1       ID2
     2.54887703E-01    2     1000022        15   # BR(~tau_2 -> ~chi_10  tau-)
     2.42864581E-01    2     1000023        15   # BR(~tau_2 -> ~chi_20  tau-)
     5.55484293E-04    2     1000025        15   # BR(~tau_2 -> ~chi_30  tau-)
     4.96234629E-01    2    -1000024        16   # BR(~tau_2 -> ~chi_1-  nu_tau)
     1.11908303E-03    2    -1000037        16   # BR(~tau_2 -> ~chi_2-  nu_tau)
     5.61955239E-04    2     1000016       -37   # BR(~tau_2 -> ~nu_tauL H-)
     1.61329213E-03    2     1000016       -24   # BR(~tau_2 -> ~nu_tauL W-)
     8.38441441E-04    2     1000015        25   # BR(~tau_2 -> ~tau_1   h)
     2.48466035E-04    2     1000015        35   # BR(~tau_2 -> ~tau_1   H)
     2.48603280E-04    2     1000015        36   # BR(~tau_2 -> ~tau_1   A)
     8.27762277E-04    2     1000015        23   # BR(~tau_2 -> ~tau_1   Z)
#
#         PDG            Width
DECAY   1000012     4.37489583E-02   # snu_eL decays
#          BR         NDA      ID1       ID2
     1.46554858E-01    2     1000022        12   # BR(~nu_eL -> ~chi_10 nu_e)
     4.78701353E-02    2     1000023        12   # BR(~nu_eL -> ~chi_20 nu_e)
     8.05575007E-01    2     1000024        11   # BR(~nu_eL -> ~chi_1+ e-)
#
#         PDG            Width
DECAY   1000014     4.37489335E-02   # snu_muL decays
#          BR         NDA      ID1       ID2
     1.46554941E-01    2     1000022        14   # BR(~nu_muL -> ~chi_10 nu_mu)
     4.78701624E-02    2     1000023        14   # BR(~nu_muL -> ~chi_20 nu_mu)
     8.05574897E-01    2     1000024        13   # BR(~nu_muL -> ~chi_1+ mu-)
#
#         PDG            Width
DECAY   1000016     1.15626942E-05   # snu_tauL decays
#          BR         NDA      ID1       ID2
     1.00000000E+00    2     1000022        16   # BR(~nu_tauL -> ~chi_10 nu_tau)
#
#         PDG            Width
DECAY   1000024     2.25012924E-09   # chargino1+ decays
#           BR         NDA      ID1       ID2       ID3
     3.50394846E-01    3     1000022         2        -1   # BR(~chi_1+ -> ~chi_10 u    db)
     3.50394846E-01    3     1000022         4        -3   # BR(~chi_1+ -> ~chi_10 c    sb)
     1.17185275E-01    3     1000022       -11        12   # BR(~chi_1+ -> ~chi_10 e+   nu_e)
     1.17185275E-01    3     1000022       -13        14   # BR(~chi_1+ -> ~chi_10 mu+  nu_mu)
     6.48397582E-02    3     1000022       -15        16   # BR(~chi_1+ -> ~chi_10 tau+ nu_tau)
#
#         PDG            Width
DECAY   1000037     1.37985685E+01   # chargino2+ decays
#          BR         NDA      ID1       ID2
     1.02746752E-01    2     1000012       -11   # BR(~chi_2+ -> ~nu_eL   e+  )
     1.02746752E-01    2     1000014       -13   # BR(~chi_2+ -> ~nu_muL mu+ )
     1.44404617E-01    2     1000016       -15   # BR(~chi_2+ -> ~nu_tau1 tau+)
     1.01939390E-01    2    -1000011        12   # BR(~chi_2+ -> ~e_L+    nu_e)
     1.01939390E-01    2    -1000013        14   # BR(~chi_2+ -> ~mu_L+   nu_mu)
     1.44345959E-01    2    -1000015        16   # BR(~chi_2+ -> ~tau_1+  nu_tau)
     7.73619758E-02    2     1000024        23   # BR(~chi_2+ -> ~chi_1+  Z )
     7.49100323E-02    2     1000022        24   # BR(~chi_2+ -> ~chi_10  W+)
     7.85913924E-02    2     1000023        24   # BR(~chi_2+ -> ~chi_20  W+)
     7.10137398E-02    2     1000024        25   # BR(~chi_2+ -> ~chi_1+  h )
#
#         PDG            Width
DECAY   1000022     0.00000000E+00   # neutralino1 decays
#
#         PDG            Width
DECAY   1000023     2.26032081E-05   # neutralino2 decays
#          BR         NDA      ID1       ID2
     5.00000000E-01    2     1000016       -16   # BR(~chi_20 -> ~nu_tau1  nu_taub)
     5.00000000E-01    2    -1000016        16   # BR(~chi_20 -> ~nu_tau1* nu_tau )
#
#         PDG            Width
DECAY   1000025     1.38040664E+01   # neutralino3 decays
#          BR         NDA      ID1       ID2
     2.18494818E-02    2     1000022        23   # BR(~chi_30 -> ~chi_10   Z )
     5.45042093E-02    2     1000023        23   # BR(~chi_30 -> ~chi_20   Z )
     7.97295663E-02    2     1000024       -24   # BR(~chi_30 -> ~chi_1+   W-)
     7.97295663E-02    2    -1000024        24   # BR(~chi_30 -> ~chi_1-   W+)
     4.80056229E-02    2     1000022        25   # BR(~chi_30 -> ~chi_10   h )
     1.83455071E-02    2     1000023        25   # BR(~chi_30 -> ~chi_20   h )
     1.48033110E-08    2     2000001        -1   # BR(~chi_30 -> ~d_R      db)
     1.48033110E-08    2    -2000001         1   # BR(~chi_30 -> ~d_R*     d )
     1.48033110E-08    2     2000003        -3   # BR(~chi_30 -> ~s _R      sb)
     1.48033110E-08    2    -2000003         3   # BR(~chi_30 -> ~s _R*     s )
     4.98865117E-02    2     1000011       -11   # BR(~chi_30 -> ~e_L-     e+)
     4.98865117E-02    2    -1000011        11   # BR(~chi_30 -> ~e_L+     e-)
     4.98865117E-02    2     1000013       -13   # BR(~chi_30 -> ~mu_L-    mu+)
     4.98865117E-02    2    -1000013        13   # BR(~chi_30 -> ~mu_L+    mu-)
     7.06838969E-02    2     1000015       -15   # BR(~chi_30 -> ~tau_1-   tau+)
     7.06838969E-02    2    -1000015        15   # BR(~chi_30 -> ~tau_1+   tau-)
     5.24023975E-02    2     1000012       -12   # BR(~chi_30 -> ~nu_eL    nu_eb)
     5.24023975E-02    2    -1000012        12   # BR(~chi_30 -> ~nu_eL*   nu_e )
     5.24023975E-02    2     1000014       -14   # BR(~chi_30 -> ~nu_muL   nu_mub)
     5.24023975E-02    2    -1000014        14   # BR(~chi_30 -> ~nu_muL*  nu_mu )
     7.36562782E-02    2     1000016       -16   # BR(~chi_30 -> ~nu_tau1  nu_taub)
     7.36562782E-02    2    -1000016        16   # BR(~chi_30 -> ~nu_tau1* nu_tau )
#
#         PDG            Width
DECAY   1000035     8.94885789E+01   # neutralino4 decays
#          BR         NDA      ID1       ID2
     1.45733563E-02    2     1000022        23   # BR(~chi_40 -> ~chi_10   Z )
     9.67696858E-03    2     1000023        23   # BR(~chi_40 -> ~chi_20   Z )
     4.56963319E-04    2     1000025        23   # BR(~chi_40 -> ~chi_30   Z )
     2.32964323E-02    2     1000024       -24   # BR(~chi_40 -> ~chi_1+   W-)
     2.32964323E-02    2    -1000024        24   # BR(~chi_40 -> ~chi_1-   W+)
     7.26313875E-04    2     1000037       -24   # BR(~chi_40 -> ~chi_2+   W-)
     7.26313875E-04    2    -1000037        24   # BR(~chi_40 -> ~chi_2-   W+)
     9.68584162E-03    2     1000022        25   # BR(~chi_40 -> ~chi_10   h )
     9.79355923E-05    2     1000022        35   # BR(~chi_40 -> ~chi_10   H )
     3.49424524E-04    2     1000022        36   # BR(~chi_40 -> ~chi_10   A )
     1.67034932E-02    2     1000023        25   # BR(~chi_40 -> ~chi_20   h )
     3.24337195E-04    2     1000023        35   # BR(~chi_40 -> ~chi_20   H )
     8.10633264E-05    2     1000023        36   # BR(~chi_40 -> ~chi_20   A )
     2.29294424E-04    2     1000025        25   # BR(~chi_40 -> ~chi_30   h )
     4.21122205E-04    2     1000024       -37   # BR(~chi_40 -> ~chi_1+   H-)
     4.21122205E-04    2    -1000024        37   # BR(~chi_40 -> ~chi_1-   H+)
     3.66319772E-03    2     1000002        -2   # BR(~chi_40 -> ~u_L      ub)
     3.66319772E-03    2    -1000002         2   # BR(~chi_40 -> ~u_L*     u )
     8.38886692E-02    2     2000002        -2   # BR(~chi_40 -> ~u_R      ub)
     8.38886692E-02    2    -2000002         2   # BR(~chi_40 -> ~u_R*     u )
     3.67022781E-03    2     1000001        -1   # BR(~chi_40 -> ~d_L      db)
     3.67022781E-03    2    -1000001         1   # BR(~chi_40 -> ~d_L*     d )
     3.26798408E-02    2     2000001        -1   # BR(~chi_40 -> ~d_R      db)
     3.26798408E-02    2    -2000001         1   # BR(~chi_40 -> ~d_R*     d )
     3.66319650E-03    2     1000004        -4   # BR(~chi_40 -> ~c_L      cb)
     3.66319650E-03    2    -1000004         4   # BR(~chi_40 -> ~c_L*     c )
     8.38886570E-02    2     2000004        -4   # BR(~chi_40 -> ~c_R      cb)
     8.38886570E-02    2    -2000004         4   # BR(~chi_40 -> ~c_R*     c )
     3.67022781E-03    2     1000003        -3   # BR(~chi_40 -> ~s _L      sb)
     3.67022781E-03    2    -1000003         3   # BR(~chi_40 -> ~s _L*     s )
     3.26798408E-02    2     2000003        -3   # BR(~chi_40 -> ~s _R      sb)
     3.26798408E-02    2    -2000003         3   # BR(~chi_40 -> ~s _R*     s )
     4.45837645E-02    2     1000006        -6   # BR(~chi_40 -> ~t_1      tb)
     4.45837645E-02    2    -1000006         6   # BR(~chi_40 -> ~t_1*     t )
     1.20152440E-03    2     1000005        -5   # BR(~chi_40 -> ~b_1      bb)
     1.20152440E-03    2    -1000005         5   # BR(~chi_40 -> ~b_1*     b )
     2.75296474E-06    2     2000005        -5   # BR(~chi_40 -> ~b_2      bb)
     2.75296474E-06    2    -2000005         5   # BR(~chi_40 -> ~b_2*     b )
     2.58713060E-02    2     1000011       -11   # BR(~chi_40 -> ~e_L-     e+)
     2.58713060E-02    2    -1000011        11   # BR(~chi_40 -> ~e_L+     e-)
     2.58713060E-02    2     1000013       -13   # BR(~chi_40 -> ~mu_L-    mu+)
     2.58713060E-02    2    -1000013        13   # BR(~chi_40 -> ~mu_L+    mu-)
     2.60898045E-02    2     1000015       -15   # BR(~chi_40 -> ~tau_1-   tau+)
     2.60898045E-02    2    -1000015        15   # BR(~chi_40 -> ~tau_1+   tau-)
     4.63345483E-05    2     2000015       -15   # BR(~chi_40 -> ~tau_2-   tau+)
     4.63345483E-05    2    -2000015        15   # BR(~chi_40 -> ~tau_2+   tau-)
     2.59258923E-02    2     1000012       -12   # BR(~chi_40 -> ~nu_eL    nu_eb)
     2.59258923E-02    2    -1000012        12   # BR(~chi_40 -> ~nu_eL*   nu_e )
     2.59258923E-02    2     1000014       -14   # BR(~chi_40 -> ~nu_muL   nu_mub)
     2.59258923E-02    2    -1000014        14   # BR(~chi_40 -> ~nu_muL*  nu_mu )
     2.61443571E-02    2     1000016       -16   # BR(~chi_40 -> ~nu_tau1  nu_taub)
     2.61443571E-02    2    -1000016        16   # BR(~chi_40 -> ~nu_tau1* nu_tau )
#
#         PDG            Width
DECAY        25     4.21876557E-03   # h decays
#          BR         NDA      ID1       ID2
     5.76104150E-01    2           5        -5   # BR(h -> b       bb     )
     6.22511972E-02    2         -15        15   # BR(h -> tau+    tau-   )
     2.20336086E-04    2         -13        13   # BR(h -> mu+     mu-    )
     2.39987380E-04    2           3        -3   # BR(h -> s       sb     )
     2.07289400E-02    2           4        -4   # BR(h -> c       cb     )
     7.81937927E-02    2          21        21   # BR(h -> g       g      )
     2.29055577E-03    2          22        22   # BR(h -> gam     gam    )
     1.66016566E-03    2          22        23   # BR(h -> Z       gam    )
     2.29121619E-01    2          24       -24   # BR(h -> W+      W-     )
     2.91892556E-02    2          23        23   # BR(h -> Z       Z      )
#
#         PDG            Width
DECAY        35     4.82108080E+01   # H decays
#          BR         NDA      ID1       ID2
     1.59911075E-01    2           5        -5   # BR(H -> b       bb     )
     3.16744076E-02    2         -15        15   # BR(H -> tau+    tau-   )
     1.10907351E-04    2         -13        13   # BR(H -> mu+     mu-    )
     6.39360538E-05    2           3        -3   # BR(H -> s       sb     )
     1.27323741E-07    2           4        -4   # BR(H -> c       cb     )
     1.25337267E-02    2           6        -6   # BR(H -> t       tb     )
     2.33673233E-06    2          21        21   # BR(H -> g       g      )
     7.11449369E-09    2          22        22   # BR(H -> gam     gam    )
     5.28730671E-09    2          23        22   # BR(H -> Z       gam    )
     5.21587400E-06    2          24       -24   # BR(H -> W+      W-     )
     2.60267263E-06    2          23        23   # BR(H -> Z       Z      )
     2.01182612E-05    2          25        25   # BR(H -> h       h      )
     2.26141273E-02    2     1000024  -1000024   # BR(H -> ~chi_1+ ~chi_1-)
     1.61453599E-03    2     1000037  -1000037   # BR(H -> ~chi_2+ ~chi_2-)
     2.53225639E-01    2     1000024  -1000037   # BR(H -> ~chi_1+ ~chi_2-)
     2.53225639E-01    2     1000037  -1000024   # BR(H -> ~chi_2+ ~chi_1-)
     4.38859854E-03    2     1000022   1000022   # BR(H -> ~chi_10 ~chi_10)
     1.20677368E-03    2     1000023   1000023   # BR(H -> ~chi_20 ~chi_20)
     7.94294499E-04    2     1000025   1000025   # BR(H -> ~chi_30 ~chi_30)
     1.23337662E-04    2     1000022   1000023   # BR(H -> ~chi_10 ~chi_20)
     1.45690251E-01    2     1000022   1000025   # BR(H -> ~chi_10 ~chi_30)
     1.12781942E-01    2     1000023   1000025   # BR(H -> ~chi_20 ~chi_30)
     1.67984857E-07    2     2000001  -2000001   # BR(H -> ~d_R    ~d_R*  )
     1.67984857E-07    2     2000003  -2000003   # BR(H -> ~s_R    ~s_R*  )
     8.01113968E-07    2     1000011  -1000011   # BR(H -> ~e_L-   ~e_L+  )
     8.01113968E-07    2     1000013  -1000013   # BR(H -> ~mu_L-  ~mu_L+ )
     6.05893544E-07    2     1000015  -1000015   # BR(H -> ~tau_1- ~tau_1+)
     2.60869835E-06    2     1000012  -1000012   # BR(H -> ~nu_eL  ~nu_eL*   )
     2.60869835E-06    2     1000014  -1000014   # BR(H -> ~nu_muL ~nu_muL*  )
     2.63509596E-06    2     1000016  -1000016   # BR(H -> ~nu_tauL ~nu_tauL*)
#
#         PDG            Width
DECAY        36     4.82139974E+01   # A decays
#          BR         NDA      ID1       ID2
     1.59923938E-01    2           5        -5   # BR(A -> b       bb     )
     3.16726596E-02    2         -15        15   # BR(A -> tau+    tau-   )
     1.10901110E-04    2         -13        13   # BR(A -> mu+     mu-    )
     6.39533322E-05    2           3        -3   # BR(A -> s       sb     )
     1.27928040E-07    2           4        -4   # BR(A -> c       cb     )
     1.25688504E-02    2           6        -6   # BR(A -> t       tb     )
     2.06461271E-05    2          21        21   # BR(A -> g       g      )
     1.96949545E-09    2          22        22   # BR(A -> gam     gam    )
     2.16887652E-08    2          23        22   # BR(A -> Z       gam    )
     5.28632885E-06    2          23        25   # BR(A -> Z       h      )
     2.14904169E-02    2     1000024  -1000024   # BR(A -> ~chi_1+ ~chi_1-)
     5.60928515E-04    2     1000037  -1000037   # BR(A -> ~chi_2+ ~chi_2-)
     2.54309006E-01    2     1000024  -1000037   # BR(A -> ~chi_1+ ~chi_2-)
     2.54309006E-01    2     1000037  -1000024   # BR(A -> ~chi_2+ ~chi_1-)
     3.41602893E-03    2     1000022   1000022   # BR(A -> ~chi_10 ~chi_10)
     1.61484295E-03    2     1000023   1000023   # BR(A -> ~chi_20 ~chi_20)
     2.80288802E-04    2     1000025   1000025   # BR(A -> ~chi_30 ~chi_30)
     4.21595674E-04    2     1000022   1000023   # BR(A -> ~chi_10 ~chi_20)
     1.17417999E-01    2     1000022   1000025   # BR(A -> ~chi_10 ~chi_30)
     1.41813501E-01    2     1000023   1000025   # BR(A -> ~chi_20 ~chi_30)
#
#         PDG            Width
DECAY        37     4.80445066E+01   # H+ decays
#          BR         NDA      ID1       ID2
     2.65359665E-04    2           4        -5   # BR(H+ -> c       bb     )
     3.17978727E-02    2         -15        16   # BR(H+ -> tau+    nu_tau )
     1.11339540E-04    2         -13        14   # BR(H+ -> mu+     nu_mu  )
     2.65359193E-06    2           2        -5   # BR(H+ -> u       bb     )
     3.21088511E-06    2           2        -3   # BR(H+ -> u       sb     )
     6.33231107E-05    2           4        -3   # BR(H+ -> c       sb     )
     1.70076237E-01    2           6        -5   # BR(H+ -> t       bb     )
     5.31455400E-06    2          24        25   # BR(H+ -> W+      h      )
     1.37888003E-13    2          24        36   # BR(H+ -> W+      A      )
     1.66183663E-03    2     1000024   1000022   # BR(H+ -> ~chi_1+ ~chi_10)
     4.66441807E-03    2     1000024   1000023   # BR(H+ -> ~chi_1+ ~chi_20)
     2.60530954E-01    2     1000024   1000025   # BR(H+ -> ~chi_1+ ~chi_30)
     2.74602483E-01    2     1000037   1000022   # BR(H+ -> ~chi_2+ ~chi_10)
     2.56205775E-01    2     1000037   1000023   # BR(H+ -> ~chi_2+ ~chi_20)
     3.11763346E-08    2     1000037   1000025   # BR(H+ -> ~chi_2+ ~chi_30)
     3.15267917E-06    2    -1000011   1000012   # BR(H+ -> ~e_L+   ~nu_eL )
     3.15267917E-06    2    -1000013   1000014   # BR(H+ -> ~mu_L+  ~nu_muL)
     2.88557009E-06    2    -1000015   1000016   # BR(H+ -> ~tau_1+ ~nu_tauL)
