#
#                              ======================
#                              | THE SUSYHIT OUTPUT |
#                              ======================
#
#
#              ------------------------------------------------------
#              |     This is the output of the SUSY-HIT package     |
#              |  created by A.Djouadi, M.Muehlleitner and M.Spira. |
#              |  In case of problems with SUSY-HIT email to        |
#              |           margarete.muehlleitner@cern.ch           |
#              |           michael.spira@psi.ch                     |
#              |           abdelhak.djouadi@cern.ch                 |
#              ------------------------------------------------------
#
#              ------------------------------------------------------
#              |  SUSY Les Houches Accord - MSSM Spectrum + Decays  |
#              |              based on the decay programs           |
#              |                                                    |
#              |                     SDECAY 1.3b                    |
#              |                                                    |
#              |  Authors: M.Muhlleitner, A.Djouadi and Y.Mambrini  |
#              |  Ref.:    Comput.Phys.Commun.168(2005)46           |
#              |           [hep-ph/0311167]                         |
#              |                                                    |
#              |                     HDECAY 3.4                     |
#              |                                                    |
#              |  By: A.Djouadi,J.Kalinowski,M.Muhlleitner,M.Spira  |
#              |  Ref.:    Comput.Phys.Commun.108(1998)56           |
#              |           [hep-ph/9704448]                         |
#              |                                                    |
#              |                                                    |
#              |  If not stated otherwise all DRbar couplings and   |
#              |  soft SUSY breaking masses are given at the scale  |
#              |  Q=  0.20206840E+04
#              |                                                    |
#              ------------------------------------------------------
#
#
BLOCK DCINFO  # Decay Program information
     1   SDECAY/HDECAY # decay calculator
     2   1.3b  /3.4    # version number
#
BLOCK SPINFO  # Spectrum calculator information
     1     SOFTSUSY    # spectrum calculator               
     2     3.4.0       # version number                    
#
BLOCK MODSEL  # Model selection
     1     0   #  nonUniversal                                     
#
BLOCK SMINPUTS  # Standard Model inputs
         1     1.27908970E+02   # alpha_em^-1(M_Z)^MSbar
         2     1.16637870E-05   # G_F [GeV^-2]
         3     1.18400000E-01   # alpha_S(M_Z)^MSbar
         4     9.11876000E+01   # M_Z pole mass
         5     4.18000000E+00   # mb(mb)^MSbar
         6     1.73200000E+02   # mt pole mass
         7     1.77700000E+00   # mtau pole mass
#
BLOCK MINPAR  # Input parameters - minimal models
         3     1.70100000E+01   # tanb                
#
BLOCK EXTPAR  # Input parameters - non-minimal models
         0    -1.00000000E+00   # Set                 
         1    -1.86983000E+03   # M_1(MX)             
         2    -1.26840000E+02   # M_2(MX)             
         3     9.87110000E+02   # M_3(MX)             
        11    -2.86886000E+03   # At(MX)              
        12     2.16390000E+03   # Ab(MX)              
        13     2.85517000E+03   # Atau(MX)            
        23     2.27548000E+03   # mu(MX)              
        26     2.83185000E+03   # mA(pole)            
        31     1.95446000E+03   # meL(MX)             
        32     1.95446000E+03   # mmuL(MX)            
        33     2.46236000E+03   # mtauL(MX)           
        34     2.13800000E+02   # meR(MX)             
        35     2.13800000E+02   # mmuR(MX)            
        36     4.87510000E+02   # mtauR(MX)           
        41     2.47678000E+03   # mqL1(MX)            
        42     2.47678000E+03   # mqL2(MX)            
        43     1.86108000E+03   # mqL3(MX)            
        44     1.08082000E+03   # muR(MX)             
        45     1.08082000E+03   # mcR(MX)             
        46     2.19614000E+03   # mtR(MX)             
        47     3.31709000E+03   # mdR(MX)             
        48     3.31709000E+03   # msR(MX)             
        49     2.05745000E+03   # mbR(MX)             
#
BLOCK MASS  # Mass Spectrum
# PDG code           mass       particle
        24     8.03840342E+01   # W+
        25     1.25755463E+02   # h
        35     2.83175363E+03   # H
        36     2.83184997E+03   # A
        37     2.83318145E+03   # H+
         5     4.81876030E+00   # b-quark pole mass calculated from mb(mb)_Msbar
   1000001     2.51039187E+03   # ~d_L
   2000001     3.34924671E+03   # ~d_R
   1000002     2.50925265E+03   # ~u_L
   2000002     1.13468170E+03   # ~u_R
   1000003     2.51039187E+03   # ~s_L
   2000003     3.34924671E+03   # ~s_R
   1000004     2.50925265E+03   # ~c_L
   2000004     1.13468170E+03   # ~c_R
   1000005     1.88506118E+03   # ~b_1
   2000005     2.08922419E+03   # ~b_2
   1000006     1.85440548E+03   # ~t_1
   2000006     2.22054052E+03   # ~t_2
   1000011     1.95801575E+03   # ~e_L
   2000011     2.73846412E+02   # ~e_R
   1000012     1.95606794E+03   # ~nu_eL
   1000013     1.95801575E+03   # ~mu_L
   2000013     2.73846412E+02   # ~mu_R
   1000014     1.95606794E+03   # ~nu_muL
   1000015     5.18683418E+02   # ~tau_1
   2000015     2.46631504E+03   # ~tau_2
   1000016     2.46456283E+03   # ~nu_tauL
   1000021     1.15380853E+03   # ~g
   1000022    -1.39455473E+02   # ~chi_10
   1000023    -1.84183081E+03   # ~chi_20
   1000025     2.30053695E+03   # ~chi_30
   1000035    -2.30247450E+03   # ~chi_40
   1000024     1.39612334E+02   # ~chi_1+
   1000037     2.30189919E+03   # ~chi_2+
#
BLOCK NMIX  # Neutralino Mixing Matrix
  1  1     7.92943650E-05   # N_11
  1  2     9.99423784E-01   # N_12
  1  3    -3.39414037E-02   # N_13
  1  4     2.72455221E-04   # N_14
  2  1     9.97961706E-01   # N_21
  2  2     1.62054455E-03   # N_22
  2  3     5.03636264E-02   # N_23
  2  4     3.91575304E-02   # N_24
  3  1     7.95890825E-03   # N_31
  3  2    -2.41928591E-02   # N_32
  3  3    -7.06677928E-01   # N_33
  3  4     7.07076847E-01   # N_34
  4  1    -6.33173176E-02   # N_41
  4  2     2.37524486E-02   # N_42
  4  3     7.04923962E-01   # N_43
  4  4     7.06051660E-01   # N_44
#
BLOCK UMIX  # Chargino Mixing Matrix U
  1  1     9.98848301E-01   # U_11
  1  2    -4.79799120E-02   # U_12
  2  1     4.79799120E-02   # U_21
  2  2     9.98848301E-01   # U_22
#
BLOCK VMIX  # Chargino Mixing Matrix V
  1  1    -9.99999923E-01   # V_11
  1  2     3.91472856E-04   # V_12
  2  1     3.91472856E-04   # V_21
  2  2     9.99999923E-01   # V_22
#
BLOCK STOPMIX  # Stop Mixing Matrix
  1  1     9.54134789E-01   # cos(theta_t)
  1  2     2.99377361E-01   # sin(theta_t)
  2  1    -2.99377361E-01   # -sin(theta_t)
  2  2     9.54134789E-01   # cos(theta_t)
#
BLOCK SBOTMIX  # Sbottom Mixing Matrix
  1  1     9.95661087E-01   # cos(theta_b)
  1  2     9.30537470E-02   # sin(theta_b)
  2  1    -9.30537470E-02   # -sin(theta_b)
  2  2     9.95661087E-01   # cos(theta_b)
#
BLOCK STAUMIX  # Stau Mixing Matrix
  1  1     1.05724211E-02   # cos(theta_tau)
  1  2     9.99944110E-01   # sin(theta_tau)
  2  1    -9.99944110E-01   # -sin(theta_tau)
  2  2     1.05724211E-02   # cos(theta_tau)
#
BLOCK ALPHA  # Higgs mixing
          -6.12901569E-02   # Mixing angle in the neutral Higgs boson sector
#
BLOCK HMIX Q=  2.02068400E+03  # DRbar Higgs Parameters
         1     2.30427935E+03   # mu(Q)MSSM           
         2     1.63267664E+01   # tan                 
         3     2.43214937E+02   # higgs               
         4     8.06684015E+06   # mA^2(Q)MSSM         
#
BLOCK GAUGE Q=  2.02068400E+03  # The gauge couplings
     1     3.64323495E-01   # gprime(Q) DRbar
     2     6.42016166E-01   # g(Q) DRbar
     3     1.03838512E+00   # g3(Q) DRbar
#
BLOCK AU Q=  2.02068400E+03  # The trilinear couplings
  1  1     0.00000000E+00   # A_u(Q) DRbar
  2  2     0.00000000E+00   # A_c(Q) DRbar
  3  3    -2.86886000E+03   # A_t(Q) DRbar
#
BLOCK AD Q=  2.02068400E+03  # The trilinear couplings
  1  1     0.00000000E+00   # A_d(Q) DRbar
  2  2     0.00000000E+00   # A_s(Q) DRbar
  3  3     2.16390000E+03   # A_b(Q) DRbar
#
BLOCK AE Q=  2.02068400E+03  # The trilinear couplings
  1  1     0.00000000E+00   # A_e(Q) DRbar
  2  2     0.00000000E+00   # A_mu(Q) DRbar
  3  3     2.85517000E+03   # A_tau(Q) DRbar
#
BLOCK Yu Q=  2.02068400E+03  # The Yukawa couplings
  1  1     0.00000000E+00   # y_u(Q) DRbar
  2  2     0.00000000E+00   # y_c(Q) DRbar
  3  3     8.31094345E-01   # y_t(Q) DRbar
#
BLOCK Yd Q=  2.02068400E+03  # The Yukawa couplings
  1  1     0.00000000E+00   # y_d(Q) DRbar
  2  2     0.00000000E+00   # y_s(Q) DRbar
  3  3     2.03360322E-01   # y_b(Q) DRbar
#
BLOCK Ye Q=  2.02068400E+03  # The Yukawa couplings
  1  1     0.00000000E+00   # y_e(Q) DRbar
  2  2     0.00000000E+00   # y_mu(Q) DRbar
  3  3     1.66685333E-01   # y_tau(Q) DRbar
#
BLOCK MSOFT Q=  2.02068400E+03  # The soft SUSY breaking masses at the scale Q
         1    -1.86983000E+03   # M_1(Q)              
         2    -1.26840000E+02   # M_2(Q)              
         3     9.87110000E+02   # M_3(Q)              
        21     2.66174765E+06   # mH1^2(Q)            
        22    -5.21951543E+06   # mH2^2(Q)            
        31     1.95446000E+03   # meL(Q)              
        32     1.95446000E+03   # mmuL(Q)             
        33     2.46236000E+03   # mtauL(Q)            
        34     2.13800000E+02   # meR(Q)              
        35     2.13800000E+02   # mmuR(Q)             
        36     4.87510000E+02   # mtauR(Q)            
        41     2.47678000E+03   # mqL1(Q)             
        42     2.47678000E+03   # mqL2(Q)             
        43     1.86108000E+03   # mqL3(Q)             
        44     1.08082000E+03   # muR(Q)              
        45     1.08082000E+03   # mcR(Q)              
        46     2.19614000E+03   # mtR(Q)              
        47     3.31709000E+03   # mdR(Q)              
        48     3.31709000E+03   # msR(Q)              
        49     2.05745000E+03   # mbR(Q)              
#
Block HiggsBoundsInputHiggsCouplingsFermions
# ScalarNormEffCoupSq PseudoSNormEffCoupSq NP   IP1 IP2 IP2
    1.00383917E+00    0.00000000E+00        3  25   5   5  # h0-b-b eff. coupling^2, normalised to SM
    2.66559462E+02    0.00000000E+00        3  35   5   5  # H0-b-b eff. coupling^2, normalised to SM
    0.00000000E+00    2.66563301E+02        3  36   5   5  # A0-b-b eff. coupling^2, normalised to SM
#
    9.99985598E-01    0.00000000E+00        3  25   6   6  # h0-t-t eff. coupling^2, normalised to SM
    3.76585660E-03    0.00000000E+00        3  35   6   6  # H0-t-t eff. coupling^2, normalised to SM
    0.00000000E+00    3.75145414E-03        3  36   6   6  # A0-t-t eff. coupling^2, normalised to SM
#
    1.00383917E+00    0.00000000E+00        3  25  15  15  # h0-tau-tau eff. coupling^2, normalised to SM
    2.66559462E+02    0.00000000E+00        3  35  15  15  # H0-tau-tau eff. coupling^2, normalised to SM
    0.00000000E+00    2.66563301E+02        3  36  15  15  # A0-tau-tau eff. coupling^2, normalised to SM
#
Block HiggsBoundsInputHiggsCouplingsBosons
    9.99999986E-01        3  25  24  24  # h0-W-W eff. coupling^2, normalised to SM
    1.37969939E-08        3  35  24  24  # H0-W-W eff. coupling^2, normalised to SM
    0.00000000E+00        3  36  24  24  # A0-W-W eff. coupling^2, normalised to SM
#
    9.99999986E-01        3  25  23  23  # h0-Z-Z eff. coupling^2, normalised to SM
    1.37969939E-08        3  35  23  23  # H0-Z-Z eff. coupling^2, normalised to SM
    0.00000000E+00        3  36  23  23  # A0-Z-Z eff. coupling^2, normalised to SM
#
    8.86357389E-01        3  25  21  21  # h0-g-g eff. coupling^2, normalised to SM
    7.64285740E-14        3  35  21  21  # H0-g-g eff. coupling^2, normalised to SM
    2.26899882E-12        3  36  21  21  # A0-g-g eff. coupling^2, normalised to SM
#
    0.00000000E+00        3  25  25  23  # h0-h0-Z eff. coupling^2, normalised to SM
    0.00000000E+00        3  35  25  23  # H0-h0-Z eff. coupling^2, normalised to SM
    1.37969939E-08        3  36  25  23  # A0-h0-Z eff. coupling^2, normalised to SM
    0.00000000E+00        3  35  35  23  # H0-H0-Z eff. coupling^2, normalised to SM
    9.99999986E-01        3  36  35  23  # A0-H0-Z eff. coupling^2, normalised to SM
    0.00000000E+00        3  36  36  23  # A0-A0-Z eff. coupling^2, normalised to SM
#
    0.00000000E+00        4  25  21  21  23  # h0-g-g-Z eff. coupling^2, normalised to SM
    0.00000000E+00        4  35  21  21  23  # H0-g-g-Z eff. coupling^2, normalised to SM
    0.00000000E+00        4  36  21  21  23  # A0-g-g-Z eff. coupling^2, normalised to SM
#
#
#
#                             =================
#                             |The decay table|
#                             =================
#
# - The QCD corrections to the decays gluino -> squark  + quark
#                                     squark -> gaugino + quark_prime
#                                     squark -> squark_prime + Higgs
#                                     squark -> gluino  + quark
#   are included.
#
# - The multi-body decays for the inos, stops and sbottoms are included.
#
# - The loop induced decays for the gluino, neutralinos and stops
#   are included.
#
# - The SUSY decays of the top quark are included.
#
#
#         PDG            Width
DECAY         6     1.45191821E+00   # top decays
#          BR         NDA      ID1       ID2
     1.00000000E+00    2           5        24   # BR(t ->  b    W+)
#
#         PDG            Width
DECAY   1000021     4.38212973E-02   # gluino decays
#          BR         NDA      ID1       ID2
     2.50526161E-01    2     2000002        -2   # BR(~g -> ~u_R  ub)
     2.50526161E-01    2    -2000002         2   # BR(~g -> ~u_R* u )
     2.49473839E-01    2     2000004        -4   # BR(~g -> ~c_R  cb)
     2.49473839E-01    2    -2000004         4   # BR(~g -> ~c_R* c )
#
#         PDG            Width
DECAY   1000006     6.25823008E+01   # stop1 decays
#          BR         NDA      ID1       ID2
     1.07348288E-01    2     1000022         6   # BR(~t_1 -> ~chi_10 t )
     2.18824028E-01    2     1000024         5   # BR(~t_1 -> ~chi_1+ b )
     6.73827684E-01    2     1000021         6   # BR(~t_1 -> ~g      t )
#
#         PDG            Width
DECAY   2000006     8.96997972E+01   # stop2 decays
#          BR         NDA      ID1       ID2
     8.87682570E-03    2     1000022         6   # BR(~t_2 -> ~chi_10 t )
     4.67755446E-03    2     1000023         6   # BR(~t_2 -> ~chi_20 t )
     0.00000000E+00    2     1000025         6   # BR(~t_2 -> ~chi_30 t )
     1.79962879E-02    2     1000024         5   # BR(~t_2 -> ~chi_1+ b )
     6.90273257E-01    2     1000021         6   # BR(~t_2 -> ~g      t )
     5.93132083E-02    2     1000006        25   # BR(~t_2 -> ~t_1    h )
     8.16330627E-02    2     1000006        23   # BR(~t_2 -> ~t_1    Z )
     1.37184888E-01    2     1000005        24   # BR(~t_2 -> ~b_1    W+)
     4.49155642E-05    2     2000005        24   # BR(~t_2 -> ~b_2    W+)
#
#         PDG            Width
DECAY   1000005     6.47073795E+01   # sbottom1 decays
#          BR         NDA      ID1       ID2
     1.17338323E-01    2     1000022         5   # BR(~b_1 -> ~chi_10 b )
     1.00562615E-05    2     1000023         5   # BR(~b_1 -> ~chi_20 b )
     2.30373674E-01    2    -1000024         6   # BR(~b_1 -> ~chi_1- t )
     6.52277946E-01    2     1000021         5   # BR(~b_1 -> ~g      b )
#
#         PDG            Width
DECAY   2000005     5.85088701E+01   # sbottom2 decays
#          BR         NDA      ID1       ID2
     8.79954792E-04    2     1000022         5   # BR(~b_2 -> ~chi_10 b )
     1.01600517E-03    2     1000023         5   # BR(~b_2 -> ~chi_20 b )
     1.73294014E-03    2    -1000024         6   # BR(~b_2 -> ~chi_1- t )
     9.85930311E-01    2     1000021         5   # BR(~b_2 -> ~g      b )
     2.26465768E-03    2     1000005        25   # BR(~b_2 -> ~b_1    h )
     2.00474523E-03    2     1000005        23   # BR(~b_2 -> ~b_1    Z )
     6.17138587E-03    2     1000006       -24   # BR(~b_2 -> ~t_1    W-)
#
#         PDG            Width
DECAY   1000002     1.42987646E+02   # sup_L decays
#          BR         NDA      ID1       ID2
     6.88739457E-02    2     1000022         2   # BR(~u_L -> ~chi_10 u)
     5.42477694E-04    2     1000023         2   # BR(~u_L -> ~chi_20 u)
     9.53079618E-07    2     1000025         2   # BR(~u_L -> ~chi_30 u)
     2.52305506E-07    2     1000035         2   # BR(~u_L -> ~chi_40 u)
     1.37900812E-01    2     1000024         1   # BR(~u_L -> ~chi_1+ d)
     5.60606445E-10    2     1000037         1   # BR(~u_L -> ~chi_2+ d)
     7.92681558E-01    2     1000021         2   # BR(~u_L -> ~g      u)
#
#         PDG            Width
DECAY   2000002     4.11379637E-04   # sup_R decays
#           BR         NDA      ID1       ID2
     3.80822612E-05    2     1000022         2   # BR(~u_R -> ~chi_10 u)
#           BR         NDA      ID1       ID2       ID3
     5.75356626E-02    3        2       -11        2000011   # BR(~u_R -> u  e+  ~e_R-)
     3.77704646E-01    3        2       11        -2000011   # BR(~u_R -> u  e-  ~e_R+)
     5.80194007E-02    3        2       -13        2000013   # BR(~u_R -> u  mu+  ~mu_R-)
     3.82153092E-01    3        2       13        -2000013   # BR(~u_R -> u  mu-  ~mu_R+)
     2.08362282E-02    3        2       -15        1000015   # BR(~u_R -> u  tau+  ~tau_1-)
     1.03665802E-01    3        2       15        -1000015   # BR(~u_R -> u  tau-  ~tau_1+)
     1.01825653E-05    3        2       23        1000022   # BR(~u_R -> u  Z  ~chi_10)
     5.59094276E-06    3        2       25        1000022   # BR(~u_R -> u  h  ~chi_10)
     2.84797762E-05    3        2       -24        1000024   # BR(~u_R -> u  W-  ~chi_1+)
     2.83339255E-06    3        2       24        -1000024   # BR(~u_R -> u  W+  ~chi_1-)
#
#         PDG            Width
DECAY   1000001     1.43061220E+02   # sdown_L decays
#          BR         NDA      ID1       ID2
     6.88665313E-02    2     1000022         1   # BR(~d_L -> ~chi_10 d)
     5.25231732E-04    2     1000023         1   # BR(~d_L -> ~chi_20 d)
     1.23426207E-06    2     1000025         1   # BR(~d_L -> ~chi_30 d)
     2.34471220E-06    2     1000035         1   # BR(~d_L -> ~chi_40 d)
     1.37576825E-01    2    -1000024         2   # BR(~d_L -> ~chi_1- u)
     8.50043205E-06    2    -1000037         2   # BR(~d_L -> ~chi_2- u)
     7.93019333E-01    2     1000021         1   # BR(~d_L -> ~g      d)
#
#         PDG            Width
DECAY   2000001     1.89897197E+02   # sdown_R decays
#          BR         NDA      ID1       ID2
     6.27448355E-11    2     1000022         1   # BR(~d_R -> ~chi_10 d)
     4.86763374E-03    2     1000023         1   # BR(~d_R -> ~chi_20 d)
     1.78248023E-07    2     1000025         1   # BR(~d_R -> ~chi_30 d)
     1.12477802E-05    2     1000035         1   # BR(~d_R -> ~chi_40 d)
     9.95120940E-01    2     1000021         1   # BR(~d_R -> ~g      d)
#
#         PDG            Width
DECAY   1000004     1.19996973E+02   # scharm_L decays
#          BR         NDA      ID1       ID2
     8.51120822E-02    2     1000022         4   # BR(~c_L -> ~chi_10 c)
     6.61112043E-04    2     1000023         4   # BR(~c_L -> ~chi_20 c)
     1.12177556E-06    2     1000025         4   # BR(~c_L -> ~chi_30 c)
     2.96860230E-07    2     1000035         4   # BR(~c_L -> ~chi_40 c)
     1.70413118E-01    2     1000024         3   # BR(~c_L -> ~chi_1+ s)
     6.59692789E-10    2     1000037         3   # BR(~c_L -> ~chi_2+ s)
     7.43812268E-01    2     1000021         4   # BR(~c_L -> ~g      c)
#
#         PDG            Width
DECAY   2000004     4.12612812E-04   # scharm_R decays
#           BR         NDA      ID1       ID2
     3.93683185E-05    2     1000022         4   # BR(~c_R -> ~chi_10 c)
#           BR         NDA      ID1       ID2       ID3
     5.70195576E-02    3        4       -11        2000011   # BR(~c_R -> c  e+  ~e_R-)
     3.79726454E-01    3        4       11        -2000011   # BR(~c_R -> c  e-  ~e_R+)
     5.79962602E-02    3        4       -13        2000013   # BR(~c_R -> c  mu+  ~mu_R-)
     3.80695886E-01    3        4       13        -2000013   # BR(~c_R -> c  mu-  ~mu_R+)
     2.09814134E-02    3        4       -15        1000015   # BR(~c_R -> c  tau+  ~tau_1-)
     1.03494120E-01    3        4       15        -1000015   # BR(~c_R -> c  tau-  ~tau_1+)
     1.01274121E-05    3        4       23        1000022   # BR(~c_R -> c  Z  ~chi_10)
     5.56841652E-06    3        4       25        1000022   # BR(~c_R -> c  h  ~chi_10)
     2.84164710E-05    3        4       -24        1000024   # BR(~c_R -> c  W-  ~chi_1+)
     2.82759034E-06    3        4       24        -1000024   # BR(~c_R -> c  W+  ~chi_1-)
#
#         PDG            Width
DECAY   1000003     1.20046512E+02   # sstrange_L decays
#          BR         NDA      ID1       ID2
     8.51110234E-02    2     1000022         3   # BR(~s_L -> ~chi_10 s)
     6.40178693E-04    2     1000023         3   # BR(~s_L -> ~chi_20 s)
     1.45319560E-06    2     1000025         3   # BR(~s_L -> ~chi_30 s)
     2.75966274E-06    2     1000035         3   # BR(~s_L -> ~chi_40 s)
     1.70028735E-01    2    -1000024         4   # BR(~s_L -> ~chi_1- c)
     1.00055149E-05    2    -1000037         4   # BR(~s_L -> ~chi_2- c)
     7.44205845E-01    2     1000021         3   # BR(~s_L -> ~g      s)
#
#         PDG            Width
DECAY   2000003     1.49764450E+02   # sstrange_R decays
#          BR         NDA      ID1       ID2
     8.22257522E-11    2     1000022         3   # BR(~s_R -> ~chi_10 s)
     6.35990754E-03    2     1000023         3   # BR(~s_R -> ~chi_20 s)
     2.31911929E-07    2     1000025         3   # BR(~s_R -> ~chi_30 s)
     1.46336506E-05    2     1000035         3   # BR(~s_R -> ~chi_40 s)
     9.93625227E-01    2     1000021         3   # BR(~s_R -> ~g      s)
#
#         PDG            Width
DECAY   1000011     2.38292719E+01   # selectron_L decays
#          BR         NDA      ID1       ID2
     3.33133764E-01    2     1000022        11   # BR(~e_L -> ~chi_10 e-)
     1.44097594E-03    2     1000023        11   # BR(~e_L -> ~chi_20 e-)
     6.65425260E-01    2    -1000024        12   # BR(~e_L -> ~chi_1- nu_e)
#
#         PDG            Width
DECAY   2000011     4.98991288E-09   # selectron_R decays
#           BR         NDA      ID1       ID2
     9.99723202E-01    2     1000022        11   # BR(~e_R -> ~chi_10 e-)
#           BR         NDA      ID1       ID2       ID3
     3.85197106E-05    3        11       23        1000022   # BR(~e_R- -> e-  Z  ~chi_10)
     5.53476597E-08    3        11       25        1000022   # BR(~e_R- -> e-  h  ~chi_10)
     1.75055161E-04    3        11       -24        1000024   # BR(~e_R- -> e-  W-  ~chi_1+)
     6.31674355E-05    3        11       24        -1000024   # BR(~e_R- -> e-  W+  ~chi_1-)
#
#         PDG            Width
DECAY   1000013     2.38292718E+01   # smuon_L decays
#          BR         NDA      ID1       ID2
     3.33133763E-01    2     1000022        13   # BR(~mu_L -> ~chi_10 mu-)
     1.44097531E-03    2     1000023        13   # BR(~mu_L -> ~chi_20 mu-)
     6.65425262E-01    2    -1000024        14   # BR(~mu_L -> ~chi_1- nu_mu)
#
#         PDG            Width
DECAY   2000013     4.98991083E-09   # smuon_R decays
#           BR         NDA      ID1       ID2
     9.99723069E-01    2     1000022        13   # BR(~mu_R -> ~chi_10 mu-)
#           BR         NDA      ID1       ID2       ID3
     3.84676213E-05    3        13       23        1000022   # BR(~mu_R- -> mu-  Z  ~chi_10)
     5.58426813E-08    3        13       25        1000022   # BR(~mu_R- -> mu-  h  ~chi_10)
     1.75101325E-04    3        13       -24        1000024   # BR(~mu_R- -> mu-  W-  ~chi_1+)
     6.33057405E-05    3        13       24        -1000024   # BR(~mu_R- -> mu-  W+  ~chi_1-)
#
#         PDG            Width
DECAY   1000015     2.90914298E-03   # stau_1 decays
#          BR         NDA      ID1       ID2
     3.33636920E-01    2     1000022        15   # BR(~tau_1 -> ~chi_10  tau-)
     6.66363080E-01    2    -1000024        16   # BR(~tau_1 -> ~chi_1-  nu_tau)
#
#         PDG            Width
DECAY   2000015     3.16947093E+01   # stau_2 decays
#          BR         NDA      ID1       ID2
     3.16603496E-01    2     1000022        15   # BR(~tau_2 -> ~chi_10  tau-)
     2.01445043E-02    2     1000023        15   # BR(~tau_2 -> ~chi_20  tau-)
     3.66096313E-04    2     1000025        15   # BR(~tau_2 -> ~chi_30  tau-)
     3.55394482E-04    2     1000035        15   # BR(~tau_2 -> ~chi_40  tau-)
     6.32312893E-01    2    -1000024        16   # BR(~tau_2 -> ~chi_1-  nu_tau)
     2.72664937E-05    2    -1000037        16   # BR(~tau_2 -> ~chi_2-  nu_tau)
     1.52069166E-02    2     1000015        25   # BR(~tau_2 -> ~tau_1   h)
     1.49834335E-02    2     1000015        23   # BR(~tau_2 -> ~tau_1   Z)
#
#         PDG            Width
DECAY   1000012     2.38387818E+01   # snu_eL decays
#          BR         NDA      ID1       ID2
     3.32602939E-01    2     1000022        12   # BR(~nu_eL -> ~chi_10 nu_e)
     1.37936319E-03    2     1000023        12   # BR(~nu_eL -> ~chi_20 nu_e)
     6.66017698E-01    2     1000024        11   # BR(~nu_eL -> ~chi_1+ e-)
#
#         PDG            Width
DECAY   1000014     2.38387817E+01   # snu_muL decays
#          BR         NDA      ID1       ID2
     3.32602940E-01    2     1000022        14   # BR(~nu_muL -> ~chi_10 nu_mu)
     1.37936319E-03    2     1000023        14   # BR(~nu_muL -> ~chi_20 nu_mu)
     6.66017696E-01    2     1000024        13   # BR(~nu_muL -> ~chi_1+ mu-)
#
#         PDG            Width
DECAY   1000016     3.16856593E+01   # snu_tauL decays
#          BR         NDA      ID1       ID2
     3.16478335E-01    2     1000022        16   # BR(~nu_tauL -> ~chi_10 nu_tau)
     1.98225981E-02    2     1000023        16   # BR(~nu_tauL -> ~chi_20 nu_tau)
     4.35234281E-06    2     1000025        16   # BR(~nu_tauL -> ~chi_30 nu_tau)
     1.83827866E-05    2     1000035        16   # BR(~nu_tauL -> ~chi_40 nu_tau)
     6.33833514E-01    2     1000024        15   # BR(~nu_tauL -> ~chi_1+ tau-)
     6.98878877E-04    2     1000037        15   # BR(~nu_tauL -> ~chi_2+ tau-)
     2.91439390E-02    2    -1000015       -24   # BR(~nu_tauL -> ~tau_1+ W-)
#
#         PDG            Width
DECAY   1000024     2.69487250E-15   # chargino1+ decays
#           BR         NDA      ID1       ID2       ID3
     2.05802250E-02    3     1000022       -11        12   # BR(~chi_1+ -> ~chi_10 e+   nu_e)
     1.76786560E-03    3     1000022       -13        14   # BR(~chi_1+ -> ~chi_10 mu+  nu_mu)
     9.77651910E-01    2     1000022       211             # BR(~chi_1+ -> ~chi_10 pi+)
#
#         PDG            Width
DECAY   1000037     2.05468821E+01   # chargino2+ decays
#          BR         NDA      ID1       ID2
     4.13948940E-02    2     1000006        -5   # BR(~chi_2+ -> ~t_1     bb)
     1.00872301E-02    2     2000006        -5   # BR(~chi_2+ -> ~t_2     bb)
     2.26700208E-01    2    -1000005         6   # BR(~chi_2+ -> ~b_1*    t )
     1.35534709E-03    2    -2000005         6   # BR(~chi_2+ -> ~b_2*    t )
     5.43655310E-09    2     1000012       -11   # BR(~chi_2+ -> ~nu_eL   e+  )
     5.43655310E-09    2     1000014       -13   # BR(~chi_2+ -> ~nu_muL mu+ )
     8.08221729E-05    2    -1000011        12   # BR(~chi_2+ -> ~e_L+    nu_e)
     8.08221729E-05    2    -1000013        14   # BR(~chi_2+ -> ~mu_L+   nu_mu)
     2.77220463E-02    2    -1000015        16   # BR(~chi_2+ -> ~tau_1+  nu_tau)
     2.19764548E-01    2     1000024        23   # BR(~chi_2+ -> ~chi_1+  Z )
     2.14236557E-01    2     1000022        24   # BR(~chi_2+ -> ~chi_10  W+)
     3.41870225E-02    2     1000023        24   # BR(~chi_2+ -> ~chi_20  W+)
     2.24390492E-01    2     1000024        25   # BR(~chi_2+ -> ~chi_1+  h )
#
#         PDG            Width
DECAY   1000022     0.00000000E+00   # neutralino1 decays
#
#         PDG            Width
DECAY   1000023     3.64124668E+01   # neutralino2 decays
#          BR         NDA      ID1       ID2
     1.62822428E-04    2     1000022        23   # BR(~chi_20 -> ~chi_10   Z )
     2.85701841E-04    2     1000024       -24   # BR(~chi_20 -> ~chi_1+   W-)
     2.85701841E-04    2    -1000024        24   # BR(~chi_20 -> ~chi_1-   W+)
     1.41980704E-04    2     1000022        25   # BR(~chi_20 -> ~chi_10   h )
     6.61743732E-02    2     2000002        -2   # BR(~chi_20 -> ~u_R      ub)
     6.61743732E-02    2    -2000002         2   # BR(~chi_20 -> ~u_R*     u )
     6.61742716E-02    2     2000004        -4   # BR(~chi_20 -> ~c_R      cb)
     6.61742716E-02    2    -2000004         4   # BR(~chi_20 -> ~c_R*     c )
     1.27208242E-01    2     2000011       -11   # BR(~chi_20 -> ~e_R-     e+)
     1.27208242E-01    2    -2000011        11   # BR(~chi_20 -> ~e_R+     e-)
     1.27208242E-01    2     2000013       -13   # BR(~chi_20 -> ~mu_R-    mu+)
     1.27208242E-01    2    -2000013        13   # BR(~chi_20 -> ~mu_R+    mu-)
     1.12796768E-01    2     1000015       -15   # BR(~chi_20 -> ~tau_1-   tau+)
     1.12796768E-01    2    -1000015        15   # BR(~chi_20 -> ~tau_1+   tau-)
#
#         PDG            Width
DECAY   1000025     2.16146452E+01   # neutralino3 decays
#          BR         NDA      ID1       ID2
     1.02734613E-01    2     1000022        23   # BR(~chi_30 -> ~chi_10   Z )
     3.20479318E-02    2     1000023        23   # BR(~chi_30 -> ~chi_20   Z )
     2.03578333E-01    2     1000024       -24   # BR(~chi_30 -> ~chi_1+   W-)
     2.03578333E-01    2    -1000024        24   # BR(~chi_30 -> ~chi_1-   W+)
     1.06789014E-01    2     1000022        25   # BR(~chi_30 -> ~chi_10   h )
     4.97763525E-04    2     1000023        25   # BR(~chi_30 -> ~chi_20   h )
     1.31575347E-05    2     2000002        -2   # BR(~chi_30 -> ~u_R      ub)
     1.31575347E-05    2    -2000002         2   # BR(~chi_30 -> ~u_R*     u )
     1.31575291E-05    2     2000004        -4   # BR(~chi_30 -> ~c_R      cb)
     1.31575291E-05    2    -2000004         4   # BR(~chi_30 -> ~c_R*     c )
     1.53017082E-01    2     1000006        -6   # BR(~chi_30 -> ~t_1      tb)
     1.53017082E-01    2    -1000006         6   # BR(~chi_30 -> ~t_1*     t )
     7.01126160E-03    2     1000005        -5   # BR(~chi_30 -> ~b_1      bb)
     7.01126160E-03    2    -1000005         5   # BR(~chi_30 -> ~b_1*     b )
     2.03886121E-03    2     2000005        -5   # BR(~chi_30 -> ~b_2      bb)
     2.03886121E-03    2    -2000005         5   # BR(~chi_30 -> ~b_2*     b )
     6.41679446E-06    2     1000011       -11   # BR(~chi_30 -> ~e_L-     e+)
     6.41679446E-06    2    -1000011        11   # BR(~chi_30 -> ~e_L+     e-)
     1.73020304E-05    2     2000011       -11   # BR(~chi_30 -> ~e_R-     e+)
     1.73020304E-05    2    -2000011        11   # BR(~chi_30 -> ~e_R+     e-)
     6.41679446E-06    2     1000013       -13   # BR(~chi_30 -> ~mu_L-    mu+)
     6.41679446E-06    2    -1000013        13   # BR(~chi_30 -> ~mu_L+    mu-)
     1.73020304E-05    2     2000013       -13   # BR(~chi_30 -> ~mu_R-    mu+)
     1.73020304E-05    2    -2000013        13   # BR(~chi_30 -> ~mu_R+    mu-)
     1.32184410E-02    2     1000015       -15   # BR(~chi_30 -> ~tau_1-   tau+)
     1.32184410E-02    2    -1000015        15   # BR(~chi_30 -> ~tau_1+   tau-)
     1.38037798E-05    2     1000012       -12   # BR(~chi_30 -> ~nu_eL    nu_eb)
     1.38037798E-05    2    -1000012        12   # BR(~chi_30 -> ~nu_eL*   nu_e )
     1.38037798E-05    2     1000014       -14   # BR(~chi_30 -> ~nu_muL   nu_mub)
     1.38037798E-05    2    -1000014        14   # BR(~chi_30 -> ~nu_muL*  nu_mu )
#
#         PDG            Width
DECAY   1000035     1.95389381E+01   # neutralino4 decays
#          BR         NDA      ID1       ID2
     1.17211174E-01    2     1000022        23   # BR(~chi_40 -> ~chi_10   Z )
     6.19713751E-04    2     1000023        23   # BR(~chi_40 -> ~chi_20   Z )
     2.24853741E-01    2     1000024       -24   # BR(~chi_40 -> ~chi_1+   W-)
     2.24853741E-01    2    -1000024        24   # BR(~chi_40 -> ~chi_1-   W+)
     1.17716893E-01    2     1000022        25   # BR(~chi_40 -> ~chi_10   h )
     3.73518651E-02    2     1000023        25   # BR(~chi_40 -> ~chi_20   h )
     9.22985587E-04    2     2000002        -2   # BR(~chi_40 -> ~u_R      ub)
     9.22985587E-04    2    -2000002         2   # BR(~chi_40 -> ~u_R*     u )
     9.22985197E-04    2     2000004        -4   # BR(~chi_40 -> ~c_R      cb)
     9.22985197E-04    2    -2000004         4   # BR(~chi_40 -> ~c_R*     c )
     1.08589195E-01    2     1000006        -6   # BR(~chi_40 -> ~t_1      tb)
     1.08589195E-01    2    -1000006         6   # BR(~chi_40 -> ~t_1*     t )
     7.68442948E-03    2     1000005        -5   # BR(~chi_40 -> ~b_1      bb)
     7.68442948E-03    2    -1000005         5   # BR(~chi_40 -> ~b_1*     b )
     2.36494508E-03    2     2000005        -5   # BR(~chi_40 -> ~b_2      bb)
     2.36494508E-03    2    -2000005         5   # BR(~chi_40 -> ~b_2*     b )
     2.74554500E-06    2     1000011       -11   # BR(~chi_40 -> ~e_L-     e+)
     2.74554500E-06    2    -1000011        11   # BR(~chi_40 -> ~e_L+     e-)
     1.21246402E-03    2     2000011       -11   # BR(~chi_40 -> ~e_R-     e+)
     1.21246402E-03    2    -2000011        11   # BR(~chi_40 -> ~e_R+     e-)
     2.74554500E-06    2     1000013       -13   # BR(~chi_40 -> ~mu_L-    mu+)
     2.74554500E-06    2    -1000013        13   # BR(~chi_40 -> ~mu_L+    mu-)
     1.21246402E-03    2     2000013       -13   # BR(~chi_40 -> ~mu_R-    mu+)
     1.21246402E-03    2    -2000013        13   # BR(~chi_40 -> ~mu_R+    mu-)
     1.56482157E-02    2     1000015       -15   # BR(~chi_40 -> ~tau_1-   tau+)
     1.56482157E-02    2    -1000015        15   # BR(~chi_40 -> ~tau_1+   tau-)
     6.66303217E-05    2     1000012       -12   # BR(~chi_40 -> ~nu_eL    nu_eb)
     6.66303217E-05    2    -1000012        12   # BR(~chi_40 -> ~nu_eL*   nu_e )
     6.66303217E-05    2     1000014       -14   # BR(~chi_40 -> ~nu_muL   nu_mub)
     6.66303217E-05    2    -1000014        14   # BR(~chi_40 -> ~nu_muL*  nu_mu )
#
#         PDG            Width
DECAY        25     4.46016353E-03   # h decays
#          BR         NDA      ID1       ID2
     6.14549368E-01    2           5        -5   # BR(h -> b       bb     )
     5.85888010E-02    2         -15        15   # BR(h -> tau+    tau-   )
     2.07380913E-04    2         -13        13   # BR(h -> mu+     mu-    )
     2.26047716E-04    2           3        -3   # BR(h -> s       sb     )
     1.95394255E-02    2           4        -4   # BR(h -> c       cb     )
     7.27283307E-02    2          21        21   # BR(h -> g       g      )
     2.15066197E-03    2          22        22   # BR(h -> gam     gam    )
     1.49716918E-03    2          22        23   # BR(h -> Z       gam    )
     2.04680606E-01    2          24       -24   # BR(h -> W+      W-     )
     2.58322092E-02    2          23        23   # BR(h -> Z       Z      )
#
#         PDG            Width
DECAY        35     1.41066351E+01   # H decays
#          BR         NDA      ID1       ID2
     5.77906337E-01    2           5        -5   # BR(H -> b       bb     )
     1.11608166E-01    2         -15        15   # BR(H -> tau+    tau-   )
     3.95705840E-04    2         -13        13   # BR(H -> mu+     mu-    )
     2.17308362E-04    2           3        -3   # BR(H -> s       sb     )
     3.12626892E-07    2           4        -4   # BR(H -> c       cb     )
     3.06812995E-02    2           6        -6   # BR(H -> t       tb     )
     1.30639782E-05    2          21        21   # BR(H -> g       g      )
     1.78075315E-08    2          22        22   # BR(H -> gam     gam    )
     1.36938983E-08    2          23        22   # BR(H -> Z       gam    )
     7.13218177E-06    2          24       -24   # BR(H -> W+      W-     )
     3.55762638E-06    2          23        23   # BR(H -> Z       Z      )
     4.06125188E-05    2          25        25   # BR(H -> h       h      )
     3.84417643E-03    2     1000024  -1000024   # BR(H -> ~chi_1+ ~chi_1-)
     9.08432497E-02    2     1000024  -1000037   # BR(H -> ~chi_1+ ~chi_2-)
     9.08432497E-02    2     1000037  -1000024   # BR(H -> ~chi_2+ ~chi_1-)
     1.92144266E-03    2     1000022   1000022   # BR(H -> ~chi_10 ~chi_10)
     1.23944173E-03    2     1000022   1000023   # BR(H -> ~chi_10 ~chi_20)
     5.08868378E-02    2     1000022   1000025   # BR(H -> ~chi_10 ~chi_30)
     3.95251426E-02    2     1000022   1000035   # BR(H -> ~chi_10 ~chi_40)
     1.34357661E-06    2     2000002  -2000002   # BR(H -> ~u_R    ~u_R*  )
     1.34357661E-06    2     2000004  -2000004   # BR(H -> ~c_R    ~c_R*  )
     1.65290839E-06    2     2000011  -2000011   # BR(H -> ~e_R-   ~e_R+  )
     1.65290839E-06    2     2000013  -2000013   # BR(H -> ~mu_R-  ~mu_R+ )
     1.69393064E-05    2     1000015  -1000015   # BR(H -> ~tau_1- ~tau_1+)
#
#         PDG            Width
DECAY        36     1.41132633E+01   # A decays
#          BR         NDA      ID1       ID2
     5.77733267E-01    2           5        -5   # BR(A -> b       bb     )
     1.11561323E-01    2         -15        15   # BR(A -> tau+    tau-   )
     3.95539128E-04    2         -13        13   # BR(A -> mu+     mu-    )
     2.17273319E-04    2           3        -3   # BR(A -> s       sb     )
     3.14174242E-07    2           4        -4   # BR(A -> c       cb     )
     3.08527687E-02    2           6        -6   # BR(A -> t       tb     )
     7.11586494E-05    2          21        21   # BR(A -> g       g      )
     4.43364322E-08    2          22        22   # BR(A -> gam     gam    )
     6.79125811E-08    2          23        22   # BR(A -> Z       gam    )
     7.21972973E-06    2          23        25   # BR(A -> Z       h      )
     3.88804887E-03    2     1000024  -1000024   # BR(A -> ~chi_1+ ~chi_1-)
     9.08356667E-02    2     1000024  -1000037   # BR(A -> ~chi_1+ ~chi_2-)
     9.08356667E-02    2     1000037  -1000024   # BR(A -> ~chi_2+ ~chi_1-)
     1.94327029E-03    2     1000022   1000022   # BR(A -> ~chi_10 ~chi_10)
     1.34780200E-03    2     1000022   1000023   # BR(A -> ~chi_10 ~chi_20)
     4.01363616E-02    2     1000022   1000025   # BR(A -> ~chi_10 ~chi_30)
     5.01742080E-02    2     1000022   1000035   # BR(A -> ~chi_10 ~chi_40)
#
#         PDG            Width
DECAY        37     1.29352034E+01   # H+ decays
#          BR         NDA      ID1       ID2
     9.12713194E-04    2           4        -5   # BR(H+ -> c       bb     )
     1.21778882E-01    2         -15        16   # BR(H+ -> tau+    nu_tau )
     4.31765346E-04    2         -13        14   # BR(H+ -> mu+     nu_mu  )
     9.12711449E-06    2           2        -5   # BR(H+ -> u       bb     )
     1.18563527E-05    2           2        -3   # BR(H+ -> u       sb     )
     2.33697729E-04    2           4        -3   # BR(H+ -> c       sb     )
     5.75136885E-01    2           6        -5   # BR(H+ -> t       bb     )
     7.89394693E-06    2          24        25   # BR(H+ -> W+      h      )
     4.25610444E-13    2          24        36   # BR(H+ -> W+      A      )
     7.75747646E-11    2     1000024   1000022   # BR(H+ -> ~chi_1+ ~chi_10)
     2.83376439E-03    2     1000024   1000023   # BR(H+ -> ~chi_1+ ~chi_20)
     1.00102543E-01    2     1000024   1000025   # BR(H+ -> ~chi_1+ ~chi_30)
     9.86250782E-02    2     1000024   1000035   # BR(H+ -> ~chi_1+ ~chi_40)
     9.99157934E-02    2     1000037   1000022   # BR(H+ -> ~chi_2+ ~chi_10)
