#
#                              ======================
#                              | THE SUSYHIT OUTPUT |
#                              ======================
#
#
#              ------------------------------------------------------
#              |     This is the output of the SUSY-HIT package     |
#              |  created by A.Djouadi, M.Muehlleitner and M.Spira. |
#              |  In case of problems with SUSY-HIT email to        |
#              |           margarete.muehlleitner@cern.ch           |
#              |           michael.spira@psi.ch                     |
#              |           abdelhak.djouadi@cern.ch                 |
#              ------------------------------------------------------
#
#              ------------------------------------------------------
#              |  SUSY Les Houches Accord - MSSM Spectrum + Decays  |
#              |              based on the decay programs           |
#              |                                                    |
#              |                     SDECAY 1.3b                    |
#              |                                                    |
#              |  Authors: M.Muhlleitner, A.Djouadi and Y.Mambrini  |
#              |  Ref.:    Comput.Phys.Commun.168(2005)46           |
#              |           [hep-ph/0311167]                         |
#              |                                                    |
#              |                     HDECAY 3.4                     |
#              |                                                    |
#              |  By: A.Djouadi,J.Kalinowski,M.Muhlleitner,M.Spira  |
#              |  Ref.:    Comput.Phys.Commun.108(1998)56           |
#              |           [hep-ph/9704448]                         |
#              |                                                    |
#              |                                                    |
#              |  If not stated otherwise all DRbar couplings and   |
#              |  soft SUSY breaking masses are given at the scale  |
#              |  Q=  0.34960580E+04
#              |                                                    |
#              ------------------------------------------------------
#
#
BLOCK DCINFO  # Decay Program information
     1   SDECAY/HDECAY # decay calculator
     2   1.3b  /3.4    # version number
#
BLOCK SPINFO  # Spectrum calculator information
     1     SOFTSUSY    # spectrum calculator               
     2     3.4.0       # version number                    
#
BLOCK MODSEL  # Model selection
     1     0   #  nonUniversal                                     
#
BLOCK SMINPUTS  # Standard Model inputs
         1     1.27908970E+02   # alpha_em^-1(M_Z)^MSbar
         2     1.16637870E-05   # G_F [GeV^-2]
         3     1.18400000E-01   # alpha_S(M_Z)^MSbar
         4     9.11876000E+01   # M_Z pole mass
         5     4.18000000E+00   # mb(mb)^MSbar
         6     1.73200000E+02   # mt pole mass
         7     1.77700000E+00   # mtau pole mass
#
BLOCK MINPAR  # Input parameters - minimal models
         3     4.39200000E+01   # tanb                
#
BLOCK EXTPAR  # Input parameters - non-minimal models
         0    -1.00000000E+00   # Set                 
         1    -4.38000000E+01   # M_1(MX)             
         2     2.04215000E+03   # M_2(MX)             
         3     2.89314000E+03   # M_3(MX)             
        11    -4.09804000E+03   # At(MX)              
        12    -1.73331000E+03   # Ab(MX)              
        13    -8.21510000E+02   # Atau(MX)            
        23     2.42160000E+02   # mu(MX)              
        26     1.48886000E+03   # mA(pole)            
        31     2.34724000E+03   # meL(MX)             
        32     2.34724000E+03   # mmuL(MX)            
        33     1.46026000E+03   # mtauL(MX)           
        34     2.22190000E+02   # meR(MX)             
        35     2.22190000E+02   # mmuR(MX)            
        36     3.21294000E+03   # mtauR(MX)           
        41     1.97887000E+03   # mqL1(MX)            
        42     1.97887000E+03   # mqL2(MX)            
        43     3.35985000E+03   # mqL3(MX)            
        44     3.69998000E+03   # muR(MX)             
        45     3.69998000E+03   # mcR(MX)             
        46     3.63659000E+03   # mtR(MX)             
        47     1.49904000E+03   # mdR(MX)             
        48     1.49904000E+03   # msR(MX)             
        49     2.29719000E+03   # mbR(MX)             
#
BLOCK MASS  # Mass Spectrum
# PDG code           mass       particle
        24     8.03758586E+01   # W+
        25     1.26459914E+02   # h
        35     1.48886813E+03   # H
        36     1.48886000E+03   # A
        37     1.49128384E+03   # H+
         5     4.81876030E+00   # b-quark pole mass calculated from mb(mb)_Msbar
   1000001     2.15041726E+03   # ~d_L
   2000001     1.67322181E+03   # ~d_R
   1000002     2.14905569E+03   # ~u_L
   2000002     3.78395516E+03   # ~u_R
   1000003     2.15041726E+03   # ~s_L
   2000003     1.67322181E+03   # ~s_R
   1000004     2.14905569E+03   # ~c_L
   2000004     3.78395516E+03   # ~c_R
   1000005     2.40503845E+03   # ~b_1
   2000005     3.41975040E+03   # ~b_2
   1000006     3.39284654E+03   # ~t_1
   2000006     3.66538189E+03   # ~t_2
   1000011     2.36434142E+03   # ~e_L
   2000011     2.94330158E+02   # ~e_R
   1000012     2.36270020E+03   # ~nu_eL
   1000013     2.36434142E+03   # ~mu_L
   2000013     2.94330158E+02   # ~mu_R
   1000014     2.36270020E+03   # ~nu_muL
   1000015     1.47385275E+03   # ~tau_1
   2000015     3.20634083E+03   # ~tau_2
   1000016     1.47143778E+03   # ~nu_tauL
   1000021     3.02825008E+03   # ~g
   1000022    -4.20413843E+01   # ~chi_10
   1000023     2.56900674E+02   # ~chi_20
   1000025    -2.60932082E+02   # ~chi_30
   1000035     2.05534052E+03   # ~chi_40
   1000024     2.55147309E+02   # ~chi_1+
   1000037     2.05550802E+03   # ~chi_2+
#
BLOCK NMIX  # Neutralino Mixing Matrix
  1  1     9.84637576E-01   # N_11
  1  2     8.06137485E-04   # N_12
  1  3     1.72878677E-01   # N_13
  1  4     2.45185094E-02   # N_14
  2  1     1.05466502E-01   # N_21
  2  2     3.13200370E-02   # N_22
  2  3    -7.00796746E-01   # N_23
  2  4     7.04826072E-01   # N_24
  3  1    -1.39158065E-01   # N_31
  3  2     2.34592677E-02   # N_32
  3  3     6.92073526E-01   # N_33
  3  4     7.07897542E-01   # N_34
  4  1    -8.33060065E-04   # N_41
  4  2     9.99233741E-01   # N_42
  4  3     5.57835239E-03   # N_43
  4  4    -3.87313802E-02   # N_44
#
BLOCK UMIX  # Chargino Mixing Matrix U
  1  1    -7.89553380E-03   # U_11
  1  2     9.99968830E-01   # U_12
  2  1    -9.99968830E-01   # U_21
  2  2    -7.89553380E-03   # U_22
#
BLOCK VMIX  # Chargino Mixing Matrix V
  1  1    -5.48133143E-02   # V_11
  1  2     9.98496620E-01   # V_12
  2  1    -9.98496620E-01   # V_21
  2  2    -5.48133143E-02   # V_22
#
BLOCK STOPMIX  # Stop Mixing Matrix
  1  1     9.47671478E-01   # cos(theta_t)
  1  2     3.19247192E-01   # sin(theta_t)
  2  1    -3.19247192E-01   # -sin(theta_t)
  2  2     9.47671478E-01   # cos(theta_t)
#
BLOCK SBOTMIX  # Sbottom Mixing Matrix
  1  1     4.78766991E-03   # cos(theta_b)
  1  2     9.99988539E-01   # sin(theta_b)
  2  1    -9.99988539E-01   # -sin(theta_b)
  2  2     4.78766991E-03   # cos(theta_b)
#
BLOCK STAUMIX  # Stau Mixing Matrix
  1  1     9.99996658E-01   # cos(theta_tau)
  1  2     2.58534114E-03   # sin(theta_tau)
  2  1    -2.58534114E-03   # -sin(theta_tau)
  2  2     9.99996658E-01   # cos(theta_tau)
#
BLOCK ALPHA  # Higgs mixing
          -2.34654050E-02   # Mixing angle in the neutral Higgs boson sector
#
BLOCK HMIX Q=  3.49605800E+03  # DRbar Higgs Parameters
         1     2.48312940E+02   # mu(Q)MSSM           
         2     4.30665953E+01   # tan                 
         3     2.42085550E+02   # higgs               
         4     2.53469280E+06   # mA^2(Q)MSSM         
#
BLOCK GAUGE Q=  3.49605800E+03  # The gauge couplings
     1     3.65955743E-01   # gprime(Q) DRbar
     2     6.38863616E-01   # g(Q) DRbar
     3     1.00835442E+00   # g3(Q) DRbar
#
BLOCK AU Q=  3.49605800E+03  # The trilinear couplings
  1  1     0.00000000E+00   # A_u(Q) DRbar
  2  2     0.00000000E+00   # A_c(Q) DRbar
  3  3    -4.09803998E+03   # A_t(Q) DRbar
#
BLOCK AD Q=  3.49605800E+03  # The trilinear couplings
  1  1     0.00000000E+00   # A_d(Q) DRbar
  2  2     0.00000000E+00   # A_s(Q) DRbar
  3  3    -1.73330999E+03   # A_b(Q) DRbar
#
BLOCK AE Q=  3.49605800E+03  # The trilinear couplings
  1  1     0.00000000E+00   # A_e(Q) DRbar
  2  2     0.00000000E+00   # A_mu(Q) DRbar
  3  3    -8.21509994E+02   # A_tau(Q) DRbar
#
BLOCK Yu Q=  3.49605800E+03  # The Yukawa couplings
  1  1     0.00000000E+00   # y_u(Q) DRbar
  2  2     0.00000000E+00   # y_c(Q) DRbar
  3  3     8.11653281E-01   # y_t(Q) DRbar
#
BLOCK Yd Q=  3.49605800E+03  # The Yukawa couplings
  1  1     0.00000000E+00   # y_d(Q) DRbar
  2  2     0.00000000E+00   # y_s(Q) DRbar
  3  3     5.69375934E-01   # y_b(Q) DRbar
#
BLOCK Ye Q=  3.49605800E+03  # The Yukawa couplings
  1  1     0.00000000E+00   # y_e(Q) DRbar
  2  2     0.00000000E+00   # y_mu(Q) DRbar
  3  3     4.52790513E-01   # y_tau(Q) DRbar
#
BLOCK MSOFT Q=  3.49605800E+03  # The soft SUSY breaking masses at the scale Q
         1    -4.38000000E+01   # M_1(Q)              
         2     2.04215000E+03   # M_2(Q)              
         3     2.89314000E+03   # M_3(Q)              
        21     2.32850119E+06   # mH1^2(Q)            
        22     1.63394426E+05   # mH2^2(Q)            
        31     2.34724000E+03   # meL(Q)              
        32     2.34724000E+03   # mmuL(Q)             
        33     1.46026000E+03   # mtauL(Q)            
        34     2.22190000E+02   # meR(Q)              
        35     2.22190000E+02   # mmuR(Q)             
        36     3.21294000E+03   # mtauR(Q)            
        41     1.97886998E+03   # mqL1(Q)             
        42     1.97886998E+03   # mqL2(Q)             
        43     3.35984997E+03   # mqL3(Q)             
        44     3.69997999E+03   # muR(Q)              
        45     3.69997999E+03   # mcR(Q)              
        46     3.63658997E+03   # mtR(Q)              
        47     1.49903998E+03   # mdR(Q)              
        48     1.49903998E+03   # msR(Q)              
        49     2.29718997E+03   # mbR(Q)              
#
Block HiggsBoundsInputHiggsCouplingsFermions
# ScalarNormEffCoupSq PseudoSNormEffCoupSq NP   IP1 IP2 IP2
    1.02162513E+00    0.00000000E+00        3  25   5   5  # h0-b-b eff. coupling^2, normalised to SM
    1.85471001E+03    0.00000000E+00        3  35   5   5  # H0-b-b eff. coupling^2, normalised to SM
    0.00000000E+00    1.85473163E+03        3  36   5   5  # A0-b-b eff. coupling^2, normalised to SM
#
    9.99988341E-01    0.00000000E+00        3  25   6   6  # h0-t-t eff. coupling^2, normalised to SM
    5.50820998E-04    0.00000000E+00        3  35   6   6  # H0-t-t eff. coupling^2, normalised to SM
    0.00000000E+00    5.39161560E-04        3  36   6   6  # A0-t-t eff. coupling^2, normalised to SM
#
    1.02162513E+00    0.00000000E+00        3  25  15  15  # h0-tau-tau eff. coupling^2, normalised to SM
    1.85471001E+03    0.00000000E+00        3  35  15  15  # H0-tau-tau eff. coupling^2, normalised to SM
    0.00000000E+00    1.85473163E+03        3  36  15  15  # A0-tau-tau eff. coupling^2, normalised to SM
#
Block HiggsBoundsInputHiggsCouplingsBosons
    9.99999938E-01        3  25  24  24  # h0-W-W eff. coupling^2, normalised to SM
    6.23620824E-08        3  35  24  24  # H0-W-W eff. coupling^2, normalised to SM
    0.00000000E+00        3  36  24  24  # A0-W-W eff. coupling^2, normalised to SM
#
    9.99999938E-01        3  25  23  23  # h0-Z-Z eff. coupling^2, normalised to SM
    6.23620824E-08        3  35  23  23  # H0-Z-Z eff. coupling^2, normalised to SM
    0.00000000E+00        3  36  23  23  # A0-Z-Z eff. coupling^2, normalised to SM
#
    8.87017557E-01        3  25  21  21  # h0-g-g eff. coupling^2, normalised to SM
    1.91713671E-08        3  35  21  21  # H0-g-g eff. coupling^2, normalised to SM
    4.53291417E-08        3  36  21  21  # A0-g-g eff. coupling^2, normalised to SM
#
    0.00000000E+00        3  25  25  23  # h0-h0-Z eff. coupling^2, normalised to SM
    0.00000000E+00        3  35  25  23  # H0-h0-Z eff. coupling^2, normalised to SM
    6.23620824E-08        3  36  25  23  # A0-h0-Z eff. coupling^2, normalised to SM
    0.00000000E+00        3  35  35  23  # H0-H0-Z eff. coupling^2, normalised to SM
    9.99999938E-01        3  36  35  23  # A0-H0-Z eff. coupling^2, normalised to SM
    0.00000000E+00        3  36  36  23  # A0-A0-Z eff. coupling^2, normalised to SM
#
    0.00000000E+00        4  25  21  21  23  # h0-g-g-Z eff. coupling^2, normalised to SM
    0.00000000E+00        4  35  21  21  23  # H0-g-g-Z eff. coupling^2, normalised to SM
    0.00000000E+00        4  36  21  21  23  # A0-g-g-Z eff. coupling^2, normalised to SM
#
#
#
#                             =================
#                             |The decay table|
#                             =================
#
# - The QCD corrections to the decays gluino -> squark  + quark
#                                     squark -> gaugino + quark_prime
#                                     squark -> squark_prime + Higgs
#                                     squark -> gluino  + quark
#   are included.
#
# - The multi-body decays for the inos, stops and sbottoms are included.
#
# - The loop induced decays for the gluino, neutralinos and stops
#   are included.
#
# - The SUSY decays of the top quark are included.
#
#
#         PDG            Width
DECAY         6     1.43805927E+00   # top decays
#          BR         NDA      ID1       ID2
     1.00000000E+00    2           5        24   # BR(t ->  b    W+)
#
#         PDG            Width
DECAY   1000021     1.23104807E+02   # gluino decays
#          BR         NDA      ID1       ID2
     5.89137469E-02    2     1000001        -1   # BR(~g -> ~d_L  db)
     5.89137469E-02    2    -1000001         1   # BR(~g -> ~d_L* d )
     1.15696811E-01    2     2000001        -1   # BR(~g -> ~d_R  db)
     1.15696811E-01    2    -2000001         1   # BR(~g -> ~d_R* d )
     5.90655748E-02    2     1000002        -2   # BR(~g -> ~u_L  ub)
     5.90655748E-02    2    -1000002         2   # BR(~g -> ~u_L* u )
     5.89137469E-02    2     1000003        -3   # BR(~g -> ~s_L  sb)
     5.89137469E-02    2    -1000003         3   # BR(~g -> ~s_L* s )
     1.15696811E-01    2     2000003        -3   # BR(~g -> ~s_R  sb)
     1.15696811E-01    2    -2000003         3   # BR(~g -> ~s_R* s )
     5.90655049E-02    2     1000004        -4   # BR(~g -> ~c_L  cb)
     5.90655049E-02    2    -1000004         4   # BR(~g -> ~c_L* c )
     3.26478047E-02    2     1000005        -5   # BR(~g -> ~b_1  bb)
     3.26478047E-02    2    -1000005         5   # BR(~g -> ~b_1* b )
#
#         PDG            Width
DECAY   1000006     9.32214736E+01   # stop1 decays
#          BR         NDA      ID1       ID2
     1.12397798E-02    2     1000022         6   # BR(~t_1 -> ~chi_10 t )
     2.29018756E-01    2     1000023         6   # BR(~t_1 -> ~chi_20 t )
     2.47821690E-01    2     1000025         6   # BR(~t_1 -> ~chi_30 t )
     5.09079392E-02    2     1000035         6   # BR(~t_1 -> ~chi_40 t )
     2.69374970E-01    2     1000024         5   # BR(~t_1 -> ~chi_1+ b )
     1.01098457E-01    2     1000037         5   # BR(~t_1 -> ~chi_2+ b )
     8.98777229E-02    2     1000021         6   # BR(~t_1 -> ~g      t )
     6.60685186E-04    2     1000005        24   # BR(~t_1 -> ~b_1    W+)
#
#         PDG            Width
DECAY   2000006     1.29353701E+02   # stop2 decays
#          BR         NDA      ID1       ID2
     6.05155413E-02    2     1000022         6   # BR(~t_2 -> ~chi_10 t )
     1.85940357E-01    2     1000023         6   # BR(~t_2 -> ~chi_20 t )
     1.74973871E-01    2     1000025         6   # BR(~t_2 -> ~chi_30 t )
     8.03510595E-03    2     1000035         6   # BR(~t_2 -> ~chi_40 t )
     3.38262211E-01    2     1000024         5   # BR(~t_2 -> ~chi_1+ b )
     1.60076127E-02    2     1000037         5   # BR(~t_2 -> ~chi_2+ b )
     1.25073892E-01    2     1000021         6   # BR(~t_2 -> ~g      t )
     1.86331150E-02    2     1000006        25   # BR(~t_2 -> ~t_1    h )
     2.77453472E-02    2     1000006        23   # BR(~t_2 -> ~t_1    Z )
     1.02561701E-04    2     1000005        24   # BR(~t_2 -> ~b_1    W+)
     4.47103856E-02    2     2000005        24   # BR(~t_2 -> ~b_2    W+)
#
#         PDG            Width
DECAY   1000005     3.15879931E+01   # sbottom1 decays
#          BR         NDA      ID1       ID2
     5.87104475E-02    2     1000022         5   # BR(~b_1 -> ~chi_10 b )
     2.36114126E-01    2     1000023         5   # BR(~b_1 -> ~chi_20 b )
     2.30272313E-01    2     1000025         5   # BR(~b_1 -> ~chi_30 b )
     1.15568969E-07    2     1000035         5   # BR(~b_1 -> ~chi_40 b )
     4.74902827E-01    2    -1000024         6   # BR(~b_1 -> ~chi_1- t )
     1.70965566E-07    2    -1000037         6   # BR(~b_1 -> ~chi_2- t )
#
#         PDG            Width
DECAY   2000005     9.20069668E+01   # sbottom2 decays
#          BR         NDA      ID1       ID2
     1.22724044E-02    2     1000022         5   # BR(~b_2 -> ~chi_10 b )
     1.16459217E-01    2     1000023         5   # BR(~b_2 -> ~chi_20 b )
     1.13982407E-01    2     1000025         5   # BR(~b_2 -> ~chi_30 b )
     6.15049572E-02    2     1000035         5   # BR(~b_2 -> ~chi_40 b )
     4.77758219E-01    2    -1000024         6   # BR(~b_2 -> ~chi_1- t )
     1.23782082E-01    2    -1000037         6   # BR(~b_2 -> ~chi_2- t )
     9.34008048E-02    2     1000021         5   # BR(~b_2 -> ~g      b )
     4.28081226E-04    2     1000005        25   # BR(~b_2 -> ~b_1    h )
     4.11827793E-04    2     1000005        23   # BR(~b_2 -> ~b_1    Z )
#
#         PDG            Width
DECAY   1000002     5.84738450E-01   # sup_L decays
#          BR         NDA      ID1       ID2
     5.27773767E-01    2     1000022         2   # BR(~u_L -> ~chi_10 u)
     3.81761294E-02    2     1000023         2   # BR(~u_L -> ~chi_20 u)
     1.39475654E-04    2     1000025         2   # BR(~u_L -> ~chi_30 u)
     1.16101741E-01    2     1000035         2   # BR(~u_L -> ~chi_40 u)
     8.66674733E-02    2     1000024         1   # BR(~u_L -> ~chi_1+ d)
     2.31141414E-01    2     1000037         1   # BR(~u_L -> ~chi_2+ d)
#
#         PDG            Width
DECAY   2000002     4.51282830E+01   # sup_R decays
#          BR         NDA      ID1       ID2
     1.83201680E-01    2     1000022         2   # BR(~u_R -> ~chi_10 u)
     2.08594969E-03    2     1000023         2   # BR(~u_R -> ~chi_20 u)
     3.63057112E-03    2     1000025         2   # BR(~u_R -> ~chi_30 u)
     6.59881637E-08    2     1000035         2   # BR(~u_R -> ~chi_40 u)
     8.11081733E-01    2     1000021         2   # BR(~u_R -> ~g      u)
#
#         PDG            Width
DECAY   1000001     5.35813468E-01   # sdown_L decays
#          BR         NDA      ID1       ID2
     5.66507451E-01    2     1000022         1   # BR(~d_L -> ~chi_10 d)
     1.96861496E-03    2     1000023         1   # BR(~d_L -> ~chi_20 d)
     3.93720295E-02    2     1000025         1   # BR(~d_L -> ~chi_30 d)
     1.30255682E-01    2     1000035         1   # BR(~d_L -> ~chi_40 d)
     1.96367083E-03    2    -1000024         2   # BR(~d_L -> ~chi_1- u)
     2.59932552E-01    2    -1000037         2   # BR(~d_L -> ~chi_2- u)
#
#         PDG            Width
DECAY   2000001     9.95009113E-01   # sdown_R decays
#          BR         NDA      ID1       ID2
     9.70834572E-01    2     1000022         1   # BR(~d_R -> ~chi_10 d)
     1.06507594E-02    2     1000023         1   # BR(~d_R -> ~chi_20 d)
     1.85146682E-02    2     1000025         1   # BR(~d_R -> ~chi_30 d)
#
#         PDG            Width
DECAY   1000004     5.73862435E-01   # scharm_L decays
#          BR         NDA      ID1       ID2
     5.41615230E-01    2     1000022         4   # BR(~c_L -> ~chi_10 c)
     3.91163607E-02    2     1000023         4   # BR(~c_L -> ~chi_20 c)
     1.42907153E-04    2     1000025         4   # BR(~c_L -> ~chi_30 c)
     1.10438999E-01    2     1000035         4   # BR(~c_L -> ~chi_40 c)
     8.88030626E-02    2     1000024         3   # BR(~c_L -> ~chi_1+ s)
     2.19883440E-01    2     1000037         3   # BR(~c_L -> ~chi_2+ s)
#
#         PDG            Width
DECAY   2000004     3.53423584E+01   # scharm_R decays
#          BR         NDA      ID1       ID2
     2.45771046E-01    2     1000022         4   # BR(~c_R -> ~chi_10 c)
     2.79448216E-03    2     1000023         4   # BR(~c_R -> ~chi_20 c)
     4.86364406E-03    2     1000025         4   # BR(~c_R -> ~chi_30 c)
     8.74522570E-08    2     1000035         4   # BR(~c_R -> ~chi_40 c)
     7.46570740E-01    2     1000021         4   # BR(~c_R -> ~g      c)
#
#         PDG            Width
DECAY   1000003     5.24341399E-01   # sstrange_L decays
#          BR         NDA      ID1       ID2
     5.83058038E-01    2     1000022         3   # BR(~s_L -> ~chi_10 s)
     2.02297530E-03    2     1000023         3   # BR(~s_L -> ~chi_20 s)
     4.04582054E-02    2     1000025         3   # BR(~s_L -> ~chi_30 s)
     1.24349378E-01    2     1000035         3   # BR(~s_L -> ~chi_40 s)
     2.01791575E-03    2    -1000024         4   # BR(~s_L -> ~chi_1- c)
     2.48093488E-01    2    -1000037         4   # BR(~s_L -> ~chi_2- c)
#
#         PDG            Width
DECAY   2000003     9.88020168E-01   # sstrange_R decays
#          BR         NDA      ID1       ID2
     9.70882684E-01    2     1000022         3   # BR(~s_R -> ~chi_10 s)
     1.06333645E-02    2     1000023         3   # BR(~s_R -> ~chi_20 s)
     1.84839515E-02    2     1000025         3   # BR(~s_R -> ~chi_30 s)
#
#         PDG            Width
DECAY   1000011     4.88622956E+00   # selectron_L decays
#          BR         NDA      ID1       ID2
     6.26343104E-01    2     1000022        11   # BR(~e_L -> ~chi_10 e-)
     1.61433838E-02    2     1000023        11   # BR(~e_L -> ~chi_20 e-)
     6.06611148E-03    2     1000025        11   # BR(~e_L -> ~chi_30 e-)
     1.16958777E-01    2     1000035        11   # BR(~e_L -> ~chi_40 e-)
     2.39260595E-04    2    -1000024        12   # BR(~e_L -> ~chi_1- nu_e)
     2.34249363E-01    2    -1000037        12   # BR(~e_L -> ~chi_2- nu_e)
#
#         PDG            Width
DECAY   2000011     1.46153199E+00   # selectron_R decays
#          BR         NDA      ID1       ID2
     9.98370667E-01    2     1000022        11   # BR(~e_R -> ~chi_10 e-)
     6.77061974E-04    2     1000023        11   # BR(~e_R -> ~chi_20 e-)
     9.52271087E-04    2     1000025        11   # BR(~e_R -> ~chi_30 e-)
#
#         PDG            Width
DECAY   1000013     4.88622951E+00   # smuon_L decays
#          BR         NDA      ID1       ID2
     6.26343108E-01    2     1000022        13   # BR(~mu_L -> ~chi_10 mu-)
     1.61433839E-02    2     1000023        13   # BR(~mu_L -> ~chi_20 mu-)
     6.06611151E-03    2     1000025        13   # BR(~mu_L -> ~chi_30 mu-)
     1.16958771E-01    2     1000035        13   # BR(~mu_L -> ~chi_40 mu-)
     2.39260598E-04    2    -1000024        14   # BR(~mu_L -> ~chi_1- nu_mu)
     2.34249366E-01    2    -1000037        14   # BR(~mu_L -> ~chi_2- nu_mu)
#
#         PDG            Width
DECAY   2000013     1.46153159E+00   # smuon_R decays
#          BR         NDA      ID1       ID2
     9.98370675E-01    2     1000022        13   # BR(~mu_R -> ~chi_10 mu-)
     6.77059085E-04    2     1000023        13   # BR(~mu_R -> ~chi_20 mu-)
     9.52265994E-04    2     1000025        13   # BR(~mu_R -> ~chi_30 mu-)
#
#         PDG            Width
DECAY   1000015     7.62884716E+00   # stau_1 decays
#          BR         NDA      ID1       ID2
     2.73727641E-01    2     1000022        15   # BR(~tau_1 -> ~chi_10  tau-)
     3.69919890E-01    2     1000023        15   # BR(~tau_1 -> ~chi_20  tau-)
     3.56212787E-01    2     1000025        15   # BR(~tau_1 -> ~chi_30  tau-)
     1.39682349E-04    2    -1000024        16   # BR(~tau_1 -> ~chi_1-  nu_tau)
#
#         PDG            Width
DECAY   2000015     4.36821948E+01   # stau_2 decays
#          BR         NDA      ID1       ID2
     3.87869622E-01    2     1000022        15   # BR(~tau_2 -> ~chi_10  tau-)
     1.49481498E-01    2     1000023        15   # BR(~tau_2 -> ~chi_20  tau-)
     1.49079086E-01    2     1000025        15   # BR(~tau_2 -> ~chi_30  tau-)
     7.00756305E-06    2     1000035        15   # BR(~tau_2 -> ~chi_40  tau-)
     2.95567960E-01    2    -1000024        16   # BR(~tau_2 -> ~chi_1-  nu_tau)
     1.38402196E-05    2    -1000037        16   # BR(~tau_2 -> ~chi_2-  nu_tau)
     7.40498327E-03    2     1000016       -37   # BR(~tau_2 -> ~nu_tauL H-)
     1.55353111E-03    2     1000016       -24   # BR(~tau_2 -> ~nu_tauL W-)
     8.19383662E-04    2     1000015        25   # BR(~tau_2 -> ~tau_1   h)
     3.70188729E-03    2     1000015        35   # BR(~tau_2 -> ~tau_1   H)
     3.70265333E-03    2     1000015        36   # BR(~tau_2 -> ~tau_1   A)
     7.98548285E-04    2     1000015        23   # BR(~tau_2 -> ~tau_1   Z)
#
#         PDG            Width
DECAY   1000012     4.90267631E+00   # snu_eL decays
#          BR         NDA      ID1       ID2
     6.20251903E-01    2     1000022        12   # BR(~nu_eL -> ~chi_10 nu_e)
     1.61717305E-03    2     1000023        12   # BR(~nu_eL -> ~chi_20 nu_e)
     2.03216193E-02    2     1000025        12   # BR(~nu_eL -> ~chi_30 nu_e)
     1.15706962E-01    2     1000035        12   # BR(~nu_eL -> ~chi_40 nu_e)
     1.14843167E-02    2     1000024        11   # BR(~nu_eL -> ~chi_1+ e-)
     2.30618025E-01    2     1000037        11   # BR(~nu_eL -> ~chi_2+ e-)
#
#         PDG            Width
DECAY   1000014     4.90267623E+00   # snu_muL decays
#          BR         NDA      ID1       ID2
     6.20251913E-01    2     1000022        14   # BR(~nu_muL -> ~chi_10 nu_mu)
     1.61717308E-03    2     1000023        14   # BR(~nu_muL -> ~chi_20 nu_mu)
     2.03216196E-02    2     1000025        14   # BR(~nu_muL -> ~chi_30 nu_mu)
     1.15706964E-01    2     1000035        14   # BR(~nu_muL -> ~chi_40 nu_mu)
     1.14843168E-02    2     1000024        13   # BR(~nu_muL -> ~chi_1+ mu-)
     2.30618013E-01    2     1000037        13   # BR(~nu_muL -> ~chi_2+ mu-)
#
#         PDG            Width
DECAY   1000016     7.63545356E+00   # snu_tauL decays
#          BR         NDA      ID1       ID2
     2.47779558E-01    2     1000022        16   # BR(~nu_tauL -> ~chi_10 nu_tau)
     6.22486423E-04    2     1000023        16   # BR(~nu_tauL -> ~chi_20 nu_tau)
     7.81261138E-03    2     1000025        16   # BR(~nu_tauL -> ~chi_30 nu_tau)
     7.43785344E-01    2     1000024        15   # BR(~nu_tauL -> ~chi_1+ tau-)
#
#         PDG            Width
DECAY   1000024     1.38200460E-01   # chargino1+ decays
#          BR         NDA      ID1       ID2
     1.00000000E+00    2     1000022        24   # BR(~chi_1+ -> ~chi_10  W+)
#
#         PDG            Width
DECAY   1000037     2.35651212E+01   # chargino2+ decays
#          BR         NDA      ID1       ID2
     8.39276685E-02    2     1000016       -15   # BR(~chi_2+ -> ~nu_tau1 tau+)
     8.35930465E-02    2    -1000015        16   # BR(~chi_2+ -> ~tau_1+  nu_tau)
     1.74301329E-01    2     1000024        23   # BR(~chi_2+ -> ~chi_1+  Z )
     7.30613357E-04    2     1000022        24   # BR(~chi_2+ -> ~chi_10  W+)
     1.69336410E-01    2     1000023        24   # BR(~chi_2+ -> ~chi_20  W+)
     1.68167053E-01    2     1000025        24   # BR(~chi_2+ -> ~chi_30  W+)
     1.77098271E-01    2     1000024        25   # BR(~chi_2+ -> ~chi_1+  h )
     3.57876734E-02    2     1000024        35   # BR(~chi_2+ -> ~chi_1+  H )
     3.58271165E-02    2     1000024        36   # BR(~chi_2+ -> ~chi_1+  A )
     2.28024186E-03    2     1000022        37   # BR(~chi_2+ -> ~chi_10  H+)
     3.49821648E-02    2     1000023        37   # BR(~chi_2+ -> ~chi_20  H+)
     3.39684121E-02    2     1000025        37   # BR(~chi_2+ -> ~chi_30  H+)
#
#         PDG            Width
DECAY   1000022     0.00000000E+00   # neutralino1 decays
#
#         PDG            Width
DECAY   1000023     1.09550201E-01   # neutralino2 decays
#          BR         NDA      ID1       ID2
     7.43345830E-01    2     1000022        23   # BR(~chi_20 -> ~chi_10   Z )
     2.56654170E-01    2     1000022        25   # BR(~chi_20 -> ~chi_10   h )
#
#         PDG            Width
DECAY   1000025     1.23069908E-01   # neutralino3 decays
#          BR         NDA      ID1       ID2
     4.80635208E-01    2     1000022        23   # BR(~chi_30 -> ~chi_10   Z )
     5.19364792E-01    2     1000022        25   # BR(~chi_30 -> ~chi_10   h )
#
#         PDG            Width
DECAY   1000035     2.35676331E+01   # neutralino4 decays
#          BR         NDA      ID1       ID2
     4.36942892E-04    2     1000022        23   # BR(~chi_40 -> ~chi_10   Z )
     6.24271975E-02    2     1000023        23   # BR(~chi_40 -> ~chi_20   Z )
     1.11130657E-01    2     1000025        23   # BR(~chi_40 -> ~chi_30   Z )
     1.69596201E-01    2     1000024       -24   # BR(~chi_40 -> ~chi_1+   W-)
     1.69596201E-01    2    -1000024        24   # BR(~chi_40 -> ~chi_1-   W+)
     3.01912657E-04    2     1000022        25   # BR(~chi_40 -> ~chi_10   h )
     1.06320622E-03    2     1000022        35   # BR(~chi_40 -> ~chi_10   H )
     1.23153601E-03    2     1000022        36   # BR(~chi_40 -> ~chi_10   A )
     1.14171397E-01    2     1000023        25   # BR(~chi_40 -> ~chi_20   h )
     2.59237762E-02    2     1000023        35   # BR(~chi_40 -> ~chi_20   H )
     9.26127551E-03    2     1000023        36   # BR(~chi_40 -> ~chi_20   A )
     6.21467086E-02    2     1000025        25   # BR(~chi_40 -> ~chi_30   h )
     8.88458840E-03    2     1000025        35   # BR(~chi_40 -> ~chi_30   H )
     2.53600407E-02    2     1000025        36   # BR(~chi_40 -> ~chi_30   A )
     3.55171951E-02    2     1000024       -37   # BR(~chi_40 -> ~chi_1+   H-)
     3.55171951E-02    2    -1000024        37   # BR(~chi_40 -> ~chi_1-   H+)
     6.24126903E-09    2     2000001        -1   # BR(~chi_40 -> ~d_R      db)
     6.24126903E-09    2    -2000001         1   # BR(~chi_40 -> ~d_R*     d )
     6.24126903E-09    2     2000003        -3   # BR(~chi_40 -> ~s _R      sb)
     6.24126903E-09    2    -2000003         3   # BR(~chi_40 -> ~s _R*     s )
     1.54707158E-07    2     2000011       -11   # BR(~chi_40 -> ~e_R-     e+)
     1.54707158E-07    2    -2000011        11   # BR(~chi_40 -> ~e_R+     e-)
     1.54707158E-07    2     2000013       -13   # BR(~chi_40 -> ~mu_R-    mu+)
     1.54707158E-07    2    -2000013        13   # BR(~chi_40 -> ~mu_R+    mu-)
     4.16725316E-02    2     1000015       -15   # BR(~chi_40 -> ~tau_1-   tau+)
     4.16725316E-02    2    -1000015        15   # BR(~chi_40 -> ~tau_1+   tau-)
     4.20441306E-02    2     1000016       -16   # BR(~chi_40 -> ~nu_tau1  nu_taub)
     4.20441306E-02    2    -1000016        16   # BR(~chi_40 -> ~nu_tau1* nu_tau )
#
#         PDG            Width
DECAY        25     4.42753750E-03   # h decays
#          BR         NDA      ID1       ID2
     5.78300448E-01    2           5        -5   # BR(h -> b       bb     )
     6.03785023E-02    2         -15        15   # BR(h -> tau+    tau-   )
     2.13732827E-04    2         -13        13   # BR(h -> mu+     mu-    )
     2.32541990E-04    2           3        -3   # BR(h -> s       sb     )
     1.97719747E-02    2           4        -4   # BR(h -> c       cb     )
     7.45172324E-02    2          21        21   # BR(h -> g       g      )
     2.22600026E-03    2          22        22   # BR(h -> gam     gam    )
     1.60321701E-03    2          22        23   # BR(h -> Z       gam    )
     2.22670451E-01    2          24       -24   # BR(h -> W+      W-     )
     2.83653432E-02    2          23        23   # BR(h -> Z       Z      )
     1.17205567E-02    2     1000022   1000022   # BR(h -> ~chi_10 ~chi_10)
#
#         PDG            Width
DECAY        35     4.13451419E+01   # H decays
#          BR         NDA      ID1       ID2
     8.23118801E-01    2           5        -5   # BR(H -> b       bb     )
     1.33234985E-01    2         -15        15   # BR(H -> tau+    tau-   )
     4.75501327E-04    2         -13        13   # BR(H -> mu+     mu-    )
     3.05372578E-04    2           3        -3   # BR(H -> s       sb     )
     8.97183443E-09    2           4        -4   # BR(H -> c       cb     )
     8.48430590E-04    2           6        -6   # BR(H -> t       tb     )
     4.52621582E-05    2          21        21   # BR(H -> g       g      )
     1.67739825E-08    2          22        22   # BR(H -> gam     gam    )
     1.97282695E-08    2          23        22   # BR(H -> Z       gam    )
     1.57778859E-06    2          24       -24   # BR(H -> W+      W-     )
     7.84043346E-07    2          23        23   # BR(H -> Z       Z      )
     5.49827625E-06    2          25        25   # BR(H -> h       h      )
     7.55075299E-04    2     1000024  -1000024   # BR(H -> ~chi_1+ ~chi_1-)
     2.53612503E-03    2     1000022   1000022   # BR(H -> ~chi_10 ~chi_10)
     7.49864590E-05    2     1000023   1000023   # BR(H -> ~chi_20 ~chi_20)
     1.20999255E-03    2     1000025   1000025   # BR(H -> ~chi_30 ~chi_30)
     1.83674362E-02    2     1000022   1000023   # BR(H -> ~chi_10 ~chi_20)
     1.79878713E-02    2     1000022   1000025   # BR(H -> ~chi_10 ~chi_30)
     1.03196135E-03    2     1000023   1000025   # BR(H -> ~chi_20 ~chi_30)
     1.46743861E-07    2     2000011  -2000011   # BR(H -> ~e_R-   ~e_R+  )
     1.46743861E-07    2     2000013  -2000013   # BR(H -> ~mu_R-  ~mu_R+ )
#
#         PDG            Width
DECAY        36     4.13535486E+01   # A decays
#          BR         NDA      ID1       ID2
     8.22978428E-01    2           5        -5   # BR(A -> b       bb     )
     1.33209514E-01    2         -15        15   # BR(A -> tau+    tau-   )
     4.75407700E-04    2         -13        13   # BR(A -> mu+     mu-    )
     3.05324516E-04    2           3        -3   # BR(A -> s       sb     )
     8.86064507E-09    2           4        -4   # BR(A -> c       cb     )
     8.63841510E-04    2           6        -6   # BR(A -> t       tb     )
     6.95805587E-05    2          21        21   # BR(A -> g       g      )
     5.90736397E-08    2          22        22   # BR(A -> gam     gam    )
     3.44721649E-08    2          23        22   # BR(A -> Z       gam    )
     1.57985181E-06    2          23        25   # BR(A -> Z       h      )
     8.66978447E-04    2     1000024  -1000024   # BR(A -> ~chi_1+ ~chi_1-)
     2.51027259E-03    2     1000022   1000022   # BR(A -> ~chi_10 ~chi_10)
     9.34900918E-05    2     1000023   1000023   # BR(A -> ~chi_20 ~chi_20)
     1.25355340E-03    2     1000025   1000025   # BR(A -> ~chi_30 ~chi_30)
     1.97964491E-02    2     1000022   1000023   # BR(A -> ~chi_10 ~chi_20)
     1.66166902E-02    2     1000022   1000025   # BR(A -> ~chi_10 ~chi_30)
     9.58787461E-04    2     1000023   1000025   # BR(A -> ~chi_20 ~chi_30)
#
#         PDG            Width
DECAY        37     3.93579529E+01   # H+ decays
#          BR         NDA      ID1       ID2
     1.37726943E-03    2           4        -5   # BR(H+ -> c       bb     )
     1.40191596E-01    2         -15        16   # BR(H+ -> tau+    nu_tau )
     5.00325850E-04    2         -13        14   # BR(H+ -> mu+     nu_mu  )
     1.37726328E-05    2           2        -5   # BR(H+ -> u       bb     )
     1.60297302E-05    2           2        -3   # BR(H+ -> u       sb     )
     3.15522448E-04    2           4        -3   # BR(H+ -> c       sb     )
     8.13923305E-01    2           6        -5   # BR(H+ -> t       bb     )
     1.67254449E-06    2          24        25   # BR(H+ -> W+      h      )
     2.79257220E-12    2          24        36   # BR(H+ -> W+      A      )
     4.24855288E-02    2     1000024   1000022   # BR(H+ -> ~chi_1+ ~chi_10)
     9.09561150E-04    2     1000024   1000023   # BR(H+ -> ~chi_1+ ~chi_20)
     2.65416956E-04    2     1000024   1000025   # BR(H+ -> ~chi_1+ ~chi_30)
