#
#                              ======================
#                              | THE SUSYHIT OUTPUT |
#                              ======================
#
#
#              ------------------------------------------------------
#              |     This is the output of the SUSY-HIT package     |
#              |  created by A.Djouadi, M.Muehlleitner and M.Spira. |
#              |  In case of problems with SUSY-HIT email to        |
#              |           margarete.muehlleitner@cern.ch           |
#              |           michael.spira@psi.ch                     |
#              |           abdelhak.djouadi@cern.ch                 |
#              ------------------------------------------------------
#
#              ------------------------------------------------------
#              |  SUSY Les Houches Accord - MSSM Spectrum + Decays  |
#              |              based on the decay programs           |
#              |                                                    |
#              |                     SDECAY 1.3b                    |
#              |                                                    |
#              |  Authors: M.Muhlleitner, A.Djouadi and Y.Mambrini  |
#              |  Ref.:    Comput.Phys.Commun.168(2005)46           |
#              |           [hep-ph/0311167]                         |
#              |                                                    |
#              |                     HDECAY 3.4                     |
#              |                                                    |
#              |  By: A.Djouadi,J.Kalinowski,M.Muhlleitner,M.Spira  |
#              |  Ref.:    Comput.Phys.Commun.108(1998)56           |
#              |           [hep-ph/9704448]                         |
#              |                                                    |
#              |                                                    |
#              |  If not stated otherwise all DRbar couplings and   |
#              |  soft SUSY breaking masses are given at the scale  |
#              |  Q=  0.34492230E+04
#              |                                                    |
#              ------------------------------------------------------
#
#
BLOCK DCINFO  # Decay Program information
     1   SDECAY/HDECAY # decay calculator
     2   1.3b  /3.4    # version number
#
BLOCK SPINFO  # Spectrum calculator information
     1     SOFTSUSY    # spectrum calculator               
     2     3.4.0       # version number                    
#
BLOCK MODSEL  # Model selection
     1     0   #  nonUniversal                                     
#
BLOCK SMINPUTS  # Standard Model inputs
         1     1.27908970E+02   # alpha_em^-1(M_Z)^MSbar
         2     1.16637870E-05   # G_F [GeV^-2]
         3     1.18400000E-01   # alpha_S(M_Z)^MSbar
         4     9.11876000E+01   # M_Z pole mass
         5     4.18000000E+00   # mb(mb)^MSbar
         6     1.73200000E+02   # mt pole mass
         7     1.77700000E+00   # mtau pole mass
#
BLOCK MINPAR  # Input parameters - minimal models
         3     5.45300000E+01   # tanb                
#
BLOCK EXTPAR  # Input parameters - non-minimal models
         0    -1.00000000E+00   # Set                 
         1    -2.75096000E+03   # M_1(MX)             
         2     1.48383000E+03   # M_2(MX)             
         3     2.55854000E+03   # M_3(MX)             
        11     4.20781000E+03   # At(MX)              
        12    -1.19072000E+03   # Ab(MX)              
        13    -9.67210000E+02   # Atau(MX)            
        23    -9.81500000E+01   # mu(MX)              
        26     1.64304000E+03   # mA(pole)            
        31     3.06077000E+03   # meL(MX)             
        32     3.06077000E+03   # mmuL(MX)            
        33     2.49280000E+02   # mtauL(MX)           
        34     1.11404000E+03   # meR(MX)             
        35     1.11404000E+03   # mmuR(MX)            
        36     3.78360000E+02   # mtauR(MX)           
        41     2.81739000E+03   # mqL1(MX)            
        42     2.81739000E+03   # mqL2(MX)            
        43     3.37462000E+03   # mqL3(MX)            
        44     3.03085000E+03   # muR(MX)             
        45     3.03085000E+03   # mcR(MX)             
        46     3.52454000E+03   # mtR(MX)             
        47     2.14460000E+02   # mdR(MX)             
        48     2.14460000E+02   # msR(MX)             
        49     1.50471000E+03   # mbR(MX)             
#
BLOCK MASS  # Mass Spectrum
# PDG code           mass       particle
        24     8.03936003E+01   # W+
        25     1.27746819E+02   # h
        35     1.64304354E+03   # H
        36     1.64303995E+03   # A
        37     1.64544916E+03   # H+
         5     4.81876030E+00   # b-quark pole mass calculated from mb(mb)_Msbar
   1000001     2.92985233E+03   # ~d_L
   2000001     6.57347440E+02   # ~d_R
   1000002     2.92892758E+03   # ~u_L
   2000002     3.12253363E+03   # ~u_R
   1000003     2.92985233E+03   # ~s_L
   2000003     6.57347440E+02   # ~s_R
   1000004     2.92892758E+03   # ~c_L
   2000004     3.12253363E+03   # ~c_R
   1000005     1.60767529E+03   # ~b_1
   2000005     3.40341355E+03   # ~b_2
   1000006     3.36385145E+03   # ~t_1
   2000006     3.55172679E+03   # ~t_2
   1000011     3.06975860E+03   # ~e_L
   2000011     1.15414162E+03   # ~e_R
   1000012     3.06840473E+03   # ~nu_eL
   1000013     3.06975860E+03   # ~mu_L
   2000013     1.15414162E+03   # ~mu_R
   1000014     3.06840473E+03   # ~nu_muL
   1000015     2.84753362E+02   # ~tau_1
   2000015     4.37334700E+02   # ~tau_2
   1000016     2.74291553E+02   # ~nu_tauL
   1000021     2.74864929E+03   # ~g
   1000022     1.02962483E+02   # ~chi_10
   1000023    -1.06076763E+02   # ~chi_20
   1000025     1.52545895E+03   # ~chi_30
   1000035    -2.70327756E+03   # ~chi_40
   1000024     1.04737808E+02   # ~chi_1+
   1000037     1.52563008E+03   # ~chi_2+
#
BLOCK NMIX  # Neutralino Mixing Matrix
  1  1     1.06990688E-02   # N_11
  1  2     3.83677615E-02   # N_12
  1  3     7.12289156E-01   # N_13
  1  4     7.00755024E-01   # N_14
  2  1     1.22115638E-02   # N_21
  2  2     3.53045627E-02   # N_22
  2  3    -7.01880861E-01   # N_23
  2  4     7.11314082E-01   # N_24
  3  1    -5.42394544E-04   # N_31
  3  2     9.98639781E-01   # N_32
  3  3    -2.55253094E-03   # N_33
  3  4    -5.20747315E-02   # N_34
  4  1     9.99868048E-01   # N_41
  4  2    -3.00006055E-04   # N_42
  4  3     9.48972967E-04   # N_43
  4  4    -1.62140680E-02   # N_44
#
BLOCK UMIX  # Chargino Mixing Matrix U
  1  1     3.62082462E-03   # U_11
  1  2     9.99993445E-01   # U_12
  2  1    -9.99993445E-01   # U_21
  2  2     3.62082462E-03   # U_22
#
BLOCK VMIX  # Chargino Mixing Matrix V
  1  1     7.37178243E-02   # V_11
  1  2    -9.97279140E-01   # V_12
  2  1    -9.97279140E-01   # V_21
  2  2    -7.37178243E-02   # V_22
#
BLOCK STOPMIX  # Stop Mixing Matrix
  1  1     8.86983407E-01   # cos(theta_t)
  1  2    -4.61801295E-01   # sin(theta_t)
  2  1     4.61801295E-01   # -sin(theta_t)
  2  2     8.86983407E-01   # cos(theta_t)
#
BLOCK SBOTMIX  # Sbottom Mixing Matrix
  1  1    -1.05193799E-03   # cos(theta_b)
  1  2     9.99999447E-01   # sin(theta_b)
  2  1    -9.99999447E-01   # -sin(theta_b)
  2  2    -1.05193799E-03   # cos(theta_b)
#
BLOCK STAUMIX  # Stau Mixing Matrix
  1  1     9.97681139E-01   # cos(theta_tau)
  1  2    -6.80613318E-02   # sin(theta_tau)
  2  1     6.80613318E-02   # -sin(theta_tau)
  2  2     9.97681139E-01   # cos(theta_tau)
#
BLOCK ALPHA  # Higgs mixing
          -1.85627479E-02   # Mixing angle in the neutral Higgs boson sector
#
BLOCK HMIX Q=  3.44922300E+03  # DRbar Higgs Parameters
         1    -1.01615496E+02   # mu(Q)MSSM           
         2     5.43425424E+01   # tan                 
         3     2.41943448E+02   # higgs               
         4     2.73529496E+06   # mA^2(Q)MSSM         
#
BLOCK GAUGE Q=  3.44922300E+03  # The gauge couplings
     1     3.66234185E-01   # gprime(Q) DRbar
     2     6.40906302E-01   # g(Q) DRbar
     3     1.01094137E+00   # g3(Q) DRbar
#
BLOCK AU Q=  3.44922300E+03  # The trilinear couplings
  1  1     0.00000000E+00   # A_u(Q) DRbar
  2  2     0.00000000E+00   # A_c(Q) DRbar
  3  3     4.20781002E+03   # A_t(Q) DRbar
#
BLOCK AD Q=  3.44922300E+03  # The trilinear couplings
  1  1     0.00000000E+00   # A_d(Q) DRbar
  2  2     0.00000000E+00   # A_s(Q) DRbar
  3  3    -1.19071998E+03   # A_b(Q) DRbar
#
BLOCK AE Q=  3.44922300E+03  # The trilinear couplings
  1  1     0.00000000E+00   # A_e(Q) DRbar
  2  2     0.00000000E+00   # A_mu(Q) DRbar
  3  3    -9.67209991E+02   # A_tau(Q) DRbar
#
BLOCK Yu Q=  3.44922300E+03  # The Yukawa couplings
  1  1     0.00000000E+00   # y_u(Q) DRbar
  2  2     0.00000000E+00   # y_c(Q) DRbar
  3  3     8.30799105E-01   # y_t(Q) DRbar
#
BLOCK Yd Q=  3.44922300E+03  # The Yukawa couplings
  1  1     0.00000000E+00   # y_d(Q) DRbar
  2  2     0.00000000E+00   # y_s(Q) DRbar
  3  3     7.45338184E-01   # y_b(Q) DRbar
#
BLOCK Ye Q=  3.44922300E+03  # The Yukawa couplings
  1  1     0.00000000E+00   # y_e(Q) DRbar
  2  2     0.00000000E+00   # y_mu(Q) DRbar
  3  3     5.27262240E-01   # y_tau(Q) DRbar
#
BLOCK MSOFT Q=  3.44922300E+03  # The soft SUSY breaking masses at the scale Q
         1    -2.75096000E+03   # M_1(Q)              
         2     1.48383000E+03   # M_2(Q)              
         3     2.55854000E+03   # M_3(Q)              
        21     2.98002717E+06   # mH1^2(Q)            
        22     2.07364586E+05   # mH2^2(Q)            
        31     3.06077000E+03   # meL(Q)              
        32     3.06077000E+03   # mmuL(Q)             
        33     2.49279998E+02   # mtauL(Q)            
        34     1.11404000E+03   # meR(Q)              
        35     1.11404000E+03   # mmuR(Q)             
        36     3.78359999E+02   # mtauR(Q)            
        41     2.81738999E+03   # mqL1(Q)             
        42     2.81738999E+03   # mqL2(Q)             
        43     3.37461998E+03   # mqL3(Q)             
        44     3.03084999E+03   # muR(Q)              
        45     3.03084999E+03   # mcR(Q)              
        46     3.52453999E+03   # mtR(Q)              
        47     2.14459880E+02   # mdR(Q)              
        48     2.14459880E+02   # msR(Q)              
        49     1.50470996E+03   # mbR(Q)              
#
Block HiggsBoundsInputHiggsCouplingsFermions
# ScalarNormEffCoupSq PseudoSNormEffCoupSq NP   IP1 IP2 IP2
    1.01779800E+00    0.00000000E+00        3  25   5   5  # h0-b-b eff. coupling^2, normalised to SM
    2.95309412E+03    0.00000000E+00        3  35   5   5  # H0-b-b eff. coupling^2, normalised to SM
    0.00000000E+00    2.95311191E+03        3  36   5   5  # A0-b-b eff. coupling^2, normalised to SM
#
    9.99993973E-01    0.00000000E+00        3  25   6   6  # h0-t-t eff. coupling^2, normalised to SM
    3.44652703E-04    0.00000000E+00        3  35   6   6  # H0-t-t eff. coupling^2, normalised to SM
    0.00000000E+00    3.38625839E-04        3  36   6   6  # A0-t-t eff. coupling^2, normalised to SM
#
    1.01779800E+00    0.00000000E+00        3  25  15  15  # h0-tau-tau eff. coupling^2, normalised to SM
    2.95309412E+03    0.00000000E+00        3  35  15  15  # H0-tau-tau eff. coupling^2, normalised to SM
    0.00000000E+00    2.95311191E+03        3  36  15  15  # A0-tau-tau eff. coupling^2, normalised to SM
#
Block HiggsBoundsInputHiggsCouplingsBosons
    9.99999973E-01        3  25  24  24  # h0-W-W eff. coupling^2, normalised to SM
    2.65805956E-08        3  35  24  24  # H0-W-W eff. coupling^2, normalised to SM
    0.00000000E+00        3  36  24  24  # A0-W-W eff. coupling^2, normalised to SM
#
    9.99999973E-01        3  25  23  23  # h0-Z-Z eff. coupling^2, normalised to SM
    2.65805956E-08        3  35  23  23  # H0-Z-Z eff. coupling^2, normalised to SM
    0.00000000E+00        3  36  23  23  # A0-Z-Z eff. coupling^2, normalised to SM
#
    8.88600167E-01        3  25  21  21  # h0-g-g eff. coupling^2, normalised to SM
    9.44196681E-09        3  35  21  21  # H0-g-g eff. coupling^2, normalised to SM
    1.75790538E-08        3  36  21  21  # A0-g-g eff. coupling^2, normalised to SM
#
    0.00000000E+00        3  25  25  23  # h0-h0-Z eff. coupling^2, normalised to SM
    0.00000000E+00        3  35  25  23  # H0-h0-Z eff. coupling^2, normalised to SM
    2.65805956E-08        3  36  25  23  # A0-h0-Z eff. coupling^2, normalised to SM
    0.00000000E+00        3  35  35  23  # H0-H0-Z eff. coupling^2, normalised to SM
    9.99999973E-01        3  36  35  23  # A0-H0-Z eff. coupling^2, normalised to SM
    0.00000000E+00        3  36  36  23  # A0-A0-Z eff. coupling^2, normalised to SM
#
    0.00000000E+00        4  25  21  21  23  # h0-g-g-Z eff. coupling^2, normalised to SM
    0.00000000E+00        4  35  21  21  23  # H0-g-g-Z eff. coupling^2, normalised to SM
    0.00000000E+00        4  36  21  21  23  # A0-g-g-Z eff. coupling^2, normalised to SM
#
#
#
#                             =================
#                             |The decay table|
#                             =================
#
# - The QCD corrections to the decays gluino -> squark  + quark
#                                     squark -> gaugino + quark_prime
#                                     squark -> squark_prime + Higgs
#                                     squark -> gluino  + quark
#   are included.
#
# - The multi-body decays for the inos, stops and sbottoms are included.
#
# - The loop induced decays for the gluino, neutralinos and stops
#   are included.
#
# - The SUSY decays of the top quark are included.
#
#
#         PDG            Width
DECAY         6     1.44647293E+00   # top decays
#          BR         NDA      ID1       ID2
     1.00000000E+00    2           5        24   # BR(t ->  b    W+)
#
#         PDG            Width
DECAY   1000021     1.20272045E+02   # gluino decays
#          BR         NDA      ID1       ID2
     2.01851342E-01    2     2000001        -1   # BR(~g -> ~d_R  db)
     2.01851342E-01    2    -2000001         1   # BR(~g -> ~d_R* d )
     2.01851342E-01    2     2000003        -3   # BR(~g -> ~s_R  sb)
     2.01851342E-01    2    -2000003         3   # BR(~g -> ~s_R* s )
     9.62973163E-02    2     1000005        -5   # BR(~g -> ~b_1  bb)
     9.62973163E-02    2    -1000005         5   # BR(~g -> ~b_1* b )
#
#         PDG            Width
DECAY   1000006     1.20849846E+02   # stop1 decays
#          BR         NDA      ID1       ID2
     1.83115454E-01    2     1000022         6   # BR(~t_1 -> ~chi_10 t )
     1.88207720E-01    2     1000023         6   # BR(~t_1 -> ~chi_20 t )
     6.26920564E-02    2     1000025         6   # BR(~t_1 -> ~chi_30 t )
     2.28281641E-03    2     1000035         6   # BR(~t_1 -> ~chi_40 t )
     3.05687343E-01    2     1000024         5   # BR(~t_1 -> ~chi_1+ b )
     1.23774992E-01    2     1000037         5   # BR(~t_1 -> ~chi_2+ b )
     1.25432095E-01    2     1000021         6   # BR(~t_1 -> ~g      t )
     8.72817448E-03    2     1000005        37   # BR(~t_1 -> ~b_1    H+)
     7.93483005E-05    2     1000005        24   # BR(~t_1 -> ~b_1    W+)
#
#         PDG            Width
DECAY   2000006     1.42822359E+02   # stop2 decays
#          BR         NDA      ID1       ID2
     1.69686756E-01    2     1000022         6   # BR(~t_2 -> ~chi_10 t )
     1.75152483E-01    2     1000023         6   # BR(~t_2 -> ~chi_20 t )
     9.75057631E-03    2     1000025         6   # BR(~t_2 -> ~chi_30 t )
     8.12062227E-03    2     1000035         6   # BR(~t_2 -> ~chi_40 t )
     3.41333761E-01    2     1000024         5   # BR(~t_2 -> ~chi_1+ b )
     1.90845521E-02    2     1000037         5   # BR(~t_2 -> ~chi_2+ b )
     2.43112060E-01    2     1000021         6   # BR(~t_2 -> ~g      t )
     5.91560198E-03    2     1000006        25   # BR(~t_2 -> ~t_1    h )
     1.57600244E-03    2     1000005        37   # BR(~t_2 -> ~b_1    H+)
     1.25231946E-02    2     1000006        23   # BR(~t_2 -> ~t_1    Z )
     2.34568789E-05    2     1000005        24   # BR(~t_2 -> ~b_1    W+)
     1.37209339E-02    2     2000005        24   # BR(~t_2 -> ~b_2    W+)
#
#         PDG            Width
DECAY   1000005     3.48244603E+01   # sbottom1 decays
#          BR         NDA      ID1       ID2
     2.56752824E-01    2     1000022         5   # BR(~b_1 -> ~chi_10 b )
     2.49151171E-01    2     1000023         5   # BR(~b_1 -> ~chi_20 b )
     1.84674835E-08    2     1000025         5   # BR(~b_1 -> ~chi_30 b )
     4.94095986E-01    2    -1000024         6   # BR(~b_1 -> ~chi_1- t )
#
#         PDG            Width
DECAY   2000005     1.34319725E+02   # sbottom2 decays
#          BR         NDA      ID1       ID2
     1.41945621E-01    2     1000022         5   # BR(~b_2 -> ~chi_10 b )
     1.37807128E-01    2     1000023         5   # BR(~b_2 -> ~chi_20 b )
     6.59448222E-02    2     1000025         5   # BR(~b_2 -> ~chi_30 b )
     5.13351957E-04    2     1000035         5   # BR(~b_2 -> ~chi_40 b )
     3.43595024E-01    2    -1000024         6   # BR(~b_2 -> ~chi_1- t )
     1.33767288E-01    2    -1000037         6   # BR(~b_2 -> ~chi_2- t )
     1.66138360E-01    2     1000021         5   # BR(~b_2 -> ~g      b )
     5.91103595E-05    2     1000005        25   # BR(~b_2 -> ~b_1    h )
     5.08994950E-03    2     1000005        35   # BR(~b_2 -> ~b_1    H )
     5.08993370E-03    2     1000005        36   # BR(~b_2 -> ~b_1    A )
     4.94116813E-05    2     1000005        23   # BR(~b_2 -> ~b_1    Z )
#
#         PDG            Width
DECAY   1000002     2.15959160E+01   # sup_L decays
#          BR         NDA      ID1       ID2
     8.59494395E-04    2     1000022         2   # BR(~u_L -> ~chi_10 u)
     7.45391902E-04    2     1000023         2   # BR(~u_L -> ~chi_20 u)
     2.82282385E-01    2     1000025         2   # BR(~u_L -> ~chi_30 u)
     4.47124785E-04    2     1000035         2   # BR(~u_L -> ~chi_40 u)
     5.72139206E-03    2     1000024         1   # BR(~u_L -> ~chi_1+ d)
     5.63050916E-01    2     1000037         1   # BR(~u_L -> ~chi_2+ d)
     1.46893296E-01    2     1000021         2   # BR(~u_L -> ~g      u)
#
#         PDG            Width
DECAY   2000002     1.25058507E+01   # sup_R decays
#          BR         NDA      ID1       ID2
     6.43209985E-05    2     1000022         2   # BR(~u_R -> ~chi_10 u)
     8.37830033E-05    2     1000023         2   # BR(~u_R -> ~chi_20 u)
     9.69653429E-08    2     1000025         2   # BR(~u_R -> ~chi_30 u)
     3.69593950E-02    2     1000035         2   # BR(~u_R -> ~chi_40 u)
     9.62892404E-01    2     1000021         2   # BR(~u_R -> ~g      u)
#
#         PDG            Width
DECAY   1000001     2.15790226E+01   # sdown_L decays
#          BR         NDA      ID1       ID2
     6.95592685E-04    2     1000022         1   # BR(~d_L -> ~chi_10 d)
     5.73107033E-04    2     1000023         1   # BR(~d_L -> ~chi_20 d)
     2.82837348E-01    2     1000025         1   # BR(~d_L -> ~chi_30 d)
     4.53648161E-04    2     1000035         1   # BR(~d_L -> ~chi_40 d)
     1.38178963E-05    2    -1000024         2   # BR(~d_L -> ~chi_1- u)
     5.66998394E-01    2    -1000037         2   # BR(~d_L -> ~chi_2- u)
     1.48428092E-01    2     1000021         1   # BR(~d_L -> ~g      d)
#
#         PDG            Width
DECAY   2000001     1.04798444E-04   # sdown_R decays
#           BR         NDA      ID1       ID2
     4.25431753E-01    2     1000022         1   # BR(~d_R -> ~chi_10 d)
     5.52522094E-01    2     1000023         1   # BR(~d_R -> ~chi_20 d)
#           BR         NDA      ID1       ID2       ID3
     1.90556263E-03    3        1       -15        1000015   # BR(~d_R -> d  tau+  ~tau_1-)
     6.22280229E-05    3        1       15        -1000015   # BR(~d_R -> d  tau-  ~tau_1+)
     2.73906737E-05    3        1       -15        2000015   # BR(~d_R -> d  tau+  ~tau_2-)
     6.65095750E-04    3        1       15        -2000015   # BR(~d_R -> d  tau-  ~tau_2+)
     2.13533704E-03    3        1       -16        1000016   # BR(~d_R -> d  nu_taub  ~nu_tau1)
     6.78120752E-05    3        1       16        -1000016   # BR(~d_R -> d  nu_tau  ~nu_tau1*)
     2.37913837E-03    3        1       23        1000022   # BR(~d_R -> d  Z  ~chi_10)
     1.30727131E-03    3        1       25        1000022   # BR(~d_R -> d  h  ~chi_10)
     1.64592138E-03    3        1       23        1000023   # BR(~d_R -> d  Z  ~chi_20)
     2.09373337E-03    3        1       25        1000023   # BR(~d_R -> d  h  ~chi_20)
     2.45070431E-04    3        1       -24        1000024   # BR(~d_R -> d  W-  ~chi_1+)
     9.51159156E-03    3        1       24        -1000024   # BR(~d_R -> d  W+  ~chi_1-)
#
#         PDG            Width
DECAY   1000004     2.14126932E+01   # scharm_L decays
#          BR         NDA      ID1       ID2
     9.10201050E-04    2     1000022         4   # BR(~c_L -> ~chi_10 c)
     7.89347553E-04    2     1000023         4   # BR(~c_L -> ~chi_20 c)
     2.95937929E-01    2     1000025         4   # BR(~c_L -> ~chi_30 c)
     4.43516876E-04    2     1000035         4   # BR(~c_L -> ~chi_40 c)
     6.05884916E-03    2     1000024         3   # BR(~c_L -> ~chi_1+ s)
     5.90288261E-01    2     1000037         3   # BR(~c_L -> ~chi_2+ s)
     1.05571895E-01    2     1000021         4   # BR(~c_L -> ~g      c)
#
#         PDG            Width
DECAY   2000004     9.04786424E+00   # scharm_R decays
#          BR         NDA      ID1       ID2
     9.34982234E-05    2     1000022         4   # BR(~c_R -> ~chi_10 c)
     1.21785590E-04    2     1000023         4   # BR(~c_R -> ~chi_20 c)
     1.39585278E-07    2     1000025         4   # BR(~c_R -> ~chi_30 c)
     5.13548734E-02    2     1000035         4   # BR(~c_R -> ~chi_40 c)
     9.48429703E-01    2     1000021         4   # BR(~c_R -> ~g      c)
#
#         PDG            Width
DECAY   1000003     2.13841741E+01   # sstrange_L decays
#          BR         NDA      ID1       ID2
     7.37048223E-04    2     1000022         3   # BR(~s_L -> ~chi_10 s)
     6.07247797E-04    2     1000023         3   # BR(~s_L -> ~chi_20 s)
     2.96688551E-01    2     1000025         3   # BR(~s_L -> ~chi_30 s)
     4.50319632E-04    2     1000035         3   # BR(~s_L -> ~chi_40 s)
     1.46411976E-05    2    -1000024         4   # BR(~s_L -> ~chi_1- c)
     5.94764058E-01    2    -1000037         4   # BR(~s_L -> ~chi_2- c)
     1.06738134E-01    2     1000021         3   # BR(~s_L -> ~g      s)
#
#         PDG            Width
DECAY   2000003     9.99086533E-05   # sstrange_R decays
#           BR         NDA      ID1       ID2
     4.24955554E-01    2     1000022         3   # BR(~s_R -> ~chi_10 s)
     5.51888769E-01    2     1000023         3   # BR(~s_R -> ~chi_20 s)
#           BR         NDA      ID1       ID2       ID3
     1.99882586E-03    3        3       -15        1000015   # BR(~s_R -> s  tau+  ~tau_1-)
     6.60443293E-05    3        3       15        -1000015   # BR(~s_R -> s  tau-  ~tau_1+)
     2.87312450E-05    3        3       -15        2000015   # BR(~s_R -> s  tau+  ~tau_2-)
     6.93093118E-04    3        3       15        -2000015   # BR(~s_R -> s  tau-  ~tau_2+)
     2.23944566E-03    3        3       -16        1000016   # BR(~s_R -> s  nu_taub  ~nu_tau1)
     7.19617347E-05    3        3       16        -1000016   # BR(~s_R -> s  nu_tau  ~nu_tau1*)
     2.49587990E-03    3        3       23        1000022   # BR(~s_R -> s  Z  ~chi_10)
     1.37125259E-03    3        3       25        1000022   # BR(~s_R -> s  h  ~chi_10)
     1.74629518E-03    3        3       23        1000023   # BR(~s_R -> s  Z  ~chi_20)
     2.19620616E-03    3        3       25        1000023   # BR(~s_R -> s  h  ~chi_20)
     2.57214957E-04    3        3       -24        1000024   # BR(~s_R -> s  W-  ~chi_1+)
     9.99072620E-03    3        3       24        -1000024   # BR(~s_R -> s  W+  ~chi_1-)
#
#         PDG            Width
DECAY   1000011     2.15665737E+01   # selectron_L decays
#          BR         NDA      ID1       ID2
     1.14813881E-03    2     1000022        11   # BR(~e_L -> ~chi_10 e-)
     1.03728635E-03    2     1000023        11   # BR(~e_L -> ~chi_20 e-)
     3.28714460E-01    2     1000025        11   # BR(~e_L -> ~chi_30 e-)
     9.56015301E-03    2     1000035        11   # BR(~e_L -> ~chi_40 e-)
     1.52140748E-05    2    -1000024        12   # BR(~e_L -> ~chi_1- nu_e)
     6.59524747E-01    2    -1000037        12   # BR(~e_L -> ~chi_2- nu_e)
#
#         PDG            Width
DECAY   2000011     1.89118204E-03   # selectron_R decays
#           BR         NDA      ID1       ID2
     3.66906302E-01    2     1000022        11   # BR(~e_R -> ~chi_10 e-)
     4.77504821E-01    2     1000023        11   # BR(~e_R -> ~chi_20 e-)
#           BR         NDA      ID1       ID2       ID3
     2.56273584E-04    3        11       -1        2000001   # BR(~e_R- -> e-  db  ~d_R)
     2.28692950E-03    3        11       1        -2000001   # BR(~e_R- -> e-  d  ~d_R*)
     2.56733614E-04    3        11       -3        2000003   # BR(~e_R- -> e-  sb  ~s_R)
     2.29258734E-03    3        11       3        -2000003   # BR(~e_R- -> e-  s  ~s_R*)
     1.83705213E-02    3        11       -15        1000015   # BR(~e_R- -> e-  tau+  ~tau_1-)
     1.43746077E-03    3        11       15        -1000015   # BR(~e_R- -> e-  tau-  ~tau_1+)
     2.99828355E-03    3        11       -15        2000015   # BR(~e_R- -> e-  tau+  ~tau_2-)
     3.38856856E-02    3        11       15        -2000015   # BR(~e_R- -> e-  tau-  ~tau_2+)
     1.96945610E-02    3        11       -16        1000016   # BR(~e_R- -> e-  nu_taub  ~nu_tau1)
     1.38252159E-03    3        11       16        -1000016   # BR(~e_R- -> e-  nu_tau  ~nu_tau1*)
     9.89804239E-03    3        11       23        1000022   # BR(~e_R- -> e-  Z  ~chi_10)
     6.56943633E-03    3        11       25        1000022   # BR(~e_R- -> e-  h  ~chi_10)
     6.84386787E-03    3        11       23        1000023   # BR(~e_R- -> e-  Z  ~chi_20)
     1.00677775E-02    3        11       25        1000023   # BR(~e_R- -> e-  h  ~chi_20)
     2.21321899E-03    3        11       -24        1000024   # BR(~e_R- -> e-  W-  ~chi_1+)
     3.71349762E-02    3        11       24        -1000024   # BR(~e_R- -> e-  W+  ~chi_1-)
#
#         PDG            Width
DECAY   1000013     2.15665736E+01   # smuon_L decays
#          BR         NDA      ID1       ID2
     1.14813881E-03    2     1000022        13   # BR(~mu_L -> ~chi_10 mu-)
     1.03728635E-03    2     1000023        13   # BR(~mu_L -> ~chi_20 mu-)
     3.28714459E-01    2     1000025        13   # BR(~mu_L -> ~chi_30 mu-)
     9.56015258E-03    2     1000035        13   # BR(~mu_L -> ~chi_40 mu-)
     1.52140748E-05    2    -1000024        14   # BR(~mu_L -> ~chi_1- nu_mu)
     6.59524749E-01    2    -1000037        14   # BR(~mu_L -> ~chi_2- nu_mu)
#
#         PDG            Width
DECAY   2000013     1.89190098E-03   # smuon_R decays
#           BR         NDA      ID1       ID2
     3.66766867E-01    2     1000022        13   # BR(~mu_R -> ~chi_10 mu-)
     4.77323356E-01    2     1000023        13   # BR(~mu_R -> ~chi_20 mu-)
#           BR         NDA      ID1       ID2       ID3
     2.56810481E-04    3        13       -1        2000001   # BR(~mu_R- -> mu-  db  ~d_R)
     2.28606045E-03    3        13       1        -2000001   # BR(~mu_R- -> mu-  d  ~d_R*)
     2.57624477E-04    3        13       -3        2000003   # BR(~mu_R- -> mu-  sb  ~s_R)
     2.29171613E-03    3        13       3        -2000003   # BR(~mu_R- -> mu-  s  ~s_R*)
     1.83624832E-02    3        13       -15        1000015   # BR(~mu_R- -> mu-  tau+  ~tau_1-)
     1.43691453E-03    3        13       15        -1000015   # BR(~mu_R- -> mu-  tau-  ~tau_1+)
     2.99714417E-03    3        13       -15        2000015   # BR(~mu_R- -> mu-  tau+  ~tau_2-)
     3.43247351E-02    3        13       15        -2000015   # BR(~mu_R- -> mu-  tau-  ~tau_2+)
     1.96870769E-02    3        13       -16        1000016   # BR(~mu_R- -> mu-  nu_taub  ~nu_tau1)
     1.38199622E-03    3        13       16        -1000016   # BR(~mu_R- -> mu-  nu_tau  ~nu_tau1*)
     9.73993893E-03    3        13       23        1000022   # BR(~mu_R- -> mu-  Z  ~chi_10)
     6.56693988E-03    3        13       25        1000022   # BR(~mu_R- -> mu-  h  ~chi_10)
     6.84126714E-03    3        13       23        1000023   # BR(~mu_R- -> mu-  Z  ~chi_20)
     1.00639517E-02    3        13       25        1000023   # BR(~mu_R- -> mu-  h  ~chi_20)
     2.20439655E-03    3        13       -24        1000024   # BR(~mu_R- -> mu-  W-  ~chi_1+)
     3.72107213E-02    3        13       24        -1000024   # BR(~mu_R- -> mu-  W+  ~chi_1-)
#
#         PDG            Width
DECAY   1000015     1.18968038E+00   # stau_1 decays
#          BR         NDA      ID1       ID2
     5.12217829E-01    2     1000022        15   # BR(~tau_1 -> ~chi_10  tau-)
     4.82586260E-01    2     1000023        15   # BR(~tau_1 -> ~chi_20  tau-)
     5.19591138E-03    2    -1000024        16   # BR(~tau_1 -> ~chi_1-  nu_tau)
#
#         PDG            Width
DECAY   2000015     4.34886707E+00   # stau_2 decays
#          BR         NDA      ID1       ID2
     2.50403944E-01    2     1000022        15   # BR(~tau_2 -> ~chi_10  tau-)
     2.43966894E-01    2     1000023        15   # BR(~tau_2 -> ~chi_20  tau-)
     4.91624675E-01    2    -1000024        16   # BR(~tau_2 -> ~chi_1-  nu_tau)
     8.12189596E-03    2     1000016       -24   # BR(~tau_2 -> ~nu_tauL W-)
     3.10272225E-03    2     1000015        25   # BR(~tau_2 -> ~tau_1   h)
     2.77986802E-03    2     1000015        23   # BR(~tau_2 -> ~tau_1   Z)
#
#         PDG            Width
DECAY   1000012     2.15872260E+01   # snu_eL decays
#          BR         NDA      ID1       ID2
     6.02827340E-04    2     1000022        12   # BR(~nu_eL -> ~chi_10 nu_e)
     4.64891712E-04    2     1000023        12   # BR(~nu_eL -> ~chi_20 nu_e)
     3.28472687E-01    2     1000025        12   # BR(~nu_eL -> ~chi_30 nu_e)
     9.50862265E-03    2     1000035        12   # BR(~nu_eL -> ~chi_40 nu_e)
     6.29748913E-03    2     1000024        11   # BR(~nu_eL -> ~chi_1+ e-)
     6.54653482E-01    2     1000037        11   # BR(~nu_eL -> ~chi_2+ e-)
#
#         PDG            Width
DECAY   1000014     2.15872259E+01   # snu_muL decays
#          BR         NDA      ID1       ID2
     6.02827342E-04    2     1000022        14   # BR(~nu_muL -> ~chi_10 nu_mu)
     4.64891713E-04    2     1000023        14   # BR(~nu_muL -> ~chi_20 nu_mu)
     3.28472688E-01    2     1000025        14   # BR(~nu_muL -> ~chi_30 nu_mu)
     9.50862268E-03    2     1000035        14   # BR(~nu_muL -> ~chi_40 nu_mu)
     6.29748913E-03    2     1000024        13   # BR(~nu_muL -> ~chi_1+ mu-)
     6.54653481E-01    2     1000037        13   # BR(~nu_muL -> ~chi_2+ mu-)
#
#         PDG            Width
DECAY   1000016     1.11830019E+00   # snu_tauL decays
#          BR         NDA      ID1       ID2
     7.69466839E-04    2     1000022        16   # BR(~nu_tauL -> ~chi_10 nu_tau)
     5.81588778E-04    2     1000023        16   # BR(~nu_tauL -> ~chi_20 nu_tau)
     9.98648944E-01    2     1000024        15   # BR(~nu_tauL -> ~chi_1+ tau-)
#
#         PDG            Width
DECAY   1000024     1.16875238E-11   # chargino1+ decays
#           BR         NDA      ID1       ID2       ID3
     6.00000141E-01    3     1000022         2        -1   # BR(~chi_1+ -> ~chi_10 u    db)
     1.99999929E-01    3     1000022       -11        12   # BR(~chi_1+ -> ~chi_10 e+   nu_e)
     1.99999929E-01    3     1000022       -13        14   # BR(~chi_1+ -> ~chi_10 mu+  nu_mu)
#
#         PDG            Width
DECAY   1000037     2.37566791E+01   # chargino2+ decays
#          BR         NDA      ID1       ID2
     2.44374647E-01    2     1000016       -15   # BR(~chi_2+ -> ~nu_tau1 tau+)
     2.43195473E-01    2    -1000015        16   # BR(~chi_2+ -> ~tau_1+  nu_tau)
     1.11530029E-03    2    -2000015        16   # BR(~chi_2+ -> ~tau_2+  nu_tau)
     1.30086894E-01    2     1000024        23   # BR(~chi_2+ -> ~chi_1+  Z )
     1.24741296E-01    2     1000022        24   # BR(~chi_2+ -> ~chi_10  W+)
     1.28503362E-01    2     1000023        24   # BR(~chi_2+ -> ~chi_20  W+)
     1.27983027E-01    2     1000024        25   # BR(~chi_2+ -> ~chi_1+  h )
#
#         PDG            Width
DECAY   1000022     0.00000000E+00   # neutralino1 decays
#
#         PDG            Width
DECAY   1000023     2.94522216E-10   # neutralino2 decays
#          BR         NDA      ID1       ID2
     1.78911710E-01    2     1000022        22   # BR(~chi_20 -> ~chi_10 gam)
#           BR         NDA      ID1       ID2       ID3
     1.14819856E-01    3     1000022        -2         2   # BR(~chi_20 -> ~chi_10 ub      u)
     1.49043206E-01    3     1000022        -1         1   # BR(~chi_20 -> ~chi_10 db      d)
     1.14819856E-01    3     1000022        -4         4   # BR(~chi_20 -> ~chi_10 cb      c)
     1.49043206E-01    3     1000022        -3         3   # BR(~chi_20 -> ~chi_10 sb      s)
     3.42400298E-02    3     1000022       -11        11   # BR(~chi_20 -> ~chi_10 e+      e-)
     3.42400298E-02    3     1000022       -13        13   # BR(~chi_20 -> ~chi_10 mu+     mu-)
     6.84642394E-02    3     1000022       -12        12   # BR(~chi_20 -> ~chi_10 nu_eb   nu_e)
     6.84642394E-02    3     1000022       -14        14   # BR(~chi_20 -> ~chi_10 nu_mub  nu_mu)
     6.84763660E-02    3     1000022       -16        16   # BR(~chi_20 -> ~chi_10 nu_taub nu_tau)
     5.84317997E-03    3     1000024        -2         1   # BR(~chi_20 -> ~chi_1+ ub      d)
     5.84317997E-03    3    -1000024        -1         2   # BR(~chi_20 -> ~chi_1- db      u)
     1.94772532E-03    3     1000024       -12        11   # BR(~chi_20 -> ~chi_1+ nu_eb   e-)
     1.94772532E-03    3    -1000024        12       -11   # BR(~chi_20 -> ~chi_1- nu_e    e+)
     1.94772532E-03    3     1000024       -14        13   # BR(~chi_20 -> ~chi_1+ nu_mub  mu-)
     1.94772532E-03    3    -1000024        14       -13   # BR(~chi_20 -> ~chi_1- nu_mu   mu+)
#
#         PDG            Width
DECAY   1000025     2.37517279E+01   # neutralino3 decays
#          BR         NDA      ID1       ID2
     5.78459630E-02    2     1000022        23   # BR(~chi_30 -> ~chi_10   Z )
     7.22822341E-02    2     1000023        23   # BR(~chi_30 -> ~chi_20   Z )
     1.27094021E-01    2     1000024       -24   # BR(~chi_30 -> ~chi_1+   W-)
     1.27094021E-01    2    -1000024        24   # BR(~chi_30 -> ~chi_1-   W+)
     6.89179255E-02    2     1000022        25   # BR(~chi_30 -> ~chi_10   h )
     5.80337071E-02    2     1000023        25   # BR(~chi_30 -> ~chi_20   h )
     1.12710372E-08    2     2000001        -1   # BR(~chi_30 -> ~d_R      db)
     1.12710372E-08    2    -2000001         1   # BR(~chi_30 -> ~d_R*     d )
     1.12710372E-08    2     2000003        -3   # BR(~chi_30 -> ~s _R      sb)
     1.12710372E-08    2    -2000003         3   # BR(~chi_30 -> ~s _R*     s )
     9.21748213E-09    2     2000011       -11   # BR(~chi_30 -> ~e_R-     e+)
     9.21748213E-09    2    -2000011        11   # BR(~chi_30 -> ~e_R+     e-)
     9.21748213E-09    2     2000013       -13   # BR(~chi_30 -> ~mu_R-    mu+)
     9.21748213E-09    2    -2000013        13   # BR(~chi_30 -> ~mu_R+    mu-)
     1.21206007E-01    2     1000015       -15   # BR(~chi_30 -> ~tau_1-   tau+)
     1.21206007E-01    2    -1000015        15   # BR(~chi_30 -> ~tau_1+   tau-)
     5.55870318E-04    2     2000015       -15   # BR(~chi_30 -> ~tau_2-   tau+)
     5.55870318E-04    2    -2000015        15   # BR(~chi_30 -> ~tau_2+   tau-)
     1.22604146E-01    2     1000016       -16   # BR(~chi_30 -> ~nu_tau1  nu_taub)
     1.22604146E-01    2    -1000016        16   # BR(~chi_30 -> ~nu_tau1* nu_tau )
#
#         PDG            Width
DECAY   1000035     5.98854623E+01   # neutralino4 decays
#          BR         NDA      ID1       ID2
     1.55081991E-02    2     1000022        23   # BR(~chi_40 -> ~chi_10   Z )
     1.26415818E-02    2     1000023        23   # BR(~chi_40 -> ~chi_20   Z )
     2.42042969E-05    2     1000025        23   # BR(~chi_40 -> ~chi_30   Z )
     2.73386194E-02    2     1000024       -24   # BR(~chi_40 -> ~chi_1+   W-)
     2.73386194E-02    2    -1000024        24   # BR(~chi_40 -> ~chi_1-   W+)
     2.55735806E-05    2     1000037       -24   # BR(~chi_40 -> ~chi_2+   W-)
     2.55735806E-05    2    -1000037        24   # BR(~chi_40 -> ~chi_2-   W+)
     1.31312411E-02    2     1000022        25   # BR(~chi_40 -> ~chi_10   h )
     5.52668947E-03    2     1000022        35   # BR(~chi_40 -> ~chi_10   H )
     6.54688355E-03    2     1000022        36   # BR(~chi_40 -> ~chi_10   A )
     1.70094848E-02    2     1000023        25   # BR(~chi_40 -> ~chi_20   h )
     6.36903608E-03    2     1000023        35   # BR(~chi_40 -> ~chi_20   H )
     5.34887898E-03    2     1000023        36   # BR(~chi_40 -> ~chi_20   A )
     2.14321574E-06    2     1000025        25   # BR(~chi_40 -> ~chi_30   h )
     1.18295289E-02    2     1000024       -37   # BR(~chi_40 -> ~chi_1+   H-)
     1.18295289E-02    2    -1000024        37   # BR(~chi_40 -> ~chi_1-   H+)
     3.44000982E-02    2     2000001        -1   # BR(~chi_40 -> ~d_R      db)
     3.44000982E-02    2    -2000001         1   # BR(~chi_40 -> ~d_R*     d )
     3.44000982E-02    2     2000003        -3   # BR(~chi_40 -> ~s _R      sb)
     3.44000982E-02    2    -2000003         3   # BR(~chi_40 -> ~s _R*     s )
     1.67669074E-02    2     1000005        -5   # BR(~chi_40 -> ~b_1      bb)
     1.67669074E-02    2    -1000005         5   # BR(~chi_40 -> ~b_1*     b )
     8.05216547E-02    2     2000011       -11   # BR(~chi_40 -> ~e_R-     e+)
     8.05216547E-02    2    -2000011        11   # BR(~chi_40 -> ~e_R+     e-)
     8.05216547E-02    2     2000013       -13   # BR(~chi_40 -> ~mu_R-    mu+)
     8.05216547E-02    2    -2000013        13   # BR(~chi_40 -> ~mu_R+    mu-)
     2.98011736E-02    2     1000015       -15   # BR(~chi_40 -> ~tau_1-   tau+)
     2.98011736E-02    2    -1000015        15   # BR(~chi_40 -> ~tau_1+   tau-)
     1.13820976E-01    2     2000015       -15   # BR(~chi_40 -> ~tau_2-   tau+)
     1.13820976E-01    2    -2000015        15   # BR(~chi_40 -> ~tau_2+   tau-)
     2.95195446E-02    2     1000016       -16   # BR(~chi_40 -> ~nu_tau1  nu_taub)
     2.95195446E-02    2    -1000016        16   # BR(~chi_40 -> ~nu_tau1* nu_tau )
#
#         PDG            Width
DECAY        25     4.43495239E-03   # h decays
#          BR         NDA      ID1       ID2
     5.50800931E-01    2           5        -5   # BR(h -> b       bb     )
     6.07317495E-02    2         -15        15   # BR(h -> tau+    tau-   )
     2.14823575E-04    2         -13        13   # BR(h -> mu+     mu-    )
     2.33551290E-04    2           3        -3   # BR(h -> s       sb     )
     1.99002656E-02    2           4        -4   # BR(h -> c       cb     )
     7.67336602E-02    2          21        21   # BR(h -> g       g      )
     2.31781847E-03    2          22        22   # BR(h -> gam     gam    )
     1.78701681E-03    2          22        23   # BR(h -> Z       gam    )
     2.54229866E-01    2          24       -24   # BR(h -> W+      W-     )
     3.30503173E-02    2          23        23   # BR(h -> Z       Z      )
#
#         PDG            Width
DECAY        35     7.61767715E+01   # H decays
#          BR         NDA      ID1       ID2
     8.11564700E-01    2           5        -5   # BR(H -> b       bb     )
     1.42878602E-01    2         -15        15   # BR(H -> tau+    tau-   )
     4.71387282E-04    2         -13        13   # BR(H -> mu+     mu-    )
     3.36668644E-04    2           3        -3   # BR(H -> s       sb     )
     3.31496600E-09    2           4        -4   # BR(H -> c       cb     )
     3.16549462E-04    2           6        -6   # BR(H -> t       tb     )
     3.86939335E-05    2          21        21   # BR(H -> g       g      )
     1.81121699E-08    2          22        22   # BR(H -> gam     gam    )
     1.78304240E-08    2          23        22   # BR(H -> Z       gam    )
     4.92131594E-07    2          24       -24   # BR(H -> W+      W-     )
     2.44781748E-07    2          23        23   # BR(H -> Z       Z      )
     1.74281950E-06    2          25        25   # BR(H -> h       h      )
     9.71667388E-04    2     1000024  -1000024   # BR(H -> ~chi_1+ ~chi_1-)
     7.33093834E-04    2     1000024  -1000037   # BR(H -> ~chi_1+ ~chi_2-)
     7.33093834E-04    2     1000037  -1000024   # BR(H -> ~chi_2+ ~chi_1-)
     1.00114391E-04    2     1000022   1000022   # BR(H -> ~chi_10 ~chi_10)
     7.00080904E-05    2     1000023   1000023   # BR(H -> ~chi_20 ~chi_20)
     2.36193173E-07    2     1000022   1000023   # BR(H -> ~chi_10 ~chi_20)
     5.66548245E-05    2     1000022   1000025   # BR(H -> ~chi_10 ~chi_30)
     6.53769426E-04    2     1000023   1000025   # BR(H -> ~chi_20 ~chi_30)
     9.82151343E-09    2     2000001  -2000001   # BR(H -> ~d_R    ~d_R*  )
     9.82151343E-09    2     2000003  -2000003   # BR(H -> ~s_R    ~s_R*  )
     4.08126151E-04    2     1000015  -1000015   # BR(H -> ~tau_1- ~tau_1+)
     3.46962898E-04    2     2000015  -2000015   # BR(H -> ~tau_2- ~tau_2+)
     2.01584499E-02    2     1000015  -2000015   # BR(H -> ~tau_1- ~tau_2+)
     2.01584499E-02    2     2000015  -1000015   # BR(H -> ~tau_2- ~tau_1+)
     2.33353558E-07    2     1000016  -1000016   # BR(H -> ~nu_tauL ~nu_tauL*)
#
#         PDG            Width
DECAY        36     7.61859391E+01   # A decays
#          BR         NDA      ID1       ID2
     8.11484348E-01    2           5        -5   # BR(A -> b       bb     )
     1.42862593E-01    2         -15        15   # BR(A -> tau+    tau-   )
     4.71332364E-04    2         -13        13   # BR(A -> mu+     mu-    )
     3.36637557E-04    2           3        -3   # BR(A -> s       sb     )
     3.28650894E-09    2           4        -4   # BR(A -> c       cb     )
     3.21059930E-04    2           6        -6   # BR(A -> t       tb     )
     5.27897942E-05    2          21        21   # BR(A -> g       g      )
     6.91156824E-09    2          22        22   # BR(A -> gam     gam    )
     2.68399117E-08    2          23        22   # BR(A -> Z       gam    )
     4.93998694E-07    2          23        25   # BR(A -> Z       h      )
     9.84036854E-04    2     1000024  -1000024   # BR(A -> ~chi_1+ ~chi_1-)
     7.32405802E-04    2     1000024  -1000037   # BR(A -> ~chi_1+ ~chi_2-)
     7.32405802E-04    2     1000037  -1000024   # BR(A -> ~chi_2+ ~chi_1-)
     9.45653601E-05    2     1000022   1000022   # BR(A -> ~chi_10 ~chi_10)
     7.67266687E-05    2     1000023   1000023   # BR(A -> ~chi_20 ~chi_20)
     9.23575091E-07    2     1000022   1000023   # BR(A -> ~chi_10 ~chi_20)
     7.44499492E-04    2     1000022   1000025   # BR(A -> ~chi_10 ~chi_30)
     3.87380050E-05    2     1000023   1000025   # BR(A -> ~chi_20 ~chi_30)
     2.05332033E-02    2     1000015  -2000015   # BR(A -> ~tau_1- ~tau_2+)
     2.05332033E-02    2    -1000015   2000015   # BR(A -> ~tau_1+ ~tau_2-)
#
#         PDG            Width
DECAY        37     7.58254904E+01   # H+ decays
#          BR         NDA      ID1       ID2
     1.36914015E-03    2           4        -5   # BR(H+ -> c       bb     )
     1.43752192E-01    2         -15        16   # BR(H+ -> tau+    nu_tau )
     4.74267324E-04    2         -13        14   # BR(H+ -> mu+     nu_mu  )
     1.36913509E-05    2           2        -5   # BR(H+ -> u       bb     )
     1.69043725E-05    2           2        -3   # BR(H+ -> u       sb     )
     3.32732349E-04    2           4        -3   # BR(H+ -> c       sb     )
     8.09868815E-01    2           6        -5   # BR(H+ -> t       bb     )
     4.99620133E-07    2          24        25   # BR(H+ -> W+      h      )
     1.40662257E-12    2          24        36   # BR(H+ -> W+      A      )
     1.48206692E-04    2     1000024   1000022   # BR(H+ -> ~chi_1+ ~chi_10)
     1.86841813E-04    2     1000024   1000023   # BR(H+ -> ~chi_1+ ~chi_20)
     8.30706782E-04    2     1000024   1000025   # BR(H+ -> ~chi_1+ ~chi_30)
     8.86173101E-04    2     1000037   1000022   # BR(H+ -> ~chi_2+ ~chi_10)
     7.78891395E-04    2     1000037   1000023   # BR(H+ -> ~chi_2+ ~chi_20)
     1.96561691E-04    2    -1000015   1000016   # BR(H+ -> ~tau_1+ ~nu_tauL)
     4.11443764E-02    2    -2000015   1000016   # BR(H+ -> ~tau_2+ ~nu_tauL)
