#
#                              ======================
#                              | THE SUSYHIT OUTPUT |
#                              ======================
#
#
#              ------------------------------------------------------
#              |     This is the output of the SUSY-HIT package     |
#              |  created by A.Djouadi, M.Muehlleitner and M.Spira. |
#              |  In case of problems with SUSY-HIT email to        |
#              |           margarete.muehlleitner@cern.ch           |
#              |           michael.spira@psi.ch                     |
#              |           abdelhak.djouadi@cern.ch                 |
#              ------------------------------------------------------
#
#              ------------------------------------------------------
#              |  SUSY Les Houches Accord - MSSM Spectrum + Decays  |
#              |              based on the decay programs           |
#              |                                                    |
#              |                     SDECAY 1.3b                    |
#              |                                                    |
#              |  Authors: M.Muhlleitner, A.Djouadi and Y.Mambrini  |
#              |  Ref.:    Comput.Phys.Commun.168(2005)46           |
#              |           [hep-ph/0311167]                         |
#              |                                                    |
#              |                     HDECAY 3.4                     |
#              |                                                    |
#              |  By: A.Djouadi,J.Kalinowski,M.Muhlleitner,M.Spira  |
#              |  Ref.:    Comput.Phys.Commun.108(1998)56           |
#              |           [hep-ph/9704448]                         |
#              |                                                    |
#              |                                                    |
#              |  If not stated otherwise all DRbar couplings and   |
#              |  soft SUSY breaking masses are given at the scale  |
#              |  Q=  0.91187600E+02
#              |                                                    |
#              ------------------------------------------------------
#
#
BLOCK DCINFO  # Decay Program information
     1   SDECAY/HDECAY # decay calculator
     2   1.3b  /3.4    # version number
#
BLOCK SPINFO  # Spectrum calculator information
     1   SuSpect     # RGE +Spectrum calculator            
     2   2.41         # version number                     
#
BLOCK MODSEL  # Model selection
     1     0   # #general MSSM low scale                           
#
BLOCK SMINPUTS  # Standard Model inputs
         1     1.27934000E+02   # alpha_em^-1(M_Z)^MSbar
         2     1.16639000E-05   # G_F [GeV^-2]
         3     1.17200000E-01   # alpha_S(M_Z)^MSbar
         4     9.11870000E+01   # M_Z pole mass
         5     4.25000000E+00   # mb(mb)^MSbar
         6     1.72500000E+02   # mt pole mass
         7     1.77700000E+00   # mtau pole mass
#
BLOCK MINPAR  # Input parameters - minimal models
#
BLOCK EXTPAR  # Input parameters - non-minimal models
         0     9.11876000E+01   # EWSB                
         1     1.00000000E+02   # M_1                 
         2     1.00000000E+03   # M_2                 
         3     2.50000000E+03   # M_3                 
        11     0.00000000E+00   # A_t                 
        12     0.00000000E+00   # A_b                 
        13     0.00000000E+00   # A_tau               
        14     0.00000000E+00   # A_u                 
        15     0.00000000E+00   # A_d                 
        16     0.00000000E+00   # A_e                 
        23     1.00000000E+04   # mu(EWSB)            
        25     1.50000000E+00   # tanbeta(in)         
        26     2.00000000E+03   # MA_pole             
        31     2.50000000E+03   # M_eL                
        32     2.50000000E+03   # M_muL               
        33     2.50000000E+03   # M_tauL              
        34     2.50000000E+03   # M_eR                
        35     2.50000000E+03   # M_muR               
        36     2.50000000E+03   # M_tauR              
        41     2.50000000E+03   # M_q1L               
        42     2.50000000E+03   # M_q2L               
        43     2.50000000E+03   # M_q3L               
        44     2.50000000E+03   # M_uR                
        45     2.50000000E+03   # M_cR                
        46     2.50000000E+03   # M_tR                
        47     2.50000000E+03   # M_dR                
        48     2.50000000E+03   # M_sR                
        49     2.50000000E+03   # M_bR                
#
BLOCK MASS  # Mass Spectrum
# PDG code           mass       particle
        24     8.05328994E+01   # W+
        25     1.25000000E+02   # h
        35     2.00046676E+03   # H
        36     2.00000000E+03   # A
        37     2.00018421E+03   # H+
         5     4.87877839E+00   # b-quark pole mass calculated from mb(mb)_Msbar
   1000001     2.50026552E+03   # ~d_L
   2000001     2.50005037E+03   # ~d_R
   1000002     2.49978483E+03   # ~u_L
   2000002     2.49989925E+03   # ~u_R
   1000003     2.50026552E+03   # ~s_L
   2000003     2.50005037E+03   # ~s_R
   1000004     2.49978483E+03   # ~c_L
   2000004     2.49989925E+03   # ~c_R
   1000005     2.49233972E+03   # ~b_1
   2000005     2.50795451E+03   # ~b_2
   1000006     2.29618112E+03   # ~t_1
   2000006     2.69646124E+03   # ~t_2
   1000011     2.50016478E+03   # ~e_L
   2000011     2.50015112E+03   # ~e_R
   1000012     2.49968407E+03   # ~nu_eL
   1000013     2.50016478E+03   # ~mu_L
   2000013     2.50015112E+03   # ~mu_R
   1000014     2.49968407E+03   # ~nu_muL
   1000015     2.49481692E+03   # ~tau_1
   2000015     2.50548885E+03   # ~tau_2
   1000016     2.49968407E+03   # ~nu_tauL
   1000021     2.50000000E+03   # ~g
   1000022     9.98165588E+01   # ~chi_10
   1000023     9.99354408E+02   # ~chi_20
   1000025    -1.00000293E+04   # ~chi_30
   1000035     1.00008584E+04   # ~chi_40
   1000024     9.99354263E+02   # ~chi_1+
   1000037     1.00006894E+04   # ~chi_2+
   1000039     1.00000000E-09   # ~gravitino
#
BLOCK NMIX  # Neutralino Mixing Matrix
  1  1     9.99989914E-01   # N_11
  1  2    -3.63444320E-04   # N_12
  1  3     3.71519793E-03   # N_13
  1  4    -2.49726501E-03   # N_14
  2  1     4.02470699E-04   # N_21
  2  2     9.99961859E-01   # N_22
  2  3    -7.08456698E-03   # N_23
  2  4     5.09180964E-03   # N_24
  3  1     8.60671820E-04   # N_31
  3  2    -1.40942725E-03   # N_32
  3  3    -7.07100632E-01   # N_33
  3  4    -7.07111002E-01   # N_34
  4  1     4.38957663E-03   # N_41
  4  2    -8.61167921E-03   # N_42
  4  3    -7.07067679E-01   # N_43
  4  4     7.07079817E-01   # N_44
#
BLOCK UMIX  # Chargino Mixing Matrix U
  1  1    -9.99949786E-01   # U_11
  1  2     1.00212462E-02   # U_12
  2  1     1.00212462E-02   # U_21
  2  2     9.99949786E-01   # U_22
#
BLOCK VMIX  # Chargino Mixing Matrix V
  1  1    -9.99974061E-01   # V_11
  1  2     7.20259657E-03   # V_12
  2  1     7.20259657E-03   # V_21
  2  2     9.99974061E-01   # V_22
#
BLOCK STOPMIX  # Stop Mixing Matrix
  1  1     7.07207983E-01   # cos(theta_t)
  1  2     7.07005565E-01   # sin(theta_t)
  2  1    -7.07005565E-01   # -sin(theta_t)
  2  2     7.07207983E-01   # cos(theta_t)
#
BLOCK SBOTMIX  # Sbottom Mixing Matrix
  1  1     7.02218389E-01   # cos(theta_b)
  1  2     7.11961610E-01   # sin(theta_b)
  2  1    -7.11961610E-01   # -sin(theta_b)
  2  2     7.02218389E-01   # cos(theta_b)
#
BLOCK STAUMIX  # Stau Mixing Matrix
  1  1     7.06653779E-01   # cos(theta_tau)
  1  2     7.07559493E-01   # sin(theta_tau)
  2  1    -7.07559493E-01   # -sin(theta_tau)
  2  2     7.06653779E-01   # cos(theta_tau)
#
BLOCK ALPHA  # Higgs mixing
          -5.90827182E-01   # Mixing angle in the neutral Higgs boson sector
#
BLOCK HMIX Q=  9.11876000E+01  # DRbar Higgs Parameters
         1     1.00000000E+04   # mu(Q)               
         2     1.49999981E+00   # tanbeta(Q)          
         3     2.51103173E+02   # vev(Q)              
         4     2.61370357E+06   # MA^2(Q)             
#
BLOCK GAUGE Q=  9.11876000E+01  # The gauge couplings
     1     3.53028271E-01   # gprime(Q) DRbar
     2     6.29630525E-01   # g(Q) DRbar
     3     1.08812916E+00   # g3(Q) DRbar
#
BLOCK AU Q=  9.11876000E+01  # The trilinear couplings
  1  1     0.00000000E+00   # A_u(Q) DRbar
  2  2     0.00000000E+00   # A_c(Q) DRbar
  3  3     0.00000000E+00   # A_t(Q) DRbar
#
BLOCK AD Q=  9.11876000E+01  # The trilinear couplings
  1  1     0.00000000E+00   # A_d(Q) DRbar
  2  2     0.00000000E+00   # A_s(Q) DRbar
  3  3     0.00000000E+00   # A_b(Q) DRbar
#
BLOCK AE Q=  9.11876000E+01  # The trilinear couplings
  1  1     0.00000000E+00   # A_e(Q) DRbar
  2  2     0.00000000E+00   # A_mu(Q) DRbar
  3  3     0.00000000E+00   # A_tau(Q) DRbar
#
BLOCK Yu Q=  9.11876000E+01  # The Yukawa couplings
  1  1     0.00000000E+00   # y_u(Q) DRbar
  2  2     0.00000000E+00   # y_c(Q) DRbar
  3  3     1.01453652E+00   # y_t(Q) DRbar
#
BLOCK Yd Q=  9.11876000E+01  # The Yukawa couplings
  1  1     0.00000000E+00   # y_d(Q) DRbar
  2  2     0.00000000E+00   # y_s(Q) DRbar
  3  3     2.64224255E-02   # y_b(Q) DRbar
#
BLOCK Ye Q=  9.11876000E+01  # The Yukawa couplings
  1  1     0.00000000E+00   # y_e(Q) DRbar
  2  2     0.00000000E+00   # y_mu(Q) DRbar
  3  3     1.80601466E-02   # y_tau(Q) DRbar
#
BLOCK MSOFT Q=  9.11876000E+01  # The soft SUSY breaking masses at the scale Q
         1     1.00000000E+02   # M_1                 
         2     1.00000000E+03   # M_2                 
         3     2.50000000E+03   # M_3                 
        14     0.00000000E+00   # A_u                 
        15     0.00000000E+00   # A_d                 
        16     0.00000000E+00   # A_e                 
        21    -1.03163233E+08   # M^2_Hd              
        22    -9.31261781E+07   # M^2_Hu              
        31     2.50000000E+03   # M_eL                
        32     2.50000000E+03   # M_muL               
        33     2.50000000E+03   # M_tauL              
        34     2.50000000E+03   # M_eR                
        35     2.50000000E+03   # M_muR               
        36     2.50000000E+03   # M_tauR              
        41     2.50000000E+03   # M_q1L               
        42     2.50000000E+03   # M_q2L               
        43     2.50000000E+03   # M_q3L               
        44     2.50000000E+03   # M_uR                
        45     2.50000000E+03   # M_cR                
        46     2.50000000E+03   # M_tR                
        47     2.50000000E+03   # M_dR                
        48     2.50000000E+03   # M_sR                
        49     2.50000000E+03   # M_bR                
#
#
#
#                             =================
#                             |The decay table|
#                             =================
#
# - The QCD corrections to the decays gluino -> squark  + quark
#                                     squark -> gaugino + quark_prime
#                                     squark -> squark_prime + Higgs
#                                     squark -> gluino  + quark
#   are included.
#
# - The multi-body decays for the inos, stops and sbottoms are included.
#
# - The loop induced decays for the gluino, neutralinos and stops
#   are included.
#
# - The SUSY decays of the top quark are included.
#
# - Possible decays of the NLSP in GMSB models are included.
#
#
#         PDG            Width
DECAY         6     1.37041664E+00   # top decays
#          BR         NDA      ID1       ID2
     1.00000000E+00    2           5        24   # BR(t ->  b    W+)
#
#         PDG            Width
DECAY   1000021     1.E-04   # gluino decays (OJ Mods)
#          BR         NDA      ID1       ID2
     1.91825661E-05    2     1000002        -2   # BR(~g -> ~u_L  ub)
     1.91825661E-05    2    -1000002         2   # BR(~g -> ~u_L* u )
     4.20584488E-06    2     2000002        -2   # BR(~g -> ~u_R  ub)
     4.20584488E-06    2    -2000002         2   # BR(~g -> ~u_R* u )
     1.91825661E-05    2     1000004        -4   # BR(~g -> ~c_L  cb)
     1.91825661E-05    2    -1000004         4   # BR(~g -> ~c_L* c )
     4.20584488E-06    2     2000004        -4   # BR(~g -> ~c_R  cb)
     4.20584488E-06    2    -2000004         4   # BR(~g -> ~c_R* c )
     3.47450256E-03    2     1000005        -5   # BR(~g -> ~b_1  bb)
     3.47450256E-03    2    -1000005         5   # BR(~g -> ~b_1* b )
     4.95687500E-01    2     1000006        -6   # BR(~g -> ~t_1  tb)
     4.95687500E-01    2    -1000006         6   # BR(~g -> ~t_1* t )
     1.58244178E-03    2     1000039        21   # BR(~g -> ~G g)
#
#         PDG            Width
DECAY   1000006     1.14351049E+01   # stop1 decays
#          BR         NDA      ID1       ID2
     2.27188793E-01    2     1000022         6   # BR(~t_1 -> ~chi_10 t )
     2.55087026E-01    2     1000023         6   # BR(~t_1 -> ~chi_20 t )
     5.17724181E-01    2     1000024         5   # BR(~t_1 -> ~chi_1+ b )
#
#         PDG            Width
DECAY   2000006    -1.21548291E+01   # stop2 decays
#          BR         NDA      ID1       ID2
    -2.40426065E-01    2     1000022         6   # BR(~t_2 -> ~chi_10 t )
    -3.00029381E-01    2     1000023         6   # BR(~t_2 -> ~chi_20 t )
     0.00000000E+00    2     1000025         6   # BR(~t_2 -> ~chi_30 t )
    -6.05502447E-01    2     1000024         5   # BR(~t_2 -> ~chi_1+ b )
    -2.62361083E-02    2     1000021         6   # BR(~t_2 -> ~g      t )
    -1.99232375E-07    2     1000006        25   # BR(~t_2 -> ~t_1    h )
     6.33424337E-01    2     1000006        23   # BR(~t_2 -> ~t_1    Z )
     8.46145542E-01    2     1000005        24   # BR(~t_2 -> ~b_1    W+)
     6.92624321E-01    2     2000005        24   # BR(~t_2 -> ~b_2    W+)
#
#         PDG            Width
DECAY   1000005     7.95993711E+00   # sbottom1 decays
#          BR         NDA      ID1       ID2
     1.03911864E-01    2     1000022         5   # BR(~b_1 -> ~chi_10 b )
     4.11670747E-01    2     1000023         5   # BR(~b_1 -> ~chi_20 b )
     8.14015989E-01    2    -1000024         6   # BR(~b_1 -> ~chi_1- t )
    -3.29598600E-01    2     1000006       -24   # BR(~b_1 -> ~t_1    W-)
#
#         PDG            Width
DECAY   2000005     3.06140944E+00   # sbottom2 decays
#          BR         NDA      ID1       ID2
     2.65304066E-01    2     1000022         5   # BR(~b_2 -> ~chi_10 b )
     1.11451477E+00    2     1000023         5   # BR(~b_2 -> ~chi_20 b )
     2.20422210E+00    2    -1000024         6   # BR(~b_2 -> ~chi_1- t )
     8.95024738E-04    2     1000021         5   # BR(~b_2 -> ~g      b )
    -2.58493596E+00    2     1000006       -24   # BR(~b_2 -> ~t_1    W-)
#
#         PDG            Width
DECAY   1000002     2.10860156E+01   # sup_L decays
#          BR         NDA      ID1       ID2
     1.54893166E-02    2     1000022         2   # BR(~u_L -> ~chi_10 u)
     3.28197781E-01    2     1000023         2   # BR(~u_L -> ~chi_20 u)
     6.56312903E-01    2     1000024         1   # BR(~u_L -> ~chi_1+ d)
#
#         PDG            Width
DECAY   2000002     5.24619074E+00   # sup_R decays
#          BR         NDA      ID1       ID2
     9.99999881E-01    2     1000022         2   # BR(~u_R -> ~chi_10 u)
     1.19417601E-07    2     1000023         2   # BR(~u_R -> ~chi_20 u)
#
#         PDG            Width
DECAY   1000001     2.10898903E+01   # sdown_L decays
#          BR         NDA      ID1       ID2
     1.56082499E-02    2     1000022         1   # BR(~d_L -> ~chi_10 d)
     3.28102702E-01    2     1000023         1   # BR(~d_L -> ~chi_20 d)
     6.56288358E-01    2    -1000024         2   # BR(~d_L -> ~chi_1- u)
     6.90479653E-07    2     1000021         1   # BR(~d_L -> ~g      d)
#
#         PDG            Width
DECAY   2000001     1.31156323E+00   # sdown_R decays
#          BR         NDA      ID1       ID2
     9.99999481E-01    2     1000022         1   # BR(~d_R -> ~chi_10 d)
     1.19422860E-07    2     1000023         1   # BR(~d_R -> ~chi_20 d)
     3.99631895E-07    2     1000021         1   # BR(~d_R -> ~g      d)
#
#         PDG            Width
DECAY   1000004     2.10860156E+01   # scharm_L decays
#          BR         NDA      ID1       ID2
     1.54893166E-02    2     1000022         4   # BR(~c_L -> ~chi_10 c)
     3.28197781E-01    2     1000023         4   # BR(~c_L -> ~chi_20 c)
     6.56312903E-01    2     1000024         3   # BR(~c_L -> ~chi_1+ s)
#
#         PDG            Width
DECAY   2000004     5.24619074E+00   # scharm_R decays
#          BR         NDA      ID1       ID2
     9.99999881E-01    2     1000022         4   # BR(~c_R -> ~chi_10 c)
     1.19417601E-07    2     1000023         4   # BR(~c_R -> ~chi_20 c)
#
#         PDG            Width
DECAY   1000003     2.10898903E+01   # sstrange_L decays
#          BR         NDA      ID1       ID2
     1.56082499E-02    2     1000022         3   # BR(~s_L -> ~chi_10 s)
     3.28102702E-01    2     1000023         3   # BR(~s_L -> ~chi_20 s)
     6.56288358E-01    2    -1000024         4   # BR(~s_L -> ~chi_1- c)
     6.90479653E-07    2     1000021         3   # BR(~s_L -> ~g      s)
#
#         PDG            Width
DECAY   2000003     1.31156323E+00   # sstrange_R decays
#          BR         NDA      ID1       ID2
     9.99999481E-01    2     1000022         3   # BR(~s_R -> ~chi_10 s)
     1.19422860E-07    2     1000023         3   # BR(~s_R -> ~chi_20 s)
     3.99631895E-07    2     1000021         3   # BR(~s_R -> ~g      s)
#
#         PDG            Width
DECAY   1000011     2.39679475E+01   # selectron_L decays
#          BR         NDA      ID1       ID2
     1.28735808E-01    2     1000022        11   # BR(~e_L -> ~chi_10 e-)
     2.90513435E-01    2     1000023        11   # BR(~e_L -> ~chi_20 e-)
     5.80750757E-01    2    -1000024        12   # BR(~e_L -> ~chi_1- nu_e)
#
#         PDG            Width
DECAY   2000011     1.23580821E+01   # selectron_R decays
#          BR         NDA      ID1       ID2
     9.99999885E-01    2     1000022        11   # BR(~e_R -> ~chi_10 e-)
     1.14724163E-07    2     1000023        11   # BR(~e_R -> ~chi_20 e-)
#
#         PDG            Width
DECAY   1000013     2.39679475E+01   # smuon_L decays
#          BR         NDA      ID1       ID2
     1.28735808E-01    2     1000022        13   # BR(~mu_L -> ~chi_10 mu-)
     2.90513435E-01    2     1000023        13   # BR(~mu_L -> ~chi_20 mu-)
     5.80750757E-01    2    -1000024        14   # BR(~mu_L -> ~chi_1- nu_mu)
#
#         PDG            Width
DECAY   2000013     1.23580821E+01   # smuon_R decays
#          BR         NDA      ID1       ID2
     9.99999885E-01    2     1000022        13   # BR(~mu_R -> ~chi_10 mu-)
     1.14724163E-07    2     1000023        13   # BR(~mu_R -> ~chi_20 mu-)
#
#         PDG            Width
DECAY   1000015     1.81069559E+01   # stau_1 decays
#          BR         NDA      ID1       ID2
     4.25931188E-01    2     1000022        15   # BR(~tau_1 -> ~chi_10  tau-)
     1.91414679E-01    2     1000023        15   # BR(~tau_1 -> ~chi_20  tau-)
     3.82647988E-01    2    -1000024        16   # BR(~tau_1 -> ~chi_1-  nu_tau)
     6.14517658E-06    2     1000039        15   # BR(~tau_1 -> ~G       tau-)
#
#         PDG            Width
DECAY   2000015     1.82189836E+01   # stau_2 decays
#          BR         NDA      ID1       ID2
     4.24351193E-01    2     1000022        15   # BR(~tau_2 -> ~chi_10  tau-)
     1.91943539E-01    2     1000023        15   # BR(~tau_2 -> ~chi_20  tau-)
     3.83705268E-01    2    -1000024        16   # BR(~tau_2 -> ~chi_1-  nu_tau)
#
#         PDG            Width
DECAY   1000012     2.39626856E+01   # snu_eL decays
#          BR         NDA      ID1       ID2
     1.29073396E-01    2     1000022        12   # BR(~nu_eL -> ~chi_10 nu_e)
     2.90216769E-01    2     1000023        12   # BR(~nu_eL -> ~chi_20 nu_e)
     5.80709835E-01    2     1000024        11   # BR(~nu_eL -> ~chi_1+ e-)
#
#         PDG            Width
DECAY   1000014     2.39626856E+01   # snu_muL decays
#          BR         NDA      ID1       ID2
     1.29073396E-01    2     1000022        14   # BR(~nu_muL -> ~chi_10 nu_mu)
     2.90216769E-01    2     1000023        14   # BR(~nu_muL -> ~chi_20 nu_mu)
     5.80709835E-01    2     1000024        13   # BR(~nu_muL -> ~chi_1+ mu-)
#
#         PDG            Width
DECAY   1000016     2.39626614E+01   # snu_tauL decays
#          BR         NDA      ID1       ID2
     1.29073527E-01    2     1000022        16   # BR(~nu_tauL -> ~chi_10 nu_tau)
     2.90217061E-01    2     1000023        16   # BR(~nu_tauL -> ~chi_20 nu_tau)
     5.80709412E-01    2     1000024        15   # BR(~nu_tauL -> ~chi_1+ tau-)
#
#         PDG            Width
DECAY   1000024     1.72070158E-04   # chargino1+ decays
#          BR         NDA      ID1       ID2
     9.93538396E-01    2     1000022        24   # BR(~chi_1+ -> ~chi_10  W+)
     6.46160406E-03    2     1000039        24   # BR(~chi_1+ -> ~G       W+)
#
#         PDG            Width
DECAY   1000037     5.27357201E+02   # chargino2+ decays
#          BR         NDA      ID1       ID2
     1.00487395E-05    2     1000002        -1   # BR(~chi_2+ -> ~u_L     db)
     1.94516587E-05    2    -1000001         2   # BR(~chi_2+ -> ~d_L*    u )
     1.00487395E-05    2     1000004        -3   # BR(~chi_2+ -> ~c_L     sb)
     1.94516587E-05    2    -1000003         4   # BR(~chi_2+ -> ~s_L*    c )
     1.94370085E-01    2     1000006        -5   # BR(~chi_2+ -> ~t_1     bb)
     1.87588021E-01    2     2000006        -5   # BR(~chi_2+ -> ~t_2     bb)
     1.87945254E-01    2    -1000005         6   # BR(~chi_2+ -> ~b_1*    t )
     1.93494880E-01    2    -2000005         6   # BR(~chi_2+ -> ~b_2*    t )
     3.40919957E-06    2     1000012       -11   # BR(~chi_2+ -> ~nu_eL   e+  )
     3.40919957E-06    2     1000014       -13   # BR(~chi_2+ -> ~nu_muL  mu+ )
     5.74620913E-05    2     1000016       -15   # BR(~chi_2+ -> ~nu_tau1 tau+)
     6.59926311E-06    2    -1000011        12   # BR(~chi_2+ -> ~e_L+    nu_e)
     6.59926311E-06    2    -1000013        14   # BR(~chi_2+ -> ~mu_L+   nu_mu)
     1.14787249E-05    2    -1000015        16   # BR(~chi_2+ -> ~tau_1+  nu_tau)
     4.91595312E-05    2    -2000015        16   # BR(~chi_2+ -> ~tau_2+  nu_tau)
     4.36653633E-02    2     1000024        23   # BR(~chi_2+ -> ~chi_1+  Z )
     1.15151452E-02    2     1000022        24   # BR(~chi_2+ -> ~chi_10  W+)
     4.26128839E-02    2     1000023        24   # BR(~chi_2+ -> ~chi_20  W+)
     4.41977228E-02    2     1000024        25   # BR(~chi_2+ -> ~chi_1+  h )
     2.78554078E-02    2     1000024        35   # BR(~chi_2+ -> ~chi_1+  H )
     2.78647958E-02    2     1000024        36   # BR(~chi_2+ -> ~chi_1+  A )
     1.06064354E-02    2     1000022        37   # BR(~chi_2+ -> ~chi_10  H+)
     2.78850165E-02    2     1000023        37   # BR(~chi_2+ -> ~chi_20  H+)
     1.09154621E-04    2     1000039        24   # BR(~chi_2+ -> ~G       W+)
     9.27167065E-05    2     1000039        37   # BR(~chi_2+ -> ~G       H+)
#
#         PDG            Width
DECAY   1000022     1.E-08   # neutralino1 decays (OJ Mods)
#          BR         NDA      ID1       ID2
     9.99764170E-01    2     1000039        22   # BR(~chi_10 -> ~G        gam)
     2.35830433E-04    2     1000039        23   # BR(~chi_10 -> ~G        Z)
#
#         PDG            Width
DECAY   1000023     1.E-08   # neutralino2 decays (OJ Mods)
#          BR         NDA      ID1       ID2
     3.19339495E-04    2     1000022        23   # BR(~chi_20 -> ~chi_10   Z )
     9.93316539E-01    2     1000022        25   # BR(~chi_20 -> ~chi_10   h )
     1.56342175E-03    2     1000039        22   # BR(~chi_20 -> ~G        gam)
     4.80069904E-03    2     1000039        23   # BR(~chi_20 -> ~G        Z)
     2.44036235E-10    2     1000039        25   # BR(~chi_20 -> ~G        h)
#
#         PDG            Width
DECAY   1000025     5.26816876E+02   # neutralino3 decays
#          BR         NDA      ID1       ID2
     1.14107610E-02    2     1000022        23   # BR(~chi_30 -> ~chi_10   Z )
     4.25457199E-02    2     1000023        23   # BR(~chi_30 -> ~chi_20   Z )
     4.26323601E-02    2     1000024       -24   # BR(~chi_30 -> ~chi_1+   W-)
     4.26323601E-02    2    -1000024        24   # BR(~chi_30 -> ~chi_1-   W+)
     4.31485108E-04    2     1000022        25   # BR(~chi_30 -> ~chi_10   h )
     1.02315096E-02    2     1000022        35   # BR(~chi_30 -> ~chi_10   H )
     4.26088815E-04    2     1000022        36   # BR(~chi_30 -> ~chi_10   A )
     1.12116759E-03    2     1000023        25   # BR(~chi_30 -> ~chi_20   h )
     2.63144845E-02    2     1000023        35   # BR(~chi_30 -> ~chi_20   H )
     1.59685142E-03    2     1000023        36   # BR(~chi_30 -> ~chi_20   A )
     2.78956564E-02    2     1000024       -37   # BR(~chi_30 -> ~chi_1+   H-)
     2.78956564E-02    2    -1000024        37   # BR(~chi_30 -> ~chi_1-   H+)
     1.48437840E-07    2     1000002        -2   # BR(~chi_30 -> ~u_L      ub)
     1.48437840E-07    2    -1000002         2   # BR(~chi_30 -> ~u_L*     u )
     3.94198010E-08    2     2000002        -2   # BR(~chi_30 -> ~u_R      ub)
     3.94198010E-08    2    -2000002         2   # BR(~chi_30 -> ~u_R*     u )
     2.34777849E-07    2     1000001        -1   # BR(~chi_30 -> ~d_L      db)
     2.34777849E-07    2    -1000001         1   # BR(~chi_30 -> ~d_L*     d )
     9.85482096E-09    2     2000001        -1   # BR(~chi_30 -> ~d_R      db)
     9.85482096E-09    2    -2000001         1   # BR(~chi_30 -> ~d_R*     d )
     1.48437840E-07    2     1000004        -4   # BR(~chi_30 -> ~c_L      cb)
     1.48437840E-07    2    -1000004         4   # BR(~chi_30 -> ~c_L*     c )
     3.94198010E-08    2     2000004        -4   # BR(~chi_30 -> ~c_R      cb)
     3.94198010E-08    2    -2000004         4   # BR(~chi_30 -> ~c_R*     c )
     2.34777849E-07    2     1000003        -3   # BR(~chi_30 -> ~s_L      sb)
     2.34777849E-07    2    -1000003         3   # BR(~chi_30 -> ~s_L*     s )
     9.85482096E-09    2     2000003        -3   # BR(~chi_30 -> ~s_R      sb)
     9.85482096E-09    2    -2000003         3   # BR(~chi_30 -> ~s_R*     s )
     1.92194661E-01    2     1000006        -6   # BR(~chi_30 -> ~t_1      tb)
     1.92194661E-01    2    -1000006         6   # BR(~chi_30 -> ~t_1*     t )
     1.89822622E-01    2     2000006        -6   # BR(~chi_30 -> ~t_2      tb)
     1.89822622E-01    2    -2000006         6   # BR(~chi_30 -> ~t_2*     t )
     1.22818460E-04    2     1000005        -5   # BR(~chi_30 -> ~b_1      bb)
     1.22818460E-04    2    -1000005         5   # BR(~chi_30 -> ~b_1*     b )
     1.36328510E-04    2     2000005        -5   # BR(~chi_30 -> ~b_2      bb)
     1.36328510E-04    2    -2000005         5   # BR(~chi_30 -> ~b_2*     b )
     2.82524107E-08    2     1000011       -11   # BR(~chi_30 -> ~e_L-     e+)
     2.82524107E-08    2    -1000011        11   # BR(~chi_30 -> ~e_L+     e-)
     3.06347286E-08    2     2000011       -11   # BR(~chi_30 -> ~e_R-     e+)
     3.06347286E-08    2    -2000011        11   # BR(~chi_30 -> ~e_R+     e-)
     2.82524107E-08    2     1000013       -13   # BR(~chi_30 -> ~mu_L-    mu+)
     2.82524107E-08    2    -1000013        13   # BR(~chi_30 -> ~mu_L+    mu-)
     3.06347286E-08    2     2000013       -13   # BR(~chi_30 -> ~mu_R-    mu+)
     3.06347286E-08    2    -2000013        13   # BR(~chi_30 -> ~mu_R+    mu-)
     2.53074095E-05    2     1000015       -15   # BR(~chi_30 -> ~tau_1-   tau+)
     2.53074095E-05    2    -1000015        15   # BR(~chi_30 -> ~tau_1+   tau-)
     2.88666550E-05    2     2000015       -15   # BR(~chi_30 -> ~tau_2-   tau+)
     2.88666550E-05    2    -2000015        15   # BR(~chi_30 -> ~tau_2+   tau-)
     1.17732019E-07    2     1000012       -12   # BR(~chi_30 -> ~nu_eL    nu_eb)
     1.17732019E-07    2    -1000012        12   # BR(~chi_30 -> ~nu_eL*   nu_e )
     1.17732019E-07    2     1000014       -14   # BR(~chi_30 -> ~nu_muL   nu_mub)
     1.17732019E-07    2    -1000014        14   # BR(~chi_30 -> ~nu_muL*  nu_mu )
     1.17732019E-07    2     1000016       -16   # BR(~chi_30 -> ~nu_tau1  nu_taub)
     1.17732019E-07    2    -1000016        16   # BR(~chi_30 -> ~nu_tau1* nu_tau )
     8.24325474E-13    2     1000039        22   # BR(~chi_30 -> ~G        gam)
     4.20135583E-06    2     1000039        23   # BR(~chi_30 -> ~G        Z)
     1.05098791E-04    2     1000039        25   # BR(~chi_30 -> ~G        h)
     3.46818411E-06    2     1000039        35   # BR(~chi_30 -> ~G        H)
     8.92205574E-05    2     1000039        36   # BR(~chi_30 -> ~G        A)
#
#         PDG            Width
DECAY   1000035     5.27413094E+02   # neutralino4 decays
#          BR         NDA      ID1       ID2
     4.38105550E-04    2     1000022        23   # BR(~chi_40 -> ~chi_10   Z )
     1.13843403E-03    2     1000023        23   # BR(~chi_40 -> ~chi_20   Z )
     4.25877238E-02    2     1000024       -24   # BR(~chi_40 -> ~chi_1+   W-)
     4.25877238E-02    2    -1000024        24   # BR(~chi_40 -> ~chi_1-   W+)
     1.15460312E-02    2     1000022        25   # BR(~chi_40 -> ~chi_10   h )
     4.13568087E-04    2     1000022        35   # BR(~chi_40 -> ~chi_10   H )
     1.02072455E-02    2     1000022        36   # BR(~chi_40 -> ~chi_10   A )
     4.30515635E-02    2     1000023        25   # BR(~chi_40 -> ~chi_20   h )
     1.54992859E-03    2     1000023        35   # BR(~chi_40 -> ~chi_20   H )
     2.62523329E-02    2     1000023        36   # BR(~chi_40 -> ~chi_20   A )
     2.78677438E-02    2     1000024       -37   # BR(~chi_40 -> ~chi_1+   H-)
     2.78677438E-02    2    -1000024        37   # BR(~chi_40 -> ~chi_1-   H+)
     5.77416452E-06    2     1000002        -2   # BR(~chi_40 -> ~u_L      ub)
     5.77416452E-06    2    -1000002         2   # BR(~chi_40 -> ~u_L*     u )
     1.02432401E-06    2     2000002        -2   # BR(~chi_40 -> ~u_R      ub)
     1.02432401E-06    2    -2000002         2   # BR(~chi_40 -> ~u_R*     u )
     8.46190525E-06    2     1000001        -1   # BR(~chi_40 -> ~d_L      db)
     8.46190525E-06    2    -1000001         1   # BR(~chi_40 -> ~d_L*     d )
     2.56077642E-07    2     2000001        -1   # BR(~chi_40 -> ~d_R      db)
     2.56077642E-07    2    -2000001         1   # BR(~chi_40 -> ~d_R*     d )
     5.77416452E-06    2     1000004        -4   # BR(~chi_40 -> ~c_L      cb)
     5.77416452E-06    2    -1000004         4   # BR(~chi_40 -> ~c_L*     c )
     1.02432401E-06    2     2000004        -4   # BR(~chi_40 -> ~c_R      cb)
     1.02432401E-06    2    -2000004         4   # BR(~chi_40 -> ~c_R*     c )
     8.46190525E-06    2     1000003        -3   # BR(~chi_40 -> ~s_L      sb)
     8.46190525E-06    2    -1000003         3   # BR(~chi_40 -> ~s_L*     s )
     2.56077642E-07    2     2000003        -3   # BR(~chi_40 -> ~s_R      sb)
     2.56077642E-07    2    -2000003         3   # BR(~chi_40 -> ~s_R*     s )
     1.99386582E-01    2     1000006        -6   # BR(~chi_40 -> ~t_1      tb)
     1.99386582E-01    2    -1000006         6   # BR(~chi_40 -> ~t_1*     t )
     1.82386814E-01    2     2000006        -6   # BR(~chi_40 -> ~t_2      tb)
     1.82386814E-01    2    -2000006         6   # BR(~chi_40 -> ~t_2*     t )
     9.33579091E-05    2     1000005        -5   # BR(~chi_40 -> ~b_1      bb)
     9.33579091E-05    2    -1000005         5   # BR(~chi_40 -> ~b_1*     b )
     1.74423774E-04    2     2000005        -5   # BR(~chi_40 -> ~b_2      bb)
     1.74423774E-04    2    -2000005         5   # BR(~chi_40 -> ~b_2*     b )
     1.24280682E-06    2     1000011       -11   # BR(~chi_40 -> ~e_L-     e+)
     1.24280682E-06    2    -1000011        11   # BR(~chi_40 -> ~e_L+     e-)
     7.96046770E-07    2     2000011       -11   # BR(~chi_40 -> ~e_R-     e+)
     7.96046770E-07    2    -2000011        11   # BR(~chi_40 -> ~e_R+     e-)
     1.24280682E-06    2     1000013       -13   # BR(~chi_40 -> ~mu_L-    mu+)
     1.24280682E-06    2    -1000013        13   # BR(~chi_40 -> ~mu_L+    mu-)
     7.96046770E-07    2     2000013       -13   # BR(~chi_40 -> ~mu_R-    mu+)
     7.96046770E-07    2    -2000013        13   # BR(~chi_40 -> ~mu_R+    mu-)
     1.76293483E-05    2     1000015       -15   # BR(~chi_40 -> ~tau_1-   tau+)
     1.76293483E-05    2    -1000015        15   # BR(~chi_40 -> ~tau_1+   tau-)
     3.84450575E-05    2     2000015       -15   # BR(~chi_40 -> ~tau_2-   tau+)
     3.84450575E-05    2    -2000015        15   # BR(~chi_40 -> ~tau_2+   tau-)
     4.02836124E-06    2     1000012       -12   # BR(~chi_40 -> ~nu_eL    nu_eb)
     4.02836124E-06    2    -1000012        12   # BR(~chi_40 -> ~nu_eL*   nu_e )
     4.02836124E-06    2     1000014       -14   # BR(~chi_40 -> ~nu_muL   nu_mub)
     4.02836124E-06    2    -1000014        14   # BR(~chi_40 -> ~nu_muL*  nu_mu )
     4.02836124E-06    2     1000016       -16   # BR(~chi_40 -> ~nu_tau1  nu_taub)
     4.02836124E-06    2    -1000016        16   # BR(~chi_40 -> ~nu_tau1* nu_tau )
     3.20020278E-11    2     1000039        22   # BR(~chi_40 -> ~G        gam)
     1.04947392E-04    2     1000039        23   # BR(~chi_40 -> ~G        Z)
     4.07848428E-06    2     1000039        25   # BR(~chi_40 -> ~G        h)
     8.92440958E-05    2     1000039        35   # BR(~chi_40 -> ~G        H)
     3.56574375E-06    2     1000039        36   # BR(~chi_40 -> ~G        A)
#
#         PDG            Width
DECAY        25     4.19816695E-03   # h decays
#          BR         NDA      ID1       ID2
     6.28500309E-01    2           5        -5   # BR(h -> b       bb     )
     6.21564289E-02    2         -15        15   # BR(h -> tau+    tau-   )
     2.20010867E-04    2         -13        13   # BR(h -> mu+     mu-    )
     4.66205128E-04    2           3        -3   # BR(h -> s       sb     )
     2.00594956E-02    2           4        -4   # BR(h -> c       cb     )
     6.43521603E-02    2          21        21   # BR(h -> g       g      )
     2.24891236E-03    2          22        22   # BR(h -> gam     gam    )
     1.49592824E-03    2          22        23   # BR(h -> Z       gam    )
     1.95569830E-01    2          24       -24   # BR(h -> W+      W-     )
     2.49307193E-02    2          23        23   # BR(h -> Z       Z      )
#
#         PDG            Width
DECAY        35     3.76619086E+01   # H decays
#          BR         NDA      ID1       ID2
     1.31771913E-03    2           5        -5   # BR(H -> b       bb     )
     2.46753074E-04    2         -15        15   # BR(H -> tau+    tau-   )
     8.72363999E-07    2         -13        13   # BR(H -> mu+     mu-    )
     1.11716236E-06    2           3        -3   # BR(H -> s       sb     )
     1.01094944E-05    2           4        -4   # BR(H -> c       cb     )
     9.95308088E-01    2           6        -6   # BR(H -> t       tb     )
     7.69130962E-04    2          21        21   # BR(H -> g       g      )
     2.52687677E-06    2          22        22   # BR(H -> gam     gam    )
     1.15242281E-06    2          23        22   # BR(H -> Z       gam    )
     5.51119552E-04    2          24       -24   # BR(H -> W+      W-     )
     2.74804972E-04    2          23        23   # BR(H -> Z       Z      )
     1.51495030E-03    2          25        25   # BR(H -> h       h      )
    -2.26672425E-24    2          36        36   # BR(H -> A       A      )
     6.35603640E-16    2          23        36   # BR(H -> Z       A      )
     1.25871486E-16    2          24       -37   # BR(H -> W+      H-     )
     1.25871486E-16    2         -24        37   # BR(H -> W-      H+     )
     6.18733893E-10    2     1000024  -1000024   # BR(H -> ~chi_1+ ~chi_1-)
     3.61211900E-07    2     1000022   1000022   # BR(H -> ~chi_10 ~chi_10)
     3.09015008E-10    2     1000023   1000023   # BR(H -> ~chi_20 ~chi_20)
     1.29320065E-06    2     1000022   1000023   # BR(H -> ~chi_10 ~chi_20)
#
#         PDG            Width
DECAY        36     3.80493672E+01   # A decays
#          BR         NDA      ID1       ID2
     1.32648538E-03    2           5        -5   # BR(A -> b       bb     )
     2.45108324E-04    2         -15        15   # BR(A -> tau+    tau-   )
     8.66546471E-07    2         -13        13   # BR(A -> mu+     mu-    )
     1.14237394E-06    2           3        -3   # BR(A -> s       sb     )
     1.00108245E-05    2           4        -4   # BR(A -> c       cb     )
     9.96911834E-01    2           6        -6   # BR(A -> t       tb     )
     9.42226894E-04    2          21        21   # BR(A -> g       g      )
     3.13803742E-06    2          22        22   # BR(A -> gam     gam    )
     1.34778801E-06    2          23        22   # BR(A -> Z       gam    )
     5.40601201E-04    2          23        25   # BR(A -> Z       h      )
     2.44563445E-06    2     1000024  -1000024   # BR(A -> ~chi_1+ ~chi_1-)
     2.52028885E-06    2     1000022   1000022   # BR(A -> ~chi_10 ~chi_10)
     1.22160548E-06    2     1000023   1000023   # BR(A -> ~chi_20 ~chi_20)
     1.10511514E-05    2     1000022   1000023   # BR(A -> ~chi_10 ~chi_20)
#
#         PDG            Width
DECAY        37     3.72389596E+01   # H+ decays
#          BR         NDA      ID1       ID2
     2.03640099E-06    2           4        -5   # BR(H+ -> c       bb     )
     2.50465527E-04    2         -15        16   # BR(H+ -> tau+    nu_tau )
     8.85486117E-07    2         -13        14   # BR(H+ -> mu+     nu_mu  )
     1.29325879E-08    2           2        -5   # BR(H+ -> u       bb     )
     5.48412187E-08    2           2        -3   # BR(H+ -> u       sb     )
     1.09273231E-05    2           4        -3   # BR(H+ -> c       sb     )
     9.99169720E-01    2           6        -5   # BR(H+ -> t       bb     )
     5.53289378E-04    2          24        25   # BR(H+ -> W+      h      )
     7.47344601E-18    2          24        36   # BR(H+ -> W+      A      )
     1.26082069E-05    2     1000024   1000022   # BR(H+ -> ~chi_1+ ~chi_10)
     1.28959924E-13    2     1000024   1000023   # BR(H+ -> ~chi_1+ ~chi_20)
