#
#                              ======================
#                              | THE SUSYHIT OUTPUT |
#                              ======================
#
#
#              ------------------------------------------------------
#              |     This is the output of the SUSY-HIT package     |
#              |  created by A.Djouadi, M.Muehlleitner and M.Spira. |
#              |  In case of problems with SUSY-HIT email to        |
#              |           margarete.muehlleitner@cern.ch           |
#              |           michael.spira@psi.ch                     |
#              |           abdelhak.djouadi@cern.ch                 |
#              ------------------------------------------------------
#
#              ------------------------------------------------------
#              |  SUSY Les Houches Accord - MSSM Spectrum + Decays  |
#              |              based on the decay programs           |
#              |                                                    |
#              |                     SDECAY 1.3b                    |
#              |                                                    |
#              |  Authors: M.Muhlleitner, A.Djouadi and Y.Mambrini  |
#              |  Ref.:    Comput.Phys.Commun.168(2005)46           |
#              |           [hep-ph/0311167]                         |
#              |                                                    |
#              |                     HDECAY 3.4                     |
#              |                                                    |
#              |  By: A.Djouadi,J.Kalinowski,M.Muhlleitner,M.Spira  |
#              |  Ref.:    Comput.Phys.Commun.108(1998)56           |
#              |           [hep-ph/9704448]                         |
#              |                                                    |
#              |                                                    |
#              |  If not stated otherwise all DRbar couplings and   |
#              |  soft SUSY breaking masses are given at the scale  |
#              |  Q=  0.50007548E+04
#              |                                                    |
#              ------------------------------------------------------
#
#
BLOCK DCINFO  # Decay Program information
     1   SDECAY/HDECAY # decay calculator
     2   1.3b  /3.4    # version number
#
BLOCK SPINFO  # Spectrum calculator information
     1    SOFTSUSY    # spectrum calculator                
     2    3.4.0       # version number                     
#
BLOCK MODSEL  # Model selection
     1     0   #  nonUniversal                                     
#
BLOCK SMINPUTS  # Standard Model inputs
         1     1.25778332E+02   # alpha_em^-1(M_Z)^MSbar
         2     1.16570000E-05   # G_F [GeV^-2]
         3     1.17200002E-01   # alpha_S(M_Z)^MSbar
         4     9.11876000E+01   # M_Z pole mass
         5     4.25000000E+00   # mb(mb)^MSbar
         6     1.72500000E+02   # mt pole mass
         7     1.77682000E+00   # mtau pole mass
#
BLOCK MINPAR  # Input parameters - minimal models
         3     1.00000000E+01   # tanb                
#
BLOCK EXTPAR  # Input parameters - non-minimal models
         0    -1.00000000E+00   # Set                 
         1     6.00000000E+01   # M_1(MX)             
         2     3.00000000E+03   # M_2(MX)             
         3     2.13913200E+03   # M_3(MX)             
        11     5.00000000E+03   # At(MX)              
        12     5.00000000E+03   # Ab(MX)              
        13     0.00000000E+00   # Atau(MX)            
        23    -6.67969000E+02   # mu(MX)              
        26     3.00000000E+03   # mA(pole)            
        31     5.00000000E+03   # meL(MX)             
        32     5.00000000E+03   # mmuL(MX)            
        33     5.00000000E+03   # mtauL(MX)           
        34     5.00000000E+03   # meR(MX)             
        35     5.00000000E+03   # mmuR(MX)            
        36     5.00000000E+03   # mtauR(MX)           
        41     5.00000000E+03   # mqL1(MX)            
        42     5.00000000E+03   # mqL2(MX)            
        43     5.00000000E+03   # mqL3(MX)            
        44     5.00000000E+03   # muR(MX)             
        45     5.00000000E+03   # mcR(MX)             
        46     5.00000000E+03   # mtR(MX)             
        47     5.00000000E+03   # mdR(MX)             
        48     5.00000000E+03   # msR(MX)             
        49     5.00000000E+03   # mbR(MX)             
#
BLOCK MASS  # Mass Spectrum
# PDG code           mass       particle
        24     8.00943595E+01   # W+
        25     1.24810401E+02   # h
        35     3.00008375E+03   # H
        36     2.99999874E+03   # A
        37     3.00137850E+03   # H+
         5     4.87878001E+00   # b-quark pole mass calculated from mb(mb)_Msbar
   1000001     5.07996051E+03   # ~d_L
   2000001     5.06216828E+03   # ~d_R
   1000002     5.07948902E+03   # ~u_L
   2000002     5.06187518E+03   # ~u_R
   1000003     5.07996051E+03   # ~s_L
   2000003     5.06216828E+03   # ~s_R
   1000004     5.07948902E+03   # ~c_L
   2000004     5.06187518E+03   # ~c_R
   1000005     5.02567911E+03   # ~b_1
   2000005     5.06048968E+03   # ~b_2
   1000006     4.91746565E+03   # ~t_1
   2000006     5.06921708E+03   # ~t_2
   1000011     5.01908816E+03   # ~e_L
   2000011     5.00593507E+03   # ~e_R
   1000012     5.01813889E+03   # ~nu_eL
   1000013     5.01908816E+03   # ~mu_L
   2000013     5.00593507E+03   # ~mu_R
   1000014     5.01813889E+03   # ~nu_muL
   1000015     5.00471948E+03   # ~tau_1
   2000015     5.01866978E+03   # ~tau_2
   1000016     5.01758941E+03   # ~nu_tauL
   1000021     2.50000007E+03   # ~g
   1000022     6.02749068E+01   # ~chi_10
   1000023     6.99989757E+02   # ~chi_20
   1000025    -7.02214840E+02   # ~chi_30
   1000035     3.07418976E+03   # ~chi_40
   1000024     7.00000271E+02   # ~chi_1+
   1000037     3.07435731E+03   # ~chi_2+
#
BLOCK NMIX  # Neutralino Mixing Matrix
  1  1     9.97979513E-01   # N_11
  1  2     2.19049720E-04   # N_12
  1  3    -6.35260728E-02   # N_13
  1  4     1.13236684E-03   # N_14
  2  1     4.41396143E-02   # N_21
  2  2     2.05651255E-02   # N_22
  2  3     7.06086391E-01   # N_23
  2  4     7.06449417E-01   # N_24
  3  1    -4.56993894E-02   # N_31
  3  2     1.61068124E-02   # N_32
  3  3    -7.05263450E-01   # N_33
  3  4     7.07287496E-01   # N_34
  4  1    -3.90405577E-04   # N_41
  4  2     9.99658741E-01   # N_42
  4  3    -3.14836818E-03   # N_43
  4  4    -2.59294647E-02   # N_44
#
BLOCK UMIX  # Chargino Mixing Matrix U
  1  1     4.46146748E-03   # U_11
  1  2     9.99990048E-01   # U_12
  2  1    -9.99990048E-01   # U_21
  2  2     4.46146748E-03   # U_22
#
BLOCK VMIX  # Chargino Mixing Matrix V
  1  1     3.66962754E-02   # V_11
  1  2    -9.99326465E-01   # V_12
  2  1    -9.99326465E-01   # V_21
  2  2    -3.66962754E-02   # V_22
#
BLOCK STOPMIX  # Stop Mixing Matrix
  1  1    -5.02975416E-01   # cos(theta_t)
  1  2     8.64300718E-01   # sin(theta_t)
  2  1    -8.64300718E-01   # -sin(theta_t)
  2  2    -5.02975416E-01   # cos(theta_t)
#
BLOCK SBOTMIX  # Sbottom Mixing Matrix
  1  1     9.98204180E-01   # cos(theta_b)
  1  2    -5.99033808E-02   # sin(theta_b)
  2  1     5.99033808E-02   # -sin(theta_b)
  2  2     9.98204180E-01   # cos(theta_b)
#
BLOCK STAUMIX  # Stau Mixing Matrix
  1  1    -7.99464740E-02   # cos(theta_tau)
  1  2     9.96799158E-01   # sin(theta_tau)
  2  1    -9.96799158E-01   # -sin(theta_tau)
  2  2    -7.99464740E-02   # cos(theta_tau)
#
BLOCK ALPHA  # Higgs mixing
          -1.05487979E-01   # Mixing angle in the neutral Higgs boson sector
#
BLOCK HMIX Q=  5.00075478E+03  # DRbar Higgs Parameters
         1    -6.80242383E+02   # mu(Q)MSSM           
         2     9.46884810E+00   # tan                 
         3     2.41791119E+02   # higgs               
         4     8.61041943E+06   # mA^2(Q)MSSM         
#
BLOCK GAUGE Q=  5.00075478E+03  # The gauge couplings
     1     3.70869575E-01   # gprime(Q) DRbar
     2     6.32923182E-01   # g(Q) DRbar
     3     9.95214099E-01   # g3(Q) DRbar
#
BLOCK AU Q=  5.00075478E+03  # The trilinear couplings
  1  1     5.00000002E+03   # A_u(Q) DRbar
  2  2     5.00000002E+03   # A_c(Q) DRbar
  3  3     5.00000002E+03   # A_t(Q) DRbar
#
BLOCK AD Q=  5.00075478E+03  # The trilinear couplings
  1  1     5.00000001E+03   # A_d(Q) DRbar
  2  2     5.00000001E+03   # A_s(Q) DRbar
  3  3     5.00000001E+03   # A_b(Q) DRbar
#
BLOCK AE Q=  5.00075478E+03  # The trilinear couplings
  1  1     0.00000000E+00   # A_e(Q) DRbar
  2  2     2.48104305E-07   # A_mu(Q) DRbar
  3  3     2.48033658E-07   # A_tau(Q) DRbar
#
BLOCK Yu Q=  5.00075478E+03  # The Yukawa couplings
  1  1     0.00000000E+00   # y_u(Q) DRbar
  2  2     0.00000000E+00   # y_c(Q) DRbar
  3  3     8.21232986E-01   # y_t(Q) DRbar
#
BLOCK Yd Q=  5.00075478E+03  # The Yukawa couplings
  1  1     0.00000000E+00   # y_d(Q) DRbar
  2  2     0.00000000E+00   # y_s(Q) DRbar
  3  3     1.30573873E-01   # y_b(Q) DRbar
#
BLOCK Ye Q=  5.00075478E+03  # The Yukawa couplings
  1  1     0.00000000E+00   # y_e(Q) DRbar
  2  2     0.00000000E+00   # y_mu(Q) DRbar
  3  3     9.70120998E-02   # y_tau(Q) DRbar
#
BLOCK MSOFT Q=  5.00075478E+03  # The soft SUSY breaking masses at the scale Q
         1     6.00000000E+01   # M_1(Q)              
         2     3.00000000E+03   # M_2(Q)              
         3     2.13913200E+03   # M_3(Q)              
        21     8.25210535E+06   # mH1^2(Q)            
        22     1.10996088E+05   # mH2^2(Q)            
        31     5.00000000E+03   # meL(Q)              
        32     5.00000000E+03   # mmuL(Q)             
        33     5.00000000E+03   # mtauL(Q)            
        34     5.00000000E+03   # meR(Q)              
        35     5.00000000E+03   # mmuR(Q)             
        36     5.00000000E+03   # mtauR(Q)            
        41     4.99999999E+03   # mqL1(Q)             
        42     4.99999999E+03   # mqL2(Q)             
        43     4.99999999E+03   # mqL3(Q)             
        44     4.99999999E+03   # muR(Q)              
        45     4.99999999E+03   # mcR(Q)              
        46     4.99999999E+03   # mtR(Q)              
        47     4.99999999E+03   # mdR(Q)              
        48     4.99999999E+03   # msR(Q)              
        49     4.99999999E+03   # mbR(Q)              
#
#
#
#                             =================
#                             |The decay table|
#                             =================
#
# - The QCD corrections to the decays gluino -> squark  + quark
#                                     squark -> gaugino + quark_prime
#                                     squark -> squark_prime + Higgs
#                                     squark -> gluino  + quark
#   are included.
#
# - The multi-body decays for the inos, stops and sbottoms are included.
#
# - The loop induced decays for the gluino, neutralinos and stops
#   are included.
#
# - The SUSY decays of the top quark are included.
#
#
#         PDG            Width
DECAY         6     1.40383745E+00   # top decays
#          BR         NDA      ID1       ID2
     1.00000000E+00    2           5        24   # BR(t ->  b    W+)
#
#         PDG            Width
DECAY   1000021     5.66028621E-03   # gluino decays
#          BR         NDA      ID1       ID2
     9.75512773E-07    2     1000022        21   # BR(~g -> ~chi_10 g)
     4.71661781E-03    2     1000023        21   # BR(~g -> ~chi_20 g)
     4.61069497E-03    2     1000025        21   # BR(~g -> ~chi_30 g)
#           BR         NDA      ID1       ID2       ID3
     1.33415902E-02    3     1000022         1        -1   # BR(~g -> ~chi_10 d  db)
     2.32850334E-05    3     1000023         1        -1   # BR(~g -> ~chi_20 d  db)
     2.44432992E-05    3     1000025         1        -1   # BR(~g -> ~chi_30 d  db)
     4.54995156E-02    3     1000022         2        -2   # BR(~g -> ~chi_10 u  ub)
     1.07900895E-04    3     1000023         2        -2   # BR(~g -> ~chi_20 u  ub)
     3.46515282E-05    3     1000025         2        -2   # BR(~g -> ~chi_30 u  ub)
     1.33415902E-02    3     1000022         3        -3   # BR(~g -> ~chi_10 s  sb)
     2.32850334E-05    3     1000023         3        -3   # BR(~g -> ~chi_20 s  sb)
     2.44432992E-05    3     1000025         3        -3   # BR(~g -> ~chi_30 s  sb)
     4.54995156E-02    3     1000022         4        -4   # BR(~g -> ~chi_10 c  cb)
     1.07900895E-04    3     1000023         4        -4   # BR(~g -> ~chi_20 c  cb)
     3.46515282E-05    3     1000025         4        -4   # BR(~g -> ~chi_30 c  cb)
     1.35793647E-02    3     1000022         5        -5   # BR(~g -> ~chi_10 b  bb)
     5.15925971E-03    3     1000023         5        -5   # BR(~g -> ~chi_20 b  bb)
     5.12403366E-03    3     1000025         5        -5   # BR(~g -> ~chi_30 b  bb)
     4.63392961E-02    3     1000022         6        -6   # BR(~g -> ~chi_10 t  tb)
     1.99895087E-01    3     1000023         6        -6   # BR(~g -> ~chi_20 t  tb)
     1.87967761E-01    3     1000025         6        -6   # BR(~g -> ~chi_30 t  tb)
     5.77859798E-05    3     1000024         1        -2   # BR(~g -> ~chi_1+ d  ub)
     5.77859798E-05    3    -1000024         2        -1   # BR(~g -> ~chi_1- u  db)
     5.77859798E-05    3     1000024         3        -4   # BR(~g -> ~chi_1+ s  cb)
     5.77859798E-05    3    -1000024         4        -3   # BR(~g -> ~chi_1- c  sb)
     2.07156496E-01    3     1000024         5        -6   # BR(~g -> ~chi_1+ b  tb)
     2.07156496E-01    3    -1000024         6        -5   # BR(~g -> ~chi_1- t  bb)
#
#         PDG            Width
DECAY   1000006     2.99229262E+02   # stop1 decays
#          BR         NDA      ID1       ID2
     2.96729597E-02    2     1000022         6   # BR(~t_1 -> ~chi_10 t )
     1.06657521E-01    2     1000023         6   # BR(~t_1 -> ~chi_20 t )
     1.01960138E-01    2     1000025         6   # BR(~t_1 -> ~chi_30 t )
     6.75536159E-03    2     1000035         6   # BR(~t_1 -> ~chi_40 t )
     1.56399301E-01    2     1000024         5   # BR(~t_1 -> ~chi_1+ b )
     1.34644529E-02    2     1000037         5   # BR(~t_1 -> ~chi_2+ b )
     5.85090266E-01    2     1000021         6   # BR(~t_1 -> ~g      t )
#
#         PDG            Width
DECAY   2000006     3.06751572E+02   # stop2 decays
#          BR         NDA      ID1       ID2
     1.11272072E-02    2     1000022         6   # BR(~t_2 -> ~chi_10 t )
     1.05505338E-01    2     1000023         6   # BR(~t_2 -> ~chi_20 t )
     1.10611081E-01    2     1000025         6   # BR(~t_2 -> ~chi_30 t )
     1.84335123E-02    2     1000035         6   # BR(~t_2 -> ~chi_40 t )
     6.11747986E-02    2     1000024         5   # BR(~t_2 -> ~chi_1+ b )
     3.66958311E-02    2     1000037         5   # BR(~t_2 -> ~chi_2+ b )
     6.52547707E-01    2     1000021         6   # BR(~t_2 -> ~g      t )
     9.01031608E-04    2     1000006        25   # BR(~t_2 -> ~t_1    h )
     3.00349353E-03    2     1000006        23   # BR(~t_2 -> ~t_1    Z )
#
#         PDG            Width
DECAY   1000005     2.81169378E+02   # sbottom1 decays
#          BR         NDA      ID1       ID2
     2.74150491E-03    2     1000022         5   # BR(~b_1 -> ~chi_10 b )
     2.91005257E-03    2     1000023         5   # BR(~b_1 -> ~chi_20 b )
     2.87519619E-03    2     1000025         5   # BR(~b_1 -> ~chi_30 b )
     2.70504098E-02    2     1000035         5   # BR(~b_1 -> ~chi_40 b )
     2.29527529E-01    2    -1000024         6   # BR(~b_1 -> ~chi_1- t )
     5.43222984E-02    2    -1000037         6   # BR(~b_1 -> ~chi_2- t )
     6.78648375E-01    2     1000021         5   # BR(~b_1 -> ~g      b )
     1.92463418E-03    2     1000006       -24   # BR(~b_1 -> ~t_1    W-)
#
#         PDG            Width
DECAY   2000005     2.00214982E+02   # sbottom2 decays
#          BR         NDA      ID1       ID2
     1.46497735E-02    2     1000022         5   # BR(~b_2 -> ~chi_10 b )
     4.15638655E-03    2     1000023         5   # BR(~b_2 -> ~chi_20 b )
     4.23174300E-03    2     1000025         5   # BR(~b_2 -> ~chi_30 b )
     1.30083265E-04    2     1000035         5   # BR(~b_2 -> ~chi_40 b )
     9.30124213E-03    2    -1000024         6   # BR(~b_2 -> ~chi_1- t )
     2.61236618E-04    2    -1000037         6   # BR(~b_2 -> ~chi_2- t )
     9.67227986E-01    2     1000021         5   # BR(~b_2 -> ~g      b )
     4.15493631E-05    2     1000006       -24   # BR(~b_2 -> ~t_1    W-)
#
#         PDG            Width
DECAY   1000002     2.19738100E+02   # sup_L decays
#          BR         NDA      ID1       ID2
     3.38554563E-03    2     1000022         2   # BR(~u_L -> ~chi_10 u)
     7.30280637E-05    2     1000023         2   # BR(~u_L -> ~chi_20 u)
     4.41937894E-06    2     1000025         2   # BR(~u_L -> ~chi_30 u)
     3.59739481E-02    2     1000035         2   # BR(~u_L -> ~chi_40 u)
     2.30886557E-04    2     1000024         1   # BR(~u_L -> ~chi_1+ d)
     7.19020599E-02    2     1000037         1   # BR(~u_L -> ~chi_2+ d)
     8.88430112E-01    2     1000021         2   # BR(~u_L -> ~g      u)
#
#         PDG            Width
DECAY   2000002     2.05559315E+02   # sup_R decays
#          BR         NDA      ID1       ID2
     5.75710068E-02    2     1000022         2   # BR(~u_R -> ~chi_10 u)
     1.08572654E-04    2     1000023         2   # BR(~u_R -> ~chi_20 u)
     1.16353237E-04    2     1000025         2   # BR(~u_R -> ~chi_30 u)
     3.53977185E-09    2     1000035         2   # BR(~u_R -> ~chi_40 u)
     9.42204064E-01    2     1000021         2   # BR(~u_R -> ~g      u)
#
#         PDG            Width
DECAY   1000001     2.19754278E+02   # sdown_L decays
#          BR         NDA      ID1       ID2
     3.37043232E-03    2     1000022         1   # BR(~d_L -> ~chi_10 d)
     1.22297420E-05    2     1000023         1   # BR(~d_L -> ~chi_20 d)
     5.37097729E-05    2     1000025         1   # BR(~d_L -> ~chi_30 d)
     3.59932908E-02    2     1000035         1   # BR(~d_L -> ~chi_40 d)
     3.41288915E-06    2    -1000024         2   # BR(~d_L -> ~chi_1- u)
     7.20143201E-02    2    -1000037         2   # BR(~d_L -> ~chi_2- u)
     8.88552604E-01    2     1000021         1   # BR(~d_L -> ~g      d)
#
#         PDG            Width
DECAY   2000001     1.96674807E+02   # sdown_R decays
#          BR         NDA      ID1       ID2
     1.50438118E-02    2     1000022         1   # BR(~d_R -> ~chi_10 d)
     2.83711127E-05    2     1000023         1   # BR(~d_R -> ~chi_20 d)
     3.04042571E-05    2     1000025         1   # BR(~d_R -> ~chi_30 d)
     9.25096971E-10    2     1000035         1   # BR(~d_R -> ~chi_40 d)
     9.84897412E-01    2     1000021         1   # BR(~d_R -> ~g      d)
#
#         PDG            Width
DECAY   1000004     2.19738100E+02   # scharm_L decays
#          BR         NDA      ID1       ID2
     3.38554563E-03    2     1000022         4   # BR(~c_L -> ~chi_10 c)
     7.30280637E-05    2     1000023         4   # BR(~c_L -> ~chi_20 c)
     4.41937894E-06    2     1000025         4   # BR(~c_L -> ~chi_30 c)
     3.59739481E-02    2     1000035         4   # BR(~c_L -> ~chi_40 c)
     2.30886557E-04    2     1000024         3   # BR(~c_L -> ~chi_1+ s)
     7.19020599E-02    2     1000037         3   # BR(~c_L -> ~chi_2+ s)
     8.88430112E-01    2     1000021         4   # BR(~c_L -> ~g      c)
#
#         PDG            Width
DECAY   2000004     2.05559315E+02   # scharm_R decays
#          BR         NDA      ID1       ID2
     5.75710068E-02    2     1000022         4   # BR(~c_R -> ~chi_10 c)
     1.08572654E-04    2     1000023         4   # BR(~c_R -> ~chi_20 c)
     1.16353237E-04    2     1000025         4   # BR(~c_R -> ~chi_30 c)
     3.53977185E-09    2     1000035         4   # BR(~c_R -> ~chi_40 c)
     9.42204064E-01    2     1000021         4   # BR(~c_R -> ~g      c)
#
#         PDG            Width
DECAY   1000003     2.19754278E+02   # sstrange_L decays
#          BR         NDA      ID1       ID2
     3.37043232E-03    2     1000022         3   # BR(~s_L -> ~chi_10 s)
     1.22297420E-05    2     1000023         3   # BR(~s_L -> ~chi_20 s)
     5.37097729E-05    2     1000025         3   # BR(~s_L -> ~chi_30 s)
     3.59932908E-02    2     1000035         3   # BR(~s_L -> ~chi_40 s)
     3.41288915E-06    2    -1000024         4   # BR(~s_L -> ~chi_1- c)
     7.20143201E-02    2    -1000037         4   # BR(~s_L -> ~chi_2- c)
     8.88552604E-01    2     1000021         3   # BR(~s_L -> ~g      s)
#
#         PDG            Width
DECAY   2000003     1.96674807E+02   # sstrange_R decays
#          BR         NDA      ID1       ID2
     1.50438118E-02    2     1000022         3   # BR(~s_R -> ~chi_10 s)
     2.83711127E-05    2     1000023         3   # BR(~s_R -> ~chi_20 s)
     3.04042571E-05    2     1000025         3   # BR(~s_R -> ~chi_30 s)
     9.25096971E-10    2     1000035         3   # BR(~s_R -> ~chi_40 s)
     9.84897412E-01    2     1000021         3   # BR(~s_R -> ~g      s)
#
#         PDG            Width
DECAY   1000011     3.03012392E+01   # selectron_L decays
#          BR         NDA      ID1       ID2
     2.25813692E-01    2     1000022        11   # BR(~e_L -> ~chi_10 e-)
     1.36801204E-03    2     1000023        11   # BR(~e_L -> ~chi_20 e-)
     7.22493051E-05    2     1000025        11   # BR(~e_L -> ~chi_30 e-)
     2.57403698E-01    2     1000035        11   # BR(~e_L -> ~chi_40 e-)
     2.52633221E-05    2    -1000024        12   # BR(~e_L -> ~chi_1- nu_e)
     5.15317085E-01    2    -1000037        12   # BR(~e_L -> ~chi_2- nu_e)
#
#         PDG            Width
DECAY   2000011     2.73838284E+01   # selectron_R decays
#          BR         NDA      ID1       ID2
     9.96118298E-01    2     1000022        11   # BR(~e_R -> ~chi_10 e-)
     1.87369515E-03    2     1000023        11   # BR(~e_R -> ~chi_20 e-)
     2.00794749E-03    2     1000025        11   # BR(~e_R -> ~chi_30 e-)
     5.91589766E-08    2     1000035        11   # BR(~e_R -> ~chi_40 e-)
#
#         PDG            Width
DECAY   1000013     3.03012392E+01   # smuon_L decays
#          BR         NDA      ID1       ID2
     2.25813692E-01    2     1000022        13   # BR(~mu_L -> ~chi_10 mu-)
     1.36801204E-03    2     1000023        13   # BR(~mu_L -> ~chi_20 mu-)
     7.22493051E-05    2     1000025        13   # BR(~mu_L -> ~chi_30 mu-)
     2.57403698E-01    2     1000035        13   # BR(~mu_L -> ~chi_40 mu-)
     2.52633221E-05    2    -1000024        14   # BR(~mu_L -> ~chi_1- nu_mu)
     5.15317085E-01    2    -1000037        14   # BR(~mu_L -> ~chi_2- nu_mu)
#
#         PDG            Width
DECAY   2000013     2.73838284E+01   # smuon_R decays
#          BR         NDA      ID1       ID2
     9.96118298E-01    2     1000022        13   # BR(~mu_R -> ~chi_10 mu-)
     1.87369515E-03    2     1000023        13   # BR(~mu_R -> ~chi_20 mu-)
     2.00794749E-03    2     1000025        13   # BR(~mu_R -> ~chi_30 mu-)
     5.91589766E-08    2     1000035        13   # BR(~mu_R -> ~chi_40 mu-)
#
#         PDG            Width
DECAY   1000015     2.91947316E+01   # stau_1 decays
#          BR         NDA      ID1       ID2
     9.30631967E-01    2     1000022        15   # BR(~tau_1 -> ~chi_10  tau-)
     1.70511254E-02    2     1000023        15   # BR(~tau_1 -> ~chi_20  tau-)
     1.65285016E-02    2     1000025        15   # BR(~tau_1 -> ~chi_30  tau-)
     1.66229244E-03    2     1000035        15   # BR(~tau_1 -> ~chi_40  tau-)
     3.07984311E-02    2    -1000024        16   # BR(~tau_1 -> ~chi_1-  nu_tau)
     3.32768195E-03    2    -1000037        16   # BR(~tau_1 -> ~chi_2-  nu_tau)
#
#         PDG            Width
DECAY   2000015     3.11804304E+01   # stau_2 decays
#          BR         NDA      ID1       ID2
     2.22930758E-01    2     1000022        15   # BR(~tau_2 -> ~chi_10  tau-)
     1.58574939E-02    2     1000023        15   # BR(~tau_2 -> ~chi_20  tau-)
     1.51337417E-02    2     1000025        15   # BR(~tau_2 -> ~chi_30  tau-)
     2.48503386E-01    2     1000035        15   # BR(~tau_2 -> ~chi_40  tau-)
     7.51617175E-05    2    -1000024        16   # BR(~tau_2 -> ~chi_1-  nu_tau)
     4.97499458E-01    2    -1000037        16   # BR(~tau_2 -> ~chi_2-  nu_tau)
#
#         PDG            Width
DECAY   1000012     3.03043321E+01   # snu_eL decays
#          BR         NDA      ID1       ID2
     2.25409922E-01    2     1000022        12   # BR(~nu_eL -> ~chi_10 nu_e)
     1.78143314E-05    2     1000023        12   # BR(~nu_eL -> ~chi_20 nu_e)
     1.16646811E-03    2     1000025        12   # BR(~nu_eL -> ~chi_30 nu_e)
     2.57447396E-01    2     1000035        12   # BR(~nu_eL -> ~chi_40 nu_e)
     1.70862192E-03    2     1000024        11   # BR(~nu_eL -> ~chi_1+ e-)
     5.14249777E-01    2     1000037        11   # BR(~nu_eL -> ~chi_2+ e-)
#
#         PDG            Width
DECAY   1000014     3.03043321E+01   # snu_muL decays
#          BR         NDA      ID1       ID2
     2.25409922E-01    2     1000022        14   # BR(~nu_muL -> ~chi_10 nu_mu)
     1.78143314E-05    2     1000023        14   # BR(~nu_muL -> ~chi_20 nu_mu)
     1.16646811E-03    2     1000025        14   # BR(~nu_muL -> ~chi_30 nu_mu)
     2.57447396E-01    2     1000035        14   # BR(~nu_muL -> ~chi_40 nu_mu)
     1.70862192E-03    2     1000024        13   # BR(~nu_muL -> ~chi_1+ mu-)
     5.14249777E-01    2     1000037        13   # BR(~nu_muL -> ~chi_2+ mu-)
#
#         PDG            Width
DECAY   1000016     3.11981105E+01   # snu_tauL decays
#          BR         NDA      ID1       ID2
     2.18928282E-01    2     1000022        16   # BR(~nu_tauL -> ~chi_10 nu_tau)
     1.73019327E-05    2     1000023        16   # BR(~nu_tauL -> ~chi_20 nu_tau)
     1.13291659E-03    2     1000025        16   # BR(~nu_tauL -> ~chi_30 nu_tau)
     2.49978737E-01    2     1000035        16   # BR(~nu_tauL -> ~chi_40 nu_tau)
     3.06121776E-02    2     1000024        15   # BR(~nu_tauL -> ~chi_1+ tau-)
     4.99330585E-01    2     1000037        15   # BR(~nu_tauL -> ~chi_2+ tau-)
#
#         PDG            Width
DECAY   1000024     4.20398913E-01   # chargino1+ decays
#          BR         NDA      ID1       ID2
     1.00000000E+00    2     1000022        24   # BR(~chi_1+ -> ~chi_10  W+)
#
#         PDG            Width
DECAY   1000037     2.14585990E+01   # chargino2+ decays
#          BR         NDA      ID1       ID2
     2.53432729E-01    2     1000024        23   # BR(~chi_2+ -> ~chi_1+  Z )
     1.77984511E-04    2     1000022        24   # BR(~chi_2+ -> ~chi_10  W+)
     2.44563489E-01    2     1000023        24   # BR(~chi_2+ -> ~chi_20  W+)
     2.44271255E-01    2     1000025        24   # BR(~chi_2+ -> ~chi_30  W+)
     2.57551979E-01    2     1000024        25   # BR(~chi_2+ -> ~chi_1+  h )
     2.56446602E-06    2     1000022        37   # BR(~chi_2+ -> ~chi_10  H+)
#
#         PDG            Width
DECAY   1000022     0.00000000E+00   # neutralino1 decays
#
#         PDG            Width
DECAY   1000023     4.34136444E-01   # neutralino2 decays
#          BR         NDA      ID1       ID2
     5.22419230E-01    2     1000022        23   # BR(~chi_20 -> ~chi_10   Z )
     4.77580770E-01    2     1000022        25   # BR(~chi_20 -> ~chi_10   h )
#
#         PDG            Width
DECAY   1000025     4.32007016E-01   # neutralino3 decays
#          BR         NDA      ID1       ID2
     4.83899324E-01    2     1000022        23   # BR(~chi_30 -> ~chi_10   Z )
     5.16100676E-01    2     1000022        25   # BR(~chi_30 -> ~chi_10   h )
#
#         PDG            Width
DECAY   1000035     2.14736883E+01   # neutralino4 decays
#          BR         NDA      ID1       ID2
     2.28862042E-05    2     1000022        23   # BR(~chi_40 -> ~chi_10   Z )
     9.62859824E-02    2     1000023        23   # BR(~chi_40 -> ~chi_20   Z )
     1.56538319E-01    2     1000025        23   # BR(~chi_40 -> ~chi_30   Z )
     2.45014393E-01    2     1000024       -24   # BR(~chi_40 -> ~chi_1+   W-)
     2.45014393E-01    2    -1000024        24   # BR(~chi_40 -> ~chi_1-   W+)
     1.52154067E-04    2     1000022        25   # BR(~chi_40 -> ~chi_10   h )
     2.45050182E-06    2     1000022        35   # BR(~chi_40 -> ~chi_10   H )
     2.79142738E-07    2     1000022        36   # BR(~chi_40 -> ~chi_10   A )
     1.60397449E-01    2     1000023        25   # BR(~chi_40 -> ~chi_20   h )
     9.65716936E-02    2     1000025        25   # BR(~chi_40 -> ~chi_30   h )
#
#         PDG            Width
DECAY        25     4.06649785E-03   # h decays
#          BR         NDA      ID1       ID2
     6.07917590E-01    2           5        -5   # BR(h -> b       bb     )
     6.38052606E-02    2         -15        15   # BR(h -> tau+    tau-   )
     2.25893659E-04    2         -13        13   # BR(h -> mu+     mu-    )
     4.78853181E-04    2           3        -3   # BR(h -> s       sb     )
     2.07484026E-02    2           4        -4   # BR(h -> c       cb     )
     6.71591547E-02    2          21        21   # BR(h -> g       g      )
     2.30955266E-03    2          22        22   # BR(h -> gam     gam    )
     1.49248573E-03    2          22        23   # BR(h -> Z       gam    )
     2.10665576E-01    2          24       -24   # BR(h -> W+      W-     )
     2.51163981E-02    2          23        23   # BR(h -> Z       Z      )
     8.08330013E-05    2     1000022   1000022   # BR(h -> ~chi_10 ~chi_10)
#
#         PDG            Width
DECAY        35     8.47984214E+00   # H decays
#          BR         NDA      ID1       ID2
     3.78094538E-01    2           5        -5   # BR(H -> b       bb     )
     6.56845356E-02    2         -15        15   # BR(H -> tau+    tau-   )
     2.32265735E-04    2         -13        13   # BR(H -> mu+     mu-    )
     2.84722149E-04    2           3        -3   # BR(H -> s       sb     )
     1.59340776E-06    2           4        -4   # BR(H -> c       cb     )
     1.59194057E-01    2           6        -6   # BR(H -> t       tb     )
     5.29313425E-05    2          21        21   # BR(H -> g       g      )
     1.84886819E-07    2          22        22   # BR(H -> gam     gam    )
     9.39808286E-08    2          23        22   # BR(H -> Z       gam    )
     7.49896119E-05    2          24       -24   # BR(H -> W+      W-     )
     3.74473437E-05    2          23        23   # BR(H -> Z       Z      )
     2.74192016E-04    2          25        25   # BR(H -> h       h      )
    -9.71199621E-24    2          36        36   # BR(H -> A       A      )
     7.10782640E-19    2          23        36   # BR(H -> Z       A      )
     2.81412098E-03    2     1000024  -1000024   # BR(H -> ~chi_1+ ~chi_1-)
     3.48072114E-03    2     1000022   1000022   # BR(H -> ~chi_10 ~chi_10)
     1.48452351E-05    2     1000023   1000023   # BR(H -> ~chi_20 ~chi_20)
     1.35565939E-03    2     1000025   1000025   # BR(H -> ~chi_30 ~chi_30)
     2.33782207E-01    2     1000022   1000023   # BR(H -> ~chi_10 ~chi_20)
     1.53100536E-01    2     1000022   1000025   # BR(H -> ~chi_10 ~chi_30)
     1.52035901E-03    2     1000023   1000025   # BR(H -> ~chi_20 ~chi_30)
#
#         PDG            Width
DECAY        36     8.48985037E+00   # A decays
#          BR         NDA      ID1       ID2
     3.77777187E-01    2           5        -5   # BR(A -> b       bb     )
     6.56090627E-02    2         -15        15   # BR(A -> tau+    tau-   )
     2.31998533E-04    2         -13        13   # BR(A -> mu+     mu-    )
     2.84602521E-04    2           3        -3   # BR(A -> s       sb     )
     1.59795536E-06    2           4        -4   # BR(A -> c       cb     )
     1.59560311E-01    2           6        -6   # BR(A -> t       tb     )
     1.57885994E-04    2          21        21   # BR(A -> g       g      )
     5.99937249E-07    2          22        22   # BR(A -> gam     gam    )
     1.91181728E-07    2          23        22   # BR(A -> Z       gam    )
     7.46176463E-05    2          23        25   # BR(A -> Z       h      )
     3.41336611E-03    2     1000024  -1000024   # BR(A -> ~chi_1+ ~chi_1-)
     3.50869452E-03    2     1000022   1000022   # BR(A -> ~chi_10 ~chi_10)
     1.23961095E-05    2     1000023   1000023   # BR(A -> ~chi_20 ~chi_20)
     2.65474908E-03    2     1000025   1000025   # BR(A -> ~chi_30 ~chi_30)
     1.55725179E-01    2     1000022   1000023   # BR(A -> ~chi_10 ~chi_20)
     2.30158087E-01    2     1000022   1000025   # BR(A -> ~chi_10 ~chi_30)
     8.29474539E-04    2     1000023   1000025   # BR(A -> ~chi_20 ~chi_30)
#
#         PDG            Width
DECAY        37     8.44798730E+00   # H+ decays
#          BR         NDA      ID1       ID2
     6.07724389E-04    2           4        -5   # BR(H+ -> c       bb     )
     6.59645057E-02    2         -15        16   # BR(H+ -> tau+    nu_tau )
     2.33255405E-04    2         -13        14   # BR(H+ -> mu+     nu_mu  )
     3.88941583E-06    2           2        -5   # BR(H+ -> u       bb     )
     1.36866428E-05    2           2        -3   # BR(H+ -> u       sb     )
     2.83041262E-04    2           4        -3   # BR(H+ -> c       sb     )
     5.36856308E-01    2           6        -5   # BR(H+ -> t       bb     )
     7.51392886E-05    2          24        25   # BR(H+ -> W+      h      )
     7.77830014E-13    2          24        36   # BR(H+ -> W+      A      )
     3.94039590E-01    2     1000024   1000022   # BR(H+ -> ~chi_1+ ~chi_10)
     1.86842668E-03    2     1000024   1000023   # BR(H+ -> ~chi_1+ ~chi_20)
     5.44331973E-05    2     1000024   1000025   # BR(H+ -> ~chi_1+ ~chi_30)
