# SUSY Les Houches Accord 2 - MSSM-RpV/Bi Spectrum + Decays + Flavor Observables
# SPheno module generated by SARAH
# ----------------------------------------------------------------------
# SPheno v3.3.6  
#   W. Porod, Comput. Phys. Commun. 153 (2003) 275-315, hep-ph/0301101
#   W. Porod, F.Staub, Comput.Phys.Commun.183 (2012) 2458-2469, arXiv:1104.1573
# SARAH: SARAHVER
#   F. Staub; arXiv:0806.0538 (online manual)
#   F. Staub; Comput. Phys. Commun. 181 (2010) 1077-1086; arXiv:0909.2863
#   F. Staub; Comput. Phys. Commun. 182 (2011)  808-833; arXiv:1002.0840
#   F. Staub; Comput. Phys. Commun. 184 (2013)  1792-1809; arXiv:1207.0906
#   F. Staub; Comput. Phys. Commun. 185 (2014)  1773-1790; arXiv:1309.7223 
# Including the calculation of flavor observables based on the FlavorKit 
#   W. Porod, F. Staub, A. Vicente; Eur.Phys.J. C74 (2014) 8, 2992; arXiv:1405.1434 
# Two-loop masss corrections to Higgs fields based on 
#   M. D. Goodsell, K. Nickel, F. Staub; arXiv:1411.0675 
#   M. D. Goodsell, K. Nickel, F. Staub; arXiv:1503.03098
#  
# in case of problems send email to florian.staub@cern.ch and goodsell@lpthe.jussieu.fr 
# ----------------------------------------------------------------------
# Created: 01.02.2018,  11:18
Block SPINFO         # Program information
     1   SPhenoSARAH      # spectrum calculator
     2   v3.3.6      # version number of SPheno
     9   SARAHVER    # version number of SARAH
Block MODSEL  # Input parameters
     1  0   #  SUSY Scale input
     2  1   #  Boundary conditions 
Block MINPAR  # Input parameters
    1    0.00000000E+00  # m0
    2    0.00000000E+00  # m12
    3    5.00000000E+00  # TanBeta
    4    0.00000000E+00  # SignumMue
    5    0.00000000E+00  # Azero
Block EXTPAR  # Input parameters
    1   -7.00000000E+02  # M1input
    2    2.00000000E+03  # M2input
    3    3.20000000E+03  # M3input
   23    3.00000000E+02  # Muinput
   25    5.00000000E+00  # TanBeta
   24    1.00000000E+06  # MA2input
Block gaugeGUT Q=  1.99791750E+03  # (GUT scale)
   1    4.69931410E-01  # g1(Q)^DRbar
   2    6.37595059E-01  # g2(Q)^DRbar
   3    1.02086187E+00  # g3(Q)^DRbar
Block SMINPUTS  # SM parameters
         1     1.27932496E+02  # alpha_em^-1(MZ)^MSbar
         2     1.16637000E-05  # G_mu [GeV^-2]
         3     1.18700000E-01  # alpha_s(MZ)^MSbar
         4     9.11887000E+01  # m_Z(pole)
         5     4.18000000E+00  # m_b(m_b), MSbar
         6     1.73500000E+02  # m_t(pole)
         7     1.77669000E+00  # m_tau(pole)
Block GAUGE Q=  1.99791750E+03  # (SUSY Scale)
   1    3.64007305E-01  # g1
   2    6.37595059E-01  # g2
   3    1.02086187E+00  # g3
Block HMIX Q=  1.99791750E+03  # (SUSY Scale)
   1    3.00000000E+02  # Mu
 101    1.92307692E+05  # Bmu
 102    4.77204155E+01  # vd
 103    2.38602077E+02  # vu
Block MSOFT Q=  1.99791750E+03  # (SUSY Scale)
  21    8.35563656E+05  # mHd2
  22    9.57657109E+03  # mHu2
   1   -7.00000000E+02  # M1
   2    2.00000000E+03  # M2
   3    3.20000000E+03  # M3
Block PHASES Q=  1.99791750E+03  # (SUSY Scale)
   1    1.00000000E+00  # pG
Block Yd Q=  1.99791750E+03  # (SUSY Scale)
  1  1     6.73034061E-05   # Real(Yd(1,1),dp)
  1  2     0.00000000E+00   # Real(Yd(1,2),dp)
  1  3     0.00000000E+00   # Real(Yd(1,3),dp)
  2  1     0.00000000E+00   # Real(Yd(2,1),dp)
  2  2     1.27876425E-03   # Real(Yd(2,2),dp)
  2  3     0.00000000E+00   # Real(Yd(2,3),dp)
  3  1     0.00000000E+00   # Real(Yd(3,1),dp)
  3  2     0.00000000E+00   # Real(Yd(3,2),dp)
  3  3     6.64277229E-02   # Real(Yd(3,3),dp)
Block Ye Q=  1.99791750E+03  # (SUSY Scale)
  1  1     1.43274145E-05   # Real(Ye(1,1),dp)
  1  2    -3.64825822E-14   # Real(Ye(1,2),dp)
  1  3     3.67190837E-14   # Real(Ye(1,3),dp)
  2  1     2.54798931E-11   # Real(Ye(2,1),dp)
  2  2     2.96245504E-03   # Real(Ye(2,2),dp)
  2  3     2.69402330E-11   # Real(Ye(2,3),dp)
  3  1     5.72710229E-10   # Real(Ye(3,1),dp)
  3  2    -6.00858557E-10   # Real(Ye(3,2),dp)
  3  3     4.98158919E-02   # Real(Ye(3,3),dp)
Block Yu Q=  1.99791750E+03  # (SUSY Scale)
  1  1     7.03422350E-06   # Real(Yu(1,1),dp)
  1  2     0.00000000E+00   # Real(Yu(1,2),dp)
  1  3     0.00000000E+00   # Real(Yu(1,3),dp)
  2  1     0.00000000E+00   # Real(Yu(2,1),dp)
  2  2     3.57338579E-03   # Real(Yu(2,2),dp)
  2  3     0.00000000E+00   # Real(Yu(2,3),dp)
  3  1     0.00000000E+00   # Real(Yu(3,1),dp)
  3  2     0.00000000E+00   # Real(Yu(3,2),dp)
  3  3     8.54559497E-01   # Real(Yu(3,3),dp)
Block RVSNVEV Q=  1.99791750E+03  # (SUSY Scale)
   1   -9.32598932E-03  # vL(1)
   2    1.24867484E-02  # vL(2)
   3   -7.69355376E-03  # vL(3)
Block RVKAPPA Q=  1.99791750E+03  # (SUSY Scale)
   1    5.96575494E-02  # Real(REps(1) ,dp)
   2   -6.27311505E-02  # Real(REps(2) ,dp)
   3    6.29538155E-02  # Real(REps(3) ,dp)
Block Td Q=  1.99791750E+03  # (SUSY Scale)
  1  1     0.00000000E+00   # Real(Td(1,1),dp)
  1  2     0.00000000E+00   # Real(Td(1,2),dp)
  1  3     0.00000000E+00   # Real(Td(1,3),dp)
  2  1     0.00000000E+00   # Real(Td(2,1),dp)
  2  2     0.00000000E+00   # Real(Td(2,2),dp)
  2  3     0.00000000E+00   # Real(Td(2,3),dp)
  3  1     0.00000000E+00   # Real(Td(3,1),dp)
  3  2     0.00000000E+00   # Real(Td(3,2),dp)
  3  3     0.00000000E+00   # Real(Td(3,3),dp)
Block Te Q=  1.99791750E+03  # (SUSY Scale)
  1  1     0.00000000E+00   # Real(Te(1,1),dp)
  1  2     0.00000000E+00   # Real(Te(1,2),dp)
  1  3     0.00000000E+00   # Real(Te(1,3),dp)
  2  1     0.00000000E+00   # Real(Te(2,1),dp)
  2  2     0.00000000E+00   # Real(Te(2,2),dp)
  2  3     0.00000000E+00   # Real(Te(2,3),dp)
  3  1     0.00000000E+00   # Real(Te(3,1),dp)
  3  2     0.00000000E+00   # Real(Te(3,2),dp)
  3  3     0.00000000E+00   # Real(Te(3,3),dp)
Block Tu Q=  1.99791750E+03  # (SUSY Scale)
  1  1     0.00000000E+00   # Real(Tu(1,1),dp)
  1  2     0.00000000E+00   # Real(Tu(1,2),dp)
  1  3     0.00000000E+00   # Real(Tu(1,3),dp)
  2  1     0.00000000E+00   # Real(Tu(2,1),dp)
  2  2     0.00000000E+00   # Real(Tu(2,2),dp)
  2  3     0.00000000E+00   # Real(Tu(2,3),dp)
  3  1     0.00000000E+00   # Real(Tu(3,1),dp)
  3  2     0.00000000E+00   # Real(Tu(3,2),dp)
  3  3    -2.70000000E+03   # Real(Tu(3,3),dp)
Block RVD Q=  1.99791750E+03  # (SUSY Scale)
   1    1.61094580E+02  # Real(Beps(1) ,dp)
   2   -2.14445054E+02  # Real(Beps(2) ,dp)
   3    1.33892744E+02  # Real(Beps(3) ,dp)
Block MSQ2 Q=  1.99791750E+03  # (SUSY Scale)
  1  1     4.00000000E+06   # Real(mq2(1,1),dp)
  1  2     0.00000000E+00   # Real(mq2(1,2),dp)
  1  3     0.00000000E+00   # Real(mq2(1,3),dp)
  2  1     0.00000000E+00   # Real(mq2(2,1),dp)
  2  2     4.00000000E+06   # Real(mq2(2,2),dp)
  2  3     0.00000000E+00   # Real(mq2(2,3),dp)
  3  1     0.00000000E+00   # Real(mq2(3,1),dp)
  3  2     0.00000000E+00   # Real(mq2(3,2),dp)
  3  3     4.00000000E+06   # Real(mq2(3,3),dp)
Block MSL2 Q=  1.99791750E+03  # (SUSY Scale)
  1  1     4.00000000E+06   # Real(ml2(1,1),dp)
  1  2     0.00000000E+00   # Real(ml2(1,2),dp)
  1  3     0.00000000E+00   # Real(ml2(1,3),dp)
  2  1     0.00000000E+00   # Real(ml2(2,1),dp)
  2  2     4.00000000E+06   # Real(ml2(2,2),dp)
  2  3     0.00000000E+00   # Real(ml2(2,3),dp)
  3  1     0.00000000E+00   # Real(ml2(3,1),dp)
  3  2     0.00000000E+00   # Real(ml2(3,2),dp)
  3  3     4.00000000E+06   # Real(ml2(3,3),dp)
Block MSD2 Q=  1.99791750E+03  # (SUSY Scale)
  1  1     4.00000000E+06   # Real(md2(1,1),dp)
  1  2     0.00000000E+00   # Real(md2(1,2),dp)
  1  3     0.00000000E+00   # Real(md2(1,3),dp)
  2  1     0.00000000E+00   # Real(md2(2,1),dp)
  2  2     4.00000000E+06   # Real(md2(2,2),dp)
  2  3     0.00000000E+00   # Real(md2(2,3),dp)
  3  1     0.00000000E+00   # Real(md2(3,1),dp)
  3  2     0.00000000E+00   # Real(md2(3,2),dp)
  3  3     4.00000000E+06   # Real(md2(3,3),dp)
Block MSU2 Q=  1.99791750E+03  # (SUSY Scale)
  1  1     4.00000000E+06   # Real(mu2(1,1),dp)
  1  2     0.00000000E+00   # Real(mu2(1,2),dp)
  1  3     0.00000000E+00   # Real(mu2(1,3),dp)
  2  1     0.00000000E+00   # Real(mu2(2,1),dp)
  2  2     4.00000000E+06   # Real(mu2(2,2),dp)
  2  3     0.00000000E+00   # Real(mu2(2,3),dp)
  3  1     0.00000000E+00   # Real(mu2(3,1),dp)
  3  2     0.00000000E+00   # Real(mu2(3,2),dp)
  3  3     4.00000000E+06   # Real(mu2(3,3),dp)
Block MSE2 Q=  1.99791750E+03  # (SUSY Scale)
  1  1     4.00000000E+06   # Real(me2(1,1),dp)
  1  2     0.00000000E+00   # Real(me2(1,2),dp)
  1  3     0.00000000E+00   # Real(me2(1,3),dp)
  2  1     0.00000000E+00   # Real(me2(2,1),dp)
  2  2     4.00000000E+06   # Real(me2(2,2),dp)
  2  3     0.00000000E+00   # Real(me2(2,3),dp)
  3  1     0.00000000E+00   # Real(me2(3,1),dp)
  3  2     0.00000000E+00   # Real(me2(3,2),dp)
  3  3     4.00000000E+06   # Real(me2(3,3),dp)
Block RVM2LH1 Q=  1.99791750E+03  # (SUSY Scale)
   1    0.00000000E+00  # mlHd2(1) 
   2    0.00000000E+00  # mlHd2(2) 
   3    0.00000000E+00  # mlHd2(3) 
Block MASS  # Mass spectrum
#   PDG code      mass          particle
   1000001     2.04863872E+03  # Sd_1
   1000003     2.07155071E+03  # Sd_2
   1000005     2.07173372E+03  # Sd_3
   2000001     2.07173381E+03  # Sd_4
   2000003     2.09028464E+03  # Sd_5
   2000005     2.09028492E+03  # Sd_6
   1000002     1.90369458E+03  # Su_1
   1000004     2.07180210E+03  # Su_2
   1000006     2.07180256E+03  # Su_3
   2000002     2.08884312E+03  # Su_4
   2000004     2.08884333E+03  # Su_5
   2000006     2.14030135E+03  # Su_6
        25     1.22351244E+02  # hh_1
        35     1.00160451E+03  # hh_2
   1000012     2.01391360E+03  # hh_3
   1000014     2.01397046E+03  # hh_4
   1000016     2.01397066E+03  # hh_5
        36     1.00077491E+03  # Ah_2
   1000017     2.01391360E+03  # Ah_3
   1000018     2.01397046E+03  # Ah_4
   1000019     2.01397066E+03  # Ah_5
        37     1.00411872E+03  # Hpm_2
   1000011     2.00285953E+03  # Hpm_3
   2000011     2.00300486E+03  # Hpm_4
   1000013     2.00300538E+03  # Hpm_5
   2000013     2.01578157E+03  # Hpm_6
   1000015     2.01580536E+03  # Hpm_7
   2000015     2.01580545E+03  # Hpm_8
        23     9.11887000E+01  # VZ
        24     8.03139545E+01  # VWm
         1     5.00000000E-03  # Fd_1
         3     9.50000000E-02  # Fd_2
         5     4.18000000E+00  # Fd_3
         2     2.50000000E-03  # Fu_1
         4     1.27000000E+00  # Fu_2
         6     1.73500000E+02  # Fu_3
   1000021     3.13323801E+03  # Glu
        12     1.58843729E-12  # Chi_1
        14     1.08427245E-11  # Chi_2
        16     4.41534878E-11  # Chi_3
   1000022     3.05774281E+02  # Chi_4
   1000023     3.06572588E+02  # Chi_5
   1000025     6.97959426E+02  # Chi_6
   1000035     2.00983211E+03  # Chi_7
        11     5.10998930E-04  # Cha_1
        13     1.05658372E-01  # Cha_2
        15     1.77669000E+00  # Cha_3
   1000024     3.05808758E+02  # Cha_4
   1000037     2.01005142E+03  # Cha_5
Block DSQMIX Q=  1.99791750E+03  # ()
  1  1     0.00000000E+00   # Real(ZD(1,1),dp)
  1  2     0.00000000E+00   # Real(ZD(1,2),dp)
  1  3     9.99329642E-01   # Real(ZD(1,3),dp)
  1  4     0.00000000E+00   # Real(ZD(1,4),dp)
  1  5     0.00000000E+00   # Real(ZD(1,5),dp)
  1  6     3.66096410E-02   # Real(ZD(1,6),dp)
  2  1     0.00000000E+00   # Real(ZD(2,1),dp)
  2  2     0.00000000E+00   # Real(ZD(2,2),dp)
  2  3    -3.66096410E-02   # Real(ZD(2,3),dp)
  2  4     0.00000000E+00   # Real(ZD(2,4),dp)
  2  5     0.00000000E+00   # Real(ZD(2,5),dp)
  2  6     9.99329642E-01   # Real(ZD(2,6),dp)
  3  1    -0.00000000E+00   # Real(ZD(3,1),dp)
  3  2    -1.00345921E-03   # Real(ZD(3,2),dp)
  3  3    -0.00000000E+00   # Real(ZD(3,3),dp)
  3  4    -0.00000000E+00   # Real(ZD(3,4),dp)
  3  5    -9.99999497E-01   # Real(ZD(3,5),dp)
  3  6    -0.00000000E+00   # Real(ZD(3,6),dp)
  4  1    -5.28130440E-05   # Real(ZD(4,1),dp)
  4  2    -0.00000000E+00   # Real(ZD(4,2),dp)
  4  3    -0.00000000E+00   # Real(ZD(4,3),dp)
  4  4    -9.99999999E-01   # Real(ZD(4,4),dp)
  4  5    -0.00000000E+00   # Real(ZD(4,5),dp)
  4  6    -0.00000000E+00   # Real(ZD(4,6),dp)
  5  1     0.00000000E+00   # Real(ZD(5,1),dp)
  5  2    -9.99999497E-01   # Real(ZD(5,2),dp)
  5  3     0.00000000E+00   # Real(ZD(5,3),dp)
  5  4     0.00000000E+00   # Real(ZD(5,4),dp)
  5  5     1.00345921E-03   # Real(ZD(5,5),dp)
  5  6     0.00000000E+00   # Real(ZD(5,6),dp)
  6  1    -9.99999999E-01   # Real(ZD(6,1),dp)
  6  2     0.00000000E+00   # Real(ZD(6,2),dp)
  6  3     0.00000000E+00   # Real(ZD(6,3),dp)
  6  4     5.28130440E-05   # Real(ZD(6,4),dp)
  6  5     0.00000000E+00   # Real(ZD(6,5),dp)
  6  6     0.00000000E+00   # Real(ZD(6,6),dp)
Block USQMIX Q=  1.99791750E+03  # ()
  1  1    -0.00000000E+00   # Real(ZU(1,1),dp)
  1  2    -0.00000000E+00   # Real(ZU(1,2),dp)
  1  3    -6.29284103E-01   # Real(ZU(1,3),dp)
  1  4    -0.00000000E+00   # Real(ZU(1,4),dp)
  1  5    -0.00000000E+00   # Real(ZU(1,5),dp)
  1  6    -7.77175346E-01   # Real(ZU(1,6),dp)
  2  1    -0.00000000E+00   # Real(ZU(2,1),dp)
  2  2    -1.29174434E-03   # Real(ZU(2,2),dp)
  2  3    -0.00000000E+00   # Real(ZU(2,3),dp)
  2  4    -0.00000000E+00   # Real(ZU(2,4),dp)
  2  5    -9.99999166E-01   # Real(ZU(2,5),dp)
  2  6    -0.00000000E+00   # Real(ZU(2,6),dp)
  3  1    -2.54285234E-06   # Real(ZU(3,1),dp)
  3  2    -0.00000000E+00   # Real(ZU(3,2),dp)
  3  3    -0.00000000E+00   # Real(ZU(3,3),dp)
  3  4    -1.00000000E+00   # Real(ZU(3,4),dp)
  3  5    -0.00000000E+00   # Real(ZU(3,5),dp)
  3  6    -0.00000000E+00   # Real(ZU(3,6),dp)
  4  1     0.00000000E+00   # Real(ZU(4,1),dp)
  4  2    -9.99999166E-01   # Real(ZU(4,2),dp)
  4  3     0.00000000E+00   # Real(ZU(4,3),dp)
  4  4     0.00000000E+00   # Real(ZU(4,4),dp)
  4  5     1.29174434E-03   # Real(ZU(4,5),dp)
  4  6     0.00000000E+00   # Real(ZU(4,6),dp)
  5  1    -1.00000000E+00   # Real(ZU(5,1),dp)
  5  2     0.00000000E+00   # Real(ZU(5,2),dp)
  5  3     0.00000000E+00   # Real(ZU(5,3),dp)
  5  4     2.54285234E-06   # Real(ZU(5,4),dp)
  5  5     0.00000000E+00   # Real(ZU(5,5),dp)
  5  6     0.00000000E+00   # Real(ZU(5,6),dp)
  6  1     0.00000000E+00   # Real(ZU(6,1),dp)
  6  2     0.00000000E+00   # Real(ZU(6,2),dp)
  6  3    -7.77175346E-01   # Real(ZU(6,3),dp)
  6  4     0.00000000E+00   # Real(ZU(6,4),dp)
  6  5     0.00000000E+00   # Real(ZU(6,5),dp)
  6  6     6.29284103E-01   # Real(ZU(6,6),dp)
Block SCALARMIX Q=  1.99791750E+03  # ()
  1  1     2.00561447E-01   # ZH(1,1)
  1  2     9.79681122E-01   # ZH(1,2)
  1  3    -3.84812753E-05   # ZH(1,3)
  1  4     5.15299325E-05   # ZH(1,4)
  1  5    -3.17401823E-05   # ZH(1,5)
  2  1    -9.79681125E-01   # ZH(2,1)
  2  2     2.00561445E-01   # ZH(2,2)
  2  3    -1.65064050E-05   # ZH(2,3)
  2  4     2.03567807E-05   # ZH(2,4)
  2  5    -1.50138928E-05   # ZH(2,5)
  3  1     8.34082865E-06   # ZH(3,1)
  3  2    -3.40952008E-05   # ZH(3,2)
  3  3     1.28466075E-04   # ZH(3,3)
  3  4    -1.09885862E-04   # ZH(3,4)
  3  5    -9.99999985E-01   # ZH(3,5)
  4  1    -9.16873623E-06   # ZH(4,1)
  4  2     5.24226241E-05   # ZH(4,2)
  4  3    -5.06361720E-02   # ZH(4,3)
  4  4    -9.98717159E-01   # ZH(4,4)
  4  5     1.03238003E-04   # ZH(4,5)
  5  1     8.92995006E-06   # ZH(5,1)
  5  2    -4.37248806E-05   # ZH(5,2)
  5  3    -9.98717157E-01   # ZH(5,3)
  5  4     5.06361556E-02   # ZH(5,4)
  5  5    -1.33863907E-04   # ZH(5,5)
Block PSEUDOSCALARMIX Q=  1.99791750E+03  # ()
  1  1     1.94619746E-01   # ZA(1,1)
  1  2    -9.80878764E-01   # ZA(1,2)
  1  3    -3.82734127E-05   # ZA(1,3)
  1  4     5.12442130E-05   # ZA(1,4)
  1  5    -3.15746171E-05   # ZA(1,5)
  2  1    -9.80878766E-01   # ZA(2,1)
  2  2    -1.94619744E-01   # ZA(2,2)
  2  3    -1.61534800E-05   # ZA(2,3)
  2  4     1.98849735E-05   # ZA(2,4)
  2  5    -1.47221855E-05   # ZA(2,5)
  3  1     8.29347327E-06   # ZA(3,1)
  3  2     3.38245768E-05   # ZA(3,2)
  3  3     1.08026517E-04   # ZA(3,3)
  3  4    -1.31657595E-04   # ZA(3,4)
  3  5    -9.99999985E-01   # ZA(3,5)
  4  1     9.17290364E-06   # ZA(4,1)
  4  2     5.23883326E-05   # ZA(4,2)
  4  3     4.18552261E-02   # ZA(4,3)
  4  4     9.99123677E-01   # ZA(4,4)
  4  5    -1.27018900E-04   # ZA(4,5)
  5  1    -8.78837499E-06   # ZA(5,1)
  5  2    -4.29193545E-05   # ZA(5,2)
  5  3     9.99123679E-01   # ZA(5,3)
  5  4    -4.18552094E-02   # ZA(5,4)
  5  5     1.13440885E-04   # ZA(5,5)
Block CHARGEMIX Q=  1.99791750E+03  # ()
  1  1     1.96015643E-01   # ZP(1,1)
  1  2    -9.80600766E-01   # ZP(1,2)
  1  3    -3.83231927E-05   # ZP(1,3)
  1  4     5.13115258E-05   # ZP(1,4)
  1  5    -3.16151625E-05   # ZP(1,5)
  1  6    -2.78401391E-15   # ZP(1,6)
  1  7     5.68058819E-13   # ZP(1,7)
  1  8    -1.06399029E-11   # ZP(1,8)
  2  1     9.80600769E-01   # ZP(2,1)
  2  2     1.96015641E-01   # ZP(2,2)
  2  3     1.62579883E-05   # ZP(2,3)
  2  4    -2.00243551E-05   # ZP(2,4)
  2  5     1.48088164E-05   # ZP(2,5)
  2  6     5.14615113E-11   # ZP(2,6)
  2  7    -1.12423865E-08   # ZP(2,7)
  2  8     1.88104485E-07   # ZP(2,8)
  3  1     1.04867891E-06   # ZP(3,1)
  3  2     3.56064167E-06   # ZP(3,2)
  3  3     3.90471131E-08   # ZP(3,3)
  3  4    -4.77435307E-08   # ZP(3,4)
  3  5    -1.03937591E-01   # ZP(3,5)
  3  6     6.57951982E-11   # ZP(3,6)
  3  7    -1.69587647E-08   # ZP(3,7)
  3  8    -9.94583821E-01   # ZP(3,8)
  4  1    -7.14188516E-08   # ZP(4,1)
  4  2    -3.44225449E-07   # ZP(4,2)
  4  3    -3.40024291E-09   # ZP(4,3)
  4  4    -6.30556435E-03   # ZP(4,4)
  4  5    -1.21997798E-09   # ZP(4,5)
  4  6    -1.63924203E-09   # ZP(4,6)
  4  7    -9.99980120E-01   # ZP(4,7)
  4  8     1.74796513E-08   # ZP(4,8)
  5  1     3.07580784E-10   # ZP(5,1)
  5  2     1.25338909E-09   # ZP(5,2)
  5  3    -3.04980159E-05   # ZP(5,3)
  5  4    -5.88402811E-12   # ZP(5,4)
  5  5     4.82690739E-12   # ZP(5,5)
  5  6    -1.00000000E+00   # ZP(5,6)
  5  7     1.63941498E-09   # ZP(5,7)
  5  8    -6.78504873E-11   # ZP(5,8)
  6  1     8.24622768E-06   # ZP(6,1)
  6  2     3.97240822E-05   # ZP(6,2)
  6  3    -9.99818484E-01   # ZP(6,3)
  6  4    -1.90520353E-02   # ZP(6,4)
  6  5     4.97110738E-05   # ZP(6,5)
  6  6     3.04924804E-05   # ZP(6,6)
  6  7     1.20139608E-04   # ZP(6,7)
  6  8    -5.23317545E-06   # ZP(6,8)
  7  1     9.73613880E-06   # ZP(7,1)
  7  2     5.50048360E-05   # ZP(7,2)
  7  3    -1.90524087E-02   # ZP(7,3)
  7  4     9.99798606E-01   # ZP(7,4)
  7  5     6.30155156E-05   # ZP(7,5)
  7  6     5.81044518E-07   # ZP(7,6)
  7  7    -6.30441973E-03   # ZP(7,7)
  7  8    -6.63377551E-06   # ZP(7,8)
  8  1    -8.26124109E-06   # ZP(8,1)
  8  2    -3.37226164E-05   # ZP(8,2)
  8  3     5.11824675E-05   # ZP(8,3)
  8  4    -6.23967309E-05   # ZP(8,4)
  8  5     9.94583817E-01   # ZP(8,5)
  8  6    -1.54915453E-09   # ZP(8,6)
  8  7     3.90436224E-07   # ZP(8,7)
  8  8    -1.03937591E-01   # ZP(8,8)
Block UVMIX Q=  1.99791750E+03  # ()
  1  1     0.00000000E+00   # Real(UV(1,1),dp)
  1  2     0.00000000E+00   # Real(UV(1,2),dp)
  1  3    -0.00000000E+00   # Real(UV(1,3),dp)
  1  4     0.00000000E+00   # Real(UV(1,4),dp)
  1  5     0.00000000E+00   # Real(UV(1,5),dp)
  1  6    -0.00000000E+00   # Real(UV(1,6),dp)
  1  7     0.00000000E+00   # Real(UV(1,7),dp)
  2  1    -5.62591023E-01   # Real(UV(2,1),dp)
  2  2     4.88440098E-01   # Real(UV(2,2),dp)
  2  3    -6.67021354E-01   # Real(UV(2,3),dp)
  2  4     1.05185080E-07   # Real(UV(2,4),dp)
  2  5     5.83378307E-08   # Real(UV(2,5),dp)
  2  6    -3.53409207E-04   # Real(UV(2,6),dp)
  2  7    -1.68982480E-10   # Real(UV(2,7),dp)
  3  1     0.00000000E+00   # Real(UV(3,1),dp)
  3  2    -0.00000000E+00   # Real(UV(3,2),dp)
  3  3    -0.00000000E+00   # Real(UV(3,3),dp)
  3  4     0.00000000E+00   # Real(UV(3,4),dp)
  3  5     0.00000000E+00   # Real(UV(3,5),dp)
  3  6     0.00000000E+00   # Real(UV(3,6),dp)
  3  7     0.00000000E+00   # Real(UV(3,7),dp)
  4  1    -1.40407904E-04   # Real(UV(4,1),dp)
  4  2     1.47411039E-04   # Real(UV(4,2),dp)
  4  3    -1.48349360E-04   # Real(UV(4,3),dp)
  4  4    -3.66181078E-02   # Real(UV(4,4),dp)
  4  5    -3.82665426E-02   # Real(UV(4,5),dp)
  4  6     7.07225250E-01   # Real(UV(4,6),dp)
  4  7    -7.05001537E-01   # Real(UV(4,7),dp)
  5  1    -0.00000000E+00   # Real(UV(5,1),dp)
  5  2     0.00000000E+00   # Real(UV(5,2),dp)
  5  3    -0.00000000E+00   # Real(UV(5,3),dp)
  5  4     0.00000000E+00   # Real(UV(5,4),dp)
  5  5     0.00000000E+00   # Real(UV(5,5),dp)
  5  6     0.00000000E+00   # Real(UV(5,6),dp)
  5  7     0.00000000E+00   # Real(UV(5,7),dp)
  6  1     0.00000000E+00   # Real(UV(6,1),dp)
  6  2    -0.00000000E+00   # Real(UV(6,2),dp)
  6  3     0.00000000E+00   # Real(UV(6,3),dp)
  6  4     0.00000000E+00   # Real(UV(6,4),dp)
  6  5    -0.00000000E+00   # Real(UV(6,5),dp)
  6  6    -0.00000000E+00   # Real(UV(6,6),dp)
  6  7    -0.00000000E+00   # Real(UV(6,7),dp)
  7  1     2.68952594E-06   # Real(UV(7,1),dp)
  7  2    -3.25362130E-06   # Real(UV(7,2),dp)
  7  3     2.49718825E-06   # Real(UV(7,3),dp)
  7  4     6.92619127E-04   # Real(UV(7,4),dp)
  7  5    -9.99086220E-01   # Real(UV(7,5),dp)
  7  6    -1.36561203E-02   # Real(UV(7,6),dp)
  7  7     4.04938955E-02   # Real(UV(7,7),dp)
Block IMUVMIX Q=  1.99791750E+03  # ()
  1  1     8.26668547E-01   # Aimag(UV(1,1))
  1  2     3.42609933E-01   # Aimag(UV(1,2))
  1  3    -4.46360333E-01   # Aimag(UV(1,3))
  1  4     1.06516184E-08   # Aimag(UV(1,4))
  1  5     6.54851663E-09   # Aimag(UV(1,5))
  1  6    -9.19529024E-07   # Aimag(UV(1,6))
  1  7     5.29064038E-12   # Aimag(UV(1,7))
  2  1     0.00000000E+00   # Aimag(UV(2,1))
  2  2     0.00000000E+00   # Aimag(UV(2,2))
  2  3     0.00000000E+00   # Aimag(UV(2,3))
  2  4     0.00000000E+00   # Aimag(UV(2,4))
  2  5     0.00000000E+00   # Aimag(UV(2,5))
  2  6     0.00000000E+00   # Aimag(UV(2,6))
  2  7     0.00000000E+00   # Aimag(UV(2,7))
  3  1     1.05078488E-02   # Aimag(UV(3,1))
  3  2    -8.02523932E-01   # Aimag(UV(3,2))
  3  3    -5.96527386E-01   # Aimag(UV(3,3))
  3  4     8.79724753E-07   # Aimag(UV(3,4))
  3  5     5.45794040E-07   # Aimag(UV(3,5))
  3  6     4.43074544E-05   # Aimag(UV(3,6))
  3  7     6.17656985E-10   # Aimag(UV(3,7))
  4  1     0.00000000E+00   # Aimag(UV(4,1))
  4  2     0.00000000E+00   # Aimag(UV(4,2))
  4  3     0.00000000E+00   # Aimag(UV(4,3))
  4  4     0.00000000E+00   # Aimag(UV(4,4))
  4  5     0.00000000E+00   # Aimag(UV(4,5))
  4  6     0.00000000E+00   # Aimag(UV(4,6))
  4  7     0.00000000E+00   # Aimag(UV(4,7))
  5  1    -1.40282061E-04   # Aimag(UV(5,1))
  5  2     1.47373012E-04   # Aimag(UV(5,2))
  5  3    -1.48141010E-04   # Aimag(UV(5,3))
  5  4     6.25987983E-02   # Aimag(UV(5,4))
  5  5     1.89416657E-02   # Aimag(UV(5,5))
  5  6     7.06617425E-01   # Aimag(UV(5,6))
  5  7     7.04566786E-01   # Aimag(UV(5,7))
  6  1     3.68899547E-06   # Aimag(UV(6,1))
  6  2    -3.18261366E-06   # Aimag(UV(6,2))
  6  3     4.45086291E-06   # Aimag(UV(6,3))
  6  4     9.97366545E-01   # Aimag(UV(6,4))
  6  5    -1.89999121E-03   # Aimag(UV(6,5))
  6  6    -1.83750826E-02   # Aimag(UV(6,6))
  6  7    -7.01335970E-02   # Aimag(UV(6,7))
  7  1     0.00000000E+00   # Aimag(UV(7,1))
  7  2     0.00000000E+00   # Aimag(UV(7,2))
  7  3     0.00000000E+00   # Aimag(UV(7,3))
  7  4     0.00000000E+00   # Aimag(UV(7,4))
  7  5     0.00000000E+00   # Aimag(UV(7,5))
  7  6     0.00000000E+00   # Aimag(UV(7,6))
  7  7     0.00000000E+00   # Aimag(UV(7,7))
Block UELMIX Q=  1.99791750E+03  # ()
  1  1    -9.99999980E-01   # Real(ZEL(1,1),dp)
  1  2    -4.33123467E-08   # Real(ZEL(1,2),dp)
  1  3     4.33957550E-08   # Real(ZEL(1,3),dp)
  1  4     3.07856839E-08   # Real(ZEL(1,4),dp)
  1  5    -1.98542455E-04   # Real(ZEL(1,5),dp)
  2  1    -1.95581836E-09   # Real(ZEL(2,1),dp)
  2  2     9.99999978E-01   # Real(ZEL(2,2),dp)
  2  3     4.56974432E-08   # Real(ZEL(2,3),dp)
  2  4    -5.77817457E-07   # Real(ZEL(2,4),dp)
  2  5    -2.08300755E-04   # Real(ZEL(2,5),dp)
  3  1     1.72381482E-09   # Real(ZEL(3,1),dp)
  3  2    -1.97765838E-09   # Real(ZEL(3,2),dp)
  3  3     9.99999978E-01   # Real(ZEL(3,3),dp)
  3  4    -5.21372769E-07   # Real(ZEL(3,4),dp)
  3  5     2.09889232E-04   # Real(ZEL(3,5),dp)
  4  1     1.98506054E-04   # Real(ZEL(4,1),dp)
  4  2    -2.08250778E-04   # Real(ZEL(4,2),dp)
  4  3     2.09860169E-04   # Real(ZEL(4,3),dp)
  4  4     1.93060177E-02   # Real(ZEL(4,4),dp)
  4  5    -9.99813558E-01   # Real(ZEL(4,5),dp)
  5  1    -3.80228438E-06   # Real(ZEL(5,1),dp)
  5  2     4.59916783E-06   # Real(ZEL(5,2),dp)
  5  3    -3.53084943E-06   # Real(ZEL(5,3),dp)
  5  4     9.99813621E-01   # Real(ZEL(5,4),dp)
  5  5     1.93060165E-02   # Real(ZEL(5,5),dp)
Block UERMIX Q=  1.99791750E+03  # ()
  1  1    -1.00000000E+00   # Real(ZER(1,1),dp)
  1  2    -2.18266760E-10   # Real(ZER(1,2),dp)
  1  3     1.30068594E-11   # Real(ZER(1,3),dp)
  1  4     3.09078766E-13   # Real(ZER(1,4),dp)
  1  5    -5.46404803E-12   # Real(ZER(1,5),dp)
  2  1    -2.18266760E-10   # Real(ZER(2,1),dp)
  2  2     1.00000000E+00   # Real(ZER(2,2),dp)
  2  3     2.84041313E-09   # Real(ZER(2,3),dp)
  2  4    -9.74287035E-10   # Real(ZER(2,4),dp)
  2  5     1.73958576E-08   # Real(ZER(2,5),dp)
  3  1     1.30068586E-11   # Real(ZER(3,1),dp)
  3  2    -2.84041778E-09   # Real(ZER(3,2),dp)
  3  3     1.00000000E+00   # Real(ZER(3,3),dp)
  3  4    -1.51713416E-08   # Real(ZER(3,4),dp)
  3  5     2.70522520E-07   # Real(ZER(3,5),dp)
  4  1     5.47278058E-12   # Real(ZER(4,1),dp)
  4  2     1.74231023E-08   # Real(ZER(4,2),dp)
  4  3     2.70947373E-07   # Real(ZER(4,3),dp)
  4  4     5.72951181E-02   # Real(ZER(4,4),dp)
  4  5    -9.98357285E-01   # Real(ZER(4,5),dp)
  5  1    -4.49223854E-15   # Real(ZER(5,1),dp)
  5  2    -2.40111546E-11   # Real(ZER(5,2),dp)
  5  3    -3.53200316E-10   # Real(ZER(5,3),dp)
  5  4     9.98357285E-01   # Real(ZER(5,4),dp)
  5  5     5.72951181E-02   # Real(ZER(5,5),dp)
Block UDLMIX Q=  1.99791750E+03  # ()
  1  1     1.00000000E+00   # Real(ZDL(1,1),dp)
  1  2     0.00000000E+00   # Real(ZDL(1,2),dp)
  1  3     0.00000000E+00   # Real(ZDL(1,3),dp)
  2  1     0.00000000E+00   # Real(ZDL(2,1),dp)
  2  2     1.00000000E+00   # Real(ZDL(2,2),dp)
  2  3     0.00000000E+00   # Real(ZDL(2,3),dp)
  3  1     0.00000000E+00   # Real(ZDL(3,1),dp)
  3  2     0.00000000E+00   # Real(ZDL(3,2),dp)
  3  3     1.00000000E+00   # Real(ZDL(3,3),dp)
Block UDRMIX Q=  1.99791750E+03  # ()
  1  1     1.00000000E+00   # Real(ZDR(1,1),dp)
  1  2     0.00000000E+00   # Real(ZDR(1,2),dp)
  1  3     0.00000000E+00   # Real(ZDR(1,3),dp)
  2  1     0.00000000E+00   # Real(ZDR(2,1),dp)
  2  2     1.00000000E+00   # Real(ZDR(2,2),dp)
  2  3     0.00000000E+00   # Real(ZDR(2,3),dp)
  3  1     0.00000000E+00   # Real(ZDR(3,1),dp)
  3  2     0.00000000E+00   # Real(ZDR(3,2),dp)
  3  3     1.00000000E+00   # Real(ZDR(3,3),dp)
Block UULMIX Q=  1.99791750E+03  # ()
  1  1     1.00000000E+00   # Real(ZUL(1,1),dp)
  1  2     0.00000000E+00   # Real(ZUL(1,2),dp)
  1  3     0.00000000E+00   # Real(ZUL(1,3),dp)
  2  1     0.00000000E+00   # Real(ZUL(2,1),dp)
  2  2     1.00000000E+00   # Real(ZUL(2,2),dp)
  2  3     0.00000000E+00   # Real(ZUL(2,3),dp)
  3  1     0.00000000E+00   # Real(ZUL(3,1),dp)
  3  2     0.00000000E+00   # Real(ZUL(3,2),dp)
  3  3     1.00000000E+00   # Real(ZUL(3,3),dp)
Block UURMIX Q=  1.99791750E+03  # ()
  1  1     1.00000000E+00   # Real(ZUR(1,1),dp)
  1  2     0.00000000E+00   # Real(ZUR(1,2),dp)
  1  3     0.00000000E+00   # Real(ZUR(1,3),dp)
  2  1     0.00000000E+00   # Real(ZUR(2,1),dp)
  2  2     1.00000000E+00   # Real(ZUR(2,2),dp)
  2  3     0.00000000E+00   # Real(ZUR(2,3),dp)
  3  1     0.00000000E+00   # Real(ZUR(3,1),dp)
  3  2     0.00000000E+00   # Real(ZUR(3,2),dp)
  3  3     1.00000000E+00   # Real(ZUR(3,3),dp)
Block SPheno # SPheno internal parameters 
         1    -1.00000000E+00  # ErrorLevel
         2     0.00000000E+00  # SPA_conventions
        11     1.00000000E+00  # Branching ratios
        13     1.00000000E+00  # 3 Body decays
        31     1.99791750E+03  # GUT scale
        33     1.99791750E+03  # Renormalization scale
        34     1.00000000E-04  # Precision
        35     4.00000000E+01  # Iterations
        38     2.00000000E+00  # RGE level
        40     7.29735257E-03  # Alpha
        41     2.49520000E+00  # Gamma_Z
        42     2.06000000E+00  # Gamma_W
        50     1.00000000E+00  # Rotate negative fermion masses
        51     0.00000000E+00  # Switch to SCKM matrix
        52     0.00000000E+00  # Ignore negative masses
        53     0.00000000E+00  # Ignore negative masses at MZ
        55     1.00000000E+00  # Calculate one loop masses
        56     1.00000000E+00  # Calculate two-loop Higgs masses
        57     0.00000000E+00  # Calculate low energy
        60     1.00000000E+00  # Include kinetic mixing
        65     1.00000000E+00  # Solution of tadpole equation
         8     3.00000000E+00  # Two-Loop Method: diagrammatic 
         9     1.00000000E+00  # Gauge-less limit
       400     1.00000000E-01  # Step-size for purely-numerical methode for 2-loop calculation
       401     1.00000000E-03  # Step-size for semi-analytical methode for 2-loop calculation
       410     0.00000000E+00  # indicative error in numerical derivation
Block HiggsLHC7 # Higgs production cross section at LHC7 [pb] 
  1        25        1.59990804E+01 # Gluon fusion 
  2        25        1.23981253E+00 # Vector boson fusion 
  3        25        5.86507416E-01 # W-H production 
  4        25        3.38811670E-01 # Z-H production 
  5        25        9.17303582E-02 # t-t-H production 
Block HiggsLHC8 # Higgs production cross section at LHC8 [pb] 
  1        25        2.02472705E+01 # Gluon fusion 
  2        25        1.59671390E+00 # Vector boson fusion 
  3        25        7.45887941E-01 # W-H production 
  4        25        4.22838099E-01 # Z-H production 
  5        25        1.38655640E-01 # t-t-H production 
Block EFFHIGGSCOUPLINGS # values of loop-induced couplings 
        25           22           22     0.18342613E-04 # H-Photon-Photon 
        25           21           21     0.58945738E-04 # H-Gluon-Gluon 
        25           22           23     0.00000000E+00 # H-Photon-Z (not yet calculated by SPheno) 
        35           22           22     0.71927400E-04 # H-Photon-Photon 
        35           21           21     0.79653415E-05 # H-Gluon-Gluon 
        35           22           23     0.00000000E+00 # H-Photon-Z (not yet calculated by SPheno) 
   1000012           22           22     0.59889525E-09 # H-Photon-Photon 
   1000012           21           21     0.54108392E-09 # H-Gluon-Gluon 
   1000012           22           23     0.00000000E+00 # H-Photon-Z (not yet calculated by SPheno) 
   1000014           22           22     0.78478545E-09 # H-Photon-Photon 
   1000014           21           21     0.83342223E-09 # H-Gluon-Gluon 
   1000014           22           23     0.00000000E+00 # H-Photon-Z (not yet calculated by SPheno) 
   1000016           22           22     0.70200732E-09 # H-Photon-Photon 
   1000016           21           21     0.69461019E-09 # H-Gluon-Gluon 
   1000016           22           23     0.00000000E+00 # H-Photon-Z (not yet calculated by SPheno) 
        36           22           22     0.15265486E-05 # A-Photon-Photon 
        36           21           21     0.11225753E-04 # A-Gluon-Gluon 
        36           22           23     0.00000000E+00 # A-Photon-Z (not yet calculated by SPheno) 
   1000017           22           22     0.10860957E-09 # A-Photon-Photon 
   1000017           21           21     0.72681478E-09 # A-Gluon-Gluon 
   1000017           22           23     0.00000000E+00 # A-Photon-Z (not yet calculated by SPheno) 
   1000018           22           22     0.15343758E-09 # A-Photon-Photon 
   1000018           21           21     0.11253064E-08 # A-Gluon-Gluon 
   1000018           22           23     0.00000000E+00 # A-Photon-Z (not yet calculated by SPheno) 
   1000019           22           22     0.13021979E-09 # A-Photon-Photon 
   1000019           21           21     0.92205130E-09 # A-Gluon-Gluon 
   1000019           22           23     0.00000000E+00 # A-Photon-Z (not yet calculated by SPheno) 
Block SPhenoLowEnergy # low energy observables 
      20    0.00000000E+00  # (g-2)_e
      21    0.00000000E+00  # (g-2)_mu
      22    0.00000000E+00  # (g-2)_tau
      23    0.00000000E+00  # EDM(e)
      24    0.00000000E+00  # EDM(mu)
      25    0.00000000E+00  # EDM(tau)
      39    0.00000000E+00  # delta(rho)
Block FlavorKitQFV # quark flavor violating observables 
     200    0.00000000E+00  # BR(B->X_s gamma)
     201    0.00000000E+00  # BR(B->X_s gamma)/BR(B->X_s gamma)_SM
     300    0.00000000E+00  # BR(D->mu nu)
     301    0.00000000E+00  # BR(D->mu nu)/BR(D->mu nu)_SM
     400    0.00000000E+00  # BR(Ds->mu nu)
     401    0.00000000E+00  # BR(Ds->mu nu)/BR(Ds->mu nu)_SM
     402    0.00000000E+00  # BR(Ds->tau nu)
     403    0.00000000E+00  # BR(Ds->tau nu)/BR(Ds->tau nu)_SM
     500    0.00000000E+00  # BR(B->mu nu)
     501    0.00000000E+00  # BR(B->mu nu)/BR(B->mu nu)_SM
     502    0.00000000E+00  # BR(B->tau nu)
     503    0.00000000E+00  # BR(B->tau nu)/BR(B->tau nu)_SM
     600    0.00000000E+00  # BR(K->mu nu)
     601    0.00000000E+00  # BR(K->mu nu)/BR(K->mu nu)_SM
     602    0.00000000E+00  # R_K = BR(K->e nu)/(K->mu nu)
     603    0.00000000E+00  # R_K^SM = BR(K->e nu)_SM/(K->mu nu)_SM
    1900    0.00000000E+00  # Delta(M_Bs)
    1901    0.00000000E+00  # Delta(M_Bs)/Delta(M_Bs)_SM
    1902    0.00000000E+00  # Delta(M_Bd)
    1903    0.00000000E+00  # Delta(M_Bd)/Delta(M_Bd)_SM
    4000    0.00000000E+00  # BR(B^0_d->e e)
    4001    0.00000000E+00  # BR(B^0_d->e e)/BR(B^0_d->e e)_SM
    4002    0.00000000E+00  # BR(B^0_s->e e)
    4003    0.00000000E+00  # BR(B^0_s->e e)/BR(B^0_s->e e)_SM
    4004    0.00000000E+00  # BR(B^0_d->mu mu)
    4005    0.00000000E+00  # BR(B^0_d->mu mu)/BR(B^0_d->mu mu)_SM
    4006    0.00000000E+00  # BR(B^0_s->mu mu)
    4007    0.00000000E+00  # BR(B^0_s->mu mu)/BR(B^0_s->mu mu)_SM
    4008    0.00000000E+00  # BR(B^0_d->tau tau)
    4009    0.00000000E+00  # BR(B^0_d->tau tau)/BR(B^0_d->tau tau)_SM
    4010    0.00000000E+00  # BR(B^0_s->tau tau)
    4011    0.00000000E+00  # BR(B^0_s->tau tau)/BR(B^0_s->tau tau)_SM
    5000    0.00000000E+00  # BR(B-> s e e)
    5001    0.00000000E+00  # BR(B-> s e e)/BR(B-> s e e)_SM
    5002    0.00000000E+00  # BR(B-> s mu mu)
    5003    0.00000000E+00  # BR(B-> s mu mu)/BR(B-> s mu mu)_SM
    6000    0.00000000E+00  # BR(B -> K mu mu)
    6001    0.00000000E+00  # BR(B -> K mu mu)/BR(B -> K mu mu)_SM
    7000    0.00000000E+00  # BR(B->s nu nu)
    7001    0.00000000E+00  # BR(B->s nu nu)/BR(B->s nu nu)_SM
    7002    0.00000000E+00  # BR(B->D nu nu)
    7003    0.00000000E+00  # BR(B->D nu nu)/BR(B->D nu nu)_SM
    8000    0.00000000E+00  # BR(K^+ -> pi^+ nu nu)
    8001    0.00000000E+00  # BR(K^+ -> pi^+ nu nu)/BR(K^+ -> pi^+ nu nu)_SM
    8002    0.00000000E+00  # BR(K_L -> pi^0 nu nu)
    8003    0.00000000E+00  # BR(K_L -> pi^0 nu nu)/BR(K_L -> pi^0 nu nu)_SM
    9100    0.00000000E+00  # Delta(M_K)
    9102    0.00000000E+00  # Delta(M_K)/Delta(M_K)_SM
    9103    0.00000000E+00  # epsilon_K
    9104    0.00000000E+00  # epsilon_K/epsilon_K^SM
Block FlavorKitLFV # lepton flavor violating observables 
     701    0.00000000E+00  # BR(mu->e gamma)
     702    0.00000000E+00  # BR(tau->e gamma)
     703    0.00000000E+00  # BR(tau->mu gamma)
     800    0.00000000E+00  # CR(mu-e, Al)
     801    0.00000000E+00  # CR(mu-e, Ti)
     802    0.00000000E+00  # CR(mu-e, Sr)
     803    0.00000000E+00  # CR(mu-e, Sb)
     804    0.00000000E+00  # CR(mu-e, Au)
     805    0.00000000E+00  # CR(mu-e, Pb)
     901    0.00000000E+00  # BR(mu->3e)
     902    0.00000000E+00  # BR(tau->3e)
     903    0.00000000E+00  # BR(tau->3mu)
     904    0.00000000E+00  # BR(tau- -> e- mu+ mu-)
     905    0.00000000E+00  # BR(tau- -> mu- e+ e-)
     906    0.00000000E+00  # BR(tau- -> e+ mu- mu-)
     907    0.00000000E+00  # BR(tau- -> mu+ e- e-)
    1001    0.00000000E+00  # BR(Z->e mu)
    1002    0.00000000E+00  # BR(Z->e tau)
    1003    0.00000000E+00  # BR(Z->mu tau)
    1101    0.00000000E+00  # BR(h->e mu)
    1102    0.00000000E+00  # BR(h->e tau)
    1103    0.00000000E+00  # BR(h->mu tau)
    2001    0.00000000E+00  # BR(tau->e pi)
    2002    0.00000000E+00  # BR(tau->e eta)
    2003    0.00000000E+00  # BR(tau->e eta')
    2004    0.00000000E+00  # BR(tau->mu pi)
    2005    0.00000000E+00  # BR(tau->mu eta)
    2006    0.00000000E+00  # BR(tau->mu eta')
Block FWCOEF Q=  1.60000000E+02  # Wilson coefficients at scale Q 
      030 4422   00   0     0.00000000E+00    # coeffC7sm
      030 4422   00   2     0.00000000E+00    # coeffC7
      030 4322   00   2     0.00000000E+00    # coeffC7p
      030 6421   00   0     0.00000000E+00    # coeffC8sm
      030 6421   00   2     0.00000000E+00    # coeffC8
      030 6321   00   2     0.00000000E+00    # coeffC8p
  0305111 4133   00   0     0.00000000E+00    # coeffC9eeSM
  0305111 4133   00   2     0.00000000E+00    # coeffC9ee
  0305111 4233   00   2     0.00000000E+00    # coeffC9Pee
  0305111 4137   00   0     0.00000000E+00    # coeffC10eeSM
  0305111 4137   00   2     0.00000000E+00    # coeffC10ee
  0305111 4237   00   2     0.00000000E+00    # coeffC10Pee
  0305131 4133   00   0     0.00000000E+00    # coeffC9mumuSM
  0305131 4133   00   2     0.00000000E+00    # coeffC9mumu
  0305131 4233   00   2     0.00000000E+00    # coeffC9Pmumu
  0305131 4137   00   0     0.00000000E+00    # coeffC10mumuSM
  0305131 4137   00   2     0.00000000E+00    # coeffC10mumu
  0305131 4237   00   2     0.00000000E+00    # coeffC10Pmumu
  0305121 4137   00   0     0.00000000E+00    # coeffC11nu1nu1SM
  0305121 4137   00   2     0.00000000E+00    # coeffC11nu1nu1
  0305121 4237   00   2     0.00000000E+00    # coeffC11Pnu1nu1
  0305141 4137   00   0     0.00000000E+00    # coeffC11nu2nu2SM
  0305141 4137   00   2     0.00000000E+00    # coeffC11nu2nu2
  0305141 4237   00   2     0.00000000E+00    # coeffC11Pnu2nu2
  0305161 4137   00   0     0.00000000E+00    # coeffC11nu3nu3SM
  0305161 4137   00   2     0.00000000E+00    # coeffC11nu3nu3
  0305161 4237   00   2     0.00000000E+00    # coeffC11Pnu3nu3
Block IMFWCOEF Q=  1.60000000E+02  # Im(Wilson coefficients) at scale Q 
      030 4422   00   0     0.00000000E+00    # coeffC7sm
      030 4422   00   2     0.00000000E+00    # coeffC7
      030 4322   00   2     0.00000000E+00    # coeffC7p
      030 6421   00   0     0.00000000E+00    # coeffC8sm
      030 6421   00   2     0.00000000E+00    # coeffC8
      030 6321   00   2     0.00000000E+00    # coeffC8p
  0305111 4133   00   0     0.00000000E+00    # coeffC9eeSM
  0305111 4133   00   2     0.00000000E+00    # coeffC9ee
  0305111 4233   00   2     0.00000000E+00    # coeffC9Pee
  0305111 4137   00   0     0.00000000E+00    # coeffC10eeSM
  0305111 4137   00   2     0.00000000E+00    # coeffC10ee
  0305111 4237   00   2     0.00000000E+00    # coeffC10Pee
  0305131 4133   00   0     0.00000000E+00    # coeffC9mumuSM
  0305131 4133   00   2     0.00000000E+00    # coeffC9mumu
  0305131 4233   00   2     0.00000000E+00    # coeffC9Pmumu
  0305131 4137   00   0     0.00000000E+00    # coeffC10mumuSM
  0305131 4137   00   2     0.00000000E+00    # coeffC10mumu
  0305131 4237   00   2     0.00000000E+00    # coeffC10Pmumu
  0305121 4137   00   0     0.00000000E+00    # coeffC11nu1nu1SM
  0305121 4137   00   2     0.00000000E+00    # coeffC11nu1nu1
  0305121 4237   00   2     0.00000000E+00    # coeffC11Pnu1nu1
  0305141 4137   00   0     0.00000000E+00    # coeffC11nu2nu2SM
  0305141 4137   00   2     0.00000000E+00    # coeffC11nu2nu2
  0305141 4237   00   2     0.00000000E+00    # coeffC11Pnu2nu2
  0305161 4137   00   0     0.00000000E+00    # coeffC11nu3nu3SM
  0305161 4137   00   2     0.00000000E+00    # coeffC11nu3nu3
  0305161 4237   00   2     0.00000000E+00    # coeffC11Pnu3nu3
DECAY   1000001     3.14397532E+01   # Sd_1
#    BR                NDA      ID1      ID2
     8.86863832E-01    2            6   -1000024   # BR(Sd_1 -> Fu_3 Cha_4 )
     3.01367784E-03    2            5    1000022   # BR(Sd_1 -> Fd_3 Chi_4 )
     2.77438651E-03    2            5    1000023   # BR(Sd_1 -> Fd_3 Chi_5 )
     7.57500235E-03    2            5    1000025   # BR(Sd_1 -> Fd_3 Chi_6 )
     3.67900037E-04    2            5    1000035   # BR(Sd_1 -> Fd_3 Chi_7 )
     9.94052002E-02    2      1000002        -24   # BR(Sd_1 -> Su_1 VWm )
DECAY   1000003     1.34476062E+00   # Sd_2
#    BR                NDA      ID1      ID2
     1.56808536E-01    2            6   -1000024   # BR(Sd_2 -> Fu_3 Cha_4 )
     6.51111783E-02    2            5    1000022   # BR(Sd_2 -> Fd_3 Chi_4 )
     6.72279402E-02    2            5    1000023   # BR(Sd_2 -> Fd_3 Chi_5 )
     7.05224909E-01    2            5    1000025   # BR(Sd_2 -> Fd_3 Chi_6 )
     5.59547240E-03    2      1000002        -24   # BR(Sd_2 -> Su_1 VWm )
DECAY   1000005     9.54960643E-01   # Sd_3
#    BR                NDA      ID1      ID2
     1.66498005E-03    2            3    1000022   # BR(Sd_3 -> Fd_2 Chi_4 )
     4.79845207E-03    2            3    1000023   # BR(Sd_3 -> Fd_2 Chi_5 )
     9.93467672E-01    2            3    1000025   # BR(Sd_3 -> Fd_2 Chi_6 )
DECAY   2000001     9.54830774E-01   # Sd_4
#    BR                NDA      ID1      ID2
     1.63091837E-03    2            1    1000022   # BR(Sd_4 -> Fd_1 Chi_4 )
     4.76490863E-03    2            1    1000023   # BR(Sd_4 -> Fd_1 Chi_5 )
     9.93603980E-01    2            1    1000025   # BR(Sd_4 -> Fd_1 Chi_6 )
DECAY   2000003     4.03955952E-01   # Sd_5
#    BR                NDA      ID1      ID2
     1.59413436E-02    2            4   -1000024   # BR(Sd_5 -> Fu_2 Cha_4 )
     2.37140198E-01    2            4   -1000037   # BR(Sd_5 -> Fu_2 Cha_5 )
     1.97085804E-02    2            3    1000022   # BR(Sd_5 -> Fd_2 Chi_4 )
     1.06894754E-03    2            3    1000023   # BR(Sd_5 -> Fd_2 Chi_5 )
     6.07062977E-01    2            3    1000025   # BR(Sd_5 -> Fd_2 Chi_6 )
     1.19077954E-01    2            3    1000035   # BR(Sd_5 -> Fd_2 Chi_7 )
DECAY   2000005     4.03398807E-01   # Sd_6
#    BR                NDA      ID1      ID2
     1.47114819E-02    2            2   -1000024   # BR(Sd_6 -> Fu_1 Cha_4 )
     2.37498144E-01    2            2   -1000037   # BR(Sd_6 -> Fu_1 Cha_5 )
     1.96567321E-02    2            1    1000022   # BR(Sd_6 -> Fd_1 Chi_4 )
     9.91409479E-04    2            1    1000023   # BR(Sd_6 -> Fd_1 Chi_5 )
     6.07898815E-01    2            1    1000025   # BR(Sd_6 -> Fd_1 Chi_6 )
     1.19243417E-01    2            1    1000035   # BR(Sd_6 -> Fd_1 Chi_7 )
DECAY   1000002     4.51503718E+01   # Su_1
#    BR                NDA      ID1      ID2
     2.79302257E-01    2            6    1000022   # BR(Su_1 -> Fu_3 Chi_4 )
     2.88484340E-01    2            6    1000023   # BR(Su_1 -> Fu_3 Chi_5 )
     5.65288379E-02    2            6    1000025   # BR(Su_1 -> Fu_3 Chi_6 )
     3.75684565E-01    2      1000024          5   # BR(Su_1 -> Cha_4^* Fd_3 )
DECAY   1000004     3.82052625E+00   # Su_2
#    BR                NDA      ID1      ID2
     1.69653806E-03    2            4    1000022   # BR(Su_2 -> Fu_2 Chi_4 )
     4.82818169E-03    2            4    1000023   # BR(Su_2 -> Fu_2 Chi_5 )
     9.93340411E-01    2            4    1000025   # BR(Su_2 -> Fu_2 Chi_6 )
     1.34845651E-04    2      1000024          3   # BR(Su_2 -> Cha_4^* Fd_2 )
DECAY   1000006     3.81951295E+00   # Su_3
#    BR                NDA      ID1      ID2
     1.63080125E-03    2            2    1000022   # BR(Su_3 -> Fu_1 Chi_4 )
     4.76474930E-03    2            2    1000023   # BR(Su_3 -> Fu_1 Chi_5 )
     9.93604447E-01    2            2    1000025   # BR(Su_3 -> Fu_1 Chi_6 )
DECAY   2000002     4.50354227E-01   # Su_4
#    BR                NDA      ID1      ID2
     3.73062289E-02    2            4    1000022   # BR(Su_4 -> Fu_2 Chi_4 )
     1.76601529E-02    2            4    1000023   # BR(Su_4 -> Fu_2 Chi_5 )
     5.22608278E-01    2            4    1000025   # BR(Su_4 -> Fu_2 Chi_6 )
     1.03090259E-01    2            4    1000035   # BR(Su_4 -> Fu_2 Chi_7 )
     1.14475042E-01    2      1000024          3   # BR(Su_4 -> Cha_4^* Fd_2 )
     2.04860038E-01    2      1000037          3   # BR(Su_4 -> Cha_5^* Fd_2 )
DECAY   2000004     4.49802080E-01   # Su_5
#    BR                NDA      ID1      ID2
     3.67967806E-02    2            2    1000022   # BR(Su_5 -> Fu_1 Chi_4 )
     1.71156443E-02    2            2    1000023   # BR(Su_5 -> Fu_1 Chi_5 )
     5.23243483E-01    2            2    1000025   # BR(Su_5 -> Fu_1 Chi_6 )
     1.03230219E-01    2            2    1000035   # BR(Su_5 -> Fu_1 Chi_7 )
     1.14500997E-01    2      1000024          1   # BR(Su_5 -> Cha_4^* Fd_1 )
     2.05112876E-01    2      1000037          1   # BR(Su_5 -> Cha_5^* Fd_1 )
DECAY   2000006     4.74046406E+01   # Su_6
#    BR                NDA      ID1      ID2
     3.11926311E-01    2            6    1000022   # BR(Su_6 -> Fu_3 Chi_4 )
     3.04986224E-01    2            6    1000023   # BR(Su_6 -> Fu_3 Chi_5 )
     2.91444092E-02    2            6    1000025   # BR(Su_6 -> Fu_3 Chi_6 )
     2.25579808E-01    2      1000024          5   # BR(Su_6 -> Cha_4^* Fd_3 )
     3.44721614E-03    2      1000037          5   # BR(Su_6 -> Cha_5^* Fd_3 )
     5.65371286E-03    2      1000002         25   # BR(Su_6 -> Su_1 hh_1 )
     5.15362263E-03    2      1000001         24   # BR(Su_6 -> Sd_1 VWm^* )
     1.14108696E-01    2      1000002         23   # BR(Su_6 -> Su_1 VZ )
DECAY        25     2.53610718E-03   # hh_1
#    BR                NDA      ID1      ID2
     1.20850961E-03    2           22         22   # BR(hh_1 -> VP VP )
     1.30726372E-01    2           21         21   # BR(hh_1 -> VG VG )
     2.13599553E-02    2           23         23   # BR(hh_1 -> VZ VZ )
     2.07723269E-01    2           24        -24   # BR(hh_1 -> VWm^* VWm_virt )
     3.38818769E-04    2          -13         13   # BR(hh_1 -> Cha_2^* Cha_2 )
     9.56867866E-02    2          -15         15   # BR(hh_1 -> Cha_3^* Cha_3 )
     1.89394123E-04    2           -3          3   # BR(hh_1 -> Fd_2^* Fd_2 )
     5.07501487E-01    2           -5          5   # BR(hh_1 -> Fd_3^* Fd_3 )
     3.52647380E-02    2           -4          4   # BR(hh_1 -> Fu_2^* Fu_2 )
DECAY        35     1.81402532E+00   # hh_2
#    BR                NDA      ID1      ID2
     1.42529364E-02    2           22         22   # BR(hh_2 -> VP VP )
     1.79257887E-03    2           21         21   # BR(hh_2 -> VG VG )
     2.61625548E-02    2          -15         15   # BR(hh_2 -> Cha_3^* Cha_3 )
     5.86661765E-03    2      1000024   -1000024   # BR(hh_2 -> Cha_4^* Cha_4 )
     2.03312875E-04    2      1000022    1000022   # BR(hh_2 -> Chi_4 Chi_4 )
     9.95306520E-04    2      1000022    1000023   # BR(hh_2 -> Chi_4 Chi_5 )
     4.32788746E-04    2      1000023    1000023   # BR(hh_2 -> Chi_5 Chi_5 )
     1.39549137E-01    2           -5          5   # BR(hh_2 -> Fd_3^* Fd_3 )
     7.99080302E-01    2           -6          6   # BR(hh_2 -> Fu_3^* Fu_3 )
     6.64470986E-03    2           25         25   # BR(hh_2 -> hh_1 hh_1 )
     3.18984925E-03    2          -24         24   # BR(hh_2 -> VWm VWm^* )
     1.66856088E-03    2           23         23   # BR(hh_2 -> VZ VZ )
DECAY   1000012     2.20707878E+00   # hh_3
#    BR                NDA      ID1      ID2
     3.26932242E-02    2          -15   -1000024   # BR(hh_3 -> Cha_3^* Cha_4 )
     3.26932242E-02    2      1000024         15   # BR(hh_3 -> Cha_4^* Cha_3 )
     2.11548693E-04    2           12    1000022   # BR(hh_3 -> Chi_1 Chi_4 )
     1.97963745E-04    2           12    1000023   # BR(hh_3 -> Chi_1 Chi_5 )
     1.85826603E-01    2           12    1000025   # BR(hh_3 -> Chi_1 Chi_6 )
     4.72086112E-04    2           14    1000022   # BR(hh_3 -> Chi_2 Chi_4 )
     4.41770325E-04    2           14    1000023   # BR(hh_3 -> Chi_2 Chi_5 )
     4.14685419E-01    2           14    1000025   # BR(hh_3 -> Chi_2 Chi_6 )
     3.77830410E-04    2           16    1000022   # BR(hh_3 -> Chi_3 Chi_4 )
     3.53567408E-04    2           16    1000023   # BR(hh_3 -> Chi_3 Chi_5 )
     3.31890216E-01    2           16    1000025   # BR(hh_3 -> Chi_3 Chi_6 )
DECAY   1000014     2.11271942E+00   # hh_4
#    BR                NDA      ID1      ID2
     1.17619779E-02    2          -13   -1000024   # BR(hh_4 -> Cha_2^* Cha_4 )
     1.17619779E-02    2      1000024         13   # BR(hh_4 -> Cha_4^* Cha_2 )
     1.63579614E-04    2           12    1000022   # BR(hh_4 -> Chi_1 Chi_4 )
     1.53075081E-04    2           12    1000023   # BR(hh_4 -> Chi_1 Chi_5 )
     1.43691890E-01    2           12    1000025   # BR(hh_4 -> Chi_1 Chi_6 )
     2.34027868E-04    2           14    1000022   # BR(hh_4 -> Chi_2 Chi_4 )
     2.18999386E-04    2           14    1000023   # BR(hh_4 -> Chi_2 Chi_5 )
     2.05575168E-01    2           14    1000025   # BR(hh_4 -> Chi_2 Chi_6 )
     7.11299708E-04    2           16    1000022   # BR(hh_4 -> Chi_3 Chi_4 )
     6.65622435E-04    2           16    1000023   # BR(hh_4 -> Chi_3 Chi_5 )
     6.24821130E-01    2           16    1000025   # BR(hh_4 -> Chi_3 Chi_6 )
DECAY   1000016     2.11238618E+00   # hh_5
#    BR                NDA      ID1      ID2
     1.16846637E-02    2          -11   -1000024   # BR(hh_5 -> Cha_1^* Cha_4 )
     1.16846637E-02    2      1000024         11   # BR(hh_5 -> Cha_4^* Cha_1 )
     7.24438152E-04    2           12    1000022   # BR(hh_5 -> Chi_1 Chi_4 )
     6.77917173E-04    2           12    1000023   # BR(hh_5 -> Chi_1 Chi_5 )
     6.36362254E-01    2           12    1000025   # BR(hh_5 -> Chi_1 Chi_6 )
     3.81753567E-04    2           14    1000022   # BR(hh_5 -> Chi_2 Chi_4 )
     3.57238638E-04    2           14    1000023   # BR(hh_5 -> Chi_2 Chi_5 )
     3.35340649E-01    2           14    1000025   # BR(hh_5 -> Chi_2 Chi_6 )
     2.53909816E-03    2           16    1000025   # BR(hh_5 -> Chi_3 Chi_6 )
DECAY        36     1.89192996E+00   # Ah_2
#    BR                NDA      ID1      ID2
     2.36125433E-03    2           21         21   # BR(Ah_2 -> VG VG )
     2.51261082E-02    2          -15         15   # BR(Ah_2 -> Cha_3^* Cha_3 )
     1.18093107E-02    2      1000024   -1000024   # BR(Ah_2 -> Cha_4^* Cha_4 )
     7.04693030E-04    2      1000022    1000022   # BR(Ah_2 -> Chi_4 Chi_4 )
     5.89961937E-04    2      1000022    1000023   # BR(Ah_2 -> Chi_4 Chi_5 )
     2.94863549E-04    2      1000023    1000023   # BR(Ah_2 -> Chi_5 Chi_5 )
     1.34028451E-01    2           -5          5   # BR(Ah_2 -> Fd_3^* Fd_3 )
     8.19082330E-01    2           -6          6   # BR(Ah_2 -> Fu_3^* Fu_3 )
     5.84292132E-03    2           25         23   # BR(Ah_2 -> hh_1 VZ )
DECAY   1000017     2.20707878E+00   # Ah_3
#    BR                NDA      ID1      ID2
     3.26932242E-02    2          -15   -1000024   # BR(Ah_3 -> Cha_3^* Cha_4 )
     3.26932242E-02    2      1000024         15   # BR(Ah_3 -> Cha_4^* Cha_3 )
     2.11525611E-04    2           12    1000022   # BR(Ah_3 -> Chi_1 Chi_4 )
     1.97942145E-04    2           12    1000023   # BR(Ah_3 -> Chi_1 Chi_5 )
     1.85806327E-01    2           12    1000025   # BR(Ah_3 -> Chi_1 Chi_6 )
     4.72087337E-04    2           14    1000022   # BR(Ah_3 -> Chi_2 Chi_4 )
     4.41771471E-04    2           14    1000023   # BR(Ah_3 -> Chi_2 Chi_5 )
     4.14686494E-01    2           14    1000025   # BR(Ah_3 -> Chi_2 Chi_6 )
     3.77852268E-04    2           16    1000022   # BR(Ah_3 -> Chi_3 Chi_4 )
     3.53587862E-04    2           16    1000023   # BR(Ah_3 -> Chi_3 Chi_5 )
     3.31909417E-01    2           16    1000025   # BR(Ah_3 -> Chi_3 Chi_6 )
DECAY   1000018     2.11271969E+00   # Ah_4
#    BR                NDA      ID1      ID2
     1.17715535E-02    2          -13   -1000024   # BR(Ah_4 -> Cha_2^* Cha_4 )
     1.17715535E-02    2      1000024         13   # BR(Ah_4 -> Cha_4^* Cha_2 )
     1.57580091E-04    2           12    1000022   # BR(Ah_4 -> Chi_1 Chi_4 )
     1.47460828E-04    2           12    1000023   # BR(Ah_4 -> Chi_1 Chi_5 )
     1.38421779E-01    2           12    1000025   # BR(Ah_4 -> Chi_1 Chi_6 )
     2.39308978E-04    2           14    1000022   # BR(Ah_4 -> Chi_2 Chi_4 )
     2.23941361E-04    2           14    1000023   # BR(Ah_4 -> Chi_2 Chi_5 )
     2.10214210E-01    2           14    1000025   # BR(Ah_4 -> Chi_2 Chi_6 )
     7.12017973E-04    2           16    1000022   # BR(Ah_4 -> Chi_3 Chi_4 )
     6.66294575E-04    2           16    1000023   # BR(Ah_4 -> Chi_3 Chi_5 )
     6.25452069E-01    2           16    1000025   # BR(Ah_4 -> Chi_3 Chi_6 )
DECAY   1000019     2.11238590E+00   # Ah_5
#    BR                NDA      ID1      ID2
     1.16941796E-02    2          -11   -1000024   # BR(Ah_5 -> Cha_1^* Cha_4 )
     1.16941796E-02    2      1000024         11   # BR(Ah_5 -> Cha_4^* Cha_1 )
     7.30462814E-04    2           12    1000022   # BR(Ah_5 -> Chi_1 Chi_4 )
     6.83554951E-04    2           12    1000023   # BR(Ah_5 -> Chi_1 Chi_5 )
     6.41654448E-01    2           12    1000025   # BR(Ah_5 -> Chi_1 Chi_6 )
     3.76470361E-04    2           14    1000022   # BR(Ah_5 -> Chi_2 Chi_4 )
     3.52294702E-04    2           14    1000023   # BR(Ah_5 -> Chi_2 Chi_5 )
     3.30699766E-01    2           14    1000025   # BR(Ah_5 -> Chi_2 Chi_6 )
     1.88791454E-03    2           16    1000025   # BR(Ah_5 -> Chi_3 Chi_6 )
DECAY        37     1.90047533E+00   # Hpm_2
#    BR                NDA      ID1      ID2
     4.99737230E-03    2           12        -15   # BR(Hpm_2^* -> Chi_1 Cha_3^* )
     1.11596356E-02    2           14        -15   # BR(Hpm_2^* -> Chi_2 Cha_3^* )
     8.92547400E-03    2           16        -15   # BR(Hpm_2^* -> Chi_3 Cha_3^* )
     2.13882992E-03    2      1000022    1000024   # BR(Hpm_2^* -> Chi_4 Cha_4^* )
     7.23373496E-03    2      1000023    1000024   # BR(Hpm_2^* -> Chi_5 Cha_4^* )
     4.34409460E-03    2      1000025    1000024   # BR(Hpm_2^* -> Chi_6 Cha_4^* )
     9.57681142E-01    2            6         -5   # BR(Hpm_2^* -> Fu_3 Fd_3^* )
     3.36569326E-03    2           25         24   # BR(Hpm_2^* -> hh_1 VWm^* )
DECAY   1000011     8.28912198E+00   # Hpm_3
#    BR                NDA      ID1      ID2
     2.35820065E-03    2           12   -1000024   # BR(Hpm_3 -> Chi_1 Cha_4 )
     5.26610049E-03    2           14   -1000024   # BR(Hpm_3 -> Chi_2 Cha_4 )
     4.21182514E-03    2           16   -1000024   # BR(Hpm_3 -> Chi_3 Cha_4 )
     7.60159194E-03    2      1000022         15   # BR(Hpm_3 -> Chi_4 Cha_3 )
     1.06753163E-02    2      1000023         15   # BR(Hpm_3 -> Chi_5 Cha_3 )
     9.69886963E-01    2      1000025         15   # BR(Hpm_3 -> Chi_6 Cha_3 )
DECAY   2000011     8.16177882E+00   # Hpm_4
#    BR                NDA      ID1      ID2
     1.67644073E-03    2      1000022         13   # BR(Hpm_4 -> Chi_4 Cha_2 )
     4.85652197E-03    2      1000023         13   # BR(Hpm_4 -> Chi_5 Cha_2 )
     9.93424029E-01    2      1000025         13   # BR(Hpm_4 -> Chi_6 Cha_2 )
DECAY   1000013     8.16133214E+00   # Hpm_5
#    BR                NDA      ID1      ID2
     1.65505262E-03    2      1000022         11   # BR(Hpm_5 -> Chi_4 Cha_1 )
     4.83552407E-03    2      1000023         11   # BR(Hpm_5 -> Chi_5 Cha_1 )
     9.93509422E-01    2      1000025         11   # BR(Hpm_5 -> Chi_6 Cha_1 )
DECAY   2000013     2.09052422E+00   # Hpm_6
#    BR                NDA      ID1      ID2
     1.89357762E-03    2           12   -1000024   # BR(Hpm_6 -> Chi_1 Cha_4 )
     1.74373076E-04    2           12   -1000037   # BR(Hpm_6 -> Chi_1 Cha_5 )
     8.34973998E-04    2           14   -1000024   # BR(Hpm_6 -> Chi_2 Cha_4 )
     1.30267012E-02    2      1000022         11   # BR(Hpm_6 -> Chi_4 Cha_1 )
     1.11210788E-02    2      1000023         11   # BR(Hpm_6 -> Chi_5 Cha_1 )
     9.72375171E-01    2      1000025         11   # BR(Hpm_6 -> Chi_6 Cha_1 )
     3.53138847E-04    2      1000025         13   # BR(Hpm_6 -> Chi_6 Cha_2 )
     1.35060080E-04    2      1000035         11   # BR(Hpm_6 -> Chi_7 Cha_1 )
DECAY   1000015     2.09112321E+00   # Hpm_7
#    BR                NDA      ID1      ID2
     2.90353329E-04    2           12   -1000024   # BR(Hpm_7 -> Chi_1 Cha_4 )
     6.77308970E-04    2           14   -1000024   # BR(Hpm_7 -> Chi_2 Cha_4 )
     1.75176180E-03    2           16   -1000024   # BR(Hpm_7 -> Chi_3 Cha_4 )
     1.63148244E-04    2           16   -1000037   # BR(Hpm_7 -> Chi_3 Cha_5 )
     1.30993806E-02    2      1000022         13   # BR(Hpm_7 -> Chi_4 Cha_2 )
     1.11948288E-02    2      1000023         13   # BR(Hpm_7 -> Chi_5 Cha_2 )
     3.52998430E-04    2      1000025         11   # BR(Hpm_7 -> Chi_6 Cha_1 )
     9.72235042E-01    2      1000025         13   # BR(Hpm_7 -> Chi_6 Cha_2 )
     1.36074323E-04    2      1000035         13   # BR(Hpm_7 -> Chi_7 Cha_2 )
DECAY   2000015     2.24596043E+00   # Hpm_8
#    BR                NDA      ID1      ID2
     1.64677571E-04    2           12   -1000024   # BR(Hpm_8 -> Chi_1 Cha_4 )
     3.67916554E-04    2           14   -1000024   # BR(Hpm_8 -> Chi_2 Cha_4 )
     1.03836270E-04    2           14   -1000037   # BR(Hpm_8 -> Chi_2 Cha_5 )
     2.94080750E-04    2           16   -1000024   # BR(Hpm_8 -> Chi_3 Cha_4 )
     3.22392543E-02    2      1000022         15   # BR(Hpm_8 -> Chi_4 Cha_3 )
     3.06003891E-02    2      1000023         15   # BR(Hpm_8 -> Chi_5 Cha_3 )
     9.35980386E-01    2      1000025         15   # BR(Hpm_8 -> Chi_6 Cha_3 )
     1.19858120E-04    2      1000035         15   # BR(Hpm_8 -> Chi_7 Cha_3 )
DECAY   1000021     2.47605290E+02   # Glu
#    BR                NDA      ID1      ID2
     4.15503073E-02    2            1   -2000001   # BR(Glu -> Fd_1 Sd_4^* )
     4.15503073E-02    2           -1    2000001   # BR(Glu -> Fd_1^* Sd_4 )
     4.03971385E-02    2            1   -2000005   # BR(Glu -> Fd_1 Sd_6^* )
     4.03971385E-02    2           -1    2000005   # BR(Glu -> Fd_1^* Sd_6 )
     4.15503042E-02    2            3   -1000005   # BR(Glu -> Fd_2 Sd_3^* )
     4.15503042E-02    2           -3    1000005   # BR(Glu -> Fd_2^* Sd_3 )
     4.03971650E-02    2            3   -2000003   # BR(Glu -> Fd_2 Sd_5^* )
     4.03971650E-02    2           -3    2000003   # BR(Glu -> Fd_2^* Sd_5 )
     4.29790377E-02    2            5   -1000001   # BR(Glu -> Fd_3 Sd_1^* )
     4.29790377E-02    2           -5    1000001   # BR(Glu -> Fd_3^* Sd_1 )
     4.15759296E-02    2            5   -1000003   # BR(Glu -> Fd_3 Sd_2^* )
     4.15759296E-02    2           -5    1000003   # BR(Glu -> Fd_3^* Sd_2 )
     4.15460231E-02    2            2   -1000006   # BR(Glu -> Fu_1 Su_3^* )
     4.15460231E-02    2           -2    1000006   # BR(Glu -> Fu_1^* Su_3 )
     4.04865351E-02    2            2   -2000004   # BR(Glu -> Fu_1 Su_5^* )
     4.04865351E-02    2           -2    2000004   # BR(Glu -> Fu_1^* Su_5 )
     4.15458780E-02    2            4   -1000004   # BR(Glu -> Fu_2 Su_2^* )
     4.15458780E-02    2           -4    1000004   # BR(Glu -> Fu_2^* Su_2 )
     4.04866817E-02    2            4   -2000002   # BR(Glu -> Fu_2 Su_4^* )
     4.04866817E-02    2           -4    2000002   # BR(Glu -> Fu_2^* Su_4 )
     4.30337965E-02    2            6   -1000002   # BR(Glu -> Fu_3 Su_1^* )
     4.30337965E-02    2           -6    1000002   # BR(Glu -> Fu_3^* Su_1 )
     4.43958655E-02    2            6   -2000006   # BR(Glu -> Fu_3 Su_6^* )
     4.43958655E-02    2           -6    2000006   # BR(Glu -> Fu_3^* Su_6 )
DECAY         6     1.44083035E+00   # Fu_3
#    BR                NDA      ID1      ID2
     1.00000000E+00    2            5         24   # BR(Fu_3 -> Fd_3 VWm^* )
DECAY        13     1.08849422E-18   # Cha_2
#    BR                NDA      ID1      ID2
#    BR                NDA      ID1      ID2       ID3
     2.20667569E-02    3           11         12         12   # BR(Cha_2 -> Cha_1 Chi_1 Chi_1 )
     5.40513149E-02    3           11         12         14   # BR(Cha_2 -> Cha_1 Chi_1 Chi_2 )
     1.10899939E-01    3           11         12         16   # BR(Cha_2 -> Cha_1 Chi_1 Chi_3 )
     2.07722768E-02    3           11         14         14   # BR(Cha_2 -> Cha_1 Chi_2 Chi_2 )
     5.13131525E-02    3           11         14         16   # BR(Cha_2 -> Cha_1 Chi_2 Chi_3 )
     8.69652880E-02    3           12         -2          1   # BR(Cha_2 -> Chi_1 Fu_1^* Fd_1 )
     1.76753812E-01    3           14         -2          1   # BR(Cha_2 -> Chi_2 Fu_1^* Fd_1 )
     4.77157898E-01    3           16         -2          1   # BR(Cha_2 -> Chi_3 Fu_1^* Fd_1 )
DECAY        15     1.85033838E-12   # Cha_3
#    BR                NDA      ID1      ID2
#    BR                NDA      ID1      ID2       ID3
     2.71696169E-02    3           11         12         12   # BR(Cha_3 -> Cha_1 Chi_1 Chi_1 )
     7.32561388E-02    3           11         12         14   # BR(Cha_3 -> Cha_1 Chi_1 Chi_2 )
     4.85302253E-02    3           11         12         16   # BR(Cha_3 -> Cha_1 Chi_1 Chi_3 )
     2.81005401E-02    3           11         14         14   # BR(Cha_3 -> Cha_1 Chi_2 Chi_2 )
     2.24846004E-02    3           11         14         16   # BR(Cha_3 -> Cha_1 Chi_2 Chi_3 )
     4.54270682E-03    3           13         12         12   # BR(Cha_3 -> Cha_2 Chi_1 Chi_1 )
     1.93797675E-02    3           13         12         14   # BR(Cha_3 -> Cha_2 Chi_1 Chi_2 )
     3.30422374E-02    3           13         12         16   # BR(Cha_3 -> Cha_2 Chi_1 Chi_3 )
     2.06179721E-02    3           13         14         14   # BR(Cha_3 -> Cha_2 Chi_2 Chi_2 )
     7.21505052E-02    3           13         14         16   # BR(Cha_3 -> Cha_2 Chi_2 Chi_3 )
     4.45164432E-02    3           13         16         16   # BR(Cha_3 -> Cha_2 Chi_3 Chi_3 )
     1.19266324E-01    3           12         -2          1   # BR(Cha_3 -> Chi_1 Fu_1^* Fd_1 )
     1.51175147E-03    3           12         -4          3   # BR(Cha_3 -> Chi_1 Fu_2^* Fd_2 )
     2.66333762E-01    3           14         -2          1   # BR(Cha_3 -> Chi_2 Fu_1^* Fd_1 )
     3.37589389E-03    3           14         -4          3   # BR(Cha_3 -> Chi_2 Fu_2^* Fd_2 )
     2.13013636E-01    3           16         -2          1   # BR(Cha_3 -> Chi_3 Fu_1^* Fd_1 )
     2.70003859E-03    3           16         -4          3   # BR(Cha_3 -> Chi_3 Fu_2^* Fd_2 )
DECAY   1000024     5.35613329E-12   # Cha_4
#    BR                NDA      ID1      ID2
     1.52992648E-03    2          -11         25   # BR(Cha_4^* -> Cha_1^* hh_1 )
     9.31156105E-02    2          -13         25   # BR(Cha_4^* -> Cha_2^* hh_1 )
     1.59078271E-01    2          -15         25   # BR(Cha_4^* -> Cha_3^* hh_1 )
     3.25331879E-04    2          -13         23   # BR(Cha_4^* -> Cha_2^* VZ )
     6.82811037E-02    2          -15         23   # BR(Cha_4^* -> Cha_3^* VZ )
     6.39990336E-01    2           14         24   # BR(Cha_4^* -> Chi_2 VWm^* )
     3.74369970E-02    2           16         24   # BR(Cha_4^* -> Chi_3 VWm^* )
DECAY   1000037     2.55945104E+01   # Cha_5
#    BR                NDA      ID1      ID2
     7.43614528E-02    2      1000024         36   # BR(Cha_5^* -> Cha_4^* Ah_2 )
     1.75115462E-01    2      1000024         25   # BR(Cha_5^* -> Cha_4^* hh_1 )
     7.38830851E-02    2      1000024         35   # BR(Cha_5^* -> Cha_4^* hh_2 )
     1.68578255E-01    2      1000024         23   # BR(Cha_5^* -> Cha_4^* VZ )
     7.43404850E-02    2      1000022         37   # BR(Cha_5^* -> Chi_4 Hpm_2^* )
     7.38333414E-02    2      1000023         37   # BR(Cha_5^* -> Chi_5 Hpm_2^* )
     1.71242914E-01    2      1000022         24   # BR(Cha_5^* -> Chi_4 VWm^* )
     1.66142869E-01    2      1000023         24   # BR(Cha_5^* -> Chi_5 VWm^* )
     7.32102573E-04    2      1000025         24   # BR(Cha_5^* -> Chi_6 VWm^* )
     3.27692730E-03    2           -5    1000002   # BR(Cha_5^* -> Fd_3^* Su_1 )
#    BR                NDA      ID1      ID2       ID3
     1.90385271E-04    3      1000024    1000022    1000025   # BR(Cha_5^* -> Cha_4^* Chi_4 Chi_6 )
     1.55262515E-04    3      1000024    1000023    1000025   # BR(Cha_5^* -> Cha_4^* Chi_5 Chi_6 )
     2.05045123E-04    3      1000024          5         -5   # BR(Cha_5^* -> Cha_4^* Fd_3 Fd_3^* )
     7.27825930E-03    3      1000024          6         -6   # BR(Cha_5^* -> Cha_4^* Fu_3 Fu_3^* )
     5.18720736E-03    3      1000022          6         -5   # BR(Cha_5^* -> Chi_4 Fu_3 Fd_3^* )
     5.09572162E-03    3      1000023          6         -5   # BR(Cha_5^* -> Chi_5 Fu_3 Fd_3^* )
DECAY   1000022     4.44119850E-12   # Chi_4
#    BR                NDA      ID1      ID2
     1.22379515E-01    2           11         24   # BR(Chi_4 -> Cha_1 VWm^* )
     1.22379515E-01    2          -11        -24   # BR(Chi_4 -> Cha_1^* VWm )
     1.88696513E-01    2           13         24   # BR(Chi_4 -> Cha_2 VWm^* )
     1.88696513E-01    2          -13        -24   # BR(Chi_4 -> Cha_2^* VWm )
     1.81893041E-01    2           15         24   # BR(Chi_4 -> Cha_3 VWm^* )
     1.81893041E-01    2          -15        -24   # BR(Chi_4 -> Cha_3^* VWm )
     2.33384471E-04    2           14         25   # BR(Chi_4 -> Chi_2 hh_1 )
     7.60281730E-03    2           16         25   # BR(Chi_4 -> Chi_3 hh_1 )
     5.91030431E-03    2           16         23   # BR(Chi_4 -> Chi_3 VZ )
#    BR                NDA      ID1      ID2       ID3
     6.16002642E-05    3           15         -5          6   # BR(Chi_4 -> Cha_3 Fd_3^* Fu_3 )
     6.16002642E-05    3          -15          5         -6   # BR(Chi_4 -> Cha_3^* Fd_3 Fu_3^* )
DECAY   1000023     4.82218418E-12   # Chi_5
#    BR                NDA      ID1      ID2
     1.13781276E-01    2           11         24   # BR(Chi_5 -> Cha_1 VWm^* )
     1.13781276E-01    2          -11        -24   # BR(Chi_5 -> Cha_1^* VWm )
     1.27229379E-01    2           13         24   # BR(Chi_5 -> Cha_2 VWm^* )
     1.27229379E-01    2          -13        -24   # BR(Chi_5 -> Cha_2^* VWm )
     2.01747824E-01    2           15         24   # BR(Chi_5 -> Cha_3 VWm^* )
     2.01747824E-01    2          -15        -24   # BR(Chi_5 -> Cha_3^* VWm )
     2.22485001E-04    2           14         25   # BR(Chi_5 -> Chi_2 hh_1 )
     4.01555693E-03    2           16         25   # BR(Chi_5 -> Chi_3 hh_1 )
     1.04597741E-04    2           14         23   # BR(Chi_5 -> Chi_2 VZ )
     8.27550752E-03    2           16         23   # BR(Chi_5 -> Chi_3 VZ )
#    BR                NDA      ID1      ID2       ID3
     4.87617043E-03    3           12        -11   -1000024   # BR(Chi_5 -> Chi_1 Cha_1^* Cha_4 )
     7.62999065E-04    3           12        -13   -1000024   # BR(Chi_5 -> Chi_1 Cha_2^* Cha_4 )
     4.87617043E-03    3           12    1000024         11   # BR(Chi_5 -> Chi_1 Cha_4^* Cha_1 )
     7.63014721E-04    3           12    1000024         13   # BR(Chi_5 -> Chi_1 Cha_4^* Cha_2 )
     2.25840403E-03    3           14        -11   -1000024   # BR(Chi_5 -> Chi_2 Cha_1^* Cha_4 )
     1.55076808E-03    3           14        -13   -1000024   # BR(Chi_5 -> Chi_2 Cha_2^* Cha_4 )
     2.25840403E-03    3           14    1000024         11   # BR(Chi_5 -> Chi_2 Cha_4^* Cha_1 )
     1.55079991E-03    3           14    1000024         13   # BR(Chi_5 -> Chi_2 Cha_4^* Cha_2 )
     4.18639479E-03    3           16        -13   -1000024   # BR(Chi_5 -> Chi_3 Cha_2^* Cha_4 )
     4.18648070E-03    3           16    1000024         13   # BR(Chi_5 -> Chi_3 Cha_4^* Cha_2 )
     2.34768430E-03    3      1000022        -11         11   # BR(Chi_5 -> Chi_4 Cha_1^* Cha_1 )
     2.12667713E-03    3      1000022        -13         13   # BR(Chi_5 -> Chi_4 Cha_2^* Cha_2 )
     1.02200489E-02    3      1000022         -1          1   # BR(Chi_5 -> Chi_4 Fd_1^* Fd_1 )
     9.08984567E-03    3      1000022         -3          3   # BR(Chi_5 -> Chi_4 Fd_2^* Fd_2 )
     7.87651569E-03    3      1000022         -2          2   # BR(Chi_5 -> Chi_4 Fu_1^* Fu_1 )
     2.14003982E-02    3     -1000024         -1          2   # BR(Chi_5 -> Cha_4 Fd_1^* Fu_1 )
     2.14003982E-02    3      1000024          1         -2   # BR(Chi_5 -> Cha_4^* Fd_1 Fu_1^* )
DECAY   1000025     1.15240305E+00   # Chi_6
#    BR                NDA      ID1      ID2
     2.49787132E-01    2     -1000024         24   # BR(Chi_6 -> Cha_4 VWm^* )
     2.49787132E-01    2      1000024        -24   # BR(Chi_6 -> Cha_4^* VWm )
     6.04480725E-02    2      1000022         25   # BR(Chi_6 -> Chi_4 hh_1 )
     1.85437791E-01    2      1000023         25   # BR(Chi_6 -> Chi_5 hh_1 )
     1.82246288E-01    2      1000022         23   # BR(Chi_6 -> Chi_4 VZ )
     7.06605742E-02    2      1000023         23   # BR(Chi_6 -> Chi_5 VZ )
#    BR                NDA      ID1      ID2       ID3
     7.84679258E-04    3     -1000024         -5          6   # BR(Chi_6 -> Cha_4 Fd_3^* Fu_3 )
     7.84679258E-04    3      1000024          5         -6   # BR(Chi_6 -> Cha_4^* Fd_3 Fu_3^* )
DECAY   1000035     2.51924083E+01   # Chi_7
#    BR                NDA      ID1      ID2
     3.73211174E-02    2      1000022         36   # BR(Chi_7 -> Chi_4 Ah_2 )
     3.83092909E-02    2      1000023         36   # BR(Chi_7 -> Chi_5 Ah_2 )
     7.51401183E-02    2     -1000024         37   # BR(Chi_7 -> Cha_4 Hpm_2^* )
     7.51401183E-02    2      1000024        -37   # BR(Chi_7 -> Cha_4^* Hpm_2 )
     1.62127281E-01    2     -1000024         24   # BR(Chi_7 -> Cha_4 VWm^* )
     1.62127281E-01    2      1000024        -24   # BR(Chi_7 -> Cha_4^* VWm )
     1.43586902E-01    2      1000022         25   # BR(Chi_7 -> Chi_4 hh_1 )
     3.76653978E-02    2      1000022         35   # BR(Chi_7 -> Chi_4 hh_2 )
     3.37885988E-02    2      1000023         25   # BR(Chi_7 -> Chi_5 hh_1 )
     3.74648198E-02    2      1000023         35   # BR(Chi_7 -> Chi_5 hh_2 )
     3.46276163E-02    2      1000022         23   # BR(Chi_7 -> Chi_4 VZ )
     1.40848742E-01    2      1000023         23   # BR(Chi_7 -> Chi_5 VZ )
     6.71317913E-04    2      1000025         23   # BR(Chi_7 -> Chi_6 VZ )
#    BR                NDA      ID1      ID2       ID3
     3.57714344E-04    3      1000022    1000022    1000025   # BR(Chi_7 -> Chi_4 Chi_4 Chi_6 )
     2.96191681E-04    3      1000023    1000023    1000025   # BR(Chi_7 -> Chi_5 Chi_5 Chi_6 )
     2.15672280E-03    3      1000022         -6          6   # BR(Chi_7 -> Chi_4 Fu_3^* Fu_3 )
     5.58566328E-03    3      1000023         -6          6   # BR(Chi_7 -> Chi_5 Fu_3^* Fu_3 )
     1.10675652E-04    3      1000025         -6          6   # BR(Chi_7 -> Chi_6 Fu_3^* Fu_3 )
     6.02283600E-03    3     -1000024         -5          6   # BR(Chi_7 -> Cha_4 Fd_3^* Fu_3 )
     6.02283600E-03    3      1000024          5         -6   # BR(Chi_7 -> Cha_4^* Fd_3 Fu_3^* )
