#
#                              ======================
#                              | THE SUSYHIT OUTPUT |
#                              ======================
#
#
#              ------------------------------------------------------
#              |     This is the output of the SUSY-HIT package     |
#              |  created by A.Djouadi, M.Muehlleitner and M.Spira. |
#              |  In case of problems with SUSY-HIT email to        |
#              |           margarete.muehlleitner@cern.ch           |
#              |           michael.spira@psi.ch                     |
#              |           abdelhak.djouadi@cern.ch                 |
#              ------------------------------------------------------
#
#              ------------------------------------------------------
#              |  SUSY Les Houches Accord - MSSM Spectrum + Decays  |
#              |              based on the decay programs           |
#              |                                                    |
#              |                     SDECAY 1.3b                    |
#              |                                                    |
#              |  Authors: M.Muhlleitner, A.Djouadi and Y.Mambrini  |
#              |  Ref.:    Comput.Phys.Commun.168(2005)46           |
#              |           [hep-ph/0311167]                         |
#              |                                                    |
#              |                     HDECAY 3.4                     |
#              |                                                    |
#              |  By: A.Djouadi,J.Kalinowski,M.Muhlleitner,M.Spira  |
#              |  Ref.:    Comput.Phys.Commun.108(1998)56           |
#              |           [hep-ph/9704448]                         |
#              |                                                    |
#              |                                                    |
#              |  If not stated otherwise all DRbar couplings and   |
#              |  soft SUSY breaking masses are given at the scale  |
#              |  Q=  0.91187600E+02
#              |                                                    |
#              ------------------------------------------------------
#
#
BLOCK DCINFO  # Decay Program information
     1   SDECAY/HDECAY # decay calculator
     2   1.3b  /3.4    # version number
#
BLOCK SPINFO  # Spectrum calculator information
     1   SuSpect     # RGE +Spectrum calculator            
     2   2.41         # version number                     
#
BLOCK MODSEL  # Model selection
     1     0   # #general MSSM low scale                           
#
BLOCK SMINPUTS  # Standard Model inputs
         1     1.27934000E+02   # alpha_em^-1(M_Z)^MSbar
         2     1.16639000E-05   # G_F [GeV^-2]
         3     1.17200000E-01   # alpha_S(M_Z)^MSbar
         4     9.11870000E+01   # M_Z pole mass
         5     4.25000000E+00   # mb(mb)^MSbar
         6     1.72500000E+02   # mt pole mass
         7     1.77700000E+00   # mtau pole mass
#
BLOCK MINPAR  # Input parameters - minimal models
#
BLOCK EXTPAR  # Input parameters - non-minimal models
         0     9.11876000E+01   # EWSB                
         1     5.00000000E+02   # M_1                 
         2     6.00000000E+02   # M_2                 
         3     2.50000000E+03   # M_3                 
        11     0.00000000E+00   # A_t                 
        12     0.00000000E+00   # A_b                 
        13     0.00000000E+00   # A_tau               
        14     0.00000000E+00   # A_u                 
        15     0.00000000E+00   # A_d                 
        16     0.00000000E+00   # A_e                 
        23     1.00000000E+04   # mu(EWSB)            
        25     1.50000000E+00   # tanbeta(in)         
        26     2.00000000E+03   # MA_pole             
        31     2.50000000E+03   # M_eL                
        32     2.50000000E+03   # M_muL               
        33     2.50000000E+03   # M_tauL              
        34     2.50000000E+03   # M_eR                
        35     2.50000000E+03   # M_muR               
        36     2.50000000E+03   # M_tauR              
        41     2.50000000E+03   # M_q1L               
        42     2.50000000E+03   # M_q2L               
        43     2.50000000E+03   # M_q3L               
        44     2.50000000E+03   # M_uR                
        45     2.50000000E+03   # M_cR                
        46     2.50000000E+03   # M_tR                
        47     2.50000000E+03   # M_dR                
        48     2.50000000E+03   # M_sR                
        49     2.50000000E+03   # M_bR                
#
BLOCK MASS  # Mass Spectrum
# PDG code           mass       particle
        24     8.05293147E+01   # W+
        25     1.25000000E+02   # h
        35     2.00048577E+03   # H
        36     2.00000000E+03   # A
        37     2.00016723E+03   # H+
         5     4.87877839E+00   # b-quark pole mass calculated from mb(mb)_Msbar
   1000001     2.50026632E+03   # ~d_L
   2000001     2.50005036E+03   # ~d_R
   1000002     2.49978402E+03   # ~u_L
   2000002     2.49989927E+03   # ~u_R
   1000003     2.50026632E+03   # ~s_L
   2000003     2.50005036E+03   # ~s_R
   1000004     2.49978402E+03   # ~c_L
   2000004     2.49989927E+03   # ~c_R
   1000005     2.49234287E+03   # ~b_1
   2000005     2.50795216E+03   # ~b_2
   1000006     2.29628118E+03   # ~t_1
   2000006     2.69636725E+03   # ~t_2
   1000011     2.50016560E+03   # ~e_L
   2000011     2.50015108E+03   # ~e_R
   1000012     2.49968329E+03   # ~nu_eL
   1000013     2.50016560E+03   # ~mu_L
   2000013     2.50015108E+03   # ~mu_R
   1000014     2.49968329E+03   # ~nu_muL
   1000015     2.49481933E+03   # ~tau_1
   2000015     2.50548724E+03   # ~tau_2
   1000016     2.49968329E+03   # ~nu_tauL
   1000021     2.50000000E+03   # ~g
   1000022     4.99807222E+02   # ~chi_10
   1000023     5.99382646E+02   # ~chi_20
   1000025    -1.00000299E+04   # ~chi_30
   1000035     1.00008401E+04   # ~chi_40
   1000024     5.99381442E+02   # ~chi_1+
   1000037     1.00006641E+04   # ~chi_2+
   1000039     1.00000000E-07   # ~gravitino
#
BLOCK NMIX  # Neutralino Mixing Matrix
  1  1     9.99983153E-01   # N_11
  1  2    -3.43760371E-03   # N_12
  1  3     3.84334816E-03   # N_13
  1  4    -2.66550971E-03   # N_14
  2  1     3.47667746E-03   # N_21
  2  2     9.99958912E-01   # N_22
  2  3    -6.86267574E-03   # N_23
  2  4     4.79485762E-03   # N_24
  3  1     8.27799666E-04   # N_31
  3  2    -1.46504261E-03   # N_32
  3  3    -7.07100486E-01   # N_33
  3  4    -7.07111074E-01   # N_34
  4  1     4.57393141E-03   # N_41
  4  2    -8.25898264E-03   # N_42
  4  3    -7.07069328E-01   # N_43
  4  4     7.07081207E-01   # N_44
#
BLOCK UMIX  # Chargino Mixing Matrix U
  1  1    -9.99952719E-01   # U_11
  1  2     9.72416022E-03   # U_12
  2  1     9.72416022E-03   # U_21
  2  2     9.99952719E-01   # U_22
#
BLOCK VMIX  # Chargino Mixing Matrix V
  1  1    -9.99976919E-01   # V_11
  1  2     6.79428162E-03   # V_12
  2  1     6.79428162E-03   # V_21
  2  2     9.99976919E-01   # V_22
#
BLOCK STOPMIX  # Stop Mixing Matrix
  1  1     7.07208762E-01   # cos(theta_t)
  1  2     7.07004786E-01   # sin(theta_t)
  2  1    -7.07004786E-01   # -sin(theta_t)
  2  2     7.07208762E-01   # cos(theta_t)
#
BLOCK SBOTMIX  # Sbottom Mixing Matrix
  1  1     7.02198326E-01   # cos(theta_b)
  1  2     7.11981398E-01   # sin(theta_b)
  2  1    -7.11981398E-01   # -sin(theta_b)
  2  2     7.02198326E-01   # cos(theta_b)
#
BLOCK STAUMIX  # Stau Mixing Matrix
  1  1     7.06625568E-01   # cos(theta_tau)
  1  2     7.07587667E-01   # sin(theta_tau)
  2  1    -7.07587667E-01   # -sin(theta_tau)
  2  2     7.06625568E-01   # cos(theta_tau)
#
BLOCK ALPHA  # Higgs mixing
          -5.90825818E-01   # Mixing angle in the neutral Higgs boson sector
#
BLOCK HMIX Q=  9.11876000E+01  # DRbar Higgs Parameters
         1     1.00000000E+04   # mu(Q)               
         2     1.49999981E+00   # tanbeta(Q)          
         3     2.51084598E+02   # vev(Q)              
         4     3.11696878E+06   # MA^2(Q)             
#
BLOCK GAUGE Q=  9.11876000E+01  # The gauge couplings
     1     3.53018015E-01   # gprime(Q) DRbar
     2     6.30722656E-01   # g(Q) DRbar
     3     1.08813168E+00   # g3(Q) DRbar
#
BLOCK AU Q=  9.11876000E+01  # The trilinear couplings
  1  1     0.00000000E+00   # A_u(Q) DRbar
  2  2     0.00000000E+00   # A_c(Q) DRbar
  3  3     0.00000000E+00   # A_t(Q) DRbar
#
BLOCK AD Q=  9.11876000E+01  # The trilinear couplings
  1  1     0.00000000E+00   # A_d(Q) DRbar
  2  2     0.00000000E+00   # A_s(Q) DRbar
  3  3     0.00000000E+00   # A_b(Q) DRbar
#
BLOCK AE Q=  9.11876000E+01  # The trilinear couplings
  1  1     0.00000000E+00   # A_e(Q) DRbar
  2  2     0.00000000E+00   # A_mu(Q) DRbar
  3  3     0.00000000E+00   # A_tau(Q) DRbar
#
BLOCK Yu Q=  9.11876000E+01  # The Yukawa couplings
  1  1     0.00000000E+00   # y_u(Q) DRbar
  2  2     0.00000000E+00   # y_c(Q) DRbar
  3  3     1.01412141E+00   # y_t(Q) DRbar
#
BLOCK Yd Q=  9.11876000E+01  # The Yukawa couplings
  1  1     0.00000000E+00   # y_d(Q) DRbar
  2  2     0.00000000E+00   # y_s(Q) DRbar
  3  3     2.64150524E-02   # y_b(Q) DRbar
#
BLOCK Ye Q=  9.11876000E+01  # The Yukawa couplings
  1  1     0.00000000E+00   # y_e(Q) DRbar
  2  2     0.00000000E+00   # y_mu(Q) DRbar
  3  3     1.80546722E-02   # y_tau(Q) DRbar
#
BLOCK MSOFT Q=  9.11876000E+01  # The soft SUSY breaking masses at the scale Q
         1     5.00000000E+02   # M_1                 
         2     6.00000000E+02   # M_2                 
         3     2.50000000E+03   # M_3                 
        14     0.00000000E+00   # A_u                 
        15     0.00000000E+00   # A_d                 
        16     0.00000000E+00   # A_e                 
        21    -1.03171693E+08   # M^2_Hd              
        22    -9.31427297E+07   # M^2_Hu              
        31     2.50000000E+03   # M_eL                
        32     2.50000000E+03   # M_muL               
        33     2.50000000E+03   # M_tauL              
        34     2.50000000E+03   # M_eR                
        35     2.50000000E+03   # M_muR               
        36     2.50000000E+03   # M_tauR              
        41     2.50000000E+03   # M_q1L               
        42     2.50000000E+03   # M_q2L               
        43     2.50000000E+03   # M_q3L               
        44     2.50000000E+03   # M_uR                
        45     2.50000000E+03   # M_cR                
        46     2.50000000E+03   # M_tR                
        47     2.50000000E+03   # M_dR                
        48     2.50000000E+03   # M_sR                
        49     2.50000000E+03   # M_bR                
#
#
#
#                             =================
#                             |The decay table|
#                             =================
#
# - The QCD corrections to the decays gluino -> squark  + quark
#                                     squark -> gaugino + quark_prime
#                                     squark -> squark_prime + Higgs
#                                     squark -> gluino  + quark
#   are included.
#
# - The multi-body decays for the inos, stops and sbottoms are included.
#
# - The loop induced decays for the gluino, neutralinos and stops
#   are included.
#
# - The SUSY decays of the top quark are included.
#
# - Possible decays of the NLSP in GMSB models are included.
#
#
#         PDG            Width
DECAY         6     1.37532841E+00   # top decays
#          BR         NDA      ID1       ID2
     1.00000000E+00    2           5        24   # BR(t ->  b    W+)
#
#         PDG            Width
DECAY   1000021     1.E-04   # gluino decays (OJ Mods)
#          BR         NDA      ID1       ID2
     1.94537353E-05    2     1000002        -2   # BR(~g -> ~u_L  ub)
     1.94537353E-05    2    -1000002         2   # BR(~g -> ~u_L* u )
     4.23168779E-06    2     2000002        -2   # BR(~g -> ~u_R  ub)
     4.23168779E-06    2    -2000002         2   # BR(~g -> ~u_R* u )
     1.94537353E-05    2     1000004        -4   # BR(~g -> ~c_L  cb)
     1.94537353E-05    2    -1000004         4   # BR(~g -> ~c_L* c )
     4.23168779E-06    2     2000004        -4   # BR(~g -> ~c_R  cb)
     4.23168779E-06    2    -2000004         4   # BR(~g -> ~c_R* c )
     3.49101893E-03    2     1000005        -5   # BR(~g -> ~b_1  bb)
     3.49101893E-03    2    -1000005         5   # BR(~g -> ~b_1* b )
     4.96461531E-01    2     1000006        -6   # BR(~g -> ~t_1  tb)
     4.96461531E-01    2    -1000006         6   # BR(~g -> ~t_1* t )
     1.59278863E-07    2     1000039        21   # BR(~g -> ~G g)
#
#         PDG            Width
DECAY   1000006     1.40888842E+01   # stop1 decays
#          BR         NDA      ID1       ID2
     1.69986285E-01    2     1000022         6   # BR(~t_1 -> ~chi_10 t )
     2.74977922E-01    2     1000023         6   # BR(~t_1 -> ~chi_20 t )
     5.55035793E-01    2     1000024         5   # BR(~t_1 -> ~chi_1+ b )
#
#         PDG            Width
DECAY   2000006    -1.01336473E+01   # stop2 decays
#          BR         NDA      ID1       ID2
    -2.67448244E-01    2     1000022         6   # BR(~t_2 -> ~chi_10 t )
    -4.39105725E-01    2     1000023         6   # BR(~t_2 -> ~chi_20 t )
     0.00000000E+00    2     1000025         6   # BR(~t_2 -> ~chi_30 t )
    -8.83335106E-01    2     1000024         5   # BR(~t_2 -> ~chi_1+ b )
    -3.13129287E-02    2     1000021         6   # BR(~t_2 -> ~g      t )
    -2.42361163E-07    2     1000006        25   # BR(~t_2 -> ~t_1    h )
     7.64126602E-01    2     1000006        23   # BR(~t_2 -> ~t_1    Z )
     1.02085649E+00    2     1000005        24   # BR(~t_2 -> ~b_1    W+)
     8.36219158E-01    2     2000005        24   # BR(~t_2 -> ~b_2    W+)
#
#         PDG            Width
DECAY   1000005     1.04626471E+01   # sbottom1 decays
#          BR         NDA      ID1       ID2
     7.37518377E-02    2     1000022         5   # BR(~b_1 -> ~chi_10 b )
     3.94427042E-01    2     1000023         5   # BR(~b_1 -> ~chi_20 b )
     7.83123327E-01    2    -1000024         6   # BR(~b_1 -> ~chi_1- t )
    -2.51302206E-01    2     1000006       -24   # BR(~b_1 -> ~t_1    W-)
#
#         PDG            Width
DECAY   2000005     5.62157064E+00   # sbottom2 decays
#          BR         NDA      ID1       ID2
     1.35045835E-01    2     1000022         5   # BR(~b_2 -> ~chi_10 b )
     7.62034027E-01    2     1000023         5   # BR(~b_2 -> ~chi_20 b )
     1.51317632E+00    2    -1000024         6   # BR(~b_2 -> ~chi_1- t )
     4.86863777E-04    2     1000021         5   # BR(~b_2 -> ~g      b )
    -1.41074305E+00    2     1000006       -24   # BR(~b_2 -> ~t_1    W-)
#
#         PDG            Width
DECAY   1000002     2.59586220E+01   # sup_L decays
#          BR         NDA      ID1       ID2
     1.14106166E-02    2     1000022         2   # BR(~u_L -> ~chi_10 u)
     3.29806758E-01    2     1000023         2   # BR(~u_L -> ~chi_20 u)
     6.58782625E-01    2     1000024         1   # BR(~u_L -> ~chi_1+ d)
#
#         PDG            Width
DECAY   2000002     4.91902698E+00   # sup_R decays
#          BR         NDA      ID1       ID2
     9.99988298E-01    2     1000022         2   # BR(~u_R -> ~chi_10 u)
     1.17022337E-05    2     1000023         2   # BR(~u_R -> ~chi_20 u)
#
#         PDG            Width
DECAY   1000001     2.59608497E+01   # sdown_L decays
#          BR         NDA      ID1       ID2
     1.22834689E-02    2     1000022         1   # BR(~d_L -> ~chi_10 d)
     3.28956494E-01    2     1000023         1   # BR(~d_L -> ~chi_20 d)
     6.58759473E-01    2    -1000024         2   # BR(~d_L -> ~chi_1- u)
     5.64315397E-07    2     1000021         1   # BR(~d_L -> ~g      d)
#
#         PDG            Width
DECAY   2000001     1.22978302E+00   # sdown_R decays
#          BR         NDA      ID1       ID2
     9.99987872E-01    2     1000022         1   # BR(~d_R -> ~chi_10 d)
     1.17022824E-05    2     1000023         1   # BR(~d_R -> ~chi_20 d)
     4.26040824E-07    2     1000021         1   # BR(~d_R -> ~g      d)
#
#         PDG            Width
DECAY   1000004     2.59586220E+01   # scharm_L decays
#          BR         NDA      ID1       ID2
     1.14106166E-02    2     1000022         4   # BR(~c_L -> ~chi_10 c)
     3.29806758E-01    2     1000023         4   # BR(~c_L -> ~chi_20 c)
     6.58782625E-01    2     1000024         3   # BR(~c_L -> ~chi_1+ s)
#
#         PDG            Width
DECAY   2000004     4.91902698E+00   # scharm_R decays
#          BR         NDA      ID1       ID2
     9.99988298E-01    2     1000022         4   # BR(~c_R -> ~chi_10 c)
     1.17022337E-05    2     1000023         4   # BR(~c_R -> ~chi_20 c)
#
#         PDG            Width
DECAY   1000003     2.59608497E+01   # sstrange_L decays
#          BR         NDA      ID1       ID2
     1.22834689E-02    2     1000022         3   # BR(~s_L -> ~chi_10 s)
     3.28956494E-01    2     1000023         3   # BR(~s_L -> ~chi_20 s)
     6.58759473E-01    2    -1000024         4   # BR(~s_L -> ~chi_1- c)
     5.64315397E-07    2     1000021         3   # BR(~s_L -> ~g      s)
#
#         PDG            Width
DECAY   2000003     1.22978302E+00   # sstrange_R decays
#          BR         NDA      ID1       ID2
     9.99987872E-01    2     1000022         3   # BR(~s_R -> ~chi_10 s)
     1.17022824E-05    2     1000023         3   # BR(~s_R -> ~chi_20 s)
     4.26040824E-07    2     1000021         3   # BR(~s_R -> ~g      s)
#
#         PDG            Width
DECAY   1000011     2.92198878E+01   # selectron_L decays
#          BR         NDA      ID1       ID2
     9.65591381E-02    2     1000022        11   # BR(~e_L -> ~chi_10 e-)
     3.01930463E-01    2     1000023        11   # BR(~e_L -> ~chi_20 e-)
     6.01510398E-01    2    -1000024        12   # BR(~e_L -> ~chi_1- nu_e)
#
#         PDG            Width
DECAY   2000011     1.14257652E+01   # selectron_R decays
#          BR         NDA      ID1       ID2
     9.99988349E-01    2     1000022        11   # BR(~e_R -> ~chi_10 e-)
     1.16506400E-05    2     1000023        11   # BR(~e_R -> ~chi_20 e-)
#
#         PDG            Width
DECAY   1000013     2.92198878E+01   # smuon_L decays
#          BR         NDA      ID1       ID2
     9.65591381E-02    2     1000022        13   # BR(~mu_L -> ~chi_10 mu-)
     3.01930463E-01    2     1000023        13   # BR(~mu_L -> ~chi_20 mu-)
     6.01510398E-01    2    -1000024        14   # BR(~mu_L -> ~chi_1- nu_mu)
#
#         PDG            Width
DECAY   2000013     1.14257652E+01   # smuon_R decays
#          BR         NDA      ID1       ID2
     9.99988349E-01    2     1000022        13   # BR(~mu_R -> ~chi_10 mu-)
     1.16506400E-05    2     1000023        13   # BR(~mu_R -> ~chi_20 mu-)
#
#         PDG            Width
DECAY   1000015     2.02676963E+01   # stau_1 decays
#          BR         NDA      ID1       ID2
     3.51007753E-01    2     1000022        15   # BR(~tau_1 -> ~chi_10  tau-)
     2.16895372E-01    2     1000023        15   # BR(~tau_1 -> ~chi_20  tau-)
     4.32096874E-01    2    -1000024        16   # BR(~tau_1 -> ~chi_1-  nu_tau)
     5.49006542E-10    2     1000039        15   # BR(~tau_1 -> ~G       tau-)
#
#         PDG            Width
DECAY   2000015     2.03777779E+01   # stau_2 decays
#          BR         NDA      ID1       ID2
     3.50033706E-01    2     1000022        15   # BR(~tau_2 -> ~chi_10  tau-)
     2.17221331E-01    2     1000023        15   # BR(~tau_2 -> ~chi_20  tau-)
     4.32744963E-01    2    -1000024        16   # BR(~tau_2 -> ~chi_1-  nu_tau)
#
#         PDG            Width
DECAY   1000012     2.92155386E+01   # snu_eL decays
#          BR         NDA      ID1       ID2
     9.89532449E-02    2     1000022        12   # BR(~nu_eL -> ~chi_10 nu_e)
     2.99562065E-01    2     1000023        12   # BR(~nu_eL -> ~chi_20 nu_e)
     6.01484690E-01    2     1000024        11   # BR(~nu_eL -> ~chi_1+ e-)
#
#         PDG            Width
DECAY   1000014     2.92155386E+01   # snu_muL decays
#          BR         NDA      ID1       ID2
     9.89532449E-02    2     1000022        14   # BR(~nu_muL -> ~chi_10 nu_mu)
     2.99562065E-01    2     1000023        14   # BR(~nu_muL -> ~chi_20 nu_mu)
     6.01484690E-01    2     1000024        13   # BR(~nu_muL -> ~chi_1+ mu-)
#
#         PDG            Width
DECAY   1000016     2.92155165E+01   # snu_tauL decays
#          BR         NDA      ID1       ID2
     9.89533200E-02    2     1000022        16   # BR(~nu_tauL -> ~chi_10 nu_tau)
     2.99562292E-01    2     1000023        16   # BR(~nu_tauL -> ~chi_20 nu_tau)
     6.01484388E-01    2     1000024        15   # BR(~nu_tauL -> ~chi_1+ tau-)
#
#         PDG            Width
DECAY   1000024     1.82163178E-05   # chargino1+ decays
#          BR         NDA      ID1       ID2
     9.99999544E-01    2     1000022        24   # BR(~chi_1+ -> ~chi_10  W+)
     4.55658533E-07    2     1000039        24   # BR(~chi_1+ -> ~G       W+)
#
#         PDG            Width
DECAY   1000037     5.27499122E+02   # chargino2+ decays
#          BR         NDA      ID1       ID2
     8.97212370E-06    2     1000002        -1   # BR(~chi_2+ -> ~u_L     db)
     1.83777389E-05    2    -1000001         2   # BR(~chi_2+ -> ~d_L*    u )
     8.97212370E-06    2     1000004        -3   # BR(~chi_2+ -> ~c_L     sb)
     1.83777389E-05    2    -1000003         4   # BR(~chi_2+ -> ~s_L*    c )
     1.94309074E-01    2     1000006        -5   # BR(~chi_2+ -> ~t_1     bb)
     1.87315907E-01    2     2000006        -5   # BR(~chi_2+ -> ~t_2     bb)
     1.87769007E-01    2    -1000005         6   # BR(~chi_2+ -> ~b_1*    t )
     1.93336979E-01    2    -2000005         6   # BR(~chi_2+ -> ~b_2*    t )
     3.04394010E-06    2     1000012       -11   # BR(~chi_2+ -> ~nu_eL   e+  )
     3.04394010E-06    2     1000014       -13   # BR(~chi_2+ -> ~nu_muL  mu+ )
     5.70611487E-05    2     1000016       -15   # BR(~chi_2+ -> ~nu_tau1 tau+)
     6.23492002E-06    2    -1000011        12   # BR(~chi_2+ -> ~e_L+    nu_e)
     6.23492002E-06    2    -1000013        14   # BR(~chi_2+ -> ~mu_L+   nu_mu)
     1.18156923E-05    2    -1000015        16   # BR(~chi_2+ -> ~tau_1+  nu_tau)
     4.84225816E-05    2    -2000015        16   # BR(~chi_2+ -> ~tau_2+  nu_tau)
     4.12377673E-02    2     1000024        23   # BR(~chi_2+ -> ~chi_1+  Z )
     1.22517971E-02    2     1000022        24   # BR(~chi_2+ -> ~chi_10  W+)
     4.04193282E-02    2     1000023        24   # BR(~chi_2+ -> ~chi_20  W+)
     4.16318888E-02    2     1000024        25   # BR(~chi_2+ -> ~chi_1+  h )
     3.05792625E-02    2     1000024        35   # BR(~chi_2+ -> ~chi_1+  H )
     3.05825534E-02    2     1000024        36   # BR(~chi_2+ -> ~chi_1+  A )
     9.66670556E-03    2     1000022        37   # BR(~chi_2+ -> ~chi_10  H+)
     3.07091538E-02    2     1000023        37   # BR(~chi_2+ -> ~chi_20  H+)
     1.09145178E-08    2     1000039        24   # BR(~chi_2+ -> ~G       W+)
     9.27100264E-09    2     1000039        37   # BR(~chi_2+ -> ~G       H+)
#
#         PDG            Width
DECAY   1000022     1.E-08   # neutralino1 decays (OJ Mods)
#          BR         NDA      ID1       ID2
     7.82444169E-01    2     1000039        22   # BR(~chi_10 -> ~G        gam)
     2.17555829E-01    2     1000039        23   # BR(~chi_10 -> ~G        Z)
     2.10707028E-09    2     1000039        25   # BR(~chi_10 -> ~G        h)
#
#         PDG            Width
DECAY   1000023     1.E-08   # neutralino2 decays (OJ Mods)
#          BR         NDA      ID1       ID2
     9.78303363E-01    2     1000022        23   # BR(~chi_20 -> ~chi_10   Z )
     5.62104318E-03    2     1000039        22   # BR(~chi_20 -> ~G        gam)
     1.60755940E-02    2     1000039        23   # BR(~chi_20 -> ~G        Z)
     2.46914198E-10    2     1000039        25   # BR(~chi_20 -> ~G        h)
#
#         PDG            Width
DECAY   1000025     5.27081966E+02   # neutralino3 decays
#          BR         NDA      ID1       ID2
     1.24643026E-02    2     1000022        23   # BR(~chi_30 -> ~chi_10   Z )
     3.98509965E-02    2     1000023        23   # BR(~chi_30 -> ~chi_20   Z )
     4.02903465E-02    2     1000024       -24   # BR(~chi_30 -> ~chi_1+   W-)
     4.02903465E-02    2    -1000024        24   # BR(~chi_30 -> ~chi_1-   W+)
     4.00589465E-04    2     1000022        25   # BR(~chi_30 -> ~chi_10   h )
     9.46108510E-03    2     1000022        35   # BR(~chi_30 -> ~chi_10   H )
     4.65553990E-04    2     1000022        36   # BR(~chi_30 -> ~chi_10   A )
     1.23061235E-03    2     1000023        25   # BR(~chi_30 -> ~chi_20   h )
     2.90317106E-02    2     1000023        35   # BR(~chi_30 -> ~chi_20   H )
     1.48931513E-03    2     1000023        36   # BR(~chi_30 -> ~chi_20   A )
     3.06092693E-02    2     1000024       -37   # BR(~chi_30 -> ~chi_1+   H-)
     3.06092693E-02    2    -1000024        37   # BR(~chi_30 -> ~chi_1-   H+)
     1.64072072E-07    2     1000002        -2   # BR(~chi_30 -> ~u_L      ub)
     1.64072072E-07    2    -1000002         2   # BR(~chi_30 -> ~u_L*     u )
     3.64530375E-08    2     2000002        -2   # BR(~chi_30 -> ~u_R      ub)
     3.64530375E-08    2    -2000002         2   # BR(~chi_30 -> ~u_R*     u )
     2.50511762E-07    2     1000001        -1   # BR(~chi_30 -> ~d_L      db)
     2.50511762E-07    2    -1000001         1   # BR(~chi_30 -> ~d_L*     d )
     9.11313983E-09    2     2000001        -1   # BR(~chi_30 -> ~d_R      db)
     9.11313983E-09    2    -2000001         1   # BR(~chi_30 -> ~d_R*     d )
     1.64072072E-07    2     1000004        -4   # BR(~chi_30 -> ~c_L      cb)
     1.64072072E-07    2    -1000004         4   # BR(~chi_30 -> ~c_L*     c )
     3.64530375E-08    2     2000004        -4   # BR(~chi_30 -> ~c_R      cb)
     3.64530375E-08    2    -2000004         4   # BR(~chi_30 -> ~c_R*     c )
     2.50511762E-07    2     1000003        -3   # BR(~chi_30 -> ~s_L      sb)
     2.50511762E-07    2    -1000003         3   # BR(~chi_30 -> ~s_L*     s )
     9.11313983E-09    2     2000003        -3   # BR(~chi_30 -> ~s_R      sb)
     9.11313983E-09    2    -2000003         3   # BR(~chi_30 -> ~s_R*     s )
     1.91982414E-01    2     1000006        -6   # BR(~chi_30 -> ~t_1      tb)
     1.91982414E-01    2    -1000006         6   # BR(~chi_30 -> ~t_1*     t )
     1.89606382E-01    2     2000006        -6   # BR(~chi_30 -> ~t_2      tb)
     1.89606382E-01    2    -2000006         6   # BR(~chi_30 -> ~t_2*     t )
     1.22572728E-04    2     1000005        -5   # BR(~chi_30 -> ~b_1      bb)
     1.22572728E-04    2    -1000005         5   # BR(~chi_30 -> ~b_1*     b )
     1.36367014E-04    2     2000005        -5   # BR(~chi_30 -> ~b_2      bb)
     1.36367014E-04    2    -2000005         5   # BR(~chi_30 -> ~b_2*     b )
     3.31053276E-08    2     1000011       -11   # BR(~chi_30 -> ~e_L-     e+)
     3.31053276E-08    2    -1000011        11   # BR(~chi_30 -> ~e_L+     e-)
     2.83291412E-08    2     2000011       -11   # BR(~chi_30 -> ~e_R-     e+)
     2.83291412E-08    2    -2000011        11   # BR(~chi_30 -> ~e_R+     e-)
     3.31053276E-08    2     1000013       -13   # BR(~chi_30 -> ~mu_L-    mu+)
     3.31053276E-08    2    -1000013        13   # BR(~chi_30 -> ~mu_L+    mu-)
     2.83291412E-08    2     2000013       -13   # BR(~chi_30 -> ~mu_R-    mu+)
     2.83291412E-08    2    -2000013        13   # BR(~chi_30 -> ~mu_R+    mu-)
     2.52477498E-05    2     1000015       -15   # BR(~chi_30 -> ~tau_1-   tau+)
     2.52477498E-05    2    -1000015        15   # BR(~chi_30 -> ~tau_1+   tau-)
     2.88797456E-05    2     2000015       -15   # BR(~chi_30 -> ~tau_2-   tau+)
     2.88797456E-05    2    -2000015        15   # BR(~chi_30 -> ~tau_2+   tau-)
     1.22689215E-07    2     1000012       -12   # BR(~chi_30 -> ~nu_eL    nu_eb)
     1.22689215E-07    2    -1000012        12   # BR(~chi_30 -> ~nu_eL*   nu_e )
     1.22689215E-07    2     1000014       -14   # BR(~chi_30 -> ~nu_muL   nu_mub)
     1.22689215E-07    2    -1000014        14   # BR(~chi_30 -> ~nu_muL*  nu_mu )
     1.22689215E-07    2     1000016       -16   # BR(~chi_30 -> ~nu_tau1  nu_taub)
     1.22689215E-07    2    -1000016        16   # BR(~chi_30 -> ~nu_tau1* nu_tau )
     1.01437207E-18    2     1000039        22   # BR(~chi_30 -> ~G        gam)
     4.20012199E-10    2     1000039        23   # BR(~chi_30 -> ~G        Z)
     1.05067123E-08    2     1000039        25   # BR(~chi_30 -> ~G        h)
     3.46717241E-10    2     1000039        35   # BR(~chi_30 -> ~G        H)
     8.91937130E-09    2     1000039        36   # BR(~chi_30 -> ~G        A)
#
#         PDG            Width
DECAY   1000035     5.27599974E+02   # neutralino4 decays
#          BR         NDA      ID1       ID2
     4.07806812E-04    2     1000022        23   # BR(~chi_40 -> ~chi_10   Z )
     1.25279187E-03    2     1000023        23   # BR(~chi_40 -> ~chi_20   Z )
     4.02539499E-02    2     1000024       -24   # BR(~chi_40 -> ~chi_1+   W-)
     4.02539499E-02    2    -1000024        24   # BR(~chi_40 -> ~chi_1-   W+)
     1.25830179E-02    2     1000022        25   # BR(~chi_40 -> ~chi_10   h )
     4.51953828E-04    2     1000022        35   # BR(~chi_40 -> ~chi_10   H )
     9.44016440E-03    2     1000022        36   # BR(~chi_40 -> ~chi_10   A )
     4.02307089E-02    2     1000023        25   # BR(~chi_40 -> ~chi_20   h )
     1.44580821E-03    2     1000023        35   # BR(~chi_40 -> ~chi_20   H )
     2.89675456E-02    2     1000023        36   # BR(~chi_40 -> ~chi_20   A )
     3.05825839E-02    2     1000024       -37   # BR(~chi_40 -> ~chi_1+   H-)
     3.05825839E-02    2    -1000024        37   # BR(~chi_40 -> ~chi_1-   H+)
     5.23400353E-06    2     1000002        -2   # BR(~chi_40 -> ~u_L      ub)
     5.23400353E-06    2    -1000002         2   # BR(~chi_40 -> ~u_L*     u )
     1.11193371E-06    2     2000002        -2   # BR(~chi_40 -> ~u_R      ub)
     1.11193371E-06    2    -2000002         2   # BR(~chi_40 -> ~u_R*     u )
     7.92410966E-06    2     1000001        -1   # BR(~chi_40 -> ~d_L      db)
     7.92410966E-06    2    -1000001         1   # BR(~chi_40 -> ~d_L*     d )
     2.77979781E-07    2     2000001        -1   # BR(~chi_40 -> ~d_R      db)
     2.77979781E-07    2    -2000001         1   # BR(~chi_40 -> ~d_R*     d )
     5.23400353E-06    2     1000004        -4   # BR(~chi_40 -> ~c_L      cb)
     5.23400353E-06    2    -1000004         4   # BR(~chi_40 -> ~c_L*     c )
     1.11193371E-06    2     2000004        -4   # BR(~chi_40 -> ~c_R      cb)
     1.11193371E-06    2    -2000004         4   # BR(~chi_40 -> ~c_R*     c )
     7.92410966E-06    2     1000003        -3   # BR(~chi_40 -> ~s_L      sb)
     7.92410966E-06    2    -1000003         3   # BR(~chi_40 -> ~s_L*     s )
     2.77979781E-07    2     2000003        -3   # BR(~chi_40 -> ~s_R      sb)
     2.77979781E-07    2    -2000003         3   # BR(~chi_40 -> ~s_R*     s )
     1.99225013E-01    2     1000006        -6   # BR(~chi_40 -> ~t_1      tb)
     1.99225013E-01    2    -1000006         6   # BR(~chi_40 -> ~t_1*     t )
     1.82180497E-01    2     2000006        -6   # BR(~chi_40 -> ~t_2      tb)
     1.82180497E-01    2    -2000006         6   # BR(~chi_40 -> ~t_2*     t )
     9.38779015E-05    2     1000005        -5   # BR(~chi_40 -> ~b_1      bb)
     9.38779015E-05    2    -1000005         5   # BR(~chi_40 -> ~b_1*     b )
     1.73170923E-04    2     2000005        -5   # BR(~chi_40 -> ~b_2      bb)
     1.73170923E-04    2    -2000005         5   # BR(~chi_40 -> ~b_2*     b )
     1.07055925E-06    2     1000011       -11   # BR(~chi_40 -> ~e_L-     e+)
     1.07055925E-06    2    -1000011        11   # BR(~chi_40 -> ~e_L+     e-)
     8.64132163E-07    2     2000011       -11   # BR(~chi_40 -> ~e_R-     e+)
     8.64132163E-07    2    -2000011        11   # BR(~chi_40 -> ~e_R+     e-)
     1.07055925E-06    2     1000013       -13   # BR(~chi_40 -> ~mu_L-    mu+)
     1.07055925E-06    2    -1000013        13   # BR(~chi_40 -> ~mu_L+    mu-)
     8.64132163E-07    2     2000013       -13   # BR(~chi_40 -> ~mu_R-    mu+)
     8.64132163E-07    2    -2000013        13   # BR(~chi_40 -> ~mu_R+    mu-)
     1.77832964E-05    2     1000015       -15   # BR(~chi_40 -> ~tau_1-   tau+)
     1.77832964E-05    2    -1000015        15   # BR(~chi_40 -> ~tau_1+   tau-)
     3.81465050E-05    2     2000015       -15   # BR(~chi_40 -> ~tau_2-   tau+)
     3.81465050E-05    2    -2000015        15   # BR(~chi_40 -> ~tau_2+   tau-)
     3.85853429E-06    2     1000012       -12   # BR(~chi_40 -> ~nu_eL    nu_eb)
     3.85853429E-06    2    -1000012        12   # BR(~chi_40 -> ~nu_eL*   nu_e )
     3.85853429E-06    2     1000014       -14   # BR(~chi_40 -> ~nu_muL   nu_mub)
     3.85853429E-06    2    -1000014        14   # BR(~chi_40 -> ~nu_muL*  nu_mu )
     3.85853429E-06    2     1000016       -16   # BR(~chi_40 -> ~nu_tau1  nu_taub)
     3.85853429E-06    2    -1000016        16   # BR(~chi_40 -> ~nu_tau1* nu_tau )
     3.93510538E-17    2     1000039        22   # BR(~chi_40 -> ~G        gam)
     1.04929972E-08    2     1000039        23   # BR(~chi_40 -> ~G        Z)
     4.07789170E-10    2     1000039        25   # BR(~chi_40 -> ~G        h)
     8.92296814E-09    2     1000039        35   # BR(~chi_40 -> ~G        H)
     3.56518731E-10    2     1000039        36   # BR(~chi_40 -> ~G        A)
#
#         PDG            Width
DECAY        25     4.19864358E-03   # h decays
#          BR         NDA      ID1       ID2
     6.28439206E-01    2           5        -5   # BR(h -> b       bb     )
     6.21491203E-02    2         -15        15   # BR(h -> tau+    tau-   )
     2.19984997E-04    2         -13        13   # BR(h -> mu+     mu-    )
     4.66150344E-04    2           3        -3   # BR(h -> s       sb     )
     2.00572552E-02    2           4        -4   # BR(h -> c       cb     )
     6.43455065E-02    2          21        21   # BR(h -> g       g      )
     2.24949537E-03    2          22        22   # BR(h -> gam     gam    )
     1.49556589E-03    2          22        23   # BR(h -> Z       gam    )
     1.95649826E-01    2          24       -24   # BR(h -> W+      W-     )
     2.49278894E-02    2          23        23   # BR(h -> Z       Z      )
#
#         PDG            Width
DECAY        35     3.76623119E+01   # H decays
#          BR         NDA      ID1       ID2
     1.31809251E-03    2           5        -5   # BR(H -> b       bb     )
     2.46753228E-04    2         -15        15   # BR(H -> tau+    tau-   )
     8.72364543E-07    2         -13        13   # BR(H -> mu+     mu-    )
     1.11716162E-06    2           3        -3   # BR(H -> s       sb     )
     1.01094278E-05    2           4        -4   # BR(H -> c       cb     )
     9.95302054E-01    2           6        -6   # BR(H -> t       tb     )
     7.69130006E-04    2          21        21   # BR(H -> g       g      )
     2.54501580E-06    2          22        22   # BR(H -> gam     gam    )
     1.15137501E-06    2          23        22   # BR(H -> Z       gam    )
     5.50597774E-04    2          24       -24   # BR(H -> W+      W-     )
     2.74544574E-04    2          23        23   # BR(H -> Z       Z      )
     1.51494263E-03    2          25        25   # BR(H -> h       h      )
     3.49443099E-24    2          36        36   # BR(H -> A       A      )
     7.76094741E-16    2          23        36   # BR(H -> Z       A      )
     2.29305641E-16    2          24       -37   # BR(H -> W+      H-     )
     2.29305641E-16    2         -24        37   # BR(H -> W-      H+     )
     4.27171237E-06    2     1000024  -1000024   # BR(H -> ~chi_1+ ~chi_1-)
     2.44781279E-07    2     1000022   1000022   # BR(H -> ~chi_10 ~chi_10)
     2.11962763E-06    2     1000023   1000023   # BR(H -> ~chi_20 ~chi_20)
     1.45421498E-06    2     1000022   1000023   # BR(H -> ~chi_10 ~chi_20)
#
#         PDG            Width
DECAY        36     3.80522532E+01   # A decays
#          BR         NDA      ID1       ID2
     1.32675838E-03    2           5        -5   # BR(A -> b       bb     )
     2.45089735E-04    2         -15        15   # BR(A -> tau+    tau-   )
     8.66480749E-07    2         -13        13   # BR(A -> mu+     mu-    )
     1.14228730E-06    2           3        -3   # BR(A -> s       sb     )
     1.00100652E-05    2           4        -4   # BR(A -> c       cb     )
     9.96836225E-01    2           6        -6   # BR(A -> t       tb     )
     9.42155432E-04    2          21        21   # BR(A -> g       g      )
     3.01767132E-06    2          22        22   # BR(A -> gam     gam    )
     1.34648147E-06    2          23        22   # BR(A -> Z       gam    )
     5.40038239E-04    2          23        25   # BR(A -> Z       h      )
     5.03703098E-05    2     1000024  -1000024   # BR(A -> ~chi_1+ ~chi_1-)
     2.42255711E-06    2     1000022   1000022   # BR(A -> ~chi_10 ~chi_10)
     2.49940312E-05    2     1000023   1000023   # BR(A -> ~chi_20 ~chi_20)
     1.55635298E-05    2     1000022   1000023   # BR(A -> ~chi_10 ~chi_20)
#
#         PDG            Width
DECAY        37     3.72388457E+01   # H+ decays
#          BR         NDA      ID1       ID2
     2.03693412E-06    2           4        -5   # BR(H+ -> c       bb     )
     2.50464167E-04    2         -15        16   # BR(H+ -> tau+    nu_tau )
     8.85481308E-07    2         -13        14   # BR(H+ -> mu+     nu_mu  )
     1.29360004E-08    2           2        -5   # BR(H+ -> u       bb     )
     5.48409839E-08    2           2        -3   # BR(H+ -> u       sb     )
     1.09272764E-05    2           4        -3   # BR(H+ -> c       sb     )
     9.99165631E-01    2           6        -5   # BR(H+ -> t       bb     )
     5.52742825E-04    2          24        25   # BR(H+ -> W+      h      )
     4.63088064E-18    2          24        36   # BR(H+ -> W+      A      )
     1.72440141E-05    2     1000024   1000022   # BR(H+ -> ~chi_1+ ~chi_10)
     2.00917728E-10    2     1000024   1000023   # BR(H+ -> ~chi_1+ ~chi_20)
