#
#                              ======================
#                              | THE SUSYHIT OUTPUT |
#                              ======================
#
#
#              ------------------------------------------------------
#              |     This is the output of the SUSY-HIT package     |
#              |  created by A.Djouadi, M.Muehlleitner and M.Spira. |
#              |  In case of problems with SUSY-HIT email to        |
#              |           margarete.muehlleitner@cern.ch           |
#              |           michael.spira@psi.ch                     |
#              |           abdelhak.djouadi@cern.ch                 |
#              ------------------------------------------------------
#
#              ------------------------------------------------------
#              |  SUSY Les Houches Accord - MSSM Spectrum + Decays  |
#              |              based on the decay programs           |
#              |                                                    |
#              |                     SDECAY 1.3b                    |
#              |                                                    |
#              |  Authors: M.Muhlleitner, A.Djouadi and Y.Mambrini  |
#              |  Ref.:    Comput.Phys.Commun.168(2005)46           |
#              |           [hep-ph/0311167]                         |
#              |                                                    |
#              |                     HDECAY 3.4                     |
#              |                                                    |
#              |  By: A.Djouadi,J.Kalinowski,M.Muhlleitner,M.Spira  |
#              |  Ref.:    Comput.Phys.Commun.108(1998)56           |
#              |           [hep-ph/9704448]                         |
#              |                                                    |
#              |                                                    |
#              |  If not stated otherwise all DRbar couplings and   |
#              |  soft SUSY breaking masses are given at the scale  |
#              |  Q=  0.50007470E+04
#              |                                                    |
#              ------------------------------------------------------
#
#
BLOCK DCINFO  # Decay Program information
     1   SDECAY/HDECAY # decay calculator
     2   1.3b  /3.4    # version number
#
BLOCK SPINFO  # Spectrum calculator information
     1    SOFTSUSY    # spectrum calculator                
     2    3.4.0       # version number                     
#
BLOCK MODSEL  # Model selection
     1     0   #  nonUniversal                                     
#
BLOCK SMINPUTS  # Standard Model inputs
         1     1.25778332E+02   # alpha_em^-1(M_Z)^MSbar
         2     1.16570000E-05   # G_F [GeV^-2]
         3     1.17200002E-01   # alpha_S(M_Z)^MSbar
         4     9.11876000E+01   # M_Z pole mass
         5     4.25000000E+00   # mb(mb)^MSbar
         6     1.72500000E+02   # mt pole mass
         7     1.77682000E+00   # mtau pole mass
#
BLOCK MINPAR  # Input parameters - minimal models
         3     1.00000000E+01   # tanb                
#
BLOCK EXTPAR  # Input parameters - non-minimal models
         0    -1.00000000E+00   # Set                 
         1     6.00000000E+01   # M_1(MX)             
         2     3.00000000E+03   # M_2(MX)             
         3     2.23497200E+03   # M_3(MX)             
        11     5.00000000E+03   # At(MX)              
        12     5.00000000E+03   # Ab(MX)              
        13     0.00000000E+00   # Atau(MX)            
        23    -8.61789000E+02   # mu(MX)              
        26     3.00000000E+03   # mA(pole)            
        31     5.00000000E+03   # meL(MX)             
        32     5.00000000E+03   # mmuL(MX)            
        33     5.00000000E+03   # mtauL(MX)           
        34     5.00000000E+03   # meR(MX)             
        35     5.00000000E+03   # mmuR(MX)            
        36     5.00000000E+03   # mtauR(MX)           
        41     5.00000000E+03   # mqL1(MX)            
        42     5.00000000E+03   # mqL2(MX)            
        43     5.00000000E+03   # mqL3(MX)            
        44     5.00000000E+03   # muR(MX)             
        45     5.00000000E+03   # mcR(MX)             
        46     5.00000000E+03   # mtR(MX)             
        47     5.00000000E+03   # mdR(MX)             
        48     5.00000000E+03   # msR(MX)             
        49     5.00000000E+03   # mbR(MX)             
#
BLOCK MASS  # Mass Spectrum
# PDG code           mass       particle
        24     8.00951864E+01   # W+
        25     1.24819136E+02   # h
        35     3.00007942E+03   # H
        36     2.99998936E+03   # A
        37     3.00140807E+03   # H+
         5     4.87878001E+00   # b-quark pole mass calculated from mb(mb)_Msbar
   1000001     5.08192323E+03   # ~d_L
   2000001     5.06415347E+03   # ~d_R
   1000002     5.08145256E+03   # ~u_L
   2000002     5.06386633E+03   # ~u_R
   1000003     5.08192323E+03   # ~s_L
   2000003     5.06415347E+03   # ~s_R
   1000004     5.08145256E+03   # ~c_L
   2000004     5.06386633E+03   # ~c_R
   1000005     5.02761131E+03   # ~b_1
   2000005     5.06258158E+03   # ~b_2
   1000006     4.91959255E+03   # ~t_1
   2000006     5.07136773E+03   # ~t_2
   1000011     5.01907407E+03   # ~e_L
   2000011     5.00592747E+03   # ~e_R
   1000012     5.01812538E+03   # ~nu_eL
   1000013     5.01907407E+03   # ~mu_L
   2000013     5.00592747E+03   # ~mu_R
   1000014     5.01812538E+03   # ~nu_muL
   1000015     5.00465121E+03   # ~tau_1
   2000015     5.01872753E+03   # ~tau_2
   1000016     5.01757814E+03   # ~nu_tauL
   1000021     2.60000011E+03   # ~g
   1000022     6.02946042E+01   # ~chi_10
   1000023     8.99734449E+02   # ~chi_20
   1000025    -9.01972960E+02   # ~chi_30
   1000035     3.07422562E+03   # ~chi_40
   1000024     9.00000438E+02   # ~chi_1+
   1000037     3.07439308E+03   # ~chi_2+
#
BLOCK NMIX  # Neutralino Mixing Matrix
  1  1     9.98775628E-01   # N_11
  1  2     1.96008407E-04   # N_12
  1  3    -4.94349942E-02   # N_13
  1  4     1.84070243E-03   # N_14
  2  1     3.36659474E-02   # N_21
  2  2     2.24240101E-02   # N_22
  2  3     7.06575263E-01   # N_23
  2  4     7.06480831E-01   # N_24
  3  1    -3.62448879E-02   # N_31
  3  2     1.52898075E-02   # N_32
  3  3    -7.05891027E-01   # N_33
  3  4     7.07227253E-01   # N_34
  4  1    -3.96662732E-04   # N_41
  4  2     9.99631606E-01   # N_42
  4  3    -5.04348121E-03   # N_43
  4  4    -2.66656862E-02   # N_44
#
BLOCK UMIX  # Chargino Mixing Matrix U
  1  1     7.14493860E-03   # U_11
  1  2     9.99974475E-01   # U_12
  2  1    -9.99974475E-01   # U_21
  2  2     7.14493860E-03   # U_22
#
BLOCK VMIX  # Chargino Mixing Matrix V
  1  1     3.77403154E-02   # V_11
  1  2    -9.99287581E-01   # V_12
  2  1    -9.99287581E-01   # V_21
  2  2    -3.77403154E-02   # V_22
#
BLOCK STOPMIX  # Stop Mixing Matrix
  1  1    -5.03820858E-01   # cos(theta_t)
  1  2     8.63808163E-01   # sin(theta_t)
  2  1    -8.63808163E-01   # -sin(theta_t)
  2  2    -5.03820858E-01   # cos(theta_t)
#
BLOCK SBOTMIX  # Sbottom Mixing Matrix
  1  1     9.97513258E-01   # cos(theta_b)
  1  2    -7.04790757E-02   # sin(theta_b)
  2  1     7.04790757E-02   # -sin(theta_b)
  2  2     9.97513258E-01   # cos(theta_b)
#
BLOCK STAUMIX  # Stau Mixing Matrix
  1  1    -1.02691308E-01   # cos(theta_tau)
  1  2     9.94713273E-01   # sin(theta_tau)
  2  1    -9.94713273E-01   # -sin(theta_tau)
  2  2    -1.02691308E-01   # cos(theta_tau)
#
BLOCK ALPHA  # Higgs mixing
          -1.05484443E-01   # Mixing angle in the neutral Higgs boson sector
#
BLOCK HMIX Q=  5.00074700E+03  # DRbar Higgs Parameters
         1    -8.77645462E+02   # mu(Q)MSSM           
         2     9.46900525E+00   # tan                 
         3     2.41833611E+02   # higgs               
         4     8.54727989E+06   # mA^2(Q)MSSM         
#
BLOCK GAUGE Q=  5.00074700E+03  # The gauge couplings
     1     3.70809838E-01   # gprime(Q) DRbar
     2     6.32634036E-01   # g(Q) DRbar
     3     9.94628992E-01   # g3(Q) DRbar
#
BLOCK AU Q=  5.00074700E+03  # The trilinear couplings
  1  1     5.00000002E+03   # A_u(Q) DRbar
  2  2     5.00000002E+03   # A_c(Q) DRbar
  3  3     5.00000002E+03   # A_t(Q) DRbar
#
BLOCK AD Q=  5.00074700E+03  # The trilinear couplings
  1  1     5.00000001E+03   # A_d(Q) DRbar
  2  2     5.00000001E+03   # A_s(Q) DRbar
  3  3     5.00000001E+03   # A_b(Q) DRbar
#
BLOCK AE Q=  5.00074700E+03  # The trilinear couplings
  1  1     0.00000000E+00   # A_e(Q) DRbar
  2  2     2.64162949E-07   # A_mu(Q) DRbar
  3  3     2.64153472E-07   # A_tau(Q) DRbar
#
BLOCK Yu Q=  5.00074700E+03  # The Yukawa couplings
  1  1     0.00000000E+00   # y_u(Q) DRbar
  2  2     0.00000000E+00   # y_c(Q) DRbar
  3  3     8.21262892E-01   # y_t(Q) DRbar
#
BLOCK Yd Q=  5.00074700E+03  # The Yukawa couplings
  1  1     0.00000000E+00   # y_d(Q) DRbar
  2  2     0.00000000E+00   # y_s(Q) DRbar
  3  3     1.30895818E-01   # y_b(Q) DRbar
#
BLOCK Ye Q=  5.00074700E+03  # The Yukawa couplings
  1  1     0.00000000E+00   # y_e(Q) DRbar
  2  2     0.00000000E+00   # y_mu(Q) DRbar
  3  3     9.68997047E-02   # y_tau(Q) DRbar
#
BLOCK MSOFT Q=  5.00074700E+03  # The soft SUSY breaking masses at the scale Q
         1     6.00000000E+01   # M_1(Q)              
         2     3.00000000E+03   # M_2(Q)              
         3     2.23497200E+03   # M_3(Q)              
        21     7.93284506E+06   # mH1^2(Q)            
        22    -2.01061114E+05   # mH2^2(Q)            
        31     5.00000000E+03   # meL(Q)              
        32     5.00000000E+03   # mmuL(Q)             
        33     5.00000000E+03   # mtauL(Q)            
        34     5.00000000E+03   # meR(Q)              
        35     5.00000000E+03   # mmuR(Q)             
        36     5.00000000E+03   # mtauR(Q)            
        41     4.99999999E+03   # mqL1(Q)             
        42     4.99999999E+03   # mqL2(Q)             
        43     4.99999999E+03   # mqL3(Q)             
        44     4.99999999E+03   # muR(Q)              
        45     4.99999999E+03   # mcR(Q)              
        46     4.99999999E+03   # mtR(Q)              
        47     4.99999999E+03   # mdR(Q)              
        48     4.99999999E+03   # msR(Q)              
        49     4.99999999E+03   # mbR(Q)              
#
#
#
#                             =================
#                             |The decay table|
#                             =================
#
# - The QCD corrections to the decays gluino -> squark  + quark
#                                     squark -> gaugino + quark_prime
#                                     squark -> squark_prime + Higgs
#                                     squark -> gluino  + quark
#   are included.
#
# - The multi-body decays for the inos, stops and sbottoms are included.
#
# - The loop induced decays for the gluino, neutralinos and stops
#   are included.
#
# - The SUSY decays of the top quark are included.
#
#
#         PDG            Width
DECAY         6     1.40251893E+00   # top decays
#          BR         NDA      ID1       ID2
     1.00000000E+00    2           5        24   # BR(t ->  b    W+)
#
#         PDG            Width
DECAY   1000021     5.60896226E-03   # gluino decays
#          BR         NDA      ID1       ID2
     1.42032877E-06    2     1000022        21   # BR(~g -> ~chi_10 g)
     4.78068098E-03    2     1000023        21   # BR(~g -> ~chi_20 g)
     4.69672101E-03    2     1000025        21   # BR(~g -> ~chi_30 g)
#           BR         NDA      ID1       ID2       ID3
     1.66498356E-02    3     1000022         1        -1   # BR(~g -> ~chi_10 d  db)
     2.18297774E-05    3     1000023         1        -1   # BR(~g -> ~chi_20 d  db)
     1.62014607E-05    3     1000025         1        -1   # BR(~g -> ~chi_30 d  db)
     5.67792900E-02    3     1000022         2        -2   # BR(~g -> ~chi_10 u  ub)
     7.89962056E-05    3     1000023         2        -2   # BR(~g -> ~chi_20 u  ub)
     2.03170409E-05    3     1000025         2        -2   # BR(~g -> ~chi_30 u  ub)
     1.66498356E-02    3     1000022         3        -3   # BR(~g -> ~chi_10 s  sb)
     2.18297774E-05    3     1000023         3        -3   # BR(~g -> ~chi_20 s  sb)
     1.62014607E-05    3     1000025         3        -3   # BR(~g -> ~chi_30 s  sb)
     5.67792900E-02    3     1000022         4        -4   # BR(~g -> ~chi_10 c  cb)
     7.89962056E-05    3     1000023         4        -4   # BR(~g -> ~chi_20 c  cb)
     2.03170409E-05    3     1000025         4        -4   # BR(~g -> ~chi_30 c  cb)
     1.69073547E-02    3     1000022         5        -5   # BR(~g -> ~chi_10 b  bb)
     4.93882078E-03    3     1000023         5        -5   # BR(~g -> ~chi_20 b  bb)
     4.89523762E-03    3     1000025         5        -5   # BR(~g -> ~chi_30 b  bb)
     5.82811761E-02    3     1000022         6        -6   # BR(~g -> ~chi_10 t  tb)
     1.89262537E-01    3     1000023         6        -6   # BR(~g -> ~chi_20 t  tb)
     1.76576763E-01    3     1000025         6        -6   # BR(~g -> ~chi_30 t  tb)
     6.23122090E-05    3     1000024         1        -2   # BR(~g -> ~chi_1+ d  ub)
     6.23122090E-05    3    -1000024         2        -1   # BR(~g -> ~chi_1- u  db)
     6.23122090E-05    3     1000024         3        -4   # BR(~g -> ~chi_1+ s  cb)
     6.23122090E-05    3    -1000024         4        -3   # BR(~g -> ~chi_1- c  sb)
     1.96138550E-01    3     1000024         5        -6   # BR(~g -> ~chi_1+ b  tb)
     1.96138550E-01    3    -1000024         6        -5   # BR(~g -> ~chi_1- t  bb)
#
#         PDG            Width
DECAY   1000006     2.86242365E+02   # stop1 decays
#          BR         NDA      ID1       ID2
     3.10784305E-02    2     1000022         6   # BR(~t_1 -> ~chi_10 t )
     1.08089165E-01    2     1000023         6   # BR(~t_1 -> ~chi_20 t )
     1.03784634E-01    2     1000025         6   # BR(~t_1 -> ~chi_30 t )
     7.10675601E-03    2     1000035         6   # BR(~t_1 -> ~chi_40 t )
     1.58748692E-01    2     1000024         5   # BR(~t_1 -> ~chi_1+ b )
     1.41610506E-02    2     1000037         5   # BR(~t_1 -> ~chi_2+ b )
     5.77031272E-01    2     1000021         6   # BR(~t_1 -> ~g      t )
#
#         PDG            Width
DECAY   2000006     2.95097426E+02   # stop2 decays
#          BR         NDA      ID1       ID2
     1.15485242E-02    2     1000022         6   # BR(~t_2 -> ~chi_10 t )
     1.07156895E-01    2     1000023         6   # BR(~t_2 -> ~chi_20 t )
     1.11771797E-01    2     1000025         6   # BR(~t_2 -> ~chi_30 t )
     1.91312028E-02    2     1000035         6   # BR(~t_2 -> ~chi_40 t )
     6.22041600E-02    2     1000024         5   # BR(~t_2 -> ~chi_1+ b )
     3.80716785E-02    2     1000037         5   # BR(~t_2 -> ~chi_2+ b )
     6.46033229E-01    2     1000021         6   # BR(~t_2 -> ~g      t )
     9.35468623E-04    2     1000006        25   # BR(~t_2 -> ~t_1    h )
     3.14704520E-03    2     1000006        23   # BR(~t_2 -> ~t_1    Z )
#
#         PDG            Width
DECAY   1000005     2.69603184E+02   # sbottom1 decays
#          BR         NDA      ID1       ID2
     2.85600091E-03    2     1000022         5   # BR(~b_1 -> ~chi_10 b )
     2.99428224E-03    2     1000023         5   # BR(~b_1 -> ~chi_20 b )
     2.92962194E-03    2     1000025         5   # BR(~b_1 -> ~chi_30 b )
     2.81746534E-02    2     1000035         5   # BR(~b_1 -> ~chi_40 b )
     2.32713009E-01    2    -1000024         6   # BR(~b_1 -> ~chi_1- t )
     5.65982725E-02    2    -1000037         6   # BR(~b_1 -> ~chi_2- t )
     6.71733864E-01    2     1000021         5   # BR(~b_1 -> ~g      b )
     2.00029597E-03    2     1000006       -24   # BR(~b_1 -> ~t_1    W-)
#
#         PDG            Width
DECAY   2000005     1.90591720E+02   # sbottom2 decays
#          BR         NDA      ID1       ID2
     1.53849623E-02    2     1000022         5   # BR(~b_2 -> ~chi_10 b )
     4.24800662E-03    2     1000023         5   # BR(~b_2 -> ~chi_20 b )
     4.34745640E-03    2     1000025         5   # BR(~b_2 -> ~chi_30 b )
     1.93865094E-04    2     1000035         5   # BR(~b_2 -> ~chi_40 b )
     9.98875909E-03    2    -1000024         6   # BR(~b_2 -> ~chi_1- t )
     3.89418371E-04    2    -1000037         6   # BR(~b_2 -> ~chi_2- t )
     9.65386579E-01    2     1000021         5   # BR(~b_2 -> ~g      b )
     6.09530775E-05    2     1000006       -24   # BR(~b_2 -> ~t_1    W-)
#
#         PDG            Width
DECAY   1000002     2.10084264E+02   # sup_L decays
#          BR         NDA      ID1       ID2
     3.54362480E-03    2     1000022         2   # BR(~u_L -> ~chi_10 u)
     7.34794878E-05    2     1000023         2   # BR(~u_L -> ~chi_20 u)
     5.88426983E-06    2     1000025         2   # BR(~u_L -> ~chi_30 u)
     3.76304492E-02    2     1000035         2   # BR(~u_L -> ~chi_40 u)
     2.48854899E-04    2     1000024         1   # BR(~u_L -> ~chi_1+ d)
     7.52113882E-02    2     1000037         1   # BR(~u_L -> ~chi_2+ d)
     8.83286319E-01    2     1000021         2   # BR(~u_L -> ~g      u)
#
#         PDG            Width
DECAY   2000002     1.95883640E+02   # sup_R decays
#          BR         NDA      ID1       ID2
     6.04719996E-02    2     1000022         2   # BR(~u_R -> ~chi_10 u)
     6.46025790E-05    2     1000023         2   # BR(~u_R -> ~chi_20 u)
     7.48553245E-05    2     1000025         2   # BR(~u_R -> ~chi_30 u)
     3.83759747E-09    2     1000035         2   # BR(~u_R -> ~chi_40 u)
     9.39388539E-01    2     1000021         2   # BR(~u_R -> ~g      u)
#
#         PDG            Width
DECAY   1000001     2.10101058E+02   # sdown_L decays
#          BR         NDA      ID1       ID2
     3.52946725E-03    2     1000022         1   # BR(~d_L -> ~chi_10 d)
     2.19378438E-05    2     1000023         1   # BR(~d_L -> ~chi_20 d)
     4.37096086E-05    2     1000025         1   # BR(~d_L -> ~chi_30 d)
     3.76506004E-02    2     1000035         1   # BR(~d_L -> ~chi_40 d)
     8.91956059E-06    2    -1000024         2   # BR(~d_L -> ~chi_1- u)
     7.53317910E-02    2    -1000037         2   # BR(~d_L -> ~chi_2- u)
     8.83413574E-01    2     1000021         1   # BR(~d_L -> ~g      d)
#
#         PDG            Width
DECAY   2000001     1.87004592E+02   # sdown_R decays
#          BR         NDA      ID1       ID2
     1.58367247E-02    2     1000022         1   # BR(~d_R -> ~chi_10 d)
     1.69185820E-05    2     1000023         1   # BR(~d_R -> ~chi_20 d)
     1.96036445E-05    2     1000025         1   # BR(~d_R -> ~chi_30 d)
     1.00514122E-09    2     1000035         1   # BR(~d_R -> ~chi_40 d)
     9.84126752E-01    2     1000021         1   # BR(~d_R -> ~g      d)
#
#         PDG            Width
DECAY   1000004     2.10084264E+02   # scharm_L decays
#          BR         NDA      ID1       ID2
     3.54362480E-03    2     1000022         4   # BR(~c_L -> ~chi_10 c)
     7.34794878E-05    2     1000023         4   # BR(~c_L -> ~chi_20 c)
     5.88426983E-06    2     1000025         4   # BR(~c_L -> ~chi_30 c)
     3.76304492E-02    2     1000035         4   # BR(~c_L -> ~chi_40 c)
     2.48854899E-04    2     1000024         3   # BR(~c_L -> ~chi_1+ s)
     7.52113882E-02    2     1000037         3   # BR(~c_L -> ~chi_2+ s)
     8.83286319E-01    2     1000021         4   # BR(~c_L -> ~g      c)
#
#         PDG            Width
DECAY   2000004     1.95883640E+02   # scharm_R decays
#          BR         NDA      ID1       ID2
     6.04719996E-02    2     1000022         4   # BR(~c_R -> ~chi_10 c)
     6.46025790E-05    2     1000023         4   # BR(~c_R -> ~chi_20 c)
     7.48553245E-05    2     1000025         4   # BR(~c_R -> ~chi_30 c)
     3.83759747E-09    2     1000035         4   # BR(~c_R -> ~chi_40 c)
     9.39388539E-01    2     1000021         4   # BR(~c_R -> ~g      c)
#
#         PDG            Width
DECAY   1000003     2.10101058E+02   # sstrange_L decays
#          BR         NDA      ID1       ID2
     3.52946725E-03    2     1000022         3   # BR(~s_L -> ~chi_10 s)
     2.19378438E-05    2     1000023         3   # BR(~s_L -> ~chi_20 s)
     4.37096086E-05    2     1000025         3   # BR(~s_L -> ~chi_30 s)
     3.76506004E-02    2     1000035         3   # BR(~s_L -> ~chi_40 s)
     8.91956059E-06    2    -1000024         4   # BR(~s_L -> ~chi_1- c)
     7.53317910E-02    2    -1000037         4   # BR(~s_L -> ~chi_2- c)
     8.83413574E-01    2     1000021         3   # BR(~s_L -> ~g      s)
#
#         PDG            Width
DECAY   2000003     1.87004592E+02   # sstrange_R decays
#          BR         NDA      ID1       ID2
     1.58367247E-02    2     1000022         3   # BR(~s_R -> ~chi_10 s)
     1.69185820E-05    2     1000023         3   # BR(~s_R -> ~chi_20 s)
     1.96036445E-05    2     1000025         3   # BR(~s_R -> ~chi_30 s)
     1.00514122E-09    2     1000035         3   # BR(~s_R -> ~chi_40 s)
     9.84126752E-01    2     1000021         3   # BR(~s_R -> ~g      s)
#
#         PDG            Width
DECAY   1000011     3.02775869E+01   # selectron_L decays
#          BR         NDA      ID1       ID2
     2.26259214E-01    2     1000022        11   # BR(~e_L -> ~chi_10 e-)
     1.09868504E-03    2     1000023        11   # BR(~e_L -> ~chi_20 e-)
     2.19131288E-05    2     1000025        11   # BR(~e_L -> ~chi_30 e-)
     2.57343896E-01    2     1000035        11   # BR(~e_L -> ~chi_40 e-)
     6.31170807E-05    2    -1000024        12   # BR(~e_L -> ~chi_1- nu_e)
     5.15213175E-01    2    -1000037        12   # BR(~e_L -> ~chi_2- nu_e)
#
#         PDG            Width
DECAY   2000011     2.73749718E+01   # selectron_R decays
#          BR         NDA      ID1       ID2
     9.97707788E-01    2     1000022        11   # BR(~e_R -> ~chi_10 e-)
     1.06182479E-03    2     1000023        11   # BR(~e_R -> ~chi_20 e-)
     1.23032608E-03    2     1000025        11   # BR(~e_R -> ~chi_30 e-)
     6.10685297E-08    2     1000035        11   # BR(~e_R -> ~chi_40 e-)
#
#         PDG            Width
DECAY   1000013     3.02775869E+01   # smuon_L decays
#          BR         NDA      ID1       ID2
     2.26259214E-01    2     1000022        13   # BR(~mu_L -> ~chi_10 mu-)
     1.09868504E-03    2     1000023        13   # BR(~mu_L -> ~chi_20 mu-)
     2.19131288E-05    2     1000025        13   # BR(~mu_L -> ~chi_30 mu-)
     2.57343896E-01    2     1000035        13   # BR(~mu_L -> ~chi_40 mu-)
     6.31170807E-05    2    -1000024        14   # BR(~mu_L -> ~chi_1- nu_mu)
     5.15213175E-01    2    -1000037        14   # BR(~mu_L -> ~chi_2- nu_mu)
#
#         PDG            Width
DECAY   2000013     2.73749718E+01   # smuon_R decays
#          BR         NDA      ID1       ID2
     9.97707788E-01    2     1000022        13   # BR(~mu_R -> ~chi_10 mu-)
     1.06182479E-03    2     1000023        13   # BR(~mu_R -> ~chi_20 mu-)
     1.23032608E-03    2     1000025        13   # BR(~mu_R -> ~chi_30 mu-)
     6.10685297E-08    2     1000035        13   # BR(~mu_R -> ~chi_40 mu-)
#
#         PDG            Width
DECAY   1000015     2.91464907E+01   # stau_1 decays
#          BR         NDA      ID1       ID2
     9.30372763E-01    2     1000022        15   # BR(~tau_1 -> ~chi_10  tau-)
     1.60465767E-02    2     1000023        15   # BR(~tau_1 -> ~chi_20  tau-)
     1.53745114E-02    2     1000025        15   # BR(~tau_1 -> ~chi_30  tau-)
     2.73282418E-03    2     1000035        15   # BR(~tau_1 -> ~chi_40  tau-)
     3.00023279E-02    2    -1000024        16   # BR(~tau_1 -> ~chi_1-  nu_tau)
     5.47099720E-03    2    -1000037        16   # BR(~tau_1 -> ~chi_2-  nu_tau)
#
#         PDG            Width
DECAY   2000015     3.11203516E+01   # stau_2 decays
#          BR         NDA      ID1       ID2
     2.26326738E-01    2     1000022        15   # BR(~tau_2 -> ~chi_10  tau-)
     1.51060422E-02    2     1000023        15   # BR(~tau_2 -> ~chi_20  tau-)
     1.47755577E-02    2     1000025        15   # BR(~tau_2 -> ~chi_30  tau-)
     2.47731974E-01    2     1000035        15   # BR(~tau_2 -> ~chi_40  tau-)
     8.94047637E-05    2    -1000024        16   # BR(~tau_2 -> ~chi_1-  nu_tau)
     4.95970283E-01    2    -1000037        16   # BR(~tau_2 -> ~chi_2-  nu_tau)
#
#         PDG            Width
DECAY   1000012     3.02804946E+01   # snu_eL decays
#          BR         NDA      ID1       ID2
     2.25891967E-01    2     1000022        12   # BR(~nu_eL -> ~chi_10 nu_e)
     4.47595203E-06    2     1000023        12   # BR(~nu_eL -> ~chi_20 nu_e)
     8.24629816E-04    2     1000025        12   # BR(~nu_eL -> ~chi_30 nu_e)
     2.57393086E-01    2     1000035        12   # BR(~nu_eL -> ~chi_40 nu_e)
     1.76046031E-03    2     1000024        11   # BR(~nu_eL -> ~chi_1+ e-)
     5.14125380E-01    2     1000037        11   # BR(~nu_eL -> ~chi_2+ e-)
#
#         PDG            Width
DECAY   1000014     3.02804946E+01   # snu_muL decays
#          BR         NDA      ID1       ID2
     2.25891967E-01    2     1000022        14   # BR(~nu_muL -> ~chi_10 nu_mu)
     4.47595203E-06    2     1000023        14   # BR(~nu_muL -> ~chi_20 nu_mu)
     8.24629816E-04    2     1000025        14   # BR(~nu_muL -> ~chi_30 nu_mu)
     2.57393086E-01    2     1000035        14   # BR(~nu_muL -> ~chi_40 nu_mu)
     1.76046031E-03    2     1000024        13   # BR(~nu_muL -> ~chi_1+ mu-)
     5.14125380E-01    2     1000037        13   # BR(~nu_muL -> ~chi_2+ mu-)
#
#         PDG            Width
DECAY   1000016     3.11490033E+01   # snu_tauL decays
#          BR         NDA      ID1       ID2
     2.19569598E-01    2     1000022        16   # BR(~nu_tauL -> ~chi_10 nu_tau)
     4.35061423E-06    2     1000023        16   # BR(~nu_tauL -> ~chi_20 nu_tau)
     8.01538069E-04    2     1000025        16   # BR(~nu_tauL -> ~chi_30 nu_tau)
     2.50123491E-01    2     1000035        16   # BR(~nu_tauL -> ~chi_40 nu_tau)
     2.98966754E-02    2     1000024        15   # BR(~nu_tauL -> ~chi_1+ tau-)
     4.99604347E-01    2     1000037        15   # BR(~nu_tauL -> ~chi_2+ tau-)
#
#         PDG            Width
DECAY   1000024     5.46097606E-01   # chargino1+ decays
#          BR         NDA      ID1       ID2
     1.00000000E+00    2     1000022        24   # BR(~chi_1+ -> ~chi_10  W+)
#
#         PDG            Width
DECAY   1000037     2.07630161E+01   # chargino2+ decays
#          BR         NDA      ID1       ID2
     2.53278579E-01    2     1000024        23   # BR(~chi_2+ -> ~chi_1+  Z )
     1.91050586E-04    2     1000022        24   # BR(~chi_2+ -> ~chi_10  W+)
     2.44262393E-01    2     1000023        24   # BR(~chi_2+ -> ~chi_20  W+)
     2.44159980E-01    2     1000025        24   # BR(~chi_2+ -> ~chi_30  W+)
     2.58106524E-01    2     1000024        25   # BR(~chi_2+ -> ~chi_1+  h )
     1.47333993E-06    2     1000022        37   # BR(~chi_2+ -> ~chi_10  H+)
#
#         PDG            Width
DECAY   1000022     0.00000000E+00   # neutralino1 decays
#
#         PDG            Width
DECAY   1000023     5.68918769E-01   # neutralino2 decays
#          BR         NDA      ID1       ID2
     5.35269763E-01    2     1000022        23   # BR(~chi_20 -> ~chi_10   Z )
     4.64730237E-01    2     1000022        25   # BR(~chi_20 -> ~chi_10   h )
#
#         PDG            Width
DECAY   1000025     5.70417091E-01   # neutralino3 decays
#          BR         NDA      ID1       ID2
     4.58684648E-01    2     1000022        23   # BR(~chi_30 -> ~chi_10   Z )
     5.41315352E-01    2     1000022        25   # BR(~chi_30 -> ~chi_10   h )
#
#         PDG            Width
DECAY   1000035     2.07787292E+01   # neutralino4 decays
#          BR         NDA      ID1       ID2
     4.00047371E-05    2     1000022        23   # BR(~chi_40 -> ~chi_10   Z )
     8.03618269E-02    2     1000023        23   # BR(~chi_40 -> ~chi_20   Z )
     1.72221912E-01    2     1000025        23   # BR(~chi_40 -> ~chi_30   Z )
     2.44859003E-01    2     1000024       -24   # BR(~chi_40 -> ~chi_1+   W-)
     2.44859003E-01    2    -1000024        24   # BR(~chi_40 -> ~chi_1-   W+)
     1.50921009E-04    2     1000022        25   # BR(~chi_40 -> ~chi_10   h )
     1.40398228E-06    2     1000022        35   # BR(~chi_40 -> ~chi_10   H )
     1.67911070E-07    2     1000022        36   # BR(~chi_40 -> ~chi_10   A )
     1.76905993E-01    2     1000023        25   # BR(~chi_40 -> ~chi_20   h )
     8.05997650E-02    2     1000025        25   # BR(~chi_40 -> ~chi_30   h )
#
#         PDG            Width
DECAY        25     4.06033184E-03   # h decays
#          BR         NDA      ID1       ID2
     6.07115922E-01    2           5        -5   # BR(h -> b       bb     )
     6.39044677E-02    2         -15        15   # BR(h -> tau+    tau-   )
     2.26244850E-04    2         -13        13   # BR(h -> mu+     mu-    )
     4.79591316E-04    2           3        -3   # BR(h -> s       sb     )
     2.07810894E-02    2           4        -4   # BR(h -> c       cb     )
     6.72749046E-02    2          21        21   # BR(h -> g       g      )
     2.31396668E-03    2          22        22   # BR(h -> gam     gam    )
     1.49597303E-03    2          22        23   # BR(h -> Z       gam    )
     2.11160670E-01    2          24       -24   # BR(h -> W+      W-     )
     2.51821512E-02    2          23        23   # BR(h -> Z       Z      )
     6.50197014E-05    2     1000022   1000022   # BR(h -> ~chi_10 ~chi_10)
#
#         PDG            Width
DECAY        35     8.24285865E+00   # H decays
#          BR         NDA      ID1       ID2
     3.90988637E-01    2           5        -5   # BR(H -> b       bb     )
     6.75751477E-02    2         -15        15   # BR(H -> tau+    tau-   )
     2.38951090E-04    2         -13        13   # BR(H -> mu+     mu-    )
     2.92917428E-04    2           3        -3   # BR(H -> s       sb     )
     1.63910635E-06    2           4        -4   # BR(H -> c       cb     )
     1.63759703E-01    2           6        -6   # BR(H -> t       tb     )
     5.44300760E-05    2          21        21   # BR(H -> g       g      )
     2.37970772E-07    2          22        22   # BR(H -> gam     gam    )
     9.66956160E-08    2          23        22   # BR(H -> Z       gam    )
     7.61130090E-05    2          24       -24   # BR(H -> W+      W-     )
     3.80083345E-05    2          23        23   # BR(H -> Z       Z      )
     2.80606520E-04    2          25        25   # BR(H -> h       h      )
     2.10897544E-23    2          36        36   # BR(H -> A       A      )
     9.65338734E-19    2          23        36   # BR(H -> Z       A      )
     2.29838477E-03    2     1000024  -1000024   # BR(H -> ~chi_1+ ~chi_1-)
     2.16297953E-03    2     1000022   1000022   # BR(H -> ~chi_10 ~chi_10)
     1.59478757E-05    2     1000023   1000023   # BR(H -> ~chi_20 ~chi_20)
     7.54341524E-04    2     1000025   1000025   # BR(H -> ~chi_30 ~chi_30)
     2.23095760E-01    2     1000022   1000023   # BR(H -> ~chi_10 ~chi_20)
     1.47623037E-01    2     1000022   1000025   # BR(H -> ~chi_10 ~chi_30)
     7.43060770E-04    2     1000023   1000025   # BR(H -> ~chi_20 ~chi_30)
#
#         PDG            Width
DECAY        36     8.25689284E+00   # A decays
#          BR         NDA      ID1       ID2
     3.90455468E-01    2           5        -5   # BR(A -> b       bb     )
     6.74621657E-02    2         -15        15   # BR(A -> tau+    tau-   )
     2.38551243E-04    2         -13        13   # BR(A -> mu+     mu-    )
     2.92641127E-04    2           3        -3   # BR(A -> s       sb     )
     1.64298060E-06    2           4        -4   # BR(A -> c       cb     )
     1.64056206E-01    2           6        -6   # BR(A -> t       tb     )
     1.62337497E-04    2          21        21   # BR(A -> g       g      )
     5.87907674E-07    2          22        22   # BR(A -> gam     gam    )
     1.96609299E-07    2          23        22   # BR(A -> Z       gam    )
     7.56955442E-05    2          23        25   # BR(A -> Z       h      )
     3.30932129E-03    2     1000024  -1000024   # BR(A -> ~chi_1+ ~chi_1-)
     2.19718772E-03    2     1000022   1000022   # BR(A -> ~chi_10 ~chi_10)
     1.62666489E-05    2     1000023   1000023   # BR(A -> ~chi_20 ~chi_20)
     1.80498512E-03    2     1000025   1000025   # BR(A -> ~chi_30 ~chi_30)
     1.49637003E-01    2     1000022   1000023   # BR(A -> ~chi_10 ~chi_20)
     2.20012908E-01    2     1000022   1000025   # BR(A -> ~chi_10 ~chi_30)
     2.76835824E-04    2     1000023   1000025   # BR(A -> ~chi_20 ~chi_30)
#
#         PDG            Width
DECAY        37     8.22451540E+00   # H+ decays
#          BR         NDA      ID1       ID2
     6.29232718E-04    2           4        -5   # BR(H+ -> c       bb     )
     6.77597727E-02    2         -15        16   # BR(H+ -> tau+    nu_tau )
     2.39603603E-04    2         -13        14   # BR(H+ -> mu+     nu_mu  )
     4.02706855E-06    2           2        -5   # BR(H+ -> u       bb     )
     1.40591157E-05    2           2        -3   # BR(H+ -> u       sb     )
     2.90743938E-04    2           4        -3   # BR(H+ -> c       sb     )
     5.54557141E-01    2           6        -5   # BR(H+ -> t       bb     )
     7.61504319E-05    2          24        25   # BR(H+ -> W+      h      )
     9.18273714E-13    2          24        36   # BR(H+ -> W+      A      )
     3.75286343E-01    2     1000024   1000022   # BR(H+ -> ~chi_1+ ~chi_10)
     1.12118468E-03    2     1000024   1000023   # BR(H+ -> ~chi_1+ ~chi_20)
     2.17408701E-05    2     1000024   1000025   # BR(H+ -> ~chi_1+ ~chi_30)
