#
#                              ======================
#                              | THE SUSYHIT OUTPUT |
#                              ======================
#
#
#              ------------------------------------------------------
#              |     This is the output of the SUSY-HIT package     |
#              |  created by A.Djouadi, M.Muehlleitner and M.Spira. |
#              |  In case of problems with SUSY-HIT email to        |
#              |           margarete.muehlleitner@cern.ch           |
#              |           michael.spira@psi.ch                     |
#              |           abdelhak.djouadi@cern.ch                 |
#              ------------------------------------------------------
#
#              ------------------------------------------------------
#              |  SUSY Les Houches Accord - MSSM Spectrum + Decays  |
#              |              based on the decay programs           |
#              |                                                    |
#              |                     SDECAY 1.3b                    |
#              |                                                    |
#              |  Authors: M.Muhlleitner, A.Djouadi and Y.Mambrini  |
#              |  Ref.:    Comput.Phys.Commun.168(2005)46           |
#              |           [hep-ph/0311167]                         |
#              |                                                    |
#              |                     HDECAY 3.4                     |
#              |                                                    |
#              |  By: A.Djouadi,J.Kalinowski,M.Muhlleitner,M.Spira  |
#              |  Ref.:    Comput.Phys.Commun.108(1998)56           |
#              |           [hep-ph/9704448]                         |
#              |                                                    |
#              |                                                    |
#              |  If not stated otherwise all DRbar couplings and   |
#              |  soft SUSY breaking masses are given at the scale  |
#              |  Q=  0.50007119E+04
#              |                                                    |
#              ------------------------------------------------------
#
#
BLOCK DCINFO  # Decay Program information
     1   SDECAY/HDECAY # decay calculator
     2   1.3b  /3.4    # version number
#
BLOCK SPINFO  # Spectrum calculator information
     1    SOFTSUSY    # spectrum calculator                
     2    3.4.0       # version number                     
#
BLOCK MODSEL  # Model selection
     1     0   #  nonUniversal                                     
#
BLOCK SMINPUTS  # Standard Model inputs
         1     1.25778332E+02   # alpha_em^-1(M_Z)^MSbar
         2     1.16570000E-05   # G_F [GeV^-2]
         3     1.17200002E-01   # alpha_S(M_Z)^MSbar
         4     9.11876000E+01   # M_Z pole mass
         5     4.25000000E+00   # mb(mb)^MSbar
         6     1.72500000E+02   # mt pole mass
         7     1.77682000E+00   # mtau pole mass
#
BLOCK MINPAR  # Input parameters - minimal models
         3     1.00000000E+01   # tanb                
#
BLOCK EXTPAR  # Input parameters - non-minimal models
         0    -1.00000000E+00   # Set                 
         1     6.00000000E+01   # M_1(MX)             
         2     3.00000000E+03   # M_2(MX)             
         3     1.03377700E+03   # M_3(MX)             
        11     5.00000000E+03   # At(MX)              
        12     5.00000000E+03   # Ab(MX)              
        13     0.00000000E+00   # Atau(MX)            
        23    -1.44702300E+03   # mu(MX)              
        26     3.00000000E+03   # mA(pole)            
        31     5.00000000E+03   # meL(MX)             
        32     5.00000000E+03   # mmuL(MX)            
        33     5.00000000E+03   # mtauL(MX)           
        34     5.00000000E+03   # meR(MX)             
        35     5.00000000E+03   # mmuR(MX)            
        36     5.00000000E+03   # mtauR(MX)           
        41     5.00000000E+03   # mqL1(MX)            
        42     5.00000000E+03   # mqL2(MX)            
        43     5.00000000E+03   # mqL3(MX)            
        44     5.00000000E+03   # muR(MX)             
        45     5.00000000E+03   # mcR(MX)             
        46     5.00000000E+03   # mtR(MX)             
        47     5.00000000E+03   # mdR(MX)             
        48     5.00000000E+03   # msR(MX)             
        49     5.00000000E+03   # mbR(MX)             
#
BLOCK MASS  # Mass Spectrum
# PDG code           mass       particle
        24     8.00948650E+01   # W+
        25     1.24523526E+02   # h
        35     3.00008764E+03   # H
        36     2.99999996E+03   # A
        37     3.00087865E+03   # H+
         5     4.87878001E+00   # b-quark pole mass calculated from mb(mb)_Msbar
   1000001     5.06523980E+03   # ~d_L
   2000001     5.04743614E+03   # ~d_R
   1000002     5.06476361E+03   # ~u_L
   2000002     5.04716046E+03   # ~u_R
   1000003     5.06523980E+03   # ~s_L
   2000003     5.04743614E+03   # ~s_R
   1000004     5.06476361E+03   # ~c_L
   2000004     5.04716046E+03   # ~c_R
   1000005     5.01159769E+03   # ~b_1
   2000005     5.04634075E+03   # ~b_2
   1000006     4.90243074E+03   # ~t_1
   2000006     5.05844441E+03   # ~t_2
   1000011     5.01905127E+03   # ~e_L
   2000011     5.00591072E+03   # ~e_R
   1000012     5.01810289E+03   # ~nu_eL
   1000013     5.01905127E+03   # ~mu_L
   2000013     5.00591072E+03   # ~mu_R
   1000014     5.01810289E+03   # ~nu_muL
   1000015     5.00437038E+03   # ~tau_1
   2000015     5.01900569E+03   # ~tau_2
   1000016     5.01756389E+03   # ~nu_tauL
   1000021     1.30000082E+03   # ~g
   1000022     6.03027666E+01   # ~chi_10
   1000023     1.49944701E+03   # ~chi_20
   1000025    -1.50189707E+03   # ~chi_30
   1000035     3.07433361E+03   # ~chi_40
   1000024     1.50000011E+03   # ~chi_1+
   1000037     3.07450114E+03   # ~chi_2+
#
BLOCK NMIX  # Neutralino Mixing Matrix
  1  1     9.99556152E-01   # N_11
  1  2     1.39885851E-04   # N_12
  1  3    -2.97287831E-02   # N_13
  1  4     1.91801657E-03   # N_14
  2  1     1.96647886E-02   # N_21
  2  2     3.09021323E-02   # N_22
  2  3     7.06897637E-01   # N_23
  2  4     7.06366821E-01   # N_24
  3  1    -2.23739055E-02   # N_31
  3  2     1.32667594E-02   # N_32
  3  3    -7.06580740E-01   # N_33
  3  4     7.07154197E-01   # N_34
  4  1    -4.50933511E-04   # N_41
  4  2     9.99434356E-01   # N_42
  4  3    -1.24735045E-02   # N_43
  4  4    -3.12278176E-02   # N_44
#
BLOCK UMIX  # Chargino Mixing Matrix U
  1  1     1.76496298E-02   # U_11
  1  2     9.99844233E-01   # U_12
  2  1    -9.99844233E-01   # U_21
  2  2     1.76496298E-02   # U_22
#
BLOCK VMIX  # Chargino Mixing Matrix V
  1  1     4.41817786E-02   # V_11
  1  2    -9.99023508E-01   # V_12
  2  1    -9.99023508E-01   # V_21
  2  2    -4.41817786E-02   # V_22
#
BLOCK STOPMIX  # Stop Mixing Matrix
  1  1    -5.13354876E-01   # cos(theta_t)
  1  2     8.58176422E-01   # sin(theta_t)
  2  1    -8.58176422E-01   # -sin(theta_t)
  2  2    -5.13354876E-01   # cos(theta_t)
#
BLOCK SBOTMIX  # Sbottom Mixing Matrix
  1  1     9.94451829E-01   # cos(theta_b)
  1  2    -1.05192965E-01   # sin(theta_b)
  2  1     1.05192965E-01   # -sin(theta_b)
  2  2     9.94451829E-01   # cos(theta_b)
#
BLOCK STAUMIX  # Stau Mixing Matrix
  1  1    -1.68205765E-01   # cos(theta_tau)
  1  2     9.85751906E-01   # sin(theta_tau)
  2  1    -9.85751906E-01   # -sin(theta_tau)
  2  2    -1.68205765E-01   # cos(theta_tau)
#
BLOCK ALPHA  # Higgs mixing
          -1.05436102E-01   # Mixing angle in the neutral Higgs boson sector
#
BLOCK HMIX Q=  5.00071194E+03  # DRbar Higgs Parameters
         1    -1.47310398E+03   # mu(Q)MSSM           
         2     9.47281702E+00   # tan                 
         3     2.41993994E+02   # higgs               
         4     8.39541609E+06   # mA^2(Q)MSSM         
#
BLOCK GAUGE Q=  5.00071194E+03  # The gauge couplings
     1     3.70715874E-01   # gprime(Q) DRbar
     2     6.32127442E-01   # g(Q) DRbar
     3     1.00479357E+00   # g3(Q) DRbar
#
BLOCK AU Q=  5.00071194E+03  # The trilinear couplings
  1  1     5.00000001E+03   # A_u(Q) DRbar
  2  2     5.00000001E+03   # A_c(Q) DRbar
  3  3     5.00000001E+03   # A_t(Q) DRbar
#
BLOCK AD Q=  5.00071194E+03  # The trilinear couplings
  1  1     5.00000000E+03   # A_d(Q) DRbar
  2  2     5.00000000E+03   # A_s(Q) DRbar
  3  3     5.00000001E+03   # A_b(Q) DRbar
#
BLOCK AE Q=  5.00071194E+03  # The trilinear couplings
  1  1     0.00000000E+00   # A_e(Q) DRbar
  2  2     6.62588033E-08   # A_mu(Q) DRbar
  3  3     6.54753416E-08   # A_tau(Q) DRbar
#
BLOCK Yu Q=  5.00071194E+03  # The Yukawa couplings
  1  1     0.00000000E+00   # y_u(Q) DRbar
  2  2     0.00000000E+00   # y_c(Q) DRbar
  3  3     8.16236551E-01   # y_t(Q) DRbar
#
BLOCK Yd Q=  5.00071194E+03  # The Yukawa couplings
  1  1     0.00000000E+00   # y_d(Q) DRbar
  2  2     0.00000000E+00   # y_s(Q) DRbar
  3  3     1.30297920E-01   # y_b(Q) DRbar
#
BLOCK Ye Q=  5.00071194E+03  # The Yukawa couplings
  1  1     0.00000000E+00   # y_e(Q) DRbar
  2  2     0.00000000E+00   # y_mu(Q) DRbar
  3  3     9.66408229E-02   # y_tau(Q) DRbar
#
BLOCK MSOFT Q=  5.00071194E+03  # The soft SUSY breaking masses at the scale Q
         1     6.00000000E+01   # M_1(Q)              
         2     3.00000000E+03   # M_2(Q)              
         3     1.03377700E+03   # M_3(Q)              
        21     6.49950648E+06   # mH1^2(Q)            
        22    -1.62464860E+06   # mH2^2(Q)            
        31     5.00000000E+03   # meL(Q)              
        32     5.00000000E+03   # mmuL(Q)             
        33     5.00000000E+03   # mtauL(Q)            
        34     5.00000000E+03   # meR(Q)              
        35     5.00000000E+03   # mmuR(Q)             
        36     5.00000000E+03   # mtauR(Q)            
        41     5.00000000E+03   # mqL1(Q)             
        42     5.00000000E+03   # mqL2(Q)             
        43     5.00000000E+03   # mqL3(Q)             
        44     5.00000000E+03   # muR(Q)              
        45     5.00000000E+03   # mcR(Q)              
        46     5.00000000E+03   # mtR(Q)              
        47     5.00000000E+03   # mdR(Q)              
        48     5.00000000E+03   # msR(Q)              
        49     5.00000000E+03   # mbR(Q)              
#
#
#
#                             =================
#                             |The decay table|
#                             =================
#
# - The QCD corrections to the decays gluino -> squark  + quark
#                                     squark -> gaugino + quark_prime
#                                     squark -> squark_prime + Higgs
#                                     squark -> gluino  + quark
#   are included.
#
# - The multi-body decays for the inos, stops and sbottoms are included.
#
# - The loop induced decays for the gluino, neutralinos and stops
#   are included.
#
# - The SUSY decays of the top quark are included.
#
#
#         PDG            Width
DECAY         6     1.40028767E+00   # top decays
#          BR         NDA      ID1       ID2
     1.00000000E+00    2           5        24   # BR(t ->  b    W+)
#
#         PDG            Width
DECAY   1000021     3.27568600E-05   # gluino decays
#          BR         NDA      ID1       ID2
     1.41170525E-05    2     1000022        21   # BR(~g -> ~chi_10 g)
#           BR         NDA      ID1       ID2       ID3
     7.94330935E-02    3     1000022         1        -1   # BR(~g -> ~chi_10 d  db)
     2.70784084E-01    3     1000022         2        -2   # BR(~g -> ~chi_10 u  ub)
     7.94330935E-02    3     1000022         3        -3   # BR(~g -> ~chi_10 s  sb)
     2.70784084E-01    3     1000022         4        -4   # BR(~g -> ~chi_10 c  cb)
     8.03969142E-02    3     1000022         5        -5   # BR(~g -> ~chi_10 b  bb)
     2.19154614E-01    3     1000022         6        -6   # BR(~g -> ~chi_10 t  tb)
#
#         PDG            Width
DECAY   1000006     3.85396719E+02   # stop1 decays
#          BR         NDA      ID1       ID2
     2.27459770E-02    2     1000022         6   # BR(~t_1 -> ~chi_10 t )
     7.00672062E-02    2     1000023         6   # BR(~t_1 -> ~chi_20 t )
     6.73088520E-02    2     1000025         6   # BR(~t_1 -> ~chi_30 t )
     5.67697431E-03    2     1000035         6   # BR(~t_1 -> ~chi_40 t )
     1.00326419E-01    2     1000024         5   # BR(~t_1 -> ~chi_1+ b )
     1.12919424E-02    2     1000037         5   # BR(~t_1 -> ~chi_2+ b )
     7.22582629E-01    2     1000021         6   # BR(~t_1 -> ~g      t )
#
#         PDG            Width
DECAY   2000006     3.92052302E+02   # stop2 decays
#          BR         NDA      ID1       ID2
     9.18904823E-03    2     1000022         6   # BR(~t_2 -> ~chi_10 t )
     7.13179412E-02    2     1000023         6   # BR(~t_2 -> ~chi_20 t )
     7.42541584E-02    2     1000025         6   # BR(~t_2 -> ~chi_30 t )
     1.37872561E-02    2     1000035         6   # BR(~t_2 -> ~chi_40 t )
     4.42381447E-02    2     1000024         5   # BR(~t_2 -> ~chi_1+ b )
     2.73777318E-02    2     1000037         5   # BR(~t_2 -> ~chi_2+ b )
     7.56458693E-01    2     1000021         6   # BR(~t_2 -> ~g      t )
     7.38932211E-04    2     1000006        25   # BR(~t_2 -> ~t_1    h )
     2.63809464E-03    2     1000006        23   # BR(~t_2 -> ~t_1    Z )
#
#         PDG            Width
DECAY   1000005     3.70204380E+02   # sbottom1 decays
#          BR         NDA      ID1       ID2
     2.11614772E-03    2     1000022         5   # BR(~b_1 -> ~chi_10 b )
     1.98102183E-03    2     1000023         5   # BR(~b_1 -> ~chi_20 b )
     1.87363981E-03    2     1000025         5   # BR(~b_1 -> ~chi_30 b )
     2.01179722E-02    2     1000035         5   # BR(~b_1 -> ~chi_40 b )
     1.48057709E-01    2    -1000024         6   # BR(~b_1 -> ~chi_1- t )
     4.04957402E-02    2    -1000037         6   # BR(~b_1 -> ~chi_2- t )
     7.83837048E-01    2     1000021         5   # BR(~b_1 -> ~g      b )
     1.52072123E-03    2     1000006       -24   # BR(~b_1 -> ~t_1    W-)
#
#         PDG            Width
DECAY   2000005     2.99206041E+02   # sbottom2 decays
#          BR         NDA      ID1       ID2
     9.79485208E-03    2     1000022         5   # BR(~b_2 -> ~chi_10 b )
     2.34766536E-03    2     1000023         5   # BR(~b_2 -> ~chi_20 b )
     2.45256394E-03    2     1000025         5   # BR(~b_2 -> ~chi_30 b )
     2.97751660E-04    2     1000035         5   # BR(~b_2 -> ~chi_40 b )
     6.77313562E-03    2    -1000024         6   # BR(~b_2 -> ~chi_1- t )
     5.99078202E-04    2    -1000037         6   # BR(~b_2 -> ~chi_2- t )
     9.77647683E-01    2     1000021         5   # BR(~b_2 -> ~g      b )
     8.72698921E-05    2     1000006       -24   # BR(~b_2 -> ~t_1    W-)
#
#         PDG            Width
DECAY   1000002     3.18018039E+02   # sup_L decays
#          BR         NDA      ID1       ID2
     2.34989602E-03    2     1000022         2   # BR(~u_L -> ~chi_10 u)
     6.18045052E-05    2     1000023         2   # BR(~u_L -> ~chi_20 u)
     4.04597952E-06    2     1000025         2   # BR(~u_L -> ~chi_30 u)
     2.45386457E-02    2     1000035         2   # BR(~u_L -> ~chi_40 u)
     1.99828419E-04    2     1000024         1   # BR(~u_L -> ~chi_1+ d)
     4.90393995E-02    2     1000037         1   # BR(~u_L -> ~chi_2+ d)
     9.23806380E-01    2     1000021         2   # BR(~u_L -> ~g      u)
#
#         PDG            Width
DECAY   2000002     3.04384440E+02   # sup_R decays
#          BR         NDA      ID1       ID2
     3.90892044E-02    2     1000022         2   # BR(~u_R -> ~chi_10 u)
     1.25852680E-05    2     1000023         2   # BR(~u_R -> ~chi_20 u)
     1.62814156E-05    2     1000025         2   # BR(~u_R -> ~chi_30 u)
     3.15489895E-09    2     1000035         2   # BR(~u_R -> ~chi_40 u)
     9.60881926E-01    2     1000021         2   # BR(~u_R -> ~g      u)
#
#         PDG            Width
DECAY   1000001     3.18029723E+02   # sdown_L decays
#          BR         NDA      ID1       ID2
     2.34331180E-03    2     1000022         1   # BR(~d_L -> ~chi_10 d)
     3.74828640E-05    2     1000023         1   # BR(~d_L -> ~chi_20 d)
     1.59218582E-05    2     1000025         1   # BR(~d_L -> ~chi_30 d)
     2.45540629E-02    2     1000035         1   # BR(~d_L -> ~chi_40 d)
     3.18920712E-05    2    -1000024         2   # BR(~d_L -> ~chi_1- u)
     4.91335326E-02    2    -1000037         2   # BR(~d_L -> ~chi_2- u)
     9.23883796E-01    2     1000021         1   # BR(~d_L -> ~g      d)
#
#         PDG            Width
DECAY   2000001     2.95474920E+02   # sdown_R decays
#          BR         NDA      ID1       ID2
     1.00675200E-02    2     1000022         1   # BR(~d_R -> ~chi_10 d)
     3.24143454E-06    2     1000023         1   # BR(~d_R -> ~chi_20 d)
     4.19340669E-06    2     1000025         1   # BR(~d_R -> ~chi_30 d)
     8.12655769E-10    2     1000035         1   # BR(~d_R -> ~chi_40 d)
     9.89925044E-01    2     1000021         1   # BR(~d_R -> ~g      d)
#
#         PDG            Width
DECAY   1000004     3.18018039E+02   # scharm_L decays
#          BR         NDA      ID1       ID2
     2.34989602E-03    2     1000022         4   # BR(~c_L -> ~chi_10 c)
     6.18045052E-05    2     1000023         4   # BR(~c_L -> ~chi_20 c)
     4.04597952E-06    2     1000025         4   # BR(~c_L -> ~chi_30 c)
     2.45386457E-02    2     1000035         4   # BR(~c_L -> ~chi_40 c)
     1.99828419E-04    2     1000024         3   # BR(~c_L -> ~chi_1+ s)
     4.90393995E-02    2     1000037         3   # BR(~c_L -> ~chi_2+ s)
     9.23806380E-01    2     1000021         4   # BR(~c_L -> ~g      c)
#
#         PDG            Width
DECAY   2000004     3.04384440E+02   # scharm_R decays
#          BR         NDA      ID1       ID2
     3.90892044E-02    2     1000022         4   # BR(~c_R -> ~chi_10 c)
     1.25852680E-05    2     1000023         4   # BR(~c_R -> ~chi_20 c)
     1.62814156E-05    2     1000025         4   # BR(~c_R -> ~chi_30 c)
     3.15489895E-09    2     1000035         4   # BR(~c_R -> ~chi_40 c)
     9.60881926E-01    2     1000021         4   # BR(~c_R -> ~g      c)
#
#         PDG            Width
DECAY   1000003     3.18029723E+02   # sstrange_L decays
#          BR         NDA      ID1       ID2
     2.34331180E-03    2     1000022         3   # BR(~s_L -> ~chi_10 s)
     3.74828640E-05    2     1000023         3   # BR(~s_L -> ~chi_20 s)
     1.59218582E-05    2     1000025         3   # BR(~s_L -> ~chi_30 s)
     2.45540629E-02    2     1000035         3   # BR(~s_L -> ~chi_40 s)
     3.18920712E-05    2    -1000024         4   # BR(~s_L -> ~chi_1- c)
     4.91335326E-02    2    -1000037         4   # BR(~s_L -> ~chi_2- c)
     9.23883796E-01    2     1000021         3   # BR(~s_L -> ~g      s)
#
#         PDG            Width
DECAY   2000003     2.95474920E+02   # sstrange_R decays
#          BR         NDA      ID1       ID2
     1.00675200E-02    2     1000022         3   # BR(~s_R -> ~chi_10 s)
     3.24143454E-06    2     1000023         3   # BR(~s_R -> ~chi_20 s)
     4.19340669E-06    2     1000025         3   # BR(~s_R -> ~chi_30 s)
     8.12655769E-10    2     1000035         3   # BR(~s_R -> ~chi_40 s)
     9.89925044E-01    2     1000021         3   # BR(~s_R -> ~g      s)
#
#         PDG            Width
DECAY   1000011     3.02403330E+01   # selectron_L decays
#          BR         NDA      ID1       ID2
     2.26732525E-01    2     1000022        11   # BR(~e_L -> ~chi_10 e-)
     9.85332754E-04    2     1000023        11   # BR(~e_L -> ~chi_20 e-)
     1.15632562E-08    2     1000025        11   # BR(~e_L -> ~chi_30 e-)
     2.57104787E-01    2     1000035        11   # BR(~e_L -> ~chi_40 e-)
     3.40862432E-04    2    -1000024        12   # BR(~e_L -> ~chi_1- nu_e)
     5.14836481E-01    2    -1000037        12   # BR(~e_L -> ~chi_2- nu_e)
#
#         PDG            Width
DECAY   2000011     2.73610919E+01   # selectron_R decays
#          BR         NDA      ID1       ID2
     9.99264644E-01    2     1000022        11   # BR(~e_R -> ~chi_10 e-)
     3.20567441E-04    2     1000023        11   # BR(~e_R -> ~chi_20 e-)
     4.14709892E-04    2     1000025        11   # BR(~e_R -> ~chi_30 e-)
     7.89146966E-08    2     1000035        11   # BR(~e_R -> ~chi_40 e-)
#
#         PDG            Width
DECAY   1000013     3.02403330E+01   # smuon_L decays
#          BR         NDA      ID1       ID2
     2.26732525E-01    2     1000022        13   # BR(~mu_L -> ~chi_10 mu-)
     9.85332754E-04    2     1000023        13   # BR(~mu_L -> ~chi_20 mu-)
     1.15632562E-08    2     1000025        13   # BR(~mu_L -> ~chi_30 mu-)
     2.57104787E-01    2     1000035        13   # BR(~mu_L -> ~chi_40 mu-)
     3.40862432E-04    2    -1000024        14   # BR(~mu_L -> ~chi_1- nu_mu)
     5.14836481E-01    2    -1000037        14   # BR(~mu_L -> ~chi_2- nu_mu)
#
#         PDG            Width
DECAY   2000013     2.73610919E+01   # smuon_R decays
#          BR         NDA      ID1       ID2
     9.99264644E-01    2     1000022        13   # BR(~mu_R -> ~chi_10 mu-)
     3.20567441E-04    2     1000023        13   # BR(~mu_R -> ~chi_20 mu-)
     4.14709892E-04    2     1000025        13   # BR(~mu_R -> ~chi_30 mu-)
     7.89146966E-08    2     1000035        13   # BR(~mu_R -> ~chi_40 mu-)
#
#         PDG            Width
DECAY   1000015     2.89735117E+01   # stau_1 decays
#          BR         NDA      ID1       ID2
     9.24232853E-01    2     1000022        15   # BR(~tau_1 -> ~chi_10  tau-)
     1.41679699E-02    2     1000023        15   # BR(~tau_1 -> ~chi_20  tau-)
     1.28864657E-02    2     1000025        15   # BR(~tau_1 -> ~chi_30  tau-)
     7.28091548E-03    2     1000035        15   # BR(~tau_1 -> ~chi_40  tau-)
     2.68521650E-02    2    -1000024        16   # BR(~tau_1 -> ~chi_1-  nu_tau)
     1.45796306E-02    2    -1000037        16   # BR(~tau_1 -> ~chi_2-  nu_tau)
#
#         PDG            Width
DECAY   2000015     3.09276401E+01   # stau_2 decays
#          BR         NDA      ID1       ID2
     2.39719211E-01    2     1000022        15   # BR(~tau_2 -> ~chi_10  tau-)
     1.29172885E-02    2     1000023        15   # BR(~tau_2 -> ~chi_20  tau-)
     1.32047009E-02    2     1000025        15   # BR(~tau_2 -> ~chi_30  tau-)
     2.44496784E-01    2     1000035        15   # BR(~tau_2 -> ~chi_40  tau-)
     7.39443072E-05    2    -1000024        16   # BR(~tau_2 -> ~chi_1-  nu_tau)
     4.89588071E-01    2    -1000037        16   # BR(~tau_2 -> ~chi_2-  nu_tau)
#
#         PDG            Width
DECAY   1000012     3.02423739E+01   # snu_eL decays
#          BR         NDA      ID1       ID2
     2.26458096E-01    2     1000022        12   # BR(~nu_eL -> ~chi_10 nu_e)
     2.05228250E-04    2     1000023        12   # BR(~nu_eL -> ~chi_20 nu_e)
     3.80658041E-04    2     1000025        12   # BR(~nu_eL -> ~chi_30 nu_e)
     2.57194249E-01    2     1000035        12   # BR(~nu_eL -> ~chi_40 nu_e)
     2.13525990E-03    2     1000024        11   # BR(~nu_eL -> ~chi_1+ e-)
     5.13626509E-01    2     1000037        11   # BR(~nu_eL -> ~chi_2+ e-)
#
#         PDG            Width
DECAY   1000014     3.02423739E+01   # snu_muL decays
#          BR         NDA      ID1       ID2
     2.26458096E-01    2     1000022        14   # BR(~nu_muL -> ~chi_10 nu_mu)
     2.05228250E-04    2     1000023        14   # BR(~nu_muL -> ~chi_20 nu_mu)
     3.80658041E-04    2     1000025        14   # BR(~nu_muL -> ~chi_30 nu_mu)
     2.57194249E-01    2     1000035        14   # BR(~nu_muL -> ~chi_40 nu_mu)
     2.13525990E-03    2     1000024        13   # BR(~nu_muL -> ~chi_1+ mu-)
     5.13626509E-01    2     1000037        13   # BR(~nu_muL -> ~chi_2+ mu-)
#
#         PDG            Width
DECAY   1000016     3.10060957E+01   # snu_tauL decays
#          BR         NDA      ID1       ID2
     2.20856390E-01    2     1000022        16   # BR(~nu_tauL -> ~chi_10 nu_tau)
     2.00143269E-04    2     1000023        16   # BR(~nu_tauL -> ~chi_20 nu_tau)
     3.71226346E-04    2     1000025        16   # BR(~nu_tauL -> ~chi_30 nu_tau)
     2.50767503E-01    2     1000035        16   # BR(~nu_tauL -> ~chi_40 nu_tau)
     2.70112506E-02    2     1000024        15   # BR(~nu_tauL -> ~chi_1+ tau-)
     5.00793487E-01    2     1000037        15   # BR(~nu_tauL -> ~chi_2+ tau-)
#
#         PDG            Width
DECAY   1000024     9.22994831E-01   # chargino1+ decays
#          BR         NDA      ID1       ID2
     1.00000000E+00    2     1000022        24   # BR(~chi_1+ -> ~chi_10  W+)
#
#         PDG            Width
DECAY   1000037     1.84064444E+01   # chargino2+ decays
#          BR         NDA      ID1       ID2
     2.52713532E-01    2     1000024        23   # BR(~chi_2+ -> ~chi_1+  Z )
     2.61254098E-04    2     1000022        24   # BR(~chi_2+ -> ~chi_10  W+)
     2.44037358E-01    2     1000023        24   # BR(~chi_2+ -> ~chi_20  W+)
     2.43697428E-01    2     1000025        24   # BR(~chi_2+ -> ~chi_30  W+)
     2.59290064E-01    2     1000024        25   # BR(~chi_2+ -> ~chi_1+  h )
     3.63813855E-07    2     1000022        37   # BR(~chi_2+ -> ~chi_10  H+)
#
#         PDG            Width
DECAY   1000022     0.00000000E+00   # neutralino1 decays
#
#         PDG            Width
DECAY   1000023     9.69850732E-01   # neutralino2 decays
#          BR         NDA      ID1       ID2
     5.56502674E-01    2     1000022        23   # BR(~chi_20 -> ~chi_10   Z )
     4.43497326E-01    2     1000022        25   # BR(~chi_20 -> ~chi_10   h )
#
#         PDG            Width
DECAY   1000025     9.79414156E-01   # neutralino3 decays
#          BR         NDA      ID1       ID2
     4.26515460E-01    2     1000022        23   # BR(~chi_30 -> ~chi_10   Z )
     5.73484540E-01    2     1000022        25   # BR(~chi_30 -> ~chi_10   h )
#
#         PDG            Width
DECAY   1000035     1.84067614E+01   # neutralino4 decays
#          BR         NDA      ID1       ID2
     9.39698782E-05    2     1000022        23   # BR(~chi_40 -> ~chi_10   Z )
     3.95249660E-02    2     1000023        23   # BR(~chi_40 -> ~chi_20   Z )
     2.12656368E-01    2     1000025        23   # BR(~chi_40 -> ~chi_30   Z )
     2.44342467E-01    2     1000024       -24   # BR(~chi_40 -> ~chi_1+   W-)
     2.44342467E-01    2    -1000024        24   # BR(~chi_40 -> ~chi_1-   W+)
     1.73526541E-04    2     1000022        25   # BR(~chi_40 -> ~chi_10   h )
     3.27865374E-07    2     1000022        35   # BR(~chi_40 -> ~chi_10   H )
     4.93150724E-08    2     1000022        36   # BR(~chi_40 -> ~chi_10   A )
     2.19385802E-01    2     1000023        25   # BR(~chi_40 -> ~chi_20   h )
     3.94800563E-02    2     1000025        25   # BR(~chi_40 -> ~chi_30   h )
#
#         PDG            Width
DECAY        25     4.02773295E-03   # h decays
#          BR         NDA      ID1       ID2
     6.12379981E-01    2           5        -5   # BR(h -> b       bb     )
     6.42612054E-02    2         -15        15   # BR(h -> tau+    tau-   )
     2.27509141E-04    2         -13        13   # BR(h -> mu+     mu-    )
     4.82494965E-04    2           3        -3   # BR(h -> s       sb     )
     2.09093790E-02    2           4        -4   # BR(h -> c       cb     )
     6.73471182E-02    2          21        21   # BR(h -> g       g      )
     2.30998514E-03    2          22        22   # BR(h -> gam     gam    )
     1.46829487E-03    2          22        23   # BR(h -> Z       gam    )
     2.06125708E-01    2          24       -24   # BR(h -> W+      W-     )
     2.44582399E-02    2          23        23   # BR(h -> Z       Z      )
     3.00841928E-05    2     1000022   1000022   # BR(h -> ~chi_10 ~chi_10)
#
#         PDG            Width
DECAY        35     7.26120166E+00   # H decays
#          BR         NDA      ID1       ID2
     4.48758729E-01    2           5        -5   # BR(H -> b       bb     )
     7.67728601E-02    2         -15        15   # BR(H -> tau+    tau-   )
     2.71474931E-04    2         -13        13   # BR(H -> mu+     mu-    )
     3.32786636E-04    2           3        -3   # BR(H -> s       sb     )
     1.85898976E-06    2           4        -4   # BR(H -> c       cb     )
     1.85727808E-01    2           6        -6   # BR(H -> t       tb     )
     6.16367433E-05    2          21        21   # BR(H -> g       g      )
     3.88466263E-07    2          22        22   # BR(H -> gam     gam    )
     1.09618558E-07    2          23        22   # BR(H -> Z       gam    )
     8.23614299E-05    2          24       -24   # BR(H -> W+      W-     )
     4.11285893E-05    2          23        23   # BR(H -> Z       Z      )
     3.13464190E-04    2          25        25   # BR(H -> h       h      )
    -3.06340045E-23    2          36        36   # BR(H -> A       A      )
     4.74831930E-19    2          23        36   # BR(H -> Z       A      )
     3.24286103E-09    2     1000024  -1000024   # BR(H -> ~chi_1+ ~chi_1-)
     8.84448934E-04    2     1000022   1000022   # BR(H -> ~chi_10 ~chi_10)
     1.92372463E-08    2     1000023   1000023   # BR(H -> ~chi_20 ~chi_20)
     1.70399924E-01    2     1000022   1000023   # BR(H -> ~chi_10 ~chi_20)
     1.16350997E-01    2     1000022   1000025   # BR(H -> ~chi_10 ~chi_30)
#
#         PDG            Width
DECAY        36     7.26389946E+00   # A decays
#          BR         NDA      ID1       ID2
     4.48742068E-01    2           5        -5   # BR(A -> b       bb     )
     7.67464365E-02    2         -15        15   # BR(A -> tau+    tau-   )
     2.71381116E-04    2         -13        13   # BR(A -> mu+     mu-    )
     3.32914679E-04    2           3        -3   # BR(A -> s       sb     )
     1.86608323E-06    2           4        -4   # BR(A -> c       cb     )
     1.86333629E-01    2           6        -6   # BR(A -> t       tb     )
     1.84442561E-04    2          21        21   # BR(A -> g       g      )
     2.67909673E-07    2          22        22   # BR(A -> gam     gam    )
     2.23341402E-07    2          23        22   # BR(A -> Z       gam    )
     8.20208987E-05    2          23        25   # BR(A -> Z       h      )
     9.10063333E-04    2     1000022   1000022   # BR(A -> ~chi_10 ~chi_10)
     1.52272148E-05    2     1000023   1000023   # BR(A -> ~chi_20 ~chi_20)
     1.17693804E-01    2     1000022   1000023   # BR(A -> ~chi_10 ~chi_20)
     1.68685656E-01    2     1000022   1000025   # BR(A -> ~chi_10 ~chi_30)
#
#         PDG            Width
DECAY        37     7.24796548E+00   # H+ decays
#          BR         NDA      ID1       ID2
     7.19818779E-04    2           4        -5   # BR(H+ -> c       bb     )
     7.69376846E-02    2         -15        16   # BR(H+ -> tau+    nu_tau )
     2.72057384E-04    2         -13        14   # BR(H+ -> mu+     nu_mu  )
     4.60681651E-06    2           2        -5   # BR(H+ -> u       bb     )
     1.59637568E-05    2           2        -3   # BR(H+ -> u       sb     )
     3.30129219E-04    2           4        -3   # BR(H+ -> c       sb     )
     6.32722399E-01    2           6        -5   # BR(H+ -> t       bb     )
     8.23262549E-05    2          24        25   # BR(H+ -> W+      h      )
     9.49819964E-14    2          24        36   # BR(H+ -> W+      A      )
     2.88899386E-01    2     1000024   1000022   # BR(H+ -> ~chi_1+ ~chi_10)
     1.56282675E-05    2     1000024   1000023   # BR(H+ -> ~chi_1+ ~chi_20)
