#
#                              ======================
#                              | THE SUSYHIT OUTPUT |
#                              ======================
#
#
#              ------------------------------------------------------
#              |     This is the output of the SUSY-HIT package     |
#              |  created by A.Djouadi, M.Muehlleitner and M.Spira. |
#              |  In case of problems with SUSY-HIT email to        |
#              |           margarete.muehlleitner@cern.ch           |
#              |           michael.spira@psi.ch                     |
#              |           abdelhak.djouadi@cern.ch                 |
#              ------------------------------------------------------
#
#              ------------------------------------------------------
#              |  SUSY Les Houches Accord - MSSM Spectrum + Decays  |
#              |              based on the decay programs           |
#              |                                                    |
#              |                     SDECAY 1.3b                    |
#              |                                                    |
#              |  Authors: M.Muhlleitner, A.Djouadi and Y.Mambrini  |
#              |  Ref.:    Comput.Phys.Commun.168(2005)46           |
#              |           [hep-ph/0311167]                         |
#              |                                                    |
#              |                     HDECAY 3.4                     |
#              |                                                    |
#              |  By: A.Djouadi,J.Kalinowski,M.Muhlleitner,M.Spira  |
#              |  Ref.:    Comput.Phys.Commun.108(1998)56           |
#              |           [hep-ph/9704448]                         |
#              |                                                    |
#              |                                                    |
#              |  If not stated otherwise all DRbar couplings and   |
#              |  soft SUSY breaking masses are given at the scale  |
#              |  Q=  0.50006979E+04
#              |                                                    |
#              ------------------------------------------------------
#
#
BLOCK DCINFO  # Decay Program information
     1   SDECAY/HDECAY # decay calculator
     2   1.3b  /3.4    # version number
#
BLOCK SPINFO  # Spectrum calculator information
     1    SOFTSUSY    # spectrum calculator                
     2    3.4.0       # version number                     
#
BLOCK MODSEL  # Model selection
     1     0   #  nonUniversal                                     
#
BLOCK SMINPUTS  # Standard Model inputs
         1     1.25778332E+02   # alpha_em^-1(M_Z)^MSbar
         2     1.16570000E-05   # G_F [GeV^-2]
         3     1.17200002E-01   # alpha_S(M_Z)^MSbar
         4     9.11876000E+01   # M_Z pole mass
         5     4.25000000E+00   # mb(mb)^MSbar
         6     1.72500000E+02   # mt pole mass
         7     1.77682000E+00   # mtau pole mass
#
BLOCK MINPAR  # Input parameters - minimal models
         3     1.00000000E+01   # tanb                
#
BLOCK EXTPAR  # Input parameters - non-minimal models
         0    -1.00000000E+00   # Set                 
         1     6.00000000E+01   # M_1(MX)             
         2     3.00000000E+03   # M_2(MX)             
         3     9.46045000E+02   # M_3(MX)             
        11     5.00000000E+03   # At(MX)              
        12     5.00000000E+03   # Ab(MX)              
        13     0.00000000E+00   # Atau(MX)            
        23    -1.74114700E+03   # mu(MX)              
        26     3.00000000E+03   # mA(pole)            
        31     5.00000000E+03   # meL(MX)             
        32     5.00000000E+03   # mmuL(MX)            
        33     5.00000000E+03   # mtauL(MX)           
        34     5.00000000E+03   # meR(MX)             
        35     5.00000000E+03   # mmuR(MX)            
        36     5.00000000E+03   # mtauR(MX)           
        41     5.00000000E+03   # mqL1(MX)            
        42     5.00000000E+03   # mqL2(MX)            
        43     5.00000000E+03   # mqL3(MX)            
        44     5.00000000E+03   # muR(MX)             
        45     5.00000000E+03   # mcR(MX)             
        46     5.00000000E+03   # mtR(MX)             
        47     5.00000000E+03   # mdR(MX)             
        48     5.00000000E+03   # msR(MX)             
        49     5.00000000E+03   # mbR(MX)             
#
BLOCK MASS  # Mass Spectrum
# PDG code           mass       particle
        24     8.00950847E+01   # W+
        25     1.24461986E+02   # h
        35     3.00007826E+03   # H
        36     2.99999995E+03   # A
        37     3.00087390E+03   # H+
         5     4.87878001E+00   # b-quark pole mass calculated from mb(mb)_Msbar
   1000001     5.06465109E+03   # ~d_L
   2000001     5.04685610E+03   # ~d_R
   1000002     5.06417454E+03   # ~u_L
   2000002     5.04658499E+03   # ~u_R
   1000003     5.06465109E+03   # ~s_L
   2000003     5.04685610E+03   # ~s_R
   1000004     5.06417454E+03   # ~c_L
   2000004     5.04658499E+03   # ~c_R
   1000005     5.01148161E+03   # ~b_1
   2000005     5.04601212E+03   # ~b_2
   1000006     4.90274288E+03   # ~t_1
   2000006     5.05913383E+03   # ~t_2
   1000011     5.01904164E+03   # ~e_L
   2000011     5.00590477E+03   # ~e_R
   1000012     5.01809333E+03   # ~nu_eL
   1000013     5.01904164E+03   # ~mu_L
   2000013     5.00590477E+03   # ~mu_R
   1000014     5.01809333E+03   # ~nu_muL
   1000015     5.00419031E+03   # ~tau_1
   2000015     5.01919315E+03   # ~tau_2
   1000016     5.01756021E+03   # ~nu_tauL
   1000021     1.20000086E+03   # ~g
   1000022     6.03008440E+01   # ~chi_10
   1000023     1.79939962E+03   # ~chi_20
   1000025    -1.80212200E+03   # ~chi_30
   1000035     3.07439058E+03   # ~chi_40
   1000024     1.80000098E+03   # ~chi_1+
   1000037     3.07455829E+03   # ~chi_2+
#
BLOCK NMIX  # Neutralino Mixing Matrix
  1  1     9.99690981E-01   # N_11
  1  2     1.21473974E-04   # N_12
  1  3    -2.47949603E-02   # N_13
  1  4     1.77132619E-03   # N_14
  2  1     1.62753262E-02   # N_21
  2  2     3.81703064E-02   # N_22
  2  3     7.06828530E-01   # N_23
  2  4     7.06166815E-01   # N_24
  3  1    -1.87828821E-02   # N_31
  3  2     1.24404770E-02   # N_32
  3  3    -7.06715935E-01   # N_33
  3  4     7.07138618E-01   # N_34
  4  1    -5.09413302E-04   # N_41
  4  2     9.99193799E-01   # N_42
  4  3    -1.81996389E-02   # N_43
  4  4    -3.57808072E-02   # N_44
#
BLOCK UMIX  # Chargino Mixing Matrix U
  1  1     2.57199105E-02   # U_11
  1  2     9.99669188E-01   # U_12
  2  1    -9.99669188E-01   # U_21
  2  2     2.57199105E-02   # U_22
#
BLOCK VMIX  # Chargino Mixing Matrix V
  1  1     5.05880124E-02   # V_11
  1  2    -9.98719607E-01   # V_12
  2  1    -9.98719607E-01   # V_21
  2  2    -5.05880124E-02   # V_22
#
BLOCK STOPMIX  # Stop Mixing Matrix
  1  1    -5.16758478E-01   # cos(theta_t)
  1  2     8.56131226E-01   # sin(theta_t)
  2  1    -8.56131226E-01   # -sin(theta_t)
  2  2    -5.16758478E-01   # cos(theta_t)
#
BLOCK SBOTMIX  # Sbottom Mixing Matrix
  1  1     9.92317976E-01   # cos(theta_b)
  1  2    -1.23713518E-01   # sin(theta_b)
  2  1     1.23713518E-01   # -sin(theta_b)
  2  2     9.92317976E-01   # cos(theta_b)
#
BLOCK STAUMIX  # Stau Mixing Matrix
  1  1    -1.98993897E-01   # cos(theta_tau)
  1  2     9.80000729E-01   # sin(theta_tau)
  2  1    -9.80000729E-01   # -sin(theta_tau)
  2  2    -1.98993897E-01   # cos(theta_tau)
#
BLOCK ALPHA  # Higgs mixing
          -1.05424175E-01   # Mixing angle in the neutral Higgs boson sector
#
BLOCK HMIX Q=  5.00069789E+03  # DRbar Higgs Parameters
         1    -1.77241401E+03   # mu(Q)MSSM           
         2     9.47366688E+00   # tan                 
         3     2.42065216E+02   # higgs               
         4     8.34442941E+06   # mA^2(Q)MSSM         
#
BLOCK GAUGE Q=  5.00069789E+03  # The gauge couplings
     1     3.70674612E-01   # gprime(Q) DRbar
     2     6.31923103E-01   # g(Q) DRbar
     3     1.00596054E+00   # g3(Q) DRbar
#
BLOCK AU Q=  5.00069789E+03  # The trilinear couplings
  1  1     5.00000001E+03   # A_u(Q) DRbar
  2  2     5.00000001E+03   # A_c(Q) DRbar
  3  3     5.00000001E+03   # A_t(Q) DRbar
#
BLOCK AD Q=  5.00069789E+03  # The trilinear couplings
  1  1     5.00000000E+03   # A_d(Q) DRbar
  2  2     5.00000000E+03   # A_s(Q) DRbar
  3  3     5.00000001E+03   # A_b(Q) DRbar
#
BLOCK AE Q=  5.00069789E+03  # The trilinear couplings
  1  1     0.00000000E+00   # A_e(Q) DRbar
  2  2     5.04434285E-08   # A_mu(Q) DRbar
  3  3     4.95987558E-08   # A_tau(Q) DRbar
#
BLOCK Yu Q=  5.00069789E+03  # The Yukawa couplings
  1  1     0.00000000E+00   # y_u(Q) DRbar
  2  2     0.00000000E+00   # y_c(Q) DRbar
  3  3     8.15335853E-01   # y_t(Q) DRbar
#
BLOCK Yd Q=  5.00069789E+03  # The Yukawa couplings
  1  1     0.00000000E+00   # y_d(Q) DRbar
  2  2     0.00000000E+00   # y_s(Q) DRbar
  3  3     1.30381922E-01   # y_b(Q) DRbar
#
BLOCK Ye Q=  5.00069789E+03  # The Yukawa couplings
  1  1     0.00000000E+00   # y_e(Q) DRbar
  2  2     0.00000000E+00   # y_mu(Q) DRbar
  3  3     9.65323561E-02   # y_tau(Q) DRbar
#
BLOCK MSOFT Q=  5.00069789E+03  # The soft SUSY breaking masses at the scale Q
         1     6.00000000E+01   # M_1(Q)              
         2     3.00000000E+03   # M_2(Q)              
         3     9.46045000E+02   # M_3(Q)              
        21     5.51183960E+06   # mH1^2(Q)            
        22    -2.60723880E+06   # mH2^2(Q)            
        31     5.00000000E+03   # meL(Q)              
        32     5.00000000E+03   # mmuL(Q)             
        33     5.00000000E+03   # mtauL(Q)            
        34     5.00000000E+03   # meR(Q)              
        35     5.00000000E+03   # mmuR(Q)             
        36     5.00000000E+03   # mtauR(Q)            
        41     5.00000000E+03   # mqL1(Q)             
        42     5.00000000E+03   # mqL2(Q)             
        43     5.00000000E+03   # mqL3(Q)             
        44     5.00000000E+03   # muR(Q)              
        45     5.00000000E+03   # mcR(Q)              
        46     5.00000000E+03   # mtR(Q)              
        47     5.00000000E+03   # mdR(Q)              
        48     5.00000000E+03   # msR(Q)              
        49     5.00000000E+03   # mbR(Q)              
#
#
#
#                             =================
#                             |The decay table|
#                             =================
#
# - The QCD corrections to the decays gluino -> squark  + quark
#                                     squark -> gaugino + quark_prime
#                                     squark -> squark_prime + Higgs
#                                     squark -> gluino  + quark
#   are included.
#
# - The multi-body decays for the inos, stops and sbottoms are included.
#
# - The loop induced decays for the gluino, neutralinos and stops
#   are included.
#
# - The SUSY decays of the top quark are included.
#
#
#         PDG            Width
DECAY         6     1.39937293E+00   # top decays
#          BR         NDA      ID1       ID2
     1.00000000E+00    2           5        24   # BR(t ->  b    W+)
#
#         PDG            Width
DECAY   1000021     2.16446256E-05   # gluino decays
#          BR         NDA      ID1       ID2
     1.53728533E-05    2     1000022        21   # BR(~g -> ~chi_10 g)
#           BR         NDA      ID1       ID2       ID3
     8.04170151E-02    3     1000022         1        -1   # BR(~g -> ~chi_10 d  db)
     2.74121327E-01    3     1000022         2        -2   # BR(~g -> ~chi_10 u  ub)
     8.04170151E-02    3     1000022         3        -3   # BR(~g -> ~chi_10 s  sb)
     2.74121327E-01    3     1000022         4        -4   # BR(~g -> ~chi_10 c  cb)
     8.13373364E-02    3     1000022         5        -5   # BR(~g -> ~chi_10 b  bb)
     2.09570607E-01    3     1000022         6        -6   # BR(~g -> ~chi_10 t  tb)
#
#         PDG            Width
DECAY   1000006     3.83640197E+02   # stop1 decays
#          BR         NDA      ID1       ID2
     2.27407666E-02    2     1000022         6   # BR(~t_1 -> ~chi_10 t )
     6.38924843E-02    2     1000023         6   # BR(~t_1 -> ~chi_20 t )
     6.12917868E-02    2     1000025         6   # BR(~t_1 -> ~chi_30 t )
     5.93413584E-03    2     1000035         6   # BR(~t_1 -> ~chi_40 t )
     9.05831680E-02    2     1000024         5   # BR(~t_1 -> ~chi_1+ b )
     1.17808209E-02    2     1000037         5   # BR(~t_1 -> ~chi_2+ b )
     7.43776838E-01    2     1000021         6   # BR(~t_1 -> ~g      t )
#
#         PDG            Width
DECAY   2000006     3.92244551E+02   # stop2 decays
#          BR         NDA      ID1       ID2
     9.30750930E-03    2     1000022         6   # BR(~t_2 -> ~chi_10 t )
     6.53177964E-02    2     1000023         6   # BR(~t_2 -> ~chi_20 t )
     6.80873126E-02    2     1000025         6   # BR(~t_2 -> ~chi_30 t )
     1.35706830E-02    2     1000035         6   # BR(~t_2 -> ~chi_40 t )
     4.15882853E-02    2     1000024         5   # BR(~t_2 -> ~chi_1+ b )
     2.68861844E-02    2     1000037         5   # BR(~t_2 -> ~chi_2+ b )
     7.71827695E-01    2     1000021         6   # BR(~t_2 -> ~g      t )
     7.30591525E-04    2     1000006        25   # BR(~t_2 -> ~t_1    h )
     2.68394260E-03    2     1000006        23   # BR(~t_2 -> ~t_1    Z )
#
#         PDG            Width
DECAY   1000005     3.71437991E+02   # sbottom1 decays
#          BR         NDA      ID1       ID2
     2.13306476E-03    2     1000022         5   # BR(~b_1 -> ~chi_10 b )
     1.85366524E-03    2     1000023         5   # BR(~b_1 -> ~chi_20 b )
     1.70824229E-03    2     1000025         5   # BR(~b_1 -> ~chi_30 b )
     1.99263618E-02    2     1000035         5   # BR(~b_1 -> ~chi_40 b )
     1.34117304E-01    2    -1000024         6   # BR(~b_1 -> ~chi_1- t )
     4.01968487E-02    2    -1000037         6   # BR(~b_1 -> ~chi_2- t )
     7.98577286E-01    2     1000021         5   # BR(~b_1 -> ~g      b )
     1.48722687E-03    2     1000006       -24   # BR(~b_1 -> ~t_1    W-)
#
#         PDG            Width
DECAY   2000005     3.05630515E+02   # sbottom2 decays
#          BR         NDA      ID1       ID2
     9.56011374E-03    2     1000022         5   # BR(~b_2 -> ~chi_10 b )
     2.07889783E-03    2     1000023         5   # BR(~b_2 -> ~chi_20 b )
     2.20603756E-03    2     1000025         5   # BR(~b_2 -> ~chi_30 b )
     4.11592439E-04    2     1000035         5   # BR(~b_2 -> ~chi_40 b )
     6.76261178E-03    2    -1000024         6   # BR(~b_2 -> ~chi_1- t )
     8.29605587E-04    2    -1000037         6   # BR(~b_2 -> ~chi_2- t )
     9.78033949E-01    2     1000021         5   # BR(~b_2 -> ~g      b )
     1.17191965E-04    2     1000006       -24   # BR(~b_2 -> ~t_1    W-)
#
#         PDG            Width
DECAY   1000002     3.24356653E+02   # sup_L decays
#          BR         NDA      ID1       ID2
     2.30396509E-03    2     1000022         2   # BR(~u_L -> ~chi_10 u)
     7.86546080E-05    2     1000023         2   # BR(~u_L -> ~chi_20 u)
     3.53289583E-06    2     1000025         2   # BR(~u_L -> ~chi_30 u)
     2.40167072E-02    2     1000035         2   # BR(~u_L -> ~chi_40 u)
     2.35374965E-04    2     1000024         1   # BR(~u_L -> ~chi_1+ d)
     4.79913234E-02    2     1000037         1   # BR(~u_L -> ~chi_2+ d)
     9.25370442E-01    2     1000021         2   # BR(~u_L -> ~g      u)
#
#         PDG            Width
DECAY   2000002     3.10765088E+02   # sup_R decays
#          BR         NDA      ID1       ID2
     3.82938854E-02    2     1000022         2   # BR(~u_R -> ~chi_10 u)
     7.73595553E-06    2     1000023         2   # BR(~u_R -> ~chi_20 u)
     1.02942692E-05    2     1000025         2   # BR(~u_R -> ~chi_30 u)
     3.94030341E-09    2     1000035         2   # BR(~u_R -> ~chi_40 u)
     9.61688080E-01    2     1000021         2   # BR(~u_R -> ~g      u)
#
#         PDG            Width
DECAY   1000001     3.24368735E+02   # sdown_L decays
#          BR         NDA      ID1       ID2
     2.29837652E-03    2     1000022         1   # BR(~d_L -> ~chi_10 d)
     5.63127207E-05    2     1000023         1   # BR(~d_L -> ~chi_20 d)
     1.19327930E-05    2     1000025         1   # BR(~d_L -> ~chi_30 d)
     2.40328977E-02    2     1000035         1   # BR(~d_L -> ~chi_40 d)
     6.08488417E-05    2    -1000024         2   # BR(~d_L -> ~chi_1- u)
     4.80958614E-02    2    -1000037         2   # BR(~d_L -> ~chi_2- u)
     9.25443770E-01    2     1000021         1   # BR(~d_L -> ~g      d)
#
#         PDG            Width
DECAY   2000001     3.01855647E+02   # sdown_R decays
#          BR         NDA      ID1       ID2
     9.85656950E-03    2     1000022         1   # BR(~d_R -> ~chi_10 d)
     1.99124107E-06    2     1000023         1   # BR(~d_R -> ~chi_20 d)
     2.64975332E-06    2     1000025         1   # BR(~d_R -> ~chi_30 d)
     1.01433323E-09    2     1000035         1   # BR(~d_R -> ~chi_40 d)
     9.90138788E-01    2     1000021         1   # BR(~d_R -> ~g      d)
#
#         PDG            Width
DECAY   1000004     3.24356653E+02   # scharm_L decays
#          BR         NDA      ID1       ID2
     2.30396509E-03    2     1000022         4   # BR(~c_L -> ~chi_10 c)
     7.86546080E-05    2     1000023         4   # BR(~c_L -> ~chi_20 c)
     3.53289583E-06    2     1000025         4   # BR(~c_L -> ~chi_30 c)
     2.40167072E-02    2     1000035         4   # BR(~c_L -> ~chi_40 c)
     2.35374965E-04    2     1000024         3   # BR(~c_L -> ~chi_1+ s)
     4.79913234E-02    2     1000037         3   # BR(~c_L -> ~chi_2+ s)
     9.25370442E-01    2     1000021         4   # BR(~c_L -> ~g      c)
#
#         PDG            Width
DECAY   2000004     3.10765088E+02   # scharm_R decays
#          BR         NDA      ID1       ID2
     3.82938854E-02    2     1000022         4   # BR(~c_R -> ~chi_10 c)
     7.73595553E-06    2     1000023         4   # BR(~c_R -> ~chi_20 c)
     1.02942692E-05    2     1000025         4   # BR(~c_R -> ~chi_30 c)
     3.94030341E-09    2     1000035         4   # BR(~c_R -> ~chi_40 c)
     9.61688080E-01    2     1000021         4   # BR(~c_R -> ~g      c)
#
#         PDG            Width
DECAY   1000003     3.24368735E+02   # sstrange_L decays
#          BR         NDA      ID1       ID2
     2.29837652E-03    2     1000022         3   # BR(~s_L -> ~chi_10 s)
     5.63127207E-05    2     1000023         3   # BR(~s_L -> ~chi_20 s)
     1.19327930E-05    2     1000025         3   # BR(~s_L -> ~chi_30 s)
     2.40328977E-02    2     1000035         3   # BR(~s_L -> ~chi_40 s)
     6.08488417E-05    2    -1000024         4   # BR(~s_L -> ~chi_1- c)
     4.80958614E-02    2    -1000037         4   # BR(~s_L -> ~chi_2- c)
     9.25443770E-01    2     1000021         3   # BR(~s_L -> ~g      s)
#
#         PDG            Width
DECAY   2000003     3.01855647E+02   # sstrange_R decays
#          BR         NDA      ID1       ID2
     9.85656950E-03    2     1000022         3   # BR(~s_R -> ~chi_10 s)
     1.99124107E-06    2     1000023         3   # BR(~s_R -> ~chi_20 s)
     2.64975332E-06    2     1000025         3   # BR(~s_R -> ~chi_30 s)
     1.01433323E-09    2     1000035         3   # BR(~s_R -> ~chi_40 s)
     9.90138788E-01    2     1000021         3   # BR(~s_R -> ~g      s)
#
#         PDG            Width
DECAY   1000011     3.02286354E+01   # selectron_L decays
#          BR         NDA      ID1       ID2
     2.26816248E-01    2     1000022        11   # BR(~e_L -> ~chi_10 e-)
     1.14046366E-03    2     1000023        11   # BR(~e_L -> ~chi_20 e-)
     1.01302530E-06    2     1000025        11   # BR(~e_L -> ~chi_30 e-)
     2.56883483E-01    2     1000035        11   # BR(~e_L -> ~chi_40 e-)
     6.62546423E-04    2    -1000024        12   # BR(~e_L -> ~chi_1- nu_e)
     5.14496246E-01    2    -1000037        12   # BR(~e_L -> ~chi_2- nu_e)
#
#         PDG            Width
DECAY   2000011     2.73550428E+01   # selectron_R decays
#          BR         NDA      ID1       ID2
     9.99531558E-01    2     1000022        11   # BR(~e_R -> ~chi_10 e-)
     2.00945864E-04    2     1000023        11   # BR(~e_R -> ~chi_20 e-)
     2.67395301E-04    2     1000025        11   # BR(~e_R -> ~chi_30 e-)
     1.00705111E-07    2     1000035        11   # BR(~e_R -> ~chi_40 e-)
#
#         PDG            Width
DECAY   1000013     3.02286354E+01   # smuon_L decays
#          BR         NDA      ID1       ID2
     2.26816248E-01    2     1000022        13   # BR(~mu_L -> ~chi_10 mu-)
     1.14046366E-03    2     1000023        13   # BR(~mu_L -> ~chi_20 mu-)
     1.01302530E-06    2     1000025        13   # BR(~mu_L -> ~chi_30 mu-)
     2.56883483E-01    2     1000035        13   # BR(~mu_L -> ~chi_40 mu-)
     6.62546423E-04    2    -1000024        14   # BR(~mu_L -> ~chi_1- nu_mu)
     5.14496246E-01    2    -1000037        14   # BR(~mu_L -> ~chi_2- nu_mu)
#
#         PDG            Width
DECAY   2000013     2.73550428E+01   # smuon_R decays
#          BR         NDA      ID1       ID2
     9.99531558E-01    2     1000022        13   # BR(~mu_R -> ~chi_10 mu-)
     2.00945864E-04    2     1000023        13   # BR(~mu_R -> ~chi_20 mu-)
     2.67395301E-04    2     1000025        13   # BR(~mu_R -> ~chi_30 mu-)
     1.00705111E-07    2     1000035        13   # BR(~mu_R -> ~chi_40 mu-)
#
#         PDG            Width
DECAY   1000015     2.88675597E+01   # stau_1 decays
#          BR         NDA      ID1       ID2
     9.19581515E-01    2     1000022        15   # BR(~tau_1 -> ~chi_10  tau-)
     1.32925002E-02    2     1000023        15   # BR(~tau_1 -> ~chi_20  tau-)
     1.16716574E-02    2     1000025        15   # BR(~tau_1 -> ~chi_30  tau-)
     1.01397679E-02    2     1000035        15   # BR(~tau_1 -> ~chi_40  tau-)
     2.50050502E-02    2    -1000024        16   # BR(~tau_1 -> ~chi_1-  nu_tau)
     2.03095091E-02    2    -1000037        16   # BR(~tau_1 -> ~chi_2-  nu_tau)
#
#         PDG            Width
DECAY   2000015     3.08149353E+01   # stau_2 decays
#          BR         NDA      ID1       ID2
     2.48153476E-01    2     1000022        15   # BR(~tau_2 -> ~chi_10  tau-)
     1.17020794E-02    2     1000023        15   # BR(~tau_2 -> ~chi_20  tau-)
     1.21411054E-02    2     1000025        15   # BR(~tau_2 -> ~chi_30  tau-)
     2.42431593E-01    2     1000035        15   # BR(~tau_2 -> ~chi_40  tau-)
     2.63912322E-05    2    -1000024        16   # BR(~tau_2 -> ~chi_1-  nu_tau)
     4.85545355E-01    2    -1000037        16   # BR(~tau_2 -> ~chi_2-  nu_tau)
#
#         PDG            Width
DECAY   1000012     3.02300933E+01   # snu_eL decays
#          BR         NDA      ID1       ID2
     2.26574612E-01    2     1000022        12   # BR(~nu_eL -> ~chi_10 nu_e)
     4.10229575E-04    2     1000023        12   # BR(~nu_eL -> ~chi_20 nu_e)
     2.75284562E-04    2     1000025        12   # BR(~nu_eL -> ~chi_30 nu_e)
     2.57013235E-01    2     1000035        12   # BR(~nu_eL -> ~chi_40 nu_e)
     2.56224803E-03    2     1000024        11   # BR(~nu_eL -> ~chi_1+ e-)
     5.13164391E-01    2     1000037        11   # BR(~nu_eL -> ~chi_2+ e-)
#
#         PDG            Width
DECAY   1000014     3.02300933E+01   # snu_muL decays
#          BR         NDA      ID1       ID2
     2.26574612E-01    2     1000022        14   # BR(~nu_muL -> ~chi_10 nu_mu)
     4.10229575E-04    2     1000023        14   # BR(~nu_muL -> ~chi_20 nu_mu)
     2.75284562E-04    2     1000025        14   # BR(~nu_muL -> ~chi_30 nu_mu)
     2.57013235E-01    2     1000035        14   # BR(~nu_muL -> ~chi_40 nu_mu)
     2.56224803E-03    2     1000024        13   # BR(~nu_muL -> ~chi_1+ mu-)
     5.13164391E-01    2     1000037        13   # BR(~nu_muL -> ~chi_2+ mu-)
#
#         PDG            Width
DECAY   1000016     3.09269134E+01   # snu_tauL decays
#          BR         NDA      ID1       ID2
     2.21446074E-01    2     1000022        16   # BR(~nu_tauL -> ~chi_10 nu_tau)
     4.00918870E-04    2     1000023        16   # BR(~nu_tauL -> ~chi_20 nu_tau)
     2.69036555E-04    2     1000025        16   # BR(~nu_tauL -> ~chi_30 nu_tau)
     2.51131581E-01    2     1000035        16   # BR(~nu_tauL -> ~chi_40 nu_tau)
     2.53269057E-02    2     1000024        15   # BR(~nu_tauL -> ~chi_1+ tau-)
     5.01425484E-01    2     1000037        15   # BR(~nu_tauL -> ~chi_2+ tau-)
#
#         PDG            Width
DECAY   1000024     1.11090092E+00   # chargino1+ decays
#          BR         NDA      ID1       ID2
     1.00000000E+00    2     1000022        24   # BR(~chi_1+ -> ~chi_10  W+)
#
#         PDG            Width
DECAY   1000037     1.67735595E+01   # chargino2+ decays
#          BR         NDA      ID1       ID2
     2.52299447E-01    2     1000024        23   # BR(~chi_2+ -> ~chi_1+  Z )
     3.54665660E-04    2     1000022        24   # BR(~chi_2+ -> ~chi_10  W+)
     2.44558708E-01    2     1000023        24   # BR(~chi_2+ -> ~chi_20  W+)
     2.43263901E-01    2     1000025        24   # BR(~chi_2+ -> ~chi_30  W+)
     2.59523138E-01    2     1000024        25   # BR(~chi_2+ -> ~chi_1+  h )
     1.39793447E-07    2     1000022        37   # BR(~chi_2+ -> ~chi_10  H+)
#
#         PDG            Width
DECAY   1000022     0.00000000E+00   # neutralino1 decays
#
#         PDG            Width
DECAY   1000023     1.16907830E+00   # neutralino2 decays
#          BR         NDA      ID1       ID2
     5.62442348E-01    2     1000022        23   # BR(~chi_20 -> ~chi_10   Z )
     4.37557652E-01    2     1000022        25   # BR(~chi_20 -> ~chi_10   h )
#
#         PDG            Width
DECAY   1000025     1.18242220E+00   # neutralino3 decays
#          BR         NDA      ID1       ID2
     4.19022910E-01    2     1000022        23   # BR(~chi_30 -> ~chi_10   Z )
     5.80977090E-01    2     1000022        25   # BR(~chi_30 -> ~chi_10   h )
#
#         PDG            Width
DECAY   1000035     1.67514225E+01   # neutralino4 decays
#          BR         NDA      ID1       ID2
     1.47341373E-04    2     1000022        23   # BR(~chi_40 -> ~chi_10   Z )
     2.45183038E-02    2     1000023        23   # BR(~chi_40 -> ~chi_20   Z )
     2.27754401E-01    2     1000025        23   # BR(~chi_40 -> ~chi_30   Z )
     2.43966668E-01    2     1000024       -24   # BR(~chi_40 -> ~chi_1+   W-)
     2.43966668E-01    2    -1000024        24   # BR(~chi_40 -> ~chi_1-   W+)
     2.19425623E-04    2     1000022        25   # BR(~chi_40 -> ~chi_10   h )
     1.20434303E-07    2     1000022        35   # BR(~chi_40 -> ~chi_10   H )
     2.46725062E-08    2     1000022        36   # BR(~chi_40 -> ~chi_10   A )
     2.35089575E-01    2     1000023        25   # BR(~chi_40 -> ~chi_20   h )
     2.43374731E-02    2     1000025        25   # BR(~chi_40 -> ~chi_30   h )
#
#         PDG            Width
DECAY        25     4.01690602E-03   # h decays
#          BR         NDA      ID1       ID2
     6.13083749E-01    2           5        -5   # BR(h -> b       bb     )
     6.43994004E-02    2         -15        15   # BR(h -> tau+    tau-   )
     2.27998679E-04    2         -13        13   # BR(h -> mu+     mu-    )
     4.83580057E-04    2           3        -3   # BR(h -> s       sb     )
     2.09574109E-02    2           4        -4   # BR(h -> c       cb     )
     6.74302795E-02    2          21        21   # BR(h -> g       g      )
     2.31150595E-03    2          22        22   # BR(h -> gam     gam    )
     1.46405898E-03    2          22        23   # BR(h -> Z       gam    )
     2.05285600E-01    2          24       -24   # BR(h -> W+      W-     )
     2.43341759E-02    2          23        23   # BR(h -> Z       Z      )
     2.22406641E-05    2     1000022   1000022   # BR(h -> ~chi_10 ~chi_10)
#
#         PDG            Width
DECAY        35     6.70627634E+00   # H decays
#          BR         NDA      ID1       ID2
     4.88303641E-01    2           5        -5   # BR(H -> b       bb     )
     8.31402978E-02    2         -15        15   # BR(H -> tau+    tau-   )
     2.93990697E-04    2         -13        13   # BR(H -> mu+     mu-    )
     3.60387684E-04    2           3        -3   # BR(H -> s       sb     )
     2.01235277E-06    2           4        -4   # BR(H -> c       cb     )
     2.01049975E-01    2           6        -6   # BR(H -> t       tb     )
     6.66790412E-05    2          21        21   # BR(H -> g       g      )
     3.86990724E-07    2          22        22   # BR(H -> gam     gam    )
     1.18658193E-07    2          23        22   # BR(H -> Z       gam    )
     8.74302299E-05    2          24       -24   # BR(H -> W+      W-     )
     4.36597820E-05    2          23        23   # BR(H -> Z       Z      )
     3.36797857E-04    2          25        25   # BR(H -> h       h      )
     8.71417346E-24    2          36        36   # BR(H -> A       A      )
     2.45921773E-19    2          23        36   # BR(H -> Z       A      )
     6.65381323E-04    2     1000022   1000022   # BR(H -> ~chi_10 ~chi_10)
     1.32898595E-01    2     1000022   1000023   # BR(H -> ~chi_10 ~chi_20)
     9.27506470E-02    2     1000022   1000025   # BR(H -> ~chi_10 ~chi_30)
#
#         PDG            Width
DECAY        36     6.70939766E+00   # A decays
#          BR         NDA      ID1       ID2
     4.88240215E-01    2           5        -5   # BR(A -> b       bb     )
     8.31040964E-02    2         -15        15   # BR(A -> tau+    tau-   )
     2.93862275E-04    2         -13        13   # BR(A -> mu+     mu-    )
     3.60493238E-04    2           3        -3   # BR(A -> s       sb     )
     2.01994422E-06    2           4        -4   # BR(A -> c       cb     )
     2.01697079E-01    2           6        -6   # BR(A -> t       tb     )
     1.99664994E-04    2          21        21   # BR(A -> g       g      )
     3.72758716E-07    2          22        22   # BR(A -> gam     gam    )
     2.41781217E-07    2          23        22   # BR(A -> Z       gam    )
     8.70618364E-05    2          23        25   # BR(A -> Z       h      )
     6.86593160E-04    2     1000022   1000022   # BR(A -> ~chi_10 ~chi_10)
     9.38298855E-02    2     1000022   1000023   # BR(A -> ~chi_10 ~chi_20)
     1.31498414E-01    2     1000022   1000025   # BR(A -> ~chi_10 ~chi_30)
#
#         PDG            Width
DECAY        37     6.69479158E+00   # H+ decays
#          BR         NDA      ID1       ID2
     7.83962717E-04    2           4        -5   # BR(H+ -> c       bb     )
     8.33096678E-02    2         -15        16   # BR(H+ -> tau+    nu_tau )
     2.94589191E-04    2         -13        14   # BR(H+ -> mu+     nu_mu  )
     5.01733572E-06    2           2        -5   # BR(H+ -> u       bb     )
     1.72858796E-05    2           2        -3   # BR(H+ -> u       sb     )
     3.57469915E-04    2           4        -3   # BR(H+ -> c       sb     )
     6.87879383E-01    2           6        -5   # BR(H+ -> t       bb     )
     8.73840858E-05    2          24        25   # BR(H+ -> W+      h      )
     1.00089520E-13    2          24        36   # BR(H+ -> W+      A      )
     2.27265240E-01    2     1000024   1000022   # BR(H+ -> ~chi_1+ ~chi_10)
