# SUSY Les Houches Accord 2 - MSSM spectrum + Decays
# SPheno v3.1.12 
# W. Porod, Comput. Phys. Commun. 153 (2003) 275-315, hep-ph/0301101
# in case of problems send email to porod@physik.uni-wuerzburg.de
# Created: 09.12.2016,  15:23
Block SPINFO         # Program information
     1   SPheno      # spectrum calculator
     2   v3.1.12     # version number
#
Block SPhenoINFO     # SPheno specific information
    1      2         # using 2-loop RGEs
    2      1         # using running masses for boundary conditions at mZ
Block MODSEL  # Model selection
    1    2    # mGMSB model
Block MINPAR  # Input parameters
    1    1.40000000E+05  # Lambda, scale of SUSY breaking
    2    2.50000000E+05  # M_M, messenger mass scale
    3    4.00000000E+01  # tanb at m_Z   
    4    1.00000000E+00  # Sign(mu)
    5    3.00000000E+00  # N_5 number of effective five-plets
    6    1.00000000E+00  # c_grav, Gravitino mass factor
Block gauge Q=  2.50000000E+05  # (GMSB scale)
   1    4.93047053E-01  # g'(Q)^DRbar
   2    6.46746199E-01  # g(Q)^DRbar
   3    9.33328992E-01  # g3(Q)^DRbar
Block SMINPUTS  # SM parameters
         1     1.27932515E+02  # alpha_em^-1(MZ)^MSbar
         2     1.16639000E-05  # G_mu [GeV^-2]
         3     1.17200000E-01  # alpha_s(MZ)^MSbar
         4     9.11876000E+01  # m_Z(pole)
         5     4.20000000E+00  # m_b(m_b), MSbar
         6     1.72500000E+02  # m_t(pole)
         7     1.77700000E+00  # m_tau(pole)
         8     0.00000000E+00  # m_nu_3
        11     5.10998910E-04  # m_e(pole)
        12     0.00000000E+00  # m_nu_1
        13     1.05658000E-01  # m_muon(pole)
        14     0.00000000E+00  # m_nu_2
        21     5.00000000E-03  # m_d(2 GeV), MSbar
        22     3.00000000E-03  # m_u(2 GeV), MSbar
        23     1.05000000E-01  # m_s(2 GeV), MSbar
        24     1.27000000E+00  # m_c(m_c), MSbar
Block gauge Q=  2.62887772E+03  # (SUSY scale)
   1    3.65139760E-01  # g'(Q)^DRbar
   2    6.37758633E-01  # g(Q)^DRbar
   3    1.01014517E+00  # g3(Q)^DRbar
Block Yu Q=  2.62887772E+03  # (SUSY scale)
  1  1     8.30279645E-06   # Y_u(Q)^DRbar
  2  2     3.51485194E-03   # Y_c(Q)^DRbar
  3  3     8.35496328E-01   # Y_t(Q)^DRbar
Block Yd Q=  2.62887772E+03  # (SUSY scale)
  1  1     4.74274597E-04   # Y_d(Q)^DRbar
  2  2     9.95976091E-03   # Y_s(Q)^DRbar
  3  3     4.78236450E-01   # Y_b(Q)^DRbar
Block Ye Q=  2.62887772E+03  # (SUSY scale)
  1  1     1.23062892E-04   # Y_e(Q)^DRbar
  2  2     2.54456256E-02   # Y_mu(Q)^DRbar
  3  3     4.28904210E-01   # Y_tau(Q)^DRbar
Block Au Q=  2.62887772E+03  # (SUSY scale)
  1  1    -8.03066584E+02   # A_u(Q)^DRbar
  2  2    -8.03063774E+02   # A_c(Q)^DRbar
  3  3    -7.55807915E+02   # A_t(Q)^DRbar
Block Ad Q=  2.62887772E+03  # (SUSY scale)
  1  1    -8.35339287E+02   # A_d(Q)^DRbar
  2  2    -8.35332780E+02   # A_s(Q)^DRbar
  3  3    -8.07136249E+02   # A_b(Q)^DRbar
Block Ae Q=  2.62887772E+03  # (SUSY scale)
  1  1    -7.89274058E+01   # A_e(Q)^DRbar
  2  2    -7.89221745E+01   # A_mu(Q)^DRbar
  3  3    -7.74452111E+01   # A_tau(Q)^DRbar
Block MSOFT Q=  2.62887772E+03  # soft SUSY breaking masses at Q
   1    6.22837670E+02  # M_1
   2    1.13647867E+03  # M_2
   3    2.86301708E+03  # M_3
  21    2.78578013E+05  # M^2_(H,d)
  22   -6.41199387E+05  # M^2_(H,u)
  31    8.69771693E+02  # M_(L,11)
  32    8.69743852E+02  # M_(L,22)
  33    8.61864988E+02  # M_(L,33)
  34    4.23119026E+02  # M_(E,11)
  35    4.23002260E+02  # M_(E,22)
  36    3.88617504E+02  # M_(E,33)
  41    2.74184849E+03  # M_(Q,11)
  42    2.74183566E+03  # M_(Q,22)
  43    2.63589586E+03  # M_(Q,33)
  44    2.62780389E+03  # M_(U,11)
  45    2.62780094E+03  # M_(U,22)
  46    2.45787038E+03  # M_(U,33)
  47    2.61666799E+03  # M_(D,11)
  48    2.61664380E+03  # M_(D,22)
  49    2.56079922E+03  # M_(D,33)
Block MASS  # Mass spectrum
#   PDG code      mass          particle
         6     1.72500000E+02  # m_t(pole)
        23     9.11876000E+01  # m_Z(pole)
        24     8.03109980E+01  # W+
        15     1.77700000E+00  # m_tau(pole)
        25     1.20720604E+02  # h0
        35     1.01001198E+03  # H0
        36     1.00997280E+03  # A0
        37     1.01371744E+03  # H+
   1000001     2.85439753E+03  # ~d_L
   2000001     2.72242650E+03  # ~d_R
   1000002     2.85327483E+03  # ~u_L
   2000002     2.73289059E+03  # ~u_R
   1000003     2.85438237E+03  # ~s_L
   2000003     2.72239632E+03  # ~s_R
   1000004     2.85325924E+03  # ~c_L
   2000004     2.73288702E+03  # ~c_R
   1000005     2.65115309E+03  # ~b_1
   2000005     2.72787054E+03  # ~b_2
   1000006     2.53011338E+03  # ~t_1
   2000006     2.73149620E+03  # ~t_2
   1000011     8.89535428E+02  # ~e_L-
   2000011     4.39745147E+02  # ~e_R-
   1000012     8.85560114E+02  # ~nu_eL
   1000013     8.89510633E+02  # ~mu_L-
   2000013     4.39568969E+02  # ~mu_R-
   1000014     8.85520107E+02  # ~nu_muL
   1000015     3.87450759E+02  # ~tau_1-
   2000015     8.82429114E+02  # ~tau_2-
   1000016     8.74323040E+02  # ~nu_tauL
   1000021     3.00025896E+03  # ~g
   1000022     6.05990847E+02  # ~chi_10
   1000023     8.88149470E+02  # ~chi_20
   1000025    -8.98062586E+02  # ~chi_30
   1000035     1.17303101E+03  # ~chi_40
   1000024     8.85984363E+02  # ~chi_1+
   1000037     1.17321840E+03  # ~chi_2+
   1000039     8.40000000E-09  # ~G
# Higgs mixing
Block alpha # Effective Higgs mixing angle
          -2.62971226E-02   # alpha
Block Hmix Q=  2.62887772E+03  # Higgs mixing parameters
   1    8.87119567E+02  # mu
   2    3.88824196E+01  # tan[beta](Q)
   3    2.43449939E+02  # v(Q)
   4    9.12992871E+05  # m^2_A(Q)
Block stopmix # stop mixing matrix
   1  1     1.30196621E-01   # Re[R_st(1,1)]
   1  2     9.91488195E-01   # Re[R_st(1,2)]
   2  1    -9.91488195E-01   # Re[R_st(2,1)]
   2  2     1.30196621E-01   # Re[R_st(2,2)]
Block sbotmix # sbottom mixing matrix
   1  1     1.95867272E-01   # Re[R_sb(1,1)]
   1  2     9.80630415E-01   # Re[R_sb(1,2)]
   2  1    -9.80630415E-01   # Re[R_sb(2,1)]
   2  2     1.95867272E-01   # Re[R_sb(2,2)]
Block staumix # stau mixing matrix
   1  1     1.06693398E-01   # Re[R_sta(1,1)]
   1  2     9.94291969E-01   # Re[R_sta(1,2)]
   2  1    -9.94291969E-01   # Re[R_sta(2,1)]
   2  2     1.06693398E-01   # Re[R_sta(2,2)]
Block Nmix # neutralino mixing matrix
   1  1    -9.93282071E-01   # Re[N(1,1)]
   1  2     9.57818476E-03   # Re[N(1,2)]
   1  3    -9.47340864E-02   # Re[N(1,3)]
   1  4     6.57604685E-02   # Re[N(1,4)]
   2  1    -1.13189321E-01   # Re[N(2,1)]
   2  2    -2.01532164E-01   # Re[N(2,2)]
   2  3     6.90923321E-01   # Re[N(2,3)]
   2  4    -6.84980239E-01   # Re[N(2,4)]
   3  1    -2.02234096E-02   # Re[N(3,1)]
   3  2     2.64479922E-02   # Re[N(3,2)]
   3  3     7.05871897E-01   # Re[N(3,3)]
   3  4     7.07556628E-01   # Re[N(3,4)]
   4  1    -1.30353070E-02   # Re[N(4,1)]
   4  2     9.79077907E-01   # Re[N(4,2)]
   4  3     1.24077724E-01   # Re[N(4,3)]
   4  4    -1.60752139E-01   # Re[N(4,4)]
Block Umix # chargino mixing matrix
   1  1    -1.75612978E-01   # Re[U(1,1)]
   1  2     9.84459284E-01   # Re[U(1,2)]
   2  1     9.84459284E-01   # Re[U(2,1)]
   2  2     1.75612978E-01   # Re[U(2,2)]
Block Vmix # chargino mixing matrix
   1  1    -2.27392664E-01   # Re[V(1,1)]
   1  2     9.73803151E-01   # Re[V(1,2)]
   2  1     9.73803151E-01   # Re[V(2,1)]
   2  2     2.27392664E-01   # Re[V(2,2)]
DECAY   2000011     2.01970018E-07   # ~e^-_R
#    BR                NDA      ID1      ID2
     1.32224650E-03    2     1000039        11   # BR(~e^-_R -> ~G e^-)
#    BR                NDA      ID1      ID2       ID3
     2.13954317E-14    3     2000013        11       -13   # BR(~e^-_R -> ~mu^-_R e^- mu^+)
     7.78756376E-14    3    -2000013        11        13   # BR(~e^-_R -> ~mu^+_R e^- mu^-)
     1.96829455E-01    3     1000015        11       -15   # BR(~e^-_R -> ~tau^-_1 e^- tau^+)
     8.01848298E-01    3    -1000015        11        15   # BR(~e^-_R -> ~tau^+_1 e^- tau^-)
DECAY   1000011     3.23127063E-01   # ~e^-_L
#    BR                NDA      ID1      ID2
     9.99948102E-01    2     1000022        11   # BR(~e^-_L -> chi^0_1 e^-)
     7.65989754E-06    2     1000023        11   # BR(~e^-_L -> chi^0_2 e^-)
     4.36175388E-05    2    -1000024        12   # BR(~e^-_L -> chi^-_1 nu_e)
     2.92289841E-07    2     2000011        23   # BR(~e^-_L -> ~e^-_R Z)
     3.00071584E-07    2     2000011        25   # BR(~e^-_L -> ~e^-_R h^0)
     2.79921961E-08    2     1000039        11   # BR(~e^-_L -> ~G e^-)
DECAY   2000013     1.98875683E-07   # ~mu^-_R
#    BR                NDA      ID1      ID2
     1.34013146E-03    2     1000039        13   # BR(~mu^-_R -> ~G mu^-)
#    BR                NDA      ID1      ID2       ID3
     1.96529004E-01    3     1000015        13       -15   # BR(~mu^-_R -> ~tau^-_1 mu^- tau^+)
     8.02130864E-01    3    -1000015        13        15   # BR(~mu^-_R -> ~tau^+_1 mu^- tau^-)
DECAY   1000013     3.31302337E-01   # ~mu^-_L
#    BR                NDA      ID1      ID2
     9.75245513E-01    2     1000022        13   # BR(~mu^-_L -> chi^0_1 mu^-)
     7.16453532E-06    2     1000023        13   # BR(~mu^-_L -> chi^0_2 mu^-)
     4.18251327E-05    2    -1000024        14   # BR(~mu^-_L -> chi^-_1 nu_mu)
     1.21914591E-02    2     2000013        23   # BR(~mu^-_L -> ~mu^-_R Z)
     1.25140110E-02    2     2000013        25   # BR(~mu^-_L -> ~mu^-_R h^0)
     2.72976494E-08    2     1000039        13   # BR(~mu^-_L -> ~G mu^-)
DECAY   1000015     1.41788202E-10   # ~tau^-_1
#    BR                NDA      ID1      ID2
     1.00000000E+00    2     1000039        15   # BR(~tau^-_1 -> ~G tau^-)
DECAY   2000015     2.77637539E+00   # ~tau^-_2
#    BR                NDA      ID1      ID2
     1.15122285E-01    2     1000022        15   # BR(~tau^-_2 -> chi^0_1 tau^-)
     4.45875865E-01    2     1000015        23   # BR(~tau^-_2 -> ~tau^-_1 Z)
     4.39001848E-01    2     1000015        25   # BR(~tau^-_2 -> ~tau^-_1 h^0)
     3.12973788E-09    2     1000039        15   # BR(~tau^-_2 -> ~G tau^-)
DECAY   1000012     3.38744432E-01   # ~nu_e
#    BR                NDA      ID1      ID2
     9.99999436E-01    2     1000022        12   # BR(~nu_e -> chi^0_1 nu_e)
     5.37560573E-07    2     2000011        24   # BR(~nu_e -> ~e^-_R W^+)
     2.61103160E-08    2     1000039        12   # BR(~nu_e -> ~G nu_e)
DECAY   1000014     3.46462091E-01   # ~nu_mu
#    BR                NDA      ID1      ID2
     9.77524063E-01    2     1000022        14   # BR(~nu_mu -> chi^0_1 nu_mu)
     2.24759118E-02    2     2000013        24   # BR(~nu_mu -> ~mu^-_R W^+)
     2.55229264E-08    2     1000039        14   # BR(~nu_mu -> ~G nu_mu)
DECAY   1000016     2.68146969E+00   # ~nu_tau
#    BR                NDA      ID1      ID2
     1.19106521E-01    2     1000022        16   # BR(~nu_tau -> chi^0_1 nu_tau)
     8.80893476E-01    2     1000015        24   # BR(~nu_tau -> ~tau^-_1 W^+)
     3.09443082E-09    2     1000039        16   # BR(~nu_tau -> ~G nu_tau)
DECAY   2000001     1.44734495E+00   # ~d_R
#    BR                NDA      ID1      ID2
     9.88157768E-01    2     1000022         1   # BR(~d_R -> chi^0_1 d)
     1.13453255E-02    2     1000023         1   # BR(~d_R -> chi^0_2 d)
     3.63426214E-04    2     1000025         1   # BR(~d_R -> chi^0_3 d)
     1.24936238E-04    2     1000035         1   # BR(~d_R -> chi^0_4 d)
     6.85997200E-06    2    -1000024         2   # BR(~d_R -> chi^-_1 u)
     6.49193086E-09    2    -1000037         2   # BR(~d_R -> chi^-_2 u)
     1.67804199E-06    2     1000039         1   # BR(~d_R -> ~G d)
DECAY   1000001     2.44590522E+01   # ~d_L
#    BR                NDA      ID1      ID2
     1.70746761E-02    2     1000022         1   # BR(~d_L -> chi^0_1 d)
     1.24697402E-02    2     1000023         1   # BR(~d_L -> chi^0_2 d)
     3.52300280E-04    2     1000025         1   # BR(~d_L -> chi^0_3 d)
     3.14231003E-01    2     1000035         1   # BR(~d_L -> chi^0_4 d)
     2.37813816E-02    2    -1000024         2   # BR(~d_L -> chi^-_1 u)
     6.32090771E-01    2    -1000037         2   # BR(~d_L -> chi^-_2 u)
     7.34403490E-13    2     2000002       -24   # BR(~d_L -> ~u_R W^-)
     9.76795930E-10    2     2000001        23   # BR(~d_L -> ~d_R Z)
     9.50204349E-10    2     2000001        25   # BR(~d_L -> ~d_R h^0)
     1.25813348E-07    2     1000039         1   # BR(~d_L -> ~G d)
DECAY   2000003     1.45601663E+00   # ~s_R
#    BR                NDA      ID1      ID2
     9.82322445E-01    2     1000022         3   # BR(~s_R -> chi^0_1 s)
     1.27384453E-02    2     1000023         3   # BR(~s_R -> chi^0_2 s)
     1.80212000E-03    2     1000025         3   # BR(~s_R -> chi^0_3 s)
     1.25327941E-04    2     1000035         3   # BR(~s_R -> chi^0_4 s)
     3.00714559E-03    2    -1000024         4   # BR(~s_R -> chi^-_1 c)
     2.84828484E-06    2    -1000037         4   # BR(~s_R -> chi^-_2 c)
     1.66795551E-06    2     1000039         3   # BR(~s_R -> ~G s)
DECAY   1000003     2.44638031E+01   # ~s_L
#    BR                NDA      ID1      ID2
     1.70710215E-02    2     1000022         3   # BR(~s_L -> chi^0_1 s)
     1.25529754E-02    2     1000023         3   # BR(~s_L -> chi^0_2 s)
     4.46162725E-04    2     1000025         3   # BR(~s_L -> chi^0_3 s)
     3.14171829E-01    2     1000035         3   # BR(~s_L -> chi^0_4 s)
     2.37888921E-02    2    -1000024         4   # BR(~s_L -> chi^-_1 c)
     6.31968012E-01    2    -1000037         4   # BR(~s_L -> chi^-_2 c)
     1.31547301E-07    2     2000004       -24   # BR(~s_L -> ~c_R W^-)
     4.30868436E-07    2     2000003        23   # BR(~s_L -> ~s_R Z)
     4.19245666E-07    2     2000003        25   # BR(~s_L -> ~s_R h^0)
     1.25785573E-07    2     1000039         3   # BR(~s_L -> ~G s)
DECAY   1000005     2.16730929E+01   # ~b_1
#    BR                NDA      ID1      ID2
     7.64933091E-02    2     1000022         5   # BR(~b_1 -> chi^0_1 b)
     2.25530375E-01    2     1000023         5   # BR(~b_1 -> chi^0_2 b)
     2.13216563E-01    2     1000025         5   # BR(~b_1 -> chi^0_3 b)
     1.42071261E-03    2     1000035         5   # BR(~b_1 -> chi^0_4 b)
     4.78183554E-01    2    -1000024         6   # BR(~b_1 -> chi^-_1 t)
     5.05108616E-03    2    -1000037         6   # BR(~b_1 -> chi^-_2 t)
     1.04302037E-04    2     1000006       -24   # BR(~b_1 -> ~t_1 W^-)
     9.81392737E-08    2     1000039         5   # BR(~b_1 -> ~G b)
DECAY   2000005     6.10774603E+01   # ~b_2
#    BR                NDA      ID1      ID2
     5.13099950E-03    2     1000022         5   # BR(~b_2 -> chi^0_1 b)
     7.64738122E-02    2     1000023         5   # BR(~b_2 -> chi^0_2 b)
     8.21495595E-02    2     1000025         5   # BR(~b_2 -> chi^0_3 b)
     1.19341575E-01    2     1000035         5   # BR(~b_2 -> chi^0_4 b)
     4.47362461E-01    2    -1000024         6   # BR(~b_2 -> chi^-_1 t)
     2.62468423E-01    2    -1000037         6   # BR(~b_2 -> chi^-_2 t)
     7.07312975E-03    2     1000006       -24   # BR(~b_2 -> ~t_1 W^-)
     4.01631481E-08    2     1000039         5   # BR(~b_2 -> ~G b)
DECAY   2000002     5.81624942E+00   # ~u_R
#    BR                NDA      ID1      ID2
     9.88160161E-01    2     1000022         2   # BR(~u_R -> chi^0_1 u)
     1.13536252E-02    2     1000023         2   # BR(~u_R -> chi^0_2 u)
     3.60518207E-04    2     1000025         2   # BR(~u_R -> chi^0_3 u)
     1.25269891E-04    2     1000035         2   # BR(~u_R -> chi^0_4 u)
     5.29580338E-10    2     1000024         1   # BR(~u_R -> chi^+_1 d)
     1.51787727E-12    2     1000037         1   # BR(~u_R -> chi^+_2 d)
     4.25659429E-07    2     1000039         2   # BR(~u_R -> ~G u)
DECAY   1000002     2.45085800E+01   # ~u_L
#    BR                NDA      ID1      ID2
     1.39129913E-02    2     1000022         2   # BR(~u_L -> chi^0_1 u)
     1.91270994E-02    2     1000023         2   # BR(~u_L -> chi^0_2 u)
     1.95072890E-04    2     1000025         2   # BR(~u_L -> chi^0_3 u)
     3.10203518E-01    2     1000035         2   # BR(~u_L -> chi^0_4 u)
     3.97703473E-02    2     1000024         1   # BR(~u_L -> chi^+_1 d)
     6.16790843E-01    2     1000037         1   # BR(~u_L -> chi^+_2 d)
     2.40503836E-09    2     2000001        24   # BR(~u_L -> ~d_R W^+)
     2.41831635E-13    2     2000002        23   # BR(~u_L -> ~u_R Z)
     1.25312368E-07    2     1000039         2   # BR(~u_L -> ~G u)
DECAY   2000004     5.81733307E+00   # ~c_R
#    BR                NDA      ID1      ID2
     9.87974445E-01    2     1000022         4   # BR(~c_R -> chi^0_1 c)
     1.13974777E-02    2     1000023         4   # BR(~c_R -> chi^0_2 c)
     4.07136194E-04    2     1000025         4   # BR(~c_R -> chi^0_3 c)
     1.25353570E-04    2     1000035         4   # BR(~c_R -> chi^0_4 c)
     9.48901833E-05    2     1000024         3   # BR(~c_R -> chi^+_1 s)
     2.71832039E-07    2     1000037         3   # BR(~c_R -> chi^+_2 s)
     4.25576995E-07    2     1000039         4   # BR(~c_R -> ~G c)
DECAY   1000004     2.45134718E+01   # ~c_L
#    BR                NDA      ID1      ID2
     1.39101934E-02    2     1000022         4   # BR(~c_L -> chi^0_1 c)
     1.91332386E-02    2     1000023         4   # BR(~c_L -> chi^0_2 c)
     2.06534209E-04    2     1000025         4   # BR(~c_L -> chi^0_3 c)
     3.10139712E-01    2     1000035         4   # BR(~c_L -> chi^0_4 c)
     3.99414909E-02    2     1000024         3   # BR(~c_L -> chi^+_1 s)
     6.16667602E-01    2     1000037         3   # BR(~c_L -> chi^+_2 s)
     1.06074678E-06    2     2000003        24   # BR(~c_L -> ~s_R W^+)
     4.33087105E-08    2     2000004        23   # BR(~c_L -> ~c_R Z)
     1.25283838E-07    2     1000039         4   # BR(~c_L -> ~G c)
DECAY   1000006     5.88761378E+01   # ~t_1
#    BR                NDA      ID1      ID2
     1.24431189E-04    2     1000022         4   # BR(~t_1 -> chi^0_1 c)
     9.07446445E-02    2     1000022         6   # BR(~t_1 -> chi^0_1 t)
     1.65446169E-04    2     1000023         4   # BR(~t_1 -> chi^0_2 c)
     2.18169534E-01    2     1000023         6   # BR(~t_1 -> chi^0_2 t)
     2.30719952E-01    2     1000025         6   # BR(~t_1 -> chi^0_3 t)
     2.98884666E-03    2     1000035         6   # BR(~t_1 -> chi^0_4 t)
     4.50926047E-01    2     1000024         5   # BR(~t_1 -> chi^+_1 b)
     6.14948726E-03    2     1000037         5   # BR(~t_1 -> chi^+_2 b)
     2.80711904E-08    2     1000039         6   # BR(~t_1 -> ~G t)
#    BR                NDA      ID1      ID2       ID3
     1.15840257E-05    3     1000022        24         5   # BR(~t_1 -> chi^0_1 W^+ b)
DECAY   2000006     6.24509419E+01   # ~t_2
#    BR                NDA      ID1      ID2
     6.10451837E-03    2     1000022         6   # BR(~t_2 -> chi^0_1 t)
     2.25329988E-01    2     1000023         6   # BR(~t_2 -> chi^0_2 t)
     2.35249467E-01    2     1000025         6   # BR(~t_2 -> chi^0_3 t)
     1.32817489E-01    2     1000035         6   # BR(~t_2 -> chi^0_4 t)
     1.52777018E-01    2     1000024         5   # BR(~t_2 -> chi^+_1 b)
     2.41519704E-01    2     1000037         5   # BR(~t_2 -> chi^+_2 b)
     3.39526563E-08    2     1000005        24   # BR(~t_2 -> ~b_1 W^+)
     3.56473123E-03    2     1000006        23   # BR(~t_2 -> ~t_1 Z)
     2.63701130E-03    2     1000006        25   # BR(~t_2 -> ~t_1 h^0)
     3.89149074E-08    2     1000039         6   # BR(~t_2 -> ~G t)
DECAY   1000024     1.47910122E+00   # chi^+_1
#    BR                NDA      ID1      ID2
     5.26680477E-08    2    -2000011        12   # BR(chi^+_1 -> ~e^+_R nu_e)
     2.25280485E-03    2    -2000013        14   # BR(chi^+_1 -> ~mu^+_R nu_mu)
     7.26587344E-01    2    -1000015        16   # BR(chi^+_1 -> ~tau^+_1 nu_tau)
     1.68066410E-06    2    -2000015        16   # BR(chi^+_1 -> ~tau^+_2 nu_tau)
     1.14878108E-07    2     1000012       -11   # BR(chi^+_1 -> ~nu_e e^+)
     1.48482038E-07    2     1000014       -13   # BR(chi^+_1 -> ~nu_mu mu^+)
     8.78449001E-04    2     1000016       -15   # BR(chi^+_1 -> ~nu_tau tau^+)
     2.69994954E-01    2     1000022        24   # BR(chi^+_1 -> chi^0_1 W^+)
#    BR                NDA      ID1      ID2       ID3
     8.52636278E-10    3     1000022        -1         2   # BR(chi^+_1 -> chi^0_1 d_bar u)
     1.79190355E-09    3     1000022        -3         4   # BR(chi^+_1 -> chi^0_1 s_bar c)
     2.69003697E-04    3     1000022        -5         6   # BR(chi^+_1 -> chi^0_1 b_bar t)
     1.42373474E-06    3     1000022       -11        12   # BR(chi^+_1 -> chi^0_1 e^+ nu_e)
     1.48181076E-06    3     1000022       -13        14   # BR(chi^+_1 -> chi^0_1 mu^+ nu_mu)
     1.25394609E-05    3     1000022       -15        16   # BR(chi^+_1 -> chi^0_1 tau^+ nu_tau)
DECAY   1000037     1.05206997E+01   # chi^+_2
#    BR                NDA      ID1      ID2
     1.68824756E-12    2    -2000011        12   # BR(chi^+_2 -> ~e^+_R nu_e)
     7.90293610E-02    2    -1000011        12   # BR(chi^+_2 -> ~e^+_L nu_e)
     7.25127674E-08    2    -2000013        14   # BR(chi^+_2 -> ~mu^+_R nu_mu)
     7.90452624E-02    2    -1000013        14   # BR(chi^+_2 -> ~mu^+_L nu_mu)
     5.50081214E-05    2    -1000015        16   # BR(chi^+_2 -> ~tau^+_1 nu_tau)
     8.36410061E-02    2    -2000015        16   # BR(chi^+_2 -> ~tau^+_2 nu_tau)
     7.92039782E-02    2     1000012       -11   # BR(chi^+_2 -> ~nu_e e^+)
     7.92265516E-02    2     1000014       -13   # BR(chi^+_2 -> ~nu_mu mu^+)
     8.56851743E-02    2     1000016       -15   # BR(chi^+_2 -> ~nu_tau tau^+)
     2.59825253E-04    2     1000022        24   # BR(chi^+_2 -> chi^0_1 W^+)
     1.33880526E-01    2     1000023        24   # BR(chi^+_2 -> chi^0_2 W^+)
     1.24444945E-01    2     1000025        24   # BR(chi^+_2 -> chi^0_3 W^+)
     1.33423223E-01    2     1000024        23   # BR(chi^+_2 -> chi^+_1 Z)
     1.21801031E-01    2     1000024        25   # BR(chi^+_2 -> chi^+_1 h^0)
#    BR                NDA      ID1      ID2       ID3
     2.47954215E-09    3     1000024         2        -2   # BR(chi^+_2 -> chi^+_1 u u_bar)
     2.47857948E-09    3     1000024         4        -4   # BR(chi^+_2 -> chi^+_1 c c_bar)
     4.07763387E-09    3     1000024         1        -1   # BR(chi^+_2 -> chi^+_1 d d_bar)
     5.16149423E-09    3     1000024         3        -3   # BR(chi^+_2 -> chi^+_1 s s_bar)
     2.54696520E-06    3     1000024         5        -5   # BR(chi^+_2 -> chi^+_1 b b_bar)
     2.16472097E-06    3     1000024        11       -11   # BR(chi^+_2 -> chi^+_1 e^- e^+)
     2.21565605E-06    3     1000024        13       -13   # BR(chi^+_2 -> chi^+_1 mu^- mu^+)
     1.25622444E-05    3     1000024        15       -15   # BR(chi^+_2 -> chi^+_1 tau^- tau^+)
     3.85442919E-07    3     1000024        12       -12   # BR(chi^+_2 -> chi^+_1 nu_e nu_bar_e)
     7.26719374E-08    3     1000022        -1         2   # BR(chi^+_2 -> chi^0_1 d_bar u)
     7.26876143E-08    3     1000022        -3         4   # BR(chi^+_2 -> chi^0_1 s_bar c)
     2.27180600E-06    3     1000022        -5         6   # BR(chi^+_2 -> chi^0_1 b_bar t)
     6.74661885E-11    3     1000022       -13        14   # BR(chi^+_2 -> chi^0_1 mu^+ nu_mu)
     2.56418368E-08    3     1000022       -15        16   # BR(chi^+_2 -> chi^0_1 tau^+ nu_tau)
     1.64233899E-09    3     1000023        -1         2   # BR(chi^+_2 -> chi^0_2 d_bar u)
     2.19633010E-09    3     1000023        -3         4   # BR(chi^+_2 -> chi^0_2 s_bar c)
     1.54265744E-04    3     1000023        -5         6   # BR(chi^+_2 -> chi^0_2 b_bar t)
     3.37833237E-07    3     1000023       -11        12   # BR(chi^+_2 -> chi^0_2 e^+ nu_e)
     3.38297615E-07    3     1000023       -13        14   # BR(chi^+_2 -> chi^0_2 mu^+ nu_mu)
     6.72200042E-06    3     1000023       -15        16   # BR(chi^+_2 -> chi^0_2 tau^+ nu_tau)
     7.00877033E-11    3     1000025        -1         2   # BR(chi^+_2 -> chi^0_3 d_bar u)
     5.06312277E-10    3     1000025        -3         4   # BR(chi^+_2 -> chi^0_3 s_bar c)
     1.15646524E-04    3     1000025        -5         6   # BR(chi^+_2 -> chi^0_3 b_bar t)
     2.42442100E-08    3     1000025       -11        12   # BR(chi^+_2 -> chi^0_3 e^+ nu_e)
     4.28189646E-08    3     1000025       -13        14   # BR(chi^+_2 -> chi^0_3 mu^+ nu_mu)
     4.32292229E-06    3     1000025       -15        16   # BR(chi^+_2 -> chi^0_3 tau^+ nu_tau)
DECAY   1000022     2.53896970E+00   # chi^0_1
#    BR                NDA      ID1      ID2
     1.39985429E-01    2     2000011       -11   # BR(chi^0_1 -> ~e^-_R e^+)
     1.39985429E-01    2    -2000011        11   # BR(chi^0_1 -> ~e^+_R e^-)
     1.40238151E-01    2     2000013       -13   # BR(chi^0_1 -> ~mu^-_R mu^+)
     1.40238151E-01    2    -2000013        13   # BR(chi^0_1 -> ~mu^+_R mu^-)
     2.19776419E-01    2     1000015       -15   # BR(chi^0_1 -> ~tau^-_1 tau^+)
     2.19776419E-01    2    -1000015        15   # BR(chi^0_1 -> ~tau^+_1 tau^-)
     3.84124057E-10    2     1000039        22   # BR(chi^0_1 -> ~G photon)
     1.14323231E-10    2     1000039        23   # BR(chi^0_1 -> ~G Z)
     2.42949639E-12    2     1000039        25   # BR(chi^0_1 -> ~G h^0)
DECAY   1000023     1.61165178E+00   # chi^0_2
#    BR                NDA      ID1      ID2
     1.06708171E-02    2     2000011       -11   # BR(chi^0_2 -> ~e^-_R e^+)
     1.06708171E-02    2    -2000011        11   # BR(chi^0_2 -> ~e^+_R e^-)
     1.16867027E-02    2     2000013       -13   # BR(chi^0_2 -> ~mu^-_R mu^+)
     1.16867027E-02    2    -2000013        13   # BR(chi^0_2 -> ~mu^+_R mu^-)
     3.41967243E-01    2     1000015       -15   # BR(chi^0_2 -> ~tau^-_1 tau^+)
     3.41967243E-01    2    -1000015        15   # BR(chi^0_2 -> ~tau^+_1 tau^-)
     9.85648053E-05    2     2000015       -15   # BR(chi^0_2 -> ~tau^-_2 tau^+)
     9.85648053E-05    2    -2000015        15   # BR(chi^0_2 -> ~tau^+_2 tau^-)
     7.06499535E-07    2     1000012       -12   # BR(chi^0_2 -> ~nu_e nu_bar_e)
     7.06499535E-07    2    -1000012        12   # BR(chi^0_2 -> ~nu^*_e nu_e)
     7.28466628E-07    2     1000014       -14   # BR(chi^0_2 -> ~nu_mu nu_bar_mu)
     7.28466628E-07    2    -1000014        14   # BR(chi^0_2 -> ~nu^*_mu nu_mu)
     1.98896968E-05    2     1000016       -16   # BR(chi^0_2 -> ~nu_tau nu_bar_tau)
     1.98896968E-05    2    -1000016        16   # BR(chi^0_2 -> ~nu^*_tau nu_tau)
     1.01584776E-02    2     1000022        23   # BR(chi^0_2 -> chi^0_1 Z)
     2.60927007E-01    2     1000022        25   # BR(chi^0_2 -> chi^0_1 h^0)
     2.19115939E-10    2     1000039        22   # BR(chi^0_2 -> ~G photon)
     3.00629778E-10    2     1000039        23   # BR(chi^0_2 -> ~G Z)
     2.75045838E-09    2     1000039        25   # BR(chi^0_2 -> ~G h^0)
     2.04375852E-07    2     1000022        22   # BR(chi^0_2 -> chi^0_1 photon)
#    BR                NDA      ID1      ID2       ID3
     1.90184019E-09    3     1000022         2        -2   # BR(chi^0_2 -> chi^0_1 u u_bar)
     1.90451687E-09    3     1000022         4        -4   # BR(chi^0_2 -> chi^0_1 c c_bar)
     4.53861381E-10    3     1000022         1        -1   # BR(chi^0_2 -> chi^0_1 d d_bar)
     1.48493848E-09    3     1000022         3        -3   # BR(chi^0_2 -> chi^0_1 s s_bar)
     2.40553779E-06    3     1000022         5        -5   # BR(chi^0_2 -> chi^0_1 b b_bar)
     5.21571544E-06    3     1000022        11       -11   # BR(chi^0_2 -> chi^0_1 e^- e^+)
     5.26695400E-06    3     1000022        13       -13   # BR(chi^0_2 -> chi^0_1 mu^- mu^+)
     1.21097334E-05    3     1000022        15       -15   # BR(chi^0_2 -> chi^0_1 tau^- tau^+)
     1.26058537E-11    3     1000024         1        -2   # BR(chi^0_2 -> chi^+_1 d u_bar)
     1.26058537E-11    3    -1000024        -1         2   # BR(chi^0_2 -> chi^-_1 d_bar u)
     2.10191568E-12    3     1000024         3        -4   # BR(chi^0_2 -> chi^+_1 s c_bar)
     2.10191568E-12    3    -1000024        -3         4   # BR(chi^0_2 -> chi^-_1 s_bar c)
     4.22853710E-12    3     1000024        11       -12   # BR(chi^0_2 -> chi^+_1 e^- nu_bar_e)
     4.22853710E-12    3    -1000024       -11        12   # BR(chi^0_2 -> chi^-_1 e^+ nu_e)
     4.20253210E-12    3     1000024        13       -14   # BR(chi^0_2 -> chi^+_1 mu^- nu_bar_mu)
     4.20253210E-12    3    -1000024       -13        14   # BR(chi^0_2 -> chi^-_1 mu^+ nu_mu)
     5.05560332E-14    3     1000024        15       -16   # BR(chi^0_2 -> chi^+_1 tau^- nu_bar_tau)
     5.05560332E-14    3    -1000024       -15        16   # BR(chi^0_2 -> chi^-_1 tau^+ nu_tau)
DECAY   1000025     1.51163393E+00   # chi^0_3
#    BR                NDA      ID1      ID2
     3.72512247E-04    2     2000011       -11   # BR(chi^0_3 -> ~e^-_R e^+)
     3.72512247E-04    2    -2000011        11   # BR(chi^0_3 -> ~e^+_R e^-)
     9.49344655E-08    2     1000011       -11   # BR(chi^0_3 -> ~e^-_L e^+)
     9.49344655E-08    2    -1000011        11   # BR(chi^0_3 -> ~e^+_L e^-)
     1.46150263E-03    2     2000013       -13   # BR(chi^0_3 -> ~mu^-_R mu^+)
     1.46150263E-03    2    -2000013        13   # BR(chi^0_3 -> ~mu^+_R mu^-)
     7.95557446E-07    2     1000013       -13   # BR(chi^0_3 -> ~mu^-_L mu^+)
     7.95557446E-07    2    -1000013        13   # BR(chi^0_3 -> ~mu^+_L mu^-)
     3.54651403E-01    2     1000015       -15   # BR(chi^0_3 -> ~tau^-_1 tau^+)
     3.54651403E-01    2    -1000015        15   # BR(chi^0_3 -> ~tau^+_1 tau^-)
     6.68002147E-04    2     2000015       -15   # BR(chi^0_3 -> ~tau^-_2 tau^+)
     6.68002147E-04    2    -2000015        15   # BR(chi^0_3 -> ~tau^+_2 tau^-)
     1.32858593E-06    2     1000012       -12   # BR(chi^0_3 -> ~nu_e nu_bar_e)
     1.32858593E-06    2    -1000012        12   # BR(chi^0_3 -> ~nu^*_e nu_e)
     1.33704219E-06    2     1000014       -14   # BR(chi^0_3 -> ~nu_mu nu_bar_mu)
     1.33704219E-06    2    -1000014        14   # BR(chi^0_3 -> ~nu^*_mu nu_mu)
     4.72991299E-06    2     1000016       -16   # BR(chi^0_3 -> ~nu_tau nu_bar_tau)
     4.72991299E-06    2    -1000016        16   # BR(chi^0_3 -> ~nu^*_tau nu_tau)
     2.77285285E-01    2     1000022        23   # BR(chi^0_3 -> chi^0_1 Z)
     8.37389619E-03    2     1000022        25   # BR(chi^0_3 -> chi^0_1 h^0)
     1.22023659E-13    2     1000039        22   # BR(chi^0_3 -> ~G photon)
     6.10261838E-10    2     1000039        23   # BR(chi^0_3 -> ~G Z)
     2.97621308E-09    2     1000039        25   # BR(chi^0_3 -> ~G h^0)
     2.13095942E-07    2     1000022        22   # BR(chi^0_3 -> chi^0_1 photon)
     4.85077351E-10    2     1000023        22   # BR(chi^0_3 -> chi^0_2 photon)
#    BR                NDA      ID1      ID2       ID3
     2.22699927E-11    3     1000022         2        -2   # BR(chi^0_3 -> chi^0_1 u u_bar)
     2.80295223E-11    3     1000022         4        -4   # BR(chi^0_3 -> chi^0_1 c c_bar)
     8.57984079E-12    3     1000022         1        -1   # BR(chi^0_3 -> chi^0_1 d d_bar)
     1.25617231E-09    3     1000022         3        -3   # BR(chi^0_3 -> chi^0_1 s s_bar)
     2.90132637E-06    3     1000022         5        -5   # BR(chi^0_3 -> chi^0_1 b b_bar)
     1.34669850E-08    3     1000022        11       -11   # BR(chi^0_3 -> chi^0_1 e^- e^+)
     7.67947226E-08    3     1000022        13       -13   # BR(chi^0_3 -> chi^0_1 mu^- mu^+)
     1.37672970E-05    3     1000022        15       -15   # BR(chi^0_3 -> chi^0_1 tau^- tau^+)
     7.03796143E-09    3     1000023         2        -2   # BR(chi^0_3 -> chi^0_2 u u_bar)
     6.32687336E-09    3     1000023         4        -4   # BR(chi^0_3 -> chi^0_2 c c_bar)
     9.13819771E-09    3     1000023         1        -1   # BR(chi^0_3 -> chi^0_2 d d_bar)
     9.12993697E-09    3     1000023         3        -3   # BR(chi^0_3 -> chi^0_2 s s_bar)
     7.35958358E-10    3     1000023         5        -5   # BR(chi^0_3 -> chi^0_2 b b_bar)
     2.10092409E-09    3     1000023        11       -11   # BR(chi^0_3 -> chi^0_2 e^- e^+)
     2.09963162E-09    3     1000023        13       -13   # BR(chi^0_3 -> chi^0_2 mu^- mu^+)
     1.33821162E-09    3     1000023        15       -15   # BR(chi^0_3 -> chi^0_2 tau^- tau^+)
     1.25512912E-08    3     1000023        12       -12   # BR(chi^0_3 -> chi^0_2 nu_e nu_bar_e)
     6.49890648E-08    3     1000024         1        -2   # BR(chi^0_3 -> chi^+_1 d u_bar)
     6.49890648E-08    3    -1000024        -1         2   # BR(chi^0_3 -> chi^-_1 d_bar u)
     6.15645063E-08    3     1000024         3        -4   # BR(chi^0_3 -> chi^+_1 s c_bar)
     6.15645063E-08    3    -1000024        -3         4   # BR(chi^0_3 -> chi^-_1 s_bar c)
     2.15348813E-08    3     1000024        11       -12   # BR(chi^0_3 -> chi^+_1 e^- nu_bar_e)
     2.15348813E-08    3    -1000024       -11        12   # BR(chi^0_3 -> chi^-_1 e^+ nu_e)
     2.15281910E-08    3     1000024        13       -14   # BR(chi^0_3 -> chi^+_1 mu^- nu_bar_mu)
     2.15281910E-08    3    -1000024       -13        14   # BR(chi^0_3 -> chi^-_1 mu^+ nu_mu)
     1.96466914E-08    3     1000024        15       -16   # BR(chi^0_3 -> chi^+_1 tau^- nu_bar_tau)
     1.96466914E-08    3    -1000024       -15        16   # BR(chi^0_3 -> chi^-_1 tau^+ nu_tau)
DECAY   1000035     1.05298948E+01   # chi^0_4
#    BR                NDA      ID1      ID2
     3.70879797E-05    2     2000011       -11   # BR(chi^0_4 -> ~e^-_R e^+)
     3.70879797E-05    2    -2000011        11   # BR(chi^0_4 -> ~e^+_R e^-)
     3.84173135E-02    2     1000011       -11   # BR(chi^0_4 -> ~e^-_L e^+)
     3.84173135E-02    2    -1000011        11   # BR(chi^0_4 -> ~e^+_L e^-)
     3.69143210E-05    2     2000013       -13   # BR(chi^0_4 -> ~mu^-_R mu^+)
     3.69143210E-05    2    -2000013        13   # BR(chi^0_4 -> ~mu^+_R mu^-)
     3.84269045E-02    2     1000013       -13   # BR(chi^0_4 -> ~mu^-_L mu^+)
     3.84269045E-02    2    -1000013        13   # BR(chi^0_4 -> ~mu^+_L mu^-)
     3.42924614E-05    2     1000015       -15   # BR(chi^0_4 -> ~tau^-_1 tau^+)
     3.42924614E-05    2    -1000015        15   # BR(chi^0_4 -> ~tau^+_1 tau^-)
     4.12042859E-02    2     2000015       -15   # BR(chi^0_4 -> ~tau^-_2 tau^+)
     4.12042859E-02    2    -2000015        15   # BR(chi^0_4 -> ~tau^+_2 tau^-)
     4.05684715E-02    2     1000012       -12   # BR(chi^0_4 -> ~nu_e nu_bar_e)
     4.05684715E-02    2    -1000012        12   # BR(chi^0_4 -> ~nu^*_e nu_e)
     4.05781867E-02    2     1000014       -14   # BR(chi^0_4 -> ~nu_mu nu_bar_mu)
     4.05781867E-02    2    -1000014        14   # BR(chi^0_4 -> ~nu^*_mu nu_mu)
     4.33251638E-02    2     1000016       -16   # BR(chi^0_4 -> ~nu_tau nu_bar_tau)
     4.33251638E-02    2    -1000016        16   # BR(chi^0_4 -> ~nu^*_tau nu_tau)
     1.34757273E-01    2     1000024       -24   # BR(chi^0_4 -> chi^+_1 W^-)
     1.34757273E-01    2    -1000024        24   # BR(chi^0_4 -> chi^-_1 W^+)
     2.82442046E-05    2     1000022        23   # BR(chi^0_4 -> chi^0_1 Z)
     2.60401534E-03    2     1000023        23   # BR(chi^0_4 -> chi^0_2 Z)
     1.19809306E-01    2     1000025        23   # BR(chi^0_4 -> chi^0_3 Z)
     2.78890531E-04    2     1000022        25   # BR(chi^0_4 -> chi^0_1 h^0)
     1.20479208E-01    2     1000023        25   # BR(chi^0_4 -> chi^0_2 h^0)
     1.68189758E-03    2     1000025        25   # BR(chi^0_4 -> chi^0_3 h^0)
     7.73372693E-10    2     1000039        22   # BR(chi^0_4 -> ~G photon)
     3.01407364E-09    2     1000039        23   # BR(chi^0_4 -> ~G Z)
     9.20745624E-11    2     1000039        25   # BR(chi^0_4 -> ~G h^0)
     1.64001729E-07    2     1000022        22   # BR(chi^0_4 -> chi^0_1 photon)
     7.73768518E-07    2     1000023        22   # BR(chi^0_4 -> chi^0_2 photon)
     7.97376616E-07    2     1000025        22   # BR(chi^0_4 -> chi^0_3 photon)
#    BR                NDA      ID1      ID2       ID3
     3.25562383E-08    3     1000022         2        -2   # BR(chi^0_4 -> chi^0_1 u u_bar)
     3.25543952E-08    3     1000022         4        -4   # BR(chi^0_4 -> chi^0_1 c c_bar)
     5.06792103E-07    3     1000022         6        -6   # BR(chi^0_4 -> chi^0_1 t t_bar)
     4.01068949E-08    3     1000022         1        -1   # BR(chi^0_4 -> chi^0_1 d d_bar)
     4.01218080E-08    3     1000022         3        -3   # BR(chi^0_4 -> chi^0_1 s s_bar)
     8.22615297E-08    3     1000022         5        -5   # BR(chi^0_4 -> chi^0_1 b b_bar)
     1.85318529E-08    3     1000022        11       -11   # BR(chi^0_4 -> chi^0_1 e^- e^+)
     1.84720536E-08    3     1000022        13       -13   # BR(chi^0_4 -> chi^0_1 mu^- mu^+)
     2.62637867E-08    3     1000022        15       -15   # BR(chi^0_4 -> chi^0_1 tau^- tau^+)
     2.83050725E-09    3     1000023         2        -2   # BR(chi^0_4 -> chi^0_2 u u_bar)
     2.82931684E-09    3     1000023         4        -4   # BR(chi^0_4 -> chi^0_2 c c_bar)
     1.85706966E-09    3     1000023         1        -1   # BR(chi^0_4 -> chi^0_2 d d_bar)
     2.35641050E-09    3     1000023         3        -3   # BR(chi^0_4 -> chi^0_2 s s_bar)
     1.17308455E-06    3     1000023         5        -5   # BR(chi^0_4 -> chi^0_2 b b_bar)
     5.08678427E-12    3     1000023        11       -11   # BR(chi^0_4 -> chi^0_2 e^- e^+)
     9.23547269E-10    3     1000023        13       -13   # BR(chi^0_4 -> chi^0_2 mu^- mu^+)
     7.11953409E-06    3     1000023        15       -15   # BR(chi^0_4 -> chi^0_2 tau^- tau^+)
     1.21399879E-06    3     1000023        12       -12   # BR(chi^0_4 -> chi^0_2 nu_e nu_bar_e)
     8.45538681E-12    3     1000025         2        -2   # BR(chi^0_4 -> chi^0_3 u u_bar)
     9.30012258E-12    3     1000025         4        -4   # BR(chi^0_4 -> chi^0_3 c c_bar)
     1.64181738E-11    3     1000025         1        -1   # BR(chi^0_4 -> chi^0_3 d d_bar)
     4.87155406E-10    3     1000025         3        -3   # BR(chi^0_4 -> chi^0_3 s s_bar)
     1.10226481E-06    3     1000025         5        -5   # BR(chi^0_4 -> chi^0_3 b b_bar)
     1.91420777E-09    3     1000025        11       -11   # BR(chi^0_4 -> chi^0_3 e^- e^+)
     1.96021085E-08    3     1000025        13       -13   # BR(chi^0_4 -> chi^0_3 mu^- mu^+)
     4.08369721E-06    3     1000025        15       -15   # BR(chi^0_4 -> chi^0_3 tau^- tau^+)
     3.06866465E-08    3     1000025        12       -12   # BR(chi^0_4 -> chi^0_3 nu_e nu_bar_e)
     1.71949766E-09    3     1000024         1        -2   # BR(chi^0_4 -> chi^+_1 d u_bar)
     1.71949766E-09    3    -1000024        -1         2   # BR(chi^0_4 -> chi^-_1 d_bar u)
     2.28298354E-09    3     1000024         3        -4   # BR(chi^0_4 -> chi^+_1 s c_bar)
     2.28298354E-09    3    -1000024        -3         4   # BR(chi^0_4 -> chi^-_1 s_bar c)
     1.56744707E-04    3     1000024         5        -6   # BR(chi^0_4 -> chi^+_1 b t_bar)
     1.56744707E-04    3    -1000024        -5         6   # BR(chi^0_4 -> chi^-_1 b_bar t)
     1.10803713E-06    3     1000024        11       -12   # BR(chi^0_4 -> chi^+_1 e^- nu_bar_e)
     1.10803713E-06    3    -1000024       -11        12   # BR(chi^0_4 -> chi^-_1 e^+ nu_e)
     1.13414755E-06    3     1000024        13       -14   # BR(chi^0_4 -> chi^+_1 mu^- nu_bar_mu)
     1.13414755E-06    3    -1000024       -13        14   # BR(chi^0_4 -> chi^-_1 mu^+ nu_mu)
     5.68763282E-06    3     1000024        15       -16   # BR(chi^0_4 -> chi^+_1 tau^- nu_bar_tau)
     5.68763282E-06    3    -1000024       -15        16   # BR(chi^0_4 -> chi^-_1 tau^+ nu_tau)
DECAY   1000021     2.03496918E+01   # ~g
#    BR                NDA      ID1      ID2
     4.33950584E-02    2     2000002        -2   # BR(~g -> ~u_R u_bar)
     4.33950584E-02    2    -2000002         2   # BR(~g -> ~u^*_R u)
     1.36713309E-02    2     1000002        -2   # BR(~g -> ~u_L u_bar)
     1.36713309E-02    2    -1000002         2   # BR(~g -> ~u^*_L u)
     4.33953064E-02    2     2000004        -4   # BR(~g -> ~c_R c_bar)
     4.33953064E-02    2    -2000004         4   # BR(~g -> ~c^*_R c)
     1.36739042E-02    2     1000004        -4   # BR(~g -> ~c_L c_bar)
     1.36739042E-02    2    -1000004         4   # BR(~g -> ~c^*_L c)
     3.10427413E-03    2     1000006        -4   # BR(~g -> ~t_1 c_bar)
     3.10427413E-03    2    -1000006         4   # BR(~g -> ~t^*_1 c)
     1.05487844E-01    2     1000006        -6   # BR(~g -> ~t_1 t_bar)
     1.05487844E-01    2    -1000006         6   # BR(~g -> ~t^*_1 t)
     4.00704002E-02    2     2000006        -6   # BR(~g -> ~t_2 t_bar)
     4.00704002E-02    2    -2000006         6   # BR(~g -> ~t^*_2 t)
     4.66873678E-02    2     2000001        -1   # BR(~g -> ~d_R d_bar)
     4.66873678E-02    2    -2000001         1   # BR(~g -> ~d^*_R d)
     1.34684440E-02    2     1000001        -1   # BR(~g -> ~d_L d_bar)
     1.34684440E-02    2    -1000001         1   # BR(~g -> ~d^*_L d)
     4.66969342E-02    2     2000003        -3   # BR(~g -> ~s_R s_bar)
     4.66969342E-02    2    -2000003         3   # BR(~g -> ~s^*_R s)
     1.34712158E-02    2     1000003        -3   # BR(~g -> ~s_L s_bar)
     1.34712158E-02    2    -1000003         3   # BR(~g -> ~s^*_L s)
     7.15315952E-02    2     1000005        -5   # BR(~g -> ~b_1 b_bar)
     7.15315952E-02    2    -1000005         5   # BR(~g -> ~b^*_1 b)
     4.52351631E-02    2     2000005        -5   # BR(~g -> ~b_2 b_bar)
     4.52351631E-02    2    -2000005         5   # BR(~g -> ~b^*_2 b)
     1.85339168E-06    2     1000022        21   # BR(~g -> chi^0_1 g)
     9.80868960E-05    2     1000023        21   # BR(~g -> chi^0_2 g)
     1.14976844E-04    2     1000025        21   # BR(~g -> chi^0_3 g)
     7.40557218E-06    2     1000035        21   # BR(~g -> chi^0_4 g)
DECAY        25     2.59148001E-03   # h^0
#    BR                NDA      ID1      ID2
     9.94435441E-09    2          11       -11   # BR(h^0 -> e^- e^+)
     4.25121738E-04    2          13       -13   # BR(h^0 -> mu^- mu^+)
     1.18067078E-01    2          15       -15   # BR(h^0 -> tau^- tau^+)
     6.11279902E-07    2           1        -1   # BR(h^0 -> d d_bar)
     2.69570516E-04    2           3        -3   # BR(h^0 -> s s_bar)
     5.85048901E-01    2           5        -5   # BR(h^0 -> b b_bar)
     2.58328128E-07    2           2        -2   # BR(h^0 -> u u_bar)
     4.62857714E-02    2           4        -4   # BR(h^0 -> c c_bar)
     6.96542477E-02    2          21        21   # BR(h^0 -> g g)
     3.47796553E-03    2          22        22   # BR(h^0 -> photon photon)
# writing decays into V V* as 3-body decays
#    BR                NDA      ID1      ID2       ID3
     8.06387233E-03    3          24        11        12   # BR(h^0 -> W^+ e^- nu_e)
     8.06387233E-03    3          24        13        14   # BR(h^0 -> W^+ mu^- nu_mu)
     8.06387233E-03    3          24        15        16   # BR(h^0 -> W^+ tau^- nu_tau)
     2.82235531E-02    3          24         1        -2   # BR(h^0 -> W^+ d u_bar)
     2.82235531E-02    3          24         3        -4   # BR(h^0 -> W^+ s c_bar)
     8.06387233E-03    3         -24       -11       -12   # BR(h^0 -> W^- e^+ nu_bar_e)
     8.06387233E-03    3         -24       -13       -14   # BR(h^0 -> W^- mu^+ nu_bar_mu)
     8.06387233E-03    3         -24       -15       -16   # BR(h^0 -> W^- tau^+ nu_bar_tau)
     2.82235531E-02    3         -24        -1         2   # BR(h^0 -> W^- d_bar u)
     2.82235531E-02    3         -24        -3         4   # BR(h^0 -> W^- s_bar c)
     5.42255635E-04    3          23        11       -11   # BR(h^0 -> Z e^- e^+)
     5.42255635E-04    3          23        13       -13   # BR(h^0 -> Z mu^- mu^+)
     4.64790544E-04    3          23        15       -15   # BR(h^0 -> Z tau^- tau^+)
     3.09860363E-03    3          23        12       -12   # BR(h^0 -> Z nu_e nu_bar_e)
     2.16902254E-03    3          23         1        -1   # BR(h^0 -> Z u u_bar)
     2.16902254E-03    3          23         3        -3   # BR(h^0 -> Z c c_bar)
     2.16902254E-03    3          23         5        -5   # BR(h^0 -> Z t t_bar)
     2.16902254E-03    3          23         2        -2   # BR(h^0 -> Z u u_bar)
     2.16902254E-03    3          23         4        -4   # BR(h^0 -> Z c c_bar)
DECAY        35     1.93635783E+01   # H^0
#    BR                NDA      ID1      ID2
     1.57045293E-08    2          11       -11   # BR(H^0 -> e^- e^+)
     6.71424099E-04    2          13       -13   # BR(H^0 -> mu^- mu^+)
     1.90758211E-01    2          15       -15   # BR(H^0 -> tau^- tau^+)
     7.93298628E-07    2           1        -1   # BR(H^0 -> d d_bar)
     3.49844288E-04    2           3        -3   # BR(H^0 -> s s_bar)
     8.06603686E-01    2           5        -5   # BR(H^0 -> b b_bar)
     1.68206354E-13    2           2        -2   # BR(H^0 -> u u_bar)
     3.01445161E-08    2           4        -4   # BR(H^0 -> c c_bar)
     1.51249868E-03    2           6        -6   # BR(H^0 -> t t_bar)
     3.78242784E-07    2     2000011  -2000011   # BR(H^0 -> ~e^-_R ~e^+_R)
     3.86746110E-07    2     2000013  -2000013   # BR(H^0 -> ~mu^-_R ~mu^+_R)
     6.60246914E-06    2     1000015  -1000015   # BR(H^0 -> ~tau^-_1 ~tau^+_1)
     1.45913504E-05    2          23        23   # BR(H^0 -> Z Z)
     2.78142626E-05    2          24       -24   # BR(H^0 -> W^+ W^-)
     1.42204631E-05    2          25        25   # BR(H^0 -> h^0 h^0)
     3.94579341E-05    2          21        21   # BR(H^0 -> g g)
     4.55785580E-08    2          22        22   # BR(H^0 -> photon photon)
DECAY        36     1.93628331E+01   # A^0
#    BR                NDA      ID1      ID2
     1.57055737E-08    2          11       -11   # BR(A^0 -> e^- e^+)
     6.71468778E-04    2          13       -13   # BR(A^0 -> mu^- mu^+)
     1.90773258E-01    2          15       -15   # BR(A^0 -> tau^- tau^+)
     7.93351045E-07    2           1        -1   # BR(A^0 -> d d_bar)
     3.49867413E-04    2           3        -3   # BR(A^0 -> s s_bar)
     8.06664727E-01    2           5        -5   # BR(A^0 -> b b_bar)
     1.51961844E-13    2           2        -2   # BR(A^0 -> u u_bar)
     2.72332953E-08    2           4        -4   # BR(A^0 -> c c_bar)
     1.49779946E-03    2           6        -6   # BR(A^0 -> t t_bar)
     2.72118812E-05    2          25        23   # BR(A^0 -> h^0 Z)
     1.47948318E-05    2          21        21   # BR(A^0 -> g g)
     3.61067598E-08    2          22        22   # BR(A^0 -> photon photon)
DECAY        37     1.67893989E+01   # H^+
#    BR                NDA      ID1      ID2
     1.81800386E-08    2         -11        12   # BR(H^+ -> e^+ nu_e)
     7.77260898E-04    2         -13        12   # BR(H^+ -> mu^+ nu_e)
     2.20830224E-01    2         -15        12   # BR(H^+ -> tau^+ nu_e)
     8.10068286E-07    2          -1         2   # BR(H^+ -> d_bar u)
     3.57266318E-04    2          -3         4   # BR(H^+ -> s_bar c)
     7.78003416E-01    2          -5         6   # BR(H^+ -> b_bar t)
     3.10039292E-05    2          25        24   # BR(H^+ -> h^0 W^+)
DECAY         6     2.43000000E+00   # top
#    BR                NDA      ID1      ID2
     1.00000000E+00    2           5        24   # BR(t -> b W)
Block HiggsBoundsInputHiggsCouplingsFermions
# ScalarNormEffCoupSq PseudoSNormEffCoupSq NP IP1 IP2 IP2
    1.10689820E+00    0.00000000E+00        3  25   5   5  # h0-b-b eff. coupling^2, normalised to SM
    1.59989310E+03    0.00000000E+00        3  35   5   5  # H0-b-b eff. coupling^2, normalised to SM
    0.00000000E+00    1.60000000E+03        3  36   5   5  # A0-b-b eff. coupling^2, normalised to SM
#
    9.99933189E-01    0.00000000E+00        3  25   6   6  # h0-t-t eff. coupling^2, normalised to SM
    6.91811378E-04    0.00000000E+00        3  35   6   6  # H0-t-t eff. coupling^2, normalised to SM
    0.00000000E+00    6.25000000E-04        3  36   6   6  # A0-t-t eff. coupling^2, normalised to SM
#
    1.10689820E+00    0.00000000E+00        3  25  15  15  # h0-tau-tau eff. coupling^2, normalised to SM
    1.59989310E+03    0.00000000E+00        3  35  15  15  # H0-tau-tau eff. coupling^2, normalised to SM
    0.00000000E+00    1.60000000E+03        3  36  15  15  # A0-tau-tau eff. coupling^2, normalised to SM
#
Block HiggsBoundsInputHiggsCouplingsBosons
    9.99998304E-01        3  25  24  24  # h0-W-W eff. coupling^2, normalised to SM
    1.69605993E-06        3  35  24  24  # H0-W-W eff. coupling^2, normalised to SM
    0.00000000E+00        3  36  24  24  # A0-W-W eff. coupling^2, normalised to SM
#
    9.99998304E-01        3  25  23  23  # h0-Z-Z eff. coupling^2, normalised to SM
    1.69605993E-06        3  35  23  23  # H0-Z-Z eff. coupling^2, normalised to SM
    0.00000000E+00        3  36  23  23  # A0-Z-Z eff. coupling^2, normalised to SM
#
    1.15895119E+00        3  25  21  21  # h0-g-g eff. coupling^2, normalised to SM
    2.10691685E-02        3  35  21  21  # H0-g-g eff. coupling^2, normalised to SM
    1.57048096E-01        3  36  21  21  # A0-g-g eff. coupling^2, normalised to SM
#
    0.00000000E+00        3  25  25  23  # h0-h0-Z eff. coupling^2, normalised to SM
    0.00000000E+00        3  35  25  23  # H0-h0-Z eff. coupling^2, normalised to SM
    1.69605993E-06        3  36  25  23  # A0-h0-Z eff. coupling^2, normalised to SM
    0.00000000E+00        3  35  35  23  # H0-H0-Z eff. coupling^2, normalised to SM
    9.99998304E-01        3  36  35  23  # A0-H0-Z eff. coupling^2, normalised to SM
    0.00000000E+00        3  36  36  23  # A0-A0-Z eff. coupling^2, normalised to SM
#
    0.00000000E+00        4  25  21  21  23  # h0-g-g-Z eff. coupling^2, normalised to SM
    0.00000000E+00        4  35  21  21  23  # H0-g-g-Z eff. coupling^2, normalised to SM
    0.00000000E+00        4  36  21  21  23  # A0-g-g-Z eff. coupling^2, normalised to SM
Block SPhenoLowEnergy  # low energy observables
    1    3.13361394E-04   # BR(b -> s gamma)
    2    1.59080505E-06   # BR(b -> s mu+ mu-)
    3    3.53992162E-05   # BR(b -> s nu nu)
    4    5.26595943E-11   # BR(Bd -> mu+ mu-)
    5    3.44403419E-09   # BR(Bs -> mu+ mu-)
    6    1.04558079E-04   # BR(B_u -> tau nu)
    7    9.45428480E-01   # BR(B_u -> tau nu)/BR(B_u -> tau nu)_SM
    8    2.73729123E-01   # |Delta(M_Bd)| [ps^-1] 
    9    2.02971833E+01   # |Delta(M_Bs)| [ps^-1] 
   20    2.15937728E-14   # Delta(g-2)_electron/2
   21    4.68804525E-10   # Delta(g-2)_muon/2
   22    3.83360609E-08   # Delta(g-2)_tau/2
   23    0.00000000E+00   # electric dipole moment of the electron
   24    0.00000000E+00   # electric dipole moment of the muon
   25    0.00000000E+00   # electric dipole moment of the tau
   26    0.00000000E+00   # Br(mu -> e gamma)
   27    0.00000000E+00   # Br(tau -> e gamma)
   28    0.00000000E+00   # Br(tau -> mu gamma)
   29    0.00000000E+00   # Br(mu -> 3 e)
   30    0.00000000E+00   # Br(tau -> 3 e)
   31    0.00000000E+00   # Br(tau -> 3 mu)
   39    1.09700464E-03   # Delta(rho_parameter)
   40    0.00000000E+00   # BR(Z -> e mu)
   41    0.00000000E+00   # BR(Z -> e tau)
   42    0.00000000E+00   # BR(Z -> mu tau)
Block FWCOEF Q=  9.11876000E+01  # Wilson coefficients at scale Q
#    id        order  M        value         comment
Block FWCOEF Q=  1.60000000E+02  # Wilson coefficients at scale Q
#    id        order  M        value         comment
     0305 4422   00   0    -1.87761255E-01   # C7
     0305 4422   00   1    -1.41254857E-02   # C7
     0305 4322   00   1    -3.04498041E-04   # C7'
     0305 6421   00   0    -9.48906110E-02   # C8
     0305 6421   00   1    -2.24770441E-02   # C8
     0305 6321   00   1    -4.80183163E-04   # C8'
 03051111 4133   00   0    -1.32221935E+00   # C9 e+e-
 03051111 4133   00   1     6.98108985E-04   # C9 e+e-
 03051111 4233   00   1    -5.71435421E-05   # C9' e+e-
 03051111 4137   00   0    -3.94492665E+00   # C10 e+e-
 03051111 4137   00   1     2.35121358E-03   # C10 e+e-
 03051111 4237   00   1     1.49563991E-03   # C10' e+e-
 03051313 4133   00   0    -1.32221935E+00   # C9 mu+mu-
 03051313 4133   00   1     6.97960439E-04   # C9 mu+mu-
 03051313 4233   00   1    -5.71566489E-05   # C9' mu+mu-
 03051313 4137   00   0    -3.94492665E+00   # C10 mu+mu-
 03051313 4137   00   1     2.35106484E-03   # C10 mu+mu-
 03051313 4237   00   1     1.49565302E-03   # C10' mu+mu-
 03051212 4237   00   0     1.49020119E+00   # C11 nu_1 nu_1
 03051212 4237   00   1    -5.66818699E-04   # C11 nu_1 nu_1
 03051212 4137   00   1    -3.59722549E-04   # C11' nu_1 nu_1
 03051414 4237   00   0     1.49020119E+00   # C11 nu_2 nu_2
 03051414 4237   00   1    -5.66818617E-04   # C11 nu_2 nu_2
 03051414 4137   00   1    -3.59719421E-04   # C11' nu_2 nu_2
 03051616 4237   00   0     1.49020119E+00   # C11 nu_3 nu_3
 03051616 4237   00   1    -5.66777694E-04   # C11 nu_3 nu_3
 03051616 4137   00   1    -3.58837940E-04   # C11' nu_3 nu_3
