#  ISAJET SUSY parameters in SUSY Les Houches Accord 2 format
#  Created by ISALHA 2.0 Last revision: H Baer 27 May 2014
Block SPINFO   # Program information
     1   ISASUGRA/ISASUSY from ISAJET   # Spectrum Calculator
     2   7.87   18-JUL-2017 13:55:55    # Version number
Block MODSEL   # Model selection
     1    13   # Non-universal supergravity model                  
Block SMINPUTS   # Standard Model inputs
     1     1.28000000E+02   # alpha_em^(-1)
     2     1.16570000E-05   # G_Fermi
     3     1.19999997E-01   # alpha_s(M_Z)
     4     9.11699982E+01   # m_{Z}(pole)
     5     4.19999981E+00   # m_{b}(m_{b})
     6     1.72500000E+02   # m_{top}(pole)
     7     1.77699995E+00   # m_{tau}(pole)
Block MINPAR   # SUSY breaking input parameters
     1     5.00000000E+03   # m_0
     2     3.00000000E+03   # m_{1/2}
     3     1.50000000E+01   # tan(beta)
     4     1.00000000E+00   # sign(mu)
     5    -8.00000000E+03   # A_0
Block EXTPAR   # Non-universal SUSY breaking parameters
     0     1.22231000E+16   # Input scale
    21     6.62257656E+04   # Down type Higgs mass squared
    22     5.75784400E+07   #  Up  type Higgs mass squared
Block MASS   # Scalar and gaugino mass spectrum
#  PDG code   mass                 particle
         6     1.72500000E+02   #  top            
        24     8.04229965E+01   #  W^+
        25     1.25386780E+02   #  h^0            
        35     1.00666821E+03   #  H^0            
        36     1.00000000E+03   #  A^0            
        37     1.00322870E+03   #  H^+            
   1000001     7.39285107E+03   #  dnl            
   1000002     7.39241162E+03   #  upl            
   1000003     7.39285107E+03   #  stl            
   1000004     7.39241162E+03   #  chl            
   1000005     5.80884131E+03   #  b1             
   1000006     3.61960205E+03   #  t1             
   1000011     5.48747754E+03   #  el-            
   1000012     5.48913330E+03   #  nuel           
   1000013     5.48747754E+03   #  mul-           
   1000014     5.48913330E+03   #  numl           
   1000015     4.65743750E+03   #  tau1           
   1000016     5.41532715E+03   #  nutl           
   1000021     6.30926660E+03   #  glss           
   1000022     2.05141556E+02   #  z1ss           
   1000023    -2.08823822E+02   #  z2ss           
   1000024     2.14878448E+02   #  w1ss           
   1000025     1.35135010E+03   #  z3ss           
   1000035     2.51455249E+03   #  z4ss           
   1000037     2.48597388E+03   #  w2ss           
   1000039     1.00000002E+20   #  gvss
   2000001     7.17226416E+03   #  dnr            
   2000002     7.38486133E+03   #  upr            
   2000003     7.17226416E+03   #  str            
   2000004     7.38486133E+03   #  chr            
   2000005     6.96386621E+03   #  b2             
   2000006     5.80493311E+03   #  t2             
   2000011     4.83175732E+03   #  er-            
   2000013     4.83175732E+03   #  mur-           
   2000015     5.41146533E+03   #  tau2           
Block ALPHA   # Effective Higgs mixing parameter
         -6.81451559E-02   # alpha
Block STOPMIX   # stop mixing matrix
  1  1     5.34728281E-02   # O_{11}
  1  2     9.98569310E-01   # O_{12}
  2  1    -9.98569310E-01   # O_{21}
  2  2     5.34728281E-02   # O_{22}
Block SBOTMIX   # sbottom mixing matrix
  1  1     9.99989569E-01   # O_{11}
  1  2     4.56619542E-03   # O_{12}
  2  1    -4.56619542E-03   # O_{21}
  2  2     9.99989569E-01   # O_{22}
Block STAUMIX   # stau mixing matrix
  1  1     5.07443538E-03   # O_{11}
  1  2     9.99987125E-01   # O_{12}
  2  1    -9.99987125E-01   # O_{21}
  2  2     5.07443538E-03   # O_{22}
Block NMIX   # neutralino mixing matrix
  1  1    -2.73779072E-02   #
  1  2     2.54482273E-02   #
  1  3    -7.09951997E-01   #
  1  4     7.03257680E-01   #
  2  1     1.77042931E-02   #
  2  2    -1.78268999E-02   #
  2  3    -7.04194129E-01   #
  2  4    -7.09563076E-01   #
  3  1     9.99457657E-01   #
  3  2     5.70950657E-03   #
  3  3    -6.94742147E-03   #
  3  4     3.16888615E-02   #
  4  1    -4.69642878E-03   #
  4  2     9.99501228E-01   #
  4  3     5.55590773E-03   #
  4  4    -3.07424180E-02   #
Block UMIX   # chargino U mixing matrix
  1  1    -7.26255542E-03   # U_{11}
  1  2     9.99973655E-01   # U_{12}
  2  1    -9.99973655E-01   # U_{21}
  2  2    -7.26255542E-03   # U_{22}
Block VMIX   # chargino V mixing matrix
  1  1    -4.43881601E-02   # V_{11}
  1  2     9.99014378E-01   # V_{12}
  2  1    -9.99014378E-01   # V_{21}
  2  2    -4.43881601E-02   # V_{22}
Block GAUGE Q=  4.50402588E+03   #
     1     3.57519686E-01   # g`
     2     6.52401745E-01   # g_2
     3     1.21956503E+00   # g_3
Block YU Q=  4.50402588E+03   #
  3  3     8.03222358E-01   # y_t
Block YD Q=  4.50402588E+03   #
  3  3     1.81784064E-01   # y_b
Block YE Q=  4.50402588E+03   #
  3  3     1.49061635E-01   # y_tau
Block HMIX Q=  4.50402588E+03   # Higgs mixing parameters
     1     2.00000000E+02   # mu(Q)
     2     1.42623720E+01   # tan(beta)(Q)
     3     2.52605408E+02   # Higgs vev at Q
     4     1.00000000E+06   # m_A^2(Q)
Block MSOFT Q=  4.50402588E+03   # DRbar SUSY breaking parameters
     1     1.35479761E+03   # M_1(Q)          
     2     2.42658301E+03   # M_2(Q)          
     3     5.91621582E+03   # M_3(Q)          
    21     9.50938500E+05   # MHd^2(Q)        
    22     4.12862461E+04   # MHu^2(Q)        
    31     5.46467090E+03   # MeL(Q)          
    32     5.46467090E+03   # MmuL(Q)         
    33     5.39288770E+03   # MtauL(Q)        
    34     4.82755957E+03   # MeR(Q)          
    35     4.82755957E+03   # MmuR(Q)         
    36     4.65741455E+03   # MtauR(Q)        
    41     7.09238770E+03   # MqL1(Q)         
    42     7.09238770E+03   # MqL2(Q)         
    43     5.61712402E+03   # MqL3(Q)         
    44     7.08461084E+03   # MuR(Q)          
    45     7.08461084E+03   # McR(Q)          
    46     3.61150098E+03   # MtR(Q)          
    47     6.86874023E+03   # MdR(Q)          
    48     6.86874023E+03   # MsR(Q)          
    49     6.78638770E+03   # MbR(Q)          
Block AU Q=  4.50402588E+03   #
  1  1    -7.75413770E+03   # A_u
  2  2    -7.75413770E+03   # A_c
  3  3    -7.75413770E+03   # A_t
Block AD Q=  4.50402588E+03   #
  1  1    -1.32772266E+04   # A_d
  2  2    -1.32772266E+04   # A_s
  3  3    -1.32772266E+04   # A_b
Block AE Q=  4.50402588E+03   #
  1  1    -9.29781348E+03   # A_e
  2  2    -9.29781348E+03   # A_mu
  3  3    -9.29781348E+03   # A_tau
#  ISAJET decay tables in SUSY Les Houches accord format
#  Created by ISALHD. Last revision: C. Balazs, 2005 May 25
Block DCINFO                           # Program information
     1   ISASUGRA from ISAJET          # Spectrum Calculator
     2   7.87   18-JUL-2017 13:55:55   # Version number
#         PDG         Width
DECAY         6  1.46776152E+00   # TP    decays
#          BR          NDA       ID1       ID2       ID3       ID4
      3.33333313E-01    3            2        -1         5             # TP     -->  UP     DB     BT          
      3.33333313E-01    3            4        -3         5             # TP     -->  CH     SB     BT          
      1.11111097E-01    3          -11        12         5             # TP     -->  E+     NUE    BT          
      1.11111097E-01    3          -13        14         5             # TP     -->  MU+    NUM    BT          
      1.11111097E-01    3          -15        16         5             # TP     -->  TAU+   NUT    BT          
#         PDG         Width
DECAY   1000021  6.02607079E+01   # GLSS  decays
#          BR          NDA       ID1       ID2       ID3       ID4
      5.70187979E-07    3      1000024         1        -2             # GLSS   -->  W1SS+  DN     UB          
      5.70187979E-07    3     -1000024         2        -1             # GLSS   -->  W1SS-  UP     DB          
      5.70187979E-07    3      1000024         3        -4             # GLSS   -->  W1SS+  ST     CB          
      5.70187979E-07    3     -1000024         4        -3             # GLSS   -->  W1SS-  CH     SB          
      3.50561386E-05    3      1000024         5        -6             # GLSS   -->  W1SS+  BT     TB          
      3.50561386E-05    3     -1000024         6        -5             # GLSS   -->  W1SS-  TP     BB          
      3.14234028E-04    3      1000037         1        -2             # GLSS   -->  W2SS+  DN     UB          
      3.14234028E-04    3     -1000037         2        -1             # GLSS   -->  W2SS-  UP     DB          
      3.14234028E-04    3      1000037         3        -4             # GLSS   -->  W2SS+  ST     CB          
      3.14234028E-04    3     -1000037         4        -3             # GLSS   -->  W2SS-  CH     SB          
      8.43501269E-09    3      1000037         5        -6             # GLSS   -->  W2SS+  BT     TB          
      8.43501269E-09    3     -1000037         6        -5             # GLSS   -->  W2SS-  TP     BB          
      2.87384727E-10    2      1000022        21                       # GLSS   -->  Z1SS   GL                 
      2.38678979E-07    3      1000022         2        -2             # GLSS   -->  Z1SS   UP     UB          
      3.05058563E-07    3      1000022         1        -1             # GLSS   -->  Z1SS   DN     DB          
      3.05058563E-07    3      1000022         3        -3             # GLSS   -->  Z1SS   ST     SB          
      2.38678979E-07    3      1000022         4        -4             # GLSS   -->  Z1SS   CH     CB          
      3.54848016E-05    3      1000022         5        -5             # GLSS   -->  Z1SS   BT     BB          
      1.31768679E-10    2      1000023        21                       # GLSS   -->  Z2SS   GL                 
      1.01502252E-07    3      1000023         2        -2             # GLSS   -->  Z2SS   UP     UB          
      1.31683322E-07    3      1000023         1        -1             # GLSS   -->  Z2SS   DN     DB          
      1.31683322E-07    3      1000023         3        -3             # GLSS   -->  Z2SS   ST     SB          
      1.01502252E-07    3      1000023         4        -4             # GLSS   -->  Z2SS   CH     CB          
      3.49665861E-05    3      1000023         5        -5             # GLSS   -->  Z2SS   BT     BB          
      2.58653472E-07    2      1000025        21                       # GLSS   -->  Z3SS   GL                 
      1.53207176E-04    3      1000025         2        -2             # GLSS   -->  Z3SS   UP     UB          
      5.23817871E-05    3      1000025         1        -1             # GLSS   -->  Z3SS   DN     DB          
      5.23817871E-05    3      1000025         3        -3             # GLSS   -->  Z3SS   ST     SB          
      1.53207176E-04    3      1000025         4        -4             # GLSS   -->  Z3SS   CH     CB          
      5.49144715E-05    3      1000025         5        -5             # GLSS   -->  Z3SS   BT     BB          
      2.00146323E-12    2      1000035        21                       # GLSS   -->  Z4SS   GL                 
      1.53920701E-04    3      1000035         2        -2             # GLSS   -->  Z4SS   UP     UB          
      1.54384077E-04    3      1000035         1        -1             # GLSS   -->  Z4SS   DN     DB          
      1.54384077E-04    3      1000035         3        -3             # GLSS   -->  Z4SS   ST     SB          
      1.53920701E-04    3      1000035         4        -4             # GLSS   -->  Z4SS   CH     CB          
      9.47978673E-09    3      1000035         5        -5             # GLSS   -->  Z4SS   BT     BB          
      2.35253256E-02    2     -1000005         5                       # GLSS   -->  BB1    BT                 
      2.35253256E-02    2      1000005        -5                       # GLSS   -->  BT1    BB                 
      4.51829940E-01    2     -1000006         6                       # GLSS   -->  TB1    TP                 
      4.51829940E-01    2      1000006        -6                       # GLSS   -->  TP1    TB                 
      2.34025661E-02    2     -2000006         6                       # GLSS   -->  TB2    TP                 
      2.34025661E-02    2      2000006        -6                       # GLSS   -->  TP2    TB                 
#         PDG         Width
DECAY   1000002  1.02079620E+02   # UPL   decays
#          BR          NDA       ID1       ID2       ID3       ID4
      1.27065869E-04    2      1000022         2                       # UPL    -->  Z1SS   UP                 
      6.47262277E-05    2      1000023         2                       # UPL    -->  Z2SS   UP                 
      1.01536158E-02    2      1000025         2                       # UPL    -->  Z3SS   UP                 
      2.37723961E-01    2      1000035         2                       # UPL    -->  Z4SS   UP                 
      2.72109479E-01    2      1000021         2                       # UPL    -->  GLSS   UP                 
      1.19919376E-03    2      1000024         1                       # UPL    -->  W1SS+  DN                 
      4.78621930E-01    2      1000037         1                       # UPL    -->  W2SS+  DN                 
#         PDG         Width
DECAY   1000001  1.02065430E+02   # DNL   decays
#          BR          NDA       ID1       ID2       ID3       ID4
      2.82521592E-04    2      1000022         1                       # DNL    -->  Z1SS   DN                 
      1.35144932E-04    2      1000023         1                       # DNL    -->  Z2SS   DN                 
      8.96449201E-03    2      1000025         1                       # DNL    -->  Z3SS   DN                 
      2.38598689E-01    2      1000035         1                       # DNL    -->  Z4SS   DN                 
      2.72335708E-01    2      1000021         1                       # DNL    -->  GLSS   DN                 
      3.21085136E-05    2     -1000024         2                       # DNL    -->  W1SS-  UP                 
      4.79651332E-01    2     -1000037         2                       # DNL    -->  W2SS-  UP                 
#         PDG         Width
DECAY   1000003  1.02065414E+02   # STL   decays
#          BR          NDA       ID1       ID2       ID3       ID4
      2.82521622E-04    2      1000022         3                       # STL    -->  Z1SS   ST                 
      1.35144946E-04    2      1000023         3                       # STL    -->  Z2SS   ST                 
      8.96449387E-03    2      1000025         3                       # STL    -->  Z3SS   ST                 
      2.38598734E-01    2      1000035         3                       # STL    -->  Z4SS   ST                 
      2.72335738E-01    2      1000021         3                       # STL    -->  GLSS   ST                 
      3.21085136E-05    2     -1000024         4                       # STL    -->  W1SS-  CH                 
      4.79651332E-01    2     -1000037         4                       # STL    -->  W2SS-  CH                 
#         PDG         Width
DECAY   1000004  1.02079590E+02   # CHL   decays
#          BR          NDA       ID1       ID2       ID3       ID4
      1.27065898E-04    2      1000022         4                       # CHL    -->  Z1SS   CH                 
      6.47262423E-05    2      1000023         4                       # CHL    -->  Z2SS   CH                 
      1.01536158E-02    2      1000025         4                       # CHL    -->  Z3SS   CH                 
      2.37724006E-01    2      1000035         4                       # CHL    -->  Z4SS   CH                 
      2.72109330E-01    2      1000021         4                       # CHL    -->  GLSS   CH                 
      1.19919411E-03    2      1000024         3                       # CHL    -->  W1SS+  ST                 
      4.78622049E-01    2      1000037         3                       # CHL    -->  W2SS+  ST                 
#         PDG         Width
DECAY   1000005  2.07673035E+02   # BT1   decays
#          BR          NDA       ID1       ID2       ID3       ID4
      9.86031163E-03    2      1000022         5                       # BT1    -->  Z1SS   BT                 
      9.62435827E-03    2      1000023         5                       # BT1    -->  Z2SS   BT                 
      3.31466412E-03    2      1000025         5                       # BT1    -->  Z3SS   BT                 
      7.78012797E-02    2      1000035         5                       # BT1    -->  Z4SS   BT                 
      3.39691728E-01    2     -1000024         6                       # BT1    -->  W1SS-  TP                 
      1.57661274E-01    2     -1000037         6                       # BT1    -->  W2SS-  TP                 
      4.01173800E-01    2          -24   1000006                       # BT1    -->  W-     TP1                
      8.72586621E-04    2          -37   1000006                       # BT1    -->  H-     TP1                
#         PDG         Width
DECAY   1000006  9.37497559E+01   # TP1   decays
#          BR          NDA       ID1       ID2       ID3       ID4
      2.31570810E-01    2      1000022         6                       # TP1    -->  Z1SS   TP                 
      2.35717595E-01    2      1000023         6                       # TP1    -->  Z2SS   TP                 
      6.44430146E-02    2      1000025         6                       # TP1    -->  Z3SS   TP                 
      6.02599428E-08    2      1000035         6                       # TP1    -->  Z4SS   TP                 
      4.68268514E-01    2      1000024         5                       # TP1    -->  W1SS+  BT                 
      1.13614385E-09    2      1000037         5                       # TP1    -->  W2SS+  BT                 
#         PDG         Width
DECAY   2000002  4.30429039E+01   # UPR   decays
#          BR          NDA       ID1       ID2       ID3       ID4
      2.90259923E-04    2      1000022         2                       # UPR    -->  Z1SS   UP                 
      1.21372250E-04    2      1000023         2                       # UPR    -->  Z2SS   UP                 
      3.61912072E-01    2      1000025         2                       # UPR    -->  Z3SS   UP                 
      6.68582607E-06    2      1000035         2                       # UPR    -->  Z4SS   UP                 
      6.37669623E-01    2      1000021         2                       # UPR    -->  GLSS   UP                 
#         PDG         Width
DECAY   2000001  2.25108929E+01   # DNR   decays
#          BR          NDA       ID1       ID2       ID3       ID4
      1.34744027E-04    2      1000022         1                       # DNR    -->  Z1SS   DN                 
      5.63430549E-05    2      1000023         1                       # DNR    -->  Z2SS   DN                 
      1.67322189E-01    2      1000025         1                       # DNR    -->  Z3SS   DN                 
      3.05518529E-06    2      1000035         1                       # DNR    -->  Z4SS   DN                 
      8.32483649E-01    2      1000021         1                       # DNR    -->  GLSS   DN                 
#         PDG         Width
DECAY   2000003  2.25108929E+01   # STR   decays
#          BR          NDA       ID1       ID2       ID3       ID4
      1.34744027E-04    2      1000022         3                       # STR    -->  Z1SS   ST                 
      5.63430549E-05    2      1000023         3                       # STR    -->  Z2SS   ST                 
      1.67322189E-01    2      1000025         3                       # STR    -->  Z3SS   ST                 
      3.05518529E-06    2      1000035         3                       # STR    -->  Z4SS   ST                 
      8.32483649E-01    2      1000021         3                       # STR    -->  GLSS   ST                 
#         PDG         Width
DECAY   2000004  4.30428772E+01   # CHR   decays
#          BR          NDA       ID1       ID2       ID3       ID4
      2.90260068E-04    2      1000022         4                       # CHR    -->  Z1SS   CH                 
      1.21372308E-04    2      1000023         4                       # CHR    -->  Z2SS   CH                 
      3.61912221E-01    2      1000025         4                       # CHR    -->  Z3SS   CH                 
      6.68582925E-06    2      1000035         4                       # CHR    -->  Z4SS   CH                 
      6.37669444E-01    2      1000021         4                       # CHR    -->  GLSS   CH                 
#         PDG         Width
DECAY   2000005  5.30705223E+01   # BT2   decays
#          BR          NDA       ID1       ID2       ID3       ID4
      4.57191169E-02    2      1000022         5                       # BT2    -->  Z1SS   BT                 
      4.50437255E-02    2      1000023         5                       # BT2    -->  Z2SS   BT                 
      6.86133876E-02    2      1000025         5                       # BT2    -->  Z3SS   BT                 
      2.06935765E-05    2      1000035         5                       # BT2    -->  Z4SS   BT                 
      2.15667754E-01    2      1000021         5                       # BT2    -->  GLSS   BT                 
      9.05976892E-02    2     -1000024         6                       # BT2    -->  W1SS-  TP                 
      3.72289105E-05    2     -1000037         6                       # BT2    -->  W2SS-  TP                 
      9.58944656E-05    2          -24   1000006                       # BT2    -->  W-     TP1                
      2.42866296E-03    2          -24   2000006                       # BT2    -->  W-     TP2                
      1.21991790E-03    2           23   1000005                       # BT2    -->  Z0     BT1                
      1.83323456E-03    2           25   1000005                       # BT2    -->  HL0    BT1                
      1.32238001E-01    2           36   1000005                       # BT2    -->  HA0    BT1                
      1.29511729E-01    2           35   1000005                       # BT2    -->  HH0    BT1                
      1.94973708E-03    2          -37   1000006                       # BT2    -->  H-     TP1                
      2.65023202E-01    2          -37   2000006                       # BT2    -->  H-     TP2                
#         PDG         Width
DECAY   2000006  2.26824203E+02   # TP2   decays
#          BR          NDA       ID1       ID2       ID3       ID4
      1.77094415E-02    2      1000024         5                       # TP2    -->  W1SS+  BT                 
      1.43799722E-01    2      1000037         5                       # TP2    -->  W2SS+  BT                 
      1.84584111E-01    2           23   1000006                       # TP2    -->  Z0     TP1                
      2.67653555E-01    2           25   1000006                       # TP2    -->  HL0    TP1                
      4.25287639E-04    2           35   1000006                       # TP2    -->  HH0    TP1                
      3.99188808E-04    2           36   1000006                       # TP2    -->  HA0    TP1                
      1.53566331E-01    2      1000022         6                       # TP2    -->  Z1SS   TP                 
      1.56427890E-01    2      1000023         6                       # TP2    -->  Z2SS   TP                 
      4.09986731E-03    2      1000025         6                       # TP2    -->  Z3SS   TP                 
      7.13345483E-02    2      1000035         6                       # TP2    -->  Z4SS   TP                 
#         PDG         Width
DECAY   1000011  4.97922783E+01   # EL-   decays
#          BR          NDA       ID1       ID2       ID3       ID4
      5.00423484E-05    2      1000022        11                       # EL-    -->  Z1SS   E-                 
      3.03201723E-05    2      1000023        11                       # EL-    -->  Z2SS   E-                 
      1.26101345E-01    2      1000025        11                       # EL-    -->  Z3SS   E-                 
      2.87753612E-01    2      1000035        11                       # EL-    -->  Z4SS   E-                 
      4.87864163E-05    2     -1000024        12                       # EL-    -->  W1SS-  NUE                
      5.86015880E-01    2     -1000037        12                       # EL-    -->  W2SS-  NUE                
#         PDG         Width
DECAY   1000013  4.97922783E+01   # MUL-  decays
#          BR          NDA       ID1       ID2       ID3       ID4
      5.00423484E-05    2      1000022        13                       # MUL-   -->  Z1SS   MU-                
      3.03201723E-05    2      1000023        13                       # MUL-   -->  Z2SS   MU-                
      1.26101345E-01    2      1000025        13                       # MUL-   -->  Z3SS   MU-                
      2.87753612E-01    2      1000035        13                       # MUL-   -->  Z4SS   MU-                
      4.87864163E-05    2     -1000024        14                       # MUL-   -->  W1SS-  NUM                
      5.86015880E-01    2     -1000037        14                       # MUL-   -->  W2SS-  NUM                
#         PDG         Width
DECAY   1000015  2.41924572E+01   # TAU1- decays
#          BR          NDA       ID1       ID2       ID3       ID4
      4.58167717E-02    2      1000022        15                       # TAU1-  -->  Z1SS   TAU-               
      4.45270054E-02    2      1000023        15                       # TAU1-  -->  Z2SS   TAU-               
      8.20349097E-01    2      1000025        15                       # TAU1-  -->  Z3SS   TAU-               
      1.49881253E-05    2      1000035        15                       # TAU1-  -->  Z4SS   TAU-               
      8.92827362E-02    2     -1000024        16                       # TAU1-  -->  W1SS-  NUT                
      9.39169149E-06    2     -1000037        16                       # TAU1-  -->  W2SS-  NUT                
#         PDG         Width
DECAY   1000012  4.97981796E+01   # NUEL  decays
#          BR          NDA       ID1       ID2       ID3       ID4
      7.58763170E-04    2      1000022        12                       # NUEL   -->  Z1SS   NUE                
      3.51338414E-04    2      1000023        12                       # NUEL   -->  Z2SS   NUE                
      1.20997593E-01    2      1000025        12                       # NUEL   -->  Z3SS   NUE                
      2.90888071E-01    2      1000035        12                       # NUEL   -->  Z4SS   NUE                
      1.82278140E-03    2      1000024        11                       # NUEL   -->  W1SS+  E-                 
      5.85181475E-01    2      1000037        11                       # NUEL   -->  W2SS+  E-                 
#         PDG         Width
DECAY   1000014  4.97981796E+01   # NUML  decays
#          BR          NDA       ID1       ID2       ID3       ID4
      7.58763170E-04    2      1000022        14                       # NUML   -->  Z1SS   NUM                
      3.51338414E-04    2      1000023        14                       # NUML   -->  Z2SS   NUM                
      1.20997593E-01    2      1000025        14                       # NUML   -->  Z3SS   NUM                
      2.90888071E-01    2      1000035        14                       # NUML   -->  Z4SS   NUM                
      1.82278140E-03    2      1000024        13                       # NUML   -->  W1SS+  MU-                
      5.85181475E-01    2      1000037        13                       # NUML   -->  W2SS+  MU-                
#         PDG         Width
DECAY   1000016  5.10540161E+01   # NUTL  decays
#          BR          NDA       ID1       ID2       ID3       ID4
      7.30091590E-04    2      1000022        16                       # NUTL   -->  Z1SS   NUT                
      3.38061363E-04    2      1000023        16                       # NUTL   -->  Z2SS   NUT                
      1.16022408E-01    2      1000025        16                       # NUTL   -->  Z3SS   NUT                
      2.75852025E-01    2      1000035        16                       # NUTL   -->  Z4SS   NUT                
      5.09859659E-02    2      1000024        15                       # NUTL   -->  W1SS+  TAU-               
      5.55167377E-01    2      1000037        15                       # NUTL   -->  W2SS+  TAU-               
      9.04000015E-04    2           24   1000015                       # NUTL   -->  W+     TAU1-              
#         PDG         Width
DECAY   2000011  2.08849506E+01   # ER-   decays
#          BR          NDA       ID1       ID2       ID3       ID4
      8.78827763E-04    2      1000022        11                       # ER-    -->  Z1SS   E-                 
      3.67454602E-04    2      1000023        11                       # ER-    -->  Z2SS   E-                 
      9.98739958E-01    2      1000025        11                       # ER-    -->  Z3SS   E-                 
      1.37991656E-05    2      1000035        11                       # ER-    -->  Z4SS   E-                 
#         PDG         Width
DECAY   2000013  2.08849506E+01   # MUR-  decays
#          BR          NDA       ID1       ID2       ID3       ID4
      8.78827763E-04    2      1000022        13                       # MUR-   -->  Z1SS   MU-                
      3.67454602E-04    2      1000023        13                       # MUR-   -->  Z2SS   MU-                
      9.98739958E-01    2      1000025        13                       # MUR-   -->  Z3SS   MU-                
      1.37991656E-05    2      1000035        13                       # MUR-   -->  Z4SS   MU-                
#         PDG         Width
DECAY   2000015  5.09912148E+01   # TAU2- decays
#          BR          NDA       ID1       ID2       ID3       ID4
      2.48406772E-02    2      1000022        15                       # TAU2-  -->  Z1SS   TAU-               
      2.44903211E-02    2      1000023        15                       # TAU2-  -->  Z2SS   TAU-               
      1.21003099E-01    2      1000025        15                       # TAU2-  -->  Z3SS   TAU-               
      2.72943437E-01    2      1000035        15                       # TAU2-  -->  Z4SS   TAU-               
      3.28047281E-05    2     -1000024        16                       # TAU2-  -->  W1SS-  NUT                
      5.56090891E-01    2     -1000037        16                       # TAU2-  -->  W2SS-  NUT                
      4.49679035E-04    2           23   1000015                       # TAU2-  -->  Z0     TAU1-              
      1.49096843E-04    2           25   1000015                       # TAU2-  -->  HL0    TAU1-              
#         PDG         Width
DECAY   1000023  6.12784379E-10   # Z2SS  decays
#          BR          NDA       ID1       ID2       ID3       ID4
      1.96225956E-01    2      1000022        22                       # Z2SS   -->  Z1SS   GM                 
      1.35998860E-01    3      1000022         2        -2             # Z2SS   -->  Z1SS   UP     UB          
      1.75371408E-01    3      1000022         1        -1             # Z2SS   -->  Z1SS   DN     DB          
      1.75371408E-01    3      1000022         3        -3             # Z2SS   -->  Z1SS   ST     SB          
      3.97829041E-02    3      1000022        11       -11             # Z2SS   -->  Z1SS   E-     E+          
      3.97829041E-02    3      1000022        13       -13             # Z2SS   -->  Z1SS   MU-    MU+         
      7.91555196E-02    3      1000022        12       -12             # Z2SS   -->  Z1SS   NUE    ANUE        
      7.91555196E-02    3      1000022        14       -14             # Z2SS   -->  Z1SS   NUM    ANUM        
      7.91555196E-02    3      1000022        16       -16             # Z2SS   -->  Z1SS   NUT    ANUT        
#         PDG         Width
DECAY   1000025  3.76378822E+00   # Z3SS  decays
#          BR          NDA       ID1       ID2       ID3       ID4
      7.33398196E-08    2      1000022        22                       # Z3SS   -->  Z1SS   GM                 
      7.00587535E-08    2      1000023        22                       # Z3SS   -->  Z2SS   GM                 
      2.11895287E-01    2      1000024       -24                       # Z3SS   -->  W1SS+  W-                 
      2.11895287E-01    2     -1000024        24                       # Z3SS   -->  W1SS-  W+                 
      3.53625119E-02    2      1000024       -37                       # Z3SS   -->  W1SS+  H-                 
      3.53625119E-02    2     -1000024        37                       # Z3SS   -->  W1SS-  H+                 
      6.09561130E-02    2      1000022        23                       # Z3SS   -->  Z1SS   Z0                 
      1.50019497E-01    2      1000023        23                       # Z3SS   -->  Z2SS   Z0                 
      1.40390075E-10    3      1000022         2        -2             # Z3SS   -->  Z1SS   UP     UB          
      2.69341095E-11    3      1000022         1        -1             # Z3SS   -->  Z1SS   DN     DB          
      2.69341095E-11    3      1000022         3        -3             # Z3SS   -->  Z1SS   ST     SB          
      1.40390075E-10    3      1000022         4        -4             # Z3SS   -->  Z1SS   CH     CB          
      5.50838530E-09    3      1000022         5        -5             # Z3SS   -->  Z1SS   BT     BB          
      1.27853483E-09    3      1000022        11       -11             # Z3SS   -->  Z1SS   E-     E+          
      1.27853483E-09    3      1000022        13       -13             # Z3SS   -->  Z1SS   MU-    MU+         
      1.11218910E-07    3      1000022        15       -15             # Z3SS   -->  Z1SS   TAU-   TAU+        
      3.29295896E-10    3      1000022        12       -12             # Z3SS   -->  Z1SS   NUE    ANUE        
      3.29295896E-10    3      1000022        14       -14             # Z3SS   -->  Z1SS   NUM    ANUM        
      3.48103907E-10    3      1000022        16       -16             # Z3SS   -->  Z1SS   NUT    ANUT        
      3.61046922E-11    3      1000023         2        -2             # Z3SS   -->  Z2SS   UP     UB          
      7.47749085E-12    3      1000023         1        -1             # Z3SS   -->  Z2SS   DN     DB          
      7.47749085E-12    3      1000023         3        -3             # Z3SS   -->  Z2SS   ST     SB          
      3.61046922E-11    3      1000023         4        -4             # Z3SS   -->  Z2SS   CH     CB          
      5.38094369E-09    3      1000023         5        -5             # Z3SS   -->  Z2SS   BT     BB          
      3.28625155E-10    3      1000023        11       -11             # Z3SS   -->  Z2SS   E-     E+          
      3.28625155E-10    3      1000023        13       -13             # Z3SS   -->  Z2SS   MU-    MU+         
      1.07619158E-07    3      1000023        15       -15             # Z3SS   -->  Z2SS   TAU-   TAU+        
      9.27914620E-11    3      1000023        12       -12             # Z3SS   -->  Z2SS   NUE    ANUE        
      9.27914620E-11    3      1000023        14       -14             # Z3SS   -->  Z2SS   NUM    ANUM        
      9.81114981E-11    3      1000023        16       -16             # Z3SS   -->  Z2SS   NUT    ANUT        
      1.59218833E-01    2      1000022        25                       # Z3SS   -->  Z1SS   HL0                
      2.67522801E-02    2      1000022        35                       # Z3SS   -->  Z1SS   HH0                
      7.99198542E-03    2      1000022        36                       # Z3SS   -->  Z1SS   HA0                
      6.61004186E-02    2      1000023        25                       # Z3SS   -->  Z2SS   HL0                
      7.10479869E-03    2      1000023        35                       # Z3SS   -->  Z2SS   HH0                
      2.73400340E-02    2      1000023        36                       # Z3SS   -->  Z2SS   HA0                
#         PDG         Width
DECAY   1000035  3.55037460E+01   # Z4SS  decays
#          BR          NDA       ID1       ID2       ID3       ID4
      4.18875828E-07    2      1000022        22                       # Z4SS   -->  Z1SS   GM                 
      6.41058193E-07    2      1000023        22                       # Z4SS   -->  Z2SS   GM                 
      5.17859977E-10    2      1000025        22                       # Z4SS   -->  Z3SS   GM                 
      1.49396792E-01    2      1000024       -24                       # Z4SS   -->  W1SS+  W-                 
      1.49396792E-01    2     -1000024        24                       # Z4SS   -->  W1SS-  W+                 
      1.01590328E-01    2      1000024       -37                       # Z4SS   -->  W1SS+  H-                 
      1.01590328E-01    2     -1000024        37                       # Z4SS   -->  W1SS-  H+                 
      9.78460776E-07    3     -1000037         2        -1             # Z4SS   -->  W2SS-  UP     DB          
      3.26153582E-07    3     -1000037        12       -11             # Z4SS   -->  W2SS-  NUE    E+          
      3.26153582E-07    3     -1000037        14       -13             # Z4SS   -->  W2SS-  NUM    MU+         
      9.78460776E-07    3      1000037         1        -2             # Z4SS   -->  W2SS+  DN     UB          
      3.26153582E-07    3      1000037        11       -12             # Z4SS   -->  W2SS+  E-     ANUE        
      3.26153582E-07    3      1000037        13       -14             # Z4SS   -->  W2SS+  MU-    ANUM        
      9.78460776E-07    3     -1000037         4        -3             # Z4SS   -->  W2SS-  CH     SB          
      3.26153582E-07    3     -1000037        16       -15             # Z4SS   -->  W2SS-  NUT    TAU+        
      9.78460776E-07    3      1000037         3        -4             # Z4SS   -->  W2SS+  ST     CB          
      3.26153582E-07    3      1000037        15       -16             # Z4SS   -->  W2SS+  TAU-   ANUT        
      4.52422425E-02    2      1000022        23                       # Z4SS   -->  Z1SS   Z0                 
      9.56458971E-02    2      1000023        23                       # Z4SS   -->  Z2SS   Z0                 
      4.68765829E-05    2      1000025        23                       # Z4SS   -->  Z3SS   Z0                 
      6.66300681E-10    3      1000022         2        -2             # Z4SS   -->  Z1SS   UP     UB          
      1.48589785E-09    3      1000022         1        -1             # Z4SS   -->  Z1SS   DN     DB          
      1.48589785E-09    3      1000022         3        -3             # Z4SS   -->  Z1SS   ST     SB          
      6.66300681E-10    3      1000022         4        -4             # Z4SS   -->  Z1SS   CH     CB          
      3.29248110E-07    3      1000022         5        -5             # Z4SS   -->  Z1SS   BT     BB          
      2.05339801E-10    3      1000022        11       -11             # Z4SS   -->  Z1SS   E-     E+          
      2.05339801E-10    3      1000022        13       -13             # Z4SS   -->  Z1SS   MU-    MU+         
      9.83201858E-08    3      1000022        15       -15             # Z4SS   -->  Z1SS   TAU-   TAU+        
      3.13979553E-09    3      1000022        12       -12             # Z4SS   -->  Z1SS   NUE    ANUE        
      3.13979553E-09    3      1000022        14       -14             # Z4SS   -->  Z1SS   NUM    ANUM        
      3.33207884E-09    3      1000022        16       -16             # Z4SS   -->  Z1SS   NUT    ANUT        
      2.53520954E-10    3      1000023         2        -2             # Z4SS   -->  Z2SS   UP     UB          
      5.30920419E-10    3      1000023         1        -1             # Z4SS   -->  Z2SS   DN     DB          
      5.30920419E-10    3      1000023         3        -3             # Z4SS   -->  Z2SS   ST     SB          
      2.53520954E-10    3      1000023         4        -4             # Z4SS   -->  Z2SS   CH     CB          
      3.20660689E-07    3      1000023         5        -5             # Z4SS   -->  Z2SS   BT     BB          
      9.37445052E-11    3      1000023        11       -11             # Z4SS   -->  Z2SS   E-     E+          
      9.37445052E-11    3      1000023        13       -13             # Z4SS   -->  Z2SS   MU-    MU+         
      9.64681348E-08    3      1000023        15       -15             # Z4SS   -->  Z2SS   TAU-   TAU+        
      1.09558662E-09    3      1000023        12       -12             # Z4SS   -->  Z2SS   NUE    ANUE        
      1.09558662E-09    3      1000023        14       -14             # Z4SS   -->  Z2SS   NUM    ANUM        
      1.16333709E-09    3      1000023        16       -16             # Z4SS   -->  Z2SS   NUT    ANUT        
      9.51339540E-09    3      1000025         2        -2             # Z4SS   -->  Z3SS   UP     UB          
      8.42293435E-09    3      1000025         1        -1             # Z4SS   -->  Z3SS   DN     DB          
      8.42293435E-09    3      1000025         3        -3             # Z4SS   -->  Z3SS   ST     SB          
      9.51339540E-09    3      1000025         4        -4             # Z4SS   -->  Z3SS   CH     CB          
      2.43424410E-08    3      1000025         5        -5             # Z4SS   -->  Z3SS   BT     BB          
      1.02260792E-07    3      1000025        11       -11             # Z4SS   -->  Z3SS   E-     E+          
      1.02260792E-07    3      1000025        13       -13             # Z4SS   -->  Z3SS   MU-    MU+         
      1.09046852E-07    3      1000025        15       -15             # Z4SS   -->  Z3SS   TAU-   TAU+        
      9.89587647E-08    3      1000025        12       -12             # Z4SS   -->  Z3SS   NUE    ANUE        
      9.89587647E-08    3      1000025        14       -14             # Z4SS   -->  Z3SS   NUM    ANUM        
      1.05321170E-07    3      1000025        16       -16             # Z4SS   -->  Z3SS   NUT    ANUT        
      9.70504805E-02    2      1000022        25                       # Z4SS   -->  Z1SS   HL0                
      5.47144338E-02    2      1000022        35                       # Z4SS   -->  Z1SS   HH0                
      4.86717075E-02    2      1000022        36                       # Z4SS   -->  Z1SS   HA0                
      5.39999492E-02    2      1000023        25                       # Z4SS   -->  Z2SS   HL0                
      4.76915203E-02    2      1000023        35                       # Z4SS   -->  Z2SS   HH0                
      5.43505736E-02    2      1000023        36                       # Z4SS   -->  Z2SS   HA0                
      5.98006474E-04    2      1000025        25                       # Z4SS   -->  Z3SS   HL0                
      5.01009572E-06    2      1000025        35                       # Z4SS   -->  Z3SS   HH0                
      5.07655102E-07    2      1000025        36                       # Z4SS   -->  Z3SS   HA0                
#         PDG         Width
DECAY   1000024  1.16822740E-07   # W1SS+ decays
#          BR          NDA       ID1       ID2       ID3       ID4
      3.04452211E-01    3      1000022         2        -1             # W1SS+  -->  Z1SS   UP     DB          
      3.04452211E-01    3      1000022         4        -3             # W1SS+  -->  Z1SS   CH     SB          
      1.01484098E-01    3      1000022       -11        12             # W1SS+  -->  Z1SS   E+     NUE         
      1.01484098E-01    3      1000022       -13        14             # W1SS+  -->  Z1SS   MU+    NUM         
      1.01485796E-01    3      1000022       -15        16             # W1SS+  -->  Z1SS   TAU+   NUT         
      2.88805012E-02    3      1000023         2        -1             # W1SS+  -->  Z2SS   UP     DB          
      2.88805012E-02    3      1000023         4        -3             # W1SS+  -->  Z2SS   CH     SB          
      9.62683745E-03    3      1000023       -11        12             # W1SS+  -->  Z2SS   E+     NUE         
      9.62683745E-03    3      1000023       -13        14             # W1SS+  -->  Z2SS   MU+    NUM         
      9.62699298E-03    3      1000023       -15        16             # W1SS+  -->  Z2SS   TAU+   NUT         
#         PDG         Width
DECAY   1000037  3.41704788E+01   # W2SS+ decays
#          BR          NDA       ID1       ID2       ID3       ID4
      1.59551827E-09    3      1000022         2        -1             # W2SS+  -->  Z1SS   UP     DB          
      1.59551827E-09    3      1000022         4        -3             # W2SS+  -->  Z1SS   CH     SB          
      2.65880873E-09    3      1000022       -11        12             # W2SS+  -->  Z1SS   E+     NUE         
      2.65880873E-09    3      1000022       -13        14             # W2SS+  -->  Z1SS   MU+    NUM         
      9.97898297E-08    3      1000022       -15        16             # W2SS+  -->  Z1SS   TAU+   NUT         
      1.39454186E-01    2      1000022        24                       # W2SS+  -->  Z1SS   W+                 
      1.05046272E-01    2      1000022        37                       # W2SS+  -->  Z1SS   H+                 
      1.01981412E-09    3      1000023         2        -1             # W2SS+  -->  Z2SS   UP     DB          
      1.01981412E-09    3      1000023         4        -3             # W2SS+  -->  Z2SS   CH     SB          
      1.44698920E-09    3      1000023       -11        12             # W2SS+  -->  Z2SS   E+     NUE         
      1.44698920E-09    3      1000023       -13        14             # W2SS+  -->  Z2SS   MU+    NUM         
      9.68340146E-08    3      1000023       -15        16             # W2SS+  -->  Z2SS   TAU+   NUT         
      1.37385070E-01    2      1000023        24                       # W2SS+  -->  Z2SS   W+                 
      1.03228763E-01    2      1000023        37                       # W2SS+  -->  Z2SS   H+                 
      1.66432770E-08    3      1000025         2        -1             # W2SS+  -->  Z3SS   UP     DB          
      1.66432770E-08    3      1000025         4        -3             # W2SS+  -->  Z3SS   CH     SB          
      1.86393251E-07    3      1000025       -11        12             # W2SS+  -->  Z3SS   E+     NUE         
      1.86393251E-07    3      1000025       -13        14             # W2SS+  -->  Z3SS   MU+    NUM         
      1.98541514E-07    3      1000025       -15        16             # W2SS+  -->  Z3SS   TAU+   NUT         
      5.52521320E-03    2      1000025        24                       # W2SS+  -->  Z3SS   W+                 
      4.95319682E-06    2      1000025        37                       # W2SS+  -->  Z3SS   H+                 
      1.46294206E-01    2      1000024        23                       # W2SS+  -->  W1SS+  Z0                 
      5.35974598E-09    3      1000024         1        -1             # W2SS+  -->  W1SS+  DN     DB          
      5.35974598E-09    3      1000024         3        -3             # W2SS+  -->  W1SS+  ST     SB          
      1.43718953E-10    3      1000024         2        -2             # W2SS+  -->  W1SS+  UP     UB          
      1.43718953E-10    3      1000024         4        -4             # W2SS+  -->  W1SS+  CH     CB          
      1.71788611E-10    3      1000024        12       -12             # W2SS+  -->  W1SS+  NUE    ANUE        
      1.71788611E-10    3      1000024        14       -14             # W2SS+  -->  W1SS+  NUM    ANUM        
      3.58226532E-10    3      1000024        16       -16             # W2SS+  -->  W1SS+  NUT    ANUT        
      6.39647535E-09    3      1000024        11       -11             # W2SS+  -->  W1SS+  E-     E+          
      6.39647535E-09    3      1000024        13       -13             # W2SS+  -->  W1SS+  MU-    MU+         
      6.78889922E-09    3      1000024        15       -15             # W2SS+  -->  W1SS+  TAU-   TAU+        
      1.55540720E-01    2      1000024        25                       # W2SS+  -->  W1SS+  HL0                
      1.03445314E-01    2      1000024        35                       # W2SS+  -->  W1SS+  HH0                
      1.04074411E-01    2      1000024        36                       # W2SS+  -->  W1SS+  HA0                
#         PDG         Width
DECAY        25  3.96857876E-03   # HL0   decays
#          BR          NDA       ID1       ID2       ID3       ID4
      5.62620484E-09    2           11       -11                       # HL0    -->  E-     E+                 
      2.37547516E-04    2           13       -13                       # HL0    -->  MU-    MU+                
      6.79555610E-02    2           15       -15                       # HL0    -->  TAU-   TAU+               
      7.05239563E-06    2            1        -1                       # HL0    -->  DN     DB                 
      2.84952181E-03    2            3        -3                       # HL0    -->  ST     SB                 
      6.10552669E-01    2            5        -5                       # HL0    -->  BT     BB                 
      2.15300201E-06    2            2        -2                       # HL0    -->  UP     UB                 
      3.99985686E-02    2            4        -4                       # HL0    -->  CH     CB                 
      2.65687704E-03    2           22        22                       # HL0    -->  GM     GM                 
      5.29692806E-02    2           21        21                       # HL0    -->  GL     GL                 
      1.11259753E-02    3           24        11       -12             # HL0    -->  W+     E-     ANUE        
      1.11259753E-02    3           24        13       -14             # HL0    -->  W+     MU-    ANUM        
      1.11259753E-02    3           24        15       -16             # HL0    -->  W+     TAU-   ANUT        
      3.33779268E-02    3           24        -2         1             # HL0    -->  W+     UB     DN          
      3.33779268E-02    3           24        -4         3             # HL0    -->  W+     CB     ST          
      1.11259753E-02    3          -24       -11        12             # HL0    -->  W-     E+     NUE         
      1.11259753E-02    3          -24       -13        14             # HL0    -->  W-     MU+    NUM         
      1.11259753E-02    3          -24       -15        16             # HL0    -->  W-     TAU+   NUT         
      3.33779268E-02    3          -24         2        -1             # HL0    -->  W-     UP     DB          
      3.33779268E-02    3          -24         4        -3             # HL0    -->  W-     CH     SB          
      1.53900811E-03    3           23        12       -12             # HL0    -->  Z0     NUE    ANUE        
      1.53900811E-03    3           23        14       -14             # HL0    -->  Z0     NUM    ANUM        
      1.53900811E-03    3           23        16       -16             # HL0    -->  Z0     NUT    ANUT        
      7.74567307E-04    3           23        11       -11             # HL0    -->  Z0     E-     E+          
      7.74567307E-04    3           23        13       -13             # HL0    -->  Z0     MU-    MU+         
      7.74567307E-04    3           23        15       -15             # HL0    -->  Z0     TAU-   TAU+        
      2.65360181E-03    3           23         2        -2             # HL0    -->  Z0     UP     UB          
      2.65360181E-03    3           23         4        -4             # HL0    -->  Z0     CH     CB          
      3.41849308E-03    3           23         1        -1             # HL0    -->  Z0     DN     DB          
      3.41849308E-03    3           23         3        -3             # HL0    -->  Z0     ST     SB          
      3.41849308E-03    3           23         5        -5             # HL0    -->  Z0     BT     BB          
#         PDG         Width
DECAY        35  3.55019617E+00   # HH0   decays
#          BR          NDA       ID1       ID2       ID3       ID4
      1.08396891E-08    2           11       -11                       # HH0    -->  E-     E+                 
      4.57671180E-04    2           13       -13                       # HH0    -->  MU-    MU+                
      1.31081611E-01    2           15       -15                       # HH0    -->  TAU-   TAU+               
      1.32786681E-05    2            1        -1                       # HH0    -->  DN     DB                 
      5.36525389E-03    2            3        -3                       # HH0    -->  ST     SB                 
      7.99764454E-01    2            5        -5                       # HH0    -->  BT     BB                 
      8.79618323E-11    2            2        -2                       # HH0    -->  UP     UB                 
      1.23876566E-06    2            4        -4                       # HH0    -->  CH     CB                 
      5.65095507E-02    2            6        -6                       # HH0    -->  TP     TB                 
      1.92852397E-07    2           22        22                       # HH0    -->  GM     GM                 
      2.48174820E-05    2           21        21                       # HH0    -->  GL     GL                 
      2.23785115E-04    2           24       -24                       # HH0    -->  W+     W-                 
      1.13619317E-04    2           23        23                       # HH0    -->  Z0     Z0                 
      1.30015414E-03    2      1000022   1000022                       # HH0    -->  Z1SS   Z1SS               
      1.62136566E-04    2      1000022   1000023                       # HH0    -->  Z1SS   Z2SS               
      7.69909006E-04    2      1000023   1000023                       # HH0    -->  Z2SS   Z2SS               
      3.38496035E-03    2      1000024  -1000024                       # HH0    -->  W1SS+  W1SS-              
      8.27403041E-04    2           25        25                       # HH0    -->  HL0    HL0                
#         PDG         Width
DECAY        36  3.54185438E+00   # HA0   decays
#          BR          NDA       ID1       ID2       ID3       ID4
      1.07955440E-08    2           11       -11                       # HA0    -->  E-     E+                 
      4.55807341E-04    2           13       -13                       # HA0    -->  MU-    MU+                
      1.30549386E-01    2           15       -15                       # HA0    -->  TAU-   TAU+               
      1.32253190E-05    2            1        -1                       # HA0    -->  DN     DB                 
      5.34369843E-03    2            3        -3                       # HA0    -->  ST     SB                 
      7.96586931E-01    2            5        -5                       # HA0    -->  BT     BB                 
      8.35887887E-11    2            2        -2                       # HA0    -->  UP     UB                 
      1.17810657E-06    2            4        -4                       # HA0    -->  CH     CB                 
      5.96937910E-02    2            6        -6                       # HA0    -->  TP     TB                 
      2.98656403E-07    2           22        22                       # HA0    -->  GM     GM                 
      7.74889195E-05    2           21        21                       # HA0    -->  GL     GL                 
      2.02713022E-03    2      1000022   1000022                       # HA0    -->  Z1SS   Z1SS               
      2.94527708E-05    2      1000022   1000023                       # HA0    -->  Z1SS   Z2SS               
      7.04577775E-04    2      1000023   1000023                       # HA0    -->  Z2SS   Z2SS               
      4.30201506E-03    2      1000024  -1000024                       # HA0    -->  W1SS+  W1SS-              
      2.15013264E-04    2           25        23                       # HA0    -->  HL0    Z0                 
#         PDG         Width
DECAY        37  3.11983132E+00   # H+    decays
#          BR          NDA       ID1       ID2       ID3       ID4
      1.22954393E-08    2           12       -11                       # H+     -->  NUE    E+                 
      5.19135676E-04    2           14       -13                       # H+     -->  NUM    MU+                
      1.48687482E-01    2           16       -15                       # H+     -->  NUT    TAU+               
      1.38451187E-05    2            2        -1                       # H+     -->  UP     DB                 
      5.59530547E-03    2            4        -3                       # H+     -->  CH     SB                 
      8.44648361E-01    2            6        -5                       # H+     -->  TP     BB                 
      1.49433017E-05    2      1000024   1000022                       # H+     -->  W1SS+  Z1SS               
      2.76091800E-04    2      1000024   1000023                       # H+     -->  W1SS+  Z2SS               
      2.44795170E-04    2           25        24                       # H+     -->  HL0    W+                 
