# SUSY Les Houches Accord 2 - MSSM spectrum + Decays
# SPheno v3.1.12 
# W. Porod, Comput. Phys. Commun. 153 (2003) 275-315, hep-ph/0301101
# in case of problems send email to porod@physik.uni-wuerzburg.de
# Created: 12.11.2012,  11:44
Block SPINFO         # Program information
     1   SPheno      # spectrum calculator
     2   v3.1.12     # version number
#
Block SPhenoINFO     # SPheno specific information
    1      2         # using 2-loop RGEs
    2      1         # using running masses for boundary conditions at mZ
Block MODSEL  # Model selection
    1    2    # mGMSB model
Block MINPAR  # Input parameters
    1    1.00000000E+05  # Lambda, scale of SUSY breaking
    2    2.50000000E+05  # M_M, messenger mass scale
    3    4.00000000E+01  # tanb at m_Z   
    4    1.00000000E+00  # Sign(mu)
    5    3.00000000E+00  # N_5 number of effective five-plets
    6    1.00000000E+00  # c_grav, Gravitino mass factor
Block gauge Q=  2.50000000E+05  # (GMSB scale)
   1    4.93688973E-01  # g'(Q)^DRbar
   2    6.49241478E-01  # g(Q)^DRbar
   3    9.40436940E-01  # g3(Q)^DRbar
Block SMINPUTS  # SM parameters
         1     1.27932524E+02  # alpha_em^-1(MZ)^MSbar
         2     1.16639000E-05  # G_mu [GeV^-2]
         3     1.17200000E-01  # alpha_s(MZ)^MSbar
         4     9.11876000E+01  # m_Z(pole)
         5     4.20000000E+00  # m_b(m_b), MSbar
         6     1.72500000E+02  # m_t(pole)
         7     1.77700000E+00  # m_tau(pole)
         8     0.00000000E+00  # m_nu_3
        11     5.10998910E-04  # m_e(pole)
        12     0.00000000E+00  # m_nu_1
        13     1.05658000E-01  # m_muon(pole)
        14     0.00000000E+00  # m_nu_2
        21     5.00000000E-03  # m_d(2 GeV), MSbar
        22     3.00000000E-03  # m_u(2 GeV), MSbar
        23     1.05000000E-01  # m_s(2 GeV), MSbar
        24     1.27000000E+00  # m_c(m_c), MSbar
Block gauge Q=  1.91237486E+03  # (SUSY scale)
   1    3.64474267E-01  # g'(Q)^DRbar
   2    6.39503918E-01  # g(Q)^DRbar
   3    1.02538404E+00  # g3(Q)^DRbar
Block Yu Q=  1.91237486E+03  # (SUSY scale)
  1  1     8.40288640E-06   # Y_u(Q)^DRbar
  2  2     3.55722341E-03   # Y_c(Q)^DRbar
  3  3     8.44131885E-01   # Y_t(Q)^DRbar
Block Yd Q=  1.91237486E+03  # (SUSY scale)
  1  1     4.78831712E-04   # Y_d(Q)^DRbar
  2  2     1.00554605E-02   # Y_s(Q)^DRbar
  3  3     4.83619190E-01   # Y_b(Q)^DRbar
Block Ye Q=  1.91237486E+03  # (SUSY scale)
  1  1     1.23071354E-04   # Y_e(Q)^DRbar
  2  2     2.54473758E-02   # Y_mu(Q)^DRbar
  3  3     4.28896302E-01   # Y_tau(Q)^DRbar
Block Au Q=  1.91237486E+03  # (SUSY scale)
  1  1    -6.17917875E+02   # A_u(Q)^DRbar
  2  2    -6.17915541E+02   # A_c(Q)^DRbar
  3  3    -5.78702602E+02   # A_t(Q)^DRbar
Block Ad Q=  1.91237486E+03  # (SUSY scale)
  1  1    -6.44725606E+02   # A_d(Q)^DRbar
  2  2    -6.44720210E+02   # A_s(Q)^DRbar
  3  3    -6.21287478E+02   # A_b(Q)^DRbar
Block Ae Q=  1.91237486E+03  # (SUSY scale)
  1  1    -5.77749117E+01   # A_e(Q)^DRbar
  2  2    -5.77708059E+01   # A_mu(Q)^DRbar
  3  3    -5.66118424E+01   # A_tau(Q)^DRbar
Block MSOFT Q=  1.91237486E+03  # soft SUSY breaking masses at Q
   1    4.29732992E+02  # M_1
   2    7.91040382E+02  # M_2
   3    2.04310860E+03  # M_3
  21    1.19597136E+05  # M^2_(H,d)
  22   -4.02462470E+05  # M^2_(H,u)
  31    6.25670385E+02  # M_(L,11)
  32    6.25649375E+02  # M_(L,22)
  33    6.19703338E+02  # M_(L,33)
  34    3.02604967E+02  # M_(E,11)
  35    3.02516369E+02  # M_(E,22)
  36    2.76360549E+02  # M_(E,33)
  41    1.99751139E+03  # M_(Q,11)
  42    1.99750138E+03  # M_(Q,22)
  43    1.91477590E+03  # M_(Q,33)
  44    1.91658282E+03  # M_(U,11)
  45    1.91658052E+03  # M_(U,22)
  46    1.78401480E+03  # M_(U,33)
  47    1.90877537E+03  # M_(D,11)
  48    1.90875655E+03  # M_(D,22)
  49    1.86513391E+03  # M_(D,33)
Block MASS  # Mass spectrum
#   PDG code      mass          particle
         6     1.72500000E+02  # m_t(pole)
        23     9.11876000E+01  # m_Z(pole)
        24     8.03103416E+01  # W+
        15     1.77700000E+00  # m_tau(pole)
        25     1.18568872E+02  # h0
        35     7.55106414E+02  # H0
        36     7.55053826E+02  # A0
        37     7.59967191E+02  # H+
   1000001     2.08045811E+03  # ~d_L
   2000001     1.98704351E+03  # ~d_R
   1000002     2.07902344E+03  # ~u_L
   2000002     1.99407654E+03  # ~u_R
   1000003     2.08044694E+03  # ~s_L
   2000003     1.98701974E+03  # ~s_R
   1000004     2.07901157E+03  # ~c_L
   2000004     1.99407375E+03  # ~c_R
   1000005     1.92943062E+03  # ~b_1
   2000005     1.98458882E+03  # ~b_2
   1000006     1.83809993E+03  # ~t_1
   2000006     1.98965138E+03  # ~t_2
   1000011     6.39956312E+02  # ~e_L-
   2000011     3.15926140E+02  # ~e_R-
   1000012     6.34596078E+02  # ~nu_eL
   1000013     6.39951163E+02  # ~mu_L-
   2000013     3.15768405E+02  # ~mu_R-
   1000014     6.34566236E+02  # ~nu_muL
   1000015     2.68792787E+02  # ~tau_1-
   2000015     6.38198688E+02  # ~tau_2-
   1000016     6.26234989E+02  # ~nu_tauL
   1000021     2.15286039E+03  # ~g
   1000022     4.17347358E+02  # ~chi_10
   1000023     6.76987545E+02  # ~chi_20
   1000025    -7.00417715E+02  # ~chi_30
   1000035     8.33489853E+02  # ~chi_40
   1000024     6.75464726E+02  # ~chi_1+
   1000037     8.33600375E+02  # ~chi_2+
   1000039     6.00000000E-09  # ~G
# Higgs mixing
Block alpha # Effective Higgs mixing angle
          -2.66745863E-02   # alpha
Block Hmix Q=  1.91237486E+03  # Higgs mixing parameters
   1    6.91649873E+02  # mu
   2    3.89649690E+01  # tan[beta](Q)
   3    2.43604758E+02  # v(Q)
   4    5.14709616E+05  # m^2_A(Q)
Block stopmix # stop mixing matrix
   1  1     1.84063926E-01   # Re[R_st(1,1)]
   1  2     9.82914275E-01   # Re[R_st(1,2)]
   2  1    -9.82914275E-01   # Re[R_st(2,1)]
   2  2     1.84063926E-01   # Re[R_st(2,2)]
Block sbotmix # sbottom mixing matrix
   1  1     2.97231788E-01   # Re[R_sb(1,1)]
   1  2     9.54805354E-01   # Re[R_sb(1,2)]
   2  1    -9.54805354E-01   # Re[R_sb(2,1)]
   2  2     2.97231788E-01   # Re[R_sb(2,2)]
Block staumix # stau mixing matrix
   1  1     1.57057969E-01   # Re[R_sta(1,1)]
   1  2     9.87589385E-01   # Re[R_sta(1,2)]
   2  1    -9.87589385E-01   # Re[R_sta(2,1)]
   2  2     1.57057969E-01   # Re[R_sta(2,2)]
Block Nmix # neutralino mixing matrix
   1  1    -9.92579656E-01   # Re[N(1,1)]
   1  2     1.32111486E-02   # Re[N(1,2)]
   1  3    -1.02808470E-01   # Re[N(1,3)]
   1  4     6.35728709E-02   # Re[N(1,4)]
   2  1     1.13823447E-01   # Re[N(2,1)]
   2  2     3.90675429E-01   # Re[N(2,2)]
   2  3    -6.55024611E-01   # Re[N(2,3)]
   2  4     6.36678640E-01   # Re[N(2,4)]
   3  1     2.71924329E-02   # Re[N(3,1)]
   3  2    -3.61978318E-02   # Re[N(3,2)]
   3  3    -7.04899367E-01   # Re[N(3,3)]
   3  4    -7.07860982E-01   # Re[N(3,4)]
   4  1    -3.30215126E-02   # Re[N(4,1)]
   4  2     9.19721638E-01   # Re[N(4,2)]
   4  3     2.51972337E-01   # Re[N(4,3)]
   4  4    -2.99218364E-01   # Re[N(4,4)]
Block Umix # chargino mixing matrix
   1  1    -3.55332410E-01   # Re[U(1,1)]
   1  2     9.34740006E-01   # Re[U(1,2)]
   2  1     9.34740006E-01   # Re[U(2,1)]
   2  2     3.55332410E-01   # Re[U(2,2)]
Block Vmix # chargino mixing matrix
   1  1    -4.21910731E-01   # Re[V(1,1)]
   1  2     9.06637378E-01   # Re[V(1,2)]
   2  1     9.06637378E-01   # Re[V(2,1)]
   2  2     4.21910731E-01   # Re[V(2,2)]
DECAY   2000011     4.94658770E-07   # ~e^-_R
#    BR                NDA      ID1      ID2
     2.02522004E-04    2     1000039        11   # BR(~e^-_R -> ~G e^-)
#    BR                NDA      ID1      ID2       ID3
     1.45607493E-14    3     2000013        11       -13   # BR(~e^-_R -> ~mu^-_R e^- mu^+)
     4.48054954E-14    3    -2000013        11        13   # BR(~e^-_R -> ~mu^+_R e^- mu^-)
     2.20861840E-01    3     1000015        11       -15   # BR(~e^-_R -> ~tau^-_1 e^- tau^+)
     7.78935638E-01    3    -1000015        11        15   # BR(~e^-_R -> ~tau^+_1 e^- tau^-)
DECAY   1000011     2.62466250E-01   # ~e^-_L
#    BR                NDA      ID1      ID2
     9.99999401E-01    2     1000022        11   # BR(~e^-_L -> chi^0_1 e^-)
     2.85055561E-07    2     2000011        23   # BR(~e^-_L -> ~e^-_R Z)
     3.00492998E-07    2     2000011        25   # BR(~e^-_L -> ~e^-_R h^0)
     1.30175213E-08    2     1000039        11   # BR(~e^-_L -> ~G e^-)
DECAY   2000013     4.87067473E-07   # ~mu^-_R
#    BR                NDA      ID1      ID2
     2.05165423E-04    2     1000039        13   # BR(~mu^-_R -> ~G mu^-)
#    BR                NDA      ID1      ID2       ID3
     2.20485277E-01    3     1000015        13       -15   # BR(~mu^-_R -> ~tau^-_1 mu^- tau^+)
     7.79309558E-01    3    -1000015        13        15   # BR(~mu^-_R -> ~tau^+_1 mu^- tau^-)
DECAY   1000013     2.69082589E-01   # ~mu^-_L
#    BR                NDA      ID1      ID2
     9.75576436E-01    2     1000022        13   # BR(~mu^-_L -> chi^0_1 mu^-)
     1.18923672E-02    2     2000013        23   # BR(~mu^-_L -> ~mu^-_R Z)
     1.25311841E-02    2     2000013        25   # BR(~mu^-_L -> ~mu^-_R h^0)
     1.26969276E-08    2     1000039        13   # BR(~mu^-_L -> ~G mu^-)
DECAY   1000015     4.46541941E-11   # ~tau^-_1
#    BR                NDA      ID1      ID2
     1.00000000E+00    2     1000039        15   # BR(~tau^-_1 -> ~G tau^-)
DECAY   2000015     2.24382614E+00   # ~tau^-_2
#    BR                NDA      ID1      ID2
     1.21555844E-01    2     1000022        15   # BR(~tau^-_2 -> chi^0_1 tau^-)
     4.50614789E-01    2     1000015        23   # BR(~tau^-_2 -> ~tau^-_1 Z)
     4.27829366E-01    2     1000015        25   # BR(~tau^-_2 -> ~tau^-_1 h^0)
     1.50185150E-09    2     1000039        15   # BR(~tau^-_2 -> ~G tau^-)
DECAY   1000012     2.78627049E-01   # ~nu_e
#    BR                NDA      ID1      ID2
     9.99999473E-01    2     1000022        12   # BR(~nu_e -> chi^0_1 nu_e)
     5.15667275E-07    2     2000011        24   # BR(~nu_e -> ~e^-_R W^+)
     1.17574670E-08    2     1000039        12   # BR(~nu_e -> ~G nu_e)
DECAY   1000014     2.84718480E-01   # ~nu_mu
#    BR                NDA      ID1      ID2
     9.78418596E-01    2     1000022        14   # BR(~nu_mu -> chi^0_1 nu_mu)
     2.15813926E-02    2     2000013        24   # BR(~nu_mu -> ~mu^-_R W^+)
     1.15032159E-08    2     1000039        14   # BR(~nu_mu -> ~G nu_mu)
DECAY   1000016     2.15993270E+00   # ~nu_tau
#    BR                NDA      ID1      ID2
     1.22135709E-01    2     1000022        16   # BR(~nu_tau -> chi^0_1 nu_tau)
     8.77864289E-01    2     1000015        24   # BR(~nu_tau -> ~tau^-_1 W^+)
     1.41937304E-09    2     1000039        16   # BR(~nu_tau -> ~G nu_tau)
DECAY   2000001     1.06386691E+00   # ~d_R
#    BR                NDA      ID1      ID2
     9.87447695E-01    2     1000022         1   # BR(~d_R -> chi^0_1 d)
     1.11069102E-02    2     1000023         1   # BR(~d_R -> chi^0_2 d)
     6.25226077E-04    2     1000025         1   # BR(~d_R -> chi^0_3 d)
     8.12284860E-04    2     1000035         1   # BR(~d_R -> chi^0_4 d)
     6.82269189E-06    2    -1000024         2   # BR(~d_R -> chi^-_1 u)
     1.34686898E-07    2    -1000037         2   # BR(~d_R -> chi^-_2 u)
     9.26829218E-07    2     1000039         1   # BR(~d_R -> ~G d)
DECAY   1000001     1.84971900E+01   # ~d_L
#    BR                NDA      ID1      ID2
     1.71599314E-02    2     1000022         1   # BR(~d_L -> chi^0_1 d)
     4.98195400E-02    2     1000023         1   # BR(~d_L -> chi^0_2 d)
     6.15652652E-04    2     1000025         1   # BR(~d_L -> chi^0_3 d)
     2.76500295E-01    2     1000035         1   # BR(~d_L -> chi^0_4 d)
     9.24668145E-02    2    -1000024         2   # BR(~d_L -> chi^-_1 u)
     5.63437699E-01    2    -1000037         2   # BR(~d_L -> chi^-_2 u)
     9.55524798E-14    2     2000002       -24   # BR(~d_L -> ~u_R W^-)
     2.87632804E-11    2     2000001        23   # BR(~d_L -> ~d_R Z)
     6.70716893E-08    2     1000039         1   # BR(~d_L -> ~G d)
DECAY   2000003     1.07027103E+00   # ~s_R
#    BR                NDA      ID1      ID2
     9.81614884E-01    2     1000022         3   # BR(~s_R -> chi^0_1 s)
     1.24894253E-02    2     1000023         3   # BR(~s_R -> chi^0_2 s)
     2.00949568E-03    2     1000025         3   # BR(~s_R -> chi^0_3 s)
     8.35561014E-04    2     1000035         3   # BR(~s_R -> chi^0_4 s)
     2.99065487E-03    2    -1000024         4   # BR(~s_R -> chi^-_1 c)
     5.90581653E-05    2    -1000037         4   # BR(~s_R -> chi^-_2 c)
     9.21228272E-07    2     1000039         3   # BR(~s_R -> ~G s)
DECAY   1000003     1.85004201E+01   # ~s_L
#    BR                NDA      ID1      ID2
     1.71557229E-02    2     1000022         3   # BR(~s_L -> chi^0_1 s)
     4.98753368E-02    2     1000023         3   # BR(~s_L -> chi^0_2 s)
     7.05661759E-04    2     1000025         3   # BR(~s_L -> chi^0_3 s)
     2.76467989E-01    2     1000035         3   # BR(~s_L -> chi^0_4 s)
     9.24402221E-02    2    -1000024         4   # BR(~s_L -> chi^-_1 c)
     5.63354970E-01    2    -1000037         4   # BR(~s_L -> chi^-_2 c)
     1.70879011E-08    2     2000004       -24   # BR(~s_L -> ~c_R W^-)
     1.27881461E-08    2     2000003        23   # BR(~s_L -> ~s_R Z)
     6.70581788E-08    2     1000039         3   # BR(~s_L -> ~G s)
DECAY   1000005     1.69054336E+01   # ~b_1
#    BR                NDA      ID1      ID2
     7.65049563E-02    2     1000022         5   # BR(~b_1 -> chi^0_1 b)
     2.26192967E-01    2     1000023         5   # BR(~b_1 -> chi^0_2 b)
     1.91443678E-01    2     1000025         5   # BR(~b_1 -> chi^0_3 b)
     1.52583259E-03    2     1000035         5   # BR(~b_1 -> chi^0_4 b)
     4.87162021E-01    2    -1000024         6   # BR(~b_1 -> chi^-_1 t)
     1.71021412E-02    2    -1000037         6   # BR(~b_1 -> chi^-_2 t)
     6.83528554E-05    2     1000006       -24   # BR(~b_1 -> ~t_1 W^-)
     5.03455873E-08    2     1000039         5   # BR(~b_1 -> ~G b)
DECAY   2000005     4.29008072E+01   # ~b_2
#    BR                NDA      ID1      ID2
     4.40876053E-03    2     1000022         5   # BR(~b_2 -> chi^0_1 b)
     7.12969529E-02    2     1000023         5   # BR(~b_2 -> chi^0_2 b)
     8.52911579E-02    2     1000025         5   # BR(~b_2 -> chi^0_3 b)
     1.27525187E-01    2     1000035         5   # BR(~b_2 -> chi^0_4 b)
     3.75827433E-01    2    -1000024         6   # BR(~b_2 -> chi^-_1 t)
     3.29687125E-01    2    -1000037         6   # BR(~b_2 -> chi^-_2 t)
     5.96336073E-03    2     1000006       -24   # BR(~b_2 -> ~t_1 W^-)
     2.28417612E-08    2     1000039         5   # BR(~b_2 -> ~G b)
DECAY   2000002     4.27331275E+00   # ~u_R
#    BR                NDA      ID1      ID2
     9.87445844E-01    2     1000022         2   # BR(~u_R -> chi^0_1 u)
     1.11168962E-02    2     1000023         2   # BR(~u_R -> chi^0_2 u)
     6.22890291E-04    2     1000025         2   # BR(~u_R -> chi^0_3 u)
     8.14134081E-04    2     1000035         2   # BR(~u_R -> chi^0_4 u)
     5.30230106E-10    2     1000024         1   # BR(~u_R -> chi^+_1 d)
     1.56055857E-11    2     1000037         1   # BR(~u_R -> chi^+_2 d)
     2.34852168E-07    2     1000039         2   # BR(~u_R -> ~G u)
DECAY   1000002     1.85674401E+01   # ~u_L
#    BR                NDA      ID1      ID2
     1.29006714E-02    2     1000022         2   # BR(~u_L -> chi^0_1 u)
     6.18816382E-02    2     1000023         2   # BR(~u_L -> chi^0_2 u)
     3.44720978E-04    2     1000025         2   # BR(~u_L -> chi^0_3 u)
     2.67713969E-01    2     1000035         2   # BR(~u_L -> chi^0_4 u)
     1.29739346E-01    2     1000024         1   # BR(~u_L -> chi^+_1 d)
     5.27419587E-01    2     1000037         1   # BR(~u_L -> chi^+_2 d)
     6.03873410E-10    2     2000001        24   # BR(~u_L -> ~d_R W^+)
     6.65878556E-08    2     1000039         2   # BR(~u_L -> ~G u)
DECAY   2000004     4.27411754E+00   # ~c_R
#    BR                NDA      ID1      ID2
     9.87257163E-01    2     1000022         4   # BR(~c_R -> chi^0_1 c)
     1.11602289E-02    2     1000023         4   # BR(~c_R -> chi^0_2 c)
     6.69379588E-04    2     1000025         4   # BR(~c_R -> chi^0_3 c)
     8.15189423E-04    2     1000035         4   # BR(~c_R -> chi^0_4 c)
     9.50083966E-05    2     1000024         3   # BR(~c_R -> chi^+_1 s)
     2.79557342E-06    2     1000037         3   # BR(~c_R -> chi^+_2 s)
     2.34805922E-07    2     1000039         4   # BR(~c_R -> ~G c)
DECAY   1000004     1.85709139E+01   # ~c_L
#    BR                NDA      ID1      ID2
     1.28983635E-02    2     1000022         4   # BR(~c_L -> chi^0_1 c)
     6.18760929E-02    2     1000023         4   # BR(~c_L -> chi^0_2 c)
     3.55510368E-04    2     1000025         4   # BR(~c_L -> chi^0_3 c)
     2.67664990E-01    2     1000035         4   # BR(~c_L -> chi^0_4 c)
     1.29865972E-01    2     1000024         3   # BR(~c_L -> chi^+_1 s)
     5.27338738E-01    2     1000037         3   # BR(~c_L -> chi^+_2 s)
     2.66624406E-07    2     2000003        24   # BR(~c_L -> ~s_R W^+)
     6.65733988E-08    2     1000039         4   # BR(~c_L -> ~G c)
DECAY   1000006     4.18814574E+01   # ~t_1
#    BR                NDA      ID1      ID2
     2.30160457E-04    2     1000022         4   # BR(~t_1 -> chi^0_1 c)
     9.19324369E-02    2     1000022         6   # BR(~t_1 -> chi^0_1 t)
     1.05668255E-03    2     1000023         4   # BR(~t_1 -> chi^0_2 c)
     2.00431247E-01    2     1000023         6   # BR(~t_1 -> chi^0_2 t)
     2.32918597E-01    2     1000025         6   # BR(~t_1 -> chi^0_3 t)
     1.58527147E-02    2     1000035         6   # BR(~t_1 -> chi^0_4 t)
     4.24413529E-01    2     1000024         5   # BR(~t_1 -> chi^+_1 b)
     3.31508200E-02    2     1000037         5   # BR(~t_1 -> chi^+_2 b)
     1.53924025E-08    2     1000039         6   # BR(~t_1 -> ~G t)
#    BR                NDA      ID1      ID2       ID3
     1.37976626E-05    3     1000022        24         5   # BR(~t_1 -> chi^0_1 W^+ b)
DECAY   2000006     4.53035477E+01   # ~t_2
#    BR                NDA      ID1      ID2
     6.08343702E-03    2     1000022         6   # BR(~t_2 -> chi^0_1 t)
     1.92803638E-01    2     1000023         6   # BR(~t_2 -> chi^0_2 t)
     2.26352607E-01    2     1000025         6   # BR(~t_2 -> chi^0_3 t)
     1.67045298E-01    2     1000035         6   # BR(~t_2 -> chi^0_4 t)
     1.45480011E-01    2     1000024         5   # BR(~t_2 -> chi^+_1 b)
     2.57030207E-01    2     1000037         5   # BR(~t_2 -> chi^+_2 b)
     2.95450450E-03    2     1000006        23   # BR(~t_2 -> ~t_1 Z)
     2.25027551E-03    2     1000006        25   # BR(~t_2 -> ~t_1 h^0)
     2.12566964E-08    2     1000039         6   # BR(~t_2 -> ~G t)
DECAY   1000024     1.24370094E+00   # chi^+_1
#    BR                NDA      ID1      ID2
     5.23672644E-08    2    -2000011        12   # BR(chi^+_1 -> ~e^+_R nu_e)
     2.92364285E-03    2    -1000011        12   # BR(chi^+_1 -> ~e^+_L nu_e)
     2.23983000E-03    2    -2000013        14   # BR(chi^+_1 -> ~mu^+_R nu_mu)
     2.91806215E-03    2    -1000013        14   # BR(chi^+_1 -> ~mu^+_L nu_mu)
     7.12933898E-01    2    -1000015        16   # BR(chi^+_1 -> ~tau^+_1 nu_tau)
     1.62125375E-03    2    -2000015        16   # BR(chi^+_1 -> ~tau^+_2 nu_tau)
     5.41585791E-03    2     1000012       -11   # BR(chi^+_1 -> ~nu_e e^+)
     5.46820460E-03    2     1000014       -13   # BR(chi^+_1 -> ~nu_mu mu^+)
     2.57359626E-02    2     1000016       -15   # BR(chi^+_1 -> ~nu_tau tau^+)
     2.40574040E-01    2     1000022        24   # BR(chi^+_1 -> chi^0_1 W^+)
#    BR                NDA      ID1      ID2       ID3
     7.77649067E-09    3     1000022        -1         2   # BR(chi^+_1 -> chi^0_1 d_bar u)
     9.96714306E-09    3     1000022        -3         4   # BR(chi^+_1 -> chi^0_1 s_bar c)
     1.40053210E-04    3     1000022        -5         6   # BR(chi^+_1 -> chi^0_1 b_bar t)
     3.44476990E-12    3     1000022       -11        12   # BR(chi^+_1 -> chi^0_1 e^+ nu_e)
     1.47060962E-07    3     1000022       -13        14   # BR(chi^+_1 -> chi^0_1 mu^+ nu_mu)
     2.89780222E-05    3     1000022       -15        16   # BR(chi^+_1 -> chi^0_1 tau^+ nu_tau)
DECAY   1000037     4.98949650E+00   # chi^+_2
#    BR                NDA      ID1      ID2
     2.68306005E-10    2    -2000011        12   # BR(chi^+_2 -> ~e^+_R nu_e)
     1.00133610E-01    2    -1000011        12   # BR(chi^+_2 -> ~e^+_L nu_e)
     1.14833446E-05    2    -2000013        14   # BR(chi^+_2 -> ~mu^+_R nu_mu)
     1.00158509E-01    2    -1000013        14   # BR(chi^+_2 -> ~mu^+_L nu_mu)
     4.27816786E-03    2    -1000015        16   # BR(chi^+_2 -> ~tau^+_1 nu_tau)
     1.07415257E-01    2    -2000015        16   # BR(chi^+_2 -> ~tau^+_2 nu_tau)
     9.87680850E-02    2     1000012       -11   # BR(chi^+_2 -> ~nu_e e^+)
     9.88158529E-02    2     1000014       -13   # BR(chi^+_2 -> ~nu_mu mu^+)
     1.12800631E-01    2     1000016       -15   # BR(chi^+_2 -> ~nu_tau tau^+)
     6.81691249E-03    2     1000022        24   # BR(chi^+_2 -> chi^0_1 W^+)
     1.24702639E-01    2     1000023        24   # BR(chi^+_2 -> chi^0_2 W^+)
     7.32443657E-02    2     1000025        24   # BR(chi^+_2 -> chi^0_3 W^+)
     1.07991215E-01    2     1000024        23   # BR(chi^+_2 -> chi^+_1 Z)
     6.48212482E-02    2     1000024        25   # BR(chi^+_2 -> chi^+_1 h^0)
#    BR                NDA      ID1      ID2       ID3
     3.85770184E-09    3     1000024         2        -2   # BR(chi^+_2 -> chi^+_1 u u_bar)
     3.85151590E-09    3     1000024         4        -4   # BR(chi^+_2 -> chi^+_1 c c_bar)
     5.13369876E-09    3     1000024         1        -1   # BR(chi^+_2 -> chi^+_1 d d_bar)
     5.45879716E-09    3     1000024         3        -3   # BR(chi^+_2 -> chi^+_1 s s_bar)
     7.72362963E-07    3     1000024         5        -5   # BR(chi^+_2 -> chi^+_1 b b_bar)
     1.08434044E-06    3     1000024        11       -11   # BR(chi^+_2 -> chi^+_1 e^- e^+)
     1.09081879E-06    3     1000024        13       -13   # BR(chi^+_2 -> chi^+_1 mu^- mu^+)
     2.82969740E-06    3     1000024        15       -15   # BR(chi^+_2 -> chi^+_1 tau^- tau^+)
     2.22939228E-06    3     1000024        12       -12   # BR(chi^+_2 -> chi^+_1 nu_e nu_bar_e)
     9.72724318E-08    3     1000022        -1         2   # BR(chi^+_2 -> chi^0_1 d_bar u)
     9.73173749E-08    3     1000022        -3         4   # BR(chi^+_2 -> chi^0_1 s_bar c)
     3.02492664E-05    3     1000022        -5         6   # BR(chi^+_2 -> chi^0_1 b_bar t)
     5.00089574E-14    3     1000022       -11        12   # BR(chi^+_2 -> chi^0_1 e^+ nu_e)
     2.13749280E-09    3     1000022       -13        14   # BR(chi^+_2 -> chi^0_1 mu^+ nu_mu)
     5.65931842E-07    3     1000022       -15        16   # BR(chi^+_2 -> chi^0_1 tau^+ nu_tau)
     2.19903531E-09    3     1000023        -1         2   # BR(chi^+_2 -> chi^0_2 d_bar u)
     2.41382239E-09    3     1000023        -3         4   # BR(chi^+_2 -> chi^0_2 s_bar c)
     6.03015158E-07    3     1000023       -11        12   # BR(chi^+_2 -> chi^0_2 e^+ nu_e)
     6.05584975E-07    3     1000023       -13        14   # BR(chi^+_2 -> chi^0_2 mu^+ nu_mu)
     1.31418906E-06    3     1000023       -15        16   # BR(chi^+_2 -> chi^0_2 tau^+ nu_tau)
     2.67006065E-11    3     1000025        -1         2   # BR(chi^+_2 -> chi^0_3 d_bar u)
     1.03649341E-10    3     1000025        -3         4   # BR(chi^+_2 -> chi^0_3 s_bar c)
     4.17707820E-09    3     1000025       -11        12   # BR(chi^+_2 -> chi^0_3 e^+ nu_e)
     5.72748247E-09    3     1000025       -13        14   # BR(chi^+_2 -> chi^0_3 mu^+ nu_mu)
     4.47946124E-07    3     1000025       -15        16   # BR(chi^+_2 -> chi^0_3 tau^+ nu_tau)
DECAY   1000022     1.53962258E+00   # chi^0_1
#    BR                NDA      ID1      ID2
     1.28669903E-01    2     2000011       -11   # BR(chi^0_1 -> ~e^-_R e^+)
     1.28669903E-01    2    -2000011        11   # BR(chi^0_1 -> ~e^+_R e^-)
     1.29015247E-01    2     2000013       -13   # BR(chi^0_1 -> ~mu^-_R mu^+)
     1.29015247E-01    2    -2000013        13   # BR(chi^0_1 -> ~mu^+_R mu^-)
     2.42314850E-01    2     1000015       -15   # BR(chi^0_1 -> ~tau^-_1 tau^+)
     2.42314850E-01    2    -1000015        15   # BR(chi^0_1 -> ~tau^+_1 tau^-)
     1.91726843E-10    2     1000039        22   # BR(chi^0_1 -> ~G photon)
     5.76695779E-11    2     1000039        23   # BR(chi^0_1 -> ~G Z)
     1.14290959E-12    2     1000039        25   # BR(chi^0_1 -> ~G h^0)
DECAY   1000023     1.35657155E+00   # chi^0_2
#    BR                NDA      ID1      ID2
     1.04551127E-02    2     2000011       -11   # BR(chi^0_2 -> ~e^-_R e^+)
     1.04551127E-02    2    -2000011        11   # BR(chi^0_2 -> ~e^+_R e^-)
     2.38511547E-03    2     1000011       -11   # BR(chi^0_2 -> ~e^-_L e^+)
     2.38511547E-03    2    -1000011        11   # BR(chi^0_2 -> ~e^+_L e^-)
     1.14636008E-02    2     2000013       -13   # BR(chi^0_2 -> ~mu^-_R mu^+)
     1.14636008E-02    2    -2000013        13   # BR(chi^0_2 -> ~mu^+_R mu^-)
     2.39956492E-03    2     1000013       -13   # BR(chi^0_2 -> ~mu^-_L mu^+)
     2.39956492E-03    2    -1000013        13   # BR(chi^0_2 -> ~mu^+_L mu^-)
     3.38553366E-01    2     1000015       -15   # BR(chi^0_2 -> ~tau^-_1 tau^+)
     3.38553366E-01    2    -1000015        15   # BR(chi^0_2 -> ~tau^+_1 tau^-)
     6.87346115E-03    2     2000015       -15   # BR(chi^0_2 -> ~tau^-_2 tau^+)
     6.87346115E-03    2    -2000015        15   # BR(chi^0_2 -> ~tau^+_2 tau^-)
     1.58574279E-03    2     1000012       -12   # BR(chi^0_2 -> ~nu_e nu_bar_e)
     1.58574279E-03    2    -1000012        12   # BR(chi^0_2 -> ~nu^*_e nu_e)
     1.58790390E-03    2     1000014       -14   # BR(chi^0_2 -> ~nu_mu nu_bar_mu)
     1.58790390E-03    2    -1000014        14   # BR(chi^0_2 -> ~nu^*_mu nu_mu)
     2.24407249E-03    2     1000016       -16   # BR(chi^0_2 -> ~nu_tau nu_bar_tau)
     2.24407249E-03    2    -1000016        16   # BR(chi^0_2 -> ~nu^*_tau nu_tau)
     1.47259883E-02    2     1000022        23   # BR(chi^0_2 -> chi^0_1 Z)
     2.30139292E-01    2     1000022        25   # BR(chi^0_2 -> chi^0_1 h^0)
     2.85152375E-10    2     1000039        22   # BR(chi^0_2 -> ~G photon)
     6.27290144E-12    2     1000039        23   # BR(chi^0_2 -> ~G Z)
     1.42545874E-09    2     1000039        25   # BR(chi^0_2 -> ~G h^0)
     3.87330445E-07    2     1000022        22   # BR(chi^0_2 -> chi^0_1 photon)
#    BR                NDA      ID1      ID2       ID3
     7.12999916E-09    3     1000022         2        -2   # BR(chi^0_2 -> chi^0_1 u u_bar)
     7.13691082E-09    3     1000022         4        -4   # BR(chi^0_2 -> chi^0_1 c c_bar)
     4.04743796E-09    3     1000022         1        -1   # BR(chi^0_2 -> chi^0_1 d d_bar)
     6.51458108E-09    3     1000022         3        -3   # BR(chi^0_2 -> chi^0_1 s s_bar)
     5.78839867E-06    3     1000022         5        -5   # BR(chi^0_2 -> chi^0_1 b b_bar)
     2.32317283E-06    3     1000022        11       -11   # BR(chi^0_2 -> chi^0_1 e^- e^+)
     2.44867012E-06    3     1000022        13       -13   # BR(chi^0_2 -> chi^0_1 mu^- mu^+)
     2.78653409E-05    3     1000022        15       -15   # BR(chi^0_2 -> chi^0_1 tau^- tau^+)
     3.19670872E-12    3     1000024         1        -2   # BR(chi^0_2 -> chi^+_1 d u_bar)
     3.19670872E-12    3    -1000024        -1         2   # BR(chi^0_2 -> chi^-_1 d_bar u)
     2.08616638E-14    3     1000024         3        -4   # BR(chi^0_2 -> chi^+_1 s c_bar)
     2.08616638E-14    3    -1000024        -3         4   # BR(chi^0_2 -> chi^-_1 s_bar c)
     1.03004069E-12    3     1000024        11       -12   # BR(chi^0_2 -> chi^+_1 e^- nu_bar_e)
     1.03004069E-12    3    -1000024       -11        12   # BR(chi^0_2 -> chi^-_1 e^+ nu_e)
     1.00577860E-12    3     1000024        13       -14   # BR(chi^0_2 -> chi^+_1 mu^- nu_bar_mu)
     1.00577860E-12    3    -1000024       -13        14   # BR(chi^0_2 -> chi^-_1 mu^+ nu_mu)
DECAY   1000025     1.32132651E+00   # chi^0_3
#    BR                NDA      ID1      ID2
     6.57278919E-04    2     2000011       -11   # BR(chi^0_3 -> ~e^-_R e^+)
     6.57278919E-04    2    -2000011        11   # BR(chi^0_3 -> ~e^+_R e^-)
     1.26084403E-05    2     1000011       -11   # BR(chi^0_3 -> ~e^-_L e^+)
     1.26084403E-05    2    -1000011        11   # BR(chi^0_3 -> ~e^+_L e^-)
     1.70717983E-03    2     2000013       -13   # BR(chi^0_3 -> ~mu^-_R mu^+)
     1.70717983E-03    2    -2000013        13   # BR(chi^0_3 -> ~mu^+_R mu^-)
     6.02134467E-05    2     1000013       -13   # BR(chi^0_3 -> ~mu^-_L mu^+)
     6.02134467E-05    2    -1000013        13   # BR(chi^0_3 -> ~mu^+_L mu^-)
     3.42330394E-01    2     1000015       -15   # BR(chi^0_3 -> ~tau^-_1 tau^+)
     3.42330394E-01    2    -1000015        15   # BR(chi^0_3 -> ~tau^+_1 tau^-)
     1.43876694E-02    2     2000015       -15   # BR(chi^0_3 -> ~tau^-_2 tau^+)
     1.43876694E-02    2    -2000015        15   # BR(chi^0_3 -> ~tau^+_2 tau^-)
     9.24469568E-05    2     1000012       -12   # BR(chi^0_3 -> ~nu_e nu_bar_e)
     9.24469568E-05    2    -1000012        12   # BR(chi^0_3 -> ~nu^*_e nu_e)
     9.25266649E-05    2     1000014       -14   # BR(chi^0_3 -> ~nu_mu nu_bar_mu)
     9.25266649E-05    2    -1000014        14   # BR(chi^0_3 -> ~nu^*_mu nu_mu)
     1.15958830E-04    2     1000016       -16   # BR(chi^0_3 -> ~nu_tau nu_bar_tau)
     1.15958830E-04    2    -1000016        16   # BR(chi^0_3 -> ~nu^*_tau nu_tau)
     2.67345529E-01    2     1000022        23   # BR(chi^0_3 -> chi^0_1 Z)
     1.36784398E-02    2     1000022        25   # BR(chi^0_3 -> chi^0_1 h^0)
     1.31993755E-13    2     1000039        22   # BR(chi^0_3 -> ~G photon)
     3.65617792E-10    2     1000039        23   # BR(chi^0_3 -> ~G Z)
     1.92515535E-09    2     1000039        25   # BR(chi^0_3 -> ~G h^0)
     2.11076462E-07    2     1000022        22   # BR(chi^0_3 -> chi^0_1 photon)
     3.69538407E-09    2     1000023        22   # BR(chi^0_3 -> chi^0_2 photon)
#    BR                NDA      ID1      ID2       ID3
     1.21985872E-10    3     1000022         2        -2   # BR(chi^0_3 -> chi^0_1 u u_bar)
     1.39174582E-10    3     1000022         4        -4   # BR(chi^0_3 -> chi^0_1 c c_bar)
     4.17297523E-11    3     1000022         1        -1   # BR(chi^0_3 -> chi^0_1 d d_bar)
     3.69389322E-09    3     1000022         3        -3   # BR(chi^0_3 -> chi^0_1 s s_bar)
     8.52845065E-06    3     1000022         5        -5   # BR(chi^0_3 -> chi^0_1 b b_bar)
     6.90516737E-08    3     1000022        11       -11   # BR(chi^0_3 -> chi^0_1 e^- e^+)
     2.39864104E-07    3     1000022        13       -13   # BR(chi^0_3 -> chi^0_1 mu^- mu^+)
     3.50074356E-05    3     1000022        15       -15   # BR(chi^0_3 -> chi^0_1 tau^- tau^+)
     5.26743009E-07    3     1000023         2        -2   # BR(chi^0_3 -> chi^0_2 u u_bar)
     5.17468782E-07    3     1000023         4        -4   # BR(chi^0_3 -> chi^0_2 c c_bar)
     6.83399931E-07    3     1000023         1        -1   # BR(chi^0_3 -> chi^0_2 d d_bar)
     6.83291113E-07    3     1000023         3        -3   # BR(chi^0_3 -> chi^0_2 s s_bar)
     5.20244725E-07    3     1000023         5        -5   # BR(chi^0_3 -> chi^0_2 b b_bar)
     1.57135566E-07    3     1000023        11       -11   # BR(chi^0_3 -> chi^0_2 e^- e^+)
     1.57077799E-07    3     1000023        13       -13   # BR(chi^0_3 -> chi^0_2 mu^- mu^+)
     1.40194938E-07    3     1000023        15       -15   # BR(chi^0_3 -> chi^0_2 tau^- tau^+)
     9.37829991E-07    3     1000023        12       -12   # BR(chi^0_3 -> chi^0_2 nu_e nu_bar_e)
     2.53403243E-06    3     1000024         1        -2   # BR(chi^0_3 -> chi^+_1 d u_bar)
     2.53403243E-06    3    -1000024        -1         2   # BR(chi^0_3 -> chi^-_1 d_bar u)
     2.50285617E-06    3     1000024         3        -4   # BR(chi^0_3 -> chi^+_1 s c_bar)
     2.50285617E-06    3    -1000024        -3         4   # BR(chi^0_3 -> chi^-_1 s_bar c)
     8.43436184E-07    3     1000024        11       -12   # BR(chi^0_3 -> chi^+_1 e^- nu_bar_e)
     8.43436184E-07    3    -1000024       -11        12   # BR(chi^0_3 -> chi^-_1 e^+ nu_e)
     8.43430533E-07    3     1000024        13       -14   # BR(chi^0_3 -> chi^+_1 mu^- nu_bar_mu)
     8.43430533E-07    3    -1000024       -13        14   # BR(chi^0_3 -> chi^-_1 mu^+ nu_mu)
     8.20799904E-07    3     1000024        15       -16   # BR(chi^0_3 -> chi^+_1 tau^- nu_bar_tau)
     8.20799904E-07    3    -1000024       -15        16   # BR(chi^0_3 -> chi^-_1 tau^+ nu_tau)
DECAY   1000035     4.99072265E+00   # chi^0_4
#    BR                NDA      ID1      ID2
     3.52919495E-04    2     2000011       -11   # BR(chi^0_4 -> ~e^-_R e^+)
     3.52919495E-04    2    -2000011        11   # BR(chi^0_4 -> ~e^+_R e^-)
     4.64545150E-02    2     1000011       -11   # BR(chi^0_4 -> ~e^-_L e^+)
     4.64545150E-02    2    -1000011        11   # BR(chi^0_4 -> ~e^+_L e^-)
     3.57000596E-04    2     2000013       -13   # BR(chi^0_4 -> ~mu^-_R mu^+)
     3.57000596E-04    2    -2000013        13   # BR(chi^0_4 -> ~mu^+_R mu^-)
     4.64778301E-02    2     1000013       -13   # BR(chi^0_4 -> ~mu^-_L mu^+)
     4.64778301E-02    2    -1000013        13   # BR(chi^0_4 -> ~mu^+_L mu^-)
     2.43701546E-03    2     1000015       -15   # BR(chi^0_4 -> ~tau^-_1 tau^+)
     2.43701546E-03    2    -1000015        15   # BR(chi^0_4 -> ~tau^+_1 tau^-)
     5.31232581E-02    2     2000015       -15   # BR(chi^0_4 -> ~tau^-_2 tau^+)
     5.31232581E-02    2    -2000015        15   # BR(chi^0_4 -> ~tau^+_2 tau^-)
     5.28621289E-02    2     1000012       -12   # BR(chi^0_4 -> ~nu_e nu_bar_e)
     5.28621289E-02    2    -1000012        12   # BR(chi^0_4 -> ~nu^*_e nu_e)
     5.28758431E-02    2     1000014       -14   # BR(chi^0_4 -> ~nu_mu nu_bar_mu)
     5.28758431E-02    2    -1000014        14   # BR(chi^0_4 -> ~nu^*_mu nu_mu)
     5.67480282E-02    2     1000016       -16   # BR(chi^0_4 -> ~nu_tau nu_bar_tau)
     5.67480282E-02    2    -1000016        16   # BR(chi^0_4 -> ~nu^*_tau nu_tau)
     1.23107054E-01    2     1000024       -24   # BR(chi^0_4 -> chi^+_1 W^-)
     1.23107054E-01    2    -1000024        24   # BR(chi^0_4 -> chi^-_1 W^+)
     7.94866433E-04    2     1000022        23   # BR(chi^0_4 -> chi^0_1 Z)
     1.30297004E-03    2     1000023        23   # BR(chi^0_4 -> chi^0_2 Z)
     5.61708042E-02    2     1000025        23   # BR(chi^0_4 -> chi^0_3 Z)
     7.14831363E-03    2     1000022        25   # BR(chi^0_4 -> chi^0_1 h^0)
     6.48819885E-02    2     1000023        25   # BR(chi^0_4 -> chi^0_2 h^0)
     9.43971069E-05    2     1000025        25   # BR(chi^0_4 -> chi^0_3 h^0)
     4.67167665E-10    2     1000039        22   # BR(chi^0_4 -> ~G photon)
     2.40426854E-09    2     1000039        23   # BR(chi^0_4 -> ~G Z)
     2.39870760E-10    2     1000039        25   # BR(chi^0_4 -> ~G h^0)
     3.18052322E-07    2     1000022        22   # BR(chi^0_4 -> chi^0_1 photon)
     1.24381932E-06    2     1000023        22   # BR(chi^0_4 -> chi^0_2 photon)
     8.76656891E-07    2     1000025        22   # BR(chi^0_4 -> chi^0_3 photon)
#    BR                NDA      ID1      ID2       ID3
     4.19004661E-08    3     1000022         2        -2   # BR(chi^0_4 -> chi^0_1 u u_bar)
     4.18934999E-08    3     1000022         4        -4   # BR(chi^0_4 -> chi^0_1 c c_bar)
     1.02671072E-06    3     1000022         6        -6   # BR(chi^0_4 -> chi^0_1 t t_bar)
     5.59446193E-08    3     1000022         1        -1   # BR(chi^0_4 -> chi^0_1 d d_bar)
     5.60329479E-08    3     1000022         3        -3   # BR(chi^0_4 -> chi^0_1 s s_bar)
     2.71057860E-07    3     1000022         5        -5   # BR(chi^0_4 -> chi^0_1 b b_bar)
     2.21464329E-07    3     1000022        11       -11   # BR(chi^0_4 -> chi^0_1 e^- e^+)
     2.22038355E-07    3     1000022        13       -13   # BR(chi^0_4 -> chi^0_1 mu^- mu^+)
     6.36104242E-07    3     1000022        15       -15   # BR(chi^0_4 -> chi^0_1 tau^- tau^+)
     3.54242752E-09    3     1000023         2        -2   # BR(chi^0_4 -> chi^0_2 u u_bar)
     3.53828076E-09    3     1000023         4        -4   # BR(chi^0_4 -> chi^0_2 c c_bar)
     2.90764731E-09    3     1000023         1        -1   # BR(chi^0_4 -> chi^0_2 d d_bar)
     3.02620362E-09    3     1000023         3        -3   # BR(chi^0_4 -> chi^0_2 s s_bar)
     2.81796184E-07    3     1000023         5        -5   # BR(chi^0_4 -> chi^0_2 b b_bar)
     9.27290747E-07    3     1000023        11       -11   # BR(chi^0_4 -> chi^0_2 e^- e^+)
     9.30372582E-07    3     1000023        13       -13   # BR(chi^0_4 -> chi^0_2 mu^- mu^+)
     1.82031523E-06    3     1000023        15       -15   # BR(chi^0_4 -> chi^0_2 tau^- tau^+)
     1.32883155E-06    3     1000023        12       -12   # BR(chi^0_4 -> chi^0_2 nu_e nu_bar_e)
     3.18460445E-12    3     1000025         2        -2   # BR(chi^0_4 -> chi^0_3 u u_bar)
     3.35992162E-12    3     1000025         4        -4   # BR(chi^0_4 -> chi^0_3 c c_bar)
     5.99319164E-12    3     1000025         1        -1   # BR(chi^0_4 -> chi^0_3 d d_bar)
     9.36911761E-11    3     1000025         3        -3   # BR(chi^0_4 -> chi^0_3 s s_bar)
     2.03495410E-07    3     1000025         5        -5   # BR(chi^0_4 -> chi^0_3 b b_bar)
     2.44372995E-10    3     1000025        11       -11   # BR(chi^0_4 -> chi^0_3 e^- e^+)
     1.55890361E-09    3     1000025        13       -13   # BR(chi^0_4 -> chi^0_3 mu^- mu^+)
     3.77557105E-07    3     1000025        15       -15   # BR(chi^0_4 -> chi^0_3 tau^- tau^+)
     4.33092463E-09    3     1000025        12       -12   # BR(chi^0_4 -> chi^0_3 nu_e nu_bar_e)
     2.29533487E-09    3     1000024         1        -2   # BR(chi^0_4 -> chi^+_1 d u_bar)
     2.29533487E-09    3    -1000024        -1         2   # BR(chi^0_4 -> chi^-_1 d_bar u)
     2.49310177E-09    3     1000024         3        -4   # BR(chi^0_4 -> chi^+_1 s c_bar)
     2.49310177E-09    3    -1000024        -3         4   # BR(chi^0_4 -> chi^-_1 s_bar c)
     5.75356702E-07    3     1000024        11       -12   # BR(chi^0_4 -> chi^+_1 e^- nu_bar_e)
     5.75356702E-07    3    -1000024       -11        12   # BR(chi^0_4 -> chi^-_1 e^+ nu_e)
     5.77646636E-07    3     1000024        13       -14   # BR(chi^0_4 -> chi^+_1 mu^- nu_bar_mu)
     5.77646636E-07    3    -1000024       -13        14   # BR(chi^0_4 -> chi^-_1 mu^+ nu_mu)
     1.12710459E-06    3     1000024        15       -16   # BR(chi^0_4 -> chi^+_1 tau^- nu_bar_tau)
     1.12710459E-06    3    -1000024       -15        16   # BR(chi^0_4 -> chi^-_1 tau^+ nu_tau)
DECAY   1000021     1.03795748E+01   # ~g
#    BR                NDA      ID1      ID2
     4.37838114E-02    2     2000002        -2   # BR(~g -> ~u_R u_bar)
     4.37838114E-02    2    -2000002         2   # BR(~g -> ~u^*_R u)
     9.85963802E-03    2     1000002        -2   # BR(~g -> ~u_L u_bar)
     9.85963802E-03    2    -1000002         2   # BR(~g -> ~u^*_L u)
     4.37829486E-02    2     2000004        -4   # BR(~g -> ~c_R c_bar)
     4.37829486E-02    2    -2000004         4   # BR(~g -> ~c^*_R c)
     9.86184461E-03    2     1000004        -4   # BR(~g -> ~c_L c_bar)
     9.86184461E-03    2    -1000004         4   # BR(~g -> ~c^*_L c)
     7.42644815E-03    2     1000006        -4   # BR(~g -> ~t_1 c_bar)
     7.42644815E-03    2    -1000006         4   # BR(~g -> ~t^*_1 c)
     1.07831947E-01    2     1000006        -6   # BR(~g -> ~t_1 t_bar)
     1.07831947E-01    2    -1000006         6   # BR(~g -> ~t^*_1 t)
     4.75865312E-02    2     2000001        -1   # BR(~g -> ~d_R d_bar)
     4.75865312E-02    2    -2000001         1   # BR(~g -> ~d^*_R d)
     9.48664097E-03    2     1000001        -1   # BR(~g -> ~d_L d_bar)
     9.48664097E-03    2    -1000001         1   # BR(~g -> ~d^*_L d)
     4.75994100E-02    2     2000003        -3   # BR(~g -> ~s_R s_bar)
     4.75994100E-02    2    -2000003         3   # BR(~g -> ~s^*_R s)
     9.48960273E-03    2     1000003        -3   # BR(~g -> ~s_L s_bar)
     9.48960273E-03    2    -1000003         3   # BR(~g -> ~s^*_L s)
     8.30524660E-02    2     1000005        -5   # BR(~g -> ~b_1 b_bar)
     8.30524660E-02    2    -1000005         5   # BR(~g -> ~b^*_1 b)
     4.96551575E-02    2     2000005        -5   # BR(~g -> ~b_2 b_bar)
     4.96551575E-02    2    -2000005         5   # BR(~g -> ~b^*_2 b)
     2.69900340E-06    2     1000022        21   # BR(~g -> chi^0_1 g)
     1.48651784E-04    2     1000023        21   # BR(~g -> chi^0_2 g)
     1.98570451E-04    2     1000025        21   # BR(~g -> chi^0_3 g)
     3.78315685E-05    2     1000035        21   # BR(~g -> chi^0_4 g)
#    BR                NDA      ID1      ID2       ID3
     3.99235170E-04    3     1000022         6        -6   # BR(~g -> chi^0_1 t t_bar)
     1.15971353E-02    3     1000023         6        -6   # BR(~g -> chi^0_2 t t_bar)
     1.36627416E-02    3     1000025         6        -6   # BR(~g -> chi^0_3 t t_bar)
     1.10553902E-02    3     1000035         6        -6   # BR(~g -> chi^0_4 t t_bar)
     4.45173267E-03    3     1000024         5        -6   # BR(~g -> chi^+_1 b t_bar)
     4.45173267E-03    3    -1000024        -5         6   # BR(~g -> chi^-_1 b_bar t)
     7.58069330E-03    3     1000037         5        -6   # BR(~g -> chi^+_2 b t_bar)
     7.58069330E-03    3    -1000037        -5         6   # BR(~g -> chi^-_2 b_bar t)
DECAY        25     2.51945661E-03   # h^0
#    BR                NDA      ID1      ID2
     1.03115028E-08    2          11       -11   # BR(h^0 -> e^- e^+)
     4.40820632E-04    2          13       -13   # BR(h^0 -> mu^- mu^+)
     1.22656995E-01    2          15       -15   # BR(h^0 -> tau^- tau^+)
     6.37203046E-07    2           1        -1   # BR(h^0 -> d d_bar)
     2.81002828E-04    2           3        -3   # BR(h^0 -> s s_bar)
     6.14704668E-01    2           5        -5   # BR(h^0 -> b b_bar)
     2.63932168E-07    2           2        -2   # BR(h^0 -> u u_bar)
     4.72898506E-02    2           4        -4   # BR(h^0 -> c c_bar)
     7.12119225E-02    2          21        21   # BR(h^0 -> g g)
     3.35439131E-03    2          22        22   # BR(h^0 -> photon photon)
# writing decays into V V* as 3-body decays
#    BR                NDA      ID1      ID2       ID3
     6.43787935E-03    3          24        11        12   # BR(h^0 -> W^+ e^- nu_e)
     6.43787935E-03    3          24        13        14   # BR(h^0 -> W^+ mu^- nu_mu)
     6.43787935E-03    3          24        15        16   # BR(h^0 -> W^+ tau^- nu_tau)
     2.25325777E-02    3          24         1        -2   # BR(h^0 -> W^+ d u_bar)
     2.25325777E-02    3          24         3        -4   # BR(h^0 -> W^+ s c_bar)
     6.43787935E-03    3         -24       -11       -12   # BR(h^0 -> W^- e^+ nu_bar_e)
     6.43787935E-03    3         -24       -13       -14   # BR(h^0 -> W^- mu^+ nu_bar_mu)
     6.43787935E-03    3         -24       -15       -16   # BR(h^0 -> W^- tau^+ nu_bar_tau)
     2.25325777E-02    3         -24        -1         2   # BR(h^0 -> W^- d_bar u)
     2.25325777E-02    3         -24        -3         4   # BR(h^0 -> W^- s_bar c)
     3.95564782E-04    3          23        11       -11   # BR(h^0 -> Z e^- e^+)
     3.95564782E-04    3          23        13       -13   # BR(h^0 -> Z mu^- mu^+)
     3.39055527E-04    3          23        15       -15   # BR(h^0 -> Z tau^- tau^+)
     2.26037018E-03    3          23        12       -12   # BR(h^0 -> Z nu_e nu_bar_e)
     1.58225913E-03    3          23         1        -1   # BR(h^0 -> Z u u_bar)
     1.58225913E-03    3          23         3        -3   # BR(h^0 -> Z c c_bar)
     1.58225913E-03    3          23         5        -5   # BR(h^0 -> Z t t_bar)
     1.58225913E-03    3          23         2        -2   # BR(h^0 -> Z u u_bar)
     1.58225913E-03    3          23         4        -4   # BR(h^0 -> Z c c_bar)
DECAY        35     1.47380051E+01   # H^0
#    BR                NDA      ID1      ID2
     1.54278180E-08    2          11       -11   # BR(H^0 -> e^- e^+)
     6.59593708E-04    2          13       -13   # BR(H^0 -> mu^- mu^+)
     1.87361658E-01    2          15       -15   # BR(H^0 -> tau^- tau^+)
     7.94158968E-07    2           1        -1   # BR(H^0 -> d d_bar)
     3.50223741E-04    2           3        -3   # BR(H^0 -> s s_bar)
     8.10104753E-01    2           5        -5   # BR(H^0 -> b b_bar)
     1.74100499E-13    2           2        -2   # BR(H^0 -> u u_bar)
     3.12008224E-08    2           4        -4   # BR(H^0 -> c c_bar)
     1.37997029E-03    2           6        -6   # BR(H^0 -> t t_bar)
     7.40326497E-07    2     2000011  -2000011   # BR(H^0 -> ~e^-_R ~e^+_R)
     7.58390224E-07    2     2000013  -2000013   # BR(H^0 -> ~mu^-_R ~mu^+_R)
     1.36220571E-05    2     1000015  -1000015   # BR(H^0 -> ~tau^-_1 ~tau^+_1)
     1.28136216E-05    2          23        23   # BR(H^0 -> Z Z)
     2.47489310E-05    2          24       -24   # BR(H^0 -> W^+ W^-)
     2.50061936E-05    2          25        25   # BR(H^0 -> h^0 h^0)
     6.51932632E-05    2          21        21   # BR(H^0 -> g g)
     7.76090134E-08    2          22        22   # BR(H^0 -> photon photon)
DECAY        36     1.47383027E+01   # A^0
#    BR                NDA      ID1      ID2
     1.54277714E-08    2          11       -11   # BR(A^0 -> e^- e^+)
     6.59591765E-04    2          13       -13   # BR(A^0 -> mu^- mu^+)
     1.87365242E-01    2          15       -15   # BR(A^0 -> tau^- tau^+)
     7.94156023E-07    2           1        -1   # BR(A^0 -> d d_bar)
     3.50222433E-04    2           3        -3   # BR(A^0 -> s s_bar)
     8.10120268E-01    2           5        -5   # BR(A^0 -> b b_bar)
     1.52854082E-13    2           2        -2   # BR(A^0 -> u u_bar)
     2.73932149E-08    2           4        -4   # BR(A^0 -> c c_bar)
     1.45889425E-03    2           6        -6   # BR(A^0 -> t t_bar)
     2.36299177E-05    2          25        23   # BR(A^0 -> h^0 Z)
     2.12677939E-05    2          21        21   # BR(A^0 -> g g)
     4.73708279E-08    2          22        22   # BR(A^0 -> photon photon)
DECAY        37     1.23470065E+01   # H^+
#    BR                NDA      ID1      ID2
     1.85355690E-08    2         -11        12   # BR(H^+ -> e^+ nu_e)
     7.92461101E-04    2         -13        12   # BR(H^+ -> mu^+ nu_e)
     2.25108461E-01    2         -15        12   # BR(H^+ -> tau^+ nu_e)
     8.41742221E-07    2          -1         2   # BR(H^+ -> d_bar u)
     3.71234790E-04    2          -3         4   # BR(H^+ -> s_bar c)
     7.73698651E-01    2          -5         6   # BR(H^+ -> b_bar t)
     2.83321706E-05    2          25        24   # BR(H^+ -> h^0 W^+)
DECAY         6     2.43000000E+00   # top
#    BR                NDA      ID1      ID2
     1.00000000E+00    2           5        24   # BR(t -> b W)
Block HiggsBoundsInputHiggsCouplingsFermions
# ScalarNormEffCoupSq PseudoSNormEffCoupSq NP IP1 IP2 IP2
    1.13889506E+00    0.00000000E+00        3  25   5   5  # h0-b-b eff. coupling^2, normalised to SM
    1.59986110E+03    0.00000000E+00        3  35   5   5  # H0-b-b eff. coupling^2, normalised to SM
    0.00000000E+00    1.60000000E+03        3  36   5   5  # A0-b-b eff. coupling^2, normalised to SM
#
    9.99913191E-01    0.00000000E+00        3  25   6   6  # h0-t-t eff. coupling^2, normalised to SM
    7.11809414E-04    0.00000000E+00        3  35   6   6  # H0-t-t eff. coupling^2, normalised to SM
    0.00000000E+00    6.25000000E-04        3  36   6   6  # A0-t-t eff. coupling^2, normalised to SM
#
    1.13889506E+00    0.00000000E+00        3  25  15  15  # h0-tau-tau eff. coupling^2, normalised to SM
    1.59986110E+03    0.00000000E+00        3  35  15  15  # H0-tau-tau eff. coupling^2, normalised to SM
    0.00000000E+00    1.60000000E+03        3  36  15  15  # A0-tau-tau eff. coupling^2, normalised to SM
#
Block HiggsBoundsInputHiggsCouplingsBosons
    9.99997178E-01        3  25  24  24  # h0-W-W eff. coupling^2, normalised to SM
    2.82170083E-06        3  35  24  24  # H0-W-W eff. coupling^2, normalised to SM
    0.00000000E+00        3  36  24  24  # A0-W-W eff. coupling^2, normalised to SM
#
    9.99997178E-01        3  25  23  23  # h0-Z-Z eff. coupling^2, normalised to SM
    2.82170083E-06        3  35  23  23  # H0-Z-Z eff. coupling^2, normalised to SM
    0.00000000E+00        3  36  23  23  # A0-Z-Z eff. coupling^2, normalised to SM
#
    1.16364279E+00        3  25  21  21  # h0-g-g eff. coupling^2, normalised to SM
    3.07081997E-02        3  35  21  21  # H0-g-g eff. coupling^2, normalised to SM
    1.68701737E-01        3  36  21  21  # A0-g-g eff. coupling^2, normalised to SM
#
    0.00000000E+00        3  25  25  23  # h0-h0-Z eff. coupling^2, normalised to SM
    0.00000000E+00        3  35  25  23  # H0-h0-Z eff. coupling^2, normalised to SM
    2.82170083E-06        3  36  25  23  # A0-h0-Z eff. coupling^2, normalised to SM
    0.00000000E+00        3  35  35  23  # H0-H0-Z eff. coupling^2, normalised to SM
    9.99997178E-01        3  36  35  23  # A0-H0-Z eff. coupling^2, normalised to SM
    0.00000000E+00        3  36  36  23  # A0-A0-Z eff. coupling^2, normalised to SM
#
    0.00000000E+00        4  25  21  21  23  # h0-g-g-Z eff. coupling^2, normalised to SM
    0.00000000E+00        4  35  21  21  23  # H0-g-g-Z eff. coupling^2, normalised to SM
    0.00000000E+00        4  36  21  21  23  # A0-g-g-Z eff. coupling^2, normalised to SM
Block SPhenoLowEnergy  # low energy observables
    1    3.17990619E-04   # BR(b -> s gamma)
    2    1.58872475E-06   # BR(b -> s mu+ mu-)
    3    3.53734235E-05   # BR(b -> s nu nu)
    4    5.46038373E-11   # BR(Bd -> mu+ mu-)
    5    3.57621225E-09   # BR(Bs -> mu+ mu-)
    6    9.98999720E-05   # BR(B_u -> tau nu)
    7    9.03309242E-01   # BR(B_u -> tau nu)/BR(B_u -> tau nu)_SM
    8    2.73420946E-01   # |Delta(M_Bd)| [ps^-1] 
    9    2.02605702E+01   # |Delta(M_Bs)| [ps^-1] 
   20    4.29905989E-14   # Delta(g-2)_electron/2
   21    9.27830433E-10   # Delta(g-2)_muon/2
   22    8.62512785E-08   # Delta(g-2)_tau/2
   23    0.00000000E+00   # electric dipole moment of the electron
   24    0.00000000E+00   # electric dipole moment of the muon
   25    0.00000000E+00   # electric dipole moment of the tau
   26    0.00000000E+00   # Br(mu -> e gamma)
   27    0.00000000E+00   # Br(tau -> e gamma)
   28    0.00000000E+00   # Br(tau -> mu gamma)
   29    0.00000000E+00   # Br(mu -> 3 e)
   30    0.00000000E+00   # Br(tau -> 3 e)
   31    0.00000000E+00   # Br(tau -> 3 mu)
   39    1.13781087E-03   # Delta(rho_parameter)
   40    0.00000000E+00   # BR(Z -> e mu)
   41    0.00000000E+00   # BR(Z -> e tau)
   42    0.00000000E+00   # BR(Z -> mu tau)
Block FWCOEF Q=  9.11876000E+01  # Wilson coefficients at scale Q
#    id        order  M        value         comment
Block FWCOEF Q=  1.60000000E+02  # Wilson coefficients at scale Q
#    id        order  M        value         comment
     0305 4422   00   0    -1.87762220E-01   # C7
     0305 4422   00   1    -1.77507470E-02   # C7
     0305 4322   00   1    -3.81598177E-04   # C7'
     0305 6421   00   0    -9.48909192E-02   # C8
     0305 6421   00   1    -3.09159360E-02   # C8
     0305 6321   00   1    -6.56242414E-04   # C8'
 03051111 4133   00   0    -1.02424875E+00   # C9 e+e-
 03051111 4133   00   1     1.32561800E-03   # C9 e+e-
 03051111 4233   00   1    -9.26401830E-05   # C9' e+e-
 03051111 4137   00   0    -3.96009075E+00   # C10 e+e-
 03051111 4137   00   1     4.70531440E-03   # C10 e+e-
 03051111 4237   00   1     2.20696085E-03   # C10' e+e-
 03051313 4133   00   0    -1.02424875E+00   # C9 mu+mu-
 03051313 4133   00   1     1.32532745E-03   # C9 mu+mu-
 03051313 4233   00   1    -9.26745286E-05   # C9' mu+mu-
 03051313 4137   00   0    -3.96009075E+00   # C10 mu+mu-
 03051313 4137   00   1     4.70502342E-03   # C10 mu+mu-
 03051313 4237   00   1     2.20699521E-03   # C10' mu+mu-
 03051212 4237   00   0     1.49021491E+00   # C11 nu_1 nu_1
 03051212 4237   00   1    -1.13016683E-03   # C11 nu_1 nu_1
 03051212 4137   00   1    -5.28779550E-04   # C11' nu_1 nu_1
 03051414 4237   00   0     1.49021491E+00   # C11 nu_2 nu_2
 03051414 4237   00   1    -1.13016656E-03   # C11 nu_2 nu_2
 03051414 4137   00   1    -5.28771370E-04   # C11' nu_2 nu_2
 03051616 4237   00   0     1.49021491E+00   # C11 nu_3 nu_3
 03051616 4237   00   1    -1.13000387E-03   # C11 nu_3 nu_3
 03051616 4137   00   1    -5.26465506E-04   # C11' nu_3 nu_3
