#
#                              ======================
#                              | THE SUSYHIT OUTPUT |
#                              ======================
#
#
#              ------------------------------------------------------
#              |     This is the output of the SUSY-HIT package     |
#              |  created by A.Djouadi, M.Muehlleitner and M.Spira. |
#              |  In case of problems with SUSY-HIT email to        |
#              |           margarete.muehlleitner@cern.ch           |
#              |           michael.spira@psi.ch                     |
#              |           abdelhak.djouadi@cern.ch                 |
#              ------------------------------------------------------
#
#              ------------------------------------------------------
#              |  SUSY Les Houches Accord - MSSM Spectrum + Decays  |
#              |              based on the decay programs           |
#              |                                                    |
#              |                     SDECAY 1.3b                    |
#              |                                                    |
#              |  Authors: M.Muhlleitner, A.Djouadi and Y.Mambrini  |
#              |  Ref.:    Comput.Phys.Commun.168(2005)46           |
#              |           [hep-ph/0311167]                         |
#              |                                                    |
#              |                     HDECAY 3.4                     |
#              |                                                    |
#              |  By: A.Djouadi,J.Kalinowski,M.Muhlleitner,M.Spira  |
#              |  Ref.:    Comput.Phys.Commun.108(1998)56           |
#              |           [hep-ph/9704448]                         |
#              |                                                    |
#              |                                                    |
#              |  If not stated otherwise all DRbar couplings and   |
#              |  soft SUSY breaking masses are given at the scale  |
#              |  Q=  0.50007339E+04
#              |                                                    |
#              ------------------------------------------------------
#
#
BLOCK DCINFO  # Decay Program information
     1   SDECAY/HDECAY # decay calculator
     2   1.3b  /3.4    # version number
#
BLOCK SPINFO  # Spectrum calculator information
     1    SOFTSUSY    # spectrum calculator                
     2    3.4.0       # version number                     
#
BLOCK MODSEL  # Model selection
     1     0   #  nonUniversal                                     
#
BLOCK SMINPUTS  # Standard Model inputs
         1     1.25778332E+02   # alpha_em^-1(M_Z)^MSbar
         2     1.16570000E-05   # G_F [GeV^-2]
         3     1.17200002E-01   # alpha_S(M_Z)^MSbar
         4     9.11876000E+01   # M_Z pole mass
         5     4.25000000E+00   # mb(mb)^MSbar
         6     1.72500000E+02   # mt pole mass
         7     1.77682000E+00   # mtau pole mass
#
BLOCK MINPAR  # Input parameters - minimal models
         3     1.00000000E+01   # tanb                
#
BLOCK EXTPAR  # Input parameters - non-minimal models
         0    -1.00000000E+00   # Set                 
         1     6.00000000E+01   # M_1(MX)             
         2     3.00000000E+03   # M_2(MX)             
         3     2.04381800E+03   # M_3(MX)             
        11     5.00000000E+03   # At(MX)              
        12     5.00000000E+03   # Ab(MX)              
        13     0.00000000E+00   # Atau(MX)            
        23    -1.15362100E+03   # mu(MX)              
        26     3.00000000E+03   # mA(pole)            
        31     5.00000000E+03   # meL(MX)             
        32     5.00000000E+03   # mmuL(MX)            
        33     5.00000000E+03   # mtauL(MX)           
        34     5.00000000E+03   # meR(MX)             
        35     5.00000000E+03   # mmuR(MX)            
        36     5.00000000E+03   # mtauR(MX)           
        41     5.00000000E+03   # mqL1(MX)            
        42     5.00000000E+03   # mqL2(MX)            
        43     5.00000000E+03   # mqL3(MX)            
        44     5.00000000E+03   # muR(MX)             
        45     5.00000000E+03   # mcR(MX)             
        46     5.00000000E+03   # mtR(MX)             
        47     5.00000000E+03   # mdR(MX)             
        48     5.00000000E+03   # msR(MX)             
        49     5.00000000E+03   # mbR(MX)             
#
BLOCK MASS  # Mass Spectrum
# PDG code           mass       particle
        24     8.00960554E+01   # W+
        25     1.24818101E+02   # h
        35     3.00008020E+03   # H
        36     2.99999986E+03   # A
        37     3.00086383E+03   # H+
         5     4.87878001E+00   # b-quark pole mass calculated from mb(mb)_Msbar
   1000001     5.07807270E+03   # ~d_L
   2000001     5.06030543E+03   # ~d_R
   1000002     5.07760102E+03   # ~u_L
   2000002     5.06002521E+03   # ~u_R
   1000003     5.07807270E+03   # ~s_L
   2000003     5.06030543E+03   # ~s_R
   1000004     5.07760102E+03   # ~c_L
   2000004     5.06002521E+03   # ~c_R
   1000005     5.02381360E+03   # ~b_1
   2000005     5.05892534E+03   # ~b_2
   1000006     4.91553620E+03   # ~t_1
   2000006     5.06855682E+03   # ~t_2
   1000011     5.01905957E+03   # ~e_L
   2000011     5.00591806E+03   # ~e_R
   1000012     5.01811137E+03   # ~nu_eL
   1000013     5.01905957E+03   # ~mu_L
   2000013     5.00591806E+03   # ~mu_R
   1000014     5.01811137E+03   # ~nu_muL
   1000015     5.00452472E+03   # ~tau_1
   2000015     5.01884765E+03   # ~tau_2
   1000016     5.01756787E+03   # ~nu_tauL
   1000021     2.40000020E+03   # ~g
   1000022     6.03023688E+01   # ~chi_10
   1000023     1.19954203E+03   # ~chi_20
   1000025    -1.20184374E+03   # ~chi_30
   1000035     3.07428531E+03   # ~chi_40
   1000024     1.20000041E+03   # ~chi_1+
   1000037     3.07445273E+03   # ~chi_2+
#
BLOCK NMIX  # Neutralino Mixing Matrix
  1  1     9.99308839E-01   # N_11
  1  2     1.64225657E-04   # N_12
  1  3    -3.71181921E-02   # N_13
  1  4     2.01415375E-03   # N_14
  2  1     2.48266100E-02   # N_21
  2  2     2.59737980E-02   # N_22
  2  3     7.06840338E-01   # N_23
  2  4     7.06460004E-01   # N_24
  3  1    -2.76642414E-02   # N_31
  3  2     1.42066917E-02   # N_32
  3  3    -7.06349574E-01   # N_33
  3  4     7.07179707E-01   # N_34
  4  1    -4.16118558E-04   # N_41
  4  2     9.99561656E-01   # N_42
  4  3    -8.32198965E-03   # N_43
  4  4    -2.84089172E-02   # N_44
#
BLOCK UMIX  # Chargino Mixing Matrix U
  1  1     1.17839241E-02   # U_11
  1  2     9.99930567E-01   # U_12
  2  1    -9.99930567E-01   # U_21
  2  2     1.17839241E-02   # U_22
#
BLOCK VMIX  # Chargino Mixing Matrix V
  1  1     4.02050157E-02   # V_11
  1  2    -9.99191451E-01   # V_12
  2  1    -9.99191451E-01   # V_21
  2  2    -4.02050157E-02   # V_22
#
BLOCK STOPMIX  # Stop Mixing Matrix
  1  1    -5.06821824E-01   # cos(theta_t)
  1  2     8.62050833E-01   # sin(theta_t)
  2  1    -8.62050833E-01   # -sin(theta_t)
  2  2    -5.06821824E-01   # cos(theta_t)
#
BLOCK SBOTMIX  # Sbottom Mixing Matrix
  1  1     9.96202062E-01   # cos(theta_b)
  1  2    -8.70715319E-02   # sin(theta_b)
  2  1     8.70715319E-02   # -sin(theta_b)
  2  2     9.96202062E-01   # cos(theta_b)
#
BLOCK STAUMIX  # Stau Mixing Matrix
  1  1    -1.36031878E-01   # cos(theta_tau)
  1  2     9.90704461E-01   # sin(theta_tau)
  2  1    -9.90704461E-01   # -sin(theta_tau)
  2  2    -1.36031878E-01   # cos(theta_tau)
#
BLOCK ALPHA  # Higgs mixing
          -1.05476987E-01   # Mixing angle in the neutral Higgs boson sector
#
BLOCK HMIX Q=  5.00073390E+03  # DRbar Higgs Parameters
         1    -1.17484566E+03   # mu(Q)MSSM           
         2     9.46944453E+00   # tan                 
         3     2.41892982E+02   # higgs               
         4     8.46566606E+06   # mA^2(Q)MSSM         
#
BLOCK GAUGE Q=  5.00073390E+03  # The gauge couplings
     1     3.70747260E-01   # gprime(Q) DRbar
     2     6.32322914E-01   # g(Q) DRbar
     3     9.95815676E-01   # g3(Q) DRbar
#
BLOCK AU Q=  5.00073390E+03  # The trilinear couplings
  1  1     5.00000002E+03   # A_u(Q) DRbar
  2  2     5.00000002E+03   # A_c(Q) DRbar
  3  3     5.00000002E+03   # A_t(Q) DRbar
#
BLOCK AD Q=  5.00073390E+03  # The trilinear couplings
  1  1     5.00000001E+03   # A_d(Q) DRbar
  2  2     5.00000001E+03   # A_s(Q) DRbar
  3  3     5.00000001E+03   # A_b(Q) DRbar
#
BLOCK AE Q=  5.00073390E+03  # The trilinear couplings
  1  1     0.00000000E+00   # A_e(Q) DRbar
  2  2     2.36131557E-07   # A_mu(Q) DRbar
  3  3     2.36008247E-07   # A_tau(Q) DRbar
#
BLOCK Yu Q=  5.00073390E+03  # The Yukawa couplings
  1  1     0.00000000E+00   # y_u(Q) DRbar
  2  2     0.00000000E+00   # y_c(Q) DRbar
  3  3     8.20764981E-01   # y_t(Q) DRbar
#
BLOCK Yd Q=  5.00073390E+03  # The Yukawa couplings
  1  1     0.00000000E+00   # y_d(Q) DRbar
  2  2     0.00000000E+00   # y_s(Q) DRbar
  3  3     1.31206078E-01   # y_b(Q) DRbar
#
BLOCK Ye Q=  5.00073390E+03  # The Yukawa couplings
  1  1     0.00000000E+00   # y_e(Q) DRbar
  2  2     0.00000000E+00   # y_mu(Q) DRbar
  3  3     9.67537637E-02   # y_tau(Q) DRbar
#
BLOCK MSOFT Q=  5.00073390E+03  # The soft SUSY breaking masses at the scale Q
         1     6.00000000E+01   # M_1(Q)              
         2     3.00000000E+03   # M_2(Q)              
         3     2.04381800E+03   # M_3(Q)              
        21     7.30501062E+06   # mH1^2(Q)            
        22    -8.20457550E+05   # mH2^2(Q)            
        31     5.00000000E+03   # meL(Q)              
        32     5.00000000E+03   # mmuL(Q)             
        33     5.00000000E+03   # mtauL(Q)            
        34     5.00000000E+03   # meR(Q)              
        35     5.00000000E+03   # mmuR(Q)             
        36     5.00000000E+03   # mtauR(Q)            
        41     5.00000000E+03   # mqL1(Q)             
        42     5.00000000E+03   # mqL2(Q)             
        43     4.99999999E+03   # mqL3(Q)             
        44     5.00000000E+03   # muR(Q)              
        45     5.00000000E+03   # mcR(Q)              
        46     4.99999999E+03   # mtR(Q)              
        47     5.00000000E+03   # mdR(Q)              
        48     5.00000000E+03   # msR(Q)              
        49     5.00000000E+03   # mbR(Q)              
#
#
#
#                             =================
#                             |The decay table|
#                             =================
#
# - The QCD corrections to the decays gluino -> squark  + quark
#                                     squark -> gaugino + quark_prime
#                                     squark -> squark_prime + Higgs
#                                     squark -> gluino  + quark
#   are included.
#
# - The multi-body decays for the inos, stops and sbottoms are included.
#
# - The loop induced decays for the gluino, neutralinos and stops
#   are included.
#
# - The SUSY decays of the top quark are included.
#
#
#         PDG            Width
DECAY         6     1.40110183E+00   # top decays
#          BR         NDA      ID1       ID2
     1.00000000E+00    2           5        24   # BR(t ->  b    W+)
#
#         PDG            Width
DECAY   1000021     1.86095933E-03   # gluino decays
#          BR         NDA      ID1       ID2
     3.10799138E-06    2     1000022        21   # BR(~g -> ~chi_10 g)
     6.88789227E-03    2     1000023        21   # BR(~g -> ~chi_20 g)
     6.81669385E-03    2     1000025        21   # BR(~g -> ~chi_30 g)
#           BR         NDA      ID1       ID2       ID3
     3.27002549E-02    3     1000022         1        -1   # BR(~g -> ~chi_10 d  db)
     2.24462629E-05    3     1000023         1        -1   # BR(~g -> ~chi_20 d  db)
     8.01608595E-06    3     1000025         1        -1   # BR(~g -> ~chi_30 d  db)
     1.11499188E-01    3     1000022         2        -2   # BR(~g -> ~chi_10 u  ub)
     5.52456381E-05    3     1000023         2        -2   # BR(~g -> ~chi_20 u  ub)
     8.80404682E-06    3     1000025         2        -2   # BR(~g -> ~chi_30 u  ub)
     3.27002549E-02    3     1000022         3        -3   # BR(~g -> ~chi_10 s  sb)
     2.24462629E-05    3     1000023         3        -3   # BR(~g -> ~chi_20 s  sb)
     8.01608595E-06    3     1000025         3        -3   # BR(~g -> ~chi_30 s  sb)
     1.11499188E-01    3     1000022         4        -4   # BR(~g -> ~chi_10 c  cb)
     5.52456381E-05    3     1000023         4        -4   # BR(~g -> ~chi_20 c  cb)
     8.80404682E-06    3     1000025         4        -4   # BR(~g -> ~chi_30 c  cb)
     3.31429070E-02    3     1000022         5        -5   # BR(~g -> ~chi_10 b  bb)
     3.85949422E-03    3     1000023         5        -5   # BR(~g -> ~chi_20 b  bb)
     3.80162755E-03    3     1000025         5        -5   # BR(~g -> ~chi_30 b  bb)
     1.12788240E-01    3     1000022         6        -6   # BR(~g -> ~chi_10 t  tb)
     1.36556517E-01    3     1000023         6        -6   # BR(~g -> ~chi_20 t  tb)
     1.19128554E-01    3     1000025         6        -6   # BR(~g -> ~chi_30 t  tb)
     6.23991441E-05    3     1000024         1        -2   # BR(~g -> ~chi_1+ d  ub)
     6.23991441E-05    3    -1000024         2        -1   # BR(~g -> ~chi_1- u  db)
     6.23991441E-05    3     1000024         3        -4   # BR(~g -> ~chi_1+ s  cb)
     6.23991441E-05    3    -1000024         4        -3   # BR(~g -> ~chi_1- c  sb)
     1.44088731E-01    3     1000024         5        -6   # BR(~g -> ~chi_1+ b  tb)
     1.44088731E-01    3    -1000024         6        -5   # BR(~g -> ~chi_1- t  bb)
#
#         PDG            Width
DECAY   1000006     2.99977946E+02   # stop1 decays
#          BR         NDA      ID1       ID2
     2.95565407E-02    2     1000022         6   # BR(~t_1 -> ~chi_10 t )
     9.74668454E-02    2     1000023         6   # BR(~t_1 -> ~chi_20 t )
     9.37486411E-02    2     1000025         6   # BR(~t_1 -> ~chi_30 t )
     6.93985683E-03    2     1000035         6   # BR(~t_1 -> ~chi_40 t )
     1.42299539E-01    2     1000024         5   # BR(~t_1 -> ~chi_1+ b )
     1.38192645E-02    2     1000037         5   # BR(~t_1 -> ~chi_2+ b )
     6.16169312E-01    2     1000021         6   # BR(~t_1 -> ~g      t )
#
#         PDG            Width
DECAY   2000006     3.10273730E+02   # stop2 decays
#          BR         NDA      ID1       ID2
     1.11404901E-02    2     1000022         6   # BR(~t_2 -> ~chi_10 t )
     9.70184891E-02    2     1000023         6   # BR(~t_2 -> ~chi_20 t )
     1.00946803E-01    2     1000025         6   # BR(~t_2 -> ~chi_30 t )
     1.79766427E-02    2     1000035         6   # BR(~t_2 -> ~chi_40 t )
     5.73777697E-02    2     1000024         5   # BR(~t_2 -> ~chi_1+ b )
     3.57446460E-02    2     1000037         5   # BR(~t_2 -> ~chi_2+ b )
     6.75793786E-01    2     1000021         6   # BR(~t_2 -> ~g      t )
     9.05310316E-04    2     1000006        25   # BR(~t_2 -> ~t_1    h )
     3.09606299E-03    2     1000006        23   # BR(~t_2 -> ~t_1    Z )
#
#         PDG            Width
DECAY   1000005     2.85323222E+02   # sbottom1 decays
#          BR         NDA      ID1       ID2
     2.71209091E-03    2     1000022         5   # BR(~b_1 -> ~chi_10 b )
     2.73520135E-03    2     1000023         5   # BR(~b_1 -> ~chi_20 b )
     2.63695562E-03    2     1000025         5   # BR(~b_1 -> ~chi_30 b )
     2.64587829E-02    2     1000035         5   # BR(~b_1 -> ~chi_40 b )
     2.08100322E-01    2    -1000024         6   # BR(~b_1 -> ~chi_1- t )
     5.31925211E-02    2    -1000037         6   # BR(~b_1 -> ~chi_2- t )
     7.02255542E-01    2     1000021         5   # BR(~b_1 -> ~g      b )
     1.90858424E-03    2     1000006       -24   # BR(~b_1 -> ~t_1    W-)
#
#         PDG            Width
DECAY   2000005     2.09866964E+02   # sbottom2 decays
#          BR         NDA      ID1       ID2
     1.39622273E-02    2     1000022         5   # BR(~b_2 -> ~chi_10 b )
     3.65576003E-03    2     1000023         5   # BR(~b_2 -> ~chi_20 b )
     3.77356084E-03    2     1000025         5   # BR(~b_2 -> ~chi_30 b )
     2.78740472E-04    2     1000035         5   # BR(~b_2 -> ~chi_40 b )
     9.39019533E-03    2    -1000024         6   # BR(~b_2 -> ~chi_1- t )
     5.60255055E-04    2    -1000037         6   # BR(~b_2 -> ~chi_2- t )
     9.68294003E-01    2     1000021         5   # BR(~b_2 -> ~g      b )
     8.52578064E-05    2     1000006       -24   # BR(~b_2 -> ~t_1    W-)
#
#         PDG            Width
DECAY   1000002     2.29174295E+02   # sup_L decays
#          BR         NDA      ID1       ID2
     3.25183113E-03    2     1000022         2   # BR(~u_L -> ~chi_10 u)
     7.22970498E-05    2     1000023         2   # BR(~u_L -> ~chi_20 u)
     5.88912819E-06    2     1000025         2   # BR(~u_L -> ~chi_30 u)
     3.43808923E-02    2     1000035         2   # BR(~u_L -> ~chi_40 u)
     2.45945523E-04    2     1000024         1   # BR(~u_L -> ~chi_1+ d)
     6.87134492E-02    2     1000037         1   # BR(~u_L -> ~chi_2+ d)
     8.93329696E-01    2     1000021         2   # BR(~u_L -> ~g      u)
#
#         PDG            Width
DECAY   2000002     2.15079955E+02   # sup_R decays
#          BR         NDA      ID1       ID2
     5.51507414E-02    2     1000022         2   # BR(~u_R -> ~chi_10 u)
     3.04063475E-05    2     1000023         2   # BR(~u_R -> ~chi_20 u)
     3.77372153E-05    2     1000025         2   # BR(~u_R -> ~chi_30 u)
     3.83650471E-09    2     1000035         2   # BR(~u_R -> ~chi_40 u)
     9.44781111E-01    2     1000021         2   # BR(~u_R -> ~g      u)
#
#         PDG            Width
DECAY   1000001     2.29190933E+02   # sdown_L decays
#          BR         NDA      ID1       ID2
     3.24098325E-03    2     1000022         1   # BR(~d_L -> ~chi_10 d)
     3.39438673E-05    2     1000023         1   # BR(~d_L -> ~chi_20 d)
     2.92562264E-05    2     1000025         1   # BR(~d_L -> ~chi_30 d)
     3.44001296E-02    2     1000035         1   # BR(~d_L -> ~chi_40 d)
     2.11289111E-05    2    -1000024         2   # BR(~d_L -> ~chi_1- u)
     6.88312455E-02    2    -1000037         2   # BR(~d_L -> ~chi_2- u)
     8.93443313E-01    2     1000021         1   # BR(~d_L -> ~g      d)
#
#         PDG            Width
DECAY   2000001     2.06197084E+02   # sdown_R decays
#          BR         NDA      ID1       ID2
     1.43824627E-02    2     1000022         1   # BR(~d_R -> ~chi_10 d)
     7.92960801E-06    2     1000023         1   # BR(~d_R -> ~chi_20 d)
     9.84141027E-06    2     1000025         1   # BR(~d_R -> ~chi_30 d)
     1.00062911E-09    2     1000035         1   # BR(~d_R -> ~chi_40 d)
     9.85599765E-01    2     1000021         1   # BR(~d_R -> ~g      d)
#
#         PDG            Width
DECAY   1000004     2.29174295E+02   # scharm_L decays
#          BR         NDA      ID1       ID2
     3.25183113E-03    2     1000022         4   # BR(~c_L -> ~chi_10 c)
     7.22970498E-05    2     1000023         4   # BR(~c_L -> ~chi_20 c)
     5.88912819E-06    2     1000025         4   # BR(~c_L -> ~chi_30 c)
     3.43808923E-02    2     1000035         4   # BR(~c_L -> ~chi_40 c)
     2.45945523E-04    2     1000024         3   # BR(~c_L -> ~chi_1+ s)
     6.87134492E-02    2     1000037         3   # BR(~c_L -> ~chi_2+ s)
     8.93329696E-01    2     1000021         4   # BR(~c_L -> ~g      c)
#
#         PDG            Width
DECAY   2000004     2.15079955E+02   # scharm_R decays
#          BR         NDA      ID1       ID2
     5.51507414E-02    2     1000022         4   # BR(~c_R -> ~chi_10 c)
     3.04063475E-05    2     1000023         4   # BR(~c_R -> ~chi_20 c)
     3.77372153E-05    2     1000025         4   # BR(~c_R -> ~chi_30 c)
     3.83650471E-09    2     1000035         4   # BR(~c_R -> ~chi_40 c)
     9.44781111E-01    2     1000021         4   # BR(~c_R -> ~g      c)
#
#         PDG            Width
DECAY   1000003     2.29190933E+02   # sstrange_L decays
#          BR         NDA      ID1       ID2
     3.24098325E-03    2     1000022         3   # BR(~s_L -> ~chi_10 s)
     3.39438673E-05    2     1000023         3   # BR(~s_L -> ~chi_20 s)
     2.92562264E-05    2     1000025         3   # BR(~s_L -> ~chi_30 s)
     3.44001296E-02    2     1000035         3   # BR(~s_L -> ~chi_40 s)
     2.11289111E-05    2    -1000024         4   # BR(~s_L -> ~chi_1- c)
     6.88312455E-02    2    -1000037         4   # BR(~s_L -> ~chi_2- c)
     8.93443313E-01    2     1000021         3   # BR(~s_L -> ~g      s)
#
#         PDG            Width
DECAY   2000003     2.06197084E+02   # sstrange_R decays
#          BR         NDA      ID1       ID2
     1.43824627E-02    2     1000022         3   # BR(~s_R -> ~chi_10 s)
     7.92960801E-06    2     1000023         3   # BR(~s_R -> ~chi_20 s)
     9.84141027E-06    2     1000025         3   # BR(~s_R -> ~chi_30 s)
     1.00062911E-09    2     1000035         3   # BR(~s_R -> ~chi_40 s)
     9.85599765E-01    2     1000021         3   # BR(~s_R -> ~g      s)
#
#         PDG            Width
DECAY   1000011     3.02531764E+01   # selectron_L decays
#          BR         NDA      ID1       ID2
     2.26581739E-01    2     1000022        11   # BR(~e_L -> ~chi_10 e-)
     9.63610826E-04    2     1000023        11   # BR(~e_L -> ~chi_20 e-)
     2.37723859E-06    2     1000025        11   # BR(~e_L -> ~chi_30 e-)
     2.57241828E-01    2     1000035        11   # BR(~e_L -> ~chi_40 e-)
     1.62896627E-04    2    -1000024        12   # BR(~e_L -> ~chi_1- nu_e)
     5.15047548E-01    2    -1000037        12   # BR(~e_L -> ~chi_2- nu_e)
#
#         PDG            Width
DECAY   2000011     2.73657125E+01   # selectron_R decays
#          BR         NDA      ID1       ID2
     9.98772150E-01    2     1000022        11   # BR(~e_R -> ~chi_10 e-)
     5.47853283E-04    2     1000023        11   # BR(~e_R -> ~chi_20 e-)
     6.79929176E-04    2     1000025        11   # BR(~e_R -> ~chi_30 e-)
     6.72025797E-08    2     1000035        11   # BR(~e_R -> ~chi_40 e-)
#
#         PDG            Width
DECAY   1000013     3.02531764E+01   # smuon_L decays
#          BR         NDA      ID1       ID2
     2.26581739E-01    2     1000022        13   # BR(~mu_L -> ~chi_10 mu-)
     9.63610826E-04    2     1000023        13   # BR(~mu_L -> ~chi_20 mu-)
     2.37723859E-06    2     1000025        13   # BR(~mu_L -> ~chi_30 mu-)
     2.57241828E-01    2     1000035        13   # BR(~mu_L -> ~chi_40 mu-)
     1.62896627E-04    2    -1000024        14   # BR(~mu_L -> ~chi_1- nu_mu)
     5.15047548E-01    2    -1000037        14   # BR(~mu_L -> ~chi_2- nu_mu)
#
#         PDG            Width
DECAY   2000013     2.73657125E+01   # smuon_R decays
#          BR         NDA      ID1       ID2
     9.98772150E-01    2     1000022        13   # BR(~mu_R -> ~chi_10 mu-)
     5.47853283E-04    2     1000023        13   # BR(~mu_R -> ~chi_20 mu-)
     6.79929176E-04    2     1000025        13   # BR(~mu_R -> ~chi_30 mu-)
     6.72025797E-08    2     1000035        13   # BR(~mu_R -> ~chi_40 mu-)
#
#         PDG            Width
DECAY   1000015     2.90648193E+01   # stau_1 decays
#          BR         NDA      ID1       ID2
     9.27988882E-01    2     1000022        15   # BR(~tau_1 -> ~chi_10  tau-)
     1.50441521E-02    2     1000023        15   # BR(~tau_1 -> ~chi_20  tau-)
     1.40733123E-02    2     1000025        15   # BR(~tau_1 -> ~chi_30  tau-)
     4.77809454E-03    2     1000035        15   # BR(~tau_1 -> ~chi_40  tau-)
     2.85491209E-02    2    -1000024        16   # BR(~tau_1 -> ~chi_1-  nu_tau)
     9.56643851E-03    2    -1000037        16   # BR(~tau_1 -> ~chi_2-  nu_tau)
#
#         PDG            Width
DECAY   2000015     3.10264464E+01   # stau_2 decays
#          BR         NDA      ID1       ID2
     2.32407394E-01    2     1000022        15   # BR(~tau_2 -> ~chi_10  tau-)
     1.40435443E-02    2     1000023        15   # BR(~tau_2 -> ~chi_20  tau-)
     1.40868580E-02    2     1000025        15   # BR(~tau_2 -> ~chi_30  tau-)
     2.46275600E-01    2     1000035        15   # BR(~tau_2 -> ~chi_40  tau-)
     9.55280471E-05    2    -1000024        16   # BR(~tau_2 -> ~chi_1-  nu_tau)
     4.93091076E-01    2    -1000037        16   # BR(~tau_2 -> ~chi_2-  nu_tau)
#
#         PDG            Width
DECAY   1000012     3.02557021E+01   # snu_eL decays
#          BR         NDA      ID1       ID2
     2.26266178E-01    2     1000022        12   # BR(~nu_eL -> ~chi_10 nu_e)
     7.64420328E-05    2     1000023        12   # BR(~nu_eL -> ~chi_20 nu_e)
     5.42648852E-04    2     1000025        12   # BR(~nu_eL -> ~chi_30 nu_e)
     2.57306144E-01    2     1000035        12   # BR(~nu_eL -> ~chi_40 nu_e)
     1.89563394E-03    2     1000024        11   # BR(~nu_eL -> ~chi_1+ e-)
     5.13912954E-01    2     1000037        11   # BR(~nu_eL -> ~chi_2+ e-)
#
#         PDG            Width
DECAY   1000014     3.02557021E+01   # snu_muL decays
#          BR         NDA      ID1       ID2
     2.26266178E-01    2     1000022        14   # BR(~nu_muL -> ~chi_10 nu_mu)
     7.64420328E-05    2     1000023        14   # BR(~nu_muL -> ~chi_20 nu_mu)
     5.42648852E-04    2     1000025        14   # BR(~nu_muL -> ~chi_30 nu_mu)
     2.57306144E-01    2     1000035        14   # BR(~nu_muL -> ~chi_40 nu_mu)
     1.89563394E-03    2     1000024        13   # BR(~nu_muL -> ~chi_1+ mu-)
     5.13912954E-01    2     1000037        13   # BR(~nu_muL -> ~chi_2+ mu-)
#
#         PDG            Width
DECAY   1000016     3.10769295E+01   # snu_tauL decays
#          BR         NDA      ID1       ID2
     2.20263079E-01    2     1000022        16   # BR(~nu_tauL -> ~chi_10 nu_tau)
     7.44119894E-05    2     1000023        16   # BR(~nu_tauL -> ~chi_20 nu_tau)
     5.28237866E-04    2     1000025        16   # BR(~nu_tauL -> ~chi_30 nu_tau)
     2.50414329E-01    2     1000035        16   # BR(~nu_tauL -> ~chi_40 nu_tau)
     2.85718569E-02    2     1000024        15   # BR(~nu_tauL -> ~chi_1+ tau-)
     5.00148085E-01    2     1000037        15   # BR(~nu_tauL -> ~chi_2+ tau-)
#
#         PDG            Width
DECAY   1000024     7.34428161E-01   # chargino1+ decays
#          BR         NDA      ID1       ID2
     1.00000000E+00    2     1000022        24   # BR(~chi_1+ -> ~chi_10  W+)
#
#         PDG            Width
DECAY   1000037     1.96705714E+01   # chargino2+ decays
#          BR         NDA      ID1       ID2
     2.53014171E-01    2     1000024        23   # BR(~chi_2+ -> ~chi_1+  Z )
     2.15541664E-04    2     1000022        24   # BR(~chi_2+ -> ~chi_10  W+)
     2.43991993E-01    2     1000023        24   # BR(~chi_2+ -> ~chi_20  W+)
     2.43955014E-01    2     1000025        24   # BR(~chi_2+ -> ~chi_30  W+)
     2.58822535E-01    2     1000024        25   # BR(~chi_2+ -> ~chi_1+  h )
     7.45537523E-07    2     1000022        37   # BR(~chi_2+ -> ~chi_10  H+)
#
#         PDG            Width
DECAY   1000022     0.00000000E+00   # neutralino1 decays
#
#         PDG            Width
DECAY   1000023     7.69683779E-01   # neutralino2 decays
#          BR         NDA      ID1       ID2
     5.48079579E-01    2     1000022        23   # BR(~chi_20 -> ~chi_10   Z )
     4.51920421E-01    2     1000022        25   # BR(~chi_20 -> ~chi_10   h )
#
#         PDG            Width
DECAY   1000025     7.75504463E-01   # neutralino3 decays
#          BR         NDA      ID1       ID2
     4.38104992E-01    2     1000022        23   # BR(~chi_30 -> ~chi_10   Z )
     5.61895008E-01    2     1000022        25   # BR(~chi_30 -> ~chi_10   h )
#
#         PDG            Width
DECAY   1000035     1.96822048E+01   # neutralino4 decays
#          BR         NDA      ID1       ID2
     6.35251051E-05    2     1000022        23   # BR(~chi_40 -> ~chi_10   Z )
     5.83474104E-02    2     1000023        23   # BR(~chi_40 -> ~chi_20   Z )
     1.93961690E-01    2     1000025        23   # BR(~chi_40 -> ~chi_30   Z )
     2.44606243E-01    2     1000024       -24   # BR(~chi_40 -> ~chi_1+   W-)
     2.44606243E-01    2    -1000024        24   # BR(~chi_40 -> ~chi_1-   W+)
     1.54944402E-04    2     1000022        25   # BR(~chi_40 -> ~chi_10   h )
     6.82525297E-07    2     1000022        35   # BR(~chi_40 -> ~chi_10   H )
     8.91620911E-08    2     1000022        36   # BR(~chi_40 -> ~chi_10   A )
     1.99798945E-01    2     1000023        25   # BR(~chi_40 -> ~chi_20   h )
     5.84602272E-02    2     1000025        25   # BR(~chi_40 -> ~chi_30   h )
#
#         PDG            Width
DECAY        25     4.05335730E-03   # h decays
#          BR         NDA      ID1       ID2
     6.06518872E-01    2           5        -5   # BR(h -> b       bb     )
     6.40107524E-02    2         -15        15   # BR(h -> tau+    tau-   )
     2.26621141E-04    2         -13        13   # BR(h -> mu+     mu-    )
     4.80390059E-04    2           3        -3   # BR(h -> s       sb     )
     2.08167197E-02    2           4        -4   # BR(h -> c       cb     )
     6.73886308E-02    2          21        21   # BR(h -> g       g      )
     2.31806462E-03    2          22        22   # BR(h -> gam     gam    )
     1.49845392E-03    2          22        23   # BR(h -> Z       gam    )
     2.11473533E-01    2          24       -24   # BR(h -> W+      W-     )
     2.52222031E-02    2          23        23   # BR(h -> Z       Z      )
     4.57591773E-05    2     1000022   1000022   # BR(h -> ~chi_10 ~chi_10)
#
#         PDG            Width
DECAY        35     7.79568442E+00   # H decays
#          BR         NDA      ID1       ID2
     4.16420539E-01    2           5        -5   # BR(H -> b       bb     )
     7.14580654E-02    2         -15        15   # BR(H -> tau+    tau-   )
     2.52681395E-04    2         -13        13   # BR(H -> mu+     mu-    )
     3.09748679E-04    2           3        -3   # BR(H -> s       sb     )
     1.73288291E-06    2           4        -4   # BR(H -> c       cb     )
     1.73128725E-01    2           6        -6   # BR(H -> t       tb     )
     5.75108462E-05    2          21        21   # BR(H -> g       g      )
     3.33341012E-07    2          22        22   # BR(H -> gam     gam    )
     1.02246278E-07    2          23        22   # BR(H -> Z       gam    )
     7.89111967E-05    2          24       -24   # BR(H -> W+      W-     )
     3.94056611E-05    2          23        23   # BR(H -> Z       Z      )
     2.94335224E-04    2          25        25   # BR(H -> h       h      )
    -1.50639164E-23    2          36        36   # BR(H -> A       A      )
     7.73368559E-19    2          23        36   # BR(H -> Z       A      )
     1.18874981E-03    2     1000024  -1000024   # BR(H -> ~chi_1+ ~chi_1-)
     1.28614704E-03    2     1000022   1000022   # BR(H -> ~chi_10 ~chi_10)
     6.58031935E-05    2     1000023   1000023   # BR(H -> ~chi_20 ~chi_20)
     2.34312859E-04    2     1000025   1000025   # BR(H -> ~chi_30 ~chi_30)
     2.00397938E-01    2     1000022   1000023   # BR(H -> ~chi_10 ~chi_20)
     1.34568946E-01    2     1000022   1000025   # BR(H -> ~chi_10 ~chi_30)
     2.16012329E-04    2     1000023   1000025   # BR(H -> ~chi_20 ~chi_30)
#
#         PDG            Width
DECAY        36     7.81596682E+00   # A decays
#          BR         NDA      ID1       ID2
     4.15479950E-01    2           5        -5   # BR(A -> b       bb     )
     7.12748044E-02    2         -15        15   # BR(A -> tau+    tau-   )
     2.52033017E-04    2         -13        13   # BR(A -> mu+     mu-    )
     3.09179646E-04    2           3        -3   # BR(A -> s       sb     )
     1.73551113E-06    2           4        -4   # BR(A -> c       cb     )
     1.73295639E-01    2           6        -6   # BR(A -> t       tb     )
     1.71486104E-04    2          21        21   # BR(A -> g       g      )
     5.27211049E-07    2          22        22   # BR(A -> gam     gam    )
     2.07729611E-07    2          23        22   # BR(A -> Z       gam    )
     7.84087833E-05    2          23        25   # BR(A -> Z       h      )
     2.90936836E-03    2     1000024  -1000024   # BR(A -> ~chi_1+ ~chi_1-)
     1.31475432E-03    2     1000022   1000022   # BR(A -> ~chi_10 ~chi_10)
     1.19105199E-04    2     1000023   1000023   # BR(A -> ~chi_20 ~chi_20)
     9.98415644E-04    2     1000025   1000025   # BR(A -> ~chi_30 ~chi_30)
     1.35951871E-01    2     1000022   1000023   # BR(A -> ~chi_10 ~chi_20)
     1.97816085E-01    2     1000022   1000025   # BR(A -> ~chi_10 ~chi_30)
     2.64280072E-05    2     1000023   1000025   # BR(A -> ~chi_20 ~chi_30)
#
#         PDG            Width
DECAY        37     7.79280969E+00   # H+ decays
#          BR         NDA      ID1       ID2
     6.70486282E-04    2           4        -5   # BR(H+ -> c       bb     )
     7.15071922E-02    2         -15        16   # BR(H+ -> tau+    nu_tau )
     2.52854758E-04    2         -13        14   # BR(H+ -> mu+     nu_mu  )
     4.29109016E-06    2           2        -5   # BR(H+ -> u       bb     )
     1.48369965E-05    2           2        -3   # BR(H+ -> u       sb     )
     3.06830281E-04    2           4        -3   # BR(H+ -> c       sb     )
     5.89226350E-01    2           6        -5   # BR(H+ -> t       bb     )
     7.87602421E-05    2          24        25   # BR(H+ -> W+      h      )
     8.11888010E-14    2          24        36   # BR(H+ -> W+      A      )
     3.37373648E-01    2     1000024   1000022   # BR(H+ -> ~chi_1+ ~chi_10)
     5.03702964E-04    2     1000024   1000023   # BR(H+ -> ~chi_1+ ~chi_20)
     6.10469250E-05    2     1000024   1000025   # BR(H+ -> ~chi_1+ ~chi_30)
