######################################################################
## PARAM_CARD AUTOMATICALY GENERATED BY MG5 FOLLOWING UFO MODEL   ####
######################################################################
##                                                                  ##
##  Width set on Auto will be computed following the information    ##
##        present in the decay.py files of the model.               ##
##        See  arXiv:1402.1178 for more details.                    ##
##                                                                  ##
######################################################################

###################################
## INFORMATION FOR HHDMINPUTS
###################################
Block hhdminputs
    1 0.000000e+00 # lHHRR
    2 0.000000e+00 # lRRXX
    3 0.000000e+00 # lHHXX
    4 0.832300e+00 # lHRXX
    5 0.004975e+00 # lHHR
    6 0.000600e+00 # lHXX
    7 0.010000e+00 # lRXX 
    8 1.000000e+00 # btg
    9 1.000000e+00 # btW
   10 0.000000e+00 # btZ
   11 1.000000e+00 # btb
   12 1.000000e+00 # kpg
   13 1.000000e+00 # kpV
   14 1.000000e+00 # KfacH
   15 1.000000e+00 # KfacR
   16 1.000000e+00 # ttH

###################################
## INFORMATION FOR MASS
###################################
Block mass
    5 4.700000e+00 # MB
    6 1.720000e+02 # MT
   15 1.777000e+00 # MTA
   23 9.118760e+01 # MZ
   25 1.250000e+02 # MH
  1000022 6.000000e+01 # MX
  35 2.750000e+02 # MR
## Dependent parameters, given by model restrictions.
## Those values should be edited following the
## analytical expression. MG5 ignores those values
## but they are important for interfacing the output of MG5
## to external program such as Pythia.
  1 0.000000 # d : 0.0
  2 0.000000 # u : 0.0
  3 0.000000 # s : 0.0
  4 0.000000 # c : 0.0
  11 0.000000 # e- : 0.0
  12 0.000000 # ve : 0.0
  13 0.000000 # mu- : 0.0
  14 0.000000 # vm : 0.0
  16 0.000000 # vt : 0.0
  21 0.000000 # g : 0.0
  22 0.000000 # a : 0.0
  24 79.824360 # w+ : cmath.sqrt(MZ__exp__2/2. + cmath.sqrt(MZ__exp__4/4. - (aEW*cmath.pi*MZ__exp__2)/(Gf*sqrt__2)))

###################################
## INFORMATION FOR SMINPUTS
###################################
Block sminputs
    1 1.279000e+02 # aEWM1
    2 1.166370e-05 # Gf
    3 1.184000e-01 # aS

###################################
## INFORMATION FOR YUKAWA
###################################
Block yukawa
    5 4.700000e+00 # ymb
    6 1.720000e+02 # ymt
   15 1.777000e+00 # ymtau

###################################
## INFORMATION FOR DECAY
###################################
DECAY   6 1.508336e+00 # WT
DECAY  23 2.495200e+00 # WZ
DECAY  24 2.085000e+00 # WW
DECAY  25 4.070000e-03 # WH
DECAY 1000022 0.000000e+00 # WX
DECAY 35 3.000000e-04 # WR
## Dependent parameters, given by model restrictions.
## Those values should be edited following the
## analytical expression. MG5 ignores those values
## but they are important for interfacing the output of MG5
## to external program such as Pythia.
DECAY  1 0.000000 # d : 0.0
DECAY  2 0.000000 # u : 0.0
DECAY  3 0.000000 # s : 0.0
DECAY  4 0.000000 # c : 0.0
DECAY  5 0.000000 # b : 0.0
DECAY  11 0.000000 # e- : 0.0
DECAY  12 0.000000 # ve : 0.0
DECAY  13 0.000000 # mu- : 0.0
DECAY  14 0.000000 # vm : 0.0
DECAY  15 0.000000 # ta- : 0.0
DECAY  16 0.000000 # vt : 0.0
DECAY  21 0.000000 # g : 0.0
DECAY  22 0.000000 # a : 0.0
#===========================================================
# QUANTUM NUMBERS OF NEW STATE(S) (NON SM PDG CODE)
#===========================================================

Block QNUMBERS 1000022  # x
        1 0  # 3 times electric charge
        2 1  # number of spin states (2S+1)
        3 1  # colour rep (1: singlet, 3: triplet, 8: octet)
        4 0  # Particle/Antiparticle distinction (0=own anti)
Block QNUMBERS 35  # r
        1 0  # 3 times electric charge
        2 1  # number of spin states (2S+1)
        3 1  # colour rep (1: singlet, 3: triplet, 8: octet)
        4 0  # Particle/Antiparticle distinction (0=own anti)
