#
#                              ======================
#                              | THE SUSYHIT OUTPUT |
#                              ======================
#
#
#              ------------------------------------------------------
#              |     This is the output of the SUSY-HIT package     |
#              |  created by A.Djouadi, M.Muehlleitner and M.Spira. |
#              |  In case of problems with SUSY-HIT email to        |
#              |           margarete.muehlleitner@cern.ch           |
#              |           michael.spira@psi.ch                     |
#              |           abdelhak.djouadi@cern.ch                 |
#              ------------------------------------------------------
#
#              ------------------------------------------------------
#              |  SUSY Les Houches Accord - MSSM Spectrum + Decays  |
#              |              based on the decay programs           |
#              |                                                    |
#              |                     SDECAY 1.3b                    |
#              |                                                    |
#              |  Authors: M.Muhlleitner, A.Djouadi and Y.Mambrini  |
#              |  Ref.:    Comput.Phys.Commun.168(2005)46           |
#              |           [hep-ph/0311167]                         |
#              |                                                    |
#              |                     HDECAY 3.4                     |
#              |                                                    |
#              |  By: A.Djouadi,J.Kalinowski,M.Muhlleitner,M.Spira  |
#              |  Ref.:    Comput.Phys.Commun.108(1998)56           |
#              |           [hep-ph/9704448]                         |
#              |                                                    |
#              |                                                    |
#              |  If not stated otherwise all DRbar couplings and   |
#              |  soft SUSY breaking masses are given at the scale  |
#              |  Q=  0.50007211E+04
#              |                                                    |
#              ------------------------------------------------------
#
#
BLOCK DCINFO  # Decay Program information
     1   SDECAY/HDECAY # decay calculator
     2   1.3b  /3.4    # version number
#
BLOCK SPINFO  # Spectrum calculator information
     1    SOFTSUSY    # spectrum calculator                
     2    3.4.0       # version number                     
#
BLOCK MODSEL  # Model selection
     1     0   #  nonUniversal                                     
#
BLOCK SMINPUTS  # Standard Model inputs
         1     1.25778332E+02   # alpha_em^-1(M_Z)^MSbar
         2     1.16570000E-05   # G_F [GeV^-2]
         3     1.17200002E-01   # alpha_S(M_Z)^MSbar
         4     9.11876000E+01   # M_Z pole mass
         5     4.25000000E+00   # mb(mb)^MSbar
         6     1.72500000E+02   # mt pole mass
         7     1.77682000E+00   # mtau pole mass
#
BLOCK MINPAR  # Input parameters - minimal models
         3     1.00000000E+01   # tanb                
#
BLOCK EXTPAR  # Input parameters - non-minimal models
         0    -1.00000000E+00   # Set                 
         1     6.00000000E+01   # M_1(MX)             
         2     3.00000000E+03   # M_2(MX)             
         3     8.59145000E+02   # M_3(MX)             
        11     5.00000000E+03   # At(MX)              
        12     5.00000000E+03   # Ab(MX)              
        13     0.00000000E+00   # Atau(MX)            
        23    -1.15415500E+03   # mu(MX)              
        26     3.00000000E+03   # mA(pole)            
        31     5.00000000E+03   # meL(MX)             
        32     5.00000000E+03   # mmuL(MX)            
        33     5.00000000E+03   # mtauL(MX)           
        34     5.00000000E+03   # meR(MX)             
        35     5.00000000E+03   # mmuR(MX)            
        36     5.00000000E+03   # mtauR(MX)           
        41     5.00000000E+03   # mqL1(MX)            
        42     5.00000000E+03   # mqL2(MX)            
        43     5.00000000E+03   # mqL3(MX)            
        44     5.00000000E+03   # muR(MX)             
        45     5.00000000E+03   # mcR(MX)             
        46     5.00000000E+03   # mtR(MX)             
        47     5.00000000E+03   # mdR(MX)             
        48     5.00000000E+03   # msR(MX)             
        49     5.00000000E+03   # mbR(MX)             
#
BLOCK MASS  # Mass Spectrum
# PDG code           mass       particle
        24     8.00933921E+01   # W+
        25     1.24392645E+02   # h
        35     3.00007970E+03   # H
        36     2.99999986E+03   # A
        37     3.00086537E+03   # H+
         5     4.87878001E+00   # b-quark pole mass calculated from mb(mb)_Msbar
   1000001     5.06418845E+03   # ~d_L
   2000001     5.04636708E+03   # ~d_R
   1000002     5.06371169E+03   # ~u_L
   2000002     5.04608547E+03   # ~u_R
   1000003     5.06418845E+03   # ~s_L
   2000003     5.04636708E+03   # ~s_R
   1000004     5.06371169E+03   # ~c_L
   2000004     5.04608547E+03   # ~c_R
   1000005     5.01051891E+03   # ~b_1
   2000005     5.04507317E+03   # ~b_2
   1000006     4.90107433E+03   # ~t_1
   2000006     5.05683325E+03   # ~t_2
   1000011     5.01906373E+03   # ~e_L
   2000011     5.00591823E+03   # ~e_R
   1000012     5.01811486E+03   # ~nu_eL
   1000013     5.01906373E+03   # ~mu_L
   2000013     5.00591823E+03   # ~mu_R
   1000014     5.01811486E+03   # ~nu_muL
   1000015     5.00452442E+03   # ~tau_1
   2000015     5.01885181E+03   # ~tau_2
   1000016     5.01757121E+03   # ~nu_tauL
   1000021     1.10000103E+03   # ~g
   1000022     6.03020344E+01   # ~chi_10
   1000023     1.19954025E+03   # ~chi_20
   1000025    -1.20184579E+03   # ~chi_30
   1000035     3.07429493E+03   # ~chi_40
   1000024     1.20000033E+03   # ~chi_1+
   1000037     3.07446244E+03   # ~chi_2+
#
BLOCK NMIX  # Neutralino Mixing Matrix
  1  1     9.99308578E-01   # N_11
  1  2     1.64182275E-04   # N_12
  1  3    -3.71252833E-02   # N_13
  1  4     2.01286089E-03   # N_14
  2  1     2.48325582E-02   # N_21
  2  2     2.59815899E-02   # N_22
  2  3     7.06840622E-01   # N_23
  2  4     7.06459225E-01   # N_24
  3  1    -2.76683210E-02   # N_31
  3  2     1.42097216E-02   # N_32
  3  3    -7.06348878E-01   # N_33
  3  4     7.07180183E-01   # N_34
  4  1    -4.16281537E-04   # N_41
  4  2     9.99561411E-01   # N_42
  4  3    -8.32537833E-03   # N_43
  4  4    -2.84165611E-02   # N_44
#
BLOCK UMIX  # Chargino Mixing Matrix U
  1  1     1.17887312E-02   # U_11
  1  2     9.99930510E-01   # U_12
  2  1    -9.99930510E-01   # U_21
  2  2     1.17887312E-02   # U_22
#
BLOCK VMIX  # Chargino Mixing Matrix V
  1  1     4.02157863E-02   # V_11
  1  2    -9.99191018E-01   # V_12
  2  1    -9.99191018E-01   # V_21
  2  2    -4.02157863E-02   # V_22
#
BLOCK STOPMIX  # Stop Mixing Matrix
  1  1    -5.11435170E-01   # cos(theta_t)
  1  2     8.59321865E-01   # sin(theta_t)
  2  1    -8.59321865E-01   # -sin(theta_t)
  2  2    -5.11435170E-01   # cos(theta_t)
#
BLOCK SBOTMIX  # Sbottom Mixing Matrix
  1  1     9.96104432E-01   # cos(theta_b)
  1  2    -8.81814071E-02   # sin(theta_b)
  2  1     8.81814071E-02   # -sin(theta_b)
  2  2     9.96104432E-01   # cos(theta_b)
#
BLOCK STAUMIX  # Stau Mixing Matrix
  1  1    -1.36044183E-01   # cos(theta_tau)
  1  2     9.90702771E-01   # sin(theta_tau)
  2  1    -9.90702771E-01   # -sin(theta_tau)
  2  2    -1.36044183E-01   # cos(theta_tau)
#
BLOCK ALPHA  # Higgs mixing
          -1.05428028E-01   # Mixing angle in the neutral Higgs boson sector
#
BLOCK HMIX Q=  5.00072110E+03  # DRbar Higgs Parameters
         1    -1.17478510E+03   # mu(Q)MSSM           
         2     9.47373975E+00   # tan                 
         3     2.41953796E+02   # higgs               
         4     8.45770425E+06   # mA^2(Q)MSSM         
#
BLOCK GAUGE Q=  5.00072110E+03  # The gauge couplings
     1     3.70772150E-01   # gprime(Q) DRbar
     2     6.32389392E-01   # g(Q) DRbar
     3     1.00724167E+00   # g3(Q) DRbar
#
BLOCK AU Q=  5.00072110E+03  # The trilinear couplings
  1  1     5.00000001E+03   # A_u(Q) DRbar
  2  2     5.00000001E+03   # A_c(Q) DRbar
  3  3     5.00000001E+03   # A_t(Q) DRbar
#
BLOCK AD Q=  5.00072110E+03  # The trilinear couplings
  1  1     5.00000000E+03   # A_d(Q) DRbar
  2  2     5.00000000E+03   # A_s(Q) DRbar
  3  3     5.00000001E+03   # A_b(Q) DRbar
#
BLOCK AE Q=  5.00072110E+03  # The trilinear couplings
  1  1     0.00000000E+00   # A_e(Q) DRbar
  2  2     3.33309979E-08   # A_mu(Q) DRbar
  3  3     3.24202680E-08   # A_tau(Q) DRbar
#
BLOCK Yu Q=  5.00072110E+03  # The Yukawa couplings
  1  1     0.00000000E+00   # y_u(Q) DRbar
  2  2     0.00000000E+00   # y_c(Q) DRbar
  3  3     8.14916900E-01   # y_t(Q) DRbar
#
BLOCK Yd Q=  5.00072110E+03  # The Yukawa couplings
  1  1     0.00000000E+00   # y_d(Q) DRbar
  2  2     0.00000000E+00   # y_s(Q) DRbar
  3  3     1.29686916E-01   # y_b(Q) DRbar
#
BLOCK Ye Q=  5.00072110E+03  # The Yukawa couplings
  1  1     0.00000000E+00   # y_e(Q) DRbar
  2  2     0.00000000E+00   # y_mu(Q) DRbar
  3  3     9.67724577E-02   # y_tau(Q) DRbar
#
BLOCK MSOFT Q=  5.00072110E+03  # The soft SUSY breaking masses at the scale Q
         1     6.00000000E+01   # M_1(Q)              
         2     3.00000000E+03   # M_2(Q)              
         3     8.59145000E+02   # M_3(Q)              
        21     7.30449977E+06   # mH1^2(Q)            
        22    -8.26159480E+05   # mH2^2(Q)            
        31     5.00000000E+03   # meL(Q)              
        32     5.00000000E+03   # mmuL(Q)             
        33     5.00000000E+03   # mtauL(Q)            
        34     5.00000000E+03   # meR(Q)              
        35     5.00000000E+03   # mmuR(Q)             
        36     5.00000000E+03   # mtauR(Q)            
        41     5.00000000E+03   # mqL1(Q)             
        42     5.00000000E+03   # mqL2(Q)             
        43     5.00000000E+03   # mqL3(Q)             
        44     5.00000000E+03   # muR(Q)              
        45     5.00000000E+03   # mcR(Q)              
        46     5.00000000E+03   # mtR(Q)              
        47     5.00000000E+03   # mdR(Q)              
        48     5.00000000E+03   # msR(Q)              
        49     5.00000000E+03   # mbR(Q)              
#
#
#
#                             =================
#                             |The decay table|
#                             =================
#
# - The QCD corrections to the decays gluino -> squark  + quark
#                                     squark -> gaugino + quark_prime
#                                     squark -> squark_prime + Higgs
#                                     squark -> gluino  + quark
#   are included.
#
# - The multi-body decays for the inos, stops and sbottoms are included.
#
# - The loop induced decays for the gluino, neutralinos and stops
#   are included.
#
# - The SUSY decays of the top quark are included.
#
#
#         PDG            Width
DECAY         6     1.40151280E+00   # top decays
#          BR         NDA      ID1       ID2
     1.00000000E+00    2           5        24   # BR(t ->  b    W+)
#
#         PDG            Width
DECAY   1000021     1.37958923E-05   # gluino decays
#          BR         NDA      ID1       ID2
     1.81613357E-05    2     1000022        21   # BR(~g -> ~chi_10 g)
#           BR         NDA      ID1       ID2       ID3
     8.15588901E-02    3     1000022         1        -1   # BR(~g -> ~chi_10 d  db)
     2.78045658E-01    3     1000022         2        -2   # BR(~g -> ~chi_10 u  ub)
     8.15588901E-02    3     1000022         3        -3   # BR(~g -> ~chi_10 s  sb)
     2.78045658E-01    3     1000022         4        -4   # BR(~g -> ~chi_10 c  cb)
     8.26341466E-02    3     1000022         5        -5   # BR(~g -> ~chi_10 b  bb)
     1.98138596E-01    3     1000022         6        -6   # BR(~g -> ~chi_10 t  tb)
#
#         PDG            Width
DECAY   1000006     4.05631881E+02   # stop1 decays
#          BR         NDA      ID1       ID2
     2.16492304E-02    2     1000022         6   # BR(~t_1 -> ~chi_10 t )
     7.15439710E-02    2     1000023         6   # BR(~t_1 -> ~chi_20 t )
     6.87606264E-02    2     1000025         6   # BR(~t_1 -> ~chi_30 t )
     5.27781712E-03    2     1000035         6   # BR(~t_1 -> ~chi_40 t )
     1.02848502E-01    2     1000024         5   # BR(~t_1 -> ~chi_1+ b )
     1.05099142E-02    2     1000037         5   # BR(~t_1 -> ~chi_2+ b )
     7.19409939E-01    2     1000021         6   # BR(~t_1 -> ~g      t )
#
#         PDG            Width
DECAY   2000006     4.08704397E+02   # stop2 decays
#          BR         NDA      ID1       ID2
     8.77722655E-03    2     1000022         6   # BR(~t_2 -> ~chi_10 t )
     7.29699293E-02    2     1000023         6   # BR(~t_2 -> ~chi_20 t )
     7.59741865E-02    2     1000025         6   # BR(~t_2 -> ~chi_30 t )
     1.33134670E-02    2     1000035         6   # BR(~t_2 -> ~chi_40 t )
     4.47129222E-02    2     1000024         5   # BR(~t_2 -> ~chi_1+ b )
     2.64728772E-02    2     1000037         5   # BR(~t_2 -> ~chi_2+ b )
     7.54572621E-01    2     1000021         6   # BR(~t_2 -> ~g      t )
     7.10015119E-04    2     1000006        25   # BR(~t_2 -> ~t_1    h )
     2.49675514E-03    2     1000006        23   # BR(~t_2 -> ~t_1    Z )
#
#         PDG            Width
DECAY   1000005     3.86915227E+02   # sbottom1 decays
#          BR         NDA      ID1       ID2
     2.01055329E-03    2     1000022         5   # BR(~b_1 -> ~chi_10 b )
     1.98301490E-03    2     1000023         5   # BR(~b_1 -> ~chi_20 b )
     1.90899222E-03    2     1000025         5   # BR(~b_1 -> ~chi_30 b )
     1.93173897E-02    2     1000035         5   # BR(~b_1 -> ~chi_40 b )
     1.52063268E-01    2    -1000024         6   # BR(~b_1 -> ~chi_1- t )
     3.88340858E-02    2    -1000037         6   # BR(~b_1 -> ~chi_2- t )
     7.82412945E-01    2     1000021         5   # BR(~b_1 -> ~g      b )
     1.46975103E-03    2     1000006       -24   # BR(~b_1 -> ~t_1    W-)
#
#         PDG            Width
DECAY   2000005     3.11621775E+02   # sbottom2 decays
#          BR         NDA      ID1       ID2
     9.42758731E-03    2     1000022         5   # BR(~b_2 -> ~chi_10 b )
     2.41755158E-03    2     1000023         5   # BR(~b_2 -> ~chi_20 b )
     2.49907649E-03    2     1000025         5   # BR(~b_2 -> ~chi_30 b )
     1.98008777E-04    2     1000035         5   # BR(~b_2 -> ~chi_40 b )
     6.31343754E-03    2    -1000024         6   # BR(~b_2 -> ~chi_1- t )
     3.97961375E-04    2    -1000037         6   # BR(~b_2 -> ~chi_2- t )
     9.78687903E-01    2     1000021         5   # BR(~b_2 -> ~g      b )
     5.84739730E-05    2     1000006       -24   # BR(~b_2 -> ~t_1    W-)
#
#         PDG            Width
DECAY   1000002     3.30458855E+02   # sup_L decays
#          BR         NDA      ID1       ID2
     2.26215244E-03    2     1000022         2   # BR(~u_L -> ~chi_10 u)
     5.01760919E-05    2     1000023         2   # BR(~u_L -> ~chi_20 u)
     4.08711842E-06    2     1000025         2   # BR(~u_L -> ~chi_30 u)
     2.36159262E-02    2     1000035         2   # BR(~u_L -> ~chi_40 u)
     1.70686810E-04    2     1000024         1   # BR(~u_L -> ~chi_1+ d)
     4.71985641E-02    2     1000037         1   # BR(~u_L -> ~chi_2+ d)
     9.26698407E-01    2     1000021         2   # BR(~u_L -> ~g      u)
#
#         PDG            Width
DECAY   2000002     3.16871853E+02   # sup_R decays
#          BR         NDA      ID1       ID2
     3.75513848E-02    2     1000022         2   # BR(~u_R -> ~chi_10 u)
     2.06508066E-05    2     1000023         2   # BR(~u_R -> ~chi_20 u)
     2.56247125E-05    2     1000025         2   # BR(~u_R -> ~chi_30 u)
     2.58070442E-09    2     1000035         2   # BR(~u_R -> ~chi_40 u)
     9.62402337E-01    2     1000021         2   # BR(~u_R -> ~g      u)
#
#         PDG            Width
DECAY   1000001     3.30468929E+02   # sdown_L decays
#          BR         NDA      ID1       ID2
     2.25470260E-03    2     1000022         1   # BR(~d_L -> ~chi_10 d)
     2.35607614E-05    2     1000023         1   # BR(~d_L -> ~chi_20 d)
     2.03012581E-05    2     1000025         1   # BR(~d_L -> ~chi_30 d)
     2.36302829E-02    2     1000035         1   # BR(~d_L -> ~chi_40 d)
     1.46682540E-05    2    -1000024         2   # BR(~d_L -> ~chi_1- u)
     4.72817940E-02    2    -1000037         2   # BR(~d_L -> ~chi_2- u)
     9.26774690E-01    2     1000021         1   # BR(~d_L -> ~g      d)
#
#         PDG            Width
DECAY   2000001     3.07957204E+02   # sdown_R decays
#          BR         NDA      ID1       ID2
     9.66014362E-03    2     1000022         1   # BR(~d_R -> ~chi_10 d)
     5.31251796E-06    2     1000023         1   # BR(~d_R -> ~chi_20 d)
     6.59207923E-06    2     1000025         1   # BR(~d_R -> ~chi_30 d)
     6.63976458E-10    2     1000035         1   # BR(~d_R -> ~chi_40 d)
     9.90327951E-01    2     1000021         1   # BR(~d_R -> ~g      d)
#
#         PDG            Width
DECAY   1000004     3.30458855E+02   # scharm_L decays
#          BR         NDA      ID1       ID2
     2.26215244E-03    2     1000022         4   # BR(~c_L -> ~chi_10 c)
     5.01760919E-05    2     1000023         4   # BR(~c_L -> ~chi_20 c)
     4.08711842E-06    2     1000025         4   # BR(~c_L -> ~chi_30 c)
     2.36159262E-02    2     1000035         4   # BR(~c_L -> ~chi_40 c)
     1.70686810E-04    2     1000024         3   # BR(~c_L -> ~chi_1+ s)
     4.71985641E-02    2     1000037         3   # BR(~c_L -> ~chi_2+ s)
     9.26698407E-01    2     1000021         4   # BR(~c_L -> ~g      c)
#
#         PDG            Width
DECAY   2000004     3.16871853E+02   # scharm_R decays
#          BR         NDA      ID1       ID2
     3.75513848E-02    2     1000022         4   # BR(~c_R -> ~chi_10 c)
     2.06508066E-05    2     1000023         4   # BR(~c_R -> ~chi_20 c)
     2.56247125E-05    2     1000025         4   # BR(~c_R -> ~chi_30 c)
     2.58070442E-09    2     1000035         4   # BR(~c_R -> ~chi_40 c)
     9.62402337E-01    2     1000021         4   # BR(~c_R -> ~g      c)
#
#         PDG            Width
DECAY   1000003     3.30468929E+02   # sstrange_L decays
#          BR         NDA      ID1       ID2
     2.25470260E-03    2     1000022         3   # BR(~s_L -> ~chi_10 s)
     2.35607614E-05    2     1000023         3   # BR(~s_L -> ~chi_20 s)
     2.03012581E-05    2     1000025         3   # BR(~s_L -> ~chi_30 s)
     2.36302829E-02    2     1000035         3   # BR(~s_L -> ~chi_40 s)
     1.46682540E-05    2    -1000024         4   # BR(~s_L -> ~chi_1- c)
     4.72817940E-02    2    -1000037         4   # BR(~s_L -> ~chi_2- c)
     9.26774690E-01    2     1000021         3   # BR(~s_L -> ~g      s)
#
#         PDG            Width
DECAY   2000003     3.07957204E+02   # sstrange_R decays
#          BR         NDA      ID1       ID2
     9.66014362E-03    2     1000022         3   # BR(~s_R -> ~chi_10 s)
     5.31251796E-06    2     1000023         3   # BR(~s_R -> ~chi_20 s)
     6.59207923E-06    2     1000025         3   # BR(~s_R -> ~chi_30 s)
     6.63976458E-10    2     1000035         3   # BR(~s_R -> ~chi_40 s)
     9.90327951E-01    2     1000021         3   # BR(~s_R -> ~g      s)
#
#         PDG            Width
DECAY   1000011     3.02589198E+01   # selectron_L decays
#          BR         NDA      ID1       ID2
     2.26569191E-01    2     1000022        11   # BR(~e_L -> ~chi_10 e-)
     9.64141965E-04    2     1000023        11   # BR(~e_L -> ~chi_20 e-)
     2.37432781E-06    2     1000025        11   # BR(~e_L -> ~chi_30 e-)
     2.57245704E-01    2     1000035        11   # BR(~e_L -> ~chi_40 e-)
     1.63033058E-04    2    -1000024        12   # BR(~e_L -> ~chi_1- nu_e)
     5.15055555E-01    2    -1000037        12   # BR(~e_L -> ~chi_2- nu_e)
#
#         PDG            Width
DECAY   2000011     2.73693864E+01   # selectron_R decays
#          BR         NDA      ID1       ID2
     9.98771687E-01    2     1000022        11   # BR(~e_R -> ~chi_10 e-)
     5.48116068E-04    2     1000023        11   # BR(~e_R -> ~chi_20 e-)
     6.80129486E-04    2     1000025        11   # BR(~e_R -> ~chi_30 e-)
     6.72547313E-08    2     1000035        11   # BR(~e_R -> ~chi_40 e-)
#
#         PDG            Width
DECAY   1000013     3.02589198E+01   # smuon_L decays
#          BR         NDA      ID1       ID2
     2.26569191E-01    2     1000022        13   # BR(~mu_L -> ~chi_10 mu-)
     9.64141965E-04    2     1000023        13   # BR(~mu_L -> ~chi_20 mu-)
     2.37432781E-06    2     1000025        13   # BR(~mu_L -> ~chi_30 mu-)
     2.57245704E-01    2     1000035        13   # BR(~mu_L -> ~chi_40 mu-)
     1.63033058E-04    2    -1000024        14   # BR(~mu_L -> ~chi_1- nu_mu)
     5.15055555E-01    2    -1000037        14   # BR(~mu_L -> ~chi_2- nu_mu)
#
#         PDG            Width
DECAY   2000013     2.73693864E+01   # smuon_R decays
#          BR         NDA      ID1       ID2
     9.98771687E-01    2     1000022        13   # BR(~mu_R -> ~chi_10 mu-)
     5.48116068E-04    2     1000023        13   # BR(~mu_R -> ~chi_20 mu-)
     6.80129486E-04    2     1000025        13   # BR(~mu_R -> ~chi_30 mu-)
     6.72547313E-08    2     1000035        13   # BR(~mu_R -> ~chi_40 mu-)
#
#         PDG            Width
DECAY   1000015     2.90691787E+01   # stau_1 decays
#          BR         NDA      ID1       ID2
     9.27971784E-01    2     1000022        15   # BR(~tau_1 -> ~chi_10  tau-)
     1.50479700E-02    2     1000023        15   # BR(~tau_1 -> ~chi_20  tau-)
     1.40765093E-02    2     1000025        15   # BR(~tau_1 -> ~chi_30  tau-)
     4.77915539E-03    2     1000035        15   # BR(~tau_1 -> ~chi_40  tau-)
     2.85560149E-02    2    -1000024        16   # BR(~tau_1 -> ~chi_1-  nu_tau)
     9.56856686E-03    2    -1000037        16   # BR(~tau_1 -> ~chi_2-  nu_tau)
#
#         PDG            Width
DECAY   2000015     3.10324596E+01   # stau_2 decays
#          BR         NDA      ID1       ID2
     2.32395517E-01    2     1000022        15   # BR(~tau_2 -> ~chi_10  tau-)
     1.40464912E-02    2     1000023        15   # BR(~tau_2 -> ~chi_20  tau-)
     1.40896661E-02    2     1000025        15   # BR(~tau_2 -> ~chi_30  tau-)
     2.46277567E-01    2     1000035        15   # BR(~tau_2 -> ~chi_40  tau-)
     9.55082337E-05    2    -1000024        16   # BR(~tau_2 -> ~chi_1-  nu_tau)
     4.93095250E-01    2    -1000037        16   # BR(~tau_2 -> ~chi_2-  nu_tau)
#
#         PDG            Width
DECAY   1000012     3.02614465E+01   # snu_eL decays
#          BR         NDA      ID1       ID2
     2.26253670E-01    2     1000022        12   # BR(~nu_eL -> ~chi_10 nu_e)
     7.65087465E-05    2     1000023        12   # BR(~nu_eL -> ~chi_20 nu_e)
     5.42831595E-04    2     1000025        12   # BR(~nu_eL -> ~chi_30 nu_e)
     2.57309987E-01    2     1000035        12   # BR(~nu_eL -> ~chi_40 nu_e)
     1.89669010E-03    2     1000024        11   # BR(~nu_eL -> ~chi_1+ e-)
     5.13920312E-01    2     1000037        11   # BR(~nu_eL -> ~chi_2+ e-)
#
#         PDG            Width
DECAY   1000014     3.02614465E+01   # snu_muL decays
#          BR         NDA      ID1       ID2
     2.26253670E-01    2     1000022        14   # BR(~nu_muL -> ~chi_10 nu_mu)
     7.65087465E-05    2     1000023        14   # BR(~nu_muL -> ~chi_20 nu_mu)
     5.42831595E-04    2     1000025        14   # BR(~nu_muL -> ~chi_30 nu_mu)
     2.57309987E-01    2     1000035        14   # BR(~nu_muL -> ~chi_40 nu_mu)
     1.89669010E-03    2     1000024        13   # BR(~nu_muL -> ~chi_1+ mu-)
     5.13920312E-01    2     1000037        13   # BR(~nu_muL -> ~chi_2+ mu-)
#
#         PDG            Width
DECAY   1000016     3.10829911E+01   # snu_tauL decays
#          BR         NDA      ID1       ID2
     2.20249754E-01    2     1000022        16   # BR(~nu_tauL -> ~chi_10 nu_tau)
     7.44765422E-05    2     1000023        16   # BR(~nu_tauL -> ~chi_20 nu_tau)
     5.28412996E-04    2     1000025        16   # BR(~nu_tauL -> ~chi_30 nu_tau)
     2.50416745E-01    2     1000035        16   # BR(~nu_tauL -> ~chi_40 nu_tau)
     2.85780100E-02    2     1000024        15   # BR(~nu_tauL -> ~chi_1+ tau-)
     5.00152601E-01    2     1000037        15   # BR(~nu_tauL -> ~chi_2+ tau-)
#
#         PDG            Width
DECAY   1000024     7.34908304E-01   # chargino1+ decays
#          BR         NDA      ID1       ID2
     1.00000000E+00    2     1000022        24   # BR(~chi_1+ -> ~chi_10  W+)
#
#         PDG            Width
DECAY   1000037     1.96841367E+01   # chargino2+ decays
#          BR         NDA      ID1       ID2
     2.53032213E-01    2     1000024        23   # BR(~chi_2+ -> ~chi_1+  Z )
     2.15573390E-04    2     1000022        24   # BR(~chi_2+ -> ~chi_10  W+)
     2.44031180E-01    2     1000023        24   # BR(~chi_2+ -> ~chi_20  W+)
     2.43993887E-01    2     1000025        24   # BR(~chi_2+ -> ~chi_30  W+)
     2.58726400E-01    2     1000024        25   # BR(~chi_2+ -> ~chi_1+  h )
     7.45816825E-07    2     1000022        37   # BR(~chi_2+ -> ~chi_10  H+)
#
#         PDG            Width
DECAY   1000022     0.00000000E+00   # neutralino1 decays
#
#         PDG            Width
DECAY   1000023     7.70024522E-01   # neutralino2 decays
#          BR         NDA      ID1       ID2
     5.48101958E-01    2     1000022        23   # BR(~chi_20 -> ~chi_10   Z )
     4.51898042E-01    2     1000022        25   # BR(~chi_20 -> ~chi_10   h )
#
#         PDG            Width
DECAY   1000025     7.75826717E-01   # neutralino3 decays
#          BR         NDA      ID1       ID2
     4.38217239E-01    2     1000022        23   # BR(~chi_30 -> ~chi_10   Z )
     5.61782761E-01    2     1000022        25   # BR(~chi_30 -> ~chi_10   h )
#
#         PDG            Width
DECAY   1000035     1.96957387E+01   # neutralino4 decays
#          BR         NDA      ID1       ID2
     6.35508801E-05    2     1000022        23   # BR(~chi_40 -> ~chi_10   Z )
     5.83437839E-02    2     1000023        23   # BR(~chi_40 -> ~chi_20   Z )
     1.93984105E-01    2     1000025        23   # BR(~chi_40 -> ~chi_30   Z )
     2.44644845E-01    2     1000024       -24   # BR(~chi_40 -> ~chi_1+   W-)
     2.44644845E-01    2    -1000024        24   # BR(~chi_40 -> ~chi_1-   W+)
     1.54897176E-04    2     1000022        25   # BR(~chi_40 -> ~chi_10   h )
     6.82801247E-07    2     1000022        35   # BR(~chi_40 -> ~chi_10   H )
     8.92424786E-08    2     1000022        36   # BR(~chi_40 -> ~chi_10   A )
     1.99732344E-01    2     1000023        25   # BR(~chi_40 -> ~chi_20   h )
     5.84308561E-02    2     1000025        25   # BR(~chi_40 -> ~chi_30   h )
#
#         PDG            Width
DECAY        25     4.02116625E-03   # h decays
#          BR         NDA      ID1       ID2
     6.15357957E-01    2           5        -5   # BR(h -> b       bb     )
     6.43009047E-02    2         -15        15   # BR(h -> tau+    tau-   )
     2.27650276E-04    2         -13        13   # BR(h -> mu+     mu-    )
     4.82892998E-04    2           3        -3   # BR(h -> s       sb     )
     2.09258020E-02    2           4        -4   # BR(h -> c       cb     )
     6.72491554E-02    2          21        21   # BR(h -> g       g      )
     2.30350707E-03    2          22        22   # BR(h -> gam     gam    )
     1.45322367E-03    2          22        23   # BR(h -> Z       gam    )
     2.03563386E-01    2          24       -24   # BR(h -> W+      W-     )
     2.40960479E-02    2          23        23   # BR(h -> Z       Z      )
     3.94729345E-05    2     1000022   1000022   # BR(h -> ~chi_10 ~chi_10)
#
#         PDG            Width
DECAY        35     7.78837761E+00   # H decays
#          BR         NDA      ID1       ID2
     4.15894412E-01    2           5        -5   # BR(H -> b       bb     )
     7.15900199E-02    2         -15        15   # BR(H -> tau+    tau-   )
     2.53147997E-04    2         -13        13   # BR(H -> mu+     mu-    )
     3.10320750E-04    2           3        -3   # BR(H -> s       sb     )
     1.73288721E-06    2           4        -4   # BR(H -> c       cb     )
     1.73129154E-01    2           6        -6   # BR(H -> t       tb     )
     5.74808189E-05    2          21        21   # BR(H -> g       g      )
     3.33257730E-07    2          22        22   # BR(H -> gam     gam    )
     1.02136795E-07    2          23        22   # BR(H -> Z       gam    )
     7.80261557E-05    2          24       -24   # BR(H -> W+      W-     )
     3.89636896E-05    2          23        23   # BR(H -> Z       Z      )
     2.94420578E-04    2          25        25   # BR(H -> h       h      )
    -4.38162726E-24    2          36        36   # BR(H -> A       A      )
     6.37411676E-19    2          23        36   # BR(H -> Z       A      )
     1.19041136E-03    2     1000024  -1000024   # BR(H -> ~chi_1+ ~chi_1-)
     1.28816697E-03    2     1000022   1000022   # BR(H -> ~chi_10 ~chi_10)
     6.58831769E-05    2     1000023   1000023   # BR(H -> ~chi_20 ~chi_20)
     2.34661873E-04    2     1000025   1000025   # BR(H -> ~chi_30 ~chi_30)
     2.00615494E-01    2     1000022   1000023   # BR(H -> ~chi_10 ~chi_20)
     1.34740987E-01    2     1000022   1000025   # BR(H -> ~chi_10 ~chi_30)
     2.16281601E-04    2     1000023   1000025   # BR(H -> ~chi_20 ~chi_30)
#
#         PDG            Width
DECAY        36     7.80871053E+00   # A decays
#          BR         NDA      ID1       ID2
     4.14952029E-01    2           5        -5   # BR(A -> b       bb     )
     7.14057704E-02    2         -15        15   # BR(A -> tau+    tau-   )
     2.52496123E-04    2         -13        13   # BR(A -> mu+     mu-    )
     3.09747634E-04    2           3        -3   # BR(A -> s       sb     )
     1.73554906E-06    2           4        -4   # BR(A -> c       cb     )
     1.73299427E-01    2           6        -6   # BR(A -> t       tb     )
     1.71554549E-04    2          21        21   # BR(A -> g       g      )
     5.27394912E-07    2          22        22   # BR(A -> gam     gam    )
     2.07658022E-07    2          23        22   # BR(A -> Z       gam    )
     7.75314562E-05    2          23        25   # BR(A -> Z       h      )
     2.91352610E-03    2     1000024  -1000024   # BR(A -> ~chi_1+ ~chi_1-)
     1.31676809E-03    2     1000022   1000022   # BR(A -> ~chi_10 ~chi_10)
     1.19271873E-04    2     1000023   1000023   # BR(A -> ~chi_20 ~chi_20)
     9.99703876E-04    2     1000025   1000025   # BR(A -> ~chi_30 ~chi_30)
     1.36125016E-01    2     1000022   1000023   # BR(A -> ~chi_10 ~chi_20)
     1.98028211E-01    2     1000022   1000025   # BR(A -> ~chi_10 ~chi_30)
     2.64758891E-05    2     1000023   1000025   # BR(A -> ~chi_20 ~chi_30)
#
#         PDG            Width
DECAY        37     7.75572498E+00   # H+ decays
#          BR         NDA      ID1       ID2
     6.66064045E-04    2           4        -5   # BR(H+ -> c       bb     )
     7.19143418E-02    2         -15        16   # BR(H+ -> tau+    nu_tau )
     2.54294469E-04    2         -13        14   # BR(H+ -> mu+     nu_mu  )
     4.26278781E-06    2           2        -5   # BR(H+ -> u       bb     )
     1.49214748E-05    2           2        -3   # BR(H+ -> u       sb     )
     3.08574256E-04    2           4        -3   # BR(H+ -> c       sb     )
     5.87127652E-01    2           6        -5   # BR(H+ -> t       bb     )
     7.81788486E-05    2          24        25   # BR(H+ -> W+      h      )
     8.23057547E-14    2          24        36   # BR(H+ -> W+      A      )
     3.39063956E-01    2     1000024   1000022   # BR(H+ -> ~chi_1+ ~chi_10)
     5.06378831E-04    2     1000024   1000023   # BR(H+ -> ~chi_1+ ~chi_20)
     6.13757741E-05    2     1000024   1000025   # BR(H+ -> ~chi_1+ ~chi_30)
