#
#                              ======================
#                              | THE SUSYHIT OUTPUT |
#                              ======================
#
#
#              ------------------------------------------------------
#              |     This is the output of the SUSY-HIT package     |
#              |  created by A.Djouadi, M.Muehlleitner and M.Spira. |
#              |  In case of problems with SUSY-HIT email to        |
#              |           margarete.muehlleitner@kit.edu           |
#              |           michael.spira@psi.ch                     |
#              |           abdelhak.djouadi@cern.ch                 |
#              ------------------------------------------------------
#
#              ------------------------------------------------------
#              |  SUSY Les Houches Accord - MSSM Spectrum + Decays  |
#              |              based on the decay programs           |
#              |                                                    |
#              |                     SDECAY 1.5                     |
#              |                                                    |
#              |  Authors: M.Muhlleitner, A.Djouadi and Y.Mambrini  |
#              |  Ref.:    Comput.Phys.Commun.168(2005)46           |
#              |           [hep-ph/0311167]                         |
#              |                                                    |
#              |                     HDECAY 3.4                     |
#              |                                                    |
#              |  By: A.Djouadi,J.Kalinowski,M.Muhlleitner,M.Spira  |
#              |  Ref.:    Comput.Phys.Commun.108(1998)56           |
#              |           [hep-ph/9704448]                         |
#              |                                                    |
#              |                                                    |
#              |  If not stated otherwise all DRbar couplings and   |
#              |  soft SUSY breaking masses are given at the scale  |
#              |  Q=  0.16419733E+04
#              |                                                    |
#              ------------------------------------------------------
#
#
BLOCK DCINFO  # Decay Program information
     1   SDECAY/HDECAY # decay calculator
     2   1.5  /3.4    # version number
#
BLOCK SPINFO  # Spectrum calculator information
     1    SOFTSUSY    # spectrum calculator                
     2    3.7.3       # version number                     
#
BLOCK MODSEL  # Model selection
     1     0   #  nonUniversal                                     
#
BLOCK SMINPUTS  # Standard Model inputs
         1     1.27934000E+02   # alpha_em^-1(M_Z)^MSbar
         2     1.16639000E-05   # G_F [GeV^-2]
         3     1.17200000E-01   # alpha_S(M_Z)^MSbar
         4     9.11870000E+01   # M_Z pole mass
         5     4.19000000E+00   # mb(mb)^MSbar
         6     1.72500000E+02   # mt pole mass
         7     1.77690000E+00   # mtau pole mass
#
BLOCK MINPAR  # Input parameters - minimal models
         3     2.00000000E+01   # tanb                
#
BLOCK EXTPAR  # Input parameters - non-minimal models
         0    -1.00000000E+00   # Set                 
         1     4.75990000E+02   # M_1(MX)             
         2     9.51990000E+02   # M_2(MX)             
         3     2.20000000E+03   # M_3(MX)             
        11     2.94338000E+03   # At(MX)              
        12     0.00000000E+00   # Ab(MX)              
        13     0.00000000E+00   # Atau(MX)            
        23    -3.00000000E+03   # mu(MX)              
        25     2.00000000E+01   # tan                 
        26     3.00000000E+03   # mA(pole)            
        31     3.00000000E+03   # meL(MX)             
        32     3.00000000E+03   # mmuL(MX)            
        33     3.00000000E+03   # mtauL(MX)           
        34     3.00000000E+03   # meR(MX)             
        35     3.00000000E+03   # mmuR(MX)            
        36     3.00000000E+03   # mtauR(MX)           
        41     3.00000000E+03   # mqL1(MX)            
        42     3.00000000E+03   # mqL2(MX)            
        43     8.99900000E+02   # mqL3(MX)            
        44     3.00000000E+03   # muR(MX)             
        45     3.00000000E+03   # mcR(MX)             
        46     3.00000000E+03   # mtR(MX)             
        47     3.00000000E+03   # mdR(MX)             
        48     3.00000000E+03   # msR(MX)             
        49     3.00000000E+03   # mbR(MX)             
#
BLOCK MASS  # Mass Spectrum
# PDG code           mass       particle
        24     8.04049127E+01   # W+
        25     1.24814381E+02   # h
        35     3.00004355E+03   # H
        36     2.99999995E+03   # A
        37     3.00108455E+03   # H+
         5     4.81337004E+00   # b-quark pole mass calculated from mb(mb)_Msbar
   1000001     3.04037810E+03   # ~d_L
   2000001     3.03520352E+03   # ~d_R
   1000002     3.03947478E+03   # ~u_L
   2000002     3.03667292E+03   # ~u_R
   1000003     3.04037810E+03   # ~s_L
   2000003     3.03520352E+03   # ~s_R
   1000004     3.03947478E+03   # ~c_L
   2000004     3.03667292E+03   # ~c_R
   1000005     1.00571954E+03   # ~b_1
   2000005     3.03308582E+03   # ~b_2
   1000006     1.00341587E+03   # ~t_1
   2000006     3.02436488E+03   # ~t_2
   1000011     3.00648770E+03   # ~e_L
   2000011     3.00166759E+03   # ~e_R
   1000012     3.00510494E+03   # ~nu_eL
   1000013     3.00648770E+03   # ~mu_L
   2000013     3.00166759E+03   # ~mu_R
   1000014     3.00510494E+03   # ~nu_muL
   1000015     2.98621978E+03   # ~tau_1
   2000015     3.02155524E+03   # ~tau_2
   1000016     3.00500311E+03   # ~nu_tauL
   1000021     2.35014115E+03   # ~g
   1000022     4.78990852E+02   # ~chi_10
   1000023     9.90421870E+02   # ~chi_20
   1000025    -2.99584708E+03   # ~chi_30
   1000035     2.99645859E+03   # ~chi_40
   1000024     9.90583036E+02   # ~chi_1+
   1000037     2.99715024E+03   # ~chi_2+
#
BLOCK NMIX  # Neutralino Mixing Matrix
  1  1     9.99886446E-01   # N_11
  1  2    -1.45171638E-04   # N_12
  1  3    -1.49794249E-02   # N_13
  1  4    -1.64053120E-03   # N_14
  2  1     5.80932579E-04   # N_21
  2  2     9.99571287E-01   # N_22
  2  3     2.82504551E-02   # N_23
  2  4     7.66924737E-03   # N_24
  3  1    -9.42752831E-03   # N_31
  3  2     1.45582486E-02   # N_32
  3  3    -7.06878142E-01   # N_33
  3  4     7.07122671E-01   # N_34
  4  1     1.17422236E-02   # N_41
  4  2    -2.54023498E-02   # N_42
  4  3     7.06612214E-01   # N_43
  4  4     7.07047396E-01   # N_44
#
BLOCK UMIX  # Chargino Mixing Matrix U
  1  1     9.99201674E-01   # U_11
  1  2     3.99501533E-02   # U_12
  2  1    -3.99501533E-02   # U_21
  2  2     9.99201674E-01   # U_22
#
BLOCK VMIX  # Chargino Mixing Matrix V
  1  1     9.99941202E-01   # V_11
  1  2    -1.08440328E-02   # V_12
  2  1    -1.08440328E-02   # V_21
  2  2    -9.99941202E-01   # V_22
#
BLOCK STOPMIX  # Stop Mixing Matrix
  1  1     9.98481981E-01   # cos(theta_t)
  1  2    -5.50793393E-02   # sin(theta_t)
  2  1     5.50793393E-02   # -sin(theta_t)
  2  2     9.98481981E-01   # cos(theta_t)
#
BLOCK SBOTMIX  # Sbottom Mixing Matrix
  1  1     9.99723631E-01   # cos(theta_b)
  1  2    -2.35087562E-02   # sin(theta_b)
  2  1     2.35087562E-02   # -sin(theta_b)
  2  2     9.99723631E-01   # cos(theta_b)
#
BLOCK STAUMIX  # Stau Mixing Matrix
  1  1    -7.06970378E-01   # cos(theta_tau)
  1  2     7.07243158E-01   # sin(theta_tau)
  2  1    -7.07243158E-01   # -sin(theta_tau)
  2  2    -7.06970378E-01   # cos(theta_tau)
#
BLOCK ALPHA  # Higgs mixing
          -5.00127189E-02   # Mixing angle in the neutral Higgs boson sector
#
BLOCK HMIX Q=  1.64197326E+03  # DRbar Higgs Parameters
         1    -3.00000000E+03   # mu(Q)MSSM           
         2     2.00000000E+01   # tan                 
         3     2.43929902E+02   # higgs               
         4     1.04057570E+07   # mA^2(Q)MSSM         
#
BLOCK GAUGE Q=  1.64197326E+03  # The gauge couplings
     1     3.62451490E-01   # gprime(Q) DRbar
     2     6.36328300E-01   # g(Q) DRbar
     3     1.02427427E+00   # g3(Q) DRbar
#
BLOCK AU Q=  1.64197326E+03  # The trilinear couplings
  1  1     2.58488351E-06   # A_u(Q) DRbar
  2  2     2.58491931E-06   # A_c(Q) DRbar
  3  3     2.94338000E+03   # A_t(Q) DRbar
#
BLOCK AD Q=  1.64197326E+03  # The trilinear couplings
  1  1     9.39672505E-07   # A_d(Q) DRbar
  2  2     9.39774682E-07   # A_s(Q) DRbar
  3  3     1.84849920E-06   # A_b(Q) DRbar
#
BLOCK AE Q=  1.64197326E+03  # The trilinear couplings
  1  1     3.72935479E-07   # A_e(Q) DRbar
  2  2     3.72953296E-07   # A_mu(Q) DRbar
  3  3     3.77892626E-07   # A_tau(Q) DRbar
#
BLOCK Yu Q=  1.64197326E+03  # The Yukawa couplings
  1  1     0.00000000E+00   # y_u(Q) DRbar
  2  2     0.00000000E+00   # y_c(Q) DRbar
  3  3     8.50545153E-01   # y_t(Q) DRbar
#
BLOCK Yd Q=  1.64197326E+03  # The Yukawa couplings
  1  1     0.00000000E+00   # y_d(Q) DRbar
  2  2     0.00000000E+00   # y_s(Q) DRbar
  3  3     3.72745515E-01   # y_b(Q) DRbar
#
BLOCK Ye Q=  1.64197326E+03  # The Yukawa couplings
  1  1     0.00000000E+00   # y_e(Q) DRbar
  2  2     0.00000000E+00   # y_mu(Q) DRbar
  3  3     2.00458272E-01   # y_tau(Q) DRbar
#
BLOCK MSOFT Q=  1.64197326E+03  # The soft SUSY breaking masses at the scale Q
         1     4.75990000E+02   # M_1(Q)              
         2     9.51990000E+02   # M_2(Q)              
         3     2.20000000E+03   # M_3(Q)              
        21    -4.19875634E+04   # M^2_Hd              
        22    -9.03214880E+06   # M^2_Hu              
        31     3.00000000E+03   # M_eL                
        32     3.00000000E+03   # M_muL               
        33     3.00000000E+03   # M_tauL              
        34     3.00000000E+03   # M_eR                
        35     3.00000000E+03   # M_muR               
        36     3.00000000E+03   # M_tauR              
        41     3.00000000E+03   # M_q1L               
        42     3.00000000E+03   # M_q2L               
        43     8.99899993E+02   # M_q3L               
        44     3.00000000E+03   # M_uR                
        45     3.00000000E+03   # M_cR                
        46     3.00000000E+03   # M_tR                
        47     3.00000000E+03   # M_dR                
        48     3.00000000E+03   # M_sR                
        49     3.00000000E+03   # M_bR                
#
#
#
#                             =================
#                             |The decay table|
#                             =================
#
# - The QCD corrections to the decays gluino -> squark  + quark
#                                     squark -> gaugino + quark_prime
#                                     squark -> squark_prime + Higgs
#                                     squark -> gluino  + quark
#   are included.
#
# - The multi-body decays for the inos, stops and sbottoms are included.
#
# - The loop induced decays for the gluino, neutralinos and stops
#   are included.
#
# - The SUSY decays of the top quark are included.
#
#
#         PDG            Width
DECAY         6     1.40531800E+00   # top decays
#          BR         NDA      ID1       ID2
     1.00000000E+00    2           5        24   # BR(t ->  b    W+)
#
#         PDG            Width
DECAY   1000021     6.38145486E+01   # gluino decays
#          BR         NDA      ID1       ID2
     2.47897895E-01    2     1000005        -5   # BR(~g -> ~b_1  bb)
     2.47897895E-01    2    -1000005         5   # BR(~g -> ~b_1* b )
     2.52102105E-01    2     1000006        -6   # BR(~g -> ~t_1  tb)
     2.52102105E-01    2    -1000006         6   # BR(~g -> ~t_1* t )
#
#         PDG            Width
DECAY   1000006     8.31805461E-02   # stop1 decays
#          BR         NDA      ID1       ID2
     9.31523001E-01    2     1000022         6   # BR(~t_1 -> ~chi_10 t )
     6.84769989E-02    2     1000024         5   # BR(~t_1 -> ~chi_1+ b )
#
#         PDG            Width
DECAY   2000006     1.12031495E+02   # stop2 decays
#          BR         NDA      ID1       ID2
     5.64852681E-02    2     1000022         6   # BR(~t_2 -> ~chi_10 t )
     3.72009333E-04    2     1000023         6   # BR(~t_2 -> ~chi_20 t )
     0.00000000E+00    2     1000025         6   # BR(~t_2 -> ~chi_30 t )
     7.48917104E-04    2     1000024         5   # BR(~t_2 -> ~chi_1+ b )
     1.34198601E-04    2     1000037         5   # BR(~t_2 -> ~chi_2+ b )
     3.02021953E-01    2     1000021         6   # BR(~t_2 -> ~g      t )
     1.67835727E-01    2     1000006        25   # BR(~t_2 -> ~t_1    h )
     1.59896852E-01    2     1000006        23   # BR(~t_2 -> ~t_1    Z )
     3.12505076E-01    2     1000005        24   # BR(~t_2 -> ~b_1    W+)
#
#         PDG            Width
DECAY   1000005     9.51451414E-02   # sbottom1 decays
#          BR         NDA      ID1       ID2
     9.56975593E-01    2     1000022         5   # BR(~b_1 -> ~chi_10 b )
     4.30244069E-02    2     1000023         5   # BR(~b_1 -> ~chi_20 b )
#
#         PDG            Width
DECAY   2000005     5.24042439E+01   # sbottom2 decays
#          BR         NDA      ID1       ID2
     3.04462214E-02    2     1000022         5   # BR(~b_2 -> ~chi_10 b )
     9.16089740E-08    2     1000023         5   # BR(~b_2 -> ~chi_20 b )
     5.10279402E-05    2     1000025         5   # BR(~b_2 -> ~chi_30 b )
     4.87325815E-05    2     1000035         5   # BR(~b_2 -> ~chi_40 b )
     9.55884066E-09    2    -1000024         6   # BR(~b_2 -> ~chi_1- t )
     6.62448425E-01    2     1000021         5   # BR(~b_2 -> ~g      b )
     6.84135589E-02    2     1000005        25   # BR(~b_2 -> ~b_1    h )
     9.73980294E-02    2     1000005        23   # BR(~b_2 -> ~b_1    Z )
     1.41193904E-01    2     1000006       -24   # BR(~b_2 -> ~t_1    W-)
#
#         PDG            Width
DECAY   1000002     6.36890707E+01   # sup_L decays
#          BR         NDA      ID1       ID2
     6.27791799E-03    2     1000022         2   # BR(~u_L -> ~chi_10 u)
     1.46950579E-01    2     1000023         2   # BR(~u_L -> ~chi_20 u)
     2.78127011E-08    2     1000025         2   # BR(~u_L -> ~chi_30 u)
     8.91336481E-08    2     1000035         2   # BR(~u_L -> ~chi_40 u)
     2.94031403E-01    2     1000024         1   # BR(~u_L -> ~chi_1+ d)
     3.78293563E-08    2     1000037         1   # BR(~u_L -> ~chi_2+ d)
     5.52739945E-01    2     1000021         2   # BR(~u_L -> ~g      u)
#
#         PDG            Width
DECAY   2000002     4.13787458E+01   # sup_R decays
#          BR         NDA      ID1       ID2
     1.54680783E-01    2     1000022         2   # BR(~u_R -> ~chi_10 u)
     4.39949405E-08    2     1000023         2   # BR(~u_R -> ~chi_20 u)
     1.18440604E-08    2     1000025         2   # BR(~u_R -> ~chi_30 u)
     1.78434883E-08    2     1000035         2   # BR(~u_R -> ~chi_40 u)
     8.45319144E-01    2     1000021         2   # BR(~u_R -> ~g      u)
#
#         PDG            Width
DECAY   1000001     6.37438072E+01   # sdown_L decays
#          BR         NDA      ID1       ID2
     6.29384945E-03    2     1000022         1   # BR(~d_L -> ~chi_10 d)
     1.46824811E-01    2     1000023         1   # BR(~d_L -> ~chi_20 d)
     4.73908693E-08    2     1000025         1   # BR(~d_L -> ~chi_30 d)
     1.31801259E-07    2     1000035         1   # BR(~d_L -> ~chi_40 d)
     2.93474895E-01    2    -1000024         2   # BR(~d_L -> ~chi_1- u)
     5.34305584E-07    2    -1000037         2   # BR(~d_L -> ~chi_2- u)
     5.53405731E-01    2     1000021         1   # BR(~d_L -> ~g      d)
#
#         PDG            Width
DECAY   2000001     3.64595113E+01   # sdown_R decays
#          BR         NDA      ID1       ID2
     4.38637727E-02    2     1000022         1   # BR(~d_R -> ~chi_10 d)
     1.24736832E-08    2     1000023         1   # BR(~d_R -> ~chi_20 d)
     3.13108949E-09    2     1000025         1   # BR(~d_R -> ~chi_30 d)
     4.71186258E-09    2     1000035         1   # BR(~d_R -> ~chi_40 d)
     9.56136207E-01    2     1000021         1   # BR(~d_R -> ~g      d)
#
#         PDG            Width
DECAY   1000004     6.36890707E+01   # scharm_L decays
#          BR         NDA      ID1       ID2
     6.27791799E-03    2     1000022         4   # BR(~c_L -> ~chi_10 c)
     1.46950579E-01    2     1000023         4   # BR(~c_L -> ~chi_20 c)
     2.78127011E-08    2     1000025         4   # BR(~c_L -> ~chi_30 c)
     8.91336481E-08    2     1000035         4   # BR(~c_L -> ~chi_40 c)
     2.94031403E-01    2     1000024         3   # BR(~c_L -> ~chi_1+ s)
     3.78293563E-08    2     1000037         3   # BR(~c_L -> ~chi_2+ s)
     5.52739945E-01    2     1000021         4   # BR(~c_L -> ~g      c)
#
#         PDG            Width
DECAY   2000004     4.13787458E+01   # scharm_R decays
#          BR         NDA      ID1       ID2
     1.54680783E-01    2     1000022         4   # BR(~c_R -> ~chi_10 c)
     4.39949405E-08    2     1000023         4   # BR(~c_R -> ~chi_20 c)
     1.18440604E-08    2     1000025         4   # BR(~c_R -> ~chi_30 c)
     1.78434883E-08    2     1000035         4   # BR(~c_R -> ~chi_40 c)
     8.45319144E-01    2     1000021         4   # BR(~c_R -> ~g      c)
#
#         PDG            Width
DECAY   1000003     6.37438072E+01   # sstrange_L decays
#          BR         NDA      ID1       ID2
     6.29384945E-03    2     1000022         3   # BR(~s_L -> ~chi_10 s)
     1.46824811E-01    2     1000023         3   # BR(~s_L -> ~chi_20 s)
     4.73908693E-08    2     1000025         3   # BR(~s_L -> ~chi_30 s)
     1.31801259E-07    2     1000035         3   # BR(~s_L -> ~chi_40 s)
     2.93474895E-01    2    -1000024         4   # BR(~s_L -> ~chi_1- c)
     5.34305584E-07    2    -1000037         4   # BR(~s_L -> ~chi_2- c)
     5.53405731E-01    2     1000021         3   # BR(~s_L -> ~g      s)
#
#         PDG            Width
DECAY   2000003     3.64595113E+01   # sstrange_R decays
#          BR         NDA      ID1       ID2
     4.38637727E-02    2     1000022         3   # BR(~s_R -> ~chi_10 s)
     1.24736832E-08    2     1000023         3   # BR(~s_R -> ~chi_20 s)
     3.13108949E-09    2     1000025         3   # BR(~s_R -> ~chi_30 s)
     4.71186258E-09    2     1000035         3   # BR(~s_R -> ~chi_40 s)
     9.56136207E-01    2     1000021         3   # BR(~s_R -> ~g      s)
#
#         PDG            Width
DECAY   1000011     3.25661294E+01   # selectron_L decays
#          BR         NDA      ID1       ID2
     1.14509495E-01    2     1000022        11   # BR(~e_L -> ~chi_10 e-)
     2.95454960E-01    2     1000023        11   # BR(~e_L -> ~chi_20 e-)
     1.56735388E-09    2     1000025        11   # BR(~e_L -> ~chi_30 e-)
     5.77703674E-09    2     1000035        11   # BR(~e_L -> ~chi_40 e-)
     5.90035492E-01    2    -1000024        12   # BR(~e_L -> ~chi_1- nu_e)
     4.56532373E-08    2    -1000037        12   # BR(~e_L -> ~chi_2- nu_e)
#
#         PDG            Width
DECAY   2000011     1.48977142E+01   # selectron_R decays
#          BR         NDA      ID1       ID2
     9.99999715E-01    2     1000022        11   # BR(~e_R -> ~chi_10 e-)
     2.82250522E-07    2     1000023        11   # BR(~e_R -> ~chi_20 e-)
     1.40511833E-09    2     1000025        11   # BR(~e_R -> ~chi_30 e-)
     1.74619643E-09    2     1000035        11   # BR(~e_R -> ~chi_40 e-)
#
#         PDG            Width
DECAY   1000013     3.25661294E+01   # smuon_L decays
#          BR         NDA      ID1       ID2
     1.14509495E-01    2     1000022        13   # BR(~mu_L -> ~chi_10 mu-)
     2.95454960E-01    2     1000023        13   # BR(~mu_L -> ~chi_20 mu-)
     1.56735388E-09    2     1000025        13   # BR(~mu_L -> ~chi_30 mu-)
     5.77703674E-09    2     1000035        13   # BR(~mu_L -> ~chi_40 mu-)
     5.90035492E-01    2    -1000024        14   # BR(~mu_L -> ~chi_1- nu_mu)
     4.56532373E-08    2    -1000037        14   # BR(~mu_L -> ~chi_2- nu_mu)
#
#         PDG            Width
DECAY   2000013     1.48977142E+01   # smuon_R decays
#          BR         NDA      ID1       ID2
     9.99999715E-01    2     1000022        13   # BR(~mu_R -> ~chi_10 mu-)
     2.82250522E-07    2     1000023        13   # BR(~mu_R -> ~chi_20 mu-)
     1.40511833E-09    2     1000025        13   # BR(~mu_R -> ~chi_30 mu-)
     1.74619643E-09    2     1000035        13   # BR(~mu_R -> ~chi_40 mu-)
#
#         PDG            Width
DECAY   1000015     2.39325959E+01   # stau_1 decays
#          BR         NDA      ID1       ID2
     3.88666241E-01    2     1000022        15   # BR(~tau_1 -> ~chi_10  tau-)
     2.03997266E-01    2     1000023        15   # BR(~tau_1 -> ~chi_20  tau-)
     4.07336493E-01    2    -1000024        16   # BR(~tau_1 -> ~chi_1-  nu_tau)
#
#         PDG            Width
DECAY   2000015     2.35040267E+01   # stau_2 decays
#          BR         NDA      ID1       ID2
     3.97125133E-01    2     1000022        15   # BR(~tau_2 -> ~chi_10  tau-)
     2.01168398E-01    2     1000023        15   # BR(~tau_2 -> ~chi_20  tau-)
     1.67305138E-05    2     1000025        15   # BR(~tau_2 -> ~chi_30  tau-)
     1.43814316E-05    2     1000035        15   # BR(~tau_2 -> ~chi_40  tau-)
     4.01658497E-01    2    -1000024        16   # BR(~tau_2 -> ~chi_1-  nu_tau)
     1.68592789E-05    2    -1000037        16   # BR(~tau_2 -> ~chi_2-  nu_tau)
#
#         PDG            Width
DECAY   1000012     3.25640233E+01   # snu_eL decays
#          BR         NDA      ID1       ID2
     1.14575503E-01    2     1000022        12   # BR(~nu_eL -> ~chi_10 nu_e)
     2.94881259E-01    2     1000023        12   # BR(~nu_eL -> ~chi_20 nu_e)
     5.58651841E-09    2     1000025        12   # BR(~nu_eL -> ~chi_30 nu_e)
     1.26385851E-08    2     1000035        12   # BR(~nu_eL -> ~chi_40 nu_e)
     5.90543217E-01    2     1000024        11   # BR(~nu_eL -> ~chi_1+ e-)
     2.44362074E-09    2     1000037        11   # BR(~nu_eL -> ~chi_2+ e-)
#
#         PDG            Width
DECAY   1000014     3.25640233E+01   # snu_muL decays
#          BR         NDA      ID1       ID2
     1.14575503E-01    2     1000022        14   # BR(~nu_muL -> ~chi_10 nu_mu)
     2.94881259E-01    2     1000023        14   # BR(~nu_muL -> ~chi_20 nu_mu)
     5.58651841E-09    2     1000025        14   # BR(~nu_muL -> ~chi_30 nu_mu)
     1.26385851E-08    2     1000035        14   # BR(~nu_muL -> ~chi_40 nu_mu)
     5.90543217E-01    2     1000024        13   # BR(~nu_muL -> ~chi_1+ mu-)
     2.44362074E-09    2     1000037        13   # BR(~nu_muL -> ~chi_2+ mu-)
#
#         PDG            Width
DECAY   1000016     3.25657338E+01   # snu_tauL decays
#          BR         NDA      ID1       ID2
     1.14565198E-01    2     1000022        16   # BR(~nu_tauL -> ~chi_10 nu_tau)
     2.94850909E-01    2     1000023        16   # BR(~nu_tauL -> ~chi_20 nu_tau)
     5.46438172E-09    2     1000025        16   # BR(~nu_tauL -> ~chi_30 nu_tau)
     1.23428308E-08    2     1000035        16   # BR(~nu_tauL -> ~chi_40 nu_tau)
     5.90581949E-01    2     1000024        15   # BR(~nu_tauL -> ~chi_1+ tau-)
     1.92630753E-06    2     1000037        15   # BR(~nu_tauL -> ~chi_2+ tau-)
#
#         PDG            Width
DECAY   1000024     9.31123897E-05   # chargino1+ decays
#          BR         NDA      ID1       ID2
     1.00000000E+00    2     1000022        24   # BR(~chi_1+ -> ~chi_10  W+)
#
#         PDG            Width
DECAY   1000037     8.49534288E+01   # chargino2+ decays
#          BR         NDA      ID1       ID2
     1.30000220E-01    2     1000006        -5   # BR(~chi_2+ -> ~t_1     bb)
     6.62589768E-01    2    -1000005         6   # BR(~chi_2+ -> ~b_1*    t )
     2.84585677E-07    2    -1000015        16   # BR(~chi_2+ -> ~tau_1+  nu_tau)
     6.13980902E-02    2     1000024        23   # BR(~chi_2+ -> ~chi_1+  Z )
     2.06838654E-02    2     1000022        24   # BR(~chi_2+ -> ~chi_10  W+)
     5.97161098E-02    2     1000023        24   # BR(~chi_2+ -> ~chi_20  W+)
     6.56116618E-02    2     1000024        25   # BR(~chi_2+ -> ~chi_1+  h )
#
#         PDG            Width
DECAY   1000022     0.00000000E+00   # neutralino1 decays
#
#         PDG            Width
DECAY   1000023     8.84157413E-05   # neutralino2 decays
#          BR         NDA      ID1       ID2
     2.78015220E-01    2     1000022        23   # BR(~chi_20 -> ~chi_10   Z )
     7.21984780E-01    2     1000022        25   # BR(~chi_20 -> ~chi_10   h )
#
#         PDG            Width
DECAY   1000025     8.50769973E+01   # neutralino3 decays
#          BR         NDA      ID1       ID2
     1.29353613E-02    2     1000022        23   # BR(~chi_30 -> ~chi_10   Z )
     4.60849331E-02    2     1000023        23   # BR(~chi_30 -> ~chi_20   Z )
     5.95701533E-02    2     1000024       -24   # BR(~chi_30 -> ~chi_1+   W-)
     5.95701533E-02    2    -1000024        24   # BR(~chi_30 -> ~chi_1-   W+)
     8.66753315E-03    2     1000022        25   # BR(~chi_30 -> ~chi_10   h )
     1.54491370E-02    2     1000023        25   # BR(~chi_30 -> ~chi_20   h )
     3.35173508E-01    2     1000006        -6   # BR(~chi_30 -> ~t_1      tb)
     3.35173508E-01    2    -1000006         6   # BR(~chi_30 -> ~t_1*     t )
     6.36875399E-02    2     1000005        -5   # BR(~chi_30 -> ~b_1      bb)
     6.36875399E-02    2    -1000005         5   # BR(~chi_30 -> ~b_1*     b )
     3.16239688E-07    2     1000015       -15   # BR(~chi_30 -> ~tau_1-   tau+)
     3.16239688E-07    2    -1000015        15   # BR(~chi_30 -> ~tau_1+   tau-)
#
#         PDG            Width
DECAY   1000035     8.42304784E+01   # neutralino4 decays
#          BR         NDA      ID1       ID2
     8.42889907E-03    2     1000022        23   # BR(~chi_40 -> ~chi_10   Z )
     1.53436119E-02    2     1000023        23   # BR(~chi_40 -> ~chi_20   Z )
     6.02118967E-02    2     1000024       -24   # BR(~chi_40 -> ~chi_1+   W-)
     6.02118967E-02    2    -1000024        24   # BR(~chi_40 -> ~chi_1-   W+)
     1.36707152E-02    2     1000022        25   # BR(~chi_40 -> ~chi_10   h )
     5.05605793E-02    2     1000023        25   # BR(~chi_40 -> ~chi_20   h )
     3.31445917E-01    2     1000006        -6   # BR(~chi_40 -> ~t_1      tb)
     3.31445917E-01    2    -1000006         6   # BR(~chi_40 -> ~t_1*     t )
     6.43400416E-02    2     1000005        -5   # BR(~chi_40 -> ~b_1      bb)
     6.43400416E-02    2    -1000005         5   # BR(~chi_40 -> ~b_1*     b )
     2.42194694E-07    2     1000015       -15   # BR(~chi_40 -> ~tau_1-   tau+)
     2.42194694E-07    2    -1000015        15   # BR(~chi_40 -> ~tau_1+   tau-)
#
#         PDG            Width
DECAY        25     3.57602668E-03   # h decays
#          BR         NDA      ID1       ID2
     5.64459948E-01    2           5        -5   # BR(h -> b       bb     )
     7.23975084E-02    2         -15        15   # BR(h -> tau+    tau-   )
     2.56290248E-04    2         -13        13   # BR(h -> mu+     mu-    )
     5.44137054E-04    2           3        -3   # BR(h -> s       sb     )
     2.36457501E-02    2           4        -4   # BR(h -> c       cb     )
     7.65544561E-02    2          21        21   # BR(h -> g       g      )
     2.61500820E-03    2          22        22   # BR(h -> gam     gam    )
     1.71882790E-03    2          22        23   # BR(h -> Z       gam    )
     2.29213025E-01    2          24       -24   # BR(h -> W+      W-     )
     2.85950485E-02    2          23        23   # BR(h -> Z       Z      )
#
#         PDG            Width
DECAY        35     3.48047481E+01   # H decays
#          BR         NDA      ID1       ID2
     8.95772290E-01    2           5        -5   # BR(H -> b       bb     )
     7.14480995E-02    2         -15        15   # BR(H -> tau+    tau-   )
     2.52623406E-04    2         -13        13   # BR(H -> mu+     mu-    )
     3.10222876E-04    2           3        -3   # BR(H -> s       sb     )
     8.69479814E-08    2           4        -4   # BR(H -> c       cb     )
     8.67361549E-03    2           6        -6   # BR(H -> t       tb     )
     1.24231309E-05    2          21        21   # BR(H -> g       g      )
     8.62351322E-08    2          22        22   # BR(H -> gam     gam    )
     3.55755333E-09    2          23        22   # BR(H -> Z       gam    )
     7.48051870E-07    2          24       -24   # BR(H -> W+      W-     )
     3.73564907E-07    2          23        23   # BR(H -> Z       Z      )
     6.01187372E-06    2          25        25   # BR(H -> h       h      )
     2.16946417E-24    2          36        36   # BR(H -> A       A      )
     5.83390808E-20    2          23        36   # BR(H -> Z       A      )
     5.06544916E-04    2     1000024  -1000024   # BR(H -> ~chi_1+ ~chi_1-)
     4.03241551E-05    2     1000022   1000022   # BR(H -> ~chi_10 ~chi_10)
     2.53054735E-04    2     1000023   1000023   # BR(H -> ~chi_20 ~chi_20)
     2.19736732E-04    2     1000022   1000023   # BR(H -> ~chi_10 ~chi_20)
     2.24987411E-02    2     1000006  -1000006   # BR(H -> ~t_1    ~t_1*  )
     5.01347820E-06    2     1000005  -1000005   # BR(H -> ~b_1    ~b_1*  )
#
#         PDG            Width
DECAY        36     3.40446188E+01   # A decays
#          BR         NDA      ID1       ID2
     9.15805030E-01    2           5        -5   # BR(A -> b       bb     )
     7.30427908E-02    2         -15        15   # BR(A -> tau+    tau-   )
     2.58261493E-04    2         -13        13   # BR(A -> mu+     mu-    )
     3.17198741E-04    2           3        -3   # BR(A -> s       sb     )
     8.95089887E-08    2           4        -4   # BR(A -> c       cb     )
     8.92418180E-03    2           6        -6   # BR(A -> t       tb     )
     2.62808613E-05    2          21        21   # BR(A -> g       g      )
     6.26483972E-08    2          22        22   # BR(A -> gam     gam    )
     2.59059681E-08    2          23        22   # BR(A -> Z       gam    )
     7.61915447E-07    2          23        25   # BR(A -> Z       h      )
     8.69809046E-04    2     1000024  -1000024   # BR(A -> ~chi_1+ ~chi_1-)
     4.49097202E-05    2     1000022   1000022   # BR(A -> ~chi_10 ~chi_10)
     4.34400913E-04    2     1000023   1000023   # BR(A -> ~chi_20 ~chi_20)
     2.76196254E-04    2     1000022   1000023   # BR(A -> ~chi_10 ~chi_20)
#
#         PDG            Width
DECAY        37     3.75345551E+01   # H+ decays
#          BR         NDA      ID1       ID2
     1.46220424E-03    2           4        -5   # BR(H+ -> c       bb     )
     6.62752761E-02    2         -15        16   # BR(H+ -> tau+    nu_tau )
     2.34333211E-04    2         -13        14   # BR(H+ -> mu+     nu_mu  )
     9.35809559E-06    2           2        -5   # BR(H+ -> u       bb     )
     1.37711675E-05    2           2        -3   # BR(H+ -> u       sb     )
     2.83317198E-04    2           4        -3   # BR(H+ -> c       sb     )
     9.20493861E-01    2           6        -5   # BR(H+ -> t       bb     )
     6.92255955E-07    2          24        25   # BR(H+ -> W+      h      )
     5.26122581E-14    2          24        36   # BR(H+ -> W+      A      )
     4.54199040E-04    2     1000024   1000022   # BR(H+ -> ~chi_1+ ~chi_10)
     1.26219239E-10    2     1000024   1000023   # BR(H+ -> ~chi_1+ ~chi_20)
     1.07729874E-02    2     1000006  -1000005   # BR(H+ -> ~t_1    ~b_1*  )
