#
#                              ======================
#                              | THE SUSYHIT OUTPUT |
#                              ======================
#
#
#              ------------------------------------------------------
#              |     This is the output of the SUSY-HIT package     |
#              |  created by A.Djouadi, M.Muehlleitner and M.Spira. |
#              |  In case of problems with SUSY-HIT email to        |
#              |           margarete.muehlleitner@kit.edu           |
#              |           michael.spira@psi.ch                     |
#              |           abdelhak.djouadi@cern.ch                 |
#              ------------------------------------------------------
#
#              ------------------------------------------------------
#              |  SUSY Les Houches Accord - MSSM Spectrum + Decays  |
#              |              based on the decay programs           |
#              |                                                    |
#              |                     SDECAY 1.5                     |
#              |                                                    |
#              |  Authors: M.Muhlleitner, A.Djouadi and Y.Mambrini  |
#              |  Ref.:    Comput.Phys.Commun.168(2005)46           |
#              |           [hep-ph/0311167]                         |
#              |                                                    |
#              |                     HDECAY 3.4                     |
#              |                                                    |
#              |  By: A.Djouadi,J.Kalinowski,M.Muhlleitner,M.Spira  |
#              |  Ref.:    Comput.Phys.Commun.108(1998)56           |
#              |           [hep-ph/9704448]                         |
#              |                                                    |
#              |                                                    |
#              |  If not stated otherwise all DRbar couplings and   |
#              |  soft SUSY breaking masses are given at the scale  |
#              |  Q=  0.91187600E+02
#              |                                                    |
#              ------------------------------------------------------
#
#
BLOCK DCINFO  # Decay Program information
     1   SDECAY/HDECAY # decay calculator
     2   1.5  /3.4    # version number
#
BLOCK SPINFO  # Spectrum calculator information
     1   SuSpect     # RGE +Spectrum calculator            
     2   2.43         # version number                     
#
BLOCK MODSEL  # Model selection
     1     2   # GMSB                                              
#
BLOCK SMINPUTS  # Standard Model inputs
         1     1.27932904E+02   # alpha_em^-1(M_Z)^MSbar
         2     1.16639000E-05   # G_F [GeV^-2]
         3     1.17200000E-01   # alpha_S(M_Z)^MSbar
         4     9.11870000E+01   # M_Z pole mass
         5     4.25000000E+00   # mb(mb)^MSbar
         6     1.72900000E+02   # mt pole mass
         7     1.77700000E+00   # mtau pole mass
#
BLOCK MINPAR  # Input parameters - minimal models
#
BLOCK EXTPAR  # Input parameters - non-minimal models
         0     9.11876000E+01   # EWSB                
         1     6.57000000E+02   # M_1                 
         2     3.00000000E+03   # M_2                 
         3     1.80000000E+03   # M_3                 
        11     0.00000000E+00   # A_t                 
        12     0.00000000E+00   # A_b                 
        13     0.00000000E+00   # A_tau               
        14     0.00000000E+00   # A_u                 
        15     0.00000000E+00   # A_d                 
        16     0.00000000E+00   # A_e                 
        23     6.50000000E+02   # mu(EWSB)            
        25     1.50000000E+00   # tanbeta(in)         
        26     2.00000000E+03   # MA_pole             
        31     5.00000000E+03   # M_eL                
        32     5.00000000E+03   # M_muL               
        33     5.00000000E+03   # M_tauL              
        34     5.00000000E+03   # M_eR                
        35     5.00000000E+03   # M_muR               
        36     5.00000000E+03   # M_tauR              
        41     5.00000000E+03   # M_q1L               
        42     5.00000000E+03   # M_q2L               
        43     5.00000000E+03   # M_q3L               
        44     5.00000000E+03   # M_uR                
        45     5.00000000E+03   # M_cR                
        46     5.00000000E+03   # M_tR                
        47     5.00000000E+03   # M_dR                
        48     5.00000000E+03   # M_sR                
        49     5.00000000E+03   # M_bR                
#
BLOCK MASS  # Mass Spectrum
# PDG code           mass       particle
        24     8.05394397E+01   # W+
        25     1.26000000E+02   # h
        35     2.00421624E+03   # H
        36     2.00000000E+03   # A
        37     2.00177599E+03   # H+
         5     4.87877839E+00   # b-quark pole mass calculated from mb(mb)_Msbar
   1000001     4.96252861E+03   # ~d_L
   2000001     4.96241862E+03   # ~d_R
   1000002     4.96228275E+03   # ~u_L
   2000002     4.96234096E+03   # ~u_R
   1000003     4.96252861E+03   # ~s_L
   2000003     4.96241862E+03   # ~s_R
   1000004     4.96228275E+03   # ~c_L
   2000004     4.96234096E+03   # ~c_R
   1000005     4.96220096E+03   # ~b_1
   2000005     4.96274773E+03   # ~b_2
   1000006     5.09102916E+03   # ~t_1
   2000006     5.39063925E+03   # ~t_2
   1000011     5.00008233E+03   # ~e_L
   2000011     5.00007603E+03   # ~e_R
   1000012     4.99984164E+03   # ~nu_eL
   1000013     5.00008233E+03   # ~mu_L
   2000013     5.00007603E+03   # ~mu_R
   1000014     4.99984164E+03   # ~nu_muL
   1000015     4.99990613E+03   # ~tau_1
   2000015     5.00025285E+03   # ~tau_2
   1000016     4.99984164E+03   # ~nu_tauL
   1000021     1.88524702E+03   # ~g
   1000022     6.51777979E+02   # ~chi_10
   1000023    -6.96964379E+02   # ~chi_20
   1000025     7.38940843E+02   # ~chi_30
   1000035     3.12900888E+03   # ~chi_40
   1000024     6.94435544E+02   # ~chi_1+
   1000037     3.12900815E+03   # ~chi_2+
   1000039     1.00000000E-09   # ~gravitino
#
BLOCK NMIX  # Neutralino Mixing Matrix
  1  1     6.99042546E-01   # N_11
  1  2    -2.23728991E-02   # N_12
  1  3     5.08756915E-01   # N_13
  1  4    -5.02001368E-01   # N_14
  2  1     6.27124018E-03   # N_21
  2  2    -4.06604827E-03   # N_22
  2  3    -7.06788256E-01   # N_23
  2  4    -7.07385680E-01   # N_24
  3  1     7.15052339E-01   # N_31
  3  2     2.27267061E-02   # N_32
  3  3    -4.91151121E-01   # N_33
  3  4     4.96944893E-01   # N_34
  4  1     5.85979722E-04   # N_41
  4  2    -9.99483075E-01   # N_42
  4  3    -1.96809527E-02   # N_43
  4  4     2.54145483E-02   # N_44
#
BLOCK UMIX  # Chargino Mixing Matrix U
  1  1    -2.78221264E-02   # U_11
  1  2     9.99612890E-01   # U_12
  2  1     9.99612890E-01   # U_21
  2  2     2.78221264E-02   # U_22
#
BLOCK VMIX  # Chargino Mixing Matrix V
  1  1    -3.59332344E-02   # V_11
  1  2     9.99354193E-01   # V_12
  2  1     9.99354193E-01   # V_21
  2  2     3.59332344E-02   # V_22
#
BLOCK STOPMIX  # Stop Mixing Matrix
  1  1     9.99929261E-01   # cos(theta_t)
  1  2    -1.18942421E-02   # sin(theta_t)
  2  1     1.18942421E-02   # -sin(theta_t)
  2  2     9.99929261E-01   # cos(theta_t)
#
BLOCK SBOTMIX  # Sbottom Mixing Matrix
  1  1     6.31998457E-01   # cos(theta_b)
  1  2     7.74969645E-01   # sin(theta_b)
  2  1    -7.74969645E-01   # -sin(theta_b)
  2  2     6.31998457E-01   # cos(theta_b)
#
BLOCK STAUMIX  # Stau Mixing Matrix
  1  1     7.00650571E-01   # cos(theta_tau)
  1  2     7.13504574E-01   # sin(theta_tau)
  2  1    -7.13504574E-01   # -sin(theta_tau)
  2  2     7.00650571E-01   # cos(theta_tau)
#
BLOCK ALPHA  # Higgs mixing
          -5.90208993E-01   # Mixing angle in the neutral Higgs boson sector
#
BLOCK HMIX Q=  9.11876000E+01  # DRbar Higgs Parameters
         1     6.50000000E+02   # mu(Q)               
         2     1.49999979E+00   # tanbeta(Q)          
         3     2.51970319E+02   # vev(Q)              
         4     3.67457088E+06   # MA^2(Q)             
#
BLOCK GAUGE Q=  9.11876000E+01  # The gauge couplings
     1     3.52896807E-01   # gprime(Q) DRbar
     2     6.27898600E-01   # g(Q) DRbar
     3     1.08213366E+00   # g3(Q) DRbar
#
BLOCK AU Q=  9.11876000E+01  # The trilinear couplings
  1  1     0.00000000E+00   # A_u(Q) DRbar
  2  2     0.00000000E+00   # A_c(Q) DRbar
  3  3     0.00000000E+00   # A_t(Q) DRbar
#
BLOCK AD Q=  9.11876000E+01  # The trilinear couplings
  1  1     0.00000000E+00   # A_d(Q) DRbar
  2  2     0.00000000E+00   # A_s(Q) DRbar
  3  3     0.00000000E+00   # A_b(Q) DRbar
#
BLOCK AE Q=  9.11876000E+01  # The trilinear couplings
  1  1     0.00000000E+00   # A_e(Q) DRbar
  2  2     0.00000000E+00   # A_mu(Q) DRbar
  3  3     0.00000000E+00   # A_tau(Q) DRbar
#
BLOCK Yu Q=  9.11876000E+01  # The Yukawa couplings
  1  1     0.00000000E+00   # y_u(Q) DRbar
  2  2     0.00000000E+00   # y_c(Q) DRbar
  3  3     1.02631602E+00   # y_t(Q) DRbar
#
BLOCK Yd Q=  9.11876000E+01  # The Yukawa couplings
  1  1     0.00000000E+00   # y_d(Q) DRbar
  2  2     0.00000000E+00   # y_s(Q) DRbar
  3  3     2.72061009E-02   # y_b(Q) DRbar
#
BLOCK Ye Q=  9.11876000E+01  # The Yukawa couplings
  1  1     0.00000000E+00   # y_e(Q) DRbar
  2  2     0.00000000E+00   # y_mu(Q) DRbar
  3  3     1.79879877E-02   # y_tau(Q) DRbar
#
BLOCK MSOFT Q=  9.11876000E+01  # The soft SUSY breaking masses at the scale Q
         1     6.57000000E+02   # M_1                 
         2     3.00000000E+03   # M_2                 
         3     1.80000000E+03   # M_3                 
        14     0.00000000E+00   # A_u                 
        15     0.00000000E+00   # A_d                 
        16     0.00000000E+00   # A_e                 
        21     2.58281358E+06   # M^2_Hd              
        22    -5.82883328E+06   # M^2_Hu              
        31     5.00000000E+03   # M_eL                
        32     5.00000000E+03   # M_muL               
        33     5.00000000E+03   # M_tauL              
        34     5.00000000E+03   # M_eR                
        35     5.00000000E+03   # M_muR               
        36     5.00000000E+03   # M_tauR              
        41     5.00000000E+03   # M_q1L               
        42     5.00000000E+03   # M_q2L               
        43     5.00000000E+03   # M_q3L               
        44     5.00000000E+03   # M_uR                
        45     5.00000000E+03   # M_cR                
        46     5.00000000E+03   # M_tR                
        47     5.00000000E+03   # M_dR                
        48     5.00000000E+03   # M_sR                
        49     5.00000000E+03   # M_bR                
#
#
#
#                             =================
#                             |The decay table|
#                             =================
#
# - The QCD corrections to the decays gluino -> squark  + quark
#                                     squark -> gaugino + quark_prime
#                                     squark -> squark_prime + Higgs
#                                     squark -> gluino  + quark
#   are included.
#
# - The multi-body decays for the inos, stops and sbottoms are included.
#
# - The loop induced decays for the gluino, neutralinos and stops
#   are included.
#
# - The SUSY decays of the top quark are included.
#
# - Possible decays of the NLSP in GMSB models are included.
#
#
#         PDG            Width
DECAY         6     1.37371870E+00   # top decays
#          BR         NDA      ID1       ID2
     1.00000000E+00    2           5        24   # BR(t ->  b    W+)
#
#         PDG            Width
DECAY   1000021     1.09162204E-03   # gluino decays
#          BR         NDA      ID1       ID2
     7.55301499E-03    2     1000022        21   # BR(~g -> ~chi_10 g)
     1.39375705E-02    2     1000023        21   # BR(~g -> ~chi_20 g)
     6.28608759E-03    2     1000025        21   # BR(~g -> ~chi_30 g)
#          BR         NDA      ID1       ID2
0.0E+00    2     1000039    21 # BR(~g -> ~G      g)
#           BR         NDA      ID1       ID2       ID3
     5.46233690E-03    3     1000022         1        -1   # BR(~g -> ~chi_10 d  db)
     7.55329275E-07    3     1000023         1        -1   # BR(~g -> ~chi_20 d  db)
     3.99854288E-03    3     1000025         1        -1   # BR(~g -> ~chi_30 d  db)
     1.69733308E-02    3     1000022         2        -2   # BR(~g -> ~chi_10 u  ub)
     6.97182918E-07    3     1000023         2        -2   # BR(~g -> ~chi_20 u  ub)
     1.48103973E-02    3     1000025         2        -2   # BR(~g -> ~chi_30 u  ub)
     5.46233690E-03    3     1000022         3        -3   # BR(~g -> ~chi_10 s  sb)
     7.55329275E-07    3     1000023         3        -3   # BR(~g -> ~chi_20 s  sb)
     3.99854288E-03    3     1000025         3        -3   # BR(~g -> ~chi_30 s  sb)
     1.69733308E-02    3     1000022         4        -4   # BR(~g -> ~chi_10 c  cb)
     6.97182918E-07    3     1000023         4        -4   # BR(~g -> ~chi_20 c  cb)
     1.48103973E-02    3     1000025         4        -4   # BR(~g -> ~chi_30 c  cb)
     5.56017957E-03    3     1000022         5        -5   # BR(~g -> ~chi_10 b  bb)
     2.14807684E-04    3     1000023         5        -5   # BR(~g -> ~chi_20 b  bb)
     4.10889932E-03    3     1000025         5        -5   # BR(~g -> ~chi_30 b  bb)
     1.06590856E-01    3     1000022         6        -6   # BR(~g -> ~chi_10 t  tb)
     1.81208553E-01    3     1000023         6        -6   # BR(~g -> ~chi_20 t  tb)
     1.08537466E-01    3     1000025         6        -6   # BR(~g -> ~chi_30 t  tb)
     1.09393155E-04    3     1000024         1        -2   # BR(~g -> ~chi_1+ d  ub)
     1.09393155E-04    3    -1000024         2        -1   # BR(~g -> ~chi_1- u  db)
     1.09393155E-04    3     1000024         3        -4   # BR(~g -> ~chi_1+ s  cb)
     1.09393155E-04    3    -1000024         4        -3   # BR(~g -> ~chi_1- c  sb)
     2.28978293E-01    3     1000024         5        -6   # BR(~g -> ~chi_1+ b  tb)
     2.28978293E-01    3    -1000024         6        -5   # BR(~g -> ~chi_1- t  bb)
#
#         PDG            Width
DECAY   1000006     2.96597298E+02   # stop1 decays
#          BR         NDA      ID1       ID2
     5.91601000E-02    2     1000022         6   # BR(~t_1 -> ~chi_10 t )
     1.18857241E-01    2     1000023         6   # BR(~t_1 -> ~chi_20 t )
     6.16093087E-02    2     1000025         6   # BR(~t_1 -> ~chi_30 t )
     2.54133559E-02    2     1000035         6   # BR(~t_1 -> ~chi_40 t )
     6.74212920E-05    2     1000024         5   # BR(~t_1 -> ~chi_1+ b )
     5.06113608E-02    2     1000037         5   # BR(~t_1 -> ~chi_2+ b )
     6.66781504E-01    2     1000021         6   # BR(~t_1 -> ~g      t )
     7.07709592E-03    2     1000005        24   # BR(~t_1 -> ~b_1    W+)
     1.04226118E-02    2     2000005        24   # BR(~t_1 -> ~b_2    W+)
#
#         PDG            Width
DECAY   2000006     3.75720849E+02   # stop2 decays
#          BR         NDA      ID1       ID2
     6.64149153E-02    2     1000022         6   # BR(~t_2 -> ~chi_10 t )
     1.00328698E-01    2     1000023         6   # BR(~t_2 -> ~chi_20 t )
     6.31002269E-02    2     1000025         6   # BR(~t_2 -> ~chi_30 t )
    -1.69094128E-05    2     1000035         6   # BR(~t_2 -> ~chi_40 t )
     2.00844778E-01    2     1000024         5   # BR(~t_2 -> ~chi_1+ b )
    -3.36265156E-05    2     1000037         5   # BR(~t_2 -> ~chi_2+ b )
     5.69303933E-01    2     1000021         6   # BR(~t_2 -> ~g      t )
    -8.26537004E-05    2     1000006        25   # BR(~t_2 -> ~t_1    h )
     2.09565781E-05    2     1000006        23   # BR(~t_2 -> ~t_1    Z )
     4.78755678E-05    2     1000005        24   # BR(~t_2 -> ~b_1    W+)
     7.18070661E-05    2     2000005        24   # BR(~t_2 -> ~b_2    W+)
#
#         PDG            Width
DECAY   1000005     2.18586483E+02   # sbottom1 decays
#          BR         NDA      ID1       ID2
     5.46081764E-03    2     1000022         5   # BR(~b_1 -> ~chi_10 b )
     9.03449325E-05    2     1000023         5   # BR(~b_1 -> ~chi_20 b )
     3.69641217E-03    2     1000025         5   # BR(~b_1 -> ~chi_30 b )
     9.60459628E-03    2     1000035         5   # BR(~b_1 -> ~chi_40 b )
     8.50372458E-02    2    -1000024         6   # BR(~b_1 -> ~chi_1- t )
     1.92843820E-02    2    -1000037         6   # BR(~b_1 -> ~chi_2- t )
     8.76826201E-01    2     1000021         5   # BR(~b_1 -> ~g      b )
#
#         PDG            Width
DECAY   2000005     2.57123361E+02   # sbottom2 decays
#          BR         NDA      ID1       ID2
     1.95083680E-03    2     1000022         5   # BR(~b_2 -> ~chi_10 b )
     1.14338329E-04    2     1000023         5   # BR(~b_2 -> ~chi_20 b )
     2.82386910E-03    2     1000025         5   # BR(~b_2 -> ~chi_30 b )
     1.84606100E-02    2     1000035         5   # BR(~b_2 -> ~chi_40 b )
     1.94588791E-01    2    -1000024         6   # BR(~b_2 -> ~chi_1- t )
     3.70818750E-02    2    -1000037         6   # BR(~b_2 -> ~chi_2- t )
     7.44979679E-01    2     1000021         5   # BR(~b_2 -> ~g      b )
#
#         PDG            Width
DECAY   1000002     2.12821025E+02   # sup_L decays
#          BR         NDA      ID1       ID2
     1.00447218E-03    2     1000022         2   # BR(~u_L -> ~chi_10 u)
     7.08541620E-07    2     1000023         2   # BR(~u_L -> ~chi_20 u)
     2.07078182E-03    2     1000025         2   # BR(~u_L -> ~chi_30 u)
     3.21471026E-02    2     1000035         2   # BR(~u_L -> ~chi_40 u)
     2.18959454E-04    2     1000024         1   # BR(~u_L -> ~chi_1+ d)
     6.42917865E-02    2     1000037         1   # BR(~u_L -> ~chi_2+ d)
     9.00266189E-01    2     1000021         2   # BR(~u_L -> ~g      u)
#
#         PDG            Width
DECAY   2000002     2.01728982E+02   # sup_R decays
#          BR         NDA      ID1       ID2
     2.46620799E-02    2     1000022         2   # BR(~u_R -> ~chi_10 u)
     1.97500704E-06    2     1000023         2   # BR(~u_R -> ~chi_20 u)
     2.55500667E-02    2     1000025         2   # BR(~u_R -> ~chi_30 u)
     6.54802139E-09    2     1000035         2   # BR(~u_R -> ~chi_40 u)
     9.49785872E-01    2     1000021         2   # BR(~u_R -> ~g      u)
#
#         PDG            Width
DECAY   1000001     2.12826286E+02   # sdown_L decays
#          BR         NDA      ID1       ID2
     2.00291852E-03    2     1000022         1   # BR(~d_L -> ~chi_10 d)
     2.32832627E-06    2     1000023         1   # BR(~d_L -> ~chi_20 d)
     1.04364386E-03    2     1000025         1   # BR(~d_L -> ~chi_30 d)
     3.21661971E-02    2     1000035         1   # BR(~d_L -> ~chi_40 d)
     1.31269677E-04    2    -1000024         2   # BR(~d_L -> ~chi_1- u)
     6.43350124E-02    2    -1000037         2   # BR(~d_L -> ~chi_2- u)
     9.00318630E-01    2     1000021         1   # BR(~d_L -> ~g      d)
#
#         PDG            Width
DECAY   2000001     1.94136813E+02   # sdown_R decays
#          BR         NDA      ID1       ID2
     6.40674513E-03    2     1000022         1   # BR(~d_R -> ~chi_10 d)
     5.13069815E-07    2     1000023         1   # BR(~d_R -> ~chi_20 d)
     6.63742951E-03    2     1000025         1   # BR(~d_R -> ~chi_30 d)
     1.70112050E-09    2     1000035         1   # BR(~d_R -> ~chi_40 d)
     9.86955311E-01    2     1000021         1   # BR(~d_R -> ~g      d)
#
#         PDG            Width
DECAY   1000004     2.12821025E+02   # scharm_L decays
#          BR         NDA      ID1       ID2
     1.00447218E-03    2     1000022         4   # BR(~c_L -> ~chi_10 c)
     7.08541620E-07    2     1000023         4   # BR(~c_L -> ~chi_20 c)
     2.07078182E-03    2     1000025         4   # BR(~c_L -> ~chi_30 c)
     3.21471026E-02    2     1000035         4   # BR(~c_L -> ~chi_40 c)
     2.18959454E-04    2     1000024         3   # BR(~c_L -> ~chi_1+ s)
     6.42917865E-02    2     1000037         3   # BR(~c_L -> ~chi_2+ s)
     9.00266189E-01    2     1000021         4   # BR(~c_L -> ~g      c)
#
#         PDG            Width
DECAY   2000004     2.01728982E+02   # scharm_R decays
#          BR         NDA      ID1       ID2
     2.46620799E-02    2     1000022         4   # BR(~c_R -> ~chi_10 c)
     1.97500704E-06    2     1000023         4   # BR(~c_R -> ~chi_20 c)
     2.55500667E-02    2     1000025         4   # BR(~c_R -> ~chi_30 c)
     6.54802139E-09    2     1000035         4   # BR(~c_R -> ~chi_40 c)
     9.49785872E-01    2     1000021         4   # BR(~c_R -> ~g      c)
#
#         PDG            Width
DECAY   1000003     2.12826286E+02   # sstrange_L decays
#          BR         NDA      ID1       ID2
     2.00291852E-03    2     1000022         3   # BR(~s_L -> ~chi_10 s)
     2.32832627E-06    2     1000023         3   # BR(~s_L -> ~chi_20 s)
     1.04364386E-03    2     1000025         3   # BR(~s_L -> ~chi_30 s)
     3.21661971E-02    2     1000035         3   # BR(~s_L -> ~chi_40 s)
     1.31269677E-04    2    -1000024         4   # BR(~s_L -> ~chi_1- c)
     6.43350124E-02    2    -1000037         4   # BR(~s_L -> ~chi_2- c)
     9.00318630E-01    2     1000021         3   # BR(~s_L -> ~g      s)
#
#         PDG            Width
DECAY   2000003     1.94136813E+02   # sstrange_R decays
#          BR         NDA      ID1       ID2
     6.40674513E-03    2     1000022         3   # BR(~s_R -> ~chi_10 s)
     5.13069815E-07    2     1000023         3   # BR(~s_R -> ~chi_20 s)
     6.63742951E-03    2     1000025         3   # BR(~s_R -> ~chi_30 s)
     1.70112050E-09    2     1000035         3   # BR(~s_R -> ~chi_40 s)
     9.86955311E-01    2     1000021         3   # BR(~s_R -> ~g      s)
#
#         PDG            Width
DECAY   1000011     2.77632638E+01   # selectron_L decays
#          BR         NDA      ID1       ID2
     9.36908125E-02    2     1000022        11   # BR(~e_L -> ~chi_10 e-)
     1.99082742E-07    2     1000023        11   # BR(~e_L -> ~chi_20 e-)
     1.21836692E-01    2     1000025        11   # BR(~e_L -> ~chi_30 e-)
     2.60980160E-01    2     1000035        11   # BR(~e_L -> ~chi_40 e-)
     1.05166773E-03    2    -1000024        12   # BR(~e_L -> ~chi_1- nu_e)
     5.22440469E-01    2    -1000037        12   # BR(~e_L -> ~chi_2- nu_e)
#
#         PDG            Width
DECAY   2000011     2.38207497E+01   # selectron_R decays
#          BR         NDA      ID1       ID2
     4.91131790E-01    2     1000022        11   # BR(~e_R -> ~chi_10 e-)
     3.93315484E-05    2     1000023        11   # BR(~e_R -> ~chi_20 e-)
     5.08828747E-01    2     1000025        11   # BR(~e_R -> ~chi_30 e-)
     1.32189692E-07    2     1000035        11   # BR(~e_R -> ~chi_40 e-)
#
#         PDG            Width
DECAY   1000013     2.77632638E+01   # smuon_L decays
#          BR         NDA      ID1       ID2
     9.36908125E-02    2     1000022        13   # BR(~mu_L -> ~chi_10 mu-)
     1.99082742E-07    2     1000023        13   # BR(~mu_L -> ~chi_20 mu-)
     1.21836692E-01    2     1000025        13   # BR(~mu_L -> ~chi_30 mu-)
     2.60980160E-01    2     1000035        13   # BR(~mu_L -> ~chi_40 mu-)
     1.05166773E-03    2    -1000024        14   # BR(~mu_L -> ~chi_1- nu_mu)
     5.22440469E-01    2    -1000037        14   # BR(~mu_L -> ~chi_2- nu_mu)
#
#         PDG            Width
DECAY   2000013     2.38207497E+01   # smuon_R decays
#          BR         NDA      ID1       ID2
     4.91131790E-01    2     1000022        13   # BR(~mu_R -> ~chi_10 mu-)
     3.93315484E-05    2     1000023        13   # BR(~mu_R -> ~chi_20 mu-)
     5.08828747E-01    2     1000025        13   # BR(~mu_R -> ~chi_30 mu-)
     1.32189692E-07    2     1000035        13   # BR(~mu_R -> ~chi_40 mu-)
#
#         PDG            Width
DECAY   1000015     2.58349946E+01   # stau_1 decays
#          BR         NDA      ID1       ID2
     2.86559779E-01    2     1000022        15   # BR(~tau_1 -> ~chi_10  tau-)
     4.58403161E-04    2     1000023        15   # BR(~tau_1 -> ~chi_20  tau-)
     2.97943426E-01    2     1000025        15   # BR(~tau_1 -> ~chi_30  tau-)
     1.37439482E-01    2     1000035        15   # BR(~tau_1 -> ~chi_40  tau-)
     2.32732617E-03    2    -1000024        16   # BR(~tau_1 -> ~chi_1-  nu_tau)
     2.75132337E-01    2    -1000037        16   # BR(~tau_1 -> ~chi_2-  nu_tau)
     1.39247461E-04    2     1000039        15   # BR(~tau_1 -> ~G       tau-)
#
#         PDG            Width
DECAY   2000015     2.58454481E+01   # stau_2 decays
#          BR         NDA      ID1       ID2
     2.67477462E-01    2     1000022        15   # BR(~tau_2 -> ~chi_10  tau-)
     7.74564848E-04    2     1000023        15   # BR(~tau_2 -> ~chi_20  tau-)
     3.02598562E-01    2     1000025        15   # BR(~tau_2 -> ~chi_30  tau-)
     1.42962571E-01    2     1000035        15   # BR(~tau_2 -> ~chi_40  tau-)
     6.63371624E-08    2    -1000024        16   # BR(~tau_2 -> ~chi_1-  nu_tau)
     2.86186774E-01    2    -1000037        16   # BR(~tau_2 -> ~chi_2-  nu_tau)
#
#         PDG            Width
DECAY   1000012     2.77626222E+01   # snu_eL decays
#          BR         NDA      ID1       ID2
     1.17683759E-01    2     1000022        12   # BR(~nu_eL -> ~chi_10 nu_e)
     3.91282249E-05    2     1000023        12   # BR(~nu_eL -> ~chi_20 nu_e)
     9.71451787E-02    2     1000025        12   # BR(~nu_eL -> ~chi_30 nu_e)
     2.61285436E-01    2     1000035        12   # BR(~nu_eL -> ~chi_40 nu_e)
     1.75419559E-03    2     1000024        11   # BR(~nu_eL -> ~chi_1+ e-)
     5.22092302E-01    2     1000037        11   # BR(~nu_eL -> ~chi_2+ e-)
#
#         PDG            Width
DECAY   1000014     2.77626222E+01   # snu_muL decays
#          BR         NDA      ID1       ID2
     1.17683759E-01    2     1000022        14   # BR(~nu_muL -> ~chi_10 nu_mu)
     3.91282249E-05    2     1000023        14   # BR(~nu_muL -> ~chi_20 nu_mu)
     9.71451787E-02    2     1000025        14   # BR(~nu_muL -> ~chi_30 nu_mu)
     2.61285436E-01    2     1000035        14   # BR(~nu_muL -> ~chi_40 nu_mu)
     1.75419559E-03    2     1000024        13   # BR(~nu_muL -> ~chi_1+ mu-)
     5.22092302E-01    2     1000037        13   # BR(~nu_muL -> ~chi_2+ mu-)
#
#         PDG            Width
DECAY   1000016     2.77935617E+01   # snu_tauL decays
#          BR         NDA      ID1       ID2
     1.17552754E-01    2     1000022        16   # BR(~nu_tauL -> ~chi_10 nu_tau)
     3.90846677E-05    2     1000023        16   # BR(~nu_tauL -> ~chi_20 nu_tau)
     9.70370376E-02    2     1000025        16   # BR(~nu_tauL -> ~chi_30 nu_tau)
     2.60994576E-01    2     1000035        16   # BR(~nu_tauL -> ~chi_40 nu_tau)
     2.86484904E-03    2     1000024        15   # BR(~nu_tauL -> ~chi_1+ tau-)
     5.21511698E-01    2     1000037        15   # BR(~nu_tauL -> ~chi_2+ tau-)
#
#         PDG            Width
DECAY   1000024     8.82502804E-05   # chargino1+ decays
#          BR         NDA      ID1       ID2
     1.00072622E-03    2     1000039        24   # BR(~chi_1+ -> ~G       W+)
#           BR         NDA      ID1       ID2       ID3
     3.33316999E-01    3     1000022         2        -1   # BR(~chi_1+ -> ~chi_10 u    db)
     3.33316999E-01    3     1000022         4        -3   # BR(~chi_1+ -> ~chi_10 c    sb)
     1.11105799E-01    3     1000022       -11        12   # BR(~chi_1+ -> ~chi_10 e+   nu_e)
     1.11105799E-01    3     1000022       -13        14   # BR(~chi_1+ -> ~chi_10 mu+  nu_mu)
     1.10153679E-01    3     1000022       -15        16   # BR(~chi_1+ -> ~chi_10 tau+ nu_tau)
#
#         PDG            Width
DECAY   1000037     3.58747390E+01   # chargino2+ decays
#          BR         NDA      ID1       ID2
     2.34617327E-01    2     1000024        23   # BR(~chi_2+ -> ~chi_1+  Z )
     1.10576394E-01    2     1000022        24   # BR(~chi_2+ -> ~chi_10  W+)
     2.28641092E-01    2     1000023        24   # BR(~chi_2+ -> ~chi_20  W+)
     1.18167572E-01    2     1000025        24   # BR(~chi_2+ -> ~chi_30  W+)
     2.35699401E-01    2     1000024        25   # BR(~chi_2+ -> ~chi_1+  h )
     1.79491139E-02    2     1000024        35   # BR(~chi_2+ -> ~chi_1+  H )
     1.81911787E-02    2     1000024        36   # BR(~chi_2+ -> ~chi_1+  A )
     1.02522271E-02    2     1000022        37   # BR(~chi_2+ -> ~chi_10  H+)
     1.79926629E-02    2     1000023        37   # BR(~chi_2+ -> ~chi_20  H+)
     7.90343408E-03    2     1000025        37   # BR(~chi_2+ -> ~chi_30  H+)
     9.59651613E-06    2     1000039        24   # BR(~chi_2+ -> ~G       W+)
     5.46890495E-10    2     1000039        37   # BR(~chi_2+ -> ~G       H+)
#
#         PDG            Width
DECAY   1000022    1.0E-05    # neutralino1 decays
#          BR         NDA      ID1       ID2
     5.02122650E-01    2     1000039        22   # BR(~chi_10 -> ~G        gam)
     4.87078666E-01    2     1000039        23   # BR(~chi_10 -> ~G        Z)
     1.07986834E-02    2     1000039        25   # BR(~chi_10 -> ~G        h)
#
#         PDG            Width
DECAY   1000023     9.50482354E-05   # neutralino2 decays
#          BR         NDA      ID1       ID2
     4.64012693E-04    2     1000022        22   # BR(~chi_20 -> ~chi_10 gam)
#          BR         NDA      ID1       ID2
     2.40522772E-08    2     1000039        22   # BR(~chi_20 -> ~G        gam)
     3.59823727E-05    2     1000039        23   # BR(~chi_20 -> ~G        Z)
     8.39337778E-04    2     1000039        25   # BR(~chi_20 -> ~G        h)
#           BR         NDA      ID1       ID2       ID3
     1.18764109E-01    3     1000022        -2         2   # BR(~chi_20 -> ~chi_10 ub      u)
     1.53757411E-01    3     1000022        -1         1   # BR(~chi_20 -> ~chi_10 db      d)
     1.18764109E-01    3     1000022        -4         4   # BR(~chi_20 -> ~chi_10 cb      c)
     1.53757411E-01    3     1000022        -3         3   # BR(~chi_20 -> ~chi_10 sb      s)
     1.38394789E-01    3     1000022        -5         5   # BR(~chi_20 -> ~chi_10 bb      b)
     3.51044148E-02    3     1000022       -11        11   # BR(~chi_20 -> ~chi_10 e+      e-)
     3.51044148E-02    3     1000022       -13        13   # BR(~chi_20 -> ~chi_10 mu+     mu-)
     3.47172957E-02    3     1000022       -15        15   # BR(~chi_20 -> ~chi_10 tau+    tau-)
     7.00981744E-02    3     1000022       -12        12   # BR(~chi_20 -> ~chi_10 nu_eb   nu_e)
     7.00981744E-02    3     1000022       -14        14   # BR(~chi_20 -> ~chi_10 nu_mub  nu_mu)
     7.00981744E-02    3     1000022       -16        16   # BR(~chi_20 -> ~chi_10 nu_taub nu_tau)
     4.02733708E-07    3     1000024        -2         1   # BR(~chi_20 -> ~chi_1+ ub      d)
     4.02733708E-07    3    -1000024        -1         2   # BR(~chi_20 -> ~chi_1- db      u)
     4.02733708E-07    3     1000024        -4         3   # BR(~chi_20 -> ~chi_1+ cb      s)
     4.02733708E-07    3    -1000024        -3         4   # BR(~chi_20 -> ~chi_1- sb      c)
     1.34244580E-07    3     1000024       -12        11   # BR(~chi_20 -> ~chi_1+ nu_eb   e-)
     1.34244580E-07    3    -1000024        12       -11   # BR(~chi_20 -> ~chi_1- nu_e    e+)
     1.34244580E-07    3     1000024       -14        13   # BR(~chi_20 -> ~chi_1+ nu_mub  mu-)
     1.34244580E-07    3    -1000024        14       -13   # BR(~chi_20 -> ~chi_1- nu_mu   mu+)
     8.65703878E-09    3     1000024       -16        15   # BR(~chi_20 -> ~chi_1+ nu_taub tau-)
     8.65703878E-09    3    -1000024        16       -15   # BR(~chi_20 -> ~chi_1- nu_tau  tau+)
#
#         PDG            Width
DECAY   1000025     2.74950013E-04   # neutralino3 decays
#          BR         NDA      ID1       ID2
     3.03059886E-04    2     1000022        22   # BR(~chi_30 -> ~chi_10 gam)
     4.79454258E-04    2     1000023        22   # BR(~chi_30 -> ~chi_20 gam)
#          BR         NDA      ID1       ID2
     3.71381707E-04    2     1000039        22   # BR(~chi_30 -> ~G        gam)
     2.98886219E-04    2     1000039        23   # BR(~chi_30 -> ~G        Z)
     7.98062390E-06    2     1000039        25   # BR(~chi_30 -> ~G        h)
#           BR         NDA      ID1       ID2       ID3
     7.13369975E-06    3     1000022        -2         2   # BR(~chi_30 -> ~chi_10 ub      u)
     8.47693522E-06    3     1000022        -1         1   # BR(~chi_30 -> ~chi_10 db      d)
     7.13369975E-06    3     1000022        -4         4   # BR(~chi_30 -> ~chi_10 cb      c)
     8.47693522E-06    3     1000022        -3         3   # BR(~chi_30 -> ~chi_10 sb      s)
     9.12916127E-06    3     1000022        -5         5   # BR(~chi_30 -> ~chi_10 bb      b)
     1.48132768E-06    3     1000022       -11        11   # BR(~chi_30 -> ~chi_10 e+      e-)
     1.48132768E-06    3     1000022       -13        13   # BR(~chi_30 -> ~chi_10 mu+     mu-)
     1.59926095E-06    3     1000022       -15        15   # BR(~chi_30 -> ~chi_10 tau+    tau-)
     4.15038479E-06    3     1000022       -12        12   # BR(~chi_30 -> ~chi_10 nu_eb   nu_e)
     4.15038479E-06    3     1000022       -14        14   # BR(~chi_30 -> ~chi_10 nu_mub  nu_mu)
     4.15038479E-06    3     1000022       -16        16   # BR(~chi_30 -> ~chi_10 nu_taub nu_tau)
     2.68444401E-02    3     1000023        -2         2   # BR(~chi_30 -> ~chi_20 ub      u)
     3.47541216E-02    3     1000023        -1         1   # BR(~chi_30 -> ~chi_20 db      d)
     2.68444401E-02    3     1000023        -4         4   # BR(~chi_30 -> ~chi_20 cb      c)
     3.47541216E-02    3     1000023        -3         3   # BR(~chi_30 -> ~chi_20 sb      s)
     3.07901509E-02    3     1000023        -5         5   # BR(~chi_30 -> ~chi_20 bb      b)
     7.93477234E-03    3     1000023       -11        11   # BR(~chi_30 -> ~chi_20 e+      e-)
     7.93477234E-03    3     1000023       -13        13   # BR(~chi_30 -> ~chi_20 mu+     mu-)
     7.83718711E-03    3     1000023       -15        15   # BR(~chi_30 -> ~chi_20 tau+    tau-)
     1.58443576E-02    3     1000023       -12        12   # BR(~chi_30 -> ~chi_20 nu_eb   nu_e)
     1.58443576E-02    3     1000023       -14        14   # BR(~chi_30 -> ~chi_20 nu_mub  nu_mu)
     1.58443576E-02    3     1000023       -16        16   # BR(~chi_30 -> ~chi_20 nu_taub nu_tau)
     1.28988580E-01    3     1000024        -2         1   # BR(~chi_30 -> ~chi_1+ ub      d)
     1.28988580E-01    3    -1000024        -1         2   # BR(~chi_30 -> ~chi_1- db      u)
     1.28988580E-01    3     1000024        -4         3   # BR(~chi_30 -> ~chi_1+ cb      s)
     1.28988580E-01    3    -1000024        -3         4   # BR(~chi_30 -> ~chi_1- sb      c)
     4.29961191E-02    3     1000024       -12        11   # BR(~chi_30 -> ~chi_1+ nu_eb   e-)
     4.29961191E-02    3    -1000024        12       -11   # BR(~chi_30 -> ~chi_1- nu_e    e+)
     4.29961191E-02    3     1000024       -14        13   # BR(~chi_30 -> ~chi_1+ nu_mub  mu-)
     4.29961191E-02    3    -1000024        14       -13   # BR(~chi_30 -> ~chi_1- nu_mu   mu+)
     4.26580001E-02    3     1000024       -16        15   # BR(~chi_30 -> ~chi_1+ nu_taub tau-)
     4.26580001E-02    3    -1000024        16       -15   # BR(~chi_30 -> ~chi_1- nu_tau  tau+)
#
#         PDG            Width
DECAY   1000035     3.58751432E+01   # neutralino4 decays
#          BR         NDA      ID1       ID2
     1.75030210E-03    2     1000022        23   # BR(~chi_40 -> ~chi_10   Z )
     2.31010879E-01    2     1000023        23   # BR(~chi_40 -> ~chi_20   Z )
     1.96151172E-03    2     1000025        23   # BR(~chi_40 -> ~chi_30   Z )
     2.28510617E-01    2     1000024       -24   # BR(~chi_40 -> ~chi_1+   W-)
     2.28510617E-01    2    -1000024        24   # BR(~chi_40 -> ~chi_1-   W+)
     1.12325350E-01    2     1000022        25   # BR(~chi_40 -> ~chi_10   h )
     1.73460567E-03    2     1000022        35   # BR(~chi_40 -> ~chi_10   H )
     8.48707791E-03    2     1000022        36   # BR(~chi_40 -> ~chi_10   A )
     3.68186612E-03    2     1000023        25   # BR(~chi_40 -> ~chi_20   h )
     1.46234585E-02    2     1000023        35   # BR(~chi_40 -> ~chi_20   H )
     3.28715605E-03    2     1000023        36   # BR(~chi_40 -> ~chi_20   A )
     1.19951409E-01    2     1000025        25   # BR(~chi_40 -> ~chi_30   h )
     1.47236142E-03    2     1000025        35   # BR(~chi_40 -> ~chi_30   H )
     6.40726109E-03    2     1000025        36   # BR(~chi_40 -> ~chi_30   A )
     1.81379651E-02    2     1000024       -37   # BR(~chi_40 -> ~chi_1+   H-)
     1.81379651E-02    2    -1000024        37   # BR(~chi_40 -> ~chi_1-   H+)
     2.30339504E-06    2     1000039        22   # BR(~chi_40 -> ~G        gam)
     7.29226574E-06    2     1000039        23   # BR(~chi_40 -> ~G        Z)
     4.93767730E-10    2     1000039        25   # BR(~chi_40 -> ~G        h)
     5.41328172E-10    2     1000039        35   # BR(~chi_40 -> ~G        H)
     3.05633871E-12    2     1000039        36   # BR(~chi_40 -> ~G        A)
#
#         PDG            Width
DECAY        25     4.21805571E-03   # h decays
#          BR         NDA      ID1       ID2
     6.01794819E-01    2           5        -5   # BR(h -> b       bb     )
     6.22445385E-02    2         -15        15   # BR(h -> tau+    tau-   )
     2.20318530E-04    2         -13        13   # BR(h -> mu+     mu-    )
     4.66151235E-04    2           3        -3   # BR(h -> s       sb     )
     2.01100978E-02    2           4        -4   # BR(h -> c       cb     )
     6.64131263E-02    2          21        21   # BR(h -> g       g      )
     2.30992855E-03    2          22        22   # BR(h -> gam     gam    )
     1.62665975E-03    2          22        23   # BR(h -> Z       gam    )
     2.16731392E-01    2          24       -24   # BR(h -> W+      W-     )
     2.80829677E-02    2          23        23   # BR(h -> Z       Z      )
#
#         PDG            Width
DECAY        35     3.95194519E+01   # H decays
#          BR         NDA      ID1       ID2
     1.40916980E-03    2           5        -5   # BR(H -> b       bb     )
     2.35790957E-04    2         -15        15   # BR(H -> tau+    tau-   )
     8.33608816E-07    2         -13        13   # BR(H -> mu+     mu-    )
     1.06730841E-06    2           3        -3   # BR(H -> s       sb     )
     9.63245119E-06    2           4        -4   # BR(H -> c       cb     )
     9.53091930E-01    2           6        -6   # BR(H -> t       tb     )
     7.63281706E-04    2          21        21   # BR(H -> g       g      )
     2.62693267E-06    2          22        22   # BR(H -> gam     gam    )
     1.10942739E-06    2          23        22   # BR(H -> Z       gam    )
     3.22286488E-04    2          24       -24   # BR(H -> W+      W-     )
     1.60703746E-04    2          23        23   # BR(H -> Z       Z      )
     8.65474028E-04    2          25        25   # BR(H -> h       h      )
     9.19062412E-24    2          36        36   # BR(H -> A       A      )
     3.63766804E-11    2          23        36   # BR(H -> Z       A      )
     5.75681412E-12    2          24       -37   # BR(H -> W+      H-     )
     5.75681412E-12    2         -24        37   # BR(H -> W-      H+     )
     3.34095071E-05    2     1000024  -1000024   # BR(H -> ~chi_1+ ~chi_1-)
     6.01841306E-04    2     1000022   1000022   # BR(H -> ~chi_10 ~chi_10)
     8.43006142E-06    2     1000023   1000023   # BR(H -> ~chi_20 ~chi_20)
     2.93126271E-04    2     1000025   1000025   # BR(H -> ~chi_30 ~chi_30)
     2.36465663E-02    2     1000022   1000023   # BR(H -> ~chi_10 ~chi_20)
     2.86358526E-08    2     1000022   1000025   # BR(H -> ~chi_10 ~chi_30)
     1.85526910E-02    2     1000023   1000025   # BR(H -> ~chi_20 ~chi_30)
#
#         PDG            Width
DECAY        36     3.99689014E+01   # A decays
#          BR         NDA      ID1       ID2
     1.41174681E-03    2           5        -5   # BR(A -> b       bb     )
     2.33336821E-04    2         -15        15   # BR(A -> tau+    tau-   )
     8.24929954E-07    2         -13        13   # BR(A -> mu+     mu-    )
     1.08755105E-06    2           3        -3   # BR(A -> s       sb     )
     9.53041519E-06    2           4        -4   # BR(A -> c       cb     )
     9.53825543E-01    2           6        -6   # BR(A -> t       tb     )
     9.02813997E-04    2          21        21   # BR(A -> g       g      )
     2.76237349E-06    2          22        22   # BR(A -> gam     gam    )
     1.29349859E-06    2          23        22   # BR(A -> Z       gam    )
     3.13956651E-04    2          23        25   # BR(A -> Z       h      )
     6.29389370E-04    2     1000024  -1000024   # BR(A -> ~chi_1+ ~chi_1-)
     2.46427434E-02    2     1000022   1000022   # BR(A -> ~chi_10 ~chi_10)
     6.39987915E-07    2     1000023   1000023   # BR(A -> ~chi_20 ~chi_20)
     1.71249343E-02    2     1000025   1000025   # BR(A -> ~chi_30 ~chi_30)
     4.42257651E-04    2     1000022   1000023   # BR(A -> ~chi_10 ~chi_20)
     5.40501183E-05    2     1000022   1000025   # BR(A -> ~chi_10 ~chi_30)
     4.03089472E-04    2     1000023   1000025   # BR(A -> ~chi_20 ~chi_30)
#
#         PDG            Width
DECAY        37     3.91527620E+01   # H+ decays
#          BR         NDA      ID1       ID2
     2.26508119E-06    2           4        -5   # BR(H+ -> c       bb     )
     2.38412249E-04    2         -15        16   # BR(H+ -> tau+    nu_tau )
     8.42873425E-07    2         -13        14   # BR(H+ -> mu+     nu_mu  )
     1.44009734E-08    2           2        -5   # BR(H+ -> u       bb     )
     5.21983305E-08    2           2        -3   # BR(H+ -> u       sb     )
     1.04007147E-05    2           4        -3   # BR(H+ -> c       sb     )
     9.55983203E-01    2           6        -5   # BR(H+ -> t       bb     )
     3.21812452E-04    2          24        25   # BR(H+ -> W+      h      )
     5.93392234E-13    2          24        36   # BR(H+ -> W+      A      )
     2.17183152E-02    2     1000024   1000022   # BR(H+ -> ~chi_1+ ~chi_10)
     1.47303714E-04    2     1000024   1000023   # BR(H+ -> ~chi_1+ ~chi_20)
     2.15773776E-02    2     1000024   1000025   # BR(H+ -> ~chi_1+ ~chi_30)
