#
#                              ======================
#                              | THE SUSYHIT OUTPUT |
#                              ======================
#
#
#              ------------------------------------------------------
#              |     This is the output of the SUSY-HIT package     |
#              |  created by A.Djouadi, M.Muehlleitner and M.Spira. |
#              |  In case of problems with SUSY-HIT email to        |
#              |           margarete.muehlleitner@cern.ch           |
#              |           michael.spira@psi.ch                     |
#              |           abdelhak.djouadi@cern.ch                 |
#              ------------------------------------------------------
#
#              ------------------------------------------------------
#              |  SUSY Les Houches Accord - MSSM Spectrum + Decays  |
#              |              based on the decay programs           |
#              |                                                    |
#              |                     SDECAY 1.3b                    |
#              |                                                    |
#              |  Authors: M.Muhlleitner, A.Djouadi and Y.Mambrini  |
#              |  Ref.:    Comput.Phys.Commun.168(2005)46           |
#              |           [hep-ph/0311167]                         |
#              |                                                    |
#              |                     HDECAY 3.4                     |
#              |                                                    |
#              |  By: A.Djouadi,J.Kalinowski,M.Muhlleitner,M.Spira  |
#              |  Ref.:    Comput.Phys.Commun.108(1998)56           |
#              |           [hep-ph/9704448]                         |
#              |                                                    |
#              |                                                    |
#              |  If not stated otherwise all DRbar couplings and   |
#              |  soft SUSY breaking masses are given at the scale  |
#              |  Q=  0.50007393E+04
#              |                                                    |
#              ------------------------------------------------------
#
#
BLOCK DCINFO  # Decay Program information
     1   SDECAY/HDECAY # decay calculator
     2   1.3b  /3.4    # version number
#
BLOCK SPINFO  # Spectrum calculator information
     1    SOFTSUSY    # spectrum calculator                
     2    3.4.0       # version number                     
#
BLOCK MODSEL  # Model selection
     1     0   #  nonUniversal                                     
#
BLOCK SMINPUTS  # Standard Model inputs
         1     1.25778332E+02   # alpha_em^-1(M_Z)^MSbar
         2     1.16570000E-05   # G_F [GeV^-2]
         3     1.17200002E-01   # alpha_S(M_Z)^MSbar
         4     9.11876000E+01   # M_Z pole mass
         5     4.25000000E+00   # mb(mb)^MSbar
         6     1.72500000E+02   # mt pole mass
         7     1.77682000E+00   # mtau pole mass
#
BLOCK MINPAR  # Input parameters - minimal models
         3     1.00000000E+01   # tanb                
#
BLOCK EXTPAR  # Input parameters - non-minimal models
         0    -1.00000000E+00   # Set                 
         1     6.00000000E+01   # M_1(MX)             
         2     3.00000000E+03   # M_2(MX)             
         3     1.21156300E+03   # M_3(MX)             
        11     5.00000000E+03   # At(MX)              
        12     5.00000000E+03   # Ab(MX)              
        13     0.00000000E+00   # Atau(MX)            
        23    -8.62000000E+02   # mu(MX)              
        26     3.00000000E+03   # mA(pole)            
        31     5.00000000E+03   # meL(MX)             
        32     5.00000000E+03   # mmuL(MX)            
        33     5.00000000E+03   # mtauL(MX)           
        34     5.00000000E+03   # meR(MX)             
        35     5.00000000E+03   # mmuR(MX)            
        36     5.00000000E+03   # mtauR(MX)           
        41     5.00000000E+03   # mqL1(MX)            
        42     5.00000000E+03   # mqL2(MX)            
        43     5.00000000E+03   # mqL3(MX)            
        44     5.00000000E+03   # muR(MX)             
        45     5.00000000E+03   # mcR(MX)             
        46     5.00000000E+03   # mtR(MX)             
        47     5.00000000E+03   # mdR(MX)             
        48     5.00000000E+03   # msR(MX)             
        49     5.00000000E+03   # mbR(MX)             
#
BLOCK MASS  # Mass Spectrum
# PDG code           mass       particle
        24     8.00938206E+01   # W+
        25     1.24615426E+02   # h
        35     3.00007072E+03   # H
        36     2.99997512E+03   # A
        37     3.00130428E+03   # H+
         5     4.87878001E+00   # b-quark pole mass calculated from mb(mb)_Msbar
   1000001     5.06669037E+03   # ~d_L
   2000001     5.04886189E+03   # ~d_R
   1000002     5.06621463E+03   # ~u_L
   2000002     5.04857303E+03   # ~u_R
   1000003     5.06669037E+03   # ~s_L
   2000003     5.04886189E+03   # ~s_R
   1000004     5.06621463E+03   # ~c_L
   2000004     5.04857303E+03   # ~c_R
   1000005     5.01264297E+03   # ~b_1
   2000005     5.04734555E+03   # ~b_2
   1000006     4.90317869E+03   # ~t_1
   2000006     5.05796681E+03   # ~t_2
   1000011     5.01907796E+03   # ~e_L
   2000011     5.00592777E+03   # ~e_R
   1000012     5.01812888E+03   # ~nu_eL
   1000013     5.01907796E+03   # ~mu_L
   2000013     5.00592777E+03   # ~mu_R
   1000014     5.01812888E+03   # ~nu_muL
   1000015     5.00465123E+03   # ~tau_1
   2000015     5.01873132E+03   # ~tau_2
   1000016     5.01758152E+03   # ~nu_tauL
   1000021     1.50000020E+03   # ~g
   1000022     6.02944193E+01   # ~chi_10
   1000023     8.99733853E+02   # ~chi_20
   1000025    -9.01974461E+02   # ~chi_30
   1000035     3.07423669E+03   # ~chi_40
   1000024     9.00000826E+02   # ~chi_1+
   1000037     3.07440421E+03   # ~chi_2+
#
BLOCK NMIX  # Neutralino Mixing Matrix
  1  1     9.98775451E-01   # N_11
  1  2     1.95975095E-04   # N_12
  1  3    -4.94386052E-02   # N_13
  1  4     1.83973900E-03   # N_14
  2  1     3.36692028E-02   # N_21
  2  2     2.24274384E-02   # N_22
  2  3     7.06575513E-01   # N_23
  2  4     7.06480318E-01   # N_24
  3  1    -3.62467394E-02   # N_31
  3  2     1.52915068E-02   # N_32
  3  3    -7.05890516E-01   # N_33
  3  4     7.07227632E-01   # N_34
  4  1    -3.96728015E-04   # N_41
  4  2     9.99631503E-01   # N_42
  4  3    -5.04471936E-03   # N_43
  4  4    -2.66693081E-02   # N_44
#
BLOCK UMIX  # Chargino Mixing Matrix U
  1  1     7.14669405E-03   # U_11
  1  2     9.99974462E-01   # U_12
  2  1    -9.99974462E-01   # U_21
  2  2     7.14669405E-03   # U_22
#
BLOCK VMIX  # Chargino Mixing Matrix V
  1  1     3.77454335E-02   # V_11
  1  2    -9.99287387E-01   # V_12
  2  1    -9.99287387E-01   # V_21
  2  2    -3.77454335E-02   # V_22
#
BLOCK STOPMIX  # Stop Mixing Matrix
  1  1    -5.07979847E-01   # cos(theta_t)
  1  2     8.61368954E-01   # sin(theta_t)
  2  1    -8.61368954E-01   # -sin(theta_t)
  2  2    -5.07979847E-01   # cos(theta_t)
#
BLOCK SBOTMIX  # Sbottom Mixing Matrix
  1  1     9.97457811E-01   # cos(theta_b)
  1  2    -7.12594925E-02   # sin(theta_b)
  2  1     7.12594925E-02   # -sin(theta_b)
  2  2     9.97457811E-01   # cos(theta_b)
#
BLOCK STAUMIX  # Stau Mixing Matrix
  1  1    -1.02685035E-01   # cos(theta_tau)
  1  2     9.94713920E-01   # sin(theta_tau)
  2  1    -9.94713920E-01   # -sin(theta_tau)
  2  2    -1.02685035E-01   # cos(theta_tau)
#
BLOCK ALPHA  # Higgs mixing
          -1.05458451E-01   # Mixing angle in the neutral Higgs boson sector
#
BLOCK HMIX Q=  5.00073926E+03  # DRbar Higgs Parameters
         1    -8.77617595E+02   # mu(Q)MSSM           
         2     9.47128670E+00   # tan                 
         3     2.41855898E+02   # higgs               
         4     8.54267234E+06   # mA^2(Q)MSSM         
#
BLOCK GAUGE Q=  5.00073926E+03  # The gauge couplings
     1     3.70831193E-01   # gprime(Q) DRbar
     2     6.32697484E-01   # g(Q) DRbar
     3     1.00270933E+00   # g3(Q) DRbar
#
BLOCK AU Q=  5.00073926E+03  # The trilinear couplings
  1  1     5.00000001E+03   # A_u(Q) DRbar
  2  2     5.00000001E+03   # A_c(Q) DRbar
  3  3     5.00000001E+03   # A_t(Q) DRbar
#
BLOCK AD Q=  5.00073926E+03  # The trilinear couplings
  1  1     5.00000000E+03   # A_d(Q) DRbar
  2  2     5.00000000E+03   # A_s(Q) DRbar
  3  3     5.00000001E+03   # A_b(Q) DRbar
#
BLOCK AE Q=  5.00073926E+03  # The trilinear couplings
  1  1     0.00000000E+00   # A_e(Q) DRbar
  2  2     9.69200195E-08   # A_mu(Q) DRbar
  3  3     9.62556559E-08   # A_tau(Q) DRbar
#
BLOCK Yu Q=  5.00073926E+03  # The Yukawa couplings
  1  1     0.00000000E+00   # y_u(Q) DRbar
  2  2     0.00000000E+00   # y_c(Q) DRbar
  3  3     8.17823583E-01   # y_t(Q) DRbar
#
BLOCK Yd Q=  5.00073926E+03  # The Yukawa couplings
  1  1     0.00000000E+00   # y_d(Q) DRbar
  2  2     0.00000000E+00   # y_s(Q) DRbar
  3  3     1.30018444E-01   # y_b(Q) DRbar
#
BLOCK Ye Q=  5.00073926E+03  # The Yukawa couplings
  1  1     0.00000000E+00   # y_e(Q) DRbar
  2  2     0.00000000E+00   # y_mu(Q) DRbar
  3  3     9.69137092E-02   # y_tau(Q) DRbar
#
BLOCK MSOFT Q=  5.00073926E+03  # The soft SUSY breaking masses at the scale Q
         1     6.00000000E+01   # M_1(Q)              
         2     3.00000000E+03   # M_2(Q)              
         3     1.21156300E+03   # M_3(Q)              
        21     7.93184006E+06   # mH1^2(Q)            
        22    -2.05210300E+05   # mH2^2(Q)            
        31     5.00000000E+03   # meL(Q)              
        32     5.00000000E+03   # mmuL(Q)             
        33     5.00000000E+03   # mtauL(Q)            
        34     5.00000000E+03   # meR(Q)              
        35     5.00000000E+03   # mmuR(Q)             
        36     5.00000000E+03   # mtauR(Q)            
        41     5.00000000E+03   # mqL1(Q)             
        42     5.00000000E+03   # mqL2(Q)             
        43     5.00000000E+03   # mqL3(Q)             
        44     5.00000000E+03   # muR(Q)              
        45     5.00000000E+03   # mcR(Q)              
        46     5.00000000E+03   # mtR(Q)              
        47     5.00000000E+03   # mdR(Q)              
        48     5.00000000E+03   # msR(Q)              
        49     5.00000000E+03   # mbR(Q)              
#
#
#
#                             =================
#                             |The decay table|
#                             =================
#
# - The QCD corrections to the decays gluino -> squark  + quark
#                                     squark -> gaugino + quark_prime
#                                     squark -> squark_prime + Higgs
#                                     squark -> gluino  + quark
#   are included.
#
# - The multi-body decays for the inos, stops and sbottoms are included.
#
# - The loop induced decays for the gluino, neutralinos and stops
#   are included.
#
# - The SUSY decays of the top quark are included.
#
#
#         PDG            Width
DECAY         6     1.40285999E+00   # top decays
#          BR         NDA      ID1       ID2
     1.00000000E+00    2           5        24   # BR(t ->  b    W+)
#
#         PDG            Width
DECAY   1000021     9.33260130E-05   # gluino decays
#          BR         NDA      ID1       ID2
     7.99638461E-06    2     1000022        21   # BR(~g -> ~chi_10 g)
     1.84440820E-02    2     1000023        21   # BR(~g -> ~chi_20 g)
     1.80344183E-02    2     1000025        21   # BR(~g -> ~chi_30 g)
#           BR         NDA      ID1       ID2       ID3
     5.73546806E-02    3     1000022         1        -1   # BR(~g -> ~chi_10 d  db)
     1.20733577E-05    3     1000023         1        -1   # BR(~g -> ~chi_20 d  db)
     7.05413065E-06    3     1000025         1        -1   # BR(~g -> ~chi_30 d  db)
     1.95555073E-01    3     1000022         2        -2   # BR(~g -> ~chi_10 u  ub)
     4.36833807E-05    3     1000023         2        -2   # BR(~g -> ~chi_20 u  ub)
     8.83676737E-06    3     1000025         2        -2   # BR(~g -> ~chi_30 u  ub)
     5.73546806E-02    3     1000022         3        -3   # BR(~g -> ~chi_10 s  sb)
     1.20733577E-05    3     1000023         3        -3   # BR(~g -> ~chi_20 s  sb)
     7.05413065E-06    3     1000025         3        -3   # BR(~g -> ~chi_30 s  sb)
     1.95555073E-01    3     1000022         4        -4   # BR(~g -> ~chi_10 c  cb)
     4.36833807E-05    3     1000023         4        -4   # BR(~g -> ~chi_20 c  cb)
     8.83676737E-06    3     1000025         4        -4   # BR(~g -> ~chi_30 c  cb)
     5.82154070E-02    3     1000022         5        -5   # BR(~g -> ~chi_10 b  bb)
     2.52149706E-03    3     1000023         5        -5   # BR(~g -> ~chi_20 b  bb)
     2.46366847E-03    3     1000025         5        -5   # BR(~g -> ~chi_30 b  bb)
     1.71350862E-01    3     1000022         6        -6   # BR(~g -> ~chi_10 t  tb)
     5.12401946E-02    3     1000023         6        -6   # BR(~g -> ~chi_20 t  tb)
     3.09726123E-02    3     1000025         6        -6   # BR(~g -> ~chi_30 t  tb)
     3.32145646E-05    3     1000024         1        -2   # BR(~g -> ~chi_1+ d  ub)
     3.32145646E-05    3    -1000024         2        -1   # BR(~g -> ~chi_1- u  db)
     3.32145646E-05    3     1000024         3        -4   # BR(~g -> ~chi_1+ s  cb)
     3.32145646E-05    3    -1000024         4        -3   # BR(~g -> ~chi_1- c  sb)
     7.03268000E-02    3     1000024         5        -6   # BR(~g -> ~chi_1+ b  tb)
     7.03268000E-02    3    -1000024         6        -5   # BR(~g -> ~chi_1- t  bb)
#
#         PDG            Width
DECAY   1000006     3.84291681E+02   # stop1 decays
#          BR         NDA      ID1       ID2
     2.29547685E-02    2     1000022         6   # BR(~t_1 -> ~chi_10 t )
     8.04159928E-02    2     1000023         6   # BR(~t_1 -> ~chi_20 t )
     7.71553607E-02    2     1000025         6   # BR(~t_1 -> ~chi_30 t )
     5.42822121E-03    2     1000035         6   # BR(~t_1 -> ~chi_40 t )
     1.16486961E-01    2     1000024         5   # BR(~t_1 -> ~chi_1+ b )
     1.08165307E-02    2     1000037         5   # BR(~t_1 -> ~chi_2+ b )
     6.86742166E-01    2     1000021         6   # BR(~t_1 -> ~g      t )
#
#         PDG            Width
DECAY   2000006     3.87977051E+02   # stop2 decays
#          BR         NDA      ID1       ID2
     9.09031391E-03    2     1000022         6   # BR(~t_2 -> ~chi_10 t )
     8.12620022E-02    2     1000023         6   # BR(~t_2 -> ~chi_20 t )
     8.48174921E-02    2     1000025         6   # BR(~t_2 -> ~chi_30 t )
     1.42185418E-02    2     1000035         6   # BR(~t_2 -> ~chi_40 t )
     4.87435055E-02    2     1000024         5   # BR(~t_2 -> ~chi_1+ b )
     2.82952266E-02    2     1000037         5   # BR(~t_2 -> ~chi_2+ b )
     7.30279087E-01    2     1000021         6   # BR(~t_2 -> ~g      t )
     7.45441734E-04    2     1000006        25   # BR(~t_2 -> ~t_1    h )
     2.54838889E-03    2     1000006        23   # BR(~t_2 -> ~t_1    Z )
#
#         PDG            Width
DECAY   1000005     3.64547204E+02   # sbottom1 decays
#          BR         NDA      ID1       ID2
     2.12272087E-03    2     1000022         5   # BR(~b_1 -> ~chi_10 b )
     2.19863641E-03    2     1000023         5   # BR(~b_1 -> ~chi_20 b )
     2.14916463E-03    2     1000025         5   # BR(~b_1 -> ~chi_30 b )
     2.06314998E-02    2     1000035         5   # BR(~b_1 -> ~chi_40 b )
     1.71654232E-01    2    -1000024         6   # BR(~b_1 -> ~chi_1- t )
     4.14446467E-02    2    -1000037         6   # BR(~b_1 -> ~chi_2- t )
     7.58241476E-01    2     1000021         5   # BR(~b_1 -> ~g      b )
     1.55762309E-03    2     1000006       -24   # BR(~b_1 -> ~t_1    W-)
#
#         PDG            Width
DECAY   2000005     2.85422908E+02   # sbottom2 decays
#          BR         NDA      ID1       ID2
     1.03010543E-02    2     1000022         5   # BR(~b_2 -> ~chi_10 b )
     2.81525108E-03    2     1000023         5   # BR(~b_2 -> ~chi_20 b )
     2.88399369E-03    2     1000025         5   # BR(~b_2 -> ~chi_30 b )
     1.36925760E-04    2     1000035         5   # BR(~b_2 -> ~chi_40 b )
     6.69349021E-03    2    -1000024         6   # BR(~b_2 -> ~chi_1- t )
     2.75027483E-04    2    -1000037         6   # BR(~b_2 -> ~chi_2- t )
     9.76852592E-01    2     1000021         5   # BR(~b_2 -> ~g      b )
     4.16655602E-05    2     1000006       -24   # BR(~b_2 -> ~t_1    W-)
#
#         PDG            Width
DECAY   1000002     3.04458053E+02   # sup_L decays
#          BR         NDA      ID1       ID2
     2.45284303E-03    2     1000022         2   # BR(~u_L -> ~chi_10 u)
     5.07833010E-05    2     1000023         2   # BR(~u_L -> ~chi_20 u)
     4.06728717E-06    2     1000025         2   # BR(~u_L -> ~chi_30 u)
     2.57224928E-02    2     1000035         2   # BR(~u_L -> ~chi_40 u)
     1.71990757E-04    2     1000024         1   # BR(~u_L -> ~chi_1+ d)
     5.14110530E-02    2     1000037         1   # BR(~u_L -> ~chi_2+ d)
     9.20186770E-01    2     1000021         2   # BR(~u_L -> ~g      u)
#
#         PDG            Width
DECAY   2000002     2.90717420E+02   # sup_R decays
#          BR         NDA      ID1       ID2
     4.08742028E-02    2     1000022         2   # BR(~u_R -> ~chi_10 u)
     4.35917197E-05    2     1000023         2   # BR(~u_R -> ~chi_20 u)
     5.05050074E-05    2     1000025         2   # BR(~u_R -> ~chi_30 u)
     2.56175258E-09    2     1000035         2   # BR(~u_R -> ~chi_40 u)
     9.59031698E-01    2     1000021         2   # BR(~u_R -> ~g      u)
#
#         PDG            Width
DECAY   1000001     3.04469459E+02   # sdown_L decays
#          BR         NDA      ID1       ID2
     2.44314839E-03    2     1000022         1   # BR(~d_L -> ~chi_10 d)
     1.51643061E-05    2     1000023         1   # BR(~d_L -> ~chi_20 d)
     3.02066532E-05    2     1000025         1   # BR(~d_L -> ~chi_30 d)
     2.57375205E-02    2     1000035         1   # BR(~d_L -> ~chi_40 d)
     6.16618623E-06    2    -1000024         2   # BR(~d_L -> ~chi_1- u)
     5.14958791E-02    2    -1000037         2   # BR(~d_L -> ~chi_2- u)
     9.20271915E-01    2     1000021         1   # BR(~d_L -> ~g      d)
#
#         PDG            Width
DECAY   2000001     2.81807073E+02   # sdown_R decays
#          BR         NDA      ID1       ID2
     1.05422542E-02    2     1000022         1   # BR(~d_R -> ~chi_10 d)
     1.12432374E-05    2     1000023         1   # BR(~d_R -> ~chi_20 d)
     1.30263228E-05    2     1000025         1   # BR(~d_R -> ~chi_30 d)
     6.60814238E-10    2     1000035         1   # BR(~d_R -> ~chi_40 d)
     9.89433476E-01    2     1000021         1   # BR(~d_R -> ~g      d)
#
#         PDG            Width
DECAY   1000004     3.04458053E+02   # scharm_L decays
#          BR         NDA      ID1       ID2
     2.45284303E-03    2     1000022         4   # BR(~c_L -> ~chi_10 c)
     5.07833010E-05    2     1000023         4   # BR(~c_L -> ~chi_20 c)
     4.06728717E-06    2     1000025         4   # BR(~c_L -> ~chi_30 c)
     2.57224928E-02    2     1000035         4   # BR(~c_L -> ~chi_40 c)
     1.71990757E-04    2     1000024         3   # BR(~c_L -> ~chi_1+ s)
     5.14110530E-02    2     1000037         3   # BR(~c_L -> ~chi_2+ s)
     9.20186770E-01    2     1000021         4   # BR(~c_L -> ~g      c)
#
#         PDG            Width
DECAY   2000004     2.90717420E+02   # scharm_R decays
#          BR         NDA      ID1       ID2
     4.08742028E-02    2     1000022         4   # BR(~c_R -> ~chi_10 c)
     4.35917197E-05    2     1000023         4   # BR(~c_R -> ~chi_20 c)
     5.05050074E-05    2     1000025         4   # BR(~c_R -> ~chi_30 c)
     2.56175258E-09    2     1000035         4   # BR(~c_R -> ~chi_40 c)
     9.59031698E-01    2     1000021         4   # BR(~c_R -> ~g      c)
#
#         PDG            Width
DECAY   1000003     3.04469459E+02   # sstrange_L decays
#          BR         NDA      ID1       ID2
     2.44314839E-03    2     1000022         3   # BR(~s_L -> ~chi_10 s)
     1.51643061E-05    2     1000023         3   # BR(~s_L -> ~chi_20 s)
     3.02066532E-05    2     1000025         3   # BR(~s_L -> ~chi_30 s)
     2.57375205E-02    2     1000035         3   # BR(~s_L -> ~chi_40 s)
     6.16618623E-06    2    -1000024         4   # BR(~s_L -> ~chi_1- c)
     5.14958791E-02    2    -1000037         4   # BR(~s_L -> ~chi_2- c)
     9.20271915E-01    2     1000021         3   # BR(~s_L -> ~g      s)
#
#         PDG            Width
DECAY   2000003     2.81807073E+02   # sstrange_R decays
#          BR         NDA      ID1       ID2
     1.05422542E-02    2     1000022         3   # BR(~s_R -> ~chi_10 s)
     1.12432374E-05    2     1000023         3   # BR(~s_R -> ~chi_20 s)
     1.30263228E-05    2     1000025         3   # BR(~s_R -> ~chi_30 s)
     6.60814238E-10    2     1000035         3   # BR(~s_R -> ~chi_40 s)
     9.89433476E-01    2     1000021         3   # BR(~s_R -> ~g      s)
#
#         PDG            Width
DECAY   1000011     3.02829415E+01   # selectron_L decays
#          BR         NDA      ID1       ID2
     2.26245340E-01    2     1000022        11   # BR(~e_L -> ~chi_10 e-)
     1.09894644E-03    2     1000023        11   # BR(~e_L -> ~chi_20 e-)
     2.19024686E-05    2     1000025        11   # BR(~e_L -> ~chi_30 e-)
     2.57348390E-01    2     1000035        11   # BR(~e_L -> ~chi_40 e-)
     6.31496501E-05    2    -1000024        12   # BR(~e_L -> ~chi_1- nu_e)
     5.15222271E-01    2    -1000037        12   # BR(~e_L -> ~chi_2- nu_e)
#
#         PDG            Width
DECAY   2000011     2.73781260E+01   # selectron_R decays
#          BR         NDA      ID1       ID2
     9.97707457E-01    2     1000022        11   # BR(~e_R -> ~chi_10 e-)
     1.06203028E-03    2     1000023        11   # BR(~e_R -> ~chi_20 e-)
     1.23045154E-03    2     1000025        11   # BR(~e_R -> ~chi_30 e-)
     6.10881101E-08    2     1000035        11   # BR(~e_R -> ~chi_40 e-)
#
#         PDG            Width
DECAY   1000013     3.02829415E+01   # smuon_L decays
#          BR         NDA      ID1       ID2
     2.26245340E-01    2     1000022        13   # BR(~mu_L -> ~chi_10 mu-)
     1.09894644E-03    2     1000023        13   # BR(~mu_L -> ~chi_20 mu-)
     2.19024686E-05    2     1000025        13   # BR(~mu_L -> ~chi_30 mu-)
     2.57348390E-01    2     1000035        13   # BR(~mu_L -> ~chi_40 mu-)
     6.31496501E-05    2    -1000024        14   # BR(~mu_L -> ~chi_1- nu_mu)
     5.15222271E-01    2    -1000037        14   # BR(~mu_L -> ~chi_2- nu_mu)
#
#         PDG            Width
DECAY   2000013     2.73781260E+01   # smuon_R decays
#          BR         NDA      ID1       ID2
     9.97707457E-01    2     1000022        13   # BR(~mu_R -> ~chi_10 mu-)
     1.06203028E-03    2     1000023        13   # BR(~mu_R -> ~chi_20 mu-)
     1.23045154E-03    2     1000025        13   # BR(~mu_R -> ~chi_30 mu-)
     6.10881101E-08    2     1000035        13   # BR(~mu_R -> ~chi_40 mu-)
#
#         PDG            Width
DECAY   1000015     2.91501692E+01   # stau_1 decays
#          BR         NDA      ID1       ID2
     9.30363202E-01    2     1000022        15   # BR(~tau_1 -> ~chi_10  tau-)
     1.60492641E-02    2     1000023        15   # BR(~tau_1 -> ~chi_20  tau-)
     1.53769488E-02    2     1000025        15   # BR(~tau_1 -> ~chi_30  tau-)
     2.73264847E-03    2     1000035        15   # BR(~tau_1 -> ~chi_40  tau-)
     3.00072905E-02    2    -1000024        16   # BR(~tau_1 -> ~chi_1-  nu_tau)
     5.47064637E-03    2    -1000037        16   # BR(~tau_1 -> ~chi_2-  nu_tau)
#
#         PDG            Width
DECAY   2000015     3.11259366E+01   # stau_2 decays
#          BR         NDA      ID1       ID2
     2.26311357E-01    2     1000022        15   # BR(~tau_2 -> ~chi_10  tau-)
     1.51078150E-02    2     1000023        15   # BR(~tau_2 -> ~chi_20  tau-)
     1.47771141E-02    2     1000025        15   # BR(~tau_2 -> ~chi_30  tau-)
     2.47735971E-01    2     1000035        15   # BR(~tau_2 -> ~chi_40  tau-)
     8.93649124E-05    2    -1000024        16   # BR(~tau_2 -> ~chi_1-  nu_tau)
     4.95978378E-01    2    -1000037        16   # BR(~tau_2 -> ~chi_2-  nu_tau)
#
#         PDG            Width
DECAY   1000012     3.02858500E+01   # snu_eL decays
#          BR         NDA      ID1       ID2
     2.25878134E-01    2     1000022        12   # BR(~nu_eL -> ~chi_10 nu_e)
     4.48392546E-06    2     1000023        12   # BR(~nu_eL -> ~chi_20 nu_e)
     8.24734608E-04    2     1000025        12   # BR(~nu_eL -> ~chi_30 nu_e)
     2.57397539E-01    2     1000035        12   # BR(~nu_eL -> ~chi_40 nu_e)
     1.76098090E-03    2     1000024        11   # BR(~nu_eL -> ~chi_1+ e-)
     5.14134127E-01    2     1000037        11   # BR(~nu_eL -> ~chi_2+ e-)
#
#         PDG            Width
DECAY   1000014     3.02858500E+01   # snu_muL decays
#          BR         NDA      ID1       ID2
     2.25878134E-01    2     1000022        14   # BR(~nu_muL -> ~chi_10 nu_mu)
     4.48392546E-06    2     1000023        14   # BR(~nu_muL -> ~chi_20 nu_mu)
     8.24734608E-04    2     1000025        14   # BR(~nu_muL -> ~chi_30 nu_mu)
     2.57397539E-01    2     1000035        14   # BR(~nu_muL -> ~chi_40 nu_mu)
     1.76098090E-03    2     1000024        13   # BR(~nu_muL -> ~chi_1+ mu-)
     5.14134127E-01    2     1000037        13   # BR(~nu_muL -> ~chi_2+ mu-)
#
#         PDG            Width
DECAY   1000016     3.11546092E+01   # snu_tauL decays
#          BR         NDA      ID1       ID2
     2.19555464E-01    2     1000022        16   # BR(~nu_tauL -> ~chi_10 nu_tau)
     4.35835071E-06    2     1000023        16   # BR(~nu_tauL -> ~chi_20 nu_tau)
     8.01637411E-04    2     1000025        16   # BR(~nu_tauL -> ~chi_30 nu_tau)
     2.50127019E-01    2     1000035        16   # BR(~nu_tauL -> ~chi_40 nu_tau)
     2.99002699E-02    2     1000024        15   # BR(~nu_tauL -> ~chi_1+ tau-)
     4.99611251E-01    2     1000037        15   # BR(~nu_tauL -> ~chi_2+ tau-)
#
#         PDG            Width
DECAY   1000024     5.46305342E-01   # chargino1+ decays
#          BR         NDA      ID1       ID2
     1.00000000E+00    2     1000022        24   # BR(~chi_1+ -> ~chi_10  W+)
#
#         PDG            Width
DECAY   1000037     2.07721575E+01   # chargino2+ decays
#          BR         NDA      ID1       ID2
     2.53286081E-01    2     1000024        23   # BR(~chi_2+ -> ~chi_1+  Z )
     1.91045577E-04    2     1000022        24   # BR(~chi_2+ -> ~chi_10  W+)
     2.44283368E-01    2     1000023        24   # BR(~chi_2+ -> ~chi_20  W+)
     2.44181174E-01    2     1000025        24   # BR(~chi_2+ -> ~chi_30  W+)
     2.58056849E-01    2     1000024        25   # BR(~chi_2+ -> ~chi_1+  h )
     1.48292795E-06    2     1000022        37   # BR(~chi_2+ -> ~chi_10  H+)
#
#         PDG            Width
DECAY   1000022     0.00000000E+00   # neutralino1 decays
#
#         PDG            Width
DECAY   1000023     5.69082914E-01   # neutralino2 decays
#          BR         NDA      ID1       ID2
     5.35265605E-01    2     1000022        23   # BR(~chi_20 -> ~chi_10   Z )
     4.64734395E-01    2     1000022        25   # BR(~chi_20 -> ~chi_10   h )
#
#         PDG            Width
DECAY   1000025     5.70581347E-01   # neutralino3 decays
#          BR         NDA      ID1       ID2
     4.58724436E-01    2     1000022        23   # BR(~chi_30 -> ~chi_10   Z )
     5.41275564E-01    2     1000022        25   # BR(~chi_30 -> ~chi_10   h )
#
#         PDG            Width
DECAY   1000035     2.07878658E+01   # neutralino4 decays
#          BR         NDA      ID1       ID2
     4.00109263E-05    2     1000022        23   # BR(~chi_40 -> ~chi_10   Z )
     8.03594817E-02    2     1000023        23   # BR(~chi_40 -> ~chi_20   Z )
     1.72231931E-01    2     1000025        23   # BR(~chi_40 -> ~chi_30   Z )
     2.44880066E-01    2     1000024       -24   # BR(~chi_40 -> ~chi_1+   W-)
     2.44880066E-01    2    -1000024        24   # BR(~chi_40 -> ~chi_1-   W+)
     1.50882267E-04    2     1000022        25   # BR(~chi_40 -> ~chi_10   h )
     1.40517302E-06    2     1000022        35   # BR(~chi_40 -> ~chi_10   H )
     1.68364477E-07    2     1000022        36   # BR(~chi_40 -> ~chi_10   A )
     1.76876966E-01    2     1000023        25   # BR(~chi_40 -> ~chi_20   h )
     8.05790219E-02    2     1000025        25   # BR(~chi_40 -> ~chi_30   h )
#
#         PDG            Width
DECAY        25     4.04811083E-03   # h decays
#          BR         NDA      ID1       ID2
     6.11682268E-01    2           5        -5   # BR(h -> b       bb     )
     6.39915968E-02    2         -15        15   # BR(h -> tau+    tau-   )
     2.26554217E-04    2         -13        13   # BR(h -> mu+     mu-    )
     4.80400065E-04    2           3        -3   # BR(h -> s       sb     )
     2.08164518E-02    2           4        -4   # BR(h -> c       cb     )
     6.71541545E-02    2          21        21   # BR(h -> g       g      )
     2.30514870E-03    2          22        22   # BR(h -> gam     gam    )
     1.47306797E-03    2          22        23   # BR(h -> Z       gam    )
     2.07190722E-01    2          24       -24   # BR(h -> W+      W-     )
     2.46189677E-02    2          23        23   # BR(h -> Z       Z      )
     6.06678471E-05    2     1000022   1000022   # BR(h -> ~chi_10 ~chi_10)
#
#         PDG            Width
DECAY        35     8.24078421E+00   # H decays
#          BR         NDA      ID1       ID2
     3.90842956E-01    2           5        -5   # BR(H -> b       bb     )
     6.76245501E-02    2         -15        15   # BR(H -> tau+    tau-   )
     2.39125780E-04    2         -13        13   # BR(H -> mu+     mu-    )
     2.93131726E-04    2           3        -3   # BR(H -> s       sb     )
     1.63870124E-06    2           4        -4   # BR(H -> c       cb     )
     1.63719220E-01    2           6        -6   # BR(H -> t       tb     )
     5.44011197E-05    2          21        21   # BR(H -> g       g      )
     2.37845613E-07    2          22        22   # BR(H -> gam     gam    )
     9.66182110E-08    2          23        22   # BR(H -> Z       gam    )
     7.56563722E-05    2          24       -24   # BR(H -> W+      W-     )
     3.77802992E-05    2          23        23   # BR(H -> Z       Z      )
     2.80480694E-04    2          25        25   # BR(H -> h       h      )
    -2.11221127E-23    2          36        36   # BR(H -> A       A      )
     1.54180411E-18    2          23        36   # BR(H -> Z       A      )
     2.29948900E-03    2     1000024  -1000024   # BR(H -> ~chi_1+ ~chi_1-)
     2.16410898E-03    2     1000022   1000022   # BR(H -> ~chi_10 ~chi_10)
     1.59528267E-05    2     1000023   1000023   # BR(H -> ~chi_20 ~chi_20)
     7.54725050E-04    2     1000025   1000025   # BR(H -> ~chi_30 ~chi_30)
     2.23167478E-01    2     1000022   1000023   # BR(H -> ~chi_10 ~chi_20)
     1.47685606E-01    2     1000022   1000025   # BR(H -> ~chi_10 ~chi_30)
     7.43364932E-04    2     1000023   1000025   # BR(H -> ~chi_20 ~chi_30)
#
#         PDG            Width
DECAY        36     8.25482740E+00   # A decays
#          BR         NDA      ID1       ID2
     3.90309124E-01    2           5        -5   # BR(A -> b       bb     )
     6.75112455E-02    2         -15        15   # BR(A -> tau+    tau-   )
     2.38724793E-04    2         -13        13   # BR(A -> mu+     mu-    )
     2.92854150E-04    2           3        -3   # BR(A -> s       sb     )
     1.64259329E-06    2           4        -4   # BR(A -> c       cb     )
     1.64017529E-01    2           6        -6   # BR(A -> t       tb     )
     1.62332570E-04    2          21        21   # BR(A -> g       g      )
     5.87888567E-07    2          22        22   # BR(A -> gam     gam    )
     1.96527671E-07    2          23        22   # BR(A -> Z       gam    )
     7.52421461E-05    2          23        25   # BR(A -> Z       h      )
     3.31094409E-03    2     1000024  -1000024   # BR(A -> ~chi_1+ ~chi_1-)
     2.19829811E-03    2     1000022   1000022   # BR(A -> ~chi_10 ~chi_10)
     1.62733714E-05    2     1000023   1000023   # BR(A -> ~chi_20 ~chi_20)
     1.80571519E-03    2     1000025   1000025   # BR(A -> ~chi_30 ~chi_30)
     1.49700172E-01    2     1000022   1000023   # BR(A -> ~chi_10 ~chi_20)
     2.20082134E-01    2     1000022   1000025   # BR(A -> ~chi_10 ~chi_30)
     2.76984968E-04    2     1000023   1000025   # BR(A -> ~chi_20 ~chi_30)
#
#         PDG            Width
DECAY        37     8.20349217E+00   # H+ decays
#          BR         NDA      ID1       ID2
     6.26789614E-04    2           4        -5   # BR(H+ -> c       bb     )
     6.79638111E-02    2         -15        16   # BR(H+ -> tau+    nu_tau )
     2.40325098E-04    2         -13        14   # BR(H+ -> mu+     nu_mu  )
     4.01143267E-06    2           2        -5   # BR(H+ -> u       bb     )
     1.41015137E-05    2           2        -3   # BR(H+ -> u       sb     )
     2.91619205E-04    2           4        -3   # BR(H+ -> c       sb     )
     5.53364108E-01    2           6        -5   # BR(H+ -> t       bb     )
     7.58624896E-05    2          24        25   # BR(H+ -> W+      h      )
     6.64529367E-13    2          24        36   # BR(H+ -> W+      A      )
     3.76273309E-01    2     1000024   1000022   # BR(H+ -> ~chi_1+ ~chi_10)
     1.12426891E-03    2     1000024   1000023   # BR(H+ -> ~chi_1+ ~chi_20)
     2.17938314E-05    2     1000024   1000025   # BR(H+ -> ~chi_1+ ~chi_30)
