#
#                              ======================
#                              | THE SUSYHIT OUTPUT |
#                              ======================
#
#
#              ------------------------------------------------------
#              |     This is the output of the SUSY-HIT package     |
#              |  created by A.Djouadi, M.Muehlleitner and M.Spira. |
#              |  In case of problems with SUSY-HIT email to        |
#              |           margarete.muehlleitner@kit.edu           |
#              |           michael.spira@psi.ch                     |
#              |           abdelhak.djouadi@cern.ch                 |
#              ------------------------------------------------------
#
#              ------------------------------------------------------
#              |  SUSY Les Houches Accord - MSSM Spectrum + Decays  |
#              |              based on the decay programs           |
#              |                                                    |
#              |                     SDECAY 1.5                     |
#              |                                                    |
#              |  Authors: M.Muhlleitner, A.Djouadi and Y.Mambrini  |
#              |  Ref.:    Comput.Phys.Commun.168(2005)46           |
#              |           [hep-ph/0311167]                         |
#              |                                                    |
#              |                     HDECAY 3.4                     |
#              |                                                    |
#              |  By: A.Djouadi,J.Kalinowski,M.Muhlleitner,M.Spira  |
#              |  Ref.:    Comput.Phys.Commun.108(1998)56           |
#              |           [hep-ph/9704448]                         |
#              |                                                    |
#              |                                                    |
#              |  If not stated otherwise all DRbar couplings and   |
#              |  soft SUSY breaking masses are given at the scale  |
#              |  Q=  0.91187600E+02
#              |                                                    |
#              ------------------------------------------------------
#
#
BLOCK DCINFO  # Decay Program information
     1   SDECAY/HDECAY # decay calculator
     2   1.5  /3.4    # version number
#
BLOCK SPINFO  # Spectrum calculator information
     1   SuSpect     # RGE +Spectrum calculator            
     2   2.43         # version number                     
#
BLOCK MODSEL  # Model selection
     1     2   # GMSB                                              
#
BLOCK SMINPUTS  # Standard Model inputs
         1     1.27932904E+02   # alpha_em^-1(M_Z)^MSbar
         2     1.16639000E-05   # G_F [GeV^-2]
         3     1.17200000E-01   # alpha_S(M_Z)^MSbar
         4     9.11870000E+01   # M_Z pole mass
         5     4.25000000E+00   # mb(mb)^MSbar
         6     1.72900000E+02   # mt pole mass
         7     1.77700000E+00   # mtau pole mass
#
BLOCK MINPAR  # Input parameters - minimal models
#
BLOCK EXTPAR  # Input parameters - non-minimal models
         0     9.11876000E+01   # EWSB                
         1     8.54000000E+02   # M_1                 
         2     3.00000000E+03   # M_2                 
         3     1.60000000E+03   # M_3                 
        11     0.00000000E+00   # A_t                 
        12     0.00000000E+00   # A_b                 
        13     0.00000000E+00   # A_tau               
        14     0.00000000E+00   # A_u                 
        15     0.00000000E+00   # A_d                 
        16     0.00000000E+00   # A_e                 
        23     8.50000000E+02   # mu(EWSB)            
        25     1.50000000E+00   # tanbeta(in)         
        26     2.00000000E+03   # MA_pole             
        31     5.00000000E+03   # M_eL                
        32     5.00000000E+03   # M_muL               
        33     5.00000000E+03   # M_tauL              
        34     5.00000000E+03   # M_eR                
        35     5.00000000E+03   # M_muR               
        36     5.00000000E+03   # M_tauR              
        41     5.00000000E+03   # M_q1L               
        42     5.00000000E+03   # M_q2L               
        43     5.00000000E+03   # M_q3L               
        44     5.00000000E+03   # M_uR                
        45     5.00000000E+03   # M_cR                
        46     5.00000000E+03   # M_tR                
        47     5.00000000E+03   # M_dR                
        48     5.00000000E+03   # M_sR                
        49     5.00000000E+03   # M_bR                
#
BLOCK MASS  # Mass Spectrum
# PDG code           mass       particle
        24     8.05400816E+01   # W+
        25     1.26000000E+02   # h
        35     2.00404123E+03   # H
        36     2.00000000E+03   # A
        37     2.00148065E+03   # H+
         5     4.87877839E+00   # b-quark pole mass calculated from mb(mb)_Msbar
   1000001     4.98044644E+03   # ~d_L
   2000001     4.98033675E+03   # ~d_R
   1000002     4.98020123E+03   # ~u_L
   2000002     4.98025924E+03   # ~u_R
   1000003     4.98044644E+03   # ~s_L
   2000003     4.98033675E+03   # ~s_R
   1000004     4.98020123E+03   # ~c_L
   2000004     4.98025924E+03   # ~c_R
   1000005     4.98003867E+03   # ~b_1
   2000005     4.98074597E+03   # ~b_2
   1000006     5.10641446E+03   # ~t_1
   2000006     5.40419628E+03   # ~t_2
   1000011     5.00008227E+03   # ~e_L
   2000011     5.00007605E+03   # ~e_R
   1000012     4.99984168E+03   # ~nu_eL
   1000013     5.00008227E+03   # ~mu_L
   2000013     5.00007605E+03   # ~mu_R
   1000014     4.99984168E+03   # ~nu_muL
   1000015     4.99985276E+03   # ~tau_1
   2000015     5.00030618E+03   # ~tau_2
   1000016     4.99984168E+03   # ~nu_tauL
   1000021     1.70499589E+03   # ~g
   1000022     8.62237825E+02   # ~chi_10
   1000023    -9.08988677E+02   # ~chi_20
   1000025     9.49386005E+02   # ~chi_30
   1000035     3.12892867E+03   # ~chi_40
   1000024     9.06237316E+02   # ~chi_1+
   1000037     3.12892770E+03   # ~chi_2+
   1000039     1.13125000E-07   # ~gravitino
#
BLOCK NMIX  # Neutralino Mixing Matrix
  1  1     7.10061159E-01   # N_11
  1  2    -2.40815026E-02   # N_12
  1  3     5.00225255E-01   # N_13
  1  4    -4.94982754E-01   # N_14
  2  1     4.81288855E-03   # N_21
  2  2    -3.84922052E-03   # N_22
  2  3    -7.06895581E-01   # N_23
  2  4    -7.07291070E-01   # N_24
  3  1     7.04123212E-01   # N_31
  3  2     2.53043385E-02   # N_32
  3  3    -4.99590020E-01   # N_33
  3  4     5.03964290E-01   # N_34
  4  1     6.99938895E-04   # N_41
  4  2    -9.99382287E-01   # N_42
  4  3    -2.19805515E-02   # N_43
  4  4     2.74118634E-02   # N_44
#
BLOCK UMIX  # Chargino Mixing Matrix U
  1  1    -3.10713541E-02   # U_11
  1  2     9.99517169E-01   # U_12
  2  1     9.99517169E-01   # U_21
  2  2     3.10713541E-02   # U_22
#
BLOCK VMIX  # Chargino Mixing Matrix V
  1  1    -3.87545282E-02   # V_11
  1  2     9.99248761E-01   # V_12
  2  1     9.99248761E-01   # V_21
  2  2     3.87545282E-02   # V_22
#
BLOCK STOPMIX  # Stop Mixing Matrix
  1  1     9.99986925E-01   # cos(theta_t)
  1  2    -5.11369035E-03   # sin(theta_t)
  2  1     5.11369035E-03   # -sin(theta_t)
  2  2     9.99986925E-01   # cos(theta_t)
#
BLOCK SBOTMIX  # Sbottom Mixing Matrix
  1  1     6.49970829E-01   # cos(theta_b)
  1  2     7.59959158E-01   # sin(theta_b)
  2  1    -7.59959158E-01   # -sin(theta_b)
  2  2     6.49970829E-01   # cos(theta_b)
#
BLOCK STAUMIX  # Stau Mixing Matrix
  1  1     7.02237841E-01   # cos(theta_tau)
  1  2     7.11942424E-01   # sin(theta_tau)
  2  1    -7.11942424E-01   # -sin(theta_tau)
  2  2     7.02237841E-01   # cos(theta_tau)
#
BLOCK ALPHA  # Higgs mixing
          -5.90206682E-01   # Mixing angle in the neutral Higgs boson sector
#
BLOCK HMIX Q=  9.11876000E+01  # DRbar Higgs Parameters
         1     8.50000000E+02   # mu(Q)               
         2     1.49999979E+00   # tanbeta(Q)          
         3     2.52037382E+02   # vev(Q)              
         4     3.59716345E+06   # MA^2(Q)             
#
BLOCK GAUGE Q=  9.11876000E+01  # The gauge couplings
     1     3.52850395E-01   # gprime(Q) DRbar
     2     6.27603658E-01   # g(Q) DRbar
     3     1.08402973E+00   # g3(Q) DRbar
#
BLOCK AU Q=  9.11876000E+01  # The trilinear couplings
  1  1     0.00000000E+00   # A_u(Q) DRbar
  2  2     0.00000000E+00   # A_c(Q) DRbar
  3  3     0.00000000E+00   # A_t(Q) DRbar
#
BLOCK AD Q=  9.11876000E+01  # The trilinear couplings
  1  1     0.00000000E+00   # A_d(Q) DRbar
  2  2     0.00000000E+00   # A_s(Q) DRbar
  3  3     0.00000000E+00   # A_b(Q) DRbar
#
BLOCK AE Q=  9.11876000E+01  # The trilinear couplings
  1  1     0.00000000E+00   # A_e(Q) DRbar
  2  2     0.00000000E+00   # A_mu(Q) DRbar
  3  3     0.00000000E+00   # A_tau(Q) DRbar
#
BLOCK Yu Q=  9.11876000E+01  # The Yukawa couplings
  1  1     0.00000000E+00   # y_u(Q) DRbar
  2  2     0.00000000E+00   # y_c(Q) DRbar
  3  3     1.02590143E+00   # y_t(Q) DRbar
#
BLOCK Yd Q=  9.11876000E+01  # The Yukawa couplings
  1  1     0.00000000E+00   # y_d(Q) DRbar
  2  2     0.00000000E+00   # y_s(Q) DRbar
  3  3     2.71960387E-02   # y_b(Q) DRbar
#
BLOCK Ye Q=  9.11876000E+01  # The Yukawa couplings
  1  1     0.00000000E+00   # y_e(Q) DRbar
  2  2     0.00000000E+00   # y_mu(Q) DRbar
  3  3     1.79852926E-02   # y_tau(Q) DRbar
#
BLOCK MSOFT Q=  9.11876000E+01  # The soft SUSY breaking masses at the scale Q
         1     8.54000000E+02   # M_1                 
         2     3.00000000E+03   # M_2                 
         3     1.60000000E+03   # M_3                 
        14     0.00000000E+00   # A_u                 
        15     0.00000000E+00   # A_d                 
        16     0.00000000E+00   # A_e                 
        21     2.24370468E+06   # M^2_Hd              
        22    -6.12814008E+06   # M^2_Hu              
        31     5.00000000E+03   # M_eL                
        32     5.00000000E+03   # M_muL               
        33     5.00000000E+03   # M_tauL              
        34     5.00000000E+03   # M_eR                
        35     5.00000000E+03   # M_muR               
        36     5.00000000E+03   # M_tauR              
        41     5.00000000E+03   # M_q1L               
        42     5.00000000E+03   # M_q2L               
        43     5.00000000E+03   # M_q3L               
        44     5.00000000E+03   # M_uR                
        45     5.00000000E+03   # M_cR                
        46     5.00000000E+03   # M_tR                
        47     5.00000000E+03   # M_dR                
        48     5.00000000E+03   # M_sR                
        49     5.00000000E+03   # M_bR                
#
#
#
#                             =================
#                             |The decay table|
#                             =================
#
# - The QCD corrections to the decays gluino -> squark  + quark
#                                     squark -> gaugino + quark_prime
#                                     squark -> squark_prime + Higgs
#                                     squark -> gluino  + quark
#   are included.
#
# - The multi-body decays for the inos, stops and sbottoms are included.
#
# - The loop induced decays for the gluino, neutralinos and stops
#   are included.
#
# - The SUSY decays of the top quark are included.
#
# - Possible decays of the NLSP in GMSB models are included.
#
#
#         PDG            Width
DECAY         6     1.37240107E+00   # top decays
#          BR         NDA      ID1       ID2
     1.00000000E+00    2           5        24   # BR(t ->  b    W+)
#
#         PDG            Width
DECAY   1000021     1.84860492E-04   # gluino decays
#          BR         NDA      ID1       ID2
     1.89497832E-02    2     1000022        21   # BR(~g -> ~chi_10 g)
     3.41875379E-02    2     1000023        21   # BR(~g -> ~chi_20 g)
     1.52231309E-02    2     1000025        21   # BR(~g -> ~chi_30 g)
#          BR         NDA      ID1       ID2
     7.01199828E-06    2     1000039        21   # BR(~g -> ~G      g)
#           BR         NDA      ID1       ID2       ID3
     7.57471081E-03    3     1000022         1        -1   # BR(~g -> ~chi_10 d  db)
     6.17550908E-07    3     1000023         1        -1   # BR(~g -> ~chi_20 d  db)
     4.23455115E-03    3     1000025         1        -1   # BR(~g -> ~chi_30 d  db)
     2.34097651E-02    3     1000022         2        -2   # BR(~g -> ~chi_10 u  ub)
     5.19011018E-07    3     1000023         2        -2   # BR(~g -> ~chi_20 u  ub)
     1.58541660E-02    3     1000025         2        -2   # BR(~g -> ~chi_30 u  ub)
     7.57471081E-03    3     1000022         3        -3   # BR(~g -> ~chi_10 s  sb)
     6.17550908E-07    3     1000023         3        -3   # BR(~g -> ~chi_20 s  sb)
     4.23455115E-03    3     1000025         3        -3   # BR(~g -> ~chi_30 s  sb)
     2.34097651E-02    3     1000022         4        -4   # BR(~g -> ~chi_10 c  cb)
     5.19011018E-07    3     1000023         4        -4   # BR(~g -> ~chi_20 c  cb)
     1.58541660E-02    3     1000025         4        -4   # BR(~g -> ~chi_30 c  cb)
     7.67848642E-03    3     1000022         5        -5   # BR(~g -> ~chi_10 b  bb)
     2.48159142E-04    3     1000023         5        -5   # BR(~g -> ~chi_20 b  bb)
     4.36389956E-03    3     1000025         5        -5   # BR(~g -> ~chi_30 b  bb)
     1.04815827E-01    3     1000022         6        -6   # BR(~g -> ~chi_10 t  tb)
     1.46768529E-01    3     1000023         6        -6   # BR(~g -> ~chi_20 t  tb)
     9.47859646E-02    3     1000025         6        -6   # BR(~g -> ~chi_30 t  tb)
     1.58649960E-04    3     1000024         1        -2   # BR(~g -> ~chi_1+ d  ub)
     1.58649960E-04    3    -1000024         2        -1   # BR(~g -> ~chi_1- u  db)
     1.58649960E-04    3     1000024         3        -4   # BR(~g -> ~chi_1+ s  cb)
     1.58649960E-04    3    -1000024         4        -3   # BR(~g -> ~chi_1- c  sb)
     2.35094206E-01    3     1000024         5        -6   # BR(~g -> ~chi_1+ b  tb)
     2.35094206E-01    3    -1000024         6        -5   # BR(~g -> ~chi_1- t  bb)
#
#         PDG            Width
DECAY   1000006     3.06080215E+02   # stop1 decays
#          BR         NDA      ID1       ID2
     5.48707936E-02    2     1000022         6   # BR(~t_1 -> ~chi_10 t )
     1.12389773E-01    2     1000023         6   # BR(~t_1 -> ~chi_20 t )
     5.93813727E-02    2     1000025         6   # BR(~t_1 -> ~chi_30 t )
     2.48665036E-02    2     1000035         6   # BR(~t_1 -> ~chi_40 t )
     3.12498465E-05    2     1000024         5   # BR(~t_1 -> ~chi_1+ b )
     4.94802207E-02    2     1000037         5   # BR(~t_1 -> ~chi_2+ b )
     6.83714429E-01    2     1000021         6   # BR(~t_1 -> ~g      t )
     6.55435865E-03    2     1000005        24   # BR(~t_1 -> ~b_1    W+)
     8.71129863E-03    2     2000005        24   # BR(~t_1 -> ~b_2    W+)
#
#         PDG            Width
DECAY   2000006     3.82767515E+02   # stop2 decays
#          BR         NDA      ID1       ID2
     6.25362887E-02    2     1000022         6   # BR(~t_2 -> ~chi_10 t )
     9.62750202E-02    2     1000023         6   # BR(~t_2 -> ~chi_20 t )
     6.18516243E-02    2     1000025         6   # BR(~t_2 -> ~chi_30 t )
    -4.54356506E-06    2     1000035         6   # BR(~t_2 -> ~chi_40 t )
     1.92819073E-01    2     1000024         5   # BR(~t_2 -> ~chi_1+ b )
    -8.70550119E-06    2     1000037         5   # BR(~t_2 -> ~chi_2+ b )
     5.86581816E-01    2     1000021         6   # BR(~t_2 -> ~g      t )
    -7.25525166E-05    2     1000006        25   # BR(~t_2 -> ~t_1    h )
     3.53530846E-06    2     1000006        23   # BR(~t_2 -> ~t_1    Z )
     7.79975283E-06    2     1000005        24   # BR(~t_2 -> ~b_1    W+)
     1.06441891E-05    2     2000005        24   # BR(~t_2 -> ~b_2    W+)
#
#         PDG            Width
DECAY   1000005     2.36212183E+02   # sbottom1 decays
#          BR         NDA      ID1       ID2
     4.90051022E-03    2     1000022         5   # BR(~b_1 -> ~chi_10 b )
     8.35167154E-05    2     1000023         5   # BR(~b_1 -> ~chi_20 b )
     2.92155109E-03    2     1000025         5   # BR(~b_1 -> ~chi_30 b )
     1.07657037E-02    2     1000035         5   # BR(~b_1 -> ~chi_40 b )
     9.82477025E-02    2    -1000024         6   # BR(~b_1 -> ~chi_1- t )
     2.16376862E-02    2    -1000037         6   # BR(~b_1 -> ~chi_2- t )
     8.61443330E-01    2     1000021         5   # BR(~b_1 -> ~g      b )
#
#         PDG            Width
DECAY   2000005     2.61641547E+02   # sbottom2 decays
#          BR         NDA      ID1       ID2
     2.13978634E-03    2     1000022         5   # BR(~b_2 -> ~chi_10 b )
     1.07388142E-04    2     1000023         5   # BR(~b_2 -> ~chi_20 b )
     2.87157957E-03    2     1000025         5   # BR(~b_2 -> ~chi_30 b )
     1.67567568E-02    2     1000035         5   # BR(~b_2 -> ~chi_40 b )
     1.67080393E-01    2    -1000024         6   # BR(~b_2 -> ~chi_1- t )
     3.36884931E-02    2    -1000037         6   # BR(~b_2 -> ~chi_2- t )
     7.77355603E-01    2     1000021         5   # BR(~b_2 -> ~g      b )
#
#         PDG            Width
DECAY   1000002     2.24888165E+02   # sup_L decays
#          BR         NDA      ID1       ID2
     9.36422696E-04    2     1000022         2   # BR(~u_L -> ~chi_10 u)
     6.80094835E-07    2     1000023         2   # BR(~u_L -> ~chi_20 u)
     1.92427710E-03    2     1000025         2   # BR(~u_L -> ~chi_30 u)
     3.07805471E-02    2     1000035         2   # BR(~u_L -> ~chi_40 u)
     2.35282033E-04    2     1000024         1   # BR(~u_L -> ~chi_1+ d)
     6.15608536E-02    2     1000037         1   # BR(~u_L -> ~chi_2+ d)
     9.04561937E-01    2     1000021         2   # BR(~u_L -> ~g      u)
#
#         PDG            Width
DECAY   2000002     2.13327208E+02   # sup_R decays
#          BR         NDA      ID1       ID2
     2.35460029E-02    2     1000022         2   # BR(~u_R -> ~chi_10 u)
     1.07438369E-06    2     1000023         2   # BR(~u_R -> ~chi_20 u)
     2.28525552E-02    2     1000025         2   # BR(~u_R -> ~chi_30 u)
     8.94692003E-09    2     1000035         2   # BR(~u_R -> ~chi_40 u)
     9.53600359E-01    2     1000021         2   # BR(~u_R -> ~g      u)
#
#         PDG            Width
DECAY   1000001     2.24893163E+02   # sdown_L decays
#          BR         NDA      ID1       ID2
     1.94698486E-03    2     1000022         1   # BR(~d_L -> ~chi_10 d)
     1.76747263E-06    2     1000023         1   # BR(~d_L -> ~chi_20 d)
     8.85079443E-04    2     1000025         1   # BR(~d_L -> ~chi_30 d)
     3.08014646E-02    2     1000035         1   # BR(~d_L -> ~chi_40 d)
     1.51244299E-04    2    -1000024         2   # BR(~d_L -> ~chi_1- u)
     6.16034358E-02    2    -1000037         2   # BR(~d_L -> ~chi_2- u)
     9.04610023E-01    2     1000021         1   # BR(~d_L -> ~g      d)
#
#         PDG            Width
DECAY   2000001     2.05908370E+02   # sdown_R decays
#          BR         NDA      ID1       ID2
     6.09869745E-03    2     1000022         1   # BR(~d_R -> ~chi_10 d)
     2.78278337E-07    2     1000023         1   # BR(~d_R -> ~chi_20 d)
     5.91908867E-03    2     1000025         1   # BR(~d_R -> ~chi_30 d)
     2.31744827E-09    2     1000035         1   # BR(~d_R -> ~chi_40 d)
     9.87981933E-01    2     1000021         1   # BR(~d_R -> ~g      d)
#
#         PDG            Width
DECAY   1000004     2.24888165E+02   # scharm_L decays
#          BR         NDA      ID1       ID2
     9.36422696E-04    2     1000022         4   # BR(~c_L -> ~chi_10 c)
     6.80094835E-07    2     1000023         4   # BR(~c_L -> ~chi_20 c)
     1.92427710E-03    2     1000025         4   # BR(~c_L -> ~chi_30 c)
     3.07805471E-02    2     1000035         4   # BR(~c_L -> ~chi_40 c)
     2.35282033E-04    2     1000024         3   # BR(~c_L -> ~chi_1+ s)
     6.15608536E-02    2     1000037         3   # BR(~c_L -> ~chi_2+ s)
     9.04561937E-01    2     1000021         4   # BR(~c_L -> ~g      c)
#
#         PDG            Width
DECAY   2000004     2.13327208E+02   # scharm_R decays
#          BR         NDA      ID1       ID2
     2.35460029E-02    2     1000022         4   # BR(~c_R -> ~chi_10 c)
     1.07438369E-06    2     1000023         4   # BR(~c_R -> ~chi_20 c)
     2.28525552E-02    2     1000025         4   # BR(~c_R -> ~chi_30 c)
     8.94692003E-09    2     1000035         4   # BR(~c_R -> ~chi_40 c)
     9.53600359E-01    2     1000021         4   # BR(~c_R -> ~g      c)
#
#         PDG            Width
DECAY   1000003     2.24893163E+02   # sstrange_L decays
#          BR         NDA      ID1       ID2
     1.94698486E-03    2     1000022         3   # BR(~s_L -> ~chi_10 s)
     1.76747263E-06    2     1000023         3   # BR(~s_L -> ~chi_20 s)
     8.85079443E-04    2     1000025         3   # BR(~s_L -> ~chi_30 s)
     3.08014646E-02    2     1000035         3   # BR(~s_L -> ~chi_40 s)
     1.51244299E-04    2    -1000024         4   # BR(~s_L -> ~chi_1- c)
     6.16034358E-02    2    -1000037         4   # BR(~s_L -> ~chi_2- c)
     9.04610023E-01    2     1000021         3   # BR(~s_L -> ~g      s)
#
#         PDG            Width
DECAY   2000003     2.05908370E+02   # sstrange_R decays
#          BR         NDA      ID1       ID2
     6.09869745E-03    2     1000022         3   # BR(~s_R -> ~chi_10 s)
     2.78278337E-07    2     1000023         3   # BR(~s_R -> ~chi_20 s)
     5.91908867E-03    2     1000025         3   # BR(~s_R -> ~chi_30 s)
     2.31744827E-09    2     1000035         3   # BR(~s_R -> ~chi_40 s)
     9.87981933E-01    2     1000021         3   # BR(~s_R -> ~g      s)
#
#         PDG            Width
DECAY   1000011     2.75859516E+01   # selectron_L decays
#          BR         NDA      ID1       ID2
     9.40801629E-02    2     1000022        11   # BR(~e_L -> ~chi_10 e-)
     8.67977891E-07    2     1000023        11   # BR(~e_L -> ~chi_20 e-)
     1.17055927E-01    2     1000025        11   # BR(~e_L -> ~chi_30 e-)
     2.62341602E-01    2     1000035        11   # BR(~e_L -> ~chi_40 e-)
     1.28262200E-03    2    -1000024        12   # BR(~e_L -> ~chi_1- nu_e)
     5.25238818E-01    2    -1000037        12   # BR(~e_L -> ~chi_2- nu_e)
#
#         PDG            Width
DECAY   2000011     2.31682778E+01   # selectron_R decays
#          BR         NDA      ID1       ID2
     5.07451379E-01    2     1000022        11   # BR(~e_R -> ~chi_10 e-)
     2.31549788E-05    2     1000023        11   # BR(~e_R -> ~chi_20 e-)
     4.92525272E-01    2     1000025        11   # BR(~e_R -> ~chi_30 e-)
     1.93878108E-07    2     1000035        11   # BR(~e_R -> ~chi_40 e-)
#
#         PDG            Width
DECAY   1000013     2.75859516E+01   # smuon_L decays
#          BR         NDA      ID1       ID2
     9.40801629E-02    2     1000022        13   # BR(~mu_L -> ~chi_10 mu-)
     8.67977891E-07    2     1000023        13   # BR(~mu_L -> ~chi_20 mu-)
     1.17055927E-01    2     1000025        13   # BR(~mu_L -> ~chi_30 mu-)
     2.62341602E-01    2     1000035        13   # BR(~mu_L -> ~chi_40 mu-)
     1.28262200E-03    2    -1000024        14   # BR(~mu_L -> ~chi_1- nu_mu)
     5.25238818E-01    2    -1000037        14   # BR(~mu_L -> ~chi_2- nu_mu)
#
#         PDG            Width
DECAY   2000013     2.31682778E+01   # smuon_R decays
#          BR         NDA      ID1       ID2
     5.07451379E-01    2     1000022        13   # BR(~mu_R -> ~chi_10 mu-)
     2.31549788E-05    2     1000023        13   # BR(~mu_R -> ~chi_20 mu-)
     4.92525272E-01    2     1000025        13   # BR(~mu_R -> ~chi_30 mu-)
     1.93878108E-07    2     1000035        13   # BR(~mu_R -> ~chi_40 mu-)
#
#         PDG            Width
DECAY   1000015     2.54226557E+01   # stau_1 decays
#          BR         NDA      ID1       ID2
     2.91276702E-01    2     1000022        15   # BR(~tau_1 -> ~chi_10  tau-)
     4.67247747E-04    2     1000023        15   # BR(~tau_1 -> ~chi_20  tau-)
     2.85082889E-01    2     1000025        15   # BR(~tau_1 -> ~chi_30  tau-)
     1.40102405E-01    2     1000035        15   # BR(~tau_1 -> ~chi_40  tau-)
     2.56856764E-03    2    -1000024        16   # BR(~tau_1 -> ~chi_1-  nu_tau)
     2.80502178E-01    2    -1000037        16   # BR(~tau_1 -> ~chi_2-  nu_tau)
     1.10569254E-08    2     1000039        15   # BR(~tau_1 -> ~G       tau-)
#
#         PDG            Width
DECAY   2000015     2.54218191E+01   # stau_2 decays
#          BR         NDA      ID1       ID2
     2.73864688E-01    2     1000022        15   # BR(~tau_2 -> ~chi_10  tau-)
     7.37485773E-04    2     1000023        15   # BR(~tau_2 -> ~chi_20  tau-)
     2.91382441E-01    2     1000025        15   # BR(~tau_2 -> ~chi_30  tau-)
     1.44568402E-01    2     1000035        15   # BR(~tau_2 -> ~chi_40  tau-)
     5.80525150E-06    2    -1000024        16   # BR(~tau_2 -> ~chi_1-  nu_tau)
     2.89441178E-01    2    -1000037        16   # BR(~tau_2 -> ~chi_2-  nu_tau)
#
#         PDG            Width
DECAY   1000012     2.75857533E+01   # snu_eL decays
#          BR         NDA      ID1       ID2
     1.19783454E-01    2     1000022        12   # BR(~nu_eL -> ~chi_10 nu_e)
     2.85304729E-05    2     1000023        12   # BR(~nu_eL -> ~chi_20 nu_e)
     9.06106736E-02    2     1000025        12   # BR(~nu_eL -> ~chi_30 nu_e)
     2.62711823E-01    2     1000035        12   # BR(~nu_eL -> ~chi_40 nu_e)
     1.99527433E-03    2     1000024        11   # BR(~nu_eL -> ~chi_1+ e-)
     5.24870244E-01    2     1000037        11   # BR(~nu_eL -> ~chi_2+ e-)
#
#         PDG            Width
DECAY   1000014     2.75857533E+01   # snu_muL decays
#          BR         NDA      ID1       ID2
     1.19783454E-01    2     1000022        14   # BR(~nu_muL -> ~chi_10 nu_mu)
     2.85304729E-05    2     1000023        14   # BR(~nu_muL -> ~chi_20 nu_mu)
     9.06106736E-02    2     1000025        14   # BR(~nu_muL -> ~chi_30 nu_mu)
     2.62711823E-01    2     1000035        14   # BR(~nu_muL -> ~chi_40 nu_mu)
     1.99527433E-03    2     1000024        13   # BR(~nu_muL -> ~chi_1+ mu-)
     5.24870244E-01    2     1000037        13   # BR(~nu_muL -> ~chi_2+ mu-)
#
#         PDG            Width
DECAY   1000016     2.76158298E+01   # snu_tauL decays
#          BR         NDA      ID1       ID2
     1.19652998E-01    2     1000022        16   # BR(~nu_tauL -> ~chi_10 nu_tau)
     2.84994004E-05    2     1000023        16   # BR(~nu_tauL -> ~chi_20 nu_tau)
     9.05119894E-02    2     1000025        16   # BR(~nu_tauL -> ~chi_30 nu_tau)
     2.62425704E-01    2     1000035        16   # BR(~nu_tauL -> ~chi_40 nu_tau)
     3.08146020E-03    2     1000024        15   # BR(~nu_tauL -> ~chi_1+ tau-)
     5.24299349E-01    2     1000037        15   # BR(~nu_tauL -> ~chi_2+ tau-)
#
#         PDG            Width
DECAY   1000024     1.02989589E-04   # chargino1+ decays
#          BR         NDA      ID1       ID2
     2.59217544E-07    2     1000039        24   # BR(~chi_1+ -> ~G       W+)
#           BR         NDA      ID1       ID2       ID3
     3.33631412E-01    3     1000022         2        -1   # BR(~chi_1+ -> ~chi_10 u    db)
     3.33631412E-01    3     1000022         4        -3   # BR(~chi_1+ -> ~chi_10 c    sb)
     1.11210603E-01    3     1000022       -11        12   # BR(~chi_1+ -> ~chi_10 e+   nu_e)
     1.11210603E-01    3     1000022       -13        14   # BR(~chi_1+ -> ~chi_10 mu+  nu_mu)
     1.10315711E-01    3     1000022       -15        16   # BR(~chi_1+ -> ~chi_10 tau+ nu_tau)
#
#         PDG            Width
DECAY   1000037     3.66896606E+01   # chargino2+ decays
#          BR         NDA      ID1       ID2
     2.44817530E-01    2     1000024        23   # BR(~chi_2+ -> ~chi_1+  Z )
     1.11795956E-01    2     1000022        24   # BR(~chi_2+ -> ~chi_10  W+)
     2.38470266E-01    2     1000023        24   # BR(~chi_2+ -> ~chi_20  W+)
     1.26871802E-01    2     1000025        24   # BR(~chi_2+ -> ~chi_30  W+)
     2.45923556E-01    2     1000024        25   # BR(~chi_2+ -> ~chi_1+  h )
     7.91427184E-03    2     1000024        35   # BR(~chi_2+ -> ~chi_1+  H )
     8.12840309E-03    2     1000024        36   # BR(~chi_2+ -> ~chi_1+  A )
     4.83739506E-03    2     1000022        37   # BR(~chi_2+ -> ~chi_10  H+)
     7.96656932E-03    2     1000023        37   # BR(~chi_2+ -> ~chi_20  H+)
     3.27424965E-03    2     1000025        37   # BR(~chi_2+ -> ~chi_30  H+)
     7.33073182E-10    2     1000039        24   # BR(~chi_2+ -> ~G       W+)
     5.06491697E-14    2     1000039        37   # BR(~chi_2+ -> ~G       H+)
#
#         PDG            Width
DECAY   1000022     3.14705124E-11   # neutralino1 decays
#          BR         NDA      ID1       ID2
     5.02209678E-01    2     1000039        22   # BR(~chi_10 -> ~G        gam)
     4.86761910E-01    2     1000039        23   # BR(~chi_10 -> ~G        Z)
     1.10284120E-02    2     1000039        25   # BR(~chi_10 -> ~G        h)
#
#         PDG            Width
DECAY   1000023     1.12690550E-04   # neutralino2 decays
#          BR         NDA      ID1       ID2
     3.12314856E-04    2     1000022        22   # BR(~chi_20 -> ~chi_10 gam)
#          BR         NDA      ID1       ID2
     2.64108391E-12    2     1000039        22   # BR(~chi_20 -> ~G        gam)
     9.19034182E-09    2     1000039        23   # BR(~chi_20 -> ~G        Z)
     2.20607095E-07    2     1000039        25   # BR(~chi_20 -> ~G        h)
#           BR         NDA      ID1       ID2       ID3
     1.18764192E-01    3     1000022        -2         2   # BR(~chi_20 -> ~chi_10 ub      u)
     1.53766267E-01    3     1000022        -1         1   # BR(~chi_20 -> ~chi_10 db      d)
     1.18764192E-01    3     1000022        -4         4   # BR(~chi_20 -> ~chi_10 cb      c)
     1.53766267E-01    3     1000022        -3         3   # BR(~chi_20 -> ~chi_10 sb      s)
     1.39321666E-01    3     1000022        -5         5   # BR(~chi_20 -> ~chi_10 bb      b)
     3.51104702E-02    3     1000022       -11        11   # BR(~chi_20 -> ~chi_10 e+      e-)
     3.51104702E-02    3     1000022       -13        13   # BR(~chi_20 -> ~chi_10 mu+     mu-)
     3.47423613E-02    3     1000022       -15        15   # BR(~chi_20 -> ~chi_10 tau+    tau-)
     7.01129246E-02    3     1000022       -12        12   # BR(~chi_20 -> ~chi_10 nu_eb   nu_e)
     7.01129246E-02    3     1000022       -14        14   # BR(~chi_20 -> ~chi_10 nu_mub  nu_mu)
     7.01129246E-02    3     1000022       -16        16   # BR(~chi_20 -> ~chi_10 nu_taub nu_tau)
     5.17290504E-07    3     1000024        -2         1   # BR(~chi_20 -> ~chi_1+ ub      d)
     5.17290504E-07    3    -1000024        -1         2   # BR(~chi_20 -> ~chi_1- db      u)
     5.17290504E-07    3     1000024        -4         3   # BR(~chi_20 -> ~chi_1+ cb      s)
     5.17290504E-07    3    -1000024        -3         4   # BR(~chi_20 -> ~chi_1- sb      c)
     1.72430180E-07    3     1000024       -12        11   # BR(~chi_20 -> ~chi_1+ nu_eb   e-)
     1.72430180E-07    3    -1000024        12       -11   # BR(~chi_20 -> ~chi_1- nu_e    e+)
     1.72430180E-07    3     1000024       -14        13   # BR(~chi_20 -> ~chi_1+ nu_mub  mu-)
     1.72430180E-07    3    -1000024        14       -13   # BR(~chi_20 -> ~chi_1- nu_mu   mu+)
     1.89306406E-08    3     1000024       -16        15   # BR(~chi_20 -> ~chi_1+ nu_taub tau-)
     1.89306406E-08    3    -1000024        16       -15   # BR(~chi_20 -> ~chi_1- nu_tau  tau+)
#
#         PDG            Width
DECAY   1000025     2.42647804E-04   # neutralino3 decays
#          BR         NDA      ID1       ID2
     3.46045554E-04    2     1000022        22   # BR(~chi_30 -> ~chi_10 gam)
     3.77830370E-04    2     1000023        22   # BR(~chi_30 -> ~chi_20 gam)
#          BR         NDA      ID1       ID2
     1.12122671E-07    2     1000039        22   # BR(~chi_30 -> ~G        gam)
     9.55780704E-08    2     1000039        23   # BR(~chi_30 -> ~G        Z)
     2.63510587E-09    2     1000039        25   # BR(~chi_30 -> ~G        h)
#           BR         NDA      ID1       ID2       ID3
     1.02467118E-05    3     1000022        -2         2   # BR(~chi_30 -> ~chi_10 ub      u)
     1.22754556E-05    3     1000022        -1         1   # BR(~chi_30 -> ~chi_10 db      d)
     1.02467118E-05    3     1000022        -4         4   # BR(~chi_30 -> ~chi_10 cb      c)
     1.22754556E-05    3     1000022        -3         3   # BR(~chi_30 -> ~chi_10 sb      s)
     1.59742825E-05    3     1000022        -5         5   # BR(~chi_30 -> ~chi_10 bb      b)
     2.19024559E-06    3     1000022       -11        11   # BR(~chi_30 -> ~chi_10 e+      e-)
     2.19024559E-06    3     1000022       -13        13   # BR(~chi_30 -> ~chi_10 mu+     mu-)
     2.77610866E-06    3     1000022       -15        15   # BR(~chi_30 -> ~chi_10 tau+    tau-)
     5.97316752E-06    3     1000022       -12        12   # BR(~chi_30 -> ~chi_10 nu_eb   nu_e)
     5.97316752E-06    3     1000022       -14        14   # BR(~chi_30 -> ~chi_10 nu_mub  nu_mu)
     5.97316752E-06    3     1000022       -16        16   # BR(~chi_30 -> ~chi_10 nu_taub nu_tau)
     2.61471253E-02    3     1000023        -2         2   # BR(~chi_30 -> ~chi_20 ub      u)
     3.38532496E-02    3     1000023        -1         1   # BR(~chi_30 -> ~chi_20 db      d)
     2.61471253E-02    3     1000023        -4         4   # BR(~chi_30 -> ~chi_20 cb      c)
     3.38532496E-02    3     1000023        -3         3   # BR(~chi_30 -> ~chi_20 sb      s)
     2.97175974E-02    3     1000023        -5         5   # BR(~chi_30 -> ~chi_20 bb      b)
     7.72996671E-03    3     1000023       -11        11   # BR(~chi_30 -> ~chi_20 e+      e-)
     7.72996671E-03    3     1000023       -13        13   # BR(~chi_30 -> ~chi_20 mu+     mu-)
     7.62928095E-03    3     1000023       -15        15   # BR(~chi_30 -> ~chi_20 tau+    tau-)
     1.54360199E-02    3     1000023       -12        12   # BR(~chi_30 -> ~chi_20 nu_eb   nu_e)
     1.54360199E-02    3     1000023       -14        14   # BR(~chi_30 -> ~chi_20 nu_mub  nu_mu)
     1.54360199E-02    3     1000023       -16        16   # BR(~chi_30 -> ~chi_20 nu_taub nu_tau)
     1.30133478E-01    3     1000024        -2         1   # BR(~chi_30 -> ~chi_1+ ub      d)
     1.30133478E-01    3    -1000024        -1         2   # BR(~chi_30 -> ~chi_1- db      u)
     1.30133478E-01    3     1000024        -4         3   # BR(~chi_30 -> ~chi_1+ cb      s)
     1.30133478E-01    3    -1000024        -3         4   # BR(~chi_30 -> ~chi_1- sb      c)
     4.33777573E-02    3     1000024       -12        11   # BR(~chi_30 -> ~chi_1+ nu_eb   e-)
     4.33777573E-02    3    -1000024        12       -11   # BR(~chi_30 -> ~chi_1- nu_e    e+)
     4.33777573E-02    3     1000024       -14        13   # BR(~chi_30 -> ~chi_1+ nu_mub  mu-)
     4.33777573E-02    3    -1000024        14       -13   # BR(~chi_30 -> ~chi_1- nu_mu   mu+)
     4.30146279E-02    3     1000024       -16        15   # BR(~chi_30 -> ~chi_1+ nu_taub tau-)
     4.30146279E-02    3    -1000024        16       -15   # BR(~chi_30 -> ~chi_1- nu_tau  tau+)
#
#         PDG            Width
DECAY   1000035     3.66900540E+01   # neutralino4 decays
#          BR         NDA      ID1       ID2
     1.35472523E-03    2     1000022        23   # BR(~chi_40 -> ~chi_10   Z )
     2.41965772E-01    2     1000023        23   # BR(~chi_40 -> ~chi_20   Z )
     1.55837301E-03    2     1000025        23   # BR(~chi_40 -> ~chi_30   Z )
     2.38395224E-01    2     1000024       -24   # BR(~chi_40 -> ~chi_1+   W-)
     2.38395224E-01    2    -1000024        24   # BR(~chi_40 -> ~chi_1-   W+)
     1.13985605E-01    2     1000022        25   # BR(~chi_40 -> ~chi_10   h )
     1.46286850E-03    2     1000022        35   # BR(~chi_40 -> ~chi_10   H )
     3.34373296E-03    2     1000022        36   # BR(~chi_40 -> ~chi_10   A )
     2.88112376E-03    2     1000023        25   # BR(~chi_40 -> ~chi_20   h )
     5.11823903E-03    2     1000023        35   # BR(~chi_40 -> ~chi_20   H )
     2.78480473E-03    2     1000023        36   # BR(~chi_40 -> ~chi_20   A )
     1.29343263E-01    2     1000025        25   # BR(~chi_40 -> ~chi_30   h )
     1.23219947E-03    2     1000025        35   # BR(~chi_40 -> ~chi_30   H )
     2.01575234E-03    2     1000025        36   # BR(~chi_40 -> ~chi_30   A )
     8.08154616E-03    2     1000024       -37   # BR(~chi_40 -> ~chi_1+   H-)
     8.08154616E-03    2    -1000024        37   # BR(~chi_40 -> ~chi_1-   H+)
     1.75956205E-10    2     1000039        22   # BR(~chi_40 -> ~G        gam)
     5.57048504E-10    2     1000039        23   # BR(~chi_40 -> ~G        Z)
     4.05939695E-14    2     1000039        25   # BR(~chi_40 -> ~G        h)
     4.99759452E-14    2     1000039        35   # BR(~chi_40 -> ~G        H)
     4.27740364E-16    2     1000039        36   # BR(~chi_40 -> ~G        A)
#
#         PDG            Width
DECAY        25     4.21838589E-03   # h decays
#          BR         NDA      ID1       ID2
     6.01847887E-01    2           5        -5   # BR(h -> b       bb     )
     6.22392370E-02    2         -15        15   # BR(h -> tau+    tau-   )
     2.20299765E-04    2         -13        13   # BR(h -> mu+     mu-    )
     4.66111592E-04    2           3        -3   # BR(h -> s       sb     )
     2.01085860E-02    2           4        -4   # BR(h -> c       cb     )
     6.64076785E-02    2          21        21   # BR(h -> g       g      )
     2.30854379E-03    2          22        22   # BR(h -> gam     gam    )
     1.62656894E-03    2          22        23   # BR(h -> Z       gam    )
     2.16694318E-01    2          24       -24   # BR(h -> W+      W-     )
     2.80807699E-02    2          23        23   # BR(h -> Z       Z      )
#
#         PDG            Width
DECAY        35     3.88094372E+01   # H decays
#          BR         NDA      ID1       ID2
     1.43425173E-03    2           5        -5   # BR(H -> b       bb     )
     2.40084505E-04    2         -15        15   # BR(H -> tau+    tau-   )
     8.48788109E-07    2         -13        13   # BR(H -> mu+     mu-    )
     1.08675642E-06    2           3        -3   # BR(H -> s       sb     )
     9.80787031E-06    2           4        -4   # BR(H -> c       cb     )
     9.70444239E-01    2           6        -6   # BR(H -> t       tb     )
     7.77242226E-04    2          21        21   # BR(H -> g       g      )
     2.63847938E-06    2          22        22   # BR(H -> gam     gam    )
     1.12987817E-06    2          23        22   # BR(H -> Z       gam    )
     3.27409154E-04    2          24       -24   # BR(H -> W+      W-     )
     1.63258041E-04    2          23        23   # BR(H -> Z       Z      )
     8.81063902E-04    2          25        25   # BR(H -> h       h      )
     7.51508691E-24    2          36        36   # BR(H -> A       A      )
     2.99679854E-11    2          23        36   # BR(H -> Z       A      )
     7.45692416E-12    2          24       -37   # BR(H -> W+      H-     )
     7.45692416E-12    2         -24        37   # BR(H -> W-      H+     )
     7.58538761E-06    2     1000024  -1000024   # BR(H -> ~chi_1+ ~chi_1-)
     1.83613491E-04    2     1000022   1000022   # BR(H -> ~chi_10 ~chi_10)
     1.29299644E-06    2     1000023   1000023   # BR(H -> ~chi_20 ~chi_20)
     3.16580971E-05    2     1000025   1000025   # BR(H -> ~chi_30 ~chi_30)
     1.58323433E-02    2     1000022   1000023   # BR(H -> ~chi_10 ~chi_20)
     4.54546057E-07    2     1000022   1000025   # BR(H -> ~chi_10 ~chi_30)
     9.65999218E-03    2     1000023   1000025   # BR(H -> ~chi_20 ~chi_30)
#
#         PDG            Width
DECAY        36     3.92442004E+01   # A decays
#          BR         NDA      ID1       ID2
     1.43722650E-03    2           5        -5   # BR(A -> b       bb     )
     2.37645723E-04    2         -15        15   # BR(A -> tau+    tau-   )
     8.40163481E-07    2         -13        13   # BR(A -> mu+     mu-    )
     1.10763426E-06    2           3        -3   # BR(A -> s       sb     )
     9.70640811E-06    2           4        -4   # BR(A -> c       cb     )
     9.71439313E-01    2           6        -6   # BR(A -> t       tb     )
     9.19485765E-04    2          21        21   # BR(A -> g       g      )
     2.99653078E-06    2          22        22   # BR(A -> gam     gam    )
     1.31759563E-06    2          23        22   # BR(A -> Z       gam    )
     3.19084819E-04    2          23        25   # BR(A -> Z       h      )
     4.48649636E-04    2     1000024  -1000024   # BR(A -> ~chi_1+ ~chi_1-)
     1.68696073E-02    2     1000022   1000022   # BR(A -> ~chi_10 ~chi_10)
     2.84532084E-07    2     1000023   1000023   # BR(A -> ~chi_20 ~chi_20)
     8.00255984E-03    2     1000025   1000025   # BR(A -> ~chi_30 ~chi_30)
     1.19364450E-04    2     1000022   1000023   # BR(A -> ~chi_10 ~chi_20)
     1.32910110E-04    2     1000022   1000025   # BR(A -> ~chi_10 ~chi_30)
     5.79000559E-05    2     1000023   1000025   # BR(A -> ~chi_20 ~chi_30)
#
#         PDG            Width
DECAY        37     3.84329434E+01   # H+ decays
#          BR         NDA      ID1       ID2
     2.30586731E-06    2           4        -5   # BR(H+ -> c       bb     )
     2.42841688E-04    2         -15        16   # BR(H+ -> tau+    nu_tau )
     8.58533090E-07    2         -13        14   # BR(H+ -> mu+     nu_mu  )
     1.46602275E-08    2           2        -5   # BR(H+ -> u       bb     )
     5.31691803E-08    2           2        -3   # BR(H+ -> u       sb     )
     1.05941609E-05    2           4        -3   # BR(H+ -> c       sb     )
     9.73760429E-01    2           6        -5   # BR(H+ -> t       bb     )
     3.27006878E-04    2          24        25   # BR(H+ -> W+      h      )
     2.43511691E-13    2          24        36   # BR(H+ -> W+      A      )
     1.42741923E-02    2     1000024   1000022   # BR(H+ -> ~chi_1+ ~chi_10)
     1.06596030E-04    2     1000024   1000023   # BR(H+ -> ~chi_1+ ~chi_20)
     1.12751079E-02    2     1000024   1000025   # BR(H+ -> ~chi_1+ ~chi_30)
