#  ISAJET SUSY parameters in SUSY Les Houches Accord 2 format
#  Created by ISALHA 2.0 Last revision: C. Balazs 21 Apr 2009
Block SPINFO   # Program information
     1   ISASUGRA from ISAJET          # Spectrum Calculator
     2   7.80   29-OCT-2009 12:50:36   # Version number
Block MODSEL   # Model selection
     1     3   # Minimal anomaly mediated (AMSB) model             
Block SMINPUTS   # Standard Model inputs
     1     1.27836258E+02   # alpha_em^(-1)
     2     1.16570000E-05   # G_Fermi
     3     1.17200002E-01   # alpha_s(M_Z)
     4     9.11699982E+01   # m_{Z}(pole)
     5     4.19999981E+00   # m_{b}(m_{b})
     6     1.72500000E+02   # m_{top}(pole)
     7     1.77699995E+00   # m_{tau}(pole)
Block MINPAR   # SUSY breaking input parameters
     1     5.00000000E+03   # m_0
     2     4.60800000E+05   # m_{3/2}
     3     5.00000000E+00   # tan(beta)
     4     1.00000000E+00   # sign(mu)
Block EXTPAR   # Non-universal SUSY breaking parameters
     0     7.91971085E+15   # Input scale
Block MASS   # Scalar and gaugino mass spectrum
#  PDG code   mass                 particle
         5     4.80000000E+00   # b-quark pole mass calculated from mb(mb)_Msbar
         6     1.72500000E+02   # t-quark pole mass (not read by ME)
        15     1.77682000E+00   # tau pole mass (not read by ME)
        23     9.11876000E+01   # Z pole mass (not read by ME)
        24     8.04229965E+01   #  W^+
        25     1.18389191E+02   #  h^0            
        35     8.53093848E+03   #  H^0            
        36     8.47509277E+03   #  A^0            
        37     8.53121680E+03   #  H^+            
   1000001     9.31856836E+03   #  dnl            
   1000002     9.31824219E+03   #  upl            
   1000003     9.31856836E+03   #  stl            
   1000004     9.31824219E+03   #  chl            
   1000005     8.05646484E+03   #  b1             
   1000006     6.55352344E+03   #  t1             
   1000011     4.65756738E+03   #  el-            
   1000012     4.64983691E+03   #  nuel           
   1000013     4.65756738E+03   #  mul-           
   1000014     4.64983691E+03   #  numl           
   1000015     4.55297266E+03   #  tau1           
   1000016     4.63808984E+03   #  nutl           
   1000021     8.51737598E+03   #  glss           
   1000022     1.29958105E+03   #  z1ss           
   1000023     4.29291992E+03   #  z2ss           
   1000024     1.29975452E+03   #  w1ss           
   1000025    -6.90437646E+03   #  z3ss           
   1000035     6.90509863E+03   #  z4ss           
   1000037     6.91272314E+03   #  w2ss           
   2000001     9.44693945E+03   #  dnr            
   2000002     9.36755371E+03   #  upr            
   2000003     9.44693945E+03   #  str            
   2000004     9.36755371E+03   #  chr            
   2000005     9.37368945E+03   #  b2             
   2000006     8.11611523E+03   #  t2             
   2000011     4.57023096E+03   #  er-            
   2000013     4.57023096E+03   #  mur-           
   2000015     4.64510400E+03   #  tau2           
Block ALPHA   # Effective Higgs mixing parameter
         -1.97458878E-01   # alpha
Block STOPMIX   # stop mixing matrix
  1  1     3.35011519E-02   # O_{11}
  1  2    -9.99438703E-01   # O_{12}
  2  1     9.99438703E-01   # O_{21}
  2  2     3.35011519E-02   # O_{22}
Block SBOTMIX   # sbottom mixing matrix
  1  1     9.99993622E-01   # O_{11}
  1  2     3.56848771E-03   # O_{12}
  2  1    -3.56848771E-03   # O_{21}
  2  2     9.99993622E-01   # O_{22}
Block STAUMIX   # stau mixing matrix
  1  1     7.45082945E-02   # O_{11}
  1  2     9.97220397E-01   # O_{12}
  2  1    -9.97220397E-01   # O_{21}
  2  2     7.45082945E-02   # O_{22}
Block NMIX   # neutralino mixing matrix
  1  1    -5.65894356E-04   #
  1  2     9.99936283E-01   #
  1  3    -1.10291308E-02   #
  1  4     2.39176909E-03   #
  2  1     9.99941707E-01   #
  2  2     6.79986435E-04   #
  2  3     9.07939672E-03   #
  2  4    -5.82996011E-03   #
  3  1    -2.30139494E-03   #
  3  2     6.10605534E-03   #
  3  3     7.07060397E-01   #
  3  4     7.07123160E-01   #
  4  1     1.05484314E-02   #
  4  2    -9.48347896E-03   #
  4  3    -7.07008958E-01   #
  4  4     7.07062542E-01   #
Block UMIX   # chargino U mixing matrix
  1  1    -9.99862194E-01   # U_{11}
  1  2     1.65998898E-02   # U_{12}
  2  1    -1.65998898E-02   # U_{21}
  2  2    -9.99862194E-01   # U_{22}
Block VMIX   # chargino V mixing matrix
  1  1    -9.99979019E-01   # V_{11}
  1  2     6.47878507E-03   # V_{12}
  2  1    -6.47878507E-03   # V_{21}
  2  2    -9.99979019E-01   # V_{22}
Block GAUGE Q=  6.96290234E+03   #
     1     3.57524991E-01   # g`
     2     6.52378619E-01   # g_2
     3     1.21928012E+00   # g_3
Block YU Q=  6.96290234E+03   #
  3  3     8.16284060E-01   # y_t
Block YD Q=  6.96290234E+03   #
  3  3     6.24283776E-02   # y_b
Block YE Q=  6.96290234E+03   #
  3  3     5.15309051E-02   # y_tau
Block HMIX Q=  6.96290234E+03   # Higgs mixing parameters
     1     6.89413672E+03   # mu(Q)
     2     5.00000000E+00   # tan(beta)(M_GUT)
     3     2.52480713E+02   # Higgs vev at Q
     4     7.18272000E+07   # m_A^2(Q)
Block MSOFT Q=  6.96290234E+03   # DRbar SUSY breaking parameters
     1     4.32975439E+03   # M_1(Q)          
     2     1.22111719E+03   # M_2(Q)          
     3    -8.01042383E+03   # M_3(Q)          
    21     3.23374943E+04   # mH1^2(Q)            
    22    -1.28800134E+05   # mH2^2(Q)            
    31     4.63596777E+03   # MeL(Q)          
    32     4.63596777E+03   # MmuL(Q)         
    33     4.62457959E+03   # MtauL(Q)        
    34     4.55674121E+03   # MeR(Q)          
    35     4.55674121E+03   # MmuR(Q)         
    36     4.53140918E+03   # MtauR(Q)        
    41     8.90421387E+03   # MqL1(Q)         
    42     8.90421387E+03   # MqL2(Q)         
    43     7.70603223E+03   # MqL3(Q)         
    44     8.95396094E+03   # MuR(Q)          
    45     8.95396094E+03   # McR(Q)          
    46     6.29143555E+03   # MtR(Q)          
    47     9.03415039E+03   # MdR(Q)          
    48     9.03415039E+03   # MsR(Q)          
    49     9.06248926E+03   # MbR(Q)          
Block AU Q=  6.96290234E+03   #
  1  1     6.96171094E+03   # A_u
  2  2     6.96171094E+03   # A_c
  3  3     6.96171094E+03   # A_t
Block AD Q=  6.96290234E+03   #
  1  1     1.64537988E+04   # A_d
  2  2     1.64537988E+04   # A_s
  3  3     1.64537988E+04   # A_b
Block AE Q=  6.96290234E+03   #
  1  1     4.77319873E+03   # A_e
  2  2     4.77319873E+03   # A_mu
  3  3     4.77319873E+03   # A_tau
#
#  ISAJET decay tables in SUSY Les Houches accord format
#  Created by ISALHD. Last revision: C. Balazs, 2005 May 25
Block DCINFO                           # Program information
     1   ISASUGRA from ISAJET          # Spectrum Calculator
     2   7.80   29-OCT-2009 12:50:36   # Version number
#         PDG         Width
DECAY        23     2.49520000E+00   # Z width (SM calculation)
DECAY        24     2.08500000E+00   # W width (SM calculation)
#
#         PDG            Width  
DECAY         6  1.14680779E+00   # TP    decays
#          BR          NDA       ID1       ID2       ID3       ID4
      3.33333343E-01    3            2        -1         5             # TP     -->  UP     DB     BT          
      3.33333343E-01    3            4        -3         5             # TP     -->  CH     SB     BT          
      1.11111112E-01    3          -11        12         5             # TP     -->  E+     NUE    BT          
      1.11111112E-01    3          -13        14         5             # TP     -->  MU+    NUM    BT          
      1.11111112E-01    3          -15        16         5             # TP     -->  TAU+   NUT    BT          
#         PDG         Width
DECAY   1000021  2.98976269E+01   # GLSS  decays
#          BR          NDA       ID1       ID2       ID3       ID4
      1.83030753E-03    3      1000024         1        -2             # GLSS   -->  W1SS+  DN     UB          
      1.83030753E-03    3     -1000024         2        -1             # GLSS   -->  W1SS-  UP     DB          
      1.83030753E-03    3      1000024         3        -4             # GLSS   -->  W1SS+  ST     CB          
      1.83030753E-03    3     -1000024         4        -3             # GLSS   -->  W1SS-  CH     SB          
      3.82946963E-09    3      1000024         5        -6             # GLSS   -->  W1SS+  BT     TB          
      3.82946963E-09    3     -1000024         6        -5             # GLSS   -->  W1SS-  TP     BB          
      2.36468489E-09    3      1000037         1        -2             # GLSS   -->  W2SS+  DN     UB          
      2.36468489E-09    3     -1000037         2        -1             # GLSS   -->  W2SS-  UP     DB          
      2.36468489E-09    3      1000037         3        -4             # GLSS   -->  W2SS+  ST     CB          
      2.36468489E-09    3     -1000037         4        -3             # GLSS   -->  W2SS-  CH     SB          
      9.47104866E-08    3      1000037         5        -6             # GLSS   -->  W2SS+  BT     TB          
      9.47104866E-08    3     -1000037         6        -5             # GLSS   -->  W2SS-  TP     BB          
      5.27944387E-14    2      1000022        21                       # GLSS   -->  Z1SS   GL                 
      9.15180426E-04    3      1000022         2        -2             # GLSS   -->  Z1SS   UP     UB          
      9.15279728E-04    3      1000022         1        -1             # GLSS   -->  Z1SS   DN     DB          
      9.15279728E-04    3      1000022         3        -3             # GLSS   -->  Z1SS   ST     SB          
      9.15180426E-04    3      1000022         4        -4             # GLSS   -->  Z1SS   CH     CB          
      4.28361924E-09    3      1000022         5        -5             # GLSS   -->  Z1SS   BT     BB          
      6.85969724E-07    2      1000023        21                       # GLSS   -->  Z2SS   GL                 
      1.11115449E-04    3      1000023         2        -2             # GLSS   -->  Z2SS   UP     UB          
      3.06702968E-05    3      1000023         1        -1             # GLSS   -->  Z2SS   DN     DB          
      3.06702968E-05    3      1000023         3        -3             # GLSS   -->  Z2SS   ST     SB          
      1.11115449E-04    3      1000023         4        -4             # GLSS   -->  Z2SS   CH     CB          
      2.58574673E-05    3      1000023         5        -5             # GLSS   -->  Z2SS   BT     BB          
      2.37234159E-14    2      1000025        21                       # GLSS   -->  Z3SS   GL                 
      5.55218094E-10    3      1000025         2        -2             # GLSS   -->  Z3SS   UP     UB          
      6.85812795E-10    3      1000025         1        -1             # GLSS   -->  Z3SS   DN     DB          
      6.85812795E-10    3      1000025         3        -3             # GLSS   -->  Z3SS   ST     SB          
      5.55218094E-10    3      1000025         4        -4             # GLSS   -->  Z3SS   CH     CB          
      9.85190525E-08    3      1000025         5        -5             # GLSS   -->  Z3SS   BT     BB          
      1.47744976E-11    2      1000035        21                       # GLSS   -->  Z4SS   GL                 
      6.73899991E-10    3      1000035         2        -2             # GLSS   -->  Z4SS   UP     UB          
      8.55449878E-10    3      1000035         1        -1             # GLSS   -->  Z4SS   DN     DB          
      8.55449878E-10    3      1000035         3        -3             # GLSS   -->  Z4SS   ST     SB          
      6.73899991E-10    3      1000035         4        -4             # GLSS   -->  Z4SS   CH     CB          
      9.84947448E-08    3      1000035         5        -5             # GLSS   -->  Z4SS   BT     BB          
      2.98162140E-02    2     -1000005         5                       # GLSS   -->  BB1    BT                 
      2.98162140E-02    2      1000005        -5                       # GLSS   -->  BT1    BB                 
      4.43291128E-01    2     -1000006         6                       # GLSS   -->  TB1    TP                 
      4.43291128E-01    2      1000006        -6                       # GLSS   -->  TP1    TB                 
      2.12462880E-02    2     -2000006         6                       # GLSS   -->  TB2    TP                 
      2.12462880E-02    2      2000006        -6                       # GLSS   -->  TP2    TB                 
#         PDG         Width
DECAY   1000002  1.26544167E+02   # UPL   decays
#          BR          NDA       ID1       ID2       ID3       ID4
      2.97918409E-01    2      1000022         2                       # UPL    -->  Z1SS   UP                 
      6.50336035E-03    2      1000023         2                       # UPL    -->  Z2SS   UP                 
      2.03708419E-06    2      1000025         2                       # UPL    -->  Z3SS   UP                 
      3.59265937E-06    2      1000035         2                       # UPL    -->  Z4SS   UP                 
      9.95623916E-02    2      1000021         2                       # UPL    -->  GLSS   UP                 
      5.96004963E-01    2      1000024         1                       # UPL    -->  W1SS+  DN                 
      5.26128088E-06    2      1000037         1                       # UPL    -->  W2SS+  DN                 
#         PDG         Width
DECAY   1000001  1.26548119E+02   # DNL   decays
#          BR          NDA       ID1       ID2       ID3       ID4
      2.98043936E-01    2      1000022         1                       # DNL    -->  Z1SS   DN                 
      6.40778197E-03    2      1000023         1                       # DNL    -->  Z2SS   DN                 
      2.68676990E-06    2      1000025         1                       # DNL    -->  Z3SS   DN                 
      8.21335198E-06    2      1000035         1                       # DNL    -->  Z4SS   DN                 
      9.96332616E-02    2      1000021         1                       # DNL    -->  GLSS   DN                 
      5.95869601E-01    2     -1000024         2                       # DNL    -->  W1SS-  UP                 
      3.45454500E-05    2     -1000037         2                       # DNL    -->  W2SS-  UP                 
#         PDG         Width
DECAY   1000003  1.26548119E+02   # STL   decays
#          BR          NDA       ID1       ID2       ID3       ID4
      2.98043936E-01    2      1000022         3                       # STL    -->  Z1SS   ST                 
      6.40778197E-03    2      1000023         3                       # STL    -->  Z2SS   ST                 
      2.68676990E-06    2      1000025         3                       # STL    -->  Z3SS   ST                 
      8.21335198E-06    2      1000035         3                       # STL    -->  Z4SS   ST                 
      9.96332616E-02    2      1000021         3                       # STL    -->  GLSS   ST                 
      5.95869601E-01    2     -1000024         4                       # STL    -->  W1SS-  CH                 
      3.45454428E-05    2     -1000037         4                       # STL    -->  W2SS-  CH                 
#         PDG         Width
DECAY   1000004  1.26544151E+02   # CHL   decays
#          BR          NDA       ID1       ID2       ID3       ID4
      2.97918439E-01    2      1000022         4                       # CHL    -->  Z1SS   CH                 
      6.50336174E-03    2      1000023         4                       # CHL    -->  Z2SS   CH                 
      2.03708373E-06    2      1000025         4                       # CHL    -->  Z3SS   CH                 
      3.59265891E-06    2      1000035         4                       # CHL    -->  Z4SS   CH                 
      9.95622501E-02    2      1000021         4                       # CHL    -->  GLSS   CH                 
      5.96005023E-01    2      1000024         3                       # CHL    -->  W1SS+  ST                 
      5.26128133E-06    2      1000037         3                       # CHL    -->  W2SS+  ST                 
#         PDG         Width
DECAY   1000005  1.18695702E+02   # BT1   decays
#          BR          NDA       ID1       ID2       ID3       ID4
      2.71053791E-01    2      1000022         5                       # BT1    -->  Z1SS   BT                 
      4.88115475E-03    2      1000023         5                       # BT1    -->  Z2SS   BT                 
      1.97571717E-04    2      1000025         5                       # BT1    -->  Z3SS   BT                 
      1.99242306E-04    2      1000035         5                       # BT1    -->  Z4SS   BT                 
      5.41356444E-01    2     -1000024         6                       # BT1    -->  W1SS-  TP                 
      5.82651496E-02    2     -1000037         6                       # BT1    -->  W2SS-  TP                 
      1.24046639E-01    2          -24   1000006                       # BT1    -->  W-     TP1                
#         PDG         Width
DECAY   1000006  4.84254694E+00   # TP1   decays
#          BR          NDA       ID1       ID2       ID3       ID4
      4.53372160E-03    2      1000022         6                       # TP1    -->  Z1SS   TP                 
      9.88562346E-01    2      1000023         6                       # TP1    -->  Z2SS   TP                 
      6.90403255E-03    2      1000024         5                       # TP1    -->  W1SS+  BT                 
#         PDG         Width
DECAY   2000002  2.72607937E+01   # UPR   decays
#          BR          NDA       ID1       ID2       ID3       ID4
      2.39273334E-07    2      1000022         2                       # UPR    -->  Z1SS   UP                 
      4.84718412E-01    2      1000023         2                       # UPR    -->  Z2SS   UP                 
      8.58323403E-07    2      1000025         2                       # UPR    -->  Z3SS   UP                 
      1.80230527E-05    2      1000035         2                       # UPR    -->  Z4SS   UP                 
      5.15262425E-01    2      1000021         2                       # UPR    -->  GLSS   UP                 
#         PDG         Width
DECAY   2000001  1.98676758E+01   # DNR   decays
#          BR          NDA       ID1       ID2       ID3       ID4
      8.28277820E-08    2      1000022         1                       # DNR    -->  Z1SS   DN                 
      1.69177219E-01    2      1000023         1                       # DNR    -->  Z2SS   DN                 
      3.08863775E-07    2      1000025         1                       # DNR    -->  Z3SS   DN                 
      6.48562764E-06    2      1000035         1                       # DNR    -->  Z4SS   DN                 
      8.30815852E-01    2      1000021         1                       # DNR    -->  GLSS   DN                 
#         PDG         Width
DECAY   2000003  1.98676758E+01   # STR   decays
#          BR          NDA       ID1       ID2       ID3       ID4
      8.28277820E-08    2      1000022         3                       # STR    -->  Z1SS   ST                 
      1.69177219E-01    2      1000023         3                       # STR    -->  Z2SS   ST                 
      3.08863775E-07    2      1000025         3                       # STR    -->  Z3SS   ST                 
      6.48562764E-06    2      1000035         3                       # STR    -->  Z4SS   ST                 
      8.30815852E-01    2      1000021         3                       # STR    -->  GLSS   ST                 
#         PDG         Width
DECAY   2000004  2.72607765E+01   # CHR   decays
#          BR          NDA       ID1       ID2       ID3       ID4
      2.39273476E-07    2      1000022         4                       # CHR    -->  Z1SS   CH                 
      4.84718740E-01    2      1000023         4                       # CHR    -->  Z2SS   CH                 
      8.58323801E-07    2      1000025         4                       # CHR    -->  Z3SS   CH                 
      1.80230618E-05    2      1000035         4                       # CHR    -->  Z4SS   CH                 
      5.15262127E-01    2      1000021         4                       # CHR    -->  GLSS   CH                 
#         PDG         Width
DECAY   2000005  1.81042366E+01   # BT2   decays
#          BR          NDA       ID1       ID2       ID3       ID4
      8.69543692E-06    2      1000022         5                       # BT2    -->  Z1SS   BT                 
      1.82708174E-01    2      1000023         5                       # BT2    -->  Z2SS   BT                 
      4.46027284E-03    2      1000025         5                       # BT2    -->  Z3SS   BT                 
      4.46728151E-03    2      1000035         5                       # BT2    -->  Z4SS   BT                 
      7.86073327E-01    2      1000021         5                       # BT2    -->  GLSS   BT                 
      1.55561775E-05    2     -1000024         6                       # BT2    -->  W1SS-  TP                 
      8.90805200E-03    2     -1000037         6                       # BT2    -->  W2SS-  TP                 
      5.64578841E-05    2          -24   1000006                       # BT2    -->  W-     TP1                
      5.87074179E-03    2          -24   2000006                       # BT2    -->  W-     TP2                
      3.38302576E-03    2           23   1000005                       # BT2    -->  Z0     BT1                
      4.04845783E-03    2           25   1000005                       # BT2    -->  HL0    BT1                
#         PDG         Width
DECAY   2000006  1.26628799E+02   # TP2   decays
#          BR          NDA       ID1       ID2       ID3       ID4
      5.11935174E-01    2      1000024         5                       # TP2    -->  W1SS+  BT                 
      4.43763653E-04    2      1000037         5                       # TP2    -->  W2SS+  BT                 
      6.54214472E-02    2           23   1000006                       # TP2    -->  Z0     TP1                
      1.01437099E-01    2           25   1000006                       # TP2    -->  HL0    TP1                
      2.55577624E-01    2      1000022         6                       # TP2    -->  Z1SS   TP                 
      4.92323330E-03    2      1000023         6                       # TP2    -->  Z2SS   TP                 
      3.04268580E-02    2      1000025         6                       # TP2    -->  Z3SS   TP                 
      2.98348814E-02    2      1000035         6                       # TP2    -->  Z4SS   TP                 
#         PDG         Width
DECAY   1000011  5.01250763E+01   # EL-   decays
#          BR          NDA       ID1       ID2       ID3       ID4
      3.32344711E-01    2      1000022        11                       # EL-    -->  Z1SS   E-                 
      2.68082949E-03    2      1000023        11                       # EL-    -->  Z2SS   E-                 
      6.64974511E-01    2     -1000024        12                       # EL-    -->  W1SS-  NUE                
      4.94481436E-19    3      1000015        11       -15             # EL-    -->  TAU1-  E-     TAU+        
      2.03478450E-20    3     -1000015        11        15             # EL-    -->  TAU1+  E-     TAU-        
#         PDG         Width
DECAY   1000013  5.01250763E+01   # MUL-  decays
#          BR          NDA       ID1       ID2       ID3       ID4
      3.32344711E-01    2      1000022        13                       # MUL-   -->  Z1SS   MU-                
      2.68082903E-03    2      1000023        13                       # MUL-   -->  Z2SS   MU-                
      6.64974511E-01    2     -1000024        14                       # MUL-   -->  W1SS-  NUM                
      4.94481436E-19    3      1000015        13       -15             # MUL-   -->  TAU1-  MU-    TAU+        
      2.03478450E-20    3     -1000015        13        15             # MUL-   -->  TAU1+  MU-    TAU-        
#         PDG         Width
DECAY   1000015  5.62935948E-01   # TAU1- decays
#          BR          NDA       ID1       ID2       ID3       ID4
      1.64827809E-01    2      1000022        15                       # TAU1-  -->  Z1SS   TAU-               
      5.04695833E-01    2      1000023        15                       # TAU1-  -->  Z2SS   TAU-               
      3.30476344E-01    2     -1000024        16                       # TAU1-  -->  W1SS-  NUT                
#         PDG         Width
DECAY   1000012  5.00366745E+01   # NUEL  decays
#          BR          NDA       ID1       ID2       ID3       ID4
      3.32606107E-01    2      1000022        12                       # NUEL   -->  Z1SS   NUE                
      2.56855227E-03    2      1000023        12                       # NUEL   -->  Z2SS   NUE                
      6.64825320E-01    2      1000024        11                       # NUEL   -->  W1SS+  E-                 
      2.38119428E-18    3      1000015        12       -15             # NUEL   -->  TAU1-  NUE    TAU+        
      6.53807278E-19    3     -1000015        12        15             # NUEL   -->  TAU1+  NUE    TAU-        
      1.12058067E-17    3     -1000015        11        16             # NUEL   -->  TAU1+  E-     NUT         
#         PDG         Width
DECAY   1000014  5.00366745E+01   # NUML  decays
#          BR          NDA       ID1       ID2       ID3       ID4
      3.32606107E-01    2      1000022        14                       # NUML   -->  Z1SS   NUM                
      2.56855227E-03    2      1000023        14                       # NUML   -->  Z2SS   NUM                
      6.64825320E-01    2      1000024        13                       # NUML   -->  W1SS+  MU-                
      2.38119428E-18    3      1000015        14       -15             # NUML   -->  TAU1-  NUM    TAU+        
      6.53807278E-19    3     -1000015        14        15             # NUML   -->  TAU1+  NUM    TAU-        
      1.15883628E-17    3     -1000015        13        16             # NUML   -->  TAU1+  MU-    NUT         
#         PDG         Width
DECAY   1000016  4.98607140E+01   # NUTL  decays
#          BR          NDA       ID1       ID2       ID3       ID4
      3.32650572E-01    2      1000022        16                       # NUTL   -->  Z1SS   NUT                
      2.42272345E-03    2      1000023        16                       # NUTL   -->  Z2SS   NUT                
      6.64914489E-01    2      1000024        15                       # NUTL   -->  W1SS+  TAU-               
      1.22134334E-05    2           24   1000015                       # NUTL   -->  W+     TAU1-              
      6.43124456E-17    3     -1000015        16        15             # NUTL   -->  TAU1+  NUT    TAU-        
      3.44093900E-19    3      1000015        16       -15             # NUTL   -->  TAU1-  NUT    TAU+        
#         PDG         Width
DECAY   2000011  3.21849555E-01   # ER-   decays
#          BR          NDA       ID1       ID2       ID3       ID4
      1.95397406E-05    2      1000022        11                       # ER-    -->  Z1SS   E-                 
      9.99980450E-01    2      1000023        11                       # ER-    -->  Z2SS   E-                 
      2.26951380E-20    3      1000015        11       -15             # ER-    -->  TAU1-  E-     TAU+        
      2.36536497E-20    3     -1000015        11        15             # ER-    -->  TAU1+  E-     TAU-        
      2.43676496E-25    3      1000015        12       -16             # ER-    -->  TAU1-  NUE    ANUT        
#         PDG         Width
DECAY   2000013  3.21849525E-01   # MUR-  decays
#          BR          NDA       ID1       ID2       ID3       ID4
      1.95397424E-05    2      1000022        13                       # MUR-   -->  Z1SS   MU-                
      9.99980450E-01    2      1000023        13                       # MUR-   -->  Z2SS   MU-                
      2.26951396E-20    3      1000015        13       -15             # MUR-   -->  TAU1-  MU-    TAU+        
      2.36536513E-20    3     -1000015        13        15             # MUR-   -->  TAU1+  MU-    TAU-        
      1.03726203E-20    3      1000015        14       -16             # MUR-   -->  TAU1-  NUM    ANUT        
#         PDG         Width
DECAY   2000015  4.96532631E+01   # TAU2- decays
#          BR          NDA       ID1       ID2       ID3       ID4
      3.32382470E-01    2      1000022        15                       # TAU2-  -->  Z1SS   TAU-               
      2.57553929E-03    2      1000023        15                       # TAU2-  -->  Z2SS   TAU-               
      6.65041268E-01    2     -1000024        16                       # TAU2-  -->  W1SS-  NUT                
      6.65777520E-07    2           23   1000015                       # TAU2-  -->  Z0     TAU1-              
#         PDG         Width
DECAY   1000023  6.62398711E-02   # Z2SS  decays
#          BR          NDA       ID1       ID2       ID3       ID4
      1.08501648E-04    2      1000022        22                       # Z2SS   -->  Z1SS   GM                 
      4.39740986E-01    2      1000024       -24                       # Z2SS   -->  W1SS+  W-                 
      4.39740986E-01    2     -1000024        24                       # Z2SS   -->  W1SS-  W+                 
      2.19486956E-03    2      1000022        23                       # Z2SS   -->  Z1SS   Z0                 
      1.20931218E-04    3      1000022         2        -2             # Z2SS   -->  Z1SS   UP     UB          
      1.19179516E-04    3      1000022         1        -1             # Z2SS   -->  Z1SS   DN     DB          
      1.19179516E-04    3      1000022         3        -3             # Z2SS   -->  Z1SS   ST     SB          
      1.20931218E-04    3      1000022         4        -4             # Z2SS   -->  Z1SS   CH     CB          
      2.30945836E-04    3      1000022         5        -5             # Z2SS   -->  Z1SS   BT     BB          
      1.58906840E-02    3      1000022        11       -11             # Z2SS   -->  Z1SS   E-     E+          
      1.58906840E-02    3      1000022        13       -13             # Z2SS   -->  Z1SS   MU-    MU+         
      1.62878148E-02    3      1000022        15       -15             # Z2SS   -->  Z1SS   TAU-   TAU+        
      1.60615314E-02    3      1000022        12       -12             # Z2SS   -->  Z1SS   NUE    ANUE        
      1.60615314E-02    3      1000022        14       -14             # Z2SS   -->  Z1SS   NUM    ANUM        
      1.64208803E-02    3      1000022        16       -16             # Z2SS   -->  Z1SS   NUT    ANUT        
      2.08904594E-02    2      1000022        25                       # Z2SS   -->  Z1SS   HL0                
#         PDG         Width
DECAY   1000025  5.11972008E+01   # Z3SS  decays
#          BR          NDA       ID1       ID2       ID3       ID4
      4.11241352E-09    2      1000022        22                       # Z3SS   -->  Z1SS   GM                 
      9.04656527E-09    2      1000023        22                       # Z3SS   -->  Z2SS   GM                 
      3.45968336E-01    2      1000024       -24                       # Z3SS   -->  W1SS+  W-                 
      3.45968336E-01    2     -1000024        24                       # Z3SS   -->  W1SS-  W+                 
      1.71255633E-01    2      1000022        23                       # Z3SS   -->  Z1SS   Z0                 
      5.42743951E-02    2      1000023        23                       # Z3SS   -->  Z2SS   Z0                 
      1.99599737E-09    3      1000022         2        -2             # Z3SS   -->  Z1SS   UP     UB          
      2.63267874E-09    3      1000022         1        -1             # Z3SS   -->  Z1SS   DN     DB          
      2.63267874E-09    3      1000022         3        -3             # Z3SS   -->  Z1SS   ST     SB          
      1.99599737E-09    3      1000022         4        -4             # Z3SS   -->  Z1SS   CH     CB          
      3.91209505E-06    3      1000022         5        -5             # Z3SS   -->  Z1SS   BT     BB          
      1.80262347E-07    3      1000022        15       -15             # Z3SS   -->  Z1SS   TAU-   TAU+        
      1.08471166E-11    3      1000023         2        -2             # Z3SS   -->  Z2SS   UP     UB          
      6.36583408E-12    3      1000023         1        -1             # Z3SS   -->  Z2SS   DN     DB          
      6.36583408E-12    3      1000023         3        -3             # Z3SS   -->  Z2SS   ST     SB          
      1.08471166E-11    3      1000023         4        -4             # Z3SS   -->  Z2SS   CH     CB          
      3.46222144E-08    3      1000023         5        -5             # Z3SS   -->  Z2SS   BT     BB          
      1.96400851E-09    3      1000023        15       -15             # Z3SS   -->  Z2SS   TAU-   TAU+        
      5.54970056E-02    2      1000022        25                       # Z3SS   -->  Z1SS   HL0                
      2.30245641E-03    2      1000023        25                       # Z3SS   -->  Z2SS   HL0                
      1.11735947E-02    2      1000006        -6                       # Z3SS   -->  TP1    TB                 
      1.11735947E-02    2     -1000006         6                       # Z3SS   -->  TB1    TP                 
      1.97540226E-06    2      1000011       -11                       # Z3SS   -->  EL-    E+                 
      1.97540226E-06    2     -1000011        11                       # Z3SS   -->  EL+    E-                 
      1.97540226E-06    2      1000013       -13                       # Z3SS   -->  MUL-   MU+                
      1.97540226E-06    2     -1000013        13                       # Z3SS   -->  MUL+   MU-                
      5.73407021E-07    2      2000011       -11                       # Z3SS   -->  ER-    E+                 
      5.73407021E-07    2     -2000011        11                       # Z3SS   -->  ER+    E-                 
      5.73407021E-07    2      2000013       -13                       # Z3SS   -->  MUR-   MU+                
      5.73407021E-07    2     -2000013        13                       # Z3SS   -->  MUR+   MU-                
      5.96131547E-04    2      1000015       -15                       # Z3SS   -->  TAU1-  TAU+               
      5.96131547E-04    2     -1000015        15                       # Z3SS   -->  TAU1+  TAU-               
      5.76040766E-04    2      2000015       -15                       # Z3SS   -->  TAU2-  TAU+               
      5.76040766E-04    2     -2000015        15                       # Z3SS   -->  TAU2+  TAU-               
      4.60474894E-06    2      1000012       -12                       # Z3SS   -->  NUEL   ANUE               
      4.60474894E-06    2     -1000012        12                       # Z3SS   -->  ANUEL  NUE                
      4.60474894E-06    2      1000014       -14                       # Z3SS   -->  NUML   ANUM               
      4.60474894E-06    2     -1000014        14                       # Z3SS   -->  ANUML  NUM                
      4.64340292E-06    2      1000016       -16                       # Z3SS   -->  NUTL   ANUT               
      4.64340292E-06    2     -1000016        16                       # Z3SS   -->  ANUTL  NUT                
#         PDG         Width
DECAY   1000035  3.90787277E+01   # Z4SS  decays
#          BR          NDA       ID1       ID2       ID3       ID4
      7.74115350E-08    2      1000022        22                       # Z4SS   -->  Z1SS   GM                 
      2.60436495E-09    2      1000023        22                       # Z4SS   -->  Z2SS   GM                 
      9.67946371E-16    2      1000025        22                       # Z4SS   -->  Z3SS   GM                 
      1.98727593E-01    2      1000024       -24                       # Z4SS   -->  W1SS+  W-                 
      1.98727593E-01    2     -1000024        24                       # Z4SS   -->  W1SS-  W+                 
      9.29789245E-02    2      1000022        23                       # Z4SS   -->  Z1SS   Z0                 
      3.38997017E-03    2      1000023        23                       # Z4SS   -->  Z2SS   Z0                 
      7.45401163E-09    3      1000022         2        -2             # Z4SS   -->  Z1SS   UP     UB          
      1.70417849E-08    3      1000022         1        -1             # Z4SS   -->  Z1SS   DN     DB          
      1.70417849E-08    3      1000022         3        -3             # Z4SS   -->  Z1SS   ST     SB          
      7.45401163E-09    3      1000022         4        -4             # Z4SS   -->  Z1SS   CH     CB          
      5.13765099E-06    3      1000022         5        -5             # Z4SS   -->  Z1SS   BT     BB          
      2.33697804E-07    3      1000022        15       -15             # Z4SS   -->  Z1SS   TAU-   TAU+        
      4.81579221E-10    3      1000023         2        -2             # Z4SS   -->  Z2SS   UP     UB          
      9.03042988E-11    3      1000023         1        -1             # Z4SS   -->  Z2SS   DN     DB          
      9.03042988E-11    3      1000023         3        -3             # Z4SS   -->  Z2SS   ST     SB          
      4.81579221E-10    3      1000023         4        -4             # Z4SS   -->  Z2SS   CH     CB          
      4.49977762E-08    3      1000023         5        -5             # Z4SS   -->  Z2SS   BT     BB          
      2.51119192E-09    3      1000023        15       -15             # Z4SS   -->  Z2SS   TAU-   TAU+        
      3.50520521E-01    2      1000022        25                       # Z4SS   -->  Z1SS   HL0                
      1.24937400E-01    2      1000023        25                       # Z4SS   -->  Z2SS   HL0                
      1.36944847E-02    2      1000006        -6                       # Z4SS   -->  TP1    TB                 
      1.36944847E-02    2     -1000006         6                       # Z4SS   -->  TB1    TP                 
      1.50083235E-06    2      1000011       -11                       # Z4SS   -->  EL-    E+                 
      1.50083235E-06    2     -1000011        11                       # Z4SS   -->  EL+    E-                 
      1.50083235E-06    2      1000013       -13                       # Z4SS   -->  MUL-   MU+                
      1.50083235E-06    2     -1000013        13                       # Z4SS   -->  MUL+   MU-                
      1.57888098E-05    2      2000011       -11                       # Z4SS   -->  ER-    E+                 
      1.57888098E-05    2     -2000011        11                       # Z4SS   -->  ER+    E-                 
      1.57888098E-05    2      2000013       -13                       # Z4SS   -->  MUR-   MU+                
      1.57888098E-05    2     -2000013        13                       # Z4SS   -->  MUR+   MU-                
      7.84906442E-04    2      1000015       -15                       # Z4SS   -->  TAU1-  TAU+               
      7.84906442E-04    2     -1000015        15                       # Z4SS   -->  TAU1+  TAU-               
      7.64228520E-04    2      2000015       -15                       # Z4SS   -->  TAU2-  TAU+               
      7.64228520E-04    2     -2000015        15                       # Z4SS   -->  TAU2+  TAU-               
      2.59400822E-05    2      1000012       -12                       # Z4SS   -->  NUEL   ANUE               
      2.59400822E-05    2     -1000012        12                       # Z4SS   -->  ANUEL  NUE                
      2.59400822E-05    2      1000014       -14                       # Z4SS   -->  NUML   ANUM               
      2.59400822E-05    2     -1000014        14                       # Z4SS   -->  ANUML  NUM                
      2.61577479E-05    2      1000016       -16                       # Z4SS   -->  NUTL   ANUT               
      2.61577479E-05    2     -1000016        16                       # Z4SS   -->  ANUTL  NUT                
#         PDG         Width
DECAY   1000024  4.53607997E-15   # W1SS+ decays
#          BR          NDA       ID1       ID2       ID3       ID4
      1.00000000E+00    2      1000022         0                       # W1SS+  -->  Z1SS   PI+                
#         PDG         Width
DECAY   1000037  5.57849350E+01   # W2SS+ decays
#          BR          NDA       ID1       ID2       ID3       ID4
      1.99639594E-08    3      1000022         2        -1             # W2SS+  -->  Z1SS   UP     DB          
      1.99639594E-08    3      1000022         4        -3             # W2SS+  -->  Z1SS   CH     SB          
      1.62972512E-07    3      1000022       -15        16             # W2SS+  -->  Z1SS   TAU+   NUT         
      3.47195804E-01    2      1000022        24                       # W2SS+  -->  Z1SS   W+                 
      9.92696342E-11    3      1000023         2        -1             # W2SS+  -->  Z2SS   UP     DB          
      9.92696342E-11    3      1000023         4        -3             # W2SS+  -->  Z2SS   CH     SB          
      1.79012549E-09    3      1000023       -15        16             # W2SS+  -->  Z2SS   TAU+   NUT         
      5.21013588E-02    2      1000023        24                       # W2SS+  -->  Z2SS   W+                 
      3.69206415E-10    3      1000025         2        -1             # W2SS+  -->  Z3SS   UP     DB          
      3.69206415E-10    3      1000025         4        -3             # W2SS+  -->  Z3SS   CH     SB          
      1.23068805E-10    3      1000025       -11        12             # W2SS+  -->  Z3SS   E+     NUE         
      1.23068805E-10    3      1000025       -13        14             # W2SS+  -->  Z3SS   MU+    NUM         
      1.23068805E-10    3      1000025       -15        16             # W2SS+  -->  Z3SS   TAU+   NUT         
      1.68699957E-10    3      1000035         2        -1             # W2SS+  -->  Z4SS   UP     DB          
      1.68699957E-10    3      1000035         4        -3             # W2SS+  -->  Z4SS   CH     SB          
      5.62333131E-11    3      1000035       -11        12             # W2SS+  -->  Z4SS   E+     NUE         
      5.62333131E-11    3      1000035       -13        14             # W2SS+  -->  Z4SS   MU+    NUM         
      5.62333131E-11    3      1000035       -15        16             # W2SS+  -->  Z4SS   TAU+   NUT         
      2.36977488E-02    2      1000006        -5                       # W2SS+  -->  TP1    BB                 
      6.56399425E-06    2      1000012       -11                       # W2SS+  -->  NUEL   E+                 
      6.56399425E-06    2      1000014       -13                       # W2SS+  -->  NUML   MU+                
      1.05640187E-03    2      1000016       -15                       # W2SS+  -->  NUTL   TAU+               
      4.28548192E-05    2     -1000011        12                       # W2SS+  -->  EL+    NUE                
      4.28548192E-05    2     -1000013        14                       # W2SS+  -->  MUL+   NUM                
      1.07381120E-03    2     -1000015        16                       # W2SS+  -->  TAU1+  NUT                
      8.03795119E-05    2     -2000015        16                       # W2SS+  -->  TAU2+  NUT                
      2.78125495E-01    2      1000024        23                       # W2SS+  -->  W1SS+  Z0                 
      6.27561825E-09    3      1000024         1        -1             # W2SS+  -->  W1SS+  DN     DB          
      6.27561825E-09    3      1000024         3        -3             # W2SS+  -->  W1SS+  ST     SB          
      4.11806234E-08    3      1000024         2        -2             # W2SS+  -->  W1SS+  UP     UB          
      4.11806234E-08    3      1000024         4        -4             # W2SS+  -->  W1SS+  CH     CB          
      2.96569854E-01    2      1000024        25                       # W2SS+  -->  W1SS+  HL0                
#         PDG         Width
DECAY        25  4.29698359E-03   # HL0   decays
#          BR          NDA       ID1       ID2       ID3       ID4
      4.68507810E-09    2           11       -11                       # HL0    -->  E-     E+                 
      1.97811532E-04    2           13       -13                       # HL0    -->  MU-    MU+                
      5.65799475E-02    2           15       -15                       # HL0    -->  TAU-   TAU+               
      5.87770364E-06    2            1        -1                       # HL0    -->  DN     DB                 
      2.37488677E-03    2            3        -3                       # HL0    -->  ST     SB                 
      7.75339484E-01    2            5        -5                       # HL0    -->  BT     BB                 
      1.87943431E-06    2            2        -2                       # HL0    -->  UP     UB                 
      3.52230743E-02    2            4        -4                       # HL0    -->  CH     CB                 
      1.93940988E-03    2           22        22                       # HL0    -->  GM     GM                 
      4.12113406E-02    2           21        21                       # HL0    -->  GL     GL                 
      4.44815680E-03    3           24        11       -12             # HL0    -->  W+     E-     ANUE        
      4.44815680E-03    3           24        13       -14             # HL0    -->  W+     MU-    ANUM        
      4.44815680E-03    3           24        15       -16             # HL0    -->  W+     TAU-   ANUT        
      1.33444713E-02    3           24        -2         1             # HL0    -->  W+     UB     DN          
      1.33444713E-02    3           24        -4         3             # HL0    -->  W+     CB     ST          
      4.44815680E-03    3          -24       -11        12             # HL0    -->  W-     E+     NUE         
      4.44815680E-03    3          -24       -13        14             # HL0    -->  W-     MU+    NUM         
      4.44815680E-03    3          -24       -15        16             # HL0    -->  W-     TAU+   NUT         
      1.33444713E-02    3          -24         2        -1             # HL0    -->  W-     UP     DB          
      1.33444713E-02    3          -24         4        -3             # HL0    -->  W-     CH     SB          
      4.82812873E-04    3           23        12       -12             # HL0    -->  Z0     NUE    ANUE        
      4.82812873E-04    3           23        14       -14             # HL0    -->  Z0     NUM    ANUM        
      4.82812873E-04    3           23        16       -16             # HL0    -->  Z0     NUT    ANUT        
      2.42994865E-04    3           23        11       -11             # HL0    -->  Z0     E-     E+          
      2.42994865E-04    3           23        13       -13             # HL0    -->  Z0     MU-    MU+         
      2.42994865E-04    3           23        15       -15             # HL0    -->  Z0     TAU-   TAU+        
      8.32479796E-04    3           23         2        -2             # HL0    -->  Z0     UP     UB          
      8.32479796E-04    3           23         4        -4             # HL0    -->  Z0     CH     CB          
      1.07243913E-03    3           23         1        -1             # HL0    -->  Z0     DN     DB          
      1.07243913E-03    3           23         3        -3             # HL0    -->  Z0     ST     SB          
      1.07243913E-03    3           23         5        -5             # HL0    -->  Z0     BT     BB          
#         PDG         Width
DECAY        35  2.49705486E+01   # HH0   decays
#          BR          NDA       ID1       ID2       ID3       ID4
      1.45141366E-09    2           11       -11                       # HH0    -->  E-     E+                 
      6.12813092E-05    2           13       -13                       # HH0    -->  MU-    MU+                
      1.75519008E-02    2           15       -15                       # HH0    -->  TAU-   TAU+               
      1.75216826E-06    2            1        -1                       # HH0    -->  DN     DB                 
      7.07963773E-04    2            3        -3                       # HH0    -->  ST     SB                 
      8.39337334E-02    2            5        -5                       # HH0    -->  BT     BB                 
      8.97610430E-10    2            2        -2                       # HH0    -->  UP     UB                 
      1.00652578E-05    2            4        -4                       # HH0    -->  CH     CB                 
      5.29347658E-01    2            6        -6                       # HH0    -->  TP     TB                 
      3.76446991E-07    2           22        22                       # HH0    -->  GM     GM                 
      3.23313143E-05    2           21        21                       # HH0    -->  GL     GL                 
      3.24612665E-05    2           24       -24                       # HH0    -->  W+     W-                 
      1.66594327E-05    2           23        23                       # HH0    -->  Z0     Z0                 
      2.66116927E-04    2      1000022   1000022                       # HH0    -->  Z1SS   Z1SS               
      1.04747392E-04    2      1000022   1000023                       # HH0    -->  Z1SS   Z2SS               
      1.17007598E-01    2      1000022   1000025                       # HH0    -->  Z1SS   Z3SS               
      6.85060071E-03    2      1000022   1000035                       # HH0    -->  Z1SS   Z4SS               
      5.59586973E-04    2      1000024  -1000024                       # HH0    -->  W1SS+  W1SS-              
      1.21686205E-01    2      1000024  -1000037                       # HH0    -->  W1SS+  W2SS-              
      1.21686205E-01    2     -1000024   1000037                       # HH0    -->  W1SS-  W2SS+              
      1.42788645E-04    2           25        25                       # HH0    -->  HL0    HL0                
#         PDG         Width
DECAY        36  2.38384762E+01   # HA0   decays
#          BR          NDA       ID1       ID2       ID3       ID4
      1.51042623E-09    2           11       -11                       # HA0    -->  E-     E+                 
      6.37729172E-05    2           13       -13                       # HA0    -->  MU-    MU+                
      1.82655416E-02    2           15       -15                       # HA0    -->  TAU-   TAU+               
      1.82347412E-06    2            1        -1                       # HA0    -->  DN     DB                 
      7.36775983E-04    2            3        -3                       # HA0    -->  ST     SB                 
      8.73496532E-02    2            5        -5                       # HA0    -->  BT     BB                 
      9.33522037E-10    2            2        -2                       # HA0    -->  UP     UB                 
      1.04746359E-05    2            4        -4                       # HA0    -->  CH     CB                 
      5.51481485E-01    2            6        -6                       # HA0    -->  TP     TB                 
      2.96106066E-07    2           22        22                       # HA0    -->  GM     GM                 
      3.80488418E-05    2           21        21                       # HA0    -->  GL     GL                 
      3.62912047E-04    2      1000022   1000022                       # HA0    -->  Z1SS   Z1SS               
      2.42917915E-04    2      1000022   1000023                       # HA0    -->  Z1SS   Z2SS               
      5.45662642E-03    2      1000022   1000025                       # HA0    -->  Z1SS   Z3SS               
      1.09519757E-01    2      1000022   1000035                       # HA0    -->  Z1SS   Z4SS               
      8.77180602E-04    2      1000024  -1000024                       # HA0    -->  W1SS+  W1SS-              
      1.12779498E-01    2      1000024  -1000037                       # HA0    -->  W1SS+  W2SS-              
      1.12779498E-01    2     -1000024   1000037                       # HA0    -->  W1SS-  W2SS+              
      3.37660167E-05    2           25        23                       # HA0    -->  HL0    Z0                 
#         PDG         Width
DECAY        37  2.39697609E+01   # H+    decays
#          BR          NDA       ID1       ID2       ID3       ID4
      1.51210100E-09    2           12       -11                       # H+     -->  NUE    E+                 
      6.38436322E-05    2           14       -13                       # H+     -->  NUM    MU+                
      1.82857942E-02    2           16       -15                       # H+     -->  NUT    TAU+               
      1.70354235E-06    2            2        -1                       # H+     -->  UP     DB                 
      6.97739597E-04    2            4        -3                       # H+     -->  CH     SB                 
      5.95874727E-01    2            6        -5                       # H+     -->  TP     BB                 
      1.88349998E-06    2      1000024   1000022                       # H+     -->  W1SS+  Z1SS               
      3.76194541E-04    2      1000024   1000023                       # H+     -->  W1SS+  Z2SS               
      1.29035965E-01    2      1000024   1000025                       # H+     -->  W1SS+  Z3SS               
      1.28822878E-01    2      1000024   1000035                       # H+     -->  W1SS+  Z4SS               
      1.26805395E-01    2      1000037   1000022                       # H+     -->  W2SS+  Z1SS               
      3.38093705E-05    2           25        24                       # H+     -->  HL0    W+                 
