#
#                              ======================
#                              | THE SUSYHIT OUTPUT |
#                              ======================
#
#
#              ------------------------------------------------------
#              |     This is the output of the SUSY-HIT package     |
#              |  created by A.Djouadi, M.Muehlleitner and M.Spira. |
#              |  In case of problems with SUSY-HIT email to        |
#              |           margarete.muehlleitner@kit.edu           |
#              |           michael.spira@psi.ch                     |
#              |           abdelhak.djouadi@cern.ch                 |
#              ------------------------------------------------------
#
#              ------------------------------------------------------
#              |  SUSY Les Houches Accord - MSSM Spectrum + Decays  |
#              |              based on the decay programs           |
#              |                                                    |
#              |                     SDECAY 1.5                     |
#              |                                                    |
#              |  Authors: M.Muhlleitner, A.Djouadi and Y.Mambrini  |
#              |  Ref.:    Comput.Phys.Commun.168(2005)46           |
#              |           [hep-ph/0311167]                         |
#              |                                                    |
#              |                     HDECAY 3.4                     |
#              |                                                    |
#              |  By: A.Djouadi,J.Kalinowski,M.Muhlleitner,M.Spira  |
#              |  Ref.:    Comput.Phys.Commun.108(1998)56           |
#              |           [hep-ph/9704448]                         |
#              |                                                    |
#              |                                                    |
#              |  If not stated otherwise all DRbar couplings and   |
#              |  soft SUSY breaking masses are given at the scale  |
#              |  Q=  0.91187600E+02
#              |                                                    |
#              ------------------------------------------------------
#
#
BLOCK DCINFO  # Decay Program information
     1   SDECAY/HDECAY # decay calculator
     2   1.5  /3.4    # version number
#
BLOCK SPINFO  # Spectrum calculator information
     1   SuSpect     # RGE +Spectrum calculator            
     2   2.43         # version number                     
#
BLOCK MODSEL  # Model selection
     1     2   # GMSB                                              
#
BLOCK SMINPUTS  # Standard Model inputs
         1     1.27932904E+02   # alpha_em^-1(M_Z)^MSbar
         2     1.16639000E-05   # G_F [GeV^-2]
         3     1.17200000E-01   # alpha_S(M_Z)^MSbar
         4     9.11870000E+01   # M_Z pole mass
         5     4.25000000E+00   # mb(mb)^MSbar
         6     1.72900000E+02   # mt pole mass
         7     1.77700000E+00   # mtau pole mass
#
BLOCK MINPAR  # Input parameters - minimal models
#
BLOCK EXTPAR  # Input parameters - non-minimal models
         0     9.11876000E+01   # EWSB                
         1     8.54000000E+02   # M_1                 
         2     3.00000000E+03   # M_2                 
         3     2.20000000E+03   # M_3                 
        11     0.00000000E+00   # A_t                 
        12     0.00000000E+00   # A_b                 
        13     0.00000000E+00   # A_tau               
        14     0.00000000E+00   # A_u                 
        15     0.00000000E+00   # A_d                 
        16     0.00000000E+00   # A_e                 
        23     8.50000000E+02   # mu(EWSB)            
        25     1.50000000E+00   # tanbeta(in)         
        26     2.00000000E+03   # MA_pole             
        31     5.00000000E+03   # M_eL                
        32     5.00000000E+03   # M_muL               
        33     5.00000000E+03   # M_tauL              
        34     5.00000000E+03   # M_eR                
        35     5.00000000E+03   # M_muR               
        36     5.00000000E+03   # M_tauR              
        41     5.00000000E+03   # M_q1L               
        42     5.00000000E+03   # M_q2L               
        43     5.00000000E+03   # M_q3L               
        44     5.00000000E+03   # M_uR                
        45     5.00000000E+03   # M_cR                
        46     5.00000000E+03   # M_tR                
        47     5.00000000E+03   # M_dR                
        48     5.00000000E+03   # M_sR                
        49     5.00000000E+03   # M_bR                
#
BLOCK MASS  # Mass Spectrum
# PDG code           mass       particle
        24     8.05400800E+01   # W+
        25     1.26000000E+02   # h
        35     2.00404254E+03   # H
        36     2.00000000E+03   # A
        37     2.00148400E+03   # H+
         5     4.87877839E+00   # b-quark pole mass calculated from mb(mb)_Msbar
   1000001     4.92095279E+03   # ~d_L
   2000001     4.92084229E+03   # ~d_R
   1000002     4.92070575E+03   # ~u_L
   2000002     4.92076420E+03   # ~u_R
   1000003     4.92095279E+03   # ~s_L
   2000003     4.92084229E+03   # ~s_R
   1000004     4.92070575E+03   # ~c_L
   2000004     4.92076420E+03   # ~c_R
   1000005     4.92054205E+03   # ~b_1
   2000005     4.92125449E+03   # ~b_2
   1000006     5.04852598E+03   # ~t_1
   2000006     5.34955001E+03   # ~t_2
   1000011     5.00008227E+03   # ~e_L
   2000011     5.00007605E+03   # ~e_R
   1000012     4.99984168E+03   # ~nu_eL
   1000013     5.00008227E+03   # ~mu_L
   2000013     5.00007605E+03   # ~mu_R
   1000014     4.99984168E+03   # ~nu_muL
   1000015     4.99985276E+03   # ~tau_1
   2000015     5.00030618E+03   # ~tau_2
   1000016     4.99984168E+03   # ~nu_tauL
   1000021     2.23871954E+03   # ~g
   1000022     8.62253715E+02   # ~chi_10
   1000023    -9.09021458E+02   # ~chi_20
   1000025     9.49402850E+02   # ~chi_30
   1000035     3.12892908E+03   # ~chi_40
   1000024     9.06270010E+02   # ~chi_1+
   1000037     3.12892811E+03   # ~chi_2+
   1000039     1.00000000E-09   # ~gravitino
#
BLOCK NMIX  # Neutralino Mixing Matrix
  1  1     7.10193027E-01   # N_11
  1  2    -2.40773212E-02   # N_12
  1  3     5.00131632E-01   # N_13
  1  4    -4.94888368E-01   # N_14
  2  1     4.81283869E-03   # N_21
  2  2    -3.84922248E-03   # N_22
  2  3    -7.06895587E-01   # N_23
  2  4    -7.07291064E-01   # N_24
  3  1     7.03990206E-01   # N_31
  3  2     2.53094418E-02   # N_32
  3  3    -4.99683709E-01   # N_33
  3  4     5.04056953E-01   # N_34
  4  1     6.99960202E-04   # N_41
  4  2    -9.99382258E-01   # N_42
  4  3    -2.19811260E-02   # N_43
  4  4     2.74124408E-02   # N_44
#
BLOCK UMIX  # Chargino Mixing Matrix U
  1  1    -3.10721660E-02   # U_11
  1  2     9.99517144E-01   # U_12
  2  1     9.99517144E-01   # U_21
  2  2     3.10721660E-02   # U_22
#
BLOCK VMIX  # Chargino Mixing Matrix V
  1  1    -3.87553441E-02   # V_11
  1  2     9.99248729E-01   # V_12
  2  1     9.99248729E-01   # V_21
  2  2     3.87553441E-02   # V_22
#
BLOCK STOPMIX  # Stop Mixing Matrix
  1  1     9.99942113E-01   # cos(theta_t)
  1  2    -1.07596770E-02   # sin(theta_t)
  2  1     1.07596770E-02   # -sin(theta_t)
  2  2     9.99942113E-01   # cos(theta_t)
#
BLOCK SBOTMIX  # Sbottom Mixing Matrix
  1  1     6.49958208E-01   # cos(theta_b)
  1  2     7.59969952E-01   # sin(theta_b)
  2  1    -7.59969952E-01   # -sin(theta_b)
  2  2     6.49958208E-01   # cos(theta_b)
#
BLOCK STAUMIX  # Stau Mixing Matrix
  1  1     7.02237578E-01   # cos(theta_tau)
  1  2     7.11942683E-01   # sin(theta_tau)
  2  1    -7.11942683E-01   # -sin(theta_tau)
  2  2     7.02237578E-01   # cos(theta_tau)
#
BLOCK ALPHA  # Higgs mixing
          -5.90208802E-01   # Mixing angle in the neutral Higgs boson sector
#
BLOCK HMIX Q=  9.11876000E+01  # DRbar Higgs Parameters
         1     8.50000000E+02   # mu(Q)               
         2     1.49999979E+00   # tanbeta(Q)          
         3     2.52039247E+02   # vev(Q)              
         4     3.57514246E+06   # MA^2(Q)             
#
BLOCK GAUGE Q=  9.11876000E+01  # The gauge couplings
     1     3.52850528E-01   # gprime(Q) DRbar
     2     6.27604510E-01   # g(Q) DRbar
     3     1.07892673E+00   # g3(Q) DRbar
#
BLOCK AU Q=  9.11876000E+01  # The trilinear couplings
  1  1     0.00000000E+00   # A_u(Q) DRbar
  2  2     0.00000000E+00   # A_c(Q) DRbar
  3  3     0.00000000E+00   # A_t(Q) DRbar
#
BLOCK AD Q=  9.11876000E+01  # The trilinear couplings
  1  1     0.00000000E+00   # A_d(Q) DRbar
  2  2     0.00000000E+00   # A_s(Q) DRbar
  3  3     0.00000000E+00   # A_b(Q) DRbar
#
BLOCK AE Q=  9.11876000E+01  # The trilinear couplings
  1  1     0.00000000E+00   # A_e(Q) DRbar
  2  2     0.00000000E+00   # A_mu(Q) DRbar
  3  3     0.00000000E+00   # A_tau(Q) DRbar
#
BLOCK Yu Q=  9.11876000E+01  # The Yukawa couplings
  1  1     0.00000000E+00   # y_u(Q) DRbar
  2  2     0.00000000E+00   # y_c(Q) DRbar
  3  3     1.02616560E+00   # y_t(Q) DRbar
#
BLOCK Yd Q=  9.11876000E+01  # The Yukawa couplings
  1  1     0.00000000E+00   # y_d(Q) DRbar
  2  2     0.00000000E+00   # y_s(Q) DRbar
  3  3     2.71904250E-02   # y_b(Q) DRbar
#
BLOCK Ye Q=  9.11876000E+01  # The Yukawa couplings
  1  1     0.00000000E+00   # y_e(Q) DRbar
  2  2     0.00000000E+00   # y_mu(Q) DRbar
  3  3     1.79851549E-02   # y_tau(Q) DRbar
#
BLOCK MSOFT Q=  9.11876000E+01  # The soft SUSY breaking masses at the scale Q
         1     8.54000000E+02   # M_1                 
         2     3.00000000E+03   # M_2                 
         3     2.20000000E+03   # M_3                 
        14     0.00000000E+00   # A_u                 
        15     0.00000000E+00   # A_d                 
        16     0.00000000E+00   # A_e                 
        21     2.24388751E+06   # M^2_Hd              
        22    -6.04898906E+06   # M^2_Hu              
        31     5.00000000E+03   # M_eL                
        32     5.00000000E+03   # M_muL               
        33     5.00000000E+03   # M_tauL              
        34     5.00000000E+03   # M_eR                
        35     5.00000000E+03   # M_muR               
        36     5.00000000E+03   # M_tauR              
        41     5.00000000E+03   # M_q1L               
        42     5.00000000E+03   # M_q2L               
        43     5.00000000E+03   # M_q3L               
        44     5.00000000E+03   # M_uR                
        45     5.00000000E+03   # M_cR                
        46     5.00000000E+03   # M_tR                
        47     5.00000000E+03   # M_dR                
        48     5.00000000E+03   # M_sR                
        49     5.00000000E+03   # M_bR                
#
#
#
#                             =================
#                             |The decay table|
#                             =================
#
# - The QCD corrections to the decays gluino -> squark  + quark
#                                     squark -> gaugino + quark_prime
#                                     squark -> squark_prime + Higgs
#                                     squark -> gluino  + quark
#   are included.
#
# - The multi-body decays for the inos, stops and sbottoms are included.
#
# - The loop induced decays for the gluino, neutralinos and stops
#   are included.
#
# - The SUSY decays of the top quark are included.
#
# - Possible decays of the NLSP in GMSB models are included.
#
#
#         PDG            Width
DECAY         6     1.37240487E+00   # top decays
#          BR         NDA      ID1       ID2
     1.00000000E+00    2           5        24   # BR(t ->  b    W+)
#
#         PDG            Width
DECAY   1000021     2.39611260E-03   # gluino decays
#          BR         NDA      ID1       ID2
     5.47577155E-03    2     1000022        21   # BR(~g -> ~chi_10 g)
     1.03460729E-02    2     1000023        21   # BR(~g -> ~chi_20 g)
     4.80866009E-03    2     1000025        21   # BR(~g -> ~chi_30 g)
#          BR         NDA      ID1       ID2
0.0E+00    2     1000039    21 # BR(~g -> ~G      g)
#           BR         NDA      ID1       ID2       ID3
     5.58166197E-03    3     1000022         1        -1   # BR(~g -> ~chi_10 d  db)
     5.67071131E-07    3     1000023         1        -1   # BR(~g -> ~chi_20 d  db)
     3.84387564E-03    3     1000025         1        -1   # BR(~g -> ~chi_30 d  db)
     1.72509190E-02    3     1000022         2        -2   # BR(~g -> ~chi_10 u  ub)
     4.76590052E-07    3     1000023         2        -2   # BR(~g -> ~chi_20 u  ub)
     1.43920790E-02    3     1000025         2        -2   # BR(~g -> ~chi_30 u  ub)
     5.58166197E-03    3     1000022         3        -3   # BR(~g -> ~chi_10 s  sb)
     5.67071131E-07    3     1000023         3        -3   # BR(~g -> ~chi_20 s  sb)
     3.84387564E-03    3     1000025         3        -3   # BR(~g -> ~chi_30 s  sb)
     1.72509190E-02    3     1000022         4        -4   # BR(~g -> ~chi_10 c  cb)
     4.76590052E-07    3     1000023         4        -4   # BR(~g -> ~chi_20 c  cb)
     1.43920790E-02    3     1000025         4        -4   # BR(~g -> ~chi_30 c  cb)
     5.67569226E-03    3     1000022         5        -5   # BR(~g -> ~chi_10 b  bb)
     2.09902762E-04    3     1000023         5        -5   # BR(~g -> ~chi_20 b  bb)
     3.95432347E-03    3     1000025         5        -5   # BR(~g -> ~chi_30 b  bb)
     1.05584625E-01    3     1000022         6        -6   # BR(~g -> ~chi_10 t  tb)
     1.86239069E-01    3     1000023         6        -6   # BR(~g -> ~chi_20 t  tb)
     1.12630458E-01    3     1000025         6        -6   # BR(~g -> ~chi_30 t  tb)
     1.29321506E-04    3     1000024         1        -2   # BR(~g -> ~chi_1+ d  ub)
     1.29321506E-04    3    -1000024         2        -1   # BR(~g -> ~chi_1- u  db)
     1.29321506E-04    3     1000024         3        -4   # BR(~g -> ~chi_1+ s  cb)
     1.29321506E-04    3    -1000024         4        -3   # BR(~g -> ~chi_1- c  sb)
     2.27699731E-01    3     1000024         5        -6   # BR(~g -> ~chi_1+ b  tb)
     2.27699731E-01    3    -1000024         6        -5   # BR(~g -> ~chi_1- t  bb)
#
#         PDG            Width
DECAY   1000006     2.67370794E+02   # stop1 decays
#          BR         NDA      ID1       ID2
     6.12920665E-02    2     1000022         6   # BR(~t_1 -> ~chi_10 t )
     1.26755987E-01    2     1000023         6   # BR(~t_1 -> ~chi_20 t )
     6.75890031E-02    2     1000025         6   # BR(~t_1 -> ~chi_30 t )
     2.73990501E-02    2     1000035         6   # BR(~t_1 -> ~chi_40 t )
     1.63037541E-05    2     1000024         5   # BR(~t_1 -> ~chi_1+ b )
     5.45271857E-02    2     1000037         5   # BR(~t_1 -> ~chi_2+ b )
     6.43423494E-01    2     1000021         6   # BR(~t_1 -> ~g      t )
     8.15296168E-03    2     1000005        24   # BR(~t_1 -> ~b_1    W+)
     1.08439476E-02    2     2000005        24   # BR(~t_1 -> ~b_2    W+)
#
#         PDG            Width
DECAY   2000006     3.46220817E+02   # stop2 decays
#          BR         NDA      ID1       ID2
     6.88135600E-02    2     1000022         6   # BR(~t_2 -> ~chi_10 t )
     1.05265095E-01    2     1000023         6   # BR(~t_2 -> ~chi_20 t )
     6.70977094E-02    2     1000025         6   # BR(~t_2 -> ~chi_30 t )
    -2.54248755E-05    2     1000035         6   # BR(~t_2 -> ~chi_40 t )
     2.10790305E-01    2     1000024         5   # BR(~t_2 -> ~chi_1+ b )
    -5.05586734E-05    2     1000037         5   # BR(~t_2 -> ~chi_2+ b )
     5.48116488E-01    2     1000021         6   # BR(~t_2 -> ~g      t )
    -1.28786386E-04    2     1000006        25   # BR(~t_2 -> ~t_1    h )
     1.87581620E-05    2     1000006        23   # BR(~t_2 -> ~t_1    Z )
     4.35346537E-05    2     1000005        24   # BR(~t_2 -> ~b_1    W+)
     5.93205341E-05    2     2000005        24   # BR(~t_2 -> ~b_2    W+)
#
#         PDG            Width
DECAY   1000005     1.96271088E+02   # sbottom1 decays
#          BR         NDA      ID1       ID2
     5.84660980E-03    2     1000022         5   # BR(~b_1 -> ~chi_10 b )
     9.89803854E-05    2     1000023         5   # BR(~b_1 -> ~chi_20 b )
     3.51808765E-03    2     1000025         5   # BR(~b_1 -> ~chi_30 b )
     1.20325678E-02    2     1000035         5   # BR(~b_1 -> ~chi_40 b )
     1.11110492E-01    2    -1000024         6   # BR(~b_1 -> ~chi_1- t )
     2.41783398E-02    2    -1000037         6   # BR(~b_1 -> ~chi_2- t )
     8.43214923E-01    2     1000021         5   # BR(~b_1 -> ~g      b )
#
#         PDG            Width
DECAY   2000005     2.23574758E+02   # sbottom2 decays
#          BR         NDA      ID1       ID2
     2.42804146E-03    2     1000022         5   # BR(~b_2 -> ~chi_10 b )
     1.23546771E-04    2     1000023         5   # BR(~b_2 -> ~chi_20 b )
     3.25113474E-03    2     1000025         5   # BR(~b_2 -> ~chi_30 b )
     1.90992677E-02    2     1000035         5   # BR(~b_2 -> ~chi_40 b )
     1.97091820E-01    2    -1000024         6   # BR(~b_2 -> ~chi_1- t )
     3.83934093E-02    2    -1000037         6   # BR(~b_2 -> ~chi_2- t )
     7.39612779E-01    2     1000021         5   # BR(~b_2 -> ~g      b )
#
#         PDG            Width
DECAY   1000002     1.85981615E+02   # sup_L decays
#          BR         NDA      ID1       ID2
     1.11470052E-03    2     1000022         2   # BR(~u_L -> ~chi_10 u)
     8.09053447E-07    2     1000023         2   # BR(~u_L -> ~chi_20 u)
     2.28830667E-03    2     1000025         2   # BR(~u_L -> ~chi_30 u)
     3.56313803E-02    2     1000035         2   # BR(~u_L -> ~chi_40 u)
     2.79907398E-04    2     1000024         1   # BR(~u_L -> ~chi_1+ d)
     7.12624844E-02    2     1000037         1   # BR(~u_L -> ~chi_2+ d)
     8.89422412E-01    2     1000021         2   # BR(~u_L -> ~g      u)
#
#         PDG            Width
DECAY   2000002     1.75158291E+02   # sup_R decays
#          BR         NDA      ID1       ID2
     2.82262919E-02    2     1000022         2   # BR(~u_R -> ~chi_10 u)
     1.28727943E-06    2     1000023         2   # BR(~u_R -> ~chi_20 u)
     2.73681715E-02    2     1000025         2   # BR(~u_R -> ~chi_30 u)
     1.04321866E-08    2     1000035         2   # BR(~u_R -> ~chi_40 u)
     9.44404239E-01    2     1000021         2   # BR(~u_R -> ~g      u)
#
#         PDG            Width
DECAY   1000001     1.85988256E+02   # sdown_L decays
#          BR         NDA      ID1       ID2
     2.31700635E-03    2     1000022         1   # BR(~d_L -> ~chi_10 d)
     2.10256859E-06    2     1000023         1   # BR(~d_L -> ~chi_20 d)
     1.05217573E-03    2     1000025         1   # BR(~d_L -> ~chi_30 d)
     3.56554249E-02    2     1000035         1   # BR(~d_L -> ~chi_40 d)
     1.79930124E-04    2    -1000024         2   # BR(~d_L -> ~chi_1- u)
     7.13114384E-02    2    -1000037         2   # BR(~d_L -> ~chi_2- u)
     8.89481922E-01    2     1000021         1   # BR(~d_L -> ~g      d)
#
#         PDG            Width
DECAY   2000001     1.67860158E+02   # sdown_R decays
#          BR         NDA      ID1       ID2
     7.36350806E-03    2     1000022         1   # BR(~d_R -> ~chi_10 d)
     3.35817920E-07    2     1000023         1   # BR(~d_R -> ~chi_20 d)
     7.13964978E-03    2     1000025         1   # BR(~d_R -> ~chi_30 d)
     2.72159727E-09    2     1000035         1   # BR(~d_R -> ~chi_40 d)
     9.85496504E-01    2     1000021         1   # BR(~d_R -> ~g      d)
#
#         PDG            Width
DECAY   1000004     1.85981615E+02   # scharm_L decays
#          BR         NDA      ID1       ID2
     1.11470052E-03    2     1000022         4   # BR(~c_L -> ~chi_10 c)
     8.09053447E-07    2     1000023         4   # BR(~c_L -> ~chi_20 c)
     2.28830667E-03    2     1000025         4   # BR(~c_L -> ~chi_30 c)
     3.56313803E-02    2     1000035         4   # BR(~c_L -> ~chi_40 c)
     2.79907398E-04    2     1000024         3   # BR(~c_L -> ~chi_1+ s)
     7.12624844E-02    2     1000037         3   # BR(~c_L -> ~chi_2+ s)
     8.89422412E-01    2     1000021         4   # BR(~c_L -> ~g      c)
#
#         PDG            Width
DECAY   2000004     1.75158291E+02   # scharm_R decays
#          BR         NDA      ID1       ID2
     2.82262919E-02    2     1000022         4   # BR(~c_R -> ~chi_10 c)
     1.28727943E-06    2     1000023         4   # BR(~c_R -> ~chi_20 c)
     2.73681715E-02    2     1000025         4   # BR(~c_R -> ~chi_30 c)
     1.04321866E-08    2     1000035         4   # BR(~c_R -> ~chi_40 c)
     9.44404239E-01    2     1000021         4   # BR(~c_R -> ~g      c)
#
#         PDG            Width
DECAY   1000003     1.85988256E+02   # sstrange_L decays
#          BR         NDA      ID1       ID2
     2.31700635E-03    2     1000022         3   # BR(~s_L -> ~chi_10 s)
     2.10256859E-06    2     1000023         3   # BR(~s_L -> ~chi_20 s)
     1.05217573E-03    2     1000025         3   # BR(~s_L -> ~chi_30 s)
     3.56554249E-02    2     1000035         3   # BR(~s_L -> ~chi_40 s)
     1.79930124E-04    2    -1000024         4   # BR(~s_L -> ~chi_1- c)
     7.13114384E-02    2    -1000037         4   # BR(~s_L -> ~chi_2- c)
     8.89481922E-01    2     1000021         3   # BR(~s_L -> ~g      s)
#
#         PDG            Width
DECAY   2000003     1.67860158E+02   # sstrange_R decays
#          BR         NDA      ID1       ID2
     7.36350806E-03    2     1000022         3   # BR(~s_R -> ~chi_10 s)
     3.35817920E-07    2     1000023         3   # BR(~s_R -> ~chi_20 s)
     7.13964978E-03    2     1000025         3   # BR(~s_R -> ~chi_30 s)
     2.72159727E-09    2     1000035         3   # BR(~s_R -> ~chi_40 s)
     9.85496504E-01    2     1000021         3   # BR(~s_R -> ~g      s)
#
#         PDG            Width
DECAY   1000011     2.75860093E+01   # selectron_L decays
#          BR         NDA      ID1       ID2
     9.41191012E-02    2     1000022        11   # BR(~e_L -> ~chi_10 e-)
     8.68023722E-07    2     1000023        11   # BR(~e_L -> ~chi_20 e-)
     1.17016748E-01    2     1000025        11   # BR(~e_L -> ~chi_30 e-)
     2.62341657E-01    2     1000035        11   # BR(~e_L -> ~chi_40 e-)
     1.28268354E-03    2    -1000024        12   # BR(~e_L -> ~chi_1- nu_e)
     5.25238943E-01    2    -1000037        12   # BR(~e_L -> ~chi_2- nu_e)
#
#         PDG            Width
DECAY   2000011     2.31682951E+01   # selectron_R decays
#          BR         NDA      ID1       ID2
     5.07638736E-01    2     1000022        11   # BR(~e_R -> ~chi_10 e-)
     2.31543851E-05    2     1000023        11   # BR(~e_R -> ~chi_20 e-)
     4.92337916E-01    2     1000025        11   # BR(~e_R -> ~chi_30 e-)
     1.93889848E-07    2     1000035        11   # BR(~e_R -> ~chi_40 e-)
#
#         PDG            Width
DECAY   1000013     2.75860093E+01   # smuon_L decays
#          BR         NDA      ID1       ID2
     9.41191012E-02    2     1000022        13   # BR(~mu_L -> ~chi_10 mu-)
     8.68023722E-07    2     1000023        13   # BR(~mu_L -> ~chi_20 mu-)
     1.17016748E-01    2     1000025        13   # BR(~mu_L -> ~chi_30 mu-)
     2.62341657E-01    2     1000035        13   # BR(~mu_L -> ~chi_40 mu-)
     1.28268354E-03    2    -1000024        14   # BR(~mu_L -> ~chi_1- nu_mu)
     5.25238943E-01    2    -1000037        14   # BR(~mu_L -> ~chi_2- nu_mu)
#
#         PDG            Width
DECAY   2000013     2.31682951E+01   # smuon_R decays
#          BR         NDA      ID1       ID2
     5.07638736E-01    2     1000022        13   # BR(~mu_R -> ~chi_10 mu-)
     2.31543851E-05    2     1000023        13   # BR(~mu_R -> ~chi_20 mu-)
     4.92337916E-01    2     1000025        13   # BR(~mu_R -> ~chi_30 mu-)
     1.93889848E-07    2     1000035        13   # BR(~mu_R -> ~chi_40 mu-)
#
#         PDG            Width
DECAY   1000015     2.54262877E+01   # stau_1 decays
#          BR         NDA      ID1       ID2
     2.91342565E-01    2     1000022        15   # BR(~tau_1 -> ~chi_10  tau-)
     4.67170924E-04    2     1000023        15   # BR(~tau_1 -> ~chi_20  tau-)
     2.84935397E-01    2     1000025        15   # BR(~tau_1 -> ~chi_30  tau-)
     1.40082604E-01    2     1000035        15   # BR(~tau_1 -> ~chi_40  tau-)
     2.56824198E-03    2    -1000024        16   # BR(~tau_1 -> ~chi_1-  nu_tau)
     2.80462543E-01    2    -1000037        16   # BR(~tau_1 -> ~chi_2-  nu_tau)
     1.41478200E-04    2     1000039        15   # BR(~tau_1 -> ~G       tau-)
#
#         PDG            Width
DECAY   2000015     2.54218571E+01   # stau_2 decays
#          BR         NDA      ID1       ID2
     2.73970115E-01    2     1000022        15   # BR(~tau_2 -> ~chi_10  tau-)
     7.37470354E-04    2     1000023        15   # BR(~tau_2 -> ~chi_20  tau-)
     2.91276341E-01    2     1000025        15   # BR(~tau_2 -> ~chi_30  tau-)
     1.44568627E-01    2     1000035        15   # BR(~tau_2 -> ~chi_40  tau-)
     5.80971764E-06    2    -1000024        16   # BR(~tau_2 -> ~chi_1-  nu_tau)
     2.89441637E-01    2    -1000037        16   # BR(~tau_2 -> ~chi_2-  nu_tau)
#
#         PDG            Width
DECAY   1000012     2.75858111E+01   # snu_eL decays
#          BR         NDA      ID1       ID2
     1.19822633E-01    2     1000022        12   # BR(~nu_eL -> ~chi_10 nu_e)
     2.85301000E-05    2     1000023        12   # BR(~nu_eL -> ~chi_20 nu_e)
     9.05712387E-02    2     1000025        12   # BR(~nu_eL -> ~chi_30 nu_e)
     2.62711889E-01    2     1000035        12   # BR(~nu_eL -> ~chi_40 nu_e)
     1.99534981E-03    2     1000024        11   # BR(~nu_eL -> ~chi_1+ e-)
     5.24870360E-01    2     1000037        11   # BR(~nu_eL -> ~chi_2+ e-)
#
#         PDG            Width
DECAY   1000014     2.75858111E+01   # snu_muL decays
#          BR         NDA      ID1       ID2
     1.19822633E-01    2     1000022        14   # BR(~nu_muL -> ~chi_10 nu_mu)
     2.85301000E-05    2     1000023        14   # BR(~nu_muL -> ~chi_20 nu_mu)
     9.05712387E-02    2     1000025        14   # BR(~nu_muL -> ~chi_30 nu_mu)
     2.62711889E-01    2     1000035        14   # BR(~nu_muL -> ~chi_40 nu_mu)
     1.99534981E-03    2     1000024        13   # BR(~nu_muL -> ~chi_1+ mu-)
     5.24870360E-01    2     1000037        13   # BR(~nu_muL -> ~chi_2+ mu-)
#
#         PDG            Width
DECAY   1000016     2.76158869E+01   # snu_tauL decays
#          BR         NDA      ID1       ID2
     1.19692137E-01    2     1000022        16   # BR(~nu_tauL -> ~chi_10 nu_tau)
     2.84990285E-05    2     1000023        16   # BR(~nu_tauL -> ~chi_20 nu_tau)
     9.04725997E-02    2     1000025        16   # BR(~nu_tauL -> ~chi_30 nu_tau)
     2.62425776E-01    2     1000035        16   # BR(~nu_tauL -> ~chi_40 nu_tau)
     3.08151131E-03    2     1000024        15   # BR(~nu_tauL -> ~chi_1+ tau-)
     5.24299478E-01    2     1000037        15   # BR(~nu_tauL -> ~chi_2+ tau-)
#
#         PDG            Width
DECAY   1000024     1.03504662E-04   # chargino1+ decays
#          BR         NDA      ID1       ID2
     3.30136907E-03    2     1000039        24   # BR(~chi_1+ -> ~G       W+)
#           BR         NDA      ID1       ID2       ID3
     3.32529828E-01    3     1000022         2        -1   # BR(~chi_1+ -> ~chi_10 u    db)
     3.32529828E-01    3     1000022         4        -3   # BR(~chi_1+ -> ~chi_10 c    sb)
     1.10843408E-01    3     1000022       -11        12   # BR(~chi_1+ -> ~chi_10 e+   nu_e)
     1.10843408E-01    3     1000022       -13        14   # BR(~chi_1+ -> ~chi_10 mu+  nu_mu)
     1.09952160E-01    3     1000022       -15        16   # BR(~chi_1+ -> ~chi_10 tau+ nu_tau)
#
#         PDG            Width
DECAY   1000037     3.66903429E+01   # chargino2+ decays
#          BR         NDA      ID1       ID2
     2.44817738E-01    2     1000024        23   # BR(~chi_2+ -> ~chi_1+  Z )
     1.11751445E-01    2     1000022        24   # BR(~chi_2+ -> ~chi_10  W+)
     2.38470577E-01    2     1000023        24   # BR(~chi_2+ -> ~chi_20  W+)
     1.26916643E-01    2     1000025        24   # BR(~chi_2+ -> ~chi_30  W+)
     2.45919676E-01    2     1000024        25   # BR(~chi_2+ -> ~chi_1+  h )
     7.91267971E-03    2     1000024        35   # BR(~chi_2+ -> ~chi_1+  H )
     8.12690893E-03    2     1000024        36   # BR(~chi_2+ -> ~chi_1+  A )
     4.83502279E-03    2     1000022        37   # BR(~chi_2+ -> ~chi_10  H+)
     7.96494019E-03    2     1000023        37   # BR(~chi_2+ -> ~chi_20  H+)
     3.27498710E-03    2     1000025        37   # BR(~chi_2+ -> ~chi_30  H+)
     9.38107526E-06    2     1000039        24   # BR(~chi_2+ -> ~G       W+)
     6.48178812E-10    2     1000039        37   # BR(~chi_2+ -> ~G       H+)
#
#         PDG            Width
DECAY   1000022    1.0E-05    # neutralino1 decays
#          BR         NDA      ID1       ID2
     5.02337542E-01    2     1000039        22   # BR(~chi_10 -> ~G        gam)
     4.86640070E-01    2     1000039        23   # BR(~chi_10 -> ~G        Z)
     1.10223886E-02    2     1000039        25   # BR(~chi_10 -> ~G        h)
#
#         PDG            Width
DECAY   1000023     1.13197158E-04   # neutralino2 decays
#          BR         NDA      ID1       ID2
     3.10914630E-04    2     1000022        22   # BR(~chi_20 -> ~chi_10 gam)
#          BR         NDA      ID1       ID2
     3.36522307E-08    2     1000039        22   # BR(~chi_20 -> ~G        gam)
     1.17106328E-04    2     1000039        23   # BR(~chi_20 -> ~G        Z)
     2.81105772E-03    2     1000039        25   # BR(~chi_20 -> ~G        h)
#           BR         NDA      ID1       ID2       ID3
     1.18415414E-01    3     1000022        -2         2   # BR(~chi_20 -> ~chi_10 ub      u)
     1.53314668E-01    3     1000022        -1         1   # BR(~chi_20 -> ~chi_10 db      d)
     1.18415414E-01    3     1000022        -4         4   # BR(~chi_20 -> ~chi_10 cb      c)
     1.53314668E-01    3     1000022        -3         3   # BR(~chi_20 -> ~chi_10 sb      s)
     1.38921814E-01    3     1000022        -5         5   # BR(~chi_20 -> ~chi_10 bb      b)
     3.50073425E-02    3     1000022       -11        11   # BR(~chi_20 -> ~chi_10 e+      e-)
     3.50073425E-02    3     1000022       -13        13   # BR(~chi_20 -> ~chi_10 mu+     mu-)
     3.46405054E-02    3     1000022       -15        15   # BR(~chi_20 -> ~chi_10 tau+    tau-)
     6.99069787E-02    3     1000022       -12        12   # BR(~chi_20 -> ~chi_10 nu_eb   nu_e)
     6.99069787E-02    3     1000022       -14        14   # BR(~chi_20 -> ~chi_10 nu_mub  nu_mu)
     6.99069787E-02    3     1000022       -16        16   # BR(~chi_20 -> ~chi_10 nu_taub nu_tau)
     5.15059664E-07    3     1000024        -2         1   # BR(~chi_20 -> ~chi_1+ ub      d)
     5.15059664E-07    3    -1000024        -1         2   # BR(~chi_20 -> ~chi_1- db      u)
     5.15059664E-07    3     1000024        -4         3   # BR(~chi_20 -> ~chi_1+ cb      s)
     5.15059664E-07    3    -1000024        -3         4   # BR(~chi_20 -> ~chi_1- sb      c)
     1.71686566E-07    3     1000024       -12        11   # BR(~chi_20 -> ~chi_1+ nu_eb   e-)
     1.71686566E-07    3    -1000024        12       -11   # BR(~chi_20 -> ~chi_1- nu_e    e+)
     1.71686566E-07    3     1000024       -14        13   # BR(~chi_20 -> ~chi_1+ nu_mub  mu-)
     1.71686566E-07    3    -1000024        14       -13   # BR(~chi_20 -> ~chi_1- nu_mu   mu+)
     1.88522483E-08    3     1000024       -16        15   # BR(~chi_20 -> ~chi_1+ nu_taub tau-)
     1.88522483E-08    3    -1000024        16       -15   # BR(~chi_20 -> ~chi_1- nu_tau  tau+)
#
#         PDG            Width
DECAY   1000025     2.42910674E-04   # neutralino3 decays
#          BR         NDA      ID1       ID2
     3.44913635E-04    2     1000022        22   # BR(~chi_30 -> ~chi_10 gam)
     3.77687015E-04    2     1000023        22   # BR(~chi_30 -> ~chi_20 gam)
#          BR         NDA      ID1       ID2
     1.43291930E-03    2     1000039        22   # BR(~chi_30 -> ~G        gam)
     1.22208197E-03    2     1000039        23   # BR(~chi_30 -> ~G        Z)
     3.36999263E-05    2     1000039        25   # BR(~chi_30 -> ~G        h)
#           BR         NDA      ID1       ID2       ID3
     1.03341263E-05    3     1000022        -2         2   # BR(~chi_30 -> ~chi_10 ub      u)
     1.23591057E-05    3     1000022        -1         1   # BR(~chi_30 -> ~chi_10 db      d)
     1.03341263E-05    3     1000022        -4         4   # BR(~chi_30 -> ~chi_10 cb      c)
     1.23591057E-05    3     1000022        -3         3   # BR(~chi_30 -> ~chi_10 sb      s)
     1.60924087E-05    3     1000022        -5         5   # BR(~chi_30 -> ~chi_10 bb      b)
     2.20792167E-06    3     1000022       -11        11   # BR(~chi_30 -> ~chi_10 e+      e-)
     2.20792167E-06    3     1000022       -13        13   # BR(~chi_30 -> ~chi_10 mu+     mu-)
     2.79936841E-06    3     1000022       -15        15   # BR(~chi_30 -> ~chi_10 tau+    tau-)
     6.01400790E-06    3     1000022       -12        12   # BR(~chi_30 -> ~chi_10 nu_eb   nu_e)
     6.01400790E-06    3     1000022       -14        14   # BR(~chi_30 -> ~chi_10 nu_mub  nu_mu)
     6.01400790E-06    3     1000022       -16        16   # BR(~chi_30 -> ~chi_10 nu_taub nu_tau)
     2.60751437E-02    3     1000023        -2         2   # BR(~chi_30 -> ~chi_20 ub      u)
     3.37600486E-02    3     1000023        -1         1   # BR(~chi_30 -> ~chi_20 db      d)
     2.60751437E-02    3     1000023        -4         4   # BR(~chi_30 -> ~chi_20 cb      c)
     3.37600486E-02    3     1000023        -3         3   # BR(~chi_30 -> ~chi_20 sb      s)
     2.96328448E-02    3     1000023        -5         5   # BR(~chi_30 -> ~chi_20 bb      b)
     7.70868277E-03    3     1000023       -11        11   # BR(~chi_30 -> ~chi_20 e+      e-)
     7.70868277E-03    3     1000023       -13        13   # BR(~chi_30 -> ~chi_20 mu+     mu-)
     7.60821339E-03    3     1000023       -15        15   # BR(~chi_30 -> ~chi_20 tau+    tau-)
     1.53935161E-02    3     1000023       -12        12   # BR(~chi_30 -> ~chi_20 nu_eb   nu_e)
     1.53935161E-02    3     1000023       -14        14   # BR(~chi_30 -> ~chi_20 nu_mub  nu_mu)
     1.53935161E-02    3     1000023       -16        16   # BR(~chi_30 -> ~chi_20 nu_taub nu_tau)
     1.29786314E-01    3     1000024        -2         1   # BR(~chi_30 -> ~chi_1+ ub      d)
     1.29786314E-01    3    -1000024        -1         2   # BR(~chi_30 -> ~chi_1- db      u)
     1.29786314E-01    3     1000024        -4         3   # BR(~chi_30 -> ~chi_1+ cb      s)
     1.29786314E-01    3    -1000024        -3         4   # BR(~chi_30 -> ~chi_1- sb      c)
     4.32620350E-02    3     1000024       -12        11   # BR(~chi_30 -> ~chi_1+ nu_eb   e-)
     4.32620350E-02    3    -1000024        12       -11   # BR(~chi_30 -> ~chi_1- nu_e    e+)
     4.32620350E-02    3     1000024       -14        13   # BR(~chi_30 -> ~chi_1+ nu_mub  mu-)
     4.32620350E-02    3    -1000024        14       -13   # BR(~chi_30 -> ~chi_1- nu_mu   mu+)
     4.28996051E-02    3     1000024       -16        15   # BR(~chi_30 -> ~chi_1+ nu_taub tau-)
     4.28996051E-02    3    -1000024        16       -15   # BR(~chi_30 -> ~chi_1- nu_tau  tau+)
#
#         PDG            Width
DECAY   1000035     3.66907361E+01   # neutralino4 decays
#          BR         NDA      ID1       ID2
     1.35411971E-03    2     1000022        23   # BR(~chi_40 -> ~chi_10   Z )
     2.41966098E-01    2     1000023        23   # BR(~chi_40 -> ~chi_20   Z )
     1.55885011E-03    2     1000025        23   # BR(~chi_40 -> ~chi_30   Z )
     2.38395549E-01    2     1000024       -24   # BR(~chi_40 -> ~chi_1+   W-)
     2.38395549E-01    2    -1000024        24   # BR(~chi_40 -> ~chi_1-   W+)
     1.13938368E-01    2     1000022        25   # BR(~chi_40 -> ~chi_10   h )
     1.46223673E-03    2     1000022        35   # BR(~chi_40 -> ~chi_10   H )
     3.34204246E-03    2     1000022        36   # BR(~chi_40 -> ~chi_10   A )
     2.88088489E-03    2     1000023        25   # BR(~chi_40 -> ~chi_20   h )
     5.11691255E-03    2     1000023        35   # BR(~chi_40 -> ~chi_20   H )
     2.78460893E-03    2     1000023        36   # BR(~chi_40 -> ~chi_20   A )
     1.29386863E-01    2     1000025        25   # BR(~chi_40 -> ~chi_30   h )
     1.23256952E-03    2     1000025        35   # BR(~chi_40 -> ~chi_30   H )
     2.01614639E-03    2     1000025        36   # BR(~chi_40 -> ~chi_30   A )
     8.07991104E-03    2     1000024       -37   # BR(~chi_40 -> ~chi_1+   H-)
     8.07991104E-03    2    -1000024        37   # BR(~chi_40 -> ~chi_1-   H+)
     2.25169312E-06    2     1000039        22   # BR(~chi_40 -> ~G        gam)
     7.12850632E-06    2     1000039        23   # BR(~chi_40 -> ~G        Z)
     5.19486386E-10    2     1000039        25   # BR(~chi_40 -> ~G        h)
     6.39567446E-10    2     1000039        35   # BR(~chi_40 -> ~G        H)
     5.47432150E-12    2     1000039        36   # BR(~chi_40 -> ~G        A)
#
#         PDG            Width
DECAY        25     4.21898124E-03   # h decays
#          BR         NDA      ID1       ID2
     6.01902144E-01    2           5        -5   # BR(h -> b       bb     )
     6.22308481E-02    2         -15        15   # BR(h -> tau+    tau-   )
     2.20270072E-04    2         -13        13   # BR(h -> mu+     mu-    )
     4.66048713E-04    2           3        -3   # BR(h -> s       sb     )
     2.01056913E-02    2           4        -4   # BR(h -> c       cb     )
     6.63998597E-02    2          21        21   # BR(h -> g       g      )
     2.30820384E-03    2          22        22   # BR(h -> gam     gam    )
     1.62633959E-03    2          22        23   # BR(h -> Z       gam    )
     2.16663788E-01    2          24       -24   # BR(h -> W+      W-     )
     2.80768071E-02    2          23        23   # BR(h -> Z       Z      )
#
#         PDG            Width
DECAY        35     3.88096208E+01   # H decays
#          BR         NDA      ID1       ID2
     1.43334741E-03    2           5        -5   # BR(H -> b       bb     )
     2.40082844E-04    2         -15        15   # BR(H -> tau+    tau-   )
     8.48782238E-07    2         -13        13   # BR(H -> mu+     mu-    )
     1.08674875E-06    2           3        -3   # BR(H -> s       sb     )
     9.80789151E-06    2           4        -4   # BR(H -> c       cb     )
     9.70446372E-01    2           6        -6   # BR(H -> t       tb     )
     7.77228237E-04    2          21        21   # BR(H -> g       g      )
     2.63842435E-06    2          22        22   # BR(H -> gam     gam    )
     1.12987167E-06    2          23        22   # BR(H -> Z       gam    )
     3.28038409E-04    2          24       -24   # BR(H -> W+      W-     )
     1.63571811E-04    2          23        23   # BR(H -> Z       Z      )
     8.81057807E-04    2          25        25   # BR(H -> h       h      )
     7.44894250E-24    2          36        36   # BR(H -> A       A      )
     3.00164387E-11    2          23        36   # BR(H -> Z       A      )
     7.42723754E-12    2          24       -37   # BR(H -> W+      H-     )
     7.42723754E-12    2         -24        37   # BR(H -> W-      H+     )
     7.58186226E-06    2     1000024  -1000024   # BR(H -> ~chi_1+ ~chi_1-)
     1.83575080E-04    2     1000022   1000022   # BR(H -> ~chi_10 ~chi_10)
     1.29234410E-06    2     1000023   1000023   # BR(H -> ~chi_20 ~chi_20)
     3.16416360E-05    2     1000025   1000025   # BR(H -> ~chi_30 ~chi_30)
     1.58359921E-02    2     1000022   1000023   # BR(H -> ~chi_10 ~chi_20)
     4.61303689E-07    2     1000022   1000025   # BR(H -> ~chi_10 ~chi_30)
     9.65424536E-03    2     1000023   1000025   # BR(H -> ~chi_20 ~chi_30)
#
#         PDG            Width
DECAY        36     3.92441009E+01   # A decays
#          BR         NDA      ID1       ID2
     1.43634307E-03    2           5        -5   # BR(A -> b       bb     )
     2.37646326E-04    2         -15        15   # BR(A -> tau+    tau-   )
     8.40165610E-07    2         -13        13   # BR(A -> mu+     mu-    )
     1.10763706E-06    2           3        -3   # BR(A -> s       sb     )
     9.70643270E-06    2           4        -4   # BR(A -> c       cb     )
     9.71441774E-01    2           6        -6   # BR(A -> t       tb     )
     9.19488095E-04    2          21        21   # BR(A -> g       g      )
     2.99658351E-06    2          22        22   # BR(A -> gam     gam    )
     1.31759844E-06    2          23        22   # BR(A -> Z       gam    )
     3.19699766E-04    2          23        25   # BR(A -> Z       h      )
     4.48596825E-04    2     1000024  -1000024   # BR(A -> ~chi_1+ ~chi_1-)
     1.68679262E-02    2     1000022   1000022   # BR(A -> ~chi_10 ~chi_10)
     2.84481856E-07    2     1000023   1000023   # BR(A -> ~chi_20 ~chi_20)
     8.00078429E-03    2     1000025   1000025   # BR(A -> ~chi_30 ~chi_30)
     1.19373232E-04    2     1000022   1000023   # BR(A -> ~chi_10 ~chi_20)
     1.34266509E-04    2     1000022   1000025   # BR(A -> ~chi_10 ~chi_30)
     5.78486000E-05    2     1000023   1000025   # BR(A -> ~chi_20 ~chi_30)
#
#         PDG            Width
DECAY        37     3.84329008E+01   # H+ decays
#          BR         NDA      ID1       ID2
     2.30393762E-06    2           4        -5   # BR(H+ -> c       bb     )
     2.42842364E-04    2         -15        16   # BR(H+ -> tau+    nu_tau )
     8.58535479E-07    2         -13        14   # BR(H+ -> mu+     nu_mu  )
     1.46478773E-08    2           2        -5   # BR(H+ -> u       bb     )
     5.31693162E-08    2           2        -3   # BR(H+ -> u       sb     )
     1.05941879E-05    2           4        -3   # BR(H+ -> c       sb     )
     9.73761741E-01    2           6        -5   # BR(H+ -> t       bb     )
     3.27638290E-04    2          24        25   # BR(H+ -> W+      h      )
     2.46278258E-13    2          24        36   # BR(H+ -> W+      A      )
     1.42782144E-02    2     1000024   1000022   # BR(H+ -> ~chi_1+ ~chi_10)
     1.06584313E-04    2     1000024   1000023   # BR(H+ -> ~chi_1+ ~chi_20)
     1.12691548E-02    2     1000024   1000025   # BR(H+ -> ~chi_1+ ~chi_30)
