#
#                              ======================
#                              | THE SUSYHIT OUTPUT |
#                              ======================
#
#
#              ------------------------------------------------------
#              |     This is the output of the SUSY-HIT package     |
#              |  created by A.Djouadi, M.Muehlleitner and M.Spira. |
#              |  In case of problems with SUSY-HIT email to        |
#              |           margarete.muehlleitner@cern.ch           |
#              |           michael.spira@psi.ch                     |
#              |           abdelhak.djouadi@cern.ch                 |
#              ------------------------------------------------------
#
#              ------------------------------------------------------
#              |  SUSY Les Houches Accord - MSSM Spectrum + Decays  |
#              |              based on the decay programs           |
#              |                                                    |
#              |                     SDECAY 1.3b                    |
#              |                                                    |
#              |  Authors: M.Muhlleitner, A.Djouadi and Y.Mambrini  |
#              |  Ref.:    Comput.Phys.Commun.168(2005)46           |
#              |           [hep-ph/0311167]                         |
#              |                                                    |
#              |                     HDECAY 3.4                     |
#              |                                                    |
#              |  By: A.Djouadi,J.Kalinowski,M.Muhlleitner,M.Spira  |
#              |  Ref.:    Comput.Phys.Commun.108(1998)56           |
#              |           [hep-ph/9704448]                         |
#              |                                                    |
#              |                                                    |
#              |  If not stated otherwise all DRbar couplings and   |
#              |  soft SUSY breaking masses are given at the scale  |
#              |  Q=  0.91187600E+02
#              |                                                    |
#              ------------------------------------------------------
#
#
BLOCK DCINFO  # Decay Program information
     1   SDECAY/HDECAY # decay calculator
     2   1.3b  /3.4    # version number
#
BLOCK SPINFO  # Spectrum calculator information
     1   SuSpect     # RGE +Spectrum calculator            
     2   2.41         # version number                     
#
BLOCK MODSEL  # Model selection
     1     0   # #general MSSM low scale                           
#
BLOCK SMINPUTS  # Standard Model inputs
         1     1.27934000E+02   # alpha_em^-1(M_Z)^MSbar
         2     1.16639000E-05   # G_F [GeV^-2]
         3     1.17200000E-01   # alpha_S(M_Z)^MSbar
         4     9.11870000E+01   # M_Z pole mass
         5     4.25000000E+00   # mb(mb)^MSbar
         6     1.72500000E+02   # mt pole mass
         7     1.77700000E+00   # mtau pole mass
#
BLOCK MINPAR  # Input parameters - minimal models
#
BLOCK EXTPAR  # Input parameters - non-minimal models
         0     9.11876000E+01   # EWSB                
         1     6.00000000E+02   # M_1                 
         2     1.00000000E+05   # M_2                 
         3     1.00000000E+05   # M_3                 
        11     0.00000000E+00   # A_t                 
        12     0.00000000E+00   # A_b                 
        13     0.00000000E+00   # A_tau               
        14     0.00000000E+00   # A_u                 
        15     0.00000000E+00   # A_d                 
        16     0.00000000E+00   # A_e                 
        23     3.50000000E+03   # mu(EWSB)            
        25     1.50000000E+00   # tanbeta(in)         
        26     2.00000000E+03   # MA_pole             
        31     1.00000000E+05   # M_eL                
        32     1.00000000E+05   # M_muL               
        33     1.00000000E+05   # M_tauL              
        34     1.00000000E+05   # M_eR                
        35     1.00000000E+05   # M_muR               
        36     1.00000000E+05   # M_tauR              
        41     1.60000000E+03   # M_q1L               
        42     1.60000000E+03   # M_q2L               
        43     1.60000000E+03   # M_q3L               
        44     1.00000000E+05   # M_uR                
        45     1.00000000E+05   # M_cR                
        46     1.00000000E+05   # M_tR                
        47     1.60000000E+03   # M_dR                
        48     1.60000000E+03   # M_sR                
        49     1.60000000E+03   # M_bR                
#
BLOCK MASS  # Mass Spectrum
# PDG code           mass       particle
        24     8.05830192E+01   # W+
        25     1.25000000E+02   # h
        35     2.00401937E+03   # H
        36     2.00000000E+03   # A
        37     2.02369488E+03   # H+
         5     4.87877839E+00   # b-quark pole mass calculated from mb(mb)_Msbar
   1000001     1.60041498E+03   # ~d_L
   2000001     1.60007996E+03   # ~d_R
   1000002     1.59966489E+03   # ~u_L
   2000002     9.99999974E+04   # ~u_R
   1000003     1.60041498E+03   # ~s_L
   2000003     1.60007996E+03   # ~s_R
   1000004     1.59966489E+03   # ~c_L
   2000004     9.99999974E+04   # ~c_R
   1000005     1.59600057E+03   # ~b_1
   2000005     1.60448731E+03   # ~b_2
   1000006     1.60644724E+03   # ~t_1
   2000006     1.00000106E+05   # ~t_2
   1000011     1.00000004E+05   # ~e_L
   2000011     1.00000004E+05   # ~e_R
   1000012     9.99999921E+04   # ~nu_eL
   1000013     1.00000004E+05   # ~mu_L
   2000013     1.00000004E+05   # ~mu_R
   1000014     9.99999921E+04   # ~nu_muL
   1000015     9.99999574E+04   # ~tau_1
   2000015     1.00000051E+05   # ~tau_2
   1000016     9.99999921E+04   # ~nu_tauL
   1000021     1.00000000E+05   # ~g
   1000022     5.99357076E+02   # ~chi_10
   1000023    -3.50002104E+03   # ~chi_20
   1000025     3.50059946E+03   # ~chi_30
   1000035     1.00000065E+05   # ~chi_40
   1000024     3.49994013E+03   # ~chi_1+
   1000037     1.00000065E+05   # ~chi_2+
   1000039     1.00000000E-09   # ~gravitino
#
BLOCK NMIX  # Neutralino Mixing Matrix
  1  1     9.99883681E-01   # N_11
  1  2    -1.14358943E-05   # N_12
  1  3     1.21895743E-02   # N_13
  1  4    -9.16722491E-03   # N_14
  2  1     2.13713802E-03   # N_21
  2  2    -1.49702325E-04   # N_22
  2  3    -7.07094529E-01   # N_23
  2  4    -7.07115787E-01   # N_24
  3  1     1.51015388E-02   # N_31
  3  2     8.02665645E-04   # N_32
  3  3    -7.07013810E-01   # N_33
  3  4     7.07038027E-01   # N_34
  4  1     3.66988483E-07   # N_41
  4  2    -9.99999667E-01   # N_42
  4  3    -4.61781553E-04   # N_43
  4  4     6.73477071E-04   # N_44
#
BLOCK UMIX  # Chargino Mixing Matrix U
  1  1    -6.53057530E-04   # U_11
  1  2     9.99999787E-01   # U_12
  2  1     9.99999787E-01   # U_21
  2  2     6.53057530E-04   # U_22
#
BLOCK VMIX  # Chargino Mixing Matrix V
  1  1    -9.52440320E-04   # V_11
  1  2     9.99999546E-01   # V_12
  2  1     9.99999546E-01   # V_21
  2  2     9.52440320E-04   # V_22
#
BLOCK STOPMIX  # Stop Mixing Matrix
  1  1     9.99999999E-01   # cos(theta_t)
  1  2     4.47213589E-05   # sin(theta_t)
  2  1    -4.47213589E-05   # -sin(theta_t)
  2  2     9.99999999E-01   # cos(theta_t)
#
BLOCK SBOTMIX  # Sbottom Mixing Matrix
  1  1     6.93009442E-01   # cos(theta_b)
  1  2     7.20928508E-01   # sin(theta_b)
  2  1    -7.20928508E-01   # -sin(theta_b)
  2  2     6.93009442E-01   # cos(theta_b)
#
BLOCK STAUMIX  # Stau Mixing Matrix
  1  1     7.06182051E-01   # cos(theta_tau)
  1  2     7.08030304E-01   # sin(theta_tau)
  2  1    -7.08030304E-01   # -sin(theta_tau)
  2  2     7.06182051E-01   # cos(theta_tau)
#
BLOCK ALPHA  # Higgs mixing
          -5.90303848E-01   # Mixing angle in the neutral Higgs boson sector
#
BLOCK HMIX Q=  9.11876000E+01  # DRbar Higgs Parameters
         1     3.50000000E+03   # mu(Q)               
         2     1.49999982E+00   # tanbeta(Q)          
         3     2.54865897E+02   # vev(Q)              
         4    -6.82055255E+07   # MA^2(Q)             
#
BLOCK GAUGE Q=  9.11876000E+01  # The gauge couplings
     1     3.50583986E-01   # gprime(Q) DRbar
     2     6.19929639E-01   # g(Q) DRbar
     3     1.02445338E+00   # g3(Q) DRbar
#
BLOCK AU Q=  9.11876000E+01  # The trilinear couplings
  1  1     0.00000000E+00   # A_u(Q) DRbar
  2  2     0.00000000E+00   # A_c(Q) DRbar
  3  3     0.00000000E+00   # A_t(Q) DRbar
#
BLOCK AD Q=  9.11876000E+01  # The trilinear couplings
  1  1     0.00000000E+00   # A_d(Q) DRbar
  2  2     0.00000000E+00   # A_s(Q) DRbar
  3  3     0.00000000E+00   # A_b(Q) DRbar
#
BLOCK AE Q=  9.11876000E+01  # The trilinear couplings
  1  1     0.00000000E+00   # A_e(Q) DRbar
  2  2     0.00000000E+00   # A_mu(Q) DRbar
  3  3     0.00000000E+00   # A_tau(Q) DRbar
#
BLOCK Yu Q=  9.11876000E+01  # The Yukawa couplings
  1  1     0.00000000E+00   # y_u(Q) DRbar
  2  2     0.00000000E+00   # y_c(Q) DRbar
  3  3     9.83674678E-01   # y_t(Q) DRbar
#
BLOCK Yd Q=  9.11876000E+01  # The Yukawa couplings
  1  1     0.00000000E+00   # y_d(Q) DRbar
  2  2     0.00000000E+00   # y_s(Q) DRbar
  3  3     2.58567556E-02   # y_b(Q) DRbar
#
BLOCK Ye Q=  9.11876000E+01  # The Yukawa couplings
  1  1     0.00000000E+00   # y_e(Q) DRbar
  2  2     0.00000000E+00   # y_mu(Q) DRbar
  3  3     1.77400685E-02   # y_tau(Q) DRbar
#
BLOCK MSOFT Q=  9.11876000E+01  # The soft SUSY breaking masses at the scale Q
         1     6.00000000E+02   # M_1                 
         2     1.00000000E+05   # M_2                 
         3     1.00000000E+05   # M_3                 
        14     0.00000000E+00   # A_u                 
        15     0.00000000E+00   # A_d                 
        16     0.00000000E+00   # A_e                 
        21     6.31608271E+08   # M^2_Hd              
        22    -1.14924892E+09   # M^2_Hu              
        31     1.00000000E+05   # M_eL                
        32     1.00000000E+05   # M_muL               
        33     1.00000000E+05   # M_tauL              
        34     1.00000000E+05   # M_eR                
        35     1.00000000E+05   # M_muR               
        36     1.00000000E+05   # M_tauR              
        41     1.60000000E+03   # M_q1L               
        42     1.60000000E+03   # M_q2L               
        43     1.60000000E+03   # M_q3L               
        44     1.00000000E+05   # M_uR                
        45     1.00000000E+05   # M_cR                
        46     1.00000000E+05   # M_tR                
        47     1.60000000E+03   # M_dR                
        48     1.60000000E+03   # M_sR                
        49     1.60000000E+03   # M_bR                
#
#
#
#                             =================
#                             |The decay table|
#                             =================
#
# - The QCD corrections to the decays gluino -> squark  + quark
#                                     squark -> gaugino + quark_prime
#                                     squark -> squark_prime + Higgs
#                                     squark -> gluino  + quark
#   are included.
#
# - The multi-body decays for the inos, stops and sbottoms are included.
#
# - The loop induced decays for the gluino, neutralinos and stops
#   are included.
#
# - The SUSY decays of the top quark are included.
#
# - Possible decays of the NLSP in GMSB models are included.
#
#
#         PDG            Width
DECAY         6     1.32644162E+00   # top decays
#          BR         NDA      ID1       ID2
     1.00000000E+00    2           5        24   # BR(t ->  b    W+)
#
#         PDG            Width
DECAY   1000021     1.E-04   # gluino decays (OJ Mods)
#          BR         NDA      ID1       ID2
     1.11979080E-03    2     1000001        -1   # BR(~g -> ~d_L  db)
     1.11979080E-03    2    -1000001         1   # BR(~g -> ~d_L* d )
     1.11979104E-03    2     2000001        -1   # BR(~g -> ~d_R  db)
     1.11979104E-03    2    -2000001         1   # BR(~g -> ~d_R* d )
     1.11979134E-03    2     1000002        -2   # BR(~g -> ~u_L  ub)
     1.11979134E-03    2    -1000002         2   # BR(~g -> ~u_L* u )
     3.02946596E-18    2     2000002        -2   # BR(~g -> ~u_R  ub)
     3.02946596E-18    2    -2000002         2   # BR(~g -> ~u_R* u )
     1.11979080E-03    2     1000003        -3   # BR(~g -> ~s_L  sb)
     1.11979080E-03    2    -1000003         3   # BR(~g -> ~s_L* s )
     1.11979104E-03    2     2000003        -3   # BR(~g -> ~s_R  sb)
     1.11979104E-03    2    -2000003         3   # BR(~g -> ~s_R* s )
     1.11979134E-03    2     1000004        -4   # BR(~g -> ~c_L  cb)
     1.11979134E-03    2    -1000004         4   # BR(~g -> ~c_L* c )
     3.02946596E-18    2     2000004        -4   # BR(~g -> ~c_R  cb)
     3.02946596E-18    2    -2000004         4   # BR(~g -> ~c_R* c )
     2.38440298E-01    2     1000005        -5   # BR(~g -> ~b_1  bb)
     2.38440298E-01    2    -1000005         5   # BR(~g -> ~b_1* b )
     2.38042929E-01    2     2000005        -5   # BR(~g -> ~b_2  bb)
     2.38042929E-01    2    -2000005         5   # BR(~g -> ~b_2* b )
     1.10204598E-03    2     1000006        -6   # BR(~g -> ~t_1  tb)
     1.10204598E-03    2    -1000006         6   # BR(~g -> ~t_1* t )
     3.13919602E-02    2     1000039        21   # BR(~g -> ~G g)
#
#         PDG            Width
DECAY   1000006     1.91240091E-01   # stop1 decays
#          BR         NDA      ID1       ID2
     1.00000000E+00    2     1000022         6   # BR(~t_1 -> ~chi_10 t )
#
#         PDG            Width
DECAY   2000006     1.58468259E+05   # stop2 decays
#          BR         NDA      ID1       ID2
     1.31519437E-03    2     1000022         6   # BR(~t_2 -> ~chi_10 t )
     3.15456582E-03    2     1000023         6   # BR(~t_2 -> ~chi_20 t )
     3.15411332E-03    2     1000025         6   # BR(~t_2 -> ~chi_30 t )
     9.92484629E-01    2     1000024         5   # BR(~t_2 -> ~chi_1+ b )
    -8.58235144E-05    2     1000006        25   # BR(~t_2 -> ~t_1    h )
     8.98734692E-05    2     1000006        35   # BR(~t_2 -> ~t_1    H )
     8.97159418E-05    2     1000006        36   # BR(~t_2 -> ~t_1    A )
     8.45125233E-05    2     1000005        37   # BR(~t_2 -> ~b_1    H+)
     9.49171450E-05    2     2000005        37   # BR(~t_2 -> ~b_2    H+)
    -6.12115661E-05    2     1000006        23   # BR(~t_2 -> ~t_1    Z )
    -1.53921213E-04    2     1000005        24   # BR(~t_2 -> ~b_1    W+)
    -1.66565626E-04    2     2000005        24   # BR(~t_2 -> ~b_2    W+)
#
#         PDG            Width
DECAY   1000005     3.53464842E+01   # sbottom1 decays
#          BR         NDA      ID1       ID2
     1.00000000E+00    2     1000022         5   # BR(~b_1 -> ~chi_10 b )
#
#         PDG            Width
DECAY   2000005     3.34927029E+01   # sbottom2 decays
#          BR         NDA      ID1       ID2
     1.00000000E+00    2     1000022         5   # BR(~b_2 -> ~chi_10 b )
#
#         PDG            Width
DECAY   1000002     1.95320896E-01   # sup_L decays
#          BR         NDA      ID1       ID2
     1.00000000E+00    2     1000022         2   # BR(~u_L -> ~chi_10 u)
#
#         PDG            Width
DECAY   2000002     2.08396947E+02   # sup_R decays
#          BR         NDA      ID1       ID2
     9.99767641E-01    2     1000022         2   # BR(~u_R -> ~chi_10 u)
     4.56215709E-06    2     1000023         2   # BR(~u_R -> ~chi_20 u)
     2.27796621E-04    2     1000025         2   # BR(~u_R -> ~chi_30 u)
#
#         PDG            Width
DECAY   1000001     1.95512693E-01   # sdown_L decays
#          BR         NDA      ID1       ID2
     1.00000000E+00    2     1000022         1   # BR(~d_L -> ~chi_10 d)
#
#         PDG            Width
DECAY   2000001     7.81697966E-01   # sdown_R decays
#          BR         NDA      ID1       ID2
     1.00000000E+00    2     1000022         1   # BR(~d_R -> ~chi_10 d)
#
#         PDG            Width
DECAY   1000004     1.95320896E-01   # scharm_L decays
#          BR         NDA      ID1       ID2
     1.00000000E+00    2     1000022         4   # BR(~c_L -> ~chi_10 c)
#
#         PDG            Width
DECAY   2000004     2.08396947E+02   # scharm_R decays
#          BR         NDA      ID1       ID2
     9.99767641E-01    2     1000022         4   # BR(~c_R -> ~chi_10 c)
     4.56215709E-06    2     1000023         4   # BR(~c_R -> ~chi_20 c)
     2.27796621E-04    2     1000025         4   # BR(~c_R -> ~chi_30 c)
#
#         PDG            Width
DECAY   1000003     1.95512693E-01   # sstrange_L decays
#          BR         NDA      ID1       ID2
     1.00000000E+00    2     1000022         3   # BR(~s_L -> ~chi_10 s)
#
#         PDG            Width
DECAY   2000003     7.81697966E-01   # sstrange_R decays
#          BR         NDA      ID1       ID2
     1.00000000E+00    2     1000022         3   # BR(~s_R -> ~chi_10 s)
#
#         PDG            Width
DECAY   1000011     1.22251853E+02   # selectron_L decays
#          BR         NDA      ID1       ID2
     9.99721553E-01    2     1000022        11   # BR(~e_L -> ~chi_10 e-)
     3.49761522E-06    2     1000023        11   # BR(~e_L -> ~chi_20 e-)
     2.72288856E-04    2     1000025        11   # BR(~e_L -> ~chi_30 e-)
     2.66071132E-06    2    -1000024        12   # BR(~e_L -> ~chi_1- nu_e)
#
#         PDG            Width
DECAY   2000011     4.89004509E+02   # selectron_R decays
#          BR         NDA      ID1       ID2
     9.99767929E-01    2     1000022        11   # BR(~e_R -> ~chi_10 e-)
     4.55650549E-06    2     1000023        11   # BR(~e_R -> ~chi_20 e-)
     2.27514358E-04    2     1000025        11   # BR(~e_R -> ~chi_30 e-)
#
#         PDG            Width
DECAY   1000013     1.22251853E+02   # smuon_L decays
#          BR         NDA      ID1       ID2
     9.99721553E-01    2     1000022        13   # BR(~mu_L -> ~chi_10 mu-)
     3.49761522E-06    2     1000023        13   # BR(~mu_L -> ~chi_20 mu-)
     2.72288856E-04    2     1000025        13   # BR(~mu_L -> ~chi_30 mu-)
     2.66071132E-06    2    -1000024        14   # BR(~mu_L -> ~chi_1- nu_mu)
#
#         PDG            Width
DECAY   2000013     4.89004509E+02   # smuon_R decays
#          BR         NDA      ID1       ID2
     9.99767929E-01    2     1000022        13   # BR(~mu_R -> ~chi_10 mu-)
     4.55650549E-06    2     1000023        13   # BR(~mu_R -> ~chi_20 mu-)
     2.27514358E-04    2     1000025        13   # BR(~mu_R -> ~chi_30 mu-)
#
#         PDG            Width
DECAY   1000015     1.18199866E+04   # stau_1 decays
#          BR         NDA      ID1       ID2
     2.59002206E-02    2     1000022        15   # BR(~tau_1 -> ~chi_10  tau-)
     2.52774004E-05    2     1000023        15   # BR(~tau_1 -> ~chi_20  tau-)
     2.53930492E-05    2     1000025        15   # BR(~tau_1 -> ~chi_30  tau-)
     2.77083898E-05    2    -1000024        16   # BR(~tau_1 -> ~chi_1-  nu_tau)
     9.74021401E-01    2     1000039        15   # BR(~tau_1 -> ~G       tau-)
#
#         PDG            Width
DECAY   2000015     3.06063354E+02   # stau_2 decays
#          BR         NDA      ID1       ID2
     9.96423651E-01    2     1000022        15   # BR(~tau_2 -> ~chi_10  tau-)
     1.07304015E-03    2     1000023        15   # BR(~tau_2 -> ~chi_20  tau-)
     1.53169643E-03    2     1000025        15   # BR(~tau_2 -> ~chi_30  tau-)
     9.71612557E-04    2    -1000024        16   # BR(~tau_2 -> ~chi_1-  nu_tau)
#
#         PDG            Width
DECAY   1000012     1.22251912E+02   # snu_eL decays
#          BR         NDA      ID1       ID2
     9.99801829E-01    2     1000022        12   # BR(~nu_eL -> ~chi_10 nu_e)
     5.75515257E-06    2     1000023        12   # BR(~nu_eL -> ~chi_20 nu_e)
     1.86756470E-04    2     1000025        12   # BR(~nu_eL -> ~chi_30 nu_e)
     5.65939697E-06    2     1000024        11   # BR(~nu_eL -> ~chi_1+ e-)
#
#         PDG            Width
DECAY   1000014     1.22251912E+02   # snu_muL decays
#          BR         NDA      ID1       ID2
     9.99801829E-01    2     1000022        14   # BR(~nu_muL -> ~chi_10 nu_mu)
     5.75515257E-06    2     1000023        14   # BR(~nu_muL -> ~chi_20 nu_mu)
     1.86756470E-04    2     1000025        14   # BR(~nu_muL -> ~chi_30 nu_mu)
     5.65939697E-06    2     1000024        13   # BR(~nu_muL -> ~chi_1+ mu-)
#
#         PDG            Width
DECAY   1000016     1.22876475E+02   # snu_tauL decays
#          BR         NDA      ID1       ID2
     9.94719989E-01    2     1000022        16   # BR(~nu_tauL -> ~chi_10 nu_tau)
     5.72590001E-06    2     1000023        16   # BR(~nu_tauL -> ~chi_20 nu_tau)
     1.85807215E-04    2     1000025        16   # BR(~nu_tauL -> ~chi_30 nu_tau)
     5.08847829E-03    2     1000024        15   # BR(~nu_tauL -> ~chi_1+ tau-)
#
#         PDG            Width
DECAY   1000024     6.01185354E+01   # chargino1+ decays
#          BR         NDA      ID1       ID2
     4.49710010E-07    2     1000002        -1   # BR(~chi_1+ -> ~u_L     db)
     2.11327528E-07    2    -1000001         2   # BR(~chi_1+ -> ~d_L*    u )
     4.49710010E-07    2     1000004        -3   # BR(~chi_1+ -> ~c_L     sb)
     2.11327528E-07    2    -1000003         4   # BR(~chi_1+ -> ~s_L*    c )
     6.24137782E-02    2     1000006        -5   # BR(~chi_1+ -> ~t_1     bb)
     8.37582598E-02    2    -1000005         6   # BR(~chi_1+ -> ~b_1*    t )
     8.01034276E-01    2    -2000005         6   # BR(~chi_1+ -> ~b_2*    t )
     4.46346775E-02    2     1000022        24   # BR(~chi_1+ -> ~chi_10  W+)
     8.15168078E-03    2     1000022        37   # BR(~chi_1+ -> ~chi_10  H+)
     5.01837897E-06    2     1000039        24   # BR(~chi_1+ -> ~G       W+)
     9.87409412E-07    2     1000039        37   # BR(~chi_1+ -> ~G       H+)
#
#         PDG            Width
DECAY   1000037     1.01762401E+05   # chargino2+ decays
#          BR         NDA      ID1       ID2
     9.70657640E-03    2     1000002        -1   # BR(~chi_2+ -> ~u_L     db)
     9.70657935E-03    2    -1000001         2   # BR(~chi_2+ -> ~d_L*    u )
     9.70657640E-03    2     1000004        -3   # BR(~chi_2+ -> ~c_L     sb)
     9.70657935E-03    2    -1000003         4   # BR(~chi_2+ -> ~s_L*    c )
     8.34860119E-01    2     1000006        -5   # BR(~chi_2+ -> ~t_1     bb)
     2.12180778E-03    2    -1000005         6   # BR(~chi_2+ -> ~b_1*    t )
     9.21767305E-03    2    -2000005         6   # BR(~chi_2+ -> ~b_2*    t )
     7.17403643E-15    2     1000012       -11   # BR(~chi_2+ -> ~nu_eL   e+  )
     7.17403643E-15    2     1000014       -13   # BR(~chi_2+ -> ~nu_muL  mu+ )
     5.02306100E-15    2    -1000011        12   # BR(~chi_2+ -> ~e_L+    nu_e)
     5.02306100E-15    2    -1000013        14   # BR(~chi_2+ -> ~mu_L+   nu_mu)
     7.79381688E-15    2    -1000015        16   # BR(~chi_2+ -> ~tau_1+  nu_tau)
     1.32643184E-16    2    -2000015        16   # BR(~chi_2+ -> ~tau_2+  nu_tau)
     1.77940431E-03    2     1000024        23   # BR(~chi_2+ -> ~chi_1+  Z )
     3.19117538E-07    2     1000022        24   # BR(~chi_2+ -> ~chi_10  W+)
     1.72640597E-03    2     1000023        24   # BR(~chi_2+ -> ~chi_20  W+)
     1.72606816E-03    2     1000025        24   # BR(~chi_2+ -> ~chi_30  W+)
     1.79649902E-03    2     1000024        25   # BR(~chi_2+ -> ~chi_1+  h )
     1.57698662E-03    2     1000024        35   # BR(~chi_2+ -> ~chi_1+  H )
     1.57719589E-03    2     1000024        36   # BR(~chi_2+ -> ~chi_1+  A )
     4.08359202E-07    2     1000022        37   # BR(~chi_2+ -> ~chi_10  H+)
     1.57713908E-03    2     1000023        37   # BR(~chi_2+ -> ~chi_20  H+)
     1.57678620E-03    2     1000025        37   # BR(~chi_2+ -> ~chi_30  H+)
     1.01636847E-01    2     1000039        24   # BR(~chi_2+ -> ~G       W+)
     2.91413332E-08    2     1000039        37   # BR(~chi_2+ -> ~G       H+)
#
#         PDG            Width
DECAY   1000022     1.E-08   # neutralino1 decays (OJ Mods)
#          BR         NDA      ID1       ID2
     7.74379179E-01    2     1000039        22   # BR(~chi_10 -> ~G        gam)
     2.25620526E-01    2     1000039        23   # BR(~chi_10 -> ~G        Z)
     2.95447971E-07    2     1000039        25   # BR(~chi_10 -> ~G        h)
#
#         PDG            Width
DECAY   1000023     1.E-08   # neutralino2 decays (OJ Mods)
#          BR         NDA      ID1       ID2
     4.25496426E-02    2     1000022        23   # BR(~chi_20 -> ~chi_10   Z )
     8.38861766E-04    2     1000022        25   # BR(~chi_20 -> ~chi_10   h )
     7.10088621E-03    2     1000022        35   # BR(~chi_20 -> ~chi_10   H )
     8.27888955E-04    2     1000022        36   # BR(~chi_20 -> ~chi_10   A )
     1.73454129E-08    2     1000002        -2   # BR(~chi_20 -> ~u_L      ub)
     1.73454129E-08    2    -1000002         2   # BR(~chi_20 -> ~u_L*     u )
     8.25957397E-08    2     1000001        -1   # BR(~chi_20 -> ~d_L      db)
     8.25957397E-08    2    -1000001         1   # BR(~chi_20 -> ~d_L*     d )
     1.75652548E-07    2     2000001        -1   # BR(~chi_20 -> ~d_R      db)
     1.75652548E-07    2    -2000001         1   # BR(~chi_20 -> ~d_R*     d )
     1.73454129E-08    2     1000004        -4   # BR(~chi_20 -> ~c_L      cb)
     1.73454129E-08    2    -1000004         4   # BR(~chi_20 -> ~c_L*     c )
     8.25957397E-08    2     1000003        -3   # BR(~chi_20 -> ~s_L      sb)
     8.25957397E-08    2    -1000003         3   # BR(~chi_20 -> ~s_L*     s )
     1.75652548E-07    2     2000003        -3   # BR(~chi_20 -> ~s_R      sb)
     1.75652548E-07    2    -2000003         3   # BR(~chi_20 -> ~s_R*     s )
     4.16582233E-01    2     1000006        -6   # BR(~chi_20 -> ~t_1      tb)
     4.16582233E-01    2    -1000006         6   # BR(~chi_20 -> ~t_1*     t )
     2.78852468E-02    2     1000005        -5   # BR(~chi_20 -> ~b_1      bb)
     2.78852468E-02    2    -1000005         5   # BR(~chi_20 -> ~b_1*     b )
     2.98705536E-02    2     2000005        -5   # BR(~chi_20 -> ~b_2      bb)
     2.98705536E-02    2    -2000005         5   # BR(~chi_20 -> ~b_2*     b )
     3.02918961E-11    2     1000039        22   # BR(~chi_20 -> ~G        gam)
     1.82051527E-07    2     1000039        23   # BR(~chi_20 -> ~G        Z)
     4.54359970E-06    2     1000039        25   # BR(~chi_20 -> ~G        h)
     3.63953826E-08    2     1000039        35   # BR(~chi_20 -> ~G        H)
     9.38633924E-07    2     1000039        36   # BR(~chi_20 -> ~G        A)
#
#         PDG            Width
DECAY   1000025     6.38352530E+01   # neutralino3 decays
#          BR         NDA      ID1       ID2
     8.51877032E-04    2     1000022        23   # BR(~chi_30 -> ~chi_10   Z )
     4.28238919E-02    2     1000022        25   # BR(~chi_30 -> ~chi_10   h )
     8.04336660E-04    2     1000022        35   # BR(~chi_30 -> ~chi_10   H )
     7.12607626E-03    2     1000022        36   # BR(~chi_30 -> ~chi_10   A )
     3.59879446E-06    2     1000002        -2   # BR(~chi_30 -> ~u_L      ub)
     3.59879446E-06    2    -1000002         2   # BR(~chi_30 -> ~u_L*     u )
     1.12852949E-06    2     1000001        -1   # BR(~chi_30 -> ~d_L      db)
     1.12852949E-06    2    -1000001         1   # BR(~chi_30 -> ~d_L*     d )
     8.75711436E-06    2     2000001        -1   # BR(~chi_30 -> ~d_R      db)
     8.75711436E-06    2    -2000001         1   # BR(~chi_30 -> ~d_R*     d )
     3.59879446E-06    2     1000004        -4   # BR(~chi_30 -> ~c_L      cb)
     3.59879446E-06    2    -1000004         4   # BR(~chi_30 -> ~c_L*     c )
     1.12852949E-06    2     1000003        -3   # BR(~chi_30 -> ~s_L      sb)
     1.12852949E-06    2    -1000003         3   # BR(~chi_30 -> ~s_L*     s )
     8.75711436E-06    2     2000003        -3   # BR(~chi_30 -> ~s_R      sb)
     8.75711436E-06    2    -2000003         3   # BR(~chi_30 -> ~s_R*     s )
     4.15979641E-01    2     1000006        -6   # BR(~chi_30 -> ~t_1      tb)
     4.15979641E-01    2    -1000006         6   # BR(~chi_30 -> ~t_1*     t )
     2.38482806E-02    2     1000005        -5   # BR(~chi_30 -> ~b_1      bb)
     2.38482806E-02    2    -1000005         5   # BR(~chi_30 -> ~b_1*     b )
     3.43428342E-02    2     2000005        -5   # BR(~chi_30 -> ~b_2      bb)
     3.43428342E-02    2    -2000005         5   # BR(~chi_30 -> ~b_2*     b )
     1.73815385E-09    2     1000039        22   # BR(~chi_30 -> ~G        gam)
     4.54503882E-06    2     1000039        23   # BR(~chi_30 -> ~G        Z)
     1.77229973E-07    2     1000039        25   # BR(~chi_30 -> ~G        h)
     9.31615511E-07    2     1000039        35   # BR(~chi_30 -> ~G        H)
     3.75161287E-08    2     1000039        36   # BR(~chi_30 -> ~G        A)
#
#         PDG            Width
DECAY   1000035     1.01762810E+05   # neutralino4 decays
#          BR         NDA      ID1       ID2
     7.95435096E-10    2     1000022        23   # BR(~chi_40 -> ~chi_10   Z )
     1.71960657E-03    2     1000023        23   # BR(~chi_40 -> ~chi_20   Z )
     5.97919092E-05    2     1000025        23   # BR(~chi_40 -> ~chi_30   Z )
     1.72638884E-03    2     1000024       -24   # BR(~chi_40 -> ~chi_1+   W-)
     1.72638884E-03    2    -1000024        24   # BR(~chi_40 -> ~chi_1-   W+)
     3.31784697E-07    2     1000022        25   # BR(~chi_40 -> ~chi_10   h )
     4.29846940E-08    2     1000022        35   # BR(~chi_40 -> ~chi_10   H )
     3.64829037E-07    2     1000022        36   # BR(~chi_40 -> ~chi_10   A )
     5.89888812E-05    2     1000023        25   # BR(~chi_40 -> ~chi_20   h )
     1.50916696E-03    2     1000023        35   # BR(~chi_40 -> ~chi_20   H )
     6.93735230E-05    2     1000023        36   # BR(~chi_40 -> ~chi_20   A )
     1.73717370E-03    2     1000025        25   # BR(~chi_40 -> ~chi_30   h )
     6.77690324E-05    2     1000025        35   # BR(~chi_40 -> ~chi_30   H )
     1.50745181E-03    2     1000025        36   # BR(~chi_40 -> ~chi_30   A )
     1.57716212E-03    2     1000024       -37   # BR(~chi_40 -> ~chi_1+   H-)
     1.57716212E-03    2    -1000024        37   # BR(~chi_40 -> ~chi_1-   H+)
     4.64693457E-03    2     1000002        -2   # BR(~chi_40 -> ~u_L      ub)
     4.64693457E-03    2    -1000002         2   # BR(~chi_40 -> ~u_L*     u )
     7.43070264E-23    2     2000002        -2   # BR(~chi_40 -> ~u_R      ub)
     7.43070264E-23    2    -2000002         2   # BR(~chi_40 -> ~u_R*     u )
     4.64693654E-03    2     1000001        -1   # BR(~chi_40 -> ~d_L      db)
     4.64693654E-03    2    -1000001         1   # BR(~chi_40 -> ~d_L*     d )
     8.89587440E-17    2     2000001        -1   # BR(~chi_40 -> ~d_R      db)
     8.89587440E-17    2    -2000001         1   # BR(~chi_40 -> ~d_R*     d )
     4.64693457E-03    2     1000004        -4   # BR(~chi_40 -> ~c_L      cb)
     4.64693457E-03    2    -1000004         4   # BR(~chi_40 -> ~c_L*     c )
     7.43070264E-23    2     2000004        -4   # BR(~chi_40 -> ~c_R      cb)
     7.43070264E-23    2    -2000004         4   # BR(~chi_40 -> ~c_R*     c )
     4.64693654E-03    2     1000003        -3   # BR(~chi_40 -> ~s_L      sb)
     4.64693654E-03    2    -1000003         3   # BR(~chi_40 -> ~s_L*     s )
     8.89587440E-17    2     2000003        -3   # BR(~chi_40 -> ~s_R      sb)
     8.89587440E-17    2    -2000003         3   # BR(~chi_40 -> ~s_R*     s )
     5.66972825E-03    2     1000006        -6   # BR(~chi_40 -> ~t_1      tb)
     5.66972825E-03    2    -1000006         6   # BR(~chi_40 -> ~t_1*     t )
     1.98803258E-01    2     1000005        -5   # BR(~chi_40 -> ~b_1      bb)
     1.98803258E-01    2    -1000005         5   # BR(~chi_40 -> ~b_1*     b )
     2.18627093E-01    2     2000005        -5   # BR(~chi_40 -> ~b_2      bb)
     2.18627093E-01    2    -2000005         5   # BR(~chi_40 -> ~b_2*     b )
     2.51151979E-15    2     1000011       -11   # BR(~chi_40 -> ~e_L-     e+)
     2.51151979E-15    2    -1000011        11   # BR(~chi_40 -> ~e_L+     e-)
     4.32714335E-28    2     2000011       -11   # BR(~chi_40 -> ~e_R-     e+)
     4.32714335E-28    2    -2000011        11   # BR(~chi_40 -> ~e_R+     e-)
     2.51151979E-15    2     1000013       -13   # BR(~chi_40 -> ~mu_L-    mu+)
     2.51151979E-15    2    -1000013        13   # BR(~chi_40 -> ~mu_L+    mu-)
     4.32714335E-28    2     2000013       -13   # BR(~chi_40 -> ~mu_R-    mu+)
     4.32714335E-28    2    -2000013        13   # BR(~chi_40 -> ~mu_R+    mu-)
     3.58700762E-15    2     1000012       -12   # BR(~chi_40 -> ~nu_eL    nu_eb)
     3.58700762E-15    2    -1000012        12   # BR(~chi_40 -> ~nu_eL*   nu_e )
     3.58700762E-15    2     1000014       -14   # BR(~chi_40 -> ~nu_muL   nu_mub)
     3.58700762E-15    2    -1000014        14   # BR(~chi_40 -> ~nu_muL*  nu_mu )
     3.58700762E-15    2     1000016       -16   # BR(~chi_40 -> ~nu_tau1  nu_taub)
     3.58700762E-15    2    -1000016        16   # BR(~chi_40 -> ~nu_tau1* nu_tau )
     2.46283962E-02    2     1000039        22   # BR(~chi_40 -> ~G        gam)
     7.70080764E-02    2     1000039        23   # BR(~chi_40 -> ~G        Z)
     4.64930293E-09    2     1000039        25   # BR(~chi_40 -> ~G        h)
     2.91901150E-08    2     1000039        35   # BR(~chi_40 -> ~G        H)
     5.75210358E-12    2     1000039        36   # BR(~chi_40 -> ~G        A)
#
#
#
#
