#
#                              ======================
#                              | THE SUSYHIT OUTPUT |
#                              ======================
#
#
#              ------------------------------------------------------
#              |     This is the output of the SUSY-HIT package     |
#              |  created by A.Djouadi, M.Muehlleitner and M.Spira. |
#              |  In case of problems with SUSY-HIT email to        |
#              |           margarete.muehlleitner@cern.ch           |
#              |           michael.spira@psi.ch                     |
#              |           abdelhak.djouadi@cern.ch                 |
#              ------------------------------------------------------
#
#              ------------------------------------------------------
#              |  SUSY Les Houches Accord - MSSM Spectrum + Decays  |
#              |              based on the decay programs           |
#              |                                                    |
#              |                     SDECAY 1.3b                    |
#              |                                                    |
#              |  Authors: M.Muhlleitner, A.Djouadi and Y.Mambrini  |
#              |  Ref.:    Comput.Phys.Commun.168(2005)46           |
#              |           [hep-ph/0311167]                         |
#              |                                                    |
#              |                     HDECAY 3.4                     |
#              |                                                    |
#              |  By: A.Djouadi,J.Kalinowski,M.Muhlleitner,M.Spira  |
#              |  Ref.:    Comput.Phys.Commun.108(1998)56           |
#              |           [hep-ph/9704448]                         |
#              |                                                    |
#              |                                                    |
#              |  If not stated otherwise all DRbar couplings and   |
#              |  soft SUSY breaking masses are given at the scale  |
#              |  Q=  0.50007453E+04
#              |                                                    |
#              ------------------------------------------------------
#
#
BLOCK DCINFO  # Decay Program information
     1   SDECAY/HDECAY # decay calculator
     2   1.3b  /3.4    # version number
#
BLOCK SPINFO  # Spectrum calculator information
     1    SOFTSUSY    # spectrum calculator                
     2    3.4.0       # version number                     
#
BLOCK MODSEL  # Model selection
     1     0   #  nonUniversal                                     
#
BLOCK SMINPUTS  # Standard Model inputs
         1     1.25778332E+02   # alpha_em^-1(M_Z)^MSbar
         2     1.16570000E-05   # G_F [GeV^-2]
         3     1.17200002E-01   # alpha_S(M_Z)^MSbar
         4     9.11876000E+01   # M_Z pole mass
         5     4.25000000E+00   # mb(mb)^MSbar
         6     1.72500000E+02   # mt pole mass
         7     1.77682000E+00   # mtau pole mass
#
BLOCK MINPAR  # Input parameters - minimal models
         3     1.00000000E+01   # tanb                
#
BLOCK EXTPAR  # Input parameters - non-minimal models
         0    -1.00000000E+00   # Set                 
         1     6.00000000E+01   # M_1(MX)             
         2     3.00000000E+03   # M_2(MX)             
         3     8.59142000E+02   # M_3(MX)             
        11     5.00000000E+03   # At(MX)              
        12     5.00000000E+03   # Ab(MX)              
        13     0.00000000E+00   # Atau(MX)            
        23    -5.71580000E+02   # mu(MX)              
        26     3.00000000E+03   # mA(pole)            
        31     5.00000000E+03   # meL(MX)             
        32     5.00000000E+03   # mmuL(MX)            
        33     5.00000000E+03   # mtauL(MX)           
        34     5.00000000E+03   # meR(MX)             
        35     5.00000000E+03   # mmuR(MX)            
        36     5.00000000E+03   # mtauR(MX)           
        41     5.00000000E+03   # mqL1(MX)            
        42     5.00000000E+03   # mqL2(MX)            
        43     5.00000000E+03   # mqL3(MX)            
        44     5.00000000E+03   # muR(MX)             
        45     5.00000000E+03   # mcR(MX)             
        46     5.00000000E+03   # mtR(MX)             
        47     5.00000000E+03   # mdR(MX)             
        48     5.00000000E+03   # msR(MX)             
        49     5.00000000E+03   # mbR(MX)             
#
BLOCK MASS  # Mass Spectrum
# PDG code           mass       particle
        24     8.00912013E+01   # W+
        25     1.24380862E+02   # h
        35     3.00008412E+03   # H
        36     2.99999916E+03   # A
        37     3.00140258E+03   # H+
         5     4.87878001E+00   # b-quark pole mass calculated from mb(mb)_Msbar
   1000001     5.06423656E+03   # ~d_L
   2000001     5.04637383E+03   # ~d_R
   1000002     5.06375925E+03   # ~u_L
   2000002     5.04607569E+03   # ~u_R
   1000003     5.06423656E+03   # ~s_L
   2000003     5.04637383E+03   # ~s_R
   1000004     5.06375925E+03   # ~c_L
   2000004     5.04607569E+03   # ~c_R
   1000005     5.01058419E+03   # ~b_1
   2000005     5.04470804E+03   # ~b_2
   1000006     4.90104467E+03   # ~t_1
   2000006     5.05567220E+03   # ~t_2
   1000011     5.01910121E+03   # ~e_L
   2000011     5.00593978E+03   # ~e_R
   1000012     5.01815088E+03   # ~nu_eL
   1000013     5.01910121E+03   # ~mu_L
   2000013     5.00593978E+03   # ~mu_R
   1000014     5.01815088E+03   # ~nu_muL
   1000015     5.00474871E+03   # ~tau_1
   2000015     5.01865221E+03   # ~tau_2
   1000016     5.01760012E+03   # ~nu_tauL
   1000021     1.10000070E+03   # ~g
   1000022     6.02507775E+01   # ~chi_10
   1000023     6.00198060E+02   # ~chi_20
   1000025    -6.02419093E+02   # ~chi_30
   1000035     3.07419097E+03   # ~chi_40
   1000024     6.00000526E+02   # ~chi_1+
   1000037     3.07435867E+03   # ~chi_2+
#
BLOCK NMIX  # Neutralino Mixing Matrix
  1  1     9.97248181E-01   # N_11
  1  2     2.26986178E-04   # N_12
  1  3    -7.41347246E-02   # N_13
  1  4     2.39766786E-04   # N_14
  2  1     5.22790161E-02   # N_21
  2  2     1.97582387E-02   # N_22
  2  3     7.05593934E-01   # N_23
  2  4     7.06409029E-01   # N_24
  3  1    -5.25625268E-02   # N_31
  3  2     1.65519318E-02   # N_32
  3  3    -7.04724153E-01   # N_33
  3  4     7.07338026E-01   # N_34
  4  1    -3.89420863E-04   # N_41
  4  2     9.99667742E-01   # N_42
  4  3    -2.26067085E-03   # N_43
  4  4    -2.56737937E-02   # N_44
#
BLOCK UMIX  # Chargino Mixing Matrix U
  1  1     3.20419711E-03   # U_11
  1  2     9.99994867E-01   # U_12
  2  1    -9.99994867E-01   # U_21
  2  2     3.20419711E-03   # U_22
#
BLOCK VMIX  # Chargino Mixing Matrix V
  1  1     3.63321449E-02   # V_11
  1  2    -9.99339770E-01   # V_12
  2  1    -9.99339770E-01   # V_21
  2  2    -3.63321449E-02   # V_22
#
BLOCK STOPMIX  # Stop Mixing Matrix
  1  1    -5.07566683E-01   # cos(theta_t)
  1  2     8.61612478E-01   # sin(theta_t)
  2  1    -8.61612478E-01   # -sin(theta_t)
  2  2    -5.07566683E-01   # cos(theta_t)
#
BLOCK SBOTMIX  # Sbottom Mixing Matrix
  1  1     9.98439683E-01   # cos(theta_b)
  1  2    -5.58408400E-02   # sin(theta_b)
  2  1     5.58408400E-02   # -sin(theta_b)
  2  2     9.98439683E-01   # cos(theta_b)
#
BLOCK STAUMIX  # Stau Mixing Matrix
  1  1    -6.84687848E-02   # cos(theta_tau)
  1  2     9.97653259E-01   # sin(theta_tau)
  2  1    -9.97653259E-01   # -sin(theta_tau)
  2  2    -6.84687848E-02   # cos(theta_tau)
#
BLOCK ALPHA  # Higgs mixing
          -1.05439949E-01   # Mixing angle in the neutral Higgs boson sector
#
BLOCK HMIX Q=  5.00074534E+03  # DRbar Higgs Parameters
         1    -5.81778325E+02   # mu(Q)MSSM           
         2     9.47316331E+00   # tan                 
         3     2.41830093E+02   # higgs               
         4     8.63950355E+06   # mA^2(Q)MSSM         
#
BLOCK GAUGE Q=  5.00074534E+03  # The gauge couplings
     1     3.70931777E-01   # gprime(Q) DRbar
     2     6.33169964E-01   # g(Q) DRbar
     3     1.00724646E+00   # g3(Q) DRbar
#
BLOCK AU Q=  5.00074534E+03  # The trilinear couplings
  1  1     5.00000001E+03   # A_u(Q) DRbar
  2  2     5.00000001E+03   # A_c(Q) DRbar
  3  3     5.00000001E+03   # A_t(Q) DRbar
#
BLOCK AD Q=  5.00074534E+03  # The trilinear couplings
  1  1     5.00000000E+03   # A_d(Q) DRbar
  2  2     5.00000000E+03   # A_s(Q) DRbar
  3  3     5.00000001E+03   # A_b(Q) DRbar
#
BLOCK AE Q=  5.00074534E+03  # The trilinear couplings
  1  1     0.00000000E+00   # A_e(Q) DRbar
  2  2     3.26590993E-08   # A_mu(Q) DRbar
  3  3     3.17412224E-08   # A_tau(Q) DRbar
#
BLOCK Yu Q=  5.00074534E+03  # The Yukawa couplings
  1  1     0.00000000E+00   # y_u(Q) DRbar
  2  2     0.00000000E+00   # y_c(Q) DRbar
  3  3     8.15308041E-01   # y_t(Q) DRbar
#
BLOCK Yd Q=  5.00074534E+03  # The Yukawa couplings
  1  1     0.00000000E+00   # y_d(Q) DRbar
  2  2     0.00000000E+00   # y_s(Q) DRbar
  3  3     1.29261840E-01   # y_b(Q) DRbar
#
BLOCK Ye Q=  5.00074534E+03  # The Yukawa couplings
  1  1     0.00000000E+00   # y_e(Q) DRbar
  2  2     0.00000000E+00   # y_mu(Q) DRbar
  3  3     9.70925749E-02   # y_tau(Q) DRbar
#
BLOCK MSOFT Q=  5.00074534E+03  # The soft SUSY breaking masses at the scale Q
         1     6.00000000E+01   # M_1(Q)              
         2     3.00000000E+03   # M_2(Q)              
         3     8.59142000E+02   # M_3(Q)              
        21     8.38062545E+06   # mH1^2(Q)            
        22     2.31218328E+05   # mH2^2(Q)            
        31     5.00000000E+03   # meL(Q)              
        32     5.00000000E+03   # mmuL(Q)             
        33     5.00000000E+03   # mtauL(Q)            
        34     5.00000000E+03   # meR(Q)              
        35     5.00000000E+03   # mmuR(Q)             
        36     5.00000000E+03   # mtauR(Q)            
        41     5.00000000E+03   # mqL1(Q)             
        42     5.00000000E+03   # mqL2(Q)             
        43     5.00000000E+03   # mqL3(Q)             
        44     5.00000000E+03   # muR(Q)              
        45     5.00000000E+03   # mcR(Q)              
        46     5.00000000E+03   # mtR(Q)              
        47     5.00000000E+03   # mdR(Q)              
        48     5.00000000E+03   # msR(Q)              
        49     5.00000000E+03   # mbR(Q)              
#
#
#
#                             =================
#                             |The decay table|
#                             =================
#
# - The QCD corrections to the decays gluino -> squark  + quark
#                                     squark -> gaugino + quark_prime
#                                     squark -> squark_prime + Higgs
#                                     squark -> gluino  + quark
#   are included.
#
# - The multi-body decays for the inos, stops and sbottoms are included.
#
# - The loop induced decays for the gluino, neutralinos and stops
#   are included.
#
# - The SUSY decays of the top quark are included.
#
#
#         PDG            Width
DECAY         6     1.40507073E+00   # top decays
#          BR         NDA      ID1       ID2
     1.00000000E+00    2           5        24   # BR(t ->  b    W+)
#
#         PDG            Width
DECAY   1000021     2.08067273E-05   # gluino decays
#          BR         NDA      ID1       ID2
     5.88332076E-06    2     1000022        21   # BR(~g -> ~chi_10 g)
     4.15703260E-02    2     1000023        21   # BR(~g -> ~chi_20 g)
     4.02822701E-02    2     1000025        21   # BR(~g -> ~chi_30 g)
#           BR         NDA      ID1       ID2       ID3
     5.38922892E-02    3     1000022         1        -1   # BR(~g -> ~chi_10 d  db)
     2.20774686E-05    3     1000023         1        -1   # BR(~g -> ~chi_20 d  db)
     1.78326774E-05    3     1000025         1        -1   # BR(~g -> ~chi_30 d  db)
     1.83760044E-01    3     1000022         2        -2   # BR(~g -> ~chi_10 u  ub)
     1.11239334E-04    3     1000023         2        -2   # BR(~g -> ~chi_20 u  ub)
     2.72207563E-05    3     1000025         2        -2   # BR(~g -> ~chi_30 u  ub)
     5.38922892E-02    3     1000022         3        -3   # BR(~g -> ~chi_10 s  sb)
     2.20774686E-05    3     1000023         3        -3   # BR(~g -> ~chi_20 s  sb)
     1.78326774E-05    3     1000025         3        -3   # BR(~g -> ~chi_30 s  sb)
     1.83760044E-01    3     1000022         4        -4   # BR(~g -> ~chi_10 c  cb)
     1.11239334E-04    3     1000023         4        -4   # BR(~g -> ~chi_20 c  cb)
     2.72207563E-05    3     1000025         4        -4   # BR(~g -> ~chi_30 c  cb)
     5.49751641E-02    3     1000022         5        -5   # BR(~g -> ~chi_10 b  bb)
     3.78219537E-03    3     1000023         5        -5   # BR(~g -> ~chi_20 b  bb)
     3.69122452E-03    3     1000025         5        -5   # BR(~g -> ~chi_30 b  bb)
     1.30372070E-01    3     1000022         6        -6   # BR(~g -> ~chi_10 t  tb)
     4.81561775E-02    3     1000023         6        -6   # BR(~g -> ~chi_20 t  tb)
     2.33556005E-02    3     1000025         6        -6   # BR(~g -> ~chi_30 t  tb)
     4.23332395E-05    3     1000024         1        -2   # BR(~g -> ~chi_1+ d  ub)
     4.23332395E-05    3    -1000024         2        -1   # BR(~g -> ~chi_1- u  db)
     4.23332395E-05    3     1000024         3        -4   # BR(~g -> ~chi_1+ s  cb)
     4.23332395E-05    3    -1000024         4        -3   # BR(~g -> ~chi_1- c  sb)
     8.89891747E-02    3     1000024         5        -6   # BR(~g -> ~chi_1+ b  tb)
     8.89891747E-02    3    -1000024         6        -5   # BR(~g -> ~chi_1- t  bb)
#
#         PDG            Width
DECAY   1000006     4.15858415E+02   # stop1 decays
#          BR         NDA      ID1       ID2
     2.10749379E-02    2     1000022         6   # BR(~t_1 -> ~chi_10 t )
     7.73269288E-02    2     1000023         6   # BR(~t_1 -> ~chi_20 t )
     7.35428627E-02    2     1000025         6   # BR(~t_1 -> ~chi_30 t )
     5.00350336E-03    2     1000035         6   # BR(~t_1 -> ~chi_40 t )
     1.11317073E-01    2     1000024         5   # BR(~t_1 -> ~chi_1+ b )
     9.97394191E-03    2     1000037         5   # BR(~t_1 -> ~chi_2+ b )
     7.01760753E-01    2     1000021         6   # BR(~t_1 -> ~g      t )
#
#         PDG            Width
DECAY   2000006     4.15580499E+02   # stop2 decays
#          BR         NDA      ID1       ID2
     8.57357302E-03    2     1000022         6   # BR(~t_2 -> ~chi_10 t )
     7.78155046E-02    2     1000023         6   # BR(~t_2 -> ~chi_20 t )
     8.20354309E-02    2     1000025         6   # BR(~t_2 -> ~chi_30 t )
     1.32652975E-02    2     1000035         6   # BR(~t_2 -> ~chi_40 t )
     4.69707433E-02    2     1000024         5   # BR(~t_2 -> ~chi_1+ b )
     2.64110599E-02    2     1000037         5   # BR(~t_2 -> ~chi_2+ b )
     7.41880601E-01    2     1000021         6   # BR(~t_2 -> ~g      t )
     6.90698407E-04    2     1000006        25   # BR(~t_2 -> ~t_1    h )
     2.35709115E-03    2     1000006        23   # BR(~t_2 -> ~t_1    Z )
#
#         PDG            Width
DECAY   1000005     3.93106407E+02   # sbottom1 decays
#          BR         NDA      ID1       ID2
     1.97704666E-03    2     1000022         5   # BR(~b_1 -> ~chi_10 b )
     2.06473210E-03    2     1000023         5   # BR(~b_1 -> ~chi_20 b )
     2.04953821E-03    2     1000025         5   # BR(~b_1 -> ~chi_30 b )
     1.91612308E-02    2     1000035         5   # BR(~b_1 -> ~chi_40 b )
     1.64709140E-01    2    -1000024         6   # BR(~b_1 -> ~chi_1- t )
     3.84735677E-02    2    -1000037         6   # BR(~b_1 -> ~chi_2- t )
     7.70121471E-01    2     1000021         5   # BR(~b_1 -> ~g      b )
     1.44327264E-03    2     1000006       -24   # BR(~b_1 -> ~t_1    W-)
#
#         PDG            Width
DECAY   2000005     3.11494144E+02   # sbottom2 decays
#          BR         NDA      ID1       ID2
     9.43741470E-03    2     1000022         5   # BR(~b_2 -> ~chi_10 b )
     2.67440371E-03    2     1000023         5   # BR(~b_2 -> ~chi_20 b )
     2.71829853E-03    2     1000025         5   # BR(~b_2 -> ~chi_30 b )
     7.58780132E-05    2     1000035         5   # BR(~b_2 -> ~chi_40 b )
     5.91096098E-03    2    -1000024         6   # BR(~b_2 -> ~chi_1- t )
     1.52352570E-04    2    -1000037         6   # BR(~b_2 -> ~chi_2- t )
     9.79007761E-01    2     1000021         5   # BR(~b_2 -> ~g      b )
     2.29301078E-05    2     1000006       -24   # BR(~b_2 -> ~t_1    W-)
#
#         PDG            Width
DECAY   1000002     3.30524181E+02   # sup_L decays
#          BR         NDA      ID1       ID2
     2.25581385E-03    2     1000022         2   # BR(~u_L -> ~chi_10 u)
     5.18367098E-05    2     1000023         2   # BR(~u_L -> ~chi_20 u)
     2.28155420E-06    2     1000025         2   # BR(~u_L -> ~chi_30 u)
     2.36774623E-02    2     1000035         2   # BR(~u_L -> ~chi_40 u)
     1.52393499E-04    2     1000024         1   # BR(~u_L -> ~chi_1+ d)
     4.73250613E-02    2     1000037         1   # BR(~u_L -> ~chi_2+ d)
     9.26535151E-01    2     1000021         2   # BR(~u_L -> ~g      u)
#
#         PDG            Width
DECAY   2000002     3.16884499E+02   # sup_R decays
#          BR         NDA      ID1       ID2
     3.74273425E-02    2     1000022         2   # BR(~u_R -> ~chi_10 u)
     1.00027351E-04    2     1000023         2   # BR(~u_R -> ~chi_20 u)
     1.01093702E-04    2     1000025         2   # BR(~u_R -> ~chi_30 u)
     2.26042702E-09    2     1000035         2   # BR(~u_R -> ~chi_40 u)
     9.62371534E-01    2     1000021         2   # BR(~u_R -> ~g      u)
#
#         PDG            Width
DECAY   1000001     3.30533211E+02   # sdown_L decays
#          BR         NDA      ID1       ID2
     2.24547201E-03    2     1000022         1   # BR(~d_L -> ~chi_10 d)
     5.26407803E-06    2     1000023         1   # BR(~d_L -> ~chi_20 d)
     4.15031530E-05    2     1000025         1   # BR(~d_L -> ~chi_30 d)
     2.36914349E-02    2     1000035         1   # BR(~d_L -> ~chi_40 d)
     1.18537102E-06    2    -1000024         2   # BR(~d_L -> ~chi_1- u)
     4.74006683E-02    2    -1000037         2   # BR(~d_L -> ~chi_2- u)
     9.26614472E-01    2     1000021         1   # BR(~d_L -> ~g      d)
#
#         PDG            Width
DECAY   2000001     3.07963381E+02   # sdown_R decays
#          BR         NDA      ID1       ID2
     9.62845635E-03    2     1000022         1   # BR(~d_R -> ~chi_10 d)
     2.57328496E-05    2     1000023         1   # BR(~d_R -> ~chi_20 d)
     2.60071775E-05    2     1000025         1   # BR(~d_R -> ~chi_30 d)
     5.81591810E-10    2     1000035         1   # BR(~d_R -> ~chi_40 d)
     9.90319803E-01    2     1000021         1   # BR(~d_R -> ~g      d)
#
#         PDG            Width
DECAY   1000004     3.30524181E+02   # scharm_L decays
#          BR         NDA      ID1       ID2
     2.25581385E-03    2     1000022         4   # BR(~c_L -> ~chi_10 c)
     5.18367098E-05    2     1000023         4   # BR(~c_L -> ~chi_20 c)
     2.28155420E-06    2     1000025         4   # BR(~c_L -> ~chi_30 c)
     2.36774623E-02    2     1000035         4   # BR(~c_L -> ~chi_40 c)
     1.52393499E-04    2     1000024         3   # BR(~c_L -> ~chi_1+ s)
     4.73250613E-02    2     1000037         3   # BR(~c_L -> ~chi_2+ s)
     9.26535151E-01    2     1000021         4   # BR(~c_L -> ~g      c)
#
#         PDG            Width
DECAY   2000004     3.16884499E+02   # scharm_R decays
#          BR         NDA      ID1       ID2
     3.74273425E-02    2     1000022         4   # BR(~c_R -> ~chi_10 c)
     1.00027351E-04    2     1000023         4   # BR(~c_R -> ~chi_20 c)
     1.01093702E-04    2     1000025         4   # BR(~c_R -> ~chi_30 c)
     2.26042702E-09    2     1000035         4   # BR(~c_R -> ~chi_40 c)
     9.62371534E-01    2     1000021         4   # BR(~c_R -> ~g      c)
#
#         PDG            Width
DECAY   1000003     3.30533211E+02   # sstrange_L decays
#          BR         NDA      ID1       ID2
     2.24547201E-03    2     1000022         3   # BR(~s_L -> ~chi_10 s)
     5.26407803E-06    2     1000023         3   # BR(~s_L -> ~chi_20 s)
     4.15031530E-05    2     1000025         3   # BR(~s_L -> ~chi_30 s)
     2.36914349E-02    2     1000035         3   # BR(~s_L -> ~chi_40 s)
     1.18537102E-06    2    -1000024         4   # BR(~s_L -> ~chi_1- c)
     4.74006683E-02    2    -1000037         4   # BR(~s_L -> ~chi_2- c)
     9.26614472E-01    2     1000021         3   # BR(~s_L -> ~g      s)
#
#         PDG            Width
DECAY   2000003     3.07963381E+02   # sstrange_R decays
#          BR         NDA      ID1       ID2
     9.62845635E-03    2     1000022         3   # BR(~s_R -> ~chi_10 s)
     2.57328496E-05    2     1000023         3   # BR(~s_R -> ~chi_20 s)
     2.60071775E-05    2     1000025         3   # BR(~s_R -> ~chi_30 s)
     5.81591810E-10    2     1000035         3   # BR(~s_R -> ~chi_40 s)
     9.90319803E-01    2     1000021         3   # BR(~s_R -> ~g      s)
#
#         PDG            Width
DECAY   1000011     3.03217679E+01   # selectron_L decays
#          BR         NDA      ID1       ID2
     2.25412710E-01    2     1000022        11   # BR(~e_L -> ~chi_10 e-)
     1.62818698E-03    2     1000023        11   # BR(~e_L -> ~chi_20 e-)
     1.30042280E-04    2     1000025        11   # BR(~e_L -> ~chi_30 e-)
     2.57437054E-01    2     1000035        11   # BR(~e_L -> ~chi_40 e-)
     1.31697766E-05    2    -1000024        12   # BR(~e_L -> ~chi_1- nu_e)
     5.15378838E-01    2    -1000037        12   # BR(~e_L -> ~chi_2- nu_e)
#
#         PDG            Width
DECAY   2000011     2.73930412E+01   # selectron_R decays
#          BR         NDA      ID1       ID2
     9.94659102E-01    2     1000022        11   # BR(~e_R -> ~chi_10 e-)
     2.65626579E-03    2     1000023        11   # BR(~e_R -> ~chi_20 e-)
     2.68457319E-03    2     1000025        11   # BR(~e_R -> ~chi_30 e-)
     5.88609978E-08    2     1000035        11   # BR(~e_R -> ~chi_40 e-)
#
#         PDG            Width
DECAY   1000013     3.03217679E+01   # smuon_L decays
#          BR         NDA      ID1       ID2
     2.25412710E-01    2     1000022        13   # BR(~mu_L -> ~chi_10 mu-)
     1.62818698E-03    2     1000023        13   # BR(~mu_L -> ~chi_20 mu-)
     1.30042280E-04    2     1000025        13   # BR(~mu_L -> ~chi_30 mu-)
     2.57437054E-01    2     1000035        13   # BR(~mu_L -> ~chi_40 mu-)
     1.31697766E-05    2    -1000024        14   # BR(~mu_L -> ~chi_1- nu_mu)
     5.15378838E-01    2    -1000037        14   # BR(~mu_L -> ~chi_2- nu_mu)
#
#         PDG            Width
DECAY   2000013     2.73930412E+01   # smuon_R decays
#          BR         NDA      ID1       ID2
     9.94659102E-01    2     1000022        13   # BR(~mu_R -> ~chi_10 mu-)
     2.65626579E-03    2     1000023        13   # BR(~mu_R -> ~chi_20 mu-)
     2.68457319E-03    2     1000025        13   # BR(~mu_R -> ~chi_30 mu-)
     5.88609978E-08    2     1000035        13   # BR(~mu_R -> ~chi_40 mu-)
#
#         PDG            Width
DECAY   1000015     2.92215635E+01   # stau_1 decays
#          BR         NDA      ID1       ID2
     9.29971897E-01    2     1000022        15   # BR(~tau_1 -> ~chi_10  tau-)
     1.78688696E-02    2     1000023        15   # BR(~tau_1 -> ~chi_20  tau-)
     1.73432140E-02    2     1000025        15   # BR(~tau_1 -> ~chi_30  tau-)
     1.22251141E-03    2     1000035        15   # BR(~tau_1 -> ~chi_40  tau-)
     3.11462641E-02    2    -1000024        16   # BR(~tau_1 -> ~chi_1-  nu_tau)
     2.44724386E-03    2    -1000037        16   # BR(~tau_1 -> ~chi_2-  nu_tau)
#
#         PDG            Width
DECAY   2000015     3.12164218E+01   # stau_2 decays
#          BR         NDA      ID1       ID2
     2.21352612E-01    2     1000022        15   # BR(~tau_2 -> ~chi_10  tau-)
     1.63119951E-02    2     1000023        15   # BR(~tau_2 -> ~chi_20  tau-)
     1.52981590E-02    2     1000025        15   # BR(~tau_2 -> ~chi_30  tau-)
     2.48827454E-01    2     1000035        15   # BR(~tau_2 -> ~chi_40  tau-)
     6.64378756E-05    2    -1000024        16   # BR(~tau_2 -> ~chi_1-  nu_tau)
     4.98143342E-01    2    -1000037        16   # BR(~tau_2 -> ~chi_2-  nu_tau)
#
#         PDG            Width
DECAY   1000012     3.03249272E+01   # snu_eL decays
#          BR         NDA      ID1       ID2
     2.24996584E-01    2     1000022        12   # BR(~nu_eL -> ~chi_10 nu_e)
     7.57374737E-05    2     1000023        12   # BR(~nu_eL -> ~chi_20 nu_e)
     1.43687929E-03    2     1000025        12   # BR(~nu_eL -> ~chi_30 nu_e)
     2.57479379E-01    2     1000035        12   # BR(~nu_eL -> ~chi_40 nu_e)
     1.69273813E-03    2     1000024        11   # BR(~nu_eL -> ~chi_1+ e-)
     5.14318683E-01    2     1000037        11   # BR(~nu_eL -> ~chi_2+ e-)
#
#         PDG            Width
DECAY   1000014     3.03249272E+01   # snu_muL decays
#          BR         NDA      ID1       ID2
     2.24996584E-01    2     1000022        14   # BR(~nu_muL -> ~chi_10 nu_mu)
     7.57374737E-05    2     1000023        14   # BR(~nu_muL -> ~chi_20 nu_mu)
     1.43687929E-03    2     1000025        14   # BR(~nu_muL -> ~chi_30 nu_mu)
     2.57479379E-01    2     1000035        14   # BR(~nu_muL -> ~chi_40 nu_mu)
     1.69273813E-03    2     1000024        13   # BR(~nu_muL -> ~chi_1+ mu-)
     5.14318683E-01    2     1000037        13   # BR(~nu_muL -> ~chi_2+ mu-)
#
#         PDG            Width
DECAY   1000016     3.12297345E+01   # snu_tauL decays
#          BR         NDA      ID1       ID2
     2.18453849E-01    2     1000022        16   # BR(~nu_tauL -> ~chi_10 nu_tau)
     7.35346201E-05    2     1000023        16   # BR(~nu_tauL -> ~chi_20 nu_tau)
     1.39508703E-03    2     1000025        16   # BR(~nu_tauL -> ~chi_30 nu_tau)
     2.49926145E-01    2     1000035        16   # BR(~nu_tauL -> ~chi_40 nu_tau)
     3.09209561E-02    2     1000024        15   # BR(~nu_tauL -> ~chi_1+ tau-)
     4.99230428E-01    2     1000037        15   # BR(~nu_tauL -> ~chi_2+ tau-)
#
#         PDG            Width
DECAY   1000024     3.57625905E-01   # chargino1+ decays
#          BR         NDA      ID1       ID2
     1.00000000E+00    2     1000022        24   # BR(~chi_1+ -> ~chi_10  W+)
#
#         PDG            Width
DECAY   1000037     2.18222223E+01   # chargino2+ decays
#          BR         NDA      ID1       ID2
     2.53519677E-01    2     1000024        23   # BR(~chi_2+ -> ~chi_1+  Z )
     1.69236058E-04    2     1000022        24   # BR(~chi_2+ -> ~chi_10  W+)
     2.44789951E-01    2     1000023        24   # BR(~chi_2+ -> ~chi_20  W+)
     2.44362213E-01    2     1000025        24   # BR(~chi_2+ -> ~chi_30  W+)
     2.57155374E-01    2     1000024        25   # BR(~chi_2+ -> ~chi_1+  h )
     3.54965233E-06    2     1000022        37   # BR(~chi_2+ -> ~chi_10  H+)
#
#         PDG            Width
DECAY   1000022     0.00000000E+00   # neutralino1 decays
#
#         PDG            Width
DECAY   1000023     3.66389529E-01   # neutralino2 decays
#          BR         NDA      ID1       ID2
     5.13992034E-01    2     1000022        23   # BR(~chi_20 -> ~chi_10   Z )
     4.86007966E-01    2     1000022        25   # BR(~chi_20 -> ~chi_10   h )
#
#         PDG            Width
DECAY   1000025     3.62035360E-01   # neutralino3 decays
#          BR         NDA      ID1       ID2
     5.03944566E-01    2     1000022        23   # BR(~chi_30 -> ~chi_10   Z )
     4.96055434E-01    2     1000022        25   # BR(~chi_30 -> ~chi_10   h )
#
#         PDG            Width
DECAY   1000035     2.18358039E+01   # neutralino4 decays
#          BR         NDA      ID1       ID2
     1.29239695E-05    2     1000022        23   # BR(~chi_40 -> ~chi_10   Z )
     1.04466918E-01    2     1000023        23   # BR(~chi_40 -> ~chi_20   Z )
     1.48516312E-01    2     1000025        23   # BR(~chi_40 -> ~chi_30   Z )
     2.45125584E-01    2     1000024       -24   # BR(~chi_40 -> ~chi_1+   W-)
     2.45125584E-01    2    -1000024        24   # BR(~chi_40 -> ~chi_1-   W+)
     1.51306094E-04    2     1000022        25   # BR(~chi_40 -> ~chi_10   h )
     3.40309406E-06    2     1000022        35   # BR(~chi_40 -> ~chi_10   H )
     3.79482773E-07    2     1000022        36   # BR(~chi_40 -> ~chi_10   A )
     1.51889475E-01    2     1000023        25   # BR(~chi_40 -> ~chi_20   h )
     1.04708114E-01    2     1000025        25   # BR(~chi_40 -> ~chi_30   h )
#
#         PDG            Width
DECAY        25     4.03035341E-03   # h decays
#          BR         NDA      ID1       ID2
     6.16454873E-01    2           5        -5   # BR(h -> b       bb     )
     6.41549713E-02    2         -15        15   # BR(h -> tau+    tau-   )
     2.27133667E-04    2         -13        13   # BR(h -> mu+     mu-    )
     4.81805398E-04    2           3        -3   # BR(h -> s       sb     )
     2.08764858E-02    2           4        -4   # BR(h -> c       cb     )
     6.70776458E-02    2          21        21   # BR(h -> g       g      )
     2.29675051E-03    2          22        22   # BR(h -> gam     gam    )
     1.44824205E-03    2          22        23   # BR(h -> Z       gam    )
     2.02901597E-01    2          24       -24   # BR(h -> W+      W-     )
     2.40052765E-02    2          23        23   # BR(h -> Z       Z      )
     7.52191073E-05    2     1000022   1000022   # BR(h -> ~chi_10 ~chi_10)
#
#         PDG            Width
DECAY        35     8.58144562E+00   # H decays
#          BR         NDA      ID1       ID2
     3.73108128E-01    2           5        -5   # BR(H -> b       bb     )
     6.49660261E-02    2         -15        15   # BR(H -> tau+    tau-   )
     2.29725029E-04    2         -13        13   # BR(H -> mu+     mu-    )
     2.81607702E-04    2           3        -3   # BR(H -> s       sb     )
     1.57309816E-06    2           4        -4   # BR(H -> c       cb     )
     1.57164967E-01    2           6        -6   # BR(H -> t       tb     )
     5.22396302E-05    2          21        21   # BR(H -> g       g      )
     1.64111140E-07    2          22        22   # BR(H -> gam     gam    )
     9.26716885E-08    2          23        22   # BR(H -> Z       gam    )
     7.38518707E-05    2          24       -24   # BR(H -> W+      W-     )
     3.68791808E-05    2          23        23   # BR(H -> Z       Z      )
     2.71167363E-04    2          25        25   # BR(H -> h       h      )
    -1.98995378E-23    2          36        36   # BR(H -> A       A      )
     9.03524510E-19    2          23        36   # BR(H -> Z       A      )
     3.01206744E-03    2     1000024  -1000024   # BR(H -> ~chi_1+ ~chi_1-)
     4.69300153E-03    2     1000022   1000022   # BR(H -> ~chi_10 ~chi_10)
     1.03184933E-04    2     1000023   1000023   # BR(H -> ~chi_20 ~chi_20)
     1.80834121E-03    2     1000025   1000025   # BR(H -> ~chi_30 ~chi_30)
     2.37397238E-01    2     1000022   1000023   # BR(H -> ~chi_10 ~chi_20)
     1.54589767E-01    2     1000022   1000025   # BR(H -> ~chi_10 ~chi_30)
     2.20997772E-03    2     1000023   1000025   # BR(H -> ~chi_20 ~chi_30)
#
#         PDG            Width
DECAY        36     8.58985445E+00   # A decays
#          BR         NDA      ID1       ID2
     3.72870120E-01    2           5        -5   # BR(A -> b       bb     )
     6.49043604E-02    2         -15        15   # BR(A -> tau+    tau-   )
     2.29506653E-04    2         -13        13   # BR(A -> mu+     mu-    )
     2.81545506E-04    2           3        -3   # BR(A -> s       sb     )
     1.57791344E-06    2           4        -4   # BR(A -> c       cb     )
     1.57559070E-01    2           6        -6   # BR(A -> t       tb     )
     1.55964818E-04    2          21        21   # BR(A -> g       g      )
     5.98694930E-07    2          22        22   # BR(A -> gam     gam    )
     1.88692867E-07    2          23        22   # BR(A -> Z       gam    )
     7.35028704E-05    2          23        25   # BR(A -> Z       h      )
     3.45129902E-03    2     1000024  -1000024   # BR(A -> ~chi_1+ ~chi_1-)
     4.70254222E-03    2     1000022   1000022   # BR(A -> ~chi_10 ~chi_10)
     8.02563870E-05    2     1000023   1000023   # BR(A -> ~chi_20 ~chi_20)
     3.29812225E-03    2     1000025   1000025   # BR(A -> ~chi_30 ~chi_30)
     1.57589786E-01    2     1000022   1000023   # BR(A -> ~chi_10 ~chi_20)
     2.33410800E-01    2     1000022   1000025   # BR(A -> ~chi_10 ~chi_30)
     1.39075804E-03    2     1000023   1000025   # BR(A -> ~chi_20 ~chi_30)
#
#         PDG            Width
DECAY        37     8.52290717E+00   # H+ decays
#          BR         NDA      ID1       ID2
     5.96858814E-04    2           4        -5   # BR(H+ -> c       bb     )
     6.54447842E-02    2         -15        16   # BR(H+ -> tau+    nu_tau )
     2.31417632E-04    2         -13        14   # BR(H+ -> mu+     nu_mu  )
     3.81987639E-06    2           2        -5   # BR(H+ -> u       bb     )
     1.35787943E-05    2           2        -3   # BR(H+ -> u       sb     )
     2.80808160E-04    2           4        -3   # BR(H+ -> c       sb     )
     5.28548873E-01    2           6        -5   # BR(H+ -> t       bb     )
     7.42320520E-05    2          24        25   # BR(H+ -> W+      h      )
     8.39397766E-13    2          24        36   # BR(H+ -> W+      A      )
     4.02172430E-01    2     1000024   1000022   # BR(H+ -> ~chi_1+ ~chi_10)
     2.49414393E-03    2     1000024   1000023   # BR(H+ -> ~chi_1+ ~chi_20)
     1.39054222E-04    2     1000024   1000025   # BR(H+ -> ~chi_1+ ~chi_30)
