#
#                              ======================
#                              | THE SUSYHIT OUTPUT |
#                              ======================
#
#
#              ------------------------------------------------------
#              |     This is the output of the SUSY-HIT package     |
#              |  created by A.Djouadi, M.Muehlleitner and M.Spira. |
#              |  In case of problems with SUSY-HIT email to        |
#              |           margarete.muehlleitner@cern.ch           |
#              |           michael.spira@psi.ch                     |
#              |           abdelhak.djouadi@cern.ch                 |
#              ------------------------------------------------------
#
#              ------------------------------------------------------
#              |  SUSY Les Houches Accord - MSSM Spectrum + Decays  |
#              |              based on the decay programs           |
#              |                                                    |
#              |                     SDECAY 1.3b                    |
#              |                                                    |
#              |  Authors: M.Muhlleitner, A.Djouadi and Y.Mambrini  |
#              |  Ref.:    Comput.Phys.Commun.168(2005)46           |
#              |           [hep-ph/0311167]                         |
#              |                                                    |
#              |                     HDECAY 3.4                     |
#              |                                                    |
#              |  By: A.Djouadi,J.Kalinowski,M.Muhlleitner,M.Spira  |
#              |  Ref.:    Comput.Phys.Commun.108(1998)56           |
#              |           [hep-ph/9704448]                         |
#              |                                                    |
#              |                                                    |
#              |  If not stated otherwise all DRbar couplings and   |
#              |  soft SUSY breaking masses are given at the scale  |
#              |  Q=  0.50007414E+04
#              |                                                    |
#              ------------------------------------------------------
#
#
BLOCK DCINFO  # Decay Program information
     1   SDECAY/HDECAY # decay calculator
     2   1.3b  /3.4    # version number
#
BLOCK SPINFO  # Spectrum calculator information
     1    SOFTSUSY    # spectrum calculator                
     2    3.4.0       # version number                     
#
BLOCK MODSEL  # Model selection
     1     0   #  nonUniversal                                     
#
BLOCK SMINPUTS  # Standard Model inputs
         1     1.25778332E+02   # alpha_em^-1(M_Z)^MSbar
         2     1.16570000E-05   # G_F [GeV^-2]
         3     1.17200002E-01   # alpha_S(M_Z)^MSbar
         4     9.11876000E+01   # M_Z pole mass
         5     4.25000000E+00   # mb(mb)^MSbar
         6     1.72500000E+02   # mt pole mass
         7     1.77682000E+00   # mtau pole mass
#
BLOCK MINPAR  # Input parameters - minimal models
         3     1.00000000E+01   # tanb                
#
BLOCK EXTPAR  # Input parameters - non-minimal models
         0    -1.00000000E+00   # Set                 
         1     6.00000000E+01   # M_1(MX)             
         2     3.00000000E+03   # M_2(MX)             
         3     8.59142000E+02   # M_3(MX)             
        11     5.00000000E+03   # At(MX)              
        12     5.00000000E+03   # Ab(MX)              
        13     0.00000000E+00   # Atau(MX)            
        23    -6.68277000E+02   # mu(MX)              
        26     3.00000000E+03   # mA(pole)            
        31     5.00000000E+03   # meL(MX)             
        32     5.00000000E+03   # mmuL(MX)            
        33     5.00000000E+03   # mtauL(MX)           
        34     5.00000000E+03   # meR(MX)             
        35     5.00000000E+03   # mmuR(MX)            
        36     5.00000000E+03   # mtauR(MX)           
        41     5.00000000E+03   # mqL1(MX)            
        42     5.00000000E+03   # mqL2(MX)            
        43     5.00000000E+03   # mqL3(MX)            
        44     5.00000000E+03   # muR(MX)             
        45     5.00000000E+03   # mcR(MX)             
        46     5.00000000E+03   # mtR(MX)             
        47     5.00000000E+03   # mdR(MX)             
        48     5.00000000E+03   # msR(MX)             
        49     5.00000000E+03   # mbR(MX)             
#
BLOCK MASS  # Mass Spectrum
# PDG code           mass       particle
        24     8.00916787E+01   # W+
        25     1.24383761E+02   # h
        35     3.00008319E+03   # H
        36     2.99999863E+03   # A
        37     3.00137553E+03   # H+
         5     4.87878001E+00   # b-quark pole mass calculated from mb(mb)_Msbar
   1000001     5.06422603E+03   # ~d_L
   2000001     5.04637256E+03   # ~d_R
   1000002     5.06374889E+03   # ~u_L
   2000002     5.04607751E+03   # ~u_R
   1000003     5.06422603E+03   # ~s_L
   2000003     5.04637256E+03   # ~s_R
   1000004     5.06374889E+03   # ~c_L
   2000004     5.04607751E+03   # ~c_R
   1000005     5.01053712E+03   # ~b_1
   2000005     5.04476406E+03   # ~b_2
   1000006     4.90097987E+03   # ~t_1
   2000006     5.05581777E+03   # ~t_2
   1000011     5.01909262E+03   # ~e_L
   2000011     5.00593559E+03   # ~e_R
   1000012     5.01814266E+03   # ~nu_eL
   1000013     5.01909262E+03   # ~mu_L
   2000013     5.00593559E+03   # ~mu_R
   1000014     5.01814266E+03   # ~nu_muL
   1000015     5.00471954E+03   # ~tau_1
   2000015     5.01867411E+03   # ~tau_2
   1000016     5.01759298E+03   # ~nu_tauL
   1000021     1.10000022E+03   # ~g
   1000022     6.02746335E+01   # ~chi_10
   1000023     6.99988180E+02   # ~chi_20
   1000025    -7.02216935E+02   # ~chi_30
   1000035     3.07420274E+03   # ~chi_40
   1000024     7.00000144E+02   # ~chi_1+
   1000037     3.07437038E+03   # ~chi_2+
#
BLOCK NMIX  # Neutralino Mixing Matrix
  1  1     9.97978744E-01   # N_11
  1  2     2.18982237E-04   # N_12
  1  3    -6.35381852E-02   # N_13
  1  4     1.12994435E-03   # N_14
  2  1     4.41499532E-02   # N_21
  2  2     2.05713782E-02   # N_22
  2  3     7.06086689E-01   # N_23
  2  4     7.06448291E-01   # N_24
  3  1    -4.57061792E-02   # N_31
  3  2     1.61103966E-02   # N_32
  3  3    -7.05262052E-01   # N_33
  3  4     7.07288370E-01   # N_34
  4  1    -3.90553682E-04   # N_41
  4  2     9.99658554E-01   # N_42
  4  3    -3.15028687E-03   # N_43
  4  4    -2.59364144E-02   # N_44
#
BLOCK UMIX  # Chargino Mixing Matrix U
  1  1     4.46418656E-03   # U_11
  1  2     9.99990035E-01   # U_12
  2  1    -9.99990035E-01   # U_21
  2  2     4.46418656E-03   # U_22
#
BLOCK VMIX  # Chargino Mixing Matrix V
  1  1     3.67061117E-02   # V_11
  1  2    -9.99326104E-01   # V_12
  2  1    -9.99326104E-01   # V_21
  2  2    -3.67061117E-02   # V_22
#
BLOCK STOPMIX  # Stop Mixing Matrix
  1  1    -5.08116173E-01   # cos(theta_t)
  1  2     8.61288543E-01   # sin(theta_t)
  2  1    -8.61288543E-01   # -sin(theta_t)
  2  2    -5.08116173E-01   # cos(theta_t)
#
BLOCK SBOTMIX  # Sbottom Mixing Matrix
  1  1     9.98133071E-01   # cos(theta_b)
  1  2    -6.10767761E-02   # sin(theta_b)
  2  1     6.10767761E-02   # -sin(theta_b)
  2  2     9.98133071E-01   # cos(theta_b)
#
BLOCK STAUMIX  # Stau Mixing Matrix
  1  1    -7.99551038E-02   # cos(theta_tau)
  1  2     9.96798466E-01   # sin(theta_tau)
  2  1    -9.96798466E-01   # -sin(theta_tau)
  2  2    -7.99551038E-02   # cos(theta_tau)
#
BLOCK ALPHA  # Higgs mixing
          -1.05437792E-01   # Mixing angle in the neutral Higgs boson sector
#
BLOCK HMIX Q=  5.00074135E+03  # DRbar Higgs Parameters
         1    -6.80206385E+02   # mu(Q)MSSM           
         2     9.47326514E+00   # tan                 
         3     2.41851357E+02   # higgs               
         4     8.60536091E+06   # mA^2(Q)MSSM         
#
BLOCK GAUGE Q=  5.00074135E+03  # The gauge couplings
     1     3.70896626E-01   # gprime(Q) DRbar
     2     6.32997159E-01   # g(Q) DRbar
     3     1.00724577E+00   # g3(Q) DRbar
#
BLOCK AU Q=  5.00074135E+03  # The trilinear couplings
  1  1     5.00000001E+03   # A_u(Q) DRbar
  2  2     5.00000001E+03   # A_c(Q) DRbar
  3  3     5.00000001E+03   # A_t(Q) DRbar
#
BLOCK AD Q=  5.00074135E+03  # The trilinear couplings
  1  1     5.00000000E+03   # A_d(Q) DRbar
  2  2     5.00000000E+03   # A_s(Q) DRbar
  3  3     5.00000001E+03   # A_b(Q) DRbar
#
BLOCK AE Q=  5.00074135E+03  # The trilinear couplings
  1  1     0.00000000E+00   # A_e(Q) DRbar
  2  2     3.27771243E-08   # A_mu(Q) DRbar
  3  3     3.18608569E-08   # A_tau(Q) DRbar
#
BLOCK Yu Q=  5.00074135E+03  # The Yukawa couplings
  1  1     0.00000000E+00   # y_u(Q) DRbar
  2  2     0.00000000E+00   # y_c(Q) DRbar
  3  3     8.15238371E-01   # y_t(Q) DRbar
#
BLOCK Yd Q=  5.00074135E+03  # The Yukawa couplings
  1  1     0.00000000E+00   # y_d(Q) DRbar
  2  2     0.00000000E+00   # y_s(Q) DRbar
  3  3     1.29327076E-01   # y_b(Q) DRbar
#
BLOCK Ye Q=  5.00074135E+03  # The Yukawa couplings
  1  1     0.00000000E+00   # y_e(Q) DRbar
  2  2     0.00000000E+00   # y_mu(Q) DRbar
  3  3     9.70325274E-02   # y_tau(Q) DRbar
#
BLOCK MSOFT Q=  5.00074135E+03  # The soft SUSY breaking masses at the scale Q
         1     6.00000000E+01   # M_1(Q)              
         2     3.00000000E+03   # M_2(Q)              
         3     8.59142000E+02   # M_3(Q)              
        21     8.25146314E+06   # mH1^2(Q)            
        22     1.04900626E+05   # mH2^2(Q)            
        31     5.00000000E+03   # meL(Q)              
        32     5.00000000E+03   # mmuL(Q)             
        33     5.00000000E+03   # mtauL(Q)            
        34     5.00000000E+03   # meR(Q)              
        35     5.00000000E+03   # mmuR(Q)             
        36     5.00000000E+03   # mtauR(Q)            
        41     5.00000000E+03   # mqL1(Q)             
        42     5.00000000E+03   # mqL2(Q)             
        43     5.00000000E+03   # mqL3(Q)             
        44     5.00000000E+03   # muR(Q)              
        45     5.00000000E+03   # mcR(Q)              
        46     5.00000000E+03   # mtR(Q)              
        47     5.00000000E+03   # mdR(Q)              
        48     5.00000000E+03   # msR(Q)              
        49     5.00000000E+03   # mbR(Q)              
#
#
#
#                             =================
#                             |The decay table|
#                             =================
#
# - The QCD corrections to the decays gluino -> squark  + quark
#                                     squark -> gaugino + quark_prime
#                                     squark -> squark_prime + Higgs
#                                     squark -> gluino  + quark
#   are included.
#
# - The multi-body decays for the inos, stops and sbottoms are included.
#
# - The loop induced decays for the gluino, neutralinos and stops
#   are included.
#
# - The SUSY decays of the top quark are included.
#
#
#         PDG            Width
DECAY         6     1.40428299E+00   # top decays
#          BR         NDA      ID1       ID2
     1.00000000E+00    2           5        24   # BR(t ->  b    W+)
#
#         PDG            Width
DECAY   1000021     1.60614659E-05   # gluino decays
#          BR         NDA      ID1       ID2
     1.09644395E-05    2     1000022        21   # BR(~g -> ~chi_10 g)
     3.28390528E-02    2     1000023        21   # BR(~g -> ~chi_20 g)
     3.17933469E-02    2     1000025        21   # BR(~g -> ~chi_30 g)
#           BR         NDA      ID1       ID2       ID3
     6.99056734E-02    3     1000022         1        -1   # BR(~g -> ~chi_10 d  db)
     9.95995926E-06    3     1000023         1        -1   # BR(~g -> ~chi_20 d  db)
     7.34420987E-06    3     1000025         1        -1   # BR(~g -> ~chi_30 d  db)
     2.38355978E-01    3     1000022         2        -2   # BR(~g -> ~chi_10 u  ub)
     4.61551884E-05    3     1000023         2        -2   # BR(~g -> ~chi_20 u  ub)
     1.04001676E-05    3     1000025         2        -2   # BR(~g -> ~chi_30 u  ub)
     6.99056734E-02    3     1000022         3        -3   # BR(~g -> ~chi_10 s  sb)
     9.95995926E-06    3     1000023         3        -3   # BR(~g -> ~chi_20 s  sb)
     7.34420987E-06    3     1000025         3        -3   # BR(~g -> ~chi_30 s  sb)
     2.38355978E-01    3     1000022         4        -4   # BR(~g -> ~chi_10 c  cb)
     4.61551884E-05    3     1000023         4        -4   # BR(~g -> ~chi_20 c  cb)
     1.04001676E-05    3     1000025         4        -4   # BR(~g -> ~chi_30 c  cb)
     7.11493080E-02    3     1000022         5        -5   # BR(~g -> ~chi_10 b  bb)
     1.95667077E-03    3     1000023         5        -5   # BR(~g -> ~chi_20 b  bb)
     1.89531914E-03    3     1000025         5        -5   # BR(~g -> ~chi_30 b  bb)
     1.69516622E-01    3     1000022         6        -6   # BR(~g -> ~chi_10 t  tb)
     6.31106739E-03    3     1000023         6        -6   # BR(~g -> ~chi_20 t  tb)
     1.88025024E-03    3     1000025         6        -6   # BR(~g -> ~chi_30 t  tb)
     2.31086700E-05    3     1000024         1        -2   # BR(~g -> ~chi_1+ d  ub)
     2.31086700E-05    3    -1000024         2        -1   # BR(~g -> ~chi_1- u  db)
     2.31086700E-05    3     1000024         3        -4   # BR(~g -> ~chi_1+ s  cb)
     2.31086700E-05    3    -1000024         4        -3   # BR(~g -> ~chi_1- c  sb)
     3.29419713E-02    3     1000024         5        -6   # BR(~g -> ~chi_1+ b  tb)
     3.29419713E-02    3    -1000024         6        -5   # BR(~g -> ~chi_1- t  bb)
#
#         PDG            Width
DECAY   1000006     4.14580881E+02   # stop1 decays
#          BR         NDA      ID1       ID2
     2.11904446E-02    2     1000022         6   # BR(~t_1 -> ~chi_10 t )
     7.64966924E-02    2     1000023         6   # BR(~t_1 -> ~chi_20 t )
     7.30524116E-02    2     1000025         6   # BR(~t_1 -> ~chi_30 t )
     5.03434728E-03    2     1000035         6   # BR(~t_1 -> ~chi_40 t )
     1.10285295E-01    2     1000024         5   # BR(~t_1 -> ~chi_1+ b )
     1.00345637E-02    2     1000037         5   # BR(~t_1 -> ~chi_2+ b )
     7.03906245E-01    2     1000021         6   # BR(~t_1 -> ~g      t )
#
#         PDG            Width
DECAY   2000006     4.14734203E+02   # stop2 decays
#          BR         NDA      ID1       ID2
     8.57798834E-03    2     1000022         6   # BR(~t_2 -> ~chi_10 t )
     7.73597896E-02    2     1000023         6   # BR(~t_2 -> ~chi_20 t )
     8.11799184E-02    2     1000025         6   # BR(~t_2 -> ~chi_30 t )
     1.32682923E-02    2     1000035         6   # BR(~t_2 -> ~chi_40 t )
     4.67061918E-02    2     1000024         5   # BR(~t_2 -> ~chi_1+ b )
     2.64138092E-02    2     1000037         5   # BR(~t_2 -> ~chi_2+ b )
     7.43420917E-01    2     1000021         6   # BR(~t_2 -> ~g      t )
     6.94257596E-04    2     1000006        25   # BR(~t_2 -> ~t_1    h )
     2.37883529E-03    2     1000006        23   # BR(~t_2 -> ~t_1    Z )
#
#         PDG            Width
DECAY   1000005     3.92328944E+02   # sbottom1 decays
#          BR         NDA      ID1       ID2
     1.97653617E-03    2     1000022         5   # BR(~b_1 -> ~chi_10 b )
     2.05993667E-03    2     1000023         5   # BR(~b_1 -> ~chi_20 b )
     2.03305169E-03    2     1000025         5   # BR(~b_1 -> ~chi_30 b )
     1.91754039E-02    2     1000035         5   # BR(~b_1 -> ~chi_40 b )
     1.63159847E-01    2    -1000024         6   # BR(~b_1 -> ~chi_1- t )
     3.85063235E-02    2    -1000037         6   # BR(~b_1 -> ~chi_2- t )
     7.71639863E-01    2     1000021         5   # BR(~b_1 -> ~g      b )
     1.44903767E-03    2     1000006       -24   # BR(~b_1 -> ~t_1    W-)
#
#         PDG            Width
DECAY   2000005     3.11518470E+02   # sbottom2 decays
#          BR         NDA      ID1       ID2
     9.44196139E-03    2     1000022         5   # BR(~b_2 -> ~chi_10 b )
     2.63866489E-03    2     1000023         5   # BR(~b_2 -> ~chi_20 b )
     2.68985724E-03    2     1000025         5   # BR(~b_2 -> ~chi_30 b )
     9.16796359E-05    2     1000035         5   # BR(~b_2 -> ~chi_40 b )
     5.97857472E-03    2    -1000024         6   # BR(~b_2 -> ~chi_1- t )
     1.84093908E-04    2    -1000037         6   # BR(~b_2 -> ~chi_2- t )
     9.78947594E-01    2     1000021         5   # BR(~b_2 -> ~g      b )
     2.75738289E-05    2     1000006       -24   # BR(~b_2 -> ~t_1    W-)
#
#         PDG            Width
DECAY   1000002     3.30509782E+02   # sup_L decays
#          BR         NDA      ID1       ID2
     2.25859538E-03    2     1000022         2   # BR(~u_L -> ~chi_10 u)
     4.86697085E-05    2     1000023         2   # BR(~u_L -> ~chi_20 u)
     2.94586503E-06    2     1000025         2   # BR(~u_L -> ~chi_30 u)
     2.36647544E-02    2     1000035         2   # BR(~u_L -> ~chi_40 u)
     1.53874072E-04    2     1000024         1   # BR(~u_L -> ~chi_1+ d)
     4.72992617E-02    2     1000037         1   # BR(~u_L -> ~chi_2+ d)
     9.26571899E-01    2     1000021         2   # BR(~u_L -> ~g      u)
#
#         PDG            Width
DECAY   2000002     3.16881927E+02   # sup_R decays
#          BR         NDA      ID1       ID2
     3.74754077E-02    2     1000022         2   # BR(~u_R -> ~chi_10 u)
     7.05904865E-05    2     1000023         2   # BR(~u_R -> ~chi_20 u)
     7.56356900E-05    2     1000025         2   # BR(~u_R -> ~chi_30 u)
     2.27316719E-09    2     1000035         2   # BR(~u_R -> ~chi_40 u)
     9.62378364E-01    2     1000021         2   # BR(~u_R -> ~g      u)
#
#         PDG            Width
DECAY   1000001     3.30518952E+02   # sdown_L decays
#          BR         NDA      ID1       ID2
     2.24861860E-03    2     1000022         1   # BR(~d_L -> ~chi_10 d)
     8.15280090E-06    2     1000023         1   # BR(~d_L -> ~chi_20 d)
     3.57899639E-05    2     1000025         1   # BR(~d_L -> ~chi_30 d)
     2.36787293E-02    2     1000035         1   # BR(~d_L -> ~chi_40 d)
     2.27617421E-06    2    -1000024         2   # BR(~d_L -> ~chi_1- u)
     4.73756402E-02    2    -1000037         2   # BR(~d_L -> ~chi_2- u)
     9.26650793E-01    2     1000021         1   # BR(~d_L -> ~g      d)
#
#         PDG            Width
DECAY   2000001     3.07962279E+02   # sdown_R decays
#          BR         NDA      ID1       ID2
     9.64077180E-03    2     1000022         1   # BR(~d_R -> ~chi_10 d)
     1.81599048E-05    2     1000023         1   # BR(~d_R -> ~chi_20 d)
     1.94578199E-05    2     1000025         1   # BR(~d_R -> ~chi_30 d)
     5.84865914E-10    2     1000035         1   # BR(~d_R -> ~chi_40 d)
     9.90321610E-01    2     1000021         1   # BR(~d_R -> ~g      d)
#
#         PDG            Width
DECAY   1000004     3.30509782E+02   # scharm_L decays
#          BR         NDA      ID1       ID2
     2.25859538E-03    2     1000022         4   # BR(~c_L -> ~chi_10 c)
     4.86697085E-05    2     1000023         4   # BR(~c_L -> ~chi_20 c)
     2.94586503E-06    2     1000025         4   # BR(~c_L -> ~chi_30 c)
     2.36647544E-02    2     1000035         4   # BR(~c_L -> ~chi_40 c)
     1.53874072E-04    2     1000024         3   # BR(~c_L -> ~chi_1+ s)
     4.72992617E-02    2     1000037         3   # BR(~c_L -> ~chi_2+ s)
     9.26571899E-01    2     1000021         4   # BR(~c_L -> ~g      c)
#
#         PDG            Width
DECAY   2000004     3.16881927E+02   # scharm_R decays
#          BR         NDA      ID1       ID2
     3.74754077E-02    2     1000022         4   # BR(~c_R -> ~chi_10 c)
     7.05904865E-05    2     1000023         4   # BR(~c_R -> ~chi_20 c)
     7.56356900E-05    2     1000025         4   # BR(~c_R -> ~chi_30 c)
     2.27316719E-09    2     1000035         4   # BR(~c_R -> ~chi_40 c)
     9.62378364E-01    2     1000021         4   # BR(~c_R -> ~g      c)
#
#         PDG            Width
DECAY   1000003     3.30518952E+02   # sstrange_L decays
#          BR         NDA      ID1       ID2
     2.24861860E-03    2     1000022         3   # BR(~s_L -> ~chi_10 s)
     8.15280090E-06    2     1000023         3   # BR(~s_L -> ~chi_20 s)
     3.57899639E-05    2     1000025         3   # BR(~s_L -> ~chi_30 s)
     2.36787293E-02    2     1000035         3   # BR(~s_L -> ~chi_40 s)
     2.27617421E-06    2    -1000024         4   # BR(~s_L -> ~chi_1- c)
     4.73756402E-02    2    -1000037         4   # BR(~s_L -> ~chi_2- c)
     9.26650793E-01    2     1000021         3   # BR(~s_L -> ~g      s)
#
#         PDG            Width
DECAY   2000003     3.07962279E+02   # sstrange_R decays
#          BR         NDA      ID1       ID2
     9.64077180E-03    2     1000022         3   # BR(~s_R -> ~chi_10 s)
     1.81599048E-05    2     1000023         3   # BR(~s_R -> ~chi_20 s)
     1.94578199E-05    2     1000025         3   # BR(~s_R -> ~chi_30 s)
     5.84865914E-10    2     1000035         3   # BR(~s_R -> ~chi_40 s)
     9.90321610E-01    2     1000021         3   # BR(~s_R -> ~g      s)
#
#         PDG            Width
DECAY   1000011     3.03075640E+01   # selectron_L decays
#          BR         NDA      ID1       ID2
     2.25799312E-01    2     1000022        11   # BR(~e_L -> ~chi_10 e-)
     1.36870643E-03    2     1000023        11   # BR(~e_L -> ~chi_20 e-)
     7.22405727E-05    2     1000025        11   # BR(~e_L -> ~chi_30 e-)
     2.57408176E-01    2     1000035        11   # BR(~e_L -> ~chi_40 e-)
     2.52947833E-05    2    -1000024        12   # BR(~e_L -> ~chi_1- nu_e)
     5.15326270E-01    2    -1000037        12   # BR(~e_L -> ~chi_2- nu_e)
#
#         PDG            Width
DECAY   2000011     2.73878245E+01   # selectron_R decays
#          BR         NDA      ID1       ID2
     9.96116823E-01    2     1000022        11   # BR(~e_R -> ~chi_10 e-)
     1.87457347E-03    2     1000023        11   # BR(~e_R -> ~chi_20 e-)
     2.00854385E-03    2     1000025        11   # BR(~e_R -> ~chi_30 e-)
     5.92032833E-08    2     1000035        11   # BR(~e_R -> ~chi_40 e-)
#
#         PDG            Width
DECAY   1000013     3.03075640E+01   # smuon_L decays
#          BR         NDA      ID1       ID2
     2.25799312E-01    2     1000022        13   # BR(~mu_L -> ~chi_10 mu-)
     1.36870643E-03    2     1000023        13   # BR(~mu_L -> ~chi_20 mu-)
     7.22405727E-05    2     1000025        13   # BR(~mu_L -> ~chi_30 mu-)
     2.57408176E-01    2     1000035        13   # BR(~mu_L -> ~chi_40 mu-)
     2.52947833E-05    2    -1000024        14   # BR(~mu_L -> ~chi_1- nu_mu)
     5.15326270E-01    2    -1000037        14   # BR(~mu_L -> ~chi_2- nu_mu)
#
#         PDG            Width
DECAY   2000013     2.73878245E+01   # smuon_R decays
#          BR         NDA      ID1       ID2
     9.96116823E-01    2     1000022        13   # BR(~mu_R -> ~chi_10 mu-)
     1.87457347E-03    2     1000023        13   # BR(~mu_R -> ~chi_20 mu-)
     2.00854385E-03    2     1000025        13   # BR(~mu_R -> ~chi_30 mu-)
     5.92032833E-08    2     1000035        13   # BR(~mu_R -> ~chi_40 mu-)
#
#         PDG            Width
DECAY   1000015     2.91995017E+01   # stau_1 decays
#          BR         NDA      ID1       ID2
     9.30613762E-01    2     1000022        15   # BR(~tau_1 -> ~chi_10  tau-)
     1.70558963E-02    2     1000023        15   # BR(~tau_1 -> ~chi_20  tau-)
     1.65326255E-02    2     1000025        15   # BR(~tau_1 -> ~chi_30  tau-)
     1.66273355E-03    2     1000035        15   # BR(~tau_1 -> ~chi_40  tau-)
     3.08064163E-02    2    -1000024        16   # BR(~tau_1 -> ~chi_1-  nu_tau)
     3.32856636E-03    2    -1000037        16   # BR(~tau_1 -> ~chi_2-  nu_tau)
#
#         PDG            Width
DECAY   2000015     3.11871133E+01   # stau_2 decays
#          BR         NDA      ID1       ID2
     2.22915937E-01    2     1000022        15   # BR(~tau_2 -> ~chi_10  tau-)
     1.58611751E-02    2     1000023        15   # BR(~tau_2 -> ~chi_20  tau-)
     1.51369075E-02    2     1000025        15   # BR(~tau_2 -> ~chi_30  tau-)
     2.48505972E-01    2     1000035        15   # BR(~tau_2 -> ~chi_40  tau-)
     7.51586915E-05    2    -1000024        16   # BR(~tau_2 -> ~chi_1-  nu_tau)
     4.97504849E-01    2    -1000037        16   # BR(~tau_2 -> ~chi_2-  nu_tau)
#
#         PDG            Width
DECAY   1000012     3.03106586E+01   # snu_eL decays
#          BR         NDA      ID1       ID2
     2.25395618E-01    2     1000022        12   # BR(~nu_eL -> ~chi_10 nu_e)
     1.78058453E-05    2     1000023        12   # BR(~nu_eL -> ~chi_20 nu_e)
     1.16684538E-03    2     1000025        12   # BR(~nu_eL -> ~chi_30 nu_e)
     2.57451823E-01    2     1000035        12   # BR(~nu_eL -> ~chi_40 nu_e)
     1.70958219E-03    2     1000024        11   # BR(~nu_eL -> ~chi_1+ e-)
     5.14258325E-01    2     1000037        11   # BR(~nu_eL -> ~chi_2+ e-)
#
#         PDG            Width
DECAY   1000014     3.03106586E+01   # snu_muL decays
#          BR         NDA      ID1       ID2
     2.25395618E-01    2     1000022        14   # BR(~nu_muL -> ~chi_10 nu_mu)
     1.78058453E-05    2     1000023        14   # BR(~nu_muL -> ~chi_20 nu_mu)
     1.16684538E-03    2     1000025        14   # BR(~nu_muL -> ~chi_30 nu_mu)
     2.57451823E-01    2     1000035        14   # BR(~nu_muL -> ~chi_40 nu_mu)
     1.70958219E-03    2     1000024        13   # BR(~nu_muL -> ~chi_1+ mu-)
     5.14258325E-01    2     1000037        13   # BR(~nu_muL -> ~chi_2+ mu-)
#
#         PDG            Width
DECAY   1000016     3.12048125E+01   # snu_tauL decays
#          BR         NDA      ID1       ID2
     2.18913055E-01    2     1000022        16   # BR(~nu_tauL -> ~chi_10 nu_tau)
     1.72935853E-05    2     1000023        16   # BR(~nu_tauL -> ~chi_20 nu_tau)
     1.13327610E-03    2     1000025        16   # BR(~nu_tauL -> ~chi_30 nu_tau)
     2.49981487E-01    2     1000035        16   # BR(~nu_tauL -> ~chi_40 nu_tau)
     3.06190955E-02    2     1000024        15   # BR(~nu_tauL -> ~chi_1+ tau-)
     4.99335792E-01    2     1000037        15   # BR(~nu_tauL -> ~chi_2+ tau-)
#
#         PDG            Width
DECAY   1000024     4.20684717E-01   # chargino1+ decays
#          BR         NDA      ID1       ID2
     1.00000000E+00    2     1000022        24   # BR(~chi_1+ -> ~chi_10  W+)
#
#         PDG            Width
DECAY   1000037     2.14735369E+01   # chargino2+ decays
#          BR         NDA      ID1       ID2
     2.53451681E-01    2     1000024        23   # BR(~chi_2+ -> ~chi_1+  Z )
     1.77977927E-04    2     1000022        24   # BR(~chi_2+ -> ~chi_10  W+)
     2.44603420E-01    2     1000023        24   # BR(~chi_2+ -> ~chi_20  W+)
     2.44311893E-01    2     1000025        24   # BR(~chi_2+ -> ~chi_30  W+)
     2.57452461E-01    2     1000024        25   # BR(~chi_2+ -> ~chi_1+  h )
     2.56665820E-06    2     1000022        37   # BR(~chi_2+ -> ~chi_10  H+)
#
#         PDG            Width
DECAY   1000022     0.00000000E+00   # neutralino1 decays
#
#         PDG            Width
DECAY   1000023     4.34392152E-01   # neutralino2 decays
#          BR         NDA      ID1       ID2
     5.22375480E-01    2     1000022        23   # BR(~chi_20 -> ~chi_10   Z )
     4.77624520E-01    2     1000022        25   # BR(~chi_20 -> ~chi_10   h )
#
#         PDG            Width
DECAY   1000025     4.32276245E-01   # neutralino3 decays
#          BR         NDA      ID1       ID2
     4.83928220E-01    2     1000022        23   # BR(~chi_30 -> ~chi_10   Z )
     5.16071780E-01    2     1000022        25   # BR(~chi_30 -> ~chi_10   h )
#
#         PDG            Width
DECAY   1000035     2.14886291E+01   # neutralino4 decays
#          BR         NDA      ID1       ID2
     2.28963801E-05    2     1000022        23   # BR(~chi_40 -> ~chi_10   Z )
     9.62829469E-02    2     1000023        23   # BR(~chi_40 -> ~chi_20   Z )
     1.56560286E-01    2     1000025        23   # BR(~chi_40 -> ~chi_30   Z )
     2.45054873E-01    2     1000024       -24   # BR(~chi_40 -> ~chi_1+   W-)
     2.45054873E-01    2    -1000024        24   # BR(~chi_40 -> ~chi_1-   W+)
     1.52076131E-04    2     1000022        25   # BR(~chi_40 -> ~chi_10   h )
     2.45192506E-06    2     1000022        35   # BR(~chi_40 -> ~chi_10   H )
     2.79521077E-07    2     1000022        36   # BR(~chi_40 -> ~chi_10   A )
     1.60346388E-01    2     1000023        25   # BR(~chi_40 -> ~chi_20   h )
     9.65229296E-02    2     1000025        25   # BR(~chi_40 -> ~chi_30   h )
#
#         PDG            Width
DECAY        25     4.02891176E-03   # h decays
#          BR         NDA      ID1       ID2
     6.16257690E-01    2           5        -5   # BR(h -> b       bb     )
     6.41781756E-02    2         -15        15   # BR(h -> tau+    tau-   )
     2.27215806E-04    2         -13        13   # BR(h -> mu+     mu-    )
     4.81977569E-04    2           3        -3   # BR(h -> s       sb     )
     2.08843522E-02    2           4        -4   # BR(h -> c       cb     )
     6.71061804E-02    2          21        21   # BR(h -> g       g      )
     2.29797084E-03    2          22        22   # BR(h -> gam     gam    )
     1.44916771E-03    2          22        23   # BR(h -> Z       gam    )
     2.03024692E-01    2          24       -24   # BR(h -> W+      W-     )
     2.40226841E-02    2          23        23   # BR(h -> Z       Z      )
     6.98937082E-05    2     1000022   1000022   # BR(h -> ~chi_10 ~chi_10)
#
#         PDG            Width
DECAY        35     8.48190737E+00   # H decays
#          BR         NDA      ID1       ID2
     3.78247874E-01    2           5        -5   # BR(H -> b       bb     )
     6.57298331E-02    2         -15        15   # BR(H -> tau+    tau-   )
     2.32425911E-04    2         -13        13   # BR(H -> mu+     mu-    )
     2.84918584E-04    2           3        -3   # BR(H -> s       sb     )
     1.59149335E-06    2           4        -4   # BR(H -> c       cb     )
     1.59002792E-01    2           6        -6   # BR(H -> t       tb     )
     5.28405689E-05    2          21        21   # BR(H -> g       g      )
     1.84551492E-07    2          22        22   # BR(H -> gam     gam    )
     9.37661489E-08    2          23        22   # BR(H -> Z       gam    )
     7.41427653E-05    2          24       -24   # BR(H -> W+      W-     )
     3.70244458E-05    2          23        23   # BR(H -> Z       Z      )
     2.73686414E-04    2          25        25   # BR(H -> h       h      )
     2.45593317E-23    2          36        36   # BR(H -> A       A      )
     7.26523225E-19    2          23        36   # BR(H -> Z       A      )
     2.81477520E-03    2     1000024  -1000024   # BR(H -> ~chi_1+ ~chi_1-)
     3.48205684E-03    2     1000022   1000022   # BR(H -> ~chi_10 ~chi_10)
     1.48643026E-05    2     1000023   1000023   # BR(H -> ~chi_20 ~chi_20)
     1.35611972E-03    2     1000025   1000025   # BR(H -> ~chi_30 ~chi_30)
     2.33758817E-01    2     1000022   1000023   # BR(H -> ~chi_10 ~chi_20)
     1.53115254E-01    2     1000022   1000025   # BR(H -> ~chi_10 ~chi_30)
     1.52070418E-03    2     1000023   1000025   # BR(H -> ~chi_20 ~chi_30)
#
#         PDG            Width
DECAY        36     8.49195986E+00   # A decays
#          BR         NDA      ID1       ID2
     3.77928857E-01    2           5        -5   # BR(A -> b       bb     )
     6.56539722E-02    2         -15        15   # BR(A -> tau+    tau-   )
     2.32157336E-04    2         -13        13   # BR(A -> mu+     mu-    )
     2.84797216E-04    2           3        -3   # BR(A -> s       sb     )
     1.59606894E-06    2           4        -4   # BR(A -> c       cb     )
     1.59371947E-01    2           6        -6   # BR(A -> t       tb     )
     1.57760792E-04    2          21        21   # BR(A -> g       g      )
     5.99470585E-07    2          22        22   # BR(A -> gam     gam    )
     1.90886668E-07    2          23        22   # BR(A -> Z       gam    )
     7.37772754E-05    2          23        25   # BR(A -> Z       h      )
     3.41416547E-03    2     1000024  -1000024   # BR(A -> ~chi_1+ ~chi_1-)
     3.50994881E-03    2     1000022   1000022   # BR(A -> ~chi_10 ~chi_10)
     1.24144722E-05    2     1000023   1000023   # BR(A -> ~chi_20 ~chi_20)
     2.65510590E-03    2     1000025   1000025   # BR(A -> ~chi_30 ~chi_30)
     1.55740363E-01    2     1000022   1000023   # BR(A -> ~chi_10 ~chi_20)
     2.30132518E-01    2     1000022   1000025   # BR(A -> ~chi_10 ~chi_30)
     8.29829137E-04    2     1000023   1000025   # BR(A -> ~chi_20 ~chi_30)
#
#         PDG            Width
DECAY        37     8.42710116E+00   # H+ decays
#          BR         NDA      ID1       ID2
     6.05259641E-04    2           4        -5   # BR(H+ -> c       bb     )
     6.61896392E-02    2         -15        16   # BR(H+ -> tau+    nu_tau )
     2.34051494E-04    2         -13        14   # BR(H+ -> mu+     nu_mu  )
     3.87364144E-06    2           2        -5   # BR(H+ -> u       bb     )
     1.37333563E-05    2           2        -3   # BR(H+ -> u       sb     )
     2.84004423E-04    2           4        -3   # BR(H+ -> c       sb     )
     5.35561231E-01    2           6        -5   # BR(H+ -> t       bb     )
     7.44954724E-05    2          24        25   # BR(H+ -> W+      h      )
     7.71710272E-13    2          24        36   # BR(H+ -> W+      A      )
     3.95105011E-01    2     1000024   1000022   # BR(H+ -> ~chi_1+ ~chi_10)
     1.87413414E-03    2     1000024   1000023   # BR(H+ -> ~chi_1+ ~chi_20)
     5.45670073E-05    2     1000024   1000025   # BR(H+ -> ~chi_1+ ~chi_30)
