#
#                              ======================
#                              | THE SUSYHIT OUTPUT |
#                              ======================
#
#
#              ------------------------------------------------------
#              |     This is the output of the SUSY-HIT package     |
#              |  created by A.Djouadi, M.Muehlleitner and M.Spira. |
#              |  In case of problems with SUSY-HIT email to        |
#              |           margarete.muehlleitner@cern.ch           |
#              |           michael.spira@psi.ch                     |
#              |           abdelhak.djouadi@cern.ch                 |
#              ------------------------------------------------------
#
#              ------------------------------------------------------
#              |  SUSY Les Houches Accord - MSSM Spectrum + Decays  |
#              |              based on the decay programs           |
#              |                                                    |
#              |                     SDECAY 1.3b                    |
#              |                                                    |
#              |  Authors: M.Muhlleitner, A.Djouadi and Y.Mambrini  |
#              |  Ref.:    Comput.Phys.Commun.168(2005)46           |
#              |           [hep-ph/0311167]                         |
#              |                                                    |
#              |                     HDECAY 3.4                     |
#              |                                                    |
#              |  By: A.Djouadi,J.Kalinowski,M.Muhlleitner,M.Spira  |
#              |  Ref.:    Comput.Phys.Commun.108(1998)56           |
#              |           [hep-ph/9704448]                         |
#              |                                                    |
#              |                                                    |
#              |  If not stated otherwise all DRbar couplings and   |
#              |  soft SUSY breaking masses are given at the scale  |
#              |  Q=  0.50007189E+04
#              |                                                    |
#              ------------------------------------------------------
#
#
BLOCK DCINFO  # Decay Program information
     1   SDECAY/HDECAY # decay calculator
     2   1.3b  /3.4    # version number
#
BLOCK SPINFO  # Spectrum calculator information
     1    SOFTSUSY    # spectrum calculator                
     2    3.4.0       # version number                     
#
BLOCK MODSEL  # Model selection
     1     0   #  nonUniversal                                     
#
BLOCK SMINPUTS  # Standard Model inputs
         1     1.25778332E+02   # alpha_em^-1(M_Z)^MSbar
         2     1.16570000E-05   # G_F [GeV^-2]
         3     1.17200002E-01   # alpha_S(M_Z)^MSbar
         4     9.11876000E+01   # M_Z pole mass
         5     4.25000000E+00   # mb(mb)^MSbar
         6     1.72500000E+02   # mt pole mass
         7     1.77682000E+00   # mtau pole mass
#
BLOCK MINPAR  # Input parameters - minimal models
         3     1.00000000E+01   # tanb                
#
BLOCK EXTPAR  # Input parameters - non-minimal models
         0    -1.00000000E+00   # Set                 
         1     6.00000000E+01   # M_1(MX)             
         2     3.00000000E+03   # M_2(MX)             
         3     2.62339500E+03   # M_3(MX)             
        11     5.00000000E+03   # At(MX)              
        12     5.00000000E+03   # Ab(MX)              
        13     0.00000000E+00   # Atau(MX)            
        23    -1.54435700E+03   # mu(MX)              
        26     3.00000000E+03   # mA(pole)            
        31     5.00000000E+03   # meL(MX)             
        32     5.00000000E+03   # mmuL(MX)            
        33     5.00000000E+03   # mtauL(MX)           
        34     5.00000000E+03   # meR(MX)             
        35     5.00000000E+03   # mmuR(MX)            
        36     5.00000000E+03   # mtauR(MX)           
        41     5.00000000E+03   # mqL1(MX)            
        42     5.00000000E+03   # mqL2(MX)            
        43     5.00000000E+03   # mqL3(MX)            
        44     5.00000000E+03   # muR(MX)             
        45     5.00000000E+03   # mcR(MX)             
        46     5.00000000E+03   # mtR(MX)             
        47     5.00000000E+03   # mdR(MX)             
        48     5.00000000E+03   # msR(MX)             
        49     5.00000000E+03   # mbR(MX)             
#
BLOCK MASS  # Mass Spectrum
# PDG code           mass       particle
        24     8.00970328E+01   # W+
        25     1.24820039E+02   # h
        35     3.00008286E+03   # H
        36     2.99999995E+03   # A
        37     3.00087329E+03   # H+
         5     4.87878001E+00   # b-quark pole mass calculated from mb(mb)_Msbar
   1000001     5.09115808E+03   # ~d_L
   2000001     5.07345746E+03   # ~d_R
   1000002     5.09069025E+03   # ~u_L
   2000002     5.07318607E+03   # ~u_R
   1000003     5.09115808E+03   # ~s_L
   2000003     5.07345746E+03   # ~s_R
   1000004     5.09069025E+03   # ~c_L
   2000004     5.07318607E+03   # ~c_R
   1000005     5.03728930E+03   # ~b_1
   2000005     5.07231990E+03   # ~b_2
   1000006     4.93065646E+03   # ~t_1
   2000006     5.08180725E+03   # ~t_2
   1000011     5.01904149E+03   # ~e_L
   2000011     5.00590832E+03   # ~e_R
   1000012     5.01809373E+03   # ~nu_eL
   1000013     5.01904149E+03   # ~mu_L
   2000013     5.00590832E+03   # ~mu_R
   1000014     5.01809373E+03   # ~nu_muL
   1000015     5.00431330E+03   # ~tau_1
   2000015     5.01905830E+03   # ~tau_2
   1000016     5.01755669E+03   # ~nu_tauL
   1000021     3.00000081E+03   # ~g
   1000022     6.03026963E+01   # ~chi_10
   1000023     1.59942896E+03   # ~chi_20
   1000025    -1.60194898E+03   # ~chi_30
   1000035     3.07432933E+03   # ~chi_40
   1000024     1.60000001E+03   # ~chi_1+
   1000037     3.07449681E+03   # ~chi_2+
#
BLOCK NMIX  # Neutralino Mixing Matrix
  1  1     9.99609620E-01   # N_11
  1  2     1.33230494E-04   # N_12
  1  3    -2.78762853E-02   # N_13
  1  4     1.87169174E-03   # N_14
  2  1     1.83862048E-02   # N_21
  2  2     3.29858188E-02   # N_22
  2  3     7.06888588E-01   # N_23
  2  4     7.06316082E-01   # N_24
  3  1    -2.10318242E-02   # N_31
  3  2     1.29774614E-02   # N_32
  3  3    -7.06633677E-01   # N_33
  3  4     7.07147859E-01   # N_34
  4  1    -4.67016312E-04   # N_41
  4  2     9.99371554E-01   # N_42
  4  3    -1.41521675E-02   # N_43
  4  4    -3.24960697E-02   # N_44
#
BLOCK UMIX  # Chargino Mixing Matrix U
  1  1     2.00180613E-02   # U_11
  1  2     9.99799619E-01   # U_12
  2  1    -9.99799619E-01   # U_21
  2  2     2.00180613E-02   # U_22
#
BLOCK VMIX  # Chargino Mixing Matrix V
  1  1     4.59683199E-02   # V_11
  1  2    -9.98942898E-01   # V_12
  2  1    -9.98942898E-01   # V_21
  2  2    -4.59683199E-02   # V_22
#
BLOCK STOPMIX  # Stop Mixing Matrix
  1  1    -5.08069941E-01   # cos(theta_t)
  1  2     8.61315816E-01   # sin(theta_t)
  2  1    -8.61315816E-01   # -sin(theta_t)
  2  2    -5.08069941E-01   # cos(theta_t)
#
BLOCK SBOTMIX  # Sbottom Mixing Matrix
  1  1     9.93905773E-01   # cos(theta_b)
  1  2    -1.10233000E-01   # sin(theta_b)
  2  1     1.10233000E-01   # -sin(theta_b)
  2  2     9.93905773E-01   # cos(theta_b)
#
BLOCK STAUMIX  # Stau Mixing Matrix
  1  1    -1.78657185E-01   # cos(theta_tau)
  1  2     9.83911383E-01   # sin(theta_tau)
  2  1    -9.83911383E-01   # -sin(theta_tau)
  2  2    -1.78657185E-01   # cos(theta_tau)
#
BLOCK ALPHA  # Higgs mixing
          -1.05470875E-01   # Mixing angle in the neutral Higgs boson sector
#
BLOCK HMIX Q=  5.00071887E+03  # DRbar Higgs Parameters
         1    -1.57284248E+03   # mu(Q)MSSM           
         2     9.46972981E+00   # tan                 
         3     2.41985923E+02   # higgs               
         4     8.38666097E+06   # mA^2(Q)MSSM         
#
BLOCK GAUGE Q=  5.00071887E+03  # The gauge couplings
     1     3.70666977E-01   # gprime(Q) DRbar
     2     6.31952549E-01   # g(Q) DRbar
     3     9.92473301E-01   # g3(Q) DRbar
#
BLOCK AU Q=  5.00071887E+03  # The trilinear couplings
  1  1     5.00000002E+03   # A_u(Q) DRbar
  2  2     5.00000002E+03   # A_c(Q) DRbar
  3  3     5.00000003E+03   # A_t(Q) DRbar
#
BLOCK AD Q=  5.00071887E+03  # The trilinear couplings
  1  1     5.00000001E+03   # A_d(Q) DRbar
  2  2     5.00000001E+03   # A_s(Q) DRbar
  3  3     5.00000001E+03   # A_b(Q) DRbar
#
BLOCK AE Q=  5.00071887E+03  # The trilinear couplings
  1  1     0.00000000E+00   # A_e(Q) DRbar
  2  2     3.28957514E-07   # A_mu(Q) DRbar
  3  3     3.29189492E-07   # A_tau(Q) DRbar
#
BLOCK Yu Q=  5.00071887E+03  # The Yukawa couplings
  1  1     0.00000000E+00   # y_u(Q) DRbar
  2  2     0.00000000E+00   # y_c(Q) DRbar
  3  3     8.21251305E-01   # y_t(Q) DRbar
#
BLOCK Yd Q=  5.00071887E+03  # The Yukawa couplings
  1  1     0.00000000E+00   # y_d(Q) DRbar
  2  2     0.00000000E+00   # y_s(Q) DRbar
  3  3     1.32168065E-01   # y_b(Q) DRbar
#
BLOCK Ye Q=  5.00071887E+03  # The Yukawa couplings
  1  1     0.00000000E+00   # y_e(Q) DRbar
  2  2     0.00000000E+00   # y_mu(Q) DRbar
  3  3     9.65821311E-02   # y_tau(Q) DRbar
#
BLOCK MSOFT Q=  5.00071887E+03  # The soft SUSY breaking masses at the scale Q
         1     6.00000000E+01   # M_1(Q)              
         2     3.00000000E+03   # M_2(Q)              
         3     2.62339500E+03   # M_3(Q)              
        21     6.19131598E+06   # mH1^2(Q)            
        22    -1.92511710E+06   # mH2^2(Q)            
        31     5.00000000E+03   # meL(Q)              
        32     5.00000000E+03   # mmuL(Q)             
        33     5.00000000E+03   # mtauL(Q)            
        34     5.00000000E+03   # meR(Q)              
        35     5.00000000E+03   # mmuR(Q)             
        36     5.00000000E+03   # mtauR(Q)            
        41     4.99999999E+03   # mqL1(Q)             
        42     4.99999999E+03   # mqL2(Q)             
        43     4.99999999E+03   # mqL3(Q)             
        44     4.99999999E+03   # muR(Q)              
        45     4.99999999E+03   # mcR(Q)              
        46     4.99999999E+03   # mtR(Q)              
        47     4.99999999E+03   # mdR(Q)              
        48     4.99999999E+03   # msR(Q)              
        49     4.99999999E+03   # mbR(Q)              
#
#
#
#                             =================
#                             |The decay table|
#                             =================
#
# - The QCD corrections to the decays gluino -> squark  + quark
#                                     squark -> gaugino + quark_prime
#                                     squark -> squark_prime + Higgs
#                                     squark -> gluino  + quark
#   are included.
#
# - The multi-body decays for the inos, stops and sbottoms are included.
#
# - The loop induced decays for the gluino, neutralinos and stops
#   are included.
#
# - The SUSY decays of the top quark are included.
#
#
#         PDG            Width
DECAY         6     1.39941836E+00   # top decays
#          BR         NDA      ID1       ID2
     1.00000000E+00    2           5        24   # BR(t ->  b    W+)
#
#         PDG            Width
DECAY   1000021     5.81989564E-03   # gluino decays
#          BR         NDA      ID1       ID2
     2.91147286E-06    2     1000022        21   # BR(~g -> ~chi_10 g)
     4.32099404E-03    2     1000023        21   # BR(~g -> ~chi_20 g)
     4.32443796E-03    2     1000025        21   # BR(~g -> ~chi_30 g)
#           BR         NDA      ID1       ID2       ID3
     3.52794106E-02    3     1000022         1        -1   # BR(~g -> ~chi_10 d  db)
     3.40005342E-05    3     1000023         1        -1   # BR(~g -> ~chi_20 d  db)
     5.12258050E-06    3     1000025         1        -1   # BR(~g -> ~chi_30 d  db)
     1.20301606E-01    3     1000022         2        -2   # BR(~g -> ~chi_10 u  ub)
     5.74790768E-05    3     1000023         2        -2   # BR(~g -> ~chi_20 u  ub)
     5.02739767E-06    3     1000025         2        -2   # BR(~g -> ~chi_30 u  ub)
     3.52794106E-02    3     1000022         3        -3   # BR(~g -> ~chi_10 s  sb)
     3.40005342E-05    3     1000023         3        -3   # BR(~g -> ~chi_20 s  sb)
     5.12258050E-06    3     1000025         3        -3   # BR(~g -> ~chi_30 s  sb)
     1.20301606E-01    3     1000022         4        -4   # BR(~g -> ~chi_10 c  cb)
     5.74790768E-05    3     1000023         4        -4   # BR(~g -> ~chi_20 c  cb)
     5.02739767E-06    3     1000025         4        -4   # BR(~g -> ~chi_30 c  cb)
     3.57401616E-02    3     1000022         5        -5   # BR(~g -> ~chi_10 b  bb)
     3.53076467E-03    3     1000023         5        -5   # BR(~g -> ~chi_20 b  bb)
     3.46336991E-03    3     1000025         5        -5   # BR(~g -> ~chi_30 b  bb)
     1.26078066E-01    3     1000022         6        -6   # BR(~g -> ~chi_10 t  tb)
     1.28283911E-01    3     1000023         6        -6   # BR(~g -> ~chi_20 t  tb)
     1.15849494E-01    3     1000025         6        -6   # BR(~g -> ~chi_30 t  tb)
     8.54870568E-05    3     1000024         1        -2   # BR(~g -> ~chi_1+ d  ub)
     8.54870568E-05    3    -1000024         2        -1   # BR(~g -> ~chi_1- u  db)
     8.54870568E-05    3     1000024         3        -4   # BR(~g -> ~chi_1+ s  cb)
     8.54870568E-05    3    -1000024         4        -3   # BR(~g -> ~chi_1- c  sb)
     1.33349324E-01    3     1000024         5        -6   # BR(~g -> ~chi_1+ b  tb)
     1.33349324E-01    3    -1000024         6        -5   # BR(~g -> ~chi_1- t  bb)
#
#         PDG            Width
DECAY   1000006     2.30472356E+02   # stop1 decays
#          BR         NDA      ID1       ID2
     3.84841157E-02    2     1000022         6   # BR(~t_1 -> ~chi_10 t )
     1.14096575E-01    2     1000023         6   # BR(~t_1 -> ~chi_20 t )
     1.09701600E-01    2     1000025         6   # BR(~t_1 -> ~chi_30 t )
     9.27160508E-03    2     1000035         6   # BR(~t_1 -> ~chi_40 t )
     1.66482751E-01    2     1000024         5   # BR(~t_1 -> ~chi_1+ b )
     1.84327462E-02    2     1000037         5   # BR(~t_1 -> ~chi_2+ b )
     5.43530607E-01    2     1000021         6   # BR(~t_1 -> ~g      t )
#
#         PDG            Width
DECAY   2000006     2.44986490E+02   # stop2 decays
#          BR         NDA      ID1       ID2
     1.40142346E-02    2     1000022         6   # BR(~t_2 -> ~chi_10 t )
     1.11699176E-01    2     1000023         6   # BR(~t_2 -> ~chi_20 t )
     1.16218028E-01    2     1000025         6   # BR(~t_2 -> ~chi_30 t )
     2.28007144E-02    2     1000035         6   # BR(~t_2 -> ~chi_40 t )
     6.65195995E-02    2     1000024         5   # BR(~t_2 -> ~chi_1+ b )
     4.52492587E-02    2     1000037         5   # BR(~t_2 -> ~chi_2+ b )
     6.18540284E-01    2     1000021         6   # BR(~t_2 -> ~g      t )
     1.09165075E-03    2     1000006        25   # BR(~t_2 -> ~t_1    h )
     3.86705422E-03    2     1000006        23   # BR(~t_2 -> ~t_1    Z )
#
#         PDG            Width
DECAY   1000005     2.20530527E+02   # sbottom1 decays
#          BR         NDA      ID1       ID2
     3.53743583E-03    2     1000022         5   # BR(~b_1 -> ~chi_10 b )
     3.32044575E-03    2     1000023         5   # BR(~b_1 -> ~chi_20 b )
     3.12389029E-03    2     1000025         5   # BR(~b_1 -> ~chi_30 b )
     3.42744332E-02    2     1000035         5   # BR(~b_1 -> ~chi_40 b )
     2.42640906E-01    2    -1000024         6   # BR(~b_1 -> ~chi_1- t )
     6.90322717E-02    2    -1000037         6   # BR(~b_1 -> ~chi_2- t )
     6.41724774E-01    2     1000021         5   # BR(~b_1 -> ~g      b )
     2.34584304E-03    2     1000006       -24   # BR(~b_1 -> ~t_1    W-)
#
#         PDG            Width
DECAY   2000005     1.51224996E+02   # sbottom2 decays
#          BR         NDA      ID1       ID2
     1.92806306E-02    2     1000022         5   # BR(~b_2 -> ~chi_10 b )
     4.60015385E-03    2     1000023         5   # BR(~b_2 -> ~chi_20 b )
     4.81785600E-03    2     1000025         5   # BR(~b_2 -> ~chi_30 b )
     6.35444228E-04    2     1000035         5   # BR(~b_2 -> ~chi_40 b )
     1.34548019E-02    2    -1000024         6   # BR(~b_2 -> ~chi_1- t )
     1.27917833E-03    2    -1000037         6   # BR(~b_2 -> ~chi_2- t )
     9.55741770E-01    2     1000021         5   # BR(~b_2 -> ~g      b )
     1.90165388E-04    2     1000006       -24   # BR(~b_2 -> ~t_1    W-)
#
#         PDG            Width
DECAY   1000002     1.70669345E+02   # sup_L decays
#          BR         NDA      ID1       ID2
     4.35754468E-03    2     1000022         2   # BR(~u_L -> ~chi_10 u)
     1.24439081E-04    2     1000023         2   # BR(~u_L -> ~chi_20 u)
     7.30397289E-06    2     1000025         2   # BR(~u_L -> ~chi_30 u)
     4.64189091E-02    2     1000035         2   # BR(~u_L -> ~chi_40 u)
     3.92948402E-04    2     1000024         1   # BR(~u_L -> ~chi_1+ d)
     9.27636544E-02    2     1000037         1   # BR(~u_L -> ~chi_2+ d)
     8.55935200E-01    2     1000021         2   # BR(~u_L -> ~g      u)
#
#         PDG            Width
DECAY   2000002     1.56359284E+02   # sup_R decays
#          BR         NDA      ID1       ID2
     7.57297517E-02    2     1000022         2   # BR(~u_R -> ~chi_10 u)
     2.08819766E-05    2     1000023         2   # BR(~u_R -> ~chi_20 u)
     2.73049751E-05    2     1000025         2   # BR(~u_R -> ~chi_30 u)
     6.69207012E-09    2     1000035         2   # BR(~u_R -> ~chi_40 u)
     9.24222055E-01    2     1000021         2   # BR(~u_R -> ~g      u)
#
#         PDG            Width
DECAY   1000001     1.70688145E+02   # sdown_L decays
#          BR         NDA      ID1       ID2
     4.34560981E-03    2     1000022         1   # BR(~d_L -> ~chi_10 d)
     8.03333922E-05    2     1000023         1   # BR(~d_L -> ~chi_20 d)
     2.71410261E-05    2     1000025         1   # BR(~d_L -> ~chi_30 d)
     4.64447779E-02    2     1000035         1   # BR(~d_L -> ~chi_40 d)
     7.45199343E-05    2    -1000024         2   # BR(~d_L -> ~chi_1- u)
     9.29406519E-02    2    -1000037         2   # BR(~d_L -> ~chi_2- u)
     8.56086966E-01    2     1000021         1   # BR(~d_L -> ~g      d)
#
#         PDG            Width
DECAY   2000001     1.47497366E+02   # sdown_R decays
#          BR         NDA      ID1       ID2
     2.00710362E-02    2     1000022         1   # BR(~d_R -> ~chi_10 d)
     5.53458245E-06    2     1000023         1   # BR(~d_R -> ~chi_20 d)
     7.23694173E-06    2     1000025         1   # BR(~d_R -> ~chi_30 d)
     1.77384955E-09    2     1000035         1   # BR(~d_R -> ~chi_40 d)
     9.79916190E-01    2     1000021         1   # BR(~d_R -> ~g      d)
#
#         PDG            Width
DECAY   1000004     1.70669345E+02   # scharm_L decays
#          BR         NDA      ID1       ID2
     4.35754468E-03    2     1000022         4   # BR(~c_L -> ~chi_10 c)
     1.24439081E-04    2     1000023         4   # BR(~c_L -> ~chi_20 c)
     7.30397289E-06    2     1000025         4   # BR(~c_L -> ~chi_30 c)
     4.64189091E-02    2     1000035         4   # BR(~c_L -> ~chi_40 c)
     3.92948402E-04    2     1000024         3   # BR(~c_L -> ~chi_1+ s)
     9.27636544E-02    2     1000037         3   # BR(~c_L -> ~chi_2+ s)
     8.55935200E-01    2     1000021         4   # BR(~c_L -> ~g      c)
#
#         PDG            Width
DECAY   2000004     1.56359284E+02   # scharm_R decays
#          BR         NDA      ID1       ID2
     7.57297517E-02    2     1000022         4   # BR(~c_R -> ~chi_10 c)
     2.08819766E-05    2     1000023         4   # BR(~c_R -> ~chi_20 c)
     2.73049751E-05    2     1000025         4   # BR(~c_R -> ~chi_30 c)
     6.69207012E-09    2     1000035         4   # BR(~c_R -> ~chi_40 c)
     9.24222055E-01    2     1000021         4   # BR(~c_R -> ~g      c)
#
#         PDG            Width
DECAY   1000003     1.70688145E+02   # sstrange_L decays
#          BR         NDA      ID1       ID2
     4.34560981E-03    2     1000022         3   # BR(~s_L -> ~chi_10 s)
     8.03333922E-05    2     1000023         3   # BR(~s_L -> ~chi_20 s)
     2.71410261E-05    2     1000025         3   # BR(~s_L -> ~chi_30 s)
     4.64447779E-02    2     1000035         3   # BR(~s_L -> ~chi_40 s)
     7.45199343E-05    2    -1000024         4   # BR(~s_L -> ~chi_1- c)
     9.29406519E-02    2    -1000037         4   # BR(~s_L -> ~chi_2- c)
     8.56086966E-01    2     1000021         3   # BR(~s_L -> ~g      s)
#
#         PDG            Width
DECAY   2000003     1.47497366E+02   # sstrange_R decays
#          BR         NDA      ID1       ID2
     2.00710362E-02    2     1000022         3   # BR(~s_R -> ~chi_10 s)
     5.53458245E-06    2     1000023         3   # BR(~s_R -> ~chi_20 s)
     7.23694173E-06    2     1000025         3   # BR(~s_R -> ~chi_30 s)
     1.77384955E-09    2     1000035         3   # BR(~s_R -> ~chi_40 s)
     9.79916190E-01    2     1000021         3   # BR(~s_R -> ~g      s)
#
#         PDG            Width
DECAY   1000011     3.02272165E+01   # selectron_L decays
#          BR         NDA      ID1       ID2
     2.26789728E-01    2     1000022        11   # BR(~e_L -> ~chi_10 e-)
     1.02007681E-03    2     1000023        11   # BR(~e_L -> ~chi_20 e-)
     2.18892951E-07    2     1000025        11   # BR(~e_L -> ~chi_30 e-)
     2.57036009E-01    2     1000035        11   # BR(~e_L -> ~chi_40 e-)
     4.26659625E-04    2    -1000024        12   # BR(~e_L -> ~chi_1- nu_e)
     5.14727307E-01    2    -1000037        12   # BR(~e_L -> ~chi_2- nu_e)
#
#         PDG            Width
DECAY   2000011     2.73538846E+01   # selectron_R decays
#          BR         NDA      ID1       ID2
     9.99370703E-01    2     1000022        11   # BR(~e_R -> ~chi_10 e-)
     2.72675397E-04    2     1000023        11   # BR(~e_R -> ~chi_20 e-)
     3.56536644E-04    2     1000025        11   # BR(~e_R -> ~chi_30 e-)
     8.46442694E-08    2     1000035        11   # BR(~e_R -> ~chi_40 e-)
#
#         PDG            Width
DECAY   1000013     3.02272165E+01   # smuon_L decays
#          BR         NDA      ID1       ID2
     2.26789728E-01    2     1000022        13   # BR(~mu_L -> ~chi_10 mu-)
     1.02007681E-03    2     1000023        13   # BR(~mu_L -> ~chi_20 mu-)
     2.18892951E-07    2     1000025        13   # BR(~mu_L -> ~chi_30 mu-)
     2.57036009E-01    2     1000035        13   # BR(~mu_L -> ~chi_40 mu-)
     4.26659625E-04    2    -1000024        14   # BR(~mu_L -> ~chi_1- nu_mu)
     5.14727307E-01    2    -1000037        14   # BR(~mu_L -> ~chi_2- nu_mu)
#
#         PDG            Width
DECAY   2000013     2.73538846E+01   # smuon_R decays
#          BR         NDA      ID1       ID2
     9.99370703E-01    2     1000022        13   # BR(~mu_R -> ~chi_10 mu-)
     2.72675397E-04    2     1000023        13   # BR(~mu_R -> ~chi_20 mu-)
     3.56536644E-04    2     1000025        13   # BR(~mu_R -> ~chi_30 mu-)
     8.46442694E-08    2     1000035        13   # BR(~mu_R -> ~chi_40 mu-)
#
#         PDG            Width
DECAY   1000015     2.89335746E+01   # stau_1 decays
#          BR         NDA      ID1       ID2
     9.22776030E-01    2     1000022        15   # BR(~tau_1 -> ~chi_10  tau-)
     1.38734001E-02    2     1000023        15   # BR(~tau_1 -> ~chi_20  tau-)
     1.24844517E-02    2     1000025        15   # BR(~tau_1 -> ~chi_30  tau-)
     8.20170756E-03    2     1000035        15   # BR(~tau_1 -> ~chi_40  tau-)
     2.62398078E-02    2    -1000024        16   # BR(~tau_1 -> ~chi_1-  nu_tau)
     1.64246025E-02    2    -1000037        16   # BR(~tau_1 -> ~chi_2-  nu_tau)
#
#         PDG            Width
DECAY   2000015     3.08821832E+01   # stau_2 decays
#          BR         NDA      ID1       ID2
     2.42446748E-01    2     1000022        15   # BR(~tau_2 -> ~chi_10  tau-)
     1.25188570E-02    2     1000023        15   # BR(~tau_2 -> ~chi_20  tau-)
     1.28672681E-02    2     1000025        15   # BR(~tau_2 -> ~chi_30  tau-)
     2.43829320E-01    2     1000035        15   # BR(~tau_2 -> ~chi_40  tau-)
     6.02411129E-05    2    -1000024        16   # BR(~tau_2 -> ~chi_1-  nu_tau)
     4.88277566E-01    2    -1000037        16   # BR(~tau_2 -> ~chi_2-  nu_tau)
#
#         PDG            Width
DECAY   1000012     3.02290731E+01   # snu_eL decays
#          BR         NDA      ID1       ID2
     2.26526960E-01    2     1000022        12   # BR(~nu_eL -> ~chi_10 nu_e)
     2.62360024E-04    2     1000023        12   # BR(~nu_eL -> ~chi_20 nu_e)
     3.40821584E-04    2     1000025        12   # BR(~nu_eL -> ~chi_30 nu_e)
     2.57136879E-01    2     1000035        12   # BR(~nu_eL -> ~chi_40 nu_e)
     2.24910106E-03    2     1000024        11   # BR(~nu_eL -> ~chi_1+ e-)
     5.13483878E-01    2     1000037        11   # BR(~nu_eL -> ~chi_2+ e-)
#
#         PDG            Width
DECAY   1000014     3.02290731E+01   # snu_muL decays
#          BR         NDA      ID1       ID2
     2.26526960E-01    2     1000022        14   # BR(~nu_muL -> ~chi_10 nu_mu)
     2.62360024E-04    2     1000023        14   # BR(~nu_muL -> ~chi_20 nu_mu)
     3.40821584E-04    2     1000025        14   # BR(~nu_muL -> ~chi_30 nu_mu)
     2.57136879E-01    2     1000035        14   # BR(~nu_muL -> ~chi_40 nu_mu)
     2.24910106E-03    2     1000024        13   # BR(~nu_muL -> ~chi_1+ mu-)
     5.13483878E-01    2     1000037        13   # BR(~nu_muL -> ~chi_2+ mu-)
#
#         PDG            Width
DECAY   1000016     3.09711267E+01   # snu_tauL decays
#          BR         NDA      ID1       ID2
     2.21075804E-01    2     1000022        16   # BR(~nu_tauL -> ~chi_10 nu_tau)
     2.56034200E-04    2     1000023        16   # BR(~nu_tauL -> ~chi_20 nu_tau)
     3.32603898E-04    2     1000025        16   # BR(~nu_tauL -> ~chi_30 nu_tau)
     2.50884585E-01    2     1000035        16   # BR(~nu_tauL -> ~chi_40 nu_tau)
     2.64502541E-02    2     1000024        15   # BR(~nu_tauL -> ~chi_1+ tau-)
     5.01000718E-01    2     1000037        15   # BR(~nu_tauL -> ~chi_2+ tau-)
#
#         PDG            Width
DECAY   1000024     9.85112654E-01   # chargino1+ decays
#          BR         NDA      ID1       ID2
     1.00000000E+00    2     1000022        24   # BR(~chi_1+ -> ~chi_10  W+)
#
#         PDG            Width
DECAY   1000037     1.78996536E+01   # chargino2+ decays
#          BR         NDA      ID1       ID2
     2.52581706E-01    2     1000024        23   # BR(~chi_2+ -> ~chi_1+  Z )
     2.84962809E-04    2     1000022        24   # BR(~chi_2+ -> ~chi_10  W+)
     2.44107443E-01    2     1000023        24   # BR(~chi_2+ -> ~chi_20  W+)
     2.43544316E-01    2     1000025        24   # BR(~chi_2+ -> ~chi_30  W+)
     2.59481295E-01    2     1000024        25   # BR(~chi_2+ -> ~chi_1+  h )
     2.76764068E-07    2     1000022        37   # BR(~chi_2+ -> ~chi_10  H+)
#
#         PDG            Width
DECAY   1000022     0.00000000E+00   # neutralino1 decays
#
#         PDG            Width
DECAY   1000023     1.03594816E+00   # neutralino2 decays
#          BR         NDA      ID1       ID2
     5.58673996E-01    2     1000022        23   # BR(~chi_20 -> ~chi_10   Z )
     4.41326004E-01    2     1000022        25   # BR(~chi_20 -> ~chi_10   h )
#
#         PDG            Width
DECAY   1000025     1.04676429E+00   # neutralino3 decays
#          BR         NDA      ID1       ID2
     4.23582993E-01    2     1000022        23   # BR(~chi_30 -> ~chi_10   Z )
     5.76417007E-01    2     1000022        25   # BR(~chi_30 -> ~chi_10   h )
#
#         PDG            Width
DECAY   1000035     1.78940420E+01   # neutralino4 decays
#          BR         NDA      ID1       ID2
     1.07974125E-04    2     1000022        23   # BR(~chi_40 -> ~chi_10   Z )
     3.40855663E-02    2     1000023        23   # BR(~chi_40 -> ~chi_20   Z )
     2.18083104E-01    2     1000025        23   # BR(~chi_40 -> ~chi_30   Z )
     2.44199941E-01    2     1000024       -24   # BR(~chi_40 -> ~chi_1+   W-)
     2.44199941E-01    2    -1000024        24   # BR(~chi_40 -> ~chi_1-   W+)
     1.84786707E-04    2     1000022        25   # BR(~chi_40 -> ~chi_10   h )
     2.47132824E-07    2     1000022        35   # BR(~chi_40 -> ~chi_10   H )
     3.99042772E-08    2     1000022        36   # BR(~chi_40 -> ~chi_10   A )
     2.25134459E-01    2     1000023        25   # BR(~chi_40 -> ~chi_20   h )
     3.40039404E-02    2     1000025        25   # BR(~chi_40 -> ~chi_30   h )
#
#         PDG            Width
DECAY        25     4.03339112E-03   # h decays
#          BR         NDA      ID1       ID2
     6.04564503E-01    2           5        -5   # BR(h -> b       bb     )
     6.43250266E-02    2         -15        15   # BR(h -> tau+    tau-   )
     2.27733776E-04    2         -13        13   # BR(h -> mu+     mu-    )
     4.82747510E-04    2           3        -3   # BR(h -> s       sb     )
     2.09200416E-02    2           4        -4   # BR(h -> c       cb     )
     6.77253801E-02    2          21        21   # BR(h -> g       g      )
     2.32982446E-03    2          22        22   # BR(h -> gam     gam    )
     1.50618703E-03    2          22        23   # BR(h -> Z       gam    )
     2.12535020E-01    2          24       -24   # BR(h -> W+      W-     )
     2.53532284E-02    2          23        23   # BR(h -> Z       Z      )
     3.03074103E-05    2     1000022   1000022   # BR(h -> ~chi_10 ~chi_10)
#
#         PDG            Width
DECAY        35     7.09811305E+00   # H decays
#          BR         NDA      ID1       ID2
     4.62611326E-01    2           5        -5   # BR(H -> b       bb     )
     7.84854979E-02    2         -15        15   # BR(H -> tau+    tau-   )
     2.77530955E-04    2         -13        13   # BR(H -> mu+     mu-    )
     3.40210400E-04    2           3        -3   # BR(H -> s       sb     )
     1.90296349E-06    2           4        -4   # BR(H -> c       cb     )
     1.90121126E-01    2           6        -6   # BR(H -> t       tb     )
     6.31128403E-05    2          21        21   # BR(H -> g       g      )
     3.82014387E-07    2          22        22   # BR(H -> gam     gam    )
     1.12305830E-07    2          23        22   # BR(H -> Z       gam    )
     8.47311083E-05    2          24       -24   # BR(H -> W+      W-     )
     4.23119384E-05    2          23        23   # BR(H -> Z       Z      )
     3.19701902E-04    2          25        25   # BR(H -> h       h      )
    -3.12898496E-23    2          36        36   # BR(H -> A       A      )
     5.48518636E-19    2          23        36   # BR(H -> Z       A      )
     7.95028280E-04    2     1000022   1000022   # BR(H -> ~chi_10 ~chi_10)
     1.58170533E-01    2     1000022   1000023   # BR(H -> ~chi_10 ~chi_20)
     1.08686493E-01    2     1000022   1000025   # BR(H -> ~chi_10 ~chi_30)
#
#         PDG            Width
DECAY        36     7.10086035E+00   # A decays
#          BR         NDA      ID1       ID2
     4.62586026E-01    2           5        -5   # BR(A -> b       bb     )
     7.84574068E-02    2         -15        15   # BR(A -> tau+    tau-   )
     2.77431235E-04    2         -13        13   # BR(A -> mu+     mu-    )
     3.40336713E-04    2           3        -3   # BR(A -> s       sb     )
     1.91017423E-06    2           4        -4   # BR(A -> c       cb     )
     1.90736239E-01    2           6        -6   # BR(A -> t       tb     )
     1.88749313E-04    2          21        21   # BR(A -> g       g      )
     3.22911658E-07    2          22        22   # BR(A -> gam     gam    )
     2.28692315E-07    2          23        22   # BR(A -> Z       gam    )
     8.43778055E-05    2          23        25   # BR(A -> Z       h      )
     8.18958059E-04    2     1000022   1000022   # BR(A -> ~chi_10 ~chi_10)
     1.09931504E-01    2     1000022   1000023   # BR(A -> ~chi_10 ~chi_20)
     1.56576509E-01    2     1000022   1000025   # BR(A -> ~chi_10 ~chi_30)
#
#         PDG            Width
DECAY        37     7.12714152E+00   # H+ decays
#          BR         NDA      ID1       ID2
     7.47316347E-04    2           4        -5   # BR(H+ -> c       bb     )
     7.81908528E-02    2         -15        16   # BR(H+ -> tau+    nu_tau )
     2.76488679E-04    2         -13        14   # BR(H+ -> mu+     nu_mu  )
     4.78280041E-06    2           2        -5   # BR(H+ -> u       bb     )
     1.62237797E-05    2           2        -3   # BR(H+ -> u       sb     )
     3.35508850E-04    2           4        -3   # BR(H+ -> c       sb     )
     6.53115250E-01    2           6        -5   # BR(H+ -> t       bb     )
     8.41940830E-05    2          24        25   # BR(H+ -> W+      h      )
     9.36892583E-14    2          24        36   # BR(H+ -> W+      A      )
     2.67229383E-01    2     1000024   1000022   # BR(H+ -> ~chi_1+ ~chi_10)
