#
#                              ======================
#                              | THE SUSYHIT OUTPUT |
#                              ======================
#
#
#              ------------------------------------------------------
#              |     This is the output of the SUSY-HIT package     |
#              |  created by A.Djouadi, M.Muehlleitner and M.Spira. |
#              |  In case of problems with SUSY-HIT email to        |
#              |           margarete.muehlleitner@cern.ch           |
#              |           michael.spira@psi.ch                     |
#              |           abdelhak.djouadi@cern.ch                 |
#              ------------------------------------------------------
#
#              ------------------------------------------------------
#              |  SUSY Les Houches Accord - MSSM Spectrum + Decays  |
#              |              based on the decay programs           |
#              |                                                    |
#              |                     SDECAY 1.3b                    |
#              |                                                    |
#              |  Authors: M.Muhlleitner, A.Djouadi and Y.Mambrini  |
#              |  Ref.:    Comput.Phys.Commun.168(2005)46           |
#              |           [hep-ph/0311167]                         |
#              |                                                    |
#              |                     HDECAY 3.4                     |
#              |                                                    |
#              |  By: A.Djouadi,J.Kalinowski,M.Muhlleitner,M.Spira  |
#              |  Ref.:    Comput.Phys.Commun.108(1998)56           |
#              |           [hep-ph/9704448]                         |
#              |                                                    |
#              |                                                    |
#              |  If not stated otherwise all DRbar couplings and   |
#              |  soft SUSY breaking masses are given at the scale  |
#              |  Q=  0.91187600E+02
#              |                                                    |
#              ------------------------------------------------------
#
#
BLOCK DCINFO  # Decay Program information
     1   SDECAY/HDECAY # decay calculator
     2   1.3b  /3.4    # version number
#
BLOCK SPINFO  # Spectrum calculator information
     1   SuSpect     # RGE +Spectrum calculator            
     2   2.41         # version number                     
#
BLOCK MODSEL  # Model selection
     1     0   # #general MSSM low scale                           
#
BLOCK SMINPUTS  # Standard Model inputs
         1     1.27934000E+02   # alpha_em^-1(M_Z)^MSbar
         2     1.16639000E-05   # G_F [GeV^-2]
         3     1.17200000E-01   # alpha_S(M_Z)^MSbar
         4     9.11870000E+01   # M_Z pole mass
         5     4.25000000E+00   # mb(mb)^MSbar
         6     1.72500000E+02   # mt pole mass
         7     1.77700000E+00   # mtau pole mass
#
BLOCK MINPAR  # Input parameters - minimal models
#
BLOCK EXTPAR  # Input parameters - non-minimal models
         0     9.11876000E+01   # EWSB                
         1     5.00000000E+03   # M_1                 
         2     1.50342000E+03   # M_2                 
         3     1.59455000E+03   # M_3                 
        11     0.00000000E+00   # A_t                 
        12     0.00000000E+00   # A_b                 
        13     0.00000000E+00   # A_tau               
        14     0.00000000E+00   # A_u                 
        15     0.00000000E+00   # A_d                 
        16     0.00000000E+00   # A_e                 
        23     5.00000000E+03   # mu(EWSB)            
        25     1.50000000E+00   # tanbeta(in)         
        26     2.00000000E+03   # MA_pole             
        31     5.00000000E+03   # M_eL                
        32     5.00000000E+03   # M_muL               
        33     5.00000000E+03   # M_tauL              
        34     5.00000000E+03   # M_eR                
        35     5.00000000E+03   # M_muR               
        36     5.00000000E+03   # M_tauR              
        41     5.00000000E+03   # M_q1L               
        42     5.00000000E+03   # M_q2L               
        43     5.00000000E+03   # M_q3L               
        44     5.00000000E+03   # M_uR                
        45     5.00000000E+03   # M_cR                
        46     5.00000000E+03   # M_tR                
        47     5.00000000E+03   # M_dR                
        48     5.00000000E+03   # M_sR                
        49     5.00000000E+03   # M_bR                
#
BLOCK MASS  # Mass Spectrum
# PDG code           mass       particle
        24     8.05358286E+01   # W+
        25     1.25000000E+02   # h
        35     2.00392302E+03   # H
        36     2.00000000E+03   # A
        37     1.99405670E+03   # H+
         5     4.87877839E+00   # b-quark pole mass calculated from mb(mb)_Msbar
   1000001     4.98090731E+03   # ~d_L
   2000001     4.98079731E+03   # ~d_R
   1000002     4.98066140E+03   # ~u_L
   2000002     4.98071960E+03   # ~u_R
   1000003     4.98090731E+03   # ~s_L
   2000003     4.98079731E+03   # ~s_R
   1000004     4.98066140E+03   # ~c_L
   2000004     4.98071960E+03   # ~c_R
   1000005     4.97880264E+03   # ~b_1
   2000005     4.98290261E+03   # ~b_2
   1000006     4.99557605E+03   # ~t_1
   2000006     5.17368273E+03   # ~t_2
   1000011     5.00008252E+03   # ~e_L
   2000011     5.00007624E+03   # ~e_R
   1000012     4.99984123E+03   # ~nu_eL
   1000013     5.00008252E+03   # ~mu_L
   2000013     5.00007624E+03   # ~mu_R
   1000014     4.99984123E+03   # ~nu_muL
   1000015     4.99874556E+03   # ~tau_1
   2000015     5.00141348E+03   # ~tau_2
   1000016     4.99984123E+03   # ~nu_tauL
   1000021     1.69999825E+03   # ~g
   1000022     1.59999768E+03   # ~chi_10
   1000023     5.20041732E+03   # ~chi_20
   1000025    -5.21877396E+03   # ~chi_30
   1000035     5.31564013E+03   # ~chi_40
   1000024     1.59999792E+03   # ~chi_1+
   1000037     5.22043159E+03   # ~chi_2+
 1000039     1.E-09   # ~gravitino              
#
BLOCK NMIX  # Neutralino Mixing Matrix
  1  1     2.47836710E-04   # N_11
  1  2    -9.99767357E-01   # N_12
  1  3     1.67752560E-02   # N_13
  1  4    -1.35558798E-02   # N_14
  2  1     4.16405886E-01   # N_21
  2  2     1.96034324E-02   # N_22
  2  3     6.42962967E-01   # N_23
  2  4    -6.42511064E-01   # N_24
  3  1     8.30021394E-04   # N_31
  3  2    -2.27632242E-03   # N_32
  3  3    -7.07090282E-01   # N_33
  3  4    -7.07119129E-01   # N_34
  4  1     9.09178414E-01   # N_41
  4  2    -8.70381001E-03   # N_42
  4  3    -2.93837620E-01   # N_43
  4  4     2.94920851E-01   # N_44
#
BLOCK UMIX  # Chargino Mixing Matrix U
  1  1    -9.99718648E-01   # U_11
  1  2     2.37197278E-02   # U_12
  2  1     2.37197278E-02   # U_21
  2  2     9.99718648E-01   # U_22
#
BLOCK VMIX  # Chargino Mixing Matrix V
  1  1    -9.99816266E-01   # V_11
  1  2     1.91685877E-02   # V_12
  2  1     1.91685877E-02   # V_21
  2  2     9.99816266E-01   # V_22
#
BLOCK STOPMIX  # Stop Mixing Matrix
  1  1     9.77537798E-01   # cos(theta_t)
  1  2     2.10760180E-01   # sin(theta_t)
  2  1    -2.10760180E-01   # -sin(theta_t)
  2  2     9.77537798E-01   # cos(theta_t)
#
BLOCK SBOTMIX  # Sbottom Mixing Matrix
  1  1     6.97556224E-01   # cos(theta_b)
  1  2     7.16530051E-01   # sin(theta_b)
  2  1    -7.16530051E-01   # -sin(theta_b)
  2  2     6.97556224E-01   # cos(theta_b)
#
BLOCK STAUMIX  # Stau Mixing Matrix
  1  1     7.06274074E-01   # cos(theta_tau)
  1  2     7.07938509E-01   # sin(theta_tau)
  2  1    -7.07938509E-01   # -sin(theta_tau)
  2  2     7.06274074E-01   # cos(theta_tau)
#
BLOCK ALPHA  # Higgs mixing
          -5.90730739E-01   # Mixing angle in the neutral Higgs boson sector
#
BLOCK HMIX Q=  9.11876000E+01  # DRbar Higgs Parameters
         1     5.00000000E+03   # mu(Q)               
         2     1.49999981E+00   # tanbeta(Q)          
         3     2.52428694E+02   # vev(Q)              
         4     2.62292648E+06   # MA^2(Q)             
#
BLOCK GAUGE Q=  9.11876000E+01  # The gauge couplings
     1     3.52541289E-01   # gprime(Q) DRbar
     2     6.27160612E-01   # g(Q) DRbar
     3     1.08410907E+00   # g3(Q) DRbar
#
BLOCK AU Q=  9.11876000E+01  # The trilinear couplings
  1  1     0.00000000E+00   # A_u(Q) DRbar
  2  2     0.00000000E+00   # A_c(Q) DRbar
  3  3     0.00000000E+00   # A_t(Q) DRbar
#
BLOCK AD Q=  9.11876000E+01  # The trilinear couplings
  1  1     0.00000000E+00   # A_d(Q) DRbar
  2  2     0.00000000E+00   # A_s(Q) DRbar
  3  3     0.00000000E+00   # A_b(Q) DRbar
#
BLOCK AE Q=  9.11876000E+01  # The trilinear couplings
  1  1     0.00000000E+00   # A_e(Q) DRbar
  2  2     0.00000000E+00   # A_mu(Q) DRbar
  3  3     0.00000000E+00   # A_tau(Q) DRbar
#
BLOCK Yu Q=  9.11876000E+01  # The Yukawa couplings
  1  1     0.00000000E+00   # y_u(Q) DRbar
  2  2     0.00000000E+00   # y_c(Q) DRbar
  3  3     1.01908799E+00   # y_t(Q) DRbar
#
BLOCK Yd Q=  9.11876000E+01  # The Yukawa couplings
  1  1     0.00000000E+00   # y_d(Q) DRbar
  2  2     0.00000000E+00   # y_s(Q) DRbar
  3  3     2.70609526E-02   # y_b(Q) DRbar
#
BLOCK Ye Q=  9.11876000E+01  # The Yukawa couplings
  1  1     0.00000000E+00   # y_e(Q) DRbar
  2  2     0.00000000E+00   # y_mu(Q) DRbar
  3  3     1.79529625E-02   # y_tau(Q) DRbar
#
BLOCK MSOFT Q=  9.11876000E+01  # The soft SUSY breaking masses at the scale Q
         1     5.00000000E+03   # M_1                 
         2     1.50342000E+03   # M_2                 
         3     1.59455000E+03   # M_3                 
        14     0.00000000E+00   # A_u                 
        15     0.00000000E+00   # A_d                 
        16     0.00000000E+00   # A_e                 
        21    -2.43090130E+07   # M^2_Hd              
        22    -2.87934480E+07   # M^2_Hu              
        31     5.00000000E+03   # M_eL                
        32     5.00000000E+03   # M_muL               
        33     5.00000000E+03   # M_tauL              
        34     5.00000000E+03   # M_eR                
        35     5.00000000E+03   # M_muR               
        36     5.00000000E+03   # M_tauR              
        41     5.00000000E+03   # M_q1L               
        42     5.00000000E+03   # M_q2L               
        43     5.00000000E+03   # M_q3L               
        44     5.00000000E+03   # M_uR                
        45     5.00000000E+03   # M_cR                
        46     5.00000000E+03   # M_tR                
        47     5.00000000E+03   # M_dR                
        48     5.00000000E+03   # M_sR                
        49     5.00000000E+03   # M_bR                
#
#
#
#                             =================
#                             |The decay table|
#                             =================
#
# - The QCD corrections to the decays gluino -> squark  + quark
#                                     squark -> gaugino + quark_prime
#                                     squark -> squark_prime + Higgs
#                                     squark -> gluino  + quark
#   are included.
#
# - The multi-body decays for the inos, stops and sbottoms are included.
#
# - The loop induced decays for the gluino, neutralinos and stops
#   are included.
#
# - The SUSY decays of the top quark are included.
#
# - Possible decays of the NLSP in GMSB models are included.
#
#
#         PDG            Width
DECAY         6     1.35956198E+00   # top decays
#          BR         NDA      ID1       ID2
     1.00000000E+00    2           5        24   # BR(t ->  b    W+)
#
#         PDG            Width
DECAY   1000021     1.13350214E-08   # gluino decays
#          BR         NDA      ID1       ID2
     1.41640239E-03    2     1000022        21   # BR(~g -> ~chi_10 g)
#          BR         NDA      ID1       ID2
 0    2     1000039        21   # BR(~g -> ~G      g) 
#           BR         NDA      ID1       ID2       ID3
     7.69683763E-02    3     1000022         1        -1   # BR(~g -> ~chi_10 d  db)
     7.69711527E-02    3     1000022         2        -2   # BR(~g -> ~chi_10 u  ub)
     7.69683763E-02    3     1000022         3        -3   # BR(~g -> ~chi_10 s  sb)
     7.69711527E-02    3     1000022         4        -4   # BR(~g -> ~chi_10 c  cb)
     7.48294777E-02    3     1000022         5        -5   # BR(~g -> ~chi_10 b  bb)
     1.53937751E-01    3     1000024         1        -2   # BR(~g -> ~chi_1+ d  ub)
     1.53937751E-01    3    -1000024         2        -1   # BR(~g -> ~chi_1- u  db)
     1.53937751E-01    3     1000024         3        -4   # BR(~g -> ~chi_1+ s  cb)
     1.53937751E-01    3    -1000024         4        -3   # BR(~g -> ~chi_1- c  sb)
#
#         PDG            Width
DECAY   1000006     2.50128650E+02   # stop1 decays
#          BR         NDA      ID1       ID2
     6.00097313E-02    2     1000022         6   # BR(~t_1 -> ~chi_10 t )
     1.20322587E-01    2     1000024         5   # BR(~t_1 -> ~chi_1+ b )
     8.19667682E-01    2     1000021         6   # BR(~t_1 -> ~g      t )
#
#         PDG            Width
DECAY   2000006     2.14832014E+02   # stop2 decays
#          BR         NDA      ID1       ID2
     7.96699248E-04    2     1000022         6   # BR(~t_2 -> ~chi_10 t )
     1.59315435E-03    2     1000024         5   # BR(~t_2 -> ~chi_1+ b )
     9.88463108E-01    2     1000021         6   # BR(~t_2 -> ~g      t )
     1.69658635E-03    2     1000006        25   # BR(~t_2 -> ~t_1    h )
     1.81949595E-03    2     1000006        23   # BR(~t_2 -> ~t_1    Z )
     2.84701712E-03    2     1000005        24   # BR(~t_2 -> ~b_1    W+)
     2.78393912E-03    2     2000005        24   # BR(~t_2 -> ~b_2    W+)
#
#         PDG            Width
DECAY   1000005     2.25563512E+02   # sbottom1 decays
#          BR         NDA      ID1       ID2
     3.24572581E-02    2     1000022         5   # BR(~b_1 -> ~chi_10 b )
     6.47515933E-02    2    -1000024         6   # BR(~b_1 -> ~chi_1- t )
     9.02791149E-01    2     1000021         5   # BR(~b_1 -> ~g      b )
#
#         PDG            Width
DECAY   2000005     2.27106286E+02   # sbottom2 decays
#          BR         NDA      ID1       ID2
     3.44081703E-02    2     1000022         5   # BR(~b_2 -> ~chi_10 b )
     6.86429606E-02    2    -1000024         6   # BR(~b_2 -> ~chi_1- t )
     8.96948869E-01    2     1000021         5   # BR(~b_2 -> ~g      b )
#
#         PDG            Width
DECAY   1000002     2.50146355E+02   # sup_L decays
#          BR         NDA      ID1       ID2
     6.19393802E-02    2     1000022         2   # BR(~u_L -> ~chi_10 u)
     1.23902383E-01    2     1000024         1   # BR(~u_L -> ~chi_1+ d)
     8.14158237E-01    2     1000021         2   # BR(~u_L -> ~g      u)
#
#         PDG            Width
DECAY   2000002     2.03662351E+02   # sup_R decays
#          BR         NDA      ID1       ID2
     2.62646207E-09    2     1000022         2   # BR(~u_R -> ~chi_10 u)
     9.99999997E-01    2     1000021         2   # BR(~u_R -> ~g      u)
#
#         PDG            Width
DECAY   1000001     2.50161816E+02   # sdown_L decays
#          BR         NDA      ID1       ID2
     6.19514253E-02    2     1000022         1   # BR(~d_L -> ~chi_10 d)
     1.23879261E-01    2    -1000024         2   # BR(~d_L -> ~chi_1- u)
     8.14169313E-01    2     1000021         1   # BR(~d_L -> ~g      d)
#
#         PDG            Width
DECAY   2000001     2.03667204E+02   # sdown_R decays
#          BR         NDA      ID1       ID2
     6.56614492E-10    2     1000022         1   # BR(~d_R -> ~chi_10 d)
     9.99999999E-01    2     1000021         1   # BR(~d_R -> ~g      d)
#
#         PDG            Width
DECAY   1000004     2.50146355E+02   # scharm_L decays
#          BR         NDA      ID1       ID2
     6.19393802E-02    2     1000022         4   # BR(~c_L -> ~chi_10 c)
     1.23902383E-01    2     1000024         3   # BR(~c_L -> ~chi_1+ s)
     8.14158237E-01    2     1000021         4   # BR(~c_L -> ~g      c)
#
#         PDG            Width
DECAY   2000004     2.03662351E+02   # scharm_R decays
#          BR         NDA      ID1       ID2
     2.62646207E-09    2     1000022         4   # BR(~c_R -> ~chi_10 c)
     9.99999997E-01    2     1000021         4   # BR(~c_R -> ~g      c)
#
#         PDG            Width
DECAY   1000003     2.50161816E+02   # sstrange_L decays
#          BR         NDA      ID1       ID2
     6.19514253E-02    2     1000022         3   # BR(~s_L -> ~chi_10 s)
     1.23879261E-01    2    -1000024         4   # BR(~s_L -> ~chi_1- c)
     8.14169313E-01    2     1000021         3   # BR(~s_L -> ~g      s)
#
#         PDG            Width
DECAY   2000003     2.03667204E+02   # sstrange_R decays
#          BR         NDA      ID1       ID2
     6.56614492E-10    2     1000022         3   # BR(~s_R -> ~chi_10 s)
     9.99999999E-01    2     1000021         3   # BR(~s_R -> ~g      s)
#
#         PDG            Width
DECAY   1000011     4.72557542E+01   # selectron_L decays
#          BR         NDA      ID1       ID2
     3.33293067E-01    2     1000022        11   # BR(~e_L -> ~chi_10 e-)
     6.66706933E-01    2    -1000024        12   # BR(~e_L -> ~chi_1- nu_e)
#
#         PDG            Width
DECAY   2000011     1.22364942E-06   # selectron_R decays
#          BR         NDA      ID1       ID2
     1.00000000E+00    2     1000022        11   # BR(~e_R -> ~chi_10 e-)
#
#         PDG            Width
DECAY   1000013     4.72557542E+01   # smuon_L decays
#          BR         NDA      ID1       ID2
     3.33293067E-01    2     1000022        13   # BR(~mu_L -> ~chi_10 mu-)
     6.66706933E-01    2    -1000024        14   # BR(~mu_L -> ~chi_1- nu_mu)
#
#         PDG            Width
DECAY   2000013     1.22364942E-06   # smuon_R decays
#          BR         NDA      ID1       ID2
     1.00000000E+00    2     1000022        13   # BR(~mu_R -> ~chi_10 mu-)
#
#         PDG            Width
DECAY   1000015     2.35951785E+01   # stau_1 decays
#          BR         NDA      ID1       ID2
     3.33293173E-01    2     1000022        15   # BR(~tau_1 -> ~chi_10  tau-)
     6.66706827E-01    2    -1000024        16   # BR(~tau_1 -> ~chi_1-  nu_tau)
     1.31004709E-11    2     1000039        15   # BR(~tau_1 -> ~G       tau-)
#
#         PDG            Width
DECAY   2000015     2.36605720E+01   # stau_2 decays
#          BR         NDA      ID1       ID2
     3.33292909E-01    2     1000022        15   # BR(~tau_2 -> ~chi_10  tau-)
     6.66707091E-01    2    -1000024        16   # BR(~tau_2 -> ~chi_1-  nu_tau)
#
#         PDG            Width
DECAY   1000012     4.72673665E+01   # snu_eL decays
#          BR         NDA      ID1       ID2
     3.33373536E-01    2     1000022        12   # BR(~nu_eL -> ~chi_10 nu_e)
     6.66626464E-01    2     1000024        11   # BR(~nu_eL -> ~chi_1+ e-)
#
#         PDG            Width
DECAY   1000014     4.72673665E+01   # snu_muL decays
#          BR         NDA      ID1       ID2
     3.33373536E-01    2     1000022        14   # BR(~nu_muL -> ~chi_10 nu_mu)
     6.66626464E-01    2     1000024        13   # BR(~nu_muL -> ~chi_1+ mu-)
#
#         PDG            Width
DECAY   1000016     4.72673603E+01   # snu_tauL decays
#          BR         NDA      ID1       ID2
     3.33373579E-01    2     1000022        16   # BR(~nu_tauL -> ~chi_10 nu_tau)
     6.66626421E-01    2     1000024        15   # BR(~nu_tauL -> ~chi_1+ tau-)
#
#         PDG            Width
DECAY   1000024     2.06673957E-8   # chargino1+ decays               
#          BR         NDA      ID1       ID2
     1.00000000E+00    2     1000039        24   # BR(~chi_1+ -> ~G       W+)
#           BR         NDA      ID1       ID2       ID3
     1.15076936E-18    3     1000022         2        -1   # BR(~chi_1+ -> ~chi_10 u    db)
     1.15076936E-18    3     1000022         4        -3   # BR(~chi_1+ -> ~chi_10 c    sb)
     3.83588832E-19    3     1000022       -11        12   # BR(~chi_1+ -> ~chi_10 e+   nu_e)
     3.83588832E-19    3     1000022       -13        14   # BR(~chi_1+ -> ~chi_10 mu+  nu_mu)
#
#         PDG            Width
DECAY   1000037     5.50579870E+01   # chargino2+ decays
#          BR         NDA      ID1       ID2
     6.19591257E-06    2     1000002        -1   # BR(~chi_2+ -> ~u_L     db)
     9.47305873E-06    2    -1000001         2   # BR(~chi_2+ -> ~d_L*    u )
     6.19591257E-06    2     1000004        -3   # BR(~chi_2+ -> ~c_L     sb)
     9.47305873E-06    2    -1000003         4   # BR(~chi_2+ -> ~s_L*    c )
     4.30369309E-04    2     1000006        -5   # BR(~chi_2+ -> ~t_1     bb)
     1.12861374E-03    2     2000006        -5   # BR(~chi_2+ -> ~t_2     bb)
     1.09786070E-02    2    -1000005         6   # BR(~chi_2+ -> ~b_1*    t )
     1.03931725E-02    2    -2000005         6   # BR(~chi_2+ -> ~b_2*    t )
     9.32816914E-07    2     1000012       -11   # BR(~chi_2+ -> ~nu_eL   e+  )
     9.32816914E-07    2     1000014       -13   # BR(~chi_2+ -> ~nu_muL  mu+ )
     2.98895550E-06    2     1000016       -15   # BR(~chi_2+ -> ~nu_tau1 tau+)
     1.42529733E-06    2    -1000011        12   # BR(~chi_2+ -> ~e_L+    nu_e)
     1.42529733E-06    2    -1000013        14   # BR(~chi_2+ -> ~mu_L+   nu_mu)
     3.15274525E-08    2    -1000015        16   # BR(~chi_2+ -> ~tau_1+  nu_tau)
     3.42795977E-06    2    -2000015        16   # BR(~chi_2+ -> ~tau_2+  nu_tau)
     2.76419724E-01    2     1000024        23   # BR(~chi_2+ -> ~chi_1+  Z )
     2.69250535E-01    2     1000022        24   # BR(~chi_2+ -> ~chi_10  W+)
     2.78342675E-01    2     1000024        25   # BR(~chi_2+ -> ~chi_1+  h )
     5.07571039E-02    2     1000024        35   # BR(~chi_2+ -> ~chi_1+  H )
     5.09946336E-02    2     1000024        36   # BR(~chi_2+ -> ~chi_1+  A )
     5.12620632E-02    2     1000022        37   # BR(~chi_2+ -> ~chi_10  H+)
     3.48582436E-12    2     1000039        24   # BR(~chi_2+ -> ~G       W+)
     1.85480644E-12    2     1000039        37   # BR(~chi_2+ -> ~G       H+)
#
#         PDG            Width
DECAY   1000022     2.06657872E-8   # neutralino1 decays              
#          BR         NDA      ID1       ID2
     2.42228861E-01    2     1000039        22   # BR(~chi_10 -> ~G        gam)
     7.57769331E-01    2     1000039        23   # BR(~chi_10 -> ~G        Z)
     1.80810254E-06    2     1000039        25   # BR(~chi_10 -> ~G        h)
#
#         PDG            Width
DECAY   1000023     4.55941819E+01   # neutralino2 decays
#          BR         NDA      ID1       ID2
     3.05658086E-03    2     1000022        23   # BR(~chi_20 -> ~chi_10   Z )
     2.70902369E-01    2     1000024       -24   # BR(~chi_20 -> ~chi_1+   W-)
     2.70902369E-01    2    -1000024        24   # BR(~chi_20 -> ~chi_1-   W+)
     2.77055717E-01    2     1000022        25   # BR(~chi_20 -> ~chi_10   h )
     7.88971674E-03    2     1000022        35   # BR(~chi_20 -> ~chi_10   H )
     4.27067866E-02    2     1000022        36   # BR(~chi_20 -> ~chi_10   A )
     5.11107832E-02    2     1000024       -37   # BR(~chi_20 -> ~chi_1+   H-)
     5.11107832E-02    2    -1000024        37   # BR(~chi_20 -> ~chi_1-   H+)
     1.27518840E-04    2     1000002        -2   # BR(~chi_20 -> ~u_L      ub)
     1.27518840E-04    2    -1000002         2   # BR(~chi_20 -> ~u_L*     u )
     1.30274432E-03    2     2000002        -2   # BR(~chi_20 -> ~u_R      ub)
     1.30274432E-03    2    -2000002         2   # BR(~chi_20 -> ~u_R*     u )
     4.55971970E-05    2     1000001        -1   # BR(~chi_20 -> ~d_L      db)
     4.55971970E-05    2    -1000001         1   # BR(~chi_20 -> ~d_L*     d )
     3.25538601E-04    2     2000001        -1   # BR(~chi_20 -> ~d_R      db)
     3.25538601E-04    2    -2000001         1   # BR(~chi_20 -> ~d_R*     d )
     1.27518840E-04    2     1000004        -4   # BR(~chi_20 -> ~c_L      cb)
     1.27518840E-04    2    -1000004         4   # BR(~chi_20 -> ~c_L*     c )
     1.30274432E-03    2     2000004        -4   # BR(~chi_20 -> ~c_R      cb)
     1.30274432E-03    2    -2000004         4   # BR(~chi_20 -> ~c_R*     c )
     4.55971970E-05    2     1000003        -3   # BR(~chi_20 -> ~s_L      sb)
     4.55971970E-05    2    -1000003         3   # BR(~chi_20 -> ~s_L*     s )
     3.25538601E-04    2     2000003        -3   # BR(~chi_20 -> ~s_R      sb)
     3.25538601E-04    2    -2000003         3   # BR(~chi_20 -> ~s_R*     s )
     8.75511875E-03    2     1000006        -6   # BR(~chi_20 -> ~t_1      tb)
     8.75511875E-03    2    -1000006         6   # BR(~chi_20 -> ~t_1*     t )
     1.52525014E-04    2     1000005        -5   # BR(~chi_20 -> ~b_1      bb)
     1.52525014E-04    2    -1000005         5   # BR(~chi_20 -> ~b_1*     b )
     4.48773240E-05    2     2000005        -5   # BR(~chi_20 -> ~b_2      bb)
     4.48773240E-05    2    -2000005         5   # BR(~chi_20 -> ~b_2*     b )
     8.19810801E-05    2     1000011       -11   # BR(~chi_20 -> ~e_L-     e+)
     8.19810801E-05    2    -1000011        11   # BR(~chi_20 -> ~e_L+     e-)
     2.79217232E-04    2     2000011       -11   # BR(~chi_20 -> ~e_R-     e+)
     2.79217232E-04    2    -2000011        11   # BR(~chi_20 -> ~e_R+     e-)
     8.19810801E-05    2     1000013       -13   # BR(~chi_20 -> ~mu_L-    mu+)
     8.19810801E-05    2    -1000013        13   # BR(~chi_20 -> ~mu_L+    mu-)
     2.79217232E-04    2     2000013       -13   # BR(~chi_20 -> ~mu_R-    mu+)
     2.79217232E-04    2    -2000013        13   # BR(~chi_20 -> ~mu_R+    mu-)
     1.89964539E-04    2     1000015       -15   # BR(~chi_20 -> ~tau_1-   tau+)
     1.89964539E-04    2    -1000015        15   # BR(~chi_20 -> ~tau_1+   tau-)
     1.73257285E-04    2     2000015       -15   # BR(~chi_20 -> ~tau_2-   tau+)
     1.73257285E-04    2    -2000015        15   # BR(~chi_20 -> ~tau_2+   tau-)
     5.87365767E-05    2     1000012       -12   # BR(~chi_20 -> ~nu_eL    nu_eb)
     5.87365767E-05    2    -1000012        12   # BR(~chi_20 -> ~nu_eL*   nu_e )
     5.87365767E-05    2     1000014       -14   # BR(~chi_20 -> ~nu_muL   nu_mub)
     5.87365767E-05    2    -1000014        14   # BR(~chi_20 -> ~nu_muL*  nu_mu )
     5.87365767E-05    2     1000016       -16   # BR(~chi_20 -> ~nu_tau1  nu_taub)
     5.87365767E-05    2    -1000016        16   # BR(~chi_20 -> ~nu_tau1* nu_tau )
     1.14698384E-12    2     1000039        22   # BR(~chi_20 -> ~G        gam)
     3.56578423E-12    2     1000039        23   # BR(~chi_20 -> ~G        Z)
     1.26967583E-13    2     1000039        25   # BR(~chi_20 -> ~G        h)
     1.72749848E-12    2     1000039        35   # BR(~chi_20 -> ~G        H)
     6.94474889E-14    2     1000039        36   # BR(~chi_20 -> ~G        A)
#
#         PDG            Width
DECAY   1000025     5.40396943E+01   # neutralino3 decays
#          BR         NDA      ID1       ID2
     2.78383019E-01    2     1000022        23   # BR(~chi_30 -> ~chi_10   Z )
     2.74218898E-01    2     1000024       -24   # BR(~chi_30 -> ~chi_1+   W-)
     2.74218898E-01    2    -1000024        24   # BR(~chi_30 -> ~chi_1-   W+)
     3.07541428E-03    2     1000022        25   # BR(~chi_30 -> ~chi_10   h )
     4.37071817E-02    2     1000022        35   # BR(~chi_30 -> ~chi_10   H )
     8.17586099E-03    2     1000022        36   # BR(~chi_30 -> ~chi_10   A )
     5.21498351E-02    2     1000024       -37   # BR(~chi_30 -> ~chi_1+   H-)
     5.21498351E-02    2    -1000024        37   # BR(~chi_30 -> ~chi_1-   H+)
     5.62326572E-08    2     1000002        -2   # BR(~chi_30 -> ~u_L      ub)
     5.62326572E-08    2    -1000002         2   # BR(~chi_30 -> ~u_L*     u )
     4.83694827E-09    2     2000002        -2   # BR(~chi_30 -> ~u_R      ub)
     4.83694827E-09    2    -2000002         2   # BR(~chi_30 -> ~u_R*     u )
     7.38385297E-08    2     1000001        -1   # BR(~chi_30 -> ~d_L      db)
     7.38385297E-08    2    -1000001         1   # BR(~chi_30 -> ~d_L*     d )
     1.20872726E-09    2     2000001        -1   # BR(~chi_30 -> ~d_R      db)
     1.20872726E-09    2    -2000001         1   # BR(~chi_30 -> ~d_R*     d )
     5.62326572E-08    2     1000004        -4   # BR(~chi_30 -> ~c_L      cb)
     5.62326572E-08    2    -1000004         4   # BR(~chi_30 -> ~c_L*     c )
     4.83694827E-09    2     2000004        -4   # BR(~chi_30 -> ~c_R      cb)
     4.83694827E-09    2    -2000004         4   # BR(~chi_30 -> ~c_R*     c )
     7.38385297E-08    2     1000003        -3   # BR(~chi_30 -> ~s_L      sb)
     7.38385297E-08    2    -1000003         3   # BR(~chi_30 -> ~s_L*     s )
     1.20872726E-09    2     2000003        -3   # BR(~chi_30 -> ~s_R      sb)
     1.20872726E-09    2    -2000003         3   # BR(~chi_30 -> ~s_R*     s )
     6.93929597E-03    2     1000006        -6   # BR(~chi_30 -> ~t_1      tb)
     6.93929597E-03    2    -1000006         6   # BR(~chi_30 -> ~t_1*     t )
     8.79327809E-06    2     1000005        -5   # BR(~chi_30 -> ~b_1      bb)
     8.79327809E-06    2    -1000005         5   # BR(~chi_30 -> ~b_1*     b )
     1.01259065E-05    2     2000005        -5   # BR(~chi_30 -> ~b_2      bb)
     1.01259065E-05    2    -2000005         5   # BR(~chi_30 -> ~b_2*     b )
     4.16594909E-09    2     1000011       -11   # BR(~chi_30 -> ~e_L-     e+)
     4.16594909E-09    2    -1000011        11   # BR(~chi_30 -> ~e_L+     e-)
     1.10765096E-09    2     2000011       -11   # BR(~chi_30 -> ~e_R-     e+)
     1.10765096E-09    2    -2000011        11   # BR(~chi_30 -> ~e_R+     e-)
     4.16594909E-09    2     1000013       -13   # BR(~chi_30 -> ~mu_L-    mu+)
     4.16594909E-09    2    -1000013        13   # BR(~chi_30 -> ~mu_L+    mu-)
     1.10765096E-09    2     2000013       -13   # BR(~chi_30 -> ~mu_R-    mu+)
     1.10765096E-09    2    -2000013        13   # BR(~chi_30 -> ~mu_R+    mu-)
     9.48437195E-07    2     1000015       -15   # BR(~chi_30 -> ~tau_1-   tau+)
     9.48437195E-07    2    -1000015        15   # BR(~chi_30 -> ~tau_1+   tau-)
     1.14056731E-06    2     2000015       -15   # BR(~chi_30 -> ~tau_2-   tau+)
     1.14056731E-06    2    -2000015        15   # BR(~chi_30 -> ~tau_2+   tau-)
     9.59033193E-09    2     1000012       -12   # BR(~chi_30 -> ~nu_eL    nu_eb)
     9.59033193E-09    2    -1000012        12   # BR(~chi_30 -> ~nu_eL*   nu_e )
     9.59033193E-09    2     1000014       -14   # BR(~chi_30 -> ~nu_muL   nu_mub)
     9.59033193E-09    2    -1000014        14   # BR(~chi_30 -> ~nu_muL*  nu_mu )
     9.59033193E-09    2     1000016       -16   # BR(~chi_30 -> ~nu_tau1  nu_taub)
     9.59033193E-09    2    -1000016        16   # BR(~chi_30 -> ~nu_tau1* nu_tau )
     1.08954020E-18    2     1000039        22   # BR(~chi_30 -> ~G        gam)
     1.36337593E-13    2     1000039        23   # BR(~chi_30 -> ~G        Z)
     3.40679374E-12    2     1000039        25   # BR(~chi_30 -> ~G        h)
     7.01130571E-14    2     1000039        35   # BR(~chi_30 -> ~G        H)
     1.80689512E-12    2     1000039        36   # BR(~chi_30 -> ~G        A)
#
#         PDG            Width
DECAY   1000035     1.29961764E+01   # neutralino4 decays
#          BR         NDA      ID1       ID2
     2.33548074E-03    2     1000022        23   # BR(~chi_40 -> ~chi_10   Z )
     1.23232886E-07    2     1000023        23   # BR(~chi_40 -> ~chi_20   Z )
     1.12175906E-03    2     1000025        23   # BR(~chi_40 -> ~chi_30   Z )
     1.90604369E-01    2     1000024       -24   # BR(~chi_40 -> ~chi_1+   W-)
     1.90604369E-01    2    -1000024        24   # BR(~chi_40 -> ~chi_1-   W+)
     4.10735290E-03    2     1000037       -24   # BR(~chi_40 -> ~chi_2+   W-)
     4.10735290E-03    2    -1000037        24   # BR(~chi_40 -> ~chi_2-   W+)
     1.94743776E-01    2     1000022        25   # BR(~chi_40 -> ~chi_10   h )
     5.31532136E-03    2     1000022        35   # BR(~chi_40 -> ~chi_10   H )
     3.20896766E-02    2     1000022        36   # BR(~chi_40 -> ~chi_10   A )
     3.77633294E-02    2     1000024       -37   # BR(~chi_40 -> ~chi_1+   H-)
     3.77633294E-02    2    -1000024        37   # BR(~chi_40 -> ~chi_1-   H+)
     2.11577771E-03    2     1000002        -2   # BR(~chi_40 -> ~u_L      ub)
     2.11577771E-03    2    -1000002         2   # BR(~chi_40 -> ~u_L*     u )
     3.75872457E-02    2     2000002        -2   # BR(~chi_40 -> ~u_R      ub)
     3.75872457E-02    2    -2000002         2   # BR(~chi_40 -> ~u_R*     u )
     2.59343757E-03    2     1000001        -1   # BR(~chi_40 -> ~d_L      db)
     2.59343757E-03    2    -1000001         1   # BR(~chi_40 -> ~d_L*     d )
     9.39389278E-03    2     2000001        -1   # BR(~chi_40 -> ~d_R      db)
     9.39389278E-03    2    -2000001         1   # BR(~chi_40 -> ~d_R*     d )
     2.11577771E-03    2     1000004        -4   # BR(~chi_40 -> ~c_L      cb)
     2.11577771E-03    2    -1000004         4   # BR(~chi_40 -> ~c_L*     c )
     3.75872457E-02    2     2000004        -4   # BR(~chi_40 -> ~c_R      cb)
     3.75872457E-02    2    -2000004         4   # BR(~chi_40 -> ~c_R*     c )
     2.59343757E-03    2     1000003        -3   # BR(~chi_40 -> ~s_L      sb)
     2.59343757E-03    2    -1000003         3   # BR(~chi_40 -> ~s_L*     s )
     9.39389278E-03    2     2000003        -3   # BR(~chi_40 -> ~s_R      sb)
     9.39389278E-03    2    -2000003         3   # BR(~chi_40 -> ~s_R*     s )
     1.79972200E-02    2     1000006        -6   # BR(~chi_40 -> ~t_1      tb)
     1.79972200E-02    2    -1000006         6   # BR(~chi_40 -> ~t_1*     t )
     3.36060682E-03    2     1000005        -5   # BR(~chi_40 -> ~b_1      bb)
     3.36060682E-03    2    -1000005         5   # BR(~chi_40 -> ~b_1*     b )
     3.89682046E-03    2     2000005        -5   # BR(~chi_40 -> ~b_2      bb)
     3.89682046E-03    2    -2000005         5   # BR(~chi_40 -> ~b_2*     b )
     2.68004884E-03    2     1000011       -11   # BR(~chi_40 -> ~e_L-     e+)
     2.68004884E-03    2    -1000011        11   # BR(~chi_40 -> ~e_L+     e-)
     1.10953097E-02    2     2000011       -11   # BR(~chi_40 -> ~e_R-     e+)
     1.10953097E-02    2    -2000011        11   # BR(~chi_40 -> ~e_R+     e-)
     2.68004884E-03    2     1000013       -13   # BR(~chi_40 -> ~mu_L-    mu+)
     2.68004884E-03    2    -1000013        13   # BR(~chi_40 -> ~mu_L+    mu-)
     1.10953097E-02    2     2000013       -13   # BR(~chi_40 -> ~mu_R-    mu+)
     1.10953097E-02    2    -2000013        13   # BR(~chi_40 -> ~mu_R+    mu-)
     6.85719687E-03    2     1000015       -15   # BR(~chi_40 -> ~tau_1-   tau+)
     6.85719687E-03    2    -1000015        15   # BR(~chi_40 -> ~tau_1+   tau-)
     6.91906848E-03    2     2000015       -15   # BR(~chi_40 -> ~tau_2-   tau+)
     6.91906848E-03    2    -2000015        15   # BR(~chi_40 -> ~tau_2+   tau-)
     2.87325575E-03    2     1000012       -12   # BR(~chi_40 -> ~nu_eL    nu_eb)
     2.87325575E-03    2    -1000012        12   # BR(~chi_40 -> ~nu_eL*   nu_e )
     2.87325575E-03    2     1000014       -14   # BR(~chi_40 -> ~nu_muL   nu_mub)
     2.87325575E-03    2    -1000014        14   # BR(~chi_40 -> ~nu_muL*  nu_mu )
     2.87325575E-03    2     1000016       -16   # BR(~chi_40 -> ~nu_tau1  nu_taub)
     2.87325575E-03    2    -1000016        16   # BR(~chi_40 -> ~nu_tau1* nu_tau )
     2.00968844E-11    2     1000039        22   # BR(~chi_40 -> ~G        gam)
     9.32559548E-12    2     1000039        23   # BR(~chi_40 -> ~G        Z)
     1.06606127E-13    2     1000039        25   # BR(~chi_40 -> ~G        h)
     1.46020124E-12    2     1000039        35   # BR(~chi_40 -> ~G        H)
     5.74665277E-14    2     1000039        36   # BR(~chi_40 -> ~G        A)
#
#         PDG            Width
DECAY        25     4.10078852E-03   # h decays
#          BR         NDA      ID1       ID2
     6.18978692E-01    2           5        -5   # BR(h -> b       bb     )
     6.36141146E-02    2         -15        15   # BR(h -> tau+    tau-   )
     2.25170537E-04    2         -13        13   # BR(h -> mu+     mu-    )
     4.77141094E-04    2           3        -3   # BR(h -> s       sb     )
     2.05384906E-02    2           4        -4   # BR(h -> c       cb     )
     6.66890731E-02    2          21        21   # BR(h -> g       g      )
     2.29448137E-03    2          22        22   # BR(h -> gam     gam    )
     1.53156222E-03    2          22        23   # BR(h -> Z       gam    )
     2.00128530E-01    2          24       -24   # BR(h -> W+      W-     )
     2.55227446E-02    2          23        23   # BR(h -> Z       Z      )
#
#         PDG            Width
DECAY        35     3.76906378E+01   # H decays
#          BR         NDA      ID1       ID2
     1.45787947E-03    2           5        -5   # BR(H -> b       bb     )
     2.47022945E-04    2         -15        15   # BR(H -> tau+    tau-   )
     8.73318078E-07    2         -13        13   # BR(H -> mu+     mu-    )
     1.11811854E-06    2           3        -3   # BR(H -> s       sb     )
     1.01139140E-05    2           4        -4   # BR(H -> c       cb     )
     9.95838248E-01    2           6        -6   # BR(H -> t       tb     )
     7.96143941E-04    2          21        21   # BR(H -> g       g      )
     2.71521375E-06    2          22        22   # BR(H -> gam     gam    )
     1.15459044E-06    2          23        22   # BR(H -> Z       gam    )
     5.16418755E-04    2          24       -24   # BR(H -> W+      W-     )
     2.57504715E-04    2          23        23   # BR(H -> Z       Z      )
     8.70793597E-04    2          25        25   # BR(H -> h       h      )
     5.79545571E-24    2          36        36   # BR(H -> A       A      )
     2.65989981E-11    2          23        36   # BR(H -> Z       A      )
     6.53825824E-09    2          24       -37   # BR(H -> W+      H-     )
     6.53825824E-09    2         -24        37   # BR(H -> W-      H+     )
#
#         PDG            Width
DECAY        36     3.80525866E+01   # A decays
#          BR         NDA      ID1       ID2
     1.46452007E-03    2           5        -5   # BR(A -> b       bb     )
     2.45087587E-04    2         -15        15   # BR(A -> tau+    tau-   )
     8.66473158E-07    2         -13        13   # BR(A -> mu+     mu-    )
     1.14227729E-06    2           3        -3   # BR(A -> s       sb     )
     1.00099775E-05    2           4        -4   # BR(A -> c       cb     )
     9.96827492E-01    2           6        -6   # BR(A -> t       tb     )
     9.42147178E-04    2          21        21   # BR(A -> g       g      )
     3.11480390E-06    2          22        22   # BR(A -> gam     gam    )
     1.34865851E-06    2          23        22   # BR(A -> Z       gam    )
     5.04271332E-04    2          23        25   # BR(A -> Z       h      )
#
#         PDG            Width
DECAY        37     3.71433479E+01   # H+ decays
#          BR         NDA      ID1       ID2
     2.33886206E-06    2           4        -5   # BR(H+ -> c       bb     )
     2.50340985E-04    2         -15        16   # BR(H+ -> tau+    nu_tau )
     8.85045824E-07    2         -13        14   # BR(H+ -> mu+     nu_mu  )
     1.48683418E-08    2           2        -5   # BR(H+ -> u       bb     )
     5.48367266E-08    2           2        -3   # BR(H+ -> u       sb     )
     1.09264417E-05    2           4        -3   # BR(H+ -> c       sb     )
     9.99222754E-01    2           6        -5   # BR(H+ -> t       bb     )
     5.12684793E-04    2          24        25   # BR(H+ -> W+      h      )
