#  ISAJET SUSY parameters in SUSY Les Houches Accord 2 format
#  Created by ISALHA 2.0 Last revision: H Baer 27 May 2014
Block SPINFO   # Program information
     1   ISASUGRA/ISASUSY from ISAJET   # Spectrum Calculator
     2   7.85   04-NOV-2015 13:42:47    # Version number
Block MODSEL   # Model selection
     1     2   # Minimal gauge mediated (GMSB) model               
Block SMINPUTS   # Standard Model inputs
     1     1.28000000E+02   # alpha_em^(-1)
     2     1.16570000E-05   # G_Fermi
     3     1.19999997E-01   # alpha_s(M_Z)
     4     9.11699982E+01   # m_{Z}(pole)
     5     4.19999981E+00   # m_{b}(m_{b})
     6     1.73339996E+02   # m_{top}(pole)
     7     1.77699995E+00   # m_{tau}(pole)
Block MINPAR   # SUSY breaking input parameters
     1     3.40000000E+05   # Lambda scale of soft SSB
     2     5.00000000E+05   # M_mess overall messenger scale
     3     4.20000000E+01   # tan(beta)
     4     1.00000000E+00   # sign(mu)
     5     1.00000000E+00   # N_5 messenger index
     6     1.00000000E+05   # c_grav gravitino mass factor
    51     1.00000000E+00   # N5_1  U(1)_Y messenger index
    52     1.00000000E+00   # N5_2 SU(2)_L messenger index
    53     1.00000000E+00   # N5_3 SU(3)_C messenger index
   101     1.00000000E+00   # Rsl
   102     0.00000000E+00   # dmH_d^2
   103     0.00000000E+00   # dmH_u^2
   104     0.00000000E+00   # d_Y
Block MASS   # Scalar and gaugino mass spectrum
#  PDG code   mass                 particle
         6     1.73339996E+02   #  top            
        24     8.04229965E+01   #  W^+
        25     1.20210022E+02   #  h^0            
        35     1.32642615E+03   #  H^0            
        36     1.31774597E+03   #  A^0            
        37     1.32928381E+03   #  H^+            
   1000001     3.51193042E+03   #  dnl            
   1000002     3.51100342E+03   #  upl            
   1000003     3.51193042E+03   #  stl            
   1000004     3.51100366E+03   #  chl            
   1000005     3.23036426E+03   #  b1             
   1000006     3.05199927E+03   #  t1             
   1000011     1.19096667E+03   #  el-            
   1000012     1.18258594E+03   #  nuel           
   1000013     1.19096667E+03   #  mul-           
   1000014     1.18258594E+03   #  numl           
   1000015     5.15426208E+02   #  tau1           
   1000016     1.16326941E+03   #  nutl           
   1000021     2.63287354E+03   #  glss           
   1000022     5.12262634E+02   #  z1ss           
   1000023     9.73540405E+02   #  z2ss           
   1000024     9.74370789E+02   #  w1ss           
   1000025    -1.16428857E+03   #  z3ss           
   1000035     1.17902014E+03   #  z4ss           
   1000037     1.17944910E+03   #  w2ss           
   1000039     4.08956455E-03   #  gvss
   2000001     3.32816895E+03   #  dnr            
   2000002     3.34544141E+03   #  upr            
   2000003     3.32816895E+03   #  str            
   2000004     3.34544189E+03   #  chr            
   2000005     3.34685132E+03   #  b2             
   2000006     3.36488208E+03   #  t2             
   2000011     5.89956604E+02   #  er-            
   2000013     5.89956604E+02   #  mur-           
   2000015     1.17218445E+03   #  tau2           
Block ALPHA   # Effective Higgs mixing parameter
         -2.40920745E-02   # alpha
Block STOPMIX   # stop mixing matrix
  1  1     3.09428200E-02   # O_{11}
  1  2     9.99521136E-01   # O_{12}
  2  1    -9.99521136E-01   # O_{21}
  2  2     3.09428200E-02   # O_{22}
Block SBOTMIX   # sbottom mixing matrix
  1  1     1.79806665E-01   # O_{11}
  1  2     9.83701944E-01   # O_{12}
  2  1    -9.83701944E-01   # O_{21}
  2  2     1.79806665E-01   # O_{22}
Block STAUMIX   # stau mixing matrix
  1  1     7.14181885E-02   # O_{11}
  1  2     9.97446477E-01   # O_{12}
  2  1    -9.97446477E-01   # O_{21}
  2  2     7.14181885E-02   # O_{22}
Block NMIX   # neutralino mixing matrix
  1  1     9.98740375E-01   #
  1  2    -3.70879215E-03   #
  1  3     4.57046218E-02   #
  1  4    -2.03689486E-02   #
  2  1     1.66195836E-02   #
  2  2     9.62429225E-01   #
  2  3    -2.07230091E-01   #
  2  4     1.74669698E-01   #
  3  1     1.78017169E-02   #
  3  2    -2.39859279E-02   #
  3  3    -7.06203163E-01   #
  3  4    -7.07378864E-01   #
  4  1     4.38685529E-02   #
  4  2    -2.70445794E-01   #
  4  3    -6.75458372E-01   #
  4  4     6.84609771E-01   #
Block UMIX   # chargino U mixing matrix
  1  1    -9.59292591E-01   # U_{11}
  1  2     2.82414138E-01   # U_{12}
  2  1    -2.82414138E-01   # U_{21}
  2  2    -9.59292591E-01   # U_{22}
Block VMIX   # chargino V mixing matrix
  1  1    -9.71539199E-01   # V_{11}
  1  2     2.36878961E-01   # V_{12}
  2  1    -2.36878961E-01   # V_{21}
  2  2    -9.71539199E-01   # V_{22}
Block GAUGE Q=  3.10381860E+03   #
     1     3.57524991E-01   # g`
     2     6.52378619E-01   # g_2
     3     1.21928000E+00   # g_3
Block YU Q=  3.10381860E+03   #
  3  3     8.33955109E-01   # y_t
Block YD Q=  3.10381860E+03   #
  3  3     4.85066175E-01   # y_b
Block YE Q=  3.10381860E+03   #
  3  3     4.52907056E-01   # y_tau
Block HMIX Q=  3.10381860E+03   # Higgs mixing parameters
     1     1.15094995E+03   # mu(Q)
     2     4.10619965E+01   # tan(beta)(Q)
     3     2.51856934E+02   # Higgs vev at Q
     4     1.73645450E+06   # m_A^2(Q)
Block MSOFT Q=  3.10381860E+03   # DRbar SUSY breaking parameters
     1     5.22444214E+02   # M_1(Q)          
     2     9.52339417E+02   # M_2(Q)          
     3     2.40244556E+03   # M_3(Q)          
    21     5.02745563E+05   # MHd^2(Q)        
    22    -1.09040488E+06   # MHu^2(Q)        
    31     1.18109790E+03   # MeL(Q)          
    32     1.18109790E+03   # MmuL(Q)         
    33     1.16218225E+03   # MtauL(Q)        
    34     5.88354187E+02   # MeR(Q)          
    35     5.88354187E+02   # MmuR(Q)         
    36     5.28126404E+02   # MtauR(Q)        
    41     3.39259985E+03   # MqL1(Q)         
    42     3.39259985E+03   # MqL2(Q)         
    43     3.23993896E+03   # MqL3(Q)         
    44     3.22441968E+03   # MuR(Q)          
    45     3.22441968E+03   # McR(Q)          
    46     2.97341699E+03   # MtR(Q)          
    47     3.20658496E+03   # MdR(Q)          
    48     3.20658496E+03   # MsR(Q)          
    49     3.12279614E+03   # MbR(Q)          
Block AU Q=  3.10381860E+03   #
  1  1    -6.68889160E+02   # A_u
  2  2    -6.68889160E+02   # A_c
  3  3    -6.68889160E+02   # A_t
Block AD Q=  3.10381860E+03   #
  1  1    -7.17633911E+02   # A_d
  2  2    -7.17633911E+02   # A_s
  3  3    -7.17633911E+02   # A_b
Block AE Q=  3.10381860E+03   #
  1  1    -7.14871750E+01   # A_e
  2  2    -7.14871750E+01   # A_mu
  3  3    -7.14871750E+01   # A_tau
#  ISAJET decay tables in SUSY Les Houches accord format
#  Created by ISALHD. Last revision: C. Balazs, 2005 May 25
Block DCINFO                           # Program information
     1   ISASUGRA from ISAJET          # Spectrum Calculator
     2   7.85   04-NOV-2015 13:42:47   # Version number
#         PDG         Width
DECAY         6  1.16968346E+00   # TP    decays
#          BR          NDA       ID1       ID2       ID3       ID4
      3.33333343E-01    3            2        -1         5             # TP     -->  UP     DB     BT          
      3.33333343E-01    3            4        -3         5             # TP     -->  CH     SB     BT          
      1.11111112E-01    3          -11        12         5             # TP     -->  E+     NUE    BT          
      1.11111112E-01    3          -13        14         5             # TP     -->  MU+    NUM    BT          
      1.11111112E-01    3          -15        16         5             # TP     -->  TAU+   NUT    BT          
#         PDG         Width
DECAY   1000021  9.25192684E-02   # GLSS  decays
#          BR          NDA       ID1       ID2       ID3       ID4
      4.14773040E-02    3      1000024         1        -2             # GLSS   -->  W1SS+  DN     UB          
      4.14773040E-02    3     -1000024         2        -1             # GLSS   -->  W1SS-  UP     DB          
      4.14772965E-02    3      1000024         3        -4             # GLSS   -->  W1SS+  ST     CB          
      4.14772965E-02    3     -1000024         4        -3             # GLSS   -->  W1SS-  CH     SB          
      5.25874794E-02    3      1000024         5        -6             # GLSS   -->  W1SS+  BT     TB          
      5.25874794E-02    3     -1000024         6        -5             # GLSS   -->  W1SS-  TP     BB          
      2.06967536E-03    3      1000037         1        -2             # GLSS   -->  W2SS+  DN     UB          
      2.06967536E-03    3     -1000037         2        -1             # GLSS   -->  W2SS-  UP     DB          
      2.06967490E-03    3      1000037         3        -4             # GLSS   -->  W2SS+  ST     CB          
      2.06967490E-03    3     -1000037         4        -3             # GLSS   -->  W2SS-  CH     SB          
      1.16123527E-01    3      1000037         5        -6             # GLSS   -->  W2SS+  BT     TB          
      1.16123527E-01    3     -1000037         6        -5             # GLSS   -->  W2SS-  TP     BB          
      4.16060948E-06    2      1000022        21                       # GLSS   -->  Z1SS   GL                 
      2.72591002E-02    3      1000022         2        -2             # GLSS   -->  Z1SS   UP     UB          
      8.00569635E-03    3      1000022         1        -1             # GLSS   -->  Z1SS   DN     DB          
      8.00569635E-03    3      1000022         3        -3             # GLSS   -->  Z1SS   ST     SB          
      2.72590742E-02    3      1000022         4        -4             # GLSS   -->  Z1SS   CH     CB          
      1.00758215E-02    3      1000022         5        -5             # GLSS   -->  Z1SS   BT     BB          
      4.12431471E-02    3      1000022         6        -6             # GLSS   -->  Z1SS   TP     TB          
      1.74388231E-04    2      1000023        21                       # GLSS   -->  Z2SS   GL                 
      2.07883250E-02    3      1000023         2        -2             # GLSS   -->  Z2SS   UP     UB          
      2.04920601E-02    3      1000023         1        -1             # GLSS   -->  Z2SS   DN     DB          
      2.04920601E-02    3      1000023         3        -3             # GLSS   -->  Z2SS   ST     SB          
      2.07883175E-02    3      1000023         4        -4             # GLSS   -->  Z2SS   CH     CB          
      3.14107612E-02    3      1000023         5        -5             # GLSS   -->  Z2SS   BT     BB          
      2.19363850E-02    3      1000023         6        -6             # GLSS   -->  Z2SS   TP     TB          
      1.74566347E-03    2      1000025        21                       # GLSS   -->  Z3SS   GL                 
      4.60326191E-06    3      1000025         2        -2             # GLSS   -->  Z3SS   UP     UB          
      5.55945644E-06    3      1000025         1        -1             # GLSS   -->  Z3SS   DN     DB          
      5.55945644E-06    3      1000025         3        -3             # GLSS   -->  Z3SS   ST     SB          
      4.60325919E-06    3      1000025         4        -4             # GLSS   -->  Z3SS   CH     CB          
      2.83701755E-02    3      1000025         5        -5             # GLSS   -->  Z3SS   BT     BB          
      7.86287114E-02    3      1000025         6        -6             # GLSS   -->  Z3SS   TP     TB          
      1.59777747E-03    2      1000035        21                       # GLSS   -->  Z4SS   GL                 
      1.07670785E-03    3      1000035         2        -2             # GLSS   -->  Z4SS   UP     UB          
      1.19221245E-03    3      1000035         1        -1             # GLSS   -->  Z4SS   DN     DB          
      1.19221245E-03    3      1000035         3        -3             # GLSS   -->  Z4SS   ST     SB          
      1.07670738E-03    3      1000035         4        -4             # GLSS   -->  Z4SS   CH     CB          
      2.65634116E-02    3      1000035         5        -5             # GLSS   -->  Z4SS   BT     BB          
      8.89911950E-02    3      1000035         6        -6             # GLSS   -->  Z4SS   TP     TB          
      9.41347684E-17    2      1000039        21                       # GLSS   -->  GVSS   GL                 
#         PDG         Width
DECAY   1000002  7.46536179E+01   # UPL   decays
#          BR          NDA       ID1       ID2       ID3       ID4
      6.09404594E-03    2      1000022         2                       # UPL    -->  Z1SS   UP                 
      1.57247826E-01    2      1000023         2                       # UPL    -->  Z2SS   UP                 
      6.73557952E-05    2      1000025         2                       # UPL    -->  Z3SS   UP                 
      1.07306279E-02    2      1000035         2                       # UPL    -->  Z4SS   UP                 
      4.90006030E-01    2      1000021         2                       # UPL    -->  GLSS   UP                 
      3.18368882E-01    2      1000024         1                       # UPL    -->  W1SS+  DN                 
      1.74852163E-02    2      1000037         1                       # UPL    -->  W2SS+  DN                 
#         PDG         Width
DECAY   1000001  7.46758118E+01   # DNL   decays
#          BR          NDA       ID1       ID2       ID3       ID4
      6.60872180E-03    2      1000022         1                       # DNL    -->  Z1SS   DN                 
      1.55278921E-01    2      1000023         1                       # DNL    -->  Z2SS   DN                 
      1.16438234E-04    2      1000025         1                       # DNL    -->  Z3SS   DN                 
      1.20867370E-02    2      1000035         1                       # DNL    -->  Z4SS   DN                 
      4.90642816E-01    2      1000021         1                       # DNL    -->  GLSS   DN                 
      3.10410172E-01    2     -1000024         2                       # DNL    -->  W1SS-  UP                 
      2.48562004E-02    2     -1000037         2                       # DNL    -->  W2SS-  UP                 
#         PDG         Width
DECAY   1000003  7.46758118E+01   # STL   decays
#          BR          NDA       ID1       ID2       ID3       ID4
      6.60872227E-03    2      1000022         3                       # STL    -->  Z1SS   ST                 
      1.55278936E-01    2      1000023         3                       # STL    -->  Z2SS   ST                 
      1.16438241E-04    2      1000025         3                       # STL    -->  Z3SS   ST                 
      1.20867379E-02    2      1000035         3                       # STL    -->  Z4SS   ST                 
      4.90642875E-01    2      1000021         3                       # STL    -->  GLSS   ST                 
      3.10410112E-01    2     -1000024         4                       # STL    -->  W1SS-  CH                 
      2.48561930E-02    2     -1000037         4                       # STL    -->  W2SS-  CH                 
#         PDG         Width
DECAY   1000004  7.46535797E+01   # CHL   decays
#          BR          NDA       ID1       ID2       ID3       ID4
      6.09404780E-03    2      1000022         4                       # CHL    -->  Z1SS   CH                 
      1.57247871E-01    2      1000023         4                       # CHL    -->  Z2SS   CH                 
      6.73558097E-05    2      1000025         4                       # CHL    -->  Z3SS   CH                 
      1.07306307E-02    2      1000035         4                       # CHL    -->  Z4SS   CH                 
      4.90005791E-01    2      1000021         4                       # CHL    -->  GLSS   CH                 
      3.18369091E-01    2      1000024         3                       # CHL    -->  W1SS+  ST                 
      1.74852274E-02    2      1000037         3                       # CHL    -->  W2SS+  ST                 
#         PDG         Width
DECAY   1000005  4.61288948E+01   # BT1   decays
#          BR          NDA       ID1       ID2       ID3       ID4
      3.98932025E-02    2      1000022         5                       # BT1    -->  Z1SS   BT                 
      3.67686227E-02    2      1000023         5                       # BT1    -->  Z2SS   BT                 
      1.21389695E-01    2      1000025         5                       # BT1    -->  Z3SS   BT                 
      9.61070508E-02    2      1000035         5                       # BT1    -->  Z4SS   BT                 
      4.33699697E-01    2      1000021         5                       # BT1    -->  GLSS   BT                 
      7.02569336E-02    2     -1000024         6                       # BT1    -->  W1SS-  TP                 
      2.01871842E-01    2     -1000037         6                       # BT1    -->  W2SS-  TP                 
      1.29594455E-05    2          -24   1000006                       # BT1    -->  W-     TP1                
#         PDG         Width
DECAY   1000006  7.50657806E+01   # TP1   decays
#          BR          NDA       ID1       ID2       ID3       ID4
      1.34864151E-01    2      1000021         6                       # TP1    -->  GLSS   TP                 
      8.61822739E-02    2      1000022         6                       # TP1    -->  Z1SS   TP                 
      1.57300849E-02    2      1000023         6                       # TP1    -->  Z2SS   TP                 
      1.95143655E-01    2      1000025         6                       # TP1    -->  Z3SS   TP                 
      1.77452162E-01    2      1000035         6                       # TP1    -->  Z4SS   TP                 
      2.93959659E-02    2      1000024         5                       # TP1    -->  W1SS+  BT                 
      3.61231714E-01    2      1000037         5                       # TP1    -->  W2SS+  BT                 
#         PDG         Width
DECAY   2000002  3.36878777E+01   # UPR   decays
#          BR          NDA       ID1       ID2       ID3       ID4
      2.13546976E-01    2      1000022         2                       # UPR    -->  Z1SS   UP                 
      5.19491587E-05    2      1000023         2                       # UPR    -->  Z2SS   UP                 
      5.49514953E-05    2      1000025         2                       # UPR    -->  Z3SS   UP                 
      3.31366551E-04    2      1000035         2                       # UPR    -->  Z4SS   UP                 
      7.86014736E-01    2      1000021         2                       # UPR    -->  GLSS   UP                 
#         PDG         Width
DECAY   2000001  2.72618465E+01   # DNR   decays
#          BR          NDA       ID1       ID2       ID3       ID4
      6.55974075E-02    2      1000022         1                       # DNR    -->  Z1SS   DN                 
      1.59350056E-05    2      1000023         1                       # DNR    -->  Z2SS   DN                 
      1.68400438E-05    2      1000025         1                       # DNR    -->  Z3SS   DN                 
      1.01539765E-04    2      1000035         1                       # DNR    -->  Z4SS   DN                 
      9.34268296E-01    2      1000021         1                       # DNR    -->  GLSS   DN                 
#         PDG         Width
DECAY   2000003  2.72618465E+01   # STR   decays
#          BR          NDA       ID1       ID2       ID3       ID4
      6.55974075E-02    2      1000022         3                       # STR    -->  Z1SS   ST                 
      1.59350056E-05    2      1000023         3                       # STR    -->  Z2SS   ST                 
      1.68400438E-05    2      1000025         3                       # STR    -->  Z3SS   ST                 
      1.01539765E-04    2      1000035         3                       # STR    -->  Z4SS   ST                 
      9.34268296E-01    2      1000021         3                       # STR    -->  GLSS   ST                 
#         PDG         Width
DECAY   2000004  3.36878471E+01   # CHR   decays
#          BR          NDA       ID1       ID2       ID3       ID4
      2.13547111E-01    2      1000022         4                       # CHR    -->  Z1SS   CH                 
      5.19491950E-05    2      1000023         4                       # CHR    -->  Z2SS   CH                 
      5.49515316E-05    2      1000025         4                       # CHR    -->  Z3SS   CH                 
      3.31366784E-04    2      1000035         4                       # CHR    -->  Z4SS   CH                 
      7.86014616E-01    2      1000021         4                       # CHR    -->  GLSS   CH                 
#         PDG         Width
DECAY   2000005  1.06363945E+02   # BT2   decays
#          BR          NDA       ID1       ID2       ID3       ID4
      3.91163677E-03    2      1000022         5                       # BT2    -->  Z1SS   BT                 
      9.59250182E-02    2      1000023         5                       # BT2    -->  Z2SS   BT                 
      5.74951731E-02    2      1000025         5                       # BT2    -->  Z3SS   BT                 
      6.65867478E-02    2      1000035         5                       # BT2    -->  Z4SS   BT                 
      2.49174848E-01    2      1000021         5                       # BT2    -->  GLSS   BT                 
      1.95811972E-01    2     -1000024         6                       # BT2    -->  W1SS-  TP                 
      3.29909980E-01    2     -1000037         6                       # BT2    -->  W2SS-  TP                 
      9.04164684E-04    2          -24   1000006                       # BT2    -->  W-     TP1                
      2.80475593E-04    2           23   1000005                       # BT2    -->  Z0     BT1                
#         PDG         Width
DECAY   2000006  1.08924706E+02   # TP2   decays
#          BR          NDA       ID1       ID2       ID3       ID4
      2.41459072E-01    2      1000021         6                       # TP2    -->  GLSS   TP                 
      2.11518183E-01    2      1000024         5                       # TP2    -->  W1SS+  BT                 
      1.17054574E-01    2      1000037         5                       # TP2    -->  W2SS+  BT                 
      5.38230175E-04    2           23   1000006                       # TP2    -->  Z0     TP1                
      2.11432297E-03    2           25   1000006                       # TP2    -->  HL0    TP1                
      1.82145683E-03    2           24   1000005                       # TP2    -->  W+     BT1                
      4.04256582E-03    2      1000022         6                       # TP2    -->  Z1SS   TP                 
      1.07318655E-01    2      1000023         6                       # TP2    -->  Z2SS   TP                 
      1.56336024E-01    2      1000025         6                       # TP2    -->  Z3SS   TP                 
      1.57796904E-01    2      1000035         6                       # TP2    -->  Z4SS   TP                 
#         PDG         Width
DECAY   1000011  2.51999021E+00   # EL-   decays
#          BR          NDA       ID1       ID2       ID3       ID4
      3.92794102E-01    2      1000022        11                       # EL-    -->  Z1SS   E-                 
      2.06727877E-01    2      1000023        11                       # EL-    -->  Z2SS   E-                 
      7.87377189E-07    2      1000025        11                       # EL-    -->  Z3SS   E-                 
      4.80995768E-05    2      1000035        11                       # EL-    -->  Z4SS   E-                 
      4.00311559E-01    2     -1000024        12                       # EL-    -->  W1SS-  NUE                
      1.17567870E-04    2     -1000037        12                       # EL-    -->  W2SS-  NUE                
      6.54532897E-20    2           11   1000039                       # EL-    -->  E-     GVSS               
#         PDG         Width
DECAY   1000013  2.51999021E+00   # MUL-  decays
#          BR          NDA       ID1       ID2       ID3       ID4
      3.92794102E-01    2      1000022        13                       # MUL-   -->  Z1SS   MU-                
      2.06727862E-01    2      1000023        13                       # MUL-   -->  Z2SS   MU-                
      7.87370880E-07    2      1000025        13                       # MUL-   -->  Z3SS   MU-                
      4.80977033E-05    2      1000035        13                       # MUL-   -->  Z4SS   MU-                
      4.00311589E-01    2     -1000024        14                       # MUL-   -->  W1SS-  NUM                
      1.17567870E-04    2     -1000037        14                       # MUL-   -->  W2SS-  NUM                
      6.54532897E-20    2           13   1000039                       # MUL-   -->  MU-    GVSS               
#         PDG         Width
DECAY   1000015  0   # TAU1- decays
#          BR          NDA       ID1       ID2       ID3       ID4
      1.00000000E+00    2      1000022        15                       # TAU1-  -->  Z1SS   TAU-               
      7.77628689E-18    2           15   1000039                       # TAU1-  -->  TAU-   GVSS               
#         PDG         Width
DECAY   1000012  2.44232416E+00   # NUEL  decays
#          BR          NDA       ID1       ID2       ID3       ID4
      4.10791934E-01    2      1000022        12                       # NUEL   -->  Z1SS   NUE                
      1.92395687E-01    2      1000023        12                       # NUEL   -->  Z2SS   NUE                
      2.19145659E-06    2      1000025        12                       # NUEL   -->  Z3SS   NUE                
      6.41175529E-06    2      1000035        12                       # NUEL   -->  Z4SS   NUE                
      3.96797389E-01    2      1000024        11                       # NUEL   -->  W1SS+  E-                 
      6.42028226E-06    2      1000037        11                       # NUEL   -->  W2SS+  E-                 
      6.51917390E-20    2           12   1000039                       # NUEL   -->  NUE    GVSS               
#         PDG         Width
DECAY   1000014  2.44232392E+00   # NUML  decays
#          BR          NDA       ID1       ID2       ID3       ID4
      4.10791934E-01    2      1000022        14                       # NUML   -->  Z1SS   NUM                
      1.92395687E-01    2      1000023        14                       # NUML   -->  Z2SS   NUM                
      2.19145659E-06    2      1000025        14                       # NUML   -->  Z3SS   NUM                
      6.41175529E-06    2      1000035        14                       # NUML   -->  Z4SS   NUM                
      3.96797359E-01    2      1000024        13                       # NUML   -->  W1SS+  MU-                
      6.41667475E-06    2      1000037        13                       # NUML   -->  W2SS+  MU-                
      6.51917390E-20    2           14   1000039                       # NUML   -->  NUM    GVSS               
#         PDG         Width
DECAY   1000016  4.86614370E+00   # NUTL  decays
#          BR          NDA       ID1       ID2       ID3       ID4
      1.99684098E-01    2      1000022        16                       # NUTL   -->  Z1SS   NUT                
      8.20804685E-02    2      1000023        16                       # NUTL   -->  Z2SS   NUT                
      1.75453812E-01    2      1000024        15                       # NUTL   -->  W1SS+  TAU-               
      5.42693734E-01    2           24   1000015                       # NUTL   -->  W+     TAU1-              
      8.34371167E-05    3     -1000015        16        15             # NUTL   -->  TAU1+  NUT    TAU-        
      4.44388752E-06    3      1000015        16       -15             # NUTL   -->  TAU1-  NUT    TAU+        
      3.01334465E-20    2           16   1000039                       # NUTL   -->  NUT    GVSS               
#         PDG         Width
DECAY   2000011  1.81198388E-01   # ER-   decays
#          BR          NDA       ID1       ID2       ID3       ID4
      1.00000000E+00    2      1000022        11                       # ER-    -->  Z1SS   E-                 
      7.10932285E-11    3      1000015        11       -15             # ER-    -->  TAU1-  E-     TAU+        
      7.58688321E-11    3     -1000015        11        15             # ER-    -->  TAU1+  E-     TAU-        
      2.16351273E-15    3      1000015        12       -16             # ER-    -->  TAU1-  NUE    ANUT        
      2.71505299E-20    2           11   1000039                       # ER-    -->  E-     GVSS               
#         PDG         Width
DECAY   2000013  1.81198195E-01   # MUR-  decays
#          BR          NDA       ID1       ID2       ID3       ID4
      1.00000000E+00    2      1000022        13                       # MUR-   -->  Z1SS   MU-                
      7.10933049E-11    3      1000015        13       -15             # MUR-   -->  TAU1-  MU-    TAU+        
      7.58689153E-11    3     -1000015        13        15             # MUR-   -->  TAU1+  MU-    TAU-        
      9.20935411E-11    3      1000015        14       -16             # MUR-   -->  TAU1-  NUM    ANUT        
      2.71505525E-20    2           13   1000039                       # MUR-   -->  MU-    GVSS               
#         PDG         Width
DECAY   2000015  5.21713305E+00   # TAU2- decays
#          BR          NDA       ID1       ID2       ID3       ID4
      1.85895503E-01    2      1000022        15                       # TAU2-  -->  Z1SS   TAU-               
      8.64350870E-02    2      1000023        15                       # TAU2-  -->  Z2SS   TAU-               
      7.72998756E-05    2      1000025        15                       # TAU2-  -->  Z3SS   TAU-               
      1.60576746E-01    2     -1000024        16                       # TAU2-  -->  W1SS-  NUT                
      2.62148440E-01    2           23   1000015                       # TAU2-  -->  Z0     TAU1-              
      3.04866910E-01    2           25   1000015                       # TAU2-  -->  HL0    TAU1-              
#         PDG         Width
DECAY   1000022  0   # Z1SS  decays
#          BR          NDA       ID1       ID2       ID3       ID4
      7.73000598E-01    2      1000039        22                       # Z1SS   -->  GVSS   GM                 
      1.77081507E-02    3      1000039        11       -11             # Z1SS   -->  GVSS   E-     E+          
      2.09141418E-01    2      1000039        23                       # Z1SS   -->  GVSS   Z0                 
      1.49852785E-04    2      1000039        25                       # Z1SS   -->  GVSS   HL0                
#         PDG         Width
DECAY   1000023  2.10473925E-01   # Z2SS  decays
#          BR          NDA       ID1       ID2       ID3       ID4
      8.03240368E-07    2      1000022        22                       # Z2SS   -->  Z1SS   GM                 
      2.00855006E-02    2      1000022        23                       # Z2SS   -->  Z1SS   Z0                 
      2.41810625E-07    3      1000022         2        -2             # Z2SS   -->  Z1SS   UP     UB          
      2.57863547E-07    3      1000022         1        -1             # Z2SS   -->  Z1SS   DN     DB          
      2.57863547E-07    3      1000022         3        -3             # Z2SS   -->  Z1SS   ST     SB          
      2.41810540E-07    3      1000022         4        -4             # Z2SS   -->  Z1SS   CH     CB          
      9.34818490E-06    3      1000022         5        -5             # Z2SS   -->  Z1SS   BT     BB          
      1.52693392E-04    3      1000022        11       -11             # Z2SS   -->  Z1SS   E-     E+          
      1.52693392E-04    3      1000022        13       -13             # Z2SS   -->  Z1SS   MU-    MU+         
      1.68706363E-04    3      1000022        15       -15             # Z2SS   -->  Z1SS   TAU-   TAU+        
      1.58882554E-04    3      1000022        12       -12             # Z2SS   -->  Z1SS   NUE    ANUE        
      1.58882554E-04    3      1000022        14       -14             # Z2SS   -->  Z1SS   NUM    ANUM        
      1.79307957E-04    3      1000022        16       -16             # Z2SS   -->  Z1SS   NUT    ANUT        
      2.24678576E-01    2      1000022        25                       # Z2SS   -->  Z1SS   HL0                
      1.30095857E-03    2      2000011       -11                       # Z2SS   -->  ER-    E+                 
      1.30095857E-03    2     -2000011        11                       # Z2SS   -->  ER+    E-                 
      1.30095845E-03    2      2000013       -13                       # Z2SS   -->  MUR-   MU+                
      1.30095845E-03    2     -2000013        13                       # Z2SS   -->  MUR+   MU-                
      3.74524891E-01    2      1000015       -15                       # Z2SS   -->  TAU1-  TAU+               
      3.74524891E-01    2     -1000015        15                       # Z2SS   -->  TAU1+  TAU-               
      6.53882074E-20    2      1000039        22                       # Z2SS   -->  GVSS   GM                 
      1.56754139E-21    3      1000039        11       -11             # Z2SS   -->  GVSS   E-     E+          
      1.97166823E-19    2      1000039        23                       # Z2SS   -->  GVSS   Z0                 
      3.86966359E-21    2      1000039        25                       # Z2SS   -->  GVSS   HL0                
#         PDG         Width
DECAY   1000025  4.29822445E+00   # Z3SS  decays
#          BR          NDA       ID1       ID2       ID3       ID4
      6.92317812E-08    2      1000022        22                       # Z3SS   -->  Z1SS   GM                 
      1.77873503E-07    2      1000023        22                       # Z3SS   -->  Z2SS   GM                 
      1.63870648E-01    2      1000024       -24                       # Z3SS   -->  W1SS+  W-                 
      1.63870648E-01    2     -1000024        24                       # Z3SS   -->  W1SS-  W+                 
      1.34929478E-01    2      1000022        23                       # Z3SS   -->  Z1SS   Z0                 
      1.63153470E-01    2      1000023        23                       # Z3SS   -->  Z2SS   Z0                 
      9.30448149E-11    3      1000022         2        -2             # Z3SS   -->  Z1SS   UP     UB          
      2.43797101E-11    3      1000022         1        -1             # Z3SS   -->  Z1SS   DN     DB          
      2.43797101E-11    3      1000022         3        -3             # Z3SS   -->  Z1SS   ST     SB          
      9.30447594E-11    3      1000022         4        -4             # Z3SS   -->  Z1SS   CH     CB          
      1.44189089E-05    3      1000022         5        -5             # Z3SS   -->  Z1SS   BT     BB          
      9.32363697E-09    3      1000022        11       -11             # Z3SS   -->  Z1SS   E-     E+          
      9.32363697E-09    3      1000022        13       -13             # Z3SS   -->  Z1SS   MU-    MU+         
      3.46150300E-05    3      1000022        15       -15             # Z3SS   -->  Z1SS   TAU-   TAU+        
      6.21553156E-08    3      1000022        12       -12             # Z3SS   -->  Z1SS   NUE    ANUE        
      6.21553156E-08    3      1000022        14       -14             # Z3SS   -->  Z1SS   NUM    ANUM        
      1.32001886E-12    3      1000023         2        -2             # Z3SS   -->  Z2SS   UP     UB          
      2.25021542E-12    3      1000023         1        -1             # Z3SS   -->  Z2SS   DN     DB          
      2.25021542E-12    3      1000023         3        -3             # Z3SS   -->  Z2SS   ST     SB          
      1.32001842E-12    3      1000023         4        -4             # Z3SS   -->  Z2SS   CH     CB          
      1.56196165E-07    3      1000023         5        -5             # Z3SS   -->  Z2SS   BT     BB          
      5.94685690E-10    3      1000023        11       -11             # Z3SS   -->  Z2SS   E-     E+          
      5.94685690E-10    3      1000023        13       -13             # Z3SS   -->  Z2SS   MU-    MU+         
      4.58489239E-06    3      1000023        15       -15             # Z3SS   -->  Z2SS   TAU-   TAU+        
      4.21590540E-09    3      1000023        12       -12             # Z3SS   -->  Z2SS   NUE    ANUE        
      4.21590540E-09    3      1000023        14       -14             # Z3SS   -->  Z2SS   NUM    ANUM        
      1.99391581E-02    2      1000022        25                       # Z3SS   -->  Z1SS   HL0                
      9.48444242E-04    2      1000023        25                       # Z3SS   -->  Z2SS   HL0                
      1.20594697E-04    2      2000011       -11                       # Z3SS   -->  ER-    E+                 
      1.20594697E-04    2     -2000011        11                       # Z3SS   -->  ER+    E-                 
      1.20594697E-04    2      2000013       -13                       # Z3SS   -->  MUR-   MU+                
      1.20594697E-04    2     -2000013        13                       # Z3SS   -->  MUR+   MU-                
      1.76375791E-01    2      1000015       -15                       # Z3SS   -->  TAU1-  TAU+               
      1.76375791E-01    2     -1000015        15                       # Z3SS   -->  TAU1+  TAU-               
      1.99097849E-09    2      1000016       -16                       # Z3SS   -->  NUTL   ANUT               
      1.99097872E-09    2     -1000016        16                       # Z3SS   -->  ANUTL  NUT                
      5.61330001E-25    2      1000039        22                       # Z3SS   -->  GVSS   GM                 
      1.36231887E-26    3      1000039        11       -11             # Z3SS   -->  GVSS   E-     E+          
      7.99626855E-21    2      1000039        23                       # Z3SS   -->  GVSS   Z0                 
      8.60792661E-21    2      1000039        25                       # Z3SS   -->  GVSS   HL0                
#         PDG         Width
DECAY   1000035  4.83737898E+00   # Z4SS  decays
#          BR          NDA       ID1       ID2       ID3       ID4
      1.23867876E-08    2      1000022        22                       # Z4SS   -->  Z1SS   GM                 
      3.05419512E-08    2      1000023        22                       # Z4SS   -->  Z2SS   GM                 
      3.74207082E-10    2      1000025        22                       # Z4SS   -->  Z3SS   GM                 
      2.05765113E-01    2      1000024       -24                       # Z4SS   -->  W1SS+  W-                 
      2.05765113E-01    2     -1000024        24                       # Z4SS   -->  W1SS-  W+                 
      1.74821187E-02    2      1000022        23                       # Z4SS   -->  Z1SS   Z0                 
      1.86446588E-03    2      1000023        23                       # Z4SS   -->  Z2SS   Z0                 
      5.23893062E-09    3      1000022         2        -2             # Z4SS   -->  Z1SS   UP     UB          
      4.96689578E-09    3      1000022         1        -1             # Z4SS   -->  Z1SS   DN     DB          
      4.96689578E-09    3      1000022         3        -3             # Z4SS   -->  Z1SS   ST     SB          
      5.23892796E-09    3      1000022         4        -4             # Z4SS   -->  Z1SS   CH     CB          
      1.19638944E-05    3      1000022         5        -5             # Z4SS   -->  Z1SS   BT     BB          
      5.34856554E-06    3      1000022        11       -11             # Z4SS   -->  Z1SS   E-     E+          
      5.34856554E-06    3      1000022        13       -13             # Z4SS   -->  Z1SS   MU-    MU+         
      2.99123872E-06    3      1000022        15       -15             # Z4SS   -->  Z1SS   TAU-   TAU+        
      9.17673242E-06    3      1000022        12       -12             # Z4SS   -->  Z1SS   NUE    ANUE        
      9.17673242E-06    3      1000022        14       -14             # Z4SS   -->  Z1SS   NUM    ANUM        
      7.97652833E-10    3      1000023         2        -2             # Z4SS   -->  Z2SS   UP     UB          
      8.86034635E-10    3      1000023         1        -1             # Z4SS   -->  Z2SS   DN     DB          
      8.86034635E-10    3      1000023         3        -3             # Z4SS   -->  Z2SS   ST     SB          
      7.97652555E-10    3      1000023         4        -4             # Z4SS   -->  Z2SS   CH     CB          
      1.49899194E-07    3      1000023         5        -5             # Z4SS   -->  Z2SS   BT     BB          
      6.60410819E-07    3      1000023        11       -11             # Z4SS   -->  Z2SS   E-     E+          
      6.60410819E-07    3      1000023        13       -13             # Z4SS   -->  Z2SS   MU-    MU+         
      3.57208449E-08    3      1000023        15       -15             # Z4SS   -->  Z2SS   TAU-   TAU+        
      1.24639519E-06    3      1000023        12       -12             # Z4SS   -->  Z2SS   NUE    ANUE        
      1.24639519E-06    3      1000023        14       -14             # Z4SS   -->  Z2SS   NUM    ANUM        
      1.67368110E-08    3      1000025         2        -2             # Z4SS   -->  Z3SS   UP     UB          
      2.15826308E-08    3      1000025         1        -1             # Z4SS   -->  Z3SS   DN     DB          
      2.15826308E-08    3      1000025         3        -3             # Z4SS   -->  Z3SS   ST     SB          
      1.67368110E-08    3      1000025         4        -4             # Z4SS   -->  Z3SS   CH     CB          
      5.19966781E-09    3      1000025         5        -5             # Z4SS   -->  Z3SS   BT     BB          
      4.90136065E-09    3      1000025        11       -11             # Z4SS   -->  Z3SS   E-     E+          
      4.90136065E-09    3      1000025        13       -13             # Z4SS   -->  Z3SS   MU-    MU+         
      4.06576861E-09    3      1000025        15       -15             # Z4SS   -->  Z3SS   TAU-   TAU+        
      9.68792246E-09    3      1000025        12       -12             # Z4SS   -->  Z3SS   NUE    ANUE        
      9.68792246E-09    3      1000025        14       -14             # Z4SS   -->  Z3SS   NUM    ANUM        
      9.74141567E-09    3      1000025        16       -16             # Z4SS   -->  Z3SS   NUT    ANUT        
      1.21275894E-01    2      1000022        25                       # Z4SS   -->  Z1SS   HL0                
      1.66135266E-01    2      1000023        25                       # Z4SS   -->  Z2SS   HL0                
      6.70301262E-04    2      2000011       -11                       # Z4SS   -->  ER-    E+                 
      6.70301262E-04    2     -2000011        11                       # Z4SS   -->  ER+    E-                 
      6.70301262E-04    2      2000013       -13                       # Z4SS   -->  MUR-   MU+                
      6.70301262E-04    2     -2000013        13                       # Z4SS   -->  MUR+   MU-                
      1.39431670E-01    2      1000015       -15                       # Z4SS   -->  TAU1-  TAU+               
      1.39431670E-01    2     -1000015        15                       # Z4SS   -->  TAU1+  TAU-               
      2.82928613E-05    2      2000015       -15                       # Z4SS   -->  TAU2-  TAU+               
      2.82928613E-05    2     -2000015        15                       # Z4SS   -->  TAU2+  TAU-               
      3.13493983E-05    2      1000016       -16                       # Z4SS   -->  NUTL   ANUT               
      3.13494020E-05    2     -1000016        16                       # Z4SS   -->  ANUTL  NUT                
      2.73336542E-22    2      1000039        22                       # Z4SS   -->  GVSS   GM                 
      6.63943361E-24    3      1000039        11       -11             # Z4SS   -->  GVSS   E-     E+          
      9.87498959E-21    2      1000039        23                       # Z4SS   -->  GVSS   Z0                 
      6.94031757E-21    2      1000039        25                       # Z4SS   -->  GVSS   HL0                
#         PDG         Width
DECAY   1000024  1.95030764E-01   # W1SS+ decays
#          BR          NDA       ID1       ID2       ID3       ID4
      5.45878606E-07    3      1000022         2        -1             # W1SS+  -->  Z1SS   UP     DB          
      5.45878493E-07    3      1000022         4        -3             # W1SS+  -->  Z1SS   CH     SB          
      3.42021202E-04    3      1000022       -11        12             # W1SS+  -->  Z1SS   E+     NUE         
      3.42021202E-04    3      1000022       -13        14             # W1SS+  -->  Z1SS   MU+    NUM         
      3.82325903E-04    3      1000022       -15        16             # W1SS+  -->  Z1SS   TAU+   NUT         
      2.37207398E-01    2      1000022        24                       # W1SS+  -->  Z1SS   W+                 
      1.28620725E-12    3      1000023       -11        12             # W1SS+  -->  Z2SS   E+     NUE         
      1.28620725E-12    3      1000023       -13        14             # W1SS+  -->  Z2SS   MU+    NUM         
      7.61725128E-01    2     -1000015        16                       # W1SS+  -->  TAU1+  NUT                
#         PDG         Width
DECAY   1000037  4.36825562E+00   # W2SS+ decays
#          BR          NDA       ID1       ID2       ID3       ID4
      9.14605902E-09    3      1000022         2        -1             # W2SS+  -->  Z1SS   UP     DB          
      9.14605724E-09    3      1000022         4        -3             # W2SS+  -->  Z1SS   CH     SB          
      1.44704827E-05    3      1000022       -11        12             # W2SS+  -->  Z1SS   E+     NUE         
      1.44704827E-05    3      1000022       -13        14             # W2SS+  -->  Z1SS   MU+    NUM         
      3.23221320E-06    3      1000022       -15        16             # W2SS+  -->  Z1SS   TAU+   NUT         
      1.37718946E-01    2      1000022        24                       # W2SS+  -->  Z1SS   W+                 
      5.97280392E-10    3      1000023         2        -1             # W2SS+  -->  Z2SS   UP     DB          
      5.97280281E-10    3      1000023         4        -3             # W2SS+  -->  Z2SS   CH     SB          
      1.00666989E-06    3      1000023       -11        12             # W2SS+  -->  Z2SS   E+     NUE         
      1.00666989E-06    3      1000023       -13        14             # W2SS+  -->  Z2SS   MU+    NUM         
      6.02317272E-08    3      1000023       -15        16             # W2SS+  -->  Z2SS   TAU+   NUT         
      1.79532290E-01    2      1000023        24                       # W2SS+  -->  Z2SS   W+                 
      7.38803863E-08    3      1000025         2        -1             # W2SS+  -->  Z3SS   UP     DB          
      7.38803863E-08    3      1000025         4        -3             # W2SS+  -->  Z3SS   CH     SB          
      2.45866723E-08    3      1000025       -11        12             # W2SS+  -->  Z3SS   E+     NUE         
      2.45866723E-08    3      1000025       -13        14             # W2SS+  -->  Z3SS   MU+    NUM         
      2.46267629E-08    3      1000025       -15        16             # W2SS+  -->  Z3SS   TAU+   NUT         
      4.22043187E-15    3      1000035       -11        12             # W2SS+  -->  Z4SS   E+     NUE         
      4.22043187E-15    3      1000035       -13        14             # W2SS+  -->  Z4SS   MU+    NUM         
      3.90532310E-04    2      1000016       -15                       # W2SS+  -->  NUTL   TAU+               
      3.09253961E-01    2     -1000015        16                       # W2SS+  -->  TAU1+  NUT                
      1.85877507E-05    2     -2000015        16                       # W2SS+  -->  TAU2+  NUT                
      1.81358948E-01    2      1000024        23                       # W2SS+  -->  W1SS+  Z0                 
      9.66161484E-10    3      1000024         1        -1             # W2SS+  -->  W1SS+  DN     DB          
      9.66161151E-10    3      1000024         3        -3             # W2SS+  -->  W1SS+  ST     SB          
      1.33734823E-09    3      1000024         2        -2             # W2SS+  -->  W1SS+  UP     UB          
      1.33734823E-09    3      1000024         4        -4             # W2SS+  -->  W1SS+  CH     CB          
      1.41681903E-06    3      1000024        12       -12             # W2SS+  -->  W1SS+  NUE    ANUE        
      1.41681903E-06    3      1000024        14       -14             # W2SS+  -->  W1SS+  NUM    ANUM        
      1.46713057E-06    3      1000024        11       -11             # W2SS+  -->  W1SS+  E-     E+          
      1.46713057E-06    3      1000024        13       -13             # W2SS+  -->  W1SS+  MU-    MU+         
      1.91686481E-01    2      1000024        25                       # W2SS+  -->  W1SS+  HL0                
#         PDG         Width
DECAY        25  4.53896634E-03   # HL0   decays
#          BR          NDA       ID1       ID2       ID3       ID4
      4.60984184E-09    2           11       -11                       # HL0    -->  E-     E+                 
      1.94634951E-04    2           13       -13                       # HL0    -->  MU-    MU+                
      5.56736179E-02    2           15       -15                       # HL0    -->  TAU-   TAU+               
      5.78199933E-06    2            1        -1                       # HL0    -->  DN     DB                 
      2.33621779E-03    2            3        -3                       # HL0    -->  ST     SB                 
      7.61066675E-01    2            5        -5                       # HL0    -->  BT     BB                 
      1.80621157E-06    2            2        -2                       # HL0    -->  UP     UB                 
      3.37719209E-02    2            4        -4                       # HL0    -->  CH     CB                 
      1.95376226E-03    2           22        22                       # HL0    -->  GM     GM                 
      4.06616181E-02    2           21        21                       # HL0    -->  GL     GL                 
      5.29266335E-03    3           24        11       -12             # HL0    -->  W+     E-     ANUE        
      5.29266335E-03    3           24        13       -14             # HL0    -->  W+     MU-    ANUM        
      5.29266335E-03    3           24        15       -16             # HL0    -->  W+     TAU-   ANUT        
      1.58779901E-02    3           24        -2         1             # HL0    -->  W+     UB     DN          
      1.58779901E-02    3           24        -4         3             # HL0    -->  W+     CB     ST          
      5.29266335E-03    3          -24       -11        12             # HL0    -->  W-     E+     NUE         
      5.29266335E-03    3          -24       -13        14             # HL0    -->  W-     MU+    NUM         
      5.29266335E-03    3          -24       -15        16             # HL0    -->  W-     TAU+   NUT         
      1.58779901E-02    3          -24         2        -1             # HL0    -->  W-     UP     DB          
      1.58779901E-02    3          -24         4        -3             # HL0    -->  W-     CH     SB          
      6.20026258E-04    3           23        12       -12             # HL0    -->  Z0     NUE    ANUE        
      6.20026258E-04    3           23        14       -14             # HL0    -->  Z0     NUM    ANUM        
      6.20026258E-04    3           23        16       -16             # HL0    -->  Z0     NUT    ANUT        
      3.12052987E-04    3           23        11       -11             # HL0    -->  Z0     E-     E+          
      3.12052987E-04    3           23        13       -13             # HL0    -->  Z0     MU-    MU+         
      3.12052987E-04    3           23        15       -15             # HL0    -->  Z0     TAU-   TAU+        
      1.06906705E-03    3           23         2        -2             # HL0    -->  Z0     UP     UB          
      1.06906705E-03    3           23         4        -4             # HL0    -->  Z0     CH     CB          
      1.37722178E-03    3           23         1        -1             # HL0    -->  Z0     DN     DB          
      1.37722178E-03    3           23         3        -3             # HL0    -->  Z0     ST     SB          
      1.37722178E-03    3           23         5        -5             # HL0    -->  Z0     BT     BB          
#         PDG         Width
DECAY        35  3.35111084E+01   # HH0   decays
#          BR          NDA       ID1       ID2       ID3       ID4
      1.18653398E-08    2           11       -11                       # HH0    -->  E-     E+                 
      5.00976050E-04    2           13       -13                       # HH0    -->  MU-    MU+                
      1.43485680E-01    2           15       -15                       # HH0    -->  TAU-   TAU+               
      1.45027379E-05    2            1        -1                       # HH0    -->  DN     DB                 
      5.85984020E-03    2            3        -3                       # HH0    -->  ST     SB                 
      8.49050641E-01    2            5        -5                       # HH0    -->  BT     BB                 
      1.52747292E-12    2            2        -2                       # HH0    -->  UP     UB                 
      2.08321662E-08    2            4        -4                       # HH0    -->  CH     CB                 
      1.02453749E-03    2            6        -6                       # HH0    -->  TP     TB                 
      9.02892694E-09    2           22        22                       # HH0    -->  GM     GM                 
      1.74515230E-06    2           21        21                       # HH0    -->  GL     GL                 
      1.82647204E-06    2           24       -24                       # HH0    -->  W+     W-                 
      9.31628961E-07    2           23        23                       # HH0    -->  Z0     Z0                 
      5.32745471E-05    2      1000022   1000022                       # HH0    -->  Z1SS   Z1SS               
      5.06861170E-06    2           25        25                       # HH0    -->  HL0    HL0                
      1.17069689E-07    2      2000011  -2000011                       # HH0    -->  ER-    ER+                
      1.15913629E-07    2      2000013  -2000013                       # HH0    -->  MUR-   MUR+               
      6.90777824E-07    2      1000015  -1000015                       # HH0    -->  TAU1-  TAU1+              
#         PDG         Width
DECAY        36  3.32984848E+01   # HA0   decays
#          BR          NDA       ID1       ID2       ID3       ID4
      1.18631274E-08    2           11       -11                       # HA0    -->  E-     E+                 
      5.00882627E-04    2           13       -13                       # HA0    -->  MU-    MU+                
      1.43459946E-01    2           15       -15                       # HA0    -->  TAU-   TAU+               
      1.45007798E-05    2            1        -1                       # HA0    -->  DN     DB                 
      5.85904904E-03    2            3        -3                       # HA0    -->  ST     SB                 
      8.48957241E-01    2            5        -5                       # HA0    -->  BT     BB                 
      1.49107625E-12    2            2        -2                       # HA0    -->  UP     UB                 
      2.03511306E-08    2            4        -4                       # HA0    -->  CH     CB                 
      1.06020353E-03    2            6        -6                       # HA0    -->  TP     TB                 
      3.30613155E-08    2           22        22                       # HA0    -->  GM     GM                 
      9.86386476E-06    2           21        21                       # HA0    -->  GL     GL                 
      1.36444651E-04    2      1000022   1000022                       # HA0    -->  Z1SS   Z1SS               
      1.79390372E-06    2           25        23                       # HA0    -->  HL0    Z0                 
#         PDG         Width
DECAY        37  3.04287224E+01   # H+    decays
#          BR          NDA       ID1       ID2       ID3       ID4
      1.30956161E-08    2           12       -11                       # H+     -->  NUE    E+                 
      5.52920508E-04    2           14       -13                       # H+     -->  NUM    MU+                
      1.58364356E-01    2           16       -15                       # H+     -->  NUT    TAU+               
      1.47460551E-05    2            2        -1                       # H+     -->  UP     DB                 
      5.95816039E-03    2            4        -3                       # H+     -->  CH     SB                 
      8.35107803E-01    2            6        -5                       # H+     -->  TP     BB                 
      1.99666442E-06    2           25        24                       # H+     -->  HL0    W+                 
