# SUSY Les Houches Accord 2 - MSSM spectrum + Decays
# SPheno v3.3.6  
# W. Porod, Comput. Phys. Commun. 153 (2003) 275-315, hep-ph/0301101
# in case of problems send email to porod@physik.uni-wuerzburg.de
# Created: 06.12.2016,  13:43
Block SPINFO         # Program information
     1   SPheno      # spectrum calculator
     2   v3.3.6      # version number
#
Block SPhenoINFO     # SPheno specific information
    1      2         # using 2-loop RGEs
    2      1         # using running masses for boundary conditions at mZ
Block MODSEL  # Model selection
    1    2    # mGMSB model
Block MINPAR  # Input parameters
    1    2.90000000E+05  # Lambda, scale of SUSY breaking
    2    5.00000000E+05  # M_M, messenger mass scale
    3    1.00000000E+01  # tanb at m_Z   
    4    1.00000000E+00  # Sign(mu)
    5    3.00000000E+00  # N_5 number of effective five-plets
    6    1.00000000E+05  # c_grav, Gravitino mass factor
Block gauge Q=  5.00000000E+05  # (GMSB scale)
   1    4.95250238E-01  # g'(Q)^DRbar
   2    6.44364629E-01  # g(Q)^DRbar
   3    9.13187193E-01  # g3(Q)^DRbar
Block SMINPUTS  # SM parameters
         1     1.27931109E+02  # alpha_em^-1(MZ)^MSbar
         2     1.16637900E-05  # G_mu [GeV^-2]
         3     1.18400000E-01  # alpha_s(MZ)^MSbar
         4     9.11876000E+01  # m_Z(pole)
         5     4.18000000E+00  # m_b(m_b), MSbar
         6     1.73100000E+02  # m_t(pole)
         7     1.77682000E+00  # m_tau(pole)
         8     0.00000000E+00  # m_nu_3
        11     5.10998930E-04  # m_e(pole)
        12     0.00000000E+00  # m_nu_1
        13     1.05658372E-01  # m_muon(pole)
        14     0.00000000E+00  # m_nu_2
        21     5.00000000E-03  # m_d(2 GeV), MSbar
        22     2.50000000E-03  # m_u(2 GeV), MSbar
        23     9.50000000E-02  # m_s(2 GeV), MSbar
        24     1.27000000E+00  # m_c(m_c), MSbar
Block gauge Q=  5.06055692E+03  # (SUSY scale)
   1    3.66489667E-01  # g'(Q)^DRbar
   2    6.35378225E-01  # g(Q)^DRbar
   3    9.85386408E-01  # g3(Q)^DRbar
Block Yu Q=  5.06055692E+03  # (SUSY scale)
#   1  1     6.70251527E-06   # Y_u(Q)^DRbar
  1  1     0.0   # Y_u(Q)^DRbar
#   2  2     3.40487828E-03   # Y_c(Q)^DRbar
  2  2     0.0   # Y_c(Q)^DRbar
#   3  3     8.24436952E-01   # Y_t(Q)^DRbar
  3  3     0.0   # Y_t(Q)^DRbar
Block Yd Q=  5.06055692E+03  # (SUSY scale)
#   1  1     1.25999180E-04   # Y_d(Q)^DRbar
  1  1     0.0   # Y_d(Q)^DRbar
#   2  2     2.39398321E-03   # Y_s(Q)^DRbar
  2  2     0.0   # Y_s(Q)^DRbar
#   3  3     1.23088883E-01   # Y_b(Q)^DRbar
  3  3     0.0   # Y_b(Q)^DRbar
Block Ye Q=  5.06055692E+03  # (SUSY scale)
#   1  1     2.82916970E-05   # Y_e(Q)^DRbar
  1  1     0.0   # Y_e(Q)^DRbar
#   2  2     5.84982884E-03   # Y_mu(Q)^DRbar
  2  2     0.0   # Y_mu(Q)^DRbar
#   3  3     9.83900153E-02   # Y_tau(Q)^DRbar
  3  3     0.0   # Y_tau(Q)^DRbar
Block Au Q=  5.06055692E+03  # (SUSY scale)
#   1  1    -1.55048974E+03   # A_u(Q)^DRbar
  1  1    0.0   # A_u(Q)^DRbar
#   2  2    -1.55048810E+03   # A_c(Q)^DRbar
  2  2    0.0   # A_c(Q)^DRbar
#   3  3    -1.46850214E+03   # A_t(Q)^DRbar
  3  3    0.0   # A_t(Q)^DRbar
Block Ad Q=  5.06055692E+03  # (SUSY scale)
#   1  1    -1.64283499E+03   # A_d(Q)^DRbar
  1  1    0.0   # A_d(Q)^DRbar
#   2  2    -1.64283382E+03   # A_s(Q)^DRbar
  2  2    0.0   # A_s(Q)^DRbar
#   3  3    -1.61450075E+03   # A_b(Q)^DRbar
  3  3    0.0   # A_b(Q)^DRbar
Block Ae Q=  5.06055692E+03  # (SUSY scale)
#   1  1    -1.99136085E+02   # A_e(Q)^DRbar
  1  1    0.0   # A_e(Q)^DRbar
#   2  2    -1.99135426E+02   # A_mu(Q)^DRbar
  2  2    0.0   # A_mu(Q)^DRbar
#   3  3    -1.98949494E+02   # A_tau(Q)^DRbar
  3  3    0.0   # A_tau(Q)^DRbar
Block MSOFT Q=  5.06055692E+03  # soft SUSY breaking masses at Q
   1    1.30657138E+03  # M_1
   2    2.34925911E+03  # M_2
   3    5.67257878E+03  # M_3
  21    3.08481732E+06  # M^2_(H,d)
  22   -2.22852985E+06  # M^2_(H,u)
  31    1.79199489E+03  # M_(L,11)
  32    1.79199130E+03  # M_(L,22)
  33    1.79097980E+03  # M_(L,33)
  34    8.85140484E+02  # M_(E,11)
  35    8.85125705E+02  # M_(E,22)
  36    8.80950158E+02  # M_(E,33)
  41    5.43256736E+03  # M_(Q,11)
  42    5.43256336E+03  # M_(Q,22)
  43    5.27393029E+03  # M_(Q,33)
  44    5.18853401E+03  # M_(U,11)
  45    5.18852841E+03  # M_(U,22)
  46    4.85218019E+03  # M_(U,33)
  47    5.16366838E+03  # M_(D,11)
  48    5.16366554E+03  # M_(D,22)
  49    5.15618218E+03  # M_(D,33)
Block MASS  # Mass spectrum
#   PDG code      mass          particle
         6     1.73100000E+02  # m_t(pole)
        23     9.11876000E+01  # m_Z(pole)
        24     8.04130081E+01  # W+
        15     1.77682000E+00  # m_tau(pole)
        25     1.23995079E+02  # h0
        35     2.48086505E+03  # H0
        36     2.48072119E+03  # A0
        37     2.48186874E+03  # H+
   1000001     5.63834371E+03  # ~d_L
   2000001     5.35717580E+03  # ~d_R
   1000002     5.63778193E+03  # ~u_L
   2000002     5.38089177E+03  # ~u_R
   1000003     5.63833890E+03  # ~s_L
   2000003     5.35717233E+03  # ~s_R
   1000004     5.63777719E+03  # ~c_L
   2000004     5.38088509E+03  # ~c_R
   1000005     5.34789574E+03  # ~b_1
   2000005     5.44749799E+03  # ~b_2
   1000006     4.98194236E+03  # ~t_1
   2000006     5.45025819E+03  # ~t_2
   1000011     1.83001341E+03  # ~e_L-
   2000011     9.16254187E+02  # ~e_R-
   1000012     1.82789705E+03  # ~nu_eL
   1000013     1.83000869E+03  # ~mu_L-
   2000013     9.16234927E+02  # ~mu_R-
   1000014     1.82789197E+03  # ~nu_muL
   1000015     9.10792686E+02  # ~tau_1-
   2000015     1.82867719E+03  # ~tau_2-
   1000016     1.82646275E+03  # ~nu_tauL
   1000021     5.92538248E+03  # ~g
   1000022     1.27564941E+03  # ~chi_10
   1000023     1.70004906E+03  # ~chi_20
   1000025    -1.70316272E+03  # ~chi_30
   1000035     2.40629531E+03  # ~chi_40
   1000024     1.69773172E+03  # ~chi_1+
   1000037     2.40632573E+03  # ~chi_2+
   1000039     3.48000000E-03  # ~G
# Higgs mixing
Block alpha # Effective Higgs mixing angle
          -1.05814676E-01   # alpha
Block Hmix Q=  5.06055692E+03  # Higgs mixing parameters
   1    1.67904330E+03  # mu
   2    9.45150106E+00  # tan[beta](Q)
   3    2.42867411E+02  # v(Q)
   4    5.42571900E+06  # m^2_A(Q)
Block stopmix # stop mixing matrix
   1  1     5.68988460E-02   # Re[R_st(1,1)]
   1  2     9.98379948E-01   # Re[R_st(1,2)]
   2  1    -9.98379948E-01   # Re[R_st(2,1)]
   2  2     5.68988460E-02   # Re[R_st(2,2)]
Block sbotmix # sbottom mixing matrix
   1  1     3.83720499E-02   # Re[R_sb(1,1)]
   1  2     9.99263522E-01   # Re[R_sb(1,2)]
   2  1    -9.99263522E-01   # Re[R_sb(2,1)]
   2  2     3.83720499E-02   # Re[R_sb(2,2)]
Block staumix # stau mixing matrix
   1  1     1.16576934E-02   # Re[R_sta(1,1)]
   1  2     9.99932047E-01   # Re[R_sta(1,2)]
   2  1    -9.99932047E-01   # Re[R_sta(2,1)]
   2  2     1.16576934E-02   # Re[R_sta(2,2)]
Block Nmix # neutralino mixing matrix
   1  1    -9.96564416E-01   # Re[N(1,1)]
   1  2     3.99694288E-03   # Re[N(1,2)]
   1  3    -6.47578129E-02   # Re[N(1,3)]
   1  4     5.14763437E-02   # Re[N(1,4)]
   2  1    -8.22380163E-02   # Re[N(2,1)]
   2  2    -8.58741555E-02   # Re[N(2,2)]
   2  3     7.02493079E-01   # Re[N(2,3)]
   2  4    -7.01687974E-01   # Re[N(2,4)]
   3  1    -9.34918767E-03   # Re[N(3,1)]
   3  2     1.20544763E-02   # Re[N(3,2)]
   3  3     7.06808738E-01   # Re[N(3,3)]
   3  4     7.07240192E-01   # Re[N(3,4)]
   4  1    -2.97744933E-03   # Re[N(4,1)]
   4  2     9.96225047E-01   # Re[N(4,2)]
   4  3     5.22619103E-02   # Re[N(4,3)]
   4  4    -6.92494337E-02   # Re[N(4,4)]
Block Umix # chargino mixing matrix
   1  1    -7.39276572E-02   # Re[U(1,1)]
   1  2     9.97263607E-01   # Re[U(1,2)]
   2  1     9.97263607E-01   # Re[U(2,1)]
   2  2     7.39276572E-02   # Re[U(2,2)]
Block Vmix # chargino mixing matrix
   1  1    -9.79427591E-02   # Re[V(1,1)]
   1  2     9.95192050E-01   # Re[V(1,2)]
   2  1     9.95192050E-01   # Re[V(2,1)]
   2  2     9.79427591E-02   # Re[V(2,2)]
DECAY        23     2.49520000E+00   # Z
DECAY        24     2.08500000E+00   # W
DECAY   2000011     6.59207060E-14   # ~e^-_R
#    BR                NDA      ID1      ID2
     9.26941129E-07    2     1000039        11   # BR(~e^-_R -> ~G e^-)
#    BR                NDA      ID1      ID2       ID3
     3.39091129E-01    3     1000015        11       -15   # BR(~e^-_R -> ~tau^-_1 e^- tau^+)
     6.60907944E-01    3    -1000015        15        11   # BR(~e^-_R -> ~tau^+_1 tau^- e^-)
     9.17229815E-12    3     1000015        12       -16   # BR(~e^-_R -> ~tau^-_1 nu_e nu_bar_tau)
DECAY   1000011     6.36879243E-01   # ~e^-_L
#    BR                NDA      ID1      ID2
     9.93693432E-01    2     1000022        11   # BR(~e^-_L -> chi^0_1 e^-)
     3.84840141E-03    2     1000023        11   # BR(~e^-_L -> chi^0_2 e^-)
     9.17203030E-06    2     1000025        11   # BR(~e^-_L -> chi^0_3 e^-)
     2.44896561E-03    2    -1000024        12   # BR(~e^-_L -> chi^-_1 nu_e)
     1.44620163E-08    2     2000011        23   # BR(~e^-_L -> ~e^-_R Z)
     1.44815452E-08    2     2000011        25   # BR(~e^-_L -> ~e^-_R h^0)
#    BR                NDA      ID1      ID2       ID3
     5.23064496E-11    3     1000012         1        -2   # BR(~e^-_L -> ~nu_e d u_bar)
     7.95332842E-12    3     1000012         3        -4   # BR(~e^-_L -> ~nu_e s c_bar)
DECAY   2000013     6.43616174E-14   # ~mu^-_R
#    BR                NDA      ID1      ID2
     9.49295413E-07    2     1000039        13   # BR(~mu^-_R -> ~G mu^-)
#    BR                NDA      ID1      ID2       ID3
     3.39073967E-01    3     1000015        13       -15   # BR(~mu^-_R -> ~tau^-_1 mu^- tau^+)
     6.60924689E-01    3    -1000015        15        13   # BR(~mu^-_R -> ~tau^+_1 tau^- mu^-)
     3.94616971E-07    3     1000015        14       -16   # BR(~mu^-_R -> ~tau^-_1 nu_mu nu_bar_tau)
DECAY   1000013     6.37682340E-01   # ~mu^-_L
#    BR                NDA      ID1      ID2
     9.92431288E-01    2     1000022        13   # BR(~mu^-_L -> chi^0_1 mu^-)
     3.86086375E-03    2     1000023        13   # BR(~mu^-_L -> chi^0_2 mu^-)
     2.66650217E-05    2     1000025        13   # BR(~mu^-_L -> chi^0_3 mu^-)
     2.44529591E-03    2    -1000024        14   # BR(~mu^-_L -> chi^-_1 nu_mu)
     6.17526718E-04    2     2000013        23   # BR(~mu^-_L -> ~mu^-_R Z)
     6.18360383E-04    2     2000013        25   # BR(~mu^-_L -> ~mu^-_R h^0)
#    BR                NDA      ID1      ID2       ID3
     5.22834392E-11    3     1000014         1        -2   # BR(~mu^-_L -> ~nu_mu d u_bar)
     7.95569753E-12    3     1000014         3        -4   # BR(~mu^-_L -> ~nu_mu s c_bar)
DECAY   1000015     5.93041658E-20   # ~tau^-_1
#    BR                NDA      ID1      ID2
     1.00000000E+00    2     1000039        15   # BR(~tau^-_1 -> ~G tau^-)
DECAY   2000015     8.64792470E-01   # ~tau^-_2
#    BR                NDA      ID1      ID2
     7.29579616E-01    2     1000022        15   # BR(~tau^-_2 -> chi^0_1 tau^-)
     6.37546254E-03    2     1000023        15   # BR(~tau^-_2 -> chi^0_2 tau^-)
     3.58550890E-03    2     1000025        15   # BR(~tau^-_2 -> chi^0_3 tau^-)
     1.68444879E-03    2    -1000024        16   # BR(~tau^-_2 -> chi^-_1 nu_tau)
     1.29306539E-01    2     1000015        23   # BR(~tau^-_2 -> ~tau^-_1 Z)
     1.29468425E-01    2     1000015        25   # BR(~tau^-_2 -> ~tau^-_1 h^0)
#    BR                NDA      ID1      ID2       ID3
     4.83043473E-11    3     1000016         1        -2   # BR(~tau^-_2 -> ~nu_tau d u_bar)
     8.88562042E-12    3     1000016         3        -4   # BR(~tau^-_2 -> ~nu_tau s c_bar)
DECAY   1000012     6.50009161E-01   # ~nu_e
#    BR                NDA      ID1      ID2
     9.95548951E-01    2     1000022        12   # BR(~nu_e -> chi^0_1 nu_e)
     3.04061701E-04    2     1000023        12   # BR(~nu_e -> chi^0_2 nu_e)
     5.97338775E-05    2     1000025        12   # BR(~nu_e -> chi^0_3 nu_e)
     4.08722639E-03    2     1000024        11   # BR(~nu_e -> chi^+_1 e^-)
     2.72869115E-08    2     2000011        24   # BR(~nu_e -> ~e^-_R W^+)
DECAY   1000014     6.50781584E-01   # ~nu_mu
#    BR                NDA      ID1      ID2
     9.94354078E-01    2     1000022        14   # BR(~nu_mu -> chi^0_1 nu_mu)
     3.03678362E-04    2     1000023        14   # BR(~nu_mu -> chi^0_2 nu_mu)
     5.96584513E-05    2     1000025        14   # BR(~nu_mu -> chi^0_3 nu_mu)
     4.11735253E-03    2     1000024        13   # BR(~nu_mu -> chi^+_1 mu^-)
     1.16523253E-03    2     2000013        24   # BR(~nu_mu -> ~mu^-_R W^+)
DECAY   1000016     8.69183409E-01   # ~nu_tau
#    BR                NDA      ID1      ID2
     7.41708178E-01    2     1000022        16   # BR(~nu_tau -> chi^0_1 nu_tau)
     2.22658750E-04    2     1000023        16   # BR(~nu_tau -> chi^0_2 nu_tau)
     4.37172692E-05    2     1000025        16   # BR(~nu_tau -> chi^0_3 nu_tau)
     1.03113833E-02    2     1000024        15   # BR(~nu_tau -> chi^+_1 tau^-)
     2.47714063E-01    2     1000015        24   # BR(~nu_tau -> ~tau^-_1 W^+)
DECAY   2000001     2.82881042E+00   # ~d_R
#    BR                NDA      ID1      ID2
     9.93762579E-01    2     1000022         1   # BR(~d_R -> chi^0_1 d)
     6.15091460E-03    2     1000023         1   # BR(~d_R -> chi^0_2 d)
     7.96679434E-05    2     1000025         1   # BR(~d_R -> chi^0_3 d)
     6.35233743E-06    2     1000035         1   # BR(~d_R -> chi^0_4 d)
     4.86359848E-07    2    -1000024         2   # BR(~d_R -> chi^-_1 u)
     7.73181878E-12    2    -1000037         2   # BR(~d_R -> chi^-_2 u)
DECAY   1000001     4.62532686E+01   # ~d_L
#    BR                NDA      ID1      ID2
     1.68614385E-02    2     1000022         1   # BR(~d_L -> chi^0_1 d)
     1.98590822E-03    2     1000023         1   # BR(~d_L -> chi^0_2 d)
     7.75860322E-05    2     1000025         1   # BR(~d_L -> chi^0_3 d)
     3.25349739E-01    2     1000035         1   # BR(~d_L -> chi^0_4 d)
     4.42452363E-03    2    -1000024         2   # BR(~d_L -> chi^-_1 u)
     6.51300804E-01    2    -1000037         2   # BR(~d_L -> chi^-_2 u)
     1.10296259E-12    2     2000002       -24   # BR(~d_L -> ~u_R W^-)
     1.84997769E-10    2     2000001        23   # BR(~d_L -> ~d_R Z)
     1.78860011E-10    2     2000001        25   # BR(~d_L -> ~d_R h^0)
DECAY   2000003     2.82979729E+00   # ~s_R
#    BR                NDA      ID1      ID2
     9.93416654E-01    2     1000022         3   # BR(~s_R -> chi^0_1 s)
     6.23515495E-03    2     1000023         3   # BR(~s_R -> chi^0_2 s)
     1.66322809E-04    2     1000025         3   # BR(~s_R -> chi^0_3 s)
     6.35070905E-06    2     1000035         3   # BR(~s_R -> chi^0_4 s)
     1.75514308E-04    2    -1000024         4   # BR(~s_R -> chi^-_1 c)
     2.78991232E-09    2    -1000037         4   # BR(~s_R -> chi^-_2 c)
DECAY   1000003     4.62548106E+01   # ~s_L
#    BR                NDA      ID1      ID2
     1.68608681E-02    2     1000022         3   # BR(~s_L -> chi^0_1 s)
     1.99145944E-03    2     1000023         3   # BR(~s_L -> chi^0_2 s)
     8.33149711E-05    2     1000025         3   # BR(~s_L -> chi^0_3 s)
     3.25338423E-01    2     1000035         3   # BR(~s_L -> chi^0_4 s)
     4.44718155E-03    2    -1000024         4   # BR(~s_L -> chi^-_1 c)
     6.51278337E-01    2    -1000037         4   # BR(~s_L -> chi^-_2 c)
     2.84627658E-07    2     2000004       -24   # BR(~s_L -> ~c_R W^-)
     6.67815790E-08    2     2000003        23   # BR(~s_L -> ~s_R Z)
     6.45659573E-08    2     2000003        25   # BR(~s_L -> ~s_R h^0)
DECAY   1000005     5.56340482E+00   # ~b_1
#    BR                NDA      ID1      ID2
     5.07418662E-01    2     1000022         5   # BR(~b_1 -> chi^0_1 b)
     1.20470888E-01    2     1000023         5   # BR(~b_1 -> chi^0_2 b)
     1.16111107E-01    2     1000025         5   # BR(~b_1 -> chi^0_3 b)
     1.40821420E-03    2     1000035         5   # BR(~b_1 -> chi^0_4 b)
     2.51449551E-01    2    -1000024         6   # BR(~b_1 -> chi^-_1 t)
     2.96710083E-03    2    -1000037         6   # BR(~b_1 -> chi^-_2 t)
     1.74477408E-04    2     1000006       -24   # BR(~b_1 -> ~t_1 W^-)
DECAY   2000005     1.05647718E+02   # ~b_2
#    BR                NDA      ID1      ID2
     7.01945991E-03    2     1000022         5   # BR(~b_2 -> chi^0_1 b)
     6.97786437E-03    2     1000023         5   # BR(~b_2 -> chi^0_2 b)
     6.39587822E-03    2     1000025         5   # BR(~b_2 -> chi^0_3 b)
     1.33264917E-01    2     1000035         5   # BR(~b_2 -> chi^0_4 b)
     5.60920376E-01    2    -1000024         6   # BR(~b_2 -> chi^-_1 t)
     2.72561778E-01    2    -1000037         6   # BR(~b_2 -> chi^-_2 t)
     1.28574843E-02    2     1000006       -24   # BR(~b_2 -> ~t_1 W^-)
     2.24177372E-06    2     1000005        23   # BR(~b_2 -> ~b_1 Z)
DECAY   2000002     1.13774082E+01   # ~u_R
#    BR                NDA      ID1      ID2
     9.93757870E-01    2     1000022         2   # BR(~u_R -> chi^0_1 u)
     6.15625631E-03    2     1000023         2   # BR(~u_R -> chi^0_2 u)
     7.94999617E-05    2     1000025         2   # BR(~u_R -> chi^0_3 u)
     6.37383873E-06    2     1000035         2   # BR(~u_R -> chi^0_4 u)
     3.44947284E-10    2     1000024         1   # BR(~u_R -> chi^+_1 d)
DECAY   1000002     4.62771745E+01   # ~u_L
#    BR                NDA      ID1      ID2
     1.55015386E-02    2     1000022         2   # BR(~u_L -> chi^0_1 u)
     4.18044819E-03    2     1000023         2   # BR(~u_L -> chi^0_2 u)
     4.25027491E-05    2     1000025         2   # BR(~u_L -> chi^0_3 u)
     3.24373959E-01    2     1000035         2   # BR(~u_L -> chi^0_4 u)
     7.76093693E-03    2     1000024         1   # BR(~u_L -> chi^+_1 d)
     6.48140615E-01    2     1000037         1   # BR(~u_L -> chi^+_2 d)
     3.68552917E-10    2     2000001        24   # BR(~u_L -> ~d_R W^+)
     5.40960011E-13    2     2000002        23   # BR(~u_L -> ~u_R Z)
     3.95739144E-13    2     2000002        25   # BR(~u_L -> ~u_R h^0)
DECAY   2000004     1.13794106E+01   # ~c_R
#    BR                NDA      ID1      ID2
     9.93581673E-01    2     1000022         4   # BR(~c_R -> chi^0_1 c)
     6.19912553E-03    2     1000023         4   # BR(~c_R -> chi^0_2 c)
     1.23799995E-04    2     1000025         4   # BR(~c_R -> chi^0_3 c)
     6.38054872E-06    2     1000035         4   # BR(~c_R -> chi^0_4 c)
     8.90026589E-05    2     1000024         3   # BR(~c_R -> chi^+_1 s)
     1.81263057E-08    2     1000037         3   # BR(~c_R -> chi^+_2 s)
DECAY   1000004     4.62787086E+01   # ~c_L
#    BR                NDA      ID1      ID2
     1.55010347E-02    2     1000022         4   # BR(~c_L -> chi^0_1 c)
     4.19159767E-03    2     1000023         4   # BR(~c_L -> chi^0_2 c)
     5.40802526E-05    2     1000025         4   # BR(~c_L -> chi^0_3 c)
     3.24362900E-01    2     1000035         4   # BR(~c_L -> chi^0_4 c)
     7.77168059E-03    2     1000024         3   # BR(~c_L -> chi^+_1 s)
     6.48118332E-01    2     1000037         3   # BR(~c_L -> chi^+_2 s)
     1.33042548E-07    2     2000003        24   # BR(~c_L -> ~s_R W^+)
     1.39598980E-07    2     2000004        23   # BR(~c_L -> ~c_R Z)
     1.02123554E-07    2     2000004        25   # BR(~c_L -> ~c_R h^0)
DECAY   1000006     1.15285946E+02   # ~t_1
#    BR                NDA      ID1      ID2
     2.34849339E-08    2     1000022         4   # BR(~t_1 -> chi^0_1 c)
     9.04083437E-02    2     1000022         6   # BR(~t_1 -> chi^0_1 t)
     6.16794464E-09    2     1000023         4   # BR(~t_1 -> chi^0_2 c)
     2.25119348E-01    2     1000023         6   # BR(~t_1 -> chi^0_2 t)
     2.28366319E-01    2     1000025         6   # BR(~t_1 -> chi^0_3 t)
     5.00276797E-04    2     1000035         6   # BR(~t_1 -> chi^0_4 t)
     4.54593137E-01    2     1000024         5   # BR(~t_1 -> chi^+_1 b)
     1.00709009E-03    2     1000037         5   # BR(~t_1 -> chi^+_2 b)
#    BR                NDA      ID1      ID2       ID3
     5.45709572E-06    3     1000022        24         5   # BR(~t_1 -> chi^0_1 W^+ b)
DECAY   2000006     1.05697415E+02   # ~t_2
#    BR                NDA      ID1      ID2
     7.38424826E-03    2     1000022         6   # BR(~t_2 -> chi^0_1 t)
     2.79583799E-01    2     1000023         6   # BR(~t_2 -> chi^0_2 t)
     2.82246671E-01    2     1000025         6   # BR(~t_2 -> chi^0_3 t)
     1.37479387E-01    2     1000035         6   # BR(~t_2 -> chi^0_4 t)
     1.27604500E-02    2     1000024         5   # BR(~t_2 -> chi^+_1 b)
     2.68917469E-01    2     1000037         5   # BR(~t_2 -> chi^+_2 b)
     1.70389488E-05    2     1000005        24   # BR(~t_2 -> ~b_1 W^+)
     6.67722254E-03    2     1000006        23   # BR(~t_2 -> ~t_1 Z)
     4.93371421E-03    2     1000006        25   # BR(~t_2 -> ~t_1 h^0)
DECAY   1000024     9.09326930E-01   # chi^+_1
#    BR                NDA      ID1      ID2
     7.50922121E-09    2    -2000011        12   # BR(chi^+_1 -> ~e^+_R nu_e)
     3.21053924E-04    2    -2000013        14   # BR(chi^+_1 -> ~mu^+_R nu_mu)
     9.16942435E-02    2    -1000015        16   # BR(chi^+_1 -> ~tau^+_1 nu_tau)
     9.03518789E-01    2     1000022        24   # BR(chi^+_1 -> chi^0_1 W^+)
#    BR                NDA      ID1      ID2       ID3
     1.48958057E-10    3     1000022        -1         2   # BR(chi^+_1 -> chi^0_1 d_bar u)
     1.66210753E-10    3     1000022        -3         4   # BR(chi^+_1 -> chi^0_1 s_bar c)
     4.46417385E-03    3     1000022        -5         6   # BR(chi^+_1 -> chi^0_1 b_bar t)
     3.54878182E-07    3     1000022       -11        12   # BR(chi^+_1 -> chi^0_1 e^+ nu_e)
     3.57249346E-07    3     1000022       -13        14   # BR(chi^+_1 -> chi^0_1 mu^+ nu_mu)
     1.02016918E-06    3     1000022       -15        16   # BR(chi^+_1 -> chi^0_1 tau^+ nu_tau)
DECAY   1000037     2.67168392E+01   # chi^+_2
#    BR                NDA      ID1      ID2
     6.39489859E-02    2    -1000011        12   # BR(chi^+_2 -> ~e^+_L nu_e)
     3.87488540E-11    2    -2000013        14   # BR(chi^+_2 -> ~mu^+_R nu_mu)
     6.39499216E-02    2    -1000013        14   # BR(chi^+_2 -> ~mu^+_L nu_mu)
     8.47546360E-09    2    -1000015        16   # BR(chi^+_2 -> ~tau^+_1 nu_tau)
     6.42138064E-02    2    -2000015        16   # BR(chi^+_2 -> ~tau^+_2 nu_tau)
     6.40880891E-02    2     1000012       -11   # BR(chi^+_2 -> ~nu_e e^+)
     6.40890705E-02    2     1000014       -13   # BR(chi^+_2 -> ~nu_mu mu^+)
     6.43658197E-02    2     1000016       -15   # BR(chi^+_2 -> ~nu_tau tau^+)
     6.35400066E-05    2     1000022        24   # BR(chi^+_2 -> chi^0_1 W^+)
     1.49927948E-01    2     1000023        24   # BR(chi^+_2 -> chi^0_2 W^+)
     1.48816848E-01    2     1000025        24   # BR(chi^+_2 -> chi^0_3 W^+)
     1.55108430E-01    2     1000024        23   # BR(chi^+_2 -> chi^+_1 Z)
     1.55520103E-01    2     1000024        25   # BR(chi^+_2 -> chi^+_1 h^0)
#    BR                NDA      ID1      ID2       ID3
     9.65965909E-10    3     1000024         2        -2   # BR(chi^+_2 -> chi^+_1 u u_bar)
     9.71274458E-10    3     1000024         4        -4   # BR(chi^+_2 -> chi^+_1 c c_bar)
     1.84933000E-03    3     1000024         6        -6   # BR(chi^+_2 -> chi^+_1 t t_bar)
     1.68937621E-09    3     1000024         1        -1   # BR(chi^+_2 -> chi^+_1 d d_bar)
     1.74495332E-09    3     1000024         3        -3   # BR(chi^+_2 -> chi^+_1 s s_bar)
     1.52711005E-07    3     1000024         5        -5   # BR(chi^+_2 -> chi^+_1 b b_bar)
     8.55888514E-11    3     1000024        13       -13   # BR(chi^+_2 -> chi^+_1 mu^- mu^+)
     2.42106358E-08    3     1000024        15       -15   # BR(chi^+_2 -> chi^+_1 tau^- tau^+)
     6.49012070E-08    3     1000022        -1         2   # BR(chi^+_2 -> chi^0_1 d_bar u)
     6.49013988E-08    3     1000022        -3         4   # BR(chi^+_2 -> chi^0_1 s_bar c)
     1.76732033E-06    3     1000022        -5         6   # BR(chi^+_2 -> chi^0_1 b_bar t)
     9.68897224E-13    3     1000022       -13        14   # BR(chi^+_2 -> chi^0_1 mu^+ nu_mu)
     2.76336212E-10    3     1000022       -15        16   # BR(chi^+_2 -> chi^0_1 tau^+ nu_tau)
     7.25108443E-10    3     1000023        -1         2   # BR(chi^+_2 -> chi^0_2 d_bar u)
     7.48850944E-10    3     1000023        -3         4   # BR(chi^+_2 -> chi^0_2 s_bar c)
     2.04674060E-03    3     1000023        -5         6   # BR(chi^+_2 -> chi^0_2 b_bar t)
     4.27922589E-11    3     1000023       -13        14   # BR(chi^+_2 -> chi^0_2 mu^+ nu_mu)
     1.21046766E-08    3     1000023       -15        16   # BR(chi^+_2 -> chi^0_2 tau^+ nu_tau)
     3.71727983E-11    3     1000025        -1         2   # BR(chi^+_2 -> chi^0_3 d_bar u)
     5.99664203E-11    3     1000025        -3         4   # BR(chi^+_2 -> chi^0_3 s_bar c)
     2.00925305E-03    3     1000025        -5         6   # BR(chi^+_2 -> chi^0_3 b_bar t)
     4.15569266E-11    3     1000025       -13        14   # BR(chi^+_2 -> chi^0_3 mu^+ nu_mu)
     1.17555058E-08    3     1000025       -15        16   # BR(chi^+_2 -> chi^0_3 tau^+ nu_tau)
DECAY   1000022     4.80104251E+00   # chi^0_1
#    BR                NDA      ID1      ID2
     1.65242713E-01    2     2000011       -11   # BR(chi^0_1 -> ~e^-_R e^+)
     1.65242713E-01    2    -2000011        11   # BR(chi^0_1 -> ~e^+_R e^-)
     1.65257674E-01    2     2000013       -13   # BR(chi^0_1 -> ~mu^-_R mu^+)
     1.65257674E-01    2    -2000013        13   # BR(chi^0_1 -> ~mu^+_R mu^-)
     1.69499613E-01    2     1000015       -15   # BR(chi^0_1 -> ~tau^-_1 tau^+)
     1.69499613E-01    2    -1000015        15   # BR(chi^0_1 -> ~tau^+_1 tau^-)
DECAY   1000023     1.06722656E+00   # chi^0_2
#    BR                NDA      ID1      ID2
     1.44923553E-02    2     2000011       -11   # BR(chi^0_2 -> ~e^-_R e^+)
     1.44923553E-02    2    -2000011        11   # BR(chi^0_2 -> ~e^+_R e^-)
     1.46278678E-02    2     2000013       -13   # BR(chi^0_2 -> ~mu^-_R mu^+)
     1.46278678E-02    2    -2000013        13   # BR(chi^0_2 -> ~mu^+_R mu^-)
     5.32025578E-02    2     1000015       -15   # BR(chi^0_2 -> ~tau^-_1 tau^+)
     5.32025578E-02    2    -1000015        15   # BR(chi^0_2 -> ~tau^+_1 tau^-)
     1.15651951E-02    2     1000022        23   # BR(chi^0_2 -> chi^0_1 Z)
     8.23625929E-01    2     1000022        25   # BR(chi^0_2 -> chi^0_1 h^0)
     1.72909748E-07    2     1000022        22   # BR(chi^0_2 -> chi^0_1 photon)
#    BR                NDA      ID1      ID2       ID3
     7.78239307E-10    3     1000022         2        -2   # BR(chi^0_2 -> chi^0_1 u u_bar)
     7.81116747E-10    3     1000022         4        -4   # BR(chi^0_2 -> chi^0_1 c c_bar)
     1.60011258E-04    3     1000022         6        -6   # BR(chi^0_2 -> chi^0_1 t t_bar)
     8.91808879E-11    3     1000022         1        -1   # BR(chi^0_2 -> chi^0_1 d d_bar)
     1.07367124E-10    3     1000022         3        -3   # BR(chi^0_2 -> chi^0_1 s s_bar)
     4.84984182E-08    3     1000022         5        -5   # BR(chi^0_2 -> chi^0_1 b b_bar)
     8.31012953E-07    3     1000022        11       -11   # BR(chi^0_2 -> chi^0_1 e^- e^+)
     8.32801809E-07    3     1000022        13       -13   # BR(chi^0_2 -> chi^0_1 mu^- mu^+)
     1.32056732E-06    3     1000022        15       -15   # BR(chi^0_2 -> chi^0_1 tau^- tau^+)
     9.51909591E-08    3     1000022        12       -12   # BR(chi^0_2 -> chi^0_1 nu_e nu_bar_e)
     2.47531636E-11    3     1000024         1        -2   # BR(chi^0_2 -> chi^+_1 d u_bar)
     2.47531636E-11    3    -1000024        -1         2   # BR(chi^0_2 -> chi^-_1 d_bar u)
     5.38294540E-12    3     1000024         3        -4   # BR(chi^0_2 -> chi^+_1 s c_bar)
     5.38294540E-12    3    -1000024        -3         4   # BR(chi^0_2 -> chi^-_1 s_bar c)
     8.25283717E-12    3     1000024        11       -12   # BR(chi^0_2 -> chi^+_1 e^- nu_bar_e)
     8.25283717E-12    3    -1000024       -11        12   # BR(chi^0_2 -> chi^-_1 e^+ nu_e)
     8.16799637E-12    3     1000024        13       -14   # BR(chi^0_2 -> chi^+_1 mu^- nu_bar_mu)
     8.16799637E-12    3    -1000024       -13        14   # BR(chi^0_2 -> chi^-_1 mu^+ nu_mu)
     2.47970108E-13    3     1000024        15       -16   # BR(chi^0_2 -> chi^+_1 tau^- nu_bar_tau)
     2.47970108E-13    3    -1000024       -15        16   # BR(chi^0_2 -> chi^-_1 tau^+ nu_tau)
DECAY   1000025     9.44979810E-01   # chi^0_3
#    BR                NDA      ID1      ID2
     2.12557069E-04    2     2000011       -11   # BR(chi^0_3 -> ~e^-_R e^+)
     2.12557069E-04    2    -2000011        11   # BR(chi^0_3 -> ~e^+_R e^-)
     3.66981032E-04    2     2000013       -13   # BR(chi^0_3 -> ~mu^-_R mu^+)
     3.66981032E-04    2    -2000013        13   # BR(chi^0_3 -> ~mu^+_R mu^-)
     4.43179641E-02    2     1000015       -15   # BR(chi^0_3 -> ~tau^-_1 tau^+)
     4.43179641E-02    2    -1000015        15   # BR(chi^0_3 -> ~tau^+_1 tau^-)
     8.97773689E-01    2     1000022        23   # BR(chi^0_3 -> chi^0_1 Z)
     1.16711080E-02    2     1000022        25   # BR(chi^0_3 -> chi^0_1 h^0)
     4.58664920E-07    2     1000022        22   # BR(chi^0_3 -> chi^0_1 photon)
     8.50915672E-12    2     1000023        22   # BR(chi^0_3 -> chi^0_2 photon)
#    BR                NDA      ID1      ID2       ID3
     3.92674101E-12    3     1000022         2        -2   # BR(chi^0_3 -> chi^0_1 u u_bar)
     8.30734651E-12    3     1000022         4        -4   # BR(chi^0_3 -> chi^0_1 c c_bar)
     7.59051331E-04    3     1000022         6        -6   # BR(chi^0_3 -> chi^0_1 t t_bar)
     9.91463568E-13    3     1000022         1        -1   # BR(chi^0_3 -> chi^0_1 d d_bar)
     2.21201771E-11    3     1000022         3        -3   # BR(chi^0_3 -> chi^0_1 s s_bar)
     5.62684659E-08    3     1000022         5        -5   # BR(chi^0_3 -> chi^0_1 b b_bar)
     2.90881287E-09    3     1000022        11       -11   # BR(chi^0_3 -> chi^0_1 e^- e^+)
     5.06111877E-09    3     1000022        13       -13   # BR(chi^0_3 -> chi^0_1 mu^- mu^+)
     6.04354335E-07    3     1000022        15       -15   # BR(chi^0_3 -> chi^0_1 tau^- tau^+)
     9.53264753E-09    3     1000022        12       -12   # BR(chi^0_3 -> chi^0_1 nu_e nu_bar_e)
     3.57223705E-11    3     1000023         2        -2   # BR(chi^0_3 -> chi^0_2 u u_bar)
     4.93404598E-12    3     1000023         4        -4   # BR(chi^0_3 -> chi^0_2 c c_bar)
     4.64319799E-11    3     1000023         1        -1   # BR(chi^0_3 -> chi^0_2 d d_bar)
     4.60848305E-11    3     1000023         3        -3   # BR(chi^0_3 -> chi^0_2 s s_bar)
     1.07103253E-11    3     1000023        11       -11   # BR(chi^0_3 -> chi^0_2 e^- e^+)
     1.06478626E-11    3     1000023        13       -13   # BR(chi^0_3 -> chi^0_2 mu^- mu^+)
     6.42650275E-11    3     1000023        12       -12   # BR(chi^0_3 -> chi^0_2 nu_e nu_bar_e)
     1.94593462E-09    3     1000024         1        -2   # BR(chi^0_3 -> chi^+_1 d u_bar)
     1.94593462E-09    3    -1000024        -1         2   # BR(chi^0_3 -> chi^-_1 d_bar u)
     1.49475221E-09    3     1000024         3        -4   # BR(chi^0_3 -> chi^+_1 s c_bar)
     1.49475221E-09    3    -1000024        -3         4   # BR(chi^0_3 -> chi^-_1 s_bar c)
     6.48656410E-10    3     1000024        11       -12   # BR(chi^0_3 -> chi^+_1 e^- nu_bar_e)
     6.48656410E-10    3    -1000024       -11        12   # BR(chi^0_3 -> chi^-_1 e^+ nu_e)
     6.47430688E-10    3     1000024        13       -14   # BR(chi^0_3 -> chi^+_1 mu^- nu_bar_mu)
     6.47430688E-10    3    -1000024       -13        14   # BR(chi^0_3 -> chi^-_1 mu^+ nu_mu)
     3.88776803E-10    3     1000024        15       -16   # BR(chi^0_3 -> chi^+_1 tau^- nu_bar_tau)
     3.88776803E-10    3    -1000024       -15        16   # BR(chi^0_3 -> chi^-_1 tau^+ nu_tau)
DECAY   1000035     2.67369351E+01   # chi^0_4
#    BR                NDA      ID1      ID2
     1.55855955E-06    2     2000011       -11   # BR(chi^0_4 -> ~e^-_R e^+)
     1.55855955E-06    2    -2000011        11   # BR(chi^0_4 -> ~e^+_R e^-)
     3.17715067E-02    2     1000011       -11   # BR(chi^0_4 -> ~e^-_L e^+)
     3.17715067E-02    2    -1000011        11   # BR(chi^0_4 -> ~e^+_L e^-)
     1.55816722E-06    2     2000013       -13   # BR(chi^0_4 -> ~mu^-_R mu^+)
     1.55816722E-06    2    -2000013        13   # BR(chi^0_4 -> ~mu^+_R mu^-)
     3.17719772E-02    2     1000013       -13   # BR(chi^0_4 -> ~mu^-_L mu^+)
     3.17719772E-02    2    -1000013        13   # BR(chi^0_4 -> ~mu^+_L mu^-)
     1.44861834E-06    2     1000015       -15   # BR(chi^0_4 -> ~tau^-_1 tau^+)
     1.44861834E-06    2    -1000015        15   # BR(chi^0_4 -> ~tau^+_1 tau^-)
     3.19046712E-02    2     2000015       -15   # BR(chi^0_4 -> ~tau^-_2 tau^+)
     3.19046712E-02    2    -2000015        15   # BR(chi^0_4 -> ~tau^+_2 tau^-)
     3.21945630E-02    2     1000012       -12   # BR(chi^0_4 -> ~nu_e nu_bar_e)
     3.21945630E-02    2    -1000012        12   # BR(chi^0_4 -> ~nu^*_e nu_e)
     3.21950506E-02    2     1000014       -14   # BR(chi^0_4 -> ~nu_mu nu_bar_mu)
     3.21950506E-02    2    -1000014        14   # BR(chi^0_4 -> ~nu^*_mu nu_mu)
     3.23325151E-02    2     1000016       -16   # BR(chi^0_4 -> ~nu_tau nu_bar_tau)
     3.23325151E-02    2    -1000016        16   # BR(chi^0_4 -> ~nu^*_tau nu_tau)
     1.50537849E-01    2     1000024       -24   # BR(chi^0_4 -> chi^+_1 W^-)
     1.50537849E-01    2    -1000024        24   # BR(chi^0_4 -> chi^-_1 W^+)
     2.04472159E-06    2     1000022        23   # BR(chi^0_4 -> chi^0_1 Z)
     3.04384233E-03    2     1000023        23   # BR(chi^0_4 -> chi^0_2 Z)
     1.50077113E-01    2     1000025        23   # BR(chi^0_4 -> chi^0_3 Z)
     6.66042630E-05    2     1000022        25   # BR(chi^0_4 -> chi^0_1 h^0)
     1.52642386E-01    2     1000023        25   # BR(chi^0_4 -> chi^0_2 h^0)
     2.87674623E-03    2     1000025        25   # BR(chi^0_4 -> chi^0_3 h^0)
     8.82856032E-08    2     1000022        22   # BR(chi^0_4 -> chi^0_1 photon)
     2.41939077E-07    2     1000023        22   # BR(chi^0_4 -> chi^0_2 photon)
     4.32600049E-07    2     1000025        22   # BR(chi^0_4 -> chi^0_3 photon)
#    BR                NDA      ID1      ID2       ID3
     3.10513738E-08    3     1000022         2        -2   # BR(chi^0_4 -> chi^0_1 u u_bar)
     3.10510311E-08    3     1000022         4        -4   # BR(chi^0_4 -> chi^0_1 c c_bar)
     9.04261669E-07    3     1000022         6        -6   # BR(chi^0_4 -> chi^0_1 t t_bar)
     3.38129156E-08    3     1000022         1        -1   # BR(chi^0_4 -> chi^0_1 d d_bar)
     3.38136667E-08    3     1000022         3        -3   # BR(chi^0_4 -> chi^0_1 s s_bar)
     4.11757332E-08    3     1000022         5        -5   # BR(chi^0_4 -> chi^0_1 b b_bar)
     6.86111750E-10    3     1000022        11       -11   # BR(chi^0_4 -> chi^0_1 e^- e^+)
     6.86849453E-10    3     1000022        13       -13   # BR(chi^0_4 -> chi^0_1 mu^- mu^+)
     8.98957361E-10    3     1000022        15       -15   # BR(chi^0_4 -> chi^0_1 tau^- tau^+)
     1.33215560E-09    3     1000023         2        -2   # BR(chi^0_4 -> chi^0_2 u u_bar)
     1.33339274E-09    3     1000023         4        -4   # BR(chi^0_4 -> chi^0_2 c c_bar)
     6.82585510E-04    3     1000023         6        -6   # BR(chi^0_4 -> chi^0_2 t t_bar)
     6.33653631E-10    3     1000023         1        -1   # BR(chi^0_4 -> chi^0_2 d d_bar)
     6.60821658E-10    3     1000023         3        -3   # BR(chi^0_4 -> chi^0_2 s s_bar)
     7.43520556E-08    3     1000023         5        -5   # BR(chi^0_4 -> chi^0_2 b b_bar)
     3.20948302E-13    3     1000023        11       -11   # BR(chi^0_4 -> chi^0_2 e^- e^+)
     4.18097719E-11    3     1000023        13       -13   # BR(chi^0_4 -> chi^0_2 mu^- mu^+)
     1.17392131E-08    3     1000023        15       -15   # BR(chi^0_4 -> chi^0_2 tau^- tau^+)
     4.61748241E-12    3     1000025         2        -2   # BR(chi^0_4 -> chi^0_3 u u_bar)
     6.48213394E-12    3     1000025         4        -4   # BR(chi^0_4 -> chi^0_3 c c_bar)
     1.11030937E-03    3     1000025         6        -6   # BR(chi^0_4 -> chi^0_3 t t_bar)
     8.51265677E-12    3     1000025         1        -1   # BR(chi^0_4 -> chi^0_3 d d_bar)
     3.57117787E-11    3     1000025         3        -3   # BR(chi^0_4 -> chi^0_3 s s_bar)
     7.37215486E-08    3     1000025         5        -5   # BR(chi^0_4 -> chi^0_3 b b_bar)
     4.15434697E-11    3     1000025        13       -13   # BR(chi^0_4 -> chi^0_3 mu^- mu^+)
     1.17546250E-08    3     1000025        15       -15   # BR(chi^0_4 -> chi^0_3 tau^- tau^+)
     7.08789861E-10    3     1000024         1        -2   # BR(chi^0_4 -> chi^+_1 d u_bar)
     7.08789861E-10    3    -1000024        -1         2   # BR(chi^0_4 -> chi^-_1 d_bar u)
     7.38768156E-10    3     1000024         3        -4   # BR(chi^0_4 -> chi^+_1 s c_bar)
     7.38768156E-10    3    -1000024        -3         4   # BR(chi^0_4 -> chi^-_1 s_bar c)
     2.03546486E-03    3     1000024         5        -6   # BR(chi^0_4 -> chi^+_1 b t_bar)
     2.03546486E-03    3    -1000024        -5         6   # BR(chi^0_4 -> chi^-_1 b_bar t)
     4.33840156E-11    3     1000024        13       -14   # BR(chi^0_4 -> chi^+_1 mu^- nu_bar_mu)
     4.33840156E-11    3    -1000024       -13        14   # BR(chi^0_4 -> chi^-_1 mu^+ nu_mu)
     1.22689663E-08    3     1000024        15       -16   # BR(chi^0_4 -> chi^+_1 tau^- nu_bar_tau)
     1.22689663E-08    3    -1000024       -15        16   # BR(chi^0_4 -> chi^-_1 tau^+ nu_tau)
DECAY   1000021     3.75731288E+01   # ~g
#    BR                NDA      ID1      ID2
     4.68281216E-02    2     2000002        -2   # BR(~g -> ~u_R u_bar)
     4.68281216E-02    2    -2000002         2   # BR(~g -> ~u^*_R u)
     1.36653127E-02    2     1000002        -2   # BR(~g -> ~u_L u_bar)
     1.36653127E-02    2    -1000002         2   # BR(~g -> ~u^*_L u)
     4.68289982E-02    2     2000004        -4   # BR(~g -> ~c_R c_bar)
     4.68289982E-02    2    -2000004         4   # BR(~g -> ~c^*_R c)
     1.36656796E-02    2     1000004        -4   # BR(~g -> ~c_L c_bar)
     1.36656796E-02    2    -1000004         4   # BR(~g -> ~c^*_L c)
     5.76152284E-07    2     1000006        -4   # BR(~g -> ~t_1 c_bar)
     5.76152284E-07    2    -1000006         4   # BR(~g -> ~t^*_1 c)
     1.26067761E-01    2     1000006        -6   # BR(~g -> ~t_1 t_bar)
     1.26067761E-01    2    -1000006         6   # BR(~g -> ~t^*_1 t)
     3.52464806E-02    2     2000006        -6   # BR(~g -> ~t_2 t_bar)
     3.52464806E-02    2    -2000006         6   # BR(~g -> ~t^*_2 t)
     5.07825594E-02    2     2000001        -1   # BR(~g -> ~d_R d_bar)
     5.07825594E-02    2    -2000001         1   # BR(~g -> ~d^*_R d)
     1.36133017E-02    2     1000001        -1   # BR(~g -> ~d_L d_bar)
     1.36133017E-02    2    -1000001         1   # BR(~g -> ~d^*_L d)
     5.07831446E-02    2     2000003        -3   # BR(~g -> ~s_R s_bar)
     5.07831446E-02    2    -2000003         3   # BR(~g -> ~s^*_R s)
     1.36137478E-02    2     1000003        -3   # BR(~g -> ~s_L s_bar)
     1.36137478E-02    2    -1000003         3   # BR(~g -> ~s^*_L s)
     5.23368408E-02    2     1000005        -5   # BR(~g -> ~b_1 b_bar)
     5.23368408E-02    2    -1000005         5   # BR(~g -> ~b^*_1 b)
     3.65226075E-02    2     2000005        -5   # BR(~g -> ~b_2 b_bar)
     3.65226075E-02    2    -2000005         5   # BR(~g -> ~b^*_2 b)
     1.83949547E-07    2     1000039        21   # BR(~g -> ~G g)
     2.71857402E-06    2     1000022        21   # BR(~g -> chi^0_1 g)
     4.28572083E-05    2     1000023        21   # BR(~g -> chi^0_2 g)
     4.34008433E-05    2     1000025        21   # BR(~g -> chi^0_3 g)
     5.76073022E-07    2     1000035        21   # BR(~g -> chi^0_4 g)
DECAY        25     3.20017634E-03   # h^0
#    BR                NDA      ID1      ID2
     7.38859051E-09    2          11       -11   # BR(h^0 -> e^- e^+)
     3.15882704E-04    2          13       -13   # BR(h^0 -> mu^- mu^+)
     8.91238265E-02    2          15       -15   # BR(h^0 -> tau^- tau^+)
     6.24874881E-07    2           1        -1   # BR(h^0 -> d d_bar)
     2.25579274E-04    2           3        -3   # BR(h^0 -> s s_bar)
     5.73608533E-01    2           5        -5   # BR(h^0 -> b b_bar)
     1.42253181E-07    2           2        -2   # BR(h^0 -> u u_bar)
     3.67030369E-02    2           4        -4   # BR(h^0 -> c c_bar)
     9.15624088E-02    2          21        21   # BR(h^0 -> g g)
     3.32501542E-03    2          22        22   # BR(h^0 -> photon photon)
# writing decays into V V* as 3-body decays
#    BR                NDA      ID1      ID2       ID3
     9.24695876E-03    3          24        11        12   # BR(h^0 -> W^+ e^- nu_e)
     9.24695876E-03    3          24        13        14   # BR(h^0 -> W^+ mu^- nu_mu)
     9.24695876E-03    3          24        15        16   # BR(h^0 -> W^+ tau^- nu_tau)
     3.23643556E-02    3          24         1        -2   # BR(h^0 -> W^+ d u_bar)
     3.23643556E-02    3          24         3        -4   # BR(h^0 -> W^+ s c_bar)
     9.24695876E-03    3         -24       -11       -12   # BR(h^0 -> W^- e^+ nu_bar_e)
     9.24695876E-03    3         -24       -13       -14   # BR(h^0 -> W^- mu^+ nu_bar_mu)
     9.24695876E-03    3         -24       -15       -16   # BR(h^0 -> W^- tau^+ nu_bar_tau)
     3.23643556E-02    3         -24        -1         2   # BR(h^0 -> W^- d_bar u)
     3.23643556E-02    3         -24        -3         4   # BR(h^0 -> W^- s_bar c)
     6.78577790E-04    3          23        11       -11   # BR(h^0 -> Z e^- e^+)
     6.78577790E-04    3          23        13       -13   # BR(h^0 -> Z mu^- mu^+)
     6.82616944E-04    3          23        15       -15   # BR(h^0 -> Z tau^- tau^+)
     4.03915351E-03    3          23        12       -12   # BR(h^0 -> Z nu_e nu_bar_e)
     3.15053974E-03    3          23         1        -1   # BR(h^0 -> Z d d_bar)
     3.15053974E-03    3          23         3        -3   # BR(h^0 -> Z s s_bar)
     3.04956090E-03    3          23         5        -5   # BR(h^0 -> Z b b_bar)
     2.34270904E-03    3          23         2        -2   # BR(h^0 -> Z u u_bar)
     2.42349211E-03    3          23         4        -4   # BR(h^0 -> Z c c_bar)
DECAY        35     4.54376715E+00   # H^0
#    BR                NDA      ID1      ID2
     8.59732666E-09    2          11       -11   # BR(H^0 -> e^- e^+)
     3.67562964E-04    2          13       -13   # BR(H^0 -> mu^- mu^+)
     1.03979123E-01    2          15       -15   # BR(H^0 -> tau^- tau^+)
     5.82483596E-07    2           1        -1   # BR(H^0 -> d d_bar)
     2.10276237E-04    2           3        -3   # BR(H^0 -> s s_bar)
     5.55887139E-01    2           5        -5   # BR(H^0 -> b b_bar)
     1.85937484E-11    2           2        -2   # BR(H^0 -> u u_bar)
     4.79836740E-06    2           4        -4   # BR(H^0 -> c c_bar)
     2.77402229E-01    2           6        -6   # BR(H^0 -> t t_bar)
     1.46632946E-05    2     2000011  -2000011   # BR(H^0 -> ~e^-_R ~e^+_R)
     1.46574116E-05    2     2000013  -2000013   # BR(H^0 -> ~mu^-_R ~mu^+_R)
     1.30366481E-05    2     1000015  -1000015   # BR(H^0 -> ~tau^-_1 ~tau^+_1)
     2.15119223E-02    2          23        23   # BR(H^0 -> Z Z)
     4.01293490E-02    2          24       -24   # BR(H^0 -> W^+ W^-)
     3.88958125E-04    2          25        25   # BR(H^0 -> h^0 h^0)
     7.44822151E-05    2          21        21   # BR(H^0 -> g g)
     1.21096880E-06    2          22        22   # BR(H^0 -> photon photon)
DECAY        36     4.26701997E+00   # A^0
#    BR                NDA      ID1      ID2
     9.15517798E-09    2          11       -11   # BR(A^0 -> e^- e^+)
     3.91412880E-04    2          13       -13   # BR(A^0 -> mu^- mu^+)
     1.10726203E-01    2          15       -15   # BR(A^0 -> tau^- tau^+)
     6.20278266E-07    2           1        -1   # BR(A^0 -> d d_bar)
     2.23920211E-04    2           3        -3   # BR(A^0 -> s s_bar)
     5.91956160E-01    2           5        -5   # BR(A^0 -> b b_bar)
     1.96483524E-11    2           2        -2   # BR(A^0 -> u u_bar)
     5.07052370E-06    2           4        -4   # BR(A^0 -> c c_bar)
     2.96460210E-01    2           6        -6   # BR(A^0 -> t t_bar)
     1.85334450E-04    2          25        23   # BR(A^0 -> h^0 Z)
     5.06380374E-05    2          21        21   # BR(A^0 -> g g)
     4.21089331E-07    2          22        22   # BR(A^0 -> photon photon)
DECAY        37     3.77683675E+00   # H^+
#    BR                NDA      ID1      ID2
     1.03481831E-08    2         -11        12   # BR(H^+ -> e^+ nu_e)
     4.42417632E-04    2         -13        12   # BR(H^+ -> mu^+ nu_e)
     1.25154861E-01    2         -15        12   # BR(H^+ -> tau^+ nu_e)
     6.15767211E-07    2          -1         2   # BR(H^+ -> d_bar u)
     2.27318062E-04    2          -3         4   # BR(H^+ -> s_bar c)
     8.73972271E-01    2          -5         6   # BR(H^+ -> b_bar t)
     2.02506703E-04    2          25        24   # BR(H^+ -> h^0 W^+)
DECAY         6     2.43000000E+00   # top
#    BR                NDA      ID1      ID2
     1.00000000E+00    2           5        24   # BR(t -> b W)
Block HiggsBoundsInputHiggsCouplingsFermions
# ScalarNormEffCoupSq PseudoSNormEffCoupSq NP IP1 IP2 IP2
    1.00764260E+00    0.00000000E+00        3  25   5   5  # h0-b-b eff. coupling^2, normalised to SM
    8.93232297E+01    0.00000000E+00        3  35   5   5  # H0-b-b eff. coupling^2, normalised to SM
    0.00000000E+00    8.93308723E+01        3  36   5   5  # A0-b-b eff. coupling^2, normalised to SM
#
    9.99914446E-01    0.00000000E+00        3  25   6   6  # h0-t-t eff. coupling^2, normalised to SM
    1.12798920E-02    0.00000000E+00        3  35   6   6  # H0-t-t eff. coupling^2, normalised to SM
    0.00000000E+00    1.11943382E-02        3  36   6   6  # A0-t-t eff. coupling^2, normalised to SM
#
    1.00764260E+00    0.00000000E+00        3  25  15  15  # h0-tau-tau eff. coupling^2, normalised to SM
    8.93232297E+01    0.00000000E+00        3  35  15  15  # H0-tau-tau eff. coupling^2, normalised to SM
    0.00000000E+00    8.93308723E+01        3  36  15  15  # A0-tau-tau eff. coupling^2, normalised to SM
#
Block HiggsBoundsInputHiggsCouplingsBosons
    9.99999837E-01        3  25  24  24  # h0-W-W eff. coupling^2, normalised to SM
    1.62848539E-07        3  35  24  24  # H0-W-W eff. coupling^2, normalised to SM
    0.00000000E+00        3  36  24  24  # A0-W-W eff. coupling^2, normalised to SM
#
    9.99999837E-01        3  25  23  23  # h0-Z-Z eff. coupling^2, normalised to SM
    1.62848539E-07        3  35  23  23  # H0-Z-Z eff. coupling^2, normalised to SM
    0.00000000E+00        3  36  23  23  # A0-Z-Z eff. coupling^2, normalised to SM
#
    1.14910301E+00        3  25  21  21  # h0-g-g eff. coupling^2, normalised to SM
    7.38863504E-03        3  35  21  21  # H0-g-g eff. coupling^2, normalised to SM
    1.28358151E-01        3  36  21  21  # A0-g-g eff. coupling^2, normalised to SM
#
    0.00000000E+00        3  25  25  23  # h0-h0-Z eff. coupling^2, normalised to SM
    0.00000000E+00        3  35  25  23  # H0-h0-Z eff. coupling^2, normalised to SM
    1.62848539E-07        3  36  25  23  # A0-h0-Z eff. coupling^2, normalised to SM
    0.00000000E+00        3  35  35  23  # H0-H0-Z eff. coupling^2, normalised to SM
    9.99999837E-01        3  36  35  23  # A0-H0-Z eff. coupling^2, normalised to SM
    0.00000000E+00        3  36  36  23  # A0-A0-Z eff. coupling^2, normalised to SM
#
    0.00000000E+00        4  25  21  21  23  # h0-g-g-Z eff. coupling^2, normalised to SM
    0.00000000E+00        4  35  21  21  23  # H0-g-g-Z eff. coupling^2, normalised to SM
    0.00000000E+00        4  36  21  21  23  # A0-g-g-Z eff. coupling^2, normalised to SM
Block SPhenoLowEnergy  # low energy observables
    1    3.25775330E-04   # BR(b -> s gamma)
    2    1.59032830E-06   # BR(b -> s mu+ mu-)
    3    3.52858688E-05   # BR(b -> s nu nu)
    4    2.05905811E-15   # BR(Bd -> e+ e-)
    5    8.79606239E-11   # BR(Bd -> mu+ mu-)
    6    1.84114987E-08   # BR(Bd -> tau+ tau-)
    7    6.93997982E-14   # BR(Bs -> e+ e-)
    8    2.96475714E-09   # BR(Bs -> mu+ mu-)
    9    6.28773100E-07   # BR(Bs -> tau+ tau-)
   10    9.67361698E-05   # BR(B_u -> tau nu)
   11    9.99397814E-01   # BR(B_u -> tau nu)/BR(B_u -> tau nu)_SM
   12    5.41463722E-01   # |Delta(M_Bd)| [ps^-1] 
   13    1.93469833E+01   # |Delta(M_Bs)| [ps^-1] 
   16    2.15474423E-03   # epsilon_K
   17    2.28163158E-15   # Delta(M_K)
   18    2.48219714E-11   # BR(K^0 -> pi^0 nu nu)
   19    8.29578260E-11   # BR(K^+ -> pi^+ nu nu)
   20    6.96177688E-16   # Delta(g-2)_electron/2
   21    2.97640082E-11   # Delta(g-2)_muon/2
   22    8.43646088E-09   # Delta(g-2)_tau/2
   23    0.00000000E+00   # electric dipole moment of the electron
   24    0.00000000E+00   # electric dipole moment of the muon
   25    0.00000000E+00   # electric dipole moment of the tau
   26    0.00000000E+00   # Br(mu -> e gamma)
   27    0.00000000E+00   # Br(tau -> e gamma)
   28    0.00000000E+00   # Br(tau -> mu gamma)
   29    0.00000000E+00   # Br(mu -> 3 e)
   30    0.00000000E+00   # Br(tau -> 3 e)
   31    0.00000000E+00   # Br(tau -> 3 mu)
   39   -5.74066957E-05   # Delta(rho_parameter)
   40    0.00000000E+00   # BR(Z -> e mu)
   41    0.00000000E+00   # BR(Z -> e tau)
   42    0.00000000E+00   # BR(Z -> mu tau)
Block FWCOEF Q=  1.60000000E+02  # Wilson coefficients at scale Q
#    id        order  M        value         comment
     0305 4422   00   0    -1.88843984E-01   # C7
     0305 4422   00   2    -1.94484393E-01   # C7
     0305 4322   00   2    -1.12633557E-04   # C7'
     0305 6421   00   0    -9.52357412E-02   # C8
     0305 6421   00   2    -1.02845188E-01   # C8
     0305 6321   00   2    -1.51039126E-04   # C8'
 03051111 4133   00   0     1.15779056E+00   # C9 e+e-
 03051111 4133   00   2     1.15795801E+00   # C9 e+e-
 03051111 4233   00   2     5.84808482E-07   # C9' e+e-
 03051111 4137   00   0    -3.98173890E+00   # C10 e+e-
 03051111 4137   00   2    -3.98169140E+00   # C10 e+e-
 03051111 4237   00   2    -1.75790785E-05   # C10' e+e-
 03051313 4133   00   0     1.15779056E+00   # C9 mu+mu-
 03051313 4133   00   2     1.15795798E+00   # C9 mu+mu-
 03051313 4233   00   2     5.84806150E-07   # C9' mu+mu-
 03051313 4137   00   0    -3.98173890E+00   # C10 mu+mu-
 03051313 4137   00   2    -3.98169143E+00   # C10 mu+mu-
 03051313 4237   00   2    -1.75790778E-05   # C10' mu+mu-
 03051212 4137   00   0     1.50570892E+00   # C11 nu_1 nu_1
 03051212 4137   00   2     1.50569866E+00   # C11 nu_1 nu_1
 03051212 4237   00   2     4.24909736E-06   # C11' nu_1 nu_1
 03051414 4137   00   0     1.50570892E+00   # C11 nu_2 nu_2
 03051414 4137   00   2     1.50569866E+00   # C11 nu_2 nu_2
 03051414 4237   00   2     4.24909782E-06   # C11' nu_2 nu_2
 03051616 4137   00   0     1.50570892E+00   # C11 nu_3 nu_3
 03051616 4137   00   2     1.50569866E+00   # C11 nu_3 nu_3
 03051616 4237   00   2     4.24922734E-06   # C11' nu_3 nu_3
Block IMFWCOEF Q=  1.60000000E+02  # Im(Wilson coefficients) at scale Q
#    id        order  M        value         comment
     0305 4422   00   0     3.85989149E-07   # C7
     0305 4422   00   2     1.01662222E-06   # C7
     0305 4322   00   2     1.48574791E-07   # C7'
     0305 6421   00   0     3.30625152E-07   # C8
     0305 6421   00   2     3.68681570E-07   # C8
     0305 6321   00   2     5.62882293E-08   # C8'
 03051111 4133   00   2     3.53896036E-09   # C9 e+e-
 03051111 4233   00   2     2.35305117E-08   # C9' e+e-
 03051111 4137   00   2    -3.71765090E-07   # C10 e+e-
 03051111 4237   00   2    -7.08736512E-07   # C10' e+e-
 03051313 4133   00   2     3.53880242E-09   # C9 mu+mu-
 03051313 4233   00   2     2.35305041E-08   # C9' mu+mu-
 03051313 4137   00   2    -3.71765069E-07   # C10 mu+mu-
 03051313 4237   00   2    -7.08736532E-07   # C10' mu+mu-
 03051212 4137   00   2     1.11556523E-07   # C11 nu_1 nu_1
 03051212 4237   00   2     1.71311059E-07   # C11' nu_1 nu_1
 03051414 4137   00   2     1.11556515E-07   # C11 nu_2 nu_2
 03051414 4237   00   2     1.71311059E-07   # C11' nu_2 nu_2
 03051616 4137   00   2     1.11554185E-07   # C11 nu_3 nu_3
 03051616 4237   00   2     1.71311059E-07   # C11' nu_3 nu_3
