#
#                              ======================
#                              | THE SUSYHIT OUTPUT |
#                              ======================
#
#
#              ------------------------------------------------------
#              |     This is the output of the SUSY-HIT package     |
#              |  created by A.Djouadi, M.Muehlleitner and M.Spira. |
#              |  In case of problems with SUSY-HIT email to        |
#              |           margarete.muehlleitner@kit.edu           |
#              |           michael.spira@psi.ch                     |
#              |           abdelhak.djouadi@cern.ch                 |
#              ------------------------------------------------------
#
#              ------------------------------------------------------
#              |  SUSY Les Houches Accord - MSSM Spectrum + Decays  |
#              |              based on the decay programs           |
#              |                                                    |
#              |                     SDECAY 1.5                     |
#              |                                                    |
#              |  Authors: M.Muhlleitner, A.Djouadi and Y.Mambrini  |
#              |  Ref.:    Comput.Phys.Commun.168(2005)46           |
#              |           [hep-ph/0311167]                         |
#              |                                                    |
#              |                     HDECAY 3.4                     |
#              |                                                    |
#              |  By: A.Djouadi,J.Kalinowski,M.Muhlleitner,M.Spira  |
#              |  Ref.:    Comput.Phys.Commun.108(1998)56           |
#              |           [hep-ph/9704448]                         |
#              |                                                    |
#              |                                                    |
#              |  If not stated otherwise all DRbar couplings and   |
#              |  soft SUSY breaking masses are given at the scale  |
#              |  Q=  0.10889105E+04
#              |                                                    |
#              ------------------------------------------------------
#
#
BLOCK DCINFO  # Decay Program information
     1   SDECAY/HDECAY # decay calculator
     2   1.5  /3.4    # version number
#
BLOCK SPINFO  # Spectrum calculator information
     1    SOFTSUSY    # spectrum calculator                
     2    3.7.3       # version number                     
#
BLOCK MODSEL  # Model selection
     1     0   #  nonUniversal                                     
#
BLOCK SMINPUTS  # Standard Model inputs
         1     1.27934000E+02   # alpha_em^-1(M_Z)^MSbar
         2     1.16639000E-05   # G_F [GeV^-2]
         3     1.17200000E-01   # alpha_S(M_Z)^MSbar
         4     9.11870000E+01   # M_Z pole mass
         5     4.19000000E+00   # mb(mb)^MSbar
         6     1.72500000E+02   # mt pole mass
         7     1.77690000E+00   # mtau pole mass
#
BLOCK MINPAR  # Input parameters - minimal models
         3     2.00000000E+01   # tanb                
#
BLOCK EXTPAR  # Input parameters - non-minimal models
         0    -1.00000000E+00   # Set                 
         1     9.99000000E+01   # M_1(MX)             
         2     1.99900000E+02   # M_2(MX)             
         3     2.20000000E+03   # M_3(MX)             
        11     2.94338000E+03   # At(MX)              
        12     0.00000000E+00   # Ab(MX)              
        13     0.00000000E+00   # Atau(MX)            
        23    -3.00000000E+03   # mu(MX)              
        25     2.00000000E+01   # tan                 
        26     3.00000000E+03   # mA(pole)            
        31     3.00000000E+03   # meL(MX)             
        32     3.00000000E+03   # mmuL(MX)            
        33     3.00000000E+03   # mtauL(MX)           
        34     3.00000000E+03   # meR(MX)             
        35     3.00000000E+03   # mmuR(MX)            
        36     3.00000000E+03   # mtauR(MX)           
        41     3.00000000E+03   # mqL1(MX)            
        42     3.00000000E+03   # mqL2(MX)            
        43     3.99900000E+02   # mqL3(MX)            
        44     3.00000000E+03   # muR(MX)             
        45     3.00000000E+03   # mcR(MX)             
        46     3.00000000E+03   # mtR(MX)             
        47     3.00000000E+03   # mdR(MX)             
        48     3.00000000E+03   # msR(MX)             
        49     3.00000000E+03   # mbR(MX)             
#
BLOCK MASS  # Mass Spectrum
# PDG code           mass       particle
        24     8.03973105E+01   # W+
        25     1.26662416E+02   # h
        35     3.00020876E+03   # H
        36     3.00000016E+03   # A
        37     3.00110977E+03   # H+
         5     4.81337004E+00   # b-quark pole mass calculated from mb(mb)_Msbar
   1000001     3.01693420E+03   # ~d_L
   2000001     3.01129645E+03   # ~d_R
   1000002     3.01601125E+03   # ~u_L
   2000002     3.01524775E+03   # ~u_R
   1000003     3.01693420E+03   # ~s_L
   2000003     3.01129645E+03   # ~s_R
   1000004     3.01601125E+03   # ~c_L
   2000004     3.01524775E+03   # ~c_R
   1000005     4.53330716E+02   # ~b_1
   2000005     3.01402692E+03   # ~b_2
   1000006     4.48214132E+02   # ~t_1
   2000006     3.01809136E+03   # ~t_2
   1000011     3.00773588E+03   # ~e_L
   2000011     2.99917918E+03   # ~e_R
   1000012     3.00633959E+03   # ~nu_eL
   1000013     3.00773588E+03   # ~mu_L
   2000013     2.99917918E+03   # ~mu_R
   1000014     3.00633959E+03   # ~nu_muL
   1000015     2.98637624E+03   # ~tau_1
   2000015     3.02270987E+03   # ~tau_2
   1000016     3.00707970E+03   # ~nu_tauL
   1000021     2.32055628E+03   # ~g
   1000022     1.01510237E+02   # ~chi_10
   1000023     2.16667631E+02   # ~chi_20
   1000025    -3.01051010E+03   # ~chi_30
   1000035     3.01061372E+03   # ~chi_40
   1000024     2.16826244E+02   # ~chi_1+
   1000037     3.01149594E+03   # ~chi_2+
#
BLOCK NMIX  # Neutralino Mixing Matrix
  1  1     9.99891918E-01   # N_11
  1  2     7.65525600E-04   # N_12
  1  3    -1.46801248E-02   # N_13
  1  4     2.45355269E-04   # N_14
  2  1    -3.82705442E-04   # N_21
  2  2     9.99659956E-01   # N_22
  2  3     2.60698127E-02   # N_23
  2  4     4.35669301E-04   # N_24
  3  1     1.02175457E-02   # N_31
  3  2    -1.87361040E-02   # N_32
  3  3     7.06778213E-01   # N_33
  3  4     7.07113228E-01   # N_34
  4  1    -1.05644493E-02   # N_41
  4  2     1.81202590E-02   # N_42
  4  3    -7.06802247E-01   # N_43
  4  4     7.07100157E-01   # N_44
#
BLOCK UMIX  # Chargino Mixing Matrix U
  1  1     9.99320892E-01   # U_11
  1  2     3.68477266E-02   # U_12
  2  1    -3.68477266E-02   # U_21
  2  2     9.99320892E-01   # U_22
#
BLOCK VMIX  # Chargino Mixing Matrix V
  1  1     9.99999811E-01   # V_11
  1  2    -6.14531824E-04   # V_12
  2  1    -6.14531824E-04   # V_21
  2  2    -9.99999811E-01   # V_22
#
BLOCK STOPMIX  # Stop Mixing Matrix
  1  1     9.98657168E-01   # cos(theta_t)
  1  2    -5.18059920E-02   # sin(theta_t)
  2  1     5.18059920E-02   # -sin(theta_t)
  2  2     9.98657168E-01   # cos(theta_t)
#
BLOCK SBOTMIX  # Sbottom Mixing Matrix
  1  1     9.99711719E-01   # cos(theta_b)
  1  2    -2.40099749E-02   # sin(theta_b)
  2  1     2.40099749E-02   # -sin(theta_b)
  2  2     9.99711719E-01   # cos(theta_b)
#
BLOCK STAUMIX  # Stau Mixing Matrix
  1  1    -7.06887114E-01   # cos(theta_tau)
  1  2     7.07326380E-01   # sin(theta_tau)
  2  1    -7.07326380E-01   # -sin(theta_tau)
  2  2    -7.06887114E-01   # cos(theta_tau)
#
BLOCK ALPHA  # Higgs mixing
          -5.00204807E-02   # Mixing angle in the neutral Higgs boson sector
#
BLOCK HMIX Q=  1.08891046E+03  # DRbar Higgs Parameters
         1    -3.00000000E+03   # mu(Q)MSSM           
         2     2.00000000E+01   # tan                 
         3     2.44737692E+02   # higgs               
         4     1.19708543E+07   # mA^2(Q)MSSM         
#
BLOCK GAUGE Q=  1.08891046E+03  # The gauge couplings
     1     3.61077239E-01   # gprime(Q) DRbar
     2     6.39293454E-01   # g(Q) DRbar
     3     1.03349538E+00   # g3(Q) DRbar
#
BLOCK AU Q=  1.08891046E+03  # The trilinear couplings
  1  1     0.00000000E+00   # A_u(Q) DRbar
  2  2     1.06242041E-06   # A_c(Q) DRbar
  3  3     2.94338000E+03   # A_t(Q) DRbar
#
BLOCK AD Q=  1.08891046E+03  # The trilinear couplings
  1  1     3.78166926E-07   # A_d(Q) DRbar
  2  2     3.78212963E-07   # A_s(Q) DRbar
  3  3     7.93238042E-07   # A_b(Q) DRbar
#
BLOCK AE Q=  1.08891046E+03  # The trilinear couplings
  1  1     1.85240719E-07   # A_e(Q) DRbar
  2  2     1.85249966E-07   # A_mu(Q) DRbar
  3  3     1.87890406E-07   # A_tau(Q) DRbar
#
BLOCK Yu Q=  1.08891046E+03  # The Yukawa couplings
  1  1     0.00000000E+00   # y_u(Q) DRbar
  2  2     0.00000000E+00   # y_c(Q) DRbar
  3  3     8.60167713E-01   # y_t(Q) DRbar
#
BLOCK Yd Q=  1.08891046E+03  # The Yukawa couplings
  1  1     0.00000000E+00   # y_d(Q) DRbar
  2  2     0.00000000E+00   # y_s(Q) DRbar
  3  3     4.09567324E-01   # y_b(Q) DRbar
#
BLOCK Ye Q=  1.08891046E+03  # The Yukawa couplings
  1  1     0.00000000E+00   # y_e(Q) DRbar
  2  2     0.00000000E+00   # y_mu(Q) DRbar
  3  3     2.03128181E-01   # y_tau(Q) DRbar
#
BLOCK MSOFT Q=  1.08891046E+03  # The soft SUSY breaking masses at the scale Q
         1     9.99000000E+01   # M_1(Q)              
         2     1.99900000E+02   # M_2(Q)              
         3     2.20000000E+03   # M_3(Q)              
        21    -7.66245708E+04   # M^2_Hd              
        22    -9.18969353E+06   # M^2_Hu              
        31     3.00000000E+03   # M_eL                
        32     3.00000000E+03   # M_muL               
        33     3.00000000E+03   # M_tauL              
        34     3.00000000E+03   # M_eR                
        35     3.00000000E+03   # M_muR               
        36     3.00000000E+03   # M_tauR              
        41     3.00000000E+03   # M_q1L               
        42     3.00000000E+03   # M_q2L               
        43     3.99899993E+02   # M_q3L               
        44     3.00000000E+03   # M_uR                
        45     3.00000000E+03   # M_cR                
        46     3.00000000E+03   # M_tR                
        47     3.00000000E+03   # M_dR                
        48     3.00000000E+03   # M_sR                
        49     3.00000000E+03   # M_bR                
#
#
#
#                             =================
#                             |The decay table|
#                             =================
#
# - The QCD corrections to the decays gluino -> squark  + quark
#                                     squark -> gaugino + quark_prime
#                                     squark -> squark_prime + Higgs
#                                     squark -> gluino  + quark
#   are included.
#
# - The multi-body decays for the inos, stops and sbottoms are included.
#
# - The loop induced decays for the gluino, neutralinos and stops
#   are included.
#
# - The SUSY decays of the top quark are included.
#
#
#         PDG            Width
DECAY         6     1.41878140E+00   # top decays
#          BR         NDA      ID1       ID2
     1.00000000E+00    2           5        24   # BR(t ->  b    W+)
#
#         PDG            Width
DECAY   1000021     8.52388046E+01   # gluino decays
#          BR         NDA      ID1       ID2
     2.48064230E-01    2     1000005        -5   # BR(~g -> ~b_1  bb)
     2.48064230E-01    2    -1000005         5   # BR(~g -> ~b_1* b )
     2.51935770E-01    2     1000006        -6   # BR(~g -> ~t_1  tb)
     2.51935770E-01    2    -1000006         6   # BR(~g -> ~t_1* t )
#
#         PDG            Width
DECAY   1000006     2.92169048E+00   # stop1 decays
#          BR         NDA      ID1       ID2
     1.44242583E-02    2     1000022         6   # BR(~t_1 -> ~chi_10 t )
     2.07661005E-01    2     1000023         6   # BR(~t_1 -> ~chi_20 t )
     7.77914737E-01    2     1000024         5   # BR(~t_1 -> ~chi_1+ b )
#
#         PDG            Width
DECAY   2000006     1.25212642E+02   # stop2 decays
#          BR         NDA      ID1       ID2
     5.23567798E-02    2     1000022         6   # BR(~t_2 -> ~chi_10 t )
     2.32132927E-04    2     1000023         6   # BR(~t_2 -> ~chi_20 t )
     0.00000000E+00    2     1000025         6   # BR(~t_2 -> ~chi_30 t )
     4.67146726E-04    2     1000024         5   # BR(~t_2 -> ~chi_1+ b )
     5.49277290E-06    2     1000037         5   # BR(~t_2 -> ~chi_2+ b )
     2.84855704E-01    2     1000021         6   # BR(~t_2 -> ~g      t )
     1.72589185E-01    2     1000006        25   # BR(~t_2 -> ~t_1    h )
     1.64733184E-01    2     1000006        23   # BR(~t_2 -> ~t_1    Z )
     3.24760374E-01    2     1000005        24   # BR(~t_2 -> ~b_1    W+)
#
#         PDG            Width
DECAY   1000005     2.51823091E+00   # sbottom1 decays
#          BR         NDA      ID1       ID2
     2.50993392E-02    2     1000022         5   # BR(~b_1 -> ~chi_10 b )
     4.64072473E-01    2     1000023         5   # BR(~b_1 -> ~chi_20 b )
     5.10828188E-01    2    -1000024         6   # BR(~b_1 -> ~chi_1- t )
#
#         PDG            Width
DECAY   2000005     5.83607435E+01   # sbottom2 decays
#          BR         NDA      ID1       ID2
     2.81932425E-02    2     1000022         5   # BR(~b_2 -> ~chi_10 b )
    -3.70271119E-08    2     1000023         5   # BR(~b_2 -> ~chi_20 b )
    -1.43241313E-07    2    -1000024         6   # BR(~b_2 -> ~chi_1- t )
     6.09483471E-01    2     1000021         5   # BR(~b_2 -> ~g      b )
     7.99250811E-02    2     1000005        25   # BR(~b_2 -> ~b_1    h )
     1.14632506E-01    2     1000005        23   # BR(~b_2 -> ~b_1    Z )
     1.67765880E-01    2     1000006       -24   # BR(~b_2 -> ~t_1    W-)
#
#         PDG            Width
DECAY   1000002     7.07793833E+01   # sup_L decays
#          BR         NDA      ID1       ID2
     5.87233910E-03    2     1000022         2   # BR(~u_L -> ~chi_10 u)
     1.63067369E-01    2     1000023         2   # BR(~u_L -> ~chi_20 u)
     7.81516595E-10    2     1000025         2   # BR(~u_L -> ~chi_30 u)
     6.93232558E-10    2     1000035         2   # BR(~u_L -> ~chi_40 u)
     3.26399028E-01    2     1000024         1   # BR(~u_L -> ~chi_1+ d)
     1.41970271E-12    2     1000037         1   # BR(~u_L -> ~chi_2+ d)
     5.04661262E-01    2     1000021         2   # BR(~u_L -> ~g      u)
#
#         PDG            Width
DECAY   2000002     4.22528672E+01   # sup_R decays
#          BR         NDA      ID1       ID2
     1.56078481E-01    2     1000022         2   # BR(~u_R -> ~chi_10 u)
     2.27021411E-08    2     1000023         2   # BR(~u_R -> ~chi_20 u)
     2.04834617E-10    2     1000025         2   # BR(~u_R -> ~chi_30 u)
     2.09717381E-10    2     1000035         2   # BR(~u_R -> ~chi_40 u)
     8.43921496E-01    2     1000021         2   # BR(~u_R -> ~g      u)
#
#         PDG            Width
DECAY   1000001     7.08302753E+01   # sdown_L decays
#          BR         NDA      ID1       ID2
     5.77526523E-03    2     1000022         1   # BR(~d_L -> ~chi_10 d)
     1.63049500E-01    2     1000023         1   # BR(~d_L -> ~chi_20 d)
     1.59615530E-09    2     1000025         1   # BR(~d_L -> ~chi_30 d)
     1.46494222E-09    2     1000035         1   # BR(~d_L -> ~chi_40 d)
     3.25826315E-01    2    -1000024         2   # BR(~d_L -> ~chi_1- u)
     7.33382695E-09    2    -1000037         2   # BR(~d_L -> ~chi_2- u)
     5.05348910E-01    2     1000021         1   # BR(~d_L -> ~g      d)
#
#         PDG            Width
DECAY   2000001     3.69866372E+01   # sdown_R decays
#          BR         NDA      ID1       ID2
     4.45149363E-02    2     1000022         1   # BR(~d_R -> ~chi_10 d)
     6.47471954E-09    2     1000023         1   # BR(~d_R -> ~chi_20 d)
     1.74471511E-12    2     1000025         1   # BR(~d_R -> ~chi_30 d)
     1.41427787E-12    2     1000035         1   # BR(~d_R -> ~chi_40 d)
     9.55485057E-01    2     1000021         1   # BR(~d_R -> ~g      d)
#
#         PDG            Width
DECAY   1000004     7.07793833E+01   # scharm_L decays
#          BR         NDA      ID1       ID2
     5.87233910E-03    2     1000022         4   # BR(~c_L -> ~chi_10 c)
     1.63067369E-01    2     1000023         4   # BR(~c_L -> ~chi_20 c)
     7.81516595E-10    2     1000025         4   # BR(~c_L -> ~chi_30 c)
     6.93232558E-10    2     1000035         4   # BR(~c_L -> ~chi_40 c)
     3.26399028E-01    2     1000024         3   # BR(~c_L -> ~chi_1+ s)
     1.41970271E-12    2     1000037         3   # BR(~c_L -> ~chi_2+ s)
     5.04661262E-01    2     1000021         4   # BR(~c_L -> ~g      c)
#
#         PDG            Width
DECAY   2000004     4.22528672E+01   # scharm_R decays
#          BR         NDA      ID1       ID2
     1.56078481E-01    2     1000022         4   # BR(~c_R -> ~chi_10 c)
     2.27021411E-08    2     1000023         4   # BR(~c_R -> ~chi_20 c)
     2.04834617E-10    2     1000025         4   # BR(~c_R -> ~chi_30 c)
     2.09717381E-10    2     1000035         4   # BR(~c_R -> ~chi_40 c)
     8.43921496E-01    2     1000021         4   # BR(~c_R -> ~g      c)
#
#         PDG            Width
DECAY   1000003     7.08302753E+01   # sstrange_L decays
#          BR         NDA      ID1       ID2
     5.77526523E-03    2     1000022         3   # BR(~s_L -> ~chi_10 s)
     1.63049500E-01    2     1000023         3   # BR(~s_L -> ~chi_20 s)
     1.59615530E-09    2     1000025         3   # BR(~s_L -> ~chi_30 s)
     1.46494222E-09    2     1000035         3   # BR(~s_L -> ~chi_40 s)
     3.25826315E-01    2    -1000024         4   # BR(~s_L -> ~chi_1- c)
     7.33382695E-09    2    -1000037         4   # BR(~s_L -> ~chi_2- c)
     5.05348910E-01    2     1000021         3   # BR(~s_L -> ~g      s)
#
#         PDG            Width
DECAY   2000003     3.69866372E+01   # sstrange_R decays
#          BR         NDA      ID1       ID2
     4.45149363E-02    2     1000022         3   # BR(~s_R -> ~chi_10 s)
     6.47471954E-09    2     1000023         3   # BR(~s_R -> ~chi_20 s)
     1.74471511E-12    2     1000025         3   # BR(~s_R -> ~chi_30 s)
     1.41427787E-12    2     1000035         3   # BR(~s_R -> ~chi_40 s)
     9.55485057E-01    2     1000021         3   # BR(~s_R -> ~g      s)
#
#         PDG            Width
DECAY   1000011     4.01578238E+01   # selectron_L decays
#          BR         NDA      ID1       ID2
     9.71544478E-02    2     1000022        11   # BR(~e_L -> ~chi_10 e-)
     3.01000935E-01    2     1000023        11   # BR(~e_L -> ~chi_20 e-)
     6.01844617E-01    2    -1000024        12   # BR(~e_L -> ~chi_1- nu_e)
#
#         PDG            Width
DECAY   2000011     1.55193445E+01   # selectron_R decays
#          BR         NDA      ID1       ID2
     9.99999855E-01    2     1000022        11   # BR(~e_R -> ~chi_10 e-)
     1.45302701E-07    2     1000023        11   # BR(~e_R -> ~chi_20 e-)
#
#         PDG            Width
DECAY   1000013     4.01578238E+01   # smuon_L decays
#          BR         NDA      ID1       ID2
     9.71544478E-02    2     1000022        13   # BR(~mu_L -> ~chi_10 mu-)
     3.01000935E-01    2     1000023        13   # BR(~mu_L -> ~chi_20 mu-)
     6.01844617E-01    2    -1000024        14   # BR(~mu_L -> ~chi_1- nu_mu)
#
#         PDG            Width
DECAY   2000013     1.55193445E+01   # smuon_R decays
#          BR         NDA      ID1       ID2
     9.99999855E-01    2     1000022        13   # BR(~mu_R -> ~chi_10 mu-)
     1.45302701E-07    2     1000023        13   # BR(~mu_R -> ~chi_20 mu-)
#
#         PDG            Width
DECAY   1000015     2.81227643E+01   # stau_1 decays
#          BR         NDA      ID1       ID2
     3.45346607E-01    2     1000022        15   # BR(~tau_1 -> ~chi_10  tau-)
     2.18278498E-01    2     1000023        15   # BR(~tau_1 -> ~chi_20  tau-)
     4.36374895E-01    2    -1000024        16   # BR(~tau_1 -> ~chi_1-  nu_tau)
#
#         PDG            Width
DECAY   2000015     2.75410722E+01   # stau_2 decays
#          BR         NDA      ID1       ID2
     3.53396733E-01    2     1000022        15   # BR(~tau_2 -> ~chi_10  tau-)
     2.15586302E-01    2     1000023        15   # BR(~tau_2 -> ~chi_20  tau-)
     3.56960396E-06    2     1000025        15   # BR(~tau_2 -> ~chi_30  tau-)
     2.61109991E-06    2     1000035        15   # BR(~tau_2 -> ~chi_40  tau-)
     4.31007712E-01    2    -1000024        16   # BR(~tau_2 -> ~chi_1-  nu_tau)
     3.07176321E-06    2    -1000037        16   # BR(~tau_2 -> ~chi_2-  nu_tau)
#
#         PDG            Width
DECAY   1000012     4.01610235E+01   # snu_eL decays
#          BR         NDA      ID1       ID2
     9.65763348E-02    2     1000022        12   # BR(~nu_eL -> ~chi_10 nu_e)
     3.01094623E-01    2     1000023        12   # BR(~nu_eL -> ~chi_20 nu_e)
     6.02329043E-01    2     1000024        11   # BR(~nu_eL -> ~chi_1+ e-)
#
#         PDG            Width
DECAY   1000014     4.01610235E+01   # snu_muL decays
#          BR         NDA      ID1       ID2
     9.65763348E-02    2     1000022        14   # BR(~nu_muL -> ~chi_10 nu_mu)
     3.01094623E-01    2     1000023        14   # BR(~nu_muL -> ~chi_20 nu_mu)
     6.02329043E-01    2     1000024        13   # BR(~nu_muL -> ~chi_1+ mu-)
#
#         PDG            Width
DECAY   1000016     4.01744497E+01   # snu_tauL decays
#          BR         NDA      ID1       ID2
     9.65679352E-02    2     1000022        16   # BR(~nu_tauL -> ~chi_10 nu_tau)
     3.01069645E-01    2     1000023        16   # BR(~nu_tauL -> ~chi_20 nu_tau)
     6.02362420E-01    2     1000024        15   # BR(~nu_tauL -> ~chi_1+ tau-)
#
#         PDG            Width
DECAY   1000024     1.09551720E-06   # chargino1+ decays
#          BR         NDA      ID1       ID2
     1.00000000E+00    2     1000022        24   # BR(~chi_1+ -> ~chi_10  W+)
#
#         PDG            Width
DECAY   1000037     1.02005243E+02   # chargino2+ decays
#          BR         NDA      ID1       ID2
     1.51022940E-01    2     1000006        -5   # BR(~chi_2+ -> ~t_1     bb)
     6.58084188E-01    2    -1000005         6   # BR(~chi_2+ -> ~b_1*    t )
     5.30622282E-13    2     1000012       -11   # BR(~chi_2+ -> ~nu_eL   e+  )
     5.30622282E-13    2     1000014       -13   # BR(~chi_2+ -> ~nu_muL  mu+ )
     9.53133640E-08    2     1000016       -15   # BR(~chi_2+ -> ~nu_tau1 tau+)
     1.01490270E-09    2    -1000011        12   # BR(~chi_2+ -> ~e_L+    nu_e)
     1.01490270E-09    2    -1000013        14   # BR(~chi_2+ -> ~mu_L+   nu_mu)
     1.30578834E-06    2    -1000015        16   # BR(~chi_2+ -> ~tau_1+  nu_tau)
     5.76394574E-02    2     1000024        23   # BR(~chi_2+ -> ~chi_1+  Z )
     1.81627043E-02    2     1000022        24   # BR(~chi_2+ -> ~chi_10  W+)
     5.62304333E-02    2     1000023        24   # BR(~chi_2+ -> ~chi_20  W+)
     5.88588734E-02    2     1000024        25   # BR(~chi_2+ -> ~chi_1+  h )
#
#         PDG            Width
DECAY   1000022     0.00000000E+00   # neutralino1 decays
#
#         PDG            Width
DECAY   1000023     2.76634061E-07   # neutralino2 decays
#          BR         NDA      ID1       ID2
     1.00000000E+00    2     1000022        23   # BR(~chi_20 -> ~chi_10   Z )
#
#         PDG            Width
DECAY   1000025     1.02085389E+02   # neutralino3 decays
#          BR         NDA      ID1       ID2
     9.55595689E-03    2     1000022        23   # BR(~chi_30 -> ~chi_10   Z )
     2.78396912E-02    2     1000023        23   # BR(~chi_30 -> ~chi_20   Z )
     5.62236493E-02    2     1000024       -24   # BR(~chi_30 -> ~chi_1+   W-)
     5.62236493E-02    2    -1000024        24   # BR(~chi_30 -> ~chi_1-   W+)
     7.97534815E-03    2     1000022        25   # BR(~chi_30 -> ~chi_10   h )
     2.30230636E-02    2     1000023        25   # BR(~chi_30 -> ~chi_20   h )
     3.34943815E-01    2     1000006        -6   # BR(~chi_30 -> ~t_1      tb)
     3.34943815E-01    2    -1000006         6   # BR(~chi_30 -> ~t_1*     t )
     7.46339779E-02    2     1000005        -5   # BR(~chi_30 -> ~b_1      bb)
     7.46339779E-02    2    -1000005         5   # BR(~chi_30 -> ~b_1*     b )
     3.41951576E-11    2     1000011       -11   # BR(~chi_30 -> ~e_L-     e+)
     3.41951576E-11    2    -1000011        11   # BR(~chi_30 -> ~e_L+     e-)
     4.50789794E-10    2     2000011       -11   # BR(~chi_30 -> ~e_R-     e+)
     4.50789794E-10    2    -2000011        11   # BR(~chi_30 -> ~e_R+     e-)
     3.41951576E-11    2     1000013       -13   # BR(~chi_30 -> ~mu_L-    mu+)
     3.41951576E-11    2    -1000013        13   # BR(~chi_30 -> ~mu_L+    mu-)
     4.50789794E-10    2     2000013       -13   # BR(~chi_30 -> ~mu_R-    mu+)
     4.50789794E-10    2    -2000013        13   # BR(~chi_30 -> ~mu_R+    mu-)
     1.52635575E-06    2     1000015       -15   # BR(~chi_30 -> ~tau_1-   tau+)
     1.52635575E-06    2    -1000015        15   # BR(~chi_30 -> ~tau_1+   tau-)
     2.75984873E-10    2     1000012       -12   # BR(~chi_30 -> ~nu_eL    nu_eb)
     2.75984873E-10    2    -1000012        12   # BR(~chi_30 -> ~nu_eL*   nu_e )
     2.75984873E-10    2     1000014       -14   # BR(~chi_30 -> ~nu_muL   nu_mub)
     2.75984873E-10    2    -1000014        14   # BR(~chi_30 -> ~nu_muL*  nu_mu )
     1.86768361E-10    2     1000016       -16   # BR(~chi_30 -> ~nu_tau1  nu_taub)
     1.86768361E-10    2    -1000016        16   # BR(~chi_30 -> ~nu_tau1* nu_tau )
#
#         PDG            Width
DECAY   1000035     1.02391115E+02   # neutralino4 decays
#          BR         NDA      ID1       ID2
     8.91582450E-03    2     1000022        23   # BR(~chi_40 -> ~chi_10   Z )
     2.97053554E-02    2     1000023        23   # BR(~chi_40 -> ~chi_20   Z )
     5.60536245E-02    2     1000024       -24   # BR(~chi_40 -> ~chi_1+   W-)
     5.60536245E-02    2    -1000024        24   # BR(~chi_40 -> ~chi_1-   W+)
     1.11185248E-02    2     1000022        25   # BR(~chi_40 -> ~chi_10   h )
     3.74348524E-02    2     1000023        25   # BR(~chi_40 -> ~chi_20   h )
     3.25933977E-01    2     1000006        -6   # BR(~chi_40 -> ~t_1      tb)
     3.25933977E-01    2    -1000006         6   # BR(~chi_40 -> ~t_1*     t )
     7.44237925E-02    2     1000005        -5   # BR(~chi_40 -> ~b_1      bb)
     7.44237925E-02    2    -1000005         5   # BR(~chi_40 -> ~b_1*     b )
     3.22348798E-11    2     1000011       -11   # BR(~chi_40 -> ~e_L-     e+)
     3.22348798E-11    2    -1000011        11   # BR(~chi_40 -> ~e_L+     e-)
     4.89275109E-10    2     2000011       -11   # BR(~chi_40 -> ~e_R-     e+)
     4.89275109E-10    2    -2000011        11   # BR(~chi_40 -> ~e_R+     e-)
     3.22348798E-11    2     1000013       -13   # BR(~chi_40 -> ~mu_L-    mu+)
     3.22348798E-11    2    -1000013        13   # BR(~chi_40 -> ~mu_L+    mu-)
     4.89275109E-10    2     2000013       -13   # BR(~chi_40 -> ~mu_R-    mu+)
     4.89275109E-10    2    -2000013        13   # BR(~chi_40 -> ~mu_R+    mu-)
     1.32588911E-06    2     1000015       -15   # BR(~chi_40 -> ~tau_1-   tau+)
     1.32588911E-06    2    -1000015        15   # BR(~chi_40 -> ~tau_1+   tau-)
     2.79165773E-10    2     1000012       -12   # BR(~chi_40 -> ~nu_eL    nu_eb)
     2.79165773E-10    2    -1000012        12   # BR(~chi_40 -> ~nu_eL*   nu_e )
     2.79165773E-10    2     1000014       -14   # BR(~chi_40 -> ~nu_muL   nu_mub)
     2.79165773E-10    2    -1000014        14   # BR(~chi_40 -> ~nu_muL*  nu_mu )
     1.90902473E-10    2     1000016       -16   # BR(~chi_40 -> ~nu_tau1  nu_taub)
     1.90902473E-10    2    -1000016        16   # BR(~chi_40 -> ~nu_tau1* nu_tau )
#
#         PDG            Width
DECAY        25     3.86090591E-03   # h decays
#          BR         NDA      ID1       ID2
     5.38345827E-01    2           5        -5   # BR(h -> b       bb     )
     6.80719643E-02    2         -15        15   # BR(h -> tau+    tau-   )
     2.40969173E-04    2         -13        13   # BR(h -> mu+     mu-    )
     5.10145580E-04    2           3        -3   # BR(h -> s       sb     )
     2.21616865E-02    2           4        -4   # BR(h -> c       cb     )
     7.34739518E-02    2          21        21   # BR(h -> g       g      )
     2.57757772E-03    2          22        22   # BR(h -> gam     gam    )
     1.87231060E-03    2          22        23   # BR(h -> Z       gam    )
     2.59485846E-01    2          24       -24   # BR(h -> W+      W-     )
     3.32597218E-02    2          23        23   # BR(h -> Z       Z      )
#
#         PDG            Width
DECAY        35     4.38594198E+01   # H decays
#          BR         NDA      ID1       ID2
     9.14147040E-01    2           5        -5   # BR(H -> b       bb     )
     5.67008896E-02    2         -15        15   # BR(H -> tau+    tau-   )
     2.00480796E-04    2         -13        13   # BR(H -> mu+     mu-    )
     2.46189677E-04    2           3        -3   # BR(H -> s       sb     )
     6.90224797E-08    2           4        -4   # BR(H -> c       cb     )
     6.88544076E-03    2           6        -6   # BR(H -> t       tb     )
     2.78876110E-06    2          21        21   # BR(H -> g       g      )
     3.06886029E-08    2          22        22   # BR(H -> gam     gam    )
     2.81474026E-09    2          23        22   # BR(H -> Z       gam    )
     7.75500992E-07    2          24       -24   # BR(H -> W+      W-     )
     3.87272288E-07    2          23        23   # BR(H -> Z       Z      )
     4.75530016E-06    2          25        25   # BR(H -> h       h      )
     1.82914227E-25    2          36        36   # BR(H -> A       A      )
     9.73301206E-18    2          23        36   # BR(H -> Z       A      )
     7.62825128E-04    2     1000024  -1000024   # BR(H -> ~chi_1+ ~chi_1-)
     3.53217494E-05    2     1000022   1000022   # BR(H -> ~chi_10 ~chi_10)
     3.81754720E-04    2     1000023   1000023   # BR(H -> ~chi_20 ~chi_20)
     2.32752631E-04    2     1000022   1000023   # BR(H -> ~chi_10 ~chi_20)
     2.03932097E-02    2     1000006  -1000006   # BR(H -> ~t_1    ~t_1*  )
     5.28604929E-06    2     1000005  -1000005   # BR(H -> ~b_1    ~b_1*  )
#
#         PDG            Width
DECAY        36     4.29673615E+01   # A decays
#          BR         NDA      ID1       ID2
     9.33111356E-01    2           5        -5   # BR(A -> b       bb     )
     5.78744902E-02    2         -15        15   # BR(A -> tau+    tau-   )
     2.04630081E-04    2         -13        13   # BR(A -> mu+     mu-    )
     2.51328230E-04    2           3        -3   # BR(A -> s       sb     )
     7.09212639E-08    2           4        -4   # BR(A -> c       cb     )
     7.07095747E-03    2           6        -6   # BR(A -> t       tb     )
     2.08232912E-05    2          21        21   # BR(A -> g       g      )
     4.92789307E-08    2          22        22   # BR(A -> gam     gam    )
     2.04993793E-08    2          23        22   # BR(A -> Z       gam    )
     7.88409413E-07    2          23        25   # BR(A -> Z       h      )
     7.92577873E-04    2     1000024  -1000024   # BR(A -> ~chi_1+ ~chi_1-)
     3.63399736E-05    2     1000022   1000022   # BR(A -> ~chi_10 ~chi_10)
     3.96628461E-04    2     1000023   1000023   # BR(A -> ~chi_20 ~chi_20)
     2.39938940E-04    2     1000022   1000023   # BR(A -> ~chi_10 ~chi_20)
#
#         PDG            Width
DECAY        37     4.64629552E+01   # H+ decays
#          BR         NDA      ID1       ID2
     1.48650044E-03    2           4        -5   # BR(H+ -> c       bb     )
     5.35401568E-02    2         -15        16   # BR(H+ -> tau+    nu_tau )
     1.89304935E-04    2         -13        14   # BR(H+ -> mu+     nu_mu  )
     9.51359123E-06    2           2        -5   # BR(H+ -> u       bb     )
     1.11249580E-05    2           2        -3   # BR(H+ -> u       sb     )
     2.28876160E-04    2           4        -3   # BR(H+ -> c       sb     )
     9.34129545E-01    2           6        -5   # BR(H+ -> t       bb     )
     7.30360971E-07    2          24        25   # BR(H+ -> W+      h      )
     4.76331824E-14    2          24        36   # BR(H+ -> W+      A      )
     4.42489891E-04    2     1000024   1000022   # BR(H+ -> ~chi_1+ ~chi_10)
     6.50900838E-11    2     1000024   1000023   # BR(H+ -> ~chi_1+ ~chi_20)
     9.96175785E-03    2     1000006  -1000005   # BR(H+ -> ~t_1    ~b_1*  )
