#
#                              ======================
#                              | THE SUSYHIT OUTPUT |
#                              ======================
#
#
#              ------------------------------------------------------
#              |     This is the output of the SUSY-HIT package     |
#              |  created by A.Djouadi, M.Muehlleitner and M.Spira. |
#              |  In case of problems with SUSY-HIT email to        |
#              |           margarete.muehlleitner@kit.edu           |
#              |           michael.spira@psi.ch                     |
#              |           abdelhak.djouadi@cern.ch                 |
#              ------------------------------------------------------
#
#              ------------------------------------------------------
#              |  SUSY Les Houches Accord - MSSM Spectrum + Decays  |
#              |              based on the decay programs           |
#              |                                                    |
#              |                     SDECAY 1.5                     |
#              |                                                    |
#              |  Authors: M.Muhlleitner, A.Djouadi and Y.Mambrini  |
#              |  Ref.:    Comput.Phys.Commun.168(2005)46           |
#              |           [hep-ph/0311167]                         |
#              |                                                    |
#              |                     HDECAY 3.4                     |
#              |                                                    |
#              |  By: A.Djouadi,J.Kalinowski,M.Muhlleitner,M.Spira  |
#              |  Ref.:    Comput.Phys.Commun.108(1998)56           |
#              |           [hep-ph/9704448]                         |
#              |                                                    |
#              |                                                    |
#              |  If not stated otherwise all DRbar couplings and   |
#              |  soft SUSY breaking masses are given at the scale  |
#              |  Q=  0.14468839E+04
#              |                                                    |
#              ------------------------------------------------------
#
#
BLOCK DCINFO  # Decay Program information
     1   SDECAY/HDECAY # decay calculator
     2   1.5  /3.4    # version number
#
BLOCK SPINFO  # Spectrum calculator information
     1    SOFTSUSY    # spectrum calculator                
     2    3.7.3       # version number                     
#
BLOCK MODSEL  # Model selection
     1     0   #  nonUniversal                                     
#
BLOCK SMINPUTS  # Standard Model inputs
         1     1.27934000E+02   # alpha_em^-1(M_Z)^MSbar
         2     1.16639000E-05   # G_F [GeV^-2]
         3     1.17200000E-01   # alpha_S(M_Z)^MSbar
         4     9.11870000E+01   # M_Z pole mass
         5     4.19000000E+00   # mb(mb)^MSbar
         6     1.72500000E+02   # mt pole mass
         7     1.77690000E+00   # mtau pole mass
#
BLOCK MINPAR  # Input parameters - minimal models
         3     2.00000000E+01   # tanb                
#
BLOCK EXTPAR  # Input parameters - non-minimal models
         0    -1.00000000E+00   # Set                 
         1     3.49900000E+02   # M_1(MX)             
         2     6.99900000E+02   # M_2(MX)             
         3     2.20000000E+03   # M_3(MX)             
        11     2.94338000E+03   # At(MX)              
        12     0.00000000E+00   # Ab(MX)              
        13     0.00000000E+00   # Atau(MX)            
        23    -3.00000000E+03   # mu(MX)              
        25     2.00000000E+01   # tan                 
        26     3.00000000E+03   # mA(pole)            
        31     3.00000000E+03   # meL(MX)             
        32     3.00000000E+03   # mmuL(MX)            
        33     3.00000000E+03   # mtauL(MX)           
        34     3.00000000E+03   # meR(MX)             
        35     3.00000000E+03   # mmuR(MX)            
        36     3.00000000E+03   # mtauR(MX)           
        41     3.00000000E+03   # mqL1(MX)            
        42     3.00000000E+03   # mqL2(MX)            
        43     6.99900000E+02   # mqL3(MX)            
        44     3.00000000E+03   # muR(MX)             
        45     3.00000000E+03   # mcR(MX)             
        46     3.00000000E+03   # mtR(MX)             
        47     3.00000000E+03   # mdR(MX)             
        48     3.00000000E+03   # msR(MX)             
        49     3.00000000E+03   # mbR(MX)             
#
BLOCK MASS  # Mass Spectrum
# PDG code           mass       particle
        24     8.04034181E+01   # W+
        25     1.25361416E+02   # h
        35     3.00011610E+03   # H
        36     2.99999993E+03   # A
        37     3.00109213E+03   # H+
         5     4.81337004E+00   # b-quark pole mass calculated from mb(mb)_Msbar
   1000001     3.03309081E+03   # ~d_L
   2000001     3.02797229E+03   # ~d_R
   1000002     3.03218255E+03   # ~u_L
   2000002     3.03013107E+03   # ~u_R
   1000003     3.03309081E+03   # ~s_L
   2000003     3.02797229E+03   # ~s_R
   1000004     3.03218255E+03   # ~c_L
   2000004     3.03013107E+03   # ~c_R
   1000005     7.97358936E+02   # ~b_1
   2000005     3.02716160E+03   # ~b_2
   1000006     7.94599055E+02   # ~t_1
   2000006     3.02256415E+03   # ~t_2
   1000011     3.00664546E+03   # ~e_L
   2000011     3.00095375E+03   # ~e_R
   1000012     3.00525992E+03   # ~nu_eL
   1000013     3.00664546E+03   # ~mu_L
   2000013     3.00095375E+03   # ~mu_R
   1000014     3.00525992E+03   # ~nu_muL
   1000015     2.98619154E+03   # ~tau_1
   2000015     3.02175403E+03   # ~tau_2
   1000016     3.00539846E+03   # ~nu_tauL
   1000021     2.34107629E+03   # ~g
   1000022     3.52985959E+02   # ~chi_10
   1000023     7.34157409E+02   # ~chi_20
   1000025    -3.00041038E+03   # ~chi_30
   1000035     3.00075945E+03   # ~chi_40
   1000024     7.34315890E+02   # ~chi_1+
   1000037     3.00154186E+03   # ~chi_2+
#
BLOCK NMIX  # Neutralino Mixing Matrix
  1  1     9.99889550E-01   # N_11
  1  2    -5.59919995E-05   # N_12
  1  3    -1.48289482E-02   # N_13
  1  4    -9.93842750E-04   # N_14
  2  1     4.61895781E-04   # N_21
  2  2     9.99621833E-01   # N_22
  2  3     2.70345200E-02   # N_23
  2  4     5.01129893E-03   # N_24
  3  1    -9.77939467E-03   # N_31
  3  2     1.55763795E-02   # N_32
  3  3    -7.06857270E-01   # N_33
  3  4     7.07117062E-01   # N_34
  4  1     1.11820685E-02   # N_41
  4  2    -2.26619725E-02   # N_42
  4  3     7.06683831E-01   # N_43
  4  4     7.07078044E-01   # N_44
#
BLOCK UMIX  # Chargino Mixing Matrix U
  1  1     9.99269012E-01   # U_11
  1  2     3.82288140E-02   # U_12
  2  1    -3.82288140E-02   # U_21
  2  2     9.99269012E-01   # U_22
#
BLOCK VMIX  # Chargino Mixing Matrix V
  1  1     9.99974901E-01   # V_11
  1  2    -7.08504210E-03   # V_12
  2  1    -7.08504210E-03   # V_21
  2  2    -9.99974901E-01   # V_22
#
BLOCK STOPMIX  # Stop Mixing Matrix
  1  1     9.98579874E-01   # cos(theta_t)
  1  2    -5.32750903E-02   # sin(theta_t)
  2  1     5.32750903E-02   # -sin(theta_t)
  2  2     9.98579874E-01   # cos(theta_t)
#
BLOCK SBOTMIX  # Sbottom Mixing Matrix
  1  1     9.99728101E-01   # cos(theta_b)
  1  2    -2.33178916E-02   # sin(theta_b)
  2  1     2.33178916E-02   # -sin(theta_b)
  2  2     9.99728101E-01   # cos(theta_b)
#
BLOCK STAUMIX  # Stau Mixing Matrix
  1  1    -7.06950750E-01   # cos(theta_tau)
  1  2     7.07262778E-01   # sin(theta_tau)
  2  1    -7.07262778E-01   # -sin(theta_tau)
  2  2    -7.06950750E-01   # cos(theta_tau)
#
BLOCK ALPHA  # Higgs mixing
          -5.00115221E-02   # Mixing angle in the neutral Higgs boson sector
#
BLOCK HMIX Q=  1.44688389E+03  # DRbar Higgs Parameters
         1    -3.00000000E+03   # mu(Q)MSSM           
         2     2.00000000E+01   # tan                 
         3     2.44150172E+02   # higgs               
         4     1.08656578E+07   # mA^2(Q)MSSM         
#
BLOCK GAUGE Q=  1.44688389E+03  # The gauge couplings
     1     3.62029463E-01   # gprime(Q) DRbar
     2     6.36856618E-01   # g(Q) DRbar
     3     1.02714115E+00   # g3(Q) DRbar
#
BLOCK AU Q=  1.44688389E+03  # The trilinear couplings
  1  1     1.99501478E-06   # A_u(Q) DRbar
  2  2     1.99504398E-06   # A_c(Q) DRbar
  3  3     2.94338000E+03   # A_t(Q) DRbar
#
BLOCK AD Q=  1.44688389E+03  # The trilinear couplings
  1  1     7.16897257E-07   # A_d(Q) DRbar
  2  2     7.16978864E-07   # A_s(Q) DRbar
  3  3     1.44338985E-06   # A_b(Q) DRbar
#
BLOCK AE Q=  1.44688389E+03  # The trilinear couplings
  1  1     3.05703264E-07   # A_e(Q) DRbar
  2  2     3.05718111E-07   # A_mu(Q) DRbar
  3  3     3.09870416E-07   # A_tau(Q) DRbar
#
BLOCK Yu Q=  1.44688389E+03  # The Yukawa couplings
  1  1     0.00000000E+00   # y_u(Q) DRbar
  2  2     0.00000000E+00   # y_c(Q) DRbar
  3  3     8.53795235E-01   # y_t(Q) DRbar
#
BLOCK Yd Q=  1.44688389E+03  # The Yukawa couplings
  1  1     0.00000000E+00   # y_d(Q) DRbar
  2  2     0.00000000E+00   # y_s(Q) DRbar
  3  3     3.83815702E-01   # y_b(Q) DRbar
#
BLOCK Ye Q=  1.44688389E+03  # The Yukawa couplings
  1  1     0.00000000E+00   # y_e(Q) DRbar
  2  2     0.00000000E+00   # y_mu(Q) DRbar
  3  3     2.01222147E-01   # y_tau(Q) DRbar
#
BLOCK MSOFT Q=  1.44688389E+03  # The soft SUSY breaking masses at the scale Q
         1     3.49900000E+02   # M_1(Q)              
         2     6.99900000E+02   # M_2(Q)              
         3     2.20000000E+03   # M_3(Q)              
        21    -4.67266341E+04   # M^2_Hd              
        22    -9.07898779E+06   # M^2_Hu              
        31     3.00000000E+03   # M_eL                
        32     3.00000000E+03   # M_muL               
        33     3.00000000E+03   # M_tauL              
        34     3.00000000E+03   # M_eR                
        35     3.00000000E+03   # M_muR               
        36     3.00000000E+03   # M_tauR              
        41     3.00000000E+03   # M_q1L               
        42     3.00000000E+03   # M_q2L               
        43     6.99899993E+02   # M_q3L               
        44     3.00000000E+03   # M_uR                
        45     3.00000000E+03   # M_cR                
        46     3.00000000E+03   # M_tR                
        47     3.00000000E+03   # M_dR                
        48     3.00000000E+03   # M_sR                
        49     3.00000000E+03   # M_bR                
#
#
#
#                             =================
#                             |The decay table|
#                             =================
#
# - The QCD corrections to the decays gluino -> squark  + quark
#                                     squark -> gaugino + quark_prime
#                                     squark -> squark_prime + Higgs
#                                     squark -> gluino  + quark
#   are included.
#
# - The multi-body decays for the inos, stops and sbottoms are included.
#
# - The loop induced decays for the gluino, neutralinos and stops
#   are included.
#
# - The SUSY decays of the top quark are included.
#
#
#         PDG            Width
DECAY         6     1.40771806E+00   # top decays
#          BR         NDA      ID1       ID2
     1.00000000E+00    2           5        24   # BR(t ->  b    W+)
#
#         PDG            Width
DECAY   1000021     7.39697525E+01   # gluino decays
#          BR         NDA      ID1       ID2
     2.47995837E-01    2     1000005        -5   # BR(~g -> ~b_1  bb)
     2.47995837E-01    2    -1000005         5   # BR(~g -> ~b_1* b )
     2.52004163E-01    2     1000006        -6   # BR(~g -> ~t_1  tb)
     2.52004163E-01    2    -1000006         6   # BR(~g -> ~t_1* t )
#
#         PDG            Width
DECAY   1000006     2.10494851E-01   # stop1 decays
#          BR         NDA      ID1       ID2
     2.98207540E-01    2     1000022         6   # BR(~t_1 -> ~chi_10 t )
     7.01792460E-01    2     1000024         5   # BR(~t_1 -> ~chi_1+ b )
#
#         PDG            Width
DECAY   2000006     1.17209517E+02   # stop2 decays
#          BR         NDA      ID1       ID2
     5.50495209E-02    2     1000022         6   # BR(~t_2 -> ~chi_10 t )
     3.20712401E-04    2     1000023         6   # BR(~t_2 -> ~chi_20 t )
     0.00000000E+00    2     1000025         6   # BR(~t_2 -> ~chi_30 t )
     6.45151264E-04    2     1000024         5   # BR(~t_2 -> ~chi_1+ b )
     7.69608330E-05    2     1000037         5   # BR(~t_2 -> ~chi_2+ b )
     2.93720415E-01    2     1000021         6   # BR(~t_2 -> ~g      t )
     1.70520334E-01    2     1000006        25   # BR(~t_2 -> ~t_1    h )
     1.61921688E-01    2     1000006        23   # BR(~t_2 -> ~t_1    Z )
     3.17745218E-01    2     1000005        24   # BR(~t_2 -> ~b_1    W+)
#
#         PDG            Width
DECAY   1000005     1.59434621E-01   # sbottom1 decays
#          BR         NDA      ID1       ID2
     4.93336231E-01    2     1000022         5   # BR(~b_1 -> ~chi_10 b )
     5.06663769E-01    2     1000023         5   # BR(~b_1 -> ~chi_20 b )
#
#         PDG            Width
DECAY   2000005     5.43430853E+01   # sbottom2 decays
#          BR         NDA      ID1       ID2
     2.98872516E-02    2     1000022         5   # BR(~b_2 -> ~chi_10 b )
     6.10817669E-08    2     1000023         5   # BR(~b_2 -> ~chi_20 b )
     2.70989307E-05    2     1000025         5   # BR(~b_2 -> ~chi_30 b )
     2.59019467E-05    2     1000035         5   # BR(~b_2 -> ~chi_40 b )
    -5.57523134E-08    2    -1000024         6   # BR(~b_2 -> ~chi_1- t )
     6.44099386E-01    2     1000021         5   # BR(~b_2 -> ~g      b )
     7.27932551E-02    2     1000005        25   # BR(~b_2 -> ~b_1    h )
     1.03125048E-01    2     1000005        23   # BR(~b_2 -> ~b_1    Z )
     1.50042053E-01    2     1000006       -24   # BR(~b_2 -> ~t_1    W-)
#
#         PDG            Width
DECAY   1000002     6.68689924E+01   # sup_L decays
#          BR         NDA      ID1       ID2
     6.08874621E-03    2     1000022         2   # BR(~u_L -> ~chi_10 u)
     1.54861097E-01    2     1000023         2   # BR(~u_L -> ~chi_20 u)
     1.66014050E-08    2     1000025         2   # BR(~u_L -> ~chi_30 u)
     3.64109120E-08    2     1000035         2   # BR(~u_L -> ~chi_40 u)
     3.09870399E-01    2     1000024         1   # BR(~u_L -> ~chi_1+ d)
     8.24748748E-09    2     1000037         1   # BR(~u_L -> ~chi_2+ d)
     5.29179697E-01    2     1000021         2   # BR(~u_L -> ~g      u)
#
#         PDG            Width
DECAY   2000002     4.17339908E+01   # sup_R decays
#          BR         NDA      ID1       ID2
     1.56070809E-01    2     1000022         2   # BR(~u_R -> ~chi_10 u)
     3.04036496E-08    2     1000023         2   # BR(~u_R -> ~chi_20 u)
     6.81993746E-09    2     1000025         2   # BR(~u_R -> ~chi_30 u)
     8.71407762E-09    2     1000035         2   # BR(~u_R -> ~chi_40 u)
     8.43929145E-01    2     1000021         2   # BR(~u_R -> ~g      u)
#
#         PDG            Width
DECAY   1000001     6.69217748E+01   # sdown_L decays
#          BR         NDA      ID1       ID2
     6.09311245E-03    2     1000022         1   # BR(~d_L -> ~chi_10 d)
     1.54743707E-01    2     1000023         1   # BR(~d_L -> ~chi_20 d)
     2.82569505E-08    2     1000025         1   # BR(~d_L -> ~chi_30 d)
     5.59401299E-08    2     1000035         1   # BR(~d_L -> ~chi_40 d)
     3.09306834E-01    2    -1000024         2   # BR(~d_L -> ~chi_1- u)
     2.53874689E-07    2    -1000037         2   # BR(~d_L -> ~chi_2- u)
     5.29856009E-01    2     1000021         1   # BR(~d_L -> ~g      d)
#
#         PDG            Width
DECAY   2000001     3.66740229E+01   # sdown_R decays
#          BR         NDA      ID1       ID2
     4.43668332E-02    2     1000022         1   # BR(~d_R -> ~chi_10 d)
     8.64178061E-09    2     1000023         1   # BR(~d_R -> ~chi_20 d)
     1.67664814E-09    2     1000025         1   # BR(~d_R -> ~chi_30 d)
     2.13841698E-09    2     1000035         1   # BR(~d_R -> ~chi_40 d)
     9.55633154E-01    2     1000021         1   # BR(~d_R -> ~g      d)
#
#         PDG            Width
DECAY   1000004     6.68689924E+01   # scharm_L decays
#          BR         NDA      ID1       ID2
     6.08874621E-03    2     1000022         4   # BR(~c_L -> ~chi_10 c)
     1.54861097E-01    2     1000023         4   # BR(~c_L -> ~chi_20 c)
     1.66014050E-08    2     1000025         4   # BR(~c_L -> ~chi_30 c)
     3.64109120E-08    2     1000035         4   # BR(~c_L -> ~chi_40 c)
     3.09870399E-01    2     1000024         3   # BR(~c_L -> ~chi_1+ s)
     8.24748748E-09    2     1000037         3   # BR(~c_L -> ~chi_2+ s)
     5.29179697E-01    2     1000021         4   # BR(~c_L -> ~g      c)
#
#         PDG            Width
DECAY   2000004     4.17339908E+01   # scharm_R decays
#          BR         NDA      ID1       ID2
     1.56070809E-01    2     1000022         4   # BR(~c_R -> ~chi_10 c)
     3.04036496E-08    2     1000023         4   # BR(~c_R -> ~chi_20 c)
     6.81993746E-09    2     1000025         4   # BR(~c_R -> ~chi_30 c)
     8.71407762E-09    2     1000035         4   # BR(~c_R -> ~chi_40 c)
     8.43929145E-01    2     1000021         4   # BR(~c_R -> ~g      c)
#
#         PDG            Width
DECAY   1000003     6.69217748E+01   # sstrange_L decays
#          BR         NDA      ID1       ID2
     6.09311245E-03    2     1000022         3   # BR(~s_L -> ~chi_10 s)
     1.54743707E-01    2     1000023         3   # BR(~s_L -> ~chi_20 s)
     2.82569505E-08    2     1000025         3   # BR(~s_L -> ~chi_30 s)
     5.59401299E-08    2     1000035         3   # BR(~s_L -> ~chi_40 s)
     3.09306834E-01    2    -1000024         4   # BR(~s_L -> ~chi_1- c)
     2.53874689E-07    2    -1000037         4   # BR(~s_L -> ~chi_2- c)
     5.29856009E-01    2     1000021         3   # BR(~s_L -> ~g      s)
#
#         PDG            Width
DECAY   2000003     3.66740229E+01   # sstrange_R decays
#          BR         NDA      ID1       ID2
     4.43668332E-02    2     1000022         3   # BR(~s_R -> ~chi_10 s)
     8.64178061E-09    2     1000023         3   # BR(~s_R -> ~chi_20 s)
     1.67664814E-09    2     1000025         3   # BR(~s_R -> ~chi_30 s)
     2.13841698E-09    2     1000035         3   # BR(~s_R -> ~chi_40 s)
     9.55633154E-01    2     1000021         3   # BR(~s_R -> ~g      s)
#
#         PDG            Width
DECAY   1000011     3.59563096E+01   # selectron_L decays
#          BR         NDA      ID1       ID2
     1.05988407E-01    2     1000022        11   # BR(~e_L -> ~chi_10 e-)
     2.98259415E-01    2     1000023        11   # BR(~e_L -> ~chi_20 e-)
     5.81109380E-10    2     1000025        11   # BR(~e_L -> ~chi_30 e-)
     1.37226928E-09    2     1000035        11   # BR(~e_L -> ~chi_40 e-)
     5.95752165E-01    2    -1000024        12   # BR(~e_L -> ~chi_1- nu_e)
     1.13452362E-08    2    -1000037        12   # BR(~e_L -> ~chi_2- nu_e)
#
#         PDG            Width
DECAY   2000011     1.52163367E+01   # selectron_R decays
#          BR         NDA      ID1       ID2
     9.99999806E-01    2     1000022        11   # BR(~e_R -> ~chi_10 e-)
     1.93945638E-07    2     1000023        11   # BR(~e_R -> ~chi_20 e-)
     1.28965984E-11    2     1000025        11   # BR(~e_R -> ~chi_30 e-)
     2.15625606E-12    2     1000035        11   # BR(~e_R -> ~chi_40 e-)
#
#         PDG            Width
DECAY   1000013     3.59563096E+01   # smuon_L decays
#          BR         NDA      ID1       ID2
     1.05988407E-01    2     1000022        13   # BR(~mu_L -> ~chi_10 mu-)
     2.98259415E-01    2     1000023        13   # BR(~mu_L -> ~chi_20 mu-)
     5.81109380E-10    2     1000025        13   # BR(~mu_L -> ~chi_30 mu-)
     1.37226928E-09    2     1000035        13   # BR(~mu_L -> ~chi_40 mu-)
     5.95752165E-01    2    -1000024        14   # BR(~mu_L -> ~chi_1- nu_mu)
     1.13452362E-08    2    -1000037        14   # BR(~mu_L -> ~chi_2- nu_mu)
#
#         PDG            Width
DECAY   2000013     1.52163367E+01   # smuon_R decays
#          BR         NDA      ID1       ID2
     9.99999806E-01    2     1000022        13   # BR(~mu_R -> ~chi_10 mu-)
     1.93945638E-07    2     1000023        13   # BR(~mu_R -> ~chi_20 mu-)
     1.28965984E-11    2     1000025        13   # BR(~mu_R -> ~chi_30 mu-)
     2.15625606E-12    2     1000035        13   # BR(~mu_R -> ~chi_40 mu-)
#
#         PDG            Width
DECAY   1000015     2.58232175E+01   # stau_1 decays
#          BR         NDA      ID1       ID2
     3.68136962E-01    2     1000022        15   # BR(~tau_1 -> ~chi_10  tau-)
     2.10819208E-01    2     1000023        15   # BR(~tau_1 -> ~chi_20  tau-)
     4.21043829E-01    2    -1000024        16   # BR(~tau_1 -> ~chi_1-  nu_tau)
#
#         PDG            Width
DECAY   2000015     2.53279340E+01   # stau_2 decays
#          BR         NDA      ID1       ID2
     3.76414878E-01    2     1000022        15   # BR(~tau_2 -> ~chi_10  tau-)
     2.08054871E-01    2     1000023        15   # BR(~tau_2 -> ~chi_20  tau-)
     1.09670185E-05    2     1000025        15   # BR(~tau_2 -> ~chi_30  tau-)
     9.18589334E-06    2     1000035        15   # BR(~tau_2 -> ~chi_40  tau-)
     4.15499381E-01    2    -1000024        16   # BR(~tau_2 -> ~chi_1-  nu_tau)
     1.07166011E-05    2    -1000037        16   # BR(~tau_2 -> ~chi_2-  nu_tau)
#
#         PDG            Width
DECAY   1000012     3.59563856E+01   # snu_eL decays
#          BR         NDA      ID1       ID2
     1.05978360E-01    2     1000022        12   # BR(~nu_eL -> ~chi_10 nu_e)
     2.97773445E-01    2     1000023        12   # BR(~nu_eL -> ~chi_20 nu_e)
     1.56644349E-09    2     1000025        12   # BR(~nu_eL -> ~chi_30 nu_e)
     2.54332822E-09    2     1000035        12   # BR(~nu_eL -> ~chi_40 nu_e)
     5.96248190E-01    2     1000024        11   # BR(~nu_eL -> ~chi_1+ e-)
     2.07012033E-10    2     1000037        11   # BR(~nu_eL -> ~chi_2+ e-)
#
#         PDG            Width
DECAY   1000014     3.59563856E+01   # snu_muL decays
#          BR         NDA      ID1       ID2
     1.05978360E-01    2     1000022        14   # BR(~nu_muL -> ~chi_10 nu_mu)
     2.97773445E-01    2     1000023        14   # BR(~nu_muL -> ~chi_20 nu_mu)
     1.56644349E-09    2     1000025        14   # BR(~nu_muL -> ~chi_30 nu_mu)
     2.54332822E-09    2     1000035        14   # BR(~nu_muL -> ~chi_40 nu_mu)
     5.96248190E-01    2     1000024        13   # BR(~nu_muL -> ~chi_1+ mu-)
     2.07012033E-10    2     1000037        13   # BR(~nu_muL -> ~chi_2+ mu-)
#
#         PDG            Width
DECAY   1000016     3.59617135E+01   # snu_tauL decays
#          BR         NDA      ID1       ID2
     1.05967817E-01    2     1000022        16   # BR(~nu_tauL -> ~chi_10 nu_tau)
     2.97746537E-01    2     1000023        16   # BR(~nu_tauL -> ~chi_20 nu_tau)
     1.65682290E-09    2     1000025        16   # BR(~nu_tauL -> ~chi_30 nu_tau)
     2.70167380E-09    2     1000035        16   # BR(~nu_tauL -> ~chi_40 nu_tau)
     5.96285257E-01    2     1000024        15   # BR(~nu_tauL -> ~chi_1+ tau-)
     3.84498613E-07    2     1000037        15   # BR(~nu_tauL -> ~chi_2+ tau-)
#
#         PDG            Width
DECAY   1000024     2.34722078E-05   # chargino1+ decays
#          BR         NDA      ID1       ID2
     1.00000000E+00    2     1000022        24   # BR(~chi_1+ -> ~chi_10  W+)
#
#         PDG            Width
DECAY   1000037     9.22116651E+01   # chargino2+ decays
#          BR         NDA      ID1       ID2
     1.36796073E-01    2     1000006        -5   # BR(~chi_2+ -> ~t_1     bb)
     6.65349093E-01    2    -1000005         6   # BR(~chi_2+ -> ~b_1*    t )
     5.26586614E-07    2    -1000015        16   # BR(~chi_2+ -> ~tau_1+  nu_tau)
     5.90060870E-02    2     1000024        23   # BR(~chi_2+ -> ~chi_1+  Z )
     1.93478152E-02    2     1000022        24   # BR(~chi_2+ -> ~chi_10  W+)
     5.74348754E-02    2     1000023        24   # BR(~chi_2+ -> ~chi_20  W+)
     6.20655291E-02    2     1000024        25   # BR(~chi_2+ -> ~chi_1+  h )
#
#         PDG            Width
DECAY   1000022     0.00000000E+00   # neutralino1 decays
#
#         PDG            Width
DECAY   1000023     2.22121850E-05   # neutralino2 decays
#          BR         NDA      ID1       ID2
     4.36141313E-01    2     1000022        23   # BR(~chi_20 -> ~chi_10   Z )
     5.63858687E-01    2     1000022        25   # BR(~chi_20 -> ~chi_10   h )
#
#         PDG            Width
DECAY   1000025     9.24015246E+01   # neutralino3 decays
#          BR         NDA      ID1       ID2
     1.12501572E-02    2     1000022        23   # BR(~chi_30 -> ~chi_10   Z )
     3.99494219E-02    2     1000023        23   # BR(~chi_30 -> ~chi_20   Z )
     5.72808423E-02    2     1000024       -24   # BR(~chi_30 -> ~chi_1+   W-)
     5.72808423E-02    2    -1000024        24   # BR(~chi_30 -> ~chi_1-   W+)
     8.90082807E-03    2     1000022        25   # BR(~chi_30 -> ~chi_10   h )
     1.91996719E-02    2     1000023        25   # BR(~chi_30 -> ~chi_20   h )
     3.35853319E-01    2     1000006        -6   # BR(~chi_30 -> ~t_1      tb)
     3.35853319E-01    2    -1000006         6   # BR(~chi_30 -> ~t_1*     t )
     6.72151903E-02    2     1000005        -5   # BR(~chi_30 -> ~b_1      bb)
     6.72151903E-02    2    -1000005         5   # BR(~chi_30 -> ~b_1*     b )
     6.09363538E-07    2     1000015       -15   # BR(~chi_30 -> ~tau_1-   tau+)
     6.09363538E-07    2    -1000015        15   # BR(~chi_30 -> ~tau_1+   tau-)
#
#         PDG            Width
DECAY   1000035     9.14792016E+01   # neutralino4 decays
#          BR         NDA      ID1       ID2
     8.69728283E-03    2     1000022        23   # BR(~chi_40 -> ~chi_10   Z )
     1.91079736E-02    2     1000023        23   # BR(~chi_40 -> ~chi_20   Z )
     5.78836171E-02    2     1000024       -24   # BR(~chi_40 -> ~chi_1+   W-)
     5.78836171E-02    2    -1000024        24   # BR(~chi_40 -> ~chi_1-   W+)
     1.18157166E-02    2     1000022        25   # BR(~chi_40 -> ~chi_10   h )
     4.31652276E-02    2     1000023        25   # BR(~chi_40 -> ~chi_20   h )
     3.32826855E-01    2     1000006        -6   # BR(~chi_40 -> ~t_1      tb)
     3.32826855E-01    2    -1000006         6   # BR(~chi_40 -> ~t_1*     t )
     6.78959369E-02    2     1000005        -5   # BR(~chi_40 -> ~b_1      bb)
     6.78959369E-02    2    -1000005         5   # BR(~chi_40 -> ~b_1*     b )
     4.90883759E-07    2     1000015       -15   # BR(~chi_40 -> ~tau_1-   tau+)
     4.90883759E-07    2    -1000015        15   # BR(~chi_40 -> ~tau_1+   tau-)
#
#         PDG            Width
DECAY        25     3.64909124E-03   # h decays
#          BR         NDA      ID1       ID2
     5.55941021E-01    2           5        -5   # BR(h -> b       bb     )
     7.12562141E-02    2         -15        15   # BR(h -> tau+    tau-   )
     2.52247354E-04    2         -13        13   # BR(h -> mu+     mu-    )
     5.35097911E-04    2           3        -3   # BR(h -> s       sb     )
     2.32540031E-02    2           4        -4   # BR(h -> c       cb     )
     7.59201838E-02    2          21        21   # BR(h -> g       g      )
     2.61017417E-03    2          22        22   # BR(h -> gam     gam    )
     1.76863282E-03    2          22        23   # BR(h -> Z       gam    )
     2.38458512E-01    2          24       -24   # BR(h -> W+      W-     )
     3.00039139E-02    2          23        23   # BR(h -> Z       Z      )
#
#         PDG            Width
DECAY        35     3.77001388E+01   # H decays
#          BR         NDA      ID1       ID2
     9.01979467E-01    2           5        -5   # BR(H -> b       bb     )
     6.59624506E-02    2         -15        15   # BR(H -> tau+    tau-   )
     2.33227463E-04    2         -13        13   # BR(H -> mu+     mu-    )
     2.86403638E-04    2           3        -3   # BR(H -> s       sb     )
     8.02681769E-08    2           4        -4   # BR(H -> c       cb     )
     8.00726667E-03    2           6        -6   # BR(H -> t       tb     )
     7.65005339E-06    2          21        21   # BR(H -> g       g      )
     6.27280806E-08    2          22        22   # BR(H -> gam     gam    )
     3.28549810E-09    2          23        22   # BR(H -> Z       gam    )
     6.60555031E-07    2          24       -24   # BR(H -> W+      W-     )
     3.29870379E-07    2          23        23   # BR(H -> Z       Z      )
     5.35788373E-06    2          25        25   # BR(H -> h       h      )
     4.16341329E-25    2          36        36   # BR(H -> A       A      )
     5.98826248E-19    2          23        36   # BR(H -> Z       A      )
     6.64835693E-04    2     1000024  -1000024   # BR(H -> ~chi_1+ ~chi_1-)
     3.91857751E-05    2     1000022   1000022   # BR(H -> ~chi_10 ~chi_10)
     3.32157630E-04    2     1000023   1000023   # BR(H -> ~chi_20 ~chi_20)
     2.34860773E-04    2     1000022   1000023   # BR(H -> ~chi_10 ~chi_20)
     2.22407834E-02    2     1000006  -1000006   # BR(H -> ~t_1    ~t_1*  )
     5.21668584E-06    2     1000005  -1000005   # BR(H -> ~b_1    ~b_1*  )
#
#         PDG            Width
DECAY        36     3.68752002E+01   # A decays
#          BR         NDA      ID1       ID2
     9.22169839E-01    2           5        -5   # BR(A -> b       bb     )
     6.74359445E-02    2         -15        15   # BR(A -> tau+    tau-   )
     2.38437051E-04    2         -13        13   # BR(A -> mu+     mu-    )
     2.92850211E-04    2           3        -3   # BR(A -> s       sb     )
     8.26381786E-08    2           4        -4   # BR(A -> c       cb     )
     8.23915162E-03    2           6        -6   # BR(A -> t       tb     )
     2.42635132E-05    2          21        21   # BR(A -> g       g      )
     6.37587087E-08    2          22        22   # BR(A -> gam     gam    )
     2.39112396E-08    2          23        22   # BR(A -> Z       gam    )
     6.72745862E-07    2          23        25   # BR(A -> Z       h      )
     8.61361453E-04    2     1000024  -1000024   # BR(A -> ~chi_1+ ~chi_1-)
     4.18443436E-05    2     1000022   1000022   # BR(A -> ~chi_10 ~chi_10)
     4.30270859E-04    2     1000023   1000023   # BR(A -> ~chi_20 ~chi_20)
     2.65194309E-04    2     1000022   1000023   # BR(A -> ~chi_10 ~chi_20)
#
#         PDG            Width
DECAY        37     4.04676422E+01   # H+ decays
#          BR         NDA      ID1       ID2
     1.47096808E-03    2           4        -5   # BR(H+ -> c       bb     )
     6.14718119E-02    2         -15        16   # BR(H+ -> tau+    nu_tau )
     2.17349333E-04    2         -13        14   # BR(H+ -> mu+     nu_mu  )
     9.41418416E-06    2           2        -5   # BR(H+ -> u       bb     )
     1.27730640E-05    2           2        -3   # BR(H+ -> u       sb     )
     2.62782999E-04    2           4        -3   # BR(H+ -> c       sb     )
     9.25387202E-01    2           6        -5   # BR(H+ -> t       bb     )
     6.14078111E-07    2          24        25   # BR(H+ -> W+      h      )
     5.05320494E-14    2          24        36   # BR(H+ -> W+      A      )
     4.60444113E-04    2     1000024   1000022   # BR(H+ -> ~chi_1+ ~chi_10)
     8.86984374E-11    2     1000024   1000023   # BR(H+ -> ~chi_1+ ~chi_20)
     1.07066400E-02    2     1000006  -1000005   # BR(H+ -> ~t_1    ~b_1*  )
