# SUSY Les Houches Accord 2 - MSSM spectrum + Decays
# SPheno v3.1.12 
# W. Porod, Comput. Phys. Commun. 153 (2003) 275-315, hep-ph/0301101
# in case of problems send email to porod@physik.uni-wuerzburg.de
# Created: 12.11.2012,  11:44
Block SPINFO         # Program information
     1   SPheno      # spectrum calculator
     2   v3.1.12     # version number
#
Block SPhenoINFO     # SPheno specific information
    1      2         # using 2-loop RGEs
    2      2         # using pole masses for boundary conditions at mZ
Block MODSEL  # Model selection
    1    2    # mGMSB model
Block MINPAR  # Input parameters
    1    1.00000000E+05  # Lambda, scale of SUSY breaking
    2    2.50000000E+05  # M_M, messenger mass scale
    3    2.00000000E+00  # tanb at m_Z   
    4    1.00000000E+00  # Sign(mu)
    5    3.00000000E+00  # N_5 number of effective five-plets
    6    1.00000000E+00  # c_grav, Gravitino mass factor
Block gauge Q=  2.50000000E+05  # (GMSB scale)
   1    4.93703447E-01  # g'(Q)^DRbar
   2    6.49148954E-01  # g(Q)^DRbar
   3    9.41968828E-01  # g3(Q)^DRbar
Block SMINPUTS  # SM parameters
         1     1.27932637E+02  # alpha_em^-1(MZ)^MSbar
         2     1.16639000E-05  # G_mu [GeV^-2]
         3     1.17200000E-01  # alpha_s(MZ)^MSbar
         4     9.11876000E+01  # m_Z(pole)
         5     4.20000000E+00  # m_b(m_b), MSbar
         6     1.72500000E+02  # m_t(pole)
         7     1.77700000E+00  # m_tau(pole)
         8     0.00000000E+00  # m_nu_3
        11     5.10998910E-04  # m_e(pole)
        12     0.00000000E+00  # m_nu_1
        13     1.05658000E-01  # m_muon(pole)
        14     0.00000000E+00  # m_nu_2
        21     5.00000000E-03  # m_d(2 GeV), MSbar
        22     3.00000000E-03  # m_u(2 GeV), MSbar
        23     1.05000000E-01  # m_s(2 GeV), MSbar
        24     1.27000000E+00  # m_c(m_c), MSbar
Block gauge Q=  1.90064430E+03  # (SUSY scale)
   1    3.64459471E-01  # g'(Q)^DRbar
   2    6.39381408E-01  # g(Q)^DRbar
   3    1.02748547E+00  # g3(Q)^DRbar
Block Yu Q=  1.90064430E+03  # (SUSY scale)
  1  1     9.48823924E-06   # Y_u(Q)^DRbar
  2  2     4.01668824E-03   # Y_c(Q)^DRbar
  3  3     9.52715376E-01   # Y_t(Q)^DRbar
Block Yd Q=  1.90064430E+03  # (SUSY scale)
  1  1     2.99979112E-05   # Y_d(Q)^DRbar
  2  2     6.29955898E-04   # Y_s(Q)^DRbar
  3  3     2.95016832E-02   # Y_b(Q)^DRbar
Block Ye Q=  1.90064430E+03  # (SUSY scale)
  1  1     6.27514247E-06   # Y_e(Q)^DRbar
  2  2     1.29749595E-03   # Y_mu(Q)^DRbar
  3  3     2.18219691E-02   # Y_tau(Q)^DRbar
Block Au Q=  1.90064430E+03  # (SUSY scale)
  1  1    -6.10775725E+02   # A_u(Q)^DRbar
  2  2    -6.10774911E+02   # A_c(Q)^DRbar
  3  3    -5.65975181E+02   # A_t(Q)^DRbar
Block Ad Q=  1.90064430E+03  # (SUSY scale)
  1  1    -6.64686574E+02   # A_d(Q)^DRbar
  2  2    -6.64686288E+02   # A_s(Q)^DRbar
  3  3    -6.50096246E+02   # A_b(Q)^DRbar
Block Ae Q=  1.90064430E+03  # (SUSY scale)
  1  1    -7.25836790E+01   # A_e(Q)^DRbar
  2  2    -7.25836666E+01   # A_mu(Q)^DRbar
  3  3    -7.25801612E+01   # A_tau(Q)^DRbar
Block MSOFT Q=  1.90064430E+03  # soft SUSY breaking masses at Q
   1    4.29681247E+02  # M_1
   2    7.90665356E+02  # M_2
   3    2.05138427E+03  # M_3
  21    3.90394242E+05  # M^2_(H,d)
  22   -6.23087742E+05  # M^2_(H,u)
  31    6.25627460E+02  # M_(L,11)
  32    6.25627395E+02  # M_(L,22)
  33    6.25608917E+02  # M_(L,33)
  34    3.02167986E+02  # M_(E,11)
  35    3.02167710E+02  # M_(E,22)
  36    3.02089905E+02  # M_(E,33)
  41    2.00496458E+03  # M_(Q,11)
  42    2.00496316E+03  # M_(Q,22)
  43    1.92714929E+03  # M_(Q,33)
  44    1.92449389E+03  # M_(U,11)
  45    1.92449097E+03  # M_(U,22)
  46    1.75486777E+03  # M_(U,33)
  47    1.91664944E+03  # M_(D,11)
  48    1.91664936E+03  # M_(D,22)
  49    1.91648722E+03  # M_(D,33)
Block MASS  # Mass spectrum
#   PDG code      mass          particle
         6     1.72500000E+02  # m_t(pole)
        23     9.11876000E+01  # m_Z(pole)
        24     8.03021851E+01  # W+
        15     1.77700000E+00  # m_tau(pole)
        25     9.52919431E+01  # h0
        35     1.41906234E+03  # H0
        36     1.41617435E+03  # A0
        37     1.41901551E+03  # H+
   1000001     2.08741894E+03  # ~d_L
   2000001     1.99468513E+03  # ~d_R
   1000002     2.08662909E+03  # ~u_L
   2000002     2.00194300E+03  # ~u_R
   1000003     2.08741724E+03  # ~s_L
   2000003     1.99468502E+03  # ~s_R
   1000004     2.08662797E+03  # ~c_L
   2000004     2.00193916E+03  # ~c_R
   1000005     1.99166264E+03  # ~b_1
   2000005     1.99553493E+03  # ~b_2
   1000006     1.79757748E+03  # ~t_1
   2000006     2.00961627E+03  # ~t_2
   1000011     6.39042683E+02  # ~e_L-
   2000011     3.14335938E+02  # ~e_R-
   1000012     6.35822278E+02  # ~nu_eL
   1000013     6.39042728E+02  # ~mu_L-
   2000013     3.14335351E+02  # ~mu_R-
   1000014     6.35822183E+02  # ~nu_muL
   1000015     3.14169937E+02  # ~tau_1-
   2000015     6.39055436E+02  # ~tau_2-
   1000016     6.35795602E+02  # ~nu_tauL
   1000021     2.16142080E+03  # ~g
   1000022     4.17197719E+02  # ~chi_10
   1000023     7.88909286E+02  # ~chi_20
   1000025    -1.07946016E+03  # ~chi_30
   1000035     1.10174482E+03  # ~chi_40
   1000024     7.88844731E+02  # ~chi_1+
   1000037     1.09936331E+03  # ~chi_2+
   1000039     6.00000000E-09  # ~G
# Higgs mixing
Block alpha # Effective Higgs mixing angle
          -4.90273878E-01   # alpha
Block Hmix Q=  1.90064430E+03  # Higgs mixing parameters
   1    1.07636318E+03  # mu
   2    1.88991148E+00  # tan[beta](Q)
   3    2.44056869E+02  # v(Q)
   4    1.79357699E+06  # m^2_A(Q)
Block stopmix # stop mixing matrix
   1  1     2.34985707E-01   # Re[R_st(1,1)]
   1  2     9.71998826E-01   # Re[R_st(1,2)]
   2  1    -9.71998826E-01   # Re[R_st(2,1)]
   2  2     2.34985707E-01   # Re[R_st(2,2)]
Block sbotmix # sbottom mixing matrix
   1  1     8.57926828E-01   # Re[R_sb(1,1)]
   1  2     5.13771892E-01   # Re[R_sb(1,2)]
   2  1    -5.13771892E-01   # Re[R_sb(2,1)]
   2  2     8.57926828E-01   # Re[R_sb(2,2)]
Block staumix # stau mixing matrix
   1  1     1.22902178E-02   # Re[R_sta(1,1)]
   1  2     9.99924472E-01   # Re[R_sta(1,2)]
   2  1    -9.99924472E-01   # Re[R_sta(2,1)]
   2  2     1.22902178E-02   # Re[R_sta(2,2)]
Block Nmix # neutralino mixing matrix
   1  1    -9.97737584E-01   # Re[N(1,1)]
   1  2     1.20404827E-02   # Re[N(1,2)]
   1  3    -5.27379283E-02   # Re[N(1,3)]
   1  4     3.99180458E-02   # Re[N(1,4)]
   2  1    -2.77528876E-02   # Re[N(2,1)]
   2  2    -9.69609522E-01   # Re[N(2,2)]
   2  3     1.80185239E-01   # Re[N(2,3)]
   2  4    -1.63157691E-01   # Re[N(2,4)]
   3  1    -8.89065113E-03   # Re[N(3,1)]
   3  2     1.25070023E-02   # Re[N(3,2)]
   3  3     7.06561133E-01   # Re[N(3,3)]
   3  4     7.07485616E-01   # Re[N(3,4)]
   4  1    -6.05842078E-02   # Re[N(4,1)]
   4  2     2.44040933E-01   # Re[N(4,2)]
   4  3     6.82292720E-01   # Re[N(4,3)]
   4  4    -6.86476672E-01   # Re[N(4,4)]
Block Umix # chargino mixing matrix
   1  1    -9.65940242E-01   # Re[U(1,1)]
   1  2     2.58765241E-01   # Re[U(1,2)]
   2  1     2.58765241E-01   # Re[U(2,1)]
   2  2     9.65940242E-01   # Re[U(2,2)]
Block Vmix # chargino mixing matrix
   1  1    -9.72094736E-01   # Re[V(1,1)]
   1  2     2.34588627E-01   # Re[V(1,2)]
   2  1     2.34588627E-01   # Re[V(2,1)]
   2  2     9.72094736E-01   # Re[V(2,2)]
DECAY   2000011     9.76832977E-11   # ~e^-_R
#    BR                NDA      ID1      ID2
     1.00000000E+00    2     1000039        11   # BR(~e^-_R -> ~G e^-)
DECAY   1000011     2.65143014E-01   # ~e^-_L
#    BR                NDA      ID1      ID2
     9.99999984E-01    2     1000022        11   # BR(~e^-_L -> chi^0_1 e^-)
     1.51379391E-09    2     2000011        23   # BR(~e^-_L -> ~e^-_R Z)
     1.61212940E-09    2     2000011        25   # BR(~e^-_L -> ~e^-_R h^0)
     1.27943807E-08    2     1000039        11   # BR(~e^-_L -> ~G e^-)
DECAY   2000013     9.76823418E-11   # ~mu^-_R
#    BR                NDA      ID1      ID2
     1.00000000E+00    2     1000039        13   # BR(~mu^-_R -> ~G mu^-)
DECAY   1000013     2.65178594E-01   # ~mu^-_L
#    BR                NDA      ID1      ID2
     9.99866363E-01    2     1000022        13   # BR(~mu^-_L -> chi^0_1 mu^-)
     6.47103878E-05    2     2000013        23   # BR(~mu^-_L -> ~mu^-_R Z)
     6.89137865E-05    2     2000013        25   # BR(~mu^-_L -> ~mu^-_R h^0)
     1.27926672E-08    2     1000039        13   # BR(~mu^-_L -> ~G mu^-)
DECAY   1000015     9.74131703E-11   # ~tau^-_1
#    BR                NDA      ID1      ID2
     1.00000000E+00    2     1000039        15   # BR(~tau^-_1 -> ~G tau^-)
DECAY   2000015     2.75208289E-01   # ~tau^-_2
#    BR                NDA      ID1      ID2
     9.63576589E-01    2     1000022        15   # BR(~tau^-_2 -> chi^0_1 tau^-)
     1.76449198E-02    2     1000015        23   # BR(~tau^-_2 -> ~tau^-_1 Z)
     1.87784786E-02    2     1000015        25   # BR(~tau^-_2 -> ~tau^-_1 h^0)
     1.23272968E-08    2     1000039        15   # BR(~tau^-_2 -> ~G tau^-)
DECAY   1000012     2.82808220E-01   # ~nu_e
#    BR                NDA      ID1      ID2
     9.99999986E-01    2     1000022        12   # BR(~nu_e -> chi^0_1 nu_e)
     2.77564545E-09    2     2000011        24   # BR(~nu_e -> ~e^-_R W^+)
     1.16959850E-08    2     1000039        12   # BR(~nu_e -> ~G nu_e)
DECAY   1000014     2.82841610E-01   # ~nu_mu
#    BR                NDA      ID1      ID2
     9.99881336E-01    2     1000022        14   # BR(~nu_mu -> chi^0_1 nu_mu)
     1.18652786E-04    2     2000013        24   # BR(~nu_mu -> ~mu^-_R W^+)
     1.16945956E-08    2     1000039        14   # BR(~nu_mu -> ~G nu_mu)
DECAY   1000016     2.92255701E-01   # ~nu_tau
#    BR                NDA      ID1      ID2
     9.67510531E-01    2     1000022        16   # BR(~nu_tau -> chi^0_1 nu_tau)
     3.24894572E-02    2     1000015        24   # BR(~nu_tau -> ~tau^-_1 W^+)
     1.13155256E-08    2     1000039        16   # BR(~nu_tau -> ~G nu_tau)
DECAY   2000001     1.06904240E+00   # ~d_R
#    BR                NDA      ID1      ID2
     9.97412989E-01    2     1000022         1   # BR(~d_R -> chi^0_1 d)
     6.00569328E-04    2     1000023         1   # BR(~d_R -> chi^0_2 d)
     4.33163786E-05    2     1000025         1   # BR(~d_R -> chi^0_3 d)
     1.94216304E-03    2     1000035         1   # BR(~d_R -> chi^0_4 d)
     1.01090945E-08    2    -1000024         2   # BR(~d_R -> chi^-_1 u)
     1.19915533E-08    2    -1000037         2   # BR(~d_R -> chi^-_2 u)
     9.40214503E-07    2     1000039         1   # BR(~d_R -> ~G d)
DECAY   1000001     1.86398372E+01   # ~d_L
#    BR                NDA      ID1      ID2
     1.70621430E-02    2     1000022         1   # BR(~d_L -> chi^0_1 d)
     3.11152620E-01    2     1000023         1   # BR(~d_L -> chi^0_2 d)
     4.92551584E-05    2     1000025         1   # BR(~d_L -> chi^0_3 d)
     1.54785110E-02    2     1000035         1   # BR(~d_L -> chi^0_4 d)
     6.24411128E-01    2    -1000024         2   # BR(~d_L -> chi^-_1 u)
     3.18462743E-02    2    -1000037         2   # BR(~d_L -> chi^-_2 u)
     2.15196737E-13    2     2000002       -24   # BR(~d_L -> ~u_R W^-)
     2.27370509E-13    2     2000001        23   # BR(~d_L -> ~d_R Z)
     6.76793395E-08    2     1000039         1   # BR(~d_L -> ~G d)
DECAY   2000003     1.06906182E+00   # ~s_R
#    BR                NDA      ID1      ID2
     9.97394936E-01    2     1000022         3   # BR(~s_R -> chi^0_1 s)
     6.02743010E-04    2     1000023         3   # BR(~s_R -> chi^0_2 s)
     4.69300830E-05    2     1000025         3   # BR(~s_R -> chi^0_3 s)
     1.94470466E-03    2     1000035         3   # BR(~s_R -> chi^0_4 s)
     4.45811329E-06    2    -1000024         4   # BR(~s_R -> chi^-_1 c)
     5.28815514E-06    2    -1000037         4   # BR(~s_R -> chi^-_2 c)
     9.40197160E-07    2     1000039         3   # BR(~s_R -> ~G s)
DECAY   1000003     1.86401679E+01   # ~s_L
#    BR                NDA      ID1      ID2
     1.70618192E-02    2     1000022         3   # BR(~s_L -> chi^0_1 s)
     3.11146576E-01    2     1000023         3   # BR(~s_L -> chi^0_2 s)
     4.94934165E-05    2     1000025         3   # BR(~s_L -> chi^0_3 s)
     1.54784743E-02    2     1000035         3   # BR(~s_L -> chi^0_4 s)
     6.24398774E-01    2    -1000024         4   # BR(~s_L -> chi^-_1 c)
     3.18647567E-02    2    -1000037         4   # BR(~s_L -> chi^-_2 c)
     3.85873034E-08    2     2000004       -24   # BR(~s_L -> ~c_R W^-)
     1.00115979E-10    2     2000003        23   # BR(~s_L -> ~s_R Z)
     6.76778630E-08    2     1000039         3   # BR(~s_L -> ~G s)
DECAY   1000005     2.65947466E+01   # ~b_1
#    BR                NDA      ID1      ID2
     1.93695420E-02    2     1000022         5   # BR(~b_1 -> chi^0_1 b)
     1.50339617E-01    2     1000023         5   # BR(~b_1 -> chi^0_2 b)
     2.37800907E-04    2     1000025         5   # BR(~b_1 -> chi^0_3 b)
     5.76293825E-03    2     1000035         5   # BR(~b_1 -> chi^0_4 b)
     3.16107195E-01    2    -1000024         6   # BR(~b_1 -> chi^-_1 t)
     4.71595480E-01    2    -1000037         6   # BR(~b_1 -> chi^-_2 t)
     3.65873892E-02    2     1000006       -24   # BR(~b_1 -> ~t_1 W^-)
     3.75081318E-08    2     1000039         5   # BR(~b_1 -> ~G b)
DECAY   2000005     1.03138661E+01   # ~b_2
#    BR                NDA      ID1      ID2
     8.26355066E-02    2     1000022         5   # BR(~b_2 -> chi^0_1 b)
     1.32048864E-01    2     1000023         5   # BR(~b_2 -> chi^0_2 b)
     1.13920848E-03    2     1000025         5   # BR(~b_2 -> chi^0_3 b)
     1.16322613E-02    2     1000035         5   # BR(~b_2 -> chi^0_4 b)
     2.78811376E-01    2    -1000024         6   # BR(~b_2 -> chi^-_1 t)
     4.57501967E-01    2    -1000037         6   # BR(~b_2 -> chi^-_2 t)
     3.62307193E-02    2     1000006       -24   # BR(~b_2 -> ~t_1 W^-)
     9.76602008E-08    2     1000039         5   # BR(~b_2 -> ~G b)
DECAY   2000002     4.29462191E+00   # ~u_R
#    BR                NDA      ID1      ID2
     9.97401248E-01    2     1000022         2   # BR(~u_R -> chi^0_1 u)
     6.01771928E-04    2     1000023         2   # BR(~u_R -> chi^0_2 u)
     4.35390506E-05    2     1000025         2   # BR(~u_R -> chi^0_3 u)
     1.95320250E-03    2     1000035         2   # BR(~u_R -> chi^0_4 u)
     2.25228146E-10    2     1000024         1   # BR(~u_R -> chi^+_1 d)
     3.15623159E-10    2     1000037         1   # BR(~u_R -> chi^+_2 d)
     2.38332757E-07    2     1000039         2   # BR(~u_R -> ~G u)
DECAY   1000002     1.86769952E+01   # ~u_L
#    BR                NDA      ID1      ID2
     1.31976204E-02    2     1000022         2   # BR(~u_L -> chi^0_1 u)
     3.17162872E-01    2     1000023         2   # BR(~u_L -> chi^0_2 u)
     2.85168014E-05    2     1000025         2   # BR(~u_L -> chi^0_3 u)
     1.27774026E-02    2     1000035         2   # BR(~u_L -> chi^0_4 u)
     6.30737221E-01    2     1000024         1   # BR(~u_L -> chi^+_1 d)
     2.60962996E-02    2     1000037         1   # BR(~u_L -> chi^+_2 d)
     8.27636972E-12    2     2000001        24   # BR(~u_L -> ~d_R W^+)
     6.74169970E-08    2     1000039         2   # BR(~u_L -> ~G u)
DECAY   2000004     4.29537617E+00   # ~c_R
#    BR                NDA      ID1      ID2
     9.97219305E-01    2     1000022         4   # BR(~c_R -> chi^0_1 c)
     6.21581869E-04    2     1000023         4   # BR(~c_R -> chi^0_2 c)
     8.17941330E-05    2     1000025         4   # BR(~c_R -> chi^0_3 c)
     1.98017334E-03    2     1000035         4   # BR(~c_R -> chi^0_4 c)
     4.03545311E-05    2     1000024         3   # BR(~c_R -> chi^+_1 s)
     5.65529501E-05    2     1000037         3   # BR(~c_R -> chi^+_2 s)
     2.38288233E-07    2     1000039         4   # BR(~c_R -> ~G c)
DECAY   1000004     1.86772128E+01   # ~c_L
#    BR                NDA      ID1      ID2
     1.31983941E-02    2     1000022         4   # BR(~c_L -> chi^0_1 c)
     3.17154569E-01    2     1000023         4   # BR(~c_L -> chi^0_2 c)
     3.80395887E-05    2     1000025         4   # BR(~c_L -> chi^0_3 c)
     1.27885154E-02    2     1000035         4   # BR(~c_L -> chi^0_4 c)
     6.30720826E-01    2     1000024         3   # BR(~c_L -> chi^+_1 s)
     2.60995852E-02    2     1000037         3   # BR(~c_L -> chi^+_2 s)
     3.64943193E-09    2     2000003        24   # BR(~c_L -> ~s_R W^+)
     6.74159309E-08    2     1000039         4   # BR(~c_L -> ~G c)
DECAY   1000006     3.03761949E+01   # ~t_1
#    BR                NDA      ID1      ID2
     2.49077274E-12    2     1000022         4   # BR(~t_1 -> chi^0_1 c)
     1.20595202E-01    2     1000022         6   # BR(~t_1 -> chi^0_1 t)
     5.46914466E-11    2     1000023         4   # BR(~t_1 -> chi^0_2 c)
     4.78320880E-02    2     1000023         6   # BR(~t_1 -> chi^0_2 t)
     2.27762341E-01    2     1000025         6   # BR(~t_1 -> chi^0_3 t)
     1.57389736E-01    2     1000035         6   # BR(~t_1 -> chi^0_4 t)
     1.01294633E-01    2     1000024         5   # BR(~t_1 -> chi^+_1 b)
     3.45109342E-01    2     1000037         5   # BR(~t_1 -> chi^+_2 b)
     1.89532382E-08    2     1000039         6   # BR(~t_1 -> ~G t)
#    BR                NDA      ID1      ID2       ID3
     1.66392347E-05    3     1000022        24         5   # BR(~t_1 -> chi^0_1 W^+ b)
DECAY   2000006     3.60232720E+01   # ~t_2
#    BR                NDA      ID1      ID2
     9.17672191E-03    2     1000022         6   # BR(~t_2 -> chi^0_1 t)
     1.30228976E-01    2     1000023         6   # BR(~t_2 -> chi^0_2 t)
     2.32133953E-01    2     1000025         6   # BR(~t_2 -> chi^0_3 t)
     2.74065172E-01    2     1000035         6   # BR(~t_2 -> chi^0_4 t)
     2.41680093E-01    2     1000024         5   # BR(~t_2 -> chi^+_1 b)
     7.24277621E-02    2     1000037         5   # BR(~t_2 -> chi^+_2 b)
     2.23598315E-02    2     1000006        23   # BR(~t_2 -> ~t_1 Z)
     1.79274625E-02    2     1000006        25   # BR(~t_2 -> ~t_1 h^0)
     2.81180812E-08    2     1000039         6   # BR(~t_2 -> ~G t)
DECAY   1000024     2.26393443E+00   # chi^+_1
#    BR                NDA      ID1      ID2
     3.55517119E-11    2    -2000011        12   # BR(chi^+_1 -> ~e^+_R nu_e)
     1.56208864E-01    2    -1000011        12   # BR(chi^+_1 -> ~e^+_L nu_e)
     1.51993599E-06    2    -2000013        14   # BR(chi^+_1 -> ~mu^+_R nu_mu)
     1.56208572E-01    2    -1000013        14   # BR(chi^+_1 -> ~mu^+_L nu_mu)
     4.29917072E-04    2    -1000015        16   # BR(chi^+_1 -> ~tau^+_1 nu_tau)
     1.56126369E-01    2    -2000015        16   # BR(chi^+_1 -> ~tau^+_2 nu_tau)
     1.64337229E-01    2     1000012       -11   # BR(chi^+_1 -> ~nu_e e^+)
     1.64337563E-01    2     1000014       -13   # BR(chi^+_1 -> ~nu_mu mu^+)
     1.64431519E-01    2     1000016       -15   # BR(chi^+_1 -> ~nu_tau tau^+)
     3.77876846E-02    2     1000022        24   # BR(chi^+_1 -> chi^0_1 W^+)
#    BR                NDA      ID1      ID2       ID3
     1.40610380E-07    3     1000022        -1         2   # BR(chi^+_1 -> chi^0_1 d_bar u)
     1.40615252E-07    3     1000022        -3         4   # BR(chi^+_1 -> chi^0_1 s_bar c)
     1.30407234E-04    3     1000022        -5         6   # BR(chi^+_1 -> chi^0_1 b_bar t)
     2.60708245E-10    3     1000022       -13        14   # BR(chi^+_1 -> chi^0_1 mu^+ nu_mu)
     7.36102842E-08    3     1000022       -15        16   # BR(chi^+_1 -> chi^0_1 tau^+ nu_tau)
DECAY   1000037     8.79333775E+00   # chi^+_2
#    BR                NDA      ID1      ID2
     3.14493320E-11    2    -2000011        12   # BR(chi^+_2 -> ~e^+_R nu_e)
     1.49237463E-02    2    -1000011        12   # BR(chi^+_2 -> ~e^+_L nu_e)
     1.34454828E-06    2    -2000013        14   # BR(chi^+_2 -> ~mu^+_R nu_mu)
     1.49239014E-02    2    -1000013        14   # BR(chi^+_2 -> ~mu^+_L nu_mu)
     3.80356866E-04    2    -1000015        16   # BR(chi^+_2 -> ~tau^+_1 nu_tau)
     1.49676507E-02    2    -2000015        16   # BR(chi^+_2 -> ~tau^+_2 nu_tau)
     1.23915269E-02    2     1000012       -11   # BR(chi^+_2 -> ~nu_e e^+)
     1.23923357E-02    2     1000014       -13   # BR(chi^+_2 -> ~nu_mu mu^+)
     1.26203495E-02    2     1000016       -15   # BR(chi^+_2 -> ~nu_tau tau^+)
     9.93105588E-02    2     1000022        24   # BR(chi^+_2 -> chi^0_1 W^+)
     2.91412600E-01    2     1000023        24   # BR(chi^+_2 -> chi^0_2 W^+)
     2.80578082E-01    2     1000024        23   # BR(chi^+_2 -> chi^+_1 Z)
     2.44267285E-01    2     1000024        25   # BR(chi^+_2 -> chi^+_1 h^0)
#    BR                NDA      ID1      ID2       ID3
     3.63388796E-08    3     1000024         2        -2   # BR(chi^+_2 -> chi^+_1 u u_bar)
     3.63318677E-08    3     1000024         4        -4   # BR(chi^+_2 -> chi^+_1 c c_bar)
     3.03055356E-08    3     1000024         1        -1   # BR(chi^+_2 -> chi^+_1 d d_bar)
     3.03036910E-08    3     1000024         3        -3   # BR(chi^+_2 -> chi^+_1 s s_bar)
     2.15186705E-07    3     1000024         5        -5   # BR(chi^+_2 -> chi^+_1 b b_bar)
     5.72685180E-07    3     1000024        11       -11   # BR(chi^+_2 -> chi^+_1 e^- e^+)
     5.72721878E-07    3     1000024        13       -13   # BR(chi^+_2 -> chi^+_1 mu^- mu^+)
     5.81151013E-07    3     1000024        15       -15   # BR(chi^+_2 -> chi^+_1 tau^- tau^+)
     2.10505957E-06    3     1000024        12       -12   # BR(chi^+_2 -> chi^+_1 nu_e nu_bar_e)
     3.80268407E-08    3     1000022        -1         2   # BR(chi^+_2 -> chi^0_1 d_bar u)
     3.82306541E-08    3     1000022        -3         4   # BR(chi^+_2 -> chi^0_1 s_bar c)
     1.29466810E-03    3     1000022        -5         6   # BR(chi^+_2 -> chi^0_1 b_bar t)
     1.66006041E-14    3     1000022       -11        12   # BR(chi^+_2 -> chi^0_1 e^+ nu_e)
     7.09720321E-10    3     1000022       -13        14   # BR(chi^+_2 -> chi^0_1 mu^+ nu_mu)
     2.00541162E-07    3     1000022       -15        16   # BR(chi^+_2 -> chi^0_1 tau^+ nu_tau)
     1.72702066E-08    3     1000023        -1         2   # BR(chi^+_2 -> chi^0_2 d_bar u)
     1.72678921E-08    3     1000023        -3         4   # BR(chi^+_2 -> chi^0_2 s_bar c)
     5.29652917E-04    3     1000023        -5         6   # BR(chi^+_2 -> chi^0_2 b_bar t)
     3.46915018E-07    3     1000023       -11        12   # BR(chi^+_2 -> chi^0_2 e^+ nu_e)
     3.46932722E-07    3     1000023       -13        14   # BR(chi^+_2 -> chi^0_2 mu^+ nu_mu)
     3.50758498E-07    3     1000023       -15        16   # BR(chi^+_2 -> chi^0_2 tau^+ nu_tau)
     1.36336747E-07    3     1000025        -1         2   # BR(chi^+_2 -> chi^0_3 d_bar u)
     1.33674740E-07    3     1000025        -3         4   # BR(chi^+_2 -> chi^0_3 s_bar c)
     4.54462842E-08    3     1000025       -11        12   # BR(chi^+_2 -> chi^0_3 e^+ nu_e)
     4.54457928E-08    3     1000025       -13        14   # BR(chi^+_2 -> chi^0_3 mu^+ nu_mu)
     4.36986147E-08    3     1000025       -15        16   # BR(chi^+_2 -> chi^0_3 tau^+ nu_tau)
DECAY   1000022     1.23173392E+00   # chi^0_1
#    BR                NDA      ID1      ID2
     1.66531085E-01    2     2000011       -11   # BR(chi^0_1 -> ~e^-_R e^+)
     1.66531085E-01    2    -2000011        11   # BR(chi^0_1 -> ~e^+_R e^-)
     1.66532517E-01    2     2000013       -13   # BR(chi^0_1 -> ~mu^-_R mu^+)
     1.66532517E-01    2    -2000013        13   # BR(chi^0_1 -> ~mu^+_R mu^-)
     1.66936397E-01    2     1000015       -15   # BR(chi^0_1 -> ~tau^-_1 tau^+)
     1.66936397E-01    2    -1000015        15   # BR(chi^0_1 -> ~tau^+_1 tau^-)
     2.42041485E-10    2     1000039        22   # BR(chi^0_1 -> ~G photon)
     7.34979077E-11    2     1000039        23   # BR(chi^0_1 -> ~G Z)
     1.17452578E-12    2     1000039        25   # BR(chi^0_1 -> ~G h^0)
DECAY   1000023     2.28207737E+00   # chi^0_2
#    BR                NDA      ID1      ID2
     4.97948269E-04    2     2000011       -11   # BR(chi^0_2 -> ~e^-_R e^+)
     4.97948269E-04    2    -2000011        11   # BR(chi^0_2 -> ~e^+_R e^-)
     8.06986677E-02    2     1000011       -11   # BR(chi^0_2 -> ~e^-_L e^+)
     8.06986677E-02    2    -1000011        11   # BR(chi^0_2 -> ~e^+_L e^-)
     4.98686082E-04    2     2000013       -13   # BR(chi^0_2 -> ~mu^-_R mu^+)
     4.98686082E-04    2    -2000013        13   # BR(chi^0_2 -> ~mu^+_R mu^-)
     8.06985963E-02    2     1000013       -13   # BR(chi^0_2 -> ~mu^-_L mu^+)
     8.06985963E-02    2    -1000013        13   # BR(chi^0_2 -> ~mu^+_L mu^-)
     7.06661130E-04    2     1000015       -15   # BR(chi^0_2 -> ~tau^-_1 tau^+)
     7.06661130E-04    2    -1000015        15   # BR(chi^0_2 -> ~tau^+_1 tau^-)
     8.06784891E-02    2     2000015       -15   # BR(chi^0_2 -> ~tau^-_2 tau^+)
     8.06784891E-02    2    -2000015        15   # BR(chi^0_2 -> ~tau^+_2 tau^-)
     7.85284001E-02    2     1000012       -12   # BR(chi^0_2 -> ~nu_e nu_bar_e)
     7.85284001E-02    2    -1000012        12   # BR(chi^0_2 -> ~nu^*_e nu_e)
     7.85284865E-02    2     1000014       -14   # BR(chi^0_2 -> ~nu_mu nu_bar_mu)
     7.85284865E-02    2    -1000014        14   # BR(chi^0_2 -> ~nu^*_mu nu_mu)
     7.85528287E-02    2     1000016       -16   # BR(chi^0_2 -> ~nu_tau nu_bar_tau)
     7.85528287E-02    2    -1000016        16   # BR(chi^0_2 -> ~nu^*_tau nu_tau)
     2.50762519E-04    2     1000022        23   # BR(chi^0_2 -> chi^0_1 Z)
     4.09696764E-02    2     1000022        25   # BR(chi^0_2 -> chi^0_1 h^0)
     1.08390822E-09    2     1000039        22   # BR(chi^0_2 -> ~G photon)
     2.18089955E-09    2     1000039        23   # BR(chi^0_2 -> ~G Z)
     2.23051596E-10    2     1000039        25   # BR(chi^0_2 -> ~G h^0)
     4.60674794E-07    2     1000022        22   # BR(chi^0_2 -> chi^0_1 photon)
#    BR                NDA      ID1      ID2       ID3
     6.25902934E-08    3     1000022         2        -2   # BR(chi^0_2 -> chi^0_1 u u_bar)
     6.25951978E-08    3     1000022         4        -4   # BR(chi^0_2 -> chi^0_1 c c_bar)
     3.79489248E-07    3     1000022         6        -6   # BR(chi^0_2 -> chi^0_1 t t_bar)
     7.80939526E-08    3     1000022         1        -1   # BR(chi^0_2 -> chi^0_1 d d_bar)
     7.80944265E-08    3     1000022         3        -3   # BR(chi^0_2 -> chi^0_1 s s_bar)
     9.60358087E-08    3     1000022         5        -5   # BR(chi^0_2 -> chi^0_1 b b_bar)
     2.47877846E-07    3     1000022        11       -11   # BR(chi^0_2 -> chi^0_1 e^- e^+)
     2.48131253E-07    3     1000022        13       -13   # BR(chi^0_2 -> chi^0_1 mu^- mu^+)
     3.16042997E-07    3     1000022        15       -15   # BR(chi^0_2 -> chi^0_1 tau^- tau^+)
DECAY   1000025     7.54504678E+00   # chi^0_3
#    BR                NDA      ID1      ID2
     2.50309171E-05    2     2000011       -11   # BR(chi^0_3 -> ~e^-_R e^+)
     2.50309171E-05    2    -2000011        11   # BR(chi^0_3 -> ~e^+_R e^-)
     6.79183171E-06    2     1000011       -11   # BR(chi^0_3 -> ~e^-_L e^+)
     6.79183171E-06    2    -1000011        11   # BR(chi^0_3 -> ~e^+_L e^-)
     2.60221734E-05    2     2000013       -13   # BR(chi^0_3 -> ~mu^-_R mu^+)
     2.60221734E-05    2    -2000013        13   # BR(chi^0_3 -> ~mu^+_R mu^-)
     7.30395014E-06    2     1000013       -13   # BR(chi^0_3 -> ~mu^-_L mu^+)
     7.30395014E-06    2    -1000013        13   # BR(chi^0_3 -> ~mu^+_L mu^-)
     3.05457865E-04    2     1000015       -15   # BR(chi^0_3 -> ~tau^-_1 tau^+)
     3.05457865E-04    2    -1000015        15   # BR(chi^0_3 -> ~tau^+_1 tau^-)
     1.51664620E-04    2     2000015       -15   # BR(chi^0_3 -> ~tau^-_2 tau^+)
     1.51664620E-04    2    -2000015        15   # BR(chi^0_3 -> ~tau^+_2 tau^-)
     3.83194895E-05    2     1000012       -12   # BR(chi^0_3 -> ~nu_e nu_bar_e)
     3.83194895E-05    2    -1000012        12   # BR(chi^0_3 -> ~nu^*_e nu_e)
     3.83195016E-05    2     1000014       -14   # BR(chi^0_3 -> ~nu_mu nu_bar_mu)
     3.83195016E-05    2    -1000014        14   # BR(chi^0_3 -> ~nu^*_mu nu_mu)
     3.83229060E-05    2     1000016       -16   # BR(chi^0_3 -> ~nu_tau nu_bar_tau)
     3.83229060E-05    2    -1000016        16   # BR(chi^0_3 -> ~nu^*_tau nu_tau)
     2.89035715E-01    2     1000024       -24   # BR(chi^0_3 -> chi^+_1 W^-)
     2.89035715E-01    2    -1000024        24   # BR(chi^0_3 -> chi^-_1 W^+)
     1.39365878E-01    2     1000022        23   # BR(chi^0_3 -> chi^0_1 Z)
     2.76422675E-01    2     1000023        23   # BR(chi^0_3 -> chi^0_2 Z)
     2.61303203E-03    2     1000022        25   # BR(chi^0_3 -> chi^0_1 h^0)
     6.57422003E-04    2     1000023        25   # BR(chi^0_3 -> chi^0_2 h^0)
     1.44796755E-14    2     1000039        22   # BR(chi^0_3 -> ~G photon)
     1.26678193E-10    2     1000039        23   # BR(chi^0_3 -> ~G Z)
     5.25197598E-10    2     1000039        25   # BR(chi^0_3 -> ~G h^0)
     6.89753187E-08    2     1000022        22   # BR(chi^0_3 -> chi^0_1 photon)
     1.85439862E-06    2     1000023        22   # BR(chi^0_3 -> chi^0_2 photon)
#    BR                NDA      ID1      ID2       ID3
     1.34747890E-10    3     1000022         2        -2   # BR(chi^0_3 -> chi^0_1 u u_bar)
     3.52458950E-10    3     1000022         4        -4   # BR(chi^0_3 -> chi^0_1 c c_bar)
     8.15624893E-04    3     1000022         6        -6   # BR(chi^0_3 -> chi^0_1 t t_bar)
     3.85483114E-11    3     1000022         1        -1   # BR(chi^0_3 -> chi^0_1 d d_bar)
     4.39166134E-11    3     1000022         3        -3   # BR(chi^0_3 -> chi^0_1 s s_bar)
     1.20530195E-08    3     1000022         5        -5   # BR(chi^0_3 -> chi^0_1 b b_bar)
     1.62277942E-08    3     1000022        11       -11   # BR(chi^0_3 -> chi^0_1 e^- e^+)
     1.72250235E-08    3     1000022        13       -13   # BR(chi^0_3 -> chi^0_1 mu^- mu^+)
     2.98634542E-07    3     1000022        15       -15   # BR(chi^0_3 -> chi^0_1 tau^- tau^+)
     1.41186250E-11    3     1000023         2        -2   # BR(chi^0_3 -> chi^0_2 u u_bar)
     2.17719958E-11    3     1000023         4        -4   # BR(chi^0_3 -> chi^0_2 c c_bar)
     2.37419512E-11    3     1000023         1        -1   # BR(chi^0_3 -> chi^0_2 d d_bar)
     2.42337633E-11    3     1000023         3        -3   # BR(chi^0_3 -> chi^0_2 s s_bar)
     1.29850667E-09    3     1000023         5        -5   # BR(chi^0_3 -> chi^0_2 b b_bar)
     1.48378558E-10    3     1000023        11       -11   # BR(chi^0_3 -> chi^0_2 e^- e^+)
     1.67872812E-10    3     1000023        13       -13   # BR(chi^0_3 -> chi^0_2 mu^- mu^+)
     5.67173951E-09    3     1000023        15       -15   # BR(chi^0_3 -> chi^0_2 tau^- tau^+)
     2.27612764E-09    3     1000023        12       -12   # BR(chi^0_3 -> chi^0_2 nu_e nu_bar_e)
     1.08142356E-10    3     1000024         1        -2   # BR(chi^0_3 -> chi^+_1 d u_bar)
     1.08142356E-10    3    -1000024        -1         2   # BR(chi^0_3 -> chi^-_1 d_bar u)
     1.15527418E-10    3     1000024         3        -4   # BR(chi^0_3 -> chi^+_1 s c_bar)
     1.15527418E-10    3    -1000024        -3         4   # BR(chi^0_3 -> chi^-_1 s_bar c)
     3.88584051E-04    3     1000024         5        -6   # BR(chi^0_3 -> chi^+_1 b t_bar)
     3.88584051E-04    3    -1000024        -5         6   # BR(chi^0_3 -> chi^-_1 b_bar t)
     2.32718469E-09    3     1000024        11       -12   # BR(chi^0_3 -> chi^+_1 e^- nu_bar_e)
     2.32718469E-09    3    -1000024       -11        12   # BR(chi^0_3 -> chi^-_1 e^+ nu_e)
     2.34536500E-09    3     1000024        13       -14   # BR(chi^0_3 -> chi^+_1 mu^- nu_bar_mu)
     2.34536500E-09    3    -1000024       -13        14   # BR(chi^0_3 -> chi^-_1 mu^+ nu_mu)
     7.53858508E-09    3     1000024        15       -16   # BR(chi^0_3 -> chi^+_1 tau^- nu_bar_tau)
     7.53858508E-09    3    -1000024       -15        16   # BR(chi^0_3 -> chi^-_1 tau^+ nu_tau)
DECAY   1000035     8.71796450E+00   # chi^0_4
#    BR                NDA      ID1      ID2
     1.03434641E-03    2     2000011       -11   # BR(chi^0_4 -> ~e^-_R e^+)
     1.03434641E-03    2    -2000011        11   # BR(chi^0_4 -> ~e^+_R e^-)
     4.96618339E-03    2     1000011       -11   # BR(chi^0_4 -> ~e^-_L e^+)
     4.96618339E-03    2    -1000011        11   # BR(chi^0_4 -> ~e^+_L e^-)
     1.03499874E-03    2     2000013       -13   # BR(chi^0_4 -> ~mu^-_R mu^+)
     1.03499874E-03    2    -2000013        13   # BR(chi^0_4 -> ~mu^+_R mu^-)
     4.96667674E-03    2     1000013       -13   # BR(chi^0_4 -> ~mu^-_L mu^+)
     4.96667674E-03    2    -1000013        13   # BR(chi^0_4 -> ~mu^+_L mu^-)
     1.21894258E-03    2     1000015       -15   # BR(chi^0_4 -> ~tau^-_1 tau^+)
     1.21894258E-03    2    -1000015        15   # BR(chi^0_4 -> ~tau^+_1 tau^-)
     5.10570652E-03    2     2000015       -15   # BR(chi^0_4 -> ~tau^-_2 tau^+)
     5.10570652E-03    2    -2000015        15   # BR(chi^0_4 -> ~tau^+_2 tau^-)
     8.87007185E-03    2     1000012       -12   # BR(chi^0_4 -> ~nu_e nu_bar_e)
     8.87007185E-03    2    -1000012        12   # BR(chi^0_4 -> ~nu^*_e nu_e)
     8.87007448E-03    2     1000014       -14   # BR(chi^0_4 -> ~nu_mu nu_bar_mu)
     8.87007448E-03    2    -1000014        14   # BR(chi^0_4 -> ~nu^*_mu nu_mu)
     8.87081520E-03    2     1000016       -16   # BR(chi^0_4 -> ~nu_tau nu_bar_tau)
     8.87081520E-03    2    -1000016        16   # BR(chi^0_4 -> ~nu^*_tau nu_tau)
     2.79059584E-01    2     1000024       -24   # BR(chi^0_4 -> chi^+_1 W^-)
     2.79059584E-01    2    -1000024        24   # BR(chi^0_4 -> chi^-_1 W^+)
     2.34722385E-03    2     1000022        23   # BR(chi^0_4 -> chi^0_1 Z)
     7.66733352E-04    2     1000023        23   # BR(chi^0_4 -> chi^0_2 Z)
     1.12041277E-01    2     1000022        25   # BR(chi^0_4 -> chi^0_1 h^0)
     2.35421690E-01    2     1000023        25   # BR(chi^0_4 -> chi^0_2 h^0)
     2.75836547E-11    2     1000039        22   # BR(chi^0_4 -> ~G photon)
     2.91729252E-09    2     1000039        23   # BR(chi^0_4 -> ~G Z)
     5.09172121E-09    2     1000039        25   # BR(chi^0_4 -> ~G h^0)
     5.45228923E-09    2     1000022        22   # BR(chi^0_4 -> chi^0_1 photon)
     4.27723064E-07    2     1000023        22   # BR(chi^0_4 -> chi^0_2 photon)
     7.81813668E-10    2     1000025        22   # BR(chi^0_4 -> chi^0_3 photon)
#    BR                NDA      ID1      ID2       ID3
     2.81044433E-08    3     1000022         2        -2   # BR(chi^0_4 -> chi^0_1 u u_bar)
     2.82622706E-08    3     1000022         4        -4   # BR(chi^0_4 -> chi^0_1 c c_bar)
     3.58374505E-04    3     1000022         6        -6   # BR(chi^0_4 -> chi^0_1 t t_bar)
     2.42003123E-08    3     1000022         1        -1   # BR(chi^0_4 -> chi^0_1 d d_bar)
     2.42046941E-08    3     1000022         3        -3   # BR(chi^0_4 -> chi^0_1 s s_bar)
     3.92606711E-08    3     1000022         5        -5   # BR(chi^0_4 -> chi^0_1 b b_bar)
     1.57332641E-06    3     1000022        11       -11   # BR(chi^0_4 -> chi^0_1 e^- e^+)
     1.57400315E-06    3     1000022        13       -13   # BR(chi^0_4 -> chi^0_1 mu^- mu^+)
     1.75719189E-06    3     1000022        15       -15   # BR(chi^0_4 -> chi^0_1 tau^- tau^+)
     2.32205989E-08    3     1000023         2        -2   # BR(chi^0_4 -> chi^0_2 u u_bar)
     2.32094897E-08    3     1000023         4        -4   # BR(chi^0_4 -> chi^0_2 c c_bar)
     2.73898099E-08    3     1000023         1        -1   # BR(chi^0_4 -> chi^0_2 d d_bar)
     2.73903595E-08    3     1000023         3        -3   # BR(chi^0_4 -> chi^0_2 s s_bar)
     3.53062857E-08    3     1000023         5        -5   # BR(chi^0_4 -> chi^0_2 b b_bar)
     3.62196523E-07    3     1000023        11       -11   # BR(chi^0_4 -> chi^0_2 e^- e^+)
     3.62218294E-07    3     1000023        13       -13   # BR(chi^0_4 -> chi^0_2 mu^- mu^+)
     3.66633081E-07    3     1000023        15       -15   # BR(chi^0_4 -> chi^0_2 tau^- tau^+)
     1.76544044E-06    3     1000023        12       -12   # BR(chi^0_4 -> chi^0_2 nu_e nu_bar_e)
     7.09936732E-08    3     1000025         2        -2   # BR(chi^0_4 -> chi^0_3 u u_bar)
     6.96130027E-08    3     1000025         4        -4   # BR(chi^0_4 -> chi^0_3 c c_bar)
     9.21227808E-08    3     1000025         1        -1   # BR(chi^0_4 -> chi^0_3 d d_bar)
     9.21066699E-08    3     1000025         3        -3   # BR(chi^0_4 -> chi^0_3 s s_bar)
     6.80729439E-08    3     1000025         5        -5   # BR(chi^0_4 -> chi^0_3 b b_bar)
     2.11412459E-08    3     1000025        11       -11   # BR(chi^0_4 -> chi^0_3 e^- e^+)
     2.11387141E-08    3     1000025        13       -13   # BR(chi^0_4 -> chi^0_3 mu^- mu^+)
     2.03918469E-08    3     1000025        15       -15   # BR(chi^0_4 -> chi^0_3 tau^- tau^+)
     1.26815854E-07    3     1000025        12       -12   # BR(chi^0_4 -> chi^0_3 nu_e nu_bar_e)
     1.76966740E-08    3     1000024         1        -2   # BR(chi^0_4 -> chi^+_1 d u_bar)
     1.76966740E-08    3    -1000024        -1         2   # BR(chi^0_4 -> chi^-_1 d_bar u)
     1.77001579E-08    3     1000024         3        -4   # BR(chi^0_4 -> chi^+_1 s c_bar)
     1.77001579E-08    3    -1000024        -3         4   # BR(chi^0_4 -> chi^-_1 s_bar c)
     5.29282439E-04    3     1000024         5        -6   # BR(chi^0_4 -> chi^+_1 b t_bar)
     5.29282439E-04    3    -1000024        -5         6   # BR(chi^0_4 -> chi^-_1 b_bar t)
     3.64945423E-07    3     1000024        11       -12   # BR(chi^0_4 -> chi^+_1 e^- nu_bar_e)
     3.64945423E-07    3    -1000024       -11        12   # BR(chi^0_4 -> chi^-_1 e^+ nu_e)
     3.64962891E-07    3     1000024        13       -14   # BR(chi^0_4 -> chi^+_1 mu^- nu_bar_mu)
     3.64962891E-07    3    -1000024       -13        14   # BR(chi^0_4 -> chi^-_1 mu^+ nu_mu)
     3.69451455E-07    3     1000024        15       -16   # BR(chi^0_4 -> chi^+_1 tau^- nu_bar_tau)
     3.69451455E-07    3    -1000024       -15        16   # BR(chi^0_4 -> chi^-_1 tau^+ nu_tau)
     3.97632825E-12    3     1000037         1        -2   # BR(chi^0_4 -> chi^+_2 d u_bar)
     3.97632825E-12    3    -1000037        -1         2   # BR(chi^0_4 -> chi^-_2 d_bar u)
     9.43026991E-13    3     1000037         3        -4   # BR(chi^0_4 -> chi^+_2 s c_bar)
     9.43026991E-13    3    -1000037        -3         4   # BR(chi^0_4 -> chi^-_2 s_bar c)
     1.32397405E-12    3     1000037        11       -12   # BR(chi^0_4 -> chi^+_2 e^- nu_bar_e)
     1.32397405E-12    3    -1000037       -11        12   # BR(chi^0_4 -> chi^-_2 e^+ nu_e)
     1.31108110E-12    3     1000037        13       -14   # BR(chi^0_4 -> chi^+_2 mu^- nu_bar_mu)
     1.31108110E-12    3    -1000037       -13        14   # BR(chi^0_4 -> chi^-_2 mu^+ nu_mu)
     5.20648492E-14    3     1000037        15       -16   # BR(chi^0_4 -> chi^+_2 tau^- nu_bar_tau)
     5.20648492E-14    3    -1000037       -15        16   # BR(chi^0_4 -> chi^-_2 tau^+ nu_tau)
DECAY   1000021     9.96892243E+00   # ~g
#    BR                NDA      ID1      ID2
     4.59911743E-02    2     2000002        -2   # BR(~g -> ~u_R u_bar)
     4.59911743E-02    2    -2000002         2   # BR(~g -> ~u^*_R u)
     1.05310459E-02    2     1000002        -2   # BR(~g -> ~u_L u_bar)
     1.05310459E-02    2    -1000002         2   # BR(~g -> ~u^*_L u)
     4.59900905E-02    2     2000004        -4   # BR(~g -> ~c_R c_bar)
     4.59900905E-02    2    -2000004         4   # BR(~g -> ~c^*_R c)
     1.05307846E-02    2     1000004        -4   # BR(~g -> ~c_L c_bar)
     1.05307846E-02    2    -1000004         4   # BR(~g -> ~c^*_L c)
     7.94072132E-11    2     1000006        -4   # BR(~g -> ~t_1 c_bar)
     7.94072132E-11    2    -1000006         4   # BR(~g -> ~t^*_1 c)
     1.49313732E-01    2     1000006        -6   # BR(~g -> ~t_1 t_bar)
     1.49313732E-01    2    -1000006         6   # BR(~g -> ~t^*_1 t)
     5.00974471E-02    2     2000001        -1   # BR(~g -> ~d_R d_bar)
     5.00974471E-02    2    -2000001         1   # BR(~g -> ~d^*_R d)
     1.03136235E-02    2     1000001        -1   # BR(~g -> ~d_L d_bar)
     1.03136235E-02    2    -1000001         1   # BR(~g -> ~d^*_L d)
     5.00974719E-02    2     2000003        -3   # BR(~g -> ~s_R s_bar)
     5.00974719E-02    2    -2000003         3   # BR(~g -> ~s^*_R s)
     1.03140902E-02    2     1000003        -3   # BR(~g -> ~s_L s_bar)
     1.03140902E-02    2    -1000003         3   # BR(~g -> ~s^*_L s)
     5.06632210E-02    2     1000005        -5   # BR(~g -> ~b_1 b_bar)
     5.06632210E-02    2    -1000005         5   # BR(~g -> ~b^*_1 b)
     5.07447702E-02    2     2000005        -5   # BR(~g -> ~b_2 b_bar)
     5.07447702E-02    2    -2000005         5   # BR(~g -> ~b^*_2 b)
     4.43157665E-06    2     1000022        21   # BR(~g -> chi^0_1 g)
     2.27171907E-05    2     1000023        21   # BR(~g -> chi^0_2 g)
     1.51026441E-04    2     1000025        21   # BR(~g -> chi^0_3 g)
     1.56069089E-04    2     1000035        21   # BR(~g -> chi^0_4 g)
#    BR                NDA      ID1      ID2       ID3
     3.25458937E-04    3     1000022         6        -6   # BR(~g -> chi^0_1 t t_bar)
     4.35185692E-03    3     1000023         6        -6   # BR(~g -> chi^0_2 t t_bar)
     6.60972368E-03    3     1000025         6        -6   # BR(~g -> chi^0_3 t t_bar)
     9.00224856E-03    3     1000035         6        -6   # BR(~g -> chi^0_4 t t_bar)
     4.04175360E-03    3     1000024         5        -6   # BR(~g -> chi^+_1 b t_bar)
     4.04175360E-03    3    -1000024        -5         6   # BR(~g -> chi^-_1 b_bar t)
     1.05902892E-03    3     1000037         5        -6   # BR(~g -> chi^+_2 b t_bar)
     1.05902892E-03    3    -1000037        -5         6   # BR(~g -> chi^-_2 b_bar t)
DECAY        25     1.95124774E-03   # h^0
#    BR                NDA      ID1      ID2
     9.00819006E-09    2          11       -11   # BR(h^0 -> e^- e^+)
     3.85122675E-04    2          13       -13   # BR(h^0 -> mu^- mu^+)
     1.08704392E-01    2          15       -15   # BR(h^0 -> tau^- tau^+)
     8.53552801E-07    2           1        -1   # BR(h^0 -> d d_bar)
     3.76416256E-04    2           3        -3   # BR(h^0 -> s s_bar)
     7.92839860E-01    2           5        -5   # BR(h^0 -> b b_bar)
     2.69730872E-07    2           2        -2   # BR(h^0 -> u u_bar)
     4.83215776E-02    2           4        -4   # BR(h^0 -> c c_bar)
     4.54920207E-02    2          21        21   # BR(h^0 -> g g)
     1.92126123E-03    2          22        22   # BR(h^0 -> photon photon)
# writing decays into V V* as 3-body decays
#    BR                NDA      ID1      ID2       ID3
     9.78311349E-05    3          24        11        12   # BR(h^0 -> W^+ e^- nu_e)
     9.78311349E-05    3          24        13        14   # BR(h^0 -> W^+ mu^- nu_mu)
     9.78311349E-05    3          24        15        16   # BR(h^0 -> W^+ tau^- nu_tau)
     3.42408972E-04    3          24         1        -2   # BR(h^0 -> W^+ d u_bar)
     3.42408972E-04    3          24         3        -4   # BR(h^0 -> W^+ s c_bar)
     9.78311349E-05    3         -24       -11       -12   # BR(h^0 -> W^- e^+ nu_bar_e)
     9.78311349E-05    3         -24       -13       -14   # BR(h^0 -> W^- mu^+ nu_bar_mu)
     9.78311349E-05    3         -24       -15       -16   # BR(h^0 -> W^- tau^+ nu_bar_tau)
     3.42408972E-04    3         -24        -1         2   # BR(h^0 -> W^- d_bar u)
     3.42408972E-04    3         -24        -3         4   # BR(h^0 -> W^- s_bar c)
     5.58214482E-08    3          23        11       -11   # BR(h^0 -> Z e^- e^+)
     5.58214482E-08    3          23        13       -13   # BR(h^0 -> Z mu^- mu^+)
     4.78469556E-08    3          23        15       -15   # BR(h^0 -> Z tau^- tau^+)
     3.18979704E-07    3          23        12       -12   # BR(h^0 -> Z nu_e nu_bar_e)
     2.23285793E-07    3          23         1        -1   # BR(h^0 -> Z u u_bar)
     2.23285793E-07    3          23         3        -3   # BR(h^0 -> Z c c_bar)
     2.23285793E-07    3          23         5        -5   # BR(h^0 -> Z t t_bar)
     2.23285793E-07    3          23         2        -2   # BR(h^0 -> Z u u_bar)
     2.23285793E-07    3          23         4        -4   # BR(h^0 -> Z c c_bar)
DECAY        35     1.95813738E+01   # H^0
#    BR                NDA      ID1      ID2
     4.41848738E-11    2          11       -11   # BR(H^0 -> e^- e^+)
     1.88902821E-06    2          13       -13   # BR(H^0 -> mu^- mu^+)
     5.34330822E-04    2          15       -15   # BR(H^0 -> tau^- tau^+)
     3.45591429E-09    2           1        -1   # BR(H^0 -> d d_bar)
     1.52405697E-06    2           3        -3   # BR(H^0 -> s s_bar)
     3.34253323E-03    2           5        -5   # BR(H^0 -> b b_bar)
     9.84944482E-11    2           2        -2   # BR(H^0 -> u u_bar)
     1.76513191E-05    2           4        -4   # BR(H^0 -> c c_bar)
     9.43258558E-01    2           6        -6   # BR(H^0 -> t t_bar)
     1.21102504E-04    2     2000011  -2000011   # BR(H^0 -> ~e^-_R ~e^+_R)
     1.98897769E-12    2     2000011  -1000011   # BR(H^0 -> ~e^-_R ~e^+_L)
     1.98897769E-12    2    -2000011   1000011   # BR(H^0 -> ~e^+_R ~e^-_L)
     6.33451741E-05    2     1000011  -1000011   # BR(H^0 -> ~e^-_L ~e^+_L)
     1.21089123E-04    2     2000013  -2000013   # BR(H^0 -> ~mu^-_R ~mu^+_R)
     8.50342724E-08    2     2000013  -1000013   # BR(H^0 -> ~mu^-_R ~mu^+_L)
     8.50342724E-08    2    -2000013   1000013   # BR(H^0 -> ~mu^+_R ~mu^-_L)
     6.33489303E-05    2     1000013  -1000013   # BR(H^0 -> ~mu^-_L ~mu^+_L)
     1.17347712E-04    2     1000015  -1000015   # BR(H^0 -> ~tau^-_1 ~tau^+_1)
     2.40413332E-05    2     1000015  -2000015   # BR(H^0 -> ~tau^-_1 ~tau^+_2)
     2.40413332E-05    2    -1000015   2000015   # BR(H^0 -> ~tau^+_1 ~tau^-_2)
     6.44115006E-05    2     2000015  -2000015   # BR(H^0 -> ~tau^-_2 ~tau^+_2)
     2.49210874E-04    2     1000012  -1000012   # BR(H^0 -> ~nu_e ~nu^*_e)
     2.49211025E-04    2     1000014  -1000014   # BR(H^0 -> ~nu_mu ~nu^*_mu)
     2.49253495E-04    2     1000016  -1000016   # BR(H^0 -> ~nu_tau ~nu^*_tau)
     8.08970838E-05    2     1000022   1000022   # BR(H^0 -> chi^0_1 chi^0_1)
     2.28729520E-04    2     1000022   1000023   # BR(H^0 -> chi^0_1 chi^0_2)
     1.71120153E-02    2          23        23   # BR(H^0 -> Z Z)
     3.25986658E-02    2          24       -24   # BR(H^0 -> W^+ W^-)
     8.37465429E-04    2          25        25   # BR(H^0 -> h^0 h^0)
     6.33789494E-04    2          21        21   # BR(H^0 -> g g)
     5.37409933E-06    2          22        22   # BR(H^0 -> photon photon)
DECAY        36     1.81513664E+01   # A^0
#    BR                NDA      ID1      ID2
     4.88961556E-11    2          11       -11   # BR(A^0 -> e^- e^+)
     2.09044887E-06    2          13       -13   # BR(A^0 -> mu^- mu^+)
     5.91308389E-04    2          15       -15   # BR(A^0 -> tau^- tau^+)
     3.82432219E-09    2           1        -1   # BR(A^0 -> d d_bar)
     1.68652475E-06    2           3        -3   # BR(A^0 -> s s_bar)
     3.69885997E-03    2           5        -5   # BR(A^0 -> b b_bar)
     9.56497673E-11    2           2        -2   # BR(A^0 -> u u_bar)
     1.71415065E-05    2           4        -4   # BR(A^0 -> c c_bar)
     9.53861291E-01    2           6        -6   # BR(A^0 -> t t_bar)
     1.90203159E-12    2     2000011  -1000011   # BR(A^0 -> ~e^-_R ~e^+_L)
     1.90203159E-12    2    -2000011   1000011   # BR(A^0 -> ~e^+_R ~e^-_L)
     8.13172616E-08    2     2000013  -1000013   # BR(A^0 -> ~mu^-_R ~mu^+_L)
     8.13172616E-08    2    -2000013   1000013   # BR(A^0 -> ~mu^+_R ~mu^-_L)
     2.30043284E-05    2     1000015  -2000015   # BR(A^0 -> ~tau^-_1 ~tau^+_2)
     2.30043284E-05    2    -1000015   2000015   # BR(A^0 -> ~tau^+_1 ~tau^-_2)
     7.31133024E-04    2     1000022   1000022   # BR(A^0 -> chi^0_1 chi^0_1)
     5.85633539E-03    2     1000022   1000023   # BR(A^0 -> chi^0_1 chi^0_2)
     3.49999609E-02    2          25        23   # BR(A^0 -> h^0 Z)
     1.92465653E-04    2          21        21   # BR(A^0 -> g g)
     1.55242866E-06    2          22        22   # BR(A^0 -> photon photon)
DECAY        37     1.57397329E+01   # H^+
#    BR                NDA      ID1      ID2
     5.65011251E-11    2         -11        12   # BR(H^+ -> e^+ nu_e)
     2.41558281E-06    2         -13        12   # BR(H^+ -> mu^+ nu_e)
     6.83276410E-04    2         -15        12   # BR(H^+ -> tau^+ nu_e)
     3.97046783E-09    2          -1         2   # BR(H^+ -> d_bar u)
     1.90705248E-05    2          -3         4   # BR(H^+ -> s_bar c)
     9.51659683E-01    2          -5         6   # BR(H^+ -> b_bar t)
     4.05828584E-12    2    -2000011   1000012   # BR(H^+ -> ~e^+_R ~nu_e)
     3.36208407E-04    2    -1000011   1000012   # BR(H^+ -> ~e^+_L ~nu_e)
     1.73503268E-07    2    -2000013   1000014   # BR(H^+ -> ~mu^+_R ~nu_mu)
     3.36214571E-04    2    -1000013   1000014   # BR(H^+ -> ~mu^+_L ~nu_mu)
     4.90836252E-05    2    -1000015   1000016   # BR(H^+ -> ~tau^+_1 ~nu_tau)
     3.37953740E-04    2    -2000015   1000016   # BR(H^+ -> ~tau^+_2 ~nu_tau)
     6.93967773E-03    2     1000024   1000022   # BR(H^+ -> chi^+_1 chi^0_1)
     3.96362386E-02    2          25        24   # BR(H^+ -> h^0 W^+)
DECAY         6     2.43000000E+00   # top
#    BR                NDA      ID1      ID2
     1.00000000E+00    2           5        24   # BR(t -> b W)
Block HiggsBoundsInputHiggsCouplingsFermions
# ScalarNormEffCoupSq PseudoSNormEffCoupSq NP IP1 IP2 IP2
    1.10858112E+00    0.00000000E+00        3  25   5   5  # h0-b-b eff. coupling^2, normalised to SM
    3.89141888E+00    0.00000000E+00        3  35   5   5  # H0-b-b eff. coupling^2, normalised to SM
    0.00000000E+00    4.00000000E+00        3  36   5   5  # A0-b-b eff. coupling^2, normalised to SM
#
    9.72854721E-01    0.00000000E+00        3  25   6   6  # h0-t-t eff. coupling^2, normalised to SM
    2.77145279E-01    0.00000000E+00        3  35   6   6  # H0-t-t eff. coupling^2, normalised to SM
    0.00000000E+00    2.50000000E-01        3  36   6   6  # A0-t-t eff. coupling^2, normalised to SM
#
    1.10858112E+00    0.00000000E+00        3  25  15  15  # h0-tau-tau eff. coupling^2, normalised to SM
    3.89141888E+00    0.00000000E+00        3  35  15  15  # H0-tau-tau eff. coupling^2, normalised to SM
    0.00000000E+00    4.00000000E+00        3  36  15  15  # A0-tau-tau eff. coupling^2, normalised to SM
#
Block HiggsBoundsInputHiggsCouplingsBosons
    9.99291209E-01        3  25  24  24  # h0-W-W eff. coupling^2, normalised to SM
    7.08790655E-04        3  35  24  24  # H0-W-W eff. coupling^2, normalised to SM
    0.00000000E+00        3  36  24  24  # A0-W-W eff. coupling^2, normalised to SM
#
    9.99291209E-01        3  25  23  23  # h0-Z-Z eff. coupling^2, normalised to SM
    7.08790655E-04        3  35  23  23  # H0-Z-Z eff. coupling^2, normalised to SM
    0.00000000E+00        3  36  23  23  # A0-Z-Z eff. coupling^2, normalised to SM
#
    1.13236863E+00        3  25  21  21  # h0-g-g eff. coupling^2, normalised to SM
    2.71193325E-01        3  35  21  21  # H0-g-g eff. coupling^2, normalised to SM
    5.03435377E-01        3  36  21  21  # A0-g-g eff. coupling^2, normalised to SM
#
    0.00000000E+00        3  25  25  23  # h0-h0-Z eff. coupling^2, normalised to SM
    0.00000000E+00        3  35  25  23  # H0-h0-Z eff. coupling^2, normalised to SM
    7.08790655E-04        3  36  25  23  # A0-h0-Z eff. coupling^2, normalised to SM
    0.00000000E+00        3  35  35  23  # H0-H0-Z eff. coupling^2, normalised to SM
    9.99291209E-01        3  36  35  23  # A0-H0-Z eff. coupling^2, normalised to SM
    0.00000000E+00        3  36  36  23  # A0-A0-Z eff. coupling^2, normalised to SM
#
    0.00000000E+00        4  25  21  21  23  # h0-g-g-Z eff. coupling^2, normalised to SM
    0.00000000E+00        4  35  21  21  23  # H0-g-g-Z eff. coupling^2, normalised to SM
    0.00000000E+00        4  36  21  21  23  # A0-g-g-Z eff. coupling^2, normalised to SM
Block SPhenoLowEnergy  # low energy observables
    1    3.11654763E-04   # BR(b -> s gamma)
    2    1.60405142E-06   # BR(b -> s mu+ mu-)
    3    3.56737600E-05   # BR(b -> s nu nu)
    4    5.24132812E-11   # BR(Bd -> mu+ mu-)
    5    3.42384415E-09   # BR(Bs -> mu+ mu-)
    6    1.10584772E-04   # BR(B_u -> tau nu)
    7    9.99922667E-01   # BR(B_u -> tau nu)/BR(B_u -> tau nu)_SM
    8    2.71901904E-01   # |Delta(M_Bd)| [ps^-1] 
    9    2.01805820E+01   # |Delta(M_Bs)| [ps^-1] 
   20    2.24513370E-15   # Delta(g-2)_electron/2
   21    3.50326860E-11   # Delta(g-2)_muon/2
   22   -3.00314478E-09   # Delta(g-2)_tau/2
   23    0.00000000E+00   # electric dipole moment of the electron
   24    0.00000000E+00   # electric dipole moment of the muon
   25    0.00000000E+00   # electric dipole moment of the tau
   26    0.00000000E+00   # Br(mu -> e gamma)
   27    0.00000000E+00   # Br(tau -> e gamma)
   28    0.00000000E+00   # Br(tau -> mu gamma)
   29    0.00000000E+00   # Br(mu -> 3 e)
   30    0.00000000E+00   # Br(tau -> 3 e)
   31    0.00000000E+00   # Br(tau -> 3 mu)
   39   -7.52287504E-05   # Delta(rho_parameter)
   40    0.00000000E+00   # BR(Z -> e mu)
   41    0.00000000E+00   # BR(Z -> e tau)
   42    0.00000000E+00   # BR(Z -> mu tau)
Block FWCOEF Q=  9.11876000E+01  # Wilson coefficients at scale Q
#    id        order  M        value         comment
Block FWCOEF Q=  1.60000000E+02  # Wilson coefficients at scale Q
#    id        order  M        value         comment
     0305 4422   00   0    -1.87774204E-01   # C7
     0305 4422   00   1    -1.33994364E-02   # C7
     0305 4322   00   1    -2.93579167E-04   # C7'
     0305 6421   00   0    -9.48947480E-02   # C8
     0305 6421   00   1    -1.73596354E-02   # C8
     0305 6321   00   1    -3.76212278E-04   # C8'
 03051111 4133   00   0    -1.02001783E+00   # C9 e+e-
 03051111 4133   00   1    -5.47551994E-05   # C9 e+e-
 03051111 4233   00   1    -9.80373800E-08   # C9' e+e-
 03051111 4137   00   0    -3.95944756E+00   # C10 e+e-
 03051111 4137   00   1    -2.09992800E-02   # C10 e+e-
 03051111 4237   00   1     2.32157222E-06   # C10' e+e-
 03051313 4133   00   0    -1.02001783E+00   # C9 mu+mu-
 03051313 4133   00   1    -5.47561666E-05   # C9 mu+mu-
 03051313 4233   00   1    -9.80374080E-08   # C9' mu+mu-
 03051313 4137   00   0    -3.95944756E+00   # C10 mu+mu-
 03051313 4137   00   1    -2.09992810E-02   # C10 mu+mu-
 03051313 4237   00   1     2.32157225E-06   # C10' mu+mu-
 03051212 4237   00   0     1.49038539E+00   # C11 nu_1 nu_1
 03051212 4237   00   1     5.02882734E-03   # C11 nu_1 nu_1
 03051212 4137   00   1    -5.56418316E-07   # C11' nu_1 nu_1
 03051414 4237   00   0     1.49038539E+00   # C11 nu_2 nu_2
 03051414 4237   00   1     5.02882734E-03   # C11 nu_2 nu_2
 03051414 4137   00   1    -5.56418310E-07   # C11' nu_2 nu_2
 03051616 4237   00   0     1.49038539E+00   # C11 nu_3 nu_3
 03051616 4237   00   1     5.02882760E-03   # C11 nu_3 nu_3
 03051616 4137   00   1    -5.56416567E-07   # C11' nu_3 nu_3
