#
#                              ======================
#                              | THE SUSYHIT OUTPUT |
#                              ======================
#
#
#              ------------------------------------------------------
#              |     This is the output of the SUSY-HIT package     |
#              |  created by A.Djouadi, M.Muehlleitner and M.Spira. |
#              |  In case of problems with SUSY-HIT email to        |
#              |           margarete.muehlleitner@cern.ch           |
#              |           michael.spira@psi.ch                     |
#              |           abdelhak.djouadi@cern.ch                 |
#              ------------------------------------------------------
#
#              ------------------------------------------------------
#              |  SUSY Les Houches Accord - MSSM Spectrum + Decays  |
#              |              based on the decay programs           |
#              |                                                    |
#              |                     SDECAY 1.3b                    |
#              |                                                    |
#              |  Authors: M.Muhlleitner, A.Djouadi and Y.Mambrini  |
#              |  Ref.:    Comput.Phys.Commun.168(2005)46           |
#              |           [hep-ph/0311167]                         |
#              |                                                    |
#              |                     HDECAY 3.4                     |
#              |                                                    |
#              |  By: A.Djouadi,J.Kalinowski,M.Muhlleitner,M.Spira  |
#              |  Ref.:    Comput.Phys.Commun.108(1998)56           |
#              |           [hep-ph/9704448]                         |
#              |                                                    |
#              |                                                    |
#              |  If not stated otherwise all DRbar couplings and   |
#              |  soft SUSY breaking masses are given at the scale  |
#              |  Q=  0.50007291E+04
#              |                                                    |
#              ------------------------------------------------------
#
#
BLOCK DCINFO  # Decay Program information
     1   SDECAY/HDECAY # decay calculator
     2   1.3b  /3.4    # version number
#
BLOCK SPINFO  # Spectrum calculator information
     1    SOFTSUSY    # spectrum calculator                
     2    3.4.0       # version number                     
#
BLOCK MODSEL  # Model selection
     1     0   #  nonUniversal                                     
#
BLOCK SMINPUTS  # Standard Model inputs
         1     1.25778332E+02   # alpha_em^-1(M_Z)^MSbar
         2     1.16570000E-05   # G_F [GeV^-2]
         3     1.17200002E-01   # alpha_S(M_Z)^MSbar
         4     9.11876000E+01   # M_Z pole mass
         5     4.25000000E+00   # mb(mb)^MSbar
         6     1.72500000E+02   # mt pole mass
         7     1.77682000E+00   # mtau pole mass
#
BLOCK MINPAR  # Input parameters - minimal models
         3     1.00000000E+01   # tanb                
#
BLOCK EXTPAR  # Input parameters - non-minimal models
         0    -1.00000000E+00   # Set                 
         1     6.00000000E+01   # M_1(MX)             
         2     3.00000000E+03   # M_2(MX)             
         3     1.39219800E+03   # M_3(MX)             
        11     5.00000000E+03   # At(MX)              
        12     5.00000000E+03   # Ab(MX)              
        13     0.00000000E+00   # Atau(MX)            
        23    -1.15379800E+03   # mu(MX)              
        26     3.00000000E+03   # mA(pole)            
        31     5.00000000E+03   # meL(MX)             
        32     5.00000000E+03   # mmuL(MX)            
        33     5.00000000E+03   # mtauL(MX)           
        34     5.00000000E+03   # meR(MX)             
        35     5.00000000E+03   # mmuR(MX)            
        36     5.00000000E+03   # mtauR(MX)           
        41     5.00000000E+03   # mqL1(MX)            
        42     5.00000000E+03   # mqL2(MX)            
        43     5.00000000E+03   # mqL3(MX)            
        44     5.00000000E+03   # muR(MX)             
        45     5.00000000E+03   # mcR(MX)             
        46     5.00000000E+03   # mtR(MX)             
        47     5.00000000E+03   # mdR(MX)             
        48     5.00000000E+03   # msR(MX)             
        49     5.00000000E+03   # mbR(MX)             
#
BLOCK MASS  # Mass Spectrum
# PDG code           mass       particle
        24     8.00952108E+01   # W+
        25     1.24694503E+02   # h
        35     3.00008000E+03   # H
        36     2.99999986E+03   # A
        37     3.00086442E+03   # H+
         5     4.87878001E+00   # b-quark pole mass calculated from mb(mb)_Msbar
   1000001     5.06845742E+03   # ~d_L
   2000001     5.05065309E+03   # ~d_R
   1000002     5.06798252E+03   # ~u_L
   2000002     5.05037183E+03   # ~u_R
   1000003     5.06845742E+03   # ~s_L
   2000003     5.05065309E+03   # ~s_R
   1000004     5.06798252E+03   # ~c_L
   2000004     5.05037183E+03   # ~c_R
   1000005     5.01435882E+03   # ~b_1
   2000005     5.04931422E+03   # ~b_2
   1000006     4.90515084E+03   # ~t_1
   2000006     5.06010034E+03   # ~t_2
   1000011     5.01906204E+03   # ~e_L
   2000011     5.00591821E+03   # ~e_R
   1000012     5.01811360E+03   # ~nu_eL
   1000013     5.01906204E+03   # ~mu_L
   2000013     5.00591821E+03   # ~mu_R
   1000014     5.01811360E+03   # ~nu_muL
   1000015     5.00452468E+03   # ~tau_1
   2000015     5.01885008E+03   # ~tau_2
   1000016     5.01757004E+03   # ~nu_tauL
   1000021     1.70000027E+03   # ~g
   1000022     6.03022381E+01   # ~chi_10
   1000023     1.19954164E+03   # ~chi_20
   1000025    -1.20184470E+03   # ~chi_30
   1000035     3.07429208E+03   # ~chi_40
   1000024     1.20000068E+03   # ~chi_1+
   1000037     3.07445954E+03   # ~chi_2+
#
BLOCK NMIX  # Neutralino Mixing Matrix
  1  1     9.99308782E-01   # N_11
  1  2     1.64206936E-04   # N_12
  1  3    -3.71197645E-02   # N_13
  1  4     2.01369838E-03   # N_14
  2  1     2.48280510E-02   # N_21
  2  2     2.59761906E-02   # N_22
  2  3     7.06840465E-01   # N_23
  2  4     7.06459738E-01   # N_24
  3  1    -2.76650242E-02   # N_31
  3  2     1.42076257E-02   # N_32
  3  3    -7.06349352E-01   # N_33
  3  4     7.07179880E-01   # N_34
  4  1    -4.16159762E-04   # N_41
  4  2     9.99561581E-01   # N_42
  4  3    -8.32302912E-03   # N_43
  4  4    -2.84112666E-02   # N_44
#
BLOCK UMIX  # Chargino Mixing Matrix U
  1  1     1.17854001E-02   # U_11
  1  2     9.99930550E-01   # U_12
  2  1    -9.99930550E-01   # U_21
  2  2     1.17854001E-02   # U_22
#
BLOCK VMIX  # Chargino Mixing Matrix V
  1  1     4.02083246E-02   # V_11
  1  2    -9.99191318E-01   # V_12
  2  1    -9.99191318E-01   # V_21
  2  2    -4.02083246E-02   # V_22
#
BLOCK STOPMIX  # Stop Mixing Matrix
  1  1    -5.09427714E-01   # cos(theta_t)
  1  2     8.60513454E-01   # sin(theta_t)
  2  1    -8.60513454E-01   # -sin(theta_t)
  2  2    -5.09427714E-01   # cos(theta_t)
#
BLOCK SBOTMIX  # Sbottom Mixing Matrix
  1  1     9.96162059E-01   # cos(theta_b)
  1  2    -8.75280081E-02   # sin(theta_b)
  2  1     8.75280081E-02   # -sin(theta_b)
  2  2     9.96162059E-01   # cos(theta_b)
#
BLOCK STAUMIX  # Stau Mixing Matrix
  1  1    -1.36025377E-01   # cos(theta_tau)
  1  2     9.90705353E-01   # sin(theta_tau)
  2  1    -9.90705353E-01   # -sin(theta_tau)
  2  2    -1.36025377E-01   # cos(theta_tau)
#
BLOCK ALPHA  # Higgs mixing
          -1.05461096E-01   # Mixing angle in the neutral Higgs boson sector
#
BLOCK HMIX Q=  5.00072914E+03  # DRbar Higgs Parameters
         1    -1.17482228E+03   # mu(Q)MSSM           
         2     9.47083311E+00   # tan                 
         3     2.41905923E+02   # higgs               
         4     8.46228708E+06   # mA^2(Q)MSSM         
#
BLOCK GAUGE Q=  5.00072914E+03  # The gauge couplings
     1     3.70760722E-01   # gprime(Q) DRbar
     2     6.32362922E-01   # g(Q) DRbar
     3     1.00087927E+00   # g3(Q) DRbar
#
BLOCK AU Q=  5.00072914E+03  # The trilinear couplings
  1  1     5.00000001E+03   # A_u(Q) DRbar
  2  2     5.00000001E+03   # A_c(Q) DRbar
  3  3     5.00000001E+03   # A_t(Q) DRbar
#
BLOCK AD Q=  5.00072914E+03  # The trilinear couplings
  1  1     5.00000000E+03   # A_d(Q) DRbar
  2  2     5.00000000E+03   # A_s(Q) DRbar
  3  3     5.00000001E+03   # A_b(Q) DRbar
#
BLOCK AE Q=  5.00072914E+03  # The trilinear couplings
  1  1     0.00000000E+00   # A_e(Q) DRbar
  2  2     1.28963987E-07   # A_mu(Q) DRbar
  3  3     1.28423606E-07   # A_tau(Q) DRbar
#
BLOCK Yu Q=  5.00072914E+03  # The Yukawa couplings
  1  1     0.00000000E+00   # y_u(Q) DRbar
  2  2     0.00000000E+00   # y_c(Q) DRbar
  3  3     8.18627406E-01   # y_t(Q) DRbar
#
BLOCK Yd Q=  5.00072914E+03  # The Yukawa couplings
  1  1     0.00000000E+00   # y_d(Q) DRbar
  2  2     0.00000000E+00   # y_s(Q) DRbar
  3  3     1.30567473E-01   # y_b(Q) DRbar
#
BLOCK Ye Q=  5.00072914E+03  # The Yukawa couplings
  1  1     0.00000000E+00   # y_e(Q) DRbar
  2  2     0.00000000E+00   # y_mu(Q) DRbar
  3  3     9.67624541E-02   # y_tau(Q) DRbar
#
BLOCK MSOFT Q=  5.00072914E+03  # The soft SUSY breaking masses at the scale Q
         1     6.00000000E+01   # M_1(Q)              
         2     3.00000000E+03   # M_2(Q)              
         3     1.39219800E+03   # M_3(Q)              
        21     7.30475078E+06   # mH1^2(Q)            
        22    -8.23010902E+05   # mH2^2(Q)            
        31     5.00000000E+03   # meL(Q)              
        32     5.00000000E+03   # mmuL(Q)             
        33     5.00000000E+03   # mtauL(Q)            
        34     5.00000000E+03   # meR(Q)              
        35     5.00000000E+03   # mmuR(Q)             
        36     5.00000000E+03   # mtauR(Q)            
        41     5.00000000E+03   # mqL1(Q)             
        42     5.00000000E+03   # mqL2(Q)             
        43     5.00000000E+03   # mqL3(Q)             
        44     5.00000000E+03   # muR(Q)              
        45     5.00000000E+03   # mcR(Q)              
        46     4.99999999E+03   # mtR(Q)              
        47     5.00000000E+03   # mdR(Q)              
        48     5.00000000E+03   # msR(Q)              
        49     5.00000000E+03   # mbR(Q)              
#
#
#
#                             =================
#                             |The decay table|
#                             =================
#
# - The QCD corrections to the decays gluino -> squark  + quark
#                                     squark -> gaugino + quark_prime
#                                     squark -> squark_prime + Higgs
#                                     squark -> gluino  + quark
#   are included.
#
# - The multi-body decays for the inos, stops and sbottoms are included.
#
# - The loop induced decays for the gluino, neutralinos and stops
#   are included.
#
# - The SUSY decays of the top quark are included.
#
#
#         PDG            Width
DECAY         6     1.40131603E+00   # top decays
#          BR         NDA      ID1       ID2
     1.00000000E+00    2           5        24   # BR(t ->  b    W+)
#
#         PDG            Width
DECAY   1000021     1.42258773E-04   # gluino decays
#          BR         NDA      ID1       ID2
     9.29558109E-06    2     1000022        21   # BR(~g -> ~chi_10 g)
     8.77990492E-03    2     1000023        21   # BR(~g -> ~chi_20 g)
     8.63328035E-03    2     1000025        21   # BR(~g -> ~chi_30 g)
#           BR         NDA      ID1       ID2       ID3
     7.11791141E-02    3     1000022         1        -1   # BR(~g -> ~chi_10 d  db)
     5.27641212E-06    3     1000023         1        -1   # BR(~g -> ~chi_20 d  db)
     1.66325244E-06    3     1000025         1        -1   # BR(~g -> ~chi_30 d  db)
     2.42673987E-01    3     1000022         2        -2   # BR(~g -> ~chi_10 u  ub)
     1.29844655E-05    3     1000023         2        -2   # BR(~g -> ~chi_20 u  ub)
     1.82550656E-06    3     1000025         2        -2   # BR(~g -> ~chi_30 u  ub)
     7.11791141E-02    3     1000022         3        -3   # BR(~g -> ~chi_10 s  sb)
     5.27641212E-06    3     1000023         3        -3   # BR(~g -> ~chi_20 s  sb)
     1.66325244E-06    3     1000025         3        -3   # BR(~g -> ~chi_30 s  sb)
     2.42673987E-01    3     1000022         4        -4   # BR(~g -> ~chi_10 c  cb)
     1.29844655E-05    3     1000023         4        -4   # BR(~g -> ~chi_20 c  cb)
     1.82550656E-06    3     1000025         4        -4   # BR(~g -> ~chi_30 c  cb)
     7.21172363E-02    3     1000022         5        -5   # BR(~g -> ~chi_10 b  bb)
     8.71645550E-04    3     1000023         5        -5   # BR(~g -> ~chi_20 b  bb)
     8.44580139E-04    3     1000025         5        -5   # BR(~g -> ~chi_30 b  bb)
     2.23969831E-01    3     1000022         6        -6   # BR(~g -> ~chi_10 t  tb)
     1.12081003E-02    3     1000023         6        -6   # BR(~g -> ~chi_20 t  tb)
     5.43355146E-03    3     1000025         6        -6   # BR(~g -> ~chi_30 t  tb)
     1.44709863E-05    3     1000024         1        -2   # BR(~g -> ~chi_1+ d  ub)
     1.44709863E-05    3    -1000024         2        -1   # BR(~g -> ~chi_1- u  db)
     1.44709863E-05    3     1000024         3        -4   # BR(~g -> ~chi_1+ s  cb)
     1.44709863E-05    3    -1000024         4        -3   # BR(~g -> ~chi_1- c  sb)
     2.01624947E-02    3     1000024         5        -6   # BR(~g -> ~chi_1+ b  tb)
     2.01624947E-02    3    -1000024         6        -5   # BR(~g -> ~chi_1- t  bb)
#
#         PDG            Width
DECAY   1000006     3.62848632E+02   # stop1 decays
#          BR         NDA      ID1       ID2
     2.43067720E-02    2     1000022         6   # BR(~t_1 -> ~chi_10 t )
     8.05057644E-02    2     1000023         6   # BR(~t_1 -> ~chi_20 t )
     7.73979896E-02    2     1000025         6   # BR(~t_1 -> ~chi_30 t )
     5.82679339E-03    2     1000035         6   # BR(~t_1 -> ~chi_40 t )
     1.16510419E-01    2     1000024         5   # BR(~t_1 -> ~chi_1+ b )
     1.16028664E-02    2     1000037         5   # BR(~t_1 -> ~chi_2+ b )
     6.83849395E-01    2     1000021         6   # BR(~t_1 -> ~g      t )
#
#         PDG            Width
DECAY   2000006     3.69702569E+02   # stop2 decays
#          BR         NDA      ID1       ID2
     9.55319274E-03    2     1000022         6   # BR(~t_2 -> ~chi_10 t )
     8.12621408E-02    2     1000023         6   # BR(~t_2 -> ~chi_20 t )
     8.45854478E-02    2     1000025         6   # BR(~t_2 -> ~chi_30 t )
     1.48665435E-02    2     1000035         6   # BR(~t_2 -> ~chi_40 t )
     4.90444198E-02    2     1000024         5   # BR(~t_2 -> ~chi_1+ b )
     2.95603594E-02    2     1000037         5   # BR(~t_2 -> ~chi_2+ b )
     7.27640882E-01    2     1000021         6   # BR(~t_2 -> ~g      t )
     7.82105548E-04    2     1000006        25   # BR(~t_2 -> ~t_1    h )
     2.70490850E-03    2     1000006        23   # BR(~t_2 -> ~t_1    Z )
#
#         PDG            Width
DECAY   1000005     3.46132555E+02   # sbottom1 decays
#          BR         NDA      ID1       ID2
     2.24266657E-03    2     1000022         5   # BR(~b_1 -> ~chi_10 b )
     2.24156172E-03    2     1000023         5   # BR(~b_1 -> ~chi_20 b )
     2.15956241E-03    2     1000025         5   # BR(~b_1 -> ~chi_30 b )
     2.16729863E-02    2     1000035         5   # BR(~b_1 -> ~chi_40 b )
     1.71227667E-01    2    -1000024         6   # BR(~b_1 -> ~chi_1- t )
     4.35709064E-02    2    -1000037         6   # BR(~b_1 -> ~chi_2- t )
     7.55256825E-01    2     1000021         5   # BR(~b_1 -> ~g      b )
     1.62782438E-03    2     1000006       -24   # BR(~b_1 -> ~t_1    W-)
#
#         PDG            Width
DECAY   2000005     2.70591563E+02   # sbottom2 decays
#          BR         NDA      ID1       ID2
     1.08480524E-02    2     1000022         5   # BR(~b_2 -> ~chi_10 b )
     2.81727424E-03    2     1000023         5   # BR(~b_2 -> ~chi_20 b )
     2.91005618E-03    2     1000025         5   # BR(~b_2 -> ~chi_30 b )
     2.21905600E-04    2     1000035         5   # BR(~b_2 -> ~chi_40 b )
     7.29702927E-03    2    -1000024         6   # BR(~b_2 -> ~chi_1- t )
     4.46008200E-04    2    -1000037         6   # BR(~b_2 -> ~chi_2- t )
     9.75392712E-01    2     1000021         5   # BR(~b_2 -> ~g      b )
     6.69619480E-05    2     1000006       -24   # BR(~b_2 -> ~t_1    W-)
#
#         PDG            Width
DECAY   1000002     2.89606950E+02   # sup_L decays
#          BR         NDA      ID1       ID2
     2.57847025E-03    2     1000022         2   # BR(~u_L -> ~chi_10 u)
     5.72379954E-05    2     1000023         2   # BR(~u_L -> ~chi_20 u)
     4.66264731E-06    2     1000025         2   # BR(~u_L -> ~chi_30 u)
     2.70446066E-02    2     1000035         2   # BR(~u_L -> ~chi_40 u)
     1.94716220E-04    2     1000024         1   # BR(~u_L -> ~chi_1+ d)
     5.40511318E-02    2     1000037         1   # BR(~u_L -> ~chi_2+ d)
     9.16069175E-01    2     1000021         2   # BR(~u_L -> ~g      u)
#
#         PDG            Width
DECAY   2000002     2.75810654E+02   # sup_R decays
#          BR         NDA      ID1       ID2
     4.30948430E-02    2     1000022         2   # BR(~u_R -> ~chi_10 u)
     2.37200796E-05    2     1000023         2   # BR(~u_R -> ~chi_20 u)
     2.94370163E-05    2     1000025         2   # BR(~u_R -> ~chi_30 u)
     2.97409015E-09    2     1000035         2   # BR(~u_R -> ~chi_40 u)
     9.56851997E-01    2     1000021         2   # BR(~u_R -> ~g      u)
#
#         PDG            Width
DECAY   1000001     2.89620020E+02   # sdown_L decays
#          BR         NDA      ID1       ID2
     2.56993992E-03    2     1000022         1   # BR(~d_L -> ~chi_10 d)
     2.68755792E-05    2     1000023         1   # BR(~d_L -> ~chi_20 d)
     2.31612624E-05    2     1000025         1   # BR(~d_L -> ~chi_30 d)
     2.70605889E-02    2     1000035         1   # BR(~d_L -> ~chi_40 d)
     1.67297627E-05    2    -1000024         2   # BR(~d_L -> ~chi_1- u)
     5.41455043E-02    2    -1000037         2   # BR(~d_L -> ~chi_2- u)
     9.16157200E-01    2     1000021         1   # BR(~d_L -> ~g      d)
#
#         PDG            Width
DECAY   2000001     2.66907522E+02   # sdown_R decays
#          BR         NDA      ID1       ID2
     1.11337107E-02    2     1000022         1   # BR(~d_R -> ~chi_10 d)
     6.12824971E-06    2     1000023         1   # BR(~d_R -> ~chi_20 d)
     7.60526101E-06    2     1000025         1   # BR(~d_R -> ~chi_30 d)
     7.68466806E-10    2     1000035         1   # BR(~d_R -> ~chi_40 d)
     9.88852555E-01    2     1000021         1   # BR(~d_R -> ~g      d)
#
#         PDG            Width
DECAY   1000004     2.89606950E+02   # scharm_L decays
#          BR         NDA      ID1       ID2
     2.57847025E-03    2     1000022         4   # BR(~c_L -> ~chi_10 c)
     5.72379954E-05    2     1000023         4   # BR(~c_L -> ~chi_20 c)
     4.66264731E-06    2     1000025         4   # BR(~c_L -> ~chi_30 c)
     2.70446066E-02    2     1000035         4   # BR(~c_L -> ~chi_40 c)
     1.94716220E-04    2     1000024         3   # BR(~c_L -> ~chi_1+ s)
     5.40511318E-02    2     1000037         3   # BR(~c_L -> ~chi_2+ s)
     9.16069175E-01    2     1000021         4   # BR(~c_L -> ~g      c)
#
#         PDG            Width
DECAY   2000004     2.75810654E+02   # scharm_R decays
#          BR         NDA      ID1       ID2
     4.30948430E-02    2     1000022         4   # BR(~c_R -> ~chi_10 c)
     2.37200796E-05    2     1000023         4   # BR(~c_R -> ~chi_20 c)
     2.94370163E-05    2     1000025         4   # BR(~c_R -> ~chi_30 c)
     2.97409015E-09    2     1000035         4   # BR(~c_R -> ~chi_40 c)
     9.56851997E-01    2     1000021         4   # BR(~c_R -> ~g      c)
#
#         PDG            Width
DECAY   1000003     2.89620020E+02   # sstrange_L decays
#          BR         NDA      ID1       ID2
     2.56993992E-03    2     1000022         3   # BR(~s_L -> ~chi_10 s)
     2.68755792E-05    2     1000023         3   # BR(~s_L -> ~chi_20 s)
     2.31612624E-05    2     1000025         3   # BR(~s_L -> ~chi_30 s)
     2.70605889E-02    2     1000035         3   # BR(~s_L -> ~chi_40 s)
     1.67297627E-05    2    -1000024         4   # BR(~s_L -> ~chi_1- c)
     5.41455043E-02    2    -1000037         4   # BR(~s_L -> ~chi_2- c)
     9.16157200E-01    2     1000021         3   # BR(~s_L -> ~g      s)
#
#         PDG            Width
DECAY   2000003     2.66907522E+02   # sstrange_R decays
#          BR         NDA      ID1       ID2
     1.11337107E-02    2     1000022         3   # BR(~s_R -> ~chi_10 s)
     6.12824971E-06    2     1000023         3   # BR(~s_R -> ~chi_20 s)
     7.60526101E-06    2     1000025         3   # BR(~s_R -> ~chi_30 s)
     7.68466806E-10    2     1000035         3   # BR(~s_R -> ~chi_40 s)
     9.88852555E-01    2     1000021         3   # BR(~s_R -> ~g      s)
#
#         PDG            Width
DECAY   1000011     3.02565558E+01   # selectron_L decays
#          BR         NDA      ID1       ID2
     2.26572960E-01    2     1000022        11   # BR(~e_L -> ~chi_10 e-)
     9.63761081E-04    2     1000023        11   # BR(~e_L -> ~chi_20 e-)
     2.37512113E-06    2     1000025        11   # BR(~e_L -> ~chi_30 e-)
     2.57244668E-01    2     1000035        11   # BR(~e_L -> ~chi_40 e-)
     1.62939945E-04    2    -1000024        12   # BR(~e_L -> ~chi_1- nu_e)
     5.15053296E-01    2    -1000037        12   # BR(~e_L -> ~chi_2- nu_e)
#
#         PDG            Width
DECAY   2000011     2.73677003E+01   # selectron_R decays
#          BR         NDA      ID1       ID2
     9.98772048E-01    2     1000022        11   # BR(~e_R -> ~chi_10 e-)
     5.47916936E-04    2     1000023        11   # BR(~e_R -> ~chi_20 e-)
     6.79967535E-04    2     1000025        11   # BR(~e_R -> ~chi_30 e-)
     6.72155362E-08    2     1000035        11   # BR(~e_R -> ~chi_40 e-)
#
#         PDG            Width
DECAY   1000013     3.02565558E+01   # smuon_L decays
#          BR         NDA      ID1       ID2
     2.26572960E-01    2     1000022        13   # BR(~mu_L -> ~chi_10 mu-)
     9.63761081E-04    2     1000023        13   # BR(~mu_L -> ~chi_20 mu-)
     2.37512113E-06    2     1000025        13   # BR(~mu_L -> ~chi_30 mu-)
     2.57244668E-01    2     1000035        13   # BR(~mu_L -> ~chi_40 mu-)
     1.62939945E-04    2    -1000024        14   # BR(~mu_L -> ~chi_1- nu_mu)
     5.15053296E-01    2    -1000037        14   # BR(~mu_L -> ~chi_2- nu_mu)
#
#         PDG            Width
DECAY   2000013     2.73677003E+01   # smuon_R decays
#          BR         NDA      ID1       ID2
     9.98772048E-01    2     1000022        13   # BR(~mu_R -> ~chi_10 mu-)
     5.47916936E-04    2     1000023        13   # BR(~mu_R -> ~chi_20 mu-)
     6.79967535E-04    2     1000025        13   # BR(~mu_R -> ~chi_30 mu-)
     6.72155362E-08    2     1000035        13   # BR(~mu_R -> ~chi_40 mu-)
#
#         PDG            Width
DECAY   1000015     2.90671252E+01   # stau_1 decays
#          BR         NDA      ID1       ID2
     9.27983839E-01    2     1000022        15   # BR(~tau_1 -> ~chi_10  tau-)
     1.50457002E-02    2     1000023        15   # BR(~tau_1 -> ~chi_20  tau-)
     1.40747138E-02    2     1000025        15   # BR(~tau_1 -> ~chi_30  tau-)
     4.77781144E-03    2     1000035        15   # BR(~tau_1 -> ~chi_40  tau-)
     2.85520630E-02    2    -1000024        16   # BR(~tau_1 -> ~chi_1-  nu_tau)
     9.56587272E-03    2    -1000037        16   # BR(~tau_1 -> ~chi_2-  nu_tau)
#
#         PDG            Width
DECAY   2000015     3.10299516E+01   # stau_2 decays
#          BR         NDA      ID1       ID2
     2.32396889E-01    2     1000022        15   # BR(~tau_2 -> ~chi_10  tau-)
     1.40445504E-02    2     1000023        15   # BR(~tau_2 -> ~chi_20  tau-)
     1.40877604E-02    2     1000025        15   # BR(~tau_2 -> ~chi_30  tau-)
     2.46278456E-01    2     1000035        15   # BR(~tau_2 -> ~chi_40  tau-)
     9.54893578E-05    2    -1000024        16   # BR(~tau_2 -> ~chi_1-  nu_tau)
     4.93096854E-01    2    -1000037        16   # BR(~tau_2 -> ~chi_2-  nu_tau)
#
#         PDG            Width
DECAY   1000012     3.02590818E+01   # snu_eL decays
#          BR         NDA      ID1       ID2
     2.26257421E-01    2     1000022        12   # BR(~nu_eL -> ~chi_10 nu_e)
     7.64691978E-05    2     1000023        12   # BR(~nu_eL -> ~chi_20 nu_e)
     5.42691188E-04    2     1000025        12   # BR(~nu_eL -> ~chi_30 nu_e)
     2.57308960E-01    2     1000035        12   # BR(~nu_eL -> ~chi_40 nu_e)
     1.89597505E-03    2     1000024        11   # BR(~nu_eL -> ~chi_1+ e-)
     5.13918484E-01    2     1000037        11   # BR(~nu_eL -> ~chi_2+ e-)
#
#         PDG            Width
DECAY   1000014     3.02590818E+01   # snu_muL decays
#          BR         NDA      ID1       ID2
     2.26257421E-01    2     1000022        14   # BR(~nu_muL -> ~chi_10 nu_mu)
     7.64691978E-05    2     1000023        14   # BR(~nu_muL -> ~chi_20 nu_mu)
     5.42691188E-04    2     1000025        14   # BR(~nu_muL -> ~chi_30 nu_mu)
     2.57308960E-01    2     1000035        14   # BR(~nu_muL -> ~chi_40 nu_mu)
     1.89597505E-03    2     1000024        13   # BR(~nu_muL -> ~chi_1+ mu-)
     5.13918484E-01    2     1000037        13   # BR(~nu_muL -> ~chi_2+ mu-)
#
#         PDG            Width
DECAY   1000016     3.10804567E+01   # snu_tauL decays
#          BR         NDA      ID1       ID2
     2.20254157E-01    2     1000022        16   # BR(~nu_tauL -> ~chi_10 nu_tau)
     7.44382984E-05    2     1000023        16   # BR(~nu_tauL -> ~chi_20 nu_tau)
     5.28278123E-04    2     1000025        16   # BR(~nu_tauL -> ~chi_30 nu_tau)
     2.50416610E-01    2     1000035        16   # BR(~nu_tauL -> ~chi_40 nu_tau)
     2.85739655E-02    2     1000024        15   # BR(~nu_tauL -> ~chi_1+ tau-)
     5.00152550E-01    2     1000037        15   # BR(~nu_tauL -> ~chi_2+ tau-)
#
#         PDG            Width
DECAY   1000024     7.34598134E-01   # chargino1+ decays
#          BR         NDA      ID1       ID2
     1.00000000E+00    2     1000022        24   # BR(~chi_1+ -> ~chi_10  W+)
#
#         PDG            Width
DECAY   1000037     1.96760068E+01   # chargino2+ decays
#          BR         NDA      ID1       ID2
     2.53018311E-01    2     1000024        23   # BR(~chi_2+ -> ~chi_1+  Z )
     2.15542012E-04    2     1000022        24   # BR(~chi_2+ -> ~chi_10  W+)
     2.44004753E-01    2     1000023        24   # BR(~chi_2+ -> ~chi_20  W+)
     2.43967712E-01    2     1000025        24   # BR(~chi_2+ -> ~chi_30  W+)
     2.58792936E-01    2     1000024        25   # BR(~chi_2+ -> ~chi_1+  h )
     7.45752291E-07    2     1000022        37   # BR(~chi_2+ -> ~chi_10  H+)
#
#         PDG            Width
DECAY   1000022     0.00000000E+00   # neutralino1 decays
#
#         PDG            Width
DECAY   1000023     7.69808015E-01   # neutralino2 decays
#          BR         NDA      ID1       ID2
     5.48083855E-01    2     1000022        23   # BR(~chi_20 -> ~chi_10   Z )
     4.51916145E-01    2     1000022        25   # BR(~chi_20 -> ~chi_10   h )
#
#         PDG            Width
DECAY   1000025     7.75623688E-01   # neutralino3 decays
#          BR         NDA      ID1       ID2
     4.38138438E-01    2     1000022        23   # BR(~chi_30 -> ~chi_10   Z )
     5.61861562E-01    2     1000022        25   # BR(~chi_30 -> ~chi_10   h )
#
#         PDG            Width
DECAY   1000035     1.96876295E+01   # neutralino4 decays
#          BR         NDA      ID1       ID2
     6.35302640E-05    2     1000022        23   # BR(~chi_40 -> ~chi_10   Z )
     5.83459900E-02    2     1000023        23   # BR(~chi_40 -> ~chi_20   Z )
     1.93967518E-01    2     1000025        23   # BR(~chi_40 -> ~chi_30   Z )
     2.44618826E-01    2     1000024       -24   # BR(~chi_40 -> ~chi_1+   W-)
     2.44618826E-01    2    -1000024        24   # BR(~chi_40 -> ~chi_1-   W+)
     1.54924117E-04    2     1000022        25   # BR(~chi_40 -> ~chi_10   h )
     6.82709709E-07    2     1000022        35   # BR(~chi_40 -> ~chi_10   H )
     8.92213592E-08    2     1000022        36   # BR(~chi_40 -> ~chi_10   A )
     1.99778509E-01    2     1000023        25   # BR(~chi_40 -> ~chi_20   h )
     5.84511041E-02    2     1000025        25   # BR(~chi_40 -> ~chi_30   h )
#
#         PDG            Width
DECAY        25     4.04801365E-03   # h decays
#          BR         NDA      ID1       ID2
     6.09499519E-01    2           5        -5   # BR(h -> b       bb     )
     6.40309745E-02    2         -15        15   # BR(h -> tau+    tau-   )
     2.26693279E-04    2         -13        13   # BR(h -> mu+     mu-    )
     4.80635807E-04    2           3        -3   # BR(h -> s       sb     )
     2.08275908E-02    2           4        -4   # BR(h -> c       cb     )
     6.72809458E-02    2          21        21   # BR(h -> g       g      )
     2.31152290E-03    2          22        22   # BR(h -> gam     gam    )
     1.48375038E-03    2          22        23   # BR(h -> Z       gam    )
     2.08948454E-01    2          24       -24   # BR(h -> W+      W-     )
     2.48660467E-02    2          23        23   # BR(h -> Z       Z      )
     4.38663645E-05    2     1000022   1000022   # BR(h -> ~chi_10 ~chi_10)
#
#         PDG            Width
DECAY        35     7.79152077E+00   # H decays
#          BR         NDA      ID1       ID2
     4.16116388E-01    2           5        -5   # BR(H -> b       bb     )
     7.15172256E-02    2         -15        15   # BR(H -> tau+    tau-   )
     2.52890590E-04    2         -13        13   # BR(H -> mu+     mu-    )
     3.10005149E-04    2           3        -3   # BR(H -> s       sb     )
     1.73328278E-06    2           4        -4   # BR(H -> c       cb     )
     1.73168675E-01    2           6        -6   # BR(H -> t       tb     )
     5.75133561E-05    2          21        21   # BR(H -> g       g      )
     3.33372345E-07    2          22        22   # BR(H -> gam     gam    )
     1.02234759E-07    2          23        22   # BR(H -> Z       gam    )
     7.86078046E-05    2          24       -24   # BR(H -> W+      W-     )
     3.92541535E-05    2          23        23   # BR(H -> Z       Z      )
     2.94440760E-04    2          25        25   # BR(H -> h       h      )
    -7.04171005E-23    2          36        36   # BR(H -> A       A      )
     5.99729265E-19    2          23        36   # BR(H -> Z       A      )
     1.18954999E-03    2     1000024  -1000024   # BR(H -> ~chi_1+ ~chi_1-)
     1.28704550E-03    2     1000022   1000022   # BR(H -> ~chi_10 ~chi_10)
     6.58457859E-05    2     1000023   1000023   # BR(H -> ~chi_20 ~chi_20)
     2.34473996E-04    2     1000025   1000025   # BR(H -> ~chi_30 ~chi_30)
     2.00514280E-01    2     1000022   1000023   # BR(H -> ~chi_10 ~chi_20)
     1.34655497E-01    2     1000022   1000025   # BR(H -> ~chi_10 ~chi_30)
     2.16138675E-04    2     1000023   1000025   # BR(H -> ~chi_20 ~chi_30)
#
#         PDG            Width
DECAY        36     7.81182149E+00   # A decays
#          BR         NDA      ID1       ID2
     4.15175310E-01    2           5        -5   # BR(A -> b       bb     )
     7.13335421E-02    2         -15        15   # BR(A -> tau+    tau-   )
     2.52240718E-04    2         -13        13   # BR(A -> mu+     mu-    )
     3.09434402E-04    2           3        -3   # BR(A -> s       sb     )
     1.73592293E-06    2           4        -4   # BR(A -> c       cb     )
     1.73336759E-01    2           6        -6   # BR(A -> t       tb     )
     1.71547710E-04    2          21        21   # BR(A -> g       g      )
     5.27390970E-07    2          22        22   # BR(A -> gam     gam    )
     2.07755084E-07    2          23        22   # BR(A -> Z       gam    )
     7.81078465E-05    2          23        25   # BR(A -> Z       h      )
     2.91135741E-03    2     1000024  -1000024   # BR(A -> ~chi_1+ ~chi_1-)
     1.31565515E-03    2     1000022   1000022   # BR(A -> ~chi_10 ~chi_10)
     1.19189359E-04    2     1000023   1000023   # BR(A -> ~chi_20 ~chi_20)
     9.99037952E-04    2     1000025   1000025   # BR(A -> ~chi_30 ~chi_30)
     1.36038960E-01    2     1000022   1000023   # BR(A -> ~chi_10 ~chi_20)
     1.97929939E-01    2     1000022   1000025   # BR(A -> ~chi_10 ~chi_30)
     2.64475200E-05    2     1000023   1000025   # BR(A -> ~chi_20 ~chi_30)
#
#         PDG            Width
DECAY        37     7.77454427E+00   # H+ decays
#          BR         NDA      ID1       ID2
     6.68310797E-04    2           4        -5   # BR(H+ -> c       bb     )
     7.16962266E-02    2         -15        16   # BR(H+ -> tau+    nu_tau )
     2.53523198E-04    2         -13        14   # BR(H+ -> mu+     nu_mu  )
     4.27716704E-06    2           2        -5   # BR(H+ -> u       bb     )
     1.48762188E-05    2           2        -3   # BR(H+ -> u       sb     )
     3.07640420E-04    2           4        -3   # BR(H+ -> c       sb     )
     5.88219754E-01    2           6        -5   # BR(H+ -> t       bb     )
     7.86006244E-05    2          24        25   # BR(H+ -> W+      h      )
     8.16571950E-14    2          24        36   # BR(H+ -> W+      A      )
     3.38190625E-01    2     1000024   1000022   # BR(H+ -> ~chi_1+ ~chi_10)
     5.04961206E-04    2     1000024   1000023   # BR(H+ -> ~chi_1+ ~chi_20)
     6.12043970E-05    2     1000024   1000025   # BR(H+ -> ~chi_1+ ~chi_30)
