#
#                              ======================
#                              | THE SUSYHIT OUTPUT |
#                              ======================
#
#
#              ------------------------------------------------------
#              |     This is the output of the SUSY-HIT package     |
#              |  created by A.Djouadi, M.Muehlleitner and M.Spira. |
#              |  In case of problems with SUSY-HIT email to        |
#              |           margarete.muehlleitner@cern.ch           |
#              |           michael.spira@psi.ch                     |
#              |           abdelhak.djouadi@cern.ch                 |
#              ------------------------------------------------------
#
#              ------------------------------------------------------
#              |  SUSY Les Houches Accord - MSSM Spectrum + Decays  |
#              |              based on the decay programs           |
#              |                                                    |
#              |                     SDECAY 1.3b                    |
#              |                                                    |
#              |  Authors: M.Muhlleitner, A.Djouadi and Y.Mambrini  |
#              |  Ref.:    Comput.Phys.Commun.168(2005)46           |
#              |           [hep-ph/0311167]                         |
#              |                                                    |
#              |                     HDECAY 3.4                     |
#              |                                                    |
#              |  By: A.Djouadi,J.Kalinowski,M.Muhlleitner,M.Spira  |
#              |  Ref.:    Comput.Phys.Commun.108(1998)56           |
#              |           [hep-ph/9704448]                         |
#              |                                                    |
#              |                                                    |
#              |  If not stated otherwise all DRbar couplings and   |
#              |  soft SUSY breaking masses are given at the scale  |
#              |  Q=  0.50007270E+04
#              |                                                    |
#              ------------------------------------------------------
#
#
BLOCK DCINFO  # Decay Program information
     1   SDECAY/HDECAY # decay calculator
     2   1.3b  /3.4    # version number
#
BLOCK SPINFO  # Spectrum calculator information
     1    SOFTSUSY    # spectrum calculator                
     2    3.4.0       # version number                     
#
BLOCK MODSEL  # Model selection
     1     0   #  nonUniversal                                     
#
BLOCK SMINPUTS  # Standard Model inputs
         1     1.25778332E+02   # alpha_em^-1(M_Z)^MSbar
         2     1.16570000E-05   # G_F [GeV^-2]
         3     1.17200002E-01   # alpha_S(M_Z)^MSbar
         4     9.11876000E+01   # M_Z pole mass
         5     4.25000000E+00   # mb(mb)^MSbar
         6     1.72500000E+02   # mt pole mass
         7     1.77682000E+00   # mtau pole mass
#
BLOCK MINPAR  # Input parameters - minimal models
         3     1.00000000E+01   # tanb                
#
BLOCK EXTPAR  # Input parameters - non-minimal models
         0    -1.00000000E+00   # Set                 
         1     6.00000000E+01   # M_1(MX)             
         2     3.00000000E+03   # M_2(MX)             
         3     1.21156500E+03   # M_3(MX)             
        11     5.00000000E+03   # At(MX)              
        12     5.00000000E+03   # Ab(MX)              
        13     0.00000000E+00   # Atau(MX)            
        23    -1.15389000E+03   # mu(MX)              
        26     3.00000000E+03   # mA(pole)            
        31     5.00000000E+03   # meL(MX)             
        32     5.00000000E+03   # mmuL(MX)            
        33     5.00000000E+03   # mtauL(MX)           
        34     5.00000000E+03   # meR(MX)             
        35     5.00000000E+03   # mmuR(MX)            
        36     5.00000000E+03   # mtauR(MX)           
        41     5.00000000E+03   # mqL1(MX)            
        42     5.00000000E+03   # mqL2(MX)            
        43     5.00000000E+03   # mqL3(MX)            
        44     5.00000000E+03   # muR(MX)             
        45     5.00000000E+03   # mcR(MX)             
        46     5.00000000E+03   # mtR(MX)             
        47     5.00000000E+03   # mdR(MX)             
        48     5.00000000E+03   # msR(MX)             
        49     5.00000000E+03   # mbR(MX)             
#
BLOCK MASS  # Mass Spectrum
# PDG code           mass       particle
        24     8.00947467E+01   # W+
        25     1.24620499E+02   # h
        35     3.00007992E+03   # H
        36     2.99999986E+03   # A
        37     3.00086469E+03   # H+
         5     4.87878001E+00   # b-quark pole mass calculated from mb(mb)_Msbar
   1000001     5.06667019E+03   # ~d_L
   2000001     5.04885883E+03   # ~d_R
   1000002     5.06619460E+03   # ~u_L
   2000002     5.04857741E+03   # ~u_R
   1000003     5.06667019E+03   # ~s_L
   2000003     5.04885883E+03   # ~s_R
   1000004     5.06619460E+03   # ~c_L
   2000004     5.04857741E+03   # ~c_R
   1000005     5.01267816E+03   # ~b_1
   2000005     5.04753358E+03   # ~b_2
   1000006     4.90332641E+03   # ~t_1
   2000006     5.05864063E+03   # ~t_2
   1000011     5.01906264E+03   # ~e_L
   2000011     5.00591822E+03   # ~e_R
   1000012     5.01811409E+03   # ~nu_eL
   1000013     5.01906264E+03   # ~mu_L
   2000013     5.00591822E+03   # ~mu_R
   1000014     5.01811409E+03   # ~nu_muL
   1000015     5.00452462E+03   # ~tau_1
   2000015     5.01885069E+03   # ~tau_2
   1000016     5.01757050E+03   # ~nu_tauL
   1000021     1.50000049E+03   # ~g
   1000022     6.03021804E+01   # ~chi_10
   1000023     1.19954082E+03   # ~chi_20
   1000025    -1.20184453E+03   # ~chi_30
   1000035     3.07429329E+03   # ~chi_40
   1000024     1.20000014E+03   # ~chi_1+
   1000037     3.07446076E+03   # ~chi_2+
#
BLOCK NMIX  # Neutralino Mixing Matrix
  1  1     9.99308734E-01   # N_11
  1  2     1.64199772E-04   # N_12
  1  3    -3.71210637E-02   # N_13
  1  4     2.01347681E-03   # N_14
  2  1     2.48291296E-02   # N_21
  2  2     2.59775324E-02   # N_22
  2  3     7.06840511E-01   # N_23
  2  4     7.06459605E-01   # N_24
  3  1    -2.76657826E-02   # N_31
  3  2     1.42081478E-02   # N_32
  3  3    -7.06349231E-01   # N_33
  3  4     7.07179961E-01   # N_34
  4  1    -4.16188741E-04   # N_41
  4  2     9.99561539E-01   # N_42
  4  3    -8.32361235E-03   # N_43
  4  4    -2.84125831E-02   # N_44
#
BLOCK UMIX  # Chargino Mixing Matrix U
  1  1     1.17862264E-02   # U_11
  1  2     9.99930540E-01   # U_12
  2  1    -9.99930540E-01   # U_21
  2  2     1.17862264E-02   # U_22
#
BLOCK VMIX  # Chargino Mixing Matrix V
  1  1     4.02101790E-02   # V_11
  1  2    -9.99191244E-01   # V_12
  2  1    -9.99191244E-01   # V_21
  2  2    -4.02101790E-02   # V_22
#
BLOCK STOPMIX  # Stop Mixing Matrix
  1  1    -5.10117170E-01   # cos(theta_t)
  1  2     8.60104920E-01   # sin(theta_t)
  2  1    -8.60104920E-01   # -sin(theta_t)
  2  2    -5.10117170E-01   # cos(theta_t)
#
BLOCK SBOTMIX  # Sbottom Mixing Matrix
  1  1     9.96146259E-01   # cos(theta_b)
  1  2    -8.77076432E-02   # sin(theta_b)
  2  1     8.77076432E-02   # -sin(theta_b)
  2  2     9.96146259E-01   # cos(theta_b)
#
BLOCK STAUMIX  # Stau Mixing Matrix
  1  1    -1.36028504E-01   # cos(theta_tau)
  1  2     9.90704924E-01   # sin(theta_tau)
  2  1    -9.90704924E-01   # -sin(theta_tau)
  2  2    -1.36028504E-01   # cos(theta_tau)
#
BLOCK ALPHA  # Higgs mixing
          -1.05452607E-01   # Mixing angle in the neutral Higgs boson sector
#
BLOCK HMIX Q=  5.00072699E+03  # DRbar Higgs Parameters
         1    -1.17481170E+03   # mu(Q)MSSM           
         2     9.47157839E+00   # tan                 
         3     2.41917049E+02   # higgs               
         4     8.46091180E+06   # mA^2(Q)MSSM         
#
BLOCK GAUGE Q=  5.00072699E+03  # The gauge couplings
     1     3.70764448E-01   # gprime(Q) DRbar
     2     6.32372410E-01   # g(Q) DRbar
     3     1.00270678E+00   # g3(Q) DRbar
#
BLOCK AU Q=  5.00072699E+03  # The trilinear couplings
  1  1     5.00000001E+03   # A_u(Q) DRbar
  2  2     5.00000001E+03   # A_c(Q) DRbar
  3  3     5.00000001E+03   # A_t(Q) DRbar
#
BLOCK AD Q=  5.00072699E+03  # The trilinear couplings
  1  1     5.00000000E+03   # A_d(Q) DRbar
  2  2     5.00000000E+03   # A_s(Q) DRbar
  3  3     5.00000001E+03   # A_b(Q) DRbar
#
BLOCK AE Q=  5.00072699E+03  # The trilinear couplings
  1  1     0.00000000E+00   # A_e(Q) DRbar
  2  2     9.75973019E-08   # A_mu(Q) DRbar
  3  3     9.69354375E-08   # A_tau(Q) DRbar
#
BLOCK Yu Q=  5.00072699E+03  # The Yukawa couplings
  1  1     0.00000000E+00   # y_u(Q) DRbar
  2  2     0.00000000E+00   # y_c(Q) DRbar
  3  3     8.17639593E-01   # y_t(Q) DRbar
#
BLOCK Yd Q=  5.00072699E+03  # The Yukawa couplings
  1  1     0.00000000E+00   # y_d(Q) DRbar
  2  2     0.00000000E+00   # y_s(Q) DRbar
  3  3     1.30314741E-01   # y_b(Q) DRbar
#
BLOCK Ye Q=  5.00072699E+03  # The Yukawa couplings
  1  1     0.00000000E+00   # y_e(Q) DRbar
  2  2     0.00000000E+00   # y_mu(Q) DRbar
  3  3     9.67654728E-02   # y_tau(Q) DRbar
#
BLOCK MSOFT Q=  5.00072699E+03  # The soft SUSY breaking masses at the scale Q
         1     6.00000000E+01   # M_1(Q)              
         2     3.00000000E+03   # M_2(Q)              
         3     1.21156500E+03   # M_3(Q)              
        21     7.30467193E+06   # mH1^2(Q)            
        22    -8.23883513E+05   # mH2^2(Q)            
        31     5.00000000E+03   # meL(Q)              
        32     5.00000000E+03   # mmuL(Q)             
        33     5.00000000E+03   # mtauL(Q)            
        34     5.00000000E+03   # meR(Q)              
        35     5.00000000E+03   # mmuR(Q)             
        36     5.00000000E+03   # mtauR(Q)            
        41     5.00000000E+03   # mqL1(Q)             
        42     5.00000000E+03   # mqL2(Q)             
        43     5.00000000E+03   # mqL3(Q)             
        44     5.00000000E+03   # muR(Q)              
        45     5.00000000E+03   # mcR(Q)              
        46     5.00000000E+03   # mtR(Q)              
        47     5.00000000E+03   # mdR(Q)              
        48     5.00000000E+03   # msR(Q)              
        49     5.00000000E+03   # mbR(Q)              
#
#
#
#                             =================
#                             |The decay table|
#                             =================
#
# - The QCD corrections to the decays gluino -> squark  + quark
#                                     squark -> gaugino + quark_prime
#                                     squark -> squark_prime + Higgs
#                                     squark -> gluino  + quark
#   are included.
#
# - The multi-body decays for the inos, stops and sbottoms are included.
#
# - The loop induced decays for the gluino, neutralinos and stops
#   are included.
#
# - The SUSY decays of the top quark are included.
#
#
#         PDG            Width
DECAY         6     1.40137835E+00   # top decays
#          BR         NDA      ID1       ID2
     1.00000000E+00    2           5        24   # BR(t ->  b    W+)
#
#         PDG            Width
DECAY   1000021     6.94766370E-05   # gluino decays
#          BR         NDA      ID1       ID2
     1.15945367E-05    2     1000022        21   # BR(~g -> ~chi_10 g)
     4.48833993E-03    2     1000023        21   # BR(~g -> ~chi_20 g)
     4.37466446E-03    2     1000025        21   # BR(~g -> ~chi_30 g)
#           BR         NDA      ID1       ID2       ID3
     7.71029473E-02    3     1000022         1        -1   # BR(~g -> ~chi_10 d  db)
     9.83204800E-07    3     1000023         1        -1   # BR(~g -> ~chi_20 d  db)
     2.98436571E-07    3     1000025         1        -1   # BR(~g -> ~chi_30 d  db)
     2.62864254E-01    3     1000022         2        -2   # BR(~g -> ~chi_10 u  ub)
     2.41943750E-06    3     1000023         2        -2   # BR(~g -> ~chi_20 u  ub)
     3.27504465E-07    3     1000025         2        -2   # BR(~g -> ~chi_30 u  ub)
     7.71029473E-02    3     1000022         3        -3   # BR(~g -> ~chi_10 s  sb)
     9.83204800E-07    3     1000023         3        -3   # BR(~g -> ~chi_20 s  sb)
     2.98436571E-07    3     1000025         3        -3   # BR(~g -> ~chi_30 s  sb)
     2.62864254E-01    3     1000022         4        -4   # BR(~g -> ~chi_10 c  cb)
     2.41943750E-06    3     1000023         4        -4   # BR(~g -> ~chi_20 c  cb)
     3.27504465E-07    3     1000025         4        -4   # BR(~g -> ~chi_30 c  cb)
     7.81168829E-02    3     1000022         5        -5   # BR(~g -> ~chi_10 b  bb)
     1.60844058E-04    3     1000023         5        -5   # BR(~g -> ~chi_20 b  bb)
     1.52889093E-04    3     1000025         5        -5   # BR(~g -> ~chi_30 b  bb)
     2.30330698E-01    3     1000022         6        -6   # BR(~g -> ~chi_10 t  tb)
     2.68277567E-06    3     1000024         1        -2   # BR(~g -> ~chi_1+ d  ub)
     2.68277567E-06    3    -1000024         2        -1   # BR(~g -> ~chi_1- u  db)
     2.68277567E-06    3     1000024         3        -4   # BR(~g -> ~chi_1+ s  cb)
     2.68277567E-06    3    -1000024         4        -3   # BR(~g -> ~chi_1- c  sb)
     1.20544766E-03    3     1000024         5        -6   # BR(~g -> ~chi_1+ b  tb)
     1.20544766E-03    3    -1000024         6        -5   # BR(~g -> ~chi_1- t  bb)
#
#         PDG            Width
DECAY   1000006     3.78387610E+02   # stop1 decays
#          BR         NDA      ID1       ID2
     2.32748047E-02    2     1000022         6   # BR(~t_1 -> ~chi_10 t )
     7.70864982E-02    2     1000023         6   # BR(~t_1 -> ~chi_20 t )
     7.41023582E-02    2     1000025         6   # BR(~t_1 -> ~chi_30 t )
     5.61132401E-03    2     1000035         6   # BR(~t_1 -> ~chi_40 t )
     1.11303564E-01    2     1000024         5   # BR(~t_1 -> ~chi_1+ b )
     1.11738285E-02    2     1000037         5   # BR(~t_1 -> ~chi_2+ b )
     6.97447623E-01    2     1000021         6   # BR(~t_1 -> ~g      t )
#
#         PDG            Width
DECAY   2000006     3.84009229E+02   # stop2 decays
#          BR         NDA      ID1       ID2
     9.24787318E-03    2     1000022         6   # BR(~t_2 -> ~chi_10 t )
     7.80982372E-02    2     1000023         6   # BR(~t_2 -> ~chi_20 t )
     8.12998129E-02    2     1000025         6   # BR(~t_2 -> ~chi_30 t )
     1.42611485E-02    2     1000035         6   # BR(~t_2 -> ~chi_40 t )
     4.73836773E-02    2     1000024         5   # BR(~t_2 -> ~chi_1+ b )
     2.83566568E-02    2     1000037         5   # BR(~t_2 -> ~chi_2+ b )
     7.37970223E-01    2     1000021         6   # BR(~t_2 -> ~g      t )
     7.55609652E-04    2     1000006        25   # BR(~t_2 -> ~t_1    h )
     2.62676132E-03    2     1000006        23   # BR(~t_2 -> ~t_1    Z )
#
#         PDG            Width
DECAY   1000005     3.60989862E+02   # sbottom1 decays
#          BR         NDA      ID1       ID2
     2.15201592E-03    2     1000022         5   # BR(~b_1 -> ~chi_10 b )
     2.14285511E-03    2     1000023         5   # BR(~b_1 -> ~chi_20 b )
     2.06398523E-03    2     1000025         5   # BR(~b_1 -> ~chi_30 b )
     2.07520026E-02    2     1000035         5   # BR(~b_1 -> ~chi_40 b )
     1.63897926E-01    2    -1000024         6   # BR(~b_1 -> ~chi_1- t )
     4.17191881E-02    2    -1000037         6   # BR(~b_1 -> ~chi_2- t )
     7.65702120E-01    2     1000021         5   # BR(~b_1 -> ~g      b )
     1.56990719E-03    2     1000006       -24   # BR(~b_1 -> ~t_1    W-)
#
#         PDG            Width
DECAY   2000005     2.85484673E+02   # sbottom2 decays
#          BR         NDA      ID1       ID2
     1.02858085E-02    2     1000022         5   # BR(~b_2 -> ~chi_10 b )
     2.66176489E-03    2     1000023         5   # BR(~b_2 -> ~chi_20 b )
     2.75006021E-03    2     1000025         5   # BR(~b_2 -> ~chi_30 b )
     2.12096531E-04    2     1000035         5   # BR(~b_2 -> ~chi_40 b )
     6.91208019E-03    2    -1000024         6   # BR(~b_2 -> ~chi_1- t )
     4.26289149E-04    2    -1000037         6   # BR(~b_2 -> ~chi_2- t )
     9.76688250E-01    2     1000021         5   # BR(~b_2 -> ~g      b )
     6.36505191E-05    2     1000006       -24   # BR(~b_2 -> ~t_1    W-)
#
#         PDG            Width
DECAY   1000002     3.04430977E+02   # sup_L decays
#          BR         NDA      ID1       ID2
     2.45398581E-03    2     1000022         2   # BR(~u_L -> ~chi_10 u)
     5.44564719E-05    2     1000023         2   # BR(~u_L -> ~chi_20 u)
     4.43602110E-06    2     1000025         2   # BR(~u_L -> ~chi_30 u)
     2.56931292E-02    2     1000035         2   # BR(~u_L -> ~chi_40 u)
     1.85252506E-04    2     1000024         1   # BR(~u_L -> ~chi_1+ d)
     5.13500669E-02    2     1000037         1   # BR(~u_L -> ~chi_2+ d)
     9.20258673E-01    2     1000021         2   # BR(~u_L -> ~g      u)
#
#         PDG            Width
DECAY   2000002     2.90712000E+02   # sup_R decays
#          BR         NDA      ID1       ID2
     4.09039370E-02    2     1000022         2   # BR(~u_R -> ~chi_10 u)
     2.25060679E-05    2     1000023         2   # BR(~u_R -> ~chi_20 u)
     2.79294781E-05    2     1000025         2   # BR(~u_R -> ~chi_30 u)
     2.81816510E-09    2     1000035         2   # BR(~u_R -> ~chi_40 u)
     9.59045625E-01    2     1000021         2   # BR(~u_R -> ~g      u)
#
#         PDG            Width
DECAY   1000001     3.04442959E+02   # sdown_L decays
#          BR         NDA      ID1       ID2
     2.44588172E-03    2     1000022         1   # BR(~d_L -> ~chi_10 d)
     2.55699515E-05    2     1000023         1   # BR(~d_L -> ~chi_20 d)
     2.20350875E-05    2     1000025         1   # BR(~d_L -> ~chi_30 d)
     2.57084834E-02    2     1000035         1   # BR(~d_L -> ~chi_40 d)
     1.59175103E-05    2    -1000024         2   # BR(~d_L -> ~chi_1- u)
     5.14400701E-02    2    -1000037         2   # BR(~d_L -> ~chi_2- u)
     9.20342042E-01    2     1000021         1   # BR(~d_L -> ~g      d)
#
#         PDG            Width
DECAY   2000001     2.81804281E+02   # sdown_R decays
#          BR         NDA      ID1       ID2
     1.05498154E-02    2     1000022         1   # BR(~d_R -> ~chi_10 d)
     5.80477097E-06    2     1000023         1   # BR(~d_R -> ~chi_20 d)
     7.20357873E-06    2     1000025         1   # BR(~d_R -> ~chi_30 d)
     7.26946936E-10    2     1000035         1   # BR(~d_R -> ~chi_40 d)
     9.89437176E-01    2     1000021         1   # BR(~d_R -> ~g      d)
#
#         PDG            Width
DECAY   1000004     3.04430977E+02   # scharm_L decays
#          BR         NDA      ID1       ID2
     2.45398581E-03    2     1000022         4   # BR(~c_L -> ~chi_10 c)
     5.44564719E-05    2     1000023         4   # BR(~c_L -> ~chi_20 c)
     4.43602110E-06    2     1000025         4   # BR(~c_L -> ~chi_30 c)
     2.56931292E-02    2     1000035         4   # BR(~c_L -> ~chi_40 c)
     1.85252506E-04    2     1000024         3   # BR(~c_L -> ~chi_1+ s)
     5.13500669E-02    2     1000037         3   # BR(~c_L -> ~chi_2+ s)
     9.20258673E-01    2     1000021         4   # BR(~c_L -> ~g      c)
#
#         PDG            Width
DECAY   2000004     2.90712000E+02   # scharm_R decays
#          BR         NDA      ID1       ID2
     4.09039370E-02    2     1000022         4   # BR(~c_R -> ~chi_10 c)
     2.25060679E-05    2     1000023         4   # BR(~c_R -> ~chi_20 c)
     2.79294781E-05    2     1000025         4   # BR(~c_R -> ~chi_30 c)
     2.81816510E-09    2     1000035         4   # BR(~c_R -> ~chi_40 c)
     9.59045625E-01    2     1000021         4   # BR(~c_R -> ~g      c)
#
#         PDG            Width
DECAY   1000003     3.04442959E+02   # sstrange_L decays
#          BR         NDA      ID1       ID2
     2.44588172E-03    2     1000022         3   # BR(~s_L -> ~chi_10 s)
     2.55699515E-05    2     1000023         3   # BR(~s_L -> ~chi_20 s)
     2.20350875E-05    2     1000025         3   # BR(~s_L -> ~chi_30 s)
     2.57084834E-02    2     1000035         3   # BR(~s_L -> ~chi_40 s)
     1.59175103E-05    2    -1000024         4   # BR(~s_L -> ~chi_1- c)
     5.14400701E-02    2    -1000037         4   # BR(~s_L -> ~chi_2- c)
     9.20342042E-01    2     1000021         3   # BR(~s_L -> ~g      s)
#
#         PDG            Width
DECAY   2000003     2.81804281E+02   # sstrange_R decays
#          BR         NDA      ID1       ID2
     1.05498154E-02    2     1000022         3   # BR(~s_R -> ~chi_10 s)
     5.80477097E-06    2     1000023         3   # BR(~s_R -> ~chi_20 s)
     7.20357873E-06    2     1000025         3   # BR(~s_R -> ~chi_30 s)
     7.26946936E-10    2     1000035         3   # BR(~s_R -> ~chi_40 s)
     9.89437176E-01    2     1000021         3   # BR(~s_R -> ~g      s)
#
#         PDG            Width
DECAY   1000011     3.02573853E+01   # selectron_L decays
#          BR         NDA      ID1       ID2
     2.26571302E-01    2     1000022        11   # BR(~e_L -> ~chi_10 e-)
     9.63854335E-04    2     1000023        11   # BR(~e_L -> ~chi_20 e-)
     2.37475528E-06    2     1000025        11   # BR(~e_L -> ~chi_30 e-)
     2.57245166E-01    2     1000035        11   # BR(~e_L -> ~chi_40 e-)
     1.62963259E-04    2    -1000024        12   # BR(~e_L -> ~chi_1- nu_e)
     5.15054339E-01    2    -1000037        12   # BR(~e_L -> ~chi_2- nu_e)
#
#         PDG            Width
DECAY   2000011     2.73682502E+01   # selectron_R decays
#          BR         NDA      ID1       ID2
     9.98771963E-01    2     1000022        11   # BR(~e_R -> ~chi_10 e-)
     5.47964640E-04    2     1000023        11   # BR(~e_R -> ~chi_20 e-)
     6.80004847E-04    2     1000025        11   # BR(~e_R -> ~chi_30 e-)
     6.72248345E-08    2     1000035        11   # BR(~e_R -> ~chi_40 e-)
#
#         PDG            Width
DECAY   1000013     3.02573853E+01   # smuon_L decays
#          BR         NDA      ID1       ID2
     2.26571302E-01    2     1000022        13   # BR(~mu_L -> ~chi_10 mu-)
     9.63854335E-04    2     1000023        13   # BR(~mu_L -> ~chi_20 mu-)
     2.37475528E-06    2     1000025        13   # BR(~mu_L -> ~chi_30 mu-)
     2.57245166E-01    2     1000035        13   # BR(~mu_L -> ~chi_40 mu-)
     1.62963259E-04    2    -1000024        14   # BR(~mu_L -> ~chi_1- nu_mu)
     5.15054339E-01    2    -1000037        14   # BR(~mu_L -> ~chi_2- nu_mu)
#
#         PDG            Width
DECAY   2000013     2.73682502E+01   # smuon_R decays
#          BR         NDA      ID1       ID2
     9.98771963E-01    2     1000022        13   # BR(~mu_R -> ~chi_10 mu-)
     5.47964640E-04    2     1000023        13   # BR(~mu_R -> ~chi_20 mu-)
     6.80004847E-04    2     1000025        13   # BR(~mu_R -> ~chi_30 mu-)
     6.72248345E-08    2     1000035        13   # BR(~mu_R -> ~chi_40 mu-)
#
#         PDG            Width
DECAY   1000015     2.90677857E+01   # stau_1 decays
#          BR         NDA      ID1       ID2
     9.27980777E-01    2     1000022        15   # BR(~tau_1 -> ~chi_10  tau-)
     1.50463468E-02    2     1000023        15   # BR(~tau_1 -> ~chi_20  tau-)
     1.40752479E-02    2     1000025        15   # BR(~tau_1 -> ~chi_30  tau-)
     4.77805261E-03    2     1000035        15   # BR(~tau_1 -> ~chi_40  tau-)
     2.85532193E-02    2    -1000024        16   # BR(~tau_1 -> ~chi_1-  nu_tau)
     9.56635641E-03    2    -1000037        16   # BR(~tau_1 -> ~chi_2-  nu_tau)
#
#         PDG            Width
DECAY   2000015     3.10308251E+01   # stau_2 decays
#          BR         NDA      ID1       ID2
     2.32395523E-01    2     1000022        15   # BR(~tau_2 -> ~chi_10  tau-)
     1.40450741E-02    2     1000023        15   # BR(~tau_2 -> ~chi_20  tau-)
     1.40882663E-02    2     1000025        15   # BR(~tau_2 -> ~chi_30  tau-)
     2.46278554E-01    2     1000035        15   # BR(~tau_2 -> ~chi_40  tau-)
     9.54895956E-05    2    -1000024        16   # BR(~tau_2 -> ~chi_1-  nu_tau)
     4.93097093E-01    2    -1000037        16   # BR(~tau_2 -> ~chi_2-  nu_tau)
#
#         PDG            Width
DECAY   1000012     3.02599116E+01   # snu_eL decays
#          BR         NDA      ID1       ID2
     2.26255770E-01    2     1000022        12   # BR(~nu_eL -> ~chi_10 nu_e)
     7.64798849E-05    2     1000023        12   # BR(~nu_eL -> ~chi_20 nu_e)
     5.42724294E-04    2     1000025        12   # BR(~nu_eL -> ~chi_30 nu_e)
     2.57309454E-01    2     1000035        12   # BR(~nu_eL -> ~chi_40 nu_e)
     1.89615528E-03    2     1000024        11   # BR(~nu_eL -> ~chi_1+ e-)
     5.13919417E-01    2     1000037        11   # BR(~nu_eL -> ~chi_2+ e-)
#
#         PDG            Width
DECAY   1000014     3.02599116E+01   # snu_muL decays
#          BR         NDA      ID1       ID2
     2.26255770E-01    2     1000022        14   # BR(~nu_muL -> ~chi_10 nu_mu)
     7.64798849E-05    2     1000023        14   # BR(~nu_muL -> ~chi_20 nu_mu)
     5.42724294E-04    2     1000025        14   # BR(~nu_muL -> ~chi_30 nu_mu)
     2.57309454E-01    2     1000035        14   # BR(~nu_muL -> ~chi_40 nu_mu)
     1.89615528E-03    2     1000024        13   # BR(~nu_muL -> ~chi_1+ mu-)
     5.13919417E-01    2     1000037        13   # BR(~nu_muL -> ~chi_2+ mu-)
#
#         PDG            Width
DECAY   1000016     3.10813377E+01   # snu_tauL decays
#          BR         NDA      ID1       ID2
     2.20252345E-01    2     1000022        16   # BR(~nu_tauL -> ~chi_10 nu_tau)
     7.44486324E-05    2     1000023        16   # BR(~nu_tauL -> ~chi_20 nu_tau)
     5.28309859E-04    2     1000025        16   # BR(~nu_tauL -> ~chi_30 nu_tau)
     2.50416855E-01    2     1000035        16   # BR(~nu_tauL -> ~chi_40 nu_tau)
     2.85750548E-02    2     1000024        15   # BR(~nu_tauL -> ~chi_1+ tau-)
     5.00152987E-01    2     1000037        15   # BR(~nu_tauL -> ~chi_2+ tau-)
#
#         PDG            Width
DECAY   1000024     7.34678473E-01   # chargino1+ decays
#          BR         NDA      ID1       ID2
     1.00000000E+00    2     1000022        24   # BR(~chi_1+ -> ~chi_10  W+)
#
#         PDG            Width
DECAY   1000037     1.96782245E+01   # chargino2+ decays
#          BR         NDA      ID1       ID2
     2.53021536E-01    2     1000024        23   # BR(~chi_2+ -> ~chi_1+  Z )
     2.15548217E-04    2     1000022        24   # BR(~chi_2+ -> ~chi_10  W+)
     2.44011474E-01    2     1000023        24   # BR(~chi_2+ -> ~chi_20  W+)
     2.43974350E-01    2     1000025        24   # BR(~chi_2+ -> ~chi_30  W+)
     2.58776347E-01    2     1000024        25   # BR(~chi_2+ -> ~chi_1+  h )
     7.45784676E-07    2     1000022        37   # BR(~chi_2+ -> ~chi_10  H+)
#
#         PDG            Width
DECAY   1000022     0.00000000E+00   # neutralino1 decays
#
#         PDG            Width
DECAY   1000023     7.69864526E-01   # neutralino2 decays
#          BR         NDA      ID1       ID2
     5.48087805E-01    2     1000022        23   # BR(~chi_20 -> ~chi_10   Z )
     4.51912195E-01    2     1000022        25   # BR(~chi_20 -> ~chi_10   h )
#
#         PDG            Width
DECAY   1000025     7.75676935E-01   # neutralino3 decays
#          BR         NDA      ID1       ID2
     4.38158021E-01    2     1000022        23   # BR(~chi_30 -> ~chi_10   Z )
     5.61841979E-01    2     1000022        25   # BR(~chi_30 -> ~chi_10   h )
#
#         PDG            Width
DECAY   1000035     1.96898413E+01   # neutralino4 decays
#          BR         NDA      ID1       ID2
     6.35349480E-05    2     1000022        23   # BR(~chi_40 -> ~chi_10   Z )
     5.83453990E-02    2     1000023        23   # BR(~chi_40 -> ~chi_20   Z )
     1.93971479E-01    2     1000025        23   # BR(~chi_40 -> ~chi_30   Z )
     2.44625419E-01    2     1000024       -24   # BR(~chi_40 -> ~chi_1+   W-)
     2.44625419E-01    2    -1000024        24   # BR(~chi_40 -> ~chi_1-   W+)
     1.54916410E-04    2     1000022        25   # BR(~chi_40 -> ~chi_10   h )
     6.82745867E-07    2     1000022        35   # BR(~chi_40 -> ~chi_10   H )
     8.92311729E-08    2     1000022        36   # BR(~chi_40 -> ~chi_10   A )
     1.99767006E-01    2     1000023        25   # BR(~chi_40 -> ~chi_20   h )
     5.84460551E-02    2     1000025        25   # BR(~chi_40 -> ~chi_30   h )
#
#         PDG            Width
DECAY        25     4.04213157E-03   # h decays
#          BR         NDA      ID1       ID2
     6.11013844E-01    2           5        -5   # BR(h -> b       bb     )
     6.40856979E-02    2         -15        15   # BR(h -> tau+    tau-   )
     2.26887348E-04    2         -13        13   # BR(h -> mu+     mu-    )
     4.81102953E-04    2           3        -3   # BR(h -> s       sb     )
     2.08479388E-02    2           4        -4   # BR(h -> c       cb     )
     6.72612880E-02    2          21        21   # BR(h -> g       g      )
     2.30914591E-03    2          22        22   # BR(h -> gam     gam    )
     1.47597359E-03    2          22        23   # BR(h -> Z       gam    )
     2.07584191E-01    2          24       -24   # BR(h -> W+      W-     )
     2.46711584E-02    2          23        23   # BR(h -> Z       Z      )
     4.27724945E-05    2     1000022   1000022   # BR(h -> ~chi_10 ~chi_10)
#
#         PDG            Width
DECAY        35     7.79042350E+00   # H decays
#          BR         NDA      ID1       ID2
     4.16037661E-01    2           5        -5   # BR(H -> b       bb     )
     7.15385589E-02    2         -15        15   # BR(H -> tau+    tau-   )
     2.52966027E-04    2         -13        13   # BR(H -> mu+     mu-    )
     3.10097637E-04    2           3        -3   # BR(H -> s       sb     )
     1.73324583E-06    2           4        -4   # BR(H -> c       cb     )
     1.73164983E-01    2           6        -6   # BR(H -> t       tb     )
     5.75070066E-05    2          21        21   # BR(H -> g       g      )
     3.33352513E-07    2          22        22   # BR(H -> gam     gam    )
     1.02213487E-07    2          23        22   # BR(H -> Z       gam    )
     7.84564622E-05    2          24       -24   # BR(H -> W+      W-     )
     3.91785761E-05    2          23        23   # BR(H -> Z       Z      )
     2.94448345E-04    2          25        25   # BR(H -> h       h      )
    -5.56800019E-23    2          36        36   # BR(H -> A       A      )
     6.04150499E-19    2          23        36   # BR(H -> Z       A      )
     1.18981416E-03    2     1000024  -1000024   # BR(H -> ~chi_1+ ~chi_1-)
     1.28737284E-03    2     1000022   1000022   # BR(H -> ~chi_10 ~chi_10)
     6.58579825E-05    2     1000023   1000023   # BR(H -> ~chi_20 ~chi_20)
     2.34530379E-04    2     1000025   1000025   # BR(H -> ~chi_30 ~chi_30)
     2.00547748E-01    2     1000022   1000023   # BR(H -> ~chi_10 ~chi_20)
     1.34682468E-01    2     1000022   1000025   # BR(H -> ~chi_10 ~chi_30)
     2.16182079E-04    2     1000023   1000025   # BR(H -> ~chi_20 ~chi_30)
#
#         PDG            Width
DECAY        36     7.81073275E+00   # A decays
#          BR         NDA      ID1       ID2
     4.15096268E-01    2           5        -5   # BR(A -> b       bb     )
     7.13547141E-02    2         -15        15   # BR(A -> tau+    tau-   )
     2.52315584E-04    2         -13        13   # BR(A -> mu+     mu-    )
     3.09526221E-04    2           3        -3   # BR(A -> s       sb     )
     1.73589169E-06    2           4        -4   # BR(A -> c       cb     )
     1.73333640E-01    2           6        -6   # BR(A -> t       tb     )
     1.71555850E-04    2          21        21   # BR(A -> g       g      )
     5.27411576E-07    2          22        22   # BR(A -> gam     gam    )
     2.07738036E-07    2          23        22   # BR(A -> Z       gam    )
     7.79578370E-05    2          23        25   # BR(A -> Z       h      )
     2.91201556E-03    2     1000024  -1000024   # BR(A -> ~chi_1+ ~chi_1-)
     1.31598101E-03    2     1000022   1000022   # BR(A -> ~chi_10 ~chi_10)
     1.19215063E-04    2     1000023   1000023   # BR(A -> ~chi_20 ~chi_20)
     9.99242207E-04    2     1000025   1000025   # BR(A -> ~chi_30 ~chi_30)
     1.36066106E-01    2     1000022   1000023   # BR(A -> ~chi_10 ~chi_20)
     1.97962536E-01    2     1000022   1000025   # BR(A -> ~chi_10 ~chi_30)
     2.64555829E-05    2     1000023   1000025   # BR(A -> ~chi_20 ~chi_30)
#
#         PDG            Width
DECAY        37     7.76859756E+00   # H+ decays
#          BR         NDA      ID1       ID2
     6.67601185E-04    2           4        -5   # BR(H+ -> c       bb     )
     7.17624080E-02    2         -15        16   # BR(H+ -> tau+    nu_tau )
     2.53757220E-04    2         -13        14   # BR(H+ -> mu+     nu_mu  )
     4.27262551E-06    2           2        -5   # BR(H+ -> u       bb     )
     1.48899506E-05    2           2        -3   # BR(H+ -> u       sb     )
     3.07923866E-04    2           4        -3   # BR(H+ -> c       sb     )
     5.87880962E-01    2           6        -5   # BR(H+ -> t       bb     )
     7.84988008E-05    2          24        25   # BR(H+ -> W+      h      )
     8.18473579E-14    2          24        36   # BR(H+ -> W+      A      )
     3.38463034E-01    2     1000024   1000022   # BR(H+ -> ~chi_1+ ~chi_10)
     5.05395458E-04    2     1000024   1000023   # BR(H+ -> ~chi_1+ ~chi_20)
     6.12572823E-05    2     1000024   1000025   # BR(H+ -> ~chi_1+ ~chi_30)
