#  ISAJET SUSY parameters in SUSY Les Houches Accord 2 format
#  Created by ISALHA 2.0 Last revision: H Baer 27 May 2014
Block SPINFO   # Program information
     1   ISASUGRA/ISASUSY from ISAJET   # Spectrum Calculator
     2   7.87   18-JUL-2017 13:55:55    # Version number
Block MODSEL   # Model selection
     1    13   # Non-universal supergravity model                  
Block SMINPUTS   # Standard Model inputs
     1     1.28000000E+02   # alpha_em^(-1)
     2     1.16570000E-05   # G_Fermi
     3     1.19999997E-01   # alpha_s(M_Z)
     4     9.11699982E+01   # m_{Z}(pole)
     5     4.19999981E+00   # m_{b}(m_{b})
     6     1.72500000E+02   # m_{top}(pole)
     7     1.77699995E+00   # m_{tau}(pole)
Block MINPAR   # SUSY breaking input parameters
     1     5.00000000E+03   # m_0
     2     2.00000000E+03   # m_{1/2}
     3     1.50000000E+01   # tan(beta)
     4     1.00000000E+00   # sign(mu)
     5    -8.00000000E+03   # A_0
Block EXTPAR   # Non-universal SUSY breaking parameters
     0     1.39906541E+16   # Input scale
    21     1.82671300E+06   # Down type Higgs mass squared
    22     4.78761160E+07   #  Up  type Higgs mass squared
Block MASS   # Scalar and gaugino mass spectrum
#  PDG code   mass                 particle
         6     1.72500000E+02   #  top            
        24     8.04229965E+01   #  W^+
        25     1.25230911E+02   #  h^0            
        35     1.00666809E+03   #  H^0            
        36     1.00000000E+03   #  A^0            
        37     1.00322870E+03   #  H^+            
   1000001     6.19617920E+03   #  dnl            
   1000002     6.19565771E+03   #  upl            
   1000003     6.19617920E+03   #  stl            
   1000004     6.19565771E+03   #  chl            
   1000005     4.66098584E+03   #  b1             
   1000006     2.53618652E+03   #  t1             
   1000011     5.26830615E+03   #  el-            
   1000012     5.27183447E+03   #  nuel           
   1000013     5.26830615E+03   #  mul-           
   1000014     5.27183447E+03   #  numl           
   1000015     4.65031787E+03   #  tau1           
   1000016     5.19774658E+03   #  nutl           
   1000021     4.40868945E+03   #  glss           
   1000022     1.31179626E+02   #  z1ss           
   1000023    -1.36724411E+02   #  z2ss           
   1000024     1.39076874E+02   #  w1ss           
   1000025     8.96134644E+02   #  z3ss           
   1000035     1.68770728E+03   #  z4ss           
   1000037     1.66801599E+03   #  w2ss           
   1000039     1.00000002E+20   #  gvss
   2000001     6.07381738E+03   #  dnr            
   2000002     6.26637158E+03   #  upr            
   2000003     6.07381738E+03   #  str            
   2000004     6.26637158E+03   #  chr            
   2000005     5.87837646E+03   #  b2             
   2000006     4.64555713E+03   #  t2             
   2000011     4.81915381E+03   #  er-            
   2000013     4.81915381E+03   #  mur-           
   2000015     5.19234521E+03   #  tau2           
Block ALPHA   # Effective Higgs mixing parameter
         -6.81428015E-02   # alpha
Block STOPMIX   # stop mixing matrix
  1  1     5.76275177E-02   # O_{11}
  1  2     9.98338163E-01   # O_{12}
  2  1    -9.98338163E-01   # O_{21}
  2  2     5.76275177E-02   # O_{22}
Block SBOTMIX   # sbottom mixing matrix
  1  1     9.99992669E-01   # O_{11}
  1  2     3.82255693E-03   # O_{12}
  2  1    -3.82255693E-03   # O_{21}
  2  2     9.99992669E-01   # O_{22}
Block STAUMIX   # stau mixing matrix
  1  1     6.73201168E-03   # O_{11}
  1  2     9.99977350E-01   # O_{12}
  2  1    -9.99977350E-01   # O_{21}
  2  2     6.73201168E-03   # O_{22}
Block NMIX   # neutralino mixing matrix
  1  1    -4.10601124E-02   #
  1  2     3.81351747E-02   #
  1  3    -7.13736236E-01   #
  1  4     6.98169351E-01   #
  2  1     2.70628165E-02   #
  2  2    -2.71069221E-02   #
  2  3    -7.00289190E-01   #
  2  4    -7.12830961E-01   #
  3  1     9.98773038E-01   #
  3  2     8.12992454E-03   #
  3  3    -1.03184171E-02   #
  3  4     4.77463938E-02   #
  4  1    -5.82710654E-03   #
  4  2     9.98871684E-01   #
  4  3     8.32917355E-03   #
  4  4    -4.63880301E-02   #
Block UMIX   # chargino U mixing matrix
  1  1    -1.06627429E-02   # U_{11}
  1  2     9.99943137E-01   # U_{12}
  2  1    -9.99943137E-01   # U_{21}
  2  2    -1.06627429E-02   # U_{22}
Block VMIX   # chargino V mixing matrix
  1  1    -6.60140812E-02   # V_{11}
  1  2     9.97818708E-01   # V_{12}
  2  1    -9.97818708E-01   # V_{21}
  2  2    -6.60140812E-02   # V_{22}
Block GAUGE Q=  3.38935718E+03   #
     1     3.57523263E-01   # g`
     2     6.52384460E-01   # g_2
     3     1.21937621E+00   # g_3
Block YU Q=  3.38935718E+03   #
  3  3     8.11185122E-01   # y_t
Block YD Q=  3.38935718E+03   #
  3  3     1.85813189E-01   # y_b
Block YE Q=  3.38935718E+03   #
  3  3     1.49701551E-01   # y_tau
Block HMIX Q=  3.38935718E+03   # Higgs mixing parameters
     1     1.30000000E+02   # mu(Q)
     2     1.43057575E+01   # tan(beta)(Q)
     3     2.52426636E+02   # Higgs vev at Q
     4     1.00000000E+06   # m_A^2(Q)
Block MSOFT Q=  3.38935718E+03   # DRbar SUSY breaking parameters
     1     8.94229004E+02   # M_1(Q)          
     2     1.61564441E+03   # M_2(Q)          
     3     4.05828857E+03   # M_3(Q)          
    21     9.63999375E+05   # MHd^2(Q)        
    22    -1.80531465E+04   # MHu^2(Q)        
    31     5.24939404E+03   # MeL(Q)          
    32     5.24939404E+03   # MmuL(Q)         
    33     5.17732617E+03   # MtauL(Q)        
    34     4.81531982E+03   # MeR(Q)          
    35     4.81531982E+03   # MmuR(Q)         
    36     4.64951221E+03   # MtauR(Q)        
    41     6.00092871E+03   # MqL1(Q)         
    42     6.00092871E+03   # MqL2(Q)         
    43     4.52535254E+03   # MqL3(Q)         
    44     6.07231250E+03   # MuR(Q)          
    45     6.07231250E+03   # McR(Q)          
    46     2.53852979E+03   # MtR(Q)          
    47     5.87733350E+03   # MdR(Q)          
    48     5.87733350E+03   # MsR(Q)          
    49     5.77677734E+03   # MbR(Q)          
Block AU Q=  3.38935718E+03   #
  1  1    -6.24379199E+03   # A_u
  2  2    -6.24379199E+03   # A_c
  3  3    -6.24379199E+03   # A_t
Block AD Q=  3.38935718E+03   #
  1  1    -1.12829346E+04   # A_d
  2  2    -1.12829346E+04   # A_s
  3  3    -1.12829346E+04   # A_b
Block AE Q=  3.38935718E+03   #
  1  1    -8.76622363E+03   # A_e
  2  2    -8.76622363E+03   # A_mu
  3  3    -8.76622363E+03   # A_tau
#  ISAJET decay tables in SUSY Les Houches accord format
#  Created by ISALHD. Last revision: C. Balazs, 2005 May 25
Block DCINFO                           # Program information
     1   ISASUGRA from ISAJET          # Spectrum Calculator
     2   7.87   18-JUL-2017 13:55:55   # Version number
#         PDG         Width
DECAY         6  1.46776152E+00   # TP    decays
#          BR          NDA       ID1       ID2       ID3       ID4
      3.33333313E-01    3            2        -1         5             # TP     -->  UP     DB     BT          
      3.33333313E-01    3            4        -3         5             # TP     -->  CH     SB     BT          
      1.11111097E-01    3          -11        12         5             # TP     -->  E+     NUE    BT          
      1.11111097E-01    3          -13        14         5             # TP     -->  MU+    NUM    BT          
      1.11111097E-01    3          -15        16         5             # TP     -->  TAU+   NUT    BT          
#         PDG         Width
DECAY   1000021  3.91350479E+01   # GLSS  decays
#          BR          NDA       ID1       ID2       ID3       ID4
      4.82180440E-07    3      1000024         1        -2             # GLSS   -->  W1SS+  DN     UB          
      4.82180440E-07    3     -1000024         2        -1             # GLSS   -->  W1SS-  UP     DB          
      4.82180440E-07    3      1000024         3        -4             # GLSS   -->  W1SS+  ST     CB          
      4.82180440E-07    3     -1000024         4        -3             # GLSS   -->  W1SS-  CH     SB          
      1.10754557E-03    3      1000024         5        -6             # GLSS   -->  W1SS+  BT     TB          
      1.10754557E-03    3     -1000024         6        -5             # GLSS   -->  W1SS-  TP     BB          
      1.20117227E-04    3      1000037         1        -2             # GLSS   -->  W2SS+  DN     UB          
      1.20117227E-04    3     -1000037         2        -1             # GLSS   -->  W2SS-  UP     DB          
      1.20117227E-04    3      1000037         3        -4             # GLSS   -->  W2SS+  ST     CB          
      1.20117227E-04    3     -1000037         4        -3             # GLSS   -->  W2SS-  CH     SB          
      8.78324732E-04    3      1000037         5        -6             # GLSS   -->  W2SS+  BT     TB          
      8.78324732E-04    3     -1000037         6        -5             # GLSS   -->  W2SS-  TP     BB          
      4.51647975E-06    2      1000022        21                       # GLSS   -->  Z1SS   GL                 
      1.99177975E-07    3      1000022         2        -2             # GLSS   -->  Z1SS   UP     UB          
      2.59831467E-07    3      1000022         1        -1             # GLSS   -->  Z1SS   DN     DB          
      2.59831467E-07    3      1000022         3        -3             # GLSS   -->  Z1SS   ST     SB          
      1.99177975E-07    3      1000022         4        -4             # GLSS   -->  Z1SS   CH     CB          
      9.83148420E-05    3      1000022         5        -5             # GLSS   -->  Z1SS   BT     BB          
      9.90742468E-04    3      1000022         6        -6             # GLSS   -->  Z1SS   TP     TB          
      4.69781207E-06    2      1000023        21                       # GLSS   -->  Z2SS   GL                 
      8.69108021E-08    3      1000023         2        -2             # GLSS   -->  Z2SS   UP     UB          
      1.14797714E-07    3      1000023         1        -1             # GLSS   -->  Z2SS   DN     DB          
      1.14797714E-07    3      1000023         3        -3             # GLSS   -->  Z2SS   ST     SB          
      8.69108021E-08    3      1000023         4        -4             # GLSS   -->  Z2SS   CH     CB          
      9.38697922E-05    3      1000023         5        -5             # GLSS   -->  Z2SS   BT     BB          
      1.03253417E-03    3      1000023         6        -6             # GLSS   -->  Z2SS   TP     TB          
      4.48781890E-07    2      1000025        21                       # GLSS   -->  Z3SS   GL                 
      5.59032487E-05    3      1000025         2        -2             # GLSS   -->  Z3SS   UP     UB          
      1.85531389E-05    3      1000025         1        -1             # GLSS   -->  Z3SS   DN     DB          
      1.85531389E-05    3      1000025         3        -3             # GLSS   -->  Z3SS   ST     SB          
      5.59032487E-05    3      1000025         4        -4             # GLSS   -->  Z3SS   CH     CB          
      3.88621993E-05    3      1000025         5        -5             # GLSS   -->  Z3SS   BT     BB          
      2.82796082E-05    3      1000025         6        -6             # GLSS   -->  Z3SS   TP     TB          
      1.48424730E-08    2      1000035        21                       # GLSS   -->  Z4SS   GL                 
      5.87670838E-05    3      1000035         2        -2             # GLSS   -->  Z4SS   UP     UB          
      5.89904557E-05    3      1000035         1        -1             # GLSS   -->  Z4SS   DN     DB          
      5.89904557E-05    3      1000035         3        -3             # GLSS   -->  Z4SS   ST     SB          
      5.87670838E-05    3      1000035         4        -4             # GLSS   -->  Z4SS   CH     CB          
      4.31776076E-04    3      1000035         5        -5             # GLSS   -->  Z4SS   BT     BB          
      4.32591303E-04    3      1000035         6        -6             # GLSS   -->  Z4SS   TP     TB          
      4.96001750E-01    2     -1000006         6                       # GLSS   -->  TB1    TP                 
      4.96001750E-01    2      1000006        -6                       # GLSS   -->  TP1    TB                 
#         PDG         Width
DECAY   1000002  1.46206375E+02   # UPL   decays
#          BR          NDA       ID1       ID2       ID3       ID4
      1.67011473E-04    2      1000022         2                       # UPL    -->  Z1SS   UP                 
      8.74201360E-05    2      1000023         2                       # UPL    -->  Z2SS   UP                 
      6.24519028E-03    2      1000025         2                       # UPL    -->  Z3SS   UP                 
      1.52214378E-01    2      1000035         2                       # UPL    -->  Z4SS   UP                 
      5.34162045E-01    2      1000021         2                       # UPL    -->  GLSS   UP                 
      1.55309704E-03    2      1000024         1                       # UPL    -->  W1SS+  DN                 
      3.05570871E-01    2      1000037         1                       # UPL    -->  W2SS+  DN                 
#         PDG         Width
DECAY   1000001  1.46206635E+02   # DNL   decays
#          BR          NDA       ID1       ID2       ID3       ID4
      3.71541333E-04    2      1000022         1                       # DNL    -->  Z1SS   DN                 
      1.83235243E-04    2      1000023         1                       # DNL    -->  Z2SS   DN                 
      5.22818184E-03    2      1000025         1                       # DNL    -->  Z3SS   DN                 
      1.52883217E-01    2      1000035         1                       # DNL    -->  Z4SS   DN                 
      5.34386516E-01    2      1000021         1                       # DNL    -->  GLSS   DN                 
      4.05227729E-05    2     -1000024         2                       # DNL    -->  W1SS-  UP                 
      3.06906730E-01    2     -1000037         2                       # DNL    -->  W2SS-  UP                 
#         PDG         Width
DECAY   1000003  1.46206635E+02   # STL   decays
#          BR          NDA       ID1       ID2       ID3       ID4
      3.71541333E-04    2      1000022         3                       # STL    -->  Z1SS   ST                 
      1.83235243E-04    2      1000023         3                       # STL    -->  Z2SS   ST                 
      5.22818184E-03    2      1000025         3                       # STL    -->  Z3SS   ST                 
      1.52883217E-01    2      1000035         3                       # STL    -->  Z4SS   ST                 
      5.34386516E-01    2      1000021         3                       # STL    -->  GLSS   ST                 
      4.05227693E-05    2     -1000024         4                       # STL    -->  W1SS-  CH                 
      3.06906700E-01    2     -1000037         4                       # STL    -->  W2SS-  CH                 
#         PDG         Width
DECAY   1000004  1.46206345E+02   # CHL   decays
#          BR          NDA       ID1       ID2       ID3       ID4
      1.67011502E-04    2      1000022         4                       # CHL    -->  Z1SS   CH                 
      8.74201360E-05    2      1000023         4                       # CHL    -->  Z2SS   CH                 
      6.24519074E-03    2      1000025         4                       # CHL    -->  Z3SS   CH                 
      1.52214378E-01    2      1000035         4                       # CHL    -->  Z4SS   CH                 
      5.34161925E-01    2      1000021         4                       # CHL    -->  GLSS   CH                 
      1.55309739E-03    2      1000024         3                       # CHL    -->  W1SS+  ST                 
      3.05570930E-01    2      1000037         3                       # CHL    -->  W2SS+  ST                 
#         PDG         Width
DECAY   1000005  1.85772980E+02   # BT1   decays
#          BR          NDA       ID1       ID2       ID3       ID4
      9.44744237E-03    2      1000022         5                       # BT1    -->  Z1SS   BT                 
      8.96670204E-03    2      1000023         5                       # BT1    -->  Z2SS   BT                 
      2.99480837E-03    2      1000025         5                       # BT1    -->  Z3SS   BT                 
      7.97208399E-02    2      1000035         5                       # BT1    -->  Z4SS   BT                 
      1.47598404E-02    2      1000021         5                       # BT1    -->  GLSS   BT                 
      3.11251044E-01    2     -1000024         6                       # BT1    -->  W1SS-  TP                 
      1.61801323E-01    2     -1000037         6                       # BT1    -->  W2SS-  TP                 
      4.09933358E-01    2          -24   1000006                       # BT1    -->  W-     TP1                
      1.12459622E-03    2          -37   1000006                       # BT1    -->  H-     TP1                
#         PDG         Width
DECAY   1000006  6.72033386E+01   # TP1   decays
#          BR          NDA       ID1       ID2       ID3       ID4
      2.28073776E-01    2      1000022         6                       # TP1    -->  Z1SS   TP                 
      2.37647936E-01    2      1000023         6                       # TP1    -->  Z2SS   TP                 
      6.52910173E-02    2      1000025         6                       # TP1    -->  Z3SS   TP                 
      2.37953045E-05    2      1000035         6                       # TP1    -->  Z4SS   TP                 
      4.68909979E-01    2      1000024         5                       # TP1    -->  W1SS+  BT                 
      5.34375213E-05    2      1000037         5                       # TP1    -->  W2SS+  BT                 
#         PDG         Width
DECAY   2000002  9.61799011E+01   # UPR   decays
#          BR          NDA       ID1       ID2       ID3       ID4
      2.48089083E-04    2      1000022         2                       # UPR    -->  Z1SS   UP                 
      1.07765678E-04    2      1000023         2                       # UPR    -->  Z2SS   UP                 
      1.40972391E-01    2      1000025         2                       # UPR    -->  Z3SS   UP                 
      4.30176578E-06    2      1000035         2                       # UPR    -->  Z4SS   UP                 
      8.58667433E-01    2      1000021         2                       # UPR    -->  GLSS   UP                 
#         PDG         Width
DECAY   2000001  7.37359772E+01   # DNR   decays
#          BR          NDA       ID1       ID2       ID3       ID4
      7.84103904E-05    2      1000022         1                       # DNR    -->  Z1SS   DN                 
      3.40599727E-05    2      1000023         1                       # DNR    -->  Z2SS   DN                 
      4.44381312E-02    2      1000025         1                       # DNR    -->  Z3SS   DN                 
      1.34601726E-06    2      1000035         1                       # DNR    -->  Z4SS   DN                 
      9.55448091E-01    2      1000021         1                       # DNR    -->  GLSS   DN                 
#         PDG         Width
DECAY   2000003  7.37359772E+01   # STR   decays
#          BR          NDA       ID1       ID2       ID3       ID4
      7.84103904E-05    2      1000022         3                       # STR    -->  Z1SS   ST                 
      3.40599727E-05    2      1000023         3                       # STR    -->  Z2SS   ST                 
      4.44381312E-02    2      1000025         3                       # STR    -->  Z3SS   ST                 
      1.34601726E-06    2      1000035         3                       # STR    -->  Z4SS   ST                 
      9.55448091E-01    2      1000021         3                       # STR    -->  GLSS   ST                 
#         PDG         Width
DECAY   2000004  9.61798706E+01   # CHR   decays
#          BR          NDA       ID1       ID2       ID3       ID4
      2.48089142E-04    2      1000022         4                       # CHR    -->  Z1SS   CH                 
      1.07765693E-04    2      1000023         4                       # CHR    -->  Z2SS   CH                 
      1.40972421E-01    2      1000025         4                       # CHR    -->  Z3SS   CH                 
      4.30176669E-06    2      1000035         4                       # CHR    -->  Z4SS   CH                 
      8.58667374E-01    2      1000021         4                       # CHR    -->  GLSS   CH                 
#         PDG         Width
DECAY   2000005  1.04203171E+02   # BT2   decays
#          BR          NDA       ID1       ID2       ID3       ID4
      2.07489580E-02    2      1000022         5                       # BT2    -->  Z1SS   BT                 
      1.99978203E-02    2      1000023         5                       # BT2    -->  Z2SS   BT                 
      3.03498339E-02    2      1000025         5                       # BT2    -->  Z3SS   BT                 
      1.14980530E-05    2      1000035         5                       # BT2    -->  Z4SS   BT                 
      5.61105609E-01    2      1000021         5                       # BT2    -->  GLSS   BT                 
      4.06096503E-02    2     -1000024         6                       # BT2    -->  W1SS-  TP                 
      1.93955475E-05    2     -1000037         6                       # BT2    -->  W2SS-  TP                 
      3.31525880E-05    2          -24   1000006                       # BT2    -->  W-     TP1                
      9.71578353E-04    2          -24   2000006                       # BT2    -->  W-     TP2                
      4.76634596E-04    2           23   1000005                       # BT2    -->  Z0     BT1                
      8.94306286E-04    2           25   1000005                       # BT2    -->  HL0    BT1                
      8.00681263E-02    2           36   1000005                       # BT2    -->  HA0    BT1                
      7.89193213E-02    2           35   1000005                       # BT2    -->  HH0    BT1                
      1.03592093E-03    2          -37   1000006                       # BT2    -->  H-     TP1                
      1.64758161E-01    2          -37   2000006                       # BT2    -->  H-     TP2                
#         PDG         Width
DECAY   2000006  2.01990982E+02   # TP2   decays
#          BR          NDA       ID1       ID2       ID3       ID4
      7.46695092E-03    2      1000021         6                       # TP2    -->  GLSS   TP                 
      1.65218543E-02    2      1000024         5                       # TP2    -->  W1SS+  BT                 
      1.47150517E-01    2      1000037         5                       # TP2    -->  W2SS+  BT                 
      1.86772153E-01    2           23   1000006                       # TP2    -->  Z0     TP1                
      2.78934598E-01    2           25   1000006                       # TP2    -->  HL0    TP1                
      5.45774063E-04    2           35   1000006                       # TP2    -->  HH0    TP1                
      5.17496082E-04    2           36   1000006                       # TP2    -->  HA0    TP1                
      1.38998881E-01    2      1000022         6                       # TP2    -->  Z1SS   TP                 
      1.45058945E-01    2      1000023         6                       # TP2    -->  Z2SS   TP                 
      4.41936916E-03    2      1000025         6                       # TP2    -->  Z3SS   TP                 
      7.36135319E-02    2      1000035         6                       # TP2    -->  Z4SS   TP                 
#         PDG         Width
DECAY   1000011  6.01083412E+01   # EL-   decays
#          BR          NDA       ID1       ID2       ID3       ID4
      8.93011529E-05    2      1000022        11                       # EL-    -->  Z1SS   E-                 
      5.51318662E-05    2      1000023        11                       # EL-    -->  Z2SS   E-                 
      1.07963249E-01    2      1000025        11                       # EL-    -->  Z3SS   E-                 
      2.94527918E-01    2      1000035        11                       # EL-    -->  Z4SS   E-                 
      8.37742773E-05    2     -1000024        12                       # EL-    -->  W1SS-  NUE                
      5.97280622E-01    2     -1000037        12                       # EL-    -->  W2SS-  NUE                
#         PDG         Width
DECAY   1000013  6.01083412E+01   # MUL-  decays
#          BR          NDA       ID1       ID2       ID3       ID4
      8.93011529E-05    2      1000022        13                       # MUL-   -->  Z1SS   MU-                
      5.51318662E-05    2      1000023        13                       # MUL-   -->  Z2SS   MU-                
      1.07963249E-01    2      1000025        13                       # MUL-   -->  Z3SS   MU-                
      2.94527918E-01    2      1000035        13                       # MUL-   -->  Z4SS   MU-                
      8.37742773E-05    2     -1000024        14                       # MUL-   -->  W1SS-  NUM                
      5.97280622E-01    2     -1000037        14                       # MUL-   -->  W2SS-  NUM                
#         PDG         Width
DECAY   1000015  2.62853279E+01   # TAU1- decays
#          BR          NDA       ID1       ID2       ID3       ID4
      4.38275263E-02    2      1000022        15                       # TAU1-  -->  Z1SS   TAU-               
      4.11484875E-02    2      1000023        15                       # TAU1-  -->  Z2SS   TAU-               
      8.32173765E-01    2      1000025        15                       # TAU1-  -->  Z3SS   TAU-               
      3.15351790E-05    2      1000035        15                       # TAU1-  -->  Z4SS   TAU-               
      8.27985778E-02    2     -1000024        16                       # TAU1-  -->  W1SS-  NUT                
      2.00992108E-05    2     -1000037        16                       # TAU1-  -->  W2SS-  NUT                
#         PDG         Width
DECAY   1000012  6.01680145E+01   # NUEL  decays
#          BR          NDA       ID1       ID2       ID3       ID4
      1.35733141E-03    2      1000022        12                       # NUEL   -->  Z1SS   NUE                
      6.49133173E-04    2      1000023        12                       # NUEL   -->  Z2SS   NUE                
      1.01728089E-01    2      1000025        12                       # NUEL   -->  Z3SS   NUE                
      2.98324645E-01    2      1000035        12                       # NUEL   -->  Z4SS   NUE                
      3.21001164E-03    2      1000024        11                       # NUEL   -->  W1SS+  E-                 
      5.94730794E-01    2      1000037        11                       # NUEL   -->  W2SS+  E-                 
#         PDG         Width
DECAY   1000014  6.01680145E+01   # NUML  decays
#          BR          NDA       ID1       ID2       ID3       ID4
      1.35733141E-03    2      1000022        14                       # NUML   -->  Z1SS   NUM                
      6.49133173E-04    2      1000023        14                       # NUML   -->  Z2SS   NUM                
      1.01728089E-01    2      1000025        14                       # NUML   -->  Z3SS   NUM                
      2.98324645E-01    2      1000035        14                       # NUML   -->  Z4SS   NUM                
      3.21001164E-03    2      1000024        13                       # NUML   -->  W1SS+  MU-                
      5.94730794E-01    2      1000037        13                       # NUML   -->  W2SS+  MU-                
#         PDG         Width
DECAY   1000016  6.14354286E+01   # NUTL  decays
#          BR          NDA       ID1       ID2       ID3       ID4
      1.31060125E-03    2      1000022        16                       # NUTL   -->  Z1SS   NUT                
      6.26782887E-04    2      1000023        16                       # NUTL   -->  Z2SS   NUT                
      9.80615392E-02    2      1000025        16                       # NUTL   -->  Z3SS   NUT                
      2.86178470E-01    2      1000035        16                       # NUTL   -->  Z4SS   NUT                
      4.26867791E-02    2      1000024        15                       # NUTL   -->  W1SS+  TAU-               
      5.70617437E-01    2      1000037        15                       # NUTL   -->  W2SS+  TAU-               
      5.18388522E-04    2           24   1000015                       # NUTL   -->  W+     TAU1-              
#         PDG         Width
DECAY   2000011  2.28494587E+01   # ER-   decays
#          BR          NDA       ID1       ID2       ID3       ID4
      1.80588535E-03    2      1000022        11                       # ER-    -->  Z1SS   E-                 
      7.84404809E-04    2      1000023        11                       # ER-    -->  Z2SS   E-                 
      9.97381628E-01    2      1000025        11                       # ER-    -->  Z3SS   E-                 
      2.80381610E-05    2      1000035        11                       # ER-    -->  Z4SS   E-                 
#         PDG         Width
DECAY   2000013  2.28494587E+01   # MUR-  decays
#          BR          NDA       ID1       ID2       ID3       ID4
      1.80588535E-03    2      1000022        13                       # MUR-   -->  Z1SS   MU-                
      7.84404809E-04    2      1000023        13                       # MUR-   -->  Z2SS   MU-                
      9.97381628E-01    2      1000025        13                       # MUR-   -->  Z3SS   MU-                
      2.80381610E-05    2      1000035        13                       # MUR-   -->  Z4SS   MU-                
#         PDG         Width
DECAY   2000015  6.13291893E+01   # TAU2- decays
#          BR          NDA       ID1       ID2       ID3       ID4
      2.02030893E-02    2      1000022        15                       # TAU2-  -->  Z1SS   TAU-               
      1.95307396E-02    2      1000023        15                       # TAU2-  -->  Z2SS   TAU-               
      1.04130797E-01    2      1000025        15                       # TAU2-  -->  Z3SS   TAU-               
      2.82588512E-01    2      1000035        15                       # TAU2-  -->  Z4SS   TAU-               
      5.86053502E-05    2     -1000024        16                       # TAU2-  -->  W1SS-  NUT                
      5.73161066E-01    2     -1000037        16                       # TAU2-  -->  W2SS-  NUT                
      2.53091945E-04    2           23   1000015                       # TAU2-  -->  Z0     TAU1-              
      7.40718460E-05    2           25   1000015                       # TAU2-  -->  HL0    TAU1-              
#         PDG         Width
DECAY   1000023  4.74441775E-09   # Z2SS  decays
#          BR          NDA       ID1       ID2       ID3       ID4
      8.18598717E-02    2      1000022        22                       # Z2SS   -->  Z1SS   GM                 
      1.31280422E-01    3      1000022         2        -2             # Z2SS   -->  Z1SS   UP     UB          
      1.69286847E-01    3      1000022         1        -1             # Z2SS   -->  Z1SS   DN     DB          
      1.69286847E-01    3      1000022         3        -3             # Z2SS   -->  Z1SS   ST     SB          
      1.31280422E-01    3      1000022         4        -4             # Z2SS   -->  Z1SS   CH     CB          
      3.84026319E-02    3      1000022        11       -11             # Z2SS   -->  Z1SS   E-     E+          
      3.84026319E-02    3      1000022        13       -13             # Z2SS   -->  Z1SS   MU-    MU+         
      1.09724905E-02    3      1000022        15       -15             # Z2SS   -->  Z1SS   TAU-   TAU+        
      7.64092952E-02    3      1000022        12       -12             # Z2SS   -->  Z1SS   NUE    ANUE        
      7.64092952E-02    3      1000022        14       -14             # Z2SS   -->  Z1SS   NUM    ANUM        
      7.64092878E-02    3      1000022        16       -16             # Z2SS   -->  Z1SS   NUT    ANUT        
#         PDG         Width
DECAY   1000025  2.12240052E+00   # Z3SS  decays
#          BR          NDA       ID1       ID2       ID3       ID4
      1.10137982E-07    2      1000022        22                       # Z3SS   -->  Z1SS   GM                 
      1.06928042E-07    2      1000023        22                       # Z3SS   -->  Z2SS   GM                 
      2.50564784E-01    2      1000024       -24                       # Z3SS   -->  W1SS+  W-                 
      2.50564784E-01    2     -1000024        24                       # Z3SS   -->  W1SS-  W+                 
      7.12942630E-02    2      1000022        23                       # Z3SS   -->  Z1SS   Z0                 
      1.75533846E-01    2      1000023        23                       # Z3SS   -->  Z2SS   Z0                 
      1.38442341E-10    3      1000022         2        -2             # Z3SS   -->  Z1SS   UP     UB          
      2.68657128E-11    3      1000022         1        -1             # Z3SS   -->  Z1SS   DN     DB          
      2.68657128E-11    3      1000022         3        -3             # Z3SS   -->  Z1SS   ST     SB          
      1.38442341E-10    3      1000022         4        -4             # Z3SS   -->  Z1SS   CH     CB          
      1.67434737E-05    3      1000022         5        -5             # Z3SS   -->  Z1SS   BT     BB          
      6.42581710E-10    3      1000022        11       -11             # Z3SS   -->  Z1SS   E-     E+          
      6.42581710E-10    3      1000022        13       -13             # Z3SS   -->  Z1SS   MU-    MU+         
      3.70375892E-06    3      1000022        15       -15             # Z3SS   -->  Z1SS   TAU-   TAU+        
      1.91927585E-10    3      1000022        12       -12             # Z3SS   -->  Z1SS   NUE    ANUE        
      1.91927585E-10    3      1000022        14       -14             # Z3SS   -->  Z1SS   NUM    ANUM        
      2.03244505E-10    3      1000022        16       -16             # Z3SS   -->  Z1SS   NUT    ANUT        
      3.69595708E-11    3      1000023         2        -2             # Z3SS   -->  Z2SS   UP     UB          
      7.70480121E-12    3      1000023         1        -1             # Z3SS   -->  Z2SS   DN     DB          
      7.70480121E-12    3      1000023         3        -3             # Z3SS   -->  Z2SS   ST     SB          
      3.69595708E-11    3      1000023         4        -4             # Z3SS   -->  Z2SS   CH     CB          
      1.60933778E-05    3      1000023         5        -5             # Z3SS   -->  Z2SS   BT     BB          
      1.70937708E-10    3      1000023        11       -11             # Z3SS   -->  Z2SS   E-     E+          
      1.70937708E-10    3      1000023        13       -13             # Z3SS   -->  Z2SS   MU-    MU+         
      3.55892848E-06    3      1000023        15       -15             # Z3SS   -->  Z2SS   TAU-   TAU+        
      5.56851197E-11    3      1000023        12       -12             # Z3SS   -->  Z2SS   NUE    ANUE        
      5.56851197E-11    3      1000023        14       -14             # Z3SS   -->  Z2SS   NUM    ANUM        
      5.89744573E-11    3      1000023        16       -16             # Z3SS   -->  Z2SS   NUT    ANUT        
      1.76427200E-01    2      1000022        25                       # Z3SS   -->  Z1SS   HL0                
      7.55747631E-02    2      1000023        25                       # Z3SS   -->  Z2SS   HL0                
#         PDG         Width
DECAY   1000035  1.95747643E+01   # Z4SS  decays
#          BR          NDA       ID1       ID2       ID3       ID4
      7.38545282E-07    2      1000022        22                       # Z4SS   -->  Z1SS   GM                 
      1.15059458E-06    2      1000023        22                       # Z4SS   -->  Z2SS   GM                 
      4.23588853E-09    2      1000025        22                       # Z4SS   -->  Z3SS   GM                 
      1.76195189E-01    2      1000024       -24                       # Z4SS   -->  W1SS+  W-                 
      1.76195189E-01    2     -1000024        24                       # Z4SS   -->  W1SS-  W+                 
      7.18454346E-02    2      1000024       -37                       # Z4SS   -->  W1SS+  H-                 
      7.18454346E-02    2     -1000024        37                       # Z4SS   -->  W1SS-  H+                 
      2.65852435E-07    3     -1000037         2        -1             # Z4SS   -->  W2SS-  UP     DB          
      8.86174760E-08    3     -1000037        12       -11             # Z4SS   -->  W2SS-  NUE    E+          
      8.86174760E-08    3     -1000037        14       -13             # Z4SS   -->  W2SS-  NUM    MU+         
      2.65852435E-07    3      1000037         1        -2             # Z4SS   -->  W2SS+  DN     UB          
      8.86174760E-08    3      1000037        11       -12             # Z4SS   -->  W2SS+  E-     ANUE        
      8.86174760E-08    3      1000037        13       -14             # Z4SS   -->  W2SS+  MU-    ANUM        
      2.65852435E-07    3     -1000037         4        -3             # Z4SS   -->  W2SS-  CH     SB          
      8.86174760E-08    3     -1000037        16       -15             # Z4SS   -->  W2SS-  NUT    TAU+        
      2.65852435E-07    3      1000037         3        -4             # Z4SS   -->  W2SS+  ST     CB          
      8.86174760E-08    3      1000037        15       -16             # Z4SS   -->  W2SS+  TAU-   ANUT        
      5.56654520E-02    2      1000022        23                       # Z4SS   -->  Z1SS   Z0                 
      1.19947210E-01    2      1000023        23                       # Z4SS   -->  Z2SS   Z0                 
      1.38285730E-04    2      1000025        23                       # Z4SS   -->  Z3SS   Z0                 
      7.21653570E-10    3      1000022         2        -2             # Z4SS   -->  Z1SS   UP     UB          
      1.61158265E-09    3      1000022         1        -1             # Z4SS   -->  Z1SS   DN     DB          
      1.61158265E-09    3      1000022         3        -3             # Z4SS   -->  Z1SS   ST     SB          
      7.21653570E-10    3      1000022         4        -4             # Z4SS   -->  Z1SS   CH     CB          
      1.99819993E-07    3      1000022         5        -5             # Z4SS   -->  Z1SS   BT     BB          
      1.21377519E-10    3      1000022        11       -11             # Z4SS   -->  Z1SS   E-     E+          
      1.21377519E-10    3      1000022        13       -13             # Z4SS   -->  Z1SS   MU-    MU+         
      2.64204889E-08    3      1000022        15       -15             # Z4SS   -->  Z1SS   TAU-   TAU+        
      1.86313298E-09    3      1000022        12       -12             # Z4SS   -->  Z1SS   NUE    ANUE        
      1.86313298E-09    3      1000022        14       -14             # Z4SS   -->  Z1SS   NUM    ANUM        
      1.97654204E-09    3      1000022        16       -16             # Z4SS   -->  Z1SS   NUT    ANUT        
      2.83039869E-10    3      1000023         2        -2             # Z4SS   -->  Z2SS   UP     UB          
      5.95537286E-10    3      1000023         1        -1             # Z4SS   -->  Z2SS   DN     DB          
      5.95537286E-10    3      1000023         3        -3             # Z4SS   -->  Z2SS   ST     SB          
      2.83039869E-10    3      1000023         4        -4             # Z4SS   -->  Z2SS   CH     CB          
      1.88436161E-07    3      1000023         5        -5             # Z4SS   -->  Z2SS   BT     BB          
      5.62782251E-11    3      1000023        11       -11             # Z4SS   -->  Z2SS   E-     E+          
      5.62782251E-11    3      1000023        13       -13             # Z4SS   -->  Z2SS   MU-    MU+         
      2.53030041E-08    3      1000023        15       -15             # Z4SS   -->  Z2SS   TAU-   TAU+        
      6.69279854E-10    3      1000023        12       -12             # Z4SS   -->  Z2SS   NUE    ANUE        
      6.69279854E-10    3      1000023        14       -14             # Z4SS   -->  Z2SS   NUM    ANUM        
      7.10199899E-10    3      1000023        16       -16             # Z4SS   -->  Z2SS   NUT    ANUT        
      4.87008478E-09    3      1000025         2        -2             # Z4SS   -->  Z3SS   UP     UB          
      4.09170475E-09    3      1000025         1        -1             # Z4SS   -->  Z3SS   DN     DB          
      4.09170475E-09    3      1000025         3        -3             # Z4SS   -->  Z3SS   ST     SB          
      4.87008478E-09    3      1000025         4        -4             # Z4SS   -->  Z3SS   CH     CB          
      1.99177155E-08    3      1000025         5        -5             # Z4SS   -->  Z3SS   BT     BB          
      2.72415406E-08    3      1000025        11       -11             # Z4SS   -->  Z3SS   E-     E+          
      2.72415406E-08    3      1000025        13       -13             # Z4SS   -->  Z3SS   MU-    MU+         
      3.03075289E-08    3      1000025        15       -15             # Z4SS   -->  Z3SS   TAU-   TAU+        
      2.59256563E-08    3      1000025        12       -12             # Z4SS   -->  Z3SS   NUE    ANUE        
      2.59256563E-08    3      1000025        14       -14             # Z4SS   -->  Z3SS   NUM    ANUM        
      2.75402172E-08    3      1000025        16       -16             # Z4SS   -->  Z3SS   NUT    ANUT        
      1.14718243E-01    2      1000022        25                       # Z4SS   -->  Z1SS   HL0                
      4.08989601E-02    2      1000022        35                       # Z4SS   -->  Z1SS   HH0                
      3.32645923E-02    2      1000022        36                       # Z4SS   -->  Z1SS   HA0                
      6.60932362E-02    2      1000023        25                       # Z4SS   -->  Z2SS   HL0                
      3.13579701E-02    2      1000023        35                       # Z4SS   -->  Z2SS   HH0                
      4.01950516E-02    2      1000023        36                       # Z4SS   -->  Z2SS   HA0                
      1.63552607E-03    2      1000025        25                       # Z4SS   -->  Z3SS   HL0                
#         PDG         Width
DECAY   1000024  3.67645789E-08   # W1SS+ decays
#          BR          NDA       ID1       ID2       ID3       ID4
      3.32783014E-01    3      1000022         2        -1             # W1SS+  -->  Z1SS   UP     DB          
      3.32783014E-01    3      1000022         4        -3             # W1SS+  -->  Z1SS   CH     SB          
      1.10927738E-01    3      1000022       -11        12             # W1SS+  -->  Z1SS   E+     NUE         
      1.10927738E-01    3      1000022       -13        14             # W1SS+  -->  Z1SS   MU+    NUM         
      1.10929660E-01    3      1000022       -15        16             # W1SS+  -->  Z1SS   TAU+   NUT         
      8.24350805E-04    3      1000023         2        -1             # W1SS+  -->  Z2SS   UP     DB          
      2.74783466E-04    3      1000023       -11        12             # W1SS+  -->  Z2SS   E+     NUE         
      2.74783466E-04    3      1000023       -13        14             # W1SS+  -->  Z2SS   MU+    NUM         
      2.74781691E-04    3      1000023       -15        16             # W1SS+  -->  Z2SS   TAU+   NUT         
#         PDG         Width
DECAY   1000037  1.89027462E+01   # W2SS+ decays
#          BR          NDA       ID1       ID2       ID3       ID4
      1.73775228E-09    3      1000022         2        -1             # W2SS+  -->  Z1SS   UP     DB          
      1.73775228E-09    3      1000022         4        -3             # W2SS+  -->  Z1SS   CH     SB          
      1.57276803E-09    3      1000022       -11        12             # W2SS+  -->  Z1SS   E+     NUE         
      1.57276803E-09    3      1000022       -13        14             # W2SS+  -->  Z1SS   MU+    NUM         
      2.76773253E-08    3      1000022       -15        16             # W2SS+  -->  Z1SS   TAU+   NUT         
      1.72846824E-01    2      1000022        24                       # W2SS+  -->  Z1SS   W+                 
      7.37953112E-02    2      1000022        37                       # W2SS+  -->  Z1SS   H+                 
      1.13475718E-09    3      1000023         2        -1             # W2SS+  -->  Z2SS   UP     DB          
      1.13475718E-09    3      1000023         4        -3             # W2SS+  -->  Z2SS   CH     SB          
      8.81057283E-10    3      1000023       -11        12             # W2SS+  -->  Z2SS   E+     NUE         
      8.81057283E-10    3      1000023       -13        14             # W2SS+  -->  Z2SS   MU+    NUM         
      2.59305555E-08    3      1000023       -15        16             # W2SS+  -->  Z2SS   TAU+   NUT         
      1.70220345E-01    2      1000023        24                       # W2SS+  -->  Z2SS   W+                 
      7.07573071E-02    2      1000023        37                       # W2SS+  -->  Z2SS   H+                 
      8.27945623E-09    3      1000025         2        -1             # W2SS+  -->  Z3SS   UP     DB          
      8.27945623E-09    3      1000025         4        -3             # W2SS+  -->  Z3SS   CH     SB          
      4.91519963E-08    3      1000025       -11        12             # W2SS+  -->  Z3SS   E+     NUE         
      4.91519963E-08    3      1000025       -13        14             # W2SS+  -->  Z3SS   MU+    NUM         
      5.33540110E-08    3      1000025       -15        16             # W2SS+  -->  Z3SS   TAU+   NUT         
      5.63927786E-03    2      1000025        24                       # W2SS+  -->  Z3SS   W+                 
      1.76385581E-01    2      1000024        23                       # W2SS+  -->  W1SS+  Z0                 
      5.70907055E-09    3      1000024         1        -1             # W2SS+  -->  W1SS+  DN     DB          
      5.70907055E-09    3      1000024         3        -3             # W2SS+  -->  W1SS+  ST     SB          
      1.49529361E-10    3      1000024         2        -2             # W2SS+  -->  W1SS+  UP     UB          
      1.49529361E-10    3      1000024         4        -4             # W2SS+  -->  W1SS+  CH     CB          
      9.76988351E-11    3      1000024        12       -12             # W2SS+  -->  W1SS+  NUE    ANUE        
      9.76988351E-11    3      1000024        14       -14             # W2SS+  -->  W1SS+  NUM    ANUM        
      1.65039565E-10    3      1000024        16       -16             # W2SS+  -->  W1SS+  NUT    ANUT        
      3.71846154E-09    3      1000024        11       -11             # W2SS+  -->  W1SS+  E-     E+          
      3.71846154E-09    3      1000024        13       -13             # W2SS+  -->  W1SS+  MU-    MU+         
      3.94499233E-09    3      1000024        15       -15             # W2SS+  -->  W1SS+  TAU-   TAU+        
      1.86844975E-01    2      1000024        25                       # W2SS+  -->  W1SS+  HL0                
      7.11483955E-02    2      1000024        35                       # W2SS+  -->  W1SS+  HH0                
      7.23617300E-02    2      1000024        36                       # W2SS+  -->  W1SS+  HA0                
#         PDG         Width
DECAY        25  3.94736230E-03   # HL0   decays
#          BR          NDA       ID1       ID2       ID3       ID4
      5.64902392E-09    2           11       -11                       # HL0    -->  E-     E+                 
      2.38510984E-04    2           13       -13                       # HL0    -->  MU-    MU+                
      6.82309717E-02    2           15       -15                       # HL0    -->  TAU-   TAU+               
      7.08112884E-06    2            1        -1                       # HL0    -->  DN     DB                 
      2.86113145E-03    2            3        -3                       # HL0    -->  ST     SB                 
      6.13032162E-01    2            5        -5                       # HL0    -->  BT     BB                 
      2.16192348E-06    2            2        -2                       # HL0    -->  UP     UB                 
      4.01718989E-02    2            4        -4                       # HL0    -->  CH     CB                 
      2.66430248E-03    2           22        22                       # HL0    -->  GM     GM                 
      5.28151654E-02    2           21        21                       # HL0    -->  GL     GL                 
      1.09909046E-02    3           24        11       -12             # HL0    -->  W+     E-     ANUE        
      1.09909046E-02    3           24        13       -14             # HL0    -->  W+     MU-    ANUM        
      1.09909046E-02    3           24        15       -16             # HL0    -->  W+     TAU-   ANUT        
      3.29727158E-02    3           24        -2         1             # HL0    -->  W+     UB     DN          
      3.29727158E-02    3           24        -4         3             # HL0    -->  W+     CB     ST          
      1.09909046E-02    3          -24       -11        12             # HL0    -->  W-     E+     NUE         
      1.09909046E-02    3          -24       -13        14             # HL0    -->  W-     MU+    NUM         
      1.09909046E-02    3          -24       -15        16             # HL0    -->  W-     TAU+   NUT         
      3.29727158E-02    3          -24         2        -1             # HL0    -->  W-     UP     DB          
      3.29727158E-02    3          -24         4        -3             # HL0    -->  W-     CH     SB          
      1.51415297E-03    3           23        12       -12             # HL0    -->  Z0     NUE    ANUE        
      1.51415297E-03    3           23        14       -14             # HL0    -->  Z0     NUM    ANUM        
      1.51415297E-03    3           23        16       -16             # HL0    -->  Z0     NUT    ANUT        
      7.62057956E-04    3           23        11       -11             # HL0    -->  Z0     E-     E+          
      7.62057956E-04    3           23        13       -13             # HL0    -->  Z0     MU-    MU+         
      7.62057956E-04    3           23        15       -15             # HL0    -->  Z0     TAU-   TAU+        
      2.61074584E-03    3           23         2        -2             # HL0    -->  Z0     UP     UB          
      2.61074584E-03    3           23         4        -4             # HL0    -->  Z0     CH     CB          
      3.36328405E-03    3           23         1        -1             # HL0    -->  Z0     DN     DB          
      3.36328405E-03    3           23         3        -3             # HL0    -->  Z0     ST     SB          
      3.36328405E-03    3           23         5        -5             # HL0    -->  Z0     BT     BB          
#         PDG         Width
DECAY        35  3.58355165E+00   # HH0   decays
#          BR          NDA       ID1       ID2       ID3       ID4
      1.07387974E-08    2           11       -11                       # HH0    -->  E-     E+                 
      4.53411340E-04    2           13       -13                       # HH0    -->  MU-    MU+                
      1.29861534E-01    2           15       -15                       # HH0    -->  TAU-   TAU+               
      1.31550751E-05    2            1        -1                       # HH0    -->  DN     DB                 
      5.31531591E-03    2            3        -3                       # HH0    -->  ST     SB                 
      7.92405844E-01    2            5        -5                       # HH0    -->  BT     BB                 
      8.71370684E-11    2            2        -2                       # HH0    -->  UP     UB                 
      1.22715051E-06    2            4        -4                       # HH0    -->  CH     CB                 
      5.59796989E-02    2            6        -6                       # HH0    -->  TP     TB                 
      2.09326871E-07    2           22        22                       # HH0    -->  GM     GM                 
      2.53861890E-05    2           21        21                       # HH0    -->  GL     GL                 
      2.21040551E-04    2           24       -24                       # HH0    -->  W+     W-                 
      1.12225855E-04    2           23        23                       # HH0    -->  Z0     Z0                 
      3.46299447E-03    2      1000022   1000022                       # HH0    -->  Z1SS   Z1SS               
      3.47411144E-04    2      1000022   1000023                       # HH0    -->  Z1SS   Z2SS               
      2.07427144E-03    2      1000023   1000023                       # HH0    -->  Z2SS   Z2SS               
      8.90585035E-03    2      1000024  -1000024                       # HH0    -->  W1SS+  W1SS-              
      8.20472836E-04    2           25        25                       # HH0    -->  HL0    HL0                
#         PDG         Width
DECAY        36  3.57649040E+00   # HA0   decays
#          BR          NDA       ID1       ID2       ID3       ID4
      1.06909956E-08    2           11       -11                       # HA0    -->  E-     E+                 
      4.51393134E-04    2           13       -13                       # HA0    -->  MU-    MU+                
      1.29285112E-01    2           15       -15                       # HA0    -->  TAU-   TAU+               
      1.30972403E-05    2            1        -1                       # HA0    -->  DN     DB                 
      5.29194809E-03    2            3        -3                       # HA0    -->  ST     SB                 
      7.88957477E-01    2            5        -5                       # HA0    -->  BT     BB                 
      8.27792834E-11    2            2        -2                       # HA0    -->  UP     UB                 
      1.16669742E-06    2            4        -4                       # HA0    -->  CH     CB                 
      5.91156967E-02    2            6        -6                       # HA0    -->  TP     TB                 
      2.72521703E-07    2           22        22                       # HA0    -->  GM     GM                 
      7.94989755E-05    2           21        21                       # HA0    -->  GL     GL                 
      4.81655868E-03    2      1000022   1000022                       # HA0    -->  Z1SS   Z1SS               
      6.22438674E-05    2      1000022   1000023                       # HA0    -->  Z1SS   Z2SS               
      1.69281487E-03    2      1000023   1000023                       # HA0    -->  Z2SS   Z2SS               
      1.00202886E-02    2      1000024  -1000024                       # HA0    -->  W1SS+  W1SS-              
      2.12321611E-04    2           25        23                       # HA0    -->  HL0    Z0                 
#         PDG         Width
DECAY        37  3.12140965E+00   # H+    decays
#          BR          NDA       ID1       ID2       ID3       ID4
      1.22892221E-08    2           12       -11                       # H+     -->  NUE    E+                 
      5.18873159E-04    2           14       -13                       # H+     -->  NUM    MU+                
      1.48612291E-01    2           16       -15                       # H+     -->  NUT    TAU+               
      1.38381183E-05    2            2        -1                       # H+     -->  UP     DB                 
      5.59247611E-03    2            4        -3                       # H+     -->  CH     SB                 
      8.44305813E-01    2            6        -5                       # H+     -->  TP     BB                 
      4.10452667E-05    2      1000024   1000022                       # H+     -->  W1SS+  Z1SS               
      6.71724789E-04    2      1000024   1000023                       # H+     -->  W1SS+  Z2SS               
      2.43970775E-04    2           25        24                       # H+     -->  HL0    W+                 
