#
#                              ======================
#                              | THE SUSYHIT OUTPUT |
#                              ======================
#
#
#              ------------------------------------------------------
#              |     This is the output of the SUSY-HIT package     |
#              |  created by A.Djouadi, M.Muehlleitner and M.Spira. |
#              |  In case of problems with SUSY-HIT email to        |
#              |           margarete.muehlleitner@cern.ch           |
#              |           michael.spira@psi.ch                     |
#              |           abdelhak.djouadi@cern.ch                 |
#              ------------------------------------------------------
#
#              ------------------------------------------------------
#              |  SUSY Les Houches Accord - MSSM Spectrum + Decays  |
#              |              based on the decay programs           |
#              |                                                    |
#              |                     SDECAY 1.3b                    |
#              |                                                    |
#              |  Authors: M.Muhlleitner, A.Djouadi and Y.Mambrini  |
#              |  Ref.:    Comput.Phys.Commun.168(2005)46           |
#              |           [hep-ph/0311167]                         |
#              |                                                    |
#              |                     HDECAY 3.4                     |
#              |                                                    |
#              |  By: A.Djouadi,J.Kalinowski,M.Muhlleitner,M.Spira  |
#              |  Ref.:    Comput.Phys.Commun.108(1998)56           |
#              |           [hep-ph/9704448]                         |
#              |                                                    |
#              |                                                    |
#              |  If not stated otherwise all DRbar couplings and   |
#              |  soft SUSY breaking masses are given at the scale  |
#              |  Q=  0.50007551E+04
#              |                                                    |
#              ------------------------------------------------------
#
#
BLOCK DCINFO  # Decay Program information
     1   SDECAY/HDECAY # decay calculator
     2   1.3b  /3.4    # version number
#
BLOCK SPINFO  # Spectrum calculator information
     1    SOFTSUSY    # spectrum calculator                
     2    3.4.0       # version number                     
#
BLOCK MODSEL  # Model selection
     1     0   #  nonUniversal                                     
#
BLOCK SMINPUTS  # Standard Model inputs
         1     1.25778332E+02   # alpha_em^-1(M_Z)^MSbar
         2     1.16570000E-05   # G_F [GeV^-2]
         3     1.17200002E-01   # alpha_S(M_Z)^MSbar
         4     9.11876000E+01   # M_Z pole mass
         5     4.25000000E+00   # mb(mb)^MSbar
         6     1.72500000E+02   # mt pole mass
         7     1.77682000E+00   # mtau pole mass
#
BLOCK MINPAR  # Input parameters - minimal models
         3     1.00000000E+01   # tanb                
#
BLOCK EXTPAR  # Input parameters - non-minimal models
         0    -1.00000000E+00   # Set                 
         1     6.00000000E+01   # M_1(MX)             
         2     3.00000000E+03   # M_2(MX)             
         3     2.23497100E+03   # M_3(MX)             
        11     5.00000000E+03   # At(MX)              
        12     5.00000000E+03   # Ab(MX)              
        13     0.00000000E+00   # Atau(MX)            
        23    -6.67965000E+02   # mu(MX)              
        26     3.00000000E+03   # mA(pole)            
        31     5.00000000E+03   # meL(MX)             
        32     5.00000000E+03   # mmuL(MX)            
        33     5.00000000E+03   # mtauL(MX)           
        34     5.00000000E+03   # meR(MX)             
        35     5.00000000E+03   # mmuR(MX)            
        36     5.00000000E+03   # mtauR(MX)           
        41     5.00000000E+03   # mqL1(MX)            
        42     5.00000000E+03   # mqL2(MX)            
        43     5.00000000E+03   # mqL3(MX)            
        44     5.00000000E+03   # muR(MX)             
        45     5.00000000E+03   # mcR(MX)             
        46     5.00000000E+03   # mtR(MX)             
        47     5.00000000E+03   # mdR(MX)             
        48     5.00000000E+03   # msR(MX)             
        49     5.00000000E+03   # mbR(MX)             
#
BLOCK MASS  # Mass Spectrum
# PDG code           mass       particle
        24     8.00943788E+01   # W+
        25     1.24812845E+02   # h
        35     3.00008377E+03   # H
        36     2.99999874E+03   # A
        37     3.00137859E+03   # H+
         5     4.87878001E+00   # b-quark pole mass calculated from mb(mb)_Msbar
   1000001     5.08194057E+03   # ~d_L
   2000001     5.06415588E+03   # ~d_R
   1000002     5.08146968E+03   # ~u_L
   2000002     5.06386302E+03   # ~u_R
   1000003     5.08194057E+03   # ~s_L
   2000003     5.06415588E+03   # ~s_R
   1000004     5.08146968E+03   # ~c_L
   2000004     5.06386302E+03   # ~c_R
   1000005     5.02766326E+03   # ~b_1
   2000005     5.06247360E+03   # ~b_2
   1000006     4.91964194E+03   # ~t_1
   2000006     5.07102616E+03   # ~t_2
   1000011     5.01908774E+03   # ~e_L
   2000011     5.00593502E+03   # ~e_R
   1000012     5.01813849E+03   # ~nu_eL
   1000013     5.01908774E+03   # ~mu_L
   2000013     5.00593502E+03   # ~mu_R
   1000014     5.01813849E+03   # ~nu_muL
   1000015     5.00471945E+03   # ~tau_1
   2000015     5.01866937E+03   # ~tau_2
   1000016     5.01758902E+03   # ~nu_tauL
   1000021     2.60000055E+03   # ~g
   1000022     6.02749140E+01   # ~chi_10
   1000023     6.99989765E+02   # ~chi_20
   1000025    -7.02214768E+02   # ~chi_30
   1000035     3.07418827E+03   # ~chi_40
   1000024     7.00000223E+02   # ~chi_1+
   1000037     3.07435581E+03   # ~chi_2+
#
BLOCK NMIX  # Neutralino Mixing Matrix
  1  1     9.97979502E-01   # N_11
  1  2     2.19051929E-04   # N_12
  1  3    -6.35262472E-02   # N_13
  1  4     1.13239763E-03   # N_14
  2  1     4.41397145E-02   # N_21
  2  2     2.05650507E-02   # N_22
  2  3     7.06086363E-01   # N_23
  2  4     7.06449441E-01   # N_24
  3  1    -4.56995358E-02   # N_31
  3  2     1.61067618E-02   # N_32
  3  3    -7.05263463E-01   # N_33
  3  4     7.07287475E-01   # N_34
  4  1    -3.90406492E-04   # N_41
  4  2     9.99658743E-01   # N_42
  4  3    -3.14835007E-03   # N_43
  4  4    -2.59293761E-02   # N_44
#
BLOCK UMIX  # Chargino Mixing Matrix U
  1  1     4.46144177E-03   # U_11
  1  2     9.99990048E-01   # U_12
  2  1    -9.99990048E-01   # U_21
  2  2     4.46144177E-03   # U_22
#
BLOCK VMIX  # Chargino Mixing Matrix V
  1  1     3.66961498E-02   # V_11
  1  2    -9.99326469E-01   # V_12
  2  1    -9.99326469E-01   # V_21
  2  2    -3.66961498E-02   # V_22
#
BLOCK STOPMIX  # Stop Mixing Matrix
  1  1    -5.02563677E-01   # cos(theta_t)
  1  2     8.64540196E-01   # sin(theta_t)
  2  1    -8.64540196E-01   # -sin(theta_t)
  2  2    -5.02563677E-01   # cos(theta_t)
#
BLOCK SBOTMIX  # Sbottom Mixing Matrix
  1  1     9.98207672E-01   # cos(theta_b)
  1  2    -5.98451632E-02   # sin(theta_b)
  2  1     5.98451632E-02   # -sin(theta_b)
  2  2     9.98207672E-01   # cos(theta_b)
#
BLOCK STAUMIX  # Stau Mixing Matrix
  1  1    -7.99483260E-02   # cos(theta_tau)
  1  2     9.96799009E-01   # sin(theta_tau)
  2  1    -9.96799009E-01   # -sin(theta_tau)
  2  2    -7.99483260E-02   # cos(theta_tau)
#
BLOCK ALPHA  # Higgs mixing
          -1.05488606E-01   # Mixing angle in the neutral Higgs boson sector
#
BLOCK HMIX Q=  5.00075514E+03  # DRbar Higgs Parameters
         1    -6.80243591E+02   # mu(Q)MSSM           
         2     9.46879354E+00   # tan                 
         3     2.41792279E+02   # higgs               
         4     8.61055740E+06   # mA^2(Q)MSSM         
#
BLOCK GAUGE Q=  5.00075514E+03  # The gauge couplings
     1     3.70867502E-01   # gprime(Q) DRbar
     2     6.32916157E-01   # g(Q) DRbar
     3     9.94630428E-01   # g3(Q) DRbar
#
BLOCK AU Q=  5.00075514E+03  # The trilinear couplings
  1  1     5.00000002E+03   # A_u(Q) DRbar
  2  2     5.00000002E+03   # A_c(Q) DRbar
  3  3     5.00000002E+03   # A_t(Q) DRbar
#
BLOCK AD Q=  5.00075514E+03  # The trilinear couplings
  1  1     5.00000001E+03   # A_d(Q) DRbar
  2  2     5.00000001E+03   # A_s(Q) DRbar
  3  3     5.00000001E+03   # A_b(Q) DRbar
#
BLOCK AE Q=  5.00075514E+03  # The trilinear couplings
  1  1     0.00000000E+00   # A_e(Q) DRbar
  2  2     2.62872197E-07   # A_mu(Q) DRbar
  3  3     2.62859856E-07   # A_tau(Q) DRbar
#
BLOCK Yu Q=  5.00075514E+03  # The Yukawa couplings
  1  1     0.00000000E+00   # y_u(Q) DRbar
  2  2     0.00000000E+00   # y_c(Q) DRbar
  3  3     8.21382106E-01   # y_t(Q) DRbar
#
BLOCK Yd Q=  5.00075514E+03  # The Yukawa couplings
  1  1     0.00000000E+00   # y_d(Q) DRbar
  2  2     0.00000000E+00   # y_s(Q) DRbar
  3  3     1.30618899E-01   # y_b(Q) DRbar
#
BLOCK Ye Q=  5.00075514E+03  # The Yukawa couplings
  1  1     0.00000000E+00   # y_e(Q) DRbar
  2  2     0.00000000E+00   # y_mu(Q) DRbar
  3  3     9.70110826E-02   # y_tau(Q) DRbar
#
BLOCK MSOFT Q=  5.00075514E+03  # The soft SUSY breaking masses at the scale Q
         1     6.00000000E+01   # M_1(Q)              
         2     3.00000000E+03   # M_2(Q)              
         3     2.23497100E+03   # M_3(Q)              
        21     8.25213808E+06   # mH1^2(Q)            
        22     1.11347827E+05   # mH2^2(Q)            
        31     5.00000000E+03   # meL(Q)              
        32     5.00000000E+03   # mmuL(Q)             
        33     5.00000000E+03   # mtauL(Q)            
        34     5.00000000E+03   # meR(Q)              
        35     5.00000000E+03   # mmuR(Q)             
        36     5.00000000E+03   # mtauR(Q)            
        41     4.99999999E+03   # mqL1(Q)             
        42     4.99999999E+03   # mqL2(Q)             
        43     4.99999999E+03   # mqL3(Q)             
        44     4.99999999E+03   # muR(Q)              
        45     4.99999999E+03   # mcR(Q)              
        46     4.99999999E+03   # mtR(Q)              
        47     4.99999999E+03   # mdR(Q)              
        48     4.99999999E+03   # msR(Q)              
        49     4.99999999E+03   # mbR(Q)              
#
#
#
#                             =================
#                             |The decay table|
#                             =================
#
# - The QCD corrections to the decays gluino -> squark  + quark
#                                     squark -> gaugino + quark_prime
#                                     squark -> squark_prime + Higgs
#                                     squark -> gluino  + quark
#   are included.
#
# - The multi-body decays for the inos, stops and sbottoms are included.
#
# - The loop induced decays for the gluino, neutralinos and stops
#   are included.
#
# - The SUSY decays of the top quark are included.
#
#
#         PDG            Width
DECAY         6     1.40380545E+00   # top decays
#          BR         NDA      ID1       ID2
     1.00000000E+00    2           5        24   # BR(t ->  b    W+)
#
#         PDG            Width
DECAY   1000021     7.29214173E-03   # gluino decays
#          BR         NDA      ID1       ID2
     9.17976021E-07    2     1000022        21   # BR(~g -> ~chi_10 g)
     4.27123990E-03    2     1000023        21   # BR(~g -> ~chi_20 g)
     4.17511783E-03    2     1000025        21   # BR(~g -> ~chi_30 g)
#           BR         NDA      ID1       ID2       ID3
     1.27895281E-02    3     1000022         1        -1   # BR(~g -> ~chi_10 d  db)
     2.31691794E-05    3     1000023         1        -1   # BR(~g -> ~chi_20 d  db)
     2.48278534E-05    3     1000025         1        -1   # BR(~g -> ~chi_30 d  db)
     4.36178125E-02    3     1000022         2        -2   # BR(~g -> ~chi_10 u  ub)
     1.07363527E-04    3     1000023         2        -2   # BR(~g -> ~chi_20 u  ub)
     3.52010013E-05    3     1000025         2        -2   # BR(~g -> ~chi_30 u  ub)
     1.27895281E-02    3     1000022         3        -3   # BR(~g -> ~chi_10 s  sb)
     2.31691794E-05    3     1000023         3        -3   # BR(~g -> ~chi_20 s  sb)
     2.48278534E-05    3     1000025         3        -3   # BR(~g -> ~chi_30 s  sb)
     4.36178125E-02    3     1000022         4        -4   # BR(~g -> ~chi_10 c  cb)
     1.07363527E-04    3     1000023         4        -4   # BR(~g -> ~chi_20 c  cb)
     3.52010013E-05    3     1000025         4        -4   # BR(~g -> ~chi_30 c  cb)
     1.30185396E-02    3     1000022         5        -5   # BR(~g -> ~chi_10 b  bb)
     5.17165332E-03    3     1000023         5        -5   # BR(~g -> ~chi_20 b  bb)
     5.13844603E-03    3     1000025         5        -5   # BR(~g -> ~chi_30 b  bb)
     4.47302731E-02    3     1000022         6        -6   # BR(~g -> ~chi_10 t  tb)
     2.01763926E-01    3     1000023         6        -6   # BR(~g -> ~chi_20 t  tb)
     1.90869299E-01    3     1000025         6        -6   # BR(~g -> ~chi_30 t  tb)
     5.77670757E-05    3     1000024         1        -2   # BR(~g -> ~chi_1+ d  ub)
     5.77670757E-05    3    -1000024         2        -1   # BR(~g -> ~chi_1- u  db)
     5.77670757E-05    3     1000024         3        -4   # BR(~g -> ~chi_1+ s  cb)
     5.77670757E-05    3    -1000024         4        -3   # BR(~g -> ~chi_1- c  sb)
     2.08716858E-01    3     1000024         5        -6   # BR(~g -> ~chi_1+ b  tb)
     2.08716858E-01    3    -1000024         6        -5   # BR(~g -> ~chi_1- t  bb)
#
#         PDG            Width
DECAY   1000006     2.89345463E+02   # stop1 decays
#          BR         NDA      ID1       ID2
     3.07119372E-02    2     1000022         6   # BR(~t_1 -> ~chi_10 t )
     1.10246798E-01    2     1000023         6   # BR(~t_1 -> ~chi_20 t )
     1.05399491E-01    2     1000025         6   # BR(~t_1 -> ~chi_30 t )
     6.96951934E-03    2     1000035         6   # BR(~t_1 -> ~chi_40 t )
     1.61880678E-01    2     1000024         5   # BR(~t_1 -> ~chi_1+ b )
     1.38912858E-02    2     1000037         5   # BR(~t_1 -> ~chi_2+ b )
     5.70900291E-01    2     1000021         6   # BR(~t_1 -> ~g      t )
#
#         PDG            Width
DECAY   2000006     2.97115856E+02   # stop2 decays
#          BR         NDA      ID1       ID2
     1.14482156E-02    2     1000022         6   # BR(~t_2 -> ~chi_10 t )
     1.08892629E-01    2     1000023         6   # BR(~t_2 -> ~chi_20 t )
     1.14154375E-01    2     1000025         6   # BR(~t_2 -> ~chi_30 t )
     1.90777007E-02    2     1000035         6   # BR(~t_2 -> ~chi_40 t )
     6.29299358E-02    2     1000024         5   # BR(~t_2 -> ~chi_1+ b )
     3.79782896E-02    2     1000037         5   # BR(~t_2 -> ~chi_2+ b )
     6.41514565E-01    2     1000021         6   # BR(~t_2 -> ~g      t )
     9.23812030E-04    2     1000006        25   # BR(~t_2 -> ~t_1    h )
     3.08047723E-03    2     1000006        23   # BR(~t_2 -> ~t_1    Z )
#
#         PDG            Width
DECAY   1000005     2.71463519E+02   # sbottom1 decays
#          BR         NDA      ID1       ID2
     2.83804749E-03    2     1000022         5   # BR(~b_1 -> ~chi_10 b )
     3.01393810E-03    2     1000023         5   # BR(~b_1 -> ~chi_20 b )
     2.97805525E-03    2     1000025         5   # BR(~b_1 -> ~chi_30 b )
     2.80496241E-02    2     1000035         5   # BR(~b_1 -> ~chi_40 b )
     2.37648562E-01    2    -1000024         6   # BR(~b_1 -> ~chi_1- t )
     5.63289363E-02    2    -1000037         6   # BR(~b_1 -> ~chi_2- t )
     6.67161185E-01    2     1000021         5   # BR(~b_1 -> ~g      b )
     1.98165177E-03    2     1000006       -24   # BR(~b_1 -> ~t_1    W-)
#
#         PDG            Width
DECAY   2000005     1.90540737E+02   # sbottom2 decays
#          BR         NDA      ID1       ID2
     1.53891020E-02    2     1000022         5   # BR(~b_2 -> ~chi_10 b )
     4.36717579E-03    2     1000023         5   # BR(~b_2 -> ~chi_20 b )
     4.44601853E-03    2     1000025         5   # BR(~b_2 -> ~chi_30 b )
     1.35857512E-04    2     1000035         5   # BR(~b_2 -> ~chi_40 b )
     9.76476664E-03    2    -1000024         6   # BR(~b_2 -> ~chi_1- t )
     2.72834313E-04    2    -1000037         6   # BR(~b_2 -> ~chi_2- t )
     9.65580679E-01    2     1000021         5   # BR(~b_2 -> ~g      b )
     4.35665213E-05    2     1000006       -24   # BR(~b_2 -> ~t_1    W-)
#
#         PDG            Width
DECAY   1000002     2.10108061E+02   # sup_L decays
#          BR         NDA      ID1       ID2
     3.53953319E-03    2     1000022         2   # BR(~u_L -> ~chi_10 u)
     7.63587674E-05    2     1000023         2   # BR(~u_L -> ~chi_20 u)
     4.62078020E-06    2     1000025         2   # BR(~u_L -> ~chi_30 u)
     3.76633544E-02    2     1000035         2   # BR(~u_L -> ~chi_40 u)
     2.41415435E-04    2     1000024         1   # BR(~u_L -> ~chi_1+ d)
     7.52787351E-02    2     1000037         1   # BR(~u_L -> ~chi_2+ d)
     8.83195982E-01    2     1000021         2   # BR(~u_L -> ~g      u)
#
#         PDG            Width
DECAY   2000002     1.95887573E+02   # sup_R decays
#          BR         NDA      ID1       ID2
     6.03931602E-02    2     1000022         2   # BR(~u_R -> ~chi_10 u)
     1.13910459E-04    2     1000023         2   # BR(~u_R -> ~chi_20 u)
     1.22073859E-04    2     1000025         2   # BR(~u_R -> ~chi_30 u)
     3.71867530E-09    2     1000035         2   # BR(~u_R -> ~chi_40 u)
     9.39370852E-01    2     1000021         2   # BR(~u_R -> ~g      u)
#
#         PDG            Width
DECAY   1000001     2.10124566E+02   # sdown_L decays
#          BR         NDA      ID1       ID2
     3.52371497E-03    2     1000022         1   # BR(~d_L -> ~chi_10 d)
     1.27871621E-05    2     1000023         1   # BR(~d_L -> ~chi_20 d)
     5.61593010E-05    2     1000025         1   # BR(~d_L -> ~chi_30 d)
     3.76833923E-02    2     1000035         1   # BR(~d_L -> ~chi_40 d)
     3.56848908E-06    2    -1000024         2   # BR(~d_L -> ~chi_1- u)
     7.53958400E-02    2    -1000037         2   # BR(~d_L -> ~chi_2- u)
     8.83324538E-01    2     1000021         1   # BR(~d_L -> ~g      d)
#
#         PDG            Width
DECAY   2000001     1.87006257E+02   # sdown_R decays
#          BR         NDA      ID1       ID2
     1.58162729E-02    2     1000022         1   # BR(~d_R -> ~chi_10 d)
     2.98319632E-05    2     1000023         1   # BR(~d_R -> ~chi_20 d)
     3.19698735E-05    2     1000025         1   # BR(~d_R -> ~chi_30 d)
     9.74007730E-10    2     1000035         1   # BR(~d_R -> ~chi_40 d)
     9.84121924E-01    2     1000021         1   # BR(~d_R -> ~g      d)
#
#         PDG            Width
DECAY   1000004     2.10108061E+02   # scharm_L decays
#          BR         NDA      ID1       ID2
     3.53953319E-03    2     1000022         4   # BR(~c_L -> ~chi_10 c)
     7.63587674E-05    2     1000023         4   # BR(~c_L -> ~chi_20 c)
     4.62078020E-06    2     1000025         4   # BR(~c_L -> ~chi_30 c)
     3.76633544E-02    2     1000035         4   # BR(~c_L -> ~chi_40 c)
     2.41415435E-04    2     1000024         3   # BR(~c_L -> ~chi_1+ s)
     7.52787351E-02    2     1000037         3   # BR(~c_L -> ~chi_2+ s)
     8.83195982E-01    2     1000021         4   # BR(~c_L -> ~g      c)
#
#         PDG            Width
DECAY   2000004     1.95887573E+02   # scharm_R decays
#          BR         NDA      ID1       ID2
     6.03931602E-02    2     1000022         4   # BR(~c_R -> ~chi_10 c)
     1.13910459E-04    2     1000023         4   # BR(~c_R -> ~chi_20 c)
     1.22073859E-04    2     1000025         4   # BR(~c_R -> ~chi_30 c)
     3.71867530E-09    2     1000035         4   # BR(~c_R -> ~chi_40 c)
     9.39370852E-01    2     1000021         4   # BR(~c_R -> ~g      c)
#
#         PDG            Width
DECAY   1000003     2.10124566E+02   # sstrange_L decays
#          BR         NDA      ID1       ID2
     3.52371497E-03    2     1000022         3   # BR(~s_L -> ~chi_10 s)
     1.27871621E-05    2     1000023         3   # BR(~s_L -> ~chi_20 s)
     5.61593010E-05    2     1000025         3   # BR(~s_L -> ~chi_30 s)
     3.76833923E-02    2     1000035         3   # BR(~s_L -> ~chi_40 s)
     3.56848908E-06    2    -1000024         4   # BR(~s_L -> ~chi_1- c)
     7.53958400E-02    2    -1000037         4   # BR(~s_L -> ~chi_2- c)
     8.83324538E-01    2     1000021         3   # BR(~s_L -> ~g      s)
#
#         PDG            Width
DECAY   2000003     1.87006257E+02   # sstrange_R decays
#          BR         NDA      ID1       ID2
     1.58162729E-02    2     1000022         3   # BR(~s_R -> ~chi_10 s)
     2.98319632E-05    2     1000023         3   # BR(~s_R -> ~chi_20 s)
     3.19698735E-05    2     1000025         3   # BR(~s_R -> ~chi_30 s)
     9.74007730E-10    2     1000035         3   # BR(~s_R -> ~chi_40 s)
     9.84121924E-01    2     1000021         3   # BR(~s_R -> ~g      s)
#
#         PDG            Width
DECAY   1000011     3.03006623E+01   # selectron_L decays
#          BR         NDA      ID1       ID2
     2.25815444E-01    2     1000022        11   # BR(~e_L -> ~chi_10 e-)
     1.36801504E-03    2     1000023        11   # BR(~e_L -> ~chi_20 e-)
     7.22529155E-05    2     1000025        11   # BR(~e_L -> ~chi_30 e-)
     2.57403112E-01    2     1000035        11   # BR(~e_L -> ~chi_40 e-)
     2.52629489E-05    2    -1000024        12   # BR(~e_L -> ~chi_1- nu_e)
     5.15315914E-01    2    -1000037        12   # BR(~e_L -> ~chi_2- nu_e)
#
#         PDG            Width
DECAY   2000011     2.73835220E+01   # selectron_R decays
#          BR         NDA      ID1       ID2
     9.96118277E-01    2     1000022        11   # BR(~e_R -> ~chi_10 e-)
     1.87370365E-03    2     1000023        11   # BR(~e_R -> ~chi_20 e-)
     2.00796037E-03    2     1000025        11   # BR(~e_R -> ~chi_30 e-)
     5.91593219E-08    2     1000035        11   # BR(~e_R -> ~chi_40 e-)
#
#         PDG            Width
DECAY   1000013     3.03006623E+01   # smuon_L decays
#          BR         NDA      ID1       ID2
     2.25815444E-01    2     1000022        13   # BR(~mu_L -> ~chi_10 mu-)
     1.36801504E-03    2     1000023        13   # BR(~mu_L -> ~chi_20 mu-)
     7.22529155E-05    2     1000025        13   # BR(~mu_L -> ~chi_30 mu-)
     2.57403112E-01    2     1000035        13   # BR(~mu_L -> ~chi_40 mu-)
     2.52629489E-05    2    -1000024        14   # BR(~mu_L -> ~chi_1- nu_mu)
     5.15315914E-01    2    -1000037        14   # BR(~mu_L -> ~chi_2- nu_mu)
#
#         PDG            Width
DECAY   2000013     2.73835220E+01   # smuon_R decays
#          BR         NDA      ID1       ID2
     9.96118277E-01    2     1000022        13   # BR(~mu_R -> ~chi_10 mu-)
     1.87370365E-03    2     1000023        13   # BR(~mu_R -> ~chi_20 mu-)
     2.00796037E-03    2     1000025        13   # BR(~mu_R -> ~chi_30 mu-)
     5.91593219E-08    2     1000035        13   # BR(~mu_R -> ~chi_40 mu-)
#
#         PDG            Width
DECAY   1000015     2.91943866E+01   # stau_1 decays
#          BR         NDA      ID1       ID2
     9.30632346E-01    2     1000022        15   # BR(~tau_1 -> ~chi_10  tau-)
     1.70509867E-02    2     1000023        15   # BR(~tau_1 -> ~chi_20  tau-)
     1.65283624E-02    2     1000025        15   # BR(~tau_1 -> ~chi_30  tau-)
     1.66235493E-03    2     1000035        15   # BR(~tau_1 -> ~chi_40  tau-)
     3.07981424E-02    2    -1000024        16   # BR(~tau_1 -> ~chi_1-  nu_tau)
     3.32780708E-03    2    -1000037        16   # BR(~tau_1 -> ~chi_2-  nu_tau)
#
#         PDG            Width
DECAY   2000015     3.11798358E+01   # stau_2 decays
#          BR         NDA      ID1       ID2
     2.22932672E-01    2     1000022        15   # BR(~tau_2 -> ~chi_10  tau-)
     1.58574729E-02    2     1000023        15   # BR(~tau_2 -> ~chi_20  tau-)
     1.51337337E-02    2     1000025        15   # BR(~tau_2 -> ~chi_30  tau-)
     2.48502755E-01    2     1000035        15   # BR(~tau_2 -> ~chi_40  tau-)
     7.51675934E-05    2    -1000024        16   # BR(~tau_2 -> ~chi_1-  nu_tau)
     4.97498199E-01    2    -1000037        16   # BR(~tau_2 -> ~chi_2-  nu_tau)
#
#         PDG            Width
DECAY   1000012     3.03037551E+01   # snu_eL decays
#          BR         NDA      ID1       ID2
     2.25411670E-01    2     1000022        12   # BR(~nu_eL -> ~chi_10 nu_e)
     1.78161294E-05    2     1000023        12   # BR(~nu_eL -> ~chi_20 nu_e)
     1.16647427E-03    2     1000025        12   # BR(~nu_eL -> ~chi_30 nu_e)
     2.57446815E-01    2     1000035        12   # BR(~nu_eL -> ~chi_40 nu_e)
     1.70860469E-03    2     1000024        11   # BR(~nu_eL -> ~chi_1+ e-)
     5.14248620E-01    2     1000037        11   # BR(~nu_eL -> ~chi_2+ e-)
#
#         PDG            Width
DECAY   1000014     3.03037551E+01   # snu_muL decays
#          BR         NDA      ID1       ID2
     2.25411670E-01    2     1000022        14   # BR(~nu_muL -> ~chi_10 nu_mu)
     1.78161294E-05    2     1000023        14   # BR(~nu_muL -> ~chi_20 nu_mu)
     1.16647427E-03    2     1000025        14   # BR(~nu_muL -> ~chi_30 nu_mu)
     2.57446815E-01    2     1000035        14   # BR(~nu_muL -> ~chi_40 nu_mu)
     1.70860469E-03    2     1000024        13   # BR(~nu_muL -> ~chi_1+ mu-)
     5.14248620E-01    2     1000037        13   # BR(~nu_muL -> ~chi_2+ mu-)
#
#         PDG            Width
DECAY   1000016     3.11975149E+01   # snu_tauL decays
#          BR         NDA      ID1       ID2
     2.18929992E-01    2     1000022        16   # BR(~nu_tauL -> ~chi_10 nu_tau)
     1.73036800E-05    2     1000023        16   # BR(~nu_tauL -> ~chi_20 nu_tau)
     1.13292264E-03    2     1000025        16   # BR(~nu_tauL -> ~chi_30 nu_tau)
     2.49978187E-01    2     1000035        16   # BR(~nu_tauL -> ~chi_40 nu_tau)
     3.06121042E-02    2     1000024        15   # BR(~nu_tauL -> ~chi_1+ tau-)
     4.99329491E-01    2     1000037        15   # BR(~nu_tauL -> ~chi_2+ tau-)
#
#         PDG            Width
DECAY   1000024     4.20391605E-01   # chargino1+ decays
#          BR         NDA      ID1       ID2
     1.00000000E+00    2     1000022        24   # BR(~chi_1+ -> ~chi_10  W+)
#
#         PDG            Width
DECAY   1000037     2.14579905E+01   # chargino2+ decays
#          BR         NDA      ID1       ID2
     2.53432848E-01    2     1000024        23   # BR(~chi_2+ -> ~chi_1+  Z )
     1.77986872E-04    2     1000022        24   # BR(~chi_2+ -> ~chi_10  W+)
     2.44562812E-01    2     1000023        24   # BR(~chi_2+ -> ~chi_20  W+)
     2.44270547E-01    2     1000025        24   # BR(~chi_2+ -> ~chi_30  W+)
     2.57553242E-01    2     1000024        25   # BR(~chi_2+ -> ~chi_1+  h )
     2.56426326E-06    2     1000022        37   # BR(~chi_2+ -> ~chi_10  H+)
#
#         PDG            Width
DECAY   1000022     0.00000000E+00   # neutralino1 decays
#
#         PDG            Width
DECAY   1000023     4.34130361E-01   # neutralino2 decays
#          BR         NDA      ID1       ID2
     5.22419716E-01    2     1000022        23   # BR(~chi_20 -> ~chi_10   Z )
     4.77580284E-01    2     1000022        25   # BR(~chi_20 -> ~chi_10   h )
#
#         PDG            Width
DECAY   1000025     4.32000908E-01   # neutralino3 decays
#          BR         NDA      ID1       ID2
     4.83898876E-01    2     1000022        23   # BR(~chi_30 -> ~chi_10   Z )
     5.16101124E-01    2     1000022        25   # BR(~chi_30 -> ~chi_10   h )
#
#         PDG            Width
DECAY   1000035     2.14730796E+01   # neutralino4 decays
#          BR         NDA      ID1       ID2
     2.28863953E-05    2     1000022        23   # BR(~chi_40 -> ~chi_10   Z )
     9.62861026E-02    2     1000023        23   # BR(~chi_40 -> ~chi_20   Z )
     1.56538318E-01    2     1000025        23   # BR(~chi_40 -> ~chi_30   Z )
     2.45013695E-01    2     1000024       -24   # BR(~chi_40 -> ~chi_1+   W-)
     2.45013695E-01    2    -1000024        24   # BR(~chi_40 -> ~chi_1-   W+)
     1.52156492E-04    2     1000022        25   # BR(~chi_40 -> ~chi_10   h )
     2.45035636E-06    2     1000022        35   # BR(~chi_40 -> ~chi_10   H )
     2.79099787E-07    2     1000022        36   # BR(~chi_40 -> ~chi_10   A )
     1.60398128E-01    2     1000023        25   # BR(~chi_40 -> ~chi_20   h )
     9.65722896E-02    2     1000025        25   # BR(~chi_40 -> ~chi_30   h )
#
#         PDG            Width
DECAY        25     4.06589336E-03   # h decays
#          BR         NDA      ID1       ID2
     6.07790023E-01    2           5        -5   # BR(h -> b       bb     )
     6.38160279E-02    2         -15        15   # BR(h -> tau+    tau-   )
     2.25931769E-04    2         -13        13   # BR(h -> mu+     mu-    )
     4.78932136E-04    2           3        -3   # BR(h -> s       sb     )
     2.07518143E-02    2           4        -4   # BR(h -> c       cb     )
     6.71730746E-02    2          21        21   # BR(h -> g       g      )
     2.31008464E-03    2          22        22   # BR(h -> gam     gam    )
     1.49303735E-03    2          22        23   # BR(h -> Z       gam    )
     2.10752316E-01    2          24       -24   # BR(h -> W+      W-     )
     2.51278446E-02    2          23        23   # BR(h -> Z       Z      )
     8.09139277E-05    2     1000022   1000022   # BR(h -> ~chi_10 ~chi_10)
#
#         PDG            Width
DECAY        35     8.47988109E+00   # H decays
#          BR         NDA      ID1       ID2
     3.78096875E-01    2           5        -5   # BR(H -> b       bb     )
     6.56834771E-02    2         -15        15   # BR(H -> tau+    tau-   )
     2.32261992E-04    2         -13        13   # BR(H -> mu+     mu-    )
     2.84717559E-04    2           3        -3   # BR(H -> s       sb     )
     1.59341952E-06    2           4        -4   # BR(H -> c       cb     )
     1.59195233E-01    2           6        -6   # BR(H -> t       tb     )
     5.29322080E-05    2          21        21   # BR(H -> g       g      )
     1.84891345E-07    2          22        22   # BR(H -> gam     gam    )
     9.39824146E-08    2          23        22   # BR(H -> Z       gam    )
     7.50033334E-05    2          24       -24   # BR(H -> W+      W-     )
     3.74541958E-05    2          23        23   # BR(H -> Z       Z      )
     2.74204174E-04    2          25        25   # BR(H -> h       h      )
     1.05639437E-23    2          36        36   # BR(H -> A       A      )
     9.47983258E-19    2          23        36   # BR(H -> Z       A      )
     2.81409023E-03    2     1000024  -1000024   # BR(H -> ~chi_1+ ~chi_1-)
     3.48071766E-03    2     1000022   1000022   # BR(H -> ~chi_10 ~chi_10)
     1.48460814E-05    2     1000023   1000023   # BR(H -> ~chi_20 ~chi_20)
     1.35565209E-03    2     1000025   1000025   # BR(H -> ~chi_30 ~chi_30)
     2.33780961E-01    2     1000022   1000023   # BR(H -> ~chi_10 ~chi_20)
     1.53099342E-01    2     1000022   1000025   # BR(H -> ~chi_10 ~chi_30)
     1.52036002E-03    2     1000023   1000025   # BR(H -> ~chi_20 ~chi_30)
#
#         PDG            Width
DECAY        36     8.48988831E+00   # A decays
#          BR         NDA      ID1       ID2
     3.77779543E-01    2           5        -5   # BR(A -> b       bb     )
     6.56080134E-02    2         -15        15   # BR(A -> tau+    tau-   )
     2.31994822E-04    2         -13        13   # BR(A -> mu+     mu-    )
     2.84597970E-04    2           3        -3   # BR(A -> s       sb     )
     1.59796663E-06    2           4        -4   # BR(A -> c       cb     )
     1.59561437E-01    2           6        -6   # BR(A -> t       tb     )
     1.57886351E-04    2          21        21   # BR(A -> g       g      )
     5.99938432E-07    2          22        22   # BR(A -> gam     gam    )
     1.91183312E-07    2          23        22   # BR(A -> Z       gam    )
     7.46312922E-05    2          23        25   # BR(A -> Z       h      )
     3.41332846E-03    2     1000024  -1000024   # BR(A -> ~chi_1+ ~chi_1-)
     3.50869224E-03    2     1000022   1000022   # BR(A -> ~chi_10 ~chi_10)
     1.23967863E-05    2     1000023   1000023   # BR(A -> ~chi_20 ~chi_20)
     2.65474161E-03    2     1000025   1000025   # BR(A -> ~chi_30 ~chi_30)
     1.55723970E-01    2     1000022   1000023   # BR(A -> ~chi_10 ~chi_20)
     2.30156903E-01    2     1000022   1000025   # BR(A -> ~chi_10 ~chi_30)
     8.29474964E-04    2     1000023   1000025   # BR(A -> ~chi_20 ~chi_30)
#
#         PDG            Width
DECAY        37     8.44923004E+00   # H+ decays
#          BR         NDA      ID1       ID2
     6.07869601E-04    2           4        -5   # BR(H+ -> c       bb     )
     6.59540453E-02    2         -15        16   # BR(H+ -> tau+    nu_tau )
     2.33218417E-04    2         -13        14   # BR(H+ -> mu+     nu_mu  )
     3.89034519E-06    2           2        -5   # BR(H+ -> u       bb     )
     1.36844724E-05    2           2        -3   # BR(H+ -> u       sb     )
     2.82996413E-04    2           4        -3   # BR(H+ -> c       sb     )
     5.36925574E-01    2           6        -5   # BR(H+ -> t       bb     )
     7.51423188E-05    2          24        25   # BR(H+ -> W+      h      )
     7.77967327E-13    2          24        36   # BR(H+ -> W+      A      )
     3.93981002E-01    2     1000024   1000022   # BR(H+ -> ~chi_1+ ~chi_10)
     1.86815067E-03    2     1000024   1000023   # BR(H+ -> ~chi_1+ ~chi_20)
     5.44270071E-05    2     1000024   1000025   # BR(H+ -> ~chi_1+ ~chi_30)
