#
#                              ======================
#                              | THE SUSYHIT OUTPUT |
#                              ======================
#
#
#              ------------------------------------------------------
#              |     This is the output of the SUSY-HIT package     |
#              |  created by A.Djouadi, M.Muehlleitner and M.Spira. |
#              |  In case of problems with SUSY-HIT email to        |
#              |           margarete.muehlleitner@cern.ch           |
#              |           michael.spira@psi.ch                     |
#              |           abdelhak.djouadi@cern.ch                 |
#              ------------------------------------------------------
#
#              ------------------------------------------------------
#              |  SUSY Les Houches Accord - MSSM Spectrum + Decays  |
#              |              based on the decay programs           |
#              |                                                    |
#              |                     SDECAY 1.3b                    |
#              |                                                    |
#              |  Authors: M.Muhlleitner, A.Djouadi and Y.Mambrini  |
#              |  Ref.:    Comput.Phys.Commun.168(2005)46           |
#              |           [hep-ph/0311167]                         |
#              |                                                    |
#              |                     HDECAY 3.4                     |
#              |                                                    |
#              |  By: A.Djouadi,J.Kalinowski,M.Muhlleitner,M.Spira  |
#              |  Ref.:    Comput.Phys.Commun.108(1998)56           |
#              |           [hep-ph/9704448]                         |
#              |                                                    |
#              |                                                    |
#              |  If not stated otherwise all DRbar couplings and   |
#              |  soft SUSY breaking masses are given at the scale  |
#              |  Q=  0.91187600E+02
#              |                                                    |
#              ------------------------------------------------------
#
#
BLOCK DCINFO  # Decay Program information
     1   SDECAY/HDECAY # decay calculator
     2   1.3b  /3.4    # version number
#
BLOCK SPINFO  # Spectrum calculator information
     1   SuSpect     # RGE +Spectrum calculator            
     2   2.41         # version number                     
#
BLOCK MODSEL  # Model selection
     1     0   # #general MSSM low scale                           
#
BLOCK SMINPUTS  # Standard Model inputs
         1     1.27934000E+02   # alpha_em^-1(M_Z)^MSbar
         2     1.16639000E-05   # G_F [GeV^-2]
         3     1.17200000E-01   # alpha_S(M_Z)^MSbar
         4     9.11870000E+01   # M_Z pole mass
         5     4.25000000E+00   # mb(mb)^MSbar
         6     1.72500000E+02   # mt pole mass
         7     1.77700000E+00   # mtau pole mass
#
BLOCK MINPAR  # Input parameters - minimal models
#
BLOCK EXTPAR  # Input parameters - non-minimal models
         0     9.11876000E+01   # EWSB                
         1     1.00000000E+01   # M_1                 
         2     1.00000000E+05   # M_2                 
         3     1.00000000E+05   # M_3                 
        11     0.00000000E+00   # A_t                 
        12     0.00000000E+00   # A_b                 
        13     0.00000000E+00   # A_tau               
        14     0.00000000E+00   # A_u                 
        15     0.00000000E+00   # A_d                 
        16     0.00000000E+00   # A_e                 
        23     3.50000000E+03   # mu(EWSB)            
        25     1.50000000E+00   # tanbeta(in)         
        26     2.00000000E+03   # MA_pole             
        31     1.00000000E+05   # M_eL                
        32     1.00000000E+05   # M_muL               
        33     1.00000000E+05   # M_tauL              
        34     1.00000000E+05   # M_eR                
        35     1.00000000E+05   # M_muR               
        36     1.00000000E+05   # M_tauR              
        41     1.00000000E+03   # M_q1L               
        42     1.00000000E+03   # M_q2L               
        43     1.00000000E+03   # M_q3L               
        44     1.00000000E+05   # M_uR                
        45     1.00000000E+05   # M_cR                
        46     1.00000000E+05   # M_tR                
        47     1.00000000E+03   # M_dR                
        48     1.00000000E+03   # M_sR                
        49     1.00000000E+03   # M_bR                
#
BLOCK MASS  # Mass Spectrum
# PDG code           mass       particle
        24     8.05806929E+01   # W+
        25     1.25000000E+02   # h
        35     2.00387000E+03   # H
        36     2.00000000E+03   # A
        37     2.02368042E+03   # H+
         5     4.87877839E+00   # b-quark pole mass calculated from mb(mb)_Msbar
   1000001     1.00066598E+03   # ~d_L
   2000001     1.00012796E+03   # ~d_R
   1000002     9.99461623E+02   # ~u_L
   2000002     9.99999974E+04   # ~u_R
   1000003     1.00066598E+03   # ~s_L
   2000003     1.00012796E+03   # ~s_R
   1000004     9.99461623E+02   # ~c_L
   2000004     9.99999974E+04   # ~c_R
   1000005     9.93601580E+02   # ~b_1
   2000005     1.00715318E+03   # ~b_2
   1000006     1.01027379E+03   # ~t_1
   2000006     1.00000106E+05   # ~t_2
   1000011     1.00000004E+05   # ~e_L
   2000011     1.00000004E+05   # ~e_R
   1000012     9.99999921E+04   # ~nu_eL
   1000013     1.00000004E+05   # ~mu_L
   2000013     1.00000004E+05   # ~mu_R
   1000014     9.99999921E+04   # ~nu_muL
   1000015     9.99999574E+04   # ~tau_1
   2000015     1.00000051E+05   # ~tau_2
   1000016     9.99999921E+04   # ~nu_tauL
   1000021     1.00000000E+05   # ~g
   1000022     9.47196155E+00   # ~chi_10
   1000023    -3.50002420E+03   # ~chi_20
   1000025     3.50048751E+03   # ~chi_30
   1000035     1.00000065E+05   # ~chi_40
   1000024     3.49993992E+03   # ~chi_1+
   1000037     1.00000065E+05   # ~chi_2+
   1000039     1.00000000E-09   # ~gravitino
#
BLOCK NMIX  # Neutralino Mixing Matrix
  1  1     9.99918119E-01   # N_11
  1  2    -9.35312176E-06   # N_12
  1  3     1.06401121E-02   # N_13
  1  4    -7.10937564E-03   # N_14
  2  1     2.49658409E-03   # N_21
  2  2    -1.49968940E-04   # N_22
  2  3    -7.07092345E-01   # N_23
  2  4    -7.07116794E-01   # N_24
  3  1     1.25507891E-02   # N_31
  3  2     8.04113707E-04   # N_32
  3  3    -7.07041010E-01   # N_33
  3  4     7.07060705E-01   # N_34
  4  1     3.65496832E-07   # N_41
  4  2    -9.99999665E-01   # N_42
  4  3    -4.62599151E-04   # N_43
  4  4     6.74669480E-04   # N_44
#
BLOCK UMIX  # Chargino Mixing Matrix U
  1  1    -6.54213787E-04   # U_11
  1  2     9.99999786E-01   # U_12
  2  1     9.99999786E-01   # U_21
  2  2     6.54213787E-04   # U_22
#
BLOCK VMIX  # Chargino Mixing Matrix V
  1  1    -9.54126644E-04   # V_11
  1  2     9.99999545E-01   # V_12
  2  1     9.99999545E-01   # V_21
  2  2     9.54126644E-04   # V_22
#
BLOCK STOPMIX  # Stop Mixing Matrix
  1  1     9.99999999E-01   # cos(theta_t)
  1  2     4.47213589E-05   # sin(theta_t)
  2  1    -4.47213589E-05   # -sin(theta_t)
  2  2     9.99999999E-01   # cos(theta_t)
#
BLOCK SBOTMIX  # Sbottom Mixing Matrix
  1  1     6.92927751E-01   # cos(theta_b)
  1  2     7.21007026E-01   # sin(theta_b)
  2  1    -7.21007026E-01   # -sin(theta_b)
  2  2     6.92927751E-01   # cos(theta_b)
#
BLOCK STAUMIX  # Stau Mixing Matrix
  1  1     7.06104461E-01   # cos(theta_tau)
  1  2     7.08107683E-01   # sin(theta_tau)
  2  1    -7.08107683E-01   # -sin(theta_tau)
  2  2     7.06104461E-01   # cos(theta_tau)
#
BLOCK ALPHA  # Higgs mixing
          -5.90225547E-01   # Mixing angle in the neutral Higgs boson sector
#
BLOCK HMIX Q=  9.11876000E+01  # DRbar Higgs Parameters
         1     3.50000000E+03   # mu(Q)               
         2     1.49999982E+00   # tanbeta(Q)          
         3     2.54849387E+02   # vev(Q)              
         4    -6.84480122E+07   # MA^2(Q)             
#
BLOCK GAUGE Q=  9.11876000E+01  # The gauge couplings
     1     3.50633473E-01   # gprime(Q) DRbar
     2     6.21067548E-01   # g(Q) DRbar
     3     1.02926404E+00   # g3(Q) DRbar
#
BLOCK AU Q=  9.11876000E+01  # The trilinear couplings
  1  1     0.00000000E+00   # A_u(Q) DRbar
  2  2     0.00000000E+00   # A_c(Q) DRbar
  3  3     0.00000000E+00   # A_t(Q) DRbar
#
BLOCK AD Q=  9.11876000E+01  # The trilinear couplings
  1  1     0.00000000E+00   # A_d(Q) DRbar
  2  2     0.00000000E+00   # A_s(Q) DRbar
  3  3     0.00000000E+00   # A_b(Q) DRbar
#
BLOCK AE Q=  9.11876000E+01  # The trilinear couplings
  1  1     0.00000000E+00   # A_e(Q) DRbar
  2  2     0.00000000E+00   # A_mu(Q) DRbar
  3  3     0.00000000E+00   # A_tau(Q) DRbar
#
BLOCK Yu Q=  9.11876000E+01  # The Yukawa couplings
  1  1     0.00000000E+00   # y_u(Q) DRbar
  2  2     0.00000000E+00   # y_c(Q) DRbar
  3  3     9.83390398E-01   # y_t(Q) DRbar
#
BLOCK Yd Q=  9.11876000E+01  # The Yukawa couplings
  1  1     0.00000000E+00   # y_d(Q) DRbar
  2  2     0.00000000E+00   # y_s(Q) DRbar
  3  3     2.58122518E-02   # y_b(Q) DRbar
#
BLOCK Ye Q=  9.11876000E+01  # The Yukawa couplings
  1  1     0.00000000E+00   # y_e(Q) DRbar
  2  2     0.00000000E+00   # y_mu(Q) DRbar
  3  3     1.77402407E-02   # y_tau(Q) DRbar
#
BLOCK MSOFT Q=  9.11876000E+01  # The soft SUSY breaking masses at the scale Q
         1     1.00000000E+01   # M_1                 
         2     1.00000000E+05   # M_2                 
         3     1.00000000E+05   # M_3                 
        14     0.00000000E+00   # A_u                 
        15     0.00000000E+00   # A_d                 
        16     0.00000000E+00   # A_e                 
        21     6.34930190E+08   # M^2_Hd              
        22    -1.14418266E+09   # M^2_Hu              
        31     1.00000000E+05   # M_eL                
        32     1.00000000E+05   # M_muL               
        33     1.00000000E+05   # M_tauL              
        34     1.00000000E+05   # M_eR                
        35     1.00000000E+05   # M_muR               
        36     1.00000000E+05   # M_tauR              
        41     1.00000000E+03   # M_q1L               
        42     1.00000000E+03   # M_q2L               
        43     1.00000000E+03   # M_q3L               
        44     1.00000000E+05   # M_uR                
        45     1.00000000E+05   # M_cR                
        46     1.00000000E+05   # M_tR                
        47     1.00000000E+03   # M_dR                
        48     1.00000000E+03   # M_sR                
        49     1.00000000E+03   # M_bR                
#
#
#
#                             =================
#                             |The decay table|
#                             =================
#
# - The QCD corrections to the decays gluino -> squark  + quark
#                                     squark -> gaugino + quark_prime
#                                     squark -> squark_prime + Higgs
#                                     squark -> gluino  + quark
#   are included.
#
# - The multi-body decays for the inos, stops and sbottoms are included.
#
# - The loop induced decays for the gluino, neutralinos and stops
#   are included.
#
# - The SUSY decays of the top quark are included.
#
# - Possible decays of the NLSP in GMSB models are included.
#
#
#         PDG            Width
DECAY         6     1.33141201E+00   # top decays
#          BR         NDA      ID1       ID2
     1.00000000E+00    2           5        24   # BR(t ->  b    W+)
#
#         PDG            Width
DECAY   1000021     1.E-04   # gluino decays (OJ Mods)
#          BR         NDA      ID1       ID2
     7.69806342E-04    2     1000001        -1   # BR(~g -> ~d_L  db)
     7.69806342E-04    2    -1000001         1   # BR(~g -> ~d_L* d )
     7.69806508E-04    2     2000001        -1   # BR(~g -> ~d_R  db)
     7.69806508E-04    2    -2000001         1   # BR(~g -> ~d_R* d )
     7.69806713E-04    2     1000002        -2   # BR(~g -> ~u_L  ub)
     7.69806713E-04    2    -1000002         2   # BR(~g -> ~u_L* u )
     2.08197323E-18    2     2000002        -2   # BR(~g -> ~u_R  ub)
     2.08197323E-18    2    -2000002         2   # BR(~g -> ~u_R* u )
     7.69806342E-04    2     1000003        -3   # BR(~g -> ~s_L  sb)
     7.69806342E-04    2    -1000003         3   # BR(~g -> ~s_L* s )
     7.69806508E-04    2     2000003        -3   # BR(~g -> ~s_R  sb)
     7.69806508E-04    2    -2000003         3   # BR(~g -> ~s_R* s )
     7.69806713E-04    2     1000004        -4   # BR(~g -> ~c_L  cb)
     7.69806713E-04    2    -1000004         4   # BR(~g -> ~c_L* c )
     2.08197323E-18    2     2000004        -4   # BR(~g -> ~c_R  cb)
     2.08197323E-18    2    -2000004         4   # BR(~g -> ~c_R* c )
     2.42643243E-01    2     1000005        -5   # BR(~g -> ~b_1  bb)
     2.42643243E-01    2    -1000005         5   # BR(~g -> ~b_1* b )
     2.41232111E-01    2     2000005        -5   # BR(~g -> ~b_2  bb)
     2.41232111E-01    2    -2000005         5   # BR(~g -> ~b_2* b )
     7.57504693E-04    2     1000006        -6   # BR(~g -> ~t_1  tb)
     7.57504693E-04    2    -1000006         6   # BR(~g -> ~t_1* t )
     2.14966036E-02    2     1000039        21   # BR(~g -> ~G g)
#
#         PDG            Width
DECAY   1000006     1.59317848E-01   # stop1 decays
#          BR         NDA      ID1       ID2
     1.00000000E+00    2     1000022         6   # BR(~t_1 -> ~chi_10 t )
#
#         PDG            Width
DECAY   2000006     2.19566160E+05   # stop2 decays
#          BR         NDA      ID1       ID2
     9.49332726E-04    2     1000022         6   # BR(~t_2 -> ~chi_10 t )
     2.25612761E-03    2     1000023         6   # BR(~t_2 -> ~chi_20 t )
     2.25587969E-03    2     1000025         6   # BR(~t_2 -> ~chi_30 t )
     9.94619325E-01    2     1000024         5   # BR(~t_2 -> ~chi_1+ b )
    -6.25104430E-05    2     1000006        25   # BR(~t_2 -> ~t_1    h )
     6.54090839E-05    2     1000006        35   # BR(~t_2 -> ~t_1    H )
     6.52981211E-05    2     1000006        36   # BR(~t_2 -> ~t_1    A )
     6.14915306E-05    2     1000005        37   # BR(~t_2 -> ~b_1    H+)
     6.91072539E-05    2     2000005        37   # BR(~t_2 -> ~b_2    H+)
    -4.49580474E-05    2     1000006        23   # BR(~t_2 -> ~t_1    Z )
    -1.12598323E-04    2     1000005        24   # BR(~t_2 -> ~b_1    W+)
    -1.21904042E-04    2     2000005        24   # BR(~t_2 -> ~b_2    W+)
#
#         PDG            Width
DECAY   1000005     4.50881017E+01   # sbottom1 decays
#          BR         NDA      ID1       ID2
     1.00000000E+00    2     1000022         5   # BR(~b_1 -> ~chi_10 b )
#
#         PDG            Width
DECAY   2000005     4.28194158E+01   # sbottom2 decays
#          BR         NDA      ID1       ID2
     1.00000000E+00    2     1000022         5   # BR(~b_2 -> ~chi_10 b )
#
#         PDG            Width
DECAY   1000002     1.65480047E-01   # sup_L decays
#          BR         NDA      ID1       ID2
     1.00000000E+00    2     1000022         2   # BR(~u_L -> ~chi_10 u)
#
#         PDG            Width
DECAY   2000002     2.08351502E+02   # sup_R decays
#          BR         NDA      ID1       ID2
     9.99836414E-01    2     1000022         2   # BR(~u_R -> ~chi_10 u)
     6.22651014E-06    2     1000023         2   # BR(~u_R -> ~chi_20 u)
     1.57359943E-04    2     1000025         2   # BR(~u_R -> ~chi_30 u)
#
#         PDG            Width
DECAY   1000001     1.65703667E-01   # sdown_L decays
#          BR         NDA      ID1       ID2
     1.00000000E+00    2     1000022         1   # BR(~d_L -> ~chi_10 d)
#
#         PDG            Width
DECAY   2000001     6.62408030E-01   # sdown_R decays
#          BR         NDA      ID1       ID2
     1.00000000E+00    2     1000022         1   # BR(~d_R -> ~chi_10 d)
#
#         PDG            Width
DECAY   1000004     1.65480047E-01   # scharm_L decays
#          BR         NDA      ID1       ID2
     1.00000000E+00    2     1000022         4   # BR(~c_L -> ~chi_10 c)
#
#         PDG            Width
DECAY   2000004     2.08351502E+02   # scharm_R decays
#          BR         NDA      ID1       ID2
     9.99836414E-01    2     1000022         4   # BR(~c_R -> ~chi_10 c)
     6.22651014E-06    2     1000023         4   # BR(~c_R -> ~chi_20 c)
     1.57359943E-04    2     1000025         4   # BR(~c_R -> ~chi_30 c)
#
#         PDG            Width
DECAY   1000003     1.65703667E-01   # sstrange_L decays
#          BR         NDA      ID1       ID2
     1.00000000E+00    2     1000022         3   # BR(~s_L -> ~chi_10 s)
#
#         PDG            Width
DECAY   2000003     6.62408030E-01   # sstrange_R decays
#          BR         NDA      ID1       ID2
     1.00000000E+00    2     1000022         3   # BR(~s_R -> ~chi_10 s)
#
#         PDG            Width
DECAY   1000011     1.22295177E+02   # selectron_L decays
#          BR         NDA      ID1       ID2
     9.99797532E-01    2     1000022        11   # BR(~e_L -> ~chi_10 e-)
     4.96491548E-06    2     1000023        11   # BR(~e_L -> ~chi_20 e-)
     1.94823832E-04    2     1000025        11   # BR(~e_L -> ~chi_30 e-)
     2.67900333E-06    2    -1000024        12   # BR(~e_L -> ~chi_1- nu_e)
#
#         PDG            Width
DECAY   2000011     4.89177781E+02   # selectron_R decays
#          BR         NDA      ID1       ID2
     9.99836646E-01    2     1000022        11   # BR(~e_R -> ~chi_10 e-)
     6.21767318E-06    2     1000023        11   # BR(~e_R -> ~chi_20 e-)
     1.57136572E-04    2     1000025        11   # BR(~e_R -> ~chi_30 e-)
#
#         PDG            Width
DECAY   1000013     1.22295177E+02   # smuon_L decays
#          BR         NDA      ID1       ID2
     9.99797532E-01    2     1000022        13   # BR(~mu_L -> ~chi_10 mu-)
     4.96491548E-06    2     1000023        13   # BR(~mu_L -> ~chi_20 mu-)
     1.94823832E-04    2     1000025        13   # BR(~mu_L -> ~chi_30 mu-)
     2.67900333E-06    2    -1000024        14   # BR(~mu_L -> ~chi_1- nu_mu)
#
#         PDG            Width
DECAY   2000013     4.89177781E+02   # smuon_R decays
#          BR         NDA      ID1       ID2
     9.99836646E-01    2     1000022        13   # BR(~mu_R -> ~chi_10 mu-)
     6.21767318E-06    2     1000023        13   # BR(~mu_R -> ~chi_20 mu-)
     1.57136572E-04    2     1000025        13   # BR(~mu_R -> ~chi_30 mu-)
#
#         PDG            Width
DECAY   1000015     1.18201353E+04   # stau_1 decays
#          BR         NDA      ID1       ID2
     2.59131364E-02    2     1000022        15   # BR(~tau_1 -> ~chi_10  tau-)
     2.51311697E-05    2     1000023        15   # BR(~tau_1 -> ~chi_20  tau-)
     2.48712246E-05    2     1000025        15   # BR(~tau_1 -> ~chi_30  tau-)
     2.77188050E-05    2    -1000024        16   # BR(~tau_1 -> ~chi_1-  nu_tau)
     9.74009142E-01    2     1000039        15   # BR(~tau_1 -> ~G       tau-)
#
#         PDG            Width
DECAY   2000015     3.06131228E+02   # stau_2 decays
#          BR         NDA      ID1       ID2
     9.96538813E-01    2     1000022        15   # BR(~tau_2 -> ~chi_10  tau-)
     1.08170678E-03    2     1000023        15   # BR(~tau_2 -> ~chi_20  tau-)
     1.40845150E-03    2     1000025        15   # BR(~tau_2 -> ~chi_30  tau-)
     9.71028815E-04    2    -1000024        16   # BR(~tau_2 -> ~chi_1-  nu_tau)
#
#         PDG            Width
DECAY   1000012     1.22295236E+02   # snu_eL decays
#          BR         NDA      ID1       ID2
     9.99863196E-01    2     1000022        12   # BR(~nu_eL -> ~chi_10 nu_e)
     7.61113046E-06    2     1000023        12   # BR(~nu_eL -> ~chi_20 nu_e)
     1.23494687E-04    2     1000025        12   # BR(~nu_eL -> ~chi_30 nu_e)
     5.69830455E-06    2     1000024        11   # BR(~nu_eL -> ~chi_1+ e-)
#
#         PDG            Width
DECAY   1000014     1.22295236E+02   # snu_muL decays
#          BR         NDA      ID1       ID2
     9.99863196E-01    2     1000022        14   # BR(~nu_muL -> ~chi_10 nu_mu)
     7.61113046E-06    2     1000023        14   # BR(~nu_muL -> ~chi_20 nu_mu)
     1.23494687E-04    2     1000025        14   # BR(~nu_muL -> ~chi_30 nu_mu)
     5.69830455E-06    2     1000024        13   # BR(~nu_muL -> ~chi_1+ mu-)
#
#         PDG            Width
DECAY   1000016     1.22919810E+02   # snu_tauL decays
#          BR         NDA      ID1       ID2
     9.94782737E-01    2     1000022        16   # BR(~nu_tauL -> ~chi_10 nu_tau)
     7.57245713E-06    2     1000023        16   # BR(~nu_tauL -> ~chi_20 nu_tau)
     1.22867191E-04    2     1000025        16   # BR(~nu_tauL -> ~chi_30 nu_tau)
     5.08682368E-03    2     1000024        15   # BR(~nu_tauL -> ~chi_1+ tau-)
#
#         PDG            Width
DECAY   1000024     8.00448867E+01   # chargino1+ decays
#          BR         NDA      ID1       ID2
     4.51683295E-07    2     1000002        -1   # BR(~chi_1+ -> ~u_L     db)
     2.12269135E-07    2    -1000001         2   # BR(~chi_1+ -> ~d_L*    u )
     4.51683295E-07    2     1000004        -3   # BR(~chi_1+ -> ~c_L     sb)
     2.12269135E-07    2    -1000003         4   # BR(~chi_1+ -> ~s_L*    c )
     9.70495379E-02    2     1000006        -5   # BR(~chi_1+ -> ~t_1     bb)
     6.36038012E-02    2    -1000005         6   # BR(~chi_1+ -> ~b_1*    t )
     8.01671317E-01    2    -2000005         6   # BR(~chi_1+ -> ~b_2*    t )
     2.59128106E-02    2     1000022        24   # BR(~chi_1+ -> ~chi_10  W+)
     1.17566942E-02    2     1000022        37   # BR(~chi_1+ -> ~chi_10  H+)
     3.76908241E-06    2     1000039        24   # BR(~chi_1+ -> ~G       W+)
     7.41625991E-07    2     1000039        37   # BR(~chi_1+ -> ~G       H+)
#
#         PDG            Width
DECAY   1000037     1.38871432E+05   # chargino2+ decays
#          BR         NDA      ID1       ID2
     7.33590407E-03    2     1000002        -1   # BR(~chi_2+ -> ~u_L     db)
     7.33590724E-03    2    -1000001         2   # BR(~chi_2+ -> ~d_L*    u )
     7.33590407E-03    2     1000004        -3   # BR(~chi_2+ -> ~c_L     sb)
     7.33590724E-03    2    -1000003         4   # BR(~chi_2+ -> ~s_L*    c )
     8.75420432E-01    2     1000006        -5   # BR(~chi_2+ -> ~t_1     bb)
     1.56709852E-03    2    -1000005         6   # BR(~chi_2+ -> ~b_1*    t )
     7.01592434E-03    2    -2000005         6   # BR(~chi_2+ -> ~b_2*    t )
     5.42361848E-15    2     1000012       -11   # BR(~chi_2+ -> ~nu_eL   e+  )
     5.42361848E-15    2     1000014       -13   # BR(~chi_2+ -> ~nu_muL  mu+ )
     3.79746698E-15    2    -1000011        12   # BR(~chi_2+ -> ~e_L+    nu_e)
     3.79746698E-15    2    -1000013        14   # BR(~chi_2+ -> ~mu_L+   nu_mu)
     5.89088181E-15    2    -1000015        16   # BR(~chi_2+ -> ~tau_1+  nu_tau)
     1.00301034E-16    2    -2000015        16   # BR(~chi_2+ -> ~tau_2+  nu_tau)
     1.34890349E-03    2     1000024        23   # BR(~chi_2+ -> ~chi_1+  Z )
     1.58730878E-07    2     1000022        24   # BR(~chi_2+ -> ~chi_10  W+)
     1.30987542E-03    2     1000023        24   # BR(~chi_2+ -> ~chi_20  W+)
     1.30970293E-03    2     1000025        24   # BR(~chi_2+ -> ~chi_30  W+)
     1.35815969E-03    2     1000024        25   # BR(~chi_2+ -> ~chi_1+  h )
     1.19221767E-03    2     1000024        35   # BR(~chi_2+ -> ~chi_1+  H )
     1.19237041E-03    2     1000024        36   # BR(~chi_2+ -> ~chi_1+  A )
     2.25600487E-07    2     1000022        37   # BR(~chi_2+ -> ~chi_10  H+)
     1.19232329E-03    2     1000023        37   # BR(~chi_2+ -> ~chi_20  H+)
     1.19214802E-03    2     1000025        37   # BR(~chi_2+ -> ~chi_30  H+)
     7.65568155E-02    2     1000039        24   # BR(~chi_2+ -> ~G       W+)
     2.20281797E-08    2     1000039        37   # BR(~chi_2+ -> ~G       H+)
#
#         PDG            Width
DECAY   1000022     1.E-08   # neutralino1 decays (OJ Mods)
#          BR         NDA      ID1       ID2
     1.00000000E+00    2     1000039        22   # BR(~chi_10 -> ~G        gam)
#
#         PDG            Width
DECAY   1000023     1.E-08   # neutralino2 decays (OJ Mods)
#          BR         NDA      ID1       ID2
     2.36891978E-02    2     1000022        23   # BR(~chi_20 -> ~chi_10   Z )
     9.20948476E-04    2     1000022        25   # BR(~chi_20 -> ~chi_10   h )
     1.06412859E-02    2     1000022        35   # BR(~chi_20 -> ~chi_10   H )
     4.33584110E-04    2     1000022        36   # BR(~chi_20 -> ~chi_10   A )
     2.68028395E-08    2     1000002        -2   # BR(~chi_20 -> ~u_L      ub)
     2.68028395E-08    2    -1000002         2   # BR(~chi_20 -> ~u_L*     u )
     1.00599447E-07    2     1000001        -1   # BR(~chi_20 -> ~d_L      db)
     1.00599447E-07    2    -1000001         1   # BR(~chi_20 -> ~d_L*     d )
     2.31264492E-07    2     2000001        -1   # BR(~chi_20 -> ~d_R      db)
     2.31264492E-07    2    -2000001         1   # BR(~chi_20 -> ~d_R*     d )
     2.68028395E-08    2     1000004        -4   # BR(~chi_20 -> ~c_L      cb)
     2.68028395E-08    2    -1000004         4   # BR(~chi_20 -> ~c_L*     c )
     1.00599447E-07    2     1000003        -3   # BR(~chi_20 -> ~s_L      sb)
     1.00599447E-07    2    -1000003         3   # BR(~chi_20 -> ~s_L*     s )
     2.31264492E-07    2     2000003        -3   # BR(~chi_20 -> ~s_R      sb)
     2.31264492E-07    2    -2000003         3   # BR(~chi_20 -> ~s_R*     s )
     3.98615925E-01    2     1000006        -6   # BR(~chi_20 -> ~t_1      tb)
     3.98615925E-01    2    -1000006         6   # BR(~chi_20 -> ~t_1*     t )
     4.00265134E-02    2     1000005        -5   # BR(~chi_20 -> ~b_1      bb)
     4.00265134E-02    2    -1000005         5   # BR(~chi_20 -> ~b_1*     b )
     4.35123327E-02    2     2000005        -5   # BR(~chi_20 -> ~b_2      bb)
     4.35123327E-02    2    -2000005         5   # BR(~chi_20 -> ~b_2*     b )
     3.07528774E-11    2     1000039        22   # BR(~chi_20 -> ~G        gam)
     1.33736317E-07    2     1000039        23   # BR(~chi_20 -> ~G        Z)
     3.33750690E-06    2     1000039        25   # BR(~chi_20 -> ~G        h)
     2.67635359E-08    2     1000039        35   # BR(~chi_20 -> ~G        H)
     6.89497244E-07    2     1000039        36   # BR(~chi_20 -> ~G        A)
#
#         PDG            Width
DECAY   1000025     8.68613459E+01   # neutralino3 decays
#          BR         NDA      ID1       ID2
     9.36186344E-04    2     1000022        23   # BR(~chi_30 -> ~chi_10   Z )
     2.37698647E-02    2     1000022        25   # BR(~chi_30 -> ~chi_10   h )
     4.21853258E-04    2     1000022        35   # BR(~chi_30 -> ~chi_10   H )
     1.06569940E-02    2     1000022        36   # BR(~chi_30 -> ~chi_10   A )
     2.62275362E-06    2     1000002        -2   # BR(~chi_30 -> ~u_L      ub)
     2.62275362E-06    2    -1000002         2   # BR(~chi_30 -> ~u_L*     u )
     6.34725754E-07    2     1000001        -1   # BR(~chi_30 -> ~d_L      db)
     6.34725754E-07    2    -1000001         1   # BR(~chi_30 -> ~d_L*     d )
     5.83746918E-06    2     2000001        -1   # BR(~chi_30 -> ~d_R      db)
     5.83746918E-06    2    -2000001         1   # BR(~chi_30 -> ~d_R*     d )
     2.62275362E-06    2     1000004        -4   # BR(~chi_30 -> ~c_L      cb)
     2.62275362E-06    2    -1000004         4   # BR(~chi_30 -> ~c_L*     c )
     6.34725754E-07    2     1000003        -3   # BR(~chi_30 -> ~s_L      sb)
     6.34725754E-07    2    -1000003         3   # BR(~chi_30 -> ~s_L*     s )
     5.83746918E-06    2     2000003        -3   # BR(~chi_30 -> ~s_R      sb)
     5.83746918E-06    2    -2000003         3   # BR(~chi_30 -> ~s_R*     s )
     3.98130840E-01    2     1000006        -6   # BR(~chi_30 -> ~t_1      tb)
     3.98130840E-01    2    -1000006         6   # BR(~chi_30 -> ~t_1*     t )
     3.55451997E-02    2     1000005        -5   # BR(~chi_30 -> ~b_1      bb)
     3.55451997E-02    2    -1000005         5   # BR(~chi_30 -> ~b_1*     b )
     4.84135240E-02    2     2000005        -5   # BR(~chi_30 -> ~b_2      bb)
     4.84135240E-02    2    -2000005         5   # BR(~chi_30 -> ~b_2*     b )
     8.93404821E-10    2     1000039        22   # BR(~chi_30 -> ~G        gam)
     3.33978793E-06    2     1000039        23   # BR(~chi_30 -> ~G        Z)
     1.30335562E-07    2     1000039        25   # BR(~chi_30 -> ~G        h)
     6.84686509E-07    2     1000039        35   # BR(~chi_30 -> ~G        H)
     2.75660118E-08    2     1000039        36   # BR(~chi_30 -> ~G        A)
#
#         PDG            Width
DECAY   1000035     1.38872003E+05   # neutralino4 decays
#          BR         NDA      ID1       ID2
     3.19307466E-11    2     1000022        23   # BR(~chi_40 -> ~chi_10   Z )
     1.30357162E-03    2     1000023        23   # BR(~chi_40 -> ~chi_20   Z )
     4.53277764E-05    2     1000025        23   # BR(~chi_40 -> ~chi_30   Z )
     1.30986239E-03    2     1000024       -24   # BR(~chi_40 -> ~chi_1+   W-)
     1.30986239E-03    2    -1000024        24   # BR(~chi_40 -> ~chi_1-   W+)
     1.64846980E-07    2     1000022        25   # BR(~chi_40 -> ~chi_10   h )
     3.03393930E-08    2     1000022        35   # BR(~chi_40 -> ~chi_10   H )
     1.94949105E-07    2     1000022        36   # BR(~chi_40 -> ~chi_10   A )
     4.46321825E-05    2     1000023        25   # BR(~chi_40 -> ~chi_20   h )
     1.14090172E-03    2     1000023        35   # BR(~chi_40 -> ~chi_20   H )
     5.24456424E-05    2     1000023        36   # BR(~chi_40 -> ~chi_20   A )
     1.31335888E-03    2     1000025        25   # BR(~chi_40 -> ~chi_30   h )
     5.12796051E-05    2     1000025        35   # BR(~chi_40 -> ~chi_30   H )
     1.13972526E-03    2     1000025        36   # BR(~chi_40 -> ~chi_30   A )
     1.19234468E-03    2     1000024       -37   # BR(~chi_40 -> ~chi_1+   H-)
     1.19234468E-03    2    -1000024        37   # BR(~chi_40 -> ~chi_1-   H+)
     3.50958727E-03    2     1000002        -2   # BR(~chi_40 -> ~u_L      ub)
     3.50958727E-03    2    -1000002         2   # BR(~chi_40 -> ~u_L*     u )
     5.60552905E-23    2     2000002        -2   # BR(~chi_40 -> ~u_R      ub)
     5.60552905E-23    2    -2000002         2   # BR(~chi_40 -> ~u_R*     u )
     3.50958970E-03    2     1000001        -1   # BR(~chi_40 -> ~d_L      db)
     3.50958970E-03    2    -1000001         1   # BR(~chi_40 -> ~d_L*     d )
     6.64156283E-17    2     2000001        -1   # BR(~chi_40 -> ~d_R      db)
     6.64156283E-17    2    -2000001         1   # BR(~chi_40 -> ~d_R*     d )
     3.50958727E-03    2     1000004        -4   # BR(~chi_40 -> ~c_L      cb)
     3.50958727E-03    2    -1000004         4   # BR(~chi_40 -> ~c_L*     c )
     5.60552905E-23    2     2000004        -4   # BR(~chi_40 -> ~c_R      cb)
     5.60552905E-23    2    -2000004         4   # BR(~chi_40 -> ~c_R*     c )
     3.50958970E-03    2     1000003        -3   # BR(~chi_40 -> ~s_L      sb)
     3.50958970E-03    2    -1000003         3   # BR(~chi_40 -> ~s_L*     s )
     6.64156283E-17    2     2000003        -3   # BR(~chi_40 -> ~s_R      sb)
     6.64156283E-17    2    -2000003         3   # BR(~chi_40 -> ~s_R*     s )
     4.29147143E-03    2     1000006        -6   # BR(~chi_40 -> ~t_1      tb)
     4.29147143E-03    2    -1000006         6   # BR(~chi_40 -> ~t_1*     t )
     2.08877981E-01    2     1000005        -5   # BR(~chi_40 -> ~b_1      bb)
     2.08877981E-01    2    -1000005         5   # BR(~chi_40 -> ~b_1*     b )
     2.28832496E-01    2     2000005        -5   # BR(~chi_40 -> ~b_2      bb)
     2.28832496E-01    2    -2000005         5   # BR(~chi_40 -> ~b_2*     b )
     1.89872504E-15    2     1000011       -11   # BR(~chi_40 -> ~e_L-     e+)
     1.89872504E-15    2    -1000011        11   # BR(~chi_40 -> ~e_L+     e-)
     3.23384237E-28    2     2000011       -11   # BR(~chi_40 -> ~e_R-     e+)
     3.23384237E-28    2    -2000011        11   # BR(~chi_40 -> ~e_R+     e-)
     1.89872504E-15    2     1000013       -13   # BR(~chi_40 -> ~mu_L-    mu+)
     1.89872504E-15    2    -1000013        13   # BR(~chi_40 -> ~mu_L+    mu-)
     3.23384237E-28    2     2000013       -13   # BR(~chi_40 -> ~mu_R-    mu+)
     3.23384237E-28    2    -2000013        13   # BR(~chi_40 -> ~mu_R+    mu-)
     2.71180072E-15    2     1000012       -12   # BR(~chi_40 -> ~nu_eL    nu_eb)
     2.71180072E-15    2    -1000012        12   # BR(~chi_40 -> ~nu_eL*   nu_e )
     2.71180072E-15    2     1000014       -14   # BR(~chi_40 -> ~nu_muL   nu_mub)
     2.71180072E-15    2    -1000014        14   # BR(~chi_40 -> ~nu_muL*  nu_mu )
     2.71180072E-15    2     1000016       -16   # BR(~chi_40 -> ~nu_tau1  nu_taub)
     2.71180072E-15    2    -1000016        16   # BR(~chi_40 -> ~nu_tau1* nu_tau )
     1.85035167E-02    2     1000039        22   # BR(~chi_40 -> ~G        gam)
     5.80530034E-02    2     1000039        23   # BR(~chi_40 -> ~G        Z)
     3.51582682E-09    2     1000039        25   # BR(~chi_40 -> ~G        h)
     2.20636769E-08    2     1000039        35   # BR(~chi_40 -> ~G        H)
     4.34806376E-12    2     1000039        36   # BR(~chi_40 -> ~G        A)
#
#
#
#
