#
#                              ======================
#                              | THE SUSYHIT OUTPUT |
#                              ======================
#
#
#              ------------------------------------------------------
#              |     This is the output of the SUSY-HIT package     |
#              |  created by A.Djouadi, M.Muehlleitner and M.Spira. |
#              |  In case of problems with SUSY-HIT email to        |
#              |           margarete.muehlleitner@kit.edu           |
#              |           michael.spira@psi.ch                     |
#              |           abdelhak.djouadi@cern.ch                 |
#              ------------------------------------------------------
#
#              ------------------------------------------------------
#              |  SUSY Les Houches Accord - MSSM Spectrum + Decays  |
#              |              based on the decay programs           |
#              |                                                    |
#              |                     SDECAY 1.5a                    |
#              |                                                    |
#              |  Authors: M.Muhlleitner, A.Djouadi and Y.Mambrini  |
#              |  Ref.:    Comput.Phys.Commun.168(2005)46           |
#              |           [hep-ph/0311167]                         |
#              |                                                    |
#              |                     HDECAY 3.4                     |
#              |                                                    |
#              |  By: A.Djouadi,J.Kalinowski,M.Muhlleitner,M.Spira  |
#              |  Ref.:    Comput.Phys.Commun.108(1998)56           |
#              |           [hep-ph/9704448]                         |
#              |                                                    |
#              |                                                    |
#              |  If not stated otherwise all DRbar couplings and   |
#              |  soft SUSY breaking masses are given at the scale  |
#              |  Q=  0.91187600E+02
#              |                                                    |
#              ------------------------------------------------------
#
#
BLOCK DCINFO  # Decay Program information
     1   SDECAY/HDECAY # decay calculator
     2   1.5a /3.4    # version number
#
BLOCK SPINFO  # Spectrum calculator information
     1   SuSpect     # RGE +Spectrum calculator            
     2   2.43         # version number                     
#
BLOCK MODSEL  # Model selection
     1     2   # GMSB                                              
#
BLOCK SMINPUTS  # Standard Model inputs
         1     1.27932904E+02   # alpha_em^-1(M_Z)^MSbar
         2     1.16639000E-05   # G_F [GeV^-2]
         3     1.17200000E-01   # alpha_S(M_Z)^MSbar
         4     9.11870000E+01   # M_Z pole mass
         5     4.25000000E+00   # mb(mb)^MSbar
         6     1.72900000E+02   # mt pole mass
         7     1.77700000E+00   # mtau pole mass
#
BLOCK MINPAR  # Input parameters - minimal models
#
BLOCK EXTPAR  # Input parameters - non-minimal models
         0     9.11876000E+01   # EWSB                
         1     1.44300000E+03   # M_1                 
         2     3.00000000E+03   # M_2                 
         3     2.80000000E+03   # M_3                 
        11     0.00000000E+00   # A_t                 
        12     0.00000000E+00   # A_b                 
        13     0.00000000E+00   # A_tau               
        14     0.00000000E+00   # A_u                 
        15     0.00000000E+00   # A_d                 
        16     0.00000000E+00   # A_e                 
        23     1.45000000E+03   # mu(EWSB)            
        25     1.50000000E+00   # tanbeta(in)         
        26     2.00000000E+03   # MA_pole             
        31     5.00000000E+03   # M_eL                
        32     5.00000000E+03   # M_muL               
        33     5.00000000E+03   # M_tauL              
        34     5.00000000E+03   # M_eR                
        35     5.00000000E+03   # M_muR               
        36     5.00000000E+03   # M_tauR              
        41     5.00000000E+03   # M_q1L               
        42     5.00000000E+03   # M_q2L               
        43     5.00000000E+03   # M_q3L               
        44     5.00000000E+03   # M_uR                
        45     5.00000000E+03   # M_cR                
        46     5.00000000E+03   # M_tR                
        47     5.00000000E+03   # M_dR                
        48     5.00000000E+03   # M_sR                
        49     5.00000000E+03   # M_bR                
#
BLOCK MASS  # Mass Spectrum
# PDG code           mass       particle
        24     8.05413728E+01   # W+
        25     1.25000000E+02   # h
        35     2.00400902E+03   # H
        36     2.00000000E+03   # A
        37     2.00151601E+03   # H+
         5     4.87877839E+00   # b-quark pole mass calculated from mb(mb)_Msbar
   1000001     5.00013292E+03   # ~d_L
   2000001     5.00002537E+03   # ~d_R
   1000002     4.99989245E+03   # ~u_L
   2000002     4.99994926E+03   # ~u_R
   1000003     5.00013292E+03   # ~s_L
   2000003     5.00002537E+03   # ~s_R
   1000004     4.99989245E+03   # ~c_L
   2000004     4.99994926E+03   # ~c_R
   1000005     4.99949337E+03   # ~b_1
   2000005     5.00066630E+03   # ~b_2
   1000006     4.98751345E+03   # ~t_1
   2000006     5.01691298E+03   # ~t_2
   1000011     5.00008218E+03   # ~e_L
   2000011     5.00007611E+03   # ~e_R
   1000012     4.99984171E+03   # ~nu_eL
   1000013     5.00008218E+03   # ~mu_L
   2000013     5.00007611E+03   # ~mu_R
   1000014     4.99984171E+03   # ~nu_muL
   1000015     4.99969262E+03   # ~tau_1
   2000015     5.00046627E+03   # ~tau_2
   1000016     4.99984171E+03   # ~nu_tauL
   1000021     2.80000000E+03   # ~g
   1000022     1.40098569E+03   # ~chi_10
   1000023    -1.45008040E+03   # ~chi_20
   1000025     1.48816887E+03   # ~chi_30
   1000035     3.00392584E+03   # ~chi_40
   1000024     1.44618517E+03   # ~chi_1+
   1000037     3.00392291E+03   # ~chi_2+
   1000039     1.00000000E-09   # ~gravitino
#
BLOCK NMIX  # Neutralino Mixing Matrix
  1  1     7.19596687E-01   # N_11
  1  2    -3.36078893E-02   # N_12
  1  3     4.92117456E-01   # N_13
  1  4    -4.88744849E-01   # N_14
  2  1     3.01757290E-03   # N_21
  2  2    -3.48704518E-03   # N_22
  2  3    -7.07001240E-01   # N_23
  2  4    -7.07197272E-01   # N_24
  3  1     6.94384264E-01   # N_31
  3  2     3.68759309E-02   # N_32
  3  3    -5.06846601E-01   # N_33
  3  4     5.09487177E-01   # N_34
  4  1     1.41318660E-03   # N_41
  4  2    -9.98748475E-01   # N_42
  4  3    -3.28051805E-02   # N_43
  4  4     3.77267415E-02   # N_44
#
BLOCK UMIX  # Chargino Mixing Matrix U
  1  1    -4.63555639E-02   # U_11
  1  2     9.98925003E-01   # U_12
  2  1     9.98925003E-01   # U_21
  2  2     4.63555639E-02   # U_22
#
BLOCK VMIX  # Chargino Mixing Matrix V
  1  1    -5.33162371E-02   # V_11
  1  2     9.98577678E-01   # V_12
  2  1     9.98577678E-01   # V_21
  2  2     5.33162371E-02   # V_22
#
BLOCK STOPMIX  # Stop Mixing Matrix
  1  1     7.07789324E-01   # cos(theta_t)
  1  2     7.06423579E-01   # sin(theta_t)
  2  1    -7.06423579E-01   # -sin(theta_t)
  2  2     7.07789324E-01   # cos(theta_t)
#
BLOCK SBOTMIX  # Sbottom Mixing Matrix
  1  1     6.73909712E-01   # cos(theta_b)
  1  2     7.38813711E-01   # sin(theta_b)
  2  1    -7.38813711E-01   # -sin(theta_b)
  2  2     6.73909712E-01   # cos(theta_b)
#
BLOCK STAUMIX  # Stau Mixing Matrix
  1  1     7.04328010E-01   # cos(theta_tau)
  1  2     7.09874675E-01   # sin(theta_tau)
  2  1    -7.09874675E-01   # -sin(theta_tau)
  2  2     7.04328010E-01   # cos(theta_tau)
#
BLOCK ALPHA  # Higgs mixing
          -5.90201421E-01   # Mixing angle in the neutral Higgs boson sector
#
BLOCK HMIX Q=  9.11876000E+01  # DRbar Higgs Parameters
         1     1.45000000E+03   # mu(Q)               
         2     1.49999979E+00   # tanbeta(Q)          
         3     2.52208843E+02   # vev(Q)              
         4     3.25891835E+06   # MA^2(Q)             
#
BLOCK GAUGE Q=  9.11876000E+01  # The gauge couplings
     1     3.52759319E-01   # gprime(Q) DRbar
     2     6.27026148E-01   # g(Q) DRbar
     3     1.07511211E+00   # g3(Q) DRbar
#
BLOCK AU Q=  9.11876000E+01  # The trilinear couplings
  1  1     0.00000000E+00   # A_u(Q) DRbar
  2  2     0.00000000E+00   # A_c(Q) DRbar
  3  3     0.00000000E+00   # A_t(Q) DRbar
#
BLOCK AD Q=  9.11876000E+01  # The trilinear couplings
  1  1     0.00000000E+00   # A_d(Q) DRbar
  2  2     0.00000000E+00   # A_s(Q) DRbar
  3  3     0.00000000E+00   # A_b(Q) DRbar
#
BLOCK AE Q=  9.11876000E+01  # The trilinear couplings
  1  1     0.00000000E+00   # A_e(Q) DRbar
  2  2     0.00000000E+00   # A_mu(Q) DRbar
  3  3     0.00000000E+00   # A_tau(Q) DRbar
#
BLOCK Yu Q=  9.11876000E+01  # The Yukawa couplings
  1  1     0.00000000E+00   # y_u(Q) DRbar
  2  2     0.00000000E+00   # y_c(Q) DRbar
  3  3     1.02525080E+00   # y_t(Q) DRbar
#
BLOCK Yd Q=  9.11876000E+01  # The Yukawa couplings
  1  1     0.00000000E+00   # y_d(Q) DRbar
  2  2     0.00000000E+00   # y_s(Q) DRbar
  3  3     2.71426701E-02   # y_b(Q) DRbar
#
BLOCK Ye Q=  9.11876000E+01  # The Yukawa couplings
  1  1     0.00000000E+00   # y_e(Q) DRbar
  2  2     0.00000000E+00   # y_mu(Q) DRbar
  3  3     1.79781421E-02   # y_tau(Q) DRbar
#
BLOCK MSOFT Q=  9.11876000E+01  # The soft SUSY breaking masses at the scale Q
         1     1.44300000E+03   # M_1                 
         2     3.00000000E+03   # M_2                 
         3     2.80000000E+03   # M_3                 
        14     0.00000000E+00   # A_u                 
        15     0.00000000E+00   # A_d                 
        16     0.00000000E+00   # A_e                 
        21     6.93379724E+05   # M^2_Hd              
        22    -7.21210743E+06   # M^2_Hu              
        31     5.00000000E+03   # M_eL                
        32     5.00000000E+03   # M_muL               
        33     5.00000000E+03   # M_tauL              
        34     5.00000000E+03   # M_eR                
        35     5.00000000E+03   # M_muR               
        36     5.00000000E+03   # M_tauR              
        41     5.00000000E+03   # M_q1L               
        42     5.00000000E+03   # M_q2L               
        43     5.00000000E+03   # M_q3L               
        44     5.00000000E+03   # M_uR                
        45     5.00000000E+03   # M_cR                
        46     5.00000000E+03   # M_tR                
        47     5.00000000E+03   # M_dR                
        48     5.00000000E+03   # M_sR                
        49     5.00000000E+03   # M_bR                
#
#
#
#                             =================
#                             |The decay table|
#                             =================
#
# - The QCD corrections to the decays gluino -> squark  + quark
#                                     squark -> gaugino + quark_prime
#                                     squark -> squark_prime + Higgs
#                                     squark -> gluino  + quark
#   are included.
#
# - The multi-body decays for the inos, stops and sbottoms are included.
#
# - The loop induced decays for the gluino, neutralinos and stops
#   are included.
#
# - The SUSY decays of the top quark are included.
#
# - Possible decays of the NLSP in GMSB models are included.
#
#
#         PDG            Width
DECAY         6     1.36982154E+00   # top decays
#          BR         NDA      ID1       ID2
     1.00000000E+00    2           5        24   # BR(t ->  b    W+)
#
#         PDG            Width
DECAY   1000021     4.64392778E-03   # gluino decays
#          BR         NDA      ID1       ID2
     4.64475219E-03    2     1000022        21   # BR(~g -> ~chi_10 g)
     9.02665195E-03    2     1000023        21   # BR(~g -> ~chi_20 g)
     4.42518650E-03    2     1000025        21   # BR(~g -> ~chi_30 g)
#          BR         NDA      ID1       ID2
     0.00000000E+00    2     1000039        21   # BR(~g -> ~G      g)
#           BR         NDA      ID1       ID2       ID3
     5.01535306E-03    3     1000022         1        -1   # BR(~g -> ~chi_10 d  db)
     2.99034131E-07    3     1000023         1        -1   # BR(~g -> ~chi_20 d  db)
     3.00826277E-03    3     1000025         1        -1   # BR(~g -> ~chi_30 d  db)
     1.49426381E-02    3     1000022         2        -2   # BR(~g -> ~chi_10 u  ub)
     2.30681954E-07    3     1000023         2        -2   # BR(~g -> ~chi_20 u  ub)
     1.17617478E-02    3     1000025         2        -2   # BR(~g -> ~chi_30 u  ub)
     5.01535306E-03    3     1000022         3        -3   # BR(~g -> ~chi_10 s  sb)
     2.99034131E-07    3     1000023         3        -3   # BR(~g -> ~chi_20 s  sb)
     3.00826277E-03    3     1000025         3        -3   # BR(~g -> ~chi_30 s  sb)
     1.49426381E-02    3     1000022         4        -4   # BR(~g -> ~chi_10 c  cb)
     2.30681954E-07    3     1000023         4        -4   # BR(~g -> ~chi_20 c  cb)
     1.17617478E-02    3     1000025         4        -4   # BR(~g -> ~chi_30 c  cb)
     5.09010816E-03    3     1000022         5        -5   # BR(~g -> ~chi_10 b  bb)
     1.70071173E-04    3     1000023         5        -5   # BR(~g -> ~chi_20 b  bb)
     3.09898708E-03    3     1000025         5        -5   # BR(~g -> ~chi_30 b  bb)
     1.08874389E-01    3     1000022         6        -6   # BR(~g -> ~chi_10 t  tb)
     1.92341905E-01    3     1000023         6        -6   # BR(~g -> ~chi_20 t  tb)
     1.19615647E-01    3     1000025         6        -6   # BR(~g -> ~chi_30 t  tb)
     2.19286256E-04    3     1000024         1        -2   # BR(~g -> ~chi_1+ d  ub)
     2.19286256E-04    3    -1000024         2        -1   # BR(~g -> ~chi_1- u  db)
     2.19286256E-04    3     1000024         3        -4   # BR(~g -> ~chi_1+ s  cb)
     2.19286256E-04    3    -1000024         4        -3   # BR(~g -> ~chi_1- c  sb)
     2.19855596E-01    3     1000024         5        -6   # BR(~g -> ~chi_1+ b  tb)
     2.19855596E-01    3    -1000024         6        -5   # BR(~g -> ~chi_1- t  bb)
#
#         PDG            Width
DECAY   1000006     2.40612622E+02   # stop1 decays
#          BR         NDA      ID1       ID2
     9.67294759E-02    2     1000022         6   # BR(~t_1 -> ~chi_10 t )
     1.27168176E-01    2     1000023         6   # BR(~t_1 -> ~chi_20 t )
     4.99411758E-02    2     1000025         6   # BR(~t_1 -> ~chi_30 t )
     1.38134891E-02    2     1000035         6   # BR(~t_1 -> ~chi_40 t )
     1.33928092E-01    2     1000024         5   # BR(~t_1 -> ~chi_1+ b )
     2.73402714E-02    2     1000037         5   # BR(~t_1 -> ~chi_2+ b )
     5.51079320E-01    2     1000021         6   # BR(~t_1 -> ~g      t )
#
#         PDG            Width
DECAY   2000006     2.27704159E+02   # stop2 decays
#          BR         NDA      ID1       ID2
     4.50697226E-02    2     1000022         6   # BR(~t_2 -> ~chi_10 t )
     1.29058629E-01    2     1000023         6   # BR(~t_2 -> ~chi_20 t )
     1.04092729E-01    2     1000025         6   # BR(~t_2 -> ~chi_30 t )
     1.98263173E-02    2     1000035         6   # BR(~t_2 -> ~chi_40 t )
     1.22255010E-01    2     1000024         5   # BR(~t_2 -> ~chi_1+ b )
     3.93252978E-02    2     1000037         5   # BR(~t_2 -> ~chi_2+ b )
     5.40372295E-01    2     1000021         6   # BR(~t_2 -> ~g      t )
#
#         PDG            Width
DECAY   1000005     1.64055618E+02   # sbottom1 decays
#          BR         NDA      ID1       ID2
     6.40201670E-03    2     1000022         5   # BR(~b_1 -> ~chi_10 b )
     1.10817698E-04    2     1000023         5   # BR(~b_1 -> ~chi_20 b )
     3.25182356E-03    2     1000025         5   # BR(~b_1 -> ~chi_30 b )
     1.98327458E-02    2     1000035         5   # BR(~b_1 -> ~chi_40 b )
     1.50207767E-01    2    -1000024         6   # BR(~b_1 -> ~chi_1- t )
     4.00259187E-02    2    -1000037         6   # BR(~b_1 -> ~chi_2- t )
     7.80168911E-01    2     1000021         5   # BR(~b_1 -> ~g      b )
#
#         PDG            Width
DECAY   2000005     1.77812042E+02   # sbottom2 decays
#          BR         NDA      ID1       ID2
     3.29351161E-03    2     1000022         5   # BR(~b_2 -> ~chi_10 b )
     1.35815882E-04    2     1000023         5   # BR(~b_2 -> ~chi_20 b )
     3.84083322E-03    2     1000025         5   # BR(~b_2 -> ~chi_30 b )
     2.50798854E-02    2     1000035         5   # BR(~b_2 -> ~chi_40 b )
     1.98039009E-01    2    -1000024         6   # BR(~b_2 -> ~chi_1- t )
     5.06336909E-02    2    -1000037         6   # BR(~b_2 -> ~chi_2- t )
     7.18977254E-01    2     1000021         5   # BR(~b_2 -> ~g      b )
#
#         PDG            Width
DECAY   1000002     1.51707348E+02   # sup_L decays
#          BR         NDA      ID1       ID2
     1.07996907E-03    2     1000022         2   # BR(~u_L -> ~chi_10 u)
     8.86622517E-07    2     1000023         2   # BR(~u_L -> ~chi_20 u)
     2.87302980E-03    2     1000025         2   # BR(~u_L -> ~chi_30 u)
     5.07789982E-02    2     1000035         2   # BR(~u_L -> ~chi_40 u)
     5.91290184E-04    2     1000024         1   # BR(~u_L -> ~chi_1+ d)
     1.01577385E-01    2     1000037         1   # BR(~u_L -> ~chi_2+ d)
     8.43098441E-01    2     1000021         2   # BR(~u_L -> ~g      u)
#
#         PDG            Width
DECAY   2000002     1.36792390E+02   # sup_R decays
#          BR         NDA      ID1       ID2
     3.39826016E-02    2     1000022         2   # BR(~u_R -> ~chi_10 u)
     5.90416765E-07    2     1000023         2   # BR(~u_R -> ~chi_20 u)
     3.09622570E-02    2     1000025         2   # BR(~u_R -> ~chi_30 u)
     6.34782952E-08    2     1000035         2   # BR(~u_R -> ~chi_40 u)
     9.35054487E-01    2     1000021         2   # BR(~u_R -> ~g      u)
#
#         PDG            Width
DECAY   1000001     1.51715106E+02   # sdown_L decays
#          BR         NDA      ID1       ID2
     2.98778025E-03    2     1000022         1   # BR(~d_L -> ~chi_10 d)
     1.70676507E-06    2     1000023         1   # BR(~d_L -> ~chi_20 d)
     8.96564029E-04    2     1000025         1   # BR(~d_L -> ~chi_30 d)
     5.08382577E-02    2     1000035         1   # BR(~d_L -> ~chi_40 d)
     4.46984109E-04    2    -1000024         2   # BR(~d_L -> ~chi_1- u)
     1.01658726E-01    2    -1000037         2   # BR(~d_L -> ~chi_2- u)
     8.43169981E-01    2     1000021         1   # BR(~d_L -> ~g      d)
#
#         PDG            Width
DECAY   2000001     1.30134903E+02   # sdown_R decays
#          BR         NDA      ID1       ID2
     8.93045846E-03    2     1000022         1   # BR(~d_R -> ~chi_10 d)
     1.55158647E-07    2     1000023         1   # BR(~d_R -> ~chi_20 d)
     8.13673279E-03    2     1000025         1   # BR(~d_R -> ~chi_30 d)
     1.66822591E-08    2     1000035         1   # BR(~d_R -> ~chi_40 d)
     9.82932637E-01    2     1000021         1   # BR(~d_R -> ~g      d)
#
#         PDG            Width
DECAY   1000004     1.51707348E+02   # scharm_L decays
#          BR         NDA      ID1       ID2
     1.07996907E-03    2     1000022         4   # BR(~c_L -> ~chi_10 c)
     8.86622517E-07    2     1000023         4   # BR(~c_L -> ~chi_20 c)
     2.87302980E-03    2     1000025         4   # BR(~c_L -> ~chi_30 c)
     5.07789982E-02    2     1000035         4   # BR(~c_L -> ~chi_40 c)
     5.91290184E-04    2     1000024         3   # BR(~c_L -> ~chi_1+ s)
     1.01577385E-01    2     1000037         3   # BR(~c_L -> ~chi_2+ s)
     8.43098441E-01    2     1000021         4   # BR(~c_L -> ~g      c)
#
#         PDG            Width
DECAY   2000004     1.36792390E+02   # scharm_R decays
#          BR         NDA      ID1       ID2
     3.39826016E-02    2     1000022         4   # BR(~c_R -> ~chi_10 c)
     5.90416765E-07    2     1000023         4   # BR(~c_R -> ~chi_20 c)
     3.09622570E-02    2     1000025         4   # BR(~c_R -> ~chi_30 c)
     6.34782952E-08    2     1000035         4   # BR(~c_R -> ~chi_40 c)
     9.35054487E-01    2     1000021         4   # BR(~c_R -> ~g      c)
#
#         PDG            Width
DECAY   1000003     1.51715106E+02   # sstrange_L decays
#          BR         NDA      ID1       ID2
     2.98778025E-03    2     1000022         3   # BR(~s_L -> ~chi_10 s)
     1.70676507E-06    2     1000023         3   # BR(~s_L -> ~chi_20 s)
     8.96564029E-04    2     1000025         3   # BR(~s_L -> ~chi_30 s)
     5.08382577E-02    2     1000035         3   # BR(~s_L -> ~chi_40 s)
     4.46984109E-04    2    -1000024         4   # BR(~s_L -> ~chi_1- c)
     1.01658726E-01    2    -1000037         4   # BR(~s_L -> ~chi_2- c)
     8.43169981E-01    2     1000021         3   # BR(~s_L -> ~g      s)
#
#         PDG            Width
DECAY   2000003     1.30134903E+02   # sstrange_R decays
#          BR         NDA      ID1       ID2
     8.93045846E-03    2     1000022         3   # BR(~s_R -> ~chi_10 s)
     1.55158647E-07    2     1000023         3   # BR(~s_R -> ~chi_20 s)
     8.13673279E-03    2     1000025         3   # BR(~s_R -> ~chi_30 s)
     1.66822591E-08    2     1000035         3   # BR(~s_R -> ~chi_40 s)
     9.82932637E-01    2     1000021         3   # BR(~s_R -> ~g      s)
#
#         PDG            Width
DECAY   1000011     2.92198770E+01   # selectron_L decays
#          BR         NDA      ID1       ID2
     7.83143710E-02    2     1000022        11   # BR(~e_L -> ~chi_10 e-)
     1.79749616E-06    2     1000023        11   # BR(~e_L -> ~chi_20 e-)
     1.01610446E-01    2     1000025        11   # BR(~e_L -> ~chi_30 e-)
     2.72198876E-01    2     1000035        11   # BR(~e_L -> ~chi_40 e-)
     2.41502526E-03    2    -1000024        12   # BR(~e_L -> ~chi_1- nu_e)
     5.45459484E-01    2    -1000037        12   # BR(~e_L -> ~chi_2- nu_e)
#
#         PDG            Width
DECAY   2000011     2.08016749E+01   # selectron_R decays
#          BR         NDA      ID1       ID2
     5.23307366E-01    2     1000022        11   # BR(~e_R -> ~chi_10 e-)
     9.09077032E-06    2     1000023        11   # BR(~e_R -> ~chi_20 e-)
     4.76682572E-01    2     1000025        11   # BR(~e_R -> ~chi_30 e-)
     9.70708514E-07    2     1000035        11   # BR(~e_R -> ~chi_40 e-)
#
#         PDG            Width
DECAY   1000013     2.92198770E+01   # smuon_L decays
#          BR         NDA      ID1       ID2
     7.83143710E-02    2     1000022        13   # BR(~mu_L -> ~chi_10 mu-)
     1.79749616E-06    2     1000023        13   # BR(~mu_L -> ~chi_20 mu-)
     1.01610446E-01    2     1000025        13   # BR(~mu_L -> ~chi_30 mu-)
     2.72198876E-01    2     1000035        13   # BR(~mu_L -> ~chi_40 mu-)
     2.41502526E-03    2    -1000024        14   # BR(~mu_L -> ~chi_1- nu_mu)
     5.45459484E-01    2    -1000037        14   # BR(~mu_L -> ~chi_2- nu_mu)
#
#         PDG            Width
DECAY   2000013     2.08016749E+01   # smuon_R decays
#          BR         NDA      ID1       ID2
     5.23307366E-01    2     1000022        13   # BR(~mu_R -> ~chi_10 mu-)
     9.09077032E-06    2     1000023        13   # BR(~mu_R -> ~chi_20 mu-)
     4.76682572E-01    2     1000025        13   # BR(~mu_R -> ~chi_30 mu-)
     9.70708514E-07    2     1000035        13   # BR(~mu_R -> ~chi_40 mu-)
#
#         PDG            Width
DECAY   1000015     2.50563559E+01   # stau_1 decays
#          BR         NDA      ID1       ID2
     2.70308634E-01    2     1000022        15   # BR(~tau_1 -> ~chi_10  tau-)
     4.45626020E-04    2     1000023        15   # BR(~tau_1 -> ~chi_20  tau-)
     2.53789133E-01    2     1000025        15   # BR(~tau_1 -> ~chi_30  tau-)
     1.57006766E-01    2     1000035        15   # BR(~tau_1 -> ~chi_40  tau-)
     3.67854595E-03    2    -1000024        16   # BR(~tau_1 -> ~chi_1-  nu_tau)
     3.14627751E-01    2    -1000037        16   # BR(~tau_1 -> ~chi_2-  nu_tau)
     1.43543992E-04    2     1000039        15   # BR(~tau_1 -> ~G       tau-)
#
#         PDG            Width
DECAY   2000015     2.50496977E+01   # stau_2 decays
#          BR         NDA      ID1       ID2
     2.56058359E-01    2     1000022        15   # BR(~tau_2 -> ~chi_10  tau-)
     6.40229883E-04    2     1000023        15   # BR(~tau_2 -> ~chi_20  tau-)
     2.61065392E-01    2     1000025        15   # BR(~tau_2 -> ~chi_30  tau-)
     1.60467600E-01    2     1000035        15   # BR(~tau_2 -> ~chi_40  tau-)
     2.12596261E-04    2    -1000024        16   # BR(~tau_2 -> ~chi_1-  nu_tau)
     3.21555822E-01    2    -1000037        16   # BR(~tau_2 -> ~chi_2-  nu_tau)
#
#         PDG            Width
DECAY   1000012     2.92209136E+01   # snu_eL decays
#          BR         NDA      ID1       ID2
     1.09230375E-01    2     1000022        12   # BR(~nu_eL -> ~chi_10 nu_e)
     1.50891302E-05    2     1000023        12   # BR(~nu_eL -> ~chi_20 nu_e)
     6.95701399E-02    2     1000025        12   # BR(~nu_eL -> ~chi_30 nu_e)
     2.73014499E-01    2     1000035        12   # BR(~nu_eL -> ~chi_40 nu_e)
     3.19442724E-03    2     1000024        11   # BR(~nu_eL -> ~chi_1+ e-)
     5.44975470E-01    2     1000037        11   # BR(~nu_eL -> ~chi_2+ e-)
#
#         PDG            Width
DECAY   1000014     2.92209136E+01   # snu_muL decays
#          BR         NDA      ID1       ID2
     1.09230375E-01    2     1000022        14   # BR(~nu_muL -> ~chi_10 nu_mu)
     1.50891302E-05    2     1000023        14   # BR(~nu_muL -> ~chi_20 nu_mu)
     6.95701399E-02    2     1000025        14   # BR(~nu_muL -> ~chi_30 nu_mu)
     2.73014499E-01    2     1000035        14   # BR(~nu_muL -> ~chi_40 nu_mu)
     3.19442724E-03    2     1000024        13   # BR(~nu_muL -> ~chi_1+ mu-)
     5.44975470E-01    2     1000037        13   # BR(~nu_muL -> ~chi_2+ mu-)
#
#         PDG            Width
DECAY   1000016     2.92478749E+01   # snu_tauL decays
#          BR         NDA      ID1       ID2
     1.09129684E-01    2     1000022        16   # BR(~nu_tauL -> ~chi_10 nu_tau)
     1.50752207E-05    2     1000023        16   # BR(~nu_tauL -> ~chi_20 nu_tau)
     6.95060086E-02    2     1000025        16   # BR(~nu_tauL -> ~chi_30 nu_tau)
     2.72762828E-01    2     1000035        16   # BR(~nu_tauL -> ~chi_40 nu_tau)
     4.11170759E-03    2     1000024        15   # BR(~nu_tauL -> ~chi_1+ tau-)
     5.44474696E-01    2     1000037        15   # BR(~nu_tauL -> ~chi_2+ tau-)
#
#         PDG            Width
DECAY   1000024     1.22362475E-04   # chargino1+ decays
#          BR         NDA      ID1       ID2
     2.94748434E-02    2     1000039        24   # BR(~chi_1+ -> ~G       W+)
#           BR         NDA      ID1       ID2       ID3
     3.24305515E-01    3     1000022         2        -1   # BR(~chi_1+ -> ~chi_10 u    db)
     3.22740099E-01    3     1000022         4        -3   # BR(~chi_1+ -> ~chi_10 c    sb)
     1.08101964E-01    3     1000022       -11        12   # BR(~chi_1+ -> ~chi_10 e+   nu_e)
     1.08099032E-01    3     1000022       -13        14   # BR(~chi_1+ -> ~chi_10 mu+  nu_mu)
     1.07278547E-01    3     1000022       -15        16   # BR(~chi_1+ -> ~chi_10 tau+ nu_tau)
#
#         PDG            Width
DECAY   1000037     3.72302219E+01   # chargino2+ decays
#          BR         NDA      ID1       ID2
     2.53265661E-01    2     1000024        23   # BR(~chi_2+ -> ~chi_1+  Z )
     1.11771526E-01    2     1000022        24   # BR(~chi_2+ -> ~chi_10  W+)
     2.46264101E-01    2     1000023        24   # BR(~chi_2+ -> ~chi_20  W+)
     1.35137176E-01    2     1000025        24   # BR(~chi_2+ -> ~chi_30  W+)
     2.53554002E-01    2     1000024        25   # BR(~chi_2+ -> ~chi_1+  h )
     7.53380006E-06    2     1000039        24   # BR(~chi_2+ -> ~G       W+)
     8.54029564E-10    2     1000039        37   # BR(~chi_2+ -> ~G       H+)
#
#         PDG            Width
DECAY   1000022    1.0E-05    # neutralino1 decays
#          BR         NDA      ID1       ID2
     4.95906185E-01    2     1000039        22   # BR(~chi_10 -> ~G        gam)
     4.92841861E-01    2     1000039        23   # BR(~chi_10 -> ~G        Z)
     1.12519542E-02    2     1000039        25   # BR(~chi_10 -> ~G        h)
#
#         PDG            Width
DECAY   1000023     1.49675300E-04   # neutralino2 decays
#          BR         NDA      ID1       ID2
     6.72945785E-04    2     1000022        22   # BR(~chi_20 -> ~chi_10 gam)
#          BR         NDA      ID1       ID2
     4.17570668E-08    2     1000039        22   # BR(~chi_20 -> ~G        gam)
     9.35756222E-04    2     1000039        23   # BR(~chi_20 -> ~G        Z)
     2.30340798E-02    2     1000039        25   # BR(~chi_20 -> ~G        h)
#           BR         NDA      ID1       ID2       ID3
     1.15800796E-01    3     1000022        -2         2   # BR(~chi_20 -> ~chi_10 ub      u)
     1.49946123E-01    3     1000022        -1         1   # BR(~chi_20 -> ~chi_10 db      d)
     1.15046380E-01    3     1000022        -4         4   # BR(~chi_20 -> ~chi_10 cb      c)
     1.49925832E-01    3     1000022        -3         3   # BR(~chi_20 -> ~chi_10 sb      s)
     1.37051162E-01    3     1000022        -5         5   # BR(~chi_20 -> ~chi_10 bb      b)
     3.42459268E-02    3     1000022       -11        11   # BR(~chi_20 -> ~chi_10 e+      e-)
     3.42447414E-02    3     1000022       -13        13   # BR(~chi_20 -> ~chi_10 mu+     mu-)
     3.39113917E-02    3     1000022       -15        15   # BR(~chi_20 -> ~chi_10 tau+    tau-)
     6.83915340E-02    3     1000022       -12        12   # BR(~chi_20 -> ~chi_10 nu_eb   nu_e)
     6.83915340E-02    3     1000022       -14        14   # BR(~chi_20 -> ~chi_10 nu_mub  nu_mu)
     6.83915340E-02    3     1000022       -16        16   # BR(~chi_20 -> ~chi_10 nu_taub nu_tau)
     2.20667940E-06    3     1000024        -2         1   # BR(~chi_20 -> ~chi_1+ ub      d)
     2.20667940E-06    3    -1000024        -1         2   # BR(~chi_20 -> ~chi_1- db      u)
     1.16825401E-06    3     1000024        -4         3   # BR(~chi_20 -> ~chi_1+ cb      s)
     1.16825401E-06    3    -1000024        -3         4   # BR(~chi_20 -> ~chi_1- sb      c)
     7.35559846E-07    3     1000024       -12        11   # BR(~chi_20 -> ~chi_1+ nu_eb   e-)
     7.35559846E-07    3    -1000024        12       -11   # BR(~chi_20 -> ~chi_1- nu_e    e+)
     7.32866103E-07    3     1000024       -14        13   # BR(~chi_20 -> ~chi_1+ nu_mub  mu-)
     7.32866103E-07    3    -1000024        14       -13   # BR(~chi_20 -> ~chi_1- nu_mu   mu+)
     2.67712221E-07    3     1000024       -16        15   # BR(~chi_20 -> ~chi_1+ nu_taub tau-)
     2.67712221E-07    3    -1000024        16       -15   # BR(~chi_20 -> ~chi_1- nu_tau  tau+)
#
#         PDG            Width
DECAY   1000025     2.18676437E-04   # neutralino3 decays
#          BR         NDA      ID1       ID2
     3.77346486E-04    2     1000022        22   # BR(~chi_30 -> ~chi_10 gam)
     7.82201406E-06    2     1000023        22   # BR(~chi_30 -> ~chi_20 gam)
#          BR         NDA      ID1       ID2
     1.49276744E-02    2     1000039        22   # BR(~chi_30 -> ~G        gam)
     1.30076919E-02    2     1000039        23   # BR(~chi_30 -> ~G        Z)
     3.72495009E-04    2     1000039        25   # BR(~chi_30 -> ~G        h)
#           BR         NDA      ID1       ID2       ID3
     1.03530309E-05    3     1000022        -2         2   # BR(~chi_30 -> ~chi_10 ub      u)
     1.22796958E-05    3     1000022        -1         1   # BR(~chi_30 -> ~chi_10 db      d)
     1.44127674E-05    3     1000022        -4         4   # BR(~chi_30 -> ~chi_10 cb      c)
     1.23556669E-05    3     1000022        -3         3   # BR(~chi_30 -> ~chi_10 sb      s)
     2.67172033E-05    3     1000022        -5         5   # BR(~chi_30 -> ~chi_10 bb      b)
     2.11919080E-06    3     1000022       -11        11   # BR(~chi_30 -> ~chi_10 e+      e-)
     2.11916665E-06    3     1000022       -13        13   # BR(~chi_30 -> ~chi_10 mu+     mu-)
     4.33011058E-06    3     1000022       -15        15   # BR(~chi_30 -> ~chi_10 tau+    tau-)
     6.02292419E-06    3     1000022       -12        12   # BR(~chi_30 -> ~chi_10 nu_eb   nu_e)
     6.02292419E-06    3     1000022       -14        14   # BR(~chi_30 -> ~chi_10 nu_mub  nu_mu)
     6.02292419E-06    3     1000022       -16        16   # BR(~chi_30 -> ~chi_10 nu_taub nu_tau)
     2.23440665E-02    3     1000023        -2         2   # BR(~chi_30 -> ~chi_20 ub      u)
     2.89325337E-02    3     1000023        -1         1   # BR(~chi_30 -> ~chi_20 db      d)
     2.21233741E-02    3     1000023        -4         4   # BR(~chi_30 -> ~chi_20 cb      c)
     2.89262525E-02    3     1000023        -3         3   # BR(~chi_30 -> ~chi_20 sb      s)
     2.50037249E-02    3     1000023        -5         5   # BR(~chi_30 -> ~chi_20 bb      b)
     6.60786090E-03    3     1000023       -11        11   # BR(~chi_30 -> ~chi_20 e+      e-)
     6.60752827E-03    3     1000023       -13        13   # BR(~chi_30 -> ~chi_20 mu+     mu-)
     6.51361817E-03    3     1000023       -15        15   # BR(~chi_30 -> ~chi_20 tau+    tau-)
     1.31962901E-02    3     1000023       -12        12   # BR(~chi_30 -> ~chi_20 nu_eb   nu_e)
     1.31962901E-02    3     1000023       -14        14   # BR(~chi_30 -> ~chi_20 nu_mub  nu_mu)
     1.31962901E-02    3     1000023       -16        16   # BR(~chi_30 -> ~chi_20 nu_taub nu_tau)
     1.31133930E-01    3     1000024        -2         1   # BR(~chi_30 -> ~chi_1+ ub      d)
     1.31133930E-01    3    -1000024        -1         2   # BR(~chi_30 -> ~chi_1- db      u)
     1.30398552E-01    3     1000024        -4         3   # BR(~chi_30 -> ~chi_1+ cb      s)
     1.30398552E-01    3    -1000024        -3         4   # BR(~chi_30 -> ~chi_1- sb      c)
     4.37112457E-02    3     1000024       -12        11   # BR(~chi_30 -> ~chi_1+ nu_eb   e-)
     4.37112457E-02    3    -1000024        12       -11   # BR(~chi_30 -> ~chi_1- nu_e    e+)
     4.37098670E-02    3     1000024       -14        13   # BR(~chi_30 -> ~chi_1+ nu_mub  mu-)
     4.37098670E-02    3    -1000024        14       -13   # BR(~chi_30 -> ~chi_1- nu_mu   mu+)
     4.33245974E-02    3     1000024       -16        15   # BR(~chi_30 -> ~chi_1+ nu_taub tau-)
     4.33245974E-02    3    -1000024        16       -15   # BR(~chi_30 -> ~chi_1- nu_tau  tau+)
#
#         PDG            Width
DECAY   1000035     3.72303309E+01   # neutralino4 decays
#          BR         NDA      ID1       ID2
     5.71063005E-04    2     1000022        23   # BR(~chi_40 -> ~chi_10   Z )
     2.51810349E-01    2     1000023        23   # BR(~chi_40 -> ~chi_20   Z )
     6.54810700E-04    2     1000025        23   # BR(~chi_40 -> ~chi_30   Z )
     2.46486187E-01    2     1000024       -24   # BR(~chi_40 -> ~chi_1+   W-)
     2.46486187E-01    2    -1000024        24   # BR(~chi_40 -> ~chi_1-   W+)
     1.14406303E-01    2     1000022        25   # BR(~chi_40 -> ~chi_10   h )
     1.20315183E-03    2     1000023        25   # BR(~chi_40 -> ~chi_20   h )
     1.38374414E-01    2     1000025        25   # BR(~chi_40 -> ~chi_30   h )
     1.80475876E-06    2     1000039        22   # BR(~chi_40 -> ~G        gam)
     5.72813771E-06    2     1000039        23   # BR(~chi_40 -> ~G        Z)
     6.43281617E-10    2     1000039        25   # BR(~chi_40 -> ~G        h)
     8.35026313E-10    2     1000039        35   # BR(~chi_40 -> ~G        H)
     1.47338573E-11    2     1000039        36   # BR(~chi_40 -> ~G        A)
#
#         PDG            Width
DECAY        25     4.08748988E-03   # h decays
#          BR         NDA      ID1       ID2
     6.17939634E-01    2           5        -5   # BR(h -> b       bb     )
     6.37203553E-02    2         -15        15   # BR(h -> tau+    tau-   )
     2.25546590E-04    2         -13        13   # BR(h -> mu+     mu-    )
     4.77953595E-04    2           3        -3   # BR(h -> s       sb     )
     2.06200020E-02    2           4        -4   # BR(h -> c       cb     )
     6.69532362E-02    2          21        21   # BR(h -> g       g      )
     2.30259829E-03    2          22        22   # BR(h -> gam     gam    )
     1.53683956E-03    2          22        23   # BR(h -> Z       gam    )
     2.00617985E-01    2          24       -24   # BR(h -> W+      W-     )
     2.56058496E-02    2          23        23   # BR(h -> Z       Z      )
#
#         PDG            Width
DECAY        35     3.78099000E+01   # H decays
#          BR         NDA      ID1       ID2
     1.46706409E-03    2           5        -5   # BR(H -> b       bb     )
     2.46429121E-04    2         -15        15   # BR(H -> tau+    tau-   )
     8.71218688E-07    2         -13        13   # BR(H -> mu+     mu-    )
     1.11547833E-06    2           3        -3   # BR(H -> s       sb     )
     1.00668522E-05    2           4        -4   # BR(H -> c       cb     )
     9.96068437E-01    2           6        -6   # BR(H -> t       tb     )
     7.97668192E-04    2          21        21   # BR(H -> g       g      )
     2.71270449E-06    2          22        22   # BR(H -> gam     gam    )
     1.16012013E-06    2          23        22   # BR(H -> Z       gam    )
     3.34445700E-04    2          24       -24   # BR(H -> W+      W-     )
     1.66766754E-04    2          23        23   # BR(H -> Z       Z      )
     9.03263144E-04    2          25        25   # BR(H -> h       h      )
     7.36381910E-24    2          36        36   # BR(H -> A       A      )
     2.95547668E-11    2          23        36   # BR(H -> Z       A      )
     6.69620610E-12    2          24       -37   # BR(H -> W+      H-     )
     6.69620610E-12    2         -24        37   # BR(H -> W-      H+     )
#
#         PDG            Width
DECAY        36     3.82380743E+01   # A decays
#          BR         NDA      ID1       ID2
     1.46999187E-03    2           5        -5   # BR(A -> b       bb     )
     2.43898694E-04    2         -15        15   # BR(A -> tau+    tau-   )
     8.62269991E-07    2         -13        13   # BR(A -> mu+     mu-    )
     1.13677850E-06    2           3        -3   # BR(A -> s       sb     )
     9.96180460E-06    2           4        -4   # BR(A -> c       cb     )
     9.96999972E-01    2           6        -6   # BR(A -> t       tb     )
     9.43679415E-04    2          21        21   # BR(A -> g       g      )
     3.16291004E-06    2          22        22   # BR(A -> gam     gam    )
     1.35269947E-06    2          23        22   # BR(A -> Z       gam    )
     3.25981089E-04    2          23        25   # BR(A -> Z       h      )
#
#         PDG            Width
DECAY        37     3.74471767E+01   # H+ decays
#          BR         NDA      ID1       ID2
     2.35540187E-06    2           4        -5   # BR(H+ -> c       bb     )
     2.49238702E-04    2         -15        16   # BR(H+ -> tau+    nu_tau )
     8.81148847E-07    2         -13        14   # BR(H+ -> mu+     nu_mu  )
     1.49746854E-08    2           2        -5   # BR(H+ -> u       bb     )
     5.45696495E-08    2           2        -3   # BR(H+ -> u       sb     )
     1.08732096E-05    2           4        -3   # BR(H+ -> c       sb     )
     9.99402486E-01    2           6        -5   # BR(H+ -> t       bb     )
     3.34095953E-04    2          24        25   # BR(H+ -> W+      h      )
     2.81218996E-13    2          24        36   # BR(H+ -> W+      A      )
