#
#                              ======================
#                              | THE SUSYHIT OUTPUT |
#                              ======================
#
#
#              ------------------------------------------------------
#              |     This is the output of the SUSY-HIT package     |
#              |  created by A.Djouadi, M.Muehlleitner and M.Spira. |
#              |  In case of problems with SUSY-HIT email to        |
#              |           margarete.muehlleitner@cern.ch           |
#              |           michael.spira@psi.ch                     |
#              |           abdelhak.djouadi@cern.ch                 |
#              ------------------------------------------------------
#
#              ------------------------------------------------------
#              |  SUSY Les Houches Accord - MSSM Spectrum + Decays  |
#              |              based on the decay programs           |
#              |                                                    |
#              |                     SDECAY 1.3b                    |
#              |                                                    |
#              |  Authors: M.Muhlleitner, A.Djouadi and Y.Mambrini  |
#              |  Ref.:    Comput.Phys.Commun.168(2005)46           |
#              |           [hep-ph/0311167]                         |
#              |                                                    |
#              |                     HDECAY 3.4                     |
#              |                                                    |
#              |  By: A.Djouadi,J.Kalinowski,M.Muhlleitner,M.Spira  |
#              |  Ref.:    Comput.Phys.Commun.108(1998)56           |
#              |           [hep-ph/9704448]                         |
#              |                                                    |
#              |                                                    |
#              |  If not stated otherwise all DRbar couplings and   |
#              |  soft SUSY breaking masses are given at the scale  |
#              |  Q=  0.50007579E+04
#              |                                                    |
#              ------------------------------------------------------
#
#
BLOCK DCINFO  # Decay Program information
     1   SDECAY/HDECAY # decay calculator
     2   1.3b  /3.4    # version number
#
BLOCK SPINFO  # Spectrum calculator information
     1    SOFTSUSY    # spectrum calculator                
     2    3.4.0       # version number                     
#
BLOCK MODSEL  # Model selection
     1     0   #  nonUniversal                                     
#
BLOCK SMINPUTS  # Standard Model inputs
         1     1.25778332E+02   # alpha_em^-1(M_Z)^MSbar
         2     1.16570000E-05   # G_F [GeV^-2]
         3     1.17200002E-01   # alpha_S(M_Z)^MSbar
         4     9.11876000E+01   # M_Z pole mass
         5     4.25000000E+00   # mb(mb)^MSbar
         6     1.72500000E+02   # mt pole mass
         7     1.77682000E+00   # mtau pole mass
#
BLOCK MINPAR  # Input parameters - minimal models
         3     1.00000000E+01   # tanb                
#
BLOCK EXTPAR  # Input parameters - non-minimal models
         0    -1.00000000E+00   # Set                 
         1     6.00000000E+01   # M_1(MX)             
         2     3.00000000E+03   # M_2(MX)             
         3     1.94902700E+03   # M_3(MX)             
        11     5.00000000E+03   # At(MX)              
        12     5.00000000E+03   # Ab(MX)              
        13     0.00000000E+00   # Atau(MX)            
        23    -5.71329000E+02   # mu(MX)              
        26     3.00000000E+03   # mA(pole)            
        31     5.00000000E+03   # meL(MX)             
        32     5.00000000E+03   # mmuL(MX)            
        33     5.00000000E+03   # mtauL(MX)           
        34     5.00000000E+03   # meR(MX)             
        35     5.00000000E+03   # mmuR(MX)            
        36     5.00000000E+03   # mtauR(MX)           
        41     5.00000000E+03   # mqL1(MX)            
        42     5.00000000E+03   # mqL2(MX)            
        43     5.00000000E+03   # mqL3(MX)            
        44     5.00000000E+03   # muR(MX)             
        45     5.00000000E+03   # mcR(MX)             
        46     5.00000000E+03   # mtR(MX)             
        47     5.00000000E+03   # mdR(MX)             
        48     5.00000000E+03   # msR(MX)             
        49     5.00000000E+03   # mbR(MX)             
#
BLOCK MASS  # Mass Spectrum
# PDG code           mass       particle
        24     8.00937758E+01   # W+
        25     1.24794538E+02   # h
        35     3.00008468E+03   # H
        36     2.99999920E+03   # A
        37     3.00140483E+03   # H+
         5     4.87878001E+00   # b-quark pole mass calculated from mb(mb)_Msbar
   1000001     5.07639689E+03   # ~d_L
   2000001     5.05858177E+03   # ~d_R
   1000002     5.07592412E+03   # ~u_L
   2000002     5.05828521E+03   # ~u_R
   1000003     5.07639689E+03   # ~s_L
   2000003     5.05858177E+03   # ~s_R
   1000004     5.07592412E+03   # ~c_L
   2000004     5.05828521E+03   # ~c_R
   1000005     5.02215853E+03   # ~b_1
   2000005     5.05685743E+03   # ~b_2
   1000006     4.91361169E+03   # ~t_1
   2000006     5.06583714E+03   # ~t_2
   1000011     5.01909755E+03   # ~e_L
   2000011     5.00593930E+03   # ~e_R
   1000012     5.01814787E+03   # ~nu_eL
   1000013     5.01909755E+03   # ~mu_L
   2000013     5.00593930E+03   # ~mu_R
   1000014     5.01814787E+03   # ~nu_muL
   1000015     5.00474864E+03   # ~tau_1
   2000015     5.01864868E+03   # ~tau_2
   1000016     5.01759730E+03   # ~nu_tauL
   1000021     2.30000075E+03   # ~g
   1000022     6.02510366E+01   # ~chi_10
   1000023     6.00199448E+02   # ~chi_20
   1000025    -6.02417075E+02   # ~chi_30
   1000035     3.07418020E+03   # ~chi_40
   1000024     6.00000701E+02   # ~chi_1+
   1000037     3.07434782E+03   # ~chi_2+
#
BLOCK NMIX  # Neutralino Mixing Matrix
  1  1     9.97249238E-01   # N_11
  1  2     2.27064164E-04   # N_12
  1  3    -7.41204920E-02   # N_13
  1  4     2.42614570E-04   # N_14
  2  1     5.22668617E-02   # N_21
  2  2     1.97524736E-02   # N_22
  2  3     7.05593785E-01   # N_23
  2  4     7.06410239E-01   # N_24
  3  1    -5.25545563E-02   # N_31
  3  2     1.65483845E-02   # N_32
  3  3    -7.04725805E-01   # N_33
  3  4     7.07337055E-01   # N_34
  4  1    -3.89275635E-04   # N_41
  4  2     9.99667914E-01   # N_42
  4  3    -2.25906908E-03   # N_43
  4  4    -2.56672139E-02   # N_44
#
BLOCK UMIX  # Chargino Mixing Matrix U
  1  1     3.20192799E-03   # U_11
  1  2     9.99994874E-01   # U_12
  2  1    -9.99994874E-01   # U_21
  2  2     3.20192799E-03   # U_22
#
BLOCK VMIX  # Chargino Mixing Matrix V
  1  1     3.63228270E-02   # V_11
  1  2    -9.99340108E-01   # V_12
  2  1    -9.99340108E-01   # V_21
  2  2    -3.63228270E-02   # V_22
#
BLOCK STOPMIX  # Stop Mixing Matrix
  1  1    -5.03213102E-01   # cos(theta_t)
  1  2     8.64162354E-01   # sin(theta_t)
  2  1    -8.64162354E-01   # -sin(theta_t)
  2  2    -5.03213102E-01   # cos(theta_t)
#
BLOCK SBOTMIX  # Sbottom Mixing Matrix
  1  1     9.98497142E-01   # cos(theta_b)
  1  2    -5.48038084E-02   # sin(theta_b)
  2  1     5.48038084E-02   # -sin(theta_b)
  2  2     9.98497142E-01   # cos(theta_b)
#
BLOCK STAUMIX  # Stau Mixing Matrix
  1  1    -6.84583644E-02   # cos(theta_tau)
  1  2     9.97653974E-01   # sin(theta_tau)
  2  1    -9.97653974E-01   # -sin(theta_tau)
  2  2    -6.84583644E-02   # cos(theta_tau)
#
BLOCK ALPHA  # Higgs mixing
          -1.05488090E-01   # Mixing angle in the neutral Higgs boson sector
#
BLOCK HMIX Q=  5.00075793E+03  # DRbar Higgs Parameters
         1    -5.81806704E+02   # mu(Q)MSSM           
         2     9.46892289E+00   # tan                 
         3     2.41769049E+02   # higgs               
         4     8.64350567E+06   # mA^2(Q)MSSM         
#
BLOCK GAUGE Q=  5.00075793E+03  # The gauge couplings
     1     3.70908763E-01   # gprime(Q) DRbar
     2     6.33108989E-01   # g(Q) DRbar
     3     9.96449664E-01   # g3(Q) DRbar
#
BLOCK AU Q=  5.00075793E+03  # The trilinear couplings
  1  1     5.00000001E+03   # A_u(Q) DRbar
  2  2     5.00000001E+03   # A_c(Q) DRbar
  3  3     5.00000002E+03   # A_t(Q) DRbar
#
BLOCK AD Q=  5.00075793E+03  # The trilinear couplings
  1  1     5.00000001E+03   # A_d(Q) DRbar
  2  2     5.00000001E+03   # A_s(Q) DRbar
  3  3     5.00000001E+03   # A_b(Q) DRbar
#
BLOCK AE Q=  5.00075793E+03  # The trilinear couplings
  1  1     0.00000000E+00   # A_e(Q) DRbar
  2  2     2.17867088E-07   # A_mu(Q) DRbar
  3  3     2.17677765E-07   # A_tau(Q) DRbar
#
BLOCK Yu Q=  5.00075793E+03  # The Yukawa couplings
  1  1     0.00000000E+00   # y_u(Q) DRbar
  2  2     0.00000000E+00   # y_c(Q) DRbar
  3  3     8.20920431E-01   # y_t(Q) DRbar
#
BLOCK Yd Q=  5.00075793E+03  # The Yukawa couplings
  1  1     0.00000000E+00   # y_d(Q) DRbar
  2  2     0.00000000E+00   # y_s(Q) DRbar
  3  3     1.30345731E-01   # y_b(Q) DRbar
#
BLOCK Ye Q=  5.00075793E+03  # The Yukawa couplings
  1  1     0.00000000E+00   # y_e(Q) DRbar
  2  2     0.00000000E+00   # y_mu(Q) DRbar
  3  3     9.70741974E-02   # y_tau(Q) DRbar
#
BLOCK MSOFT Q=  5.00075793E+03  # The soft SUSY breaking masses at the scale Q
         1     6.00000000E+01   # M_1(Q)              
         2     3.00000000E+03   # M_2(Q)              
         3     1.94902700E+03   # M_3(Q)              
        21     8.38112069E+06   # mH1^2(Q)            
        22     2.36619298E+05   # mH2^2(Q)            
        31     5.00000000E+03   # meL(Q)              
        32     5.00000000E+03   # mmuL(Q)             
        33     5.00000000E+03   # mtauL(Q)            
        34     5.00000000E+03   # meR(Q)              
        35     5.00000000E+03   # mmuR(Q)             
        36     5.00000000E+03   # mtauR(Q)            
        41     5.00000000E+03   # mqL1(Q)             
        42     5.00000000E+03   # mqL2(Q)             
        43     4.99999999E+03   # mqL3(Q)             
        44     5.00000000E+03   # muR(Q)              
        45     5.00000000E+03   # mcR(Q)              
        46     4.99999999E+03   # mtR(Q)              
        47     5.00000000E+03   # mdR(Q)              
        48     5.00000000E+03   # msR(Q)              
        49     5.00000000E+03   # mbR(Q)              
#
#
#
#                             =================
#                             |The decay table|
#                             =================
#
# - The QCD corrections to the decays gluino -> squark  + quark
#                                     squark -> gaugino + quark_prime
#                                     squark -> squark_prime + Higgs
#                                     squark -> gluino  + quark
#   are included.
#
# - The multi-body decays for the inos, stops and sbottoms are included.
#
# - The loop induced decays for the gluino, neutralinos and stops
#   are included.
#
# - The SUSY decays of the top quark are included.
#
#
#         PDG            Width
DECAY         6     1.40468738E+00   # top decays
#          BR         NDA      ID1       ID2
     1.00000000E+00    2           5        24   # BR(t ->  b    W+)
#
#         PDG            Width
DECAY   1000021     3.78351515E-03   # gluino decays
#          BR         NDA      ID1       ID2
     7.66537269E-07    2     1000022        21   # BR(~g -> ~chi_10 g)
     5.49013028E-03    2     1000023        21   # BR(~g -> ~chi_20 g)
     5.35401402E-03    2     1000025        21   # BR(~g -> ~chi_30 g)
#           BR         NDA      ID1       ID2       ID3
     1.27909198E-02    3     1000022         1        -1   # BR(~g -> ~chi_10 d  db)
     2.72647935E-05    3     1000023         1        -1   # BR(~g -> ~chi_20 d  db)
     3.05631970E-05    3     1000025         1        -1   # BR(~g -> ~chi_30 d  db)
     4.36207968E-02    3     1000022         2        -2   # BR(~g -> ~chi_10 u  ub)
     1.37359252E-04    3     1000023         2        -2   # BR(~g -> ~chi_20 u  ub)
     4.66913020E-05    3     1000025         2        -2   # BR(~g -> ~chi_30 u  ub)
     1.27909198E-02    3     1000022         3        -3   # BR(~g -> ~chi_10 s  sb)
     2.72647935E-05    3     1000023         3        -3   # BR(~g -> ~chi_20 s  sb)
     3.05631970E-05    3     1000025         3        -3   # BR(~g -> ~chi_30 s  sb)
     4.36207968E-02    3     1000022         4        -4   # BR(~g -> ~chi_10 c  cb)
     1.37359252E-04    3     1000023         4        -4   # BR(~g -> ~chi_20 c  cb)
     4.66913020E-05    3     1000025         4        -4   # BR(~g -> ~chi_30 c  cb)
     1.30449886E-02    3     1000022         5        -5   # BR(~g -> ~chi_10 b  bb)
     5.23548375E-03    3     1000023         5        -5   # BR(~g -> ~chi_20 b  bb)
     5.20152734E-03    3     1000025         5        -5   # BR(~g -> ~chi_30 b  bb)
     4.36540439E-02    3     1000022         6        -6   # BR(~g -> ~chi_10 t  tb)
     2.01424718E-01    3     1000023         6        -6   # BR(~g -> ~chi_20 t  tb)
     1.88136361E-01    3     1000025         6        -6   # BR(~g -> ~chi_30 t  tb)
     5.61242655E-05    3     1000024         1        -2   # BR(~g -> ~chi_1+ d  ub)
     5.61242655E-05    3    -1000024         2        -1   # BR(~g -> ~chi_1- u  db)
     5.61242655E-05    3     1000024         3        -4   # BR(~g -> ~chi_1+ s  cb)
     5.61242655E-05    3    -1000024         4        -3   # BR(~g -> ~chi_1- c  sb)
     2.09463140E-01    3     1000024         5        -6   # BR(~g -> ~chi_1+ b  tb)
     2.09463140E-01    3    -1000024         6        -5   # BR(~g -> ~chi_1- t  bb)
#
#         PDG            Width
DECAY   1000006     3.19917540E+02   # stop1 decays
#          BR         NDA      ID1       ID2
     2.76452072E-02    2     1000022         6   # BR(~t_1 -> ~chi_10 t )
     1.01210226E-01    2     1000023         6   # BR(~t_1 -> ~chi_20 t )
     9.63505267E-02    2     1000025         6   # BR(~t_1 -> ~chi_30 t )
     6.32769271E-03    2     1000035         6   # BR(~t_1 -> ~chi_40 t )
     1.47809230E-01    2     1000024         5   # BR(~t_1 -> ~chi_1+ b )
     1.26132075E-02    2     1000037         5   # BR(~t_1 -> ~chi_2+ b )
     6.08043911E-01    2     1000021         6   # BR(~t_1 -> ~g      t )
#
#         PDG            Width
DECAY   2000006     3.26317268E+02   # stop2 decays
#          BR         NDA      ID1       ID2
     1.05467319E-02    2     1000022         6   # BR(~t_2 -> ~chi_10 t )
     9.99990130E-02    2     1000023         6   # BR(~t_2 -> ~chi_20 t )
     1.05326856E-01    2     1000025         6   # BR(~t_2 -> ~chi_30 t )
     1.72791373E-02    2     1000035         6   # BR(~t_2 -> ~chi_40 t )
     5.83276699E-02    2     1000024         5   # BR(~t_2 -> ~chi_1+ b )
     3.44020615E-02    2     1000037         5   # BR(~t_2 -> ~chi_2+ b )
     6.70424400E-01    2     1000021         6   # BR(~t_2 -> ~g      t )
     8.54555730E-04    2     1000006        25   # BR(~t_2 -> ~t_1    h )
     2.83957517E-03    2     1000006        23   # BR(~t_2 -> ~t_1    Z )
#
#         PDG            Width
DECAY   1000005     3.00901133E+02   # sbottom1 decays
#          BR         NDA      ID1       ID2
     2.56982792E-03    2     1000022         5   # BR(~b_1 -> ~chi_10 b )
     2.72826443E-03    2     1000023         5   # BR(~b_1 -> ~chi_20 b )
     2.71047889E-03    2     1000025         5   # BR(~b_1 -> ~chi_30 b )
     2.52534737E-02    2     1000035         5   # BR(~b_1 -> ~chi_40 b )
     2.17011445E-01    2    -1000024         6   # BR(~b_1 -> ~chi_1- t )
     5.07077279E-02    2    -1000037         6   # BR(~b_1 -> ~chi_2- t )
     6.97203228E-01    2     1000021         5   # BR(~b_1 -> ~g      b )
     1.81555418E-03    2     1000006       -24   # BR(~b_1 -> ~t_1    W-)
#
#         PDG            Width
DECAY   2000005     2.19083655E+02   # sbottom2 decays
#          BR         NDA      ID1       ID2
     1.33889235E-02    2     1000022         5   # BR(~b_2 -> ~chi_10 b )
     3.84441444E-03    2     1000023         5   # BR(~b_2 -> ~chi_20 b )
     3.90349195E-03    2     1000025         5   # BR(~b_2 -> ~chi_30 b )
     9.87089262E-05    2     1000035         5   # BR(~b_2 -> ~chi_40 b )
     8.41529586E-03    2    -1000024         6   # BR(~b_2 -> ~chi_1- t )
     1.98213169E-04    2    -1000037         6   # BR(~b_2 -> ~chi_2- t )
     9.70119312E-01    2     1000021         5   # BR(~b_2 -> ~g      b )
     3.16401163E-05    2     1000006       -24   # BR(~b_2 -> ~t_1    W-)
#
#         PDG            Width
DECAY   1000002     2.38557154E+02   # sup_L decays
#          BR         NDA      ID1       ID2
     3.11680741E-03    2     1000022         2   # BR(~u_L -> ~chi_10 u)
     7.16613706E-05    2     1000023         2   # BR(~u_L -> ~chi_20 u)
     3.15342868E-06    2     1000025         2   # BR(~u_L -> ~chi_30 u)
     3.30886195E-02    2     1000035         2   # BR(~u_L -> ~chi_40 u)
     2.10676924E-04    2     1000024         1   # BR(~u_L -> ~chi_1+ d)
     6.61356137E-02    2     1000037         1   # BR(~u_L -> ~chi_2+ d)
     8.97373468E-01    2     1000021         2   # BR(~u_L -> ~g      u)
#
#         PDG            Width
DECAY   2000002     2.24452085E+02   # sup_R decays
#          BR         NDA      ID1       ID2
     5.26926771E-02    2     1000022         2   # BR(~u_R -> ~chi_10 u)
     1.40922137E-04    2     1000023         2   # BR(~u_R -> ~chi_20 u)
     1.42448283E-04    2     1000025         2   # BR(~u_R -> ~chi_30 u)
     3.21706655E-09    2     1000035         2   # BR(~u_R -> ~chi_40 u)
     9.47023949E-01    2     1000021         2   # BR(~u_R -> ~g      u)
#
#         PDG            Width
DECAY   1000001     2.38572389E+02   # sdown_L decays
#          BR         NDA      ID1       ID2
     3.10240066E-03    2     1000022         1   # BR(~d_L -> ~chi_10 d)
     7.27510795E-06    2     1000023         1   # BR(~d_L -> ~chi_20 d)
     5.73835020E-05    2     1000025         1   # BR(~d_L -> ~chi_30 d)
     3.31067511E-02    2     1000035         1   # BR(~d_L -> ~chi_40 d)
     1.63717957E-06    2    -1000024         2   # BR(~d_L -> ~chi_1- u)
     6.62384449E-02    2    -1000037         2   # BR(~d_L -> ~chi_2- u)
     8.97486108E-01    2     1000021         1   # BR(~d_L -> ~g      d)
#
#         PDG            Width
DECAY   2000001     2.15559778E+02   # sdown_R decays
#          BR         NDA      ID1       ID2
     1.37174083E-02    2     1000022         1   # BR(~d_R -> ~chi_10 d)
     3.66861708E-05    2     1000023         1   # BR(~d_R -> ~chi_20 d)
     3.70834721E-05    2     1000025         1   # BR(~d_R -> ~chi_30 d)
     8.37607742E-10    2     1000035         1   # BR(~d_R -> ~chi_40 d)
     9.86208821E-01    2     1000021         1   # BR(~d_R -> ~g      d)
#
#         PDG            Width
DECAY   1000004     2.38557154E+02   # scharm_L decays
#          BR         NDA      ID1       ID2
     3.11680741E-03    2     1000022         4   # BR(~c_L -> ~chi_10 c)
     7.16613706E-05    2     1000023         4   # BR(~c_L -> ~chi_20 c)
     3.15342868E-06    2     1000025         4   # BR(~c_L -> ~chi_30 c)
     3.30886195E-02    2     1000035         4   # BR(~c_L -> ~chi_40 c)
     2.10676924E-04    2     1000024         3   # BR(~c_L -> ~chi_1+ s)
     6.61356137E-02    2     1000037         3   # BR(~c_L -> ~chi_2+ s)
     8.97373468E-01    2     1000021         4   # BR(~c_L -> ~g      c)
#
#         PDG            Width
DECAY   2000004     2.24452085E+02   # scharm_R decays
#          BR         NDA      ID1       ID2
     5.26926771E-02    2     1000022         4   # BR(~c_R -> ~chi_10 c)
     1.40922137E-04    2     1000023         4   # BR(~c_R -> ~chi_20 c)
     1.42448283E-04    2     1000025         4   # BR(~c_R -> ~chi_30 c)
     3.21706655E-09    2     1000035         4   # BR(~c_R -> ~chi_40 c)
     9.47023949E-01    2     1000021         4   # BR(~c_R -> ~g      c)
#
#         PDG            Width
DECAY   1000003     2.38572389E+02   # sstrange_L decays
#          BR         NDA      ID1       ID2
     3.10240066E-03    2     1000022         3   # BR(~s_L -> ~chi_10 s)
     7.27510795E-06    2     1000023         3   # BR(~s_L -> ~chi_20 s)
     5.73835020E-05    2     1000025         3   # BR(~s_L -> ~chi_30 s)
     3.31067511E-02    2     1000035         3   # BR(~s_L -> ~chi_40 s)
     1.63717957E-06    2    -1000024         4   # BR(~s_L -> ~chi_1- c)
     6.62384449E-02    2    -1000037         4   # BR(~s_L -> ~chi_2- c)
     8.97486108E-01    2     1000021         3   # BR(~s_L -> ~g      s)
#
#         PDG            Width
DECAY   2000003     2.15559778E+02   # sstrange_R decays
#          BR         NDA      ID1       ID2
     1.37174083E-02    2     1000022         3   # BR(~s_R -> ~chi_10 s)
     3.66861708E-05    2     1000023         3   # BR(~s_R -> ~chi_20 s)
     3.70834721E-05    2     1000025         3   # BR(~s_R -> ~chi_30 s)
     8.37607742E-10    2     1000035         3   # BR(~s_R -> ~chi_40 s)
     9.86208821E-01    2     1000021         3   # BR(~s_R -> ~g      s)
#
#         PDG            Width
DECAY   1000011     3.03165278E+01   # selectron_L decays
#          BR         NDA      ID1       ID2
     2.25424063E-01    2     1000022        11   # BR(~e_L -> ~chi_10 e-)
     1.62738842E-03    2     1000023        11   # BR(~e_L -> ~chi_20 e-)
     1.30038405E-04    2     1000025        11   # BR(~e_L -> ~chi_30 e-)
     2.57433617E-01    2     1000035        11   # BR(~e_L -> ~chi_40 e-)
     1.31508598E-05    2    -1000024        12   # BR(~e_L -> ~chi_1- nu_e)
     5.15371742E-01    2    -1000037        12   # BR(~e_L -> ~chi_2- nu_e)
#
#         PDG            Width
DECAY   2000011     2.73896411E+01   # selectron_R decays
#          BR         NDA      ID1       ID2
     9.94661151E-01    2     1000022        11   # BR(~e_R -> ~chi_10 e-)
     2.65503029E-03    2     1000023        11   # BR(~e_R -> ~chi_20 e-)
     2.68375945E-03    2     1000025        11   # BR(~e_R -> ~chi_30 e-)
     5.88175856E-08    2     1000035        11   # BR(~e_R -> ~chi_40 e-)
#
#         PDG            Width
DECAY   1000013     3.03165278E+01   # smuon_L decays
#          BR         NDA      ID1       ID2
     2.25424063E-01    2     1000022        13   # BR(~mu_L -> ~chi_10 mu-)
     1.62738842E-03    2     1000023        13   # BR(~mu_L -> ~chi_20 mu-)
     1.30038405E-04    2     1000025        13   # BR(~mu_L -> ~chi_30 mu-)
     2.57433617E-01    2     1000035        13   # BR(~mu_L -> ~chi_40 mu-)
     1.31508598E-05    2    -1000024        14   # BR(~mu_L -> ~chi_1- nu_mu)
     5.15371742E-01    2    -1000037        14   # BR(~mu_L -> ~chi_2- nu_mu)
#
#         PDG            Width
DECAY   2000013     2.73896411E+01   # smuon_R decays
#          BR         NDA      ID1       ID2
     9.94661151E-01    2     1000022        13   # BR(~mu_R -> ~chi_10 mu-)
     2.65503029E-03    2     1000023        13   # BR(~mu_R -> ~chi_20 mu-)
     2.68375945E-03    2     1000025        13   # BR(~mu_R -> ~chi_30 mu-)
     5.88175856E-08    2     1000035        13   # BR(~mu_R -> ~chi_40 mu-)
#
#         PDG            Width
DECAY   1000015     2.92174639E+01   # stau_1 decays
#          BR         NDA      ID1       ID2
     9.29989400E-01    2     1000022        15   # BR(~tau_1 -> ~chi_10  tau-)
     1.78640935E-02    2     1000023        15   # BR(~tau_1 -> ~chi_20  tau-)
     1.73391749E-02    2     1000025        15   # BR(~tau_1 -> ~chi_30  tau-)
     1.22209773E-03    2     1000035        15   # BR(~tau_1 -> ~chi_40  tau-)
     3.11388187E-02    2    -1000024        16   # BR(~tau_1 -> ~chi_1-  nu_tau)
     2.44641476E-03    2    -1000037        16   # BR(~tau_1 -> ~chi_2-  nu_tau)
#
#         PDG            Width
DECAY   2000015     3.12108512E+01   # stau_2 decays
#          BR         NDA      ID1       ID2
     2.21364359E-01    2     1000022        15   # BR(~tau_2 -> ~chi_10  tau-)
     1.63082480E-02    2     1000023        15   # BR(~tau_2 -> ~chi_20  tau-)
     1.52950482E-02    2     1000025        15   # BR(~tau_2 -> ~chi_30  tau-)
     2.48825898E-01    2     1000035        15   # BR(~tau_2 -> ~chi_40  tau-)
     6.64312002E-05    2    -1000024        16   # BR(~tau_2 -> ~chi_1-  nu_tau)
     4.98140016E-01    2    -1000037        16   # BR(~tau_2 -> ~chi_2-  nu_tau)
#
#         PDG            Width
DECAY   1000012     3.03196855E+01   # snu_eL decays
#          BR         NDA      ID1       ID2
     2.25007845E-01    2     1000022        12   # BR(~nu_eL -> ~chi_10 nu_e)
     7.57316511E-05    2     1000023        12   # BR(~nu_eL -> ~chi_20 nu_e)
     1.43641561E-03    2     1000025        12   # BR(~nu_eL -> ~chi_30 nu_e)
     2.57475985E-01    2     1000035        12   # BR(~nu_eL -> ~chi_40 nu_e)
     1.69183548E-03    2     1000024        11   # BR(~nu_eL -> ~chi_1+ e-)
     5.14312187E-01    2     1000037        11   # BR(~nu_eL -> ~chi_2+ e-)
#
#         PDG            Width
DECAY   1000014     3.03196855E+01   # snu_muL decays
#          BR         NDA      ID1       ID2
     2.25007845E-01    2     1000022        14   # BR(~nu_muL -> ~chi_10 nu_mu)
     7.57316511E-05    2     1000023        14   # BR(~nu_muL -> ~chi_20 nu_mu)
     1.43641561E-03    2     1000025        14   # BR(~nu_muL -> ~chi_30 nu_mu)
     2.57475985E-01    2     1000035        14   # BR(~nu_muL -> ~chi_40 nu_mu)
     1.69183548E-03    2     1000024        13   # BR(~nu_muL -> ~chi_1+ mu-)
     5.14312187E-01    2     1000037        13   # BR(~nu_muL -> ~chi_2+ mu-)
#
#         PDG            Width
DECAY   1000016     3.12241513E+01   # snu_tauL decays
#          BR         NDA      ID1       ID2
     2.18466088E-01    2     1000022        16   # BR(~nu_tauL -> ~chi_10 nu_tau)
     7.35294059E-05    2     1000023        16   # BR(~nu_tauL -> ~chi_20 nu_tau)
     1.39464517E-03    2     1000025        16   # BR(~nu_tauL -> ~chi_30 nu_tau)
     2.49924366E-01    2     1000035        16   # BR(~nu_tauL -> ~chi_40 nu_tau)
     3.09142229E-02    2     1000024        15   # BR(~nu_tauL -> ~chi_1+ tau-)
     4.99227149E-01    2     1000037        15   # BR(~nu_tauL -> ~chi_2+ tau-)
#
#         PDG            Width
DECAY   1000024     3.57397360E-01   # chargino1+ decays
#          BR         NDA      ID1       ID2
     1.00000000E+00    2     1000022        24   # BR(~chi_1+ -> ~chi_10  W+)
#
#         PDG            Width
DECAY   1000037     2.18084625E+01   # chargino2+ decays
#          BR         NDA      ID1       ID2
     2.53500644E-01    2     1000024        23   # BR(~chi_2+ -> ~chi_1+  Z )
     1.69252082E-04    2     1000022        24   # BR(~chi_2+ -> ~chi_10  W+)
     2.44751937E-01    2     1000023        24   # BR(~chi_2+ -> ~chi_20  W+)
     2.44323354E-01    2     1000025        24   # BR(~chi_2+ -> ~chi_30  W+)
     2.57251266E-01    2     1000024        25   # BR(~chi_2+ -> ~chi_1+  h )
     3.54712655E-06    2     1000022        37   # BR(~chi_2+ -> ~chi_10  H+)
#
#         PDG            Width
DECAY   1000022     0.00000000E+00   # neutralino1 decays
#
#         PDG            Width
DECAY   1000023     3.66159833E-01   # neutralino2 decays
#          BR         NDA      ID1       ID2
     5.14070328E-01    2     1000022        23   # BR(~chi_20 -> ~chi_10   Z )
     4.85929672E-01    2     1000022        25   # BR(~chi_20 -> ~chi_10   h )
#
#         PDG            Width
DECAY   1000025     3.61786833E-01   # neutralino3 decays
#          BR         NDA      ID1       ID2
     5.03966209E-01    2     1000022        23   # BR(~chi_30 -> ~chi_10   Z )
     4.96033791E-01    2     1000022        25   # BR(~chi_30 -> ~chi_10   h )
#
#         PDG            Width
DECAY   1000035     2.18220375E+01   # neutralino4 decays
#          BR         NDA      ID1       ID2
     1.29179103E-05    2     1000022        23   # BR(~chi_40 -> ~chi_10   Z )
     1.04469224E-01    2     1000023        23   # BR(~chi_40 -> ~chi_20   Z )
     1.48495110E-01    2     1000025        23   # BR(~chi_40 -> ~chi_30   Z )
     2.45086876E-01    2     1000024       -24   # BR(~chi_40 -> ~chi_1+   W-)
     2.45086876E-01    2    -1000024        24   # BR(~chi_40 -> ~chi_1-   W+)
     1.51389082E-04    2     1000022        25   # BR(~chi_40 -> ~chi_10   h )
     3.40138948E-06    2     1000022        35   # BR(~chi_40 -> ~chi_10   H )
     3.79051914E-07    2     1000022        36   # BR(~chi_40 -> ~chi_10   A )
     1.51935197E-01    2     1000023        25   # BR(~chi_40 -> ~chi_20   h )
     1.04758630E-01    2     1000025        25   # BR(~chi_40 -> ~chi_30   h )
#
#         PDG            Width
DECAY        25     4.06938924E-03   # h decays
#          BR         NDA      ID1       ID2
     6.08623464E-01    2           5        -5   # BR(h -> b       bb     )
     6.37529319E-02    2         -15        15   # BR(h -> tau+    tau-   )
     2.25708466E-04    2         -13        13   # BR(h -> mu+     mu-    )
     4.78472343E-04    2           3        -3   # BR(h -> s       sb     )
     2.07315358E-02    2           4        -4   # BR(h -> c       cb     )
     6.70862964E-02    2          21        21   # BR(h -> g       g      )
     2.30651035E-03    2          22        22   # BR(h -> gam     gam    )
     1.48926393E-03    2          22        23   # BR(h -> Z       gam    )
     2.10170789E-01    2          24       -24   # BR(h -> W+      W-     )
     2.50485864E-02    2          23        23   # BR(h -> Z       Z      )
     8.64413376E-05    2     1000022   1000022   # BR(h -> ~chi_10 ~chi_10)
#
#         PDG            Width
DECAY        35     8.57771453E+00   # H decays
#          BR         NDA      ID1       ID2
     3.72836442E-01    2           5        -5   # BR(H -> b       bb     )
     6.49361031E-02    2         -15        15   # BR(H -> tau+    tau-   )
     2.29619218E-04    2         -13        13   # BR(H -> mu+     mu-    )
     2.81477914E-04    2           3        -3   # BR(H -> s       sb     )
     1.57523031E-06    2           4        -4   # BR(H -> c       cb     )
     1.57377987E-01    2           6        -6   # BR(H -> t       tb     )
     5.23357880E-05    2          21        21   # BR(H -> g       g      )
     1.64442794E-07    2          22        22   # BR(H -> gam     gam    )
     9.28939456E-08    2          23        22   # BR(H -> Z       gam    )
     7.46517155E-05    2          24       -24   # BR(H -> W+      W-     )
     3.72786070E-05    2          23        23   # BR(H -> Z       Z      )
     2.71732742E-04    2          25        25   # BR(H -> h       h      )
    -4.93100997E-23    2          36        36   # BR(H -> A       A      )
     9.44554405E-19    2          23        36   # BR(H -> Z       A      )
     3.01199598E-03    2     1000024  -1000024   # BR(H -> ~chi_1+ ~chi_1-)
     4.69214267E-03    2     1000022   1000022   # BR(H -> ~chi_10 ~chi_10)
     1.03129240E-04    2     1000023   1000023   # BR(H -> ~chi_20 ~chi_20)
     1.80808804E-03    2     1000025   1000025   # BR(H -> ~chi_30 ~chi_30)
     2.37468290E-01    2     1000022   1000023   # BR(H -> ~chi_10 ~chi_20)
     1.54607037E-01    2     1000022   1000025   # BR(H -> ~chi_10 ~chi_30)
     2.20985610E-03    2     1000023   1000025   # BR(H -> ~chi_20 ~chi_30)
#
#         PDG            Width
DECAY        36     8.58608258E+00   # A decays
#          BR         NDA      ID1       ID2
     3.72600001E-01    2           5        -5   # BR(A -> b       bb     )
     6.48747557E-02    2         -15        15   # BR(A -> tau+    tau-   )
     2.29401969E-04    2         -13        13   # BR(A -> mu+     mu-    )
     2.81417196E-04    2           3        -3   # BR(A -> s       sb     )
     1.58002084E-06    2           4        -4   # BR(A -> c       cb     )
     1.57769499E-01    2           6        -6   # BR(A -> t       tb     )
     1.56114973E-04    2          21        21   # BR(A -> g       g      )
     5.99262667E-07    2          22        22   # BR(A -> gam     gam    )
     1.89010838E-07    2          23        22   # BR(A -> Z       gam    )
     7.42966739E-05    2          23        25   # BR(A -> Z       h      )
     3.45123232E-03    2     1000024  -1000024   # BR(A -> ~chi_1+ ~chi_1-)
     4.70178326E-03    2     1000022   1000022   # BR(A -> ~chi_10 ~chi_10)
     8.01978666E-05    2     1000023   1000023   # BR(A -> ~chi_20 ~chi_20)
     3.29830897E-03    2     1000025   1000025   # BR(A -> ~chi_30 ~chi_30)
     1.57606977E-01    2     1000022   1000023   # BR(A -> ~chi_10 ~chi_20)
     2.33483187E-01    2     1000022   1000025   # BR(A -> ~chi_10 ~chi_30)
     1.39045830E-03    2     1000023   1000025   # BR(A -> ~chi_20 ~chi_30)
#
#         PDG            Width
DECAY        37     8.53803997E+00   # H+ decays
#          BR         NDA      ID1       ID2
     5.98646550E-04    2           4        -5   # BR(H+ -> c       bb     )
     6.52703665E-02    2         -15        16   # BR(H+ -> tau+    nu_tau )
     2.30800878E-04    2         -13        14   # BR(H+ -> mu+     nu_mu  )
     3.83131790E-06    2           2        -5   # BR(H+ -> u       bb     )
     1.35426040E-05    2           2        -3   # BR(H+ -> u       sb     )
     2.80062475E-04    2           4        -3   # BR(H+ -> c       sb     )
     5.29527651E-01    2           6        -5   # BR(H+ -> t       bb     )
     7.48680112E-05    2          24        25   # BR(H+ -> W+      h      )
     8.44529261E-13    2          24        36   # BR(H+ -> W+      A      )
     4.01373165E-01    2     1000024   1000022   # BR(H+ -> ~chi_1+ ~chi_10)
     2.48829748E-03    2     1000024   1000023   # BR(H+ -> ~chi_1+ ~chi_20)
     1.38768180E-04    2     1000024   1000025   # BR(H+ -> ~chi_1+ ~chi_30)
