#
#                              ======================
#                              | THE SUSYHIT OUTPUT |
#                              ======================
#
#
#              ------------------------------------------------------
#              |     This is the output of the SUSY-HIT package     |
#              |  created by A.Djouadi, M.Muehlleitner and M.Spira. |
#              |  In case of problems with SUSY-HIT email to        |
#              |           margarete.muehlleitner@cern.ch           |
#              |           michael.spira@psi.ch                     |
#              |           abdelhak.djouadi@cern.ch                 |
#              ------------------------------------------------------
#
#              ------------------------------------------------------
#              |  SUSY Les Houches Accord - MSSM Spectrum + Decays  |
#              |              based on the decay programs           |
#              |                                                    |
#              |                     SDECAY 1.3b                    |
#              |                                                    |
#              |  Authors: M.Muhlleitner, A.Djouadi and Y.Mambrini  |
#              |  Ref.:    Comput.Phys.Commun.168(2005)46           |
#              |           [hep-ph/0311167]                         |
#              |                                                    |
#              |                     HDECAY 3.4                     |
#              |                                                    |
#              |  By: A.Djouadi,J.Kalinowski,M.Muhlleitner,M.Spira  |
#              |  Ref.:    Comput.Phys.Commun.108(1998)56           |
#              |           [hep-ph/9704448]                         |
#              |                                                    |
#              |                                                    |
#              |  If not stated otherwise all DRbar couplings and   |
#              |  soft SUSY breaking masses are given at the scale  |
#              |  Q=  0.50006965E+04
#              |                                                    |
#              ------------------------------------------------------
#
#
BLOCK DCINFO  # Decay Program information
     1   SDECAY/HDECAY # decay calculator
     2   1.3b  /3.4    # version number
#
BLOCK SPINFO  # Spectrum calculator information
     1    SOFTSUSY    # spectrum calculator                
     2    3.4.0       # version number                     
#
BLOCK MODSEL  # Model selection
     1     0   #  nonUniversal                                     
#
BLOCK SMINPUTS  # Standard Model inputs
         1     1.25778332E+02   # alpha_em^-1(M_Z)^MSbar
         2     1.16570000E-05   # G_F [GeV^-2]
         3     1.17200002E-01   # alpha_S(M_Z)^MSbar
         4     9.11876000E+01   # M_Z pole mass
         5     4.25000000E+00   # mb(mb)^MSbar
         6     1.72500000E+02   # mt pole mass
         7     1.77682000E+00   # mtau pole mass
#
BLOCK MINPAR  # Input parameters - minimal models
         3     1.00000000E+01   # tanb                
#
BLOCK EXTPAR  # Input parameters - non-minimal models
         0    -1.00000000E+00   # Set                 
         1     6.00000000E+01   # M_1(MX)             
         2     3.00000000E+03   # M_2(MX)             
         3     1.12230200E+03   # M_3(MX)             
        11     5.00000000E+03   # At(MX)              
        12     5.00000000E+03   # Ab(MX)              
        13     0.00000000E+00   # Atau(MX)            
        23    -1.83916800E+03   # mu(MX)              
        26     3.00000000E+03   # mA(pole)            
        31     5.00000000E+03   # meL(MX)             
        32     5.00000000E+03   # mmuL(MX)            
        33     5.00000000E+03   # mtauL(MX)           
        34     5.00000000E+03   # meR(MX)             
        35     5.00000000E+03   # mmuR(MX)            
        36     5.00000000E+03   # mtauR(MX)           
        41     5.00000000E+03   # mqL1(MX)            
        42     5.00000000E+03   # mqL2(MX)            
        43     5.00000000E+03   # mqL3(MX)            
        44     5.00000000E+03   # muR(MX)             
        45     5.00000000E+03   # mcR(MX)             
        46     5.00000000E+03   # mtR(MX)             
        47     5.00000000E+03   # mdR(MX)             
        48     5.00000000E+03   # msR(MX)             
        49     5.00000000E+03   # mbR(MX)             
#
BLOCK MASS  # Mass Spectrum
# PDG code           mass       particle
        24     8.00959326E+01   # W+
        25     1.24575476E+02   # h
        35     3.00007703E+03   # H
        36     2.99999995E+03   # A
        37     3.00087363E+03   # H+
         5     4.87878001E+00   # b-quark pole mass calculated from mb(mb)_Msbar
   1000001     5.06588522E+03   # ~d_L
   2000001     5.04809851E+03   # ~d_R
   1000002     5.06540921E+03   # ~u_L
   2000002     5.04782865E+03   # ~u_R
   1000003     5.06588522E+03   # ~s_L
   2000003     5.04809851E+03   # ~s_R
   1000004     5.06540921E+03   # ~c_L
   2000004     5.04782865E+03   # ~c_R
   1000005     5.01273034E+03   # ~b_1
   2000005     5.04732241E+03   # ~b_2
   1000006     4.90423598E+03   # ~t_1
   2000006     5.06045718E+03   # ~t_2
   1000011     5.01903805E+03   # ~e_L
   2000011     5.00590320E+03   # ~e_R
   1000012     5.01808993E+03   # ~nu_eL
   1000013     5.01903805E+03   # ~mu_L
   2000013     5.00590320E+03   # ~mu_R
   1000014     5.01808993E+03   # ~nu_muL
   1000015     5.00412517E+03   # ~tau_1
   2000015     5.01926180E+03   # ~tau_2
   1000016     5.01755914E+03   # ~nu_tauL
   1000021     1.40000077E+03   # ~g
   1000022     6.03000143E+01   # ~chi_10
   1000023     1.89938935E+03   # ~chi_20
   1000025    -1.90224350E+03   # ~chi_30
   1000035     3.07443334E+03   # ~chi_40
   1000024     1.90000035E+03   # ~chi_1+
   1000037     3.07460115E+03   # ~chi_2+
#
BLOCK NMIX  # Neutralino Mixing Matrix
  1  1     9.99722492E-01   # N_11
  1  2     1.16342962E-04   # N_12
  1  3    -2.34938240E-02   # N_13
  1  4     1.72188658E-03   # N_14
  2  1     1.53884653E-02   # N_21
  2  2     4.14225584E-02   # N_22
  2  3     7.06771698E-01   # N_23
  2  4     7.06060290E-01   # N_24
  3  1    -1.78282075E-02   # N_31
  3  2     1.21863012E-02   # N_32
  3  3    -7.06748991E-01   # N_33
  3  4     7.07134720E-01   # N_34
  4  1    -5.36981167E-04   # N_41
  4  2     9.99067391E-01   # N_42
  4  3    -2.06801890E-02   # N_43
  4  4    -3.78997263E-02   # N_44
#
BLOCK UMIX  # Chargino Mixing Matrix U
  1  1     2.92074983E-02   # U_11
  1  2     9.99573370E-01   # U_12
  2  1    -9.99573370E-01   # U_21
  2  2     2.92074983E-02   # U_22
#
BLOCK VMIX  # Chargino Mixing Matrix V
  1  1     5.35624338E-02   # V_11
  1  2    -9.98564503E-01   # V_12
  2  1    -9.98564503E-01   # V_21
  2  2    -5.35624338E-02   # V_22
#
BLOCK STOPMIX  # Stop Mixing Matrix
  1  1    -5.17288360E-01   # cos(theta_t)
  1  2     8.55811166E-01   # sin(theta_t)
  2  1    -8.55811166E-01   # -sin(theta_t)
  2  2    -5.17288360E-01   # cos(theta_t)
#
BLOCK SBOTMIX  # Sbottom Mixing Matrix
  1  1     9.91522545E-01   # cos(theta_b)
  1  2    -1.29934763E-01   # sin(theta_b)
  2  1     1.29934763E-01   # -sin(theta_b)
  2  2     9.91522545E-01   # cos(theta_b)
#
BLOCK STAUMIX  # Stau Mixing Matrix
  1  1    -2.08911842E-01   # cos(theta_tau)
  1  2     9.77934477E-01   # sin(theta_tau)
  2  1    -9.77934477E-01   # -sin(theta_tau)
  2  2    -2.08911842E-01   # cos(theta_tau)
#
BLOCK ALPHA  # Higgs mixing
          -1.05434451E-01   # Mixing angle in the neutral Higgs boson sector
#
BLOCK HMIX Q=  5.00069653E+03  # DRbar Higgs Parameters
         1    -1.87243547E+03   # mu(Q)MSSM           
         2     9.47270176E+00   # tan                 
         3     2.42067373E+02   # higgs               
         4     8.33337276E+06   # mA^2(Q)MSSM         
#
BLOCK GAUGE Q=  5.00069653E+03  # The gauge couplings
     1     3.70657896E-01   # gprime(Q) DRbar
     2     6.31852672E-01   # g(Q) DRbar
     3     1.00370624E+00   # g3(Q) DRbar
#
BLOCK AU Q=  5.00069653E+03  # The trilinear couplings
  1  1     5.00000001E+03   # A_u(Q) DRbar
  2  2     5.00000001E+03   # A_c(Q) DRbar
  3  3     5.00000001E+03   # A_t(Q) DRbar
#
BLOCK AD Q=  5.00069653E+03  # The trilinear couplings
  1  1     5.00000000E+03   # A_d(Q) DRbar
  2  2     5.00000000E+03   # A_s(Q) DRbar
  3  3     5.00000001E+03   # A_b(Q) DRbar
#
BLOCK AE Q=  5.00069653E+03  # The trilinear couplings
  1  1     0.00000000E+00   # A_e(Q) DRbar
  2  2     8.31221846E-08   # A_mu(Q) DRbar
  3  3     8.24018484E-08   # A_tau(Q) DRbar
#
BLOCK Yu Q=  5.00069653E+03  # The Yukawa couplings
  1  1     0.00000000E+00   # y_u(Q) DRbar
  2  2     0.00000000E+00   # y_c(Q) DRbar
  3  3     8.16632913E-01   # y_t(Q) DRbar
#
BLOCK Yd Q=  5.00069653E+03  # The Yukawa couplings
  1  1     0.00000000E+00   # y_d(Q) DRbar
  2  2     0.00000000E+00   # y_s(Q) DRbar
  3  3     1.30875427E-01   # y_b(Q) DRbar
#
BLOCK Ye Q=  5.00069653E+03  # The Yukawa couplings
  1  1     0.00000000E+00   # y_e(Q) DRbar
  2  2     0.00000000E+00   # y_mu(Q) DRbar
  3  3     9.64958769E-02   # y_tau(Q) DRbar
#
BLOCK MSOFT Q=  5.00069653E+03  # The soft SUSY breaking masses at the scale Q
         1     6.00000000E+01   # M_1(Q)              
         2     3.00000000E+03   # M_2(Q)              
         3     1.12230200E+03   # M_3(Q)              
        21     5.14194112E+06   # mH1^2(Q)            
        22    -2.97422725E+06   # mH2^2(Q)            
        31     5.00000000E+03   # meL(Q)              
        32     5.00000000E+03   # mmuL(Q)             
        33     5.00000000E+03   # mtauL(Q)            
        34     5.00000000E+03   # meR(Q)              
        35     5.00000000E+03   # mmuR(Q)             
        36     5.00000000E+03   # mtauR(Q)            
        41     5.00000000E+03   # mqL1(Q)             
        42     5.00000000E+03   # mqL2(Q)             
        43     5.00000000E+03   # mqL3(Q)             
        44     5.00000000E+03   # muR(Q)              
        45     5.00000000E+03   # mcR(Q)              
        46     5.00000000E+03   # mtR(Q)              
        47     5.00000000E+03   # mdR(Q)              
        48     5.00000000E+03   # msR(Q)              
        49     5.00000000E+03   # mbR(Q)              
#
#
#
#                             =================
#                             |The decay table|
#                             =================
#
# - The QCD corrections to the decays gluino -> squark  + quark
#                                     squark -> gaugino + quark_prime
#                                     squark -> squark_prime + Higgs
#                                     squark -> gluino  + quark
#   are included.
#
# - The multi-body decays for the inos, stops and sbottoms are included.
#
# - The loop induced decays for the gluino, neutralinos and stops
#   are included.
#
# - The SUSY decays of the top quark are included.
#
#
#         PDG            Width
DECAY         6     1.39902403E+00   # top decays
#          BR         NDA      ID1       ID2
     1.00000000E+00    2           5        24   # BR(t ->  b    W+)
#
#         PDG            Width
DECAY   1000021     4.80302078E-05   # gluino decays
#          BR         NDA      ID1       ID2
     1.22334465E-05    2     1000022        21   # BR(~g -> ~chi_10 g)
#           BR         NDA      ID1       ID2       ID3
     7.87067648E-02    3     1000022         1        -1   # BR(~g -> ~chi_10 d  db)
     2.68292394E-01    3     1000022         2        -2   # BR(~g -> ~chi_10 u  ub)
     7.87067648E-02    3     1000022         3        -3   # BR(~g -> ~chi_10 s  sb)
     2.68292394E-01    3     1000022         4        -4   # BR(~g -> ~chi_10 c  cb)
     7.95960666E-02    3     1000022         5        -5   # BR(~g -> ~chi_10 b  bb)
     2.26393382E-01    3     1000022         6        -6   # BR(~g -> ~chi_10 t  tb)
#
#         PDG            Width
DECAY   1000006     3.66940275E+02   # stop1 decays
#          BR         NDA      ID1       ID2
     2.37723246E-02    2     1000022         6   # BR(~t_1 -> ~chi_10 t )
     6.45435376E-02    2     1000023         6   # BR(~t_1 -> ~chi_20 t )
     6.18998645E-02    2     1000025         6   # BR(~t_1 -> ~chi_30 t )
     6.28455849E-03    2     1000035         6   # BR(~t_1 -> ~chi_40 t )
     9.13763315E-02    2     1000024         5   # BR(~t_1 -> ~chi_1+ b )
     1.24647359E-02    2     1000037         5   # BR(~t_1 -> ~chi_2+ b )
     7.39658647E-01    2     1000021         6   # BR(~t_1 -> ~g      t )
#
#         PDG            Width
DECAY   2000006     3.77796905E+02   # stop2 decays
#          BR         NDA      ID1       ID2
     9.65593752E-03    2     1000022         6   # BR(~t_2 -> ~chi_10 t )
     6.58122919E-02    2     1000023         6   # BR(~t_2 -> ~chi_20 t )
     6.86263393E-02    2     1000025         6   # BR(~t_2 -> ~chi_30 t )
     1.40511245E-02    2     1000035         6   # BR(~t_2 -> ~chi_40 t )
     4.21277982E-02    2     1000024         5   # BR(~t_2 -> ~chi_1+ b )
     2.78065903E-02    2     1000037         5   # BR(~t_2 -> ~chi_2+ b )
     7.68382768E-01    2     1000021         6   # BR(~t_2 -> ~g      t )
     7.54499359E-04    2     1000006        25   # BR(~t_2 -> ~t_1    h )
     2.78265067E-03    2     1000006        23   # BR(~t_2 -> ~t_1    Z )
#
#         PDG            Width
DECAY   1000005     3.56626989E+02   # sbottom1 decays
#          BR         NDA      ID1       ID2
     2.22987875E-03    2     1000022         5   # BR(~b_1 -> ~chi_10 b )
     1.89918963E-03    2     1000023         5   # BR(~b_1 -> ~chi_20 b )
     1.73079269E-03    2     1000025         5   # BR(~b_1 -> ~chi_30 b )
     2.07314969E-02    2     1000035         5   # BR(~b_1 -> ~chi_40 b )
     1.35110217E-01    2    -1000024         6   # BR(~b_1 -> ~chi_1- t )
     4.18657967E-02    2    -1000037         6   # BR(~b_1 -> ~chi_2- t )
     7.94900520E-01    2     1000021         5   # BR(~b_1 -> ~g      b )
     1.53210857E-03    2     1000006       -24   # BR(~b_1 -> ~t_1    W-)
#
#         PDG            Width
DECAY   2000005     2.92590112E+02   # sbottom2 decays
#          BR         NDA      ID1       ID2
     9.97147327E-03    2     1000022         5   # BR(~b_2 -> ~chi_10 b )
     2.10151523E-03    2     1000023         5   # BR(~b_2 -> ~chi_20 b )
     2.24451619E-03    2     1000025         5   # BR(~b_2 -> ~chi_30 b )
     4.76825260E-04    2     1000035         5   # BR(~b_2 -> ~chi_40 b )
     7.11061519E-03    2    -1000024         6   # BR(~b_2 -> ~chi_1- t )
     9.61919452E-04    2    -1000037         6   # BR(~b_2 -> ~chi_2- t )
     9.76998127E-01    2     1000021         5   # BR(~b_2 -> ~g      b )
     1.35008865E-04    2     1000006       -24   # BR(~b_2 -> ~t_1    W-)
#
#         PDG            Width
DECAY   1000002     3.11348324E+02   # sup_L decays
#          BR         NDA      ID1       ID2
     2.39931195E-03    2     1000022         2   # BR(~u_L -> ~chi_10 u)
     9.15148012E-05    2     1000023         2   # BR(~u_L -> ~chi_20 u)
     3.50537912E-06    2     1000025         2   # BR(~u_L -> ~chi_30 u)
     2.50360515E-02    2     1000035         2   # BR(~u_L -> ~chi_40 u)
     2.65929289E-04    2     1000024         1   # BR(~u_L -> ~chi_1+ d)
     5.00258893E-02    2     1000037         1   # BR(~u_L -> ~chi_2+ d)
     9.22177798E-01    2     1000021         2   # BR(~u_L -> ~g      u)
#
#         PDG            Width
DECAY   2000002     2.97693191E+02   # sup_R decays
#          BR         NDA      ID1       ID2
     3.99621617E-02    2     1000022         2   # BR(~u_R -> ~chi_10 u)
     6.98335111E-06    2     1000023         2   # BR(~u_R -> ~chi_20 u)
     9.36392213E-06    2     1000025         2   # BR(~u_R -> ~chi_30 u)
     4.57536997E-09    2     1000035         2   # BR(~u_R -> ~chi_40 u)
     9.60021486E-01    2     1000021         2   # BR(~u_R -> ~g      u)
#
#         PDG            Width
DECAY   1000001     3.11361675E+02   # sdown_L decays
#          BR         NDA      ID1       ID2
     2.39373053E-03    2     1000022         1   # BR(~d_L -> ~chi_10 d)
     6.84106233E-05    2     1000023         1   # BR(~d_L -> ~chi_20 d)
     1.13763126E-05    2     1000025         1   # BR(~d_L -> ~chi_30 d)
     2.50533144E-02    2     1000035         1   # BR(~d_L -> ~chi_40 d)
     7.90830196E-05    2    -1000024         2   # BR(~d_L -> ~chi_1- u)
     5.01405067E-02    2    -1000037         2   # BR(~d_L -> ~chi_2- u)
     9.22253578E-01    2     1000021         1   # BR(~d_L -> ~g      d)
#
#         PDG            Width
DECAY   2000001     2.88787724E+02   # sdown_R decays
#          BR         NDA      ID1       ID2
     1.02991766E-02    2     1000022         1   # BR(~d_R -> ~chi_10 d)
     1.79983469E-06    2     1000023         1   # BR(~d_R -> ~chi_20 d)
     2.41338488E-06    2     1000025         1   # BR(~d_R -> ~chi_30 d)
     1.17932641E-09    2     1000035         1   # BR(~d_R -> ~chi_40 d)
     9.89696609E-01    2     1000021         1   # BR(~d_R -> ~g      d)
#
#         PDG            Width
DECAY   1000004     3.11348324E+02   # scharm_L decays
#          BR         NDA      ID1       ID2
     2.39931195E-03    2     1000022         4   # BR(~c_L -> ~chi_10 c)
     9.15148012E-05    2     1000023         4   # BR(~c_L -> ~chi_20 c)
     3.50537912E-06    2     1000025         4   # BR(~c_L -> ~chi_30 c)
     2.50360515E-02    2     1000035         4   # BR(~c_L -> ~chi_40 c)
     2.65929289E-04    2     1000024         3   # BR(~c_L -> ~chi_1+ s)
     5.00258893E-02    2     1000037         3   # BR(~c_L -> ~chi_2+ s)
     9.22177798E-01    2     1000021         4   # BR(~c_L -> ~g      c)
#
#         PDG            Width
DECAY   2000004     2.97693191E+02   # scharm_R decays
#          BR         NDA      ID1       ID2
     3.99621617E-02    2     1000022         4   # BR(~c_R -> ~chi_10 c)
     6.98335111E-06    2     1000023         4   # BR(~c_R -> ~chi_20 c)
     9.36392213E-06    2     1000025         4   # BR(~c_R -> ~chi_30 c)
     4.57536997E-09    2     1000035         4   # BR(~c_R -> ~chi_40 c)
     9.60021486E-01    2     1000021         4   # BR(~c_R -> ~g      c)
#
#         PDG            Width
DECAY   1000003     3.11361675E+02   # sstrange_L decays
#          BR         NDA      ID1       ID2
     2.39373053E-03    2     1000022         3   # BR(~s_L -> ~chi_10 s)
     6.84106233E-05    2     1000023         3   # BR(~s_L -> ~chi_20 s)
     1.13763126E-05    2     1000025         3   # BR(~s_L -> ~chi_30 s)
     2.50533144E-02    2     1000035         3   # BR(~s_L -> ~chi_40 s)
     7.90830196E-05    2    -1000024         4   # BR(~s_L -> ~chi_1- c)
     5.01405067E-02    2    -1000037         4   # BR(~s_L -> ~chi_2- c)
     9.22253578E-01    2     1000021         3   # BR(~s_L -> ~g      s)
#
#         PDG            Width
DECAY   2000003     2.88787724E+02   # sstrange_R decays
#          BR         NDA      ID1       ID2
     1.02991766E-02    2     1000022         3   # BR(~s_R -> ~chi_10 s)
     1.79983469E-06    2     1000023         3   # BR(~s_R -> ~chi_20 s)
     2.41338488E-06    2     1000025         3   # BR(~s_R -> ~chi_30 s)
     1.17932641E-09    2     1000035         3   # BR(~s_R -> ~chi_40 s)
     9.89696609E-01    2     1000021         3   # BR(~s_R -> ~g      s)
#
#         PDG            Width
DECAY   1000011     3.02248025E+01   # selectron_L decays
#          BR         NDA      ID1       ID2
     2.26834713E-01    2     1000022        11   # BR(~e_L -> ~chi_10 e-)
     1.23211456E-03    2     1000023        11   # BR(~e_L -> ~chi_20 e-)
     1.44389541E-06    2     1000025        11   # BR(~e_L -> ~chi_30 e-)
     2.56776257E-01    2     1000035        11   # BR(~e_L -> ~chi_40 e-)
     8.25768499E-04    2    -1000024        12   # BR(~e_L -> ~chi_1- nu_e)
     5.14329703E-01    2    -1000037        12   # BR(~e_L -> ~chi_2- nu_e)
#
#         PDG            Width
DECAY   2000011     2.73525965E+01   # selectron_R decays
#          BR         NDA      ID1       ID2
     9.99593502E-01    2     1000022        11   # BR(~e_R -> ~chi_10 e-)
     1.73604958E-04    2     1000023        11   # BR(~e_R -> ~chi_20 e-)
     2.32780935E-04    2     1000025        11   # BR(~e_R -> ~chi_30 e-)
     1.11895760E-07    2     1000035        11   # BR(~e_R -> ~chi_40 e-)
#
#         PDG            Width
DECAY   1000013     3.02248025E+01   # smuon_L decays
#          BR         NDA      ID1       ID2
     2.26834713E-01    2     1000022        13   # BR(~mu_L -> ~chi_10 mu-)
     1.23211456E-03    2     1000023        13   # BR(~mu_L -> ~chi_20 mu-)
     1.44389541E-06    2     1000025        13   # BR(~mu_L -> ~chi_30 mu-)
     2.56776257E-01    2     1000035        13   # BR(~mu_L -> ~chi_40 mu-)
     8.25768499E-04    2    -1000024        14   # BR(~mu_L -> ~chi_1- nu_mu)
     5.14329703E-01    2    -1000037        14   # BR(~mu_L -> ~chi_2- nu_mu)
#
#         PDG            Width
DECAY   2000013     2.73525965E+01   # smuon_R decays
#          BR         NDA      ID1       ID2
     9.99593502E-01    2     1000022        13   # BR(~mu_R -> ~chi_10 mu-)
     1.73604958E-04    2     1000023        13   # BR(~mu_R -> ~chi_20 mu-)
     2.32780935E-04    2     1000025        13   # BR(~mu_R -> ~chi_30 mu-)
     1.11895760E-07    2     1000035        13   # BR(~mu_R -> ~chi_40 mu-)
#
#         PDG            Width
DECAY   1000015     2.88292529E+01   # stau_1 decays
#          BR         NDA      ID1       ID2
     9.17881436E-01    2     1000022        15   # BR(~tau_1 -> ~chi_10  tau-)
     1.30019900E-02    2     1000023        15   # BR(~tau_1 -> ~chi_20  tau-)
     1.12527393E-02    2     1000025        15   # BR(~tau_1 -> ~chi_30  tau-)
     1.11486725E-02    2     1000035        15   # BR(~tau_1 -> ~chi_40  tau-)
     2.43820446E-02    2    -1000024        16   # BR(~tau_1 -> ~chi_1-  nu_tau)
     2.23331173E-02    2    -1000037        16   # BR(~tau_1 -> ~chi_2-  nu_tau)
#
#         PDG            Width
DECAY   2000015     3.07744639E+01   # stau_2 decays
#          BR         NDA      ID1       ID2
     2.51179552E-01    2     1000022        15   # BR(~tau_2 -> ~chi_10  tau-)
     1.12834864E-02    2     1000023        15   # BR(~tau_2 -> ~chi_20  tau-)
     1.17502935E-02    2     1000025        15   # BR(~tau_2 -> ~chi_30  tau-)
     2.41684483E-01    2     1000035        15   # BR(~tau_2 -> ~chi_40  tau-)
     1.05313699E-05    2    -1000024        16   # BR(~tau_2 -> ~chi_1-  nu_tau)
     4.84091653E-01    2    -1000037        16   # BR(~tau_2 -> ~chi_2-  nu_tau)
#
#         PDG            Width
DECAY   1000012     3.02260444E+01   # snu_eL decays
#          BR         NDA      ID1       ID2
     2.26602633E-01    2     1000022        12   # BR(~nu_eL -> ~chi_10 nu_e)
     5.07860015E-04    2     1000023        12   # BR(~nu_eL -> ~chi_20 nu_e)
     2.47898761E-04    2     1000025        12   # BR(~nu_eL -> ~chi_30 nu_e)
     2.56924512E-01    2     1000035        12   # BR(~nu_eL -> ~chi_40 nu_e)
     2.77610183E-03    2     1000024        11   # BR(~nu_eL -> ~chi_1+ e-)
     5.12940995E-01    2     1000037        11   # BR(~nu_eL -> ~chi_2+ e-)
#
#         PDG            Width
DECAY   1000014     3.02260444E+01   # snu_muL decays
#          BR         NDA      ID1       ID2
     2.26602633E-01    2     1000022        14   # BR(~nu_muL -> ~chi_10 nu_mu)
     5.07860015E-04    2     1000023        14   # BR(~nu_muL -> ~chi_20 nu_mu)
     2.47898761E-04    2     1000025        14   # BR(~nu_muL -> ~chi_30 nu_mu)
     2.56924512E-01    2     1000035        14   # BR(~nu_muL -> ~chi_40 nu_mu)
     2.77610183E-03    2     1000024        13   # BR(~nu_muL -> ~chi_1+ mu-)
     5.12940995E-01    2     1000037        13   # BR(~nu_muL -> ~chi_2+ mu-)
#
#         PDG            Width
DECAY   1000016     3.08987256E+01   # snu_tauL decays
#          BR         NDA      ID1       ID2
     2.21645916E-01    2     1000022        16   # BR(~nu_tauL -> ~chi_10 nu_tau)
     4.96715939E-04    2     1000023        16   # BR(~nu_tauL -> ~chi_20 nu_tau)
     2.42459007E-04    2     1000025        16   # BR(~nu_tauL -> ~chi_30 nu_tau)
     2.51240646E-01    2     1000035        16   # BR(~nu_tauL -> ~chi_40 nu_tau)
     2.47743616E-02    2     1000024        15   # BR(~nu_tauL -> ~chi_1+ tau-)
     5.01599901E-01    2     1000037        15   # BR(~nu_tauL -> ~chi_2+ tau-)
#
#         PDG            Width
DECAY   1000024     1.17314597E+00   # chargino1+ decays
#          BR         NDA      ID1       ID2
     1.00000000E+00    2     1000022        24   # BR(~chi_1+ -> ~chi_10  W+)
#
#         PDG            Width
DECAY   1000037     1.61076339E+01   # chargino2+ decays
#          BR         NDA      ID1       ID2
     2.52110585E-01    2     1000024        23   # BR(~chi_2+ -> ~chi_1+  Z )
     4.06560671E-04    2     1000022        24   # BR(~chi_2+ -> ~chi_10  W+)
     2.44905811E-01    2     1000023        24   # BR(~chi_2+ -> ~chi_20  W+)
     2.43047405E-01    2     1000025        24   # BR(~chi_2+ -> ~chi_30  W+)
     2.59529552E-01    2     1000024        25   # BR(~chi_2+ -> ~chi_1+  h )
     8.63739744E-08    2     1000022        37   # BR(~chi_2+ -> ~chi_10  H+)
#
#         PDG            Width
DECAY   1000022     0.00000000E+00   # neutralino1 decays
#
#         PDG            Width
DECAY   1000023     1.23512534E+00   # neutralino2 decays
#          BR         NDA      ID1       ID2
     5.64041885E-01    2     1000022        23   # BR(~chi_20 -> ~chi_10   Z )
     4.35958115E-01    2     1000022        25   # BR(~chi_20 -> ~chi_10   h )
#
#         PDG            Width
DECAY   1000025     1.24988053E+00   # neutralino3 decays
#          BR         NDA      ID1       ID2
     4.17042065E-01    2     1000022        23   # BR(~chi_30 -> ~chi_10   Z )
     5.82957935E-01    2     1000022        25   # BR(~chi_30 -> ~chi_10   h )
#
#         PDG            Width
DECAY   1000035     1.60744302E+01   # neutralino4 decays
#          BR         NDA      ID1       ID2
     1.76058702E-04    2     1000022        23   # BR(~chi_40 -> ~chi_10   Z )
     2.03993256E-02    2     1000023        23   # BR(~chi_40 -> ~chi_20   Z )
     2.31979563E-01    2     1000025        23   # BR(~chi_40 -> ~chi_30   Z )
     2.43791632E-01    2     1000024       -24   # BR(~chi_40 -> ~chi_1+   W-)
     2.43791632E-01    2    -1000024        24   # BR(~chi_40 -> ~chi_1-   W+)
     2.45971465E-04    2     1000022        25   # BR(~chi_40 -> ~chi_10   h )
     7.13875770E-08    2     1000022        35   # BR(~chi_40 -> ~chi_10   H )
     1.82506433E-08    2     1000022        36   # BR(~chi_40 -> ~chi_10   A )
     2.39435359E-01    2     1000023        25   # BR(~chi_40 -> ~chi_20   h )
     2.01803699E-02    2     1000025        25   # BR(~chi_40 -> ~chi_30   h )
#
#         PDG            Width
DECAY        25     4.02404293E-03   # h decays
#          BR         NDA      ID1       ID2
     6.10604656E-01    2           5        -5   # BR(h -> b       bb     )
     6.43434755E-02    2         -15        15   # BR(h -> tau+    tau-   )
     2.27800177E-04    2         -13        13   # BR(h -> mu+     mu-    )
     4.83073266E-04    2           3        -3   # BR(h -> s       sb     )
     2.09355908E-02    2           4        -4   # BR(h -> c       cb     )
     6.74912019E-02    2          21        21   # BR(h -> g       g      )
     2.31622790E-03    2          22        22   # BR(h -> gam     gam    )
     1.47663752E-03    2          22        23   # BR(h -> Z       gam    )
     2.07458351E-01    2          24       -24   # BR(h -> W+      W-     )
     2.46417395E-02    2          23        23   # BR(h -> Z       Z      )
     2.12467808E-05    2     1000022   1000022   # BR(h -> ~chi_10 ~chi_10)
#
#         PDG            Width
DECAY        35     6.52523355E+00   # H decays
#          BR         NDA      ID1       ID2
     5.03245471E-01    2           5        -5   # BR(H -> b       bb     )
     8.54295899E-02    2         -15        15   # BR(H -> tau+    tau-   )
     3.02085816E-04    2         -13        13   # BR(H -> mu+     mu-    )
     3.70311060E-04    2           3        -3   # BR(H -> s       sb     )
     2.06859117E-06    2           4        -4   # BR(H -> c       cb     )
     2.06668634E-01    2           6        -6   # BR(H -> t       tb     )
     6.85378914E-05    2          21        21   # BR(H -> g       g      )
     3.92171561E-07    2          22        22   # BR(H -> gam     gam    )
     1.22011108E-07    2          23        22   # BR(H -> Z       gam    )
     8.96051722E-05    2          24       -24   # BR(H -> W+      W-     )
     4.47458807E-05    2          23        23   # BR(H -> Z       Z      )
     3.45228971E-04    2          25        25   # BR(H -> h       h      )
     3.37678036E-23    2          36        36   # BR(H -> A       A      )
     5.14139362E-19    2          23        36   # BR(H -> Z       A      )
     6.13716498E-04    2     1000022   1000022   # BR(H -> ~chi_10 ~chi_10)
     1.18993424E-01    2     1000022   1000023   # BR(H -> ~chi_10 ~chi_20)
     8.38260672E-02    2     1000022   1000025   # BR(H -> ~chi_10 ~chi_30)
#
#         PDG            Width
DECAY        36     6.52848970E+00   # A decays
#          BR         NDA      ID1       ID2
     5.03162866E-01    2           5        -5   # BR(A -> b       bb     )
     8.53895551E-02    2         -15        15   # BR(A -> tau+    tau-   )
     3.01943827E-04    2         -13        13   # BR(A -> mu+     mu-    )
     3.70407252E-04    2           3        -3   # BR(A -> s       sb     )
     2.07634099E-06    2           4        -4   # BR(A -> c       cb     )
     2.07328455E-01    2           6        -6   # BR(A -> t       tb     )
     2.05222237E-04    2          21        21   # BR(A -> g       g      )
     3.93087622E-07    2          22        22   # BR(A -> gam     gam    )
     2.48566821E-07    2          23        22   # BR(A -> Z       gam    )
     8.92238937E-05    2          23        25   # BR(A -> Z       h      )
     6.33758246E-04    2     1000022   1000022   # BR(A -> ~chi_10 ~chi_10)
     8.48285356E-02    2     1000022   1000023   # BR(A -> ~chi_10 ~chi_20)
     1.17687315E-01    2     1000022   1000025   # BR(A -> ~chi_10 ~chi_30)
#
#         PDG            Width
DECAY        37     6.52295998E+00   # H+ decays
#          BR         NDA      ID1       ID2
     8.09205506E-04    2           4        -5   # BR(H+ -> c       bb     )
     8.54868313E-02    2         -15        16   # BR(H+ -> tau+    nu_tau )
     3.02287803E-04    2         -13        14   # BR(H+ -> mu+     nu_mu  )
     5.17888886E-06    2           2        -5   # BR(H+ -> u       bb     )
     1.77376183E-05    2           2        -3   # BR(H+ -> u       sb     )
     3.66812629E-04    2           4        -3   # BR(H+ -> c       sb     )
     7.08906694E-01    2           6        -5   # BR(H+ -> t       bb     )
     8.94349153E-05    2          24        25   # BR(H+ -> W+      h      )
     1.02566167E-13    2          24        36   # BR(H+ -> W+      A      )
     2.04015817E-01    2     1000024   1000022   # BR(H+ -> ~chi_1+ ~chi_10)
