#
#                              ======================
#                              | THE SUSYHIT OUTPUT |
#                              ======================
#
#
#              ------------------------------------------------------
#              |     This is the output of the SUSY-HIT package     |
#              |  created by A.Djouadi, M.Muehlleitner and M.Spira. |
#              |  In case of problems with SUSY-HIT email to        |
#              |           margarete.muehlleitner@cern.ch           |
#              |           michael.spira@psi.ch                     |
#              |           abdelhak.djouadi@cern.ch                 |
#              ------------------------------------------------------
#
#              ------------------------------------------------------
#              |  SUSY Les Houches Accord - MSSM Spectrum + Decays  |
#              |              based on the decay programs           |
#              |                                                    |
#              |                     SDECAY 1.3b                    |
#              |                                                    |
#              |  Authors: M.Muhlleitner, A.Djouadi and Y.Mambrini  |
#              |  Ref.:    Comput.Phys.Commun.168(2005)46           |
#              |           [hep-ph/0311167]                         |
#              |                                                    |
#              |                     HDECAY 3.4                     |
#              |                                                    |
#              |  By: A.Djouadi,J.Kalinowski,M.Muhlleitner,M.Spira  |
#              |  Ref.:    Comput.Phys.Commun.108(1998)56           |
#              |           [hep-ph/9704448]                         |
#              |                                                    |
#              |                                                    |
#              |  If not stated otherwise all DRbar couplings and   |
#              |  soft SUSY breaking masses are given at the scale  |
#              |  Q=  0.50007620E+04
#              |                                                    |
#              ------------------------------------------------------
#
#
BLOCK DCINFO  # Decay Program information
     1   SDECAY/HDECAY # decay calculator
     2   1.3b  /3.4    # version number
#
BLOCK SPINFO  # Spectrum calculator information
     1    SOFTSUSY    # spectrum calculator                
     2    3.4.0       # version number                     
#
BLOCK MODSEL  # Model selection
     1     0   #  nonUniversal                                     
#
BLOCK SMINPUTS  # Standard Model inputs
         1     1.25778332E+02   # alpha_em^-1(M_Z)^MSbar
         2     1.16570000E-05   # G_F [GeV^-2]
         3     1.17200002E-01   # alpha_S(M_Z)^MSbar
         4     9.11876000E+01   # M_Z pole mass
         5     4.25000000E+00   # mb(mb)^MSbar
         6     1.72500000E+02   # mt pole mass
         7     1.77682000E+00   # mtau pole mass
#
BLOCK MINPAR  # Input parameters - minimal models
         3     1.00000000E+01   # tanb                
#
BLOCK EXTPAR  # Input parameters - non-minimal models
         0    -1.00000000E+00   # Set                 
         1     6.00000000E+01   # M_1(MX)             
         2     3.00000000E+03   # M_2(MX)             
         3     8.59140000E+02   # M_3(MX)             
        11     5.00000000E+03   # At(MX)              
        12     5.00000000E+03   # Ab(MX)              
        13     0.00000000E+00   # Atau(MX)            
        23    -1.58784000E+02   # mu(MX)              
        26     3.00000000E+03   # mA(pole)            
        31     5.00000000E+03   # meL(MX)             
        32     5.00000000E+03   # mmuL(MX)            
        33     5.00000000E+03   # mtauL(MX)           
        34     5.00000000E+03   # meR(MX)             
        35     5.00000000E+03   # mmuR(MX)            
        36     5.00000000E+03   # mtauR(MX)           
        41     5.00000000E+03   # mqL1(MX)            
        42     5.00000000E+03   # mqL2(MX)            
        43     5.00000000E+03   # mqL3(MX)            
        44     5.00000000E+03   # muR(MX)             
        45     5.00000000E+03   # mcR(MX)             
        46     5.00000000E+03   # mtR(MX)             
        47     5.00000000E+03   # mdR(MX)             
        48     5.00000000E+03   # msR(MX)             
        49     5.00000000E+03   # mbR(MX)             
#
BLOCK MASS  # Mass Spectrum
# PDG code           mass       particle
        24     8.00882335E+01   # W+
        25     1.24378345E+02   # h
        35     3.00009107E+03   # H
        36     2.99999979E+03   # A
        37     3.00148538E+03   # H+
         5     4.87878001E+00   # b-quark pole mass calculated from mb(mb)_Msbar
   1000001     5.06432099E+03   # ~d_L
   2000001     5.04638041E+03   # ~d_R
   1000002     5.06384193E+03   # ~u_L
   2000002     5.04606770E+03   # ~u_R
   1000003     5.06432099E+03   # ~s_L
   2000003     5.04638041E+03   # ~s_R
   1000004     5.06384193E+03   # ~c_L
   2000004     5.04606770E+03   # ~c_R
   1000005     5.01093551E+03   # ~b_1
   2000005     5.04448414E+03   # ~b_2
   1000006     4.90156436E+03   # ~t_1
   2000006     5.05522832E+03   # ~t_2
   1000011     5.01917718E+03   # ~e_L
   2000011     5.00596309E+03   # ~e_R
   1000012     5.01822338E+03   # ~nu_eL
   1000013     5.01917718E+03   # ~mu_L
   2000013     5.00596309E+03   # ~mu_R
   1000014     5.01822338E+03   # ~nu_muL
   1000015     5.00483771E+03   # ~tau_1
   2000015     5.01863824E+03   # ~tau_2
   1000016     5.01766792E+03   # ~nu_tauL
   1000021     1.10000056E+03   # ~g
   1000022     5.78411519E+01   # ~chi_10
   1000023    -1.75657107E+02   # ~chi_20
   1000025     1.75676938E+02   # ~chi_30
   1000035     3.07435891E+03   # ~chi_40
   1000024     1.70000922E+02   # ~chi_1+
   1000037     3.07452722E+03   # ~chi_2+
#
BLOCK NMIX  # Neutralino Mixing Matrix
  1  1     9.59048272E-01   # N_11
  1  2    -9.57070791E-04   # N_12
  1  3    -2.74987663E-01   # N_13
  1  4    -6.78769636E-02   # N_14
  2  1    -1.47332369E-01   # N_21
  2  2     1.87648570E-02   # N_22
  2  3    -6.89002573E-01   # N_23
  2  4     7.09377549E-01   # N_24
  3  1     2.41907863E-01   # N_31
  3  2     1.69342793E-02   # N_32
  3  3     6.70563585E-01   # N_33
  3  4     7.01097921E-01   # N_34
  4  1    -4.14119906E-04   # N_41
  4  2     9.99680046E-01   # N_42
  4  3     1.31076043E-03   # N_43
  4  4    -2.52570005E-02   # N_44
#
BLOCK UMIX  # Chargino Mixing Matrix U
  1  1    -1.84786191E-03   # U_11
  1  2     9.99998293E-01   # U_12
  2  1    -9.99998293E-01   # U_21
  2  2    -1.84786191E-03   # U_22
#
BLOCK VMIX  # Chargino Mixing Matrix V
  1  1     3.57376202E-02   # V_11
  1  2    -9.99361207E-01   # V_12
  2  1    -9.99361207E-01   # V_21
  2  2    -3.57376202E-02   # V_22
#
BLOCK STOPMIX  # Stop Mixing Matrix
  1  1    -5.05454814E-01   # cos(theta_t)
  1  2     8.62853076E-01   # sin(theta_t)
  2  1    -8.62853076E-01   # -sin(theta_t)
  2  2    -5.05454814E-01   # cos(theta_t)
#
BLOCK SBOTMIX  # Sbottom Mixing Matrix
  1  1     9.99425359E-01   # cos(theta_b)
  1  2    -3.38961913E-02   # sin(theta_b)
  2  1     3.38961913E-02   # -sin(theta_b)
  2  2     9.99425359E-01   # cos(theta_b)
#
BLOCK STAUMIX  # Stau Mixing Matrix
  1  1    -1.87307345E-02   # cos(theta_tau)
  1  2     9.99824564E-01   # sin(theta_tau)
  2  1    -9.99824564E-01   # -sin(theta_tau)
  2  2    -1.87307345E-02   # cos(theta_tau)
#
BLOCK ALPHA  # Higgs mixing
          -1.05451839E-01   # Mixing angle in the neutral Higgs boson sector
#
BLOCK HMIX Q=  5.00076203E+03  # DRbar Higgs Parameters
         1    -1.61603772E+02   # mu(Q)MSSM           
         2     9.47256660E+00   # tan                 
         3     2.41712297E+02   # higgs               
         4     8.80044441E+06   # mA^2(Q)MSSM         
#
BLOCK GAUGE Q=  5.00076203E+03  # The gauge couplings
     1     3.71211511E-01   # gprime(Q) DRbar
     2     6.34589431E-01   # g(Q) DRbar
     3     1.00724979E+00   # g3(Q) DRbar
#
BLOCK AU Q=  5.00076203E+03  # The trilinear couplings
  1  1     5.00000001E+03   # A_u(Q) DRbar
  2  2     5.00000001E+03   # A_c(Q) DRbar
  3  3     5.00000001E+03   # A_t(Q) DRbar
#
BLOCK AD Q=  5.00076203E+03  # The trilinear couplings
  1  1     5.00000000E+03   # A_d(Q) DRbar
  2  2     5.00000000E+03   # A_s(Q) DRbar
  3  3     5.00000001E+03   # A_b(Q) DRbar
#
BLOCK AE Q=  5.00076203E+03  # The trilinear couplings
  1  1     0.00000000E+00   # A_e(Q) DRbar
  2  2     3.20103358E-08   # A_mu(Q) DRbar
  3  3     3.10798866E-08   # A_tau(Q) DRbar
#
BLOCK Yu Q=  5.00076203E+03  # The Yukawa couplings
  1  1     0.00000000E+00   # y_u(Q) DRbar
  2  2     0.00000000E+00   # y_c(Q) DRbar
  3  3     8.15725469E-01   # y_t(Q) DRbar
#
BLOCK Yd Q=  5.00076203E+03  # The Yukawa couplings
  1  1     0.00000000E+00   # y_d(Q) DRbar
  2  2     0.00000000E+00   # y_s(Q) DRbar
  3  3     1.29027555E-01   # y_b(Q) DRbar
#
BLOCK Ye Q=  5.00076203E+03  # The Yukawa couplings
  1  1     0.00000000E+00   # y_e(Q) DRbar
  2  2     0.00000000E+00   # y_mu(Q) DRbar
  3  3     9.73907766E-02   # y_tau(Q) DRbar
#
BLOCK MSOFT Q=  5.00076203E+03  # The soft SUSY breaking masses at the scale Q
         1     6.00000000E+01   # M_1(Q)              
         2     3.00000000E+03   # M_2(Q)              
         3     8.59140000E+02   # M_3(Q)              
        21     8.70856272E+06   # mH1^2(Q)            
        22     5.49327188E+05   # mH2^2(Q)            
        31     5.00000000E+03   # meL(Q)              
        32     5.00000000E+03   # mmuL(Q)             
        33     5.00000000E+03   # mtauL(Q)            
        34     5.00000000E+03   # meR(Q)              
        35     5.00000000E+03   # mmuR(Q)             
        36     5.00000000E+03   # mtauR(Q)            
        41     5.00000000E+03   # mqL1(Q)             
        42     5.00000000E+03   # mqL2(Q)             
        43     5.00000000E+03   # mqL3(Q)             
        44     5.00000000E+03   # muR(Q)              
        45     5.00000000E+03   # mcR(Q)              
        46     5.00000000E+03   # mtR(Q)              
        47     5.00000000E+03   # mdR(Q)              
        48     5.00000000E+03   # msR(Q)              
        49     5.00000000E+03   # mbR(Q)              
#
#
#
#                             =================
#                             |The decay table|
#                             =================
#
# - The QCD corrections to the decays gluino -> squark  + quark
#                                     squark -> gaugino + quark_prime
#                                     squark -> squark_prime + Higgs
#                                     squark -> gluino  + quark
#   are included.
#
# - The multi-body decays for the inos, stops and sbottoms are included.
#
# - The loop induced decays for the gluino, neutralinos and stops
#   are included.
#
# - The SUSY decays of the top quark are included.
#
#
#         PDG            Width
DECAY         6     1.41150827E+00   # top decays
#          BR         NDA      ID1       ID2
     1.00000000E+00    2           5        24   # BR(t ->  b    W+)
#
#         PDG            Width
DECAY   1000021     9.12036810E-05   # gluino decays
#          BR         NDA      ID1       ID2
     2.26707096E-04    2     1000022        21   # BR(~g -> ~chi_10 g)
     2.45342714E-02    2     1000023        21   # BR(~g -> ~chi_20 g)
     2.49252252E-02    2     1000025        21   # BR(~g -> ~chi_30 g)
#           BR         NDA      ID1       ID2       ID3
     1.13978936E-02    3     1000022         1        -1   # BR(~g -> ~chi_10 d  db)
     2.08422175E-04    3     1000023         1        -1   # BR(~g -> ~chi_20 d  db)
     6.13981185E-04    3     1000025         1        -1   # BR(~g -> ~chi_30 d  db)
     3.87401445E-02    3     1000022         2        -2   # BR(~g -> ~chi_10 u  ub)
     5.02015691E-04    3     1000023         2        -2   # BR(~g -> ~chi_20 u  ub)
     2.48453717E-03    3     1000025         2        -2   # BR(~g -> ~chi_30 u  ub)
     1.13978936E-02    3     1000022         3        -3   # BR(~g -> ~chi_10 s  sb)
     2.08422175E-04    3     1000023         3        -3   # BR(~g -> ~chi_20 s  sb)
     6.13981185E-04    3     1000025         3        -3   # BR(~g -> ~chi_30 s  sb)
     3.87401445E-02    3     1000022         4        -4   # BR(~g -> ~chi_10 c  cb)
     5.02015691E-04    3     1000023         4        -4   # BR(~g -> ~chi_20 c  cb)
     2.48453717E-03    3     1000025         4        -4   # BR(~g -> ~chi_30 c  cb)
     1.27986332E-02    3     1000022         5        -5   # BR(~g -> ~chi_10 b  bb)
     6.15685454E-03    3     1000023         5        -5   # BR(~g -> ~chi_20 b  bb)
     6.21781917E-03    3     1000025         5        -5   # BR(~g -> ~chi_30 b  bb)
     2.42023379E-02    3     1000022         6        -6   # BR(~g -> ~chi_10 t  tb)
     1.57253360E-01    3     1000023         6        -6   # BR(~g -> ~chi_20 t  tb)
     1.93137573E-01    3     1000025         6        -6   # BR(~g -> ~chi_30 t  tb)
     6.25138058E-05    3     1000024         1        -2   # BR(~g -> ~chi_1+ d  ub)
     6.25138058E-05    3    -1000024         2        -1   # BR(~g -> ~chi_1- u  db)
     6.25138058E-05    3     1000024         3        -4   # BR(~g -> ~chi_1+ s  cb)
     6.25138058E-05    3    -1000024         4        -3   # BR(~g -> ~chi_1- c  sb)
     2.21201587E-01    3     1000024         5        -6   # BR(~g -> ~chi_1+ b  tb)
     2.21201587E-01    3    -1000024         6        -5   # BR(~g -> ~chi_1- t  bb)
#
#         PDG            Width
DECAY   1000006     4.19303460E+02   # stop1 decays
#          BR         NDA      ID1       ID2
     1.73260586E-02    2     1000022         6   # BR(~t_1 -> ~chi_10 t )
     7.33208427E-02    2     1000023         6   # BR(~t_1 -> ~chi_20 t )
     8.44212362E-02    2     1000025         6   # BR(~t_1 -> ~chi_30 t )
     4.93293097E-03    2     1000035         6   # BR(~t_1 -> ~chi_40 t )
     1.14060172E-01    2     1000024         5   # BR(~t_1 -> ~chi_1+ b )
     9.83491344E-03    2     1000037         5   # BR(~t_1 -> ~chi_2+ b )
     6.96103846E-01    2     1000021         6   # BR(~t_1 -> ~g      t )
#
#         PDG            Width
DECAY   2000006     4.17812377E+02   # stop2 decays
#          BR         NDA      ID1       ID2
     1.14702447E-02    2     1000022         6   # BR(~t_2 -> ~chi_10 t )
     8.71820960E-02    2     1000023         6   # BR(~t_2 -> ~chi_20 t )
     7.31891855E-02    2     1000025         6   # BR(~t_2 -> ~chi_30 t )
     1.33025083E-02    2     1000035         6   # BR(~t_2 -> ~chi_40 t )
     4.75781935E-02    2     1000024         5   # BR(~t_2 -> ~chi_1+ b )
     2.64915763E-02    2     1000037         5   # BR(~t_2 -> ~chi_2+ b )
     7.37836127E-01    2     1000021         6   # BR(~t_2 -> ~g      t )
     6.75549054E-04    2     1000006        25   # BR(~t_2 -> ~t_1    h )
     2.27451947E-03    2     1000006        23   # BR(~t_2 -> ~t_1    Z )
#
#         PDG            Width
DECAY   1000005     3.95273556E+02   # sbottom1 decays
#          BR         NDA      ID1       ID2
     2.21529083E-03    2     1000022         5   # BR(~b_1 -> ~chi_10 b )
     2.05356843E-03    2     1000023         5   # BR(~b_1 -> ~chi_20 b )
     1.87110486E-03    2     1000025         5   # BR(~b_1 -> ~chi_30 b )
     1.91832672E-02    2     1000035         5   # BR(~b_1 -> ~chi_40 b )
     1.68773538E-01    2    -1000024         6   # BR(~b_1 -> ~chi_1- t )
     3.85092752E-02    2    -1000037         6   # BR(~b_1 -> ~chi_2- t )
     7.65975087E-01    2     1000021         5   # BR(~b_1 -> ~g      b )
     1.41886829E-03    2     1000006       -24   # BR(~b_1 -> ~t_1    W-)
#
#         PDG            Width
DECAY   2000005     3.11391399E+02   # sbottom2 decays
#          BR         NDA      ID1       ID2
     9.03355048E-03    2     1000022         5   # BR(~b_2 -> ~chi_10 b )
     2.86463330E-03    2     1000023         5   # BR(~b_2 -> ~chi_20 b )
     3.09407685E-03    2     1000025         5   # BR(~b_2 -> ~chi_30 b )
     2.59575281E-05    2     1000035         5   # BR(~b_2 -> ~chi_40 b )
     5.63770983E-03    2    -1000024         6   # BR(~b_2 -> ~chi_1- t )
     5.21240603E-05    2    -1000037         6   # BR(~b_2 -> ~chi_2- t )
     9.79283716E-01    2     1000021         5   # BR(~b_2 -> ~g      b )
     8.23216023E-06    2     1000006       -24   # BR(~b_2 -> ~t_1    W-)
#
#         PDG            Width
DECAY   1000002     3.30638004E+02   # sup_L decays
#          BR         NDA      ID1       ID2
     2.06267046E-03    2     1000022         2   # BR(~u_L -> ~chi_10 u)
     5.90338964E-06    2     1000023         2   # BR(~u_L -> ~chi_20 u)
     2.44382012E-04    2     1000025         2   # BR(~u_L -> ~chi_30 u)
     2.37741857E-02    2     1000035         2   # BR(~u_L -> ~chi_40 u)
     1.51933471E-04    2     1000024         1   # BR(~u_L -> ~chi_1+ d)
     4.75196799E-02    2     1000037         1   # BR(~u_L -> ~chi_2+ d)
     9.26241245E-01    2     1000021         2   # BR(~u_L -> ~g      u)
#
#         PDG            Width
DECAY   2000002     3.16904262E+02   # sup_R decays
#          BR         NDA      ID1       ID2
     3.46656156E-02    2     1000022         2   # BR(~u_R -> ~chi_10 u)
     8.16441573E-04    2     1000023         2   # BR(~u_R -> ~chi_20 u)
     2.20104289E-03    2     1000025         2   # BR(~u_R -> ~chi_30 u)
     2.55961049E-09    2     1000035         2   # BR(~u_R -> ~chi_40 u)
     9.62316897E-01    2     1000021         2   # BR(~u_R -> ~g      u)
#
#         PDG            Width
DECAY   1000001     3.30646359E+02   # sdown_L decays
#          BR         NDA      ID1       ID2
     2.10547928E-03    2     1000022         1   # BR(~d_L -> ~chi_10 d)
     1.34151385E-04    2     1000023         1   # BR(~d_L -> ~chi_20 d)
     5.43691035E-05    2     1000025         1   # BR(~d_L -> ~chi_30 d)
     2.37887395E-02    2     1000035         1   # BR(~d_L -> ~chi_40 d)
     4.06229663E-07    2    -1000024         2   # BR(~d_L -> ~chi_1- u)
     4.75940351E-02    2    -1000037         2   # BR(~d_L -> ~chi_2- u)
     9.26322819E-01    2     1000021         1   # BR(~d_L -> ~g      d)
#
#         PDG            Width
DECAY   2000001     3.07970666E+02   # sdown_R decays
#          BR         NDA      ID1       ID2
     8.91835304E-03    2     1000022         1   # BR(~d_R -> ~chi_10 d)
     2.10044331E-04    2     1000023         1   # BR(~d_R -> ~chi_20 d)
     5.66258011E-04    2     1000025         1   # BR(~d_R -> ~chi_30 d)
     6.58601464E-10    2     1000035         1   # BR(~d_R -> ~chi_40 d)
     9.90305344E-01    2     1000021         1   # BR(~d_R -> ~g      d)
#
#         PDG            Width
DECAY   1000004     3.30638004E+02   # scharm_L decays
#          BR         NDA      ID1       ID2
     2.06267046E-03    2     1000022         4   # BR(~c_L -> ~chi_10 c)
     5.90338964E-06    2     1000023         4   # BR(~c_L -> ~chi_20 c)
     2.44382012E-04    2     1000025         4   # BR(~c_L -> ~chi_30 c)
     2.37741857E-02    2     1000035         4   # BR(~c_L -> ~chi_40 c)
     1.51933471E-04    2     1000024         3   # BR(~c_L -> ~chi_1+ s)
     4.75196799E-02    2     1000037         3   # BR(~c_L -> ~chi_2+ s)
     9.26241245E-01    2     1000021         4   # BR(~c_L -> ~g      c)
#
#         PDG            Width
DECAY   2000004     3.16904262E+02   # scharm_R decays
#          BR         NDA      ID1       ID2
     3.46656156E-02    2     1000022         4   # BR(~c_R -> ~chi_10 c)
     8.16441573E-04    2     1000023         4   # BR(~c_R -> ~chi_20 c)
     2.20104289E-03    2     1000025         4   # BR(~c_R -> ~chi_30 c)
     2.55961049E-09    2     1000035         4   # BR(~c_R -> ~chi_40 c)
     9.62316897E-01    2     1000021         4   # BR(~c_R -> ~g      c)
#
#         PDG            Width
DECAY   1000003     3.30646359E+02   # sstrange_L decays
#          BR         NDA      ID1       ID2
     2.10547928E-03    2     1000022         3   # BR(~s_L -> ~chi_10 s)
     1.34151385E-04    2     1000023         3   # BR(~s_L -> ~chi_20 s)
     5.43691035E-05    2     1000025         3   # BR(~s_L -> ~chi_30 s)
     2.37887395E-02    2     1000035         3   # BR(~s_L -> ~chi_40 s)
     4.06229663E-07    2    -1000024         4   # BR(~s_L -> ~chi_1- c)
     4.75940351E-02    2    -1000037         4   # BR(~s_L -> ~chi_2- c)
     9.26322819E-01    2     1000021         3   # BR(~s_L -> ~g      s)
#
#         PDG            Width
DECAY   2000003     3.07970666E+02   # sstrange_R decays
#          BR         NDA      ID1       ID2
     8.91835304E-03    2     1000022         3   # BR(~s_R -> ~chi_10 s)
     2.10044331E-04    2     1000023         3   # BR(~s_R -> ~chi_20 s)
     5.66258011E-04    2     1000025         3   # BR(~s_R -> ~chi_30 s)
     6.58601464E-10    2     1000035         3   # BR(~s_R -> ~chi_40 s)
     9.90305344E-01    2     1000021         3   # BR(~s_R -> ~g      s)
#
#         PDG            Width
DECAY   1000011     3.04359227E+01   # selectron_L decays
#          BR         NDA      ID1       ID2
     2.07143631E-01    2     1000022        11   # BR(~e_L -> ~chi_10 e-)
     2.99525737E-03    2     1000023        11   # BR(~e_L -> ~chi_20 e-)
     1.65426466E-02    2     1000025        11   # BR(~e_L -> ~chi_30 e-)
     2.57601255E-01    2     1000035        11   # BR(~e_L -> ~chi_40 e-)
     4.50094682E-06    2    -1000024        12   # BR(~e_L -> ~chi_1- nu_e)
     5.15712709E-01    2    -1000037        12   # BR(~e_L -> ~chi_2- nu_e)
#
#         PDG            Width
DECAY   2000011     2.74345697E+01   # selectron_R decays
#          BR         NDA      ID1       ID2
     9.19935684E-01    2     1000022        11   # BR(~e_R -> ~chi_10 e-)
     2.16630055E-02    2     1000023        11   # BR(~e_R -> ~chi_20 e-)
     5.84012435E-02    2     1000025        11   # BR(~e_R -> ~chi_30 e-)
     6.65560822E-08    2     1000035        11   # BR(~e_R -> ~chi_40 e-)
#
#         PDG            Width
DECAY   1000013     3.04359227E+01   # smuon_L decays
#          BR         NDA      ID1       ID2
     2.07143631E-01    2     1000022        13   # BR(~mu_L -> ~chi_10 mu-)
     2.99525737E-03    2     1000023        13   # BR(~mu_L -> ~chi_20 mu-)
     1.65426466E-02    2     1000025        13   # BR(~mu_L -> ~chi_30 mu-)
     2.57601255E-01    2     1000035        13   # BR(~mu_L -> ~chi_40 mu-)
     4.50094682E-06    2    -1000024        14   # BR(~mu_L -> ~chi_1- nu_mu)
     5.15712709E-01    2    -1000037        14   # BR(~mu_L -> ~chi_2- nu_mu)
#
#         PDG            Width
DECAY   2000013     2.74345697E+01   # smuon_R decays
#          BR         NDA      ID1       ID2
     9.19935684E-01    2     1000022        13   # BR(~mu_R -> ~chi_10 mu-)
     2.16630055E-02    2     1000023        13   # BR(~mu_R -> ~chi_20 mu-)
     5.84012435E-02    2     1000025        13   # BR(~mu_R -> ~chi_30 mu-)
     6.65560822E-08    2     1000035        13   # BR(~mu_R -> ~chi_40 mu-)
#
#         PDG            Width
DECAY   1000015     2.93131440E+01   # stau_1 decays
#          BR         NDA      ID1       ID2
     8.63854831E-01    2     1000022        15   # BR(~tau_1 -> ~chi_10  tau-)
     3.51207522E-02    2     1000023        15   # BR(~tau_1 -> ~chi_20  tau-)
     6.86194317E-02    2     1000025        15   # BR(~tau_1 -> ~chi_30  tau-)
     9.58391394E-05    2     1000035        15   # BR(~tau_1 -> ~chi_40  tau-)
     3.21174338E-02    2    -1000024        16   # BR(~tau_1 -> ~chi_1-  nu_tau)
     1.91712479E-04    2    -1000037        16   # BR(~tau_1 -> ~chi_2-  nu_tau)
#
#         PDG            Width
DECAY   2000015     3.13710660E+01   # stau_2 decays
#          BR         NDA      ID1       ID2
     2.02636737E-01    2     1000022        15   # BR(~tau_2 -> ~chi_10  tau-)
     1.75822577E-02    2     1000023        15   # BR(~tau_2 -> ~chi_20  tau-)
     3.00355479E-02    2     1000025        15   # BR(~tau_2 -> ~chi_30  tau-)
     2.49740741E-01    2     1000035        15   # BR(~tau_2 -> ~chi_40  tau-)
     2.85137604E-05    2    -1000024        16   # BR(~tau_2 -> ~chi_1-  nu_tau)
     4.99976202E-01    2    -1000037        16   # BR(~tau_2 -> ~chi_2-  nu_tau)
#
#         PDG            Width
DECAY   1000012     3.04387743E+01   # snu_eL decays
#          BR         NDA      ID1       ID2
     2.08502812E-01    2     1000022        12   # BR(~nu_eL -> ~chi_10 nu_e)
     7.25603505E-03    2     1000023        12   # BR(~nu_eL -> ~chi_20 nu_e)
     1.02232952E-02    2     1000025        12   # BR(~nu_eL -> ~chi_30 nu_e)
     2.57660237E-01    2     1000035        12   # BR(~nu_eL -> ~chi_40 nu_e)
     1.68303252E-03    2     1000024        11   # BR(~nu_eL -> ~chi_1+ e-)
     5.14674589E-01    2     1000037        11   # BR(~nu_eL -> ~chi_2+ e-)
#
#         PDG            Width
DECAY   1000014     3.04387743E+01   # snu_muL decays
#          BR         NDA      ID1       ID2
     2.08502812E-01    2     1000022        14   # BR(~nu_muL -> ~chi_10 nu_mu)
     7.25603505E-03    2     1000023        14   # BR(~nu_muL -> ~chi_20 nu_mu)
     1.02232952E-02    2     1000025        14   # BR(~nu_muL -> ~chi_30 nu_mu)
     2.57660237E-01    2     1000035        14   # BR(~nu_muL -> ~chi_40 nu_mu)
     1.68303252E-03    2     1000024        13   # BR(~nu_muL -> ~chi_1+ mu-)
     5.14674589E-01    2     1000037        13   # BR(~nu_muL -> ~chi_2+ mu-)
#
#         PDG            Width
DECAY   1000016     3.13738025E+01   # snu_tauL decays
#          BR         NDA      ID1       ID2
     2.02266434E-01    2     1000022        16   # BR(~nu_tauL -> ~chi_10 nu_tau)
     7.03900160E-03    2     1000023        16   # BR(~nu_tauL -> ~chi_20 nu_tau)
     9.91750877E-03    2     1000025        16   # BR(~nu_tauL -> ~chi_30 nu_tau)
     2.49887062E-01    2     1000035        16   # BR(~nu_tauL -> ~chi_40 nu_tau)
     3.17423765E-02    2     1000024        15   # BR(~nu_tauL -> ~chi_1+ tau-)
     4.99147617E-01    2     1000037        15   # BR(~nu_tauL -> ~chi_2+ tau-)
#
#         PDG            Width
DECAY   1000024     5.13672397E-02   # chargino1+ decays
#          BR         NDA      ID1       ID2
     1.00000000E+00    2     1000022        24   # BR(~chi_1+ -> ~chi_10  W+)
#
#         PDG            Width
DECAY   1000037     2.34458649E+01   # chargino2+ decays
#          BR         NDA      ID1       ID2
     2.53930204E-01    2     1000024        23   # BR(~chi_2+ -> ~chi_1+  Z )
     1.78542554E-03    2     1000022        24   # BR(~chi_2+ -> ~chi_10  W+)
     2.45176732E-01    2     1000023        24   # BR(~chi_2+ -> ~chi_20  W+)
     2.43654789E-01    2     1000025        24   # BR(~chi_2+ -> ~chi_30  W+)
     2.55397516E-01    2     1000024        25   # BR(~chi_2+ -> ~chi_1+  h )
     5.53323837E-05    2     1000022        37   # BR(~chi_2+ -> ~chi_10  H+)
#
#         PDG            Width
DECAY   1000022     0.00000000E+00   # neutralino1 decays
#
#         PDG            Width
DECAY   1000023     2.13864640E-02   # neutralino2 decays
#          BR         NDA      ID1       ID2
     1.00000000E+00    2     1000022        23   # BR(~chi_20 -> ~chi_10   Z )
#
#         PDG            Width
DECAY   1000025     2.52529292E-02   # neutralino3 decays
#          BR         NDA      ID1       ID2
     1.00000000E+00    2     1000022        23   # BR(~chi_30 -> ~chi_10   Z )
#
#         PDG            Width
DECAY   1000035     2.34567299E+01   # neutralino4 decays
#          BR         NDA      ID1       ID2
     1.72238418E-03    2     1000022        23   # BR(~chi_40 -> ~chi_10   Z )
     1.14760630E-01    2     1000023        23   # BR(~chi_40 -> ~chi_20   Z )
     1.37044079E-01    2     1000025        23   # BR(~chi_40 -> ~chi_30   Z )
     2.45675165E-01    2     1000024       -24   # BR(~chi_40 -> ~chi_1+   W-)
     2.45675165E-01    2    -1000024        24   # BR(~chi_40 -> ~chi_1-   W+)
     1.61120798E-04    2     1000022        25   # BR(~chi_40 -> ~chi_10   h )
     5.27436300E-05    2     1000022        35   # BR(~chi_40 -> ~chi_10   H )
     5.97767650E-06    2     1000022        36   # BR(~chi_40 -> ~chi_10   A )
     1.39310381E-01    2     1000023        25   # BR(~chi_40 -> ~chi_20   h )
     1.15592352E-01    2     1000025        25   # BR(~chi_40 -> ~chi_30   h )
#
#         PDG            Width
DECAY        25     4.05876767E-03   # h decays
#          BR         NDA      ID1       ID2
     6.13994546E-01    2           5        -5   # BR(h -> b       bb     )
     6.37109249E-02    2         -15        15   # BR(h -> tau+    tau-   )
     2.25561580E-04    2         -13        13   # BR(h -> mu+     mu-    )
     4.78471881E-04    2           3        -3   # BR(h -> s       sb     )
     2.07299747E-02    2           4        -4   # BR(h -> c       cb     )
     6.66042779E-02    2          21        21   # BR(h -> g       g      )
     2.27714308E-03    2          22        22   # BR(h -> gam     gam    )
     1.43762003E-03    2          22        23   # BR(h -> Z       gam    )
     2.01512918E-01    2          24       -24   # BR(h -> W+      W-     )
     2.38296251E-02    2          23        23   # BR(h -> Z       Z      )
     5.19893681E-03    2     1000022   1000022   # BR(h -> ~chi_10 ~chi_10)
#
#         PDG            Width
DECAY        35     8.83220244E+00   # H decays
#          BR         NDA      ID1       ID2
     3.59280017E-01    2           5        -5   # BR(H -> b       bb     )
     6.31136860E-02    2         -15        15   # BR(H -> tau+    tau-   )
     2.23175007E-04    2         -13        13   # BR(H -> mu+     mu-    )
     2.73578280E-04    2           3        -3   # BR(H -> s       sb     )
     1.52878466E-06    2           4        -4   # BR(H -> c       cb     )
     1.52737706E-01    2           6        -6   # BR(H -> t       tb     )
     5.08095966E-05    2          21        21   # BR(H -> g       g      )
     1.51589998E-07    2          22        22   # BR(H -> gam     gam    )
     8.99948234E-08    2          23        22   # BR(H -> Z       gam    )
     7.46283157E-05    2          24       -24   # BR(H -> W+      W-     )
     3.72669001E-05    2          23        23   # BR(H -> Z       Z      )
     2.66189985E-04    2          25        25   # BR(H -> h       h      )
     3.04800559E-24    2          36        36   # BR(H -> A       A      )
     8.10001593E-19    2          23        36   # BR(H -> Z       A      )
     3.50204200E-03    2     1000024  -1000024   # BR(H -> ~chi_1+ ~chi_1-)
     6.14389279E-02    2     1000022   1000022   # BR(H -> ~chi_10 ~chi_10)
     1.02218670E-02    2     1000023   1000023   # BR(H -> ~chi_20 ~chi_20)
     2.02261132E-02    2     1000025   1000025   # BR(H -> ~chi_30 ~chi_30)
     1.20843583E-01    2     1000022   1000023   # BR(H -> ~chi_10 ~chi_20)
     1.78536358E-01    2     1000022   1000025   # BR(H -> ~chi_10 ~chi_30)
     2.91722811E-02    2     1000023   1000025   # BR(H -> ~chi_20 ~chi_30)
#
#         PDG            Width
DECAY        36     8.83719259E+00   # A decays
#          BR         NDA      ID1       ID2
     3.59200245E-01    2           5        -5   # BR(A -> b       bb     )
     6.30798624E-02    2         -15        15   # BR(A -> tau+    tau-   )
     2.23055092E-04    2         -13        13   # BR(A -> mu+     mu-    )
     2.73631112E-04    2           3        -3   # BR(A -> s       sb     )
     1.53394382E-06    2           4        -4   # BR(A -> c       cb     )
     1.53168580E-01    2           6        -6   # BR(A -> t       tb     )
     1.51610773E-04    2          21        21   # BR(A -> g       g      )
     5.20654674E-07    2          22        22   # BR(A -> gam     gam    )
     1.83299762E-07    2          23        22   # BR(A -> Z       gam    )
     7.43059661E-05    2          23        25   # BR(A -> Z       h      )
     3.62402232E-03    2     1000024  -1000024   # BR(A -> ~chi_1+ ~chi_1-)
     5.54014277E-02    2     1000022   1000022   # BR(A -> ~chi_10 ~chi_10)
     1.60373649E-02    2     1000023   1000023   # BR(A -> ~chi_20 ~chi_20)
     1.31499813E-02    2     1000025   1000025   # BR(A -> ~chi_30 ~chi_30)
     1.94655827E-01    2     1000022   1000023   # BR(A -> ~chi_10 ~chi_20)
     1.11178465E-01    2     1000022   1000025   # BR(A -> ~chi_10 ~chi_30)
     2.97793834E-02    2     1000023   1000025   # BR(A -> ~chi_20 ~chi_30)
#
#         PDG            Width
DECAY        37     8.76129957E+00   # H+ decays
#          BR         NDA      ID1       ID2
     5.73775542E-04    2           4        -5   # BR(H+ -> c       bb     )
     6.36577867E-02    2         -15        16   # BR(H+ -> tau+    nu_tau )
     2.25098675E-04    2         -13        14   # BR(H+ -> mu+     nu_mu  )
     3.67214404E-06    2           2        -5   # BR(H+ -> u       bb     )
     1.32079724E-05    2           2        -3   # BR(H+ -> u       sb     )
     2.73139973E-04    2           4        -3   # BR(H+ -> c       sb     )
     5.09919541E-01    2           6        -5   # BR(H+ -> t       bb     )
     7.51094369E-05    2          24        25   # BR(H+ -> W+      h      )
     1.08525916E-12    2          24        36   # BR(H+ -> W+      A      )
     3.87494879E-01    2     1000024   1000022   # BR(H+ -> ~chi_1+ ~chi_10)
     5.78672238E-03    2     1000024   1000023   # BR(H+ -> ~chi_1+ ~chi_20)
     3.19770669E-02    2     1000024   1000025   # BR(H+ -> ~chi_1+ ~chi_30)
