#
#                              ======================
#                              | THE SUSYHIT OUTPUT |
#                              ======================
#
#
#              ------------------------------------------------------
#              |     This is the output of the SUSY-HIT package     |
#              |  created by A.Djouadi, M.Muehlleitner and M.Spira. |
#              |  In case of problems with SUSY-HIT email to        |
#              |           margarete.muehlleitner@kit.edu           |
#              |           michael.spira@psi.ch                     |
#              |           abdelhak.djouadi@cern.ch                 |
#              ------------------------------------------------------
#
#              ------------------------------------------------------
#              |  SUSY Les Houches Accord - MSSM Spectrum + Decays  |
#              |              based on the decay programs           |
#              |                                                    |
#              |                     SDECAY 1.5a                    |
#              |                                                    |
#              |  Authors: M.Muhlleitner, A.Djouadi and Y.Mambrini  |
#              |  Ref.:    Comput.Phys.Commun.168(2005)46           |
#              |           [hep-ph/0311167]                         |
#              |                                                    |
#              |                     HDECAY 3.4                     |
#              |                                                    |
#              |  By: A.Djouadi,J.Kalinowski,M.Muhlleitner,M.Spira  |
#              |  Ref.:    Comput.Phys.Commun.108(1998)56           |
#              |           [hep-ph/9704448]                         |
#              |                                                    |
#              |                                                    |
#              |  If not stated otherwise all DRbar couplings and   |
#              |  soft SUSY breaking masses are given at the scale  |
#              |  Q=  0.91187600E+02
#              |                                                    |
#              ------------------------------------------------------
#
#
BLOCK DCINFO  # Decay Program information
     1   SDECAY/HDECAY # decay calculator
     2   1.5a /3.4    # version number
#
BLOCK SPINFO  # Spectrum calculator information
     1   SuSpect     # RGE +Spectrum calculator            
     2   2.43         # version number                     
#
BLOCK MODSEL  # Model selection
     1     2   # GMSB                                              
#
BLOCK SMINPUTS  # Standard Model inputs
         1     1.27932904E+02   # alpha_em^-1(M_Z)^MSbar
         2     1.16639000E-05   # G_F [GeV^-2]
         3     1.17200000E-01   # alpha_S(M_Z)^MSbar
         4     9.11870000E+01   # M_Z pole mass
         5     4.25000000E+00   # mb(mb)^MSbar
         6     1.72900000E+02   # mt pole mass
         7     1.77700000E+00   # mtau pole mass
#
BLOCK MINPAR  # Input parameters - minimal models
#
BLOCK EXTPAR  # Input parameters - non-minimal models
         0     9.11876000E+01   # EWSB                
         1     4.59000000E+02   # M_1                 
         2     3.00000000E+03   # M_2                 
         3     2.80000000E+03   # M_3                 
        11     0.00000000E+00   # A_t                 
        12     0.00000000E+00   # A_b                 
        13     0.00000000E+00   # A_tau               
        14     0.00000000E+00   # A_u                 
        15     0.00000000E+00   # A_d                 
        16     0.00000000E+00   # A_e                 
        23     4.50000000E+02   # mu(EWSB)            
        25     1.50000000E+00   # tanbeta(in)         
        26     2.00000000E+03   # MA_pole             
        31     5.00000000E+03   # M_eL                
        32     5.00000000E+03   # M_muL               
        33     5.00000000E+03   # M_tauL              
        34     5.00000000E+03   # M_eR                
        35     5.00000000E+03   # M_muR               
        36     5.00000000E+03   # M_tauR              
        41     5.00000000E+03   # M_q1L               
        42     5.00000000E+03   # M_q2L               
        43     5.00000000E+03   # M_q3L               
        44     5.00000000E+03   # M_uR                
        45     5.00000000E+03   # M_cR                
        46     5.00000000E+03   # M_tR                
        47     5.00000000E+03   # M_dR                
        48     5.00000000E+03   # M_sR                
        49     5.00000000E+03   # M_bR                
#
BLOCK MASS  # Mass Spectrum
# PDG code           mass       particle
        24     8.05385960E+01   # W+
        25     1.25000000E+02   # h
        35     2.00424776E+03   # H
        36     2.00000000E+03   # A
        37     2.00200325E+03   # H+
         5     4.87877839E+00   # b-quark pole mass calculated from mb(mb)_Msbar
   1000001     5.00013309E+03   # ~d_L
   2000001     5.00002534E+03   # ~d_R
   1000002     4.99989224E+03   # ~u_L
   2000002     4.99994933E+03   # ~u_R
   1000003     5.00013309E+03   # ~s_L
   2000003     5.00002534E+03   # ~s_R
   1000004     4.99989224E+03   # ~c_L
   2000004     4.99994933E+03   # ~c_R
   1000005     4.99989064E+03   # ~b_1
   2000005     5.00026922E+03   # ~b_2
   1000006     4.99767063E+03   # ~t_1
   2000006     5.00679694E+03   # ~t_2
   1000011     5.00008242E+03   # ~e_L
   2000011     5.00007601E+03   # ~e_R
   1000012     4.99984157E+03   # ~nu_eL
   1000013     5.00008242E+03   # ~mu_L
   2000013     5.00007601E+03   # ~mu_R
   1000014     4.99984157E+03   # ~nu_muL
   1000015     4.99995950E+03   # ~tau_1
   2000015     5.00019955E+03   # ~tau_2
   1000016     4.99984157E+03   # ~nu_tauL
   1000021     2.80000000E+03   # ~g
   1000022     4.09424147E+02   # ~chi_10
   1000023    -4.50154065E+02   # ~chi_20
   1000025     4.97300430E+02   # ~chi_30
   1000035     3.00242949E+03   # ~chi_40
   1000024     4.47710750E+02   # ~chi_1+
   1000037     3.00242887E+03   # ~chi_2+
   1000039     1.00000000E-09   # ~gravitino
#
BLOCK NMIX  # Neutralino Mixing Matrix
  1  1     6.59434065E-01   # N_11
  1  2    -2.24641677E-02   # N_12
  1  3     5.36332203E-01   # N_13
  1  4    -5.26298246E-01   # N_14
  2  1     9.62979899E-03   # N_21
  2  2    -4.51711647E-03   # N_22
  2  3    -7.06461434E-01   # N_23
  2  4    -7.07671608E-01   # N_24
  3  1     7.51700534E-01   # N_31
  3  2     2.04778739E-02   # N_32
  3  3    -4.61437506E-01   # N_33
  3  4     4.70746632E-01   # N_34
  4  1     5.36345721E-04   # N_41
  4  2    -9.99527695E-01   # N_42
  4  3    -1.83149973E-02   # N_43
  4  4     2.46710296E-02   # N_44
#
BLOCK UMIX  # Chargino Mixing Matrix U
  1  1    -2.58912874E-02   # U_11
  1  2     9.99664764E-01   # U_12
  2  1     9.99664764E-01   # U_21
  2  2     2.58912874E-02   # U_22
#
BLOCK VMIX  # Chargino Mixing Matrix V
  1  1    -3.48835151E-02   # V_11
  1  2     9.99391385E-01   # V_12
  2  1     9.99391385E-01   # V_21
  2  2     3.48835151E-02   # V_22
#
BLOCK STOPMIX  # Stop Mixing Matrix
  1  1     7.09313808E-01   # cos(theta_t)
  1  2     7.04892844E-01   # sin(theta_t)
  2  1    -7.04892844E-01   # -sin(theta_t)
  2  2     7.09313808E-01   # cos(theta_t)
#
BLOCK SBOTMIX  # Sbottom Mixing Matrix
  1  1     5.98067622E-01   # cos(theta_b)
  1  2     8.01445644E-01   # sin(theta_b)
  2  1    -8.01445644E-01   # -sin(theta_b)
  2  2     5.98067622E-01   # cos(theta_b)
#
BLOCK STAUMIX  # Stau Mixing Matrix
  1  1     6.97596739E-01   # cos(theta_tau)
  1  2     7.16490607E-01   # sin(theta_tau)
  2  1    -7.16490607E-01   # -sin(theta_tau)
  2  2     6.97596739E-01   # cos(theta_tau)
#
BLOCK ALPHA  # Higgs mixing
          -5.90208403E-01   # Mixing angle in the neutral Higgs boson sector
#
BLOCK HMIX Q=  9.11876000E+01  # DRbar Higgs Parameters
         1     4.50000000E+02   # mu(Q)               
         2     1.49999979E+00   # tanbeta(Q)          
         3     2.51892726E+02   # vev(Q)              
         4     3.74001766E+06   # MA^2(Q)             
#
BLOCK GAUGE Q=  9.11876000E+01  # The gauge couplings
     1     3.52960655E-01   # gprime(Q) DRbar
     2     6.28306231E-01   # g(Q) DRbar
     3     1.07511073E+00   # g3(Q) DRbar
#
BLOCK AU Q=  9.11876000E+01  # The trilinear couplings
  1  1     0.00000000E+00   # A_u(Q) DRbar
  2  2     0.00000000E+00   # A_c(Q) DRbar
  3  3     0.00000000E+00   # A_t(Q) DRbar
#
BLOCK AD Q=  9.11876000E+01  # The trilinear couplings
  1  1     0.00000000E+00   # A_d(Q) DRbar
  2  2     0.00000000E+00   # A_s(Q) DRbar
  3  3     0.00000000E+00   # A_b(Q) DRbar
#
BLOCK AE Q=  9.11876000E+01  # The trilinear couplings
  1  1     0.00000000E+00   # A_e(Q) DRbar
  2  2     0.00000000E+00   # A_mu(Q) DRbar
  3  3     0.00000000E+00   # A_tau(Q) DRbar
#
BLOCK Yu Q=  9.11876000E+01  # The Yukawa couplings
  1  1     0.00000000E+00   # y_u(Q) DRbar
  2  2     0.00000000E+00   # y_c(Q) DRbar
  3  3     1.02678433E+00   # y_t(Q) DRbar
#
BLOCK Yd Q=  9.11876000E+01  # The Yukawa couplings
  1  1     0.00000000E+00   # y_d(Q) DRbar
  2  2     0.00000000E+00   # y_s(Q) DRbar
  3  3     2.72094842E-02   # y_b(Q) DRbar
#
BLOCK Ye Q=  9.11876000E+01  # The Yukawa couplings
  1  1     0.00000000E+00   # y_e(Q) DRbar
  2  2     0.00000000E+00   # y_mu(Q) DRbar
  3  3     1.79911915E-02   # y_tau(Q) DRbar
#
BLOCK MSOFT Q=  9.11876000E+01  # The soft SUSY breaking masses at the scale Q
         1     4.59000000E+02   # M_1                 
         2     3.00000000E+03   # M_2                 
         3     2.80000000E+03   # M_3                 
        14     0.00000000E+00   # A_u                 
        15     0.00000000E+00   # A_d                 
        16     0.00000000E+00   # A_e                 
        21     2.83402519E+06   # M^2_Hd              
        22    -5.45869515E+06   # M^2_Hu              
        31     5.00000000E+03   # M_eL                
        32     5.00000000E+03   # M_muL               
        33     5.00000000E+03   # M_tauL              
        34     5.00000000E+03   # M_eR                
        35     5.00000000E+03   # M_muR               
        36     5.00000000E+03   # M_tauR              
        41     5.00000000E+03   # M_q1L               
        42     5.00000000E+03   # M_q2L               
        43     5.00000000E+03   # M_q3L               
        44     5.00000000E+03   # M_uR                
        45     5.00000000E+03   # M_cR                
        46     5.00000000E+03   # M_tR                
        47     5.00000000E+03   # M_dR                
        48     5.00000000E+03   # M_sR                
        49     5.00000000E+03   # M_bR                
#
#
#
#                             =================
#                             |The decay table|
#                             =================
#
# - The QCD corrections to the decays gluino -> squark  + quark
#                                     squark -> gaugino + quark_prime
#                                     squark -> squark_prime + Higgs
#                                     squark -> gluino  + quark
#   are included.
#
# - The multi-body decays for the inos, stops and sbottoms are included.
#
# - The loop induced decays for the gluino, neutralinos and stops
#   are included.
#
# - The SUSY decays of the top quark are included.
#
# - Possible decays of the NLSP in GMSB models are included.
#
#
#         PDG            Width
DECAY         6     1.37553898E+00   # top decays
#          BR         NDA      ID1       ID2
     1.00000000E+00    2           5        24   # BR(t ->  b    W+)
#
#         PDG            Width
DECAY   1000021     2.45016781E-02   # gluino decays
#          BR         NDA      ID1       ID2
     2.15217865E-03    2     1000022        21   # BR(~g -> ~chi_10 g)
     3.85073092E-03    2     1000023        21   # BR(~g -> ~chi_20 g)
     1.65886663E-03    2     1000025        21   # BR(~g -> ~chi_30 g)
#          BR         NDA      ID1       ID2
     0.00000000E+00    2     1000039        21   # BR(~g -> ~G      g)
#           BR         NDA      ID1       ID2       ID3
     3.08792931E-03    3     1000022         1        -1   # BR(~g -> ~chi_10 d  db)
     1.21914562E-06    3     1000023         1        -1   # BR(~g -> ~chi_20 d  db)
     3.37575307E-03    3     1000025         1        -1   # BR(~g -> ~chi_30 d  db)
     9.53846988E-03    3     1000022         2        -2   # BR(~g -> ~chi_10 u  ub)
     1.36758247E-06    3     1000023         2        -2   # BR(~g -> ~chi_20 u  ub)
     1.23560755E-02    3     1000025         2        -2   # BR(~g -> ~chi_30 u  ub)
     3.08792931E-03    3     1000022         3        -3   # BR(~g -> ~chi_10 s  sb)
     1.21914562E-06    3     1000023         3        -3   # BR(~g -> ~chi_20 s  sb)
     3.37575307E-03    3     1000025         3        -3   # BR(~g -> ~chi_30 s  sb)
     9.53846988E-03    3     1000022         4        -4   # BR(~g -> ~chi_10 c  cb)
     1.36758247E-06    3     1000023         4        -4   # BR(~g -> ~chi_20 c  cb)
     1.23560755E-02    3     1000025         4        -4   # BR(~g -> ~chi_30 c  cb)
     3.17747648E-03    3     1000022         5        -5   # BR(~g -> ~chi_10 b  bb)
     1.69210833E-04    3     1000023         5        -5   # BR(~g -> ~chi_20 b  bb)
     3.45291679E-03    3     1000025         5        -5   # BR(~g -> ~chi_30 b  bb)
     1.25221061E-01    3     1000022         6        -6   # BR(~g -> ~chi_10 t  tb)
     2.19818387E-01    3     1000023         6        -6   # BR(~g -> ~chi_20 t  tb)
     1.16634202E-01    3     1000025         6        -6   # BR(~g -> ~chi_30 t  tb)
     6.91490581E-05    3     1000024         1        -2   # BR(~g -> ~chi_1+ d  ub)
     6.91490581E-05    3    -1000024         2        -1   # BR(~g -> ~chi_1- u  db)
     6.91490581E-05    3     1000024         3        -4   # BR(~g -> ~chi_1+ s  cb)
     6.91490581E-05    3    -1000024         4        -3   # BR(~g -> ~chi_1- c  sb)
     2.29389935E-01    3     1000024         5        -6   # BR(~g -> ~chi_1+ b  tb)
     2.29389935E-01    3    -1000024         6        -5   # BR(~g -> ~chi_1- t  bb)
#
#         PDG            Width
DECAY   1000006     2.57319384E+02   # stop1 decays
#          BR         NDA      ID1       ID2
     1.14398284E-01    2     1000022         6   # BR(~t_1 -> ~chi_10 t )
     1.39337529E-01    2     1000023         6   # BR(~t_1 -> ~chi_20 t )
     4.57482791E-02    2     1000025         6   # BR(~t_1 -> ~chi_30 t )
     1.40170901E-02    2     1000035         6   # BR(~t_1 -> ~chi_40 t )
     1.40847985E-01    2     1000024         5   # BR(~t_1 -> ~chi_1+ b )
     2.79210261E-02    2     1000037         5   # BR(~t_1 -> ~chi_2+ b )
     5.17729807E-01    2     1000021         6   # BR(~t_1 -> ~g      t )
#
#         PDG            Width
DECAY   2000006     2.44488703E+02   # stop2 decays
#          BR         NDA      ID1       ID2
     5.89859608E-02    2     1000022         6   # BR(~t_2 -> ~chi_10 t )
     1.42492681E-01    2     1000023         6   # BR(~t_2 -> ~chi_20 t )
     1.05444505E-01    2     1000025         6   # BR(~t_2 -> ~chi_30 t )
     1.72138600E-02    2     1000035         6   # BR(~t_2 -> ~chi_40 t )
     1.40896973E-01    2     1000024         5   # BR(~t_2 -> ~chi_1+ b )
     3.43166674E-02    2     1000037         5   # BR(~t_2 -> ~chi_2+ b )
     5.00649354E-01    2     1000021         6   # BR(~t_2 -> ~g      t )
#
#         PDG            Width
DECAY   1000005     1.35140955E+02   # sbottom1 decays
#          BR         NDA      ID1       ID2
     9.03186432E-03    2     1000022         5   # BR(~b_1 -> ~chi_10 b )
     1.45494873E-04    2     1000023         5   # BR(~b_1 -> ~chi_20 b )
     8.77534260E-03    2     1000025         5   # BR(~b_1 -> ~chi_30 b )
     6.99836027E-03    2     1000035         5   # BR(~b_1 -> ~chi_40 b )
     1.40111049E-02    2    -1000024         6   # BR(~b_1 -> ~chi_1- t )
     1.40151870E-02    2    -1000037         6   # BR(~b_1 -> ~chi_2- t )
     9.47022646E-01    2     1000021         5   # BR(~b_1 -> ~g      b )
#
#         PDG            Width
DECAY   2000005     2.17931835E+02   # sbottom2 decays
#          BR         NDA      ID1       ID2
     1.53768430E-03    2     1000022         5   # BR(~b_2 -> ~chi_10 b )
     1.41453774E-04    2     1000023         5   # BR(~b_2 -> ~chi_20 b )
     2.58686875E-03    2     1000025         5   # BR(~b_2 -> ~chi_30 b )
     3.12819271E-02    2     1000035         5   # BR(~b_2 -> ~chi_40 b )
     3.14982715E-01    2    -1000024         6   # BR(~b_2 -> ~chi_1- t )
     6.28105499E-02    2    -1000037         6   # BR(~b_2 -> ~chi_2- t )
     5.86658801E-01    2     1000021         5   # BR(~b_2 -> ~g      b )
#
#         PDG            Width
DECAY   1000002     1.51891492E+02   # sup_L decays
#          BR         NDA      ID1       ID2
     1.24670623E-03    2     1000022         2   # BR(~u_L -> ~chi_10 u)
     8.97404957E-07    2     1000023         2   # BR(~u_L -> ~chi_20 u)
     3.15679125E-03    2     1000025         2   # BR(~u_L -> ~chi_30 u)
     5.10778371E-02    2     1000035         2   # BR(~u_L -> ~chi_40 u)
     2.96584348E-04    2     1000024         1   # BR(~u_L -> ~chi_1+ d)
     1.02148387E-01    2     1000037         1   # BR(~u_L -> ~chi_2+ d)
     8.42072797E-01    2     1000021         2   # BR(~u_L -> ~g      u)
#
#         PDG            Width
DECAY   2000002     1.38282967E+02   # sup_R decays
#          BR         NDA      ID1       ID2
     3.27389452E-02    2     1000022         2   # BR(~u_R -> ~chi_10 u)
     6.96300308E-06    2     1000023         2   # BR(~u_R -> ~chi_20 u)
     4.22824445E-02    2     1000025         2   # BR(~u_R -> ~chi_30 u)
     9.06541983E-09    2     1000035         2   # BR(~u_R -> ~chi_40 u)
     9.24971638E-01    2     1000021         2   # BR(~u_R -> ~g      u)
#
#         PDG            Width
DECAY   1000001     1.51897811E+02   # sdown_L decays
#          BR         NDA      ID1       ID2
     2.60229372E-03    2     1000022         1   # BR(~d_L -> ~chi_10 d)
     4.86732674E-06    2     1000023         1   # BR(~d_L -> ~chi_20 d)
     1.75678127E-03    2     1000025         1   # BR(~d_L -> ~chi_30 d)
     5.11042243E-02    2     1000035         1   # BR(~d_L -> ~chi_40 d)
     1.63387594E-04    2    -1000024         2   # BR(~d_L -> ~chi_1- u)
     1.02215987E-01    2    -1000037         2   # BR(~d_L -> ~chi_2- u)
     8.42152458E-01    2     1000021         1   # BR(~d_L -> ~g      d)
#
#         PDG            Width
DECAY   2000001     1.30507149E+02   # sdown_R decays
#          BR         NDA      ID1       ID2
     8.67253425E-03    2     1000022         1   # BR(~d_R -> ~chi_10 d)
     1.84449705E-06    2     1000023         1   # BR(~d_R -> ~chi_20 d)
     1.12006057E-02    2     1000025         1   # BR(~d_R -> ~chi_30 d)
     2.40150625E-09    2     1000035         1   # BR(~d_R -> ~chi_40 d)
     9.80125013E-01    2     1000021         1   # BR(~d_R -> ~g      d)
#
#         PDG            Width
DECAY   1000004     1.51891492E+02   # scharm_L decays
#          BR         NDA      ID1       ID2
     1.24670623E-03    2     1000022         4   # BR(~c_L -> ~chi_10 c)
     8.97404957E-07    2     1000023         4   # BR(~c_L -> ~chi_20 c)
     3.15679125E-03    2     1000025         4   # BR(~c_L -> ~chi_30 c)
     5.10778371E-02    2     1000035         4   # BR(~c_L -> ~chi_40 c)
     2.96584348E-04    2     1000024         3   # BR(~c_L -> ~chi_1+ s)
     1.02148387E-01    2     1000037         3   # BR(~c_L -> ~chi_2+ s)
     8.42072797E-01    2     1000021         4   # BR(~c_L -> ~g      c)
#
#         PDG            Width
DECAY   2000004     1.38282967E+02   # scharm_R decays
#          BR         NDA      ID1       ID2
     3.27389452E-02    2     1000022         4   # BR(~c_R -> ~chi_10 c)
     6.96300308E-06    2     1000023         4   # BR(~c_R -> ~chi_20 c)
     4.22824445E-02    2     1000025         4   # BR(~c_R -> ~chi_30 c)
     9.06541983E-09    2     1000035         4   # BR(~c_R -> ~chi_40 c)
     9.24971638E-01    2     1000021         4   # BR(~c_R -> ~g      c)
#
#         PDG            Width
DECAY   1000003     1.51897811E+02   # sstrange_L decays
#          BR         NDA      ID1       ID2
     2.60229372E-03    2     1000022         3   # BR(~s_L -> ~chi_10 s)
     4.86732674E-06    2     1000023         3   # BR(~s_L -> ~chi_20 s)
     1.75678127E-03    2     1000025         3   # BR(~s_L -> ~chi_30 s)
     5.11042243E-02    2     1000035         3   # BR(~s_L -> ~chi_40 s)
     1.63387594E-04    2    -1000024         4   # BR(~s_L -> ~chi_1- c)
     1.02215987E-01    2    -1000037         4   # BR(~s_L -> ~chi_2- c)
     8.42152458E-01    2     1000021         3   # BR(~s_L -> ~g      s)
#
#         PDG            Width
DECAY   2000003     1.30507149E+02   # sstrange_R decays
#          BR         NDA      ID1       ID2
     8.67253425E-03    2     1000022         3   # BR(~s_R -> ~chi_10 s)
     1.84449705E-06    2     1000023         3   # BR(~s_R -> ~chi_20 s)
     1.12006057E-02    2     1000025         3   # BR(~s_R -> ~chi_30 s)
     2.40150625E-09    2     1000035         3   # BR(~s_R -> ~chi_40 s)
     9.80125013E-01    2     1000021         3   # BR(~s_R -> ~g      s)
#
#         PDG            Width
DECAY   1000011     3.02056345E+01   # selectron_L decays
#          BR         NDA      ID1       ID2
     7.76613228E-02    2     1000022        11   # BR(~e_L -> ~chi_10 e-)
     5.09505053E-07    2     1000023        11   # BR(~e_L -> ~chi_20 e-)
     1.24918984E-01    2     1000025        11   # BR(~e_L -> ~chi_30 e-)
     2.65365192E-01    2     1000035        11   # BR(~e_L -> ~chi_40 e-)
     8.57585368E-04    2    -1000024        12   # BR(~e_L -> ~chi_1- nu_e)
     5.31196406E-01    2    -1000037        12   # BR(~e_L -> ~chi_2- nu_e)
#
#         PDG            Width
DECAY   2000011     2.43652356E+01   # selectron_R decays
#          BR         NDA      ID1       ID2
     4.36433470E-01    2     1000022        11   # BR(~e_R -> ~chi_10 e-)
     9.28077637E-05    2     1000023        11   # BR(~e_R -> ~chi_20 e-)
     5.63473603E-01    2     1000025        11   # BR(~e_R -> ~chi_30 e-)
     1.19644073E-07    2     1000035        11   # BR(~e_R -> ~chi_40 e-)
#
#         PDG            Width
DECAY   1000013     3.02056345E+01   # smuon_L decays
#          BR         NDA      ID1       ID2
     7.76613228E-02    2     1000022        13   # BR(~mu_L -> ~chi_10 mu-)
     5.09505053E-07    2     1000023        13   # BR(~mu_L -> ~chi_20 mu-)
     1.24918984E-01    2     1000025        13   # BR(~mu_L -> ~chi_30 mu-)
     2.65365192E-01    2     1000035        13   # BR(~mu_L -> ~chi_40 mu-)
     8.57585368E-04    2    -1000024        14   # BR(~mu_L -> ~chi_1- nu_mu)
     5.31196406E-01    2    -1000037        14   # BR(~mu_L -> ~chi_2- nu_mu)
#
#         PDG            Width
DECAY   2000013     2.43652356E+01   # smuon_R decays
#          BR         NDA      ID1       ID2
     4.36433470E-01    2     1000022        13   # BR(~mu_R -> ~chi_10 mu-)
     9.28077637E-05    2     1000023        13   # BR(~mu_R -> ~chi_20 mu-)
     5.63473603E-01    2     1000025        13   # BR(~mu_R -> ~chi_30 mu-)
     1.19644073E-07    2     1000035        13   # BR(~mu_R -> ~chi_40 mu-)
#
#         PDG            Width
DECAY   1000015     2.72845189E+01   # stau_1 decays
#          BR         NDA      ID1       ID2
     2.48310522E-01    2     1000022        15   # BR(~tau_1 -> ~chi_10  tau-)
     4.21294174E-04    2     1000023        15   # BR(~tau_1 -> ~chi_20  tau-)
     3.20576526E-01    2     1000025        15   # BR(~tau_1 -> ~chi_30  tau-)
     1.42733900E-01    2     1000035        15   # BR(~tau_1 -> ~chi_40  tau-)
     2.10695266E-03    2    -1000024        16   # BR(~tau_1 -> ~chi_1-  nu_tau)
     2.85718948E-01    2    -1000037        16   # BR(~tau_1 -> ~chi_2-  nu_tau)
     1.31856802E-04    2     1000039        15   # BR(~tau_1 -> ~G       tau-)
#
#         PDG            Width
DECAY   2000015     2.73849698E+01   # stau_2 decays
#          BR         NDA      ID1       ID2
     2.27235112E-01    2     1000022        15   # BR(~tau_2 -> ~chi_10  tau-)
     8.18027034E-04    2     1000023        15   # BR(~tau_2 -> ~chi_20  tau-)
     3.20216308E-01    2     1000025        15   # BR(~tau_2 -> ~chi_30  tau-)
     1.50488225E-01    2     1000035        15   # BR(~tau_2 -> ~chi_40  tau-)
     2.83622278E-06    2    -1000024        16   # BR(~tau_2 -> ~chi_1-  nu_tau)
     3.01239491E-01    2    -1000037        16   # BR(~tau_2 -> ~chi_2-  nu_tau)
#
#         PDG            Width
DECAY   1000012     3.02045206E+01   # snu_eL decays
#          BR         NDA      ID1       ID2
     9.90084742E-02    2     1000022        12   # BR(~nu_eL -> ~chi_10 nu_e)
     6.30197265E-05    2     1000023        12   # BR(~nu_eL -> ~chi_20 nu_e)
     1.02876087E-01    2     1000025        12   # BR(~nu_eL -> ~chi_30 nu_e)
     2.65653487E-01    2     1000035        12   # BR(~nu_eL -> ~chi_40 nu_e)
     1.55670017E-03    2     1000024        11   # BR(~nu_eL -> ~chi_1+ e-)
     5.30842232E-01    2     1000037        11   # BR(~nu_eL -> ~chi_2+ e-)
#
#         PDG            Width
DECAY   1000014     3.02045206E+01   # snu_muL decays
#          BR         NDA      ID1       ID2
     9.90084742E-02    2     1000022        14   # BR(~nu_muL -> ~chi_10 nu_mu)
     6.30197265E-05    2     1000023        14   # BR(~nu_muL -> ~chi_20 nu_mu)
     1.02876087E-01    2     1000025        14   # BR(~nu_muL -> ~chi_30 nu_mu)
     2.65653487E-01    2     1000035        14   # BR(~nu_muL -> ~chi_40 nu_mu)
     1.55670017E-03    2     1000024        13   # BR(~nu_muL -> ~chi_1+ mu-)
     5.30842232E-01    2     1000037        13   # BR(~nu_muL -> ~chi_2+ mu-)
#
#         PDG            Width
DECAY   1000016     3.02361913E+01   # snu_tauL decays
#          BR         NDA      ID1       ID2
     9.89047686E-02    2     1000022        16   # BR(~nu_tauL -> ~chi_10 nu_tau)
     6.29537170E-05    2     1000023        16   # BR(~nu_tauL -> ~chi_20 nu_tau)
     1.02768330E-01    2     1000025        16   # BR(~nu_tauL -> ~chi_30 nu_tau)
     2.65375230E-01    2     1000035        16   # BR(~nu_tauL -> ~chi_40 nu_tau)
     2.60202226E-03    2     1000024        15   # BR(~nu_tauL -> ~chi_1+ tau-)
     5.30286695E-01    2     1000037        15   # BR(~nu_tauL -> ~chi_2+ tau-)
#
#         PDG            Width
DECAY   1000024     5.26169744E-05   # chargino1+ decays
#          BR         NDA      ID1       ID2
     1.73478609E-04    2     1000039        24   # BR(~chi_1+ -> ~G       W+)
#           BR         NDA      ID1       ID2       ID3
     3.34426283E-01    3     1000022         2        -1   # BR(~chi_1+ -> ~chi_10 u    db)
     3.32165651E-01    3     1000022         4        -3   # BR(~chi_1+ -> ~chi_10 c    sb)
     1.11475556E-01    3     1000022       -11        12   # BR(~chi_1+ -> ~chi_10 e+   nu_e)
     1.11471313E-01    3     1000022       -13        14   # BR(~chi_1+ -> ~chi_10 mu+  nu_mu)
     1.10287718E-01    3     1000022       -15        16   # BR(~chi_1+ -> ~chi_10 tau+ nu_tau)
#
#         PDG            Width
DECAY   1000037     3.27844143E+01   # chargino2+ decays
#          BR         NDA      ID1       ID2
     2.25788563E-01    2     1000024        23   # BR(~chi_2+ -> ~chi_1+  Z )
     1.17733710E-01    2     1000022        24   # BR(~chi_2+ -> ~chi_10  W+)
     2.20182903E-01    2     1000023        24   # BR(~chi_2+ -> ~chi_20  W+)
     1.02428240E-01    2     1000025        24   # BR(~chi_2+ -> ~chi_30  W+)
     2.26659999E-01    2     1000024        25   # BR(~chi_2+ -> ~chi_1+  h )
     2.66822325E-02    2     1000024        35   # BR(~chi_2+ -> ~chi_1+  H )
     2.69382729E-02    2     1000024        36   # BR(~chi_2+ -> ~chi_1+  A )
     1.63101698E-02    2     1000022        37   # BR(~chi_2+ -> ~chi_10  H+)
     2.66858149E-02    2     1000023        37   # BR(~chi_2+ -> ~chi_20  H+)
     1.05815540E-02    2     1000025        37   # BR(~chi_2+ -> ~chi_30  H+)
     8.54062452E-06    2     1000039        24   # BR(~chi_2+ -> ~G       W+)
     3.41771051E-10    2     1000039        37   # BR(~chi_2+ -> ~G       H+)
#
#         PDG            Width
DECAY   1000022    1.0E-05    # neutralino1 decays
#          BR         NDA      ID1       ID2
     4.96208456E-01    2     1000039        22   # BR(~chi_10 -> ~G        gam)
     4.93632959E-01    2     1000039        23   # BR(~chi_10 -> ~G        Z)
     1.01585849E-02    2     1000039        25   # BR(~chi_10 -> ~G        h)
#
#         PDG            Width
DECAY   1000023     5.80651534E-05   # neutralino2 decays
#          BR         NDA      ID1       ID2
     8.96104707E-04    2     1000022        22   # BR(~chi_20 -> ~chi_10 gam)
#          BR         NDA      ID1       ID2
     1.40128396E-08    2     1000039        22   # BR(~chi_20 -> ~G        gam)
     6.03419460E-06    2     1000039        23   # BR(~chi_20 -> ~G        Z)
     1.27966405E-04    2     1000039        25   # BR(~chi_20 -> ~G        h)
#           BR         NDA      ID1       ID2       ID3
     1.19333220E-01    3     1000022        -2         2   # BR(~chi_20 -> ~chi_10 ub      u)
     1.54482000E-01    3     1000022        -1         1   # BR(~chi_20 -> ~chi_10 db      d)
     1.18275079E-01    3     1000022        -4         4   # BR(~chi_20 -> ~chi_10 cb      c)
     1.54452342E-01    3     1000022        -3         3   # BR(~chi_20 -> ~chi_10 sb      s)
     1.35848895E-01    3     1000022        -5         5   # BR(~chi_20 -> ~chi_10 bb      b)
     3.52642530E-02    3     1000022       -11        11   # BR(~chi_20 -> ~chi_10 e+      e-)
     3.52626417E-02    3     1000022       -13        13   # BR(~chi_20 -> ~chi_10 mu+     mu-)
     3.48084742E-02    3     1000022       -15        15   # BR(~chi_20 -> ~chi_10 tau+    tau-)
     7.04136391E-02    3     1000022       -12        12   # BR(~chi_20 -> ~chi_10 nu_eb   nu_e)
     7.04136391E-02    3     1000022       -14        14   # BR(~chi_20 -> ~chi_10 nu_mub  nu_mu)
     7.04136391E-02    3     1000022       -16        16   # BR(~chi_20 -> ~chi_10 nu_taub nu_tau)
     5.55031458E-07    3     1000024        -2         1   # BR(~chi_20 -> ~chi_1+ ub      d)
     5.55031458E-07    3    -1000024        -1         2   # BR(~chi_20 -> ~chi_1- db      u)
     9.63712830E-08    3     1000024        -4         3   # BR(~chi_20 -> ~chi_1+ cb      s)
     9.63712830E-08    3    -1000024        -3         4   # BR(~chi_20 -> ~chi_1- sb      c)
     1.85010507E-07    3     1000024       -12        11   # BR(~chi_20 -> ~chi_1+ nu_eb   e-)
     1.85010507E-07    3    -1000024        12       -11   # BR(~chi_20 -> ~chi_1- nu_e    e+)
     1.83298140E-07    3     1000024       -14        13   # BR(~chi_20 -> ~chi_1+ nu_mub  mu-)
     1.83298140E-07    3    -1000024        14       -13   # BR(~chi_20 -> ~chi_1- nu_mu   mu+)
     9.11862378E-09    3     1000024       -16        15   # BR(~chi_20 -> ~chi_1+ nu_taub tau-)
     9.11862378E-09    3    -1000024        16       -15   # BR(~chi_20 -> ~chi_1- nu_tau  tau+)
#
#         PDG            Width
DECAY   1000025     4.21839445E-04   # neutralino3 decays
#          BR         NDA      ID1       ID2
     1.87536860E-04    2     1000022        22   # BR(~chi_30 -> ~chi_10 gam)
     4.81533055E-04    2     1000023        22   # BR(~chi_30 -> ~chi_20 gam)
#          BR         NDA      ID1       ID2
     3.67534106E-05    2     1000039        22   # BR(~chi_30 -> ~G        gam)
     2.40675927E-05    2     1000039        23   # BR(~chi_30 -> ~G        Z)
     5.76625005E-07    2     1000039        25   # BR(~chi_30 -> ~G        h)
#           BR         NDA      ID1       ID2       ID3
     1.86919692E-06    3     1000022        -2         2   # BR(~chi_30 -> ~chi_10 ub      u)
     2.67005639E-06    3     1000022        -1         1   # BR(~chi_30 -> ~chi_10 db      d)
     2.52543739E-06    3     1000022        -4         4   # BR(~chi_30 -> ~chi_10 cb      c)
     2.68232794E-06    3     1000022        -3         3   # BR(~chi_30 -> ~chi_10 sb      s)
     5.00056632E-06    3     1000022        -5         5   # BR(~chi_30 -> ~chi_10 bb      b)
     8.80002634E-07    3     1000022       -11        11   # BR(~chi_30 -> ~chi_10 e+      e-)
     8.79988718E-07    3     1000022       -13        13   # BR(~chi_30 -> ~chi_10 mu+     mu-)
     1.23481978E-06    3     1000022       -15        15   # BR(~chi_30 -> ~chi_10 tau+    tau-)
     1.10121302E-06    3     1000022       -12        12   # BR(~chi_30 -> ~chi_10 nu_eb   nu_e)
     1.10121302E-06    3     1000022       -14        14   # BR(~chi_30 -> ~chi_10 nu_mub  nu_mu)
     1.10121302E-06    3     1000022       -16        16   # BR(~chi_30 -> ~chi_10 nu_taub nu_tau)
     2.73606836E-02    3     1000023        -2         2   # BR(~chi_30 -> ~chi_20 ub      u)
     3.54197233E-02    3     1000023        -1         1   # BR(~chi_30 -> ~chi_20 db      d)
     2.71696860E-02    3     1000023        -4         4   # BR(~chi_30 -> ~chi_20 cb      c)
     3.54145432E-02    3     1000023        -3         3   # BR(~chi_30 -> ~chi_20 sb      s)
     3.21358978E-02    3     1000023        -5         5   # BR(~chi_30 -> ~chi_20 bb      b)
     8.08548954E-03    3     1000023       -11        11   # BR(~chi_30 -> ~chi_20 e+      e-)
     8.08519156E-03    3     1000023       -13        13   # BR(~chi_30 -> ~chi_20 mu+     mu-)
     8.00137033E-03    3     1000023       -15        15   # BR(~chi_30 -> ~chi_20 tau+    tau-)
     1.61443692E-02    3     1000023       -12        12   # BR(~chi_30 -> ~chi_20 nu_eb   nu_e)
     1.61443692E-02    3     1000023       -14        14   # BR(~chi_30 -> ~chi_20 nu_mub  nu_mu)
     1.61443692E-02    3     1000023       -16        16   # BR(~chi_30 -> ~chi_20 nu_taub nu_tau)
     1.28451874E-01    3     1000024        -2         1   # BR(~chi_30 -> ~chi_1+ ub      d)
     1.28451874E-01    3    -1000024        -1         2   # BR(~chi_30 -> ~chi_1- db      u)
     1.27938864E-01    3     1000024        -4         3   # BR(~chi_30 -> ~chi_1+ cb      s)
     1.27938864E-01    3    -1000024        -3         4   # BR(~chi_30 -> ~chi_1- sb      c)
     4.28171991E-02    3     1000024       -12        11   # BR(~chi_30 -> ~chi_1+ nu_eb   e-)
     4.28171991E-02    3    -1000024        12       -11   # BR(~chi_30 -> ~chi_1- nu_e    e+)
     4.28162388E-02    3     1000024       -14        13   # BR(~chi_30 -> ~chi_1+ nu_mub  mu-)
     4.28162388E-02    3    -1000024        14       -13   # BR(~chi_30 -> ~chi_1- nu_mu   mu+)
     4.25472208E-02    3     1000024       -16        15   # BR(~chi_30 -> ~chi_1+ nu_taub tau-)
     4.25472208E-02    3    -1000024        16       -15   # BR(~chi_30 -> ~chi_1- nu_tau  tau+)
#
#         PDG            Width
DECAY   1000035     3.27848238E+01   # neutralino4 decays
#          BR         NDA      ID1       ID2
     2.42464092E-03    2     1000022        23   # BR(~chi_40 -> ~chi_10   Z )
     2.21152324E-01    2     1000023        23   # BR(~chi_40 -> ~chi_20   Z )
     2.36191699E-03    2     1000025        23   # BR(~chi_40 -> ~chi_30   Z )
     2.19967931E-01    2     1000024       -24   # BR(~chi_40 -> ~chi_1+   W-)
     2.19967931E-01    2    -1000024        24   # BR(~chi_40 -> ~chi_1-   W+)
     1.18923226E-01    2     1000022        25   # BR(~chi_40 -> ~chi_10   h )
     1.77239237E-03    2     1000022        35   # BR(~chi_40 -> ~chi_10   H )
     1.45188475E-02    2     1000022        36   # BR(~chi_40 -> ~chi_10   A )
     4.78168278E-03    2     1000023        25   # BR(~chi_40 -> ~chi_20   h )
     2.36043810E-02    2     1000023        35   # BR(~chi_40 -> ~chi_20   H )
     2.98954763E-03    2     1000023        36   # BR(~chi_40 -> ~chi_20   A )
     1.03215094E-01    2     1000025        25   # BR(~chi_40 -> ~chi_30   h )
     1.16812772E-03    2     1000025        35   # BR(~chi_40 -> ~chi_30   H )
     9.40430414E-03    2     1000025        36   # BR(~chi_40 -> ~chi_30   A )
     2.68695567E-02    2     1000024       -37   # BR(~chi_40 -> ~chi_1+   H-)
     2.68695567E-02    2    -1000024        37   # BR(~chi_40 -> ~chi_1-   H+)
     2.04939666E-06    2     1000039        22   # BR(~chi_40 -> ~G        gam)
     6.49043696E-06    2     1000039        23   # BR(~chi_40 -> ~G        Z)
     4.51724785E-10    2     1000039        25   # BR(~chi_40 -> ~G        h)
     3.39078363E-10    2     1000039        35   # BR(~chi_40 -> ~G        H)
     9.90574148E-13    2     1000039        36   # BR(~chi_40 -> ~G        A)
#
#         PDG            Width
DECAY        25     4.08391612E-03   # h decays
#          BR         NDA      ID1       ID2
     6.17516709E-01    2           5        -5   # BR(h -> b       bb     )
     6.37774453E-02    2         -15        15   # BR(h -> tau+    tau-   )
     2.25748668E-04    2         -13        13   # BR(h -> mu+     mu-    )
     4.78381629E-04    2           3        -3   # BR(h -> s       sb     )
     2.06378532E-02    2           4        -4   # BR(h -> c       cb     )
     6.70123629E-02    2          21        21   # BR(h -> g       g      )
     2.31038887E-03    2          22        22   # BR(h -> gam     gam    )
     1.53803212E-03    2          22        23   # BR(h -> Z       gam    )
     2.00874822E-01    2          24       -24   # BR(h -> W+      W-     )
     2.56282560E-02    2          23        23   # BR(h -> Z       Z      )
#
#         PDG            Width
DECAY        35     3.99485426E+01   # H decays
#          BR         NDA      ID1       ID2
     1.39437754E-03    2           5        -5   # BR(H -> b       bb     )
     2.33262158E-04    2         -15        15   # BR(H -> tau+    tau-   )
     8.24668574E-07    2         -13        13   # BR(H -> mu+     mu-    )
     1.05585951E-06    2           3        -3   # BR(H -> s       sb     )
     9.52910053E-06    2           4        -4   # BR(H -> c       cb     )
     9.42866625E-01    2           6        -6   # BR(H -> t       tb     )
     7.55010527E-04    2          21        21   # BR(H -> g       g      )
     2.64077506E-06    2          22        22   # BR(H -> gam     gam    )
     1.09728390E-06    2          23        22   # BR(H -> Z       gam    )
     3.18669485E-04    2          24       -24   # BR(H -> W+      W-     )
     1.58900159E-04    2          23        23   # BR(H -> Z       Z      )
     8.56745036E-04    2          25        25   # BR(H -> h       h      )
     9.47369109E-24    2          36        36   # BR(H -> A       A      )
     3.73504701E-11    2          23        36   # BR(H -> Z       A      )
     3.74935772E-12    2          24       -37   # BR(H -> W+      H-     )
     3.74935772E-12    2         -24        37   # BR(H -> W-      H+     )
     6.49523525E-05    2     1000024  -1000024   # BR(H -> ~chi_1+ ~chi_1-)
     1.05137318E-03    2     1000022   1000022   # BR(H -> ~chi_10 ~chi_10)
     2.71770396E-05    2     1000023   1000023   # BR(H -> ~chi_20 ~chi_20)
     5.90522035E-04    2     1000025   1000025   # BR(H -> ~chi_30 ~chi_30)
     2.55439104E-02    2     1000022   1000023   # BR(H -> ~chi_10 ~chi_20)
     2.39844403E-05    2     1000022   1000025   # BR(H -> ~chi_10 ~chi_30)
     2.60993431E-02    2     1000023   1000025   # BR(H -> ~chi_20 ~chi_30)
#
#         PDG            Width
DECAY        36     4.03996884E+01   # A decays
#          BR         NDA      ID1       ID2
     1.39701410E-03    2           5        -5   # BR(A -> b       bb     )
     2.30848721E-04    2         -15        15   # BR(A -> tau+    tau-   )
     8.16133620E-07    2         -13        13   # BR(A -> mu+     mu-    )
     1.07595435E-06    2           3        -3   # BR(A -> s       sb     )
     9.42879115E-06    2           4        -4   # BR(A -> c       cb     )
     9.43654778E-01    2           6        -6   # BR(A -> t       tb     )
     8.93187175E-04    2          21        21   # BR(A -> g       g      )
     2.64848029E-06    2          22        22   # BR(A -> gam     gam    )
     1.27943684E-06    2          23        22   # BR(A -> Z       gam    )
     3.10501840E-04    2          23        25   # BR(A -> Z       h      )
     7.08887645E-04    2     1000024  -1000024   # BR(A -> ~chi_1+ ~chi_1-)
     2.90921364E-02    2     1000022   1000022   # BR(A -> ~chi_10 ~chi_10)
     1.33091102E-06    2     1000023   1000023   # BR(A -> ~chi_20 ~chi_20)
     2.18158941E-02    2     1000025   1000025   # BR(A -> ~chi_30 ~chi_30)
     6.68440232E-04    2     1000022   1000023   # BR(A -> ~chi_10 ~chi_20)
     2.87292212E-04    2     1000022   1000025   # BR(A -> ~chi_10 ~chi_30)
     9.24439611E-04    2     1000023   1000025   # BR(A -> ~chi_20 ~chi_30)
#
#         PDG            Width
DECAY        37     3.95877029E+01   # H+ decays
#          BR         NDA      ID1       ID2
     2.24111201E-06    2           4        -5   # BR(H+ -> c       bb     )
     2.35819639E-04    2         -15        16   # BR(H+ -> tau+    nu_tau )
     8.33707609E-07    2         -13        14   # BR(H+ -> mu+     nu_mu  )
     1.42486111E-08    2           2        -5   # BR(H+ -> u       bb     )
     5.16299071E-08    2           2        -3   # BR(H+ -> u       sb     )
     1.02874537E-05    2           4        -3   # BR(H+ -> c       sb     )
     9.45575154E-01    2           6        -5   # BR(H+ -> t       bb     )
     3.18276505E-04    2          24        25   # BR(H+ -> W+      h      )
     1.07146066E-12    2          24        36   # BR(H+ -> W+      A      )
     2.35484244E-02    2     1000024   1000022   # BR(H+ -> ~chi_1+ ~chi_10)
     1.59695412E-04    2     1000024   1000023   # BR(H+ -> ~chi_1+ ~chi_20)
     3.01492017E-02    2     1000024   1000025   # BR(H+ -> ~chi_1+ ~chi_30)
