#
#                              ======================
#                              | THE SUSYHIT OUTPUT |
#                              ======================
#
#
#              ------------------------------------------------------
#              |     This is the output of the SUSY-HIT package     |
#              |  created by A.Djouadi, M.Muehlleitner and M.Spira. |
#              |  In case of problems with SUSY-HIT email to        |
#              |           margarete.muehlleitner@kit.edu           |
#              |           michael.spira@psi.ch                     |
#              |           abdelhak.djouadi@cern.ch                 |
#              ------------------------------------------------------
#
#              ------------------------------------------------------
#              |  SUSY Les Houches Accord - MSSM Spectrum + Decays  |
#              |              based on the decay programs           |
#              |                                                    |
#              |                     SDECAY 1.5                     |
#              |                                                    |
#              |  Authors: M.Muhlleitner, A.Djouadi and Y.Mambrini  |
#              |  Ref.:    Comput.Phys.Commun.168(2005)46           |
#              |           [hep-ph/0311167]                         |
#              |                                                    |
#              |                     HDECAY 3.4                     |
#              |                                                    |
#              |  By: A.Djouadi,J.Kalinowski,M.Muhlleitner,M.Spira  |
#              |  Ref.:    Comput.Phys.Commun.108(1998)56           |
#              |           [hep-ph/9704448]                         |
#              |                                                    |
#              |                                                    |
#              |  If not stated otherwise all DRbar couplings and   |
#              |  soft SUSY breaking masses are given at the scale  |
#              |  Q=  0.10257112E+04
#              |                                                    |
#              ------------------------------------------------------
#
#
BLOCK DCINFO  # Decay Program information
     1   SDECAY/HDECAY # decay calculator
     2   1.5  /3.4    # version number
#
BLOCK SPINFO  # Spectrum calculator information
     1    SOFTSUSY    # spectrum calculator                
     2    3.7.3       # version number                     
#
BLOCK MODSEL  # Model selection
     1     0   #  nonUniversal                                     
#
BLOCK SMINPUTS  # Standard Model inputs
         1     1.27934000E+02   # alpha_em^-1(M_Z)^MSbar
         2     1.16639000E-05   # G_F [GeV^-2]
         3     1.17200000E-01   # alpha_S(M_Z)^MSbar
         4     9.11870000E+01   # M_Z pole mass
         5     4.19000000E+00   # mb(mb)^MSbar
         6     1.72500000E+02   # mt pole mass
         7     1.77690000E+00   # mtau pole mass
#
BLOCK MINPAR  # Input parameters - minimal models
         3     2.00000000E+01   # tanb                
#
BLOCK EXTPAR  # Input parameters - non-minimal models
         0    -1.00000000E+00   # Set                 
         1     1.49900000E+02   # M_1(MX)             
         2     2.99900000E+02   # M_2(MX)             
         3     2.20000000E+03   # M_3(MX)             
        11     2.94338000E+03   # At(MX)              
        12     0.00000000E+00   # Ab(MX)              
        13     0.00000000E+00   # Atau(MX)            
        23     3.00000000E+03   # mu(MX)              
        25     2.00000000E+01   # tan                 
        26     3.00000000E+03   # mA(pole)            
        31     3.00000000E+03   # meL(MX)             
        32     3.00000000E+03   # mmuL(MX)            
        33     3.00000000E+03   # mtauL(MX)           
        34     3.00000000E+03   # meR(MX)             
        35     3.00000000E+03   # mmuR(MX)            
        36     3.00000000E+03   # mtauR(MX)           
        41     3.00000000E+03   # mqL1(MX)            
        42     3.00000000E+03   # mqL2(MX)            
        43     3.49900000E+02   # mqL3(MX)            
        44     3.00000000E+03   # muR(MX)             
        45     3.00000000E+03   # mcR(MX)             
        46     3.00000000E+03   # mtR(MX)             
        47     3.00000000E+03   # mdR(MX)             
        48     3.00000000E+03   # msR(MX)             
        49     3.00000000E+03   # mbR(MX)             
#
BLOCK MASS  # Mass Spectrum
# PDG code           mass       particle
        24     8.04001736E+01   # W+
        25     1.25467165E+02   # h
        35     3.00023205E+03   # H
        36     2.99999995E+03   # A
        37     3.00099481E+03   # H+
         5     4.81337004E+00   # b-quark pole mass calculated from mb(mb)_Msbar
   1000001     3.01364185E+03   # ~d_L
   2000001     3.00832718E+03   # ~d_R
   1000002     3.01271832E+03   # ~u_L
   2000002     3.01084442E+03   # ~u_R
   1000003     3.01364185E+03   # ~s_L
   2000003     3.00832718E+03   # ~s_R
   1000004     3.01271832E+03   # ~c_L
   2000004     3.01084442E+03   # ~c_R
   1000005     3.64492889E+02   # ~b_1
   2000005     3.00799182E+03   # ~b_2
   1000006     3.58867356E+02   # ~t_1
   2000006     2.99182972E+03   # ~t_2
   1000011     3.00692385E+03   # ~e_L
   2000011     3.00060826E+03   # ~e_R
   1000012     3.00552819E+03   # ~nu_eL
   1000013     3.00692385E+03   # ~mu_L
   2000013     3.00060826E+03   # ~mu_R
   1000014     3.00552819E+03   # ~nu_muL
   1000015     2.98601901E+03   # ~tau_1
   2000015     3.02232883E+03   # ~tau_2
   1000016     3.00582292E+03   # ~nu_tauL
   1000021     2.31602170E+03   # ~g
   1000022     1.51679214E+02   # ~chi_10
   1000023     3.19110865E+02   # ~chi_20
   1000025    -3.00584253E+03   # ~chi_30
   1000035     3.00638519E+03   # ~chi_40
   1000024     3.19269926E+02   # ~chi_1+
   1000037     3.00703689E+03   # ~chi_2+
#
BLOCK NMIX  # Neutralino Mixing Matrix
  1  1     9.99888325E-01   # N_11
  1  2    -1.15525701E-03   # N_12
  1  3     1.48262784E-02   # N_13
  1  4    -1.47795908E-03   # N_14
  2  1     1.55233324E-03   # N_21
  2  2     9.99642353E-01   # N_22
  2  3    -2.64056660E-02   # N_23
  2  4     3.93670303E-03   # N_24
  3  1    -9.41739122E-03   # N_31
  3  2     1.59011461E-02   # N_32
  3  3     7.06840921E-01   # N_33
  3  4     7.07131090E-01   # N_34
  4  1    -1.14995877E-02   # N_41
  4  2     2.14705729E-02   # N_42
  4  3     7.06724016E-01   # N_43
  4  4    -7.07069968E-01   # N_44
#
BLOCK UMIX  # Chargino Mixing Matrix U
  1  1     9.99301742E-01   # U_11
  1  2    -3.73634541E-02   # U_12
  2  1     3.73634541E-02   # U_21
  2  2     9.99301742E-01   # U_22
#
BLOCK VMIX  # Chargino Mixing Matrix V
  1  1     9.99984479E-01   # V_11
  1  2    -5.57159834E-03   # V_12
  2  1     5.57159834E-03   # V_21
  2  2     9.99984479E-01   # V_22
#
BLOCK STOPMIX  # Stop Mixing Matrix
  1  1     9.98909620E-01   # cos(theta_t)
  1  2    -4.66858766E-02   # sin(theta_t)
  2  1     4.66858766E-02   # -sin(theta_t)
  2  2     9.98909620E-01   # cos(theta_t)
#
BLOCK SBOTMIX  # Sbottom Mixing Matrix
  1  1     9.99923472E-01   # cos(theta_b)
  1  2     1.23713436E-02   # sin(theta_b)
  2  1    -1.23713436E-02   # -sin(theta_b)
  2  2     9.99923472E-01   # cos(theta_b)
#
BLOCK STAUMIX  # Stau Mixing Matrix
  1  1     7.06898861E-01   # cos(theta_tau)
  1  2     7.07314640E-01   # sin(theta_tau)
  2  1    -7.07314640E-01   # -sin(theta_tau)
  2  2     7.06898861E-01   # cos(theta_tau)
#
BLOCK ALPHA  # Higgs mixing
          -5.01995622E-02   # Mixing angle in the neutral Higgs boson sector
#
BLOCK HMIX Q=  1.02571120E+03  # DRbar Higgs Parameters
         1     3.00000000E+03   # mu(Q)MSSM           
         2     2.00000000E+01   # tan                 
         3     2.45090834E+02   # higgs               
         4     5.86643408E+06   # mA^2(Q)MSSM         
#
BLOCK GAUGE Q=  1.02571120E+03  # The gauge couplings
     1     3.60905232E-01   # gprime(Q) DRbar
     2     6.38392866E-01   # g(Q) DRbar
     3     1.03481729E+00   # g3(Q) DRbar
#
BLOCK AU Q=  1.02571120E+03  # The trilinear couplings
  1  1     0.00000000E+00   # A_u(Q) DRbar
  2  2     9.15954266E-07   # A_c(Q) DRbar
  3  3     2.94338000E+03   # A_t(Q) DRbar
#
BLOCK AD Q=  1.02571120E+03  # The trilinear couplings
  1  1     2.28093864E-07   # A_d(Q) DRbar
  2  2     2.28139958E-07   # A_s(Q) DRbar
  3  3     5.28613019E-07   # A_b(Q) DRbar
#
BLOCK AE Q=  1.02571120E+03  # The trilinear couplings
  1  1     0.00000000E+00   # A_e(Q) DRbar
  2  2     4.93699538E-08   # A_mu(Q) DRbar
  3  3     4.99466294E-08   # A_tau(Q) DRbar
#
BLOCK Yu Q=  1.02571120E+03  # The Yukawa couplings
  1  1     0.00000000E+00   # y_u(Q) DRbar
  2  2     0.00000000E+00   # y_c(Q) DRbar
  3  3     8.60147375E-01   # y_t(Q) DRbar
#
BLOCK Yd Q=  1.02571120E+03  # The Yukawa couplings
  1  1     0.00000000E+00   # y_d(Q) DRbar
  2  2     0.00000000E+00   # y_s(Q) DRbar
  3  3     2.11488092E-01   # y_b(Q) DRbar
#
BLOCK Ye Q=  1.02571120E+03  # The Yukawa couplings
  1  1     0.00000000E+00   # y_e(Q) DRbar
  2  2     0.00000000E+00   # y_mu(Q) DRbar
  3  3     2.05392146E-01   # y_tau(Q) DRbar
#
BLOCK MSOFT Q=  1.02571120E+03  # The soft SUSY breaking masses at the scale Q
         1     1.49900000E+02   # M_1(Q)              
         2     2.99900000E+02   # M_2(Q)              
         3     2.20000000E+03   # M_3(Q)              
        21    -9.56983760E+04   # M^2_Hd              
        22    -9.19238589E+06   # M^2_Hu              
        31     3.00000000E+03   # M_eL                
        32     3.00000000E+03   # M_muL               
        33     3.00000000E+03   # M_tauL              
        34     3.00000000E+03   # M_eR                
        35     3.00000000E+03   # M_muR               
        36     3.00000000E+03   # M_tauR              
        41     3.00000000E+03   # M_q1L               
        42     3.00000000E+03   # M_q2L               
        43     3.49899994E+02   # M_q3L               
        44     3.00000000E+03   # M_uR                
        45     3.00000000E+03   # M_cR                
        46     3.00000000E+03   # M_tR                
        47     3.00000000E+03   # M_dR                
        48     3.00000000E+03   # M_sR                
        49     3.00000000E+03   # M_bR                
#
#
#
#                             =================
#                             |The decay table|
#                             =================
#
# - The QCD corrections to the decays gluino -> squark  + quark
#                                     squark -> gaugino + quark_prime
#                                     squark -> squark_prime + Higgs
#                                     squark -> gluino  + quark
#   are included.
#
# - The multi-body decays for the inos, stops and sbottoms are included.
#
# - The loop induced decays for the gluino, neutralinos and stops
#   are included.
#
# - The SUSY decays of the top quark are included.
#
#
#         PDG            Width
DECAY         6     1.41466070E+00   # top decays
#          BR         NDA      ID1       ID2
     1.00000000E+00    2           5        24   # BR(t ->  b    W+)
#
#         PDG            Width
DECAY   1000021     8.69995043E+01   # gluino decays
#          BR         NDA      ID1       ID2
     2.48239146E-01    2     1000005        -5   # BR(~g -> ~b_1  bb)
     2.48239146E-01    2    -1000005         5   # BR(~g -> ~b_1* b )
     2.51760854E-01    2     1000006        -6   # BR(~g -> ~t_1  tb)
     2.51760854E-01    2    -1000006         6   # BR(~g -> ~t_1* t )
#
#         PDG            Width
DECAY   1000006     1.49766076E-01   # stop1 decays
#          BR         NDA      ID1       ID2
     7.57078039E-02    2     1000022         6   # BR(~t_1 -> ~chi_10 t )
     9.24292196E-01    2     1000024         5   # BR(~t_1 -> ~chi_1+ b )
#
#         PDG            Width
DECAY   2000006     1.07832203E+02   # stop2 decays
#          BR         NDA      ID1       ID2
     6.00788049E-02    2     1000022         6   # BR(~t_2 -> ~chi_10 t )
     2.85223672E-04    2     1000023         6   # BR(~t_2 -> ~chi_20 t )
     0.00000000E+00    2     1000025         6   # BR(~t_2 -> ~chi_30 t )
     5.72597848E-04    2     1000024         5   # BR(~t_2 -> ~chi_1+ b )
     3.14595214E-01    2     1000021         6   # BR(~t_2 -> ~g      t )
     1.66821831E-01    2     1000006        25   # BR(~t_2 -> ~t_1    h )
     1.53056367E-01    2     1000006        23   # BR(~t_2 -> ~t_1    Z )
     3.04589962E-01    2     1000005        24   # BR(~t_2 -> ~b_1    W+)
#
#         PDG            Width
DECAY   1000005     1.27275499E-01   # sbottom1 decays
#          BR         NDA      ID1       ID2
     3.07409879E-01    2     1000022         5   # BR(~b_1 -> ~chi_10 b )
     6.92590121E-01    2     1000023         5   # BR(~b_1 -> ~chi_20 b )
#
#         PDG            Width
DECAY   2000005     4.28031764E+01   # sbottom2 decays
#          BR         NDA      ID1       ID2
     3.82745850E-02    2     1000022         5   # BR(~b_2 -> ~chi_10 b )
     1.43737753E-07    2     1000023         5   # BR(~b_2 -> ~chi_20 b )
     7.35279955E-09    2    -1000024         6   # BR(~b_2 -> ~chi_1- t )
     8.28046659E-01    2     1000021         5   # BR(~b_2 -> ~g      b )
     2.92953560E-02    2     1000005        25   # BR(~b_2 -> ~b_1    h )
     4.27312888E-02    2     1000005        23   # BR(~b_2 -> ~b_1    Z )
     6.16519604E-02    2     1000006       -24   # BR(~b_2 -> ~t_1    W-)
#
#         PDG            Width
DECAY   1000002     7.03402467E+01   # sup_L decays
#          BR         NDA      ID1       ID2
     5.76334086E-03    2     1000022         2   # BR(~u_L -> ~chi_10 u)
     1.61683228E-01    2     1000023         2   # BR(~u_L -> ~chi_20 u)
     8.57189254E-10    2     1000025         2   # BR(~u_L -> ~chi_30 u)
     1.36316437E-09    2     1000035         2   # BR(~u_L -> ~chi_40 u)
     3.23391601E-01    2     1000024         1   # BR(~u_L -> ~chi_1+ d)
     1.83712607E-10    2     1000037         1   # BR(~u_L -> ~chi_2+ d)
     5.09161828E-01    2     1000021         2   # BR(~u_L -> ~g      u)
#
#         PDG            Width
DECAY   2000002     4.22259889E+01   # sup_R decays
#          BR         NDA      ID1       ID2
     1.55410187E-01    2     1000022         2   # BR(~u_R -> ~chi_10 u)
     3.68564476E-07    2     1000023         2   # BR(~u_R -> ~chi_20 u)
     1.93771800E-10    2     1000025         2   # BR(~u_R -> ~chi_30 u)
     2.30850112E-10    2     1000035         2   # BR(~u_R -> ~chi_40 u)
     8.44589444E-01    2     1000021         2   # BR(~u_R -> ~g      u)
#
#         PDG            Width
DECAY   1000001     7.03917401E+01   # sdown_L decays
#          BR         NDA      ID1       ID2
     5.90399313E-03    2     1000022         1   # BR(~d_L -> ~chi_10 d)
     1.61429003E-01    2     1000023         1   # BR(~d_L -> ~chi_20 d)
     1.71475174E-09    2     1000025         1   # BR(~d_L -> ~chi_30 d)
     2.66375352E-09    2     1000035         1   # BR(~d_L -> ~chi_40 d)
     3.22820021E-01    2    -1000024         2   # BR(~d_L -> ~chi_1- u)
     1.10764734E-08    2    -1000037         2   # BR(~d_L -> ~chi_2- u)
     5.09846968E-01    2     1000021         1   # BR(~d_L -> ~g      d)
#
#         PDG            Width
DECAY   2000001     3.71002646E+01   # sdown_R decays
#          BR         NDA      ID1       ID2
     4.41819580E-02    2     1000022         1   # BR(~d_R -> ~chi_10 d)
     1.04777181E-07    2     1000023         1   # BR(~d_R -> ~chi_20 d)
     1.40513350E-11    2     1000025         1   # BR(~d_R -> ~chi_30 d)
     1.29381120E-11    2     1000035         1   # BR(~d_R -> ~chi_40 d)
     9.55817937E-01    2     1000021         1   # BR(~d_R -> ~g      d)
#
#         PDG            Width
DECAY   1000004     7.03402467E+01   # scharm_L decays
#          BR         NDA      ID1       ID2
     5.76334086E-03    2     1000022         4   # BR(~c_L -> ~chi_10 c)
     1.61683228E-01    2     1000023         4   # BR(~c_L -> ~chi_20 c)
     8.57189254E-10    2     1000025         4   # BR(~c_L -> ~chi_30 c)
     1.36316437E-09    2     1000035         4   # BR(~c_L -> ~chi_40 c)
     3.23391601E-01    2     1000024         3   # BR(~c_L -> ~chi_1+ s)
     1.83712607E-10    2     1000037         3   # BR(~c_L -> ~chi_2+ s)
     5.09161828E-01    2     1000021         4   # BR(~c_L -> ~g      c)
#
#         PDG            Width
DECAY   2000004     4.22259889E+01   # scharm_R decays
#          BR         NDA      ID1       ID2
     1.55410187E-01    2     1000022         4   # BR(~c_R -> ~chi_10 c)
     3.68564476E-07    2     1000023         4   # BR(~c_R -> ~chi_20 c)
     1.93771800E-10    2     1000025         4   # BR(~c_R -> ~chi_30 c)
     2.30850112E-10    2     1000035         4   # BR(~c_R -> ~chi_40 c)
     8.44589444E-01    2     1000021         4   # BR(~c_R -> ~g      c)
#
#         PDG            Width
DECAY   1000003     7.03917401E+01   # sstrange_L decays
#          BR         NDA      ID1       ID2
     5.90399313E-03    2     1000022         3   # BR(~s_L -> ~chi_10 s)
     1.61429003E-01    2     1000023         3   # BR(~s_L -> ~chi_20 s)
     1.71475174E-09    2     1000025         3   # BR(~s_L -> ~chi_30 s)
     2.66375352E-09    2     1000035         3   # BR(~s_L -> ~chi_40 s)
     3.22820021E-01    2    -1000024         4   # BR(~s_L -> ~chi_1- c)
     1.10764734E-08    2    -1000037         4   # BR(~s_L -> ~chi_2- c)
     5.09846968E-01    2     1000021         3   # BR(~s_L -> ~g      s)
#
#         PDG            Width
DECAY   2000003     3.71002646E+01   # sstrange_R decays
#          BR         NDA      ID1       ID2
     4.41819580E-02    2     1000022         3   # BR(~s_R -> ~chi_10 s)
     1.04777181E-07    2     1000023         3   # BR(~s_R -> ~chi_20 s)
     1.40513350E-11    2     1000025         3   # BR(~s_R -> ~chi_30 s)
     1.29381120E-11    2     1000035         3   # BR(~s_R -> ~chi_40 s)
     9.55817937E-01    2     1000021         3   # BR(~s_R -> ~g      s)
#
#         PDG            Width
DECAY   1000011     3.95884767E+01   # selectron_L decays
#          BR         NDA      ID1       ID2
     9.74884582E-02    2     1000022        11   # BR(~e_L -> ~chi_10 e-)
     3.01330621E-01    2     1000023        11   # BR(~e_L -> ~chi_20 e-)
     1.78129789E-11    2     1000025        11   # BR(~e_L -> ~chi_30 e-)
     8.85541945E-12    2     1000035        11   # BR(~e_L -> ~chi_40 e-)
     6.01180921E-01    2    -1000024        12   # BR(~e_L -> ~chi_1- nu_e)
#
#         PDG            Width
DECAY   2000011     1.54681194E+01   # selectron_R decays
#          BR         NDA      ID1       ID2
     9.99997632E-01    2     1000022        11   # BR(~e_R -> ~chi_10 e-)
     2.36814577E-06    2     1000023        11   # BR(~e_R -> ~chi_20 e-)
#
#         PDG            Width
DECAY   1000013     3.95884767E+01   # smuon_L decays
#          BR         NDA      ID1       ID2
     9.74884582E-02    2     1000022        13   # BR(~mu_L -> ~chi_10 mu-)
     3.01330621E-01    2     1000023        13   # BR(~mu_L -> ~chi_20 mu-)
     1.78129789E-11    2     1000025        13   # BR(~mu_L -> ~chi_30 mu-)
     8.85541945E-12    2     1000035        13   # BR(~mu_L -> ~chi_40 mu-)
     6.01180921E-01    2    -1000024        14   # BR(~mu_L -> ~chi_1- nu_mu)
#
#         PDG            Width
DECAY   2000013     1.54681194E+01   # smuon_R decays
#          BR         NDA      ID1       ID2
     9.99997632E-01    2     1000022        13   # BR(~mu_R -> ~chi_10 mu-)
     2.36814577E-06    2     1000023        13   # BR(~mu_R -> ~chi_20 mu-)
#
#         PDG            Width
DECAY   1000015     2.78164396E+01   # stau_1 decays
#          BR         NDA      ID1       ID2
     3.47371082E-01    2     1000022        15   # BR(~tau_1 -> ~chi_10  tau-)
     2.17908185E-01    2     1000023        15   # BR(~tau_1 -> ~chi_20  tau-)
     4.34720733E-01    2    -1000024        16   # BR(~tau_1 -> ~chi_1-  nu_tau)
#
#         PDG            Width
DECAY   2000015     2.72234602E+01   # stau_2 decays
#          BR         NDA      ID1       ID2
     3.55588808E-01    2     1000022        15   # BR(~tau_2 -> ~chi_10  tau-)
     2.15183573E-01    2     1000023        15   # BR(~tau_2 -> ~chi_20  tau-)
     5.21737098E-06    2     1000025        15   # BR(~tau_2 -> ~chi_30  tau-)
     6.19560503E-06    2     1000035        15   # BR(~tau_2 -> ~chi_40  tau-)
     4.29210303E-01    2    -1000024        16   # BR(~tau_2 -> ~chi_1-  nu_tau)
     5.90273019E-06    2    -1000037        16   # BR(~tau_2 -> ~chi_2-  nu_tau)
#
#         PDG            Width
DECAY   1000012     3.95917111E+01   # snu_eL decays
#          BR         NDA      ID1       ID2
     9.82345710E-02    2     1000022        12   # BR(~nu_eL -> ~chi_10 nu_e)
     3.00104080E-01    2     1000023        12   # BR(~nu_eL -> ~chi_20 nu_e)
     6.01661349E-01    2     1000024        11   # BR(~nu_eL -> ~chi_1+ e-)
#
#         PDG            Width
DECAY   1000014     3.95917111E+01   # snu_muL decays
#          BR         NDA      ID1       ID2
     9.82345710E-02    2     1000022        14   # BR(~nu_muL -> ~chi_10 nu_mu)
     3.00104080E-01    2     1000023        14   # BR(~nu_muL -> ~chi_20 nu_mu)
     6.01661349E-01    2     1000024        13   # BR(~nu_muL -> ~chi_1+ mu-)
#
#         PDG            Width
DECAY   1000016     3.95991102E+01   # snu_tauL decays
#          BR         NDA      ID1       ID2
     9.82259457E-02    2     1000022        16   # BR(~nu_tauL -> ~chi_10 nu_tau)
     3.00078771E-01    2     1000023        16   # BR(~nu_tauL -> ~chi_20 nu_tau)
     6.01695283E-01    2     1000024        15   # BR(~nu_tauL -> ~chi_1+ tau-)
#
#         PDG            Width
DECAY   1000024     2.53160801E-05   # chargino1+ decays
#          BR         NDA      ID1       ID2
     1.00000000E+00    2     1000022        24   # BR(~chi_1+ -> ~chi_10  W+)
#
#         PDG            Width
DECAY   1000037     9.19156922E+01   # chargino2+ decays
#          BR         NDA      ID1       ID2
     4.64130030E-02    2     1000006        -5   # BR(~chi_2+ -> ~t_1     bb)
     1.01986943E-04    2     2000006        -5   # BR(~chi_2+ -> ~t_2     bb)
     7.36326170E-01    2    -1000005         6   # BR(~chi_2+ -> ~b_1*    t )
     4.14338444E-12    2     1000012       -11   # BR(~chi_2+ -> ~nu_eL   e+  )
     4.14338444E-12    2     1000014       -13   # BR(~chi_2+ -> ~nu_muL  mu+ )
     1.04652542E-12    2    -1000011        12   # BR(~chi_2+ -> ~e_L+    nu_e)
     1.04652542E-12    2    -1000013        14   # BR(~chi_2+ -> ~mu_L+   nu_mu)
     1.03972224E-06    2    -1000015        16   # BR(~chi_2+ -> ~tau_1+  nu_tau)
     6.55275418E-02    2     1000024        23   # BR(~chi_2+ -> ~chi_1+  Z )
     2.02383230E-02    2     1000022        24   # BR(~chi_2+ -> ~chi_10  W+)
     6.40330795E-02    2     1000023        24   # BR(~chi_2+ -> ~chi_20  W+)
     6.73588559E-02    2     1000024        25   # BR(~chi_2+ -> ~chi_1+  h )
#
#         PDG            Width
DECAY   1000022     0.00000000E+00   # neutralino1 decays
#
#         PDG            Width
DECAY   1000023     1.83464333E-05   # neutralino2 decays
#          BR         NDA      ID1       ID2
     4.95975187E-02    2     1000022        23   # BR(~chi_20 -> ~chi_10   Z )
     9.50402481E-01    2     1000022        25   # BR(~chi_20 -> ~chi_10   h )
#
#         PDG            Width
DECAY   1000025     9.22087569E+01   # neutralino3 decays
#          BR         NDA      ID1       ID2
     1.24848177E-02    2     1000022        23   # BR(~chi_30 -> ~chi_10   Z )
     4.21026492E-02    2     1000023        23   # BR(~chi_30 -> ~chi_20   Z )
     6.37168876E-02    2     1000024       -24   # BR(~chi_30 -> ~chi_1+   W-)
     6.37168876E-02    2    -1000024        24   # BR(~chi_30 -> ~chi_1-   W+)
     8.54868440E-03    2     1000022        25   # BR(~chi_30 -> ~chi_10   h )
     2.33412021E-02    2     1000023        25   # BR(~chi_30 -> ~chi_20   h )
     3.70765761E-01    2     1000006        -6   # BR(~chi_30 -> ~t_1      tb)
     3.70765761E-01    2    -1000006         6   # BR(~chi_30 -> ~t_1*     t )
     2.22776737E-02    2     1000005        -5   # BR(~chi_30 -> ~b_1      bb)
     2.22776737E-02    2    -1000005         5   # BR(~chi_30 -> ~b_1*     b )
     9.07099593E-11    2     2000011       -11   # BR(~chi_30 -> ~e_R-     e+)
     9.07099593E-11    2    -2000011        11   # BR(~chi_30 -> ~e_R+     e-)
     9.07099593E-11    2     2000013       -13   # BR(~chi_30 -> ~mu_R-    mu+)
     9.07099593E-11    2    -2000013        13   # BR(~chi_30 -> ~mu_R+    mu-)
     1.00118591E-06    2     1000015       -15   # BR(~chi_30 -> ~tau_1-   tau+)
     1.00118591E-06    2    -1000015        15   # BR(~chi_30 -> ~tau_1+   tau-)
     1.30203277E-12    2     1000012       -12   # BR(~chi_30 -> ~nu_eL    nu_eb)
     1.30203277E-12    2    -1000012        12   # BR(~chi_30 -> ~nu_eL*   nu_e )
     1.30203277E-12    2     1000014       -14   # BR(~chi_30 -> ~nu_muL   nu_mub)
     1.30203277E-12    2    -1000014        14   # BR(~chi_30 -> ~nu_muL*  nu_mu )
     5.06781075E-15    2     1000016       -16   # BR(~chi_30 -> ~nu_tau1  nu_taub)
     5.06781075E-15    2    -1000016        16   # BR(~chi_30 -> ~nu_tau1* nu_tau )
#
#         PDG            Width
DECAY   1000035     9.12990863E+01   # neutralino4 decays
#          BR         NDA      ID1       ID2
     8.45661243E-03    2     1000022        23   # BR(~chi_40 -> ~chi_10   Z )
     2.33441785E-02    2     1000023        23   # BR(~chi_40 -> ~chi_20   Z )
     6.43718146E-02    2     1000024       -24   # BR(~chi_40 -> ~chi_1+   W-)
     6.43718146E-02    2    -1000024        24   # BR(~chi_40 -> ~chi_1-   W+)
     1.29171797E-02    2     1000022        25   # BR(~chi_40 -> ~chi_10   h )
     4.41435758E-02    2     1000023        25   # BR(~chi_40 -> ~chi_20   h )
     3.68666341E-01    2     1000006        -6   # BR(~chi_40 -> ~t_1      tb)
     3.68666341E-01    2    -1000006         6   # BR(~chi_40 -> ~t_1*     t )
     2.25298239E-02    2     1000005        -5   # BR(~chi_40 -> ~b_1      bb)
     2.25298239E-02    2    -1000005         5   # BR(~chi_40 -> ~b_1*     b )
     1.66337154E-10    2     2000011       -11   # BR(~chi_40 -> ~e_R-     e+)
     1.66337154E-10    2    -2000011        11   # BR(~chi_40 -> ~e_R+     e-)
     1.66337154E-10    2     2000013       -13   # BR(~chi_40 -> ~mu_R-    mu+)
     1.66337154E-10    2    -2000013        13   # BR(~chi_40 -> ~mu_R+    mu-)
     1.24728530E-06    2     1000015       -15   # BR(~chi_40 -> ~tau_1-   tau+)
     1.24728530E-06    2    -1000015        15   # BR(~chi_40 -> ~tau_1+   tau-)
     1.69695422E-11    2     1000012       -12   # BR(~chi_40 -> ~nu_eL    nu_eb)
     1.69695422E-11    2    -1000012        12   # BR(~chi_40 -> ~nu_eL*   nu_e )
     1.69695422E-11    2     1000014       -14   # BR(~chi_40 -> ~nu_muL   nu_mub)
     1.69695422E-11    2    -1000014        14   # BR(~chi_40 -> ~nu_muL*  nu_mu )
     7.30534763E-12    2     1000016       -16   # BR(~chi_40 -> ~nu_tau1  nu_taub)
     7.30534763E-12    2    -1000016        16   # BR(~chi_40 -> ~nu_tau1* nu_tau )
#
#         PDG            Width
DECAY        25     5.03916634E-03   # h decays
#          BR         NDA      ID1       ID2
     6.74289703E-01    2           5        -5   # BR(h -> b       bb     )
     5.20322777E-02    2         -15        15   # BR(h -> tau+    tau-   )
     1.84194150E-04    2         -13        13   # BR(h -> mu+     mu-    )
     3.90632890E-04    2           3        -3   # BR(h -> s       sb     )
     1.68504041E-02    2           4        -4   # BR(h -> c       cb     )
     5.63098307E-02    2          21        21   # BR(h -> g       g      )
     1.88785368E-03    2          22        22   # BR(h -> gam     gam    )
     1.29266661E-03    2          22        23   # BR(h -> Z       gam    )
     1.74748514E-01    2          24       -24   # BR(h -> W+      W-     )
     2.20139225E-02    2          23        23   # BR(h -> Z       Z      )
#
#         PDG            Width
DECAY        35     1.38463533E+01   # H decays
#          BR         NDA      ID1       ID2
     7.38651525E-01    2           5        -5   # BR(H -> b       bb     )
     1.79602722E-01    2         -15        15   # BR(H -> tau+    tau-   )
     6.35032308E-04    2         -13        13   # BR(H -> mu+     mu-    )
     7.79816345E-04    2           3        -3   # BR(H -> s       sb     )
     2.20202627E-07    2           4        -4   # BR(H -> c       cb     )
     2.19666464E-02    2           6        -6   # BR(H -> t       tb     )
     3.52610365E-05    2          21        21   # BR(H -> g       g      )
     6.92824307E-08    2          22        22   # BR(H -> gam     gam    )
     8.39431907E-09    2          23        22   # BR(H -> Z       gam    )
     3.70664207E-05    2          24       -24   # BR(H -> W+      W-     )
     1.85103596E-05    2          23        23   # BR(H -> Z       Z      )
     9.06323748E-05    2          25        25   # BR(H -> h       h      )
     5.15784433E-24    2          36        36   # BR(H -> A       A      )
     5.27961831E-17    2          23        36   # BR(H -> Z       A      )
     2.35257332E-03    2     1000024  -1000024   # BR(H -> ~chi_1+ ~chi_1-)
     1.12989285E-04    2     1000022   1000022   # BR(H -> ~chi_10 ~chi_10)
     1.17233543E-03    2     1000023   1000023   # BR(H -> ~chi_20 ~chi_20)
     7.30853214E-04    2     1000022   1000023   # BR(H -> ~chi_10 ~chi_20)
     5.38072610E-02    2     1000006  -1000006   # BR(H -> ~t_1    ~t_1*  )
     6.47677844E-06    2     1000005  -1000005   # BR(H -> ~b_1    ~b_1*  )
#
#         PDG            Width
DECAY        36     1.31047960E+01   # A decays
#          BR         NDA      ID1       ID2
     7.80506291E-01    2           5        -5   # BR(A -> b       bb     )
     1.89756023E-01    2         -15        15   # BR(A -> tau+    tau-   )
     6.70931014E-04    2         -13        13   # BR(A -> mu+     mu-    )
     8.24042606E-04    2           3        -3   # BR(A -> s       sb     )
     2.32533143E-07    2           4        -4   # BR(A -> c       cb     )
     2.31839067E-02    2           6        -6   # BR(A -> t       tb     )
     6.82743864E-05    2          21        21   # BR(A -> g       g      )
     3.16872641E-08    2          22        22   # BR(A -> gam     gam    )
     6.72455309E-08    2          23        22   # BR(A -> Z       gam    )
     3.90089954E-05    2          23        25   # BR(A -> Z       h      )
     2.68244246E-03    2     1000024  -1000024   # BR(A -> ~chi_1+ ~chi_1-)
     1.23044299E-04    2     1000022   1000022   # BR(A -> ~chi_10 ~chi_10)
     1.33667114E-03    2     1000023   1000023   # BR(A -> ~chi_20 ~chi_20)
     8.09032757E-04    2     1000022   1000023   # BR(A -> ~chi_10 ~chi_20)
#
#         PDG            Width
DECAY        37     9.63983910E+00   # H+ decays
#          BR         NDA      ID1       ID2
     1.06998886E-03    2           4        -5   # BR(H+ -> c       bb     )
     2.58047732E-01    2         -15        16   # BR(H+ -> tau+    nu_tau )
     9.12393840E-04    2         -13        14   # BR(H+ -> mu+     nu_mu  )
     6.84791772E-06    2           2        -5   # BR(H+ -> u       bb     )
     5.36192758E-05    2           2        -3   # BR(H+ -> u       sb     )
     1.10312092E-03    2           4        -3   # BR(H+ -> c       sb     )
     6.98715938E-01    2           6        -5   # BR(H+ -> t       bb     )
     5.31164392E-05    2          24        25   # BR(H+ -> W+      h      )
     1.33020042E-13    2          24        36   # BR(H+ -> W+      A      )
     2.14346978E-03    2     1000024   1000022   # BR(H+ -> ~chi_1+ ~chi_10)
     5.14720049E-09    2     1000024   1000023   # BR(H+ -> ~chi_1+ ~chi_20)
     3.78937675E-02    2     1000006  -1000005   # BR(H+ -> ~t_1    ~b_1*  )
