#
#                              ======================
#                              | THE SUSYHIT OUTPUT |
#                              ======================
#
#
#              ------------------------------------------------------
#              |     This is the output of the SUSY-HIT package     |
#              |  created by A.Djouadi, M.Muehlleitner and M.Spira. |
#              |  In case of problems with SUSY-HIT email to        |
#              |           margarete.muehlleitner@cern.ch           |
#              |           michael.spira@psi.ch                     |
#              |           abdelhak.djouadi@cern.ch                 |
#              ------------------------------------------------------
#
#              ------------------------------------------------------
#              |  SUSY Les Houches Accord - MSSM Spectrum + Decays  |
#              |              based on the decay programs           |
#              |                                                    |
#              |                     SDECAY 1.3b                    |
#              |                                                    |
#              |  Authors: M.Muhlleitner, A.Djouadi and Y.Mambrini  |
#              |  Ref.:    Comput.Phys.Commun.168(2005)46           |
#              |           [hep-ph/0311167]                         |
#              |                                                    |
#              |                     HDECAY 3.4                     |
#              |                                                    |
#              |  By: A.Djouadi,J.Kalinowski,M.Muhlleitner,M.Spira  |
#              |  Ref.:    Comput.Phys.Commun.108(1998)56           |
#              |           [hep-ph/9704448]                         |
#              |                                                    |
#              |                                                    |
#              |  If not stated otherwise all DRbar couplings and   |
#              |  soft SUSY breaking masses are given at the scale  |
#              |  Q=  0.50007314E+04
#              |                                                    |
#              ------------------------------------------------------
#
#
BLOCK DCINFO  # Decay Program information
     1   SDECAY/HDECAY # decay calculator
     2   1.3b  /3.4    # version number
#
BLOCK SPINFO  # Spectrum calculator information
     1    SOFTSUSY    # spectrum calculator                
     2    3.4.0       # version number                     
#
BLOCK MODSEL  # Model selection
     1     0   #  nonUniversal                                     
#
BLOCK SMINPUTS  # Standard Model inputs
         1     1.25778332E+02   # alpha_em^-1(M_Z)^MSbar
         2     1.16570000E-05   # G_F [GeV^-2]
         3     1.17200002E-01   # alpha_S(M_Z)^MSbar
         4     9.11876000E+01   # M_Z pole mass
         5     4.25000000E+00   # mb(mb)^MSbar
         6     1.72500000E+02   # mt pole mass
         7     1.77682000E+00   # mtau pole mass
#
BLOCK MINPAR  # Input parameters - minimal models
         3     1.00000000E+01   # tanb                
#
BLOCK EXTPAR  # Input parameters - non-minimal models
         0    -1.00000000E+00   # Set                 
         1     6.00000000E+01   # M_1(MX)             
         2     3.00000000E+03   # M_2(MX)             
         3     2.62339200E+03   # M_3(MX)             
        11     5.00000000E+03   # At(MX)              
        12     5.00000000E+03   # Ab(MX)              
        13     0.00000000E+00   # Atau(MX)            
        23    -1.25111900E+03   # mu(MX)              
        26     3.00000000E+03   # mA(pole)            
        31     5.00000000E+03   # meL(MX)             
        32     5.00000000E+03   # mmuL(MX)            
        33     5.00000000E+03   # mtauL(MX)           
        34     5.00000000E+03   # meR(MX)             
        35     5.00000000E+03   # mmuR(MX)            
        36     5.00000000E+03   # mtauR(MX)           
        41     5.00000000E+03   # mqL1(MX)            
        42     5.00000000E+03   # mqL2(MX)            
        43     5.00000000E+03   # mqL3(MX)            
        44     5.00000000E+03   # muR(MX)             
        45     5.00000000E+03   # mcR(MX)             
        46     5.00000000E+03   # mtR(MX)             
        47     5.00000000E+03   # mdR(MX)             
        48     5.00000000E+03   # msR(MX)             
        49     5.00000000E+03   # mbR(MX)             
#
BLOCK MASS  # Mass Spectrum
# PDG code           mass       particle
        24     8.00963510E+01   # W+
        25     1.24817025E+02   # h
        35     3.00008180E+03   # H
        36     2.99999987E+03   # A
        37     3.00086813E+03   # H+
         5     4.87878001E+00   # b-quark pole mass calculated from mb(mb)_Msbar
   1000001     5.09117292E+03   # ~d_L
   2000001     5.07345992E+03   # ~d_R
   1000002     5.09070511E+03   # ~u_L
   2000002     5.07318329E+03   # ~u_R
   1000003     5.09117292E+03   # ~s_L
   2000003     5.07345992E+03   # ~s_R
   1000004     5.09070511E+03   # ~c_L
   2000004     5.07318329E+03   # ~c_R
   1000005     5.03703450E+03   # ~b_1
   2000005     5.07211338E+03   # ~b_2
   1000006     4.93007082E+03   # ~t_1
   2000006     5.08088834E+03   # ~t_2
   1000011     5.01905268E+03   # ~e_L
   2000011     5.00591511E+03   # ~e_R
   1000012     5.01810467E+03   # ~nu_eL
   1000013     5.01905268E+03   # ~mu_L
   2000013     5.00591511E+03   # ~mu_R
   1000014     5.01810467E+03   # ~nu_muL
   1000015     5.00447613E+03   # ~tau_1
   2000015     5.01889282E+03   # ~tau_2
   1000016     5.01756266E+03   # ~nu_tauL
   1000021     3.00000073E+03   # ~g
   1000022     6.03030629E+01   # ~chi_10
   1000023     1.29950394E+03   # ~chi_20
   1000025    -1.30184299E+03   # ~chi_30
   1000035     3.07429126E+03   # ~chi_40
   1000024     1.30000042E+03   # ~chi_1+
   1000037     3.07445866E+03   # ~chi_2+
#
BLOCK NMIX  # Neutralino Mixing Matrix
  1  1     9.99410390E-01   # N_11
  1  2     1.55351924E-04   # N_12
  1  3    -3.42763304E-02   # N_13
  1  4     1.99527861E-03   # N_14
  2  1     2.28287352E-02   # N_21
  2  2     2.74274223E-02   # N_22
  2  3     7.06874867E-01   # N_23
  2  4     7.06437901E-01   # N_24
  3  1    -2.56425371E-02   # N_31
  3  2     1.38783152E-02   # N_32
  3  3    -7.06442656E-01   # N_33
  3  4     7.07169446E-01   # N_34
  4  1    -4.25719653E-04   # N_41
  4  2     9.99527441E-01   # N_42
  4  3    -9.58272513E-03   # N_43
  4  4    -2.92042018E-02   # N_44
#
BLOCK UMIX  # Chargino Mixing Matrix U
  1  1     1.35663476E-02   # U_11
  1  2     9.99907973E-01   # U_12
  2  1    -9.99907973E-01   # U_21
  2  2     1.35663476E-02   # U_22
#
BLOCK VMIX  # Chargino Mixing Matrix V
  1  1     4.13278668E-02   # V_11
  1  2    -9.99145639E-01   # V_12
  2  1    -9.99145639E-01   # V_21
  2  2    -4.13278668E-02   # V_22
#
BLOCK STOPMIX  # Stop Mixing Matrix
  1  1    -5.05216015E-01   # cos(theta_t)
  1  2     8.62992919E-01   # sin(theta_t)
  2  1    -8.62992919E-01   # -sin(theta_t)
  2  2    -5.05216015E-01   # cos(theta_t)
#
BLOCK SBOTMIX  # Sbottom Mixing Matrix
  1  1     9.95713281E-01   # cos(theta_b)
  1  2    -9.24935784E-02   # sin(theta_b)
  2  1     9.24935784E-02   # -sin(theta_b)
  2  2     9.95713281E-01   # cos(theta_b)
#
BLOCK STAUMIX  # Stau Mixing Matrix
  1  1    -1.46922146E-01   # cos(theta_tau)
  1  2     9.89148059E-01   # sin(theta_tau)
  2  1    -9.89148059E-01   # -sin(theta_tau)
  2  2    -1.46922146E-01   # cos(theta_tau)
#
BLOCK ALPHA  # Higgs mixing
          -1.05476633E-01   # Mixing angle in the neutral Higgs boson sector
#
BLOCK HMIX Q=  5.00073142E+03  # DRbar Higgs Parameters
         1    -1.27417985E+03   # mu(Q)MSSM           
         2     9.46941883E+00   # tan                 
         3     2.41924420E+02   # higgs               
         4     8.44409872E+06   # mA^2(Q)MSSM         
#
BLOCK GAUGE Q=  5.00073142E+03  # The gauge couplings
     1     3.70715780E-01   # gprime(Q) DRbar
     2     6.32188632E-01   # g(Q) DRbar
     3     9.92476278E-01   # g3(Q) DRbar
#
BLOCK AU Q=  5.00073142E+03  # The trilinear couplings
  1  1     5.00000002E+03   # A_u(Q) DRbar
  2  2     5.00000002E+03   # A_c(Q) DRbar
  3  3     5.00000003E+03   # A_t(Q) DRbar
#
BLOCK AD Q=  5.00073142E+03  # The trilinear couplings
  1  1     5.00000001E+03   # A_d(Q) DRbar
  2  2     5.00000001E+03   # A_s(Q) DRbar
  3  3     5.00000001E+03   # A_b(Q) DRbar
#
BLOCK AE Q=  5.00073142E+03  # The trilinear couplings
  1  1     0.00000000E+00   # A_e(Q) DRbar
  2  2     3.26349916E-07   # A_mu(Q) DRbar
  3  3     3.26577969E-07   # A_tau(Q) DRbar
#
BLOCK Yu Q=  5.00073142E+03  # The Yukawa couplings
  1  1     0.00000000E+00   # y_u(Q) DRbar
  2  2     0.00000000E+00   # y_c(Q) DRbar
  3  3     8.21415198E-01   # y_t(Q) DRbar
#
BLOCK Yd Q=  5.00073142E+03  # The Yukawa couplings
  1  1     0.00000000E+00   # y_d(Q) DRbar
  2  2     0.00000000E+00   # y_s(Q) DRbar
  3  3     1.31677935E-01   # y_b(Q) DRbar
#
BLOCK Ye Q=  5.00073142E+03  # The Yukawa couplings
  1  1     0.00000000E+00   # y_e(Q) DRbar
  2  2     0.00000000E+00   # y_mu(Q) DRbar
  3  3     9.67035140E-02   # y_tau(Q) DRbar
#
BLOCK MSOFT Q=  5.00073142E+03  # The soft SUSY breaking masses at the scale Q
         1     6.00000000E+01   # M_1(Q)              
         2     3.00000000E+03   # M_2(Q)              
         3     2.62339200E+03   # M_3(Q)              
        21     7.05706531E+06   # mH1^2(Q)            
        22    -1.06471334E+06   # mH2^2(Q)            
        31     5.00000000E+03   # meL(Q)              
        32     5.00000000E+03   # mmuL(Q)             
        33     5.00000000E+03   # mtauL(Q)            
        34     5.00000000E+03   # meR(Q)              
        35     5.00000000E+03   # mmuR(Q)             
        36     5.00000000E+03   # mtauR(Q)            
        41     4.99999999E+03   # mqL1(Q)             
        42     4.99999999E+03   # mqL2(Q)             
        43     4.99999999E+03   # mqL3(Q)             
        44     4.99999999E+03   # muR(Q)              
        45     4.99999999E+03   # mcR(Q)              
        46     4.99999999E+03   # mtR(Q)              
        47     4.99999999E+03   # mdR(Q)              
        48     4.99999999E+03   # msR(Q)              
        49     4.99999999E+03   # mbR(Q)              
#
#
#
#                             =================
#                             |The decay table|
#                             =================
#
# - The QCD corrections to the decays gluino -> squark  + quark
#                                     squark -> gaugino + quark_prime
#                                     squark -> squark_prime + Higgs
#                                     squark -> gluino  + quark
#   are included.
#
# - The multi-body decays for the inos, stops and sbottoms are included.
#
# - The loop induced decays for the gluino, neutralinos and stops
#   are included.
#
# - The SUSY decays of the top quark are included.
#
#
#         PDG            Width
DECAY         6     1.40049390E+00   # top decays
#          BR         NDA      ID1       ID2
     1.00000000E+00    2           5        24   # BR(t ->  b    W+)
#
#         PDG            Width
DECAY   1000021     9.04130600E-03   # gluino decays
#          BR         NDA      ID1       ID2
     1.90965742E-06    2     1000022        21   # BR(~g -> ~chi_10 g)
     3.97030404E-03    2     1000023        21   # BR(~g -> ~chi_20 g)
     3.94103810E-03    2     1000025        21   # BR(~g -> ~chi_30 g)
#           BR         NDA      ID1       ID2       ID3
     2.27053261E-02    3     1000022         1        -1   # BR(~g -> ~chi_10 d  db)
     2.82808953E-05    3     1000023         1        -1   # BR(~g -> ~chi_20 d  db)
     8.87875067E-06    3     1000025         1        -1   # BR(~g -> ~chi_30 d  db)
     7.74293686E-02    3     1000022         2        -2   # BR(~g -> ~chi_10 u  ub)
     6.23620784E-05    3     1000023         2        -2   # BR(~g -> ~chi_20 u  ub)
     9.43574170E-06    3     1000025         2        -2   # BR(~g -> ~chi_30 u  ub)
     2.27053261E-02    3     1000022         3        -3   # BR(~g -> ~chi_10 s  sb)
     2.82808953E-05    3     1000023         3        -3   # BR(~g -> ~chi_20 s  sb)
     8.87875067E-06    3     1000025         3        -3   # BR(~g -> ~chi_30 s  sb)
     7.74293686E-02    3     1000022         4        -4   # BR(~g -> ~chi_10 c  cb)
     6.23620784E-05    3     1000023         4        -4   # BR(~g -> ~chi_20 c  cb)
     9.43574170E-06    3     1000025         4        -4   # BR(~g -> ~chi_30 c  cb)
     2.30195822E-02    3     1000022         5        -5   # BR(~g -> ~chi_10 b  bb)
     4.46626366E-03    3     1000023         5        -5   # BR(~g -> ~chi_20 b  bb)
     4.40992374E-03    3     1000025         5        -5   # BR(~g -> ~chi_30 b  bb)
     8.12364656E-02    3     1000022         6        -6   # BR(~g -> ~chi_10 t  tb)
     1.69616084E-01    3     1000023         6        -6   # BR(~g -> ~chi_20 t  tb)
     1.58113398E-01    3     1000025         6        -6   # BR(~g -> ~chi_30 t  tb)
     7.74783002E-05    3     1000024         1        -2   # BR(~g -> ~chi_1+ d  ub)
     7.74783002E-05    3    -1000024         2        -1   # BR(~g -> ~chi_1- u  db)
     7.74783002E-05    3     1000024         3        -4   # BR(~g -> ~chi_1+ s  cb)
     7.74783002E-05    3    -1000024         4        -3   # BR(~g -> ~chi_1- c  sb)
     1.75213906E-01    3     1000024         5        -6   # BR(~g -> ~chi_1+ b  tb)
     1.75213906E-01    3    -1000024         6        -5   # BR(~g -> ~chi_1- t  bb)
#
#         PDG            Width
DECAY   1000006     2.38127067E+02   # stop1 decays
#          BR         NDA      ID1       ID2
     3.73835690E-02    2     1000022         6   # BR(~t_1 -> ~chi_10 t )
     1.19659351E-01    2     1000023         6   # BR(~t_1 -> ~chi_20 t )
     1.15153604E-01    2     1000025         6   # BR(~t_1 -> ~chi_30 t )
     8.69801904E-03    2     1000035         6   # BR(~t_1 -> ~chi_40 t )
     1.75820088E-01    2     1000024         5   # BR(~t_1 -> ~chi_1+ b )
     1.73151944E-02    2     1000037         5   # BR(~t_1 -> ~chi_2+ b )
     5.25970174E-01    2     1000021         6   # BR(~t_1 -> ~g      t )
#
#         PDG            Width
DECAY   2000006     2.50096283E+02   # stop2 decays
#          BR         NDA      ID1       ID2
     1.35808815E-02    2     1000022         6   # BR(~t_2 -> ~chi_10 t )
     1.17675450E-01    2     1000023         6   # BR(~t_2 -> ~chi_20 t )
     1.22367793E-01    2     1000025         6   # BR(~t_2 -> ~chi_30 t )
     2.25765387E-02    2     1000035         6   # BR(~t_2 -> ~chi_40 t )
     6.86360257E-02    2     1000024         5   # BR(~t_2 -> ~chi_1+ b )
     4.48755660E-02    2     1000037         5   # BR(~t_2 -> ~chi_2+ b )
     6.05489474E-01    2     1000021         6   # BR(~t_2 -> ~g      t )
     1.07421376E-03    2     1000006        25   # BR(~t_2 -> ~t_1    h )
     3.72405625E-03    2     1000006        23   # BR(~t_2 -> ~t_1    Z )
#
#         PDG            Width
DECAY   1000005     2.25109528E+02   # sbottom1 decays
#          BR         NDA      ID1       ID2
     3.43512157E-03    2     1000022         5   # BR(~b_1 -> ~chi_10 b )
     3.41972642E-03    2     1000023         5   # BR(~b_1 -> ~chi_20 b )
     3.28079243E-03    2     1000025         5   # BR(~b_1 -> ~chi_30 b )
     3.37388282E-02    2     1000035         5   # BR(~b_1 -> ~chi_40 b )
     2.57334467E-01    2    -1000024         6   # BR(~b_1 -> ~chi_1- t )
     6.78512951E-02    2    -1000037         6   # BR(~b_1 -> ~chi_2- t )
     6.28608392E-01    2     1000021         5   # BR(~b_1 -> ~g      b )
     2.33137719E-03    2     1000006       -24   # BR(~b_1 -> ~t_1    W-)
#
#         PDG            Width
DECAY   2000005     1.51159493E+02   # sbottom2 decays
#          BR         NDA      ID1       ID2
     1.93380333E-02    2     1000022         5   # BR(~b_2 -> ~chi_10 b )
     4.97187053E-03    2     1000023         5   # BR(~b_2 -> ~chi_20 b )
     5.14611268E-03    2     1000025         5   # BR(~b_2 -> ~chi_30 b )
     4.35361743E-04    2     1000035         5   # BR(~b_2 -> ~chi_40 b )
     1.30949791E-02    2    -1000024         6   # BR(~b_2 -> ~chi_1- t )
     8.75315311E-04    2    -1000037         6   # BR(~b_2 -> ~chi_2- t )
     9.56004238E-01    2     1000021         5   # BR(~b_2 -> ~g      b )
     1.34089543E-04    2     1000006       -24   # BR(~b_2 -> ~t_1    W-)
#
#         PDG            Width
DECAY   1000002     1.70686662E+02   # sup_L decays
#          BR         NDA      ID1       ID2
     4.35751355E-03    2     1000022         2   # BR(~u_L -> ~chi_10 u)
     1.01731321E-04    2     1000023         2   # BR(~u_L -> ~chi_20 u)
     7.85957195E-06    2     1000025         2   # BR(~u_L -> ~chi_30 u)
     4.64658760E-02    2     1000035         2   # BR(~u_L -> ~chi_40 u)
     3.41683895E-04    2     1000024         1   # BR(~u_L -> ~chi_1+ d)
     9.28647342E-02    2     1000037         1   # BR(~u_L -> ~chi_2+ d)
     8.55860602E-01    2     1000021         2   # BR(~u_L -> ~g      u)
#
#         PDG            Width
DECAY   2000002     1.56362881E+02   # sup_R decays
#          BR         NDA      ID1       ID2
     7.57177001E-02    2     1000022         2   # BR(~u_R -> ~chi_10 u)
     3.46344056E-05    2     1000023         2   # BR(~u_R -> ~chi_20 u)
     4.36765982E-05    2     1000025         2   # BR(~u_R -> ~chi_30 u)
     5.56236706E-09    2     1000035         2   # BR(~u_R -> ~chi_40 u)
     9.24203983E-01    2     1000021         2   # BR(~u_R -> ~g      u)
#
#         PDG            Width
DECAY   1000001     1.70704747E+02   # sdown_L decays
#          BR         NDA      ID1       ID2
     4.34362388E-03    2     1000022         1   # BR(~d_L -> ~chi_10 d)
     5.27592936E-05    2     1000023         1   # BR(~d_L -> ~chi_20 d)
     3.56808379E-05    2     1000025         1   # BR(~d_L -> ~chi_30 d)
     4.64904569E-02    2     1000035         1   # BR(~d_L -> ~chi_40 d)
     3.68188427E-05    2    -1000024         2   # BR(~d_L -> ~chi_1- u)
     9.30247182E-02    2    -1000037         2   # BR(~d_L -> ~chi_2- u)
     8.56015942E-01    2     1000021         1   # BR(~d_L -> ~g      d)
#
#         PDG            Width
DECAY   2000001     1.47499113E+02   # sdown_R decays
#          BR         NDA      ID1       ID2
     2.00680874E-02    2     1000022         1   # BR(~d_R -> ~chi_10 d)
     9.17957863E-06    2     1000023         1   # BR(~d_R -> ~chi_20 d)
     1.15761418E-05    2     1000025         1   # BR(~d_R -> ~chi_30 d)
     1.47442360E-09    2     1000035         1   # BR(~d_R -> ~chi_40 d)
     9.79911155E-01    2     1000021         1   # BR(~d_R -> ~g      d)
#
#         PDG            Width
DECAY   1000004     1.70686662E+02   # scharm_L decays
#          BR         NDA      ID1       ID2
     4.35751355E-03    2     1000022         4   # BR(~c_L -> ~chi_10 c)
     1.01731321E-04    2     1000023         4   # BR(~c_L -> ~chi_20 c)
     7.85957195E-06    2     1000025         4   # BR(~c_L -> ~chi_30 c)
     4.64658760E-02    2     1000035         4   # BR(~c_L -> ~chi_40 c)
     3.41683895E-04    2     1000024         3   # BR(~c_L -> ~chi_1+ s)
     9.28647342E-02    2     1000037         3   # BR(~c_L -> ~chi_2+ s)
     8.55860602E-01    2     1000021         4   # BR(~c_L -> ~g      c)
#
#         PDG            Width
DECAY   2000004     1.56362881E+02   # scharm_R decays
#          BR         NDA      ID1       ID2
     7.57177001E-02    2     1000022         4   # BR(~c_R -> ~chi_10 c)
     3.46344056E-05    2     1000023         4   # BR(~c_R -> ~chi_20 c)
     4.36765982E-05    2     1000025         4   # BR(~c_R -> ~chi_30 c)
     5.56236706E-09    2     1000035         4   # BR(~c_R -> ~chi_40 c)
     9.24203983E-01    2     1000021         4   # BR(~c_R -> ~g      c)
#
#         PDG            Width
DECAY   1000003     1.70704747E+02   # sstrange_L decays
#          BR         NDA      ID1       ID2
     4.34362388E-03    2     1000022         3   # BR(~s_L -> ~chi_10 s)
     5.27592936E-05    2     1000023         3   # BR(~s_L -> ~chi_20 s)
     3.56808379E-05    2     1000025         3   # BR(~s_L -> ~chi_30 s)
     4.64904569E-02    2     1000035         3   # BR(~s_L -> ~chi_40 s)
     3.68188427E-05    2    -1000024         4   # BR(~s_L -> ~chi_1- c)
     9.30247182E-02    2    -1000037         4   # BR(~s_L -> ~chi_2- c)
     8.56015942E-01    2     1000021         3   # BR(~s_L -> ~g      s)
#
#         PDG            Width
DECAY   2000003     1.47499113E+02   # sstrange_R decays
#          BR         NDA      ID1       ID2
     2.00680874E-02    2     1000022         3   # BR(~s_R -> ~chi_10 s)
     9.17957863E-06    2     1000023         3   # BR(~s_R -> ~chi_20 s)
     1.15761418E-05    2     1000025         3   # BR(~s_R -> ~chi_30 s)
     1.47442360E-09    2     1000035         3   # BR(~s_R -> ~chi_40 s)
     9.79911155E-01    2     1000021         3   # BR(~s_R -> ~g      s)
#
#         PDG            Width
DECAY   1000011     3.02429175E+01   # selectron_L decays
#          BR         NDA      ID1       ID2
     2.26658967E-01    2     1000022        11   # BR(~e_L -> ~chi_10 e-)
     9.56628990E-04    2     1000023        11   # BR(~e_L -> ~chi_20 e-)
     7.70327795E-07    2     1000025        11   # BR(~e_L -> ~chi_30 e-)
     2.57196881E-01    2     1000035        11   # BR(~e_L -> ~chi_40 e-)
     2.11363024E-04    2    -1000024        12   # BR(~e_L -> ~chi_1- nu_e)
     5.14975390E-01    2    -1000037        12   # BR(~e_L -> ~chi_2- nu_e)
#
#         PDG            Width
DECAY   2000011     2.73610645E+01   # selectron_R decays
#          BR         NDA      ID1       ID2
     9.98974590E-01    2     1000022        11   # BR(~e_R -> ~chi_10 e-)
     4.53479496E-04    2     1000023        11   # BR(~e_R -> ~chi_20 e-)
     5.71860061E-04    2     1000025        11   # BR(~e_R -> ~chi_30 e-)
     7.03390140E-08    2     1000035        11   # BR(~e_R -> ~chi_40 e-)
#
#         PDG            Width
DECAY   1000013     3.02429175E+01   # smuon_L decays
#          BR         NDA      ID1       ID2
     2.26658967E-01    2     1000022        13   # BR(~mu_L -> ~chi_10 mu-)
     9.56628990E-04    2     1000023        13   # BR(~mu_L -> ~chi_20 mu-)
     7.70327795E-07    2     1000025        13   # BR(~mu_L -> ~chi_30 mu-)
     2.57196881E-01    2     1000035        13   # BR(~mu_L -> ~chi_40 mu-)
     2.11363024E-04    2    -1000024        14   # BR(~mu_L -> ~chi_1- nu_mu)
     5.14975390E-01    2    -1000037        14   # BR(~mu_L -> ~chi_2- nu_mu)
#
#         PDG            Width
DECAY   2000013     2.73610645E+01   # smuon_R decays
#          BR         NDA      ID1       ID2
     9.98974590E-01    2     1000022        13   # BR(~mu_R -> ~chi_10 mu-)
     4.53479496E-04    2     1000023        13   # BR(~mu_R -> ~chi_20 mu-)
     5.71860061E-04    2     1000025        13   # BR(~mu_R -> ~chi_30 mu-)
     7.03390140E-08    2     1000035        13   # BR(~mu_R -> ~chi_40 mu-)
#
#         PDG            Width
DECAY   1000015     2.90324412E+01   # stau_1 decays
#          BR         NDA      ID1       ID2
     9.26860143E-01    2     1000022        15   # BR(~tau_1 -> ~chi_10  tau-)
     1.47472484E-02    2     1000023        15   # BR(~tau_1 -> ~chi_20  tau-)
     1.36740860E-02    2     1000025        15   # BR(~tau_1 -> ~chi_30  tau-)
     5.56741658E-03    2     1000035        15   # BR(~tau_1 -> ~chi_40  tau-)
     2.80038636E-02    2    -1000024        16   # BR(~tau_1 -> ~chi_1-  nu_tau)
     1.11472428E-02    2    -1000037        16   # BR(~tau_1 -> ~chi_2-  nu_tau)
#
#         PDG            Width
DECAY   2000015     3.09891675E+01   # stau_2 decays
#          BR         NDA      ID1       ID2
     2.34731365E-01    2     1000022        15   # BR(~tau_2 -> ~chi_10  tau-)
     1.36775277E-02    2     1000023        15   # BR(~tau_2 -> ~chi_20  tau-)
     1.38135992E-02    2     1000025        15   # BR(~tau_2 -> ~chi_30  tau-)
     2.45710124E-01    2     1000035        15   # BR(~tau_2 -> ~chi_40  tau-)
     9.18496868E-05    2    -1000024        16   # BR(~tau_2 -> ~chi_1-  nu_tau)
     4.91975535E-01    2    -1000037        16   # BR(~tau_2 -> ~chi_2-  nu_tau)
#
#         PDG            Width
DECAY   1000012     3.02452919E+01   # snu_eL decays
#          BR         NDA      ID1       ID2
     2.26358200E-01    2     1000022        12   # BR(~nu_eL -> ~chi_10 nu_e)
     1.13176133E-04    2     1000023        12   # BR(~nu_eL -> ~chi_20 nu_e)
     4.79740005E-04    2     1000025        12   # BR(~nu_eL -> ~chi_30 nu_e)
     2.57268335E-01    2     1000035        12   # BR(~nu_eL -> ~chi_40 nu_e)
     1.96087259E-03    2     1000024        11   # BR(~nu_eL -> ~chi_1+ e-)
     5.13819677E-01    2     1000037        11   # BR(~nu_eL -> ~chi_2+ e-)
#
#         PDG            Width
DECAY   1000014     3.02452919E+01   # snu_muL decays
#          BR         NDA      ID1       ID2
     2.26358200E-01    2     1000022        14   # BR(~nu_muL -> ~chi_10 nu_mu)
     1.13176133E-04    2     1000023        14   # BR(~nu_muL -> ~chi_20 nu_mu)
     4.79740005E-04    2     1000025        14   # BR(~nu_muL -> ~chi_30 nu_mu)
     2.57268335E-01    2     1000035        14   # BR(~nu_muL -> ~chi_40 nu_mu)
     1.96087259E-03    2     1000024        13   # BR(~nu_muL -> ~chi_1+ mu-)
     5.13819677E-01    2     1000037        13   # BR(~nu_muL -> ~chi_2+ mu-)
#
#         PDG            Width
DECAY   1000016     3.10482826E+01   # snu_tauL decays
#          BR         NDA      ID1       ID2
     2.20480147E-01    2     1000022        16   # BR(~nu_tauL -> ~chi_10 nu_tau)
     1.10233767E-04    2     1000023        16   # BR(~nu_tauL -> ~chi_20 nu_tau)
     4.67267612E-04    2     1000025        16   # BR(~nu_tauL -> ~chi_30 nu_tau)
     2.50522570E-01    2     1000035        16   # BR(~nu_tauL -> ~chi_40 nu_tau)
     2.80724646E-02    2     1000024        15   # BR(~nu_tauL -> ~chi_1+ tau-)
     5.00347317E-01    2     1000037        15   # BR(~nu_tauL -> ~chi_2+ tau-)
#
#         PDG            Width
DECAY   1000024     7.97095441E-01   # chargino1+ decays
#          BR         NDA      ID1       ID2
     1.00000000E+00    2     1000022        24   # BR(~chi_1+ -> ~chi_10  W+)
#
#         PDG            Width
DECAY   1000037     1.92707459E+01   # chargino2+ decays
#          BR         NDA      ID1       ID2
     2.52919079E-01    2     1000024        23   # BR(~chi_2+ -> ~chi_1+  Z )
     2.27548301E-04    2     1000022        24   # BR(~chi_2+ -> ~chi_10  W+)
     2.43956135E-01    2     1000023        24   # BR(~chi_2+ -> ~chi_20  W+)
     2.43868514E-01    2     1000025        24   # BR(~chi_2+ -> ~chi_30  W+)
     2.59028132E-01    2     1000024        25   # BR(~chi_2+ -> ~chi_1+  h )
     5.91652570E-07    2     1000022        37   # BR(~chi_2+ -> ~chi_10  H+)
#
#         PDG            Width
DECAY   1000022     0.00000000E+00   # neutralino1 decays
#
#         PDG            Width
DECAY   1000023     8.36329561E-01   # neutralino2 decays
#          BR         NDA      ID1       ID2
     5.51247436E-01    2     1000022        23   # BR(~chi_20 -> ~chi_10   Z )
     4.48752564E-01    2     1000022        25   # BR(~chi_20 -> ~chi_10   h )
#
#         PDG            Width
DECAY   1000025     8.43436612E-01   # neutralino3 decays
#          BR         NDA      ID1       ID2
     4.33553579E-01    2     1000022        23   # BR(~chi_30 -> ~chi_10   Z )
     5.66446421E-01    2     1000022        25   # BR(~chi_30 -> ~chi_10   h )
#
#         PDG            Width
DECAY   1000035     1.92795636E+01   # neutralino4 decays
#          BR         NDA      ID1       ID2
     7.23346770E-05    2     1000022        23   # BR(~chi_40 -> ~chi_10   Z )
     5.16783307E-02    2     1000023        23   # BR(~chi_40 -> ~chi_20   Z )
     2.00567917E-01    2     1000025        23   # BR(~chi_40 -> ~chi_30   Z )
     2.44512328E-01    2     1000024       -24   # BR(~chi_40 -> ~chi_1+   W-)
     2.44512328E-01    2    -1000024        24   # BR(~chi_40 -> ~chi_1-   W+)
     1.59144716E-04    2     1000022        25   # BR(~chi_40 -> ~chi_10   h )
     5.39515967E-07    2     1000022        35   # BR(~chi_40 -> ~chi_10   H )
     7.31967632E-08    2     1000022        36   # BR(~chi_40 -> ~chi_10   A )
     2.06753451E-01    2     1000023        25   # BR(~chi_40 -> ~chi_20   h )
     5.17435526E-02    2     1000025        25   # BR(~chi_40 -> ~chi_30   h )
#
#         PDG            Width
DECAY        25     4.04281386E-03   # h decays
#          BR         NDA      ID1       ID2
     6.05537875E-01    2           5        -5   # BR(h -> b       bb     )
     6.41763608E-02    2         -15        15   # BR(h -> tau+    tau-   )
     2.27207459E-04    2         -13        13   # BR(h -> mu+     mu-    )
     4.81633817E-04    2           3        -3   # BR(h -> s       sb     )
     2.08708666E-02    2           4        -4   # BR(h -> c       cb     )
     6.75630059E-02    2          21        21   # BR(h -> g       g      )
     2.32406317E-03    2          22        22   # BR(h -> gam     gam    )
     1.50223208E-03    2          22        23   # BR(h -> Z       gam    )
     2.11991143E-01    2          24       -24   # BR(h -> W+      W-     )
     2.52845643E-02    2          23        23   # BR(h -> Z       Z      )
     4.10485540E-05    2     1000022   1000022   # BR(h -> ~chi_10 ~chi_10)
#
#         PDG            Width
DECAY        35     7.63166871E+00   # H decays
#          BR         NDA      ID1       ID2
     4.26948516E-01    2           5        -5   # BR(H -> b       bb     )
     7.29934562E-02    2         -15        15   # BR(H -> tau+    tau-   )
     2.58110659E-04    2         -13        13   # BR(H -> mu+     mu-    )
     3.16404102E-04    2           3        -3   # BR(H -> s       sb     )
     1.77011418E-06    2           4        -4   # BR(H -> c       cb     )
     1.76848427E-01    2           6        -6   # BR(H -> t       tb     )
     5.87390316E-05    2          21        21   # BR(H -> g       g      )
     3.62285860E-07    2          22        22   # BR(H -> gam     gam    )
     1.04451050E-07    2          23        22   # BR(H -> Z       gam    )
     8.02186317E-05    2          24       -24   # BR(H -> W+      W-     )
     4.00585525E-05    2          23        23   # BR(H -> Z       Z      )
     2.99826108E-04    2          25        25   # BR(H -> h       h      )
     3.91490694E-24    2          36        36   # BR(H -> A       A      )
     1.17806537E-18    2          23        36   # BR(H -> Z       A      )
     7.42953473E-04    2     1000024  -1000024   # BR(H -> ~chi_1+ ~chi_1-)
     1.11961065E-03    2     1000022   1000022   # BR(H -> ~chi_10 ~chi_10)
     5.60916748E-05    2     1000023   1000023   # BR(H -> ~chi_20 ~chi_20)
     1.23951391E-04    2     1000025   1000025   # BR(H -> ~chi_30 ~chi_30)
     1.91039820E-01    2     1000022   1000023   # BR(H -> ~chi_10 ~chi_20)
     1.28948712E-01    2     1000022   1000025   # BR(H -> ~chi_10 ~chi_30)
     1.22868095E-04    2     1000023   1000025   # BR(H -> ~chi_20 ~chi_30)
#
#         PDG            Width
DECAY        36     7.65269077E+00   # A decays
#          BR         NDA      ID1       ID2
     4.25918376E-01    2           5        -5   # BR(A -> b       bb     )
     7.27951124E-02    2         -15        15   # BR(A -> tau+    tau-   )
     2.57408940E-04    2         -13        13   # BR(A -> mu+     mu-    )
     3.15774520E-04    2           3        -3   # BR(A -> s       sb     )
     1.77254922E-06    2           4        -4   # BR(A -> c       cb     )
     1.76993997E-01    2           6        -6   # BR(A -> t       tb     )
     1.75145448E-04    2          21        21   # BR(A -> g       g      )
     4.86965783E-07    2          22        22   # BR(A -> gam     gam    )
     2.12177287E-07    2          23        22   # BR(A -> Z       gam    )
     7.96956280E-05    2          23        25   # BR(A -> Z       h      )
     2.59057293E-03    2     1000024  -1000024   # BR(A -> ~chi_1+ ~chi_1-)
     1.14625120E-03    2     1000022   1000022   # BR(A -> ~chi_10 ~chi_10)
     1.46680485E-04    2     1000023   1000023   # BR(A -> ~chi_20 ~chi_20)
     7.66086411E-04    2     1000025   1000025   # BR(A -> ~chi_30 ~chi_30)
     1.30194185E-01    2     1000022   1000023   # BR(A -> ~chi_10 ~chi_20)
     1.88611278E-01    2     1000022   1000025   # BR(A -> ~chi_10 ~chi_30)
     6.96419970E-06    2     1000023   1000025   # BR(A -> ~chi_20 ~chi_30)
#
#         PDG            Width
DECAY        37     7.64545076E+00   # H+ decays
#          BR         NDA      ID1       ID2
     6.88743572E-04    2           4        -5   # BR(H+ -> c       bb     )
     7.28851355E-02    2         -15        16   # BR(H+ -> tau+    nu_tau )
     2.57727268E-04    2         -13        14   # BR(H+ -> mu+     nu_mu  )
     4.40793635E-06    2           2        -5   # BR(H+ -> u       bb     )
     1.51229026E-05    2           2        -3   # BR(H+ -> u       sb     )
     3.12742860E-04    2           4        -3   # BR(H+ -> c       sb     )
     6.03913319E-01    2           6        -5   # BR(H+ -> t       bb     )
     7.98916005E-05    2          24        25   # BR(H+ -> W+      h      )
     8.48251331E-14    2          24        36   # BR(H+ -> W+      A      )
     3.21422180E-01    2     1000024   1000022   # BR(H+ -> ~chi_1+ ~chi_10)
     3.54799389E-04    2     1000024   1000023   # BR(H+ -> ~chi_1+ ~chi_20)
     6.59305315E-05    2     1000024   1000025   # BR(H+ -> ~chi_1+ ~chi_30)
