#  ISAJET SUSY parameters in SUSY Les Houches Accord 2 format
#  Created by ISALHA 2.0 Last revision: C. Balazs 21 Apr 2009
Block SPINFO   # Program information
     1   ISASUGRA from ISAJET          # Spectrum Calculator
     2   7.80   29-OCT-2009 12:50:36   # Version number
Block MODSEL   # Model selection
     1     3   # Minimal anomaly mediated (AMSB) model             
Block SMINPUTS   # Standard Model inputs
     1     1.27836258E+02   # alpha_em^(-1)
     2     1.16570000E-05   # G_Fermi
     3     1.17200002E-01   # alpha_s(M_Z)
     4     9.11699982E+01   # m_{Z}(pole)
     5     4.19999981E+00   # m_{b}(m_{b})
     6     1.72500000E+02   # m_{top}(pole)
     7     1.77699995E+00   # m_{tau}(pole)
Block MINPAR   # SUSY breaking input parameters
     1     5.00000000E+03   # m_0
     2     1.19800000E+05   # m_{3/2}
     3     5.00000000E+00   # tan(beta)
     4     1.00000000E+00   # sign(mu)
Block EXTPAR   # Non-universal SUSY breaking parameters
     0     8.56622691E+15   # Input scale
Block MASS   # Scalar and gaugino mass spectrum
#  PDG code   mass                 particle
         5     4.80000000E+00   # b-quark pole mass calculated from mb(mb)_Msbar
         6     1.72500000E+02   # t-quark pole mass (not read by ME)
        15     1.77682000E+00   # tau pole mass (not read by ME)
        23     9.11876000E+01   # Z pole mass (not read by ME)
        24     8.04229965E+01   #  W^+
        25     1.15598442E+02   #  h^0            
        35     5.49086279E+03   #  H^0            
        36     5.45483936E+03   #  A^0            
        37     5.49130371E+03   #  H^+            
   1000001     5.42363965E+03   #  dnl            
   1000002     5.42308350E+03   #  upl            
   1000003     5.42363965E+03   #  stl            
   1000004     5.42308350E+03   #  chl            
   1000005     4.51348340E+03   #  b1             
   1000006     3.35379907E+03   #  t1             
   1000011     4.96983691E+03   #  el-            
   1000012     4.97085791E+03   #  nuel           
   1000013     4.96983691E+03   #  mul-           
   1000014     4.97085791E+03   #  numl           
   1000015     4.95456250E+03   #  tau1           
   1000016     4.96493848E+03   #  nutl           
   1000021     2.62913721E+03   #  glss           
   1000022     3.49753510E+02   #  z1ss           
   1000023     1.11460852E+03   #  z2ss           
   1000024     3.49925873E+02   #  w1ss           
   1000025    -2.05024951E+03   #  z3ss           
   1000035     2.05298706E+03   #  z4ss           
   1000037     2.05497827E+03   #  w2ss           
   2000001     5.45760645E+03   #  dnr            
   2000002     5.44594287E+03   #  upr            
   2000003     5.45760645E+03   #  str            
   2000004     5.44594336E+03   #  chr            
   2000005     5.43255713E+03   #  b2             
   2000006     4.53409668E+03   #  t2             
   2000011     4.96750781E+03   #  er-            
   2000013     4.96750781E+03   #  mur-           
   2000015     4.96382031E+03   #  tau2           
Block ALPHA   # Effective Higgs mixing parameter
         -1.97537854E-01   # alpha
Block STOPMIX   # stop mixing matrix
  1  1     1.71172172E-02   # O_{11}
  1  2    -9.99853492E-01   # O_{12}
  2  1     9.99853492E-01   # O_{21}
  2  2     1.71172172E-02   # O_{22}
Block SBOTMIX   # sbottom mixing matrix
  1  1     9.99996960E-01   # O_{11}
  1  2     2.46055494E-03   # O_{12}
  2  1    -2.46055494E-03   # O_{21}
  2  2     9.99996960E-01   # O_{22}
Block STAUMIX   # stau mixing matrix
  1  1     2.57104814E-01   # O_{11}
  1  2     9.66383517E-01   # O_{12}
  2  1    -9.66383517E-01   # O_{21}
  2  2     2.57104814E-01   # O_{22}
Block NMIX   # neutralino mixing matrix
  1  1     4.90912993E-04   #
  1  2    -9.99149978E-01   #
  1  3     3.90750989E-02   #
  1  4    -1.31296972E-02   #
  2  1    -9.99318898E-01   #
  2  2    -1.96344033E-03   #
  2  3    -3.09064686E-02   #
  2  4     2.00703144E-02   #
  3  1     7.68768787E-03   #
  3  2    -1.83396488E-02   #
  3  3    -7.06686735E-01   #
  3  4    -7.07247198E-01   #
  4  1     3.60906683E-02   #
  4  2    -3.68686877E-02   #
  4  3    -7.05770314E-01   #
  4  4     7.06559896E-01   #
Block UMIX   # chargino U mixing matrix
  1  1    -9.98475552E-01   # U_{11}
  1  2     5.51953241E-02   # U_{12}
  2  1    -5.51953241E-02   # U_{21}
  2  2    -9.98475552E-01   # U_{22}
Block VMIX   # chargino V mixing matrix
  1  1    -9.99784291E-01   # V_{11}
  1  2     2.07692198E-02   # V_{12}
  2  1    -2.07692198E-02   # V_{21}
  2  2    -9.99784291E-01   # V_{22}
Block GAUGE Q=  3.82600098E+03   #
     1     3.57524991E-01   # g`
     2     6.52378619E-01   # g_2
     3     1.21928000E+00   # g_3
Block YU Q=  3.82600098E+03   #
  3  3     8.38436604E-01   # y_t
Block YD Q=  3.82600098E+03   #
  3  3     6.43478483E-02   # y_b
Block YE Q=  3.82600098E+03   #
  3  3     5.14888652E-02   # y_tau
Block HMIX Q=  3.82600098E+03   # Higgs mixing parameters
     1     2.02749829E+03   # mu(Q)
     2     5.00000000E+00   # tan(beta)(M_GUT)
     3     2.52229141E+02   # Higgs vev at Q
     4     2.97552720E+07   # m_A^2(Q)
Block MSOFT Q=  3.82600098E+03   # DRbar SUSY breaking parameters
     1     1.11794507E+03   # M_1(Q)          
     2     3.24304199E+02   # M_2(Q)          
     3    -2.31422510E+03   # M_3(Q)          
    21     3.23374943E+04   # mH1^2(Q)            
    22    -1.28800134E+05   # mH2^2(Q)            
    31     4.95293262E+03   # MeL(Q)          
    32     4.95293262E+03   # MmuL(Q)         
    33     4.94719287E+03   # MtauL(Q)        
    34     4.96208496E+03   # MeR(Q)          
    35     4.96208496E+03   # MmuR(Q)         
    36     4.95089307E+03   # MtauR(Q)        
    41     5.31285449E+03   # MqL1(Q)         
    42     5.31285449E+03   # MqL2(Q)         
    43     4.42227539E+03   # MqL3(Q)         
    44     5.33551270E+03   # MuR(Q)          
    45     5.33551270E+03   # McR(Q)          
    46     3.31012451E+03   # MtR(Q)          
    47     5.34697607E+03   # MdR(Q)          
    48     5.34697607E+03   # MsR(Q)          
    49     5.34408252E+03   # MbR(Q)          
Block AU Q=  3.82600098E+03   #
  1  1     1.89697961E+03   # A_u
  2  2     1.89697961E+03   # A_c
  3  3     1.89697961E+03   # A_t
Block AD Q=  3.82600098E+03   #
  1  1     4.51701367E+03   # A_d
  2  2     4.51701367E+03   # A_s
  3  3     4.51701367E+03   # A_b
Block AE Q=  3.82600098E+03   #
  1  1     1.25330676E+03   # A_e
  2  2     1.25330676E+03   # A_mu
  3  3     1.25330676E+03   # A_tau
#
#  ISAJET decay tables in SUSY Les Houches accord format
#  Created by ISALHD. Last revision: C. Balazs, 2005 May 25
Block DCINFO                           # Program information
     1   ISASUGRA from ISAJET          # Spectrum Calculator
     2   7.80   29-OCT-2009 12:50:36   # Version number
#         PDG         Width
DECAY        23     2.49520000E+00   # Z width (SM calculation)
DECAY        24     2.08500000E+00   # W width (SM calculation)
#
#         PDG            Width  
DECAY         6  1.14680779E+00   # TP    decays
#          BR          NDA       ID1       ID2       ID3       ID4
      3.33333343E-01    3            2        -1         5             # TP     -->  UP     DB     BT          
      3.33333343E-01    3            4        -3         5             # TP     -->  CH     SB     BT          
      1.11111112E-01    3          -11        12         5             # TP     -->  E+     NUE    BT          
      1.11111112E-01    3          -13        14         5             # TP     -->  MU+    NUM    BT          
      1.11111112E-01    3          -15        16         5             # TP     -->  TAU+   NUT    BT          
#         PDG         Width
DECAY   1000021  8.22491292E-03   # GLSS  decays
#          BR          NDA       ID1       ID2       ID3       ID4
      7.09137693E-02    3      1000024         1        -2             # GLSS   -->  W1SS+  DN     UB          
      7.09137693E-02    3     -1000024         2        -1             # GLSS   -->  W1SS-  UP     DB          
      7.09137693E-02    3      1000024         3        -4             # GLSS   -->  W1SS+  ST     CB          
      7.09137693E-02    3     -1000024         4        -3             # GLSS   -->  W1SS-  CH     SB          
      1.60215795E-01    3      1000024         5        -6             # GLSS   -->  W1SS+  BT     TB          
      1.60215795E-01    3     -1000024         6        -5             # GLSS   -->  W1SS-  TP     BB          
      6.57961550E-07    3      1000037         1        -2             # GLSS   -->  W2SS+  DN     UB          
      6.57961550E-07    3     -1000037         2        -1             # GLSS   -->  W2SS-  UP     DB          
      6.57961550E-07    3      1000037         3        -4             # GLSS   -->  W2SS+  ST     CB          
      6.57961550E-07    3     -1000037         4        -3             # GLSS   -->  W2SS-  CH     SB          
      7.25218235E-03    3      1000037         5        -6             # GLSS   -->  W2SS+  BT     TB          
      7.25218235E-03    3     -1000037         6        -5             # GLSS   -->  W2SS-  TP     BB          
      9.33985916E-07    2      1000022        21                       # GLSS   -->  Z1SS   GL                 
      3.54679115E-02    3      1000022         2        -2             # GLSS   -->  Z1SS   UP     UB          
      3.54642607E-02    3      1000022         1        -1             # GLSS   -->  Z1SS   DN     DB          
      3.54642607E-02    3      1000022         3        -3             # GLSS   -->  Z1SS   ST     SB          
      3.54679115E-02    3      1000022         4        -4             # GLSS   -->  Z1SS   CH     CB          
      8.33133459E-02    3      1000022         5        -5             # GLSS   -->  Z1SS   BT     BB          
      7.66153559E-02    3      1000022         6        -6             # GLSS   -->  Z1SS   TP     TB          
      6.92891772E-04    2      1000023        21                       # GLSS   -->  Z2SS   GL                 
      4.88248141E-03    3      1000023         2        -2             # GLSS   -->  Z2SS   UP     UB          
      1.42044446E-03    3      1000023         1        -1             # GLSS   -->  Z2SS   DN     DB          
      1.42044446E-03    3      1000023         3        -3             # GLSS   -->  Z2SS   ST     SB          
      4.88248002E-03    3      1000023         4        -4             # GLSS   -->  Z2SS   CH     CB          
      1.85784127E-03    3      1000023         5        -5             # GLSS   -->  Z2SS   BT     BB          
      5.34061156E-02    3      1000023         6        -6             # GLSS   -->  Z2SS   TP     TB          
      1.25741260E-03    2      1000025        21                       # GLSS   -->  Z3SS   GL                 
      1.37615856E-07    3      1000025         2        -2             # GLSS   -->  Z3SS   UP     UB          
      1.72144240E-07    3      1000025         1        -1             # GLSS   -->  Z3SS   DN     DB          
      1.72144240E-07    3      1000025         3        -3             # GLSS   -->  Z3SS   ST     SB          
      1.37615856E-07    3      1000025         4        -4             # GLSS   -->  Z3SS   CH     CB          
      1.58082057E-05    3      1000025         5        -5             # GLSS   -->  Z3SS   BT     BB          
      5.70729561E-03    3      1000025         6        -6             # GLSS   -->  Z3SS   TP     TB          
      1.18087884E-03    2      1000035        21                       # GLSS   -->  Z4SS   GL                 
      2.31601376E-07    3      1000035         2        -2             # GLSS   -->  Z4SS   UP     UB          
      2.97946627E-07    3      1000035         1        -1             # GLSS   -->  Z4SS   DN     DB          
      2.97946627E-07    3      1000035         3        -3             # GLSS   -->  Z4SS   ST     SB          
      2.31601348E-07    3      1000035         4        -4             # GLSS   -->  Z4SS   CH     CB          
      1.58753937E-05    3      1000035         5        -5             # GLSS   -->  Z4SS   BT     BB          
      2.87032989E-03    3      1000035         6        -6             # GLSS   -->  Z4SS   TP     TB          
#         PDG         Width
DECAY   1000002  2.34660172E+02   # UPL   decays
#          BR          NDA       ID1       ID2       ID3       ID4
      9.62901413E-02    2      1000022         2                       # UPL    -->  Z1SS   UP                 
      3.05553782E-03    2      1000023         2                       # UPL    -->  Z2SS   UP                 
      2.04846474E-05    2      1000025         2                       # UPL    -->  Z3SS   UP                 
      6.53591196E-05    2      1000035         2                       # UPL    -->  Z4SS   UP                 
      7.07648933E-01    2      1000021         2                       # UPL    -->  GLSS   UP                 
      1.92858025E-01    2      1000024         1                       # UPL    -->  W1SS+  DN                 
      6.15536192E-05    2      1000037         1                       # UPL    -->  W2SS+  DN                 
#         PDG         Width
DECAY   1000001  2.34669098E+02   # DNL   decays
#          BR          NDA       ID1       ID2       ID3       ID4
      9.63311866E-02    2      1000022         1                       # DNL    -->  Z1SS   DN                 
      2.92747258E-03    2      1000023         1                       # DNL    -->  Z2SS   DN                 
      2.78714942E-05    2      1000025         1                       # DNL    -->  Z3SS   DN                 
      1.34994858E-04    2      1000035         1                       # DNL    -->  Z4SS   DN                 
      7.07777500E-01    2      1000021         1                       # DNL    -->  GLSS   DN                 
      1.92366183E-01    2     -1000024         2                       # DNL    -->  W1SS-  UP                 
      4.34786140E-04    2     -1000037         2                       # DNL    -->  W2SS-  UP                 
#         PDG         Width
DECAY   1000003  2.34669083E+02   # STL   decays
#          BR          NDA       ID1       ID2       ID3       ID4
      9.63311940E-02    2      1000022         3                       # STL    -->  Z1SS   ST                 
      2.92747281E-03    2      1000023         3                       # STL    -->  Z2SS   ST                 
      2.78714961E-05    2      1000025         3                       # STL    -->  Z3SS   ST                 
      1.34994858E-04    2      1000035         3                       # STL    -->  Z4SS   ST                 
      7.07777560E-01    2      1000021         3                       # STL    -->  GLSS   ST                 
      1.92366153E-01    2     -1000024         4                       # STL    -->  W1SS-  CH                 
      4.34786081E-04    2     -1000037         4                       # STL    -->  W2SS-  CH                 
#         PDG         Width
DECAY   1000004  2.34660141E+02   # CHL   decays
#          BR          NDA       ID1       ID2       ID3       ID4
      9.62901562E-02    2      1000022         4                       # CHL    -->  Z1SS   CH                 
      3.05553759E-03    2      1000023         4                       # CHL    -->  Z2SS   CH                 
      2.04846438E-05    2      1000025         4                       # CHL    -->  Z3SS   CH                 
      6.53591196E-05    2      1000035         4                       # CHL    -->  Z4SS   CH                 
      7.07648814E-01    2      1000021         4                       # CHL    -->  GLSS   CH                 
      1.92858040E-01    2      1000024         3                       # CHL    -->  W1SS+  ST                 
      6.15536337E-05    2      1000037         3                       # CHL    -->  W2SS+  ST                 
#         PDG         Width
DECAY   1000005  2.00896942E+02   # BT1   decays
#          BR          NDA       ID1       ID2       ID3       ID4
      9.32996199E-02    2      1000022         5                       # BT1    -->  Z1SS   BT                 
      2.73800734E-03    2      1000023         5                       # BT1    -->  Z2SS   BT                 
      6.37444202E-04    2      1000025         5                       # BT1    -->  Z3SS   BT                 
      7.24177982E-04    2      1000035         5                       # BT1    -->  Z4SS   BT                 
      5.21529257E-01    2      1000021         5                       # BT1    -->  GLSS   BT                 
      1.85824871E-01    2     -1000024         6                       # BT1    -->  W1SS-  TP                 
      1.87464520E-01    2     -1000037         6                       # BT1    -->  W2SS-  TP                 
      7.78200198E-03    2          -24   1000006                       # BT1    -->  W-     TP1                
#         PDG         Width
DECAY   1000006  6.69646530E+01   # TP1   decays
#          BR          NDA       ID1       ID2       ID3       ID4
      3.94728780E-01    2      1000021         6                       # TP1    -->  GLSS   TP                 
      7.90683498E-06    2      1000022         6                       # TP1    -->  Z1SS   TP                 
      8.85808393E-02    2      1000023         6                       # TP1    -->  Z2SS   TP                 
      1.28230259E-01    2      1000025         6                       # TP1    -->  Z3SS   TP                 
      1.29213542E-01    2      1000035         6                       # TP1    -->  Z4SS   TP                 
      3.31080191E-05    2      1000024         5                       # TP1    -->  W1SS+  BT                 
      2.59205550E-01    2      1000037         5                       # TP1    -->  W2SS+  BT                 
#         PDG         Width
DECAY   2000002  1.78852982E+02   # UPR   decays
#          BR          NDA       ID1       ID2       ID3       ID4
      1.64517573E-08    2      1000022         2                       # UPR    -->  Z1SS   UP                 
      6.31005540E-02    2      1000023         2                       # UPR    -->  Z2SS   UP                 
      2.99661360E-06    2      1000025         2                       # UPR    -->  Z3SS   UP                 
      6.59850775E-05    2      1000035         2                       # UPR    -->  Z4SS   UP                 
      9.36830461E-01    2      1000021         2                       # UPR    -->  GLSS   UP                 
#         PDG         Width
DECAY   2000001  1.71149948E+02   # DNR   decays
#          BR          NDA       ID1       ID2       ID3       ID4
      4.30740998E-09    2      1000022         1                       # DNR    -->  Z1SS   DN                 
      1.65266134E-02    2      1000023         1                       # DNR    -->  Z2SS   DN                 
      7.85654265E-07    2      1000025         1                       # DNR    -->  Z3SS   DN                 
      1.73000899E-05    2      1000035         1                       # DNR    -->  Z4SS   DN                 
      9.83455360E-01    2      1000021         1                       # DNR    -->  GLSS   DN                 
#         PDG         Width
DECAY   2000003  1.71149948E+02   # STR   decays
#          BR          NDA       ID1       ID2       ID3       ID4
      4.30740998E-09    2      1000022         3                       # STR    -->  Z1SS   ST                 
      1.65266134E-02    2      1000023         3                       # STR    -->  Z2SS   ST                 
      7.85654265E-07    2      1000025         3                       # STR    -->  Z3SS   ST                 
      1.73000899E-05    2      1000035         3                       # STR    -->  Z4SS   ST                 
      9.83455360E-01    2      1000021         3                       # STR    -->  GLSS   ST                 
#         PDG         Width
DECAY   2000004  1.78852997E+02   # CHR   decays
#          BR          NDA       ID1       ID2       ID3       ID4
      1.64517555E-08    2      1000022         4                       # CHR    -->  Z1SS   CH                 
      6.31005391E-02    2      1000023         4                       # CHR    -->  Z2SS   CH                 
      2.99661338E-06    2      1000025         4                       # CHR    -->  Z3SS   CH                 
      6.59850557E-05    2      1000035         4                       # CHR    -->  Z4SS   CH                 
      9.36830461E-01    2      1000021         4                       # CHR    -->  GLSS   CH                 
#         PDG         Width
DECAY   2000005  1.70231583E+02   # BT2   decays
#          BR          NDA       ID1       ID2       ID3       ID4
      1.33429035E-06    2      1000022         5                       # BT2    -->  Z1SS   BT                 
      1.65269114E-02    2      1000023         5                       # BT2    -->  Z2SS   BT                 
      1.02209428E-03    2      1000025         5                       # BT2    -->  Z3SS   BT                 
      1.03697437E-03    2      1000035         5                       # BT2    -->  Z4SS   BT                 
      9.79128182E-01    2      1000021         5                       # BT2    -->  GLSS   BT                 
      2.64940172E-06    2     -1000024         6                       # BT2    -->  W1SS-  TP                 
      2.03875359E-03    2     -1000037         6                       # BT2    -->  W2SS-  TP                 
      2.57121712E-07    2          -24   1000006                       # BT2    -->  W-     TP1                
      1.02376274E-04    2          -24   2000006                       # BT2    -->  W-     TP2                
      5.50341429E-05    2           23   1000005                       # BT2    -->  Z0     BT1                
      8.53532401E-05    2           25   1000005                       # BT2    -->  HL0    BT1                
#         PDG         Width
DECAY   2000006  2.03509460E+02   # TP2   decays
#          BR          NDA       ID1       ID2       ID3       ID4
      5.17203212E-01    2      1000021         6                       # TP2    -->  GLSS   TP                 
      1.85372010E-01    2      1000024         5                       # TP2    -->  W1SS+  BT                 
      1.22038252E-03    2      1000037         5                       # TP2    -->  W2SS+  BT                 
      4.07072296E-03    2           23   1000006                       # TP2    -->  Z0     TP1                
      1.05063859E-02    2           25   1000006                       # TP2    -->  HL0    TP1                
      9.22955051E-02    2      1000022         6                       # TP2    -->  Z1SS   TP                 
      3.02682305E-03    2      1000023         6                       # TP2    -->  Z2SS   TP                 
      9.34844092E-02    2      1000025         6                       # TP2    -->  Z3SS   TP                 
      9.28206742E-02    2      1000035         6                       # TP2    -->  Z4SS   TP                 
#         PDG         Width
DECAY   1000011  6.77932205E+01   # EL-   decays
#          BR          NDA       ID1       ID2       ID3       ID4
      3.04847151E-01    2      1000022        11                       # EL-    -->  Z1SS   E-                 
      8.45621452E-02    2      1000023        11                       # EL-    -->  Z2SS   E-                 
      4.23299825E-05    2      1000025        11                       # EL-    -->  Z3SS   E-                 
      6.15754761E-05    2      1000035        11                       # EL-    -->  Z4SS   E-                 
      6.09194577E-01    2     -1000024        12                       # EL-    -->  W1SS-  NUE                
      1.29222707E-03    2     -1000037        12                       # EL-    -->  W2SS-  NUE                
#         PDG         Width
DECAY   1000013  6.77932205E+01   # MUL-  decays
#          BR          NDA       ID1       ID2       ID3       ID4
      3.04847151E-01    2      1000022        13                       # MUL-   -->  Z1SS   MU-                
      8.45621452E-02    2      1000023        13                       # MUL-   -->  Z2SS   MU-                
      4.23299825E-05    2      1000025        13                       # MUL-   -->  Z3SS   MU-                
      6.15754761E-05    2      1000035        13                       # MUL-   -->  Z4SS   MU-                
      6.09194577E-01    2     -1000024        14                       # MUL-   -->  W1SS-  NUM                
      1.29222707E-03    2     -1000037        14                       # MUL-   -->  W2SS-  NUM                
#         PDG         Width
DECAY   1000015  2.60871849E+01   # TAU1- decays
#          BR          NDA       ID1       ID2       ID3       ID4
      5.39868921E-02    2      1000022        15                       # TAU1-  -->  Z1SS   TAU-               
      8.27246904E-01    2      1000023        15                       # TAU1-  -->  Z2SS   TAU-               
      3.17432871E-03    2      1000025        15                       # TAU1-  -->  Z3SS   TAU-               
      3.17945378E-03    2      1000035        15                       # TAU1-  -->  Z4SS   TAU-               
      1.07878111E-01    2     -1000024        16                       # TAU1-  -->  W1SS-  NUT                
      4.53436002E-03    2     -1000037        16                       # TAU1-  -->  W2SS-  NUT                
#         PDG         Width
DECAY   1000012  6.78283081E+01   # NUEL  decays
#          BR          NDA       ID1       ID2       ID3       ID4
      3.05082709E-01    2      1000022        12                       # NUEL   -->  Z1SS   NUE                
      8.33391994E-02    2      1000023        12                       # NUEL   -->  Z2SS   NUE                
      1.08176828E-04    2      1000025        12                       # NUEL   -->  Z3SS   NUE                
      6.82385755E-04    2      1000035        12                       # NUEL   -->  Z4SS   NUE                
      6.10604644E-01    2      1000024        11                       # NUEL   -->  W1SS+  E-                 
      1.82941658E-04    2      1000037        11                       # NUEL   -->  W2SS+  E-                 
#         PDG         Width
DECAY   1000014  6.78283081E+01   # NUML  decays
#          BR          NDA       ID1       ID2       ID3       ID4
      3.05082709E-01    2      1000022        14                       # NUML   -->  Z1SS   NUM                
      8.33391994E-02    2      1000023        14                       # NUML   -->  Z2SS   NUM                
      1.08176828E-04    2      1000025        14                       # NUML   -->  Z3SS   NUM                
      6.82385755E-04    2      1000035        14                       # NUML   -->  Z4SS   NUM                
      6.10604644E-01    2      1000024        13                       # NUML   -->  W1SS+  MU-                
      1.82941658E-04    2      1000037        13                       # NUML   -->  W2SS+  MU-                
#         PDG         Width
DECAY   1000016  6.79348450E+01   # NUTL  decays
#          BR          NDA       ID1       ID2       ID3       ID4
      3.04234266E-01    2      1000022        16                       # NUTL   -->  Z1SS   NUT                
      8.30884278E-02    2      1000023        16                       # NUTL   -->  Z2SS   NUT                
      1.07773085E-04    2      1000025        16                       # NUTL   -->  Z3SS   NUT                
      6.79836608E-04    2      1000035        16                       # NUTL   -->  Z4SS   NUT                
      6.08918369E-01    2      1000024        15                       # NUTL   -->  W1SS+  TAU-               
      2.97136931E-03    2      1000037        15                       # NUTL   -->  W2SS+  TAU-               
      3.51483009E-11    3      1000015        16       -15             # NUTL   -->  TAU1-  NUT    TAU+        
      3.51483009E-11    3      1000015        12       -11             # NUTL   -->  TAU1-  NUE    E+          
      3.51483009E-11    3      1000015        14       -13             # NUTL   -->  TAU1-  NUM    MU+         
      1.05444903E-10    3      1000015         2        -1             # NUTL   -->  TAU1-  UP     DB          
      1.05444903E-10    3      1000015         4        -3             # NUTL   -->  TAU1-  CH     SB          
#         PDG         Width
DECAY   2000011  2.27786179E+01   # ER-   decays
#          BR          NDA       ID1       ID2       ID3       ID4
      2.64668614E-07    2      1000022        11                       # ER-    -->  Z1SS   E-                 
      9.98961270E-01    2      1000023        11                       # ER-    -->  Z2SS   E-                 
      4.51225606E-05    2      1000025        11                       # ER-    -->  Z3SS   E-                 
      9.93379857E-04    2      1000035        11                       # ER-    -->  Z4SS   E-                 
#         PDG         Width
DECAY   2000013  2.27786179E+01   # MUR-  decays
#          BR          NDA       ID1       ID2       ID3       ID4
      2.64668614E-07    2      1000022        13                       # MUR-   -->  Z1SS   MU-                
      9.98961270E-01    2      1000023        13                       # MUR-   -->  Z2SS   MU-                
      4.51225606E-05    2      1000025        13                       # MUR-   -->  Z3SS   MU-                
      9.93379857E-04    2      1000035        13                       # MUR-   -->  Z4SS   MU-                
#         PDG         Width
DECAY   2000015  6.48920517E+01   # TAU2- decays
#          BR          NDA       ID1       ID2       ID3       ID4
      2.96351105E-01    2      1000022        15                       # TAU2-  -->  Z1SS   TAU-               
      1.05248891E-01    2      1000023        15                       # TAU2-  -->  Z2SS   TAU-               
      1.70835282E-03    2      1000025        15                       # TAU2-  -->  Z3SS   TAU-               
      2.04896461E-03    2      1000035        15                       # TAU2-  -->  Z4SS   TAU-               
      5.92206597E-01    2     -1000024        16                       # TAU2-  -->  W1SS-  NUT                
      2.43608793E-03    2     -1000037        16                       # TAU2-  -->  W2SS-  NUT                
#         PDG         Width
DECAY   1000023  9.57671180E-03   # Z2SS  decays
#          BR          NDA       ID1       ID2       ID3       ID4
      3.82970654E-07    2      1000022        22                       # Z2SS   -->  Z1SS   GM                 
      2.28941619E-01    2      1000024       -24                       # Z2SS   -->  W1SS+  W-                 
      2.28941619E-01    2     -1000024        24                       # Z2SS   -->  W1SS-  W+                 
      3.16108055E-02    2      1000022        23                       # Z2SS   -->  Z1SS   Z0                 
      7.01922409E-06    3      1000022         2        -2             # Z2SS   -->  Z1SS   UP     UB          
      6.72406804E-06    3      1000022         1        -1             # Z2SS   -->  Z1SS   DN     DB          
      6.72406804E-06    3      1000022         3        -3             # Z2SS   -->  Z1SS   ST     SB          
      7.01922409E-06    3      1000022         4        -4             # Z2SS   -->  Z1SS   CH     CB          
      1.42996414E-05    3      1000022         5        -5             # Z2SS   -->  Z1SS   BT     BB          
      2.96534909E-05    3      1000022        11       -11             # Z2SS   -->  Z1SS   E-     E+          
      2.96534909E-05    3      1000022        13       -13             # Z2SS   -->  Z1SS   MU-    MU+         
      2.98246869E-05    3      1000022        15       -15             # Z2SS   -->  Z1SS   TAU-   TAU+        
      2.92394197E-05    3      1000022        12       -12             # Z2SS   -->  Z1SS   NUE    ANUE        
      2.92394197E-05    3      1000022        14       -14             # Z2SS   -->  Z1SS   NUM    ANUM        
      2.93825124E-05    3      1000022        16       -16             # Z2SS   -->  Z1SS   NUT    ANUT        
      5.10286868E-01    2      1000022        25                       # Z2SS   -->  Z1SS   HL0                
#         PDG         Width
DECAY   1000025  1.50857315E+01   # Z3SS  decays
#          BR          NDA       ID1       ID2       ID3       ID4
      2.85118858E-07    2      1000022        22                       # Z3SS   -->  Z1SS   GM                 
      5.40860601E-09    2      1000023        22                       # Z3SS   -->  Z2SS   GM                 
      3.09622020E-01    2      1000024       -24                       # Z3SS   -->  W1SS+  W-                 
      3.09622020E-01    2     -1000024        24                       # Z3SS   -->  W1SS-  W+                 
      2.34208941E-01    2      1000022        23                       # Z3SS   -->  Z1SS   Z0                 
      8.43948498E-02    2      1000023        23                       # Z3SS   -->  Z2SS   Z0                 
      7.63719310E-10    3      1000022         2        -2             # Z3SS   -->  Z1SS   UP     UB          
      1.03889741E-09    3      1000022         1        -1             # Z3SS   -->  Z1SS   DN     DB          
      1.03889741E-09    3      1000022         3        -3             # Z3SS   -->  Z1SS   ST     SB          
      7.63719310E-10    3      1000022         4        -4             # Z3SS   -->  Z1SS   CH     CB          
      1.56268314E-07    3      1000022         5        -5             # Z3SS   -->  Z1SS   BT     BB          
      2.58040561E-10    3      1000022        11       -11             # Z3SS   -->  Z1SS   E-     E+          
      2.58040561E-10    3      1000022        13       -13             # Z3SS   -->  Z1SS   MU-    MU+         
      2.53269050E-08    3      1000022        15       -15             # Z3SS   -->  Z1SS   TAU-   TAU+        
      6.59654165E-10    3      1000022        12       -12             # Z3SS   -->  Z1SS   NUE    ANUE        
      6.59654165E-10    3      1000022        14       -14             # Z3SS   -->  Z1SS   NUM    ANUM        
      6.63092470E-10    3      1000022        16       -16             # Z3SS   -->  Z1SS   NUT    ANUT        
      7.61897403E-12    3      1000023         2        -2             # Z3SS   -->  Z2SS   UP     UB          
      3.97017402E-12    3      1000023         1        -1             # Z3SS   -->  Z2SS   DN     DB          
      3.97017402E-12    3      1000023         3        -3             # Z3SS   -->  Z2SS   ST     SB          
      7.61897316E-12    3      1000023         4        -4             # Z3SS   -->  Z2SS   CH     CB          
      2.80088197E-09    3      1000023         5        -5             # Z3SS   -->  Z2SS   BT     BB          
      2.07533071E-11    3      1000023        11       -11             # Z3SS   -->  Z2SS   E-     E+          
      2.07533071E-11    3      1000023        13       -13             # Z3SS   -->  Z2SS   MU-    MU+         
      4.17734292E-09    3      1000023        15       -15             # Z3SS   -->  Z2SS   TAU-   TAU+        
      2.15281248E-11    3      1000023        12       -12             # Z3SS   -->  Z2SS   NUE    ANUE        
      2.15281248E-11    3      1000023        14       -14             # Z3SS   -->  Z2SS   NUM    ANUM        
      2.16440268E-11    3      1000023        16       -16             # Z3SS   -->  Z2SS   NUT    ANUT        
      5.83593026E-02    2      1000022        25                       # Z3SS   -->  Z1SS   HL0                
      3.79251642E-03    2      1000023        25                       # Z3SS   -->  Z2SS   HL0                
#         PDG         Width
DECAY   1000035  1.44542179E+01   # Z4SS  decays
#          BR          NDA       ID1       ID2       ID3       ID4
      2.98489944E-08    2      1000022        22                       # Z4SS   -->  Z1SS   GM                 
      1.84035032E-09    2      1000023        22                       # Z4SS   -->  Z2SS   GM                 
      3.57578550E-13    2      1000025        22                       # Z4SS   -->  Z3SS   GM                 
      2.80467719E-01    2      1000024       -24                       # Z4SS   -->  W1SS+  W-                 
      2.80467719E-01    2     -1000024        24                       # Z4SS   -->  W1SS-  W+                 
      6.06432743E-02    2      1000022        23                       # Z4SS   -->  Z1SS   Z0                 
      4.08400083E-03    2      1000023        23                       # Z4SS   -->  Z2SS   Z0                 
      4.31225899E-09    3      1000022         2        -2             # Z4SS   -->  Z1SS   UP     UB          
      8.90480756E-09    3      1000022         1        -1             # Z4SS   -->  Z1SS   DN     DB          
      8.90480756E-09    3      1000022         3        -3             # Z4SS   -->  Z1SS   ST     SB          
      4.31225899E-09    3      1000022         4        -4             # Z4SS   -->  Z1SS   CH     CB          
      1.80241827E-07    3      1000022         5        -5             # Z4SS   -->  Z1SS   BT     BB          
      6.61879329E-10    3      1000022        11       -11             # Z4SS   -->  Z1SS   E-     E+          
      6.61879329E-10    3      1000022        13       -13             # Z4SS   -->  Z1SS   MU-    MU+         
      2.67618177E-08    3      1000022        15       -15             # Z4SS   -->  Z1SS   TAU-   TAU+        
      7.33747374E-09    3      1000022        12       -12             # Z4SS   -->  Z1SS   NUE    ANUE        
      7.33747374E-09    3      1000022        14       -14             # Z4SS   -->  Z1SS   NUM    ANUM        
      7.37529282E-09    3      1000022        16       -16             # Z4SS   -->  Z1SS   NUT    ANUT        
      3.25885707E-10    3      1000023         2        -2             # Z4SS   -->  Z2SS   UP     UB          
      6.91449537E-11    3      1000023         1        -1             # Z4SS   -->  Z2SS   DN     DB          
      6.91449537E-11    3      1000023         3        -3             # Z4SS   -->  Z2SS   ST     SB          
      3.25885596E-10    3      1000023         4        -4             # Z4SS   -->  Z2SS   CH     CB          
      3.01261815E-09    3      1000023         5        -5             # Z4SS   -->  Z2SS   BT     BB          
      7.96585298E-10    3      1000023        11       -11             # Z4SS   -->  Z2SS   E-     E+          
      7.96585298E-10    3      1000023        13       -13             # Z4SS   -->  Z2SS   MU-    MU+         
      5.17291765E-09    3      1000023        15       -15             # Z4SS   -->  Z2SS   TAU-   TAU+        
      3.84906357E-10    3      1000023        12       -12             # Z4SS   -->  Z2SS   NUE    ANUE        
      3.84906357E-10    3      1000023        14       -14             # Z4SS   -->  Z2SS   NUM    ANUM        
      3.86962462E-10    3      1000023        16       -16             # Z4SS   -->  Z2SS   NUT    ANUT        
      1.64168592E-12    3      1000025         2        -2             # Z4SS   -->  Z3SS   UP     UB          
      2.11696654E-12    3      1000025         1        -1             # Z4SS   -->  Z3SS   DN     DB          
      2.11696654E-12    3      1000025         3        -3             # Z4SS   -->  Z3SS   ST     SB          
      4.80232716E-13    3      1000025        11       -11             # Z4SS   -->  Z3SS   E-     E+          
      4.80232716E-13    3      1000025        13       -13             # Z4SS   -->  Z3SS   MU-    MU+         
      9.55511061E-13    3      1000025        12       -12             # Z4SS   -->  Z3SS   NUE    ANUE        
      9.55511061E-13    3      1000025        14       -14             # Z4SS   -->  Z3SS   NUM    ANUM        
      9.55511061E-13    3      1000025        16       -16             # Z4SS   -->  Z3SS   NUT    ANUT        
      2.72104889E-01    2      1000022        25                       # Z4SS   -->  Z1SS   HL0                
      1.02232188E-01    2      1000023        25                       # Z4SS   -->  Z2SS   HL0                
#         PDG         Width
DECAY   1000024  4.57943916E-15   # W1SS+ decays
#          BR          NDA       ID1       ID2       ID3       ID4
      9.58244085E-01    2      1000022         0                       # W1SS+  -->  Z1SS   PI+                
      2.08779871E-02    3      1000022       -11        12             # W1SS+  -->  Z1SS   E+     NUE         
      2.08779871E-02    3      1000022       -13        14             # W1SS+  -->  Z1SS   MU+    NUM         
#         PDG         Width
DECAY   1000037  1.53012276E+01   # W2SS+ decays
#          BR          NDA       ID1       ID2       ID3       ID4
      1.03340554E-08    3      1000022         2        -1             # W2SS+  -->  Z1SS   UP     DB          
      1.03340554E-08    3      1000022         4        -3             # W2SS+  -->  Z1SS   CH     SB          
      5.02010522E-09    3      1000022       -11        12             # W2SS+  -->  Z1SS   E+     NUE         
      5.02010522E-09    3      1000022       -13        14             # W2SS+  -->  Z1SS   MU+    NUM         
      2.98957197E-08    3      1000022       -15        16             # W2SS+  -->  Z1SS   TAU+   NUT         
      3.00793916E-01    2      1000022        24                       # W2SS+  -->  Z1SS   W+                 
      7.99533495E-11    3      1000023         2        -1             # W2SS+  -->  Z2SS   UP     DB          
      7.99533495E-11    3      1000023         4        -3             # W2SS+  -->  Z2SS   CH     SB          
      3.59037744E-10    3      1000023       -11        12             # W2SS+  -->  Z2SS   E+     NUE         
      3.59037744E-10    3      1000023       -13        14             # W2SS+  -->  Z2SS   MU+    NUM         
      4.51950122E-09    3      1000023       -15        16             # W2SS+  -->  Z2SS   TAU+   NUT         
      8.78780708E-02    2      1000023        24                       # W2SS+  -->  Z2SS   W+                 
      6.83695045E-11    3      1000025         2        -1             # W2SS+  -->  Z3SS   UP     DB          
      6.83695045E-11    3      1000025         4        -3             # W2SS+  -->  Z3SS   CH     SB          
      2.27898343E-11    3      1000025       -11        12             # W2SS+  -->  Z3SS   E+     NUE         
      2.27898343E-11    3      1000025       -13        14             # W2SS+  -->  Z3SS   MU+    NUM         
      2.27898776E-11    3      1000025       -15        16             # W2SS+  -->  Z3SS   TAU+   NUT         
      8.81098525E-13    3      1000035         2        -1             # W2SS+  -->  Z4SS   UP     DB          
      2.93699472E-13    3      1000035       -11        12             # W2SS+  -->  Z4SS   E+     NUE         
      2.93699472E-13    3      1000035       -13        14             # W2SS+  -->  Z4SS   MU+    NUM         
      2.93700096E-13    3      1000035       -15        16             # W2SS+  -->  Z4SS   TAU+   NUT         
      2.96456367E-01    2      1000024        23                       # W2SS+  -->  W1SS+  Z0                 
      3.08223091E-09    3      1000024         1        -1             # W2SS+  -->  W1SS+  DN     DB          
      3.08223091E-09    3      1000024         3        -3             # W2SS+  -->  W1SS+  ST     SB          
      2.17020730E-08    3      1000024         2        -2             # W2SS+  -->  W1SS+  UP     UB          
      2.17020730E-08    3      1000024         4        -4             # W2SS+  -->  W1SS+  CH     CB          
      1.05356177E-08    3      1000024        12       -12             # W2SS+  -->  W1SS+  NUE    ANUE        
      1.05356177E-08    3      1000024        14       -14             # W2SS+  -->  W1SS+  NUM    ANUM        
      1.06771338E-08    3      1000024        16       -16             # W2SS+  -->  W1SS+  NUT    ANUT        
      1.49433144E-09    3      1000024        11       -11             # W2SS+  -->  W1SS+  E-     E+          
      1.49433144E-09    3      1000024        13       -13             # W2SS+  -->  W1SS+  MU-    MU+         
      1.50206791E-09    3      1000024        15       -15             # W2SS+  -->  W1SS+  TAU-   TAU+        
      3.14871550E-01    2      1000024        25                       # W2SS+  -->  W1SS+  HL0                
#         PDG         Width
DECAY        25  4.09193523E-03   # HL0   decays
#          BR          NDA       ID1       ID2       ID3       ID4
      4.80766849E-09    2           11       -11                       # HL0    -->  E-     E+                 
      2.02987430E-04    2           13       -13                       # HL0    -->  MU-    MU+                
      5.80565929E-02    2           15       -15                       # HL0    -->  TAU-   TAU+               
      6.03365788E-06    2            1        -1                       # HL0    -->  DN     DB                 
      2.43790005E-03    2            3        -3                       # HL0    -->  ST     SB                 
      7.98606217E-01    2            5        -5                       # HL0    -->  BT     BB                 
      1.92771836E-06    2            2        -2                       # HL0    -->  UP     UB                 
      3.62602919E-02    2            4        -4                       # HL0    -->  CH     CB                 
      1.86337763E-03    2           22        22                       # HL0    -->  GM     GM                 
      3.99664342E-02    2           21        21                       # HL0    -->  GL     GL                 
      3.23013472E-03    3           24        11       -12             # HL0    -->  W+     E-     ANUE        
      3.23013472E-03    3           24        13       -14             # HL0    -->  W+     MU-    ANUM        
      3.23013472E-03    3           24        15       -16             # HL0    -->  W+     TAU-   ANUT        
      9.69040394E-03    3           24        -2         1             # HL0    -->  W+     UB     DN          
      9.69040394E-03    3           24        -4         3             # HL0    -->  W+     CB     ST          
      3.23013472E-03    3          -24       -11        12             # HL0    -->  W-     E+     NUE         
      3.23013472E-03    3          -24       -13        14             # HL0    -->  W-     MU+    NUM         
      3.23013472E-03    3          -24       -15        16             # HL0    -->  W-     TAU+   NUT         
      9.69040394E-03    3          -24         2        -1             # HL0    -->  W-     UP     DB          
      9.69040394E-03    3          -24         4        -3             # HL0    -->  W-     CH     SB          
      3.04729154E-04    3           23        12       -12             # HL0    -->  Z0     NUE    ANUE        
      3.04729154E-04    3           23        14       -14             # HL0    -->  Z0     NUM    ANUM        
      3.04729154E-04    3           23        16       -16             # HL0    -->  Z0     NUT    ANUT        
      1.53367131E-04    3           23        11       -11             # HL0    -->  Z0     E-     E+          
      1.53367131E-04    3           23        13       -13             # HL0    -->  Z0     MU-    MU+         
      1.53367131E-04    3           23        15       -15             # HL0    -->  Z0     TAU-   TAU+        
      5.25422744E-04    3           23         2        -2             # HL0    -->  Z0     UP     UB          
      5.25422744E-04    3           23         4        -4             # HL0    -->  Z0     CH     CB          
      6.76873955E-04    3           23         1        -1             # HL0    -->  Z0     DN     DB          
      6.76873955E-04    3           23         3        -3             # HL0    -->  Z0     ST     SB          
      6.76873955E-04    3           23         5        -5             # HL0    -->  Z0     BT     BB          
#         PDG         Width
DECAY        35  6.73907471E+01   # HH0   decays
#          BR          NDA       ID1       ID2       ID3       ID4
      3.46137868E-10    2           11       -11                       # HH0    -->  E-     E+                 
      1.46145649E-05    2           13       -13                       # HH0    -->  MU-    MU+                
      4.18583304E-03    2           15       -15                       # HH0    -->  TAU-   TAU+               
      4.18943756E-07    2            1        -1                       # HH0    -->  DN     DB                 
      1.69274499E-04    2            3        -3                       # HH0    -->  ST     SB                 
      2.10005976E-02    2            5        -5                       # HH0    -->  BT     BB                 
      2.14794973E-10    2            2        -2                       # HH0    -->  UP     UB                 
      2.51543520E-06    2            4        -4                       # HH0    -->  CH     CB                 
      1.31987691E-01    2            6        -6                       # HH0    -->  TP     TB                 
      2.04100488E-07    2           22        22                       # HH0    -->  GM     GM                 
      1.46898410E-05    2           21        21                       # HH0    -->  GL     GL                 
      1.61736061E-05    2           24       -24                       # HH0    -->  W+     W-                 
      8.29866531E-06    2           23        23                       # HH0    -->  Z0     Z0                 
      8.53865931E-04    2      1000022   1000022                       # HH0    -->  Z1SS   Z1SS               
      6.40845858E-04    2      1000022   1000023                       # HH0    -->  Z1SS   Z2SS               
      1.82878822E-01    2      1000022   1000025                       # HH0    -->  Z1SS   Z3SS               
      7.19728395E-02    2      1000022   1000035                       # HH0    -->  Z1SS   Z4SS               
      1.09012966E-04    2      1000023   1000023                       # HH0    -->  Z2SS   Z2SS               
      5.54168746E-02    2      1000023   1000025                       # HH0    -->  Z2SS   Z3SS               
      1.67253148E-02    2      1000023   1000035                       # HH0    -->  Z2SS   Z4SS               
      7.10760505E-05    2      1000025   1000025                       # HH0    -->  Z3SS   Z3SS               
      8.10932950E-04    2      1000025   1000035                       # HH0    -->  Z3SS   Z4SS               
      1.97679095E-04    2      1000035   1000035                       # HH0    -->  Z4SS   Z4SS               
      1.67592266E-03    2      1000024  -1000024                       # HH0    -->  W1SS+  W1SS-              
      1.80676398E-05    2      1000037  -1000037                       # HH0    -->  W2SS+  W2SS-              
      2.55582154E-01    2      1000024  -1000037                       # HH0    -->  W1SS+  W2SS-              
      2.55582154E-01    2     -1000024   1000037                       # HH0    -->  W1SS-  W2SS+              
      6.41157239E-05    2           25        25                       # HH0    -->  HL0    HL0                
#         PDG         Width
DECAY        36  6.67215500E+01   # HA0   decays
#          BR          NDA       ID1       ID2       ID3       ID4
      3.47335660E-10    2           11       -11                       # HA0    -->  E-     E+                 
      1.46651391E-05    2           13       -13                       # HA0    -->  MU-    MU+                
      4.20031976E-03    2           15       -15                       # HA0    -->  TAU-   TAU+               
      4.20410345E-07    2            1        -1                       # HA0    -->  DN     DB                 
      1.69867068E-04    2            3        -3                       # HA0    -->  ST     SB                 
      2.10741404E-02    2            5        -5                       # HA0    -->  BT     BB                 
      2.15227988E-10    2            2        -2                       # HA0    -->  UP     UB                 
      2.52217524E-06    2            4        -4                       # HA0    -->  CH     CB                 
      1.32707641E-01    2            6        -6                       # HA0    -->  TP     TB                 
      1.05158456E-07    2           22        22                       # HA0    -->  GM     GM                 
      1.68634815E-05    2           21        21                       # HA0    -->  GL     GL                 
      1.14002300E-03    2      1000022   1000022                       # HA0    -->  Z1SS   Z1SS               
      1.03088166E-03    2      1000022   1000023                       # HA0    -->  Z1SS   Z2SS               
      7.24179745E-02    2      1000022   1000025                       # HA0    -->  Z1SS   Z3SS               
      1.81529820E-01    2      1000022   1000035                       # HA0    -->  Z1SS   Z4SS               
      2.20612783E-04    2      1000023   1000023                       # HA0    -->  Z2SS   Z2SS               
      1.67695265E-02    2      1000023   1000025                       # HA0    -->  Z2SS   Z3SS               
      5.48746921E-02    2      1000023   1000035                       # HA0    -->  Z2SS   Z4SS               
      7.10003587E-05    2      1000025   1000025                       # HA0    -->  Z3SS   Z3SS               
      2.47823511E-04    2      1000025   1000035                       # HA0    -->  Z3SS   Z4SS               
      1.00523210E-03    2      1000035   1000035                       # HA0    -->  Z4SS   Z4SS               
      2.31037661E-03    2      1000024  -1000024                       # HA0    -->  W1SS+  W1SS-              
      4.39311960E-04    2      1000037  -1000037                       # HA0    -->  W2SS+  W2SS-              
      2.54869968E-01    2      1000024  -1000037                       # HA0    -->  W1SS+  W2SS-              
      2.54869968E-01    2     -1000024   1000037                       # HA0    -->  W1SS-  W2SS+              
      1.62132383E-05    2           25        23                       # HA0    -->  HL0    Z0                 
#         PDG         Width
DECAY        37  6.66650925E+01   # H+    decays
#          BR          NDA       ID1       ID2       ID3       ID4
      3.49953649E-10    2           12       -11                       # H+     -->  NUE    E+                 
      1.47756746E-05    2           14       -13                       # H+     -->  NUM    MU+                
      4.23197867E-03    2           16       -15                       # H+     -->  NUT    TAU+               
      3.94259956E-07    2            2        -1                       # H+     -->  UP     DB                 
      1.61581949E-04    2            4        -3                       # H+     -->  CH     SB                 
      1.43887281E-01    2            6        -5                       # H+     -->  TP     BB                 
      6.29509529E-08    2      1000024   1000022                       # H+     -->  W1SS+  Z1SS               
      1.69547705E-03    2      1000024   1000023                       # H+     -->  W1SS+  Z2SS               
      2.58746177E-01    2      1000024   1000025                       # H+     -->  W1SS+  Z3SS               
      2.57963240E-01    2      1000024   1000035                       # H+     -->  W1SS+  Z4SS               
      2.59216309E-01    2      1000037   1000022                       # H+     -->  W2SS+  Z1SS               
      7.35192671E-02    2      1000037   1000023                       # H+     -->  W2SS+  Z2SS               
      3.12344288E-04    2      1000037   1000025                       # H+     -->  W2SS+  Z3SS               
      2.34702267E-04    2      1000037   1000035                       # H+     -->  W2SS+  Z4SS               
      1.63423665E-05    2           25        24                       # H+     -->  HL0    W+                 
