#
#                              ======================
#                              | THE SUSYHIT OUTPUT |
#                              ======================
#
#
#              ------------------------------------------------------
#              |     This is the output of the SUSY-HIT package     |
#              |  created by A.Djouadi, M.Muehlleitner and M.Spira. |
#              |  In case of problems with SUSY-HIT email to        |
#              |           margarete.muehlleitner@cern.ch           |
#              |           michael.spira@psi.ch                     |
#              |           abdelhak.djouadi@cern.ch                 |
#              ------------------------------------------------------
#
#              ------------------------------------------------------
#              |  SUSY Les Houches Accord - MSSM Spectrum + Decays  |
#              |              based on the decay programs           |
#              |                                                    |
#              |                     SDECAY 1.3b                    |
#              |                                                    |
#              |  Authors: M.Muhlleitner, A.Djouadi and Y.Mambrini  |
#              |  Ref.:    Comput.Phys.Commun.168(2005)46           |
#              |           [hep-ph/0311167]                         |
#              |                                                    |
#              |                     HDECAY 3.4                     |
#              |                                                    |
#              |  By: A.Djouadi,J.Kalinowski,M.Muhlleitner,M.Spira  |
#              |  Ref.:    Comput.Phys.Commun.108(1998)56           |
#              |           [hep-ph/9704448]                         |
#              |                                                    |
#              |                                                    |
#              |  If not stated otherwise all DRbar couplings and   |
#              |  soft SUSY breaking masses are given at the scale  |
#              |  Q=  0.50006944E+04
#              |                                                    |
#              ------------------------------------------------------
#
#
BLOCK DCINFO  # Decay Program information
     1   SDECAY/HDECAY # decay calculator
     2   1.3b  /3.4    # version number
#
BLOCK SPINFO  # Spectrum calculator information
     1    SOFTSUSY    # spectrum calculator                
     2    3.4.0       # version number                     
#
BLOCK MODSEL  # Model selection
     1     0   #  nonUniversal                                     
#
BLOCK SMINPUTS  # Standard Model inputs
         1     1.25778332E+02   # alpha_em^-1(M_Z)^MSbar
         2     1.16570000E-05   # G_F [GeV^-2]
         3     1.17200002E-01   # alpha_S(M_Z)^MSbar
         4     9.11876000E+01   # M_Z pole mass
         5     4.25000000E+00   # mb(mb)^MSbar
         6     1.72500000E+02   # mt pole mass
         7     1.77682000E+00   # mtau pole mass
#
BLOCK MINPAR  # Input parameters - minimal models
         3     1.00000000E+01   # tanb                
#
BLOCK EXTPAR  # Input parameters - non-minimal models
         0    -1.00000000E+00   # Set                 
         1     6.00000000E+01   # M_1(MX)             
         2     3.00000000E+03   # M_2(MX)             
         3     7.73147000E+02   # M_3(MX)             
        11     5.00000000E+03   # At(MX)              
        12     5.00000000E+03   # Ab(MX)              
        13     0.00000000E+00   # Atau(MX)            
        23    -1.74139900E+03   # mu(MX)              
        26     3.00000000E+03   # mA(pole)            
        31     5.00000000E+03   # meL(MX)             
        32     5.00000000E+03   # mmuL(MX)            
        33     5.00000000E+03   # mtauL(MX)           
        34     5.00000000E+03   # meR(MX)             
        35     5.00000000E+03   # mmuR(MX)            
        36     5.00000000E+03   # mtauR(MX)           
        41     5.00000000E+03   # mqL1(MX)            
        42     5.00000000E+03   # mqL2(MX)            
        43     5.00000000E+03   # mqL3(MX)            
        44     5.00000000E+03   # muR(MX)             
        45     5.00000000E+03   # mcR(MX)             
        46     5.00000000E+03   # mtR(MX)             
        47     5.00000000E+03   # mdR(MX)             
        48     5.00000000E+03   # msR(MX)             
        49     5.00000000E+03   # mbR(MX)             
#
BLOCK MASS  # Mass Spectrum
# PDG code           mass       particle
        24     8.00942266E+01   # W+
        25     1.24312516E+02   # h
        35     3.00007816E+03   # H
        36     2.99999995E+03   # A
        37     3.00087435E+03   # H+
         5     4.87878001E+00   # b-quark pole mass calculated from mb(mb)_Msbar
   1000001     5.06374985E+03   # ~d_L
   2000001     5.04595110E+03   # ~d_R
   1000002     5.06327277E+03   # ~u_L
   2000002     5.04568001E+03   # ~u_R
   1000003     5.06374985E+03   # ~s_L
   2000003     5.04595110E+03   # ~s_R
   1000004     5.06327277E+03   # ~c_L
   2000004     5.04568001E+03   # ~c_R
   1000005     5.01078401E+03   # ~b_1
   2000005     5.04512795E+03   # ~b_2
   1000006     4.90206813E+03   # ~t_1
   2000006     5.05858513E+03   # ~t_2
   1000011     5.01904219E+03   # ~e_L
   2000011     5.00590470E+03   # ~e_R
   1000012     5.01809368E+03   # ~nu_eL
   1000013     5.01904219E+03   # ~mu_L
   2000013     5.00590470E+03   # ~mu_R
   1000014     5.01809368E+03   # ~nu_muL
   1000015     5.00419007E+03   # ~tau_1
   2000015     5.01919381E+03   # ~tau_2
   1000016     5.01756053E+03   # ~nu_tauL
   1000021     1.00000073E+03   # ~g
   1000022     6.03007253E+01   # ~chi_10
   1000023     1.79939822E+03   # ~chi_20
   1000025    -1.80212188E+03   # ~chi_30
   1000035     3.07439080E+03   # ~chi_40
   1000024     1.80000010E+03   # ~chi_1+
   1000037     3.07455854E+03   # ~chi_2+
#
BLOCK NMIX  # Neutralino Mixing Matrix
  1  1     9.99690934E-01   # N_11
  1  2     1.21464403E-04   # N_12
  1  3    -2.47968647E-02   # N_13
  1  4     1.77106847E-03   # N_14
  2  1     1.62768563E-02   # N_21
  2  2     3.81741230E-02   # N_22
  2  3     7.06828545E-01   # N_23
  2  4     7.06166559E-01   # N_24
  3  1    -1.87840438E-02   # N_31
  3  2     1.24413568E-02   # N_32
  3  3    -7.06715800E-01   # N_33
  3  4     7.07138707E-01   # N_34
  4  1    -5.09493419E-04   # N_41
  4  2     9.99193642E-01   # N_42
  4  3    -1.82017216E-02   # N_43
  4  4    -3.57841240E-02   # N_44
#
BLOCK UMIX  # Chargino Mixing Matrix U
  1  1     2.57228885E-02   # U_11
  1  2     9.99669112E-01   # U_12
  2  1    -9.99669112E-01   # U_21
  2  2     2.57228885E-02   # U_22
#
BLOCK VMIX  # Chargino Mixing Matrix V
  1  1     5.05926903E-02   # V_11
  1  2    -9.98719370E-01   # V_12
  2  1    -9.98719370E-01   # V_21
  2  2    -5.05926903E-02   # V_22
#
BLOCK STOPMIX  # Stop Mixing Matrix
  1  1    -5.17373955E-01   # cos(theta_t)
  1  2     8.55759423E-01   # sin(theta_t)
  2  1    -8.55759423E-01   # -sin(theta_t)
  2  2    -5.17373955E-01   # cos(theta_t)
#
BLOCK SBOTMIX  # Sbottom Mixing Matrix
  1  1     9.92280118E-01   # cos(theta_b)
  1  2    -1.24016803E-01   # sin(theta_b)
  2  1     1.24016803E-01   # -sin(theta_b)
  2  2     9.92280118E-01   # cos(theta_b)
#
BLOCK STAUMIX  # Stau Mixing Matrix
  1  1    -1.99007809E-01   # cos(theta_tau)
  1  2     9.79997904E-01   # sin(theta_tau)
  2  1    -9.79997904E-01   # -sin(theta_tau)
  2  2    -1.99007809E-01   # cos(theta_tau)
#
BLOCK ALPHA  # Higgs mixing
          -1.05408852E-01   # Mixing angle in the neutral Higgs boson sector
#
BLOCK HMIX Q=  5.00069436E+03  # DRbar Higgs Parameters
         1    -1.77238736E+03   # mu(Q)MSSM           
         2     9.47501387E+00   # tan                 
         3     2.42089699E+02   # higgs               
         4     8.34183778E+06   # mA^2(Q)MSSM         
#
BLOCK GAUGE Q=  5.00069436E+03  # The gauge couplings
     1     3.70678661E-01   # gprime(Q) DRbar
     2     6.31931054E-01   # g(Q) DRbar
     3     1.00863446E+00   # g3(Q) DRbar
#
BLOCK AU Q=  5.00069436E+03  # The trilinear couplings
  1  1     5.00000001E+03   # A_u(Q) DRbar
  2  2     5.00000001E+03   # A_c(Q) DRbar
  3  3     5.00000001E+03   # A_t(Q) DRbar
#
BLOCK AD Q=  5.00069436E+03  # The trilinear couplings
  1  1     5.00000000E+03   # A_d(Q) DRbar
  2  2     5.00000000E+03   # A_s(Q) DRbar
  3  3     5.00000001E+03   # A_b(Q) DRbar
#
BLOCK AE Q=  5.00069436E+03  # The trilinear couplings
  1  1     0.00000000E+00   # A_e(Q) DRbar
  2  2     1.73027260E-08   # A_mu(Q) DRbar
  3  3     1.63313475E-08   # A_tau(Q) DRbar
#
BLOCK Yu Q=  5.00069436E+03  # The Yukawa couplings
  1  1     0.00000000E+00   # y_u(Q) DRbar
  2  2     0.00000000E+00   # y_c(Q) DRbar
  3  3     8.13651680E-01   # y_t(Q) DRbar
#
BLOCK Yd Q=  5.00069436E+03  # The Yukawa couplings
  1  1     0.00000000E+00   # y_d(Q) DRbar
  2  2     0.00000000E+00   # y_s(Q) DRbar
  3  3     1.29936602E-01   # y_b(Q) DRbar
#
BLOCK Ye Q=  5.00069436E+03  # The Yukawa couplings
  1  1     0.00000000E+00   # y_e(Q) DRbar
  2  2     0.00000000E+00   # y_mu(Q) DRbar
  3  3     9.65360492E-02   # y_tau(Q) DRbar
#
BLOCK MSOFT Q=  5.00069436E+03  # The soft SUSY breaking masses at the scale Q
         1     6.00000000E+01   # M_1(Q)              
         2     3.00000000E+03   # M_2(Q)              
         3     7.73147000E+02   # M_3(Q)              
        21     5.51176334E+06   # mH1^2(Q)            
        22    -2.60860698E+06   # mH2^2(Q)            
        31     5.00000000E+03   # meL(Q)              
        32     5.00000000E+03   # mmuL(Q)             
        33     5.00000000E+03   # mtauL(Q)            
        34     5.00000000E+03   # meR(Q)              
        35     5.00000000E+03   # mmuR(Q)             
        36     5.00000000E+03   # mtauR(Q)            
        41     5.00000000E+03   # mqL1(Q)             
        42     5.00000000E+03   # mqL2(Q)             
        43     5.00000000E+03   # mqL3(Q)             
        44     5.00000000E+03   # muR(Q)              
        45     5.00000000E+03   # mcR(Q)              
        46     5.00000000E+03   # mtR(Q)              
        47     5.00000000E+03   # mdR(Q)              
        48     5.00000000E+03   # msR(Q)              
        49     5.00000000E+03   # mbR(Q)              
#
#
#
#                             =================
#                             |The decay table|
#                             =================
#
# - The QCD corrections to the decays gluino -> squark  + quark
#                                     squark -> gaugino + quark_prime
#                                     squark -> squark_prime + Higgs
#                                     squark -> gluino  + quark
#   are included.
#
# - The multi-body decays for the inos, stops and sbottoms are included.
#
# - The loop induced decays for the gluino, neutralinos and stops
#   are included.
#
# - The SUSY decays of the top quark are included.
#
#
#         PDG            Width
DECAY         6     1.39944558E+00   # top decays
#          BR         NDA      ID1       ID2
     1.00000000E+00    2           5        24   # BR(t ->  b    W+)
#
#         PDG            Width
DECAY   1000021     8.40583600E-06   # gluino decays
#          BR         NDA      ID1       ID2
     2.03557743E-05    2     1000022        21   # BR(~g -> ~chi_10 g)
#           BR         NDA      ID1       ID2       ID3
     8.31443365E-02    3     1000022         1        -1   # BR(~g -> ~chi_10 d  db)
     2.83413833E-01    3     1000022         2        -2   # BR(~g -> ~chi_10 u  ub)
     8.31443365E-02    3     1000022         3        -3   # BR(~g -> ~chi_10 s  sb)
     2.83413833E-01    3     1000022         4        -4   # BR(~g -> ~chi_10 c  cb)
     8.40936804E-02    3     1000022         5        -5   # BR(~g -> ~chi_10 b  bb)
     1.82769625E-01    3     1000022         6        -6   # BR(~g -> ~chi_10 t  tb)
#
#         PDG            Width
DECAY   1000006     3.96069756E+02   # stop1 decays
#          BR         NDA      ID1       ID2
     2.19962246E-02    2     1000022         6   # BR(~t_1 -> ~chi_10 t )
     6.16696348E-02    2     1000023         6   # BR(~t_1 -> ~chi_20 t )
     5.91560511E-02    2     1000025         6   # BR(~t_1 -> ~chi_30 t )
     5.76869774E-03    2     1000035         6   # BR(~t_1 -> ~chi_40 t )
     8.72469392E-02    2     1000024         5   # BR(~t_1 -> ~chi_1+ b )
     1.14525779E-02    2     1000037         5   # BR(~t_1 -> ~chi_2+ b )
     7.52709875E-01    2     1000021         6   # BR(~t_1 -> ~g      t )
#
#         PDG            Width
DECAY   2000006     4.03360323E+02   # stop2 decays
#          BR         NDA      ID1       ID2
     9.09244123E-03    2     1000022         6   # BR(~t_2 -> ~chi_10 t )
     6.32841061E-02    2     1000023         6   # BR(~t_2 -> ~chi_20 t )
     6.59698160E-02    2     1000025         6   # BR(~t_2 -> ~chi_30 t )
     1.31576121E-02    2     1000035         6   # BR(~t_2 -> ~chi_40 t )
     4.04717545E-02    2     1000024         5   # BR(~t_2 -> ~chi_1+ b )
     2.60684612E-02    2     1000037         5   # BR(~t_2 -> ~chi_2+ b )
     7.78627735E-01    2     1000021         6   # BR(~t_2 -> ~g      t )
     7.08701779E-04    2     1000006        25   # BR(~t_2 -> ~t_1    h )
     2.61937251E-03    2     1000006        23   # BR(~t_2 -> ~t_1    Z )
#
#         PDG            Width
DECAY   1000005     3.83213195E+02   # sbottom1 decays
#          BR         NDA      ID1       ID2
     2.06891899E-03    2     1000022         5   # BR(~b_1 -> ~chi_10 b )
     1.78602952E-03    2     1000023         5   # BR(~b_1 -> ~chi_20 b )
     1.64498283E-03    2     1000025         5   # BR(~b_1 -> ~chi_30 b )
     1.92943843E-02    2     1000035         5   # BR(~b_1 -> ~chi_40 b )
     1.29505262E-01    2    -1000024         6   # BR(~b_1 -> ~chi_1- t )
     3.89209766E-02    2    -1000037         6   # BR(~b_1 -> ~chi_2- t )
     8.05340166E-01    2     1000021         5   # BR(~b_1 -> ~g      b )
     1.43927972E-03    2     1000006       -24   # BR(~b_1 -> ~t_1    W-)
#
#         PDG            Width
DECAY   2000005     3.17542241E+02   # sbottom2 decays
#          BR         NDA      ID1       ID2
     9.20279001E-03    2     1000022         5   # BR(~b_2 -> ~chi_10 b )
     1.98761683E-03    2     1000023         5   # BR(~b_2 -> ~chi_20 b )
     2.11013342E-03    2     1000025         5   # BR(~b_2 -> ~chi_30 b )
     3.98932619E-04    2     1000035         5   # BR(~b_2 -> ~chi_40 b )
     6.49355669E-03    2    -1000024         6   # BR(~b_2 -> ~chi_1- t )
     8.04070739E-04    2    -1000037         6   # BR(~b_2 -> ~chi_2- t )
     9.78890272E-01    2     1000021         5   # BR(~b_2 -> ~g      b )
     1.12627367E-04    2     1000006       -24   # BR(~b_2 -> ~t_1    W-)
#
#         PDG            Width
DECAY   1000002     3.36227710E+02   # sup_L decays
#          BR         NDA      ID1       ID2
     2.22314985E-03    2     1000022         2   # BR(~u_L -> ~chi_10 u)
     7.58666824E-05    2     1000023         2   # BR(~u_L -> ~chi_20 u)
     3.40750114E-06    2     1000025         2   # BR(~u_L -> ~chi_30 u)
     2.31455976E-02    2     1000035         2   # BR(~u_L -> ~chi_40 u)
     2.27028819E-04    2     1000024         1   # BR(~u_L -> ~chi_1+ d)
     4.62506186E-02    2     1000037         1   # BR(~u_L -> ~chi_2+ d)
     9.28074331E-01    2     1000021         2   # BR(~u_L -> ~g      u)
#
#         PDG            Width
DECAY   2000002     3.22692648E+02   # sup_R decays
#          BR         NDA      ID1       ID2
     3.68873511E-02    2     1000022         2   # BR(~u_R -> ~chi_10 u)
     7.44881993E-06    2     1000023         2   # BR(~u_R -> ~chi_20 u)
     9.91152375E-06    2     1000025         2   # BR(~u_R -> ~chi_30 u)
     3.79200420E-09    2     1000035         2   # BR(~u_R -> ~chi_40 u)
     9.63095285E-01    2     1000021         2   # BR(~u_R -> ~g      u)
#
#         PDG            Width
DECAY   1000001     3.36238992E+02   # sdown_L decays
#          BR         NDA      ID1       ID2
     2.21776594E-03    2     1000022         1   # BR(~d_L -> ~chi_10 d)
     5.43170583E-05    2     1000023         1   # BR(~d_L -> ~chi_20 d)
     1.15091451E-05    2     1000025         1   # BR(~d_L -> ~chi_30 d)
     2.31613017E-02    2     1000035         1   # BR(~d_L -> ~chi_40 d)
     5.86941723E-05    2    -1000024         2   # BR(~d_L -> ~chi_1- u)
     4.63515788E-02    2    -1000037         2   # BR(~d_L -> ~chi_2- u)
     9.28144833E-01    2     1000021         1   # BR(~d_L -> ~g      d)
#
#         PDG            Width
DECAY   2000001     3.13780577E+02   # sdown_R decays
#          BR         NDA      ID1       ID2
     9.48426968E-03    2     1000022         1   # BR(~d_R -> ~chi_10 d)
     1.91525876E-06    2     1000023         1   # BR(~d_R -> ~chi_20 d)
     2.54847545E-06    2     1000025         1   # BR(~d_R -> ~chi_30 d)
     9.75101782E-10    2     1000035         1   # BR(~d_R -> ~chi_40 d)
     9.90511266E-01    2     1000021         1   # BR(~d_R -> ~g      d)
#
#         PDG            Width
DECAY   1000004     3.36227710E+02   # scharm_L decays
#          BR         NDA      ID1       ID2
     2.22314985E-03    2     1000022         4   # BR(~c_L -> ~chi_10 c)
     7.58666824E-05    2     1000023         4   # BR(~c_L -> ~chi_20 c)
     3.40750114E-06    2     1000025         4   # BR(~c_L -> ~chi_30 c)
     2.31455976E-02    2     1000035         4   # BR(~c_L -> ~chi_40 c)
     2.27028819E-04    2     1000024         3   # BR(~c_L -> ~chi_1+ s)
     4.62506186E-02    2     1000037         3   # BR(~c_L -> ~chi_2+ s)
     9.28074331E-01    2     1000021         4   # BR(~c_L -> ~g      c)
#
#         PDG            Width
DECAY   2000004     3.22692648E+02   # scharm_R decays
#          BR         NDA      ID1       ID2
     3.68873511E-02    2     1000022         4   # BR(~c_R -> ~chi_10 c)
     7.44881993E-06    2     1000023         4   # BR(~c_R -> ~chi_20 c)
     9.91152375E-06    2     1000025         4   # BR(~c_R -> ~chi_30 c)
     3.79200420E-09    2     1000035         4   # BR(~c_R -> ~chi_40 c)
     9.63095285E-01    2     1000021         4   # BR(~c_R -> ~g      c)
#
#         PDG            Width
DECAY   1000003     3.36238992E+02   # sstrange_L decays
#          BR         NDA      ID1       ID2
     2.21776594E-03    2     1000022         3   # BR(~s_L -> ~chi_10 s)
     5.43170583E-05    2     1000023         3   # BR(~s_L -> ~chi_20 s)
     1.15091451E-05    2     1000025         3   # BR(~s_L -> ~chi_30 s)
     2.31613017E-02    2     1000035         3   # BR(~s_L -> ~chi_40 s)
     5.86941723E-05    2    -1000024         4   # BR(~s_L -> ~chi_1- c)
     4.63515788E-02    2    -1000037         4   # BR(~s_L -> ~chi_2- c)
     9.28144833E-01    2     1000021         3   # BR(~s_L -> ~g      s)
#
#         PDG            Width
DECAY   2000003     3.13780577E+02   # sstrange_R decays
#          BR         NDA      ID1       ID2
     9.48426968E-03    2     1000022         3   # BR(~s_R -> ~chi_10 s)
     1.91525876E-06    2     1000023         3   # BR(~s_R -> ~chi_20 s)
     2.54847545E-06    2     1000025         3   # BR(~s_R -> ~chi_30 s)
     9.75101782E-10    2     1000035         3   # BR(~s_R -> ~chi_40 s)
     9.90511266E-01    2     1000021         3   # BR(~s_R -> ~g      s)
#
#         PDG            Width
DECAY   1000011     3.02293835E+01   # selectron_L decays
#          BR         NDA      ID1       ID2
     2.26815586E-01    2     1000022        11   # BR(~e_L -> ~chi_10 e-)
     1.14068945E-03    2     1000023        11   # BR(~e_L -> ~chi_20 e-)
     1.01333447E-06    2     1000025        11   # BR(~e_L -> ~chi_30 e-)
     2.56883537E-01    2     1000035        11   # BR(~e_L -> ~chi_40 e-)
     6.62700442E-04    2    -1000024        12   # BR(~e_L -> ~chi_1- nu_e)
     5.14496473E-01    2    -1000037        12   # BR(~e_L -> ~chi_2- nu_e)
#
#         PDG            Width
DECAY   2000011     2.73556395E+01   # selectron_R decays
#          BR         NDA      ID1       ID2
     9.99531487E-01    2     1000022        11   # BR(~e_R -> ~chi_10 e-)
     2.00983744E-04    2     1000023        11   # BR(~e_R -> ~chi_20 e-)
     2.67428393E-04    2     1000025        11   # BR(~e_R -> ~chi_30 e-)
     1.00736771E-07    2     1000035        11   # BR(~e_R -> ~chi_40 e-)
#
#         PDG            Width
DECAY   1000013     3.02293835E+01   # smuon_L decays
#          BR         NDA      ID1       ID2
     2.26815586E-01    2     1000022        13   # BR(~mu_L -> ~chi_10 mu-)
     1.14068945E-03    2     1000023        13   # BR(~mu_L -> ~chi_20 mu-)
     1.01333447E-06    2     1000025        13   # BR(~mu_L -> ~chi_30 mu-)
     2.56883537E-01    2     1000035        13   # BR(~mu_L -> ~chi_40 mu-)
     6.62700442E-04    2    -1000024        14   # BR(~mu_L -> ~chi_1- nu_mu)
     5.14496473E-01    2    -1000037        14   # BR(~mu_L -> ~chi_2- nu_mu)
#
#         PDG            Width
DECAY   2000013     2.73556395E+01   # smuon_R decays
#          BR         NDA      ID1       ID2
     9.99531487E-01    2     1000022        13   # BR(~mu_R -> ~chi_10 mu-)
     2.00983744E-04    2     1000023        13   # BR(~mu_R -> ~chi_20 mu-)
     2.67428393E-04    2     1000025        13   # BR(~mu_R -> ~chi_30 mu-)
     1.00736771E-07    2     1000035        13   # BR(~mu_R -> ~chi_40 mu-)
#
#         PDG            Width
DECAY   1000015     2.88682859E+01   # stau_1 decays
#          BR         NDA      ID1       ID2
     9.19574561E-01    2     1000022        15   # BR(~tau_1 -> ~chi_10  tau-)
     1.32933534E-02    2     1000023        15   # BR(~tau_1 -> ~chi_20  tau-)
     1.16721892E-02    2     1000025        15   # BR(~tau_1 -> ~chi_30  tau-)
     1.01411512E-02    2     1000035        15   # BR(~tau_1 -> ~chi_40  tau-)
     2.50064614E-02    2    -1000024        16   # BR(~tau_1 -> ~chi_1-  nu_tau)
     2.03122837E-02    2    -1000037        16   # BR(~tau_1 -> ~chi_2-  nu_tau)
#
#         PDG            Width
DECAY   2000015     3.08157154E+01   # stau_2 decays
#          BR         NDA      ID1       ID2
     2.48156181E-01    2     1000022        15   # BR(~tau_2 -> ~chi_10  tau-)
     1.17027185E-02    2     1000023        15   # BR(~tau_2 -> ~chi_20  tau-)
     1.21418013E-02    2     1000025        15   # BR(~tau_2 -> ~chi_30  tau-)
     2.42430210E-01    2     1000035        15   # BR(~tau_2 -> ~chi_40  tau-)
     2.63918186E-05    2    -1000024        16   # BR(~tau_2 -> ~chi_1-  nu_tau)
     4.85542697E-01    2    -1000037        16   # BR(~tau_2 -> ~chi_2-  nu_tau)
#
#         PDG            Width
DECAY   1000012     3.02308415E+01   # snu_eL decays
#          BR         NDA      ID1       ID2
     2.26573956E-01    2     1000022        12   # BR(~nu_eL -> ~chi_10 nu_e)
     4.10314110E-04    2     1000023        12   # BR(~nu_eL -> ~chi_20 nu_e)
     2.75320933E-04    2     1000025        12   # BR(~nu_eL -> ~chi_30 nu_e)
     2.57013302E-01    2     1000035        12   # BR(~nu_eL -> ~chi_40 nu_e)
     2.56272401E-03    2     1000024        11   # BR(~nu_eL -> ~chi_1+ e-)
     5.13164382E-01    2     1000037        11   # BR(~nu_eL -> ~chi_2+ e-)
#
#         PDG            Width
DECAY   1000014     3.02308415E+01   # snu_muL decays
#          BR         NDA      ID1       ID2
     2.26573956E-01    2     1000022        14   # BR(~nu_muL -> ~chi_10 nu_mu)
     4.10314110E-04    2     1000023        14   # BR(~nu_muL -> ~chi_20 nu_mu)
     2.75320933E-04    2     1000025        14   # BR(~nu_muL -> ~chi_30 nu_mu)
     2.57013302E-01    2     1000035        14   # BR(~nu_muL -> ~chi_40 nu_mu)
     2.56272401E-03    2     1000024        13   # BR(~nu_muL -> ~chi_1+ mu-)
     5.13164382E-01    2     1000037        13   # BR(~nu_muL -> ~chi_2+ mu-)
#
#         PDG            Width
DECAY   1000016     3.09277150E+01   # snu_tauL decays
#          BR         NDA      ID1       ID2
     2.21445173E-01    2     1000022        16   # BR(~nu_tauL -> ~chi_10 nu_tau)
     4.01001012E-04    2     1000023        16   # BR(~nu_tauL -> ~chi_20 nu_tau)
     2.69071782E-04    2     1000025        16   # BR(~nu_tauL -> ~chi_30 nu_tau)
     2.51131347E-01    2     1000035        16   # BR(~nu_tauL -> ~chi_40 nu_tau)
     2.53285283E-02    2     1000024        15   # BR(~nu_tauL -> ~chi_1+ tau-)
     5.01424879E-01    2     1000037        15   # BR(~nu_tauL -> ~chi_2+ tau-)
#
#         PDG            Width
DECAY   1000024     1.11111903E+00   # chargino1+ decays
#          BR         NDA      ID1       ID2
     1.00000000E+00    2     1000022        24   # BR(~chi_1+ -> ~chi_10  W+)
#
#         PDG            Width
DECAY   1000037     1.67767957E+01   # chargino2+ decays
#          BR         NDA      ID1       ID2
     2.52306379E-01    2     1000024        23   # BR(~chi_2+ -> ~chi_1+  Z )
     3.54707869E-04    2     1000022        24   # BR(~chi_2+ -> ~chi_10  W+)
     2.44570871E-01    2     1000023        24   # BR(~chi_2+ -> ~chi_20  W+)
     2.43276019E-01    2     1000025        24   # BR(~chi_2+ -> ~chi_30  W+)
     2.59491883E-01    2     1000024        25   # BR(~chi_2+ -> ~chi_1+  h )
     1.39787882E-07    2     1000022        37   # BR(~chi_2+ -> ~chi_10  H+)
#
#         PDG            Width
DECAY   1000022     0.00000000E+00   # neutralino1 decays
#
#         PDG            Width
DECAY   1000023     1.16921543E+00   # neutralino2 decays
#          BR         NDA      ID1       ID2
     5.62458479E-01    2     1000022        23   # BR(~chi_20 -> ~chi_10   Z )
     4.37541521E-01    2     1000022        25   # BR(~chi_20 -> ~chi_10   h )
#
#         PDG            Width
DECAY   1000025     1.18254154E+00   # neutralino3 decays
#          BR         NDA      ID1       ID2
     4.19069257E-01    2     1000022        23   # BR(~chi_30 -> ~chi_10   Z )
     5.80930743E-01    2     1000022        25   # BR(~chi_30 -> ~chi_10   h )
#
#         PDG            Width
DECAY   1000035     1.67546507E+01   # neutralino4 decays
#          BR         NDA      ID1       ID2
     1.47364096E-04    2     1000022        23   # BR(~chi_40 -> ~chi_10   Z )
     2.45176480E-02    2     1000023        23   # BR(~chi_40 -> ~chi_20   Z )
     2.27761769E-01    2     1000025        23   # BR(~chi_40 -> ~chi_30   Z )
     2.43978956E-01    2     1000024       -24   # BR(~chi_40 -> ~chi_1+   W-)
     2.43978956E-01    2    -1000024        24   # BR(~chi_40 -> ~chi_1-   W+)
     2.19418543E-04    2     1000022        25   # BR(~chi_40 -> ~chi_10   h )
     1.20434664E-07    2     1000022        35   # BR(~chi_40 -> ~chi_10   H )
     2.46709316E-08    2     1000022        36   # BR(~chi_40 -> ~chi_10   A )
     2.35062079E-01    2     1000023        25   # BR(~chi_40 -> ~chi_20   h )
     2.43336646E-02    2     1000025        25   # BR(~chi_40 -> ~chi_30   h )
#
#         PDG            Width
DECAY        25     4.00379695E-03   # h decays
#          BR         NDA      ID1       ID2
     6.15975023E-01    2           5        -5   # BR(h -> b       bb     )
     6.45319283E-02    2         -15        15   # BR(h -> tau+    tau-   )
     2.28468549E-04    2         -13        13   # BR(h -> mu+     mu-    )
     4.84690221E-04    2           3        -3   # BR(h -> s       sb     )
     2.10057123E-02    2           4        -4   # BR(h -> c       cb     )
     6.74125315E-02    2          21        21   # BR(h -> g       g      )
     2.30747364E-03    2          22        22   # BR(h -> gam     gam    )
     1.44895159E-03    2          22        23   # BR(h -> Z       gam    )
     2.02628048E-01    2          24       -24   # BR(h -> W+      W-     )
     2.39561117E-02    2          23        23   # BR(h -> Z       Z      )
     2.10608292E-05    2     1000022   1000022   # BR(h -> ~chi_10 ~chi_10)
#
#         PDG            Width
DECAY        35     6.70307656E+00   # H decays
#          BR         NDA      ID1       ID2
     4.88078014E-01    2           5        -5   # BR(H -> b       bb     )
     8.32036472E-02    2         -15        15   # BR(H -> tau+    tau-   )
     2.94214705E-04    2         -13        13   # BR(H -> mu+     mu-    )
     3.60662314E-04    2           3        -3   # BR(H -> s       sb     )
     2.01272398E-06    2           4        -4   # BR(H -> c       cb     )
     2.01087061E-01    2           6        -6   # BR(H -> t       tb     )
     6.66810524E-05    2          21        21   # BR(H -> g       g      )
     3.87043222E-07    2          22        22   # BR(H -> gam     gam    )
     1.18639384E-07    2          23        22   # BR(H -> Z       gam    )
     8.71450703E-05    2          24       -24   # BR(H -> W+      W-     )
     4.35173787E-05    2          23        23   # BR(H -> Z       Z      )
     3.36955121E-04    2          25        25   # BR(H -> h       h      )
     1.58235668E-23    2          36        36   # BR(H -> A       A      )
     5.16883405E-19    2          23        36   # BR(H -> Z       A      )
     6.65855240E-04    2     1000022   1000022   # BR(H -> ~chi_10 ~chi_10)
     1.32968652E-01    2     1000022   1000023   # BR(H -> ~chi_10 ~chi_20)
     9.28050760E-02    2     1000022   1000025   # BR(H -> ~chi_10 ~chi_30)
#
#         PDG            Width
DECAY        36     6.70620921E+00   # A decays
#          BR         NDA      ID1       ID2
     4.88013915E-01    2           5        -5   # BR(A -> b       bb     )
     8.31672528E-02    2         -15        15   # BR(A -> tau+    tau-   )
     2.94085601E-04    2         -13        13   # BR(A -> mu+     mu-    )
     3.60767156E-04    2           3        -3   # BR(A -> s       sb     )
     2.02033005E-06    2           4        -4   # BR(A -> c       cb     )
     2.01735605E-01    2           6        -6   # BR(A -> t       tb     )
     1.99726760E-04    2          21        21   # BR(A -> g       g      )
     3.72824454E-07    2          22        22   # BR(A -> gam     gam    )
     2.41798306E-07    2          23        22   # BR(A -> Z       gam    )
     8.67787935E-05    2          23        25   # BR(A -> Z       h      )
     6.87073207E-04    2     1000022   1000022   # BR(A -> ~chi_10 ~chi_10)
     9.38849301E-02    2     1000022   1000023   # BR(A -> ~chi_10 ~chi_20)
     1.31567230E-01    2     1000022   1000025   # BR(A -> ~chi_10 ~chi_30)
#
#         PDG            Width
DECAY        37     6.68384496E+00   # H+ decays
#          BR         NDA      ID1       ID2
     7.82651878E-04    2           4        -5   # BR(H+ -> c       bb     )
     8.34698534E-02    2         -15        16   # BR(H+ -> tau+    nu_tau )
     2.95155619E-04    2         -13        14   # BR(H+ -> mu+     nu_mu  )
     5.00894633E-06    2           2        -5   # BR(H+ -> u       bb     )
     1.73191160E-05    2           2        -3   # BR(H+ -> u       sb     )
     3.58156135E-04    2           4        -3   # BR(H+ -> c       sb     )
     6.87330071E-01    2           6        -5   # BR(H+ -> t       bb     )
     8.72012278E-05    2          24        25   # BR(H+ -> W+      h      )
     1.00510908E-13    2          24        36   # BR(H+ -> W+      A      )
     2.27654582E-01    2     1000024   1000022   # BR(H+ -> ~chi_1+ ~chi_10)
