#
#                              ======================
#                              | THE SUSYHIT OUTPUT |
#                              ======================
#
#
#              ------------------------------------------------------
#              |     This is the output of the SUSY-HIT package     |
#              |  created by A.Djouadi, M.Muehlleitner and M.Spira. |
#              |  In case of problems with SUSY-HIT email to        |
#              |           margarete.muehlleitner@cern.ch           |
#              |           michael.spira@psi.ch                     |
#              |           abdelhak.djouadi@cern.ch                 |
#              ------------------------------------------------------
#
#              ------------------------------------------------------
#              |  SUSY Les Houches Accord - MSSM Spectrum + Decays  |
#              |              based on the decay programs           |
#              |                                                    |
#              |                     SDECAY 1.3b                    |
#              |                                                    |
#              |  Authors: M.Muhlleitner, A.Djouadi and Y.Mambrini  |
#              |  Ref.:    Comput.Phys.Commun.168(2005)46           |
#              |           [hep-ph/0311167]                         |
#              |                                                    |
#              |                     HDECAY 3.4                     |
#              |                                                    |
#              |  By: A.Djouadi,J.Kalinowski,M.Muhlleitner,M.Spira  |
#              |  Ref.:    Comput.Phys.Commun.108(1998)56           |
#              |           [hep-ph/9704448]                         |
#              |                                                    |
#              |                                                    |
#              |  If not stated otherwise all DRbar couplings and   |
#              |  soft SUSY breaking masses are given at the scale  |
#              |  Q=  0.50007227E+04
#              |                                                    |
#              ------------------------------------------------------
#
#
BLOCK DCINFO  # Decay Program information
     1   SDECAY/HDECAY # decay calculator
     2   1.3b  /3.4    # version number
#
BLOCK SPINFO  # Spectrum calculator information
     1    SOFTSUSY    # spectrum calculator                
     2    3.4.0       # version number                     
#
BLOCK MODSEL  # Model selection
     1     0   #  nonUniversal                                     
#
BLOCK SMINPUTS  # Standard Model inputs
         1     1.25778332E+02   # alpha_em^-1(M_Z)^MSbar
         2     1.16570000E-05   # G_F [GeV^-2]
         3     1.17200002E-01   # alpha_S(M_Z)^MSbar
         4     9.11876000E+01   # M_Z pole mass
         5     4.25000000E+00   # mb(mb)^MSbar
         6     1.72500000E+02   # mt pole mass
         7     1.77682000E+00   # mtau pole mass
#
BLOCK MINPAR  # Input parameters - minimal models
         3     1.00000000E+01   # tanb                
#
BLOCK EXTPAR  # Input parameters - non-minimal models
         0    -1.00000000E+00   # Set                 
         1     6.00000000E+01   # M_1(MX)             
         2     3.00000000E+03   # M_2(MX)             
         3     2.42818500E+03   # M_3(MX)             
        11     5.00000000E+03   # At(MX)              
        12     5.00000000E+03   # Ab(MX)              
        13     0.00000000E+00   # Atau(MX)            
        23    -1.44649800E+03   # mu(MX)              
        26     3.00000000E+03   # mA(pole)            
        31     5.00000000E+03   # meL(MX)             
        32     5.00000000E+03   # mmuL(MX)            
        33     5.00000000E+03   # mtauL(MX)           
        34     5.00000000E+03   # meR(MX)             
        35     5.00000000E+03   # mmuR(MX)            
        36     5.00000000E+03   # mtauR(MX)           
        41     5.00000000E+03   # mqL1(MX)            
        42     5.00000000E+03   # mqL2(MX)            
        43     5.00000000E+03   # mqL3(MX)            
        44     5.00000000E+03   # muR(MX)             
        45     5.00000000E+03   # mcR(MX)             
        46     5.00000000E+03   # mtR(MX)             
        47     5.00000000E+03   # mdR(MX)             
        48     5.00000000E+03   # msR(MX)             
        49     5.00000000E+03   # mbR(MX)             
#
BLOCK MASS  # Mass Spectrum
# PDG code           mass       particle
        24     8.00968599E+01   # W+
        25     1.24827962E+02   # h
        35     3.00008807E+03   # H
        36     2.99999993E+03   # A
        37     3.00087727E+03   # H+
         5     4.87878001E+00   # b-quark pole mass calculated from mb(mb)_Msbar
   1000001     5.08624870E+03   # ~d_L
   2000001     5.06852577E+03   # ~d_R
   1000002     5.08577949E+03   # ~u_L
   2000002     5.06825219E+03   # ~u_R
   1000003     5.08624870E+03   # ~s_L
   2000003     5.06852577E+03   # ~s_R
   1000004     5.08577949E+03   # ~c_L
   2000004     5.06825219E+03   # ~c_R
   1000005     5.03222911E+03   # ~b_1
   2000005     5.06732719E+03   # ~b_2
   1000006     4.92501315E+03   # ~t_1
   2000006     5.07691500E+03   # ~t_2
   1000011     5.01904590E+03   # ~e_L
   2000011     5.00591054E+03   # ~e_R
   1000012     5.01809806E+03   # ~nu_eL
   1000013     5.01904590E+03   # ~mu_L
   2000013     5.00591054E+03   # ~mu_R
   1000014     5.01809806E+03   # ~nu_muL
   1000015     5.00437059E+03   # ~tau_1
   2000015     5.01900034E+03   # ~tau_2
   1000016     5.01755921E+03   # ~nu_tauL
   1000021     2.80000025E+03   # ~g
   1000022     6.03031077E+01   # ~chi_10
   1000023     1.49944891E+03   # ~chi_20
   1000025    -1.50189568E+03   # ~chi_30
   1000035     3.07431977E+03   # ~chi_40
   1000024     1.50000043E+03   # ~chi_1+
   1000037     3.07448722E+03   # ~chi_2+
#
BLOCK NMIX  # Neutralino Mixing Matrix
  1  1     9.99556249E-01   # N_11
  1  2     1.39924384E-04   # N_12
  1  3    -2.97254554E-02   # N_13
  1  4     1.91888465E-03   # N_14
  2  1     1.96618123E-02   # N_21
  2  2     3.08953241E-02   # N_22
  2  3     7.06897428E-01   # N_23
  2  4     7.06367411E-01   # N_24
  3  1    -2.23721769E-02   # N_31
  3  2     1.32646731E-02   # N_32
  3  3    -7.06581148E-01   # N_33
  3  4     7.07153883E-01   # N_34
  4  1    -4.50815636E-04   # N_41
  4  2     9.99434594E-01   # N_42
  4  3    -1.24701485E-02   # N_43
  4  4    -3.12215365E-02   # N_44
#
BLOCK UMIX  # Chargino Mixing Matrix U
  1  1     1.76448543E-02   # U_11
  1  2     9.99844317E-01   # U_12
  2  1    -9.99844317E-01   # U_21
  2  2     1.76448543E-02   # U_22
#
BLOCK VMIX  # Chargino Mixing Matrix V
  1  1     4.41729519E-02   # V_11
  1  2    -9.99023899E-01   # V_12
  2  1    -9.99023899E-01   # V_21
  2  2    -4.41729519E-02   # V_22
#
BLOCK STOPMIX  # Stop Mixing Matrix
  1  1    -5.07876761E-01   # cos(theta_t)
  1  2     8.61429739E-01   # sin(theta_t)
  2  1    -8.61429739E-01   # -sin(theta_t)
  2  2    -5.07876761E-01   # cos(theta_t)
#
BLOCK SBOTMIX  # Sbottom Mixing Matrix
  1  1     9.94550644E-01   # cos(theta_b)
  1  2    -1.04254576E-01   # sin(theta_b)
  2  1     1.04254576E-01   # -sin(theta_b)
  2  2     9.94550644E-01   # cos(theta_b)
#
BLOCK STAUMIX  # Stau Mixing Matrix
  1  1    -1.68221262E-01   # cos(theta_tau)
  1  2     9.85749262E-01   # sin(theta_tau)
  2  1    -9.85749262E-01   # -sin(theta_tau)
  2  2    -1.68221262E-01   # cos(theta_tau)
#
BLOCK ALPHA  # Higgs mixing
          -1.05473187E-01   # Mixing angle in the neutral Higgs boson sector
#
BLOCK HMIX Q=  5.00072270E+03  # DRbar Higgs Parameters
         1    -1.47317236E+03   # mu(Q)MSSM           
         2     9.46958413E+00   # tan                 
         3     2.41960016E+02   # higgs               
         4     8.40420805E+06   # mA^2(Q)MSSM         
#
BLOCK GAUGE Q=  5.00072270E+03  # The gauge couplings
     1     3.70686614E-01   # gprime(Q) DRbar
     2     6.32041497E-01   # g(Q) DRbar
     3     9.93514886E-01   # g3(Q) DRbar
#
BLOCK AU Q=  5.00072270E+03  # The trilinear couplings
  1  1     5.00000002E+03   # A_u(Q) DRbar
  2  2     5.00000002E+03   # A_c(Q) DRbar
  3  3     5.00000003E+03   # A_t(Q) DRbar
#
BLOCK AD Q=  5.00072270E+03  # The trilinear couplings
  1  1     5.00000001E+03   # A_d(Q) DRbar
  2  2     5.00000001E+03   # A_s(Q) DRbar
  3  3     5.00000001E+03   # A_b(Q) DRbar
#
BLOCK AE Q=  5.00072270E+03  # The trilinear couplings
  1  1     0.00000000E+00   # A_e(Q) DRbar
  2  2     2.98248022E-07   # A_mu(Q) DRbar
  3  3     2.98362200E-07   # A_tau(Q) DRbar
#
BLOCK Yu Q=  5.00072270E+03  # The Yukawa couplings
  1  1     0.00000000E+00   # y_u(Q) DRbar
  2  2     0.00000000E+00   # y_c(Q) DRbar
  3  3     8.21157118E-01   # y_t(Q) DRbar
#
BLOCK Yd Q=  5.00072270E+03  # The Yukawa couplings
  1  1     0.00000000E+00   # y_d(Q) DRbar
  2  2     0.00000000E+00   # y_s(Q) DRbar
  3  3     1.31904627E-01   # y_b(Q) DRbar
#
BLOCK Ye Q=  5.00072270E+03  # The Yukawa couplings
  1  1     0.00000000E+00   # y_e(Q) DRbar
  2  2     0.00000000E+00   # y_mu(Q) DRbar
  3  3     9.66222698E-02   # y_tau(Q) DRbar
#
BLOCK MSOFT Q=  5.00072270E+03  # The soft SUSY breaking masses at the scale Q
         1     6.00000000E+01   # M_1(Q)              
         2     3.00000000E+03   # M_2(Q)              
         3     2.42818500E+03   # M_3(Q)              
        21     6.50011119E+06   # mH1^2(Q)            
        22    -1.61882143E+06   # mH2^2(Q)            
        31     5.00000000E+03   # meL(Q)              
        32     5.00000000E+03   # mmuL(Q)             
        33     5.00000000E+03   # mtauL(Q)            
        34     5.00000000E+03   # meR(Q)              
        35     5.00000000E+03   # mmuR(Q)             
        36     5.00000000E+03   # mtauR(Q)            
        41     4.99999999E+03   # mqL1(Q)             
        42     4.99999999E+03   # mqL2(Q)             
        43     4.99999999E+03   # mqL3(Q)             
        44     4.99999999E+03   # muR(Q)              
        45     4.99999999E+03   # mcR(Q)              
        46     4.99999999E+03   # mtR(Q)              
        47     4.99999999E+03   # mdR(Q)              
        48     4.99999999E+03   # msR(Q)              
        49     4.99999999E+03   # mbR(Q)              
#
#
#
#                             =================
#                             |The decay table|
#                             =================
#
# - The QCD corrections to the decays gluino -> squark  + quark
#                                     squark -> gaugino + quark_prime
#                                     squark -> squark_prime + Higgs
#                                     squark -> gluino  + quark
#   are included.
#
# - The multi-body decays for the inos, stops and sbottoms are included.
#
# - The loop induced decays for the gluino, neutralinos and stops
#   are included.
#
# - The SUSY decays of the top quark are included.
#
#
#         PDG            Width
DECAY         6     1.39981987E+00   # top decays
#          BR         NDA      ID1       ID2
     1.00000000E+00    2           5        24   # BR(t ->  b    W+)
#
#         PDG            Width
DECAY   1000021     3.83615651E-03   # gluino decays
#          BR         NDA      ID1       ID2
     3.12349084E-06    2     1000022        21   # BR(~g -> ~chi_10 g)
     5.00685985E-03    2     1000023        21   # BR(~g -> ~chi_20 g)
     4.99644550E-03    2     1000025        21   # BR(~g -> ~chi_30 g)
#           BR         NDA      ID1       ID2       ID3
     3.64929494E-02    3     1000022         1        -1   # BR(~g -> ~chi_10 d  db)
     2.91057896E-05    3     1000023         1        -1   # BR(~g -> ~chi_20 d  db)
     5.41951850E-06    3     1000025         1        -1   # BR(~g -> ~chi_30 d  db)
     1.24434615E-01    3     1000022         2        -2   # BR(~g -> ~chi_10 u  ub)
     5.32169338E-05    3     1000023         2        -2   # BR(~g -> ~chi_20 u  ub)
     5.44278389E-06    3     1000025         2        -2   # BR(~g -> ~chi_30 u  ub)
     3.64929494E-02    3     1000022         3        -3   # BR(~g -> ~chi_10 s  sb)
     2.91057896E-05    3     1000023         3        -3   # BR(~g -> ~chi_20 s  sb)
     5.41951850E-06    3     1000025         3        -3   # BR(~g -> ~chi_30 s  sb)
     1.24434615E-01    3     1000022         4        -4   # BR(~g -> ~chi_10 c  cb)
     5.32169338E-05    3     1000023         4        -4   # BR(~g -> ~chi_20 c  cb)
     5.44278389E-06    3     1000025         4        -4   # BR(~g -> ~chi_30 c  cb)
     3.69679700E-02    3     1000022         5        -5   # BR(~g -> ~chi_10 b  bb)
     3.46766970E-03    3     1000023         5        -5   # BR(~g -> ~chi_20 b  bb)
     3.40475547E-03    3     1000025         5        -5   # BR(~g -> ~chi_30 b  bb)
     1.29125771E-01    3     1000022         6        -6   # BR(~g -> ~chi_10 t  tb)
     1.24307515E-01    3     1000023         6        -6   # BR(~g -> ~chi_20 t  tb)
     1.10517275E-01    3     1000025         6        -6   # BR(~g -> ~chi_30 t  tb)
     7.50745793E-05    3     1000024         1        -2   # BR(~g -> ~chi_1+ d  ub)
     7.50745793E-05    3    -1000024         2        -1   # BR(~g -> ~chi_1- u  db)
     7.50745793E-05    3     1000024         3        -4   # BR(~g -> ~chi_1+ s  cb)
     7.50745793E-05    3    -1000024         4        -3   # BR(~g -> ~chi_1- c  sb)
     1.29930409E-01    3     1000024         5        -6   # BR(~g -> ~chi_1+ b  tb)
     1.29930409E-01    3    -1000024         6        -5   # BR(~g -> ~chi_1- t  bb)
#
#         PDG            Width
DECAY   1000006     2.53122125E+02   # stop1 decays
#          BR         NDA      ID1       ID2
     3.50262368E-02    2     1000022         6   # BR(~t_1 -> ~chi_10 t )
     1.07064583E-01    2     1000023         6   # BR(~t_1 -> ~chi_20 t )
     1.02960229E-01    2     1000025         6   # BR(~t_1 -> ~chi_30 t )
     8.37779936E-03    2     1000035         6   # BR(~t_1 -> ~chi_40 t )
     1.56198176E-01    2     1000024         5   # BR(~t_1 -> ~chi_1+ b )
     1.66642104E-02    2     1000037         5   # BR(~t_1 -> ~chi_2+ b )
     5.73708765E-01    2     1000021         6   # BR(~t_1 -> ~g      t )
#
#         PDG            Width
DECAY   2000006     2.66723784E+02   # stop2 decays
#          BR         NDA      ID1       ID2
     1.29121720E-02    2     1000022         6   # BR(~t_2 -> ~chi_10 t )
     1.05419469E-01    2     1000023         6   # BR(~t_2 -> ~chi_20 t )
     1.09667594E-01    2     1000025         6   # BR(~t_2 -> ~chi_30 t )
     2.09150567E-02    2     1000035         6   # BR(~t_2 -> ~chi_40 t )
     6.27008231E-02    2     1000024         5   # BR(~t_2 -> ~chi_1+ b )
     4.15322613E-02    2     1000037         5   # BR(~t_2 -> ~chi_2+ b )
     6.42256120E-01    2     1000021         6   # BR(~t_2 -> ~g      t )
     1.02196253E-03    2     1000006        25   # BR(~t_2 -> ~t_1    h )
     3.57454114E-03    2     1000006        23   # BR(~t_2 -> ~t_1    Z )
#
#         PDG            Width
DECAY   1000005     2.42022151E+02   # sbottom1 decays
#          BR         NDA      ID1       ID2
     3.21574832E-03    2     1000022         5   # BR(~b_1 -> ~chi_10 b )
     3.08018596E-03    2     1000023         5   # BR(~b_1 -> ~chi_20 b )
     2.91852141E-03    2     1000025         5   # BR(~b_1 -> ~chi_30 b )
     3.11994147E-02    2     1000035         5   # BR(~b_1 -> ~chi_40 b )
     2.27724999E-01    2    -1000024         6   # BR(~b_1 -> ~chi_1- t )
     6.28024634E-02    2    -1000037         6   # BR(~b_1 -> ~chi_2- t )
     6.66884541E-01    2     1000021         5   # BR(~b_1 -> ~g      b )
     2.17412589E-03    2     1000006       -24   # BR(~b_1 -> ~t_1    W-)
#
#         PDG            Width
DECAY   2000005     1.71069740E+02   # sbottom2 decays
#          BR         NDA      ID1       ID2
     1.70698452E-02    2     1000022         5   # BR(~b_2 -> ~chi_10 b )
     4.18186354E-03    2     1000023         5   # BR(~b_2 -> ~chi_20 b )
     4.36129587E-03    2     1000025         5   # BR(~b_2 -> ~chi_30 b )
     4.99410042E-04    2     1000035         5   # BR(~b_2 -> ~chi_40 b )
     1.18186793E-02    2    -1000024         6   # BR(~b_2 -> ~chi_1- t )
     1.00485285E-03    2    -1000037         6   # BR(~b_2 -> ~chi_2- t )
     9.60913854E-01    2     1000021         5   # BR(~b_2 -> ~g      b )
     1.50198923E-04    2     1000006       -24   # BR(~b_2 -> ~t_1    W-)
#
#         PDG            Width
DECAY   1000002     1.90463200E+02   # sup_L decays
#          BR         NDA      ID1       ID2
     3.90738473E-03    2     1000022         2   # BR(~u_L -> ~chi_10 u)
     1.03234751E-04    2     1000023         2   # BR(~u_L -> ~chi_20 u)
     6.75801367E-06    2     1000025         2   # BR(~u_L -> ~chi_30 u)
     4.15057780E-02    2     1000035         2   # BR(~u_L -> ~chi_40 u)
     3.33787517E-04    2     1000024         1   # BR(~u_L -> ~chi_1+ d)
     8.29476658E-02    2     1000037         1   # BR(~u_L -> ~chi_2+ d)
     8.71195391E-01    2     1000021         2   # BR(~u_L -> ~g      u)
#
#         PDG            Width
DECAY   2000002     1.76220911E+02   # sup_R decays
#          BR         NDA      ID1       ID2
     6.72362380E-02    2     1000022         2   # BR(~u_R -> ~chi_10 u)
     2.17518221E-05    2     1000023         2   # BR(~u_R -> ~chi_20 u)
     2.81446109E-05    2     1000025         2   # BR(~u_R -> ~chi_30 u)
     5.51919930E-09    2     1000035         2   # BR(~u_R -> ~chi_40 u)
     9.32713860E-01    2     1000021         2   # BR(~u_R -> ~g      u)
#
#         PDG            Width
DECAY   1000001     1.90481648E+02   # sdown_L decays
#          BR         NDA      ID1       ID2
     3.89619965E-03    2     1000022         1   # BR(~d_L -> ~chi_10 d)
     6.26013984E-05    2     1000023         1   # BR(~d_L -> ~chi_20 d)
     2.65980840E-05    2     1000025         1   # BR(~d_L -> ~chi_30 d)
     4.15290029E-02    2     1000035         1   # BR(~d_L -> ~chi_40 d)
     5.32607416E-05    2    -1000024         2   # BR(~d_L -> ~chi_1- u)
     8.31011339E-02    2    -1000037         2   # BR(~d_L -> ~chi_2- u)
     8.71331203E-01    2     1000021         1   # BR(~d_L -> ~g      d)
#
#         PDG            Width
DECAY   2000001     1.67352618E+02   # sdown_R decays
#          BR         NDA      ID1       ID2
     1.77007775E-02    2     1000022         1   # BR(~d_R -> ~chi_10 d)
     5.72655370E-06    2     1000023         1   # BR(~d_R -> ~chi_20 d)
     7.40956949E-06    2     1000025         1   # BR(~d_R -> ~chi_30 d)
     1.45317772E-09    2     1000035         1   # BR(~d_R -> ~chi_40 d)
     9.82286085E-01    2     1000021         1   # BR(~d_R -> ~g      d)
#
#         PDG            Width
DECAY   1000004     1.90463200E+02   # scharm_L decays
#          BR         NDA      ID1       ID2
     3.90738473E-03    2     1000022         4   # BR(~c_L -> ~chi_10 c)
     1.03234751E-04    2     1000023         4   # BR(~c_L -> ~chi_20 c)
     6.75801367E-06    2     1000025         4   # BR(~c_L -> ~chi_30 c)
     4.15057780E-02    2     1000035         4   # BR(~c_L -> ~chi_40 c)
     3.33787517E-04    2     1000024         3   # BR(~c_L -> ~chi_1+ s)
     8.29476658E-02    2     1000037         3   # BR(~c_L -> ~chi_2+ s)
     8.71195391E-01    2     1000021         4   # BR(~c_L -> ~g      c)
#
#         PDG            Width
DECAY   2000004     1.76220911E+02   # scharm_R decays
#          BR         NDA      ID1       ID2
     6.72362380E-02    2     1000022         4   # BR(~c_R -> ~chi_10 c)
     2.17518221E-05    2     1000023         4   # BR(~c_R -> ~chi_20 c)
     2.81446109E-05    2     1000025         4   # BR(~c_R -> ~chi_30 c)
     5.51919930E-09    2     1000035         4   # BR(~c_R -> ~chi_40 c)
     9.32713860E-01    2     1000021         4   # BR(~c_R -> ~g      c)
#
#         PDG            Width
DECAY   1000003     1.90481648E+02   # sstrange_L decays
#          BR         NDA      ID1       ID2
     3.89619965E-03    2     1000022         3   # BR(~s_L -> ~chi_10 s)
     6.26013984E-05    2     1000023         3   # BR(~s_L -> ~chi_20 s)
     2.65980840E-05    2     1000025         3   # BR(~s_L -> ~chi_30 s)
     4.15290029E-02    2     1000035         3   # BR(~s_L -> ~chi_40 s)
     5.32607416E-05    2    -1000024         4   # BR(~s_L -> ~chi_1- c)
     8.31011339E-02    2    -1000037         4   # BR(~s_L -> ~chi_2- c)
     8.71331203E-01    2     1000021         3   # BR(~s_L -> ~g      s)
#
#         PDG            Width
DECAY   2000003     1.67352618E+02   # sstrange_R decays
#          BR         NDA      ID1       ID2
     1.77007775E-02    2     1000022         3   # BR(~s_R -> ~chi_10 s)
     5.72655370E-06    2     1000023         3   # BR(~s_R -> ~chi_20 s)
     7.40956949E-06    2     1000025         3   # BR(~s_R -> ~chi_30 s)
     1.45317772E-09    2     1000035         3   # BR(~s_R -> ~chi_40 s)
     9.82286085E-01    2     1000021         3   # BR(~s_R -> ~g      s)
#
#         PDG            Width
DECAY   1000011     3.02330461E+01   # selectron_L decays
#          BR         NDA      ID1       ID2
     2.26751200E-01    2     1000022        11   # BR(~e_L -> ~chi_10 e-)
     9.84933667E-04    2     1000023        11   # BR(~e_L -> ~chi_20 e-)
     1.12751082E-08    2     1000025        11   # BR(~e_L -> ~chi_30 e-)
     2.57098826E-01    2     1000035        11   # BR(~e_L -> ~chi_40 e-)
     3.40666923E-04    2    -1000024        12   # BR(~e_L -> ~chi_1- nu_e)
     5.14824363E-01    2    -1000037        12   # BR(~e_L -> ~chi_2- nu_e)
#
#         PDG            Width
DECAY   2000011     2.73567727E+01   # selectron_R decays
#          BR         NDA      ID1       ID2
     9.99264805E-01    2     1000022        11   # BR(~e_R -> ~chi_10 e-)
     3.20470238E-04    2     1000023        11   # BR(~e_R -> ~chi_20 e-)
     4.14645948E-04    2     1000025        11   # BR(~e_R -> ~chi_30 e-)
     7.88742960E-08    2     1000035        11   # BR(~e_R -> ~chi_40 e-)
#
#         PDG            Width
DECAY   1000013     3.02330461E+01   # smuon_L decays
#          BR         NDA      ID1       ID2
     2.26751200E-01    2     1000022        13   # BR(~mu_L -> ~chi_10 mu-)
     9.84933667E-04    2     1000023        13   # BR(~mu_L -> ~chi_20 mu-)
     1.12751082E-08    2     1000025        13   # BR(~mu_L -> ~chi_30 mu-)
     2.57098826E-01    2     1000035        13   # BR(~mu_L -> ~chi_40 mu-)
     3.40666923E-04    2    -1000024        14   # BR(~mu_L -> ~chi_1- nu_mu)
     5.14824363E-01    2    -1000037        14   # BR(~mu_L -> ~chi_2- nu_mu)
#
#         PDG            Width
DECAY   2000013     2.73567727E+01   # smuon_R decays
#          BR         NDA      ID1       ID2
     9.99264805E-01    2     1000022        13   # BR(~mu_R -> ~chi_10 mu-)
     3.20470238E-04    2     1000023        13   # BR(~mu_R -> ~chi_20 mu-)
     4.14645948E-04    2     1000025        13   # BR(~mu_R -> ~chi_30 mu-)
     7.88742960E-08    2     1000035        13   # BR(~mu_R -> ~chi_40 mu-)
#
#         PDG            Width
DECAY   1000015     2.89685299E+01   # stau_1 decays
#          BR         NDA      ID1       ID2
     9.24242281E-01    2     1000022        15   # BR(~tau_1 -> ~chi_10  tau-)
     1.41648420E-02    2     1000023        15   # BR(~tau_1 -> ~chi_20  tau-)
     1.28837363E-02    2     1000025        15   # BR(~tau_1 -> ~chi_30  tau-)
     7.28171221E-03    2     1000035        15   # BR(~tau_1 -> ~chi_40  tau-)
     2.68462074E-02    2    -1000024        16   # BR(~tau_1 -> ~chi_1-  nu_tau)
     1.45812215E-02    2    -1000037        16   # BR(~tau_1 -> ~chi_2-  nu_tau)
#
#         PDG            Width
DECAY   2000015     3.09201328E+01   # stau_2 decays
#          BR         NDA      ID1       ID2
     2.39742941E-01    2     1000022        15   # BR(~tau_2 -> ~chi_10  tau-)
     1.29152624E-02    2     1000023        15   # BR(~tau_2 -> ~chi_20  tau-)
     1.32028789E-02    2     1000025        15   # BR(~tau_2 -> ~chi_30  tau-)
     2.44490186E-01    2     1000035        15   # BR(~tau_2 -> ~chi_40  tau-)
     7.40431869E-05    2    -1000024        16   # BR(~tau_2 -> ~chi_1-  nu_tau)
     4.89574689E-01    2    -1000037        16   # BR(~tau_2 -> ~chi_2-  nu_tau)
#
#         PDG            Width
DECAY   1000012     3.02350861E+01   # snu_eL decays
#          BR         NDA      ID1       ID2
     2.26476727E-01    2     1000022        12   # BR(~nu_eL -> ~chi_10 nu_e)
     2.05100325E-04    2     1000023        12   # BR(~nu_eL -> ~chi_20 nu_e)
     3.80578052E-04    2     1000025        12   # BR(~nu_eL -> ~chi_30 nu_e)
     2.57188327E-01    2     1000035        12   # BR(~nu_eL -> ~chi_40 nu_e)
     2.13433775E-03    2     1000024        11   # BR(~nu_eL -> ~chi_1+ e-)
     5.13614930E-01    2     1000037        11   # BR(~nu_eL -> ~chi_2+ e-)
#
#         PDG            Width
DECAY   1000014     3.02350861E+01   # snu_muL decays
#          BR         NDA      ID1       ID2
     2.26476727E-01    2     1000022        14   # BR(~nu_muL -> ~chi_10 nu_mu)
     2.05100325E-04    2     1000023        14   # BR(~nu_muL -> ~chi_20 nu_mu)
     3.80578052E-04    2     1000025        14   # BR(~nu_muL -> ~chi_30 nu_mu)
     2.57188327E-01    2     1000035        14   # BR(~nu_muL -> ~chi_40 nu_mu)
     2.13433775E-03    2     1000024        13   # BR(~nu_muL -> ~chi_1+ mu-)
     5.13614930E-01    2     1000037        13   # BR(~nu_muL -> ~chi_2+ mu-)
#
#         PDG            Width
DECAY   1000016     3.09985152E+01   # snu_tauL decays
#          BR         NDA      ID1       ID2
     2.20875341E-01    2     1000022        16   # BR(~nu_tauL -> ~chi_10 nu_tau)
     2.00019224E-04    2     1000023        16   # BR(~nu_tauL -> ~chi_20 nu_tau)
     3.71149656E-04    2     1000025        16   # BR(~nu_tauL -> ~chi_30 nu_tau)
     2.50762635E-01    2     1000035        16   # BR(~nu_tauL -> ~chi_40 nu_tau)
     2.70068511E-02    2     1000024        15   # BR(~nu_tauL -> ~chi_1+ tau-)
     5.00784004E-01    2     1000037        15   # BR(~nu_tauL -> ~chi_2+ tau-)
#
#         PDG            Width
DECAY   1000024     9.22496408E-01   # chargino1+ decays
#          BR         NDA      ID1       ID2
     1.00000000E+00    2     1000022        24   # BR(~chi_1+ -> ~chi_10  W+)
#
#         PDG            Width
DECAY   1000037     1.83946293E+01   # chargino2+ decays
#          BR         NDA      ID1       ID2
     2.52703062E-01    2     1000024        23   # BR(~chi_2+ -> ~chi_1+  Z )
     2.61234677E-04    2     1000022        24   # BR(~chi_2+ -> ~chi_10  W+)
     2.44007085E-01    2     1000023        24   # BR(~chi_2+ -> ~chi_20  W+)
     2.43667710E-01    2     1000025        24   # BR(~chi_2+ -> ~chi_30  W+)
     2.59360545E-01    2     1000024        25   # BR(~chi_2+ -> ~chi_1+  h )
     3.63606388E-07    2     1000022        37   # BR(~chi_2+ -> ~chi_10  H+)
#
#         PDG            Width
DECAY   1000022     0.00000000E+00   # neutralino1 decays
#
#         PDG            Width
DECAY   1000023     9.69503619E-01   # neutralino2 decays
#          BR         NDA      ID1       ID2
     5.56482101E-01    2     1000022        23   # BR(~chi_20 -> ~chi_10   Z )
     4.43517899E-01    2     1000022        25   # BR(~chi_20 -> ~chi_10   h )
#
#         PDG            Width
DECAY   1000025     9.79090036E-01   # neutralino3 decays
#          BR         NDA      ID1       ID2
     4.26423710E-01    2     1000022        23   # BR(~chi_30 -> ~chi_10   Z )
     5.73576290E-01    2     1000022        25   # BR(~chi_30 -> ~chi_10   h )
#
#         PDG            Width
DECAY   1000035     1.83949842E+01   # neutralino4 decays
#          BR         NDA      ID1       ID2
     9.39508629E-05    2     1000022        23   # BR(~chi_40 -> ~chi_10   Z )
     3.95275116E-02    2     1000023        23   # BR(~chi_40 -> ~chi_20   Z )
     2.12642674E-01    2     1000025        23   # BR(~chi_40 -> ~chi_30   Z )
     2.44312904E-01    2     1000024       -24   # BR(~chi_40 -> ~chi_1+   W-)
     2.44312904E-01    2    -1000024        24   # BR(~chi_40 -> ~chi_1-   W+)
     1.73568459E-04    2     1000022        25   # BR(~chi_40 -> ~chi_10   h )
     3.27687960E-07    2     1000022        35   # BR(~chi_40 -> ~chi_10   H )
     4.92512794E-08    2     1000022        36   # BR(~chi_40 -> ~chi_10   A )
     2.19441582E-01    2     1000023        25   # BR(~chi_40 -> ~chi_20   h )
     3.94945277E-02    2     1000025        25   # BR(~chi_40 -> ~chi_30   h )
#
#         PDG            Width
DECAY        25     4.04017700E-03   # h decays
#          BR         NDA      ID1       ID2
     6.04991800E-01    2           5        -5   # BR(h -> b       bb     )
     6.42219234E-02    2         -15        15   # BR(h -> tau+    tau-   )
     2.27368718E-04    2         -13        13   # BR(h -> mu+     mu-    )
     4.81967622E-04    2           3        -3   # BR(h -> s       sb     )
     2.08859680E-02    2           4        -4   # BR(h -> c       cb     )
     6.76241908E-02    2          21        21   # BR(h -> g       g      )
     2.32650485E-03    2          22        22   # BR(h -> gam     gam    )
     1.50472124E-03    2          22        23   # BR(h -> Z       gam    )
     2.12366255E-01    2          24       -24   # BR(h -> W+      W-     )
     2.53358395E-02    2          23        23   # BR(h -> Z       Z      )
     3.34606233E-05    2     1000022   1000022   # BR(h -> ~chi_10 ~chi_10)
#
#         PDG            Width
DECAY        35     7.27636410E+00   # H decays
#          BR         NDA      ID1       ID2
     4.49876363E-01    2           5        -5   # BR(H -> b       bb     )
     7.65605834E-02    2         -15        15   # BR(H -> tau+    tau-   )
     2.70724304E-04    2         -13        13   # BR(H -> mu+     mu-    )
     3.31866410E-04    2           3        -3   # BR(H -> s       sb     )
     1.85643059E-06    2           4        -4   # BR(H -> c       cb     )
     1.85472128E-01    2           6        -6   # BR(H -> t       tb     )
     6.15797822E-05    2          21        21   # BR(H -> g       g      )
     3.88046732E-07    2          22        22   # BR(H -> gam     gam    )
     1.09556292E-07    2          23        22   # BR(H -> Z       gam    )
     8.31029587E-05    2          24       -24   # BR(H -> W+      W-     )
     4.14988932E-05    2          23        23   # BR(H -> Z       Z      )
     3.12763654E-04    2          25        25   # BR(H -> h       h      )
     4.15261997E-23    2          36        36   # BR(H -> A       A      )
     1.18388003E-18    2          23        36   # BR(H -> Z       A      )
     3.22337159E-09    2     1000024  -1000024   # BR(H -> ~chi_1+ ~chi_1-)
     8.82241955E-04    2     1000022   1000022   # BR(H -> ~chi_10 ~chi_10)
     1.91104100E-08    2     1000023   1000023   # BR(H -> ~chi_20 ~chi_20)
     1.70025987E-01    2     1000022   1000023   # BR(H -> ~chi_10 ~chi_20)
     1.16078785E-01    2     1000022   1000025   # BR(H -> ~chi_10 ~chi_30)
#
#         PDG            Width
DECAY        36     7.27902460E+00   # A decays
#          BR         NDA      ID1       ID2
     4.49861199E-01    2           5        -5   # BR(A -> b       bb     )
     7.65346973E-02    2         -15        15   # BR(A -> tau+    tau-   )
     2.70632390E-04    2         -13        13   # BR(A -> mu+     mu-    )
     3.31996285E-04    2           3        -3   # BR(A -> s       sb     )
     1.86347738E-06    2           4        -4   # BR(A -> c       cb     )
     1.86073428E-01    2           6        -6   # BR(A -> t       tb     )
     1.84132721E-04    2          21        21   # BR(A -> g       g      )
     2.67606735E-07    2          22        22   # BR(A -> gam     gam    )
     2.23090548E-07    2          23        22   # BR(A -> Z       gam    )
     8.27577254E-05    2          23        25   # BR(A -> Z       h      )
     9.07820566E-04    2     1000022   1000022   # BR(A -> ~chi_10 ~chi_10)
     1.51626111E-05    2     1000023   1000023   # BR(A -> ~chi_20 ~chi_20)
     1.17418810E-01    2     1000022   1000023   # BR(A -> ~chi_10 ~chi_20)
     1.68317009E-01    2     1000022   1000025   # BR(A -> ~chi_10 ~chi_30)
#
#         PDG            Width
DECAY        37     7.29863284E+00   # H+ decays
#          BR         NDA      ID1       ID2
     7.25890051E-04    2           4        -5   # BR(H+ -> c       bb     )
     7.63514042E-02    2         -15        16   # BR(H+ -> tau+    nu_tau )
     2.69984252E-04    2         -13        14   # BR(H+ -> mu+     nu_mu  )
     4.64567271E-06    2           2        -5   # BR(H+ -> u       bb     )
     1.58421108E-05    2           2        -3   # BR(H+ -> u       sb     )
     3.27616020E-04    2           4        -3   # BR(H+ -> c       sb     )
     6.35361884E-01    2           6        -5   # BR(H+ -> t       bb     )
     8.26608224E-05    2          24        25   # BR(H+ -> W+      h      )
     9.36032202E-14    2          24        36   # BR(H+ -> W+      A      )
     2.86844578E-01    2     1000024   1000022   # BR(H+ -> ~chi_1+ ~chi_10)
     1.54949393E-05    2     1000024   1000023   # BR(H+ -> ~chi_1+ ~chi_20)
