#  ISAJET SUSY parameters in SUSY Les Houches Accord 2 format
#  Created by ISALHA 2.0 Last revision: C. Balazs 21 Apr 2009
Block SPINFO   # Program information
     1   ISASUGRA from ISAJET          # Spectrum Calculator
     2   7.80   29-OCT-2009 12:50:36   # Version number
Block MODSEL   # Model selection
     1     3   # Minimal anomaly mediated (AMSB) model             
Block SMINPUTS   # Standard Model inputs
     1     1.27836258E+02   # alpha_em^(-1)
     2     1.16570000E-05   # G_Fermi
     3     1.17200002E-01   # alpha_s(M_Z)
     4     9.11699982E+01   # m_{Z}(pole)
     5     4.19999981E+00   # m_{b}(m_{b})
     6     1.72500000E+02   # m_{top}(pole)
     7     1.77699995E+00   # m_{tau}(pole)
Block MINPAR   # SUSY breaking input parameters
     1     5.00000000E+03   # m_0
     2     2.97600000E+05   # m_{3/2}
     3     5.00000000E+00   # tan(beta)
     4     1.00000000E+00   # sign(mu)
Block EXTPAR   # Non-universal SUSY breaking parameters
     0     8.23659408E+15   # Input scale
Block MASS   # Scalar and gaugino mass spectrum
#  PDG code   mass                 particle
         5     4.80000000E+00   # b-quark pole mass calculated from mb(mb)_Msbar
         6     1.72500000E+02   # t-quark pole mass (not read by ME)
        15     1.77682000E+00   # tau pole mass (not read by ME)
        23     9.11876000E+01   # Z pole mass (not read by ME)
        24     8.04229965E+01   #  W^+
        25     1.17200684E+02   #  h^0            
        35     6.82391162E+03   #  H^0            
        36     6.77920068E+03   #  A^0            
        37     6.82426123E+03   #  H^+            
   1000001     7.21431055E+03   #  dnl            
   1000002     7.21389258E+03   #  upl            
   1000003     7.21431055E+03   #  stl            
   1000004     7.21389258E+03   #  chl            
   1000005     6.18686328E+03   #  b1             
   1000006     4.92628906E+03   #  t1             
   1000011     4.85373145E+03   #  el-            
   1000012     4.85196680E+03   #  nuel           
   1000013     4.85373145E+03   #  mul-           
   1000014     4.85196680E+03   #  numl           
   1000015     4.80698242E+03   #  tau1           
   1000016     4.84457715E+03   #  nutl           
   1000021     5.77925342E+03   #  glss           
   1000022     8.49682983E+02   #  z1ss           
   1000023     2.77197217E+03   #  z2ss           
   1000024     8.49856812E+02   #  w1ss           
   1000025    -4.57773779E+03   #  z3ss           
   1000035     4.57891455E+03   #  z4ss           
   1000037     4.58363672E+03   #  w2ss           
   2000001     7.29252734E+03   #  dnr            
   2000002     7.25092480E+03   #  upr            
   2000003     7.29252734E+03   #  str            
   2000004     7.25092480E+03   #  chr            
   2000005     7.24349023E+03   #  b2             
   2000006     6.22800244E+03   #  t2             
   2000011     4.82162695E+03   #  er-            
   2000013     4.82162695E+03   #  mur-           
   2000015     4.84705566E+03   #  tau2           
Block ALPHA   # Effective Higgs mixing parameter
         -1.97492093E-01   # alpha
Block STOPMIX   # stop mixing matrix
  1  1     3.32560763E-02   # O_{11}
  1  2    -9.99446869E-01   # O_{12}
  2  1     9.99446869E-01   # O_{21}
  2  2     3.32560763E-02   # O_{22}
Block SBOTMIX   # sbottom mixing matrix
  1  1     9.99994338E-01   # O_{11}
  1  2     3.36214737E-03   # O_{12}
  2  1    -3.36214737E-03   # O_{21}
  2  2     9.99994338E-01   # O_{22}
Block STAUMIX   # stau mixing matrix
  1  1     1.15964301E-01   # O_{11}
  1  2     9.93253410E-01   # O_{12}
  2  1    -9.93253410E-01   # O_{21}
  2  2     1.15964301E-01   # O_{22}
Block NMIX   # neutralino mixing matrix
  1  1    -4.40530799E-04   #
  1  2     9.99842405E-01   #
  1  3    -1.70909762E-02   #
  1  4     4.75806557E-03   #
  2  1     9.99850333E-01   #
  2  2     7.32170651E-04   #
  2  3     1.43959224E-02   #
  2  4    -9.57280397E-03   #
  3  1    -3.41567397E-03   #
  3  2     8.71863961E-03   #
  3  3     7.07011878E-01   #
  3  4     7.07139552E-01   #
  4  1     1.69574767E-02   #
  4  2    -1.54397683E-02   #
  4  3    -7.06848502E-01   #
  4  4     7.06993103E-01   #
Block UMIX   # chargino U mixing matrix
  1  1    -9.99686539E-01   # U_{11}
  1  2     2.50368621E-02   # U_{12}
  2  1    -2.50368621E-02   # U_{21}
  2  2    -9.99686539E-01   # U_{22}
Block VMIX   # chargino V mixing matrix
  1  1    -9.99952853E-01   # V_{11}
  1  2     9.71258711E-03   # V_{12}
  2  1    -9.71258711E-03   # V_{21}
  2  2    -9.99952853E-01   # V_{22}
Block GAUGE Q=  5.30467285E+03   #
     1     3.57524991E-01   # g`
     2     6.52378619E-01   # g_2
     3     1.21928000E+00   # g_3
Block YU Q=  5.30467285E+03   #
  3  3     8.24267566E-01   # y_t
Block YD Q=  5.30467285E+03   #
  3  3     6.34609535E-02   # y_b
Block YE Q=  5.30467285E+03   #
  3  3     5.14506660E-02   # y_tau
Block HMIX Q=  5.30467285E+03   # Higgs mixing parameters
     1     4.55817480E+03   # mu(Q)
     2     5.00000000E+00   # tan(beta)(M_GUT)
     3     2.52340500E+02   # Higgs vev at Q
     4     4.59575600E+07   # m_A^2(Q)
Block MSOFT Q=  5.30467285E+03   # DRbar SUSY breaking parameters
     1     2.78614551E+03   # M_1(Q)          
     2     7.94388794E+02   # M_2(Q)          
     3    -5.35090869E+03   # M_3(Q)          
    21     3.23374943E+04   # mH1^2(Q)            
    22    -1.28800134E+05   # mH2^2(Q)            
    31     4.83548438E+03   # MeL(Q)          
    32     4.83548438E+03   # MmuL(Q)         
    33     4.82831982E+03   # MtauL(Q)        
    34     4.81326807E+03   # MeR(Q)          
    35     4.81326807E+03   # MmuR(Q)         
    36     4.79851221E+03   # MtauR(Q)        
    41     6.94601221E+03   # MqL1(Q)         
    42     6.94601221E+03   # MqL2(Q)         
    43     5.94256787E+03   # MqL3(Q)         
    44     6.98351123E+03   # MuR(Q)          
    45     6.98351123E+03   # McR(Q)          
    46     4.73525195E+03   # MtR(Q)          
    47     7.02562646E+03   # MdR(Q)          
    48     7.02562646E+03   # MsR(Q)          
    49     7.04167578E+03   # MbR(Q)          
Block AU Q=  5.30467285E+03   #
  1  1     4.57625586E+03   # A_u
  2  2     4.57625586E+03   # A_c
  3  3     4.57625586E+03   # A_t
Block AD Q=  5.30467285E+03   #
  1  1     1.08532803E+04   # A_d
  2  2     1.08532803E+04   # A_s
  3  3     1.08532803E+04   # A_b
Block AE Q=  5.30467285E+03   #
  1  1     3.09240137E+03   # A_e
  2  2     3.09240137E+03   # A_mu
  3  3     3.09240137E+03   # A_tau
#
#  ISAJET decay tables in SUSY Les Houches accord format
#  Created by ISALHD. Last revision: C. Balazs, 2005 May 25
Block DCINFO                           # Program information
     1   ISASUGRA from ISAJET          # Spectrum Calculator
     2   7.80   29-OCT-2009 12:50:36   # Version number
#         PDG         Width
DECAY        23     2.49520000E+00   # Z width (SM calculation)
DECAY        24     2.08500000E+00   # W width (SM calculation)
#
#         PDG            Width  
DECAY         6  1.14680779E+00   # TP    decays
#          BR          NDA       ID1       ID2       ID3       ID4
      3.33333343E-01    3            2        -1         5             # TP     -->  UP     DB     BT          
      3.33333343E-01    3            4        -3         5             # TP     -->  CH     SB     BT          
      1.11111112E-01    3          -11        12         5             # TP     -->  E+     NUE    BT          
      1.11111112E-01    3          -13        14         5             # TP     -->  MU+    NUM    BT          
      1.11111112E-01    3          -15        16         5             # TP     -->  TAU+   NUT    BT          
#         PDG         Width
DECAY   1000021  8.39288139E+00   # GLSS  decays
#          BR          NDA       ID1       ID2       ID3       ID4
      1.78044057E-03    3      1000024         1        -2             # GLSS   -->  W1SS+  DN     UB          
      1.78044057E-03    3     -1000024         2        -1             # GLSS   -->  W1SS-  UP     DB          
      1.78044057E-03    3      1000024         3        -4             # GLSS   -->  W1SS+  ST     CB          
      1.78044057E-03    3     -1000024         4        -3             # GLSS   -->  W1SS-  CH     SB          
      5.41535299E-03    3      1000024         5        -6             # GLSS   -->  W1SS+  BT     TB          
      5.41535299E-03    3     -1000024         6        -5             # GLSS   -->  W1SS-  TP     BB          
      4.65880401E-09    3      1000037         1        -2             # GLSS   -->  W2SS+  DN     UB          
      4.65880401E-09    3     -1000037         2        -1             # GLSS   -->  W2SS-  UP     DB          
      4.65880401E-09    3      1000037         3        -4             # GLSS   -->  W2SS+  ST     CB          
      4.65880401E-09    3     -1000037         4        -3             # GLSS   -->  W2SS-  CH     SB          
      7.74944929E-05    3      1000037         5        -6             # GLSS   -->  W2SS+  BT     TB          
      7.74944929E-05    3     -1000037         6        -5             # GLSS   -->  W2SS-  TP     BB          
      2.37882389E-08    2      1000022        21                       # GLSS   -->  Z1SS   GL                 
      8.90358526E-04    3      1000022         2        -2             # GLSS   -->  Z1SS   UP     UB          
      8.90320400E-04    3      1000022         1        -1             # GLSS   -->  Z1SS   DN     DB          
      8.90320400E-04    3      1000022         3        -3             # GLSS   -->  Z1SS   ST     SB          
      8.90358526E-04    3      1000022         4        -4             # GLSS   -->  Z1SS   CH     CB          
      2.82897754E-03    3      1000022         5        -5             # GLSS   -->  Z1SS   BT     BB          
      2.58584227E-03    3      1000022         6        -6             # GLSS   -->  Z1SS   TP     TB          
      5.43201122E-06    2      1000023        21                       # GLSS   -->  Z2SS   GL                 
      1.05553096E-04    3      1000023         2        -2             # GLSS   -->  Z2SS   UP     UB          
      3.01490745E-05    3      1000023         1        -1             # GLSS   -->  Z2SS   DN     DB          
      3.01490745E-05    3      1000023         3        -3             # GLSS   -->  Z2SS   ST     SB          
      1.05553096E-04    3      1000023         4        -4             # GLSS   -->  Z2SS   CH     CB          
      5.05145326E-05    3      1000023         5        -5             # GLSS   -->  Z2SS   BT     BB          
      2.41468788E-05    3      1000023         6        -6             # GLSS   -->  Z2SS   TP     TB          
      1.39328279E-06    2      1000025        21                       # GLSS   -->  Z3SS   GL                 
      1.02809183E-09    3      1000025         2        -2             # GLSS   -->  Z3SS   UP     UB          
      1.27557021E-09    3      1000025         1        -1             # GLSS   -->  Z3SS   DN     DB          
      1.27557021E-09    3      1000025         3        -3             # GLSS   -->  Z3SS   ST     SB          
      1.02809183E-09    3      1000025         4        -4             # GLSS   -->  Z3SS   CH     CB          
      8.59315264E-07    3      1000025         5        -5             # GLSS   -->  Z3SS   BT     BB          
      6.38451675E-05    3      1000025         6        -6             # GLSS   -->  Z3SS   TP     TB          
      1.75735317E-06    2      1000035        21                       # GLSS   -->  Z4SS   GL                 
      1.51869939E-09    3      1000035         2        -2             # GLSS   -->  Z4SS   UP     UB          
      1.91960359E-09    3      1000035         1        -1             # GLSS   -->  Z4SS   DN     DB          
      1.91960359E-09    3      1000035         3        -3             # GLSS   -->  Z4SS   ST     SB          
      1.51869939E-09    3      1000035         4        -4             # GLSS   -->  Z4SS   CH     CB          
      8.61070419E-07    3      1000035         5        -5             # GLSS   -->  Z4SS   BT     BB          
      5.50309378E-05    3      1000035         6        -6             # GLSS   -->  Z4SS   TP     TB          
      4.86220509E-01    2     -1000006         6                       # GLSS   -->  TB1    TP                 
      4.86220509E-01    2      1000006        -6                       # GLSS   -->  TP1    TB                 
#         PDG         Width
DECAY   1000002  1.36570038E+02   # UPL   decays
#          BR          NDA       ID1       ID2       ID3       ID4
      2.16114998E-01    2      1000022         2                       # UPL    -->  Z1SS   UP                 
      5.46360807E-03    2      1000023         2                       # UPL    -->  Z2SS   UP                 
      5.19567129E-06    2      1000025         2                       # UPL    -->  Z3SS   UP                 
      1.20580298E-05    2      1000035         2                       # UPL    -->  Z4SS   UP                 
      3.45998943E-01    2      1000021         2                       # UPL    -->  GLSS   UP                 
      4.32390332E-01    2      1000024         1                       # UPL    -->  W1SS+  DN                 
      1.49150792E-05    2      1000037         1                       # UPL    -->  W2SS+  DN                 
#         PDG         Width
DECAY   1000001  1.36577713E+02   # DNL   decays
#          BR          NDA       ID1       ID2       ID3       ID4
      2.16185883E-01    2      1000022         1                       # DNL    -->  Z1SS   DN                 
      5.37717436E-03    2      1000023         1                       # DNL    -->  Z2SS   DN                 
      6.92803405E-06    2      1000025         1                       # DNL    -->  Z3SS   DN                 
      2.72727193E-05    2      1000035         1                       # DNL    -->  Z4SS   DN                 
      3.46141487E-01    2      1000021         1                       # DNL    -->  GLSS   DN                 
      4.32162225E-01    2     -1000024         2                       # DNL    -->  W1SS-  UP                 
      9.91252818E-05    2     -1000037         2                       # DNL    -->  W2SS-  UP                 
#         PDG         Width
DECAY   1000003  1.36577713E+02   # STL   decays
#          BR          NDA       ID1       ID2       ID3       ID4
      2.16185883E-01    2      1000022         3                       # STL    -->  Z1SS   ST                 
      5.37717436E-03    2      1000023         3                       # STL    -->  Z2SS   ST                 
      6.92803405E-06    2      1000025         3                       # STL    -->  Z3SS   ST                 
      2.72727193E-05    2      1000035         3                       # STL    -->  Z4SS   ST                 
      3.46141487E-01    2      1000021         3                       # STL    -->  GLSS   ST                 
      4.32162136E-01    2     -1000024         4                       # STL    -->  W1SS-  CH                 
      9.91252527E-05    2     -1000037         4                       # STL    -->  W2SS-  CH                 
#         PDG         Width
DECAY   1000004  1.36570007E+02   # CHL   decays
#          BR          NDA       ID1       ID2       ID3       ID4
      2.16115013E-01    2      1000022         4                       # CHL    -->  Z1SS   CH                 
      5.46360854E-03    2      1000023         4                       # CHL    -->  Z2SS   CH                 
      5.19567084E-06    2      1000025         4                       # CHL    -->  Z3SS   CH                 
      1.20580289E-05    2      1000035         4                       # CHL    -->  Z4SS   CH                 
      3.45998883E-01    2      1000021         4                       # CHL    -->  GLSS   CH                 
      4.32390422E-01    2      1000024         3                       # CHL    -->  W1SS+  ST                 
      1.49150819E-05    2      1000037         3                       # CHL    -->  W2SS+  ST                 
#         PDG         Width
DECAY   1000005  1.05249138E+02   # BT1   decays
#          BR          NDA       ID1       ID2       ID3       ID4
      2.38156125E-01    2      1000022         5                       # BT1    -->  Z1SS   BT                 
      5.26340678E-03    2      1000023         5                       # BT1    -->  Z2SS   BT                 
      5.14380285E-04    2      1000025         5                       # BT1    -->  Z3SS   BT                 
      5.26740914E-04    2      1000035         5                       # BT1    -->  Z4SS   BT                 
      4.93684150E-02    2      1000021         5                       # BT1    -->  GLSS   BT                 
      4.75288540E-01    2     -1000024         6                       # BT1    -->  W1SS-  TP                 
      1.51981100E-01    2     -1000037         6                       # BT1    -->  W2SS-  TP                 
      7.89013505E-02    2          -24   1000006                       # BT1    -->  W-     TP1                
#         PDG         Width
DECAY   1000006  7.31644154E+00   # TP1   decays
#          BR          NDA       ID1       ID2       ID3       ID4
      1.65947573E-03    2      1000022         6                       # TP1    -->  Z1SS   TP                 
      7.03177869E-01    2      1000023         6                       # TP1    -->  Z2SS   TP                 
      6.67694882E-02    2      1000025         6                       # TP1    -->  Z3SS   TP                 
      7.12806508E-02    2      1000035         6                       # TP1    -->  Z4SS   TP                 
      2.42265221E-03    2      1000024         5                       # TP1    -->  W1SS+  BT                 
      1.54689953E-01    2      1000037         5                       # TP1    -->  W2SS+  BT                 
#         PDG         Width
DECAY   2000002  6.11724930E+01   # UPR   decays
#          BR          NDA       ID1       ID2       ID3       ID4
      5.05820239E-08    2      1000022         2                       # UPR    -->  Z1SS   UP                 
      1.95294186E-01    2      1000023         2                       # UPR    -->  Z2SS   UP                 
      1.13073963E-06    2      1000025         2                       # UPR    -->  Z3SS   UP                 
      2.78507105E-05    2      1000035         2                       # UPR    -->  Z4SS   UP                 
      8.04676831E-01    2      1000021         2                       # UPR    -->  GLSS   UP                 
#         PDG         Width
DECAY   2000001  5.44788399E+01   # DNR   decays
#          BR          NDA       ID1       ID2       ID3       ID4
      1.42852139E-08    2      1000022         1                       # DNR    -->  Z1SS   DN                 
      5.53518459E-02    2      1000023         1                       # DNR    -->  Z2SS   DN                 
      3.24071038E-07    2      1000025         1                       # DNR    -->  Z3SS   DN                 
      7.98214205E-06    2      1000035         1                       # DNR    -->  Z4SS   DN                 
      9.44639862E-01    2      1000021         1                       # DNR    -->  GLSS   DN                 
#         PDG         Width
DECAY   2000003  5.44788399E+01   # STR   decays
#          BR          NDA       ID1       ID2       ID3       ID4
      1.42852139E-08    2      1000022         3                       # STR    -->  Z1SS   ST                 
      5.53518459E-02    2      1000023         3                       # STR    -->  Z2SS   ST                 
      3.24071038E-07    2      1000025         3                       # STR    -->  Z3SS   ST                 
      7.98214205E-06    2      1000035         3                       # STR    -->  Z4SS   ST                 
      9.44639862E-01    2      1000021         3                       # STR    -->  GLSS   ST                 
#         PDG         Width
DECAY   2000004  6.11724663E+01   # CHR   decays
#          BR          NDA       ID1       ID2       ID3       ID4
      5.05820417E-08    2      1000022         4                       # CHR    -->  Z1SS   CH                 
      1.95294246E-01    2      1000023         4                       # CHR    -->  Z2SS   CH                 
      1.13073975E-06    2      1000025         4                       # CHR    -->  Z3SS   CH                 
      2.78507123E-05    2      1000035         4                       # CHR    -->  Z4SS   CH                 
      8.04676712E-01    2      1000021         4                       # CHR    -->  GLSS   CH                 
#         PDG         Width
DECAY   2000005  5.23730354E+01   # BT2   decays
#          BR          NDA       ID1       ID2       ID3       ID4
      5.08757751E-07    2      1000022         5                       # BT2    -->  Z1SS   BT                 
      5.69258668E-02    2      1000023         5                       # BT2    -->  Z2SS   BT                 
      2.11773906E-03    2      1000025         5                       # BT2    -->  Z3SS   BT                 
      2.12559197E-03    2      1000035         5                       # BT2    -->  Z4SS   BT                 
      9.32299554E-01    2      1000021         5                       # BT2    -->  GLSS   BT                 
      8.14021064E-07    2     -1000024         6                       # BT2    -->  W1SS-  TP                 
      4.23430419E-03    2     -1000037         6                       # BT2    -->  W2SS-  TP                 
      9.14958673E-06    2          -24   1000006                       # BT2    -->  W-     TP1                
      9.36272845E-04    2          -24   2000006                       # BT2    -->  W-     TP2                
      5.29082958E-04    2           23   1000005                       # BT2    -->  Z0     BT1                
      8.21066496E-04    2           25   1000005                       # BT2    -->  HL0    BT1                
#         PDG         Width
DECAY   2000006  1.10944275E+02   # TP2   decays
#          BR          NDA       ID1       ID2       ID3       ID4
      5.01419008E-02    2      1000021         6                       # TP2    -->  GLSS   TP                 
      4.54972774E-01    2      1000024         5                       # TP2    -->  W1SS+  BT                 
      1.09407085E-03    2      1000037         5                       # TP2    -->  W2SS+  BT                 
      4.12907191E-02    2           23   1000006                       # TP2    -->  Z0     TP1                
      6.98489174E-02    2           25   1000006                       # TP2    -->  HL0    TP1                
      2.26971105E-01    2      1000022         6                       # TP2    -->  Z1SS   TP                 
      5.41590014E-03    2      1000023         6                       # TP2    -->  Z2SS   TP                 
      7.56829157E-02    2      1000025         6                       # TP2    -->  Z3SS   TP                 
      7.45818168E-02    2      1000035         6                       # TP2    -->  Z4SS   TP                 
#         PDG         Width
DECAY   1000011  6.03626213E+01   # EL-   decays
#          BR          NDA       ID1       ID2       ID3       ID4
      3.17788392E-01    2      1000022        11                       # EL-    -->  Z1SS   E-                 
      4.65361848E-02    2      1000023        11                       # EL-    -->  Z2SS   E-                 
      1.93398037E-07    2      1000025        11                       # EL-    -->  Z3SS   E-                 
      1.53466658E-07    2      1000035        11                       # EL-    -->  Z4SS   E-                 
      6.35670066E-01    2     -1000024        12                       # EL-    -->  W1SS-  NUE                
      4.96752637E-06    2     -1000037        12                       # EL-    -->  W2SS-  NUE                
#         PDG         Width
DECAY   1000013  6.03626213E+01   # MUL-  decays
#          BR          NDA       ID1       ID2       ID3       ID4
      3.17788392E-01    2      1000022        13                       # MUL-   -->  Z1SS   MU-                
      4.65361848E-02    2      1000023        13                       # MUL-   -->  Z2SS   MU-                
      1.93398009E-07    2      1000025        13                       # MUL-   -->  Z3SS   MU-                
      1.53466644E-07    2      1000035        13                       # MUL-   -->  Z4SS   MU-                
      6.35670066E-01    2     -1000024        14                       # MUL-   -->  W1SS-  NUM                
      4.96752637E-06    2     -1000037        14                       # MUL-   -->  W2SS-  NUM                
#         PDG         Width
DECAY   1000015  1.15788412E+01   # TAU1- decays
#          BR          NDA       ID1       ID2       ID3       ID4
      2.27868445E-02    2      1000022        15                       # TAU1-  -->  Z1SS   TAU-               
      9.31210220E-01    2      1000023        15                       # TAU1-  -->  Z2SS   TAU-               
      9.76427254E-05    2      1000025        15                       # TAU1-  -->  Z3SS   TAU-               
      9.76330630E-05    2      1000035        15                       # TAU1-  -->  Z4SS   TAU-               
      4.56328578E-02    2     -1000024        16                       # TAU1-  -->  W1SS-  NUT                
      1.74803674E-04    2     -1000037        16                       # TAU1-  -->  W2SS-  NUT                
#         PDG         Width
DECAY   1000012  6.03600540E+01   # NUEL  decays
#          BR          NDA       ID1       ID2       ID3       ID4
      3.17979634E-01    2      1000022        12                       # NUEL   -->  Z1SS   NUE                
      4.62413840E-02    2      1000023        12                       # NUEL   -->  Z2SS   NUE                
      4.58366515E-07    2      1000025        12                       # NUEL   -->  Z3SS   NUE                
      2.48201877E-06    2      1000035        12                       # NUEL   -->  Z4SS   NUE                
      6.35775268E-01    2      1000024        11                       # NUEL   -->  W1SS+  E-                 
      7.38391748E-07    2      1000037        11                       # NUEL   -->  W2SS+  E-                 
#         PDG         Width
DECAY   1000014  6.03600540E+01   # NUML  decays
#          BR          NDA       ID1       ID2       ID3       ID4
      3.17979634E-01    2      1000022        14                       # NUML   -->  Z1SS   NUM                
      4.62413840E-02    2      1000023        14                       # NUML   -->  Z2SS   NUM                
      4.58366515E-07    2      1000025        14                       # NUML   -->  Z3SS   NUM                
      2.48201877E-06    2      1000035        14                       # NUML   -->  Z4SS   NUM                
      6.35775268E-01    2      1000024        13                       # NUML   -->  W1SS+  MU-                
      7.38391691E-07    2      1000037        13                       # NUML   -->  W2SS+  MU-                
#         PDG         Width
DECAY   1000016  6.02518616E+01   # NUTL  decays
#          BR          NDA       ID1       ID2       ID3       ID4
      3.18004012E-01    2      1000022        16                       # NUTL   -->  Z1SS   NUT                
      4.61171232E-02    2      1000023        16                       # NUTL   -->  Z2SS   NUT                
      4.36083639E-07    2      1000025        16                       # NUTL   -->  Z3SS   NUT                
      2.36079723E-06    2      1000035        16                       # NUTL   -->  Z4SS   NUT                
      6.35825992E-01    2      1000024        15                       # NUTL   -->  W1SS+  TAU-               
      5.00219940E-05    2      1000037        15                       # NUTL   -->  W2SS+  TAU-               
      5.51186341E-09    3      1000015        16       -15             # NUTL   -->  TAU1-  NUT    TAU+        
      5.51186341E-09    3      1000015        12       -11             # NUTL   -->  TAU1-  NUE    E+          
      5.51186341E-09    3      1000015        14       -13             # NUTL   -->  TAU1-  NUM    MU+         
      1.65355889E-08    3      1000015         2        -1             # NUTL   -->  TAU1-  UP     DB          
      1.65355889E-08    3      1000015         4        -3             # NUTL   -->  TAU1-  CH     SB          
#         PDG         Width
DECAY   2000011  1.09887323E+01   # ER-   decays
#          BR          NDA       ID1       ID2       ID3       ID4
      4.06626697E-07    2      1000022        11                       # ER-    -->  Z1SS   E-                 
      9.99993145E-01    2      1000023        11                       # ER-    -->  Z2SS   E-                 
      2.53165666E-07    2      1000025        11                       # ER-    -->  Z3SS   E-                 
      6.18133845E-06    2      1000035        11                       # ER-    -->  Z4SS   E-                 
#         PDG         Width
DECAY   2000013  1.09887323E+01   # MUR-  decays
#          BR          NDA       ID1       ID2       ID3       ID4
      4.06626697E-07    2      1000022        13                       # MUR-   -->  Z1SS   MU-                
      9.99993145E-01    2      1000023        13                       # MUR-   -->  Z2SS   MU-                
      2.53165638E-07    2      1000025        13                       # MUR-   -->  Z3SS   MU-                
      6.18133754E-06    2      1000035        13                       # MUR-   -->  Z4SS   MU-                
#         PDG         Width
DECAY   2000015  5.95760155E+01   # TAU2- decays
#          BR          NDA       ID1       ID2       ID3       ID4
      3.17017287E-01    2      1000022        15                       # TAU2-  -->  Z1SS   TAU-               
      4.88026328E-02    2      1000023        15                       # TAU2-  -->  Z2SS   TAU-               
      2.73865317E-05    2      1000025        15                       # TAU2-  -->  Z3SS   TAU-               
      2.83083154E-05    2      1000035        15                       # TAU2-  -->  Z4SS   TAU-               
      6.34115398E-01    2     -1000024        16                       # TAU2-  -->  W1SS-  NUT                
      9.01155363E-06    2     -1000037        16                       # TAU2-  -->  W2SS-  NUT                
#         PDG         Width
DECAY   1000023  1.67751741E-02   # Z2SS  decays
#          BR          NDA       ID1       ID2       ID3       ID4
      1.43435716E-06    2      1000022        22                       # Z2SS   -->  Z1SS   GM                 
      4.12028790E-01    2      1000024       -24                       # Z2SS   -->  W1SS+  W-                 
      4.12028790E-01    2     -1000024        24                       # Z2SS   -->  W1SS-  W+                 
      1.25459582E-02    2      1000022        23                       # Z2SS   -->  Z1SS   Z0                 
      1.37534400E-04    3      1000022         2        -2             # Z2SS   -->  Z1SS   UP     UB          
      1.35362687E-04    3      1000022         1        -1             # Z2SS   -->  Z1SS   DN     DB          
      1.35362687E-04    3      1000022         3        -3             # Z2SS   -->  Z1SS   ST     SB          
      1.37534400E-04    3      1000022         4        -4             # Z2SS   -->  Z1SS   CH     CB          
      2.64686474E-04    3      1000022         5        -5             # Z2SS   -->  Z1SS   BT     BB          
      2.43677851E-03    3      1000022        11       -11             # Z2SS   -->  Z1SS   E-     E+          
      2.43677851E-03    3      1000022        13       -13             # Z2SS   -->  Z1SS   MU-    MU+         
      2.45444034E-03    3      1000022        15       -15             # Z2SS   -->  Z1SS   TAU-   TAU+        
      2.43038801E-03    3      1000022        12       -12             # Z2SS   -->  Z1SS   NUE    ANUE        
      2.43038801E-03    3      1000022        14       -14             # Z2SS   -->  Z1SS   NUM    ANUM        
      2.44814297E-03    3      1000022        16       -16             # Z2SS   -->  Z1SS   NUT    ANUT        
      1.47947580E-01    2      1000022        25                       # Z2SS   -->  Z1SS   HL0                
#         PDG         Width
DECAY   1000025  3.34042091E+01   # Z3SS  decays
#          BR          NDA       ID1       ID2       ID3       ID4
      2.55822830E-08    2      1000022        22                       # Z3SS   -->  Z1SS   GM                 
      4.83566716E-08    2      1000023        22                       # Z3SS   -->  Z2SS   GM                 
      3.34244847E-01    2      1000024       -24                       # Z3SS   -->  W1SS+  W-                 
      3.34244847E-01    2     -1000024        24                       # Z3SS   -->  W1SS-  W+                 
      2.03299671E-01    2      1000022        23                       # Z3SS   -->  Z1SS   Z0                 
      6.88337237E-02    2      1000023        23                       # Z3SS   -->  Z2SS   Z0                 
      1.79756743E-09    3      1000022         2        -2             # Z3SS   -->  Z1SS   UP     UB          
      2.39660891E-09    3      1000022         1        -1             # Z3SS   -->  Z1SS   DN     DB          
      2.39660891E-09    3      1000022         3        -3             # Z3SS   -->  Z1SS   ST     SB          
      1.79756743E-09    3      1000022         4        -4             # Z3SS   -->  Z1SS   CH     CB          
      1.66399923E-06    3      1000022         5        -5             # Z3SS   -->  Z1SS   BT     BB          
      5.67608138E-09    3      1000022        11       -11             # Z3SS   -->  Z1SS   E-     E+          
      5.67608138E-09    3      1000022        13       -13             # Z3SS   -->  Z1SS   MU-    MU+         
      1.29890805E-06    3      1000022        15       -15             # Z3SS   -->  Z1SS   TAU-   TAU+        
      1.36810820E-08    3      1000022        12       -12             # Z3SS   -->  Z1SS   NUE    ANUE        
      1.36810820E-08    3      1000022        14       -14             # Z3SS   -->  Z1SS   NUM    ANUM        
      1.39018956E-08    3      1000022        16       -16             # Z3SS   -->  Z1SS   NUT    ANUT        
      1.07991836E-11    3      1000023         2        -2             # Z3SS   -->  Z2SS   UP     UB          
      6.11165285E-12    3      1000023         1        -1             # Z3SS   -->  Z2SS   DN     DB          
      6.11165285E-12    3      1000023         3        -3             # Z3SS   -->  Z2SS   ST     SB          
      1.07991836E-11    3      1000023         4        -4             # Z3SS   -->  Z2SS   CH     CB          
      1.77924750E-08    3      1000023         5        -5             # Z3SS   -->  Z2SS   BT     BB          
      5.09796538E-10    3      1000023        11       -11             # Z3SS   -->  Z2SS   E-     E+          
      5.09796538E-10    3      1000023        13       -13             # Z3SS   -->  Z2SS   MU-    MU+         
      3.63546519E-07    3      1000023        15       -15             # Z3SS   -->  Z2SS   TAU-   TAU+        
      5.25281874E-10    3      1000023        12       -12             # Z3SS   -->  Z2SS   NUE    ANUE        
      5.25281874E-10    3      1000023        14       -14             # Z3SS   -->  Z2SS   NUM    ANUM        
      5.37279332E-10    3      1000023        16       -16             # Z3SS   -->  Z2SS   NUT    ANUT        
      5.67544512E-02    2      1000022        25                       # Z3SS   -->  Z1SS   HL0                
      2.61912053E-03    2      1000023        25                       # Z3SS   -->  Z2SS   HL0                
#         PDG         Width
DECAY   1000035  2.81231899E+01   # Z4SS  decays
#          BR          NDA       ID1       ID2       ID3       ID4
      1.42337324E-08    2      1000022        22                       # Z4SS   -->  Z1SS   GM                 
      7.16618374E-08    2      1000023        22                       # Z4SS   -->  Z2SS   GM                 
      2.37072113E-15    2      1000025        22                       # Z4SS   -->  Z3SS   GM                 
      2.41025895E-01    2      1000024       -24                       # Z4SS   -->  W1SS+  W-                 
      2.41025895E-01    2     -1000024        24                       # Z4SS   -->  W1SS-  W+                 
      7.70204887E-02    2      1000022        23                       # Z4SS   -->  Z1SS   Z0                 
      3.33522051E-03    2      1000023        23                       # Z4SS   -->  Z2SS   Z0                 
      8.25272917E-09    3      1000022         2        -2             # Z4SS   -->  Z1SS   UP     UB          
      1.86636822E-08    3      1000022         1        -1             # Z4SS   -->  Z1SS   DN     DB          
      1.86636822E-08    3      1000022         3        -3             # Z4SS   -->  Z1SS   ST     SB          
      8.25272917E-09    3      1000022         4        -4             # Z4SS   -->  Z1SS   CH     CB          
      2.00527074E-06    3      1000022         5        -5             # Z4SS   -->  Z1SS   BT     BB          
      7.59525154E-09    3      1000022        11       -11             # Z4SS   -->  Z1SS   E-     E+          
      7.59525154E-09    3      1000022        13       -13             # Z4SS   -->  Z1SS   MU-    MU+         
      1.54117640E-06    3      1000022        15       -15             # Z4SS   -->  Z1SS   TAU-   TAU+        
      1.24878824E-07    3      1000022        12       -12             # Z4SS   -->  Z1SS   NUE    ANUE        
      1.24878824E-07    3      1000022        14       -14             # Z4SS   -->  Z1SS   NUM    ANUM        
      1.26674109E-07    3      1000022        16       -16             # Z4SS   -->  Z1SS   NUT    ANUT        
      5.41732825E-10    3      1000023         2        -2             # Z4SS   -->  Z2SS   UP     UB          
      1.03153035E-10    3      1000023         1        -1             # Z4SS   -->  Z2SS   DN     DB          
      1.03153035E-10    3      1000023         3        -3             # Z4SS   -->  Z2SS   ST     SB          
      5.41732825E-10    3      1000023         4        -4             # Z4SS   -->  Z2SS   CH     CB          
      2.10624069E-08    3      1000023         5        -5             # Z4SS   -->  Z2SS   BT     BB          
      1.82819822E-08    3      1000023        11       -11             # Z4SS   -->  Z2SS   E-     E+          
      1.82819822E-08    3      1000023        13       -13             # Z4SS   -->  Z2SS   MU-    MU+         
      4.50779112E-07    3      1000023        15       -15             # Z4SS   -->  Z2SS   TAU-   TAU+        
      7.25007521E-09    3      1000023        12       -12             # Z4SS   -->  Z2SS   NUE    ANUE        
      7.25007521E-09    3      1000023        14       -14             # Z4SS   -->  Z2SS   NUM    ANUM        
      7.38861727E-09    3      1000023        16       -16             # Z4SS   -->  Z2SS   NUT    ANUT        
      4.37684882E-13    3      1000025         2        -2             # Z4SS   -->  Z3SS   UP     UB          
      5.64397595E-13    3      1000025         1        -1             # Z4SS   -->  Z3SS   DN     DB          
      1.28033299E-13    3      1000025        11       -11             # Z4SS   -->  Z3SS   E-     E+          
      2.54746013E-13    3      1000025        12       -12             # Z4SS   -->  Z3SS   NUE    ANUE        
      2.54746013E-13    3      1000025        14       -14             # Z4SS   -->  Z3SS   NUM    ANUM        
      2.54745986E-13    3      1000025        16       -16             # Z4SS   -->  Z3SS   NUT    ANUT        
      3.21399957E-01    2      1000022        25                       # Z4SS   -->  Z1SS   HL0                
      1.16187990E-01    2      1000023        25                       # Z4SS   -->  Z2SS   HL0                
#         PDG         Width
DECAY   1000024  4.58214670E-15   # W1SS+ decays
#          BR          NDA       ID1       ID2       ID3       ID4
      1.00000000E+00    2      1000022         0                       # W1SS+  -->  Z1SS   PI+                
#         PDG         Width
DECAY   1000037  3.53645935E+01   # W2SS+ decays
#          BR          NDA       ID1       ID2       ID3       ID4
      2.08887734E-08    3      1000022         2        -1             # W2SS+  -->  Z1SS   UP     DB          
      2.08887734E-08    3      1000022         4        -3             # W2SS+  -->  Z1SS   CH     SB          
      8.94213485E-08    3      1000022       -11        12             # W2SS+  -->  Z1SS   E+     NUE         
      8.94213485E-08    3      1000022       -13        14             # W2SS+  -->  Z1SS   MU+    NUM         
      1.32762455E-06    3      1000022       -15        16             # W2SS+  -->  Z1SS   TAU+   NUT         
      3.31850588E-01    2      1000022        24                       # W2SS+  -->  Z1SS   W+                 
      1.10002632E-10    3      1000023         2        -1             # W2SS+  -->  Z2SS   UP     DB          
      1.10002632E-10    3      1000023         4        -3             # W2SS+  -->  Z2SS   CH     SB          
      6.32078523E-09    3      1000023       -11        12             # W2SS+  -->  Z2SS   E+     NUE         
      6.32078523E-09    3      1000023       -13        14             # W2SS+  -->  Z2SS   MU+    NUM         
      3.56626799E-07    3      1000023       -15        16             # W2SS+  -->  Z2SS   TAU+   NUT         
      6.75864220E-02    2      1000023        24                       # W2SS+  -->  Z2SS   W+                 
      9.32891542E-11    3      1000025         2        -1             # W2SS+  -->  Z3SS   UP     DB          
      9.32891542E-11    3      1000025         4        -3             # W2SS+  -->  Z3SS   CH     SB          
      3.10963894E-11    3      1000025       -11        12             # W2SS+  -->  Z3SS   E+     NUE         
      3.10963894E-11    3      1000025       -13        14             # W2SS+  -->  Z3SS   MU+    NUM         
      3.10969722E-11    3      1000025       -15        16             # W2SS+  -->  Z3SS   TAU+   NUT         
      3.04854440E-11    3      1000035         2        -1             # W2SS+  -->  Z4SS   UP     DB          
      3.04854440E-11    3      1000035         4        -3             # W2SS+  -->  Z4SS   CH     SB          
      1.01618245E-11    3      1000035       -11        12             # W2SS+  -->  Z4SS   E+     NUE         
      1.01618245E-11    3      1000035       -13        14             # W2SS+  -->  Z4SS   MU+    NUM         
      1.01620162E-11    3      1000035       -15        16             # W2SS+  -->  Z4SS   TAU+   NUT         
      2.91228533E-01    2      1000024        23                       # W2SS+  -->  W1SS+  Z0                 
      6.56537802E-09    3      1000024         1        -1             # W2SS+  -->  W1SS+  DN     DB          
      6.56537802E-09    3      1000024         3        -3             # W2SS+  -->  W1SS+  ST     SB          
      4.35905925E-08    3      1000024         2        -2             # W2SS+  -->  W1SS+  UP     UB          
      4.35905925E-08    3      1000024         4        -4             # W2SS+  -->  W1SS+  CH     CB          
      1.75145175E-07    3      1000024        12       -12             # W2SS+  -->  W1SS+  NUE    ANUE        
      1.75145175E-07    3      1000024        14       -14             # W2SS+  -->  W1SS+  NUM    ANUM        
      1.93239600E-07    3      1000024        16       -16             # W2SS+  -->  W1SS+  NUT    ANUT        
      2.64664290E-08    3      1000024        11       -11             # W2SS+  -->  W1SS+  E-     E+          
      2.64664290E-08    3      1000024        13       -13             # W2SS+  -->  W1SS+  MU-    MU+         
      2.68692144E-08    3      1000024        15       -15             # W2SS+  -->  W1SS+  TAU-   TAU+        
      3.09331864E-01    2      1000024        25                       # W2SS+  -->  W1SS+  HL0                
#         PDG         Width
DECAY        25  4.20501363E-03   # HL0   decays
#          BR          NDA       ID1       ID2       ID3       ID4
      4.74105910E-09    2           11       -11                       # HL0    -->  E-     E+                 
      2.00175113E-04    2           13       -13                       # HL0    -->  MU-    MU+                
      5.72544299E-02    2           15       -15                       # HL0    -->  TAU-   TAU+               
      5.94883295E-06    2            1        -1                       # HL0    -->  DN     DB                 
      2.40362668E-03    2            3        -3                       # HL0    -->  ST     SB                 
      7.85845041E-01    2            5        -5                       # HL0    -->  BT     BB                 
      1.90152196E-06    2            2        -2                       # HL0    -->  UP     UB                 
      3.56921144E-02    2            4        -4                       # HL0    -->  CH     CB                 
      1.90661789E-03    2           22        22                       # HL0    -->  GM     GM                 
      4.07144949E-02    2           21        21                       # HL0    -->  GL     GL                 
      3.89605411E-03    3           24        11       -12             # HL0    -->  W+     E-     ANUE        
      3.89605411E-03    3           24        13       -14             # HL0    -->  W+     MU-    ANUM        
      3.89605411E-03    3           24        15       -16             # HL0    -->  W+     TAU-   ANUT        
      1.16881626E-02    3           24        -2         1             # HL0    -->  W+     UB     DN          
      1.16881626E-02    3           24        -4         3             # HL0    -->  W+     CB     ST          
      3.89605411E-03    3          -24       -11        12             # HL0    -->  W-     E+     NUE         
      3.89605411E-03    3          -24       -13        14             # HL0    -->  W-     MU+    NUM         
      3.89605411E-03    3          -24       -15        16             # HL0    -->  W-     TAU+   NUT         
      1.16881626E-02    3          -24         2        -1             # HL0    -->  W-     UP     DB          
      1.16881626E-02    3          -24         4        -3             # HL0    -->  W-     CH     SB          
      3.99868906E-04    3           23        12       -12             # HL0    -->  Z0     NUE    ANUE        
      3.99868906E-04    3           23        14       -14             # HL0    -->  Z0     NUM    ANUM        
      3.99868906E-04    3           23        16       -16             # HL0    -->  Z0     NUT    ANUT        
      2.01250004E-04    3           23        11       -11             # HL0    -->  Z0     E-     E+          
      2.01250004E-04    3           23        13       -13             # HL0    -->  Z0     MU-    MU+         
      2.01250004E-04    3           23        15       -15             # HL0    -->  Z0     TAU-   TAU+        
      6.89465494E-04    3           23         2        -2             # HL0    -->  Z0     UP     UB          
      6.89465494E-04    3           23         4        -4             # HL0    -->  Z0     CH     CB          
      8.88201350E-04    3           23         1        -1             # HL0    -->  Z0     DN     DB          
      8.88201350E-04    3           23         3        -3             # HL0    -->  Z0     ST     SB          
      8.88201350E-04    3           23         5        -5             # HL0    -->  Z0     BT     BB          
#         PDG         Width
DECAY        35  3.90653229E+01   # HH0   decays
#          BR          NDA       ID1       ID2       ID3       ID4
      7.42093664E-10    2           11       -11                       # HH0    -->  E-     E+                 
      3.13325363E-05    2           13       -13                       # HH0    -->  MU-    MU+                
      8.97411443E-03    2           15       -15                       # HH0    -->  TAU-   TAU+               
      8.97018310E-07    2            1        -1                       # HH0    -->  DN     DB                 
      3.62440856E-04    2            3        -3                       # HH0    -->  ST     SB                 
      4.42398861E-02    2            5        -5                       # HH0    -->  BT     BB                 
      4.59687649E-10    2            2        -2                       # HH0    -->  UP     UB                 
      5.26821668E-06    2            4        -4                       # HH0    -->  CH     CB                 
      2.76814520E-01    2            6        -6                       # HH0    -->  TP     TB                 
      2.73119696E-07    2           22        22                       # HH0    -->  GM     GM                 
      2.27542296E-05    2           21        21                       # HH0    -->  GL     GL                 
      2.46651489E-05    2           24       -24                       # HH0    -->  W+     W-                 
      1.26573077E-05    2           23        23                       # HH0    -->  Z0     Z0                 
      3.34616430E-04    2      1000022   1000022                       # HH0    -->  Z1SS   Z1SS               
      1.88045669E-04    2      1000022   1000023                       # HH0    -->  Z1SS   Z2SS               
      1.81244805E-01    2      1000022   1000025                       # HH0    -->  Z1SS   Z3SS               
      4.20487635E-02    2      1000022   1000035                       # HH0    -->  Z1SS   Z4SS               
      1.31482948E-05    2      1000023   1000023                       # HH0    -->  Z2SS   Z2SS               
      6.84955216E-04    2      1000024  -1000024                       # HH0    -->  W1SS+  W1SS-              
      2.22445175E-01    2      1000024  -1000037                       # HH0    -->  W1SS+  W2SS-              
      2.22445175E-01    2     -1000024   1000037                       # HH0    -->  W1SS-  W2SS+              
      1.06505948E-04    2           25        25                       # HH0    -->  HL0    HL0                
#         PDG         Width
DECAY        36  3.82270851E+01   # HA0   decays
#          BR          NDA       ID1       ID2       ID3       ID4
      7.53426432E-10    2           11       -11                       # HA0    -->  E-     E+                 
      3.18110215E-05    2           13       -13                       # HA0    -->  MU-    MU+                
      9.11116321E-03    2           15       -15                       # HA0    -->  TAU-   TAU+               
      9.10752419E-07    2            1        -1                       # HA0    -->  DN     DB                 
      3.67989996E-04    2            3        -3                       # HA0    -->  ST     SB                 
      4.49172519E-02    2            5        -5                       # HA0    -->  BT     BB                 
      4.66258088E-10    2            2        -2                       # HA0    -->  UP     UB                 
      5.34697119E-06    2            4        -4                       # HA0    -->  CH     CB                 
      2.81444877E-01    2            6        -6                       # HA0    -->  TP     TB                 
      1.78645038E-07    2           22        22                       # HA0    -->  GM     GM                 
      2.62513458E-05    2           21        21                       # HA0    -->  GL     GL                 
      4.52475098E-04    2      1000022   1000022                       # HA0    -->  Z1SS   Z1SS               
      3.67680506E-04    2      1000022   1000023                       # HA0    -->  Z1SS   Z2SS               
      4.12358008E-02    2      1000022   1000025                       # HA0    -->  Z1SS   Z3SS               
      1.79997027E-01    2      1000022   1000035                       # HA0    -->  Z1SS   Z4SS               
      6.61986633E-05    2      1000023   1000023                       # HA0    -->  Z2SS   Z2SS               
      1.01140200E-03    2      1000024  -1000024                       # HA0    -->  W1SS+  W1SS-              
      2.20469266E-01    2      1000024  -1000037                       # HA0    -->  W1SS+  W2SS-              
      2.20469266E-01    2     -1000024   1000037                       # HA0    -->  W1SS-  W2SS+              
      2.50248358E-05    2           25        23                       # HA0    -->  HL0    Z0                 
#         PDG         Width
DECAY        37  3.82098503E+01   # H+    decays
#          BR          NDA       ID1       ID2       ID3       ID4
      7.58776486E-10    2           12       -11                       # H+     -->  NUE    E+                 
      3.20369109E-05    2           14       -13                       # H+     -->  NUM    MU+                
      9.17586125E-03    2           16       -15                       # H+     -->  NUT    TAU+               
      8.54842312E-07    2            2        -1                       # H+     -->  UP     DB                 
      3.50235670E-04    2            4        -3                       # H+     -->  CH     SB                 
      3.05757046E-01    2            6        -5                       # H+     -->  TP     BB                 
      7.69924270E-07    2      1000024   1000022                       # H+     -->  W1SS+  Z1SS               
      5.83354325E-04    2      1000024   1000023                       # H+     -->  W1SS+  Z2SS               
      2.28436112E-01    2      1000024   1000025                       # H+     -->  W1SS+  Z3SS               
      2.28131294E-01    2      1000024   1000035                       # H+     -->  W1SS+  Z4SS               
      2.27507144E-01    2      1000037   1000022                       # H+     -->  W2SS+  Z1SS               
      2.52094324E-05    2           25        24                       # H+     -->  HL0    W+                 
