#
#                              ======================
#                              | THE SUSYHIT OUTPUT |
#                              ======================
#
#
#              ------------------------------------------------------
#              |     This is the output of the SUSY-HIT package     |
#              |  created by A.Djouadi, M.Muehlleitner and M.Spira. |
#              |  In case of problems with SUSY-HIT email to        |
#              |           margarete.muehlleitner@cern.ch           |
#              |           michael.spira@psi.ch                     |
#              |           abdelhak.djouadi@cern.ch                 |
#              ------------------------------------------------------
#
#              ------------------------------------------------------
#              |  SUSY Les Houches Accord - MSSM Spectrum + Decays  |
#              |              based on the decay programs           |
#              |                                                    |
#              |                     SDECAY 1.3b                    |
#              |                                                    |
#              |  Authors: M.Muhlleitner, A.Djouadi and Y.Mambrini  |
#              |  Ref.:    Comput.Phys.Commun.168(2005)46           |
#              |           [hep-ph/0311167]                         |
#              |                                                    |
#              |                     HDECAY 3.4                     |
#              |                                                    |
#              |  By: A.Djouadi,J.Kalinowski,M.Muhlleitner,M.Spira  |
#              |  Ref.:    Comput.Phys.Commun.108(1998)56           |
#              |           [hep-ph/9704448]                         |
#              |                                                    |
#              |                                                    |
#              |  If not stated otherwise all DRbar couplings and   |
#              |  soft SUSY breaking masses are given at the scale  |
#              |  Q=  0.91187600E+02
#              |                                                    |
#              ------------------------------------------------------
#
#
BLOCK DCINFO  # Decay Program information
     1   SDECAY/HDECAY # decay calculator
     2   1.3b  /3.4    # version number
#
BLOCK SPINFO  # Spectrum calculator information
     1   SuSpect     # RGE +Spectrum calculator            
     2   2.41         # version number                     
#
BLOCK MODSEL  # Model selection
     1     0   # #general MSSM low scale                           
#
BLOCK SMINPUTS  # Standard Model inputs
         1     1.27934000E+02   # alpha_em^-1(M_Z)^MSbar
         2     1.16639000E-05   # G_F [GeV^-2]
         3     1.17200000E-01   # alpha_S(M_Z)^MSbar
         4     9.11870000E+01   # M_Z pole mass
         5     4.25000000E+00   # mb(mb)^MSbar
         6     1.72500000E+02   # mt pole mass
         7     1.77700000E+00   # mtau pole mass
#
BLOCK MINPAR  # Input parameters - minimal models
#
BLOCK EXTPAR  # Input parameters - non-minimal models
         0     9.11876000E+01   # EWSB                
         1     3.00000000E+02   # M_1                 
         2     1.00000000E+05   # M_2                 
         3     1.00000000E+05   # M_3                 
        11     0.00000000E+00   # A_t                 
        12     0.00000000E+00   # A_b                 
        13     0.00000000E+00   # A_tau               
        14     0.00000000E+00   # A_u                 
        15     0.00000000E+00   # A_d                 
        16     0.00000000E+00   # A_e                 
        23     3.50000000E+03   # mu(EWSB)            
        25     1.50000000E+00   # tanbeta(in)         
        26     2.00000000E+03   # MA_pole             
        31     1.00000000E+05   # M_eL                
        32     1.00000000E+05   # M_muL               
        33     1.00000000E+05   # M_tauL              
        34     1.00000000E+05   # M_eR                
        35     1.00000000E+05   # M_muR               
        36     1.00000000E+05   # M_tauR              
        41     1.30000000E+03   # M_q1L               
        42     1.30000000E+03   # M_q2L               
        43     1.30000000E+03   # M_q3L               
        44     1.00000000E+05   # M_uR                
        45     1.00000000E+05   # M_cR                
        46     1.00000000E+05   # M_tR                
        47     1.30000000E+03   # M_dR                
        48     1.30000000E+03   # M_sR                
        49     1.30000000E+03   # M_bR                
#
BLOCK MASS  # Mass Spectrum
# PDG code           mass       particle
        24     8.05817773E+01   # W+
        25     1.25000000E+02   # h
        35     2.00397932E+03   # H
        36     2.00000000E+03   # A
        37     2.02369944E+03   # H+
         5     4.87877839E+00   # b-quark pole mass calculated from mb(mb)_Msbar
   1000001     1.30051144E+03   # ~d_L
   2000001     1.30009842E+03   # ~d_R
   1000002     1.29958682E+03   # ~u_L
   2000002     9.99999974E+04   # ~u_R
   1000003     1.30051144E+03   # ~s_L
   2000003     1.30009842E+03   # ~s_R
   1000004     1.29958682E+03   # ~c_L
   2000004     9.99999974E+04   # ~c_R
   1000005     1.29507890E+03   # ~b_1
   2000005     1.30551518E+03   # ~b_2
   1000006     1.30792473E+03   # ~t_1
   2000006     1.00000106E+05   # ~t_2
   1000011     1.00000004E+05   # ~e_L
   2000011     1.00000004E+05   # ~e_R
   1000012     9.99999921E+04   # ~nu_eL
   1000013     1.00000004E+05   # ~mu_L
   2000013     1.00000004E+05   # ~mu_R
   1000014     9.99999921E+04   # ~nu_muL
   1000015     9.99999574E+04   # ~tau_1
   2000015     1.00000051E+05   # ~tau_2
   1000016     9.99999921E+04   # ~nu_tauL
   1000021     1.00000000E+05   # ~g
   1000022     2.99420522E+02   # ~chi_10
   1000023    -3.50002253E+03   # ~chi_20
   1000025     3.50053740E+03   # ~chi_30
   1000035     1.00000065E+05   # ~chi_40
   1000024     3.49994004E+03   # ~chi_1+
   1000037     1.00000065E+05   # ~chi_2+
   1000039     1.00000000E-09   # ~gravitino
#
BLOCK NMIX  # Neutralino Mixing Matrix
  1  1     9.99903669E-01   # N_11
  1  2    -1.02842208E-05   # N_12
  1  3     1.13087507E-02   # N_13
  1  4    -8.04763911E-03   # N_14
  2  1     2.30594713E-03   # N_21
  2  2    -1.49819690E-04   # N_22
  2  3    -7.07093515E-01   # N_23
  2  4    -7.07116271E-01   # N_24
  3  1     1.36870379E-02   # N_31
  3  2     8.03306542E-04   # N_32
  3  3    -7.07029462E-01   # N_33
  3  4     7.07051172E-01   # N_34
  4  1     3.66181670E-07   # N_41
  4  2    -9.99999666E-01   # N_42
  4  3    -4.62141317E-04   # N_43
  4  4     6.74001761E-04   # N_44
#
BLOCK UMIX  # Chargino Mixing Matrix U
  1  1    -6.53566312E-04   # U_11
  1  2     9.99999786E-01   # U_12
  2  1     9.99999786E-01   # U_21
  2  2     6.53566312E-04   # U_22
#
BLOCK VMIX  # Chargino Mixing Matrix V
  1  1    -9.53182344E-04   # V_11
  1  2     9.99999546E-01   # V_12
  2  1     9.99999546E-01   # V_21
  2  2     9.53182344E-04   # V_22
#
BLOCK STOPMIX  # Stop Mixing Matrix
  1  1     9.99999999E-01   # cos(theta_t)
  1  2     4.47213589E-05   # sin(theta_t)
  2  1    -4.47213589E-05   # -sin(theta_t)
  2  2     9.99999999E-01   # cos(theta_t)
#
BLOCK SBOTMIX  # Sbottom Mixing Matrix
  1  1     6.92973589E-01   # cos(theta_b)
  1  2     7.20962971E-01   # sin(theta_b)
  2  1    -7.20962971E-01   # -sin(theta_b)
  2  2     6.92973589E-01   # cos(theta_b)
#
BLOCK STAUMIX  # Stau Mixing Matrix
  1  1     7.06147945E-01   # cos(theta_tau)
  1  2     7.08064319E-01   # sin(theta_tau)
  2  1    -7.08064319E-01   # -sin(theta_tau)
  2  2     7.06147945E-01   # cos(theta_tau)
#
BLOCK ALPHA  # Higgs mixing
          -5.90269773E-01   # Mixing angle in the neutral Higgs boson sector
#
BLOCK HMIX Q=  9.11876000E+01  # DRbar Higgs Parameters
         1     3.50000000E+03   # mu(Q)               
         2     1.49999982E+00   # tanbeta(Q)          
         3     2.54858446E+02   # vev(Q)              
         4    -6.83105754E+07   # MA^2(Q)             
#
BLOCK GAUGE Q=  9.11876000E+01  # The gauge couplings
     1     3.50606161E-01   # gprime(Q) DRbar
     2     6.20430822E-01   # g(Q) DRbar
     3     1.02657273E+00   # g3(Q) DRbar
#
BLOCK AU Q=  9.11876000E+01  # The trilinear couplings
  1  1     0.00000000E+00   # A_u(Q) DRbar
  2  2     0.00000000E+00   # A_c(Q) DRbar
  3  3     0.00000000E+00   # A_t(Q) DRbar
#
BLOCK AD Q=  9.11876000E+01  # The trilinear couplings
  1  1     0.00000000E+00   # A_d(Q) DRbar
  2  2     0.00000000E+00   # A_s(Q) DRbar
  3  3     0.00000000E+00   # A_b(Q) DRbar
#
BLOCK AE Q=  9.11876000E+01  # The trilinear couplings
  1  1     0.00000000E+00   # A_e(Q) DRbar
  2  2     0.00000000E+00   # A_mu(Q) DRbar
  3  3     0.00000000E+00   # A_tau(Q) DRbar
#
BLOCK Yu Q=  9.11876000E+01  # The Yukawa couplings
  1  1     0.00000000E+00   # y_u(Q) DRbar
  2  2     0.00000000E+00   # y_c(Q) DRbar
  3  3     9.83617980E-01   # y_t(Q) DRbar
#
BLOCK Yd Q=  9.11876000E+01  # The Yukawa couplings
  1  1     0.00000000E+00   # y_d(Q) DRbar
  2  2     0.00000000E+00   # y_s(Q) DRbar
  3  3     2.58372717E-02   # y_b(Q) DRbar
#
BLOCK Ye Q=  9.11876000E+01  # The Yukawa couplings
  1  1     0.00000000E+00   # y_e(Q) DRbar
  2  2     0.00000000E+00   # y_mu(Q) DRbar
  3  3     1.77401610E-02   # y_tau(Q) DRbar
#
BLOCK MSOFT Q=  9.11876000E+01  # The soft SUSY breaking masses at the scale Q
         1     3.00000000E+02   # M_1                 
         2     1.00000000E+05   # M_2                 
         3     1.00000000E+05   # M_3                 
        14     0.00000000E+00   # A_u                 
        15     0.00000000E+00   # A_d                 
        16     0.00000000E+00   # A_e                 
        21     6.33065389E+08   # M^2_Hd              
        22    -1.14732808E+09   # M^2_Hu              
        31     1.00000000E+05   # M_eL                
        32     1.00000000E+05   # M_muL               
        33     1.00000000E+05   # M_tauL              
        34     1.00000000E+05   # M_eR                
        35     1.00000000E+05   # M_muR               
        36     1.00000000E+05   # M_tauR              
        41     1.30000000E+03   # M_q1L               
        42     1.30000000E+03   # M_q2L               
        43     1.30000000E+03   # M_q3L               
        44     1.00000000E+05   # M_uR                
        45     1.00000000E+05   # M_cR                
        46     1.00000000E+05   # M_tR                
        47     1.30000000E+03   # M_dR                
        48     1.30000000E+03   # M_sR                
        49     1.30000000E+03   # M_bR                
#
#
#
#                             =================
#                             |The decay table|
#                             =================
#
# - The QCD corrections to the decays gluino -> squark  + quark
#                                     squark -> gaugino + quark_prime
#                                     squark -> squark_prime + Higgs
#                                     squark -> gluino  + quark
#   are included.
#
# - The multi-body decays for the inos, stops and sbottoms are included.
#
# - The loop induced decays for the gluino, neutralinos and stops
#   are included.
#
# - The SUSY decays of the top quark are included.
#
# - Possible decays of the NLSP in GMSB models are included.
#
#
#         PDG            Width
DECAY         6     1.32863859E+00   # top decays
#          BR         NDA      ID1       ID2
     1.00000000E+00    2           5        24   # BR(t ->  b    W+)
#
#         PDG            Width
DECAY   1000021     1.E-04   # gluino decays (OJ Mods)
#          BR         NDA      ID1       ID2
    -5.74363035E-03    2     1000001        -1   # BR(~g -> ~d_L  db)
    -5.74363035E-03    2    -1000001         1   # BR(~g -> ~d_L* d )
    -5.74363158E-03    2     2000001        -1   # BR(~g -> ~d_R  db)
    -5.74363158E-03    2    -2000001         1   # BR(~g -> ~d_R* d )
    -5.74363311E-03    2     1000002        -2   # BR(~g -> ~u_L  ub)
    -5.74363311E-03    2    -1000002         2   # BR(~g -> ~u_L* u )
    -1.55360310E-17    2     2000002        -2   # BR(~g -> ~u_R  ub)
    -1.55360310E-17    2    -2000002         2   # BR(~g -> ~u_R* u )
    -5.74363035E-03    2     1000003        -3   # BR(~g -> ~s_L  sb)
    -5.74363035E-03    2    -1000003         3   # BR(~g -> ~s_L* s )
    -5.74363158E-03    2     2000003        -3   # BR(~g -> ~s_R  sb)
    -5.74363158E-03    2    -2000003         3   # BR(~g -> ~s_R* s )
    -5.74363311E-03    2     1000004        -4   # BR(~g -> ~c_L  cb)
    -5.74363311E-03    2    -1000004         4   # BR(~g -> ~c_L* c )
    -1.55360310E-17    2     2000004        -4   # BR(~g -> ~c_R  cb)
    -1.55360310E-17    2    -2000004         4   # BR(~g -> ~c_R* c )
     3.17924509E-01    2     1000005        -5   # BR(~g -> ~b_1  bb)
     3.17924509E-01    2    -1000005         5   # BR(~g -> ~b_1* b )
     3.02551734E-01    2     2000005        -5   # BR(~g -> ~b_2  bb)
     3.02551734E-01    2    -2000005         5   # BR(~g -> ~b_2* b )
    -5.65227805E-03    2     1000006        -6   # BR(~g -> ~t_1  tb)
    -5.65227805E-03    2    -1000006         6   # BR(~g -> ~t_1* t )
    -1.60724350E-01    2     1000039        21   # BR(~g -> ~G g)
#
#         PDG            Width
DECAY   1000006     1.88017580E-01   # stop1 decays
#          BR         NDA      ID1       ID2
     1.00000000E+00    2     1000022         6   # BR(~t_1 -> ~chi_10 t )
#
#         PDG            Width
DECAY   2000006    -1.36857614E+04   # stop2 decays
#          BR         NDA      ID1       ID2
    -1.52250209E-02    2     1000022         6   # BR(~t_2 -> ~chi_10 t )
    -3.63871528E-02    2     1000023         6   # BR(~t_2 -> ~chi_20 t )
    -3.63826552E-02    2     1000025         6   # BR(~t_2 -> ~chi_30 t )
     1.08672216E+00    2     1000024         5   # BR(~t_2 -> ~chi_1+ b )
     9.97929149E-04    2     1000006        25   # BR(~t_2 -> ~t_1    h )
    -1.04465907E-03    2     1000006        35   # BR(~t_2 -> ~t_1    H )
    -1.04285361E-03    2     1000006        36   # BR(~t_2 -> ~t_1    A )
    -9.82220063E-04    2     1000005        37   # BR(~t_2 -> ~b_1    H+)
    -1.10345486E-03    2     2000005        37   # BR(~t_2 -> ~b_2    H+)
     7.14292161E-04    2     1000006        23   # BR(~t_2 -> ~t_1    Z )
     1.79298443E-03    2     1000005        24   # BR(~t_2 -> ~b_1    W+)
     1.94065578E-03    2     2000005        24   # BR(~t_2 -> ~b_2    W+)
#
#         PDG            Width
DECAY   1000005    -1.14570655E+01   # sbottom1 decays
#          BR         NDA      ID1       ID2
     1.00000000E+00    2     1000022         5   # BR(~b_1 -> ~chi_10 b )
#
#         PDG            Width
DECAY   2000005    -1.10204058E+01   # sbottom2 decays
#          BR         NDA      ID1       ID2
     1.00000000E+00    2     1000022         5   # BR(~b_2 -> ~chi_10 b )
#
#         PDG            Width
DECAY   1000002     1.92366624E-01   # sup_L decays
#          BR         NDA      ID1       ID2
     1.00000000E+00    2     1000022         2   # BR(~u_L -> ~chi_10 u)
#
#         PDG            Width
DECAY   2000002     2.08378645E+02   # sup_R decays
#          BR         NDA      ID1       ID2
     9.99807559E-01    2     1000022         2   # BR(~u_R -> ~chi_10 u)
     5.31155928E-06    2     1000023         2   # BR(~u_R -> ~chi_20 u)
     1.87129425E-04    2     1000025         2   # BR(~u_R -> ~chi_30 u)
#
#         PDG            Width
DECAY   1000001     1.92568273E-01   # sdown_L decays
#          BR         NDA      ID1       ID2
     1.00000000E+00    2     1000022         1   # BR(~d_L -> ~chi_10 d)
#
#         PDG            Width
DECAY   2000001     7.69903804E-01   # sdown_R decays
#          BR         NDA      ID1       ID2
     1.00000000E+00    2     1000022         1   # BR(~d_R -> ~chi_10 d)
#
#         PDG            Width
DECAY   1000004     1.92366624E-01   # scharm_L decays
#          BR         NDA      ID1       ID2
     1.00000000E+00    2     1000022         4   # BR(~c_L -> ~chi_10 c)
#
#         PDG            Width
DECAY   2000004     2.08378645E+02   # scharm_R decays
#          BR         NDA      ID1       ID2
     9.99807559E-01    2     1000022         4   # BR(~c_R -> ~chi_10 c)
     5.31155928E-06    2     1000023         4   # BR(~c_R -> ~chi_20 c)
     1.87129425E-04    2     1000025         4   # BR(~c_R -> ~chi_30 c)
#
#         PDG            Width
DECAY   1000003     1.92568273E-01   # sstrange_L decays
#          BR         NDA      ID1       ID2
     1.00000000E+00    2     1000022         3   # BR(~s_L -> ~chi_10 s)
#
#         PDG            Width
DECAY   2000003     7.69903804E-01   # sstrange_R decays
#          BR         NDA      ID1       ID2
     1.00000000E+00    2     1000022         3   # BR(~s_R -> ~chi_10 s)
#
#         PDG            Width
DECAY   1000011     1.22273924E+02   # selectron_L decays
#          BR         NDA      ID1       ID2
     9.99765464E-01    2     1000022        11   # BR(~e_L -> ~chi_10 e-)
     4.15482843E-06    2     1000023        11   # BR(~e_L -> ~chi_20 e-)
     2.27712480E-04    2     1000025        11   # BR(~e_L -> ~chi_30 e-)
     2.66868750E-06    2    -1000024        12   # BR(~e_L -> ~chi_1- nu_e)
#
#         PDG            Width
DECAY   2000011     4.89092782E+02   # selectron_R decays
#          BR         NDA      ID1       ID2
     9.99807816E-01    2     1000022        11   # BR(~e_R -> ~chi_10 e-)
     5.30446997E-06    2     1000023        11   # BR(~e_R -> ~chi_20 e-)
     1.86879615E-04    2     1000025        11   # BR(~e_R -> ~chi_30 e-)
#
#         PDG            Width
DECAY   1000013     1.22273924E+02   # smuon_L decays
#          BR         NDA      ID1       ID2
     9.99765464E-01    2     1000022        13   # BR(~mu_L -> ~chi_10 mu-)
     4.15482843E-06    2     1000023        13   # BR(~mu_L -> ~chi_20 mu-)
     2.27712480E-04    2     1000025        13   # BR(~mu_L -> ~chi_30 mu-)
     2.66868750E-06    2    -1000024        14   # BR(~mu_L -> ~chi_1- nu_mu)
#
#         PDG            Width
DECAY   2000013     4.89092782E+02   # smuon_R decays
#          BR         NDA      ID1       ID2
     9.99807816E-01    2     1000022        13   # BR(~mu_R -> ~chi_10 mu-)
     5.30446997E-06    2     1000023        13   # BR(~mu_R -> ~chi_20 mu-)
     1.86879615E-04    2     1000025        13   # BR(~mu_R -> ~chi_30 mu-)
#
#         PDG            Width
DECAY   1000015     1.18200595E+04   # stau_1 decays
#          BR         NDA      ID1       ID2
     2.59066291E-02    2     1000022        15   # BR(~tau_1 -> ~chi_10  tau-)
     2.52079419E-05    2     1000023        15   # BR(~tau_1 -> ~chi_20  tau-)
     2.50618404E-05    2     1000025        15   # BR(~tau_1 -> ~chi_30  tau-)
     2.77130036E-05    2    -1000024        16   # BR(~tau_1 -> ~chi_1-  nu_tau)
     9.74015388E-01    2     1000039        15   # BR(~tau_1 -> ~G       tau-)
#
#         PDG            Width
DECAY   2000015     3.06100755E+02   # stau_2 decays
#          BR         NDA      ID1       ID2
     9.96489850E-01    2     1000022        15   # BR(~tau_2 -> ~chi_10  tau-)
     1.07705977E-03    2     1000023        15   # BR(~tau_2 -> ~chi_20  tau-)
     1.46175657E-03    2     1000025        15   # BR(~tau_2 -> ~chi_30  tau-)
     9.71333728E-04    2    -1000024        16   # BR(~tau_2 -> ~chi_1-  nu_tau)
#
#         PDG            Width
DECAY   1000012     1.22273983E+02   # snu_eL decays
#          BR         NDA      ID1       ID2
     9.99837653E-01    2     1000022        12   # BR(~nu_eL -> ~chi_10 nu_e)
     6.59427923E-06    2     1000023        12   # BR(~nu_eL -> ~chi_20 nu_e)
     1.50076062E-04    2     1000025        12   # BR(~nu_eL -> ~chi_30 nu_e)
     5.67636249E-06    2     1000024        11   # BR(~nu_eL -> ~chi_1+ e-)
#
#         PDG            Width
DECAY   1000014     1.22273983E+02   # snu_muL decays
#          BR         NDA      ID1       ID2
     9.99837653E-01    2     1000022        14   # BR(~nu_muL -> ~chi_10 nu_mu)
     6.59427923E-06    2     1000023        14   # BR(~nu_muL -> ~chi_20 nu_mu)
     1.50076062E-04    2     1000025        14   # BR(~nu_muL -> ~chi_30 nu_mu)
     5.67636249E-06    2     1000024        13   # BR(~nu_muL -> ~chi_1+ mu-)
#
#         PDG            Width
DECAY   1000016     1.22898552E+02   # snu_tauL decays
#          BR         NDA      ID1       ID2
     9.94756491E-01    2     1000022        16   # BR(~nu_tauL -> ~chi_10 nu_tau)
     6.56076719E-06    2     1000023        16   # BR(~nu_tauL -> ~chi_20 nu_tau)
     1.49313377E-04    2     1000025        16   # BR(~nu_tauL -> ~chi_30 nu_tau)
     5.08763509E-03    2     1000024        15   # BR(~nu_tauL -> ~chi_1+ tau-)
#
#         PDG            Width
DECAY   1000024     6.33570316E+01   # chargino1+ decays
#          BR         NDA      ID1       ID2
     5.04061138E-07    2     1000002        -1   # BR(~chi_1+ -> ~u_L     db)
     2.36877416E-07    2    -1000001         2   # BR(~chi_1+ -> ~d_L*    u )
     5.04061138E-07    2     1000004        -3   # BR(~chi_1+ -> ~c_L     sb)
     2.36877416E-07    2    -1000003         4   # BR(~chi_1+ -> ~s_L*    c )
    -2.77603292E-02    2     1000006        -5   # BR(~chi_1+ -> ~t_1     bb)
     8.21716903E-02    2    -1000005         6   # BR(~chi_1+ -> ~b_1*    t )
     8.96672786E-01    2    -2000005         6   # BR(~chi_1+ -> ~b_2*    t )
     3.75887986E-02    2     1000022        24   # BR(~chi_1+ -> ~chi_10  W+)
     1.13198738E-02    2     1000022        37   # BR(~chi_1+ -> ~chi_10  H+)
     4.76185012E-06    2     1000039        24   # BR(~chi_1+ -> ~G       W+)
     9.36929542E-07    2     1000039        37   # BR(~chi_1+ -> ~G       H+)
#
#         PDG            Width
DECAY   1000037    -9.96992508E+02   # chargino2+ decays
#          BR         NDA      ID1       ID2
     1.04713454E-01    2     1000002        -1   # BR(~chi_2+ -> ~u_L     db)
     1.04713491E-01    2    -1000001         2   # BR(~chi_2+ -> ~d_L*    u )
     1.04713454E-01    2     1000004        -3   # BR(~chi_2+ -> ~c_L     sb)
     1.04713491E-01    2    -1000003         4   # BR(~chi_2+ -> ~s_L*    c )
    -7.80051867E-01    2     1000006        -5   # BR(~chi_2+ -> ~t_1     bb)
     2.26612561E-02    2    -1000005         6   # BR(~chi_2+ -> ~b_1*    t )
     9.97493792E-02    2    -2000005         6   # BR(~chi_2+ -> ~b_2*    t )
     7.74019652E-14    2     1000012       -11   # BR(~chi_2+ -> ~nu_eL   e+  )
     7.74019652E-14    2     1000014       -13   # BR(~chi_2+ -> ~nu_muL  mu+ )
     5.41947055E-14    2    -1000011        12   # BR(~chi_2+ -> ~e_L+    nu_e)
     5.41947055E-14    2    -1000013        14   # BR(~chi_2+ -> ~mu_L+   nu_mu)
     8.40807650E-14    2    -1000015        16   # BR(~chi_2+ -> ~tau_1+  nu_tau)
     1.43124860E-15    2    -2000015        16   # BR(~chi_2+ -> ~tau_2+  nu_tau)
     1.92213016E-02    2     1000024        23   # BR(~chi_2+ -> ~chi_1+  Z )
     2.75899470E-06    2     1000022        24   # BR(~chi_2+ -> ~chi_10  W+)
     1.86561120E-02    2     1000023        24   # BR(~chi_2+ -> ~chi_20  W+)
     1.86531526E-02    2     1000025        24   # BR(~chi_2+ -> ~chi_30  W+)
     1.93827169E-02    2     1000024        25   # BR(~chi_2+ -> ~chi_1+  h )
     1.70144249E-02    2     1000024        35   # BR(~chi_2+ -> ~chi_1+  H )
     1.70166491E-02    2     1000024        36   # BR(~chi_2+ -> ~chi_1+  A )
     3.71506962E-06    2     1000022        37   # BR(~chi_2+ -> ~chi_10  H+)
     1.70160087E-02    2     1000023        37   # BR(~chi_2+ -> ~chi_20  H+)
     1.70129473E-02    2     1000025        37   # BR(~chi_2+ -> ~chi_30  H+)
     1.09480724E+00    2     1000039        24   # BR(~chi_2+ -> ~G       W+)
     3.14392610E-07    2     1000039        37   # BR(~chi_2+ -> ~G       H+)
#
#         PDG            Width
DECAY   1000022     1.E-08   # neutralino1 decays (OJ Mods)
#          BR         NDA      ID1       ID2
     8.22071245E-01    2     1000039        22   # BR(~chi_10 -> ~G        gam)
     1.77928717E-01    2     1000039        23   # BR(~chi_10 -> ~G        Z)
     3.86702529E-08    2     1000039        25   # BR(~chi_10 -> ~G        h)
#
#         PDG            Width
DECAY   1000023     1.E-08   # neutralino2 decays (OJ Mods)
#          BR         NDA      ID1       ID2
     3.79041562E-02    2     1000022        23   # BR(~chi_20 -> ~chi_10   Z )
     1.05825696E-03    2     1000022        25   # BR(~chi_20 -> ~chi_10   h )
     1.09358553E-02    2     1000022        35   # BR(~chi_20 -> ~chi_10   H )
     7.33457590E-04    2     1000022        36   # BR(~chi_20 -> ~chi_10   A )
     2.59959213E-08    2     1000002        -2   # BR(~chi_20 -> ~u_L      ub)
     2.59959213E-08    2    -1000002         2   # BR(~chi_20 -> ~u_L*     u )
     1.09527884E-07    2     1000001        -1   # BR(~chi_20 -> ~d_L      db)
     1.09527884E-07    2    -1000001         1   # BR(~chi_20 -> ~d_L*     d )
     2.42255490E-07    2     2000001        -1   # BR(~chi_20 -> ~d_R      db)
     2.42255490E-07    2    -2000001         1   # BR(~chi_20 -> ~d_R*     d )
     2.59959213E-08    2     1000004        -4   # BR(~chi_20 -> ~c_L      cb)
     2.59959213E-08    2    -1000004         4   # BR(~chi_20 -> ~c_L*     c )
     1.09527884E-07    2     1000003        -3   # BR(~chi_20 -> ~s_L      sb)
     1.09527884E-07    2    -1000003         3   # BR(~chi_20 -> ~s_L*     s )
     2.42255490E-07    2     2000003        -3   # BR(~chi_20 -> ~s_R      sb)
     2.42255490E-07    2    -2000003         3   # BR(~chi_20 -> ~s_R*     s )
     4.91757859E-01    2     1000006        -6   # BR(~chi_20 -> ~t_1      tb)
     4.91757859E-01    2    -1000006         6   # BR(~chi_20 -> ~t_1*     t )
    -7.98350943E-03    2     1000005        -5   # BR(~chi_20 -> ~b_1      bb)
    -7.98350943E-03    2    -1000005         5   # BR(~chi_20 -> ~b_1*     b )
    -9.09375479E-03    2     2000005        -5   # BR(~chi_20 -> ~b_2      bb)
    -9.09375479E-03    2    -2000005         5   # BR(~chi_20 -> ~b_2*     b )
     3.59276871E-11    2     1000039        22   # BR(~chi_20 -> ~G        gam)
     1.84288481E-07    2     1000039        23   # BR(~chi_20 -> ~G        Z)
     4.59927204E-06    2     1000039        25   # BR(~chi_20 -> ~G        h)
     3.68570606E-08    2     1000039        35   # BR(~chi_20 -> ~G        H)
     9.50148485E-07    2     1000039        36   # BR(~chi_20 -> ~G        A)
#
#         PDG            Width
DECAY   1000025     6.29586772E+01   # neutralino3 decays
#          BR         NDA      ID1       ID2
     1.07651346E-03    2     1000022        23   # BR(~chi_30 -> ~chi_10   Z )
     3.81521062E-02    2     1000022        25   # BR(~chi_30 -> ~chi_10   h )
     7.14173850E-04    2     1000022        35   # BR(~chi_30 -> ~chi_10   H )
     1.09743072E-02    2     1000022        36   # BR(~chi_30 -> ~chi_10   A )
     3.67131729E-06    2     1000002        -2   # BR(~chi_30 -> ~u_L      ub)
     3.67131729E-06    2    -1000002         2   # BR(~chi_30 -> ~u_L*     u )
     1.01103033E-06    2     1000001        -1   # BR(~chi_30 -> ~d_L      db)
     1.01103033E-06    2    -1000001         1   # BR(~chi_30 -> ~d_L*     d )
     8.53482648E-06    2     2000001        -1   # BR(~chi_30 -> ~d_R      db)
     8.53482648E-06    2    -2000001         1   # BR(~chi_30 -> ~d_R*     d )
     3.67131729E-06    2     1000004        -4   # BR(~chi_30 -> ~c_L      cb)
     3.67131729E-06    2    -1000004         4   # BR(~chi_30 -> ~c_L*     c )
     1.01103033E-06    2     1000003        -3   # BR(~chi_30 -> ~s_L      sb)
     1.01103033E-06    2    -1000003         3   # BR(~chi_30 -> ~s_L*     s )
     8.53482648E-06    2     2000003        -3   # BR(~chi_30 -> ~s_R      sb)
     8.53482648E-06    2    -2000003         3   # BR(~chi_30 -> ~s_R*     s )
     4.91781943E-01    2     1000006        -6   # BR(~chi_30 -> ~t_1      tb)
     4.91781943E-01    2    -1000006         6   # BR(~chi_30 -> ~t_1*     t )
    -6.61861297E-03    2     1000005        -5   # BR(~chi_30 -> ~b_1      bb)
    -6.61861297E-03    2    -1000005         5   # BR(~chi_30 -> ~b_1*     b )
    -1.06477553E-02    2     2000005        -5   # BR(~chi_30 -> ~b_2      bb)
    -1.06477553E-02    2    -2000005         5   # BR(~chi_30 -> ~b_2*     b )
     1.45681661E-09    2     1000039        22   # BR(~chi_30 -> ~G        gam)
     4.60800888E-06    2     1000039        23   # BR(~chi_30 -> ~G        Z)
     1.79747641E-07    2     1000039        25   # BR(~chi_30 -> ~G        h)
     9.44537346E-07    2     1000039        35   # BR(~chi_30 -> ~G        H)
     3.80347018E-08    2     1000039        36   # BR(~chi_30 -> ~G        A)
#
#         PDG            Width
DECAY   1000035    -9.97034064E+02   # neutralino4 decays
#          BR         NDA      ID1       ID2
     1.13110264E-09    2     1000022        23   # BR(~chi_40 -> ~chi_10   Z )
     1.85754948E-02    2     1000023        23   # BR(~chi_40 -> ~chi_20   Z )
     6.45897124E-04    2     1000025        23   # BR(~chi_40 -> ~chi_30   Z )
     1.86560691E-02    2     1000024       -24   # BR(~chi_40 -> ~chi_1+   W-)
     1.86560691E-02    2    -1000024        24   # BR(~chi_40 -> ~chi_1-   W+)
     2.87012955E-06    2     1000022        25   # BR(~chi_40 -> ~chi_10   h )
     4.41367683E-07    2     1000022        35   # BR(~chi_40 -> ~chi_10   H )
     3.26866589E-06    2     1000022        36   # BR(~chi_40 -> ~chi_10   A )
     6.36671749E-04    2     1000023        25   # BR(~chi_40 -> ~chi_20   h )
     1.62825580E-02    2     1000023        35   # BR(~chi_40 -> ~chi_20   H )
     7.48481136E-04    2     1000023        36   # BR(~chi_40 -> ~chi_20   A )
     1.87432718E-02    2     1000025        25   # BR(~chi_40 -> ~chi_30   h )
     7.31472035E-04    2     1000025        35   # BR(~chi_40 -> ~chi_30   H )
     1.62649666E-02    2     1000025        36   # BR(~chi_40 -> ~chi_30   A )
     1.70164138E-02    2     1000024       -37   # BR(~chi_40 -> ~chi_1+   H-)
     1.70164138E-02    2    -1000024        37   # BR(~chi_40 -> ~chi_1-   H+)
     5.01149499E-02    2     1000002        -2   # BR(~chi_40 -> ~u_L      ub)
     5.01149499E-02    2    -1000002         2   # BR(~chi_40 -> ~u_L*     u )
     8.00309473E-22    2     2000002        -2   # BR(~chi_40 -> ~u_R      ub)
     8.00309473E-22    2    -2000002         2   # BR(~chi_40 -> ~u_R*     u )
     5.01149765E-02    2     1000001        -1   # BR(~chi_40 -> ~d_L      db)
     5.01149765E-02    2    -1000001         1   # BR(~chi_40 -> ~d_L*     d )
     9.53741659E-16    2     2000001        -1   # BR(~chi_40 -> ~d_R      db)
     9.53741659E-16    2    -2000001         1   # BR(~chi_40 -> ~d_R*     d )
     5.01149499E-02    2     1000004        -4   # BR(~chi_40 -> ~c_L      cb)
     5.01149499E-02    2    -1000004         4   # BR(~chi_40 -> ~c_L*     c )
     8.00309473E-22    2     2000004        -4   # BR(~chi_40 -> ~c_R      cb)
     8.00309473E-22    2    -2000004         4   # BR(~chi_40 -> ~c_R*     c )
     5.01149765E-02    2     1000003        -3   # BR(~chi_40 -> ~s_L      sb)
     5.01149765E-02    2    -1000003         3   # BR(~chi_40 -> ~s_L*     s )
     9.53741659E-16    2     2000003        -3   # BR(~chi_40 -> ~s_R      sb)
     9.53741659E-16    2    -2000003         3   # BR(~chi_40 -> ~s_R*     s )
     6.12057553E-02    2     1000006        -6   # BR(~chi_40 -> ~t_1      tb)
     6.12057553E-02    2    -1000006         6   # BR(~chi_40 -> ~t_1*     t )
    -2.05346556E-01    2     1000005        -5   # BR(~chi_40 -> ~b_1      bb)
    -2.05346556E-01    2    -1000005         5   # BR(~chi_40 -> ~b_1*     b )
    -1.84683099E-01    2     2000005        -5   # BR(~chi_40 -> ~b_2      bb)
    -1.84683099E-01    2    -2000005         5   # BR(~chi_40 -> ~b_2*     b )
     2.70974427E-14    2     1000011       -11   # BR(~chi_40 -> ~e_L-     e+)
     2.70974427E-14    2    -1000011        11   # BR(~chi_40 -> ~e_L+     e-)
     4.64124322E-27    2     2000011       -11   # BR(~chi_40 -> ~e_R-     e+)
     4.64124322E-27    2    -2000011        11   # BR(~chi_40 -> ~e_R+     e-)
     2.70974427E-14    2     1000013       -13   # BR(~chi_40 -> ~mu_L-    mu+)
     2.70974427E-14    2    -1000013        13   # BR(~chi_40 -> ~mu_L+    mu-)
     4.64124322E-27    2     2000013       -13   # BR(~chi_40 -> ~mu_R-    mu+)
     4.64124322E-27    2    -2000013        13   # BR(~chi_40 -> ~mu_R+    mu-)
     3.87011617E-14    2     1000012       -12   # BR(~chi_40 -> ~nu_eL    nu_eb)
     3.87011617E-14    2    -1000012        12   # BR(~chi_40 -> ~nu_eL*   nu_e )
     3.87011617E-14    2     1000014       -14   # BR(~chi_40 -> ~nu_muL   nu_mub)
     3.87011617E-14    2    -1000014        14   # BR(~chi_40 -> ~nu_muL*  nu_mu )
     3.87011617E-14    2     1000016       -16   # BR(~chi_40 -> ~nu_tau1  nu_taub)
     3.87011617E-14    2    -1000016        16   # BR(~chi_40 -> ~nu_tau1* nu_tau )
     2.64993735E-01    2     1000039        22   # BR(~chi_40 -> ~G        gam)
     8.29817784E-01    2     1000039        23   # BR(~chi_40 -> ~G        Z)
     5.01681709E-08    2     1000039        25   # BR(~chi_40 -> ~G        h)
     3.14912747E-07    2     1000039        35   # BR(~chi_40 -> ~G        H)
     6.20573136E-11    2     1000039        36   # BR(~chi_40 -> ~G        A)
#
#
#
#
