#
#                              ======================
#                              | THE SUSYHIT OUTPUT |
#                              ======================
#
#
#              ------------------------------------------------------
#              |     This is the output of the SUSY-HIT package     |
#              |  created by A.Djouadi, M.Muehlleitner and M.Spira. |
#              |  In case of problems with SUSY-HIT email to        |
#              |           margarete.muehlleitner@cern.ch           |
#              |           michael.spira@psi.ch                     |
#              |           abdelhak.djouadi@cern.ch                 |
#              ------------------------------------------------------
#
#              ------------------------------------------------------
#              |  SUSY Les Houches Accord - MSSM Spectrum + Decays  |
#              |              based on the decay programs           |
#              |                                                    |
#              |                     SDECAY 1.3b                    |
#              |                                                    |
#              |  Authors: M.Muhlleitner, A.Djouadi and Y.Mambrini  |
#              |  Ref.:    Comput.Phys.Commun.168(2005)46           |
#              |           [hep-ph/0311167]                         |
#              |                                                    |
#              |                     HDECAY 3.4                     |
#              |                                                    |
#              |  By: A.Djouadi,J.Kalinowski,M.Muhlleitner,M.Spira  |
#              |  Ref.:    Comput.Phys.Commun.108(1998)56           |
#              |           [hep-ph/9704448]                         |
#              |                                                    |
#              |                                                    |
#              |  If not stated otherwise all DRbar couplings and   |
#              |  soft SUSY breaking masses are given at the scale  |
#              |  Q=  0.50007614E+04
#              |                                                    |
#              ------------------------------------------------------
#
#
BLOCK DCINFO  # Decay Program information
     1   SDECAY/HDECAY # decay calculator
     2   1.3b  /3.4    # version number
#
BLOCK SPINFO  # Spectrum calculator information
     1    SOFTSUSY    # spectrum calculator                
     2    3.4.0       # version number                     
#
BLOCK MODSEL  # Model selection
     1     0   #  nonUniversal                                     
#
BLOCK SMINPUTS  # Standard Model inputs
         1     1.25778332E+02   # alpha_em^-1(M_Z)^MSbar
         2     1.16570000E-05   # G_F [GeV^-2]
         3     1.17200002E-01   # alpha_S(M_Z)^MSbar
         4     9.11876000E+01   # M_Z pole mass
         5     4.25000000E+00   # mb(mb)^MSbar
         6     1.72500000E+02   # mt pole mass
         7     1.77682000E+00   # mtau pole mass
#
BLOCK MINPAR  # Input parameters - minimal models
         3     1.00000000E+01   # tanb                
#
BLOCK EXTPAR  # Input parameters - non-minimal models
         0    -1.00000000E+00   # Set                 
         1     6.00000000E+01   # M_1(MX)             
         2     3.00000000E+03   # M_2(MX)             
         3     1.85478100E+03   # M_3(MX)             
        11     5.00000000E+03   # At(MX)              
        12     5.00000000E+03   # Ab(MX)              
        13     0.00000000E+00   # Atau(MX)            
        23    -4.74889000E+02   # mu(MX)              
        26     3.00000000E+03   # mA(pole)            
        31     5.00000000E+03   # meL(MX)             
        32     5.00000000E+03   # mmuL(MX)            
        33     5.00000000E+03   # mtauL(MX)           
        34     5.00000000E+03   # meR(MX)             
        35     5.00000000E+03   # mmuR(MX)            
        36     5.00000000E+03   # mtauR(MX)           
        41     5.00000000E+03   # mqL1(MX)            
        42     5.00000000E+03   # mqL2(MX)            
        43     5.00000000E+03   # mqL3(MX)            
        44     5.00000000E+03   # muR(MX)             
        45     5.00000000E+03   # mcR(MX)             
        46     5.00000000E+03   # mtR(MX)             
        47     5.00000000E+03   # mdR(MX)             
        48     5.00000000E+03   # msR(MX)             
        49     5.00000000E+03   # mbR(MX)             
#
BLOCK MASS  # Mass Spectrum
# PDG code           mass       particle
        24     8.00931434E+01   # W+
        25     1.24780636E+02   # h
        35     3.00008586E+03   # H
        36     2.99999945E+03   # A
        37     3.00143004E+03   # H+
         5     4.87878001E+00   # b-quark pole mass calculated from mb(mb)_Msbar
   1000001     5.07480830E+03   # ~d_L
   2000001     5.05697606E+03   # ~d_R
   1000002     5.07433480E+03   # ~u_L
   2000002     5.05667616E+03   # ~u_R
   1000003     5.07480830E+03   # ~s_L
   2000003     5.05697606E+03   # ~s_R
   1000004     5.07433480E+03   # ~c_L
   2000004     5.05667616E+03   # ~c_R
   1000005     5.02062886E+03   # ~b_1
   2000005     5.05520329E+03   # ~b_2
   1000006     4.91195252E+03   # ~t_1
   2000006     5.06427580E+03   # ~t_2
   1000011     5.01910830E+03   # ~e_L
   2000011     5.00594379E+03   # ~e_R
   1000012     5.01815813E+03   # ~nu_eL
   1000013     5.01910830E+03   # ~mu_L
   2000013     5.00594379E+03   # ~mu_R
   1000014     5.01815813E+03   # ~nu_muL
   1000015     5.00477445E+03   # ~tau_1
   2000015     5.01863258E+03   # ~tau_2
   1000016     5.01760648E+03   # ~nu_tauL
   1000021     2.20000093E+03   # ~g
   1000022     6.02023399E+01   # ~chi_10
   1000023     5.00513106E+02   # ~chi_20
   1000025    -5.02707834E+02   # ~chi_30
   1000035     3.07417873E+03   # ~chi_40
   1000024     5.00000866E+02   # ~chi_1+
   1000037     3.07434643E+03   # ~chi_2+
#
BLOCK NMIX  # Neutralino Mixing Matrix
  1  1     9.96029274E-01   # N_11
  1  2     2.24955117E-04   # N_12
  1  3    -8.90130294E-02   # N_13
  1  4    -1.52191208E-03   # N_14
  2  1     6.40537333E-02   # N_21
  2  2     1.90066620E-02   # N_22
  2  3     7.04713497E-01   # N_23
  2  4     7.06338979E-01   # N_24
  3  1    -6.18276122E-02   # N_31
  3  2     1.70142262E-02   # N_32
  3  3    -7.03884658E-01   # N_33
  3  4     7.07413776E-01   # N_34
  4  1    -3.89687383E-04   # N_41
  4  2     9.99674553E-01   # N_42
  4  3    -1.39862969E-03   # N_43
  4  4    -2.54691907E-02   # N_44
#
BLOCK UMIX  # Chargino Mixing Matrix U
  1  1     1.98321172E-03   # U_11
  1  2     9.99998033E-01   # U_12
  2  1    -9.99998033E-01   # U_21
  2  2     1.98321172E-03   # U_22
#
BLOCK VMIX  # Chargino Mixing Matrix V
  1  1     3.60391461E-02   # V_11
  1  2    -9.99350379E-01   # V_12
  2  1    -9.99350379E-01   # V_21
  2  2    -3.60391461E-02   # V_22
#
BLOCK STOPMIX  # Stop Mixing Matrix
  1  1    -5.03072337E-01   # cos(theta_t)
  1  2     8.64244308E-01   # sin(theta_t)
  2  1    -8.64244308E-01   # -sin(theta_t)
  2  2    -5.03072337E-01   # cos(theta_t)
#
BLOCK SBOTMIX  # Sbottom Mixing Matrix
  1  1     9.98764072E-01   # cos(theta_b)
  1  2    -4.97023992E-02   # sin(theta_b)
  2  1     4.97023992E-02   # -sin(theta_b)
  2  2     9.98764072E-01   # cos(theta_b)
#
BLOCK STAUMIX  # Stau Mixing Matrix
  1  1    -5.69178995E-02   # cos(theta_tau)
  1  2     9.98378862E-01   # sin(theta_tau)
  2  1    -9.98378862E-01   # -sin(theta_tau)
  2  2    -5.69178995E-02   # cos(theta_tau)
#
BLOCK ALPHA  # Higgs mixing
          -1.05488914E-01   # Mixing angle in the neutral Higgs boson sector
#
BLOCK HMIX Q=  5.00076140E+03  # DRbar Higgs Parameters
         1    -4.83584096E+02   # mu(Q)MSSM           
         2     9.46894121E+00   # tan                 
         3     2.41747283E+02   # higgs               
         4     8.67815976E+06   # mA^2(Q)MSSM         
#
BLOCK GAUGE Q=  5.00076140E+03  # The gauge couplings
     1     3.70952067E-01   # gprime(Q) DRbar
     2     6.33319049E-01   # g(Q) DRbar
     3     9.97105893E-01   # g3(Q) DRbar
#
BLOCK AU Q=  5.00076140E+03  # The trilinear couplings
  1  1     5.00000001E+03   # A_u(Q) DRbar
  2  2     5.00000001E+03   # A_c(Q) DRbar
  3  3     5.00000002E+03   # A_t(Q) DRbar
#
BLOCK AD Q=  5.00076140E+03  # The trilinear couplings
  1  1     5.00000001E+03   # A_d(Q) DRbar
  2  2     5.00000001E+03   # A_s(Q) DRbar
  3  3     5.00000001E+03   # A_b(Q) DRbar
#
BLOCK AE Q=  5.00076140E+03  # The trilinear couplings
  1  1     0.00000000E+00   # A_e(Q) DRbar
  2  2     2.02472643E-07   # A_mu(Q) DRbar
  3  3     2.02222774E-07   # A_tau(Q) DRbar
#
BLOCK Yu Q=  5.00076140E+03  # The Yukawa couplings
  1  1     0.00000000E+00   # y_u(Q) DRbar
  2  2     0.00000000E+00   # y_c(Q) DRbar
  3  3     8.20758691E-01   # y_t(Q) DRbar
#
BLOCK Yd Q=  5.00076140E+03  # The Yukawa couplings
  1  1     0.00000000E+00   # y_d(Q) DRbar
  2  2     0.00000000E+00   # y_s(Q) DRbar
  3  3     1.30172669E-01   # y_b(Q) DRbar
#
BLOCK Ye Q=  5.00076140E+03  # The Yukawa couplings
  1  1     0.00000000E+00   # y_e(Q) DRbar
  2  2     0.00000000E+00   # y_mu(Q) DRbar
  3  3     9.71383441E-02   # y_tau(Q) DRbar
#
BLOCK MSOFT Q=  5.00076140E+03  # The soft SUSY breaking masses at the scale Q
         1     6.00000000E+01   # M_1(Q)              
         2     3.00000000E+03   # M_2(Q)              
         3     1.85478100E+03   # M_3(Q)              
        21     8.49012925E+06   # mH1^2(Q)            
        22     3.42749237E+05   # mH2^2(Q)            
        31     5.00000000E+03   # meL(Q)              
        32     5.00000000E+03   # mmuL(Q)             
        33     5.00000000E+03   # mtauL(Q)            
        34     5.00000000E+03   # meR(Q)              
        35     5.00000000E+03   # mmuR(Q)             
        36     5.00000000E+03   # mtauR(Q)            
        41     5.00000000E+03   # mqL1(Q)             
        42     5.00000000E+03   # mqL2(Q)             
        43     4.99999999E+03   # mqL3(Q)             
        44     5.00000000E+03   # muR(Q)              
        45     5.00000000E+03   # mcR(Q)              
        46     4.99999999E+03   # mtR(Q)              
        47     5.00000000E+03   # mdR(Q)              
        48     5.00000000E+03   # msR(Q)              
        49     5.00000000E+03   # mbR(Q)              
#
#
#
#                             =================
#                             |The decay table|
#                             =================
#
# - The QCD corrections to the decays gluino -> squark  + quark
#                                     squark -> gaugino + quark_prime
#                                     squark -> squark_prime + Higgs
#                                     squark -> gluino  + quark
#   are included.
#
# - The multi-body decays for the inos, stops and sbottoms are included.
#
# - The loop induced decays for the gluino, neutralinos and stops
#   are included.
#
# - The SUSY decays of the top quark are included.
#
#
#         PDG            Width
DECAY         6     1.40564737E+00   # top decays
#          BR         NDA      ID1       ID2
     1.00000000E+00    2           5        24   # BR(t ->  b    W+)
#
#         PDG            Width
DECAY   1000021     3.26615584E-03   # gluino decays
#          BR         NDA      ID1       ID2
     3.91825168E-07    2     1000022        21   # BR(~g -> ~chi_10 g)
     5.76874260E-03    2     1000023        21   # BR(~g -> ~chi_20 g)
     5.61275780E-03    2     1000025        21   # BR(~g -> ~chi_30 g)
#           BR         NDA      ID1       ID2       ID3
     1.16979625E-02    3     1000022         1        -1   # BR(~g -> ~chi_10 d  db)
     3.59768144E-05    3     1000023         1        -1   # BR(~g -> ~chi_20 d  db)
     4.05606159E-05    3     1000025         1        -1   # BR(~g -> ~chi_30 d  db)
     3.98927042E-02    3     1000022         2        -2   # BR(~g -> ~chi_10 u  ub)
     1.87717264E-04    3     1000023         2        -2   # BR(~g -> ~chi_20 u  ub)
     6.75029346E-05    3     1000025         2        -2   # BR(~g -> ~chi_30 u  ub)
     1.16979625E-02    3     1000022         3        -3   # BR(~g -> ~chi_10 s  sb)
     3.59768144E-05    3     1000023         3        -3   # BR(~g -> ~chi_20 s  sb)
     4.05606159E-05    3     1000025         3        -3   # BR(~g -> ~chi_30 s  sb)
     3.98927042E-02    3     1000022         4        -4   # BR(~g -> ~chi_10 c  cb)
     1.87717264E-04    3     1000023         4        -4   # BR(~g -> ~chi_20 c  cb)
     6.75029346E-05    3     1000025         4        -4   # BR(~g -> ~chi_30 c  cb)
     1.19714400E-02    3     1000022         5        -5   # BR(~g -> ~chi_10 b  bb)
     5.31731815E-03    3     1000023         5        -5   # BR(~g -> ~chi_20 b  bb)
     5.28747148E-03    3     1000025         5        -5   # BR(~g -> ~chi_30 b  bb)
     3.94286487E-02    3     1000022         6        -6   # BR(~g -> ~chi_10 t  tb)
     2.04784762E-01    3     1000023         6        -6   # BR(~g -> ~chi_20 t  tb)
     1.91300530E-01    3     1000025         6        -6   # BR(~g -> ~chi_30 t  tb)
     5.48695603E-05    3     1000024         1        -2   # BR(~g -> ~chi_1+ d  ub)
     5.48695603E-05    3    -1000024         2        -1   # BR(~g -> ~chi_1- u  db)
     5.48695603E-05    3     1000024         3        -4   # BR(~g -> ~chi_1+ s  cb)
     5.48695603E-05    3    -1000024         4        -3   # BR(~g -> ~chi_1- c  sb)
     2.13231805E-01    3     1000024         5        -6   # BR(~g -> ~chi_1+ b  tb)
     2.13231805E-01    3    -1000024         6        -5   # BR(~g -> ~chi_1- t  bb)
#
#         PDG            Width
DECAY   1000006     3.30481609E+02   # stop1 decays
#          BR         NDA      ID1       ID2
     2.66055524E-02    2     1000022         6   # BR(~t_1 -> ~chi_10 t )
     9.93199567E-02    2     1000023         6   # BR(~t_1 -> ~chi_20 t )
     9.39553383E-02    2     1000025         6   # BR(~t_1 -> ~chi_30 t )
     6.12371723E-03    2     1000035         6   # BR(~t_1 -> ~chi_40 t )
     1.44432110E-01    2     1000024         5   # BR(~t_1 -> ~chi_1+ b )
     1.22073658E-02    2     1000037         5   # BR(~t_1 -> ~chi_2+ b )
     6.17355959E-01    2     1000021         6   # BR(~t_1 -> ~g      t )
#
#         PDG            Width
DECAY   2000006     3.36076549E+02   # stop2 decays
#          BR         NDA      ID1       ID2
     1.03288627E-02    2     1000022         6   # BR(~t_2 -> ~chi_10 t )
     9.75703251E-02    2     1000023         6   # BR(~t_2 -> ~chi_20 t )
     1.03493115E-01    2     1000025         6   # BR(~t_2 -> ~chi_30 t )
     1.67694747E-02    2     1000035         6   # BR(~t_2 -> ~chi_40 t )
     5.71624323E-02    2     1000024         5   # BR(~t_2 -> ~chi_1+ b )
     3.33905889E-02    2     1000037         5   # BR(~t_2 -> ~chi_2+ b )
     6.77699889E-01    2     1000021         6   # BR(~t_2 -> ~g      t )
     8.31056914E-04    2     1000006        25   # BR(~t_2 -> ~t_1    h )
     2.75425529E-03    2     1000006        23   # BR(~t_2 -> ~t_1    Z )
#
#         PDG            Width
DECAY   1000005     3.10768945E+02   # sbottom1 decays
#          BR         NDA      ID1       ID2
     2.50056291E-03    2     1000022         5   # BR(~b_1 -> ~chi_10 b )
     2.64238384E-03    2     1000023         5   # BR(~b_1 -> ~chi_20 b )
     2.64303138E-03    2     1000025         5   # BR(~b_1 -> ~chi_30 b )
     2.44579209E-02    2     1000035         5   # BR(~b_1 -> ~chi_40 b )
     2.12165300E-01    2    -1000024         6   # BR(~b_1 -> ~chi_1- t )
     4.91059188E-02    2    -1000037         6   # BR(~b_1 -> ~chi_2- t )
     7.04721804E-01    2     1000021         5   # BR(~b_1 -> ~g      b )
     1.76307737E-03    2     1000006       -24   # BR(~b_1 -> ~t_1    W-)
#
#         PDG            Width
DECAY   2000005     2.28226064E+02   # sbottom2 decays
#          BR         NDA      ID1       ID2
     1.28411226E-02    2     1000022         5   # BR(~b_2 -> ~chi_10 b )
     3.73436765E-03    2     1000023         5   # BR(~b_2 -> ~chi_20 b )
     3.77884639E-03    2     1000025         5   # BR(~b_2 -> ~chi_30 b )
     7.68470028E-05    2     1000035         5   # BR(~b_2 -> ~chi_40 b )
     7.99084606E-03    2    -1000024         6   # BR(~b_2 -> ~chi_1- t )
     1.54306136E-04    2    -1000037         6   # BR(~b_2 -> ~chi_2- t )
     9.71398813E-01    2     1000021         5   # BR(~b_2 -> ~g      b )
     2.48513462E-05    2     1000006       -24   # BR(~b_2 -> ~t_1    W-)
#
#         PDG            Width
DECAY   1000002     2.47697679E+02   # sup_L decays
#          BR         NDA      ID1       ID2
     2.99601621E-03    2     1000022         2   # BR(~u_L -> ~chi_10 u)
     7.70725047E-05    2     1000023         2   # BR(~u_L -> ~chi_20 u)
     1.89588759E-06    2     1000025         2   # BR(~u_L -> ~chi_30 u)
     3.18589578E-02    2     1000035         2   # BR(~u_L -> ~chi_40 u)
     2.01616132E-04    2     1000024         1   # BR(~u_L -> ~chi_1+ d)
     6.36782946E-02    2     1000037         1   # BR(~u_L -> ~chi_2+ d)
     9.01186147E-01    2     1000021         2   # BR(~u_L -> ~g      u)
#
#         PDG            Width
DECAY   2000002     2.33621992E+02   # sup_R decays
#          BR         NDA      ID1       ID2
     5.05279591E-02    2     1000022         2   # BR(~u_R -> ~chi_10 u)
     2.05164785E-04    2     1000023         2   # BR(~u_R -> ~chi_20 u)
     1.91119602E-04    2     1000025         2   # BR(~u_R -> ~chi_30 u)
     3.09505095E-09    2     1000035         2   # BR(~u_R -> ~chi_40 u)
     9.49075753E-01    2     1000021         2   # BR(~u_R -> ~g      u)
#
#         PDG            Width
DECAY   1000001     2.47712321E+02   # sdown_L decays
#          BR         NDA      ID1       ID2
     2.98229142E-03    2     1000022         1   # BR(~d_L -> ~chi_10 d)
     3.27990544E-06    2     1000023         1   # BR(~d_L -> ~chi_20 d)
     6.56491257E-05    2     1000025         1   # BR(~d_L -> ~chi_30 d)
     3.18765994E-02    2     1000035         1   # BR(~d_L -> ~chi_40 d)
     6.10564250E-07    2    -1000024         2   # BR(~d_L -> ~chi_1- u)
     6.37767486E-02    2    -1000037         2   # BR(~d_L -> ~chi_2- u)
     9.01294821E-01    2     1000021         1   # BR(~d_L -> ~g      d)
#
#         PDG            Width
DECAY   2000001     2.24724834E+02   # sdown_R decays
#          BR         NDA      ID1       ID2
     1.31328976E-02    2     1000022         1   # BR(~d_R -> ~chi_10 d)
     5.33252086E-05    2     1000023         1   # BR(~d_R -> ~chi_20 d)
     4.96746694E-05    2     1000025         1   # BR(~d_R -> ~chi_30 d)
     8.04555884E-10    2     1000035         1   # BR(~d_R -> ~chi_40 d)
     9.86764102E-01    2     1000021         1   # BR(~d_R -> ~g      d)
#
#         PDG            Width
DECAY   1000004     2.47697679E+02   # scharm_L decays
#          BR         NDA      ID1       ID2
     2.99601621E-03    2     1000022         4   # BR(~c_L -> ~chi_10 c)
     7.70725047E-05    2     1000023         4   # BR(~c_L -> ~chi_20 c)
     1.89588759E-06    2     1000025         4   # BR(~c_L -> ~chi_30 c)
     3.18589578E-02    2     1000035         4   # BR(~c_L -> ~chi_40 c)
     2.01616132E-04    2     1000024         3   # BR(~c_L -> ~chi_1+ s)
     6.36782946E-02    2     1000037         3   # BR(~c_L -> ~chi_2+ s)
     9.01186147E-01    2     1000021         4   # BR(~c_L -> ~g      c)
#
#         PDG            Width
DECAY   2000004     2.33621992E+02   # scharm_R decays
#          BR         NDA      ID1       ID2
     5.05279591E-02    2     1000022         4   # BR(~c_R -> ~chi_10 c)
     2.05164785E-04    2     1000023         4   # BR(~c_R -> ~chi_20 c)
     1.91119602E-04    2     1000025         4   # BR(~c_R -> ~chi_30 c)
     3.09505095E-09    2     1000035         4   # BR(~c_R -> ~chi_40 c)
     9.49075753E-01    2     1000021         4   # BR(~c_R -> ~g      c)
#
#         PDG            Width
DECAY   1000003     2.47712321E+02   # sstrange_L decays
#          BR         NDA      ID1       ID2
     2.98229142E-03    2     1000022         3   # BR(~s_L -> ~chi_10 s)
     3.27990544E-06    2     1000023         3   # BR(~s_L -> ~chi_20 s)
     6.56491257E-05    2     1000025         3   # BR(~s_L -> ~chi_30 s)
     3.18765994E-02    2     1000035         3   # BR(~s_L -> ~chi_40 s)
     6.10564250E-07    2    -1000024         4   # BR(~s_L -> ~chi_1- c)
     6.37767486E-02    2    -1000037         4   # BR(~s_L -> ~chi_2- c)
     9.01294821E-01    2     1000021         3   # BR(~s_L -> ~g      s)
#
#         PDG            Width
DECAY   2000003     2.24724834E+02   # sstrange_R decays
#          BR         NDA      ID1       ID2
     1.31328976E-02    2     1000022         3   # BR(~s_R -> ~chi_10 s)
     5.33252086E-05    2     1000023         3   # BR(~s_R -> ~chi_20 s)
     4.96746694E-05    2     1000025         3   # BR(~s_R -> ~chi_30 s)
     8.04555884E-10    2     1000035         3   # BR(~s_R -> ~chi_40 s)
     9.86764102E-01    2     1000021         3   # BR(~s_R -> ~g      s)
#
#         PDG            Width
DECAY   1000011     3.03337568E+01   # selectron_L decays
#          BR         NDA      ID1       ID2
     2.24796836E-01    2     1000022        11   # BR(~e_L -> ~chi_10 e-)
     2.06747738E-03    2     1000023        11   # BR(~e_L -> ~chi_20 e-)
     2.38498115E-04    2     1000025        11   # BR(~e_L -> ~chi_30 e-)
     2.57463652E-01    2     1000035        11   # BR(~e_L -> ~chi_40 e-)
     5.09038707E-06    2    -1000024        12   # BR(~e_L -> ~chi_1- nu_e)
     5.15428446E-01    2    -1000037        12   # BR(~e_L -> ~chi_2- nu_e)
#
#         PDG            Width
DECAY   2000011     2.73960680E+01   # selectron_R decays
#          BR         NDA      ID1       ID2
     9.92229278E-01    2     1000022        11   # BR(~e_R -> ~chi_10 e-)
     4.02305154E-03    2     1000023        11   # BR(~e_R -> ~chi_20 e-)
     3.74761147E-03    2     1000025        11   # BR(~e_R -> ~chi_30 e-)
     5.89422601E-08    2     1000035        11   # BR(~e_R -> ~chi_40 e-)
#
#         PDG            Width
DECAY   1000013     3.03337568E+01   # smuon_L decays
#          BR         NDA      ID1       ID2
     2.24796836E-01    2     1000022        13   # BR(~mu_L -> ~chi_10 mu-)
     2.06747738E-03    2     1000023        13   # BR(~mu_L -> ~chi_20 mu-)
     2.38498115E-04    2     1000025        13   # BR(~mu_L -> ~chi_30 mu-)
     2.57463652E-01    2     1000035        13   # BR(~mu_L -> ~chi_40 mu-)
     5.09038707E-06    2    -1000024        14   # BR(~mu_L -> ~chi_1- nu_mu)
     5.15428446E-01    2    -1000037        14   # BR(~mu_L -> ~chi_2- nu_mu)
#
#         PDG            Width
DECAY   2000013     2.73960680E+01   # smuon_R decays
#          BR         NDA      ID1       ID2
     9.92229278E-01    2     1000022        13   # BR(~mu_R -> ~chi_10 mu-)
     4.02305154E-03    2     1000023        13   # BR(~mu_R -> ~chi_20 mu-)
     3.74761147E-03    2     1000025        13   # BR(~mu_R -> ~chi_30 mu-)
     5.89422601E-08    2     1000035        13   # BR(~mu_R -> ~chi_40 mu-)
#
#         PDG            Width
DECAY   1000015     2.92388315E+01   # stau_1 decays
#          BR         NDA      ID1       ID2
     9.28347182E-01    2     1000022        15   # BR(~tau_1 -> ~chi_10  tau-)
     1.91868260E-02    2     1000023        15   # BR(~tau_1 -> ~chi_20  tau-)
     1.84830546E-02    2     1000025        15   # BR(~tau_1 -> ~chi_30  tau-)
     8.47880501E-04    2     1000035        15   # BR(~tau_1 -> ~chi_40  tau-)
     3.14378050E-02    2    -1000024        16   # BR(~tau_1 -> ~chi_1-  nu_tau)
     1.69725188E-03    2    -1000037        16   # BR(~tau_1 -> ~chi_2-  nu_tau)
#
#         PDG            Width
DECAY   2000015     3.12410747E+01   # stau_2 decays
#          BR         NDA      ID1       ID2
     2.19785590E-01    2     1000022        15   # BR(~tau_2 -> ~chi_10  tau-)
     1.68944766E-02    2     1000023        15   # BR(~tau_2 -> ~chi_20  tau-)
     1.54639666E-02    2     1000025        15   # BR(~tau_2 -> ~chi_30  tau-)
     2.49104445E-01    2     1000035        15   # BR(~tau_2 -> ~chi_40  tau-)
     5.72509880E-05    2    -1000024        16   # BR(~tau_2 -> ~chi_1-  nu_tau)
     4.98694271E-01    2    -1000037        16   # BR(~tau_2 -> ~chi_2-  nu_tau)
#
#         PDG            Width
DECAY   1000012     3.03369528E+01   # snu_eL decays
#          BR         NDA      ID1       ID2
     2.24384227E-01    2     1000022        12   # BR(~nu_eL -> ~chi_10 nu_e)
     2.21671159E-04    2     1000023        12   # BR(~nu_eL -> ~chi_20 nu_e)
     1.83249356E-03    2     1000025        12   # BR(~nu_eL -> ~chi_30 nu_e)
     2.57505828E-01    2     1000035        12   # BR(~nu_eL -> ~chi_40 nu_e)
     1.68046842E-03    2     1000024        11   # BR(~nu_eL -> ~chi_1+ e-)
     5.14375312E-01    2     1000037        11   # BR(~nu_eL -> ~chi_2+ e-)
#
#         PDG            Width
DECAY   1000014     3.03369528E+01   # snu_muL decays
#          BR         NDA      ID1       ID2
     2.24384227E-01    2     1000022        14   # BR(~nu_muL -> ~chi_10 nu_mu)
     2.21671159E-04    2     1000023        14   # BR(~nu_muL -> ~chi_20 nu_mu)
     1.83249356E-03    2     1000025        14   # BR(~nu_muL -> ~chi_30 nu_mu)
     2.57505828E-01    2     1000035        14   # BR(~nu_muL -> ~chi_40 nu_mu)
     1.68046842E-03    2     1000024        13   # BR(~nu_muL -> ~chi_1+ mu-)
     5.14375312E-01    2     1000037        13   # BR(~nu_muL -> ~chi_2+ mu-)
#
#         PDG            Width
DECAY   1000016     3.12507362E+01   # snu_tauL decays
#          BR         NDA      ID1       ID2
     2.17799188E-01    2     1000022        16   # BR(~nu_tauL -> ~chi_10 nu_tau)
     2.15164803E-04    2     1000023        16   # BR(~nu_tauL -> ~chi_20 nu_tau)
     1.77870726E-03    2     1000025        16   # BR(~nu_tauL -> ~chi_30 nu_tau)
     2.49882746E-01    2     1000035        16   # BR(~nu_tauL -> ~chi_40 nu_tau)
     3.11767179E-02    2     1000024        15   # BR(~nu_tauL -> ~chi_1+ tau-)
     4.99147477E-01    2     1000037        15   # BR(~nu_tauL -> ~chi_2+ tau-)
#
#         PDG            Width
DECAY   1000024     2.94079772E-01   # chargino1+ decays
#          BR         NDA      ID1       ID2
     1.00000000E+00    2     1000022        24   # BR(~chi_1+ -> ~chi_10  W+)
#
#         PDG            Width
DECAY   1000037     2.21626521E+01   # chargino2+ decays
#          BR         NDA      ID1       ID2
     2.53559612E-01    2     1000024        23   # BR(~chi_2+ -> ~chi_1+  Z )
     1.56231993E-04    2     1000022        24   # BR(~chi_2+ -> ~chi_10  W+)
     2.44968528E-01    2     1000023        24   # BR(~chi_2+ -> ~chi_20  W+)
     2.44374562E-01    2     1000025        24   # BR(~chi_2+ -> ~chi_30  W+)
     2.56935886E-01    2     1000024        25   # BR(~chi_2+ -> ~chi_1+  h )
     5.18068566E-06    2     1000022        37   # BR(~chi_2+ -> ~chi_10  H+)
#
#         PDG            Width
DECAY   1000022     0.00000000E+00   # neutralino1 decays
#
#         PDG            Width
DECAY   1000023     2.97413013E-01   # neutralino2 decays
#          BR         NDA      ID1       ID2
     5.04339851E-01    2     1000022        23   # BR(~chi_20 -> ~chi_10   Z )
     4.95660149E-01    2     1000022        25   # BR(~chi_20 -> ~chi_10   h )
#
#         PDG            Width
DECAY   1000025     2.90315119E-01   # neutralino3 decays
#          BR         NDA      ID1       ID2
     5.33681709E-01    2     1000022        23   # BR(~chi_30 -> ~chi_10   Z )
     4.66318291E-01    2     1000022        25   # BR(~chi_30 -> ~chi_10   h )
#
#         PDG            Width
DECAY   1000035     2.21736060E+01   # neutralino4 decays
#          BR         NDA      ID1       ID2
     3.09991399E-06    2     1000022        23   # BR(~chi_40 -> ~chi_10   Z )
     1.12719734E-01    2     1000023        23   # BR(~chi_40 -> ~chi_20   Z )
     1.40401115E-01    2     1000025        23   # BR(~chi_40 -> ~chi_30   Z )
     2.45151525E-01    2     1000024       -24   # BR(~chi_40 -> ~chi_1+   W-)
     2.45151525E-01    2    -1000024        24   # BR(~chi_40 -> ~chi_1-   W+)
     1.45578950E-04    2     1000022        25   # BR(~chi_40 -> ~chi_10   h )
     4.98379727E-06    2     1000022        35   # BR(~chi_40 -> ~chi_10   H )
     5.43968698E-07    2     1000022        36   # BR(~chi_40 -> ~chi_10   A )
     1.43425073E-01    2     1000023        25   # BR(~chi_40 -> ~chi_20   h )
     1.12996821E-01    2     1000025        25   # BR(~chi_40 -> ~chi_30   h )
#
#         PDG            Width
DECAY        25     4.07146325E-03   # h decays
#          BR         NDA      ID1       ID2
     6.09199500E-01    2           5        -5   # BR(h -> b       bb     )
     6.37145758E-02    2         -15        15   # BR(h -> tau+    tau-   )
     2.25572733E-04    2         -13        13   # BR(h -> mu+     mu-    )
     4.78194863E-04    2           3        -3   # BR(h -> s       sb     )
     2.07191130E-02    2           4        -4   # BR(h -> c       cb     )
     6.70301605E-02    2          21        21   # BR(h -> g       g      )
     2.30401233E-03    2          22        22   # BR(h -> gam     gam    )
     1.48660752E-03    2          22        23   # BR(h -> Z       gam    )
     2.09765521E-01    2          24       -24   # BR(h -> W+      W-     )
     2.49921292E-02    2          23        23   # BR(h -> Z       Z      )
     8.46124692E-05    2     1000022   1000022   # BR(h -> ~chi_10 ~chi_10)
#
#         PDG            Width
DECAY        35     8.66092925E+00   # H decays
#          BR         NDA      ID1       ID2
     3.68345282E-01    2           5        -5   # BR(H -> b       bb     )
     6.43124533E-02    2         -15        15   # BR(H -> tau+    tau-   )
     2.27413943E-04    2         -13        13   # BR(H -> mu+     mu-    )
     2.78774570E-04    2           3        -3   # BR(H -> s       sb     )
     1.56012015E-06    2           4        -4   # BR(H -> c       cb     )
     1.55868364E-01    2           6        -6   # BR(H -> t       tb     )
     5.18424726E-05    2          21        21   # BR(H -> g       g      )
     1.49140219E-07    2          22        22   # BR(H -> gam     gam    )
     9.19874241E-08    2          23        22   # BR(H -> Z       gam    )
     7.44986592E-05    2          24       -24   # BR(H -> W+      W-     )
     3.72021733E-05    2          23        23   # BR(H -> Z       Z      )
     2.69789795E-04    2          25        25   # BR(H -> h       h      )
    -4.00635590E-24    2          36        36   # BR(H -> A       A      )
     5.30716562E-19    2          23        36   # BR(H -> Z       A      )
     3.17450403E-03    2     1000024  -1000024   # BR(H -> ~chi_1+ ~chi_1-)
     6.71499441E-03    2     1000022   1000022   # BR(H -> ~chi_10 ~chi_10)
     3.68911523E-04    2     1000023   1000023   # BR(H -> ~chi_20 ~chi_20)
     2.44846036E-03    2     1000025   1000025   # BR(H -> ~chi_30 ~chi_30)
     2.39562285E-01    2     1000022   1000023   # BR(H -> ~chi_10 ~chi_20)
     1.54939509E-01    2     1000022   1000025   # BR(H -> ~chi_10 ~chi_30)
     3.32391419E-03    2     1000023   1000025   # BR(H -> ~chi_20 ~chi_30)
#
#         PDG            Width
DECAY        36     8.66796022E+00   # A decays
#          BR         NDA      ID1       ID2
     3.68172166E-01    2           5        -5   # BR(A -> b       bb     )
     6.42622021E-02    2         -15        15   # BR(A -> tau+    tau-   )
     2.27235933E-04    2         -13        13   # BR(A -> mu+     mu-    )
     2.78760025E-04    2           3        -3   # BR(A -> s       sb     )
     1.56509000E-06    2           4        -4   # BR(A -> c       cb     )
     1.56278613E-01    2           6        -6   # BR(A -> t       tb     )
     1.54639957E-04    2          21        21   # BR(A -> g       g      )
     5.93807624E-07    2          22        22   # BR(A -> gam     gam    )
     1.87197009E-07    2          23        22   # BR(A -> Z       gam    )
     7.41564891E-05    2          23        25   # BR(A -> Z       h      )
     3.48643482E-03    2     1000024  -1000024   # BR(A -> ~chi_1+ ~chi_1-)
     6.67213526E-03    2     1000022   1000022   # BR(A -> ~chi_10 ~chi_10)
     2.71050944E-04    2     1000023   1000023   # BR(A -> ~chi_20 ~chi_20)
     4.22314010E-03    2     1000025   1000025   # BR(A -> ~chi_30 ~chi_30)
     1.58340689E-01    2     1000022   1000023   # BR(A -> ~chi_10 ~chi_20)
     2.35193750E-01    2     1000022   1000025   # BR(A -> ~chi_10 ~chi_30)
     2.36268006E-03    2     1000023   1000025   # BR(A -> ~chi_20 ~chi_30)
#
#         PDG            Width
DECAY        37     8.61514271E+00   # H+ decays
#          BR         NDA      ID1       ID2
     5.90944145E-04    2           4        -5   # BR(H+ -> c       bb     )
     6.46870115E-02    2         -15        16   # BR(H+ -> tau+    nu_tau )
     2.28738091E-04    2         -13        14   # BR(H+ -> mu+     nu_mu  )
     3.78202270E-06    2           2        -5   # BR(H+ -> u       bb     )
     1.34215521E-05    2           2        -3   # BR(H+ -> u       sb     )
     2.77559098E-04    2           4        -3   # BR(H+ -> c       sb     )
     5.23325819E-01    2           6        -5   # BR(H+ -> t       bb     )
     7.47660683E-05    2          24        25   # BR(H+ -> W+      h      )
     9.13962575E-13    2          24        36   # BR(H+ -> W+      A      )
     4.07002270E-01    2     1000024   1000022   # BR(H+ -> ~chi_1+ ~chi_10)
     3.46593606E-03    2     1000024   1000023   # BR(H+ -> ~chi_1+ ~chi_20)
     3.29752868E-04    2     1000024   1000025   # BR(H+ -> ~chi_1+ ~chi_30)
