#
#                              ======================
#                              | THE SUSYHIT OUTPUT |
#                              ======================
#
#
#              ------------------------------------------------------
#              |     This is the output of the SUSY-HIT package     |
#              |  created by A.Djouadi, M.Muehlleitner and M.Spira. |
#              |  In case of problems with SUSY-HIT email to        |
#              |           margarete.muehlleitner@cern.ch           |
#              |           michael.spira@psi.ch                     |
#              |           abdelhak.djouadi@cern.ch                 |
#              ------------------------------------------------------
#
#              ------------------------------------------------------
#              |  SUSY Les Houches Accord - MSSM Spectrum + Decays  |
#              |              based on the decay programs           |
#              |                                                    |
#              |                     SDECAY 1.3b                    |
#              |                                                    |
#              |  Authors: M.Muhlleitner, A.Djouadi and Y.Mambrini  |
#              |  Ref.:    Comput.Phys.Commun.168(2005)46           |
#              |           [hep-ph/0311167]                         |
#              |                                                    |
#              |                     HDECAY 3.4                     |
#              |                                                    |
#              |  By: A.Djouadi,J.Kalinowski,M.Muhlleitner,M.Spira  |
#              |  Ref.:    Comput.Phys.Commun.108(1998)56           |
#              |           [hep-ph/9704448]                         |
#              |                                                    |
#              |                                                    |
#              |  If not stated otherwise all DRbar couplings and   |
#              |  soft SUSY breaking masses are given at the scale  |
#              |  Q=  0.50007233E+04
#              |                                                    |
#              ------------------------------------------------------
#
#
BLOCK DCINFO  # Decay Program information
     1   SDECAY/HDECAY # decay calculator
     2   1.3b  /3.4    # version number
#
BLOCK SPINFO  # Spectrum calculator information
     1    SOFTSUSY    # spectrum calculator                
     2    3.4.0       # version number                     
#
BLOCK MODSEL  # Model selection
     1     0   #  nonUniversal                                     
#
BLOCK SMINPUTS  # Standard Model inputs
         1     1.25778332E+02   # alpha_em^-1(M_Z)^MSbar
         2     1.16570000E-05   # G_F [GeV^-2]
         3     1.17200002E-01   # alpha_S(M_Z)^MSbar
         4     9.11876000E+01   # M_Z pole mass
         5     4.25000000E+00   # mb(mb)^MSbar
         6     1.72500000E+02   # mt pole mass
         7     1.77682000E+00   # mtau pole mass
#
BLOCK MINPAR  # Input parameters - minimal models
         3     1.00000000E+01   # tanb                
#
BLOCK EXTPAR  # Input parameters - non-minimal models
         0    -1.00000000E+00   # Set                 
         1     6.00000000E+01   # M_1(MX)             
         2     3.00000000E+03   # M_2(MX)             
         3     1.66797400E+03   # M_3(MX)             
        11     5.00000000E+03   # At(MX)              
        12     5.00000000E+03   # Ab(MX)              
        13     0.00000000E+00   # Atau(MX)            
        23    -1.34887200E+03   # mu(MX)              
        26     3.00000000E+03   # mA(pole)            
        31     5.00000000E+03   # meL(MX)             
        32     5.00000000E+03   # mmuL(MX)            
        33     5.00000000E+03   # mtauL(MX)           
        34     5.00000000E+03   # meR(MX)             
        35     5.00000000E+03   # mmuR(MX)            
        36     5.00000000E+03   # mtauR(MX)           
        41     5.00000000E+03   # mqL1(MX)            
        42     5.00000000E+03   # mqL2(MX)            
        43     5.00000000E+03   # mqL3(MX)            
        44     5.00000000E+03   # muR(MX)             
        45     5.00000000E+03   # mcR(MX)             
        46     5.00000000E+03   # mtR(MX)             
        47     5.00000000E+03   # mdR(MX)             
        48     5.00000000E+03   # msR(MX)             
        49     5.00000000E+03   # mbR(MX)             
#
BLOCK MASS  # Mass Spectrum
# PDG code           mass       particle
        24     8.00962053E+01   # W+
        25     1.24771578E+02   # h
        35     3.00008412E+03   # H
        36     2.99999990E+03   # A
        37     3.00087301E+03   # H+
         5     4.87878001E+00   # b-quark pole mass calculated from mb(mb)_Msbar
   1000001     5.07188940E+03   # ~d_L
   2000001     5.05410766E+03   # ~d_R
   1000002     5.07141574E+03   # ~u_L
   2000002     5.05383073E+03   # ~u_R
   1000003     5.07188940E+03   # ~s_L
   2000003     5.05410766E+03   # ~s_R
   1000004     5.07141574E+03   # ~c_L
   2000004     5.05383073E+03   # ~c_R
   1000005     5.01780678E+03   # ~b_1
   2000005     5.05288677E+03   # ~b_2
   1000006     4.90908203E+03   # ~t_1
   2000006     5.06361489E+03   # ~t_2
   1000011     5.01905279E+03   # ~e_L
   2000011     5.00591306E+03   # ~e_R
   1000012     5.01810471E+03   # ~nu_eL
   1000013     5.01905279E+03   # ~mu_L
   2000013     5.00591306E+03   # ~mu_R
   1000014     5.01810471E+03   # ~nu_muL
   1000015     5.00442502E+03   # ~tau_1
   2000015     5.01894825E+03   # ~tau_2
   1000016     5.01756412E+03   # ~nu_tauL
   1000021     2.00000092E+03   # ~g
   1000022     6.03031570E+01   # ~chi_10
   1000023     1.39947252E+03   # ~chi_20
   1000025    -1.40186055E+03   # ~chi_30
   1000035     3.07431782E+03   # ~chi_40
   1000024     1.40000015E+03   # ~chi_1+
   1000037     3.07448528E+03   # ~chi_2+
#
BLOCK NMIX  # Neutralino Mixing Matrix
  1  1     9.99491094E-01   # N_11
  1  2     1.47256851E-04   # N_12
  1  3    -3.18384297E-02   # N_13
  1  4     1.96111796E-03   # N_14
  2  1     2.11274958E-02   # N_21
  2  2     2.90581378E-02   # N_22
  2  3     7.06893243E-01   # N_23
  2  4     7.06407245E-01   # N_24
  3  1    -2.38954192E-02   # N_31
  3  2     1.35651606E-02   # N_32
  3  3    -7.06518352E-01   # N_33
  3  4     7.07161095E-01   # N_34
  4  1    -4.37187255E-04   # N_41
  4  2     9.99485662E-01   # N_42
  4  3    -1.09579140E-02   # N_43
  4  4    -3.01354215E-02   # N_44
#
BLOCK UMIX  # Chargino Mixing Matrix U
  1  1     1.55095009E-02   # U_11
  1  2     9.99879720E-01   # U_12
  2  1    -9.99879720E-01   # U_21
  2  2     1.55095009E-02   # U_22
#
BLOCK VMIX  # Chargino Mixing Matrix V
  1  1     4.26417033E-02   # V_11
  1  2    -9.99090429E-01   # V_12
  2  1    -9.99090429E-01   # V_21
  2  2    -4.26417033E-02   # V_22
#
BLOCK STOPMIX  # Stop Mixing Matrix
  1  1    -5.10036912E-01   # cos(theta_t)
  1  2     8.60152515E-01   # sin(theta_t)
  2  1    -8.60152515E-01   # -sin(theta_t)
  2  2    -5.10036912E-01   # cos(theta_t)
#
BLOCK SBOTMIX  # Sbottom Mixing Matrix
  1  1     9.95114402E-01   # cos(theta_b)
  1  2    -9.87285518E-02   # sin(theta_b)
  2  1     9.87285518E-02   # -sin(theta_b)
  2  2     9.95114402E-01   # cos(theta_b)
#
BLOCK STAUMIX  # Stau Mixing Matrix
  1  1    -1.57617924E-01   # cos(theta_tau)
  1  2     9.87500172E-01   # sin(theta_tau)
  2  1    -9.87500172E-01   # -sin(theta_tau)
  2  2    -1.57617924E-01   # cos(theta_tau)
#
BLOCK ALPHA  # Higgs mixing
          -1.05466339E-01   # Mixing angle in the neutral Higgs boson sector
#
BLOCK HMIX Q=  5.00072334E+03  # DRbar Higgs Parameters
         1    -1.37359447E+03   # mu(Q)MSSM           
         2     9.47023465E+00   # tan                 
         3     2.41936931E+02   # higgs               
         4     8.42052163E+06   # mA^2(Q)MSSM         
#
BLOCK GAUGE Q=  5.00072334E+03  # The gauge couplings
     1     3.70718994E-01   # gprime(Q) DRbar
     2     6.32172141E-01   # g(Q) DRbar
     3     9.98499296E-01   # g3(Q) DRbar
#
BLOCK AU Q=  5.00072334E+03  # The trilinear couplings
  1  1     5.00000001E+03   # A_u(Q) DRbar
  2  2     5.00000001E+03   # A_c(Q) DRbar
  3  3     5.00000002E+03   # A_t(Q) DRbar
#
BLOCK AD Q=  5.00072334E+03  # The trilinear couplings
  1  1     5.00000001E+03   # A_d(Q) DRbar
  2  2     5.00000001E+03   # A_s(Q) DRbar
  3  3     5.00000001E+03   # A_b(Q) DRbar
#
BLOCK AE Q=  5.00072334E+03  # The trilinear couplings
  1  1     0.00000000E+00   # A_e(Q) DRbar
  2  2     1.76171581E-07   # A_mu(Q) DRbar
  3  3     1.75812691E-07   # A_tau(Q) DRbar
#
BLOCK Yu Q=  5.00072334E+03  # The Yukawa couplings
  1  1     0.00000000E+00   # y_u(Q) DRbar
  2  2     0.00000000E+00   # y_c(Q) DRbar
  3  3     8.19644864E-01   # y_t(Q) DRbar
#
BLOCK Yd Q=  5.00072334E+03  # The Yukawa couplings
  1  1     0.00000000E+00   # y_d(Q) DRbar
  2  2     0.00000000E+00   # y_s(Q) DRbar
  3  3     1.31140708E-01   # y_b(Q) DRbar
#
BLOCK Ye Q=  5.00072334E+03  # The Yukawa couplings
  1  1     0.00000000E+00   # y_e(Q) DRbar
  2  2     0.00000000E+00   # y_mu(Q) DRbar
  3  3     9.66711462E-02   # y_tau(Q) DRbar
#
BLOCK MSOFT Q=  5.00072334E+03  # The soft SUSY breaking masses at the scale Q
         1     6.00000000E+01   # M_1(Q)              
         2     3.00000000E+03   # M_2(Q)              
         3     1.66797400E+03   # M_3(Q)              
        21     6.78836160E+06   # mH1^2(Q)            
        22    -1.33484955E+06   # mH2^2(Q)            
        31     5.00000000E+03   # meL(Q)              
        32     5.00000000E+03   # mmuL(Q)             
        33     5.00000000E+03   # mtauL(Q)            
        34     5.00000000E+03   # meR(Q)              
        35     5.00000000E+03   # mmuR(Q)             
        36     5.00000000E+03   # mtauR(Q)            
        41     5.00000000E+03   # mqL1(Q)             
        42     5.00000000E+03   # mqL2(Q)             
        43     5.00000000E+03   # mqL3(Q)             
        44     5.00000000E+03   # muR(Q)              
        45     5.00000000E+03   # mcR(Q)              
        46     4.99999999E+03   # mtR(Q)              
        47     5.00000000E+03   # mdR(Q)              
        48     5.00000000E+03   # msR(Q)              
        49     5.00000000E+03   # mbR(Q)              
#
#
#
#                             =================
#                             |The decay table|
#                             =================
#
# - The QCD corrections to the decays gluino -> squark  + quark
#                                     squark -> gaugino + quark_prime
#                                     squark -> squark_prime + Higgs
#                                     squark -> gluino  + quark
#   are included.
#
# - The multi-body decays for the inos, stops and sbottoms are included.
#
# - The loop induced decays for the gluino, neutralinos and stops
#   are included.
#
# - The SUSY decays of the top quark are included.
#
#
#         PDG            Width
DECAY         6     1.40042720E+00   # top decays
#          BR         NDA      ID1       ID2
     1.00000000E+00    2           5        24   # BR(t ->  b    W+)
#
#         PDG            Width
DECAY   1000021     3.40878826E-04   # gluino decays
#          BR         NDA      ID1       ID2
     7.57741465E-06    2     1000022        21   # BR(~g -> ~chi_10 g)
     6.56272057E-03    2     1000023        21   # BR(~g -> ~chi_20 g)
     6.50101614E-03    2     1000025        21   # BR(~g -> ~chi_30 g)
#           BR         NDA      ID1       ID2       ID3
     6.85706711E-02    3     1000022         1        -1   # BR(~g -> ~chi_10 d  db)
     7.33488944E-06    3     1000023         1        -1   # BR(~g -> ~chi_20 d  db)
     1.52785238E-06    3     1000025         1        -1   # BR(~g -> ~chi_30 d  db)
     2.33779379E-01    3     1000022         2        -2   # BR(~g -> ~chi_10 u  ub)
     1.46460703E-05    3     1000023         2        -2   # BR(~g -> ~chi_20 u  ub)
     1.57386558E-06    3     1000025         2        -2   # BR(~g -> ~chi_30 u  ub)
     6.85706711E-02    3     1000022         3        -3   # BR(~g -> ~chi_10 s  sb)
     7.33488944E-06    3     1000023         3        -3   # BR(~g -> ~chi_20 s  sb)
     1.52785238E-06    3     1000025         3        -3   # BR(~g -> ~chi_30 s  sb)
     2.33779379E-01    3     1000022         4        -4   # BR(~g -> ~chi_10 c  cb)
     1.46460703E-05    3     1000023         4        -4   # BR(~g -> ~chi_20 c  cb)
     1.57386558E-06    3     1000025         4        -4   # BR(~g -> ~chi_30 c  cb)
     6.94346442E-02    3     1000022         5        -5   # BR(~g -> ~chi_10 b  bb)
     9.63806293E-04    3     1000023         5        -5   # BR(~g -> ~chi_20 b  bb)
     9.35225789E-04    3     1000025         5        -5   # BR(~g -> ~chi_30 b  bb)
     2.26839326E-01    3     1000022         6        -6   # BR(~g -> ~chi_10 t  tb)
     1.94303709E-02    3     1000023         6        -6   # BR(~g -> ~chi_20 t  tb)
     1.17347729E-02    3     1000025         6        -6   # BR(~g -> ~chi_30 t  tb)
     1.92461593E-05    3     1000024         1        -2   # BR(~g -> ~chi_1+ d  ub)
     1.92461593E-05    3    -1000024         2        -1   # BR(~g -> ~chi_1- u  db)
     1.92461593E-05    3     1000024         3        -4   # BR(~g -> ~chi_1+ s  cb)
     1.92461593E-05    3    -1000024         4        -3   # BR(~g -> ~chi_1- c  sb)
     2.63816449E-02    3     1000024         5        -6   # BR(~g -> ~chi_1+ b  tb)
     2.63816449E-02    3    -1000024         6        -5   # BR(~g -> ~chi_1- t  bb)
#
#         PDG            Width
DECAY   1000006     3.32611211E+02   # stop1 decays
#          BR         NDA      ID1       ID2
     2.65207780E-02    2     1000022         6   # BR(~t_1 -> ~chi_10 t )
     8.38273863E-02    2     1000023         6   # BR(~t_1 -> ~chi_20 t )
     8.05875365E-02    2     1000025         6   # BR(~t_1 -> ~chi_30 t )
     6.42051105E-03    2     1000035         6   # BR(~t_1 -> ~chi_40 t )
     1.21297335E-01    2     1000024         5   # BR(~t_1 -> ~chi_1+ b )
     1.27763550E-02    2     1000037         5   # BR(~t_1 -> ~chi_2+ b )
     6.68570098E-01    2     1000021         6   # BR(~t_1 -> ~g      t )
#
#         PDG            Width
DECAY   2000006     3.42696933E+02   # stop2 decays
#          BR         NDA      ID1       ID2
     1.02787109E-02    2     1000022         6   # BR(~t_2 -> ~chi_10 t )
     8.41055257E-02    2     1000023         6   # BR(~t_2 -> ~chi_20 t )
     8.75220656E-02    2     1000025         6   # BR(~t_2 -> ~chi_30 t )
     1.60344965E-02    2     1000035         6   # BR(~t_2 -> ~chi_40 t )
     5.09017647E-02    2     1000024         5   # BR(~t_2 -> ~chi_1+ b )
     3.18564527E-02    2     1000037         5   # BR(~t_2 -> ~chi_2+ b )
     7.15557263E-01    2     1000021         6   # BR(~t_2 -> ~g      t )
     8.35173596E-04    2     1000006        25   # BR(~t_2 -> ~t_1    h )
     2.90854765E-03    2     1000006        23   # BR(~t_2 -> ~t_1    Z )
#
#         PDG            Width
DECAY   1000005     3.18758562E+02   # sbottom1 decays
#          BR         NDA      ID1       ID2
     2.44376091E-03    2     1000022         5   # BR(~b_1 -> ~chi_10 b )
     2.36860058E-03    2     1000023         5   # BR(~b_1 -> ~chi_20 b )
     2.25711088E-03    2     1000025         5   # BR(~b_1 -> ~chi_30 b )
     2.35219252E-02    2     1000035         5   # BR(~b_1 -> ~chi_40 b )
     1.77650984E-01    2    -1000024         6   # BR(~b_1 -> ~chi_1- t )
     4.73251266E-02    2    -1000037         6   # BR(~b_1 -> ~chi_2- t )
     7.42696882E-01    2     1000021         5   # BR(~b_1 -> ~g      b )
     1.73560933E-03    2     1000006       -24   # BR(~b_1 -> ~t_1    W-)
#
#         PDG            Width
DECAY   2000005     2.46098563E+02   # sbottom2 decays
#          BR         NDA      ID1       ID2
     1.19029503E-02    2     1000022         5   # BR(~b_2 -> ~chi_10 b )
     2.96859757E-03    2     1000023         5   # BR(~b_2 -> ~chi_20 b )
     3.08620624E-03    2     1000025         5   # BR(~b_2 -> ~chi_30 b )
     3.13077331E-04    2     1000035         5   # BR(~b_2 -> ~chi_40 b )
     8.18135307E-03    2    -1000024         6   # BR(~b_2 -> ~chi_1- t )
     6.29672014E-04    2    -1000037         6   # BR(~b_2 -> ~chi_2- t )
     9.72824303E-01    2     1000021         5   # BR(~b_2 -> ~g      b )
     9.38407862E-05    2     1000006       -24   # BR(~b_2 -> ~t_1    W-)
#
#         PDG            Width
DECAY   1000002     2.65178201E+02   # sup_L decays
#          BR         NDA      ID1       ID2
     2.81377824E-03    2     1000022         2   # BR(~u_L -> ~chi_10 u)
     6.93458484E-05    2     1000023         2   # BR(~u_L -> ~chi_20 u)
     4.97773425E-06    2     1000025         2   # BR(~u_L -> ~chi_30 u)
     2.95822469E-02    2     1000035         2   # BR(~u_L -> ~chi_40 u)
     2.28930371E-04    2     1000024         1   # BR(~u_L -> ~chi_1+ d)
     5.91203907E-02    2     1000037         1   # BR(~u_L -> ~chi_2+ d)
     9.08180330E-01    2     1000021         2   # BR(~u_L -> ~g      u)
#
#         PDG            Width
DECAY   2000002     2.51267670E+02   # sup_R decays
#          BR         NDA      ID1       ID2
     4.72748100E-02    2     1000022         2   # BR(~u_R -> ~chi_10 u)
     1.80482493E-05    2     1000023         2   # BR(~u_R -> ~chi_20 u)
     2.30739962E-05    2     1000025         2   # BR(~u_R -> ~chi_30 u)
     3.61056420E-09    2     1000035         2   # BR(~u_R -> ~chi_40 u)
     9.52684064E-01    2     1000021         2   # BR(~u_R -> ~g      u)
#
#         PDG            Width
DECAY   1000001     2.65193370E+02   # sdown_L decays
#          BR         NDA      ID1       ID2
     2.80541254E-03    2     1000022         1   # BR(~d_L -> ~chi_10 d)
     3.91265635E-05    2     1000023         1   # BR(~d_L -> ~chi_20 d)
     2.09270039E-05    2     1000025         1   # BR(~d_L -> ~chi_30 d)
     2.95998168E-02    2     1000035         1   # BR(~d_L -> ~chi_40 d)
     3.02872129E-05    2    -1000024         2   # BR(~d_L -> ~chi_1- u)
     5.92287499E-02    2    -1000037         2   # BR(~d_L -> ~chi_2- u)
     9.08275680E-01    2     1000021         1   # BR(~d_L -> ~g      d)
#
#         PDG            Width
DECAY   2000001     2.42373971E+02   # sdown_R decays
#          BR         NDA      ID1       ID2
     1.22530589E-02    2     1000022         1   # BR(~d_R -> ~chi_10 d)
     4.67797146E-06    2     1000023         1   # BR(~d_R -> ~chi_20 d)
     5.98060793E-06    2     1000025         1   # BR(~d_R -> ~chi_30 d)
     9.35933611E-10    2     1000035         1   # BR(~d_R -> ~chi_40 d)
     9.87736282E-01    2     1000021         1   # BR(~d_R -> ~g      d)
#
#         PDG            Width
DECAY   1000004     2.65178201E+02   # scharm_L decays
#          BR         NDA      ID1       ID2
     2.81377824E-03    2     1000022         4   # BR(~c_L -> ~chi_10 c)
     6.93458484E-05    2     1000023         4   # BR(~c_L -> ~chi_20 c)
     4.97773425E-06    2     1000025         4   # BR(~c_L -> ~chi_30 c)
     2.95822469E-02    2     1000035         4   # BR(~c_L -> ~chi_40 c)
     2.28930371E-04    2     1000024         3   # BR(~c_L -> ~chi_1+ s)
     5.91203907E-02    2     1000037         3   # BR(~c_L -> ~chi_2+ s)
     9.08180330E-01    2     1000021         4   # BR(~c_L -> ~g      c)
#
#         PDG            Width
DECAY   2000004     2.51267670E+02   # scharm_R decays
#          BR         NDA      ID1       ID2
     4.72748100E-02    2     1000022         4   # BR(~c_R -> ~chi_10 c)
     1.80482493E-05    2     1000023         4   # BR(~c_R -> ~chi_20 c)
     2.30739962E-05    2     1000025         4   # BR(~c_R -> ~chi_30 c)
     3.61056420E-09    2     1000035         4   # BR(~c_R -> ~chi_40 c)
     9.52684064E-01    2     1000021         4   # BR(~c_R -> ~g      c)
#
#         PDG            Width
DECAY   1000003     2.65193370E+02   # sstrange_L decays
#          BR         NDA      ID1       ID2
     2.80541254E-03    2     1000022         3   # BR(~s_L -> ~chi_10 s)
     3.91265635E-05    2     1000023         3   # BR(~s_L -> ~chi_20 s)
     2.09270039E-05    2     1000025         3   # BR(~s_L -> ~chi_30 s)
     2.95998168E-02    2     1000035         3   # BR(~s_L -> ~chi_40 s)
     3.02872129E-05    2    -1000024         4   # BR(~s_L -> ~chi_1- c)
     5.92287499E-02    2    -1000037         4   # BR(~s_L -> ~chi_2- c)
     9.08275680E-01    2     1000021         3   # BR(~s_L -> ~g      s)
#
#         PDG            Width
DECAY   2000003     2.42373971E+02   # sstrange_R decays
#          BR         NDA      ID1       ID2
     1.22530589E-02    2     1000022         3   # BR(~s_R -> ~chi_10 s)
     4.67797146E-06    2     1000023         3   # BR(~s_R -> ~chi_20 s)
     5.98060793E-06    2     1000025         3   # BR(~s_R -> ~chi_30 s)
     9.35933611E-10    2     1000035         3   # BR(~s_R -> ~chi_40 s)
     9.87736282E-01    2     1000021         3   # BR(~s_R -> ~g      s)
#
#         PDG            Width
DECAY   1000011     3.02425904E+01   # selectron_L decays
#          BR         NDA      ID1       ID2
     2.26695688E-01    2     1000022        11   # BR(~e_L -> ~chi_10 e-)
     9.63996185E-04    2     1000023        11   # BR(~e_L -> ~chi_20 e-)
     1.12364945E-07    2     1000025        11   # BR(~e_L -> ~chi_30 e-)
     2.57155957E-01    2     1000035        11   # BR(~e_L -> ~chi_40 e-)
     2.69925511E-04    2    -1000024        12   # BR(~e_L -> ~chi_1- nu_e)
     5.14914321E-01    2    -1000037        12   # BR(~e_L -> ~chi_2- nu_e)
#
#         PDG            Width
DECAY   2000011     2.73615458E+01   # selectron_R decays
#          BR         NDA      ID1       ID2
     9.99135273E-01    2     1000022        11   # BR(~e_R -> ~chi_10 e-)
     3.79492707E-04    2     1000023        11   # BR(~e_R -> ~chi_20 e-)
     4.85160153E-04    2     1000025        11   # BR(~e_R -> ~chi_30 e-)
     7.41778185E-08    2     1000035        11   # BR(~e_R -> ~chi_40 e-)
#
#         PDG            Width
DECAY   1000013     3.02425904E+01   # smuon_L decays
#          BR         NDA      ID1       ID2
     2.26695688E-01    2     1000022        13   # BR(~mu_L -> ~chi_10 mu-)
     9.63996185E-04    2     1000023        13   # BR(~mu_L -> ~chi_20 mu-)
     1.12364945E-07    2     1000025        13   # BR(~mu_L -> ~chi_30 mu-)
     2.57155957E-01    2     1000035        13   # BR(~mu_L -> ~chi_40 mu-)
     2.69925511E-04    2    -1000024        14   # BR(~mu_L -> ~chi_1- nu_mu)
     5.14914321E-01    2    -1000037        14   # BR(~mu_L -> ~chi_2- nu_mu)
#
#         PDG            Width
DECAY   2000013     2.73615458E+01   # smuon_R decays
#          BR         NDA      ID1       ID2
     9.99135273E-01    2     1000022        13   # BR(~mu_R -> ~chi_10 mu-)
     3.79492707E-04    2     1000023        13   # BR(~mu_R -> ~chi_20 mu-)
     4.85160153E-04    2     1000025        13   # BR(~mu_R -> ~chi_30 mu-)
     7.41778185E-08    2     1000035        13   # BR(~mu_R -> ~chi_40 mu-)
#
#         PDG            Width
DECAY   1000015     2.90041978E+01   # stau_1 decays
#          BR         NDA      ID1       ID2
     9.25607331E-01    2     1000022        15   # BR(~tau_1 -> ~chi_10  tau-)
     1.44567263E-02    2     1000023        15   # BR(~tau_1 -> ~chi_20  tau-)
     1.32804908E-02    2     1000025        15   # BR(~tau_1 -> ~chi_30  tau-)
     6.40084472E-03    2     1000035        15   # BR(~tau_1 -> ~chi_40  tau-)
     2.74380197E-02    2    -1000024        16   # BR(~tau_1 -> ~chi_1-  nu_tau)
     1.28165873E-02    2    -1000037        16   # BR(~tau_1 -> ~chi_2-  nu_tau)
#
#         PDG            Width
DECAY   2000015     3.09602365E+01   # stau_2 decays
#          BR         NDA      ID1       ID2
     2.37151461E-01    2     1000022        15   # BR(~tau_2 -> ~chi_10  tau-)
     1.33020507E-02    2     1000023        15   # BR(~tau_2 -> ~chi_20  tau-)
     1.35188963E-02    2     1000025        15   # BR(~tau_2 -> ~chi_30  tau-)
     2.45123234E-01    2     1000035        15   # BR(~tau_2 -> ~chi_40  tau-)
     8.45784640E-05    2    -1000024        16   # BR(~tau_2 -> ~chi_1-  nu_tau)
     4.90819779E-01    2    -1000037        16   # BR(~tau_2 -> ~chi_2-  nu_tau)
#
#         PDG            Width
DECAY   1000012     3.02448037E+01   # snu_eL decays
#          BR         NDA      ID1       ID2
     2.26408610E-01    2     1000022        12   # BR(~nu_eL -> ~chi_10 nu_e)
     1.55857138E-04    2     1000023        12   # BR(~nu_eL -> ~chi_20 nu_e)
     4.26388291E-04    2     1000025        12   # BR(~nu_eL -> ~chi_30 nu_e)
     2.57235696E-01    2     1000035        12   # BR(~nu_eL -> ~chi_40 nu_e)
     2.03974490E-03    2     1000024        11   # BR(~nu_eL -> ~chi_1+ e-)
     5.13733704E-01    2     1000037        11   # BR(~nu_eL -> ~chi_2+ e-)
#
#         PDG            Width
DECAY   1000014     3.02448037E+01   # snu_muL decays
#          BR         NDA      ID1       ID2
     2.26408610E-01    2     1000022        14   # BR(~nu_muL -> ~chi_10 nu_mu)
     1.55857138E-04    2     1000023        14   # BR(~nu_muL -> ~chi_20 nu_mu)
     4.26388291E-04    2     1000025        14   # BR(~nu_muL -> ~chi_30 nu_mu)
     2.57235696E-01    2     1000035        14   # BR(~nu_muL -> ~chi_40 nu_mu)
     2.03974490E-03    2     1000024        13   # BR(~nu_muL -> ~chi_1+ mu-)
     5.13733704E-01    2     1000037        13   # BR(~nu_muL -> ~chi_2+ mu-)
#
#         PDG            Width
DECAY   1000016     3.10286986E+01   # snu_tauL decays
#          BR         NDA      ID1       ID2
     2.20664937E-01    2     1000022        16   # BR(~nu_tauL -> ~chi_10 nu_tau)
     1.51897746E-04    2     1000023        16   # BR(~nu_tauL -> ~chi_20 nu_tau)
     4.15556277E-04    2     1000025        16   # BR(~nu_tauL -> ~chi_30 nu_tau)
     2.50645079E-01    2     1000035        16   # BR(~nu_tauL -> ~chi_40 nu_tau)
     2.75503320E-02    2     1000024        15   # BR(~nu_tauL -> ~chi_1+ tau-)
     5.00572197E-01    2     1000037        15   # BR(~nu_tauL -> ~chi_2+ tau-)
#
#         PDG            Width
DECAY   1000024     8.59965155E-01   # chargino1+ decays
#          BR         NDA      ID1       ID2
     1.00000000E+00    2     1000022        24   # BR(~chi_1+ -> ~chi_10  W+)
#
#         PDG            Width
DECAY   1000037     1.88539664E+01   # chargino2+ decays
#          BR         NDA      ID1       ID2
     2.52814759E-01    2     1000024        23   # BR(~chi_2+ -> ~chi_1+  Z )
     2.42470574E-04    2     1000022        24   # BR(~chi_2+ -> ~chi_10  W+)
     2.43967686E-01    2     1000023        24   # BR(~chi_2+ -> ~chi_20  W+)
     2.43782407E-01    2     1000025        24   # BR(~chi_2+ -> ~chi_30  W+)
     2.59192210E-01    2     1000024        25   # BR(~chi_2+ -> ~chi_1+  h )
     4.67170577E-07    2     1000022        37   # BR(~chi_2+ -> ~chi_10  H+)
#
#         PDG            Width
DECAY   1000022     0.00000000E+00   # neutralino1 decays
#
#         PDG            Width
DECAY   1000023     9.03072796E-01   # neutralino2 decays
#          BR         NDA      ID1       ID2
     5.54024873E-01    2     1000022        23   # BR(~chi_20 -> ~chi_10   Z )
     4.45975127E-01    2     1000022        25   # BR(~chi_20 -> ~chi_10   h )
#
#         PDG            Width
DECAY   1000025     9.11426874E-01   # neutralino3 decays
#          BR         NDA      ID1       ID2
     4.29727051E-01    2     1000022        23   # BR(~chi_30 -> ~chi_10   Z )
     5.70272949E-01    2     1000022        25   # BR(~chi_30 -> ~chi_10   h )
#
#         PDG            Width
DECAY   1000035     1.88590603E+01   # neutralino4 decays
#          BR         NDA      ID1       ID2
     8.22968933E-05    2     1000022        23   # BR(~chi_40 -> ~chi_10   Z )
     4.53965043E-02    2     1000023        23   # BR(~chi_40 -> ~chi_20   Z )
     2.06801388E-01    2     1000025        23   # BR(~chi_40 -> ~chi_30   Z )
     2.44423851E-01    2     1000024       -24   # BR(~chi_40 -> ~chi_1+   W-)
     2.44423851E-01    2    -1000024        24   # BR(~chi_40 -> ~chi_1-   W+)
     1.65192621E-04    2     1000022        25   # BR(~chi_40 -> ~chi_10   h )
     4.23809597E-07    2     1000022        35   # BR(~chi_40 -> ~chi_10   H )
     6.02412663E-08    2     1000022        36   # BR(~chi_40 -> ~chi_10   A )
     2.13296484E-01    2     1000023        25   # BR(~chi_40 -> ~chi_20   h )
     4.54099480E-02    2     1000025        25   # BR(~chi_40 -> ~chi_30   h )
#
#         PDG            Width
DECAY        25     4.04778723E-03   # h decays
#          BR         NDA      ID1       ID2
     6.07324674E-01    2           5        -5   # BR(h -> b       bb     )
     6.40725717E-02    2         -15        15   # BR(h -> tau+    tau-   )
     2.26840208E-04    2         -13        13   # BR(h -> mu+     mu-    )
     4.80889590E-04    2           3        -3   # BR(h -> s       sb     )
     2.08391212E-02    2           4        -4   # BR(h -> c       cb     )
     6.74070183E-02    2          21        21   # BR(h -> g       g      )
     2.31771768E-03    2          22        22   # BR(h -> gam     gam    )
     1.49424565E-03    2          22        23   # BR(h -> Z       gam    )
     2.10690944E-01    2          24       -24   # BR(h -> W+      W-     )
     2.51097083E-02    2          23        23   # BR(h -> Z       Z      )
     3.62697982E-05    2     1000022   1000022   # BR(h -> ~chi_10 ~chi_10)
#
#         PDG            Width
DECAY        35     7.44877797E+00   # H decays
#          BR         NDA      ID1       ID2
     4.37458017E-01    2           5        -5   # BR(H -> b       bb     )
     7.47986387E-02    2         -15        15   # BR(H -> tau+    tau-   )
     2.64493928E-04    2         -13        13   # BR(H -> mu+     mu-    )
     3.24228995E-04    2           3        -3   # BR(H -> s       sb     )
     1.81322112E-06    2           4        -4   # BR(H -> c       cb     )
     1.81155154E-01    2           6        -6   # BR(H -> t       tb     )
     6.01491446E-05    2          21        21   # BR(H -> g       g      )
     3.84167646E-07    2          22        22   # BR(H -> gam     gam    )
     1.06982210E-07    2          23        22   # BR(H -> Z       gam    )
     8.13812550E-05    2          24       -24   # BR(H -> W+      W-     )
     4.06391279E-05    2          23        23   # BR(H -> Z       Z      )
     3.06404315E-04    2          25        25   # BR(H -> h       h      )
     8.13762771E-25    2          36        36   # BR(H -> A       A      )
     3.50666120E-19    2          23        36   # BR(H -> Z       A      )
     3.04262282E-04    2     1000024  -1000024   # BR(H -> ~chi_1+ ~chi_1-)
     9.89220713E-04    2     1000022   1000022   # BR(H -> ~chi_10 ~chi_10)
     2.94681999E-05    2     1000023   1000023   # BR(H -> ~chi_20 ~chi_20)
     4.25384229E-05    2     1000025   1000025   # BR(H -> ~chi_30 ~chi_30)
     1.81142798E-01    2     1000022   1000023   # BR(H -> ~chi_10 ~chi_20)
     1.22944144E-01    2     1000022   1000025   # BR(H -> ~chi_10 ~chi_30)
     5.61573976E-05    2     1000023   1000025   # BR(H -> ~chi_20 ~chi_30)
#
#         PDG            Width
DECAY        36     7.46794069E+00   # A decays
#          BR         NDA      ID1       ID2
     4.36481659E-01    2           5        -5   # BR(A -> b       bb     )
     7.46088521E-02    2         -15        15   # BR(A -> tau+    tau-   )
     2.63822458E-04    2         -13        13   # BR(A -> mu+     mu-    )
     3.23642232E-04    2           3        -3   # BR(A -> s       sb     )
     1.81608756E-06    2           4        -4   # BR(A -> c       cb     )
     1.81341421E-01    2           6        -6   # BR(A -> t       tb     )
     1.79460321E-04    2          21        21   # BR(A -> g       g      )
     4.26286058E-07    2          22        22   # BR(A -> gam     gam    )
     2.17392223E-07    2          23        22   # BR(A -> Z       gam    )
     8.08654672E-05    2          23        25   # BR(A -> Z       h      )
     2.01791607E-03    2     1000024  -1000024   # BR(A -> ~chi_1+ ~chi_1-)
     1.01439009E-03    2     1000022   1000022   # BR(A -> ~chi_10 ~chi_10)
     1.48381695E-04    2     1000023   1000023   # BR(A -> ~chi_20 ~chi_20)
     5.12431873E-04    2     1000025   1000025   # BR(A -> ~chi_30 ~chi_30)
     1.24114151E-01    2     1000022   1000023   # BR(A -> ~chi_10 ~chi_20)
     1.78909820E-01    2     1000022   1000025   # BR(A -> ~chi_10 ~chi_30)
     7.27134815E-07    2     1000023   1000025   # BR(A -> ~chi_20 ~chi_30)
#
#         PDG            Width
DECAY        37     7.45088219E+00   # H+ decays
#          BR         NDA      ID1       ID2
     7.03655497E-04    2           4        -5   # BR(H+ -> c       bb     )
     7.48014297E-02    2         -15        16   # BR(H+ -> tau+    nu_tau )
     2.64503427E-04    2         -13        14   # BR(H+ -> mu+     nu_mu  )
     4.50337211E-06    2           2        -5   # BR(H+ -> u       bb     )
     1.55205103E-05    2           2        -3   # BR(H+ -> u       sb     )
     3.20964818E-04    2           4        -3   # BR(H+ -> c       sb     )
     6.17734930E-01    2           6        -5   # BR(H+ -> t       bb     )
     8.11734372E-05    2          24        25   # BR(H+ -> W+      h      )
     8.94991141E-14    2          24        36   # BR(H+ -> W+      A      )
     3.05799843E-01    2     1000024   1000022   # BR(H+ -> ~chi_1+ ~chi_10)
     2.16813571E-04    2     1000024   1000023   # BR(H+ -> ~chi_1+ ~chi_20)
     5.66625141E-05    2     1000024   1000025   # BR(H+ -> ~chi_1+ ~chi_30)
