#
#                              ======================
#                              | THE SUSYHIT OUTPUT |
#                              ======================
#
#
#              ------------------------------------------------------
#              |     This is the output of the SUSY-HIT package     |
#              |  created by A.Djouadi, M.Muehlleitner and M.Spira. |
#              |  In case of problems with SUSY-HIT email to        |
#              |           margarete.muehlleitner@cern.ch           |
#              |           michael.spira@psi.ch                     |
#              |           abdelhak.djouadi@cern.ch                 |
#              ------------------------------------------------------
#
#              ------------------------------------------------------
#              |  SUSY Les Houches Accord - MSSM Spectrum + Decays  |
#              |              based on the decay programs           |
#              |                                                    |
#              |                     SDECAY 1.3b                    |
#              |                                                    |
#              |  Authors: M.Muhlleitner, A.Djouadi and Y.Mambrini  |
#              |  Ref.:    Comput.Phys.Commun.168(2005)46           |
#              |           [hep-ph/0311167]                         |
#              |                                                    |
#              |                     HDECAY 3.4                     |
#              |                                                    |
#              |  By: A.Djouadi,J.Kalinowski,M.Muhlleitner,M.Spira  |
#              |  Ref.:    Comput.Phys.Commun.108(1998)56           |
#              |           [hep-ph/9704448]                         |
#              |                                                    |
#              |                                                    |
#              |  If not stated otherwise all DRbar couplings and   |
#              |  soft SUSY breaking masses are given at the scale  |
#              |  Q=  0.50007412E+04
#              |                                                    |
#              ------------------------------------------------------
#
#
BLOCK DCINFO  # Decay Program information
     1   SDECAY/HDECAY # decay calculator
     2   1.3b  /3.4    # version number
#
BLOCK SPINFO  # Spectrum calculator information
     1    SOFTSUSY    # spectrum calculator                
     2    3.4.0       # version number                     
#
BLOCK MODSEL  # Model selection
     1     0   #  nonUniversal                                     
#
BLOCK SMINPUTS  # Standard Model inputs
         1     1.25778332E+02   # alpha_em^-1(M_Z)^MSbar
         2     1.16570000E-05   # G_F [GeV^-2]
         3     1.17200002E-01   # alpha_S(M_Z)^MSbar
         4     9.11876000E+01   # M_Z pole mass
         5     4.25000000E+00   # mb(mb)^MSbar
         6     1.72500000E+02   # mt pole mass
         7     1.77682000E+00   # mtau pole mass
#
BLOCK MINPAR  # Input parameters - minimal models
         3     1.00000000E+01   # tanb                
#
BLOCK EXTPAR  # Input parameters - non-minimal models
         0    -1.00000000E+00   # Set                 
         1     6.00000000E+01   # M_1(MX)             
         2     3.00000000E+03   # M_2(MX)             
         3     6.88105000E+02   # M_3(MX)             
        11     5.00000000E+03   # At(MX)              
        12     5.00000000E+03   # Ab(MX)              
        13     0.00000000E+00   # Atau(MX)            
        23    -5.71671000E+02   # mu(MX)              
        26     3.00000000E+03   # mA(pole)            
        31     5.00000000E+03   # meL(MX)             
        32     5.00000000E+03   # mmuL(MX)            
        33     5.00000000E+03   # mtauL(MX)           
        34     5.00000000E+03   # meR(MX)             
        35     5.00000000E+03   # mmuR(MX)            
        36     5.00000000E+03   # mtauR(MX)           
        41     5.00000000E+03   # mqL1(MX)            
        42     5.00000000E+03   # mqL2(MX)            
        43     5.00000000E+03   # mqL3(MX)            
        44     5.00000000E+03   # muR(MX)             
        45     5.00000000E+03   # mcR(MX)             
        46     5.00000000E+03   # mtR(MX)             
        47     5.00000000E+03   # mdR(MX)             
        48     5.00000000E+03   # msR(MX)             
        49     5.00000000E+03   # mbR(MX)             
#
BLOCK MASS  # Mass Spectrum
# PDG code           mass       particle
        24     8.00902473E+01   # W+
        25     1.24211759E+02   # h
        35     3.00008393E+03   # H
        36     2.99999915E+03   # A
        37     3.00140216E+03   # H+
         5     4.87878001E+00   # b-quark pole mass calculated from mb(mb)_Msbar
   1000001     5.06349765E+03   # ~d_L
   2000001     5.04563177E+03   # ~d_R
   1000002     5.06301984E+03   # ~u_L
   2000002     5.04533350E+03   # ~u_R
   1000003     5.06349765E+03   # ~s_L
   2000003     5.04563177E+03   # ~s_R
   1000004     5.06301984E+03   # ~c_L
   2000004     5.04533350E+03   # ~c_R
   1000005     5.01007889E+03   # ~b_1
   2000005     5.04398055E+03   # ~b_2
   1000006     4.90061055E+03   # ~t_1
   2000006     5.05529762E+03   # ~t_2
   1000011     5.01910168E+03   # ~e_L
   2000011     5.00593988E+03   # ~e_R
   1000012     5.01815112E+03   # ~nu_eL
   1000013     5.01910168E+03   # ~mu_L
   2000013     5.00593988E+03   # ~mu_R
   1000014     5.01815112E+03   # ~nu_muL
   1000015     5.00474870E+03   # ~tau_1
   2000015     5.01865266E+03   # ~tau_2
   1000016     5.01760032E+03   # ~nu_tauL
   1000021     9.00000414E+02   # ~g
   1000022     6.02507010E+01   # ~chi_10
   1000023     6.00197919E+02   # ~chi_20
   1000025    -6.02420130E+02   # ~chi_30
   1000035     3.07419206E+03   # ~chi_40
   1000024     6.00000726E+02   # ~chi_1+
   1000037     3.07435978E+03   # ~chi_2+
#
BLOCK NMIX  # Neutralino Mixing Matrix
  1  1     9.97247699E-01   # N_11
  1  2     2.26962549E-04   # N_12
  1  3    -7.41412033E-02   # N_13
  1  4     2.38720057E-04   # N_14
  2  1     5.22843640E-02   # N_21
  2  2     1.97604728E-02   # N_22
  2  3     7.05593896E-01   # N_23
  2  4     7.06408609E-01   # N_24
  3  1    -5.25663401E-02   # N_31
  3  2     1.65533129E-02   # N_32
  3  3    -7.04723508E-01   # N_33
  3  4     7.07338353E-01   # N_34
  4  1    -3.89483994E-04   # N_41
  4  2     9.99667675E-01   # N_42
  4  3    -2.26128448E-03   # N_43
  4  4    -2.56763483E-02   # N_44
#
BLOCK UMIX  # Chargino Mixing Matrix U
  1  1     3.20506648E-03   # U_11
  1  2     9.99994864E-01   # U_12
  2  1    -9.99994864E-01   # U_21
  2  2     3.20506648E-03   # U_22
#
BLOCK VMIX  # Chargino Mixing Matrix V
  1  1     3.63357611E-02   # V_11
  1  2    -9.99339638E-01   # V_12
  2  1    -9.99339638E-01   # V_21
  2  2    -3.63357611E-02   # V_22
#
BLOCK STOPMIX  # Stop Mixing Matrix
  1  1    -5.08225068E-01   # cos(theta_t)
  1  2     8.61224291E-01   # sin(theta_t)
  2  1    -8.61224291E-01   # -sin(theta_t)
  2  2    -5.08225068E-01   # cos(theta_t)
#
BLOCK SBOTMIX  # Sbottom Mixing Matrix
  1  1     9.98424697E-01   # cos(theta_b)
  1  2    -5.61081493E-02   # sin(theta_b)
  2  1     5.61081493E-02   # -sin(theta_b)
  2  2     9.98424697E-01   # cos(theta_b)
#
BLOCK STAUMIX  # Stau Mixing Matrix
  1  1    -6.84768041E-02   # cos(theta_tau)
  1  2     9.97652709E-01   # sin(theta_tau)
  2  1    -9.97652709E-01   # -sin(theta_tau)
  2  2    -6.84768041E-02   # cos(theta_tau)
#
BLOCK ALPHA  # Higgs mixing
          -1.05422397E-01   # Mixing angle in the neutral Higgs boson sector
#
BLOCK HMIX Q=  5.00074121E+03  # DRbar Higgs Parameters
         1    -5.81769903E+02   # mu(Q)MSSM           
         2     9.47470967E+00   # tan                 
         3     2.41858301E+02   # higgs               
         4     8.63855091E+06   # mA^2(Q)MSSM         
#
BLOCK GAUGE Q=  5.00074121E+03  # The gauge couplings
     1     3.70936031E-01   # gprime(Q) DRbar
     2     6.33177955E-01   # g(Q) DRbar
     3     1.01019779E+00   # g3(Q) DRbar
#
BLOCK AU Q=  5.00074121E+03  # The trilinear couplings
  1  1     5.00000001E+03   # A_u(Q) DRbar
  2  2     5.00000001E+03   # A_c(Q) DRbar
  3  3     5.00000001E+03   # A_t(Q) DRbar
#
BLOCK AD Q=  5.00074121E+03  # The trilinear couplings
  1  1     5.00000000E+03   # A_d(Q) DRbar
  2  2     5.00000000E+03   # A_s(Q) DRbar
  3  3     5.00000001E+03   # A_b(Q) DRbar
#
BLOCK AE Q=  5.00074121E+03  # The trilinear couplings
  1  1     0.00000000E+00   # A_e(Q) DRbar
  2  2     0.00000000E+00   # A_mu(Q) DRbar
  3  3    -1.44439294E-09   # A_tau(Q) DRbar
#
BLOCK Yu Q=  5.00074121E+03  # The Yukawa couplings
  1  1     0.00000000E+00   # y_u(Q) DRbar
  2  2     0.00000000E+00   # y_c(Q) DRbar
  3  3     8.13434506E-01   # y_t(Q) DRbar
#
BLOCK Yd Q=  5.00074121E+03  # The Yukawa couplings
  1  1     0.00000000E+00   # y_d(Q) DRbar
  2  2     0.00000000E+00   # y_s(Q) DRbar
  3  3     1.28954170E-01   # y_b(Q) DRbar
#
BLOCK Ye Q=  5.00074121E+03  # The Yukawa couplings
  1  1     0.00000000E+00   # y_e(Q) DRbar
  2  2     0.00000000E+00   # y_mu(Q) DRbar
  3  3     9.70968722E-02   # y_tau(Q) DRbar
#
BLOCK MSOFT Q=  5.00074121E+03  # The soft SUSY breaking masses at the scale Q
         1     6.00000000E+01   # M_1(Q)              
         2     3.00000000E+03   # M_2(Q)              
         3     6.88105000E+02   # M_3(Q)              
        21     8.38051406E+06   # mH1^2(Q)            
        22     2.29591505E+05   # mH2^2(Q)            
        31     5.00000000E+03   # meL(Q)              
        32     5.00000000E+03   # mmuL(Q)             
        33     5.00000000E+03   # mtauL(Q)            
        34     5.00000000E+03   # meR(Q)              
        35     5.00000000E+03   # mmuR(Q)             
        36     5.00000000E+03   # mtauR(Q)            
        41     5.00000000E+03   # mqL1(Q)             
        42     5.00000000E+03   # mqL2(Q)             
        43     5.00000000E+03   # mqL3(Q)             
        44     5.00000000E+03   # muR(Q)              
        45     5.00000000E+03   # mcR(Q)              
        46     5.00000000E+03   # mtR(Q)              
        47     5.00000000E+03   # mdR(Q)              
        48     5.00000000E+03   # msR(Q)              
        49     5.00000000E+03   # mbR(Q)              
#
#
#
#                             =================
#                             |The decay table|
#                             =================
#
# - The QCD corrections to the decays gluino -> squark  + quark
#                                     squark -> gaugino + quark_prime
#                                     squark -> squark_prime + Higgs
#                                     squark -> gluino  + quark
#   are included.
#
# - The multi-body decays for the inos, stops and sbottoms are included.
#
# - The loop induced decays for the gluino, neutralinos and stops
#   are included.
#
# - The SUSY decays of the top quark are included.
#
#
#         PDG            Width
DECAY         6     1.40514798E+00   # top decays
#          BR         NDA      ID1       ID2
     1.00000000E+00    2           5        24   # BR(t ->  b    W+)
#
#         PDG            Width
DECAY   1000021     5.42607473E-06   # gluino decays
#          BR         NDA      ID1       ID2
     1.04374675E-05    2     1000022        21   # BR(~g -> ~chi_10 g)
     4.28122404E-02    2     1000023        21   # BR(~g -> ~chi_20 g)
     4.11435923E-02    2     1000025        21   # BR(~g -> ~chi_30 g)
#           BR         NDA      ID1       ID2       ID3
     7.58323811E-02    3     1000022         1        -1   # BR(~g -> ~chi_10 d  db)
     8.47130810E-06    3     1000023         1        -1   # BR(~g -> ~chi_20 d  db)
     6.38535458E-06    3     1000025         1        -1   # BR(~g -> ~chi_30 d  db)
     2.58567093E-01    3     1000022         2        -2   # BR(~g -> ~chi_10 u  ub)
     4.26839317E-05    3     1000023         2        -2   # BR(~g -> ~chi_20 u  ub)
     9.74619265E-06    3     1000025         2        -2   # BR(~g -> ~chi_30 u  ub)
     7.58323811E-02    3     1000022         3        -3   # BR(~g -> ~chi_10 s  sb)
     8.47130810E-06    3     1000023         3        -3   # BR(~g -> ~chi_20 s  sb)
     6.38535458E-06    3     1000025         3        -3   # BR(~g -> ~chi_30 s  sb)
     2.58567093E-01    3     1000022         4        -4   # BR(~g -> ~chi_10 c  cb)
     4.26839317E-05    3     1000023         4        -4   # BR(~g -> ~chi_20 c  cb)
     9.74619265E-06    3     1000025         4        -4   # BR(~g -> ~chi_30 c  cb)
     7.73798713E-02    3     1000022         5        -5   # BR(~g -> ~chi_10 b  bb)
     1.41969166E-03    3     1000023         5        -5   # BR(~g -> ~chi_20 b  bb)
     1.36246059E-03    3     1000025         5        -5   # BR(~g -> ~chi_30 b  bb)
     1.45093404E-01    3     1000022         6        -6   # BR(~g -> ~chi_10 t  tb)
     1.60871992E-05    3     1000024         1        -2   # BR(~g -> ~chi_1+ d  ub)
     1.60871992E-05    3    -1000024         2        -1   # BR(~g -> ~chi_1- u  db)
     1.60871992E-05    3     1000024         3        -4   # BR(~g -> ~chi_1+ s  cb)
     1.60871992E-05    3    -1000024         4        -3   # BR(~g -> ~chi_1- c  sb)
     1.08902160E-02    3     1000024         5        -6   # BR(~g -> ~chi_1+ b  tb)
     1.08902160E-02    3    -1000024         6        -5   # BR(~g -> ~chi_1- t  bb)
#
#         PDG            Width
DECAY   1000006     4.27603745E+02   # stop1 decays
#          BR         NDA      ID1       ID2
     2.04657921E-02    2     1000022         6   # BR(~t_1 -> ~chi_10 t )
     7.49141717E-02    2     1000023         6   # BR(~t_1 -> ~chi_20 t )
     7.12353869E-02    2     1000025         6   # BR(~t_1 -> ~chi_30 t )
     4.88702460E-03    2     1000035         6   # BR(~t_1 -> ~chi_40 t )
     1.07612616E-01    2     1000024         5   # BR(~t_1 -> ~chi_1+ b )
     9.74187180E-03    2     1000037         5   # BR(~t_1 -> ~chi_2+ b )
     7.11143137E-01    2     1000021         6   # BR(~t_1 -> ~g      t )
#
#         PDG            Width
DECAY   2000006     4.26122356E+02   # stop2 decays
#          BR         NDA      ID1       ID2
     8.40135256E-03    2     1000022         6   # BR(~t_2 -> ~chi_10 t )
     7.55736517E-02    2     1000023         6   # BR(~t_2 -> ~chi_20 t )
     7.96856207E-02    2     1000025         6   # BR(~t_2 -> ~chi_30 t )
     1.29001339E-02    2     1000035         6   # BR(~t_2 -> ~chi_40 t )
     4.58467942E-02    2     1000024         5   # BR(~t_2 -> ~chi_1+ b )
     2.56843807E-02    2     1000037         5   # BR(~t_2 -> ~chi_2+ b )
     7.48932975E-01    2     1000021         6   # BR(~t_2 -> ~g      t )
     6.71117615E-04    2     1000006        25   # BR(~t_2 -> ~t_1    h )
     2.30397365E-03    2     1000006        23   # BR(~t_2 -> ~t_1    Z )
#
#         PDG            Width
DECAY   1000005     4.04296816E+02   # sbottom1 decays
#          BR         NDA      ID1       ID2
     1.92346964E-03    2     1000022         5   # BR(~b_1 -> ~chi_10 b )
     1.99902970E-03    2     1000023         5   # BR(~b_1 -> ~chi_20 b )
     1.98401416E-03    2     1000025         5   # BR(~b_1 -> ~chi_30 b )
     1.86148931E-02    2     1000035         5   # BR(~b_1 -> ~chi_40 b )
     1.59492867E-01    2    -1000024         6   # BR(~b_1 -> ~chi_1- t )
     3.73760136E-02    2    -1000037         6   # BR(~b_1 -> ~chi_2- t )
     7.77211477E-01    2     1000021         5   # BR(~b_1 -> ~g      b )
     1.39823520E-03    2     1000006       -24   # BR(~b_1 -> ~t_1    W-)
#
#         PDG            Width
DECAY   2000005     3.22906451E+02   # sbottom2 decays
#          BR         NDA      ID1       ID2
     9.10462718E-03    2     1000022         5   # BR(~b_2 -> ~chi_10 b )
     2.56913969E-03    2     1000023         5   # BR(~b_2 -> ~chi_20 b )
     2.61185998E-03    2     1000025         5   # BR(~b_2 -> ~chi_30 b )
     7.44467253E-05    2     1000035         5   # BR(~b_2 -> ~chi_40 b )
     5.68850466E-03    2    -1000024         6   # BR(~b_2 -> ~chi_1- t )
     1.49475157E-04    2    -1000037         6   # BR(~b_2 -> ~chi_2- t )
     9.79779796E-01    2     1000021         5   # BR(~b_2 -> ~g      b )
     2.21503201E-05    2     1000006       -24   # BR(~b_2 -> ~t_1    W-)
#
#         PDG            Width
DECAY   1000002     3.41898654E+02   # sup_L decays
#          BR         NDA      ID1       ID2
     2.18119034E-03    2     1000022         2   # BR(~u_L -> ~chi_10 u)
     5.01254896E-05    2     1000023         2   # BR(~u_L -> ~chi_20 u)
     2.20620837E-06    2     1000025         2   # BR(~u_L -> ~chi_30 u)
     2.28682875E-02    2     1000035         2   # BR(~u_L -> ~chi_40 u)
     1.47359935E-04    2     1000024         1   # BR(~u_L -> ~chi_1+ d)
     4.57077222E-02    2     1000037         1   # BR(~u_L -> ~chi_2+ d)
     9.29043108E-01    2     1000021         2   # BR(~u_L -> ~g      u)
#
#         PDG            Width
DECAY   2000002     3.28310176E+02   # sup_R decays
#          BR         NDA      ID1       ID2
     3.61319490E-02    2     1000022         2   # BR(~u_R -> ~chi_10 u)
     9.65705156E-05    2     1000023         2   # BR(~u_R -> ~chi_20 u)
     9.75941325E-05    2     1000025         2   # BR(~u_R -> ~chi_30 u)
     2.18039553E-09    2     1000035         2   # BR(~u_R -> ~chi_40 u)
     9.63673884E-01    2     1000021         2   # BR(~u_R -> ~g      u)
#
#         PDG            Width
DECAY   1000001     3.41906963E+02   # sdown_L decays
#          BR         NDA      ID1       ID2
     2.17119823E-03    2     1000022         1   # BR(~d_L -> ~chi_10 d)
     5.09048844E-06    2     1000023         1   # BR(~d_L -> ~chi_20 d)
     4.01307320E-05    2     1000025         1   # BR(~d_L -> ~chi_30 d)
     2.28818653E-02    2     1000035         1   # BR(~d_L -> ~chi_40 d)
     1.14661549E-06    2    -1000024         2   # BR(~d_L -> ~chi_1- u)
     4.57809204E-02    2    -1000037         2   # BR(~d_L -> ~chi_2- u)
     9.29119648E-01    2     1000021         1   # BR(~d_L -> ~g      d)
#
#         PDG            Width
DECAY   2000001     3.19386840E+02   # sdown_R decays
#          BR         NDA      ID1       ID2
     9.28590979E-03    2     1000022         1   # BR(~d_R -> ~chi_10 d)
     2.48187023E-05    2     1000023         1   # BR(~d_R -> ~chi_20 d)
     2.50817733E-05    2     1000025         1   # BR(~d_R -> ~chi_30 d)
     5.60439301E-10    2     1000035         1   # BR(~d_R -> ~chi_40 d)
     9.90664189E-01    2     1000021         1   # BR(~d_R -> ~g      d)
#
#         PDG            Width
DECAY   1000004     3.41898654E+02   # scharm_L decays
#          BR         NDA      ID1       ID2
     2.18119034E-03    2     1000022         4   # BR(~c_L -> ~chi_10 c)
     5.01254896E-05    2     1000023         4   # BR(~c_L -> ~chi_20 c)
     2.20620837E-06    2     1000025         4   # BR(~c_L -> ~chi_30 c)
     2.28682875E-02    2     1000035         4   # BR(~c_L -> ~chi_40 c)
     1.47359935E-04    2     1000024         3   # BR(~c_L -> ~chi_1+ s)
     4.57077222E-02    2     1000037         3   # BR(~c_L -> ~chi_2+ s)
     9.29043108E-01    2     1000021         4   # BR(~c_L -> ~g      c)
#
#         PDG            Width
DECAY   2000004     3.28310176E+02   # scharm_R decays
#          BR         NDA      ID1       ID2
     3.61319490E-02    2     1000022         4   # BR(~c_R -> ~chi_10 c)
     9.65705156E-05    2     1000023         4   # BR(~c_R -> ~chi_20 c)
     9.75941325E-05    2     1000025         4   # BR(~c_R -> ~chi_30 c)
     2.18039553E-09    2     1000035         4   # BR(~c_R -> ~chi_40 c)
     9.63673884E-01    2     1000021         4   # BR(~c_R -> ~g      c)
#
#         PDG            Width
DECAY   1000003     3.41906963E+02   # sstrange_L decays
#          BR         NDA      ID1       ID2
     2.17119823E-03    2     1000022         3   # BR(~s_L -> ~chi_10 s)
     5.09048844E-06    2     1000023         3   # BR(~s_L -> ~chi_20 s)
     4.01307320E-05    2     1000025         3   # BR(~s_L -> ~chi_30 s)
     2.28818653E-02    2     1000035         3   # BR(~s_L -> ~chi_40 s)
     1.14661549E-06    2    -1000024         4   # BR(~s_L -> ~chi_1- c)
     4.57809204E-02    2    -1000037         4   # BR(~s_L -> ~chi_2- c)
     9.29119648E-01    2     1000021         3   # BR(~s_L -> ~g      s)
#
#         PDG            Width
DECAY   2000003     3.19386840E+02   # sstrange_R decays
#          BR         NDA      ID1       ID2
     9.28590979E-03    2     1000022         3   # BR(~s_R -> ~chi_10 s)
     2.48187023E-05    2     1000023         3   # BR(~s_R -> ~chi_20 s)
     2.50817733E-05    2     1000025         3   # BR(~s_R -> ~chi_30 s)
     5.60439301E-10    2     1000035         3   # BR(~s_R -> ~chi_40 s)
     9.90664189E-01    2     1000021         3   # BR(~s_R -> ~g      s)
#
#         PDG            Width
DECAY   1000011     3.03225077E+01   # selectron_L decays
#          BR         NDA      ID1       ID2
     2.25412166E-01    2     1000022        11   # BR(~e_L -> ~chi_10 e-)
     1.62853315E-03    2     1000023        11   # BR(~e_L -> ~chi_20 e-)
     1.30057318E-04    2     1000025        11   # BR(~e_L -> ~chi_30 e-)
     2.57437080E-01    2     1000035        11   # BR(~e_L -> ~chi_40 e-)
     1.31769362E-05    2    -1000024        12   # BR(~e_L -> ~chi_1- nu_e)
     5.15378987E-01    2    -1000037        12   # BR(~e_L -> ~chi_2- nu_e)
#
#         PDG            Width
DECAY   2000011     2.73936693E+01   # selectron_R decays
#          BR         NDA      ID1       ID2
     9.94658169E-01    2     1000022        11   # BR(~e_R -> ~chi_10 e-)
     2.65680938E-03    2     1000023        11   # BR(~e_R -> ~chi_20 e-)
     2.68496254E-03    2     1000025        11   # BR(~e_R -> ~chi_30 e-)
     5.88800378E-08    2     1000035        11   # BR(~e_R -> ~chi_40 e-)
#
#         PDG            Width
DECAY   1000013     3.03225077E+01   # smuon_L decays
#          BR         NDA      ID1       ID2
     2.25412166E-01    2     1000022        13   # BR(~mu_L -> ~chi_10 mu-)
     1.62853315E-03    2     1000023        13   # BR(~mu_L -> ~chi_20 mu-)
     1.30057318E-04    2     1000025        13   # BR(~mu_L -> ~chi_30 mu-)
     2.57437080E-01    2     1000035        13   # BR(~mu_L -> ~chi_40 mu-)
     1.31769362E-05    2    -1000024        14   # BR(~mu_L -> ~chi_1- nu_mu)
     5.15378987E-01    2    -1000037        14   # BR(~mu_L -> ~chi_2- nu_mu)
#
#         PDG            Width
DECAY   2000013     2.73936693E+01   # smuon_R decays
#          BR         NDA      ID1       ID2
     9.94658169E-01    2     1000022        13   # BR(~mu_R -> ~chi_10 mu-)
     2.65680938E-03    2     1000023        13   # BR(~mu_R -> ~chi_20 mu-)
     2.68496254E-03    2     1000025        13   # BR(~mu_R -> ~chi_30 mu-)
     5.88800378E-08    2     1000035        13   # BR(~mu_R -> ~chi_40 mu-)
#
#         PDG            Width
DECAY   1000015     2.92223555E+01   # stau_1 decays
#          BR         NDA      ID1       ID2
     9.29966605E-01    2     1000022        15   # BR(~tau_1 -> ~chi_10  tau-)
     1.78702855E-02    2     1000023        15   # BR(~tau_1 -> ~chi_20  tau-)
     1.73443409E-02    2     1000025        15   # BR(~tau_1 -> ~chi_30  tau-)
     1.22279095E-03    2     1000035        15   # BR(~tau_1 -> ~chi_40  tau-)
     3.11481736E-02    2    -1000024        16   # BR(~tau_1 -> ~chi_1-  nu_tau)
     2.44780388E-03    2    -1000037        16   # BR(~tau_1 -> ~chi_2-  nu_tau)
#
#         PDG            Width
DECAY   2000015     3.12172386E+01   # stau_2 decays
#          BR         NDA      ID1       ID2
     2.21352252E-01    2     1000022        15   # BR(~tau_2 -> ~chi_10  tau-)
     1.63132716E-02    2     1000023        15   # BR(~tau_2 -> ~chi_20  tau-)
     1.52991943E-02    2     1000025        15   # BR(~tau_2 -> ~chi_30  tau-)
     2.48826769E-01    2     1000035        15   # BR(~tau_2 -> ~chi_40  tau-)
     6.64504901E-05    2    -1000024        16   # BR(~tau_2 -> ~chi_1-  nu_tau)
     4.98142063E-01    2    -1000037        16   # BR(~tau_2 -> ~chi_2-  nu_tau)
#
#         PDG            Width
DECAY   1000012     3.03256674E+01   # snu_eL decays
#          BR         NDA      ID1       ID2
     2.24996064E-01    2     1000022        12   # BR(~nu_eL -> ~chi_10 nu_e)
     7.57495779E-05    2     1000023        12   # BR(~nu_eL -> ~chi_20 nu_e)
     1.43709770E-03    2     1000025        12   # BR(~nu_eL -> ~chi_30 nu_e)
     2.57479400E-01    2     1000035        12   # BR(~nu_eL -> ~chi_40 nu_e)
     1.69307658E-03    2     1000024        11   # BR(~nu_eL -> ~chi_1+ e-)
     5.14318612E-01    2     1000037        11   # BR(~nu_eL -> ~chi_2+ e-)
#
#         PDG            Width
DECAY   1000014     3.03256674E+01   # snu_muL decays
#          BR         NDA      ID1       ID2
     2.24996064E-01    2     1000022        14   # BR(~nu_muL -> ~chi_10 nu_mu)
     7.57495779E-05    2     1000023        14   # BR(~nu_muL -> ~chi_20 nu_mu)
     1.43709770E-03    2     1000025        14   # BR(~nu_muL -> ~chi_30 nu_mu)
     2.57479400E-01    2     1000035        14   # BR(~nu_muL -> ~chi_40 nu_mu)
     1.69307658E-03    2     1000024        13   # BR(~nu_muL -> ~chi_1+ mu-)
     5.14318612E-01    2     1000037        13   # BR(~nu_muL -> ~chi_2+ mu-)
#
#         PDG            Width
DECAY   1000016     3.12305548E+01   # snu_tauL decays
#          BR         NDA      ID1       ID2
     2.18452938E-01    2     1000022        16   # BR(~nu_tauL -> ~chi_10 nu_tau)
     7.35462351E-05    2     1000023        16   # BR(~nu_tauL -> ~chi_20 nu_tau)
     1.39529649E-03    2     1000025        16   # BR(~nu_tauL -> ~chi_30 nu_tau)
     2.49925695E-01    2     1000035        16   # BR(~nu_tauL -> ~chi_40 nu_tau)
     3.09231049E-02    2     1000024        15   # BR(~nu_tauL -> ~chi_1+ tau-)
     4.99229420E-01    2     1000037        15   # BR(~nu_tauL -> ~chi_2+ tau-)
#
#         PDG            Width
DECAY   1000024     3.57706225E-01   # chargino1+ decays
#          BR         NDA      ID1       ID2
     1.00000000E+00    2     1000022        24   # BR(~chi_1+ -> ~chi_10  W+)
#
#         PDG            Width
DECAY   1000037     2.18264424E+01   # chargino2+ decays
#          BR         NDA      ID1       ID2
     2.53528244E-01    2     1000024        23   # BR(~chi_2+ -> ~chi_1+  Z )
     1.69236704E-04    2     1000022        24   # BR(~chi_2+ -> ~chi_10  W+)
     2.44804107E-01    2     1000023        24   # BR(~chi_2+ -> ~chi_20  W+)
     2.44376609E-01    2     1000025        24   # BR(~chi_2+ -> ~chi_30  W+)
     2.57118254E-01    2     1000024        25   # BR(~chi_2+ -> ~chi_1+  h )
     3.55001146E-06    2     1000022        37   # BR(~chi_2+ -> ~chi_10  H+)
#
#         PDG            Width
DECAY   1000022     0.00000000E+00   # neutralino1 decays
#
#         PDG            Width
DECAY   1000023     3.66473103E-01   # neutralino2 decays
#          BR         NDA      ID1       ID2
     5.13962143E-01    2     1000022        23   # BR(~chi_20 -> ~chi_10   Z )
     4.86037857E-01    2     1000022        25   # BR(~chi_20 -> ~chi_10   h )
#
#         PDG            Width
DECAY   1000025     3.62126822E-01   # neutralino3 decays
#          BR         NDA      ID1       ID2
     5.03934202E-01    2     1000022        23   # BR(~chi_30 -> ~chi_10   Z )
     4.96065798E-01    2     1000022        25   # BR(~chi_30 -> ~chi_10   h )
#
#         PDG            Width
DECAY   1000035     2.18400254E+01   # neutralino4 decays
#          BR         NDA      ID1       ID2
     1.29268432E-05    2     1000022        23   # BR(~chi_40 -> ~chi_10   Z )
     1.04466613E-01    2     1000023        23   # BR(~chi_40 -> ~chi_20   Z )
     1.48525149E-01    2     1000025        23   # BR(~chi_40 -> ~chi_30   Z )
     2.45139938E-01    2     1000024       -24   # BR(~chi_40 -> ~chi_1+   W-)
     2.45139938E-01    2    -1000024        24   # BR(~chi_40 -> ~chi_1-   W+)
     1.51279649E-04    2     1000022        25   # BR(~chi_40 -> ~chi_10   h )
     3.40335096E-06    2     1000022        35   # BR(~chi_40 -> ~chi_10   H )
     3.79529765E-07    2     1000022        36   # BR(~chi_40 -> ~chi_10   A )
     1.51871611E-01    2     1000023        25   # BR(~chi_40 -> ~chi_20   h )
     1.04688760E-01    2     1000025        25   # BR(~chi_40 -> ~chi_30   h )
#
#         PDG            Width
DECAY        25     4.01202824E-03   # h decays
#          BR         NDA      ID1       ID2
     6.19366861E-01    2           5        -5   # BR(h -> b       bb     )
     6.43595960E-02    2         -15        15   # BR(h -> tau+    tau-   )
     2.27858877E-04    2         -13        13   # BR(h -> mu+     mu-    )
     4.83472023E-04    2           3        -3   # BR(h -> s       sb     )
     2.09488998E-02    2           4        -4   # BR(h -> c       cb     )
     6.71151387E-02    2          21        21   # BR(h -> g       g      )
     2.29418755E-03    2          22        22   # BR(h -> gam     gam    )
     1.43252533E-03    2          22        23   # BR(h -> Z       gam    )
     2.00097499E-01    2          24       -24   # BR(h -> W+      W-     )
     2.36031857E-02    2          23        23   # BR(h -> Z       Z      )
     7.07761499E-05    2     1000022   1000022   # BR(h -> ~chi_10 ~chi_10)
#
#         PDG            Width
DECAY        35     8.58277249E+00   # H decays
#          BR         NDA      ID1       ID2
     3.73204110E-01    2           5        -5   # BR(H -> b       bb     )
     6.49771942E-02    2         -15        15   # BR(H -> tau+    tau-   )
     2.29764520E-04    2         -13        13   # BR(H -> mu+     mu-    )
     2.81656141E-04    2           3        -3   # BR(H -> s       sb     )
     1.57232755E-06    2           4        -4   # BR(H -> c       cb     )
     1.57087978E-01    2           6        -6   # BR(H -> t       tb     )
     5.22050319E-05    2          21        21   # BR(H -> g       g      )
     1.63992767E-07    2          22        22   # BR(H -> gam     gam    )
     9.25907070E-08    2          23        22   # BR(H -> Z       gam    )
     7.35579836E-05    2          24       -24   # BR(H -> W+      W-     )
     3.67324196E-05    2          23        23   # BR(H -> Z       Z      )
     2.70995279E-04    2          25        25   # BR(H -> h       h      )
    -9.22576503E-24    2          36        36   # BR(H -> A       A      )
     6.42095114E-19    2          23        36   # BR(H -> Z       A      )
     3.01214007E-03    2     1000024  -1000024   # BR(H -> ~chi_1+ ~chi_1-)
     4.69350160E-03    2     1000022   1000022   # BR(H -> ~chi_10 ~chi_10)
     1.03214814E-04    2     1000023   1000023   # BR(H -> ~chi_20 ~chi_20)
     1.80848769E-03    2     1000025   1000025   # BR(H -> ~chi_30 ~chi_30)
     2.37372404E-01    2     1000022   1000023   # BR(H -> ~chi_10 ~chi_20)
     1.54584122E-01    2     1000022   1000025   # BR(H -> ~chi_10 ~chi_30)
     2.21010719E-03    2     1000023   1000025   # BR(H -> ~chi_20 ~chi_30)
#
#         PDG            Width
DECAY        36     8.59119560E+00   # A decays
#          BR         NDA      ID1       ID2
     3.72965496E-01    2           5        -5   # BR(A -> b       bb     )
     6.49154160E-02    2         -15        15   # BR(A -> tau+    tau-   )
     2.29545746E-04    2         -13        13   # BR(A -> mu+     mu-    )
     2.81593424E-04    2           3        -3   # BR(A -> s       sb     )
     1.57715218E-06    2           4        -4   # BR(A -> c       cb     )
     1.57483055E-01    2           6        -6   # BR(A -> t       tb     )
     1.55910747E-04    2          21        21   # BR(A -> g       g      )
     5.98492006E-07    2          22        22   # BR(A -> gam     gam    )
     1.88577155E-07    2          23        22   # BR(A -> Z       gam    )
     7.32112978E-05    2          23        25   # BR(A -> Z       h      )
     3.45137659E-03    2     1000024  -1000024   # BR(A -> ~chi_1+ ~chi_1-)
     4.70300622E-03    2     1000022   1000022   # BR(A -> ~chi_10 ~chi_10)
     8.02851934E-05    2     1000023   1000023   # BR(A -> ~chi_20 ~chi_20)
     3.29815385E-03    2     1000025   1000025   # BR(A -> ~chi_30 ~chi_30)
     1.57584218E-01    2     1000022   1000023   # BR(A -> ~chi_10 ~chi_20)
     2.33385442E-01    2     1000022   1000025   # BR(A -> ~chi_10 ~chi_30)
     1.39092565E-03    2     1000023   1000025   # BR(A -> ~chi_20 ~chi_30)
#
#         PDG            Width
DECAY        37     8.52015665E+00   # H+ decays
#          BR         NDA      ID1       ID2
     5.96530304E-04    2           4        -5   # BR(H+ -> c       bb     )
     6.54872768E-02    2         -15        16   # BR(H+ -> tau+    nu_tau )
     2.31567889E-04    2         -13        14   # BR(H+ -> mu+     nu_mu  )
     3.81777392E-06    2           2        -5   # BR(H+ -> u       bb     )
     1.35876111E-05    2           2        -3   # BR(H+ -> u       sb     )
     2.80989495E-04    2           4        -3   # BR(H+ -> c       sb     )
     5.28343253E-01    2           6        -5   # BR(H+ -> t       bb     )
     7.39729752E-05    2          24        25   # BR(H+ -> W+      h      )
     8.38439805E-13    2          24        36   # BR(H+ -> W+      A      )
     4.02334344E-01    2     1000024   1000022   # BR(H+ -> ~chi_1+ ~chi_10)
     2.49553698E-03    2     1000024   1000023   # BR(H+ -> ~chi_1+ ~chi_20)
     1.39123466E-04    2     1000024   1000025   # BR(H+ -> ~chi_1+ ~chi_30)
