#
#                              ======================
#                              | THE SUSYHIT OUTPUT |
#                              ======================
#
#
#              ------------------------------------------------------
#              |     This is the output of the SUSY-HIT package     |
#              |  created by A.Djouadi, M.Muehlleitner and M.Spira. |
#              |  In case of problems with SUSY-HIT email to        |
#              |           margarete.muehlleitner@cern.ch           |
#              |           michael.spira@psi.ch                     |
#              |           abdelhak.djouadi@cern.ch                 |
#              ------------------------------------------------------
#
#              ------------------------------------------------------
#              |  SUSY Les Houches Accord - MSSM Spectrum + Decays  |
#              |              based on the decay programs           |
#              |                                                    |
#              |                     SDECAY 1.3b                    |
#              |                                                    |
#              |  Authors: M.Muhlleitner, A.Djouadi and Y.Mambrini  |
#              |  Ref.:    Comput.Phys.Commun.168(2005)46           |
#              |           [hep-ph/0311167]                         |
#              |                                                    |
#              |                     HDECAY 3.4                     |
#              |                                                    |
#              |  By: A.Djouadi,J.Kalinowski,M.Muhlleitner,M.Spira  |
#              |  Ref.:    Comput.Phys.Commun.108(1998)56           |
#              |           [hep-ph/9704448]                         |
#              |                                                    |
#              |                                                    |
#              |  If not stated otherwise all DRbar couplings and   |
#              |  soft SUSY breaking masses are given at the scale  |
#              |  Q=  0.50007065E+04
#              |                                                    |
#              ------------------------------------------------------
#
#
BLOCK DCINFO  # Decay Program information
     1   SDECAY/HDECAY # decay calculator
     2   1.3b  /3.4    # version number
#
BLOCK SPINFO  # Spectrum calculator information
     1    SOFTSUSY    # spectrum calculator                
     2    3.4.0       # version number                     
#
BLOCK MODSEL  # Model selection
     1     0   #  nonUniversal                                     
#
BLOCK SMINPUTS  # Standard Model inputs
         1     1.25778332E+02   # alpha_em^-1(M_Z)^MSbar
         2     1.16570000E-05   # G_F [GeV^-2]
         3     1.17200002E-01   # alpha_S(M_Z)^MSbar
         4     9.11876000E+01   # M_Z pole mass
         5     4.25000000E+00   # mb(mb)^MSbar
         6     1.72500000E+02   # mt pole mass
         7     1.77682000E+00   # mtau pole mass
#
BLOCK MINPAR  # Input parameters - minimal models
         3     1.00000000E+01   # tanb                
#
BLOCK EXTPAR  # Input parameters - non-minimal models
         0    -1.00000000E+00   # Set                 
         1     6.00000000E+01   # M_1(MX)             
         2     3.00000000E+03   # M_2(MX)             
         3     1.66797700E+03   # M_3(MX)             
        11     5.00000000E+03   # At(MX)              
        12     5.00000000E+03   # Ab(MX)              
        13     0.00000000E+00   # Atau(MX)            
        23    -1.74056000E+03   # mu(MX)              
        26     3.00000000E+03   # mA(pole)            
        31     5.00000000E+03   # meL(MX)             
        32     5.00000000E+03   # mmuL(MX)            
        33     5.00000000E+03   # mtauL(MX)           
        34     5.00000000E+03   # meR(MX)             
        35     5.00000000E+03   # mmuR(MX)            
        36     5.00000000E+03   # mtauR(MX)           
        41     5.00000000E+03   # mqL1(MX)            
        42     5.00000000E+03   # mqL2(MX)            
        43     5.00000000E+03   # mqL3(MX)            
        44     5.00000000E+03   # muR(MX)             
        45     5.00000000E+03   # mcR(MX)             
        46     5.00000000E+03   # mtR(MX)             
        47     5.00000000E+03   # mdR(MX)             
        48     5.00000000E+03   # msR(MX)             
        49     5.00000000E+03   # mbR(MX)             
#
BLOCK MASS  # Mass Spectrum
# PDG code           mass       particle
        24     8.00970150E+01   # W+
        25     1.24772964E+02   # h
        35     3.00007857E+03   # H
        36     2.99999995E+03   # A
        37     3.00087268E+03   # H+
         5     4.87878001E+00   # b-quark pole mass calculated from mb(mb)_Msbar
   1000001     5.07187140E+03   # ~d_L
   2000001     5.05410480E+03   # ~d_R
   1000002     5.07139766E+03   # ~u_L
   2000002     5.05383409E+03   # ~u_R
   1000003     5.07187140E+03   # ~s_L
   2000003     5.05410480E+03   # ~s_R
   1000004     5.07139766E+03   # ~c_L
   2000004     5.05383409E+03   # ~c_R
   1000005     5.01826788E+03   # ~b_1
   2000005     5.05319250E+03   # ~b_2
   1000006     4.91010411E+03   # ~t_1
   2000006     5.06501789E+03   # ~t_2
   1000011     5.01903911E+03   # ~e_L
   2000011     5.00590497E+03   # ~e_R
   1000012     5.01809127E+03   # ~nu_eL
   1000013     5.01903911E+03   # ~mu_L
   2000013     5.00590497E+03   # ~mu_R
   1000014     5.01809127E+03   # ~nu_muL
   1000015     5.00419089E+03   # ~tau_1
   2000015     5.01919047E+03   # ~tau_2
   1000016     5.01755823E+03   # ~nu_tauL
   1000021     2.00000045E+03   # ~g
   1000022     6.03011779E+01   # ~chi_10
   1000023     1.79940022E+03   # ~chi_20
   1000025    -1.80211957E+03   # ~chi_30
   1000035     3.07438695E+03   # ~chi_40
   1000024     1.80000026E+03   # ~chi_1+
   1000037     3.07455461E+03   # ~chi_2+
#
BLOCK NMIX  # Neutralino Mixing Matrix
  1  1     9.99691069E-01   # N_11
  1  2     1.21501504E-04   # N_12
  1  3    -2.47913724E-02   # N_13
  1  4     1.77196062E-03   # N_14
  2  1     1.62723373E-02   # N_21
  2  2     3.81621064E-02   # N_22
  2  3     7.06828469E-01   # N_23
  2  4     7.06167388E-01   # N_24
  3  1    -1.87808001E-02   # N_31
  3  2     1.24386262E-02   # N_32
  3  3    -7.06716237E-01   # N_33
  3  4     7.07138404E-01   # N_34
  4  1    -5.09253672E-04   # N_41
  4  2     9.99194135E-01   # N_42
  4  3    -1.81951348E-02   # N_43
  4  4    -3.57737094E-02   # N_44
#
BLOCK UMIX  # Chargino Mixing Matrix U
  1  1     2.57134618E-02   # U_11
  1  2     9.99669354E-01   # U_12
  2  1    -9.99669354E-01   # U_21
  2  2     2.57134618E-02   # U_22
#
BLOCK VMIX  # Chargino Mixing Matrix V
  1  1     5.05780063E-02   # V_11
  1  2    -9.98720114E-01   # V_12
  2  1    -9.98720114E-01   # V_21
  2  2    -5.05780063E-02   # V_22
#
BLOCK STOPMIX  # Stop Mixing Matrix
  1  1    -5.14105361E-01   # cos(theta_t)
  1  2     8.57727042E-01   # sin(theta_t)
  2  1    -8.57727042E-01   # -sin(theta_t)
  2  2    -5.14105361E-01   # cos(theta_t)
#
BLOCK SBOTMIX  # Sbottom Mixing Matrix
  1  1     9.92399803E-01   # cos(theta_b)
  1  2    -1.23055398E-01   # sin(theta_b)
  2  1     1.23055398E-01   # -sin(theta_b)
  2  2     9.92399803E-01   # cos(theta_b)
#
BLOCK STAUMIX  # Stau Mixing Matrix
  1  1    -1.98980567E-01   # cos(theta_tau)
  1  2     9.80003436E-01   # sin(theta_tau)
  2  1    -9.80003436E-01   # -sin(theta_tau)
  2  2    -1.98980567E-01   # cos(theta_tau)
#
BLOCK ALPHA  # Higgs mixing
          -1.05458779E-01   # Mixing angle in the neutral Higgs boson sector
#
BLOCK HMIX Q=  5.00070654E+03  # DRbar Higgs Parameters
         1    -1.77247802E+03   # mu(Q)MSSM           
         2     9.47063811E+00   # tan                 
         3     2.42018775E+02   # higgs               
         4     8.35258406E+06   # mA^2(Q)MSSM         
#
BLOCK GAUGE Q=  5.00070654E+03  # The gauge couplings
     1     3.70659585E-01   # gprime(Q) DRbar
     2     6.31885260E-01   # g(Q) DRbar
     3     9.98494830E-01   # g3(Q) DRbar
#
BLOCK AU Q=  5.00070654E+03  # The trilinear couplings
  1  1     5.00000001E+03   # A_u(Q) DRbar
  2  2     5.00000001E+03   # A_c(Q) DRbar
  3  3     5.00000002E+03   # A_t(Q) DRbar
#
BLOCK AD Q=  5.00070654E+03  # The trilinear couplings
  1  1     5.00000001E+03   # A_d(Q) DRbar
  2  2     5.00000001E+03   # A_s(Q) DRbar
  3  3     5.00000001E+03   # A_b(Q) DRbar
#
BLOCK AE Q=  5.00070654E+03  # The trilinear couplings
  1  1     0.00000000E+00   # A_e(Q) DRbar
  2  2     1.77885659E-07   # A_mu(Q) DRbar
  3  3     1.77528876E-07   # A_tau(Q) DRbar
#
BLOCK Yu Q=  5.00070654E+03  # The Yukawa couplings
  1  1     0.00000000E+00   # y_u(Q) DRbar
  2  2     0.00000000E+00   # y_c(Q) DRbar
  3  3     8.19410790E-01   # y_t(Q) DRbar
#
BLOCK Yd Q=  5.00070654E+03  # The Yukawa couplings
  1  1     0.00000000E+00   # y_d(Q) DRbar
  2  2     0.00000000E+00   # y_s(Q) DRbar
  3  3     1.31673079E-01   # y_b(Q) DRbar
#
BLOCK Ye Q=  5.00070654E+03  # The Yukawa couplings
  1  1     0.00000000E+00   # y_e(Q) DRbar
  2  2     0.00000000E+00   # y_mu(Q) DRbar
  3  3     9.65207253E-02   # y_tau(Q) DRbar
#
BLOCK MSOFT Q=  5.00070654E+03  # The soft SUSY breaking masses at the scale Q
         1     6.00000000E+01   # M_1(Q)              
         2     3.00000000E+03   # M_2(Q)              
         3     1.66797700E+03   # M_3(Q)              
        21     5.51217820E+06   # mH1^2(Q)            
        22    -2.60368504E+06   # mH2^2(Q)            
        31     5.00000000E+03   # meL(Q)              
        32     5.00000000E+03   # mmuL(Q)             
        33     5.00000000E+03   # mtauL(Q)            
        34     5.00000000E+03   # meR(Q)              
        35     5.00000000E+03   # mmuR(Q)             
        36     5.00000000E+03   # mtauR(Q)            
        41     5.00000000E+03   # mqL1(Q)             
        42     5.00000000E+03   # mqL2(Q)             
        43     5.00000000E+03   # mqL3(Q)             
        44     5.00000000E+03   # muR(Q)              
        45     5.00000000E+03   # mcR(Q)              
        46     4.99999999E+03   # mtR(Q)              
        47     5.00000000E+03   # mdR(Q)              
        48     5.00000000E+03   # msR(Q)              
        49     5.00000000E+03   # mbR(Q)              
#
#
#
#                             =================
#                             |The decay table|
#                             =================
#
# - The QCD corrections to the decays gluino -> squark  + quark
#                                     squark -> gaugino + quark_prime
#                                     squark -> squark_prime + Higgs
#                                     squark -> gluino  + quark
#   are included.
#
# - The multi-body decays for the inos, stops and sbottoms are included.
#
# - The loop induced decays for the gluino, neutralinos and stops
#   are included.
#
# - The SUSY decays of the top quark are included.
#
#
#         PDG            Width
DECAY         6     1.39912114E+00   # top decays
#          BR         NDA      ID1       ID2
     1.00000000E+00    2           5        24   # BR(t ->  b    W+)
#
#         PDG            Width
DECAY   1000021     3.07238670E-04   # gluino decays
#          BR         NDA      ID1       ID2
     8.11034904E-06    2     1000022        21   # BR(~g -> ~chi_10 g)
     3.92036783E-04    2     1000023        21   # BR(~g -> ~chi_20 g)
     3.82464169E-04    2     1000025        21   # BR(~g -> ~chi_30 g)
#           BR         NDA      ID1       ID2       ID3
     7.60881415E-02    3     1000022         1        -1   # BR(~g -> ~chi_10 d  db)
     9.38489965E-08    3     1000023         1        -1   # BR(~g -> ~chi_20 d  db)
     7.31074495E-09    3     1000025         1        -1   # BR(~g -> ~chi_30 d  db)
     2.59389578E-01    3     1000022         2        -2   # BR(~g -> ~chi_10 u  ub)
     1.39108651E-07    3     1000023         2        -2   # BR(~g -> ~chi_20 u  ub)
     6.88913600E-09    3     1000025         2        -2   # BR(~g -> ~chi_30 u  ub)
     7.60881415E-02    3     1000022         3        -3   # BR(~g -> ~chi_10 s  sb)
     9.38489965E-08    3     1000023         3        -3   # BR(~g -> ~chi_20 s  sb)
     7.31074495E-09    3     1000025         3        -3   # BR(~g -> ~chi_30 s  sb)
     2.59389578E-01    3     1000022         4        -4   # BR(~g -> ~chi_10 c  cb)
     1.39108651E-07    3     1000023         4        -4   # BR(~g -> ~chi_20 c  cb)
     6.88913600E-09    3     1000025         4        -4   # BR(~g -> ~chi_30 c  cb)
     7.69789382E-02    3     1000022         5        -5   # BR(~g -> ~chi_10 b  bb)
     6.82596116E-06    3     1000023         5        -5   # BR(~g -> ~chi_20 b  bb)
     6.17206723E-06    3     1000025         5        -5   # BR(~g -> ~chi_30 b  bb)
     2.51266233E-01    3     1000022         6        -6   # BR(~g -> ~chi_10 t  tb)
     2.20489780E-07    3     1000024         1        -2   # BR(~g -> ~chi_1+ d  ub)
     2.20489780E-07    3    -1000024         2        -1   # BR(~g -> ~chi_1- u  db)
     2.20489780E-07    3     1000024         3        -4   # BR(~g -> ~chi_1+ s  cb)
     2.20489780E-07    3    -1000024         4        -3   # BR(~g -> ~chi_1- c  sb)
     1.20243092E-06    3     1000024         5        -6   # BR(~g -> ~chi_1+ b  tb)
     1.20243092E-06    3    -1000024         6        -5   # BR(~g -> ~chi_1- t  bb)
#
#         PDG            Width
DECAY   1000006     3.21568130E+02   # stop1 decays
#          BR         NDA      ID1       ID2
     2.72851057E-02    2     1000022         6   # BR(~t_1 -> ~chi_10 t )
     7.67481274E-02    2     1000023         6   # BR(~t_1 -> ~chi_20 t )
     7.36563723E-02    2     1000025         6   # BR(~t_1 -> ~chi_30 t )
     6.97268178E-03    2     1000035         6   # BR(~t_1 -> ~chi_40 t )
     1.09824510E-01    2     1000024         5   # BR(~t_1 -> ~chi_1+ b )
     1.38424324E-02    2     1000037         5   # BR(~t_1 -> ~chi_2+ b )
     6.91670771E-01    2     1000021         6   # BR(~t_1 -> ~g      t )
#
#         PDG            Width
DECAY   2000006     3.35167942E+02   # stop2 decays
#          BR         NDA      ID1       ID2
     1.06654213E-02    2     1000022         6   # BR(~t_2 -> ~chi_10 t )
     7.70302794E-02    2     1000023         6   # BR(~t_2 -> ~chi_20 t )
     8.02713609E-02    2     1000025         6   # BR(~t_2 -> ~chi_30 t )
     1.61135668E-02    2     1000035         6   # BR(~t_2 -> ~chi_40 t )
     4.80944470E-02    2     1000024         5   # BR(~t_2 -> ~chi_1+ b )
     3.19233081E-02    2     1000037         5   # BR(~t_2 -> ~chi_2+ b )
     7.32021926E-01    2     1000021         6   # BR(~t_2 -> ~g      t )
     8.43656906E-04    2     1000006        25   # BR(~t_2 -> ~t_1    h )
     3.03603320E-03    2     1000006        23   # BR(~t_2 -> ~t_1    Z )
#
#         PDG            Width
DECAY   1000005     3.12109707E+02   # sbottom1 decays
#          BR         NDA      ID1       ID2
     2.53063757E-03    2     1000022         5   # BR(~b_1 -> ~chi_10 b )
     2.24168291E-03    2     1000023         5   # BR(~b_1 -> ~chi_20 b )
     2.06914615E-03    2     1000025         5   # BR(~b_1 -> ~chi_30 b )
     2.38496859E-02    2     1000035         5   # BR(~b_1 -> ~chi_40 b )
     1.60866675E-01    2    -1000024         6   # BR(~b_1 -> ~chi_1- t )
     4.81130098E-02    2    -1000037         6   # BR(~b_1 -> ~chi_2- t )
     7.58599566E-01    2     1000021         5   # BR(~b_1 -> ~g      b )
     1.72959692E-03    2     1000006       -24   # BR(~b_1 -> ~t_1    W-)
#
#         PDG            Width
DECAY   2000005     2.46171550E+02   # sbottom2 decays
#          BR         NDA      ID1       ID2
     1.18524180E-02    2     1000022         5   # BR(~b_2 -> ~chi_10 b )
     2.62797601E-03    2     1000023         5   # BR(~b_2 -> ~chi_20 b )
     2.78497887E-03    2     1000025         5   # BR(~b_2 -> ~chi_30 b )
     5.00941879E-04    2     1000035         5   # BR(~b_2 -> ~chi_40 b )
     8.43119829E-03    2    -1000024         6   # BR(~b_2 -> ~chi_1- t )
     1.00973228E-03    2    -1000037         6   # BR(~b_2 -> ~chi_2- t )
     9.72647968E-01    2     1000021         5   # BR(~b_2 -> ~g      b )
     1.44786532E-04    2     1000006       -24   # BR(~b_2 -> ~t_1    W-)
#
#         PDG            Width
DECAY   1000002     2.65158090E+02   # sup_L decays
#          BR         NDA      ID1       ID2
     2.81346322E-03    2     1000022         2   # BR(~u_L -> ~chi_10 u)
     9.62943000E-05    2     1000023         2   # BR(~u_L -> ~chi_20 u)
     4.32557253E-06    2     1000025         2   # BR(~u_L -> ~chi_30 u)
     2.95376954E-02    2     1000035         2   # BR(~u_L -> ~chi_40 u)
     2.88170082E-04    2     1000024         1   # BR(~u_L -> ~chi_1+ d)
     5.90236892E-02    2     1000037         1   # BR(~u_L -> ~chi_2+ d)
     9.08236362E-01    2     1000021         2   # BR(~u_L -> ~g      u)
#
#         PDG            Width
DECAY   2000002     2.51262277E+02   # sup_R decays
#          BR         NDA      ID1       ID2
     4.72796336E-02    2     1000022         2   # BR(~u_R -> ~chi_10 u)
     9.57687015E-06    2     1000023         2   # BR(~u_R -> ~chi_20 u)
     1.27459329E-05    2     1000025         2   # BR(~u_R -> ~chi_30 u)
     4.89730132E-09    2     1000035         2   # BR(~u_R -> ~chi_40 u)
     9.52698039E-01    2     1000021         2   # BR(~u_R -> ~g      u)
#
#         PDG            Width
DECAY   1000001     2.65174349E+02   # sdown_L decays
#          BR         NDA      ID1       ID2
     2.80656993E-03    2     1000022         1   # BR(~d_L -> ~chi_10 d)
     6.89389491E-05    2     1000023         1   # BR(~d_L -> ~chi_20 d)
     1.46108728E-05    2     1000025         1   # BR(~d_L -> ~chi_30 d)
     2.95567926E-02    2     1000035         1   # BR(~d_L -> ~chi_40 d)
     7.44876133E-05    2    -1000024         2   # BR(~d_L -> ~chi_1- u)
     5.91505937E-02    2    -1000037         2   # BR(~d_L -> ~chi_2- u)
     9.08328006E-01    2     1000021         1   # BR(~d_L -> ~g      d)
#
#         PDG            Width
DECAY   2000001     2.42370886E+02   # sdown_R decays
#          BR         NDA      ID1       ID2
     1.22541869E-02    2     1000022         1   # BR(~d_R -> ~chi_10 d)
     2.48226024E-06    2     1000023         1   # BR(~d_R -> ~chi_20 d)
     3.30366031E-06    2     1000025         1   # BR(~d_R -> ~chi_30 d)
     1.26946645E-09    2     1000035         1   # BR(~d_R -> ~chi_40 d)
     9.87740026E-01    2     1000021         1   # BR(~d_R -> ~g      d)
#
#         PDG            Width
DECAY   1000004     2.65158090E+02   # scharm_L decays
#          BR         NDA      ID1       ID2
     2.81346322E-03    2     1000022         4   # BR(~c_L -> ~chi_10 c)
     9.62943000E-05    2     1000023         4   # BR(~c_L -> ~chi_20 c)
     4.32557253E-06    2     1000025         4   # BR(~c_L -> ~chi_30 c)
     2.95376954E-02    2     1000035         4   # BR(~c_L -> ~chi_40 c)
     2.88170082E-04    2     1000024         3   # BR(~c_L -> ~chi_1+ s)
     5.90236892E-02    2     1000037         3   # BR(~c_L -> ~chi_2+ s)
     9.08236362E-01    2     1000021         4   # BR(~c_L -> ~g      c)
#
#         PDG            Width
DECAY   2000004     2.51262277E+02   # scharm_R decays
#          BR         NDA      ID1       ID2
     4.72796336E-02    2     1000022         4   # BR(~c_R -> ~chi_10 c)
     9.57687015E-06    2     1000023         4   # BR(~c_R -> ~chi_20 c)
     1.27459329E-05    2     1000025         4   # BR(~c_R -> ~chi_30 c)
     4.89730132E-09    2     1000035         4   # BR(~c_R -> ~chi_40 c)
     9.52698039E-01    2     1000021         4   # BR(~c_R -> ~g      c)
#
#         PDG            Width
DECAY   1000003     2.65174349E+02   # sstrange_L decays
#          BR         NDA      ID1       ID2
     2.80656993E-03    2     1000022         3   # BR(~s_L -> ~chi_10 s)
     6.89389491E-05    2     1000023         3   # BR(~s_L -> ~chi_20 s)
     1.46108728E-05    2     1000025         3   # BR(~s_L -> ~chi_30 s)
     2.95567926E-02    2     1000035         3   # BR(~s_L -> ~chi_40 s)
     7.44876133E-05    2    -1000024         4   # BR(~s_L -> ~chi_1- c)
     5.91505937E-02    2    -1000037         4   # BR(~s_L -> ~chi_2- c)
     9.08328006E-01    2     1000021         3   # BR(~s_L -> ~g      s)
#
#         PDG            Width
DECAY   2000003     2.42370886E+02   # sstrange_R decays
#          BR         NDA      ID1       ID2
     1.22541869E-02    2     1000022         3   # BR(~s_R -> ~chi_10 s)
     2.48226024E-06    2     1000023         3   # BR(~s_R -> ~chi_20 s)
     3.30366031E-06    2     1000025         3   # BR(~s_R -> ~chi_30 s)
     1.26946645E-09    2     1000035         3   # BR(~s_R -> ~chi_40 s)
     9.87740026E-01    2     1000021         3   # BR(~s_R -> ~g      s)
#
#         PDG            Width
DECAY   1000011     3.02252928E+01   # selectron_L decays
#          BR         NDA      ID1       ID2
     2.26822884E-01    2     1000022        11   # BR(~e_L -> ~chi_10 e-)
     1.13998514E-03    2     1000023        11   # BR(~e_L -> ~chi_20 e-)
     1.01181638E-06    2     1000025        11   # BR(~e_L -> ~chi_30 e-)
     2.56881628E-01    2     1000035        11   # BR(~e_L -> ~chi_40 e-)
     6.62207765E-04    2    -1000024        12   # BR(~e_L -> ~chi_1- nu_e)
     5.14492284E-01    2    -1000037        12   # BR(~e_L -> ~chi_2- nu_e)
#
#         PDG            Width
DECAY   2000011     2.73528271E+01   # selectron_R decays
#          BR         NDA      ID1       ID2
     9.99531691E-01    2     1000022        11   # BR(~e_R -> ~chi_10 e-)
     2.00872022E-04    2     1000023        11   # BR(~e_R -> ~chi_20 e-)
     2.67336236E-04    2     1000025        11   # BR(~e_R -> ~chi_30 e-)
     1.00642301E-07    2     1000035        11   # BR(~e_R -> ~chi_40 e-)
#
#         PDG            Width
DECAY   1000013     3.02252928E+01   # smuon_L decays
#          BR         NDA      ID1       ID2
     2.26822884E-01    2     1000022        13   # BR(~mu_L -> ~chi_10 mu-)
     1.13998514E-03    2     1000023        13   # BR(~mu_L -> ~chi_20 mu-)
     1.01181638E-06    2     1000025        13   # BR(~mu_L -> ~chi_30 mu-)
     2.56881628E-01    2     1000035        13   # BR(~mu_L -> ~chi_40 mu-)
     6.62207765E-04    2    -1000024        14   # BR(~mu_L -> ~chi_1- nu_mu)
     5.14492284E-01    2    -1000037        14   # BR(~mu_L -> ~chi_2- nu_mu)
#
#         PDG            Width
DECAY   2000013     2.73528271E+01   # smuon_R decays
#          BR         NDA      ID1       ID2
     9.99531691E-01    2     1000022        13   # BR(~mu_R -> ~chi_10 mu-)
     2.00872022E-04    2     1000023        13   # BR(~mu_R -> ~chi_20 mu-)
     2.67336236E-04    2     1000025        13   # BR(~mu_R -> ~chi_30 mu-)
     1.00642301E-07    2     1000035        13   # BR(~mu_R -> ~chi_40 mu-)
#
#         PDG            Width
DECAY   1000015     2.88649449E+01   # stau_1 decays
#          BR         NDA      ID1       ID2
     9.19594035E-01    2     1000022        15   # BR(~tau_1 -> ~chi_10  tau-)
     1.32902326E-02    2     1000023        15   # BR(~tau_1 -> ~chi_20  tau-)
     1.16700014E-02    2     1000025        15   # BR(~tau_1 -> ~chi_30  tau-)
     1.01382509E-02    2     1000035        15   # BR(~tau_1 -> ~chi_40  tau-)
     2.50010166E-02    2    -1000024        16   # BR(~tau_1 -> ~chi_1-  nu_tau)
     2.03064631E-02    2    -1000037        16   # BR(~tau_1 -> ~chi_2-  nu_tau)
#
#         PDG            Width
DECAY   2000015     3.08114865E+01   # stau_2 decays
#          BR         NDA      ID1       ID2
     2.48157740E-01    2     1000022        15   # BR(~tau_2 -> ~chi_10  tau-)
     1.17004458E-02    2     1000023        15   # BR(~tau_2 -> ~chi_20  tau-)
     1.21394589E-02    2     1000025        15   # BR(~tau_2 -> ~chi_30  tau-)
     2.42431333E-01    2     1000035        15   # BR(~tau_2 -> ~chi_40  tau-)
     2.64152332E-05    2    -1000024        16   # BR(~tau_2 -> ~chi_1-  nu_tau)
     4.85544606E-01    2    -1000037        16   # BR(~tau_2 -> ~chi_2-  nu_tau)
#
#         PDG            Width
DECAY   1000012     3.02267508E+01   # snu_eL decays
#          BR         NDA      ID1       ID2
     2.26581221E-01    2     1000022        12   # BR(~nu_eL -> ~chi_10 nu_e)
     4.10035394E-04    2     1000023        12   # BR(~nu_eL -> ~chi_20 nu_e)
     2.75214974E-04    2     1000025        12   # BR(~nu_eL -> ~chi_30 nu_e)
     2.57011369E-01    2     1000035        12   # BR(~nu_eL -> ~chi_40 nu_e)
     2.56120989E-03    2     1000024        11   # BR(~nu_eL -> ~chi_1+ e-)
     5.13160950E-01    2     1000037        11   # BR(~nu_eL -> ~chi_2+ e-)
#
#         PDG            Width
DECAY   1000014     3.02267508E+01   # snu_muL decays
#          BR         NDA      ID1       ID2
     2.26581221E-01    2     1000022        14   # BR(~nu_muL -> ~chi_10 nu_mu)
     4.10035394E-04    2     1000023        14   # BR(~nu_muL -> ~chi_20 nu_mu)
     2.75214974E-04    2     1000025        14   # BR(~nu_muL -> ~chi_30 nu_mu)
     2.57011369E-01    2     1000035        14   # BR(~nu_muL -> ~chi_40 nu_mu)
     2.56120989E-03    2     1000024        13   # BR(~nu_muL -> ~chi_1+ mu-)
     5.13160950E-01    2     1000037        13   # BR(~nu_muL -> ~chi_2+ mu-)
#
#         PDG            Width
DECAY   1000016     3.09234031E+01   # snu_tauL decays
#          BR         NDA      ID1       ID2
     2.21453188E-01    2     1000022        16   # BR(~nu_tauL -> ~chi_10 nu_tau)
     4.00730283E-04    2     1000023        16   # BR(~nu_tauL -> ~chi_20 nu_tau)
     2.68969343E-04    2     1000025        16   # BR(~nu_tauL -> ~chi_30 nu_tau)
     2.51130508E-01    2     1000035        16   # BR(~nu_tauL -> ~chi_40 nu_tau)
     2.53229874E-02    2     1000024        15   # BR(~nu_tauL -> ~chi_1+ tau-)
     5.01423618E-01    2     1000037        15   # BR(~nu_tauL -> ~chi_2+ tau-)
#
#         PDG            Width
DECAY   1000024     1.11039759E+00   # chargino1+ decays
#          BR         NDA      ID1       ID2
     1.00000000E+00    2     1000022        24   # BR(~chi_1+ -> ~chi_10  W+)
#
#         PDG            Width
DECAY   1000037     1.67654942E+01   # chargino2+ decays
#          BR         NDA      ID1       ID2
     2.52286483E-01    2     1000024        23   # BR(~chi_2+ -> ~chi_1+  Z )
     3.54592590E-04    2     1000022        24   # BR(~chi_2+ -> ~chi_10  W+)
     2.44531926E-01    2     1000023        24   # BR(~chi_2+ -> ~chi_20  W+)
     2.43237201E-01    2     1000025        24   # BR(~chi_2+ -> ~chi_30  W+)
     2.59589658E-01    2     1000024        25   # BR(~chi_2+ -> ~chi_1+  h )
     1.39787984E-07    2     1000022        37   # BR(~chi_2+ -> ~chi_10  H+)
#
#         PDG            Width
DECAY   1000022     0.00000000E+00   # neutralino1 decays
#
#         PDG            Width
DECAY   1000023     1.16875261E+00   # neutralino2 decays
#          BR         NDA      ID1       ID2
     5.62412684E-01    2     1000022        23   # BR(~chi_20 -> ~chi_10   Z )
     4.37587316E-01    2     1000022        25   # BR(~chi_20 -> ~chi_10   h )
#
#         PDG            Width
DECAY   1000025     1.18213148E+00   # neutralino3 decays
#          BR         NDA      ID1       ID2
     4.18924882E-01    2     1000022        23   # BR(~chi_30 -> ~chi_10   Z )
     5.81075118E-01    2     1000022        25   # BR(~chi_30 -> ~chi_10   h )
#
#         PDG            Width
DECAY   1000035     1.67433769E+01   # neutralino4 decays
#          BR         NDA      ID1       ID2
     1.47299904E-04    2     1000022        23   # BR(~chi_40 -> ~chi_10   Z )
     2.45200427E-02    2     1000023        23   # BR(~chi_40 -> ~chi_20   Z )
     2.27740169E-01    2     1000025        23   # BR(~chi_40 -> ~chi_30   Z )
     2.43939608E-01    2     1000024       -24   # BR(~chi_40 -> ~chi_1+   W-)
     2.43939608E-01    2    -1000024        24   # BR(~chi_40 -> ~chi_1-   W+)
     2.19449665E-04    2     1000022        25   # BR(~chi_40 -> ~chi_10   h )
     1.20420776E-07    2     1000022        35   # BR(~chi_40 -> ~chi_10   H )
     2.46684570E-08    2     1000022        36   # BR(~chi_40 -> ~chi_10   A )
     2.35147863E-01    2     1000023        25   # BR(~chi_40 -> ~chi_20   h )
     2.43458134E-02    2     1000025        25   # BR(~chi_40 -> ~chi_30   h )
#
#         PDG            Width
DECAY        25     4.03765984E-03   # h decays
#          BR         NDA      ID1       ID2
     6.06340538E-01    2           5        -5   # BR(h -> b       bb     )
     6.42302337E-02    2         -15        15   # BR(h -> tau+    tau-   )
     2.27398383E-04    2         -13        13   # BR(h -> mu+     mu-    )
     4.82072220E-04    2           3        -3   # BR(h -> s       sb     )
     2.08915911E-02    2           4        -4   # BR(h -> c       cb     )
     6.75779095E-02    2          21        21   # BR(h -> g       g      )
     2.32374318E-03    2          22        22   # BR(h -> gam     gam    )
     1.49822410E-03    2          22        23   # BR(h -> Z       gam    )
     2.11226436E-01    2          24       -24   # BR(h -> W+      W-     )
     2.51770752E-02    2          23        23   # BR(h -> Z       Z      )
     2.47791166E-05    2     1000022   1000022   # BR(h -> ~chi_10 ~chi_10)
#
#         PDG            Width
DECAY        35     6.71885337E+00   # H decays
#          BR         NDA      ID1       ID2
     4.89218260E-01    2           5        -5   # BR(H -> b       bb     )
     8.29316005E-02    2         -15        15   # BR(H -> tau+    tau-   )
     2.93252727E-04    2         -13        13   # BR(H -> mu+     mu-    )
     3.59482972E-04    2           3        -3   # BR(H -> s       sb     )
     2.00991410E-06    2           4        -4   # BR(H -> c       cb     )
     2.00806332E-01    2           6        -6   # BR(H -> t       tb     )
     6.66234675E-05    2          21        21   # BR(H -> g       g      )
     3.86598897E-07    2          22        22   # BR(H -> gam     gam    )
     1.18606127E-07    2          23        22   # BR(H -> Z       gam    )
     8.80934064E-05    2          24       -24   # BR(H -> W+      W-     )
     4.39909596E-05    2          23        23   # BR(H -> Z       Z      )
     3.36078834E-04    2          25        25   # BR(H -> h       h      )
    -3.12181087E-24    2          36        36   # BR(H -> A       A      )
     6.43470228E-19    2          23        36   # BR(H -> Z       A      )
     6.63822322E-04    2     1000022   1000022   # BR(H -> ~chi_10 ~chi_10)
     1.32635442E-01    2     1000022   1000023   # BR(H -> ~chi_10 ~chi_20)
     9.25545062E-02    2     1000022   1000025   # BR(H -> ~chi_10 ~chi_30)
#
#         PDG            Width
DECAY        36     6.72194540E+00   # A decays
#          BR         NDA      ID1       ID2
     4.89156400E-01    2           5        -5   # BR(A -> b       bb     )
     8.28959376E-02    2         -15        15   # BR(A -> tau+    tau-   )
     2.93126210E-04    2         -13        13   # BR(A -> mu+     mu-    )
     3.59590377E-04    2           3        -3   # BR(A -> s       sb     )
     2.01746340E-06    2           4        -4   # BR(A -> c       cb     )
     2.01449363E-01    2           6        -6   # BR(A -> t       tb     )
     1.99366736E-04    2          21        21   # BR(A -> g       g      )
     3.72311866E-07    2          22        22   # BR(A -> gam     gam    )
     2.41549657E-07    2          23        22   # BR(A -> Z       gam    )
     8.77203913E-05    2          23        25   # BR(A -> Z       h      )
     6.85005309E-04    2     1000022   1000022   # BR(A -> ~chi_10 ~chi_10)
     9.36316127E-02    2     1000022   1000023   # BR(A -> ~chi_10 ~chi_20)
     1.31239246E-01    2     1000022   1000025   # BR(A -> ~chi_10 ~chi_30)
#
#         PDG            Width
DECAY        37     6.73290101E+00   # H+ decays
#          BR         NDA      ID1       ID2
     7.88522529E-04    2           4        -5   # BR(H+ -> c       bb     )
     8.27851275E-02    2         -15        16   # BR(H+ -> tau+    nu_tau )
     2.92734377E-04    2         -13        14   # BR(H+ -> mu+     nu_mu  )
     5.04651858E-06    2           2        -5   # BR(H+ -> u       bb     )
     1.71770439E-05    2           2        -3   # BR(H+ -> u       sb     )
     3.55221675E-04    2           4        -3   # BR(H+ -> c       sb     )
     6.89727105E-01    2           6        -5   # BR(H+ -> t       bb     )
     8.77103411E-05    2          24        25   # BR(H+ -> W+      h      )
     9.88317468E-14    2          24        36   # BR(H+ -> W+      A      )
     2.25941355E-01    2     1000024   1000022   # BR(H+ -> ~chi_1+ ~chi_10)
