#
#                              ======================
#                              | THE SUSYHIT OUTPUT |
#                              ======================
#
#
#              ------------------------------------------------------
#              |     This is the output of the SUSY-HIT package     |
#              |  created by A.Djouadi, M.Muehlleitner and M.Spira. |
#              |  In case of problems with SUSY-HIT email to        |
#              |           margarete.muehlleitner@cern.ch           |
#              |           michael.spira@psi.ch                     |
#              |           abdelhak.djouadi@cern.ch                 |
#              ------------------------------------------------------
#
#              ------------------------------------------------------
#              |  SUSY Les Houches Accord - MSSM Spectrum + Decays  |
#              |              based on the decay programs           |
#              |                                                    |
#              |                     SDECAY 1.3b                    |
#              |                                                    |
#              |  Authors: M.Muhlleitner, A.Djouadi and Y.Mambrini  |
#              |  Ref.:    Comput.Phys.Commun.168(2005)46           |
#              |           [hep-ph/0311167]                         |
#              |                                                    |
#              |                     HDECAY 3.4                     |
#              |                                                    |
#              |  By: A.Djouadi,J.Kalinowski,M.Muhlleitner,M.Spira  |
#              |  Ref.:    Comput.Phys.Commun.108(1998)56           |
#              |           [hep-ph/9704448]                         |
#              |                                                    |
#              |                                                    |
#              |  If not stated otherwise all DRbar couplings and   |
#              |  soft SUSY breaking masses are given at the scale  |
#              |  Q=  0.50007171E+04
#              |                                                    |
#              ------------------------------------------------------
#
#
BLOCK DCINFO  # Decay Program information
     1   SDECAY/HDECAY # decay calculator
     2   1.3b  /3.4    # version number
#
BLOCK SPINFO  # Spectrum calculator information
     1    SOFTSUSY    # spectrum calculator                
     2    3.4.0       # version number                     
#
BLOCK MODSEL  # Model selection
     1     0   #  nonUniversal                                     
#
BLOCK SMINPUTS  # Standard Model inputs
         1     1.25778332E+02   # alpha_em^-1(M_Z)^MSbar
         2     1.16570000E-05   # G_F [GeV^-2]
         3     1.17200002E-01   # alpha_S(M_Z)^MSbar
         4     9.11876000E+01   # M_Z pole mass
         5     4.25000000E+00   # mb(mb)^MSbar
         6     1.72500000E+02   # mt pole mass
         7     1.77682000E+00   # mtau pole mass
#
BLOCK MINPAR  # Input parameters - minimal models
         3     1.00000000E+01   # tanb                
#
BLOCK EXTPAR  # Input parameters - non-minimal models
         0    -1.00000000E+00   # Set                 
         1     6.00000000E+01   # M_1(MX)             
         2     3.00000000E+03   # M_2(MX)             
         3     6.88108000E+02   # M_3(MX)             
        11     5.00000000E+03   # At(MX)              
        12     5.00000000E+03   # Ab(MX)              
        13     0.00000000E+00   # Atau(MX)            
        23    -1.15434100E+03   # mu(MX)              
        26     3.00000000E+03   # mA(pole)            
        31     5.00000000E+03   # meL(MX)             
        32     5.00000000E+03   # mmuL(MX)            
        33     5.00000000E+03   # mtauL(MX)           
        34     5.00000000E+03   # meR(MX)             
        35     5.00000000E+03   # mmuR(MX)            
        36     5.00000000E+03   # mtauR(MX)           
        41     5.00000000E+03   # mqL1(MX)            
        42     5.00000000E+03   # mqL2(MX)            
        43     5.00000000E+03   # mqL3(MX)            
        44     5.00000000E+03   # muR(MX)             
        45     5.00000000E+03   # mcR(MX)             
        46     5.00000000E+03   # mtR(MX)             
        47     5.00000000E+03   # mdR(MX)             
        48     5.00000000E+03   # msR(MX)             
        49     5.00000000E+03   # mbR(MX)             
#
BLOCK MASS  # Mass Spectrum
# PDG code           mass       particle
        24     8.00924346E+01   # W+
        25     1.24222332E+02   # h
        35     3.00007955E+03   # H
        36     2.99999986E+03   # A
        37     3.00086581E+03   # H+
         5     4.87878001E+00   # b-quark pole mass calculated from mb(mb)_Msbar
   1000001     5.06344952E+03   # ~d_L
   2000001     5.04562500E+03   # ~d_R
   1000002     5.06297226E+03   # ~u_L
   2000002     5.04534334E+03   # ~u_R
   1000003     5.06344952E+03   # ~s_L
   2000003     5.04562500E+03   # ~s_R
   1000004     5.06297226E+03   # ~c_L
   2000004     5.04534334E+03   # ~c_R
   1000005     5.01001327E+03   # ~b_1
   2000005     5.04434975E+03   # ~b_2
   1000006     4.90063897E+03   # ~t_1
   2000006     5.05645615E+03   # ~t_2
   1000011     5.01906423E+03   # ~e_L
   2000011     5.00591825E+03   # ~e_R
   1000012     5.01811514E+03   # ~nu_eL
   1000013     5.01906423E+03   # ~mu_L
   2000013     5.00591825E+03   # ~mu_R
   1000014     5.01811514E+03   # ~nu_muL
   1000015     5.00452429E+03   # ~tau_1
   2000015     5.01885236E+03   # ~tau_2
   1000016     5.01757145E+03   # ~nu_tauL
   1000021     9.00001133E+02   # ~g
   1000022     6.03019437E+01   # ~chi_10
   1000023     1.19954001E+03   # ~chi_20
   1000025    -1.20184684E+03   # ~chi_30
   1000035     3.07429548E+03   # ~chi_40
   1000024     1.20000061E+03   # ~chi_1+
   1000037     3.07446302E+03   # ~chi_2+
#
BLOCK NMIX  # Neutralino Mixing Matrix
  1  1     9.99308459E-01   # N_11
  1  2     1.64171590E-04   # N_12
  1  3    -3.71285316E-02   # N_13
  1  4     2.01243746E-03   # N_14
  2  1     2.48351611E-02   # N_21
  2  2     2.59845710E-02   # N_22
  2  3     7.06840690E-01   # N_23
  2  4     7.06458955E-01   # N_24
  3  1    -2.76703116E-02   # N_31
  3  2     1.42108871E-02   # N_32
  3  3    -7.06348623E-01   # N_33
  3  4     7.07180336E-01   # N_34
  4  1    -4.16352038E-04   # N_41
  4  2     9.99561317E-01   # N_42
  4  3    -8.32666890E-03   # N_43
  4  4    -2.84194904E-02   # N_44
#
BLOCK UMIX  # Chargino Mixing Matrix U
  1  1     1.17905608E-02   # U_11
  1  2     9.99930489E-01   # U_12
  2  1    -9.99930489E-01   # U_21
  2  2     1.17905608E-02   # U_22
#
BLOCK VMIX  # Chargino Mixing Matrix V
  1  1     4.02199157E-02   # V_11
  1  2    -9.99190852E-01   # V_12
  2  1    -9.99190852E-01   # V_21
  2  2    -4.02199157E-02   # V_22
#
BLOCK STOPMIX  # Stop Mixing Matrix
  1  1    -5.12072895E-01   # cos(theta_t)
  1  2     8.58941995E-01   # sin(theta_t)
  2  1    -8.58941995E-01   # -sin(theta_t)
  2  2    -5.12072895E-01   # cos(theta_t)
#
BLOCK SBOTMIX  # Sbottom Mixing Matrix
  1  1     9.96075685E-01   # cos(theta_b)
  1  2    -8.85055351E-02   # sin(theta_b)
  2  1     8.85055351E-02   # -sin(theta_b)
  2  2     9.96075685E-01   # cos(theta_b)
#
BLOCK STAUMIX  # Stau Mixing Matrix
  1  1    -1.36058058E-01   # cos(theta_tau)
  1  2     9.90700865E-01   # sin(theta_tau)
  2  1    -9.90700865E-01   # -sin(theta_tau)
  2  2    -1.36058058E-01   # cos(theta_tau)
#
BLOCK ALPHA  # Higgs mixing
          -1.05410604E-01   # Mixing angle in the neutral Higgs boson sector
#
BLOCK HMIX Q=  5.00071706E+03  # DRbar Higgs Parameters
         1    -1.17476727E+03   # mu(Q)MSSM           
         2     9.47527356E+00   # tan                 
         3     2.41982032E+02   # higgs               
         4     8.45589916E+06   # mA^2(Q)MSSM         
#
BLOCK GAUGE Q=  5.00071706E+03  # The gauge couplings
     1     3.70776381E-01   # gprime(Q) DRbar
     2     6.32397323E-01   # g(Q) DRbar
     3     1.01019293E+00   # g3(Q) DRbar
#
BLOCK AU Q=  5.00071706E+03  # The trilinear couplings
  1  1     5.00000001E+03   # A_u(Q) DRbar
  2  2     5.00000001E+03   # A_c(Q) DRbar
  3  3     5.00000001E+03   # A_t(Q) DRbar
#
BLOCK AD Q=  5.00071706E+03  # The trilinear couplings
  1  1     5.00000000E+03   # A_d(Q) DRbar
  2  2     5.00000000E+03   # A_s(Q) DRbar
  3  3     5.00000001E+03   # A_b(Q) DRbar
#
BLOCK AE Q=  5.00071706E+03  # The trilinear couplings
  1  1     0.00000000E+00   # A_e(Q) DRbar
  2  2     0.00000000E+00   # A_mu(Q) DRbar
  3  3    -1.01639380E-09   # A_tau(Q) DRbar
#
BLOCK Yu Q=  5.00071706E+03  # The Yukawa couplings
  1  1     0.00000000E+00   # y_u(Q) DRbar
  2  2     0.00000000E+00   # y_c(Q) DRbar
  3  3     8.13037371E-01   # y_t(Q) DRbar
#
BLOCK Yd Q=  5.00071706E+03  # The Yukawa couplings
  1  1     0.00000000E+00   # y_d(Q) DRbar
  2  2     0.00000000E+00   # y_s(Q) DRbar
  3  3     1.29296157E-01   # y_b(Q) DRbar
#
BLOCK Ye Q=  5.00071706E+03  # The Yukawa couplings
  1  1     0.00000000E+00   # y_e(Q) DRbar
  2  2     0.00000000E+00   # y_mu(Q) DRbar
  3  3     9.67765601E-02   # y_tau(Q) DRbar
#
BLOCK MSOFT Q=  5.00071706E+03  # The soft SUSY breaking masses at the scale Q
         1     6.00000000E+01   # M_1(Q)              
         2     3.00000000E+03   # M_2(Q)              
         3     6.88108000E+02   # M_3(Q)              
        21     7.30440575E+06   # mH1^2(Q)            
        22    -8.27766584E+05   # mH2^2(Q)            
        31     5.00000000E+03   # meL(Q)              
        32     5.00000000E+03   # mmuL(Q)             
        33     5.00000000E+03   # mtauL(Q)            
        34     5.00000000E+03   # meR(Q)              
        35     5.00000000E+03   # mmuR(Q)             
        36     5.00000000E+03   # mtauR(Q)            
        41     5.00000000E+03   # mqL1(Q)             
        42     5.00000000E+03   # mqL2(Q)             
        43     5.00000000E+03   # mqL3(Q)             
        44     5.00000000E+03   # muR(Q)              
        45     5.00000000E+03   # mcR(Q)              
        46     5.00000000E+03   # mtR(Q)              
        47     5.00000000E+03   # mdR(Q)              
        48     5.00000000E+03   # msR(Q)              
        49     5.00000000E+03   # mbR(Q)              
#
#
#
#                             =================
#                             |The decay table|
#                             =================
#
# - The QCD corrections to the decays gluino -> squark  + quark
#                                     squark -> gaugino + quark_prime
#                                     squark -> squark_prime + Higgs
#                                     squark -> gluino  + quark
#   are included.
#
# - The multi-body decays for the inos, stops and sbottoms are included.
#
# - The loop induced decays for the gluino, neutralinos and stops
#   are included.
#
# - The SUSY decays of the top quark are included.
#
#
#         PDG            Width
DECAY         6     1.40158979E+00   # top decays
#          BR         NDA      ID1       ID2
     1.00000000E+00    2           5        24   # BR(t ->  b    W+)
#
#         PDG            Width
DECAY   1000021     4.85339303E-06   # gluino decays
#          BR         NDA      ID1       ID2
     2.50958883E-05    2     1000022        21   # BR(~g -> ~chi_10 g)
#           BR         NDA      ID1       ID2       ID3
     8.50713551E-02    3     1000022         1        -1   # BR(~g -> ~chi_10 d  db)
     2.90016226E-01    3     1000022         2        -2   # BR(~g -> ~chi_10 u  ub)
     8.50713551E-02    3     1000022         3        -3   # BR(~g -> ~chi_10 s  sb)
     2.90016226E-01    3     1000022         4        -4   # BR(~g -> ~chi_10 c  cb)
     8.61989691E-02    3     1000022         5        -5   # BR(~g -> ~chi_10 b  bb)
     1.63600772E-01    3     1000022         6        -6   # BR(~g -> ~chi_10 t  tb)
#
#         PDG            Width
DECAY   1000006     4.17425158E+02   # stop1 decays
#          BR         NDA      ID1       ID2
     2.10073006E-02    2     1000022         6   # BR(~t_1 -> ~chi_10 t )
     6.92491316E-02    2     1000023         6   # BR(~t_1 -> ~chi_20 t )
     6.65491446E-02    2     1000025         6   # BR(~t_1 -> ~chi_30 t )
     5.14940680E-03    2     1000035         6   # BR(~t_1 -> ~chi_40 t )
     9.93412292E-02    2     1000024         5   # BR(~t_1 -> ~chi_1+ b )
     1.02543221E-02    2     1000037         5   # BR(~t_1 -> ~chi_2+ b )
     7.28449465E-01    2     1000021         6   # BR(~t_1 -> ~g      t )
#
#         PDG            Width
DECAY   2000006     4.19255715E+02   # stop2 decays
#          BR         NDA      ID1       ID2
     8.59618578E-03    2     1000022         6   # BR(~t_2 -> ~chi_10 t )
     7.08374079E-02    2     1000023         6   # BR(~t_2 -> ~chi_20 t )
     7.37595791E-02    2     1000025         6   # BR(~t_2 -> ~chi_30 t )
     1.29415483E-02    2     1000035         6   # BR(~t_2 -> ~chi_40 t )
     4.36106848E-02    2     1000024         5   # BR(~t_2 -> ~chi_1+ b )
     2.57337371E-02    2     1000037         5   # BR(~t_2 -> ~chi_2+ b )
     7.61392333E-01    2     1000021         6   # BR(~t_2 -> ~g      t )
     6.89458229E-04    2     1000006        25   # BR(~t_2 -> ~t_1    h )
     2.43906633E-03    2     1000006        23   # BR(~t_2 -> ~t_1    Z )
#
#         PDG            Width
DECAY   1000005     3.98123199E+02   # sbottom1 decays
#          BR         NDA      ID1       ID2
     1.95513217E-03    2     1000022         5   # BR(~b_1 -> ~chi_10 b )
     1.91686602E-03    2     1000023         5   # BR(~b_1 -> ~chi_20 b )
     1.84471017E-03    2     1000025         5   # BR(~b_1 -> ~chi_30 b )
     1.87566253E-02    2     1000035         5   # BR(~b_1 -> ~chi_40 b )
     1.47163292E-01    2    -1000024         6   # BR(~b_1 -> ~chi_1- t )
     3.77061529E-02    2    -1000037         6   # BR(~b_1 -> ~chi_2- t )
     7.89234148E-01    2     1000021         5   # BR(~b_1 -> ~g      b )
     1.42307361E-03    2     1000006       -24   # BR(~b_1 -> ~t_1    W-)
#
#         PDG            Width
DECAY   2000005     3.23031738E+02   # sbottom2 decays
#          BR         NDA      ID1       ID2
     9.09550513E-03    2     1000022         5   # BR(~b_2 -> ~chi_10 b )
     2.31900269E-03    2     1000023         5   # BR(~b_2 -> ~chi_20 b )
     2.39796665E-03    2     1000025         5   # BR(~b_2 -> ~chi_30 b )
     1.93152820E-04    2     1000035         5   # BR(~b_2 -> ~chi_40 b )
     6.07552262E-03    2    -1000024         6   # BR(~b_2 -> ~chi_1- t )
     3.88194516E-04    2    -1000037         6   # BR(~b_2 -> ~chi_2- t )
     9.79474290E-01    2     1000021         5   # BR(~b_2 -> ~g      b )
     5.63658679E-05    2     1000006       -24   # BR(~b_2 -> ~t_1    W-)
#
#         PDG            Width
DECAY   1000002     3.41833268E+02   # sup_L decays
#          BR         NDA      ID1       ID2
     2.18730685E-03    2     1000022         2   # BR(~u_L -> ~chi_10 u)
     4.85106742E-05    2     1000023         2   # BR(~u_L -> ~chi_20 u)
     3.95126656E-06    2     1000025         2   # BR(~u_L -> ~chi_30 u)
     2.28087107E-02    2     1000035         2   # BR(~u_L -> ~chi_40 u)
     1.65018019E-04    2     1000024         1   # BR(~u_L -> ~chi_1+ d)
     4.55852602E-02    2     1000037         1   # BR(~u_L -> ~chi_2+ d)
     9.29201242E-01    2     1000021         2   # BR(~u_L -> ~g      u)
#
#         PDG            Width
DECAY   2000002     3.28297336E+02   # sup_R decays
#          BR         NDA      ID1       ID2
     3.62516913E-02    2     1000022         2   # BR(~u_R -> ~chi_10 u)
     1.99334515E-05    2     1000023         2   # BR(~u_R -> ~chi_20 u)
     2.47329255E-05    2     1000025         2   # BR(~u_R -> ~chi_30 u)
     2.48936815E-09    2     1000035         2   # BR(~u_R -> ~chi_40 u)
     9.63703640E-01    2     1000021         2   # BR(~u_R -> ~g      u)
#
#         PDG            Width
DECAY   1000001     3.41842630E+02   # sdown_L decays
#          BR         NDA      ID1       ID2
     2.18011075E-03    2     1000022         1   # BR(~d_L -> ~chi_10 d)
     2.27790133E-05    2     1000023         1   # BR(~d_L -> ~chi_20 d)
     1.96261356E-05    2     1000025         1   # BR(~d_L -> ~chi_30 d)
     2.28226611E-02    2     1000035         1   # BR(~d_L -> ~chi_40 d)
     1.41826319E-05    2    -1000024         2   # BR(~d_L -> ~chi_1- u)
     4.56658249E-02    2    -1000037         2   # BR(~d_L -> ~chi_2- u)
     9.29274815E-01    2     1000021         1   # BR(~d_L -> ~g      d)
#
#         PDG            Width
DECAY   2000001     3.19380488E+02   # sdown_R decays
#          BR         NDA      ID1       ID2
     9.31647374E-03    2     1000022         1   # BR(~d_R -> ~chi_10 d)
     5.12284932E-06    2     1000023         1   # BR(~d_R -> ~chi_20 d)
     6.35630299E-06    2     1000025         1   # BR(~d_R -> ~chi_30 d)
     6.39836925E-10    2     1000035         1   # BR(~d_R -> ~chi_40 d)
     9.90672046E-01    2     1000021         1   # BR(~d_R -> ~g      d)
#
#         PDG            Width
DECAY   1000004     3.41833268E+02   # scharm_L decays
#          BR         NDA      ID1       ID2
     2.18730685E-03    2     1000022         4   # BR(~c_L -> ~chi_10 c)
     4.85106742E-05    2     1000023         4   # BR(~c_L -> ~chi_20 c)
     3.95126656E-06    2     1000025         4   # BR(~c_L -> ~chi_30 c)
     2.28087107E-02    2     1000035         4   # BR(~c_L -> ~chi_40 c)
     1.65018019E-04    2     1000024         3   # BR(~c_L -> ~chi_1+ s)
     4.55852602E-02    2     1000037         3   # BR(~c_L -> ~chi_2+ s)
     9.29201242E-01    2     1000021         4   # BR(~c_L -> ~g      c)
#
#         PDG            Width
DECAY   2000004     3.28297336E+02   # scharm_R decays
#          BR         NDA      ID1       ID2
     3.62516913E-02    2     1000022         4   # BR(~c_R -> ~chi_10 c)
     1.99334515E-05    2     1000023         4   # BR(~c_R -> ~chi_20 c)
     2.47329255E-05    2     1000025         4   # BR(~c_R -> ~chi_30 c)
     2.48936815E-09    2     1000035         4   # BR(~c_R -> ~chi_40 c)
     9.63703640E-01    2     1000021         4   # BR(~c_R -> ~g      c)
#
#         PDG            Width
DECAY   1000003     3.41842630E+02   # sstrange_L decays
#          BR         NDA      ID1       ID2
     2.18011075E-03    2     1000022         3   # BR(~s_L -> ~chi_10 s)
     2.27790133E-05    2     1000023         3   # BR(~s_L -> ~chi_20 s)
     1.96261356E-05    2     1000025         3   # BR(~s_L -> ~chi_30 s)
     2.28226611E-02    2     1000035         3   # BR(~s_L -> ~chi_40 s)
     1.41826319E-05    2    -1000024         4   # BR(~s_L -> ~chi_1- c)
     4.56658249E-02    2    -1000037         4   # BR(~s_L -> ~chi_2- c)
     9.29274815E-01    2     1000021         3   # BR(~s_L -> ~g      s)
#
#         PDG            Width
DECAY   2000003     3.19380488E+02   # sstrange_R decays
#          BR         NDA      ID1       ID2
     9.31647374E-03    2     1000022         3   # BR(~s_R -> ~chi_10 s)
     5.12284932E-06    2     1000023         3   # BR(~s_R -> ~chi_20 s)
     6.35630299E-06    2     1000025         3   # BR(~s_R -> ~chi_30 s)
     6.39836925E-10    2     1000035         3   # BR(~s_R -> ~chi_40 s)
     9.90672046E-01    2     1000021         3   # BR(~s_R -> ~g      s)
#
#         PDG            Width
DECAY   1000011     3.02596648E+01   # selectron_L decays
#          BR         NDA      ID1       ID2
     2.26568744E-01    2     1000022        11   # BR(~e_L -> ~chi_10 e-)
     9.64356183E-04    2     1000023        11   # BR(~e_L -> ~chi_20 e-)
     2.37428920E-06    2     1000025        11   # BR(~e_L -> ~chi_30 e-)
     2.57245730E-01    2     1000035        11   # BR(~e_L -> ~chi_40 e-)
     1.63083753E-04    2    -1000024        12   # BR(~e_L -> ~chi_1- nu_e)
     5.15055712E-01    2    -1000037        12   # BR(~e_L -> ~chi_2- nu_e)
#
#         PDG            Width
DECAY   2000011     2.73700105E+01   # selectron_R decays
#          BR         NDA      ID1       ID2
     9.98771474E-01    2     1000022        11   # BR(~e_R -> ~chi_10 e-)
     5.48231019E-04    2     1000023        11   # BR(~e_R -> ~chi_20 e-)
     6.80227226E-04    2     1000025        11   # BR(~e_R -> ~chi_30 e-)
     6.72774867E-08    2     1000035        11   # BR(~e_R -> ~chi_40 e-)
#
#         PDG            Width
DECAY   1000013     3.02596648E+01   # smuon_L decays
#          BR         NDA      ID1       ID2
     2.26568744E-01    2     1000022        13   # BR(~mu_L -> ~chi_10 mu-)
     9.64356183E-04    2     1000023        13   # BR(~mu_L -> ~chi_20 mu-)
     2.37428920E-06    2     1000025        13   # BR(~mu_L -> ~chi_30 mu-)
     2.57245730E-01    2     1000035        13   # BR(~mu_L -> ~chi_40 mu-)
     1.63083753E-04    2    -1000024        14   # BR(~mu_L -> ~chi_1- nu_mu)
     5.15055712E-01    2    -1000037        14   # BR(~mu_L -> ~chi_2- nu_mu)
#
#         PDG            Width
DECAY   2000013     2.73700105E+01   # smuon_R decays
#          BR         NDA      ID1       ID2
     9.98771474E-01    2     1000022        13   # BR(~mu_R -> ~chi_10 mu-)
     5.48231019E-04    2     1000023        13   # BR(~mu_R -> ~chi_20 mu-)
     6.80227226E-04    2     1000025        13   # BR(~mu_R -> ~chi_30 mu-)
     6.72774867E-08    2     1000035        13   # BR(~mu_R -> ~chi_40 mu-)
#
#         PDG            Width
DECAY   1000015     2.90699548E+01   # stau_1 decays
#          BR         NDA      ID1       ID2
     9.27965483E-01    2     1000022        15   # BR(~tau_1 -> ~chi_10  tau-)
     1.50489838E-02    2     1000023        15   # BR(~tau_1 -> ~chi_20  tau-)
     1.40772510E-02    2     1000025        15   # BR(~tau_1 -> ~chi_30  tau-)
     4.78010846E-03    2     1000035        15   # BR(~tau_1 -> ~chi_40  tau-)
     2.85576972E-02    2    -1000024        16   # BR(~tau_1 -> ~chi_1-  nu_tau)
     9.57047697E-03    2    -1000037        16   # BR(~tau_1 -> ~chi_2-  nu_tau)
#
#         PDG            Width
DECAY   2000015     3.10332624E+01   # stau_2 decays
#          BR         NDA      ID1       ID2
     2.32397103E-01    2     1000022        15   # BR(~tau_2 -> ~chi_10  tau-)
     1.40474192E-02    2     1000023        15   # BR(~tau_2 -> ~chi_20  tau-)
     1.40905931E-02    2     1000025        15   # BR(~tau_2 -> ~chi_30  tau-)
     2.46276381E-01    2     1000035        15   # BR(~tau_2 -> ~chi_40  tau-)
     9.55281094E-05    2    -1000024        16   # BR(~tau_2 -> ~chi_1-  nu_tau)
     4.93092976E-01    2    -1000037        16   # BR(~tau_2 -> ~chi_2-  nu_tau)
#
#         PDG            Width
DECAY   1000012     3.02621920E+01   # snu_eL decays
#          BR         NDA      ID1       ID2
     2.26253227E-01    2     1000022        12   # BR(~nu_eL -> ~chi_10 nu_e)
     7.65285035E-05    2     1000023        12   # BR(~nu_eL -> ~chi_20 nu_e)
     5.42914326E-04    2     1000025        12   # BR(~nu_eL -> ~chi_30 nu_e)
     2.57310014E-01    2     1000035        12   # BR(~nu_eL -> ~chi_40 nu_e)
     1.89708051E-03    2     1000024        11   # BR(~nu_eL -> ~chi_1+ e-)
     5.13920236E-01    2     1000037        11   # BR(~nu_eL -> ~chi_2+ e-)
#
#         PDG            Width
DECAY   1000014     3.02621920E+01   # snu_muL decays
#          BR         NDA      ID1       ID2
     2.26253227E-01    2     1000022        14   # BR(~nu_muL -> ~chi_10 nu_mu)
     7.65285035E-05    2     1000023        14   # BR(~nu_muL -> ~chi_20 nu_mu)
     5.42914326E-04    2     1000025        14   # BR(~nu_muL -> ~chi_30 nu_mu)
     2.57310014E-01    2     1000035        14   # BR(~nu_muL -> ~chi_40 nu_mu)
     1.89708051E-03    2     1000024        13   # BR(~nu_muL -> ~chi_1+ mu-)
     5.13920236E-01    2     1000037        13   # BR(~nu_muL -> ~chi_2+ mu-)
#
#         PDG            Width
DECAY   1000016     3.10838061E+01   # snu_tauL decays
#          BR         NDA      ID1       ID2
     2.20248972E-01    2     1000022        16   # BR(~nu_tauL -> ~chi_10 nu_tau)
     7.44956557E-05    2     1000023        16   # BR(~nu_tauL -> ~chi_20 nu_tau)
     5.28492686E-04    2     1000025        16   # BR(~nu_tauL -> ~chi_30 nu_tau)
     2.50416367E-01    2     1000035        16   # BR(~nu_tauL -> ~chi_40 nu_tau)
     2.85799518E-02    2     1000024        15   # BR(~nu_tauL -> ~chi_1+ tau-)
     5.00151721E-01    2     1000037        15   # BR(~nu_tauL -> ~chi_2+ tau-)
#
#         PDG            Width
DECAY   1000024     7.35072106E-01   # chargino1+ decays
#          BR         NDA      ID1       ID2
     1.00000000E+00    2     1000022        24   # BR(~chi_1+ -> ~chi_10  W+)
#
#         PDG            Width
DECAY   1000037     1.96881821E+01   # chargino2+ decays
#          BR         NDA      ID1       ID2
     2.53040520E-01    2     1000024        23   # BR(~chi_2+ -> ~chi_1+  Z )
     2.15594694E-04    2     1000022        24   # BR(~chi_2+ -> ~chi_10  W+)
     2.44045467E-01    2     1000023        24   # BR(~chi_2+ -> ~chi_20  W+)
     2.44008027E-01    2     1000025        24   # BR(~chi_2+ -> ~chi_30  W+)
     2.58689646E-01    2     1000024        25   # BR(~chi_2+ -> ~chi_1+  h )
     7.45821675E-07    2     1000022        37   # BR(~chi_2+ -> ~chi_10  H+)
#
#         PDG            Width
DECAY   1000022     0.00000000E+00   # neutralino1 decays
#
#         PDG            Width
DECAY   1000023     7.70137881E-01   # neutralino2 decays
#          BR         NDA      ID1       ID2
     5.48113592E-01    2     1000022        23   # BR(~chi_20 -> ~chi_10   Z )
     4.51886408E-01    2     1000022        25   # BR(~chi_20 -> ~chi_10   h )
#
#         PDG            Width
DECAY   1000025     7.75932415E-01   # neutralino3 decays
#          BR         NDA      ID1       ID2
     4.38260766E-01    2     1000022        23   # BR(~chi_30 -> ~chi_10   Z )
     5.61739234E-01    2     1000022        25   # BR(~chi_30 -> ~chi_10   h )
#
#         PDG            Width
DECAY   1000035     1.96997732E+01   # neutralino4 decays
#          BR         NDA      ID1       ID2
     6.35633361E-05    2     1000022        23   # BR(~chi_40 -> ~chi_10   Z )
     5.83427660E-02    2     1000023        23   # BR(~chi_40 -> ~chi_20   Z )
     1.93993670E-01    2     1000025        23   # BR(~chi_40 -> ~chi_30   Z )
     2.44658914E-01    2     1000024       -24   # BR(~chi_40 -> ~chi_1+   W-)
     2.44658914E-01    2    -1000024        24   # BR(~chi_40 -> ~chi_1-   W+)
     1.54884875E-04    2     1000022        25   # BR(~chi_40 -> ~chi_10   h )
     6.82826152E-07    2     1000022        35   # BR(~chi_40 -> ~chi_10   H )
     8.92450654E-08    2     1000022        36   # BR(~chi_40 -> ~chi_10   A )
     1.99706743E-01    2     1000023        25   # BR(~chi_40 -> ~chi_20   h )
     5.84197725E-02    2     1000025        25   # BR(~chi_40 -> ~chi_30   h )
#
#         PDG            Width
DECAY        25     4.00422447E-03   # h decays
#          BR         NDA      ID1       ID2
     6.18438333E-01    2           5        -5   # BR(h -> b       bb     )
     6.44837442E-02    2         -15        15   # BR(h -> tau+    tau-   )
     2.28298364E-04    2         -13        13   # BR(h -> mu+     mu-    )
     4.84397158E-04    2           3        -3   # BR(h -> s       sb     )
     2.09911891E-02    2           4        -4   # BR(h -> c       cb     )
     6.72622991E-02    2          21        21   # BR(h -> g       g      )
     2.30007283E-03    2          22        22   # BR(h -> gam     gam    )
     1.43681911E-03    2          22        23   # BR(h -> Z       gam    )
     2.00656823E-01    2          24       -24   # BR(h -> W+      W-     )
     2.36809678E-02    2          23        23   # BR(h -> Z       Z      )
     3.70567834E-05    2     1000022   1000022   # BR(h -> ~chi_10 ~chi_10)
#
#         PDG            Width
DECAY        35     7.78755982E+00   # H decays
#          BR         NDA      ID1       ID2
     4.15840324E-01    2           5        -5   # BR(H -> b       bb     )
     7.16207281E-02    2         -15        15   # BR(H -> tau+    tau-   )
     2.53256583E-04    2         -13        13   # BR(H -> mu+     mu-    )
     3.10453891E-04    2           3        -3   # BR(H -> s       sb     )
     1.73249225E-06    2           4        -4   # BR(H -> c       cb     )
     1.73089695E-01    2           6        -6   # BR(H -> t       tb     )
     5.74578083E-05    2          21        21   # BR(H -> g       g      )
     3.33167922E-07    2          22        22   # BR(H -> gam     gam    )
     1.02074256E-07    2          23        22   # BR(H -> Z       gam    )
     7.77222181E-05    2          24       -24   # BR(H -> W+      W-     )
     3.88119092E-05    2          23        23   # BR(H -> Z       Z      )
     2.94373414E-04    2          25        25   # BR(H -> h       h      )
    -8.64157151E-24    2          36        36   # BR(H -> A       A      )
     9.74298601E-19    2          23        36   # BR(H -> Z       A      )
     1.19074671E-03    2     1000024  -1000024   # BR(H -> ~chi_1+ ~chi_1-)
     1.28864308E-03    2     1000022   1000022   # BR(H -> ~chi_10 ~chi_10)
     6.58957833E-05    2     1000023   1000023   # BR(H -> ~chi_20 ~chi_20)
     2.34738353E-04    2     1000025   1000025   # BR(H -> ~chi_30 ~chi_30)
     2.00647164E-01    2     1000022   1000023   # BR(H -> ~chi_10 ~chi_20)
     1.34771483E-01    2     1000022   1000025   # BR(H -> ~chi_10 ~chi_30)
     2.16337751E-04    2     1000023   1000025   # BR(H -> ~chi_20 ~chi_30)
#
#         PDG            Width
DECAY        36     7.80790916E+00   # A decays
#          BR         NDA      ID1       ID2
     4.14897187E-01    2           5        -5   # BR(A -> b       bb     )
     7.14362248E-02    2         -15        15   # BR(A -> tau+    tau-   )
     2.52603812E-04    2         -13        13   # BR(A -> mu+     mu-    )
     3.09879697E-04    2           3        -3   # BR(A -> s       sb     )
     1.73516529E-06    2           4        -4   # BR(A -> c       cb     )
     1.73261107E-01    2           6        -6   # BR(A -> t       tb     )
     1.71539724E-04    2          21        21   # BR(A -> g       g      )
     5.27340952E-07    2          22        22   # BR(A -> gam     gam    )
     2.07584618E-07    2          23        22   # BR(A -> Z       gam    )
     7.72303607E-05    2          23        25   # BR(A -> Z       h      )
     2.91438330E-03    2     1000024  -1000024   # BR(A -> ~chi_1+ ~chi_1-)
     1.31723760E-03    2     1000022   1000022   # BR(A -> ~chi_10 ~chi_10)
     1.19302730E-04    2     1000023   1000023   # BR(A -> ~chi_20 ~chi_20)
     9.99960496E-04    2     1000025   1000025   # BR(A -> ~chi_30 ~chi_30)
     1.36155726E-01    2     1000022   1000023   # BR(A -> ~chi_10 ~chi_20)
     1.98058659E-01    2     1000022   1000025   # BR(A -> ~chi_10 ~chi_30)
     2.64886505E-05    2     1000023   1000025   # BR(A -> ~chi_20 ~chi_30)
#
#         PDG            Width
DECAY        37     7.74885701E+00   # H+ decays
#          BR         NDA      ID1       ID2
     6.65243766E-04    2           4        -5   # BR(H+ -> c       bb     )
     7.20014000E-02    2         -15        16   # BR(H+ -> tau+    nu_tau )
     2.54602314E-04    2         -13        14   # BR(H+ -> mu+     nu_mu  )
     4.25753802E-06    2           2        -5   # BR(H+ -> u       bb     )
     1.49395382E-05    2           2        -3   # BR(H+ -> u       sb     )
     3.08946719E-04    2           4        -3   # BR(H+ -> c       sb     )
     5.86712153E-01    2           6        -5   # BR(H+ -> t       bb     )
     7.79362994E-05    2          24        25   # BR(H+ -> W+      h      )
     8.25863330E-14    2          24        36   # BR(H+ -> W+      A      )
     3.39392144E-01    2     1000024   1000022   # BR(H+ -> ~chi_1+ ~chi_10)
     5.06935189E-04    2     1000024   1000023   # BR(H+ -> ~chi_1+ ~chi_20)
     6.14420750E-05    2     1000024   1000025   # BR(H+ -> ~chi_1+ ~chi_30)
