#
#                              ======================
#                              | THE SUSYHIT OUTPUT |
#                              ======================
#
#
#              ------------------------------------------------------
#              |     This is the output of the SUSY-HIT package     |
#              |  created by A.Djouadi, M.Muehlleitner and M.Spira. |
#              |  In case of problems with SUSY-HIT email to        |
#              |           margarete.muehlleitner@cern.ch           |
#              |           michael.spira@psi.ch                     |
#              |           abdelhak.djouadi@cern.ch                 |
#              ------------------------------------------------------
#
#              ------------------------------------------------------
#              |  SUSY Les Houches Accord - MSSM Spectrum + Decays  |
#              |              based on the decay programs           |
#              |                                                    |
#              |                     SDECAY 1.3b                    |
#              |                                                    |
#              |  Authors: M.Muhlleitner, A.Djouadi and Y.Mambrini  |
#              |  Ref.:    Comput.Phys.Commun.168(2005)46           |
#              |           [hep-ph/0311167]                         |
#              |                                                    |
#              |                     HDECAY 3.4                     |
#              |                                                    |
#              |  By: A.Djouadi,J.Kalinowski,M.Muhlleitner,M.Spira  |
#              |  Ref.:    Comput.Phys.Commun.108(1998)56           |
#              |           [hep-ph/9704448]                         |
#              |                                                    |
#              |                                                    |
#              |  If not stated otherwise all DRbar couplings and   |
#              |  soft SUSY breaking masses are given at the scale  |
#              |  Q=  0.91187600E+02
#              |                                                    |
#              ------------------------------------------------------
#
#
BLOCK DCINFO  # Decay Program information
     1   SDECAY/HDECAY # decay calculator
     2   1.3b  /3.4    # version number
#
BLOCK SPINFO  # Spectrum calculator information
     1   SuSpect     # RGE +Spectrum calculator            
     2   2.41         # version number                     
#
BLOCK MODSEL  # Model selection
     1     0   # #general MSSM low scale                           
#
BLOCK SMINPUTS  # Standard Model inputs
         1     1.27934000E+02   # alpha_em^-1(M_Z)^MSbar
         2     1.16639000E-05   # G_F [GeV^-2]
         3     1.17200000E-01   # alpha_S(M_Z)^MSbar
         4     9.11870000E+01   # M_Z pole mass
         5     4.25000000E+00   # mb(mb)^MSbar
         6     1.72500000E+02   # mt pole mass
         7     1.77700000E+00   # mtau pole mass
#
BLOCK MINPAR  # Input parameters - minimal models
#
BLOCK EXTPAR  # Input parameters - non-minimal models
         0     9.11876000E+01   # EWSB                
         1     1.10000000E+03   # M_1                 
         2     1.00000000E+05   # M_2                 
         3     1.00000000E+05   # M_3                 
        11     0.00000000E+00   # A_t                 
        12     0.00000000E+00   # A_b                 
        13     0.00000000E+00   # A_tau               
        14     0.00000000E+00   # A_u                 
        15     0.00000000E+00   # A_d                 
        16     0.00000000E+00   # A_e                 
        23     3.50000000E+03   # mu(EWSB)            
        25     1.50000000E+00   # tanbeta(in)         
        26     2.00000000E+03   # MA_pole             
        31     1.00000000E+05   # M_eL                
        32     1.00000000E+05   # M_muL               
        33     1.00000000E+05   # M_tauL              
        34     1.00000000E+05   # M_eR                
        35     1.00000000E+05   # M_muR               
        36     1.00000000E+05   # M_tauR              
        41     1.30000000E+03   # M_q1L               
        42     1.30000000E+03   # M_q2L               
        43     1.30000000E+03   # M_q3L               
        44     1.00000000E+05   # M_uR                
        45     1.00000000E+05   # M_cR                
        46     1.00000000E+05   # M_tR                
        47     1.30000000E+03   # M_dR                
        48     1.30000000E+03   # M_sR                
        49     1.30000000E+03   # M_bR                
#
BLOCK MASS  # Mass Spectrum
# PDG code           mass       particle
        24     8.05817471E+01   # W+
        25     1.25000000E+02   # h
        35     2.00397705E+03   # H
        36     2.00000000E+03   # A
        37     2.02369763E+03   # H+
         5     4.87877839E+00   # b-quark pole mass calculated from mb(mb)_Msbar
   1000001     1.30051149E+03   # ~d_L
   2000001     1.30009843E+03   # ~d_R
   1000002     1.29958678E+03   # ~u_L
   2000002     9.99999974E+04   # ~u_R
   1000003     1.30051149E+03   # ~s_L
   2000003     1.30009843E+03   # ~s_R
   1000004     1.29958678E+03   # ~c_L
   2000004     9.99999974E+04   # ~c_R
   1000005     1.29507895E+03   # ~b_1
   2000005     1.30551521E+03   # ~b_2
   1000006     1.30792386E+03   # ~t_1
   2000006     1.00000106E+05   # ~t_2
   1000011     1.00000004E+05   # ~e_L
   2000011     1.00000004E+05   # ~e_R
   1000012     9.99999921E+04   # ~nu_eL
   1000013     1.00000004E+05   # ~mu_L
   2000013     1.00000004E+05   # ~mu_R
   1000014     9.99999921E+04   # ~nu_muL
   1000015     9.99999574E+04   # ~tau_1
   2000015     1.00000051E+05   # ~tau_2
   1000016     9.99999921E+04   # ~nu_tauL
   1000021     1.00000000E+05   # ~g
   1000022     1.09921713E+03   # ~chi_10
   1000023    -3.50001902E+03   # ~chi_20
   1000025     3.50073727E+03   # ~chi_30
   1000035     1.00000065E+05   # ~chi_40
   1000024     3.49994003E+03   # ~chi_1+
   1000037     1.00000065E+05   # ~chi_2+
   1000039     1.00000000E-09   # ~gravitino
#
BLOCK NMIX  # Neutralino Mixing Matrix
  1  1     9.99831703E-01   # N_11
  1  2    -1.40051406E-05   # N_12
  1  3     1.42492716E-02   # N_13
  1  4    -1.15552859E-02   # N_14
  2  1     1.90500257E-03   # N_21
  2  2    -1.49826270E-04   # N_22
  2  3    -7.07095886E-01   # N_23
  2  4    -7.07115094E-01   # N_24
  3  1     1.82465755E-02   # N_31
  3  2     8.03295273E-04   # N_32
  3  3    -7.06973941E-01   # N_33
  3  4     7.07003723E-01   # N_34
  4  1     3.69185265E-07   # N_41
  4  2    -9.99999666E-01   # N_42
  4  3    -4.62167003E-04   # N_43
  4  4     6.74039223E-04   # N_44
#
BLOCK UMIX  # Chargino Mixing Matrix U
  1  1    -6.53602637E-04   # U_11
  1  2     9.99999786E-01   # U_12
  2  1     9.99999786E-01   # U_21
  2  2     6.53602637E-04   # U_22
#
BLOCK VMIX  # Chargino Mixing Matrix V
  1  1    -9.53235322E-04   # V_11
  1  2     9.99999546E-01   # V_12
  2  1     9.99999546E-01   # V_21
  2  2     9.53235322E-04   # V_22
#
BLOCK STOPMIX  # Stop Mixing Matrix
  1  1     9.99999999E-01   # cos(theta_t)
  1  2     4.47213589E-05   # sin(theta_t)
  2  1    -4.47213589E-05   # -sin(theta_t)
  2  2     9.99999999E-01   # cos(theta_t)
#
BLOCK SBOTMIX  # Sbottom Mixing Matrix
  1  1     6.92971969E-01   # cos(theta_b)
  1  2     7.20964528E-01   # sin(theta_b)
  2  1    -7.20964528E-01   # -sin(theta_b)
  2  2     6.92971969E-01   # cos(theta_b)
#
BLOCK STAUMIX  # Stau Mixing Matrix
  1  1     7.06147898E-01   # cos(theta_tau)
  1  2     7.08064366E-01   # sin(theta_tau)
  2  1    -7.08064366E-01   # -sin(theta_tau)
  2  2     7.06147898E-01   # cos(theta_tau)
#
BLOCK ALPHA  # Higgs mixing
          -5.90268883E-01   # Mixing angle in the neutral Higgs boson sector
#
BLOCK HMIX Q=  9.11876000E+01  # DRbar Higgs Parameters
         1     3.50000000E+03   # mu(Q)               
         2     1.49999982E+00   # tanbeta(Q)          
         3     2.54872876E+02   # vev(Q)              
         4    -6.83417832E+07   # MA^2(Q)             
#
BLOCK GAUGE Q=  9.11876000E+01  # The gauge couplings
     1     3.50606278E-01   # gprime(Q) DRbar
     2     6.20430146E-01   # g(Q) DRbar
     3     1.02657295E+00   # g3(Q) DRbar
#
BLOCK AU Q=  9.11876000E+01  # The trilinear couplings
  1  1     0.00000000E+00   # A_u(Q) DRbar
  2  2     0.00000000E+00   # A_c(Q) DRbar
  3  3     0.00000000E+00   # A_t(Q) DRbar
#
BLOCK AD Q=  9.11876000E+01  # The trilinear couplings
  1  1     0.00000000E+00   # A_d(Q) DRbar
  2  2     0.00000000E+00   # A_s(Q) DRbar
  3  3     0.00000000E+00   # A_b(Q) DRbar
#
BLOCK AE Q=  9.11876000E+01  # The trilinear couplings
  1  1     0.00000000E+00   # A_e(Q) DRbar
  2  2     0.00000000E+00   # A_mu(Q) DRbar
  3  3     0.00000000E+00   # A_tau(Q) DRbar
#
BLOCK Yu Q=  9.11876000E+01  # The Yukawa couplings
  1  1     0.00000000E+00   # y_u(Q) DRbar
  2  2     0.00000000E+00   # y_c(Q) DRbar
  3  3     9.83513205E-01   # y_t(Q) DRbar
#
BLOCK Yd Q=  9.11876000E+01  # The Yukawa couplings
  1  1     0.00000000E+00   # y_d(Q) DRbar
  2  2     0.00000000E+00   # y_s(Q) DRbar
  3  3     2.58357350E-02   # y_b(Q) DRbar
#
BLOCK Ye Q=  9.11876000E+01  # The Yukawa couplings
  1  1     0.00000000E+00   # y_e(Q) DRbar
  2  2     0.00000000E+00   # y_mu(Q) DRbar
  3  3     1.77391068E-02   # y_tau(Q) DRbar
#
BLOCK MSOFT Q=  9.11876000E+01  # The soft SUSY breaking masses at the scale Q
         1     1.10000000E+03   # M_1                 
         2     1.00000000E+05   # M_2                 
         3     1.00000000E+05   # M_3                 
        14     0.00000000E+00   # A_u                 
        15     0.00000000E+00   # A_d                 
        16     0.00000000E+00   # A_e                 
        21     6.33067185E+08   # M^2_Hd              
        22    -1.14681741E+09   # M^2_Hu              
        31     1.00000000E+05   # M_eL                
        32     1.00000000E+05   # M_muL               
        33     1.00000000E+05   # M_tauL              
        34     1.00000000E+05   # M_eR                
        35     1.00000000E+05   # M_muR               
        36     1.00000000E+05   # M_tauR              
        41     1.30000000E+03   # M_q1L               
        42     1.30000000E+03   # M_q2L               
        43     1.30000000E+03   # M_q3L               
        44     1.00000000E+05   # M_uR                
        45     1.00000000E+05   # M_cR                
        46     1.00000000E+05   # M_tR                
        47     1.30000000E+03   # M_dR                
        48     1.30000000E+03   # M_sR                
        49     1.30000000E+03   # M_bR                
#
#
#
#                             =================
#                             |The decay table|
#                             =================
#
# - The QCD corrections to the decays gluino -> squark  + quark
#                                     squark -> gaugino + quark_prime
#                                     squark -> squark_prime + Higgs
#                                     squark -> gluino  + quark
#   are included.
#
# - The multi-body decays for the inos, stops and sbottoms are included.
#
# - The loop induced decays for the gluino, neutralinos and stops
#   are included.
#
# - The SUSY decays of the top quark are included.
#
# - Possible decays of the NLSP in GMSB models are included.
#
#
#         PDG            Width
DECAY         6     1.32863694E+00   # top decays
#          BR         NDA      ID1       ID2
     1.00000000E+00    2           5        24   # BR(t ->  b    W+)
#
#         PDG            Width
DECAY   1000021     1.E-04   # gluino decays (OJ Mods)
#          BR         NDA      ID1       ID2
     2.32988579E-04    2     1000001        -1   # BR(~g -> ~d_L  db)
     2.32988579E-04    2    -1000001         1   # BR(~g -> ~d_L* d )
     2.32988629E-04    2     2000001        -1   # BR(~g -> ~d_R  db)
     2.32988629E-04    2    -2000001         1   # BR(~g -> ~d_R* d )
     2.32988691E-04    2     1000002        -2   # BR(~g -> ~u_L  ub)
     2.32988691E-04    2    -1000002         2   # BR(~g -> ~u_L* u )
     6.30214265E-19    2     2000002        -2   # BR(~g -> ~u_R  ub)
     6.30214265E-19    2    -2000002         2   # BR(~g -> ~u_R* u )
     2.32988579E-04    2     1000003        -3   # BR(~g -> ~s_L  sb)
     2.32988579E-04    2    -1000003         3   # BR(~g -> ~s_L* s )
     2.32988629E-04    2     2000003        -3   # BR(~g -> ~s_R  sb)
     2.32988629E-04    2    -2000003         3   # BR(~g -> ~s_R* s )
     2.32988691E-04    2     1000004        -4   # BR(~g -> ~c_L  cb)
     2.32988691E-04    2    -1000004         4   # BR(~g -> ~c_L* c )
     6.30214265E-19    2     2000004        -4   # BR(~g -> ~c_R  cb)
     6.30214265E-19    2    -2000004         4   # BR(~g -> ~c_R* c )
     2.47627720E-01    2     1000005        -5   # BR(~g -> ~b_1  bb)
     2.47627720E-01    2    -1000005         5   # BR(~g -> ~b_1* b )
     2.47485198E-01    2     2000005        -5   # BR(~g -> ~b_2  bb)
     2.47485198E-01    2    -2000005         5   # BR(~g -> ~b_2* b )
     2.29282955E-04    2     1000006        -6   # BR(~g -> ~t_1  tb)
     2.29282955E-04    2    -1000006         6   # BR(~g -> ~t_1* t )
     6.51973479E-03    2     1000039        21   # BR(~g -> ~G g)
#
#         PDG            Width
DECAY   1000006     1.19698738E-02   # stop1 decays
#          BR         NDA      ID1       ID2
     1.00000000E+00    2     1000022         6   # BR(~t_1 -> ~chi_10 t )
#
#         PDG            Width
DECAY   2000006     7.94500254E+05   # stop2 decays
#          BR         NDA      ID1       ID2
     2.62318695E-04    2     1000022         6   # BR(~t_2 -> ~chi_10 t )
     6.26654884E-04    2     1000023         6   # BR(~t_2 -> ~chi_20 t )
     6.26531508E-04    2     1000025         6   # BR(~t_2 -> ~chi_30 t )
     9.98506429E-01    2     1000024         5   # BR(~t_2 -> ~chi_1+ b )
    -1.71862842E-05    2     1000006        25   # BR(~t_2 -> ~t_1    h )
     1.79910645E-05    2     1000006        35   # BR(~t_2 -> ~t_1    H )
     1.79599829E-05    2     1000006        36   # BR(~t_2 -> ~t_1    A )
     1.69155571E-05    2     1000005        37   # BR(~t_2 -> ~b_1    H+)
     1.90043474E-05    2     2000005        37   # BR(~t_2 -> ~b_2    H+)
    -1.23040696E-05    2     1000006        23   # BR(~t_2 -> ~t_1    Z )
    -3.08849487E-05    2     1000005        24   # BR(~t_2 -> ~b_1    W+)
    -3.34292812E-05    2     2000005        24   # BR(~t_2 -> ~b_2    W+)
#
#         PDG            Width
DECAY   1000005     1.46201999E+01   # sbottom1 decays
#          BR         NDA      ID1       ID2
     1.00000000E+00    2     1000022         5   # BR(~b_1 -> ~chi_10 b )
#
#         PDG            Width
DECAY   2000005     1.55754933E+01   # sbottom2 decays
#          BR         NDA      ID1       ID2
     1.00000000E+00    2     1000022         5   # BR(~b_2 -> ~chi_10 b )
#
#         PDG            Width
DECAY   1000002     2.04311404E-02   # sup_L decays
#          BR         NDA      ID1       ID2
     1.00000000E+00    2     1000022         2   # BR(~u_L -> ~chi_10 u)
#
#         PDG            Width
DECAY   2000002     2.08386635E+02   # sup_R decays
#          BR         NDA      ID1       ID2
     9.99663816E-01    2     1000022         2   # BR(~u_R -> ~chi_10 u)
     3.62491731E-06    2     1000023         2   # BR(~u_R -> ~chi_20 u)
     3.32559557E-04    2     1000025         2   # BR(~u_R -> ~chi_30 u)
#
#         PDG            Width
DECAY   1000001     2.05830793E-02   # sdown_L decays
#          BR         NDA      ID1       ID2
     1.00000000E+00    2     1000022         1   # BR(~d_L -> ~chi_10 d)
#
#         PDG            Width
DECAY   2000001     8.20593390E-02   # sdown_R decays
#          BR         NDA      ID1       ID2
     1.00000000E+00    2     1000022         1   # BR(~d_R -> ~chi_10 d)
#
#         PDG            Width
DECAY   1000004     2.04311404E-02   # scharm_L decays
#          BR         NDA      ID1       ID2
     1.00000000E+00    2     1000022         4   # BR(~c_L -> ~chi_10 c)
#
#         PDG            Width
DECAY   2000004     2.08386635E+02   # scharm_R decays
#          BR         NDA      ID1       ID2
     9.99663816E-01    2     1000022         4   # BR(~c_R -> ~chi_10 c)
     3.62491731E-06    2     1000023         4   # BR(~c_R -> ~chi_20 c)
     3.32559557E-04    2     1000025         4   # BR(~c_R -> ~chi_30 c)
#
#         PDG            Width
DECAY   1000003     2.05830793E-02   # sstrange_L decays
#          BR         NDA      ID1       ID2
     1.00000000E+00    2     1000022         3   # BR(~s_L -> ~chi_10 s)
#
#         PDG            Width
DECAY   2000003     8.20593390E-02   # sstrange_R decays
#          BR         NDA      ID1       ID2
     1.00000000E+00    2     1000022         3   # BR(~s_R -> ~chi_10 s)
#
#         PDG            Width
DECAY   1000011     1.22246617E+02   # selectron_L decays
#          BR         NDA      ID1       ID2
     9.99608670E-01    2     1000022        11   # BR(~e_L -> ~chi_10 e-)
     2.68322733E-06    2     1000023        11   # BR(~e_L -> ~chi_20 e-)
     3.85977091E-04    2     1000025        11   # BR(~e_L -> ~chi_30 e-)
     2.66957453E-06    2    -1000024        12   # BR(~e_L -> ~chi_1- nu_e)
#
#         PDG            Width
DECAY   2000011     4.88983558E+02   # selectron_R decays
#          BR         NDA      ID1       ID2
     9.99664176E-01    2     1000022        11   # BR(~e_R -> ~chi_10 e-)
     3.62102668E-06    2     1000023        11   # BR(~e_R -> ~chi_20 e-)
     3.32202497E-04    2     1000025        11   # BR(~e_R -> ~chi_30 e-)
#
#         PDG            Width
DECAY   1000013     1.22246617E+02   # smuon_L decays
#          BR         NDA      ID1       ID2
     9.99608670E-01    2     1000022        13   # BR(~mu_L -> ~chi_10 mu-)
     2.68322733E-06    2     1000023        13   # BR(~mu_L -> ~chi_20 mu-)
     3.85977091E-04    2     1000025        13   # BR(~mu_L -> ~chi_30 mu-)
     2.66957453E-06    2    -1000024        14   # BR(~mu_L -> ~chi_1- nu_mu)
#
#         PDG            Width
DECAY   2000013     4.88983558E+02   # smuon_R decays
#          BR         NDA      ID1       ID2
     9.99664176E-01    2     1000022        13   # BR(~mu_R -> ~chi_10 mu-)
     3.62102668E-06    2     1000023        13   # BR(~mu_R -> ~chi_20 mu-)
     3.32202497E-04    2     1000025        13   # BR(~mu_R -> ~chi_30 mu-)
#
#         PDG            Width
DECAY   1000015     1.18199912E+04   # stau_1 decays
#          BR         NDA      ID1       ID2
     2.58993922E-02    2     1000022        15   # BR(~tau_1 -> ~chi_10  tau-)
     2.53719969E-05    2     1000023        15   # BR(~tau_1 -> ~chi_20  tau-)
     2.65045660E-05    2     1000025        15   # BR(~tau_1 -> ~chi_30  tau-)
     2.77100145E-05    2    -1000024        16   # BR(~tau_1 -> ~chi_1-  nu_tau)
     9.74021021E-01    2     1000039        15   # BR(~tau_1 -> ~G       tau-)
#
#         PDG            Width
DECAY   2000015     3.06032360E+02   # stau_2 decays
#          BR         NDA      ID1       ID2
     9.96259974E-01    2     1000022        15   # BR(~tau_2 -> ~chi_10  tau-)
     1.06746099E-03    2     1000023        15   # BR(~tau_2 -> ~chi_20  tau-)
     1.70113493E-03    2     1000025        15   # BR(~tau_2 -> ~chi_30  tau-)
     9.71430018E-04    2    -1000024        16   # BR(~tau_2 -> ~chi_1-  nu_tau)
#
#         PDG            Width
DECAY   1000012     1.22246678E+02   # snu_eL decays
#          BR         NDA      ID1       ID2
     9.99707167E-01    2     1000022        12   # BR(~nu_eL -> ~chi_10 nu_e)
     4.69905828E-06    2     1000023        12   # BR(~nu_eL -> ~chi_20 nu_e)
     2.82456181E-04    2     1000025        12   # BR(~nu_eL -> ~chi_30 nu_e)
     5.67824913E-06    2     1000024        11   # BR(~nu_eL -> ~chi_1+ e-)
#
#         PDG            Width
DECAY   1000014     1.22246678E+02   # snu_muL decays
#          BR         NDA      ID1       ID2
     9.99707167E-01    2     1000022        14   # BR(~nu_muL -> ~chi_10 nu_mu)
     4.69905828E-06    2     1000023        14   # BR(~nu_muL -> ~chi_20 nu_mu)
     2.82456181E-04    2     1000025        14   # BR(~nu_muL -> ~chi_30 nu_mu)
     5.67824913E-06    2     1000024        13   # BR(~nu_muL -> ~chi_1+ mu-)
#
#         PDG            Width
DECAY   1000016     1.22871173E+02   # snu_tauL decays
#          BR         NDA      ID1       ID2
     9.94626139E-01    2     1000022        16   # BR(~nu_tauL -> ~chi_10 nu_tau)
     4.67517524E-06    2     1000023        16   # BR(~nu_tauL -> ~chi_20 nu_tau)
     2.81020593E-04    2     1000025        16   # BR(~nu_tauL -> ~chi_30 nu_tau)
     5.08816527E-03    2     1000024        15   # BR(~nu_tauL -> ~chi_1+ tau-)
#
#         PDG            Width
DECAY   1000024     8.70664963E+01   # chargino1+ decays
#          BR         NDA      ID1       ID2
     3.66838582E-07    2     1000002        -1   # BR(~chi_1+ -> ~u_L     db)
     1.72391333E-07    2    -1000001         2   # BR(~chi_1+ -> ~d_L*    u )
     3.66838582E-07    2     1000004        -3   # BR(~chi_1+ -> ~c_L     sb)
     1.72391333E-07    2    -1000003         4   # BR(~chi_1+ -> ~s_L*    c )
     2.50090795E-01    2     1000006        -5   # BR(~chi_1+ -> ~t_1     bb)
     5.97726126E-02    2    -1000005         6   # BR(~chi_1+ -> ~b_1*    t )
     6.52417369E-01    2    -2000005         6   # BR(~chi_1+ -> ~b_2*    t )
     3.57402264E-02    2     1000022        24   # BR(~chi_1+ -> ~chi_10  W+)
     1.97377142E-03    2     1000022        37   # BR(~chi_1+ -> ~chi_10  H+)
     3.46513409E-06    2     1000039        24   # BR(~chi_1+ -> ~G       W+)
     6.81793584E-07    2     1000039        37   # BR(~chi_1+ -> ~G       H+)
#
#         PDG            Width
DECAY   1000037     4.82442675E+05   # chargino2+ decays
#          BR         NDA      ID1       ID2
     2.22926932E-03    2     1000002        -1   # BR(~chi_2+ -> ~u_L     db)
     2.22927010E-03    2    -1000001         2   # BR(~chi_2+ -> ~d_L*    u )
     2.22926932E-03    2     1000004        -3   # BR(~chi_2+ -> ~c_L     sb)
     2.22927010E-03    2    -1000003         4   # BR(~chi_2+ -> ~s_L*    c )
     9.62103869E-01    2     1000006        -5   # BR(~chi_2+ -> ~t_1     bb)
     4.82338002E-04    2    -1000005         6   # BR(~chi_2+ -> ~b_1*    t )
     2.12369390E-03    2    -2000005         6   # BR(~chi_2+ -> ~b_2*    t )
     1.64782865E-15    2     1000012       -11   # BR(~chi_2+ -> ~nu_eL   e+  )
     1.64782865E-15    2     1000014       -13   # BR(~chi_2+ -> ~nu_muL  mu+ )
     1.15376384E-15    2    -1000011        12   # BR(~chi_2+ -> ~e_L+    nu_e)
     1.15376384E-15    2    -1000013        14   # BR(~chi_2+ -> ~mu_L+   nu_mu)
     1.79001495E-15    2    -1000015        16   # BR(~chi_2+ -> ~tau_1+  nu_tau)
     3.04701921E-17    2    -2000015        16   # BR(~chi_2+ -> ~tau_2+  nu_tau)
     4.09252582E-04    2     1000024        23   # BR(~chi_2+ -> ~chi_1+  Z )
     1.11810117E-07    2     1000022        24   # BR(~chi_2+ -> ~chi_10  W+)
     3.97218812E-04    2     1000023        24   # BR(~chi_2+ -> ~chi_20  W+)
     3.97102725E-04    2     1000025        24   # BR(~chi_2+ -> ~chi_30  W+)
     4.12643201E-04    2     1000024        25   # BR(~chi_2+ -> ~chi_1+  h )
     3.62224114E-04    2     1000024        35   # BR(~chi_2+ -> ~chi_1+  H )
     3.62271447E-04    2     1000024        36   # BR(~chi_2+ -> ~chi_1+  A )
     1.32221872E-07    2     1000022        37   # BR(~chi_2+ -> ~chi_10  H+)
     3.62259167E-04    2     1000023        37   # BR(~chi_2+ -> ~chi_20  H+)
     3.62138153E-04    2     1000025        37   # BR(~chi_2+ -> ~chi_30  H+)
     2.33076597E-02    2     1000039        24   # BR(~chi_2+ -> ~G       W+)
     6.69393688E-09    2     1000039        37   # BR(~chi_2+ -> ~G       H+)
#
#         PDG            Width
DECAY   1000022     1.E-08   # neutralino1 decays (OJ Mods)
#          BR         NDA      ID1       ID2
     7.62858483E-01    2     1000039        22   # BR(~chi_10 -> ~G        gam)
     2.37140186E-01    2     1000039        23   # BR(~chi_10 -> ~G        Z)
     1.33131355E-06    2     1000039        25   # BR(~chi_10 -> ~G        h)
#
#         PDG            Width
DECAY   1000023     1.E-08   # neutralino2 decays (OJ Mods)
#          BR         NDA      ID1       ID2
     2.92058250E-02    2     1000022        23   # BR(~chi_20 -> ~chi_10   Z )
     3.12958074E-04    2     1000022        25   # BR(~chi_20 -> ~chi_10   h )
     1.20893259E-03    2     1000022        35   # BR(~chi_20 -> ~chi_10   H )
     4.76251121E-04    2     1000022        36   # BR(~chi_20 -> ~chi_10   A )
     8.13295230E-09    2     1000002        -2   # BR(~chi_20 -> ~u_L      ub)
     8.13295230E-09    2    -1000002         2   # BR(~chi_20 -> ~u_L*     u )
     4.81487559E-08    2     1000001        -1   # BR(~chi_20 -> ~d_L      db)
     4.81487559E-08    2    -1000001         1   # BR(~chi_20 -> ~d_L*     d )
     9.58651938E-08    2     2000001        -1   # BR(~chi_20 -> ~d_R      db)
     9.58651938E-08    2    -2000001         1   # BR(~chi_20 -> ~d_R*     d )
     8.13295230E-09    2     1000004        -4   # BR(~chi_20 -> ~c_L      cb)
     8.13295230E-09    2    -1000004         4   # BR(~chi_20 -> ~c_L*     c )
     4.81487559E-08    2     1000003        -3   # BR(~chi_20 -> ~s_L      sb)
     4.81487559E-08    2    -1000003         3   # BR(~chi_20 -> ~s_L*     s )
     9.58651938E-08    2     2000003        -3   # BR(~chi_20 -> ~s_R      sb)
     9.58651938E-08    2    -2000003         3   # BR(~chi_20 -> ~s_R*     s )
     2.85086875E-01    2     1000006        -6   # BR(~chi_20 -> ~t_1      tb)
     2.85086875E-01    2    -1000006         6   # BR(~chi_20 -> ~t_1*     t )
     9.66131152E-02    2     1000005        -5   # BR(~chi_20 -> ~b_1      bb)
     9.66131152E-02    2    -1000005         5   # BR(~chi_20 -> ~b_1*     b )
     1.02696089E-01    2     2000005        -5   # BR(~chi_20 -> ~b_2      bb)
     1.02696089E-01    2    -2000005         5   # BR(~chi_20 -> ~b_2*     b )
     1.39899681E-11    2     1000039        22   # BR(~chi_20 -> ~G        gam)
     1.06849050E-07    2     1000039        23   # BR(~chi_20 -> ~G        Z)
     2.66674979E-06    2     1000039        25   # BR(~chi_20 -> ~G        h)
     2.13712347E-08    2     1000039        35   # BR(~chi_20 -> ~G        H)
     5.50914224E-07    2     1000039        36   # BR(~chi_20 -> ~G        A)
#
#         PDG            Width
DECAY   1000025     1.09226501E+02   # neutralino3 decays
#          BR         NDA      ID1       ID2
     3.17380110E-04    2     1000022        23   # BR(~chi_30 -> ~chi_10   Z )
     2.92421169E-02    2     1000022        25   # BR(~chi_30 -> ~chi_10   h )
     4.59941127E-04    2     1000022        35   # BR(~chi_30 -> ~chi_10   H )
     1.21938537E-03    2     1000022        36   # BR(~chi_30 -> ~chi_10   A )
     3.32792828E-06    2     1000002        -2   # BR(~chi_30 -> ~u_L      ub)
     3.32792828E-06    2    -1000002         2   # BR(~chi_30 -> ~u_L*     u )
     1.28334798E-06    2     1000001        -1   # BR(~chi_30 -> ~d_L      db)
     1.28334798E-06    2    -1000001         1   # BR(~chi_30 -> ~d_L*     d )
     8.74389039E-06    2     2000001        -1   # BR(~chi_30 -> ~d_R      db)
     8.74389039E-06    2    -2000001         1   # BR(~chi_30 -> ~d_R*     d )
     3.32792828E-06    2     1000004        -4   # BR(~chi_30 -> ~c_L      cb)
     3.32792828E-06    2    -1000004         4   # BR(~chi_30 -> ~c_L*     c )
     1.28334798E-06    2     1000003        -3   # BR(~chi_30 -> ~s_L      sb)
     1.28334798E-06    2    -1000003         3   # BR(~chi_30 -> ~s_L*     s )
     8.74389039E-06    2     2000003        -3   # BR(~chi_30 -> ~s_R      sb)
     8.74389039E-06    2    -2000003         3   # BR(~chi_30 -> ~s_R*     s )
     2.83453726E-01    2     1000006        -6   # BR(~chi_30 -> ~t_1      tb)
     2.83453726E-01    2    -1000006         6   # BR(~chi_30 -> ~t_1*     t )
     7.83368831E-02    2     1000005        -5   # BR(~chi_30 -> ~b_1      bb)
     7.83368831E-02    2    -1000005         5   # BR(~chi_30 -> ~b_1*     b )
     1.22565086E-01    2     2000005        -5   # BR(~chi_30 -> ~b_2      bb)
     1.22565086E-01    2    -2000005         5   # BR(~chi_30 -> ~b_2*     b )
     1.46894341E-09    2     1000039        22   # BR(~chi_30 -> ~G        gam)
     2.65664064E-06    2     1000039        23   # BR(~chi_30 -> ~G        Z)
     1.03629122E-07    2     1000039        25   # BR(~chi_30 -> ~G        h)
     5.44635544E-07    2     1000039        35   # BR(~chi_30 -> ~G        H)
     2.19301048E-08    2     1000039        36   # BR(~chi_30 -> ~G        A)
#
#         PDG            Width
DECAY   1000035     4.82444752E+05   # neutralino4 decays
#          BR         NDA      ID1       ID2
     8.89931429E-10    2     1000022        23   # BR(~chi_40 -> ~chi_10   Z )
     3.95499378E-04    2     1000023        23   # BR(~chi_40 -> ~chi_20   Z )
     1.37509150E-05    2     1000025        23   # BR(~chi_40 -> ~chi_30   Z )
     3.97214644E-04    2     1000024       -24   # BR(~chi_40 -> ~chi_1+   W-)
     3.97214644E-04    2    -1000024        24   # BR(~chi_40 -> ~chi_1-   W+)
     1.15407662E-07    2     1000022        25   # BR(~chi_40 -> ~chi_10   h )
     1.15484916E-08    2     1000022        35   # BR(~chi_40 -> ~chi_10   H )
     1.20509147E-07    2     1000022        36   # BR(~chi_40 -> ~chi_10   A )
     1.35539716E-05    2     1000023        25   # BR(~chi_40 -> ~chi_20   h )
     3.46641208E-04    2     1000023        35   # BR(~chi_40 -> ~chi_20   H )
     1.59348585E-05    2     1000023        36   # BR(~chi_40 -> ~chi_20   A )
     3.98972509E-04    2     1000025        25   # BR(~chi_40 -> ~chi_30   h )
     1.55693873E-05    2     1000025        35   # BR(~chi_40 -> ~chi_30   H )
     3.46214550E-04    2     1000025        36   # BR(~chi_40 -> ~chi_30   A )
     3.62263474E-04    2     1000024       -37   # BR(~chi_40 -> ~chi_1+   H-)
     3.62263474E-04    2    -1000024        37   # BR(~chi_40 -> ~chi_1-   H+)
     1.06690019E-03    2     1000002        -2   # BR(~chi_40 -> ~u_L      ub)
     1.06690019E-03    2    -1000002         2   # BR(~chi_40 -> ~u_L*     u )
     1.73185451E-23    2     2000002        -2   # BR(~chi_40 -> ~u_R      ub)
     1.73185451E-23    2    -2000002         2   # BR(~chi_40 -> ~u_R*     u )
     1.06690076E-03    2     1000001        -1   # BR(~chi_40 -> ~d_L      db)
     1.06690076E-03    2    -1000001         1   # BR(~chi_40 -> ~d_L*     d )
     2.06387789E-17    2     2000001        -1   # BR(~chi_40 -> ~d_R      db)
     2.06387789E-17    2    -2000001         1   # BR(~chi_40 -> ~d_R*     d )
     1.06690019E-03    2     1000004        -4   # BR(~chi_40 -> ~c_L      cb)
     1.06690019E-03    2    -1000004         4   # BR(~chi_40 -> ~c_L*     c )
     1.73185451E-23    2     2000004        -4   # BR(~chi_40 -> ~c_R      cb)
     1.73185451E-23    2    -2000004         4   # BR(~chi_40 -> ~c_R*     c )
     1.06690076E-03    2     1000003        -3   # BR(~chi_40 -> ~s_L      sb)
     1.06690076E-03    2    -1000003         3   # BR(~chi_40 -> ~s_L*     s )
     2.06387789E-17    2     2000003        -3   # BR(~chi_40 -> ~s_R      sb)
     2.06387789E-17    2    -2000003         3   # BR(~chi_40 -> ~s_R*     s )
     1.30301324E-03    2     1000006        -6   # BR(~chi_40 -> ~t_1      tb)
     1.30301324E-03    2    -1000006         6   # BR(~chi_40 -> ~t_1*     t )
     2.30609108E-01    2     1000005        -5   # BR(~chi_40 -> ~b_1      bb)
     2.30609108E-01    2    -1000005         5   # BR(~chi_40 -> ~b_1*     b )
     2.50442904E-01    2     2000005        -5   # BR(~chi_40 -> ~b_2      bb)
     2.50442904E-01    2    -2000005         5   # BR(~chi_40 -> ~b_2*     b )
     5.76879113E-16    2     1000011       -11   # BR(~chi_40 -> ~e_L-     e+)
     5.76879113E-16    2    -1000011        11   # BR(~chi_40 -> ~e_L+     e-)
     1.00435579E-28    2     2000011       -11   # BR(~chi_40 -> ~e_R-     e+)
     1.00435579E-28    2    -2000011        11   # BR(~chi_40 -> ~e_R+     e-)
     5.76879113E-16    2     1000013       -13   # BR(~chi_40 -> ~mu_L-    mu+)
     5.76879113E-16    2    -1000013        13   # BR(~chi_40 -> ~mu_L+    mu-)
     1.00435579E-28    2     2000013       -13   # BR(~chi_40 -> ~mu_R-    mu+)
     1.00435579E-28    2    -2000013        13   # BR(~chi_40 -> ~mu_R+    mu-)
     8.23911401E-16    2     1000012       -12   # BR(~chi_40 -> ~nu_eL    nu_eb)
     8.23911401E-16    2    -1000012        12   # BR(~chi_40 -> ~nu_eL*   nu_e )
     8.23911401E-16    2     1000014       -14   # BR(~chi_40 -> ~nu_muL   nu_mub)
     8.23911401E-16    2    -1000014        14   # BR(~chi_40 -> ~nu_muL*  nu_mu )
     8.23911401E-16    2     1000016       -16   # BR(~chi_40 -> ~nu_tau1  nu_taub)
     8.23911401E-16    2    -1000016        16   # BR(~chi_40 -> ~nu_tau1* nu_tau )
     5.64149223E-03    2     1000039        22   # BR(~chi_40 -> ~G        gam)
     1.76660679E-02    2     1000039        23   # BR(~chi_40 -> ~G        Z)
     1.06815908E-09    2     1000039        25   # BR(~chi_40 -> ~G        h)
     6.70495187E-09    2     1000039        35   # BR(~chi_40 -> ~G        H)
     1.32129159E-12    2     1000039        36   # BR(~chi_40 -> ~G        A)
#
#
#
#
