#
#                              ======================
#                              | THE SUSYHIT OUTPUT |
#                              ======================
#
#
#              ------------------------------------------------------
#              |     This is the output of the SUSY-HIT package     |
#              |  created by A.Djouadi, M.Muehlleitner and M.Spira. |
#              |  In case of problems with SUSY-HIT email to        |
#              |           margarete.muehlleitner@cern.ch           |
#              |           michael.spira@psi.ch                     |
#              |           abdelhak.djouadi@cern.ch                 |
#              ------------------------------------------------------
#
#              ------------------------------------------------------
#              |  SUSY Les Houches Accord - MSSM Spectrum + Decays  |
#              |              based on the decay programs           |
#              |                                                    |
#              |                     SDECAY 1.3b                    |
#              |                                                    |
#              |  Authors: M.Muhlleitner, A.Djouadi and Y.Mambrini  |
#              |  Ref.:    Comput.Phys.Commun.168(2005)46           |
#              |           [hep-ph/0311167]                         |
#              |                                                    |
#              |                     HDECAY 3.4                     |
#              |                                                    |
#              |  By: A.Djouadi,J.Kalinowski,M.Muhlleitner,M.Spira  |
#              |  Ref.:    Comput.Phys.Commun.108(1998)56           |
#              |           [hep-ph/9704448]                         |
#              |                                                    |
#              |                                                    |
#              |  If not stated otherwise all DRbar couplings and   |
#              |  soft SUSY breaking masses are given at the scale  |
#              |  Q=  0.50007643E+04
#              |                                                    |
#              ------------------------------------------------------
#
#
BLOCK DCINFO  # Decay Program information
     1   SDECAY/HDECAY # decay calculator
     2   1.3b  /3.4    # version number
#
BLOCK SPINFO  # Spectrum calculator information
     1    SOFTSUSY    # spectrum calculator                
     2    3.4.0       # version number                     
#
BLOCK MODSEL  # Model selection
     1     0   #  nonUniversal                                     
#
BLOCK SMINPUTS  # Standard Model inputs
         1     1.25778332E+02   # alpha_em^-1(M_Z)^MSbar
         2     1.16570000E-05   # G_F [GeV^-2]
         3     1.17200002E-01   # alpha_S(M_Z)^MSbar
         4     9.11876000E+01   # M_Z pole mass
         5     4.25000000E+00   # mb(mb)^MSbar
         6     1.72500000E+02   # mt pole mass
         7     1.77682000E+00   # mtau pole mass
#
BLOCK MINPAR  # Input parameters - minimal models
         3     1.00000000E+01   # tanb                
#
BLOCK EXTPAR  # Input parameters - non-minimal models
         0    -1.00000000E+00   # Set                 
         1     6.00000000E+01   # M_1(MX)             
         2     3.00000000E+03   # M_2(MX)             
         3     1.03377000E+03   # M_3(MX)             
        11     5.00000000E+03   # At(MX)              
        12     5.00000000E+03   # Ab(MX)              
        13     0.00000000E+00   # Atau(MX)            
        23    -1.87328000E+02   # mu(MX)              
        26     3.00000000E+03   # mA(pole)            
        31     5.00000000E+03   # meL(MX)             
        32     5.00000000E+03   # mmuL(MX)            
        33     5.00000000E+03   # mtauL(MX)           
        34     5.00000000E+03   # meR(MX)             
        35     5.00000000E+03   # mmuR(MX)            
        36     5.00000000E+03   # mtauR(MX)           
        41     5.00000000E+03   # mqL1(MX)            
        42     5.00000000E+03   # mqL2(MX)            
        43     5.00000000E+03   # mqL3(MX)            
        44     5.00000000E+03   # muR(MX)             
        45     5.00000000E+03   # mcR(MX)             
        46     5.00000000E+03   # mtR(MX)             
        47     5.00000000E+03   # mdR(MX)             
        48     5.00000000E+03   # msR(MX)             
        49     5.00000000E+03   # mbR(MX)             
#
BLOCK MASS  # Mass Spectrum
# PDG code           mass       particle
        24     8.00891662E+01   # W+
        25     1.24503843E+02   # h
        35     3.00009059E+03   # H
        36     2.99999978E+03   # A
        37     3.00148225E+03   # H+
         5     4.87878001E+00   # b-quark pole mass calculated from mb(mb)_Msbar
   1000001     5.06537719E+03   # ~d_L
   2000001     5.04745137E+03   # ~d_R
   1000002     5.06489894E+03   # ~u_L
   2000002     5.04713995E+03   # ~u_R
   1000003     5.06537719E+03   # ~s_L
   2000003     5.04745137E+03   # ~s_R
   1000004     5.06489894E+03   # ~c_L
   2000004     5.04713995E+03   # ~c_R
   1000005     5.01178769E+03   # ~b_1
   2000005     5.04556071E+03   # ~b_2
   1000006     4.90241508E+03   # ~t_1
   2000006     5.05597323E+03   # ~t_2
   1000011     5.01916630E+03   # ~e_L
   2000011     5.00596079E+03   # ~e_R
   1000012     5.01821316E+03   # ~nu_eL
   1000013     5.01916630E+03   # ~mu_L
   2000013     5.00596079E+03   # ~mu_R
   1000014     5.01821316E+03   # ~nu_muL
   1000015     5.00483312E+03   # ~tau_1
   2000015     5.01863154E+03   # ~tau_2
   1000016     5.01765809E+03   # ~nu_tauL
   1000021     1.30000049E+03   # ~g
   1000022     5.87052042E+01   # ~chi_10
   1000023     2.04233438E+02   # ~chi_20
   1000025    -2.05086064E+02   # ~chi_30
   1000035     3.07431863E+03   # ~chi_40
   1000024     2.00000817E+02   # ~chi_1+
   1000037     3.07448683E+03   # ~chi_2+
#
BLOCK NMIX  # Neutralino Mixing Matrix
  1  1     9.72105597E-01   # N_11
  1  2    -5.01613741E-04   # N_12
  1  3    -2.30117428E-01   # N_13
  1  4    -4.53478392E-02   # N_14
  2  1     1.94570186E-01   # N_21
  2  2     1.71167076E-02   # N_22
  2  3     6.83254333E-01   # N_23
  2  4     7.03571586E-01   # N_24
  3  1    -1.30969403E-01   # N_31
  3  2     1.85862065E-02   # N_32
  3  3    -6.92970664E-01   # N_33
  3  4     7.08726483E-01   # N_34
  4  1    -4.08685625E-04   # N_41
  4  2     9.99680609E-01   # N_42
  4  3     1.06954277E-03   # N_43
  4  4    -2.52461764E-02   # N_44
#
BLOCK UMIX  # Chargino Mixing Matrix U
  1  1    -1.50861501E-03   # U_11
  1  2     9.99998862E-01   # U_12
  2  1    -9.99998862E-01   # U_21
  2  2    -1.50861501E-03   # U_22
#
BLOCK VMIX  # Chargino Mixing Matrix V
  1  1     3.57132524E-02   # V_11
  1  2    -9.99362078E-01   # V_12
  2  1    -9.99362078E-01   # V_21
  2  2    -3.57132524E-02   # V_22
#
BLOCK STOPMIX  # Stop Mixing Matrix
  1  1    -5.04918440E-01   # cos(theta_t)
  1  2     8.63167057E-01   # sin(theta_t)
  2  1    -8.63167057E-01   # -sin(theta_t)
  2  2    -5.04918440E-01   # cos(theta_t)
#
BLOCK SBOTMIX  # Sbottom Mixing Matrix
  1  1     9.99380065E-01   # cos(theta_b)
  1  2    -3.52063301E-02   # sin(theta_b)
  2  1     3.52063301E-02   # -sin(theta_b)
  2  2     9.99380065E-01   # cos(theta_b)
#
BLOCK STAUMIX  # Stau Mixing Matrix
  1  1    -2.21900694E-02   # cos(theta_tau)
  1  2     9.99753770E-01   # sin(theta_tau)
  2  1    -9.99753770E-01   # -sin(theta_tau)
  2  2    -2.21900694E-02   # cos(theta_tau)
#
BLOCK ALPHA  # Higgs mixing
          -1.05464627E-01   # Mixing angle in the neutral Higgs boson sector
#
BLOCK HMIX Q=  5.00076428E+03  # DRbar Higgs Parameters
         1    -1.90682905E+02   # mu(Q)MSSM           
         2     9.47140186E+00   # tan                 
         3     2.41702786E+02   # higgs               
         4     8.78894769E+06   # mA^2(Q)MSSM         
#
BLOCK GAUGE Q=  5.00076428E+03  # The gauge couplings
     1     3.71172633E-01   # gprime(Q) DRbar
     2     6.34394408E-01   # g(Q) DRbar
     3     1.00480431E+00   # g3(Q) DRbar
#
BLOCK AU Q=  5.00076428E+03  # The trilinear couplings
  1  1     5.00000001E+03   # A_u(Q) DRbar
  2  2     5.00000001E+03   # A_c(Q) DRbar
  3  3     5.00000001E+03   # A_t(Q) DRbar
#
BLOCK AD Q=  5.00076428E+03  # The trilinear couplings
  1  1     5.00000000E+03   # A_d(Q) DRbar
  2  2     5.00000000E+03   # A_s(Q) DRbar
  3  3     5.00000001E+03   # A_b(Q) DRbar
#
BLOCK AE Q=  5.00076428E+03  # The trilinear couplings
  1  1     0.00000000E+00   # A_e(Q) DRbar
  2  2     6.40140433E-08   # A_mu(Q) DRbar
  3  3     6.32118018E-08   # A_tau(Q) DRbar
#
BLOCK Yu Q=  5.00076428E+03  # The Yukawa couplings
  1  1     0.00000000E+00   # y_u(Q) DRbar
  2  2     0.00000000E+00   # y_c(Q) DRbar
  3  3     8.17177118E-01   # y_t(Q) DRbar
#
BLOCK Yd Q=  5.00076428E+03  # The Yukawa couplings
  1  1     0.00000000E+00   # y_d(Q) DRbar
  2  2     0.00000000E+00   # y_s(Q) DRbar
  3  3     1.29250209E-01   # y_b(Q) DRbar
#
BLOCK Ye Q=  5.00076428E+03  # The Yukawa couplings
  1  1     0.00000000E+00   # y_e(Q) DRbar
  2  2     0.00000000E+00   # y_mu(Q) DRbar
  3  3     9.73632464E-02   # y_tau(Q) DRbar
#
BLOCK MSOFT Q=  5.00076428E+03  # The soft SUSY breaking masses at the scale Q
         1     6.00000000E+01   # M_1(Q)              
         2     3.00000000E+03   # M_2(Q)              
         3     1.03377000E+03   # M_3(Q)              
        21     8.69764111E+06   # mH1^2(Q)            
        22     5.40157744E+05   # mH2^2(Q)            
        31     5.00000000E+03   # meL(Q)              
        32     5.00000000E+03   # mmuL(Q)             
        33     5.00000000E+03   # mtauL(Q)            
        34     5.00000000E+03   # meR(Q)              
        35     5.00000000E+03   # mmuR(Q)             
        36     5.00000000E+03   # mtauR(Q)            
        41     5.00000000E+03   # mqL1(Q)             
        42     5.00000000E+03   # mqL2(Q)             
        43     5.00000000E+03   # mqL3(Q)             
        44     5.00000000E+03   # muR(Q)              
        45     5.00000000E+03   # mcR(Q)              
        46     5.00000000E+03   # mtR(Q)              
        47     5.00000000E+03   # mdR(Q)              
        48     5.00000000E+03   # msR(Q)              
        49     5.00000000E+03   # mbR(Q)              
#
#
#
#                             =================
#                             |The decay table|
#                             =================
#
# - The QCD corrections to the decays gluino -> squark  + quark
#                                     squark -> gaugino + quark_prime
#                                     squark -> squark_prime + Higgs
#                                     squark -> gluino  + quark
#   are included.
#
# - The multi-body decays for the inos, stops and sbottoms are included.
#
# - The loop induced decays for the gluino, neutralinos and stops
#   are included.
#
# - The SUSY decays of the top quark are included.
#
#
#         PDG            Width
DECAY         6     1.41059981E+00   # top decays
#          BR         NDA      ID1       ID2
     1.00000000E+00    2           5        24   # BR(t ->  b    W+)
#
#         PDG            Width
DECAY   1000021     2.27254510E-04   # gluino decays
#          BR         NDA      ID1       ID2
     6.25888780E-05    2     1000022        21   # BR(~g -> ~chi_10 g)
     1.68533151E-02    2     1000023        21   # BR(~g -> ~chi_20 g)
     1.64479276E-02    2     1000025        21   # BR(~g -> ~chi_30 g)
#           BR         NDA      ID1       ID2       ID3
     1.08582646E-02    3     1000022         1        -1   # BR(~g -> ~chi_10 d  db)
     3.63374535E-04    3     1000023         1        -1   # BR(~g -> ~chi_20 d  db)
     1.61134377E-04    3     1000025         1        -1   # BR(~g -> ~chi_30 d  db)
     3.69532953E-02    3     1000022         2        -2   # BR(~g -> ~chi_10 u  ub)
     1.52894578E-03    3     1000023         2        -2   # BR(~g -> ~chi_20 u  ub)
     3.73206981E-04    3     1000025         2        -2   # BR(~g -> ~chi_30 u  ub)
     1.08582646E-02    3     1000022         3        -3   # BR(~g -> ~chi_10 s  sb)
     3.63374535E-04    3     1000023         3        -3   # BR(~g -> ~chi_20 s  sb)
     1.61134377E-04    3     1000025         3        -3   # BR(~g -> ~chi_30 s  sb)
     3.69532953E-02    3     1000022         4        -4   # BR(~g -> ~chi_10 c  cb)
     1.52894578E-03    3     1000023         4        -4   # BR(~g -> ~chi_20 c  cb)
     3.73206981E-04    3     1000025         4        -4   # BR(~g -> ~chi_30 c  cb)
     1.18207331E-02    3     1000022         5        -5   # BR(~g -> ~chi_10 b  bb)
     5.88487852E-03    3     1000023         5        -5   # BR(~g -> ~chi_20 b  bb)
     5.84701032E-03    3     1000025         5        -5   # BR(~g -> ~chi_30 b  bb)
     2.74166288E-02    3     1000022         6        -6   # BR(~g -> ~chi_10 t  tb)
     2.01307275E-01    3     1000023         6        -6   # BR(~g -> ~chi_20 t  tb)
     1.72619831E-01    3     1000025         6        -6   # BR(~g -> ~chi_30 t  tb)
     5.86756455E-05    3     1000024         1        -2   # BR(~g -> ~chi_1+ d  ub)
     5.86756455E-05    3    -1000024         2        -1   # BR(~g -> ~chi_1- u  db)
     5.86756455E-05    3     1000024         3        -4   # BR(~g -> ~chi_1+ s  cb)
     5.86756455E-05    3    -1000024         4        -3   # BR(~g -> ~chi_1- c  sb)
     2.20514333E-01    3     1000024         5        -6   # BR(~g -> ~chi_1+ b  tb)
     2.20514333E-01    3    -1000024         6        -5   # BR(~g -> ~chi_1- t  bb)
#
#         PDG            Width
DECAY   1000006     4.06238652E+02   # stop1 decays
#          BR         NDA      ID1       ID2
     1.89805829E-02    2     1000022         6   # BR(~t_1 -> ~chi_10 t )
     8.59500337E-02    2     1000023         6   # BR(~t_1 -> ~chi_20 t )
     7.60882650E-02    2     1000025         6   # BR(~t_1 -> ~chi_30 t )
     5.06847504E-03    2     1000035         6   # BR(~t_1 -> ~chi_40 t )
     1.18177481E-01    2     1000024         5   # BR(~t_1 -> ~chi_1+ b )
     1.01046816E-02    2     1000037         5   # BR(~t_1 -> ~chi_2+ b )
     6.85630481E-01    2     1000021         6   # BR(~t_1 -> ~g      t )
#
#         PDG            Width
DECAY   2000006     4.06021741E+02   # stop2 decays
#          BR         NDA      ID1       ID2
     1.06058540E-02    2     1000022         6   # BR(~t_2 -> ~chi_10 t )
     7.73575020E-02    2     1000023         6   # BR(~t_2 -> ~chi_20 t )
     8.91782287E-02    2     1000025         6   # BR(~t_2 -> ~chi_30 t )
     1.37212599E-02    2     1000035         6   # BR(~t_2 -> ~chi_40 t )
     4.88294033E-02    2     1000024         5   # BR(~t_2 -> ~chi_1+ b )
     2.73256199E-02    2     1000037         5   # BR(~t_2 -> ~chi_2+ b )
     7.29952289E-01    2     1000021         6   # BR(~t_2 -> ~g      t )
     6.96540908E-04    2     1000006        25   # BR(~t_2 -> ~t_1    h )
     2.33330282E-03    2     1000006        23   # BR(~t_2 -> ~t_1    Z )
#
#         PDG            Width
DECAY   1000005     3.82858530E+02   # sbottom1 decays
#          BR         NDA      ID1       ID2
     2.20958853E-03    2     1000022         5   # BR(~b_1 -> ~chi_10 b )
     2.00116780E-03    2     1000023         5   # BR(~b_1 -> ~chi_20 b )
     2.13632585E-03    2     1000025         5   # BR(~b_1 -> ~chi_30 b )
     1.98115863E-02    2     1000035         5   # BR(~b_1 -> ~chi_40 b )
     1.74587046E-01    2    -1000024         6   # BR(~b_1 -> ~chi_1- t )
     3.97709693E-02    2    -1000037         6   # BR(~b_1 -> ~chi_2- t )
     7.58018035E-01    2     1000021         5   # BR(~b_1 -> ~g      b )
     1.46528154E-03    2     1000006       -24   # BR(~b_1 -> ~t_1    W-)
#
#         PDG            Width
DECAY   2000005     2.98923981E+02   # sbottom2 decays
#          BR         NDA      ID1       ID2
     9.55370821E-03    2     1000022         5   # BR(~b_2 -> ~chi_10 b )
     3.09989517E-03    2     1000023         5   # BR(~b_2 -> ~chi_20 b )
     2.96958122E-03    2     1000025         5   # BR(~b_2 -> ~chi_30 b )
     2.89894918E-05    2     1000035         5   # BR(~b_2 -> ~chi_40 b )
     5.90068324E-03    2    -1000024         6   # BR(~b_2 -> ~chi_1- t )
     5.82107699E-05    2    -1000037         6   # BR(~b_2 -> ~chi_2- t )
     9.78379616E-01    2     1000021         5   # BR(~b_2 -> ~g      b )
     9.31612902E-06    2     1000006       -24   # BR(~b_2 -> ~t_1    W-)
#
#         PDG            Width
DECAY   1000002     3.18202487E+02   # sup_L decays
#          BR         NDA      ID1       ID2
     2.21193805E-03    2     1000022         2   # BR(~u_L -> ~chi_10 u)
     1.87050811E-04    2     1000023         2   # BR(~u_L -> ~chi_20 u)
     2.98534287E-06    2     1000025         2   # BR(~u_L -> ~chi_30 u)
     2.47156874E-02    2     1000035         2   # BR(~u_L -> ~chi_40 u)
     1.57391598E-04    2     1000024         1   # BR(~u_L -> ~chi_1+ d)
     4.94014849E-02    2     1000037         1   # BR(~u_L -> ~chi_2+ d)
     9.23323462E-01    2     1000021         2   # BR(~u_L -> ~g      u)
#
#         PDG            Width
DECAY   2000002     3.04418927E+02   # sup_R decays
#          BR         NDA      ID1       ID2
     3.70589521E-02    2     1000022         2   # BR(~u_R -> ~chi_10 u)
     1.48043883E-03    2     1000023         2   # BR(~u_R -> ~chi_20 u)
     6.70758301E-04    2     1000025         2   # BR(~u_R -> ~chi_30 u)
     2.59751635E-09    2     1000035         2   # BR(~u_R -> ~chi_40 u)
     9.60789848E-01    2     1000021         2   # BR(~u_R -> ~g      u)
#
#         PDG            Width
DECAY   1000001     3.18211844E+02   # sdown_L decays
#          BR         NDA      ID1       ID2
     2.23561837E-03    2     1000022         1   # BR(~d_L -> ~chi_10 d)
     2.67691720E-05    2     1000023         1   # BR(~d_L -> ~chi_20 d)
     1.20142978E-04    2     1000025         1   # BR(~d_L -> ~chi_30 d)
     2.47305919E-02    2     1000035         1   # BR(~d_L -> ~chi_40 d)
     2.80871866E-07    2    -1000024         2   # BR(~d_L -> ~chi_1- u)
     4.94785099E-02    2    -1000037         2   # BR(~d_L -> ~chi_2- u)
     9.23408087E-01    2     1000021         1   # BR(~d_L -> ~g      d)
#
#         PDG            Width
DECAY   2000001     2.95490054E+02   # sdown_R decays
#          BR         NDA      ID1       ID2
     9.54528401E-03    2     1000022         1   # BR(~d_R -> ~chi_10 d)
     3.81317150E-04    2     1000023         1   # BR(~d_R -> ~chi_20 d)
     1.72767452E-04    2     1000025         1   # BR(~d_R -> ~chi_30 d)
     6.69139552E-10    2     1000035         1   # BR(~d_R -> ~chi_40 d)
     9.89900631E-01    2     1000021         1   # BR(~d_R -> ~g      d)
#
#         PDG            Width
DECAY   1000004     3.18202487E+02   # scharm_L decays
#          BR         NDA      ID1       ID2
     2.21193805E-03    2     1000022         4   # BR(~c_L -> ~chi_10 c)
     1.87050811E-04    2     1000023         4   # BR(~c_L -> ~chi_20 c)
     2.98534287E-06    2     1000025         4   # BR(~c_L -> ~chi_30 c)
     2.47156874E-02    2     1000035         4   # BR(~c_L -> ~chi_40 c)
     1.57391598E-04    2     1000024         3   # BR(~c_L -> ~chi_1+ s)
     4.94014849E-02    2     1000037         3   # BR(~c_L -> ~chi_2+ s)
     9.23323462E-01    2     1000021         4   # BR(~c_L -> ~g      c)
#
#         PDG            Width
DECAY   2000004     3.04418927E+02   # scharm_R decays
#          BR         NDA      ID1       ID2
     3.70589521E-02    2     1000022         4   # BR(~c_R -> ~chi_10 c)
     1.48043883E-03    2     1000023         4   # BR(~c_R -> ~chi_20 c)
     6.70758301E-04    2     1000025         4   # BR(~c_R -> ~chi_30 c)
     2.59751635E-09    2     1000035         4   # BR(~c_R -> ~chi_40 c)
     9.60789848E-01    2     1000021         4   # BR(~c_R -> ~g      c)
#
#         PDG            Width
DECAY   1000003     3.18211844E+02   # sstrange_L decays
#          BR         NDA      ID1       ID2
     2.23561837E-03    2     1000022         3   # BR(~s_L -> ~chi_10 s)
     2.67691720E-05    2     1000023         3   # BR(~s_L -> ~chi_20 s)
     1.20142978E-04    2     1000025         3   # BR(~s_L -> ~chi_30 s)
     2.47305919E-02    2     1000035         3   # BR(~s_L -> ~chi_40 s)
     2.80871866E-07    2    -1000024         4   # BR(~s_L -> ~chi_1- c)
     4.94785099E-02    2    -1000037         4   # BR(~s_L -> ~chi_2- c)
     9.23408087E-01    2     1000021         3   # BR(~s_L -> ~g      s)
#
#         PDG            Width
DECAY   2000003     2.95490054E+02   # sstrange_R decays
#          BR         NDA      ID1       ID2
     9.54528401E-03    2     1000022         3   # BR(~s_R -> ~chi_10 s)
     3.81317150E-04    2     1000023         3   # BR(~s_R -> ~chi_20 s)
     1.72767452E-04    2     1000025         3   # BR(~s_R -> ~chi_30 s)
     6.69139552E-10    2     1000035         3   # BR(~s_R -> ~chi_40 s)
     9.89900631E-01    2     1000021         3   # BR(~s_R -> ~g      s)
#
#         PDG            Width
DECAY   1000011     3.04204317E+01   # selectron_L decays
#          BR         NDA      ID1       ID2
     2.13235707E-01    2     1000022        11   # BR(~e_L -> ~chi_10 e-)
     1.12900988E-02    2     1000023        11   # BR(~e_L -> ~chi_20 e-)
     2.21774984E-03    2     1000025        11   # BR(~e_L -> ~chi_30 e-)
     2.57582155E-01    2     1000035        11   # BR(~e_L -> ~chi_40 e-)
     2.99703381E-06    2    -1000024        12   # BR(~e_L -> ~chi_1- nu_e)
     5.15671292E-01    2    -1000037        12   # BR(~e_L -> ~chi_2- nu_e)
#
#         PDG            Width
DECAY   2000011     2.74288025E+01   # selectron_R decays
#          BR         NDA      ID1       ID2
     9.45148522E-01    2     1000022        11   # BR(~e_R -> ~chi_10 e-)
     3.77483755E-02    2     1000023        11   # BR(~e_R -> ~chi_20 e-)
     1.71030379E-02    2     1000025        11   # BR(~e_R -> ~chi_30 e-)
     6.48227859E-08    2     1000035        11   # BR(~e_R -> ~chi_40 e-)
#
#         PDG            Width
DECAY   1000013     3.04204317E+01   # smuon_L decays
#          BR         NDA      ID1       ID2
     2.13235707E-01    2     1000022        13   # BR(~mu_L -> ~chi_10 mu-)
     1.12900988E-02    2     1000023        13   # BR(~mu_L -> ~chi_20 mu-)
     2.21774984E-03    2     1000025        13   # BR(~mu_L -> ~chi_30 mu-)
     2.57582155E-01    2     1000035        13   # BR(~mu_L -> ~chi_40 mu-)
     2.99703381E-06    2    -1000024        14   # BR(~mu_L -> ~chi_1- nu_mu)
     5.15671292E-01    2    -1000037        14   # BR(~mu_L -> ~chi_2- nu_mu)
#
#         PDG            Width
DECAY   2000013     2.74288025E+01   # smuon_R decays
#          BR         NDA      ID1       ID2
     9.45148522E-01    2     1000022        13   # BR(~mu_R -> ~chi_10 mu-)
     3.77483755E-02    2     1000023        13   # BR(~mu_R -> ~chi_20 mu-)
     1.71030379E-02    2     1000025        13   # BR(~mu_R -> ~chi_30 mu-)
     6.48227859E-08    2     1000035        13   # BR(~mu_R -> ~chi_40 mu-)
#
#         PDG            Width
DECAY   1000015     2.93049190E+01   # stau_1 decays
#          BR         NDA      ID1       ID2
     8.86681032E-01    2     1000022        15   # BR(~tau_1 -> ~chi_10  tau-)
     4.98630512E-02    2     1000023        15   # BR(~tau_1 -> ~chi_20  tau-)
     3.09804874E-02    2     1000025        15   # BR(~tau_1 -> ~chi_30  tau-)
     1.33191427E-04    2     1000035        15   # BR(~tau_1 -> ~chi_40  tau-)
     3.20757425E-02    2    -1000024        16   # BR(~tau_1 -> ~chi_1-  nu_tau)
     2.66495393E-04    2    -1000037        16   # BR(~tau_1 -> ~chi_2-  nu_tau)
#
#         PDG            Width
DECAY   2000015     3.13539761E+01   # stau_2 decays
#          BR         NDA      ID1       ID2
     2.07960713E-01    2     1000022        15   # BR(~tau_2 -> ~chi_10  tau-)
     2.54163778E-02    2     1000023        15   # BR(~tau_2 -> ~chi_20  tau-)
     1.70107348E-02    2     1000025        15   # BR(~tau_2 -> ~chi_30  tau-)
     2.49696576E-01    2     1000035        15   # BR(~tau_2 -> ~chi_40  tau-)
     3.08463613E-05    2    -1000024        16   # BR(~tau_2 -> ~chi_1-  nu_tau)
     4.99884751E-01    2    -1000037        16   # BR(~tau_2 -> ~chi_2-  nu_tau)
#
#         PDG            Width
DECAY   1000012     3.04233736E+01   # snu_eL decays
#          BR         NDA      ID1       ID2
     2.13927933E-01    2     1000022        12   # BR(~nu_eL -> ~chi_10 nu_e)
     6.15712738E-03    2     1000023        12   # BR(~nu_eL -> ~chi_20 nu_e)
     5.96637375E-03    2     1000025        12   # BR(~nu_eL -> ~chi_30 nu_e)
     2.57637246E-01    2     1000035        12   # BR(~nu_eL -> ~chi_40 nu_e)
     1.67906920E-03    2     1000024        11   # BR(~nu_eL -> ~chi_1+ e-)
     5.14632251E-01    2     1000037        11   # BR(~nu_eL -> ~chi_2+ e-)
#
#         PDG            Width
DECAY   1000014     3.04233736E+01   # snu_muL decays
#          BR         NDA      ID1       ID2
     2.13927933E-01    2     1000022        14   # BR(~nu_muL -> ~chi_10 nu_mu)
     6.15712738E-03    2     1000023        14   # BR(~nu_muL -> ~chi_20 nu_mu)
     5.96637375E-03    2     1000025        14   # BR(~nu_muL -> ~chi_30 nu_mu)
     2.57637246E-01    2     1000035        14   # BR(~nu_muL -> ~chi_40 nu_mu)
     1.67906920E-03    2     1000024        13   # BR(~nu_muL -> ~chi_1+ mu-)
     5.14632251E-01    2     1000037        13   # BR(~nu_muL -> ~chi_2+ mu-)
#
#         PDG            Width
DECAY   1000016     3.13570464E+01   # snu_tauL decays
#          BR         NDA      ID1       ID2
     2.07535144E-01    2     1000022        16   # BR(~nu_tauL -> ~chi_10 nu_tau)
     5.97313047E-03    2     1000023        16   # BR(~nu_tauL -> ~chi_20 nu_tau)
     5.78807720E-03    2     1000025        16   # BR(~nu_tauL -> ~chi_30 nu_tau)
     2.49871864E-01    2     1000035        16   # BR(~nu_tauL -> ~chi_40 nu_tau)
     3.17110984E-02    2     1000024        15   # BR(~nu_tauL -> ~chi_1+ tau-)
     4.99120687E-01    2     1000037        15   # BR(~nu_tauL -> ~chi_2+ tau-)
#
#         PDG            Width
DECAY   1000024     8.36368135E-02   # chargino1+ decays
#          BR         NDA      ID1       ID2
     1.00000000E+00    2     1000022        24   # BR(~chi_1+ -> ~chi_10  W+)
#
#         PDG            Width
DECAY   1000037     2.33106991E+01   # chargino2+ decays
#          BR         NDA      ID1       ID2
     2.53788821E-01    2     1000024        23   # BR(~chi_2+ -> ~chi_1+  Z )
     7.56104766E-04    2     1000022        24   # BR(~chi_2+ -> ~chi_10  W+)
     2.44870474E-01    2     1000023        24   # BR(~chi_2+ -> ~chi_20  W+)
     2.44897592E-01    2     1000025        24   # BR(~chi_2+ -> ~chi_30  W+)
     2.55649492E-01    2     1000024        25   # BR(~chi_2+ -> ~chi_1+  h )
     3.75160506E-05    2     1000022        37   # BR(~chi_2+ -> ~chi_10  H+)
#
#         PDG            Width
DECAY   1000022     0.00000000E+00   # neutralino1 decays
#
#         PDG            Width
DECAY   1000023     6.60850063E-02   # neutralino2 decays
#          BR         NDA      ID1       ID2
     5.79841100E-01    2     1000022        23   # BR(~chi_20 -> ~chi_10   Z )
     4.20158900E-01    2     1000022        25   # BR(~chi_20 -> ~chi_10   h )
#
#         PDG            Width
DECAY   1000025     4.89349208E-02   # neutralino3 decays
#          BR         NDA      ID1       ID2
     9.00496408E-01    2     1000022        23   # BR(~chi_30 -> ~chi_10   Z )
     9.95035925E-02    2     1000022        25   # BR(~chi_30 -> ~chi_10   h )
#
#         PDG            Width
DECAY   1000035     2.33129568E+01   # neutralino4 decays
#          BR         NDA      ID1       ID2
     7.78452648E-04    2     1000022        23   # BR(~chi_40 -> ~chi_10   Z )
     1.35968940E-01    2     1000023        23   # BR(~chi_40 -> ~chi_20   Z )
     1.16858272E-01    2     1000025        23   # BR(~chi_40 -> ~chi_30   Z )
     2.45475532E-01    2     1000024       -24   # BR(~chi_40 -> ~chi_1+   W-)
     2.45475532E-01    2    -1000024        24   # BR(~chi_40 -> ~chi_1-   W+)
     1.15905034E-05    2     1000022        25   # BR(~chi_40 -> ~chi_10   h )
     3.59904750E-05    2     1000022        35   # BR(~chi_40 -> ~chi_10   H )
     3.93037573E-06    2     1000022        36   # BR(~chi_40 -> ~chi_10   A )
     1.18301676E-01    2     1000023        25   # BR(~chi_40 -> ~chi_20   h )
     1.37090083E-01    2     1000025        25   # BR(~chi_40 -> ~chi_30   h )
#
#         PDG            Width
DECAY        25     4.05598005E-03   # h decays
#          BR         NDA      ID1       ID2
     6.14312710E-01    2           5        -5   # BR(h -> b       bb     )
     6.38190967E-02    2         -15        15   # BR(h -> tau+    tau-   )
     2.25943995E-04    2         -13        13   # BR(h -> mu+     mu-    )
     4.79188878E-04    2           3        -3   # BR(h -> s       sb     )
     2.07610617E-02    2           4        -4   # BR(h -> c       cb     )
     6.68479402E-02    2          21        21   # BR(h -> g       g      )
     2.28906626E-03    2          22        22   # BR(h -> gam     gam    )
     1.45516877E-03    2          22        23   # BR(h -> Z       gam    )
     2.04419370E-01    2          24       -24   # BR(h -> W+      W-     )
     2.42275897E-02    2          23        23   # BR(h -> Z       Z      )
     1.16286356E-03    2     1000022   1000022   # BR(h -> ~chi_10 ~chi_10)
#
#         PDG            Width
DECAY        35     8.82227731E+00   # H decays
#          BR         NDA      ID1       ID2
     3.59662904E-01    2           5        -5   # BR(H -> b       bb     )
     6.31691422E-02    2         -15        15   # BR(H -> tau+    tau-   )
     2.23371104E-04    2         -13        13   # BR(H -> mu+     mu-    )
     2.73818652E-04    2           3        -3   # BR(H -> s       sb     )
     1.53087834E-06    2           4        -4   # BR(H -> c       cb     )
     1.52946881E-01    2           6        -6   # BR(H -> t       tb     )
     5.08830942E-05    2          21        21   # BR(H -> g       g      )
     1.46506893E-07    2          22        22   # BR(H -> gam     gam    )
     9.01491177E-08    2          23        22   # BR(H -> Z       gam    )
     7.46843263E-05    2          24       -24   # BR(H -> W+      W-     )
     3.72948736E-05    2          23        23   # BR(H -> Z       Z      )
     2.66441049E-04    2          25        25   # BR(H -> h       h      )
     3.74458759E-23    2          36        36   # BR(H -> A       A      )
     6.82643114E-19    2          23        36   # BR(H -> Z       A      )
     3.48206109E-03    2     1000024  -1000024   # BR(H -> ~chi_1+ ~chi_1-)
     4.37169107E-02    2     1000022   1000022   # BR(H -> ~chi_10 ~chi_10)
     1.24584907E-02    2     1000023   1000023   # BR(H -> ~chi_20 ~chi_20)
     8.48649438E-03    2     1000025   1000025   # BR(H -> ~chi_30 ~chi_30)
     2.02265445E-01    2     1000022   1000023   # BR(H -> ~chi_10 ~chi_20)
     1.31683028E-01    2     1000022   1000025   # BR(H -> ~chi_10 ~chi_30)
     2.12003819E-02    2     1000023   1000025   # BR(H -> ~chi_20 ~chi_30)
#
#         PDG            Width
DECAY        36     8.82729098E+00   # A decays
#          BR         NDA      ID1       ID2
     3.59581858E-01    2           5        -5   # BR(A -> b       bb     )
     6.31350902E-02    2         -15        15   # BR(A -> tau+    tau-   )
     2.23250382E-04    2         -13        13   # BR(A -> mu+     mu-    )
     2.73870712E-04    2           3        -3   # BR(A -> s       sb     )
     1.53604217E-06    2           4        -4   # BR(A -> c       cb     )
     1.53378106E-01    2           6        -6   # BR(A -> t       tb     )
     1.51802640E-04    2          21        21   # BR(A -> g       g      )
     5.33145951E-07    2          22        22   # BR(A -> gam     gam    )
     1.83577879E-07    2          23        22   # BR(A -> Z       gam    )
     7.43607542E-05    2          23        25   # BR(A -> Z       h      )
     3.60698477E-03    2     1000024  -1000024   # BR(A -> ~chi_1+ ~chi_1-)
     4.02610129E-02    2     1000022   1000022   # BR(A -> ~chi_10 ~chi_10)
     8.19440114E-03    2     1000023   1000023   # BR(A -> ~chi_20 ~chi_20)
     1.33438388E-02    2     1000025   1000025   # BR(A -> ~chi_30 ~chi_30)
     1.28501828E-01    2     1000022   1000023   # BR(A -> ~chi_10 ~chi_20)
     2.08498452E-01    2     1000022   1000025   # BR(A -> ~chi_10 ~chi_30)
     2.07728914E-02    2     1000023   1000025   # BR(A -> ~chi_20 ~chi_30)
#
#         PDG            Width
DECAY        37     8.75455404E+00   # H+ decays
#          BR         NDA      ID1       ID2
     5.74763361E-04    2           4        -5   # BR(H+ -> c       bb     )
     6.36911040E-02    2         -15        16   # BR(H+ -> tau+    nu_tau )
     2.25216488E-04    2         -13        14   # BR(H+ -> mu+     nu_mu  )
     3.67846606E-06    2           2        -5   # BR(H+ -> u       bb     )
     1.32148869E-05    2           2        -3   # BR(H+ -> u       sb     )
     2.73283696E-04    2           4        -3   # BR(H+ -> c       sb     )
     5.10690255E-01    2           6        -5   # BR(H+ -> t       bb     )
     7.51382121E-05    2          24        25   # BR(H+ -> W+      h      )
     1.07473845E-12    2          24        36   # BR(H+ -> W+      A      )
     3.98404553E-01    2     1000024   1000022   # BR(H+ -> ~chi_1+ ~chi_10)
     2.18004539E-02    2     1000024   1000023   # BR(H+ -> ~chi_1+ ~chi_20)
     4.24833875E-03    2     1000024   1000025   # BR(H+ -> ~chi_1+ ~chi_30)
