#
#                              ======================
#                              | THE SUSYHIT OUTPUT |
#                              ======================
#
#
#              ------------------------------------------------------
#              |     This is the output of the SUSY-HIT package     |
#              |  created by A.Djouadi, M.Muehlleitner and M.Spira. |
#              |  In case of problems with SUSY-HIT email to        |
#              |           margarete.muehlleitner@cern.ch           |
#              |           michael.spira@psi.ch                     |
#              |           abdelhak.djouadi@cern.ch                 |
#              ------------------------------------------------------
#
#              ------------------------------------------------------
#              |  SUSY Les Houches Accord - MSSM Spectrum + Decays  |
#              |              based on the decay programs           |
#              |                                                    |
#              |                     SDECAY 1.3b                    |
#              |                                                    |
#              |  Authors: M.Muhlleitner, A.Djouadi and Y.Mambrini  |
#              |  Ref.:    Comput.Phys.Commun.168(2005)46           |
#              |           [hep-ph/0311167]                         |
#              |                                                    |
#              |                     HDECAY 3.4                     |
#              |                                                    |
#              |  By: A.Djouadi,J.Kalinowski,M.Muhlleitner,M.Spira  |
#              |  Ref.:    Comput.Phys.Commun.108(1998)56           |
#              |           [hep-ph/9704448]                         |
#              |                                                    |
#              |                                                    |
#              |  If not stated otherwise all DRbar couplings and   |
#              |  soft SUSY breaking masses are given at the scale  |
#              |  Q=  0.50007354E+04
#              |                                                    |
#              ------------------------------------------------------
#
#
BLOCK DCINFO  # Decay Program information
     1   SDECAY/HDECAY # decay calculator
     2   1.3b  /3.4    # version number
#
BLOCK SPINFO  # Spectrum calculator information
     1    SOFTSUSY    # spectrum calculator                
     2    3.4.0       # version number                     
#
BLOCK MODSEL  # Model selection
     1     0   #  nonUniversal                                     
#
BLOCK SMINPUTS  # Standard Model inputs
         1     1.25778332E+02   # alpha_em^-1(M_Z)^MSbar
         2     1.16570000E-05   # G_F [GeV^-2]
         3     1.17200002E-01   # alpha_S(M_Z)^MSbar
         4     9.11876000E+01   # M_Z pole mass
         5     4.25000000E+00   # mb(mb)^MSbar
         6     1.72500000E+02   # mt pole mass
         7     1.77682000E+00   # mtau pole mass
#
BLOCK MINPAR  # Input parameters - minimal models
         3     1.00000000E+01   # tanb                
#
BLOCK EXTPAR  # Input parameters - non-minimal models
         0    -1.00000000E+00   # Set                 
         1     6.00000000E+01   # M_1(MX)             
         2     3.00000000E+03   # M_2(MX)             
         3     2.52553900E+03   # M_3(MX)             
        11     5.00000000E+03   # At(MX)              
        12     5.00000000E+03   # Ab(MX)              
        13     0.00000000E+00   # Atau(MX)            
        23    -1.15359700E+03   # mu(MX)              
        26     3.00000000E+03   # mA(pole)            
        31     5.00000000E+03   # meL(MX)             
        32     5.00000000E+03   # mmuL(MX)            
        33     5.00000000E+03   # mtauL(MX)           
        34     5.00000000E+03   # meR(MX)             
        35     5.00000000E+03   # mmuR(MX)            
        36     5.00000000E+03   # mtauR(MX)           
        41     5.00000000E+03   # mqL1(MX)            
        42     5.00000000E+03   # mqL2(MX)            
        43     5.00000000E+03   # mqL3(MX)            
        44     5.00000000E+03   # muR(MX)             
        45     5.00000000E+03   # mcR(MX)             
        46     5.00000000E+03   # mtR(MX)             
        47     5.00000000E+03   # mdR(MX)             
        48     5.00000000E+03   # msR(MX)             
        49     5.00000000E+03   # mbR(MX)             
#
BLOCK MASS  # Mass Spectrum
# PDG code           mass       particle
        24     8.00961159E+01   # W+
        25     1.24820746E+02   # h
        35     3.00008027E+03   # H
        36     2.99999985E+03   # A
        37     3.00086371E+03   # H+
         5     4.87878001E+00   # b-quark pole mass calculated from mb(mb)_Msbar
   1000001     5.08865139E+03   # ~d_L
   2000001     5.07092414E+03   # ~d_R
   1000002     5.08818285E+03   # ~u_L
   2000002     5.07064518E+03   # ~u_R
   1000003     5.08865139E+03   # ~s_L
   2000003     5.07092414E+03   # ~s_R
   1000004     5.08818285E+03   # ~c_L
   2000004     5.07064518E+03   # ~c_R
   1000005     5.03443805E+03   # ~b_1
   2000005     5.06951845E+03   # ~b_2
   1000006     4.92717156E+03   # ~t_1
   2000006     5.07827350E+03   # ~t_2
   1000011     5.01905743E+03   # ~e_L
   2000011     5.00591781E+03   # ~e_R
   1000012     5.01810930E+03   # ~nu_eL
   1000013     5.01905743E+03   # ~mu_L
   2000013     5.00591781E+03   # ~mu_R
   1000014     5.01810930E+03   # ~nu_muL
   1000015     5.00452453E+03   # ~tau_1
   2000015     5.01884558E+03   # ~tau_2
   1000016     5.01756585E+03   # ~nu_tauL
   1000021     2.90000050E+03   # ~g
   1000022     6.03023979E+01   # ~chi_10
   1000023     1.19954288E+03   # ~chi_20
   1000025    -1.20184424E+03   # ~chi_30
   1000035     3.07427773E+03   # ~chi_40
   1000024     1.20000101E+03   # ~chi_1+
   1000037     3.07444514E+03   # ~chi_2+
#
BLOCK NMIX  # Neutralino Mixing Matrix
  1  1     9.99308812E-01   # N_11
  1  2     1.64232653E-04   # N_12
  1  3    -3.71189156E-02   # N_13
  1  4     2.01425474E-03   # N_14
  2  1     2.48270482E-02   # N_21
  2  2     2.59735607E-02   # N_22
  2  3     7.06840270E-01   # N_23
  2  4     7.06460066E-01   # N_24
  3  1    -2.76648261E-02   # N_31
  3  2     1.42065514E-02   # N_32
  3  3    -7.06349605E-01   # N_33
  3  4     7.07179657E-01   # N_34
  4  1    -4.16126612E-04   # N_41
  4  2     9.99561664E-01   # N_42
  4  3    -8.32191837E-03   # N_43
  4  4    -2.84086509E-02   # N_44
#
BLOCK UMIX  # Chargino Mixing Matrix U
  1  1     1.17838220E-02   # U_11
  1  2     9.99930568E-01   # U_12
  2  1    -9.99930568E-01   # U_21
  2  2     1.17838220E-02   # U_22
#
BLOCK VMIX  # Chargino Mixing Matrix V
  1  1     4.02046427E-02   # V_11
  1  2    -9.99191466E-01   # V_12
  2  1    -9.99191466E-01   # V_21
  2  2    -4.02046427E-02   # V_22
#
BLOCK STOPMIX  # Stop Mixing Matrix
  1  1    -5.04792734E-01   # cos(theta_t)
  1  2     8.63240578E-01   # sin(theta_t)
  2  1    -8.63240578E-01   # -sin(theta_t)
  2  2    -5.04792734E-01   # cos(theta_t)
#
BLOCK SBOTMIX  # Sbottom Mixing Matrix
  1  1     9.96221803E-01   # cos(theta_b)
  1  2    -8.68453754E-02   # sin(theta_b)
  2  1     8.68453754E-02   # -sin(theta_b)
  2  2     9.96221803E-01   # cos(theta_b)
#
BLOCK STAUMIX  # Stau Mixing Matrix
  1  1    -1.36049143E-01   # cos(theta_tau)
  1  2     9.90702090E-01   # sin(theta_tau)
  2  1    -9.90702090E-01   # -sin(theta_tau)
  2  2    -1.36049143E-01   # cos(theta_tau)
#
BLOCK ALPHA  # Higgs mixing
          -1.05478902E-01   # Mixing angle in the neutral Higgs boson sector
#
BLOCK HMIX Q=  5.00073541E+03  # DRbar Higgs Parameters
         1    -1.17485567E+03   # mu(Q)MSSM           
         2     9.46928584E+00   # tan                 
         3     2.41901096E+02   # higgs               
         4     8.46648599E+06   # mA^2(Q)MSSM         
#
BLOCK GAUGE Q=  5.00073541E+03  # The gauge couplings
     1     3.70736705E-01   # gprime(Q) DRbar
     2     6.32287180E-01   # g(Q) DRbar
     3     9.92989593E-01   # g3(Q) DRbar
#
BLOCK AU Q=  5.00073541E+03  # The trilinear couplings
  1  1     5.00000002E+03   # A_u(Q) DRbar
  2  2     5.00000002E+03   # A_c(Q) DRbar
  3  3     5.00000003E+03   # A_t(Q) DRbar
#
BLOCK AD Q=  5.00073541E+03  # The trilinear couplings
  1  1     5.00000001E+03   # A_d(Q) DRbar
  2  2     5.00000001E+03   # A_s(Q) DRbar
  3  3     5.00000001E+03   # A_b(Q) DRbar
#
BLOCK AE Q=  5.00073541E+03  # The trilinear couplings
  1  1     0.00000000E+00   # A_e(Q) DRbar
  2  2     3.10743109E-07   # A_mu(Q) DRbar
  3  3     3.10911962E-07   # A_tau(Q) DRbar
#
BLOCK Yu Q=  5.00073541E+03  # The Yukawa couplings
  1  1     0.00000000E+00   # y_u(Q) DRbar
  2  2     0.00000000E+00   # y_c(Q) DRbar
  3  3     8.21406436E-01   # y_t(Q) DRbar
#
BLOCK Yd Q=  5.00073541E+03  # The Yukawa couplings
  1  1     0.00000000E+00   # y_d(Q) DRbar
  2  2     0.00000000E+00   # y_s(Q) DRbar
  3  3     1.31478741E-01   # y_b(Q) DRbar
#
BLOCK Ye Q=  5.00073541E+03  # The Yukawa couplings
  1  1     0.00000000E+00   # y_e(Q) DRbar
  2  2     0.00000000E+00   # y_mu(Q) DRbar
  3  3     9.67490010E-02   # y_tau(Q) DRbar
#
BLOCK MSOFT Q=  5.00073541E+03  # The soft SUSY breaking masses at the scale Q
         1     6.00000000E+01   # M_1(Q)              
         2     3.00000000E+03   # M_2(Q)              
         3     2.52553900E+03   # M_3(Q)              
        21     7.30518016E+06   # mH1^2(Q)            
        22    -8.18675536E+05   # mH2^2(Q)            
        31     5.00000000E+03   # meL(Q)              
        32     5.00000000E+03   # mmuL(Q)             
        33     5.00000000E+03   # mtauL(Q)            
        34     5.00000000E+03   # meR(Q)              
        35     5.00000000E+03   # mmuR(Q)             
        36     5.00000000E+03   # mtauR(Q)            
        41     4.99999999E+03   # mqL1(Q)             
        42     4.99999999E+03   # mqL2(Q)             
        43     4.99999999E+03   # mqL3(Q)             
        44     4.99999999E+03   # muR(Q)              
        45     4.99999999E+03   # mcR(Q)              
        46     4.99999999E+03   # mtR(Q)              
        47     4.99999999E+03   # mdR(Q)              
        48     4.99999999E+03   # msR(Q)              
        49     4.99999999E+03   # mbR(Q)              
#
#
#
#                             =================
#                             |The decay table|
#                             =================
#
# - The QCD corrections to the decays gluino -> squark  + quark
#                                     squark -> gaugino + quark_prime
#                                     squark -> squark_prime + Higgs
#                                     squark -> gluino  + quark
#   are included.
#
# - The multi-body decays for the inos, stops and sbottoms are included.
#
# - The loop induced decays for the gluino, neutralinos and stops
#   are included.
#
# - The SUSY decays of the top quark are included.
#
#
#         PDG            Width
DECAY         6     1.40094083E+00   # top decays
#          BR         NDA      ID1       ID2
     1.00000000E+00    2           5        24   # BR(t ->  b    W+)
#
#         PDG            Width
DECAY   1000021     8.03878456E-03   # gluino decays
#          BR         NDA      ID1       ID2
     1.80017199E-06    2     1000022        21   # BR(~g -> ~chi_10 g)
     4.16376244E-03    2     1000023        21   # BR(~g -> ~chi_20 g)
     4.12224059E-03    2     1000025        21   # BR(~g -> ~chi_30 g)
#           BR         NDA      ID1       ID2       ID3
     2.11339802E-02    3     1000022         1        -1   # BR(~g -> ~chi_10 d  db)
     2.58917336E-05    3     1000023         1        -1   # BR(~g -> ~chi_20 d  db)
     1.01606976E-05    3     1000025         1        -1   # BR(~g -> ~chi_30 d  db)
     7.20703670E-02    3     1000022         2        -2   # BR(~g -> ~chi_10 u  ub)
     6.37357218E-05    3     1000023         2        -2   # BR(~g -> ~chi_20 u  ub)
     1.11676147E-05    3     1000025         2        -2   # BR(~g -> ~chi_30 u  ub)
     2.11339802E-02    3     1000022         3        -3   # BR(~g -> ~chi_10 s  sb)
     2.58917336E-05    3     1000023         3        -3   # BR(~g -> ~chi_20 s  sb)
     1.01606976E-05    3     1000025         3        -3   # BR(~g -> ~chi_30 s  sb)
     7.20703670E-02    3     1000022         4        -4   # BR(~g -> ~chi_10 c  cb)
     6.37357218E-05    3     1000023         4        -4   # BR(~g -> ~chi_20 c  cb)
     1.11676147E-05    3     1000025         4        -4   # BR(~g -> ~chi_30 c  cb)
     2.14311557E-02    3     1000022         5        -5   # BR(~g -> ~chi_10 b  bb)
     4.58937740E-03    3     1000023         5        -5   # BR(~g -> ~chi_20 b  bb)
     4.53653602E-03    3     1000025         5        -5   # BR(~g -> ~chi_30 b  bb)
     7.52565032E-02    3     1000022         6        -6   # BR(~g -> ~chi_10 t  tb)
     1.74756060E-01    3     1000023         6        -6   # BR(~g -> ~chi_20 t  tb)
     1.62920834E-01    3     1000025         6        -6   # BR(~g -> ~chi_30 t  tb)
     7.27223928E-05    3     1000024         1        -2   # BR(~g -> ~chi_1+ d  ub)
     7.27223928E-05    3    -1000024         2        -1   # BR(~g -> ~chi_1- u  db)
     7.27223928E-05    3     1000024         3        -4   # BR(~g -> ~chi_1+ s  cb)
     7.27223928E-05    3    -1000024         4        -3   # BR(~g -> ~chi_1- c  sb)
     1.80650117E-01    3     1000024         5        -6   # BR(~g -> ~chi_1+ b  tb)
     1.80650117E-01    3    -1000024         6        -5   # BR(~g -> ~chi_1- t  bb)
#
#         PDG            Width
DECAY   1000006     2.50374742E+02   # stop1 decays
#          BR         NDA      ID1       ID2
     3.55586230E-02    2     1000022         6   # BR(~t_1 -> ~chi_10 t )
     1.16493137E-01    2     1000023         6   # BR(~t_1 -> ~chi_20 t )
     1.12095805E-01    2     1000025         6   # BR(~t_1 -> ~chi_30 t )
     8.22324157E-03    2     1000035         6   # BR(~t_1 -> ~chi_40 t )
     1.71232299E-01    2     1000024         5   # BR(~t_1 -> ~chi_1+ b )
     1.63750475E-02    2     1000037         5   # BR(~t_1 -> ~chi_2+ b )
     5.40021847E-01    2     1000021         6   # BR(~t_1 -> ~g      t )
#
#         PDG            Width
DECAY   2000006     2.61605443E+02   # stop2 decays
#          BR         NDA      ID1       ID2
     1.29881793E-02    2     1000022         6   # BR(~t_2 -> ~chi_10 t )
     1.14876728E-01    2     1000023         6   # BR(~t_2 -> ~chi_20 t )
     1.19487270E-01    2     1000025         6   # BR(~t_2 -> ~chi_30 t )
     2.15883224E-02    2     1000035         6   # BR(~t_2 -> ~chi_40 t )
     6.68555759E-02    2     1000024         5   # BR(~t_2 -> ~chi_1+ b )
     4.29270910E-02    2     1000037         5   # BR(~t_2 -> ~chi_2+ b )
     6.16683305E-01    2     1000021         6   # BR(~t_2 -> ~g      t )
     1.03572419E-03    2     1000006        25   # BR(~t_2 -> ~t_1    h )
     3.55780395E-03    2     1000006        23   # BR(~t_2 -> ~t_1    Z )
#
#         PDG            Width
DECAY   1000005     2.36422676E+02   # sbottom1 decays
#          BR         NDA      ID1       ID2
     3.26506478E-03    2     1000022         5   # BR(~b_1 -> ~chi_10 b )
     3.30256490E-03    2     1000023         5   # BR(~b_1 -> ~chi_20 b )
     3.18520783E-03    2     1000025         5   # BR(~b_1 -> ~chi_30 b )
     3.21253894E-02    2     1000035         5   # BR(~b_1 -> ~chi_40 b )
     2.50693627E-01    2    -1000024         6   # BR(~b_1 -> ~chi_1- t )
     6.45838553E-02    2    -1000037         6   # BR(~b_1 -> ~chi_2- t )
     6.40607014E-01    2     1000021         5   # BR(~b_1 -> ~g      b )
     2.23727742E-03    2     1000006       -24   # BR(~b_1 -> ~t_1    W-)
#
#         PDG            Width
DECAY   2000005     1.61079764E+02   # sbottom2 decays
#          BR         NDA      ID1       ID2
     1.81641144E-02    2     1000022         5   # BR(~b_2 -> ~chi_10 b )
     4.76679121E-03    2     1000023         5   # BR(~b_2 -> ~chi_20 b )
     4.91841565E-03    2     1000025         5   # BR(~b_2 -> ~chi_30 b )
     3.57312543E-04    2     1000035         5   # BR(~b_2 -> ~chi_40 b )
     1.21768545E-02    2    -1000024         6   # BR(~b_2 -> ~chi_1- t )
     7.18184030E-04    2    -1000037         6   # BR(~b_2 -> ~chi_2- t )
     9.58787712E-01    2     1000021         5   # BR(~b_2 -> ~g      b )
     1.10615880E-04    2     1000006       -24   # BR(~b_2 -> ~t_1    W-)
#
#         PDG            Width
DECAY   1000002     1.80598844E+02   # sup_L decays
#          BR         NDA      ID1       ID2
     4.11961875E-03    2     1000022         2   # BR(~u_L -> ~chi_10 u)
     9.17109957E-05    2     1000023         2   # BR(~u_L -> ~chi_20 u)
     7.46988450E-06    2     1000025         2   # BR(~u_L -> ~chi_30 u)
     4.38754836E-02    2     1000035         2   # BR(~u_L -> ~chi_40 u)
     3.11984120E-04    2     1000024         1   # BR(~u_L -> ~chi_1+ d)
     8.76893731E-02    2     1000037         1   # BR(~u_L -> ~chi_2+ d)
     8.63904359E-01    2     1000021         2   # BR(~u_L -> ~g      u)
#
#         PDG            Width
DECAY   2000002     1.66304018E+02   # sup_R decays
#          BR         NDA      ID1       ID2
     7.12069244E-02    2     1000022         2   # BR(~u_R -> ~chi_10 u)
     3.93144298E-05    2     1000023         2   # BR(~u_R -> ~chi_20 u)
     4.87935393E-05    2     1000025         2   # BR(~u_R -> ~chi_30 u)
     4.99077834E-09    2     1000035         2   # BR(~u_R -> ~chi_40 u)
     9.28704963E-01    2     1000021         2   # BR(~u_R -> ~g      u)
#
#         PDG            Width
DECAY   1000001     1.80616715E+02   # sdown_L decays
#          BR         NDA      ID1       ID2
     4.10576695E-03    2     1000022         1   # BR(~d_L -> ~chi_10 d)
     4.30558365E-05    2     1000023         1   # BR(~d_L -> ~chi_20 d)
     3.71120682E-05    2     1000025         1   # BR(~d_L -> ~chi_30 d)
     4.38987088E-02    2     1000035         1   # BR(~d_L -> ~chi_40 d)
     2.68015265E-05    2    -1000024         2   # BR(~d_L -> ~chi_1- u)
     8.78370457E-02    2    -1000037         2   # BR(~d_L -> ~chi_2- u)
     8.64051509E-01    2     1000021         1   # BR(~d_L -> ~g      d)
#
#         PDG            Width
DECAY   2000001     1.57436715E+02   # sdown_R decays
#          BR         NDA      ID1       ID2
     1.88054379E-02    2     1000022         1   # BR(~d_R -> ~chi_10 d)
     1.03829001E-05    2     1000023         1   # BR(~d_R -> ~chi_20 d)
     1.28863237E-05    2     1000025         1   # BR(~d_R -> ~chi_30 d)
     1.31820863E-09    2     1000035         1   # BR(~d_R -> ~chi_40 d)
     9.81171292E-01    2     1000021         1   # BR(~d_R -> ~g      d)
#
#         PDG            Width
DECAY   1000004     1.80598844E+02   # scharm_L decays
#          BR         NDA      ID1       ID2
     4.11961875E-03    2     1000022         4   # BR(~c_L -> ~chi_10 c)
     9.17109957E-05    2     1000023         4   # BR(~c_L -> ~chi_20 c)
     7.46988450E-06    2     1000025         4   # BR(~c_L -> ~chi_30 c)
     4.38754836E-02    2     1000035         4   # BR(~c_L -> ~chi_40 c)
     3.11984120E-04    2     1000024         3   # BR(~c_L -> ~chi_1+ s)
     8.76893731E-02    2     1000037         3   # BR(~c_L -> ~chi_2+ s)
     8.63904359E-01    2     1000021         4   # BR(~c_L -> ~g      c)
#
#         PDG            Width
DECAY   2000004     1.66304018E+02   # scharm_R decays
#          BR         NDA      ID1       ID2
     7.12069244E-02    2     1000022         4   # BR(~c_R -> ~chi_10 c)
     3.93144298E-05    2     1000023         4   # BR(~c_R -> ~chi_20 c)
     4.87935393E-05    2     1000025         4   # BR(~c_R -> ~chi_30 c)
     4.99077834E-09    2     1000035         4   # BR(~c_R -> ~chi_40 c)
     9.28704963E-01    2     1000021         4   # BR(~c_R -> ~g      c)
#
#         PDG            Width
DECAY   1000003     1.80616715E+02   # sstrange_L decays
#          BR         NDA      ID1       ID2
     4.10576695E-03    2     1000022         3   # BR(~s_L -> ~chi_10 s)
     4.30558365E-05    2     1000023         3   # BR(~s_L -> ~chi_20 s)
     3.71120682E-05    2     1000025         3   # BR(~s_L -> ~chi_30 s)
     4.38987088E-02    2     1000035         3   # BR(~s_L -> ~chi_40 s)
     2.68015265E-05    2    -1000024         4   # BR(~s_L -> ~chi_1- c)
     8.78370457E-02    2    -1000037         4   # BR(~s_L -> ~chi_2- c)
     8.64051509E-01    2     1000021         3   # BR(~s_L -> ~g      s)
#
#         PDG            Width
DECAY   2000003     1.57436715E+02   # sstrange_R decays
#          BR         NDA      ID1       ID2
     1.88054379E-02    2     1000022         3   # BR(~s_R -> ~chi_10 s)
     1.03829001E-05    2     1000023         3   # BR(~s_R -> ~chi_20 s)
     1.28863237E-05    2     1000025         3   # BR(~s_R -> ~chi_30 s)
     1.31820863E-09    2     1000035         3   # BR(~s_R -> ~chi_40 s)
     9.81171292E-01    2     1000021         3   # BR(~s_R -> ~g      s)
#
#         PDG            Width
DECAY   1000011     3.02502434E+01   # selectron_L decays
#          BR         NDA      ID1       ID2
     2.26590698E-01    2     1000022        11   # BR(~e_L -> ~chi_10 e-)
     9.63615003E-04    2     1000023        11   # BR(~e_L -> ~chi_20 e-)
     2.37941423E-06    2     1000025        11   # BR(~e_L -> ~chi_30 e-)
     2.57238841E-01    2     1000035        11   # BR(~e_L -> ~chi_40 e-)
     1.62891079E-04    2    -1000024        12   # BR(~e_L -> ~chi_1- nu_e)
     5.15041576E-01    2    -1000037        12   # BR(~e_L -> ~chi_2- nu_e)
#
#         PDG            Width
DECAY   2000011     2.73641528E+01   # selectron_R decays
#          BR         NDA      ID1       ID2
     9.98772102E-01    2     1000022        11   # BR(~e_R -> ~chi_10 e-)
     5.47872525E-04    2     1000023        11   # BR(~e_R -> ~chi_20 e-)
     6.79957845E-04    2     1000025        11   # BR(~e_R -> ~chi_30 e-)
     6.72055748E-08    2     1000035        11   # BR(~e_R -> ~chi_40 e-)
#
#         PDG            Width
DECAY   1000013     3.02502434E+01   # smuon_L decays
#          BR         NDA      ID1       ID2
     2.26590698E-01    2     1000022        13   # BR(~mu_L -> ~chi_10 mu-)
     9.63615003E-04    2     1000023        13   # BR(~mu_L -> ~chi_20 mu-)
     2.37941423E-06    2     1000025        13   # BR(~mu_L -> ~chi_30 mu-)
     2.57238841E-01    2     1000035        13   # BR(~mu_L -> ~chi_40 mu-)
     1.62891079E-04    2    -1000024        14   # BR(~mu_L -> ~chi_1- nu_mu)
     5.15041576E-01    2    -1000037        14   # BR(~mu_L -> ~chi_2- nu_mu)
#
#         PDG            Width
DECAY   2000013     2.73641528E+01   # smuon_R decays
#          BR         NDA      ID1       ID2
     9.98772102E-01    2     1000022        13   # BR(~mu_R -> ~chi_10 mu-)
     5.47872525E-04    2     1000023        13   # BR(~mu_R -> ~chi_20 mu-)
     6.79957845E-04    2     1000025        13   # BR(~mu_R -> ~chi_30 mu-)
     6.72055748E-08    2     1000035        13   # BR(~mu_R -> ~chi_40 mu-)
#
#         PDG            Width
DECAY   1000015     2.90630831E+01   # stau_1 decays
#          BR         NDA      ID1       ID2
     9.27988188E-01    2     1000022        15   # BR(~tau_1 -> ~chi_10  tau-)
     1.50436158E-02    2     1000023        15   # BR(~tau_1 -> ~chi_20  tau-)
     1.40727104E-02    2     1000025        15   # BR(~tau_1 -> ~chi_30  tau-)
     4.77909730E-03    2     1000035        15   # BR(~tau_1 -> ~chi_40  tau-)
     2.85479420E-02    2    -1000024        16   # BR(~tau_1 -> ~chi_1-  nu_tau)
     9.56844641E-03    2    -1000037        16   # BR(~tau_1 -> ~chi_2-  nu_tau)
#
#         PDG            Width
DECAY   2000015     3.10234468E+01   # stau_2 decays
#          BR         NDA      ID1       ID2
     2.32419534E-01    2     1000022        15   # BR(~tau_2 -> ~chi_10  tau-)
     1.40435016E-02    2     1000023        15   # BR(~tau_2 -> ~chi_20  tau-)
     1.40869311E-02    2     1000025        15   # BR(~tau_2 -> ~chi_30  tau-)
     2.46271523E-01    2     1000035        15   # BR(~tau_2 -> ~chi_40  tau-)
     9.55875295E-05    2    -1000024        16   # BR(~tau_2 -> ~chi_1-  nu_tau)
     4.93082923E-01    2    -1000037        16   # BR(~tau_2 -> ~chi_2-  nu_tau)
#
#         PDG            Width
DECAY   1000012     3.02527688E+01   # snu_eL decays
#          BR         NDA      ID1       ID2
     2.26275124E-01    2     1000022        12   # BR(~nu_eL -> ~chi_10 nu_e)
     7.64286679E-05    2     1000023        12   # BR(~nu_eL -> ~chi_20 nu_e)
     5.42663245E-04    2     1000025        12   # BR(~nu_eL -> ~chi_30 nu_e)
     2.57303181E-01    2     1000035        12   # BR(~nu_eL -> ~chi_40 nu_e)
     1.89556709E-03    2     1000024        11   # BR(~nu_eL -> ~chi_1+ e-)
     5.13907036E-01    2     1000037        11   # BR(~nu_eL -> ~chi_2+ e-)
#
#         PDG            Width
DECAY   1000014     3.02527688E+01   # snu_muL decays
#          BR         NDA      ID1       ID2
     2.26275124E-01    2     1000022        14   # BR(~nu_muL -> ~chi_10 nu_mu)
     7.64286679E-05    2     1000023        14   # BR(~nu_muL -> ~chi_20 nu_mu)
     5.42663245E-04    2     1000025        14   # BR(~nu_muL -> ~chi_30 nu_mu)
     2.57303181E-01    2     1000035        14   # BR(~nu_muL -> ~chi_40 nu_mu)
     1.89556709E-03    2     1000024        13   # BR(~nu_muL -> ~chi_1+ mu-)
     5.13907036E-01    2     1000037        13   # BR(~nu_muL -> ~chi_2+ mu-)
#
#         PDG            Width
DECAY   1000016     3.10739159E+01   # snu_tauL decays
#          BR         NDA      ID1       ID2
     2.20271795E-01    2     1000022        16   # BR(~nu_tauL -> ~chi_10 nu_tau)
     7.43989822E-05    2     1000023        16   # BR(~nu_tauL -> ~chi_20 nu_tau)
     5.28251897E-04    2     1000025        16   # BR(~nu_tauL -> ~chi_30 nu_tau)
     2.50411461E-01    2     1000035        16   # BR(~nu_tauL -> ~chi_40 nu_tau)
     2.85717359E-02    2     1000024        15   # BR(~nu_tauL -> ~chi_1+ tau-)
     5.00142357E-01    2     1000037        15   # BR(~nu_tauL -> ~chi_2+ tau-)
#
#         PDG            Width
DECAY   1000024     7.34373911E-01   # chargino1+ decays
#          BR         NDA      ID1       ID2
     1.00000000E+00    2     1000022        24   # BR(~chi_1+ -> ~chi_10  W+)
#
#         PDG            Width
DECAY   1000037     1.96679477E+01   # chargino2+ decays
#          BR         NDA      ID1       ID2
     2.53015604E-01    2     1000024        23   # BR(~chi_2+ -> ~chi_1+  Z )
     2.15554001E-04    2     1000022        24   # BR(~chi_2+ -> ~chi_10  W+)
     2.43989450E-01    2     1000023        24   # BR(~chi_2+ -> ~chi_20  W+)
     2.43952457E-01    2     1000025        24   # BR(~chi_2+ -> ~chi_30  W+)
     2.58826190E-01    2     1000024        25   # BR(~chi_2+ -> ~chi_1+  h )
     7.45269174E-07    2     1000022        37   # BR(~chi_2+ -> ~chi_10  H+)
#
#         PDG            Width
DECAY   1000022     0.00000000E+00   # neutralino1 decays
#
#         PDG            Width
DECAY   1000023     7.69639301E-01   # neutralino2 decays
#          BR         NDA      ID1       ID2
     5.48081333E-01    2     1000022        23   # BR(~chi_20 -> ~chi_10   Z )
     4.51918667E-01    2     1000022        25   # BR(~chi_20 -> ~chi_10   h )
#
#         PDG            Width
DECAY   1000025     7.75459650E-01   # neutralino3 decays
#          BR         NDA      ID1       ID2
     4.38103205E-01    2     1000022        23   # BR(~chi_30 -> ~chi_10   Z )
     5.61896795E-01    2     1000022        25   # BR(~chi_30 -> ~chi_10   h )
#
#         PDG            Width
DECAY   1000035     1.96795835E+01   # neutralino4 decays
#          BR         NDA      ID1       ID2
     6.35288080E-05    2     1000022        23   # BR(~chi_40 -> ~chi_10   Z )
     5.83476808E-02    2     1000023        23   # BR(~chi_40 -> ~chi_20   Z )
     1.93962756E-01    2     1000025        23   # BR(~chi_40 -> ~chi_30   Z )
     2.44603736E-01    2     1000024       -24   # BR(~chi_40 -> ~chi_1+   W-)
     2.44603736E-01    2    -1000024        24   # BR(~chi_40 -> ~chi_1-   W+)
     1.54954662E-04    2     1000022        25   # BR(~chi_40 -> ~chi_10   h )
     6.82320425E-07    2     1000022        35   # BR(~chi_40 -> ~chi_10   H )
     8.90927968E-08    2     1000022        36   # BR(~chi_40 -> ~chi_10   A )
     1.99801697E-01    2     1000023        25   # BR(~chi_40 -> ~chi_20   h )
     5.84611386E-02    2     1000025        25   # BR(~chi_40 -> ~chi_30   h )
#
#         PDG            Width
DECAY        25     4.04768518E-03   # h decays
#          BR         NDA      ID1       ID2
     6.05892936E-01    2           5        -5   # BR(h -> b       bb     )
     6.41020082E-02    2         -15        15   # BR(h -> tau+    tau-   )
     2.26944207E-04    2         -13        13   # BR(h -> mu+     mu-    )
     4.81072888E-04    2           3        -3   # BR(h -> s       sb     )
     2.08462454E-02    2           4        -4   # BR(h -> c       cb     )
     6.74876215E-02    2          21        21   # BR(h -> g       g      )
     2.32151350E-03    2          22        22   # BR(h -> gam     gam    )
     1.50091452E-03    2          22        23   # BR(h -> Z       gam    )
     2.11828937E-01    2          24       -24   # BR(h -> W+      W-     )
     2.52659387E-02    2          23        23   # BR(h -> Z       Z      )
     4.58679148E-05    2     1000022   1000022   # BR(h -> ~chi_10 ~chi_10)
#
#         PDG            Width
DECAY        35     7.79864281E+00   # H decays
#          BR         NDA      ID1       ID2
     4.16639771E-01    2           5        -5   # BR(H -> b       bb     )
     7.14285631E-02    2         -15        15   # BR(H -> tau+    tau-   )
     2.52577073E-04    2         -13        13   # BR(H -> mu+     mu-    )
     3.09620790E-04    2           3        -3   # BR(H -> s       sb     )
     1.73228889E-06    2           4        -4   # BR(H -> c       cb     )
     1.73069378E-01    2           6        -6   # BR(H -> t       tb     )
     5.74940782E-05    2          21        21   # BR(H -> g       g      )
     3.33262817E-07    2          22        22   # BR(H -> gam     gam    )
     1.02214349E-07    2          23        22   # BR(H -> Z       gam    )
     7.89797244E-05    2          24       -24   # BR(H -> W+      W-     )
     3.94398818E-05    2          23        23   # BR(H -> Z       Z      )
     2.94215459E-04    2          25        25   # BR(H -> h       h      )
     8.06720883E-24    2          36        36   # BR(H -> A       A      )
     2.99867513E-19    2          23        36   # BR(H -> Z       A      )
     1.18827649E-03    2     1000024  -1000024   # BR(H -> ~chi_1+ ~chi_1-)
     1.28570138E-03    2     1000022   1000022   # BR(H -> ~chi_10 ~chi_10)
     6.57737354E-05    2     1000023   1000023   # BR(H -> ~chi_20 ~chi_20)
     2.34224805E-04    2     1000025   1000025   # BR(H -> ~chi_30 ~chi_30)
     2.00321356E-01    2     1000022   1000023   # BR(H -> ~chi_10 ~chi_20)
     1.34516519E-01    2     1000022   1000025   # BR(H -> ~chi_10 ~chi_30)
     2.15942721E-04    2     1000023   1000025   # BR(H -> ~chi_20 ~chi_30)
#
#         PDG            Width
DECAY        36     7.81891969E+00   # A decays
#          BR         NDA      ID1       ID2
     4.15699149E-01    2           5        -5   # BR(A -> b       bb     )
     7.12454988E-02    2         -15        15   # BR(A -> tau+    tau-   )
     2.51929390E-04    2         -13        13   # BR(A -> mu+     mu-    )
     3.09052527E-04    2           3        -3   # BR(A -> s       sb     )
     1.73491384E-06    2           4        -4   # BR(A -> c       cb     )
     1.73235999E-01    2           6        -6   # BR(A -> t       tb     )
     1.71424698E-04    2          21        21   # BR(A -> g       g      )
     5.27023019E-07    2          22        22   # BR(A -> gam     gam    )
     2.07659078E-07    2          23        22   # BR(A -> Z       gam    )
     7.84769841E-05    2          23        25   # BR(A -> Z       h      )
     2.90821313E-03    2     1000024  -1000024   # BR(A -> ~chi_1+ ~chi_1-)
     1.31430244E-03    2     1000022   1000022   # BR(A -> ~chi_10 ~chi_10)
     1.19051468E-04    2     1000023   1000023   # BR(A -> ~chi_20 ~chi_20)
     9.98050974E-04    2     1000025   1000025   # BR(A -> ~chi_30 ~chi_30)
     1.35899130E-01    2     1000022   1000023   # BR(A -> ~chi_10 ~chi_20)
     1.97740833E-01    2     1000022   1000025   # BR(A -> ~chi_10 ~chi_30)
     2.64201647E-05    2     1000023   1000025   # BR(A -> ~chi_20 ~chi_30)
#
#         PDG            Width
DECAY        37     7.80364409E+00   # H+ decays
#          BR         NDA      ID1       ID2
     6.71774103E-04    2           4        -5   # BR(H+ -> c       bb     )
     7.14055172E-02    2         -15        16   # BR(H+ -> tau+    nu_tau )
     2.52495227E-04    2         -13        14   # BR(H+ -> mu+     nu_mu  )
     4.29933223E-06    2           2        -5   # BR(H+ -> u       bb     )
     1.48159001E-05    2           2        -3   # BR(H+ -> u       sb     )
     3.06394117E-04    2           4        -3   # BR(H+ -> c       sb     )
     5.89798641E-01    2           6        -5   # BR(H+ -> t       bb     )
     7.87490358E-05    2          24        25   # BR(H+ -> W+      h      )
     8.10231390E-14    2          24        36   # BR(H+ -> W+      A      )
     3.36903353E-01    2     1000024   1000022   # BR(H+ -> ~chi_1+ ~chi_10)
     5.03004910E-04    2     1000024   1000023   # BR(H+ -> ~chi_1+ ~chi_20)
     6.09561216E-05    2     1000024   1000025   # BR(H+ -> ~chi_1+ ~chi_30)
