#
#                              ======================
#                              | THE SUSYHIT OUTPUT |
#                              ======================
#
#
#              ------------------------------------------------------
#              |     This is the output of the SUSY-HIT package     |
#              |  created by A.Djouadi, M.Muehlleitner and M.Spira. |
#              |  In case of problems with SUSY-HIT email to        |
#              |           margarete.muehlleitner@kit.edu           |
#              |           michael.spira@psi.ch                     |
#              |           abdelhak.djouadi@cern.ch                 |
#              ------------------------------------------------------
#
#              ------------------------------------------------------
#              |  SUSY Les Houches Accord - MSSM Spectrum + Decays  |
#              |              based on the decay programs           |
#              |                                                    |
#              |                     SDECAY 1.5                     |
#              |                                                    |
#              |  Authors: M.Muhlleitner, A.Djouadi and Y.Mambrini  |
#              |  Ref.:    Comput.Phys.Commun.168(2005)46           |
#              |           [hep-ph/0311167]                         |
#              |                                                    |
#              |                     HDECAY 3.4                     |
#              |                                                    |
#              |  By: A.Djouadi,J.Kalinowski,M.Muhlleitner,M.Spira  |
#              |  Ref.:    Comput.Phys.Commun.108(1998)56           |
#              |           [hep-ph/9704448]                         |
#              |                                                    |
#              |                                                    |
#              |  If not stated otherwise all DRbar couplings and   |
#              |  soft SUSY breaking masses are given at the scale  |
#              |  Q=  0.16871792E+04
#              |                                                    |
#              ------------------------------------------------------
#
#
BLOCK DCINFO  # Decay Program information
     1   SDECAY/HDECAY # decay calculator
     2   1.5  /3.4    # version number
#
BLOCK SPINFO  # Spectrum calculator information
     1    SOFTSUSY    # spectrum calculator                
     2    3.7.3       # version number                     
#
BLOCK MODSEL  # Model selection
     1     0   #  nonUniversal                                     
#
BLOCK SMINPUTS  # Standard Model inputs
         1     1.27934000E+02   # alpha_em^-1(M_Z)^MSbar
         2     1.16639000E-05   # G_F [GeV^-2]
         3     1.17200000E-01   # alpha_S(M_Z)^MSbar
         4     9.11870000E+01   # M_Z pole mass
         5     4.19000000E+00   # mb(mb)^MSbar
         6     1.72500000E+02   # mt pole mass
         7     1.77690000E+00   # mtau pole mass
#
BLOCK MINPAR  # Input parameters - minimal models
         3     2.00000000E+01   # tanb                
#
BLOCK EXTPAR  # Input parameters - non-minimal models
         0    -1.00000000E+00   # Set                 
         1     2.49900000E+02   # M_1(MX)             
         2     4.99900000E+02   # M_2(MX)             
         3     2.20000000E+03   # M_3(MX)             
        11     2.94338000E+03   # At(MX)              
        12     0.00000000E+00   # Ab(MX)              
        13     0.00000000E+00   # Atau(MX)            
        23    -3.00000000E+03   # mu(MX)              
        25     2.00000000E+01   # tan                 
        26     3.00000000E+03   # mA(pole)            
        31     3.00000000E+03   # meL(MX)             
        32     3.00000000E+03   # mmuL(MX)            
        33     3.00000000E+03   # mtauL(MX)           
        34     3.00000000E+03   # meR(MX)             
        35     3.00000000E+03   # mmuR(MX)            
        36     3.00000000E+03   # mtauR(MX)           
        41     3.00000000E+03   # mqL1(MX)            
        42     3.00000000E+03   # mqL2(MX)            
        43     9.49900000E+02   # mqL3(MX)            
        44     3.00000000E+03   # muR(MX)             
        45     3.00000000E+03   # mcR(MX)             
        46     3.00000000E+03   # mtR(MX)             
        47     3.00000000E+03   # mdR(MX)             
        48     3.00000000E+03   # msR(MX)             
        49     3.00000000E+03   # mbR(MX)             
#
BLOCK MASS  # Mass Spectrum
# PDG code           mass       particle
        24     8.03995845E+01   # W+
        25     1.24841204E+02   # h
        35     3.00001399E+03   # H
        36     2.99999994E+03   # A
        37     3.00108649E+03   # H+
         5     4.81337004E+00   # b-quark pole mass calculated from mb(mb)_Msbar
   1000001     3.04190990E+03   # ~d_L
   2000001     3.03675126E+03   # ~d_R
   1000002     3.04100248E+03   # ~u_L
   2000002     3.03806148E+03   # ~u_R
   1000003     3.04190990E+03   # ~s_L
   2000003     3.03675126E+03   # ~s_R
   1000004     3.04100248E+03   # ~c_L
   2000004     3.03806148E+03   # ~c_R
   1000005     1.04937859E+03   # ~b_1
   2000005     3.03421238E+03   # ~b_2
   1000006     1.04726857E+03   # ~t_1
   2000006     3.02450565E+03   # ~t_2
   1000011     3.00642472E+03   # ~e_L
   2000011     3.00184739E+03   # ~e_R
   1000012     3.00503579E+03   # ~nu_eL
   1000013     3.00642472E+03   # ~mu_L
   2000013     3.00184739E+03   # ~mu_R
   1000014     3.00503579E+03   # ~nu_muL
   1000015     2.98605735E+03   # ~tau_1
   2000015     3.02165321E+03   # ~tau_2
   1000016     3.00487427E+03   # ~nu_tauL
   1000021     2.35218890E+03   # ~g
   1000022     2.51515893E+02   # ~chi_10
   1000023     5.30796336E+02   # ~chi_20
   1000025    -2.99499502E+03   # ~chi_30
   1000035     2.99518801E+03   # ~chi_40
   1000024     5.30959736E+02   # ~chi_1+
   1000037     2.99603169E+03   # ~chi_2+
#
BLOCK NMIX  # Neutralino Mixing Matrix
  1  1     9.99891043E-01   # N_11
  1  2     7.58852106E-05   # N_12
  1  3    -1.47530886E-02   # N_13
  1  4    -4.93385928E-04   # N_14
  2  1     3.15048943E-04   # N_21
  2  2     9.99646844E-01   # N_22
  2  3     2.63905571E-02   # N_23
  2  4     3.10264304E-03   # N_24
  3  1    -1.00815199E-02   # N_31
  3  2     1.64689390E-02   # N_32
  3  3    -7.06838468E-01   # N_33
  3  4     7.07111390E-01   # N_34
  4  1     1.07780569E-02   # N_41
  4  2    -2.08555854E-02   # N_42
  4  3     7.06728565E-01   # N_43
  4  4     7.07095194E-01   # N_44
#
BLOCK UMIX  # Chargino Mixing Matrix U
  1  1     9.99303533E-01   # U_11
  1  2     3.73155362E-02   # U_12
  2  1    -3.73155362E-02   # U_21
  2  2     9.99303533E-01   # U_22
#
BLOCK VMIX  # Chargino Mixing Matrix V
  1  1     9.99990382E-01   # V_11
  1  2    -4.38578693E-03   # V_12
  2  1    -4.38578693E-03   # V_21
  2  2    -9.99990382E-01   # V_22
#
BLOCK STOPMIX  # Stop Mixing Matrix
  1  1     9.98450554E-01   # cos(theta_t)
  1  2    -5.56461249E-02   # sin(theta_t)
  2  1     5.56461249E-02   # -sin(theta_t)
  2  2     9.98450554E-01   # cos(theta_t)
#
BLOCK SBOTMIX  # Sbottom Mixing Matrix
  1  1     9.99708870E-01   # cos(theta_b)
  1  2    -2.41283079E-02   # sin(theta_b)
  2  1     2.41283079E-02   # -sin(theta_b)
  2  2     9.99708870E-01   # cos(theta_b)
#
BLOCK STAUMIX  # Stau Mixing Matrix
  1  1    -7.06950803E-01   # cos(theta_tau)
  1  2     7.07262725E-01   # sin(theta_tau)
  2  1    -7.07262725E-01   # -sin(theta_tau)
  2  2    -7.06950803E-01   # cos(theta_tau)
#
BLOCK ALPHA  # Higgs mixing
          -5.00162274E-02   # Mixing angle in the neutral Higgs boson sector
#
BLOCK HMIX Q=  1.68717920E+03  # DRbar Higgs Parameters
         1    -3.00000000E+03   # mu(Q)MSSM           
         2     2.00000000E+01   # tan                 
         3     2.43841020E+02   # higgs               
         4     1.01723310E+07   # mA^2(Q)MSSM         
#
BLOCK GAUGE Q=  1.68717920E+03  # The gauge couplings
     1     3.62546185E-01   # gprime(Q) DRbar
     2     6.37788034E-01   # g(Q) DRbar
     3     1.02367785E+00   # g3(Q) DRbar
#
BLOCK AU Q=  1.68717920E+03  # The trilinear couplings
  1  1     2.70833488E-06   # A_u(Q) DRbar
  2  2     2.70837525E-06   # A_c(Q) DRbar
  3  3     2.94338000E+03   # A_t(Q) DRbar
#
BLOCK AD Q=  1.68717920E+03  # The trilinear couplings
  1  1     9.51068258E-07   # A_d(Q) DRbar
  2  2     9.51181430E-07   # A_s(Q) DRbar
  3  3     1.94693811E-06   # A_b(Q) DRbar
#
BLOCK AE Q=  1.68717920E+03  # The trilinear couplings
  1  1     4.11209292E-07   # A_e(Q) DRbar
  2  2     4.11229560E-07   # A_mu(Q) DRbar
  3  3     4.16937417E-07   # A_tau(Q) DRbar
#
BLOCK Yu Q=  1.68717920E+03  # The Yukawa couplings
  1  1     0.00000000E+00   # y_u(Q) DRbar
  2  2     0.00000000E+00   # y_c(Q) DRbar
  3  3     8.49986824E-01   # y_t(Q) DRbar
#
BLOCK Yd Q=  1.68717920E+03  # The Yukawa couplings
  1  1     0.00000000E+00   # y_d(Q) DRbar
  2  2     0.00000000E+00   # y_s(Q) DRbar
  3  3     3.78401384E-01   # y_b(Q) DRbar
#
BLOCK Ye Q=  1.68717920E+03  # The Yukawa couplings
  1  1     0.00000000E+00   # y_e(Q) DRbar
  2  2     0.00000000E+00   # y_mu(Q) DRbar
  3  3     2.02073740E-01   # y_tau(Q) DRbar
#
BLOCK MSOFT Q=  1.68717920E+03  # The soft SUSY breaking masses at the scale Q
         1     2.49900000E+02   # M_1(Q)              
         2     4.99900000E+02   # M_2(Q)              
         3     2.20000000E+03   # M_3(Q)              
        21    -3.73160610E+04   # M^2_Hd              
        22    -9.02574756E+06   # M^2_Hu              
        31     3.00000000E+03   # M_eL                
        32     3.00000000E+03   # M_muL               
        33     3.00000000E+03   # M_tauL              
        34     3.00000000E+03   # M_eR                
        35     3.00000000E+03   # M_muR               
        36     3.00000000E+03   # M_tauR              
        41     3.00000000E+03   # M_q1L               
        42     3.00000000E+03   # M_q2L               
        43     9.49899993E+02   # M_q3L               
        44     3.00000000E+03   # M_uR                
        45     3.00000000E+03   # M_cR                
        46     3.00000000E+03   # M_tR                
        47     3.00000000E+03   # M_dR                
        48     3.00000000E+03   # M_sR                
        49     3.00000000E+03   # M_bR                
#
#
#
#                             =================
#                             |The decay table|
#                             =================
#
# - The QCD corrections to the decays gluino -> squark  + quark
#                                     squark -> gaugino + quark_prime
#                                     squark -> squark_prime + Higgs
#                                     squark -> gluino  + quark
#   are included.
#
# - The multi-body decays for the inos, stops and sbottoms are included.
#
# - The loop induced decays for the gluino, neutralinos and stops
#   are included.
#
# - The SUSY decays of the top quark are included.
#
#
#         PDG            Width
DECAY         6     1.41200730E+00   # top decays
#          BR         NDA      ID1       ID2
     1.00000000E+00    2           5        24   # BR(t ->  b    W+)
#
#         PDG            Width
DECAY   1000021     6.14820338E+01   # gluino decays
#          BR         NDA      ID1       ID2
     2.47885636E-01    2     1000005        -5   # BR(~g -> ~b_1  bb)
     2.47885636E-01    2    -1000005         5   # BR(~g -> ~b_1* b )
     2.52114364E-01    2     1000006        -6   # BR(~g -> ~t_1  tb)
     2.52114364E-01    2    -1000006         6   # BR(~g -> ~t_1* t )
#
#         PDG            Width
DECAY   1000006     7.08351000E+00   # stop1 decays
#          BR         NDA      ID1       ID2
     1.86236421E-02    2     1000022         6   # BR(~t_1 -> ~chi_10 t )
     3.06978909E-01    2     1000023         6   # BR(~t_1 -> ~chi_20 t )
     6.74397449E-01    2     1000024         5   # BR(~t_1 -> ~chi_1+ b )
#
#         PDG            Width
DECAY   2000006     1.11479112E+02   # stop2 decays
#          BR         NDA      ID1       ID2
     5.88265182E-02    2     1000022         6   # BR(~t_2 -> ~chi_10 t )
     3.34499615E-04    2     1000023         6   # BR(~t_2 -> ~chi_20 t )
     0.00000000E+00    2     1000025         6   # BR(~t_2 -> ~chi_30 t )
     6.72735986E-04    2     1000024         5   # BR(~t_2 -> ~chi_1+ b )
     1.47612302E-04    2     1000037         5   # BR(~t_2 -> ~chi_2+ b )
     3.02143131E-01    2     1000021         6   # BR(~t_2 -> ~g      t )
     1.66262509E-01    2     1000006        25   # BR(~t_2 -> ~t_1    h )
     1.59591278E-01    2     1000006        23   # BR(~t_2 -> ~t_1    Z )
     3.12021716E-01    2     1000005        24   # BR(~t_2 -> ~b_1    W+)
#
#         PDG            Width
DECAY   1000005     6.93218566E+00   # sbottom1 decays
#          BR         NDA      ID1       ID2
     2.02382838E-02    2     1000022         5   # BR(~b_1 -> ~chi_10 b )
     3.47377034E-01    2     1000023         5   # BR(~b_1 -> ~chi_20 b )
     6.32384682E-01    2    -1000024         6   # BR(~b_1 -> ~chi_1- t )
#
#         PDG            Width
DECAY   2000005     5.28174281E+01   # sbottom2 decays
#          BR         NDA      ID1       ID2
     3.13138267E-02    2     1000022         5   # BR(~b_2 -> ~chi_10 b )
     4.59696399E-07    2     1000023         5   # BR(~b_2 -> ~chi_20 b )
     5.78343551E-05    2     1000025         5   # BR(~b_2 -> ~chi_30 b )
     5.65328730E-05    2     1000035         5   # BR(~b_2 -> ~chi_40 b )
     7.33163113E-07    2    -1000024         6   # BR(~b_2 -> ~chi_1- t )
     6.55700627E-01    2     1000021         5   # BR(~b_2 -> ~g      b )
     6.92496356E-02    2     1000005        25   # BR(~b_2 -> ~b_1    h )
     9.94366331E-02    2     1000005        23   # BR(~b_2 -> ~b_1    Z )
     1.44183718E-01    2     1000006       -24   # BR(~b_2 -> ~t_1    W-)
#
#         PDG            Width
DECAY   1000002     6.86885310E+01   # sup_L decays
#          BR         NDA      ID1       ID2
     6.04865007E-03    2     1000022         2   # BR(~u_L -> ~chi_10 u)
     1.60677456E-01    2     1000023         2   # BR(~u_L -> ~chi_20 u)
     3.73165666E-08    2     1000025         2   # BR(~u_L -> ~chi_30 u)
     6.18084909E-08    2     1000035         2   # BR(~u_L -> ~chi_40 u)
     3.21525320E-01    2     1000024         1   # BR(~u_L -> ~chi_1+ d)
     6.48007424E-09    2     1000037         1   # BR(~u_L -> ~chi_2+ d)
     5.11748468E-01    2     1000021         2   # BR(~u_L -> ~g      u)
#
#         PDG            Width
DECAY   2000002     4.15504000E+01   # sup_R decays
#          BR         NDA      ID1       ID2
     1.59696954E-01    2     1000022         2   # BR(~u_R -> ~chi_10 u)
     1.51371132E-08    2     1000023         2   # BR(~u_R -> ~chi_20 u)
     1.49623602E-08    2     1000025         2   # BR(~u_R -> ~chi_30 u)
     1.69528711E-08    2     1000035         2   # BR(~u_R -> ~chi_40 u)
     8.40302999E-01    2     1000021         2   # BR(~u_R -> ~g      u)
#
#         PDG            Width
DECAY   1000001     6.87394193E+01   # sdown_L decays
#          BR         NDA      ID1       ID2
     6.03639473E-03    2     1000022         1   # BR(~d_L -> ~chi_10 d)
     1.60575244E-01    2     1000023         1   # BR(~d_L -> ~chi_20 d)
     6.17049798E-08    2     1000025         1   # BR(~d_L -> ~chi_30 d)
     9.50130248E-08    2     1000035         1   # BR(~d_L -> ~chi_40 d)
     3.20956202E-01    2    -1000024         2   # BR(~d_L -> ~chi_1- u)
     4.87138315E-07    2    -1000037         2   # BR(~d_L -> ~chi_2- u)
     5.12431516E-01    2     1000021         1   # BR(~d_L -> ~g      d)
#
#         PDG            Width
DECAY   2000001     3.64678826E+01   # sdown_R decays
#          BR         NDA      ID1       ID2
     4.54677865E-02    2     1000022         1   # BR(~d_R -> ~chi_10 d)
     4.30955310E-09    2     1000023         1   # BR(~d_R -> ~chi_20 d)
     4.01548330E-09    2     1000025         1   # BR(~d_R -> ~chi_30 d)
     4.54842555E-09    2     1000035         1   # BR(~d_R -> ~chi_40 d)
     9.54532201E-01    2     1000021         1   # BR(~d_R -> ~g      d)
#
#         PDG            Width
DECAY   1000004     6.86885310E+01   # scharm_L decays
#          BR         NDA      ID1       ID2
     6.04865007E-03    2     1000022         4   # BR(~c_L -> ~chi_10 c)
     1.60677456E-01    2     1000023         4   # BR(~c_L -> ~chi_20 c)
     3.73165666E-08    2     1000025         4   # BR(~c_L -> ~chi_30 c)
     6.18084909E-08    2     1000035         4   # BR(~c_L -> ~chi_40 c)
     3.21525320E-01    2     1000024         3   # BR(~c_L -> ~chi_1+ s)
     6.48007424E-09    2     1000037         3   # BR(~c_L -> ~chi_2+ s)
     5.11748468E-01    2     1000021         4   # BR(~c_L -> ~g      c)
#
#         PDG            Width
DECAY   2000004     4.15504000E+01   # scharm_R decays
#          BR         NDA      ID1       ID2
     1.59696954E-01    2     1000022         4   # BR(~c_R -> ~chi_10 c)
     1.51371132E-08    2     1000023         4   # BR(~c_R -> ~chi_20 c)
     1.49623602E-08    2     1000025         4   # BR(~c_R -> ~chi_30 c)
     1.69528711E-08    2     1000035         4   # BR(~c_R -> ~chi_40 c)
     8.40302999E-01    2     1000021         4   # BR(~c_R -> ~g      c)
#
#         PDG            Width
DECAY   1000003     6.87394193E+01   # sstrange_L decays
#          BR         NDA      ID1       ID2
     6.03639473E-03    2     1000022         3   # BR(~s_L -> ~chi_10 s)
     1.60575244E-01    2     1000023         3   # BR(~s_L -> ~chi_20 s)
     6.17049798E-08    2     1000025         3   # BR(~s_L -> ~chi_30 s)
     9.50130248E-08    2     1000035         3   # BR(~s_L -> ~chi_40 s)
     3.20956202E-01    2    -1000024         4   # BR(~s_L -> ~chi_1- c)
     4.87138315E-07    2    -1000037         4   # BR(~s_L -> ~chi_2- c)
     5.12431516E-01    2     1000021         3   # BR(~s_L -> ~g      s)
#
#         PDG            Width
DECAY   2000003     3.64678826E+01   # sstrange_R decays
#          BR         NDA      ID1       ID2
     4.54677865E-02    2     1000022         3   # BR(~s_R -> ~chi_10 s)
     4.30955310E-09    2     1000023         3   # BR(~s_R -> ~chi_20 s)
     4.01548330E-09    2     1000025         3   # BR(~s_R -> ~chi_30 s)
     4.54842555E-09    2     1000035         3   # BR(~s_R -> ~chi_40 s)
     9.54532201E-01    2     1000021         3   # BR(~s_R -> ~g      s)
#
#         PDG            Width
DECAY   1000011     3.80940156E+01   # selectron_L decays
#          BR         NDA      ID1       ID2
     1.01751583E-01    2     1000022        11   # BR(~e_L -> ~chi_10 e-)
     2.99632715E-01    2     1000023        11   # BR(~e_L -> ~chi_20 e-)
     2.12071964E-09    2     1000025        11   # BR(~e_L -> ~chi_30 e-)
     3.85654572E-09    2     1000035        11   # BR(~e_L -> ~chi_40 e-)
     5.98615654E-01    2    -1000024        12   # BR(~e_L -> ~chi_1- nu_e)
     4.23639929E-08    2    -1000037        12   # BR(~e_L -> ~chi_2- nu_e)
#
#         PDG            Width
DECAY   2000011     1.54761025E+01   # selectron_R decays
#          BR         NDA      ID1       ID2
     9.99999901E-01    2     1000022        11   # BR(~e_R -> ~chi_10 e-)
     9.44884153E-08    2     1000023        11   # BR(~e_R -> ~chi_20 e-)
     2.14406674E-09    2     1000025        11   # BR(~e_R -> ~chi_30 e-)
     2.31462776E-09    2     1000035        11   # BR(~e_R -> ~chi_40 e-)
#
#         PDG            Width
DECAY   1000013     3.80940156E+01   # smuon_L decays
#          BR         NDA      ID1       ID2
     1.01751583E-01    2     1000022        13   # BR(~mu_L -> ~chi_10 mu-)
     2.99632715E-01    2     1000023        13   # BR(~mu_L -> ~chi_20 mu-)
     2.12071964E-09    2     1000025        13   # BR(~mu_L -> ~chi_30 mu-)
     3.85654572E-09    2     1000035        13   # BR(~mu_L -> ~chi_40 mu-)
     5.98615654E-01    2    -1000024        14   # BR(~mu_L -> ~chi_1- nu_mu)
     4.23639929E-08    2    -1000037        14   # BR(~mu_L -> ~chi_2- nu_mu)
#
#         PDG            Width
DECAY   2000013     1.54761025E+01   # smuon_R decays
#          BR         NDA      ID1       ID2
     9.99999901E-01    2     1000022        13   # BR(~mu_R -> ~chi_10 mu-)
     9.44884153E-08    2     1000023        13   # BR(~mu_R -> ~chi_20 mu-)
     2.14406674E-09    2     1000025        13   # BR(~mu_R -> ~chi_30 mu-)
     2.31462776E-09    2     1000035        13   # BR(~mu_R -> ~chi_40 mu-)
#
#         PDG            Width
DECAY   1000015     2.70432059E+01   # stau_1 decays
#          BR         NDA      ID1       ID2
     3.57494274E-01    2     1000022        15   # BR(~tau_1 -> ~chi_10  tau-)
     2.14341351E-01    2     1000023        15   # BR(~tau_1 -> ~chi_20  tau-)
     4.28164375E-01    2    -1000024        16   # BR(~tau_1 -> ~chi_1-  nu_tau)
#
#         PDG            Width
DECAY   2000015     2.65038746E+01   # stau_2 decays
#          BR         NDA      ID1       ID2
     3.65686858E-01    2     1000022        15   # BR(~tau_2 -> ~chi_10  tau-)
     2.11598196E-01    2     1000023        15   # BR(~tau_2 -> ~chi_20  tau-)
     1.62767142E-05    2     1000025        15   # BR(~tau_2 -> ~chi_30  tau-)
     1.42399368E-05    2     1000035        15   # BR(~tau_2 -> ~chi_40  tau-)
     4.22667956E-01    2    -1000024        16   # BR(~tau_2 -> ~chi_1-  nu_tau)
     1.64726014E-05    2    -1000037        16   # BR(~tau_2 -> ~chi_2-  nu_tau)
#
#         PDG            Width
DECAY   1000012     3.80954300E+01   # snu_eL decays
#          BR         NDA      ID1       ID2
     1.01645176E-01    2     1000022        12   # BR(~nu_eL -> ~chi_10 nu_e)
     2.99250829E-01    2     1000023        12   # BR(~nu_eL -> ~chi_20 nu_e)
     7.00110548E-09    2     1000025        12   # BR(~nu_eL -> ~chi_30 nu_e)
     9.94948199E-09    2     1000035        12   # BR(~nu_eL -> ~chi_40 nu_e)
     5.99103977E-01    2     1000024        11   # BR(~nu_eL -> ~chi_1+ e-)
     4.39636508E-10    2     1000037        11   # BR(~nu_eL -> ~chi_2+ e-)
#
#         PDG            Width
DECAY   1000014     3.80954300E+01   # snu_muL decays
#          BR         NDA      ID1       ID2
     1.01645176E-01    2     1000022        14   # BR(~nu_muL -> ~chi_10 nu_mu)
     2.99250829E-01    2     1000023        14   # BR(~nu_muL -> ~chi_20 nu_mu)
     7.00110548E-09    2     1000025        14   # BR(~nu_muL -> ~chi_30 nu_mu)
     9.94948199E-09    2     1000035        14   # BR(~nu_muL -> ~chi_40 nu_mu)
     5.99103977E-01    2     1000024        13   # BR(~nu_muL -> ~chi_1+ mu-)
     4.39636508E-10    2     1000037        13   # BR(~nu_muL -> ~chi_2+ mu-)
#
#         PDG            Width
DECAY   1000016     3.80965109E+01   # snu_tauL decays
#          BR         NDA      ID1       ID2
     1.01636674E-01    2     1000022        16   # BR(~nu_tauL -> ~chi_10 nu_tau)
     2.99224182E-01    2     1000023        16   # BR(~nu_tauL -> ~chi_20 nu_tau)
     6.77820752E-09    2     1000025        16   # BR(~nu_tauL -> ~chi_30 nu_tau)
     9.62654325E-09    2     1000035        16   # BR(~nu_tauL -> ~chi_40 nu_tau)
     5.99136974E-01    2     1000024        15   # BR(~nu_tauL -> ~chi_1+ tau-)
     2.15307284E-06    2     1000037        15   # BR(~nu_tauL -> ~chi_2+ tau-)
#
#         PDG            Width
DECAY   1000024     4.72643519E-06   # chargino1+ decays
#          BR         NDA      ID1       ID2
     1.00000000E+00    2     1000022        24   # BR(~chi_1+ -> ~chi_10  W+)
#
#         PDG            Width
DECAY   1000037     8.48206717E+01   # chargino2+ decays
#          BR         NDA      ID1       ID2
     1.31156759E-01    2     1000006        -5   # BR(~chi_2+ -> ~t_1     bb)
     6.50130273E-01    2    -1000005         6   # BR(~chi_2+ -> ~b_1*    t )
     2.46455051E-07    2    -1000015        16   # BR(~chi_2+ -> ~tau_1+  nu_tau)
     6.53617173E-02    2     1000024        23   # BR(~chi_2+ -> ~chi_1+  Z )
     2.11499915E-02    2     1000022        24   # BR(~chi_2+ -> ~chi_10  W+)
     6.36149854E-02    2     1000023        24   # BR(~chi_2+ -> ~chi_20  W+)
     6.85860275E-02    2     1000024        25   # BR(~chi_2+ -> ~chi_1+  h )
#
#         PDG            Width
DECAY   1000022     0.00000000E+00   # neutralino1 decays
#
#         PDG            Width
DECAY   1000023     4.70805117E-06   # neutralino2 decays
#          BR         NDA      ID1       ID2
     8.05719872E-01    2     1000022        23   # BR(~chi_20 -> ~chi_10   Z )
     1.94280128E-01    2     1000022        25   # BR(~chi_20 -> ~chi_10   h )
#
#         PDG            Width
DECAY   1000025     8.50330363E+01   # neutralino3 decays
#          BR         NDA      ID1       ID2
     1.15590366E-02    2     1000022        23   # BR(~chi_30 -> ~chi_10   Z )
     4.01274714E-02    2     1000023        23   # BR(~chi_30 -> ~chi_20   Z )
     6.34332018E-02    2     1000024       -24   # BR(~chi_30 -> ~chi_1+   W-)
     6.34332018E-02    2    -1000024        24   # BR(~chi_30 -> ~chi_1-   W+)
     1.05038509E-02    2     1000022        25   # BR(~chi_30 -> ~chi_10   h )
     2.55544945E-02    2     1000023        25   # BR(~chi_30 -> ~chi_20   h )
     3.28306965E-01    2     1000006        -6   # BR(~chi_30 -> ~t_1      tb)
     3.28306965E-01    2    -1000006         6   # BR(~chi_30 -> ~t_1*     t )
     6.43871288E-02    2     1000005        -5   # BR(~chi_30 -> ~b_1      bb)
     6.43871288E-02    2    -1000005         5   # BR(~chi_30 -> ~b_1*     b )
     2.77794256E-07    2     1000015       -15   # BR(~chi_30 -> ~tau_1-   tau+)
     2.77794256E-07    2    -1000015        15   # BR(~chi_30 -> ~tau_1+   tau-)
#
#         PDG            Width
DECAY   1000035     8.40744274E+01   # neutralino4 decays
#          BR         NDA      ID1       ID2
     1.02343951E-02    2     1000022        23   # BR(~chi_40 -> ~chi_10   Z )
     2.53485760E-02    2     1000023        23   # BR(~chi_40 -> ~chi_20   Z )
     6.41754046E-02    2     1000024       -24   # BR(~chi_40 -> ~chi_1+   W-)
     6.41754046E-02    2    -1000024        24   # BR(~chi_40 -> ~chi_1-   W+)
     1.21842335E-02    2     1000022        25   # BR(~chi_40 -> ~chi_10   h )
     4.33535481E-02    2     1000023        25   # BR(~chi_40 -> ~chi_20   h )
     3.25138812E-01    2     1000006        -6   # BR(~chi_40 -> ~t_1      tb)
     3.25138812E-01    2    -1000006         6   # BR(~chi_40 -> ~t_1*     t )
     6.51252135E-02    2     1000005        -5   # BR(~chi_40 -> ~b_1      bb)
     6.51252135E-02    2    -1000005         5   # BR(~chi_40 -> ~b_1*     b )
     1.93894238E-07    2     1000015       -15   # BR(~chi_40 -> ~tau_1-   tau+)
     1.93894238E-07    2    -1000015        15   # BR(~chi_40 -> ~tau_1+   tau-)
#
#         PDG            Width
DECAY        25     3.59957673E-03   # h decays
#          BR         NDA      ID1       ID2
     5.66279407E-01    2           5        -5   # BR(h -> b       bb     )
     7.19494309E-02    2         -15        15   # BR(h -> tau+    tau-   )
     2.54703902E-04    2         -13        13   # BR(h -> mu+     mu-    )
     5.40745413E-04    2           3        -3   # BR(h -> s       sb     )
     2.34951032E-02    2           4        -4   # BR(h -> c       cb     )
     7.61039943E-02    2          21        21   # BR(h -> g       g      )
     2.60005141E-03    2          22        22   # BR(h -> gam     gam    )
     1.71137659E-03    2          22        23   # BR(h -> Z       gam    )
     2.28561382E-01    2          24       -24   # BR(h -> W+      W-     )
     2.85038046E-02    2          23        23   # BR(h -> Z       Z      )
#
#         PDG            Width
DECAY        35     3.44582652E+01   # H decays
#          BR         NDA      ID1       ID2
     8.94562282E-01    2           5        -5   # BR(H -> b       bb     )
     7.21657842E-02    2         -15        15   # BR(H -> tau+    tau-   )
     2.55160968E-04    2         -13        13   # BR(H -> mu+     mu-    )
     3.13339423E-04    2           3        -3   # BR(H -> s       sb     )
     8.78338168E-08    2           4        -4   # BR(H -> c       cb     )
     8.76198132E-03    2           6        -6   # BR(H -> t       tb     )
     1.35788014E-05    2          21        21   # BR(H -> g       g      )
     6.07296005E-08    2          22        22   # BR(H -> gam     gam    )
     3.58507097E-09    2          23        22   # BR(H -> Z       gam    )
     8.56298970E-07    2          24       -24   # BR(H -> W+      W-     )
     4.27621489E-07    2          23        23   # BR(H -> Z       Z      )
     6.14432148E-06    2          25        25   # BR(H -> h       h      )
     4.20980152E-24    2          36        36   # BR(H -> A       A      )
     3.04999115E-21    2          23        36   # BR(H -> Z       A      )
     8.49286357E-04    2     1000024  -1000024   # BR(H -> ~chi_1+ ~chi_1-)
     4.41281395E-05    2     1000022   1000022   # BR(H -> ~chi_10 ~chi_10)
     4.24413633E-04    2     1000023   1000023   # BR(H -> ~chi_20 ~chi_20)
     2.77043143E-04    2     1000022   1000023   # BR(H -> ~chi_10 ~chi_20)
     2.23203394E-02    2     1000006  -1000006   # BR(H -> ~t_1    ~t_1*  )
     5.08254020E-06    2     1000005  -1000005   # BR(H -> ~b_1    ~b_1*  )
#
#         PDG            Width
DECAY        36     3.36980550E+01   # A decays
#          BR         NDA      ID1       ID2
     9.14783718E-01    2           5        -5   # BR(A -> b       bb     )
     7.37939910E-02    2         -15        15   # BR(A -> tau+    tau-   )
     2.60917553E-04    2         -13        13   # BR(A -> mu+     mu-    )
     3.20460935E-04    2           3        -3   # BR(A -> s       sb     )
     9.04295336E-08    2           4        -4   # BR(A -> c       cb     )
     9.01596152E-03    2           6        -6   # BR(A -> t       tb     )
     2.65511439E-05    2          21        21   # BR(A -> g       g      )
     7.08736422E-08    2          22        22   # BR(A -> gam     gam    )
     2.61483788E-08    2          23        22   # BR(A -> Z       gam    )
     8.72390025E-07    2          23        25   # BR(A -> Z       h      )
     9.69781705E-04    2     1000024  -1000024   # BR(A -> ~chi_1+ ~chi_1-)
     4.61193754E-05    2     1000022   1000022   # BR(A -> ~chi_10 ~chi_10)
     4.84574903E-04    2     1000023   1000023   # BR(A -> ~chi_20 ~chi_20)
     2.96864245E-04    2     1000022   1000023   # BR(A -> ~chi_10 ~chi_20)
#
#         PDG            Width
DECAY        37     3.69874821E+01   # H+ decays
#          BR         NDA      ID1       ID2
     1.46036542E-03    2           4        -5   # BR(H+ -> c       bb     )
     6.72555813E-02    2         -15        16   # BR(H+ -> tau+    nu_tau )
     2.37799331E-04    2         -13        14   # BR(H+ -> mu+     nu_mu  )
     9.34632712E-06    2           2        -5   # BR(H+ -> u       bb     )
     1.39748614E-05    2           2        -3   # BR(H+ -> u       sb     )
     2.87507837E-04    2           4        -3   # BR(H+ -> c       sb     )
     9.19463842E-01    2           6        -5   # BR(H+ -> t       bb     )
     7.96167512E-07    2          24        25   # BR(H+ -> W+      h      )
     5.38722348E-14    2          24        36   # BR(H+ -> W+      A      )
     5.28725023E-04    2     1000024   1000022   # BR(H+ -> ~chi_1+ ~chi_10)
     4.90851438E-11    2     1000024   1000023   # BR(H+ -> ~chi_1+ ~chi_20)
     1.07420619E-02    2     1000006  -1000005   # BR(H+ -> ~t_1    ~b_1*  )
