#
#                              ======================
#                              | THE SUSYHIT OUTPUT |
#                              ======================
#
#
#              ------------------------------------------------------
#              |     This is the output of the SUSY-HIT package     |
#              |  created by A.Djouadi, M.Muehlleitner and M.Spira. |
#              |  In case of problems with SUSY-HIT email to        |
#              |           margarete.muehlleitner@kit.edu           |
#              |           michael.spira@psi.ch                     |
#              |           abdelhak.djouadi@cern.ch                 |
#              ------------------------------------------------------
#
#              ------------------------------------------------------
#              |  SUSY Les Houches Accord - MSSM Spectrum + Decays  |
#              |              based on the decay programs           |
#              |                                                    |
#              |                     SDECAY 1.5                     |
#              |                                                    |
#              |  Authors: M.Muhlleitner, A.Djouadi and Y.Mambrini  |
#              |  Ref.:    Comput.Phys.Commun.168(2005)46           |
#              |           [hep-ph/0311167]                         |
#              |                                                    |
#              |                     HDECAY 3.4                     |
#              |                                                    |
#              |  By: A.Djouadi,J.Kalinowski,M.Muhlleitner,M.Spira  |
#              |  Ref.:    Comput.Phys.Commun.108(1998)56           |
#              |           [hep-ph/9704448]                         |
#              |                                                    |
#              |                                                    |
#              |  If not stated otherwise all DRbar couplings and   |
#              |  soft SUSY breaking masses are given at the scale  |
#              |  Q=  0.91187600E+02
#              |                                                    |
#              ------------------------------------------------------
#
#
BLOCK DCINFO  # Decay Program information
     1   SDECAY/HDECAY # decay calculator
     2   1.5  /3.4    # version number
#
BLOCK SPINFO  # Spectrum calculator information
     1   SuSpect     # RGE +Spectrum calculator            
     2   2.43         # version number                     
#
BLOCK MODSEL  # Model selection
     1     2   # GMSB                                              
#
BLOCK SMINPUTS  # Standard Model inputs
         1     1.27932904E+02   # alpha_em^-1(M_Z)^MSbar
         2     1.16639000E-05   # G_F [GeV^-2]
         3     1.17200000E-01   # alpha_S(M_Z)^MSbar
         4     9.11870000E+01   # M_Z pole mass
         5     4.25000000E+00   # mb(mb)^MSbar
         6     1.72900000E+02   # mt pole mass
         7     1.77700000E+00   # mtau pole mass
#
BLOCK MINPAR  # Input parameters - minimal models
#
BLOCK EXTPAR  # Input parameters - non-minimal models
         0     9.11876000E+01   # EWSB                
         1     6.57000000E+02   # M_1                 
         2     3.00000000E+03   # M_2                 
         3     1.50000000E+03   # M_3                 
        11     0.00000000E+00   # A_t                 
        12     0.00000000E+00   # A_b                 
        13     0.00000000E+00   # A_tau               
        14     0.00000000E+00   # A_u                 
        15     0.00000000E+00   # A_d                 
        16     0.00000000E+00   # A_e                 
        23     6.50000000E+02   # mu(EWSB)            
        25     1.50000000E+00   # tanbeta(in)         
        26     2.00000000E+03   # MA_pole             
        31     5.00000000E+03   # M_eL                
        32     5.00000000E+03   # M_muL               
        33     5.00000000E+03   # M_tauL              
        34     5.00000000E+03   # M_eR                
        35     5.00000000E+03   # M_muR               
        36     5.00000000E+03   # M_tauR              
        41     5.00000000E+03   # M_q1L               
        42     5.00000000E+03   # M_q2L               
        43     5.00000000E+03   # M_q3L               
        44     5.00000000E+03   # M_uR                
        45     5.00000000E+03   # M_cR                
        46     5.00000000E+03   # M_tR                
        47     5.00000000E+03   # M_dR                
        48     5.00000000E+03   # M_sR                
        49     5.00000000E+03   # M_bR                
#
BLOCK MASS  # Mass Spectrum
# PDG code           mass       particle
        24     8.05394400E+01   # W+
        25     1.26000000E+02   # h
        35     2.00418653E+03   # H
        36     2.00000000E+03   # A
        37     2.00180537E+03   # H+
         5     4.87877839E+00   # b-quark pole mass calculated from mb(mb)_Msbar
   1000001     4.98868337E+03   # ~d_L
   2000001     4.98857374E+03   # ~d_R
   1000002     4.98843831E+03   # ~u_L
   2000002     4.98849634E+03   # ~u_R
   1000003     4.98868337E+03   # ~s_L
   2000003     4.98857374E+03   # ~s_R
   1000004     4.98843831E+03   # ~c_L
   2000004     4.98849634E+03   # ~c_R
   1000005     4.98835679E+03   # ~b_1
   2000005     4.98890177E+03   # ~b_2
   1000006     5.11642809E+03   # ~t_1
   2000006     5.41455138E+03   # ~t_2
   1000011     5.00008233E+03   # ~e_L
   2000011     5.00007602E+03   # ~e_R
   1000012     4.99984165E+03   # ~nu_eL
   1000013     5.00008233E+03   # ~mu_L
   2000013     5.00007602E+03   # ~mu_R
   1000014     4.99984165E+03   # ~nu_muL
   1000015     4.99990613E+03   # ~tau_1
   2000015     5.00025285E+03   # ~tau_2
   1000016     4.99984165E+03   # ~nu_tauL
   1000021     1.61386929E+03   # ~g
   1000022     6.51766301E+02   # ~chi_10
   1000023    -6.96940893E+02   # ~chi_20
   1000025     7.38929084E+02   # ~chi_30
   1000035     3.12900870E+03   # ~chi_40
   1000024     6.94412119E+02   # ~chi_1+
   1000037     3.12900797E+03   # ~chi_2+
   1000039     4.62272727E-08   # ~gravitino
#
BLOCK NMIX  # Neutralino Mixing Matrix
  1  1     6.98946479E-01   # N_11
  1  2    -2.23755730E-02   # N_12
  1  3     5.08822936E-01   # N_13
  1  4    -5.02068096E-01   # N_14
  2  1     6.27130207E-03   # N_21
  2  2    -4.06604328E-03   # N_22
  2  3    -7.06788246E-01   # N_23
  2  4    -7.07385689E-01   # N_24
  3  1     7.15146242E-01   # N_31
  3  2     2.27233109E-02   # N_32
  3  3    -4.91082752E-01   # N_33
  3  4     4.96877484E-01   # N_34
  4  1     5.85965871E-04   # N_41
  4  2    -9.99483092E-01   # N_42
  4  3    -1.96805722E-02   # N_43
  4  4     2.54141605E-02   # N_44
#
BLOCK UMIX  # Chargino Mixing Matrix U
  1  1    -2.78215887E-02   # U_11
  1  2     9.99612905E-01   # U_12
  2  1     9.99612905E-01   # U_21
  2  2     2.78215887E-02   # U_22
#
BLOCK VMIX  # Chargino Mixing Matrix V
  1  1    -3.59326864E-02   # V_11
  1  2     9.99354213E-01   # V_12
  2  1     9.99354213E-01   # V_21
  2  2     3.59326864E-02   # V_22
#
BLOCK STOPMIX  # Stop Mixing Matrix
  1  1     9.99959447E-01   # cos(theta_t)
  1  2    -9.00579566E-03   # sin(theta_t)
  2  1     9.00579566E-03   # -sin(theta_t)
  2  2     9.99959447E-01   # cos(theta_t)
#
BLOCK SBOTMIX  # Sbottom Mixing Matrix
  1  1     6.32000136E-01   # cos(theta_b)
  1  2     7.74968276E-01   # sin(theta_b)
  2  1    -7.74968276E-01   # -sin(theta_b)
  2  2     6.32000136E-01   # cos(theta_b)
#
BLOCK STAUMIX  # Stau Mixing Matrix
  1  1     7.00650764E-01   # cos(theta_tau)
  1  2     7.13504385E-01   # sin(theta_tau)
  2  1    -7.13504385E-01   # -sin(theta_tau)
  2  2     7.00650764E-01   # cos(theta_tau)
#
BLOCK ALPHA  # Higgs mixing
          -5.90206578E-01   # Mixing angle in the neutral Higgs boson sector
#
BLOCK HMIX Q=  9.11876000E+01  # DRbar Higgs Parameters
         1     6.50000000E+02   # mu(Q)               
         2     1.49999979E+00   # tanbeta(Q)          
         3     2.51968575E+02   # vev(Q)              
         4     3.68332451E+06   # MA^2(Q)             
#
BLOCK GAUGE Q=  9.11876000E+01  # The gauge couplings
     1     3.52896758E-01   # gprime(Q) DRbar
     2     6.27898258E-01   # g(Q) DRbar
     3     1.08507304E+00   # g3(Q) DRbar
#
BLOCK AU Q=  9.11876000E+01  # The trilinear couplings
  1  1     0.00000000E+00   # A_u(Q) DRbar
  2  2     0.00000000E+00   # A_c(Q) DRbar
  3  3     0.00000000E+00   # A_t(Q) DRbar
#
BLOCK AD Q=  9.11876000E+01  # The trilinear couplings
  1  1     0.00000000E+00   # A_d(Q) DRbar
  2  2     0.00000000E+00   # A_s(Q) DRbar
  3  3     0.00000000E+00   # A_b(Q) DRbar
#
BLOCK AE Q=  9.11876000E+01  # The trilinear couplings
  1  1     0.00000000E+00   # A_e(Q) DRbar
  2  2     0.00000000E+00   # A_mu(Q) DRbar
  3  3     0.00000000E+00   # A_tau(Q) DRbar
#
BLOCK Yu Q=  9.11876000E+01  # The Yukawa couplings
  1  1     0.00000000E+00   # y_u(Q) DRbar
  2  2     0.00000000E+00   # y_c(Q) DRbar
  3  3     1.02606891E+00   # y_t(Q) DRbar
#
BLOCK Yd Q=  9.11876000E+01  # The Yukawa couplings
  1  1     0.00000000E+00   # y_d(Q) DRbar
  2  2     0.00000000E+00   # y_s(Q) DRbar
  3  3     2.72064788E-02   # y_b(Q) DRbar
#
BLOCK Ye Q=  9.11876000E+01  # The Yukawa couplings
  1  1     0.00000000E+00   # y_e(Q) DRbar
  2  2     0.00000000E+00   # y_mu(Q) DRbar
  3  3     1.79881168E-02   # y_tau(Q) DRbar
#
BLOCK MSOFT Q=  9.11876000E+01  # The soft SUSY breaking masses at the scale Q
         1     6.57000000E+02   # M_1                 
         2     3.00000000E+03   # M_2                 
         3     1.50000000E+03   # M_3                 
        14     0.00000000E+00   # A_u                 
        15     0.00000000E+00   # A_d                 
        16     0.00000000E+00   # A_e                 
        21     2.58295418E+06   # M^2_Hd              
        22    -5.86050106E+06   # M^2_Hu              
        31     5.00000000E+03   # M_eL                
        32     5.00000000E+03   # M_muL               
        33     5.00000000E+03   # M_tauL              
        34     5.00000000E+03   # M_eR                
        35     5.00000000E+03   # M_muR               
        36     5.00000000E+03   # M_tauR              
        41     5.00000000E+03   # M_q1L               
        42     5.00000000E+03   # M_q2L               
        43     5.00000000E+03   # M_q3L               
        44     5.00000000E+03   # M_uR                
        45     5.00000000E+03   # M_cR                
        46     5.00000000E+03   # M_tR                
        47     5.00000000E+03   # M_dR                
        48     5.00000000E+03   # M_sR                
        49     5.00000000E+03   # M_bR                
#
#
#
#                             =================
#                             |The decay table|
#                             =================
#
# - The QCD corrections to the decays gluino -> squark  + quark
#                                     squark -> gaugino + quark_prime
#                                     squark -> squark_prime + Higgs
#                                     squark -> gluino  + quark
#   are included.
#
# - The multi-body decays for the inos, stops and sbottoms are included.
#
# - The loop induced decays for the gluino, neutralinos and stops
#   are included.
#
# - The SUSY decays of the top quark are included.
#
# - Possible decays of the NLSP in GMSB models are included.
#
#
#         PDG            Width
DECAY         6     1.37371719E+00   # top decays
#          BR         NDA      ID1       ID2
     1.00000000E+00    2           5        24   # BR(t ->  b    W+)
#
#         PDG            Width
DECAY   1000021     3.01725239E-04   # gluino decays
#          BR         NDA      ID1       ID2
     1.41354082E-02    2     1000022        21   # BR(~g -> ~chi_10 g)
     2.55537483E-02    2     1000023        21   # BR(~g -> ~chi_20 g)
     1.12876765E-02    2     1000025        21   # BR(~g -> ~chi_30 g)
#          BR         NDA      ID1       ID2
     1.95487958E-05    2     1000039        21   # BR(~g -> ~G      g)
#           BR         NDA      ID1       ID2       ID3
     6.43351088E-03    3     1000022         1        -1   # BR(~g -> ~chi_10 d  db)
     7.91244661E-07    3     1000023         1        -1   # BR(~g -> ~chi_20 d  db)
     4.26096650E-03    3     1000025         1        -1   # BR(~g -> ~chi_30 d  db)
     1.99905794E-02    3     1000022         2        -2   # BR(~g -> ~chi_10 u  ub)
     7.30334316E-07    3     1000023         2        -2   # BR(~g -> ~chi_20 u  ub)
     1.57819974E-02    3     1000025         2        -2   # BR(~g -> ~chi_30 u  ub)
     6.43351088E-03    3     1000022         3        -3   # BR(~g -> ~chi_10 s  sb)
     7.91244661E-07    3     1000023         3        -3   # BR(~g -> ~chi_20 s  sb)
     4.26096650E-03    3     1000025         3        -3   # BR(~g -> ~chi_30 s  sb)
     1.99905794E-02    3     1000022         4        -4   # BR(~g -> ~chi_10 c  cb)
     7.30334316E-07    3     1000023         4        -4   # BR(~g -> ~chi_20 c  cb)
     1.57819974E-02    3     1000025         4        -4   # BR(~g -> ~chi_30 c  cb)
     6.53755823E-03    3     1000022         5        -5   # BR(~g -> ~chi_10 b  bb)
     2.36112458E-04    3     1000023         5        -5   # BR(~g -> ~chi_20 b  bb)
     4.38191662E-03    3     1000025         5        -5   # BR(~g -> ~chi_30 b  bb)
     1.07290639E-01    3     1000022         6        -6   # BR(~g -> ~chi_10 t  tb)
     1.64333931E-01    3     1000023         6        -6   # BR(~g -> ~chi_20 t  tb)
     1.01605355E-01    3     1000025         6        -6   # BR(~g -> ~chi_30 t  tb)
     1.22927689E-04    3     1000024         1        -2   # BR(~g -> ~chi_1+ d  ub)
     1.22927689E-04    3    -1000024         2        -1   # BR(~g -> ~chi_1- u  db)
     1.22927689E-04    3     1000024         3        -4   # BR(~g -> ~chi_1+ s  cb)
     1.22927689E-04    3    -1000024         4        -3   # BR(~g -> ~chi_1- c  sb)
     2.35594622E-01    3     1000024         5        -6   # BR(~g -> ~chi_1+ b  tb)
     2.35594622E-01    3    -1000024         6        -5   # BR(~g -> ~chi_1- t  bb)
#
#         PDG            Width
DECAY   1000006     3.14199218E+02   # stop1 decays
#          BR         NDA      ID1       ID2
     5.64190370E-02    2     1000022         6   # BR(~t_1 -> ~chi_10 t )
     1.12787614E-01    2     1000023         6   # BR(~t_1 -> ~chi_20 t )
     5.81765454E-02    2     1000025         6   # BR(~t_1 -> ~chi_30 t )
     2.43831498E-02    2     1000035         6   # BR(~t_1 -> ~chi_40 t )
     6.57159497E-05    2     1000024         5   # BR(~t_1 -> ~chi_1+ b )
     4.85564649E-02    2     1000037         5   # BR(~t_1 -> ~chi_2+ b )
     6.83684697E-01    2     1000021         6   # BR(~t_1 -> ~g      t )
     6.44191238E-03    2     1000005        24   # BR(~t_1 -> ~b_1    W+)
     9.48486345E-03    2     2000005        24   # BR(~t_1 -> ~b_2    W+)
#
#         PDG            Width
DECAY   2000006     3.92205690E+02   # stop2 decays
#          BR         NDA      ID1       ID2
     6.36583221E-02    2     1000022         6   # BR(~t_2 -> ~chi_10 t )
     9.64590574E-02    2     1000023         6   # BR(~t_2 -> ~chi_20 t )
     6.09258139E-02    2     1000025         6   # BR(~t_2 -> ~chi_30 t )
    -8.01446796E-06    2     1000035         6   # BR(~t_2 -> ~chi_40 t )
     1.93116933E-01    2     1000024         5   # BR(~t_2 -> ~chi_1+ b )
    -1.57826330E-05    2     1000037         5   # BR(~t_2 -> ~chi_2+ b )
     5.85851209E-01    2     1000021         6   # BR(~t_2 -> ~g      t )
    -6.24099278E-05    2     1000006        25   # BR(~t_2 -> ~t_1    h )
     1.12171606E-05    2     1000006        23   # BR(~t_2 -> ~t_1    Z )
     2.54584049E-05    2     1000005        24   # BR(~t_2 -> ~b_1    W+)
     3.81963639E-05    2     2000005        24   # BR(~t_2 -> ~b_2    W+)
#
#         PDG            Width
DECAY   1000005     2.37336689E+02   # sbottom1 decays
#          BR         NDA      ID1       ID2
     5.03247698E-03    2     1000022         5   # BR(~b_1 -> ~chi_10 b )
     8.35982889E-05    2     1000023         5   # BR(~b_1 -> ~chi_20 b )
     3.38162696E-03    2     1000025         5   # BR(~b_1 -> ~chi_30 b )
     9.29249709E-03    2     1000035         5   # BR(~b_1 -> ~chi_40 b )
     8.26895862E-02    2    -1000024         6   # BR(~b_1 -> ~chi_1- t )
     1.86602100E-02    2    -1000037         6   # BR(~b_1 -> ~chi_2- t )
     8.80860004E-01    2     1000021         5   # BR(~b_1 -> ~g      b )
#
#         PDG            Width
DECAY   2000005     2.73988474E+02   # sbottom2 decays
#          BR         NDA      ID1       ID2
     1.86866660E-03    2     1000022         5   # BR(~b_2 -> ~chi_10 b )
     1.08031338E-04    2     1000023         5   # BR(~b_2 -> ~chi_20 b )
     2.70974885E-03    2     1000025         5   # BR(~b_2 -> ~chi_30 b )
     1.74069235E-02    2     1000035         5   # BR(~b_2 -> ~chi_40 b )
     1.80231930E-01    2    -1000024         6   # BR(~b_2 -> ~chi_1- t )
     3.49671926E-02    2    -1000037         6   # BR(~b_2 -> ~chi_2- t )
     7.62707507E-01    2     1000021         5   # BR(~b_2 -> ~g      b )
#
#         PDG            Width
DECAY   1000002     2.30622337E+02   # sup_L decays
#          BR         NDA      ID1       ID2
     9.32908447E-04    2     1000022         2   # BR(~u_L -> ~chi_10 u)
     6.58323331E-07    2     1000023         2   # BR(~u_L -> ~chi_20 u)
     1.92444177E-03    2     1000025         2   # BR(~u_L -> ~chi_30 u)
     3.02235075E-02    2     1000035         2   # BR(~u_L -> ~chi_40 u)
     2.03436427E-04    2     1000024         1   # BR(~u_L -> ~chi_1+ d)
     6.04447405E-02    2     1000037         1   # BR(~u_L -> ~chi_2+ d)
     9.06270307E-01    2     1000021         2   # BR(~u_L -> ~g      u)
#
#         PDG            Width
DECAY   2000002     2.19208795E+02   # sup_R decays
#          BR         NDA      ID1       ID2
     2.28440881E-02    2     1000022         2   # BR(~u_R -> ~chi_10 u)
     1.83001089E-06    2     1000023         2   # BR(~u_R -> ~chi_20 u)
     2.36807240E-02    2     1000025         2   # BR(~u_R -> ~chi_30 u)
     6.13888794E-09    2     1000035         2   # BR(~u_R -> ~chi_40 u)
     9.53473352E-01    2     1000021         2   # BR(~u_R -> ~g      u)
#
#         PDG            Width
DECAY   1000001     2.30626771E+02   # sdown_L decays
#          BR         NDA      ID1       ID2
     1.86056539E-03    2     1000022         1   # BR(~d_L -> ~chi_10 d)
     2.16334669E-06    2     1000023         1   # BR(~d_L -> ~chi_20 d)
     9.70085803E-04    2     1000025         1   # BR(~d_L -> ~chi_30 d)
     3.02415137E-02    2     1000035         1   # BR(~d_L -> ~chi_40 d)
     1.21962972E-04    2    -1000024         2   # BR(~d_L -> ~chi_1- u)
     6.04854884E-02    2    -1000037         2   # BR(~d_L -> ~chi_2- u)
     9.06318220E-01    2     1000021         1   # BR(~d_L -> ~g      d)
#
#         PDG            Width
DECAY   2000001     2.11564310E+02   # sdown_R decays
#          BR         NDA      ID1       ID2
     5.91747803E-03    2     1000022         1   # BR(~d_R -> ~chi_10 d)
     4.74041725E-07    2     1000023         1   # BR(~d_R -> ~chi_20 d)
     6.13420010E-03    2     1000025         1   # BR(~d_R -> ~chi_30 d)
     1.59026447E-09    2     1000035         1   # BR(~d_R -> ~chi_40 d)
     9.87947846E-01    2     1000021         1   # BR(~d_R -> ~g      d)
#
#         PDG            Width
DECAY   1000004     2.30622337E+02   # scharm_L decays
#          BR         NDA      ID1       ID2
     9.32908447E-04    2     1000022         4   # BR(~c_L -> ~chi_10 c)
     6.58323331E-07    2     1000023         4   # BR(~c_L -> ~chi_20 c)
     1.92444177E-03    2     1000025         4   # BR(~c_L -> ~chi_30 c)
     3.02235075E-02    2     1000035         4   # BR(~c_L -> ~chi_40 c)
     2.03436427E-04    2     1000024         3   # BR(~c_L -> ~chi_1+ s)
     6.04447405E-02    2     1000037         3   # BR(~c_L -> ~chi_2+ s)
     9.06270307E-01    2     1000021         4   # BR(~c_L -> ~g      c)
#
#         PDG            Width
DECAY   2000004     2.19208795E+02   # scharm_R decays
#          BR         NDA      ID1       ID2
     2.28440881E-02    2     1000022         4   # BR(~c_R -> ~chi_10 c)
     1.83001089E-06    2     1000023         4   # BR(~c_R -> ~chi_20 c)
     2.36807240E-02    2     1000025         4   # BR(~c_R -> ~chi_30 c)
     6.13888794E-09    2     1000035         4   # BR(~c_R -> ~chi_40 c)
     9.53473352E-01    2     1000021         4   # BR(~c_R -> ~g      c)
#
#         PDG            Width
DECAY   1000003     2.30626771E+02   # sstrange_L decays
#          BR         NDA      ID1       ID2
     1.86056539E-03    2     1000022         3   # BR(~s_L -> ~chi_10 s)
     2.16334669E-06    2     1000023         3   # BR(~s_L -> ~chi_20 s)
     9.70085803E-04    2     1000025         3   # BR(~s_L -> ~chi_30 s)
     3.02415137E-02    2     1000035         3   # BR(~s_L -> ~chi_40 s)
     1.21962972E-04    2    -1000024         4   # BR(~s_L -> ~chi_1- c)
     6.04854884E-02    2    -1000037         4   # BR(~s_L -> ~chi_2- c)
     9.06318220E-01    2     1000021         3   # BR(~s_L -> ~g      s)
#
#         PDG            Width
DECAY   2000003     2.11564310E+02   # sstrange_R decays
#          BR         NDA      ID1       ID2
     5.91747803E-03    2     1000022         3   # BR(~s_R -> ~chi_10 s)
     4.74041725E-07    2     1000023         3   # BR(~s_R -> ~chi_20 s)
     6.13420010E-03    2     1000025         3   # BR(~s_R -> ~chi_30 s)
     1.59026447E-09    2     1000035         3   # BR(~s_R -> ~chi_40 s)
     9.87947846E-01    2     1000021         3   # BR(~s_R -> ~g      s)
#
#         PDG            Width
DECAY   1000011     2.77632406E+01   # selectron_L decays
#          BR         NDA      ID1       ID2
     9.36623291E-02    2     1000022        11   # BR(~e_L -> ~chi_10 e-)
     1.99052923E-07    2     1000023        11   # BR(~e_L -> ~chi_20 e-)
     1.21865268E-01    2     1000025        11   # BR(~e_L -> ~chi_30 e-)
     2.60980145E-01    2     1000035        11   # BR(~e_L -> ~chi_40 e-)
     1.05162960E-03    2    -1000024        12   # BR(~e_L -> ~chi_1- nu_e)
     5.22440429E-01    2    -1000037        12   # BR(~e_L -> ~chi_2- nu_e)
#
#         PDG            Width
DECAY   2000011     2.38207431E+01   # selectron_R decays
#          BR         NDA      ID1       ID2
     4.90997416E-01    2     1000022        11   # BR(~e_R -> ~chi_10 e-)
     3.93324297E-05    2     1000023        11   # BR(~e_R -> ~chi_20 e-)
     5.08963119E-01    2     1000025        11   # BR(~e_R -> ~chi_30 e-)
     1.32183461E-07    2     1000035        11   # BR(~e_R -> ~chi_40 e-)
#
#         PDG            Width
DECAY   1000013     2.77632406E+01   # smuon_L decays
#          BR         NDA      ID1       ID2
     9.36623291E-02    2     1000022        13   # BR(~mu_L -> ~chi_10 mu-)
     1.99052923E-07    2     1000023        13   # BR(~mu_L -> ~chi_20 mu-)
     1.21865268E-01    2     1000025        13   # BR(~mu_L -> ~chi_30 mu-)
     2.60980145E-01    2     1000035        13   # BR(~mu_L -> ~chi_40 mu-)
     1.05162960E-03    2    -1000024        14   # BR(~mu_L -> ~chi_1- nu_mu)
     5.22440429E-01    2    -1000037        14   # BR(~mu_L -> ~chi_2- nu_mu)
#
#         PDG            Width
DECAY   2000013     2.38207431E+01   # smuon_R decays
#          BR         NDA      ID1       ID2
     4.90997416E-01    2     1000022        13   # BR(~mu_R -> ~chi_10 mu-)
     3.93324297E-05    2     1000023        13   # BR(~mu_R -> ~chi_20 mu-)
     5.08963119E-01    2     1000025        13   # BR(~mu_R -> ~chi_30 mu-)
     1.32183461E-07    2     1000035        13   # BR(~mu_R -> ~chi_40 mu-)
#
#         PDG            Width
DECAY   1000015     2.58313857E+01   # stau_1 decays
#          BR         NDA      ID1       ID2
     2.86521676E-01    2     1000022        15   # BR(~tau_1 -> ~chi_10  tau-)
     4.58475631E-04    2     1000023        15   # BR(~tau_1 -> ~chi_20  tau-)
     2.98062833E-01    2     1000025        15   # BR(~tau_1 -> ~chi_30  tau-)
     1.37458639E-01    2     1000035        15   # BR(~tau_1 -> ~chi_40  tau-)
     2.32762946E-03    2    -1000024        16   # BR(~tau_1 -> ~chi_1-  nu_tau)
     2.75170681E-01    2    -1000037        16   # BR(~tau_1 -> ~chi_2-  nu_tau)
     6.51705538E-08    2     1000039        15   # BR(~tau_1 -> ~G       tau-)
#
#         PDG            Width
DECAY   2000015     2.58454331E+01   # stau_2 decays
#          BR         NDA      ID1       ID2
     2.67401233E-01    2     1000022        15   # BR(~tau_2 -> ~chi_10  tau-)
     7.74577980E-04    2     1000023        15   # BR(~tau_2 -> ~chi_20  tau-)
     3.02675151E-01    2     1000025        15   # BR(~tau_2 -> ~chi_30  tau-)
     1.42962448E-01    2     1000035        15   # BR(~tau_2 -> ~chi_40  tau-)
     6.66798214E-08    2    -1000024        16   # BR(~tau_2 -> ~chi_1-  nu_tau)
     2.86186523E-01    2    -1000037        16   # BR(~tau_2 -> ~chi_2-  nu_tau)
#
#         PDG            Width
DECAY   1000012     2.77625991E+01   # snu_eL decays
#          BR         NDA      ID1       ID2
     1.17654879E-01    2     1000022        12   # BR(~nu_eL -> ~chi_10 nu_e)
     3.91286413E-05    2     1000023        12   # BR(~nu_eL -> ~chi_20 nu_e)
     9.71741618E-02    2     1000025        12   # BR(~nu_eL -> ~chi_30 nu_e)
     2.61285415E-01    2     1000035        12   # BR(~nu_eL -> ~chi_40 nu_e)
     1.75414629E-03    2     1000024        11   # BR(~nu_eL -> ~chi_1+ e-)
     5.22092270E-01    2     1000037        11   # BR(~nu_eL -> ~chi_2+ e-)
#
#         PDG            Width
DECAY   1000014     2.77625991E+01   # snu_muL decays
#          BR         NDA      ID1       ID2
     1.17654879E-01    2     1000022        14   # BR(~nu_muL -> ~chi_10 nu_mu)
     3.91286413E-05    2     1000023        14   # BR(~nu_muL -> ~chi_20 nu_mu)
     9.71741618E-02    2     1000025        14   # BR(~nu_muL -> ~chi_30 nu_mu)
     2.61285415E-01    2     1000035        14   # BR(~nu_muL -> ~chi_40 nu_mu)
     1.75414629E-03    2     1000024        13   # BR(~nu_muL -> ~chi_1+ mu-)
     5.22092270E-01    2     1000037        13   # BR(~nu_muL -> ~chi_2+ mu-)
#
#         PDG            Width
DECAY   1000016     2.77935391E+01   # snu_tauL decays
#          BR         NDA      ID1       ID2
     1.17523904E-01    2     1000022        16   # BR(~nu_tauL -> ~chi_10 nu_tau)
     3.90850829E-05    2     1000023        16   # BR(~nu_tauL -> ~chi_20 nu_tau)
     9.70659865E-02    2     1000025        16   # BR(~nu_tauL -> ~chi_30 nu_tau)
     2.60994549E-01    2     1000035        16   # BR(~nu_tauL -> ~chi_40 nu_tau)
     2.86481964E-03    2     1000024        15   # BR(~nu_tauL -> ~chi_1+ tau-)
     5.21511655E-01    2     1000037        15   # BR(~nu_tauL -> ~chi_2+ tau-)
#
#         PDG            Width
DECAY   1000024     8.80556034E-05   # chargino1+ decays
#          BR         NDA      ID1       ID2
     4.69249011E-07    2     1000039        24   # BR(~chi_1+ -> ~G       W+)
#           BR         NDA      ID1       ID2       ID3
     3.33650912E-01    3     1000022         2        -1   # BR(~chi_1+ -> ~chi_10 u    db)
     3.33650912E-01    3     1000022         4        -3   # BR(~chi_1+ -> ~chi_10 c    sb)
     1.11217104E-01    3     1000022       -11        12   # BR(~chi_1+ -> ~chi_10 e+   nu_e)
     1.11217104E-01    3     1000022       -13        14   # BR(~chi_1+ -> ~chi_10 mu+  nu_mu)
     1.10263500E-01    3     1000022       -15        16   # BR(~chi_1+ -> ~chi_10 tau+ nu_tau)
#
#         PDG            Width
DECAY   1000037     3.58741706E+01   # chargino2+ decays
#          BR         NDA      ID1       ID2
     2.34617648E-01    2     1000024        23   # BR(~chi_2+ -> ~chi_1+  Z )
     1.10607265E-01    2     1000022        24   # BR(~chi_2+ -> ~chi_10  W+)
     2.28641365E-01    2     1000023        24   # BR(~chi_2+ -> ~chi_20  W+)
     1.18136964E-01    2     1000025        24   # BR(~chi_2+ -> ~chi_30  W+)
     2.35703083E-01    2     1000024        25   # BR(~chi_2+ -> ~chi_1+  h )
     1.79524339E-02    2     1000024        35   # BR(~chi_2+ -> ~chi_1+  H )
     1.81928252E-02    2     1000024        36   # BR(~chi_2+ -> ~chi_1+  A )
     1.02547029E-02    2     1000022        37   # BR(~chi_2+ -> ~chi_10  H+)
     1.79927065E-02    2     1000023        37   # BR(~chi_2+ -> ~chi_20  H+)
     7.90100254E-03    2     1000025        37   # BR(~chi_2+ -> ~chi_30  H+)
     4.49084431E-09    2     1000039        24   # BR(~chi_2+ -> ~G       W+)
     2.55896299E-13    2     1000039        37   # BR(~chi_2+ -> ~G       H+)
#
#         PDG            Width
DECAY   1000022     4.51879397E-11   # neutralino1 decays
#          BR         NDA      ID1       ID2
     5.02029672E-01    2     1000039        22   # BR(~chi_10 -> ~G        gam)
     4.87167343E-01    2     1000039        23   # BR(~chi_10 -> ~G        Z)
     1.08029846E-02    2     1000039        25   # BR(~chi_10 -> ~G        h)
#
#         PDG            Width
DECAY   1000023     9.48586743E-05   # neutralino2 decays
#          BR         NDA      ID1       ID2
     4.64814464E-04    2     1000022        22   # BR(~chi_20 -> ~chi_10 gam)
#          BR         NDA      ID1       ID2
     1.12763176E-11    2     1000039        22   # BR(~chi_20 -> ~G        gam)
     1.68688359E-08    2     1000039        23   # BR(~chi_20 -> ~G        Z)
     3.93486369E-07    2     1000039        25   # BR(~chi_20 -> ~G        h)
#           BR         NDA      ID1       ID2       ID3
     1.18868926E-01    3     1000022        -2         2   # BR(~chi_20 -> ~chi_10 ub      u)
     1.53893124E-01    3     1000022        -1         1   # BR(~chi_20 -> ~chi_10 db      d)
     1.18868926E-01    3     1000022        -4         4   # BR(~chi_20 -> ~chi_10 cb      c)
     1.53893124E-01    3     1000022        -3         3   # BR(~chi_20 -> ~chi_10 sb      s)
     1.38509727E-01    3     1000022        -5         5   # BR(~chi_20 -> ~chi_10 bb      b)
     3.51354040E-02    3     1000022       -11        11   # BR(~chi_20 -> ~chi_10 e+      e-)
     3.51354040E-02    3     1000022       -13        13   # BR(~chi_20 -> ~chi_10 mu+     mu-)
     3.47477954E-02    3     1000022       -15        15   # BR(~chi_20 -> ~chi_10 tau+    tau-)
     7.01600584E-02    3     1000022       -12        12   # BR(~chi_20 -> ~chi_10 nu_eb   nu_e)
     7.01600584E-02    3     1000022       -14        14   # BR(~chi_20 -> ~chi_10 nu_mub  nu_mu)
     7.01600584E-02    3     1000022       -16        16   # BR(~chi_20 -> ~chi_10 nu_taub nu_tau)
     4.03488941E-07    3     1000024        -2         1   # BR(~chi_20 -> ~chi_1+ ub      d)
     4.03488941E-07    3    -1000024        -1         2   # BR(~chi_20 -> ~chi_1- db      u)
     4.03488941E-07    3     1000024        -4         3   # BR(~chi_20 -> ~chi_1+ cb      s)
     4.03488941E-07    3    -1000024        -3         4   # BR(~chi_20 -> ~chi_1- sb      c)
     1.34496324E-07    3     1000024       -12        11   # BR(~chi_20 -> ~chi_1+ nu_eb   e-)
     1.34496324E-07    3    -1000024        12       -11   # BR(~chi_20 -> ~chi_1- nu_e    e+)
     1.34496324E-07    3     1000024       -14        13   # BR(~chi_20 -> ~chi_1+ nu_mub  mu-)
     1.34496324E-07    3    -1000024        14       -13   # BR(~chi_20 -> ~chi_1- nu_mu   mu+)
     8.67174439E-09    3     1000024       -16        15   # BR(~chi_20 -> ~chi_1+ nu_taub tau-)
     8.67174439E-09    3    -1000024        16       -15   # BR(~chi_20 -> ~chi_1- nu_tau  tau+)
#
#         PDG            Width
DECAY   1000025     2.75076959E-04   # neutralino3 decays
#          BR         NDA      ID1       ID2
     3.03194455E-04    2     1000022        22   # BR(~chi_30 -> ~chi_10 gam)
     4.79070255E-04    2     1000023        22   # BR(~chi_30 -> ~chi_20 gam)
#          BR         NDA      ID1       ID2
     1.73739530E-07    2     1000039        22   # BR(~chi_30 -> ~G        gam)
     1.39776152E-07    2     1000039        23   # BR(~chi_30 -> ~G        Z)
     3.73166056E-09    2     1000039        25   # BR(~chi_30 -> ~G        h)
#           BR         NDA      ID1       ID2       ID3
     7.06834468E-06    3     1000022        -2         2   # BR(~chi_30 -> ~chi_10 ub      u)
     8.40423808E-06    3     1000022        -1         1   # BR(~chi_30 -> ~chi_10 db      d)
     7.06834468E-06    3     1000022        -4         4   # BR(~chi_30 -> ~chi_10 cb      c)
     8.40423808E-06    3     1000022        -3         3   # BR(~chi_30 -> ~chi_10 sb      s)
     9.04505859E-06    3     1000022        -5         5   # BR(~chi_30 -> ~chi_10 bb      b)
     1.46689264E-06    3     1000022       -11        11   # BR(~chi_30 -> ~chi_10 e+      e-)
     1.46689264E-06    3     1000022       -13        13   # BR(~chi_30 -> ~chi_10 mu+     mu-)
     1.58295064E-06    3     1000022       -15        15   # BR(~chi_30 -> ~chi_10 tau+    tau-)
     4.11543901E-06    3     1000022       -12        12   # BR(~chi_30 -> ~chi_10 nu_eb   nu_e)
     4.11543901E-06    3     1000022       -14        14   # BR(~chi_30 -> ~chi_10 nu_mub  nu_mu)
     4.11543901E-06    3     1000022       -16        16   # BR(~chi_30 -> ~chi_10 nu_taub nu_tau)
     2.68636011E-02    3     1000023        -2         2   # BR(~chi_30 -> ~chi_20 ub      u)
     3.47789303E-02    3     1000023        -1         1   # BR(~chi_30 -> ~chi_20 db      d)
     2.68636011E-02    3     1000023        -4         4   # BR(~chi_30 -> ~chi_20 cb      c)
     3.47789303E-02    3     1000023        -3         3   # BR(~chi_30 -> ~chi_20 sb      s)
     3.08141254E-02    3     1000023        -5         5   # BR(~chi_30 -> ~chi_20 bb      b)
     7.94043760E-03    3     1000023       -11        11   # BR(~chi_30 -> ~chi_20 e+      e-)
     7.94043760E-03    3     1000023       -13        13   # BR(~chi_30 -> ~chi_20 mu+     mu-)
     7.84282382E-03    3     1000023       -15        15   # BR(~chi_30 -> ~chi_20 tau+    tau-)
     1.58556708E-02    3     1000023       -12        12   # BR(~chi_30 -> ~chi_20 nu_eb   nu_e)
     1.58556708E-02    3     1000023       -14        14   # BR(~chi_30 -> ~chi_20 nu_mub  nu_mu)
     1.58556708E-02    3     1000023       -16        16   # BR(~chi_30 -> ~chi_20 nu_taub nu_tau)
     1.29074573E-01    3     1000024        -2         1   # BR(~chi_30 -> ~chi_1+ ub      d)
     1.29074573E-01    3    -1000024        -1         2   # BR(~chi_30 -> ~chi_1- db      u)
     1.29074573E-01    3     1000024        -4         3   # BR(~chi_30 -> ~chi_1+ cb      s)
     1.29074573E-01    3    -1000024        -3         4   # BR(~chi_30 -> ~chi_1- sb      c)
     4.30247838E-02    3     1000024       -12        11   # BR(~chi_30 -> ~chi_1+ nu_eb   e-)
     4.30247838E-02    3    -1000024        12       -11   # BR(~chi_30 -> ~chi_1- nu_e    e+)
     4.30247838E-02    3     1000024       -14        13   # BR(~chi_30 -> ~chi_1+ nu_mub  mu-)
     4.30247838E-02    3    -1000024        14       -13   # BR(~chi_30 -> ~chi_1- nu_mu   mu+)
     4.26866194E-02    3     1000024       -16        15   # BR(~chi_30 -> ~chi_1+ nu_taub tau-)
     4.26866194E-02    3    -1000024        16       -15   # BR(~chi_30 -> ~chi_1- nu_tau  tau+)
#
#         PDG            Width
DECAY   1000035     3.58745745E+01   # neutralino4 decays
#          BR         NDA      ID1       ID2
     1.75085748E-03    2     1000022        23   # BR(~chi_40 -> ~chi_10   Z )
     2.31011086E-01    2     1000023        23   # BR(~chi_40 -> ~chi_20   Z )
     1.96107614E-03    2     1000025        23   # BR(~chi_40 -> ~chi_30   Z )
     2.28510886E-01    2     1000024       -24   # BR(~chi_40 -> ~chi_1+   W-)
     2.28510886E-01    2    -1000024        24   # BR(~chi_40 -> ~chi_1-   W+)
     1.12358219E-01    2     1000022        25   # BR(~chi_40 -> ~chi_10   h )
     1.73520361E-03    2     1000022        35   # BR(~chi_40 -> ~chi_10   H )
     8.48989767E-03    2     1000022        36   # BR(~chi_40 -> ~chi_10   A )
     3.68213031E-03    2     1000023        25   # BR(~chi_40 -> ~chi_20   h )
     1.46264473E-02    2     1000023        35   # BR(~chi_40 -> ~chi_20   H )
     3.28724955E-03    2     1000023        36   # BR(~chi_40 -> ~chi_20   A )
     1.19921957E-01    2     1000025        25   # BR(~chi_40 -> ~chi_30   h )
     1.47208894E-03    2     1000025        35   # BR(~chi_40 -> ~chi_30   H )
     6.40599380E-03    2     1000025        36   # BR(~chi_40 -> ~chi_30   A )
     1.81380081E-02    2     1000024       -37   # BR(~chi_40 -> ~chi_1+   H-)
     1.81380081E-02    2    -1000024        37   # BR(~chi_40 -> ~chi_1-   H+)
     1.07791152E-09    2     1000039        22   # BR(~chi_40 -> ~G        gam)
     3.41253239E-09    2     1000039        23   # BR(~chi_40 -> ~G        Z)
     2.31064880E-13    2     1000039        25   # BR(~chi_40 -> ~G        h)
     2.53334800E-13    2     1000039        35   # BR(~chi_40 -> ~G        H)
     1.43013499E-15    2     1000039        36   # BR(~chi_40 -> ~G        A)
#
#         PDG            Width
DECAY        25     4.21780055E-03   # h decays
#          BR         NDA      ID1       ID2
     6.01771630E-01    2           5        -5   # BR(h -> b       bb     )
     6.22478551E-02    2         -15        15   # BR(h -> tau+    tau-   )
     2.20330269E-04    2         -13        13   # BR(h -> mu+     mu-    )
     4.66176137E-04    2           3        -3   # BR(h -> s       sb     )
     2.01113795E-02    2           4        -4   # BR(h -> c       cb     )
     6.64166346E-02    2          21        21   # BR(h -> g       g      )
     2.31007320E-03    2          22        22   # BR(h -> gam     gam    )
     1.62675786E-03    2          22        23   # BR(h -> Z       gam    )
     2.16744496E-01    2          24       -24   # BR(h -> W+      W-     )
     2.80846669E-02    2          23        23   # BR(h -> Z       Z      )
#
#         PDG            Width
DECAY        35     3.95186171E+01   # H decays
#          BR         NDA      ID1       ID2
     1.40954490E-03    2           5        -5   # BR(H -> b       bb     )
     2.35793205E-04    2         -15        15   # BR(H -> tau+    tau-   )
     8.33616764E-07    2         -13        13   # BR(H -> mu+     mu-    )
     1.06732085E-06    2           3        -3   # BR(H -> s       sb     )
     9.63246218E-06    2           4        -4   # BR(H -> c       cb     )
     9.53092234E-01    2           6        -6   # BR(H -> t       tb     )
     7.63298613E-04    2          21        21   # BR(H -> g       g      )
     2.62698567E-06    2          22        22   # BR(H -> gam     gam    )
     1.10944706E-06    2          23        22   # BR(H -> Z       gam    )
     3.21573738E-04    2          24       -24   # BR(H -> W+      W-     )
     1.60348330E-04    2          23        23   # BR(H -> Z       Z      )
     8.65508120E-04    2          25        25   # BR(H -> h       h      )
     8.79320903E-24    2          36        36   # BR(H -> A       A      )
     3.51138836E-11    2          23        36   # BR(H -> Z       A      )
     5.09296846E-12    2          24       -37   # BR(H -> W+      H-     )
     5.09296846E-12    2         -24        37   # BR(H -> W-      H+     )
     3.34112276E-05    2     1000024  -1000024   # BR(H -> ~chi_1+ ~chi_1-)
     6.01864327E-04    2     1000022   1000022   # BR(H -> ~chi_10 ~chi_10)
     8.43061709E-06    2     1000023   1000023   # BR(H -> ~chi_20 ~chi_20)
     2.93138104E-04    2     1000025   1000025   # BR(H -> ~chi_30 ~chi_30)
     2.36410786E-02    2     1000022   1000023   # BR(H -> ~chi_10 ~chi_20)
     2.60236773E-08    2     1000022   1000025   # BR(H -> ~chi_10 ~chi_30)
     1.85584803E-02    2     1000023   1000025   # BR(H -> ~chi_20 ~chi_30)
#
#         PDG            Width
DECAY        36     3.99689155E+01   # A decays
#          BR         NDA      ID1       ID2
     1.41210207E-03    2           5        -5   # BR(A -> b       bb     )
     2.33336739E-04    2         -15        15   # BR(A -> tau+    tau-   )
     8.24929664E-07    2         -13        13   # BR(A -> mu+     mu-    )
     1.08755067E-06    2           3        -3   # BR(A -> s       sb     )
     9.53041183E-06    2           4        -4   # BR(A -> c       cb     )
     9.53825207E-01    2           6        -6   # BR(A -> t       tb     )
     9.02813679E-04    2          21        21   # BR(A -> g       g      )
     2.76236164E-06    2          22        22   # BR(A -> gam     gam    )
     1.29349823E-06    2          23        22   # BR(A -> Z       gam    )
     3.13269617E-04    2          23        25   # BR(A -> Z       h      )
     6.29388004E-04    2     1000024  -1000024   # BR(A -> ~chi_1+ ~chi_1-)
     2.46434637E-02    2     1000022   1000022   # BR(A -> ~chi_10 ~chi_10)
     6.40012792E-07    2     1000023   1000023   # BR(A -> ~chi_20 ~chi_20)
     1.71256463E-02    2     1000025   1000025   # BR(A -> ~chi_30 ~chi_30)
     4.42161231E-04    2     1000022   1000023   # BR(A -> ~chi_10 ~chi_20)
     5.32475704E-05    2     1000022   1000025   # BR(A -> ~chi_10 ~chi_30)
     4.03225664E-04    2     1000023   1000025   # BR(A -> ~chi_20 ~chi_30)
#
#         PDG            Width
DECAY        37     3.91533158E+01   # H+ decays
#          BR         NDA      ID1       ID2
     2.26585423E-06    2           4        -5   # BR(H+ -> c       bb     )
     2.38412376E-04    2         -15        16   # BR(H+ -> tau+    nu_tau )
     8.42873873E-07    2         -13        14   # BR(H+ -> mu+     nu_mu  )
     1.44059211E-08    2           2        -5   # BR(H+ -> u       bb     )
     5.21982546E-08    2           2        -3   # BR(H+ -> u       sb     )
     1.04006995E-05    2           4        -3   # BR(H+ -> c       sb     )
     9.55982541E-01    2           6        -5   # BR(H+ -> t       bb     )
     3.21118096E-04    2          24        25   # BR(H+ -> W+      h      )
     6.44108394E-13    2          24        36   # BR(H+ -> W+      A      )
     2.17130978E-02    2     1000024   1000022   # BR(H+ -> ~chi_1+ ~chi_10)
     1.47305295E-04    2     1000024   1000023   # BR(H+ -> ~chi_1+ ~chi_20)
     2.15839495E-02    2     1000024   1000025   # BR(H+ -> ~chi_1+ ~chi_30)
