#
#                              ======================
#                              | THE SUSYHIT OUTPUT |
#                              ======================
#
#
#              ------------------------------------------------------
#              |     This is the output of the SUSY-HIT package     |
#              |  created by A.Djouadi, M.Muehlleitner and M.Spira. |
#              |  In case of problems with SUSY-HIT email to        |
#              |           margarete.muehlleitner@cern.ch           |
#              |           michael.spira@psi.ch                     |
#              |           abdelhak.djouadi@cern.ch                 |
#              ------------------------------------------------------
#
#              ------------------------------------------------------
#              |  SUSY Les Houches Accord - MSSM Spectrum + Decays  |
#              |              based on the decay programs           |
#              |                                                    |
#              |                     SDECAY 1.3b                    |
#              |                                                    |
#              |  Authors: M.Muhlleitner, A.Djouadi and Y.Mambrini  |
#              |  Ref.:    Comput.Phys.Commun.168(2005)46           |
#              |           [hep-ph/0311167]                         |
#              |                                                    |
#              |                     HDECAY 3.4                     |
#              |                                                    |
#              |  By: A.Djouadi,J.Kalinowski,M.Muhlleitner,M.Spira  |
#              |  Ref.:    Comput.Phys.Commun.108(1998)56           |
#              |           [hep-ph/9704448]                         |
#              |                                                    |
#              |                                                    |
#              |  If not stated otherwise all DRbar couplings and   |
#              |  soft SUSY breaking masses are given at the scale  |
#              |  Q=  0.50007250E+04
#              |                                                    |
#              ------------------------------------------------------
#
#
BLOCK DCINFO  # Decay Program information
     1   SDECAY/HDECAY # decay calculator
     2   1.3b  /3.4    # version number
#
BLOCK SPINFO  # Spectrum calculator information
     1    SOFTSUSY    # spectrum calculator                
     2    3.4.0       # version number                     
#
BLOCK MODSEL  # Model selection
     1     0   #  nonUniversal                                     
#
BLOCK SMINPUTS  # Standard Model inputs
         1     1.25778332E+02   # alpha_em^-1(M_Z)^MSbar
         2     1.16570000E-05   # G_F [GeV^-2]
         3     1.17200002E-01   # alpha_S(M_Z)^MSbar
         4     9.11876000E+01   # M_Z pole mass
         5     4.25000000E+00   # mb(mb)^MSbar
         6     1.72500000E+02   # mt pole mass
         7     1.77682000E+00   # mtau pole mass
#
BLOCK MINPAR  # Input parameters - minimal models
         3     1.00000000E+01   # tanb                
#
BLOCK EXTPAR  # Input parameters - non-minimal models
         0    -1.00000000E+00   # Set                 
         1     6.00000000E+01   # M_1(MX)             
         2     3.00000000E+03   # M_2(MX)             
         3     1.39219900E+03   # M_3(MX)             
        11     5.00000000E+03   # At(MX)              
        12     5.00000000E+03   # Ab(MX)              
        13     0.00000000E+00   # Atau(MX)            
        23    -1.25133700E+03   # mu(MX)              
        26     3.00000000E+03   # mA(pole)            
        31     5.00000000E+03   # meL(MX)             
        32     5.00000000E+03   # mmuL(MX)            
        33     5.00000000E+03   # mtauL(MX)           
        34     5.00000000E+03   # meR(MX)             
        35     5.00000000E+03   # mmuR(MX)            
        36     5.00000000E+03   # mtauR(MX)           
        41     5.00000000E+03   # mqL1(MX)            
        42     5.00000000E+03   # mqL2(MX)            
        43     5.00000000E+03   # mqL3(MX)            
        44     5.00000000E+03   # muR(MX)             
        45     5.00000000E+03   # mcR(MX)             
        46     5.00000000E+03   # mtR(MX)             
        47     5.00000000E+03   # mdR(MX)             
        48     5.00000000E+03   # msR(MX)             
        49     5.00000000E+03   # mbR(MX)             
#
BLOCK MASS  # Mass Spectrum
# PDG code           mass       particle
        24     8.00954690E+01   # W+
        25     1.24695583E+02   # h
        35     3.00008152E+03   # H
        36     2.99999988E+03   # A
        37     3.00086885E+03   # H+
         5     4.87878001E+00   # b-quark pole mass calculated from mb(mb)_Msbar
   1000001     5.06845176E+03   # ~d_L
   2000001     5.05065221E+03   # ~d_R
   1000002     5.06797688E+03   # ~u_L
   2000002     5.05037303E+03   # ~u_R
   1000003     5.06845176E+03   # ~s_L
   2000003     5.05065221E+03   # ~s_R
   1000004     5.06797688E+03   # ~c_L
   2000004     5.05037303E+03   # ~c_R
   1000005     5.01440469E+03   # ~b_1
   2000005     5.04938119E+03   # ~b_2
   1000006     4.90526774E+03   # ~t_1
   2000006     5.06038550E+03   # ~t_2
   1000011     5.01905776E+03   # ~e_L
   2000011     5.00591554E+03   # ~e_R
   1000012     5.01810945E+03   # ~nu_eL
   1000013     5.01905776E+03   # ~mu_L
   2000013     5.00591554E+03   # ~mu_R
   1000014     5.01810945E+03   # ~nu_muL
   1000015     5.00447632E+03   # ~tau_1
   2000015     5.01889776E+03   # ~tau_2
   1000016     5.01756730E+03   # ~nu_tauL
   1000021     1.70000062E+03   # ~g
   1000022     6.03028944E+01   # ~chi_10
   1000023     1.29950341E+03   # ~chi_20
   1000025    -1.30184421E+03   # ~chi_30
   1000035     3.07430720E+03   # ~chi_40
   1000024     1.30000084E+03   # ~chi_1+
   1000037     3.07447466E+03   # ~chi_2+
#
BLOCK NMIX  # Neutralino Mixing Matrix
  1  1     9.99410374E-01   # N_11
  1  2     1.55325838E-04   # N_12
  1  3    -3.42768328E-02   # N_13
  1  4     1.99474902E-03   # N_14
  2  1     2.28294727E-02   # N_21
  2  2     2.74301415E-02   # N_22
  2  3     7.06875056E-01   # N_23
  2  4     7.06437582E-01   # N_24
  3  1    -2.56425102E-02   # N_31
  3  2     1.38793467E-02   # N_32
  3  3    -7.06442427E-01   # N_33
  3  4     7.07169657E-01   # N_34
  4  1    -4.25749861E-04   # N_41
  4  2     9.99527352E-01   # N_42
  4  3    -9.58392922E-03   # N_43
  4  4    -2.92068501E-02   # N_44
#
BLOCK UMIX  # Chargino Mixing Matrix U
  1  1     1.35680589E-02   # U_11
  1  2     9.99907950E-01   # U_12
  2  1    -9.99907950E-01   # U_21
  2  2     1.35680589E-02   # U_22
#
BLOCK VMIX  # Chargino Mixing Matrix V
  1  1     4.13315882E-02   # V_11
  1  2    -9.99145485E-01   # V_12
  2  1    -9.99145485E-01   # V_21
  2  2    -4.13315882E-02   # V_22
#
BLOCK STOPMIX  # Stop Mixing Matrix
  1  1    -5.10239275E-01   # cos(theta_t)
  1  2     8.60032489E-01   # sin(theta_t)
  2  1    -8.60032489E-01   # -sin(theta_t)
  2  2    -5.10239275E-01   # cos(theta_t)
#
BLOCK SBOTMIX  # Sbottom Mixing Matrix
  1  1     9.95649026E-01   # cos(theta_b)
  1  2    -9.31827078E-02   # sin(theta_b)
  2  1     9.31827078E-02   # -sin(theta_b)
  2  2     9.95649026E-01   # cos(theta_b)
#
BLOCK STAUMIX  # Stau Mixing Matrix
  1  1    -1.46891620E-01   # cos(theta_tau)
  1  2     9.89152593E-01   # sin(theta_tau)
  2  1    -9.89152593E-01   # -sin(theta_tau)
  2  2    -1.46891620E-01   # cos(theta_tau)
#
BLOCK ALPHA  # Higgs mixing
          -1.05459162E-01   # Mixing angle in the neutral Higgs boson sector
#
BLOCK HMIX Q=  5.00072501E+03  # DRbar Higgs Parameters
         1    -1.27414296E+03   # mu(Q)MSSM           
         2     9.47093131E+00   # tan                 
         3     2.41926335E+02   # higgs               
         4     8.43957454E+06   # mA^2(Q)MSSM         
#
BLOCK GAUGE Q=  5.00072501E+03  # The gauge couplings
     1     3.70742011E-01   # gprime(Q) DRbar
     2     6.32272099E-01   # g(Q) DRbar
     3     1.00087833E+00   # g3(Q) DRbar
#
BLOCK AU Q=  5.00072501E+03  # The trilinear couplings
  1  1     5.00000001E+03   # A_u(Q) DRbar
  2  2     5.00000001E+03   # A_c(Q) DRbar
  3  3     5.00000001E+03   # A_t(Q) DRbar
#
BLOCK AD Q=  5.00072501E+03  # The trilinear couplings
  1  1     5.00000000E+03   # A_d(Q) DRbar
  2  2     5.00000000E+03   # A_s(Q) DRbar
  3  3     5.00000001E+03   # A_b(Q) DRbar
#
BLOCK AE Q=  5.00072501E+03  # The trilinear couplings
  1  1     0.00000000E+00   # A_e(Q) DRbar
  2  2     1.29263167E-07   # A_mu(Q) DRbar
  3  3     1.28723498E-07   # A_tau(Q) DRbar
#
BLOCK Yu Q=  5.00072501E+03  # The Yukawa couplings
  1  1     0.00000000E+00   # y_u(Q) DRbar
  2  2     0.00000000E+00   # y_c(Q) DRbar
  3  3     8.18567607E-01   # y_t(Q) DRbar
#
BLOCK Yd Q=  5.00072501E+03  # The Yukawa couplings
  1  1     0.00000000E+00   # y_d(Q) DRbar
  2  2     0.00000000E+00   # y_s(Q) DRbar
  3  3     1.30680672E-01   # y_b(Q) DRbar
#
BLOCK Ye Q=  5.00072501E+03  # The Yukawa couplings
  1  1     0.00000000E+00   # y_e(Q) DRbar
  2  2     0.00000000E+00   # y_mu(Q) DRbar
  3  3     9.67177174E-02   # y_tau(Q) DRbar
#
BLOCK MSOFT Q=  5.00072501E+03  # The soft SUSY breaking masses at the scale Q
         1     6.00000000E+01   # M_1(Q)              
         2     3.00000000E+03   # M_2(Q)              
         3     1.39219900E+03   # M_3(Q)              
        21     7.05658407E+06   # mH1^2(Q)            
        22    -1.06942004E+06   # mH2^2(Q)            
        31     5.00000000E+03   # meL(Q)              
        32     5.00000000E+03   # mmuL(Q)             
        33     5.00000000E+03   # mtauL(Q)            
        34     5.00000000E+03   # meR(Q)              
        35     5.00000000E+03   # mmuR(Q)             
        36     5.00000000E+03   # mtauR(Q)            
        41     5.00000000E+03   # mqL1(Q)             
        42     5.00000000E+03   # mqL2(Q)             
        43     5.00000000E+03   # mqL3(Q)             
        44     5.00000000E+03   # muR(Q)              
        45     5.00000000E+03   # mcR(Q)              
        46     4.99999999E+03   # mtR(Q)              
        47     5.00000000E+03   # mdR(Q)              
        48     5.00000000E+03   # msR(Q)              
        49     5.00000000E+03   # mbR(Q)              
#
#
#
#                             =================
#                             |The decay table|
#                             =================
#
# - The QCD corrections to the decays gluino -> squark  + quark
#                                     squark -> gaugino + quark_prime
#                                     squark -> squark_prime + Higgs
#                                     squark -> gluino  + quark
#   are included.
#
# - The multi-body decays for the inos, stops and sbottoms are included.
#
# - The loop induced decays for the gluino, neutralinos and stops
#   are included.
#
# - The SUSY decays of the top quark are included.
#
#
#         PDG            Width
DECAY         6     1.40090225E+00   # top decays
#          BR         NDA      ID1       ID2
     1.00000000E+00    2           5        24   # BR(t ->  b    W+)
#
#         PDG            Width
DECAY   1000021     1.34640753E-04   # gluino decays
#          BR         NDA      ID1       ID2
     9.83830510E-06    2     1000022        21   # BR(~g -> ~chi_10 g)
     5.29568431E-03    2     1000023        21   # BR(~g -> ~chi_20 g)
     5.20367154E-03    2     1000025        21   # BR(~g -> ~chi_30 g)
#           BR         NDA      ID1       ID2       ID3
     7.52155934E-02    3     1000022         1        -1   # BR(~g -> ~chi_10 d  db)
     2.32109295E-06    3     1000023         1        -1   # BR(~g -> ~chi_20 d  db)
     5.81459794E-07    3     1000025         1        -1   # BR(~g -> ~chi_30 d  db)
     2.56429187E-01    3     1000022         2        -2   # BR(~g -> ~chi_10 u  ub)
     5.11645953E-06    3     1000023         2        -2   # BR(~g -> ~chi_20 u  ub)
     6.16954212E-07    3     1000025         2        -2   # BR(~g -> ~chi_30 u  ub)
     7.52155934E-02    3     1000022         3        -3   # BR(~g -> ~chi_10 s  sb)
     2.32109295E-06    3     1000023         3        -3   # BR(~g -> ~chi_20 s  sb)
     5.81459794E-07    3     1000025         3        -3   # BR(~g -> ~chi_30 s  sb)
     2.56429187E-01    3     1000022         4        -4   # BR(~g -> ~chi_10 c  cb)
     5.11645953E-06    3     1000023         4        -4   # BR(~g -> ~chi_20 c  cb)
     6.16954212E-07    3     1000025         4        -4   # BR(~g -> ~chi_30 c  cb)
     7.61782808E-02    3     1000022         5        -5   # BR(~g -> ~chi_10 b  bb)
     3.41503657E-04    3     1000023         5        -5   # BR(~g -> ~chi_20 b  bb)
     3.27948797E-04    3     1000025         5        -5   # BR(~g -> ~chi_30 b  bb)
     2.36609410E-01    3     1000022         6        -6   # BR(~g -> ~chi_10 t  tb)
     1.11481157E-03    3     1000023         6        -6   # BR(~g -> ~chi_20 t  tb)
     3.35368930E-04    3     1000025         6        -6   # BR(~g -> ~chi_30 t  tb)
     6.21776000E-06    3     1000024         1        -2   # BR(~g -> ~chi_1+ d  ub)
     6.21776000E-06    3    -1000024         2        -1   # BR(~g -> ~chi_1- u  db)
     6.21776000E-06    3     1000024         3        -4   # BR(~g -> ~chi_1+ s  cb)
     6.21776000E-06    3    -1000024         4        -3   # BR(~g -> ~chi_1- c  sb)
     5.62588868E-03    3     1000024         5        -6   # BR(~g -> ~chi_1+ b  tb)
     5.62588868E-03    3    -1000024         6        -5   # BR(~g -> ~chi_1- t  bb)
#
#         PDG            Width
DECAY   1000006     3.60564195E+02   # stop1 decays
#          BR         NDA      ID1       ID2
     2.44374492E-02    2     1000022         6   # BR(~t_1 -> ~chi_10 t )
     7.91826319E-02    2     1000023         6   # BR(~t_1 -> ~chi_20 t )
     7.61243380E-02    2     1000025         6   # BR(~t_1 -> ~chi_30 t )
     5.90886969E-03    2     1000035         6   # BR(~t_1 -> ~chi_40 t )
     1.14394851E-01    2     1000024         5   # BR(~t_1 -> ~chi_1+ b )
     1.17626397E-02    2     1000037         5   # BR(~t_1 -> ~chi_2+ b )
     6.88189220E-01    2     1000021         6   # BR(~t_1 -> ~g      t )
#
#         PDG            Width
DECAY   2000006     3.68162214E+02   # stop2 decays
#          BR         NDA      ID1       ID2
     9.62117922E-03    2     1000022         6   # BR(~t_2 -> ~chi_10 t )
     7.99413695E-02    2     1000023         6   # BR(~t_2 -> ~chi_20 t )
     8.31968075E-02    2     1000025         6   # BR(~t_2 -> ~chi_30 t )
     1.48854740E-02    2     1000035         6   # BR(~t_2 -> ~chi_40 t )
     4.84963636E-02    2     1000024         5   # BR(~t_2 -> ~chi_1+ b )
     2.95868890E-02    2     1000037         5   # BR(~t_2 -> ~chi_2+ b )
     7.30751823E-01    2     1000021         6   # BR(~t_2 -> ~g      t )
     7.85460148E-04    2     1000006        25   # BR(~t_2 -> ~t_1    h )
     2.73463449E-03    2     1000006        23   # BR(~t_2 -> ~t_1    Z )
#
#         PDG            Width
DECAY   1000005     3.44759323E+02   # sbottom1 decays
#          BR         NDA      ID1       ID2
     2.25653759E-03    2     1000022         5   # BR(~b_1 -> ~chi_10 b )
     2.21742058E-03    2     1000023         5   # BR(~b_1 -> ~chi_20 b )
     2.12476445E-03    2     1000025         5   # BR(~b_1 -> ~chi_30 b )
     2.17280702E-02    2     1000035         5   # BR(~b_1 -> ~chi_40 b )
     1.68075591E-01    2    -1000024         6   # BR(~b_1 -> ~chi_1- t )
     4.36971847E-02    2    -1000037         6   # BR(~b_1 -> ~chi_2- t )
     7.58269979E-01    2     1000021         5   # BR(~b_1 -> ~g      b )
     1.63045245E-03    2     1000006       -24   # BR(~b_1 -> ~t_1    W-)
#
#         PDG            Width
DECAY   2000005     2.70611431E+02   # sbottom2 decays
#          BR         NDA      ID1       ID2
     1.08401860E-02    2     1000022         5   # BR(~b_2 -> ~chi_10 b )
     2.75502055E-03    2     1000023         5   # BR(~b_2 -> ~chi_20 b )
     2.85498776E-03    2     1000025         5   # BR(~b_2 -> ~chi_30 b )
     2.53264251E-04    2     1000035         5   # BR(~b_2 -> ~chi_40 b )
     7.36978201E-03    2    -1000024         6   # BR(~b_2 -> ~chi_1- t )
     5.09187246E-04    2    -1000037         6   # BR(~b_2 -> ~chi_2- t )
     9.75341577E-01    2     1000021         5   # BR(~b_2 -> ~g      b )
     7.59952420E-05    2     1000006       -24   # BR(~b_2 -> ~t_1    W-)
#
#         PDG            Width
DECAY   1000002     2.89599643E+02   # sup_L decays
#          BR         NDA      ID1       ID2
     2.57856141E-03    2     1000022         2   # BR(~u_L -> ~chi_10 u)
     5.99869960E-05    2     1000023         2   # BR(~u_L -> ~chi_20 u)
     4.63508797E-06    2     1000025         2   # BR(~u_L -> ~chi_30 u)
     2.70351610E-02    2     1000035         2   # BR(~u_L -> ~chi_40 u)
     2.01480774E-04    2     1000024         1   # BR(~u_L -> ~chi_1+ d)
     5.40312013E-02    2     1000037         1   # BR(~u_L -> ~chi_2+ d)
     9.16088973E-01    2     1000021         2   # BR(~u_L -> ~g      u)
#
#         PDG            Width
DECAY   2000002     2.75809043E+02   # sup_R decays
#          BR         NDA      ID1       ID2
     4.30995196E-02    2     1000022         2   # BR(~u_R -> ~chi_10 u)
     1.96397502E-05    2     1000023         2   # BR(~u_R -> ~chi_20 u)
     2.47652982E-05    2     1000025         2   # BR(~u_R -> ~chi_30 u)
     3.11241182E-09    2     1000035         2   # BR(~u_R -> ~chi_40 u)
     9.56856072E-01    2     1000021         2   # BR(~u_R -> ~g      u)
#
#         PDG            Width
DECAY   1000001     2.89612934E+02   # sdown_L decays
#          BR         NDA      ID1       ID2
     2.57049793E-03    2     1000022         1   # BR(~d_L -> ~chi_10 d)
     3.11146745E-05    2     1000023         1   # BR(~d_L -> ~chi_20 d)
     2.10388614E-05    2     1000025         1   # BR(~d_L -> ~chi_30 d)
     2.70513209E-02    2     1000035         1   # BR(~d_L -> ~chi_40 d)
     2.17138713E-05    2    -1000024         2   # BR(~d_L -> ~chi_1- u)
     5.41280163E-02    2    -1000037         2   # BR(~d_L -> ~chi_2- u)
     9.16176297E-01    2     1000021         1   # BR(~d_L -> ~g      d)
#
#         PDG            Width
DECAY   2000001     2.66906641E+02   # sdown_R decays
#          BR         NDA      ID1       ID2
     1.11348860E-02    2     1000022         1   # BR(~d_R -> ~chi_10 d)
     5.07406477E-06    2     1000023         1   # BR(~d_R -> ~chi_20 d)
     6.39828581E-06    2     1000025         1   # BR(~d_R -> ~chi_30 d)
     8.04204208E-10    2     1000035         1   # BR(~d_R -> ~chi_40 d)
     9.88853641E-01    2     1000021         1   # BR(~d_R -> ~g      d)
#
#         PDG            Width
DECAY   1000004     2.89599643E+02   # scharm_L decays
#          BR         NDA      ID1       ID2
     2.57856141E-03    2     1000022         4   # BR(~c_L -> ~chi_10 c)
     5.99869960E-05    2     1000023         4   # BR(~c_L -> ~chi_20 c)
     4.63508797E-06    2     1000025         4   # BR(~c_L -> ~chi_30 c)
     2.70351610E-02    2     1000035         4   # BR(~c_L -> ~chi_40 c)
     2.01480774E-04    2     1000024         3   # BR(~c_L -> ~chi_1+ s)
     5.40312013E-02    2     1000037         3   # BR(~c_L -> ~chi_2+ s)
     9.16088973E-01    2     1000021         4   # BR(~c_L -> ~g      c)
#
#         PDG            Width
DECAY   2000004     2.75809043E+02   # scharm_R decays
#          BR         NDA      ID1       ID2
     4.30995196E-02    2     1000022         4   # BR(~c_R -> ~chi_10 c)
     1.96397502E-05    2     1000023         4   # BR(~c_R -> ~chi_20 c)
     2.47652982E-05    2     1000025         4   # BR(~c_R -> ~chi_30 c)
     3.11241182E-09    2     1000035         4   # BR(~c_R -> ~chi_40 c)
     9.56856072E-01    2     1000021         4   # BR(~c_R -> ~g      c)
#
#         PDG            Width
DECAY   1000003     2.89612934E+02   # sstrange_L decays
#          BR         NDA      ID1       ID2
     2.57049793E-03    2     1000022         3   # BR(~s_L -> ~chi_10 s)
     3.11146745E-05    2     1000023         3   # BR(~s_L -> ~chi_20 s)
     2.10388614E-05    2     1000025         3   # BR(~s_L -> ~chi_30 s)
     2.70513209E-02    2     1000035         3   # BR(~s_L -> ~chi_40 s)
     2.17138713E-05    2    -1000024         4   # BR(~s_L -> ~chi_1- c)
     5.41280163E-02    2    -1000037         4   # BR(~s_L -> ~chi_2- c)
     9.16176297E-01    2     1000021         3   # BR(~s_L -> ~g      s)
#
#         PDG            Width
DECAY   2000003     2.66906641E+02   # sstrange_R decays
#          BR         NDA      ID1       ID2
     1.11348860E-02    2     1000022         3   # BR(~s_R -> ~chi_10 s)
     5.07406477E-06    2     1000023         3   # BR(~s_R -> ~chi_20 s)
     6.39828581E-06    2     1000025         3   # BR(~s_R -> ~chi_30 s)
     8.04204208E-10    2     1000035         3   # BR(~s_R -> ~chi_40 s)
     9.88853641E-01    2     1000021         3   # BR(~s_R -> ~g      s)
#
#         PDG            Width
DECAY   1000011     3.02498617E+01   # selectron_L decays
#          BR         NDA      ID1       ID2
     2.26639214E-01    2     1000022        11   # BR(~e_L -> ~chi_10 e-)
     9.56772611E-04    2     1000023        11   # BR(~e_L -> ~chi_20 e-)
     7.67739414E-07    2     1000025        11   # BR(~e_L -> ~chi_30 e-)
     2.57203378E-01    2     1000035        11   # BR(~e_L -> ~chi_40 e-)
     2.11423892E-04    2    -1000024        12   # BR(~e_L -> ~chi_1- nu_e)
     5.14988444E-01    2    -1000037        12   # BR(~e_L -> ~chi_2- nu_e)
#
#         PDG            Width
DECAY   2000011     2.73649390E+01   # selectron_R decays
#          BR         NDA      ID1       ID2
     9.98974562E-01    2     1000022        11   # BR(~e_R -> ~chi_10 e-)
     4.53508863E-04    2     1000023        11   # BR(~e_R -> ~chi_20 e-)
     5.71858721E-04    2     1000025        11   # BR(~e_R -> ~chi_30 e-)
     7.03481278E-08    2     1000035        11   # BR(~e_R -> ~chi_40 e-)
#
#         PDG            Width
DECAY   1000013     3.02498617E+01   # smuon_L decays
#          BR         NDA      ID1       ID2
     2.26639214E-01    2     1000022        13   # BR(~mu_L -> ~chi_10 mu-)
     9.56772611E-04    2     1000023        13   # BR(~mu_L -> ~chi_20 mu-)
     7.67739414E-07    2     1000025        13   # BR(~mu_L -> ~chi_30 mu-)
     2.57203378E-01    2     1000035        13   # BR(~mu_L -> ~chi_40 mu-)
     2.11423892E-04    2    -1000024        14   # BR(~mu_L -> ~chi_1- nu_mu)
     5.14988444E-01    2    -1000037        14   # BR(~mu_L -> ~chi_2- nu_mu)
#
#         PDG            Width
DECAY   2000013     2.73649390E+01   # smuon_R decays
#          BR         NDA      ID1       ID2
     9.98974562E-01    2     1000022        13   # BR(~mu_R -> ~chi_10 mu-)
     4.53508863E-04    2     1000023        13   # BR(~mu_R -> ~chi_20 mu-)
     5.71858721E-04    2     1000025        13   # BR(~mu_R -> ~chi_30 mu-)
     7.03481278E-08    2     1000035        13   # BR(~mu_R -> ~chi_40 mu-)
#
#         PDG            Width
DECAY   1000015     2.90368341E+01   # stau_1 decays
#          BR         NDA      ID1       ID2
     9.26857316E-01    2     1000022        15   # BR(~tau_1 -> ~chi_10  tau-)
     1.47493202E-02    2     1000023        15   # BR(~tau_1 -> ~chi_20  tau-)
     1.36761098E-02    2     1000025        15   # BR(~tau_1 -> ~chi_30  tau-)
     5.56560488E-03    2     1000035        15   # BR(~tau_1 -> ~chi_40  tau-)
     2.80080331E-02    2    -1000024        16   # BR(~tau_1 -> ~chi_1-  nu_tau)
     1.11436162E-02    2    -1000037        16   # BR(~tau_1 -> ~chi_2-  nu_tau)
#
#         PDG            Width
DECAY   2000015     3.09963021E+01   # stau_2 decays
#          BR         NDA      ID1       ID2
     2.34704909E-01    2     1000022        15   # BR(~tau_2 -> ~chi_10  tau-)
     1.36785028E-02    2     1000023        15   # BR(~tau_2 -> ~chi_20  tau-)
     1.38143185E-02    2     1000025        15   # BR(~tau_2 -> ~chi_30  tau-)
     2.45718397E-01    2     1000035        15   # BR(~tau_2 -> ~chi_40  tau-)
     9.17293584E-05    2    -1000024        16   # BR(~tau_2 -> ~chi_1-  nu_tau)
     4.91992143E-01    2    -1000037        16   # BR(~tau_2 -> ~chi_2-  nu_tau)
#
#         PDG            Width
DECAY   1000012     3.02522370E+01   # snu_eL decays
#          BR         NDA      ID1       ID2
     2.26338483E-01    2     1000022        12   # BR(~nu_eL -> ~chi_10 nu_e)
     1.13230277E-04    2     1000023        12   # BR(~nu_eL -> ~chi_20 nu_e)
     4.79760124E-04    2     1000025        12   # BR(~nu_eL -> ~chi_30 nu_e)
     2.57274779E-01    2     1000035        12   # BR(~nu_eL -> ~chi_40 nu_e)
     1.96129551E-03    2     1000024        11   # BR(~nu_eL -> ~chi_1+ e-)
     5.13832453E-01    2     1000037        11   # BR(~nu_eL -> ~chi_2+ e-)
#
#         PDG            Width
DECAY   1000014     3.02522370E+01   # snu_muL decays
#          BR         NDA      ID1       ID2
     2.26338483E-01    2     1000022        14   # BR(~nu_muL -> ~chi_10 nu_mu)
     1.13230277E-04    2     1000023        14   # BR(~nu_muL -> ~chi_20 nu_mu)
     4.79760124E-04    2     1000025        14   # BR(~nu_muL -> ~chi_30 nu_mu)
     2.57274779E-01    2     1000035        14   # BR(~nu_muL -> ~chi_40 nu_mu)
     1.96129551E-03    2     1000024        13   # BR(~nu_muL -> ~chi_1+ mu-)
     5.13832453E-01    2     1000037        13   # BR(~nu_muL -> ~chi_2+ mu-)
#
#         PDG            Width
DECAY   1000016     3.10554624E+01   # snu_tauL decays
#          BR         NDA      ID1       ID2
     2.20460579E-01    2     1000022        16   # BR(~nu_tauL -> ~chi_10 nu_tau)
     1.10286320E-04    2     1000023        16   # BR(~nu_tauL -> ~chi_20 nu_tau)
     4.67286433E-04    2     1000025        16   # BR(~nu_tauL -> ~chi_30 nu_tau)
     2.50528414E-01    2     1000035        16   # BR(~nu_tauL -> ~chi_40 nu_tau)
     2.80745365E-02    2     1000024        15   # BR(~nu_tauL -> ~chi_1+ tau-)
     5.00358898E-01    2     1000037        15   # BR(~nu_tauL -> ~chi_2+ tau-)
#
#         PDG            Width
DECAY   1000024     7.97346099E-01   # chargino1+ decays
#          BR         NDA      ID1       ID2
     1.00000000E+00    2     1000022        24   # BR(~chi_1+ -> ~chi_10  W+)
#
#         PDG            Width
DECAY   1000037     1.92791028E+01   # chargino2+ decays
#          BR         NDA      ID1       ID2
     2.52921083E-01    2     1000024        23   # BR(~chi_2+ -> ~chi_1+  Z )
     2.27533692E-04    2     1000022        24   # BR(~chi_2+ -> ~chi_10  W+)
     2.43971510E-01    2     1000023        24   # BR(~chi_2+ -> ~chi_20  W+)
     2.43883734E-01    2     1000025        24   # BR(~chi_2+ -> ~chi_30  W+)
     2.58995547E-01    2     1000024        25   # BR(~chi_2+ -> ~chi_1+  h )
     5.92080775E-07    2     1000022        37   # BR(~chi_2+ -> ~chi_10  H+)
#
#         PDG            Width
DECAY   1000022     0.00000000E+00   # neutralino1 decays
#
#         PDG            Width
DECAY   1000023     8.36517577E-01   # neutralino2 decays
#          BR         NDA      ID1       ID2
     5.51250569E-01    2     1000022        23   # BR(~chi_20 -> ~chi_10   Z )
     4.48749431E-01    2     1000022        25   # BR(~chi_20 -> ~chi_10   h )
#
#         PDG            Width
DECAY   1000025     8.43619116E-01   # neutralino3 decays
#          BR         NDA      ID1       ID2
     4.33589326E-01    2     1000022        23   # BR(~chi_30 -> ~chi_10   Z )
     5.66410674E-01    2     1000022        25   # BR(~chi_30 -> ~chi_10   h )
#
#         PDG            Width
DECAY   1000035     1.92879029E+01   # neutralino4 decays
#          BR         NDA      ID1       ID2
     7.23347837E-05    2     1000022        23   # BR(~chi_40 -> ~chi_10   Z )
     5.16767074E-02    2     1000023        23   # BR(~chi_40 -> ~chi_20   Z )
     2.00571995E-01    2     1000025        23   # BR(~chi_40 -> ~chi_30   Z )
     2.44527369E-01    2     1000024       -24   # BR(~chi_40 -> ~chi_1+   W-)
     2.44527369E-01    2    -1000024        24   # BR(~chi_40 -> ~chi_1-   W+)
     1.59112848E-04    2     1000022        25   # BR(~chi_40 -> ~chi_10   h )
     5.39855225E-07    2     1000022        35   # BR(~chi_40 -> ~chi_10   H )
     7.33137146E-08    2     1000022        36   # BR(~chi_40 -> ~chi_10   A )
     2.06729629E-01    2     1000023        25   # BR(~chi_40 -> ~chi_20   h )
     5.17348693E-02    2     1000025        25   # BR(~chi_40 -> ~chi_30   h )
#
#         PDG            Width
DECAY        25     4.04579016E-03   # h decays
#          BR         NDA      ID1       ID2
     6.09267775E-01    2           5        -5   # BR(h -> b       bb     )
     6.40656938E-02    2         -15        15   # BR(h -> tau+    tau-   )
     2.26816194E-04    2         -13        13   # BR(h -> mu+     mu-    )
     4.80895700E-04    2           3        -3   # BR(h -> s       sb     )
     2.08391863E-02    2           4        -4   # BR(h -> c       cb     )
     6.73195439E-02    2          21        21   # BR(h -> g       g      )
     2.31292081E-03    2          22        22   # BR(h -> gam     gam    )
     1.48472440E-03    2          22        23   # BR(h -> Z       gam    )
     2.09080051E-01    2          24       -24   # BR(h -> W+      W-     )
     2.48830954E-02    2          23        23   # BR(h -> Z       Z      )
     3.92968000E-05    2     1000022   1000022   # BR(h -> ~chi_10 ~chi_10)
#
#         PDG            Width
DECAY        35     7.62234455E+00   # H decays
#          BR         NDA      ID1       ID2
     4.26259587E-01    2           5        -5   # BR(H -> b       bb     )
     7.31061006E-02    2         -15        15   # BR(H -> tau+    tau-   )
     2.58508978E-04    2         -13        13   # BR(H -> mu+     mu-    )
     3.16892413E-04    2           3        -3   # BR(H -> s       sb     )
     1.77168823E-06    2           4        -4   # BR(H -> c       cb     )
     1.77005686E-01    2           6        -6   # BR(H -> t       tb     )
     5.87765430E-05    2          21        21   # BR(H -> g       g      )
     3.62511580E-07    2          22        22   # BR(H -> gam     gam    )
     1.04505689E-07    2          23        22   # BR(H -> Z       gam    )
     7.98343522E-05    2          24       -24   # BR(H -> W+      W-     )
     3.98666522E-05    2          23        23   # BR(H -> Z       Z      )
     3.00197831E-04    2          25        25   # BR(H -> h       h      )
     2.20941066E-23    2          36        36   # BR(H -> A       A      )
     9.54055015E-19    2          23        36   # BR(H -> Z       A      )
     7.43973193E-04    2     1000024  -1000024   # BR(H -> ~chi_1+ ~chi_1-)
     1.12110684E-03    2     1000022   1000022   # BR(H -> ~chi_10 ~chi_10)
     5.61705127E-05    2     1000023   1000023   # BR(H -> ~chi_20 ~chi_20)
     1.24119437E-04    2     1000025   1000025   # BR(H -> ~chi_30 ~chi_30)
     1.91282528E-01    2     1000022   1000023   # BR(H -> ~chi_10 ~chi_20)
     1.29121402E-01    2     1000022   1000025   # BR(H -> ~chi_10 ~chi_30)
     1.23010146E-04    2     1000023   1000025   # BR(H -> ~chi_20 ~chi_30)
#
#         PDG            Width
DECAY        36     7.64339165E+00   # A decays
#          BR         NDA      ID1       ID2
     4.25229023E-01    2           5        -5   # BR(A -> b       bb     )
     7.29069610E-02    2         -15        15   # BR(A -> tau+    tau-   )
     2.57804445E-04    2         -13        13   # BR(A -> mu+     mu-    )
     3.16259658E-04    2           3        -3   # BR(A -> s       sb     )
     1.77413896E-06    2           4        -4   # BR(A -> c       cb     )
     1.77152737E-01    2           6        -6   # BR(A -> t       tb     )
     1.75325813E-04    2          21        21   # BR(A -> g       g      )
     4.87450581E-07    2          22        22   # BR(A -> gam     gam    )
     2.12342967E-07    2          23        22   # BR(A -> Z       gam    )
     7.93141478E-05    2          23        25   # BR(A -> Z       h      )
     2.59416424E-03    2     1000024  -1000024   # BR(A -> ~chi_1+ ~chi_1-)
     1.14776274E-03    2     1000022   1000022   # BR(A -> ~chi_10 ~chi_10)
     1.46895697E-04    2     1000023   1000023   # BR(A -> ~chi_20 ~chi_20)
     7.67071361E-04    2     1000025   1000025   # BR(A -> ~chi_30 ~chi_30)
     1.30367817E-01    2     1000022   1000023   # BR(A -> ~chi_10 ~chi_20)
     1.88849417E-01    2     1000022   1000025   # BR(A -> ~chi_10 ~chi_30)
     6.97310876E-06    2     1000023   1000025   # BR(A -> ~chi_20 ~chi_30)
#
#         PDG            Width
DECAY        37     7.61147272E+00   # H+ decays
#          BR         NDA      ID1       ID2
     6.84689961E-04    2           4        -5   # BR(H+ -> c       bb     )
     7.32339050E-02    2         -15        16   # BR(H+ -> tau+    nu_tau )
     2.58960543E-04    2         -13        14   # BR(H+ -> mu+     nu_mu  )
     4.38199320E-06    2           2        -5   # BR(H+ -> u       bb     )
     1.51952681E-05    2           2        -3   # BR(H+ -> u       sb     )
     3.14238293E-04    2           4        -3   # BR(H+ -> c       sb     )
     6.02104849E-01    2           6        -5   # BR(H+ -> t       bb     )
     7.97671290E-05    2          24        25   # BR(H+ -> W+      h      )
     8.55560988E-14    2          24        36   # BR(H+ -> W+      A      )
     3.22881335E-01    2     1000024   1000022   # BR(H+ -> ~chi_1+ ~chi_10)
     3.56430863E-04    2     1000024   1000023   # BR(H+ -> ~chi_1+ ~chi_20)
     6.62478056E-05    2     1000024   1000025   # BR(H+ -> ~chi_1+ ~chi_30)
