#
#                              ======================
#                              | THE SUSYHIT OUTPUT |
#                              ======================
#
#
#              ------------------------------------------------------
#              |     This is the output of the SUSY-HIT package     |
#              |  created by A.Djouadi, M.Muehlleitner and M.Spira. |
#              |  In case of problems with SUSY-HIT email to        |
#              |           margarete.muehlleitner@cern.ch           |
#              |           michael.spira@psi.ch                     |
#              |           abdelhak.djouadi@cern.ch                 |
#              ------------------------------------------------------
#
#              ------------------------------------------------------
#              |  SUSY Les Houches Accord - MSSM Spectrum + Decays  |
#              |              based on the decay programs           |
#              |                                                    |
#              |                     SDECAY 1.3b                    |
#              |                                                    |
#              |  Authors: M.Muhlleitner, A.Djouadi and Y.Mambrini  |
#              |  Ref.:    Comput.Phys.Commun.168(2005)46           |
#              |           [hep-ph/0311167]                         |
#              |                                                    |
#              |                     HDECAY 3.4                     |
#              |                                                    |
#              |  By: A.Djouadi,J.Kalinowski,M.Muhlleitner,M.Spira  |
#              |  Ref.:    Comput.Phys.Commun.108(1998)56           |
#              |           [hep-ph/9704448]                         |
#              |                                                    |
#              |                                                    |
#              |  If not stated otherwise all DRbar couplings and   |
#              |  soft SUSY breaking masses are given at the scale  |
#              |  Q=  0.50007716E+04
#              |                                                    |
#              ------------------------------------------------------
#
#
BLOCK DCINFO  # Decay Program information
     1   SDECAY/HDECAY # decay calculator
     2   1.3b  /3.4    # version number
#
BLOCK SPINFO  # Spectrum calculator information
     1    SOFTSUSY    # spectrum calculator                
     2    3.4.0       # version number                     
#
BLOCK MODSEL  # Model selection
     1     0   #  nonUniversal                                     
#
BLOCK SMINPUTS  # Standard Model inputs
         1     1.25778332E+02   # alpha_em^-1(M_Z)^MSbar
         2     1.16570000E-05   # G_F [GeV^-2]
         3     1.17200002E-01   # alpha_S(M_Z)^MSbar
         4     9.11876000E+01   # M_Z pole mass
         5     4.25000000E+00   # mb(mb)^MSbar
         6     1.72500000E+02   # mt pole mass
         7     1.77682000E+00   # mtau pole mass
#
BLOCK MINPAR  # Input parameters - minimal models
         3     1.00000000E+01   # tanb                
#
BLOCK EXTPAR  # Input parameters - non-minimal models
         0    -1.00000000E+00   # Set                 
         1     6.00000000E+01   # M_1(MX)             
         2     3.00000000E+03   # M_2(MX)             
         3     2.42817600E+03   # M_3(MX)             
        11     5.00000000E+03   # At(MX)              
        12     5.00000000E+03   # Ab(MX)              
        13     0.00000000E+00   # Atau(MX)            
        23    -2.82770000E+02   # mu(MX)              
        26     3.00000000E+03   # mA(pole)            
        31     5.00000000E+03   # meL(MX)             
        32     5.00000000E+03   # mmuL(MX)            
        33     5.00000000E+03   # mtauL(MX)           
        34     5.00000000E+03   # meR(MX)             
        35     5.00000000E+03   # mmuR(MX)            
        36     5.00000000E+03   # mtauR(MX)           
        41     5.00000000E+03   # mqL1(MX)            
        42     5.00000000E+03   # mqL2(MX)            
        43     5.00000000E+03   # mqL3(MX)            
        44     5.00000000E+03   # muR(MX)             
        45     5.00000000E+03   # mcR(MX)             
        46     5.00000000E+03   # mtR(MX)             
        47     5.00000000E+03   # mdR(MX)             
        48     5.00000000E+03   # msR(MX)             
        49     5.00000000E+03   # mbR(MX)             
#
BLOCK MASS  # Mass Spectrum
# PDG code           mass       particle
        24     8.00919278E+01   # W+
        25     1.24798477E+02   # h
        35     3.00008913E+03   # H
        36     2.99999971E+03   # A
        37     3.00146928E+03   # H+
         5     4.87878001E+00   # b-quark pole mass calculated from mb(mb)_Msbar
   1000001     5.08635887E+03   # ~d_L
   2000001     5.06853953E+03   # ~d_R
   1000002     5.08588822E+03   # ~u_L
   2000002     5.06823450E+03   # ~u_R
   1000003     5.08635887E+03   # ~s_L
   2000003     5.06853953E+03   # ~s_R
   1000004     5.08588822E+03   # ~c_L
   2000004     5.06823450E+03   # ~c_R
   1000005     5.03230881E+03   # ~b_1
   2000005     5.06665164E+03   # ~b_2
   1000006     4.92483151E+03   # ~t_1
   2000006     5.07456814E+03   # ~t_2
   1000011     5.01913600E+03   # ~e_L
   2000011     5.00595364E+03   # ~e_R
   1000012     5.01818457E+03   # ~nu_eL
   1000013     5.01913600E+03   # ~mu_L
   2000013     5.00595364E+03   # ~mu_R
   1000014     5.01818457E+03   # ~nu_muL
   1000015     5.00481611E+03   # ~tau_1
   2000015     5.01861752E+03   # ~tau_2
   1000016     5.01763083E+03   # ~nu_tauL
   1000021     2.80000069E+03   # ~g
   1000022     5.97919752E+01   # ~chi_10
   1000023     3.01967010E+02   # ~chi_20
   1000025    -3.03835888E+02   # ~chi_30
   1000035     3.07421939E+03   # ~chi_40
   1000024     3.00000260E+02   # ~chi_1+
   1000037     3.07438730E+03   # ~chi_2+
#
BLOCK NMIX  # Neutralino Mixing Matrix
  1  1     9.88607158E-01   # N_11
  1  2     6.02085572E-05   # N_12
  1  3    -1.49797110E-01   # N_13
  1  4    -1.47210499E-02   # N_14
  2  1     1.16361962E-01   # N_21
  2  2     1.76943714E-02   # N_22
  2  3     6.98596043E-01   # N_23
  2  4     7.05769348E-01   # N_24
  3  1    -9.54757710E-02   # N_31
  3  2     1.80268323E-02   # N_32
  3  3    -6.99660151E-01   # N_33
  3  4     7.07838317E-01   # N_34
  4  1    -3.97475491E-04   # N_41
  4  2     9.99680919E-01   # N_42
  4  3     2.60540614E-04   # N_43
  4  4    -2.52553998E-02   # N_44
#
BLOCK UMIX  # Chargino Mixing Matrix U
  1  1    -3.65914408E-04   # U_11
  1  2     9.99999933E-01   # U_12
  2  1    -9.99999933E-01   # U_21
  2  2    -3.65914408E-04   # U_22
#
BLOCK VMIX  # Chargino Mixing Matrix V
  1  1     3.57255744E-02   # V_11
  1  2    -9.99361638E-01   # V_12
  2  1    -9.99361638E-01   # V_21
  2  2    -3.57255744E-02   # V_22
#
BLOCK STOPMIX  # Stop Mixing Matrix
  1  1    -4.99572925E-01   # cos(theta_t)
  1  2     8.66271835E-01   # sin(theta_t)
  2  1    -8.66271835E-01   # -sin(theta_t)
  2  2    -4.99572925E-01   # cos(theta_t)
#
BLOCK SBOTMIX  # Sbottom Mixing Matrix
  1  1     9.99233688E-01   # cos(theta_b)
  1  2    -3.91412412E-02   # sin(theta_b)
  2  1     3.91412412E-02   # -sin(theta_b)
  2  2     9.99233688E-01   # cos(theta_b)
#
BLOCK STAUMIX  # Stau Mixing Matrix
  1  1    -3.37602563E-02   # cos(theta_tau)
  1  2     9.99429960E-01   # sin(theta_tau)
  2  1    -9.99429960E-01   # -sin(theta_tau)
  2  2    -3.37602563E-02   # cos(theta_tau)
#
BLOCK ALPHA  # Higgs mixing
          -1.05499048E-01   # Mixing angle in the neutral Higgs boson sector
#
BLOCK HMIX Q=  5.00077164E+03  # DRbar Higgs Parameters
         1    -2.87952663E+02   # mu(Q)MSSM           
         2     9.46824771E+00   # tan                 
         3     2.41701057E+02   # higgs               
         4     8.75208153E+06   # mA^2(Q)MSSM         
#
BLOCK GAUGE Q=  5.00077164E+03  # The gauge couplings
     1     3.71053972E-01   # gprime(Q) DRbar
     2     6.33848223E-01   # g(Q) DRbar
     3     9.93524286E-01   # g3(Q) DRbar
#
BLOCK AU Q=  5.00077164E+03  # The trilinear couplings
  1  1     5.00000002E+03   # A_u(Q) DRbar
  2  2     5.00000002E+03   # A_c(Q) DRbar
  3  3     5.00000003E+03   # A_t(Q) DRbar
#
BLOCK AD Q=  5.00077164E+03  # The trilinear couplings
  1  1     5.00000001E+03   # A_d(Q) DRbar
  2  2     5.00000001E+03   # A_s(Q) DRbar
  3  3     5.00000001E+03   # A_b(Q) DRbar
#
BLOCK AE Q=  5.00077164E+03  # The trilinear couplings
  1  1     0.00000000E+00   # A_e(Q) DRbar
  2  2     2.89390118E-07   # A_mu(Q) DRbar
  3  3     2.89485262E-07   # A_tau(Q) DRbar
#
BLOCK Yu Q=  5.00077164E+03  # The Yukawa couplings
  1  1     0.00000000E+00   # y_u(Q) DRbar
  2  2     0.00000000E+00   # y_c(Q) DRbar
  3  3     8.21907927E-01   # y_t(Q) DRbar
#
BLOCK Yd Q=  5.00077164E+03  # The Yukawa couplings
  1  1     0.00000000E+00   # y_d(Q) DRbar
  2  2     0.00000000E+00   # y_s(Q) DRbar
  3  3     1.30167872E-01   # y_b(Q) DRbar
#
BLOCK Ye Q=  5.00077164E+03  # The Yukawa couplings
  1  1     0.00000000E+00   # y_e(Q) DRbar
  2  2     0.00000000E+00   # y_mu(Q) DRbar
  3  3     9.72684164E-02   # y_tau(Q) DRbar
#
BLOCK MSOFT Q=  5.00077164E+03  # The soft SUSY breaking masses at the scale Q
         1     6.00000000E+01   # M_1(Q)              
         2     3.00000000E+03   # M_2(Q)              
         3     2.42817600E+03   # M_3(Q)              
        21     8.64858163E+06   # mH1^2(Q)            
        22     4.98601036E+05   # mH2^2(Q)            
        31     5.00000000E+03   # meL(Q)              
        32     5.00000000E+03   # mmuL(Q)             
        33     5.00000000E+03   # mtauL(Q)            
        34     5.00000000E+03   # meR(Q)              
        35     5.00000000E+03   # mmuR(Q)             
        36     5.00000000E+03   # mtauR(Q)            
        41     4.99999999E+03   # mqL1(Q)             
        42     4.99999999E+03   # mqL2(Q)             
        43     4.99999999E+03   # mqL3(Q)             
        44     4.99999999E+03   # muR(Q)              
        45     4.99999999E+03   # mcR(Q)              
        46     4.99999999E+03   # mtR(Q)              
        47     4.99999999E+03   # mdR(Q)              
        48     4.99999999E+03   # msR(Q)              
        49     4.99999999E+03   # mbR(Q)              
#
#
#
#                             =================
#                             |The decay table|
#                             =================
#
# - The QCD corrections to the decays gluino -> squark  + quark
#                                     squark -> gaugino + quark_prime
#                                     squark -> squark_prime + Higgs
#                                     squark -> gluino  + quark
#   are included.
#
# - The multi-body decays for the inos, stops and sbottoms are included.
#
# - The loop induced decays for the gluino, neutralinos and stops
#   are included.
#
# - The SUSY decays of the top quark are included.
#
#
#         PDG            Width
DECAY         6     1.40805071E+00   # top decays
#          BR         NDA      ID1       ID2
     1.00000000E+00    2           5        24   # BR(t ->  b    W+)
#
#         PDG            Width
DECAY   1000021     1.58446611E-02   # gluino decays
#          BR         NDA      ID1       ID2
     2.92455589E-07    2     1000022        21   # BR(~g -> ~chi_10 g)
     3.06226260E-03    2     1000023        21   # BR(~g -> ~chi_20 g)
     2.96646508E-03    2     1000025        21   # BR(~g -> ~chi_30 g)
#           BR         NDA      ID1       ID2       ID3
     8.65909693E-03    3     1000022         1        -1   # BR(~g -> ~chi_10 d  db)
     1.01553511E-04    3     1000023         1        -1   # BR(~g -> ~chi_20 d  db)
     9.34196126E-05    3     1000025         1        -1   # BR(~g -> ~chi_30 d  db)
     2.95210845E-02    3     1000022         2        -2   # BR(~g -> ~chi_10 u  ub)
     4.79697737E-04    3     1000023         2        -2   # BR(~g -> ~chi_20 u  ub)
     1.91493600E-04    3     1000025         2        -2   # BR(~g -> ~chi_30 u  ub)
     8.65909693E-03    3     1000022         3        -3   # BR(~g -> ~chi_10 s  sb)
     1.01553511E-04    3     1000023         3        -3   # BR(~g -> ~chi_20 s  sb)
     9.34196126E-05    3     1000025         3        -3   # BR(~g -> ~chi_30 s  sb)
     2.95210845E-02    3     1000022         4        -4   # BR(~g -> ~chi_10 c  cb)
     4.79697737E-04    3     1000023         4        -4   # BR(~g -> ~chi_20 c  cb)
     1.91493600E-04    3     1000025         4        -4   # BR(~g -> ~chi_30 c  cb)
     9.04559570E-03    3     1000022         5        -5   # BR(~g -> ~chi_10 b  bb)
     5.30351710E-03    3     1000023         5        -5   # BR(~g -> ~chi_20 b  bb)
     5.30539744E-03    3     1000025         5        -5   # BR(~g -> ~chi_30 b  bb)
     3.00610594E-02    3     1000022         6        -6   # BR(~g -> ~chi_10 t  tb)
     2.15744432E-01    3     1000023         6        -6   # BR(~g -> ~chi_20 t  tb)
     2.07491540E-01    3     1000025         6        -6   # BR(~g -> ~chi_30 t  tb)
     5.21385690E-05    3     1000024         1        -2   # BR(~g -> ~chi_1+ d  ub)
     5.21385690E-05    3    -1000024         2        -1   # BR(~g -> ~chi_1- u  db)
     5.21385690E-05    3     1000024         3        -4   # BR(~g -> ~chi_1+ s  cb)
     5.21385690E-05    3    -1000024         4        -3   # BR(~g -> ~chi_1- c  sb)
     2.21359096E-01    3     1000024         5        -6   # BR(~g -> ~chi_1+ b  tb)
     2.21359096E-01    3    -1000024         6        -5   # BR(~g -> ~chi_1- t  bb)
#
#         PDG            Width
DECAY   1000006     2.73436012E+02   # stop1 decays
#          BR         NDA      ID1       ID2
     3.11127354E-02    2     1000022         6   # BR(~t_1 -> ~chi_10 t )
     1.23689340E-01    2     1000023         6   # BR(~t_1 -> ~chi_20 t )
     1.13856460E-01    2     1000025         6   # BR(~t_1 -> ~chi_30 t )
     7.26763314E-03    2     1000035         6   # BR(~t_1 -> ~chi_40 t )
     1.78245910E-01    2     1000024         5   # BR(~t_1 -> ~chi_1+ b )
     1.44882873E-02    2     1000037         5   # BR(~t_1 -> ~chi_2+ b )
     5.31339634E-01    2     1000021         6   # BR(~t_1 -> ~g      t )
#
#         PDG            Width
DECAY   2000006     2.80005296E+02   # stop2 decays
#          BR         NDA      ID1       ID2
     1.28223831E-02    2     1000022         6   # BR(~t_2 -> ~chi_10 t )
     1.16149295E-01    2     1000023         6   # BR(~t_2 -> ~chi_20 t )
     1.27130065E-01    2     1000025         6   # BR(~t_2 -> ~chi_30 t )
     2.04945117E-02    2     1000035         6   # BR(~t_2 -> ~chi_40 t )
     6.76808439E-02    2     1000024         5   # BR(~t_2 -> ~chi_1+ b )
     4.08136113E-02    2     1000037         5   # BR(~t_2 -> ~chi_2+ b )
     6.10830367E-01    2     1000021         6   # BR(~t_2 -> ~g      t )
     9.48851187E-04    2     1000006        25   # BR(~t_2 -> ~t_1    h )
     3.13007208E-03    2     1000006        23   # BR(~t_2 -> ~t_1    Z )
#
#         PDG            Width
DECAY   1000005     2.54207003E+02   # sbottom1 decays
#          BR         NDA      ID1       ID2
     3.13182418E-03    2     1000022         5   # BR(~b_1 -> ~chi_10 b )
     3.17015823E-03    2     1000023         5   # BR(~b_1 -> ~chi_20 b )
     3.25297622E-03    2     1000025         5   # BR(~b_1 -> ~chi_30 b )
     3.01839867E-02    2     1000035         5   # BR(~b_1 -> ~chi_40 b )
     2.62546346E-01    2    -1000024         6   # BR(~b_1 -> ~chi_1- t )
     6.05958372E-02    2    -1000037         6   # BR(~b_1 -> ~chi_2- t )
     6.35051062E-01    2     1000021         5   # BR(~b_1 -> ~g      b )
     2.06780899E-03    2     1000006       -24   # BR(~b_1 -> ~t_1    W-)
#
#         PDG            Width
DECAY   2000005     1.70773519E+02   # sbottom2 decays
#          BR         NDA      ID1       ID2
     1.69947799E-02    2     1000022         5   # BR(~b_2 -> ~chi_10 b )
     5.15247097E-03    2     1000023         5   # BR(~b_2 -> ~chi_20 b )
     5.12982998E-03    2     1000025         5   # BR(~b_2 -> ~chi_30 b )
     5.76821877E-05    2     1000035         5   # BR(~b_2 -> ~chi_40 b )
     1.03939439E-02    2    -1000024         6   # BR(~b_2 -> ~chi_1- t )
     1.15834979E-04    2    -1000037         6   # BR(~b_2 -> ~chi_2- t )
     9.62135145E-01    2     1000021         5   # BR(~b_2 -> ~g      b )
     2.03126525E-05    2     1000006       -24   # BR(~b_2 -> ~t_1    W-)
#
#         PDG            Width
DECAY   1000002     1.90611592E+02   # sup_L decays
#          BR         NDA      ID1       ID2
     3.82385196E-03    2     1000022         2   # BR(~u_L -> ~chi_10 u)
     1.66614300E-04    2     1000023         2   # BR(~u_L -> ~chi_20 u)
     3.71922542E-08    2     1000025         2   # BR(~u_L -> ~chi_30 u)
     4.17383834E-02    2     1000035         2   # BR(~u_L -> ~chi_40 u)
     2.60594973E-04    2     1000024         1   # BR(~u_L -> ~chi_1+ d)
     8.34260020E-02    2     1000037         1   # BR(~u_L -> ~chi_2+ d)
     8.70584516E-01    2     1000021         2   # BR(~u_L -> ~g      u)
#
#         PDG            Width
DECAY   2000002     1.76246031E+02   # sup_R decays
#          BR         NDA      ID1       ID2
     6.58922393E-02    2     1000022         2   # BR(~u_R -> ~chi_10 u)
     9.07423508E-04    2     1000023         2   # BR(~u_R -> ~chi_20 u)
     6.10855579E-04    2     1000025         2   # BR(~u_R -> ~chi_30 u)
     4.29857748E-09    2     1000035         2   # BR(~u_R -> ~chi_40 u)
     9.32589477E-01    2     1000021         2   # BR(~u_R -> ~g      u)
#
#         PDG            Width
DECAY   1000001     1.90628086E+02   # sdown_L decays
#          BR         NDA      ID1       ID2
     3.81911237E-03    2     1000022         1   # BR(~d_L -> ~chi_10 d)
     2.56395810E-06    2     1000023         1   # BR(~d_L -> ~chi_20 d)
     1.37160773E-04    2     1000025         1   # BR(~d_L -> ~chi_30 d)
     4.17604366E-02    2     1000035         1   # BR(~d_L -> ~chi_40 d)
     2.73382452E-08    2    -1000024         2   # BR(~d_L -> ~chi_1- u)
     8.35508105E-02    2    -1000037         2   # BR(~d_L -> ~chi_2- u)
     8.70729888E-01    2     1000021         1   # BR(~d_L -> ~g      d)
#
#         PDG            Width
DECAY   2000001     1.67362860E+02   # sdown_R decays
#          BR         NDA      ID1       ID2
     1.73484742E-02    2     1000022         1   # BR(~d_R -> ~chi_10 d)
     2.38911665E-04    2     1000023         1   # BR(~d_R -> ~chi_20 d)
     1.60829562E-04    2     1000025         1   # BR(~d_R -> ~chi_30 d)
     1.13190939E-09    2     1000035         1   # BR(~d_R -> ~chi_40 d)
     9.82251783E-01    2     1000021         1   # BR(~d_R -> ~g      d)
#
#         PDG            Width
DECAY   1000004     1.90611592E+02   # scharm_L decays
#          BR         NDA      ID1       ID2
     3.82385196E-03    2     1000022         4   # BR(~c_L -> ~chi_10 c)
     1.66614300E-04    2     1000023         4   # BR(~c_L -> ~chi_20 c)
     3.71922542E-08    2     1000025         4   # BR(~c_L -> ~chi_30 c)
     4.17383834E-02    2     1000035         4   # BR(~c_L -> ~chi_40 c)
     2.60594973E-04    2     1000024         3   # BR(~c_L -> ~chi_1+ s)
     8.34260020E-02    2     1000037         3   # BR(~c_L -> ~chi_2+ s)
     8.70584516E-01    2     1000021         4   # BR(~c_L -> ~g      c)
#
#         PDG            Width
DECAY   2000004     1.76246031E+02   # scharm_R decays
#          BR         NDA      ID1       ID2
     6.58922393E-02    2     1000022         4   # BR(~c_R -> ~chi_10 c)
     9.07423508E-04    2     1000023         4   # BR(~c_R -> ~chi_20 c)
     6.10855579E-04    2     1000025         4   # BR(~c_R -> ~chi_30 c)
     4.29857748E-09    2     1000035         4   # BR(~c_R -> ~chi_40 c)
     9.32589477E-01    2     1000021         4   # BR(~c_R -> ~g      c)
#
#         PDG            Width
DECAY   1000003     1.90628086E+02   # sstrange_L decays
#          BR         NDA      ID1       ID2
     3.81911237E-03    2     1000022         3   # BR(~s_L -> ~chi_10 s)
     2.56395810E-06    2     1000023         3   # BR(~s_L -> ~chi_20 s)
     1.37160773E-04    2     1000025         3   # BR(~s_L -> ~chi_30 s)
     4.17604366E-02    2     1000035         3   # BR(~s_L -> ~chi_40 s)
     2.73382452E-08    2    -1000024         4   # BR(~s_L -> ~chi_1- c)
     8.35508105E-02    2    -1000037         4   # BR(~s_L -> ~chi_2- c)
     8.70729888E-01    2     1000021         3   # BR(~s_L -> ~g      s)
#
#         PDG            Width
DECAY   2000003     1.67362860E+02   # sstrange_R decays
#          BR         NDA      ID1       ID2
     1.73484742E-02    2     1000022         3   # BR(~s_R -> ~chi_10 s)
     2.38911665E-04    2     1000023         3   # BR(~s_R -> ~chi_20 s)
     1.60829562E-04    2     1000025         3   # BR(~s_R -> ~chi_30 s)
     1.13190939E-09    2     1000035         3   # BR(~s_R -> ~chi_40 s)
     9.82251783E-01    2     1000021         3   # BR(~s_R -> ~g      s)
#
#         PDG            Width
DECAY   1000011     3.03765489E+01   # selectron_L decays
#          BR         NDA      ID1       ID2
     2.21146177E-01    2     1000022        11   # BR(~e_L -> ~chi_10 e-)
     4.82739578E-03    2     1000023        11   # BR(~e_L -> ~chi_20 e-)
     9.39806384E-04    2     1000025        11   # BR(~e_L -> ~chi_30 e-)
     2.57528433E-01    2     1000035        11   # BR(~e_L -> ~chi_40 e-)
     1.75566466E-07    2    -1000024        12   # BR(~e_L -> ~chi_1- nu_e)
     5.15558011E-01    2    -1000037        12   # BR(~e_L -> ~chi_2- nu_e)
#
#         PDG            Width
DECAY   2000011     2.74112044E+01   # selectron_R decays
#          BR         NDA      ID1       ID2
     9.77499607E-01    2     1000022        11   # BR(~e_R -> ~chi_10 e-)
     1.34477242E-02    2     1000023        11   # BR(~e_R -> ~chi_20 e-)
     9.05260737E-03    2     1000025        11   # BR(~e_R -> ~chi_30 e-)
     6.13200517E-08    2     1000035        11   # BR(~e_R -> ~chi_40 e-)
#
#         PDG            Width
DECAY   1000013     3.03765489E+01   # smuon_L decays
#          BR         NDA      ID1       ID2
     2.21146177E-01    2     1000022        13   # BR(~mu_L -> ~chi_10 mu-)
     4.82739578E-03    2     1000023        13   # BR(~mu_L -> ~chi_20 mu-)
     9.39806384E-04    2     1000025        13   # BR(~mu_L -> ~chi_30 mu-)
     2.57528433E-01    2     1000035        13   # BR(~mu_L -> ~chi_40 mu-)
     1.75566466E-07    2    -1000024        14   # BR(~mu_L -> ~chi_1- nu_mu)
     5.15558011E-01    2    -1000037        14   # BR(~mu_L -> ~chi_2- nu_mu)
#
#         PDG            Width
DECAY   2000013     2.74112044E+01   # smuon_R decays
#          BR         NDA      ID1       ID2
     9.77499607E-01    2     1000022        13   # BR(~mu_R -> ~chi_10 mu-)
     1.34477242E-02    2     1000023        13   # BR(~mu_R -> ~chi_20 mu-)
     9.05260737E-03    2     1000025        13   # BR(~mu_R -> ~chi_30 mu-)
     6.13200517E-08    2     1000035        13   # BR(~mu_R -> ~chi_40 mu-)
#
#         PDG            Width
DECAY   1000015     2.92775916E+01   # stau_1 decays
#          BR         NDA      ID1       ID2
     9.15784560E-01    2     1000022        15   # BR(~tau_1 -> ~chi_10  tau-)
     2.78165880E-02    2     1000023        15   # BR(~tau_1 -> ~chi_20  tau-)
     2.35871970E-02    2     1000025        15   # BR(~tau_1 -> ~chi_30  tau-)
     3.02656324E-04    2     1000035        15   # BR(~tau_1 -> ~chi_40  tau-)
     3.19032397E-02    2    -1000024        16   # BR(~tau_1 -> ~chi_1-  nu_tau)
     6.05758785E-04    2    -1000037        16   # BR(~tau_1 -> ~chi_2-  nu_tau)
#
#         PDG            Width
DECAY   2000015     3.13032294E+01   # stau_2 decays
#          BR         NDA      ID1       ID2
     2.15174612E-01    2     1000022        15   # BR(~tau_2 -> ~chi_10  tau-)
     1.96417268E-02    2     1000023        15   # BR(~tau_2 -> ~chi_20  tau-)
     1.60653946E-02    2     1000025        15   # BR(~tau_2 -> ~chi_30  tau-)
     2.49531087E-01    2     1000035        15   # BR(~tau_2 -> ~chi_40  tau-)
     3.91396346E-05    2    -1000024        16   # BR(~tau_2 -> ~chi_1-  nu_tau)
     4.99548040E-01    2    -1000037        16   # BR(~tau_2 -> ~chi_2-  nu_tau)
#
#         PDG            Width
DECAY   1000012     3.03796768E+01   # snu_eL decays
#          BR         NDA      ID1       ID2
     2.20989486E-01    2     1000022        12   # BR(~nu_eL -> ~chi_10 nu_e)
     1.66630350E-03    2     1000023        12   # BR(~nu_eL -> ~chi_20 nu_e)
     3.58052968E-03    2     1000025        12   # BR(~nu_eL -> ~chi_30 nu_e)
     2.57575579E-01    2     1000035        12   # BR(~nu_eL -> ~chi_40 nu_e)
     1.67306478E-03    2     1000024        11   # BR(~nu_eL -> ~chi_1+ e-)
     5.14515037E-01    2     1000037        11   # BR(~nu_eL -> ~chi_2+ e-)
#
#         PDG            Width
DECAY   1000014     3.03796768E+01   # snu_muL decays
#          BR         NDA      ID1       ID2
     2.20989486E-01    2     1000022        14   # BR(~nu_muL -> ~chi_10 nu_mu)
     1.66630350E-03    2     1000023        14   # BR(~nu_muL -> ~chi_20 nu_mu)
     3.58052968E-03    2     1000025        14   # BR(~nu_muL -> ~chi_30 nu_mu)
     2.57575579E-01    2     1000035        14   # BR(~nu_muL -> ~chi_40 nu_mu)
     1.67306478E-03    2     1000024        13   # BR(~nu_muL -> ~chi_1+ mu-)
     5.14515037E-01    2     1000037        13   # BR(~nu_muL -> ~chi_2+ mu-)
#
#         PDG            Width
DECAY   1000016     3.13078085E+01   # snu_tauL decays
#          BR         NDA      ID1       ID2
     2.14414493E-01    2     1000022        16   # BR(~nu_tauL -> ~chi_10 nu_tau)
     1.61672429E-03    2     1000023        16   # BR(~nu_tauL -> ~chi_20 nu_tau)
     3.47399450E-03    2     1000025        16   # BR(~nu_tauL -> ~chi_30 nu_tau)
     2.49845798E-01    2     1000035        16   # BR(~nu_tauL -> ~chi_40 nu_tau)
     3.15747265E-02    2     1000024        15   # BR(~nu_tauL -> ~chi_1+ tau-)
     4.99074263E-01    2     1000037        15   # BR(~nu_tauL -> ~chi_2+ tau-)
#
#         PDG            Width
DECAY   1000024     1.63049146E-01   # chargino1+ decays
#          BR         NDA      ID1       ID2
     1.00000000E+00    2     1000022        24   # BR(~chi_1+ -> ~chi_10  W+)
#
#         PDG            Width
DECAY   1000037     2.28953095E+01   # chargino2+ decays
#          BR         NDA      ID1       ID2
     2.53648473E-01    2     1000024        23   # BR(~chi_2+ -> ~chi_1+  Z )
     1.47796190E-04    2     1000022        24   # BR(~chi_2+ -> ~chi_10  W+)
     2.45426586E-01    2     1000023        24   # BR(~chi_2+ -> ~chi_20  W+)
     2.44530618E-01    2     1000025        24   # BR(~chi_2+ -> ~chi_30  W+)
     2.56231398E-01    2     1000024        25   # BR(~chi_2+ -> ~chi_1+  h )
     1.51282655E-05    2     1000022        37   # BR(~chi_2+ -> ~chi_10  H+)
#
#         PDG            Width
DECAY   1000022     0.00000000E+00   # neutralino1 decays
#
#         PDG            Width
DECAY   1000023     1.53403050E-01   # neutralino2 decays
#          BR         NDA      ID1       ID2
     4.91774506E-01    2     1000022        23   # BR(~chi_20 -> ~chi_10   Z )
     5.08225494E-01    2     1000022        25   # BR(~chi_20 -> ~chi_10   h )
#
#         PDG            Width
DECAY   1000025     1.38255603E-01   # neutralino3 decays
#          BR         NDA      ID1       ID2
     6.71453825E-01    2     1000022        23   # BR(~chi_30 -> ~chi_10   Z )
     3.28546175E-01    2     1000022        25   # BR(~chi_30 -> ~chi_10   h )
#
#         PDG            Width
DECAY   1000035     2.28968005E+01   # neutralino4 decays
#          BR         NDA      ID1       ID2
     6.90266510E-05    2     1000022        23   # BR(~chi_40 -> ~chi_10   Z )
     1.29012118E-01    2     1000023        23   # BR(~chi_40 -> ~chi_20   Z )
     1.24402226E-01    2     1000025        23   # BR(~chi_40 -> ~chi_30   Z )
     2.45257526E-01    2     1000024       -24   # BR(~chi_40 -> ~chi_1+   W-)
     2.45257526E-01    2    -1000024        24   # BR(~chi_40 -> ~chi_1-   W+)
     6.83400049E-05    2     1000022        25   # BR(~chi_40 -> ~chi_10   h )
     1.46030369E-05    2     1000022        35   # BR(~chi_40 -> ~chi_10   H )
     1.54744706E-06    2     1000022        36   # BR(~chi_40 -> ~chi_10   A )
     1.26597669E-01    2     1000023        25   # BR(~chi_40 -> ~chi_20   h )
     1.29319418E-01    2     1000025        25   # BR(~chi_40 -> ~chi_30   h )
#
#         PDG            Width
DECAY        25     4.07544943E-03   # h decays
#          BR         NDA      ID1       ID2
     6.09117927E-01    2           5        -5   # BR(h -> b       bb     )
     6.36643430E-02    2         -15        15   # BR(h -> tau+    tau-   )
     2.25394812E-04    2         -13        13   # BR(h -> mu+     mu-    )
     4.77804085E-04    2           3        -3   # BR(h -> s       sb     )
     2.07012183E-02    2           4        -4   # BR(h -> c       cb     )
     6.69932376E-02    2          21        21   # BR(h -> g       g      )
     2.30210522E-03    2          22        22   # BR(h -> gam     gam    )
     1.48747905E-03    2          22        23   # BR(h -> Z       gam    )
     2.10004522E-01    2          24       -24   # BR(h -> W+      W-     )
     2.50237200E-02    2          23        23   # BR(h -> Z       Z      )
     2.24899406E-06    2     1000022   1000022   # BR(h -> ~chi_10 ~chi_10)
#
#         PDG            Width
DECAY        35     8.77783006E+00   # H decays
#          BR         NDA      ID1       ID2
     3.61349924E-01    2           5        -5   # BR(H -> b       bb     )
     6.34466980E-02    2         -15        15   # BR(H -> tau+    tau-   )
     2.24352564E-04    2         -13        13   # BR(H -> mu+     mu-    )
     2.75021736E-04    2           3        -3   # BR(H -> s       sb     )
     1.53964150E-06    2           4        -4   # BR(H -> c       cb     )
     1.53822388E-01    2           6        -6   # BR(H -> t       tb     )
     5.11834256E-05    2          21        21   # BR(H -> g       g      )
     1.38385494E-07    2          22        22   # BR(H -> gam     gam    )
     9.07556216E-08    2          23        22   # BR(H -> Z       gam    )
     7.48630069E-05    2          24       -24   # BR(H -> W+      W-     )
     3.73841118E-05    2          23        23   # BR(H -> Z       Z      )
     2.67699554E-04    2          25        25   # BR(H -> h       h      )
    -3.10766441E-24    2          36        36   # BR(H -> A       A      )
     6.49045430E-19    2          23        36   # BR(H -> Z       A      )
     3.40720708E-03    2     1000024  -1000024   # BR(H -> ~chi_1+ ~chi_1-)
     1.88177961E-02    2     1000022   1000022   # BR(H -> ~chi_10 ~chi_10)
     3.33028938E-03    2     1000023   1000023   # BR(H -> ~chi_20 ~chi_20)
     5.10696620E-03    2     1000025   1000025   # BR(H -> ~chi_30 ~chi_30)
     2.32168741E-01    2     1000022   1000023   # BR(H -> ~chi_10 ~chi_20)
     1.48105049E-01    2     1000022   1000025   # BR(H -> ~chi_10 ~chi_30)
     9.51266673E-03    2     1000023   1000025   # BR(H -> ~chi_20 ~chi_30)
#
#         PDG            Width
DECAY        36     8.78315774E+00   # A decays
#          BR         NDA      ID1       ID2
     3.61254345E-01    2           5        -5   # BR(A -> b       bb     )
     6.34100727E-02    2         -15        15   # BR(A -> tau+    tau-   )
     2.24222740E-04    2         -13        13   # BR(A -> mu+     mu-    )
     2.75063627E-04    2           3        -3   # BR(A -> s       sb     )
     1.54478909E-06    2           4        -4   # BR(A -> c       cb     )
     1.54251511E-01    2           6        -6   # BR(A -> t       tb     )
     1.52624802E-04    2          21        21   # BR(A -> g       g      )
     5.64053052E-07    2          22        22   # BR(A -> gam     gam    )
     1.84708096E-07    2          23        22   # BR(A -> Z       gam    )
     7.45340742E-05    2          23        25   # BR(A -> Z       h      )
     3.56249938E-03    2     1000024  -1000024   # BR(A -> ~chi_1+ ~chi_1-)
     1.80698007E-02    2     1000022   1000022   # BR(A -> ~chi_10 ~chi_10)
     2.25897135E-03    2     1000023   1000023   # BR(A -> ~chi_20 ~chi_20)
     8.17911354E-03    2     1000025   1000025   # BR(A -> ~chi_30 ~chi_30)
     1.51233869E-01    2     1000022   1000023   # BR(A -> ~chi_10 ~chi_20)
     2.28712047E-01    2     1000022   1000025   # BR(A -> ~chi_10 ~chi_30)
     8.33903172E-03    2     1000023   1000025   # BR(A -> ~chi_20 ~chi_30)
#
#         PDG            Width
DECAY        37     8.72845530E+00   # H+ decays
#          BR         NDA      ID1       ID2
     5.79574179E-04    2           4        -5   # BR(H+ -> c       bb     )
     6.38387290E-02    2         -15        16   # BR(H+ -> tau+    nu_tau )
     2.25738501E-04    2         -13        14   # BR(H+ -> mu+     nu_mu  )
     3.70925520E-06    2           2        -5   # BR(H+ -> u       bb     )
     1.32455242E-05    2           2        -3   # BR(H+ -> u       sb     )
     2.73919260E-04    2           4        -3   # BR(H+ -> c       sb     )
     5.14248078E-01    2           6        -5   # BR(H+ -> t       bb     )
     7.51598896E-05    2          24        25   # BR(H+ -> W+      h      )
     1.03186781E-12    2          24        36   # BR(H+ -> W+      A      )
     4.09927627E-01    2     1000024   1000022   # BR(H+ -> ~chi_1+ ~chi_10)
     9.10955501E-03    2     1000024   1000023   # BR(H+ -> ~chi_1+ ~chi_20)
     1.70466448E-03    2     1000024   1000025   # BR(H+ -> ~chi_1+ ~chi_30)
