#
#                              ======================
#                              | THE SUSYHIT OUTPUT |
#                              ======================
#
#
#              ------------------------------------------------------
#              |     This is the output of the SUSY-HIT package     |
#              |  created by A.Djouadi, M.Muehlleitner and M.Spira. |
#              |  In case of problems with SUSY-HIT email to        |
#              |           margarete.muehlleitner@cern.ch           |
#              |           michael.spira@psi.ch                     |
#              |           abdelhak.djouadi@cern.ch                 |
#              ------------------------------------------------------
#
#              ------------------------------------------------------
#              |  SUSY Les Houches Accord - MSSM Spectrum + Decays  |
#              |              based on the decay programs           |
#              |                                                    |
#              |                     SDECAY 1.3b                    |
#              |                                                    |
#              |  Authors: M.Muhlleitner, A.Djouadi and Y.Mambrini  |
#              |  Ref.:    Comput.Phys.Commun.168(2005)46           |
#              |           [hep-ph/0311167]                         |
#              |                                                    |
#              |                     HDECAY 3.4                     |
#              |                                                    |
#              |  By: A.Djouadi,J.Kalinowski,M.Muhlleitner,M.Spira  |
#              |  Ref.:    Comput.Phys.Commun.108(1998)56           |
#              |           [hep-ph/9704448]                         |
#              |                                                    |
#              |                                                    |
#              |  If not stated otherwise all DRbar couplings and   |
#              |  soft SUSY breaking masses are given at the scale  |
#              |  Q=  0.50007553E+04
#              |                                                    |
#              ------------------------------------------------------
#
#
BLOCK DCINFO  # Decay Program information
     1   SDECAY/HDECAY # decay calculator
     2   1.3b  /3.4    # version number
#
BLOCK SPINFO  # Spectrum calculator information
     1    SOFTSUSY    # spectrum calculator                
     2    3.4.0       # version number                     
#
BLOCK MODSEL  # Model selection
     1     0   #  nonUniversal                                     
#
BLOCK SMINPUTS  # Standard Model inputs
         1     1.25778332E+02   # alpha_em^-1(M_Z)^MSbar
         2     1.16570000E-05   # G_F [GeV^-2]
         3     1.17200002E-01   # alpha_S(M_Z)^MSbar
         4     9.11876000E+01   # M_Z pole mass
         5     4.25000000E+00   # mb(mb)^MSbar
         6     1.72500000E+02   # mt pole mass
         7     1.77682000E+00   # mtau pole mass
#
BLOCK MINPAR  # Input parameters - minimal models
         3     1.00000000E+01   # tanb                
#
BLOCK EXTPAR  # Input parameters - non-minimal models
         0    -1.00000000E+00   # Set                 
         1     6.00000000E+01   # M_1(MX)             
         2     3.00000000E+03   # M_2(MX)             
         3     1.21156100E+03   # M_3(MX)             
        11     5.00000000E+03   # At(MX)              
        12     5.00000000E+03   # Ab(MX)              
        13     0.00000000E+00   # Atau(MX)            
        23    -4.74983000E+02   # mu(MX)              
        26     3.00000000E+03   # mA(pole)            
        31     5.00000000E+03   # meL(MX)             
        32     5.00000000E+03   # mmuL(MX)            
        33     5.00000000E+03   # mtauL(MX)           
        34     5.00000000E+03   # meR(MX)             
        35     5.00000000E+03   # mmuR(MX)            
        36     5.00000000E+03   # mtauR(MX)           
        41     5.00000000E+03   # mqL1(MX)            
        42     5.00000000E+03   # mqL2(MX)            
        43     5.00000000E+03   # mqL3(MX)            
        44     5.00000000E+03   # muR(MX)             
        45     5.00000000E+03   # mcR(MX)             
        46     5.00000000E+03   # mtR(MX)             
        47     5.00000000E+03   # mdR(MX)             
        48     5.00000000E+03   # msR(MX)             
        49     5.00000000E+03   # mbR(MX)             
#
BLOCK MASS  # Mass Spectrum
# PDG code           mass       particle
        24     8.00919895E+01   # W+
        25     1.24603509E+02   # h
        35     3.00008558E+03   # H
        36     2.99999944E+03   # A
        37     3.00142926E+03   # H+
         5     4.87878001E+00   # b-quark pole mass calculated from mb(mb)_Msbar
   1000001     5.06673059E+03   # ~d_L
   2000001     5.04886689E+03   # ~d_R
   1000002     5.06625424E+03   # ~u_L
   2000002     5.04856592E+03   # ~u_R
   1000003     5.06673059E+03   # ~s_L
   2000003     5.04886689E+03   # ~s_R
   1000004     5.06625424E+03   # ~c_L
   2000004     5.04856592E+03   # ~c_R
   1000005     5.01280341E+03   # ~b_1
   2000005     5.04712302E+03   # ~b_2
   1000006     4.90338352E+03   # ~t_1
   2000006     5.05734790E+03   # ~t_2
   1000011     5.01911054E+03   # ~e_L
   2000011     5.00594410E+03   # ~e_R
   1000012     5.01816007E+03   # ~nu_eL
   1000013     5.01911054E+03   # ~mu_L
   2000013     5.00594410E+03   # ~mu_R
   1000014     5.01816007E+03   # ~nu_muL
   1000015     5.00477455E+03   # ~tau_1
   2000015     5.01863474E+03   # ~tau_2
   1000016     5.01760832E+03   # ~nu_tauL
   1000021     1.50000023E+03   # ~g
   1000022     6.02022011E+01   # ~chi_10
   1000023     5.00512006E+02   # ~chi_20
   1000025    -5.02708293E+02   # ~chi_30
   1000035     3.07418588E+03   # ~chi_40
   1000024     5.00000317E+02   # ~chi_1+
   1000037     3.07435362E+03   # ~chi_2+
#
BLOCK NMIX  # Neutralino Mixing Matrix
  1  1     9.96028657E-01   # N_11
  1  2     2.24904936E-04   # N_12
  1  3    -8.90198980E-02   # N_13
  1  4    -1.52356364E-03   # N_14
  2  1     6.40598079E-02   # N_21
  2  2     1.90091076E-02   # N_22
  2  3     7.04713549E-01   # N_23
  2  4     7.06338310E-01   # N_24
  3  1    -6.18312476E-02   # N_31
  3  2     1.70158496E-02   # N_32
  3  3    -7.03883736E-01   # N_33
  3  4     7.07414337E-01   # N_34
  4  1    -3.89747204E-04   # N_41
  4  2     9.99674479E-01   # N_42
  4  3    -1.39923037E-03   # N_43
  4  4    -2.54720660E-02   # N_44
#
BLOCK UMIX  # Chargino Mixing Matrix U
  1  1     1.98406307E-03   # U_11
  1  2     9.99998032E-01   # U_12
  2  1    -9.99998032E-01   # U_21
  2  2     1.98406307E-03   # U_22
#
BLOCK VMIX  # Chargino Mixing Matrix V
  1  1     3.60432213E-02   # V_11
  1  2    -9.99350232E-01   # V_12
  2  1    -9.99350232E-01   # V_21
  2  2    -3.60432213E-02   # V_22
#
BLOCK STOPMIX  # Stop Mixing Matrix
  1  1    -5.05681109E-01   # cos(theta_t)
  1  2     8.62720474E-01   # sin(theta_t)
  2  1    -8.62720474E-01   # -sin(theta_t)
  2  2    -5.05681109E-01   # cos(theta_t)
#
BLOCK SBOTMIX  # Sbottom Mixing Matrix
  1  1     9.98736922E-01   # cos(theta_b)
  1  2    -5.02450061E-02   # sin(theta_b)
  2  1     5.02450061E-02   # -sin(theta_b)
  2  2     9.98736922E-01   # cos(theta_b)
#
BLOCK STAUMIX  # Stau Mixing Matrix
  1  1    -5.69196199E-02   # cos(theta_tau)
  1  2     9.98378764E-01   # sin(theta_tau)
  2  1    -9.98378764E-01   # -sin(theta_tau)
  2  2    -5.69196199E-02   # cos(theta_tau)
#
BLOCK ALPHA  # Higgs mixing
          -1.05467037E-01   # Mixing angle in the neutral Higgs boson sector
#
BLOCK HMIX Q=  5.00075534E+03  # DRbar Higgs Parameters
         1    -4.83571935E+02   # mu(Q)MSSM           
         2     9.47086938E+00   # tan                 
         3     2.41771179E+02   # higgs               
         4     8.67639472E+06   # mA^2(Q)MSSM         
#
BLOCK GAUGE Q=  5.00075534E+03  # The gauge couplings
     1     3.70965383E-01   # gprime(Q) DRbar
     2     6.33356644E-01   # g(Q) DRbar
     3     1.00271218E+00   # g3(Q) DRbar
#
BLOCK AU Q=  5.00075534E+03  # The trilinear couplings
  1  1     5.00000001E+03   # A_u(Q) DRbar
  2  2     5.00000001E+03   # A_c(Q) DRbar
  3  3     5.00000001E+03   # A_t(Q) DRbar
#
BLOCK AD Q=  5.00075534E+03  # The trilinear couplings
  1  1     5.00000000E+03   # A_d(Q) DRbar
  2  2     5.00000000E+03   # A_s(Q) DRbar
  3  3     5.00000001E+03   # A_b(Q) DRbar
#
BLOCK AE Q=  5.00075534E+03  # The trilinear couplings
  1  1     0.00000000E+00   # A_e(Q) DRbar
  2  2     9.60138318E-08   # A_mu(Q) DRbar
  3  3     9.53439281E-08   # A_tau(Q) DRbar
#
BLOCK Yu Q=  5.00075534E+03  # The Yukawa couplings
  1  1     0.00000000E+00   # y_u(Q) DRbar
  2  2     0.00000000E+00   # y_c(Q) DRbar
  3  3     8.18091603E-01   # y_t(Q) DRbar
#
BLOCK Yd Q=  5.00075534E+03  # The Yukawa couplings
  1  1     0.00000000E+00   # y_d(Q) DRbar
  2  2     0.00000000E+00   # y_s(Q) DRbar
  3  3     1.29656154E-01   # y_b(Q) DRbar
#
BLOCK Ye Q=  5.00075534E+03  # The Yukawa couplings
  1  1     0.00000000E+00   # y_e(Q) DRbar
  2  2     0.00000000E+00   # y_mu(Q) DRbar
  3  3     9.71482955E-02   # y_tau(Q) DRbar
#
BLOCK MSOFT Q=  5.00075534E+03  # The soft SUSY breaking masses at the scale Q
         1     6.00000000E+01   # M_1(Q)              
         2     3.00000000E+03   # M_2(Q)              
         3     1.21156100E+03   # M_3(Q)              
        21     8.48989165E+06   # mH1^2(Q)            
        22     3.39998974E+05   # mH2^2(Q)            
        31     5.00000000E+03   # meL(Q)              
        32     5.00000000E+03   # mmuL(Q)             
        33     5.00000000E+03   # mtauL(Q)            
        34     5.00000000E+03   # meR(Q)              
        35     5.00000000E+03   # mmuR(Q)             
        36     5.00000000E+03   # mtauR(Q)            
        41     5.00000000E+03   # mqL1(Q)             
        42     5.00000000E+03   # mqL2(Q)             
        43     5.00000000E+03   # mqL3(Q)             
        44     5.00000000E+03   # muR(Q)              
        45     5.00000000E+03   # mcR(Q)              
        46     5.00000000E+03   # mtR(Q)              
        47     5.00000000E+03   # mdR(Q)              
        48     5.00000000E+03   # msR(Q)              
        49     5.00000000E+03   # mbR(Q)              
#
#
#
#                             =================
#                             |The decay table|
#                             =================
#
# - The QCD corrections to the decays gluino -> squark  + quark
#                                     squark -> gaugino + quark_prime
#                                     squark -> squark_prime + Higgs
#                                     squark -> gluino  + quark
#   are included.
#
# - The multi-body decays for the inos, stops and sbottoms are included.
#
# - The loop induced decays for the gluino, neutralinos and stops
#   are included.
#
# - The SUSY decays of the top quark are included.
#
#
#         PDG            Width
DECAY         6     1.40586483E+00   # top decays
#          BR         NDA      ID1       ID2
     1.00000000E+00    2           5        24   # BR(t ->  b    W+)
#
#         PDG            Width
DECAY   1000021     2.85826635E-04   # gluino decays
#          BR         NDA      ID1       ID2
     6.72409410E-07    2     1000022        21   # BR(~g -> ~chi_10 g)
     1.59284926E-02    2     1000023        21   # BR(~g -> ~chi_20 g)
     1.54834652E-02    2     1000025        21   # BR(~g -> ~chi_30 g)
#           BR         NDA      ID1       ID2       ID3
     1.86352721E-02    3     1000022         1        -1   # BR(~g -> ~chi_10 d  db)
     3.90536875E-05    3     1000023         1        -1   # BR(~g -> ~chi_20 d  db)
     3.67147248E-05    3     1000025         1        -1   # BR(~g -> ~chi_30 d  db)
     6.35441513E-02    3     1000022         2        -2   # BR(~g -> ~chi_10 u  ub)
     2.03796622E-04    3     1000023         2        -2   # BR(~g -> ~chi_20 u  ub)
     6.10728390E-05    3     1000025         2        -2   # BR(~g -> ~chi_30 u  ub)
     1.86352721E-02    3     1000022         3        -3   # BR(~g -> ~chi_10 s  sb)
     3.90536875E-05    3     1000023         3        -3   # BR(~g -> ~chi_20 s  sb)
     3.67147248E-05    3     1000025         3        -3   # BR(~g -> ~chi_30 s  sb)
     6.35441513E-02    3     1000022         4        -4   # BR(~g -> ~chi_10 c  cb)
     2.03796622E-04    3     1000023         4        -4   # BR(~g -> ~chi_20 c  cb)
     6.10728390E-05    3     1000025         4        -4   # BR(~g -> ~chi_30 c  cb)
     1.90715299E-02    3     1000022         5        -5   # BR(~g -> ~chi_10 b  bb)
     5.39672572E-03    3     1000023         5        -5   # BR(~g -> ~chi_20 b  bb)
     5.33753161E-03    3     1000025         5        -5   # BR(~g -> ~chi_30 b  bb)
     5.52823997E-02    3     1000022         6        -6   # BR(~g -> ~chi_10 t  tb)
     1.78273719E-01    3     1000023         6        -6   # BR(~g -> ~chi_20 t  tb)
     1.48146023E-01    3     1000025         6        -6   # BR(~g -> ~chi_30 t  tb)
     5.67357993E-05    3     1000024         1        -2   # BR(~g -> ~chi_1+ d  ub)
     5.67357993E-05    3    -1000024         2        -1   # BR(~g -> ~chi_1- u  db)
     5.67357993E-05    3     1000024         3        -4   # BR(~g -> ~chi_1+ s  cb)
     5.67357993E-05    3    -1000024         4        -3   # BR(~g -> ~chi_1- c  sb)
     1.95906187E-01    3     1000024         5        -6   # BR(~g -> ~chi_1+ b  tb)
     1.95906187E-01    3    -1000024         6        -5   # BR(~g -> ~chi_1- t  bb)
#
#         PDG            Width
DECAY   1000006     3.89783367E+02   # stop1 decays
#          BR         NDA      ID1       ID2
     2.24362132E-02    2     1000022         6   # BR(~t_1 -> ~chi_10 t )
     8.40311347E-02    2     1000023         6   # BR(~t_1 -> ~chi_20 t )
     7.94425471E-02    2     1000025         6   # BR(~t_1 -> ~chi_30 t )
     5.27800669E-03    2     1000035         6   # BR(~t_1 -> ~chi_40 t )
     1.21147232E-01    2     1000024         5   # BR(~t_1 -> ~chi_1+ b )
     1.05216571E-02    2     1000037         5   # BR(~t_1 -> ~chi_2+ b )
     6.77143209E-01    2     1000021         6   # BR(~t_1 -> ~g      t )
#
#         PDG            Width
DECAY   2000006     3.91600953E+02   # stop2 decays
#          BR         NDA      ID1       ID2
     9.05248188E-03    2     1000022         6   # BR(~t_2 -> ~chi_10 t )
     8.34454426E-02    2     1000023         6   # BR(~t_2 -> ~chi_20 t )
     8.85632141E-02    2     1000025         6   # BR(~t_2 -> ~chi_30 t )
     1.41938572E-02    2     1000035         6   # BR(~t_2 -> ~chi_40 t )
     4.99127806E-02    2     1000024         5   # BR(~t_2 -> ~chi_1+ b )
     2.82622911E-02    2     1000037         5   # BR(~t_2 -> ~chi_2+ b )
     7.23386238E-01    2     1000021         6   # BR(~t_2 -> ~g      t )
     7.29932566E-04    2     1000006        25   # BR(~t_2 -> ~t_1    h )
     2.45376157E-03    2     1000006        23   # BR(~t_2 -> ~t_1    Z )
#
#         PDG            Width
DECAY   1000005     3.67875888E+02   # sbottom1 decays
#          BR         NDA      ID1       ID2
     2.11929930E-03    2     1000022         5   # BR(~b_1 -> ~chi_10 b )
     2.22192284E-03    2     1000023         5   # BR(~b_1 -> ~chi_20 b )
     2.22151196E-03    2     1000025         5   # BR(~b_1 -> ~chi_30 b )
     2.05467876E-02    2     1000035         5   # BR(~b_1 -> ~chi_40 b )
     1.78678297E-01    2    -1000024         6   # BR(~b_1 -> ~chi_1- t )
     4.12525751E-02    2    -1000037         6   # BR(~b_1 -> ~chi_2- t )
     7.51426683E-01    2     1000021         5   # BR(~b_1 -> ~g      b )
     1.53292255E-03    2     1000006       -24   # BR(~b_1 -> ~t_1    W-)
#
#         PDG            Width
DECAY   2000005     2.85326964E+02   # sbottom2 decays
#          BR         NDA      ID1       ID2
     1.02860356E-02    2     1000022         5   # BR(~b_2 -> ~chi_10 b )
     2.97470228E-03    2     1000023         5   # BR(~b_2 -> ~chi_20 b )
     3.01173864E-03    2     1000025         5   # BR(~b_2 -> ~chi_30 b )
     6.50910815E-05    2     1000035         5   # BR(~b_2 -> ~chi_40 b )
     6.39655188E-03    2    -1000024         6   # BR(~b_2 -> ~chi_1- t )
     1.30692402E-04    2    -1000037         6   # BR(~b_2 -> ~chi_2- t )
     9.77114873E-01    2     1000021         5   # BR(~b_2 -> ~g      b )
     2.03150017E-05    2     1000006       -24   # BR(~b_2 -> ~t_1    W-)
#
#         PDG            Width
DECAY   1000002     3.04513181E+02   # sup_L decays
#          BR         NDA      ID1       ID2
     2.44145688E-03    2     1000022         2   # BR(~u_L -> ~chi_10 u)
     6.27877990E-05    2     1000023         2   # BR(~u_L -> ~chi_20 u)
     1.54491747E-06    2     1000025         2   # BR(~u_L -> ~chi_30 u)
     2.57753915E-02    2     1000035         2   # BR(~u_L -> ~chi_40 u)
     1.64250826E-04    2     1000024         1   # BR(~u_L -> ~chi_1+ d)
     5.15186764E-02    2     1000037         1   # BR(~u_L -> ~chi_2+ d)
     9.20035892E-01    2     1000021         2   # BR(~u_L -> ~g      u)
#
#         PDG            Width
DECAY   2000002     2.90727250E+02   # sup_R decays
#          BR         NDA      ID1       ID2
     4.06777043E-02    2     1000022         2   # BR(~u_R -> ~chi_10 u)
     1.65107237E-04    2     1000023         2   # BR(~u_R -> ~chi_20 u)
     1.53792741E-04    2     1000025         2   # BR(~u_R -> ~chi_30 u)
     2.47418253E-09    2     1000035         2   # BR(~u_R -> ~chi_40 u)
     9.59003393E-01    2     1000021         2   # BR(~u_R -> ~g      u)
#
#         PDG            Width
DECAY   1000001     3.04524012E+02   # sdown_L decays
#          BR         NDA      ID1       ID2
     2.43033187E-03    2     1000022         1   # BR(~d_L -> ~chi_10 d)
     2.67277781E-06    2     1000023         1   # BR(~d_L -> ~chi_20 d)
     5.34789455E-05    2     1000025         1   # BR(~d_L -> ~chi_30 d)
     2.57903624E-02    2     1000035         1   # BR(~d_L -> ~chi_40 d)
     4.97735360E-07    2    -1000024         2   # BR(~d_L -> ~chi_1- u)
     5.15997397E-02    2    -1000037         2   # BR(~d_L -> ~chi_2- u)
     9.20122917E-01    2     1000021         1   # BR(~d_L -> ~g      d)
#
#         PDG            Width
DECAY   2000001     2.81811364E+02   # sdown_R decays
#          BR         NDA      ID1       ID2
     1.04917937E-02    2     1000022         1   # BR(~d_R -> ~chi_10 d)
     4.25853671E-05    2     1000023         1   # BR(~d_R -> ~chi_20 d)
     3.96670709E-05    2     1000025         1   # BR(~d_R -> ~chi_30 d)
     6.38242168E-10    2     1000035         1   # BR(~d_R -> ~chi_40 d)
     9.89425953E-01    2     1000021         1   # BR(~d_R -> ~g      d)
#
#         PDG            Width
DECAY   1000004     3.04513181E+02   # scharm_L decays
#          BR         NDA      ID1       ID2
     2.44145688E-03    2     1000022         4   # BR(~c_L -> ~chi_10 c)
     6.27877990E-05    2     1000023         4   # BR(~c_L -> ~chi_20 c)
     1.54491747E-06    2     1000025         4   # BR(~c_L -> ~chi_30 c)
     2.57753915E-02    2     1000035         4   # BR(~c_L -> ~chi_40 c)
     1.64250826E-04    2     1000024         3   # BR(~c_L -> ~chi_1+ s)
     5.15186764E-02    2     1000037         3   # BR(~c_L -> ~chi_2+ s)
     9.20035892E-01    2     1000021         4   # BR(~c_L -> ~g      c)
#
#         PDG            Width
DECAY   2000004     2.90727250E+02   # scharm_R decays
#          BR         NDA      ID1       ID2
     4.06777043E-02    2     1000022         4   # BR(~c_R -> ~chi_10 c)
     1.65107237E-04    2     1000023         4   # BR(~c_R -> ~chi_20 c)
     1.53792741E-04    2     1000025         4   # BR(~c_R -> ~chi_30 c)
     2.47418253E-09    2     1000035         4   # BR(~c_R -> ~chi_40 c)
     9.59003393E-01    2     1000021         4   # BR(~c_R -> ~g      c)
#
#         PDG            Width
DECAY   1000003     3.04524012E+02   # sstrange_L decays
#          BR         NDA      ID1       ID2
     2.43033187E-03    2     1000022         3   # BR(~s_L -> ~chi_10 s)
     2.67277781E-06    2     1000023         3   # BR(~s_L -> ~chi_20 s)
     5.34789455E-05    2     1000025         3   # BR(~s_L -> ~chi_30 s)
     2.57903624E-02    2     1000035         3   # BR(~s_L -> ~chi_40 s)
     4.97735360E-07    2    -1000024         4   # BR(~s_L -> ~chi_1- c)
     5.15997397E-02    2    -1000037         4   # BR(~s_L -> ~chi_2- c)
     9.20122917E-01    2     1000021         3   # BR(~s_L -> ~g      s)
#
#         PDG            Width
DECAY   2000003     2.81811364E+02   # sstrange_R decays
#          BR         NDA      ID1       ID2
     1.04917937E-02    2     1000022         3   # BR(~s_R -> ~chi_10 s)
     4.25853671E-05    2     1000023         3   # BR(~s_R -> ~chi_20 s)
     3.96670709E-05    2     1000025         3   # BR(~s_R -> ~chi_30 s)
     6.38242168E-10    2     1000035         3   # BR(~s_R -> ~chi_40 s)
     9.89425953E-01    2     1000021         3   # BR(~s_R -> ~g      s)
#
#         PDG            Width
DECAY   1000011     3.03369455E+01   # selectron_L decays
#          BR         NDA      ID1       ID2
     2.24789133E-01    2     1000022        11   # BR(~e_L -> ~chi_10 e-)
     2.06788146E-03    2     1000023        11   # BR(~e_L -> ~chi_20 e-)
     2.38492920E-04    2     1000025        11   # BR(~e_L -> ~chi_30 e-)
     2.57466054E-01    2     1000035        11   # BR(~e_L -> ~chi_40 e-)
     5.09483029E-06    2    -1000024        12   # BR(~e_L -> ~chi_1- nu_e)
     5.15433344E-01    2    -1000037        12   # BR(~e_L -> ~chi_2- nu_e)
#
#         PDG            Width
DECAY   2000011     2.73980360E+01   # selectron_R decays
#          BR         NDA      ID1       ID2
     9.92228074E-01    2     1000022        11   # BR(~e_R -> ~chi_10 e-)
     4.02381510E-03    2     1000023        11   # BR(~e_R -> ~chi_20 e-)
     3.74805216E-03    2     1000025        11   # BR(~e_R -> ~chi_30 e-)
     5.89600361E-08    2     1000035        11   # BR(~e_R -> ~chi_40 e-)
#
#         PDG            Width
DECAY   1000013     3.03369455E+01   # smuon_L decays
#          BR         NDA      ID1       ID2
     2.24789133E-01    2     1000022        13   # BR(~mu_L -> ~chi_10 mu-)
     2.06788146E-03    2     1000023        13   # BR(~mu_L -> ~chi_20 mu-)
     2.38492920E-04    2     1000025        13   # BR(~mu_L -> ~chi_30 mu-)
     2.57466054E-01    2     1000035        13   # BR(~mu_L -> ~chi_40 mu-)
     5.09483029E-06    2    -1000024        14   # BR(~mu_L -> ~chi_1- nu_mu)
     5.15433344E-01    2    -1000037        14   # BR(~mu_L -> ~chi_2- nu_mu)
#
#         PDG            Width
DECAY   2000013     2.73980360E+01   # smuon_R decays
#          BR         NDA      ID1       ID2
     9.92228074E-01    2     1000022        13   # BR(~mu_R -> ~chi_10 mu-)
     4.02381510E-03    2     1000023        13   # BR(~mu_R -> ~chi_20 mu-)
     3.74805216E-03    2     1000025        13   # BR(~mu_R -> ~chi_30 mu-)
     5.89600361E-08    2     1000035        13   # BR(~mu_R -> ~chi_40 mu-)
#
#         PDG            Width
DECAY   1000015     2.92411796E+01   # stau_1 decays
#          BR         NDA      ID1       ID2
     9.28338236E-01    2     1000022        15   # BR(~tau_1 -> ~chi_10  tau-)
     1.91894336E-02    2     1000023        15   # BR(~tau_1 -> ~chi_20  tau-)
     1.84852361E-02    2     1000025        15   # BR(~tau_1 -> ~chi_30  tau-)
     8.47955426E-04    2     1000035        15   # BR(~tau_1 -> ~chi_40  tau-)
     3.14417366E-02    2    -1000024        16   # BR(~tau_1 -> ~chi_1-  nu_tau)
     1.69740212E-03    2    -1000037        16   # BR(~tau_1 -> ~chi_2-  nu_tau)
#
#         PDG            Width
DECAY   2000015     3.12444462E+01   # stau_2 decays
#          BR         NDA      ID1       ID2
     2.19777494E-01    2     1000022        15   # BR(~tau_2 -> ~chi_10  tau-)
     1.68963173E-02    2     1000023        15   # BR(~tau_2 -> ~chi_20  tau-)
     1.54654298E-02    2     1000025        15   # BR(~tau_2 -> ~chi_30  tau-)
     2.49106013E-01    2     1000035        15   # BR(~tau_2 -> ~chi_40  tau-)
     5.72480759E-05    2    -1000024        16   # BR(~tau_2 -> ~chi_1-  nu_tau)
     4.98697497E-01    2    -1000037        16   # BR(~tau_2 -> ~chi_2-  nu_tau)
#
#         PDG            Width
DECAY   1000012     3.03401423E+01   # snu_eL decays
#          BR         NDA      ID1       ID2
     2.24376590E-01    2     1000022        12   # BR(~nu_eL -> ~chi_10 nu_e)
     2.21679838E-04    2     1000023        12   # BR(~nu_eL -> ~chi_20 nu_e)
     1.83271902E-03    2     1000025        12   # BR(~nu_eL -> ~chi_30 nu_e)
     2.57508204E-01    2     1000035        12   # BR(~nu_eL -> ~chi_40 nu_e)
     1.68087207E-03    2     1000024        11   # BR(~nu_eL -> ~chi_1+ e-)
     5.14379935E-01    2     1000037        11   # BR(~nu_eL -> ~chi_2+ e-)
#
#         PDG            Width
DECAY   1000014     3.03401423E+01   # snu_muL decays
#          BR         NDA      ID1       ID2
     2.24376590E-01    2     1000022        14   # BR(~nu_muL -> ~chi_10 nu_mu)
     2.21679838E-04    2     1000023        14   # BR(~nu_muL -> ~chi_20 nu_mu)
     1.83271902E-03    2     1000025        14   # BR(~nu_muL -> ~chi_30 nu_mu)
     2.57508204E-01    2     1000035        14   # BR(~nu_muL -> ~chi_40 nu_mu)
     1.68087207E-03    2     1000024        13   # BR(~nu_muL -> ~chi_1+ mu-)
     5.14379935E-01    2     1000037        13   # BR(~nu_muL -> ~chi_2+ mu-)
#
#         PDG            Width
DECAY   1000016     3.12541125E+01   # snu_tauL decays
#          BR         NDA      ID1       ID2
     2.17791138E-01    2     1000022        16   # BR(~nu_tauL -> ~chi_10 nu_tau)
     2.15172598E-04    2     1000023        16   # BR(~nu_tauL -> ~chi_20 nu_tau)
     1.77892091E-03    2     1000025        16   # BR(~nu_tauL -> ~chi_30 nu_tau)
     2.49884309E-01    2     1000035        16   # BR(~nu_tauL -> ~chi_40 nu_tau)
     3.11799790E-02    2     1000024        15   # BR(~nu_tauL -> ~chi_1+ tau-)
     4.99150480E-01    2     1000037        15   # BR(~nu_tauL -> ~chi_2+ tau-)
#
#         PDG            Width
DECAY   1000024     2.94167637E-01   # chargino1+ decays
#          BR         NDA      ID1       ID2
     1.00000000E+00    2     1000022        24   # BR(~chi_1+ -> ~chi_10  W+)
#
#         PDG            Width
DECAY   1000037     2.21695560E+01   # chargino2+ decays
#          BR         NDA      ID1       ID2
     2.53567365E-01    2     1000024        23   # BR(~chi_2+ -> ~chi_1+  Z )
     1.56213321E-04    2     1000022        24   # BR(~chi_2+ -> ~chi_10  W+)
     2.44985689E-01    2     1000023        24   # BR(~chi_2+ -> ~chi_20  W+)
     2.44392299E-01    2     1000025        24   # BR(~chi_2+ -> ~chi_30  W+)
     2.56893250E-01    2     1000024        25   # BR(~chi_2+ -> ~chi_1+  h )
     5.18287593E-06    2     1000022        37   # BR(~chi_2+ -> ~chi_10  H+)
#
#         PDG            Width
DECAY   1000022     0.00000000E+00   # neutralino1 decays
#
#         PDG            Width
DECAY   1000023     2.97514530E-01   # neutralino2 decays
#          BR         NDA      ID1       ID2
     5.04278475E-01    2     1000022        23   # BR(~chi_20 -> ~chi_10   Z )
     4.95721525E-01    2     1000022        25   # BR(~chi_20 -> ~chi_10   h )
#
#         PDG            Width
DECAY   1000025     2.90425984E-01   # neutralino3 decays
#          BR         NDA      ID1       ID2
     5.33635768E-01    2     1000022        23   # BR(~chi_30 -> ~chi_10   Z )
     4.66364232E-01    2     1000022        25   # BR(~chi_30 -> ~chi_10   h )
#
#         PDG            Width
DECAY   1000035     2.21805152E+01   # neutralino4 decays
#          BR         NDA      ID1       ID2
     3.10050359E-06    2     1000022        23   # BR(~chi_40 -> ~chi_10   Z )
     1.12718602E-01    2     1000023        23   # BR(~chi_40 -> ~chi_20   Z )
     1.40409869E-01    2     1000025        23   # BR(~chi_40 -> ~chi_30   Z )
     2.45169157E-01    2     1000024       -24   # BR(~chi_40 -> ~chi_1+   W-)
     2.45169157E-01    2    -1000024        24   # BR(~chi_40 -> ~chi_1-   W+)
     1.45532785E-04    2     1000022        25   # BR(~chi_40 -> ~chi_10   h )
     4.98538755E-06    2     1000022        35   # BR(~chi_40 -> ~chi_10   H )
     5.44379522E-07    2     1000022        36   # BR(~chi_40 -> ~chi_10   A )
     1.43406277E-01    2     1000023        25   # BR(~chi_40 -> ~chi_20   h )
     1.12972775E-01    2     1000025        25   # BR(~chi_40 -> ~chi_30   h )
#
#         PDG            Width
DECAY        25     4.05565184E-03   # h decays
#          BR         NDA      ID1       ID2
     6.12660498E-01    2           5        -5   # BR(h -> b       bb     )
     6.38712834E-02    2         -15        15   # BR(h -> tau+    tau-   )
     2.26128315E-04    2         -13        13   # BR(h -> mu+     mu-    )
     4.79505419E-04    2           3        -3   # BR(h -> s       sb     )
     2.07761297E-02    2           4        -4   # BR(h -> c       cb     )
     6.70107197E-02    2          21        21   # BR(h -> g       g      )
     2.29929072E-03    2          22        22   # BR(h -> gam     gam    )
     1.46864684E-03    2          22        23   # BR(h -> Z       gam    )
     2.06591567E-01    2          24       -24   # BR(h -> W+      W-     )
     2.45362952E-02    2          23        23   # BR(h -> Z       Z      )
     7.99352260E-05    2     1000022   1000022   # BR(h -> ~chi_10 ~chi_10)
#
#         PDG            Width
DECAY        35     8.66351382E+00   # H decays
#          BR         NDA      ID1       ID2
     3.68532796E-01    2           5        -5   # BR(H -> b       bb     )
     6.43194571E-02    2         -15        15   # BR(H -> tau+    tau-   )
     2.27438709E-04    2         -13        13   # BR(H -> mu+     mu-    )
     2.78804966E-04    2           3        -3   # BR(H -> s       sb     )
     1.55900316E-06    2           4        -4   # BR(H -> c       cb     )
     1.55756767E-01    2           6        -6   # BR(H -> t       tb     )
     5.17939572E-05    2          21        21   # BR(H -> g       g      )
     1.48982531E-07    2          22        22   # BR(H -> gam     gam    )
     9.18785429E-08    2          23        22   # BR(H -> Z       gam    )
     7.41390681E-05    2          24       -24   # BR(H -> W+      W-     )
     3.70226008E-05    2          23        23   # BR(H -> Z       Z      )
     2.69463363E-04    2          25        25   # BR(H -> h       h      )
     1.71590596E-24    2          36        36   # BR(H -> A       A      )
     6.97632489E-19    2          23        36   # BR(H -> Z       A      )
     3.17420280E-03    2     1000024  -1000024   # BR(H -> ~chi_1+ ~chi_1-)
     6.71472345E-03    2     1000022   1000022   # BR(H -> ~chi_10 ~chi_10)
     3.68920292E-04    2     1000023   1000023   # BR(H -> ~chi_20 ~chi_20)
     2.44833680E-03    2     1000025   1000025   # BR(H -> ~chi_30 ~chi_30)
     2.39505043E-01    2     1000022   1000023   # BR(H -> ~chi_10 ~chi_20)
     1.54915667E-01    2     1000022   1000025   # BR(H -> ~chi_10 ~chi_30)
     3.32362478E-03    2     1000023   1000025   # BR(H -> ~chi_20 ~chi_30)
#
#         PDG            Width
DECAY        36     8.67056327E+00   # A decays
#          BR         NDA      ID1       ID2
     3.68358999E-01    2           5        -5   # BR(A -> b       bb     )
     6.42690757E-02    2         -15        15   # BR(A -> tau+    tau-   )
     2.27260239E-04    2         -13        13   # BR(A -> mu+     mu-    )
     2.78789792E-04    2           3        -3   # BR(A -> s       sb     )
     1.56398311E-06    2           4        -4   # BR(A -> c       cb     )
     1.56168087E-01    2           6        -6   # BR(A -> t       tb     )
     1.54556756E-04    2          21        21   # BR(A -> g       g      )
     5.93490215E-07    2          22        22   # BR(A -> gam     gam    )
     1.87035664E-07    2          23        22   # BR(A -> Z       gam    )
     7.37995127E-05    2          23        25   # BR(A -> Z       h      )
     3.48608750E-03    2     1000024  -1000024   # BR(A -> ~chi_1+ ~chi_1-)
     6.67181437E-03    2     1000022   1000022   # BR(A -> ~chi_10 ~chi_10)
     2.71080773E-04    2     1000023   1000023   # BR(A -> ~chi_20 ~chi_20)
     4.22254862E-03    2     1000025   1000025   # BR(A -> ~chi_30 ~chi_30)
     1.58316591E-01    2     1000022   1000023   # BR(A -> ~chi_10 ~chi_20)
     2.35136357E-01    2     1000022   1000025   # BR(A -> ~chi_10 ~chi_30)
     2.36260842E-03    2     1000023   1000025   # BR(A -> ~chi_20 ~chi_30)
#
#         PDG            Width
DECAY        37     8.60826388E+00   # H+ decays
#          BR         NDA      ID1       ID2
     5.90132606E-04    2           4        -5   # BR(H+ -> c       bb     )
     6.47650541E-02    2         -15        16   # BR(H+ -> tau+    nu_tau )
     2.29014055E-04    2         -13        14   # BR(H+ -> mu+     nu_mu  )
     3.77682885E-06    2           2        -5   # BR(H+ -> u       bb     )
     1.34377452E-05    2           2        -3   # BR(H+ -> u       sb     )
     2.77892742E-04    2           4        -3   # BR(H+ -> c       sb     )
     5.22879824E-01    2           6        -5   # BR(H+ -> t       bb     )
     7.44879230E-05    2          24        25   # BR(H+ -> W+      h      )
     9.12231138E-13    2          24        36   # BR(H+ -> W+      A      )
     4.07366744E-01    2     1000024   1000022   # BR(H+ -> ~chi_1+ ~chi_10)
     3.46957169E-03    2     1000024   1000023   # BR(H+ -> ~chi_1+ ~chi_20)
     3.30064154E-04    2     1000024   1000025   # BR(H+ -> ~chi_1+ ~chi_30)
