#
#                              ======================
#                              | THE SUSYHIT OUTPUT |
#                              ======================
#
#
#              ------------------------------------------------------
#              |     This is the output of the SUSY-HIT package     |
#              |  created by A.Djouadi, M.Muehlleitner and M.Spira. |
#              |  In case of problems with SUSY-HIT email to        |
#              |           margarete.muehlleitner@cern.ch           |
#              |           michael.spira@psi.ch                     |
#              |           abdelhak.djouadi@cern.ch                 |
#              ------------------------------------------------------
#
#              ------------------------------------------------------
#              |  SUSY Les Houches Accord - MSSM Spectrum + Decays  |
#              |              based on the decay programs           |
#              |                                                    |
#              |                     SDECAY 1.3b                    |
#              |                                                    |
#              |  Authors: M.Muhlleitner, A.Djouadi and Y.Mambrini  |
#              |  Ref.:    Comput.Phys.Commun.168(2005)46           |
#              |           [hep-ph/0311167]                         |
#              |                                                    |
#              |                     HDECAY 3.4                     |
#              |                                                    |
#              |  By: A.Djouadi,J.Kalinowski,M.Muhlleitner,M.Spira  |
#              |  Ref.:    Comput.Phys.Commun.108(1998)56           |
#              |           [hep-ph/9704448]                         |
#              |                                                    |
#              |                                                    |
#              |  If not stated otherwise all DRbar couplings and   |
#              |  soft SUSY breaking masses are given at the scale  |
#              |  Q=  0.50007293E+04
#              |                                                    |
#              ------------------------------------------------------
#
#
BLOCK DCINFO  # Decay Program information
     1   SDECAY/HDECAY # decay calculator
     2   1.3b  /3.4    # version number
#
BLOCK SPINFO  # Spectrum calculator information
     1    SOFTSUSY    # spectrum calculator                
     2    3.4.0       # version number                     
#
BLOCK MODSEL  # Model selection
     1     0   #  nonUniversal                                     
#
BLOCK SMINPUTS  # Standard Model inputs
         1     1.25778332E+02   # alpha_em^-1(M_Z)^MSbar
         2     1.16570000E-05   # G_F [GeV^-2]
         3     1.17200002E-01   # alpha_S(M_Z)^MSbar
         4     9.11876000E+01   # M_Z pole mass
         5     4.25000000E+00   # mb(mb)^MSbar
         6     1.72500000E+02   # mt pole mass
         7     1.77682000E+00   # mtau pole mass
#
BLOCK MINPAR  # Input parameters - minimal models
         3     1.00000000E+01   # tanb                
#
BLOCK EXTPAR  # Input parameters - non-minimal models
         0    -1.00000000E+00   # Set                 
         1     6.00000000E+01   # M_1(MX)             
         2     3.00000000E+03   # M_2(MX)             
         3     1.94903200E+03   # M_3(MX)             
        11     5.00000000E+03   # At(MX)              
        12     5.00000000E+03   # Ab(MX)              
        13     0.00000000E+00   # Atau(MX)            
        23    -1.25115900E+03   # mu(MX)              
        26     3.00000000E+03   # mA(pole)            
        31     5.00000000E+03   # meL(MX)             
        32     5.00000000E+03   # mmuL(MX)            
        33     5.00000000E+03   # mtauL(MX)           
        34     5.00000000E+03   # meR(MX)             
        35     5.00000000E+03   # mmuR(MX)            
        36     5.00000000E+03   # mtauR(MX)           
        41     5.00000000E+03   # mqL1(MX)            
        42     5.00000000E+03   # mqL2(MX)            
        43     5.00000000E+03   # mqL3(MX)            
        44     5.00000000E+03   # muR(MX)             
        45     5.00000000E+03   # mcR(MX)             
        46     5.00000000E+03   # mtR(MX)             
        47     5.00000000E+03   # mdR(MX)             
        48     5.00000000E+03   # msR(MX)             
        49     5.00000000E+03   # mbR(MX)             
#
BLOCK MASS  # Mass Spectrum
# PDG code           mass       particle
        24     8.00962541E+01   # W+
        25     1.24811858E+02   # h
        35     3.00008170E+03   # H
        36     2.99999987E+03   # A
        37     3.00086830E+03   # H+
         5     4.87878001E+00   # b-quark pole mass calculated from mb(mb)_Msbar
   1000001     5.07634320E+03   # ~d_L
   2000001     5.05857412E+03   # ~d_R
   1000002     5.07587099E+03   # ~u_L
   2000002     5.05829575E+03   # ~u_R
   1000003     5.07634320E+03   # ~s_L
   2000003     5.05857412E+03   # ~s_R
   1000004     5.07587099E+03   # ~c_L
   2000004     5.05829575E+03   # ~c_R
   1000005     5.02214139E+03   # ~b_1
   2000005     5.05726560E+03   # ~b_2
   1000006     4.91376562E+03   # ~t_1
   2000006     5.06727598E+03   # ~t_2
   1000011     5.01905567E+03   # ~e_L
   2000011     5.00591546E+03   # ~e_R
   1000012     5.01810757E+03   # ~nu_eL
   1000013     5.01905567E+03   # ~mu_L
   2000013     5.00591546E+03   # ~mu_R
   1000014     5.01810757E+03   # ~nu_muL
   1000015     5.00447639E+03   # ~tau_1
   2000015     5.01889570E+03   # ~tau_2
   1000016     5.01756548E+03   # ~nu_tauL
   1000021     2.30000076E+03   # ~g
   1000022     6.03030208E+01   # ~chi_10
   1000023     1.29950390E+03   # ~chi_20
   1000025    -1.30184346E+03   # ~chi_30
   1000035     3.07430179E+03   # ~chi_40
   1000024     1.30000074E+03   # ~chi_1+
   1000037     3.07446922E+03   # ~chi_2+
#
BLOCK NMIX  # Neutralino Mixing Matrix
  1  1     9.99410423E-01   # N_11
  1  2     1.55342097E-04   # N_12
  1  3    -3.42753838E-02   # N_13
  1  4     1.99513695E-03   # N_14
  2  1     2.28281684E-02   # N_21
  2  2     2.74277978E-02   # N_22
  2  3     7.06874953E-01   # N_23
  2  4     7.06437818E-01   # N_24
  3  1    -2.56417654E-02   # N_31
  3  2     1.38785066E-02   # N_32
  3  3    -7.06442614E-01   # N_33
  3  4     7.07169513E-01   # N_34
  4  1    -4.25708665E-04   # N_41
  4  2     9.99527428E-01   # N_42
  4  3    -9.58285901E-03   # N_43
  4  4    -2.92046016E-02   # N_44
#
BLOCK UMIX  # Chargino Mixing Matrix U
  1  1     1.35665394E-02   # U_11
  1  2     9.99907970E-01   # U_12
  2  1    -9.99907970E-01   # U_21
  2  2     1.35665394E-02   # U_22
#
BLOCK VMIX  # Chargino Mixing Matrix V
  1  1     4.13284249E-02   # V_11
  1  2    -9.99145616E-01   # V_12
  2  1    -9.99145616E-01   # V_21
  2  2    -4.13284249E-02   # V_22
#
BLOCK STOPMIX  # Stop Mixing Matrix
  1  1    -5.08036864E-01   # cos(theta_t)
  1  2     8.61335327E-01   # sin(theta_t)
  2  1    -8.61335327E-01   # -sin(theta_t)
  2  2    -5.08036864E-01   # cos(theta_t)
#
BLOCK SBOTMIX  # Sbottom Mixing Matrix
  1  1     9.95685548E-01   # cos(theta_b)
  1  2    -9.27916457E-02   # sin(theta_b)
  2  1     9.27916457E-02   # -sin(theta_b)
  2  2     9.95685548E-01   # cos(theta_b)
#
BLOCK STAUMIX  # Stau Mixing Matrix
  1  1    -1.46896483E-01   # cos(theta_tau)
  1  2     9.89151871E-01   # sin(theta_tau)
  2  1    -9.89151871E-01   # -sin(theta_tau)
  2  2    -1.46896483E-01   # cos(theta_tau)
#
BLOCK ALPHA  # Higgs mixing
          -1.05473836E-01   # Mixing angle in the neutral Higgs boson sector
#
BLOCK HMIX Q=  5.00072928E+03  # DRbar Higgs Parameters
         1    -1.27416584E+03   # mu(Q)MSSM           
         2     9.46964951E+00   # tan                 
         3     2.41913257E+02   # higgs               
         4     8.44287043E+06   # mA^2(Q)MSSM         
#
BLOCK GAUGE Q=  5.00072928E+03  # The gauge couplings
     1     3.70730561E-01   # gprime(Q) DRbar
     2     6.32238547E-01   # g(Q) DRbar
     3     9.96444116E-01   # g3(Q) DRbar
#
BLOCK AU Q=  5.00072928E+03  # The trilinear couplings
  1  1     5.00000001E+03   # A_u(Q) DRbar
  2  2     5.00000001E+03   # A_c(Q) DRbar
  3  3     5.00000002E+03   # A_t(Q) DRbar
#
BLOCK AD Q=  5.00072928E+03  # The trilinear couplings
  1  1     5.00000001E+03   # A_d(Q) DRbar
  2  2     5.00000001E+03   # A_s(Q) DRbar
  3  3     5.00000001E+03   # A_b(Q) DRbar
#
BLOCK AE Q=  5.00072928E+03  # The trilinear couplings
  1  1     0.00000000E+00   # A_e(Q) DRbar
  2  2     2.21575344E-07   # A_mu(Q) DRbar
  3  3     2.21393936E-07   # A_tau(Q) DRbar
#
BLOCK Yu Q=  5.00072928E+03  # The Yukawa couplings
  1  1     0.00000000E+00   # y_u(Q) DRbar
  2  2     0.00000000E+00   # y_c(Q) DRbar
  3  3     8.20503657E-01   # y_t(Q) DRbar
#
BLOCK Yd Q=  5.00072928E+03  # The Yukawa couplings
  1  1     0.00000000E+00   # y_d(Q) DRbar
  2  2     0.00000000E+00   # y_s(Q) DRbar
  3  3     1.31274698E-01   # y_b(Q) DRbar
#
BLOCK Ye Q=  5.00072928E+03  # The Yukawa couplings
  1  1     0.00000000E+00   # y_e(Q) DRbar
  2  2     0.00000000E+00   # y_mu(Q) DRbar
  3  3     9.67101627E-02   # y_tau(Q) DRbar
#
BLOCK MSOFT Q=  5.00072928E+03  # The soft SUSY breaking masses at the scale Q
         1     6.00000000E+01   # M_1(Q)              
         2     3.00000000E+03   # M_2(Q)              
         3     1.94903200E+03   # M_3(Q)              
        21     7.05681484E+06   # mH1^2(Q)            
        22    -1.06721842E+06   # mH2^2(Q)            
        31     5.00000000E+03   # meL(Q)              
        32     5.00000000E+03   # mmuL(Q)             
        33     5.00000000E+03   # mtauL(Q)            
        34     5.00000000E+03   # meR(Q)              
        35     5.00000000E+03   # mmuR(Q)             
        36     5.00000000E+03   # mtauR(Q)            
        41     5.00000000E+03   # mqL1(Q)             
        42     5.00000000E+03   # mqL2(Q)             
        43     4.99999999E+03   # mqL3(Q)             
        44     5.00000000E+03   # muR(Q)              
        45     5.00000000E+03   # mcR(Q)              
        46     4.99999999E+03   # mtR(Q)              
        47     5.00000000E+03   # mdR(Q)              
        48     5.00000000E+03   # msR(Q)              
        49     5.00000000E+03   # mbR(Q)              
#
#
#
#                             =================
#                             |The decay table|
#                             =================
#
# - The QCD corrections to the decays gluino -> squark  + quark
#                                     squark -> gaugino + quark_prime
#                                     squark -> squark_prime + Higgs
#                                     squark -> gluino  + quark
#   are included.
#
# - The multi-body decays for the inos, stops and sbottoms are included.
#
# - The loop induced decays for the gluino, neutralinos and stops
#   are included.
#
# - The SUSY decays of the top quark are included.
#
#
#         PDG            Width
DECAY         6     1.40071930E+00   # top decays
#          BR         NDA      ID1       ID2
     1.00000000E+00    2           5        24   # BR(t ->  b    W+)
#
#         PDG            Width
DECAY   1000021     1.10417246E-03   # gluino decays
#          BR         NDA      ID1       ID2
     4.32012986E-06    2     1000022        21   # BR(~g -> ~chi_10 g)
     7.56622007E-03    2     1000023        21   # BR(~g -> ~chi_20 g)
     7.50310029E-03    2     1000025        21   # BR(~g -> ~chi_30 g)
#           BR         NDA      ID1       ID2       ID3
     4.39846399E-02    3     1000022         1        -1   # BR(~g -> ~chi_10 d  db)
     1.98749848E-05    3     1000023         1        -1   # BR(~g -> ~chi_20 d  db)
     5.49887869E-06    3     1000025         1        -1   # BR(~g -> ~chi_30 d  db)
     1.49969085E-01    3     1000022         2        -2   # BR(~g -> ~chi_10 u  ub)
     4.38167362E-05    3     1000023         2        -2   # BR(~g -> ~chi_20 u  ub)
     5.83781267E-06    3     1000025         2        -2   # BR(~g -> ~chi_30 u  ub)
     4.39846399E-02    3     1000022         3        -3   # BR(~g -> ~chi_10 s  sb)
     1.98749848E-05    3     1000023         3        -3   # BR(~g -> ~chi_20 s  sb)
     5.49887869E-06    3     1000025         3        -3   # BR(~g -> ~chi_30 s  sb)
     1.49969085E-01    3     1000022         4        -4   # BR(~g -> ~chi_10 c  cb)
     4.38167362E-05    3     1000023         4        -4   # BR(~g -> ~chi_20 c  cb)
     5.83781267E-06    3     1000025         4        -4   # BR(~g -> ~chi_30 c  cb)
     4.45605650E-02    3     1000022         5        -5   # BR(~g -> ~chi_10 b  bb)
     3.01488086E-03    3     1000023         5        -5   # BR(~g -> ~chi_20 b  bb)
     2.95892999E-03    3     1000025         5        -5   # BR(~g -> ~chi_30 b  bb)
     1.50389838E-01    3     1000022         6        -6   # BR(~g -> ~chi_10 t  tb)
     9.93660287E-02    3     1000023         6        -6   # BR(~g -> ~chi_20 t  tb)
     8.19493892E-02    3     1000025         6        -6   # BR(~g -> ~chi_30 t  tb)
     5.38007224E-05    3     1000024         1        -2   # BR(~g -> ~chi_1+ d  ub)
     5.38007224E-05    3    -1000024         2        -1   # BR(~g -> ~chi_1- u  db)
     5.38007224E-05    3     1000024         3        -4   # BR(~g -> ~chi_1+ s  cb)
     5.38007224E-05    3    -1000024         4        -3   # BR(~g -> ~chi_1- c  sb)
     1.07207010E-01    3     1000024         5        -6   # BR(~g -> ~chi_1+ b  tb)
     1.07207010E-01    3    -1000024         6        -5   # BR(~g -> ~chi_1- t  bb)
#
#         PDG            Width
DECAY   1000006     3.07315191E+02   # stop1 decays
#          BR         NDA      ID1       ID2
     2.88003956E-02    2     1000022         6   # BR(~t_1 -> ~chi_10 t )
     9.30162004E-02    2     1000023         6   # BR(~t_1 -> ~chi_20 t )
     8.94595343E-02    2     1000025         6   # BR(~t_1 -> ~chi_30 t )
     6.84296986E-03    2     1000035         6   # BR(~t_1 -> ~chi_40 t )
     1.35385502E-01    2     1000024         5   # BR(~t_1 -> ~chi_1+ b )
     1.36220623E-02    2     1000037         5   # BR(~t_1 -> ~chi_2+ b )
     6.32873336E-01    2     1000021         6   # BR(~t_1 -> ~g      t )
#
#         PDG            Width
DECAY   2000006     3.17999762E+02   # stop2 decays
#          BR         NDA      ID1       ID2
     1.09385692E-02    2     1000022         6   # BR(~t_2 -> ~chi_10 t )
     9.27467932E-02    2     1000023         6   # BR(~t_2 -> ~chi_20 t )
     9.64923274E-02    2     1000025         6   # BR(~t_2 -> ~chi_30 t )
     1.74487736E-02    2     1000035         6   # BR(~t_2 -> ~chi_40 t )
     5.53138281E-02    2     1000024         5   # BR(~t_2 -> ~chi_1+ b )
     3.46818388E-02    2     1000037         5   # BR(~t_2 -> ~chi_2+ b )
     6.88429309E-01    2     1000021         6   # BR(~t_2 -> ~g      t )
     8.88438066E-04    2     1000006        25   # BR(~t_2 -> ~t_1    h )
     3.06012317E-03    2     1000006        23   # BR(~t_2 -> ~t_1    Z )
#
#         PDG            Width
DECAY   1000005     2.93338632E+02   # sbottom1 decays
#          BR         NDA      ID1       ID2
     2.64505474E-03    2     1000022         5   # BR(~b_1 -> ~chi_10 b )
     2.62134247E-03    2     1000023         5   # BR(~b_1 -> ~chi_20 b )
     2.51340660E-03    2     1000025         5   # BR(~b_1 -> ~chi_30 b )
     2.56721270E-02    2     1000035         5   # BR(~b_1 -> ~chi_40 b )
     1.97935315E-01    2    -1000024         6   # BR(~b_1 -> ~chi_1- t )
     5.16295439E-02    2    -1000037         6   # BR(~b_1 -> ~chi_2- t )
     7.15120628E-01    2     1000021         5   # BR(~b_1 -> ~g      b )
     1.86258290E-03    2     1000006       -24   # BR(~b_1 -> ~t_1    W-)
#
#         PDG            Width
DECAY   2000005     2.19249875E+02   # sbottom2 decays
#          BR         NDA      ID1       ID2
     1.33598083E-02    2     1000022         5   # BR(~b_2 -> ~chi_10 b )
     3.42225938E-03    2     1000023         5   # BR(~b_2 -> ~chi_20 b )
     3.54423142E-03    2     1000025         5   # BR(~b_2 -> ~chi_30 b )
     3.06261178E-04    2     1000035         5   # BR(~b_2 -> ~chi_40 b )
     9.08590009E-03    2    -1000024         6   # BR(~b_2 -> ~chi_1- t )
     6.15752008E-04    2    -1000037         6   # BR(~b_2 -> ~chi_2- t )
     9.69572932E-01    2     1000021         5   # BR(~b_2 -> ~g      b )
     9.28560307E-05    2     1000006       -24   # BR(~b_2 -> ~t_1    W-)
#
#         PDG            Width
DECAY   1000002     2.38484587E+02   # sup_L decays
#          BR         NDA      ID1       ID2
     3.12592621E-03    2     1000022         2   # BR(~u_L -> ~chi_10 u)
     7.28272585E-05    2     1000023         2   # BR(~u_L -> ~chi_20 u)
     5.62711599E-06    2     1000025         2   # BR(~u_L -> ~chi_30 u)
     3.29938547E-02    2     1000035         2   # BR(~u_L -> ~chi_40 u)
     2.44609032E-04    2     1000024         1   # BR(~u_L -> ~chi_1+ d)
     6.59400272E-02    2     1000037         1   # BR(~u_L -> ~chi_2+ d)
     8.97617128E-01    2     1000021         2   # BR(~u_L -> ~g      u)
#
#         PDG            Width
DECAY   2000002     2.24439128E+02   # sup_R decays
#          BR         NDA      ID1       ID2
     5.28736372E-02    2     1000022         2   # BR(~u_R -> ~chi_10 u)
     2.41314207E-05    2     1000023         2   # BR(~u_R -> ~chi_20 u)
     3.04310399E-05    2     1000025         2   # BR(~u_R -> ~chi_30 u)
     3.84362898E-09    2     1000035         2   # BR(~u_R -> ~chi_40 u)
     9.47071796E-01    2     1000021         2   # BR(~u_R -> ~g      u)
#
#         PDG            Width
DECAY   1000001     2.38501013E+02   # sdown_L decays
#          BR         NDA      ID1       ID2
     3.11607872E-03    2     1000022         1   # BR(~d_L -> ~chi_10 d)
     3.77726330E-05    2     1000023         1   # BR(~d_L -> ~chi_20 d)
     2.55433962E-05    2     1000025         1   # BR(~d_L -> ~chi_30 d)
     3.30127093E-02    2     1000035         1   # BR(~d_L -> ~chi_40 d)
     2.63593772E-05    2    -1000024         2   # BR(~d_L -> ~chi_1- u)
     6.60564329E-02    2    -1000037         2   # BR(~d_L -> ~chi_2- u)
     8.97725104E-01    2     1000021         1   # BR(~d_L -> ~g      d)
#
#         PDG            Width
DECAY   2000001     2.15553818E+02   # sdown_R decays
#          BR         NDA      ID1       ID2
     1.37640531E-02    2     1000022         1   # BR(~d_R -> ~chi_10 d)
     6.28198114E-06    2     1000023         1   # BR(~d_R -> ~chi_20 d)
     7.92192191E-06    2     1000025         1   # BR(~d_R -> ~chi_30 d)
     1.00069988E-09    2     1000035         1   # BR(~d_R -> ~chi_40 d)
     9.86221742E-01    2     1000021         1   # BR(~d_R -> ~g      d)
#
#         PDG            Width
DECAY   1000004     2.38484587E+02   # scharm_L decays
#          BR         NDA      ID1       ID2
     3.12592621E-03    2     1000022         4   # BR(~c_L -> ~chi_10 c)
     7.28272585E-05    2     1000023         4   # BR(~c_L -> ~chi_20 c)
     5.62711599E-06    2     1000025         4   # BR(~c_L -> ~chi_30 c)
     3.29938547E-02    2     1000035         4   # BR(~c_L -> ~chi_40 c)
     2.44609032E-04    2     1000024         3   # BR(~c_L -> ~chi_1+ s)
     6.59400272E-02    2     1000037         3   # BR(~c_L -> ~chi_2+ s)
     8.97617128E-01    2     1000021         4   # BR(~c_L -> ~g      c)
#
#         PDG            Width
DECAY   2000004     2.24439128E+02   # scharm_R decays
#          BR         NDA      ID1       ID2
     5.28736372E-02    2     1000022         4   # BR(~c_R -> ~chi_10 c)
     2.41314207E-05    2     1000023         4   # BR(~c_R -> ~chi_20 c)
     3.04310399E-05    2     1000025         4   # BR(~c_R -> ~chi_30 c)
     3.84362898E-09    2     1000035         4   # BR(~c_R -> ~chi_40 c)
     9.47071796E-01    2     1000021         4   # BR(~c_R -> ~g      c)
#
#         PDG            Width
DECAY   1000003     2.38501013E+02   # sstrange_L decays
#          BR         NDA      ID1       ID2
     3.11607872E-03    2     1000022         3   # BR(~s_L -> ~chi_10 s)
     3.77726330E-05    2     1000023         3   # BR(~s_L -> ~chi_20 s)
     2.55433962E-05    2     1000025         3   # BR(~s_L -> ~chi_30 s)
     3.30127093E-02    2     1000035         3   # BR(~s_L -> ~chi_40 s)
     2.63593772E-05    2    -1000024         4   # BR(~s_L -> ~chi_1- c)
     6.60564329E-02    2    -1000037         4   # BR(~s_L -> ~chi_2- c)
     8.97725104E-01    2     1000021         3   # BR(~s_L -> ~g      s)
#
#         PDG            Width
DECAY   2000003     2.15553818E+02   # sstrange_R decays
#          BR         NDA      ID1       ID2
     1.37640531E-02    2     1000022         3   # BR(~s_R -> ~chi_10 s)
     6.28198114E-06    2     1000023         3   # BR(~s_R -> ~chi_20 s)
     7.92192191E-06    2     1000025         3   # BR(~s_R -> ~chi_30 s)
     1.00069988E-09    2     1000035         3   # BR(~s_R -> ~chi_40 s)
     9.86221742E-01    2     1000021         3   # BR(~s_R -> ~g      s)
#
#         PDG            Width
DECAY   1000011     3.02470162E+01   # selectron_L decays
#          BR         NDA      ID1       ID2
     2.26646472E-01    2     1000022        11   # BR(~e_L -> ~chi_10 e-)
     9.56628647E-04    2     1000023        11   # BR(~e_L -> ~chi_20 e-)
     7.68708539E-07    2     1000025        11   # BR(~e_L -> ~chi_30 e-)
     2.57201046E-01    2     1000035        11   # BR(~e_L -> ~chi_40 e-)
     2.11373880E-04    2    -1000024        12   # BR(~e_L -> ~chi_1- nu_e)
     5.14983711E-01    2    -1000037        12   # BR(~e_L -> ~chi_2- nu_e)
#
#         PDG            Width
DECAY   2000011     2.73632486E+01   # selectron_R decays
#          BR         NDA      ID1       ID2
     9.98974647E-01    2     1000022        11   # BR(~e_R -> ~chi_10 e-)
     4.53456987E-04    2     1000023        11   # BR(~e_R -> ~chi_20 e-)
     5.71825588E-04    2     1000025        11   # BR(~e_R -> ~chi_30 e-)
     7.03348108E-08    2     1000035        11   # BR(~e_R -> ~chi_40 e-)
#
#         PDG            Width
DECAY   1000013     3.02470162E+01   # smuon_L decays
#          BR         NDA      ID1       ID2
     2.26646472E-01    2     1000022        13   # BR(~mu_L -> ~chi_10 mu-)
     9.56628647E-04    2     1000023        13   # BR(~mu_L -> ~chi_20 mu-)
     7.68708539E-07    2     1000025        13   # BR(~mu_L -> ~chi_30 mu-)
     2.57201046E-01    2     1000035        13   # BR(~mu_L -> ~chi_40 mu-)
     2.11373880E-04    2    -1000024        14   # BR(~mu_L -> ~chi_1- nu_mu)
     5.14983711E-01    2    -1000037        14   # BR(~mu_L -> ~chi_2- nu_mu)
#
#         PDG            Width
DECAY   2000013     2.73632486E+01   # smuon_R decays
#          BR         NDA      ID1       ID2
     9.98974647E-01    2     1000022        13   # BR(~mu_R -> ~chi_10 mu-)
     4.53456987E-04    2     1000023        13   # BR(~mu_R -> ~chi_20 mu-)
     5.71825588E-04    2     1000025        13   # BR(~mu_R -> ~chi_30 mu-)
     7.03348108E-08    2     1000035        13   # BR(~mu_R -> ~chi_40 mu-)
#
#         PDG            Width
DECAY   1000015     2.90348698E+01   # stau_1 decays
#          BR         NDA      ID1       ID2
     9.26861807E-01    2     1000022        15   # BR(~tau_1 -> ~chi_10  tau-)
     1.47479707E-02    2     1000023        15   # BR(~tau_1 -> ~chi_20  tau-)
     1.36749076E-02    2     1000025        15   # BR(~tau_1 -> ~chi_30  tau-)
     5.56581119E-03    2     1000035        15   # BR(~tau_1 -> ~chi_40  tau-)
     2.80054750E-02    2    -1000024        16   # BR(~tau_1 -> ~chi_1-  nu_tau)
     1.11440280E-02    2    -1000037        16   # BR(~tau_1 -> ~chi_2-  nu_tau)
#
#         PDG            Width
DECAY   2000015     3.09933532E+01   # stau_2 decays
#          BR         NDA      ID1       ID2
     2.34713666E-01    2     1000022        15   # BR(~tau_2 -> ~chi_10  tau-)
     1.36776004E-02    2     1000023        15   # BR(~tau_2 -> ~chi_20  tau-)
     1.38134967E-02    2     1000025        15   # BR(~tau_2 -> ~chi_30  tau-)
     2.45716064E-01    2     1000035        15   # BR(~tau_2 -> ~chi_40  tau-)
     9.17626655E-05    2    -1000024        16   # BR(~tau_2 -> ~chi_1-  nu_tau)
     4.91987411E-01    2    -1000037        16   # BR(~tau_2 -> ~chi_2-  nu_tau)
#
#         PDG            Width
DECAY   1000012     3.02493912E+01   # snu_eL decays
#          BR         NDA      ID1       ID2
     2.26345722E-01    2     1000022        12   # BR(~nu_eL -> ~chi_10 nu_e)
     1.13198598E-04    2     1000023        12   # BR(~nu_eL -> ~chi_20 nu_e)
     4.79722885E-04    2     1000025        12   # BR(~nu_eL -> ~chi_30 nu_e)
     2.57272465E-01    2     1000035        12   # BR(~nu_eL -> ~chi_40 nu_e)
     1.96097076E-03    2     1000024        11   # BR(~nu_eL -> ~chi_1+ e-)
     5.13827921E-01    2     1000037        11   # BR(~nu_eL -> ~chi_2+ e-)
#
#         PDG            Width
DECAY   1000014     3.02493912E+01   # snu_muL decays
#          BR         NDA      ID1       ID2
     2.26345722E-01    2     1000022        14   # BR(~nu_muL -> ~chi_10 nu_mu)
     1.13198598E-04    2     1000023        14   # BR(~nu_muL -> ~chi_20 nu_mu)
     4.79722885E-04    2     1000025        14   # BR(~nu_muL -> ~chi_30 nu_mu)
     2.57272465E-01    2     1000035        14   # BR(~nu_muL -> ~chi_40 nu_mu)
     1.96097076E-03    2     1000024        13   # BR(~nu_muL -> ~chi_1+ mu-)
     5.13827921E-01    2     1000037        13   # BR(~nu_muL -> ~chi_2+ mu-)
#
#         PDG            Width
DECAY   1000016     3.10524913E+01   # snu_tauL decays
#          BR         NDA      ID1       ID2
     2.20467985E-01    2     1000022        16   # BR(~nu_tauL -> ~chi_10 nu_tau)
     1.10255643E-04    2     1000023        16   # BR(~nu_tauL -> ~chi_20 nu_tau)
     4.67250918E-04    2     1000025        16   # BR(~nu_tauL -> ~chi_30 nu_tau)
     2.50526573E-01    2     1000035        16   # BR(~nu_tauL -> ~chi_40 nu_tau)
     2.80726283E-02    2     1000024        15   # BR(~nu_tauL -> ~chi_1+ tau-)
     5.00355307E-01    2     1000037        15   # BR(~nu_tauL -> ~chi_2+ tau-)
#
#         PDG            Width
DECAY   1000024     7.97179570E-01   # chargino1+ decays
#          BR         NDA      ID1       ID2
     1.00000000E+00    2     1000022        24   # BR(~chi_1+ -> ~chi_10  W+)
#
#         PDG            Width
DECAY   1000037     1.92743580E+01   # chargino2+ decays
#          BR         NDA      ID1       ID2
     2.52917072E-01    2     1000024        23   # BR(~chi_2+ -> ~chi_1+  Z )
     2.27530426E-04    2     1000022        24   # BR(~chi_2+ -> ~chi_10  W+)
     2.43959782E-01    2     1000023        24   # BR(~chi_2+ -> ~chi_20  W+)
     2.43872149E-01    2     1000025        24   # BR(~chi_2+ -> ~chi_30  W+)
     2.59022874E-01    2     1000024        25   # BR(~chi_2+ -> ~chi_1+  h )
     5.91948648E-07    2     1000022        37   # BR(~chi_2+ -> ~chi_10  H+)
#
#         PDG            Width
DECAY   1000022     0.00000000E+00   # neutralino1 decays
#
#         PDG            Width
DECAY   1000023     8.36398497E-01   # neutralino2 decays
#          BR         NDA      ID1       ID2
     5.51245017E-01    2     1000022        23   # BR(~chi_20 -> ~chi_10   Z )
     4.48754983E-01    2     1000022        25   # BR(~chi_20 -> ~chi_10   h )
#
#         PDG            Width
DECAY   1000025     8.43506234E-01   # neutralino3 decays
#          BR         NDA      ID1       ID2
     4.33556379E-01    2     1000022        23   # BR(~chi_30 -> ~chi_10   Z )
     5.66443621E-01    2     1000022        25   # BR(~chi_30 -> ~chi_10   h )
#
#         PDG            Width
DECAY   1000035     1.92831703E+01   # neutralino4 decays
#          BR         NDA      ID1       ID2
     7.23289397E-05    2     1000022        23   # BR(~chi_40 -> ~chi_10   Z )
     5.16779290E-02    2     1000023        23   # BR(~chi_40 -> ~chi_20   Z )
     2.00566476E-01    2     1000025        23   # BR(~chi_40 -> ~chi_30   Z )
     2.44515883E-01    2     1000024       -24   # BR(~chi_40 -> ~chi_1+   W-)
     2.44515883E-01    2    -1000024        24   # BR(~chi_40 -> ~chi_1-   W+)
     1.59130072E-04    2     1000022        25   # BR(~chi_40 -> ~chi_10   h )
     5.39739514E-07    2     1000022        35   # BR(~chi_40 -> ~chi_10   H )
     7.32756414E-08    2     1000022        36   # BR(~chi_40 -> ~chi_10   A )
     2.06749422E-01    2     1000023        25   # BR(~chi_40 -> ~chi_20   h )
     5.17423347E-02    2     1000025        25   # BR(~chi_40 -> ~chi_30   h )
#
#         PDG            Width
DECAY        25     4.05101282E-03   # h decays
#          BR         NDA      ID1       ID2
     6.06482036E-01    2           5        -5   # BR(h -> b       bb     )
     6.40435164E-02    2         -15        15   # BR(h -> tau+    tau-   )
     2.26737164E-04    2         -13        13   # BR(h -> mu+     mu-    )
     4.80640794E-04    2           3        -3   # BR(h -> s       sb     )
     2.08279327E-02    2           4        -4   # BR(h -> c       cb     )
     6.74175619E-02    2          21        21   # BR(h -> g       g      )
     2.31896516E-03    2          22        22   # BR(h -> gam     gam    )
     1.49848883E-03    2          22        23   # BR(h -> Z       gam    )
     2.11446212E-01    2          24       -24   # BR(h -> W+      W-     )
     2.52170202E-02    2          23        23   # BR(h -> Z       Z      )
     4.08888343E-05    2     1000022   1000022   # BR(h -> ~chi_10 ~chi_10)
#
#         PDG            Width
DECAY        35     7.62673125E+00   # H decays
#          BR         NDA      ID1       ID2
     4.26580967E-01    2           5        -5   # BR(H -> b       bb     )
     7.30442716E-02    2         -15        15   # BR(H -> tau+    tau-   )
     2.58290346E-04    2         -13        13   # BR(H -> mu+     mu-    )
     3.16624376E-04    2           3        -3   # BR(H -> s       sb     )
     1.77116554E-06    2           4        -4   # BR(H -> c       cb     )
     1.76953465E-01    2           6        -6   # BR(H -> t       tb     )
     5.87693459E-05    2          21        21   # BR(H -> g       g      )
     3.62444463E-07    2          22        22   # BR(H -> gam     gam    )
     1.04508153E-07    2          23        22   # BR(H -> Z       gam    )
     8.01165489E-05    2          24       -24   # BR(H -> W+      W-     )
     4.00075753E-05    2          23        23   # BR(H -> Z       Z      )
     3.00052365E-04    2          25        25   # BR(H -> h       h      )
     3.96003412E-23    2          36        36   # BR(H -> A       A      )
     1.12578034E-18    2          23        36   # BR(H -> Z       A      )
     7.43449960E-04    2     1000024  -1000024   # BR(H -> ~chi_1+ ~chi_1-)
     1.12028446E-03    2     1000022   1000022   # BR(H -> ~chi_10 ~chi_10)
     5.61322310E-05    2     1000023   1000023   # BR(H -> ~chi_20 ~chi_20)
     1.24030345E-04    2     1000025   1000025   # BR(H -> ~chi_30 ~chi_30)
     1.91164254E-01    2     1000022   1000023   # BR(H -> ~chi_10 ~chi_20)
     1.29034111E-01    2     1000022   1000025   # BR(H -> ~chi_10 ~chi_30)
     1.22935440E-04    2     1000023   1000025   # BR(H -> ~chi_20 ~chi_30)
#
#         PDG            Width
DECAY        36     7.64776143E+00   # A decays
#          BR         NDA      ID1       ID2
     4.25550877E-01    2           5        -5   # BR(A -> b       bb     )
     7.28455812E-02    2         -15        15   # BR(A -> tau+    tau-   )
     2.57587401E-04    2         -13        13   # BR(A -> mu+     mu-    )
     3.15993439E-04    2           3        -3   # BR(A -> s       sb     )
     1.77360530E-06    2           4        -4   # BR(A -> c       cb     )
     1.77099449E-01    2           6        -6   # BR(A -> t       tb     )
     1.75253348E-04    2          21        21   # BR(A -> g       g      )
     4.87263061E-07    2          22        22   # BR(A -> gam     gam    )
     2.12301831E-07    2          23        22   # BR(A -> Z       gam    )
     7.95940262E-05    2          23        25   # BR(A -> Z       h      )
     2.59231029E-03    2     1000024  -1000024   # BR(A -> ~chi_1+ ~chi_1-)
     1.14693582E-03    2     1000022   1000022   # BR(A -> ~chi_10 ~chi_10)
     1.46787746E-04    2     1000023   1000023   # BR(A -> ~chi_20 ~chi_20)
     7.66565744E-04    2     1000025   1000025   # BR(A -> ~chi_30 ~chi_30)
     1.30280041E-01    2     1000022   1000023   # BR(A -> ~chi_10 ~chi_20)
     1.88733584E-01    2     1000022   1000025   # BR(A -> ~chi_10 ~chi_30)
     6.96748013E-06    2     1000023   1000025   # BR(A -> ~chi_20 ~chi_30)
#
#         PDG            Width
DECAY        37     7.62887720E+00   # H+ decays
#          BR         NDA      ID1       ID2
     6.86768239E-04    2           4        -5   # BR(H+ -> c       bb     )
     7.30470396E-02    2         -15        16   # BR(H+ -> tau+    nu_tau )
     2.58299773E-04    2         -13        14   # BR(H+ -> mu+     nu_mu  )
     4.39529420E-06    2           2        -5   # BR(H+ -> u       bb     )
     1.51564959E-05    2           2        -3   # BR(H+ -> u       sb     )
     3.13437406E-04    2           4        -3   # BR(H+ -> c       sb     )
     6.03050257E-01    2           6        -5   # BR(H+ -> t       bb     )
     7.99115975E-05    2          24        25   # BR(H+ -> W+      h      )
     8.50956433E-14    2          24        36   # BR(H+ -> W+      A      )
     3.22123084E-01    2     1000024   1000022   # BR(H+ -> ~chi_1+ ~chi_10)
     3.55568483E-04    2     1000024   1000023   # BR(H+ -> ~chi_1+ ~chi_20)
     6.60819826E-05    2     1000024   1000025   # BR(H+ -> ~chi_1+ ~chi_30)
