#  ISAJET SUSY parameters in SUSY Les Houches Accord 2 format
#  Created by ISALHA 2.0 Last revision: H Baer 27 May 2014
Block SPINFO   # Program information
     1   ISASUGRA/ISASUSY from ISAJET   # Spectrum Calculator
     2   7.85   04-NOV-2015 13:42:47    # Version number
Block MODSEL   # Model selection
     1     2   # Minimal gauge mediated (GMSB) model               
Block SMINPUTS   # Standard Model inputs
     1     1.28000000E+02   # alpha_em^(-1)
     2     1.16570000E-05   # G_Fermi
     3     1.19999997E-01   # alpha_s(M_Z)
     4     9.11699982E+01   # m_{Z}(pole)
     5     4.19999981E+00   # m_{b}(m_{b})
     6     1.73000000E+02   # m_{top}(pole)
     7     1.77699995E+00   # m_{tau}(pole)
Block MINPAR   # SUSY breaking input parameters
     1     4.90000000E+05   # Lambda scale of soft SSB
     2     1.00000000E+06   # M_mess overall messenger scale
     3     5.00000000E+01   # tan(beta)
     4     1.00000000E+00   # sign(mu)
     5     1.00000000E+00   # N_5 messenger index
     6     1.00000000E+05   # c_grav gravitino mass factor
    51     1.00000000E+00   # N5_1  U(1)_Y messenger index
    52     1.00000000E+00   # N5_2 SU(2)_L messenger index
    53     1.00000000E+00   # N5_3 SU(3)_C messenger index
   101     1.00000000E+00   # Rsl
   102     0.00000000E+00   # dmH_d^2
   103     0.00000000E+00   # dmH_u^2
   104     0.00000000E+00   # d_Y
Block MASS   # Scalar and gaugino mass spectrum
#  PDG code   mass                 particle
         6     1.73000000E+02   #  top            
        24     8.04229965E+01   #  W^+
        25     1.21474541E+02   #  h^0            
        35     1.69430579E+03   #  H^0            
        36     1.68322522E+03   #  A^0            
        37     1.69667163E+03   #  H^+            
   1000001     4.88126025E+03   #  dnl            
   1000002     4.88059277E+03   #  upl            
   1000003     4.88126025E+03   #  stl            
   1000004     4.88059375E+03   #  chl            
   1000005     4.42435498E+03   #  b1             
   1000006     4.20821533E+03   #  t1             
   1000011     1.70988245E+03   #  el-            
   1000012     1.70075256E+03   #  nuel           
   1000013     1.70988245E+03   #  mul-           
   1000014     1.70075256E+03   #  numl           
   1000015     6.96074219E+02   #  tau1           
   1000016     1.66364758E+03   #  nutl           
   1000021     3.52157520E+03   #  glss           
   1000022     7.06735535E+02   #  z1ss           
   1000023     1.34231995E+03   #  z2ss           
   1000024     1.34278552E+03   #  w1ss           
   1000025    -1.63311255E+03   #  z3ss           
   1000035     1.64213574E+03   #  z4ss           
   1000037     1.64304297E+03   #  w2ss           
   1000039     1.17875682E-02   #  gvss
   2000001     4.60790381E+03   #  dnr            
   2000002     4.63472461E+03   #  upr            
   2000003     4.60790381E+03   #  str            
   2000004     4.63472461E+03   #  chr            
   2000005     4.61937598E+03   #  b2             
   2000006     4.64433594E+03   #  t2             
   2000011     8.59995850E+02   #  er-            
   2000013     8.59995850E+02   #  mur-           
   2000015     1.67014124E+03   #  tau2           
Block ALPHA   # Effective Higgs mixing parameter
         -2.01450922E-02   # alpha
Block STOPMIX   # stop mixing matrix
  1  1     2.20325794E-02   # O_{11}
  1  2     9.99757230E-01   # O_{12}
  2  1    -9.99757230E-01   # O_{21}
  2  2     2.20325794E-02   # O_{22}
Block SBOTMIX   # sbottom mixing matrix
  1  1     1.35757476E-01   # O_{11}
  1  2     9.90742087E-01   # O_{12}
  2  1    -9.90742087E-01   # O_{21}
  2  2     1.35757476E-01   # O_{22}
Block STAUMIX   # stau mixing matrix
  1  1     5.58547564E-02   # O_{11}
  1  2     9.98438895E-01   # O_{12}
  2  1    -9.98438895E-01   # O_{21}
  2  2     5.58547564E-02   # O_{22}
Block NMIX   # neutralino mixing matrix
  1  1     9.99396503E-01   #
  1  2    -1.91933371E-03   #
  1  3     3.18840668E-02   #
  1  4    -1.36416955E-02   #
  2  1     7.82827381E-03   #
  2  2     9.83937502E-01   #
  2  3    -1.37604922E-01   #
  2  4     1.13449112E-01   #
  3  1     1.28567331E-02   #
  3  2    -1.73797570E-02   #
  3  3    -7.06635594E-01   #
  3  4    -7.07247198E-01   #
  4  1     3.13016959E-02   #
  4  2    -1.77655160E-01   #
  4  3    -6.93335652E-01   #
  4  4     6.97670758E-01   #
Block UMIX   # chargino U mixing matrix
  1  1    -9.81669724E-01   # U_{11}
  1  2     1.90589964E-01   # U_{12}
  2  1    -1.90589964E-01   # U_{21}
  2  2    -9.81669724E-01   # U_{22}
Block VMIX   # chargino V mixing matrix
  1  1    -9.87590432E-01   # V_{11}
  1  2     1.57051384E-01   # V_{12}
  2  1    -1.57051384E-01   # V_{21}
  2  2    -9.87590432E-01   # V_{22}
Block GAUGE Q=  4.29224609E+03   #
     1     3.57515603E-01   # g`
     2     6.52412236E-01   # g_2
     3     1.21976948E+00   # g_3
Block YU Q=  4.29224609E+03   #
  3  3     8.23001146E-01   # y_t
Block YD Q=  4.29224609E+03   #
  3  3     5.51186919E-01   # y_b
Block YE Q=  4.29224609E+03   #
  3  3     5.50516009E-01   # y_tau
Block HMIX Q=  4.29224609E+03   # Higgs mixing parameters
     1     1.61600684E+03   # mu(Q)
     2     4.94279556E+01   # tan(beta)(Q)
     3     2.52185852E+02   # Higgs vev at Q
     4     2.83324725E+06   # m_A^2(Q)
Block MSOFT Q=  4.29224609E+03   # DRbar SUSY breaking parameters
     1     7.19884094E+02   # M_1(Q)          
     2     1.30059497E+03   # M_2(Q)          
     3     3.21123096E+03   # M_3(Q)          
    21     4.92518938E+05   # MHd^2(Q)        
    22    -2.11755500E+06   # MHu^2(Q)        
    31     1.69688623E+03   # MeL(Q)          
    32     1.69688623E+03   # MmuL(Q)         
    33     1.66058350E+03   # MtauL(Q)        
    34     8.58472778E+02   # MeR(Q)          
    35     8.58472778E+02   # MmuR(Q)         
    36     7.27521179E+02   # MtauR(Q)        
    41     4.72434863E+03   # MqL1(Q)         
    42     4.72434863E+03   # MqL2(Q)         
    43     4.48303125E+03   # MqL3(Q)         
    44     4.47507959E+03   # MuR(Q)          
    45     4.47507959E+03   # McR(Q)          
    46     4.10958057E+03   # MtR(Q)          
    47     4.44766113E+03   # MdR(Q)          
    48     4.44766113E+03   # MsR(Q)          
    49     4.28478711E+03   # MbR(Q)          
Block AU Q=  4.29224609E+03   #
  1  1    -9.24068481E+02   # A_u
  2  2    -9.24068481E+02   # A_c
  3  3    -9.24068481E+02   # A_t
Block AD Q=  4.29224609E+03   #
  1  1    -9.80584656E+02   # A_d
  2  2    -9.80584656E+02   # A_s
  3  3    -9.80584656E+02   # A_b
Block AE Q=  4.29224609E+03   #
  1  1    -9.57690811E+01   # A_e
  2  2    -9.57690811E+01   # A_mu
  3  3    -9.57690811E+01   # A_tau
#  ISAJET decay tables in SUSY Les Houches accord format
#  Created by ISALHD. Last revision: C. Balazs, 2005 May 25
Block DCINFO                           # Program information
     1   ISASUGRA from ISAJET          # Spectrum Calculator
     2   7.85   04-NOV-2015 13:42:47   # Version number
#         PDG         Width
DECAY         6  1.16039467E+00   # TP    decays
#          BR          NDA       ID1       ID2       ID3       ID4
      3.33333343E-01    3            2        -1         5             # TP     -->  UP     DB     BT          
      3.33333343E-01    3            4        -3         5             # TP     -->  CH     SB     BT          
      1.11111112E-01    3          -11        12         5             # TP     -->  E+     NUE    BT          
      1.11111112E-01    3          -13        14         5             # TP     -->  MU+    NUM    BT          
      1.11111112E-01    3          -15        16         5             # TP     -->  TAU+   NUT    BT          
#         PDG         Width
DECAY   1000021  9.58542526E-02   # GLSS  decays
#          BR          NDA       ID1       ID2       ID3       ID4
      4.14374806E-02    3      1000024         1        -2             # GLSS   -->  W1SS+  DN     UB          
      4.14374806E-02    3     -1000024         2        -1             # GLSS   -->  W1SS-  UP     DB          
      4.14374545E-02    3      1000024         3        -4             # GLSS   -->  W1SS+  ST     CB          
      4.14374545E-02    3     -1000024         4        -3             # GLSS   -->  W1SS-  CH     SB          
      5.44723868E-02    3      1000024         5        -6             # GLSS   -->  W1SS+  BT     TB          
      5.44723868E-02    3     -1000024         6        -5             # GLSS   -->  W1SS-  TP     BB          
      8.35443032E-04    3      1000037         1        -2             # GLSS   -->  W2SS+  DN     UB          
      8.35443032E-04    3     -1000037         2        -1             # GLSS   -->  W2SS-  UP     DB          
      8.35442625E-04    3      1000037         3        -4             # GLSS   -->  W2SS+  ST     CB          
      8.35442625E-04    3     -1000037         4        -3             # GLSS   -->  W2SS-  CH     SB          
      1.14352293E-01    3      1000037         5        -6             # GLSS   -->  W2SS+  BT     TB          
      1.14352293E-01    3     -1000037         6        -5             # GLSS   -->  W2SS-  TP     BB          
      7.95697451E-06    2      1000022        21                       # GLSS   -->  Z1SS   GL                 
      2.77571846E-02    3      1000022         2        -2             # GLSS   -->  Z1SS   UP     UB          
      8.12863093E-03    3      1000022         1        -1             # GLSS   -->  Z1SS   DN     DB          
      8.12863093E-03    3      1000022         3        -3             # GLSS   -->  Z1SS   ST     SB          
      2.77571827E-02    3      1000022         4        -4             # GLSS   -->  Z1SS   CH     CB          
      1.06391124E-02    3      1000022         5        -5             # GLSS   -->  Z1SS   BT     BB          
      4.51296978E-02    3      1000022         6        -6             # GLSS   -->  Z1SS   TP     TB          
      6.48417481E-05    2      1000023        21                       # GLSS   -->  Z2SS   GL                 
      2.07709391E-02    3      1000023         2        -2             # GLSS   -->  Z2SS   UP     UB          
      2.06335690E-02    3      1000023         1        -1             # GLSS   -->  Z2SS   DN     DB          
      2.06335690E-02    3      1000023         3        -3             # GLSS   -->  Z2SS   ST     SB          
      2.07709149E-02    3      1000023         4        -4             # GLSS   -->  Z2SS   CH     CB          
      3.07735279E-02    3      1000023         5        -5             # GLSS   -->  Z2SS   BT     BB          
      2.39188448E-02    3      1000023         6        -6             # GLSS   -->  Z2SS   TP     TB          
      1.20110263E-03    2      1000025        21                       # GLSS   -->  Z3SS   GL                 
      2.07380367E-06    3      1000025         2        -2             # GLSS   -->  Z3SS   UP     UB          
      2.50296807E-06    3      1000025         1        -1             # GLSS   -->  Z3SS   DN     DB          
      2.50296807E-06    3      1000025         3        -3             # GLSS   -->  Z3SS   ST     SB          
      2.07380185E-06    3      1000025         4        -4             # GLSS   -->  Z3SS   CH     CB          
      3.33116427E-02    3      1000025         5        -5             # GLSS   -->  Z3SS   BT     BB          
      7.59098530E-02    3      1000025         6        -6             # GLSS   -->  Z3SS   TP     TB          
      1.15617819E-03    2      1000035        21                       # GLSS   -->  Z4SS   GL                 
      4.17738425E-04    3      1000035         2        -2             # GLSS   -->  Z4SS   UP     UB          
      4.66269586E-04    3      1000035         1        -1             # GLSS   -->  Z4SS   DN     DB          
      4.66269586E-04    3      1000035         3        -3             # GLSS   -->  Z4SS   ST     SB          
      4.17737931E-04    3      1000035         4        -4             # GLSS   -->  Z4SS   CH     CB          
      3.20806615E-02    3      1000035         5        -5             # GLSS   -->  Z4SS   BT     BB          
      8.27077925E-02    3      1000035         6        -6             # GLSS   -->  Z4SS   TP     TB          
      4.68178536E-17    2      1000039        21                       # GLSS   -->  GVSS   GL                 
#         PDG         Width
DECAY   1000002  1.12437004E+02   # UPL   decays
#          BR          NDA       ID1       ID2       ID3       ID4
      5.74877672E-03    2      1000022         2                       # UPL    -->  Z1SS   UP                 
      1.51584670E-01    2      1000023         2                       # UPL    -->  Z2SS   UP                 
      3.25254696E-05    2      1000025         2                       # UPL    -->  Z3SS   UP                 
      4.24693059E-03    2      1000035         2                       # UPL    -->  Z4SS   UP                 
      5.26799381E-01    2      1000021         2                       # UPL    -->  GLSS   UP                 
      3.04501563E-01    2      1000024         1                       # UPL    -->  W1SS+  DN                 
      7.08616013E-03    2      1000037         1                       # UPL    -->  W2SS+  DN                 
#         PDG         Width
DECAY   1000001  1.12453705E+02   # DNL   decays
#          BR          NDA       ID1       ID2       ID3       ID4
      5.99496020E-03    2      1000022         1                       # DNL    -->  Z1SS   DN                 
      1.50708407E-01    2      1000023         1                       # DNL    -->  Z2SS   DN                 
      5.61231900E-05    2      1000025         1                       # DNL    -->  Z3SS   DN                 
      4.83276648E-03    2      1000035         1                       # DNL    -->  Z4SS   DN                 
      5.27099848E-01    2      1000021         1                       # DNL    -->  GLSS   DN                 
      3.00871462E-01    2     -1000024         2                       # DNL    -->  W1SS-  UP                 
      1.04364483E-02    2     -1000037         2                       # DNL    -->  W2SS-  UP                 
#         PDG         Width
DECAY   1000003  1.12453705E+02   # STL   decays
#          BR          NDA       ID1       ID2       ID3       ID4
      5.99496067E-03    2      1000022         3                       # STL    -->  Z1SS   ST                 
      1.50708422E-01    2      1000023         3                       # STL    -->  Z2SS   ST                 
      5.61231936E-05    2      1000025         3                       # STL    -->  Z3SS   ST                 
      4.83276695E-03    2      1000035         3                       # STL    -->  Z4SS   ST                 
      5.27099848E-01    2      1000021         3                       # STL    -->  GLSS   ST                 
      3.00871402E-01    2     -1000024         4                       # STL    -->  W1SS-  CH                 
      1.04364464E-02    2     -1000037         4                       # STL    -->  W2SS-  CH                 
#         PDG         Width
DECAY   1000004  1.12437057E+02   # CHL   decays
#          BR          NDA       ID1       ID2       ID3       ID4
      5.74877532E-03    2      1000022         4                       # CHL    -->  Z1SS   CH                 
      1.51584625E-01    2      1000023         4                       # CHL    -->  Z2SS   CH                 
      3.25254623E-05    2      1000025         4                       # CHL    -->  Z3SS   CH                 
      4.24692919E-03    2      1000035         4                       # CHL    -->  Z4SS   CH                 
      5.26799440E-01    2      1000021         4                       # CHL    -->  GLSS   CH                 
      3.04501563E-01    2      1000024         3                       # CHL    -->  W1SS+  ST                 
      7.08615920E-03    2      1000037         3                       # CHL    -->  W2SS+  ST                 
#         PDG         Width
DECAY   1000005  7.39543304E+01   # BT1   decays
#          BR          NDA       ID1       ID2       ID3       ID4
      3.32977884E-02    2      1000022         5                       # BT1    -->  Z1SS   BT                 
      1.80677306E-02    2      1000023         5                       # BT1    -->  Z2SS   BT                 
      1.29871950E-01    2      1000025         5                       # BT1    -->  Z3SS   BT                 
      1.17620684E-01    2      1000035         5                       # BT1    -->  Z4SS   BT                 
      4.28570211E-01    2      1000021         5                       # BT1    -->  GLSS   BT                 
      3.51360701E-02    2     -1000024         6                       # BT1    -->  W1SS-  TP                 
      2.37430841E-01    2     -1000037         6                       # BT1    -->  W2SS-  TP                 
      4.72154306E-06    2          -24   1000006                       # BT1    -->  W-     TP1                
#         PDG         Width
DECAY   1000006  1.06124771E+02   # TP1   decays
#          BR          NDA       ID1       ID2       ID3       ID4
      1.85238168E-01    2      1000021         6                       # TP1    -->  GLSS   TP                 
      8.43257830E-02    2      1000022         6                       # TP1    -->  Z1SS   TP                 
      6.46086317E-03    2      1000023         6                       # TP1    -->  Z2SS   TP                 
      1.82791978E-01    2      1000025         6                       # TP1    -->  Z3SS   TP                 
      1.75390214E-01    2      1000035         6                       # TP1    -->  Z4SS   TP                 
      1.24882180E-02    2      1000024         5                       # TP1    -->  W1SS+  BT                 
      3.53304774E-01    2      1000037         5                       # TP1    -->  W2SS+  BT                 
#         PDG         Width
DECAY   2000002  5.39216995E+01   # UPR   decays
#          BR          NDA       ID1       ID2       ID3       ID4
      1.85147226E-01    2      1000022         2                       # UPR    -->  Z1SS   UP                 
      9.99338044E-06    2      1000023         2                       # UPR    -->  Z2SS   UP                 
      2.46369418E-05    2      1000025         2                       # UPR    -->  Z3SS   UP                 
      1.45578015E-04    2      1000035         2                       # UPR    -->  Z4SS   UP                 
      8.14672589E-01    2      1000021         2                       # UPR    -->  GLSS   UP                 
#         PDG         Width
DECAY   2000001  4.47966728E+01   # DNR   decays
#          BR          NDA       ID1       ID2       ID3       ID4
      5.53621612E-02    2      1000022         1                       # DNR    -->  Z1SS   DN                 
      2.98346322E-06    2      1000023         1                       # DNR    -->  Z2SS   DN                 
      7.34658124E-06    2      1000025         1                       # DNR    -->  Z3SS   DN                 
      4.34086251E-05    2      1000035         1                       # DNR    -->  Z4SS   DN                 
      9.44584072E-01    2      1000021         1                       # DNR    -->  GLSS   DN                 
#         PDG         Width
DECAY   2000003  4.47966728E+01   # STR   decays
#          BR          NDA       ID1       ID2       ID3       ID4
      5.53621612E-02    2      1000022         3                       # STR    -->  Z1SS   ST                 
      2.98346322E-06    2      1000023         3                       # STR    -->  Z2SS   ST                 
      7.34658124E-06    2      1000025         3                       # STR    -->  Z3SS   ST                 
      4.34086251E-05    2      1000035         3                       # STR    -->  Z4SS   ST                 
      9.44584072E-01    2      1000021         3                       # STR    -->  GLSS   ST                 
#         PDG         Width
DECAY   2000004  5.39216614E+01   # CHR   decays
#          BR          NDA       ID1       ID2       ID3       ID4
      1.85147315E-01    2      1000022         4                       # CHR    -->  Z1SS   CH                 
      9.99338499E-06    2      1000023         4                       # CHR    -->  Z2SS   CH                 
      2.46369527E-05    2      1000025         4                       # CHR    -->  Z3SS   CH                 
      1.45578073E-04    2      1000035         4                       # CHR    -->  Z4SS   CH                 
      8.14672470E-01    2      1000021         4                       # CHR    -->  GLSS   CH                 
#         PDG         Width
DECAY   2000005  1.57951767E+02   # BT2   decays
#          BR          NDA       ID1       ID2       ID3       ID4
      3.74616333E-03    2      1000022         5                       # BT2    -->  Z1SS   BT                 
      9.60605517E-02    2      1000023         5                       # BT2    -->  Z2SS   BT                 
      6.61872327E-02    2      1000025         5                       # BT2    -->  Z3SS   BT                 
      7.01782256E-02    2      1000035         5                       # BT2    -->  Z4SS   BT                 
      2.71962821E-01    2      1000021         5                       # BT2    -->  GLSS   BT                 
      1.91774324E-01    2     -1000024         6                       # BT2    -->  W1SS-  TP                 
      2.93285459E-01    2     -1000037         6                       # BT2    -->  W2SS-  TP                 
      8.98096885E-04    2          -24   1000006                       # BT2    -->  W-     TP1                
      1.45167205E-03    2           23   1000005                       # BT2    -->  Z0     BT1                
      4.45546396E-03    2           25   1000005                       # BT2    -->  HL0    BT1                
#         PDG         Width
DECAY   2000006  1.60866409E+02   # TP2   decays
#          BR          NDA       ID1       ID2       ID3       ID4
      2.70831466E-01    2      1000021         6                       # TP2    -->  GLSS   TP                 
      2.02394471E-01    2      1000024         5                       # TP2    -->  W1SS+  BT                 
      1.31306455E-01    2      1000037         5                       # TP2    -->  W2SS+  BT                 
      5.34130260E-04    2           23   1000006                       # TP2    -->  Z0     TP1                
      2.04826659E-03    2           25   1000006                       # TP2    -->  HL0    TP1                
      4.76217549E-03    2           24   1000005                       # TP2    -->  W+     BT1                
      3.82606732E-03    2      1000022         6                       # TP2    -->  Z1SS   TP                 
      1.00913621E-01    2      1000023         6                       # TP2    -->  Z2SS   TP                 
      1.41186848E-01    2      1000025         6                       # TP2    -->  Z3SS   TP                 
      1.42196476E-01    2      1000035         6                       # TP2    -->  Z4SS   TP                 
#         PDG         Width
DECAY   1000011  4.55970907E+00   # EL-   decays
#          BR          NDA       ID1       ID2       ID3       ID4
      3.25149715E-01    2      1000022        11                       # EL-    -->  Z1SS   E-                 
      2.26981372E-01    2      1000023        11                       # EL-    -->  Z2SS   E-                 
      1.29370642E-06    2      1000025        11                       # EL-    -->  Z3SS   E-                 
      2.45160656E-04    2      1000035        11                       # EL-    -->  Z4SS   E-                 
      4.46948677E-01    2     -1000024        12                       # EL-    -->  W1SS-  NUE                
      6.73783128E-04    2     -1000037        12                       # EL-    -->  W2SS-  NUE                
      2.65602476E-20    2           11   1000039                       # EL-    -->  E-     GVSS               
#         PDG         Width
DECAY   1000013  4.55970907E+00   # MUL-  decays
#          BR          NDA       ID1       ID2       ID3       ID4
      3.25149745E-01    2      1000022        13                       # MUL-   -->  Z1SS   MU-                
      2.26981357E-01    2      1000023        13                       # MUL-   -->  Z2SS   MU-                
      1.29370517E-06    2      1000025        13                       # MUL-   -->  Z3SS   MU-                
      2.45160365E-04    2      1000035        13                       # MUL-   -->  Z4SS   MU-                
      4.46948677E-01    2     -1000024        14                       # MUL-   -->  W1SS-  NUM                
      6.73783128E-04    2     -1000037        14                       # MUL-   -->  W2SS-  NUM                
      2.65602493E-20    2           13   1000039                       # MUL-   -->  MU-    GVSS               
#         PDG         Width
DECAY   1000015  0   # TAU1- decays
#          BR          NDA       ID1       ID2       ID3       ID4
      1.00000000E+00    2           15   1000039                       # TAU1-  -->  TAU-   GVSS               
#         PDG         Width
DECAY   1000012  4.44970465E+00   # NUEL  decays
#          BR          NDA       ID1       ID2       ID3       ID4
      3.34584266E-01    2      1000022        12                       # NUEL   -->  Z1SS   NUE                
      2.19546050E-01    2      1000023        12                       # NUEL   -->  Z2SS   NUE                
      5.84358941E-06    2      1000025        12                       # NUEL   -->  Z3SS   NUE                
      2.80341686E-04    2      1000035        12                       # NUEL   -->  Z4SS   NUE                
      4.45230275E-01    2      1000024        11                       # NUEL   -->  W1SS+  E-                 
      3.53220792E-04    2      1000037        11                       # NUEL   -->  W2SS+  E-                 
      2.64979587E-20    2           12   1000039                       # NUEL   -->  NUE    GVSS               
#         PDG         Width
DECAY   1000014  4.44970465E+00   # NUML  decays
#          BR          NDA       ID1       ID2       ID3       ID4
      3.34584266E-01    2      1000022        14                       # NUML   -->  Z1SS   NUM                
      2.19546050E-01    2      1000023        14                       # NUML   -->  Z2SS   NUM                
      5.84358941E-06    2      1000025        14                       # NUML   -->  Z3SS   NUM                
      2.80341686E-04    2      1000035        14                       # NUML   -->  Z4SS   NUM                
      4.45230275E-01    2      1000024        13                       # NUML   -->  W1SS+  MU-                
      3.53220210E-04    2      1000037        13                       # NUML   -->  W2SS+  MU-                
      2.64979587E-20    2           14   1000039                       # NUML   -->  NUM    GVSS               
#         PDG         Width
DECAY   1000016  9.13850594E+00   # NUTL  decays
#          BR          NDA       ID1       ID2       ID3       ID4
      1.56374559E-01    2      1000022        16                       # NUTL   -->  Z1SS   NUT                
      8.95666108E-02    2      1000023        16                       # NUTL   -->  Z2SS   NUT                
      6.05819423E-07    2      1000025        16                       # NUTL   -->  Z3SS   NUT                
      1.92087355E-05    2      1000035        16                       # NUTL   -->  Z4SS   NUT                
      1.85996145E-01    2      1000024        15                       # NUTL   -->  W1SS+  TAU-               
      6.63598941E-04    2      1000037        15                       # NUTL   -->  W2SS+  TAU-               
      5.67379296E-01    2           24   1000015                       # NUTL   -->  W+     TAU1-              
      1.15549861E-20    2           16   1000039                       # NUTL   -->  NUT    GVSS               
#         PDG         Width
DECAY   2000011  4.60504442E-01   # ER-   decays
#          BR          NDA       ID1       ID2       ID3       ID4
      1.00000000E+00    2      1000022        11                       # ER-    -->  Z1SS   E-                 
      2.01596531E-10    3      1000015        11       -15             # ER-    -->  TAU1-  E-     TAU+        
      2.41639098E-10    3     -1000015        11        15             # ER-    -->  TAU1+  E-     TAU-        
      1.94580663E-14    3      1000015        12       -16             # ER-    -->  TAU1-  NUE    ANUT        
      8.46420074E-21    2           11   1000039                       # ER-    -->  E-     GVSS               
#         PDG         Width
DECAY   2000013  4.60504353E-01   # MUR-  decays
#          BR          NDA       ID1       ID2       ID3       ID4
      1.00000000E+00    2      1000022        13                       # MUR-   -->  Z1SS   MU-                
      2.01596573E-10    3      1000015        13       -15             # MUR-   -->  TAU1-  MU-    TAU+        
      2.41639153E-10    3     -1000015        13        15             # MUR-   -->  TAU1+  MU-    TAU-        
      8.28271673E-10    3      1000015        14       -16             # MUR-   -->  TAU1-  NUM    ANUT        
      8.46420074E-21    2           13   1000039                       # MUR-   -->  MU-    GVSS               
#         PDG         Width
DECAY   2000015  9.87457848E+00   # TAU2- decays
#          BR          NDA       ID1       ID2       ID3       ID4
      1.44669682E-01    2      1000022        15                       # TAU2-  -->  Z1SS   TAU-               
      8.75099003E-02    2      1000023        15                       # TAU2-  -->  Z2SS   TAU-               
      9.47218388E-04    2      1000025        15                       # TAU2-  -->  Z3SS   TAU-               
      5.76416962E-04    2      1000035        15                       # TAU2-  -->  Z4SS   TAU-               
      1.67938307E-01    2     -1000024        16                       # TAU2-  -->  W1SS-  NUT                
      8.21803114E-05    2     -1000037        16                       # TAU2-  -->  W2SS-  NUT                
      2.68739551E-01    2           23   1000015                       # TAU2-  -->  Z0     TAU1-              
      3.29536736E-01    2           25   1000015                       # TAU2-  -->  HL0    TAU1-              
#         PDG         Width
DECAY   1000022  0   # Z1SS  decays
#          BR          NDA       ID1       ID2       ID3       ID4
      5.00000000E-01    2      1000015       -15                       # Z1SS   -->  TAU1-  TAU+               
      5.00000000E-01    2     -1000015        15                       # Z1SS   -->  TAU1+  TAU-               
      3.51235079E-19    2      1000039        22                       # Z1SS   -->  GVSS   GM                 
      8.23360395E-21    3      1000039        11       -11             # Z1SS   -->  GVSS   E-     E+          
      1.00163378E-19    2      1000039        23                       # Z1SS   -->  GVSS   Z0                 
      3.43729700E-23    2      1000039        25                       # Z1SS   -->  GVSS   HL0                
#         PDG         Width
DECAY   1000023  1.73874408E-01   # Z2SS  decays
#          BR          NDA       ID1       ID2       ID3       ID4
      6.11047312E-07    2      1000022        22                       # Z2SS   -->  Z1SS   GM                 
      1.43472189E-02    2      1000022        23                       # Z2SS   -->  Z1SS   Z0                 
      4.12857332E-07    3      1000022         2        -2             # Z2SS   -->  Z1SS   UP     UB          
      4.27513299E-07    3      1000022         1        -1             # Z2SS   -->  Z1SS   DN     DB          
      4.27513299E-07    3      1000022         3        -3             # Z2SS   -->  Z1SS   ST     SB          
      4.12856991E-07    3      1000022         4        -4             # Z2SS   -->  Z1SS   CH     CB          
      1.24158587E-05    3      1000022         5        -5             # Z2SS   -->  Z1SS   BT     BB          
      2.00736104E-04    3      1000022        11       -11             # Z2SS   -->  Z1SS   E-     E+          
      2.00736104E-04    3      1000022        13       -13             # Z2SS   -->  Z1SS   MU-    MU+         
      2.33717510E-04    3      1000022        15       -15             # Z2SS   -->  Z1SS   TAU-   TAU+        
      2.07323857E-04    3      1000022        12       -12             # Z2SS   -->  Z1SS   NUE    ANUE        
      2.07323857E-04    3      1000022        14       -14             # Z2SS   -->  Z1SS   NUM    ANUM        
      2.41072499E-04    3      1000022        16       -16             # Z2SS   -->  Z1SS   NUT    ANUT        
      1.62730798E-01    2      1000022        25                       # Z2SS   -->  Z1SS   HL0                
      4.18151991E-04    2      2000011       -11                       # Z2SS   -->  ER-    E+                 
      4.18151991E-04    2     -2000011        11                       # Z2SS   -->  ER+    E-                 
      4.18151991E-04    2      2000013       -13                       # Z2SS   -->  MUR-   MU+                
      4.18151991E-04    2     -2000013        13                       # Z2SS   -->  MUR+   MU-                
      4.09971863E-01    2      1000015       -15                       # Z2SS   -->  TAU1-  TAU+               
      4.09971863E-01    2     -1000015        15                       # Z2SS   -->  TAU1+  TAU-               
      4.80052427E-20    2      1000039        22                       # Z2SS   -->  GVSS   GM                 
      1.17638654E-21    3      1000039        11       -11             # Z2SS   -->  GVSS   E-     E+          
      1.51634679E-19    2      1000039        23                       # Z2SS   -->  GVSS   Z0                 
      1.23027798E-21    2      1000039        25                       # Z2SS   -->  GVSS   HL0                
#         PDG         Width
DECAY   1000025  8.06331921E+00   # Z3SS  decays
#          BR          NDA       ID1       ID2       ID3       ID4
      5.01015975E-08    2      1000022        22                       # Z3SS   -->  Z1SS   GM                 
      1.22827160E-07    2      1000023        22                       # Z3SS   -->  Z2SS   GM                 
      1.62476629E-01    2      1000024       -24                       # Z3SS   -->  W1SS+  W-                 
      1.62476629E-01    2     -1000024        24                       # Z3SS   -->  W1SS-  W+                 
      9.77818295E-02    2      1000022        23                       # Z3SS   -->  Z1SS   Z0                 
      1.64220333E-01    2      1000023        23                       # Z3SS   -->  Z2SS   Z0                 
      4.03568186E-11    3      1000022         2        -2             # Z3SS   -->  Z1SS   UP     UB          
      1.03392911E-11    3      1000022         1        -1             # Z3SS   -->  Z1SS   DN     DB          
      1.03392911E-11    3      1000022         3        -3             # Z3SS   -->  Z1SS   ST     SB          
      4.03568151E-11    3      1000022         4        -4             # Z3SS   -->  Z1SS   CH     CB          
      2.20803558E-05    3      1000022         5        -5             # Z3SS   -->  Z1SS   BT     BB          
      2.66394951E-09    3      1000022        11       -11             # Z3SS   -->  Z1SS   E-     E+          
      2.66394951E-09    3      1000022        13       -13             # Z3SS   -->  Z1SS   MU-    MU+         
      2.74531976E-05    3      1000022        15       -15             # Z3SS   -->  Z1SS   TAU-   TAU+        
      1.63691087E-08    3      1000022        12       -12             # Z3SS   -->  Z1SS   NUE    ANUE        
      1.63691087E-08    3      1000022        14       -14             # Z3SS   -->  Z1SS   NUM    ANUM        
      2.35976643E-08    3      1000022        16       -16             # Z3SS   -->  Z1SS   NUT    ANUT        
      8.31107102E-13    3      1000023         2        -2             # Z3SS   -->  Z2SS   UP     UB          
      1.42478553E-12    3      1000023         1        -1             # Z3SS   -->  Z2SS   DN     DB          
      1.42478553E-12    3      1000023         3        -3             # Z3SS   -->  Z2SS   ST     SB          
      8.31106451E-13    3      1000023         4        -4             # Z3SS   -->  Z2SS   CH     CB          
      3.35626680E-07    3      1000023         5        -5             # Z3SS   -->  Z2SS   BT     BB          
      1.73847284E-10    3      1000023        11       -11             # Z3SS   -->  Z2SS   E-     E+          
      1.73847284E-10    3      1000023        13       -13             # Z3SS   -->  Z2SS   MU-    MU+         
      4.08307733E-06    3      1000023        15       -15             # Z3SS   -->  Z2SS   TAU-   TAU+        
      1.08850751E-09    3      1000023        12       -12             # Z3SS   -->  Z2SS   NUE    ANUE        
      1.08850751E-09    3      1000023        14       -14             # Z3SS   -->  Z2SS   NUM    ANUM        
      2.07790674E-09    3      1000023        16       -16             # Z3SS   -->  Z2SS   NUT    ANUT        
      1.58494655E-02    2      1000022        25                       # Z3SS   -->  Z1SS   HL0                
      1.52647414E-03    2      1000023        25                       # Z3SS   -->  Z2SS   HL0                
      4.44672478E-05    2      2000011       -11                       # Z3SS   -->  ER-    E+                 
      4.44672478E-05    2     -2000011        11                       # Z3SS   -->  ER+    E-                 
      4.44672478E-05    2      2000013       -13                       # Z3SS   -->  MUR-   MU+                
      4.44672478E-05    2     -2000013        13                       # Z3SS   -->  MUR+   MU-                
      1.97718278E-01    2      1000015       -15                       # Z3SS   -->  TAU1-  TAU+               
      1.97718278E-01    2     -1000015        15                       # Z3SS   -->  TAU1+  TAU-               
      1.00107151E-25    2      1000039        22                       # Z3SS   -->  GVSS   GM                 
      2.48570726E-27    3      1000039        11       -11             # Z3SS   -->  GVSS   E-     E+          
      2.83607658E-21    2      1000039        23                       # Z3SS   -->  GVSS   Z0                 
      3.03748617E-21    2      1000039        25                       # Z3SS   -->  GVSS   HL0                
#         PDG         Width
DECAY   1000035  8.65720749E+00   # Z4SS  decays
#          BR          NDA       ID1       ID2       ID3       ID4
      2.76519678E-08    2      1000022        22                       # Z4SS   -->  Z1SS   GM                 
      3.10994892E-08    2      1000023        22                       # Z4SS   -->  Z2SS   GM                 
      1.18905380E-11    2      1000025        22                       # Z4SS   -->  Z3SS   GM                 
      1.75390780E-01    2      1000024       -24                       # Z4SS   -->  W1SS+  W-                 
      1.75390780E-01    2     -1000024        24                       # Z4SS   -->  W1SS-  W+                 
      1.46278311E-02    2      1000022        23                       # Z4SS   -->  Z1SS   Z0                 
      1.83540047E-03    2      1000023        23                       # Z4SS   -->  Z2SS   Z0                 
      1.92541005E-09    3      1000022         2        -2             # Z4SS   -->  Z1SS   UP     UB          
      1.70825920E-09    3      1000022         1        -1             # Z4SS   -->  Z1SS   DN     DB          
      1.70825920E-09    3      1000022         3        -3             # Z4SS   -->  Z1SS   ST     SB          
      1.92540894E-09    3      1000022         4        -4             # Z4SS   -->  Z1SS   CH     CB          
      1.97008576E-05    3      1000022         5        -5             # Z4SS   -->  Z1SS   BT     BB          
      1.16766410E-06    3      1000022        11       -11             # Z4SS   -->  Z1SS   E-     E+          
      1.16766410E-06    3      1000022        13       -13             # Z4SS   -->  Z1SS   MU-    MU+         
      3.05079648E-05    3      1000022        15       -15             # Z4SS   -->  Z1SS   TAU-   TAU+        
      1.86412979E-06    3      1000022        12       -12             # Z4SS   -->  Z1SS   NUE    ANUE        
      1.86412979E-06    3      1000022        14       -14             # Z4SS   -->  Z1SS   NUM    ANUM        
      2.56340581E-06    3      1000022        16       -16             # Z4SS   -->  Z1SS   NUT    ANUT        
      3.47570833E-10    3      1000023         2        -2             # Z4SS   -->  Z2SS   UP     UB          
      3.92956223E-10    3      1000023         1        -1             # Z4SS   -->  Z2SS   DN     DB          
      3.92956223E-10    3      1000023         3        -3             # Z4SS   -->  Z2SS   ST     SB          
      3.47570528E-10    3      1000023         4        -4             # Z4SS   -->  Z2SS   CH     CB          
      3.17760566E-07    3      1000023         5        -5             # Z4SS   -->  Z2SS   BT     BB          
      1.17792680E-07    3      1000023        11       -11             # Z4SS   -->  Z2SS   E-     E+          
      1.17792680E-07    3      1000023        13       -13             # Z4SS   -->  Z2SS   MU-    MU+         
      5.14260682E-06    3      1000023        15       -15             # Z4SS   -->  Z2SS   TAU-   TAU+        
      1.91298213E-07    3      1000023        12       -12             # Z4SS   -->  Z2SS   NUE    ANUE        
      1.91298213E-07    3      1000023        14       -14             # Z4SS   -->  Z2SS   NUM    ANUM        
      3.41925812E-07    3      1000023        16       -16             # Z4SS   -->  Z2SS   NUT    ANUT        
      8.53973114E-10    3      1000025         2        -2             # Z4SS   -->  Z3SS   UP     UB          
      1.10120901E-09    3      1000025         1        -1             # Z4SS   -->  Z3SS   DN     DB          
      1.10120901E-09    3      1000025         3        -3             # Z4SS   -->  Z3SS   ST     SB          
      8.53973114E-10    3      1000025         4        -4             # Z4SS   -->  Z3SS   CH     CB          
      2.49831461E-10    3      1000025        11       -11             # Z4SS   -->  Z3SS   E-     E+          
      2.49831461E-10    3      1000025        13       -13             # Z4SS   -->  Z3SS   MU-    MU+         
      1.71186412E-10    3      1000025        15       -15             # Z4SS   -->  Z3SS   TAU-   TAU+        
      4.96895414E-10    3      1000025        12       -12             # Z4SS   -->  Z3SS   NUE    ANUE        
      4.96895414E-10    3      1000025        14       -14             # Z4SS   -->  Z3SS   NUM    ANUM        
      4.96684860E-10    3      1000025        16       -16             # Z4SS   -->  Z3SS   NUT    ANUT        
      9.96564701E-02    2      1000022        25                       # Z4SS   -->  Z1SS   HL0                
      1.81466803E-01    2      1000023        25                       # Z4SS   -->  Z2SS   HL0                
      2.48936587E-04    2      2000011       -11                       # Z4SS   -->  ER-    E+                 
      2.48936587E-04    2     -2000011        11                       # Z4SS   -->  ER+    E-                 
      2.48936587E-04    2      2000013       -13                       # Z4SS   -->  MUR-   MU+                
      2.48936587E-04    2     -2000013        13                       # Z4SS   -->  MUR+   MU-                
      1.75285429E-01    2      1000015       -15                       # Z4SS   -->  TAU1-  TAU+               
      1.75285429E-01    2     -1000015        15                       # Z4SS   -->  TAU1+  TAU-               
      3.86309066E-23    2      1000039        22                       # Z4SS   -->  GVSS   GM                 
      9.59576322E-25    3      1000039        11       -11             # Z4SS   -->  GVSS   E-     E+          
      3.18569024E-21    2      1000039        23                       # Z4SS   -->  GVSS   Z0                 
      2.61216287E-21    2      1000039        25                       # Z4SS   -->  GVSS   HL0                
#         PDG         Width
DECAY   1000024  1.67215630E-01   # W1SS+ decays
#          BR          NDA       ID1       ID2       ID3       ID4
      8.77542277E-07    3      1000022         2        -1             # W1SS+  -->  Z1SS   UP     DB          
      8.77542107E-07    3      1000022         4        -3             # W1SS+  -->  Z1SS   CH     SB          
      4.26678016E-04    3      1000022       -11        12             # W1SS+  -->  Z1SS   E+     NUE         
      4.26678016E-04    3      1000022       -13        14             # W1SS+  -->  Z1SS   MU+    NUM         
      4.96523164E-04    3      1000022       -15        16             # W1SS+  -->  Z1SS   TAU+   NUT         
      1.74223140E-01    2      1000022        24                       # W1SS+  -->  Z1SS   W+                 
      5.12941902E-13    3      1000023       -11        12             # W1SS+  -->  Z2SS   E+     NUE         
      5.12941902E-13    3      1000023       -13        14             # W1SS+  -->  Z2SS   MU+    NUM         
      8.24425220E-01    2     -1000015        16                       # W1SS+  -->  TAU1+  NUT                
#         PDG         Width
DECAY   1000037  8.22306061E+00   # W2SS+ decays
#          BR          NDA       ID1       ID2       ID3       ID4
      3.13869020E-09    3      1000022         2        -1             # W2SS+  -->  Z1SS   UP     DB          
      3.13868953E-09    3      1000022         4        -3             # W2SS+  -->  Z1SS   CH     SB          
      3.02565059E-06    3      1000022       -11        12             # W2SS+  -->  Z1SS   E+     NUE         
      3.02565059E-06    3      1000022       -13        14             # W2SS+  -->  Z1SS   MU+    NUM         
      3.78117511E-05    3      1000022       -15        16             # W2SS+  -->  Z1SS   TAU+   NUT         
      1.05487838E-01    2      1000022        24                       # W2SS+  -->  Z1SS   W+                 
      2.62299488E-10    3      1000023         2        -1             # W2SS+  -->  Z2SS   UP     DB          
      2.62299432E-10    3      1000023         4        -3             # W2SS+  -->  Z2SS   CH     SB          
      1.33122299E-07    3      1000023       -11        12             # W2SS+  -->  Z2SS   E+     NUE         
      1.33122299E-07    3      1000023       -13        14             # W2SS+  -->  Z2SS   MU+    NUM         
      5.89599904E-06    3      1000023       -15        16             # W2SS+  -->  Z2SS   TAU+   NUT         
      1.63839146E-01    2      1000023        24                       # W2SS+  -->  Z2SS   W+                 
      4.92424945E-09    3      1000025         2        -1             # W2SS+  -->  Z3SS   UP     DB          
      4.92424945E-09    3      1000025         4        -3             # W2SS+  -->  Z3SS   CH     SB          
      1.64130898E-09    3      1000025       -11        12             # W2SS+  -->  Z3SS   E+     NUE         
      1.64130898E-09    3      1000025       -13        14             # W2SS+  -->  Z3SS   MU+    NUM         
      1.64258618E-09    3      1000025       -15        16             # W2SS+  -->  Z3SS   TAU+   NUT         
      1.33862258E-14    3      1000035       -11        12             # W2SS+  -->  Z4SS   E+     NUE         
      1.33862258E-14    3      1000035       -13        14             # W2SS+  -->  Z4SS   MU+    NUM         
      3.68695170E-01    2     -1000015        16                       # W2SS+  -->  TAU1+  NUT                
      1.67037874E-01    2      1000024        23                       # W2SS+  -->  W1SS+  Z0                 
      4.13342111E-10    3      1000024         1        -1             # W2SS+  -->  W1SS+  DN     DB          
      4.13341805E-10    3      1000024         3        -3             # W2SS+  -->  W1SS+  ST     SB          
      6.01092010E-10    3      1000024         2        -2             # W2SS+  -->  W1SS+  UP     UB          
      6.01092010E-10    3      1000024         4        -4             # W2SS+  -->  W1SS+  CH     CB          
      2.48776331E-07    3      1000024        12       -12             # W2SS+  -->  W1SS+  NUE    ANUE        
      2.48776331E-07    3      1000024        14       -14             # W2SS+  -->  W1SS+  NUM    ANUM        
      1.92900842E-07    3      1000024        11       -11             # W2SS+  -->  W1SS+  E-     E+          
      1.92900842E-07    3      1000024        13       -13             # W2SS+  -->  W1SS+  MU-    MU+         
      3.62208169E-07    3      1000024        15       -15             # W2SS+  -->  W1SS+  TAU-   TAU+        
      1.94888681E-01    2      1000024        25                       # W2SS+  -->  W1SS+  HL0                
#         PDG         Width
DECAY        25  4.62778099E-03   # HL0   decays
#          BR          NDA       ID1       ID2       ID3       ID4
      4.52688154E-09    2           11       -11                       # HL0    -->  E-     E+                 
      1.91132262E-04    2           13       -13                       # HL0    -->  MU-    MU+                
      5.46731763E-02    2           15       -15                       # HL0    -->  TAU-   TAU+               
      5.67706138E-06    2            1        -1                       # HL0    -->  DN     DB                 
      2.29381770E-03    2            3        -3                       # HL0    -->  ST     SB                 
      7.46146321E-01    2            5        -5                       # HL0    -->  BT     BB                 
      1.78991843E-06    2            2        -2                       # HL0    -->  UP     UB                 
      3.34138945E-02    2            4        -4                       # HL0    -->  CH     CB                 
      1.99778634E-03    2           22        22                       # HL0    -->  GM     GM                 
      4.14202325E-02    2           21        21                       # HL0    -->  GL     GL                 
      6.05475483E-03    3           24        11       -12             # HL0    -->  W+     E-     ANUE        
      6.05475483E-03    3           24        13       -14             # HL0    -->  W+     MU-    ANUM        
      6.05475483E-03    3           24        15       -16             # HL0    -->  W+     TAU-   ANUT        
      1.81642640E-02    3           24        -2         1             # HL0    -->  W+     UB     DN          
      1.81642640E-02    3           24        -4         3             # HL0    -->  W+     CB     ST          
      6.05475483E-03    3          -24       -11        12             # HL0    -->  W-     E+     NUE         
      6.05475483E-03    3          -24       -13        14             # HL0    -->  W-     MU+    NUM         
      6.05475483E-03    3          -24       -15        16             # HL0    -->  W-     TAU+   NUT         
      1.81642640E-02    3          -24         2        -1             # HL0    -->  W-     UP     DB          
      1.81642640E-02    3          -24         4        -3             # HL0    -->  W-     CH     SB          
      7.43440760E-04    3           23        12       -12             # HL0    -->  Z0     NUE    ANUE        
      7.43440760E-04    3           23        14       -14             # HL0    -->  Z0     NUM    ANUM        
      7.43440760E-04    3           23        16       -16             # HL0    -->  Z0     NUT    ANUT        
      3.74166266E-04    3           23        11       -11             # HL0    -->  Z0     E-     E+          
      3.74166266E-04    3           23        13       -13             # HL0    -->  Z0     MU-    MU+         
      3.74166266E-04    3           23        15       -15             # HL0    -->  Z0     TAU-   TAU+        
      1.28186191E-03    3           23         2        -2             # HL0    -->  Z0     UP     UB          
      1.28186191E-03    3           23         4        -4             # HL0    -->  Z0     CH     CB          
      1.65135402E-03    3           23         1        -1             # HL0    -->  Z0     DN     DB          
      1.65135402E-03    3           23         3        -3             # HL0    -->  Z0     ST     SB          
      1.65135402E-03    3           23         5        -5             # HL0    -->  Z0     BT     BB          
#         PDG         Width
DECAY        35  5.91528282E+01   # HH0   decays
#          BR          NDA       ID1       ID2       ID3       ID4
      1.21687806E-08    2           11       -11                       # HH0    -->  E-     E+                 
      5.13787847E-04    2           13       -13                       # HH0    -->  MU-    MU+                
      1.47155762E-01    2           15       -15                       # HH0    -->  TAU-   TAU+               
      1.48457402E-05    2            1        -1                       # HH0    -->  DN     DB                 
      5.99842984E-03    2            3        -3                       # HH0    -->  ST     SB                 
      8.45783412E-01    2            5        -5                       # HH0    -->  BT     BB                 
      7.71300070E-13    2            2        -2                       # HH0    -->  UP     UB                 
      1.02313855E-08    2            4        -4                       # HH0    -->  CH     CB                 
      5.17734967E-04    2            6        -6                       # HH0    -->  TP     TB                 
      5.64111113E-09    2           22        22                       # HH0    -->  GM     GM                 
      9.51092034E-07    2           21        21                       # HH0    -->  GL     GL                 
      5.76306661E-07    2           24       -24                       # HH0    -->  W+     W-                 
      2.94673129E-07    2           23        23                       # HH0    -->  Z0     Z0                 
      1.22664023E-05    2      1000022   1000022                       # HH0    -->  Z1SS   Z1SS               
      1.48271909E-06    2           25        25                       # HH0    -->  HL0    HL0                
      4.04506011E-07    2      1000015  -1000015                       # HH0    -->  TAU1-  TAU1+              
#         PDG         Width
DECAY        36  5.87720070E+01   # HA0   decays
#          BR          NDA       ID1       ID2       ID3       ID4
      1.21676038E-08    2           11       -11                       # HA0    -->  E-     E+                 
      5.13738138E-04    2           13       -13                       # HA0    -->  MU-    MU+                
      1.47142157E-01    2           15       -15                       # HA0    -->  TAU-   TAU+               
      1.48450326E-05    2            1        -1                       # HA0    -->  DN     DB                 
      5.99814486E-03    2            3        -3                       # HA0    -->  ST     SB                 
      8.45755816E-01    2            5        -5                       # HA0    -->  BT     BB                 
      7.59988210E-13    2            2        -2                       # HA0    -->  UP     UB                 
      1.00887485E-08    2            4        -4                       # HA0    -->  CH     CB                 
      5.28012111E-04    2            6        -6                       # HA0    -->  TP     TB                 
      1.88267624E-08    2           22        22                       # HA0    -->  GM     GM                 
      5.57419617E-06    2           21        21                       # HA0    -->  GL     GL                 
      4.11160800E-05    2      1000022   1000022                       # HA0    -->  Z1SS   Z1SS               
      5.69881252E-07    2           25        23                       # HA0    -->  HL0    Z0                 
#         PDG         Width
DECAY        37  5.43870583E+01   # H+    decays
#          BR          NDA       ID1       ID2       ID3       ID4
      1.32536524E-08    2           12       -11                       # H+     -->  NUE    E+                 
      5.59593085E-04    2           14       -13                       # H+     -->  NUM    MU+                
      1.60275698E-01    2           16       -15                       # H+     -->  NUT    TAU+               
      1.49240077E-05    2            2        -1                       # H+     -->  UP     DB                 
      6.03005616E-03    2            4        -3                       # H+     -->  CH     SB                 
      8.33119094E-01    2            6        -5                       # H+     -->  TP     BB                 
      6.23951166E-07    2           25        24                       # H+     -->  HL0    W+                 
