#
#                              ======================
#                              | THE SUSYHIT OUTPUT |
#                              ======================
#
#
#              ------------------------------------------------------
#              |     This is the output of the SUSY-HIT package     |
#              |  created by A.Djouadi, M.Muehlleitner and M.Spira. |
#              |  In case of problems with SUSY-HIT email to        |
#              |           margarete.muehlleitner@cern.ch           |
#              |           michael.spira@psi.ch                     |
#              |           abdelhak.djouadi@cern.ch                 |
#              ------------------------------------------------------
#
#              ------------------------------------------------------
#              |  SUSY Les Houches Accord - MSSM Spectrum + Decays  |
#              |              based on the decay programs           |
#              |                                                    |
#              |                     SDECAY 1.3b                    |
#              |                                                    |
#              |  Authors: M.Muhlleitner, A.Djouadi and Y.Mambrini  |
#              |  Ref.:    Comput.Phys.Commun.168(2005)46           |
#              |           [hep-ph/0311167]                         |
#              |                                                    |
#              |                     HDECAY 3.4                     |
#              |                                                    |
#              |  By: A.Djouadi,J.Kalinowski,M.Muhlleitner,M.Spira  |
#              |  Ref.:    Comput.Phys.Commun.108(1998)56           |
#              |           [hep-ph/9704448]                         |
#              |                                                    |
#              |                                                    |
#              |  If not stated otherwise all DRbar couplings and   |
#              |  soft SUSY breaking masses are given at the scale  |
#              |  Q=  0.91187600E+02
#              |                                                    |
#              ------------------------------------------------------
#
#
BLOCK DCINFO  # Decay Program information
     1   SDECAY/HDECAY # decay calculator
     2   1.3b  /3.4    # version number
#
BLOCK SPINFO  # Spectrum calculator information
     1   SuSpect     # RGE +Spectrum calculator            
     2   2.41         # version number                     
#
BLOCK MODSEL  # Model selection
     1     0   # #general MSSM low scale                           
#
BLOCK SMINPUTS  # Standard Model inputs
         1     1.27934000E+02   # alpha_em^-1(M_Z)^MSbar
         2     1.16639000E-05   # G_F [GeV^-2]
         3     1.17200000E-01   # alpha_S(M_Z)^MSbar
         4     9.11870000E+01   # M_Z pole mass
         5     4.25000000E+00   # mb(mb)^MSbar
         6     1.72500000E+02   # mt pole mass
         7     1.77700000E+00   # mtau pole mass
#
BLOCK MINPAR  # Input parameters - minimal models
#
BLOCK EXTPAR  # Input parameters - non-minimal models
         0     9.11876000E+01   # EWSB                
         1     5.00000000E+03   # M_1                 
         2     7.39845000E+02   # M_2                 
         3     5.68366000E+03   # M_3                 
        11     0.00000000E+00   # A_t                 
        12     0.00000000E+00   # A_b                 
        13     0.00000000E+00   # A_tau               
        14     0.00000000E+00   # A_u                 
        15     0.00000000E+00   # A_d                 
        16     0.00000000E+00   # A_e                 
        23     5.00000000E+03   # mu(EWSB)            
        25     1.50000000E+00   # tanbeta(in)         
        26     2.00000000E+03   # MA_pole             
        31     5.00000000E+03   # M_eL                
        32     5.00000000E+03   # M_muL               
        33     5.00000000E+03   # M_tauL              
        34     5.00000000E+03   # M_eR                
        35     5.00000000E+03   # M_muR               
        36     5.00000000E+03   # M_tauR              
        41     5.00000000E+03   # M_q1L               
        42     5.00000000E+03   # M_q2L               
        43     5.00000000E+03   # M_q3L               
        44     5.00000000E+03   # M_uR                
        45     5.00000000E+03   # M_cR                
        46     5.00000000E+03   # M_tR                
        47     5.00000000E+03   # M_dR                
        48     5.00000000E+03   # M_sR                
        49     5.00000000E+03   # M_bR                
#
BLOCK MASS  # Mass Spectrum
# PDG code           mass       particle
        24     8.05304754E+01   # W+
        25     1.25000000E+02   # h
        35     2.00388912E+03   # H
        36     2.00000000E+03   # A
        37     1.99327950E+03   # H+
         5     4.87877839E+00   # b-quark pole mass calculated from mb(mb)_Msbar
   1000001     4.14521242E+03   # ~d_L
   2000001     4.14507925E+03   # ~d_R
   1000002     4.14491489E+03   # ~u_L
   2000002     4.14498570E+03   # ~u_R
   1000003     4.14521242E+03   # ~s_L
   2000003     4.14507925E+03   # ~s_R
   1000004     4.14491489E+03   # ~c_L
   2000004     4.14498570E+03   # ~c_R
   1000005     4.14269707E+03   # ~b_1
   2000005     4.14759481E+03   # ~b_2
   1000006     4.18049546E+03   # ~t_1
   2000006     4.36981705E+03   # ~t_2
   1000011     5.00008303E+03   # ~e_L
   2000011     5.00007616E+03   # ~e_R
   1000012     4.99984081E+03   # ~nu_eL
   1000013     5.00008303E+03   # ~mu_L
   2000013     5.00007616E+03   # ~mu_R
   1000014     4.99984081E+03   # ~nu_muL
   1000015     4.99874639E+03   # ~tau_1
   2000015     5.00141308E+03   # ~tau_2
   1000016     4.99984081E+03   # ~nu_tauL
   1000021     4.99999215E+03   # ~g
   1000022     8.00000253E+02   # ~chi_10
   1000023     5.19849560E+03   # ~chi_20
   1000025    -5.21674276E+03   # ~chi_30
   1000035     5.31520844E+03   # ~chi_40
   1000024     8.00000380E+02   # ~chi_1+
   1000037     5.21810476E+03   # ~chi_2+
 1000039     1.E-09   # ~gravitino              
#
BLOCK NMIX  # Neutralino Mixing Matrix
  1  1     1.65763123E-04   # N_11
  1  2    -9.99841644E-01   # N_12
  1  3     1.42772020E-02   # N_13
  1  4    -1.06216823E-02   # N_14
  2  1     4.09472322E-01   # N_21
  2  2     1.61312476E-02   # N_22
  2  3     6.45233986E-01   # N_23
  2  4    -6.44783145E-01   # N_24
  3  1     8.29724035E-04   # N_31
  3  2    -2.58470476E-03   # N_32
  3  3    -7.07088101E-01   # N_33
  3  4    -7.07120250E-01   # N_34
  4  1     9.12322148E-01   # N_41
  4  2    -7.05607984E-03   # N_42
  4  3    -2.88956195E-01   # N_43
  4  4     2.90039354E-01   # N_44
#
BLOCK UMIX  # Chargino Mixing Matrix U
  1  1    -9.99796194E-01   # U_11
  1  2     2.01883889E-02   # U_12
  2  1     2.01883889E-02   # U_21
  2  2     9.99796194E-01   # U_22
#
BLOCK VMIX  # Chargino Mixing Matrix V
  1  1    -9.99887188E-01   # V_11
  1  2     1.50203599E-02   # V_12
  2  1     1.50203599E-02   # V_21
  2  2     9.99887188E-01   # V_22
#
BLOCK STOPMIX  # Stop Mixing Matrix
  1  1     9.92496250E-01   # cos(theta_t)
  1  2     1.22275074E-01   # sin(theta_t)
  2  1    -1.22275074E-01   # -sin(theta_t)
  2  2     9.92496250E-01   # cos(theta_t)
#
BLOCK SBOTMIX  # Sbottom Mixing Matrix
  1  1     6.97427317E-01   # cos(theta_b)
  1  2     7.16655522E-01   # sin(theta_b)
  2  1    -7.16655522E-01   # -sin(theta_b)
  2  2     6.97427317E-01   # cos(theta_b)
#
BLOCK STAUMIX  # Stau Mixing Matrix
  1  1     7.06195942E-01   # cos(theta_tau)
  1  2     7.08016449E-01   # sin(theta_tau)
  2  1    -7.08016449E-01   # -sin(theta_tau)
  2  2     7.06195942E-01   # cos(theta_tau)
#
BLOCK ALPHA  # Higgs mixing
          -5.90318615E-01   # Mixing angle in the neutral Higgs boson sector
#
BLOCK HMIX Q=  9.11876000E+01  # DRbar Higgs Parameters
         1     5.00000000E+03   # mu(Q)               
         2     1.49999981E+00   # tanbeta(Q)          
         3     2.52295682E+02   # vev(Q)              
         4     3.10023378E+06   # MA^2(Q)             
#
BLOCK GAUGE Q=  9.11876000E+01  # The gauge couplings
     1     3.52528091E-01   # gprime(Q) DRbar
     2     6.28676975E-01   # g(Q) DRbar
     3     1.06418838E+00   # g3(Q) DRbar
#
BLOCK AU Q=  9.11876000E+01  # The trilinear couplings
  1  1     0.00000000E+00   # A_u(Q) DRbar
  2  2     0.00000000E+00   # A_c(Q) DRbar
  3  3     0.00000000E+00   # A_t(Q) DRbar
#
BLOCK AD Q=  9.11876000E+01  # The trilinear couplings
  1  1     0.00000000E+00   # A_d(Q) DRbar
  2  2     0.00000000E+00   # A_s(Q) DRbar
  3  3     0.00000000E+00   # A_b(Q) DRbar
#
BLOCK AE Q=  9.11876000E+01  # The trilinear couplings
  1  1     0.00000000E+00   # A_e(Q) DRbar
  2  2     0.00000000E+00   # A_mu(Q) DRbar
  3  3     0.00000000E+00   # A_tau(Q) DRbar
#
BLOCK Yu Q=  9.11876000E+01  # The Yukawa couplings
  1  1     0.00000000E+00   # y_u(Q) DRbar
  2  2     0.00000000E+00   # y_c(Q) DRbar
  3  3     1.01446667E+00   # y_t(Q) DRbar
#
BLOCK Yd Q=  9.11876000E+01  # The Yukawa couplings
  1  1     0.00000000E+00   # y_d(Q) DRbar
  2  2     0.00000000E+00   # y_s(Q) DRbar
  3  3     2.68339312E-02   # y_b(Q) DRbar
#
BLOCK Ye Q=  9.11876000E+01  # The Yukawa couplings
  1  1     0.00000000E+00   # y_e(Q) DRbar
  2  2     0.00000000E+00   # y_mu(Q) DRbar
  3  3     1.79537881E-02   # y_tau(Q) DRbar
#
BLOCK MSOFT Q=  9.11876000E+01  # The soft SUSY breaking masses at the scale Q
         1     5.00000000E+03   # M_1                 
         2     7.39845000E+02   # M_2                 
         3     5.68366000E+03   # M_3                 
        14     0.00000000E+00   # A_u                 
        15     0.00000000E+00   # A_d                 
        16     0.00000000E+00   # A_e                 
        21    -2.44011464E+07   # M^2_Hd              
        22    -2.88429536E+07   # M^2_Hu              
        31     5.00000000E+03   # M_eL                
        32     5.00000000E+03   # M_muL               
        33     5.00000000E+03   # M_tauL              
        34     5.00000000E+03   # M_eR                
        35     5.00000000E+03   # M_muR               
        36     5.00000000E+03   # M_tauR              
        41     5.00000000E+03   # M_q1L               
        42     5.00000000E+03   # M_q2L               
        43     5.00000000E+03   # M_q3L               
        44     5.00000000E+03   # M_uR                
        45     5.00000000E+03   # M_cR                
        46     5.00000000E+03   # M_tR                
        47     5.00000000E+03   # M_dR                
        48     5.00000000E+03   # M_sR                
        49     5.00000000E+03   # M_bR                
#
#
#
#                             =================
#                             |The decay table|
#                             =================
#
# - The QCD corrections to the decays gluino -> squark  + quark
#                                     squark -> gaugino + quark_prime
#                                     squark -> squark_prime + Higgs
#                                     squark -> gluino  + quark
#   are included.
#
# - The multi-body decays for the inos, stops and sbottoms are included.
#
# - The loop induced decays for the gluino, neutralinos and stops
#   are included.
#
# - The SUSY decays of the top quark are included.
#
# - Possible decays of the NLSP in GMSB models are included.
#
#
#         PDG            Width
DECAY         6     1.36637203E+00   # top decays
#          BR         NDA      ID1       ID2
     1.00000000E+00    2           5        24   # BR(t ->  b    W+)
#
#         PDG            Width
DECAY   1000021     6.15722431E+01   # gluino decays
#          BR         NDA      ID1       ID2
     4.34628062E-02    2     1000001        -1   # BR(~g -> ~d_L  db)
     4.34628062E-02    2    -1000001         1   # BR(~g -> ~d_L* d )
     4.34750837E-02    2     2000001        -1   # BR(~g -> ~d_R  db)
     4.34750837E-02    2    -2000001         1   # BR(~g -> ~d_R* d )
     4.34902384E-02    2     1000002        -2   # BR(~g -> ~u_L  ub)
     4.34902384E-02    2    -1000002         2   # BR(~g -> ~u_L* u )
     4.34837092E-02    2     2000002        -2   # BR(~g -> ~u_R  ub)
     4.34837092E-02    2    -2000002         2   # BR(~g -> ~u_R* u )
     4.34628062E-02    2     1000003        -3   # BR(~g -> ~s_L  sb)
     4.34628062E-02    2    -1000003         3   # BR(~g -> ~s_L* s )
     4.34750837E-02    2     2000003        -3   # BR(~g -> ~s_R  sb)
     4.34750837E-02    2    -2000003         3   # BR(~g -> ~s_R* s )
     4.34902384E-02    2     1000004        -4   # BR(~g -> ~c_L  cb)
     4.34902384E-02    2    -1000004         4   # BR(~g -> ~c_L* c )
     4.34837092E-02    2     2000004        -4   # BR(~g -> ~c_R  cb)
     4.34837092E-02    2    -2000004         4   # BR(~g -> ~c_R* c )
     4.35807845E-02    2     1000005        -5   # BR(~g -> ~b_1  bb)
     4.35807845E-02    2    -1000005         5   # BR(~g -> ~b_1* b )
     4.33578018E-02    2     2000005        -5   # BR(~g -> ~b_2  bb)
     4.33578018E-02    2    -2000005         5   # BR(~g -> ~b_2* b )
     4.32334584E-02    2     1000006        -6   # BR(~g -> ~t_1  tb)
     4.32334584E-02    2    -1000006         6   # BR(~g -> ~t_1* t )
     2.19750662E-02    2     2000006        -6   # BR(~g -> ~t_2  tb)
     2.19750662E-02    2    -2000006         6   # BR(~g -> ~t_2* t )
     5.84282216E-05    2     1000039        21   # BR(~g -> ~G g)
#
#         PDG            Width
DECAY   1000006     4.57740698E+01   # stop1 decays
#          BR         NDA      ID1       ID2
     3.32702821E-01    2     1000022         6   # BR(~t_1 -> ~chi_10 t )
     6.67297179E-01    2     1000024         5   # BR(~t_1 -> ~chi_1+ b )
#
#         PDG            Width
DECAY   2000006    -3.40572813E-01   # stop2 decays
#          BR         NDA      ID1       ID2
     8.58964575E-01    2     1000022         6   # BR(~t_2 -> ~chi_10 t )
     1.72523188E+00    2     1000024         5   # BR(~t_2 -> ~chi_1+ b )
    -4.21432992E-01    2     1000006        25   # BR(~t_2 -> ~t_1    h )
    -2.72674409E-01    2     1000006        23   # BR(~t_2 -> ~t_1    Z )
    -4.49718844E-01    2     1000005        24   # BR(~t_2 -> ~b_1    W+)
    -4.40370214E-01    2     2000005        24   # BR(~t_2 -> ~b_2    W+)
#
#         PDG            Width
DECAY   1000005     2.13739258E+01   # sbottom1 decays
#          BR         NDA      ID1       ID2
     3.33967990E-01    2     1000022         5   # BR(~b_1 -> ~chi_10 b )
     6.66032010E-01    2    -1000024         6   # BR(~b_1 -> ~chi_1- t )
#
#         PDG            Width
DECAY   2000005     2.30955164E+01   # sbottom2 decays
#          BR         NDA      ID1       ID2
     3.33972776E-01    2     1000022         5   # BR(~b_2 -> ~chi_10 b )
     6.66027224E-01    2    -1000024         6   # BR(~b_2 -> ~chi_1- t )
#
#         PDG            Width
DECAY   1000002     4.50079315E+01   # sup_L decays
#          BR         NDA      ID1       ID2
     3.33299322E-01    2     1000022         2   # BR(~u_L -> ~chi_10 u)
     6.66700678E-01    2     1000024         1   # BR(~u_L -> ~chi_1+ d)
#
#         PDG            Width
DECAY   2000002     2.30505574E-07   # sup_R decays
#          BR         NDA      ID1       ID2
     1.00000000E+00    2     1000022         2   # BR(~u_R -> ~chi_10 u)
#
#         PDG            Width
DECAY   1000001     4.50077315E+01   # sdown_L decays
#          BR         NDA      ID1       ID2
     3.33367315E-01    2     1000022         1   # BR(~d_L -> ~chi_10 d)
     6.66632685E-01    2    -1000024         2   # BR(~d_L -> ~chi_1- u)
#
#         PDG            Width
DECAY   2000001     5.76277631E-08   # sdown_R decays
#          BR         NDA      ID1       ID2
     1.00000000E+00    2     1000022         1   # BR(~d_R -> ~chi_10 d)
#
#         PDG            Width
DECAY   1000004     4.50079315E+01   # scharm_L decays
#          BR         NDA      ID1       ID2
     3.33299322E-01    2     1000022         4   # BR(~c_L -> ~chi_10 c)
     6.66700678E-01    2     1000024         3   # BR(~c_L -> ~chi_1+ s)
#
#         PDG            Width
DECAY   2000004     2.30505574E-07   # scharm_R decays
#          BR         NDA      ID1       ID2
     1.00000000E+00    2     1000022         4   # BR(~c_R -> ~chi_10 c)
#
#         PDG            Width
DECAY   1000003     4.50077315E+01   # sstrange_L decays
#          BR         NDA      ID1       ID2
     3.33367315E-01    2     1000022         3   # BR(~s_L -> ~chi_10 s)
     6.66632685E-01    2    -1000024         4   # BR(~s_L -> ~chi_1- c)
#
#         PDG            Width
DECAY   2000003     5.76277631E-08   # sstrange_R decays
#          BR         NDA      ID1       ID2
     1.00000000E+00    2     1000022         3   # BR(~s_R -> ~chi_10 s)
#
#         PDG            Width
DECAY   1000011     5.59677981E+01   # selectron_L decays
#          BR         NDA      ID1       ID2
     3.33312221E-01    2     1000022        11   # BR(~e_L -> ~chi_10 e-)
     6.66687779E-01    2    -1000024        12   # BR(~e_L -> ~chi_1- nu_e)
#
#         PDG            Width
DECAY   2000011     6.45023133E-07   # selectron_R decays
#          BR         NDA      ID1       ID2
     1.00000000E+00    2     1000022        11   # BR(~e_R -> ~chi_10 e-)
#
#         PDG            Width
DECAY   1000013     5.59677981E+01   # smuon_L decays
#          BR         NDA      ID1       ID2
     3.33312221E-01    2     1000022        13   # BR(~mu_L -> ~chi_10 mu-)
     6.66687779E-01    2    -1000024        14   # BR(~mu_L -> ~chi_1- nu_mu)
#
#         PDG            Width
DECAY   2000013     6.45023133E-07   # smuon_R decays
#          BR         NDA      ID1       ID2
     1.00000000E+00    2     1000022        13   # BR(~mu_R -> ~chi_10 mu-)
#
#         PDG            Width
DECAY   1000015     2.79394770E+01   # stau_1 decays
#          BR         NDA      ID1       ID2
     3.33269430E-01    2     1000022        15   # BR(~tau_1 -> ~chi_10  tau-)
     6.66601960E-01    2    -1000024        16   # BR(~tau_1 -> ~chi_1-  nu_tau)
     1.28609678E-04    2     1000039        15   # BR(~tau_1 -> ~G       tau-)
#
#         PDG            Width
DECAY   2000015     2.80319149E+01   # stau_2 decays
#          BR         NDA      ID1       ID2
     3.33312130E-01    2     1000022        15   # BR(~tau_2 -> ~chi_10  tau-)
     6.66687870E-01    2    -1000024        16   # BR(~tau_2 -> ~chi_1-  nu_tau)
#
#         PDG            Width
DECAY   1000012     5.59785317E+01   # snu_eL decays
#          BR         NDA      ID1       ID2
     3.33354409E-01    2     1000022        12   # BR(~nu_eL -> ~chi_10 nu_e)
     6.66645591E-01    2     1000024        11   # BR(~nu_eL -> ~chi_1+ e-)
#
#         PDG            Width
DECAY   1000014     5.59785317E+01   # snu_muL decays
#          BR         NDA      ID1       ID2
     3.33354409E-01    2     1000022        14   # BR(~nu_muL -> ~chi_10 nu_mu)
     6.66645591E-01    2     1000024        13   # BR(~nu_muL -> ~chi_1+ mu-)
#
#         PDG            Width
DECAY   1000016     5.59785292E+01   # snu_tauL decays
#          BR         NDA      ID1       ID2
     3.33354424E-01    2     1000022        16   # BR(~nu_tauL -> ~chi_10 nu_tau)
     6.66645576E-01    2     1000024        15   # BR(~nu_tauL -> ~chi_1+ tau-)
#
#         PDG            Width
DECAY   1000024     2.06673957E-8   # chargino1+ decays               
#          BR         NDA      ID1       ID2
     1.00000000E+00    2     1000039        24   # BR(~chi_1+ -> ~G       W+)
#           BR         NDA      ID1       ID2       ID3
     1.34820661E-25    3     1000022         2        -1   # BR(~chi_1+ -> ~chi_10 u    db)
     1.34820661E-25    3     1000022         4        -3   # BR(~chi_1+ -> ~chi_10 c    sb)
     4.49345677E-26    3     1000022       -11        12   # BR(~chi_1+ -> ~chi_10 e+   nu_e)
     4.49345677E-26    3     1000022       -13        14   # BR(~chi_1+ -> ~chi_10 mu+  nu_mu)
#
#         PDG            Width
DECAY   1000037     8.95831944E+01   # chargino2+ decays
#          BR         NDA      ID1       ID2
     2.41308031E-05    2     1000002        -1   # BR(~chi_2+ -> ~u_L     db)
     4.35737221E-05    2    -1000001         2   # BR(~chi_2+ -> ~d_L*    u )
     2.41308031E-05    2     1000004        -3   # BR(~chi_2+ -> ~c_L     sb)
     4.35737221E-05    2    -1000003         4   # BR(~chi_2+ -> ~s_L*    c )
    -4.48476071E-03    2     1000006        -5   # BR(~chi_2+ -> ~t_1     bb)
     1.65005736E-01    2     2000006        -5   # BR(~chi_2+ -> ~t_2     bb)
     1.16322876E-01    2    -1000005         6   # BR(~chi_2+ -> ~b_1*    t )
     1.22995732E-01    2    -2000005         6   # BR(~chi_2+ -> ~b_2*    t )
     3.46597693E-07    2     1000012       -11   # BR(~chi_2+ -> ~nu_eL   e+  )
     3.46597693E-07    2     1000014       -13   # BR(~chi_2+ -> ~nu_muL  mu+ )
     1.58799577E-06    2     1000016       -15   # BR(~chi_2+ -> ~nu_tau1 tau+)
     6.24776156E-07    2    -1000011        12   # BR(~chi_2+ -> ~e_L+    nu_e)
     6.24776156E-07    2    -1000013        14   # BR(~chi_2+ -> ~mu_L+   nu_mu)
     5.50793381E-08    2    -1000015        16   # BR(~chi_2+ -> ~tau_1+  nu_tau)
     1.79836790E-06    2    -2000015        16   # BR(~chi_2+ -> ~tau_2+  nu_tau)
     1.45188377E-01    2     1000024        23   # BR(~chi_2+ -> ~chi_1+  Z )
     1.41610280E-01    2     1000022        24   # BR(~chi_2+ -> ~chi_10  W+)
     1.45808690E-01    2     1000024        25   # BR(~chi_2+ -> ~chi_1+  h )
     5.56585952E-02    2     1000024        35   # BR(~chi_2+ -> ~chi_1+  H )
     5.57474291E-02    2     1000024        36   # BR(~chi_2+ -> ~chi_1+  A )
     5.59681859E-02    2     1000022        37   # BR(~chi_2+ -> ~chi_10  H+)
     2.48444080E-05    2     1000039        24   # BR(~chi_2+ -> ~G       W+)
     1.32227423E-05    2     1000039        37   # BR(~chi_2+ -> ~G       H+)
#
#         PDG            Width
DECAY   1000022     2.06657872E-8   # neutralino1 decays              
#          BR         NDA      ID1       ID2
     2.48687014E-01    2     1000039        22   # BR(~chi_10 -> ~G        gam)
     7.51312624E-01    2     1000039        23   # BR(~chi_10 -> ~G        Z)
     3.62519965E-07    2     1000039        25   # BR(~chi_10 -> ~G        h)
#
#         PDG            Width
DECAY   1000023     7.68358480E+01   # neutralino2 decays
#          BR         NDA      ID1       ID2
     2.95423659E-03    2     1000022        23   # BR(~chi_20 -> ~chi_10   Z )
     1.38171618E-01    2     1000024       -24   # BR(~chi_20 -> ~chi_1+   W-)
     1.38171618E-01    2    -1000024        24   # BR(~chi_20 -> ~chi_1-   W+)
     1.39367251E-01    2     1000022        25   # BR(~chi_20 -> ~chi_10   h )
     4.10098658E-03    2     1000022        35   # BR(~chi_20 -> ~chi_10   H )
     4.99567133E-02    2     1000022        36   # BR(~chi_20 -> ~chi_10   A )
     5.43802363E-02    2     1000024       -37   # BR(~chi_20 -> ~chi_1+   H-)
     5.43802363E-02    2    -1000024        37   # BR(~chi_20 -> ~chi_1-   H+)
     5.88024036E-04    2     1000002        -2   # BR(~chi_20 -> ~u_L      ub)
     5.88024036E-04    2    -1000002         2   # BR(~chi_20 -> ~u_L*     u )
     6.41732062E-03    2     2000002        -2   # BR(~chi_20 -> ~u_R      ub)
     6.41732062E-03    2    -2000002         2   # BR(~chi_20 -> ~u_R*     u )
     2.49754423E-04    2     1000001        -1   # BR(~chi_20 -> ~d_L      db)
     2.49754423E-04    2    -1000001         1   # BR(~chi_20 -> ~d_L*     d )
     1.60412708E-03    2     2000001        -1   # BR(~chi_20 -> ~d_R      db)
     1.60412708E-03    2    -2000001         1   # BR(~chi_20 -> ~d_R*     d )
     5.88024036E-04    2     1000004        -4   # BR(~chi_20 -> ~c_L      cb)
     5.88024036E-04    2    -1000004         4   # BR(~chi_20 -> ~c_L*     c )
     6.41732062E-03    2     2000004        -4   # BR(~chi_20 -> ~c_R      cb)
     6.41732062E-03    2    -2000004         4   # BR(~chi_20 -> ~c_R*     c )
     2.49754423E-04    2     1000003        -3   # BR(~chi_20 -> ~s_L      sb)
     2.49754423E-04    2    -1000003         3   # BR(~chi_20 -> ~s_L*     s )
     1.60412708E-03    2     2000003        -3   # BR(~chi_20 -> ~s_R      sb)
     1.60412708E-03    2    -2000003         3   # BR(~chi_20 -> ~s_R*     s )
     1.03137812E-01    2     1000006        -6   # BR(~chi_20 -> ~t_1      tb)
     1.03137812E-01    2    -1000006         6   # BR(~chi_20 -> ~t_1*     t )
     8.76497308E-02    2     2000006        -6   # BR(~chi_20 -> ~t_2      tb)
     8.76497308E-02    2    -2000006         6   # BR(~chi_20 -> ~t_2*     t )
     1.55084927E-03    2     1000005        -5   # BR(~chi_20 -> ~b_1      bb)
     1.55084927E-03    2    -1000005         5   # BR(~chi_20 -> ~b_1*     b )
     4.78982612E-04    2     2000005        -5   # BR(~chi_20 -> ~b_2      bb)
     4.78982612E-04    2    -2000005         5   # BR(~chi_20 -> ~b_2*     b )
     4.50279491E-05    2     1000011       -11   # BR(~chi_20 -> ~e_L-     e+)
     4.50279491E-05    2    -1000011        11   # BR(~chi_20 -> ~e_L+     e-)
     1.57252340E-04    2     2000011       -11   # BR(~chi_20 -> ~e_R-     e+)
     1.57252340E-04    2    -2000011        11   # BR(~chi_20 -> ~e_R+     e-)
     4.50279491E-05    2     1000013       -13   # BR(~chi_20 -> ~mu_L-    mu+)
     4.50279491E-05    2    -1000013        13   # BR(~chi_20 -> ~mu_L+    mu-)
     1.57252340E-04    2     2000013       -13   # BR(~chi_20 -> ~mu_R-    mu+)
     1.57252340E-04    2    -2000013        13   # BR(~chi_20 -> ~mu_R+    mu-)
     1.06603273E-04    2     1000015       -15   # BR(~chi_20 -> ~tau_1-   tau+)
     1.06603273E-04    2    -1000015        15   # BR(~chi_20 -> ~tau_1+   tau-)
     9.68651060E-05    2     2000015       -15   # BR(~chi_20 -> ~tau_2-   tau+)
     9.68651060E-05    2    -2000015        15   # BR(~chi_20 -> ~tau_2+   tau-)
     3.40623360E-05    2     1000012       -12   # BR(~chi_20 -> ~nu_eL    nu_eb)
     3.40623360E-05    2    -1000012        12   # BR(~chi_20 -> ~nu_eL*   nu_e )
     3.40623360E-05    2     1000014       -14   # BR(~chi_20 -> ~nu_muL   nu_mub)
     3.40623360E-05    2    -1000014        14   # BR(~chi_20 -> ~nu_muL*  nu_mu )
     3.40623360E-05    2     1000016       -16   # BR(~chi_20 -> ~nu_tau1  nu_taub)
     3.40623360E-05    2    -1000016        16   # BR(~chi_20 -> ~nu_tau1* nu_tau )
     7.58018190E-06    2     1000039        22   # BR(~chi_20 -> ~G        gam)
     2.46942717E-05    2     1000039        23   # BR(~chi_20 -> ~G        Z)
     8.84070783E-07    2     1000039        25   # BR(~chi_20 -> ~G        h)
     1.19702141E-05    2     1000039        35   # BR(~chi_20 -> ~G        H)
     4.81275220E-07    2     1000039        36   # BR(~chi_20 -> ~G        A)
#
#         PDG            Width
DECAY   1000025     8.81040646E+01   # neutralino3 decays
#          BR         NDA      ID1       ID2
     1.44468801E-01    2     1000022        23   # BR(~chi_30 -> ~chi_10   Z )
     1.43946034E-01    2     1000024       -24   # BR(~chi_30 -> ~chi_1+   W-)
     1.43946034E-01    2    -1000024        24   # BR(~chi_30 -> ~chi_1-   W+)
     3.05874061E-03    2     1000022        25   # BR(~chi_30 -> ~chi_10   h )
     5.23112262E-02    2     1000022        35   # BR(~chi_30 -> ~chi_10   H )
     4.34532569E-03    2     1000022        36   # BR(~chi_30 -> ~chi_10   A )
     5.68607784E-02    2     1000024       -37   # BR(~chi_30 -> ~chi_1+   H-)
     5.68607784E-02    2    -1000024        37   # BR(~chi_30 -> ~chi_1-   H+)
     3.60595462E-07    2     1000002        -2   # BR(~chi_30 -> ~u_L      ub)
     3.60595462E-07    2    -1000002         2   # BR(~chi_30 -> ~u_L*     u )
     2.35061256E-08    2     2000002        -2   # BR(~chi_30 -> ~u_R      ub)
     2.35061256E-08    2    -2000002         2   # BR(~chi_30 -> ~u_R*     u )
     4.58361874E-07    2     1000001        -1   # BR(~chi_30 -> ~d_L      db)
     4.58361874E-07    2    -1000001         1   # BR(~chi_30 -> ~d_L*     d )
     5.87580078E-09    2     2000001        -1   # BR(~chi_30 -> ~d_R      db)
     5.87580078E-09    2    -2000001         1   # BR(~chi_30 -> ~d_R*     d )
     3.60595462E-07    2     1000004        -4   # BR(~chi_30 -> ~c_L      cb)
     3.60595462E-07    2    -1000004         4   # BR(~chi_30 -> ~c_L*     c )
     2.35061256E-08    2     2000004        -4   # BR(~chi_30 -> ~c_R      cb)
     2.35061256E-08    2    -2000004         4   # BR(~chi_30 -> ~c_R*     c )
     4.58361874E-07    2     1000003        -3   # BR(~chi_30 -> ~s_L      sb)
     4.58361874E-07    2    -1000003         3   # BR(~chi_30 -> ~s_L*     s )
     5.87580078E-09    2     2000003        -3   # BR(~chi_30 -> ~s_R      sb)
     5.87580078E-09    2    -2000003         3   # BR(~chi_30 -> ~s_R*     s )
     1.16658926E-01    2     1000006        -6   # BR(~chi_30 -> ~t_1      tb)
     1.16658926E-01    2    -1000006         6   # BR(~chi_30 -> ~t_1*     t )
     8.02480449E-02    2     2000006        -6   # BR(~chi_30 -> ~t_2      tb)
     8.02480449E-02    2    -2000006         6   # BR(~chi_30 -> ~t_2*     t )
     7.92769820E-05    2     1000005        -5   # BR(~chi_30 -> ~b_1      bb)
     7.92769820E-05    2    -1000005         5   # BR(~chi_30 -> ~b_1*     b )
     9.28160366E-05    2     2000005        -5   # BR(~chi_30 -> ~b_2      bb)
     9.28160366E-05    2    -2000005         5   # BR(~chi_30 -> ~b_2*     b )
     3.45895624E-09    2     1000011       -11   # BR(~chi_30 -> ~e_L-     e+)
     3.45895624E-09    2    -1000011        11   # BR(~chi_30 -> ~e_L+     e-)
     6.66790365E-10    2     2000011       -11   # BR(~chi_30 -> ~e_R-     e+)
     6.66790365E-10    2    -2000011        11   # BR(~chi_30 -> ~e_R+     e-)
     3.45895624E-09    2     1000013       -13   # BR(~chi_30 -> ~mu_L-    mu+)
     3.45895624E-09    2    -1000013        13   # BR(~chi_30 -> ~mu_L+    mu-)
     6.66790365E-10    2     2000013       -13   # BR(~chi_30 -> ~mu_R-    mu+)
     6.66790365E-10    2    -2000013        13   # BR(~chi_30 -> ~mu_R+    mu-)
     5.65019304E-07    2     1000015       -15   # BR(~chi_30 -> ~tau_1-   tau+)
     5.65019304E-07    2    -1000015        15   # BR(~chi_30 -> ~tau_1+   tau-)
     6.94524846E-07    2     2000015       -15   # BR(~chi_30 -> ~tau_2-   tau+)
     6.94524846E-07    2    -2000015        15   # BR(~chi_30 -> ~tau_2+   tau-)
     7.17866198E-09    2     1000012       -12   # BR(~chi_30 -> ~nu_eL    nu_eb)
     7.17866198E-09    2    -1000012        12   # BR(~chi_30 -> ~nu_eL*   nu_e )
     7.17866198E-09    2     1000014       -14   # BR(~chi_30 -> ~nu_muL   nu_mub)
     7.17866198E-09    2    -1000014        14   # BR(~chi_30 -> ~nu_muL*  nu_mu )
     7.17866198E-09    2     1000016       -16   # BR(~chi_30 -> ~nu_tau1  nu_taub)
     7.17866198E-09    2    -1000016        16   # BR(~chi_30 -> ~nu_tau1* nu_tau )
     1.47471653E-11    2     1000039        22   # BR(~chi_30 -> ~G        gam)
     9.70267869E-07    2     1000039        23   # BR(~chi_30 -> ~G        Z)
     2.42387614E-05    2     1000039        25   # BR(~chi_30 -> ~G        h)
     5.00742213E-07    2     1000039        35   # BR(~chi_30 -> ~G        H)
     1.28509491E-05    2     1000039        36   # BR(~chi_30 -> ~G        A)
#
#         PDG            Width
DECAY   1000035     3.61673339E+01   # neutralino4 decays
#          BR         NDA      ID1       ID2
     1.31493031E-03    2     1000022        23   # BR(~chi_40 -> ~chi_10   Z )
     4.72878279E-08    2     1000023        23   # BR(~chi_40 -> ~chi_20   Z )
     5.74612610E-04    2     1000025        23   # BR(~chi_40 -> ~chi_30   Z )
     5.72725255E-02    2     1000024       -24   # BR(~chi_40 -> ~chi_1+   W-)
     5.72725255E-02    2    -1000024        24   # BR(~chi_40 -> ~chi_1-   W+)
     1.74793190E-03    2     1000037       -24   # BR(~chi_40 -> ~chi_2+   W-)
     1.74793190E-03    2    -1000037        24   # BR(~chi_40 -> ~chi_2-   W+)
     5.76772320E-02    2     1000022        25   # BR(~chi_40 -> ~chi_10   h )
     1.61064370E-03    2     1000022        35   # BR(~chi_40 -> ~chi_10   H )
     2.13261893E-02    2     1000022        36   # BR(~chi_40 -> ~chi_10   A )
     2.30677540E-02    2     1000024       -37   # BR(~chi_40 -> ~chi_1+   H-)
     2.30677540E-02    2    -1000024        37   # BR(~chi_40 -> ~chi_1-   H+)
     4.46412410E-03    2     1000002        -2   # BR(~chi_40 -> ~u_L      ub)
     4.46412410E-03    2    -1000002         2   # BR(~chi_40 -> ~u_L*     u )
     7.77184750E-02    2     2000002        -2   # BR(~chi_40 -> ~u_R      ub)
     7.77184750E-02    2    -2000002         2   # BR(~chi_40 -> ~u_R*     u )
     5.26625435E-03    2     1000001        -1   # BR(~chi_40 -> ~d_L      db)
     5.26625435E-03    2    -1000001         1   # BR(~chi_40 -> ~d_L*     d )
     1.94274163E-02    2     2000001        -1   # BR(~chi_40 -> ~d_R      db)
     1.94274163E-02    2    -2000001         1   # BR(~chi_40 -> ~d_R*     d )
     4.46412410E-03    2     1000004        -4   # BR(~chi_40 -> ~c_L      cb)
     4.46412410E-03    2    -1000004         4   # BR(~chi_40 -> ~c_L*     c )
     7.77184750E-02    2     2000004        -4   # BR(~chi_40 -> ~c_R      cb)
     7.77184750E-02    2    -2000004         4   # BR(~chi_40 -> ~c_R*     c )
     5.26625435E-03    2     1000003        -3   # BR(~chi_40 -> ~s_L      sb)
     5.26625435E-03    2    -1000003         3   # BR(~chi_40 -> ~s_L*     s )
     1.94274163E-02    2     2000003        -3   # BR(~chi_40 -> ~s_R      sb)
     1.94274163E-02    2    -2000003         3   # BR(~chi_40 -> ~s_R*     s )
     6.24929806E-02    2     1000006        -6   # BR(~chi_40 -> ~t_1      tb)
     6.24929806E-02    2    -1000006         6   # BR(~chi_40 -> ~t_1*     t )
     7.86121197E-02    2     2000006        -6   # BR(~chi_40 -> ~t_2      tb)
     7.86121197E-02    2    -2000006         6   # BR(~chi_40 -> ~t_2*     t )
     1.17069529E-02    2     1000005        -5   # BR(~chi_40 -> ~b_1      bb)
     1.17069529E-02    2    -1000005         5   # BR(~chi_40 -> ~b_1*     b )
     1.37502986E-02    2     2000005        -5   # BR(~chi_40 -> ~b_2      bb)
     1.37502986E-02    2    -2000005         5   # BR(~chi_40 -> ~b_2*     b )
     9.73389293E-04    2     1000011       -11   # BR(~chi_40 -> ~e_L-     e+)
     9.73389293E-04    2    -1000011        11   # BR(~chi_40 -> ~e_L+     e-)
     4.00339537E-03    2     2000011       -11   # BR(~chi_40 -> ~e_R-     e+)
     4.00339537E-03    2    -2000011        11   # BR(~chi_40 -> ~e_R+     e-)
     9.73389293E-04    2     1000013       -13   # BR(~chi_40 -> ~mu_L-    mu+)
     9.73389293E-04    2    -1000013        13   # BR(~chi_40 -> ~mu_L+    mu-)
     4.00339537E-03    2     2000013       -13   # BR(~chi_40 -> ~mu_R-    mu+)
     4.00339537E-03    2    -2000013        13   # BR(~chi_40 -> ~mu_R+    mu-)
     2.47824438E-03    2     1000015       -15   # BR(~chi_40 -> ~tau_1-   tau+)
     2.47824438E-03    2    -1000015        15   # BR(~chi_40 -> ~tau_1+   tau-)
     2.49883865E-03    2     2000015       -15   # BR(~chi_40 -> ~tau_2-   tau+)
     2.49883865E-03    2    -2000015        15   # BR(~chi_40 -> ~tau_2+   tau-)
     1.03013806E-03    2     1000012       -12   # BR(~chi_40 -> ~nu_eL    nu_eb)
     1.03013806E-03    2    -1000012        12   # BR(~chi_40 -> ~nu_eL*   nu_e )
     1.03013806E-03    2     1000014       -14   # BR(~chi_40 -> ~nu_muL   nu_mub)
     1.03013806E-03    2    -1000014        14   # BR(~chi_40 -> ~nu_muL*  nu_mu )
     1.03013806E-03    2     1000016       -16   # BR(~chi_40 -> ~nu_tau1  nu_taub)
     1.03013806E-03    2    -1000016        16   # BR(~chi_40 -> ~nu_tau1* nu_tau )
     8.47611454E-05    2     1000039        22   # BR(~chi_40 -> ~G        gam)
     3.84752841E-05    2     1000039        23   # BR(~chi_40 -> ~G        Z)
     4.32351182E-07    2     1000039        25   # BR(~chi_40 -> ~G        h)
     5.89417373E-06    2     1000039        35   # BR(~chi_40 -> ~G        H)
     2.31929957E-07    2     1000039        36   # BR(~chi_40 -> ~G        A)
#
#         PDG            Width
DECAY        25     4.11676548E-03   # h decays
#          BR         NDA      ID1       ID2
     6.20291673E-01    2           5        -5   # BR(h -> b       bb     )
     6.32893603E-02    2         -15        15   # BR(h -> tau+    tau-   )
     2.24021026E-04    2         -13        13   # BR(h -> mu+     mu-    )
     4.74716216E-04    2           3        -3   # BR(h -> s       sb     )
     2.04700885E-02    2           4        -4   # BR(h -> c       cb     )
     6.65068327E-02    2          21        21   # BR(h -> g       g      )
     2.28642821E-03    2          22        22   # BR(h -> gam     gam    )
     1.52527528E-03    2          22        23   # BR(h -> Z       gam    )
     1.99507860E-01    2          24       -24   # BR(h -> W+      W-     )
     2.54237450E-02    2          23        23   # BR(h -> Z       Z      )
#
#         PDG            Width
DECAY        35     3.76350628E+01   # H decays
#          BR         NDA      ID1       ID2
     1.42972894E-03    2           5        -5   # BR(H -> b       bb     )
     2.47520253E-04    2         -15        15   # BR(H -> tau+    tau-   )
     8.75076247E-07    2         -13        13   # BR(H -> mu+     mu-    )
     1.12038381E-06    2           3        -3   # BR(H -> s       sb     )
     1.01162544E-05    2           4        -4   # BR(H -> c       cb     )
     9.96067759E-01    2           6        -6   # BR(H -> t       tb     )
     7.95953326E-04    2          21        21   # BR(H -> g       g      )
     2.71623386E-06    2          22        22   # BR(H -> gam     gam    )
     1.15490316E-06    2          23        22   # BR(H -> Z       gam    )
     3.72707181E-04    2          24       -24   # BR(H -> W+      W-     )
     1.85844768E-04    2          23        23   # BR(H -> Z       Z      )
     8.73986855E-04    2          25        25   # BR(H -> h       h      )
     5.67916259E-24    2          36        36   # BR(H -> A       A      )
     2.55043267E-11    2          23        36   # BR(H -> Z       A      )
     9.42268521E-09    2          24       -37   # BR(H -> W+      H-     )
     9.42268521E-09    2         -24        37   # BR(H -> W-      H+     )
     6.99777904E-06    2     1000024  -1000024   # BR(H -> ~chi_1+ ~chi_1-)
     3.49992254E-06    2     1000022   1000022   # BR(H -> ~chi_10 ~chi_10)
#
#         PDG            Width
DECAY        36     3.80557233E+01   # A decays
#          BR         NDA      ID1       ID2
     1.43353643E-03    2           5        -5   # BR(A -> b       bb     )
     2.45067386E-04    2         -15        15   # BR(A -> tau+    tau-   )
     8.66401740E-07    2         -13        13   # BR(A -> mu+     mu-    )
     1.14218314E-06    2           3        -3   # BR(A -> s       sb     )
     1.00091525E-05    2           4        -4   # BR(A -> c       cb     )
     9.96745329E-01    2           6        -6   # BR(A -> t       tb     )
     9.42069522E-04    2          21        21   # BR(A -> g       g      )
     3.01611161E-06    2          22        22   # BR(A -> gam     gam    )
     1.34674854E-06    2          23        22   # BR(A -> Z       gam    )
     3.63391710E-04    2          23        25   # BR(A -> Z       h      )
     1.69463286E-04    2     1000024  -1000024   # BR(A -> ~chi_1+ ~chi_1-)
     8.47623294E-05    2     1000022   1000022   # BR(A -> ~chi_10 ~chi_10)
#
#         PDG            Width
DECAY        37     3.71237213E+01   # H+ decays
#          BR         NDA      ID1       ID2
     2.27333083E-06    2           4        -5   # BR(H+ -> c       bb     )
     2.50375711E-04    2         -15        16   # BR(H+ -> tau+    nu_tau )
     8.85168594E-07    2         -13        14   # BR(H+ -> mu+     nu_mu  )
     1.44489237E-08    2           2        -5   # BR(H+ -> u       bb     )
     5.48472290E-08    2           2        -3   # BR(H+ -> u       sb     )
     1.09285361E-05    2           4        -3   # BR(H+ -> c       sb     )
     9.99366224E-01    2           6        -5   # BR(H+ -> t       bb     )
     3.69243775E-04    2          24        25   # BR(H+ -> W+      h      )
     1.44733122E-12    2     1000024   1000022   # BR(H+ -> ~chi_1+ ~chi_10)
