#
#                              ======================
#                              | THE SUSYHIT OUTPUT |
#                              ======================
#
#
#              ------------------------------------------------------
#              |     This is the output of the SUSY-HIT package     |
#              |  created by A.Djouadi, M.Muehlleitner and M.Spira. |
#              |  In case of problems with SUSY-HIT email to        |
#              |           margarete.muehlleitner@kit.edu           |
#              |           michael.spira@psi.ch                     |
#              |           abdelhak.djouadi@cern.ch                 |
#              ------------------------------------------------------
#
#              ------------------------------------------------------
#              |  SUSY Les Houches Accord - MSSM Spectrum + Decays  |
#              |              based on the decay programs           |
#              |                                                    |
#              |                     SDECAY 1.5                     |
#              |                                                    |
#              |  Authors: M.Muhlleitner, A.Djouadi and Y.Mambrini  |
#              |  Ref.:    Comput.Phys.Commun.168(2005)46           |
#              |           [hep-ph/0311167]                         |
#              |                                                    |
#              |                     HDECAY 3.4                     |
#              |                                                    |
#              |  By: A.Djouadi,J.Kalinowski,M.Muhlleitner,M.Spira  |
#              |  Ref.:    Comput.Phys.Commun.108(1998)56           |
#              |           [hep-ph/9704448]                         |
#              |                                                    |
#              |                                                    |
#              |  If not stated otherwise all DRbar couplings and   |
#              |  soft SUSY breaking masses are given at the scale  |
#              |  Q=  0.92134975E+04
#              |                                                    |
#              ------------------------------------------------------
#
#
BLOCK DCINFO  # Decay Program information
     1   SDECAY/HDECAY # decay calculator
     2   1.5  /3.4    # version number
#
BLOCK SPINFO  # Spectrum calculator information
     1   SuSpect     # RGE +Spectrum calculator            
     2   2.41        # version number                      
#
BLOCK MODSEL  # Model selection
     1     3   # #AMSB                                             
#
BLOCK SMINPUTS  # Standard Model inputs
         1     1.27934000E+02   # alpha_em^-1(M_Z)^MSbar
         2     1.16639000E-05   # G_F [GeV^-2]
         3     1.17200000E-01   # alpha_S(M_Z)^MSbar
         4     9.11870000E+01   # M_Z pole mass
         5     4.25000000E+00   # mb(mb)^MSbar
         6     1.73100000E+02   # mt pole mass
         7     1.77710000E+00   # mtau pole mass
#
BLOCK MINPAR  # Input parameters - minimal models
         1     5.00000000E+03   # m0                  
         2     6.75000000E+05   # M_3                 
         3     5.00000000E+00   # tanbeta(mZ)         
         4     1.00000000E+00   # sign(mu)            
         5     1.00000000E+00   # cQ                  
         6     1.00000000E+00   # cuR                 
#
BLOCK EXTPAR  # Input parameters - non-minimal models
         0     9.21349754E+03   # EWSB                
#
BLOCK MASS  # Mass Spectrum
# PDG code           mass       particle
        24     8.05085284E+01   # W+
        25     1.23158522E+02   # h
        35     1.09493562E+04   # H
        36     1.09489458E+04   # A
        37     1.09496378E+04   # H+
         5     4.87877839E+00   # b-quark pole mass calculated from mb(mb)_Msbar
   1000001     1.00000000E+10   # ~d_L
   2000001     1.00000000E+10   # ~d_R 
   1000002     1.00000000E+10   # ~u_L 
   2000002     1.00000000E+10   # ~u_R 
   1000003     1.00000000E+10   # ~s_L 
   2000003     1.00000000E+10   # ~s_R 
   1000004     1.00000000E+10   # ~c_L 
   2000004     1.00000000E+10   # ~c_R 
   1000005     1.00000000E+10   # ~b_1 
   2000005     1.00000000E+10   # ~b_2 
   1000006     1.00000000E+10   # ~t_1 
   2000006     1.00000000E+10   # ~t_2 
   1000011     1.00000000E+10   # ~e_L 
   2000011     1.00000000E+10   # ~e_R 
   1000012     1.00000000E+10   # ~nu_eL 
   1000013     1.00000000E+10   # ~mu_L 
   2000013     1.00000000E+10   # ~mu_R 
   1000014     1.00000000E+10   # ~nu_muL 
   1000015     1.00000000E+10   # ~tau_1 
   2000015     1.00000000E+10   # ~tau_2 
   1000016     1.00000000E+10   # ~nu_tauL 
   1000021     1.00000000E+10   # ~g 
   1000022     2.11797544E+03   # ~chi_10
   1000023     1.00000000E+10   # ~chi_20 
   1000025     1.00000000E+10   # ~chi_30 
   1000035     1.00000000E+10   # ~chi_40 
   1000024     2.11797546E+03   # ~chi_1+
   1000037     1.00000000E+10   # ~chi_2+ 
#
BLOCK NMIX  # Neutralino Mixing Matrix
  1  1     5.40679337E-05   # N_11
  1  2    -9.99958812E-01   # N_12
  1  3     8.39880410E-03   # N_13
  1  4    -3.43975974E-03   # N_14
  2  1     9.99940533E-01   # N_21
  2  2     1.49759719E-04   # N_22
  2  3     8.70156542E-03   # N_23
  2  4    -6.57200367E-03   # N_24
  3  1     1.50627624E-03   # N_31
  3  2    -3.50649020E-03   # N_32
  3  3    -7.07091453E-01   # N_33
  3  4    -7.07111810E-01   # N_34
  4  1     1.08008866E-02   # N_41
  4  2    -8.36999748E-03   # N_42
  4  3    -7.07018684E-01   # N_43
  4  4     7.07062843E-01   # N_44
#
BLOCK UMIX  # Chargino Mixing Matrix U
  1  1    -9.99929466E-01   # U_11
  1  2     1.18770094E-02   # U_12
  2  1     1.18770094E-02   # U_21
  2  2     9.99929466E-01   # U_22
#
BLOCK VMIX  # Chargino Mixing Matrix V
  1  1    -9.99988169E-01   # V_11
  1  2     4.86440075E-03   # V_12
  2  1     4.86440075E-03   # V_21
  2  2     9.99988169E-01   # V_22
#
BLOCK STOPMIX  # Stop Mixing Matrix
  1  1    -3.26542567E-02   # cos(theta_t)
  1  2     9.99466708E-01   # sin(theta_t)
  2  1    -9.99466708E-01   # -sin(theta_t)
  2  2    -3.26542567E-02   # cos(theta_t)
#
BLOCK SBOTMIX  # Sbottom Mixing Matrix
  1  1     9.99999039E-01   # cos(theta_b)
  1  2     1.38636181E-03   # sin(theta_b)
  2  1    -1.38636181E-03   # -sin(theta_b)
  2  2     9.99999039E-01   # cos(theta_b)
#
BLOCK STAUMIX  # Stau Mixing Matrix
  1  1     3.33187949E-02   # cos(theta_tau)
  1  2     9.99444775E-01   # sin(theta_tau)
  2  1    -9.99444775E-01   # -sin(theta_tau)
  2  2     3.33187949E-02   # cos(theta_tau)
#
BLOCK ALPHA  # Higgs mixing
          -2.09913875E-01   # Mixing angle in the neutral Higgs boson sector
#
BLOCK HMIX Q=  9.21349754E+03  # DRbar Higgs Parameters
         1     9.84339682E+03   # mu(Q)               
         2     4.69468069E+00   # tanbeta(Q)          
         3     2.44018502E+02   # vev(Q)              
         4     1.19731145E+08   # MA^2(Q)             
#
BLOCK GAUGE Q=  9.21349754E+03  # The gauge couplings
     1     3.67283551E-01   # gprime(Q) DRbar
     2     6.31221772E-01   # g(Q) DRbar
     3     9.54072351E-01   # g3(Q) DRbar
#
BLOCK AU Q=  9.21349754E+03  # The trilinear couplings
  1  1     2.11206708E+04   # A_u(Q) DRbar
  2  2     2.11206708E+04   # A_c(Q) DRbar
  3  3     9.92583612E+03   # A_t(Q) DRbar
#
BLOCK AD Q=  9.21349754E+03  # The trilinear couplings
  1  1     2.32234377E+04   # A_d(Q) DRbar
  2  2     2.32234377E+04   # A_s(Q) DRbar
  3  3     2.34407331E+04   # A_b(Q) DRbar
#
BLOCK AE Q=  9.21349754E+03  # The trilinear couplings
  1  1     6.71936619E+03   # A_e(Q) DRbar
  2  2     6.71936619E+03   # A_mu(Q) DRbar
  3  3     6.68880584E+03   # A_tau(Q) DRbar
#
BLOCK Yu Q=  9.21349754E+03  # The Yukawa couplings
  1  1     0.00000000E+00   # y_u(Q) DRbar
  2  2     0.00000000E+00   # y_c(Q) DRbar
  3  3     8.04510832E-01   # y_t(Q) DRbar
#
BLOCK Yd Q=  9.21349754E+03  # The Yukawa couplings
  1  1     0.00000000E+00   # y_d(Q) DRbar
  2  2     0.00000000E+00   # y_s(Q) DRbar
  3  3     6.44087505E-02   # y_b(Q) DRbar
#
BLOCK Ye Q=  9.21349754E+03  # The Yukawa couplings
  1  1     0.00000000E+00   # y_e(Q) DRbar
  2  2     0.00000000E+00   # y_mu(Q) DRbar
  3  3     4.86976885E-02   # y_tau(Q) DRbar
#
BLOCK MSOFT Q=  9.21349754E+03  # The soft SUSY breaking masses at the scale Q
         1     6.44365759E+03   # M_1                 
         2     2.00833820E+03   # M_2                 
         3    -1.13222733E+04   # M_3                 
        21     1.68144018E+07   # M^2_Hd              
        22    -9.03433849E+07   # M^2_Hu              
        31     4.28660895E+03   # M_eL                
        32     4.28660895E+03   # M_muL               
        33     4.27326550E+03   # M_tauL              
        34     4.05172421E+03   # M_eR                
        35     4.05172421E+03   # M_muR               
        36     4.02340602E+03   # M_tauR              
        41     1.17255344E+04   # M_q1L               
        42     1.17255344E+04   # M_q2L               
        43     1.01424524E+04   # M_q3L               
        44     1.17881608E+04   # M_uR                
        45     1.17881608E+04   # M_cR                
        46     8.36860215E+03   # M_tR                
        47     1.19093018E+04   # M_dR                
        48     1.19093018E+04   # M_sR                
        49     1.18700868E+04   # M_bR                
#
#
#
#                             =================
#                             |The decay table|
#                             =================
#
# - The QCD corrections to the decays gluino -> squark  + quark
#                                     squark -> gaugino + quark_prime
#                                     squark -> squark_prime + Higgs
#                                     squark -> gluino  + quark
#   are included.
#
# - The multi-body decays for the inos, stops and sbottoms are included.
#
# - The loop induced decays for the gluino, neutralinos and stops
#   are included.
#
# - The SUSY decays of the top quark are included.
#
#
#         PDG            Width
DECAY         6     1.39526879E+00   # top decays
#          BR         NDA      ID1       ID2
     1.00000000E+00    2           5        24   # BR(t ->  b    W+)
#
#         PDG            Width
DECAY   1000021     2.66227071E+01   # gluino decays
#          BR         NDA      ID1       ID2
     2.15597447E-02    2     1000005        -5   # BR(~g -> ~b_1  bb)
     2.15597447E-02    2    -1000005         5   # BR(~g -> ~b_1* b )
     4.61798389E-01    2     1000006        -6   # BR(~g -> ~t_1  tb)
     4.61798389E-01    2    -1000006         6   # BR(~g -> ~t_1* t )
     1.66418658E-02    2     2000006        -6   # BR(~g -> ~t_2  tb)
     1.66418658E-02    2    -2000006         6   # BR(~g -> ~t_2* t )
#
#         PDG            Width
DECAY   1000006     4.50936345E+00   # stop1 decays
#          BR         NDA      ID1       ID2
     4.00067435E-03    2     1000022         6   # BR(~t_1 -> ~chi_10 t )
     9.87992303E-01    2     1000023         6   # BR(~t_1 -> ~chi_20 t )
     8.00702305E-03    2     1000024         5   # BR(~t_1 -> ~chi_1+ b )
#
#         PDG            Width
DECAY   2000006     1.26384604E+02   # stop2 decays
#          BR         NDA      ID1       ID2
     2.93682859E-01    2     1000022         6   # BR(~t_2 -> ~chi_10 t )
     5.01610120E-03    2     1000023         6   # BR(~t_2 -> ~chi_20 t )
     7.38796294E-03    2     1000025         6   # BR(~t_2 -> ~chi_30 t )
     7.14902883E-03    2     1000035         6   # BR(~t_2 -> ~chi_40 t )
     5.87657386E-01    2     1000024         5   # BR(~t_2 -> ~chi_1+ b )
     1.04560755E-04    2     1000037         5   # BR(~t_2 -> ~chi_2+ b )
     8.06192612E-02    2     1000006        25   # BR(~t_2 -> ~t_1    h )
     1.83828405E-02    2     1000006        23   # BR(~t_2 -> ~t_1    Z )
#
#         PDG            Width
DECAY   1000005     1.04861371E+02   # sbottom1 decays
#          BR         NDA      ID1       ID2
     3.53303904E-01    2     1000022         5   # BR(~b_1 -> ~chi_10 b )
     5.75810081E-03    2     1000023         5   # BR(~b_1 -> ~chi_20 b )
     5.23204679E-05    2     1000025         5   # BR(~b_1 -> ~chi_30 b )
     5.27437507E-05    2     1000035         5   # BR(~b_1 -> ~chi_40 b )
     7.06255046E-01    2    -1000024         6   # BR(~b_1 -> ~chi_1- t )
     1.60759555E-02    2    -1000037         6   # BR(~b_1 -> ~chi_2- t )
    -8.14980709E-02    2     1000006       -24   # BR(~b_1 -> ~t_1    W-)
#
#         PDG            Width
DECAY   2000005     3.40110460E+01   # sbottom2 decays
#          BR         NDA      ID1       ID2
     7.19347077E-08    2     1000022         5   # BR(~b_2 -> ~chi_10 b )
     1.08025599E-01    2     1000023         5   # BR(~b_2 -> ~chi_20 b )
     1.70072317E-03    2     1000025         5   # BR(~b_2 -> ~chi_30 b )
     1.70291495E-03    2     1000035         5   # BR(~b_2 -> ~chi_40 b )
     1.43106995E-07    2    -1000024         6   # BR(~b_2 -> ~chi_1- t )
     3.39963182E-03    2    -1000037         6   # BR(~b_2 -> ~chi_2- t )
     8.80684091E-01    2     1000021         5   # BR(~b_2 -> ~g      b )
     6.02741918E-04    2     1000005        25   # BR(~b_2 -> ~b_1    h )
     1.71177118E-03    2     1000005        23   # BR(~b_2 -> ~b_1    Z )
     9.61723145E-06    2     1000006       -24   # BR(~b_2 -> ~t_1    W-)
     2.16269466E-03    2     2000006       -24   # BR(~b_2 -> ~t_2    W-)
#
#         PDG            Width
DECAY   1000002     1.53496367E+02   # sup_L decays
#          BR         NDA      ID1       ID2
     2.78589043E-01    2     1000022         2   # BR(~u_L -> ~chi_10 u)
     5.81974098E-03    2     1000023         2   # BR(~u_L -> ~chi_20 u)
     3.36958924E-07    2     1000025         2   # BR(~u_L -> ~chi_30 u)
     1.28340638E-06    2     1000035         2   # BR(~u_L -> ~chi_40 u)
     5.57222489E-01    2     1000024         1   # BR(~u_L -> ~chi_1+ d)
     1.54276914E-06    2     1000037         1   # BR(~u_L -> ~chi_2+ d)
     1.58365564E-01    2     1000021         2   # BR(~u_L -> ~g      u)
#
#         PDG            Width
DECAY   2000002     4.11932869E+01   # sup_R decays
#          BR         NDA      ID1       ID2
     1.83707262E-09    2     1000022         2   # BR(~u_R -> ~chi_10 u)
     3.50911903E-01    2     1000023         2   # BR(~u_R -> ~chi_20 u)
     1.73691500E-07    2     1000025         2   # BR(~u_R -> ~chi_30 u)
     8.92530594E-06    2     1000035         2   # BR(~u_R -> ~chi_40 u)
     6.49078996E-01    2     1000021         2   # BR(~u_R -> ~g      u)
#
#         PDG            Width
DECAY   1000001     1.53498406E+02   # sdown_L decays
#          BR         NDA      ID1       ID2
     2.78602829E-01    2     1000022         1   # BR(~d_L -> ~chi_10 d)
     5.80199200E-03    2     1000023         1   # BR(~d_L -> ~chi_20 d)
     4.70670440E-07    2     1000025         1   # BR(~d_L -> ~chi_30 d)
     3.56989579E-06    2     1000035         1   # BR(~d_L -> ~chi_40 d)
     5.57161267E-01    2    -1000024         2   # BR(~d_L -> ~chi_1- u)
     9.19866496E-06    2    -1000037         2   # BR(~d_L -> ~chi_2- u)
     1.58420673E-01    2     1000021         1   # BR(~d_L -> ~g      d)
#
#         PDG            Width
DECAY   2000001     3.53921737E+01   # sdown_R decays
#          BR         NDA      ID1       ID2
     5.40376849E-10    2     1000022         1   # BR(~d_R -> ~chi_10 d)
     1.04625482E-01    2     1000023         1   # BR(~d_R -> ~chi_20 d)
     5.49768691E-08    2     1000025         1   # BR(~d_R -> ~chi_30 d)
     2.82513530E-06    2     1000035         1   # BR(~d_R -> ~chi_40 d)
     8.95371638E-01    2     1000021         1   # BR(~d_R -> ~g      d)
#
#         PDG            Width
DECAY   1000004     1.53496367E+02   # scharm_L decays
#          BR         NDA      ID1       ID2
     2.78589043E-01    2     1000022         4   # BR(~c_L -> ~chi_10 c)
     5.81974098E-03    2     1000023         4   # BR(~c_L -> ~chi_20 c)
     3.36958924E-07    2     1000025         4   # BR(~c_L -> ~chi_30 c)
     1.28340638E-06    2     1000035         4   # BR(~c_L -> ~chi_40 c)
     5.57222489E-01    2     1000024         3   # BR(~c_L -> ~chi_1+ s)
     1.54276914E-06    2     1000037         3   # BR(~c_L -> ~chi_2+ s)
     1.58365564E-01    2     1000021         4   # BR(~c_L -> ~g      c)
#
#         PDG            Width
DECAY   2000004     4.11932869E+01   # scharm_R decays
#          BR         NDA      ID1       ID2
     1.83707262E-09    2     1000022         4   # BR(~c_R -> ~chi_10 c)
     3.50911903E-01    2     1000023         4   # BR(~c_R -> ~chi_20 c)
     1.73691500E-07    2     1000025         4   # BR(~c_R -> ~chi_30 c)
     8.92530594E-06    2     1000035         4   # BR(~c_R -> ~chi_40 c)
     6.49078996E-01    2     1000021         4   # BR(~c_R -> ~g      c)
#
#         PDG            Width
DECAY   1000003     1.53498406E+02   # sstrange_L decays
#          BR         NDA      ID1       ID2
     2.78602829E-01    2     1000022         3   # BR(~s_L -> ~chi_10 s)
     5.80199200E-03    2     1000023         3   # BR(~s_L -> ~chi_20 s)
     4.70670440E-07    2     1000025         3   # BR(~s_L -> ~chi_30 s)
     3.56989579E-06    2     1000035         3   # BR(~s_L -> ~chi_40 s)
     5.57161267E-01    2    -1000024         4   # BR(~s_L -> ~chi_1- c)
     9.19866496E-06    2    -1000037         4   # BR(~s_L -> ~chi_2- c)
     1.58420673E-01    2     1000021         3   # BR(~s_L -> ~g      s)
#
#         PDG            Width
DECAY   2000003     3.53921737E+01   # sstrange_R decays
#          BR         NDA      ID1       ID2
     5.40376849E-10    2     1000022         3   # BR(~s_R -> ~chi_10 s)
     1.04625482E-01    2     1000023         3   # BR(~s_R -> ~chi_20 s)
     5.49768691E-08    2     1000025         3   # BR(~s_R -> ~chi_30 s)
     2.82513530E-06    2     1000035         3   # BR(~s_R -> ~chi_40 s)
     8.95371638E-01    2     1000021         3   # BR(~s_R -> ~g      s)
#
#         PDG            Width
DECAY   1000011     2.91195464E+01   # selectron_L decays
#          BR         NDA      ID1       ID2
     3.33332396E-01    2     1000022        11   # BR(~e_L -> ~chi_10 e-)
     6.66667604E-01    2    -1000024        12   # BR(~e_L -> ~chi_1- nu_e)
#
#         PDG            Width
DECAY   2000011     3.35824123E-08   # selectron_R decays
#          BR         NDA      ID1       ID2
     1.00000000E+00    2     1000022        11   # BR(~e_R -> ~chi_10 e-)
#
#         PDG            Width
DECAY   1000013     2.91195464E+01   # smuon_L decays
#          BR         NDA      ID1       ID2
     3.33332396E-01    2     1000022        13   # BR(~mu_L -> ~chi_10 mu-)
     6.66667604E-01    2    -1000024        14   # BR(~mu_L -> ~chi_1- nu_mu)
#
#         PDG            Width
DECAY   2000013     3.35824123E-08   # smuon_R decays
#          BR         NDA      ID1       ID2
     1.00000000E+00    2     1000022        13   # BR(~mu_R -> ~chi_10 mu-)
#
#         PDG            Width
DECAY   1000015     2.92938755E-02   # stau_1 decays
#          BR         NDA      ID1       ID2
     3.33333825E-01    2     1000022        15   # BR(~tau_1 -> ~chi_10  tau-)
     6.66666175E-01    2    -1000024        16   # BR(~tau_1 -> ~chi_1-  nu_tau)
#
#         PDG            Width
DECAY   2000015     2.89518230E+01   # stau_2 decays
#          BR         NDA      ID1       ID2
     3.32529566E-01    2     1000022        15   # BR(~tau_2 -> ~chi_10  tau-)
     6.65062450E-01    2    -1000024        16   # BR(~tau_2 -> ~chi_1-  nu_tau)
     1.27426394E-03    2     1000015        25   # BR(~tau_2 -> ~tau_1   h)
     1.13372059E-03    2     1000015        23   # BR(~tau_2 -> ~tau_1   Z)
#
#         PDG            Width
DECAY   1000012     2.91132112E+01   # snu_eL decays
#          BR         NDA      ID1       ID2
     3.33334271E-01    2     1000022        12   # BR(~nu_eL -> ~chi_10 nu_e)
     6.66665729E-01    2     1000024        11   # BR(~nu_eL -> ~chi_1+ e-)
#
#         PDG            Width
DECAY   1000014     2.91132112E+01   # snu_muL decays
#          BR         NDA      ID1       ID2
     3.33334271E-01    2     1000022        14   # BR(~nu_muL -> ~chi_10 nu_mu)
     6.66665729E-01    2     1000024        13   # BR(~nu_muL -> ~chi_1+ mu-)
#
#         PDG            Width
DECAY   1000016     2.89707828E+01   # snu_tauL decays
#          BR         NDA      ID1       ID2
     3.32581691E-01    2     1000022        16   # BR(~nu_tauL -> ~chi_10 nu_tau)
     6.65160064E-01    2     1000024        15   # BR(~nu_tauL -> ~chi_1+ tau-)
     2.25824471E-03    2    -1000015       -24   # BR(~nu_tauL -> ~tau_1+ W-)
#
#         PDG            Width
DECAY   1000024     0.00000000E+00   # stable chargino_1
#           BR         NDA      ID1       ID2       ID3
     3.74960614E-01    3     1000022         2        -1   # BR(~chi_1+ -> ~chi_10 u    db)
     3.74960614E-01    3     1000022         4        -3   # BR(~chi_1+ -> ~chi_10 c    sb)
     1.25039386E-01    3     1000022       -11        12   # BR(~chi_1+ -> ~chi_10 e+   nu_e)
     1.25039386E-01    3     1000022       -13        14   # BR(~chi_1+ -> ~chi_10 mu+  nu_mu)
#
#         PDG            Width
DECAY   1000037     8.39094902E+01   # chargino2+ decays
#          BR         NDA      ID1       ID2
     1.38034558E-01    2     1000006        -5   # BR(~chi_2+ -> ~t_1     bb)
     7.21548366E-06    2     1000012       -11   # BR(~chi_2+ -> ~nu_eL   e+  )
     7.21548366E-06    2     1000014       -13   # BR(~chi_2+ -> ~nu_muL  mu+ )
     1.82709893E-03    2     1000016       -15   # BR(~chi_2+ -> ~nu_tau1 tau+)
     4.30091577E-05    2    -1000011        12   # BR(~chi_2+ -> ~e_L+    nu_e)
     4.30091577E-05    2    -1000013        14   # BR(~chi_2+ -> ~mu_L+   nu_mu)
     1.89546783E-03    2    -1000015        16   # BR(~chi_2+ -> ~tau_1+  nu_tau)
     6.37622750E-05    2    -2000015        16   # BR(~chi_2+ -> ~tau_2+  nu_tau)
     2.58415621E-01    2     1000024        23   # BR(~chi_2+ -> ~chi_1+  Z )
     2.47661966E-01    2     1000022        24   # BR(~chi_2+ -> ~chi_10  W+)
     8.14549487E-02    2     1000023        24   # BR(~chi_2+ -> ~chi_20  W+)
     2.70546129E-01    2     1000024        25   # BR(~chi_2+ -> ~chi_1+  h )
#
#         PDG            Width
DECAY   1000022     0.00000000E+00   # stable neutralino 
#
#         PDG            Width
DECAY   1000023     5.15612115E+01   # neutralino2 decays
#          BR         NDA      ID1       ID2
     2.84533047E-06    2     1000022        23   # BR(~chi_20 -> ~chi_10   Z )
     4.71494421E-05    2     1000024       -24   # BR(~chi_20 -> ~chi_1+   W-)
     4.71494421E-05    2    -1000024        24   # BR(~chi_20 -> ~chi_1-   W+)
     4.85209340E-05    2     1000022        25   # BR(~chi_20 -> ~chi_10   h )
     2.45883522E-02    2     1000011       -11   # BR(~chi_20 -> ~e_L-     e+)
     2.45883522E-02    2    -1000011        11   # BR(~chi_20 -> ~e_L+     e-)
     1.16563485E-01    2     2000011       -11   # BR(~chi_20 -> ~e_R-     e+)
     1.16563485E-01    2    -2000011        11   # BR(~chi_20 -> ~e_R+     e-)
     2.45883522E-02    2     1000013       -13   # BR(~chi_20 -> ~mu_L-    mu+)
     2.45883522E-02    2    -1000013        13   # BR(~chi_20 -> ~mu_L+    mu-)
     1.16563485E-01    2     2000013       -13   # BR(~chi_20 -> ~mu_R-    mu+)
     1.16563485E-01    2    -2000013        13   # BR(~chi_20 -> ~mu_R+    mu-)
     1.18720413E-01    2     1000015       -15   # BR(~chi_20 -> ~tau_1-   tau+)
     1.18720413E-01    2    -1000015        15   # BR(~chi_20 -> ~tau_1+   tau-)
     2.49221882E-02    2     2000015       -15   # BR(~chi_20 -> ~tau_2-   tau+)
     2.49221882E-02    2    -2000015        15   # BR(~chi_20 -> ~tau_2+   tau-)
     2.45751321E-02    2     1000012       -12   # BR(~chi_20 -> ~nu_eL    nu_eb)
     2.45751321E-02    2    -1000012        12   # BR(~chi_20 -> ~nu_eL*   nu_e )
     2.45751321E-02    2     1000014       -14   # BR(~chi_20 -> ~nu_muL   nu_mub)
     2.45751321E-02    2    -1000014        14   # BR(~chi_20 -> ~nu_muL*  nu_mu )
     2.48306274E-02    2     1000016       -16   # BR(~chi_20 -> ~nu_tau1  nu_taub)
     2.48306274E-02    2    -1000016        16   # BR(~chi_20 -> ~nu_tau1* nu_tau )
#
#         PDG            Width
DECAY   1000025     8.24521423E+01   # neutralino3 decays
#          BR         NDA      ID1       ID2
     2.23726659E-01    2     1000022        23   # BR(~chi_30 -> ~chi_10   Z )
     8.47573565E-02    2     1000023        23   # BR(~chi_30 -> ~chi_20   Z )
     2.52044349E-01    2     1000024       -24   # BR(~chi_30 -> ~chi_1+   W-)
     2.52044349E-01    2    -1000024        24   # BR(~chi_30 -> ~chi_1-   W+)
     4.11004078E-02    2     1000022        25   # BR(~chi_30 -> ~chi_10   h )
     1.72426755E-03    2     1000023        25   # BR(~chi_30 -> ~chi_20   h )
     7.03863359E-02    2     1000006        -6   # BR(~chi_30 -> ~t_1      tb)
     7.03863359E-02    2    -1000006         6   # BR(~chi_30 -> ~t_1*     t )
     1.07302423E-06    2     1000011       -11   # BR(~chi_30 -> ~e_L-     e+)
     1.07302423E-06    2    -1000011        11   # BR(~chi_30 -> ~e_L+     e-)
     5.00760788E-07    2     2000011       -11   # BR(~chi_30 -> ~e_R-     e+)
     5.00760788E-07    2    -2000011        11   # BR(~chi_30 -> ~e_R+     e-)
     1.07302423E-06    2     1000013       -13   # BR(~chi_30 -> ~mu_L-    mu+)
     1.07302423E-06    2    -1000013        13   # BR(~chi_30 -> ~mu_L+    mu-)
     5.00760788E-07    2     2000013       -13   # BR(~chi_30 -> ~mu_R-    mu+)
     5.00760788E-07    2    -2000013        13   # BR(~chi_30 -> ~mu_R+    mu-)
     9.72354902E-04    2     1000015       -15   # BR(~chi_30 -> ~tau_1-   tau+)
     9.72354902E-04    2    -1000015        15   # BR(~chi_30 -> ~tau_1+   tau-)
     9.30517268E-04    2     2000015       -15   # BR(~chi_30 -> ~tau_2-   tau+)
     9.30517268E-04    2    -2000015        15   # BR(~chi_30 -> ~tau_2+   tau-)
     2.98038699E-06    2     1000012       -12   # BR(~chi_30 -> ~nu_eL    nu_eb)
     2.98038699E-06    2    -1000012        12   # BR(~chi_30 -> ~nu_eL*   nu_e )
     2.98038699E-06    2     1000014       -14   # BR(~chi_30 -> ~nu_muL   nu_mub)
     2.98038699E-06    2    -1000014        14   # BR(~chi_30 -> ~nu_muL*  nu_mu )
     2.98907995E-06    2     1000016       -16   # BR(~chi_30 -> ~nu_tau1  nu_taub)
     2.98907995E-06    2    -1000016        16   # BR(~chi_30 -> ~nu_tau1* nu_tau )
#
#         PDG            Width
DECAY   1000035     8.33111809E+01   # neutralino4 decays
#          BR         NDA      ID1       ID2
     3.88594806E-02    2     1000022        23   # BR(~chi_40 -> ~chi_10   Z )
     1.63382936E-03    2     1000023        23   # BR(~chi_40 -> ~chi_20   Z )
     2.49435926E-01    2     1000024       -24   # BR(~chi_40 -> ~chi_1+   W-)
     2.49435926E-01    2    -1000024        24   # BR(~chi_40 -> ~chi_1-   W+)
     2.31804499E-01    2     1000022        25   # BR(~chi_40 -> ~chi_10   h )
     8.78283478E-02    2     1000023        25   # BR(~chi_40 -> ~chi_20   h )
     6.84424175E-02    2     1000006        -6   # BR(~chi_40 -> ~t_1      tb)
     6.84424175E-02    2    -1000006         6   # BR(~chi_40 -> ~t_1*     t )
     6.67754324E-07    2     1000011       -11   # BR(~chi_40 -> ~e_L-     e+)
     6.67754324E-07    2    -1000011        11   # BR(~chi_40 -> ~e_L+     e-)
     2.54858880E-05    2     2000011       -11   # BR(~chi_40 -> ~e_R-     e+)
     2.54858880E-05    2    -2000011        11   # BR(~chi_40 -> ~e_R+     e-)
     6.67754324E-07    2     1000013       -13   # BR(~chi_40 -> ~mu_L-    mu+)
     6.67754324E-07    2    -1000013        13   # BR(~chi_40 -> ~mu_L+    mu-)
     2.54858880E-05    2     2000013       -13   # BR(~chi_40 -> ~mu_R-    mu+)
     2.54858880E-05    2    -2000013        13   # BR(~chi_40 -> ~mu_R+    mu-)
     9.78709479E-04    2     1000015       -15   # BR(~chi_40 -> ~tau_1-   tau+)
     9.78709479E-04    2    -1000015        15   # BR(~chi_40 -> ~tau_1+   tau-)
     9.28524428E-04    2     2000015       -15   # BR(~chi_40 -> ~tau_2-   tau+)
     9.28524428E-04    2    -2000015        15   # BR(~chi_40 -> ~tau_2+   tau-)
     3.29803753E-05    2     1000012       -12   # BR(~chi_40 -> ~nu_eL    nu_eb)
     3.29803753E-05    2    -1000012        12   # BR(~chi_40 -> ~nu_eL*   nu_e )
     3.29803753E-05    2     1000014       -14   # BR(~chi_40 -> ~nu_muL   nu_mub)
     3.29803753E-05    2    -1000014        14   # BR(~chi_40 -> ~nu_muL*  nu_mu )
     3.30765514E-05    2     1000016       -16   # BR(~chi_40 -> ~nu_tau1  nu_taub)
     3.30765514E-05    2    -1000016        16   # BR(~chi_40 -> ~nu_tau1* nu_tau )
#
#         PDG            Width
DECAY        36     2.03072121E+01   # A decays
#          BR         NDA      ID1       ID2
     1.10864158E-01    2           5        -5   # BR(A -> b       bb     )
     2.46307000E-02    2         -15        15   # BR(A -> tau+    tau-   )
     8.70684901E-05    2         -13        13   # BR(A -> mu+     mu-    )
     9.11718075E-05    2           3        -3   # BR(A -> s       sb     )
     8.46823697E-06    2           4        -4   # BR(A -> c       cb     )
     8.52528099E-01    2           6        -6   # BR(A -> t       tb     )
     1.37247835E-04    2          21        21   # BR(A -> g       g      )
     3.58344206E-07    2          22        22   # BR(A -> gam     gam    )
     2.74579744E-07    2          23        22   # BR(A -> Z       gam    )
     3.99402235E-05    2          23        25   # BR(A -> Z       h      )
     6.74724332E-04    2     1000024  -1000024   # BR(A -> ~chi_1+ ~chi_1-)
     3.37402880E-04    2     1000022   1000022   # BR(A -> ~chi_10 ~chi_10)
     2.43620027E-04    2     1000022   1000023   # BR(A -> ~chi_10 ~chi_20)
     5.17838311E-03    2     1000015  -2000015   # BR(A -> ~tau_1- ~tau_2+)
     5.17838311E-03    2    -1000015   2000015   # BR(A -> ~tau_1+ ~tau_2-)
#
#         PDG            Width
DECAY        37     2.00114590E+01   # H+ decays
#          BR         NDA      ID1       ID2
     1.75394346E-04    2           4        -5   # BR(H+ -> c       bb     )
     2.49963014E-02    2         -15        16   # BR(H+ -> tau+    nu_tau )
     8.83608758E-05    2         -13        14   # BR(H+ -> mu+     nu_mu  )
     1.12243920E-06    2           2        -5   # BR(H+ -> u       bb     )
     4.43433832E-06    2           2        -3   # BR(H+ -> u       sb     )
     9.94558218E-05    2           4        -3   # BR(H+ -> c       sb     )
     9.63753703E-01    2           6        -5   # BR(H+ -> t       bb     )
     4.05400565E-05    2          24        25   # BR(H+ -> W+      h      )
     1.04457588E-14    2          24        36   # BR(H+ -> W+      A      )
     9.30581609E-13    2     1000024   1000022   # BR(H+ -> ~chi_1+ ~chi_10)
     3.14849291E-04    2     1000024   1000023   # BR(H+ -> ~chi_1+ ~chi_20)
     1.30006419E-05    2    -1000011   1000012   # BR(H+ -> ~e_L+   ~nu_eL )
     1.30006419E-05    2    -1000013   1000014   # BR(H+ -> ~mu_L+  ~nu_muL)
     1.04518491E-02    2    -1000015   1000016   # BR(H+ -> ~tau_1+ ~nu_tauL)
     4.79875643E-05    2    -2000015   1000016   # BR(H+ -> ~tau_2+ ~nu_tauL)
