#
#                              ======================
#                              | THE SUSYHIT OUTPUT |
#                              ======================
#
#
#              ------------------------------------------------------
#              |     This is the output of the SUSY-HIT package     |
#              |  created by A.Djouadi, M.Muehlleitner and M.Spira. |
#              |  In case of problems with SUSY-HIT email to        |
#              |           margarete.muehlleitner@kit.edu           |
#              |           michael.spira@psi.ch                     |
#              |           abdelhak.djouadi@cern.ch                 |
#              ------------------------------------------------------
#
#              ------------------------------------------------------
#              |  SUSY Les Houches Accord - MSSM Spectrum + Decays  |
#              |              based on the decay programs           |
#              |                                                    |
#              |                     SDECAY 1.5a                    |
#              |                                                    |
#              |  Authors: M.Muhlleitner, A.Djouadi and Y.Mambrini  |
#              |  Ref.:    Comput.Phys.Commun.168(2005)46           |
#              |           [hep-ph/0311167]                         |
#              |                                                    |
#              |                     HDECAY 3.4                     |
#              |                                                    |
#              |  By: A.Djouadi,J.Kalinowski,M.Muhlleitner,M.Spira  |
#              |  Ref.:    Comput.Phys.Commun.108(1998)56           |
#              |           [hep-ph/9704448]                         |
#              |                                                    |
#              |                                                    |
#              |  If not stated otherwise all DRbar couplings and   |
#              |  soft SUSY breaking masses are given at the scale  |
#              |  Q=  0.91187600E+02
#              |                                                    |
#              ------------------------------------------------------
#
#
BLOCK DCINFO  # Decay Program information
     1   SDECAY/HDECAY # decay calculator
     2   1.5a /3.4    # version number
#
BLOCK SPINFO  # Spectrum calculator information
     1   SuSpect     # RGE +Spectrum calculator            
     2   2.43         # version number                     
#
BLOCK MODSEL  # Model selection
     1     2   # GMSB                                              
#
BLOCK SMINPUTS  # Standard Model inputs
         1     1.27932904E+02   # alpha_em^-1(M_Z)^MSbar
         2     1.16639000E-05   # G_F [GeV^-2]
         3     1.17200000E-01   # alpha_S(M_Z)^MSbar
         4     9.11870000E+01   # M_Z pole mass
         5     4.25000000E+00   # mb(mb)^MSbar
         6     1.72900000E+02   # mt pole mass
         7     1.77700000E+00   # mtau pole mass
#
BLOCK MINPAR  # Input parameters - minimal models
#
BLOCK EXTPAR  # Input parameters - non-minimal models
         0     9.11876000E+01   # EWSB                
         1     6.54299572E+02   # M_1                 
         2     3.00000000E+03   # M_2                 
         3     1.80000000E+03   # M_3                 
        11     0.00000000E+00   # A_t                 
        12     0.00000000E+00   # A_b                 
        13     0.00000000E+00   # A_tau               
        14     0.00000000E+00   # A_u                 
        15     0.00000000E+00   # A_d                 
        16     0.00000000E+00   # A_e                 
        23    -6.50000000E+02   # mu(EWSB)            
        25     1.50000000E+00   # tanbeta(in)         
        26     2.00000000E+03   # MA_pole             
        31     5.00000000E+03   # M_eL                
        32     5.00000000E+03   # M_muL               
        33     5.00000000E+03   # M_tauL              
        34     5.00000000E+03   # M_eR                
        35     5.00000000E+03   # M_muR               
        36     5.00000000E+03   # M_tauR              
        41     5.00000000E+03   # M_q1L               
        42     5.00000000E+03   # M_q2L               
        43     5.00000000E+03   # M_q3L               
        44     5.00000000E+03   # M_uR                
        45     5.00000000E+03   # M_cR                
        46     5.00000000E+03   # M_tR                
        47     5.00000000E+03   # M_dR                
        48     5.00000000E+03   # M_sR                
        49     5.00000000E+03   # M_bR                
#
BLOCK MASS  # Mass Spectrum
# PDG code           mass       particle
        24     8.05396360E+01   # W+
        25     1.25000000E+02   # h
        35     2.00414590E+03   # H
        36     2.00000000E+03   # A
        37     2.00183968E+03   # H+
         5     4.87877839E+00   # b-quark pole mass calculated from mb(mb)_Msbar
   1000001     5.00013280E+03   # ~d_L
   2000001     5.00002530E+03   # ~d_R
   1000002     4.99989250E+03   # ~u_L
   2000002     4.99994939E+03   # ~u_R
   1000003     5.00013280E+03   # ~s_L
   2000003     5.00002530E+03   # ~s_R
   1000004     4.99989250E+03   # ~c_L
   2000004     4.99994939E+03   # ~c_R
   1000005     4.99981183E+03   # ~b_1
   2000005     5.00034771E+03   # ~b_2
   1000006     4.99564059E+03   # ~t_1
   2000006     5.00882243E+03   # ~t_2
   1000011     5.00008220E+03   # ~e_L
   2000011     5.00007591E+03   # ~e_R
   1000012     4.99984189E+03   # ~nu_eL
   1000013     5.00008220E+03   # ~mu_L
   2000013     5.00007591E+03   # ~mu_R
   1000014     4.99984189E+03   # ~nu_muL
   1000015     4.99990615E+03   # ~tau_1
   2000015     5.00025258E+03   # ~tau_2
   1000016     4.99984189E+03   # ~nu_tauL
   1000021     1.80000000E+03   # ~g
   1000022     6.43654238E+02   # ~chi_10
   1000023    -6.53096331E+02   # ~chi_20
   1000025     6.61993966E+02   # ~chi_30
   1000035     3.00174770E+03   # ~chi_40
   1000024     6.51542903E+02   # ~chi_1+
   1000037     3.00174741E+03   # ~chi_2+
   1000039     1.19148737E-08   # ~gravitino
#
BLOCK NMIX  # Neutralino Mixing Matrix
  1  1     5.83152047E-01   # N_11
  1  2    -4.68740294E-03   # N_12
  1  3    -5.88329380E-01   # N_13
  1  4    -5.60160923E-01   # N_14
  2  1     3.32975966E-02   # N_21
  2  2    -2.12025980E-02   # N_22
  2  3     7.06219777E-01   # N_23
  2  4    -7.06891325E-01   # N_24
  3  1     8.11680224E-01   # N_31
  3  2     4.75273910E-03   # N_32
  3  3     3.93719571E-01   # N_33
  3  4     4.31436583E-01   # N_34
  4  1     4.18343528E-04   # N_41
  4  2    -9.99752914E-01   # N_42
  4  3    -1.03472675E-02   # N_43
  4  4     1.96689980E-02   # N_44
#
BLOCK UMIX  # Chargino Mixing Matrix U
  1  1    -1.46257893E-02   # U_11
  1  2     9.99893037E-01   # U_12
  2  1     9.99893037E-01   # U_21
  2  2     1.46257893E-02   # U_22
#
BLOCK VMIX  # Chargino Mixing Matrix V
  1  1     2.78148374E-02   # V_11
  1  2    -9.99613093E-01   # V_12
  2  1     9.99613093E-01   # V_21
  2  2     2.78148374E-02   # V_22
#
BLOCK STOPMIX  # Stop Mixing Matrix
  1  1     7.08630391E-01   # cos(theta_t)
  1  2    -7.05579881E-01   # sin(theta_t)
  2  1     7.05579881E-01   # -sin(theta_t)
  2  2     7.08630391E-01   # cos(theta_t)
#
BLOCK SBOTMIX  # Sbottom Mixing Matrix
  1  1    -6.32218210E-01   # cos(theta_b)
  1  2     7.74790381E-01   # sin(theta_b)
  2  1    -7.74790381E-01   # -sin(theta_b)
  2  2    -6.32218210E-01   # cos(theta_b)
#
BLOCK STAUMIX  # Stau Mixing Matrix
  1  1    -7.00661696E-01   # cos(theta_tau)
  1  2     7.13493649E-01   # sin(theta_tau)
  2  1    -7.13493649E-01   # -sin(theta_tau)
  2  2    -7.00661696E-01   # cos(theta_tau)
#
BLOCK ALPHA  # Higgs mixing
          -5.90202339E-01   # Mixing angle in the neutral Higgs boson sector
#
BLOCK HMIX Q=  9.11876000E+01  # DRbar Higgs Parameters
         1    -6.50000000E+02   # mu(Q)               
         2     1.49999979E+00   # tanbeta(Q)          
         3     2.51780069E+02   # vev(Q)              
         4     4.19371663E+06   # MA^2(Q)             
#
BLOCK GAUGE Q=  9.11876000E+01  # The gauge couplings
     1     3.52892747E-01   # gprime(Q) DRbar
     2     6.27874622E-01   # g(Q) DRbar
     3     1.08213319E+00   # g3(Q) DRbar
#
BLOCK AU Q=  9.11876000E+01  # The trilinear couplings
  1  1     0.00000000E+00   # A_u(Q) DRbar
  2  2     0.00000000E+00   # A_c(Q) DRbar
  3  3     0.00000000E+00   # A_t(Q) DRbar
#
BLOCK AD Q=  9.11876000E+01  # The trilinear couplings
  1  1     0.00000000E+00   # A_d(Q) DRbar
  2  2     0.00000000E+00   # A_s(Q) DRbar
  3  3     0.00000000E+00   # A_b(Q) DRbar
#
BLOCK AE Q=  9.11876000E+01  # The trilinear couplings
  1  1     0.00000000E+00   # A_e(Q) DRbar
  2  2     0.00000000E+00   # A_mu(Q) DRbar
  3  3     0.00000000E+00   # A_tau(Q) DRbar
#
BLOCK Yu Q=  9.11876000E+01  # The Yukawa couplings
  1  1     0.00000000E+00   # y_u(Q) DRbar
  2  2     0.00000000E+00   # y_c(Q) DRbar
  3  3     1.02720655E+00   # y_t(Q) DRbar
#
BLOCK Yd Q=  9.11876000E+01  # The Yukawa couplings
  1  1     0.00000000E+00   # y_d(Q) DRbar
  2  2     0.00000000E+00   # y_s(Q) DRbar
  3  3     2.72617761E-02   # y_b(Q) DRbar
#
BLOCK Ye Q=  9.11876000E+01  # The Yukawa couplings
  1  1     0.00000000E+00   # y_e(Q) DRbar
  2  2     0.00000000E+00   # y_mu(Q) DRbar
  3  3     1.79865399E-02   # y_tau(Q) DRbar
#
BLOCK MSOFT Q=  9.11876000E+01  # The soft SUSY breaking masses at the scale Q
         1     6.54299572E+02   # M_1                 
         2     3.00000000E+03   # M_2                 
         3     1.80000000E+03   # M_3                 
        14     0.00000000E+00   # A_u                 
        15     0.00000000E+00   # A_d                 
        16     0.00000000E+00   # A_e                 
        21     2.58760542E+06   # M^2_Hd              
        22    -5.84068820E+06   # M^2_Hu              
        31     5.00000000E+03   # M_eL                
        32     5.00000000E+03   # M_muL               
        33     5.00000000E+03   # M_tauL              
        34     5.00000000E+03   # M_eR                
        35     5.00000000E+03   # M_muR               
        36     5.00000000E+03   # M_tauR              
        41     5.00000000E+03   # M_q1L               
        42     5.00000000E+03   # M_q2L               
        43     5.00000000E+03   # M_q3L               
        44     5.00000000E+03   # M_uR                
        45     5.00000000E+03   # M_cR                
        46     5.00000000E+03   # M_tR                
        47     5.00000000E+03   # M_dR                
        48     5.00000000E+03   # M_sR                
        49     5.00000000E+03   # M_bR                
#
#
#
#                             =================
#                             |The decay table|
#                             =================
#
# - The QCD corrections to the decays gluino -> squark  + quark
#                                     squark -> gaugino + quark_prime
#                                     squark -> squark_prime + Higgs
#                                     squark -> gluino  + quark
#   are included.
#
# - The multi-body decays for the inos, stops and sbottoms are included.
#
# - The loop induced decays for the gluino, neutralinos and stops
#   are included.
#
# - The SUSY decays of the top quark are included.
#
# - Possible decays of the NLSP in GMSB models are included.
#
#
#         PDG            Width
DECAY         6     1.37360540E+00   # top decays
#          BR         NDA      ID1       ID2
     1.00000000E+00    2           5        24   # BR(t ->  b    W+)
#
#         PDG            Width
DECAY   1000021     9.95868075E-04   # gluino decays
#          BR         NDA      ID1       ID2
     9.99343250E-03    2     1000022        21   # BR(~g -> ~chi_10 g)
     1.56262237E-02    2     1000023        21   # BR(~g -> ~chi_20 g)
     5.77161116E-03    2     1000025        21   # BR(~g -> ~chi_30 g)
#          BR         NDA      ID1       ID2
     0.00000000E+00    2     1000039        21   # BR(~g -> ~G      g)
#           BR         NDA      ID1       ID2       ID3
     2.83531986E-03    3     1000022         1        -1   # BR(~g -> ~chi_10 d  db)
     1.79509902E-05    3     1000023         1        -1   # BR(~g -> ~chi_20 d  db)
     5.08240456E-03    3     1000025         1        -1   # BR(~g -> ~chi_30 d  db)
     9.42803645E-03    3     1000022         2        -2   # BR(~g -> ~chi_10 u  ub)
     1.67271628E-05    3     1000023         2        -2   # BR(~g -> ~chi_20 u  ub)
     1.75623192E-02    3     1000025         2        -2   # BR(~g -> ~chi_30 u  ub)
     2.83531986E-03    3     1000022         3        -3   # BR(~g -> ~chi_10 s  sb)
     1.79509902E-05    3     1000023         3        -3   # BR(~g -> ~chi_20 s  sb)
     5.08240456E-03    3     1000025         3        -3   # BR(~g -> ~chi_30 s  sb)
     9.42803645E-03    3     1000022         4        -4   # BR(~g -> ~chi_10 c  cb)
     1.67271628E-05    3     1000023         4        -4   # BR(~g -> ~chi_20 c  cb)
     1.75623192E-02    3     1000025         4        -4   # BR(~g -> ~chi_30 c  cb)
     2.98674161E-03    3     1000022         5        -5   # BR(~g -> ~chi_10 b  bb)
     2.00340115E-04    3     1000023         5        -5   # BR(~g -> ~chi_20 b  bb)
     5.11920140E-03    3     1000025         5        -5   # BR(~g -> ~chi_30 b  bb)
     1.27746469E-01    3     1000022         6        -6   # BR(~g -> ~chi_10 t  tb)
     1.90072052E-01    3     1000023         6        -6   # BR(~g -> ~chi_20 t  tb)
     1.08571036E-01    3     1000025         6        -6   # BR(~g -> ~chi_30 t  tb)
     2.18642919E-05    3     1000024         1        -2   # BR(~g -> ~chi_1+ d  ub)
     2.18642919E-05    3    -1000024         2        -1   # BR(~g -> ~chi_1- u  db)
     2.18642919E-05    3     1000024         3        -4   # BR(~g -> ~chi_1+ s  cb)
     2.18642919E-05    3    -1000024         4        -3   # BR(~g -> ~chi_1- c  sb)
     2.31893022E-01    3     1000024         5        -6   # BR(~g -> ~chi_1+ b  tb)
     2.31893022E-01    3    -1000024         6        -5   # BR(~g -> ~chi_1- t  bb)
#
#         PDG            Width
DECAY   1000006     3.14838342E+02   # stop1 decays
#          BR         NDA      ID1       ID2
     5.44969208E-02    2     1000022         6   # BR(~t_1 -> ~chi_10 t )
     1.06986619E-01    2     1000023         6   # BR(~t_1 -> ~chi_20 t )
     7.55108879E-02    2     1000025         6   # BR(~t_1 -> ~chi_30 t )
     1.32923580E-02    2     1000035         6   # BR(~t_1 -> ~chi_40 t )
     1.06868167E-01    2     1000024         5   # BR(~t_1 -> ~chi_1+ b )
     2.65429144E-02    2     1000037         5   # BR(~t_1 -> ~chi_2+ b )
     6.16302133E-01    2     1000021         6   # BR(~t_1 -> ~g      t )
#
#         PDG            Width
DECAY   2000006     3.26788633E+02   # stop2 decays
#          BR         NDA      ID1       ID2
     9.34273630E-02    2     1000022         6   # BR(~t_2 -> ~chi_10 t )
     1.11565696E-01    2     1000023         6   # BR(~t_2 -> ~chi_20 t )
     2.93427253E-02    2     1000025         6   # BR(~t_2 -> ~chi_30 t )
     1.10605052E-02    2     1000035         6   # BR(~t_2 -> ~chi_40 t )
     1.12110280E-01    2     1000024         5   # BR(~t_2 -> ~chi_1+ b )
     2.20761611E-02    2     1000037         5   # BR(~t_2 -> ~chi_2+ b )
     6.20417270E-01    2     1000021         6   # BR(~t_2 -> ~g      t )
#
#         PDG            Width
DECAY   1000005     2.44564327E+02   # sbottom1 decays
#          BR         NDA      ID1       ID2
     3.22887483E-03    2     1000022         5   # BR(~b_1 -> ~chi_10 b )
     2.11087189E-05    2     1000023         5   # BR(~b_1 -> ~chi_20 b )
     3.81233618E-03    2     1000025         5   # BR(~b_1 -> ~chi_30 b )
     1.45618615E-02    2     1000035         5   # BR(~b_1 -> ~chi_40 b )
     1.37825756E-01    2    -1000024         6   # BR(~b_1 -> ~chi_1- t )
     2.91772759E-02    2    -1000037         6   # BR(~b_1 -> ~chi_2- t )
     8.11372787E-01    2     1000021         5   # BR(~b_1 -> ~g      b )
#
#         PDG            Width
DECAY   2000005     2.49280227E+02   # sbottom2 decays
#          BR         NDA      ID1       ID2
     1.42802224E-03    2     1000022         5   # BR(~b_2 -> ~chi_10 b )
     2.43645808E-04    2     1000023         5   # BR(~b_2 -> ~chi_20 b )
     4.68890239E-03    2     1000025         5   # BR(~b_2 -> ~chi_30 b )
     1.68843649E-02    2     1000035         5   # BR(~b_2 -> ~chi_40 b )
     1.46185185E-01    2    -1000024         6   # BR(~b_2 -> ~chi_1- t )
     3.38277489E-02    2    -1000037         6   # BR(~b_2 -> ~chi_2- t )
     7.96742131E-01    2     1000021         5   # BR(~b_2 -> ~g      b )
#
#         PDG            Width
DECAY   1000002     2.22491259E+02   # sup_L decays
#          BR         NDA      ID1       ID2
     8.99322279E-04    2     1000022         2   # BR(~u_L -> ~chi_10 u)
     1.84006657E-05    2     1000023         2   # BR(~u_L -> ~chi_20 u)
     2.01886296E-03    2     1000025         2   # BR(~u_L -> ~chi_30 u)
     3.49081141E-02    2     1000035         2   # BR(~u_L -> ~chi_40 u)
     1.27165880E-04    2     1000024         1   # BR(~u_L -> ~chi_1+ d)
     6.98076611E-02    2     1000037         1   # BR(~u_L -> ~chi_2+ d)
     8.92220473E-01    2     1000021         2   # BR(~u_L -> ~g      u)
#
#         PDG            Width
DECAY   2000002     2.08779139E+02   # sup_R decays
#          BR         NDA      ID1       ID2
     1.67400162E-02    2     1000022         2   # BR(~u_R -> ~chi_10 u)
     5.45243944E-05    2     1000023         2   # BR(~u_R -> ~chi_20 u)
     3.23687869E-02    2     1000025         2   # BR(~u_R -> ~chi_30 u)
     3.65876202E-09    2     1000035         2   # BR(~u_R -> ~chi_40 u)
     9.50836669E-01    2     1000021         2   # BR(~u_R -> ~g      u)
#
#         PDG            Width
DECAY   1000001     2.22495165E+02   # sdown_L decays
#          BR         NDA      ID1       ID2
     1.06784583E-03    2     1000022         1   # BR(~d_L -> ~chi_10 d)
     6.18765562E-05    2     1000023         1   # BR(~d_L -> ~chi_20 d)
     1.78159790E-03    2     1000025         1   # BR(~d_L -> ~chi_30 d)
     3.49238818E-02    2     1000035         1   # BR(~d_L -> ~chi_40 d)
     3.51617950E-05    2    -1000024         2   # BR(~d_L -> ~chi_1- u)
     6.98564063E-02    2    -1000037         2   # BR(~d_L -> ~chi_2- u)
     8.92273230E-01    2     1000021         1   # BR(~d_L -> ~g      d)
#
#         PDG            Width
DECAY   2000001     2.01085781E+02   # sdown_R decays
#          BR         NDA      ID1       ID2
     4.34518941E-03    2     1000022         1   # BR(~d_R -> ~chi_10 d)
     1.41528435E-05    2     1000023         1   # BR(~d_R -> ~chi_20 d)
     8.40193445E-03    2     1000025         1   # BR(~d_R -> ~chi_30 d)
     9.49732396E-10    2     1000035         1   # BR(~d_R -> ~chi_40 d)
     9.87238722E-01    2     1000021         1   # BR(~d_R -> ~g      d)
#
#         PDG            Width
DECAY   1000004     2.22491259E+02   # scharm_L decays
#          BR         NDA      ID1       ID2
     8.99322279E-04    2     1000022         4   # BR(~c_L -> ~chi_10 c)
     1.84006657E-05    2     1000023         4   # BR(~c_L -> ~chi_20 c)
     2.01886296E-03    2     1000025         4   # BR(~c_L -> ~chi_30 c)
     3.49081141E-02    2     1000035         4   # BR(~c_L -> ~chi_40 c)
     1.27165880E-04    2     1000024         3   # BR(~c_L -> ~chi_1+ s)
     6.98076611E-02    2     1000037         3   # BR(~c_L -> ~chi_2+ s)
     8.92220473E-01    2     1000021         4   # BR(~c_L -> ~g      c)
#
#         PDG            Width
DECAY   2000004     2.08779139E+02   # scharm_R decays
#          BR         NDA      ID1       ID2
     1.67400162E-02    2     1000022         4   # BR(~c_R -> ~chi_10 c)
     5.45243944E-05    2     1000023         4   # BR(~c_R -> ~chi_20 c)
     3.23687869E-02    2     1000025         4   # BR(~c_R -> ~chi_30 c)
     3.65876202E-09    2     1000035         4   # BR(~c_R -> ~chi_40 c)
     9.50836669E-01    2     1000021         4   # BR(~c_R -> ~g      c)
#
#         PDG            Width
DECAY   1000003     2.22495165E+02   # sstrange_L decays
#          BR         NDA      ID1       ID2
     1.06784583E-03    2     1000022         3   # BR(~s_L -> ~chi_10 s)
     6.18765562E-05    2     1000023         3   # BR(~s_L -> ~chi_20 s)
     1.78159790E-03    2     1000025         3   # BR(~s_L -> ~chi_30 s)
     3.49238818E-02    2     1000035         3   # BR(~s_L -> ~chi_40 s)
     3.51617950E-05    2    -1000024         4   # BR(~s_L -> ~chi_1- c)
     6.98564063E-02    2    -1000037         4   # BR(~s_L -> ~chi_2- c)
     8.92273230E-01    2     1000021         3   # BR(~s_L -> ~g      s)
#
#         PDG            Width
DECAY   2000003     2.01085781E+02   # sstrange_R decays
#          BR         NDA      ID1       ID2
     4.34518941E-03    2     1000022         3   # BR(~s_R -> ~chi_10 s)
     1.41528435E-05    2     1000023         3   # BR(~s_R -> ~chi_20 s)
     8.40193445E-03    2     1000025         3   # BR(~s_R -> ~chi_30 s)
     9.49732396E-10    2     1000035         3   # BR(~s_R -> ~chi_40 s)
     9.87238722E-01    2     1000021         3   # BR(~s_R -> ~g      s)
#
#         PDG            Width
DECAY   1000011     3.00607445E+01   # selectron_L decays
#          BR         NDA      ID1       ID2
     6.58416640E-02    2     1000022        11   # BR(~e_L -> ~chi_10 e-)
     3.90071792E-06    2     1000023        11   # BR(~e_L -> ~chi_20 e-)
     1.33774952E-01    2     1000025        11   # BR(~e_L -> ~chi_30 e-)
     2.66569772E-01    2     1000035        11   # BR(~e_L -> ~chi_40 e-)
     2.69660263E-04    2    -1000024        12   # BR(~e_L -> ~chi_1- nu_e)
     5.33540050E-01    2    -1000037        12   # BR(~e_L -> ~chi_2- nu_e)
#
#         PDG            Width
DECAY   2000011     2.39304122E+01   # selectron_R decays
#          BR         NDA      ID1       ID2
     3.40503470E-01    2     1000022        11   # BR(~e_R -> ~chi_10 e-)
     1.10904979E-03    2     1000023        11   # BR(~e_R -> ~chi_20 e-)
     6.58387406E-01    2     1000025        11   # BR(~e_R -> ~chi_30 e-)
     7.41213513E-08    2     1000035        11   # BR(~e_R -> ~chi_40 e-)
#
#         PDG            Width
DECAY   1000013     3.00607445E+01   # smuon_L decays
#          BR         NDA      ID1       ID2
     6.58416640E-02    2     1000022        13   # BR(~mu_L -> ~chi_10 mu-)
     3.90071792E-06    2     1000023        13   # BR(~mu_L -> ~chi_20 mu-)
     1.33774952E-01    2     1000025        13   # BR(~mu_L -> ~chi_30 mu-)
     2.66569772E-01    2     1000035        13   # BR(~mu_L -> ~chi_40 mu-)
     2.69660263E-04    2    -1000024        14   # BR(~mu_L -> ~chi_1- nu_mu)
     5.33540050E-01    2    -1000037        14   # BR(~mu_L -> ~chi_2- nu_mu)
#
#         PDG            Width
DECAY   2000013     2.39304122E+01   # smuon_R decays
#          BR         NDA      ID1       ID2
     3.40503470E-01    2     1000022        13   # BR(~mu_R -> ~chi_10 mu-)
     1.10904979E-03    2     1000023        13   # BR(~mu_R -> ~chi_20 mu-)
     6.58387406E-01    2     1000025        13   # BR(~mu_R -> ~chi_30 mu-)
     7.41213513E-08    2     1000035        13   # BR(~mu_R -> ~chi_40 mu-)
#
#         PDG            Width
DECAY   1000015     2.69704124E+01   # stau_1 decays
#          BR         NDA      ID1       ID2
     1.95779236E-01    2     1000022        15   # BR(~tau_1 -> ~chi_10  tau-)
     2.76002179E-04    2     1000023        15   # BR(~tau_1 -> ~chi_20  tau-)
     3.65671379E-01    2     1000025        15   # BR(~tau_1 -> ~chi_30  tau-)
     1.45969296E-01    2     1000035        15   # BR(~tau_1 -> ~chi_40  tau-)
     1.45869696E-04    2    -1000024        16   # BR(~tau_1 -> ~chi_1-  nu_tau)
     2.92157277E-01    2    -1000037        16   # BR(~tau_1 -> ~chi_2-  nu_tau)
     9.39570116E-07    2     1000039        15   # BR(~tau_1 -> ~G       tau-)
#
#         PDG            Width
DECAY   2000015     2.71140606E+01   # stau_2 decays
#          BR         NDA      ID1       ID2
     1.79572939E-01    2     1000022        15   # BR(~tau_2 -> ~chi_10  tau-)
     1.85267706E-03    2     1000023        15   # BR(~tau_2 -> ~chi_20  tau-)
     3.66015235E-01    2     1000025        15   # BR(~tau_2 -> ~chi_30  tau-)
     1.50344086E-01    2     1000035        15   # BR(~tau_2 -> ~chi_40  tau-)
     1.30058528E-03    2    -1000024        16   # BR(~tau_2 -> ~chi_1-  nu_tau)
     3.00914477E-01    2    -1000037        16   # BR(~tau_2 -> ~chi_2-  nu_tau)
#
#         PDG            Width
DECAY   1000012     3.00589077E+01   # snu_eL decays
#          BR         NDA      ID1       ID2
     6.97189675E-02    2     1000022        12   # BR(~nu_eL -> ~chi_10 nu_e)
     1.00416024E-03    2     1000023        12   # BR(~nu_eL -> ~chi_20 nu_e)
     1.28315819E-01    2     1000025        12   # BR(~nu_eL -> ~chi_30 nu_e)
     2.66795237E-01    2     1000035        12   # BR(~nu_eL -> ~chi_40 nu_e)
     9.75294109E-04    2     1000024        11   # BR(~nu_eL -> ~chi_1+ e-)
     5.33190522E-01    2     1000037        11   # BR(~nu_eL -> ~chi_2+ e-)
#
#         PDG            Width
DECAY   1000014     3.00589077E+01   # snu_muL decays
#          BR         NDA      ID1       ID2
     6.97189675E-02    2     1000022        14   # BR(~nu_muL -> ~chi_10 nu_mu)
     1.00416024E-03    2     1000023        14   # BR(~nu_muL -> ~chi_20 nu_mu)
     1.28315819E-01    2     1000025        14   # BR(~nu_muL -> ~chi_30 nu_mu)
     2.66795237E-01    2     1000035        14   # BR(~nu_muL -> ~chi_40 nu_mu)
     9.75294109E-04    2     1000024        13   # BR(~nu_muL -> ~chi_1+ mu-)
     5.33190522E-01    2     1000037        13   # BR(~nu_muL -> ~chi_2+ mu-)
#
#         PDG            Width
DECAY   1000016     3.00900047E+01   # snu_tauL decays
#          BR         NDA      ID1       ID2
     6.96469154E-02    2     1000022        16   # BR(~nu_tauL -> ~chi_10 nu_tau)
     1.00312248E-03    2     1000023        16   # BR(~nu_tauL -> ~chi_20 nu_tau)
     1.28183210E-01    2     1000025        16   # BR(~nu_tauL -> ~chi_30 nu_tau)
     2.66519513E-01    2     1000035        16   # BR(~nu_tauL -> ~chi_40 nu_tau)
     2.00768799E-03    2     1000024        15   # BR(~nu_tauL -> ~chi_1+ tau-)
     5.32639551E-01    2     1000037        15   # BR(~nu_tauL -> ~chi_2+ tau-)
#
#         PDG            Width
DECAY   1000024     2.10930968E-08   # chargino1+ decays
#          BR         NDA      ID1       ID2
     2.12795534E-02    2     1000039        24   # BR(~chi_1+ -> ~G       W+)
#           BR         NDA      ID1       ID2       ID3
     3.51619960E-01    3     1000022         2        -1   # BR(~chi_1+ -> ~chi_10 u    db)
     3.00944392E-01    3     1000022         4        -3   # BR(~chi_1+ -> ~chi_10 c    sb)
     1.17207341E-01    3     1000022       -11        12   # BR(~chi_1+ -> ~chi_10 e+   nu_e)
     1.17102347E-01    3     1000022       -13        14   # BR(~chi_1+ -> ~chi_10 mu+  nu_mu)
     9.18464077E-02    3     1000022       -15        16   # BR(~chi_1+ -> ~chi_10 tau+ nu_tau)
#
#         PDG            Width
DECAY   1000037     2.40337094E+01   # chargino2+ decays
#          BR         NDA      ID1       ID2
     1.49254282E-01    2     1000024        23   # BR(~chi_2+ -> ~chi_1+  Z )
     9.23054579E-02    2     1000022        24   # BR(~chi_2+ -> ~chi_10  W+)
     1.44990284E-01    2     1000023        24   # BR(~chi_2+ -> ~chi_20  W+)
     5.38261265E-02    2     1000025        24   # BR(~chi_2+ -> ~chi_30  W+)
     1.49713088E-01    2     1000024        25   # BR(~chi_2+ -> ~chi_1+  h )
     1.02170767E-01    2     1000024        35   # BR(~chi_2+ -> ~chi_1+  H )
     1.02772053E-01    2     1000024        36   # BR(~chi_2+ -> ~chi_1+  A )
     6.85258241E-02    2     1000022        37   # BR(~chi_2+ -> ~chi_10  H+)
     1.02302556E-01    2     1000023        37   # BR(~chi_2+ -> ~chi_20  H+)
     3.41394810E-02    2     1000025        37   # BR(~chi_2+ -> ~chi_30  H+)
     8.19914518E-08    2     1000039        24   # BR(~chi_2+ -> ~G       W+)
     1.50921177E-12    2     1000039        37   # BR(~chi_2+ -> ~G       H+)
#
#         PDG            Width
DECAY   1000022     1.0E-05   # neutralino1 decays
#          BR         NDA      ID1       ID2
     4.18442183E-01    2     1000039        22   # BR(~chi_10 -> ~G        gam)
     1.41247261E-01    2     1000039        23   # BR(~chi_10 -> ~G        Z)
     4.40310556E-01    2     1000039        25   # BR(~chi_10 -> ~G        h)
#
#         PDG            Width
DECAY   1000023     1.0E-05   # neutralino2 decays
#          BR         NDA      ID1       ID2
     1.19223585E-02    2     1000022        22   # BR(~chi_20 -> ~chi_10 gam)
#          BR         NDA      ID1       ID2
     8.60860404E-06    2     1000039        22   # BR(~chi_20 -> ~G        gam)
     1.10240351E-02    2     1000039        23   # BR(~chi_20 -> ~G        Z)
     4.02780898E-04    2     1000039        25   # BR(~chi_20 -> ~G        h)
#           BR         NDA      ID1       ID2       ID3
     1.38593197E-01    3     1000022        -2         2   # BR(~chi_20 -> ~chi_10 ub      u)
     1.79429141E-01    3     1000022        -1         1   # BR(~chi_20 -> ~chi_10 db      d)
     1.19356100E-01    3     1000022        -4         4   # BR(~chi_20 -> ~chi_10 cb      c)
     1.78834446E-01    3     1000022        -3         3   # BR(~chi_20 -> ~chi_10 sb      s)
     4.09655364E-02    3     1000022       -11        11   # BR(~chi_20 -> ~chi_10 e+      e-)
     4.09392772E-02    3     1000022       -13        13   # BR(~chi_20 -> ~chi_10 mu+     mu-)
     3.28273798E-02    3     1000022       -15        15   # BR(~chi_20 -> ~chi_10 tau+    tau-)
     8.18036043E-02    3     1000022       -12        12   # BR(~chi_20 -> ~chi_10 nu_eb   nu_e)
     8.18036043E-02    3     1000022       -14        14   # BR(~chi_20 -> ~chi_10 nu_mub  nu_mu)
     8.18036043E-02    3     1000022       -16        16   # BR(~chi_20 -> ~chi_10 nu_taub nu_tau)
     8.62884852E-05    3     1000024        -2         1   # BR(~chi_20 -> ~chi_1+ ub      d)
     8.62884852E-05    3    -1000024        -1         2   # BR(~chi_20 -> ~chi_1- db      u)
     2.87628309E-05    3     1000024       -12        11   # BR(~chi_20 -> ~chi_1+ nu_eb   e-)
     2.87628309E-05    3    -1000024        12       -11   # BR(~chi_20 -> ~chi_1- nu_e    e+)
     2.81120148E-05    3     1000024       -14        13   # BR(~chi_20 -> ~chi_1+ nu_mub  mu-)
     2.81120148E-05    3    -1000024        14       -13   # BR(~chi_20 -> ~chi_1- nu_mu   mu+)
#
#         PDG            Width
DECAY   1000025     1.0E-05   # neutralino3 decays
#          BR         NDA      ID1       ID2
     8.89655498E-01    2     1000022        22   # BR(~chi_30 -> ~chi_10 gam)
     2.01930627E-02    2     1000023        22   # BR(~chi_30 -> ~chi_20 gam)
#          BR         NDA      ID1       ID2
     4.42416027E-04    2     1000039        22   # BR(~chi_30 -> ~G        gam)
     1.33968495E-04    2     1000039        23   # BR(~chi_30 -> ~G        Z)
     1.26628617E-04    2     1000039        25   # BR(~chi_30 -> ~G        h)
#           BR         NDA      ID1       ID2       ID3
     5.84776072E-05    3     1000022        -2         2   # BR(~chi_30 -> ~chi_10 ub      u)
     7.64859154E-05    3     1000022        -1         1   # BR(~chi_30 -> ~chi_10 db      d)
     5.40405926E-05    3     1000022        -4         4   # BR(~chi_30 -> ~chi_10 cb      c)
     7.63898272E-05    3     1000022        -3         3   # BR(~chi_30 -> ~chi_10 sb      s)
     3.16758081E-05    3     1000022        -5         5   # BR(~chi_30 -> ~chi_10 bb      b)
     1.80789593E-05    3     1000022       -11        11   # BR(~chi_30 -> ~chi_10 e+      e-)
     1.80700219E-05    3     1000022       -13        13   # BR(~chi_30 -> ~chi_10 mu+     mu-)
     1.57479564E-05    3     1000022       -15        15   # BR(~chi_30 -> ~chi_10 tau+    tau-)
     3.45490383E-05    3     1000022       -12        12   # BR(~chi_30 -> ~chi_10 nu_eb   nu_e)
     3.45490383E-05    3     1000022       -14        14   # BR(~chi_30 -> ~chi_10 nu_mub  nu_mu)
     3.45490383E-05    3     1000022       -16        16   # BR(~chi_30 -> ~chi_10 nu_taub nu_tau)
     1.76165584E-03    3     1000023        -2         2   # BR(~chi_30 -> ~chi_20 ub      u)
     2.28075565E-03    3     1000023        -1         1   # BR(~chi_30 -> ~chi_20 db      d)
     1.48658245E-03    3     1000023        -4         4   # BR(~chi_30 -> ~chi_20 cb      c)
     2.27225014E-03    3     1000023        -3         3   # BR(~chi_30 -> ~chi_20 sb      s)
     5.20738234E-04    3     1000023       -11        11   # BR(~chi_30 -> ~chi_20 e+      e-)
     5.20363097E-04    3     1000023       -13        13   # BR(~chi_30 -> ~chi_20 mu+     mu-)
     4.03889974E-04    3     1000023       -15        15   # BR(~chi_30 -> ~chi_20 tau+    tau-)
     1.03978716E-03    3     1000023       -12        12   # BR(~chi_30 -> ~chi_20 nu_eb   nu_e)
     1.03978716E-03    3     1000023       -14        14   # BR(~chi_30 -> ~chi_20 nu_mub  nu_mu)
     1.03978716E-03    3     1000023       -16        16   # BR(~chi_30 -> ~chi_20 nu_taub nu_tau)
     1.33465797E-02    3     1000024        -2         1   # BR(~chi_30 -> ~chi_1+ ub      d)
     1.33465797E-02    3    -1000024        -1         2   # BR(~chi_30 -> ~chi_1- db      u)
     1.22059333E-02    3     1000024        -4         3   # BR(~chi_30 -> ~chi_1+ cb      s)
     1.22059333E-02    3    -1000024        -3         4   # BR(~chi_30 -> ~chi_1- sb      c)
     4.44880628E-03    3     1000024       -12        11   # BR(~chi_30 -> ~chi_1+ nu_eb   e-)
     4.44880628E-03    3    -1000024        12       -11   # BR(~chi_30 -> ~chi_1- nu_e    e+)
     4.44653456E-03    3     1000024       -14        13   # BR(~chi_30 -> ~chi_1+ nu_mub  mu-)
     4.44653456E-03    3    -1000024        14       -13   # BR(~chi_30 -> ~chi_1- nu_mu   mu+)
     3.86725383E-03    3     1000024       -16        15   # BR(~chi_30 -> ~chi_1+ nu_taub tau-)
     3.86725383E-03    3    -1000024        16       -15   # BR(~chi_30 -> ~chi_1- nu_tau  tau+)
#
#         PDG            Width
DECAY   1000035     2.40340639E+01   # neutralino4 decays
#          BR         NDA      ID1       ID2
     8.88323385E-02    2     1000022        23   # BR(~chi_40 -> ~chi_10   Z )
     1.31195609E-02    2     1000023        23   # BR(~chi_40 -> ~chi_20   Z )
     4.74961113E-02    2     1000025        23   # BR(~chi_40 -> ~chi_30   Z )
     1.45362468E-01    2     1000024       -24   # BR(~chi_40 -> ~chi_1+   W-)
     1.45362468E-01    2    -1000024        24   # BR(~chi_40 -> ~chi_1-   W+)
     5.86066859E-03    2     1000022        25   # BR(~chi_40 -> ~chi_10   h )
     6.76846563E-02    2     1000022        35   # BR(~chi_40 -> ~chi_10   H )
     6.15277595E-04    2     1000022        36   # BR(~chi_40 -> ~chi_10   A )
     1.36347493E-01    2     1000023        25   # BR(~chi_40 -> ~chi_20   h )
     6.33399670E-04    2     1000023        35   # BR(~chi_40 -> ~chi_20   H )
     1.01885177E-01    2     1000023        36   # BR(~chi_40 -> ~chi_20   A )
     7.71260274E-03    2     1000025        25   # BR(~chi_40 -> ~chi_30   h )
     3.39291818E-02    2     1000025        35   # BR(~chi_40 -> ~chi_30   H )
     1.04673721E-04    2     1000025        36   # BR(~chi_40 -> ~chi_30   A )
     1.02526920E-01    2     1000024       -37   # BR(~chi_40 -> ~chi_1+   H-)
     1.02526920E-01    2    -1000024        37   # BR(~chi_40 -> ~chi_1-   H+)
     1.97019300E-08    2     1000039        22   # BR(~chi_40 -> ~G        gam)
     6.22810747E-08    2     1000039        23   # BR(~chi_40 -> ~G        Z)
     4.57323766E-12    2     1000039        25   # BR(~chi_40 -> ~G        h)
     1.48174387E-12    2     1000039        35   # BR(~chi_40 -> ~G        H)
     2.08143662E-14    2     1000039        36   # BR(~chi_40 -> ~G        A)
#
#         PDG            Width
DECAY        25     4.07993628E-03   # h decays
#          BR         NDA      ID1       ID2
     6.17188397E-01    2           5        -5   # BR(h -> b       bb     )
     6.38385022E-02    2         -15        15   # BR(h -> tau+    tau-   )
     2.25964786E-04    2         -13        13   # BR(h -> mu+     mu-    )
     4.78839766E-04    2           3        -3   # BR(h -> s       sb     )
     2.06581525E-02    2           4        -4   # BR(h -> c       cb     )
     6.70782252E-02    2          21        21   # BR(h -> g       g      )
     2.29877683E-03    2          22        22   # BR(h -> gam     gam    )
     1.53958909E-03    2          22        23   # BR(h -> Z       gam    )
     2.01040296E-01    2          24       -24   # BR(h -> W+      W-     )
     2.56532562E-02    2          23        23   # BR(h -> Z       Z      )
#
#         PDG            Width
DECAY        35     3.88981200E+01   # H decays
#          BR         NDA      ID1       ID2
     1.43747147E-03    2           5        -5   # BR(H -> b       bb     )
     2.39551047E-04    2         -15        15   # BR(H -> tau+    tau-   )
     8.46902136E-07    2         -13        13   # BR(H -> mu+     mu-    )
     1.08433394E-06    2           3        -3   # BR(H -> s       sb     )
     9.78582302E-06    2           4        -4   # BR(H -> c       cb     )
     9.68265565E-01    2           6        -6   # BR(H -> t       tb     )
     7.75380916E-04    2          21        21   # BR(H -> g       g      )
     2.62203092E-06    2          22        22   # BR(H -> gam     gam    )
     1.12719548E-06    2          23        22   # BR(H -> Z       gam    )
     3.25427947E-04    2          24       -24   # BR(H -> W+      W-     )
     1.62270168E-04    2          23        23   # BR(H -> Z       Z      )
     8.79688888E-04    2          25        25   # BR(H -> h       h      )
     8.53645681E-24    2          36        36   # BR(H -> A       A      )
     3.39766053E-11    2          23        36   # BR(H -> Z       A      )
     4.40976928E-12    2          24       -37   # BR(H -> W+      H-     )
     4.40976928E-12    2         -24        37   # BR(H -> W-      H+     )
     4.31195819E-05    2     1000024  -1000024   # BR(H -> ~chi_1+ ~chi_1-)
     1.25038158E-02    2     1000022   1000022   # BR(H -> ~chi_10 ~chi_10)
     1.08157005E-05    2     1000023   1000023   # BR(H -> ~chi_20 ~chi_20)
     1.08467097E-02    2     1000025   1000025   # BR(H -> ~chi_30 ~chi_30)
     1.46929030E-04    2     1000022   1000023   # BR(H -> ~chi_10 ~chi_20)
     2.54190783E-03    2     1000022   1000025   # BR(H -> ~chi_10 ~chi_30)
     1.80588092E-03    2     1000023   1000025   # BR(H -> ~chi_20 ~chi_30)
#
#         PDG            Width
DECAY        36     3.93298963E+01   # A decays
#          BR         NDA      ID1       ID2
     1.44045898E-03    2           5        -5   # BR(A -> b       bb     )
     2.37127917E-04    2         -15        15   # BR(A -> tau+    tau-   )
     8.38332849E-07    2         -13        13   # BR(A -> mu+     mu-    )
     1.10522083E-06    2           3        -3   # BR(A -> s       sb     )
     9.68525882E-06    2           4        -4   # BR(A -> c       cb     )
     9.69322644E-01    2           6        -6   # BR(A -> t       tb     )
     9.17482297E-04    2          21        21   # BR(A -> g       g      )
     3.12651435E-06    2          22        22   # BR(A -> gam     gam    )
     1.31457876E-06    2          23        22   # BR(A -> Z       gam    )
     3.17196353E-04    2          23        25   # BR(A -> Z       h      )
     3.20784472E-04    2     1000024  -1000024   # BR(A -> ~chi_1+ ~chi_1-)
     1.04645019E-03    2     1000022   1000022   # BR(A -> ~chi_10 ~chi_10)
     4.75784892E-04    2     1000023   1000023   # BR(A -> ~chi_20 ~chi_20)
     4.59346226E-04    2     1000025   1000025   # BR(A -> ~chi_30 ~chi_30)
     8.65349921E-03    2     1000022   1000023   # BR(A -> ~chi_10 ~chi_20)
     3.85017152E-04    2     1000022   1000025   # BR(A -> ~chi_10 ~chi_30)
     1.64081387E-02    2     1000023   1000025   # BR(A -> ~chi_20 ~chi_30)
#
#         PDG            Width
DECAY        37     3.85311490E+01   # H+ decays
#          BR         NDA      ID1       ID2
     2.31453596E-06    2           4        -5   # BR(H+ -> c       bb     )
     2.42266200E-04    2         -15        16   # BR(H+ -> tau+    nu_tau )
     8.56498530E-07    2         -13        14   # BR(H+ -> mu+     nu_mu  )
     1.47159397E-08    2           2        -5   # BR(H+ -> u       bb     )
     5.30418916E-08    2           2        -3   # BR(H+ -> u       sb     )
     1.05687973E-05    2           4        -3   # BR(H+ -> c       sb     )
     9.71441092E-01    2           6        -5   # BR(H+ -> t       bb     )
     3.25127735E-04    2          24        25   # BR(H+ -> W+      h      )
     7.19100213E-13    2          24        36   # BR(H+ -> W+      A      )
     9.17594184E-03    2     1000024   1000022   # BR(H+ -> ~chi_1+ ~chi_10)
     4.40635374E-05    2     1000024   1000023   # BR(H+ -> ~chi_1+ ~chi_20)
     1.87577013E-02    2     1000024   1000025   # BR(H+ -> ~chi_1+ ~chi_30)
