#
#                              ======================
#                              | THE SUSYHIT OUTPUT |
#                              ======================
#
#
#              ------------------------------------------------------
#              |     This is the output of the SUSY-HIT package     |
#              |  created by A.Djouadi, M.Muehlleitner and M.Spira. |
#              |  In case of problems with SUSY-HIT email to        |
#              |           margarete.muehlleitner@kit.edu           |
#              |           michael.spira@psi.ch                     |
#              |           abdelhak.djouadi@cern.ch                 |
#              ------------------------------------------------------
#
#              ------------------------------------------------------
#              |  SUSY Les Houches Accord - MSSM Spectrum + Decays  |
#              |              based on the decay programs           |
#              |                                                    |
#              |                     SDECAY 1.5                     |
#              |                                                    |
#              |  Authors: M.Muhlleitner, A.Djouadi and Y.Mambrini  |
#              |  Ref.:    Comput.Phys.Commun.168(2005)46           |
#              |           [hep-ph/0311167]                         |
#              |                                                    |
#              |                     HDECAY 3.4                     |
#              |                                                    |
#              |  By: A.Djouadi,J.Kalinowski,M.Muhlleitner,M.Spira  |
#              |  Ref.:    Comput.Phys.Commun.108(1998)56           |
#              |           [hep-ph/9704448]                         |
#              |                                                    |
#              |                                                    |
#              |  If not stated otherwise all DRbar couplings and   |
#              |  soft SUSY breaking masses are given at the scale  |
#              |  Q=  0.91187600E+02
#              |                                                    |
#              ------------------------------------------------------
#
#
BLOCK DCINFO  # Decay Program information
     1   SDECAY/HDECAY # decay calculator
     2   1.5  /3.4    # version number
#
BLOCK SPINFO  # Spectrum calculator information
     1   SuSpect     # RGE +Spectrum calculator            
     2   2.43         # version number                     
#
BLOCK MODSEL  # Model selection
     1     2   # GMSB                                              
#
BLOCK SMINPUTS  # Standard Model inputs
         1     1.27932904E+02   # alpha_em^-1(M_Z)^MSbar
         2     1.16639000E-05   # G_F [GeV^-2]
         3     1.17200000E-01   # alpha_S(M_Z)^MSbar
         4     9.11870000E+01   # M_Z pole mass
         5     4.25000000E+00   # mb(mb)^MSbar
         6     1.72900000E+02   # mt pole mass
         7     1.77700000E+00   # mtau pole mass
#
BLOCK MINPAR  # Input parameters - minimal models
#
BLOCK EXTPAR  # Input parameters - non-minimal models
         0     9.11876000E+01   # EWSB                
         1     2.19900000E+03   # M_1                 
         2     3.00000000E+03   # M_2                 
         3     2.40000000E+03   # M_3                 
        11     0.00000000E+00   # A_t                 
        12     0.00000000E+00   # A_b                 
        13     0.00000000E+00   # A_tau               
        14     0.00000000E+00   # A_u                 
        15     0.00000000E+00   # A_d                 
        16     0.00000000E+00   # A_e                 
        23     2.22500000E+03   # mu(EWSB)            
        25     1.50000000E+00   # tanbeta(in)         
        26     2.00000000E+03   # MA_pole             
        31     5.00000000E+03   # M_eL                
        32     5.00000000E+03   # M_muL               
        33     5.00000000E+03   # M_tauL              
        34     5.00000000E+03   # M_eR                
        35     5.00000000E+03   # M_muR               
        36     5.00000000E+03   # M_tauR              
        41     5.00000000E+03   # M_q1L               
        42     5.00000000E+03   # M_q2L               
        43     5.00000000E+03   # M_q3L               
        44     5.00000000E+03   # M_uR                
        45     5.00000000E+03   # M_cR                
        46     5.00000000E+03   # M_tR                
        47     5.00000000E+03   # M_dR                
        48     5.00000000E+03   # M_sR                
        49     5.00000000E+03   # M_bR                
#
BLOCK MASS  # Mass Spectrum
# PDG code           mass       particle
        24     8.05424058E+01   # W+
        25     1.26000000E+02   # h
        35     2.00398410E+03   # H
        36     2.00000000E+03   # A
        37     2.00152286E+03   # H+
         5     4.87877839E+00   # b-quark pole mass calculated from mb(mb)_Msbar
   1000001     4.89730069E+03   # ~d_L
   2000001     4.89718995E+03   # ~d_R
   1000002     4.89705305E+03   # ~u_L
   2000002     4.89711149E+03   # ~u_R
   1000003     4.89730069E+03   # ~s_L
   2000003     4.89718995E+03   # ~s_R
   1000004     4.89705305E+03   # ~c_L
   2000004     4.89711149E+03   # ~c_R
   1000005     4.89632178E+03   # ~b_1
   2000005     4.89817018E+03   # ~b_2
   1000006     5.00200712E+03   # ~t_1
   2000006     5.28842825E+03   # ~t_2
   1000011     5.00008213E+03   # ~e_L
   2000011     5.00007619E+03   # ~e_R
   1000012     4.99984168E+03   # ~nu_eL
   1000013     5.00008213E+03   # ~mu_L
   2000013     5.00007619E+03   # ~mu_R
   1000014     4.99984168E+03   # ~nu_muL
   1000015     4.99948572E+03   # ~tau_1
   2000015     5.00067316E+03   # ~tau_2
   1000016     4.99984168E+03   # ~nu_tauL
   1000021     2.41235572E+03   # ~g
   1000022     2.29612826E+03   # ~chi_10
   1000023    -2.35396286E+03   # ~chi_20
   1000025     2.38382760E+03   # ~chi_30
   1000035     3.12475482E+03   # ~chi_40
   1000024     2.34614751E+03   # ~chi_1+
   1000037     3.12473086E+03   # ~chi_2+
   1000039     1.00000000E-09   # ~gravitino
#
BLOCK NMIX  # Neutralino Mixing Matrix
  1  1     7.54874224E-01   # N_11
  1  2    -6.16517274E-02   # N_12
  1  3     4.62862238E-01   # N_13
  1  4    -4.60567605E-01   # N_14
  2  1     1.86253036E-03   # N_21
  2  2    -2.83530341E-03   # N_22
  2  3    -7.07057484E-01   # N_23
  2  4    -7.07147938E-01   # N_24
  3  1     6.55843278E-01   # N_31
  3  2     7.94197976E-02   # N_32
  3  3    -5.30159524E-01   # N_33
  3  4     5.31500678E-01   # N_34
  4  1     5.57060879E-03   # N_41
  4  2    -9.94928903E-01   # N_42
  4  3    -6.89865335E-02   # N_43
  4  4     7.29815401E-02   # N_44
#
BLOCK UMIX  # Chargino Mixing Matrix U
  1  1    -9.72644686E-02   # U_11
  1  2     9.95258571E-01   # U_12
  2  1     9.95258571E-01   # U_21
  2  2     9.72644686E-02   # U_22
#
BLOCK VMIX  # Chargino Mixing Matrix V
  1  1    -1.02904825E-01   # V_11
  1  2     9.94691207E-01   # V_12
  2  1     9.94691207E-01   # V_21
  2  2     1.02904825E-01   # V_22
#
BLOCK STOPMIX  # Stop Mixing Matrix
  1  1     9.99690314E-01   # cos(theta_t)
  1  2     2.48852586E-02   # sin(theta_t)
  2  1    -2.48852586E-02   # -sin(theta_t)
  2  2     9.99690314E-01   # cos(theta_t)
#
BLOCK SBOTMIX  # Sbottom Mixing Matrix
  1  1     6.85597384E-01   # cos(theta_b)
  1  2     7.27980925E-01   # sin(theta_b)
  2  1    -7.27980925E-01   # -sin(theta_b)
  2  2     6.85597384E-01   # cos(theta_b)
#
BLOCK STAUMIX  # Stau Mixing Matrix
  1  1     7.05333351E-01   # cos(theta_tau)
  1  2     7.08875775E-01   # sin(theta_tau)
  2  1    -7.08875775E-01   # -sin(theta_tau)
  2  2     7.05333351E-01   # cos(theta_tau)
#
BLOCK ALPHA  # Higgs mixing
          -5.90193435E-01   # Mixing angle in the neutral Higgs boson sector
#
BLOCK HMIX Q=  9.11876000E+01  # DRbar Higgs Parameters
         1     2.22500000E+03   # mu(Q)               
         2     1.49999979E+00   # tanbeta(Q)          
         3     2.52385886E+02   # vev(Q)              
         4     2.88365862E+06   # MA^2(Q)             
#
BLOCK GAUGE Q=  9.11876000E+01  # The gauge couplings
     1     3.52687388E-01   # gprime(Q) DRbar
     2     6.26570261E-01   # g(Q) DRbar
     3     1.07754704E+00   # g3(Q) DRbar
#
BLOCK AU Q=  9.11876000E+01  # The trilinear couplings
  1  1     0.00000000E+00   # A_u(Q) DRbar
  2  2     0.00000000E+00   # A_c(Q) DRbar
  3  3     0.00000000E+00   # A_t(Q) DRbar
#
BLOCK AD Q=  9.11876000E+01  # The trilinear couplings
  1  1     0.00000000E+00   # A_d(Q) DRbar
  2  2     0.00000000E+00   # A_s(Q) DRbar
  3  3     0.00000000E+00   # A_b(Q) DRbar
#
BLOCK AE Q=  9.11876000E+01  # The trilinear couplings
  1  1     0.00000000E+00   # A_e(Q) DRbar
  2  2     0.00000000E+00   # A_mu(Q) DRbar
  3  3     0.00000000E+00   # A_tau(Q) DRbar
#
BLOCK Yu Q=  9.11876000E+01  # The Yukawa couplings
  1  1     0.00000000E+00   # y_u(Q) DRbar
  2  2     0.00000000E+00   # y_c(Q) DRbar
  3  3     1.02443250E+00   # y_t(Q) DRbar
#
BLOCK Yd Q=  9.11876000E+01  # The Yukawa couplings
  1  1     0.00000000E+00   # y_d(Q) DRbar
  2  2     0.00000000E+00   # y_s(Q) DRbar
  3  3     2.71127700E-02   # y_b(Q) DRbar
#
BLOCK Ye Q=  9.11876000E+01  # The Yukawa couplings
  1  1     0.00000000E+00   # y_e(Q) DRbar
  2  2     0.00000000E+00   # y_mu(Q) DRbar
  3  3     1.79701234E-02   # y_tau(Q) DRbar
#
BLOCK MSOFT Q=  9.11876000E+01  # The soft SUSY breaking masses at the scale Q
         1     2.19900000E+03   # M_1                 
         2     3.00000000E+03   # M_2                 
         3     2.40000000E+03   # M_3                 
        14     0.00000000E+00   # A_u                 
        15     0.00000000E+00   # A_d                 
        16     0.00000000E+00   # A_e                 
        21    -2.49059132E+06   # M^2_Hd              
        22    -9.92064566E+06   # M^2_Hu              
        31     5.00000000E+03   # M_eL                
        32     5.00000000E+03   # M_muL               
        33     5.00000000E+03   # M_tauL              
        34     5.00000000E+03   # M_eR                
        35     5.00000000E+03   # M_muR               
        36     5.00000000E+03   # M_tauR              
        41     5.00000000E+03   # M_q1L               
        42     5.00000000E+03   # M_q2L               
        43     5.00000000E+03   # M_q3L               
        44     5.00000000E+03   # M_uR                
        45     5.00000000E+03   # M_cR                
        46     5.00000000E+03   # M_tR                
        47     5.00000000E+03   # M_dR                
        48     5.00000000E+03   # M_sR                
        49     5.00000000E+03   # M_bR                
#
#
#
#                             =================
#                             |The decay table|
#                             =================
#
# - The QCD corrections to the decays gluino -> squark  + quark
#                                     squark -> gaugino + quark_prime
#                                     squark -> squark_prime + Higgs
#                                     squark -> gluino  + quark
#   are included.
#
# - The multi-body decays for the inos, stops and sbottoms are included.
#
# - The loop induced decays for the gluino, neutralinos and stops
#   are included.
#
# - The SUSY decays of the top quark are included.
#
# - Possible decays of the NLSP in GMSB models are included.
#
#
#         PDG            Width
DECAY         6     1.36778646E+00   # top decays
#          BR         NDA      ID1       ID2
     1.00000000E+00    2           5        24   # BR(t ->  b    W+)
#
#         PDG            Width
DECAY   1000021     9.40905515E-05   # gluino decays
#          BR         NDA      ID1       ID2
     2.42376561E-04    2     1000022        21   # BR(~g -> ~chi_10 g)
     7.55698699E-05    2     1000023        21   # BR(~g -> ~chi_20 g)
     5.08755945E-06    2     1000025        21   # BR(~g -> ~chi_30 g)
#          BR         NDA      ID1       ID2
0.0E+00    2     1000039    21 # BR(~g -> ~G      g)
#           BR         NDA      ID1       ID2       ID3
     3.44034976E-06    3     1000022         1        -1   # BR(~g -> ~chi_10 d  db)
     3.38107442E-12    3     1000023         1        -1   # BR(~g -> ~chi_20 d  db)
     1.70351632E-09    3     1000025         1        -1   # BR(~g -> ~chi_30 d  db)
     9.26557569E-06    3     1000022         2        -2   # BR(~g -> ~chi_10 u  ub)
     2.58731292E-12    3     1000023         2        -2   # BR(~g -> ~chi_20 u  ub)
     7.72500394E-09    3     1000025         2        -2   # BR(~g -> ~chi_30 u  ub)
     3.44034976E-06    3     1000022         3        -3   # BR(~g -> ~chi_10 s  sb)
     3.38107442E-12    3     1000023         3        -3   # BR(~g -> ~chi_20 s  sb)
     1.70351632E-09    3     1000025         3        -3   # BR(~g -> ~chi_30 s  sb)
     9.26557569E-06    3     1000022         4        -4   # BR(~g -> ~chi_10 c  cb)
     2.58731292E-12    3     1000023         4        -4   # BR(~g -> ~chi_20 c  cb)
     7.72500394E-09    3     1000025         4        -4   # BR(~g -> ~chi_30 c  cb)
     3.31499038E-06    3     1000022         5        -5   # BR(~g -> ~chi_10 b  bb)
     3.29089456E-09    3     1000023         5        -5   # BR(~g -> ~chi_20 b  bb)
     1.51089359E-09    3     1000025         5        -5   # BR(~g -> ~chi_30 b  bb)
     3.55750564E-08    3     1000024         1        -2   # BR(~g -> ~chi_1+ d  ub)
     3.55750564E-08    3    -1000024         2        -1   # BR(~g -> ~chi_1- u  db)
     3.55750564E-08    3     1000024         3        -4   # BR(~g -> ~chi_1+ s  cb)
     3.55750564E-08    3    -1000024         4        -3   # BR(~g -> ~chi_1- c  sb)
#
#         PDG            Width
DECAY   1000006     2.23433680E+02   # stop1 decays
#          BR         NDA      ID1       ID2
     4.21974804E-02    2     1000022         6   # BR(~t_1 -> ~chi_10 t )
     9.67592706E-02    2     1000023         6   # BR(~t_1 -> ~chi_20 t )
     5.59150864E-02    2     1000025         6   # BR(~t_1 -> ~chi_30 t )
     3.23484150E-02    2     1000035         6   # BR(~t_1 -> ~chi_40 t )
     4.08520194E-04    2     1000024         5   # BR(~t_1 -> ~chi_1+ b )
     6.27106403E-02    2     1000037         5   # BR(~t_1 -> ~chi_2+ b )
     7.02531038E-01    2     1000021         6   # BR(~t_1 -> ~g      t )
     3.58060253E-03    2     1000005        24   # BR(~t_1 -> ~b_1    W+)
     3.54894636E-03    2     2000005        24   # BR(~t_1 -> ~b_2    W+)
#
#         PDG            Width
DECAY   2000006     2.79654248E+02   # stop2 decays
#          BR         NDA      ID1       ID2
     5.22332677E-02    2     1000022         6   # BR(~t_2 -> ~chi_10 t )
     8.75410130E-02    2     1000023         6   # BR(~t_2 -> ~chi_20 t )
     6.05135614E-02    2     1000025         6   # BR(~t_2 -> ~chi_30 t )
     4.28307685E-04    2     1000035         6   # BR(~t_2 -> ~chi_40 t )
     1.74739402E-01    2     1000024         5   # BR(~t_2 -> ~chi_1+ b )
     8.58697224E-04    2     1000037         5   # BR(~t_2 -> ~chi_2+ b )
     6.22910514E-01    2     1000021         6   # BR(~t_2 -> ~g      t )
     7.72281811E-06    2     1000006        25   # BR(~t_2 -> ~t_1    h )
     1.16301498E-04    2     1000006        23   # BR(~t_2 -> ~t_1    Z )
     3.08488969E-04    2     1000005        24   # BR(~t_2 -> ~b_1    W+)
     3.42723762E-04    2     2000005        24   # BR(~t_2 -> ~b_2    W+)
#
#         PDG            Width
DECAY   1000005     1.79981860E+02   # sbottom1 decays
#          BR         NDA      ID1       ID2
     4.66585971E-03    2     1000022         5   # BR(~b_1 -> ~chi_10 b )
     7.29243106E-05    2     1000023         5   # BR(~b_1 -> ~chi_20 b )
     1.58226183E-03    2     1000025         5   # BR(~b_1 -> ~chi_30 b )
     1.62738655E-02    2     1000035         5   # BR(~b_1 -> ~chi_40 b )
     1.03295417E-01    2    -1000024         6   # BR(~b_1 -> ~chi_1- t )
     3.36020156E-02    2    -1000037         6   # BR(~b_1 -> ~chi_2- t )
     8.40507656E-01    2     1000021         5   # BR(~b_1 -> ~g      b )
#
#         PDG            Width
DECAY   2000005     1.85516699E+02   # sbottom2 decays
#          BR         NDA      ID1       ID2
     2.90403807E-03    2     1000022         5   # BR(~b_2 -> ~chi_10 b )
     8.74560973E-05    2     1000023         5   # BR(~b_2 -> ~chi_20 b )
     2.17386478E-03    2     1000025         5   # BR(~b_2 -> ~chi_30 b )
     1.90825474E-02    2     1000035         5   # BR(~b_2 -> ~chi_40 b )
     1.21430097E-01    2    -1000024         6   # BR(~b_2 -> ~chi_1- t )
     3.94070332E-02    2    -1000037         6   # BR(~b_2 -> ~chi_2- t )
     8.14914963E-01    2     1000021         5   # BR(~b_2 -> ~g      b )
#
#         PDG            Width
DECAY   1000002     1.71302553E+02   # sup_L decays
#          BR         NDA      ID1       ID2
     4.19575777E-04    2     1000022         2   # BR(~u_L -> ~chi_10 u)
     3.93790704E-07    2     1000023         2   # BR(~u_L -> ~chi_20 u)
     2.57288900E-03    2     1000025         2   # BR(~u_L -> ~chi_30 u)
     3.75965931E-02    2     1000035         2   # BR(~u_L -> ~chi_40 u)
     1.35499054E-03    2     1000024         1   # BR(~u_L -> ~chi_1+ d)
     7.53169910E-02    2     1000037         1   # BR(~u_L -> ~chi_2+ d)
     8.82738567E-01    2     1000021         2   # BR(~u_L -> ~g      u)
#
#         PDG            Width
DECAY   2000002     1.57430562E+02   # sup_R decays
#          BR         NDA      ID1       ID2
     2.29062801E-02    2     1000022         2   # BR(~u_R -> ~chi_10 u)
     1.35497091E-07    2     1000023         2   # BR(~u_R -> ~chi_20 u)
     1.65456485E-02    2     1000025         2   # BR(~u_R -> ~chi_30 u)
     7.23926603E-07    2     1000035         2   # BR(~u_R -> ~chi_40 u)
     9.60547212E-01    2     1000021         2   # BR(~u_R -> ~g      u)
#
#         PDG            Width
DECAY   1000001     1.71313005E+02   # sdown_L decays
#          BR         NDA      ID1       ID2
     2.71046705E-03    2     1000022         1   # BR(~d_L -> ~chi_10 d)
     6.46392854E-07    2     1000023         1   # BR(~d_L -> ~chi_20 d)
     1.19501823E-04    2     1000025         1   # BR(~d_L -> ~chi_30 d)
     3.77597146E-02    2     1000035         1   # BR(~d_L -> ~chi_40 d)
     1.21058385E-03    2    -1000024         2   # BR(~d_L -> ~chi_1- u)
     7.54125286E-02    2    -1000037         2   # BR(~d_L -> ~chi_2- u)
     8.82786558E-01    2     1000021         1   # BR(~d_L -> ~g      d)
#
#         PDG            Width
DECAY   2000001     1.52777838E+02   # sdown_R decays
#          BR         NDA      ID1       ID2
     5.90116932E-03    2     1000022         1   # BR(~d_R -> ~chi_10 d)
     3.49071180E-08    2     1000023         1   # BR(~d_R -> ~chi_20 d)
     4.26253631E-03    2     1000025         1   # BR(~d_R -> ~chi_30 d)
     1.86504421E-07    2     1000035         1   # BR(~d_R -> ~chi_40 d)
     9.89836073E-01    2     1000021         1   # BR(~d_R -> ~g      d)
#
#         PDG            Width
DECAY   1000004     1.71302553E+02   # scharm_L decays
#          BR         NDA      ID1       ID2
     4.19575777E-04    2     1000022         4   # BR(~c_L -> ~chi_10 c)
     3.93790704E-07    2     1000023         4   # BR(~c_L -> ~chi_20 c)
     2.57288900E-03    2     1000025         4   # BR(~c_L -> ~chi_30 c)
     3.75965931E-02    2     1000035         4   # BR(~c_L -> ~chi_40 c)
     1.35499054E-03    2     1000024         3   # BR(~c_L -> ~chi_1+ s)
     7.53169910E-02    2     1000037         3   # BR(~c_L -> ~chi_2+ s)
     8.82738567E-01    2     1000021         4   # BR(~c_L -> ~g      c)
#
#         PDG            Width
DECAY   2000004     1.57430562E+02   # scharm_R decays
#          BR         NDA      ID1       ID2
     2.29062801E-02    2     1000022         4   # BR(~c_R -> ~chi_10 c)
     1.35497091E-07    2     1000023         4   # BR(~c_R -> ~chi_20 c)
     1.65456485E-02    2     1000025         4   # BR(~c_R -> ~chi_30 c)
     7.23926603E-07    2     1000035         4   # BR(~c_R -> ~chi_40 c)
     9.60547212E-01    2     1000021         4   # BR(~c_R -> ~g      c)
#
#         PDG            Width
DECAY   1000003     1.71313005E+02   # sstrange_L decays
#          BR         NDA      ID1       ID2
     2.71046705E-03    2     1000022         3   # BR(~s_L -> ~chi_10 s)
     6.46392854E-07    2     1000023         3   # BR(~s_L -> ~chi_20 s)
     1.19501823E-04    2     1000025         3   # BR(~s_L -> ~chi_30 s)
     3.77597146E-02    2     1000035         3   # BR(~s_L -> ~chi_40 s)
     1.21058385E-03    2    -1000024         4   # BR(~s_L -> ~chi_1- c)
     7.54125286E-02    2    -1000037         4   # BR(~s_L -> ~chi_2- c)
     8.82786558E-01    2     1000021         3   # BR(~s_L -> ~g      s)
#
#         PDG            Width
DECAY   2000003     1.52777838E+02   # sstrange_R decays
#          BR         NDA      ID1       ID2
     5.90116932E-03    2     1000022         3   # BR(~s_R -> ~chi_10 s)
     3.49071180E-08    2     1000023         3   # BR(~s_R -> ~chi_20 s)
     4.26253631E-03    2     1000025         3   # BR(~s_R -> ~chi_30 s)
     1.86504421E-07    2     1000035         3   # BR(~s_R -> ~chi_40 s)
     9.89836073E-01    2     1000021         3   # BR(~s_R -> ~g      s)
#
#         PDG            Width
DECAY   1000011     2.56773856E+01   # selectron_L decays
#          BR         NDA      ID1       ID2
     6.24851205E-02    2     1000022        11   # BR(~e_L -> ~chi_10 e-)
     1.47107612E-06    2     1000023        11   # BR(~e_L -> ~chi_20 e-)
     9.13647873E-02    2     1000025        11   # BR(~e_L -> ~chi_30 e-)
     2.77832651E-01    2     1000035        11   # BR(~e_L -> ~chi_40 e-)
     8.74994575E-03    2    -1000024        12   # BR(~e_L -> ~chi_1- nu_e)
     5.59566025E-01    2    -1000037        12   # BR(~e_L -> ~chi_2- nu_e)
#
#         PDG            Width
DECAY   2000011     1.51368211E+01   # selectron_R decays
#          BR         NDA      ID1       ID2
     5.80116590E-01    2     1000022        11   # BR(~e_R -> ~chi_10 e-)
     3.43598232E-06    2     1000023        11   # BR(~e_R -> ~chi_20 e-)
     4.19861131E-01    2     1000025        11   # BR(~e_R -> ~chi_30 e-)
     1.88434688E-05    2     1000035        11   # BR(~e_R -> ~chi_40 e-)
#
#         PDG            Width
DECAY   1000013     2.56773856E+01   # smuon_L decays
#          BR         NDA      ID1       ID2
     6.24851205E-02    2     1000022        13   # BR(~mu_L -> ~chi_10 mu-)
     1.47107612E-06    2     1000023        13   # BR(~mu_L -> ~chi_20 mu-)
     9.13647873E-02    2     1000025        13   # BR(~mu_L -> ~chi_30 mu-)
     2.77832651E-01    2     1000035        13   # BR(~mu_L -> ~chi_40 mu-)
     8.74994575E-03    2    -1000024        14   # BR(~mu_L -> ~chi_1- nu_mu)
     5.59566025E-01    2    -1000037        14   # BR(~mu_L -> ~chi_2- nu_mu)
#
#         PDG            Width
DECAY   2000013     1.51368211E+01   # smuon_R decays
#          BR         NDA      ID1       ID2
     5.80116590E-01    2     1000022        13   # BR(~mu_R -> ~chi_10 mu-)
     3.43598232E-06    2     1000023        13   # BR(~mu_R -> ~chi_20 mu-)
     4.19861131E-01    2     1000025        13   # BR(~mu_R -> ~chi_30 mu-)
     1.88434688E-05    2     1000035        13   # BR(~mu_R -> ~chi_40 mu-)
#
#         PDG            Width
DECAY   1000015     2.04522867E+01   # stau_1 decays
#          BR         NDA      ID1       ID2
     2.60426342E-01    2     1000022        15   # BR(~tau_1 -> ~chi_10  tau-)
     4.13554919E-04    2     1000023        15   # BR(~tau_1 -> ~chi_20  tau-)
     2.09956884E-01    2     1000025        15   # BR(~tau_1 -> ~chi_30  tau-)
     1.72477735E-01    2     1000035        15   # BR(~tau_1 -> ~chi_40  tau-)
     9.16208663E-03    2    -1000024        16   # BR(~tau_1 -> ~chi_1-  nu_tau)
     3.47387576E-01    2    -1000037        16   # BR(~tau_1 -> ~chi_2-  nu_tau)
     1.75821182E-04    2     1000039        15   # BR(~tau_1 -> ~G       tau-)
#
#         PDG            Width
DECAY   2000015     2.04238993E+01   # stau_2 decays
#          BR         NDA      ID1       ID2
     2.48125143E-01    2     1000022        15   # BR(~tau_2 -> ~chi_10  tau-)
     5.42979080E-04    2     1000023        15   # BR(~tau_2 -> ~chi_20  tau-)
     2.16322723E-01    2     1000025        15   # BR(~tau_2 -> ~chi_30  tau-)
     1.76601639E-01    2     1000035        15   # BR(~tau_2 -> ~chi_40  tau-)
     2.77159605E-03    2    -1000024        16   # BR(~tau_2 -> ~chi_1-  nu_tau)
     3.55635919E-01    2    -1000037        16   # BR(~tau_2 -> ~chi_2-  nu_tau)
#
#         PDG            Width
DECAY   1000012     2.56811922E+01   # snu_eL decays
#          BR         NDA      ID1       ID2
     1.12076663E-01    2     1000022        12   # BR(~nu_eL -> ~chi_10 nu_e)
     6.94720403E-06    2     1000023        12   # BR(~nu_eL -> ~chi_20 nu_e)
     3.81076480E-02    2     1000025        12   # BR(~nu_eL -> ~chi_30 nu_e)
     2.81267390E-01    2     1000035        12   # BR(~nu_eL -> ~chi_40 nu_e)
     9.79173270E-03    2     1000024        11   # BR(~nu_eL -> ~chi_1+ e-)
     5.58749619E-01    2     1000037        11   # BR(~nu_eL -> ~chi_2+ e-)
#
#         PDG            Width
DECAY   1000014     2.56811922E+01   # snu_muL decays
#          BR         NDA      ID1       ID2
     1.12076663E-01    2     1000022        14   # BR(~nu_muL -> ~chi_10 nu_mu)
     6.94720403E-06    2     1000023        14   # BR(~nu_muL -> ~chi_20 nu_mu)
     3.81076480E-02    2     1000025        14   # BR(~nu_muL -> ~chi_30 nu_mu)
     2.81267390E-01    2     1000035        14   # BR(~nu_muL -> ~chi_40 nu_mu)
     9.79173270E-03    2     1000024        13   # BR(~nu_muL -> ~chi_1+ mu-)
     5.58749619E-01    2     1000037        13   # BR(~nu_muL -> ~chi_2+ mu-)
#
#         PDG            Width
DECAY   1000016     2.57006423E+01   # snu_tauL decays
#          BR         NDA      ID1       ID2
     1.11991844E-01    2     1000022        16   # BR(~nu_tauL -> ~chi_10 nu_tau)
     6.94194644E-06    2     1000023        16   # BR(~nu_tauL -> ~chi_20 nu_tau)
     3.80788084E-02    2     1000025        16   # BR(~nu_tauL -> ~chi_30 nu_tau)
     2.81054529E-01    2     1000035        16   # BR(~nu_tauL -> ~chi_40 nu_tau)
     1.05348207E-02    2     1000024        15   # BR(~nu_tauL -> ~chi_1+ tau-)
     5.58333056E-01    2     1000037        15   # BR(~nu_tauL -> ~chi_2+ tau-)
#
#         PDG            Width
DECAY   1000024     2.32511579E-04   # chargino1+ decays
#          BR         NDA      ID1       ID2
     1.76910214E-01    2     1000039        24   # BR(~chi_1+ -> ~G       W+)
     9.56703112E-04    2     1000039        37   # BR(~chi_1+ -> ~G       H+)
#           BR         NDA      ID1       ID2       ID3
     2.74232749E-01    3     1000022         2        -1   # BR(~chi_1+ -> ~chi_10 u    db)
     2.74232749E-01    3     1000022         4        -3   # BR(~chi_1+ -> ~chi_10 c    sb)
     9.14109859E-02    3     1000022       -11        12   # BR(~chi_1+ -> ~chi_10 e+   nu_e)
     9.14109859E-02    3     1000022       -13        14   # BR(~chi_1+ -> ~chi_10 mu+  nu_mu)
     9.08456123E-02    3     1000022       -15        16   # BR(~chi_1+ -> ~chi_10 tau+ nu_tau)
#
#         PDG            Width
DECAY   1000037     2.98218751E+01   # chargino2+ decays
#          BR         NDA      ID1       ID2
     2.55430485E-01    2     1000024        23   # BR(~chi_2+ -> ~chi_1+  Z )
     9.72861576E-02    2     1000022        24   # BR(~chi_2+ -> ~chi_10  W+)
     2.45738506E-01    2     1000023        24   # BR(~chi_2+ -> ~chi_20  W+)
     1.52007560E-01    2     1000025        24   # BR(~chi_2+ -> ~chi_30  W+)
     2.49525870E-01    2     1000024        25   # BR(~chi_2+ -> ~chi_1+  h )
     1.14146326E-05    2     1000039        24   # BR(~chi_2+ -> ~G       W+)
     6.82008912E-09    2     1000039        37   # BR(~chi_2+ -> ~G       H+)
#
#         PDG            Width
DECAY   1000022    1.0E-05    # neutralino1 decays
#          BR         NDA      ID1       ID2
     5.02105804E-01    2     1000039        22   # BR(~chi_10 -> ~G        gam)
     4.87163892E-01    2     1000039        23   # BR(~chi_10 -> ~G        Z)
     9.85003079E-03    2     1000039        25   # BR(~chi_10 -> ~G        h)
     8.43946841E-04    2     1000039        35   # BR(~chi_10 -> ~G        H)
     3.63258145E-05    2     1000039        36   # BR(~chi_10 -> ~G        A)
#
#         PDG            Width
DECAY   1000023     3.67272937E-04   # neutralino2 decays
#          BR         NDA      ID1       ID2
     1.25857149E-04    2     1000022        22   # BR(~chi_20 -> ~chi_10 gam)
#          BR         NDA      ID1       ID2
     1.22268282E-08    2     1000039        22   # BR(~chi_20 -> ~G        gam)
     4.33624962E-03    2     1000039        23   # BR(~chi_20 -> ~G        Z)
     1.07778522E-01    2     1000039        25   # BR(~chi_20 -> ~G        h)
     2.44475053E-05    2     1000039        35   # BR(~chi_20 -> ~G        H)
     6.51761777E-04    2     1000039        36   # BR(~chi_20 -> ~G        A)
#           BR         NDA      ID1       ID2       ID3
     1.04843190E-01    3     1000022        -2         2   # BR(~chi_20 -> ~chi_10 ub      u)
     1.35769340E-01    3     1000022        -1         1   # BR(~chi_20 -> ~chi_10 db      d)
     1.04843190E-01    3     1000022        -4         4   # BR(~chi_20 -> ~chi_10 cb      c)
     1.35769340E-01    3     1000022        -3         3   # BR(~chi_20 -> ~chi_10 sb      s)
     1.27069190E-01    3     1000022        -5         5   # BR(~chi_20 -> ~chi_10 bb      b)
     3.10136876E-02    3     1000022       -11        11   # BR(~chi_20 -> ~chi_10 e+      e-)
     3.10136876E-02    3     1000022       -13        13   # BR(~chi_20 -> ~chi_10 mu+     mu-)
     3.07713951E-02    3     1000022       -15        15   # BR(~chi_20 -> ~chi_10 tau+    tau-)
     6.19400819E-02    3     1000022       -12        12   # BR(~chi_20 -> ~chi_10 nu_eb   nu_e)
     6.19400819E-02    3     1000022       -14        14   # BR(~chi_20 -> ~chi_10 nu_mub  nu_mu)
     6.19400819E-02    3     1000022       -16        16   # BR(~chi_20 -> ~chi_10 nu_taub nu_tau)
     2.90234243E-05    3     1000024        -2         1   # BR(~chi_20 -> ~chi_1+ ub      d)
     2.90234243E-05    3    -1000024        -1         2   # BR(~chi_20 -> ~chi_1- db      u)
     2.90234243E-05    3     1000024        -4         3   # BR(~chi_20 -> ~chi_1+ cb      s)
     2.90234243E-05    3    -1000024        -3         4   # BR(~chi_20 -> ~chi_1- sb      c)
     9.67447567E-06    3     1000024       -12        11   # BR(~chi_20 -> ~chi_1+ nu_eb   e-)
     9.67447567E-06    3    -1000024        12       -11   # BR(~chi_20 -> ~chi_1- nu_e    e+)
     9.67447567E-06    3     1000024       -14        13   # BR(~chi_20 -> ~chi_1+ nu_mub  mu-)
     9.67447567E-06    3    -1000024        14       -13   # BR(~chi_20 -> ~chi_1- nu_mu   mu+)
     7.54672275E-06    3     1000024       -16        15   # BR(~chi_20 -> ~chi_1+ nu_taub tau-)
     7.54672275E-06    3    -1000024        16       -15   # BR(~chi_20 -> ~chi_1- nu_tau  tau+)
#
#         PDG            Width
DECAY   1000025     1.86027868E-04   # neutralino3 decays
#          BR         NDA      ID1       ID2
     4.53372907E-04    2     1000022        22   # BR(~chi_30 -> ~chi_10 gam)
     3.08336726E-06    2     1000023        22   # BR(~chi_30 -> ~chi_20 gam)
#          BR         NDA      ID1       ID2
     1.77551669E-01    2     1000039        22   # BR(~chi_30 -> ~G        gam)
     1.58586599E-01    2     1000039        23   # BR(~chi_30 -> ~G        Z)
     5.05851258E-03    2     1000039        25   # BR(~chi_30 -> ~G        h)
     9.55506785E-04    2     1000039        35   # BR(~chi_30 -> ~G        H)
     3.91900950E-05    2     1000039        36   # BR(~chi_30 -> ~G        A)
#           BR         NDA      ID1       ID2       ID3
     2.87055457E-05    3     1000022        -2         2   # BR(~chi_30 -> ~chi_10 ub      u)
     3.47550215E-05    3     1000022        -1         1   # BR(~chi_30 -> ~chi_10 db      d)
     2.87055457E-05    3     1000022        -4         4   # BR(~chi_30 -> ~chi_10 cb      c)
     3.47550215E-05    3     1000022        -3         3   # BR(~chi_30 -> ~chi_10 sb      s)
     1.46035387E-04    3     1000022        -5         5   # BR(~chi_30 -> ~chi_10 bb      b)
     6.38352599E-06    3     1000022       -11        11   # BR(~chi_30 -> ~chi_10 e+      e-)
     6.38352599E-06    3     1000022       -13        13   # BR(~chi_30 -> ~chi_10 mu+     mu-)
     2.32963397E-05    3     1000022       -15        15   # BR(~chi_30 -> ~chi_10 tau+    tau-)
     1.66632820E-05    3     1000022       -12        12   # BR(~chi_30 -> ~chi_10 nu_eb   nu_e)
     1.66632820E-05    3     1000022       -14        14   # BR(~chi_30 -> ~chi_10 nu_mub  nu_mu)
     1.66632820E-05    3     1000022       -16        16   # BR(~chi_30 -> ~chi_10 nu_taub nu_tau)
     8.27525982E-03    3     1000023        -2         2   # BR(~chi_30 -> ~chi_20 ub      u)
     1.07162665E-02    3     1000023        -1         1   # BR(~chi_30 -> ~chi_20 db      d)
     8.27525982E-03    3     1000023        -4         4   # BR(~chi_30 -> ~chi_20 cb      c)
     1.07162665E-02    3     1000023        -3         3   # BR(~chi_30 -> ~chi_20 sb      s)
     8.45976114E-03    3     1000023        -5         5   # BR(~chi_30 -> ~chi_20 bb      b)
     2.44791001E-03    3     1000023       -11        11   # BR(~chi_30 -> ~chi_20 e+      e-)
     2.44791001E-03    3     1000023       -13        13   # BR(~chi_30 -> ~chi_20 mu+     mu-)
     2.39575199E-03    3     1000023       -15        15   # BR(~chi_30 -> ~chi_20 tau+    tau-)
     4.88891038E-03    3     1000023       -12        12   # BR(~chi_30 -> ~chi_20 nu_eb   nu_e)
     4.88891038E-03    3     1000023       -14        14   # BR(~chi_30 -> ~chi_20 nu_mub  nu_mu)
     4.88891038E-03    3     1000023       -16        16   # BR(~chi_30 -> ~chi_20 nu_taub nu_tau)
     9.82186314E-02    3     1000024        -2         1   # BR(~chi_30 -> ~chi_1+ ub      d)
     9.82186314E-02    3    -1000024        -1         2   # BR(~chi_30 -> ~chi_1- db      u)
     9.82186314E-02    3     1000024        -4         3   # BR(~chi_30 -> ~chi_1+ cb      s)
     9.82186314E-02    3    -1000024        -3         4   # BR(~chi_30 -> ~chi_1- sb      c)
     3.27394878E-02    3     1000024       -12        11   # BR(~chi_30 -> ~chi_1+ nu_eb   e-)
     3.27394878E-02    3    -1000024        12       -11   # BR(~chi_30 -> ~chi_1- nu_e    e+)
     3.27394878E-02    3     1000024       -14        13   # BR(~chi_30 -> ~chi_1+ nu_mub  mu-)
     3.27394878E-02    3    -1000024        14       -13   # BR(~chi_30 -> ~chi_1- nu_mu   mu+)
     3.23797313E-02    3     1000024       -16        15   # BR(~chi_30 -> ~chi_1+ nu_taub tau-)
     3.23797313E-02    3    -1000024        16       -15   # BR(~chi_30 -> ~chi_1- nu_tau  tau+)
#
#         PDG            Width
DECAY   1000035     2.98180951E+01   # neutralino4 decays
#          BR         NDA      ID1       ID2
     8.86495784E-05    2     1000022        23   # BR(~chi_40 -> ~chi_10   Z )
     2.52661543E-01    2     1000023        23   # BR(~chi_40 -> ~chi_20   Z )
     1.15970411E-04    2     1000025        23   # BR(~chi_40 -> ~chi_30   Z )
     2.48266418E-01    2     1000024       -24   # BR(~chi_40 -> ~chi_1+   W-)
     2.48266418E-01    2    -1000024        24   # BR(~chi_40 -> ~chi_1-   W+)
     9.76635649E-02    2     1000022        25   # BR(~chi_40 -> ~chi_10   h )
     1.93077589E-04    2     1000023        25   # BR(~chi_40 -> ~chi_20   h )
     1.52732935E-01    2     1000025        25   # BR(~chi_40 -> ~chi_30   h )
     2.68527965E-06    2     1000039        22   # BR(~chi_40 -> ~G        gam)
     8.72748909E-06    2     1000039        23   # BR(~chi_40 -> ~G        Z)
     2.82689662E-09    2     1000039        25   # BR(~chi_40 -> ~G        h)
     6.62496172E-09    2     1000039        35   # BR(~chi_40 -> ~G        H)
     1.99900544E-10    2     1000039        36   # BR(~chi_40 -> ~G        A)
#
#         PDG            Width
DECAY        25     4.22391570E-03   # h decays
#          BR         NDA      ID1       ID2
     6.02442665E-01    2           5        -5   # BR(h -> b       bb     )
     6.21552970E-02    2         -15        15   # BR(h -> tau+    tau-   )
     2.20002654E-04    2         -13        13   # BR(h -> mu+     mu-    )
     4.65483309E-04    2           3        -3   # BR(h -> s       sb     )
     2.00826169E-02    2           4        -4   # BR(h -> c       cb     )
     6.63243847E-02    2          21        21   # BR(h -> g       g      )
     2.30303927E-03    2          22        22   # BR(h -> gam     gam    )
     1.62457095E-03    2          22        23   # BR(h -> Z       gam    )
     2.16337931E-01    2          24       -24   # BR(h -> W+      W-     )
     2.80440091E-02    2          23        23   # BR(h -> Z       Z      )
#
#         PDG            Width
DECAY        35     3.78081635E+01   # H decays
#          BR         NDA      ID1       ID2
     1.46319704E-03    2           5        -5   # BR(H -> b       bb     )
     2.46440011E-04    2         -15        15   # BR(H -> tau+    tau-   )
     8.71257191E-07    2         -13        13   # BR(H -> mu+     mu-    )
     1.11552978E-06    2           3        -3   # BR(H -> s       sb     )
     1.00669667E-05    2           4        -4   # BR(H -> c       cb     )
     9.96079076E-01    2           6        -6   # BR(H -> t       tb     )
     7.97735895E-04    2          21        21   # BR(H -> g       g      )
     2.71887463E-06    2          22        22   # BR(H -> gam     gam    )
     1.16047258E-06    2          23        22   # BR(H -> Z       gam    )
     3.32023364E-04    2          24       -24   # BR(H -> W+      W-     )
     1.65558920E-04    2          23        23   # BR(H -> Z       Z      )
     9.00035325E-04    2          25        25   # BR(H -> h       h      )
     7.06946203E-24    2          36        36   # BR(H -> A       A      )
     2.86496553E-11    2          23        36   # BR(H -> Z       A      )
     6.28062379E-12    2          24       -37   # BR(H -> W+      H-     )
     6.28062379E-12    2         -24        37   # BR(H -> W-      H+     )
#
#         PDG            Width
DECAY        36     3.82378309E+01   # A decays
#          BR         NDA      ID1       ID2
     1.46609954E-03    2           5        -5   # BR(A -> b       bb     )
     2.43900246E-04    2         -15        15   # BR(A -> tau+    tau-   )
     8.62275479E-07    2         -13        13   # BR(A -> mu+     mu-    )
     1.13678573E-06    2           3        -3   # BR(A -> s       sb     )
     9.96186801E-06    2           4        -4   # BR(A -> c       cb     )
     9.97006318E-01    2           6        -6   # BR(A -> t       tb     )
     9.43685421E-04    2          21        21   # BR(A -> g       g      )
     3.12444204E-06    2          22        22   # BR(A -> gam     gam    )
     1.35305620E-06    2          23        22   # BR(A -> Z       gam    )
     3.23557945E-04    2          23        25   # BR(A -> Z       h      )
#
#         PDG            Width
DECAY        37     3.74469956E+01   # H+ decays
#          BR         NDA      ID1       ID2
     2.34680529E-06    2           4        -5   # BR(H+ -> c       bb     )
     2.49240760E-04    2         -15        16   # BR(H+ -> tau+    nu_tau )
     8.81156123E-07    2         -13        14   # BR(H+ -> mu+     nu_mu  )
     1.49196667E-08    2           2        -5   # BR(H+ -> u       bb     )
     5.45700749E-08    2           2        -3   # BR(H+ -> u       sb     )
     1.08732943E-05    2           4        -3   # BR(H+ -> c       sb     )
     9.99404973E-01    2           6        -5   # BR(H+ -> t       bb     )
     3.31615566E-04    2          24        25   # BR(H+ -> W+      h      )
     2.87630480E-13    2          24        36   # BR(H+ -> W+      A      )
