#
#                              ======================
#                              | THE SUSYHIT OUTPUT |
#                              ======================
#
#
#              ------------------------------------------------------
#              |     This is the output of the SUSY-HIT package     |
#              |  created by A.Djouadi, M.Muehlleitner and M.Spira. |
#              |  In case of problems with SUSY-HIT email to        |
#              |           margarete.muehlleitner@kit.edu           |
#              |           michael.spira@psi.ch                     |
#              |           abdelhak.djouadi@cern.ch                 |
#              ------------------------------------------------------
#
#              ------------------------------------------------------
#              |  SUSY Les Houches Accord - MSSM Spectrum + Decays  |
#              |              based on the decay programs           |
#              |                                                    |
#              |                     SDECAY 1.5                     |
#              |                                                    |
#              |  Authors: M.Muhlleitner, A.Djouadi and Y.Mambrini  |
#              |  Ref.:    Comput.Phys.Commun.168(2005)46           |
#              |           [hep-ph/0311167]                         |
#              |                                                    |
#              |                     HDECAY 3.4                     |
#              |                                                    |
#              |  By: A.Djouadi,J.Kalinowski,M.Muhlleitner,M.Spira  |
#              |  Ref.:    Comput.Phys.Commun.108(1998)56           |
#              |           [hep-ph/9704448]                         |
#              |                                                    |
#              |                                                    |
#              |  If not stated otherwise all DRbar couplings and   |
#              |  soft SUSY breaking masses are given at the scale  |
#              |  Q=  0.12808213E+04
#              |                                                    |
#              ------------------------------------------------------
#
#
BLOCK DCINFO  # Decay Program information
     1   SDECAY/HDECAY # decay calculator
     2   1.5  /3.4    # version number
#
BLOCK SPINFO  # Spectrum calculator information
     1    SOFTSUSY    # spectrum calculator                
     2    3.7.3       # version number                     
#
BLOCK MODSEL  # Model selection
     1     0   #  nonUniversal                                     
#
BLOCK SMINPUTS  # Standard Model inputs
         1     1.27934000E+02   # alpha_em^-1(M_Z)^MSbar
         2     1.16639000E-05   # G_F [GeV^-2]
         3     1.17200000E-01   # alpha_S(M_Z)^MSbar
         4     9.11870000E+01   # M_Z pole mass
         5     4.19000000E+00   # mb(mb)^MSbar
         6     1.72500000E+02   # mt pole mass
         7     1.77690000E+00   # mtau pole mass
#
BLOCK MINPAR  # Input parameters - minimal models
         3     2.00000000E+01   # tanb                
#
BLOCK EXTPAR  # Input parameters - non-minimal models
         0    -1.00000000E+00   # Set                 
         1     9.99000000E+01   # M_1(MX)             
         2     1.99900000E+02   # M_2(MX)             
         3     2.20000000E+03   # M_3(MX)             
        11     2.94338000E+03   # At(MX)              
        12     0.00000000E+00   # Ab(MX)              
        13     0.00000000E+00   # Atau(MX)            
        23    -3.00000000E+03   # mu(MX)              
        25     2.00000000E+01   # tan                 
        26     3.00000000E+03   # mA(pole)            
        31     3.00000000E+03   # meL(MX)             
        32     3.00000000E+03   # mmuL(MX)            
        33     3.00000000E+03   # mtauL(MX)           
        34     3.00000000E+03   # meR(MX)             
        35     3.00000000E+03   # mmuR(MX)            
        36     3.00000000E+03   # mtauR(MX)           
        41     3.00000000E+03   # mqL1(MX)            
        42     3.00000000E+03   # mqL2(MX)            
        43     5.49900000E+02   # mqL3(MX)            
        44     3.00000000E+03   # muR(MX)             
        45     3.00000000E+03   # mcR(MX)             
        46     3.00000000E+03   # mtR(MX)             
        47     3.00000000E+03   # mdR(MX)             
        48     3.00000000E+03   # msR(MX)             
        49     3.00000000E+03   # mbR(MX)             
#
BLOCK MASS  # Mass Spectrum
# PDG code           mass       particle
        24     8.03963744E+01   # W+
        25     1.26038165E+02   # h
        35     3.00015766E+03   # H
        36     2.99999998E+03   # A
        37     3.00110357E+03   # H+
         5     4.81337004E+00   # b-quark pole mass calculated from mb(mb)_Msbar
   1000001     3.02636519E+03   # ~d_L
   2000001     3.02090358E+03   # ~d_R
   1000002     3.02544517E+03   # ~u_L
   2000002     3.02377135E+03   # ~u_R
   1000003     3.02636519E+03   # ~s_L
   2000003     3.02090358E+03   # ~s_R
   1000004     3.02544517E+03   # ~c_L
   2000004     3.02377135E+03   # ~c_R
   1000005     6.29558724E+02   # ~b_1
   2000005     3.02144441E+03   # ~b_2
   1000006     6.26249508E+02   # ~t_1
   2000006     3.02051581E+03   # ~t_2
   1000011     3.00721996E+03   # ~e_L
   2000011     3.00027061E+03   # ~e_R
   1000012     3.00582273E+03   # ~nu_eL
   1000013     3.00721996E+03   # ~mu_L
   2000013     3.00027061E+03   # ~mu_R
   1000014     3.00582273E+03   # ~nu_muL
   1000015     2.98624001E+03   # ~tau_1
   2000015     3.02233388E+03   # ~tau_2
   1000016     3.00620423E+03   # ~nu_tauL
   1000021     2.33245713E+03   # ~g
   1000022     1.01222423E+02   # ~chi_10
   1000023     2.16986802E+02   # ~chi_20
   1000025    -3.00478333E+03   # ~chi_30
   1000035     3.00487798E+03   # ~chi_40
   1000024     2.17146165E+02   # ~chi_1+
   1000037     3.00576680E+03   # ~chi_2+
#
BLOCK NMIX  # Neutralino Mixing Matrix
  1  1     9.99891898E-01   # N_11
  1  2     7.64817992E-04   # N_12
  1  3    -1.46815120E-02   # N_13
  1  4     2.45378415E-04   # N_14
  2  1    -3.82351964E-04   # N_21
  2  2     9.99660649E-01   # N_22
  2  3     2.60432722E-02   # N_23
  2  4     4.35224562E-04   # N_24
  3  1     1.02184896E-02   # N_31
  3  2    -1.87170280E-02   # N_32
  3  3     7.06778712E-01   # N_33
  3  4     7.07113221E-01   # N_34
  4  1    -1.05654261E-02   # N_41
  4  2     1.81018108E-02   # N_42
  4  3    -7.06802697E-01   # N_43
  4  4     7.07100165E-01   # N_44
#
BLOCK UMIX  # Chargino Mixing Matrix U
  1  1     9.99322274E-01   # U_11
  1  2     3.68102376E-02   # U_12
  2  1    -3.68102376E-02   # U_21
  2  2     9.99322274E-01   # U_22
#
BLOCK VMIX  # Chargino Mixing Matrix V
  1  1     9.99999812E-01   # V_11
  1  2    -6.13907446E-04   # V_12
  2  1    -6.13907446E-04   # V_21
  2  2    -9.99999812E-01   # V_22
#
BLOCK STOPMIX  # Stop Mixing Matrix
  1  1     9.98627989E-01   # cos(theta_t)
  1  2    -5.23654427E-02   # sin(theta_t)
  2  1     5.23654427E-02   # -sin(theta_t)
  2  2     9.98627989E-01   # cos(theta_t)
#
BLOCK SBOTMIX  # Sbottom Mixing Matrix
  1  1     9.99713794E-01   # cos(theta_b)
  1  2    -2.39234213E-02   # sin(theta_b)
  2  1     2.39234213E-02   # -sin(theta_b)
  2  2     9.99713794E-01   # cos(theta_b)
#
BLOCK STAUMIX  # Stau Mixing Matrix
  1  1    -7.06898248E-01   # cos(theta_tau)
  1  2     7.07315253E-01   # sin(theta_tau)
  2  1    -7.07315253E-01   # -sin(theta_tau)
  2  2    -7.06898248E-01   # cos(theta_tau)
#
BLOCK ALPHA  # Higgs mixing
          -5.00157562E-02   # Mixing angle in the neutral Higgs boson sector
#
BLOCK HMIX Q=  1.28082133E+03  # DRbar Higgs Parameters
         1    -3.00000000E+03   # mu(Q)MSSM           
         2     2.00000000E+01   # tan                 
         3     2.44394054E+02   # higgs               
         4     1.12207519E+07   # mA^2(Q)MSSM         
#
BLOCK GAUGE Q=  1.28082133E+03  # The gauge couplings
     1     3.61618120E-01   # gprime(Q) DRbar
     2     6.39540133E-01   # g(Q) DRbar
     3     1.02988662E+00   # g3(Q) DRbar
#
BLOCK AU Q=  1.28082133E+03  # The trilinear couplings
  1  1     1.53135542E-06   # A_u(Q) DRbar
  2  2     1.53137975E-06   # A_c(Q) DRbar
  3  3     2.94338000E+03   # A_t(Q) DRbar
#
BLOCK AD Q=  1.28082133E+03  # The trilinear couplings
  1  1     5.40492686E-07   # A_d(Q) DRbar
  2  2     5.40558742E-07   # A_s(Q) DRbar
  3  3     1.13298277E-06   # A_b(Q) DRbar
#
BLOCK AE Q=  1.28082133E+03  # The trilinear couplings
  1  1     2.59767318E-07   # A_e(Q) DRbar
  2  2     2.59780348E-07   # A_mu(Q) DRbar
  3  3     2.63500844E-07   # A_tau(Q) DRbar
#
BLOCK Yu Q=  1.28082133E+03  # The Yukawa couplings
  1  1     0.00000000E+00   # y_u(Q) DRbar
  2  2     0.00000000E+00   # y_c(Q) DRbar
  3  3     8.56724115E-01   # y_t(Q) DRbar
#
BLOCK Yd Q=  1.28082133E+03  # The Yukawa couplings
  1  1     0.00000000E+00   # y_d(Q) DRbar
  2  2     0.00000000E+00   # y_s(Q) DRbar
  3  3     4.02073991E-01   # y_b(Q) DRbar
#
BLOCK Ye Q=  1.28082133E+03  # The Yukawa couplings
  1  1     0.00000000E+00   # y_e(Q) DRbar
  2  2     0.00000000E+00   # y_mu(Q) DRbar
  3  3     2.03244189E-01   # y_tau(Q) DRbar
#
BLOCK MSOFT Q=  1.28082133E+03  # The soft SUSY breaking masses at the scale Q
         1     9.99000000E+01   # M_1(Q)              
         2     1.99900000E+02   # M_2(Q)              
         3     2.20000000E+03   # M_3(Q)              
        21    -5.53060961E+04   # M^2_Hd              
        22    -9.12750196E+06   # M^2_Hu              
        31     3.00000000E+03   # M_eL                
        32     3.00000000E+03   # M_muL               
        33     3.00000000E+03   # M_tauL              
        34     3.00000000E+03   # M_eR                
        35     3.00000000E+03   # M_muR               
        36     3.00000000E+03   # M_tauR              
        41     3.00000000E+03   # M_q1L               
        42     3.00000000E+03   # M_q2L               
        43     5.49899993E+02   # M_q3L               
        44     3.00000000E+03   # M_uR                
        45     3.00000000E+03   # M_cR                
        46     3.00000000E+03   # M_tR                
        47     3.00000000E+03   # M_dR                
        48     3.00000000E+03   # M_sR                
        49     3.00000000E+03   # M_bR                
#
#
#
#                             =================
#                             |The decay table|
#                             =================
#
# - The QCD corrections to the decays gluino -> squark  + quark
#                                     squark -> gaugino + quark_prime
#                                     squark -> squark_prime + Higgs
#                                     squark -> gluino  + quark
#   are included.
#
# - The multi-body decays for the inos, stops and sbottoms are included.
#
# - The loop induced decays for the gluino, neutralinos and stops
#   are included.
#
# - The SUSY decays of the top quark are included.
#
#
#         PDG            Width
DECAY         6     1.41991792E+00   # top decays
#          BR         NDA      ID1       ID2
     1.00000000E+00    2           5        24   # BR(t ->  b    W+)
#
#         PDG            Width
DECAY   1000021     8.04704486E+01   # gluino decays
#          BR         NDA      ID1       ID2
     2.48055457E-01    2     1000005        -5   # BR(~g -> ~b_1  bb)
     2.48055457E-01    2    -1000005         5   # BR(~g -> ~b_1* b )
     2.51944543E-01    2     1000006        -6   # BR(~g -> ~t_1  tb)
     2.51944543E-01    2    -1000006         6   # BR(~g -> ~t_1* t )
#
#         PDG            Width
DECAY   1000006     5.89843549E+00   # stop1 decays
#          BR         NDA      ID1       ID2
     1.31972558E-02    2     1000022         6   # BR(~t_1 -> ~chi_10 t )
     2.87876841E-01    2     1000023         6   # BR(~t_1 -> ~chi_20 t )
     6.98925903E-01    2     1000024         5   # BR(~t_1 -> ~chi_1+ b )
#
#         PDG            Width
DECAY   2000006     1.21525383E+02   # stop2 decays
#          BR         NDA      ID1       ID2
     5.41601648E-02    2     1000022         6   # BR(~t_2 -> ~chi_10 t )
     2.41680033E-04    2     1000023         6   # BR(~t_2 -> ~chi_20 t )
     0.00000000E+00    2     1000025         6   # BR(~t_2 -> ~chi_30 t )
     4.86340928E-04    2     1000024         5   # BR(~t_2 -> ~chi_1+ b )
     3.63908274E-05    2     1000037         5   # BR(~t_2 -> ~chi_2+ b )
     2.87536376E-01    2     1000021         6   # BR(~t_2 -> ~g      t )
     1.71372414E-01    2     1000006        25   # BR(~t_2 -> ~t_1    h )
     1.63674720E-01    2     1000006        23   # BR(~t_2 -> ~t_1    Z )
     3.22491913E-01    2     1000005        24   # BR(~t_2 -> ~b_1    W+)
#
#         PDG            Width
DECAY   1000005     5.61480905E+00   # sbottom1 decays
#          BR         NDA      ID1       ID2
     1.62162600E-02    2     1000022         5   # BR(~b_1 -> ~chi_10 b )
     3.71115125E-01    2     1000023         5   # BR(~b_1 -> ~chi_20 b )
     6.12668615E-01    2    -1000024         6   # BR(~b_1 -> ~chi_1- t )
#
#         PDG            Width
DECAY   2000005     5.69199052E+01   # sbottom2 decays
#          BR         NDA      ID1       ID2
     2.90733780E-02    2     1000022         5   # BR(~b_2 -> ~chi_10 b )
    -5.23412115E-08    2     1000023         5   # BR(~b_2 -> ~chi_20 b )
     1.10172132E-05    2     1000025         5   # BR(~b_2 -> ~chi_30 b )
     1.05463334E-05    2     1000035         5   # BR(~b_2 -> ~chi_40 b )
    -1.71887770E-07    2    -1000024         6   # BR(~b_2 -> ~chi_1- t )
     6.19072948E-01    2     1000021         5   # BR(~b_2 -> ~g      b )
     7.79494399E-02    2     1000005        25   # BR(~b_2 -> ~b_1    h )
     1.11290947E-01    2     1000005        23   # BR(~b_2 -> ~b_1    Z )
     1.62591947E-01    2     1000006       -24   # BR(~b_2 -> ~t_1    W-)
#
#         PDG            Width
DECAY   1000002     7.07515533E+01   # sup_L decays
#          BR         NDA      ID1       ID2
     5.91249721E-03    2     1000022         2   # BR(~u_L -> ~chi_10 u)
     1.63821554E-01    2     1000023         2   # BR(~u_L -> ~chi_20 u)
     1.02803130E-08    2     1000025         2   # BR(~u_L -> ~chi_30 u)
     9.37954511E-09    2     1000035         2   # BR(~u_L -> ~chi_40 u)
     3.27908173E-01    2     1000024         1   # BR(~u_L -> ~chi_1+ d)
     2.49936428E-11    2     1000037         1   # BR(~u_L -> ~chi_2+ d)
     5.02357756E-01    2     1000021         2   # BR(~u_L -> ~g      u)
#
#         PDG            Width
DECAY   2000002     4.20430446E+01   # sup_R decays
#          BR         NDA      ID1       ID2
     1.57821647E-01    2     1000022         2   # BR(~u_R -> ~chi_10 u)
     2.29132785E-08    2     1000023         2   # BR(~u_R -> ~chi_20 u)
     3.09076398E-09    2     1000025         2   # BR(~u_R -> ~chi_30 u)
     3.27218693E-09    2     1000035         2   # BR(~u_R -> ~chi_40 u)
     8.42178324E-01    2     1000021         2   # BR(~u_R -> ~g      u)
#
#         PDG            Width
DECAY   1000001     7.08021255E+01   # sdown_L decays
#          BR         NDA      ID1       ID2
     5.81496418E-03    2     1000022         1   # BR(~d_L -> ~chi_10 d)
     1.63803953E-01    2     1000023         1   # BR(~d_L -> ~chi_20 d)
     1.68968599E-08    2     1000025         1   # BR(~d_L -> ~chi_30 d)
     1.58723089E-08    2     1000035         1   # BR(~d_L -> ~chi_40 d)
     3.27334401E-01    2    -1000024         2   # BR(~d_L -> ~chi_1- u)
     9.81248241E-08    2    -1000037         2   # BR(~d_L -> ~chi_2- u)
     5.03046552E-01    2     1000021         1   # BR(~d_L -> ~g      d)
#
#         PDG            Width
DECAY   2000001     3.68341880E+01   # sdown_R decays
#          BR         NDA      ID1       ID2
     4.49908181E-02    2     1000022         1   # BR(~d_R -> ~chi_10 d)
     6.53188213E-09    2     1000023         1   # BR(~d_R -> ~chi_20 d)
     6.41601198E-10    2     1000025         1   # BR(~d_R -> ~chi_30 d)
     6.78079016E-10    2     1000035         1   # BR(~d_R -> ~chi_40 d)
     9.55009174E-01    2     1000021         1   # BR(~d_R -> ~g      d)
#
#         PDG            Width
DECAY   1000004     7.07515533E+01   # scharm_L decays
#          BR         NDA      ID1       ID2
     5.91249721E-03    2     1000022         4   # BR(~c_L -> ~chi_10 c)
     1.63821554E-01    2     1000023         4   # BR(~c_L -> ~chi_20 c)
     1.02803130E-08    2     1000025         4   # BR(~c_L -> ~chi_30 c)
     9.37954511E-09    2     1000035         4   # BR(~c_L -> ~chi_40 c)
     3.27908173E-01    2     1000024         3   # BR(~c_L -> ~chi_1+ s)
     2.49936428E-11    2     1000037         3   # BR(~c_L -> ~chi_2+ s)
     5.02357756E-01    2     1000021         4   # BR(~c_L -> ~g      c)
#
#         PDG            Width
DECAY   2000004     4.20430446E+01   # scharm_R decays
#          BR         NDA      ID1       ID2
     1.57821647E-01    2     1000022         4   # BR(~c_R -> ~chi_10 c)
     2.29132785E-08    2     1000023         4   # BR(~c_R -> ~chi_20 c)
     3.09076398E-09    2     1000025         4   # BR(~c_R -> ~chi_30 c)
     3.27218693E-09    2     1000035         4   # BR(~c_R -> ~chi_40 c)
     8.42178324E-01    2     1000021         4   # BR(~c_R -> ~g      c)
#
#         PDG            Width
DECAY   1000003     7.08021255E+01   # sstrange_L decays
#          BR         NDA      ID1       ID2
     5.81496418E-03    2     1000022         3   # BR(~s_L -> ~chi_10 s)
     1.63803953E-01    2     1000023         3   # BR(~s_L -> ~chi_20 s)
     1.68968599E-08    2     1000025         3   # BR(~s_L -> ~chi_30 s)
     1.58723089E-08    2     1000035         3   # BR(~s_L -> ~chi_40 s)
     3.27334401E-01    2    -1000024         4   # BR(~s_L -> ~chi_1- c)
     9.81248241E-08    2    -1000037         4   # BR(~s_L -> ~chi_2- c)
     5.03046552E-01    2     1000021         3   # BR(~s_L -> ~g      s)
#
#         PDG            Width
DECAY   2000003     3.68341880E+01   # sstrange_R decays
#          BR         NDA      ID1       ID2
     4.49908181E-02    2     1000022         3   # BR(~s_R -> ~chi_10 s)
     6.53188213E-09    2     1000023         3   # BR(~s_R -> ~chi_20 s)
     6.41601198E-10    2     1000025         3   # BR(~s_R -> ~chi_30 s)
     6.78079016E-10    2     1000035         3   # BR(~s_R -> ~chi_40 s)
     9.55009174E-01    2     1000021         3   # BR(~s_R -> ~g      s)
#
#         PDG            Width
DECAY   1000011     4.01894713E+01   # selectron_L decays
#          BR         NDA      ID1       ID2
     9.73529391E-02    2     1000022        11   # BR(~e_L -> ~chi_10 e-)
     3.00934487E-01    2     1000023        11   # BR(~e_L -> ~chi_20 e-)
     1.33738461E-10    2     1000025        11   # BR(~e_L -> ~chi_30 e-)
     1.08544305E-10    2     1000035        11   # BR(~e_L -> ~chi_40 e-)
     6.01712573E-01    2    -1000024        12   # BR(~e_L -> ~chi_1- nu_e)
     7.70198162E-10    2    -1000037        12   # BR(~e_L -> ~chi_2- nu_e)
#
#         PDG            Width
DECAY   2000011     1.55717662E+01   # selectron_R decays
#          BR         NDA      ID1       ID2
     9.99999855E-01    2     1000022        11   # BR(~e_R -> ~chi_10 e-)
     1.45028918E-07    2     1000023        11   # BR(~e_R -> ~chi_20 e-)
#
#         PDG            Width
DECAY   1000013     4.01894713E+01   # smuon_L decays
#          BR         NDA      ID1       ID2
     9.73529391E-02    2     1000022        13   # BR(~mu_L -> ~chi_10 mu-)
     3.00934487E-01    2     1000023        13   # BR(~mu_L -> ~chi_20 mu-)
     1.33738461E-10    2     1000025        13   # BR(~mu_L -> ~chi_30 mu-)
     1.08544305E-10    2     1000035        13   # BR(~mu_L -> ~chi_40 mu-)
     6.01712573E-01    2    -1000024        14   # BR(~mu_L -> ~chi_1- nu_mu)
     7.70198162E-10    2    -1000037        14   # BR(~mu_L -> ~chi_2- nu_mu)
#
#         PDG            Width
DECAY   2000013     1.55717662E+01   # smuon_R decays
#          BR         NDA      ID1       ID2
     9.99999855E-01    2     1000022        13   # BR(~mu_R -> ~chi_10 mu-)
     1.45028918E-07    2     1000023        13   # BR(~mu_R -> ~chi_20 mu-)
#
#         PDG            Width
DECAY   1000015     2.81643604E+01   # stau_1 decays
#          BR         NDA      ID1       ID2
     3.45850908E-01    2     1000022        15   # BR(~tau_1 -> ~chi_10  tau-)
     2.18110119E-01    2     1000023        15   # BR(~tau_1 -> ~chi_20  tau-)
     4.36038973E-01    2    -1000024        16   # BR(~tau_1 -> ~chi_1-  nu_tau)
#
#         PDG            Width
DECAY   2000015     2.75804092E+01   # stau_2 decays
#          BR         NDA      ID1       ID2
     3.53918642E-01    2     1000022        15   # BR(~tau_2 -> ~chi_10  tau-)
     2.15408622E-01    2     1000023        15   # BR(~tau_2 -> ~chi_20  tau-)
     7.12666516E-06    2     1000025        15   # BR(~tau_2 -> ~chi_30  tau-)
     5.74647934E-06    2     1000035        15   # BR(~tau_2 -> ~chi_40  tau-)
     4.30653172E-01    2    -1000024        16   # BR(~tau_2 -> ~chi_1-  nu_tau)
     6.69000021E-06    2    -1000037        16   # BR(~tau_2 -> ~chi_2-  nu_tau)
#
#         PDG            Width
DECAY   1000012     4.01925816E+01   # snu_eL decays
#          BR         NDA      ID1       ID2
     9.67748963E-02    2     1000022        12   # BR(~nu_eL -> ~chi_10 nu_e)
     3.01028760E-01    2     1000023        12   # BR(~nu_eL -> ~chi_20 nu_e)
     8.72878123E-11    2     1000025        12   # BR(~nu_eL -> ~chi_30 nu_e)
     6.96703008E-11    2     1000035        12   # BR(~nu_eL -> ~chi_40 nu_e)
     6.02196344E-01    2     1000024        11   # BR(~nu_eL -> ~chi_1+ e-)
     3.17617070E-16    2     1000037        11   # BR(~nu_eL -> ~chi_2+ e-)
#
#         PDG            Width
DECAY   1000014     4.01925816E+01   # snu_muL decays
#          BR         NDA      ID1       ID2
     9.67748963E-02    2     1000022        14   # BR(~nu_muL -> ~chi_10 nu_mu)
     3.01028760E-01    2     1000023        14   # BR(~nu_muL -> ~chi_20 nu_mu)
     8.72878123E-11    2     1000025        14   # BR(~nu_muL -> ~chi_30 nu_mu)
     6.96703008E-11    2     1000035        14   # BR(~nu_muL -> ~chi_40 nu_mu)
     6.02196344E-01    2     1000024        13   # BR(~nu_muL -> ~chi_1+ mu-)
     3.17617070E-16    2     1000037        13   # BR(~nu_muL -> ~chi_2+ mu-)
#
#         PDG            Width
DECAY   1000016     4.02011260E+01   # snu_tauL decays
#          BR         NDA      ID1       ID2
     9.67666637E-02    2     1000022        16   # BR(~nu_tauL -> ~chi_10 nu_tau)
     3.01003778E-01    2     1000023        16   # BR(~nu_tauL -> ~chi_20 nu_tau)
     1.63046948E-10    2     1000025        16   # BR(~nu_tauL -> ~chi_30 nu_tau)
     1.37234132E-10    2     1000035        16   # BR(~nu_tauL -> ~chi_40 nu_tau)
     6.02229558E-01    2     1000024        15   # BR(~nu_tauL -> ~chi_1+ tau-)
#
#         PDG            Width
DECAY   1000024     1.11928629E-06   # chargino1+ decays
#          BR         NDA      ID1       ID2
     1.00000000E+00    2     1000022        24   # BR(~chi_1+ -> ~chi_10  W+)
#
#         PDG            Width
DECAY   1000037     9.84057141E+01   # chargino2+ decays
#          BR         NDA      ID1       ID2
     1.46467534E-01    2     1000006        -5   # BR(~chi_2+ -> ~t_1     bb)
     6.56616582E-01    2    -1000005         6   # BR(~chi_2+ -> ~b_1*    t )
     8.22159319E-07    2    -1000015        16   # BR(~chi_2+ -> ~tau_1+  nu_tau)
     5.93581992E-02    2     1000024        23   # BR(~chi_2+ -> ~chi_1+  Z )
     1.87382120E-02    2     1000022        24   # BR(~chi_2+ -> ~chi_10  W+)
     5.78772999E-02    2     1000023        24   # BR(~chi_2+ -> ~chi_20  W+)
     6.09413509E-02    2     1000024        25   # BR(~chi_2+ -> ~chi_1+  h )
#
#         PDG            Width
DECAY   1000022     0.00000000E+00   # neutralino1 decays
#
#         PDG            Width
DECAY   1000023     2.80539147E-07   # neutralino2 decays
#          BR         NDA      ID1       ID2
     1.00000000E+00    2     1000022        23   # BR(~chi_20 -> ~chi_10   Z )
#
#         PDG            Width
DECAY   1000025     9.84594403E+01   # neutralino3 decays
#          BR         NDA      ID1       ID2
     9.86628194E-03    2     1000022        23   # BR(~chi_30 -> ~chi_10   Z )
     2.86765735E-02    2     1000023        23   # BR(~chi_30 -> ~chi_20   Z )
     5.78840380E-02    2     1000024       -24   # BR(~chi_30 -> ~chi_1+   W-)
     5.78840380E-02    2    -1000024        24   # BR(~chi_30 -> ~chi_1-   W+)
     8.27894254E-03    2     1000022        25   # BR(~chi_30 -> ~chi_10   h )
     2.38313718E-02    2     1000023        25   # BR(~chi_30 -> ~chi_20   h )
     3.34423500E-01    2     1000006        -6   # BR(~chi_30 -> ~t_1      tb)
     3.34423500E-01    2    -1000006         6   # BR(~chi_30 -> ~t_1*     t )
     7.23649207E-02    2     1000005        -5   # BR(~chi_30 -> ~b_1      bb)
     7.23649207E-02    2    -1000005         5   # BR(~chi_30 -> ~b_1*     b )
     7.46822996E-11    2     2000011       -11   # BR(~chi_30 -> ~e_R-     e+)
     7.46822996E-11    2    -2000011        11   # BR(~chi_30 -> ~e_R+     e-)
     7.46822996E-11    2     2000013       -13   # BR(~chi_30 -> ~mu_R-    mu+)
     7.46822996E-11    2    -2000013        13   # BR(~chi_30 -> ~mu_R+    mu-)
     9.56532082E-07    2     1000015       -15   # BR(~chi_30 -> ~tau_1-   tau+)
     9.56532082E-07    2    -1000015        15   # BR(~chi_30 -> ~tau_1+   tau-)
#
#         PDG            Width
DECAY   1000035     9.87837751E+01   # neutralino4 decays
#          BR         NDA      ID1       ID2
     9.20254380E-03    2     1000022        23   # BR(~chi_40 -> ~chi_10   Z )
     3.05890897E-02    2     1000023        23   # BR(~chi_40 -> ~chi_20   Z )
     5.76912800E-02    2     1000024       -24   # BR(~chi_40 -> ~chi_1+   W-)
     5.76912800E-02    2    -1000024        24   # BR(~chi_40 -> ~chi_1-   W+)
     1.15366061E-02    2     1000022        25   # BR(~chi_40 -> ~chi_10   h )
     3.87746336E-02    2     1000023        25   # BR(~chi_40 -> ~chi_20   h )
     3.25116361E-01    2     1000006        -6   # BR(~chi_40 -> ~t_1      tb)
     3.25116361E-01    2    -1000006         6   # BR(~chi_40 -> ~t_1*     t )
     7.21401260E-02    2     1000005        -5   # BR(~chi_40 -> ~b_1      bb)
     7.21401260E-02    2    -1000005         5   # BR(~chi_40 -> ~b_1*     b )
     8.29453606E-11    2     2000011       -11   # BR(~chi_40 -> ~e_R-     e+)
     8.29453606E-11    2    -2000011        11   # BR(~chi_40 -> ~e_R+     e-)
     8.29453606E-11    2     2000013       -13   # BR(~chi_40 -> ~mu_R-    mu+)
     8.29453606E-11    2    -2000013        13   # BR(~chi_40 -> ~mu_R+    mu-)
     7.95791051E-07    2     1000015       -15   # BR(~chi_40 -> ~tau_1-   tau+)
     7.95791051E-07    2    -1000015        15   # BR(~chi_40 -> ~tau_1+   tau-)
#
#         PDG            Width
DECAY        25     3.77068503E-03   # h decays
#          BR         NDA      ID1       ID2
     5.48293370E-01    2           5        -5   # BR(h -> b       bb     )
     6.93432954E-02    2         -15        15   # BR(h -> tau+    tau-   )
     2.45472451E-04    2         -13        13   # BR(h -> mu+     mu-    )
     5.20179852E-04    2           3        -3   # BR(h -> s       sb     )
     2.26018637E-02    2           4        -4   # BR(h -> c       cb     )
     7.44998437E-02    2          21        21   # BR(h -> g       g      )
     2.58330444E-03    2          22        22   # BR(h -> gam     gam    )
     1.81613492E-03    2          22        23   # BR(h -> Z       gam    )
     2.48534252E-01    2          24       -24   # BR(h -> W+      W-     )
     3.15622833E-02    2          23        23   # BR(h -> Z       Z      )
#
#         PDG            Width
DECAY        35     4.06767709E+01   # H decays
#          BR         NDA      ID1       ID2
     9.08051877E-01    2           5        -5   # BR(H -> b       bb     )
     6.11362918E-02    2         -15        15   # BR(H -> tau+    tau-   )
     2.16163318E-04    2         -13        13   # BR(H -> mu+     mu-    )
     2.65448357E-04    2           3        -3   # BR(H -> s       sb     )
     7.44078187E-08    2           4        -4   # BR(H -> c       cb     )
     7.42266054E-03    2           6        -6   # BR(H -> t       tb     )
     4.84142456E-06    2          21        21   # BR(H -> g       g      )
     3.98483870E-08    2          22        22   # BR(H -> gam     gam    )
     3.03743691E-09    2          23        22   # BR(H -> Z       gam    )
     7.13721894E-07    2          24       -24   # BR(H -> W+      W-     )
     3.56420784E-07    2          23        23   # BR(H -> Z       Z      )
     4.94637856E-06    2          25        25   # BR(H -> h       h      )
     1.64765868E-25    2          36        36   # BR(H -> A       A      )
     2.55440900E-18    2          23        36   # BR(H -> Z       A      )
     8.20726302E-04    2     1000024  -1000024   # BR(H -> ~chi_1+ ~chi_1-)
     3.80966635E-05    2     1000022   1000022   # BR(H -> ~chi_10 ~chi_10)
     4.10731281E-04    2     1000023   1000023   # BR(H -> ~chi_20 ~chi_20)
     2.50739392E-04    2     1000022   1000023   # BR(H -> ~chi_10 ~chi_20)
     2.13708940E-02    2     1000006  -1000006   # BR(H -> ~t_1    ~t_1*  )
     5.39609724E-06    2     1000005  -1000005   # BR(H -> ~b_1    ~b_1*  )
#
#         PDG            Width
DECAY        36     3.98105339E+01   # A decays
#          BR         NDA      ID1       ID2
     9.27810363E-01    2           5        -5   # BR(A -> b       bb     )
     6.24637189E-02    2         -15        15   # BR(A -> tau+    tau-   )
     2.20856474E-04    2         -13        13   # BR(A -> mu+     mu-    )
     2.71257612E-04    2           3        -3   # BR(A -> s       sb     )
     7.65450530E-08    2           4        -4   # BR(A -> c       cb     )
     7.63165777E-03    2           6        -6   # BR(A -> t       tb     )
     2.24745015E-05    2          21        21   # BR(A -> g       g      )
     5.31710592E-08    2          22        22   # BR(A -> gam     gam    )
     2.21213345E-08    2          23        22   # BR(A -> Z       gam    )
     7.26386574E-07    2          23        25   # BR(A -> Z       h      )
     8.53639782E-04    2     1000024  -1000024   # BR(A -> ~chi_1+ ~chi_1-)
     3.92328178E-05    2     1000022   1000022   # BR(A -> ~chi_10 ~chi_10)
     4.27185500E-04    2     1000023   1000023   # BR(A -> ~chi_20 ~chi_20)
     2.58735116E-04    2     1000022   1000023   # BR(A -> ~chi_10 ~chi_20)
#
#         PDG            Width
DECAY        37     4.32257652E+01   # H+ decays
#          BR         NDA      ID1       ID2
     1.47850667E-03    2           4        -5   # BR(H+ -> c       bb     )
     5.75496758E-02    2         -15        16   # BR(H+ -> tau+    nu_tau )
     2.03481616E-04    2         -13        14   # BR(H+ -> mu+     nu_mu  )
     9.46243112E-06    2           2        -5   # BR(H+ -> u       bb     )
     1.19580879E-05    2           2        -3   # BR(H+ -> u       sb     )
     2.46016320E-04    2           4        -3   # BR(H+ -> c       sb     )
     9.29621579E-01    2           6        -5   # BR(H+ -> t       bb     )
     6.70153644E-07    2          24        25   # BR(H+ -> W+      h      )
     4.98269141E-14    2          24        36   # BR(H+ -> W+      A      )
     4.75205924E-04    2     1000024   1000022   # BR(H+ -> ~chi_1+ ~chi_10)
     6.97697880E-11    2     1000024   1000023   # BR(H+ -> ~chi_1+ ~chi_20)
     1.04034440E-02    2     1000006  -1000005   # BR(H+ -> ~t_1    ~b_1*  )
