#
#                              ======================
#                              | THE SUSYHIT OUTPUT |
#                              ======================
#
#
#              ------------------------------------------------------
#              |     This is the output of the SUSY-HIT package     |
#              |  created by A.Djouadi, M.Muehlleitner and M.Spira. |
#              |  In case of problems with SUSY-HIT email to        |
#              |           margarete.muehlleitner@cern.ch           |
#              |           michael.spira@psi.ch                     |
#              |           abdelhak.djouadi@cern.ch                 |
#              ------------------------------------------------------
#
#              ------------------------------------------------------
#              |  SUSY Les Houches Accord - MSSM Spectrum + Decays  |
#              |              based on the decay programs           |
#              |                                                    |
#              |                     SDECAY 1.3b                    |
#              |                                                    |
#              |  Authors: M.Muhlleitner, A.Djouadi and Y.Mambrini  |
#              |  Ref.:    Comput.Phys.Commun.168(2005)46           |
#              |           [hep-ph/0311167]                         |
#              |                                                    |
#              |                     HDECAY 3.4                     |
#              |                                                    |
#              |  By: A.Djouadi,J.Kalinowski,M.Muhlleitner,M.Spira  |
#              |  Ref.:    Comput.Phys.Commun.108(1998)56           |
#              |           [hep-ph/9704448]                         |
#              |                                                    |
#              |                                                    |
#              |  If not stated otherwise all DRbar couplings and   |
#              |  soft SUSY breaking masses are given at the scale  |
#              |  Q=  0.50007628E+04
#              |                                                    |
#              ------------------------------------------------------
#
#
BLOCK DCINFO  # Decay Program information
     1   SDECAY/HDECAY # decay calculator
     2   1.3b  /3.4    # version number
#
BLOCK SPINFO  # Spectrum calculator information
     1    SOFTSUSY    # spectrum calculator                
     2    3.4.0       # version number                     
#
BLOCK MODSEL  # Model selection
     1     0   #  nonUniversal                                     
#
BLOCK SMINPUTS  # Standard Model inputs
         1     1.25778332E+02   # alpha_em^-1(M_Z)^MSbar
         2     1.16570000E-05   # G_F [GeV^-2]
         3     1.17200002E-01   # alpha_S(M_Z)^MSbar
         4     9.11876000E+01   # M_Z pole mass
         5     4.25000000E+00   # mb(mb)^MSbar
         6     1.72500000E+02   # mt pole mass
         7     1.77682000E+00   # mtau pole mass
#
BLOCK MINPAR  # Input parameters - minimal models
         3     1.00000000E+01   # tanb                
#
BLOCK EXTPAR  # Input parameters - non-minimal models
         0    -1.00000000E+00   # Set                 
         1     6.00000000E+01   # M_1(MX)             
         2     3.00000000E+03   # M_2(MX)             
         3     2.13913100E+03   # M_3(MX)             
        11     5.00000000E+03   # At(MX)              
        12     5.00000000E+03   # Ab(MX)              
        13     0.00000000E+00   # Atau(MX)            
        23    -4.74873000E+02   # mu(MX)              
        26     3.00000000E+03   # mA(pole)            
        31     5.00000000E+03   # meL(MX)             
        32     5.00000000E+03   # mmuL(MX)            
        33     5.00000000E+03   # mtauL(MX)           
        34     5.00000000E+03   # meR(MX)             
        35     5.00000000E+03   # mmuR(MX)            
        36     5.00000000E+03   # mtauR(MX)           
        41     5.00000000E+03   # mqL1(MX)            
        42     5.00000000E+03   # mqL2(MX)            
        43     5.00000000E+03   # mqL3(MX)            
        44     5.00000000E+03   # muR(MX)             
        45     5.00000000E+03   # mcR(MX)             
        46     5.00000000E+03   # mtR(MX)             
        47     5.00000000E+03   # mdR(MX)             
        48     5.00000000E+03   # msR(MX)             
        49     5.00000000E+03   # mbR(MX)             
#
BLOCK MASS  # Mass Spectrum
# PDG code           mass       particle
        24     8.00933131E+01   # W+
        25     1.24803101E+02   # h
        35     3.00008591E+03   # H
        36     2.99999945E+03   # A
        37     3.00143024E+03   # H+
         5     4.87878001E+00   # b-quark pole mass calculated from mb(mb)_Msbar
   1000001     5.07998332E+03   # ~d_L
   2000001     5.06217091E+03   # ~d_R
   1000002     5.07951145E+03   # ~u_L
   2000002     5.06187166E+03   # ~u_R
   1000003     5.07998332E+03   # ~s_L
   2000003     5.06217091E+03   # ~s_R
   1000004     5.07951145E+03   # ~c_L
   2000004     5.06187166E+03   # ~c_R
   1000005     5.02578553E+03   # ~b_1
   2000005     5.06038823E+03   # ~b_2
   1000006     4.91761850E+03   # ~t_1
   2000006     5.06894654E+03   # ~t_2
   1000011     5.01910714E+03   # ~e_L
   2000011     5.00594363E+03   # ~e_R
   1000012     5.01815704E+03   # ~nu_eL
   1000013     5.01910714E+03   # ~mu_L
   2000013     5.00594363E+03   # ~mu_R
   1000014     5.01815704E+03   # ~nu_muL
   1000015     5.00477437E+03   # ~tau_1
   2000015     5.01863145E+03   # ~tau_2
   1000016     5.01760542E+03   # ~nu_tauL
   1000021     2.50000040E+03   # ~g
   1000022     6.02023711E+01   # ~chi_10
   1000023     5.00512974E+02   # ~chi_20
   1000025    -5.02707368E+02   # ~chi_30
   1000035     3.07417463E+03   # ~chi_40
   1000024     5.00000548E+02   # ~chi_1+
   1000037     3.07434231E+03   # ~chi_2+
#
BLOCK NMIX  # Neutralino Mixing Matrix
  1  1     9.96029280E-01   # N_11
  1  2     2.24965060E-04   # N_12
  1  3    -8.90129624E-02   # N_13
  1  4    -1.52168391E-03   # N_14
  2  1     6.40535138E-02   # N_21
  2  2     1.90062645E-02   # N_22
  2  3     7.04713386E-01   # N_23
  2  4     7.06339120E-01   # N_24
  3  1    -6.18277374E-02   # N_31
  3  2     1.70139496E-02   # N_32
  3  3    -7.03884777E-01   # N_33
  3  4     7.07413653E-01   # N_34
  4  1    -3.89682623E-04   # N_41
  4  2     9.99674565E-01   # N_42
  4  3    -1.39853924E-03   # N_43
  4  4    -2.54687145E-02   # N_44
#
BLOCK UMIX  # Chargino Mixing Matrix U
  1  1     1.98308335E-03   # U_11
  1  2     9.99998034E-01   # U_12
  2  1    -9.99998034E-01   # U_21
  2  2     1.98308335E-03   # U_22
#
BLOCK VMIX  # Chargino Mixing Matrix V
  1  1     3.60384697E-02   # V_11
  1  2    -9.99350403E-01   # V_12
  2  1    -9.99350403E-01   # V_21
  2  2    -3.60384697E-02   # V_22
#
BLOCK STOPMIX  # Stop Mixing Matrix
  1  1    -5.01860018E-01   # cos(theta_t)
  1  2     8.64948855E-01   # sin(theta_t)
  2  1    -8.64948855E-01   # -sin(theta_t)
  2  2    -5.01860018E-01   # cos(theta_t)
#
BLOCK SBOTMIX  # Sbottom Mixing Matrix
  1  1     9.98773699E-01   # cos(theta_b)
  1  2    -4.95085668E-02   # sin(theta_b)
  2  1     4.95085668E-02   # -sin(theta_b)
  2  2     9.98773699E-01   # cos(theta_b)
#
BLOCK STAUMIX  # Stau Mixing Matrix
  1  1    -5.69206411E-02   # cos(theta_tau)
  1  2     9.98378706E-01   # sin(theta_tau)
  2  1    -9.98378706E-01   # -sin(theta_tau)
  2  2    -5.69206411E-02   # cos(theta_tau)
#
BLOCK ALPHA  # Higgs mixing
          -1.05492554E-01   # Mixing angle in the neutral Higgs boson sector
#
BLOCK HMIX Q=  5.00076282E+03  # DRbar Higgs Parameters
         1    -4.83587050E+02   # mu(Q)MSSM           
         2     9.46862079E+00   # tan                 
         3     2.41747556E+02   # higgs               
         4     8.67859874E+06   # mA^2(Q)MSSM         
#
BLOCK GAUGE Q=  5.00076282E+03  # The gauge couplings
     1     3.70946012E-01   # gprime(Q) DRbar
     2     6.33299464E-01   # g(Q) DRbar
     3     9.95215428E-01   # g3(Q) DRbar
#
BLOCK AU Q=  5.00076282E+03  # The trilinear couplings
  1  1     5.00000002E+03   # A_u(Q) DRbar
  2  2     5.00000002E+03   # A_c(Q) DRbar
  3  3     5.00000002E+03   # A_t(Q) DRbar
#
BLOCK AD Q=  5.00076282E+03  # The trilinear couplings
  1  1     5.00000001E+03   # A_d(Q) DRbar
  2  2     5.00000001E+03   # A_s(Q) DRbar
  3  3     5.00000001E+03   # A_b(Q) DRbar
#
BLOCK AE Q=  5.00076282E+03  # The trilinear couplings
  1  1     0.00000000E+00   # A_e(Q) DRbar
  2  2     2.46916333E-07   # A_mu(Q) DRbar
  3  3     2.46842320E-07   # A_tau(Q) DRbar
#
BLOCK Yu Q=  5.00076282E+03  # The Yukawa couplings
  1  1     0.00000000E+00   # y_u(Q) DRbar
  2  2     0.00000000E+00   # y_c(Q) DRbar
  3  3     8.21365801E-01   # y_t(Q) DRbar
#
BLOCK Yd Q=  5.00076282E+03  # The Yukawa couplings
  1  1     0.00000000E+00   # y_d(Q) DRbar
  2  2     0.00000000E+00   # y_s(Q) DRbar
  3  3     1.30315813E-01   # y_b(Q) DRbar
#
BLOCK Ye Q=  5.00076282E+03  # The Yukawa couplings
  1  1     0.00000000E+00   # y_e(Q) DRbar
  2  2     0.00000000E+00   # y_mu(Q) DRbar
  3  3     9.71349695E-02   # y_tau(Q) DRbar
#
BLOCK MSOFT Q=  5.00076282E+03  # The soft SUSY breaking masses at the scale Q
         1     6.00000000E+01   # M_1(Q)              
         2     3.00000000E+03   # M_2(Q)              
         3     2.13913100E+03   # M_3(Q)              
        21     8.49021637E+06   # mH1^2(Q)            
        22     3.43796142E+05   # mH2^2(Q)            
        31     5.00000000E+03   # meL(Q)              
        32     5.00000000E+03   # mmuL(Q)             
        33     5.00000000E+03   # mtauL(Q)            
        34     5.00000000E+03   # meR(Q)              
        35     5.00000000E+03   # mmuR(Q)             
        36     5.00000000E+03   # mtauR(Q)            
        41     4.99999999E+03   # mqL1(Q)             
        42     4.99999999E+03   # mqL2(Q)             
        43     4.99999999E+03   # mqL3(Q)             
        44     4.99999999E+03   # muR(Q)              
        45     4.99999999E+03   # mcR(Q)              
        46     4.99999999E+03   # mtR(Q)              
        47     4.99999999E+03   # mdR(Q)              
        48     4.99999999E+03   # msR(Q)              
        49     4.99999999E+03   # mbR(Q)              
#
#
#
#                             =================
#                             |The decay table|
#                             =================
#
# - The QCD corrections to the decays gluino -> squark  + quark
#                                     squark -> gaugino + quark_prime
#                                     squark -> squark_prime + Higgs
#                                     squark -> gluino  + quark
#   are included.
#
# - The multi-body decays for the inos, stops and sbottoms are included.
#
# - The loop induced decays for the gluino, neutralinos and stops
#   are included.
#
# - The SUSY decays of the top quark are included.
#
#
#         PDG            Width
DECAY         6     1.40555300E+00   # top decays
#          BR         NDA      ID1       ID2
     1.00000000E+00    2           5        24   # BR(t ->  b    W+)
#
#         PDG            Width
DECAY   1000021     7.07699255E-03   # gluino decays
#          BR         NDA      ID1       ID2
     3.59838482E-07    2     1000022        21   # BR(~g -> ~chi_10 g)
     4.24308518E-03    2     1000023        21   # BR(~g -> ~chi_20 g)
     4.12764971E-03    2     1000025        21   # BR(~g -> ~chi_30 g)
#           BR         NDA      ID1       ID2       ID3
     1.06329483E-02    3     1000022         1        -1   # BR(~g -> ~chi_10 d  db)
     3.50041159E-05    3     1000023         1        -1   # BR(~g -> ~chi_20 d  db)
     4.19800323E-05    3     1000025         1        -1   # BR(~g -> ~chi_30 d  db)
     3.62629818E-02    3     1000022         2        -2   # BR(~g -> ~chi_10 u  ub)
     1.82628377E-04    3     1000023         2        -2   # BR(~g -> ~chi_20 u  ub)
     6.98852667E-05    3     1000025         2        -2   # BR(~g -> ~chi_30 u  ub)
     1.06329483E-02    3     1000022         3        -3   # BR(~g -> ~chi_10 s  sb)
     3.50041159E-05    3     1000023         3        -3   # BR(~g -> ~chi_20 s  sb)
     4.19800323E-05    3     1000025         3        -3   # BR(~g -> ~chi_30 s  sb)
     3.62629818E-02    3     1000022         4        -4   # BR(~g -> ~chi_10 c  cb)
     1.82628377E-04    3     1000023         4        -4   # BR(~g -> ~chi_20 c  cb)
     6.98852667E-05    3     1000025         4        -4   # BR(~g -> ~chi_30 c  cb)
     1.08832921E-02    3     1000022         5        -5   # BR(~g -> ~chi_10 b  bb)
     5.29805870E-03    3     1000023         5        -5   # BR(~g -> ~chi_20 b  bb)
     5.27502431E-03    3     1000025         5        -5   # BR(~g -> ~chi_30 b  bb)
     3.67873379E-02    3     1000022         6        -6   # BR(~g -> ~chi_10 t  tb)
     2.08658776E-01    3     1000023         6        -6   # BR(~g -> ~chi_20 t  tb)
     1.98359339E-01    3     1000025         6        -6   # BR(~g -> ~chi_30 t  tb)
     5.43650727E-05    3     1000024         1        -2   # BR(~g -> ~chi_1+ d  ub)
     5.43650727E-05    3    -1000024         2        -1   # BR(~g -> ~chi_1- u  db)
     5.43650727E-05    3     1000024         3        -4   # BR(~g -> ~chi_1+ s  cb)
     5.43650727E-05    3    -1000024         4        -3   # BR(~g -> ~chi_1- c  sb)
     2.15849381E-01    3     1000024         5        -6   # BR(~g -> ~chi_1+ b  tb)
     2.15849381E-01    3    -1000024         6        -5   # BR(~g -> ~chi_1- t  bb)
#
#         PDG            Width
DECAY   1000006     3.01627503E+02   # stop1 decays
#          BR         NDA      ID1       ID2
     2.92223230E-02    2     1000022         6   # BR(~t_1 -> ~chi_10 t )
     1.08718217E-01    2     1000023         6   # BR(~t_1 -> ~chi_20 t )
     1.02872959E-01    2     1000025         6   # BR(~t_1 -> ~chi_30 t )
     6.66088397E-03    2     1000035         6   # BR(~t_1 -> ~chi_40 t )
     1.58730934E-01    2     1000024         5   # BR(~t_1 -> ~chi_1+ b )
     1.32781492E-02    2     1000037         5   # BR(~t_1 -> ~chi_2+ b )
     5.80516534E-01    2     1000021         6   # BR(~t_1 -> ~g      t )
#
#         PDG            Width
DECAY   2000006     3.08289119E+02   # stop2 decays
#          BR         NDA      ID1       ID2
     1.11467931E-02    2     1000022         6   # BR(~t_2 -> ~chi_10 t )
     1.06326412E-01    2     1000023         6   # BR(~t_2 -> ~chi_20 t )
     1.12752963E-01    2     1000025         6   # BR(~t_2 -> ~chi_30 t )
     1.84080435E-02    2     1000035         6   # BR(~t_2 -> ~chi_40 t )
     6.16858949E-02    2     1000024         5   # BR(~t_2 -> ~chi_1+ b )
     3.66534210E-02    2     1000037         5   # BR(~t_2 -> ~chi_2+ b )
     6.49192516E-01    2     1000021         6   # BR(~t_2 -> ~g      t )
     8.89817227E-04    2     1000006        25   # BR(~t_2 -> ~t_1    h )
     2.94413889E-03    2     1000006        23   # BR(~t_2 -> ~t_1    Z )
#
#         PDG            Width
DECAY   1000005     2.82616814E+02   # sbottom1 decays
#          BR         NDA      ID1       ID2
     2.74519941E-03    2     1000022         5   # BR(~b_1 -> ~chi_10 b )
     2.90622869E-03    2     1000023         5   # BR(~b_1 -> ~chi_20 b )
     2.90751345E-03    2     1000025         5   # BR(~b_1 -> ~chi_30 b )
     2.69778875E-02    2     1000035         5   # BR(~b_1 -> ~chi_40 b )
     2.33175079E-01    2    -1000024         6   # BR(~b_1 -> ~chi_1- t )
     5.41654808E-02    2    -1000037         6   # BR(~b_1 -> ~chi_2- t )
     6.75217125E-01    2     1000021         5   # BR(~b_1 -> ~g      b )
     1.90548592E-03    2     1000006       -24   # BR(~b_1 -> ~t_1    W-)
#
#         PDG            Width
DECAY   2000005     2.00162565E+02   # sbottom2 decays
#          BR         NDA      ID1       ID2
     1.46296377E-02    2     1000022         5   # BR(~b_2 -> ~chi_10 b )
     4.25813978E-03    2     1000023         5   # BR(~b_2 -> ~chi_20 b )
     4.30793075E-03    2     1000025         5   # BR(~b_2 -> ~chi_30 b )
     8.55228030E-05    2     1000035         5   # BR(~b_2 -> ~chi_40 b )
     9.09263357E-03    2    -1000024         6   # BR(~b_2 -> ~chi_1- t )
     1.71730780E-04    2    -1000037         6   # BR(~b_2 -> ~chi_2- t )
     9.67426330E-01    2     1000021         5   # BR(~b_2 -> ~g      b )
     2.80748745E-05    2     1000006       -24   # BR(~b_2 -> ~t_1    W-)
#
#         PDG            Width
DECAY   1000002     2.19769572E+02   # sup_L decays
#          BR         NDA      ID1       ID2
     3.37347281E-03    2     1000022         2   # BR(~u_L -> ~chi_10 u)
     8.68006077E-05    2     1000023         2   # BR(~u_L -> ~chi_20 u)
     2.13481247E-06    2     1000025         2   # BR(~u_L -> ~chi_30 u)
     3.60136576E-02    2     1000035         2   # BR(~u_L -> ~chi_40 u)
     2.27059269E-04    2     1000024         1   # BR(~u_L -> ~chi_1+ d)
     7.19825665E-02    2     1000037         1   # BR(~u_L -> ~chi_2+ d)
     8.88314308E-01    2     1000021         2   # BR(~u_L -> ~g      u)
#
#         PDG            Width
DECAY   2000002     2.05564474E+02   # sup_R decays
#          BR         NDA      ID1       ID2
     5.73683983E-02    2     1000022         2   # BR(~u_R -> ~chi_10 u)
     2.32997732E-04    2     1000023         2   # BR(~u_R -> ~chi_20 u)
     2.17049845E-04    2     1000025         2   # BR(~u_R -> ~chi_30 u)
     3.52807122E-09    2     1000035         2   # BR(~u_R -> ~chi_40 u)
     9.42181551E-01    2     1000021         2   # BR(~u_R -> ~g      u)
#
#         PDG            Width
DECAY   1000001     2.19785509E+02   # sdown_L decays
#          BR         NDA      ID1       ID2
     3.35797335E-03    2     1000022         1   # BR(~d_L -> ~chi_10 d)
     3.69329566E-06    2     1000023         1   # BR(~d_L -> ~chi_20 d)
     7.39353024E-05    2     1000025         1   # BR(~d_L -> ~chi_30 d)
     3.60330454E-02    2     1000035         1   # BR(~d_L -> ~chi_40 d)
     6.87542502E-07    2    -1000024         2   # BR(~d_L -> ~chi_1- u)
     7.20927472E-02    2    -1000037         2   # BR(~d_L -> ~chi_2- u)
     8.88437918E-01    2     1000021         1   # BR(~d_L -> ~g      d)
#
#         PDG            Width
DECAY   2000001     1.96676815E+02   # sdown_R decays
#          BR         NDA      ID1       ID2
     1.49911102E-02    2     1000022         1   # BR(~d_R -> ~chi_10 d)
     6.08854739E-05    2     1000023         1   # BR(~d_R -> ~chi_20 d)
     5.67180754E-05    2     1000025         1   # BR(~d_R -> ~chi_30 d)
     9.22056534E-10    2     1000035         1   # BR(~d_R -> ~chi_40 d)
     9.84891285E-01    2     1000021         1   # BR(~d_R -> ~g      d)
#
#         PDG            Width
DECAY   1000004     2.19769572E+02   # scharm_L decays
#          BR         NDA      ID1       ID2
     3.37347281E-03    2     1000022         4   # BR(~c_L -> ~chi_10 c)
     8.68006077E-05    2     1000023         4   # BR(~c_L -> ~chi_20 c)
     2.13481247E-06    2     1000025         4   # BR(~c_L -> ~chi_30 c)
     3.60136576E-02    2     1000035         4   # BR(~c_L -> ~chi_40 c)
     2.27059269E-04    2     1000024         3   # BR(~c_L -> ~chi_1+ s)
     7.19825665E-02    2     1000037         3   # BR(~c_L -> ~chi_2+ s)
     8.88314308E-01    2     1000021         4   # BR(~c_L -> ~g      c)
#
#         PDG            Width
DECAY   2000004     2.05564474E+02   # scharm_R decays
#          BR         NDA      ID1       ID2
     5.73683983E-02    2     1000022         4   # BR(~c_R -> ~chi_10 c)
     2.32997732E-04    2     1000023         4   # BR(~c_R -> ~chi_20 c)
     2.17049845E-04    2     1000025         4   # BR(~c_R -> ~chi_30 c)
     3.52807122E-09    2     1000035         4   # BR(~c_R -> ~chi_40 c)
     9.42181551E-01    2     1000021         4   # BR(~c_R -> ~g      c)
#
#         PDG            Width
DECAY   1000003     2.19785509E+02   # sstrange_L decays
#          BR         NDA      ID1       ID2
     3.35797335E-03    2     1000022         3   # BR(~s_L -> ~chi_10 s)
     3.69329566E-06    2     1000023         3   # BR(~s_L -> ~chi_20 s)
     7.39353024E-05    2     1000025         3   # BR(~s_L -> ~chi_30 s)
     3.60330454E-02    2     1000035         3   # BR(~s_L -> ~chi_40 s)
     6.87542502E-07    2    -1000024         4   # BR(~s_L -> ~chi_1- c)
     7.20927472E-02    2    -1000037         4   # BR(~s_L -> ~chi_2- c)
     8.88437918E-01    2     1000021         3   # BR(~s_L -> ~g      s)
#
#         PDG            Width
DECAY   2000003     1.96676815E+02   # sstrange_R decays
#          BR         NDA      ID1       ID2
     1.49911102E-02    2     1000022         3   # BR(~s_R -> ~chi_10 s)
     6.08854739E-05    2     1000023         3   # BR(~s_R -> ~chi_20 s)
     5.67180754E-05    2     1000025         3   # BR(~s_R -> ~chi_30 s)
     9.22056534E-10    2     1000035         3   # BR(~s_R -> ~chi_40 s)
     9.84891285E-01    2     1000021         3   # BR(~s_R -> ~g      s)
#
#         PDG            Width
DECAY   1000011     3.03321363E+01   # selectron_L decays
#          BR         NDA      ID1       ID2
     2.24801463E-01    2     1000022        11   # BR(~e_L -> ~chi_10 e-)
     2.06746108E-03    2     1000023        11   # BR(~e_L -> ~chi_20 e-)
     2.38517889E-04    2     1000025        11   # BR(~e_L -> ~chi_30 e-)
     2.57462111E-01    2     1000035        11   # BR(~e_L -> ~chi_40 e-)
     5.08968413E-06    2    -1000024        12   # BR(~e_L -> ~chi_1- nu_e)
     5.15425357E-01    2    -1000037        12   # BR(~e_L -> ~chi_2- nu_e)
#
#         PDG            Width
DECAY   2000011     2.73951728E+01   # selectron_R decays
#          BR         NDA      ID1       ID2
     9.92229290E-01    2     1000022        11   # BR(~e_R -> ~chi_10 e-)
     4.02302401E-03    2     1000023        11   # BR(~e_R -> ~chi_20 e-)
     3.74762679E-03    2     1000025        11   # BR(~e_R -> ~chi_30 e-)
     5.89410060E-08    2     1000035        11   # BR(~e_R -> ~chi_40 e-)
#
#         PDG            Width
DECAY   1000013     3.03321363E+01   # smuon_L decays
#          BR         NDA      ID1       ID2
     2.24801463E-01    2     1000022        13   # BR(~mu_L -> ~chi_10 mu-)
     2.06746108E-03    2     1000023        13   # BR(~mu_L -> ~chi_20 mu-)
     2.38517889E-04    2     1000025        13   # BR(~mu_L -> ~chi_30 mu-)
     2.57462111E-01    2     1000035        13   # BR(~mu_L -> ~chi_40 mu-)
     5.08968413E-06    2    -1000024        14   # BR(~mu_L -> ~chi_1- nu_mu)
     5.15425357E-01    2    -1000037        14   # BR(~mu_L -> ~chi_2- nu_mu)
#
#         PDG            Width
DECAY   2000013     2.73951728E+01   # smuon_R decays
#          BR         NDA      ID1       ID2
     9.92229290E-01    2     1000022        13   # BR(~mu_R -> ~chi_10 mu-)
     4.02302401E-03    2     1000023        13   # BR(~mu_R -> ~chi_20 mu-)
     3.74762679E-03    2     1000025        13   # BR(~mu_R -> ~chi_30 mu-)
     5.89410060E-08    2     1000035        13   # BR(~mu_R -> ~chi_40 mu-)
#
#         PDG            Width
DECAY   1000015     2.92378073E+01   # stau_1 decays
#          BR         NDA      ID1       ID2
     9.28349187E-01    2     1000022        15   # BR(~tau_1 -> ~chi_10  tau-)
     1.91862514E-02    2     1000023        15   # BR(~tau_1 -> ~chi_20  tau-)
     1.84825296E-02    2     1000025        15   # BR(~tau_1 -> ~chi_30  tau-)
     8.47943209E-04    2     1000035        15   # BR(~tau_1 -> ~chi_40  tau-)
     3.14367117E-02    2    -1000024        16   # BR(~tau_1 -> ~chi_1-  nu_tau)
     1.69737741E-03    2    -1000037        16   # BR(~tau_1 -> ~chi_2-  nu_tau)
#
#         PDG            Width
DECAY   2000015     3.12393925E+01   # stau_2 decays
#          BR         NDA      ID1       ID2
     2.19790380E-01    2     1000022        15   # BR(~tau_2 -> ~chi_10  tau-)
     1.68942411E-02    2     1000023        15   # BR(~tau_2 -> ~chi_20  tau-)
     1.54637847E-02    2     1000025        15   # BR(~tau_2 -> ~chi_30  tau-)
     2.49102987E-01    2     1000035        15   # BR(~tau_2 -> ~chi_40  tau-)
     5.72592656E-05    2    -1000024        16   # BR(~tau_2 -> ~chi_1-  nu_tau)
     4.98691349E-01    2    -1000037        16   # BR(~tau_2 -> ~chi_2-  nu_tau)
#
#         PDG            Width
DECAY   1000012     3.03353320E+01   # snu_eL decays
#          BR         NDA      ID1       ID2
     2.24388839E-01    2     1000022        12   # BR(~nu_eL -> ~chi_10 nu_e)
     2.21688806E-04    2     1000023        12   # BR(~nu_eL -> ~chi_20 nu_e)
     1.83250019E-03    2     1000025        12   # BR(~nu_eL -> ~chi_30 nu_e)
     2.57504301E-01    2     1000035        12   # BR(~nu_eL -> ~chi_40 nu_e)
     1.68039085E-03    2     1000024        11   # BR(~nu_eL -> ~chi_1+ e-)
     5.14372281E-01    2     1000037        11   # BR(~nu_eL -> ~chi_2+ e-)
#
#         PDG            Width
DECAY   1000014     3.03353320E+01   # snu_muL decays
#          BR         NDA      ID1       ID2
     2.24388839E-01    2     1000022        14   # BR(~nu_muL -> ~chi_10 nu_mu)
     2.21688806E-04    2     1000023        14   # BR(~nu_muL -> ~chi_20 nu_mu)
     1.83250019E-03    2     1000025        14   # BR(~nu_muL -> ~chi_30 nu_mu)
     2.57504301E-01    2     1000035        14   # BR(~nu_muL -> ~chi_40 nu_mu)
     1.68039085E-03    2     1000024        13   # BR(~nu_muL -> ~chi_1+ mu-)
     5.14372281E-01    2     1000037        13   # BR(~nu_muL -> ~chi_2+ mu-)
#
#         PDG            Width
DECAY   1000016     3.12490522E+01   # snu_tauL decays
#          BR         NDA      ID1       ID2
     2.17803766E-01    2     1000022        16   # BR(~nu_tauL -> ~chi_10 nu_tau)
     2.15182033E-04    2     1000023        16   # BR(~nu_tauL -> ~chi_20 nu_tau)
     1.77871453E-03    2     1000025        16   # BR(~nu_tauL -> ~chi_30 nu_tau)
     2.49881384E-01    2     1000035        16   # BR(~nu_tauL -> ~chi_40 nu_tau)
     3.11761769E-02    2     1000024        15   # BR(~nu_tauL -> ~chi_1+ tau-)
     4.99144776E-01    2     1000037        15   # BR(~nu_tauL -> ~chi_2+ tau-)
#
#         PDG            Width
DECAY   1000024     2.94059299E-01   # chargino1+ decays
#          BR         NDA      ID1       ID2
     1.00000000E+00    2     1000022        24   # BR(~chi_1+ -> ~chi_10  W+)
#
#         PDG            Width
DECAY   1000037     2.21605597E+01   # chargino2+ decays
#          BR         NDA      ID1       ID2
     2.53559137E-01    2     1000024        23   # BR(~chi_2+ -> ~chi_1+  Z )
     1.56238257E-04    2     1000022        24   # BR(~chi_2+ -> ~chi_10  W+)
     2.44965309E-01    2     1000023        24   # BR(~chi_2+ -> ~chi_20  W+)
     2.44371175E-01    2     1000025        24   # BR(~chi_2+ -> ~chi_30  W+)
     2.56942960E-01    2     1000024        25   # BR(~chi_2+ -> ~chi_1+  h )
     5.17957252E-06    2     1000022        37   # BR(~chi_2+ -> ~chi_10  H+)
#
#         PDG            Width
DECAY   1000022     0.00000000E+00   # neutralino1 decays
#
#         PDG            Width
DECAY   1000023     2.97392687E-01   # neutralino2 decays
#          BR         NDA      ID1       ID2
     5.04348167E-01    2     1000022        23   # BR(~chi_20 -> ~chi_10   Z )
     4.95651833E-01    2     1000022        25   # BR(~chi_20 -> ~chi_10   h )
#
#         PDG            Width
DECAY   1000025     2.90293778E-01   # neutralino3 decays
#          BR         NDA      ID1       ID2
     5.33686995E-01    2     1000022        23   # BR(~chi_30 -> ~chi_10   Z )
     4.66313005E-01    2     1000022        25   # BR(~chi_30 -> ~chi_10   h )
#
#         PDG            Width
DECAY   1000035     2.21715117E+01   # neutralino4 decays
#          BR         NDA      ID1       ID2
     3.09990942E-06    2     1000022        23   # BR(~chi_40 -> ~chi_10   Z )
     1.12720215E-01    2     1000023        23   # BR(~chi_40 -> ~chi_20   Z )
     1.40400206E-01    2     1000025        23   # BR(~chi_40 -> ~chi_30   Z )
     2.45148167E-01    2     1000024       -24   # BR(~chi_40 -> ~chi_1+   W-)
     2.45148167E-01    2    -1000024        24   # BR(~chi_40 -> ~chi_1-   W+)
     1.45589513E-04    2     1000022        25   # BR(~chi_40 -> ~chi_10   h )
     4.98297932E-06    2     1000022        35   # BR(~chi_40 -> ~chi_10   H )
     5.43738558E-07    2     1000022        36   # BR(~chi_40 -> ~chi_10   A )
     1.43428227E-01    2     1000023        25   # BR(~chi_40 -> ~chi_20   h )
     1.13000803E-01    2     1000025        25   # BR(~chi_40 -> ~chi_30   h )
#
#         PDG            Width
DECAY        25     4.07186327E-03   # h decays
#          BR         NDA      ID1       ID2
     6.08603431E-01    2           5        -5   # BR(h -> b       bb     )
     6.37199303E-02    2         -15        15   # BR(h -> tau+    tau-   )
     2.25591591E-04    2         -13        13   # BR(h -> mu+     mu-    )
     4.78218056E-04    2           3        -3   # BR(h -> s       sb     )
     2.07200785E-02    2           4        -4   # BR(h -> c       cb     )
     6.70592481E-02    2          21        21   # BR(h -> g       g      )
     2.30552073E-03    2          22        22   # BR(h -> gam     gam    )
     1.48948337E-03    2          22        23   # BR(h -> Z       gam    )
     2.10252940E-01    2          24       -24   # BR(h -> W+      W-     )
     2.50603123E-02    2          23        23   # BR(h -> Z       Z      )
     8.52462858E-05    2     1000022   1000022   # BR(h -> ~chi_10 ~chi_10)
#
#         PDG            Width
DECAY        35     8.66030881E+00   # H decays
#          BR         NDA      ID1       ID2
     3.68299357E-01    2           5        -5   # BR(H -> b       bb     )
     6.43127075E-02    2         -15        15   # BR(H -> tau+    tau-   )
     2.27414842E-04    2         -13        13   # BR(H -> mu+     mu-    )
     2.78775666E-04    2           3        -3   # BR(H -> s       sb     )
     1.56034038E-06    2           4        -4   # BR(H -> c       cb     )
     1.55890367E-01    2           6        -6   # BR(H -> t       tb     )
     5.18518398E-05    2          21        21   # BR(H -> g       g      )
     1.49170972E-07    2          22        22   # BR(H -> gam     gam    )
     9.20069808E-08    2          23        22   # BR(H -> Z       gam    )
     7.45621868E-05    2          24       -24   # BR(H -> W+      W-     )
     3.72338976E-05    2          23        23   # BR(H -> Z       Z      )
     2.69876608E-04    2          25        25   # BR(H -> h       h      )
    -1.38992954E-23    2          36        36   # BR(H -> A       A      )
     6.16042053E-19    2          23        36   # BR(H -> Z       A      )
     3.17462371E-03    2     1000024  -1000024   # BR(H -> ~chi_1+ ~chi_1-)
     6.71536123E-03    2     1000022   1000022   # BR(H -> ~chi_10 ~chi_10)
     3.68939544E-04    2     1000023   1000023   # BR(H -> ~chi_20 ~chi_20)
     2.44857563E-03    2     1000025   1000025   # BR(H -> ~chi_30 ~chi_30)
     2.39577374E-01    2     1000022   1000023   # BR(H -> ~chi_10 ~chi_20)
     1.54947060E-01    2     1000022   1000025   # BR(H -> ~chi_10 ~chi_30)
     3.32411760E-03    2     1000023   1000025   # BR(H -> ~chi_20 ~chi_30)
#
#         PDG            Width
DECAY        36     8.66733602E+00   # A decays
#          BR         NDA      ID1       ID2
     3.68126351E-01    2           5        -5   # BR(A -> b       bb     )
     6.42624807E-02    2         -15        15   # BR(A -> tau+    tau-   )
     2.27236919E-04    2         -13        13   # BR(A -> mu+     mu-    )
     2.78761242E-04    2           3        -3   # BR(A -> s       sb     )
     1.56530865E-06    2           4        -4   # BR(A -> c       cb     )
     1.56300446E-01    2           6        -6   # BR(A -> t       tb     )
     1.54657209E-04    2          21        21   # BR(A -> g       g      )
     5.93873467E-07    2          22        22   # BR(A -> gam     gam    )
     1.87227003E-07    2          23        22   # BR(A -> Z       gam    )
     7.42196112E-05    2          23        25   # BR(A -> Z       h      )
     3.48656798E-03    2     1000024  -1000024   # BR(A -> ~chi_1+ ~chi_1-)
     6.67250785E-03    2     1000022   1000022   # BR(A -> ~chi_10 ~chi_10)
     2.71067594E-04    2     1000023   1000023   # BR(A -> ~chi_20 ~chi_20)
     4.22340129E-03    2     1000025   1000025   # BR(A -> ~chi_30 ~chi_30)
     1.58348363E-01    2     1000022   1000023   # BR(A -> ~chi_10 ~chi_20)
     2.35208783E-01    2     1000022   1000025   # BR(A -> ~chi_10 ~chi_30)
     2.36281036E-03    2     1000023   1000025   # BR(A -> ~chi_20 ~chi_30)
#
#         PDG            Width
DECAY        37     8.61783396E+00   # H+ decays
#          BR         NDA      ID1       ID2
     5.91258766E-04    2           4        -5   # BR(H+ -> c       bb     )
     6.46624383E-02    2         -15        16   # BR(H+ -> tau+    nu_tau )
     2.28651198E-04    2         -13        14   # BR(H+ -> mu+     nu_mu  )
     3.78403628E-06    2           2        -5   # BR(H+ -> u       bb     )
     1.34164534E-05    2           2        -3   # BR(H+ -> u       sb     )
     2.77453862E-04    2           4        -3   # BR(H+ -> c       sb     )
     5.23484376E-01    2           6        -5   # BR(H+ -> t       bb     )
     7.48009684E-05    2          24        25   # BR(H+ -> W+      h      )
     9.14314819E-13    2          24        36   # BR(H+ -> W+      A      )
     4.06869390E-01    2     1000024   1000022   # BR(H+ -> ~chi_1+ ~chi_10)
     3.46477119E-03    2     1000024   1000023   # BR(H+ -> ~chi_1+ ~chi_20)
     3.29659290E-04    2     1000024   1000025   # BR(H+ -> ~chi_1+ ~chi_30)
