#  ISAJET SUSY parameters in SUSY Les Houches Accord 2 format
#  Created by ISALHA 2.0 Last revision: H Baer 27 May 2014
Block SPINFO   # Program information
     1   ISASUGRA/ISASUSY from ISAJET   # Spectrum Calculator
     2   7.87   18-JUL-2017 13:55:55    # Version number
Block MODSEL   # Model selection
     1    13   # Non-universal supergravity model                  
Block SMINPUTS   # Standard Model inputs
     1     1.28000000E+02   # alpha_em^(-1)
     2     1.16570000E-05   # G_Fermi
     3     1.19999997E-01   # alpha_s(M_Z)
     4     9.11699982E+01   # m_{Z}(pole)
     5     4.19999981E+00   # m_{b}(m_{b})
     6     1.72500000E+02   # m_{top}(pole)
     7     1.77699995E+00   # m_{tau}(pole)
Block MINPAR   # SUSY breaking input parameters
     1     5.00000000E+03   # m_0
     2     5.00000000E+03   # m_{1/2}
     3     1.50000000E+01   # tan(beta)
     4     1.00000000E+00   # sign(mu)
     5    -8.00000000E+03   # A_0
Block EXTPAR   # Non-universal SUSY breaking parameters
     0     1.04656628E+16   # Input scale
    21    -5.63643550E+06   # Down type Higgs mass squared
    22     8.27296000E+07   #  Up  type Higgs mass squared
Block MASS   # Scalar and gaugino mass spectrum
#  PDG code   mass                 particle
         6     1.72500000E+02   #  top            
        24     8.04229965E+01   #  W^+
        25     1.25663490E+02   #  h^0            
        35     1.00666888E+03   #  H^0            
        36     1.00000000E+03   #  A^0            
        37     1.00322870E+03   #  H^+            
   1000001     1.01511143E+04   #  dnl            
   1000002     1.01507822E+04   #  upl            
   1000003     1.01511143E+04   #  stl            
   1000004     1.01507822E+04   #  chl            
   1000005     8.41227930E+03   #  b1             
   1000006     5.94183594E+03   #  t1             
   1000011     6.11933252E+03   #  el-            
   1000012     6.11595117E+03   #  nuel           
   1000013     6.11933252E+03   #  mul-           
   1000014     6.11595117E+03   #  numl           
   1000015     4.71473242E+03   #  tau1           
   1000016     6.03940674E+03   #  nutl           
   1000021     1.00050391E+04   #  glss           
   1000022     2.07357895E+02   #  z1ss           
   1000023    -2.09507919E+02   #  z2ss           
   1000024     2.17207275E+02   #  w1ss           
   1000025     2.27535205E+03   #  z3ss           
   1000035     4.17628662E+03   #  z4ss           
   1000037     4.12787695E+03   #  w2ss           
   1000039     1.00000002E+20   #  gvss
   2000001     9.70679980E+03   #  dnr            
   2000002     9.97609473E+03   #  upr            
   2000003     9.70679980E+03   #  str            
   2000004     9.97609473E+03   #  chr            
   2000005     9.47674902E+03   #  b2             
   2000006     8.43006543E+03   #  t2             
   2000011     4.89815967E+03   #  er-            
   2000013     4.89815967E+03   #  mur-           
   2000015     6.04118555E+03   #  tau2           
Block ALPHA   # Effective Higgs mixing parameter
         -6.81568235E-02   # alpha
Block STOPMIX   # stop mixing matrix
  1  1     4.23879698E-02   # O_{11}
  1  2     9.99101222E-01   # O_{12}
  2  1    -9.99101222E-01   # O_{21}
  2  2     4.23879698E-02   # O_{22}
Block SBOTMIX   # sbottom mixing matrix
  1  1     9.99983907E-01   # O_{11}
  1  2     5.66885993E-03   # O_{12}
  2  1    -5.66885993E-03   # O_{21}
  2  2     9.99983907E-01   # O_{22}
Block STAUMIX   # stau mixing matrix
  1  1     1.00906275E-03   # O_{11}
  1  2     9.99999464E-01   # O_{12}
  2  1    -9.99999464E-01   # O_{21}
  2  2     1.00906275E-03   # O_{22}
Block NMIX   # neutralino mixing matrix
  1  1     1.50290905E-02   #
  1  2    -1.45310033E-02   #
  1  3     7.08829224E-01   #
  1  4    -7.05070257E-01   #
  2  1    -1.09368796E-02   #
  2  2     1.07854968E-02   #
  2  3     7.05368757E-01   #
  2  4     7.08674073E-01   #
  3  1     9.99816060E-01   #
  3  2     5.06535172E-03   #
  3  3    -2.92626000E-03   #
  3  4     1.82655640E-02   #
  4  1    -4.72889096E-03   #
  4  2     9.99823570E-01   #
  4  3     2.70749815E-03   #
  4  4    -1.79844741E-02   #
Block UMIX   # chargino U mixing matrix
  1  1    -3.39975487E-03   # U_{11}
  1  2     9.99994218E-01   # U_{12}
  2  1    -9.99994218E-01   # U_{21}
  2  2    -3.39975487E-03   # U_{22}
Block VMIX   # chargino V mixing matrix
  1  1    -2.65868884E-02   # V_{11}
  1  2     9.99646485E-01   # V_{12}
  2  1    -9.99646485E-01   # V_{21}
  2  2    -2.65868884E-02   # V_{22}
Block GAUGE Q=  6.91114697E+03   #
     1     3.57522994E-01   # g`
     2     6.52385354E-01   # g_2
     3     1.21939635E+00   # g_3
Block YU Q=  6.91114697E+03   #
  3  3     7.93558598E-01   # y_t
Block YD Q=  6.91114697E+03   #
  3  3     1.76447377E-01   # y_b
Block YE Q=  6.91114697E+03   #
  3  3     1.48001075E-01   # y_tau
Block HMIX Q=  6.91114697E+03   # Higgs mixing parameters
     1     2.00000000E+02   # mu(Q)
     2     1.41989145E+01   # tan(beta)(Q)
     3     2.52928253E+02   # Higgs vev at Q
     4     1.00000000E+06   # m_A^2(Q)
Block MSOFT Q=  6.91114697E+03   # DRbar SUSY breaking parameters
     1     2.29178857E+03   # M_1(Q)          
     2     4.05911157E+03   # M_2(Q)          
     3     9.54410254E+03   # M_3(Q)          
    21     9.66345250E+05   # MHd^2(Q)        
    22     3.08844313E+05   # MHu^2(Q)        
    31     6.08487354E+03   # MeL(Q)          
    32     6.08487354E+03   # MmuL(Q)         
    33     6.01043701E+03   # MtauL(Q)        
    34     4.89274609E+03   # MeR(Q)          
    35     4.89274609E+03   # MmuR(Q)         
    36     4.71204150E+03   # MtauR(Q)        
    41     9.66440625E+03   # MqL1(Q)         
    42     9.66440625E+03   # MqL2(Q)         
    43     8.11375830E+03   # MqL3(Q)         
    44     9.49221094E+03   # MuR(Q)          
    45     9.49221094E+03   # McR(Q)          
    46     5.88678564E+03   # MtR(Q)          
    47     9.22819922E+03   # MdR(Q)          
    48     9.22819922E+03   # MsR(Q)          
    49     9.16125586E+03   # MbR(Q)          
Block AU Q=  6.91114697E+03   #
  1  1    -1.05779033E+04   # A_u
  2  2    -1.05779033E+04   # A_c
  3  3    -1.05779033E+04   # A_t
Block AD Q=  6.91114697E+03   #
  1  1    -1.70493691E+04   # A_d
  2  2    -1.70493691E+04   # A_s
  3  3    -1.70493691E+04   # A_b
Block AE Q=  6.91114697E+03   #
  1  1    -1.03375332E+04   # A_e
  2  2    -1.03375332E+04   # A_mu
  3  3    -1.03375332E+04   # A_tau
#  ISAJET decay tables in SUSY Les Houches accord format
#  Created by ISALHD. Last revision: C. Balazs, 2005 May 25
Block DCINFO                           # Program information
     1   ISASUGRA from ISAJET          # Spectrum Calculator
     2   7.87   18-JUL-2017 13:55:55   # Version number
#         PDG         Width
DECAY         6  1.46776152E+00   # TP    decays
#          BR          NDA       ID1       ID2       ID3       ID4
      3.33333313E-01    3            2        -1         5             # TP     -->  UP     DB     BT          
      3.33333313E-01    3            4        -3         5             # TP     -->  CH     SB     BT          
      1.11111097E-01    3          -11        12         5             # TP     -->  E+     NUE    BT          
      1.11111097E-01    3          -13        14         5             # TP     -->  MU+    NUM    BT          
      1.11111097E-01    3          -15        16         5             # TP     -->  TAU+   NUT    BT          
#         PDG         Width
DECAY   1000021  1.13513596E+02   # GLSS  decays
#          BR          NDA       ID1       ID2       ID3       ID4
      5.86279725E-07    3      1000024         1        -2             # GLSS   -->  W1SS+  DN     UB          
      5.86279725E-07    3     -1000024         2        -1             # GLSS   -->  W1SS-  UP     DB          
      5.86279725E-07    3      1000024         3        -4             # GLSS   -->  W1SS+  ST     CB          
      5.86279725E-07    3     -1000024         4        -3             # GLSS   -->  W1SS-  CH     SB          
      9.50382731E-04    3      1000037         1        -2             # GLSS   -->  W2SS+  DN     UB          
      9.50382731E-04    3     -1000037         2        -1             # GLSS   -->  W2SS-  UP     DB          
      9.50382731E-04    3      1000037         3        -4             # GLSS   -->  W2SS+  ST     CB          
      9.50382731E-04    3     -1000037         4        -3             # GLSS   -->  W2SS-  CH     SB          
      4.78572904E-10    2      1000022        21                       # GLSS   -->  Z1SS   GL                 
      1.12916339E-07    3      1000022         2        -2             # GLSS   -->  Z1SS   UP     UB          
      2.43075903E-07    3      1000022         1        -1             # GLSS   -->  Z1SS   DN     DB          
      2.43075903E-07    3      1000022         3        -3             # GLSS   -->  Z1SS   ST     SB          
      1.12916339E-07    3      1000022         4        -4             # GLSS   -->  Z1SS   CH     CB          
      2.66553446E-10    2      1000023        21                       # GLSS   -->  Z2SS   GL                 
      6.27638244E-08    3      1000023         2        -2             # GLSS   -->  Z2SS   UP     UB          
      1.33050634E-07    3      1000023         1        -1             # GLSS   -->  Z2SS   DN     DB          
      1.33050634E-07    3      1000023         3        -3             # GLSS   -->  Z2SS   ST     SB          
      6.27638244E-08    3      1000023         4        -4             # GLSS   -->  Z2SS   CH     CB          
      1.43463922E-06    2      1000025        21                       # GLSS   -->  Z3SS   GL                 
      2.87458934E-05    3      1000025         2        -2             # GLSS   -->  Z3SS   UP     UB          
      2.57223164E-05    3      1000025         1        -1             # GLSS   -->  Z3SS   DN     DB          
      2.57223164E-05    3      1000025         3        -3             # GLSS   -->  Z3SS   ST     SB          
      2.87458934E-05    3      1000025         4        -4             # GLSS   -->  Z3SS   CH     CB          
      1.16750090E-11    2      1000035        21                       # GLSS   -->  Z4SS   GL                 
      7.81099137E-04    3      1000035         2        -2             # GLSS   -->  Z4SS   UP     UB          
      7.83413765E-04    3      1000035         1        -1             # GLSS   -->  Z4SS   DN     DB          
      7.83413765E-04    3      1000035         3        -3             # GLSS   -->  Z4SS   ST     SB          
      7.81099137E-04    3      1000035         4        -4             # GLSS   -->  Z4SS   CH     CB          
      2.73992518E-05    2     -2000002         2                       # GLSS   -->  UBR    UP                 
      2.73992518E-05    2      2000002        -2                       # GLSS   -->  UPR    UB                 
      2.83109001E-03    2     -2000001         1                       # GLSS   -->  DBR    DN                 
      2.83109001E-03    2      2000001        -1                       # GLSS   -->  DNR    DB                 
      2.83108954E-03    2     -2000003         3                       # GLSS   -->  SBR    ST                 
      2.83108954E-03    2      2000003        -3                       # GLSS   -->  STR    SB                 
      2.73695186E-05    2     -2000004         4                       # GLSS   -->  CBR    CH                 
      2.73695186E-05    2      2000004        -4                       # GLSS   -->  CHR    CB                 
      7.04861507E-02    2     -1000005         5                       # GLSS   -->  BB1    BT                 
      7.04861507E-02    2      1000005        -5                       # GLSS   -->  BT1    BB                 
      8.67762603E-03    2     -2000005         5                       # GLSS   -->  BB2    BT                 
      8.67762603E-03    2      2000005        -5                       # GLSS   -->  BT2    BB                 
      3.42197150E-01    2     -1000006         6                       # GLSS   -->  TB1    TP                 
      3.42197150E-01    2      1000006        -6                       # GLSS   -->  TP1    TB                 
      6.93999156E-02    2     -2000006         6                       # GLSS   -->  TB2    TP                 
      6.93999156E-02    2      2000006        -6                       # GLSS   -->  TP2    TB                 
#         PDG         Width
DECAY   1000002  9.07572632E+01   # UPL   decays
#          BR          NDA       ID1       ID2       ID3       ID4
      6.52497765E-05    2      1000022         2                       # UPL    -->  Z1SS   UP                 
      3.62765240E-05    2      1000023         2                       # UPL    -->  Z2SS   UP                 
      1.50477067E-02    2      1000025         2                       # UPL    -->  Z3SS   UP                 
      3.24222475E-01    2      1000035         2                       # UPL    -->  Z4SS   UP                 
      4.50968696E-03    2      1000021         2                       # UPL    -->  GLSS   UP                 
      6.64962979E-04    2      1000024         1                       # UPL    -->  W1SS+  DN                 
      6.55453622E-01    2      1000037         1                       # UPL    -->  W2SS+  DN                 
#         PDG         Width
DECAY   1000001  9.07160797E+01   # DNL   decays
#          BR          NDA       ID1       ID2       ID3       ID4
      1.40601376E-04    2      1000022         1                       # DNL    -->  Z1SS   DN                 
      7.69766339E-05    2      1000023         1                       # DNL    -->  Z2SS   DN                 
      1.34782596E-02    2      1000025         1                       # DNL    -->  Z3SS   DN                 
      3.25515270E-01    2      1000035         1                       # DNL    -->  Z4SS   DN                 
      4.53202194E-03    2      1000021         1                       # DNL    -->  GLSS   DN                 
      1.08785016E-05    2     -1000024         2                       # DNL    -->  W1SS-  UP                 
      6.56246006E-01    2     -1000037         2                       # DNL    -->  W2SS-  UP                 
#         PDG         Width
DECAY   1000003  9.07160797E+01   # STL   decays
#          BR          NDA       ID1       ID2       ID3       ID4
      1.40601376E-04    2      1000022         3                       # STL    -->  Z1SS   ST                 
      7.69766339E-05    2      1000023         3                       # STL    -->  Z2SS   ST                 
      1.34782596E-02    2      1000025         3                       # STL    -->  Z3SS   ST                 
      3.25515270E-01    2      1000035         3                       # STL    -->  Z4SS   ST                 
      4.53202194E-03    2      1000021         3                       # STL    -->  GLSS   ST                 
      1.08785007E-05    2     -1000024         4                       # STL    -->  W1SS-  CH                 
      6.56246006E-01    2     -1000037         4                       # STL    -->  W2SS-  CH                 
#         PDG         Width
DECAY   1000004  9.07572479E+01   # CHL   decays
#          BR          NDA       ID1       ID2       ID3       ID4
      6.52497911E-05    2      1000022         4                       # CHL    -->  Z1SS   CH                 
      3.62765313E-05    2      1000023         4                       # CHL    -->  Z2SS   CH                 
      1.50477095E-02    2      1000025         4                       # CHL    -->  Z3SS   CH                 
      3.24222565E-01    2      1000035         4                       # CHL    -->  Z4SS   CH                 
      4.50949185E-03    2      1000021         4                       # CHL    -->  GLSS   CH                 
      6.64963096E-04    2      1000024         3                       # CHL    -->  W1SS+  ST                 
      6.55453682E-01    2      1000037         3                       # CHL    -->  W2SS+  ST                 
#         PDG         Width
DECAY   1000005  2.54754318E+02   # BT1   decays
#          BR          NDA       ID1       ID2       ID3       ID4
      1.09034674E-02    2      1000022         5                       # BT1    -->  Z1SS   BT                 
      1.07613606E-02    2      1000023         5                       # BT1    -->  Z2SS   BT                 
      3.78743163E-03    2      1000025         5                       # BT1    -->  Z3SS   BT                 
      7.90301561E-02    2      1000035         5                       # BT1    -->  Z4SS   BT                 
      3.90794814E-01    2     -1000024         6                       # BT1    -->  W1SS-  TP                 
      1.60422996E-01    2     -1000037         6                       # BT1    -->  W2SS-  TP                 
      3.43244076E-01    2          -24   1000006                       # BT1    -->  W-     TP1                
      1.05568627E-03    2          -37   1000006                       # BT1    -->  H-     TP1                
#         PDG         Width
DECAY   1000006  1.50349228E+02   # TP1   decays
#          BR          NDA       ID1       ID2       ID3       ID4
      2.32575923E-01    2      1000022         6                       # TP1    -->  Z1SS   TP                 
      2.34932318E-01    2      1000023         6                       # TP1    -->  Z2SS   TP                 
      6.48951530E-02    2      1000025         6                       # TP1    -->  Z3SS   TP                 
      6.28768066E-06    2      1000035         6                       # TP1    -->  Z4SS   TP                 
      4.67579842E-01    2      1000024         5                       # TP1    -->  W1SS+  BT                 
      1.04508945E-05    2      1000037         5                       # TP1    -->  W2SS+  BT                 
#         PDG         Width
DECAY   2000002  2.02669773E+01   # UPR   decays
#          BR          NDA       ID1       ID2       ID3       ID4
      2.51118065E-04    2      1000022         2                       # UPR    -->  Z1SS   UP                 
      1.32981600E-04    2      1000023         2                       # UPR    -->  Z2SS   UP                 
      9.99598980E-01    2      1000025         2                       # UPR    -->  Z3SS   UP                 
      1.69258492E-05    2      1000035         2                       # UPR    -->  Z4SS   UP                 
#         PDG         Width
DECAY   2000001  4.89959145E+00   # DNR   decays
#          BR          NDA       ID1       ID2       ID3       ID4
      2.52662896E-04    2      1000022         1                       # DNR    -->  Z1SS   DN                 
      1.33799535E-04    2      1000023         1                       # DNR    -->  Z2SS   DN                 
      9.99596894E-01    2      1000025         1                       # DNR    -->  Z3SS   DN                 
      1.66260743E-05    2      1000035         1                       # DNR    -->  Z4SS   DN                 
#         PDG         Width
DECAY   2000003  4.89959145E+00   # STR   decays
#          BR          NDA       ID1       ID2       ID3       ID4
      2.52662896E-04    2      1000022         3                       # STR    -->  Z1SS   ST                 
      1.33799535E-04    2      1000023         3                       # STR    -->  Z2SS   ST                 
      9.99596894E-01    2      1000025         3                       # STR    -->  Z3SS   ST                 
      1.66260743E-05    2      1000035         3                       # STR    -->  Z4SS   ST                 
#         PDG         Width
DECAY   2000004  2.02669773E+01   # CHR   decays
#          BR          NDA       ID1       ID2       ID3       ID4
      2.51118065E-04    2      1000022         4                       # CHR    -->  Z1SS   CH                 
      1.32981600E-04    2      1000023         4                       # CHR    -->  Z2SS   CH                 
      9.99598980E-01    2      1000025         4                       # CHR    -->  Z3SS   CH                 
      1.69258492E-05    2      1000035         4                       # CHR    -->  Z4SS   CH                 
#         PDG         Width
DECAY   2000005  3.21293030E+01   # BT2   decays
#          BR          NDA       ID1       ID2       ID3       ID4
      9.69069451E-02    2      1000022         5                       # BT2    -->  Z1SS   BT                 
      9.60982367E-02    2      1000023         5                       # BT2    -->  Z2SS   BT                 
      1.47978768E-01    2      1000025         5                       # BT2    -->  Z3SS   BT                 
      3.90772548E-05    2      1000035         5                       # BT2    -->  Z4SS   BT                 
      1.92915753E-01    2     -1000024         6                       # BT2    -->  W1SS-  TP                 
      7.14372582E-05    2     -1000037         6                       # BT2    -->  W2SS-  TP                 
      2.22312388E-04    2          -24   1000006                       # BT2    -->  W-     TP1                
      4.98211896E-03    2          -24   2000006                       # BT2    -->  W-     TP2                
      2.64583249E-03    2           23   1000005                       # BT2    -->  Z0     BT1                
      2.35492596E-03    2           25   1000005                       # BT2    -->  HL0    BT1                
      1.26587898E-01    2           36   1000005                       # BT2    -->  HA0    BT1                
      1.20006233E-01    2           35   1000005                       # BT2    -->  HH0    BT1                
      2.05420726E-03    2          -37   1000006                       # BT2    -->  H-     TP1                
      2.07136229E-01    2          -37   2000006                       # BT2    -->  H-     TP2                
#         PDG         Width
DECAY   2000006  2.77196198E+02   # TP2   decays
#          BR          NDA       ID1       ID2       ID3       ID4
      1.99981183E-02    2      1000024         5                       # TP2    -->  W1SS+  BT                 
      1.47997081E-01    2      1000037         5                       # TP2    -->  W2SS+  BT                 
      1.62500069E-01    2           23   1000006                       # TP2    -->  Z0     TP1                
      2.31908679E-01    2           25   1000006                       # TP2    -->  HL0    TP1                
      5.14831452E-04    2           35   1000006                       # TP2    -->  HH0    TP1                
      4.86108416E-04    2           36   1000006                       # TP2    -->  HA0    TP1                
      1.78813502E-01    2      1000022         6                       # TP2    -->  Z1SS   TP                 
      1.80687487E-01    2      1000023         6                       # TP2    -->  Z2SS   TP                 
      4.22312506E-03    2      1000025         6                       # TP2    -->  Z3SS   TP                 
      7.28709474E-02    2      1000035         6                       # TP2    -->  Z4SS   TP                 
#         PDG         Width
DECAY   1000011  2.84954834E+01   # EL-   decays
#          BR          NDA       ID1       ID2       ID3       ID4
      3.54628974E-05    2      1000022        11                       # EL-    -->  Z1SS   E-                 
      2.05566066E-05    2      1000023        11                       # EL-    -->  Z2SS   E-                 
      2.06458032E-01    2      1000025        11                       # EL-    -->  Z3SS   E-                 
      2.56555229E-01    2      1000035        11                       # EL-    -->  Z4SS   E-                 
      2.08434813E-05    2     -1000024        12                       # EL-    -->  W1SS-  NUE                
      5.36909878E-01    2     -1000037        12                       # EL-    -->  W2SS-  NUE                
#         PDG         Width
DECAY   1000013  2.84954834E+01   # MUL-  decays
#          BR          NDA       ID1       ID2       ID3       ID4
      3.54628974E-05    2      1000022        13                       # MUL-   -->  Z1SS   MU-                
      2.05566066E-05    2      1000023        13                       # MUL-   -->  Z2SS   MU-                
      2.06458032E-01    2      1000025        13                       # MUL-   -->  Z3SS   MU-                
      2.56555229E-01    2      1000035        13                       # MUL-   -->  Z4SS   MU-                
      2.08434813E-05    2     -1000024        14                       # MUL-   -->  W1SS-  NUM                
      5.36909878E-01    2     -1000037        14                       # MUL-   -->  W2SS-  NUM                
#         PDG         Width
DECAY   1000015  1.84408321E+01   # TAU1- decays
#          BR          NDA       ID1       ID2       ID3       ID4
      5.92615120E-02    2      1000022        15                       # TAU1-  -->  Z1SS   TAU-               
      5.85249364E-02    2      1000023        15                       # TAU1-  -->  Z2SS   TAU-               
      7.64911532E-01    2      1000025        15                       # TAU1-  -->  Z3SS   TAU-               
      1.34876950E-06    2      1000035        15                       # TAU1-  -->  Z4SS   TAU-               
      1.17300719E-01    2     -1000024        16                       # TAU1-  -->  W1SS-  NUT                
      5.35743450E-09    2     -1000037        16                       # TAU1-  -->  W2SS-  NUT                
#         PDG         Width
DECAY   1000012  2.83428726E+01   # NUEL  decays
#          BR          NDA       ID1       ID2       ID3       ID4
      4.70729778E-04    2      1000022        12                       # NUEL   -->  Z1SS   NUE                
      2.55656603E-04    2      1000023        12                       # NUEL   -->  Z2SS   NUE                
      1.99874014E-01    2      1000025        12                       # NUEL   -->  Z3SS   NUE                
      2.59986579E-01    2      1000035        12                       # NUEL   -->  Z4SS   NUE                
      1.28085807E-03    2      1000024        11                       # NUEL   -->  W1SS+  E-                 
      5.38132131E-01    2      1000037        11                       # NUEL   -->  W2SS+  E-                 
#         PDG         Width
DECAY   1000014  2.83428726E+01   # NUML  decays
#          BR          NDA       ID1       ID2       ID3       ID4
      4.70729778E-04    2      1000022        14                       # NUML   -->  Z1SS   NUM                
      2.55656603E-04    2      1000023        14                       # NUML   -->  Z2SS   NUM                
      1.99874014E-01    2      1000025        14                       # NUML   -->  Z3SS   NUM                
      2.59986579E-01    2      1000035        14                       # NUML   -->  Z4SS   NUM                
      1.28085807E-03    2      1000024        13                       # NUML   -->  W1SS+  MU-                
      5.38132131E-01    2      1000037        13                       # NUML   -->  W2SS+  MU-                
#         PDG         Width
DECAY   1000016  3.18419952E+01   # NUTL  decays
#          BR          NDA       ID1       ID2       ID3       ID4
      4.13732836E-04    2      1000022        16                       # NUTL   -->  Z1SS   NUT                
      2.24700896E-04    2      1000023        16                       # NUTL   -->  Z2SS   NUT                
      1.74246266E-01    2      1000025        16                       # NUTL   -->  Z3SS   NUT                
      2.18448058E-01    2      1000035        16                       # NUTL   -->  Z4SS   NUT                
      8.82872939E-02    2      1000024        15                       # NUTL   -->  W1SS+  TAU-               
      4.53027368E-01    2      1000037        15                       # NUTL   -->  W2SS+  TAU-               
      2.71591998E-04    2           24   1000015                       # NUTL   -->  W+     TAU1-              
      6.50810078E-02    2           37   1000015                       # NUTL   -->  H+     TAU1-              
#         PDG         Width
DECAY   2000011  1.53243122E+01   # ER-   decays
#          BR          NDA       ID1       ID2       ID3       ID4
      3.65896325E-04    2      1000022        11                       # ER-    -->  Z1SS   E-                 
      1.93752348E-04    2      1000023        11                       # ER-    -->  Z2SS   E-                 
      9.99437630E-01    2      1000025        11                       # ER-    -->  Z3SS   E-                 
      2.71018848E-06    2      1000035        11                       # ER-    -->  Z4SS   E-                 
#         PDG         Width
DECAY   2000013  1.53243122E+01   # MUR-  decays
#          BR          NDA       ID1       ID2       ID3       ID4
      3.65896325E-04    2      1000022        13                       # MUR-   -->  Z1SS   MU-                
      1.93752348E-04    2      1000023        13                       # MUR-   -->  Z2SS   MU-                
      9.99437630E-01    2      1000025        13                       # MUR-   -->  Z3SS   MU-                
      2.71018848E-06    2      1000035        13                       # MUR-   -->  Z4SS   MU-                
#         PDG         Width
DECAY   2000015  3.19795475E+01   # TAU2- decays
#          BR          NDA       ID1       ID2       ID3       ID4
      4.36511934E-02    2      1000022        15                       # TAU2-  -->  Z1SS   TAU-               
      4.32258621E-02    2      1000023        15                       # TAU2-  -->  Z2SS   TAU-               
      1.80102795E-01    2      1000025        15                       # TAU2-  -->  Z3SS   TAU-               
      2.15554804E-01    2      1000035        15                       # TAU2-  -->  Z4SS   TAU-               
      1.58765652E-05    2     -1000024        16                       # TAU2-  -->  W1SS-  NUT                
      4.51991588E-01    2     -1000037        16                       # TAU2-  -->  W2SS-  NUT                
      1.37277937E-04    2           23   1000015                       # TAU2-  -->  Z0     TAU1-              
      3.81866383E-04    2           25   1000015                       # TAU2-  -->  HL0    TAU1-              
      3.26191634E-02    2           36   1000015                       # TAU2-  -->  HA0    TAU1-              
      3.23195234E-02    2           35   1000015                       # TAU2-  -->  HH0    TAU1-              
#         PDG         Width
DECAY   1000023  5.89505597E-11   # Z2SS  decays
#          BR          NDA       ID1       ID2       ID3       ID4
      4.28106815E-01    2      1000022        22                       # Z2SS   -->  Z1SS   GM                 
      9.67645347E-02    3      1000022         2        -2             # Z2SS   -->  Z1SS   UP     UB          
      1.24778487E-01    3      1000022         1        -1             # Z2SS   -->  Z1SS   DN     DB          
      1.24778487E-01    3      1000022         3        -3             # Z2SS   -->  Z1SS   ST     SB          
      2.83059403E-02    3      1000022        11       -11             # Z2SS   -->  Z1SS   E-     E+          
      2.83059403E-02    3      1000022        13       -13             # Z2SS   -->  Z1SS   MU-    MU+         
      5.63199185E-02    3      1000022        12       -12             # Z2SS   -->  Z1SS   NUE    ANUE        
      5.63199185E-02    3      1000022        14       -14             # Z2SS   -->  Z1SS   NUM    ANUM        
      5.63199148E-02    3      1000022        16       -16             # Z2SS   -->  Z1SS   NUT    ANUT        
#         PDG         Width
DECAY   1000025  8.95596313E+00   # Z3SS  decays
#          BR          NDA       ID1       ID2       ID3       ID4
      3.15358974E-08    2      1000022        22                       # Z3SS   -->  Z1SS   GM                 
      3.16206545E-08    2      1000023        22                       # Z3SS   -->  Z2SS   GM                 
      1.45334080E-01    2      1000024       -24                       # Z3SS   -->  W1SS+  W-                 
      1.45334080E-01    2     -1000024        24                       # Z3SS   -->  W1SS-  W+                 
      1.02815874E-01    2      1000024       -37                       # Z3SS   -->  W1SS+  H-                 
      1.02815874E-01    2     -1000024        37                       # Z3SS   -->  W1SS-  H+                 
      4.94151749E-02    2      1000022        23                       # Z3SS   -->  Z1SS   Z0                 
      9.51333120E-02    2      1000023        23                       # Z3SS   -->  Z2SS   Z0                 
      7.67244532E-11    3      1000022         2        -2             # Z3SS   -->  Z1SS   UP     UB          
      1.47277555E-11    3      1000022         1        -1             # Z3SS   -->  Z1SS   DN     DB          
      1.47277555E-11    3      1000022         3        -3             # Z3SS   -->  Z1SS   ST     SB          
      7.67244532E-11    3      1000022         4        -4             # Z3SS   -->  Z1SS   CH     CB          
      9.41657596E-09    3      1000022         5        -5             # Z3SS   -->  Z1SS   BT     BB          
      2.43164222E-09    3      1000022        11       -11             # Z3SS   -->  Z1SS   E-     E+          
      2.43164222E-09    3      1000022        13       -13             # Z3SS   -->  Z1SS   MU-    MU+         
      6.88638750E-07    3      1000022        15       -15             # Z3SS   -->  Z1SS   TAU-   TAU+        
      4.30011887E-10    3      1000022        12       -12             # Z3SS   -->  Z1SS   NUE    ANUE        
      4.30011887E-10    3      1000022        14       -14             # Z3SS   -->  Z1SS   NUM    ANUM        
      4.53616422E-10    3      1000022        16       -16             # Z3SS   -->  Z1SS   NUT    ANUT        
      2.94426948E-11    3      1000023         2        -2             # Z3SS   -->  Z2SS   UP     UB          
      5.75901219E-12    3      1000023         1        -1             # Z3SS   -->  Z2SS   DN     DB          
      5.75901219E-12    3      1000023         3        -3             # Z3SS   -->  Z2SS   ST     SB          
      2.94426948E-11    3      1000023         4        -4             # Z3SS   -->  Z2SS   CH     CB          
      9.30765331E-09    3      1000023         5        -5             # Z3SS   -->  Z2SS   BT     BB          
      9.46232981E-10    3      1000023        11       -11             # Z3SS   -->  Z2SS   E-     E+          
      9.46232981E-10    3      1000023        13       -13             # Z3SS   -->  Z2SS   MU-    MU+         
      6.79265270E-07    3      1000023        15       -15             # Z3SS   -->  Z2SS   TAU-   TAU+        
      1.70066961E-10    3      1000023        12       -12             # Z3SS   -->  Z2SS   NUE    ANUE        
      1.70066961E-10    3      1000023        14       -14             # Z3SS   -->  Z2SS   NUM    ANUM        
      1.79464610E-10    3      1000023        16       -16             # Z3SS   -->  Z2SS   NUT    ANUT        
      1.04931600E-01    2      1000022        25                       # Z3SS   -->  Z1SS   HL0                
      5.42420968E-02    2      1000022        35                       # Z3SS   -->  Z1SS   HH0                
      4.53102812E-02    2      1000022        36                       # Z3SS   -->  Z1SS   HA0                
      5.57801127E-02    2      1000023        25                       # Z3SS   -->  Z2SS   HL0                
      4.46068831E-02    2      1000023        35                       # Z3SS   -->  Z2SS   HH0                
      5.42791896E-02    2      1000023        36                       # Z3SS   -->  Z2SS   HA0                
#         PDG         Width
DECAY   1000035  6.58514023E+01   # Z4SS  decays
#          BR          NDA       ID1       ID2       ID3       ID4
      2.40921509E-07    2      1000022        22                       # Z4SS   -->  Z1SS   GM                 
      3.58650368E-07    2      1000023        22                       # Z4SS   -->  Z2SS   GM                 
      4.41967174E-09    2      1000025        22                       # Z4SS   -->  Z3SS   GM                 
      1.38932213E-01    2      1000024       -24                       # Z4SS   -->  W1SS+  W-                 
      1.38932213E-01    2     -1000024        24                       # Z4SS   -->  W1SS-  W+                 
      1.16097271E-01    2      1000024       -37                       # Z4SS   -->  W1SS+  H-                 
      1.16097271E-01    2     -1000024        37                       # Z4SS   -->  W1SS-  H+                 
      8.68378356E-06    3     -1000037         2        -1             # Z4SS   -->  W2SS-  UP     DB          
      2.89459445E-06    3     -1000037        12       -11             # Z4SS   -->  W2SS-  NUE    E+          
      2.89459445E-06    3     -1000037        14       -13             # Z4SS   -->  W2SS-  NUM    MU+         
      8.68378356E-06    3      1000037         1        -2             # Z4SS   -->  W2SS+  DN     UB          
      2.89459445E-06    3      1000037        11       -12             # Z4SS   -->  W2SS+  E-     ANUE        
      2.89459445E-06    3      1000037        13       -14             # Z4SS   -->  W2SS+  MU-    ANUM        
      8.68378356E-06    3     -1000037         4        -3             # Z4SS   -->  W2SS-  CH     SB          
      2.89459445E-06    3     -1000037        16       -15             # Z4SS   -->  W2SS-  NUT    TAU+        
      8.68378356E-06    3      1000037         3        -4             # Z4SS   -->  W2SS+  ST     CB          
      2.89459445E-06    3      1000037        15       -16             # Z4SS   -->  W2SS+  TAU-   ANUT        
      4.19263542E-02    2      1000022        23                       # Z4SS   -->  Z1SS   Z0                 
      7.77219310E-02    2      1000023        23                       # Z4SS   -->  Z2SS   Z0                 
      1.30710869E-05    2      1000025        23                       # Z4SS   -->  Z3SS   Z0                 
      4.38255626E-10    3      1000022         2        -2             # Z4SS   -->  Z1SS   UP     UB          
      9.47035117E-10    3      1000022         1        -1             # Z4SS   -->  Z1SS   DN     DB          
      9.47035117E-10    3      1000022         3        -3             # Z4SS   -->  Z1SS   ST     SB          
      4.38255626E-10    3      1000022         4        -4             # Z4SS   -->  Z1SS   CH     CB          
      5.20240690E-07    3      1000022         5        -5             # Z4SS   -->  Z1SS   BT     BB          
      4.23251711E-10    3      1000022        11       -11             # Z4SS   -->  Z1SS   E-     E+          
      4.23251711E-10    3      1000022        13       -13             # Z4SS   -->  Z1SS   MU-    MU+         
      5.80344590E-07    3      1000022        15       -15             # Z4SS   -->  Z1SS   TAU-   TAU+        
      5.66182701E-09    3      1000022        12       -12             # Z4SS   -->  Z1SS   NUE    ANUE        
      5.66182701E-09    3      1000022        14       -14             # Z4SS   -->  Z1SS   NUM    ANUM        
      6.03985217E-09    3      1000022        16       -16             # Z4SS   -->  Z1SS   NUT    ANUT        
      2.03290204E-10    3      1000023         2        -2             # Z4SS   -->  Z2SS   UP     UB          
      4.32591268E-10    3      1000023         1        -1             # Z4SS   -->  Z2SS   DN     DB          
      4.32591268E-10    3      1000023         3        -3             # Z4SS   -->  Z2SS   ST     SB          
      2.03290204E-10    3      1000023         4        -4             # Z4SS   -->  Z2SS   CH     CB          
      5.13707107E-07    3      1000023         5        -5             # Z4SS   -->  Z2SS   BT     BB          
      2.09160494E-10    3      1000023        11       -11             # Z4SS   -->  Z2SS   E-     E+          
      2.09160494E-10    3      1000023        13       -13             # Z4SS   -->  Z2SS   MU-    MU+         
      5.74403828E-07    3      1000023        15       -15             # Z4SS   -->  Z2SS   TAU-   TAU+        
      2.62169730E-09    3      1000023        12       -12             # Z4SS   -->  Z2SS   NUE    ANUE        
      2.62169730E-09    3      1000023        14       -14             # Z4SS   -->  Z2SS   NUM    ANUM        
      2.79961432E-09    3      1000023        16       -16             # Z4SS   -->  Z2SS   NUT    ANUT        
      1.83172464E-08    3      1000025         2        -2             # Z4SS   -->  Z3SS   UP     UB          
      1.64502403E-08    3      1000025         1        -1             # Z4SS   -->  Z3SS   DN     DB          
      1.64502403E-08    3      1000025         3        -3             # Z4SS   -->  Z3SS   ST     SB          
      1.83172464E-08    3      1000025         4        -4             # Z4SS   -->  Z3SS   CH     CB          
      3.89334893E-08    3      1000025         5        -5             # Z4SS   -->  Z3SS   BT     BB          
      6.38866766E-07    3      1000025        11       -11             # Z4SS   -->  Z3SS   E-     E+          
      6.38866766E-07    3      1000025        13       -13             # Z4SS   -->  Z3SS   MU-    MU+         
      6.87807869E-07    3      1000025        15       -15             # Z4SS   -->  Z3SS   TAU-   TAU+        
      6.23852088E-07    3      1000025        12       -12             # Z4SS   -->  Z3SS   NUE    ANUE        
      6.23852088E-07    3      1000025        14       -14             # Z4SS   -->  Z3SS   NUM    ANUM        
      6.70585280E-07    3      1000025        16       -16             # Z4SS   -->  Z3SS   NUT    ANUT        
      8.30606148E-02    2      1000022        25                       # Z4SS   -->  Z1SS   HL0                
      5.71136028E-02    2      1000022        35                       # Z4SS   -->  Z1SS   HH0                
      6.06313348E-02    2      1000022        36                       # Z4SS   -->  Z1SS   HA0                
      5.22679165E-02    2      1000023        25                       # Z4SS   -->  Z2SS   HL0                
      6.01242669E-02    2      1000023        35                       # Z4SS   -->  Z2SS   HH0                
      5.68419583E-02    2      1000023        36                       # Z4SS   -->  Z2SS   HA0                
      1.79356299E-04    2      1000025        25                       # Z4SS   -->  Z3SS   HL0                
      1.12925727E-06    2      1000025        35                       # Z4SS   -->  Z3SS   HH0                
      4.64087435E-07    2      1000025        36                       # Z4SS   -->  Z3SS   HA0                
#         PDG         Width
DECAY   1000024  1.46346281E-07   # W1SS+ decays
#          BR          NDA       ID1       ID2       ID3       ID4
      2.57356286E-01    3      1000022         2        -1             # W1SS+  -->  Z1SS   UP     DB          
      2.57356286E-01    3      1000022         4        -3             # W1SS+  -->  Z1SS   CH     SB          
      8.57854337E-02    3      1000022       -11        12             # W1SS+  -->  Z1SS   E+     NUE         
      8.57854337E-02    3      1000022       -13        14             # W1SS+  -->  Z1SS   MU+    NUM         
      8.57868120E-02    3      1000022       -15        16             # W1SS+  -->  Z1SS   TAU+   NUT         
      7.59764910E-02    3      1000023         2        -1             # W1SS+  -->  Z2SS   UP     DB          
      7.59764910E-02    3      1000023         4        -3             # W1SS+  -->  Z2SS   CH     SB          
      2.53254976E-02    3      1000023       -11        12             # W1SS+  -->  Z2SS   E+     NUE         
      2.53254976E-02    3      1000023       -13        14             # W1SS+  -->  Z2SS   MU+    NUM         
      2.53258925E-02    3      1000023       -15        16             # W1SS+  -->  Z2SS   TAU+   NUT         
#         PDG         Width
DECAY   1000037  6.29932976E+01   # W2SS+ decays
#          BR          NDA       ID1       ID2       ID3       ID4
      1.14266319E-09    3      1000022         2        -1             # W2SS+  -->  Z1SS   UP     DB          
      1.14266319E-09    3      1000022         4        -3             # W2SS+  -->  Z1SS   CH     SB          
      5.23618882E-09    3      1000022       -11        12             # W2SS+  -->  Z1SS   E+     NUE         
      5.23618882E-09    3      1000022       -13        14             # W2SS+  -->  Z1SS   MU+    NUM         
      5.78392189E-07    3      1000022       -15        16             # W2SS+  -->  Z1SS   TAU+   NUT         
      1.19817548E-01    2      1000022        24                       # W2SS+  -->  Z1SS   W+                 
      1.20931163E-01    2      1000022        37                       # W2SS+  -->  Z1SS   H+                 
      7.45090545E-10    3      1000023         2        -1             # W2SS+  -->  Z2SS   UP     DB          
      7.45090545E-10    3      1000023         4        -3             # W2SS+  -->  Z2SS   CH     SB          
      3.10570347E-09    3      1000023       -11        12             # W2SS+  -->  Z2SS   E+     NUE         
      3.10570347E-09    3      1000023       -13        14             # W2SS+  -->  Z2SS   MU+    NUM         
      5.70522900E-07    3      1000023       -15        16             # W2SS+  -->  Z2SS   TAU+   NUT         
      1.16978385E-01    2      1000023        24                       # W2SS+  -->  Z2SS   W+                 
      1.19719215E-01    2      1000023        37                       # W2SS+  -->  Z2SS   H+                 
      3.22817471E-08    3      1000025         2        -1             # W2SS+  -->  Z3SS   UP     DB          
      3.22817471E-08    3      1000025         4        -3             # W2SS+  -->  Z3SS   CH     SB          
      1.16077047E-06    3      1000025       -11        12             # W2SS+  -->  Z3SS   E+     NUE         
      1.16077047E-06    3      1000025       -13        14             # W2SS+  -->  Z3SS   MU+    NUM         
      1.24791393E-06    3      1000025       -15        16             # W2SS+  -->  Z3SS   TAU+   NUT         
      1.17050363E-02    2      1000025        24                       # W2SS+  -->  Z3SS   W+                 
      1.45654110E-06    2      1000025        37                       # W2SS+  -->  Z3SS   H+                 
      1.31044820E-01    2      1000024        23                       # W2SS+  -->  W1SS+  Z0                 
      4.02446121E-09    3      1000024         1        -1             # W2SS+  -->  W1SS+  DN     DB          
      4.02446121E-09    3      1000024         3        -3             # W2SS+  -->  W1SS+  ST     SB          
      6.58429006E-11    3      1000024         2        -2             # W2SS+  -->  W1SS+  UP     UB          
      6.58429006E-11    3      1000024         4        -4             # W2SS+  -->  W1SS+  CH     CB          
      2.25092681E-10    3      1000024        12       -12             # W2SS+  -->  W1SS+  NUE    ANUE        
      2.25092681E-10    3      1000024        14       -14             # W2SS+  -->  W1SS+  NUM    ANUM        
      1.03251274E-09    3      1000024        16       -16             # W2SS+  -->  W1SS+  NUT    ANUT        
      1.37950904E-08    3      1000024        11       -11             # W2SS+  -->  W1SS+  E-     E+          
      1.37950904E-08    3      1000024        13       -13             # W2SS+  -->  W1SS+  MU-    MU+         
      1.47154466E-08    3      1000024        15       -15             # W2SS+  -->  W1SS+  TAU-   TAU+        
      1.39517412E-01    2      1000024        25                       # W2SS+  -->  W1SS+  HL0                
      1.20017804E-01    2      1000024        35                       # W2SS+  -->  W1SS+  HH0                
      1.20262355E-01    2      1000024        36                       # W2SS+  -->  W1SS+  HA0                
#         PDG         Width
DECAY        25  4.00697021E-03   # HL0   decays
#          BR          NDA       ID1       ID2       ID3       ID4
      5.58650592E-09    2           11       -11                       # HL0    -->  E-     E+                 
      2.35871368E-04    2           13       -13                       # HL0    -->  MU-    MU+                
      6.74764216E-02    2           15       -15                       # HL0    -->  TAU-   TAU+               
      7.00240616E-06    2            1        -1                       # HL0    -->  DN     DB                 
      2.82932352E-03    2            3        -3                       # HL0    -->  ST     SB                 
      6.06238782E-01    2            5        -5                       # HL0    -->  BT     BB                 
      2.13700719E-06    2            2        -2                       # HL0    -->  UP     UB                 
      3.96881327E-02    2            4        -4                       # HL0    -->  CH     CB                 
      2.65184790E-03    2           22        22                       # HL0    -->  GM     GM                 
      5.31003773E-02    2           21        21                       # HL0    -->  GL     GL                 
      1.13674747E-02    3           24        11       -12             # HL0    -->  W+     E-     ANUE        
      1.13674747E-02    3           24        13       -14             # HL0    -->  W+     MU-    ANUM        
      1.13674747E-02    3           24        15       -16             # HL0    -->  W+     TAU-   ANUT        
      3.41024250E-02    3           24        -2         1             # HL0    -->  W+     UB     DN          
      3.41024250E-02    3           24        -4         3             # HL0    -->  W+     CB     ST          
      1.13674747E-02    3          -24       -11        12             # HL0    -->  W-     E+     NUE         
      1.13674747E-02    3          -24       -13        14             # HL0    -->  W-     MU+    NUM         
      1.13674747E-02    3          -24       -15        16             # HL0    -->  W-     TAU+   NUT         
      3.41024250E-02    3          -24         2        -1             # HL0    -->  W-     UP     DB          
      3.41024250E-02    3          -24         4        -3             # HL0    -->  W-     CH     SB          
      1.58360647E-03    3           23        12       -12             # HL0    -->  Z0     NUE    ANUE        
      1.58360647E-03    3           23        14       -14             # HL0    -->  Z0     NUM    ANUM        
      1.58360647E-03    3           23        16       -16             # HL0    -->  Z0     NUT    ANUT        
      7.97013228E-04    3           23        11       -11             # HL0    -->  Z0     E-     E+          
      7.97013228E-04    3           23        13       -13             # HL0    -->  Z0     MU-    MU+         
      7.97013228E-04    3           23        15       -15             # HL0    -->  Z0     TAU-   TAU+        
      2.73049972E-03    3           23         2        -2             # HL0    -->  Z0     UP     UB          
      2.73049972E-03    3           23         4        -4             # HL0    -->  Z0     CH     CB          
      3.51755647E-03    3           23         1        -1             # HL0    -->  Z0     DN     DB          
      3.51755647E-03    3           23         3        -3             # HL0    -->  Z0     ST     SB          
      3.51755647E-03    3           23         5        -5             # HL0    -->  Z0     BT     BB          
#         PDG         Width
DECAY        35  3.53685713E+00   # HH0   decays
#          BR          NDA       ID1       ID2       ID3       ID4
      1.08805605E-08    2           11       -11                       # HH0    -->  E-     E+                 
      4.59396862E-04    2           13       -13                       # HH0    -->  MU-    MU+                
      1.31575853E-01    2           15       -15                       # HH0    -->  TAU-   TAU+               
      1.33287358E-05    2            1        -1                       # HH0    -->  DN     DB                 
      5.38548362E-03    2            3        -3                       # HH0    -->  ST     SB                 
      8.02653015E-01    2            5        -5                       # HH0    -->  BT     BB                 
      8.83238205E-11    2            2        -2                       # HH0    -->  UP     UB                 
      1.24386327E-06    2            4        -4                       # HH0    -->  CH     CB                 
      5.67421094E-02    2            6        -6                       # HH0    -->  TP     TB                 
      1.67770253E-07    2           22        22                       # HH0    -->  GM     GM                 
      2.39673591E-05    2           21        21                       # HH0    -->  GL     GL                 
      2.27965880E-04    2           24       -24                       # HH0    -->  W+     W-                 
      1.15741954E-04    2           23        23                       # HH0    -->  Z0     Z0                 
      4.09144617E-04    2      1000022   1000022                       # HH0    -->  Z1SS   Z1SS               
      4.01423749E-05    2      1000022   1000023                       # HH0    -->  Z1SS   Z2SS               
      2.87370436E-04    2      1000023   1000023                       # HH0    -->  Z2SS   Z2SS               
      1.21609366E-03    2      1000024  -1000024                       # HH0    -->  W1SS+  W1SS-              
      8.48990865E-04    2           25        25                       # HH0    -->  HL0    HL0                
#         PDG         Width
DECAY        36  3.52502799E+00   # HA0   decays
#          BR          NDA       ID1       ID2       ID3       ID4
      1.08470752E-08    2           11       -11                       # HA0    -->  E-     E+                 
      4.57983086E-04    2           13       -13                       # HA0    -->  MU-    MU+                
      1.31172553E-01    2           15       -15                       # HA0    -->  TAU-   TAU+               
      1.32884488E-05    2            1        -1                       # HA0    -->  DN     DB                 
      5.36920596E-03    2            3        -3                       # HA0    -->  ST     SB                 
      8.00262749E-01    2            5        -5                       # HA0    -->  BT     BB                 
      8.39877889E-11    2            2        -2                       # HA0    -->  UP     UB                 
      1.18373021E-06    2            4        -4                       # HA0    -->  CH     CB                 
      5.99787347E-02    2            6        -6                       # HA0    -->  TP     TB                 
      3.22762048E-07    2           22        22                       # HA0    -->  GM     GM                 
      7.44150457E-05    2           21        21                       # HA0    -->  GL     GL                 
      6.42041152E-04    2      1000022   1000022                       # HA0    -->  Z1SS   Z1SS               
      4.73964974E-06    2      1000022   1000023                       # HA0    -->  Z1SS   Z2SS               
      2.63808703E-04    2      1000023   1000023                       # HA0    -->  Z2SS   Z2SS               
      1.53971615E-03    2      1000024  -1000024                       # HA0    -->  W1SS+  W1SS-              
      2.19200694E-04    2           25        23                       # HA0    -->  HL0    Z0                 
#         PDG         Width
DECAY        37  3.11882544E+00   # H+    decays
#          BR          NDA       ID1       ID2       ID3       ID4
      1.22994050E-08    2           12       -11                       # H+     -->  NUE    E+                 
      5.19303081E-04    2           14       -13                       # H+     -->  NUM    MU+                
      1.48735434E-01    2           16       -15                       # H+     -->  NUT    TAU+               
      1.38495843E-05    2            2        -1                       # H+     -->  UP     DB                 
      5.59710991E-03    2            4        -3                       # H+     -->  CH     SB                 
      8.44796538E-01    2            6        -5                       # H+     -->  TP     BB                 
      1.02916065E-05    2      1000024   1000022                       # H+     -->  W1SS+  Z1SS               
      7.89718397E-05    2      1000024   1000023                       # H+     -->  W1SS+  Z2SS               
      2.48457800E-04    2           25        24                       # H+     -->  HL0    W+                 
