# SUSY Les Houches Accord 2 - MSSM spectrum + Decays
# SPheno v3.1.12 
# W. Porod, Comput. Phys. Commun. 153 (2003) 275-315, hep-ph/0301101
# in case of problems send email to porod@physik.uni-wuerzburg.de
# Created: 09.12.2016,  15:23
Block SPINFO         # Program information
     1   SPheno      # spectrum calculator
     2   v3.1.12     # version number
#
Block SPhenoINFO     # SPheno specific information
    1      2         # using 2-loop RGEs
    2      1         # using running masses for boundary conditions at mZ
Block MODSEL  # Model selection
    1    2    # mGMSB model
Block MINPAR  # Input parameters
    1    1.60000000E+05  # Lambda, scale of SUSY breaking
    2    2.50000000E+05  # M_M, messenger mass scale
    3    5.00000000E+00  # tanb at m_Z   
    4    1.00000000E+00  # Sign(mu)
    5    3.00000000E+00  # N_5 number of effective five-plets
    6    1.00000000E+00  # c_grav, Gravitino mass factor
Block gauge Q=  2.50000000E+05  # (GMSB scale)
   1    4.92745898E-01  # g'(Q)^DRbar
   2    6.45768957E-01  # g(Q)^DRbar
   3    9.30561350E-01  # g3(Q)^DRbar
Block SMINPUTS  # SM parameters
         1     1.27932421E+02  # alpha_em^-1(MZ)^MSbar
         2     1.16639000E-05  # G_mu [GeV^-2]
         3     1.17200000E-01  # alpha_s(MZ)^MSbar
         4     9.11876000E+01  # m_Z(pole)
         5     4.20000000E+00  # m_b(m_b), MSbar
         6     1.72500000E+02  # m_t(pole)
         7     1.77700000E+00  # m_tau(pole)
         8     0.00000000E+00  # m_nu_3
        11     5.10998910E-04  # m_e(pole)
        12     0.00000000E+00  # m_nu_1
        13     1.05658000E-01  # m_muon(pole)
        14     0.00000000E+00  # m_nu_2
        21     5.00000000E-03  # m_d(2 GeV), MSbar
        22     3.00000000E-03  # m_u(2 GeV), MSbar
        23     1.05000000E-01  # m_s(2 GeV), MSbar
        24     1.27000000E+00  # m_c(m_c), MSbar
Block gauge Q=  3.00034882E+03  # (SUSY scale)
   1    3.65377446E-01  # g'(Q)^DRbar
   2    6.37020919E-01  # g(Q)^DRbar
   3    1.00405774E+00  # g3(Q)^DRbar
Block Yu Q=  3.00034882E+03  # (SUSY scale)
  1  1     8.42800194E-06   # Y_u(Q)^DRbar
  2  2     3.56785460E-03   # Y_c(Q)^DRbar
  3  3     8.48255558E-01   # Y_t(Q)^DRbar
Block Yd Q=  3.00034882E+03  # (SUSY scale)
  1  1     6.59764483E-05   # Y_d(Q)^DRbar
  2  2     1.38550490E-03   # Y_s(Q)^DRbar
  3  3     6.48489896E-02   # Y_b(Q)^DRbar
Block Ye Q=  3.00034882E+03  # (SUSY scale)
  1  1     1.43294920E-05   # Y_e(Q)^DRbar
  2  2     2.96287447E-03   # Y_mu(Q)^DRbar
  3  3     4.98324068E-02   # Y_tau(Q)^DRbar
Block Au Q=  3.00034882E+03  # (SUSY scale)
  1  1    -8.94452153E+02   # A_u(Q)^DRbar
  2  2    -8.94451254E+02   # A_c(Q)^DRbar
  3  3    -8.46544151E+02   # A_t(Q)^DRbar
Block Ad Q=  3.00034882E+03  # (SUSY scale)
  1  1    -9.50762698E+02   # A_d(Q)^DRbar
  2  2    -9.50762285E+02   # A_s(Q)^DRbar
  3  3    -9.34933249E+02   # A_b(Q)^DRbar
Block Ae Q=  3.00034882E+03  # (SUSY scale)
  1  1    -1.08988045E+02   # A_e(Q)^DRbar
  2  2    -1.08987955E+02   # A_mu(Q)^DRbar
  3  3    -1.08962751E+02   # A_tau(Q)^DRbar
Block MSOFT Q=  3.00034882E+03  # soft SUSY breaking masses at Q
   1    7.28098950E+02  # M_1
   2    1.32388636E+03  # M_2
   3    3.30216661E+03  # M_3
  21    9.72417707E+05  # M^2_(H,d)
  22   -8.37326253E+05  # M^2_(H,u)
  31    9.91708535E+02  # M_(L,11)
  32    9.91708042E+02  # M_(L,22)
  33    9.91569085E+02  # M_(L,33)
  34    4.82857618E+02  # M_(E,11)
  35    4.82855557E+02  # M_(E,22)
  36    4.82274286E+02  # M_(E,33)
  41    3.11464548E+03  # M_(Q,11)
  42    3.11464364E+03  # M_(Q,22)
  43    3.02408131E+03  # M_(Q,33)
  44    2.98419407E+03  # M_(U,11)
  45    2.98419070E+03  # M_(U,22)
  46    2.78932747E+03  # M_(U,33)
  47    2.97136038E+03  # M_(D,11)
  48    2.97135986E+03  # M_(D,22)
  49    2.97022181E+03  # M_(D,33)
Block MASS  # Mass spectrum
#   PDG code      mass          particle
         6     1.72500000E+02  # m_t(pole)
        23     9.11876000E+01  # m_Z(pole)
        24     8.03177360E+01  # W+
        15     1.77700000E+00  # m_tau(pole)
        25     1.16495898E+02  # h0
        35     1.50354747E+03  # H0
        36     1.50292489E+03  # A0
        37     1.50488517E+03  # H+
   1000001     3.24284479E+03  # ~d_L
   2000001     3.09167567E+03  # ~d_R
   1000002     3.24193130E+03  # ~u_L
   2000002     3.10375423E+03  # ~u_R
   1000003     3.24284254E+03  # ~s_L
   2000003     3.09167501E+03  # ~s_R
   1000004     3.24192922E+03  # ~c_L
   2000004     3.10375010E+03  # ~c_R
   1000005     3.09012549E+03  # ~b_1
   2000005     3.13197861E+03  # ~b_2
   1000006     2.86893158E+03  # ~t_1
   2000006     3.13778047E+03  # ~t_2
   1000011     1.01437953E+03  # ~e_L-
   2000011     5.02074004E+02  # ~e_R-
   1000012     1.01109146E+03  # ~nu_eL
   1000013     1.01437904E+03  # ~mu_L-
   2000013     5.02070997E+02  # ~mu_R-
   1000014     1.01109076E+03  # ~nu_muL
   1000015     5.01222838E+02  # ~tau_1-
   2000015     1.01423850E+03  # ~tau_2-
   1000016     1.01089210E+03  # ~nu_tauL
   1000021     3.45064719E+03  # ~g
   1000022     7.08135307E+02  # ~chi_10
   1000023     1.06363013E+03  # ~chi_20
   1000025    -1.07523914E+03  # ~chi_30
   1000035     1.36512371E+03  # ~chi_40
   1000024     1.06046928E+03  # ~chi_1+
   1000037     1.36525703E+03  # ~chi_2+
   1000039     9.60000000E-09  # ~G
# Higgs mixing
Block alpha # Effective Higgs mixing angle
          -2.09718960E-01   # alpha
Block Hmix Q=  3.00034882E+03  # Higgs mixing parameters
   1    1.06157997E+03  # mu
   2    4.74445135E+00  # tan[beta](Q)
   3    2.43548881E+02  # v(Q)
   4    1.97001816E+06  # m^2_A(Q)
Block stopmix # stop mixing matrix
   1  1     1.13314597E-01   # Re[R_st(1,1)]
   1  2     9.93559159E-01   # Re[R_st(1,2)]
   2  1    -9.93559159E-01   # Re[R_st(2,1)]
   2  2     1.13314597E-01   # Re[R_st(2,2)]
Block sbotmix # sbottom mixing matrix
   1  1     5.80816584E-02   # Re[R_sb(1,1)]
   1  2     9.98311836E-01   # Re[R_sb(1,2)]
   2  1    -9.98311836E-01   # Re[R_sb(2,1)]
   2  2     5.80816584E-02   # Re[R_sb(2,2)]
Block staumix # stau mixing matrix
   1  1     1.20437056E-02   # Re[R_sta(1,1)]
   1  2     9.99927472E-01   # Re[R_sta(1,2)]
   2  1    -9.99927472E-01   # Re[R_sta(2,1)]
   2  2     1.20437056E-02   # Re[R_sta(2,2)]
Block Nmix # neutralino mixing matrix
   1  1    -9.94464357E-01   # Re[N(1,1)]
   1  2     9.61075539E-03   # Re[N(1,2)]
   1  3    -8.30870898E-02   # Re[N(1,3)]
   1  4     6.35988377E-02   # Re[N(1,4)]
   2  1    -1.03339451E-01   # Re[N(2,1)]
   2  2    -2.20256696E-01   # Re[N(2,2)]
   2  3     6.88171737E-01   # Re[N(2,3)]
   2  4    -6.83540493E-01   # Re[N(2,4)]
   3  1    -1.36002308E-02   # Re[N(3,1)]
   3  2     1.78255330E-02   # Re[N(3,2)]
   3  3     7.06379709E-01   # Re[N(3,3)]
   3  4     7.07477909E-01   # Re[N(3,4)]
   4  1    -1.32904018E-02   # Re[N(4,1)]
   4  2     9.75231701E-01   # Re[N(4,2)]
   4  3     1.43331444E-01   # Re[N(4,3)]
   4  4    -1.67936270E-01   # Re[N(4,4)]
Block Umix # chargino mixing matrix
   1  1    -2.02931566E-01   # Re[U(1,1)]
   1  2     9.79192923E-01   # Re[U(1,2)]
   2  1     9.79192923E-01   # Re[U(2,1)]
   2  2     2.02931566E-01   # Re[U(2,2)]
Block Vmix # chargino mixing matrix
   1  1    -2.37681458E-01   # Re[V(1,1)]
   1  2     9.71343155E-01   # Re[V(1,2)]
   2  1     9.71343155E-01   # Re[V(2,1)]
   2  2     2.37681458E-01   # Re[V(2,2)]
DECAY   2000011     3.96687794E-10   # ~e^-_R
#    BR                NDA      ID1      ID2
     1.00000000E+00    2     1000039        11   # BR(~e^-_R -> ~G e^-)
DECAY   1000011     3.38425172E-01   # ~e^-_L
#    BR                NDA      ID1      ID2
     9.99999951E-01    2     1000022        11   # BR(~e^-_L -> chi^0_1 e^-)
     4.87403396E-09    2     2000011        23   # BR(~e^-_L -> ~e^-_R Z)
     4.90900536E-09    2     2000011        25   # BR(~e^-_L -> ~e^-_R h^0)
     3.94593473E-08    2     1000039        11   # BR(~e^-_L -> ~G e^-)
DECAY   2000013     3.96675845E-10   # ~mu^-_R
#    BR                NDA      ID1      ID2
     1.00000000E+00    2     1000039        13   # BR(~mu^-_R -> ~G mu^-)
DECAY   1000013     3.38566175E-01   # ~mu^-_L
#    BR                NDA      ID1      ID2
     9.99581881E-01    2     1000022        13   # BR(~mu^-_L -> chi^0_1 mu^-)
     2.08292831E-04    2     2000013        23   # BR(~mu^-_L -> ~mu^-_R Z)
     2.09786955E-04    2     2000013        25   # BR(~mu^-_L -> ~mu^-_R h^0)
     3.94428150E-08    2     1000039        13   # BR(~mu^-_L -> ~G mu^-)
DECAY   1000015     3.93316878E-10   # ~tau^-_1
#    BR                NDA      ID1      ID2
     1.00000000E+00    2     1000039        15   # BR(~tau^-_1 -> ~G tau^-)
DECAY   2000015     3.78347846E-01   # ~tau^-_2
#    BR                NDA      ID1      ID2
     8.94076259E-01    2     1000022        15   # BR(~tau^-_2 -> chi^0_1 tau^-)
     5.27863046E-02    2     1000015        23   # BR(~tau^-_2 -> ~tau^-_1 Z)
     5.31374012E-02    2     1000015        25   # BR(~tau^-_2 -> ~tau^-_1 h^0)
     3.52706961E-08    2     1000039        15   # BR(~tau^-_2 -> ~G tau^-)
DECAY   1000012     3.56393508E-01   # ~nu_e
#    BR                NDA      ID1      ID2
     9.99999954E-01    2     1000022        12   # BR(~nu_e -> chi^0_1 nu_e)
     8.93846927E-09    2     2000011        24   # BR(~nu_e -> ~e^-_R W^+)
     3.68665585E-08    2     1000039        12   # BR(~nu_e -> ~G nu_e)
DECAY   1000014     3.56528494E-01   # ~nu_mu
#    BR                NDA      ID1      ID2
     9.99617962E-01    2     1000022        14   # BR(~nu_mu -> chi^0_1 nu_mu)
     3.82001558E-04    2     2000013        24   # BR(~nu_mu -> ~mu^-_R W^+)
     3.68524719E-08    2     1000039        14   # BR(~nu_mu -> ~G nu_mu)
DECAY   1000016     3.94617110E-01   # ~nu_tau
#    BR                NDA      ID1      ID2
     9.02273631E-01    2     1000022        16   # BR(~nu_tau -> chi^0_1 nu_tau)
     9.77263361E-02    2     1000015        24   # BR(~nu_tau -> ~tau^-_1 W^+)
     3.32627579E-08    2     1000039        16   # BR(~nu_tau -> ~G nu_tau)
DECAY   2000001     1.63581321E+00   # ~d_R
#    BR                NDA      ID1      ID2
     9.90451147E-01    2     1000022         1   # BR(~d_R -> chi^0_1 d)
     9.25938780E-03    2     1000023         1   # BR(~d_R -> chi^0_2 d)
     1.59494975E-04    2     1000025         1   # BR(~d_R -> chi^0_3 d)
     1.27693187E-04    2     1000035         1   # BR(~d_R -> chi^0_4 d)
     1.30126576E-07    2    -1000024         2   # BR(~d_R -> chi^-_1 u)
     2.82389450E-10    2    -1000037         2   # BR(~d_R -> chi^-_2 u)
     2.14706946E-06    2     1000039         1   # BR(~d_R -> ~G d)
DECAY   1000001     2.72207263E+01   # ~d_L
#    BR                NDA      ID1      ID2
     1.73995888E-02    2     1000022         1   # BR(~d_L -> chi^0_1 d)
     1.53956631E-02    2     1000023         1   # BR(~d_L -> chi^0_2 d)
     1.58942553E-04    2     1000025         1   # BR(~d_L -> chi^0_3 d)
     3.11233493E-01    2     1000035         1   # BR(~d_L -> chi^0_4 d)
     3.15881062E-02    2    -1000024         2   # BR(~d_L -> chi^-_1 u)
     6.24224043E-01    2    -1000037         2   # BR(~d_L -> chi^-_2 u)
     1.26840939E-12    2     2000002       -24   # BR(~d_L -> ~u_R W^-)
     3.96513981E-11    2     2000001        23   # BR(~d_L -> ~d_R Z)
     4.29870864E-11    2     2000001        25   # BR(~d_L -> ~d_R h^0)
     1.63810324E-07    2     1000039         1   # BR(~d_L -> ~G d)
DECAY   2000003     1.63599912E+00   # ~s_R
#    BR                NDA      ID1      ID2
     9.90339352E-01    2     1000022         3   # BR(~s_R -> chi^0_1 s)
     9.28624703E-03    2     1000023         3   # BR(~s_R -> chi^0_2 s)
     1.87016596E-04    2     1000025         3   # BR(~s_R -> chi^0_3 s)
     1.27733482E-04    2     1000035         3   # BR(~s_R -> chi^0_4 s)
     5.73792542E-05    2    -1000024         4   # BR(~s_R -> chi^-_1 c)
     1.24512912E-07    2    -1000037         4   # BR(~s_R -> chi^-_2 c)
     2.14682316E-06    2     1000039         3   # BR(~s_R -> ~G s)
DECAY   1000003     2.72214391E+01   # ~s_L
#    BR                NDA      ID1      ID2
     1.73991085E-02    2     1000022         3   # BR(~s_L -> chi^0_1 s)
     1.53968591E-02    2     1000023         3   # BR(~s_L -> chi^0_2 s)
     1.60745899E-04    2     1000025         3   # BR(~s_L -> chi^0_3 s)
     3.11225073E-01    2     1000035         3   # BR(~s_L -> chi^0_4 s)
     3.16092248E-02    2    -1000024         4   # BR(~s_L -> chi^-_1 c)
     6.24208561E-01    2    -1000037         4   # BR(~s_L -> chi^-_2 c)
     2.27313876E-07    2     2000004       -24   # BR(~s_L -> ~c_R W^-)
     1.74853235E-08    2     2000003        23   # BR(~s_L -> ~s_R Z)
     1.89563230E-08    2     2000003        25   # BR(~s_L -> ~s_R h^0)
     1.63805466E-07    2     1000039         3   # BR(~s_L -> ~G s)
DECAY   1000005     2.22570778E+00   # ~b_1
#    BR                NDA      ID1      ID2
     7.30427704E-01    2     1000022         5   # BR(~b_1 -> chi^0_1 b)
     5.82039128E-02    2     1000023         5   # BR(~b_1 -> chi^0_2 b)
     4.35886127E-02    2     1000025         5   # BR(~b_1 -> chi^0_3 b)
     4.80764279E-03    2     1000035         5   # BR(~b_1 -> chi^0_4 b)
     1.49739144E-01    2    -1000024         6   # BR(~b_1 -> chi^-_1 t)
     1.24671075E-02    2    -1000037         6   # BR(~b_1 -> chi^-_2 t)
     7.64301337E-04    2     1000006       -24   # BR(~b_1 -> ~t_1 W^-)
     1.57405314E-06    2     1000039         5   # BR(~b_1 -> ~G b)
DECAY   2000005     6.09653543E+01   # ~b_2
#    BR                NDA      ID1      ID2
     7.39208226E-03    2     1000022         5   # BR(~b_2 -> chi^0_1 b)
     7.78934727E-03    2     1000023         5   # BR(~b_2 -> chi^0_2 b)
     1.78383874E-03    2     1000025         5   # BR(~b_2 -> chi^0_3 b)
     1.30026645E-01    2     1000035         5   # BR(~b_2 -> chi^0_4 b)
     5.43413594E-01    2    -1000024         6   # BR(~b_2 -> chi^-_1 t)
     2.95079004E-01    2    -1000037         6   # BR(~b_2 -> chi^-_2 t)
     1.45154277E-02    2     1000006       -24   # BR(~b_2 -> ~t_1 W^-)
     6.14635824E-08    2     1000039         5   # BR(~b_2 -> ~G b)
DECAY   2000002     6.57453375E+00   # ~u_R
#    BR                NDA      ID1      ID2
     9.90441181E-01    2     1000022         2   # BR(~u_R -> chi^0_1 u)
     9.27057700E-03    2     1000023         2   # BR(~u_R -> chi^0_2 u)
     1.59634692E-04    2     1000025         2   # BR(~u_R -> chi^0_3 u)
     1.28062498E-04    2     1000035         2   # BR(~u_R -> chi^0_4 u)
     5.32621019E-10    2     1000024         1   # BR(~u_R -> chi^+_1 d)
     2.31598976E-12    2     1000037         1   # BR(~u_R -> chi^+_2 d)
     5.44730670E-07    2     1000039         2   # BR(~u_R -> ~G u)
DECAY   1000002     2.72599758E+01   # ~u_L
#    BR                NDA      ID1      ID2
     1.41866902E-02    2     1000022         2   # BR(~u_L -> chi^0_1 u)
     2.20211552E-02    2     1000023         2   # BR(~u_L -> chi^0_2 u)
     8.81445037E-05    2     1000025         2   # BR(~u_L -> chi^0_3 u)
     3.07401850E-01    2     1000035         2   # BR(~u_L -> chi^0_4 u)
     4.32522127E-02    2     1000024         1   # BR(~u_L -> chi^+_1 d)
     6.13049784E-01    2     1000037         1   # BR(~u_L -> chi^+_2 d)
     8.97789423E-11    2     2000001        24   # BR(~u_L -> ~d_R W^+)
     4.99080561E-13    2     2000002        23   # BR(~u_L -> ~u_R Z)
     4.33863064E-13    2     2000002        25   # BR(~u_L -> ~u_R h^0)
     1.63344206E-07    2     1000039         2   # BR(~u_L -> ~G u)
DECAY   2000004     6.57576757E+00   # ~c_R
#    BR                NDA      ID1      ID2
     9.90253739E-01    2     1000022         4   # BR(~c_R -> chi^0_1 c)
     9.31526063E-03    2     1000023         4   # BR(~c_R -> chi^0_2 c)
     2.06391859E-04    2     1000025         4   # BR(~c_R -> chi^0_3 c)
     1.28215902E-04    2     1000035         4   # BR(~c_R -> chi^0_4 c)
     9.54333367E-05    2     1000024         3   # BR(~c_R -> chi^+_1 s)
     4.14999789E-07    2     1000037         3   # BR(~c_R -> chi^+_2 s)
     5.44624474E-07    2     1000039         4   # BR(~c_R -> ~G c)
DECAY   1000004     2.72606637E+01   # ~c_L
#    BR                NDA      ID1      ID2
     1.41863934E-02    2     1000022         4   # BR(~c_L -> chi^0_1 c)
     2.20308348E-02    2     1000023         4   # BR(~c_L -> chi^0_2 c)
     9.99975764E-05    2     1000025         4   # BR(~c_L -> chi^0_3 c)
     3.07395030E-01    2     1000035         4   # BR(~c_L -> chi^0_4 c)
     4.32526080E-02    2     1000024         3   # BR(~c_L -> chi^+_1 s)
     6.13034766E-01    2     1000037         3   # BR(~c_L -> chi^+_2 s)
     3.95907692E-08    2     2000003        24   # BR(~c_L -> ~s_R W^+)
     8.94427136E-08    2     2000004        23   # BR(~c_L -> ~c_R Z)
     7.77547877E-08    2     2000004        25   # BR(~c_L -> ~c_R h^0)
     1.63339460E-07    2     1000039         4   # BR(~c_L -> ~G c)
DECAY   1000006     6.64385546E+01   # ~t_1
#    BR                NDA      ID1      ID2
     4.08082224E-10    2     1000022         4   # BR(~t_1 -> chi^0_1 c)
     9.09499542E-02    2     1000022         6   # BR(~t_1 -> chi^0_1 t)
     6.08570982E-10    2     1000023         4   # BR(~t_1 -> chi^0_2 c)
     2.18494812E-01    2     1000023         6   # BR(~t_1 -> chi^0_2 t)
     2.30211014E-01    2     1000025         6   # BR(~t_1 -> chi^0_3 t)
     4.27619429E-03    2     1000035         6   # BR(~t_1 -> chi^0_4 t)
     4.47345406E-01    2     1000024         5   # BR(~t_1 -> chi^+_1 b)
     8.71487183E-03    2     1000037         5   # BR(~t_1 -> chi^+_2 b)
     3.58508316E-08    2     1000039         6   # BR(~t_1 -> ~G t)
#    BR                NDA      ID1      ID2       ID3
     7.71102381E-06    3     1000022        24         5   # BR(~t_1 -> chi^0_1 W^+ b)
DECAY   2000006     6.11802757E+01   # ~t_2
#    BR                NDA      ID1      ID2
     7.15535484E-03    2     1000022         6   # BR(~t_2 -> chi^0_1 t)
     2.66685445E-01    2     1000023         6   # BR(~t_2 -> chi^0_2 t)
     2.80360856E-01    2     1000025         6   # BR(~t_2 -> chi^0_3 t)
     1.53887311E-01    2     1000035         6   # BR(~t_2 -> chi^0_4 t)
     5.78781334E-03    2     1000024         5   # BR(~t_2 -> chi^+_1 b)
     2.72762425E-01    2     1000037         5   # BR(~t_2 -> chi^+_2 b)
     7.58185454E-03    2     1000006        23   # BR(~t_2 -> ~t_1 Z)
     5.77887853E-03    2     1000006        25   # BR(~t_2 -> ~t_1 h^0)
     6.10735751E-08    2     1000039         6   # BR(~t_2 -> ~G t)
DECAY   1000024     6.94096328E-01   # chi^+_1
#    BR                NDA      ID1      ID2
     1.91792743E-09    2    -2000011        12   # BR(chi^+_1 -> ~e^+_R nu_e)
     1.83642922E-03    2    -1000011        12   # BR(chi^+_1 -> ~e^+_L nu_e)
     8.19973477E-05    2    -2000013        14   # BR(chi^+_1 -> ~mu^+_R nu_mu)
     1.83640805E-03    2    -1000013        14   # BR(chi^+_1 -> ~mu^+_L nu_mu)
     2.32361182E-02    2    -1000015        16   # BR(chi^+_1 -> ~tau^+_1 nu_tau)
     1.83040823E-03    2    -2000015        16   # BR(chi^+_1 -> ~tau^+_2 nu_tau)
     2.88232643E-03    2     1000012       -11   # BR(chi^+_1 -> ~nu_e e^+)
     2.88370076E-03    2     1000014       -13   # BR(chi^+_1 -> ~nu_mu mu^+)
     3.27353681E-03    2     1000016       -15   # BR(chi^+_1 -> ~nu_tau tau^+)
     9.59419975E-01    2     1000022        24   # BR(chi^+_1 -> chi^0_1 W^+)
#    BR                NDA      ID1      ID2       ID3
     4.04329387E-09    3     1000022        -1         2   # BR(chi^+_1 -> chi^0_1 d_bar u)
     4.07604189E-09    3     1000022        -3         4   # BR(chi^+_1 -> chi^0_1 s_bar c)
     2.71835833E-03    3     1000022        -5         6   # BR(chi^+_1 -> chi^0_1 b_bar t)
     6.05472279E-14    3     1000022       -11        12   # BR(chi^+_1 -> chi^0_1 e^+ nu_e)
     2.58852920E-09    3     1000022       -13        14   # BR(chi^+_1 -> chi^0_1 mu^+ nu_mu)
     7.29105582E-07    3     1000022       -15        16   # BR(chi^+_1 -> chi^0_1 tau^+ nu_tau)
DECAY   1000037     1.42178778E+01   # chi^+_2
#    BR                NDA      ID1      ID2
     3.97628998E-13    2    -2000011        12   # BR(chi^+_2 -> ~e^+_R nu_e)
     7.45758706E-02    2    -1000011        12   # BR(chi^+_2 -> ~e^+_L nu_e)
     1.70000479E-08    2    -2000013        14   # BR(chi^+_2 -> ~mu^+_R nu_mu)
     7.45761160E-02    2    -1000013        14   # BR(chi^+_2 -> ~mu^+_L nu_mu)
     4.83135440E-06    2    -1000015        16   # BR(chi^+_2 -> ~tau^+_1 nu_tau)
     7.46453046E-02    2    -2000015        16   # BR(chi^+_2 -> ~tau^+_2 nu_tau)
     7.45603267E-02    2     1000012       -11   # BR(chi^+_2 -> ~nu_e e^+)
     7.45605976E-02    2     1000014       -13   # BR(chi^+_2 -> ~nu_mu mu^+)
     7.46369671E-02    2     1000016       -15   # BR(chi^+_2 -> ~nu_tau tau^+)
     3.50089314E-04    2     1000022        24   # BR(chi^+_2 -> chi^0_1 W^+)
     1.43482429E-01    2     1000023        24   # BR(chi^+_2 -> chi^0_2 W^+)
     1.33364109E-01    2     1000025        24   # BR(chi^+_2 -> chi^0_3 W^+)
     1.45764270E-01    2     1000024        23   # BR(chi^+_2 -> chi^+_1 Z)
     1.29080432E-01    2     1000024        25   # BR(chi^+_2 -> chi^+_1 h^0)
#    BR                NDA      ID1      ID2       ID3
     2.06985160E-09    3     1000024         2        -2   # BR(chi^+_2 -> chi^+_1 u u_bar)
     2.07020880E-09    3     1000024         4        -4   # BR(chi^+_2 -> chi^+_1 c c_bar)
     2.79776116E-09    3     1000024         1        -1   # BR(chi^+_2 -> chi^+_1 d d_bar)
     2.80071799E-09    3     1000024         3        -3   # BR(chi^+_2 -> chi^+_1 s s_bar)
     1.08721443E-08    3     1000024         5        -5   # BR(chi^+_2 -> chi^+_1 b b_bar)
     5.18084044E-07    3     1000024        11       -11   # BR(chi^+_2 -> chi^+_1 e^- e^+)
     5.18249872E-07    3     1000024        13       -13   # BR(chi^+_2 -> chi^+_1 mu^- mu^+)
     5.60037503E-07    3     1000024        15       -15   # BR(chi^+_2 -> chi^+_1 tau^- tau^+)
     1.19865669E-06    3     1000024        12       -12   # BR(chi^+_2 -> chi^+_1 nu_e nu_bar_e)
     6.80247177E-08    3     1000022        -1         2   # BR(chi^+_2 -> chi^0_1 d_bar u)
     6.80231739E-08    3     1000022        -3         4   # BR(chi^+_2 -> chi^0_1 s_bar c)
     3.83850941E-06    3     1000022        -5         6   # BR(chi^+_2 -> chi^0_1 b_bar t)
     2.94881079E-12    3     1000022       -13        14   # BR(chi^+_2 -> chi^0_1 mu^+ nu_mu)
     8.34765934E-10    3     1000022       -15        16   # BR(chi^+_2 -> chi^0_1 tau^+ nu_tau)
     1.19816525E-09    3     1000023        -1         2   # BR(chi^+_2 -> chi^0_2 d_bar u)
     1.19977717E-09    3     1000023        -3         4   # BR(chi^+_2 -> chi^0_2 s_bar c)
     2.24549859E-04    3     1000023        -5         6   # BR(chi^+_2 -> chi^0_2 b_bar t)
     2.98946409E-07    3     1000023       -11        12   # BR(chi^+_2 -> chi^0_2 e^+ nu_e)
     2.99020322E-07    3     1000023       -13        14   # BR(chi^+_2 -> chi^0_2 mu^+ nu_mu)
     3.15386771E-07    3     1000023       -15        16   # BR(chi^+_2 -> chi^0_2 tau^+ nu_tau)
     1.90457004E-11    3     1000025        -1         2   # BR(chi^+_2 -> chi^0_3 d_bar u)
     2.04776245E-11    3     1000025        -3         4   # BR(chi^+_2 -> chi^0_3 s_bar c)
     1.66353980E-04    3     1000025        -5         6   # BR(chi^+_2 -> chi^0_3 b_bar t)
     3.12532109E-09    3     1000025       -11        12   # BR(chi^+_2 -> chi^0_3 e^+ nu_e)
     3.19060182E-09    3     1000025       -13        14   # BR(chi^+_2 -> chi^0_3 mu^+ nu_mu)
     2.14290236E-08    3     1000025       -15        16   # BR(chi^+_2 -> chi^0_3 tau^+ nu_tau)
DECAY   1000022     2.76639604E+00   # chi^0_1
#    BR                NDA      ID1      ID2
     1.66281075E-01    2     2000011       -11   # BR(chi^0_1 -> ~e^-_R e^+)
     1.66281075E-01    2    -2000011        11   # BR(chi^0_1 -> ~e^+_R e^-)
     1.66285143E-01    2     2000013       -13   # BR(chi^0_1 -> ~mu^-_R mu^+)
     1.66285143E-01    2    -2000013        13   # BR(chi^0_1 -> ~mu^+_R mu^-)
     1.67433781E-01    2     1000015       -15   # BR(chi^0_1 -> ~tau^-_1 tau^+)
     1.67433781E-01    2    -1000015        15   # BR(chi^0_1 -> ~tau^+_1 tau^-)
     5.88989169E-10    2     1000039        22   # BR(chi^0_1 -> ~G photon)
     1.72110184E-10    2     1000039        23   # BR(chi^0_1 -> ~G Z)
     5.05503457E-12    2     1000039        25   # BR(chi^0_1 -> ~G h^0)
DECAY   1000023     8.78633177E-01   # chi^0_2
#    BR                NDA      ID1      ID2
     2.07382533E-02    2     2000011       -11   # BR(chi^0_2 -> ~e^-_R e^+)
     2.07382533E-02    2    -2000011        11   # BR(chi^0_2 -> ~e^+_R e^-)
     1.56232312E-03    2     1000011       -11   # BR(chi^0_2 -> ~e^-_L e^+)
     1.56232312E-03    2    -1000011        11   # BR(chi^0_2 -> ~e^+_L e^-)
     2.07697997E-02    2     2000013       -13   # BR(chi^0_2 -> ~mu^-_R mu^+)
     2.07697997E-02    2    -2000013        13   # BR(chi^0_2 -> ~mu^+_R mu^-)
     1.56285193E-03    2     1000013       -13   # BR(chi^0_2 -> ~mu^-_L mu^+)
     1.56285193E-03    2    -1000013        13   # BR(chi^0_2 -> ~mu^+_L mu^-)
     2.96800764E-02    2     1000015       -15   # BR(chi^0_2 -> ~tau^-_1 tau^+)
     2.96800764E-02    2    -1000015        15   # BR(chi^0_2 -> ~tau^+_1 tau^-)
     1.71243375E-03    2     2000015       -15   # BR(chi^0_2 -> ~tau^-_2 tau^+)
     1.71243375E-03    2    -2000015        15   # BR(chi^0_2 -> ~tau^+_2 tau^-)
     5.87816178E-04    2     1000012       -12   # BR(chi^0_2 -> ~nu_e nu_bar_e)
     5.87816178E-04    2    -1000012        12   # BR(chi^0_2 -> ~nu^*_e nu_e)
     5.87831551E-04    2     1000014       -14   # BR(chi^0_2 -> ~nu_mu nu_bar_mu)
     5.87831551E-04    2    -1000014        14   # BR(chi^0_2 -> ~nu^*_mu nu_mu)
     5.92171984E-04    2     1000016       -16   # BR(chi^0_2 -> ~nu_tau nu_bar_tau)
     5.92171984E-04    2    -1000016        16   # BR(chi^0_2 -> ~nu^*_tau nu_tau)
     1.56011832E-02    2     1000022        23   # BR(chi^0_2 -> chi^0_1 Z)
     8.28803726E-01    2     1000022        25   # BR(chi^0_2 -> chi^0_1 h^0)
     7.64634411E-10    2     1000039        22   # BR(chi^0_2 -> ~G photon)
     1.33212307E-09    2     1000039        23   # BR(chi^0_2 -> ~G Z)
     1.26947533E-08    2     1000039        25   # BR(chi^0_2 -> ~G h^0)
     3.41655515E-07    2     1000022        22   # BR(chi^0_2 -> chi^0_1 photon)
#    BR                NDA      ID1      ID2       ID3
     5.97067788E-09    3     1000022         2        -2   # BR(chi^0_2 -> chi^0_1 u u_bar)
     5.98202609E-09    3     1000022         4        -4   # BR(chi^0_2 -> chi^0_1 c c_bar)
     6.31853206E-07    3     1000022         6        -6   # BR(chi^0_2 -> chi^0_1 t t_bar)
     1.79765523E-09    3     1000022         1        -1   # BR(chi^0_2 -> chi^0_1 d d_bar)
     1.81381754E-09    3     1000022         3        -3   # BR(chi^0_2 -> chi^0_1 s s_bar)
     3.76663862E-08    3     1000022         5        -5   # BR(chi^0_2 -> chi^0_1 b b_bar)
     2.13336117E-06    3     1000022        11       -11   # BR(chi^0_2 -> chi^0_1 e^- e^+)
     2.13535869E-06    3     1000022        13       -13   # BR(chi^0_2 -> chi^0_1 mu^- mu^+)
     2.66372544E-06    3     1000022        15       -15   # BR(chi^0_2 -> chi^0_1 tau^- tau^+)
     1.55253877E-10    3     1000024         1        -2   # BR(chi^0_2 -> chi^+_1 d u_bar)
     1.55253877E-10    3    -1000024        -1         2   # BR(chi^0_2 -> chi^-_1 d_bar u)
     7.08386707E-11    3     1000024         3        -4   # BR(chi^0_2 -> chi^+_1 s c_bar)
     7.08386707E-11    3    -1000024        -3         4   # BR(chi^0_2 -> chi^-_1 s_bar c)
     5.14493453E-11    3     1000024        11       -12   # BR(chi^0_2 -> chi^+_1 e^- nu_bar_e)
     5.14493453E-11    3    -1000024       -11        12   # BR(chi^0_2 -> chi^-_1 e^+ nu_e)
     5.11637083E-11    3     1000024        13       -14   # BR(chi^0_2 -> chi^+_1 mu^- nu_bar_mu)
     5.11637083E-11    3    -1000024       -13        14   # BR(chi^0_2 -> chi^-_1 mu^+ nu_mu)
     1.04577854E-11    3     1000024        15       -16   # BR(chi^0_2 -> chi^+_1 tau^- nu_bar_tau)
     1.04577854E-11    3    -1000024       -15        16   # BR(chi^0_2 -> chi^-_1 tau^+ nu_tau)
DECAY   1000025     7.45237121E-01   # chi^0_3
#    BR                NDA      ID1      ID2
     4.33403856E-04    2     2000011       -11   # BR(chi^0_3 -> ~e^-_R e^+)
     4.33403856E-04    2    -2000011        11   # BR(chi^0_3 -> ~e^+_R e^-)
     3.54091557E-06    2     1000011       -11   # BR(chi^0_3 -> ~e^-_L e^+)
     3.54091557E-06    2    -1000011        11   # BR(chi^0_3 -> ~e^+_L e^-)
     4.71607369E-04    2     2000013       -13   # BR(chi^0_3 -> ~mu^-_R mu^+)
     4.71607369E-04    2    -2000013        13   # BR(chi^0_3 -> ~mu^+_R mu^-)
     4.31350709E-06    2     1000013       -13   # BR(chi^0_3 -> ~mu^-_L mu^+)
     4.31350709E-06    2    -1000013        13   # BR(chi^0_3 -> ~mu^+_L mu^-)
     1.12598176E-02    2     1000015       -15   # BR(chi^0_3 -> ~tau^-_1 tau^+)
     1.12598176E-02    2    -1000015        15   # BR(chi^0_3 -> ~tau^+_1 tau^-)
     2.23138004E-04    2     2000015       -15   # BR(chi^0_3 -> ~tau^-_2 tau^+)
     2.23138004E-04    2    -2000015        15   # BR(chi^0_3 -> ~tau^+_2 tau^-)
     2.56251240E-05    2     1000012       -12   # BR(chi^0_3 -> ~nu_e nu_bar_e)
     2.56251240E-05    2    -1000012        12   # BR(chi^0_3 -> ~nu^*_e nu_e)
     2.56256698E-05    2     1000014       -14   # BR(chi^0_3 -> ~nu_mu nu_bar_mu)
     2.56256698E-05    2    -1000014        14   # BR(chi^0_3 -> ~nu^*_mu nu_mu)
     2.57797274E-05    2     1000016       -16   # BR(chi^0_3 -> ~nu_tau nu_bar_tau)
     2.57797274E-05    2    -1000016        16   # BR(chi^0_3 -> ~nu^*_tau nu_tau)
     9.58423888E-01    2     1000022        23   # BR(chi^0_3 -> chi^0_1 Z)
     1.65506789E-02    2     1000022        25   # BR(chi^0_3 -> chi^0_1 h^0)
     2.05648848E-13    2     1000039        22   # BR(chi^0_3 -> ~G photon)
     1.56376765E-09    2     1000039        23   # BR(chi^0_3 -> ~G Z)
     7.11942759E-09    2     1000039        25   # BR(chi^0_3 -> ~G h^0)
     7.79433754E-07    2     1000022        22   # BR(chi^0_3 -> chi^0_1 photon)
     5.84935865E-10    2     1000023        22   # BR(chi^0_3 -> chi^0_2 photon)
#    BR                NDA      ID1      ID2       ID3
     3.82880625E-11    3     1000022         2        -2   # BR(chi^0_3 -> chi^0_1 u u_bar)
     6.02675742E-11    3     1000022         4        -4   # BR(chi^0_3 -> chi^0_1 c c_bar)
     7.57367537E-05    3     1000022         6        -6   # BR(chi^0_3 -> chi^0_1 t t_bar)
     9.91259352E-12    3     1000022         1        -1   # BR(chi^0_3 -> chi^0_1 d d_bar)
     3.20657194E-11    3     1000022         3        -3   # BR(chi^0_3 -> chi^0_1 s s_bar)
     4.89526295E-08    3     1000022         5        -5   # BR(chi^0_3 -> chi^0_1 b b_bar)
     1.78241861E-08    3     1000022        11       -11   # BR(chi^0_3 -> chi^0_1 e^- e^+)
     2.05226348E-08    3     1000022        13       -13   # BR(chi^0_3 -> chi^0_1 mu^- mu^+)
     7.79490672E-07    3     1000022        15       -15   # BR(chi^0_3 -> chi^0_1 tau^- tau^+)
     3.12383347E-08    3     1000023         2        -2   # BR(chi^0_3 -> chi^0_2 u u_bar)
     2.89485756E-08    3     1000023         4        -4   # BR(chi^0_3 -> chi^0_2 c c_bar)
     4.05714520E-08    3     1000023         1        -1   # BR(chi^0_3 -> chi^0_2 d d_bar)
     4.05447750E-08    3     1000023         3        -3   # BR(chi^0_3 -> chi^0_2 s s_bar)
     9.28700856E-09    3     1000023         5        -5   # BR(chi^0_3 -> chi^0_2 b b_bar)
     9.33805617E-09    3     1000023        11       -11   # BR(chi^0_3 -> chi^0_2 e^- e^+)
     9.33419287E-09    3     1000023        13       -13   # BR(chi^0_3 -> chi^0_2 mu^- mu^+)
     8.13002028E-09    3     1000023        15       -15   # BR(chi^0_3 -> chi^0_2 tau^- tau^+)
     5.59821981E-08    3     1000023        12       -12   # BR(chi^0_3 -> chi^0_2 nu_e nu_bar_e)
     3.57682763E-07    3     1000024         1        -2   # BR(chi^0_3 -> chi^+_1 d u_bar)
     3.57682763E-07    3    -1000024        -1         2   # BR(chi^0_3 -> chi^-_1 d_bar u)
     3.44978803E-07    3     1000024         3        -4   # BR(chi^0_3 -> chi^+_1 s c_bar)
     3.44978803E-07    3    -1000024        -3         4   # BR(chi^0_3 -> chi^-_1 s_bar c)
     1.19200771E-07    3     1000024        11       -12   # BR(chi^0_3 -> chi^+_1 e^- nu_bar_e)
     1.19200771E-07    3    -1000024       -11        12   # BR(chi^0_3 -> chi^-_1 e^+ nu_e)
     1.19170982E-07    3     1000024        13       -14   # BR(chi^0_3 -> chi^+_1 mu^- nu_bar_mu)
     1.19170982E-07    3    -1000024       -13        14   # BR(chi^0_3 -> chi^-_1 mu^+ nu_mu)
     1.11061471E-07    3     1000024        15       -16   # BR(chi^0_3 -> chi^+_1 tau^- nu_bar_tau)
     1.11061471E-07    3    -1000024       -15        16   # BR(chi^0_3 -> chi^-_1 tau^+ nu_tau)
DECAY   1000035     1.42789539E+01   # chi^0_4
#    BR                NDA      ID1      ID2
     3.35374197E-05    2     2000011       -11   # BR(chi^0_4 -> ~e^-_R e^+)
     3.35374197E-05    2    -2000011        11   # BR(chi^0_4 -> ~e^+_R e^-)
     3.62341585E-02    2     1000011       -11   # BR(chi^0_4 -> ~e^-_L e^+)
     3.62341585E-02    2    -1000011        11   # BR(chi^0_4 -> ~e^+_L e^-)
     3.35433344E-05    2     2000013       -13   # BR(chi^0_4 -> ~mu^-_R mu^+)
     3.35433344E-05    2    -2000013        13   # BR(chi^0_4 -> ~mu^+_R mu^-)
     3.62342876E-02    2     1000013       -13   # BR(chi^0_4 -> ~mu^-_L mu^+)
     3.62342876E-02    2    -1000013        13   # BR(chi^0_4 -> ~mu^+_L mu^-)
     3.52276614E-05    2     1000015       -15   # BR(chi^0_4 -> ~tau^-_1 tau^+)
     3.52276614E-05    2    -1000015        15   # BR(chi^0_4 -> ~tau^+_1 tau^-)
     3.62706970E-02    2     2000015       -15   # BR(chi^0_4 -> ~tau^-_2 tau^+)
     3.62706970E-02    2    -2000015        15   # BR(chi^0_4 -> ~tau^+_2 tau^-)
     3.79840201E-02    2     1000012       -12   # BR(chi^0_4 -> ~nu_e nu_bar_e)
     3.79840201E-02    2    -1000012        12   # BR(chi^0_4 -> ~nu^*_e nu_e)
     3.79841488E-02    2     1000014       -14   # BR(chi^0_4 -> ~nu_mu nu_bar_mu)
     3.79841488E-02    2    -1000014        14   # BR(chi^0_4 -> ~nu^*_mu nu_mu)
     3.80204317E-02    2     1000016       -16   # BR(chi^0_4 -> ~nu_tau nu_bar_tau)
     3.80204317E-02    2    -1000016        16   # BR(chi^0_4 -> ~nu^*_tau nu_tau)
     1.45794140E-01    2     1000024       -24   # BR(chi^0_4 -> chi^+_1 W^-)
     1.45794140E-01    2    -1000024        24   # BR(chi^0_4 -> chi^-_1 W^+)
     3.47287476E-05    2     1000022        23   # BR(chi^0_4 -> chi^0_1 Z)
     1.02378219E-03    2     1000023        23   # BR(chi^0_4 -> chi^0_2 Z)
     1.30483337E-01    2     1000025        23   # BR(chi^0_4 -> chi^0_3 Z)
     3.77877175E-04    2     1000022        25   # BR(chi^0_4 -> chi^0_1 h^0)
     1.29655999E-01    2     1000023        25   # BR(chi^0_4 -> chi^0_2 h^0)
     7.13169244E-04    2     1000025        25   # BR(chi^0_4 -> chi^0_3 h^0)
     9.26315306E-10    2     1000039        22   # BR(chi^0_4 -> ~G photon)
     3.71759218E-09    2     1000039        23   # BR(chi^0_4 -> ~G Z)
     1.55519428E-10    2     1000039        25   # BR(chi^0_4 -> ~G h^0)
     1.15267330E-07    2     1000022        22   # BR(chi^0_4 -> chi^0_1 photon)
     2.95621283E-07    2     1000023        22   # BR(chi^0_4 -> chi^0_2 photon)
     6.81310121E-07    2     1000025        22   # BR(chi^0_4 -> chi^0_3 photon)
#    BR                NDA      ID1      ID2       ID3
     3.03857634E-08    3     1000022         2        -2   # BR(chi^0_4 -> chi^0_1 u u_bar)
     3.03839268E-08    3     1000022         4        -4   # BR(chi^0_4 -> chi^0_1 c c_bar)
     1.25098853E-06    3     1000022         6        -6   # BR(chi^0_4 -> chi^0_1 t t_bar)
     3.74596602E-08    3     1000022         1        -1   # BR(chi^0_4 -> chi^0_1 d d_bar)
     3.74597490E-08    3     1000022         3        -3   # BR(chi^0_4 -> chi^0_1 s s_bar)
     4.36702853E-08    3     1000022         5        -5   # BR(chi^0_4 -> chi^0_1 b b_bar)
     1.56706505E-08    3     1000022        11       -11   # BR(chi^0_4 -> chi^0_1 e^- e^+)
     1.56721973E-08    3     1000022        13       -13   # BR(chi^0_4 -> chi^0_1 mu^- mu^+)
     1.60611468E-08    3     1000022        15       -15   # BR(chi^0_4 -> chi^0_1 tau^- tau^+)
     2.02233350E-09    3     1000023         2        -2   # BR(chi^0_4 -> chi^0_2 u u_bar)
     2.02151008E-09    3     1000023         4        -4   # BR(chi^0_4 -> chi^0_2 c c_bar)
     1.42414894E-09    3     1000023         1        -1   # BR(chi^0_4 -> chi^0_2 d d_bar)
     1.42552558E-09    3     1000023         3        -3   # BR(chi^0_4 -> chi^0_2 s s_bar)
     4.73011205E-09    3     1000023         5        -5   # BR(chi^0_4 -> chi^0_2 b b_bar)
     4.80296087E-07    3     1000023        11       -11   # BR(chi^0_4 -> chi^0_2 e^- e^+)
     4.80369330E-07    3     1000023        13       -13   # BR(chi^0_4 -> chi^0_2 mu^- mu^+)
     4.94985644E-07    3     1000023        15       -15   # BR(chi^0_4 -> chi^0_2 tau^- tau^+)
     4.73201428E-07    3     1000023        12       -12   # BR(chi^0_4 -> chi^0_2 nu_e nu_bar_e)
     2.31645041E-12    3     1000025         2        -2   # BR(chi^0_4 -> chi^0_3 u u_bar)
     2.77878156E-12    3     1000025         4        -4   # BR(chi^0_4 -> chi^0_3 c c_bar)
     4.21009432E-12    3     1000025         1        -1   # BR(chi^0_4 -> chi^0_3 d d_bar)
     5.55696380E-12    3     1000025         3        -3   # BR(chi^0_4 -> chi^0_3 s s_bar)
     3.03706036E-09    3     1000025         5        -5   # BR(chi^0_4 -> chi^0_3 b b_bar)
     1.87928563E-10    3     1000025        11       -11   # BR(chi^0_4 -> chi^0_3 e^- e^+)
     2.49966660E-10    3     1000025        13       -13   # BR(chi^0_4 -> chi^0_3 mu^- mu^+)
     1.76193894E-08    3     1000025        15       -15   # BR(chi^0_4 -> chi^0_3 tau^- tau^+)
     3.63387239E-09    3     1000025        12       -12   # BR(chi^0_4 -> chi^0_3 nu_e nu_bar_e)
     1.24396230E-09    3     1000024         1        -2   # BR(chi^0_4 -> chi^+_1 d u_bar)
     1.24396230E-09    3    -1000024        -1         2   # BR(chi^0_4 -> chi^-_1 d_bar u)
     1.24621316E-09    3     1000024         3        -4   # BR(chi^0_4 -> chi^+_1 s c_bar)
     1.24621316E-09    3    -1000024        -3         4   # BR(chi^0_4 -> chi^-_1 s_bar c)
     2.28248279E-04    3     1000024         5        -6   # BR(chi^0_4 -> chi^+_1 b t_bar)
     2.28248279E-04    3    -1000024        -5         6   # BR(chi^0_4 -> chi^-_1 b_bar t)
     2.73688552E-07    3     1000024        11       -12   # BR(chi^0_4 -> chi^+_1 e^- nu_bar_e)
     2.73688552E-07    3    -1000024       -11        12   # BR(chi^0_4 -> chi^-_1 e^+ nu_e)
     2.73765527E-07    3     1000024        13       -14   # BR(chi^0_4 -> chi^+_1 mu^- nu_bar_mu)
     2.73765527E-07    3    -1000024       -13        14   # BR(chi^0_4 -> chi^-_1 mu^+ nu_mu)
     2.92676783E-07    3     1000024        15       -16   # BR(chi^0_4 -> chi^+_1 tau^- nu_bar_tau)
     2.92676783E-07    3    -1000024       -15        16   # BR(chi^0_4 -> chi^-_1 tau^+ nu_tau)
DECAY   1000021     2.69606276E+01   # ~g
#    BR                NDA      ID1      ID2
     4.67996810E-02    2     2000002        -2   # BR(~g -> ~u_R u_bar)
     4.67996810E-02    2    -2000002         2   # BR(~g -> ~u^*_R u)
     1.76637873E-02    2     1000002        -2   # BR(~g -> ~u_L u_bar)
     1.76637873E-02    2    -1000002         2   # BR(~g -> ~u^*_L u)
     4.68001123E-02    2     2000004        -4   # BR(~g -> ~c_R c_bar)
     4.68001123E-02    2    -2000004         4   # BR(~g -> ~c^*_R c)
     1.76640318E-02    2     1000004        -4   # BR(~g -> ~c_L c_bar)
     1.76640318E-02    2    -1000004         4   # BR(~g -> ~c^*_L c)
     9.96693018E-09    2     1000006        -4   # BR(~g -> ~t_1 c_bar)
     9.96693018E-09    2    -1000006         4   # BR(~g -> ~t^*_1 c)
     1.09226666E-01    2     1000006        -6   # BR(~g -> ~t_1 t_bar)
     1.09226666E-01    2    -1000006         6   # BR(~g -> ~t^*_1 t)
     3.67142598E-02    2     2000006        -6   # BR(~g -> ~t_2 t_bar)
     3.67142598E-02    2    -2000006         6   # BR(~g -> ~t^*_2 t)
     4.99309448E-02    2     2000001        -1   # BR(~g -> ~d_R d_bar)
     4.99309448E-02    2    -2000001         1   # BR(~g -> ~d^*_R d)
     1.75142874E-02    2     1000001        -1   # BR(~g -> ~d_L d_bar)
     1.75142874E-02    2    -1000001         1   # BR(~g -> ~d^*_L d)
     4.99311071E-02    2     2000003        -3   # BR(~g -> ~s_R s_bar)
     4.99311071E-02    2    -2000003         3   # BR(~g -> ~s^*_R s)
     1.75146582E-02    2     1000003        -3   # BR(~g -> ~s_L s_bar)
     1.75146582E-02    2    -1000003         3   # BR(~g -> ~s^*_L s)
     5.02644543E-02    2     1000005        -5   # BR(~g -> ~b_1 b_bar)
     5.02644543E-02    2    -1000005         5   # BR(~g -> ~b^*_1 b)
     3.98954985E-02    2     2000005        -5   # BR(~g -> ~b_2 b_bar)
     3.98954985E-02    2    -2000005         5   # BR(~g -> ~b^*_2 b)
     2.27629445E-06    2     1000022        21   # BR(~g -> chi^0_1 g)
     7.45298770E-05    2     1000023        21   # BR(~g -> chi^0_2 g)
     7.86412946E-05    2     1000025        21   # BR(~g -> chi^0_3 g)
     5.55506562E-06    2     1000035        21   # BR(~g -> chi^0_4 g)
DECAY        25     2.62380217E-03   # h^0
#    BR                NDA      ID1      ID2
     8.38334364E-09    2          11       -11   # BR(h^0 -> e^- e^+)
     3.58409532E-04    2          13       -13   # BR(h^0 -> mu^- mu^+)
     1.01212614E-01    2          15       -15   # BR(h^0 -> tau^- tau^+)
     7.41669922E-07    2           1        -1   # BR(h^0 -> d d_bar)
     3.27075950E-04    2           3        -3   # BR(h^0 -> s s_bar)
     6.92055784E-01    2           5        -5   # BR(h^0 -> b b_bar)
     2.43779849E-07    2           2        -2   # BR(h^0 -> u u_bar)
     4.36782441E-02    2           4        -4   # BR(h^0 -> c c_bar)
     5.97760986E-02    2          21        21   # BR(h^0 -> g g)
     2.96176914E-03    2          22        22   # BR(h^0 -> photon photon)
# writing decays into V V* as 3-body decays
#    BR                NDA      ID1      ID2       ID3
     4.61397466E-03    3          24        11        12   # BR(h^0 -> W^+ e^- nu_e)
     4.61397466E-03    3          24        13        14   # BR(h^0 -> W^+ mu^- nu_mu)
     4.61397466E-03    3          24        15        16   # BR(h^0 -> W^+ tau^- nu_tau)
     1.61489113E-02    3          24         1        -2   # BR(h^0 -> W^+ d u_bar)
     1.61489113E-02    3          24         3        -4   # BR(h^0 -> W^+ s c_bar)
     4.61397466E-03    3         -24       -11       -12   # BR(h^0 -> W^- e^+ nu_bar_e)
     4.61397466E-03    3         -24       -13       -14   # BR(h^0 -> W^- mu^+ nu_bar_mu)
     4.61397466E-03    3         -24       -15       -16   # BR(h^0 -> W^- tau^+ nu_bar_tau)
     1.61489113E-02    3         -24        -1         2   # BR(h^0 -> W^- d_bar u)
     1.61489113E-02    3         -24        -3         4   # BR(h^0 -> W^- s_bar c)
     2.57233100E-04    3          23        11       -11   # BR(h^0 -> Z e^- e^+)
     2.57233100E-04    3          23        13       -13   # BR(h^0 -> Z mu^- mu^+)
     2.20485515E-04    3          23        15       -15   # BR(h^0 -> Z tau^- tau^+)
     1.46990343E-03    3          23        12       -12   # BR(h^0 -> Z nu_e nu_bar_e)
     1.02893240E-03    3          23         1        -1   # BR(h^0 -> Z u u_bar)
     1.02893240E-03    3          23         3        -3   # BR(h^0 -> Z c c_bar)
     1.02893240E-03    3          23         5        -5   # BR(h^0 -> Z t t_bar)
     1.02893240E-03    3          23         2        -2   # BR(h^0 -> Z u u_bar)
     1.02893240E-03    3          23         4        -4   # BR(h^0 -> Z c c_bar)
DECAY        35     3.78247065E+00   # H^0
#    BR                NDA      ID1      ID2
     1.55342565E-09    2          11       -11   # BR(H^0 -> e^- e^+)
     6.64133479E-05    2          13       -13   # BR(H^0 -> mu^- mu^+)
     1.87866338E-02    2          15       -15   # BR(H^0 -> tau^- tau^+)
     1.12315495E-07    2           1        -1   # BR(H^0 -> d d_bar)
     4.95310888E-05    2           3        -3   # BR(H^0 -> s s_bar)
     1.08509791E-01    2           5        -5   # BR(H^0 -> b b_bar)
     8.30334003E-11    2           2        -2   # BR(H^0 -> u u_bar)
     1.48805257E-05    2           4        -4   # BR(H^0 -> c c_bar)
     8.03511443E-01    2           6        -6   # BR(H^0 -> t t_bar)
     1.18150332E-04    2     2000011  -2000011   # BR(H^0 -> ~e^-_R ~e^+_R)
     1.18123802E-04    2     2000013  -2000013   # BR(H^0 -> ~mu^-_R ~mu^+_R)
     1.10760702E-04    2     1000015  -1000015   # BR(H^0 -> ~tau^-_1 ~tau^+_1)
     1.89073711E-04    2     1000022   1000022   # BR(H^0 -> chi^0_1 chi^0_1)
     2.26758413E-02    2          23        23   # BR(H^0 -> Z Z)
     4.28745143E-02    2          24       -24   # BR(H^0 -> W^+ W^-)
     2.51193424E-03    2          25        25   # BR(H^0 -> h^0 h^0)
     4.58337098E-04    2          21        21   # BR(H^0 -> g g)
     4.45730932E-06    2          22        22   # BR(H^0 -> photon photon)
DECAY        36     3.45277761E+00   # A^0
#    BR                NDA      ID1      ID2
     1.70972816E-09    2          11       -11   # BR(A^0 -> e^- e^+)
     7.30957246E-05    2          13       -13   # BR(A^0 -> mu^- mu^+)
     2.06770219E-02    2          15       -15   # BR(A^0 -> tau^- tau^+)
     1.23615921E-07    2           1        -1   # BR(A^0 -> d d_bar)
     5.45145736E-05    2           3        -3   # BR(A^0 -> s s_bar)
     1.19427527E-01    2           5        -5   # BR(A^0 -> b b_bar)
     8.06874559E-11    2           2        -2   # BR(A^0 -> u u_bar)
     1.44600911E-05    2           4        -4   # BR(A^0 -> c c_bar)
     8.09325760E-01    2           6        -6   # BR(A^0 -> t t_bar)
     3.49158827E-03    2     1000022   1000022   # BR(A^0 -> chi^0_1 chi^0_1)
     4.67696114E-02    2          25        23   # BR(A^0 -> h^0 Z)
     1.64881404E-04    2          21        21   # BR(A^0 -> g g)
     1.41448294E-06    2          22        22   # BR(A^0 -> photon photon)
DECAY        37     3.00278777E+00   # H^+
#    BR                NDA      ID1      ID2
     1.96850770E-09    2         -11        12   # BR(H^+ -> e^+ nu_e)
     8.41592833E-05    2         -13        12   # BR(H^+ -> mu^+ nu_e)
     2.38066367E-02    2         -15        12   # BR(H^+ -> tau^+ nu_e)
     1.25273159E-07    2          -1         2   # BR(H^+ -> d_bar u)
     6.98536612E-05    2          -3         4   # BR(H^+ -> s_bar c)
     9.23538683E-01    2          -5         6   # BR(H^+ -> b_bar t)
     5.25005399E-02    2          25        24   # BR(H^+ -> h^0 W^+)
DECAY         6     2.43000000E+00   # top
#    BR                NDA      ID1      ID2
     1.00000000E+00    2           5        24   # BR(t -> b W)
Block HiggsBoundsInputHiggsCouplingsFermions
# ScalarNormEffCoupSq PseudoSNormEffCoupSq NP IP1 IP2 IP2
    1.12686613E+00    0.00000000E+00        3  25   5   5  # h0-b-b eff. coupling^2, normalised to SM
    2.48731339E+01    0.00000000E+00        3  35   5   5  # H0-b-b eff. coupling^2, normalised to SM
    0.00000000E+00    2.50000000E+01        3  36   5   5  # A0-b-b eff. coupling^2, normalised to SM
#
    9.94925355E-01    0.00000000E+00        3  25   6   6  # h0-t-t eff. coupling^2, normalised to SM
    4.50746451E-02    0.00000000E+00        3  35   6   6  # H0-t-t eff. coupling^2, normalised to SM
    0.00000000E+00    4.00000000E-02        3  36   6   6  # A0-t-t eff. coupling^2, normalised to SM
#
    1.12686613E+00    0.00000000E+00        3  25  15  15  # h0-tau-tau eff. coupling^2, normalised to SM
    2.48731339E+01    0.00000000E+00        3  35  15  15  # H0-tau-tau eff. coupling^2, normalised to SM
    0.00000000E+00    2.50000000E+01        3  36  15  15  # A0-tau-tau eff. coupling^2, normalised to SM
#
Block HiggsBoundsInputHiggsCouplingsBosons
    9.99848141E-01        3  25  24  24  # h0-W-W eff. coupling^2, normalised to SM
    1.51858500E-04        3  35  24  24  # H0-W-W eff. coupling^2, normalised to SM
    0.00000000E+00        3  36  24  24  # A0-W-W eff. coupling^2, normalised to SM
#
    9.99848141E-01        3  25  23  23  # h0-Z-Z eff. coupling^2, normalised to SM
    1.51858500E-04        3  35  23  23  # H0-Z-Z eff. coupling^2, normalised to SM
    0.00000000E+00        3  36  23  23  # A0-Z-Z eff. coupling^2, normalised to SM
#
    1.14951698E+00        3  25  21  21  # h0-g-g eff. coupling^2, normalised to SM
    4.06409872E-02        3  35  21  21  # H0-g-g eff. coupling^2, normalised to SM
    2.11222681E-01        3  36  21  21  # A0-g-g eff. coupling^2, normalised to SM
#
    0.00000000E+00        3  25  25  23  # h0-h0-Z eff. coupling^2, normalised to SM
    0.00000000E+00        3  35  25  23  # H0-h0-Z eff. coupling^2, normalised to SM
    1.51858500E-04        3  36  25  23  # A0-h0-Z eff. coupling^2, normalised to SM
    0.00000000E+00        3  35  35  23  # H0-H0-Z eff. coupling^2, normalised to SM
    9.99848141E-01        3  36  35  23  # A0-H0-Z eff. coupling^2, normalised to SM
    0.00000000E+00        3  36  36  23  # A0-A0-Z eff. coupling^2, normalised to SM
#
    0.00000000E+00        4  25  21  21  23  # h0-g-g-Z eff. coupling^2, normalised to SM
    0.00000000E+00        4  35  21  21  23  # H0-g-g-Z eff. coupling^2, normalised to SM
    0.00000000E+00        4  36  21  21  23  # A0-g-g-Z eff. coupling^2, normalised to SM
Block SPhenoLowEnergy  # low energy observables
    1    3.10542001E-04   # BR(b -> s gamma)
    2    1.59393719E-06   # BR(b -> s mu+ mu-)
    3    3.54404370E-05   # BR(b -> s nu nu)
    4    5.18812726E-11   # BR(Bd -> mu+ mu-)
    5    3.38910827E-09   # BR(Bs -> mu+ mu-)
    6    1.10547274E-04   # BR(B_u -> tau nu)
    7    9.99583605E-01   # BR(B_u -> tau nu)/BR(B_u -> tau nu)_SM
    8    2.73685145E-01   # |Delta(M_Bd)| [ps^-1] 
    9    2.03128403E+01   # |Delta(M_Bs)| [ps^-1] 
   20    1.91264945E-15   # Delta(g-2)_electron/2
   21    3.95921470E-11   # Delta(g-2)_muon/2
   22    1.43942987E-09   # Delta(g-2)_tau/2
   23    0.00000000E+00   # electric dipole moment of the electron
   24    0.00000000E+00   # electric dipole moment of the muon
   25    0.00000000E+00   # electric dipole moment of the tau
   26    0.00000000E+00   # Br(mu -> e gamma)
   27    0.00000000E+00   # Br(tau -> e gamma)
   28    0.00000000E+00   # Br(tau -> mu gamma)
   29    0.00000000E+00   # Br(mu -> 3 e)
   30    0.00000000E+00   # Br(tau -> 3 e)
   31    0.00000000E+00   # Br(tau -> 3 mu)
   39    4.74279038E-04   # Delta(rho_parameter)
   40    0.00000000E+00   # BR(Z -> e mu)
   41    0.00000000E+00   # BR(Z -> e tau)
   42    0.00000000E+00   # BR(Z -> mu tau)
Block FWCOEF Q=  9.11876000E+01  # Wilson coefficients at scale Q
#    id        order  M        value         comment
Block FWCOEF Q=  1.60000000E+02  # Wilson coefficients at scale Q
#    id        order  M        value         comment
     0305 4422   00   0    -1.87751356E-01   # C7
     0305 4422   00   1    -1.23425441E-02   # C7
     0305 4322   00   1    -2.70209812E-04   # C7'
     0305 6421   00   0    -9.48874482E-02   # C8
     0305 6421   00   1    -1.58866165E-02   # C8
     0305 6321   00   1    -3.45349670E-04   # C8'
 03051111 4133   00   0    -1.44575869E+00   # C9 e+e-
 03051111 4133   00   1     3.42073628E-04   # C9 e+e-
 03051111 4233   00   1    -4.90221049E-07   # C9' e+e-
 03051111 4137   00   0    -3.93838161E+00   # C10 e+e-
 03051111 4137   00   1    -1.89537119E-03   # C10 e+e-
 03051111 4237   00   1     1.32609450E-05   # C10' e+e-
 03051313 4133   00   0    -1.44575869E+00   # C9 mu+mu-
 03051313 4133   00   1     3.42071962E-04   # C9 mu+mu-
 03051313 4233   00   1    -4.90221893E-07   # C9' mu+mu-
 03051313 4137   00   0    -3.93838161E+00   # C10 mu+mu-
 03051313 4137   00   1    -1.89537286E-03   # C10 mu+mu-
 03051313 4237   00   1     1.32609459E-05   # C10' mu+mu-
 03051212 4237   00   0     1.49006039E+00   # C11 nu_1 nu_1
 03051212 4237   00   1     4.55349505E-04   # C11 nu_1 nu_1
 03051212 4137   00   1    -3.19432914E-06   # C11' nu_1 nu_1
 03051414 4237   00   0     1.49006039E+00   # C11 nu_2 nu_2
 03051414 4237   00   1     4.55349506E-04   # C11 nu_2 nu_2
 03051414 4137   00   1    -3.19432895E-06   # C11' nu_2 nu_2
 03051616 4237   00   0     1.49006039E+00   # C11 nu_3 nu_3
 03051616 4237   00   1     4.55349715E-04   # C11 nu_3 nu_3
 03051616 4137   00   1    -3.19427343E-06   # C11' nu_3 nu_3
