#
#                              ======================
#                              | THE SUSYHIT OUTPUT |
#                              ======================
#
#
#              ------------------------------------------------------
#              |     This is the output of the SUSY-HIT package     |
#              |  created by A.Djouadi, M.Muehlleitner and M.Spira. |
#              |  In case of problems with SUSY-HIT email to        |
#              |           margarete.muehlleitner@kit.edu           |
#              |           michael.spira@psi.ch                     |
#              |           abdelhak.djouadi@cern.ch                 |
#              ------------------------------------------------------
#
#              ------------------------------------------------------
#              |  SUSY Les Houches Accord - MSSM Spectrum + Decays  |
#              |              based on the decay programs           |
#              |                                                    |
#              |                     SDECAY 1.5                     |
#              |                                                    |
#              |  Authors: M.Muhlleitner, A.Djouadi and Y.Mambrini  |
#              |  Ref.:    Comput.Phys.Commun.168(2005)46           |
#              |           [hep-ph/0311167]                         |
#              |                                                    |
#              |                     HDECAY 3.4                     |
#              |                                                    |
#              |  By: A.Djouadi,J.Kalinowski,M.Muhlleitner,M.Spira  |
#              |  Ref.:    Comput.Phys.Commun.108(1998)56           |
#              |           [hep-ph/9704448]                         |
#              |                                                    |
#              |                                                    |
#              |  If not stated otherwise all DRbar couplings and   |
#              |  soft SUSY breaking masses are given at the scale  |
#              |  Q=  0.40557216E+04
#              |                                                    |
#              ------------------------------------------------------
#
#
BLOCK DCINFO  # Decay Program information
     1   SDECAY/HDECAY # decay calculator
     2   1.5  /3.4    # version number
#
BLOCK SPINFO  # Spectrum calculator information
     1   SuSpect     # RGE +Spectrum calculator            
     2   2.41        # version number                      
#
BLOCK MODSEL  # Model selection
     1     3   # #AMSB                                             
#
BLOCK SMINPUTS  # Standard Model inputs
         1     1.27934000E+02   # alpha_em^-1(M_Z)^MSbar
         2     1.16639000E-05   # G_F [GeV^-2]
         3     1.17200000E-01   # alpha_S(M_Z)^MSbar
         4     9.11870000E+01   # M_Z pole mass
         5     4.25000000E+00   # mb(mb)^MSbar
         6     1.73100000E+02   # mt pole mass
         7     1.77710000E+00   # mtau pole mass
#
BLOCK MINPAR  # Input parameters - minimal models
         1     5.00000000E+03   # m0                  
         2     1.55000000E+05   # M_3                 
         3     5.00000000E+00   # tanbeta(mZ)         
         4     1.00000000E+00   # sign(mu)            
         5     1.00000000E+00   # cQ                  
         6     1.00000000E+00   # cuR                 
#
BLOCK EXTPAR  # Input parameters - non-minimal models
         0     4.05572163E+03   # EWSB                
#
BLOCK MASS  # Mass Spectrum
# PDG code           mass       particle
        24     8.04906990E+01   # W+
        25     1.18603706E+02   # h
        35     5.65372105E+03   # H
        36     5.65352115E+03   # A
        37     5.65439239E+03   # H+
         5     4.87877839E+00   # b-quark pole mass calculated from mb(mb)_Msbar
   1000001     1.00000000E+10   # ~d_L
   2000001     1.00000000E+10   # ~d_R 
   1000002     1.00000000E+10   # ~u_L 
   2000002     1.00000000E+10   # ~u_R 
   1000003     1.00000000E+10   # ~s_L 
   2000003     1.00000000E+10   # ~s_R 
   1000004     1.00000000E+10   # ~c_L 
   2000004     1.00000000E+10   # ~c_R 
   1000005     1.00000000E+10   # ~b_1 
   2000005     1.00000000E+10   # ~b_2 
   1000006     1.00000000E+10   # ~t_1 
   2000006     1.00000000E+10   # ~t_2 
   1000011     1.00000000E+10   # ~e_L 
   2000011     1.00000000E+10   # ~e_R 
   1000012     1.00000000E+10   # ~nu_eL 
   1000013     1.00000000E+10   # ~mu_L 
   2000013     1.00000000E+10   # ~mu_R 
   1000014     1.00000000E+10   # ~nu_muL 
   1000015     1.00000000E+10   # ~tau_1 
   2000015     1.00000000E+10   # ~tau_2 
   1000016     1.00000000E+10   # ~nu_tauL 
   1000021     1.00000000E+10   # ~g 
   1000022     5.07356676E+02   # ~chi_10
   1000023     1.00000000E+10   # ~chi_20 
   1000025     1.00000000E+10   # ~chi_30 
   1000035     1.00000000E+10   # ~chi_40 
   1000024     5.07357628E+02   # ~chi_1+
   1000037     1.00000000E+10   # ~chi_2+ 
#
BLOCK NMIX  # Neutralino Mixing Matrix
  1  1     8.91169427E-04   # N_11
  1  2    -9.99397578E-01   # N_12
  1  3     3.22801357E-02   # N_13
  1  4    -1.27153030E-02   # N_14
  2  1     9.99399643E-01   # N_21
  2  2     2.05876372E-03   # N_22
  2  3     2.83408630E-02   # N_23
  2  4    -1.98219565E-02   # N_24
  3  1     6.04768657E-03   # N_31
  3  2    -1.38287796E-02   # N_32
  3  3    -7.06870396E-01   # N_33
  3  4    -7.07182037E-01   # N_34
  4  1     3.41025559E-02   # N_41
  4  2    -3.17648643E-02   # N_42
  4  3    -7.06037556E-01   # N_43
  4  4     7.06639214E-01   # N_44
#
BLOCK UMIX  # Chargino Mixing Matrix U
  1  1    -9.98959354E-01   # U_11
  1  2     4.56092987E-02   # U_12
  2  1     4.56092987E-02   # U_21
  2  2     9.98959354E-01   # U_22
#
BLOCK VMIX  # Chargino Mixing Matrix V
  1  1    -9.99838468E-01   # V_11
  1  2     1.79732430E-02   # V_12
  2  1     1.79732430E-02   # V_21
  2  2     9.99838468E-01   # V_22
#
BLOCK STOPMIX  # Stop Mixing Matrix
  1  1    -3.14665245E-02   # cos(theta_t)
  1  2     9.99504806E-01   # sin(theta_t)
  2  1    -9.99504806E-01   # -sin(theta_t)
  2  2    -3.14665245E-02   # cos(theta_t)
#
BLOCK SBOTMIX  # Sbottom Mixing Matrix
  1  1     9.99998850E-01   # cos(theta_b)
  1  2     1.51657465E-03   # sin(theta_b)
  2  1    -1.51657465E-03   # -sin(theta_b)
  2  2     9.99998850E-01   # cos(theta_b)
#
BLOCK STAUMIX  # Stau Mixing Matrix
  1  1     6.47782811E-01   # cos(theta_tau)
  1  2     7.61825065E-01   # sin(theta_tau)
  2  1    -7.61825065E-01   # -sin(theta_tau)
  2  2     6.47782811E-01   # cos(theta_tau)
#
BLOCK ALPHA  # Higgs mixing
          -2.08457548E-01   # Mixing angle in the neutral Higgs boson sector
#
BLOCK HMIX Q=  4.05572163E+03  # DRbar Higgs Parameters
         1     2.52914494E+03   # mu(Q)               
         2     4.73092679E+00   # tanbeta(Q)          
         3     2.43392853E+02   # vev(Q)              
         4     3.20350479E+07   # MA^2(Q)             
#
BLOCK GAUGE Q=  4.05572163E+03  # The gauge couplings
     1     3.65109537E-01   # gprime(Q) DRbar
     2     6.36710845E-01   # g(Q) DRbar
     3     9.94887016E-01   # g3(Q) DRbar
#
BLOCK AU Q=  4.05572163E+03  # The trilinear couplings
  1  1     5.12957019E+03   # A_u(Q) DRbar
  2  2     5.12957019E+03   # A_c(Q) DRbar
  3  3     2.42940383E+03   # A_t(Q) DRbar
#
BLOCK AD Q=  4.05572163E+03  # The trilinear couplings
  1  1     5.77602329E+03   # A_d(Q) DRbar
  2  2     5.77602329E+03   # A_s(Q) DRbar
  3  3     5.77282961E+03   # A_b(Q) DRbar
#
BLOCK AE Q=  4.05572163E+03  # The trilinear couplings
  1  1     1.55763769E+03   # A_e(Q) DRbar
  2  2     1.55763769E+03   # A_mu(Q) DRbar
  3  3     1.55049451E+03   # A_tau(Q) DRbar
#
BLOCK Yu Q=  4.05572163E+03  # The Yukawa couplings
  1  1     0.00000000E+00   # y_u(Q) DRbar
  2  2     0.00000000E+00   # y_c(Q) DRbar
  3  3     8.33685938E-01   # y_t(Q) DRbar
#
BLOCK Yd Q=  4.05572163E+03  # The Yukawa couplings
  1  1     0.00000000E+00   # y_d(Q) DRbar
  2  2     0.00000000E+00   # y_s(Q) DRbar
  3  3     6.66577585E-02   # y_b(Q) DRbar
#
BLOCK Ye Q=  4.05572163E+03  # The Yukawa couplings
  1  1     0.00000000E+00   # y_e(Q) DRbar
  2  2     0.00000000E+00   # y_mu(Q) DRbar
  3  3     4.91296167E-02   # y_tau(Q) DRbar
#
BLOCK MSOFT Q=  4.05572163E+03  # The soft SUSY breaking masses at the scale Q
         1     1.46380112E+03   # M_1                 
         2     4.73739316E+02   # M_2                 
         3    -2.82111688E+03   # M_3                 
        21     2.41206548E+07   # M^2_Hd              
        22    -4.70277329E+06   # M^2_Hu              
        31     4.94050682E+03   # M_eL                
        32     4.94050682E+03   # M_muL               
        33     4.93519110E+03   # M_tauL              
        34     4.94526784E+03   # M_eR                
        35     4.94526784E+03   # M_muR               
        36     4.93459380E+03   # M_tauR              
        41     5.57215647E+03   # M_q1L               
        42     5.57215647E+03   # M_q2L               
        43     4.65377987E+03   # M_q3L               
        44     5.59654309E+03   # M_uR                
        45     5.59654309E+03   # M_cR                
        46     3.53095501E+03   # M_tR                
        47     5.61243628E+03   # M_dR                
        48     5.61243628E+03   # M_sR                
        49     5.59876568E+03   # M_bR                
#
#
#
#                             =================
#                             |The decay table|
#                             =================
#
# - The QCD corrections to the decays gluino -> squark  + quark
#                                     squark -> gaugino + quark_prime
#                                     squark -> squark_prime + Higgs
#                                     squark -> gluino  + quark
#   are included.
#
# - The multi-body decays for the inos, stops and sbottoms are included.
#
# - The loop induced decays for the gluino, neutralinos and stops
#   are included.
#
# - The SUSY decays of the top quark are included.
#
#
#         PDG            Width
DECAY         6     1.42042693E+00   # top decays
#          BR         NDA      ID1       ID2
     1.00000000E+00    2           5        24   # BR(t ->  b    W+)
#
#         PDG            Width
DECAY   1000021     5.75726232E-03   # gluino decays
#          BR         NDA      ID1       ID2
     2.40491839E-06    2     1000022        21   # BR(~g -> ~chi_10 g)
     9.61194070E-06    2     1000023        21   # BR(~g -> ~chi_20 g)
#           BR         NDA      ID1       ID2       ID3
     3.97254373E-02    3     1000022         1        -1   # BR(~g -> ~chi_10 d  db)
     9.08878203E-04    3     1000023         1        -1   # BR(~g -> ~chi_20 d  db)
     3.97134950E-02    3     1000022         2        -2   # BR(~g -> ~chi_10 u  ub)
     3.13136631E-03    3     1000023         2        -2   # BR(~g -> ~chi_20 u  ub)
     3.97254373E-02    3     1000022         3        -3   # BR(~g -> ~chi_10 s  sb)
     9.08878203E-04    3     1000023         3        -3   # BR(~g -> ~chi_20 s  sb)
     3.97134950E-02    3     1000022         4        -4   # BR(~g -> ~chi_10 c  cb)
     3.13136631E-03    3     1000023         4        -4   # BR(~g -> ~chi_20 c  cb)
     8.72616718E-02    3     1000022         5        -5   # BR(~g -> ~chi_10 b  bb)
     1.15412461E-03    3     1000023         5        -5   # BR(~g -> ~chi_20 b  bb)
     7.72299662E-02    3     1000022         6        -6   # BR(~g -> ~chi_10 t  tb)
     1.99272507E-02    3     1000023         6        -6   # BR(~g -> ~chi_20 t  tb)
     7.94390804E-02    3     1000024         1        -2   # BR(~g -> ~chi_1+ d  ub)
     7.94390804E-02    3    -1000024         2        -1   # BR(~g -> ~chi_1- u  db)
     7.94390804E-02    3     1000024         3        -4   # BR(~g -> ~chi_1+ s  cb)
     7.94390804E-02    3    -1000024         4        -3   # BR(~g -> ~chi_1- c  sb)
     1.64850147E-01    3     1000024         5        -6   # BR(~g -> ~chi_1+ b  tb)
     1.64850147E-01    3    -1000024         6        -5   # BR(~g -> ~chi_1- t  bb)
#
#         PDG            Width
DECAY   1000006     9.80595330E+01   # stop1 decays
#          BR         NDA      ID1       ID2
    -2.35351984E-06    2     1000022         6   # BR(~t_1 -> ~chi_10 t )
     5.77005230E-02    2     1000023         6   # BR(~t_1 -> ~chi_20 t )
     6.13164918E-02    2     1000025         6   # BR(~t_1 -> ~chi_30 t )
     6.22061495E-02    2     1000035         6   # BR(~t_1 -> ~chi_40 t )
    -4.71739240E-06    2     1000024         5   # BR(~t_1 -> ~chi_1+ b )
     1.24860398E-01    2     1000037         5   # BR(~t_1 -> ~chi_2+ b )
     6.93923509E-01    2     1000021         6   # BR(~t_1 -> ~g      t )
#
#         PDG            Width
DECAY   2000006     2.57126658E+02   # stop2 decays
#          BR         NDA      ID1       ID2
     6.98326758E-02    2     1000022         6   # BR(~t_2 -> ~chi_10 t )
     2.39348740E-03    2     1000023         6   # BR(~t_2 -> ~chi_20 t )
     6.44163606E-02    2     1000025         6   # BR(~t_2 -> ~chi_30 t )
     6.37504495E-02    2     1000035         6   # BR(~t_2 -> ~chi_40 t )
     1.40080770E-01    2     1000024         5   # BR(~t_2 -> ~chi_1+ b )
     8.27468254E-04    2     1000037         5   # BR(~t_2 -> ~chi_2+ b )
     6.41186988E-01    2     1000021         6   # BR(~t_2 -> ~g      t )
     6.21665967E-03    2     1000006        25   # BR(~t_2 -> ~t_1    h )
     1.12951404E-02    2     1000006        23   # BR(~t_2 -> ~t_1    Z )
#
#         PDG            Width
DECAY   1000005     2.58067616E+02   # sbottom1 decays
#          BR         NDA      ID1       ID2
     6.96059092E-02    2     1000022         5   # BR(~b_1 -> ~chi_10 b )
     2.08974957E-03    2     1000023         5   # BR(~b_1 -> ~chi_20 b )
     4.06787904E-04    2     1000025         5   # BR(~b_1 -> ~chi_30 b )
     4.50029002E-04    2     1000035         5   # BR(~b_1 -> ~chi_40 b )
     1.38798458E-01    2    -1000024         6   # BR(~b_1 -> ~chi_1- t )
     1.27664665E-01    2    -1000037         6   # BR(~b_1 -> ~chi_2- t )
     6.37225521E-01    2     1000021         5   # BR(~b_1 -> ~g      b )
     2.37588804E-02    2     1000006       -24   # BR(~b_1 -> ~t_1    W-)
#
#         PDG            Width
DECAY   2000005     2.40908676E+02   # sbottom2 decays
#          BR         NDA      ID1       ID2
     9.65407713E-07    2     1000022         5   # BR(~b_2 -> ~chi_10 b )
     1.16902756E-02    2     1000023         5   # BR(~b_2 -> ~chi_20 b )
     6.54288098E-04    2     1000025         5   # BR(~b_2 -> ~chi_30 b )
     6.62491575E-04    2     1000035         5   # BR(~b_2 -> ~chi_40 b )
     1.90459344E-06    2    -1000024         6   # BR(~b_2 -> ~chi_1- t )
     1.30552802E-03    2    -1000037         6   # BR(~b_2 -> ~chi_2- t )
     9.85613753E-01    2     1000021         5   # BR(~b_2 -> ~g      b )
     1.68056214E-05    2     1000005        25   # BR(~b_2 -> ~b_1    h )
     1.90058320E-05    2     1000005        23   # BR(~b_2 -> ~b_1    Z )
     2.46430585E-07    2     1000006       -24   # BR(~b_2 -> ~t_1    W-)
     3.47354219E-05    2     2000006       -24   # BR(~b_2 -> ~t_2    W-)
#
#         PDG            Width
DECAY   1000002     3.00943813E+02   # sup_L decays
#          BR         NDA      ID1       ID2
     7.18129840E-02    2     1000022         2   # BR(~u_L -> ~chi_10 u)
     2.37548810E-03    2     1000023         2   # BR(~u_L -> ~chi_20 u)
     7.44970206E-06    2     1000025         2   # BR(~u_L -> ~chi_30 u)
     2.95350076E-05    2     1000035         2   # BR(~u_L -> ~chi_40 u)
     1.43801726E-01    2     1000024         1   # BR(~u_L -> ~chi_1+ d)
     2.99461879E-05    2     1000037         1   # BR(~u_L -> ~chi_2+ d)
     7.81942871E-01    2     1000021         2   # BR(~u_L -> ~g      u)
#
#         PDG            Width
DECAY   2000002     2.48598313E+02   # sup_R decays
#          BR         NDA      ID1       ID2
     4.06050987E-08    2     1000022         2   # BR(~u_R -> ~chi_10 u)
     4.52872773E-02    2     1000023         2   # BR(~u_R -> ~chi_20 u)
     1.21113749E-06    2     1000025         2   # BR(~u_R -> ~chi_30 u)
     3.84714859E-05    2     1000035         2   # BR(~u_R -> ~chi_40 u)
     9.54672999E-01    2     1000021         2   # BR(~u_R -> ~g      u)
#
#         PDG            Width
DECAY   1000001     3.00960194E+02   # sdown_L decays
#          BR         NDA      ID1       ID2
     7.18645829E-02    2     1000022         1   # BR(~d_L -> ~chi_10 d)
     2.27538801E-03    2     1000023         1   # BR(~d_L -> ~chi_20 d)
     1.04170777E-05    2     1000025         1   # BR(~d_L -> ~chi_30 d)
     6.79222105E-05    2     1000035         1   # BR(~d_L -> ~chi_40 d)
     1.43554198E-01    2    -1000024         2   # BR(~d_L -> ~chi_1- u)
     1.92862837E-04    2    -1000037         2   # BR(~d_L -> ~chi_2- u)
     7.82034629E-01    2     1000021         1   # BR(~d_L -> ~g      d)
#
#         PDG            Width
DECAY   2000001     2.41473113E+02   # sdown_R decays
#          BR         NDA      ID1       ID2
     1.04816328E-08    2     1000022         1   # BR(~d_R -> ~chi_10 d)
     1.16984391E-02    2     1000023         1   # BR(~d_R -> ~chi_20 d)
     3.13494583E-07    2     1000025         1   # BR(~d_R -> ~chi_30 d)
     9.95815089E-06    2     1000035         1   # BR(~d_R -> ~chi_40 d)
     9.88291279E-01    2     1000021         1   # BR(~d_R -> ~g      d)
#
#         PDG            Width
DECAY   1000004     3.00943813E+02   # scharm_L decays
#          BR         NDA      ID1       ID2
     7.18129840E-02    2     1000022         4   # BR(~c_L -> ~chi_10 c)
     2.37548810E-03    2     1000023         4   # BR(~c_L -> ~chi_20 c)
     7.44970206E-06    2     1000025         4   # BR(~c_L -> ~chi_30 c)
     2.95350076E-05    2     1000035         4   # BR(~c_L -> ~chi_40 c)
     1.43801726E-01    2     1000024         3   # BR(~c_L -> ~chi_1+ s)
     2.99461879E-05    2     1000037         3   # BR(~c_L -> ~chi_2+ s)
     7.81942871E-01    2     1000021         4   # BR(~c_L -> ~g      c)
#
#         PDG            Width
DECAY   2000004     2.48598313E+02   # scharm_R decays
#          BR         NDA      ID1       ID2
     4.06050987E-08    2     1000022         4   # BR(~c_R -> ~chi_10 c)
     4.52872773E-02    2     1000023         4   # BR(~c_R -> ~chi_20 c)
     1.21113749E-06    2     1000025         4   # BR(~c_R -> ~chi_30 c)
     3.84714859E-05    2     1000035         4   # BR(~c_R -> ~chi_40 c)
     9.54672999E-01    2     1000021         4   # BR(~c_R -> ~g      c)
#
#         PDG            Width
DECAY   1000003     3.00960194E+02   # sstrange_L decays
#          BR         NDA      ID1       ID2
     7.18645829E-02    2     1000022         3   # BR(~s_L -> ~chi_10 s)
     2.27538801E-03    2     1000023         3   # BR(~s_L -> ~chi_20 s)
     1.04170777E-05    2     1000025         3   # BR(~s_L -> ~chi_30 s)
     6.79222105E-05    2     1000035         3   # BR(~s_L -> ~chi_40 s)
     1.43554198E-01    2    -1000024         4   # BR(~s_L -> ~chi_1- c)
     1.92862837E-04    2    -1000037         4   # BR(~s_L -> ~chi_2- c)
     7.82034629E-01    2     1000021         3   # BR(~s_L -> ~g      s)
#
#         PDG            Width
DECAY   2000003     2.41473113E+02   # sstrange_R decays
#          BR         NDA      ID1       ID2
     1.04816328E-08    2     1000022         3   # BR(~s_R -> ~chi_10 s)
     1.16984391E-02    2     1000023         3   # BR(~s_R -> ~chi_20 s)
     3.13494583E-07    2     1000025         3   # BR(~s_R -> ~chi_30 s)
     9.95815089E-06    2     1000035         3   # BR(~s_R -> ~chi_40 s)
     9.88291279E-01    2     1000021         3   # BR(~s_R -> ~g      s)
#
#         PDG            Width
DECAY   1000011     6.39310893E+01   # selectron_L decays
#          BR         NDA      ID1       ID2
     3.04428122E-01    2     1000022        11   # BR(~e_L -> ~chi_10 e-)
     8.58864397E-02    2     1000023        11   # BR(~e_L -> ~chi_20 e-)
     1.80164025E-05    2     1000025        11   # BR(~e_L -> ~chi_30 e-)
     2.49817196E-05    2     1000035        11   # BR(~e_L -> ~chi_40 e-)
     6.08944947E-01    2    -1000024        12   # BR(~e_L -> ~chi_1- nu_e)
     6.97492320E-04    2    -1000037        12   # BR(~e_L -> ~chi_2- nu_e)
#
#         PDG            Width
DECAY   2000011     2.18522839E+01   # selectron_R decays
#          BR         NDA      ID1       ID2
     9.33352870E-07    2     1000022        11   # BR(~e_R -> ~chi_10 e-)
     9.99223648E-01    2     1000023        11   # BR(~e_R -> ~chi_20 e-)
     2.36764404E-05    2     1000025        11   # BR(~e_R -> ~chi_30 e-)
     7.51742256E-04    2     1000035        11   # BR(~e_R -> ~chi_40 e-)
#
#         PDG            Width
DECAY   1000013     6.39310893E+01   # smuon_L decays
#          BR         NDA      ID1       ID2
     3.04428122E-01    2     1000022        13   # BR(~mu_L -> ~chi_10 mu-)
     8.58864397E-02    2     1000023        13   # BR(~mu_L -> ~chi_20 mu-)
     1.80164025E-05    2     1000025        13   # BR(~mu_L -> ~chi_30 mu-)
     2.49817196E-05    2     1000035        13   # BR(~mu_L -> ~chi_40 mu-)
     6.08944947E-01    2    -1000024        14   # BR(~mu_L -> ~chi_1- nu_mu)
     6.97492320E-04    2    -1000037        14   # BR(~mu_L -> ~chi_2- nu_mu)
#
#         PDG            Width
DECAY   2000013     2.18522839E+01   # smuon_R decays
#          BR         NDA      ID1       ID2
     9.33352870E-07    2     1000022        13   # BR(~mu_R -> ~chi_10 mu-)
     9.99223648E-01    2     1000023        13   # BR(~mu_R -> ~chi_20 mu-)
     2.36764404E-05    2     1000025        13   # BR(~mu_R -> ~chi_30 mu-)
     7.51742256E-04    2     1000035        13   # BR(~mu_R -> ~chi_40 mu-)
#
#         PDG            Width
DECAY   1000015     3.97281664E+01   # stau_1 decays
#          BR         NDA      ID1       ID2
     2.06954379E-01    2     1000022        15   # BR(~tau_1 -> ~chi_10  tau-)
     3.76562785E-01    2     1000023        15   # BR(~tau_1 -> ~chi_20  tau-)
     1.26692100E-03    2     1000025        15   # BR(~tau_1 -> ~chi_30  tau-)
     8.01369327E-04    2     1000035        15   # BR(~tau_1 -> ~chi_40  tau-)
     4.13956904E-01    2    -1000024        16   # BR(~tau_1 -> ~chi_1-  nu_tau)
     4.57641860E-04    2    -1000037        16   # BR(~tau_1 -> ~chi_2-  nu_tau)
#
#         PDG            Width
DECAY   2000015     4.62986789E+01   # stau_2 decays
#          BR         NDA      ID1       ID2
     2.42320222E-01    2     1000022        15   # BR(~tau_2 -> ~chi_10  tau-)
     2.65514259E-01    2     1000023        15   # BR(~tau_2 -> ~chi_20  tau-)
     1.69917095E-03    2     1000025        15   # BR(~tau_2 -> ~chi_30  tau-)
     2.44185804E-03    2     1000035        15   # BR(~tau_2 -> ~chi_40  tau-)
     4.84710807E-01    2    -1000024        16   # BR(~tau_2 -> ~chi_1-  nu_tau)
     3.31368248E-03    2    -1000037        16   # BR(~tau_2 -> ~chi_2-  nu_tau)
#
#         PDG            Width
DECAY   1000012     6.39444501E+01   # snu_eL decays
#          BR         NDA      ID1       ID2
     3.04951913E-01    2     1000022        12   # BR(~nu_eL -> ~chi_10 nu_e)
     8.46302518E-02    2     1000023        12   # BR(~nu_eL -> ~chi_20 nu_e)
     5.01872878E-05    2     1000025        12   # BR(~nu_eL -> ~chi_30 nu_e)
     4.41164739E-04    2     1000035        12   # BR(~nu_eL -> ~chi_40 nu_e)
     6.09818222E-01    2     1000024        11   # BR(~nu_eL -> ~chi_1+ e-)
     1.08261718E-04    2     1000037        11   # BR(~nu_eL -> ~chi_2+ e-)
#
#         PDG            Width
DECAY   1000014     6.39444501E+01   # snu_muL decays
#          BR         NDA      ID1       ID2
     3.04951913E-01    2     1000022        14   # BR(~nu_muL -> ~chi_10 nu_mu)
     8.46302518E-02    2     1000023        14   # BR(~nu_muL -> ~chi_20 nu_mu)
     5.01872878E-05    2     1000025        14   # BR(~nu_muL -> ~chi_30 nu_mu)
     4.41164739E-04    2     1000035        14   # BR(~nu_muL -> ~chi_40 nu_mu)
     6.09818222E-01    2     1000024        13   # BR(~nu_muL -> ~chi_1+ mu-)
     1.08261718E-04    2     1000037        13   # BR(~nu_muL -> ~chi_2+ mu-)
#
#         PDG            Width
DECAY   1000016     6.39981386E+01   # snu_tauL decays
#          BR         NDA      ID1       ID2
     3.04354212E-01    2     1000022        16   # BR(~nu_tauL -> ~chi_10 nu_tau)
     8.44334459E-02    2     1000023        16   # BR(~nu_tauL -> ~chi_20 nu_tau)
     5.00129065E-05    2     1000025        16   # BR(~nu_tauL -> ~chi_30 nu_tau)
     4.39629944E-04    2     1000035        16   # BR(~nu_tauL -> ~chi_40 nu_tau)
     6.08630047E-01    2     1000024        15   # BR(~nu_tauL -> ~chi_1+ tau-)
     2.09265227E-03    2     1000037        15   # BR(~nu_tauL -> ~chi_2+ tau-)
#
#         PDG            Width
DECAY   1000024     0.00000000E+00   # stable chargino_1
#           BR         NDA      ID1       ID2       ID3
     3.74994135E-01    3     1000022         2        -1   # BR(~chi_1+ -> ~chi_10 u    db)
     3.74994135E-01    3     1000022         4        -3   # BR(~chi_1+ -> ~chi_10 c    sb)
     1.25005865E-01    3     1000022       -11        12   # BR(~chi_1+ -> ~chi_10 e+   nu_e)
     1.25005865E-01    3     1000022       -13        14   # BR(~chi_1+ -> ~chi_10 mu+  nu_mu)
#
#         PDG            Width
DECAY   1000037     1.89222709E+01   # chargino2+ decays
#          BR         NDA      ID1       ID2
     2.99981542E-01    2     1000024        23   # BR(~chi_2+ -> ~chi_1+  Z )
     2.89682778E-01    2     1000022        24   # BR(~chi_2+ -> ~chi_10  W+)
     9.93289926E-02    2     1000023        24   # BR(~chi_2+ -> ~chi_20  W+)
     3.11006687E-01    2     1000024        25   # BR(~chi_2+ -> ~chi_1+  h )
#
#         PDG            Width
DECAY   1000022     0.00000000E+00   # stable neutralino 
#
#         PDG            Width
DECAY   1000023     1.82903797E-02   # neutralino2 decays
#          BR         NDA      ID1       ID2
     1.65130622E-02    2     1000022        23   # BR(~chi_20 -> ~chi_10   Z )
     3.25900731E-01    2     1000024       -24   # BR(~chi_20 -> ~chi_1+   W-)
     3.25900731E-01    2    -1000024        24   # BR(~chi_20 -> ~chi_1-   W+)
     3.31685475E-01    2     1000022        25   # BR(~chi_20 -> ~chi_10   h )
#
#         PDG            Width
DECAY   1000025     1.86014295E+01   # neutralino3 decays
#          BR         NDA      ID1       ID2
     2.56678188E-01    2     1000022        23   # BR(~chi_30 -> ~chi_10   Z )
     1.00038308E-01    2     1000023        23   # BR(~chi_30 -> ~chi_20   Z )
     2.94807384E-01    2     1000024       -24   # BR(~chi_30 -> ~chi_1+   W-)
     2.94807384E-01    2    -1000024        24   # BR(~chi_30 -> ~chi_1-   W+)
     5.04257620E-02    2     1000022        25   # BR(~chi_30 -> ~chi_10   h )
     3.24297457E-03    2     1000023        25   # BR(~chi_30 -> ~chi_20   h )
#
#         PDG            Width
DECAY   1000035     1.88125921E+01   # neutralino4 decays
#          BR         NDA      ID1       ID2
     4.81242793E-02    2     1000022        23   # BR(~chi_40 -> ~chi_10   Z )
     3.15303498E-03    2     1000023        23   # BR(~chi_40 -> ~chi_20   Z )
     2.91506629E-01    2     1000024       -24   # BR(~chi_40 -> ~chi_1+   W-)
     2.91506629E-01    2    -1000024        24   # BR(~chi_40 -> ~chi_1-   W+)
     2.63039319E-01    2     1000022        25   # BR(~chi_40 -> ~chi_10   h )
     1.02670110E-01    2     1000023        25   # BR(~chi_40 -> ~chi_20   h )
#
#         PDG            Width
DECAY        25     3.43721165E-03   # h decays
#          BR         NDA      ID1       ID2
     7.03754831E-01    2           5        -5   # BR(h -> b       bb     )
     7.15253990E-02    2         -15        15   # BR(h -> tau+    tau-   )
     2.53179028E-04    2         -13        13   # BR(h -> mu+     mu-    )
     5.42110962E-04    2           3        -3   # BR(h -> s       sb     )
     2.35751148E-02    2           4        -4   # BR(h -> c       cb     )
     6.85094228E-02    2          21        21   # BR(h -> g       g      )
     2.21287833E-03    2          22        22   # BR(h -> gam     gam    )
     9.75510465E-04    2          22        23   # BR(h -> Z       gam    )
     1.15667975E-01    2          24       -24   # BR(h -> W+      W-     )
     1.29835785E-02    2          23        23   # BR(h -> Z       Z      )
#
#         PDG            Width
DECAY        35     6.14783809E+01   # H decays
#          BR         NDA      ID1       ID2
     2.16531564E-02    2           5        -5   # BR(H -> b       bb     )
     4.26598670E-03    2         -15        15   # BR(H -> tau+    tau-   )
     1.50800919E-05    2         -13        13   # BR(H -> mu+     mu-    )
     1.70341290E-05    2           3        -3   # BR(H -> s       sb     )
     1.52606943E-06    2           4        -4   # BR(H -> c       cb     )
     1.54747796E-01    2           6        -6   # BR(H -> t       tb     )
     3.97126932E-05    2          21        21   # BR(H -> g       g      )
     2.18521129E-07    2          22        22   # BR(H -> gam     gam    )
     7.63805551E-08    2          23        22   # BR(H -> Z       gam    )
     2.13110475E-05    2          24       -24   # BR(H -> W+      W-     )
     1.06518515E-05    2          23        23   # BR(H -> Z       Z      )
     7.16297785E-05    2          25        25   # BR(H -> h       h      )
    -9.62309357E-25    2          36        36   # BR(H -> A       A      )
     5.91468358E-18    2          23        36   # BR(H -> Z       A      )
     1.24551179E-03    2     1000024  -1000024   # BR(H -> ~chi_1+ ~chi_1-)
     4.13765134E-06    2     1000037  -1000037   # BR(H -> ~chi_2+ ~chi_2-)
     2.51421742E-01    2     1000024  -1000037   # BR(H -> ~chi_1+ ~chi_2-)
     2.51421742E-01    2     1000037  -1000024   # BR(H -> ~chi_2+ ~chi_1-)
     6.23885051E-04    2     1000022   1000022   # BR(H -> ~chi_10 ~chi_10)
     7.70308968E-05    2     1000023   1000023   # BR(H -> ~chi_20 ~chi_20)
     1.29060177E-05    2     1000025   1000025   # BR(H -> ~chi_30 ~chi_30)
     4.61078229E-05    2     1000035   1000035   # BR(H -> ~chi_40 ~chi_40)
     4.82306908E-04    2     1000022   1000023   # BR(H -> ~chi_10 ~chi_20)
     1.87043119E-01    2     1000022   1000025   # BR(H -> ~chi_10 ~chi_30)
     6.39425037E-02    2     1000022   1000035   # BR(H -> ~chi_10 ~chi_40)
     5.12978183E-02    2     1000023   1000025   # BR(H -> ~chi_20 ~chi_30)
     1.10962194E-02    2     1000023   1000035   # BR(H -> ~chi_20 ~chi_40)
     4.40790516E-04    2     1000025   1000035   # BR(H -> ~chi_30 ~chi_40)
#
#         PDG            Width
DECAY        36     6.14744831E+01   # A decays
#          BR         NDA      ID1       ID2
     2.16840046E-02    2           5        -5   # BR(A -> b       bb     )
     4.26637636E-03    2         -15        15   # BR(A -> tau+    tau-   )
     1.50814634E-05    2         -13        13   # BR(A -> mu+     mu-    )
     1.70853453E-05    2           3        -3   # BR(A -> s       sb     )
     1.53811493E-06    2           4        -4   # BR(A -> c       cb     )
     1.54882820E-01    2           6        -6   # BR(A -> t       tb     )
     5.52301676E-05    2          21        21   # BR(A -> g       g      )
     8.80816807E-08    2          22        22   # BR(A -> gam     gam    )
     9.55582092E-08    2          23        22   # BR(A -> Z       gam    )
     2.12912638E-05    2          23        25   # BR(A -> Z       h      )
     1.79710489E-03    2     1000024  -1000024   # BR(A -> ~chi_1+ ~chi_1-)
     2.45655694E-04    2     1000037  -1000037   # BR(A -> ~chi_2+ ~chi_2-)
     2.51011315E-01    2     1000024  -1000037   # BR(A -> ~chi_1+ ~chi_2-)
     2.51011315E-01    2     1000037  -1000024   # BR(A -> ~chi_2+ ~chi_1-)
     9.00320854E-04    2     1000022   1000022   # BR(A -> ~chi_10 ~chi_10)
     1.90602868E-04    2     1000023   1000023   # BR(A -> ~chi_20 ~chi_20)
     2.92297890E-05    2     1000025   1000025   # BR(A -> ~chi_30 ~chi_30)
     5.87622130E-04    2     1000035   1000035   # BR(A -> ~chi_40 ~chi_40)
     8.76321005E-04    2     1000022   1000023   # BR(A -> ~chi_10 ~chi_20)
     6.44198878E-02    2     1000022   1000025   # BR(A -> ~chi_10 ~chi_30)
     1.85878736E-01    2     1000022   1000035   # BR(A -> ~chi_10 ~chi_40)
     1.12015918E-02    2     1000023   1000025   # BR(A -> ~chi_20 ~chi_30)
     5.08526326E-02    2     1000023   1000035   # BR(A -> ~chi_20 ~chi_40)
     5.40529394E-05    2     1000025   1000035   # BR(A -> ~chi_30 ~chi_40)
#
#         PDG            Width
DECAY        37     6.13113871E+01   # H+ decays
#          BR         NDA      ID1       ID2
     3.41029011E-05    2           4        -5   # BR(H+ -> c       bb     )
     4.27838468E-03    2         -15        16   # BR(H+ -> tau+    nu_tau )
     1.51239123E-05    2         -13        14   # BR(H+ -> mu+     nu_mu  )
     2.18243332E-07    2           2        -5   # BR(H+ -> u       bb     )
     8.19874485E-07    2           2        -3   # BR(H+ -> u       sb     )
     1.83433477E-05    2           4        -3   # BR(H+ -> c       sb     )
     1.74353819E-01    2           6        -5   # BR(H+ -> t       bb     )
     2.13614722E-05    2          24        25   # BR(H+ -> W+      h      )
     1.07744710E-14    2          24        36   # BR(H+ -> W+      A      )
     6.94921719E-10    2     1000024   1000022   # BR(H+ -> ~chi_1+ ~chi_10)
     1.36812158E-03    2     1000024   1000023   # BR(H+ -> ~chi_1+ ~chi_20)
     2.52322199E-01    2     1000024   1000025   # BR(H+ -> ~chi_1+ ~chi_30)
     2.51565236E-01    2     1000024   1000035   # BR(H+ -> ~chi_1+ ~chi_40)
     2.52520249E-01    2     1000037   1000022   # BR(H+ -> ~chi_2+ ~chi_10)
     6.32509649E-02    2     1000037   1000023   # BR(H+ -> ~chi_2+ ~chi_20)
     1.49215663E-04    2     1000037   1000025   # BR(H+ -> ~chi_2+ ~chi_30)
     1.01839789E-04    2     1000037   1000035   # BR(H+ -> ~chi_2+ ~chi_40)
