#
#                              ======================
#                              | THE SUSYHIT OUTPUT |
#                              ======================
#
#
#              ------------------------------------------------------
#              |     This is the output of the SUSY-HIT package     |
#              |  created by A.Djouadi, M.Muehlleitner and M.Spira. |
#              |  In case of problems with SUSY-HIT email to        |
#              |           margarete.muehlleitner@kit.edu           |
#              |           michael.spira@psi.ch                     |
#              |           abdelhak.djouadi@cern.ch                 |
#              ------------------------------------------------------
#
#              ------------------------------------------------------
#              |  SUSY Les Houches Accord - MSSM Spectrum + Decays  |
#              |              based on the decay programs           |
#              |                                                    |
#              |                     SDECAY 1.5                     |
#              |                                                    |
#              |  Authors: M.Muhlleitner, A.Djouadi and Y.Mambrini  |
#              |  Ref.:    Comput.Phys.Commun.168(2005)46           |
#              |           [hep-ph/0311167]                         |
#              |                                                    |
#              |                     HDECAY 3.4                     |
#              |                                                    |
#              |  By: A.Djouadi,J.Kalinowski,M.Muhlleitner,M.Spira  |
#              |  Ref.:    Comput.Phys.Commun.108(1998)56           |
#              |           [hep-ph/9704448]                         |
#              |                                                    |
#              |                                                    |
#              |  If not stated otherwise all DRbar couplings and   |
#              |  soft SUSY breaking masses are given at the scale  |
#              |  Q=  0.91187600E+02
#              |                                                    |
#              ------------------------------------------------------
#
#
BLOCK DCINFO  # Decay Program information
     1   SDECAY/HDECAY # decay calculator
     2   1.5  /3.4    # version number
#
BLOCK SPINFO  # Spectrum calculator information
     1   SuSpect     # RGE +Spectrum calculator            
     2   2.43         # version number                     
#
BLOCK MODSEL  # Model selection
     1     2   # GMSB                                              
#
BLOCK SMINPUTS  # Standard Model inputs
         1     1.27932904E+02   # alpha_em^-1(M_Z)^MSbar
         2     1.16639000E-05   # G_F [GeV^-2]
         3     1.17200000E-01   # alpha_S(M_Z)^MSbar
         4     9.11870000E+01   # M_Z pole mass
         5     4.25000000E+00   # mb(mb)^MSbar
         6     1.72900000E+02   # mt pole mass
         7     1.77700000E+00   # mtau pole mass
#
BLOCK MINPAR  # Input parameters - minimal models
#
BLOCK EXTPAR  # Input parameters - non-minimal models
         0     9.11876000E+01   # EWSB                
         1     4.63000000E+02   # M_1                 
         2     3.00000000E+03   # M_2                 
         3     2.00000000E+03   # M_3                 
        11     0.00000000E+00   # A_t                 
        12     0.00000000E+00   # A_b                 
        13     0.00000000E+00   # A_tau               
        14     0.00000000E+00   # A_u                 
        15     0.00000000E+00   # A_d                 
        16     0.00000000E+00   # A_e                 
        23     4.50000000E+02   # mu(EWSB)            
        25     1.50000000E+00   # tanbeta(in)         
        26     2.00000000E+03   # MA_pole             
        31     5.00000000E+03   # M_eL                
        32     5.00000000E+03   # M_muL               
        33     5.00000000E+03   # M_tauL              
        34     5.00000000E+03   # M_eR                
        35     5.00000000E+03   # M_muR               
        36     5.00000000E+03   # M_tauR              
        41     5.00000000E+03   # M_q1L               
        42     5.00000000E+03   # M_q2L               
        43     5.00000000E+03   # M_q3L               
        44     5.00000000E+03   # M_uR                
        45     5.00000000E+03   # M_cR                
        46     5.00000000E+03   # M_tR                
        47     5.00000000E+03   # M_dR                
        48     5.00000000E+03   # M_sR                
        49     5.00000000E+03   # M_bR                
#
BLOCK MASS  # Mass Spectrum
# PDG code           mass       particle
        24     8.05385978E+01   # W+
        25     1.26000000E+02   # h
        35     2.00422323E+03   # H
        36     2.00000000E+03   # A
        37     2.00201873E+03   # H+
         5     4.87877839E+00   # b-quark pole mass calculated from mb(mb)_Msbar
   1000001     4.94269523E+03   # ~d_L
   2000001     4.94258488E+03   # ~d_R
   1000002     4.94244859E+03   # ~u_L
   2000002     4.94250705E+03   # ~u_R
   1000003     4.94269523E+03   # ~s_L
   2000003     4.94258488E+03   # ~s_R
   1000004     4.94244859E+03   # ~c_L
   2000004     4.94250705E+03   # ~c_R
   1000005     4.94244690E+03   # ~b_1
   2000005     4.94283469E+03   # ~b_2
   1000006     5.07339256E+03   # ~t_1
   2000006     5.37460774E+03   # ~t_2
   1000011     5.00008242E+03   # ~e_L
   2000011     5.00007601E+03   # ~e_R
   1000012     4.99984157E+03   # ~nu_eL
   1000013     5.00008242E+03   # ~mu_L
   2000013     5.00007601E+03   # ~mu_R
   1000014     4.99984157E+03   # ~nu_muL
   1000015     4.99995950E+03   # ~tau_1
   2000015     5.00019955E+03   # ~tau_2
   1000016     4.99984157E+03   # ~nu_tauL
   1000021     2.06307655E+03   # ~g
   1000022     4.42370653E+02   # ~chi_10
   1000023    -4.84204004E+02   # ~chi_20
   1000025     5.29941012E+02   # ~chi_30
   1000035     3.12901619E+03   # ~chi_40
   1000024     4.81848954E+02   # ~chi_1+
   1000037     3.12901563E+03   # ~chi_2+
   1000039     1.00000000E-09   # ~gravitino
#
BLOCK NMIX  # Neutralino Mixing Matrix
  1  1     6.70835777E-01   # N_11
  1  2    -2.13895330E-02   # N_12
  1  3     5.28872458E-01   # N_13
  1  4    -5.19437939E-01   # N_14
  2  1     8.97796336E-03   # N_21
  2  2    -4.31381108E-03   # N_22
  2  3    -7.06541251E-01   # N_23
  2  4    -7.07601758E-01   # N_24
  3  1     7.41551420E-01   # N_31
  3  2     2.00743462E-02   # N_32
  3  3    -4.69872249E-01   # N_33
  3  4     4.78454367E-01   # N_34
  4  1     4.98785954E-04   # N_41
  4  2    -9.99560353E-01   # N_42
  4  3    -1.77046114E-02   # N_43
  4  4     2.37781078E-02   # N_44
#
BLOCK UMIX  # Chargino Mixing Matrix U
  1  1    -2.50291312E-02   # U_11
  1  2     9.99686722E-01   # U_12
  2  1     9.99686722E-01   # U_21
  2  2     2.50291312E-02   # U_22
#
BLOCK VMIX  # Chargino Mixing Matrix V
  1  1    -3.36213630E-02   # V_11
  1  2     9.99434642E-01   # V_12
  2  1     9.99434642E-01   # V_21
  2  2     3.36213630E-02   # V_22
#
BLOCK STOPMIX  # Stop Mixing Matrix
  1  1     9.99828956E-01   # cos(theta_t)
  1  2    -1.84948302E-02   # sin(theta_t)
  2  1     1.84948302E-02   # -sin(theta_t)
  2  2     9.99828956E-01   # cos(theta_t)
#
BLOCK SBOTMIX  # Sbottom Mixing Matrix
  1  1     5.98101380E-01   # cos(theta_b)
  1  2     8.01420451E-01   # sin(theta_b)
  2  1    -8.01420451E-01   # -sin(theta_b)
  2  2     5.98101380E-01   # cos(theta_b)
#
BLOCK STAUMIX  # Stau Mixing Matrix
  1  1     6.97596958E-01   # cos(theta_tau)
  1  2     7.16490394E-01   # sin(theta_tau)
  2  1    -7.16490394E-01   # -sin(theta_tau)
  2  2     6.97596958E-01   # cos(theta_tau)
#
BLOCK ALPHA  # Higgs mixing
          -5.90209410E-01   # Mixing angle in the neutral Higgs boson sector
#
BLOCK HMIX Q=  9.11876000E+01  # DRbar Higgs Parameters
         1     4.50000000E+02   # mu(Q)               
         2     1.49999979E+00   # tanbeta(Q)          
         3     2.51892847E+02   # vev(Q)              
         4     3.75572601E+06   # MA^2(Q)             
#
BLOCK GAUGE Q=  9.11876000E+01  # The gauge couplings
     1     3.52960560E-01   # gprime(Q) DRbar
     2     6.28305672E-01   # g(Q) DRbar
     3     1.08044608E+00   # g3(Q) DRbar
#
BLOCK AU Q=  9.11876000E+01  # The trilinear couplings
  1  1     0.00000000E+00   # A_u(Q) DRbar
  2  2     0.00000000E+00   # A_c(Q) DRbar
  3  3     0.00000000E+00   # A_t(Q) DRbar
#
BLOCK AD Q=  9.11876000E+01  # The trilinear couplings
  1  1     0.00000000E+00   # A_d(Q) DRbar
  2  2     0.00000000E+00   # A_s(Q) DRbar
  3  3     0.00000000E+00   # A_b(Q) DRbar
#
BLOCK AE Q=  9.11876000E+01  # The trilinear couplings
  1  1     0.00000000E+00   # A_e(Q) DRbar
  2  2     0.00000000E+00   # A_mu(Q) DRbar
  3  3     0.00000000E+00   # A_tau(Q) DRbar
#
BLOCK Yu Q=  9.11876000E+01  # The Yukawa couplings
  1  1     0.00000000E+00   # y_u(Q) DRbar
  2  2     0.00000000E+00   # y_c(Q) DRbar
  3  3     1.02673550E+00   # y_t(Q) DRbar
#
BLOCK Yd Q=  9.11876000E+01  # The Yukawa couplings
  1  1     0.00000000E+00   # y_d(Q) DRbar
  2  2     0.00000000E+00   # y_s(Q) DRbar
  3  3     2.72178480E-02   # y_b(Q) DRbar
#
BLOCK Ye Q=  9.11876000E+01  # The Yukawa couplings
  1  1     0.00000000E+00   # y_e(Q) DRbar
  2  2     0.00000000E+00   # y_mu(Q) DRbar
  3  3     1.79911829E-02   # y_tau(Q) DRbar
#
BLOCK MSOFT Q=  9.11876000E+01  # The soft SUSY breaking masses at the scale Q
         1     4.63000000E+02   # M_1                 
         2     3.00000000E+03   # M_2                 
         3     2.00000000E+03   # M_3                 
        14     0.00000000E+00   # A_u                 
        15     0.00000000E+00   # A_d                 
        16     0.00000000E+00   # A_e                 
        21     2.83419590E+06   # M^2_Hd              
        22    -5.59979847E+06   # M^2_Hu              
        31     5.00000000E+03   # M_eL                
        32     5.00000000E+03   # M_muL               
        33     5.00000000E+03   # M_tauL              
        34     5.00000000E+03   # M_eR                
        35     5.00000000E+03   # M_muR               
        36     5.00000000E+03   # M_tauR              
        41     5.00000000E+03   # M_q1L               
        42     5.00000000E+03   # M_q2L               
        43     5.00000000E+03   # M_q3L               
        44     5.00000000E+03   # M_uR                
        45     5.00000000E+03   # M_cR                
        46     5.00000000E+03   # M_tR                
        47     5.00000000E+03   # M_dR                
        48     5.00000000E+03   # M_sR                
        49     5.00000000E+03   # M_bR                
#
#
#
#                             =================
#                             |The decay table|
#                             =================
#
# - The QCD corrections to the decays gluino -> squark  + quark
#                                     squark -> gaugino + quark_prime
#                                     squark -> squark_prime + Higgs
#                                     squark -> gluino  + quark
#   are included.
#
# - The multi-body decays for the inos, stops and sbottoms are included.
#
# - The loop induced decays for the gluino, neutralinos and stops
#   are included.
#
# - The SUSY decays of the top quark are included.
#
# - Possible decays of the NLSP in GMSB models are included.
#
#
#         PDG            Width
DECAY         6     1.37553646E+00   # top decays
#          BR         NDA      ID1       ID2
     1.00000000E+00    2           5        24   # BR(t ->  b    W+)
#
#         PDG            Width
DECAY   1000021     3.22022324E-03   # gluino decays
#          BR         NDA      ID1       ID2
     4.69963866E-03    2     1000022        21   # BR(~g -> ~chi_10 g)
     8.30162472E-03    2     1000023        21   # BR(~g -> ~chi_20 g)
     3.51412652E-03    2     1000025        21   # BR(~g -> ~chi_30 g)
#          BR         NDA      ID1       ID2
0.0E+00    2     1000039    21 # BR(~g -> ~G      g)
#           BR         NDA      ID1       ID2       ID3
     4.32604029E-03    3     1000022         1        -1   # BR(~g -> ~chi_10 d  db)
     1.20646627E-06    3     1000023         1        -1   # BR(~g -> ~chi_20 d  db)
     4.17050449E-03    3     1000025         1        -1   # BR(~g -> ~chi_30 d  db)
     1.34465313E-02    3     1000022         2        -2   # BR(~g -> ~chi_10 u  ub)
     1.33197382E-06    3     1000023         2        -2   # BR(~g -> ~chi_20 u  ub)
     1.52581191E-02    3     1000025         2        -2   # BR(~g -> ~chi_30 u  ub)
     4.32604029E-03    3     1000022         3        -3   # BR(~g -> ~chi_10 s  sb)
     1.20646627E-06    3     1000023         3        -3   # BR(~g -> ~chi_20 s  sb)
     4.17050449E-03    3     1000025         3        -3   # BR(~g -> ~chi_30 s  sb)
     1.34465313E-02    3     1000022         4        -4   # BR(~g -> ~chi_10 c  cb)
     1.33197382E-06    3     1000023         4        -4   # BR(~g -> ~chi_20 c  cb)
     1.52581191E-02    3     1000025         4        -4   # BR(~g -> ~chi_30 c  cb)
     4.43134074E-03    3     1000022         5        -5   # BR(~g -> ~chi_10 b  bb)
     2.09764017E-04    3     1000023         5        -5   # BR(~g -> ~chi_20 b  bb)
     4.27053652E-03    3     1000025         5        -5   # BR(~g -> ~chi_30 b  bb)
     1.14013530E-01    3     1000022         6        -6   # BR(~g -> ~chi_10 t  tb)
     1.98534365E-01    3     1000023         6        -6   # BR(~g -> ~chi_20 t  tb)
     1.09179652E-01    3     1000025         6        -6   # BR(~g -> ~chi_30 t  tb)
     8.47930380E-05    3     1000024         1        -2   # BR(~g -> ~chi_1+ d  ub)
     8.47930380E-05    3    -1000024         2        -1   # BR(~g -> ~chi_1- u  db)
     8.47930380E-05    3     1000024         3        -4   # BR(~g -> ~chi_1+ s  cb)
     8.47930380E-05    3    -1000024         4        -3   # BR(~g -> ~chi_1- c  sb)
     2.32368304E-01    3     1000024         5        -6   # BR(~g -> ~chi_1+ b  tb)
     2.32368304E-01    3    -1000024         6        -5   # BR(~g -> ~chi_1- t  bb)
#
#         PDG            Width
DECAY   1000006     2.85669306E+02   # stop1 decays
#          BR         NDA      ID1       ID2
     6.63205710E-02    2     1000022         6   # BR(~t_1 -> ~chi_10 t )
     1.25502167E-01    2     1000023         6   # BR(~t_1 -> ~chi_20 t )
     6.10605403E-02    2     1000025         6   # BR(~t_1 -> ~chi_30 t )
     2.60939527E-02    2     1000035         6   # BR(~t_1 -> ~chi_40 t )
     1.49818364E-04    2     1000024         5   # BR(~t_1 -> ~chi_1+ b )
     5.20031538E-02    2     1000037         5   # BR(~t_1 -> ~chi_2+ b )
     6.48988878E-01    2     1000021         6   # BR(~t_1 -> ~g      t )
     7.17656244E-03    2     1000005        24   # BR(~t_1 -> ~b_1    W+)
     1.27043564E-02    2     2000005        24   # BR(~t_1 -> ~b_2    W+)
#
#         PDG            Width
DECAY   2000006     3.66789617E+02   # stop2 decays
#          BR         NDA      ID1       ID2
     7.19216413E-02    2     1000022         6   # BR(~t_2 -> ~chi_10 t )
     1.04414473E-01    2     1000023         6   # BR(~t_2 -> ~chi_20 t )
     6.26591425E-02    2     1000025         6   # BR(~t_2 -> ~chi_30 t )
    -2.30848145E-05    2     1000035         6   # BR(~t_2 -> ~chi_40 t )
     2.08817485E-01    2     1000024         5   # BR(~t_2 -> ~chi_1+ b )
    -4.61664007E-05    2     1000037         5   # BR(~t_2 -> ~chi_2+ b )
     5.51963917E-01    2     1000021         6   # BR(~t_2 -> ~g      t )
    -7.72408146E-05    2     1000006        25   # BR(~t_2 -> ~t_1    h )
     5.37777330E-05    2     1000006        23   # BR(~t_2 -> ~t_1    Z )
     1.13189828E-04    2     1000005        24   # BR(~t_2 -> ~b_1    W+)
     2.02864857E-04    2     2000005        24   # BR(~t_2 -> ~b_2    W+)
#
#         PDG            Width
DECAY   1000005     1.91942649E+02   # sbottom1 decays
#          BR         NDA      ID1       ID2
     6.31131002E-03    2     1000022         5   # BR(~b_1 -> ~chi_10 b )
     1.02433506E-04    2     1000023         5   # BR(~b_1 -> ~chi_20 b )
     5.57508969E-03    2     1000025         5   # BR(~b_1 -> ~chi_30 b )
     6.15860510E-03    2     1000035         5   # BR(~b_1 -> ~chi_40 b )
     3.71003946E-02    2    -1000024         6   # BR(~b_1 -> ~chi_1- t )
     1.23492917E-02    2    -1000037         6   # BR(~b_1 -> ~chi_2- t )
     9.32402875E-01    2     1000021         5   # BR(~b_1 -> ~g      b )
#
#         PDG            Width
DECAY   2000005     2.59315741E+02   # sbottom2 decays
#          BR         NDA      ID1       ID2
     1.44627151E-03    2     1000022         5   # BR(~b_2 -> ~chi_10 b )
     1.17793362E-04    2     1000023         5   # BR(~b_2 -> ~chi_20 b )
     2.38587969E-03    2     1000025         5   # BR(~b_2 -> ~chi_30 b )
     2.14987953E-02    2     1000035         5   # BR(~b_2 -> ~chi_40 b )
     2.41638334E-01    2    -1000024         6   # BR(~b_2 -> ~chi_1- t )
     4.31548029E-02    2    -1000037         6   # BR(~b_2 -> ~chi_2- t )
     6.89758123E-01    2     1000021         5   # BR(~b_2 -> ~g      b )
#
#         PDG            Width
DECAY   1000002     1.99865367E+02   # sup_L decays
#          BR         NDA      ID1       ID2
     9.99904891E-04    2     1000022         2   # BR(~u_L -> ~chi_10 u)
     6.35951560E-07    2     1000023         2   # BR(~u_L -> ~chi_20 u)
     2.30913644E-03    2     1000025         2   # BR(~u_L -> ~chi_30 u)
     3.37874512E-02    2     1000035         2   # BR(~u_L -> ~chi_40 u)
     2.07482241E-04    2     1000024         1   # BR(~u_L -> ~chi_1+ d)
     6.75705655E-02    2     1000037         1   # BR(~u_L -> ~chi_2+ d)
     8.95124824E-01    2     1000021         2   # BR(~u_L -> ~g      u)
#
#         PDG            Width
DECAY   2000002     1.89190615E+02   # sup_R decays
#          BR         NDA      ID1       ID2
     2.45501276E-02    2     1000022         2   # BR(~u_R -> ~chi_10 u)
     4.38356851E-06    2     1000023         2   # BR(~u_R -> ~chi_20 u)
     2.97941696E-02    2     1000025         2   # BR(~u_R -> ~chi_30 u)
     4.98759947E-09    2     1000035         2   # BR(~u_R -> ~chi_40 u)
     9.45651314E-01    2     1000021         2   # BR(~u_R -> ~g      u)
#
#         PDG            Width
DECAY   1000001     1.99870937E+02   # sdown_L decays
#          BR         NDA      ID1       ID2
     1.98919300E-03    2     1000022         1   # BR(~d_L -> ~chi_10 d)
     3.29782273E-06    2     1000023         1   # BR(~d_L -> ~chi_20 d)
     1.28988727E-03    2     1000025         1   # BR(~d_L -> ~chi_30 d)
     3.38052991E-02    2     1000035         1   # BR(~d_L -> ~chi_40 d)
     1.14988001E-04    2    -1000024         2   # BR(~d_L -> ~chi_1- u)
     6.76150899E-02    2    -1000037         2   # BR(~d_L -> ~chi_2- u)
     8.95182245E-01    2     1000021         1   # BR(~d_L -> ~g      d)
#
#         PDG            Width
DECAY   2000001     1.81484156E+02   # sdown_R decays
#          BR         NDA      ID1       ID2
     6.39825849E-03    2     1000022         1   # BR(~d_R -> ~chi_10 d)
     1.14244649E-06    2     1000023         1   # BR(~d_R -> ~chi_20 d)
     7.76496329E-03    2     1000025         1   # BR(~d_R -> ~chi_30 d)
     1.29992238E-09    2     1000035         1   # BR(~d_R -> ~chi_40 d)
     9.85835634E-01    2     1000021         1   # BR(~d_R -> ~g      d)
#
#         PDG            Width
DECAY   1000004     1.99865367E+02   # scharm_L decays
#          BR         NDA      ID1       ID2
     9.99904891E-04    2     1000022         4   # BR(~c_L -> ~chi_10 c)
     6.35951560E-07    2     1000023         4   # BR(~c_L -> ~chi_20 c)
     2.30913644E-03    2     1000025         4   # BR(~c_L -> ~chi_30 c)
     3.37874512E-02    2     1000035         4   # BR(~c_L -> ~chi_40 c)
     2.07482241E-04    2     1000024         3   # BR(~c_L -> ~chi_1+ s)
     6.75705655E-02    2     1000037         3   # BR(~c_L -> ~chi_2+ s)
     8.95124824E-01    2     1000021         4   # BR(~c_L -> ~g      c)
#
#         PDG            Width
DECAY   2000004     1.89190615E+02   # scharm_R decays
#          BR         NDA      ID1       ID2
     2.45501276E-02    2     1000022         4   # BR(~c_R -> ~chi_10 c)
     4.38356851E-06    2     1000023         4   # BR(~c_R -> ~chi_20 c)
     2.97941696E-02    2     1000025         4   # BR(~c_R -> ~chi_30 c)
     4.98759947E-09    2     1000035         4   # BR(~c_R -> ~chi_40 c)
     9.45651314E-01    2     1000021         4   # BR(~c_R -> ~g      c)
#
#         PDG            Width
DECAY   1000003     1.99870937E+02   # sstrange_L decays
#          BR         NDA      ID1       ID2
     1.98919300E-03    2     1000022         3   # BR(~s_L -> ~chi_10 s)
     3.29782273E-06    2     1000023         3   # BR(~s_L -> ~chi_20 s)
     1.28988727E-03    2     1000025         3   # BR(~s_L -> ~chi_30 s)
     3.38052991E-02    2     1000035         3   # BR(~s_L -> ~chi_40 s)
     1.14988001E-04    2    -1000024         4   # BR(~s_L -> ~chi_1- c)
     6.76150899E-02    2    -1000037         4   # BR(~s_L -> ~chi_2- c)
     8.95182245E-01    2     1000021         3   # BR(~s_L -> ~g      s)
#
#         PDG            Width
DECAY   2000003     1.81484156E+02   # sstrange_R decays
#          BR         NDA      ID1       ID2
     6.39825849E-03    2     1000022         3   # BR(~s_R -> ~chi_10 s)
     1.14244649E-06    2     1000023         3   # BR(~s_R -> ~chi_20 s)
     7.76496329E-03    2     1000025         3   # BR(~s_R -> ~chi_30 s)
     1.29992238E-09    2     1000035         3   # BR(~s_R -> ~chi_40 s)
     9.85835634E-01    2     1000021         3   # BR(~s_R -> ~g      s)
#
#         PDG            Width
DECAY   1000011     2.79087191E+01   # selectron_L decays
#          BR         NDA      ID1       ID2
     8.75069545E-02    2     1000022        11   # BR(~e_L -> ~chi_10 e-)
     3.67607888E-07    2     1000023        11   # BR(~e_L -> ~chi_20 e-)
     1.31141167E-01    2     1000025        11   # BR(~e_L -> ~chi_30 e-)
     2.60020951E-01    2     1000035        11   # BR(~e_L -> ~chi_40 e-)
     8.65160704E-04    2    -1000024        12   # BR(~e_L -> ~chi_1- nu_e)
     5.20465399E-01    2    -1000037        12   # BR(~e_L -> ~chi_2- nu_e)
#
#         PDG            Width
DECAY   2000011     2.43065629E+01   # selectron_R decays
#          BR         NDA      ID1       ID2
     4.51723221E-01    2     1000022        11   # BR(~e_R -> ~chi_10 e-)
     8.06561107E-05    2     1000023        11   # BR(~e_R -> ~chi_20 e-)
     5.48196029E-01    2     1000025        11   # BR(~e_R -> ~chi_30 e-)
     9.38959809E-08    2     1000035        11   # BR(~e_R -> ~chi_40 e-)
#
#         PDG            Width
DECAY   1000013     2.79087191E+01   # smuon_L decays
#          BR         NDA      ID1       ID2
     8.75069545E-02    2     1000022        13   # BR(~mu_L -> ~chi_10 mu-)
     3.67607888E-07    2     1000023        13   # BR(~mu_L -> ~chi_20 mu-)
     1.31141167E-01    2     1000025        13   # BR(~mu_L -> ~chi_30 mu-)
     2.60020951E-01    2     1000035        13   # BR(~mu_L -> ~chi_40 mu-)
     8.65160704E-04    2    -1000024        14   # BR(~mu_L -> ~chi_1- nu_mu)
     5.20465399E-01    2    -1000037        14   # BR(~mu_L -> ~chi_2- nu_mu)
#
#         PDG            Width
DECAY   2000013     2.43065629E+01   # smuon_R decays
#          BR         NDA      ID1       ID2
     4.51723221E-01    2     1000022        13   # BR(~mu_R -> ~chi_10 mu-)
     8.06561107E-05    2     1000023        13   # BR(~mu_R -> ~chi_20 mu-)
     5.48196029E-01    2     1000025        13   # BR(~mu_R -> ~chi_30 mu-)
     9.38959809E-08    2     1000035        13   # BR(~mu_R -> ~chi_40 mu-)
#
#         PDG            Width
DECAY   1000015     2.61373255E+01   # stau_1 decays
#          BR         NDA      ID1       ID2
     2.67773242E-01    2     1000022        15   # BR(~tau_1 -> ~chi_10  tau-)
     4.44890592E-04    2     1000023        15   # BR(~tau_1 -> ~chi_20  tau-)
     3.24592854E-01    2     1000025        15   # BR(~tau_1 -> ~chi_30  tau-)
     1.34901752E-01    2     1000035        15   # BR(~tau_1 -> ~chi_40  tau-)
     2.12596885E-03    2    -1000024        16   # BR(~tau_1 -> ~chi_1-  nu_tau)
     2.70023648E-01    2    -1000037        16   # BR(~tau_1 -> ~chi_2-  nu_tau)
     1.37644129E-04    2     1000039        15   # BR(~tau_1 -> ~G       tau-)
#
#         PDG            Width
DECAY   2000015     2.61763315E+01   # stau_2 decays
#          BR         NDA      ID1       ID2
     2.46056971E-01    2     1000022        15   # BR(~tau_2 -> ~chi_10  tau-)
     8.36184942E-04    2     1000023        15   # BR(~tau_2 -> ~chi_20  tau-)
     3.25281634E-01    2     1000025        15   # BR(~tau_2 -> ~chi_30  tau-)
     1.42529353E-01    2     1000035        15   # BR(~tau_2 -> ~chi_40  tau-)
     6.10329313E-06    2    -1000024        16   # BR(~tau_2 -> ~chi_1-  nu_tau)
     2.85289753E-01    2    -1000037        16   # BR(~tau_2 -> ~chi_2-  nu_tau)
#
#         PDG            Width
DECAY   1000012     2.79076740E+01   # snu_eL decays
#          BR         NDA      ID1       ID2
     1.09835497E-01    2     1000022        12   # BR(~nu_eL -> ~chi_10 nu_e)
     6.04495707E-05    2     1000023        12   # BR(~nu_eL -> ~chi_20 nu_e)
     1.08132503E-01    2     1000025        12   # BR(~nu_eL -> ~chi_30 nu_e)
     2.60277598E-01    2     1000035        12   # BR(~nu_eL -> ~chi_40 nu_e)
     1.56109893E-03    2     1000024        11   # BR(~nu_eL -> ~chi_1+ e-)
     5.20132854E-01    2     1000037        11   # BR(~nu_eL -> ~chi_2+ e-)
#
#         PDG            Width
DECAY   1000014     2.79076740E+01   # snu_muL decays
#          BR         NDA      ID1       ID2
     1.09835497E-01    2     1000022        14   # BR(~nu_muL -> ~chi_10 nu_mu)
     6.04495707E-05    2     1000023        14   # BR(~nu_muL -> ~chi_20 nu_mu)
     1.08132503E-01    2     1000025        14   # BR(~nu_muL -> ~chi_30 nu_mu)
     2.60277598E-01    2     1000035        14   # BR(~nu_muL -> ~chi_40 nu_mu)
     1.56109893E-03    2     1000024        13   # BR(~nu_muL -> ~chi_1+ mu-)
     5.20132854E-01    2     1000037        13   # BR(~nu_muL -> ~chi_2+ mu-)
#
#         PDG            Width
DECAY   1000016     2.79392629E+01   # snu_tauL decays
#          BR         NDA      ID1       ID2
     1.09711314E-01    2     1000022        16   # BR(~nu_tauL -> ~chi_10 nu_tau)
     6.03812249E-05    2     1000023        16   # BR(~nu_tauL -> ~chi_20 nu_tau)
     1.08010246E-01    2     1000025        16   # BR(~nu_tauL -> ~chi_30 nu_tau)
     2.59983321E-01    2     1000035        16   # BR(~nu_tauL -> ~chi_40 nu_tau)
     2.68950190E-03    2     1000024        15   # BR(~nu_tauL -> ~chi_1+ tau-)
     5.19545236E-01    2     1000037        15   # BR(~nu_tauL -> ~chi_2+ tau-)
#
#         PDG            Width
DECAY   1000024     6.07543170E-05   # chargino1+ decays
#          BR         NDA      ID1       ID2
     2.20788711E-04    2     1000039        24   # BR(~chi_1+ -> ~G       W+)
#           BR         NDA      ID1       ID2       ID3
     3.33631055E-01    3     1000022         2        -1   # BR(~chi_1+ -> ~chi_10 u    db)
     3.33631055E-01    3     1000022         4        -3   # BR(~chi_1+ -> ~chi_10 c    sb)
     1.11210478E-01    3     1000022       -11        12   # BR(~chi_1+ -> ~chi_10 e+   nu_e)
     1.11210478E-01    3     1000022       -13        14   # BR(~chi_1+ -> ~chi_10 mu+  nu_mu)
     1.10096144E-01    3     1000022       -15        16   # BR(~chi_1+ -> ~chi_10 tau+ nu_tau)
#
#         PDG            Width
DECAY   1000037     3.50060667E+01   # chargino2+ decays
#          BR         NDA      ID1       ID2
     2.21829591E-01    2     1000024        23   # BR(~chi_2+ -> ~chi_1+  Z )
     1.12662146E-01    2     1000022        24   # BR(~chi_2+ -> ~chi_10  W+)
     2.16302356E-01    2     1000023        24   # BR(~chi_2+ -> ~chi_20  W+)
     1.03631800E-01    2     1000025        24   # BR(~chi_2+ -> ~chi_30  W+)
     2.22778035E-01    2     1000024        25   # BR(~chi_2+ -> ~chi_1+  h )
     3.05831176E-02    2     1000024        35   # BR(~chi_2+ -> ~chi_1+  H )
     3.08262602E-02    2     1000024        36   # BR(~chi_2+ -> ~chi_1+  A )
     1.79963314E-02    2     1000022        37   # BR(~chi_2+ -> ~chi_10  H+)
     3.05894539E-02    2     1000023        37   # BR(~chi_2+ -> ~chi_20  H+)
     1.27910725E-02    2     1000025        37   # BR(~chi_2+ -> ~chi_30  H+)
     9.83549713E-06    2     1000039        24   # BR(~chi_2+ -> ~G       W+)
     4.69065821E-10    2     1000039        37   # BR(~chi_2+ -> ~G       H+)
#
#         PDG            Width
DECAY   1000022    1.0E-05    # neutralino1 decays
#          BR         NDA      ID1       ID2
     5.00474427E-01    2     1000039        22   # BR(~chi_10 -> ~G        gam)
     4.89343720E-01    2     1000039        23   # BR(~chi_10 -> ~G        Z)
     1.01818524E-02    2     1000039        25   # BR(~chi_10 -> ~G        h)
#
#         PDG            Width
DECAY   1000023     6.56146618E-05   # neutralino2 decays
#          BR         NDA      ID1       ID2
     8.02006589E-04    2     1000022        22   # BR(~chi_20 -> ~chi_10 gam)
#          BR         NDA      ID1       ID2
     1.52511971E-08    2     1000039        22   # BR(~chi_20 -> ~G        gam)
     7.85762507E-06    2     1000039        23   # BR(~chi_20 -> ~G        Z)
     1.69795277E-04    2     1000039        25   # BR(~chi_20 -> ~G        h)
#           BR         NDA      ID1       ID2       ID3
     1.19102108E-01    3     1000022        -2         2   # BR(~chi_20 -> ~chi_10 ub      u)
     1.54182838E-01    3     1000022        -1         1   # BR(~chi_20 -> ~chi_10 db      d)
     1.19102108E-01    3     1000022        -4         4   # BR(~chi_20 -> ~chi_10 cb      c)
     1.54182838E-01    3     1000022        -3         3   # BR(~chi_20 -> ~chi_10 sb      s)
     1.36464895E-01    3     1000022        -5         5   # BR(~chi_20 -> ~chi_10 bb      b)
     3.51959773E-02    3     1000022       -11        11   # BR(~chi_20 -> ~chi_10 e+      e-)
     3.51959773E-02    3     1000022       -13        13   # BR(~chi_20 -> ~chi_10 mu+     mu-)
     3.47595133E-02    3     1000022       -15        15   # BR(~chi_20 -> ~chi_10 tau+    tau-)
     7.02772928E-02    3     1000022       -12        12   # BR(~chi_20 -> ~chi_10 nu_eb   nu_e)
     7.02772928E-02    3     1000022       -14        14   # BR(~chi_20 -> ~chi_10 nu_mub  nu_mu)
     7.02772928E-02    3     1000022       -16        16   # BR(~chi_20 -> ~chi_10 nu_taub nu_tau)
     4.08994070E-07    3     1000024        -2         1   # BR(~chi_20 -> ~chi_1+ ub      d)
     4.08994070E-07    3    -1000024        -1         2   # BR(~chi_20 -> ~chi_1- db      u)
     4.08994070E-07    3     1000024        -4         3   # BR(~chi_20 -> ~chi_1+ cb      s)
     4.08994070E-07    3    -1000024        -3         4   # BR(~chi_20 -> ~chi_1- sb      c)
     1.36331371E-07    3     1000024       -12        11   # BR(~chi_20 -> ~chi_1+ nu_eb   e-)
     1.36331371E-07    3    -1000024        12       -11   # BR(~chi_20 -> ~chi_1- nu_e    e+)
     1.36331371E-07    3     1000024       -14        13   # BR(~chi_20 -> ~chi_1+ nu_mub  mu-)
     1.36331371E-07    3    -1000024        14       -13   # BR(~chi_20 -> ~chi_1- nu_mu   mu+)
     4.81931154E-09    3     1000024       -16        15   # BR(~chi_20 -> ~chi_1+ nu_taub tau-)
     4.81931154E-09    3    -1000024        16       -15   # BR(~chi_20 -> ~chi_1- nu_tau  tau+)
#
#         PDG            Width
DECAY   1000025     3.73909798E-04   # neutralino3 decays
#          BR         NDA      ID1       ID2
     2.17022038E-04    2     1000022        22   # BR(~chi_30 -> ~chi_10 gam)
     5.22686268E-04    2     1000023        22   # BR(~chi_30 -> ~chi_20 gam)
#          BR         NDA      ID1       ID2
     5.54410992E-05    2     1000039        22   # BR(~chi_30 -> ~G        gam)
     3.83964723E-05    2     1000039        23   # BR(~chi_30 -> ~G        Z)
     9.43162478E-07    2     1000039        25   # BR(~chi_30 -> ~G        h)
#           BR         NDA      ID1       ID2       ID3
     3.22687278E-08    3     1000022        -2         2   # BR(~chi_30 -> ~chi_10 ub      u)
     3.09113627E-08    3     1000022        -1         1   # BR(~chi_30 -> ~chi_10 db      d)
     3.22687278E-08    3     1000022        -4         4   # BR(~chi_30 -> ~chi_10 cb      c)
     3.09113627E-08    3     1000022        -3         3   # BR(~chi_30 -> ~chi_10 sb      s)
     1.00602897E-06    3     1000022        -5         5   # BR(~chi_30 -> ~chi_10 bb      b)
     8.59936677E-08    3     1000022       -11        11   # BR(~chi_30 -> ~chi_10 e+      e-)
     8.59936677E-08    3     1000022       -13        13   # BR(~chi_30 -> ~chi_10 mu+     mu-)
     2.32213483E-07    3     1000022       -15        15   # BR(~chi_30 -> ~chi_10 tau+    tau-)
     4.30630767E-09    3     1000022       -12        12   # BR(~chi_30 -> ~chi_10 nu_eb   nu_e)
     4.30630767E-09    3     1000022       -14        14   # BR(~chi_30 -> ~chi_10 nu_mub  nu_mu)
     4.30630767E-09    3     1000022       -16        16   # BR(~chi_30 -> ~chi_10 nu_taub nu_tau)
     2.74998083E-02    3     1000023        -2         2   # BR(~chi_30 -> ~chi_20 ub      u)
     3.55998257E-02    3     1000023        -1         1   # BR(~chi_30 -> ~chi_20 db      d)
     2.74998083E-02    3     1000023        -4         4   # BR(~chi_30 -> ~chi_20 cb      c)
     3.55998257E-02    3     1000023        -3         3   # BR(~chi_30 -> ~chi_20 sb      s)
     3.21158537E-02    3     1000023        -5         5   # BR(~chi_30 -> ~chi_20 bb      b)
     8.12659971E-03    3     1000023       -11        11   # BR(~chi_30 -> ~chi_20 e+      e-)
     8.12659971E-03    3     1000023       -13        13   # BR(~chi_30 -> ~chi_20 mu+     mu-)
     8.03834635E-03    3     1000023       -15        15   # BR(~chi_30 -> ~chi_20 tau+    tau-)
     1.62264690E-02    3     1000023       -12        12   # BR(~chi_30 -> ~chi_20 nu_eb   nu_e)
     1.62264690E-02    3     1000023       -14        14   # BR(~chi_30 -> ~chi_20 nu_mub  nu_mu)
     1.62264690E-02    3     1000023       -16        16   # BR(~chi_30 -> ~chi_20 nu_taub nu_tau)
     1.28075307E-01    3     1000024        -2         1   # BR(~chi_30 -> ~chi_1+ ub      d)
     1.28075307E-01    3    -1000024        -1         2   # BR(~chi_30 -> ~chi_1- db      u)
     1.28075307E-01    3     1000024        -4         3   # BR(~chi_30 -> ~chi_1+ cb      s)
     1.28075307E-01    3    -1000024        -3         4   # BR(~chi_30 -> ~chi_1- sb      c)
     4.26916836E-02    3     1000024       -12        11   # BR(~chi_30 -> ~chi_1+ nu_eb   e-)
     4.26916836E-02    3    -1000024        12       -11   # BR(~chi_30 -> ~chi_1- nu_e    e+)
     4.26916836E-02    3     1000024       -14        13   # BR(~chi_30 -> ~chi_1+ nu_mub  mu-)
     4.26916836E-02    3    -1000024        14       -13   # BR(~chi_30 -> ~chi_1- nu_mu   mu+)
     4.24049615E-02    3     1000024       -16        15   # BR(~chi_30 -> ~chi_1+ nu_taub tau-)
     4.24049615E-02    3    -1000024        16       -15   # BR(~chi_30 -> ~chi_1- nu_tau  tau+)
#
#         PDG            Width
DECAY   1000035     3.50064618E+01   # neutralino4 decays
#          BR         NDA      ID1       ID2
     2.28585281E-03    2     1000022        23   # BR(~chi_40 -> ~chi_10   Z )
     2.17346056E-01    2     1000023        23   # BR(~chi_40 -> ~chi_20   Z )
     2.33152348E-03    2     1000025        23   # BR(~chi_40 -> ~chi_30   Z )
     2.16114035E-01    2     1000024       -24   # BR(~chi_40 -> ~chi_1+   W-)
     2.16114035E-01    2    -1000024        24   # BR(~chi_40 -> ~chi_1-   W+)
     1.13881344E-01    2     1000022        25   # BR(~chi_40 -> ~chi_10   h )
     1.89609217E-03    2     1000022        35   # BR(~chi_40 -> ~chi_10   H )
     1.60739905E-02    2     1000022        36   # BR(~chi_40 -> ~chi_10   A )
     4.60497553E-03    2     1000023        25   # BR(~chi_40 -> ~chi_20   h )
     2.72048314E-02    2     1000023        35   # BR(~chi_40 -> ~chi_20   H )
     3.30322338E-03    2     1000023        36   # BR(~chi_40 -> ~chi_20   A )
     1.04527526E-01    2     1000025        25   # BR(~chi_40 -> ~chi_30   h )
     1.35077362E-03    2     1000025        35   # BR(~chi_40 -> ~chi_30   H )
     1.14240692E-02    2     1000025        36   # BR(~chi_40 -> ~chi_30   A )
     3.07659175E-02    2     1000024       -37   # BR(~chi_40 -> ~chi_1+   H-)
     3.07659175E-02    2    -1000024        37   # BR(~chi_40 -> ~chi_1-   H+)
     2.36000016E-06    2     1000039        22   # BR(~chi_40 -> ~G        gam)
     7.47465924E-06    2     1000039        23   # BR(~chi_40 -> ~G        Z)
     4.80492167E-10    2     1000039        25   # BR(~chi_40 -> ~G        h)
     4.65774592E-10    2     1000039        35   # BR(~chi_40 -> ~G        H)
     1.43400444E-12    2     1000039        36   # BR(~chi_40 -> ~G        A)
#
#         PDG            Width
DECAY        25     4.21766868E-03   # h decays
#          BR         NDA      ID1       ID2
     6.01729128E-01    2           5        -5   # BR(h -> b       bb     )
     6.22503277E-02    2         -15        15   # BR(h -> tau+    tau-   )
     2.20339021E-04    2         -13        13   # BR(h -> mu+     mu-    )
     4.66194580E-04    2           3        -3   # BR(h -> s       sb     )
     2.01119320E-02    2           4        -4   # BR(h -> c       cb     )
     6.64196955E-02    2          21        21   # BR(h -> g       g      )
     2.31241218E-03    2          22        22   # BR(h -> gam     gam    )
     1.62676076E-03    2          22        23   # BR(h -> Z       gam    )
     2.16777666E-01    2          24       -24   # BR(h -> W+      W-     )
     2.80855446E-02    2          23        23   # BR(h -> Z       Z      )
#
#         PDG            Width
DECAY        35     3.99038358E+01   # H decays
#          BR         NDA      ID1       ID2
     1.39634524E-03    2           5        -5   # BR(H -> b       bb     )
     2.33520324E-04    2         -15        15   # BR(H -> tau+    tau-   )
     8.25581284E-07    2         -13        13   # BR(H -> mu+     mu-    )
     1.05702986E-06    2           3        -3   # BR(H -> s       sb     )
     9.53970468E-06    2           4        -4   # BR(H -> c       cb     )
     9.43915222E-01    2           6        -6   # BR(H -> t       tb     )
     7.55925386E-04    2          21        21   # BR(H -> g       g      )
     2.63728027E-06    2          22        22   # BR(H -> gam     gam    )
     1.09850921E-06    2          23        22   # BR(H -> Z       gam    )
     3.19306072E-04    2          24       -24   # BR(H -> W+      W-     )
     1.59217573E-04    2          23        23   # BR(H -> Z       Z      )
     8.57365376E-04    2          25        25   # BR(H -> h       h      )
     9.01477725E-24    2          36        36   # BR(H -> A       A      )
     3.63251948E-11    2          23        36   # BR(H -> Z       A      )
     3.43077498E-12    2          24       -37   # BR(H -> W+      H-     )
     3.43077498E-12    2         -24        37   # BR(H -> W-      H+     )
     5.65260284E-05    2     1000024  -1000024   # BR(H -> ~chi_1+ ~chi_1-)
     9.95153095E-04    2     1000022   1000022   # BR(H -> ~chi_10 ~chi_10)
     2.27665888E-05    2     1000023   1000023   # BR(H -> ~chi_20 ~chi_20)
     5.62230974E-04    2     1000025   1000025   # BR(H -> ~chi_30 ~chi_30)
     2.57944771E-02    2     1000022   1000023   # BR(H -> ~chi_10 ~chi_20)
     1.23733132E-05    2     1000022   1000025   # BR(H -> ~chi_10 ~chi_30)
     2.49044124E-02    2     1000023   1000025   # BR(H -> ~chi_20 ~chi_30)
#
#         PDG            Width
DECAY        36     4.03526849E+01   # A decays
#          BR         NDA      ID1       ID2
     1.39906007E-03    2           5        -5   # BR(A -> b       bb     )
     2.31117617E-04    2         -15        15   # BR(A -> tau+    tau-   )
     8.17084268E-07    2         -13        13   # BR(A -> mu+     mu-    )
     1.07720764E-06    2           3        -3   # BR(A -> s       sb     )
     9.43977397E-06    2           4        -4   # BR(A -> c       cb     )
     9.44753964E-01    2           6        -6   # BR(A -> t       tb     )
     8.94227576E-04    2          21        21   # BR(A -> g       g      )
     2.66894001E-06    2          22        22   # BR(A -> gam     gam    )
     1.28092773E-06    2          23        22   # BR(A -> Z       gam    )
     3.11088253E-04    2          23        25   # BR(A -> Z       h      )
     6.47386655E-04    2     1000024  -1000024   # BR(A -> ~chi_1+ ~chi_1-)
     2.86089999E-02    2     1000022   1000022   # BR(A -> ~chi_10 ~chi_10)
     1.16213735E-06    2     1000023   1000023   # BR(A -> ~chi_20 ~chi_20)
     2.15251900E-02    2     1000025   1000025   # BR(A -> ~chi_30 ~chi_30)
     6.62128251E-04    2     1000022   1000023   # BR(A -> ~chi_10 ~chi_20)
     1.08267314E-04    2     1000022   1000025   # BR(A -> ~chi_10 ~chi_30)
     8.42123763E-04    2     1000023   1000025   # BR(A -> ~chi_20 ~chi_30)
#
#         PDG            Width
DECAY        37     3.95431761E+01   # H+ decays
#          BR         NDA      ID1       ID2
     2.24458827E-06    2           4        -5   # BR(H+ -> c       bb     )
     2.36087004E-04    2         -15        16   # BR(H+ -> tau+    nu_tau )
     8.34652841E-07    2         -13        14   # BR(H+ -> mu+     nu_mu  )
     1.42707522E-08    2           2        -5   # BR(H+ -> u       bb     )
     5.16883894E-08    2           2        -3   # BR(H+ -> u       sb     )
     1.02991065E-05    2           4        -3   # BR(H+ -> c       sb     )
     9.46646939E-01    2           6        -5   # BR(H+ -> t       bb     )
     3.18872933E-04    2          24        25   # BR(H+ -> W+      h      )
     1.11475079E-12    2          24        36   # BR(H+ -> W+      A      )
     2.39303473E-02    2     1000024   1000022   # BR(H+ -> ~chi_1+ ~chi_10)
     1.46295555E-04    2     1000024   1000023   # BR(H+ -> ~chi_1+ ~chi_20)
     2.87080134E-02    2     1000024   1000025   # BR(H+ -> ~chi_1+ ~chi_30)
