#  ISAJET SUSY parameters in SUSY Les Houches Accord 2 format
#  Created by ISALHA 2.0 Last revision: H Baer 27 May 2014
Block SPINFO   # Program information
     1   ISASUGRA/ISASUSY from ISAJET   # Spectrum Calculator
     2   7.87   18-JUL-2017 13:55:55    # Version number
Block MODSEL   # Model selection
     1    13   # Non-universal supergravity model                  
Block SMINPUTS   # Standard Model inputs
     1     1.28000000E+02   # alpha_em^(-1)
     2     1.16570000E-05   # G_Fermi
     3     1.19999997E-01   # alpha_s(M_Z)
     4     9.11699982E+01   # m_{Z}(pole)
     5     4.19999981E+00   # m_{b}(m_{b})
     6     1.72500000E+02   # m_{top}(pole)
     7     1.77699995E+00   # m_{tau}(pole)
Block MINPAR   # SUSY breaking input parameters
     1     5.00000000E+03   # m_0
     2     5.00000000E+02   # m_{1/2}
     3     1.50000000E+01   # tan(beta)
     4     1.00000000E+00   # sign(mu)
     5    -8.00000000E+03   # A_0
Block EXTPAR   # Non-universal SUSY breaking parameters
     0     1.94118155E+16   # Input scale
    21     2.98210075E+06   # Down type Higgs mass squared
    22     3.76618240E+07   #  Up  type Higgs mass squared
Block MASS   # Scalar and gaugino mass spectrum
#  PDG code   mass                 particle
         6     1.72500000E+02   #  top            
        24     8.04229965E+01   #  W^+
        25     1.24338371E+02   #  h^0            
        35     1.00666571E+03   #  H^0            
        36     1.00000000E+03   #  A^0            
        37     1.00322870E+03   #  H^+            
   1000001     5.03147314E+03   #  dnl            
   1000002     5.03082813E+03   #  upl            
   1000003     5.03147314E+03   #  stl            
   1000004     5.03082813E+03   #  chl            
   1000005     3.52856177E+03   #  b1             
   1000006     1.46550439E+03   #  t1             
   1000011     5.08891406E+03   #  el-            
   1000012     5.09363574E+03   #  nuel           
   1000013     5.08891406E+03   #  mul-           
   1000014     5.09363574E+03   #  numl           
   1000015     4.66146338E+03   #  tau1           
   1000016     5.01846094E+03   #  nutl           
   1000021     1.36105835E+03   #  glss           
   1000022     1.73436859E+02   #  z1ss           
   1000023    -2.10722458E+02   #  z2ss           
   1000024     2.01037506E+02   #  w1ss           
   1000025     2.43190552E+02   #  z3ss           
   1000035     4.60443207E+02   #  z4ss           
   1000037     4.51028168E+02   #  w2ss           
   1000039     1.00000002E+20   #  gvss
   2000001     5.01413135E+03   #  dnr            
   2000002     5.18481445E+03   #  upr            
   2000003     5.01413135E+03   #  str            
   2000004     5.18481445E+03   #  chr            
   2000005     4.85575049E+03   #  b2             
   2000006     3.50392017E+03   #  t2             
   2000011     4.82227148E+03   #  er-            
   2000013     4.82227148E+03   #  mur-           
   2000015     5.01233252E+03   #  tau2           
Block ALPHA   # Effective Higgs mixing parameter
         -6.81056306E-02   # alpha
Block STOPMIX   # stop mixing matrix
  1  1     4.97270264E-02   # O_{11}
  1  2     9.98762846E-01   # O_{12}
  2  1    -9.98762846E-01   # O_{21}
  2  2     4.97270264E-02   # O_{22}
Block SBOTMIX   # sbottom mixing matrix
  1  1     9.99994040E-01   # O_{11}
  1  2     3.45077971E-03   # O_{12}
  2  1    -3.45077971E-03   # O_{21}
  2  2     9.99994040E-01   # O_{22}
Block STAUMIX   # stau mixing matrix
  1  1     8.20909254E-03   # O_{11}
  1  2     9.99966323E-01   # O_{12}
  2  1    -9.99966323E-01   # O_{21}
  2  2     8.20909254E-03   # O_{22}
Block NMIX   # neutralino mixing matrix
  1  1     4.95150506E-01   #
  1  2    -1.81971893E-01   #
  1  3     6.41512454E-01   #
  1  4    -5.56932569E-01   #
  2  1     6.50005043E-02   #
  2  2    -7.60629997E-02   #
  2  3    -6.92226589E-01   #
  2  4    -7.14710832E-01   #
  3  1    -8.65317583E-01   #
  3  2    -1.57632291E-01   #
  3  3     3.09326738E-01   #
  3  4    -3.61517251E-01   #
  4  1     4.27390672E-02   #
  4  2    -9.67601478E-01   #
  4  3    -1.16622627E-01   #
  4  4     2.19817638E-01   #
Block UMIX   # chargino U mixing matrix
  1  1    -1.62206963E-01   # U_{11}
  1  2     9.86756742E-01   # U_{12}
  2  1    -9.86756742E-01   # U_{21}
  2  2    -1.62206963E-01   # U_{22}
Block VMIX   # chargino V mixing matrix
  1  1    -3.05309147E-01   # V_{11}
  1  2     9.52253282E-01   # V_{12}
  2  1    -9.52253282E-01   # V_{21}
  2  2    -3.05309147E-01   # V_{22}
Block GAUGE Q=  2.28783252E+03   #
     1     3.57519180E-01   # g`
     2     6.52400792E-01   # g_2
     3     1.21959198E+00   # g_3
Block YU Q=  2.28783252E+03   #
  3  3     8.34838808E-01   # y_t
Block YD Q=  2.28783252E+03   #
  3  3     1.95057973E-01   # y_b
Block YE Q=  2.28783252E+03   #
  3  3     1.51315659E-01   # y_tau
Block HMIX Q=  2.28783252E+03   # Higgs mixing parameters
     1     2.00000000E+02   # mu(Q)
     2     1.43662472E+01   # tan(beta)(Q)
     3     2.52221664E+02   # Higgs vev at Q
     4     1.00000000E+06   # m_A^2(Q)
Block MSOFT Q=  2.28783252E+03   # DRbar SUSY breaking parameters
     1     2.23643860E+02   # M_1(Q)          
     2     4.11461243E+02   # M_2(Q)          
     3     1.14153430E+03   # M_3(Q)          
    21     9.30692625E+05   # MHd^2(Q)        
    22    -5.42186719E+04   # MHu^2(Q)        
    31     5.07271875E+03   # MeL(Q)          
    32     5.07271875E+03   # MmuL(Q)         
    33     4.99957275E+03   # MtauL(Q)        
    34     4.81870605E+03   # MeR(Q)          
    35     4.81870605E+03   # MmuR(Q)         
    36     4.65847314E+03   # MtauR(Q)        
    41     4.95612305E+03   # MqL1(Q)         
    42     4.95612305E+03   # MqL2(Q)         
    43     3.48525757E+03   # MqL3(Q)         
    44     5.10829248E+03   # MuR(Q)          
    45     5.10829248E+03   # McR(Q)          
    46     1.50180493E+03   # MtR(Q)          
    47     4.93925293E+03   # MdR(Q)          
    48     4.93925293E+03   # MsR(Q)          
    49     4.80321582E+03   # MbR(Q)          
Block AU Q=  2.28783252E+03   #
  1  1    -3.73422119E+03   # A_u
  2  2    -3.73422119E+03   # A_c
  3  3    -3.73422119E+03   # A_t
Block AD Q=  2.28783252E+03   #
  1  1    -8.02343311E+03   # A_d
  2  2    -8.02343311E+03   # A_s
  3  3    -8.02343311E+03   # A_b
Block AE Q=  2.28783252E+03   #
  1  1    -7.93641455E+03   # A_e
  2  2    -7.93641455E+03   # A_mu
  3  3    -7.93641455E+03   # A_tau
#  ISAJET decay tables in SUSY Les Houches accord format
#  Created by ISALHD. Last revision: C. Balazs, 2005 May 25
Block DCINFO                           # Program information
     1   ISASUGRA from ISAJET          # Spectrum Calculator
     2   7.87   18-JUL-2017 13:55:55   # Version number
#         PDG         Width
DECAY         6  1.46776152E+00   # TP    decays
#          BR          NDA       ID1       ID2       ID3       ID4
      3.33333313E-01    3            2        -1         5             # TP     -->  UP     DB     BT          
      3.33333313E-01    3            4        -3         5             # TP     -->  CH     SB     BT          
      1.11111097E-01    3          -11        12         5             # TP     -->  E+     NUE    BT          
      1.11111097E-01    3          -13        14         5             # TP     -->  MU+    NUM    BT          
      1.11111097E-01    3          -15        16         5             # TP     -->  TAU+   NUT    BT          
#         PDG         Width
DECAY   1000021  3.39204930E-02   # GLSS  decays
#          BR          NDA       ID1       ID2       ID3       ID4
      6.89832304E-05    3      1000024         1        -2             # GLSS   -->  W1SS+  DN     UB          
      6.89832304E-05    3     -1000024         2        -1             # GLSS   -->  W1SS-  UP     DB          
      6.89832304E-05    3      1000024         3        -4             # GLSS   -->  W1SS+  ST     CB          
      6.89832304E-05    3     -1000024         4        -3             # GLSS   -->  W1SS-  CH     SB          
      2.22372890E-01    3      1000024         5        -6             # GLSS   -->  W1SS+  BT     TB          
      2.22372890E-01    3     -1000024         6        -5             # GLSS   -->  W1SS-  TP     BB          
      6.77120348E-04    3      1000037         1        -2             # GLSS   -->  W2SS+  DN     UB          
      6.77120348E-04    3     -1000037         2        -1             # GLSS   -->  W2SS-  UP     DB          
      6.77120348E-04    3      1000037         3        -4             # GLSS   -->  W2SS+  ST     CB          
      6.77120348E-04    3     -1000037         4        -3             # GLSS   -->  W2SS-  CH     SB          
      1.70471575E-02    3      1000037         5        -6             # GLSS   -->  W2SS+  BT     TB          
      1.70471575E-02    3     -1000037         6        -5             # GLSS   -->  W2SS-  TP     BB          
      2.25931872E-03    2      1000022        21                       # GLSS   -->  Z1SS   GL                 
      7.58722963E-05    3      1000022         2        -2             # GLSS   -->  Z1SS   UP     UB          
      6.55644835E-05    3      1000022         1        -1             # GLSS   -->  Z1SS   DN     DB          
      6.55644835E-05    3      1000022         3        -3             # GLSS   -->  Z1SS   ST     SB          
      7.58722963E-05    3      1000022         4        -4             # GLSS   -->  Z1SS   CH     CB          
      5.21888607E-04    3      1000022         5        -5             # GLSS   -->  Z1SS   BT     BB          
      1.35366485E-01    3      1000022         6        -6             # GLSS   -->  Z1SS   TP     TB          
      4.67907730E-03    2      1000023        21                       # GLSS   -->  Z2SS   GL                 
      2.21097253E-06    3      1000023         2        -2             # GLSS   -->  Z2SS   UP     UB          
      3.00279930E-06    3      1000023         1        -1             # GLSS   -->  Z2SS   DN     DB          
      3.00279930E-06    3      1000023         3        -3             # GLSS   -->  Z2SS   ST     SB          
      2.21097253E-06    3      1000023         4        -4             # GLSS   -->  Z2SS   CH     CB          
      3.51331575E-04    3      1000023         5        -5             # GLSS   -->  Z2SS   BT     BB          
      2.13592872E-01    3      1000023         6        -6             # GLSS   -->  Z2SS   TP     TB          
      2.37774407E-03    2      1000025        21                       # GLSS   -->  Z3SS   GL                 
      2.59397028E-04    3      1000025         2        -2             # GLSS   -->  Z3SS   UP     UB          
      5.80939486E-05    3      1000025         1        -1             # GLSS   -->  Z3SS   DN     DB          
      5.80939486E-05    3      1000025         3        -3             # GLSS   -->  Z3SS   ST     SB          
      2.59397028E-04    3      1000025         4        -4             # GLSS   -->  Z3SS   CH     CB          
      1.31654655E-04    3      1000025         5        -5             # GLSS   -->  Z3SS   BT     BB          
      1.40371636E-01    3      1000025         6        -6             # GLSS   -->  Z3SS   TP     TB          
      3.28452472E-04    2      1000035        21                       # GLSS   -->  Z4SS   GL                 
      3.22407403E-04    3      1000035         2        -2             # GLSS   -->  Z4SS   UP     UB          
      3.32611817E-04    3      1000035         1        -1             # GLSS   -->  Z4SS   DN     DB          
      3.32611817E-04    3      1000035         3        -3             # GLSS   -->  Z4SS   ST     SB          
      3.22407403E-04    3      1000035         4        -4             # GLSS   -->  Z4SS   CH     CB          
      1.49403629E-03    3      1000035         5        -5             # GLSS   -->  Z4SS   BT     BB          
      1.44624067E-02    3      1000035         6        -6             # GLSS   -->  Z4SS   TP     TB          
#         PDG         Width
DECAY   1000002  2.90894409E+02   # UPL   decays
#          BR          NDA       ID1       ID2       ID3       ID4
      6.04803383E-04    2      1000022         2                       # UPL    -->  Z1SS   UP                 
      2.98568892E-04    2      1000023         2                       # UPL    -->  Z2SS   UP                 
      7.24286679E-03    2      1000025         2                       # UPL    -->  Z3SS   UP                 
      6.59394339E-02    2      1000035         2                       # UPL    -->  Z4SS   UP                 
      7.82476544E-01    2      1000021         2                       # UPL    -->  GLSS   UP                 
      1.35281291E-02    2      1000024         1                       # UPL    -->  W1SS+  DN                 
      1.29909694E-01    2      1000037         1                       # UPL    -->  W2SS+  DN                 
#         PDG         Width
DECAY   1000001  2.90897888E+02   # DNL   decays
#          BR          NDA       ID1       ID2       ID3       ID4
      5.40085696E-03    2      1000022         1                       # DNL    -->  Z1SS   DN                 
      5.61469700E-04    2      1000023         1                       # DNL    -->  Z2SS   DN                 
      5.86891602E-08    2      1000025         1                       # DNL    -->  Z3SS   DN                 
      6.81170225E-02    2      1000035         1                       # DNL    -->  Z4SS   DN                 
      7.82590389E-01    2      1000021         1                       # DNL    -->  GLSS   DN                 
      3.81898391E-03    2     -1000024         2                       # DNL    -->  W1SS-  UP                 
      1.39511198E-01    2     -1000037         2                       # DNL    -->  W2SS-  UP                 
#         PDG         Width
DECAY   1000003  2.90897888E+02   # STL   decays
#          BR          NDA       ID1       ID2       ID3       ID4
      5.40085696E-03    2      1000022         3                       # STL    -->  Z1SS   ST                 
      5.61469700E-04    2      1000023         3                       # STL    -->  Z2SS   ST                 
      5.86891602E-08    2      1000025         3                       # STL    -->  Z3SS   ST                 
      6.81170225E-02    2      1000035         3                       # STL    -->  Z4SS   ST                 
      7.82590389E-01    2      1000021         3                       # STL    -->  GLSS   ST                 
      3.81898368E-03    2     -1000024         4                       # STL    -->  W1SS-  CH                 
      1.39511183E-01    2     -1000037         4                       # STL    -->  W2SS-  CH                 
#         PDG         Width
DECAY   1000004  2.90894379E+02   # CHL   decays
#          BR          NDA       ID1       ID2       ID3       ID4
      6.04803325E-04    2      1000022         4                       # CHL    -->  Z1SS   CH                 
      2.98568833E-04    2      1000023         4                       # CHL    -->  Z2SS   CH                 
      7.24286633E-03    2      1000025         4                       # CHL    -->  Z3SS   CH                 
      6.59394413E-02    2      1000035         4                       # CHL    -->  Z4SS   CH                 
      7.82476544E-01    2      1000021         4                       # CHL    -->  GLSS   CH                 
      1.35281309E-02    2      1000024         3                       # CHL    -->  W1SS+  ST                 
      1.29909709E-01    2      1000037         3                       # CHL    -->  W2SS+  ST                 
#         PDG         Width
DECAY   1000005  2.71859589E+02   # BT1   decays
#          BR          NDA       ID1       ID2       ID3       ID4
      8.30725487E-03    2      1000022         5                       # BT1    -->  Z1SS   BT                 
      5.30679151E-03    2      1000023         5                       # BT1    -->  Z2SS   BT                 
      9.60288686E-04    2      1000025         5                       # BT1    -->  Z3SS   BT                 
      5.03456853E-02    2      1000035         5                       # BT1    -->  Z4SS   BT                 
      5.11326551E-01    2      1000021         5                       # BT1    -->  GLSS   BT                 
      1.57801062E-01    2     -1000024         6                       # BT1    -->  W1SS-  TP                 
      1.18947722E-01    2     -1000037         6                       # BT1    -->  W2SS-  TP                 
      1.46970674E-01    2          -24   1000006                       # BT1    -->  W-     TP1                
      3.40436891E-05    2          -37   1000006                       # BT1    -->  H-     TP1                
#         PDG         Width
DECAY   1000006  3.99197693E+01   # TP1   decays
#          BR          NDA       ID1       ID2       ID3       ID4
      1.65701166E-01    2      1000022         6                       # TP1    -->  Z1SS   TP                 
      2.36706778E-01    2      1000023         6                       # TP1    -->  Z2SS   TP                 
      1.17380761E-01    2      1000025         6                       # TP1    -->  Z3SS   TP                 
      1.43678691E-02    2      1000035         6                       # TP1    -->  Z4SS   TP                 
      4.37180877E-01    2      1000024         5                       # TP1    -->  W1SS+  BT                 
      2.86625847E-02    2      1000037         5                       # TP1    -->  W2SS+  BT                 
#         PDG         Width
DECAY   2000002  2.47806747E+02   # UPR   decays
#          BR          NDA       ID1       ID2       ID3       ID4
      1.15701314E-02    2      1000022         2                       # UPR    -->  Z1SS   UP                 
      1.99174567E-04    2      1000023         2                       # UPR    -->  Z2SS   UP                 
      3.52593586E-02    2      1000025         2                       # UPR    -->  Z3SS   UP                 
      8.50372307E-05    2      1000035         2                       # UPR    -->  Z4SS   UP                 
      9.52886283E-01    2      1000021         2                       # UPR    -->  GLSS   UP                 
#         PDG         Width
DECAY   2000001  2.29511902E+02   # DNR   decays
#          BR          NDA       ID1       ID2       ID3       ID4
      3.01982183E-03    2      1000022         1                       # DNR    -->  Z1SS   DN                 
      5.19810164E-05    2      1000023         1                       # DNR    -->  Z2SS   DN                 
      9.20136459E-03    2      1000025         1                       # DNR    -->  Z3SS   DN                 
      2.21738646E-05    2      1000035         1                       # DNR    -->  Z4SS   DN                 
      9.87704635E-01    2      1000021         1                       # DNR    -->  GLSS   DN                 
#         PDG         Width
DECAY   2000003  2.29511902E+02   # STR   decays
#          BR          NDA       ID1       ID2       ID3       ID4
      3.01982183E-03    2      1000022         3                       # STR    -->  Z1SS   ST                 
      5.19810164E-05    2      1000023         3                       # STR    -->  Z2SS   ST                 
      9.20136459E-03    2      1000025         3                       # STR    -->  Z3SS   ST                 
      2.21738646E-05    2      1000035         3                       # STR    -->  Z4SS   ST                 
      9.87704635E-01    2      1000021         3                       # STR    -->  GLSS   ST                 
#         PDG         Width
DECAY   2000004  2.47806717E+02   # CHR   decays
#          BR          NDA       ID1       ID2       ID3       ID4
      1.15701323E-02    2      1000022         4                       # CHR    -->  Z1SS   CH                 
      1.99174567E-04    2      1000023         4                       # CHR    -->  Z2SS   CH                 
      3.52593586E-02    2      1000025         4                       # CHR    -->  Z3SS   CH                 
      8.50372307E-05    2      1000035         4                       # CHR    -->  Z4SS   CH                 
      9.52886283E-01    2      1000021         4                       # CHR    -->  GLSS   CH                 
#         PDG         Width
DECAY   2000005  2.58768677E+02   # BT2   decays
#          BR          NDA       ID1       ID2       ID3       ID4
      8.63631163E-03    2      1000022         5                       # BT2    -->  Z1SS   BT                 
      7.17097800E-03    2      1000023         5                       # BT2    -->  Z2SS   BT                 
      9.34213493E-03    2      1000025         5                       # BT2    -->  Z3SS   BT                 
      2.45689560E-04    2      1000035         5                       # BT2    -->  Z4SS   BT                 
      8.41811240E-01    2      1000021         5                       # BT2    -->  GLSS   BT                 
      1.43626640E-02    2     -1000024         6                       # BT2    -->  W1SS-  TP                 
      4.38787480E-04    2     -1000037         6                       # BT2    -->  W2SS-  TP                 
      6.35947936E-06    2          -24   1000006                       # BT2    -->  W-     TP1                
      3.74536321E-04    2          -24   2000006                       # BT2    -->  W-     TP2                
      1.81262294E-04    2           23   1000005                       # BT2    -->  Z0     BT1                
      3.82360886E-04    2           25   1000005                       # BT2    -->  HL0    BT1                
      2.87945531E-02    2           36   1000005                       # BT2    -->  HA0    BT1                
      2.85279881E-02    2           35   1000005                       # BT2    -->  HH0    BT1                
      1.26296523E-04    2          -37   1000006                       # BT2    -->  H-     TP1                
      5.95988370E-02    2          -37   2000006                       # BT2    -->  H-     TP2                
#         PDG         Width
DECAY   2000006  2.79390015E+02   # TP2   decays
#          BR          NDA       ID1       ID2       ID3       ID4
      4.86450821E-01    2      1000021         6                       # TP2    -->  GLSS   TP                 
      1.59130488E-02    2      1000024         5                       # TP2    -->  W1SS+  BT                 
      9.63682532E-02    2      1000037         5                       # TP2    -->  W2SS+  BT                 
      7.00851753E-02    2           23   1000006                       # TP2    -->  Z0     TP1                
      1.13282882E-01    2           25   1000006                       # TP2    -->  HL0    TP1                
      2.06881759E-05    2           35   1000006                       # TP2    -->  HH0    TP1                
      1.66892605E-05    2           36   1000006                       # TP2    -->  HA0    TP1                
      4.94547337E-02    2      1000022         6                       # TP2    -->  Z1SS   TP                 
      8.38648900E-02    2      1000023         6                       # TP2    -->  Z2SS   TP                 
      2.76984163E-02    2      1000025         6                       # TP2    -->  Z3SS   TP                 
      5.68444058E-02    2      1000035         6                       # TP2    -->  Z4SS   TP                 
#         PDG         Width
DECAY   1000011  6.97261658E+01   # EL-   decays
#          BR          NDA       ID1       ID2       ID3       ID4
      2.49222643E-03    2      1000022        11                       # EL-    -->  Z1SS   E-                 
      4.98156296E-04    2      1000023        11                       # EL-    -->  Z2SS   E-                 
      1.22624479E-01    2      1000025        11                       # EL-    -->  Z3SS   E-                 
      2.69369036E-01    2      1000035        11                       # EL-    -->  Z4SS   E-                 
      1.61158722E-02    2     -1000024        12                       # EL-    -->  W1SS-  NUE                
      5.88900328E-01    2     -1000037        12                       # EL-    -->  W2SS-  NUE                
#         PDG         Width
DECAY   1000013  6.97261658E+01   # MUL-  decays
#          BR          NDA       ID1       ID2       ID3       ID4
      2.49222643E-03    2      1000022        13                       # MUL-   -->  Z1SS   MU-                
      4.98156296E-04    2      1000023        13                       # MUL-   -->  Z2SS   MU-                
      1.22624479E-01    2      1000025        13                       # MUL-   -->  Z3SS   MU-                
      2.69369036E-01    2      1000035        13                       # MUL-   -->  Z4SS   MU-                
      1.61158722E-02    2     -1000024        14                       # MUL-   -->  W1SS-  NUM                
      5.88900328E-01    2     -1000037        14                       # MUL-   -->  W2SS-  NUM                
#         PDG         Width
DECAY   1000015  2.80329170E+01   # TAU1- decays
#          BR          NDA       ID1       ID2       ID3       ID4
      2.40481570E-01    2      1000022        15                       # TAU1-  -->  Z1SS   TAU-               
      4.11535949E-02    2      1000023        15                       # TAU1-  -->  Z2SS   TAU-               
      6.37008846E-01    2      1000025        15                       # TAU1-  -->  Z3SS   TAU-               
      2.17651553E-03    2      1000035        15                       # TAU1-  -->  Z4SS   TAU-               
      7.78990462E-02    2     -1000024        16                       # TAU1-  -->  W1SS-  NUT                
      1.28052454E-03    2     -1000037        16                       # TAU1-  -->  W2SS-  NUT                
#         PDG         Width
DECAY   1000012  6.98155212E+01   # NUEL  decays
#          BR          NDA       ID1       ID2       ID3       ID4
      6.31852895E-02    2      1000022        12                       # NUEL   -->  Z1SS   NUE                
      3.82468360E-03    2      1000023        12                       # NUEL   -->  Z2SS   NUE                
      3.09074335E-02    2      1000025        12                       # NUEL   -->  Z3SS   NUE                
      2.96748817E-01    2      1000035        12                       # NUEL   -->  Z4SS   NUE                
      5.70746846E-02    2      1000024        11                       # NUEL   -->  W1SS+  E-                 
      5.48259079E-01    2      1000037        11                       # NUEL   -->  W2SS+  E-                 
#         PDG         Width
DECAY   1000014  6.98155212E+01   # NUML  decays
#          BR          NDA       ID1       ID2       ID3       ID4
      6.31852895E-02    2      1000022        14                       # NUML   -->  Z1SS   NUM                
      3.82468360E-03    2      1000023        14                       # NUML   -->  Z2SS   NUM                
      3.09074335E-02    2      1000025        14                       # NUML   -->  Z3SS   NUM                
      2.96748817E-01    2      1000035        14                       # NUML   -->  Z4SS   NUM                
      5.70746846E-02    2      1000024        13                       # NUML   -->  W1SS+  MU-                
      5.48259079E-01    2      1000037        13                       # NUML   -->  W2SS+  MU-                
#         PDG         Width
DECAY   1000016  7.11572113E+01   # NUTL  decays
#          BR          NDA       ID1       ID2       ID3       ID4
      6.10746928E-02    2      1000022        16                       # NUTL   -->  Z1SS   NUT                
      3.69680300E-03    2      1000023        16                       # NUTL   -->  Z2SS   NUT                
      2.98729949E-02    2      1000025        16                       # NUTL   -->  Z3SS   NUT                
      2.86713839E-01    2      1000035        16                       # NUTL   -->  Z4SS   NUT                
      8.78513008E-02    2      1000024        15                       # NUTL   -->  W1SS+  TAU-               
      5.30604184E-01    2      1000037        15                       # NUTL   -->  W2SS+  TAU-               
      1.86101417E-04    2           24   1000015                       # NUTL   -->  W+     TAU1-              
#         PDG         Width
DECAY   2000011  2.44172897E+01   # ER-   decays
#          BR          NDA       ID1       ID2       ID3       ID4
      2.45642334E-01    2      1000022        11                       # ER-    -->  Z1SS   E-                 
      4.22791531E-03    2      1000023        11                       # ER-    -->  Z2SS   E-                 
      7.48328209E-01    2      1000025        11                       # ER-    -->  Z3SS   E-                 
      1.80155609E-03    2      1000035        11                       # ER-    -->  Z4SS   E-                 
#         PDG         Width
DECAY   2000013  2.44172897E+01   # MUR-  decays
#          BR          NDA       ID1       ID2       ID3       ID4
      2.45642334E-01    2      1000022        13                       # MUR-   -->  Z1SS   MU-                
      4.22791531E-03    2      1000023        13                       # MUR-   -->  Z2SS   MU-                
      7.48328209E-01    2      1000025        13                       # MUR-   -->  Z3SS   MU-                
      1.80155609E-03    2      1000035        13                       # MUR-   -->  Z4SS   MU-                
#         PDG         Width
DECAY   2000015  7.10380173E+01   # TAU2- decays
#          BR          NDA       ID1       ID2       ID3       ID4
      1.57709103E-02    2      1000022        15                       # TAU2-  -->  Z1SS   TAU-               
      1.66962128E-02    2      1000023        15                       # TAU2-  -->  Z2SS   TAU-               
      1.21910095E-01    2      1000025        15                       # TAU2-  -->  Z3SS   TAU-               
      2.60904610E-01    2      1000035        15                       # TAU2-  -->  Z4SS   TAU-               
      1.52093116E-02    2     -1000024        16                       # TAU2-  -->  W1SS-  NUT                
      5.69376469E-01    2     -1000037        16                       # TAU2-  -->  W2SS-  NUT                
      8.74375328E-05    2           23   1000015                       # TAU2-  -->  Z0     TAU1-              
      4.50359112E-05    2           25   1000015                       # TAU2-  -->  HL0    TAU1-              
#         PDG         Width
DECAY   1000023  4.52433633E-05   # Z2SS  decays
#          BR          NDA       ID1       ID2       ID3       ID4
      1.11950247E-03    2      1000022        22                       # Z2SS   -->  Z1SS   GM                 
      7.28953630E-04    3     -1000024         2        -1             # Z2SS   -->  W1SS-  UP     DB          
      2.42984548E-04    3     -1000024        12       -11             # Z2SS   -->  W1SS-  NUE    E+          
      2.42984548E-04    3     -1000024        14       -13             # Z2SS   -->  W1SS-  NUM    MU+         
      7.28953630E-04    3      1000024         1        -2             # Z2SS   -->  W1SS+  DN     UB          
      2.42984548E-04    3      1000024        11       -12             # Z2SS   -->  W1SS+  E-     ANUE        
      2.42984548E-04    3      1000024        13       -14             # Z2SS   -->  W1SS+  MU-    ANUM        
      7.28953630E-04    3     -1000024         4        -3             # Z2SS   -->  W1SS-  CH     SB          
      2.42984548E-04    3     -1000024        16       -15             # Z2SS   -->  W1SS-  NUT    TAU+        
      7.28953630E-04    3      1000024         3        -4             # Z2SS   -->  W1SS+  ST     CB          
      2.42984548E-04    3      1000024        15       -16             # Z2SS   -->  W1SS+  TAU-   ANUT        
      1.20594271E-01    3      1000022         2        -2             # Z2SS   -->  Z1SS   UP     UB          
      1.55503213E-01    3      1000022         1        -1             # Z2SS   -->  Z1SS   DN     DB          
      1.55503213E-01    3      1000022         3        -3             # Z2SS   -->  Z1SS   ST     SB          
      1.20594271E-01    3      1000022         4        -4             # Z2SS   -->  Z1SS   CH     CB          
      1.27077863E-01    3      1000022         5        -5             # Z2SS   -->  Z1SS   BT     BB          
      3.52756865E-02    3      1000022        11       -11             # Z2SS   -->  Z1SS   E-     E+          
      3.52756865E-02    3      1000022        13       -13             # Z2SS   -->  Z1SS   MU-    MU+         
      3.41097862E-02    3      1000022        15       -15             # Z2SS   -->  Z1SS   TAU-   TAU+        
      7.01909140E-02    3      1000022        12       -12             # Z2SS   -->  Z1SS   NUE    ANUE        
      7.01909140E-02    3      1000022        14       -14             # Z2SS   -->  Z1SS   NUM    ANUM        
      7.01909736E-02    3      1000022        16       -16             # Z2SS   -->  Z1SS   NUT    ANUT        
#         PDG         Width
DECAY   1000025  9.94198563E-05   # Z3SS  decays
#          BR          NDA       ID1       ID2       ID3       ID4
      1.17622409E-03    2      1000022        22                       # Z3SS   -->  Z1SS   GM                 
      6.50906372E-07    2      1000023        22                       # Z3SS   -->  Z2SS   GM                 
      1.54064283E-01    3     -1000024         2        -1             # Z3SS   -->  W1SS-  UP     DB          
      5.13547622E-02    3     -1000024        12       -11             # Z3SS   -->  W1SS-  NUE    E+          
      5.13547622E-02    3     -1000024        14       -13             # Z3SS   -->  W1SS-  NUM    MU+         
      1.54064283E-01    3      1000024         1        -2             # Z3SS   -->  W1SS+  DN     UB          
      5.13547622E-02    3      1000024        11       -12             # Z3SS   -->  W1SS+  E-     ANUE        
      5.13547622E-02    3      1000024        13       -14             # Z3SS   -->  W1SS+  MU-    ANUM        
      1.54064283E-01    3     -1000024         4        -3             # Z3SS   -->  W1SS-  CH     SB          
      5.13547622E-02    3     -1000024        16       -15             # Z3SS   -->  W1SS-  NUT    TAU+        
      1.54064283E-01    3      1000024         3        -4             # Z3SS   -->  W1SS+  ST     CB          
      5.13547622E-02    3      1000024        15       -16             # Z3SS   -->  W1SS+  TAU-   ANUT        
      7.21997931E-05    3      1000022         2        -2             # Z3SS   -->  Z1SS   UP     UB          
      9.40894606E-05    3      1000022         1        -1             # Z3SS   -->  Z1SS   DN     DB          
      9.40894606E-05    3      1000022         3        -3             # Z3SS   -->  Z1SS   ST     SB          
      7.21997931E-05    3      1000022         4        -4             # Z3SS   -->  Z1SS   CH     CB          
      9.05949855E-05    3      1000022         5        -5             # Z3SS   -->  Z1SS   BT     BB          
      2.27677865E-05    3      1000022        11       -11             # Z3SS   -->  Z1SS   E-     E+          
      2.27677865E-05    3      1000022        13       -13             # Z3SS   -->  Z1SS   MU-    MU+         
      2.28077297E-05    3      1000022        15       -15             # Z3SS   -->  Z1SS   TAU-   TAU+        
      4.17299925E-05    3      1000022        12       -12             # Z3SS   -->  Z1SS   NUE    ANUE        
      4.17299925E-05    3      1000022        14       -14             # Z3SS   -->  Z1SS   NUM    ANUM        
      4.17095944E-05    3      1000022        16       -16             # Z3SS   -->  Z1SS   NUT    ANUT        
      9.02734883E-03    3      1000023         2        -2             # Z3SS   -->  Z2SS   UP     UB          
      1.16407368E-02    3      1000023         1        -1             # Z3SS   -->  Z2SS   DN     DB          
      1.16407368E-02    3      1000023         3        -3             # Z3SS   -->  Z2SS   ST     SB          
      9.02734883E-03    3      1000023         4        -4             # Z3SS   -->  Z2SS   CH     CB          
      8.91394075E-03    3      1000023         5        -5             # Z3SS   -->  Z2SS   BT     BB          
      2.64080428E-03    3      1000023        11       -11             # Z3SS   -->  Z2SS   E-     E+          
      2.64080428E-03    3      1000023        13       -13             # Z3SS   -->  Z2SS   MU-    MU+         
      2.52694427E-03    3      1000023        15       -15             # Z3SS   -->  Z2SS   TAU-   TAU+        
      5.25395619E-03    3      1000023        12       -12             # Z3SS   -->  Z2SS   NUE    ANUE        
      5.25395619E-03    3      1000023        14       -14             # Z3SS   -->  Z2SS   NUM    ANUM        
      5.25395060E-03    3      1000023        16       -16             # Z3SS   -->  Z2SS   NUT    ANUT        
#         PDG         Width
DECAY   1000035  3.12686586E+00   # Z4SS  decays
#          BR          NDA       ID1       ID2       ID3       ID4
      1.02209697E-06    2      1000022        22                       # Z4SS   -->  Z1SS   GM                 
      3.20477147E-06    2      1000023        22                       # Z4SS   -->  Z2SS   GM                 
      5.83319604E-07    2      1000025        22                       # Z4SS   -->  Z3SS   GM                 
      2.65983731E-01    2      1000024       -24                       # Z4SS   -->  W1SS+  W-                 
      2.65983731E-01    2     -1000024        24                       # Z4SS   -->  W1SS-  W+                 
      3.73923044E-08    3     -1000037         2        -1             # Z4SS   -->  W2SS-  UP     DB          
      1.24641018E-08    3     -1000037        12       -11             # Z4SS   -->  W2SS-  NUE    E+          
      1.24641018E-08    3     -1000037        14       -13             # Z4SS   -->  W2SS-  NUM    MU+         
      3.73923044E-08    3      1000037         1        -2             # Z4SS   -->  W2SS+  DN     UB          
      1.24641018E-08    3      1000037        11       -12             # Z4SS   -->  W2SS+  E-     ANUE        
      1.24641018E-08    3      1000037        13       -14             # Z4SS   -->  W2SS+  MU-    ANUM        
      3.73923044E-08    3     -1000037         4        -3             # Z4SS   -->  W2SS-  CH     SB          
      1.24641018E-08    3     -1000037        16       -15             # Z4SS   -->  W2SS-  NUT    TAU+        
      3.73923044E-08    3      1000037         3        -4             # Z4SS   -->  W2SS+  ST     CB          
      1.24641018E-08    3      1000037        15       -16             # Z4SS   -->  W2SS+  TAU-   ANUT        
      1.62806083E-02    2      1000022        23                       # Z4SS   -->  Z1SS   Z0                 
      2.38446578E-01    2      1000023        23                       # Z4SS   -->  Z2SS   Z0                 
      8.69385619E-03    2      1000025        23                       # Z4SS   -->  Z3SS   Z0                 
      5.78539924E-11    3      1000022         2        -2             # Z4SS   -->  Z1SS   UP     UB          
      5.25515020E-10    3      1000022         1        -1             # Z4SS   -->  Z1SS   DN     DB          
      5.25515020E-10    3      1000022         3        -3             # Z4SS   -->  Z1SS   ST     SB          
      5.78539924E-11    3      1000022         4        -4             # Z4SS   -->  Z1SS   CH     CB          
      2.28662600E-07    3      1000022         5        -5             # Z4SS   -->  Z1SS   BT     BB          
      1.90631087E-11    3      1000022        11       -11             # Z4SS   -->  Z1SS   E-     E+          
      1.90631087E-11    3      1000022        13       -13             # Z4SS   -->  Z1SS   MU-    MU+         
      4.35453522E-08    3      1000022        15       -15             # Z4SS   -->  Z1SS   TAU-   TAU+        
      4.77347661E-10    3      1000022        12       -12             # Z4SS   -->  Z1SS   NUE    ANUE        
      4.77347661E-10    3      1000022        14       -14             # Z4SS   -->  Z1SS   NUM    ANUM        
      5.06724829E-10    3      1000022        16       -16             # Z4SS   -->  Z1SS   NUT    ANUT        
      6.85695554E-12    3      1000023         2        -2             # Z4SS   -->  Z2SS   UP     UB          
      1.33038970E-11    3      1000023         1        -1             # Z4SS   -->  Z2SS   DN     DB          
      1.33038970E-11    3      1000023         3        -3             # Z4SS   -->  Z2SS   ST     SB          
      6.85695554E-12    3      1000023         4        -4             # Z4SS   -->  Z2SS   CH     CB          
      1.92889502E-07    3      1000023         5        -5             # Z4SS   -->  Z2SS   BT     BB          
      8.42526624E-13    3      1000023        11       -11             # Z4SS   -->  Z2SS   E-     E+          
      8.42526624E-13    3      1000023        13       -13             # Z4SS   -->  Z2SS   MU-    MU+         
      3.71803672E-08    3      1000023        15       -15             # Z4SS   -->  Z2SS   TAU-   TAU+        
      7.03650983E-12    3      1000023        12       -12             # Z4SS   -->  Z2SS   NUE    ANUE        
      7.03650983E-12    3      1000023        14       -14             # Z4SS   -->  Z2SS   NUM    ANUM        
      7.46991184E-12    3      1000023        16       -16             # Z4SS   -->  Z2SS   NUT    ANUT        
      2.54165106E-10    3      1000025         2        -2             # Z4SS   -->  Z3SS   UP     UB          
      7.08251478E-14    3      1000025         1        -1             # Z4SS   -->  Z3SS   DN     DB          
      7.08251478E-14    3      1000025         3        -3             # Z4SS   -->  Z3SS   ST     SB          
      2.54165106E-10    3      1000025         4        -4             # Z4SS   -->  Z3SS   CH     CB          
      2.49887897E-08    3      1000025         5        -5             # Z4SS   -->  Z3SS   BT     BB          
      3.15004106E-10    3      1000025        11       -11             # Z4SS   -->  Z3SS   E-     E+          
      3.15004106E-10    3      1000025        13       -13             # Z4SS   -->  Z3SS   MU-    MU+         
      5.18048671E-09    3      1000025        15       -15             # Z4SS   -->  Z3SS   TAU-   TAU+        
      8.65987490E-11    3      1000025        12       -12             # Z4SS   -->  Z3SS   NUE    ANUE        
      8.65987490E-11    3      1000025        14       -14             # Z4SS   -->  Z3SS   NUM    ANUM        
      9.19326837E-11    3      1000025        16       -16             # Z4SS   -->  Z3SS   NUT    ANUT        
      1.03158526E-01    2      1000022        25                       # Z4SS   -->  Z1SS   HL0                
      1.86024439E-02    2      1000023        25                       # Z4SS   -->  Z2SS   HL0                
      8.28449577E-02    2      1000025        25                       # Z4SS   -->  Z3SS   HL0                
#         PDG         Width
DECAY   1000024  1.49655780E-05   # W1SS+ decays
#          BR          NDA       ID1       ID2       ID3       ID4
      3.33331913E-01    3      1000022         2        -1             # W1SS+  -->  Z1SS   UP     DB          
      3.33331913E-01    3      1000022         4        -3             # W1SS+  -->  Z1SS   CH     SB          
      1.11111321E-01    3      1000022       -11        12             # W1SS+  -->  Z1SS   E+     NUE         
      1.11111321E-01    3      1000022       -13        14             # W1SS+  -->  Z1SS   MU+    NUM         
      1.11113474E-01    3      1000022       -15        16             # W1SS+  -->  Z1SS   TAU+   NUT         
#         PDG         Width
DECAY   1000037  2.96850729E+00   # W2SS+ decays
#          BR          NDA       ID1       ID2       ID3       ID4
      2.91300539E-10    3      1000022         2        -1             # W2SS+  -->  Z1SS   UP     DB          
      2.91300539E-10    3      1000022         4        -3             # W2SS+  -->  Z1SS   CH     SB          
      3.45093343E-10    3      1000022       -11        12             # W2SS+  -->  Z1SS   E+     NUE         
      3.45093343E-10    3      1000022       -13        14             # W2SS+  -->  Z1SS   MU+    NUM         
      4.56747173E-08    3      1000022       -15        16             # W2SS+  -->  Z1SS   TAU+   NUT         
      1.60394475E-01    2      1000022        24                       # W2SS+  -->  Z1SS   W+                 
      4.56362240E-11    3      1000023         2        -1             # W2SS+  -->  Z2SS   UP     DB          
      4.56362240E-11    3      1000023         4        -3             # W2SS+  -->  Z2SS   CH     SB          
      1.51302807E-11    3      1000023       -11        12             # W2SS+  -->  Z2SS   E+     NUE         
      1.51302807E-11    3      1000023       -13        14             # W2SS+  -->  Z2SS   MU+    NUM         
      3.04926040E-08    3      1000023       -15        16             # W2SS+  -->  Z2SS   TAU+   NUT         
      2.57993281E-01    2      1000023        24                       # W2SS+  -->  Z2SS   W+                 
      1.48157445E-10    3      1000025         2        -1             # W2SS+  -->  Z3SS   UP     DB          
      1.48157445E-10    3      1000025         4        -3             # W2SS+  -->  Z3SS   CH     SB          
      3.40237255E-10    3      1000025       -11        12             # W2SS+  -->  Z3SS   E+     NUE         
      3.40237255E-10    3      1000025       -13        14             # W2SS+  -->  Z3SS   MU+    NUM         
      5.46503554E-09    3      1000025       -15        16             # W2SS+  -->  Z3SS   TAU+   NUT         
      1.15637809E-01    2      1000025        24                       # W2SS+  -->  Z3SS   W+                 
      2.46874064E-01    2      1000024        23                       # W2SS+  -->  W1SS+  Z0                 
      5.60093694E-10    3      1000024         1        -1             # W2SS+  -->  W1SS+  DN     DB          
      5.60093694E-10    3      1000024         3        -3             # W2SS+  -->  W1SS+  ST     SB          
      1.69672554E-10    3      1000024         2        -2             # W2SS+  -->  W1SS+  UP     UB          
      1.69672554E-10    3      1000024         4        -4             # W2SS+  -->  W1SS+  CH     CB          
      5.40359528E-11    3      1000024        12       -12             # W2SS+  -->  W1SS+  NUE    ANUE        
      5.40359528E-11    3      1000024        14       -14             # W2SS+  -->  W1SS+  NUM    ANUM        
      7.68825004E-11    3      1000024        16       -16             # W2SS+  -->  W1SS+  NUT    ANUT        
      1.77619225E-10    3      1000024        11       -11             # W2SS+  -->  W1SS+  E-     E+          
      1.77619225E-10    3      1000024        13       -13             # W2SS+  -->  W1SS+  MU-    MU+         
      1.88553465E-10    3      1000024        15       -15             # W2SS+  -->  W1SS+  TAU-   TAU+        
      2.19100356E-01    2      1000024        25                       # W2SS+  -->  W1SS+  HL0                
#         PDG         Width
DECAY        25  3.83143499E-03   # HL0   decays
#          BR          NDA       ID1       ID2       ID3       ID4
      5.77217296E-09    2           11       -11                       # HL0    -->  E-     E+                 
      2.43710514E-04    2           13       -13                       # HL0    -->  MU-    MU+                
      6.97171986E-02    2           15       -15                       # HL0    -->  TAU-   TAU+               
      7.23625953E-06    2            1        -1                       # HL0    -->  DN     DB                 
      2.92381202E-03    2            3        -3                       # HL0    -->  ST     SB                 
      6.26415074E-01    2            5        -5                       # HL0    -->  BT     BB                 
      2.21170626E-06    2            2        -2                       # HL0    -->  UP     UB                 
      4.11416031E-02    2            4        -4                       # HL0    -->  CH     CB                 
      2.68256129E-03    2           22        22                       # HL0    -->  GM     GM                 
      5.25923669E-02    2           21        21                       # HL0    -->  GL     GL                 
      1.02311186E-02    3           24        11       -12             # HL0    -->  W+     E-     ANUE        
      1.02311186E-02    3           24        13       -14             # HL0    -->  W+     MU-    ANUM        
      1.02311186E-02    3           24        15       -16             # HL0    -->  W+     TAU-   ANUT        
      3.06933541E-02    3           24        -2         1             # HL0    -->  W+     UB     DN          
      3.06933541E-02    3           24        -4         3             # HL0    -->  W+     CB     ST          
      1.02311186E-02    3          -24       -11        12             # HL0    -->  W-     E+     NUE         
      1.02311186E-02    3          -24       -13        14             # HL0    -->  W-     MU+    NUM         
      1.02311186E-02    3          -24       -15        16             # HL0    -->  W-     TAU+   NUT         
      3.06933541E-02    3          -24         2        -1             # HL0    -->  W-     UP     DB          
      3.06933541E-02    3          -24         4        -3             # HL0    -->  W-     CH     SB          
      1.37562153E-03    3           23        12       -12             # HL0    -->  Z0     NUE    ANUE        
      1.37562153E-03    3           23        14       -14             # HL0    -->  Z0     NUM    ANUM        
      1.37562153E-03    3           23        16       -16             # HL0    -->  Z0     NUT    ANUT        
      6.92336471E-04    3           23        11       -11             # HL0    -->  Z0     E-     E+          
      6.92336471E-04    3           23        13       -13             # HL0    -->  Z0     MU-    MU+         
      6.92336471E-04    3           23        15       -15             # HL0    -->  Z0     TAU-   TAU+        
      2.37188605E-03    3           23         2        -2             # HL0    -->  Z0     UP     UB          
      2.37188605E-03    3           23         4        -4             # HL0    -->  Z0     CH     CB          
      3.05557367E-03    3           23         1        -1             # HL0    -->  Z0     DN     DB          
      3.05557367E-03    3           23         3        -3             # HL0    -->  Z0     ST     SB          
      3.05557367E-03    3           23         5        -5             # HL0    -->  Z0     BT     BB          
#         PDG         Width
DECAY        35  1.21180067E+01   # HH0   decays
#          BR          NDA       ID1       ID2       ID3       ID4
      3.17569882E-09    2           11       -11                       # HH0    -->  E-     E+                 
      1.34083719E-04    2           13       -13                       # HH0    -->  MU-    MU+                
      3.84029187E-02    2           15       -15                       # HH0    -->  TAU-   TAU+               
      3.89024535E-06    2            1        -1                       # HH0    -->  DN     DB                 
      1.57185597E-03    2            3        -3                       # HH0    -->  ST     SB                 
      2.36273140E-01    2            5        -5                       # HH0    -->  BT     BB                 
      2.57401565E-11    2            2        -2                       # HH0    -->  UP     UB                 
      3.62498469E-07    2            4        -4                       # HH0    -->  CH     CB                 
      1.65363085E-02    2            6        -6                       # HH0    -->  TP     TB                 
      4.64798035E-07    2           22        22                       # HH0    -->  GM     GM                 
      8.19575598E-06    2           21        21                       # HH0    -->  GL     GL                 
      6.23161832E-05    2           24       -24                       # HH0    -->  W+     W-                 
      3.16389269E-05    2           23        23                       # HH0    -->  Z0     Z0                 
      4.32578772E-02    2      1000022   1000022                       # HH0    -->  Z1SS   Z1SS               
      2.32359003E-02    2      1000022   1000023                       # HH0    -->  Z1SS   Z2SS               
      1.02738023E-03    2      1000022   1000025                       # HH0    -->  Z1SS   Z3SS               
      4.76570949E-02    2      1000022   1000035                       # HH0    -->  Z1SS   Z4SS               
      3.57727706E-03    2      1000023   1000023                       # HH0    -->  Z2SS   Z2SS               
      2.21832898E-02    2      1000023   1000025                       # HH0    -->  Z2SS   Z3SS               
      1.31154537E-01    2      1000023   1000035                       # HH0    -->  Z2SS   Z4SS               
      3.82761401E-03    2      1000025   1000025                       # HH0    -->  Z3SS   Z3SS               
      1.22904992E-02    2      1000025   1000035                       # HH0    -->  Z3SS   Z4SS               
      4.65443562E-04    2      1000035   1000035                       # HH0    -->  Z4SS   Z4SS               
      4.53359112E-02    2      1000024  -1000024                       # HH0    -->  W1SS+  W1SS-              
      1.09178224E-03    2      1000037  -1000037                       # HH0    -->  W2SS+  W2SS-              
      1.85827836E-01    2      1000024  -1000037                       # HH0    -->  W1SS+  W2SS-              
      1.85827836E-01    2     -1000024   1000037                       # HH0    -->  W1SS-  W2SS+              
      2.14649408E-04    2           25        25                       # HH0    -->  HL0    HL0                
#         PDG         Width
DECAY        36  1.19312143E+01   # HA0   decays
#          BR          NDA       ID1       ID2       ID3       ID4
      3.20472360E-09    2           11       -11                       # HA0    -->  E-     E+                 
      1.35309208E-04    2           13       -13                       # HA0    -->  MU-    MU+                
      3.87543887E-02    2           15       -15                       # HA0    -->  TAU-   TAU+               
      3.92601714E-06    2            1        -1                       # HA0    -->  DN     DB                 
      1.58630975E-03    2            3        -3                       # HA0    -->  ST     SB                 
      2.38456413E-01    2            5        -5                       # HA0    -->  BT     BB                 
      2.48138454E-11    2            2        -2                       # HA0    -->  UP     UB                 
      3.49728197E-07    2            4        -4                       # HA0    -->  CH     CB                 
      1.77204702E-02    2            6        -6                       # HA0    -->  TP     TB                 
      8.15440785E-07    2           22        22                       # HA0    -->  GM     GM                 
      2.60329962E-05    2           21        21                       # HA0    -->  GL     GL                 
      6.25762716E-02    2      1000022   1000022                       # HA0    -->  Z1SS   Z1SS               
      1.29897241E-02    2      1000022   1000023                       # HA0    -->  Z1SS   Z2SS               
      1.31332525E-03    2      1000022   1000025                       # HA0    -->  Z1SS   Z3SS               
      8.97255838E-02    2      1000022   1000035                       # HA0    -->  Z1SS   Z4SS               
      3.30762891E-03    2      1000023   1000023                       # HA0    -->  Z2SS   Z2SS               
      1.45719275E-02    2      1000023   1000025                       # HA0    -->  Z2SS   Z3SS               
      5.91728017E-02    2      1000023   1000035                       # HA0    -->  Z2SS   Z4SS               
      6.89887395E-03    2      1000025   1000025                       # HA0    -->  Z3SS   Z3SS               
      3.21557149E-02    2      1000025   1000035                       # HA0    -->  Z3SS   Z4SS               
      4.63568419E-03    2      1000035   1000035                       # HA0    -->  Z4SS   Z4SS               
      6.24357350E-02    2      1000024  -1000024                       # HA0    -->  W1SS+  W1SS-              
      9.23748408E-03    2      1000037  -1000037                       # HA0    -->  W2SS+  W2SS-              
      1.72117233E-01    2      1000024  -1000037                       # HA0    -->  W1SS+  W2SS-              
      1.72117233E-01    2     -1000024   1000037                       # HA0    -->  W1SS-  W2SS+              
      6.07181755E-05    2           25        23                       # HA0    -->  HL0    Z0                 
#         PDG         Width
DECAY        37  1.15305233E+01   # H+    decays
#          BR          NDA       ID1       ID2       ID3       ID4
      3.32679595E-09    2           12       -11                       # H+     -->  NUE    E+                 
      1.40463337E-04    2           14       -13                       # H+     -->  NUM    MU+                
      4.02305983E-02    2           16       -15                       # H+     -->  NUT    TAU+               
      3.74609499E-06    2            2        -1                       # H+     -->  UP     DB                 
      1.51393027E-03    2            4        -3                       # H+     -->  CH     SB                 
      2.30321124E-01    2            6        -5                       # H+     -->  TP     BB                 
      1.79238804E-02    2      1000024   1000022                       # H+     -->  W1SS+  Z1SS               
      1.23069463E-02    2      1000024   1000023                       # H+     -->  W1SS+  Z2SS               
      9.16040465E-02    2      1000024   1000025                       # H+     -->  W1SS+  Z3SS               
      1.89274132E-01    2      1000024   1000035                       # H+     -->  W1SS+  Z4SS               
      1.67417645E-01    2      1000037   1000022                       # H+     -->  W2SS+  Z1SS               
      1.91729739E-01    2      1000037   1000023                       # H+     -->  W2SS+  Z2SS               
      5.74618541E-02    2      1000037   1000025                       # H+     -->  W2SS+  Z3SS               
      8.90081446E-06    2      1000037   1000035                       # H+     -->  W2SS+  Z4SS               
      6.30068753E-05    2           25        24                       # H+     -->  HL0    W+                 
