#  ISAJET SUSY parameters in SUSY Les Houches Accord 2 format
#  Created by ISALHA 2.0 Last revision: H Baer 27 May 2014
Block SPINFO   # Program information
     1   ISASUGRA/ISASUSY from ISAJET   # Spectrum Calculator
     2   7.87   18-JUL-2017 13:55:55    # Version number
Block MODSEL   # Model selection
     1    13   # Non-universal supergravity model                  
Block SMINPUTS   # Standard Model inputs
     1     1.28000000E+02   # alpha_em^(-1)
     2     1.16570000E-05   # G_Fermi
     3     1.19999997E-01   # alpha_s(M_Z)
     4     9.11699982E+01   # m_{Z}(pole)
     5     4.19999981E+00   # m_{b}(m_{b})
     6     1.72500000E+02   # m_{top}(pole)
     7     1.77699995E+00   # m_{tau}(pole)
Block MINPAR   # SUSY breaking input parameters
     1     5.00000000E+03   # m_0
     2     8.00000000E+02   # m_{1/2}
     3     1.50000000E+01   # tan(beta)
     4     1.00000000E+00   # sign(mu)
     5    -8.00000000E+03   # A_0
Block EXTPAR   # Non-universal SUSY breaking parameters
     0     1.75916878E+16   # Input scale
    21     2.90738925E+06   # Down type Higgs mass squared
    22     3.90947320E+07   #  Up  type Higgs mass squared
Block MASS   # Scalar and gaugino mass spectrum
#  PDG code   mass                 particle
         6     1.72500000E+02   #  top            
        24     8.04229965E+01   #  W^+
        25     1.24580544E+02   #  h^0            
        35     1.00666681E+03   #  H^0            
        36     1.00000000E+03   #  A^0            
        37     1.00322870E+03   #  H^+            
   1000001     5.17195215E+03   #  dnl            
   1000002     5.17132520E+03   #  upl            
   1000003     5.17195215E+03   #  stl            
   1000004     5.17132520E+03   #  chl            
   1000005     3.65733398E+03   #  b1             
   1000006     1.59332251E+03   #  t1             
   1000011     5.10878076E+03   #  el-            
   1000012     5.11346924E+03   #  nuel           
   1000013     5.10878076E+03   #  mul-           
   1000014     5.11346924E+03   #  numl           
   1000015     4.65840430E+03   #  tau1           
   1000016     5.03833643E+03   #  nutl           
   1000021     2.00963904E+03   #  glss           
   1000022     1.43288040E+02   #  z1ss           
   1000023    -1.58784027E+02   #  z2ss           
   1000024     1.56137360E+02   #  w1ss           
   1000025     3.62754089E+02   #  z3ss           
   1000035     7.02383728E+02   #  z4ss           
   1000037     6.91095398E+02   #  w2ss           
   1000039     1.00000002E+20   #  gvss
   2000001     5.14100928E+03   #  dnr            
   2000002     5.31497559E+03   #  upr            
   2000003     5.14100928E+03   #  str            
   2000004     5.31497607E+03   #  chr            
   2000005     4.97314648E+03   #  b2             
   2000006     3.63250806E+03   #  t2             
   2000011     4.82069385E+03   #  er-            
   2000013     4.82069385E+03   #  mur-           
   2000015     5.03220508E+03   #  tau2           
Block ALPHA   # Effective Higgs mixing parameter
         -6.81212023E-02   # alpha
Block STOPMIX   # stop mixing matrix
  1  1     5.41944280E-02   # O_{11}
  1  2     9.98530388E-01   # O_{12}
  2  1    -9.98530388E-01   # O_{21}
  2  2     5.41944280E-02   # O_{22}
Block SBOTMIX   # sbottom mixing matrix
  1  1     9.99993861E-01   # O_{11}
  1  2     3.49817378E-03   # O_{12}
  2  1    -3.49817378E-03   # O_{21}
  2  2     9.99993861E-01   # O_{22}
Block STAUMIX   # stau mixing matrix
  1  1     7.78305205E-03   # O_{11}
  1  2     9.99969721E-01   # O_{12}
  2  1    -9.99969721E-01   # O_{21}
  2  2     7.78305205E-03   # O_{22}
Block NMIX   # neutralino mixing matrix
  1  1     1.42507002E-01   #
  1  2    -1.06604837E-01   #
  1  3     7.17069745E-01   #
  1  4    -6.73898041E-01   #
  2  1     5.48270941E-02   #
  2  2    -5.87462522E-02   #
  2  3    -6.92969322E-01   #
  2  4    -7.16475010E-01   #
  3  1     9.88119364E-01   #
  3  2     3.61929201E-02   #
  3  3    -6.42865598E-02   #
  3  4     1.34823978E-01   #
  4  1     1.74917392E-02   #
  4  2    -9.91904497E-01   #
  4  3    -3.83712165E-02   #
  4  4     1.19780473E-01   #
Block UMIX   # chargino U mixing matrix
  1  1    -5.16393781E-02   # U_{11}
  1  2     9.98665810E-01   # U_{12}
  2  1    -9.98665810E-01   # U_{21}
  2  2    -5.16393781E-02   # U_{22}
Block VMIX   # chargino V mixing matrix
  1  1    -1.66480824E-01   # V_{11}
  1  2     9.86044705E-01   # V_{12}
  2  1    -9.86044705E-01   # V_{21}
  2  2    -1.66480824E-01   # V_{22}
Block GAUGE Q=  2.40239087E+03   #
     1     3.57524544E-01   # g`
     2     6.52375877E-01   # g_2
     3     1.21924520E+00   # g_3
Block YU Q=  2.40239087E+03   #
  3  3     8.26936901E-01   # y_t
Block YD Q=  2.40239087E+03   #
  3  3     1.92870557E-01   # y_b
Block YE Q=  2.40239087E+03   #
  3  3     1.50918663E-01   # y_tau
Block HMIX Q=  2.40239087E+03   # Higgs mixing parameters
     1     1.50000000E+02   # mu(Q)
     2     1.43598413E+01   # tan(beta)(Q)
     3     2.52247894E+02   # Higgs vev at Q
     4     1.00000000E+06   # m_A^2(Q)
Block MSOFT Q=  2.40239087E+03   # DRbar SUSY breaking parameters
     1     3.55601257E+02   # M_1(Q)          
     2     6.51026733E+02   # M_2(Q)          
     3     1.74697571E+03   # M_3(Q)          
    21     9.47034875E+05   # MHd^2(Q)        
    22    -5.95676484E+04   # MHu^2(Q)        
    31     5.09235791E+03   # MeL(Q)          
    32     5.09235791E+03   # MmuL(Q)         
    33     5.01925635E+03   # MtauL(Q)        
    34     4.81709619E+03   # MeR(Q)          
    35     4.81709619E+03   # MmuR(Q)         
    36     4.65571924E+03   # MtauR(Q)        
    41     5.08181543E+03   # MqL1(Q)         
    42     5.08181543E+03   # MqL2(Q)         
    43     3.60351611E+03   # MqL3(Q)         
    44     5.22425293E+03   # MuR(Q)          
    45     5.22425293E+03   # McR(Q)          
    46     1.60162524E+03   # MtR(Q)          
    47     5.05137207E+03   # MdR(Q)          
    48     5.05137207E+03   # MsR(Q)          
    49     4.92010791E+03   # MbR(Q)          
Block AU Q=  2.40239087E+03   #
  1  1    -4.28035791E+03   # A_u
  2  2    -4.28035791E+03   # A_c
  3  3    -4.28035791E+03   # A_t
Block AD Q=  2.40239087E+03   #
  1  1    -8.71008789E+03   # A_d
  2  2    -8.71008789E+03   # A_s
  3  3    -8.71008789E+03   # A_b
Block AE Q=  2.40239087E+03   #
  1  1    -8.10553027E+03   # A_e
  2  2    -8.10553027E+03   # A_mu
  3  3    -8.10553027E+03   # A_tau
#  ISAJET decay tables in SUSY Les Houches accord format
#  Created by ISALHD. Last revision: C. Balazs, 2005 May 25
Block DCINFO                           # Program information
     1   ISASUGRA from ISAJET          # Spectrum Calculator
     2   7.87   18-JUL-2017 13:55:55   # Version number
#         PDG         Width
DECAY         6  1.46776152E+00   # TP    decays
#          BR          NDA       ID1       ID2       ID3       ID4
      3.33333313E-01    3            2        -1         5             # TP     -->  UP     DB     BT          
      3.33333313E-01    3            4        -3         5             # TP     -->  CH     SB     BT          
      1.11111097E-01    3          -11        12         5             # TP     -->  E+     NUE    BT          
      1.11111097E-01    3          -13        14         5             # TP     -->  MU+    NUM    BT          
      1.11111097E-01    3          -15        16         5             # TP     -->  TAU+   NUT    BT          
#         PDG         Width
DECAY   1000021  5.25847244E+00   # GLSS  decays
#          BR          NDA       ID1       ID2       ID3       ID4
      7.42982536E-07    3      1000024         1        -2             # GLSS   -->  W1SS+  DN     UB          
      7.42982536E-07    3     -1000024         2        -1             # GLSS   -->  W1SS-  UP     DB          
      7.42982536E-07    3      1000024         3        -4             # GLSS   -->  W1SS+  ST     CB          
      7.42982536E-07    3     -1000024         4        -3             # GLSS   -->  W1SS-  CH     SB          
      1.63605291E-04    3      1000024         5        -6             # GLSS   -->  W1SS+  BT     TB          
      1.63605291E-04    3     -1000024         6        -5             # GLSS   -->  W1SS-  TP     BB          
      2.84375128E-05    3      1000037         1        -2             # GLSS   -->  W2SS+  DN     UB          
      2.84375128E-05    3     -1000037         2        -1             # GLSS   -->  W2SS-  UP     DB          
      2.84375128E-05    3      1000037         3        -4             # GLSS   -->  W2SS+  ST     CB          
      2.84375128E-05    3     -1000037         4        -3             # GLSS   -->  W2SS-  CH     SB          
      1.37721916E-04    3      1000037         5        -6             # GLSS   -->  W2SS+  BT     TB          
      1.37721916E-04    3     -1000037         6        -5             # GLSS   -->  W2SS-  TP     BB          
      2.86758836E-06    2      1000022        21                       # GLSS   -->  Z1SS   GL                 
      4.16709611E-07    3      1000022         2        -2             # GLSS   -->  Z1SS   UP     UB          
      5.25198686E-07    3      1000022         1        -1             # GLSS   -->  Z1SS   DN     DB          
      5.25198686E-07    3      1000022         3        -3             # GLSS   -->  Z1SS   ST     SB          
      4.16709526E-07    3      1000022         4        -4             # GLSS   -->  Z1SS   CH     CB          
      1.97276713E-05    3      1000022         5        -5             # GLSS   -->  Z1SS   BT     BB          
      1.38802774E-04    3      1000022         6        -6             # GLSS   -->  Z1SS   TP     TB          
      3.17634954E-06    2      1000023        21                       # GLSS   -->  Z2SS   GL                 
      7.45017203E-08    3      1000023         2        -2             # GLSS   -->  Z2SS   UP     UB          
      1.00646631E-07    3      1000023         1        -1             # GLSS   -->  Z2SS   DN     DB          
      1.00646631E-07    3      1000023         3        -3             # GLSS   -->  Z2SS   ST     SB          
      7.45017132E-08    3      1000023         4        -4             # GLSS   -->  Z2SS   CH     CB          
      1.68111583E-05    3      1000023         5        -5             # GLSS   -->  Z2SS   BT     BB          
      1.55384667E-04    3      1000023         6        -6             # GLSS   -->  Z2SS   TP     TB          
      7.42390904E-13    2      1000025        21                       # GLSS   -->  Z3SS   GL                 
      1.22073798E-05    3      1000025         2        -2             # GLSS   -->  Z3SS   UP     UB          
      3.69292457E-06    3      1000025         1        -1             # GLSS   -->  Z3SS   DN     DB          
      3.69292457E-06    3      1000025         3        -3             # GLSS   -->  Z3SS   ST     SB          
      1.22073743E-05    3      1000025         4        -4             # GLSS   -->  Z3SS   CH     CB          
      6.12422582E-06    3      1000025         5        -5             # GLSS   -->  Z3SS   BT     BB          
      7.98840483E-06    3      1000025         6        -6             # GLSS   -->  Z3SS   TP     TB          
      8.48728661E-08    2      1000035        21                       # GLSS   -->  Z4SS   GL                 
      1.37743173E-05    3      1000035         2        -2             # GLSS   -->  Z4SS   UP     UB          
      1.39446738E-05    3      1000035         1        -1             # GLSS   -->  Z4SS   DN     DB          
      1.39446738E-05    3      1000035         3        -3             # GLSS   -->  Z4SS   ST     SB          
      1.37743173E-05    3      1000035         4        -4             # GLSS   -->  Z4SS   CH     CB          
      6.63103710E-05    3      1000035         5        -5             # GLSS   -->  Z4SS   BT     BB          
      6.79238146E-05    3      1000035         6        -6             # GLSS   -->  Z4SS   TP     TB          
      4.99352992E-01    2     -1000006         6                       # GLSS   -->  TB1    TP                 
      4.99352992E-01    2      1000006        -6                       # GLSS   -->  TP1    TB                 
#         PDG         Width
DECAY   1000002  2.59600281E+02   # UPL   decays
#          BR          NDA       ID1       ID2       ID3       ID4
      5.42495633E-04    2      1000022         2                       # UPL    -->  Z1SS   UP                 
      1.98506619E-04    2      1000023         2                       # UPL    -->  Z2SS   UP                 
      3.91775323E-03    2      1000025         2                       # UPL    -->  Z3SS   UP                 
      7.89704397E-02    2      1000035         2                       # UPL    -->  Z4SS   UP                 
      7.54449308E-01    2      1000021         2                       # UPL    -->  GLSS   UP                 
      4.63954173E-03    2      1000024         1                       # UPL    -->  W1SS+  DN                 
      1.57282025E-01    2      1000037         1                       # UPL    -->  W2SS+  DN                 
#         PDG         Width
DECAY   1000001  2.59605530E+02   # DNL   decays
#          BR          NDA       ID1       ID2       ID3       ID4
      1.47473323E-03    2      1000022         1                       # DNL    -->  Z1SS   DN                 
      3.96092277E-04    2      1000023         1                       # DNL    -->  Z2SS   DN                 
      1.74193142E-03    2      1000025         1                       # DNL    -->  Z3SS   DN                 
      8.00063983E-02    2      1000035         1                       # DNL    -->  Z4SS   DN                 
      7.54582584E-01    2      1000021         1                       # DNL    -->  GLSS   DN                 
      4.46429302E-04    2     -1000024         2                       # DNL    -->  W1SS-  UP                 
      1.61351860E-01    2     -1000037         2                       # DNL    -->  W2SS-  UP                 
#         PDG         Width
DECAY   1000003  2.59605530E+02   # STL   decays
#          BR          NDA       ID1       ID2       ID3       ID4
      1.47473323E-03    2      1000022         3                       # STL    -->  Z1SS   ST                 
      3.96092277E-04    2      1000023         3                       # STL    -->  Z2SS   ST                 
      1.74193142E-03    2      1000025         3                       # STL    -->  Z3SS   ST                 
      8.00063983E-02    2      1000035         3                       # STL    -->  Z4SS   ST                 
      7.54582584E-01    2      1000021         3                       # STL    -->  GLSS   ST                 
      4.46429243E-04    2     -1000024         4                       # STL    -->  W1SS-  CH                 
      1.61351845E-01    2     -1000037         4                       # STL    -->  W2SS-  CH                 
#         PDG         Width
DECAY   1000004  2.59600250E+02   # CHL   decays
#          BR          NDA       ID1       ID2       ID3       ID4
      5.42495633E-04    2      1000022         4                       # CHL    -->  Z1SS   CH                 
      1.98506590E-04    2      1000023         4                       # CHL    -->  Z2SS   CH                 
      3.91775323E-03    2      1000025         4                       # CHL    -->  Z3SS   CH                 
      7.89704397E-02    2      1000035         4                       # CHL    -->  Z4SS   CH                 
      7.54449248E-01    2      1000021         4                       # CHL    -->  GLSS   CH                 
      4.63954220E-03    2      1000024         3                       # CHL    -->  W1SS+  ST                 
      1.57282054E-01    2      1000037         3                       # CHL    -->  W2SS+  ST                 
#         PDG         Width
DECAY   1000005  2.39929703E+02   # BT1   decays
#          BR          NDA       ID1       ID2       ID3       ID4
      7.21575273E-03    2      1000022         5                       # BT1    -->  Z1SS   BT                 
      5.94981620E-03    2      1000023         5                       # BT1    -->  Z2SS   BT                 
      1.36166217E-03    2      1000025         5                       # BT1    -->  Z3SS   BT                 
      5.89470156E-02    2      1000035         5                       # BT1    -->  Z4SS   BT                 
      4.02563155E-01    2      1000021         5                       # BT1    -->  GLSS   BT                 
      1.92498446E-01    2     -1000024         6                       # BT1    -->  W1SS-  TP                 
      1.24449790E-01    2     -1000037         6                       # BT1    -->  W2SS-  TP                 
      2.06734180E-01    2          -24   1000006                       # BT1    -->  W-     TP1                
      2.80120963E-04    2          -37   1000006                       # BT1    -->  H-     TP1                
#         PDG         Width
DECAY   1000006  4.34740334E+01   # TP1   decays
#          BR          NDA       ID1       ID2       ID3       ID4
      2.12997869E-01    2      1000022         6                       # TP1    -->  Z1SS   TP                 
      2.38318041E-01    2      1000023         6                       # TP1    -->  Z2SS   TP                 
      7.90318176E-02    2      1000025         6                       # TP1    -->  Z3SS   TP                 
      2.39121099E-03    2      1000035         6                       # TP1    -->  Z4SS   TP                 
      4.62455034E-01    2      1000024         5                       # TP1    -->  W1SS+  BT                 
      4.80601890E-03    2      1000037         5                       # TP1    -->  W2SS+  BT                 
#         PDG         Width
DECAY   2000002  2.16545547E+02   # UPR   decays
#          BR          NDA       ID1       ID2       ID3       ID4
      1.12514687E-03    2      1000022         2                       # UPR    -->  Z1SS   UP                 
      1.66488098E-04    2      1000023         2                       # UPR    -->  Z2SS   UP                 
      5.36700003E-02    2      1000025         2                       # UPR    -->  Z3SS   UP                 
      1.63881959E-05    2      1000035         2                       # UPR    -->  Z4SS   UP                 
      9.45021987E-01    2      1000021         2                       # UPR    -->  GLSS   UP                 
#         PDG         Width
DECAY   2000001  1.96865814E+02   # DNR   decays
#          BR          NDA       ID1       ID2       ID3       ID4
      2.99248379E-04    2      1000022         1                       # DNR    -->  Z1SS   DN                 
      4.42788078E-05    2      1000023         1                       # DNR    -->  Z2SS   DN                 
      1.42665124E-02    2      1000025         1                       # DNR    -->  Z3SS   DN                 
      4.34844605E-06    2      1000035         1                       # DNR    -->  Z4SS   DN                 
      9.85385597E-01    2      1000021         1                       # DNR    -->  GLSS   DN                 
#         PDG         Width
DECAY   2000003  1.96865814E+02   # STR   decays
#          BR          NDA       ID1       ID2       ID3       ID4
      2.99248379E-04    2      1000022         3                       # STR    -->  Z1SS   ST                 
      4.42788078E-05    2      1000023         3                       # STR    -->  Z2SS   ST                 
      1.42665124E-02    2      1000025         3                       # STR    -->  Z3SS   ST                 
      4.34844605E-06    2      1000035         3                       # STR    -->  Z4SS   ST                 
      9.85385597E-01    2      1000021         3                       # STR    -->  GLSS   ST                 
#         PDG         Width
DECAY   2000004  2.16545547E+02   # CHR   decays
#          BR          NDA       ID1       ID2       ID3       ID4
      1.12514687E-03    2      1000022         4                       # CHR    -->  Z1SS   CH                 
      1.66488098E-04    2      1000023         4                       # CHR    -->  Z2SS   CH                 
      5.36699928E-02    2      1000025         4                       # CHR    -->  Z3SS   CH                 
      1.63881978E-05    2      1000035         4                       # CHR    -->  Z4SS   CH                 
      9.45021987E-01    2      1000021         4                       # CHR    -->  GLSS   CH                 
#         PDG         Width
DECAY   2000005  2.27890411E+02   # BT2   decays
#          BR          NDA       ID1       ID2       ID3       ID4
      8.90721288E-03    2      1000022         5                       # BT2    -->  Z1SS   BT                 
      8.17009434E-03    2      1000023         5                       # BT2    -->  Z2SS   BT                 
      1.19919693E-02    2      1000025         5                       # BT2    -->  Z3SS   BT                 
      3.88366752E-05    2      1000035         5                       # BT2    -->  Z4SS   BT                 
      8.05519342E-01    2      1000021         5                       # BT2    -->  GLSS   BT                 
      1.68011598E-02    2     -1000024         6                       # BT2    -->  W1SS-  TP                 
      6.49250724E-05    2     -1000037         6                       # BT2    -->  W2SS-  TP                 
      9.11244933E-06    2          -24   1000006                       # BT2    -->  W-     TP1                
      4.32631699E-04    2          -24   2000006                       # BT2    -->  W-     TP2                
      2.09244390E-04    2           23   1000005                       # BT2    -->  Z0     BT1                
      4.09076340E-04    2           25   1000005                       # BT2    -->  HL0    BT1                
      3.62358019E-02    2           36   1000005                       # BT2    -->  HA0    BT1                
      3.58880349E-02    2           35   1000005                       # BT2    -->  HH0    BT1                
      2.41936592E-04    2          -37   1000006                       # BT2    -->  H-     TP1                
      7.50806257E-02    2          -37   2000006                       # BT2    -->  H-     TP2                
#         PDG         Width
DECAY   2000006  2.49641281E+02   # TP2   decays
#          BR          NDA       ID1       ID2       ID3       ID4
      3.73311073E-01    2      1000021         6                       # TP2    -->  GLSS   TP                 
      1.23988045E-02    2      1000024         5                       # TP2    -->  W1SS+  BT                 
      1.12875894E-01    2      1000037         5                       # TP2    -->  W2SS+  BT                 
      9.73076820E-02    2           23   1000006                       # TP2    -->  Z0     TP1                
      1.56592101E-01    2           25   1000006                       # TP2    -->  HL0    TP1                
      1.46968974E-04    2           35   1000006                       # TP2    -->  HH0    TP1                
      1.35146940E-04    2           36   1000006                       # TP2    -->  HA0    TP1                
      8.46835673E-02    2      1000022         6                       # TP2    -->  Z1SS   TP                 
      9.62435082E-02    2      1000023         6                       # TP2    -->  Z2SS   TP                 
      6.99183112E-03    2      1000025         6                       # TP2    -->  Z3SS   TP                 
      5.93133904E-02    2      1000035         6                       # TP2    -->  Z4SS   TP                 
#         PDG         Width
DECAY   1000011  6.86042480E+01   # EL-   decays
#          BR          NDA       ID1       ID2       ID3       ID4
      2.50295736E-04    2      1000022        11                       # EL-    -->  Z1SS   E-                 
      2.56117462E-04    2      1000023        11                       # EL-    -->  Z2SS   E-                 
      1.04128882E-01    2      1000025        11                       # EL-    -->  Z3SS   E-                 
      2.91127294E-01    2      1000035        11                       # EL-    -->  Z4SS   E-                 
      1.66862458E-03    2     -1000024        12                       # EL-    -->  W1SS-  NUE                
      6.02568746E-01    2     -1000037        12                       # EL-    -->  W2SS-  NUE                
#         PDG         Width
DECAY   1000013  6.86042480E+01   # MUL-  decays
#          BR          NDA       ID1       ID2       ID3       ID4
      2.50295736E-04    2      1000022        13                       # MUL-   -->  Z1SS   MU-                
      2.56117462E-04    2      1000023        13                       # MUL-   -->  Z2SS   MU-                
      1.04128882E-01    2      1000025        13                       # MUL-   -->  Z3SS   MU-                
      2.91127294E-01    2      1000035        13                       # MUL-   -->  Z4SS   MU-                
      1.66862458E-03    2     -1000024        14                       # MUL-   -->  W1SS-  NUM                
      6.02568746E-01    2     -1000037        14                       # MUL-   -->  W2SS-  NUM                
#         PDG         Width
DECAY   1000015  2.78325787E+01   # TAU1- decays
#          BR          NDA       ID1       ID2       ID3       ID4
      5.85584566E-02    2      1000022        15                       # TAU1-  -->  Z1SS   TAU-               
      4.04293388E-02    2      1000023        15                       # TAU1-  -->  Z2SS   TAU-               
      8.21314573E-01    2      1000025        15                       # TAU1-  -->  Z3SS   TAU-               
      2.64689705E-04    2      1000035        15                       # TAU1-  -->  Z4SS   TAU-               
      7.94058070E-02    2     -1000024        16                       # TAU1-  -->  W1SS-  NUT                
      2.72356483E-05    2     -1000037        16                       # TAU1-  -->  W2SS-  NUT                
#         PDG         Width
DECAY   1000012  6.86934967E+01   # NUEL  decays
#          BR          NDA       ID1       ID2       ID3       ID4
      1.06989946E-02    2      1000022        12                       # NUEL   -->  Z1SS   NUE                
      2.47050682E-03    2      1000023        12                       # NUEL   -->  Z2SS   NUE                
      7.97024146E-02    2      1000025        12                       # NUEL   -->  Z3SS   NUE                
      3.02541643E-01    2      1000035        12                       # NUEL   -->  Z4SS   NUE                
      1.73364580E-02    2      1000024        11                       # NUEL   -->  W1SS+  E-                 
      5.87249935E-01    2      1000037        11                       # NUEL   -->  W2SS+  E-                 
#         PDG         Width
DECAY   1000014  6.86934967E+01   # NUML  decays
#          BR          NDA       ID1       ID2       ID3       ID4
      1.06989946E-02    2      1000022        14                       # NUML   -->  Z1SS   NUM                
      2.47050682E-03    2      1000023        14                       # NUML   -->  Z2SS   NUM                
      7.97024146E-02    2      1000025        14                       # NUML   -->  Z3SS   NUM                
      3.02541643E-01    2      1000035        14                       # NUML   -->  Z4SS   NUM                
      1.73364580E-02    2      1000024        13                       # NUML   -->  W1SS+  MU-                
      5.87249935E-01    2      1000037        13                       # NUML   -->  W2SS+  MU-                
#         PDG         Width
DECAY   1000016  7.00180359E+01   # NUTL  decays
#          BR          NDA       ID1       ID2       ID3       ID4
      1.03418846E-02    2      1000022        16                       # NUTL   -->  Z1SS   NUT                
      2.38802051E-03    2      1000023        16                       # NUTL   -->  Z2SS   NUT                
      7.70223290E-02    2      1000025        16                       # NUTL   -->  Z3SS   NUT                
      2.92119294E-01    2      1000035        16                       # NUTL   -->  Z4SS   NUT                
      5.07929996E-02    2      1000024        15                       # NUTL   -->  W1SS+  TAU-               
      5.67129910E-01    2      1000037        15                       # NUTL   -->  W2SS+  TAU-               
      2.05479009E-04    2           24   1000015                       # NUTL   -->  W+     TAU1-              
#         PDG         Width
DECAY   2000011  2.42476101E+01   # ER-   decays
#          BR          NDA       ID1       ID2       ID3       ID4
      2.04995386E-02    2      1000022        11                       # ER-    -->  Z1SS   E-                 
      3.03310226E-03    2      1000023        11                       # ER-    -->  Z2SS   E-                 
      9.76170957E-01    2      1000025        11                       # ER-    -->  Z3SS   E-                 
      2.96392740E-04    2      1000035        11                       # ER-    -->  Z4SS   E-                 
#         PDG         Width
DECAY   2000013  2.42476101E+01   # MUR-  decays
#          BR          NDA       ID1       ID2       ID3       ID4
      2.04995386E-02    2      1000022        13                       # MUR-   -->  Z1SS   MU-                
      3.03310226E-03    2      1000023        13                       # MUR-   -->  Z2SS   MU-                
      9.76170957E-01    2      1000025        13                       # MUR-   -->  Z3SS   MU-                
      2.96392740E-04    2      1000035        13                       # MUR-   -->  Z4SS   MU-                
#         PDG         Width
DECAY   2000015  6.98976212E+01   # TAU2- decays
#          BR          NDA       ID1       ID2       ID3       ID4
      1.75945349E-02    2      1000022        15                       # TAU2-  -->  Z1SS   TAU-               
      1.67402700E-02    2      1000023        15                       # TAU2-  -->  Z2SS   TAU-               
      1.00844711E-01    2      1000025        15                       # TAU2-  -->  Z3SS   TAU-               
      2.81215459E-01    2      1000035        15                       # TAU2-  -->  Z4SS   TAU-               
      1.49970665E-03    2     -1000024        16                       # TAU2-  -->  W1SS-  NUT                
      5.81964374E-01    2     -1000037        16                       # TAU2-  -->  W2SS-  NUT                
      9.71889021E-05    2           23   1000015                       # TAU2-  -->  Z0     TAU1-              
      4.37666968E-05    2           25   1000015                       # TAU2-  -->  HL0    TAU1-              
#         PDG         Width
DECAY   1000023  7.23407823E-07   # Z2SS  decays
#          BR          NDA       ID1       ID2       ID3       ID4
      9.16096382E-03    2      1000022        22                       # Z2SS   -->  Z1SS   GM                 
      7.50426261E-05    3     -1000024         2        -1             # Z2SS   -->  W1SS-  UP     DB          
      2.50142093E-05    3     -1000024        12       -11             # Z2SS   -->  W1SS-  NUE    E+          
      2.50142093E-05    3     -1000024        14       -13             # Z2SS   -->  W1SS-  NUM    MU+         
      7.50426261E-05    3      1000024         1        -2             # Z2SS   -->  W1SS+  DN     UB          
      2.50142093E-05    3      1000024        11       -12             # Z2SS   -->  W1SS+  E-     ANUE        
      2.50142093E-05    3      1000024        13       -14             # Z2SS   -->  W1SS+  MU-    ANUM        
      7.50426261E-05    3     -1000024         4        -3             # Z2SS   -->  W1SS-  CH     SB          
      2.50142093E-05    3     -1000024        16       -15             # Z2SS   -->  W1SS-  NUT    TAU+        
      7.50426261E-05    3      1000024         3        -4             # Z2SS   -->  W1SS+  ST     CB          
      2.50142093E-05    3      1000024        15       -16             # Z2SS   -->  W1SS+  TAU-   ANUT        
      1.31631956E-01    3      1000022         2        -2             # Z2SS   -->  Z1SS   UP     UB          
      1.69738829E-01    3      1000022         1        -1             # Z2SS   -->  Z1SS   DN     DB          
      1.69738829E-01    3      1000022         3        -3             # Z2SS   -->  Z1SS   ST     SB          
      1.31631956E-01    3      1000022         4        -4             # Z2SS   -->  Z1SS   CH     CB          
      4.83360887E-02    3      1000022         5        -5             # Z2SS   -->  Z1SS   BT     BB          
      3.85051668E-02    3      1000022        11       -11             # Z2SS   -->  Z1SS   E-     E+          
      3.85051668E-02    3      1000022        13       -13             # Z2SS   -->  Z1SS   MU-    MU+         
      3.24583091E-02    3      1000022        15       -15             # Z2SS   -->  Z1SS   TAU-   TAU+        
      7.66142011E-02    3      1000022        12       -12             # Z2SS   -->  Z1SS   NUE    ANUE        
      7.66142011E-02    3      1000022        14       -14             # Z2SS   -->  Z1SS   NUM    ANUM        
      7.66142160E-02    3      1000022        16       -16             # Z2SS   -->  Z1SS   NUT    ANUT        
#         PDG         Width
DECAY   1000025  6.13634765E-01   # Z3SS  decays
#          BR          NDA       ID1       ID2       ID3       ID4
      5.59404114E-08    2      1000022        22                       # Z3SS   -->  Z1SS   GM                 
      2.37686564E-08    2      1000023        22                       # Z3SS   -->  Z2SS   GM                 
      2.84462720E-01    2      1000024       -24                       # Z3SS   -->  W1SS+  W-                 
      2.84462720E-01    2     -1000024        24                       # Z3SS   -->  W1SS-  W+                 
      3.59702893E-02    2      1000022        23                       # Z3SS   -->  Z1SS   Z0                 
      2.01882944E-01    2      1000023        23                       # Z3SS   -->  Z2SS   Z0                 
      5.05794989E-11    3      1000022         2        -2             # Z3SS   -->  Z1SS   UP     UB          
      6.84937784E-12    3      1000022         1        -1             # Z3SS   -->  Z1SS   DN     DB          
      6.84937784E-12    3      1000022         3        -3             # Z3SS   -->  Z1SS   ST     SB          
      5.05794816E-11    3      1000022         4        -4             # Z3SS   -->  Z1SS   CH     CB          
      1.02654525E-07    3      1000022         5        -5             # Z3SS   -->  Z1SS   BT     BB          
      1.20016150E-10    3      1000022        11       -11             # Z3SS   -->  Z1SS   E-     E+          
      1.20016150E-10    3      1000022        13       -13             # Z3SS   -->  Z1SS   MU-    MU+         
      2.16398472E-08    3      1000022        15       -15             # Z3SS   -->  Z1SS   TAU-   TAU+        
      2.85460648E-11    3      1000022        12       -12             # Z3SS   -->  Z1SS   NUE    ANUE        
      2.85460648E-11    3      1000022        14       -14             # Z3SS   -->  Z1SS   NUM    ANUM        
      3.02919842E-11    3      1000022        16       -16             # Z3SS   -->  Z1SS   NUT    ANUT        
      2.50726089E-12    3      1000023         2        -2             # Z3SS   -->  Z2SS   UP     UB          
      4.41909096E-13    3      1000023         1        -1             # Z3SS   -->  Z2SS   DN     DB          
      4.41909096E-13    3      1000023         3        -3             # Z3SS   -->  Z2SS   ST     SB          
      2.50726002E-12    3      1000023         4        -4             # Z3SS   -->  Z2SS   CH     CB          
      8.19279578E-08    3      1000023         5        -5             # Z3SS   -->  Z2SS   BT     BB          
      5.73136677E-12    3      1000023        11       -11             # Z3SS   -->  Z2SS   E-     E+          
      5.73136677E-12    3      1000023        13       -13             # Z3SS   -->  Z2SS   MU-    MU+         
      1.71308621E-08    3      1000023        15       -15             # Z3SS   -->  Z2SS   TAU-   TAU+        
      2.03923510E-12    3      1000023        12       -12             # Z3SS   -->  Z2SS   NUE    ANUE        
      2.03923510E-12    3      1000023        14       -14             # Z3SS   -->  Z2SS   NUM    ANUM        
      2.16400704E-12    3      1000023        16       -16             # Z3SS   -->  Z2SS   NUT    ANUT        
      1.76921859E-01    2      1000022        25                       # Z3SS   -->  Z1SS   HL0                
      1.62992831E-02    2      1000023        25                       # Z3SS   -->  Z2SS   HL0                
#         PDG         Width
DECAY   1000035  5.64863825E+00   # Z4SS  decays
#          BR          NDA       ID1       ID2       ID3       ID4
      1.74408513E-06    2      1000022        22                       # Z4SS   -->  Z1SS   GM                 
      3.17833064E-06    2      1000023        22                       # Z4SS   -->  Z2SS   GM                 
      7.20775759E-08    2      1000025        22                       # Z4SS   -->  Z3SS   GM                 
      2.45667949E-01    2      1000024       -24                       # Z4SS   -->  W1SS+  W-                 
      2.45667949E-01    2     -1000024        24                       # Z4SS   -->  W1SS-  W+                 
      5.44428289E-08    3     -1000037         2        -1             # Z4SS   -->  W2SS-  UP     DB          
      1.81476096E-08    3     -1000037        12       -11             # Z4SS   -->  W2SS-  NUE    E+          
      1.81476096E-08    3     -1000037        14       -13             # Z4SS   -->  W2SS-  NUM    MU+         
      5.44428289E-08    3      1000037         1        -2             # Z4SS   -->  W2SS+  DN     UB          
      1.81476096E-08    3      1000037        11       -12             # Z4SS   -->  W2SS+  E-     ANUE        
      1.81476096E-08    3      1000037        13       -14             # Z4SS   -->  W2SS+  MU-    ANUM        
      5.44428289E-08    3     -1000037         4        -3             # Z4SS   -->  W2SS-  CH     SB          
      1.81476096E-08    3     -1000037        16       -15             # Z4SS   -->  W2SS-  NUT    TAU+        
      5.44428289E-08    3      1000037         3        -4             # Z4SS   -->  W2SS+  ST     CB          
      1.81476096E-08    3      1000037        15       -16             # Z4SS   -->  W2SS+  TAU-   ANUT        
      5.14581092E-02    2      1000022        23                       # Z4SS   -->  Z1SS   Z0                 
      2.12692618E-01    2      1000023        23                       # Z4SS   -->  Z2SS   Z0                 
      1.62726338E-03    2      1000025        23                       # Z4SS   -->  Z3SS   Z0                 
      3.65053349E-10    3      1000022         2        -2             # Z4SS   -->  Z1SS   UP     UB          
      1.00443653E-09    3      1000022         1        -1             # Z4SS   -->  Z1SS   DN     DB          
      1.00443653E-09    3      1000022         3        -3             # Z4SS   -->  Z1SS   ST     SB          
      3.65053349E-10    3      1000022         4        -4             # Z4SS   -->  Z1SS   CH     CB          
      4.03843569E-06    3      1000022         5        -5             # Z4SS   -->  Z1SS   BT     BB          
      1.57976045E-11    3      1000022        11       -11             # Z4SS   -->  Z1SS   E-     E+          
      1.57976045E-11    3      1000022        13       -13             # Z4SS   -->  Z1SS   MU-    MU+         
      7.97264306E-07    3      1000022        15       -15             # Z4SS   -->  Z1SS   TAU-   TAU+        
      6.89401092E-10    3      1000022        12       -12             # Z4SS   -->  Z1SS   NUE    ANUE        
      6.89401092E-10    3      1000022        14       -14             # Z4SS   -->  Z1SS   NUM    ANUM        
      7.31804006E-10    3      1000022        16       -16             # Z4SS   -->  Z1SS   NUT    ANUT        
      6.61357358E-11    3      1000023         2        -2             # Z4SS   -->  Z2SS   UP     UB          
      1.33588945E-10    3      1000023         1        -1             # Z4SS   -->  Z2SS   DN     DB          
      1.33588945E-10    3      1000023         3        -3             # Z4SS   -->  Z2SS   ST     SB          
      6.61357358E-11    3      1000023         4        -4             # Z4SS   -->  Z2SS   CH     CB          
      3.58985358E-06    3      1000023         5        -5             # Z4SS   -->  Z2SS   BT     BB          
      7.90502646E-12    3      1000023        11       -11             # Z4SS   -->  Z2SS   E-     E+          
      7.90502646E-12    3      1000023        13       -13             # Z4SS   -->  Z2SS   MU-    MU+         
      7.09374035E-07    3      1000023        15       -15             # Z4SS   -->  Z2SS   TAU-   TAU+        
      7.88336757E-11    3      1000023        12       -12             # Z4SS   -->  Z2SS   NUE    ANUE        
      7.88336757E-11    3      1000023        14       -14             # Z4SS   -->  Z2SS   NUM    ANUM        
      8.36894373E-11    3      1000023        16       -16             # Z4SS   -->  Z2SS   NUT    ANUT        
      5.78869286E-10    3      1000025         2        -2             # Z4SS   -->  Z3SS   UP     UB          
      2.60206884E-10    3      1000025         1        -1             # Z4SS   -->  Z3SS   DN     DB          
      2.60206884E-10    3      1000025         3        -3             # Z4SS   -->  Z3SS   ST     SB          
      5.78869286E-10    3      1000025         4        -4             # Z4SS   -->  Z3SS   CH     CB          
      7.89286947E-09    3      1000025         5        -5             # Z4SS   -->  Z3SS   BT     BB          
      1.42288126E-09    3      1000025        11       -11             # Z4SS   -->  Z3SS   E-     E+          
      1.42288126E-09    3      1000025        13       -13             # Z4SS   -->  Z3SS   MU-    MU+         
      2.86669777E-09    3      1000025        15       -15             # Z4SS   -->  Z3SS   TAU-   TAU+        
      1.12645537E-09    3      1000025        12       -12             # Z4SS   -->  Z3SS   NUE    ANUE        
      1.12645537E-09    3      1000025        14       -14             # Z4SS   -->  Z3SS   NUM    ANUM        
      1.19597565E-09    3      1000025        16       -16             # Z4SS   -->  Z3SS   NUT    ANUT        
      1.67890325E-01    2      1000022        25                       # Z4SS   -->  Z1SS   HL0                
      5.87346442E-02    2      1000023        25                       # Z4SS   -->  Z2SS   HL0                
      1.62467845E-02    2      1000025        25                       # Z4SS   -->  Z3SS   HL0                
#         PDG         Width
DECAY   1000024  4.06215634E-07   # W1SS+ decays
#          BR          NDA       ID1       ID2       ID3       ID4
      3.33332330E-01    3      1000022         2        -1             # W1SS+  -->  Z1SS   UP     DB          
      3.33332330E-01    3      1000022         4        -3             # W1SS+  -->  Z1SS   CH     SB          
      1.11111075E-01    3      1000022       -11        12             # W1SS+  -->  Z1SS   E+     NUE         
      1.11111075E-01    3      1000022       -13        14             # W1SS+  -->  Z1SS   MU+    NUM         
      1.11113124E-01    3      1000022       -15        16             # W1SS+  -->  Z1SS   TAU+   NUT         
#         PDG         Width
DECAY   1000037  5.56949902E+00   # W2SS+ decays
#          BR          NDA       ID1       ID2       ID3       ID4
      7.24677318E-10    3      1000022         2        -1             # W2SS+  -->  Z1SS   UP     DB          
      7.24677318E-10    3      1000022         4        -3             # W2SS+  -->  Z1SS   CH     SB          
      4.45106868E-10    3      1000022       -11        12             # W2SS+  -->  Z1SS   E+     NUE         
      4.45106868E-10    3      1000022       -13        14             # W2SS+  -->  Z1SS   MU+    NUM         
      7.47073102E-07    3      1000022       -15        16             # W2SS+  -->  Z1SS   TAU+   NUT         
      2.37662360E-01    2      1000022        24                       # W2SS+  -->  Z1SS   W+                 
      3.50142054E-10    3      1000023         2        -1             # W2SS+  -->  Z2SS   UP     DB          
      3.50142054E-10    3      1000023         4        -3             # W2SS+  -->  Z2SS   CH     SB          
      1.35206984E-10    3      1000023       -11        12             # W2SS+  -->  Z2SS   E+     NUE         
      1.35206984E-10    3      1000023       -13        14             # W2SS+  -->  Z2SS   MU+    NUM         
      6.26893382E-07    3      1000023       -15        16             # W2SS+  -->  Z2SS   TAU+   NUT         
      2.50852317E-01    2      1000023        24                       # W2SS+  -->  Z2SS   W+                 
      7.14267812E-10    3      1000025         2        -1             # W2SS+  -->  Z3SS   UP     DB          
      7.14267812E-10    3      1000025         4        -3             # W2SS+  -->  Z3SS   CH     SB          
      2.22844387E-09    3      1000025       -11        12             # W2SS+  -->  Z3SS   E+     NUE         
      2.22844387E-09    3      1000025       -13        14             # W2SS+  -->  Z3SS   MU+    NUM         
      3.60078611E-09    3      1000025       -15        16             # W2SS+  -->  Z3SS   TAU+   NUT         
      2.09210124E-02    2      1000025        24                       # W2SS+  -->  Z3SS   W+                 
      2.43282303E-01    2      1000024        23                       # W2SS+  -->  W1SS+  Z0                 
      2.09599360E-09    3      1000024         1        -1             # W2SS+  -->  W1SS+  DN     DB          
      2.09599360E-09    3      1000024         3        -3             # W2SS+  -->  W1SS+  ST     SB          
      2.06756098E-10    3      1000024         2        -2             # W2SS+  -->  W1SS+  UP     UB          
      2.06756098E-10    3      1000024         4        -4             # W2SS+  -->  W1SS+  CH     CB          
      7.24204932E-11    3      1000024        12       -12             # W2SS+  -->  W1SS+  NUE    ANUE        
      7.24204932E-11    3      1000024        14       -14             # W2SS+  -->  W1SS+  NUM    ANUM        
      1.05111010E-10    3      1000024        16       -16             # W2SS+  -->  W1SS+  NUT    ANUT        
      7.31095129E-10    3      1000024        11       -11             # W2SS+  -->  W1SS+  E-     E+          
      7.31095129E-10    3      1000024        13       -13             # W2SS+  -->  W1SS+  MU-    MU+         
      7.76076647E-10    3      1000024        15       -15             # W2SS+  -->  W1SS+  TAU-   TAU+        
      2.47280583E-01    2      1000024        25                       # W2SS+  -->  W1SS+  HL0                
#         PDG         Width
DECAY        25  3.86256212E-03   # HL0   decays
#          BR          NDA       ID1       ID2       ID3       ID4
      5.73942804E-09    2           11       -11                       # HL0    -->  E-     E+                 
      2.42327980E-04    2           13       -13                       # HL0    -->  MU-    MU+                
      6.93220347E-02    2           15       -15                       # HL0    -->  TAU-   TAU+               
      7.19500304E-06    2            1        -1                       # HL0    -->  DN     DB                 
      2.90714228E-03    2            3        -3                       # HL0    -->  ST     SB                 
      6.22856498E-01    2            5        -5                       # HL0    -->  BT     BB                 
      2.19808817E-06    2            2        -2                       # HL0    -->  UP     UB                 
      4.08761986E-02    2            4        -4                       # HL0    -->  CH     CB                 
      2.67804321E-03    2           22        22                       # HL0    -->  GM     GM                 
      5.26575185E-02    2           21        21                       # HL0    -->  GL     GL                 
      1.04333274E-02    3           24        11       -12             # HL0    -->  W+     E-     ANUE        
      1.04333274E-02    3           24        13       -14             # HL0    -->  W+     MU-    ANUM        
      1.04333274E-02    3           24        15       -16             # HL0    -->  W+     TAU-   ANUT        
      3.12999822E-02    3           24        -2         1             # HL0    -->  W+     UB     DN          
      3.12999822E-02    3           24        -4         3             # HL0    -->  W+     CB     ST          
      1.04333274E-02    3          -24       -11        12             # HL0    -->  W-     E+     NUE         
      1.04333274E-02    3          -24       -13        14             # HL0    -->  W-     MU+    NUM         
      1.04333274E-02    3          -24       -15        16             # HL0    -->  W-     TAU+   NUT         
      3.12999822E-02    3          -24         2        -1             # HL0    -->  W-     UP     DB          
      3.12999822E-02    3          -24         4        -3             # HL0    -->  W-     CH     SB          
      1.41234288E-03    3           23        12       -12             # HL0    -->  Z0     NUE    ANUE        
      1.41234288E-03    3           23        14       -14             # HL0    -->  Z0     NUM    ANUM        
      1.41234288E-03    3           23        16       -16             # HL0    -->  Z0     NUT    ANUT        
      7.10817927E-04    3           23        11       -11             # HL0    -->  Z0     E-     E+          
      7.10817927E-04    3           23        13       -13             # HL0    -->  Z0     MU-    MU+         
      7.10817927E-04    3           23        15       -15             # HL0    -->  Z0     TAU-   TAU+        
      2.43520201E-03    3           23         2        -2             # HL0    -->  Z0     UP     UB          
      2.43520201E-03    3           23         4        -4             # HL0    -->  Z0     CH     CB          
      3.13714030E-03    3           23         1        -1             # HL0    -->  Z0     DN     DB          
      3.13714030E-03    3           23         3        -3             # HL0    -->  Z0     ST     SB          
      3.13714030E-03    3           23         5        -5             # HL0    -->  Z0     BT     BB          
#         PDG         Width
DECAY        35  7.68437958E+00   # HH0   decays
#          BR          NDA       ID1       ID2       ID3       ID4
      5.00796427E-09    2           11       -11                       # HH0    -->  E-     E+                 
      2.11445280E-04    2           13       -13                       # HH0    -->  MU-    MU+                
      6.05600402E-02    2           15       -15                       # HH0    -->  TAU-   TAU+               
      6.13477914E-06    2            1        -1                       # HH0    -->  DN     DB                 
      2.47876113E-03    2            3        -3                       # HH0    -->  ST     SB                 
      3.70999813E-01    2            5        -5                       # HH0    -->  BT     BB                 
      4.06099321E-11    2            2        -2                       # HH0    -->  UP     UB                 
      5.71909425E-07    2            4        -4                       # HH0    -->  CH     CB                 
      2.60891374E-02    2            6        -6                       # HH0    -->  TP     TB                 
      2.23741807E-07    2           22        22                       # HH0    -->  GM     GM                 
      1.25637571E-05    2           21        21                       # HH0    -->  GL     GL                 
      1.00271587E-04    2           24       -24                       # HH0    -->  W+     W-                 
      5.09095007E-05    2           23        23                       # HH0    -->  Z0     Z0                 
      1.48944007E-02    2      1000022   1000022                       # HH0    -->  Z1SS   Z1SS               
      3.14716739E-03    2      1000022   1000023                       # HH0    -->  Z1SS   Z2SS               
      3.76823656E-02    2      1000022   1000025                       # HH0    -->  Z1SS   Z3SS               
      3.23710442E-02    2      1000022   1000035                       # HH0    -->  Z1SS   Z4SS               
      4.07812931E-03    2      1000023   1000023                       # HH0    -->  Z2SS   Z2SS               
      6.39748424E-02    2      1000023   1000025                       # HH0    -->  Z2SS   Z3SS               
      9.42298546E-02    2      1000023   1000035                       # HH0    -->  Z2SS   Z4SS               
      2.85177055E-04    2      1000025   1000025                       # HH0    -->  Z3SS   Z3SS               
      2.49929428E-02    2      1000024  -1000024                       # HH0    -->  W1SS+  W1SS-              
      1.31737560E-01    2      1000024  -1000037                       # HH0    -->  W1SS+  W2SS-              
      1.31737560E-01    2     -1000024   1000037                       # HH0    -->  W1SS-  W2SS+              
      3.59129772E-04    2           25        25                       # HH0    -->  HL0    HL0                
#         PDG         Width
DECAY        36  7.54343987E+00   # HA0   decays
#          BR          NDA       ID1       ID2       ID3       ID4
      5.06880760E-09    2           11       -11                       # HA0    -->  E-     E+                 
      2.14014202E-04    2           13       -13                       # HA0    -->  MU-    MU+                
      6.12965636E-02    2           15       -15                       # HA0    -->  TAU-   TAU+               
      6.20965420E-06    2            1        -1                       # HA0    -->  DN     DB                 
      2.50901468E-03    2            3        -3                       # HA0    -->  ST     SB                 
      3.75544697E-01    2            5        -5                       # HA0    -->  BT     BB                 
      3.92472548E-11    2            2        -2                       # HA0    -->  UP     UB                 
      5.53153768E-07    2            4        -4                       # HA0    -->  CH     CB                 
      2.80278921E-02    2            6        -6                       # HA0    -->  TP     TB                 
      6.08764879E-08    2           22        22                       # HA0    -->  GM     GM                 
      4.01731741E-05    2           21        21                       # HA0    -->  GL     GL                 
      2.11376790E-02    2      1000022   1000022                       # HA0    -->  Z1SS   Z1SS               
      1.28079404E-03    2      1000022   1000023                       # HA0    -->  Z1SS   Z2SS               
      6.18088208E-02    2      1000022   1000025                       # HA0    -->  Z1SS   Z3SS               
      9.62173864E-02    2      1000022   1000035                       # HA0    -->  Z1SS   Z4SS               
      3.46472836E-03    2      1000023   1000023                       # HA0    -->  Z2SS   Z2SS               
      3.75878252E-02    2      1000023   1000025                       # HA0    -->  Z2SS   Z3SS               
      2.59002429E-02    2      1000023   1000035                       # HA0    -->  Z2SS   Z4SS               
      1.05492421E-03    2      1000025   1000025                       # HA0    -->  Z3SS   Z3SS               
      3.03802360E-02    2      1000024  -1000024                       # HA0    -->  W1SS+  W1SS-              
      1.26715139E-01    2      1000024  -1000037                       # HA0    -->  W1SS+  W2SS-              
      1.26715139E-01    2     -1000024   1000037                       # HA0    -->  W1SS-  W2SS+              
      9.79727411E-05    2           25        23                       # HA0    -->  HL0    Z0                 
#         PDG         Width
DECAY        37  7.10128403E+00   # H+    decays
#          BR          NDA       ID1       ID2       ID3       ID4
      5.40179723E-09    2           12       -11                       # H+     -->  NUE    E+                 
      2.28073637E-04    2           14       -13                       # H+     -->  NUM    MU+                
      6.53233752E-02    2           16       -15                       # H+     -->  NUT    TAU+               
      6.08262326E-06    2            2        -1                       # H+     -->  UP     DB                 
      2.45820452E-03    2            4        -3                       # H+     -->  CH     SB                 
      3.72489005E-01    2            6        -5                       # H+     -->  TP     BB                 
      3.65759071E-04    2      1000024   1000022                       # H+     -->  W1SS+  Z1SS               
      3.43850371E-03    2      1000024   1000023                       # H+     -->  W1SS+  Z2SS               
      1.40806049E-01    2      1000024   1000025                       # H+     -->  W1SS+  Z3SS               
      1.28619298E-01    2      1000024   1000035                       # H+     -->  W1SS+  Z4SS               
      1.50533840E-01    2      1000037   1000022                       # H+     -->  W2SS+  Z1SS               
      1.35627419E-01    2      1000037   1000023                       # H+     -->  W2SS+  Z2SS               
      1.04369217E-04    2           25        24                       # H+     -->  HL0    W+                 
