#
#                              ======================
#                              | THE SUSYHIT OUTPUT |
#                              ======================
#
#
#              ------------------------------------------------------
#              |     This is the output of the SUSY-HIT package     |
#              |  created by A.Djouadi, M.Muehlleitner and M.Spira. |
#              |  In case of problems with SUSY-HIT email to        |
#              |           margarete.muehlleitner@cern.ch           |
#              |           michael.spira@psi.ch                     |
#              |           abdelhak.djouadi@cern.ch                 |
#              ------------------------------------------------------
#
#              ------------------------------------------------------
#              |  SUSY Les Houches Accord - MSSM Spectrum + Decays  |
#              |              based on the decay programs           |
#              |                                                    |
#              |                     SDECAY 1.3b                    |
#              |                                                    |
#              |  Authors: M.Muhlleitner, A.Djouadi and Y.Mambrini  |
#              |  Ref.:    Comput.Phys.Commun.168(2005)46           |
#              |           [hep-ph/0311167]                         |
#              |                                                    |
#              |                     HDECAY 3.4                     |
#              |                                                    |
#              |  By: A.Djouadi,J.Kalinowski,M.Muhlleitner,M.Spira  |
#              |  Ref.:    Comput.Phys.Commun.108(1998)56           |
#              |           [hep-ph/9704448]                         |
#              |                                                    |
#              |                                                    |
#              |  If not stated otherwise all DRbar couplings and   |
#              |  soft SUSY breaking masses are given at the scale  |
#              |  Q=  0.50007753E+04
#              |                                                    |
#              ------------------------------------------------------
#
#
BLOCK DCINFO  # Decay Program information
     1   SDECAY/HDECAY # decay calculator
     2   1.3b  /3.4    # version number
#
BLOCK SPINFO  # Spectrum calculator information
     1    SOFTSUSY    # spectrum calculator                
     2    3.4.0       # version number                     
#
BLOCK MODSEL  # Model selection
     1     0   #  nonUniversal                                     
#
BLOCK SMINPUTS  # Standard Model inputs
         1     1.25778332E+02   # alpha_em^-1(M_Z)^MSbar
         2     1.16570000E-05   # G_F [GeV^-2]
         3     1.17200002E-01   # alpha_S(M_Z)^MSbar
         4     9.11876000E+01   # M_Z pole mass
         5     4.25000000E+00   # mb(mb)^MSbar
         6     1.72500000E+02   # mt pole mass
         7     1.77682000E+00   # mtau pole mass
#
BLOCK MINPAR  # Input parameters - minimal models
         3     1.00000000E+01   # tanb                
#
BLOCK EXTPAR  # Input parameters - non-minimal models
         0    -1.00000000E+00   # Set                 
         1     6.00000000E+01   # M_1(MX)             
         2     3.00000000E+03   # M_2(MX)             
         3     2.04381100E+03   # M_3(MX)             
        11     5.00000000E+03   # At(MX)              
        12     5.00000000E+03   # Ab(MX)              
        13     0.00000000E+00   # Atau(MX)            
        23    -1.58713000E+02   # mu(MX)              
        26     3.00000000E+03   # mA(pole)            
        31     5.00000000E+03   # meL(MX)             
        32     5.00000000E+03   # mmuL(MX)            
        33     5.00000000E+03   # mtauL(MX)           
        34     5.00000000E+03   # meR(MX)             
        35     5.00000000E+03   # mmuR(MX)            
        36     5.00000000E+03   # mtauR(MX)           
        41     5.00000000E+03   # mqL1(MX)            
        42     5.00000000E+03   # mqL2(MX)            
        43     5.00000000E+03   # mqL3(MX)            
        44     5.00000000E+03   # muR(MX)             
        45     5.00000000E+03   # mcR(MX)             
        46     5.00000000E+03   # mtR(MX)             
        47     5.00000000E+03   # mdR(MX)             
        48     5.00000000E+03   # msR(MX)             
        49     5.00000000E+03   # mbR(MX)             
#
BLOCK MASS  # Mass Spectrum
# PDG code           mass       particle
        24     8.00908679E+01   # W+
        25     1.24796595E+02   # h
        35     3.00009178E+03   # H
        36     2.99999980E+03   # A
        37     3.00148470E+03   # H+
         5     4.87878001E+00   # b-quark pole mass calculated from mb(mb)_Msbar
   1000001     5.07820491E+03   # ~d_L
   2000001     5.06031879E+03   # ~d_R
   1000002     5.07773096E+03   # ~u_L
   2000002     5.06000818E+03   # ~u_R
   1000003     5.07820491E+03   # ~s_L
   2000003     5.06031879E+03   # ~s_R
   1000004     5.07773096E+03   # ~c_L
   2000004     5.06000818E+03   # ~c_R
   1000005     5.02422698E+03   # ~b_1
   2000005     5.05837865E+03   # ~b_2
   1000006     4.91602115E+03   # ~t_1
   2000006     5.06695799E+03   # ~t_2
   1000011     5.01917320E+03   # ~e_L
   2000011     5.00596228E+03   # ~e_R
   1000012     5.01822008E+03   # ~nu_eL
   1000013     5.01917320E+03   # ~mu_L
   2000013     5.00596228E+03   # ~mu_R
   1000014     5.01822008E+03   # ~nu_muL
   1000015     5.00483735E+03   # ~tau_1
   2000015     5.01863447E+03   # ~tau_2
   1000016     5.01766483E+03   # ~nu_tauL
   1000021     2.40000043E+03   # ~g
   1000022     5.78426536E+01   # ~chi_10
   1000023    -1.75655141E+02   # ~chi_20
   1000025     1.75672866E+02   # ~chi_30
   1000035     3.07434435E+03   # ~chi_40
   1000024     1.70000138E+02   # ~chi_1+
   1000037     3.07451257E+03   # ~chi_2+
#
BLOCK NMIX  # Neutralino Mixing Matrix
  1  1     9.59064010E-01   # N_11
  1  2    -9.56179211E-04   # N_12
  1  3    -2.74937453E-01   # N_13
  1  4    -6.78579928E-02   # N_14
  2  1    -1.47310838E-01   # N_21
  2  2     1.87605681E-02   # N_22
  2  3    -6.89011659E-01   # N_23
  2  4     7.09373310E-01   # N_24
  3  1     2.41858574E-01   # N_31
  3  2     1.69293253E-02   # N_32
  3  3     6.70574837E-01   # N_33
  3  4     7.01104284E-01   # N_34
  4  1    -4.13962802E-04   # N_41
  4  2     9.99680211E-01   # N_42
  4  3     1.31140045E-03   # N_43
  4  4    -2.52504280E-02   # N_44
#
BLOCK UMIX  # Chargino Mixing Matrix U
  1  1    -1.84877397E-03   # U_11
  1  2     9.99998291E-01   # U_12
  2  1    -9.99998291E-01   # U_21
  2  2    -1.84877397E-03   # U_22
#
BLOCK VMIX  # Chargino Mixing Matrix V
  1  1     3.57282699E-02   # V_11
  1  2    -9.99361542E-01   # V_12
  2  1    -9.99361542E-01   # V_21
  2  2    -3.57282699E-02   # V_22
#
BLOCK STOPMIX  # Stop Mixing Matrix
  1  1    -5.00611828E-01   # cos(theta_t)
  1  2     8.65671876E-01   # sin(theta_t)
  2  1    -8.65671876E-01   # -sin(theta_t)
  2  2    -5.00611828E-01   # cos(theta_t)
#
BLOCK SBOTMIX  # Sbottom Mixing Matrix
  1  1     9.99458812E-01   # cos(theta_b)
  1  2    -3.28950318E-02   # sin(theta_b)
  2  1     3.28950318E-02   # -sin(theta_b)
  2  2     9.99458812E-01   # cos(theta_b)
#
BLOCK STAUMIX  # Stau Mixing Matrix
  1  1    -1.87274250E-02   # cos(theta_tau)
  1  2     9.99824626E-01   # sin(theta_tau)
  2  1    -9.99824626E-01   # -sin(theta_tau)
  2  2    -1.87274250E-02   # cos(theta_tau)
#
BLOCK ALPHA  # Higgs mixing
          -1.05501475E-01   # Mixing angle in the neutral Higgs boson sector
#
BLOCK HMIX Q=  5.00077529E+03  # DRbar Higgs Parameters
         1    -1.61611136E+02   # mu(Q)MSSM           
         2     9.46818327E+00   # tan                 
         3     2.41650869E+02   # higgs               
         4     8.80173035E+06   # mA^2(Q)MSSM         
#
BLOCK GAUGE Q=  5.00077529E+03  # The gauge couplings
     1     3.71186262E-01   # gprime(Q) DRbar
     2     6.34520840E-01   # g(Q) DRbar
     3     9.95823441E-01   # g3(Q) DRbar
#
BLOCK AU Q=  5.00077529E+03  # The trilinear couplings
  1  1     5.00000002E+03   # A_u(Q) DRbar
  2  2     5.00000002E+03   # A_c(Q) DRbar
  3  3     5.00000002E+03   # A_t(Q) DRbar
#
BLOCK AD Q=  5.00077529E+03  # The trilinear couplings
  1  1     5.00000001E+03   # A_d(Q) DRbar
  2  2     5.00000001E+03   # A_s(Q) DRbar
  3  3     5.00000001E+03   # A_b(Q) DRbar
#
BLOCK AE Q=  5.00077529E+03  # The trilinear couplings
  1  1     0.00000000E+00   # A_e(Q) DRbar
  2  2     2.30291503E-07   # A_mu(Q) DRbar
  3  3     2.30149261E-07   # A_tau(Q) DRbar
#
BLOCK Yu Q=  5.00077529E+03  # The Yukawa couplings
  1  1     0.00000000E+00   # y_u(Q) DRbar
  2  2     0.00000000E+00   # y_c(Q) DRbar
  3  3     8.21519020E-01   # y_t(Q) DRbar
#
BLOCK Yd Q=  5.00077529E+03  # The Yukawa couplings
  1  1     0.00000000E+00   # y_d(Q) DRbar
  2  2     0.00000000E+00   # y_s(Q) DRbar
  3  3     1.29899661E-01   # y_b(Q) DRbar
#
BLOCK Ye Q=  5.00077529E+03  # The Yukawa couplings
  1  1     0.00000000E+00   # y_e(Q) DRbar
  2  2     0.00000000E+00   # y_mu(Q) DRbar
  3  3     9.73707937E-02   # y_tau(Q) DRbar
#
BLOCK MSOFT Q=  5.00077529E+03  # The soft SUSY breaking masses at the scale Q
         1     6.00000000E+01   # M_1(Q)              
         2     3.00000000E+03   # M_2(Q)              
         3     2.04381100E+03   # M_3(Q)              
        21     8.70887131E+06   # mH1^2(Q)            
        22     5.55075819E+05   # mH2^2(Q)            
        31     5.00000000E+03   # meL(Q)              
        32     5.00000000E+03   # mmuL(Q)             
        33     5.00000000E+03   # mtauL(Q)            
        34     5.00000000E+03   # meR(Q)              
        35     5.00000000E+03   # mmuR(Q)             
        36     5.00000000E+03   # mtauR(Q)            
        41     5.00000000E+03   # mqL1(Q)             
        42     5.00000000E+03   # mqL2(Q)             
        43     4.99999999E+03   # mqL3(Q)             
        44     5.00000000E+03   # muR(Q)              
        45     5.00000000E+03   # mcR(Q)              
        46     4.99999999E+03   # mtR(Q)              
        47     5.00000000E+03   # mdR(Q)              
        48     5.00000000E+03   # msR(Q)              
        49     5.00000000E+03   # mbR(Q)              
#
#
#
#                             =================
#                             |The decay table|
#                             =================
#
# - The QCD corrections to the decays gluino -> squark  + quark
#                                     squark -> gaugino + quark_prime
#                                     squark -> squark_prime + Higgs
#                                     squark -> gluino  + quark
#   are included.
#
# - The multi-body decays for the inos, stops and sbottoms are included.
#
# - The loop induced decays for the gluino, neutralinos and stops
#   are included.
#
# - The SUSY decays of the top quark are included.
#
#
#         PDG            Width
DECAY         6     1.41108726E+00   # top decays
#          BR         NDA      ID1       ID2
     1.00000000E+00    2           5        24   # BR(t ->  b    W+)
#
#         PDG            Width
DECAY   1000021     7.02539604E-03   # gluino decays
#          BR         NDA      ID1       ID2
     3.21974190E-05    2     1000022        21   # BR(~g -> ~chi_10 g)
     4.00483891E-03    2     1000023        21   # BR(~g -> ~chi_20 g)
     4.08287742E-03    2     1000025        21   # BR(~g -> ~chi_30 g)
#           BR         NDA      ID1       ID2       ID3
     8.00507081E-03    3     1000022         1        -1   # BR(~g -> ~chi_10 d  db)
     2.04675866E-04    3     1000023         1        -1   # BR(~g -> ~chi_20 d  db)
     4.67237192E-04    3     1000025         1        -1   # BR(~g -> ~chi_30 d  db)
     2.72132855E-02    3     1000022         2        -2   # BR(~g -> ~chi_10 u  ub)
     4.93257670E-04    3     1000023         2        -2   # BR(~g -> ~chi_20 u  ub)
     1.89069937E-03    3     1000025         2        -2   # BR(~g -> ~chi_30 u  ub)
     8.00507081E-03    3     1000022         3        -3   # BR(~g -> ~chi_10 s  sb)
     2.04675866E-04    3     1000023         3        -3   # BR(~g -> ~chi_20 s  sb)
     4.67237192E-04    3     1000025         3        -3   # BR(~g -> ~chi_30 s  sb)
     2.72132855E-02    3     1000022         4        -4   # BR(~g -> ~chi_10 c  cb)
     4.93257670E-04    3     1000023         4        -4   # BR(~g -> ~chi_20 c  cb)
     1.89069937E-03    3     1000025         4        -4   # BR(~g -> ~chi_30 c  cb)
     8.99610249E-03    3     1000022         5        -5   # BR(~g -> ~chi_10 b  bb)
     5.32353705E-03    3     1000023         5        -5   # BR(~g -> ~chi_20 b  bb)
     5.30612903E-03    3     1000025         5        -5   # BR(~g -> ~chi_30 b  bb)
     2.64832145E-02    3     1000022         6        -6   # BR(~g -> ~chi_10 t  tb)
     2.06195017E-01    3     1000023         6        -6   # BR(~g -> ~chi_20 t  tb)
     2.17549331E-01    3     1000025         6        -6   # BR(~g -> ~chi_30 t  tb)
     5.28904056E-05    3     1000024         1        -2   # BR(~g -> ~chi_1+ d  ub)
     5.28904056E-05    3    -1000024         2        -1   # BR(~g -> ~chi_1- u  db)
     5.28904056E-05    3     1000024         3        -4   # BR(~g -> ~chi_1+ s  cb)
     5.28904056E-05    3    -1000024         4        -3   # BR(~g -> ~chi_1- c  sb)
     2.22633370E-01    3     1000024         5        -6   # BR(~g -> ~chi_1+ b  tb)
     2.22633370E-01    3    -1000024         6        -5   # BR(~g -> ~chi_1- t  bb)
#
#         PDG            Width
DECAY   1000006     3.13775808E+02   # stop1 decays
#          BR         NDA      ID1       ID2
     2.34736656E-02    2     1000022         6   # BR(~t_1 -> ~chi_10 t )
     9.87818031E-02    2     1000023         6   # BR(~t_1 -> ~chi_20 t )
     1.13386927E-01    2     1000025         6   # BR(~t_1 -> ~chi_30 t )
     6.39161042E-03    2     1000035         6   # BR(~t_1 -> ~chi_40 t )
     1.55832115E-01    2     1000024         5   # BR(~t_1 -> ~chi_1+ b )
     1.27426561E-02    2     1000037         5   # BR(~t_1 -> ~chi_2+ b )
     5.89391223E-01    2     1000021         6   # BR(~t_1 -> ~g      t )
#
#         PDG            Width
DECAY   2000006     3.19232304E+02   # stop2 decays
#          BR         NDA      ID1       ID2
     1.45822911E-02    2     1000022         6   # BR(~t_2 -> ~chi_10 t )
     1.14901162E-01    2     1000023         6   # BR(~t_2 -> ~chi_20 t )
     9.67579703E-02    2     1000025         6   # BR(~t_2 -> ~chi_30 t )
     1.78510456E-02    2     1000035         6   # BR(~t_2 -> ~chi_40 t )
     6.04347442E-02    2     1000024         5   # BR(~t_2 -> ~chi_1+ b )
     3.55492468E-02    2     1000037         5   # BR(~t_2 -> ~chi_2+ b )
     6.56277149E-01    2     1000021         6   # BR(~t_2 -> ~g      t )
     8.52226233E-04    2     1000006        25   # BR(~t_2 -> ~t_1    h )
     2.79416408E-03    2     1000006        23   # BR(~t_2 -> ~t_1    Z )
#
#         PDG            Width
DECAY   1000005     2.93668134E+02   # sbottom1 decays
#          BR         NDA      ID1       ID2
     2.95949705E-03    2     1000022         5   # BR(~b_1 -> ~chi_10 b )
     2.79007038E-03    2     1000023         5   # BR(~b_1 -> ~chi_20 b )
     2.54495511E-03    2     1000025         5   # BR(~b_1 -> ~chi_30 b )
     2.60714394E-02    2     1000035         5   # BR(~b_1 -> ~chi_40 b )
     2.28980481E-01    2    -1000024         6   # BR(~b_1 -> ~chi_1- t )
     5.23387970E-02    2    -1000037         6   # BR(~b_1 -> ~chi_2- t )
     6.82488273E-01    2     1000021         5   # BR(~b_1 -> ~g      b )
     1.82648673E-03    2     1000006       -24   # BR(~b_1 -> ~t_1    W-)
#
#         PDG            Width
DECAY   2000005     2.09606517E+02   # sbottom2 decays
#          BR         NDA      ID1       ID2
     1.34079689E-02    2     1000022         5   # BR(~b_2 -> ~chi_10 b )
     4.27214715E-03    2     1000023         5   # BR(~b_2 -> ~chi_20 b )
     4.60854622E-03    2     1000025         5   # BR(~b_2 -> ~chi_30 b )
     3.23876045E-05    2     1000035         5   # BR(~b_2 -> ~chi_40 b )
     8.38121863E-03    2    -1000024         6   # BR(~b_2 -> ~chi_1- t )
     6.50494977E-05    2    -1000037         6   # BR(~b_2 -> ~chi_2- t )
     9.69221089E-01    2     1000021         5   # BR(~b_2 -> ~g      b )
     1.15933253E-05    2     1000006       -24   # BR(~b_2 -> ~t_1    W-)
#
#         PDG            Width
DECAY   1000002     2.29354647E+02   # sup_L decays
#          BR         NDA      ID1       ID2
     2.96445634E-03    2     1000022         2   # BR(~u_L -> ~chi_10 u)
     8.48750612E-06    2     1000023         2   # BR(~u_L -> ~chi_20 u)
     3.51129991E-04    2     1000025         2   # BR(~u_L -> ~chi_30 u)
     3.46027280E-02    2     1000035         2   # BR(~u_L -> ~chi_40 u)
     2.18268583E-04    2     1000024         1   # BR(~u_L -> ~chi_1+ d)
     6.91638218E-02    2     1000037         1   # BR(~u_L -> ~chi_2+ d)
     8.92691108E-01    2     1000021         2   # BR(~u_L -> ~g      u)
#
#         PDG            Width
DECAY   2000002     2.15110154E+02   # sup_R decays
#          BR         NDA      ID1       ID2
     5.09118396E-02    2     1000022         2   # BR(~u_R -> ~chi_10 u)
     1.19898387E-03    2     1000023         2   # BR(~u_R -> ~chi_20 u)
     3.23196558E-03    2     1000025         2   # BR(~u_R -> ~chi_30 u)
     3.80510557E-09    2     1000035         2   # BR(~u_R -> ~chi_40 u)
     9.44657207E-01    2     1000021         2   # BR(~u_R -> ~g      u)
#
#         PDG            Width
DECAY   1000001     2.29369711E+02   # sdown_L decays
#          BR         NDA      ID1       ID2
     3.02579756E-03    2     1000022         1   # BR(~d_L -> ~chi_10 d)
     1.92758632E-04    2     1000023         1   # BR(~d_L -> ~chi_20 d)
     7.81313946E-05    2     1000025         1   # BR(~d_L -> ~chi_30 d)
     3.46222941E-02    2     1000035         1   # BR(~d_L -> ~chi_40 d)
     5.84450513E-07    2    -1000024         2   # BR(~d_L -> ~chi_1- u)
     6.92687706E-02    2    -1000037         2   # BR(~d_L -> ~chi_2- u)
     8.92811663E-01    2     1000021         1   # BR(~d_L -> ~g      d)
#
#         PDG            Width
DECAY   2000001     2.06208699E+02   # sdown_R decays
#          BR         NDA      ID1       ID2
     1.32782199E-02    2     1000022         1   # BR(~d_R -> ~chi_10 d)
     3.12704767E-04    2     1000023         1   # BR(~d_R -> ~chi_20 d)
     8.42922971E-04    2     1000025         1   # BR(~d_R -> ~chi_30 d)
     9.92542917E-10    2     1000035         1   # BR(~d_R -> ~chi_40 d)
     9.85566151E-01    2     1000021         1   # BR(~d_R -> ~g      d)
#
#         PDG            Width
DECAY   1000004     2.29354647E+02   # scharm_L decays
#          BR         NDA      ID1       ID2
     2.96445634E-03    2     1000022         4   # BR(~c_L -> ~chi_10 c)
     8.48750612E-06    2     1000023         4   # BR(~c_L -> ~chi_20 c)
     3.51129991E-04    2     1000025         4   # BR(~c_L -> ~chi_30 c)
     3.46027280E-02    2     1000035         4   # BR(~c_L -> ~chi_40 c)
     2.18268583E-04    2     1000024         3   # BR(~c_L -> ~chi_1+ s)
     6.91638218E-02    2     1000037         3   # BR(~c_L -> ~chi_2+ s)
     8.92691108E-01    2     1000021         4   # BR(~c_L -> ~g      c)
#
#         PDG            Width
DECAY   2000004     2.15110154E+02   # scharm_R decays
#          BR         NDA      ID1       ID2
     5.09118396E-02    2     1000022         4   # BR(~c_R -> ~chi_10 c)
     1.19898387E-03    2     1000023         4   # BR(~c_R -> ~chi_20 c)
     3.23196558E-03    2     1000025         4   # BR(~c_R -> ~chi_30 c)
     3.80510557E-09    2     1000035         4   # BR(~c_R -> ~chi_40 c)
     9.44657207E-01    2     1000021         4   # BR(~c_R -> ~g      c)
#
#         PDG            Width
DECAY   1000003     2.29369711E+02   # sstrange_L decays
#          BR         NDA      ID1       ID2
     3.02579756E-03    2     1000022         3   # BR(~s_L -> ~chi_10 s)
     1.92758632E-04    2     1000023         3   # BR(~s_L -> ~chi_20 s)
     7.81313946E-05    2     1000025         3   # BR(~s_L -> ~chi_30 s)
     3.46222941E-02    2     1000035         3   # BR(~s_L -> ~chi_40 s)
     5.84450513E-07    2    -1000024         4   # BR(~s_L -> ~chi_1- c)
     6.92687706E-02    2    -1000037         4   # BR(~s_L -> ~chi_2- c)
     8.92811663E-01    2     1000021         3   # BR(~s_L -> ~g      s)
#
#         PDG            Width
DECAY   2000003     2.06208699E+02   # sstrange_R decays
#          BR         NDA      ID1       ID2
     1.32782199E-02    2     1000022         3   # BR(~s_R -> ~chi_10 s)
     3.12704767E-04    2     1000023         3   # BR(~s_R -> ~chi_20 s)
     8.42922971E-04    2     1000025         3   # BR(~s_R -> ~chi_30 s)
     9.92542917E-10    2     1000035         3   # BR(~s_R -> ~chi_40 s)
     9.85566151E-01    2     1000021         3   # BR(~s_R -> ~g      s)
#
#         PDG            Width
DECAY   1000011     3.04300890E+01   # selectron_L decays
#          BR         NDA      ID1       ID2
     2.07162490E-01    2     1000022        11   # BR(~e_L -> ~chi_10 e-)
     2.99475062E-03    2     1000023        11   # BR(~e_L -> ~chi_20 e-)
     1.65363595E-02    2     1000025        11   # BR(~e_L -> ~chi_30 e-)
     2.57597308E-01    2     1000035        11   # BR(~e_L -> ~chi_40 e-)
     4.50527718E-06    2    -1000024        12   # BR(~e_L -> ~chi_1- nu_e)
     5.15704587E-01    2    -1000037        12   # BR(~e_L -> ~chi_2- nu_e)
#
#         PDG            Width
DECAY   2000011     2.74308350E+01   # selectron_R decays
#          BR         NDA      ID1       ID2
     9.19965809E-01    2     1000022        11   # BR(~e_R -> ~chi_10 e-)
     2.16566743E-02    2     1000023        11   # BR(~e_R -> ~chi_20 e-)
     5.83774505E-02    2     1000025        11   # BR(~e_R -> ~chi_30 e-)
     6.65063261E-08    2     1000035        11   # BR(~e_R -> ~chi_40 e-)
#
#         PDG            Width
DECAY   1000013     3.04300890E+01   # smuon_L decays
#          BR         NDA      ID1       ID2
     2.07162490E-01    2     1000022        13   # BR(~mu_L -> ~chi_10 mu-)
     2.99475062E-03    2     1000023        13   # BR(~mu_L -> ~chi_20 mu-)
     1.65363595E-02    2     1000025        13   # BR(~mu_L -> ~chi_30 mu-)
     2.57597308E-01    2     1000035        13   # BR(~mu_L -> ~chi_40 mu-)
     4.50527718E-06    2    -1000024        14   # BR(~mu_L -> ~chi_1- nu_mu)
     5.15704587E-01    2    -1000037        14   # BR(~mu_L -> ~chi_2- nu_mu)
#
#         PDG            Width
DECAY   2000013     2.74308350E+01   # smuon_R decays
#          BR         NDA      ID1       ID2
     9.19965809E-01    2     1000022        13   # BR(~mu_R -> ~chi_10 mu-)
     2.16566743E-02    2     1000023        13   # BR(~mu_R -> ~chi_20 mu-)
     5.83774505E-02    2     1000025        13   # BR(~mu_R -> ~chi_30 mu-)
     6.65063261E-08    2     1000035        13   # BR(~mu_R -> ~chi_40 mu-)
#
#         PDG            Width
DECAY   1000015     2.93086384E+01   # stau_1 decays
#          BR         NDA      ID1       ID2
     8.63896381E-01    2     1000022        15   # BR(~tau_1 -> ~chi_10  tau-)
     3.51118567E-02    2     1000023        15   # BR(~tau_1 -> ~chi_20  tau-)
     6.85951356E-02    2     1000025        15   # BR(~tau_1 -> ~chi_30  tau-)
     9.58020205E-05    2     1000035        15   # BR(~tau_1 -> ~chi_40  tau-)
     3.21091868E-02    2    -1000024        16   # BR(~tau_1 -> ~chi_1-  nu_tau)
     1.91638209E-04    2    -1000037        16   # BR(~tau_1 -> ~chi_2-  nu_tau)
#
#         PDG            Width
DECAY   2000015     3.13648504E+01   # stau_2 decays
#          BR         NDA      ID1       ID2
     2.02655303E-01    2     1000022        15   # BR(~tau_2 -> ~chi_10  tau-)
     1.75789616E-02    2     1000023        15   # BR(~tau_2 -> ~chi_20  tau-)
     3.00269334E-02    2     1000025        15   # BR(~tau_2 -> ~chi_30  tau-)
     2.49738595E-01    2     1000035        15   # BR(~tau_2 -> ~chi_40  tau-)
     2.85147350E-05    2    -1000024        16   # BR(~tau_2 -> ~chi_1-  nu_tau)
     4.99971692E-01    2    -1000037        16   # BR(~tau_2 -> ~chi_2-  nu_tau)
#
#         PDG            Width
DECAY   1000012     3.04329390E+01   # snu_eL decays
#          BR         NDA      ID1       ID2
     2.08520424E-01    2     1000022        12   # BR(~nu_eL -> ~chi_10 nu_e)
     7.25399618E-03    2     1000023        12   # BR(~nu_eL -> ~chi_20 nu_e)
     1.02200512E-02    2     1000025        12   # BR(~nu_eL -> ~chi_30 nu_e)
     2.57656333E-01    2     1000035        12   # BR(~nu_eL -> ~chi_40 nu_e)
     1.68210973E-03    2     1000024        11   # BR(~nu_eL -> ~chi_1+ e-)
     5.14667086E-01    2     1000037        11   # BR(~nu_eL -> ~chi_2+ e-)
#
#         PDG            Width
DECAY   1000014     3.04329390E+01   # snu_muL decays
#          BR         NDA      ID1       ID2
     2.08520424E-01    2     1000022        14   # BR(~nu_muL -> ~chi_10 nu_mu)
     7.25399618E-03    2     1000023        14   # BR(~nu_muL -> ~chi_20 nu_mu)
     1.02200512E-02    2     1000025        14   # BR(~nu_muL -> ~chi_30 nu_mu)
     2.57656333E-01    2     1000035        14   # BR(~nu_muL -> ~chi_40 nu_mu)
     1.68210973E-03    2     1000024        13   # BR(~nu_muL -> ~chi_1+ mu-)
     5.14667086E-01    2     1000037        13   # BR(~nu_muL -> ~chi_2+ mu-)
#
#         PDG            Width
DECAY   1000016     3.13675847E+01   # snu_tauL decays
#          BR         NDA      ID1       ID2
     2.02284839E-01    2     1000022        16   # BR(~nu_tauL -> ~chi_10 nu_tau)
     7.03706962E-03    2     1000023        16   # BR(~nu_tauL -> ~chi_20 nu_tau)
     9.91442643E-03    2     1000025        16   # BR(~nu_tauL -> ~chi_30 nu_tau)
     2.49884931E-01    2     1000035        16   # BR(~nu_tauL -> ~chi_40 nu_tau)
     3.17350851E-02    2     1000024        15   # BR(~nu_tauL -> ~chi_1+ tau-)
     4.99143649E-01    2     1000037        15   # BR(~nu_tauL -> ~chi_2+ tau-)
#
#         PDG            Width
DECAY   1000024     5.13284486E-02   # chargino1+ decays
#          BR         NDA      ID1       ID2
     1.00000000E+00    2     1000022        24   # BR(~chi_1+ -> ~chi_10  W+)
#
#         PDG            Width
DECAY   1000037     2.34306634E+01   # chargino2+ decays
#          BR         NDA      ID1       ID2
     2.53909867E-01    2     1000024        23   # BR(~chi_2+ -> ~chi_1+  Z )
     1.78442276E-03    2     1000022        24   # BR(~chi_2+ -> ~chi_10  W+)
     2.45133819E-01    2     1000023        24   # BR(~chi_2+ -> ~chi_20  W+)
     2.43618216E-01    2     1000025        24   # BR(~chi_2+ -> ~chi_30  W+)
     2.55498379E-01    2     1000024        25   # BR(~chi_2+ -> ~chi_1+  h )
     5.52959754E-05    2     1000022        37   # BR(~chi_2+ -> ~chi_10  H+)
#
#         PDG            Width
DECAY   1000022     0.00000000E+00   # neutralino1 decays
#
#         PDG            Width
DECAY   1000023     2.13699239E-02   # neutralino2 decays
#          BR         NDA      ID1       ID2
     1.00000000E+00    2     1000022        23   # BR(~chi_20 -> ~chi_10   Z )
#
#         PDG            Width
DECAY   1000025     2.52381601E-02   # neutralino3 decays
#          BR         NDA      ID1       ID2
     1.00000000E+00    2     1000022        23   # BR(~chi_30 -> ~chi_10   Z )
#
#         PDG            Width
DECAY   1000035     2.34414739E+01   # neutralino4 decays
#          BR         NDA      ID1       ID2
     1.72178975E-03    2     1000022        23   # BR(~chi_40 -> ~chi_10   Z )
     1.14740752E-01    2     1000023        23   # BR(~chi_40 -> ~chi_20   Z )
     1.37045473E-01    2     1000025        23   # BR(~chi_40 -> ~chi_30   Z )
     2.45633967E-01    2     1000024       -24   # BR(~chi_40 -> ~chi_1+   W-)
     2.45633967E-01    2    -1000024        24   # BR(~chi_40 -> ~chi_1-   W+)
     1.60861270E-04    2     1000022        25   # BR(~chi_40 -> ~chi_10   h )
     5.27130428E-05    2     1000022        35   # BR(~chi_40 -> ~chi_10   H )
     5.96900383E-06    2     1000022        36   # BR(~chi_40 -> ~chi_10   A )
     1.39377191E-01    2     1000023        25   # BR(~chi_40 -> ~chi_20   h )
     1.15627316E-01    2     1000025        25   # BR(~chi_40 -> ~chi_30   h )
#
#         PDG            Width
DECAY        25     4.10435304E-03   # h decays
#          BR         NDA      ID1       ID2
     6.06411716E-01    2           5        -5   # BR(h -> b       bb     )
     6.32170981E-02    2         -15        15   # BR(h -> tau+    tau-   )
     2.23811412E-04    2         -13        13   # BR(h -> mu+     mu-    )
     4.74448699E-04    2           3        -3   # BR(h -> s       sb     )
     2.05551796E-02    2           4        -4   # BR(h -> c       cb     )
     6.65182783E-02    2          21        21   # BR(h -> g       g      )
     2.28367918E-03    2          22        22   # BR(h -> gam     gam    )
     1.47669747E-03    2          22        23   # BR(h -> Z       gam    )
     2.08515023E-01    2          24       -24   # BR(h -> W+      W-     )
     2.48416240E-02    2          23        23   # BR(h -> Z       Z      )
     5.48244368E-03    2     1000022   1000022   # BR(h -> ~chi_10 ~chi_10)
#
#         PDG            Width
DECAY        35     8.82135858E+00   # H decays
#          BR         NDA      ID1       ID2
     3.58499547E-01    2           5        -5   # BR(H -> b       bb     )
     6.31327971E-02    2         -15        15   # BR(H -> tau+    tau-   )
     2.23242585E-04    2         -13        13   # BR(H -> mu+     mu-    )
     2.73661038E-04    2           3        -3   # BR(H -> s       sb     )
     1.53211586E-06    2           4        -4   # BR(H -> c       cb     )
     1.53070520E-01    2           6        -6   # BR(H -> t       tb     )
     5.09447174E-05    2          21        21   # BR(H -> g       g      )
     1.52020409E-07    2          22        22   # BR(H -> gam     gam    )
     9.02871427E-08    2          23        22   # BR(H -> Z       gam    )
     7.54333560E-05    2          24       -24   # BR(H -> W+      W-     )
     3.76689211E-05    2          23        23   # BR(H -> Z       Z      )
     2.67169673E-04    2          25        25   # BR(H -> h       h      )
    -2.20684255E-23    2          36        36   # BR(H -> A       A      )
     1.43418194E-18    2          23        36   # BR(H -> Z       A      )
     3.50466020E-03    2     1000024  -1000024   # BR(H -> ~chi_1+ ~chi_1-)
     6.14807211E-02    2     1000022   1000022   # BR(H -> ~chi_10 ~chi_10)
     1.02284398E-02    2     1000023   1000023   # BR(H -> ~chi_20 ~chi_20)
     2.02402754E-02    2     1000025   1000025   # BR(H -> ~chi_30 ~chi_30)
     1.20963843E-01    2     1000022   1000023   # BR(H -> ~chi_10 ~chi_20)
     1.78757322E-01    2     1000022   1000025   # BR(H -> ~chi_10 ~chi_30)
     2.91919800E-02    2     1000023   1000025   # BR(H -> ~chi_20 ~chi_30)
#
#         PDG            Width
DECAY        36     8.82630979E+00   # A decays
#          BR         NDA      ID1       ID2
     3.58421313E-01    2           5        -5   # BR(A -> b       bb     )
     6.30992023E-02    2         -15        15   # BR(A -> tau+    tau-   )
     2.23123479E-04    2         -13        13   # BR(A -> mu+     mu-    )
     2.73715117E-04    2           3        -3   # BR(A -> s       sb     )
     1.53725754E-06    2           4        -4   # BR(A -> c       cb     )
     1.53499465E-01    2           6        -6   # BR(A -> t       tb     )
     1.51879822E-04    2          21        21   # BR(A -> g       g      )
     5.21605704E-07    2          22        22   # BR(A -> gam     gam    )
     1.83760893E-07    2          23        22   # BR(A -> Z       gam    )
     7.51051559E-05    2          23        25   # BR(A -> Z       h      )
     3.62684203E-03    2     1000024  -1000024   # BR(A -> ~chi_1+ ~chi_1-)
     5.54371774E-02    2     1000022   1000022   # BR(A -> ~chi_10 ~chi_10)
     1.60509155E-02    2     1000023   1000023   # BR(A -> ~chi_20 ~chi_20)
     1.31565205E-02    2     1000025   1000025   # BR(A -> ~chi_30 ~chi_30)
     1.94889554E-01    2     1000022   1000023   # BR(A -> ~chi_10 ~chi_20)
     1.11293451E-01    2     1000022   1000025   # BR(A -> ~chi_10 ~chi_30)
     2.97994928E-02    2     1000023   1000025   # BR(A -> ~chi_20 ~chi_30)
#
#         PDG            Width
DECAY        37     8.76349696E+00   # H+ decays
#          BR         NDA      ID1       ID2
     5.74053422E-04    2           4        -5   # BR(H+ -> c       bb     )
     6.35829251E-02    2         -15        16   # BR(H+ -> tau+    nu_tau )
     2.24833959E-04    2         -13        14   # BR(H+ -> mu+     nu_mu  )
     3.67392246E-06    2           2        -5   # BR(H+ -> u       bb     )
     1.31924402E-05    2           2        -3   # BR(H+ -> u       sb     )
     2.72821515E-04    2           4        -3   # BR(H+ -> c       sb     )
     5.10195474E-01    2           6        -5   # BR(H+ -> t       bb     )
     7.58047067E-05    2          24        25   # BR(H+ -> W+      h      )
     1.08247241E-12    2          24        36   # BR(H+ -> W+      A      )
     3.87324991E-01    2     1000024   1000022   # BR(H+ -> ~chi_1+ ~chi_10)
     5.78242947E-03    2     1000024   1000023   # BR(H+ -> ~chi_1+ ~chi_20)
     3.19498005E-02    2     1000024   1000025   # BR(H+ -> ~chi_1+ ~chi_30)
