# SUSY Les Houches Accord 2 - MSSM spectrum + Decays
# SPheno v3.1.12 
# W. Porod, Comput. Phys. Commun. 153 (2003) 275-315, hep-ph/0301101
# in case of problems send email to porod@physik.uni-wuerzburg.de
# Created: 23.11.2012,  13:29
Block SPINFO         # Program information
     1   SPheno      # spectrum calculator
     2   v3.1.12     # version number
#
Block SPhenoINFO     # SPheno specific information
    1      2         # using 2-loop RGEs
    2      1         # using running masses for boundary conditions at mZ
Block MODSEL  # Model selection
    1    2    # mGMSB model
Block MINPAR  # Input parameters
    1    1.10000000E+05  # Lambda, scale of SUSY breaking
    2    2.50000000E+05  # M_M, messenger mass scale
    3    5.00000000E+01  # tanb at m_Z   
    4    1.00000000E+00  # Sign(mu)
    5    3.00000000E+00  # N_5 number of effective five-plets
    6    1.00000000E+00  # c_grav, Gravitino mass factor
Block gauge Q=  2.50000000E+05  # (GMSB scale)
   1    4.93514025E-01  # g'(Q)^DRbar
   2    6.48505925E-01  # g(Q)^DRbar
   3    9.38348791E-01  # g3(Q)^DRbar
Block SMINPUTS  # SM parameters
         1     1.27932537E+02  # alpha_em^-1(MZ)^MSbar
         2     1.16639000E-05  # G_mu [GeV^-2]
         3     1.17200000E-01  # alpha_s(MZ)^MSbar
         4     9.11876000E+01  # m_Z(pole)
         5     4.20000000E+00  # m_b(m_b), MSbar
         6     1.72500000E+02  # m_t(pole)
         7     1.77700000E+00  # m_tau(pole)
         8     0.00000000E+00  # m_nu_3
        11     5.10998910E-04  # m_e(pole)
        12     0.00000000E+00  # m_nu_1
        13     1.05658000E-01  # m_muon(pole)
        14     0.00000000E+00  # m_nu_2
        21     5.00000000E-03  # m_d(2 GeV), MSbar
        22     3.00000000E-03  # m_u(2 GeV), MSbar
        23     1.05000000E-01  # m_s(2 GeV), MSbar
        24     1.27000000E+00  # m_c(m_c), MSbar
Block gauge Q=  2.08387395E+03  # (SUSY scale)
   1    3.64665205E-01  # g'(Q)^DRbar
   2    6.39023769E-01  # g(Q)^DRbar
   3    1.02110259E+00  # g3(Q)^DRbar
Block Yu Q=  2.08387395E+03  # (SUSY scale)
  1  1     8.37769969E-06   # Y_u(Q)^DRbar
  2  2     3.54656199E-03   # Y_c(Q)^DRbar
  3  3     8.42633665E-01   # Y_t(Q)^DRbar
Block Yd Q=  2.08387395E+03  # (SUSY scale)
  1  1     5.84786388E-04   # Y_d(Q)^DRbar
  2  2     1.22805032E-02   # Y_s(Q)^DRbar
  3  3     5.93886037E-01   # Y_b(Q)^DRbar
Block Ye Q=  2.08387395E+03  # (SUSY scale)
  1  1     1.58617829E-04   # Y_e(Q)^DRbar
  2  2     3.27975320E-02   # Y_mu(Q)^DRbar
  3  3     5.53746755E-01   # Y_tau(Q)^DRbar
Block Au Q=  2.08387395E+03  # (SUSY scale)
  1  1    -6.64805177E+02   # A_u(Q)^DRbar
  2  2    -6.64801834E+02   # A_c(Q)^DRbar
  3  3    -6.21324753E+02   # A_t(Q)^DRbar
Block Ad Q=  2.08387395E+03  # (SUSY scale)
  1  1    -6.85023751E+02   # A_d(Q)^DRbar
  2  2    -6.85015364E+02   # A_s(Q)^DRbar
  3  3    -6.53916707E+02   # A_b(Q)^DRbar
Block Ae Q=  2.08387395E+03  # (SUSY scale)
  1  1    -5.49437926E+01   # A_e(Q)^DRbar
  2  2    -5.49371151E+01   # A_mu(Q)^DRbar
  3  3    -5.30493877E+01   # A_tau(Q)^DRbar
Block MSOFT Q=  2.08387395E+03  # soft SUSY breaking masses at Q
   1    4.76304680E+02  # M_1
   2    8.74634572E+02  # M_2
   3    2.24323862E+03  # M_3
  21   -1.21726710E+04  # M^2_(H,d)
  22   -4.61356523E+05  # M^2_(H,u)
  31    6.86687599E+02  # M_(L,11)
  32    6.86653762E+02  # M_(L,22)
  33    6.77059237E+02  # M_(L,33)
  34    3.32866061E+02  # M_(E,11)
  35    3.32723396E+02  # M_(E,22)
  36    2.89549880E+02  # M_(E,33)
  41    2.18382936E+03  # M_(Q,11)
  42    2.18381387E+03  # M_(Q,22)
  43    2.08314702E+03  # M_(Q,33)
  44    2.09460953E+03  # M_(U,11)
  45    2.09460705E+03  # M_(U,22)
  46    1.95214118E+03  # M_(U,33)
  47    2.08598966E+03  # M_(D,11)
  48    2.08595939E+03  # M_(D,22)
  49    2.01479123E+03  # M_(D,33)
Block MASS  # Mass spectrum
#   PDG code      mass          particle
         6     1.72500000E+02  # m_t(pole)
        23     9.11876000E+01  # m_Z(pole)
        24     8.03093721E+01  # W+
        15     1.77700000E+00  # m_tau(pole)
        25     1.19218002E+02  # h0
        35     6.94260827E+02  # H0
        36     6.94220541E+02  # A0
        37     6.99720065E+02  # H+
   1000001     2.27392020E+03  # ~d_L
   2000001     2.17077128E+03  # ~d_R
   1000002     2.27253527E+03  # ~u_L
   2000002     2.17871502E+03  # ~u_R
   1000003     2.27390237E+03  # ~s_L
   2000003     2.17073345E+03  # ~s_R
   1000004     2.27251652E+03  # ~c_L
   2000004     2.17871203E+03  # ~c_R
   1000005     2.07973925E+03  # ~b_1
   2000005     2.15604381E+03  # ~b_2
   1000006     2.01007716E+03  # ~t_1
   2000006     2.16037952E+03  # ~t_2
   1000011     7.02317455E+02  # ~e_L-
   2000011     3.46537112E+02  # ~e_R-
   1000012     6.97394557E+02  # ~nu_eL
   1000013     7.02305007E+02  # ~mu_L-
   2000013     3.46292600E+02  # ~mu_R-
   1000014     6.97346444E+02  # ~nu_muL
   1000015     2.71267260E+02  # ~tau_1-
   2000015     6.98266450E+02  # ~tau_2-
   1000016     6.84009839E+02  # ~nu_tauL
   1000021     2.35968624E+03  # ~g
   1000022     4.62882714E+02  # ~chi_10
   1000023     7.32364503E+02  # ~chi_20
   1000025    -7.51103321E+02  # ~chi_30
   1000035     9.13780060E+02  # ~chi_40
   1000024     7.30675441E+02  # ~chi_1+
   1000037     9.13929143E+02  # ~chi_2+
   1000039     6.60000000E-09  # ~G
# Higgs mixing
Block alpha # Effective Higgs mixing angle
          -2.12979572E-02   # alpha
Block Hmix Q=  2.08387395E+03  # Higgs mixing parameters
   1    7.43627809E+02  # mu
   2    4.91761776E+01  # tan[beta](Q)
   3    2.43518517E+02  # v(Q)
   4    4.41530074E+05  # m^2_A(Q)
Block stopmix # stop mixing matrix
   1  1     1.81597124E-01   # Re[R_st(1,1)]
   1  2     9.83373014E-01   # Re[R_st(1,2)]
   2  1    -9.83373014E-01   # Re[R_st(2,1)]
   2  2     1.81597124E-01   # Re[R_st(2,2)]
Block sbotmix # sbottom mixing matrix
   1  1     2.57434889E-01   # Re[R_sb(1,1)]
   1  2     9.66295647E-01   # Re[R_sb(1,2)]
   2  1    -9.66295647E-01   # Re[R_sb(2,1)]
   2  2     2.57434889E-01   # Re[R_sb(2,2)]
Block staumix # stau mixing matrix
   1  1     1.76079109E-01   # Re[R_sta(1,1)]
   1  2     9.84376019E-01   # Re[R_sta(1,2)]
   2  1    -9.84376019E-01   # Re[R_sta(2,1)]
   2  2     1.76079109E-01   # Re[R_sta(2,2)]
Block Nmix # neutralino mixing matrix
   1  1    -9.92978834E-01   # Re[N(1,1)]
   1  2     1.18114279E-02   # Re[N(1,2)]
   1  3    -9.93509742E-02   # Re[N(1,3)]
   1  4     6.31102940E-02   # Re[N(1,4)]
   2  1     1.12691274E-01   # Re[N(2,1)]
   2  2     3.26777257E-01   # Re[N(2,2)]
   2  3    -6.70379105E-01   # Re[N(2,3)]
   2  4     6.56589032E-01   # Re[N(2,4)]
   3  1     2.51806443E-02   # Re[N(3,1)]
   3  2    -3.33535875E-02   # Re[N(3,2)]
   3  3    -7.05221115E-01   # Re[N(3,3)]
   3  4    -7.07754656E-01   # Re[N(3,4)]
   4  1    -2.56835939E-02   # Re[N(4,1)]
   4  2     9.44438803E-01   # Re[N(4,2)]
   4  3     2.08289269E-01   # Re[N(4,3)]
   4  4    -2.52964979E-01   # Re[N(4,4)]
Block Umix # chargino mixing matrix
   1  1    -2.93840215E-01   # Re[U(1,1)]
   1  2     9.55854554E-01   # Re[U(1,2)]
   2  1     9.55854554E-01   # Re[U(2,1)]
   2  2     2.93840215E-01   # Re[U(2,2)]
Block Vmix # chargino mixing matrix
   1  1    -3.56824064E-01   # Re[V(1,1)]
   1  2     9.34171605E-01   # Re[V(1,2)]
   2  1     9.34171605E-01   # Re[V(2,1)]
   2  2     3.56824064E-01   # Re[V(2,2)]
DECAY   2000011     2.83336205E-06   # ~e^-_R
#    BR                NDA      ID1      ID2
     4.63993018E-05    2     1000039        11   # BR(~e^-_R -> ~G e^-)
#    BR                NDA      ID1      ID2       ID3
     6.69986763E-14    3     2000013        11       -13   # BR(~e^-_R -> ~mu^-_R e^- mu^+)
     2.15448202E-13    3    -2000013        11        13   # BR(~e^-_R -> ~mu^+_R e^- mu^-)
     2.02820633E-01    3     1000015        11       -15   # BR(~e^-_R -> ~tau^-_1 e^- tau^+)
     7.97132968E-01    3    -1000015        11        15   # BR(~e^-_R -> ~tau^+_1 e^- tau^-)
DECAY   1000011     2.80962168E-01   # ~e^-_L
#    BR                NDA      ID1      ID2
     9.99999012E-01    2     1000022        11   # BR(~e^-_L -> chi^0_1 e^-)
     4.74284950E-07    2     2000011        23   # BR(~e^-_L -> ~e^-_R Z)
     4.97625437E-07    2     2000011        25   # BR(~e^-_L -> ~e^-_R h^0)
     1.59986826E-08    2     1000039        11   # BR(~e^-_L -> ~G e^-)
DECAY   2000013     2.79652359E-06   # ~mu^-_R
#    BR                NDA      ID1      ID2
     4.68448839E-05    2     1000039        13   # BR(~mu^-_R -> ~G mu^-)
#    BR                NDA      ID1      ID2       ID3
     2.02144736E-01    3     1000015        13       -15   # BR(~mu^-_R -> ~tau^-_1 mu^- tau^+)
     7.97808419E-01    3    -1000015        13        15   # BR(~mu^-_R -> ~tau^+_1 mu^- tau^-)
DECAY   1000013     2.92694807E-01   # ~mu^-_L
#    BR                NDA      ID1      ID2
     9.60101564E-01    2     1000022        13   # BR(~mu^-_L -> chi^0_1 mu^-)
     1.94754079E-02    2     2000013        23   # BR(~mu^-_L -> ~mu^-_R Z)
     2.04230125E-02    2     2000013        25   # BR(~mu^-_L -> ~mu^-_R h^0)
     1.53560149E-08    2     1000039        13   # BR(~mu^-_L -> ~G mu^-)
DECAY   1000015     3.86346617E-11   # ~tau^-_1
#    BR                NDA      ID1      ID2
     1.00000000E+00    2     1000039        15   # BR(~tau^-_1 -> ~G tau^-)
DECAY   2000015     3.88018618E+00   # ~tau^-_2
#    BR                NDA      ID1      ID2
     7.53337601E-02    2     1000022        15   # BR(~tau^-_2 -> chi^0_1 tau^-)
     4.80681569E-01    2     1000015        23   # BR(~tau^-_2 -> ~tau^-_1 Z)
     4.43984670E-01    2     1000015        25   # BR(~tau^-_2 -> ~tau^-_1 h^0)
     1.12539977E-09    2     1000039        15   # BR(~tau^-_2 -> ~G tau^-)
DECAY   1000012     2.96691813E-01   # ~nu_e
#    BR                NDA      ID1      ID2
     9.99999121E-01    2     1000022        12   # BR(~nu_e -> chi^0_1 nu_e)
     8.63943218E-07    2     2000011        24   # BR(~nu_e -> ~e^-_R W^+)
     1.46268889E-08    2     1000039        12   # BR(~nu_e -> ~G nu_e)
DECAY   1000014     3.07569970E-01   # ~nu_mu
#    BR                NDA      ID1      ID2
     9.64354920E-01    2     1000022        14   # BR(~nu_mu -> chi^0_1 nu_mu)
     3.56450656E-02    2     2000013        24   # BR(~nu_mu -> ~mu^-_R W^+)
     1.41046977E-08    2     1000039        14   # BR(~nu_mu -> ~G nu_mu)
DECAY   1000016     3.76532357E+00   # ~nu_tau
#    BR                NDA      ID1      ID2
     7.25484042E-02    2     1000022        16   # BR(~nu_tau -> chi^0_1 nu_tau)
     9.27451595E-01    2     1000015        24   # BR(~nu_tau -> ~tau^-_1 W^+)
     1.04610239E-09    2     1000039        16   # BR(~nu_tau -> ~G nu_tau)
DECAY   2000001     1.16046667E+00   # ~d_R
#    BR                NDA      ID1      ID2
     9.87979679E-01    2     1000022         1   # BR(~d_R -> chi^0_1 d)
     1.09725492E-02    2     1000023         1   # BR(~d_R -> chi^0_2 d)
     5.45147894E-04    2     1000025         1   # BR(~d_R -> chi^0_3 d)
     4.91174044E-04    2     1000035         1   # BR(~d_R -> chi^0_4 d)
     1.02525644E-05    2    -1000024         2   # BR(~d_R -> chi^-_1 u)
     1.05007272E-07    2    -1000037         2   # BR(~d_R -> chi^-_2 u)
     1.09270372E-06    2     1000039         1   # BR(~d_R -> ~G d)
DECAY   1000001     2.00452736E+01   # ~d_L
#    BR                NDA      ID1      ID2
     1.70535579E-02    2     1000022         1   # BR(~d_L -> chi^0_1 d)
     3.45103142E-02    2     1000023         1   # BR(~d_L -> chi^0_2 d)
     5.32405342E-04    2     1000025         1   # BR(~d_L -> chi^0_3 d)
     2.91976631E-01    2     1000035         1   # BR(~d_L -> chi^0_4 d)
     6.39867732E-02    2    -1000024         2   # BR(~d_L -> chi^-_1 u)
     5.91940239E-01    2    -1000037         2   # BR(~d_L -> chi^-_2 u)
     2.85808520E-13    2     2000002       -24   # BR(~d_L -> ~u_R W^-)
     4.16692077E-10    2     2000001        23   # BR(~d_L -> ~d_R Z)
     7.97864003E-08    2     1000039         1   # BR(~d_L -> ~G d)
DECAY   2000003     1.17089957E+00   # ~s_R
#    BR                NDA      ID1      ID2
     9.79275145E-01    2     1000022         3   # BR(~s_R -> chi^0_1 s)
     1.30488476E-02    2     1000023         3   # BR(~s_R -> chi^0_2 s)
     2.63973465E-03    2     1000025         3   # BR(~s_R -> chi^0_3 s)
     5.08452540E-04    2     1000035         3   # BR(~s_R -> chi^0_4 s)
     4.48081750E-03    2    -1000024         4   # BR(~s_R -> chi^-_1 c)
     4.59202580E-05    2    -1000037         4   # BR(~s_R -> chi^-_2 c)
     1.08287319E-06    2     1000039         3   # BR(~s_R -> ~G s)
DECAY   1000003     2.00504875E+01   # ~s_L
#    BR                NDA      ID1      ID2
     1.70477647E-02    2     1000022         3   # BR(~s_L -> chi^0_1 s)
     3.46098852E-02    2     1000023         3   # BR(~s_L -> chi^0_2 s)
     6.68702279E-04    2     1000025         3   # BR(~s_L -> chi^0_3 s)
     2.91916141E-01    2     1000035         3   # BR(~s_L -> chi^0_4 s)
     6.39580748E-02    2    -1000024         4   # BR(~s_L -> chi^-_1 c)
     5.91799117E-01    2    -1000037         4   # BR(~s_L -> chi^-_2 c)
     5.11405394E-08    2     2000004       -24   # BR(~s_L -> ~c_R W^-)
     1.84130753E-07    2     2000003        23   # BR(~s_L -> ~s_R Z)
     7.97625245E-08    2     1000039         3   # BR(~s_L -> ~G s)
DECAY   1000005     2.47115617E+01   # ~b_1
#    BR                NDA      ID1      ID2
     5.88054114E-02    2     1000022         5   # BR(~b_1 -> chi^0_1 b)
     2.35756698E-01    2     1000023         5   # BR(~b_1 -> chi^0_2 b)
     2.16609209E-01    2     1000025         5   # BR(~b_1 -> chi^0_3 b)
     9.18326804E-04    2     1000035         5   # BR(~b_1 -> chi^0_4 b)
     4.81549903E-01    2    -1000024         6   # BR(~b_1 -> chi^-_1 t)
     6.36041082E-03    2    -1000037         6   # BR(~b_1 -> chi^-_2 t)
     4.14192204E-08    2     1000039         5   # BR(~b_1 -> ~G b)
DECAY   2000005     5.14743106E+01   # ~b_2
#    BR                NDA      ID1      ID2
     4.10719124E-03    2     1000022         5   # BR(~b_2 -> chi^0_1 b)
     9.96244565E-02    2     1000023         5   # BR(~b_2 -> chi^0_2 b)
     1.15811003E-01    2     1000025         5   # BR(~b_2 -> chi^0_3 b)
     1.20015155E-01    2     1000035         5   # BR(~b_2 -> chi^0_4 b)
     3.70248478E-01    2    -1000024         6   # BR(~b_2 -> chi^-_1 t)
     2.85274293E-01    2    -1000037         6   # BR(~b_2 -> chi^-_2 t)
     4.91939848E-03    2     1000006       -24   # BR(~b_2 -> ~t_1 W^-)
     2.38097883E-08    2     1000039         5   # BR(~b_2 -> ~G b)
DECAY   2000002     4.66205409E+00   # ~u_R
#    BR                NDA      ID1      ID2
     9.87985828E-01    2     1000022         2   # BR(~u_R -> chi^0_1 u)
     1.09805355E-02    2     1000023         2   # BR(~u_R -> chi^0_2 u)
     5.41032249E-04    2     1000025         2   # BR(~u_R -> chi^0_3 u)
     4.92327056E-04    2     1000035         2   # BR(~u_R -> chi^0_4 u)
     5.30720058E-10    2     1000024         1   # BR(~u_R -> chi^+_1 d)
     8.96636488E-12    2     1000037         1   # BR(~u_R -> chi^+_2 d)
     2.77006259E-07    2     1000039         2   # BR(~u_R -> ~G u)
DECAY   1000002     2.01083697E+01   # ~u_L
#    BR                NDA      ID1      ID2
     1.32241473E-02    2     1000022         2   # BR(~u_L -> chi^0_1 u)
     4.47006739E-02    2     1000023         2   # BR(~u_L -> chi^0_2 u)
     2.97180332E-04    2     1000025         2   # BR(~u_L -> chi^0_3 u)
     2.84792260E-01    2     1000035         2   # BR(~u_L -> chi^0_4 u)
     9.39783214E-02    2     1000024         1   # BR(~u_L -> chi^+_1 d)
     5.63007336E-01    2     1000037         1   # BR(~u_L -> chi^+_2 d)
     1.76193179E-09    2     2000001        24   # BR(~u_L -> ~d_R W^+)
     1.17870990E-14    2     2000002        23   # BR(~u_L -> ~u_R Z)
     7.92941328E-08    2     1000039         2   # BR(~u_L -> ~G u)
DECAY   2000004     4.66292761E+00   # ~c_R
#    BR                NDA      ID1      ID2
     9.87798386E-01    2     1000022         4   # BR(~c_R -> chi^0_1 c)
     1.10241638E-02    2     1000023         4   # BR(~c_R -> chi^0_2 c)
     5.87543052E-04    2     1000025         4   # BR(~c_R -> chi^0_3 c)
     4.92927747E-04    2     1000035         4   # BR(~c_R -> chi^0_4 c)
     9.50970529E-05    2     1000024         3   # BR(~c_R -> chi^+_1 s)
     1.60589247E-06    2     1000037         3   # BR(~c_R -> chi^+_2 s)
     2.76952090E-07    2     1000039         4   # BR(~c_R -> ~G c)
DECAY   1000004     2.01139176E+01   # ~c_L
#    BR                NDA      ID1      ID2
     1.32205115E-02    2     1000022         4   # BR(~c_L -> chi^0_1 c)
     4.46956759E-02    2     1000023         4   # BR(~c_L -> chi^0_2 c)
     3.08132455E-04    2     1000025         4   # BR(~c_L -> chi^0_3 c)
     2.84712323E-01    2     1000035         4   # BR(~c_L -> chi^0_4 c)
     9.41957340E-02    2     1000024         3   # BR(~c_L -> chi^+_1 s)
     5.62866764E-01    2     1000037         3   # BR(~c_L -> chi^+_2 s)
     7.77661978E-07    2     2000003        24   # BR(~c_L -> ~s_R W^+)
     2.09331071E-09    2     2000004        23   # BR(~c_L -> ~c_R Z)
     7.92688929E-08    2     1000039         4   # BR(~c_L -> ~G c)
DECAY   1000006     4.63592878E+01   # ~t_1
#    BR                NDA      ID1      ID2
     3.56695367E-04    2     1000022         4   # BR(~t_1 -> chi^0_1 c)
     9.10110738E-02    2     1000022         6   # BR(~t_1 -> chi^0_1 t)
     1.15686216E-03    2     1000023         4   # BR(~t_1 -> chi^0_2 c)
     2.07762049E-01    2     1000023         6   # BR(~t_1 -> chi^0_2 t)
     2.31995689E-01    2     1000025         6   # BR(~t_1 -> chi^0_3 t)
     9.37049746E-03    2     1000035         6   # BR(~t_1 -> chi^0_4 t)
     4.38763418E-01    2     1000024         5   # BR(~t_1 -> chi^+_1 b)
     1.95652662E-02    2     1000037         5   # BR(~t_1 -> chi^+_2 b)
     1.80780083E-08    2     1000039         6   # BR(~t_1 -> ~G t)
#    BR                NDA      ID1      ID2       ID3
     1.84313598E-05    3     1000022        24         5   # BR(~t_1 -> chi^0_1 W^+ b)
DECAY   2000006     5.29578861E+01   # ~t_2
#    BR                NDA      ID1      ID2
     5.70815129E-03    2     1000022         6   # BR(~t_2 -> chi^0_1 t)
     1.89492260E-01    2     1000023         6   # BR(~t_2 -> chi^0_2 t)
     2.12295081E-01    2     1000025         6   # BR(~t_2 -> chi^0_3 t)
     1.44251357E-01    2     1000035         6   # BR(~t_2 -> chi^0_4 t)
     2.02471449E-01    2     1000024         5   # BR(~t_2 -> chi^+_1 b)
     2.41580574E-01    2     1000037         5   # BR(~t_2 -> chi^+_2 b)
     2.23834314E-06    2     1000005        24   # BR(~t_2 -> ~b_1 W^+)
     2.39071518E-03    2     1000006        23   # BR(~t_2 -> ~t_1 Z)
     1.80815097E-03    2     1000006        25   # BR(~t_2 -> ~t_1 h^0)
     2.27862805E-08    2     1000039         6   # BR(~t_2 -> ~G t)
DECAY   1000024     2.04217748E+00   # chi^+_1
#    BR                NDA      ID1      ID2
     5.61269788E-08    2    -2000011        12   # BR(chi^+_1 -> ~e^+_R nu_e)
     7.26989955E-04    2    -1000011        12   # BR(chi^+_1 -> ~e^+_L nu_e)
     2.40121892E-03    2    -2000013        14   # BR(chi^+_1 -> ~mu^+_R nu_mu)
     7.24739299E-04    2    -1000013        14   # BR(chi^+_1 -> ~mu^+_L nu_mu)
     8.12238175E-01    2    -1000015        16   # BR(chi^+_1 -> ~tau^+_1 nu_tau)
     2.24877896E-04    2    -2000015        16   # BR(chi^+_1 -> ~tau^+_2 nu_tau)
     1.46644005E-03    2     1000012       -11   # BR(chi^+_1 -> ~nu_e e^+)
     1.49968594E-03    2     1000014       -13   # BR(chi^+_1 -> ~nu_mu mu^+)
     1.85793086E-02    2     1000016       -15   # BR(chi^+_1 -> ~nu_tau tau^+)
     1.61994989E-01    2     1000022        24   # BR(chi^+_1 -> chi^0_1 W^+)
#    BR                NDA      ID1      ID2       ID3
     2.89515615E-09    3     1000022        -1         2   # BR(chi^+_1 -> chi^0_1 d_bar u)
     6.50833478E-09    3     1000022        -3         4   # BR(chi^+_1 -> chi^0_1 s_bar c)
     1.22038150E-04    3     1000022        -5         6   # BR(chi^+_1 -> chi^0_1 b_bar t)
     2.85900363E-12    3     1000022       -11        12   # BR(chi^+_1 -> chi^0_1 e^+ nu_e)
     1.21985603E-07    3     1000022       -13        14   # BR(chi^+_1 -> chi^0_1 mu^+ nu_mu)
     2.13499855E-05    3     1000022       -15        16   # BR(chi^+_1 -> chi^0_1 tau^+ nu_tau)
DECAY   1000037     6.25089591E+00   # chi^+_2
#    BR                NDA      ID1      ID2
     1.73298595E-10    2    -2000011        12   # BR(chi^+_2 -> ~e^+_R nu_e)
     9.09771873E-02    2    -1000011        12   # BR(chi^+_2 -> ~e^+_L nu_e)
     7.42358585E-06    2    -2000013        14   # BR(chi^+_2 -> ~mu^+_R nu_mu)
     9.10074419E-02    2    -1000013        14   # BR(chi^+_2 -> ~mu^+_L nu_mu)
     3.34854440E-03    2    -1000015        16   # BR(chi^+_2 -> ~tau^+_1 nu_tau)
     9.99948696E-02    2    -2000015        16   # BR(chi^+_2 -> ~tau^+_2 nu_tau)
     9.04331774E-02    2     1000012       -11   # BR(chi^+_2 -> ~nu_e e^+)
     9.04899200E-02    2     1000014       -13   # BR(chi^+_2 -> ~nu_mu mu^+)
     1.07235877E-01    2     1000016       -15   # BR(chi^+_2 -> ~nu_tau tau^+)
     3.39794025E-03    2     1000022        24   # BR(chi^+_2 -> chi^0_1 W^+)
     1.27185102E-01    2     1000023        24   # BR(chi^+_2 -> chi^0_2 W^+)
     9.38480258E-02    2     1000025        24   # BR(chi^+_2 -> chi^0_3 W^+)
     1.16504961E-01    2     1000024        23   # BR(chi^+_2 -> chi^+_1 Z)
     8.55327797E-02    2     1000024        25   # BR(chi^+_2 -> chi^+_1 h^0)
#    BR                NDA      ID1      ID2       ID3
     3.15070729E-09    3     1000024         2        -2   # BR(chi^+_2 -> chi^+_1 u u_bar)
     3.14574233E-09    3     1000024         4        -4   # BR(chi^+_2 -> chi^+_1 c c_bar)
     4.45296807E-09    3     1000024         1        -1   # BR(chi^+_2 -> chi^+_1 d d_bar)
     5.65252700E-09    3     1000024         3        -3   # BR(chi^+_2 -> chi^+_1 s s_bar)
     2.84537939E-06    3     1000024         5        -5   # BR(chi^+_2 -> chi^+_1 b b_bar)
     1.10945258E-06    3     1000024        11       -11   # BR(chi^+_2 -> chi^+_1 e^- e^+)
     1.12522423E-06    3     1000024        13       -13   # BR(chi^+_2 -> chi^+_1 mu^- mu^+)
     5.37908083E-06    3     1000024        15       -15   # BR(chi^+_2 -> chi^+_1 tau^- tau^+)
     1.90233967E-06    3     1000024        12       -12   # BR(chi^+_2 -> chi^+_1 nu_e nu_bar_e)
     8.69758668E-08    3     1000022        -1         2   # BR(chi^+_2 -> chi^0_1 d_bar u)
     8.70020675E-08    3     1000022        -3         4   # BR(chi^+_2 -> chi^0_1 s_bar c)
     1.86466917E-05    3     1000022        -5         6   # BR(chi^+_2 -> chi^0_1 b_bar t)
     2.95847971E-14    3     1000022       -11        12   # BR(chi^+_2 -> chi^0_1 e^+ nu_e)
     1.26502266E-09    3     1000022       -13        14   # BR(chi^+_2 -> chi^0_1 mu^+ nu_mu)
     3.63914201E-07    3     1000022       -15        16   # BR(chi^+_2 -> chi^0_1 tau^+ nu_tau)
     1.86649384E-09    3     1000023        -1         2   # BR(chi^+_2 -> chi^0_2 d_bar u)
     2.57734972E-09    3     1000023        -3         4   # BR(chi^+_2 -> chi^0_2 s_bar c)
     6.20896149E-08    3     1000023        -5         6   # BR(chi^+_2 -> chi^0_2 b_bar t)
     6.29211363E-07    3     1000023       -11        12   # BR(chi^+_2 -> chi^0_2 e^+ nu_e)
     6.36092693E-07    3     1000023       -13        14   # BR(chi^+_2 -> chi^0_2 mu^+ nu_mu)
     2.53410358E-06    3     1000023       -15        16   # BR(chi^+_2 -> chi^0_2 tau^+ nu_tau)
     3.56390375E-11    3     1000025        -1         2   # BR(chi^+_2 -> chi^0_3 d_bar u)
     3.91677934E-10    3     1000025        -3         4   # BR(chi^+_2 -> chi^0_3 s_bar c)
     6.70432184E-09    3     1000025       -11        12   # BR(chi^+_2 -> chi^0_3 e^+ nu_e)
     1.13539518E-08    3     1000025       -13        14   # BR(chi^+_2 -> chi^0_3 mu^+ nu_mu)
     1.30144887E-06    3     1000025       -15        16   # BR(chi^+_2 -> chi^0_3 tau^+ nu_tau)
DECAY   1000022     1.98342004E+00   # chi^0_1
#    BR                NDA      ID1      ID2
     1.17603111E-01    2     2000011       -11   # BR(chi^0_1 -> ~e^-_R e^+)
     1.17603111E-01    2    -2000011        11   # BR(chi^0_1 -> ~e^+_R e^-)
     1.18028531E-01    2     2000013       -13   # BR(chi^0_1 -> ~mu^-_R mu^+)
     1.18028531E-01    2    -2000013        13   # BR(chi^0_1 -> ~mu^+_R mu^-)
     2.64368358E-01    2     1000015       -15   # BR(chi^0_1 -> ~tau^-_1 tau^+)
     2.64368358E-01    2    -1000015        15   # BR(chi^0_1 -> ~tau^+_1 tau^-)
     2.06794533E-10    2     1000039        22   # BR(chi^0_1 -> ~G photon)
     6.21311633E-11    2     1000039        23   # BR(chi^0_1 -> ~G Z)
     1.19327879E-12    2     1000039        25   # BR(chi^0_1 -> ~G h^0)
DECAY   1000023     2.16746838E+00   # chi^0_2
#    BR                NDA      ID1      ID2
     6.83779673E-03    2     2000011       -11   # BR(chi^0_2 -> ~e^-_R e^+)
     6.83779673E-03    2    -2000011        11   # BR(chi^0_2 -> ~e^+_R e^-)
     6.77997863E-04    2     1000011       -11   # BR(chi^0_2 -> ~e^-_L e^+)
     6.77997863E-04    2    -1000011        11   # BR(chi^0_2 -> ~e^+_L e^-)
     7.94918847E-03    2     2000013       -13   # BR(chi^0_2 -> ~mu^-_R mu^+)
     7.94918847E-03    2    -2000013        13   # BR(chi^0_2 -> ~mu^+_R mu^-)
     6.88293272E-04    2     1000013       -13   # BR(chi^0_2 -> ~mu^-_L mu^+)
     6.88293272E-04    2    -1000013        13   # BR(chi^0_2 -> ~mu^+_L mu^-)
     3.93684331E-01    2     1000015       -15   # BR(chi^0_2 -> ~tau^-_1 tau^+)
     3.93684331E-01    2    -1000015        15   # BR(chi^0_2 -> ~tau^+_1 tau^-)
     4.36652162E-03    2     2000015       -15   # BR(chi^0_2 -> ~tau^-_2 tau^+)
     4.36652162E-03    2    -2000015        15   # BR(chi^0_2 -> ~tau^+_2 tau^-)
     4.10809791E-04    2     1000012       -12   # BR(chi^0_2 -> ~nu_e nu_bar_e)
     4.10809791E-04    2    -1000012        12   # BR(chi^0_2 -> ~nu^*_e nu_e)
     4.11913262E-04    2     1000014       -14   # BR(chi^0_2 -> ~nu_mu nu_bar_mu)
     4.11913262E-04    2    -1000014        14   # BR(chi^0_2 -> ~nu^*_mu nu_mu)
     7.70828934E-04    2     1000016       -16   # BR(chi^0_2 -> ~nu_tau nu_bar_tau)
     7.70828934E-04    2    -1000016        16   # BR(chi^0_2 -> ~nu^*_tau nu_tau)
     9.22650859E-03    2     1000022        23   # BR(chi^0_2 -> chi^0_1 Z)
     1.59144732E-01    2     1000022        25   # BR(chi^0_2 -> chi^0_1 h^0)
     1.72645220E-10    2     1000039        22   # BR(chi^0_2 -> ~G photon)
     2.92523353E-11    2     1000039        23   # BR(chi^0_2 -> ~G Z)
     1.14953356E-09    2     1000039        25   # BR(chi^0_2 -> ~G h^0)
     2.08709765E-07    2     1000022        22   # BR(chi^0_2 -> chi^0_1 photon)
#    BR                NDA      ID1      ID2       ID3
     3.31816059E-09    3     1000022         2        -2   # BR(chi^0_2 -> chi^0_1 u u_bar)
     3.32198028E-09    3     1000022         4        -4   # BR(chi^0_2 -> chi^0_1 c c_bar)
     1.53569387E-09    3     1000022         1        -1   # BR(chi^0_2 -> chi^0_1 d d_bar)
     5.58469299E-09    3     1000022         3        -3   # BR(chi^0_2 -> chi^0_1 s s_bar)
     9.58580841E-06    3     1000022         5        -5   # BR(chi^0_2 -> chi^0_1 b b_bar)
     1.24305823E-06    3     1000022        11       -11   # BR(chi^0_2 -> chi^0_1 e^- e^+)
     1.35047083E-06    3     1000022        13       -13   # BR(chi^0_2 -> chi^0_1 mu^- mu^+)
     2.09951696E-05    3     1000022        15       -15   # BR(chi^0_2 -> chi^0_1 tau^- tau^+)
     3.08832871E-12    3     1000024         1        -2   # BR(chi^0_2 -> chi^+_1 d u_bar)
     3.08832871E-12    3    -1000024        -1         2   # BR(chi^0_2 -> chi^-_1 d_bar u)
     9.70508416E-14    3     1000024         3        -4   # BR(chi^0_2 -> chi^+_1 s c_bar)
     9.70508416E-14    3    -1000024        -3         4   # BR(chi^0_2 -> chi^-_1 s_bar c)
     1.00128648E-12    3     1000024        11       -12   # BR(chi^0_2 -> chi^+_1 e^- nu_bar_e)
     1.00128648E-12    3    -1000024       -11        12   # BR(chi^0_2 -> chi^-_1 e^+ nu_e)
     9.82037155E-13    3     1000024        13       -14   # BR(chi^0_2 -> chi^+_1 mu^- nu_bar_mu)
     9.82037155E-13    3    -1000024       -13        14   # BR(chi^0_2 -> chi^-_1 mu^+ nu_mu)
DECAY   1000025     2.12937110E+00   # chi^0_3
#    BR                NDA      ID1      ID2
     3.66634243E-04    2     2000011       -11   # BR(chi^0_3 -> ~e^-_R e^+)
     3.66634243E-04    2    -2000011        11   # BR(chi^0_3 -> ~e^+_R e^-)
     4.07920718E-06    2     1000011       -11   # BR(chi^0_3 -> ~e^-_L e^+)
     4.07920718E-06    2    -1000011        11   # BR(chi^0_3 -> ~e^+_L e^-)
     1.50634497E-03    2     2000013       -13   # BR(chi^0_3 -> ~mu^-_R mu^+)
     1.50634497E-03    2    -2000013        13   # BR(chi^0_3 -> ~mu^+_R mu^-)
     3.44325756E-05    2     1000013       -13   # BR(chi^0_3 -> ~mu^-_L mu^+)
     3.44325756E-05    2    -1000013        13   # BR(chi^0_3 -> ~mu^+_L mu^-)
     3.96674368E-01    2     1000015       -15   # BR(chi^0_3 -> ~tau^-_1 tau^+)
     3.96674368E-01    2    -1000015        15   # BR(chi^0_3 -> ~tau^+_1 tau^-)
     1.01824002E-02    2     2000015       -15   # BR(chi^0_3 -> ~tau^-_2 tau^+)
     1.01824002E-02    2    -2000015        15   # BR(chi^0_3 -> ~tau^+_2 tau^-)
     3.10269000E-05    2     1000012       -12   # BR(chi^0_3 -> ~nu_e nu_bar_e)
     3.10269000E-05    2    -1000012        12   # BR(chi^0_3 -> ~nu^*_e nu_e)
     3.10804488E-05    2     1000014       -14   # BR(chi^0_3 -> ~nu_mu nu_bar_mu)
     3.10804488E-05    2    -1000014        14   # BR(chi^0_3 -> ~nu^*_mu nu_mu)
     4.75275373E-05    2     1000016       -16   # BR(chi^0_3 -> ~nu_tau nu_bar_tau)
     4.75275373E-05    2    -1000016        16   # BR(chi^0_3 -> ~nu^*_tau nu_tau)
     1.74191848E-01    2     1000022        23   # BR(chi^0_3 -> chi^0_1 Z)
     8.00950116E-03    2     1000022        25   # BR(chi^0_3 -> chi^0_1 h^0)
     8.41824153E-14    2     1000039        22   # BR(chi^0_3 -> ~G photon)
     2.75226493E-10    2     1000039        23   # BR(chi^0_3 -> ~G Z)
     1.41569709E-09    2     1000039        25   # BR(chi^0_3 -> ~G h^0)
     9.56432619E-08    2     1000022        22   # BR(chi^0_3 -> chi^0_1 photon)
     2.04019098E-09    2     1000023        22   # BR(chi^0_3 -> chi^0_2 photon)
#    BR                NDA      ID1      ID2       ID3
     5.15891325E-11    3     1000022         2        -2   # BR(chi^0_3 -> chi^0_1 u u_bar)
     6.00551773E-11    3     1000022         4        -4   # BR(chi^0_3 -> chi^0_1 c c_bar)
     2.62339927E-11    3     1000022         1        -1   # BR(chi^0_3 -> chi^0_1 d d_bar)
     5.47544887E-09    3     1000022         3        -3   # BR(chi^0_3 -> chi^0_1 s s_bar)
     1.28629288E-05    3     1000022         5        -5   # BR(chi^0_3 -> chi^0_1 b b_bar)
     2.98448924E-08    3     1000022        11       -11   # BR(chi^0_3 -> chi^0_1 e^- e^+)
     1.67899075E-07    3     1000022        13       -13   # BR(chi^0_3 -> chi^0_1 mu^- mu^+)
     2.52183199E-05    3     1000022        15       -15   # BR(chi^0_3 -> chi^0_1 tau^- tau^+)
     1.12475778E-07    3     1000023         2        -2   # BR(chi^0_3 -> chi^0_2 u u_bar)
     1.09351676E-07    3     1000023         4        -4   # BR(chi^0_3 -> chi^0_2 c c_bar)
     1.45961271E-07    3     1000023         1        -1   # BR(chi^0_3 -> chi^0_2 d d_bar)
     1.45924536E-07    3     1000023         3        -3   # BR(chi^0_3 -> chi^0_2 s s_bar)
     9.33890200E-08    3     1000023         5        -5   # BR(chi^0_3 -> chi^0_2 b b_bar)
     3.35703056E-08    3     1000023        11       -11   # BR(chi^0_3 -> chi^0_2 e^- e^+)
     3.35478771E-08    3     1000023        13       -13   # BR(chi^0_3 -> chi^0_2 mu^- mu^+)
     2.72625219E-08    3     1000023        15       -15   # BR(chi^0_3 -> chi^0_2 tau^- tau^+)
     2.00543739E-07    3     1000023        12       -12   # BR(chi^0_3 -> chi^0_2 nu_e nu_bar_e)
     6.02832300E-07    3     1000024         1        -2   # BR(chi^0_3 -> chi^+_1 d u_bar)
     6.02832300E-07    3    -1000024        -1         2   # BR(chi^0_3 -> chi^-_1 d_bar u)
     5.91653679E-07    3     1000024         3        -4   # BR(chi^0_3 -> chi^+_1 s c_bar)
     5.91653679E-07    3    -1000024        -3         4   # BR(chi^0_3 -> chi^-_1 s_bar c)
     2.00692526E-07    3     1000024        11       -12   # BR(chi^0_3 -> chi^+_1 e^- nu_bar_e)
     2.00692526E-07    3    -1000024       -11        12   # BR(chi^0_3 -> chi^-_1 e^+ nu_e)
     2.00690697E-07    3     1000024        13       -14   # BR(chi^0_3 -> chi^+_1 mu^- nu_bar_mu)
     2.00690697E-07    3    -1000024       -13        14   # BR(chi^0_3 -> chi^-_1 mu^+ nu_mu)
     1.92253784E-07    3     1000024        15       -16   # BR(chi^0_3 -> chi^+_1 tau^- nu_bar_tau)
     1.92253784E-07    3    -1000024       -15        16   # BR(chi^0_3 -> chi^-_1 tau^+ nu_tau)
DECAY   1000035     6.24336300E+00   # chi^0_4
#    BR                NDA      ID1      ID2
     1.87234037E-04    2     2000011       -11   # BR(chi^0_4 -> ~e^-_R e^+)
     1.87234037E-04    2    -2000011        11   # BR(chi^0_4 -> ~e^+_R e^-)
     4.30452572E-02    2     1000011       -11   # BR(chi^0_4 -> ~e^-_L e^+)
     4.30452572E-02    2    -1000011        11   # BR(chi^0_4 -> ~e^+_L e^-)
     1.89420140E-04    2     2000013       -13   # BR(chi^0_4 -> ~mu^-_R mu^+)
     1.89420140E-04    2    -2000013        13   # BR(chi^0_4 -> ~mu^+_R mu^-)
     4.30711303E-02    2     1000013       -13   # BR(chi^0_4 -> ~mu^-_L mu^+)
     4.30711303E-02    2    -1000013        13   # BR(chi^0_4 -> ~mu^+_L mu^-)
     1.96163421E-03    2     1000015       -15   # BR(chi^0_4 -> ~tau^-_1 tau^+)
     1.96163421E-03    2    -1000015        15   # BR(chi^0_4 -> ~tau^+_1 tau^-)
     5.05904418E-02    2     2000015       -15   # BR(chi^0_4 -> ~tau^-_2 tau^+)
     5.05904418E-02    2    -2000015        15   # BR(chi^0_4 -> ~tau^+_2 tau^-)
     4.76678670E-02    2     1000012       -12   # BR(chi^0_4 -> ~nu_e nu_bar_e)
     4.76678670E-02    2    -1000012        12   # BR(chi^0_4 -> ~nu^*_e nu_e)
     4.76862190E-02    2     1000014       -14   # BR(chi^0_4 -> ~nu_mu nu_bar_mu)
     4.76862190E-02    2    -1000014        14   # BR(chi^0_4 -> ~nu^*_mu nu_mu)
     5.28580337E-02    2     1000016       -16   # BR(chi^0_4 -> ~nu_tau nu_bar_tau)
     5.28580337E-02    2    -1000016        16   # BR(chi^0_4 -> ~nu^*_tau nu_tau)
     1.26056176E-01    2     1000024       -24   # BR(chi^0_4 -> chi^+_1 W^-)
     1.26056176E-01    2    -1000024        24   # BR(chi^0_4 -> chi^-_1 W^+)
     3.82644868E-04    2     1000022        23   # BR(chi^0_4 -> chi^0_1 Z)
     1.64191526E-03    2     1000023        23   # BR(chi^0_4 -> chi^0_2 Z)
     8.18312806E-02    2     1000025        23   # BR(chi^0_4 -> chi^0_3 Z)
     3.56369053E-03    2     1000022        25   # BR(chi^0_4 -> chi^0_1 h^0)
     8.55247644E-02    2     1000023        25   # BR(chi^0_4 -> chi^0_2 h^0)
     4.08058456E-04    2     1000025        25   # BR(chi^0_4 -> chi^0_3 h^0)
     5.33477459E-10    2     1000039        22   # BR(chi^0_4 -> ~G photon)
     2.48169983E-09    2     1000039        23   # BR(chi^0_4 -> ~G Z)
     1.77727571E-10    2     1000039        25   # BR(chi^0_4 -> ~G h^0)
     2.67026883E-07    2     1000022        22   # BR(chi^0_4 -> chi^0_1 photon)
     1.04887739E-06    2     1000023        22   # BR(chi^0_4 -> chi^0_2 photon)
     8.39408463E-07    2     1000025        22   # BR(chi^0_4 -> chi^0_3 photon)
#    BR                NDA      ID1      ID2       ID3
     3.80486975E-08    3     1000022         2        -2   # BR(chi^0_4 -> chi^0_1 u u_bar)
     3.80442179E-08    3     1000022         4        -4   # BR(chi^0_4 -> chi^0_1 c c_bar)
     1.34369486E-06    3     1000022         6        -6   # BR(chi^0_4 -> chi^0_1 t t_bar)
     4.93200606E-08    3     1000022         1        -1   # BR(chi^0_4 -> chi^0_1 d d_bar)
     4.93853072E-08    3     1000022         3        -3   # BR(chi^0_4 -> chi^0_1 s s_bar)
     2.12245446E-07    3     1000022         5        -5   # BR(chi^0_4 -> chi^0_1 b b_bar)
     1.09253387E-07    3     1000022        11       -11   # BR(chi^0_4 -> chi^0_1 e^- e^+)
     1.09273502E-07    3     1000022        13       -13   # BR(chi^0_4 -> chi^0_1 mu^- mu^+)
     4.25989974E-07    3     1000022        15       -15   # BR(chi^0_4 -> chi^0_1 tau^- tau^+)
     3.05993954E-09    3     1000023         2        -2   # BR(chi^0_4 -> chi^0_2 u u_bar)
     3.05705341E-09    3     1000023         4        -4   # BR(chi^0_4 -> chi^0_2 c c_bar)
     2.39634270E-09    3     1000023         1        -1   # BR(chi^0_4 -> chi^0_2 d d_bar)
     2.88609638E-09    3     1000023         3        -3   # BR(chi^0_4 -> chi^0_2 s s_bar)
     1.16123128E-06    3     1000023         5        -5   # BR(chi^0_4 -> chi^0_2 b b_bar)
     9.62505343E-07    3     1000023        11       -11   # BR(chi^0_4 -> chi^0_2 e^- e^+)
     9.69987746E-07    3     1000023        13       -13   # BR(chi^0_4 -> chi^0_2 mu^- mu^+)
     3.17583288E-06    3     1000023        15       -15   # BR(chi^0_4 -> chi^0_2 tau^- tau^+)
     1.16648691E-06    3     1000023        12       -12   # BR(chi^0_4 -> chi^0_2 nu_e nu_bar_e)
     4.20907737E-12    3     1000025         2        -2   # BR(chi^0_4 -> chi^0_3 u u_bar)
     4.47440139E-12    3     1000025         4        -4   # BR(chi^0_4 -> chi^0_3 c c_bar)
     8.53733887E-12    3     1000025         1        -1   # BR(chi^0_4 -> chi^0_3 d d_bar)
     4.03631084E-10    3     1000025         3        -3   # BR(chi^0_4 -> chi^0_3 s s_bar)
     9.29344753E-07    3     1000025         5        -5   # BR(chi^0_4 -> chi^0_3 b b_bar)
     4.08453362E-10    3     1000025        11       -11   # BR(chi^0_4 -> chi^0_3 e^- e^+)
     4.52365172E-09    3     1000025        13       -13   # BR(chi^0_4 -> chi^0_3 mu^- mu^+)
     1.14051602E-06    3     1000025        15       -15   # BR(chi^0_4 -> chi^0_3 tau^- tau^+)
     7.00025263E-09    3     1000025        12       -12   # BR(chi^0_4 -> chi^0_3 nu_e nu_bar_e)
     1.95529568E-09    3     1000024         1        -2   # BR(chi^0_4 -> chi^+_1 d u_bar)
     1.95529568E-09    3    -1000024        -1         2   # BR(chi^0_4 -> chi^-_1 d_bar u)
     2.63533762E-09    3     1000024         3        -4   # BR(chi^0_4 -> chi^+_1 s c_bar)
     2.63533762E-09    3    -1000024        -3         4   # BR(chi^0_4 -> chi^-_1 s_bar c)
     1.18684173E-07    3     1000024         5        -6   # BR(chi^0_4 -> chi^+_1 b t_bar)
     1.18684173E-07    3    -1000024        -5         6   # BR(chi^0_4 -> chi^-_1 b_bar t)
     5.93477393E-07    3     1000024        11       -12   # BR(chi^0_4 -> chi^+_1 e^- nu_bar_e)
     5.93477393E-07    3    -1000024       -11        12   # BR(chi^0_4 -> chi^-_1 e^+ nu_e)
     5.99801707E-07    3     1000024        13       -14   # BR(chi^0_4 -> chi^+_1 mu^- nu_bar_mu)
     5.99801707E-07    3    -1000024       -13        14   # BR(chi^0_4 -> chi^-_1 mu^+ nu_mu)
     2.06117635E-06    3     1000024        15       -16   # BR(chi^0_4 -> chi^+_1 tau^- nu_bar_tau)
     2.06117635E-06    3    -1000024       -15        16   # BR(chi^0_4 -> chi^-_1 tau^+ nu_tau)
DECAY   1000021     1.30196678E+01   # ~g
#    BR                NDA      ID1      ID2
     4.08979040E-02    2     2000002        -2   # BR(~g -> ~u_R u_bar)
     4.08979040E-02    2    -2000002         2   # BR(~g -> ~u^*_R u)
     9.88096465E-03    2     1000002        -2   # BR(~g -> ~u_L u_bar)
     9.88096465E-03    2    -1000002         2   # BR(~g -> ~u^*_L u)
     4.08975122E-02    2     2000004        -4   # BR(~g -> ~c_R c_bar)
     4.08975122E-02    2    -2000004         4   # BR(~g -> ~c^*_R c)
     9.88450031E-03    2     1000004        -4   # BR(~g -> ~c_L c_bar)
     9.88450031E-03    2    -1000004         4   # BR(~g -> ~c^*_L c)
     1.01920645E-02    2     1000006        -4   # BR(~g -> ~t_1 c_bar)
     1.01920645E-02    2    -1000006         4   # BR(~g -> ~t^*_1 c)
     1.01970138E-01    2     1000006        -6   # BR(~g -> ~t_1 t_bar)
     1.01970138E-01    2    -1000006         6   # BR(~g -> ~t^*_1 t)
     3.33918437E-02    2     2000006        -6   # BR(~g -> ~t_2 t_bar)
     3.33918437E-02    2    -2000006         6   # BR(~g -> ~t^*_2 t)
     4.44112549E-02    2     2000001        -1   # BR(~g -> ~d_R d_bar)
     4.44112549E-02    2    -2000001         1   # BR(~g -> ~d^*_R d)
     9.57514168E-03    2     1000001        -1   # BR(~g -> ~d_L d_bar)
     9.57514168E-03    2    -1000001         1   # BR(~g -> ~d^*_L d)
     4.44281058E-02    2     2000003        -3   # BR(~g -> ~s_R s_bar)
     4.44281058E-02    2    -2000003         3   # BR(~g -> ~s^*_R s)
     9.57913073E-03    2     1000003        -3   # BR(~g -> ~s_L s_bar)
     9.57913073E-03    2    -1000003         3   # BR(~g -> ~s^*_L s)
     9.28920836E-02    2     1000005        -5   # BR(~g -> ~b_1 b_bar)
     9.28920836E-02    2    -1000005         5   # BR(~g -> ~b^*_1 b)
     5.18103856E-02    2     2000005        -5   # BR(~g -> ~b_2 b_bar)
     5.18103856E-02    2    -2000005         5   # BR(~g -> ~b^*_2 b)
     1.78398229E-06    2     1000022        21   # BR(~g -> chi^0_1 g)
     1.48051317E-04    2     1000023        21   # BR(~g -> chi^0_2 g)
     1.97777353E-04    2     1000025        21   # BR(~g -> chi^0_3 g)
     3.03276631E-05    2     1000035        21   # BR(~g -> chi^0_4 g)
DECAY        25     2.46809916E-03   # h^0
#    BR                NDA      ID1      ID2
     1.10146616E-08    2          11       -11   # BR(h^0 -> e^- e^+)
     4.70865333E-04    2          13       -13   # BR(h^0 -> mu^- mu^+)
     1.29754369E-01    2          15       -15   # BR(h^0 -> tau^- tau^+)
     6.13437083E-07    2           1        -1   # BR(h^0 -> d d_bar)
     2.70520307E-04    2           3        -3   # BR(h^0 -> s s_bar)
     5.89653336E-01    2           5        -5   # BR(h^0 -> b b_bar)
     2.70287319E-07    2           2        -2   # BR(h^0 -> u u_bar)
     4.84284793E-02    2           4        -4   # BR(h^0 -> c c_bar)
     7.28987819E-02    2          21        21   # BR(h^0 -> g g)
     3.51530027E-03    2          22        22   # BR(h^0 -> photon photon)
# writing decays into V V* as 3-body decays
#    BR                NDA      ID1      ID2       ID3
     7.10835585E-03    3          24        11        12   # BR(h^0 -> W^+ e^- nu_e)
     7.10835585E-03    3          24        13        14   # BR(h^0 -> W^+ mu^- nu_mu)
     7.10835585E-03    3          24        15        16   # BR(h^0 -> W^+ tau^- nu_tau)
     2.48792455E-02    3          24         1        -2   # BR(h^0 -> W^+ d u_bar)
     2.48792455E-02    3          24         3        -4   # BR(h^0 -> W^+ s c_bar)
     7.10835585E-03    3         -24       -11       -12   # BR(h^0 -> W^- e^+ nu_bar_e)
     7.10835585E-03    3         -24       -13       -14   # BR(h^0 -> W^- mu^+ nu_bar_mu)
     7.10835585E-03    3         -24       -15       -16   # BR(h^0 -> W^- tau^+ nu_bar_tau)
     2.48792455E-02    3         -24        -1         2   # BR(h^0 -> W^- d_bar u)
     2.48792455E-02    3         -24        -3         4   # BR(h^0 -> W^- s_bar c)
     4.49411764E-04    3          23        11       -11   # BR(h^0 -> Z e^- e^+)
     4.49411764E-04    3          23        13       -13   # BR(h^0 -> Z mu^- mu^+)
     3.85210083E-04    3          23        15       -15   # BR(h^0 -> Z tau^- tau^+)
     2.56806722E-03    3          23        12       -12   # BR(h^0 -> Z nu_e nu_bar_e)
     1.79764706E-03    3          23         1        -1   # BR(h^0 -> Z u u_bar)
     1.79764706E-03    3          23         3        -3   # BR(h^0 -> Z c c_bar)
     1.79764706E-03    3          23         5        -5   # BR(h^0 -> Z t t_bar)
     1.79764706E-03    3          23         2        -2   # BR(h^0 -> Z u u_bar)
     1.79764706E-03    3          23         4        -4   # BR(h^0 -> Z c c_bar)
DECAY        35     2.08007446E+01   # H^0
#    BR                NDA      ID1      ID2
     1.66986328E-08    2          11       -11   # BR(H^0 -> e^- e^+)
     7.13935833E-04    2          13       -13   # BR(H^0 -> mu^- mu^+)
     2.03508348E-01    2          15       -15   # BR(H^0 -> tau^- tau^+)
     7.70635562E-07    2           1        -1   # BR(H^0 -> d d_bar)
     3.39849683E-04    2           3        -3   # BR(H^0 -> s s_bar)
     7.94784928E-01    2           5        -5   # BR(H^0 -> b b_bar)
     7.17647810E-14    2           2        -2   # BR(H^0 -> u u_bar)
     1.28610811E-08    2           4        -4   # BR(H^0 -> c c_bar)
     5.37796381E-04    2           6        -6   # BR(H^0 -> t t_bar)
     3.90619951E-08    2     2000011  -2000011   # BR(H^0 -> ~e^-_R ~e^+_R)
     4.84738928E-08    2     2000013  -2000013   # BR(H^0 -> ~mu^-_R ~mu^+_R)
     1.50998654E-05    2     1000015  -1000015   # BR(H^0 -> ~tau^-_1 ~tau^+_1)
     4.16363802E-06    2          23        23   # BR(H^0 -> Z Z)
     8.06097930E-06    2          24       -24   # BR(H^0 -> W^+ W^-)
     1.21776884E-05    2          25        25   # BR(H^0 -> h^0 h^0)
     7.46496859E-05    2          21        21   # BR(H^0 -> g g)
     1.02463721E-07    2          22        22   # BR(H^0 -> photon photon)
DECAY        36     2.08007236E+01   # A^0
#    BR                NDA      ID1      ID2
     1.66985776E-08    2          11       -11   # BR(A^0 -> e^- e^+)
     7.13933542E-04    2          13       -13   # BR(A^0 -> mu^- mu^+)
     2.03513009E-01    2          15       -15   # BR(A^0 -> tau^- tau^+)
     7.70632562E-07    2           1        -1   # BR(A^0 -> d d_bar)
     3.39848361E-04    2           3        -3   # BR(A^0 -> s s_bar)
     7.94805976E-01    2           5        -5   # BR(A^0 -> b b_bar)
     6.32648423E-14    2           2        -2   # BR(A^0 -> u u_bar)
     1.13377968E-08    2           4        -4   # BR(A^0 -> c c_bar)
     5.96744337E-04    2           6        -6   # BR(A^0 -> t t_bar)
     7.60582636E-06    2          25        23   # BR(A^0 -> h^0 Z)
     2.20422592E-05    2          21        21   # BR(A^0 -> g g)
     4.24417729E-08    2          22        22   # BR(A^0 -> photon photon)
DECAY        37     1.72834066E+01   # H^+
#    BR                NDA      ID1      ID2
     2.02560820E-08    2         -11        12   # BR(H^+ -> e^+ nu_e)
     8.66031628E-04    2         -13        12   # BR(H^+ -> mu^+ nu_e)
     2.46869951E-01    2         -15        12   # BR(H^+ -> tau^+ nu_e)
     8.25975649E-07    2          -1         2   # BR(H^+ -> d_bar u)
     3.64264315E-04    2          -3         4   # BR(H^+ -> s_bar c)
     7.51889653E-01    2          -5         6   # BR(H^+ -> b_bar t)
     9.25449210E-06    2          25        24   # BR(H^+ -> h^0 W^+)
DECAY         6     2.43000000E+00   # top
#    BR                NDA      ID1      ID2
     1.00000000E+00    2           5        24   # BR(t -> b W)
Block HiggsBoundsInputHiggsCouplingsFermions
# ScalarNormEffCoupSq PseudoSNormEffCoupSq NP IP1 IP2 IP2
    1.13428954E+00    0.00000000E+00        3  25   5   5  # h0-b-b eff. coupling^2, normalised to SM
    2.49986571E+03    0.00000000E+00        3  35   5   5  # H0-b-b eff. coupling^2, normalised to SM
    0.00000000E+00    2.50000000E+03        3  36   5   5  # A0-b-b eff. coupling^2, normalised to SM
#
    9.99946284E-01    0.00000000E+00        3  25   6   6  # h0-t-t eff. coupling^2, normalised to SM
    4.53715815E-04    0.00000000E+00        3  35   6   6  # H0-t-t eff. coupling^2, normalised to SM
    0.00000000E+00    4.00000000E-04        3  36   6   6  # A0-t-t eff. coupling^2, normalised to SM
#
    1.13428954E+00    0.00000000E+00        3  25  15  15  # h0-tau-tau eff. coupling^2, normalised to SM
    2.49986571E+03    0.00000000E+00        3  35  15  15  # H0-tau-tau eff. coupling^2, normalised to SM
    0.00000000E+00    2.50000000E+03        3  36  15  15  # A0-tau-tau eff. coupling^2, normalised to SM
#
Block HiggsBoundsInputHiggsCouplingsBosons
    9.99998308E-01        3  25  24  24  # h0-W-W eff. coupling^2, normalised to SM
    1.69161991E-06        3  35  24  24  # H0-W-W eff. coupling^2, normalised to SM
    0.00000000E+00        3  36  24  24  # A0-W-W eff. coupling^2, normalised to SM
#
    9.99998308E-01        3  25  23  23  # h0-Z-Z eff. coupling^2, normalised to SM
    1.69161991E-06        3  35  23  23  # H0-Z-Z eff. coupling^2, normalised to SM
    0.00000000E+00        3  36  23  23  # A0-Z-Z eff. coupling^2, normalised to SM
#
    1.16189094E+00        3  25  21  21  # h0-g-g eff. coupling^2, normalised to SM
    5.45118090E-02        3  35  21  21  # H0-g-g eff. coupling^2, normalised to SM
    2.09581088E-01        3  36  21  21  # A0-g-g eff. coupling^2, normalised to SM
#
    0.00000000E+00        3  25  25  23  # h0-h0-Z eff. coupling^2, normalised to SM
    0.00000000E+00        3  35  25  23  # H0-h0-Z eff. coupling^2, normalised to SM
    1.69161991E-06        3  36  25  23  # A0-h0-Z eff. coupling^2, normalised to SM
    0.00000000E+00        3  35  35  23  # H0-H0-Z eff. coupling^2, normalised to SM
    9.99998308E-01        3  36  35  23  # A0-H0-Z eff. coupling^2, normalised to SM
    0.00000000E+00        3  36  36  23  # A0-A0-Z eff. coupling^2, normalised to SM
#
    0.00000000E+00        4  25  21  21  23  # h0-g-g-Z eff. coupling^2, normalised to SM
    0.00000000E+00        4  35  21  21  23  # H0-g-g-Z eff. coupling^2, normalised to SM
    0.00000000E+00        4  36  21  21  23  # A0-g-g-Z eff. coupling^2, normalised to SM
Block SPhenoLowEnergy  # low energy observables
    1    3.20204929E-04   # BR(b -> s gamma)
    2    1.58916895E-06   # BR(b -> s mu+ mu-)
    3    3.53834165E-05   # BR(b -> s nu nu)
    4    6.53920334E-11   # BR(Bd -> mu+ mu-)
    5    4.30668059E-09   # BR(Bs -> mu+ mu-)
    6    9.17031676E-05   # BR(B_u -> tau nu)
    7    8.29192612E-01   # BR(B_u -> tau nu)/BR(B_u -> tau nu)_SM
    8    2.73258148E-01   # |Delta(M_Bd)| [ps^-1] 
    9    2.02164318E+01   # |Delta(M_Bs)| [ps^-1] 
   20    4.51858831E-14   # Delta(g-2)_electron/2
   21    9.80567224E-10   # Delta(g-2)_muon/2
   22    9.77697283E-08   # Delta(g-2)_tau/2
   23    0.00000000E+00   # electric dipole moment of the electron
   24    0.00000000E+00   # electric dipole moment of the muon
   25    0.00000000E+00   # electric dipole moment of the tau
   26    0.00000000E+00   # Br(mu -> e gamma)
   27    0.00000000E+00   # Br(tau -> e gamma)
   28    0.00000000E+00   # Br(tau -> mu gamma)
   29    0.00000000E+00   # Br(mu -> 3 e)
   30    0.00000000E+00   # Br(tau -> 3 e)
   31    0.00000000E+00   # Br(tau -> 3 mu)
   39    1.73458470E-03   # Delta(rho_parameter)
   40    0.00000000E+00   # BR(Z -> e mu)
   41    0.00000000E+00   # BR(Z -> e tau)
   42    0.00000000E+00   # BR(Z -> mu tau)
Block FWCOEF Q=  9.11876000E+01  # Wilson coefficients at scale Q
#    id        order  M        value         comment
Block FWCOEF Q=  1.60000000E+02  # Wilson coefficients at scale Q
#    id        order  M        value         comment
     0305 4422   00   0    -1.87763644E-01   # C7
     0305 4422   00   1    -1.99635463E-02   # C7
     0305 4322   00   1    -4.22925341E-04   # C7'
     0305 6421   00   0    -9.48913743E-02   # C8
     0305 6421   00   1    -3.33602589E-02   # C8
     0305 6321   00   1    -7.02680190E-04   # C8'
 03051111 4133   00   0    -1.10479947E+00   # C9 e+e-
 03051111 4133   00   1     1.11322016E-03   # C9 e+e-
 03051111 4233   00   1    -1.56362094E-04   # C9' e+e-
 03051111 4137   00   0    -3.95595103E+00   # C10 e+e-
 03051111 4137   00   1     3.97660179E-03   # C10 e+e-
 03051111 4237   00   1     3.83012782E-03   # C10' e+e-
 03051313 4133   00   0    -1.10479947E+00   # C9 mu+mu-
 03051313 4133   00   1     1.11282732E-03   # C9 mu+mu-
 03051313 4233   00   1    -1.56471621E-04   # C9' mu+mu-
 03051313 4137   00   0    -3.95595103E+00   # C10 mu+mu-
 03051313 4137   00   1     3.97620852E-03   # C10 mu+mu-
 03051313 4237   00   1     3.83023741E-03   # C10' mu+mu-
 03051212 4237   00   0     1.49023517E+00   # C11 nu_1 nu_1
 03051212 4237   00   1    -9.55857540E-04   # C11 nu_1 nu_1
 03051212 4137   00   1    -9.18661656E-04   # C11' nu_1 nu_1
 03051414 4237   00   0     1.49023517E+00   # C11 nu_2 nu_2
 03051414 4237   00   1    -9.55857217E-04   # C11 nu_2 nu_2
 03051414 4137   00   1    -9.18635465E-04   # C11' nu_2 nu_2
 03051616 4237   00   0     1.49023517E+00   # C11 nu_3 nu_3
 03051616 4237   00   1    -9.55596600E-04   # C11 nu_3 nu_3
 03051616 4137   00   1    -9.11253362E-04   # C11' nu_3 nu_3
