#
#                              ======================
#                              | THE SUSYHIT OUTPUT |
#                              ======================
#
#
#              ------------------------------------------------------
#              |     This is the output of the SUSY-HIT package     |
#              |  created by A.Djouadi, M.Muehlleitner and M.Spira. |
#              |  In case of problems with SUSY-HIT email to        |
#              |           margarete.muehlleitner@cern.ch           |
#              |           michael.spira@psi.ch                     |
#              |           abdelhak.djouadi@cern.ch                 |
#              ------------------------------------------------------
#
#              ------------------------------------------------------
#              |  SUSY Les Houches Accord - MSSM Spectrum + Decays  |
#              |              based on the decay programs           |
#              |                                                    |
#              |                     SDECAY 1.3b                    |
#              |                                                    |
#              |  Authors: M.Muhlleitner, A.Djouadi and Y.Mambrini  |
#              |  Ref.:    Comput.Phys.Commun.168(2005)46           |
#              |           [hep-ph/0311167]                         |
#              |                                                    |
#              |                     HDECAY 3.4                     |
#              |                                                    |
#              |  By: A.Djouadi,J.Kalinowski,M.Muhlleitner,M.Spira  |
#              |  Ref.:    Comput.Phys.Commun.108(1998)56           |
#              |           [hep-ph/9704448]                         |
#              |                                                    |
#              |                                                    |
#              |  If not stated otherwise all DRbar couplings and   |
#              |  soft SUSY breaking masses are given at the scale  |
#              |  Q=  0.91187600E+02
#              |                                                    |
#              ------------------------------------------------------
#
#
BLOCK DCINFO  # Decay Program information
     1   SDECAY/HDECAY # decay calculator
     2   1.3b  /3.4    # version number
#
BLOCK SPINFO  # Spectrum calculator information
     1   SuSpect     # RGE +Spectrum calculator            
     2   2.41         # version number                     
#
BLOCK MODSEL  # Model selection
     1     0   # #general MSSM low scale                           
#
BLOCK SMINPUTS  # Standard Model inputs
         1     1.27934000E+02   # alpha_em^-1(M_Z)^MSbar
         2     1.16639000E-05   # G_F [GeV^-2]
         3     1.17200000E-01   # alpha_S(M_Z)^MSbar
         4     9.11870000E+01   # M_Z pole mass
         5     4.25000000E+00   # mb(mb)^MSbar
         6     1.72500000E+02   # mt pole mass
         7     1.77700000E+00   # mtau pole mass
#
BLOCK MINPAR  # Input parameters - minimal models
#
BLOCK EXTPAR  # Input parameters - non-minimal models
         0     9.11876000E+01   # EWSB                
         1     5.00000000E+03   # M_1                 
         2     4.58709000E+02   # M_2                 
         3     1.26857000E+03   # M_3                 
        11     0.00000000E+00   # A_t                 
        12     0.00000000E+00   # A_b                 
        13     0.00000000E+00   # A_tau               
        14     0.00000000E+00   # A_u                 
        15     0.00000000E+00   # A_d                 
        16     0.00000000E+00   # A_e                 
        23     5.00000000E+03   # mu(EWSB)            
        25     1.50000000E+00   # tanbeta(in)         
        26     2.00000000E+03   # MA_pole             
        31     5.00000000E+03   # M_eL                
        32     5.00000000E+03   # M_muL               
        33     5.00000000E+03   # M_tauL              
        34     5.00000000E+03   # M_eR                
        35     5.00000000E+03   # M_muR               
        36     5.00000000E+03   # M_tauR              
        41     5.00000000E+03   # M_q1L               
        42     5.00000000E+03   # M_q2L               
        43     5.00000000E+03   # M_q3L               
        44     5.00000000E+03   # M_uR                
        45     5.00000000E+03   # M_cR                
        46     5.00000000E+03   # M_tR                
        47     5.00000000E+03   # M_dR                
        48     5.00000000E+03   # M_sR                
        49     5.00000000E+03   # M_bR                
#
BLOCK MASS  # Mass Spectrum
# PDG code           mass       particle
        24     8.05272652E+01   # W+
        25     1.25000000E+02   # h
        35     2.00393970E+03   # H
        36     2.00000000E+03   # A
        37     1.99282917E+03   # H+
         5     4.87877839E+00   # b-quark pole mass calculated from mb(mb)_Msbar
   1000001     5.00588817E+03   # ~d_L
   2000001     5.00577763E+03   # ~d_R
   1000002     5.00564129E+03   # ~u_L
   2000002     5.00570026E+03   # ~u_R
   1000003     5.00588817E+03   # ~s_L
   2000003     5.00577763E+03   # ~s_R
   1000004     5.00564129E+03   # ~c_L
   2000004     5.00570026E+03   # ~c_R
   1000005     5.00378905E+03   # ~b_1
   2000005     5.00787739E+03   # ~b_2
   1000006     5.03097427E+03   # ~t_1
   2000006     5.20191266E+03   # ~t_2
   1000011     5.00008343E+03   # ~e_L
   2000011     5.00007615E+03   # ~e_R
   1000012     4.99984042E+03   # ~nu_eL
   1000013     5.00008343E+03   # ~mu_L
   2000013     5.00007615E+03   # ~mu_R
   1000014     4.99984042E+03   # ~nu_muL
   1000015     4.99874688E+03   # ~tau_1
   2000015     5.00141298E+03   # ~tau_2
   1000016     4.99984042E+03   # ~nu_tauL
   1000021     1.40000009E+03   # ~g
   1000022     5.00000870E+02   # ~chi_10
   1000023     5.20076794E+03   # ~chi_20
   1000025    -5.21957010E+03   # ~chi_30
   1000035     5.31566390E+03   # ~chi_40
   1000024     5.00000973E+02   # ~chi_1+
   1000037     5.22084834E+03   # ~chi_2+
 1000039     1.E-09   # ~gravitino              
#
BLOCK NMIX  # Neutralino Mixing Matrix
  1  1     1.45097812E-04   # N_11
  1  2    -9.99860098E-01   # N_12
  1  3     1.35951352E-02   # N_13
  1  4    -9.74351307E-03   # N_14
  2  1     4.17613487E-01   # N_21
  2  2     1.50564906E-02   # N_22
  2  3     6.42637697E-01   # N_23
  2  4    -6.42175263E-01   # N_24
  3  1     8.29437723E-04   # N_31
  3  2    -2.72336519E-03   # N_32
  3  3    -7.07087097E-01   # N_33
  3  4    -7.07120734E-01   # N_34
  4  1     9.08624382E-01   # N_41
  4  2    -6.75797094E-03   # N_42
  4  3    -2.94719867E-01   # N_43
  4  4     2.95797672E-01   # N_44
#
BLOCK UMIX  # Chargino Mixing Matrix U
  1  1    -9.99815200E-01   # U_11
  1  2     1.92241035E-02   # U_12
  2  1     1.92241035E-02   # U_21
  2  2     9.99815200E-01   # U_22
#
BLOCK VMIX  # Chargino Mixing Matrix V
  1  1    -9.99905068E-01   # V_11
  1  2     1.37787535E-02   # V_12
  2  1     1.37787535E-02   # V_21
  2  2     9.99905068E-01   # V_22
#
BLOCK STOPMIX  # Stop Mixing Matrix
  1  1     9.72801666E-01   # cos(theta_t)
  1  2     2.31639631E-01   # sin(theta_t)
  2  1    -2.31639631E-01   # -sin(theta_t)
  2  2     9.72801666E-01   # cos(theta_t)
#
BLOCK SBOTMIX  # Sbottom Mixing Matrix
  1  1     6.97481320E-01   # cos(theta_b)
  1  2     7.16602964E-01   # sin(theta_b)
  2  1    -7.16602964E-01   # -sin(theta_b)
  2  2     6.97481320E-01   # cos(theta_b)
#
BLOCK STAUMIX  # Stau Mixing Matrix
  1  1     7.06141745E-01   # cos(theta_tau)
  1  2     7.08070502E-01   # sin(theta_tau)
  2  1    -7.08070502E-01   # -sin(theta_tau)
  2  2     7.06141745E-01   # cos(theta_tau)
#
BLOCK ALPHA  # Higgs mixing
          -5.90299539E-01   # Mixing angle in the neutral Higgs boson sector
#
BLOCK HMIX Q=  9.11876000E+01  # DRbar Higgs Parameters
         1     5.00000000E+03   # mu(Q)               
         2     1.49999981E+00   # tanbeta(Q)          
         3     2.52280874E+02   # vev(Q)              
         4     3.27316106E+06   # MA^2(Q)             
#
BLOCK GAUGE Q=  9.11876000E+01  # The gauge couplings
     1     3.52519740E-01   # gprime(Q) DRbar
     2     6.29718291E-01   # g(Q) DRbar
     3     1.08782262E+00   # g3(Q) DRbar
#
BLOCK AU Q=  9.11876000E+01  # The trilinear couplings
  1  1     0.00000000E+00   # A_u(Q) DRbar
  2  2     0.00000000E+00   # A_c(Q) DRbar
  3  3     0.00000000E+00   # A_t(Q) DRbar
#
BLOCK AD Q=  9.11876000E+01  # The trilinear couplings
  1  1     0.00000000E+00   # A_d(Q) DRbar
  2  2     0.00000000E+00   # A_s(Q) DRbar
  3  3     0.00000000E+00   # A_b(Q) DRbar
#
BLOCK AE Q=  9.11876000E+01  # The trilinear couplings
  1  1     0.00000000E+00   # A_e(Q) DRbar
  2  2     0.00000000E+00   # A_mu(Q) DRbar
  3  3     0.00000000E+00   # A_tau(Q) DRbar
#
BLOCK Yu Q=  9.11876000E+01  # The Yukawa couplings
  1  1     0.00000000E+00   # y_u(Q) DRbar
  2  2     0.00000000E+00   # y_c(Q) DRbar
  3  3     1.01879940E+00   # y_t(Q) DRbar
#
BLOCK Yd Q=  9.11876000E+01  # The Yukawa couplings
  1  1     0.00000000E+00   # y_d(Q) DRbar
  2  2     0.00000000E+00   # y_s(Q) DRbar
  3  3     2.70831093E-02   # y_b(Q) DRbar
#
BLOCK Ye Q=  9.11876000E+01  # The Yukawa couplings
  1  1     0.00000000E+00   # y_e(Q) DRbar
  2  2     0.00000000E+00   # y_mu(Q) DRbar
  3  3     1.79501953E-02   # y_tau(Q) DRbar
#
BLOCK MSOFT Q=  9.11876000E+01  # The soft SUSY breaking masses at the scale Q
         1     5.00000000E+03   # M_1                 
         2     4.58709000E+02   # M_2                 
         3     1.26857000E+03   # M_3                 
        14     0.00000000E+00   # A_u                 
        15     0.00000000E+00   # A_d                 
        16     0.00000000E+00   # A_e                 
        21    -2.44594963E+07   # M^2_Hd              
        22    -2.89206105E+07   # M^2_Hu              
        31     5.00000000E+03   # M_eL                
        32     5.00000000E+03   # M_muL               
        33     5.00000000E+03   # M_tauL              
        34     5.00000000E+03   # M_eR                
        35     5.00000000E+03   # M_muR               
        36     5.00000000E+03   # M_tauR              
        41     5.00000000E+03   # M_q1L               
        42     5.00000000E+03   # M_q2L               
        43     5.00000000E+03   # M_q3L               
        44     5.00000000E+03   # M_uR                
        45     5.00000000E+03   # M_cR                
        46     5.00000000E+03   # M_tR                
        47     5.00000000E+03   # M_dR                
        48     5.00000000E+03   # M_sR                
        49     5.00000000E+03   # M_bR                
#
#
#
#                             =================
#                             |The decay table|
#                             =================
#
# - The QCD corrections to the decays gluino -> squark  + quark
#                                     squark -> gaugino + quark_prime
#                                     squark -> squark_prime + Higgs
#                                     squark -> gluino  + quark
#   are included.
#
# - The multi-body decays for the inos, stops and sbottoms are included.
#
# - The loop induced decays for the gluino, neutralinos and stops
#   are included.
#
# - The SUSY decays of the top quark are included.
#
# - Possible decays of the NLSP in GMSB models are included.
#
#
#         PDG            Width
DECAY         6     1.37103923E+00   # top decays
#          BR         NDA      ID1       ID2
     1.00000000E+00    2           5        24   # BR(t ->  b    W+)
#
#         PDG            Width
DECAY   1000021     2.17635515E-04   # gluino decays
#          BR         NDA      ID1       ID2
     1.16907761E-05    2     1000022        21   # BR(~g -> ~chi_10 g)
#          BR         NDA      ID1       ID2
 0    2     1000039        21   # BR(~g -> ~G      g) 
#           BR         NDA      ID1       ID2       ID3
     5.83929071E-02    3     1000022         1        -1   # BR(~g -> ~chi_10 d  db)
     5.83985681E-02    3     1000022         2        -2   # BR(~g -> ~chi_10 u  ub)
     5.83929071E-02    3     1000022         3        -3   # BR(~g -> ~chi_10 s  sb)
     5.83985681E-02    3     1000022         4        -4   # BR(~g -> ~chi_10 c  cb)
     5.83684392E-02    3     1000022         5        -5   # BR(~g -> ~chi_10 b  bb)
     3.44616818E-02    3     1000022         6        -6   # BR(~g -> ~chi_10 t  tb)
     1.16791444E-01    3     1000024         1        -2   # BR(~g -> ~chi_1+ d  ub)
     1.16791444E-01    3    -1000024         2        -1   # BR(~g -> ~chi_1- u  db)
     1.16791444E-01    3     1000024         3        -4   # BR(~g -> ~chi_1+ s  cb)
     1.16791444E-01    3    -1000024         4        -3   # BR(~g -> ~chi_1- c  sb)
     9.29882121E-02    3     1000024         5        -6   # BR(~g -> ~chi_1+ b  tb)
     9.29882121E-02    3    -1000024         6        -5   # BR(~g -> ~chi_1- t  bb)
#
#         PDG            Width
DECAY   1000006     2.78017512E+02   # stop1 decays
#          BR         NDA      ID1       ID2
     6.62123421E-02    2     1000022         6   # BR(~t_1 -> ~chi_10 t )
     1.32619150E-01    2     1000024         5   # BR(~t_1 -> ~chi_1+ b )
     8.01168507E-01    2     1000021         6   # BR(~t_1 -> ~g      t )
#
#         PDG            Width
DECAY   2000006     2.32674434E+02   # stop2 decays
#          BR         NDA      ID1       ID2
     1.62168068E-03    2     1000022         6   # BR(~t_2 -> ~chi_10 t )
     3.24372884E-03    2     1000024         5   # BR(~t_2 -> ~chi_1+ b )
     9.85291056E-01    2     1000021         6   # BR(~t_2 -> ~g      t )
     1.47056686E-03    2     1000006        25   # BR(~t_2 -> ~t_1    h )
     1.70037162E-03    2     1000006        23   # BR(~t_2 -> ~t_1    Z )
     3.36961623E-03    2     1000005        24   # BR(~t_2 -> ~b_1    W+)
     3.30297927E-03    2     2000005        24   # BR(~t_2 -> ~b_2    W+)
#
#         PDG            Width
DECAY   1000005     2.48049854E+02   # sbottom1 decays
#          BR         NDA      ID1       ID2
     3.64574296E-02    2     1000022         5   # BR(~b_1 -> ~chi_10 b )
     7.28086139E-02    2    -1000024         6   # BR(~b_1 -> ~chi_1- t )
     8.90733956E-01    2     1000021         5   # BR(~b_1 -> ~g      b )
#
#         PDG            Width
DECAY   2000005     2.49962204E+02   # sbottom2 decays
#          BR         NDA      ID1       ID2
     3.86201053E-02    2     1000022         5   # BR(~b_2 -> ~chi_10 b )
     7.71270791E-02    2    -1000024         6   # BR(~b_2 -> ~chi_1- t )
     8.84252816E-01    2     1000021         5   # BR(~b_2 -> ~g      b )
#
#         PDG            Width
DECAY   1000002     2.77282311E+02   # sup_L decays
#          BR         NDA      ID1       ID2
     6.76795339E-02    2     1000022         2   # BR(~u_L -> ~chi_10 u)
     1.35378575E-01    2     1000024         1   # BR(~u_L -> ~chi_1+ d)
     7.96941891E-01    2     1000021         2   # BR(~u_L -> ~g      u)
#
#         PDG            Width
DECAY   2000002     2.20981376E+02   # sup_R decays
#          BR         NDA      ID1       ID2
     9.96432028E-10    2     1000022         2   # BR(~u_R -> ~chi_10 u)
     9.99999999E-01    2     1000021         2   # BR(~u_R -> ~g      u)
#
#         PDG            Width
DECAY   1000001     2.77295079E+02   # sdown_L decays
#          BR         NDA      ID1       ID2
     6.76872164E-02    2     1000022         1   # BR(~d_L -> ~chi_10 d)
     1.35354944E-01    2    -1000024         2   # BR(~d_L -> ~chi_1- u)
     7.96957840E-01    2     1000021         1   # BR(~d_L -> ~g      d)
#
#         PDG            Width
DECAY   2000001     2.20985951E+02   # sdown_R decays
#          BR         NDA      ID1       ID2
     2.49106850E-10    2     1000022         1   # BR(~d_R -> ~chi_10 d)
     1.00000000E+00    2     1000021         1   # BR(~d_R -> ~g      d)
#
#         PDG            Width
DECAY   1000004     2.77282311E+02   # scharm_L decays
#          BR         NDA      ID1       ID2
     6.76795339E-02    2     1000022         4   # BR(~c_L -> ~chi_10 c)
     1.35378575E-01    2     1000024         3   # BR(~c_L -> ~chi_1+ s)
     7.96941891E-01    2     1000021         4   # BR(~c_L -> ~g      c)
#
#         PDG            Width
DECAY   2000004     2.20981376E+02   # scharm_R decays
#          BR         NDA      ID1       ID2
     9.96432028E-10    2     1000022         4   # BR(~c_R -> ~chi_10 c)
     9.99999999E-01    2     1000021         4   # BR(~c_R -> ~g      c)
#
#         PDG            Width
DECAY   1000003     2.77295079E+02   # sstrange_L decays
#          BR         NDA      ID1       ID2
     6.76872164E-02    2     1000022         3   # BR(~s_L -> ~chi_10 s)
     1.35354944E-01    2    -1000024         4   # BR(~s_L -> ~chi_1- c)
     7.96957840E-01    2     1000021         3   # BR(~s_L -> ~g      s)
#
#         PDG            Width
DECAY   2000003     2.20985951E+02   # sstrange_R decays
#          BR         NDA      ID1       ID2
     2.49106850E-10    2     1000022         3   # BR(~s_R -> ~chi_10 s)
     1.00000000E+00    2     1000021         3   # BR(~s_R -> ~g      s)
#
#         PDG            Width
DECAY   1000011     5.79683408E+01   # selectron_L decays
#          BR         NDA      ID1       ID2
     3.33317186E-01    2     1000022        11   # BR(~e_L -> ~chi_10 e-)
     6.66682814E-01    2    -1000024        12   # BR(~e_L -> ~chi_1- nu_e)
#
#         PDG            Width
DECAY   2000011     5.10147772E-07   # selectron_R decays
#          BR         NDA      ID1       ID2
     1.00000000E+00    2     1000022        11   # BR(~e_R -> ~chi_10 e-)
#
#         PDG            Width
DECAY   1000013     5.79683408E+01   # smuon_L decays
#          BR         NDA      ID1       ID2
     3.33317186E-01    2     1000022        13   # BR(~mu_L -> ~chi_10 mu-)
     6.66682814E-01    2    -1000024        14   # BR(~mu_L -> ~chi_1- nu_mu)
#
#         PDG            Width
DECAY   2000013     5.10147772E-07   # smuon_R decays
#          BR         NDA      ID1       ID2
     1.00000000E+00    2     1000022        13   # BR(~mu_R -> ~chi_10 mu-)
#
#         PDG            Width
DECAY   1000015     2.89314275E+01   # stau_1 decays
#          BR         NDA      ID1       ID2
     3.33287525E-01    2     1000022        15   # BR(~tau_1 -> ~chi_10  tau-)
     6.66623276E-01    2    -1000024        16   # BR(~tau_1 -> ~chi_1-  nu_tau)
     8.91986454E-05    2     1000039        15   # BR(~tau_1 -> ~G       tau-)
#
#         PDG            Width
DECAY   2000015     2.90394951E+01   # stau_2 decays
#          BR         NDA      ID1       ID2
     3.33317112E-01    2     1000022        15   # BR(~tau_2 -> ~chi_10  tau-)
     6.66682888E-01    2    -1000024        16   # BR(~tau_2 -> ~chi_1-  nu_tau)
#
#         PDG            Width
DECAY   1000012     5.79786364E+01   # snu_eL decays
#          BR         NDA      ID1       ID2
     3.33349451E-01    2     1000022        12   # BR(~nu_eL -> ~chi_10 nu_e)
     6.66650549E-01    2     1000024        11   # BR(~nu_eL -> ~chi_1+ e-)
#
#         PDG            Width
DECAY   1000014     5.79786364E+01   # snu_muL decays
#          BR         NDA      ID1       ID2
     3.33349451E-01    2     1000022        14   # BR(~nu_muL -> ~chi_10 nu_mu)
     6.66650549E-01    2     1000024        13   # BR(~nu_muL -> ~chi_1+ mu-)
#
#         PDG            Width
DECAY   1000016     5.79786350E+01   # snu_tauL decays
#          BR         NDA      ID1       ID2
     3.33349459E-01    2     1000022        16   # BR(~nu_tauL -> ~chi_10 nu_tau)
     6.66650541E-01    2     1000024        15   # BR(~nu_tauL -> ~chi_1+ tau-)
#
#         PDG            Width
DECAY   1000024     2.06673957E-8   # chargino1+ decays               
#          BR         NDA      ID1       ID2
     1.00000000E+00    2     1000039        24   # BR(~chi_1+ -> ~G       W+)
#           BR         NDA      ID1       ID2       ID3
     7.49000911E-25    3     1000022         2        -1   # BR(~chi_1+ -> ~chi_10 u    db)
     7.49000911E-25    3     1000022         4        -3   # BR(~chi_1+ -> ~chi_10 c    sb)
     2.49667124E-25    3     1000022       -11        12   # BR(~chi_1+ -> ~chi_10 e+   nu_e)
     2.49667124E-25    3     1000022       -13        14   # BR(~chi_1+ -> ~chi_10 mu+  nu_mu)
#
#         PDG            Width
DECAY   1000037     5.46351733E+01   # chargino2+ decays
#          BR         NDA      ID1       ID2
     2.78591613E-06    2     1000002        -1   # BR(~chi_2+ -> ~u_L     db)
     5.41401519E-06    2    -1000001         2   # BR(~chi_2+ -> ~d_L*    u )
     2.78591613E-06    2     1000004        -3   # BR(~chi_2+ -> ~c_L     sb)
     5.41401519E-06    2    -1000003         4   # BR(~chi_2+ -> ~s_L*    c )
     4.71277502E-04    2     1000006        -5   # BR(~chi_2+ -> ~t_1     bb)
     1.90935360E-04    2     2000006        -5   # BR(~chi_2+ -> ~t_2     bb)
     8.44073570E-03    2    -1000005         6   # BR(~chi_2+ -> ~b_1*    t )
     7.81861841E-03    2    -2000005         6   # BR(~chi_2+ -> ~b_2*    t )
     4.91443441E-07    2     1000012       -11   # BR(~chi_2+ -> ~nu_eL   e+  )
     4.91443441E-07    2     1000014       -13   # BR(~chi_2+ -> ~nu_muL  mu+ )
     2.57717807E-06    2     1000016       -15   # BR(~chi_2+ -> ~nu_tau1 tau+)
     9.54576943E-07    2    -1000011        12   # BR(~chi_2+ -> ~e_L+    nu_e)
     9.54576943E-07    2    -1000013        14   # BR(~chi_2+ -> ~mu_L+   nu_mu)
     1.14021989E-07    2    -1000015        16   # BR(~chi_2+ -> ~tau_1+  nu_tau)
     2.90533789E-06    2    -2000015        16   # BR(~chi_2+ -> ~tau_2+  nu_tau)
     2.20655581E-01    2     1000024        23   # BR(~chi_2+ -> ~chi_1+  Z )
     2.15407937E-01    2     1000022        24   # BR(~chi_2+ -> ~chi_10  W+)
     2.21046224E-01    2     1000024        25   # BR(~chi_2+ -> ~chi_1+  h )
     1.08418150E-01    2     1000024        35   # BR(~chi_2+ -> ~chi_1+  H )
     1.08538136E-01    2     1000024        36   # BR(~chi_2+ -> ~chi_1+  A )
     1.08942557E-01    2     1000022        37   # BR(~chi_2+ -> ~chi_10  H+)
     2.93319018E-05    2     1000039        24   # BR(~chi_2+ -> ~G       W+)
     1.56283136E-05    2     1000039        37   # BR(~chi_2+ -> ~G       H+)
#
#         PDG            Width
DECAY   1000022     2.06657872E-8   # neutralino1 decays              
#          BR         NDA      ID1       ID2
     2.63885493E-01    2     1000039        22   # BR(~chi_10 -> ~G        gam)
     7.36114388E-01    2     1000039        23   # BR(~chi_10 -> ~G        Z)
     1.18940791E-07    2     1000039        25   # BR(~chi_10 -> ~G        h)
#
#         PDG            Width
DECAY   1000023     4.46080524E+01   # neutralino2 decays
#          BR         NDA      ID1       ID2
     5.87532572E-03    2     1000022        23   # BR(~chi_20 -> ~chi_10   Z )
     2.18834360E-01    2     1000024       -24   # BR(~chi_20 -> ~chi_1+   W-)
     2.18834360E-01    2    -1000024        24   # BR(~chi_20 -> ~chi_1-   W+)
     2.18805133E-01    2     1000022        25   # BR(~chi_20 -> ~chi_10   h )
     6.41633417E-03    2     1000022        35   # BR(~chi_20 -> ~chi_10   H )
     1.03356697E-01    2     1000022        36   # BR(~chi_20 -> ~chi_10   A )
     1.10350054E-01    2     1000024       -37   # BR(~chi_20 -> ~chi_1+   H-)
     1.10350054E-01    2    -1000024        37   # BR(~chi_20 -> ~chi_1-   H+)
     1.02876786E-04    2     1000002        -2   # BR(~chi_20 -> ~u_L      ub)
     1.02876786E-04    2    -1000002         2   # BR(~chi_20 -> ~u_L*     u )
     1.15567804E-03    2     2000002        -2   # BR(~chi_20 -> ~u_R      ub)
     1.15567804E-03    2    -2000002         2   # BR(~chi_20 -> ~u_R*     u )
     4.69578647E-05    2     1000001        -1   # BR(~chi_20 -> ~d_L      db)
     4.69578647E-05    2    -1000001         1   # BR(~chi_20 -> ~d_L*     d )
     2.88775024E-04    2     2000001        -1   # BR(~chi_20 -> ~d_R      db)
     2.88775024E-04    2    -2000001         1   # BR(~chi_20 -> ~d_R*     d )
     1.02876786E-04    2     1000004        -4   # BR(~chi_20 -> ~c_L      cb)
     1.02876786E-04    2    -1000004         4   # BR(~chi_20 -> ~c_L*     c )
     1.15567804E-03    2     2000004        -4   # BR(~chi_20 -> ~c_R      cb)
     1.15567804E-03    2    -2000004         4   # BR(~chi_20 -> ~c_R*     c )
     4.69578647E-05    2     1000003        -3   # BR(~chi_20 -> ~s_L      sb)
     4.69578647E-05    2    -1000003         3   # BR(~chi_20 -> ~s_L*     s )
     2.88775024E-04    2     2000003        -3   # BR(~chi_20 -> ~s_R      sb)
     2.88775024E-04    2    -2000003         3   # BR(~chi_20 -> ~s_R*     s )
     1.27873296E-04    2     1000005        -5   # BR(~chi_20 -> ~b_1      bb)
     1.27873296E-04    2    -1000005         5   # BR(~chi_20 -> ~b_1*     b )
     3.72988685E-05    2     2000005        -5   # BR(~chi_20 -> ~b_2      bb)
     3.72988685E-05    2    -2000005         5   # BR(~chi_20 -> ~b_2*     b )
     8.15566201E-05    2     1000011       -11   # BR(~chi_20 -> ~e_L-     e+)
     8.15566201E-05    2    -1000011        11   # BR(~chi_20 -> ~e_L+     e-)
     2.87963333E-04    2     2000011       -11   # BR(~chi_20 -> ~e_R-     e+)
     2.87963333E-04    2    -2000011        11   # BR(~chi_20 -> ~e_R+     e-)
     8.15566201E-05    2     1000013       -13   # BR(~chi_20 -> ~mu_L-    mu+)
     8.15566201E-05    2    -1000013        13   # BR(~chi_20 -> ~mu_L+    mu-)
     2.87963333E-04    2     2000013       -13   # BR(~chi_20 -> ~mu_R-    mu+)
     2.87963333E-04    2    -2000013        13   # BR(~chi_20 -> ~mu_R+    mu-)
     1.94587974E-04    2     1000015       -15   # BR(~chi_20 -> ~tau_1-   tau+)
     1.94587974E-04    2    -1000015        15   # BR(~chi_20 -> ~tau_1+   tau-)
     1.77011808E-04    2     2000015       -15   # BR(~chi_20 -> ~tau_2-   tau+)
     1.77011808E-04    2    -2000015        15   # BR(~chi_20 -> ~tau_2+   tau-)
     6.31616659E-05    2     1000012       -12   # BR(~chi_20 -> ~nu_eL    nu_eb)
     6.31616659E-05    2    -1000012        12   # BR(~chi_20 -> ~nu_eL*   nu_e )
     6.31616659E-05    2     1000014       -14   # BR(~chi_20 -> ~nu_muL   nu_mub)
     6.31616659E-05    2    -1000014        14   # BR(~chi_20 -> ~nu_muL*  nu_mu )
     6.31616659E-05    2     1000016       -16   # BR(~chi_20 -> ~nu_tau1  nu_taub)
     6.31616659E-05    2    -1000016        16   # BR(~chi_20 -> ~nu_tau1* nu_tau )
     9.74621548E-06    2     1000039        22   # BR(~chi_20 -> ~G        gam)
     3.05111372E-05    2     1000039        23   # BR(~chi_20 -> ~G        Z)
     1.08729053E-06    2     1000039        25   # BR(~chi_20 -> ~G        h)
     1.47288776E-05    2     1000039        35   # BR(~chi_20 -> ~G        H)
     5.92273160E-07    2     1000039        36   # BR(~chi_20 -> ~G        A)
#
#         PDG            Width
DECAY   1000025     5.37820975E+01   # neutralino3 decays
#          BR         NDA      ID1       ID2
     2.18152668E-01    2     1000022        23   # BR(~chi_30 -> ~chi_10   Z )
     2.18764990E-01    2     1000024       -24   # BR(~chi_30 -> ~chi_1+   W-)
     2.18764990E-01    2    -1000024        24   # BR(~chi_30 -> ~chi_1-   W+)
     5.82338603E-03    2     1000022        25   # BR(~chi_30 -> ~chi_10   h )
     1.03708098E-01    2     1000022        35   # BR(~chi_30 -> ~chi_10   H )
     6.51753530E-03    2     1000022        36   # BR(~chi_30 -> ~chi_10   A )
     1.10594561E-01    2     1000024       -37   # BR(~chi_30 -> ~chi_1+   H-)
     1.10594561E-01    2    -1000024        37   # BR(~chi_30 -> ~chi_1-   H+)
     7.30940495E-08    2     1000002        -2   # BR(~chi_30 -> ~u_L      ub)
     7.30940495E-08    2    -1000002         2   # BR(~chi_30 -> ~u_L*     u )
     4.24481768E-09    2     2000002        -2   # BR(~chi_30 -> ~u_R      ub)
     4.24481768E-09    2    -2000002         2   # BR(~chi_30 -> ~u_R*     u )
     9.16383530E-08    2     1000001        -1   # BR(~chi_30 -> ~d_L      db)
     9.16383530E-08    2    -1000001         1   # BR(~chi_30 -> ~d_L*     d )
     1.06071546E-09    2     2000001        -1   # BR(~chi_30 -> ~d_R      db)
     1.06071546E-09    2    -2000001         1   # BR(~chi_30 -> ~d_R*     d )
     7.30940495E-08    2     1000004        -4   # BR(~chi_30 -> ~c_L      cb)
     7.30940495E-08    2    -1000004         4   # BR(~chi_30 -> ~c_L*     c )
     4.24481768E-09    2     2000004        -4   # BR(~chi_30 -> ~c_R      cb)
     4.24481768E-09    2    -2000004         4   # BR(~chi_30 -> ~c_R*     c )
     9.16383530E-08    2     1000003        -3   # BR(~chi_30 -> ~s_L      sb)
     9.16383530E-08    2    -1000003         3   # BR(~chi_30 -> ~s_L*     s )
     1.06071546E-09    2     2000003        -3   # BR(~chi_30 -> ~s_R      sb)
     1.06071546E-09    2    -2000003         3   # BR(~chi_30 -> ~s_R*     s )
     3.49887602E-03    2     1000006        -6   # BR(~chi_30 -> ~t_1      tb)
     3.49887602E-03    2    -1000006         6   # BR(~chi_30 -> ~t_1*     t )
     7.14999294E-06    2     1000005        -5   # BR(~chi_30 -> ~b_1      bb)
     7.14999294E-06    2    -1000005         5   # BR(~chi_30 -> ~b_1*     b )
     8.43203837E-06    2     2000005        -5   # BR(~chi_30 -> ~b_2      bb)
     8.43203837E-06    2    -2000005         5   # BR(~chi_30 -> ~b_2*     b )
     6.62122126E-09    2     1000011       -11   # BR(~chi_30 -> ~e_L-     e+)
     6.62122126E-09    2    -1000011        11   # BR(~chi_30 -> ~e_L+     e-)
     1.11897331E-09    2     2000011       -11   # BR(~chi_30 -> ~e_R-     e+)
     1.11897331E-09    2    -2000011        11   # BR(~chi_30 -> ~e_R+     e-)
     6.62122126E-09    2     1000013       -13   # BR(~chi_30 -> ~mu_L-    mu+)
     6.62122126E-09    2    -1000013        13   # BR(~chi_30 -> ~mu_L+    mu-)
     1.11897331E-09    2     2000013       -13   # BR(~chi_30 -> ~mu_R-    mu+)
     1.11897331E-09    2    -2000013        13   # BR(~chi_30 -> ~mu_R+    mu-)
     9.43538328E-07    2     1000015       -15   # BR(~chi_30 -> ~tau_1-   tau+)
     9.43538328E-07    2    -1000015        15   # BR(~chi_30 -> ~tau_1+   tau-)
     1.17165908E-06    2     2000015       -15   # BR(~chi_30 -> ~tau_2-   tau+)
     1.17165908E-06    2    -2000015        15   # BR(~chi_30 -> ~tau_2+   tau-)
     1.32124112E-08    2     1000012       -12   # BR(~chi_30 -> ~nu_eL    nu_eb)
     1.32124112E-08    2    -1000012        12   # BR(~chi_30 -> ~nu_eL*   nu_e )
     1.32124112E-08    2     1000014       -14   # BR(~chi_30 -> ~nu_muL   nu_mub)
     1.32124112E-08    2    -1000014        14   # BR(~chi_30 -> ~nu_muL*  nu_mu )
     1.32124112E-08    2     1000016       -16   # BR(~chi_30 -> ~nu_tau1  nu_taub)
     1.32124112E-08    2    -1000016        16   # BR(~chi_30 -> ~nu_tau1* nu_tau )
     2.19110537E-11    2     1000039        22   # BR(~chi_30 -> ~G        gam)
     1.14466685E-06    2     1000039        23   # BR(~chi_30 -> ~G        Z)
     2.85940607E-05    2     1000039        25   # BR(~chi_30 -> ~G        h)
     5.91250262E-07    2     1000039        35   # BR(~chi_30 -> ~G        H)
     1.51714331E-05    2     1000039        36   # BR(~chi_30 -> ~G        A)
#
#         PDG            Width
DECAY   1000035     1.28338900E+01   # neutralino4 decays
#          BR         NDA      ID1       ID2
     4.48968691E-03    2     1000022        23   # BR(~chi_40 -> ~chi_10   Z )
     1.21050032E-07    2     1000023        23   # BR(~chi_40 -> ~chi_20   Z )
     9.17686031E-04    2     1000025        23   # BR(~chi_40 -> ~chi_30   Z )
     1.56481522E-01    2     1000024       -24   # BR(~chi_40 -> ~chi_1+   W-)
     1.56481522E-01    2    -1000024        24   # BR(~chi_40 -> ~chi_1-   W+)
     4.03788069E-03    2     1000037       -24   # BR(~chi_40 -> ~chi_2+   W-)
     4.03788069E-03    2    -1000037        24   # BR(~chi_40 -> ~chi_2-   W+)
     1.56172281E-01    2     1000022        25   # BR(~chi_40 -> ~chi_10   h )
     4.34061009E-03    2     1000022        35   # BR(~chi_40 -> ~chi_10   H )
     7.53829402E-02    2     1000022        36   # BR(~chi_40 -> ~chi_10   A )
     8.01260453E-02    2     1000024       -37   # BR(~chi_40 -> ~chi_1+   H-)
     8.01260453E-02    2    -1000024        37   # BR(~chi_40 -> ~chi_1-   H+)
     1.98125989E-03    2     1000002        -2   # BR(~chi_40 -> ~u_L      ub)
     1.98125989E-03    2    -1000002         2   # BR(~chi_40 -> ~u_L*     u )
     3.43780348E-02    2     2000002        -2   # BR(~chi_40 -> ~u_R      ub)
     3.43780348E-02    2    -2000002         2   # BR(~chi_40 -> ~u_R*     u )
     2.32145435E-03    2     1000001        -1   # BR(~chi_40 -> ~d_L      db)
     2.32145435E-03    2    -1000001         1   # BR(~chi_40 -> ~d_L*     d )
     8.59166565E-03    2     2000001        -1   # BR(~chi_40 -> ~d_R      db)
     8.59166565E-03    2    -2000001         1   # BR(~chi_40 -> ~d_R*     d )
     1.98125989E-03    2     1000004        -4   # BR(~chi_40 -> ~c_L      cb)
     1.98125989E-03    2    -1000004         4   # BR(~chi_40 -> ~c_L*     c )
     3.43780348E-02    2     2000004        -4   # BR(~chi_40 -> ~c_R      cb)
     3.43780348E-02    2    -2000004         4   # BR(~chi_40 -> ~c_R*     c )
     2.32145435E-03    2     1000003        -3   # BR(~chi_40 -> ~s_L      sb)
     2.32145435E-03    2    -1000003         3   # BR(~chi_40 -> ~s_L*     s )
     8.59166565E-03    2     2000003        -3   # BR(~chi_40 -> ~s_R      sb)
     8.59166565E-03    2    -2000003         3   # BR(~chi_40 -> ~s_R*     s )
     1.46139688E-02    2     1000006        -6   # BR(~chi_40 -> ~t_1      tb)
     1.46139688E-02    2    -1000006         6   # BR(~chi_40 -> ~t_1*     t )
     2.92979955E-03    2     1000005        -5   # BR(~chi_40 -> ~b_1      bb)
     2.92979955E-03    2    -1000005         5   # BR(~chi_40 -> ~b_1*     b )
     3.38916599E-03    2     2000005        -5   # BR(~chi_40 -> ~b_2      bb)
     3.38916599E-03    2    -2000005         5   # BR(~chi_40 -> ~b_2*     b )
     2.73064472E-03    2     1000011       -11   # BR(~chi_40 -> ~e_L-     e+)
     2.73064472E-03    2    -1000011        11   # BR(~chi_40 -> ~e_L+     e-)
     1.12192041E-02    2     2000011       -11   # BR(~chi_40 -> ~e_R-     e+)
     1.12192041E-02    2    -2000011        11   # BR(~chi_40 -> ~e_R+     e-)
     2.73064472E-03    2     1000013       -13   # BR(~chi_40 -> ~mu_L-    mu+)
     2.73064472E-03    2    -1000013        13   # BR(~chi_40 -> ~mu_L+    mu-)
     1.12192041E-02    2     2000013       -13   # BR(~chi_40 -> ~mu_R-    mu+)
     1.12192041E-02    2    -2000013        13   # BR(~chi_40 -> ~mu_R+    mu-)
     6.94560773E-03    2     1000015       -15   # BR(~chi_40 -> ~tau_1-   tau+)
     6.94560773E-03    2    -1000015        15   # BR(~chi_40 -> ~tau_1+   tau-)
     7.00517938E-03    2     2000015       -15   # BR(~chi_40 -> ~tau_2-   tau+)
     7.00517938E-03    2    -2000015        15   # BR(~chi_40 -> ~tau_2+   tau-)
     2.88399739E-03    2     1000012       -12   # BR(~chi_40 -> ~nu_eL    nu_eb)
     2.88399739E-03    2    -1000012        12   # BR(~chi_40 -> ~nu_eL*   nu_e )
     2.88399739E-03    2     1000014       -14   # BR(~chi_40 -> ~nu_muL   nu_mub)
     2.88399739E-03    2    -1000014        14   # BR(~chi_40 -> ~nu_muL*  nu_mu )
     2.88399739E-03    2     1000016       -16   # BR(~chi_40 -> ~nu_tau1  nu_taub)
     2.88399739E-03    2    -1000016        16   # BR(~chi_40 -> ~nu_tau1* nu_tau )
     1.70408537E-04    2     1000039        22   # BR(~chi_40 -> ~G        gam)
     7.81300845E-05    2     1000039        23   # BR(~chi_40 -> ~G        Z)
     9.10246927E-07    2     1000039        25   # BR(~chi_40 -> ~G        h)
     1.24136659E-05    2     1000039        35   # BR(~chi_40 -> ~G        H)
     4.88701304E-07    2     1000039        36   # BR(~chi_40 -> ~G        A)
#
#         PDG            Width
DECAY        25     4.09642529E-03   # h decays
#          BR         NDA      ID1       ID2
     6.18346584E-01    2           5        -5   # BR(h -> b       bb     )
     6.35999925E-02    2         -15        15   # BR(h -> tau+    tau-   )
     2.25120550E-04    2         -13        13   # BR(h -> mu+     mu-    )
     4.77046693E-04    2           3        -3   # BR(h -> s       sb     )
     2.05722555E-02    2           4        -4   # BR(h -> c       cb     )
     6.68042264E-02    2          21        21   # BR(h -> g       g      )
     2.29978419E-03    2          22        22   # BR(h -> gam     gam    )
     1.53266989E-03    2          22        23   # BR(h -> Z       gam    )
     2.00592335E-01    2          24       -24   # BR(h -> W+      W-     )
     2.55499850E-02    2          23        23   # BR(h -> Z       Z      )
#
#         PDG            Width
DECAY        35     3.76354603E+01   # H decays
#          BR         NDA      ID1       ID2
     1.46417194E-03    2           5        -5   # BR(H -> b       bb     )
     2.47530214E-04    2         -15        15   # BR(H -> tau+    tau-   )
     8.75111463E-07    2         -13        13   # BR(H -> mu+     mu-    )
     1.12042550E-06    2           3        -3   # BR(H -> s       sb     )
     1.01157915E-05    2           4        -4   # BR(H -> c       cb     )
     9.96023570E-01    2           6        -6   # BR(H -> t       tb     )
     7.96279180E-04    2          21        21   # BR(H -> g       g      )
     2.75086014E-06    2          22        22   # BR(H -> gam     gam    )
     1.15397473E-06    2          23        22   # BR(H -> Z       gam    )
     3.66617013E-04    2          24       -24   # BR(H -> W+      W-     )
     1.82807882E-04    2          23        23   # BR(H -> Z       Z      )
     8.72491359E-04    2          25        25   # BR(H -> h       h      )
     5.92219455E-24    2          36        36   # BR(H -> A       A      )
     2.72040501E-11    2          23        36   # BR(H -> Z       A      )
     1.18741938E-08    2          24       -37   # BR(H -> W+      H-     )
     1.18741938E-08    2         -24        37   # BR(H -> W-      H+     )
     2.03267501E-05    2     1000024  -1000024   # BR(H -> ~chi_1+ ~chi_1-)
     1.01661714E-05    2     1000022   1000022   # BR(H -> ~chi_10 ~chi_10)
#
#         PDG            Width
DECAY        36     3.80594726E+01   # A decays
#          BR         NDA      ID1       ID2
     1.46751378E-03    2           5        -5   # BR(A -> b       bb     )
     2.45043244E-04    2         -15        15   # BR(A -> tau+    tau-   )
     8.66316388E-07    2         -13        13   # BR(A -> mu+     mu-    )
     1.14207062E-06    2           3        -3   # BR(A -> s       sb     )
     1.00081664E-05    2           4        -4   # BR(A -> c       cb     )
     9.96647136E-01    2           6        -6   # BR(A -> t       tb     )
     9.41976716E-04    2          21        21   # BR(A -> g       g      )
     2.93328369E-06    2          22        22   # BR(A -> gam     gam    )
     1.34553790E-06    2          23        22   # BR(A -> Z       gam    )
     3.57394807E-04    2          23        25   # BR(A -> Z       h      )
     2.16403592E-04    2     1000024  -1000024   # BR(A -> ~chi_1+ ~chi_1-)
     1.08236053E-04    2     1000022   1000022   # BR(A -> ~chi_10 ~chi_10)
#
#         PDG            Width
DECAY        37     3.71177835E+01   # H+ decays
#          BR         NDA      ID1       ID2
     2.34636613E-06    2           4        -5   # BR(H+ -> c       bb     )
     2.50359189E-04    2         -15        16   # BR(H+ -> tau+    nu_tau )
     8.85110184E-07    2         -13        14   # BR(H+ -> mu+     nu_mu  )
     1.49163520E-08    2           2        -5   # BR(H+ -> u       bb     )
     5.48452881E-08    2           2        -3   # BR(H+ -> u       sb     )
     1.09281503E-05    2           4        -3   # BR(H+ -> c       sb     )
     9.99372416E-01    2           6        -5   # BR(H+ -> t       bb     )
     3.62995411E-04    2          24        25   # BR(H+ -> W+      h      )
     1.48149563E-12    2     1000024   1000022   # BR(H+ -> ~chi_1+ ~chi_10)
