#
#                              ======================
#                              | THE SUSYHIT OUTPUT |
#                              ======================
#
#
#              ------------------------------------------------------
#              |     This is the output of the SUSY-HIT package     |
#              |  created by A.Djouadi, M.Muehlleitner and M.Spira. |
#              |  In case of problems with SUSY-HIT email to        |
#              |           margarete.muehlleitner@kit.edu           |
#              |           michael.spira@psi.ch                     |
#              |           abdelhak.djouadi@cern.ch                 |
#              ------------------------------------------------------
#
#              ------------------------------------------------------
#              |  SUSY Les Houches Accord - MSSM Spectrum + Decays  |
#              |              based on the decay programs           |
#              |                                                    |
#              |                     SDECAY 1.5a                    |
#              |                                                    |
#              |  Authors: M.Muhlleitner, A.Djouadi and Y.Mambrini  |
#              |  Ref.:    Comput.Phys.Commun.168(2005)46           |
#              |           [hep-ph/0311167]                         |
#              |                                                    |
#              |                     HDECAY 3.4                     |
#              |                                                    |
#              |  By: A.Djouadi,J.Kalinowski,M.Muhlleitner,M.Spira  |
#              |  Ref.:    Comput.Phys.Commun.108(1998)56           |
#              |           [hep-ph/9704448]                         |
#              |                                                    |
#              |                                                    |
#              |  If not stated otherwise all DRbar couplings and   |
#              |  soft SUSY breaking masses are given at the scale  |
#              |  Q=  0.91187600E+02
#              |                                                    |
#              ------------------------------------------------------
#
#
BLOCK DCINFO  # Decay Program information
     1   SDECAY/HDECAY # decay calculator
     2   1.5a /3.4    # version number
#
BLOCK SPINFO  # Spectrum calculator information
     1   SuSpect     # RGE +Spectrum calculator            
     2   2.43         # version number                     
#
BLOCK MODSEL  # Model selection
     1     2   # GMSB                                              
#
BLOCK SMINPUTS  # Standard Model inputs
         1     1.27932904E+02   # alpha_em^-1(M_Z)^MSbar
         2     1.16639000E-05   # G_F [GeV^-2]
         3     1.17200000E-01   # alpha_S(M_Z)^MSbar
         4     9.11870000E+01   # M_Z pole mass
         5     4.25000000E+00   # mb(mb)^MSbar
         6     1.72900000E+02   # mt pole mass
         7     1.77700000E+00   # mtau pole mass
#
BLOCK MINPAR  # Input parameters - minimal models
#
BLOCK EXTPAR  # Input parameters - non-minimal models
         0     9.11876000E+01   # EWSB                
         1     8.48000000E+02   # M_1                 
         2     3.00000000E+03   # M_2                 
         3     2.40000000E+03   # M_3                 
        11     0.00000000E+00   # A_t                 
        12     0.00000000E+00   # A_b                 
        13     0.00000000E+00   # A_tau               
        14     0.00000000E+00   # A_u                 
        15     0.00000000E+00   # A_d                 
        16     0.00000000E+00   # A_e                 
        23     8.50000000E+02   # mu(EWSB)            
        25     1.50000000E+00   # tanbeta(in)         
        26     2.00000000E+03   # MA_pole             
        31     5.00000000E+03   # M_eL                
        32     5.00000000E+03   # M_muL               
        33     5.00000000E+03   # M_tauL              
        34     5.00000000E+03   # M_eR                
        35     5.00000000E+03   # M_muR               
        36     5.00000000E+03   # M_tauR              
        41     5.00000000E+03   # M_q1L               
        42     5.00000000E+03   # M_q2L               
        43     5.00000000E+03   # M_q3L               
        44     5.00000000E+03   # M_uR                
        45     5.00000000E+03   # M_cR                
        46     5.00000000E+03   # M_tR                
        47     5.00000000E+03   # M_dR                
        48     5.00000000E+03   # M_sR                
        49     5.00000000E+03   # M_bR                
#
BLOCK MASS  # Mass Spectrum
# PDG code           mass       particle
        24     8.05400794E+01   # W+
        25     1.25000000E+02   # h
        35     2.00404201E+03   # H
        36     2.00000000E+03   # A
        37     2.00148504E+03   # H+
         5     4.87877839E+00   # b-quark pole mass calculated from mb(mb)_Msbar
   1000001     5.00013297E+03   # ~d_L
   2000001     5.00002535E+03   # ~d_R
   1000002     4.99989238E+03   # ~u_L
   2000002     4.99994930E+03   # ~u_R
   1000003     5.00013297E+03   # ~s_L
   2000003     5.00002535E+03   # ~s_R
   1000004     4.99989238E+03   # ~c_L
   2000004     4.99994930E+03   # ~c_R
   1000005     4.99973299E+03   # ~b_1
   2000005     5.00042674E+03   # ~b_2
   1000006     4.99360937E+03   # ~t_1
   2000006     5.01084748E+03   # ~t_2
   1000011     5.00008227E+03   # ~e_L
   2000011     5.00007605E+03   # ~e_R
   1000012     4.99984168E+03   # ~nu_eL
   1000013     5.00008227E+03   # ~mu_L
   2000013     5.00007605E+03   # ~mu_R
   1000014     4.99984168E+03   # ~nu_muL
   1000015     4.99985276E+03   # ~tau_1
   2000015     5.00030618E+03   # ~tau_2
   1000016     4.99984168E+03   # ~nu_tauL
   1000021     2.40000000E+03   # ~g
   1000022     8.04052158E+02   # ~chi_10
   1000023    -8.50107442E+02   # ~chi_20
   1000025     8.91197818E+02   # ~chi_30
   1000035     3.00285747E+03   # ~chi_40
   1000024     8.47268582E+02   # ~chi_1+
   1000037     3.00285640E+03   # ~chi_2+
   1000039     1.00000000E-09   # ~gravitino
#
BLOCK NMIX  # Neutralino Mixing Matrix
  1  1     7.03691383E-01   # N_11
  1  2    -2.50491610E-02   # N_12
  1  3     5.04872837E-01   # N_13
  1  4    -4.99293898E-01   # N_14
  2  1     5.14342950E-03   # N_21
  2  2    -4.03497198E-03   # N_22
  2  3    -7.06868206E-01   # N_23
  2  4    -7.07315067E-01   # N_24
  3  1     7.10486754E-01   # N_31
  3  2     2.58867405E-02   # N_32
  3  3    -4.94903082E-01   # N_33
  3  4     4.99609236E-01   # N_34
  4  1     7.45043457E-04   # N_41
  4  2    -9.99342852E-01   # N_42
  4  3    -2.26207404E-02   # N_43
  4  4     2.83127500E-02   # N_44
#
BLOCK UMIX  # Chargino Mixing Matrix U
  1  1    -3.19753213E-02   # U_11
  1  2     9.99488659E-01   # U_12
  2  1     9.99488659E-01   # U_21
  2  2     3.19753213E-02   # U_22
#
BLOCK VMIX  # Chargino Mixing Matrix V
  1  1    -4.00275133E-02   # V_11
  1  2     9.99198578E-01   # V_12
  2  1     9.99198578E-01   # V_21
  2  2     4.00275133E-02   # V_22
#
BLOCK STOPMIX  # Stop Mixing Matrix
  1  1     7.08272757E-01   # cos(theta_t)
  1  2     7.05938880E-01   # sin(theta_t)
  2  1    -7.05938880E-01   # -sin(theta_t)
  2  2     7.08272757E-01   # cos(theta_t)
#
BLOCK SBOTMIX  # Sbottom Mixing Matrix
  1  1     6.49951927E-01   # cos(theta_b)
  1  2     7.59975324E-01   # sin(theta_b)
  2  1    -7.59975324E-01   # -sin(theta_b)
  2  2     6.49951927E-01   # cos(theta_b)
#
BLOCK STAUMIX  # Stau Mixing Matrix
  1  1     7.02237532E-01   # cos(theta_tau)
  1  2     7.11942728E-01   # sin(theta_tau)
  2  1    -7.11942728E-01   # -sin(theta_tau)
  2  2     7.02237532E-01   # cos(theta_tau)
#
BLOCK ALPHA  # Higgs mixing
          -5.90208510E-01   # Mixing angle in the neutral Higgs boson sector
#
BLOCK HMIX Q=  9.11876000E+01  # DRbar Higgs Parameters
         1     8.50000000E+02   # mu(Q)               
         2     1.49999979E+00   # tanbeta(Q)          
         3     2.52038931E+02   # vev(Q)              
         4     3.56800557E+06   # MA^2(Q)             
#
BLOCK GAUGE Q=  9.11876000E+01  # The gauge couplings
     1     3.52850572E-01   # gprime(Q) DRbar
     2     6.27604779E-01   # g(Q) DRbar
     3     1.07754526E+00   # g3(Q) DRbar
#
BLOCK AU Q=  9.11876000E+01  # The trilinear couplings
  1  1     0.00000000E+00   # A_u(Q) DRbar
  2  2     0.00000000E+00   # A_c(Q) DRbar
  3  3     0.00000000E+00   # A_t(Q) DRbar
#
BLOCK AD Q=  9.11876000E+01  # The trilinear couplings
  1  1     0.00000000E+00   # A_d(Q) DRbar
  2  2     0.00000000E+00   # A_s(Q) DRbar
  3  3     0.00000000E+00   # A_b(Q) DRbar
#
BLOCK AE Q=  9.11876000E+01  # The trilinear couplings
  1  1     0.00000000E+00   # A_e(Q) DRbar
  2  2     0.00000000E+00   # A_mu(Q) DRbar
  3  3     0.00000000E+00   # A_tau(Q) DRbar
#
BLOCK Yu Q=  9.11876000E+01  # The Yukawa couplings
  1  1     0.00000000E+00   # y_u(Q) DRbar
  2  2     0.00000000E+00   # y_c(Q) DRbar
  3  3     1.02617380E+00   # y_t(Q) DRbar
#
BLOCK Yd Q=  9.11876000E+01  # The Yukawa couplings
  1  1     0.00000000E+00   # y_d(Q) DRbar
  2  2     0.00000000E+00   # y_s(Q) DRbar
  3  3     2.71874833E-02   # y_b(Q) DRbar
#
BLOCK Ye Q=  9.11876000E+01  # The Yukawa couplings
  1  1     0.00000000E+00   # y_e(Q) DRbar
  2  2     0.00000000E+00   # y_mu(Q) DRbar
  3  3     1.79851783E-02   # y_tau(Q) DRbar
#
BLOCK MSOFT Q=  9.11876000E+01  # The soft SUSY breaking masses at the scale Q
         1     8.48000000E+02   # M_1                 
         2     3.00000000E+03   # M_2                 
         3     2.40000000E+03   # M_3                 
        14     0.00000000E+00   # A_u                 
        15     0.00000000E+00   # A_d                 
        16     0.00000000E+00   # A_e                 
        21     2.24398379E+06   # M^2_Hd              
        22    -6.01515965E+06   # M^2_Hu              
        31     5.00000000E+03   # M_eL                
        32     5.00000000E+03   # M_muL               
        33     5.00000000E+03   # M_tauL              
        34     5.00000000E+03   # M_eR                
        35     5.00000000E+03   # M_muR               
        36     5.00000000E+03   # M_tauR              
        41     5.00000000E+03   # M_q1L               
        42     5.00000000E+03   # M_q2L               
        43     5.00000000E+03   # M_q3L               
        44     5.00000000E+03   # M_uR                
        45     5.00000000E+03   # M_cR                
        46     5.00000000E+03   # M_tR                
        47     5.00000000E+03   # M_dR                
        48     5.00000000E+03   # M_sR                
        49     5.00000000E+03   # M_bR                
#
#
#
#                             =================
#                             |The decay table|
#                             =================
#
# - The QCD corrections to the decays gluino -> squark  + quark
#                                     squark -> gaugino + quark_prime
#                                     squark -> squark_prime + Higgs
#                                     squark -> gluino  + quark
#   are included.
#
# - The multi-body decays for the inos, stops and sbottoms are included.
#
# - The loop induced decays for the gluino, neutralinos and stops
#   are included.
#
# - The SUSY decays of the top quark are included.
#
# - Possible decays of the NLSP in GMSB models are included.
#
#
#         PDG            Width
DECAY         6     1.37240607E+00   # top decays
#          BR         NDA      ID1       ID2
     1.00000000E+00    2           5        24   # BR(t ->  b    W+)
#
#         PDG            Width
DECAY   1000021     5.22376505E-03   # gluino decays
#          BR         NDA      ID1       ID2
     4.04184519E-03    2     1000022        21   # BR(~g -> ~chi_10 g)
     7.77571309E-03    2     1000023        21   # BR(~g -> ~chi_20 g)
     3.69887941E-03    2     1000025        21   # BR(~g -> ~chi_30 g)
#          BR         NDA      ID1       ID2
     0.00000000E+00    2     1000039        21   # BR(~g -> ~G      g)
#           BR         NDA      ID1       ID2       ID3
     4.31498877E-03    3     1000022         1        -1   # BR(~g -> ~chi_10 d  db)
     5.39107480E-07    3     1000023         1        -1   # BR(~g -> ~chi_20 d  db)
     3.21619374E-03    3     1000025         1        -1   # BR(~g -> ~chi_30 d  db)
     1.32715284E-02    3     1000022         2        -2   # BR(~g -> ~chi_10 u  ub)
     4.56403809E-07    3     1000023         2        -2   # BR(~g -> ~chi_20 u  ub)
     1.20569540E-02    3     1000025         2        -2   # BR(~g -> ~chi_30 u  ub)
     4.31498877E-03    3     1000022         3        -3   # BR(~g -> ~chi_10 s  sb)
     5.39107480E-07    3     1000023         3        -3   # BR(~g -> ~chi_20 s  sb)
     3.21619374E-03    3     1000025         3        -3   # BR(~g -> ~chi_30 s  sb)
     1.32715284E-02    3     1000022         4        -4   # BR(~g -> ~chi_10 c  cb)
     4.56403809E-07    3     1000023         4        -4   # BR(~g -> ~chi_20 c  cb)
     1.20569540E-02    3     1000025         4        -4   # BR(~g -> ~chi_30 c  cb)
     4.39443018E-03    3     1000022         5        -5   # BR(~g -> ~chi_10 b  bb)
     1.72050292E-04    3     1000023         5        -5   # BR(~g -> ~chi_20 b  bb)
     3.30515124E-03    3     1000025         5        -5   # BR(~g -> ~chi_30 b  bb)
     1.13770472E-01    3     1000022         6        -6   # BR(~g -> ~chi_10 t  tb)
     2.04519404E-01    3     1000023         6        -6   # BR(~g -> ~chi_20 t  tb)
     1.22235367E-01    3     1000025         6        -6   # BR(~g -> ~chi_30 t  tb)
     1.10588362E-04    3     1000024         1        -2   # BR(~g -> ~chi_1+ d  ub)
     1.10588362E-04    3    -1000024         2        -1   # BR(~g -> ~chi_1- u  db)
     1.10588362E-04    3     1000024         3        -4   # BR(~g -> ~chi_1+ s  cb)
     1.10588362E-04    3    -1000024         4        -3   # BR(~g -> ~chi_1- c  sb)
     2.26186873E-01    3     1000024         5        -6   # BR(~g -> ~chi_1+ b  tb)
     2.26186873E-01    3    -1000024         6        -5   # BR(~g -> ~chi_1- t  bb)
#
#         PDG            Width
DECAY   1000006     2.83571471E+02   # stop1 decays
#          BR         NDA      ID1       ID2
     9.47072649E-02    2     1000022         6   # BR(~t_1 -> ~chi_10 t )
     1.21750907E-01    2     1000023         6   # BR(~t_1 -> ~chi_20 t )
     4.57132339E-02    2     1000025         6   # BR(~t_1 -> ~chi_30 t )
     1.22943096E-02    2     1000035         6   # BR(~t_1 -> ~chi_40 t )
     1.26075293E-01    2     1000024         5   # BR(~t_1 -> ~chi_1+ b )
     2.44495358E-02    2     1000037         5   # BR(~t_1 -> ~chi_2+ b )
     5.75009455E-01    2     1000021         6   # BR(~t_1 -> ~g      t )
#
#         PDG            Width
DECAY   2000006     2.71072180E+02   # stop2 decays
#          BR         NDA      ID1       ID2
     4.52726970E-02    2     1000022         6   # BR(~t_2 -> ~chi_10 t )
     1.23533777E-01    2     1000023         6   # BR(~t_2 -> ~chi_20 t )
     9.72435788E-02    2     1000025         6   # BR(~t_2 -> ~chi_30 t )
     1.59910194E-02    2     1000035         6   # BR(~t_2 -> ~chi_40 t )
     1.19257959E-01    2     1000024         5   # BR(~t_2 -> ~chi_1+ b )
     3.18354943E-02    2     1000037         5   # BR(~t_2 -> ~chi_2+ b )
     5.66865475E-01    2     1000021         6   # BR(~t_2 -> ~g      t )
#
#         PDG            Width
DECAY   1000005     1.90746509E+02   # sbottom1 decays
#          BR         NDA      ID1       ID2
     6.10815211E-03    2     1000022         5   # BR(~b_1 -> ~chi_10 b )
     1.03156505E-04    2     1000023         5   # BR(~b_1 -> ~chi_20 b )
     3.82462919E-03    2     1000025         5   # BR(~b_1 -> ~chi_30 b )
     1.42868242E-02    2     1000035         5   # BR(~b_1 -> ~chi_40 b )
     1.15840212E-01    2    -1000024         6   # BR(~b_1 -> ~chi_1- t )
     2.87100938E-02    2    -1000037         6   # BR(~b_1 -> ~chi_2- t )
     8.31126932E-01    2     1000021         5   # BR(~b_1 -> ~g      b )
#
#         PDG            Width
DECAY   2000005     2.20648734E+02   # sbottom2 decays
#          BR         NDA      ID1       ID2
     2.46548384E-03    2     1000022         5   # BR(~b_2 -> ~chi_10 b )
     1.29385943E-04    2     1000023         5   # BR(~b_2 -> ~chi_20 b )
     3.40100915E-03    2     1000025         5   # BR(~b_2 -> ~chi_30 b )
     2.27690106E-02    2     1000035         5   # BR(~b_2 -> ~chi_40 b )
     2.07633087E-01    2    -1000024         6   # BR(~b_2 -> ~chi_1- t )
     4.57787070E-02    2    -1000037         6   # BR(~b_2 -> ~chi_2- t )
     7.17823316E-01    2     1000021         5   # BR(~b_2 -> ~g      b )
#
#         PDG            Width
DECAY   1000002     1.82386609E+02   # sup_L decays
#          BR         NDA      ID1       ID2
     1.11910374E-03    2     1000022         2   # BR(~u_L -> ~chi_10 u)
     9.19203887E-07    2     1000023         2   # BR(~u_L -> ~chi_20 u)
     2.45076926E-03    2     1000025         2   # BR(~u_L -> ~chi_30 u)
     4.24554453E-02    2     1000035         2   # BR(~u_L -> ~chi_40 u)
     3.12428952E-04    2     1000024         1   # BR(~u_L -> ~chi_1+ d)
     8.49101682E-02    2     1000037         1   # BR(~u_L -> ~chi_2+ d)
     8.68751165E-01    2     1000021         2   # BR(~u_L -> ~g      u)
#
#         PDG            Width
DECAY   2000002     1.68442835E+02   # sup_R decays
#          BR         NDA      ID1       ID2
     2.95465754E-02    2     1000022         2   # BR(~u_R -> ~chi_10 u)
     1.56881848E-06    2     1000023         2   # BR(~u_R -> ~chi_20 u)
     2.97615321E-02    2     1000025         2   # BR(~u_R -> ~chi_30 u)
     1.43625655E-08    2     1000035         2   # BR(~u_R -> ~chi_40 u)
     9.40690309E-01    2     1000021         2   # BR(~u_R -> ~g      u)
#
#         PDG            Width
DECAY   1000001     1.82392677E+02   # sdown_L decays
#          BR         NDA      ID1       ID2
     2.41492644E-03    2     1000022         1   # BR(~d_L -> ~chi_10 d)
     2.43550676E-06    2     1000023         1   # BR(~d_L -> ~chi_20 d)
     1.11485266E-03    2     1000025         1   # BR(~d_L -> ~chi_30 d)
     4.24843893E-02    2     1000035         1   # BR(~d_L -> ~chi_40 d)
     1.99376112E-04    2    -1000024         2   # BR(~d_L -> ~chi_1- u)
     8.49698973E-02    2    -1000037         2   # BR(~d_L -> ~chi_2- u)
     8.68814123E-01    2     1000021         1   # BR(~d_L -> ~g      d)
#
#         PDG            Width
DECAY   2000001     1.60955455E+02   # sdown_R decays
#          BR         NDA      ID1       ID2
     7.73039012E-03    2     1000022         1   # BR(~d_R -> ~chi_10 d)
     4.10456408E-07    2     1000023         1   # BR(~d_R -> ~chi_20 d)
     7.78663301E-03    2     1000025         1   # BR(~d_R -> ~chi_30 d)
     3.75785725E-09    2     1000035         1   # BR(~d_R -> ~chi_40 d)
     9.84482563E-01    2     1000021         1   # BR(~d_R -> ~g      d)
#
#         PDG            Width
DECAY   1000004     1.82386609E+02   # scharm_L decays
#          BR         NDA      ID1       ID2
     1.11910374E-03    2     1000022         4   # BR(~c_L -> ~chi_10 c)
     9.19203887E-07    2     1000023         4   # BR(~c_L -> ~chi_20 c)
     2.45076926E-03    2     1000025         4   # BR(~c_L -> ~chi_30 c)
     4.24554453E-02    2     1000035         4   # BR(~c_L -> ~chi_40 c)
     3.12428952E-04    2     1000024         3   # BR(~c_L -> ~chi_1+ s)
     8.49101682E-02    2     1000037         3   # BR(~c_L -> ~chi_2+ s)
     8.68751165E-01    2     1000021         4   # BR(~c_L -> ~g      c)
#
#         PDG            Width
DECAY   2000004     1.68442835E+02   # scharm_R decays
#          BR         NDA      ID1       ID2
     2.95465754E-02    2     1000022         4   # BR(~c_R -> ~chi_10 c)
     1.56881848E-06    2     1000023         4   # BR(~c_R -> ~chi_20 c)
     2.97615321E-02    2     1000025         4   # BR(~c_R -> ~chi_30 c)
     1.43625655E-08    2     1000035         4   # BR(~c_R -> ~chi_40 c)
     9.40690309E-01    2     1000021         4   # BR(~c_R -> ~g      c)
#
#         PDG            Width
DECAY   1000003     1.82392677E+02   # sstrange_L decays
#          BR         NDA      ID1       ID2
     2.41492644E-03    2     1000022         3   # BR(~s_L -> ~chi_10 s)
     2.43550676E-06    2     1000023         3   # BR(~s_L -> ~chi_20 s)
     1.11485266E-03    2     1000025         3   # BR(~s_L -> ~chi_30 s)
     4.24843893E-02    2     1000035         3   # BR(~s_L -> ~chi_40 s)
     1.99376112E-04    2    -1000024         4   # BR(~s_L -> ~chi_1- c)
     8.49698973E-02    2    -1000037         4   # BR(~s_L -> ~chi_2- c)
     8.68814123E-01    2     1000021         3   # BR(~s_L -> ~g      s)
#
#         PDG            Width
DECAY   2000003     1.60955455E+02   # sstrange_R decays
#          BR         NDA      ID1       ID2
     7.73039012E-03    2     1000022         3   # BR(~s_R -> ~chi_10 s)
     4.10456408E-07    2     1000023         3   # BR(~s_R -> ~chi_20 s)
     7.78663301E-03    2     1000025         3   # BR(~s_R -> ~chi_30 s)
     3.75785725E-09    2     1000035         3   # BR(~s_R -> ~chi_40 s)
     9.84482563E-01    2     1000021         3   # BR(~s_R -> ~g      s)
#
#         PDG            Width
DECAY   1000011     2.99021419E+01   # selectron_L decays
#          BR         NDA      ID1       ID2
     8.53791445E-02    2     1000022        11   # BR(~e_L -> ~chi_10 e-)
     8.07509952E-07    2     1000023        11   # BR(~e_L -> ~chi_20 e-)
     1.11113901E-01    2     1000025        11   # BR(~e_L -> ~chi_30 e-)
     2.67212489E-01    2     1000035        11   # BR(~e_L -> ~chi_40 e-)
     1.26386857E-03    2    -1000024        12   # BR(~e_L -> ~chi_1- nu_e)
     5.35029790E-01    2    -1000037        12   # BR(~e_L -> ~chi_2- nu_e)
#
#         PDG            Width
DECAY   2000011     2.33615633E+01   # selectron_R decays
#          BR         NDA      ID1       ID2
     4.98223750E-01    2     1000022        11   # BR(~e_R -> ~chi_10 e-)
     2.64511308E-05    2     1000023        11   # BR(~e_R -> ~chi_20 e-)
     5.01749558E-01    2     1000025        11   # BR(~e_R -> ~chi_30 e-)
     2.40559707E-07    2     1000035        11   # BR(~e_R -> ~chi_40 e-)
#
#         PDG            Width
DECAY   1000013     2.99021419E+01   # smuon_L decays
#          BR         NDA      ID1       ID2
     8.53791445E-02    2     1000022        13   # BR(~mu_L -> ~chi_10 mu-)
     8.07509952E-07    2     1000023        13   # BR(~mu_L -> ~chi_20 mu-)
     1.11113901E-01    2     1000025        13   # BR(~mu_L -> ~chi_30 mu-)
     2.67212489E-01    2     1000035        13   # BR(~mu_L -> ~chi_40 mu-)
     1.26386857E-03    2    -1000024        14   # BR(~mu_L -> ~chi_1- nu_mu)
     5.35029790E-01    2    -1000037        14   # BR(~mu_L -> ~chi_2- nu_mu)
#
#         PDG            Width
DECAY   2000013     2.33615633E+01   # smuon_R decays
#          BR         NDA      ID1       ID2
     4.98223750E-01    2     1000022        13   # BR(~mu_R -> ~chi_10 mu-)
     2.64511308E-05    2     1000023        13   # BR(~mu_R -> ~chi_20 mu-)
     5.01749558E-01    2     1000025        13   # BR(~mu_R -> ~chi_30 mu-)
     2.40559707E-07    2     1000035        13   # BR(~mu_R -> ~chi_40 mu-)
#
#         PDG            Width
DECAY   1000015     2.66658094E+01   # stau_1 decays
#          BR         NDA      ID1       ID2
     2.74754280E-01    2     1000022        15   # BR(~tau_1 -> ~chi_10  tau-)
     4.43327204E-04    2     1000023        15   # BR(~tau_1 -> ~chi_20  tau-)
     2.79383506E-01    2     1000025        15   # BR(~tau_1 -> ~chi_30  tau-)
     1.47468300E-01    2     1000035        15   # BR(~tau_1 -> ~chi_40  tau-)
     2.54457577E-03    2    -1000024        16   # BR(~tau_1 -> ~chi_1-  nu_tau)
     2.95271109E-01    2    -1000037        16   # BR(~tau_1 -> ~chi_2-  nu_tau)
     1.34901790E-04    2     1000039        15   # BR(~tau_1 -> ~G       tau-)
#
#         PDG            Width
DECAY   2000015     2.66925118E+01   # stau_2 decays
#          BR         NDA      ID1       ID2
     2.57797740E-01    2     1000022        15   # BR(~tau_2 -> ~chi_10  tau-)
     7.17145051E-04    2     1000023        15   # BR(~tau_2 -> ~chi_20  tau-)
     2.85062489E-01    2     1000025        15   # BR(~tau_2 -> ~chi_30  tau-)
     1.52023606E-01    2     1000035        15   # BR(~tau_2 -> ~chi_40  tau-)
     9.73231471E-06    2    -1000024        16   # BR(~tau_2 -> ~chi_1-  nu_tau)
     3.04389287E-01    2    -1000037        16   # BR(~tau_2 -> ~chi_2-  nu_tau)
#
#         PDG            Width
DECAY   1000012     2.99017847E+01   # snu_eL decays
#          BR         NDA      ID1       ID2
     1.10019726E-01    2     1000022        12   # BR(~nu_eL -> ~chi_10 nu_e)
     2.96417754E-05    2     1000023        12   # BR(~nu_eL -> ~chi_20 nu_e)
     8.57061475E-02    2     1000025        12   # BR(~nu_eL -> ~chi_30 nu_e)
     2.67622131E-01    2     1000035        12   # BR(~nu_eL -> ~chi_40 nu_e)
     1.98048301E-03    2     1000024        11   # BR(~nu_eL -> ~chi_1+ e-)
     5.34641871E-01    2     1000037        11   # BR(~nu_eL -> ~chi_2+ e-)
#
#         PDG            Width
DECAY   1000014     2.99017847E+01   # snu_muL decays
#          BR         NDA      ID1       ID2
     1.10019726E-01    2     1000022        14   # BR(~nu_muL -> ~chi_10 nu_mu)
     2.96417754E-05    2     1000023        14   # BR(~nu_muL -> ~chi_20 nu_mu)
     8.57061475E-02    2     1000025        14   # BR(~nu_muL -> ~chi_30 nu_mu)
     2.67622131E-01    2     1000035        14   # BR(~nu_muL -> ~chi_40 nu_mu)
     1.98048301E-03    2     1000024        13   # BR(~nu_muL -> ~chi_1+ mu-)
     5.34641871E-01    2     1000037        13   # BR(~nu_muL -> ~chi_2+ mu-)
#
#         PDG            Width
DECAY   1000016     2.99321197E+01   # snu_tauL decays
#          BR         NDA      ID1       ID2
     1.09908225E-01    2     1000022        16   # BR(~nu_tauL -> ~chi_10 nu_tau)
     2.96117346E-05    2     1000023        16   # BR(~nu_tauL -> ~chi_20 nu_tau)
     8.56192877E-02    2     1000025        16   # BR(~nu_tauL -> ~chi_30 nu_tau)
     2.67350906E-01    2     1000035        16   # BR(~nu_tauL -> ~chi_40 nu_tau)
     2.99116321E-03    2     1000024        15   # BR(~nu_tauL -> ~chi_1+ tau-)
     5.34100806E-01    2     1000037        15   # BR(~nu_tauL -> ~chi_2+ tau-)
#
#         PDG            Width
DECAY   1000024     9.48420164E-05   # chargino1+ decays
#          BR         NDA      ID1       ID2
     2.56199720E-03    2     1000039        24   # BR(~chi_1+ -> ~G       W+)
#           BR         NDA      ID1       ID2       ID3
     3.33377270E-01    3     1000022         2        -1   # BR(~chi_1+ -> ~chi_10 u    db)
     3.31613741E-01    3     1000022         4        -3   # BR(~chi_1+ -> ~chi_10 c    sb)
     1.11125893E-01    3     1000022       -11        12   # BR(~chi_1+ -> ~chi_10 e+   nu_e)
     1.11122588E-01    3     1000022       -13        14   # BR(~chi_1+ -> ~chi_10 mu+  nu_mu)
     1.10198511E-01    3     1000022       -15        16   # BR(~chi_1+ -> ~chi_10 tau+ nu_tau)
#
#         PDG            Width
DECAY   1000037     3.46307574E+01   # chargino2+ decays
#          BR         NDA      ID1       ID2
     2.47269903E-01    2     1000024        23   # BR(~chi_2+ -> ~chi_1+  Z )
     1.14807281E-01    2     1000022        24   # BR(~chi_2+ -> ~chi_10  W+)
     2.40869423E-01    2     1000023        24   # BR(~chi_2+ -> ~chi_20  W+)
     1.26267685E-01    2     1000025        24   # BR(~chi_2+ -> ~chi_30  W+)
     2.48280153E-01    2     1000024        25   # BR(~chi_2+ -> ~chi_1+  h )
     5.51325655E-03    2     1000024        35   # BR(~chi_2+ -> ~chi_1+  H )
     5.71858309E-03    2     1000024        36   # BR(~chi_2+ -> ~chi_1+  A )
     3.68880054E-03    2     1000022        37   # BR(~chi_2+ -> ~chi_10  H+)
     5.55496707E-03    2     1000023        37   # BR(~chi_2+ -> ~chi_20  H+)
     2.02185810E-03    2     1000025        37   # BR(~chi_2+ -> ~chi_30  H+)
     8.08960609E-06    2     1000039        24   # BR(~chi_2+ -> ~G       W+)
     4.64870308E-10    2     1000039        37   # BR(~chi_2+ -> ~G       H+)
#
#         PDG            Width
DECAY   1000022    1.0E-05    # neutralino1 decays
#          BR         NDA      ID1       ID2
     4.97173325E-01    2     1000039        22   # BR(~chi_10 -> ~G        gam)
     4.91651040E-01    2     1000039        23   # BR(~chi_10 -> ~G        Z)
     1.11756346E-02    2     1000039        25   # BR(~chi_10 -> ~G        h)
#
#         PDG            Width
DECAY   1000023     1.05513789E-04   # neutralino2 decays
#          BR         NDA      ID1       ID2
     3.42993460E-04    2     1000022        22   # BR(~chi_20 -> ~chi_10 gam)
#          BR         NDA      ID1       ID2
     3.04232419E-08    2     1000039        22   # BR(~chi_20 -> ~G        gam)
     8.93946797E-05    2     1000039        23   # BR(~chi_20 -> ~G        Z)
     2.13613354E-03    2     1000039        25   # BR(~chi_20 -> ~G        h)
#           BR         NDA      ID1       ID2       ID3
     1.18648901E-01    3     1000022        -2         2   # BR(~chi_20 -> ~chi_10 ub      u)
     1.53616957E-01    3     1000022        -1         1   # BR(~chi_20 -> ~chi_10 db      d)
     1.17791931E-01    3     1000022        -4         4   # BR(~chi_20 -> ~chi_10 cb      c)
     1.53593546E-01    3     1000022        -3         3   # BR(~chi_20 -> ~chi_10 sb      s)
     1.38791247E-01    3     1000022        -5         5   # BR(~chi_20 -> ~chi_10 bb      b)
     3.50763578E-02    3     1000022       -11        11   # BR(~chi_20 -> ~chi_10 e+      e-)
     3.50750267E-02    3     1000022       -13        13   # BR(~chi_20 -> ~chi_10 mu+     mu-)
     3.47004753E-02    3     1000022       -15        15   # BR(~chi_20 -> ~chi_10 tau+    tau-)
     7.00448096E-02    3     1000022       -12        12   # BR(~chi_20 -> ~chi_10 nu_eb   nu_e)
     7.00448096E-02    3     1000022       -14        14   # BR(~chi_20 -> ~chi_10 nu_mub  nu_mu)
     7.00448096E-02    3     1000022       -16        16   # BR(~chi_20 -> ~chi_10 nu_taub nu_tau)
     6.45771860E-07    3     1000024        -2         1   # BR(~chi_20 -> ~chi_1+ ub      d)
     6.45771860E-07    3    -1000024        -1         2   # BR(~chi_20 -> ~chi_1- db      u)
     1.86621442E-07    3     1000024        -4         3   # BR(~chi_20 -> ~chi_1+ cb      s)
     1.86621442E-07    3    -1000024        -3         4   # BR(~chi_20 -> ~chi_1- sb      c)
     2.15257303E-07    3     1000024       -12        11   # BR(~chi_20 -> ~chi_1+ nu_eb   e-)
     2.15257303E-07    3    -1000024        12       -11   # BR(~chi_20 -> ~chi_1- nu_e    e+)
     2.13778080E-07    3     1000024       -14        13   # BR(~chi_20 -> ~chi_1+ nu_mub  mu-)
     2.13778080E-07    3    -1000024        14       -13   # BR(~chi_20 -> ~chi_1- nu_mu   mu+)
     2.77970113E-08    3     1000024       -16        15   # BR(~chi_20 -> ~chi_1+ nu_taub tau-)
     2.77970113E-08    3    -1000024        16       -15   # BR(~chi_20 -> ~chi_1- nu_tau  tau+)
#
#         PDG            Width
DECAY   1000025     2.60871354E-04   # neutralino3 decays
#          BR         NDA      ID1       ID2
     3.15653940E-04    2     1000022        22   # BR(~chi_30 -> ~chi_10 gam)
     3.82135974E-04    2     1000023        22   # BR(~chi_30 -> ~chi_20 gam)
#          BR         NDA      ID1       ID2
     9.90992115E-04    2     1000039        22   # BR(~chi_30 -> ~G        gam)
     8.18850049E-04    2     1000039        23   # BR(~chi_30 -> ~G        Z)
     2.23465596E-05    2     1000039        25   # BR(~chi_30 -> ~G        h)
#           BR         NDA      ID1       ID2       ID3
     7.79226304E-06    3     1000022        -2         2   # BR(~chi_30 -> ~chi_10 ub      u)
     9.26701099E-06    3     1000022        -1         1   # BR(~chi_30 -> ~chi_10 db      d)
     8.41087778E-06    3     1000022        -4         4   # BR(~chi_30 -> ~chi_10 cb      c)
     9.27862510E-06    3     1000022        -3         3   # BR(~chi_30 -> ~chi_10 sb      s)
     1.13764956E-05    3     1000022        -5         5   # BR(~chi_30 -> ~chi_10 bb      b)
     1.61540793E-06    3     1000022       -11        11   # BR(~chi_30 -> ~chi_10 e+      e-)
     1.61538940E-06    3     1000022       -13        13   # BR(~chi_30 -> ~chi_10 mu+     mu-)
     1.95506305E-06    3     1000022       -15        15   # BR(~chi_30 -> ~chi_10 tau+    tau-)
     4.53835969E-06    3     1000022       -12        12   # BR(~chi_30 -> ~chi_10 nu_eb   nu_e)
     4.53835969E-06    3     1000022       -14        14   # BR(~chi_30 -> ~chi_10 nu_mub  nu_mu)
     4.53835969E-06    3     1000022       -16        16   # BR(~chi_30 -> ~chi_10 nu_taub nu_tau)
     2.59832217E-02    3     1000023        -2         2   # BR(~chi_30 -> ~chi_20 ub      u)
     3.36410349E-02    3     1000023        -1         1   # BR(~chi_30 -> ~chi_20 db      d)
     2.57570821E-02    3     1000023        -4         4   # BR(~chi_30 -> ~chi_20 cb      c)
     3.36346966E-02    3     1000023        -3         3   # BR(~chi_30 -> ~chi_20 sb      s)
     2.96551092E-02    3     1000023        -5         5   # BR(~chi_30 -> ~chi_20 bb      b)
     7.68150834E-03    3     1000023       -11        11   # BR(~chi_30 -> ~chi_20 e+      e-)
     7.68116368E-03    3     1000023       -13        13   # BR(~chi_30 -> ~chi_20 mu+     mu-)
     7.58400556E-03    3     1000023       -15        15   # BR(~chi_30 -> ~chi_20 tau+    tau-)
     1.53392456E-02    3     1000023       -12        12   # BR(~chi_30 -> ~chi_20 nu_eb   nu_e)
     1.53392456E-02    3     1000023       -14        14   # BR(~chi_30 -> ~chi_20 nu_mub  nu_mu)
     1.53392456E-02    3     1000023       -16        16   # BR(~chi_30 -> ~chi_20 nu_taub nu_tau)
     1.30301204E-01    3     1000024        -2         1   # BR(~chi_30 -> ~chi_1+ ub      d)
     1.30301204E-01    3    -1000024        -1         2   # BR(~chi_30 -> ~chi_1- db      u)
     1.29634477E-01    3     1000024        -4         3   # BR(~chi_30 -> ~chi_1+ cb      s)
     1.29634477E-01    3    -1000024        -3         4   # BR(~chi_30 -> ~chi_1- sb      c)
     4.34336617E-02    3     1000024       -12        11   # BR(~chi_30 -> ~chi_1+ nu_eb   e-)
     4.34336617E-02    3    -1000024        12       -11   # BR(~chi_30 -> ~chi_1- nu_e    e+)
     4.34324123E-02    3     1000024       -14        13   # BR(~chi_30 -> ~chi_1+ nu_mub  mu-)
     4.34324123E-02    3    -1000024        14       -13   # BR(~chi_30 -> ~chi_1- nu_mu   mu+)
     4.30830130E-02    3     1000024       -16        15   # BR(~chi_30 -> ~chi_1+ nu_taub tau-)
     4.30830130E-02    3    -1000024        16       -15   # BR(~chi_30 -> ~chi_1- nu_tau  tau+)
#
#         PDG            Width
DECAY   1000035     3.46311567E+01   # neutralino4 decays
#          BR         NDA      ID1       ID2
     1.43284778E-03    2     1000022        23   # BR(~chi_40 -> ~chi_10   Z )
     2.44307574E-01    2     1000023        23   # BR(~chi_40 -> ~chi_20   Z )
     1.60336859E-03    2     1000025        23   # BR(~chi_40 -> ~chi_30   Z )
     2.40779579E-01    2     1000024       -24   # BR(~chi_40 -> ~chi_1+   W-)
     2.40779579E-01    2    -1000024        24   # BR(~chi_40 -> ~chi_1-   W+)
     1.16964992E-01    2     1000022        25   # BR(~chi_40 -> ~chi_10   h )
     1.26116759E-03    2     1000022        35   # BR(~chi_40 -> ~chi_10   H )
     2.40298098E-03    2     1000022        36   # BR(~chi_40 -> ~chi_10   A )
     3.00433482E-03    2     1000023        25   # BR(~chi_40 -> ~chi_20   h )
     3.21359180E-03    2     1000023        35   # BR(~chi_40 -> ~chi_20   H )
     2.28285903E-03    2     1000023        36   # BR(~chi_40 -> ~chi_20   A )
     1.28622498E-01    2     1000025        25   # BR(~chi_40 -> ~chi_30   h )
     9.32397011E-04    2     1000025        35   # BR(~chi_40 -> ~chi_30   H )
     1.06901600E-03    2     1000025        36   # BR(~chi_40 -> ~chi_30   A )
     5.66756251E-03    2     1000024       -37   # BR(~chi_40 -> ~chi_1+   H-)
     5.66756251E-03    2    -1000024        37   # BR(~chi_40 -> ~chi_1-   H+)
     1.94173477E-06    2     1000039        22   # BR(~chi_40 -> ~G        gam)
     6.14705652E-06    2     1000039        23   # BR(~chi_40 -> ~G        Z)
     4.81816939E-10    2     1000039        25   # BR(~chi_40 -> ~G        h)
     4.58370432E-10    2     1000039        35   # BR(~chi_40 -> ~G        H)
     3.77786406E-12    2     1000039        36   # BR(~chi_40 -> ~G        A)
#
#         PDG            Width
DECAY        25     4.08501965E-03   # h decays
#          BR         NDA      ID1       ID2
     6.17667650E-01    2           5        -5   # BR(h -> b       bb     )
     6.37602368E-02    2         -15        15   # BR(h -> tau+    tau-   )
     2.25687756E-04    2         -13        13   # BR(h -> mu+     mu-    )
     4.78252548E-04    2           3        -3   # BR(h -> s       sb     )
     2.06322751E-02    2           4        -4   # BR(h -> c       cb     )
     6.69938997E-02    2          21        21   # BR(h -> g       g      )
     2.30582555E-03    2          22        22   # BR(h -> gam     gam    )
     1.53769842E-03    2          22        23   # BR(h -> Z       gam    )
     2.00777141E-01    2          24       -24   # BR(h -> W+      W-     )
     2.56213327E-02    2          23        23   # BR(h -> Z       Z      )
#
#         PDG            Width
DECAY        35     3.90636662E+01   # H decays
#          BR         NDA      ID1       ID2
     1.42396081E-03    2           5        -5   # BR(H -> b       bb     )
     2.38521527E-04    2         -15        15   # BR(H -> tau+    tau-   )
     8.43262402E-07    2         -13        13   # BR(H -> mu+     mu-    )
     1.07968141E-06    2           3        -3   # BR(H -> s       sb     )
     9.74409647E-06    2           4        -4   # BR(H -> c       cb     )
     9.64134128E-01    2           6        -6   # BR(H -> t       tb     )
     7.72104030E-04    2          21        21   # BR(H -> g       g      )
     2.62882195E-06    2          22        22   # BR(H -> gam     gam    )
     1.12252371E-06    2          23        22   # BR(H -> Z       gam    )
     3.25818528E-04    2          24       -24   # BR(H -> W+      W-     )
     1.62464897E-04    2          23        23   # BR(H -> Z       Z      )
     8.75683592E-04    2          25        25   # BR(H -> h       h      )
     7.55354778E-24    2          36        36   # BR(H -> A       A      )
     2.98016888E-11    2          23        36   # BR(H -> Z       A      )
     7.35632688E-12    2          24       -37   # BR(H -> W+      H-     )
     7.35632688E-12    2         -24        37   # BR(H -> W-      H+     )
     1.58829769E-05    2     1000024  -1000024   # BR(H -> ~chi_1+ ~chi_1-)
     2.95727002E-04    2     1000022   1000022   # BR(H -> ~chi_10 ~chi_10)
     2.85412528E-06    2     1000023   1000023   # BR(H -> ~chi_20 ~chi_20)
     9.12765908E-05    2     1000025   1000025   # BR(H -> ~chi_30 ~chi_30)
     1.87472248E-02    2     1000022   1000023   # BR(H -> ~chi_10 ~chi_20)
     3.66830084E-07    2     1000022   1000025   # BR(H -> ~chi_10 ~chi_30)
     1.28985677E-02    2     1000023   1000025   # BR(H -> ~chi_20 ~chi_30)
#
#         PDG            Width
DECAY        36     3.95137216E+01   # A decays
#          BR         NDA      ID1       ID2
     1.42647762E-03    2           5        -5   # BR(A -> b       bb     )
     2.36024753E-04    2         -15        15   # BR(A -> tau+    tau-   )
     8.34432765E-07    2         -13        13   # BR(A -> mu+     mu-    )
     1.10007913E-06    2           3        -3   # BR(A -> s       sb     )
     9.64020115E-06    2           4        -4   # BR(A -> c       cb     )
     9.64813170E-01    2           6        -6   # BR(A -> t       tb     )
     9.13213995E-04    2          21        21   # BR(A -> g       g      )
     2.90150021E-06    2          22        22   # BR(A -> gam     gam    )
     1.30860765E-06    2          23        22   # BR(A -> Z       gam    )
     3.17494636E-04    2          23        25   # BR(A -> Z       h      )
     5.95664014E-04    2     1000024  -1000024   # BR(A -> ~chi_1+ ~chi_1-)
     1.97849343E-02    2     1000022   1000022   # BR(A -> ~chi_10 ~chi_10)
     3.98289039E-07    2     1000023   1000023   # BR(A -> ~chi_20 ~chi_20)
     1.14518026E-02    2     1000025   1000025   # BR(A -> ~chi_30 ~chi_30)
     2.05774089E-04    2     1000022   1000023   # BR(A -> ~chi_10 ~chi_20)
     1.00923984E-04    2     1000022   1000025   # BR(A -> ~chi_10 ~chi_30)
     1.38336461E-04    2     1000023   1000025   # BR(A -> ~chi_20 ~chi_30)
#
#         PDG            Width
DECAY        37     3.86910945E+01   # H+ decays
#          BR         NDA      ID1       ID2
     2.28838322E-06    2           4        -5   # BR(H+ -> c       bb     )
     2.41221951E-04    2         -15        16   # BR(H+ -> tau+    nu_tau )
     8.52806735E-07    2         -13        14   # BR(H+ -> mu+     nu_mu  )
     1.45489786E-08    2           2        -5   # BR(H+ -> u       bb     )
     5.28145299E-08    2           2        -3   # BR(H+ -> u       sb     )
     1.05234954E-05    2           4        -3   # BR(H+ -> c       sb     )
     9.67263956E-01    2           6        -5   # BR(H+ -> t       bb     )
     3.25427966E-04    2          24        25   # BR(H+ -> W+      h      )
     2.45493237E-13    2          24        36   # BR(H+ -> W+      A      )
     1.68646665E-02    2     1000024   1000022   # BR(H+ -> ~chi_1+ ~chi_10)
     1.41690174E-04    2     1000024   1000023   # BR(H+ -> ~chi_1+ ~chi_20)
     1.51493049E-02    2     1000024   1000025   # BR(H+ -> ~chi_1+ ~chi_30)
