#
#                              ======================
#                              | THE SUSYHIT OUTPUT |
#                              ======================
#
#
#              ------------------------------------------------------
#              |     This is the output of the SUSY-HIT package     |
#              |  created by A.Djouadi, M.Muehlleitner and M.Spira. |
#              |  In case of problems with SUSY-HIT email to        |
#              |           margarete.muehlleitner@cern.ch           |
#              |           michael.spira@psi.ch                     |
#              |           abdelhak.djouadi@cern.ch                 |
#              ------------------------------------------------------
#
#              ------------------------------------------------------
#              |  SUSY Les Houches Accord - MSSM Spectrum + Decays  |
#              |              based on the decay programs           |
#              |                                                    |
#              |                     SDECAY 1.3b                    |
#              |                                                    |
#              |  Authors: M.Muhlleitner, A.Djouadi and Y.Mambrini  |
#              |  Ref.:    Comput.Phys.Commun.168(2005)46           |
#              |           [hep-ph/0311167]                         |
#              |                                                    |
#              |                     HDECAY 3.4                     |
#              |                                                    |
#              |  By: A.Djouadi,J.Kalinowski,M.Muhlleitner,M.Spira  |
#              |  Ref.:    Comput.Phys.Commun.108(1998)56           |
#              |           [hep-ph/9704448]                         |
#              |                                                    |
#              |                                                    |
#              |  If not stated otherwise all DRbar couplings and   |
#              |  soft SUSY breaking masses are given at the scale  |
#              |  Q=  0.91187600E+02
#              |                                                    |
#              ------------------------------------------------------
#
#
BLOCK DCINFO  # Decay Program information
     1   SDECAY/HDECAY # decay calculator
     2   1.3b  /3.4    # version number
#
BLOCK SPINFO  # Spectrum calculator information
     1   SuSpect     # RGE +Spectrum calculator            
     2   2.41         # version number                     
#
BLOCK MODSEL  # Model selection
     1     0   # #general MSSM low scale                           
#
BLOCK SMINPUTS  # Standard Model inputs
         1     1.27934000E+02   # alpha_em^-1(M_Z)^MSbar
         2     1.16639000E-05   # G_F [GeV^-2]
         3     1.17200000E-01   # alpha_S(M_Z)^MSbar
         4     9.11870000E+01   # M_Z pole mass
         5     4.25000000E+00   # mb(mb)^MSbar
         6     1.72500000E+02   # mt pole mass
         7     1.77700000E+00   # mtau pole mass
#
BLOCK MINPAR  # Input parameters - minimal models
#
BLOCK EXTPAR  # Input parameters - non-minimal models
         0     9.11876000E+01   # EWSB                
         1     2.00000000E+02   # M_1                 
         2     1.00000000E+05   # M_2                 
         3     1.00000000E+05   # M_3                 
        11     0.00000000E+00   # A_t                 
        12     0.00000000E+00   # A_b                 
        13     0.00000000E+00   # A_tau               
        14     0.00000000E+00   # A_u                 
        15     0.00000000E+00   # A_d                 
        16     0.00000000E+00   # A_e                 
        23     3.50000000E+03   # mu(EWSB)            
        25     1.50000000E+00   # tanbeta(in)         
        26     2.00000000E+03   # MA_pole             
        31     1.00000000E+05   # M_eL                
        32     1.00000000E+05   # M_muL               
        33     1.00000000E+05   # M_tauL              
        34     1.00000000E+05   # M_eR                
        35     1.00000000E+05   # M_muR               
        36     1.00000000E+05   # M_tauR              
        41     1.80000000E+03   # M_q1L               
        42     1.80000000E+03   # M_q2L               
        43     1.80000000E+03   # M_q3L               
        44     1.00000000E+05   # M_uR                
        45     1.00000000E+05   # M_cR                
        46     1.00000000E+05   # M_tR                
        47     1.80000000E+03   # M_dR                
        48     1.80000000E+03   # M_sR                
        49     1.80000000E+03   # M_bR                
#
BLOCK MASS  # Mass Spectrum
# PDG code           mass       particle
        24     8.05837831E+01   # W+
        25     1.25000000E+02   # h
        35     2.00404017E+03   # H
        36     2.00000000E+03   # A
        37     2.02369285E+03   # H+
         5     4.87877839E+00   # b-quark pole mass calculated from mb(mb)_Msbar
   1000001     1.80036856E+03   # ~d_L
   2000001     1.80007107E+03   # ~d_R
   1000002     1.79970245E+03   # ~u_L
   2000002     9.99999974E+04   # ~u_R
   1000003     1.80036856E+03   # ~s_L
   2000003     1.80007107E+03   # ~s_R
   1000004     1.79970245E+03   # ~c_L
   2000004     9.99999974E+04   # ~c_R
   1000005     1.79644406E+03   # ~b_1
   2000005     1.80399139E+03   # ~b_2
   1000006     1.80573397E+03   # ~t_1
   2000006     1.00000106E+05   # ~t_2
   1000011     1.00000004E+05   # ~e_L
   2000011     1.00000004E+05   # ~e_R
   1000012     9.99999921E+04   # ~nu_eL
   1000013     1.00000004E+05   # ~mu_L
   2000013     1.00000004E+05   # ~mu_R
   1000014     9.99999921E+04   # ~nu_muL
   1000015     9.99999574E+04   # ~tau_1
   2000015     1.00000051E+05   # ~tau_2
   1000016     9.99999921E+04   # ~nu_tauL
   1000021     1.00000000E+05   # ~g
   1000022     1.99439337E+02   # ~chi_10
   1000023    -3.50002306E+03   # ~chi_20
   1000025     3.50051928E+03   # ~chi_30
   1000035     1.00000064E+05   # ~chi_40
   1000024     3.49994019E+03   # ~chi_1+
   1000037     1.00000064E+05   # ~chi_2+
   1000039     1.00000000E-09   # ~gravitino
#
BLOCK NMIX  # Neutralino Mixing Matrix
  1  1     9.99909129E-01   # N_11
  1  2    -9.92877922E-06   # N_12
  1  3     1.10586834E-02   # N_13
  1  4    -7.70972783E-03   # N_14
  2  1     2.36805626E-03   # N_21
  2  2    -1.49631261E-04   # N_22
  2  3    -7.07093141E-01   # N_23
  2  4    -7.07116440E-01   # N_24
  3  1     1.32712751E-02   # N_31
  3  2     8.02299065E-04   # N_32
  3  3    -7.07033791E-01   # N_33
  3  4     7.07054770E-01   # N_34
  4  1     3.65320509E-07   # N_41
  4  2    -9.99999667E-01   # N_42
  4  3    -4.61559264E-04   # N_43
  4  4     6.73152877E-04   # N_44
#
BLOCK UMIX  # Chargino Mixing Matrix U
  1  1    -6.52743166E-04   # U_11
  1  2     9.99999787E-01   # U_12
  2  1     9.99999787E-01   # U_21
  2  2     6.52743166E-04   # U_22
#
BLOCK VMIX  # Chargino Mixing Matrix V
  1  1    -9.51981842E-04   # V_11
  1  2     9.99999547E-01   # V_12
  2  1     9.99999547E-01   # V_21
  2  2     9.51981842E-04   # V_22
#
BLOCK STOPMIX  # Stop Mixing Matrix
  1  1     9.99999999E-01   # cos(theta_t)
  1  2     4.47213589E-05   # sin(theta_t)
  2  1    -4.47213589E-05   # -sin(theta_t)
  2  2     9.99999999E-01   # cos(theta_t)
#
BLOCK SBOTMIX  # Sbottom Mixing Matrix
  1  1     6.93030854E-01   # cos(theta_b)
  1  2     7.20907924E-01   # sin(theta_b)
  2  1    -7.20907924E-01   # -sin(theta_b)
  2  2     6.93030854E-01   # cos(theta_b)
#
BLOCK STAUMIX  # Stau Mixing Matrix
  1  1     7.06201497E-01   # cos(theta_tau)
  1  2     7.08010908E-01   # sin(theta_tau)
  2  1    -7.08010908E-01   # -sin(theta_tau)
  2  2     7.06201497E-01   # cos(theta_tau)
#
BLOCK ALPHA  # Higgs mixing
          -5.90323783E-01   # Mixing angle in the neutral Higgs boson sector
#
BLOCK HMIX Q=  9.11876000E+01  # DRbar Higgs Parameters
         1     3.50000000E+03   # mu(Q)               
         2     1.49999982E+00   # tanbeta(Q)          
         3     2.54860252E+02   # vev(Q)              
         4    -6.81241437E+07   # MA^2(Q)             
#
BLOCK GAUGE Q=  9.11876000E+01  # The gauge couplings
     1     3.50571492E-01   # gprime(Q) DRbar
     2     6.19644975E-01   # g(Q) DRbar
     3     1.02325583E+00   # g3(Q) DRbar
#
BLOCK AU Q=  9.11876000E+01  # The trilinear couplings
  1  1     0.00000000E+00   # A_u(Q) DRbar
  2  2     0.00000000E+00   # A_c(Q) DRbar
  3  3     0.00000000E+00   # A_t(Q) DRbar
#
BLOCK AD Q=  9.11876000E+01  # The trilinear couplings
  1  1     0.00000000E+00   # A_d(Q) DRbar
  2  2     0.00000000E+00   # A_s(Q) DRbar
  3  3     0.00000000E+00   # A_b(Q) DRbar
#
BLOCK AE Q=  9.11876000E+01  # The trilinear couplings
  1  1     0.00000000E+00   # A_e(Q) DRbar
  2  2     0.00000000E+00   # A_mu(Q) DRbar
  3  3     0.00000000E+00   # A_tau(Q) DRbar
#
BLOCK Yu Q=  9.11876000E+01  # The Yukawa couplings
  1  1     0.00000000E+00   # y_u(Q) DRbar
  2  2     0.00000000E+00   # y_c(Q) DRbar
  3  3     9.83725346E-01   # y_t(Q) DRbar
#
BLOCK Yd Q=  9.11876000E+01  # The Yukawa couplings
  1  1     0.00000000E+00   # y_d(Q) DRbar
  2  2     0.00000000E+00   # y_s(Q) DRbar
  3  3     2.58687858E-02   # y_b(Q) DRbar
#
BLOCK Ye Q=  9.11876000E+01  # The Yukawa couplings
  1  1     0.00000000E+00   # y_e(Q) DRbar
  2  2     0.00000000E+00   # y_mu(Q) DRbar
  3  3     1.77407752E-02   # y_tau(Q) DRbar
#
BLOCK MSOFT Q=  9.11876000E+01  # The soft SUSY breaking masses at the scale Q
         1     2.00000000E+02   # M_1                 
         2     1.00000000E+05   # M_2                 
         3     1.00000000E+05   # M_3                 
        14     0.00000000E+00   # A_u                 
        15     0.00000000E+00   # A_d                 
        16     0.00000000E+00   # A_e                 
        21     6.30783476E+08   # M^2_Hd              
        22    -1.15045502E+09   # M^2_Hu              
        31     1.00000000E+05   # M_eL                
        32     1.00000000E+05   # M_muL               
        33     1.00000000E+05   # M_tauL              
        34     1.00000000E+05   # M_eR                
        35     1.00000000E+05   # M_muR               
        36     1.00000000E+05   # M_tauR              
        41     1.80000000E+03   # M_q1L               
        42     1.80000000E+03   # M_q2L               
        43     1.80000000E+03   # M_q3L               
        44     1.00000000E+05   # M_uR                
        45     1.00000000E+05   # M_cR                
        46     1.00000000E+05   # M_tR                
        47     1.80000000E+03   # M_dR                
        48     1.80000000E+03   # M_sR                
        49     1.80000000E+03   # M_bR                
#
#
#
#                             =================
#                             |The decay table|
#                             =================
#
# - The QCD corrections to the decays gluino -> squark  + quark
#                                     squark -> gaugino + quark_prime
#                                     squark -> squark_prime + Higgs
#                                     squark -> gluino  + quark
#   are included.
#
# - The multi-body decays for the inos, stops and sbottoms are included.
#
# - The loop induced decays for the gluino, neutralinos and stops
#   are included.
#
# - The SUSY decays of the top quark are included.
#
# - Possible decays of the NLSP in GMSB models are included.
#
#
#         PDG            Width
DECAY         6     1.32519221E+00   # top decays
#          BR         NDA      ID1       ID2
     1.00000000E+00    2           5        24   # BR(t ->  b    W+)
#
#         PDG            Width
DECAY   1000021     1.E-04   # gluino decays (OJ Mods)
#          BR         NDA      ID1       ID2
    -9.58312254E-03    2     1000001        -1   # BR(~g -> ~d_L  db)
    -9.58312254E-03    2    -1000001         1   # BR(~g -> ~d_L* d )
    -9.58312460E-03    2     2000001        -1   # BR(~g -> ~d_R  db)
    -9.58312460E-03    2    -2000001         1   # BR(~g -> ~d_R* d )
    -9.58312714E-03    2     1000002        -2   # BR(~g -> ~u_L  ub)
    -9.58312714E-03    2    -1000002         2   # BR(~g -> ~u_L* u )
    -2.59295693E-17    2     2000002        -2   # BR(~g -> ~u_R  ub)
    -2.59295693E-17    2    -2000002         2   # BR(~g -> ~u_R* u )
    -9.58312254E-03    2     1000003        -3   # BR(~g -> ~s_L  sb)
    -9.58312254E-03    2    -1000003         3   # BR(~g -> ~s_L* s )
    -9.58312460E-03    2     2000003        -3   # BR(~g -> ~s_R  sb)
    -9.58312460E-03    2    -2000003         3   # BR(~g -> ~s_R* s )
    -9.58312714E-03    2     1000004        -4   # BR(~g -> ~c_L  cb)
    -9.58312714E-03    2    -1000004         4   # BR(~g -> ~c_L* c )
    -2.59295693E-17    2     2000004        -4   # BR(~g -> ~c_R  cb)
    -2.59295693E-17    2    -2000004         4   # BR(~g -> ~c_R* c )
     3.49505747E-01    2     1000005        -5   # BR(~g -> ~b_1  bb)
     3.49505747E-01    2    -1000005         5   # BR(~g -> ~b_1* b )
     3.51898856E-01    2     2000005        -5   # BR(~g -> ~b_2  bb)
     3.51898856E-01    2    -2000005         5   # BR(~g -> ~b_2* b )
    -9.43159226E-03    2     1000006        -6   # BR(~g -> ~t_1  tb)
    -9.43159226E-03    2    -1000006         6   # BR(~g -> ~t_1* t )
    -2.68948524E-01    2     1000039        21   # BR(~g -> ~G g)
#
#         PDG            Width
DECAY   1000006     2.81159716E-01   # stop1 decays
#          BR         NDA      ID1       ID2
     1.00000000E+00    2     1000022         6   # BR(~t_1 -> ~chi_10 t )
#
#         PDG            Width
DECAY   2000006    -2.85785839E+04   # stop2 decays
#          BR         NDA      ID1       ID2
    -7.29308857E-03    2     1000022         6   # BR(~t_2 -> ~chi_10 t )
    -1.75301084E-02    2     1000023         6   # BR(~t_2 -> ~chi_20 t )
    -1.75280304E-02    2     1000025         6   # BR(~t_2 -> ~chi_30 t )
     1.04175410E+00    2     1000024         5   # BR(~t_2 -> ~chi_1+ b )
     4.74772919E-04    2     1000006        25   # BR(~t_2 -> ~t_1    h )
    -4.97274937E-04    2     1000006        35   # BR(~t_2 -> ~t_1    H )
    -4.96396203E-04    2     1000006        36   # BR(~t_2 -> ~t_1    A )
    -4.67644151E-04    2     1000005        37   # BR(~t_2 -> ~b_1    H+)
    -5.25133575E-04    2     2000005        37   # BR(~t_2 -> ~b_2    H+)
     3.37912740E-04    2     1000006        23   # BR(~t_2 -> ~t_1    Z )
     8.50561825E-04    2     1000005        24   # BR(~t_2 -> ~b_1    W+)
     9.20327194E-04    2     2000005        24   # BR(~t_2 -> ~b_2    W+)
#
#         PDG            Width
DECAY   1000005    -7.63360767E+00   # sbottom1 decays
#          BR         NDA      ID1       ID2
     1.00000000E+00    2     1000022         5   # BR(~b_1 -> ~chi_10 b )
#
#         PDG            Width
DECAY   2000005    -7.74978914E+00   # sbottom2 decays
#          BR         NDA      ID1       ID2
     1.00000000E+00    2     1000022         5   # BR(~b_2 -> ~chi_10 b )
#
#         PDG            Width
DECAY   1000002     2.83514602E-01   # sup_L decays
#          BR         NDA      ID1       ID2
     1.00000000E+00    2     1000022         2   # BR(~u_L -> ~chi_10 u)
#
#         PDG            Width
DECAY   2000002     2.08391777E+02   # sup_R decays
#          BR         NDA      ID1       ID2
     9.99818463E-01    2     1000022         2   # BR(~u_R -> ~chi_10 u)
     5.60158789E-06    2     1000023         2   # BR(~u_R -> ~chi_20 u)
     1.75934996E-04    2     1000025         2   # BR(~u_R -> ~chi_30 u)
#
#         PDG            Width
DECAY   1000001     2.83679313E-01   # sdown_L decays
#          BR         NDA      ID1       ID2
     1.00000000E+00    2     1000022         1   # BR(~d_L -> ~chi_10 d)
#
#         PDG            Width
DECAY   2000001     1.13441023E+00   # sdown_R decays
#          BR         NDA      ID1       ID2
     1.00000000E+00    2     1000022         1   # BR(~d_R -> ~chi_10 d)
#
#         PDG            Width
DECAY   1000004     2.83514602E-01   # scharm_L decays
#          BR         NDA      ID1       ID2
     1.00000000E+00    2     1000022         4   # BR(~c_L -> ~chi_10 c)
#
#         PDG            Width
DECAY   2000004     2.08391777E+02   # scharm_R decays
#          BR         NDA      ID1       ID2
     9.99818463E-01    2     1000022         4   # BR(~c_R -> ~chi_10 c)
     5.60158789E-06    2     1000023         4   # BR(~c_R -> ~chi_20 c)
     1.75934996E-04    2     1000025         4   # BR(~c_R -> ~chi_30 c)
#
#         PDG            Width
DECAY   1000003     2.83679313E-01   # sstrange_L decays
#          BR         NDA      ID1       ID2
     1.00000000E+00    2     1000022         3   # BR(~s_L -> ~chi_10 s)
#
#         PDG            Width
DECAY   2000003     1.13441023E+00   # sstrange_R decays
#          BR         NDA      ID1       ID2
     1.00000000E+00    2     1000022         3   # BR(~s_R -> ~chi_10 s)
#
#         PDG            Width
DECAY   1000011     1.22250963E+02   # selectron_L decays
#          BR         NDA      ID1       ID2
     9.99777681E-01    2     1000022        11   # BR(~e_L -> ~chi_10 e-)
     4.41421977E-06    2     1000023        11   # BR(~e_L -> ~chi_20 e-)
     2.15249377E-04    2     1000025        11   # BR(~e_L -> ~chi_30 e-)
     2.65572906E-06    2    -1000024        12   # BR(~e_L -> ~chi_1- nu_e)
#
#         PDG            Width
DECAY   2000011     4.89000952E+02   # selectron_R decays
#          BR         NDA      ID1       ID2
     9.99818709E-01    2     1000022        11   # BR(~e_R -> ~chi_10 e-)
     5.59400682E-06    2     1000023        11   # BR(~e_R -> ~chi_20 e-)
     1.75696844E-04    2     1000025        11   # BR(~e_R -> ~chi_30 e-)
#
#         PDG            Width
DECAY   1000013     1.22250963E+02   # smuon_L decays
#          BR         NDA      ID1       ID2
     9.99777681E-01    2     1000022        13   # BR(~mu_L -> ~chi_10 mu-)
     4.41421977E-06    2     1000023        13   # BR(~mu_L -> ~chi_20 mu-)
     2.15249377E-04    2     1000025        13   # BR(~mu_L -> ~chi_30 mu-)
     2.65572906E-06    2    -1000024        14   # BR(~mu_L -> ~chi_1- nu_mu)
#
#         PDG            Width
DECAY   2000013     4.89000952E+02   # smuon_R decays
#          BR         NDA      ID1       ID2
     9.99818709E-01    2     1000022        13   # BR(~mu_R -> ~chi_10 mu-)
     5.59400682E-06    2     1000023        13   # BR(~mu_R -> ~chi_20 mu-)
     1.75696844E-04    2     1000025        13   # BR(~mu_R -> ~chi_30 mu-)
#
#         PDG            Width
DECAY   1000015     1.18199742E+04   # stau_1 decays
#          BR         NDA      ID1       ID2
     2.58997093E-02    2     1000022        15   # BR(~tau_1 -> ~chi_10  tau-)
     2.51852241E-05    2     1000023        15   # BR(~tau_1 -> ~chi_20  tau-)
     2.49822478E-05    2     1000025        15   # BR(~tau_1 -> ~chi_30  tau-)
     2.77079670E-05    2    -1000024        16   # BR(~tau_1 -> ~chi_1-  nu_tau)
     9.74022415E-01    2     1000039        15   # BR(~tau_1 -> ~G       tau-)
#
#         PDG            Width
DECAY   2000015     3.06071370E+02   # stau_2 decays
#          BR         NDA      ID1       ID2
     9.96507258E-01    2     1000022        15   # BR(~tau_2 -> ~chi_10  tau-)
     1.07875094E-03    2     1000023        15   # BR(~tau_2 -> ~chi_20  tau-)
     1.44222637E-03    2     1000025        15   # BR(~tau_2 -> ~chi_30  tau-)
     9.71765138E-04    2    -1000024        16   # BR(~tau_2 -> ~chi_1-  nu_tau)
#
#         PDG            Width
DECAY   1000012     1.22251021E+02   # snu_eL decays
#          BR         NDA      ID1       ID2
     9.99847284E-01    2     1000022        12   # BR(~nu_eL -> ~chi_10 nu_e)
     6.91327787E-06    2     1000023        12   # BR(~nu_eL -> ~chi_20 nu_e)
     1.40154239E-04    2     1000025        12   # BR(~nu_eL -> ~chi_30 nu_e)
     5.64879967E-06    2     1000024        11   # BR(~nu_eL -> ~chi_1+ e-)
#
#         PDG            Width
DECAY   1000014     1.22251021E+02   # snu_muL decays
#          BR         NDA      ID1       ID2
     9.99847284E-01    2     1000022        14   # BR(~nu_muL -> ~chi_10 nu_mu)
     6.91327787E-06    2     1000023        14   # BR(~nu_muL -> ~chi_20 nu_mu)
     1.40154239E-04    2     1000025        14   # BR(~nu_muL -> ~chi_30 nu_mu)
     5.64879967E-06    2     1000024        13   # BR(~nu_muL -> ~chi_1+ mu-)
#
#         PDG            Width
DECAY   1000016     1.22875633E+02   # snu_tauL decays
#          BR         NDA      ID1       ID2
     9.94764773E-01    2     1000022        16   # BR(~nu_tauL -> ~chi_10 nu_tau)
     6.87813570E-06    2     1000023        16   # BR(~nu_tauL -> ~chi_20 nu_tau)
     1.39441795E-04    2     1000025        16   # BR(~nu_tauL -> ~chi_30 nu_tau)
     5.08890754E-03    2     1000024        15   # BR(~nu_tauL -> ~chi_1+ tau-)
#
#         PDG            Width
DECAY   1000024     4.91992486E+01   # chargino1+ decays
#          BR         NDA      ID1       ID2
     4.77698039E-07    2     1000002        -1   # BR(~chi_1+ -> ~u_L     db)
     2.24471875E-07    2    -1000001         2   # BR(~chi_1+ -> ~d_L*    u )
     4.77698039E-07    2     1000004        -3   # BR(~chi_1+ -> ~c_L     sb)
     2.24471875E-07    2    -1000003         4   # BR(~chi_1+ -> ~s_L*    c )
    -9.74155940E-03    2     1000006        -5   # BR(~chi_1+ -> ~t_1     bb)
     9.67044341E-02    2    -1000005         6   # BR(~chi_1+ -> ~b_1*    t )
     8.50762862E-01    2    -2000005         6   # BR(~chi_1+ -> ~b_2*    t )
     4.61112130E-02    2     1000022        24   # BR(~chi_1+ -> ~chi_10  W+)
     1.61543068E-02    2     1000022        37   # BR(~chi_1+ -> ~chi_10  H+)
     6.13216295E-06    2     1000039        24   # BR(~chi_1+ -> ~G       W+)
     1.20655861E-06    2     1000039        37   # BR(~chi_1+ -> ~G       H+)
#
#         PDG            Width
DECAY   1000037    -9.87928872E+03   # chargino2+ decays
#          BR         NDA      ID1       ID2
     6.72449030E-01    2     1000002        -1   # BR(~chi_2+ -> ~u_L     db)
     6.72449216E-01    2    -1000001         2   # BR(~chi_2+ -> ~d_L*    u )
     6.72449030E-01    2     1000004        -3   # BR(~chi_2+ -> ~c_L     sb)
     6.72449216E-01    2    -1000003         4   # BR(~chi_2+ -> ~s_L*    c )
    -1.04459942E+01    2     1000006        -5   # BR(~chi_2+ -> ~t_1     bb)
     1.47841676E-01    2    -1000005         6   # BR(~chi_2+ -> ~b_1*    t )
     6.37433921E-01    2    -2000005         6   # BR(~chi_2+ -> ~b_2*    t )
     4.83437260E-13    2     1000012       -11   # BR(~chi_2+ -> ~nu_eL   e+  )
     4.83437260E-13    2     1000014       -13   # BR(~chi_2+ -> ~nu_muL  mu+ )
     3.36655024E-13    2    -1000011        12   # BR(~chi_2+ -> ~e_L+    nu_e)
     3.36655024E-13    2    -1000013        14   # BR(~chi_2+ -> ~mu_L+   nu_mu)
     5.29953542E-13    2    -1000015        16   # BR(~chi_2+ -> ~tau_1+  nu_tau)
     7.92256107E-15    2    -2000015        16   # BR(~chi_2+ -> ~tau_2+  nu_tau)
     1.23174105E-01    2     1000024        23   # BR(~chi_2+ -> ~chi_1+  Z )
     1.64649851E-05    2     1000022        24   # BR(~chi_2+ -> ~chi_10  W+)
     1.19478632E-01    2     1000023        24   # BR(~chi_2+ -> ~chi_20  W+)
     1.19460892E-01    2     1000025        24   # BR(~chi_2+ -> ~chi_30  W+)
     1.24451811E-01    2     1000024        25   # BR(~chi_2+ -> ~chi_1+  h )
     1.09244935E-01    2     1000024        35   # BR(~chi_2+ -> ~chi_1+  H )
     1.09259558E-01    2     1000024        36   # BR(~chi_2+ -> ~chi_1+  A )
     2.26472934E-05    2     1000022        37   # BR(~chi_2+ -> ~chi_10  H+)
     1.09255380E-01    2     1000023        37   # BR(~chi_2+ -> ~chi_20  H+)
     1.09237062E-01    2     1000025        37   # BR(~chi_2+ -> ~chi_30  H+)
     7.04731861E+00    2     1000039        24   # BR(~chi_2+ -> ~G       W+)
     2.01866348E-06    2     1000039        37   # BR(~chi_2+ -> ~G       H+)
#
#         PDG            Width
DECAY   1000022     1.E-08   # neutralino1 decays (OJ Mods)
#          BR         NDA      ID1       ID2
     8.88633720E-01    2     1000039        22   # BR(~chi_10 -> ~G        gam)
     1.11366275E-01    2     1000039        23   # BR(~chi_10 -> ~G        Z)
     4.95709355E-09    2     1000039        25   # BR(~chi_10 -> ~G        h)
#
#         PDG            Width
DECAY   1000023     1.E-08   # neutralino2 decays (OJ Mods)
#          BR         NDA      ID1       ID2
     4.66280760E-02    2     1000022        23   # BR(~chi_20 -> ~chi_10   Z )
     1.46230839E-03    2     1000022        25   # BR(~chi_20 -> ~chi_10   h )
     1.58282009E-02    2     1000022        35   # BR(~chi_20 -> ~chi_10   H )
     8.92180812E-04    2     1000022        36   # BR(~chi_20 -> ~chi_10   A )
     2.73637146E-08    2     1000002        -2   # BR(~chi_20 -> ~u_L      ub)
     2.73637146E-08    2    -1000002         2   # BR(~chi_20 -> ~u_L*     u )
     1.10254079E-07    2     1000001        -1   # BR(~chi_20 -> ~d_L      db)
     1.10254079E-07    2    -1000001         1   # BR(~chi_20 -> ~d_L*     d )
     2.47485199E-07    2     2000001        -1   # BR(~chi_20 -> ~d_R      db)
     2.47485199E-07    2    -2000001         1   # BR(~chi_20 -> ~d_R*     d )
     2.73637146E-08    2     1000004        -4   # BR(~chi_20 -> ~c_L      cb)
     2.73637146E-08    2    -1000004         4   # BR(~chi_20 -> ~c_L*     c )
     1.10254079E-07    2     1000003        -3   # BR(~chi_20 -> ~s_L      sb)
     1.10254079E-07    2    -1000003         3   # BR(~chi_20 -> ~s_L*     s )
     2.47485199E-07    2     2000003        -3   # BR(~chi_20 -> ~s_R      sb)
     2.47485199E-07    2    -2000003         3   # BR(~chi_20 -> ~s_R*     s )
     4.78430648E-01    2     1000006        -6   # BR(~chi_20 -> ~t_1      tb)
     4.78430648E-01    2    -1000006         6   # BR(~chi_20 -> ~t_1*     t )
    -5.24715758E-03    2     1000005        -5   # BR(~chi_20 -> ~b_1      bb)
    -5.24715758E-03    2    -1000005         5   # BR(~chi_20 -> ~b_1*     b )
    -5.59327221E-03    2     2000005        -5   # BR(~chi_20 -> ~b_2      bb)
    -5.59327221E-03    2    -2000005         5   # BR(~chi_20 -> ~b_2*     b )
     4.91319834E-11    2     1000039        22   # BR(~chi_20 -> ~G        gam)
     2.38630729E-07    2     1000039        23   # BR(~chi_20 -> ~G        Z)
     5.95556719E-06    2     1000039        25   # BR(~chi_20 -> ~G        h)
     4.76930495E-08    2     1000039        35   # BR(~chi_20 -> ~G        H)
     1.23031512E-06    2     1000039        36   # BR(~chi_20 -> ~G        A)
#
#         PDG            Width
DECAY   1000025     4.86481546E+01   # neutralino3 decays
#          BR         NDA      ID1       ID2
     1.48431038E-03    2     1000022        23   # BR(~chi_30 -> ~chi_10   Z )
     4.69942906E-02    2     1000022        25   # BR(~chi_30 -> ~chi_10   h )
     8.67712638E-04    2     1000022        35   # BR(~chi_30 -> ~chi_10   H )
     1.58706941E-02    2     1000022        36   # BR(~chi_30 -> ~chi_10   A )
     3.38820878E-06    2     1000002        -2   # BR(~chi_30 -> ~u_L      ub)
     3.38820878E-06    2    -1000002         2   # BR(~chi_30 -> ~u_L*     u )
     8.96485982E-07    2     1000001        -1   # BR(~chi_30 -> ~d_L      db)
     8.96485982E-07    2    -1000001         1   # BR(~chi_30 -> ~d_L*     d )
     7.76956705E-06    2     2000001        -1   # BR(~chi_30 -> ~d_R      db)
     7.76956705E-06    2    -2000001         1   # BR(~chi_30 -> ~d_R*     d )
     3.38820878E-06    2     1000004        -4   # BR(~chi_30 -> ~c_L      cb)
     3.38820878E-06    2    -1000004         4   # BR(~chi_30 -> ~c_L*     c )
     8.96485982E-07    2     1000003        -3   # BR(~chi_30 -> ~s_L      sb)
     8.96485982E-07    2    -1000003         3   # BR(~chi_30 -> ~s_L*     s )
     7.76956705E-06    2     2000003        -3   # BR(~chi_30 -> ~s_R      sb)
     7.76956705E-06    2    -2000003         3   # BR(~chi_30 -> ~s_R*     s )
     4.78263947E-01    2     1000006        -6   # BR(~chi_30 -> ~t_1      tb)
     4.78263947E-01    2    -1000006         6   # BR(~chi_30 -> ~t_1*     t )
    -4.68512529E-03    2     1000005        -5   # BR(~chi_30 -> ~b_1      bb)
    -4.68512529E-03    2    -1000005         5   # BR(~chi_30 -> ~b_1*     b )
    -6.21178498E-03    2     2000005        -5   # BR(~chi_30 -> ~b_2      bb)
    -6.21178498E-03    2    -2000005         5   # BR(~chi_30 -> ~b_2*     b )
     1.77506071E-09    2     1000039        22   # BR(~chi_30 -> ~G        gam)
     5.96338983E-06    2     1000039        23   # BR(~chi_30 -> ~G        Z)
     2.32490732E-07    2     1000039        25   # BR(~chi_30 -> ~G        h)
     1.22222288E-06    2     1000039        35   # BR(~chi_30 -> ~G        H)
     4.92215925E-08    2     1000039        36   # BR(~chi_30 -> ~G        A)
#
#         PDG            Width
DECAY   1000035    -9.87936917E+03   # neutralino4 decays
#          BR         NDA      ID1       ID2
     1.35947018E-09    2     1000022        23   # BR(~chi_40 -> ~chi_10   Z )
     1.19041034E-01    2     1000023        23   # BR(~chi_40 -> ~chi_20   Z )
     4.13925512E-03    2     1000025        23   # BR(~chi_40 -> ~chi_30   Z )
     1.19483793E-01    2     1000024       -24   # BR(~chi_40 -> ~chi_1+   W-)
     1.19483793E-01    2    -1000024        24   # BR(~chi_40 -> ~chi_1-   W+)
     1.71802167E-05    2     1000022        25   # BR(~chi_40 -> ~chi_10   h )
     2.80503349E-06    2     1000022        35   # BR(~chi_40 -> ~chi_10   H )
     1.98114718E-05    2     1000022        36   # BR(~chi_40 -> ~chi_10   A )
     4.08587213E-03    2     1000023        25   # BR(~chi_40 -> ~chi_20   h )
     1.04553078E-01    2     1000023        35   # BR(~chi_40 -> ~chi_20   H )
     4.80600616E-03    2     1000023        36   # BR(~chi_40 -> ~chi_20   A )
     1.20355038E-01    2     1000025        25   # BR(~chi_40 -> ~chi_30   h )
     4.69431703E-03    2     1000025        35   # BR(~chi_40 -> ~chi_30   H )
     1.04439139E-01    2     1000025        36   # BR(~chi_40 -> ~chi_30   A )
     1.09263014E-01    2     1000024       -37   # BR(~chi_40 -> ~chi_1+   H-)
     1.09263014E-01    2    -1000024        37   # BR(~chi_40 -> ~chi_1-   H+)
     3.22009302E-01    2     1000002        -2   # BR(~chi_40 -> ~u_L      ub)
     3.22009302E-01    2    -1000002         2   # BR(~chi_40 -> ~u_L*     u )
     5.01821679E-21    2     2000002        -2   # BR(~chi_40 -> ~u_R      ub)
     5.01821679E-21    2    -2000002         2   # BR(~chi_40 -> ~u_R*     u )
     3.22009422E-01    2     1000001        -1   # BR(~chi_40 -> ~d_L      db)
     3.22009422E-01    2    -1000001         1   # BR(~chi_40 -> ~d_L*     d )
     6.11366602E-15    2     2000001        -1   # BR(~chi_40 -> ~d_R      db)
     6.11366602E-15    2    -2000001         1   # BR(~chi_40 -> ~d_R*     d )
     3.22009302E-01    2     1000004        -4   # BR(~chi_40 -> ~c_L      cb)
     3.22009302E-01    2    -1000004         4   # BR(~chi_40 -> ~c_L*     c )
     5.01821679E-21    2     2000004        -4   # BR(~chi_40 -> ~c_R      cb)
     5.01821679E-21    2    -2000004         4   # BR(~chi_40 -> ~c_R*     c )
     3.22009422E-01    2     1000003        -3   # BR(~chi_40 -> ~s_L      sb)
     3.22009422E-01    2    -1000003         3   # BR(~chi_40 -> ~s_L*     s )
     6.11366602E-15    2     2000003        -3   # BR(~chi_40 -> ~s_R      sb)
     6.11366602E-15    2    -2000003         3   # BR(~chi_40 -> ~s_R*     s )
     3.92657463E-01    2     1000006        -6   # BR(~chi_40 -> ~t_1      tb)
     3.92657463E-01    2    -1000006         6   # BR(~chi_40 -> ~t_1*     t )
    -2.62321961E+00    2     1000005        -5   # BR(~chi_40 -> ~b_1      bb)
    -2.62321961E+00    2    -1000005         5   # BR(~chi_40 -> ~b_1*     b )
    -2.60006057E+00    2     2000005        -5   # BR(~chi_40 -> ~b_2      bb)
    -2.60006057E+00    2    -2000005         5   # BR(~chi_40 -> ~b_2*     b )
     1.68335723E-13    2     1000011       -11   # BR(~chi_40 -> ~e_L-     e+)
     1.68335723E-13    2    -1000011        11   # BR(~chi_40 -> ~e_L+     e-)
     2.87641925E-26    2     2000011       -11   # BR(~chi_40 -> ~e_R-     e+)
     2.87641925E-26    2    -2000011        11   # BR(~chi_40 -> ~e_R+     e-)
     1.68335723E-13    2     1000013       -13   # BR(~chi_40 -> ~mu_L-    mu+)
     1.68335723E-13    2    -1000013        13   # BR(~chi_40 -> ~mu_L+    mu-)
     2.87641925E-26    2     2000013       -13   # BR(~chi_40 -> ~mu_R-    mu+)
     2.87641925E-26    2    -2000013        13   # BR(~chi_40 -> ~mu_R+    mu-)
     2.41730736E-13    2     1000012       -12   # BR(~chi_40 -> ~nu_eL    nu_eb)
     2.41730736E-13    2    -1000012        12   # BR(~chi_40 -> ~nu_eL*   nu_e )
     2.41730736E-13    2     1000014       -14   # BR(~chi_40 -> ~nu_muL   nu_mub)
     2.41730736E-13    2    -1000014        14   # BR(~chi_40 -> ~nu_muL*  nu_mu )
     2.41730736E-13    2     1000016       -16   # BR(~chi_40 -> ~nu_tau1  nu_taub)
     2.41730736E-13    2    -1000016        16   # BR(~chi_40 -> ~nu_tau1* nu_tau )
     1.70887650E+00    2     1000039        22   # BR(~chi_40 -> ~G        gam)
     5.33878997E+00    2     1000039        23   # BR(~chi_40 -> ~G        Z)
     3.22049006E-07    2     1000039        25   # BR(~chi_40 -> ~G        h)
     2.02218199E-06    2     1000039        35   # BR(~chi_40 -> ~G        H)
     3.98477925E-10    2     1000039        36   # BR(~chi_40 -> ~G        A)
#
#
#
#
