#
#                              ======================
#                              | THE SUSYHIT OUTPUT |
#                              ======================
#
#
#              ------------------------------------------------------
#              |     This is the output of the SUSY-HIT package     |
#              |  created by A.Djouadi, M.Muehlleitner and M.Spira. |
#              |  In case of problems with SUSY-HIT email to        |
#              |           margarete.muehlleitner@kit.edu           |
#              |           michael.spira@psi.ch                     |
#              |           abdelhak.djouadi@cern.ch                 |
#              ------------------------------------------------------
#
#              ------------------------------------------------------
#              |  SUSY Les Houches Accord - MSSM Spectrum + Decays  |
#              |              based on the decay programs           |
#              |                                                    |
#              |                     SDECAY 1.5                     |
#              |                                                    |
#              |  Authors: M.Muhlleitner, A.Djouadi and Y.Mambrini  |
#              |  Ref.:    Comput.Phys.Commun.168(2005)46           |
#              |           [hep-ph/0311167]                         |
#              |                                                    |
#              |                     HDECAY 3.4                     |
#              |                                                    |
#              |  By: A.Djouadi,J.Kalinowski,M.Muhlleitner,M.Spira  |
#              |  Ref.:    Comput.Phys.Commun.108(1998)56           |
#              |           [hep-ph/9704448]                         |
#              |                                                    |
#              |                                                    |
#              |  If not stated otherwise all DRbar couplings and   |
#              |  soft SUSY breaking masses are given at the scale  |
#              |  Q=  0.91187600E+02
#              |                                                    |
#              ------------------------------------------------------
#
#
BLOCK DCINFO  # Decay Program information
     1   SDECAY/HDECAY # decay calculator
     2   1.5  /3.4    # version number
#
BLOCK SPINFO  # Spectrum calculator information
     1   SuSpect     # RGE +Spectrum calculator            
     2   2.43         # version number                     
#
BLOCK MODSEL  # Model selection
     1     2   # GMSB                                              
#
BLOCK SMINPUTS  # Standard Model inputs
         1     1.27932904E+02   # alpha_em^-1(M_Z)^MSbar
         2     1.16639000E-05   # G_F [GeV^-2]
         3     1.17200000E-01   # alpha_S(M_Z)^MSbar
         4     9.11870000E+01   # M_Z pole mass
         5     4.25000000E+00   # mb(mb)^MSbar
         6     1.72900000E+02   # mt pole mass
         7     1.77700000E+00   # mtau pole mass
#
BLOCK MINPAR  # Input parameters - minimal models
#
BLOCK EXTPAR  # Input parameters - non-minimal models
         0     9.11876000E+01   # EWSB                
         1     6.57000000E+02   # M_1                 
         2     3.00000000E+03   # M_2                 
         3     1.20000000E+03   # M_3                 
        11     0.00000000E+00   # A_t                 
        12     0.00000000E+00   # A_b                 
        13     0.00000000E+00   # A_tau               
        14     0.00000000E+00   # A_u                 
        15     0.00000000E+00   # A_d                 
        16     0.00000000E+00   # A_e                 
        23     6.50000000E+02   # mu(EWSB)            
        25     1.50000000E+00   # tanbeta(in)         
        26     2.00000000E+03   # MA_pole             
        31     5.00000000E+03   # M_eL                
        32     5.00000000E+03   # M_muL               
        33     5.00000000E+03   # M_tauL              
        34     5.00000000E+03   # M_eR                
        35     5.00000000E+03   # M_muR               
        36     5.00000000E+03   # M_tauR              
        41     5.00000000E+03   # M_q1L               
        42     5.00000000E+03   # M_q2L               
        43     5.00000000E+03   # M_q3L               
        44     5.00000000E+03   # M_uR                
        45     5.00000000E+03   # M_cR                
        46     5.00000000E+03   # M_tR                
        47     5.00000000E+03   # M_dR                
        48     5.00000000E+03   # M_sR                
        49     5.00000000E+03   # M_bR                
#
BLOCK MASS  # Mass Spectrum
# PDG code           mass       particle
        24     8.05394413E+01   # W+
        25     1.26000000E+02   # h
        35     2.00448038E+03   # H
        36     2.00000000E+03   # A
        37     2.00206555E+03   # H+
         5     4.87877839E+00   # b-quark pole mass calculated from mb(mb)_Msbar
   1000001     5.01048226E+03   # ~d_L
   2000001     5.01037294E+03   # ~d_R
   1000002     5.01023789E+03   # ~u_L
   2000002     5.01029575E+03   # ~u_R
   1000003     5.01048226E+03   # ~s_L
   2000003     5.01037294E+03   # ~s_R
   1000004     5.01023789E+03   # ~c_L
   2000004     5.01029575E+03   # ~c_R
   1000005     5.01015661E+03   # ~b_1
   2000005     5.01070005E+03   # ~b_2
   1000006     5.13751029E+03   # ~t_1
   2000006     5.43433599E+03   # ~t_2
   1000011     5.00008232E+03   # ~e_L
   2000011     5.00007602E+03   # ~e_R
   1000012     4.99984165E+03   # ~nu_eL
   1000013     5.00008232E+03   # ~mu_L
   2000013     5.00007602E+03   # ~mu_R
   1000014     4.99984165E+03   # ~nu_muL
   1000015     4.99990613E+03   # ~tau_1
   2000015     5.00025284E+03   # ~tau_2
   1000016     4.99984165E+03   # ~nu_tauL
   1000021     1.33582891E+03   # ~g
   1000022     6.51746347E+02   # ~chi_10
   1000023    -6.96900778E+02   # ~chi_20
   1000025     7.38909009E+02   # ~chi_30
   1000035     3.12900848E+03   # ~chi_40
   1000024     6.94372106E+02   # ~chi_1+
   1000037     3.12900775E+03   # ~chi_2+
   1000039     6.31875000E-08   # ~gravitino
#
BLOCK NMIX  # Neutralino Mixing Matrix
  1  1     6.98782333E-01   # N_11
  1  2    -2.23801460E-02   # N_12
  1  3     5.08935702E-01   # N_13
  1  4    -5.02182070E-01   # N_14
  2  1     6.27140793E-03   # N_21
  2  2    -4.06603592E-03   # N_22
  2  3    -7.06788230E-01   # N_23
  2  4    -7.07385704E-01   # N_24
  3  1     7.15306632E-01   # N_31
  3  2     2.27175161E-02   # N_32
  3  3    -4.90965935E-01   # N_33
  3  4     4.96762306E-01   # N_34
  4  1     5.85942367E-04   # N_41
  4  2    -9.99483122E-01   # N_42
  4  3    -1.96799276E-02   # N_43
  4  4     2.54135051E-02   # N_44
#
BLOCK UMIX  # Chargino Mixing Matrix U
  1  1    -2.78206778E-02   # U_11
  1  2     9.99612930E-01   # U_12
  2  1     9.99612930E-01   # U_21
  2  2     2.78206778E-02   # U_22
#
BLOCK VMIX  # Chargino Mixing Matrix V
  1  1    -3.59317602E-02   # V_11
  1  2     9.99354246E-01   # V_12
  2  1     9.99354246E-01   # V_21
  2  2     3.59317602E-02   # V_22
#
BLOCK STOPMIX  # Stop Mixing Matrix
  1  1     9.99981921E-01   # cos(theta_t)
  1  2    -6.01312507E-03   # sin(theta_t)
  2  1     6.01312507E-03   # -sin(theta_t)
  2  2     9.99981921E-01   # cos(theta_t)
#
BLOCK SBOTMIX  # Sbottom Mixing Matrix
  1  1     6.31994743E-01   # cos(theta_b)
  1  2     7.74972674E-01   # sin(theta_b)
  2  1    -7.74972674E-01   # -sin(theta_b)
  2  2     6.31994743E-01   # cos(theta_b)
#
BLOCK STAUMIX  # Stau Mixing Matrix
  1  1     7.00651023E-01   # cos(theta_tau)
  1  2     7.13504130E-01   # sin(theta_tau)
  2  1    -7.13504130E-01   # -sin(theta_tau)
  2  2     7.00651023E-01   # cos(theta_tau)
#
BLOCK ALPHA  # Higgs mixing
          -5.90201722E-01   # Mixing angle in the neutral Higgs boson sector
#
BLOCK HMIX Q=  9.11876000E+01  # DRbar Higgs Parameters
         1     6.50000000E+02   # mu(Q)               
         2     1.49999979E+00   # tanbeta(Q)          
         3     2.51965587E+02   # vev(Q)              
         4     3.69347521E+06   # MA^2(Q)             
#
BLOCK GAUGE Q=  9.11876000E+01  # The gauge couplings
     1     3.52896695E-01   # gprime(Q) DRbar
     2     6.27897892E-01   # g(Q) DRbar
     3     1.08870400E+00   # g3(Q) DRbar
#
BLOCK AU Q=  9.11876000E+01  # The trilinear couplings
  1  1     0.00000000E+00   # A_u(Q) DRbar
  2  2     0.00000000E+00   # A_c(Q) DRbar
  3  3     0.00000000E+00   # A_t(Q) DRbar
#
BLOCK AD Q=  9.11876000E+01  # The trilinear couplings
  1  1     0.00000000E+00   # A_d(Q) DRbar
  2  2     0.00000000E+00   # A_s(Q) DRbar
  3  3     0.00000000E+00   # A_b(Q) DRbar
#
BLOCK AE Q=  9.11876000E+01  # The trilinear couplings
  1  1     0.00000000E+00   # A_e(Q) DRbar
  2  2     0.00000000E+00   # A_mu(Q) DRbar
  3  3     0.00000000E+00   # A_tau(Q) DRbar
#
BLOCK Yu Q=  9.11876000E+01  # The Yukawa couplings
  1  1     0.00000000E+00   # y_u(Q) DRbar
  2  2     0.00000000E+00   # y_c(Q) DRbar
  3  3     1.02564677E+00   # y_t(Q) DRbar
#
BLOCK Yd Q=  9.11876000E+01  # The Yukawa couplings
  1  1     0.00000000E+00   # y_d(Q) DRbar
  2  2     0.00000000E+00   # y_s(Q) DRbar
  3  3     2.72042001E-02   # y_b(Q) DRbar
#
BLOCK Ye Q=  9.11876000E+01  # The Yukawa couplings
  1  1     0.00000000E+00   # y_e(Q) DRbar
  2  2     0.00000000E+00   # y_mu(Q) DRbar
  3  3     1.79883363E-02   # y_tau(Q) DRbar
#
BLOCK MSOFT Q=  9.11876000E+01  # The soft SUSY breaking masses at the scale Q
         1     6.57000000E+02   # M_1                 
         2     3.00000000E+03   # M_2                 
         3     1.20000000E+03   # M_3                 
        14     0.00000000E+00   # A_u                 
        15     0.00000000E+00   # A_d                 
        16     0.00000000E+00   # A_e                 
        21     2.58401647E+06   # M^2_Hd              
        22    -5.88130166E+06   # M^2_Hu              
        31     5.00000000E+03   # M_eL                
        32     5.00000000E+03   # M_muL               
        33     5.00000000E+03   # M_tauL              
        34     5.00000000E+03   # M_eR                
        35     5.00000000E+03   # M_muR               
        36     5.00000000E+03   # M_tauR              
        41     5.00000000E+03   # M_q1L               
        42     5.00000000E+03   # M_q2L               
        43     5.00000000E+03   # M_q3L               
        44     5.00000000E+03   # M_uR                
        45     5.00000000E+03   # M_cR                
        46     5.00000000E+03   # M_tR                
        47     5.00000000E+03   # M_dR                
        48     5.00000000E+03   # M_sR                
        49     5.00000000E+03   # M_bR                
#
#
#
#                             =================
#                             |The decay table|
#                             =================
#
# - The QCD corrections to the decays gluino -> squark  + quark
#                                     squark -> gaugino + quark_prime
#                                     squark -> squark_prime + Higgs
#                                     squark -> gluino  + quark
#   are included.
#
# - The multi-body decays for the inos, stops and sbottoms are included.
#
# - The loop induced decays for the gluino, neutralinos and stops
#   are included.
#
# - The SUSY decays of the top quark are included.
#
# - Possible decays of the NLSP in GMSB models are included.
#
#
#         PDG            Width
DECAY         6     1.37371553E+00   # top decays
#          BR         NDA      ID1       ID2
     1.00000000E+00    2           5        24   # BR(t ->  b    W+)
#
#         PDG            Width
DECAY   1000021     4.95577314E-05   # gluino decays
#          BR         NDA      ID1       ID2
     3.57407537E-02    2     1000022        21   # BR(~g -> ~chi_10 g)
     6.16188792E-02    2     1000023        21   # BR(~g -> ~chi_20 g)
     2.58813229E-02    2     1000025        21   # BR(~g -> ~chi_30 g)
#          BR         NDA      ID1       ID2
     2.47495231E-05    2     1000039        21   # BR(~g -> ~G      g)
#           BR         NDA      ID1       ID2       ID3
     8.53199646E-03    3     1000022         1        -1   # BR(~g -> ~chi_10 d  db)
     8.87826277E-07    3     1000023         1        -1   # BR(~g -> ~chi_20 d  db)
     4.64303963E-03    3     1000025         1        -1   # BR(~g -> ~chi_30 d  db)
     2.65099988E-02    3     1000022         2        -2   # BR(~g -> ~chi_10 u  ub)
     8.19485967E-07    3     1000023         2        -2   # BR(~g -> ~chi_20 u  ub)
     1.71964251E-02    3     1000025         2        -2   # BR(~g -> ~chi_30 u  ub)
     8.53199646E-03    3     1000022         3        -3   # BR(~g -> ~chi_10 s  sb)
     8.87826277E-07    3     1000023         3        -3   # BR(~g -> ~chi_20 s  sb)
     4.64303963E-03    3     1000025         3        -3   # BR(~g -> ~chi_30 s  sb)
     2.65099988E-02    3     1000022         4        -4   # BR(~g -> ~chi_10 c  cb)
     8.19485967E-07    3     1000023         4        -4   # BR(~g -> ~chi_20 c  cb)
     1.71964251E-02    3     1000025         4        -4   # BR(~g -> ~chi_30 c  cb)
     8.64544451E-03    3     1000022         5        -5   # BR(~g -> ~chi_10 b  bb)
     2.78940656E-04    3     1000023         5        -5   # BR(~g -> ~chi_20 b  bb)
     4.78347606E-03    3     1000025         5        -5   # BR(~g -> ~chi_30 b  bb)
     9.84725451E-02    3     1000022         6        -6   # BR(~g -> ~chi_10 t  tb)
     1.11186171E-01    3     1000023         6        -6   # BR(~g -> ~chi_20 t  tb)
     7.16764990E-02    3     1000025         6        -6   # BR(~g -> ~chi_30 t  tb)
     1.48939245E-04    3     1000024         1        -2   # BR(~g -> ~chi_1+ d  ub)
     1.48939245E-04    3    -1000024         2        -1   # BR(~g -> ~chi_1- u  db)
     1.48939245E-04    3     1000024         3        -4   # BR(~g -> ~chi_1+ s  cb)
     1.48939245E-04    3    -1000024         4        -3   # BR(~g -> ~chi_1- c  sb)
     2.33664564E-01    3     1000024         5        -6   # BR(~g -> ~chi_1+ b  tb)
     2.33664564E-01    3    -1000024         6        -5   # BR(~g -> ~chi_1- t  bb)
#
#         PDG            Width
DECAY   1000006     3.29621520E+02   # stop1 decays
#          BR         NDA      ID1       ID2
     5.42229419E-02    2     1000022         6   # BR(~t_1 -> ~chi_10 t )
     1.07811394E-01    2     1000023         6   # BR(~t_1 -> ~chi_20 t )
     5.53143509E-02    2     1000025         6   # BR(~t_1 -> ~chi_30 t )
     2.35437936E-02    2     1000035         6   # BR(~t_1 -> ~chi_40 t )
     7.84924203E-05    2     1000024         5   # BR(~t_1 -> ~chi_1+ b )
     4.68827626E-02    2     1000037         5   # BR(~t_1 -> ~chi_2+ b )
     6.97457160E-01    2     1000021         6   # BR(~t_1 -> ~g      t )
     5.94203670E-03    2     1000005        24   # BR(~t_1 -> ~b_1    W+)
     8.74706756E-03    2     2000005        24   # BR(~t_1 -> ~b_2    W+)
#
#         PDG            Width
DECAY   2000006     4.06552945E+02   # stop2 decays
#          BR         NDA      ID1       ID2
     6.13165717E-02    2     1000022         6   # BR(~t_2 -> ~chi_10 t )
     9.31827997E-02    2     1000023         6   # BR(~t_2 -> ~chi_20 t )
     5.91274221E-02    2     1000025         6   # BR(~t_2 -> ~chi_30 t )
     1.94146504E-06    2     1000035         6   # BR(~t_2 -> ~chi_40 t )
     1.86566752E-01    2     1000024         5   # BR(~t_2 -> ~chi_1+ b )
     4.16976846E-06    2     1000037         5   # BR(~t_2 -> ~chi_2+ b )
     5.99813096E-01    2     1000021         6   # BR(~t_2 -> ~g      t )
    -4.36305059E-05    2     1000006        25   # BR(~t_2 -> ~t_1    h )
     4.69175960E-06    2     1000006        23   # BR(~t_2 -> ~t_1    Z )
     1.04678753E-05    2     1000005        24   # BR(~t_2 -> ~b_1    W+)
     1.57176347E-05    2     2000005        24   # BR(~t_2 -> ~b_2    W+)
#
#         PDG            Width
DECAY   1000005     2.54064260E+02   # sbottom1 decays
#          BR         NDA      ID1       ID2
     4.69509065E-03    2     1000022         5   # BR(~b_1 -> ~chi_10 b )
     7.82625163E-05    2     1000023         5   # BR(~b_1 -> ~chi_20 b )
     3.13166321E-03    2     1000025         5   # BR(~b_1 -> ~chi_30 b )
     9.09339504E-03    2     1000035         5   # BR(~b_1 -> ~chi_40 b )
     8.13502554E-02    2    -1000024         6   # BR(~b_1 -> ~chi_1- t )
     1.82622693E-02    2    -1000037         6   # BR(~b_1 -> ~chi_2- t )
     8.83389064E-01    2     1000021         5   # BR(~b_1 -> ~g      b )
#
#         PDG            Width
DECAY   2000005     2.88588054E+02   # sbottom2 decays
#          BR         NDA      ID1       ID2
     1.80933819E-03    2     1000022         5   # BR(~b_2 -> ~chi_10 b )
     1.03036483E-04    2     1000023         5   # BR(~b_2 -> ~chi_20 b )
     2.62877751E-03    2     1000025         5   # BR(~b_2 -> ~chi_30 b )
     1.65278267E-02    2     1000035         5   # BR(~b_2 -> ~chi_40 b )
     1.68236546E-01    2    -1000024         6   # BR(~b_2 -> ~chi_1- t )
     3.32023794E-02    2    -1000037         6   # BR(~b_2 -> ~chi_2- t )
     7.77492096E-01    2     1000021         5   # BR(~b_2 -> ~g      b )
#
#         PDG            Width
DECAY   1000002     2.46331347E+02   # sup_L decays
#          BR         NDA      ID1       ID2
     8.77653433E-04    2     1000022         2   # BR(~u_L -> ~chi_10 u)
     6.19736387E-07    2     1000023         2   # BR(~u_L -> ~chi_20 u)
     1.81227459E-03    2     1000025         2   # BR(~u_L -> ~chi_30 u)
     2.87233937E-02    2     1000035         2   # BR(~u_L -> ~chi_40 u)
     1.91505766E-04    2     1000024         1   # BR(~u_L -> ~chi_1+ d)
     5.74446252E-02    2     1000037         1   # BR(~u_L -> ~chi_2+ d)
     9.10949928E-01    2     1000021         2   # BR(~u_L -> ~g      u)
#
#         PDG            Width
DECAY   2000002     2.34654315E+02   # sup_R decays
#          BR         NDA      ID1       ID2
     2.14478677E-02    2     1000022         2   # BR(~u_R -> ~chi_10 u)
     1.71906555E-06    2     1000023         2   # BR(~u_R -> ~chi_20 u)
     2.22547284E-02    2     1000025         2   # BR(~u_R -> ~chi_30 u)
     5.82094515E-09    2     1000035         2   # BR(~u_R -> ~chi_40 u)
     9.56295679E-01    2     1000021         2   # BR(~u_R -> ~g      u)
#
#         PDG            Width
DECAY   1000001     2.46335010E+02   # sdown_L decays
#          BR         NDA      ID1       ID2
     1.75091414E-03    2     1000022         1   # BR(~d_L -> ~chi_10 d)
     2.03660119E-06    2     1000023         1   # BR(~d_L -> ~chi_20 d)
     9.13853382E-04    2     1000025         1   # BR(~d_L -> ~chi_30 d)
     2.87405452E-02    2     1000035         1   # BR(~d_L -> ~chi_40 d)
     1.14809215E-04    2    -1000024         2   # BR(~d_L -> ~chi_1- u)
     5.74834288E-02    2    -1000037         2   # BR(~d_L -> ~chi_2- u)
     9.10994413E-01    2     1000021         1   # BR(~d_L -> ~g      d)
#
#         PDG            Width
DECAY   2000001     2.26967317E+02   # sdown_R decays
#          BR         NDA      ID1       ID2
     5.54365927E-03    2     1000022         1   # BR(~d_R -> ~chi_10 d)
     4.44329257E-07    2     1000023         1   # BR(~d_R -> ~chi_20 d)
     5.75221141E-03    2     1000025         1   # BR(~d_R -> ~chi_30 d)
     1.50460465E-09    2     1000035         1   # BR(~d_R -> ~chi_40 d)
     9.88703683E-01    2     1000021         1   # BR(~d_R -> ~g      d)
#
#         PDG            Width
DECAY   1000004     2.46331347E+02   # scharm_L decays
#          BR         NDA      ID1       ID2
     8.77653433E-04    2     1000022         4   # BR(~c_L -> ~chi_10 c)
     6.19736387E-07    2     1000023         4   # BR(~c_L -> ~chi_20 c)
     1.81227459E-03    2     1000025         4   # BR(~c_L -> ~chi_30 c)
     2.87233937E-02    2     1000035         4   # BR(~c_L -> ~chi_40 c)
     1.91505766E-04    2     1000024         3   # BR(~c_L -> ~chi_1+ s)
     5.74446252E-02    2     1000037         3   # BR(~c_L -> ~chi_2+ s)
     9.10949928E-01    2     1000021         4   # BR(~c_L -> ~g      c)
#
#         PDG            Width
DECAY   2000004     2.34654315E+02   # scharm_R decays
#          BR         NDA      ID1       ID2
     2.14478677E-02    2     1000022         4   # BR(~c_R -> ~chi_10 c)
     1.71906555E-06    2     1000023         4   # BR(~c_R -> ~chi_20 c)
     2.22547284E-02    2     1000025         4   # BR(~c_R -> ~chi_30 c)
     5.82094515E-09    2     1000035         4   # BR(~c_R -> ~chi_40 c)
     9.56295679E-01    2     1000021         4   # BR(~c_R -> ~g      c)
#
#         PDG            Width
DECAY   1000003     2.46335010E+02   # sstrange_L decays
#          BR         NDA      ID1       ID2
     1.75091414E-03    2     1000022         3   # BR(~s_L -> ~chi_10 s)
     2.03660119E-06    2     1000023         3   # BR(~s_L -> ~chi_20 s)
     9.13853382E-04    2     1000025         3   # BR(~s_L -> ~chi_30 s)
     2.87405452E-02    2     1000035         3   # BR(~s_L -> ~chi_40 s)
     1.14809215E-04    2    -1000024         4   # BR(~s_L -> ~chi_1- c)
     5.74834288E-02    2    -1000037         4   # BR(~s_L -> ~chi_2- c)
     9.10994413E-01    2     1000021         3   # BR(~s_L -> ~g      s)
#
#         PDG            Width
DECAY   2000003     2.26967317E+02   # sstrange_R decays
#          BR         NDA      ID1       ID2
     5.54365927E-03    2     1000022         3   # BR(~s_R -> ~chi_10 s)
     4.44329257E-07    2     1000023         3   # BR(~s_R -> ~chi_20 s)
     5.75221141E-03    2     1000025         3   # BR(~s_R -> ~chi_30 s)
     1.50460465E-09    2     1000035         3   # BR(~s_R -> ~chi_40 s)
     9.88703683E-01    2     1000021         3   # BR(~s_R -> ~g      s)
#
#         PDG            Width
DECAY   1000011     2.77632151E+01   # selectron_L decays
#          BR         NDA      ID1       ID2
     9.36136281E-02    2     1000022        11   # BR(~e_L -> ~chi_10 e-)
     1.99003574E-07    2     1000023        11   # BR(~e_L -> ~chi_20 e-)
     1.21914043E-01    2     1000025        11   # BR(~e_L -> ~chi_30 e-)
     2.60980148E-01    2     1000035        11   # BR(~e_L -> ~chi_40 e-)
     1.05156524E-03    2    -1000024        12   # BR(~e_L -> ~chi_1- nu_e)
     5.22440416E-01    2    -1000037        12   # BR(~e_L -> ~chi_2- nu_e)
#
#         PDG            Width
DECAY   2000011     2.38207348E+01   # selectron_R decays
#          BR         NDA      ID1       ID2
     4.90767860E-01    2     1000022        11   # BR(~e_R -> ~chi_10 e-)
     3.93339368E-05    2     1000023        11   # BR(~e_R -> ~chi_20 e-)
     5.09192674E-01    2     1000025        11   # BR(~e_R -> ~chi_30 e-)
     1.32172880E-07    2     1000035        11   # BR(~e_R -> ~chi_40 e-)
#
#         PDG            Width
DECAY   1000013     2.77632151E+01   # smuon_L decays
#          BR         NDA      ID1       ID2
     9.36136281E-02    2     1000022        13   # BR(~mu_L -> ~chi_10 mu-)
     1.99003574E-07    2     1000023        13   # BR(~mu_L -> ~chi_20 mu-)
     1.21914043E-01    2     1000025        13   # BR(~mu_L -> ~chi_30 mu-)
     2.60980148E-01    2     1000035        13   # BR(~mu_L -> ~chi_40 mu-)
     1.05156524E-03    2    -1000024        14   # BR(~mu_L -> ~chi_1- nu_mu)
     5.22440416E-01    2    -1000037        14   # BR(~mu_L -> ~chi_2- nu_mu)
#
#         PDG            Width
DECAY   2000013     2.38207348E+01   # smuon_R decays
#          BR         NDA      ID1       ID2
     4.90767860E-01    2     1000022        13   # BR(~mu_R -> ~chi_10 mu-)
     3.93339368E-05    2     1000023        13   # BR(~mu_R -> ~chi_20 mu-)
     5.09192674E-01    2     1000025        13   # BR(~mu_R -> ~chi_30 mu-)
     1.32172880E-07    2     1000035        13   # BR(~mu_R -> ~chi_40 mu-)
#
#         PDG            Width
DECAY   1000015     2.58313706E+01   # stau_1 decays
#          BR         NDA      ID1       ID2
     2.86388421E-01    2     1000022        15   # BR(~tau_1 -> ~chi_10  tau-)
     4.58490185E-04    2     1000023        15   # BR(~tau_1 -> ~chi_20  tau-)
     2.98195959E-01    2     1000025        15   # BR(~tau_1 -> ~chi_30  tau-)
     1.37458702E-01    2     1000035        15   # BR(~tau_1 -> ~chi_40  tau-)
     2.32759475E-03    2    -1000024        16   # BR(~tau_1 -> ~chi_1-  nu_tau)
     2.75170798E-01    2    -1000037        16   # BR(~tau_1 -> ~chi_2-  nu_tau)
     3.48807540E-08    2     1000039        15   # BR(~tau_1 -> ~G       tau-)
#
#         PDG            Width
DECAY   2000015     2.58454164E+01   # stau_2 decays
#          BR         NDA      ID1       ID2
     2.67270911E-01    2     1000022        15   # BR(~tau_2 -> ~chi_10  tau-)
     7.74600128E-04    2     1000023        15   # BR(~tau_2 -> ~chi_20  tau-)
     3.02805891E-01    2     1000025        15   # BR(~tau_2 -> ~chi_30  tau-)
     1.42962305E-01    2     1000035        15   # BR(~tau_2 -> ~chi_40  tau-)
     6.72562461E-08    2    -1000024        16   # BR(~tau_2 -> ~chi_1-  nu_tau)
     2.86186226E-01    2    -1000037        16   # BR(~tau_2 -> ~chi_2-  nu_tau)
#
#         PDG            Width
DECAY   1000012     2.77625737E+01   # snu_eL decays
#          BR         NDA      ID1       ID2
     1.17605501E-01    2     1000022        12   # BR(~nu_eL -> ~chi_10 nu_e)
     3.91293622E-05    2     1000023        12   # BR(~nu_eL -> ~chi_20 nu_e)
     9.72236323E-02    2     1000025        12   # BR(~nu_eL -> ~chi_30 nu_e)
     2.61285405E-01    2     1000035        12   # BR(~nu_eL -> ~chi_40 nu_e)
     1.75406338E-03    2     1000024        11   # BR(~nu_eL -> ~chi_1+ e-)
     5.22092268E-01    2     1000037        11   # BR(~nu_eL -> ~chi_2+ e-)
#
#         PDG            Width
DECAY   1000014     2.77625737E+01   # snu_muL decays
#          BR         NDA      ID1       ID2
     1.17605501E-01    2     1000022        14   # BR(~nu_muL -> ~chi_10 nu_mu)
     3.91293622E-05    2     1000023        14   # BR(~nu_muL -> ~chi_20 nu_mu)
     9.72236323E-02    2     1000025        14   # BR(~nu_muL -> ~chi_30 nu_mu)
     2.61285405E-01    2     1000035        14   # BR(~nu_muL -> ~chi_40 nu_mu)
     1.75406338E-03    2     1000024        13   # BR(~nu_muL -> ~chi_1+ mu-)
     5.22092268E-01    2     1000037        13   # BR(~nu_muL -> ~chi_2+ mu-)
#
#         PDG            Width
DECAY   1000016     2.77935146E+01   # snu_tauL decays
#          BR         NDA      ID1       ID2
     1.17474578E-01    2     1000022        16   # BR(~nu_tauL -> ~chi_10 nu_tau)
     3.90858017E-05    2     1000023        16   # BR(~nu_tauL -> ~chi_20 nu_tau)
     9.71153987E-02    2     1000025        16   # BR(~nu_tauL -> ~chi_30 nu_tau)
     2.60994531E-01    2     1000035        16   # BR(~nu_tauL -> ~chi_40 nu_tau)
     2.86477002E-03    2     1000024        15   # BR(~nu_tauL -> ~chi_1+ tau-)
     5.21511636E-01    2     1000037        15   # BR(~nu_tauL -> ~chi_2+ tau-)
#
#         PDG            Width
DECAY   1000024     8.78742418E-05   # chargino1+ decays
#          BR         NDA      ID1       ID2
     2.51597172E-07    2     1000039        24   # BR(~chi_1+ -> ~G       W+)
#           BR         NDA      ID1       ID2       ID3
     3.33651287E-01    3     1000022         2        -1   # BR(~chi_1+ -> ~chi_10 u    db)
     3.33651287E-01    3     1000022         4        -3   # BR(~chi_1+ -> ~chi_10 c    sb)
     1.11217229E-01    3     1000022       -11        12   # BR(~chi_1+ -> ~chi_10 e+   nu_e)
     1.11217229E-01    3     1000022       -13        14   # BR(~chi_1+ -> ~chi_10 mu+  nu_mu)
     1.10262717E-01    3     1000022       -15        16   # BR(~chi_1+ -> ~chi_10 tau+ nu_tau)
#
#         PDG            Width
DECAY   1000037     3.58717459E+01   # chargino2+ decays
#          BR         NDA      ID1       ID2
     2.34624140E-01    2     1000024        23   # BR(~chi_2+ -> ~chi_1+  Z )
     1.10662821E-01    2     1000022        24   # BR(~chi_2+ -> ~chi_10  W+)
     2.28647652E-01    2     1000023        24   # BR(~chi_2+ -> ~chi_20  W+)
     1.18087674E-01    2     1000025        24   # BR(~chi_2+ -> ~chi_30  W+)
     2.35715193E-01    2     1000024        25   # BR(~chi_2+ -> ~chi_1+  h )
     1.79398268E-02    2     1000024        35   # BR(~chi_2+ -> ~chi_1+  H )
     1.81960943E-02    2     1000024        36   # BR(~chi_2+ -> ~chi_1+  A )
     1.02532530E-02    2     1000022        37   # BR(~chi_2+ -> ~chi_10  H+)
     1.79818097E-02    2     1000023        37   # BR(~chi_2+ -> ~chi_20  H+)
     7.89153466E-03    2     1000025        37   # BR(~chi_2+ -> ~chi_30  H+)
     2.40376186E-09    2     1000039        24   # BR(~chi_2+ -> ~G       W+)
     1.36863752E-13    2     1000039        37   # BR(~chi_2+ -> ~G       H+)
#
#         PDG            Width
DECAY   1000022     2.41777903E-11   # neutralino1 decays
#          BR         NDA      ID1       ID2
     5.01870820E-01    2     1000039        22   # BR(~chi_10 -> ~G        gam)
     4.87318763E-01    2     1000039        23   # BR(~chi_10 -> ~G        Z)
     1.08104167E-02    2     1000039        25   # BR(~chi_10 -> ~G        h)
#
#         PDG            Width
DECAY   1000023     9.46773074E-05   # neutralino2 decays
#          BR         NDA      ID1       ID2
     4.65372377E-04    2     1000022        22   # BR(~chi_20 -> ~chi_10 gam)
#          BR         NDA      ID1       ID2
     6.04548772E-12    2     1000039        22   # BR(~chi_20 -> ~G        gam)
     9.04319919E-09    2     1000039        23   # BR(~chi_20 -> ~G        Z)
     2.10941711E-07    2     1000039        25   # BR(~chi_20 -> ~G        h)
#           BR         NDA      ID1       ID2       ID3
     1.18870365E-01    3     1000022        -2         2   # BR(~chi_20 -> ~chi_10 ub      u)
     1.53895000E-01    3     1000022        -1         1   # BR(~chi_20 -> ~chi_10 db      d)
     1.18870365E-01    3     1000022        -4         4   # BR(~chi_20 -> ~chi_10 cb      c)
     1.53895000E-01    3     1000022        -3         3   # BR(~chi_20 -> ~chi_10 sb      s)
     1.38499080E-01    3     1000022        -5         5   # BR(~chi_20 -> ~chi_10 bb      b)
     3.51358370E-02    3     1000022       -11        11   # BR(~chi_20 -> ~chi_10 e+      e-)
     3.51358370E-02    3     1000022       -13        13   # BR(~chi_20 -> ~chi_10 mu+     mu-)
     3.47479709E-02    3     1000022       -15        15   # BR(~chi_20 -> ~chi_10 tau+    tau-)
     7.01609261E-02    3     1000022       -12        12   # BR(~chi_20 -> ~chi_10 nu_eb   nu_e)
     7.01609261E-02    3     1000022       -14        14   # BR(~chi_20 -> ~chi_10 nu_mub  nu_mu)
     7.01609261E-02    3     1000022       -16        16   # BR(~chi_20 -> ~chi_10 nu_taub nu_tau)
     4.04179350E-07    3     1000024        -2         1   # BR(~chi_20 -> ~chi_1+ ub      d)
     4.04179350E-07    3    -1000024        -1         2   # BR(~chi_20 -> ~chi_1- db      u)
     4.04179350E-07    3     1000024        -4         3   # BR(~chi_20 -> ~chi_1+ cb      s)
     4.04179350E-07    3    -1000024        -3         4   # BR(~chi_20 -> ~chi_1- sb      c)
     1.34726461E-07    3     1000024       -12        11   # BR(~chi_20 -> ~chi_1+ nu_eb   e-)
     1.34726461E-07    3    -1000024        12       -11   # BR(~chi_20 -> ~chi_1- nu_e    e+)
     1.34726461E-07    3     1000024       -14        13   # BR(~chi_20 -> ~chi_1+ nu_mub  mu-)
     1.34726461E-07    3    -1000024        14       -13   # BR(~chi_20 -> ~chi_1- nu_mu   mu+)
     8.68402236E-09    3     1000024       -16        15   # BR(~chi_20 -> ~chi_1+ nu_taub tau-)
     8.68402236E-09    3    -1000024        16       -15   # BR(~chi_20 -> ~chi_1- nu_tau  tau+)
#
#         PDG            Width
DECAY   1000025     2.75613391E-04   # neutralino3 decays
#          BR         NDA      ID1       ID2
     3.02820129E-04    2     1000022        22   # BR(~chi_30 -> ~chi_10 gam)
     4.77958386E-04    2     1000023        22   # BR(~chi_30 -> ~chi_20 gam)
#          BR         NDA      ID1       ID2
     9.28357275E-08    2     1000039        22   # BR(~chi_30 -> ~G        gam)
     7.46434411E-08    2     1000039        23   # BR(~chi_30 -> ~G        Z)
     1.99231531E-09    2     1000039        25   # BR(~chi_30 -> ~G        h)
#           BR         NDA      ID1       ID2       ID3
     6.95456481E-06    3     1000022        -2         2   # BR(~chi_30 -> ~chi_10 ub      u)
     8.27030557E-06    3     1000022        -1         1   # BR(~chi_30 -> ~chi_10 db      d)
     6.95456481E-06    3     1000022        -4         4   # BR(~chi_30 -> ~chi_10 cb      c)
     8.27030557E-06    3     1000022        -3         3   # BR(~chi_30 -> ~chi_10 sb      s)
     8.89105441E-06    3     1000022        -5         5   # BR(~chi_30 -> ~chi_10 bb      b)
     1.44075592E-06    3     1000022       -11        11   # BR(~chi_30 -> ~chi_10 e+      e-)
     1.44075592E-06    3     1000022       -13        13   # BR(~chi_30 -> ~chi_10 mu+     mu-)
     1.55351598E-06    3     1000022       -15        15   # BR(~chi_30 -> ~chi_10 tau+    tau-)
     4.05144479E-06    3     1000022       -12        12   # BR(~chi_30 -> ~chi_10 nu_eb   nu_e)
     4.05144479E-06    3     1000022       -14        14   # BR(~chi_30 -> ~chi_10 nu_mub  nu_mu)
     4.05144479E-06    3     1000022       -16        16   # BR(~chi_30 -> ~chi_10 nu_taub nu_tau)
     2.68652226E-02    3     1000023        -2         2   # BR(~chi_30 -> ~chi_20 ub      u)
     3.47810315E-02    3     1000023        -1         1   # BR(~chi_30 -> ~chi_20 db      d)
     2.68652226E-02    3     1000023        -4         4   # BR(~chi_30 -> ~chi_20 cb      c)
     3.47810315E-02    3     1000023        -3         3   # BR(~chi_30 -> ~chi_20 sb      s)
     3.08193925E-02    3     1000023        -5         5   # BR(~chi_30 -> ~chi_20 bb      b)
     7.94091846E-03    3     1000023       -11        11   # BR(~chi_30 -> ~chi_20 e+      e-)
     7.94091846E-03    3     1000023       -13        13   # BR(~chi_30 -> ~chi_20 mu+     mu-)
     7.84336898E-03    3     1000023       -15        15   # BR(~chi_30 -> ~chi_20 tau+    tau-)
     1.58566317E-02    3     1000023       -12        12   # BR(~chi_30 -> ~chi_20 nu_eb   nu_e)
     1.58566317E-02    3     1000023       -14        14   # BR(~chi_30 -> ~chi_20 nu_mub  nu_mu)
     1.58566317E-02    3     1000023       -16        16   # BR(~chi_30 -> ~chi_20 nu_taub nu_tau)
     1.29072044E-01    3     1000024        -2         1   # BR(~chi_30 -> ~chi_1+ ub      d)
     1.29072044E-01    3    -1000024        -1         2   # BR(~chi_30 -> ~chi_1- db      u)
     1.29072044E-01    3     1000024        -4         3   # BR(~chi_30 -> ~chi_1+ cb      s)
     1.29072044E-01    3    -1000024        -3         4   # BR(~chi_30 -> ~chi_1- sb      c)
     4.30239411E-02    3     1000024       -12        11   # BR(~chi_30 -> ~chi_1+ nu_eb   e-)
     4.30239411E-02    3    -1000024        12       -11   # BR(~chi_30 -> ~chi_1- nu_e    e+)
     4.30239411E-02    3     1000024       -14        13   # BR(~chi_30 -> ~chi_1+ nu_mub  mu-)
     4.30239411E-02    3    -1000024        14       -13   # BR(~chi_30 -> ~chi_1- nu_mu   mu+)
     4.26860907E-02    3     1000024       -16        15   # BR(~chi_30 -> ~chi_1+ nu_taub tau-)
     4.26860907E-02    3    -1000024        16       -15   # BR(~chi_30 -> ~chi_1- nu_tau  tau+)
#
#         PDG            Width
DECAY   1000035     3.58721496E+01   # neutralino4 decays
#          BR         NDA      ID1       ID2
     1.75185078E-03    2     1000022        23   # BR(~chi_40 -> ~chi_10   Z )
     2.31017291E-01    2     1000023        23   # BR(~chi_40 -> ~chi_20   Z )
     1.96038164E-03    2     1000025        23   # BR(~chi_40 -> ~chi_30   Z )
     2.28517161E-01    2     1000024       -24   # BR(~chi_40 -> ~chi_1+   W-)
     2.28517161E-01    2    -1000024        24   # BR(~chi_40 -> ~chi_1-   W+)
     1.12417134E-01    2     1000022        25   # BR(~chi_40 -> ~chi_10   h )
     1.73536521E-03    2     1000022        35   # BR(~chi_40 -> ~chi_10   H )
     8.49492867E-03    2     1000022        36   # BR(~chi_40 -> ~chi_10   A )
     3.68270041E-03    2     1000023        25   # BR(~chi_40 -> ~chi_20   h )
     1.46150002E-02    2     1000023        35   # BR(~chi_40 -> ~chi_20   H )
     3.28749134E-03    2     1000023        36   # BR(~chi_40 -> ~chi_20   A )
     1.19874588E-01    2     1000025        25   # BR(~chi_40 -> ~chi_30   h )
     1.47079341E-03    2     1000025        35   # BR(~chi_40 -> ~chi_30   H )
     6.40398900E-03    2     1000025        36   # BR(~chi_40 -> ~chi_30   A )
     1.81270811E-02    2     1000024       -37   # BR(~chi_40 -> ~chi_1+   H-)
     1.81270811E-02    2    -1000024        37   # BR(~chi_40 -> ~chi_1-   H+)
     5.76961516E-10    2     1000039        22   # BR(~chi_40 -> ~G        gam)
     1.82658589E-09    2     1000039        23   # BR(~chi_40 -> ~G        Z)
     1.23678475E-13    2     1000039        25   # BR(~chi_40 -> ~G        h)
     1.35480439E-13    2     1000039        35   # BR(~chi_40 -> ~G        H)
     7.65375189E-16    2     1000039        36   # BR(~chi_40 -> ~G        A)
#
#         PDG            Width
DECAY        25     4.21750358E-03   # h decays
#          BR         NDA      ID1       ID2
     6.01744526E-01    2           5        -5   # BR(h -> b       bb     )
     6.22513358E-02    2         -15        15   # BR(h -> tau+    tau-   )
     2.20342589E-04    2         -13        13   # BR(h -> mu+     mu-    )
     4.66202330E-04    2           3        -3   # BR(h -> s       sb     )
     2.01129265E-02    2           4        -4   # BR(h -> c       cb     )
     6.64211902E-02    2          21        21   # BR(h -> g       g      )
     2.31023763E-03    2          22        22   # BR(h -> gam     gam    )
     1.62687188E-03    2          22        23   # BR(h -> Z       gam    )
     2.16759722E-01    2          24       -24   # BR(h -> W+      W-     )
     2.80866451E-02    2          23        23   # BR(h -> Z       Z      )
#
#         PDG            Width
DECAY        35     3.95236162E+01   # H decays
#          BR         NDA      ID1       ID2
     1.40994588E-03    2           5        -5   # BR(H -> b       bb     )
     2.35799482E-04    2         -15        15   # BR(H -> tau+    tau-   )
     8.33638956E-07    2         -13        13   # BR(H -> mu+     mu-    )
     1.06732764E-06    2           3        -3   # BR(H -> s       sb     )
     9.63232076E-06    2           4        -4   # BR(H -> c       cb     )
     9.53085990E-01    2           6        -6   # BR(H -> t       tb     )
     7.63198429E-04    2          21        21   # BR(H -> g       g      )
     2.62664517E-06    2          22        22   # BR(H -> gam     gam    )
     1.10935718E-06    2          23        22   # BR(H -> Z       gam    )
     3.20259458E-04    2          24       -24   # BR(H -> W+      W-     )
     1.59693111E-04    2          23        23   # BR(H -> Z       Z      )
     8.65280631E-04    2          25        25   # BR(H -> h       h      )
     1.22942804E-23    2          36        36   # BR(H -> A       A      )
     4.92842171E-11    2          23        36   # BR(H -> Z       A      )
     5.46262441E-12    2          24       -37   # BR(H -> W+      H-     )
     5.46262441E-12    2         -24        37   # BR(H -> W-      H+     )
     3.34305628E-05    2     1000024  -1000024   # BR(H -> ~chi_1+ ~chi_1-)
     6.02140983E-04    2     1000022   1000022   # BR(H -> ~chi_10 ~chi_10)
     8.43571879E-06    2     1000023   1000023   # BR(H -> ~chi_20 ~chi_20)
     2.93343331E-04    2     1000025   1000025   # BR(H -> ~chi_30 ~chi_30)
     2.36352838E-02    2     1000022   1000023   # BR(H -> ~chi_10 ~chi_20)
     2.18619908E-08    2     1000022   1000025   # BR(H -> ~chi_10 ~chi_30)
     1.85719076E-02    2     1000023   1000025   # BR(H -> ~chi_20 ~chi_30)
#
#         PDG            Width
DECAY        36     3.99689224E+01   # A decays
#          BR         NDA      ID1       ID2
     1.41249077E-03    2           5        -5   # BR(A -> b       bb     )
     2.33336698E-04    2         -15        15   # BR(A -> tau+    tau-   )
     8.24929520E-07    2         -13        13   # BR(A -> mu+     mu-    )
     1.08755048E-06    2           3        -3   # BR(A -> s       sb     )
     9.53041017E-06    2           4        -4   # BR(A -> c       cb     )
     9.53825040E-01    2           6        -6   # BR(A -> t       tb     )
     9.02813521E-04    2          21        21   # BR(A -> g       g      )
     2.76234253E-06    2          22        22   # BR(A -> gam     gam    )
     1.29349842E-06    2          23        22   # BR(A -> Z       gam    )
     3.11890596E-04    2          23        25   # BR(A -> Z       h      )
     6.29386289E-04    2     1000024  -1000024   # BR(A -> ~chi_1+ ~chi_1-)
     2.46446962E-02    2     1000022   1000022   # BR(A -> ~chi_10 ~chi_10)
     6.40055762E-07    2     1000023   1000023   # BR(A -> ~chi_20 ~chi_20)
     1.71268617E-02    2     1000025   1000025   # BR(A -> ~chi_30 ~chi_30)
     4.41996642E-04    2     1000022   1000023   # BR(A -> ~chi_10 ~chi_20)
     5.18904537E-05    2     1000022   1000025   # BR(A -> ~chi_10 ~chi_30)
     4.03458489E-04    2     1000023   1000025   # BR(A -> ~chi_20 ~chi_30)
#
#         PDG            Width
DECAY        37     3.91580632E+01   # H+ decays
#          BR         NDA      ID1       ID2
     2.26668433E-06    2           4        -5   # BR(H+ -> c       bb     )
     2.38414455E-04    2         -15        16   # BR(H+ -> tau+    nu_tau )
     8.42881222E-07    2         -13        14   # BR(H+ -> mu+     nu_mu  )
     1.44112346E-08    2           2        -5   # BR(H+ -> u       bb     )
     5.21977914E-08    2           2        -3   # BR(H+ -> u       sb     )
     1.04006067E-05    2           4        -3   # BR(H+ -> c       sb     )
     9.55976757E-01    2           6        -5   # BR(H+ -> t       bb     )
     3.19791887E-04    2          24        25   # BR(H+ -> W+      h      )
     1.26243077E-12    2          24        36   # BR(H+ -> W+      A      )
     2.17063085E-02    2     1000024   1000022   # BR(H+ -> ~chi_1+ ~chi_10)
     1.47323803E-04    2     1000024   1000023   # BR(H+ -> ~chi_1+ ~chi_20)
     2.15978278E-02    2     1000024   1000025   # BR(H+ -> ~chi_1+ ~chi_30)
