#
#                              ======================
#                              | THE SUSYHIT OUTPUT |
#                              ======================
#
#
#              ------------------------------------------------------
#              |     This is the output of the SUSY-HIT package     |
#              |  created by A.Djouadi, M.Muehlleitner and M.Spira. |
#              |  In case of problems with SUSY-HIT email to        |
#              |           margarete.muehlleitner@cern.ch           |
#              |           michael.spira@psi.ch                     |
#              |           abdelhak.djouadi@cern.ch                 |
#              ------------------------------------------------------
#
#              ------------------------------------------------------
#              |  SUSY Les Houches Accord - MSSM Spectrum + Decays  |
#              |              based on the decay programs           |
#              |                                                    |
#              |                     SDECAY 1.3b                    |
#              |                                                    |
#              |  Authors: M.Muhlleitner, A.Djouadi and Y.Mambrini  |
#              |  Ref.:    Comput.Phys.Commun.168(2005)46           |
#              |           [hep-ph/0311167]                         |
#              |                                                    |
#              |                     HDECAY 3.4                     |
#              |                                                    |
#              |  By: A.Djouadi,J.Kalinowski,M.Muhlleitner,M.Spira  |
#              |  Ref.:    Comput.Phys.Commun.108(1998)56           |
#              |           [hep-ph/9704448]                         |
#              |                                                    |
#              |                                                    |
#              |  If not stated otherwise all DRbar couplings and   |
#              |  soft SUSY breaking masses are given at the scale  |
#              |  Q=  0.50007391E+04
#              |                                                    |
#              ------------------------------------------------------
#
#
BLOCK DCINFO  # Decay Program information
     1   SDECAY/HDECAY # decay calculator
     2   1.3b  /3.4    # version number
#
BLOCK SPINFO  # Spectrum calculator information
     1    SOFTSUSY    # spectrum calculator                
     2    3.4.0       # version number                     
#
BLOCK MODSEL  # Model selection
     1     0   #  nonUniversal                                     
#
BLOCK SMINPUTS  # Standard Model inputs
         1     1.25778332E+02   # alpha_em^-1(M_Z)^MSbar
         2     1.16570000E-05   # G_F [GeV^-2]
         3     1.17200002E-01   # alpha_S(M_Z)^MSbar
         4     9.11876000E+01   # M_Z pole mass
         5     4.25000000E+00   # mb(mb)^MSbar
         6     1.72500000E+02   # mt pole mass
         7     1.77682000E+00   # mtau pole mass
#
BLOCK MINPAR  # Input parameters - minimal models
         3     1.00000000E+01   # tanb                
#
BLOCK EXTPAR  # Input parameters - non-minimal models
         0    -1.00000000E+00   # Set                 
         1     6.00000000E+01   # M_1(MX)             
         2     3.00000000E+03   # M_2(MX)             
         3     9.46039000E+02   # M_3(MX)             
        11     5.00000000E+03   # At(MX)              
        12     5.00000000E+03   # Ab(MX)              
        13     0.00000000E+00   # Atau(MX)            
        23    -7.65105000E+02   # mu(MX)              
        26     3.00000000E+03   # mA(pole)            
        31     5.00000000E+03   # meL(MX)             
        32     5.00000000E+03   # mmuL(MX)            
        33     5.00000000E+03   # mtauL(MX)           
        34     5.00000000E+03   # meR(MX)             
        35     5.00000000E+03   # mmuR(MX)            
        36     5.00000000E+03   # mtauR(MX)           
        41     5.00000000E+03   # mqL1(MX)            
        42     5.00000000E+03   # mqL2(MX)            
        43     5.00000000E+03   # mqL3(MX)            
        44     5.00000000E+03   # muR(MX)             
        45     5.00000000E+03   # mcR(MX)             
        46     5.00000000E+03   # mtR(MX)             
        47     5.00000000E+03   # mdR(MX)             
        48     5.00000000E+03   # msR(MX)             
        49     5.00000000E+03   # mbR(MX)             
#
BLOCK MASS  # Mass Spectrum
# PDG code           mass       particle
        24     8.00924979E+01   # W+
        25     1.24455075E+02   # h
        35     3.00008242E+03   # H
        36     2.99999727E+03   # A
        37     3.00136240E+03   # H+
         5     4.87878001E+00   # b-quark pole mass calculated from mb(mb)_Msbar
   1000001     5.06470840E+03   # ~d_L
   2000001     5.04686492E+03   # ~d_R
   1000002     5.06423165E+03   # ~u_L
   2000002     5.04657292E+03   # ~u_R
   1000003     5.06470840E+03   # ~s_L
   2000003     5.04686492E+03   # ~s_R
   1000004     5.06423165E+03   # ~c_L
   2000004     5.04657292E+03   # ~c_R
   1000005     5.01089844E+03   # ~b_1
   2000005     5.04530822E+03   # ~b_2
   1000006     4.90133140E+03   # ~t_1
   2000006     5.05629848E+03   # ~t_2
   1000011     5.01908507E+03   # ~e_L
   2000011     5.00593162E+03   # ~e_R
   1000012     5.01813551E+03   # ~nu_eL
   1000013     5.01908507E+03   # ~mu_L
   2000013     5.00593162E+03   # ~mu_R
   1000014     5.01813551E+03   # ~nu_muL
   1000015     5.00468704E+03   # ~tau_1
   2000015     5.01870069E+03   # ~tau_2
   1000016     5.01758695E+03   # ~nu_tauL
   1000021     1.20000045E+03   # ~g
   1000022     6.02872931E+01   # ~chi_10
   1000023     7.99841556E+02   # ~chi_20
   1000025    -8.02075132E+02   # ~chi_30
   1000035     3.07421937E+03   # ~chi_40
   1000024     8.00000973E+02   # ~chi_1+
   1000037     3.07438695E+03   # ~chi_2+
#
BLOCK NMIX  # Neutralino Mixing Matrix
  1  1     9.98451556E-01   # N_11
  1  2     2.07774532E-04   # N_12
  1  3    -5.56048577E-02   # N_13
  1  4     1.59608236E-03   # N_14
  2  1     3.82055585E-02   # N_21
  2  2     2.14580928E-02   # N_22
  2  3     7.06385088E-01   # N_23
  2  4     7.06470094E-01   # N_24
  3  1    -4.04310732E-02   # N_31
  3  2     1.56908372E-02   # N_32
  3  3    -7.05628512E-01   # N_33
  3  4     7.07253512E-01   # N_34
  4  1    -3.93012733E-04   # N_41
  4  2     9.99646590E-01   # N_42
  4  3    -4.07566179E-03   # N_43
  4  4    -2.62665150E-02   # N_44
#
BLOCK UMIX  # Chargino Mixing Matrix U
  1  1     5.77464784E-03   # U_11
  1  2     9.99983327E-01   # U_12
  2  1    -9.99983327E-01   # U_21
  2  2     5.77464784E-03   # U_22
#
BLOCK VMIX  # Chargino Mixing Matrix V
  1  1     3.71747022E-02   # V_11
  1  2    -9.99308782E-01   # V_12
  2  1    -9.99308782E-01   # V_21
  2  2    -3.71747022E-02   # V_22
#
BLOCK STOPMIX  # Stop Mixing Matrix
  1  1    -5.08369133E-01   # cos(theta_t)
  1  2     8.61139260E-01   # sin(theta_t)
  2  1    -8.61139260E-01   # -sin(theta_t)
  2  2    -5.08369133E-01   # cos(theta_t)
#
BLOCK SBOTMIX  # Sbottom Mixing Matrix
  1  1     9.97803641E-01   # cos(theta_b)
  1  2    -6.62411806E-02   # sin(theta_b)
  2  1     6.62411806E-02   # -sin(theta_b)
  2  2     9.97803641E-01   # cos(theta_b)
#
BLOCK STAUMIX  # Stau Mixing Matrix
  1  1    -9.13661703E-02   # cos(theta_tau)
  1  2     9.95817364E-01   # sin(theta_tau)
  2  1    -9.95817364E-01   # -sin(theta_tau)
  2  2    -9.13661703E-02   # cos(theta_tau)
#
BLOCK ALPHA  # Higgs mixing
          -1.05443040E-01   # Mixing angle in the neutral Higgs boson sector
#
BLOCK HMIX Q=  5.00073908E+03  # DRbar Higgs Parameters
         1    -7.78825207E+02   # mu(Q)MSSM           
         2     9.47271968E+00   # tan                 
         3     2.41860782E+02   # higgs               
         4     8.57309262E+06   # mA^2(Q)MSSM         
#
BLOCK GAUGE Q=  5.00073908E+03  # The gauge couplings
     1     3.70864026E-01   # gprime(Q) DRbar
     2     6.32843089E-01   # g(Q) DRbar
     3     1.00597046E+00   # g3(Q) DRbar
#
BLOCK AU Q=  5.00073908E+03  # The trilinear couplings
  1  1     5.00000001E+03   # A_u(Q) DRbar
  2  2     5.00000001E+03   # A_c(Q) DRbar
  3  3     5.00000001E+03   # A_t(Q) DRbar
#
BLOCK AD Q=  5.00073908E+03  # The trilinear couplings
  1  1     5.00000000E+03   # A_d(Q) DRbar
  2  2     5.00000000E+03   # A_s(Q) DRbar
  3  3     5.00000001E+03   # A_b(Q) DRbar
#
BLOCK AE Q=  5.00073908E+03  # The trilinear couplings
  1  1     0.00000000E+00   # A_e(Q) DRbar
  2  2     4.90973071E-08   # A_mu(Q) DRbar
  3  3     4.82459072E-08   # A_tau(Q) DRbar
#
BLOCK Yu Q=  5.00073908E+03  # The Yukawa couplings
  1  1     0.00000000E+00   # y_u(Q) DRbar
  2  2     0.00000000E+00   # y_c(Q) DRbar
  3  3     8.15962432E-01   # y_t(Q) DRbar
#
BLOCK Yd Q=  5.00073908E+03  # The Yukawa couplings
  1  1     0.00000000E+00   # y_d(Q) DRbar
  2  2     0.00000000E+00   # y_s(Q) DRbar
  3  3     1.29542891E-01   # y_b(Q) DRbar
#
BLOCK Ye Q=  5.00073908E+03  # The Yukawa couplings
  1  1     0.00000000E+00   # y_e(Q) DRbar
  2  2     0.00000000E+00   # y_mu(Q) DRbar
  3  3     9.69733973E-02   # y_tau(Q) DRbar
#
BLOCK MSOFT Q=  5.00073908E+03  # The soft SUSY breaking masses at the scale Q
         1     6.00000000E+01   # M_1(Q)              
         2     3.00000000E+03   # M_2(Q)              
         3     9.46039000E+02   # M_3(Q)              
        21     8.10212162E+06   # mH1^2(Q)            
        22    -4.06528187E+04   # mH2^2(Q)            
        31     5.00000000E+03   # meL(Q)              
        32     5.00000000E+03   # mmuL(Q)             
        33     5.00000000E+03   # mtauL(Q)            
        34     5.00000000E+03   # meR(Q)              
        35     5.00000000E+03   # mmuR(Q)             
        36     5.00000000E+03   # mtauR(Q)            
        41     5.00000000E+03   # mqL1(Q)             
        42     5.00000000E+03   # mqL2(Q)             
        43     5.00000000E+03   # mqL3(Q)             
        44     5.00000000E+03   # muR(Q)              
        45     5.00000000E+03   # mcR(Q)              
        46     5.00000000E+03   # mtR(Q)              
        47     5.00000000E+03   # mdR(Q)              
        48     5.00000000E+03   # msR(Q)              
        49     5.00000000E+03   # mbR(Q)              
#
#
#
#                             =================
#                             |The decay table|
#                             =================
#
# - The QCD corrections to the decays gluino -> squark  + quark
#                                     squark -> gaugino + quark_prime
#                                     squark -> squark_prime + Higgs
#                                     squark -> gluino  + quark
#   are included.
#
# - The multi-body decays for the inos, stops and sbottoms are included.
#
# - The loop induced decays for the gluino, neutralinos and stops
#   are included.
#
# - The SUSY decays of the top quark are included.
#
#
#         PDG            Width
DECAY         6     1.40356363E+00   # top decays
#          BR         NDA      ID1       ID2
     1.00000000E+00    2           5        24   # BR(t ->  b    W+)
#
#         PDG            Width
DECAY   1000021     2.40926194E-05   # gluino decays
#          BR         NDA      ID1       ID2
     1.20530834E-05    2     1000022        21   # BR(~g -> ~chi_10 g)
     2.33453544E-02    2     1000023        21   # BR(~g -> ~chi_20 g)
     2.26544153E-02    2     1000025        21   # BR(~g -> ~chi_30 g)
#           BR         NDA      ID1       ID2       ID3
     7.21275852E-02    3     1000022         1        -1   # BR(~g -> ~chi_10 d  db)
     6.79579486E-06    3     1000023         1        -1   # BR(~g -> ~chi_20 d  db)
     4.44923845E-06    3     1000025         1        -1   # BR(~g -> ~chi_30 d  db)
     2.45925826E-01    3     1000022         2        -2   # BR(~g -> ~chi_10 u  ub)
     2.80457260E-05    3     1000023         2        -2   # BR(~g -> ~chi_20 u  ub)
     5.90107021E-06    3     1000025         2        -2   # BR(~g -> ~chi_30 u  ub)
     7.21275852E-02    3     1000022         3        -3   # BR(~g -> ~chi_10 s  sb)
     6.79579486E-06    3     1000023         3        -3   # BR(~g -> ~chi_20 s  sb)
     4.44923845E-06    3     1000025         3        -3   # BR(~g -> ~chi_30 s  sb)
     2.45925826E-01    3     1000022         4        -4   # BR(~g -> ~chi_10 c  cb)
     2.80457260E-05    3     1000023         4        -4   # BR(~g -> ~chi_20 c  cb)
     5.90107021E-06    3     1000025         4        -4   # BR(~g -> ~chi_30 c  cb)
     7.32942785E-02    3     1000022         5        -5   # BR(~g -> ~chi_10 b  bb)
     1.41081899E-03    3     1000023         5        -5   # BR(~g -> ~chi_20 b  bb)
     1.36492946E-03    3     1000025         5        -5   # BR(~g -> ~chi_30 b  bb)
     1.88315116E-01    3     1000022         6        -6   # BR(~g -> ~chi_10 t  tb)
     4.58270553E-03    3     1000023         6        -6   # BR(~g -> ~chi_20 t  tb)
     1.36921792E-03    3     1000025         6        -6   # BR(~g -> ~chi_30 t  tb)
     1.76074459E-05    3     1000024         1        -2   # BR(~g -> ~chi_1+ d  ub)
     1.76074459E-05    3    -1000024         2        -1   # BR(~g -> ~chi_1- u  db)
     1.76074459E-05    3     1000024         3        -4   # BR(~g -> ~chi_1+ s  cb)
     1.76074459E-05    3    -1000024         4        -3   # BR(~g -> ~chi_1- c  sb)
     2.36917378E-02    3     1000024         5        -6   # BR(~g -> ~chi_1+ b  tb)
     2.36917378E-02    3    -1000024         6        -5   # BR(~g -> ~chi_1- t  bb)
#
#         PDG            Width
DECAY   1000006     4.06807939E+02   # stop1 decays
#          BR         NDA      ID1       ID2
     2.16324998E-02    2     1000022         6   # BR(~t_1 -> ~chi_10 t )
     7.69321324E-02    2     1000023         6   # BR(~t_1 -> ~chi_20 t )
     7.36709911E-02    2     1000025         6   # BR(~t_1 -> ~chi_30 t )
     5.13851831E-03    2     1000035         6   # BR(~t_1 -> ~chi_40 t )
     1.11088500E-01    2     1000024         5   # BR(~t_1 -> ~chi_1+ b )
     1.02409066E-02    2     1000037         5   # BR(~t_1 -> ~chi_2+ b )
     7.01296452E-01    2     1000021         6   # BR(~t_1 -> ~g      t )
#
#         PDG            Width
DECAY   2000006     4.08069153E+02   # stop2 decays
#          BR         NDA      ID1       ID2
     8.69913916E-03    2     1000022         6   # BR(~t_2 -> ~chi_10 t )
     7.79412769E-02    2     1000023         6   # BR(~t_2 -> ~chi_20 t )
     8.15331851E-02    2     1000025         6   # BR(~t_2 -> ~chi_30 t )
     1.34796381E-02    2     1000035         6   # BR(~t_2 -> ~chi_40 t )
     4.70051260E-02    2     1000024         5   # BR(~t_2 -> ~chi_1+ b )
     2.68301669E-02    2     1000037         5   # BR(~t_2 -> ~chi_2+ b )
     7.41373826E-01    2     1000021         6   # BR(~t_2 -> ~g      t )
     7.08050362E-04    2     1000006        25   # BR(~t_2 -> ~t_1    h )
     2.42959161E-03    2     1000006        23   # BR(~t_2 -> ~t_1    Z )
#
#         PDG            Width
DECAY   1000005     3.85434181E+02   # sbottom1 decays
#          BR         NDA      ID1       ID2
     2.00957013E-03    2     1000022         5   # BR(~b_1 -> ~chi_10 b )
     2.08691143E-03    2     1000023         5   # BR(~b_1 -> ~chi_20 b )
     2.04929275E-03    2     1000025         5   # BR(~b_1 -> ~chi_30 b )
     1.95038345E-02    2     1000035         5   # BR(~b_1 -> ~chi_40 b )
     1.64177222E-01    2    -1000024         6   # BR(~b_1 -> ~chi_1- t )
     3.91718610E-02    2    -1000037         6   # BR(~b_1 -> ~chi_2- t )
     7.69523727E-01    2     1000021         5   # BR(~b_1 -> ~g      b )
     1.47758051E-03    2     1000006       -24   # BR(~b_1 -> ~t_1    W-)
#
#         PDG            Width
DECAY   2000005     3.05448735E+02   # sbottom2 decays
#          BR         NDA      ID1       ID2
     9.63030837E-03    2     1000022         5   # BR(~b_2 -> ~chi_10 b )
     2.65809225E-03    2     1000023         5   # BR(~b_2 -> ~chi_20 b )
     2.71669116E-03    2     1000025         5   # BR(~b_2 -> ~chi_30 b )
     1.10606485E-04    2     1000035         5   # BR(~b_2 -> ~chi_40 b )
     6.17303846E-03    2    -1000024         6   # BR(~b_2 -> ~chi_1- t )
     2.22126289E-04    2    -1000037         6   # BR(~b_2 -> ~chi_2- t )
     9.78455806E-01    2     1000021         5   # BR(~b_2 -> ~g      b )
     3.33314522E-05    2     1000006       -24   # BR(~b_2 -> ~t_1    W-)
#
#         PDG            Width
DECAY   1000002     3.24429350E+02   # sup_L decays
#          BR         NDA      ID1       ID2
     2.30215547E-03    2     1000022         2   # BR(~u_L -> ~chi_10 u)
     4.80564060E-05    2     1000023         2   # BR(~u_L -> ~chi_20 u)
     3.48812762E-06    2     1000025         2   # BR(~u_L -> ~chi_30 u)
     2.41082301E-02    2     1000035         2   # BR(~u_L -> ~chi_40 u)
     1.58793452E-04    2     1000024         1   # BR(~u_L -> ~chi_1+ d)
     4.81851817E-02    2     1000037         1   # BR(~u_L -> ~chi_2+ d)
     9.25194095E-01    2     1000021         2   # BR(~u_L -> ~g      u)
#
#         PDG            Width
DECAY   2000002     3.10782127E+02   # sup_R decays
#          BR         NDA      ID1       ID2
     3.82358332E-02    2     1000022         2   # BR(~u_R -> ~chi_10 u)
     5.32441578E-05    2     1000023         2   # BR(~u_R -> ~chi_20 u)
     5.96106955E-05    2     1000025         2   # BR(~u_R -> ~chi_30 u)
     2.34787693E-09    2     1000035         2   # BR(~u_R -> ~chi_40 u)
     9.61651310E-01    2     1000021         2   # BR(~u_R -> ~g      u)
#
#         PDG            Width
DECAY   1000001     3.24439103E+02   # sdown_L decays
#          BR         NDA      ID1       ID2
     2.29251428E-03    2     1000022         1   # BR(~d_L -> ~chi_10 d)
     1.12535336E-05    2     1000023         1   # BR(~d_L -> ~chi_20 d)
     3.19620308E-05    2     1000025         1   # BR(~d_L -> ~chi_30 d)
     2.41224494E-02    2     1000035         1   # BR(~d_L -> ~chi_40 d)
     3.83195777E-06    2    -1000024         2   # BR(~d_L -> ~chi_1- u)
     4.82638862E-02    2    -1000037         2   # BR(~d_L -> ~chi_2- u)
     9.25274103E-01    2     1000021         1   # BR(~d_L -> ~g      d)
#
#         PDG            Width
DECAY   2000001     3.01865172E+02   # sdown_R decays
#          BR         NDA      ID1       ID2
     9.84189723E-03    2     1000022         1   # BR(~d_R -> ~chi_10 d)
     1.37051179E-05    2     1000023         1   # BR(~d_R -> ~chi_20 d)
     1.53438738E-05    2     1000025         1   # BR(~d_R -> ~chi_30 d)
     6.04425012E-10    2     1000035         1   # BR(~d_R -> ~chi_40 d)
     9.90129053E-01    2     1000021         1   # BR(~d_R -> ~g      d)
#
#         PDG            Width
DECAY   1000004     3.24429350E+02   # scharm_L decays
#          BR         NDA      ID1       ID2
     2.30215547E-03    2     1000022         4   # BR(~c_L -> ~chi_10 c)
     4.80564060E-05    2     1000023         4   # BR(~c_L -> ~chi_20 c)
     3.48812762E-06    2     1000025         4   # BR(~c_L -> ~chi_30 c)
     2.41082301E-02    2     1000035         4   # BR(~c_L -> ~chi_40 c)
     1.58793452E-04    2     1000024         3   # BR(~c_L -> ~chi_1+ s)
     4.81851817E-02    2     1000037         3   # BR(~c_L -> ~chi_2+ s)
     9.25194095E-01    2     1000021         4   # BR(~c_L -> ~g      c)
#
#         PDG            Width
DECAY   2000004     3.10782127E+02   # scharm_R decays
#          BR         NDA      ID1       ID2
     3.82358332E-02    2     1000022         4   # BR(~c_R -> ~chi_10 c)
     5.32441578E-05    2     1000023         4   # BR(~c_R -> ~chi_20 c)
     5.96106955E-05    2     1000025         4   # BR(~c_R -> ~chi_30 c)
     2.34787693E-09    2     1000035         4   # BR(~c_R -> ~chi_40 c)
     9.61651310E-01    2     1000021         4   # BR(~c_R -> ~g      c)
#
#         PDG            Width
DECAY   1000003     3.24439103E+02   # sstrange_L decays
#          BR         NDA      ID1       ID2
     2.29251428E-03    2     1000022         3   # BR(~s_L -> ~chi_10 s)
     1.12535336E-05    2     1000023         3   # BR(~s_L -> ~chi_20 s)
     3.19620308E-05    2     1000025         3   # BR(~s_L -> ~chi_30 s)
     2.41224494E-02    2     1000035         3   # BR(~s_L -> ~chi_40 s)
     3.83195777E-06    2    -1000024         4   # BR(~s_L -> ~chi_1- c)
     4.82638862E-02    2    -1000037         4   # BR(~s_L -> ~chi_2- c)
     9.25274103E-01    2     1000021         3   # BR(~s_L -> ~g      s)
#
#         PDG            Width
DECAY   2000003     3.01865172E+02   # sstrange_R decays
#          BR         NDA      ID1       ID2
     9.84189723E-03    2     1000022         3   # BR(~s_R -> ~chi_10 s)
     1.37051179E-05    2     1000023         3   # BR(~s_R -> ~chi_20 s)
     1.53438738E-05    2     1000025         3   # BR(~s_R -> ~chi_30 s)
     6.04425012E-10    2     1000035         3   # BR(~s_R -> ~chi_40 s)
     9.90129053E-01    2     1000021         3   # BR(~s_R -> ~g      s)
#
#         PDG            Width
DECAY   1000011     3.02948867E+01   # selectron_L decays
#          BR         NDA      ID1       ID2
     2.26059018E-01    2     1000022        11   # BR(~e_L -> ~chi_10 e-)
     1.20530381E-03    2     1000023        11   # BR(~e_L -> ~chi_20 e-)
     4.01397393E-05    2     1000025        11   # BR(~e_L -> ~chi_30 e-)
     2.57378966E-01    2     1000035        11   # BR(~e_L -> ~chi_40 e-)
     4.18096138E-05    2    -1000024        12   # BR(~e_L -> ~chi_1- nu_e)
     5.15274762E-01    2    -1000037        12   # BR(~e_L -> ~chi_2- nu_e)
#
#         PDG            Width
DECAY   2000011     2.73829901E+01   # selectron_R decays
#          BR         NDA      ID1       ID2
     9.97060724E-01    2     1000022        11   # BR(~e_R -> ~chi_10 e-)
     1.38670576E-03    2     1000023        11   # BR(~e_R -> ~chi_20 e-)
     1.55251025E-03    2     1000025        11   # BR(~e_R -> ~chi_30 e-)
     5.99502517E-08    2     1000035        11   # BR(~e_R -> ~chi_40 e-)
#
#         PDG            Width
DECAY   1000013     3.02948867E+01   # smuon_L decays
#          BR         NDA      ID1       ID2
     2.26059018E-01    2     1000022        13   # BR(~mu_L -> ~chi_10 mu-)
     1.20530381E-03    2     1000023        13   # BR(~mu_L -> ~chi_20 mu-)
     4.01397393E-05    2     1000025        13   # BR(~mu_L -> ~chi_30 mu-)
     2.57378966E-01    2     1000035        13   # BR(~mu_L -> ~chi_40 mu-)
     4.18096138E-05    2    -1000024        14   # BR(~mu_L -> ~chi_1- nu_mu)
     5.15274762E-01    2    -1000037        14   # BR(~mu_L -> ~chi_2- nu_mu)
#
#         PDG            Width
DECAY   2000013     2.73829901E+01   # smuon_R decays
#          BR         NDA      ID1       ID2
     9.97060724E-01    2     1000022        13   # BR(~mu_R -> ~chi_10 mu-)
     1.38670576E-03    2     1000023        13   # BR(~mu_R -> ~chi_20 mu-)
     1.55251025E-03    2     1000025        13   # BR(~mu_R -> ~chi_30 mu-)
     5.99502517E-08    2     1000035        13   # BR(~mu_R -> ~chi_40 mu-)
#
#         PDG            Width
DECAY   1000015     2.91758429E+01   # stau_1 decays
#          BR         NDA      ID1       ID2
     9.30677224E-01    2     1000022        15   # BR(~tau_1 -> ~chi_10  tau-)
     1.64885370E-02    2     1000023        15   # BR(~tau_1 -> ~chi_20  tau-)
     1.59031624E-02    2     1000025        15   # BR(~tau_1 -> ~chi_30  tau-)
     2.16688053E-03    2     1000035        15   # BR(~tau_1 -> ~chi_40  tau-)
     3.04262974E-02    2    -1000024        16   # BR(~tau_1 -> ~chi_1-  nu_tau)
     4.33789859E-03    2    -1000037        16   # BR(~tau_1 -> ~chi_2-  nu_tau)
#
#         PDG            Width
DECAY   2000015     3.11572095E+01   # stau_2 decays
#          BR         NDA      ID1       ID2
     2.24555547E-01    2     1000022        15   # BR(~tau_2 -> ~chi_10  tau-)
     1.54712375E-02    2     1000023        15   # BR(~tau_2 -> ~chi_20  tau-)
     1.49657846E-02    2     1000025        15   # BR(~tau_2 -> ~chi_30  tau-)
     2.48141856E-01    2     1000035        15   # BR(~tau_2 -> ~chi_40  tau-)
     8.29617311E-05    2    -1000024        16   # BR(~tau_2 -> ~chi_1-  nu_tau)
     4.96782614E-01    2    -1000037        16   # BR(~tau_2 -> ~chi_2-  nu_tau)
#
#         PDG            Width
DECAY   1000012     3.02978964E+01   # snu_eL decays
#          BR         NDA      ID1       ID2
     2.25673003E-01    2     1000022        12   # BR(~nu_eL -> ~chi_10 nu_e)
     5.43737282E-07    2     1000023        12   # BR(~nu_eL -> ~chi_20 nu_e)
     9.71843664E-04    2     1000025        12   # BR(~nu_eL -> ~chi_30 nu_e)
     2.57424909E-01    2     1000035        12   # BR(~nu_eL -> ~chi_40 nu_e)
     1.73215303E-03    2     1000024        11   # BR(~nu_eL -> ~chi_1+ e-)
     5.14197548E-01    2     1000037        11   # BR(~nu_eL -> ~chi_2+ e-)
#
#         PDG            Width
DECAY   1000014     3.02978964E+01   # snu_muL decays
#          BR         NDA      ID1       ID2
     2.25673003E-01    2     1000022        14   # BR(~nu_muL -> ~chi_10 nu_mu)
     5.43737282E-07    2     1000023        14   # BR(~nu_muL -> ~chi_20 nu_mu)
     9.71843664E-04    2     1000025        14   # BR(~nu_muL -> ~chi_30 nu_mu)
     2.57424909E-01    2     1000035        14   # BR(~nu_muL -> ~chi_40 nu_mu)
     1.73215303E-03    2     1000024        13   # BR(~nu_muL -> ~chi_1+ mu-)
     5.14197548E-01    2     1000037        13   # BR(~nu_muL -> ~chi_2+ mu-)
#
#         PDG            Width
DECAY   1000016     3.11800325E+01   # snu_tauL decays
#          BR         NDA      ID1       ID2
     2.19264345E-01    2     1000022        16   # BR(~nu_tauL -> ~chi_10 nu_tau)
     5.28290251E-07    2     1000023        16   # BR(~nu_tauL -> ~chi_20 nu_tau)
     9.44234498E-04    2     1000025        16   # BR(~nu_tauL -> ~chi_30 nu_tau)
     2.50048866E-01    2     1000035        16   # BR(~nu_tauL -> ~chi_40 nu_tau)
     3.02784442E-02    2     1000024        15   # BR(~nu_tauL -> ~chi_1+ tau-)
     4.99463583E-01    2     1000037        15   # BR(~nu_tauL -> ~chi_2+ tau-)
#
#         PDG            Width
DECAY   1000024     4.83567685E-01   # chargino1+ decays
#          BR         NDA      ID1       ID2
     1.00000000E+00    2     1000022        24   # BR(~chi_1+ -> ~chi_10  W+)
#
#         PDG            Width
DECAY   1000037     2.11248805E+01   # chargino2+ decays
#          BR         NDA      ID1       ID2
     2.53373527E-01    2     1000024        23   # BR(~chi_2+ -> ~chi_1+  Z )
     1.84739671E-04    2     1000022        24   # BR(~chi_2+ -> ~chi_10  W+)
     2.44435923E-01    2     1000023        24   # BR(~chi_2+ -> ~chi_20  W+)
     2.44252631E-01    2     1000025        24   # BR(~chi_2+ -> ~chi_30  W+)
     2.57751256E-01    2     1000024        25   # BR(~chi_2+ -> ~chi_1+  h )
     1.92393957E-06    2     1000022        37   # BR(~chi_2+ -> ~chi_10  H+)
#
#         PDG            Width
DECAY   1000022     0.00000000E+00   # neutralino1 decays
#
#         PDG            Width
DECAY   1000023     5.01911325E-01   # neutralino2 decays
#          BR         NDA      ID1       ID2
     5.29392826E-01    2     1000022        23   # BR(~chi_20 -> ~chi_10   Z )
     4.70607174E-01    2     1000022        25   # BR(~chi_20 -> ~chi_10   h )
#
#         PDG            Width
DECAY   1000025     5.01712146E-01   # neutralino3 decays
#          BR         NDA      ID1       ID2
     4.69547871E-01    2     1000022        23   # BR(~chi_30 -> ~chi_10   Z )
     5.30452129E-01    2     1000022        25   # BR(~chi_30 -> ~chi_10   h )
#
#         PDG            Width
DECAY   1000035     2.11406332E+01   # neutralino4 decays
#          BR         NDA      ID1       ID2
     3.18629166E-05    2     1000022        23   # BR(~chi_40 -> ~chi_10   Z )
     8.82284182E-02    2     1000023        23   # BR(~chi_40 -> ~chi_20   Z )
     1.64485121E-01    2     1000025        23   # BR(~chi_40 -> ~chi_30   Z )
     2.44973217E-01    2     1000024       -24   # BR(~chi_40 -> ~chi_1+   W-)
     2.44973217E-01    2    -1000024        24   # BR(~chi_40 -> ~chi_1-   W+)
     1.51437516E-04    2     1000022        25   # BR(~chi_40 -> ~chi_10   h )
     1.83252053E-06    2     1000022        35   # BR(~chi_40 -> ~chi_10   H )
     2.13834265E-07    2     1000022        36   # BR(~chi_40 -> ~chi_10   A )
     1.68694574E-01    2     1000023        25   # BR(~chi_40 -> ~chi_20   h )
     8.84601055E-02    2     1000025        25   # BR(~chi_40 -> ~chi_30   h )
#
#         PDG            Width
DECAY        25     4.03449664E-03   # h decays
#          BR         NDA      ID1       ID2
     6.14833619E-01    2           5        -5   # BR(h -> b       bb     )
     6.41252261E-02    2         -15        15   # BR(h -> tau+    tau-   )
     2.27028027E-04    2         -13        13   # BR(h -> mu+     mu-    )
     4.81525535E-04    2           3        -3   # BR(h -> s       sb     )
     2.08650660E-02    2           4        -4   # BR(h -> c       cb     )
     6.71262198E-02    2          21        21   # BR(h -> g       g      )
     2.30041690E-03    2          22        22   # BR(h -> gam     gam    )
     1.45662495E-03    2          22        23   # BR(h -> Z       gam    )
     2.04312872E-01    2          24       -24   # BR(h -> W+      W-     )
     2.42069126E-02    2          23        23   # BR(h -> Z       Z      )
     6.44886154E-05    2     1000022   1000022   # BR(h -> ~chi_10 ~chi_10)
#
#         PDG            Width
DECAY        35     8.36785211E+00   # H decays
#          BR         NDA      ID1       ID2
     3.84134835E-01    2           5        -5   # BR(H -> b       bb     )
     6.66180632E-02    2         -15        15   # BR(H -> tau+    tau-   )
     2.35566763E-04    2         -13        13   # BR(H -> mu+     mu-    )
     2.88768788E-04    2           3        -3   # BR(H -> s       sb     )
     1.61334736E-06    2           4        -4   # BR(H -> c       cb     )
     1.61186180E-01    2           6        -6   # BR(H -> t       tb     )
     5.35599663E-05    2          21        21   # BR(H -> g       g      )
     2.09388344E-07    2          22        22   # BR(H -> gam     gam    )
     9.50784536E-08    2          23        22   # BR(H -> Z       gam    )
     7.47242218E-05    2          24       -24   # BR(H -> W+      W-     )
     3.73148091E-05    2          23        23   # BR(H -> Z       Z      )
     2.76791905E-04    2          25        25   # BR(H -> h       h      )
    -4.05952600E-23    2          36        36   # BR(H -> A       A      )
     7.68610914E-19    2          23        36   # BR(H -> Z       A      )
     2.57852090E-03    2     1000024  -1000024   # BR(H -> ~chi_1+ ~chi_1-)
     2.69937527E-03    2     1000022   1000022   # BR(H -> ~chi_10 ~chi_10)
     4.85045111E-07    2     1000023   1000023   # BR(H -> ~chi_20 ~chi_20)
     1.01800935E-03    2     1000025   1000025   # BR(H -> ~chi_30 ~chi_30)
     2.28961834E-01    2     1000022   1000023   # BR(H -> ~chi_10 ~chi_20)
     1.50771131E-01    2     1000022   1000025   # BR(H -> ~chi_10 ~chi_30)
     1.06292234E-03    2     1000023   1000025   # BR(H -> ~chi_20 ~chi_30)
#
#         PDG            Width
DECAY        36     8.37981193E+00   # A decays
#          BR         NDA      ID1       ID2
     3.83716954E-01    2           5        -5   # BR(A -> b       bb     )
     6.65249347E-02    2         -15        15   # BR(A -> tau+    tau-   )
     2.35237124E-04    2         -13        13   # BR(A -> mu+     mu-    )
     2.88575355E-04    2           3        -3   # BR(A -> s       sb     )
     1.61761494E-06    2           4        -4   # BR(A -> c       cb     )
     1.61523375E-01    2           6        -6   # BR(A -> t       tb     )
     1.59882889E-04    2          21        21   # BR(A -> g       g      )
     5.95913807E-07    2          22        22   # BR(A -> gam     gam    )
     1.93494548E-07    2          23        22   # BR(A -> Z       gam    )
     7.43372625E-05    2          23        25   # BR(A -> Z       h      )
     3.36976074E-03    2     1000024  -1000024   # BR(A -> ~chi_1+ ~chi_1-)
     2.73292595E-03    2     1000022   1000022   # BR(A -> ~chi_10 ~chi_10)
     4.42731810E-07    2     1000023   1000023   # BR(A -> ~chi_20 ~chi_20)
     2.17844222E-03    2     1000025   1000025   # BR(A -> ~chi_30 ~chi_30)
     1.53068760E-01    2     1000022   1000023   # BR(A -> ~chi_10 ~chi_20)
     2.25635136E-01    2     1000022   1000025   # BR(A -> ~chi_10 ~chi_30)
     4.88828534E-04    2     1000023   1000025   # BR(A -> ~chi_20 ~chi_30)
#
#         PDG            Width
DECAY        37     8.31939973E+00   # H+ decays
#          BR         NDA      ID1       ID2
     6.15104210E-04    2           4        -5   # BR(H+ -> c       bb     )
     6.70385042E-02    2         -15        16   # BR(H+ -> tau+    nu_tau )
     2.37053144E-04    2         -13        14   # BR(H+ -> mu+     nu_mu  )
     3.93664640E-06    2           2        -5   # BR(H+ -> u       bb     )
     1.39094910E-05    2           2        -3   # BR(H+ -> u       sb     )
     2.87647229E-04    2           4        -3   # BR(H+ -> c       sb     )
     5.43766071E-01    2           6        -5   # BR(H+ -> t       bb     )
     7.50276313E-05    2          24        25   # BR(H+ -> W+      h      )
     7.48854509E-13    2          24        36   # BR(H+ -> W+      A      )
     3.86494787E-01    2     1000024   1000022   # BR(H+ -> ~chi_1+ ~chi_10)
     1.44375870E-03    2     1000024   1000023   # BR(H+ -> ~chi_1+ ~chi_20)
     2.42000744E-05    2     1000024   1000025   # BR(H+ -> ~chi_1+ ~chi_30)
