# SUSY Les Houches Accord 2 - MSSM spectrum + Decays
# SPheno v3.1.12 
# W. Porod, Comput. Phys. Commun. 153 (2003) 275-315, hep-ph/0301101
# in case of problems send email to porod@physik.uni-wuerzburg.de
# Created: 09.12.2016,  15:23
Block SPINFO         # Program information
     1   SPheno      # spectrum calculator
     2   v3.1.12     # version number
#
Block SPhenoINFO     # SPheno specific information
    1      2         # using 2-loop RGEs
    2      1         # using running masses for boundary conditions at mZ
Block MODSEL  # Model selection
    1    2    # mGMSB model
Block MINPAR  # Input parameters
    1    1.50000000E+05  # Lambda, scale of SUSY breaking
    2    2.50000000E+05  # M_M, messenger mass scale
    3    3.00000000E+01  # tanb at m_Z   
    4    1.00000000E+00  # Sign(mu)
    5    3.00000000E+00  # N_5 number of effective five-plets
    6    1.00000000E+00  # c_grav, Gravitino mass factor
Block gauge Q=  2.50000000E+05  # (GMSB scale)
   1    4.92911087E-01  # g'(Q)^DRbar
   2    6.46256381E-01  # g(Q)^DRbar
   3    9.31906053E-01  # g3(Q)^DRbar
Block SMINPUTS  # SM parameters
         1     1.27932492E+02  # alpha_em^-1(MZ)^MSbar
         2     1.16639000E-05  # G_mu [GeV^-2]
         3     1.17200000E-01  # alpha_s(MZ)^MSbar
         4     9.11876000E+01  # m_Z(pole)
         5     4.20000000E+00  # m_b(m_b), MSbar
         6     1.72500000E+02  # m_t(pole)
         7     1.77700000E+00  # m_tau(pole)
         8     0.00000000E+00  # m_nu_3
        11     5.10998910E-04  # m_e(pole)
        12     0.00000000E+00  # m_nu_1
        13     1.05658000E-01  # m_muon(pole)
        14     0.00000000E+00  # m_nu_2
        21     5.00000000E-03  # m_d(2 GeV), MSbar
        22     3.00000000E-03  # m_u(2 GeV), MSbar
        23     1.05000000E-01  # m_s(2 GeV), MSbar
        24     1.27000000E+00  # m_c(m_c), MSbar
Block gauge Q=  2.81621362E+03  # (SUSY scale)
   1    3.65277436E-01  # g'(Q)^DRbar
   2    6.37393450E-01  # g(Q)^DRbar
   3    1.00698816E+00  # g3(Q)^DRbar
Block Yu Q=  2.81621362E+03  # (SUSY scale)
  1  1     8.28169745E-06   # Y_u(Q)^DRbar
  2  2     3.50591947E-03   # Y_c(Q)^DRbar
  3  3     8.33303408E-01   # Y_t(Q)^DRbar
Block Yd Q=  2.81621362E+03  # (SUSY scale)
  1  1     3.63009679E-04   # Y_d(Q)^DRbar
  2  2     7.62320067E-03   # Y_s(Q)^DRbar
  3  3     3.63563979E-01   # Y_b(Q)^DRbar
Block Ye Q=  2.81621362E+03  # (SUSY scale)
  1  1     8.96681041E-05   # Y_e(Q)^DRbar
  2  2     1.85405323E-02   # Y_mu(Q)^DRbar
  3  3     3.12179029E-01   # Y_tau(Q)^DRbar
Block Au Q=  2.81621362E+03  # (SUSY scale)
  1  1    -8.49418712E+02   # A_u(Q)^DRbar
  2  2    -8.49416662E+02   # A_c(Q)^DRbar
  3  3    -8.02304857E+02   # A_t(Q)^DRbar
Block Ad Q=  2.81621362E+03  # (SUSY scale)
  1  1    -8.90812806E+02   # A_d(Q)^DRbar
  2  2    -8.90808704E+02   # A_s(Q)^DRbar
  3  3    -8.67706074E+02   # A_b(Q)^DRbar
Block Ae Q=  2.81621362E+03  # (SUSY scale)
  1  1    -9.21951478E+01   # A_e(Q)^DRbar
  2  2    -9.21920441E+01   # A_mu(Q)^DRbar
  3  3    -9.13164615E+01   # A_tau(Q)^DRbar
Block MSOFT Q=  2.81621362E+03  # soft SUSY breaking masses at Q
   1    6.74594091E+02  # M_1
   2    1.22864940E+03  # M_2
   3    3.07916420E+03  # M_3
  21    5.54832580E+05  # M^2_(H,d)
  22   -7.03027792E+05  # M^2_(H,u)
  31    9.30794726E+02  # M_(L,11)
  32    9.30777902E+02  # M_(L,22)
  33    9.26024934E+02  # M_(L,33)
  34    4.53096221E+02  # M_(E,11)
  35    4.53025785E+02  # M_(E,22)
  36    4.32692532E+02  # M_(E,33)
  41    2.92802998E+03  # M_(Q,11)
  42    2.92802142E+03  # M_(Q,22)
  43    2.82870308E+03  # M_(Q,33)
  44    2.80574422E+03  # M_(U,11)
  45    2.80574112E+03  # M_(U,22)
  46    2.62712767E+03  # M_(U,33)
  47    2.79376167E+03  # M_(D,11)
  48    2.79374667E+03  # M_(D,22)
  49    2.75970452E+03  # M_(D,33)
Block MASS  # Mass spectrum
#   PDG code      mass          particle
         6     1.72500000E+02  # m_t(pole)
        23     9.11876000E+01  # m_Z(pole)
        24     8.03126351E+01  # W+
        15     1.77700000E+00  # m_tau(pole)
        25     1.21063097E+02  # h0
        35     1.19129730E+03  # H0
        36     1.19124655E+03  # A0
        37     1.19441908E+03  # H+
   1000001     3.04843696E+03  # ~d_L
   2000001     2.90683570E+03  # ~d_R
   1000002     3.04738493E+03  # ~u_L
   2000002     2.91809821E+03  # ~u_R
   1000003     3.04842672E+03  # ~s_L
   2000003     2.90681693E+03  # ~s_R
   1000004     3.04737453E+03  # ~c_L
   2000004     2.91809446E+03  # ~c_R
   1000005     2.86300689E+03  # ~b_1
   2000005     2.92880711E+03  # ~b_2
   1000006     2.70437588E+03  # ~t_1
   2000006     2.93267718E+03  # ~t_2
   1000011     9.52038013E+02  # ~e_L-
   2000011     4.71036219E+02  # ~e_R-
   1000012     9.48297989E+02  # ~nu_eL
   1000013     9.52021093E+02  # ~mu_L-
   2000013     4.70932636E+02  # ~mu_R-
   1000014     9.48273735E+02  # ~nu_muL
   1000015     4.40968278E+02  # ~tau_1-
   2000015     9.47228430E+02  # ~tau_2-
   1000016     9.41459141E+02  # ~nu_tauL
   1000021     3.22253754E+03  # ~g
   1000022     6.56447112E+02  # ~chi_10
   1000023     9.37768515E+02  # ~chi_20
   1000025    -9.45836335E+02  # ~chi_30
   1000035     1.26565257E+03  # ~chi_40
   1000024     9.35348960E+02  # ~chi_1+
   1000037     1.26584056E+03  # ~chi_2+
   1000039     9.00000000E-09  # ~G
# Higgs mixing
Block alpha # Effective Higgs mixing angle
          -3.51682929E-02   # alpha
Block Hmix Q=  2.81621362E+03  # Higgs mixing parameters
   1    9.32846272E+02  # mu
   2    2.88879643E+01  # tan[beta](Q)
   3    2.43446011E+02  # v(Q)
   4    1.25288215E+06  # m^2_A(Q)
Block stopmix # stop mixing matrix
   1  1     1.14285714E-01   # Re[R_st(1,1)]
   1  2     9.93447923E-01   # Re[R_st(1,2)]
   2  1    -9.93447923E-01   # Re[R_st(2,1)]
   2  2     1.14285714E-01   # Re[R_st(2,2)]
Block sbotmix # sbottom mixing matrix
   1  1     1.71232484E-01   # Re[R_sb(1,1)]
   1  2     9.85230651E-01   # Re[R_sb(1,2)]
   2  1    -9.85230651E-01   # Re[R_sb(2,1)]
   2  2     1.71232484E-01   # Re[R_sb(2,2)]
Block staumix # stau mixing matrix
   1  1     7.31547860E-02   # Re[R_sta(1,1)]
   1  2     9.97320599E-01   # Re[R_sta(1,2)]
   2  1    -9.97320599E-01   # Re[R_sta(2,1)]
   2  2     7.31547860E-02   # Re[R_sta(2,2)]
Block Nmix # neutralino mixing matrix
   1  1    -9.93100754E-01   # Re[N(1,1)]
   1  2     9.28288360E-03   # Re[N(1,2)]
   1  3    -9.50172626E-02   # Re[N(1,3)]
   1  4     6.80914127E-02   # Re[N(1,4)]
   2  1    -1.15247475E-01   # Re[N(2,1)]
   2  2    -1.75587653E-01   # Re[N(2,2)]
   2  3     6.93571173E-01   # Re[N(2,3)]
   2  4    -6.89090723E-01   # Re[N(2,4)]
   3  1    -1.88109312E-02   # Re[N(3,1)]
   3  2     2.45040803E-02   # Re[N(3,2)]
   3  3     7.06022566E-01   # Re[N(3,3)]
   3  4     7.07515254E-01   # Re[N(3,4)]
   4  1    -1.07266431E-02   # Re[N(4,1)]
   4  2     9.84115011E-01   # Re[N(4,2)]
   4  3     1.07064859E-01   # Re[N(4,3)]
   4  4    -1.41208006E-01   # Re[N(4,4)]
Block Umix # chargino mixing matrix
   1  1    -1.51543265E-01   # Re[U(1,1)]
   1  2     9.88450625E-01   # Re[U(1,2)]
   2  1     9.88450625E-01   # Re[U(2,1)]
   2  2     1.51543265E-01   # Re[U(2,2)]
Block Vmix # chargino mixing matrix
   1  1    -1.99763200E-01   # Re[V(1,1)]
   1  2     9.79844204E-01   # Re[V(1,2)]
   2  1     9.79844204E-01   # Re[V(2,1)]
   2  2     1.99763200E-01   # Re[V(2,2)]
DECAY   2000011     1.08168437E-08   # ~e^-_R
#    BR                NDA      ID1      ID2
     3.03276367E-02    2     1000039        11   # BR(~e^-_R -> ~G e^-)
#    BR                NDA      ID1      ID2       ID3
     1.92207674E-01    3     1000015        11       -15   # BR(~e^-_R -> ~tau^-_1 e^- tau^+)
     7.77464690E-01    3    -1000015        11        15   # BR(~e^-_R -> ~tau^+_1 e^- tau^-)
DECAY   1000011     3.32231819E-01   # ~e^-_L
#    BR                NDA      ID1      ID2
     9.98758369E-01    2     1000022        11   # BR(~e^-_L -> chi^0_1 e^-)
     5.98519631E-04    2     1000023        11   # BR(~e^-_L -> chi^0_2 e^-)
     3.67845707E-07    2     1000025        11   # BR(~e^-_L -> chi^0_3 e^-)
     6.42391533E-04    2    -1000024        12   # BR(~e^-_L -> chi^-_1 nu_e)
     1.58025443E-07    2     2000011        23   # BR(~e^-_L -> ~e^-_R Z)
     1.61115036E-07    2     2000011        25   # BR(~e^-_L -> ~e^-_R h^0)
     3.33041100E-08    2     1000039        11   # BR(~e^-_L -> ~G e^-)
DECAY   2000013     1.06413366E-08   # ~mu^-_R
#    BR                NDA      ID1      ID2
     3.07939418E-02    2     1000039        13   # BR(~mu^-_R -> ~G mu^-)
#    BR                NDA      ID1      ID2       ID3
     1.91986283E-01    3     1000015        13       -15   # BR(~mu^-_R -> ~tau^-_1 mu^- tau^+)
     7.77219775E-01    3    -1000015        13        15   # BR(~mu^-_R -> ~tau^+_1 mu^- tau^-)
DECAY   1000013     3.36754686E-01   # ~mu^-_L
#    BR                NDA      ID1      ID2
     9.85308044E-01    2     1000022        13   # BR(~mu^-_L -> chi^0_1 mu^-)
     5.95965361E-04    2     1000023        13   # BR(~mu^-_L -> chi^0_2 mu^-)
     1.96812628E-06    2     1000025        13   # BR(~mu^-_L -> chi^0_3 mu^-)
     6.31419381E-04    2    -1000024        14   # BR(~mu^-_L -> chi^-_1 nu_mu)
     6.66635601E-03    2     2000013        23   # BR(~mu^-_L -> ~mu^-_R Z)
     6.79621454E-03    2     2000013        25   # BR(~mu^-_L -> ~mu^-_R h^0)
     3.28538896E-08    2     1000039        13   # BR(~mu^-_L -> ~G mu^-)
DECAY   1000015     2.35871866E-10   # ~tau^-_1
#    BR                NDA      ID1      ID2
     1.00000000E+00    2     1000039        15   # BR(~tau^-_1 -> ~G tau^-)
DECAY   2000015     1.65611090E+00   # ~tau^-_2
#    BR                NDA      ID1      ID2
     1.98137290E-01    2     1000022        15   # BR(~tau^-_2 -> chi^0_1 tau^-)
     2.18453136E-04    2     1000023        15   # BR(~tau^-_2 -> chi^0_2 tau^-)
     3.84610370E-05    2    -1000024        16   # BR(~tau^-_2 -> chi^-_1 nu_tau)
     4.00703238E-01    2     1000015        23   # BR(~tau^-_2 -> ~tau^-_1 Z)
     4.00902551E-01    2     1000015        25   # BR(~tau^-_2 -> ~tau^-_1 h^0)
     6.51396921E-09    2     1000039        15   # BR(~tau^-_2 -> ~G tau^-)
DECAY   1000012     3.48012106E-01   # ~nu_e
#    BR                NDA      ID1      ID2
     9.99288289E-01    2     1000022        12   # BR(~nu_e -> chi^0_1 nu_e)
     6.44424819E-05    2     1000023        12   # BR(~nu_e -> chi^0_2 nu_e)
     3.68573121E-07    2     1000025        12   # BR(~nu_e -> chi^0_3 nu_e)
     6.46578188E-04    2     1000024        11   # BR(~nu_e -> chi^+_1 e^-)
     2.90953317E-07    2     2000011        24   # BR(~nu_e -> ~e^-_R W^+)
     3.11743499E-08    2     1000039        12   # BR(~nu_e -> ~G nu_e)
DECAY   1000014     3.52303103E-01   # ~nu_mu
#    BR                NDA      ID1      ID2
     9.86998949E-01    2     1000022        14   # BR(~nu_mu -> chi^0_1 nu_mu)
     6.33678915E-05    2     1000023        14   # BR(~nu_mu -> chi^0_2 nu_mu)
     3.56963149E-07    2     1000025        14   # BR(~nu_mu -> chi^0_3 nu_mu)
     6.48018204E-04    2     1000024        13   # BR(~nu_mu -> chi^+_1 mu^-)
     1.22892774E-02    2     2000013        24   # BR(~nu_mu -> ~mu^-_R W^+)
     3.07907133E-08    2     1000039        14   # BR(~nu_mu -> ~G nu_mu)
DECAY   1000016     1.60967237E+00   # ~nu_tau
#    BR                NDA      ID1      ID2
     2.08772153E-01    2     1000022        16   # BR(~nu_tau -> chi^0_1 nu_tau)
     1.73656366E-06    2     1000023        16   # BR(~nu_tau -> chi^0_2 nu_tau)
     1.65150872E-04    2     1000024        15   # BR(~nu_tau -> chi^+_1 tau^-)
     7.91060953E-01    2     1000015        24   # BR(~nu_tau -> ~tau^-_1 W^+)
     6.50036140E-09    2     1000039        16   # BR(~nu_tau -> ~G nu_tau)
DECAY   2000001     1.54192528E+00   # ~d_R
#    BR                NDA      ID1      ID2
     9.87735854E-01    2     1000022         1   # BR(~d_R -> chi^0_1 d)
     1.18576261E-02    2     1000023         1   # BR(~d_R -> chi^0_2 d)
     3.16535975E-04    2     1000025         1   # BR(~d_R -> chi^0_3 d)
     8.40373698E-05    2     1000035         1   # BR(~d_R -> chi^0_4 d)
     4.04096454E-06    2    -1000024         2   # BR(~d_R -> chi^-_1 u)
     1.25374379E-09    2    -1000037         2   # BR(~d_R -> chi^-_2 u)
     1.90417434E-06    2     1000039         1   # BR(~d_R -> ~G d)
DECAY   1000001     2.58477207E+01   # ~d_L
#    BR                NDA      ID1      ID2
     1.71632240E-02    2     1000022         1   # BR(~d_L -> chi^0_1 d)
     9.21408572E-03    2     1000023         1   # BR(~d_L -> chi^0_2 d)
     3.07442917E-04    2     1000025         1   # BR(~d_L -> chi^0_3 d)
     3.17494173E-01    2     1000035         1   # BR(~d_L -> chi^0_4 d)
     1.79635273E-02    2    -1000024         2   # BR(~d_L -> chi^-_1 u)
     6.37857402E-01    2    -1000037         2   # BR(~d_L -> chi^-_2 u)
     8.48849695E-13    2     2000002       -24   # BR(~d_L -> ~u_R W^-)
     6.83345367E-10    2     2000001        23   # BR(~d_L -> ~d_R Z)
     7.16651203E-10    2     2000001        25   # BR(~d_L -> ~d_R h^0)
     1.44089206E-07    2     1000039         1   # BR(~d_L -> ~G d)
DECAY   2000003     1.54736889E+00   # ~s_R
#    BR                NDA      ID1      ID2
     9.84289164E-01    2     1000022         3   # BR(~s_R -> chi^0_1 s)
     1.26779281E-02    2     1000023         3   # BR(~s_R -> chi^0_2 s)
     1.17078712E-03    2     1000025         3   # BR(~s_R -> chi^0_3 s)
     8.39030458E-05    2     1000035         3   # BR(~s_R -> chi^0_4 s)
     1.77576905E-03    2    -1000024         4   # BR(~s_R -> chi^-_1 c)
     5.51370574E-07    2    -1000037         4   # BR(~s_R -> chi^-_2 c)
     1.89741421E-06    2     1000039         3   # BR(~s_R -> ~G s)
DECAY   1000003     2.58509695E+01   # ~s_L
#    BR                NDA      ID1      ID2
     1.71609443E-02    2     1000022         3   # BR(~s_L -> chi^0_1 s)
     9.26486608E-03    2     1000023         3   # BR(~s_L -> chi^0_2 s)
     3.63295775E-04    2     1000025         3   # BR(~s_L -> chi^0_3 s)
     3.17454482E-01    2     1000035         3   # BR(~s_L -> chi^0_4 s)
     1.79790268E-02    2    -1000024         4   # BR(~s_L -> chi^-_1 c)
     6.37776472E-01    2    -1000037         4   # BR(~s_L -> chi^-_2 c)
     1.52083279E-07    2     2000004       -24   # BR(~s_L -> ~c_R W^-)
     3.01375063E-07    2     2000003        23   # BR(~s_L -> ~s_R Z)
     3.16072590E-07    2     2000003        25   # BR(~s_L -> ~s_R h^0)
     1.44068677E-07    2     1000039         3   # BR(~s_L -> ~G s)
DECAY   1000005     1.47554351E+01   # ~b_1
#    BR                NDA      ID1      ID2
     1.13790613E-01    2     1000022         5   # BR(~b_1 -> chi^0_1 b)
     2.10087683E-01    2     1000023         5   # BR(~b_1 -> chi^0_2 b)
     1.97738080E-01    2     1000025         5   # BR(~b_1 -> chi^0_3 b)
     3.62248948E-03    2     1000035         5   # BR(~b_1 -> chi^0_4 b)
     4.64848045E-01    2    -1000024         6   # BR(~b_1 -> chi^-_1 t)
     9.60689120E-03    2    -1000037         6   # BR(~b_1 -> chi^-_2 t)
     3.06013773E-04    2     1000006       -24   # BR(~b_1 -> ~t_1 W^-)
     1.84426709E-07    2     1000039         5   # BR(~b_1 -> ~G b)
DECAY   2000005     6.14645569E+01   # ~b_2
#    BR                NDA      ID1      ID2
     5.83148926E-03    2     1000022         5   # BR(~b_2 -> chi^0_1 b)
     4.88922445E-02    2     1000023         5   # BR(~b_2 -> chi^0_2 b)
     5.12537945E-02    2     1000025         5   # BR(~b_2 -> chi^0_3 b)
     1.24886384E-01    2     1000035         5   # BR(~b_2 -> chi^0_4 b)
     4.89596082E-01    2    -1000024         6   # BR(~b_2 -> chi^-_1 t)
     2.71078952E-01    2    -1000037         6   # BR(~b_2 -> chi^-_2 t)
     8.46100349E-03    2     1000006       -24   # BR(~b_2 -> ~t_1 W^-)
     4.96013085E-08    2     1000039         5   # BR(~b_2 -> ~G b)
DECAY   2000002     6.19674114E+00   # ~u_R
#    BR                NDA      ID1      ID2
     9.87733316E-01    2     1000022         2   # BR(~u_R -> chi^0_1 u)
     1.18670324E-02    2     1000023         2   # BR(~u_R -> chi^0_2 u)
     3.14897982E-04    2     1000025         2   # BR(~u_R -> chi^0_3 u)
     8.42701737E-05    2     1000035         2   # BR(~u_R -> chi^0_4 u)
     5.29571966E-10    2     1000024         1   # BR(~u_R -> chi^+_1 d)
     7.84661332E-13    2     1000037         1   # BR(~u_R -> chi^+_2 d)
     4.83063005E-07    2     1000039         2   # BR(~u_R -> ~G u)
DECAY   1000002     2.58938340E+01   # ~u_L
#    BR                NDA      ID1      ID2
     1.40790597E-02    2     1000022         2   # BR(~u_L -> chi^0_1 u)
     1.52202284E-02    2     1000023         2   # BR(~u_L -> chi^0_2 u)
     1.69824204E-04    2     1000025         2   # BR(~u_L -> chi^0_3 u)
     3.14101301E-01    2     1000035         2   # BR(~u_L -> chi^0_4 u)
     3.11434450E-02    2     1000024         1   # BR(~u_L -> chi^+_1 d)
     6.25285997E-01    2     1000037         1   # BR(~u_L -> chi^+_2 d)
     1.59891098E-09    2     2000001        24   # BR(~u_L -> ~d_R W^+)
     3.10822308E-13    2     2000002        23   # BR(~u_L -> ~u_R Z)
     1.97710897E-13    2     2000002        25   # BR(~u_L -> ~u_R h^0)
     1.43584589E-07    2     1000039         2   # BR(~u_L -> ~G u)
DECAY   2000004     6.19789630E+00   # ~c_R
#    BR                NDA      ID1      ID2
     9.87547754E-01    2     1000022         4   # BR(~c_R -> chi^0_1 c)
     1.19108358E-02    2     1000023         4   # BR(~c_R -> chi^0_2 c)
     3.61593796E-04    2     1000025         4   # BR(~c_R -> chi^0_3 c)
     8.43054330E-05    2     1000035         4   # BR(~c_R -> chi^0_4 c)
     9.48879191E-05    2     1000024         3   # BR(~c_R -> chi^+_1 s)
     1.40546944E-07    2     1000037         3   # BR(~c_R -> chi^+_2 s)
     4.82969502E-07    2     1000039         4   # BR(~c_R -> ~G c)
DECAY   1000004     2.58971483E+01   # ~c_L
#    BR                NDA      ID1      ID2
     1.40772611E-02    2     1000022         4   # BR(~c_L -> chi^0_1 c)
     1.52287491E-02    2     1000023         4   # BR(~c_L -> chi^0_2 c)
     1.81456646E-04    2     1000025         4   # BR(~c_L -> chi^0_3 c)
     3.14060046E-01    2     1000035         4   # BR(~c_L -> chi^0_4 c)
     3.12465277E-02    2     1000024         3   # BR(~c_L -> chi^+_1 s)
     6.25205020E-01    2     1000037         3   # BR(~c_L -> chi^+_2 s)
     7.05134811E-07    2     2000003        24   # BR(~c_L -> ~s_R W^+)
     5.56844251E-08    2     2000004        23   # BR(~c_L -> ~c_R Z)
     3.54126857E-08    2     2000004        25   # BR(~c_L -> ~c_R h^0)
     1.43563662E-07    2     1000039         4   # BR(~c_L -> ~G c)
DECAY   1000006     6.30334366E+01   # ~t_1
#    BR                NDA      ID1      ID2
     5.12561238E-05    2     1000022         4   # BR(~t_1 -> chi^0_1 c)
     9.06515086E-02    2     1000022         6   # BR(~t_1 -> chi^0_1 t)
     5.37261520E-05    2     1000023         4   # BR(~t_1 -> chi^0_2 c)
     2.19828866E-01    2     1000023         6   # BR(~t_1 -> chi^0_2 t)
     2.30429074E-01    2     1000025         6   # BR(~t_1 -> chi^0_3 t)
     2.25668362E-03    2     1000035         6   # BR(~t_1 -> chi^0_4 t)
     4.52101877E-01    2     1000024         5   # BR(~t_1 -> chi^+_1 b)
     4.61826663E-03    2     1000037         5   # BR(~t_1 -> chi^+_2 b)
     3.19410810E-08    2     1000039         6   # BR(~t_1 -> ~G t)
#    BR                NDA      ID1      ID2       ID3
     8.71013455E-06    3     1000022        24         5   # BR(~t_1 -> chi^0_1 W^+ b)
DECAY   2000006     6.27848159E+01   # ~t_2
#    BR                NDA      ID1      ID2
     6.65545844E-03    2     1000022         6   # BR(~t_2 -> chi^0_1 t)
     2.45060938E-01    2     1000023         6   # BR(~t_2 -> chi^0_2 t)
     2.53434229E-01    2     1000025         6   # BR(~t_2 -> chi^0_3 t)
     1.37489236E-01    2     1000035         6   # BR(~t_2 -> chi^0_4 t)
     9.63770093E-02    2     1000024         5   # BR(~t_2 -> chi^+_1 b)
     2.53508382E-01    2     1000037         5   # BR(~t_2 -> chi^+_2 b)
     4.31386843E-03    2     1000006        23   # BR(~t_2 -> ~t_1 Z)
     3.16082978E-03    2     1000006        25   # BR(~t_2 -> ~t_1 h^0)
     4.82073869E-08    2     1000039         6   # BR(~t_2 -> ~G t)
DECAY   1000024     9.76370307E-01   # chi^+_1
#    BR                NDA      ID1      ID2
     4.36877240E-08    2    -2000011        12   # BR(chi^+_1 -> ~e^+_R nu_e)
     1.86830297E-03    2    -2000013        14   # BR(chi^+_1 -> ~mu^+_R nu_mu)
     5.71254891E-01    2    -1000015        16   # BR(chi^+_1 -> ~tau^+_1 nu_tau)
     4.26436009E-01    2     1000022        24   # BR(chi^+_1 -> chi^0_1 W^+)
#    BR                NDA      ID1      ID2       ID3
     7.64226214E-10    3     1000022        -1         2   # BR(chi^+_1 -> chi^0_1 d_bar u)
     1.18113750E-09    3     1000022        -3         4   # BR(chi^+_1 -> chi^0_1 s_bar c)
     4.16760259E-04    3     1000022        -5         6   # BR(chi^+_1 -> chi^0_1 b_bar t)
     3.76650560E-06    3     1000022       -11        12   # BR(chi^+_1 -> chi^0_1 e^+ nu_e)
     3.80537484E-06    3     1000022       -13        14   # BR(chi^+_1 -> chi^0_1 mu^+ nu_mu)
     1.64192550E-05    3     1000022       -15        16   # BR(chi^+_1 -> chi^0_1 tau^+ nu_tau)
DECAY   1000037     1.21920141E+01   # chi^+_2
#    BR                NDA      ID1      ID2
     7.73394876E-02    2    -1000011        12   # BR(chi^+_2 -> ~e^+_L nu_e)
     1.04260341E-13    2    -2000013        14   # BR(chi^+_2 -> ~mu^+_R nu_mu)
     7.73481864E-02    2    -1000013        14   # BR(chi^+_2 -> ~mu^+_L nu_mu)
     9.50802465E-07    2    -1000015        16   # BR(chi^+_2 -> ~tau^+_1 nu_tau)
     7.98303254E-02    2    -2000015        16   # BR(chi^+_2 -> ~tau^+_2 nu_tau)
     7.75586833E-02    2     1000012       -11   # BR(chi^+_2 -> ~nu_e e^+)
     7.75701334E-02    2     1000014       -13   # BR(chi^+_2 -> ~nu_mu mu^+)
     8.08202719E-02    2     1000016       -15   # BR(chi^+_2 -> ~nu_tau tau^+)
     5.13382240E-05    2     1000022        24   # BR(chi^+_2 -> chi^0_1 W^+)
     1.35393444E-01    2     1000023        24   # BR(chi^+_2 -> chi^0_2 W^+)
     1.28948884E-01    2     1000025        24   # BR(chi^+_2 -> chi^0_3 W^+)
     1.36476549E-01    2     1000024        23   # BR(chi^+_2 -> chi^+_1 Z)
     1.28098239E-01    2     1000024        25   # BR(chi^+_2 -> chi^+_1 h^0)
#    BR                NDA      ID1      ID2       ID3
     2.41522468E-09    3     1000024         2        -2   # BR(chi^+_2 -> chi^+_1 u u_bar)
     2.41572737E-09    3     1000024         4        -4   # BR(chi^+_2 -> chi^+_1 c c_bar)
     4.13187879E-09    3     1000024         1        -1   # BR(chi^+_2 -> chi^+_1 d d_bar)
     4.70441171E-09    3     1000024         3        -3   # BR(chi^+_2 -> chi^+_1 s s_bar)
     1.33279008E-06    3     1000024         5        -5   # BR(chi^+_2 -> chi^+_1 b b_bar)
     2.19759733E-14    3     1000024        11       -11   # BR(chi^+_2 -> chi^+_1 e^- e^+)
     9.39542737E-10    3     1000024        13       -13   # BR(chi^+_2 -> chi^+_1 mu^- mu^+)
     2.66293175E-07    3     1000024        15       -15   # BR(chi^+_2 -> chi^+_1 tau^- tau^+)
     1.66995681E-12    3     1000024        12       -12   # BR(chi^+_2 -> chi^+_1 nu_e nu_bar_e)
     7.03318864E-08    3     1000022        -1         2   # BR(chi^+_2 -> chi^0_1 d_bar u)
     7.03423375E-08    3     1000022        -3         4   # BR(chi^+_2 -> chi^0_1 s_bar c)
     5.14969090E-07    3     1000022        -5         6   # BR(chi^+_2 -> chi^0_1 b_bar t)
     2.17484673E-11    3     1000022       -13        14   # BR(chi^+_2 -> chi^0_1 mu^+ nu_mu)
     7.17677116E-09    3     1000022       -15        16   # BR(chi^+_2 -> chi^0_1 tau^+ nu_tau)
     1.66049259E-09    3     1000023        -1         2   # BR(chi^+_2 -> chi^0_2 d_bar u)
     1.94270771E-09    3     1000023        -3         4   # BR(chi^+_2 -> chi^0_2 s_bar c)
     3.00546611E-04    3     1000023        -5         6   # BR(chi^+_2 -> chi^0_2 b_bar t)
     1.13407856E-14    3     1000023       -11        12   # BR(chi^+_2 -> chi^0_2 e^+ nu_e)
     4.84853483E-10    3     1000023       -13        14   # BR(chi^+_2 -> chi^0_2 mu^+ nu_mu)
     1.37372023E-07    3     1000023       -15        16   # BR(chi^+_2 -> chi^0_2 tau^+ nu_tau)
     8.20946628E-11    3     1000025        -1         2   # BR(chi^+_2 -> chi^0_3 d_bar u)
     3.18470142E-10    3     1000025        -3         4   # BR(chi^+_2 -> chi^0_3 s_bar c)
     2.54919511E-04    3     1000025        -5         6   # BR(chi^+_2 -> chi^0_3 b_bar t)
     4.13017171E-10    3     1000025       -13        14   # BR(chi^+_2 -> chi^0_3 mu^+ nu_mu)
     5.62163528E-06    3     1000025       -15        16   # BR(chi^+_2 -> chi^0_3 tau^+ nu_tau)
DECAY   1000022     2.65765520E+00   # chi^0_1
#    BR                NDA      ID1      ID2
     1.52179219E-01    2     2000011       -11   # BR(chi^0_1 -> ~e^-_R e^+)
     1.52179219E-01    2    -2000011        11   # BR(chi^0_1 -> ~e^+_R e^-)
     1.52323414E-01    2     2000013       -13   # BR(chi^0_1 -> ~mu^-_R mu^+)
     1.52323414E-01    2    -2000013        13   # BR(chi^0_1 -> ~mu^+_R mu^-)
     1.95497367E-01    2     1000015       -15   # BR(chi^0_1 -> ~tau^-_1 tau^+)
     1.95497367E-01    2    -1000015        15   # BR(chi^0_1 -> ~tau^+_1 tau^-)
     4.76599214E-10    2     1000039        22   # BR(chi^0_1 -> ~G photon)
     1.40997535E-10    2     1000039        23   # BR(chi^0_1 -> ~G Z)
     3.30325724E-12    2     1000039        25   # BR(chi^0_1 -> ~G h^0)
DECAY   1000023     1.11942940E+00   # chi^0_2
#    BR                NDA      ID1      ID2
     1.65117395E-02    2     2000011       -11   # BR(chi^0_2 -> ~e^-_R e^+)
     1.65117395E-02    2    -2000011        11   # BR(chi^0_2 -> ~e^+_R e^-)
     1.73121110E-02    2     2000013       -13   # BR(chi^0_2 -> ~mu^-_R mu^+)
     1.73121110E-02    2    -2000013        13   # BR(chi^0_2 -> ~mu^+_R mu^-)
     2.62538951E-01    2     1000015       -15   # BR(chi^0_2 -> ~tau^-_1 tau^+)
     2.62538951E-01    2    -1000015        15   # BR(chi^0_2 -> ~tau^+_1 tau^-)
     1.29450846E-02    2     1000022        23   # BR(chi^0_2 -> chi^0_1 Z)
     3.94305756E-01    2     1000022        25   # BR(chi^0_2 -> chi^0_1 h^0)
     3.21522344E-10    2     1000039        22   # BR(chi^0_2 -> ~G photon)
     6.23656828E-10    2     1000039        23   # BR(chi^0_2 -> ~G Z)
     4.65875708E-09    2     1000039        25   # BR(chi^0_2 -> ~G h^0)
     2.43395171E-07    2     1000022        22   # BR(chi^0_2 -> chi^0_1 photon)
#    BR                NDA      ID1      ID2       ID3
     2.10001306E-09    3     1000022         2        -2   # BR(chi^0_2 -> chi^0_1 u u_bar)
     2.10281401E-09    3     1000022         4        -4   # BR(chi^0_2 -> chi^0_1 c c_bar)
     4.03279108E-10    3     1000022         1        -1   # BR(chi^0_2 -> chi^0_1 d d_bar)
     8.52870199E-10    3     1000022         3        -3   # BR(chi^0_2 -> chi^0_1 s s_bar)
     1.03293122E-06    3     1000022         5        -5   # BR(chi^0_2 -> chi^0_1 b b_bar)
     4.14802998E-06    3     1000022        11       -11   # BR(chi^0_2 -> chi^0_1 e^- e^+)
     4.17221153E-06    3     1000022        13       -13   # BR(chi^0_2 -> chi^0_1 mu^- mu^+)
     1.15782967E-05    3     1000022        15       -15   # BR(chi^0_2 -> chi^0_1 tau^- tau^+)
     2.37171236E-06    3     1000022        12       -12   # BR(chi^0_2 -> chi^0_1 nu_e nu_bar_e)
     3.09481732E-11    3     1000024         1        -2   # BR(chi^0_2 -> chi^+_1 d u_bar)
     3.09481732E-11    3    -1000024        -1         2   # BR(chi^0_2 -> chi^-_1 d_bar u)
     7.71677155E-12    3     1000024         3        -4   # BR(chi^0_2 -> chi^+_1 s c_bar)
     7.71677155E-12    3    -1000024        -3         4   # BR(chi^0_2 -> chi^-_1 s_bar c)
     1.04621579E-11    3     1000024        11       -12   # BR(chi^0_2 -> chi^+_1 e^- nu_bar_e)
     1.04621579E-11    3    -1000024       -11        12   # BR(chi^0_2 -> chi^-_1 e^+ nu_e)
     1.03635758E-11    3     1000024        13       -14   # BR(chi^0_2 -> chi^+_1 mu^- nu_bar_mu)
     1.03635758E-11    3    -1000024       -13        14   # BR(chi^0_2 -> chi^-_1 mu^+ nu_mu)
     4.68001598E-13    3     1000024        15       -16   # BR(chi^0_2 -> chi^+_1 tau^- nu_bar_tau)
     4.68001598E-13    3    -1000024       -15        16   # BR(chi^0_2 -> chi^-_1 tau^+ nu_tau)
DECAY   1000025     1.00370593E+00   # chi^0_3
#    BR                NDA      ID1      ID2
     5.00545316E-04    2     2000011       -11   # BR(chi^0_3 -> ~e^-_R e^+)
     5.00545316E-04    2    -2000011        11   # BR(chi^0_3 -> ~e^+_R e^-)
     1.39974198E-03    2     2000013       -13   # BR(chi^0_3 -> ~mu^-_R mu^+)
     1.39974198E-03    2    -2000013        13   # BR(chi^0_3 -> ~mu^+_R mu^-)
     2.76443475E-01    2     1000015       -15   # BR(chi^0_3 -> ~tau^-_1 tau^+)
     2.76443475E-01    2    -1000015        15   # BR(chi^0_3 -> ~tau^+_1 tau^-)
     2.02145499E-07    2     1000016       -16   # BR(chi^0_3 -> ~nu_tau nu_bar_tau)
     2.02145499E-07    2    -1000016        16   # BR(chi^0_3 -> ~nu^*_tau nu_tau)
     4.32408845E-01    2     1000022        23   # BR(chi^0_3 -> chi^0_1 Z)
     1.08877109E-02    2     1000022        25   # BR(chi^0_3 -> chi^0_1 h^0)
     1.82600585E-13    2     1000039        22   # BR(chi^0_3 -> ~G photon)
     1.03311135E-09    2     1000039        23   # BR(chi^0_3 -> ~G Z)
     4.96496017E-09    2     1000039        25   # BR(chi^0_3 -> ~G h^0)
     3.71746784E-07    2     1000022        22   # BR(chi^0_3 -> chi^0_1 photon)
     3.27237495E-10    2     1000023        22   # BR(chi^0_3 -> chi^0_2 photon)
#    BR                NDA      ID1      ID2       ID3
     2.19852885E-11    3     1000022         2        -2   # BR(chi^0_3 -> chi^0_1 u u_bar)
     2.85474632E-11    3     1000022         4        -4   # BR(chi^0_3 -> chi^0_1 c c_bar)
     6.88536205E-12    3     1000022         1        -1   # BR(chi^0_3 -> chi^0_1 d d_bar)
     5.62722434E-10    3     1000022         3        -3   # BR(chi^0_3 -> chi^0_1 s s_bar)
     1.27338382E-06    3     1000022         5        -5   # BR(chi^0_3 -> chi^0_1 b b_bar)
     2.15607247E-08    3     1000022        11       -11   # BR(chi^0_3 -> chi^0_1 e^- e^+)
     6.13737027E-08    3     1000022        13       -13   # BR(chi^0_3 -> chi^0_1 mu^- mu^+)
     1.33320753E-05    3     1000022        15       -15   # BR(chi^0_3 -> chi^0_1 tau^- tau^+)
     1.39672641E-07    3     1000022        12       -12   # BR(chi^0_3 -> chi^0_1 nu_e nu_bar_e)
     3.82072034E-09    3     1000023         2        -2   # BR(chi^0_3 -> chi^0_2 u u_bar)
     3.23608506E-09    3     1000023         4        -4   # BR(chi^0_3 -> chi^0_2 c c_bar)
     4.96160775E-09    3     1000023         1        -1   # BR(chi^0_3 -> chi^0_2 d d_bar)
     4.95482838E-09    3     1000023         3        -3   # BR(chi^0_3 -> chi^0_2 s s_bar)
     1.13858711E-09    3     1000023        11       -11   # BR(chi^0_3 -> chi^0_2 e^- e^+)
     1.13790094E-09    3     1000023        13       -13   # BR(chi^0_3 -> chi^0_2 mu^- mu^+)
     1.04660373E-09    3     1000023        15       -15   # BR(chi^0_3 -> chi^0_2 tau^- tau^+)
     6.86615787E-09    3     1000023        12       -12   # BR(chi^0_3 -> chi^0_2 nu_e nu_bar_e)
     4.86886063E-08    3     1000024         1        -2   # BR(chi^0_3 -> chi^+_1 d u_bar)
     4.86886063E-08    3    -1000024        -1         2   # BR(chi^0_3 -> chi^-_1 d_bar u)
     4.53178463E-08    3     1000024         3        -4   # BR(chi^0_3 -> chi^+_1 s c_bar)
     4.53178463E-08    3    -1000024        -3         4   # BR(chi^0_3 -> chi^-_1 s_bar c)
     1.62757203E-08    3     1000024        11       -12   # BR(chi^0_3 -> chi^+_1 e^- nu_bar_e)
     1.62757203E-08    3    -1000024       -11        12   # BR(chi^0_3 -> chi^-_1 e^+ nu_e)
     1.62666515E-08    3     1000024        13       -14   # BR(chi^0_3 -> chi^+_1 mu^- nu_bar_mu)
     1.62666515E-08    3    -1000024       -13        14   # BR(chi^0_3 -> chi^-_1 mu^+ nu_mu)
     1.38875606E-08    3     1000024        15       -16   # BR(chi^0_3 -> chi^+_1 tau^- nu_bar_tau)
     1.38875606E-08    3    -1000024       -15        16   # BR(chi^0_3 -> chi^-_1 tau^+ nu_tau)
DECAY   1000035     1.22038100E+01   # chi^0_4
#    BR                NDA      ID1      ID2
     2.35084237E-05    2     2000011       -11   # BR(chi^0_4 -> ~e^-_R e^+)
     2.35084237E-05    2    -2000011        11   # BR(chi^0_4 -> ~e^+_R e^-)
     3.77824240E-02    2     1000011       -11   # BR(chi^0_4 -> ~e^-_L e^+)
     3.77824240E-02    2    -1000011        11   # BR(chi^0_4 -> ~e^+_L e^-)
     2.34364921E-05    2     2000013       -13   # BR(chi^0_4 -> ~mu^-_R mu^+)
     2.34364921E-05    2    -2000013        13   # BR(chi^0_4 -> ~mu^+_R mu^-)
     3.77873422E-02    2     1000013       -13   # BR(chi^0_4 -> ~mu^-_L mu^+)
     3.77873422E-02    2    -1000013        13   # BR(chi^0_4 -> ~mu^+_L mu^-)
     8.48810926E-06    2     1000015       -15   # BR(chi^0_4 -> ~tau^-_1 tau^+)
     8.48810926E-06    2    -1000015        15   # BR(chi^0_4 -> ~tau^+_1 tau^-)
     3.91929351E-02    2     2000015       -15   # BR(chi^0_4 -> ~tau^-_2 tau^+)
     3.91929351E-02    2    -2000015        15   # BR(chi^0_4 -> ~tau^+_2 tau^-)
     3.95341315E-02    2     1000012       -12   # BR(chi^0_4 -> ~nu_e nu_bar_e)
     3.95341315E-02    2    -1000012        12   # BR(chi^0_4 -> ~nu^*_e nu_e)
     3.95393082E-02    2     1000014       -14   # BR(chi^0_4 -> ~nu_mu nu_bar_mu)
     3.95393082E-02    2    -1000014        14   # BR(chi^0_4 -> ~nu^*_mu nu_mu)
     4.10018893E-02    2     1000016       -16   # BR(chi^0_4 -> ~nu_tau nu_bar_tau)
     4.10018893E-02    2    -1000016        16   # BR(chi^0_4 -> ~nu^*_tau nu_tau)
     1.36385605E-01    2     1000024       -24   # BR(chi^0_4 -> chi^+_1 W^-)
     1.36385605E-01    2    -1000024        24   # BR(chi^0_4 -> chi^-_1 W^+)
     6.71398376E-06    2     1000022        23   # BR(chi^0_4 -> chi^0_1 Z)
     2.89134309E-03    2     1000023        23   # BR(chi^0_4 -> chi^0_2 Z)
     1.25508681E-01    2     1000025        23   # BR(chi^0_4 -> chi^0_3 Z)
     5.91376596E-05    2     1000022        25   # BR(chi^0_4 -> chi^0_1 h^0)
     1.26258467E-01    2     1000023        25   # BR(chi^0_4 -> chi^0_2 h^0)
     2.10292772E-03    2     1000025        25   # BR(chi^0_4 -> chi^0_3 h^0)
     8.67464851E-10    2     1000039        22   # BR(chi^0_4 -> ~G photon)
     3.26679437E-09    2     1000039        23   # BR(chi^0_4 -> ~G Z)
     7.90235266E-11    2     1000039        25   # BR(chi^0_4 -> ~G h^0)
     1.44444856E-07    2     1000022        22   # BR(chi^0_4 -> chi^0_1 photon)
     7.00875423E-07    2     1000023        22   # BR(chi^0_4 -> chi^0_2 photon)
     7.84574920E-07    2     1000025        22   # BR(chi^0_4 -> chi^0_3 photon)
#    BR                NDA      ID1      ID2       ID3
     3.16248965E-08    3     1000022         2        -2   # BR(chi^0_4 -> chi^0_1 u u_bar)
     3.16233150E-08    3     1000022         4        -4   # BR(chi^0_4 -> chi^0_1 c c_bar)
     1.50544659E-07    3     1000022         6        -6   # BR(chi^0_4 -> chi^0_1 t t_bar)
     3.86753143E-08    3     1000022         1        -1   # BR(chi^0_4 -> chi^0_1 d d_bar)
     3.86870105E-08    3     1000022         3        -3   # BR(chi^0_4 -> chi^0_1 s s_bar)
     7.22853522E-08    3     1000022         5        -5   # BR(chi^0_4 -> chi^0_1 b b_bar)
     1.12517773E-08    3     1000022        11       -11   # BR(chi^0_4 -> chi^0_1 e^- e^+)
     1.12325891E-08    3     1000022        13       -13   # BR(chi^0_4 -> chi^0_1 mu^- mu^+)
     1.01749773E-08    3     1000022        15       -15   # BR(chi^0_4 -> chi^0_1 tau^- tau^+)
     2.91349268E-09    3     1000023         2        -2   # BR(chi^0_4 -> chi^0_2 u u_bar)
     2.91269984E-09    3     1000023         4        -4   # BR(chi^0_4 -> chi^0_2 c c_bar)
     1.77223485E-09    3     1000023         1        -1   # BR(chi^0_4 -> chi^0_2 d d_bar)
     2.03938324E-09    3     1000023         3        -3   # BR(chi^0_4 -> chi^0_2 s s_bar)
     6.21318790E-07    3     1000023         5        -5   # BR(chi^0_4 -> chi^0_2 b b_bar)
     4.65102244E-12    3     1000023        11       -11   # BR(chi^0_4 -> chi^0_2 e^- e^+)
     4.34684505E-10    3     1000023        13       -13   # BR(chi^0_4 -> chi^0_2 mu^- mu^+)
     1.22865830E-07    3     1000023        15       -15   # BR(chi^0_4 -> chi^0_2 tau^- tau^+)
     1.00258659E-11    3     1000025         2        -2   # BR(chi^0_4 -> chi^0_3 u u_bar)
     1.11731121E-11    3     1000025         4        -4   # BR(chi^0_4 -> chi^0_3 c c_bar)
     1.88108325E-11    3     1000025         1        -1   # BR(chi^0_4 -> chi^0_3 d d_bar)
     2.77346498E-10    3     1000025         3        -3   # BR(chi^0_4 -> chi^0_3 s s_bar)
     5.98868723E-07    3     1000025         5        -5   # BR(chi^0_4 -> chi^0_3 b b_bar)
     4.70355865E-14    3     1000025        11       -11   # BR(chi^0_4 -> chi^0_3 e^- e^+)
     4.16900517E-10    3     1000025        13       -13   # BR(chi^0_4 -> chi^0_3 mu^- mu^+)
     5.44045915E-06    3     1000025        15       -15   # BR(chi^0_4 -> chi^0_3 tau^- tau^+)
     1.60914229E-08    3     1000025        12       -12   # BR(chi^0_4 -> chi^0_3 nu_e nu_bar_e)
     1.72933790E-09    3     1000024         1        -2   # BR(chi^0_4 -> chi^+_1 d u_bar)
     1.72933790E-09    3    -1000024        -1         2   # BR(chi^0_4 -> chi^-_1 d_bar u)
     2.02476020E-09    3     1000024         3        -4   # BR(chi^0_4 -> chi^+_1 s c_bar)
     2.02476020E-09    3    -1000024        -3         4   # BR(chi^0_4 -> chi^-_1 s_bar c)
     3.02733351E-04    3     1000024         5        -6   # BR(chi^0_4 -> chi^+_1 b t_bar)
     3.02733351E-04    3    -1000024        -5         6   # BR(chi^0_4 -> chi^-_1 b_bar t)
     1.15151257E-14    3     1000024        11       -12   # BR(chi^0_4 -> chi^+_1 e^- nu_bar_e)
     1.15151257E-14    3    -1000024       -11        12   # BR(chi^0_4 -> chi^-_1 e^+ nu_e)
     4.92292663E-10    3     1000024        13       -14   # BR(chi^0_4 -> chi^+_1 mu^- nu_bar_mu)
     4.92292663E-10    3    -1000024       -13        14   # BR(chi^0_4 -> chi^-_1 mu^+ nu_mu)
     1.38374063E-07    3     1000024        15       -16   # BR(chi^0_4 -> chi^+_1 tau^- nu_bar_tau)
     1.38374063E-07    3    -1000024       -15        16   # BR(chi^0_4 -> chi^-_1 tau^+ nu_tau)
DECAY   1000021     2.32891144E+01   # ~g
#    BR                NDA      ID1      ID2
     4.52303679E-02    2     2000002        -2   # BR(~g -> ~u_R u_bar)
     4.52303679E-02    2    -2000002         2   # BR(~g -> ~u^*_R u)
     1.56084396E-02    2     1000002        -2   # BR(~g -> ~u_L u_bar)
     1.56084396E-02    2    -1000002         2   # BR(~g -> ~u^*_L u)
     4.52307237E-02    2     2000004        -4   # BR(~g -> ~c_R c_bar)
     4.52307237E-02    2    -2000004         4   # BR(~g -> ~c^*_R c)
     1.56100598E-02    2     1000004        -4   # BR(~g -> ~c_L c_bar)
     1.56100598E-02    2    -1000004         4   # BR(~g -> ~c^*_L c)
     1.25161471E-03    2     1000006        -4   # BR(~g -> ~t_1 c_bar)
     1.25161471E-03    2    -1000006         4   # BR(~g -> ~t^*_1 c)
     1.06710176E-01    2     1000006        -6   # BR(~g -> ~t_1 t_bar)
     1.06710176E-01    2    -1000006         6   # BR(~g -> ~t^*_1 t)
     3.83294334E-02    2     2000006        -6   # BR(~g -> ~t_2 t_bar)
     3.83294334E-02    2    -2000006         6   # BR(~g -> ~t^*_2 t)
     4.84605460E-02    2     2000001        -1   # BR(~g -> ~d_R d_bar)
     4.84605460E-02    2    -2000001         1   # BR(~g -> ~d^*_R d)
     1.54266797E-02    2     1000001        -1   # BR(~g -> ~d_L d_bar)
     1.54266797E-02    2    -1000001         1   # BR(~g -> ~d^*_L d)
     4.84659566E-02    2     2000003        -3   # BR(~g -> ~s_R s_bar)
     4.84659566E-02    2    -2000003         3   # BR(~g -> ~s^*_R s)
     1.54284720E-02    2     1000003        -3   # BR(~g -> ~s_L s_bar)
     1.54284720E-02    2    -1000003         3   # BR(~g -> ~s^*_L s)
     6.16921229E-02    2     1000005        -5   # BR(~g -> ~b_1 b_bar)
     6.16921229E-02    2    -1000005         5   # BR(~g -> ~b^*_1 b)
     4.24609244E-02    2     2000005        -5   # BR(~g -> ~b_2 b_bar)
     4.24609244E-02    2    -2000005         5   # BR(~g -> ~b^*_2 b)
     2.04894755E-06    2     1000022        21   # BR(~g -> chi^0_1 g)
     8.56502131E-05    2     1000023        21   # BR(~g -> chi^0_2 g)
     9.63293948E-05    2     1000025        21   # BR(~g -> chi^0_3 g)
     4.93815349E-06    2     1000035        21   # BR(~g -> chi^0_4 g)
DECAY        25     2.70584521E-03   # h^0
#    BR                NDA      ID1      ID2
     9.21860357E-09    2          11       -11   # BR(h^0 -> e^- e^+)
     3.94106245E-04    2          13       -13   # BR(h^0 -> mu^- mu^+)
     1.10279010E-01    2          15       -15   # BR(h^0 -> tau^- tau^+)
     6.27141346E-07    2           1        -1   # BR(h^0 -> d d_bar)
     2.76566852E-04    2           3        -3   # BR(h^0 -> s s_bar)
     5.98736489E-01    2           5        -5   # BR(h^0 -> b b_bar)
     2.47358706E-07    2           2        -2   # BR(h^0 -> u u_bar)
     4.43203807E-02    2           4        -4   # BR(h^0 -> c c_bar)
     6.65498483E-02    2          21        21   # BR(h^0 -> g g)
     3.35840834E-03    2          22        22   # BR(h^0 -> photon photon)
# writing decays into V V* as 3-body decays
#    BR                NDA      ID1      ID2       ID3
     8.02309431E-03    3          24        11        12   # BR(h^0 -> W^+ e^- nu_e)
     8.02309431E-03    3          24        13        14   # BR(h^0 -> W^+ mu^- nu_mu)
     8.02309431E-03    3          24        15        16   # BR(h^0 -> W^+ tau^- nu_tau)
     2.80808301E-02    3          24         1        -2   # BR(h^0 -> W^+ d u_bar)
     2.80808301E-02    3          24         3        -4   # BR(h^0 -> W^+ s c_bar)
     8.02309431E-03    3         -24       -11       -12   # BR(h^0 -> W^- e^+ nu_bar_e)
     8.02309431E-03    3         -24       -13       -14   # BR(h^0 -> W^- mu^+ nu_bar_mu)
     8.02309431E-03    3         -24       -15       -16   # BR(h^0 -> W^- tau^+ nu_bar_tau)
     2.80808301E-02    3         -24        -1         2   # BR(h^0 -> W^- d_bar u)
     2.80808301E-02    3         -24        -3         4   # BR(h^0 -> W^- s_bar c)
     5.46784712E-04    3          23        11       -11   # BR(h^0 -> Z e^- e^+)
     5.46784712E-04    3          23        13       -13   # BR(h^0 -> Z mu^- mu^+)
     4.68672611E-04    3          23        15       -15   # BR(h^0 -> Z tau^- tau^+)
     3.12448407E-03    3          23        12       -12   # BR(h^0 -> Z nu_e nu_bar_e)
     2.18713885E-03    3          23         1        -1   # BR(h^0 -> Z u u_bar)
     2.18713885E-03    3          23         3        -3   # BR(h^0 -> Z c c_bar)
     2.18713885E-03    3          23         5        -5   # BR(h^0 -> Z t t_bar)
     2.18713885E-03    3          23         2        -2   # BR(h^0 -> Z u u_bar)
     2.18713885E-03    3          23         4        -4   # BR(h^0 -> Z c c_bar)
DECAY        35     1.30392596E+01   # H^0
#    BR                NDA      ID1      ID2
     1.45960752E-08    2          11       -11   # BR(H^0 -> e^- e^+)
     6.24028600E-04    2          13       -13   # BR(H^0 -> mu^- mu^+)
     1.76913825E-01    2          15       -15   # BR(H^0 -> tau^- tau^+)
     8.14433733E-07    2           1        -1   # BR(H^0 -> d d_bar)
     3.59165050E-04    2           3        -3   # BR(H^0 -> s s_bar)
     8.16922077E-01    2           5        -5   # BR(H^0 -> b b_bar)
     5.24709405E-13    2           2        -2   # BR(H^0 -> u u_bar)
     9.40339157E-08    2           4        -4   # BR(H^0 -> c c_bar)
     4.90452036E-03    2           6        -6   # BR(H^0 -> t t_bar)
     1.05961870E-06    2     2000011  -2000011   # BR(H^0 -> ~e^-_R ~e^+_R)
     1.06735622E-06    2     2000013  -2000013   # BR(H^0 -> ~mu^-_R ~mu^+_R)
     4.24146536E-06    2     1000015  -1000015   # BR(H^0 -> ~tau^-_1 ~tau^+_1)
     7.25503423E-05    2          23        23   # BR(H^0 -> Z Z)
     1.37730307E-04    2          24       -24   # BR(H^0 -> W^+ W^-)
     3.21752902E-05    2          25        25   # BR(H^0 -> h^0 h^0)
     2.66077224E-05    2          21        21   # BR(H^0 -> g g)
     2.85281144E-08    2          22        22   # BR(H^0 -> photon photon)
DECAY        36     1.30359231E+01   # A^0
#    BR                NDA      ID1      ID2
     1.46010370E-08    2          11       -11   # BR(A^0 -> e^- e^+)
     6.24240753E-04    2          13       -13   # BR(A^0 -> mu^- mu^+)
     1.76975540E-01    2          15       -15   # BR(A^0 -> tau^- tau^+)
     8.14710239E-07    2           1        -1   # BR(A^0 -> d d_bar)
     3.59286987E-04    2           3        -3   # BR(A^0 -> s s_bar)
     8.17203713E-01    2           5        -5   # BR(A^0 -> b b_bar)
     4.71154207E-13    2           2        -2   # BR(A^0 -> u u_bar)
     8.44361649E-08    2           4        -4   # BR(A^0 -> c c_bar)
     4.68586102E-03    2           6        -6   # BR(A^0 -> t t_bar)
     1.35975081E-04    2          25        23   # BR(A^0 -> h^0 Z)
     1.44228923E-05    2          21        21   # BR(A^0 -> g g)
     4.62972556E-08    2          22        22   # BR(A^0 -> photon photon)
DECAY        37     1.14018285E+01   # H^+
#    BR                NDA      ID1      ID2
     1.67380964E-08    2         -11        12   # BR(H^+ -> e^+ nu_e)
     7.15606834E-04    2         -13        12   # BR(H^+ -> mu^+ nu_e)
     2.02878310E-01    2         -15        12   # BR(H^+ -> tau^+ nu_e)
     8.22977582E-07    2          -1         2   # BR(H^+ -> d_bar u)
     3.63017122E-04    2          -3         4   # BR(H^+ -> s_bar c)
     7.95889490E-01    2          -5         6   # BR(H^+ -> b_bar t)
     1.52736206E-04    2          25        24   # BR(H^+ -> h^0 W^+)
DECAY         6     2.43000000E+00   # top
#    BR                NDA      ID1      ID2
     1.00000000E+00    2           5        24   # BR(t -> b W)
Block HiggsBoundsInputHiggsCouplingsFermions
# ScalarNormEffCoupSq PseudoSNormEffCoupSq NP IP1 IP2 IP2
    1.11390541E+00    0.00000000E+00        3  25   5   5  # h0-b-b eff. coupling^2, normalised to SM
    8.99886095E+02    0.00000000E+00        3  35   5   5  # H0-b-b eff. coupling^2, normalised to SM
    0.00000000E+00    9.00000000E+02        3  36   5   5  # A0-b-b eff. coupling^2, normalised to SM
#
    9.99873438E-01    0.00000000E+00        3  25   6   6  # h0-t-t eff. coupling^2, normalised to SM
    1.23767267E-03    0.00000000E+00        3  35   6   6  # H0-t-t eff. coupling^2, normalised to SM
    0.00000000E+00    1.11111111E-03        3  36   6   6  # A0-t-t eff. coupling^2, normalised to SM
#
    1.11390541E+00    0.00000000E+00        3  25  15  15  # h0-tau-tau eff. coupling^2, normalised to SM
    8.99886095E+02    0.00000000E+00        3  35  15  15  # H0-tau-tau eff. coupling^2, normalised to SM
    0.00000000E+00    9.00000000E+02        3  36  15  15  # A0-tau-tau eff. coupling^2, normalised to SM
#
Block HiggsBoundsInputHiggsCouplingsBosons
    9.99996587E-01        3  25  24  24  # h0-W-W eff. coupling^2, normalised to SM
    3.41250229E-06        3  35  24  24  # H0-W-W eff. coupling^2, normalised to SM
    0.00000000E+00        3  36  24  24  # A0-W-W eff. coupling^2, normalised to SM
#
    9.99996587E-01        3  25  23  23  # h0-Z-Z eff. coupling^2, normalised to SM
    3.41250229E-06        3  35  23  23  # H0-Z-Z eff. coupling^2, normalised to SM
    0.00000000E+00        3  36  23  23  # A0-Z-Z eff. coupling^2, normalised to SM
#
    1.15734279E+00        3  25  21  21  # h0-g-g eff. coupling^2, normalised to SM
    8.87053185E-03        3  35  21  21  # H0-g-g eff. coupling^2, normalised to SM
    1.24612680E-01        3  36  21  21  # A0-g-g eff. coupling^2, normalised to SM
#
    0.00000000E+00        3  25  25  23  # h0-h0-Z eff. coupling^2, normalised to SM
    0.00000000E+00        3  35  25  23  # H0-h0-Z eff. coupling^2, normalised to SM
    3.41250229E-06        3  36  25  23  # A0-h0-Z eff. coupling^2, normalised to SM
    0.00000000E+00        3  35  35  23  # H0-H0-Z eff. coupling^2, normalised to SM
    9.99996587E-01        3  36  35  23  # A0-H0-Z eff. coupling^2, normalised to SM
    0.00000000E+00        3  36  36  23  # A0-A0-Z eff. coupling^2, normalised to SM
#
    0.00000000E+00        4  25  21  21  23  # h0-g-g-Z eff. coupling^2, normalised to SM
    0.00000000E+00        4  35  21  21  23  # H0-g-g-Z eff. coupling^2, normalised to SM
    0.00000000E+00        4  36  21  21  23  # A0-g-g-Z eff. coupling^2, normalised to SM
Block SPhenoLowEnergy  # low energy observables
    1    3.11432757E-04   # BR(b -> s gamma)
    2    1.59137999E-06   # BR(b -> s mu+ mu-)
    3    3.54017734E-05   # BR(b -> s nu nu)
    4    5.18818363E-11   # BR(Bd -> mu+ mu-)
    5    3.39032766E-09   # BR(Bs -> mu+ mu-)
    6    1.08082025E-04   # BR(B_u -> tau nu)
    7    9.77292486E-01   # BR(B_u -> tau nu)/BR(B_u -> tau nu)_SM
    8    2.73836815E-01   # |Delta(M_Bd)| [ps^-1] 
    9    2.03169142E+01   # |Delta(M_Bs)| [ps^-1] 
   20    1.37530446E-14   # Delta(g-2)_electron/2
   21    2.97573907E-10   # Delta(g-2)_muon/2
   22    2.15831946E-08   # Delta(g-2)_tau/2
   23    0.00000000E+00   # electric dipole moment of the electron
   24    0.00000000E+00   # electric dipole moment of the muon
   25    0.00000000E+00   # electric dipole moment of the tau
   26    0.00000000E+00   # Br(mu -> e gamma)
   27    0.00000000E+00   # Br(tau -> e gamma)
   28    0.00000000E+00   # Br(tau -> mu gamma)
   29    0.00000000E+00   # Br(mu -> 3 e)
   30    0.00000000E+00   # Br(tau -> 3 e)
   31    0.00000000E+00   # Br(tau -> 3 mu)
   39    7.39075766E-04   # Delta(rho_parameter)
   40    0.00000000E+00   # BR(Z -> e mu)
   41    0.00000000E+00   # BR(Z -> e tau)
   42    0.00000000E+00   # BR(Z -> mu tau)
Block FWCOEF Q=  9.11876000E+01  # Wilson coefficients at scale Q
#    id        order  M        value         comment
Block FWCOEF Q=  1.60000000E+02  # Wilson coefficients at scale Q
#    id        order  M        value         comment
     0305 4422   00   0    -1.87758850E-01   # C7
     0305 4422   00   1    -1.25738566E-02   # C7
     0305 4322   00   1    -2.72562027E-04   # C7'
     0305 6421   00   0    -9.48898426E-02   # C8
     0305 6421   00   1    -1.90438898E-02   # C8
     0305 6321   00   1    -4.08892319E-04   # C8'
 03051111 4133   00   0    -1.38657749E+00   # C9 e+e-
 03051111 4133   00   1     6.05789410E-04   # C9 e+e-
 03051111 4233   00   1    -2.50490178E-05   # C9' e+e-
 03051111 4137   00   0    -3.94163688E+00   # C10 e+e-
 03051111 4137   00   1     1.95087460E-03   # C10 e+e-
 03051111 4237   00   1     6.67983438E-04   # C10' e+e-
 03051313 4133   00   0    -1.38657749E+00   # C9 mu+mu-
 03051313 4133   00   1     6.05719676E-04   # C9 mu+mu-
 03051313 4233   00   1    -2.50514029E-05   # C9' mu+mu-
 03051313 4137   00   0    -3.94163688E+00   # C10 mu+mu-
 03051313 4137   00   1     1.95080476E-03   # C10 mu+mu-
 03051313 4237   00   1     6.67985824E-04   # C10' mu+mu-
 03051212 4237   00   0     1.49016698E+00   # C11 nu_1 nu_1
 03051212 4237   00   1    -4.70811853E-04   # C11 nu_1 nu_1
 03051212 4137   00   1    -1.60788465E-04   # C11' nu_1 nu_1
 03051414 4237   00   0     1.49016698E+00   # C11 nu_2 nu_2
 03051414 4237   00   1    -4.70811818E-04   # C11 nu_2 nu_2
 03051414 4137   00   1    -1.60787899E-04   # C11' nu_2 nu_2
 03051616 4237   00   0     1.49016698E+00   # C11 nu_3 nu_3
 03051616 4237   00   1    -4.70798566E-04   # C11 nu_3 nu_3
 03051616 4137   00   1    -1.60628242E-04   # C11' nu_3 nu_3
