#
#                              ======================
#                              | THE SUSYHIT OUTPUT |
#                              ======================
#
#
#              ------------------------------------------------------
#              |     This is the output of the SUSY-HIT package     |
#              |  created by A.Djouadi, M.Muehlleitner and M.Spira. |
#              |  In case of problems with SUSY-HIT email to        |
#              |           margarete.muehlleitner@cern.ch           |
#              |           michael.spira@psi.ch                     |
#              |           abdelhak.djouadi@cern.ch                 |
#              ------------------------------------------------------
#
#              ------------------------------------------------------
#              |  SUSY Les Houches Accord - MSSM Spectrum + Decays  |
#              |              based on the decay programs           |
#              |                                                    |
#              |                     SDECAY 1.3b                    |
#              |                                                    |
#              |  Authors: M.Muhlleitner, A.Djouadi and Y.Mambrini  |
#              |  Ref.:    Comput.Phys.Commun.168(2005)46           |
#              |           [hep-ph/0311167]                         |
#              |                                                    |
#              |                     HDECAY 3.4                     |
#              |                                                    |
#              |  By: A.Djouadi,J.Kalinowski,M.Muhlleitner,M.Spira  |
#              |  Ref.:    Comput.Phys.Commun.108(1998)56           |
#              |           [hep-ph/9704448]                         |
#              |                                                    |
#              |                                                    |
#              |  If not stated otherwise all DRbar couplings and   |
#              |  soft SUSY breaking masses are given at the scale  |
#              |  Q=  0.50007100E+04
#              |                                                    |
#              ------------------------------------------------------
#
#
BLOCK DCINFO  # Decay Program information
     1   SDECAY/HDECAY # decay calculator
     2   1.3b  /3.4    # version number
#
BLOCK SPINFO  # Spectrum calculator information
     1    SOFTSUSY    # spectrum calculator                
     2    3.4.0       # version number                     
#
BLOCK MODSEL  # Model selection
     1     0   #  nonUniversal                                     
#
BLOCK SMINPUTS  # Standard Model inputs
         1     1.25778332E+02   # alpha_em^-1(M_Z)^MSbar
         2     1.16570000E-05   # G_F [GeV^-2]
         3     1.17200002E-01   # alpha_S(M_Z)^MSbar
         4     9.11876000E+01   # M_Z pole mass
         5     4.25000000E+00   # mb(mb)^MSbar
         6     1.72500000E+02   # mt pole mass
         7     1.77682000E+00   # mtau pole mass
#
BLOCK MINPAR  # Input parameters - minimal models
         3     1.00000000E+01   # tanb                
#
BLOCK EXTPAR  # Input parameters - non-minimal models
         0    -1.00000000E+00   # Set                 
         1     6.00000000E+01   # M_1(MX)             
         2     3.00000000E+03   # M_2(MX)             
         3     1.57544000E+03   # M_3(MX)             
        11     5.00000000E+03   # At(MX)              
        12     5.00000000E+03   # Ab(MX)              
        13     0.00000000E+00   # Atau(MX)            
        23    -1.64251600E+03   # mu(MX)              
        26     3.00000000E+03   # mA(pole)            
        31     5.00000000E+03   # meL(MX)             
        32     5.00000000E+03   # mmuL(MX)            
        33     5.00000000E+03   # mtauL(MX)           
        34     5.00000000E+03   # meR(MX)             
        35     5.00000000E+03   # mmuR(MX)            
        36     5.00000000E+03   # mtauR(MX)           
        41     5.00000000E+03   # mqL1(MX)            
        42     5.00000000E+03   # mqL2(MX)            
        43     5.00000000E+03   # mqL3(MX)            
        44     5.00000000E+03   # muR(MX)             
        45     5.00000000E+03   # mcR(MX)             
        46     5.00000000E+03   # mtR(MX)             
        47     5.00000000E+03   # mdR(MX)             
        48     5.00000000E+03   # msR(MX)             
        49     5.00000000E+03   # mbR(MX)             
#
BLOCK MASS  # Mass Spectrum
# PDG code           mass       particle
        24     8.00966900E+01   # W+
        25     1.24751894E+02   # h
        35     3.00008018E+03   # H
        36     2.99999995E+03   # A
        37     3.00087291E+03   # H+
         5     4.87878001E+00   # b-quark pole mass calculated from mb(mb)_Msbar
   1000001     5.07062124E+03   # ~d_L
   2000001     5.05284632E+03   # ~d_R
   1000002     5.07014710E+03   # ~u_L
   2000002     5.05257416E+03   # ~u_R
   1000003     5.07062124E+03   # ~s_L
   2000003     5.05284632E+03   # ~s_R
   1000004     5.07014710E+03   # ~c_L
   2000004     5.05257416E+03   # ~c_R
   1000005     5.01689444E+03   # ~b_1
   2000005     5.05185959E+03   # ~b_2
   1000006     4.90843665E+03   # ~t_1
   2000006     5.06353665E+03   # ~t_2
   1000011     5.01904262E+03   # ~e_L
   2000011     5.00590673E+03   # ~e_R
   1000012     5.01809470E+03   # ~nu_eL
   1000013     5.01904262E+03   # ~mu_L
   2000013     5.00590673E+03   # ~mu_R
   1000014     5.01809470E+03   # ~nu_muL
   1000015     5.00425354E+03   # ~tau_1
   2000015     5.01912497E+03   # ~tau_2
   1000016     5.01755952E+03   # ~nu_tauL
   1000021     1.90000082E+03   # ~g
   1000022     6.03019354E+01   # ~chi_10
   1000023     1.69941343E+03   # ~chi_20
   1000025    -1.70202416E+03   # ~chi_30
   1000035     3.07436081E+03   # ~chi_40
   1000024     1.70000096E+03   # ~chi_1+
   1000037     3.07452839E+03   # ~chi_2+
#
BLOCK NMIX  # Neutralino Mixing Matrix
  1  1     9.99653914E-01   # N_11
  1  2     1.27096851E-04   # N_12
  1  3    -2.62434045E-02   # N_13
  1  4     1.82195109E-03   # N_14
  2  1     1.72653021E-02   # N_21
  2  2     3.53853196E-02   # N_22
  2  3     7.06866294E-01   # N_23
  2  4     7.06250544E-01   # N_24
  3  1    -1.98425003E-02   # N_31
  3  2     1.27027841E-02   # N_32
  3  3    -7.06678087E-01   # N_33
  3  4     7.07142840E-01   # N_34
  4  1    -4.86279899E-04   # N_41
  4  2     9.99293001E-01   # N_42
  4  3    -1.60439182E-02   # N_43
  4  4    -3.39978520E-02   # N_44
#
BLOCK UMIX  # Chargino Mixing Matrix U
  1  1     2.26846557E-02   # U_11
  1  2     9.99742670E-01   # U_12
  2  1    -9.99742670E-01   # U_21
  2  2     2.26846557E-02   # U_22
#
BLOCK VMIX  # Chargino Mixing Matrix V
  1  1     4.80817330E-02   # V_11
  1  2    -9.98843405E-01   # V_12
  2  1    -9.98843405E-01   # V_21
  2  2    -4.80817330E-02   # V_22
#
BLOCK STOPMIX  # Stop Mixing Matrix
  1  1    -5.13349511E-01   # cos(theta_t)
  1  2     8.58179631E-01   # sin(theta_t)
  2  1    -8.58179631E-01   # -sin(theta_t)
  2  2    -5.13349511E-01   # cos(theta_t)
#
BLOCK SBOTMIX  # Sbottom Mixing Matrix
  1  1     9.93154182E-01   # cos(theta_b)
  1  2    -1.16810833E-01   # sin(theta_b)
  2  1     1.16810833E-01   # -sin(theta_b)
  2  2     9.93154182E-01   # cos(theta_b)
#
BLOCK STAUMIX  # Stau Mixing Matrix
  1  1    -1.88882237E-01   # cos(theta_tau)
  1  2     9.81999746E-01   # sin(theta_tau)
  2  1    -9.81999746E-01   # -sin(theta_tau)
  2  2    -1.88882237E-01   # cos(theta_tau)
#
BLOCK ALPHA  # Higgs mixing
          -1.05458065E-01   # Mixing angle in the neutral Higgs boson sector
#
BLOCK HMIX Q=  5.00071003E+03  # DRbar Higgs Parameters
         1    -1.67258466E+03   # mu(Q)MSSM           
         2     9.47076194E+00   # tan                 
         3     2.42000802E+02   # higgs               
         4     8.36647782E+06   # mA^2(Q)MSSM         
#
BLOCK GAUGE Q=  5.00071003E+03  # The gauge couplings
     1     3.70675053E-01   # gprime(Q) DRbar
     2     6.31956120E-01   # g(Q) DRbar
     3     9.99247619E-01   # g3(Q) DRbar
#
BLOCK AU Q=  5.00071003E+03  # The trilinear couplings
  1  1     5.00000001E+03   # A_u(Q) DRbar
  2  2     5.00000001E+03   # A_c(Q) DRbar
  3  3     5.00000002E+03   # A_t(Q) DRbar
#
BLOCK AD Q=  5.00071003E+03  # The trilinear couplings
  1  1     5.00000001E+03   # A_d(Q) DRbar
  2  2     5.00000001E+03   # A_s(Q) DRbar
  3  3     5.00000001E+03   # A_b(Q) DRbar
#
BLOCK AE Q=  5.00071003E+03  # The trilinear couplings
  1  1     0.00000000E+00   # A_e(Q) DRbar
  2  2     1.61869420E-07   # A_mu(Q) DRbar
  3  3     1.61452302E-07   # A_tau(Q) DRbar
#
BLOCK Yu Q=  5.00071003E+03  # The Yukawa couplings
  1  1     0.00000000E+00   # y_u(Q) DRbar
  2  2     0.00000000E+00   # y_c(Q) DRbar
  3  3     8.19130295E-01   # y_t(Q) DRbar
#
BLOCK Yd Q=  5.00071003E+03  # The Yukawa couplings
  1  1     0.00000000E+00   # y_d(Q) DRbar
  2  2     0.00000000E+00   # y_s(Q) DRbar
  3  3     1.31417144E-01   # y_b(Q) DRbar
#
BLOCK Ye Q=  5.00071003E+03  # The Yukawa couplings
  1  1     0.00000000E+00   # y_e(Q) DRbar
  2  2     0.00000000E+00   # y_mu(Q) DRbar
  3  3     9.65567874E-02   # y_tau(Q) DRbar
#
BLOCK MSOFT Q=  5.00071003E+03  # The soft SUSY breaking masses at the scale Q
         1     6.00000000E+01   # M_1(Q)              
         2     3.00000000E+03   # M_2(Q)              
         3     1.57544000E+03   # M_3(Q)              
        21     5.86168376E+06   # mH1^2(Q)            
        22    -2.25636495E+06   # mH2^2(Q)            
        31     5.00000000E+03   # meL(Q)              
        32     5.00000000E+03   # mmuL(Q)             
        33     5.00000000E+03   # mtauL(Q)            
        34     5.00000000E+03   # meR(Q)              
        35     5.00000000E+03   # mmuR(Q)             
        36     5.00000000E+03   # mtauR(Q)            
        41     5.00000000E+03   # mqL1(Q)             
        42     5.00000000E+03   # mqL2(Q)             
        43     5.00000000E+03   # mqL3(Q)             
        44     5.00000000E+03   # muR(Q)              
        45     5.00000000E+03   # mcR(Q)              
        46     4.99999999E+03   # mtR(Q)              
        47     5.00000000E+03   # mdR(Q)              
        48     5.00000000E+03   # msR(Q)              
        49     5.00000000E+03   # mbR(Q)              
#
#
#
#                             =================
#                             |The decay table|
#                             =================
#
# - The QCD corrections to the decays gluino -> squark  + quark
#                                     squark -> gaugino + quark_prime
#                                     squark -> squark_prime + Higgs
#                                     squark -> gluino  + quark
#   are included.
#
# - The multi-body decays for the inos, stops and sbottoms are included.
#
# - The loop induced decays for the gluino, neutralinos and stops
#   are included.
#
# - The SUSY decays of the top quark are included.
#
#
#         PDG            Width
DECAY         6     1.39944913E+00   # top decays
#          BR         NDA      ID1       ID2
     1.00000000E+00    2           5        24   # BR(t ->  b    W+)
#
#         PDG            Width
DECAY   1000021     2.34869918E-04   # gluino decays
#          BR         NDA      ID1       ID2
     8.64496260E-06    2     1000022        21   # BR(~g -> ~chi_10 g)
     4.97624933E-04    2     1000023        21   # BR(~g -> ~chi_20 g)
     4.84630635E-04    2     1000025        21   # BR(~g -> ~chi_30 g)
#           BR         NDA      ID1       ID2       ID3
     7.63338894E-02    3     1000022         1        -1   # BR(~g -> ~chi_10 d  db)
     9.99522330E-08    3     1000023         1        -1   # BR(~g -> ~chi_20 d  db)
     9.86222336E-09    3     1000025         1        -1   # BR(~g -> ~chi_30 d  db)
     2.60227624E-01    3     1000022         2        -2   # BR(~g -> ~chi_10 u  ub)
     1.57579157E-07    3     1000023         2        -2   # BR(~g -> ~chi_20 u  ub)
     9.46646133E-09    3     1000025         2        -2   # BR(~g -> ~chi_30 u  ub)
     7.63338894E-02    3     1000022         3        -3   # BR(~g -> ~chi_10 s  sb)
     9.99522330E-08    3     1000023         3        -3   # BR(~g -> ~chi_20 s  sb)
     9.86222336E-09    3     1000025         3        -3   # BR(~g -> ~chi_30 s  sb)
     2.60227624E-01    3     1000022         4        -4   # BR(~g -> ~chi_10 c  cb)
     1.57579157E-07    3     1000023         4        -4   # BR(~g -> ~chi_20 c  cb)
     9.46646133E-09    3     1000025         4        -4   # BR(~g -> ~chi_30 c  cb)
     7.72379290E-02    3     1000022         5        -5   # BR(~g -> ~chi_10 b  bb)
     8.51680055E-06    3     1000023         5        -5   # BR(~g -> ~chi_20 b  bb)
     7.74829662E-06    3     1000025         5        -5   # BR(~g -> ~chi_30 b  bb)
     2.48627332E-01    3     1000022         6        -6   # BR(~g -> ~chi_10 t  tb)
     2.40442180E-07    3     1000024         1        -2   # BR(~g -> ~chi_1+ d  ub)
     2.40442180E-07    3    -1000024         2        -1   # BR(~g -> ~chi_1- u  db)
     2.40442180E-07    3     1000024         3        -4   # BR(~g -> ~chi_1+ s  cb)
     2.40442180E-07    3    -1000024         4        -3   # BR(~g -> ~chi_1- c  sb)
     1.51571000E-06    3     1000024         5        -6   # BR(~g -> ~chi_1+ b  tb)
     1.51571000E-06    3    -1000024         6        -5   # BR(~g -> ~chi_1- t  bb)
#
#         PDG            Width
DECAY   1000006     3.33291231E+02   # stop1 decays
#          BR         NDA      ID1       ID2
     2.63450235E-02    2     1000022         6   # BR(~t_1 -> ~chi_10 t )
     7.65965165E-02    2     1000023         6   # BR(~t_1 -> ~chi_20 t )
     7.35382368E-02    2     1000025         6   # BR(~t_1 -> ~chi_30 t )
     6.64289938E-03    2     1000035         6   # BR(~t_1 -> ~chi_40 t )
     1.09828604E-01    2     1000024         5   # BR(~t_1 -> ~chi_1+ b )
     1.31978280E-02    2     1000037         5   # BR(~t_1 -> ~chi_2+ b )
     6.93850892E-01    2     1000021         6   # BR(~t_1 -> ~g      t )
#
#         PDG            Width
DECAY   2000006     3.45416586E+02   # stop2 decays
#          BR         NDA      ID1       ID2
     1.03379256E-02    2     1000022         6   # BR(~t_2 -> ~chi_10 t )
     7.70328161E-02    2     1000023         6   # BR(~t_2 -> ~chi_20 t )
     8.02435490E-02    2     1000025         6   # BR(~t_2 -> ~chi_30 t )
     1.56842599E-02    2     1000035         6   # BR(~t_2 -> ~chi_40 t )
     4.77890782E-02    2     1000024         5   # BR(~t_2 -> ~chi_1+ b )
     3.11012060E-02    2     1000037         5   # BR(~t_2 -> ~chi_2+ b )
     7.34037816E-01    2     1000021         6   # BR(~t_2 -> ~g      t )
     8.25093189E-04    2     1000006        25   # BR(~t_2 -> ~t_1    h )
     2.94825581E-03    2     1000006        23   # BR(~t_2 -> ~t_1    Z )
#
#         PDG            Width
DECAY   1000005     3.22346026E+02   # sbottom1 decays
#          BR         NDA      ID1       ID2
     2.44153983E-03    2     1000022         5   # BR(~b_1 -> ~chi_10 b )
     2.21257413E-03    2     1000023         5   # BR(~b_1 -> ~chi_20 b )
     2.06192574E-03    2     1000025         5   # BR(~b_1 -> ~chi_30 b )
     2.31195157E-02    2     1000035         5   # BR(~b_1 -> ~chi_40 b )
     1.61003524E-01    2    -1000024         6   # BR(~b_1 -> ~chi_1- t )
     4.65995947E-02    2    -1000037         6   # BR(~b_1 -> ~chi_2- t )
     7.60865302E-01    2     1000021         5   # BR(~b_1 -> ~g      b )
     1.69602329E-03    2     1000006       -24   # BR(~b_1 -> ~t_1    W-)
#
#         PDG            Width
DECAY   2000005     2.54608258E+02   # sbottom2 decays
#          BR         NDA      ID1       ID2
     1.14755142E-02    2     1000022         5   # BR(~b_2 -> ~chi_10 b )
     2.62630587E-03    2     1000023         5   # BR(~b_2 -> ~chi_20 b )
     2.76746698E-03    2     1000025         5   # BR(~b_2 -> ~chi_30 b )
     4.33624494E-04    2     1000035         5   # BR(~b_2 -> ~chi_40 b )
     8.10126612E-03    2    -1000024         6   # BR(~b_2 -> ~chi_1- t )
     8.73424434E-04    2    -1000037         6   # BR(~b_2 -> ~chi_2- t )
     9.73595826E-01    2     1000021         5   # BR(~b_2 -> ~g      b )
     1.26571765E-04    2     1000006       -24   # BR(~b_2 -> ~t_1    W-)
#
#         PDG            Width
DECAY   1000002     2.73576417E+02   # sup_L decays
#          BR         NDA      ID1       ID2
     2.72780134E-03    2     1000022         2   # BR(~u_L -> ~chi_10 u)
     8.46068095E-05    2     1000023         2   # BR(~u_L -> ~chi_20 u)
     4.38060298E-06    2     1000025         2   # BR(~u_L -> ~chi_30 u)
     2.86181273E-02    2     1000035         2   # BR(~u_L -> ~chi_40 u)
     2.60333526E-04    2     1000024         1   # BR(~u_L -> ~chi_1+ d)
     5.71884448E-02    2     1000037         1   # BR(~u_L -> ~chi_2+ d)
     9.11116306E-01    2     1000021         2   # BR(~u_L -> ~g      u)
#
#         PDG            Width
DECAY   2000002     2.59720156E+02   # sup_R decays
#          BR         NDA      ID1       ID2
     4.57527070E-02    2     1000022         2   # BR(~u_R -> ~chi_10 u)
     1.07583921E-05    2     1000023         2   # BR(~u_R -> ~chi_20 u)
     1.41988094E-05    2     1000025         2   # BR(~u_R -> ~chi_30 u)
     4.31681626E-09    2     1000035         2   # BR(~u_R -> ~chi_40 u)
     9.54222331E-01    2     1000021         2   # BR(~u_R -> ~g      u)
#
#         PDG            Width
DECAY   1000001     2.73591843E+02   # sdown_L decays
#          BR         NDA      ID1       ID2
     2.72081900E-03    2     1000022         1   # BR(~d_L -> ~chi_10 d)
     5.77051433E-05    2     1000023         1   # BR(~d_L -> ~chi_20 d)
     1.54741506E-05    2     1000025         1   # BR(~d_L -> ~chi_30 d)
     2.86362686E-02    2     1000035         1   # BR(~d_L -> ~chi_40 d)
     5.79523583E-05    2    -1000024         2   # BR(~d_L -> ~chi_1- u)
     5.73059719E-02    2    -1000037         2   # BR(~d_L -> ~chi_2- u)
     9.11205809E-01    2     1000021         1   # BR(~d_L -> ~g      d)
#
#         PDG            Width
DECAY   2000001     2.50825425E+02   # sdown_R decays
#          BR         NDA      ID1       ID2
     1.18444405E-02    2     1000022         1   # BR(~d_R -> ~chi_10 d)
     2.78520325E-06    2     1000023         1   # BR(~d_R -> ~chi_20 d)
     3.67588144E-06    2     1000025         1   # BR(~d_R -> ~chi_30 d)
     1.11767542E-09    2     1000035         1   # BR(~d_R -> ~chi_40 d)
     9.88149097E-01    2     1000021         1   # BR(~d_R -> ~g      d)
#
#         PDG            Width
DECAY   1000004     2.73576417E+02   # scharm_L decays
#          BR         NDA      ID1       ID2
     2.72780134E-03    2     1000022         4   # BR(~c_L -> ~chi_10 c)
     8.46068095E-05    2     1000023         4   # BR(~c_L -> ~chi_20 c)
     4.38060298E-06    2     1000025         4   # BR(~c_L -> ~chi_30 c)
     2.86181273E-02    2     1000035         4   # BR(~c_L -> ~chi_40 c)
     2.60333526E-04    2     1000024         3   # BR(~c_L -> ~chi_1+ s)
     5.71884448E-02    2     1000037         3   # BR(~c_L -> ~chi_2+ s)
     9.11116306E-01    2     1000021         4   # BR(~c_L -> ~g      c)
#
#         PDG            Width
DECAY   2000004     2.59720156E+02   # scharm_R decays
#          BR         NDA      ID1       ID2
     4.57527070E-02    2     1000022         4   # BR(~c_R -> ~chi_10 c)
     1.07583921E-05    2     1000023         4   # BR(~c_R -> ~chi_20 c)
     1.41988094E-05    2     1000025         4   # BR(~c_R -> ~chi_30 c)
     4.31681626E-09    2     1000035         4   # BR(~c_R -> ~chi_40 c)
     9.54222331E-01    2     1000021         4   # BR(~c_R -> ~g      c)
#
#         PDG            Width
DECAY   1000003     2.73591843E+02   # sstrange_L decays
#          BR         NDA      ID1       ID2
     2.72081900E-03    2     1000022         3   # BR(~s_L -> ~chi_10 s)
     5.77051433E-05    2     1000023         3   # BR(~s_L -> ~chi_20 s)
     1.54741506E-05    2     1000025         3   # BR(~s_L -> ~chi_30 s)
     2.86362686E-02    2     1000035         3   # BR(~s_L -> ~chi_40 s)
     5.79523583E-05    2    -1000024         4   # BR(~s_L -> ~chi_1- c)
     5.73059719E-02    2    -1000037         4   # BR(~s_L -> ~chi_2- c)
     9.11205809E-01    2     1000021         3   # BR(~s_L -> ~g      s)
#
#         PDG            Width
DECAY   2000003     2.50825425E+02   # sstrange_R decays
#          BR         NDA      ID1       ID2
     1.18444405E-02    2     1000022         3   # BR(~s_R -> ~chi_10 s)
     2.78520325E-06    2     1000023         3   # BR(~s_R -> ~chi_20 s)
     3.67588144E-06    2     1000025         3   # BR(~s_R -> ~chi_30 s)
     1.11767542E-09    2     1000035         3   # BR(~s_R -> ~chi_40 s)
     9.88149097E-01    2     1000021         3   # BR(~s_R -> ~g      s)
#
#         PDG            Width
DECAY   1000011     3.02292532E+01   # selectron_L decays
#          BR         NDA      ID1       ID2
     2.26799731E-01    2     1000022        11   # BR(~e_L -> ~chi_10 e-)
     1.07092706E-03    2     1000023        11   # BR(~e_L -> ~chi_20 e-)
     5.84984012E-07    2     1000025        11   # BR(~e_L -> ~chi_30 e-)
     2.56969242E-01    2     1000035        11   # BR(~e_L -> ~chi_40 e-)
     5.32008573E-04    2    -1000024        12   # BR(~e_L -> ~chi_1- nu_e)
     5.14627506E-01    2    -1000037        12   # BR(~e_L -> ~chi_2- nu_e)
#
#         PDG            Width
DECAY   2000011     2.73550927E+01   # selectron_R decays
#          BR         NDA      ID1       ID2
     9.99458373E-01    2     1000022        11   # BR(~e_R -> ~chi_10 e-)
     2.33444207E-04    2     1000023        11   # BR(~e_R -> ~chi_20 e-)
     3.08091389E-04    2     1000025        11   # BR(~e_R -> ~chi_30 e-)
     9.17687036E-08    2     1000035        11   # BR(~e_R -> ~chi_40 e-)
#
#         PDG            Width
DECAY   1000013     3.02292532E+01   # smuon_L decays
#          BR         NDA      ID1       ID2
     2.26799731E-01    2     1000022        13   # BR(~mu_L -> ~chi_10 mu-)
     1.07092706E-03    2     1000023        13   # BR(~mu_L -> ~chi_20 mu-)
     5.84984012E-07    2     1000025        13   # BR(~mu_L -> ~chi_30 mu-)
     2.56969242E-01    2     1000035        13   # BR(~mu_L -> ~chi_40 mu-)
     5.32008573E-04    2    -1000024        14   # BR(~mu_L -> ~chi_1- nu_mu)
     5.14627506E-01    2    -1000037        14   # BR(~mu_L -> ~chi_2- nu_mu)
#
#         PDG            Width
DECAY   2000013     2.73550927E+01   # smuon_R decays
#          BR         NDA      ID1       ID2
     9.99458373E-01    2     1000022        13   # BR(~mu_R -> ~chi_10 mu-)
     2.33444207E-04    2     1000023        13   # BR(~mu_R -> ~chi_20 mu-)
     3.08091389E-04    2     1000025        13   # BR(~mu_R -> ~chi_30 mu-)
     9.17687036E-08    2     1000035        13   # BR(~mu_R -> ~chi_40 mu-)
#
#         PDG            Width
DECAY   1000015     2.89018410E+01   # stau_1 decays
#          BR         NDA      ID1       ID2
     9.21226261E-01    2     1000022        15   # BR(~tau_1 -> ~chi_10  tau-)
     1.35825318E-02    2     1000023        15   # BR(~tau_1 -> ~chi_20  tau-)
     1.20813109E-02    2     1000025        15   # BR(~tau_1 -> ~chi_30  tau-)
     9.15327313E-03    2     1000035        15   # BR(~tau_1 -> ~chi_40  tau-)
     2.56248973E-02    2    -1000024        16   # BR(~tau_1 -> ~chi_1-  nu_tau)
     1.83317264E-02    2    -1000037        16   # BR(~tau_1 -> ~chi_2-  nu_tau)
#
#         PDG            Width
DECAY   2000015     3.08506471E+01   # stau_2 decays
#          BR         NDA      ID1       ID2
     2.45232459E-01    2     1000022        15   # BR(~tau_2 -> ~chi_10  tau-)
     1.21137554E-02    2     1000023        15   # BR(~tau_2 -> ~chi_20  tau-)
     1.25126519E-02    2     1000025        15   # BR(~tau_2 -> ~chi_30  tau-)
     2.43149826E-01    2     1000035        15   # BR(~tau_2 -> ~chi_40  tau-)
     4.38028784E-05    2    -1000024        16   # BR(~tau_2 -> ~chi_1-  nu_tau)
     4.86947504E-01    2    -1000037        16   # BR(~tau_2 -> ~chi_2-  nu_tau)
#
#         PDG            Width
DECAY   1000012     3.02309162E+01   # snu_eL decays
#          BR         NDA      ID1       ID2
     2.26547888E-01    2     1000022        12   # BR(~nu_eL -> ~chi_10 nu_e)
     3.29733204E-04    2     1000023        12   # BR(~nu_eL -> ~chi_20 nu_e)
     3.05984970E-04    2     1000025        12   # BR(~nu_eL -> ~chi_30 nu_e)
     2.57083356E-01    2     1000035        12   # BR(~nu_eL -> ~chi_40 nu_e)
     2.38927434E-03    2     1000024        11   # BR(~nu_eL -> ~chi_1+ e-)
     5.13343763E-01    2     1000037        11   # BR(~nu_eL -> ~chi_2+ e-)
#
#         PDG            Width
DECAY   1000014     3.02309162E+01   # snu_muL decays
#          BR         NDA      ID1       ID2
     2.26547888E-01    2     1000022        14   # BR(~nu_muL -> ~chi_10 nu_mu)
     3.29733204E-04    2     1000023        14   # BR(~nu_muL -> ~chi_20 nu_mu)
     3.05984970E-04    2     1000025        14   # BR(~nu_muL -> ~chi_30 nu_mu)
     2.57083356E-01    2     1000035        14   # BR(~nu_muL -> ~chi_40 nu_mu)
     2.38927434E-03    2     1000024        13   # BR(~nu_muL -> ~chi_1+ mu-)
     5.13343763E-01    2     1000037        13   # BR(~nu_muL -> ~chi_2+ mu-)
#
#         PDG            Width
DECAY   1000016     3.09508200E+01   # snu_tauL decays
#          BR         NDA      ID1       ID2
     2.21254860E-01    2     1000022        16   # BR(~nu_tauL -> ~chi_10 nu_tau)
     3.22011593E-04    2     1000023        16   # BR(~nu_tauL -> ~chi_20 nu_tau)
     2.98819431E-04    2     1000025        16   # BR(~nu_tauL -> ~chi_30 nu_tau)
     2.51012552E-01    2     1000035        16   # BR(~nu_tauL -> ~chi_40 nu_tau)
     2.58868948E-02    2     1000024        15   # BR(~nu_tauL -> ~chi_1+ tau-)
     5.01224862E-01    2     1000037        15   # BR(~nu_tauL -> ~chi_2+ tau-)
#
#         PDG            Width
DECAY   1000024     1.04792629E+00   # chargino1+ decays
#          BR         NDA      ID1       ID2
     1.00000000E+00    2     1000022        24   # BR(~chi_1+ -> ~chi_10  W+)
#
#         PDG            Width
DECAY   1000037     1.73639933E+01   # chargino2+ decays
#          BR         NDA      ID1       ID2
     2.52444102E-01    2     1000024        23   # BR(~chi_2+ -> ~chi_1+  Z )
     3.15270203E-04    2     1000022        24   # BR(~chi_2+ -> ~chi_10  W+)
     2.44284107E-01    2     1000023        24   # BR(~chi_2+ -> ~chi_20  W+)
     2.43410214E-01    2     1000025        24   # BR(~chi_2+ -> ~chi_30  W+)
     2.59546104E-01    2     1000024        25   # BR(~chi_2+ -> ~chi_1+  h )
     2.02989184E-07    2     1000022        37   # BR(~chi_2+ -> ~chi_10  H+)
#
#         PDG            Width
DECAY   1000022     0.00000000E+00   # neutralino1 decays
#
#         PDG            Width
DECAY   1000023     1.10250041E+00   # neutralino2 decays
#          BR         NDA      ID1       ID2
     5.60640199E-01    2     1000022        23   # BR(~chi_20 -> ~chi_10   Z )
     4.39359801E-01    2     1000022        25   # BR(~chi_20 -> ~chi_10   h )
#
#         PDG            Width
DECAY   1000025     1.11456868E+00   # neutralino3 decays
#          BR         NDA      ID1       ID2
     4.21121460E-01    2     1000022        23   # BR(~chi_30 -> ~chi_10   Z )
     5.78878540E-01    2     1000022        25   # BR(~chi_30 -> ~chi_10   h )
#
#         PDG            Width
DECAY   1000035     1.73509621E+01   # neutralino4 decays
#          BR         NDA      ID1       ID2
     1.25298098E-04    2     1000022        23   # BR(~chi_40 -> ~chi_10   Z )
     2.90810477E-02    2     1000023        23   # BR(~chi_40 -> ~chi_20   Z )
     2.23115013E-01    2     1000025        23   # BR(~chi_40 -> ~chi_30   Z )
     2.44084214E-01    2     1000024       -24   # BR(~chi_40 -> ~chi_1+   W-)
     2.44084214E-01    2    -1000024        24   # BR(~chi_40 -> ~chi_1-   W+)
     1.99653446E-04    2     1000022        25   # BR(~chi_40 -> ~chi_10   h )
     1.78782532E-07    2     1000022        35   # BR(~chi_40 -> ~chi_10   H )
     3.18408912E-08    2     1000022        36   # BR(~chi_40 -> ~chi_10   A )
     2.30359816E-01    2     1000023        25   # BR(~chi_40 -> ~chi_20   h )
     2.89505340E-02    2     1000025        25   # BR(~chi_40 -> ~chi_30   h )
#
#         PDG            Width
DECAY        25     4.03946859E-03   # h decays
#          BR         NDA      ID1       ID2
     6.07105943E-01    2           5        -5   # BR(h -> b       bb     )
     6.41913995E-02    2         -15        15   # BR(h -> tau+    tau-   )
     2.27260989E-04    2         -13        13   # BR(h -> mu+     mu-    )
     4.81796726E-04    2           3        -3   # BR(h -> s       sb     )
     2.08793959E-02    2           4        -4   # BR(h -> c       cb     )
     6.75141680E-02    2          21        21   # BR(h -> g       g      )
     2.32104077E-03    2          22        22   # BR(h -> gam     gam    )
     1.49469258E-03    2          22        23   # BR(h -> Z       gam    )
     2.10658175E-01    2          24       -24   # BR(h -> W+      W-     )
     2.50992276E-02    2          23        23   # BR(h -> Z       Z      )
     2.69002483E-05    2     1000022   1000022   # BR(h -> ~chi_10 ~chi_10)
#
#         PDG            Width
DECAY        35     6.90203812E+00   # H decays
#          BR         NDA      ID1       ID2
     4.75023023E-01    2           5        -5   # BR(H -> b       bb     )
     8.07326832E-02    2         -15        15   # BR(H -> tau+    tau-   )
     2.85477180E-04    2         -13        13   # BR(H -> mu+     mu-    )
     3.49951319E-04    2           3        -3   # BR(H -> s       sb     )
     1.95654357E-06    2           4        -4   # BR(H -> c       cb     )
     1.95474197E-01    2           6        -6   # BR(H -> t       tb     )
     6.48646259E-05    2          21        21   # BR(H -> g       g      )
     3.83182493E-07    2          22        22   # BR(H -> gam     gam    )
     1.15446117E-07    2          23        22   # BR(H -> Z       gam    )
     8.61872313E-05    2          24       -24   # BR(H -> W+      W-     )
     4.30390768E-05    2          23        23   # BR(H -> Z       Z      )
     3.28053049E-04    2          25        25   # BR(H -> h       h      )
    -2.39126379E-23    2          36        36   # BR(H -> A       A      )
     5.38363030E-19    2          23        36   # BR(H -> Z       A      )
     7.24385495E-04    2     1000022   1000022   # BR(H -> ~chi_10 ~chi_10)
     1.45900739E-01    2     1000022   1000023   # BR(H -> ~chi_10 ~chi_20)
     1.00984945E-01    2     1000022   1000025   # BR(H -> ~chi_10 ~chi_30)
#
#         PDG            Width
DECAY        36     6.90497613E+00   # A decays
#          BR         NDA      ID1       ID2
     4.74979555E-01    2           5        -5   # BR(A -> b       bb     )
     8.07007190E-02    2         -15        15   # BR(A -> tau+    tau-   )
     2.85363753E-04    2         -13        13   # BR(A -> mu+     mu-    )
     3.50067838E-04    2           3        -3   # BR(A -> s       sb     )
     1.96393499E-06    2           4        -4   # BR(A -> c       cb     )
     1.96104401E-01    2           6        -6   # BR(A -> t       tb     )
     1.94079142E-04    2          21        21   # BR(A -> g       g      )
     3.50094854E-07    2          22        22   # BR(A -> gam     gam    )
     2.35124492E-07    2          23        22   # BR(A -> Z       gam    )
     8.58252592E-05    2          23        25   # BR(A -> Z       h      )
     7.46878665E-04    2     1000022   1000022   # BR(A -> ~chi_10 ~chi_10)
     1.02143774E-01    2     1000022   1000023   # BR(A -> ~chi_10 ~chi_20)
     1.44406788E-01    2     1000022   1000025   # BR(A -> ~chi_10 ~chi_30)
#
#         PDG            Width
DECAY        37     6.91066916E+00   # H+ decays
#          BR         NDA      ID1       ID2
     7.64946687E-04    2           4        -5   # BR(H+ -> c       bb     )
     8.06577011E-02    2         -15        16   # BR(H+ -> tau+    nu_tau )
     2.85211639E-04    2         -13        14   # BR(H+ -> mu+     nu_mu  )
     4.89563388E-06    2           2        -5   # BR(H+ -> u       bb     )
     1.67356251E-05    2           2        -3   # BR(H+ -> u       sb     )
     3.46093026E-04    2           4        -3   # BR(H+ -> c       sb     )
     6.69925202E-01    2           6        -5   # BR(H+ -> t       bb     )
     8.58845014E-05    2          24        25   # BR(H+ -> W+      h      )
     9.64143119E-14    2          24        36   # BR(H+ -> W+      A      )
     2.47913330E-01    2     1000024   1000022   # BR(H+ -> ~chi_1+ ~chi_10)
