#
#                              ======================
#                              | THE SUSYHIT OUTPUT |
#                              ======================
#
#
#              ------------------------------------------------------
#              |     This is the output of the SUSY-HIT package     |
#              |  created by A.Djouadi, M.Muehlleitner and M.Spira. |
#              |  In case of problems with SUSY-HIT email to        |
#              |           margarete.muehlleitner@cern.ch           |
#              |           michael.spira@psi.ch                     |
#              |           abdelhak.djouadi@cern.ch                 |
#              ------------------------------------------------------
#
#              ------------------------------------------------------
#              |  SUSY Les Houches Accord - MSSM Spectrum + Decays  |
#              |              based on the decay programs           |
#              |                                                    |
#              |                     SDECAY 1.3b                    |
#              |                                                    |
#              |  Authors: M.Muhlleitner, A.Djouadi and Y.Mambrini  |
#              |  Ref.:    Comput.Phys.Commun.168(2005)46           |
#              |           [hep-ph/0311167]                         |
#              |                                                    |
#              |                     HDECAY 3.4                     |
#              |                                                    |
#              |  By: A.Djouadi,J.Kalinowski,M.Muhlleitner,M.Spira  |
#              |  Ref.:    Comput.Phys.Commun.108(1998)56           |
#              |           [hep-ph/9704448]                         |
#              |                                                    |
#              |                                                    |
#              |  If not stated otherwise all DRbar couplings and   |
#              |  soft SUSY breaking masses are given at the scale  |
#              |  Q=  0.91187600E+02
#              |                                                    |
#              ------------------------------------------------------
#
#
BLOCK DCINFO  # Decay Program information
     1   SDECAY/HDECAY # decay calculator
     2   1.3b  /3.4    # version number
#
BLOCK SPINFO  # Spectrum calculator information
     1   SuSpect     # RGE +Spectrum calculator            
     2   2.41         # version number                     
#
BLOCK MODSEL  # Model selection
     1     0   # #general MSSM low scale                           
#
BLOCK SMINPUTS  # Standard Model inputs
         1     1.27934000E+02   # alpha_em^-1(M_Z)^MSbar
         2     1.16639000E-05   # G_F [GeV^-2]
         3     1.17200000E-01   # alpha_S(M_Z)^MSbar
         4     9.11870000E+01   # M_Z pole mass
         5     4.25000000E+00   # mb(mb)^MSbar
         6     1.72500000E+02   # mt pole mass
         7     1.77700000E+00   # mtau pole mass
#
BLOCK MINPAR  # Input parameters - minimal models
#
BLOCK EXTPAR  # Input parameters - non-minimal models
         0     9.11876000E+01   # EWSB                
         1     7.00000000E+02   # M_1                 
         2     1.00000000E+05   # M_2                 
         3     1.00000000E+05   # M_3                 
        11     0.00000000E+00   # A_t                 
        12     0.00000000E+00   # A_b                 
        13     0.00000000E+00   # A_tau               
        14     0.00000000E+00   # A_u                 
        15     0.00000000E+00   # A_d                 
        16     0.00000000E+00   # A_e                 
        23     3.50000000E+03   # mu(EWSB)            
        25     1.50000000E+00   # tanbeta(in)         
        26     2.00000000E+03   # MA_pole             
        31     1.00000000E+05   # M_eL                
        32     1.00000000E+05   # M_muL               
        33     1.00000000E+05   # M_tauL              
        34     1.00000000E+05   # M_eR                
        35     1.00000000E+05   # M_muR               
        36     1.00000000E+05   # M_tauR              
        41     8.00000000E+02   # M_q1L               
        42     8.00000000E+02   # M_q2L               
        43     8.00000000E+02   # M_q3L               
        44     1.00000000E+05   # M_uR                
        45     1.00000000E+05   # M_cR                
        46     1.00000000E+05   # M_tR                
        47     8.00000000E+02   # M_dR                
        48     8.00000000E+02   # M_sR                
        49     8.00000000E+02   # M_bR                
#
BLOCK MASS  # Mass Spectrum
# PDG code           mass       particle
        24     8.05804147E+01   # W+
        25     1.25000000E+02   # h
        35     2.00386934E+03   # H
        36     2.00000000E+03   # A
        37     2.02370767E+03   # H+
         5     4.87877839E+00   # b-quark pole mass calculated from mb(mb)_Msbar
   1000001     8.00833681E+02   # ~d_L
   2000001     8.00159967E+02   # ~d_R
   1000002     7.99325583E+02   # ~u_L
   2000002     9.99999974E+04   # ~u_R
   1000003     8.00833681E+02   # ~s_L
   2000003     8.00159967E+02   # ~s_R
   1000004     7.99325583E+02   # ~c_L
   2000004     9.99999974E+04   # ~c_R
   1000005     7.91995515E+02   # ~b_1
   2000005     8.08917149E+02   # ~b_2
   1000006     8.12793207E+02   # ~t_1
   2000006     1.00000106E+05   # ~t_2
   1000011     1.00000004E+05   # ~e_L
   2000011     1.00000004E+05   # ~e_R
   1000012     9.99999920E+04   # ~nu_eL
   1000013     1.00000004E+05   # ~mu_L
   2000013     1.00000004E+05   # ~mu_R
   1000014     9.99999920E+04   # ~nu_muL
   1000015     9.99999574E+04   # ~tau_1
   2000015     1.00000051E+05   # ~tau_2
   1000016     9.99999920E+04   # ~nu_tauL
   1000021     1.00000000E+05   # ~g
   1000022     6.99332796E+02   # ~chi_10
   1000023    -3.50002062E+03   # ~chi_20
   1000025     3.50062297E+03   # ~chi_30
   1000035     1.00000065E+05   # ~chi_40
   1000024     3.49993981E+03   # ~chi_1+
   1000037     1.00000065E+05   # ~chi_2+
   1000039     1.00000000E-09   # ~gravitino
#
BLOCK NMIX  # Neutralino Mixing Matrix
  1  1     9.99875463E-01   # N_11
  1  2    -1.19094568E-05   # N_12
  1  3     1.25367131E-02   # N_13
  1  4    -9.58586467E-03   # N_14
  2  1     2.08658753E-03   # N_21
  2  2    -1.50102171E-04   # N_22
  2  3    -7.07094821E-01   # N_23
  2  4    -7.07115647E-01   # N_24
  3  1     1.56430254E-02   # N_31
  3  2     8.04804258E-04   # N_32
  3  3    -7.07007447E-01   # N_33
  3  4     7.07032614E-01   # N_34
  4  1     3.68399133E-07   # N_41
  4  2    -9.99999665E-01   # N_42
  4  3    -4.63015597E-04   # N_43
  4  4     6.75276840E-04   # N_44
#
BLOCK UMIX  # Chargino Mixing Matrix U
  1  1    -6.54802730E-04   # U_11
  1  2     9.99999786E-01   # U_12
  2  1     9.99999786E-01   # U_21
  2  2     6.54802730E-04   # U_22
#
BLOCK VMIX  # Chargino Mixing Matrix V
  1  1    -9.54985578E-04   # V_11
  1  2     9.99999544E-01   # V_12
  2  1     9.99999544E-01   # V_21
  2  2     9.54985578E-04   # V_22
#
BLOCK STOPMIX  # Stop Mixing Matrix
  1  1     9.99999999E-01   # cos(theta_t)
  1  2     4.47213589E-05   # sin(theta_t)
  2  1    -4.47213589E-05   # -sin(theta_t)
  2  2     9.99999999E-01   # cos(theta_t)
#
BLOCK SBOTMIX  # Sbottom Mixing Matrix
  1  1     6.92886782E-01   # cos(theta_b)
  1  2     7.21046397E-01   # sin(theta_b)
  2  1    -7.21046397E-01   # -sin(theta_b)
  2  2     6.92886782E-01   # cos(theta_b)
#
BLOCK STAUMIX  # Stau Mixing Matrix
  1  1     7.06066896E-01   # cos(theta_tau)
  1  2     7.08145139E-01   # sin(theta_tau)
  2  1    -7.08145139E-01   # -sin(theta_tau)
  2  2     7.06066896E-01   # cos(theta_tau)
#
BLOCK ALPHA  # Higgs mixing
          -5.90185985E-01   # Mixing angle in the neutral Higgs boson sector
#
BLOCK HMIX Q=  9.11876000E+01  # DRbar Higgs Parameters
         1     3.50000000E+03   # mu(Q)               
         2     1.49999982E+00   # tanbeta(Q)          
         3     2.54854827E+02   # vev(Q)              
         4    -6.86014797E+07   # MA^2(Q)             
#
BLOCK GAUGE Q=  9.11876000E+01  # The gauge couplings
     1     3.50655675E-01   # gprime(Q) DRbar
     2     6.21613232E-01   # g(Q) DRbar
     3     1.03156195E+00   # g3(Q) DRbar
#
BLOCK AU Q=  9.11876000E+01  # The trilinear couplings
  1  1     0.00000000E+00   # A_u(Q) DRbar
  2  2     0.00000000E+00   # A_c(Q) DRbar
  3  3     0.00000000E+00   # A_t(Q) DRbar
#
BLOCK AD Q=  9.11876000E+01  # The trilinear couplings
  1  1     0.00000000E+00   # A_d(Q) DRbar
  2  2     0.00000000E+00   # A_s(Q) DRbar
  3  3     0.00000000E+00   # A_b(Q) DRbar
#
BLOCK AE Q=  9.11876000E+01  # The trilinear couplings
  1  1     0.00000000E+00   # A_e(Q) DRbar
  2  2     0.00000000E+00   # A_mu(Q) DRbar
  3  3     0.00000000E+00   # A_tau(Q) DRbar
#
BLOCK Yu Q=  9.11876000E+01  # The Yukawa couplings
  1  1     0.00000000E+00   # y_u(Q) DRbar
  2  2     0.00000000E+00   # y_c(Q) DRbar
  3  3     9.82957611E-01   # y_t(Q) DRbar
#
BLOCK Yd Q=  9.11876000E+01  # The Yukawa couplings
  1  1     0.00000000E+00   # y_d(Q) DRbar
  2  2     0.00000000E+00   # y_s(Q) DRbar
  3  3     2.57893196E-02   # y_b(Q) DRbar
#
BLOCK Ye Q=  9.11876000E+01  # The Yukawa couplings
  1  1     0.00000000E+00   # y_e(Q) DRbar
  2  2     0.00000000E+00   # y_mu(Q) DRbar
  3  3     1.77393338E-02   # y_tau(Q) DRbar
#
BLOCK MSOFT Q=  9.11876000E+01  # The soft SUSY breaking masses at the scale Q
         1     7.00000000E+02   # M_1                 
         2     1.00000000E+05   # M_2                 
         3     1.00000000E+05   # M_3                 
        14     0.00000000E+00   # A_u                 
        15     0.00000000E+00   # A_d                 
        16     0.00000000E+00   # A_e                 
        21     6.36540031E+08   # M^2_Hd              
        22    -1.14035773E+09   # M^2_Hu              
        31     1.00000000E+05   # M_eL                
        32     1.00000000E+05   # M_muL               
        33     1.00000000E+05   # M_tauL              
        34     1.00000000E+05   # M_eR                
        35     1.00000000E+05   # M_muR               
        36     1.00000000E+05   # M_tauR              
        41     8.00000000E+02   # M_q1L               
        42     8.00000000E+02   # M_q2L               
        43     8.00000000E+02   # M_q3L               
        44     1.00000000E+05   # M_uR                
        45     1.00000000E+05   # M_cR                
        46     1.00000000E+05   # M_tR                
        47     8.00000000E+02   # M_dR                
        48     8.00000000E+02   # M_sR                
        49     8.00000000E+02   # M_bR                
#
#
#
#                             =================
#                             |The decay table|
#                             =================
#
# - The QCD corrections to the decays gluino -> squark  + quark
#                                     squark -> gaugino + quark_prime
#                                     squark -> squark_prime + Higgs
#                                     squark -> gluino  + quark
#   are included.
#
# - The multi-body decays for the inos, stops and sbottoms are included.
#
# - The loop induced decays for the gluino, neutralinos and stops
#   are included.
#
# - The SUSY decays of the top quark are included.
#
# - Possible decays of the NLSP in GMSB models are included.
#
#
#         PDG            Width
DECAY         6     1.33376420E+00   # top decays
#          BR         NDA      ID1       ID2
     1.00000000E+00    2           5        24   # BR(t ->  b    W+)
#
#         PDG            Width
DECAY   1000021     1.E-04   # gluino decays (OJ Mods)
#          BR         NDA      ID1       ID2
    -1.58928565E-04    2     1000001        -1   # BR(~g -> ~d_L  db)
    -1.58928565E-04    2    -1000001         1   # BR(~g -> ~d_L* d )
    -1.58928599E-04    2     2000001        -1   # BR(~g -> ~d_R  db)
    -1.58928599E-04    2    -2000001         1   # BR(~g -> ~d_R* d )
    -1.58928642E-04    2     1000002        -2   # BR(~g -> ~u_L  ub)
    -1.58928642E-04    2    -1000002         2   # BR(~g -> ~u_L* u )
    -4.29797958E-19    2     2000002        -2   # BR(~g -> ~u_R  ub)
    -4.29797958E-19    2    -2000002         2   # BR(~g -> ~u_R* u )
    -1.58928565E-04    2     1000003        -3   # BR(~g -> ~s_L  sb)
    -1.58928565E-04    2    -1000003         3   # BR(~g -> ~s_L* s )
    -1.58928599E-04    2     2000003        -3   # BR(~g -> ~s_R  sb)
    -1.58928599E-04    2    -2000003         3   # BR(~g -> ~s_R* s )
    -1.58928642E-04    2     1000004        -4   # BR(~g -> ~c_L  cb)
    -1.58928642E-04    2    -1000004         4   # BR(~g -> ~c_L* c )
    -4.29797958E-19    2     2000004        -4   # BR(~g -> ~c_R  cb)
    -4.29797958E-19    2    -2000004         4   # BR(~g -> ~c_R* c )
     2.51342440E-01    2     1000005        -5   # BR(~g -> ~b_1  bb)
     2.51342440E-01    2    -1000005         5   # BR(~g -> ~b_1* b )
     2.51982885E-01    2     2000005        -5   # BR(~g -> ~b_2  bb)
     2.51982885E-01    2    -2000005         5   # BR(~g -> ~b_2* b )
    -1.56377902E-04    2     1000006        -6   # BR(~g -> ~t_1  tb)
    -1.56377902E-04    2    -1000006         6   # BR(~g -> ~t_1* t )
    -4.43075127E-03    2     1000039        21   # BR(~g -> ~G g)
#
#         PDG            Width
DECAY   1000006     8.51406584E-04   # stop1 decays
#          BR         NDA      ID1       ID2
     9.87451471E-01    2     1000022         4   # BR(~t_1 -> ~chi_10 c )
     7.61295126E-03    2     1000022         2   # BR(~t_1 -> ~chi_10 u )
#           BR         NDA      ID1       ID2       ID3
     2.52587813E-04    3     1000022         5        24   # BR(~t_1 -> ~chi_10  b  W+)
     1.56680765E-03    3     1000005        -1         2   # BR(~t_1 -> ~b_1     db u)
     3.79138160E-07    3     2000005        -1         2   # BR(~t_1 -> ~b_2     db u)
     1.56680765E-03    3     1000005        -3         4   # BR(~t_1 -> ~b_1     sb c)
     3.79138160E-07    3     2000005        -3         4   # BR(~t_1 -> ~b_2     sb c)
     5.03779373E-04    3     1000005       -15        16   # BR(~t_1 -> ~b_1     tau+ nu_tau)
     4.55126725E-08    3     2000005       -15        16   # BR(~t_1 -> ~b_2     tau+ nu_tau)
     5.22269216E-04    3     1000005       -11        12   # BR(~t_1 -> ~b_1     e+   nu_e)
     1.26379387E-07    3     2000005       -11        12   # BR(~t_1 -> ~b_2     e+   nu_e)
     5.22269216E-04    3     1000005       -13        14   # BR(~t_1 -> ~b_1     mu+  nu_mu)
     1.26379387E-07    3     2000005       -13        14   # BR(~t_1 -> ~b_2     mu+  nu_mu)
#
#         PDG            Width
DECAY   2000006    -1.21836678E+06   # stop2 decays
#          BR         NDA      ID1       ID2
    -1.70993909E-04    2     1000022         6   # BR(~t_2 -> ~chi_10 t )
    -4.04538560E-04    2     1000023         6   # BR(~t_2 -> ~chi_20 t )
    -4.04477481E-04    2     1000025         6   # BR(~t_2 -> ~chi_30 t )
     1.00096525E+00    2     1000024         5   # BR(~t_2 -> ~chi_1+ b )
     1.13070261E-05    2     1000006        25   # BR(~t_2 -> ~t_1    h )
    -1.18269684E-05    2     1000006        35   # BR(~t_2 -> ~t_1    H )
    -1.18072439E-05    2     1000006        36   # BR(~t_2 -> ~t_1    A )
    -1.11163755E-05    2     1000005        37   # BR(~t_2 -> ~b_1    H+)
    -1.24976783E-05    2     2000005        37   # BR(~t_2 -> ~b_2    H+)
     8.16921088E-06    2     1000006        23   # BR(~t_2 -> ~t_1    Z )
     2.04202176E-05    2     1000005        24   # BR(~t_2 -> ~b_1    W+)
     2.21130602E-05    2     2000005        24   # BR(~t_2 -> ~b_2    W+)
#
#         PDG            Width
DECAY   1000005    -7.79591028E+00   # sbottom1 decays
#          BR         NDA      ID1       ID2
     1.00000000E+00    2     1000022         5   # BR(~b_1 -> ~chi_10 b )
#
#         PDG            Width
DECAY   2000005    -1.06782961E+01   # sbottom2 decays
#          BR         NDA      ID1       ID2
     1.00000000E+00    2     1000022         5   # BR(~b_2 -> ~chi_10 b )
#
#         PDG            Width
DECAY   1000002     9.07957787E-03   # sup_L decays
#          BR         NDA      ID1       ID2
     1.00000000E+00    2     1000022         2   # BR(~u_L -> ~chi_10 u)
#
#         PDG            Width
DECAY   2000002     2.08359046E+02   # sup_R decays
#          BR         NDA      ID1       ID2
     9.99751223E-01    2     1000022         2   # BR(~u_R -> ~chi_10 u)
     4.34893817E-06    2     1000023         2   # BR(~u_R -> ~chi_20 u)
     2.44428189E-04    2     1000025         2   # BR(~u_R -> ~chi_30 u)
#
#         PDG            Width
DECAY   1000001     9.29772303E-03   # sdown_L decays
#          BR         NDA      ID1       ID2
     1.00000000E+00    2     1000022         1   # BR(~d_L -> ~chi_10 d)
#
#         PDG            Width
DECAY   2000001     3.67996953E-02   # sdown_R decays
#          BR         NDA      ID1       ID2
     1.00000000E+00    2     1000022         1   # BR(~d_R -> ~chi_10 d)
#
#         PDG            Width
DECAY   1000004     9.07957787E-03   # scharm_L decays
#          BR         NDA      ID1       ID2
     1.00000000E+00    2     1000022         4   # BR(~c_L -> ~chi_10 c)
#
#         PDG            Width
DECAY   2000004     2.08359046E+02   # scharm_R decays
#          BR         NDA      ID1       ID2
     9.99751223E-01    2     1000022         4   # BR(~c_R -> ~chi_10 c)
     4.34893817E-06    2     1000023         4   # BR(~c_R -> ~chi_20 c)
     2.44428189E-04    2     1000025         4   # BR(~c_R -> ~chi_30 c)
#
#         PDG            Width
DECAY   1000003     9.29772303E-03   # sstrange_L decays
#          BR         NDA      ID1       ID2
     1.00000000E+00    2     1000022         3   # BR(~s_L -> ~chi_10 s)
#
#         PDG            Width
DECAY   2000003     3.67996953E-02   # sstrange_R decays
#          BR         NDA      ID1       ID2
     1.00000000E+00    2     1000022         3   # BR(~s_R -> ~chi_10 s)
#
#         PDG            Width
DECAY   1000011     1.22298682E+02   # selectron_L decays
#          BR         NDA      ID1       ID2
     9.99703317E-01    2     1000022        11   # BR(~e_L -> ~chi_10 e-)
     3.30640674E-06    2     1000023        11   # BR(~e_L -> ~chi_20 e-)
     2.90688362E-04    2     1000025        11   # BR(~e_L -> ~chi_30 e-)
     2.68847010E-06    2    -1000024        12   # BR(~e_L -> ~chi_1- nu_e)
#
#         PDG            Width
DECAY   2000011     4.89191797E+02   # selectron_R decays
#          BR         NDA      ID1       ID2
     9.99751527E-01    2     1000022        11   # BR(~e_R -> ~chi_10 e-)
     4.34361440E-06    2     1000023        11   # BR(~e_R -> ~chi_20 e-)
     2.44128894E-04    2     1000025        11   # BR(~e_R -> ~chi_30 e-)
#
#         PDG            Width
DECAY   1000013     1.22298682E+02   # smuon_L decays
#          BR         NDA      ID1       ID2
     9.99703317E-01    2     1000022        13   # BR(~mu_L -> ~chi_10 mu-)
     3.30640674E-06    2     1000023        13   # BR(~mu_L -> ~chi_20 mu-)
     2.90688362E-04    2     1000025        13   # BR(~mu_L -> ~chi_30 mu-)
     2.68847010E-06    2    -1000024        14   # BR(~mu_L -> ~chi_1- nu_mu)
#
#         PDG            Width
DECAY   2000013     4.89191797E+02   # smuon_R decays
#          BR         NDA      ID1       ID2
     9.99751527E-01    2     1000022        13   # BR(~mu_R -> ~chi_10 mu-)
     4.34361440E-06    2     1000023        13   # BR(~mu_R -> ~chi_20 mu-)
     2.44128894E-04    2     1000025        13   # BR(~mu_R -> ~chi_30 mu-)
#
#         PDG            Width
DECAY   1000015     1.18201636E+04   # stau_1 decays
#          BR         NDA      ID1       ID2
     2.59146207E-02    2     1000022        15   # BR(~tau_1 -> ~chi_10  tau-)
     2.52949941E-05    2     1000023        15   # BR(~tau_1 -> ~chi_20  tau-)
     2.55531749E-05    2     1000025        15   # BR(~tau_1 -> ~chi_30  tau-)
     2.77209717E-05    2    -1000024        16   # BR(~tau_1 -> ~chi_1-  nu_tau)
     9.74006810E-01    2     1000039        15   # BR(~tau_1 -> ~G       tau-)
#
#         PDG            Width
DECAY   2000015     3.06120255E+02   # stau_2 decays
#          BR         NDA      ID1       ID2
     9.96398570E-01    2     1000022        15   # BR(~tau_2 -> ~chi_10  tau-)
     1.07156616E-03    2     1000023        15   # BR(~tau_2 -> ~chi_20  tau-)
     1.55909077E-03    2     1000025        15   # BR(~tau_2 -> ~chi_30  tau-)
     9.70772609E-04    2    -1000024        16   # BR(~tau_2 -> ~chi_1-  nu_tau)
#
#         PDG            Width
DECAY   1000012     1.22298744E+02   # snu_eL decays
#          BR         NDA      ID1       ID2
     9.99787132E-01    2     1000022        12   # BR(~nu_eL -> ~chi_10 nu_e)
     5.52203922E-06    2     1000023        12   # BR(~nu_eL -> ~chi_20 nu_e)
     2.01627667E-04    2     1000025        12   # BR(~nu_eL -> ~chi_30 nu_e)
     5.71844046E-06    2     1000024        11   # BR(~nu_eL -> ~chi_1+ e-)
#
#         PDG            Width
DECAY   1000014     1.22298744E+02   # snu_muL decays
#          BR         NDA      ID1       ID2
     9.99787132E-01    2     1000022        14   # BR(~nu_muL -> ~chi_10 nu_mu)
     5.52203922E-06    2     1000023        14   # BR(~nu_muL -> ~chi_20 nu_mu)
     2.01627667E-04    2     1000025        14   # BR(~nu_muL -> ~chi_30 nu_mu)
     5.71844046E-06    2     1000024        13   # BR(~nu_muL -> ~chi_1+ mu-)
#
#         PDG            Width
DECAY   1000016     1.22923254E+02   # snu_tauL decays
#          BR         NDA      ID1       ID2
     9.94707721E-01    2     1000022        16   # BR(~nu_tauL -> ~chi_10 nu_tau)
     5.49398454E-06    2     1000023        16   # BR(~nu_tauL -> ~chi_20 nu_tau)
     2.00603299E-04    2     1000025        16   # BR(~nu_tauL -> ~chi_30 nu_tau)
     5.08618186E-03    2     1000024        15   # BR(~nu_tauL -> ~chi_1+ tau-)
#
#         PDG            Width
DECAY   1000024     3.88606205E+01   # chargino1+ decays
#          BR         NDA      ID1       ID2
     9.90931919E-07    2     1000002        -1   # BR(~chi_1+ -> ~u_L     db)
     4.65696825E-07    2    -1000001         2   # BR(~chi_1+ -> ~d_L*    u )
     9.90931919E-07    2     1000004        -3   # BR(~chi_1+ -> ~c_L     sb)
     4.65696825E-07    2    -1000003         4   # BR(~chi_1+ -> ~s_L*    c )
    -9.59341024E-01    2     1000006        -5   # BR(~chi_1+ -> ~t_1     bb)
     1.23277958E-01    2    -1000005         6   # BR(~chi_1+ -> ~b_1*    t )
     1.75334954E+00    2    -2000005         6   # BR(~chi_1+ -> ~b_2*    t )
     7.19195217E-02    2     1000022        24   # BR(~chi_1+ -> ~chi_10  W+)
     1.07817992E-02    2     1000022        37   # BR(~chi_1+ -> ~chi_10  H+)
     7.76346774E-06    2     1000039        24   # BR(~chi_1+ -> ~G       W+)
     1.52750665E-06    2     1000039        37   # BR(~chi_1+ -> ~G       H+)
#
#         PDG            Width
DECAY   1000037    -7.25337568E+05   # chargino2+ decays
#          BR         NDA      ID1       ID2
    -1.54790638E-03    2     1000002        -1   # BR(~chi_2+ -> ~u_L     db)
    -1.54790718E-03    2    -1000001         2   # BR(~chi_2+ -> ~d_L*    u )
    -1.54790638E-03    2     1000004        -3   # BR(~chi_2+ -> ~c_L     sb)
    -1.54790718E-03    2    -1000003         4   # BR(~chi_2+ -> ~s_L*    c )
     1.02626464E+00    2     1000006        -5   # BR(~chi_2+ -> ~t_1     bb)
    -3.26868685E-04    2    -1000005         6   # BR(~chi_2+ -> ~b_1*    t )
    -1.48547545E-03    2    -2000005         6   # BR(~chi_2+ -> ~b_2*    t )
    -1.14776730E-15    2     1000012       -11   # BR(~chi_2+ -> ~nu_eL   e+  )
    -1.14776730E-15    2     1000014       -13   # BR(~chi_2+ -> ~nu_muL  mu+ )
    -8.01434545E-16    2    -1000011        12   # BR(~chi_2+ -> ~e_L+    nu_e)
    -8.01434545E-16    2    -1000013        14   # BR(~chi_2+ -> ~mu_L+   nu_mu)
    -1.24310596E-15    2    -1000015        16   # BR(~chi_2+ -> ~tau_1+  nu_tau)
    -2.11702216E-17    2    -2000015        16   # BR(~chi_2+ -> ~tau_2+  nu_tau)
    -2.85079201E-04    2     1000024        23   # BR(~chi_2+ -> ~chi_1+  Z )
    -5.54046408E-08    2     1000022        24   # BR(~chi_2+ -> ~chi_10  W+)
    -2.76941918E-04    2     1000023        24   # BR(~chi_2+ -> ~chi_20  W+)
    -2.76883510E-04    2     1000025        24   # BR(~chi_2+ -> ~chi_30  W+)
    -2.86631572E-04    2     1000024        25   # BR(~chi_2+ -> ~chi_1+  h )
    -2.51611557E-04    2     1000024        35   # BR(~chi_2+ -> ~chi_1+  H )
    -2.51643224E-04    2     1000024        36   # BR(~chi_2+ -> ~chi_1+  A )
    -6.93690100E-08    2     1000022        37   # BR(~chi_2+ -> ~chi_10  H+)
    -2.51634275E-04    2     1000023        37   # BR(~chi_2+ -> ~chi_20  H+)
    -2.51573528E-04    2     1000025        37   # BR(~chi_2+ -> ~chi_30  H+)
    -1.61285410E-02    2     1000039        24   # BR(~chi_2+ -> ~G       W+)
    -4.64912685E-09    2     1000039        37   # BR(~chi_2+ -> ~G       H+)
#
#         PDG            Width
DECAY   1000022     1.E-08   # neutralino1 decays (OJ Mods)
#          BR         NDA      ID1       ID2
     7.70846975E-01    2     1000039        22   # BR(~chi_10 -> ~G        gam)
     2.29152590E-01    2     1000039        23   # BR(~chi_10 -> ~G        Z)
     4.35144407E-07    2     1000039        25   # BR(~chi_10 -> ~G        h)
#
#         PDG            Width
DECAY   1000023     1.E-08   # neutralino2 decays (OJ Mods)
#          BR         NDA      ID1       ID2
    -3.04435355E+00    2     1000022        23   # BR(~chi_20 -> ~chi_10   Z )
    -5.31625840E-02    2     1000022        25   # BR(~chi_20 -> ~chi_10   h )
    -4.08632087E-01    2     1000022        35   # BR(~chi_20 -> ~chi_10   H )
    -5.82844338E-02    2     1000022        36   # BR(~chi_20 -> ~chi_10   A )
    -1.52321580E-06    2     1000002        -2   # BR(~chi_20 -> ~u_L      ub)
    -1.52321580E-06    2    -1000002         2   # BR(~chi_20 -> ~u_L*     u )
    -7.63487727E-06    2     1000001        -1   # BR(~chi_20 -> ~d_L      db)
    -7.63487727E-06    2    -1000001         1   # BR(~chi_20 -> ~d_L*     d )
    -1.59793284E-05    2     2000001        -1   # BR(~chi_20 -> ~d_R      db)
    -1.59793284E-05    2    -2000001         1   # BR(~chi_20 -> ~d_R*     d )
    -1.52321580E-06    2     1000004        -4   # BR(~chi_20 -> ~c_L      cb)
    -1.52321580E-06    2    -1000004         4   # BR(~chi_20 -> ~c_L*     c )
    -7.63487727E-06    2     1000003        -3   # BR(~chi_20 -> ~s_L      sb)
    -7.63487727E-06    2    -1000003         3   # BR(~chi_20 -> ~s_L*     s )
    -1.59793284E-05    2     2000003        -3   # BR(~chi_20 -> ~s_R      sb)
    -1.59793284E-05    2    -2000003         3   # BR(~chi_20 -> ~s_R*     s )
    -3.92199256E+01    2     1000006        -6   # BR(~chi_20 -> ~t_1      tb)
    -3.92199256E+01    2    -1000006         6   # BR(~chi_20 -> ~t_1*     t )
     2.01038111E+01    2     1000005        -5   # BR(~chi_20 -> ~b_1      bb)
     2.01038111E+01    2    -1000005         5   # BR(~chi_20 -> ~b_1*     b )
     2.13985704E+01    2     2000005        -5   # BR(~chi_20 -> ~b_2      bb)
     2.13985704E+01    2    -2000005         5   # BR(~chi_20 -> ~b_2*     b )
    -1.98026959E-09    2     1000039        22   # BR(~chi_20 -> ~G        gam)
    -1.24947899E-05    2     1000039        23   # BR(~chi_20 -> ~G        Z)
    -3.11829449E-04    2     1000039        25   # BR(~chi_20 -> ~G        h)
    -2.50166749E-06    2     1000039        35   # BR(~chi_20 -> ~G        H)
    -6.44218883E-05    2     1000039        36   # BR(~chi_20 -> ~G        A)
#
#         PDG            Width
DECAY   1000025    -1.64869301E+00   # neutralino3 decays
#          BR         NDA      ID1       ID2
    -3.05620827E-02    2     1000022        23   # BR(~chi_30 -> ~chi_10   Z )
    -1.72185394E+00    2     1000022        25   # BR(~chi_30 -> ~chi_10   h )
    -3.19893117E-02    2     1000022        35   # BR(~chi_30 -> ~chi_10   H )
    -2.31549345E-01    2     1000022        36   # BR(~chi_30 -> ~chi_10   A )
    -2.05203715E-04    2     1000002        -2   # BR(~chi_30 -> ~u_L      ub)
    -2.05203715E-04    2    -1000002         2   # BR(~chi_30 -> ~u_L*     u )
    -6.67261222E-05    2     1000001        -1   # BR(~chi_30 -> ~d_L      db)
    -6.67261222E-05    2    -1000001         1   # BR(~chi_30 -> ~d_L*     d )
    -5.05924308E-04    2     2000001        -1   # BR(~chi_30 -> ~d_R      db)
    -5.05924308E-04    2    -2000001         1   # BR(~chi_30 -> ~d_R*     d )
    -2.05203715E-04    2     1000004        -4   # BR(~chi_30 -> ~c_L      cb)
    -2.05203715E-04    2    -1000004         4   # BR(~chi_30 -> ~c_L*     c )
    -6.67261222E-05    2     1000003        -3   # BR(~chi_30 -> ~s_L      sb)
    -6.67261222E-05    2    -1000003         3   # BR(~chi_30 -> ~s_L*     s )
    -5.05924308E-04    2     2000003        -3   # BR(~chi_30 -> ~s_R      sb)
    -5.05924308E-04    2    -2000003         3   # BR(~chi_30 -> ~s_R*     s )
    -2.20941917E+01    2     1000006        -6   # BR(~chi_30 -> ~t_1      tb)
    -2.20941917E+01    2    -1000006         6   # BR(~chi_30 -> ~t_1*     t )
     9.65642121E+00    2     1000005        -5   # BR(~chi_30 -> ~b_1      bb)
     9.65642121E+00    2    -1000005         5   # BR(~chi_30 -> ~b_1*     b )
     1.39472211E+01    2     2000005        -5   # BR(~chi_30 -> ~b_2      bb)
     1.39472211E+01    2    -2000005         5   # BR(~chi_30 -> ~b_2*     b )
    -7.21728146E-08    2     1000039        22   # BR(~chi_30 -> ~G        gam)
    -1.76022097E-04    2     1000039        23   # BR(~chi_30 -> ~G        Z)
    -6.87201947E-06    2     1000039        25   # BR(~chi_30 -> ~G        h)
    -3.60895019E-05    2     1000039        35   # BR(~chi_30 -> ~G        H)
    -1.45295703E-06    2     1000039        36   # BR(~chi_30 -> ~G        A)
#
#         PDG            Width
DECAY   1000035    -7.25340780E+05   # neutralino4 decays
#          BR         NDA      ID1       ID2
    -1.90665468E-10    2     1000022        23   # BR(~chi_40 -> ~chi_10   Z )
    -2.75498761E-04    2     1000023        23   # BR(~chi_40 -> ~chi_20   Z )
    -9.57919035E-06    2     1000025        23   # BR(~chi_40 -> ~chi_30   Z )
    -2.76938920E-04    2     1000024       -24   # BR(~chi_40 -> ~chi_1+   W-)
    -2.76938920E-04    2    -1000024        24   # BR(~chi_40 -> ~chi_1-   W+)
    -5.72331121E-08    2     1000022        25   # BR(~chi_40 -> ~chi_10   h )
    -7.02898236E-09    2     1000022        35   # BR(~chi_40 -> ~chi_10   H )
    -6.22531090E-08    2     1000022        36   # BR(~chi_40 -> ~chi_10   A )
    -9.42293305E-06    2     1000023        25   # BR(~chi_40 -> ~chi_20   h )
    -2.40777818E-04    2     1000023        35   # BR(~chi_40 -> ~chi_20   H )
    -1.10686408E-05    2     1000023        36   # BR(~chi_40 -> ~chi_20   A )
    -2.77150408E-04    2     1000025        25   # BR(~chi_40 -> ~chi_30   h )
    -1.08252648E-05    2     1000025        35   # BR(~chi_40 -> ~chi_30   H )
    -2.40511193E-04    2     1000025        36   # BR(~chi_40 -> ~chi_30   A )
    -2.51637612E-04    2     1000024       -37   # BR(~chi_40 -> ~chi_1+   H-)
    -2.51637612E-04    2    -1000024        37   # BR(~chi_40 -> ~chi_1-   H+)
    -7.40324568E-04    2     1000002        -2   # BR(~chi_40 -> ~u_L      ub)
    -7.40324568E-04    2    -1000002         2   # BR(~chi_40 -> ~u_L*     u )
    -1.20528430E-23    2     2000002        -2   # BR(~chi_40 -> ~u_R      ub)
    -1.20528430E-23    2    -2000002         2   # BR(~chi_40 -> ~u_R*     u )
    -7.40325213E-04    2     1000001        -1   # BR(~chi_40 -> ~d_L      db)
    -7.40325213E-04    2    -1000001         1   # BR(~chi_40 -> ~d_L*     d )
    -1.42101473E-17    2     2000001        -1   # BR(~chi_40 -> ~d_R      db)
    -1.42101473E-17    2    -2000001         1   # BR(~chi_40 -> ~d_R*     d )
    -7.40324568E-04    2     1000004        -4   # BR(~chi_40 -> ~c_L      cb)
    -7.40324568E-04    2    -1000004         4   # BR(~chi_40 -> ~c_L*     c )
    -1.20528430E-23    2     2000004        -4   # BR(~chi_40 -> ~c_R      cb)
    -1.20528430E-23    2    -2000004         4   # BR(~chi_40 -> ~c_R*     c )
    -7.40325213E-04    2     1000003        -3   # BR(~chi_40 -> ~s_L      sb)
    -7.40325213E-04    2    -1000003         3   # BR(~chi_40 -> ~s_L*     s )
    -1.42101473E-17    2     2000003        -3   # BR(~chi_40 -> ~s_R      sb)
    -1.42101473E-17    2    -2000003         3   # BR(~chi_40 -> ~s_R*     s )
    -9.06165186E-04    2     1000006        -6   # BR(~chi_40 -> ~t_1      tb)
    -9.06165186E-04    2    -1000006         6   # BR(~chi_40 -> ~t_1*     t )
     2.46609094E-01    2     1000005        -5   # BR(~chi_40 -> ~b_1      bb)
     2.46609094E-01    2    -1000005         5   # BR(~chi_40 -> ~b_1*     b )
     2.66523164E-01    2     2000005        -5   # BR(~chi_40 -> ~b_2      bb)
     2.66523164E-01    2    -2000005         5   # BR(~chi_40 -> ~b_2*     b )
    -4.00715206E-16    2     1000011       -11   # BR(~chi_40 -> ~e_L-     e+)
    -4.00715206E-16    2    -1000011        11   # BR(~chi_40 -> ~e_L+     e-)
    -6.92236871E-29    2     2000011       -11   # BR(~chi_40 -> ~e_R-     e+)
    -6.92236871E-29    2    -2000011        11   # BR(~chi_40 -> ~e_R+     e-)
    -4.00715206E-16    2     1000013       -13   # BR(~chi_40 -> ~mu_L-    mu+)
    -4.00715206E-16    2    -1000013        13   # BR(~chi_40 -> ~mu_L+    mu-)
    -6.92236871E-29    2     2000013       -13   # BR(~chi_40 -> ~mu_R-    mu+)
    -6.92236871E-29    2    -2000013        13   # BR(~chi_40 -> ~mu_R+    mu-)
    -5.73881444E-16    2     1000012       -12   # BR(~chi_40 -> ~nu_eL    nu_eb)
    -5.73881444E-16    2    -1000012        12   # BR(~chi_40 -> ~nu_eL*   nu_e )
    -5.73881444E-16    2     1000014       -14   # BR(~chi_40 -> ~nu_muL   nu_mub)
    -5.73881444E-16    2    -1000014        14   # BR(~chi_40 -> ~nu_muL*  nu_mu )
    -5.73881444E-16    2     1000016       -16   # BR(~chi_40 -> ~nu_tau1  nu_taub)
    -5.73881444E-16    2    -1000016        16   # BR(~chi_40 -> ~nu_tau1* nu_tau )
    -3.89339382E-03    2     1000039        22   # BR(~chi_40 -> ~G        gam)
    -1.22350736E-02    2     1000039        23   # BR(~chi_40 -> ~G        Z)
    -7.42174662E-10    2     1000039        25   # BR(~chi_40 -> ~G        h)
    -4.65646863E-09    2     1000039        35   # BR(~chi_40 -> ~G        H)
    -9.17673777E-13    2     1000039        36   # BR(~chi_40 -> ~G        A)
#
#
#
#
