#
#                              ======================
#                              | THE SUSYHIT OUTPUT |
#                              ======================
#
#
#              ------------------------------------------------------
#              |     This is the output of the SUSY-HIT package     |
#              |  created by A.Djouadi, M.Muehlleitner and M.Spira. |
#              |  In case of problems with SUSY-HIT email to        |
#              |           margarete.muehlleitner@kit.edu           |
#              |           michael.spira@psi.ch                     |
#              |           abdelhak.djouadi@cern.ch                 |
#              ------------------------------------------------------
#
#              ------------------------------------------------------
#              |  SUSY Les Houches Accord - MSSM Spectrum + Decays  |
#              |              based on the decay programs           |
#              |                                                    |
#              |                     SDECAY 1.5                     |
#              |                                                    |
#              |  Authors: M.Muhlleitner, A.Djouadi and Y.Mambrini  |
#              |  Ref.:    Comput.Phys.Commun.168(2005)46           |
#              |           [hep-ph/0311167]                         |
#              |                                                    |
#              |                     HDECAY 3.4                     |
#              |                                                    |
#              |  By: A.Djouadi,J.Kalinowski,M.Muhlleitner,M.Spira  |
#              |  Ref.:    Comput.Phys.Commun.108(1998)56           |
#              |           [hep-ph/9704448]                         |
#              |                                                    |
#              |                                                    |
#              |  If not stated otherwise all DRbar couplings and   |
#              |  soft SUSY breaking masses are given at the scale  |
#              |  Q=  0.91187600E+02
#              |                                                    |
#              ------------------------------------------------------
#
#
BLOCK DCINFO  # Decay Program information
     1   SDECAY/HDECAY # decay calculator
     2   1.5  /3.4    # version number
#
BLOCK SPINFO  # Spectrum calculator information
     1   SuSpect     # RGE +Spectrum calculator            
     2   2.43         # version number                     
#
BLOCK MODSEL  # Model selection
     1     2   # GMSB                                              
#
BLOCK SMINPUTS  # Standard Model inputs
         1     1.27932904E+02   # alpha_em^-1(M_Z)^MSbar
         2     1.16639000E-05   # G_F [GeV^-2]
         3     1.17200000E-01   # alpha_S(M_Z)^MSbar
         4     9.11870000E+01   # M_Z pole mass
         5     4.25000000E+00   # mb(mb)^MSbar
         6     1.72900000E+02   # mt pole mass
         7     1.77700000E+00   # mtau pole mass
#
BLOCK MINPAR  # Input parameters - minimal models
#
BLOCK EXTPAR  # Input parameters - non-minimal models
         0     9.11876000E+01   # EWSB                
         1     1.44600000E+03   # M_1                 
         2     3.00000000E+03   # M_2                 
         3     1.90000000E+03   # M_3                 
        11     0.00000000E+00   # A_t                 
        12     0.00000000E+00   # A_b                 
        13     0.00000000E+00   # A_tau               
        14     0.00000000E+00   # A_u                 
        15     0.00000000E+00   # A_d                 
        16     0.00000000E+00   # A_e                 
        23     1.45000000E+03   # mu(EWSB)            
        25     1.50000000E+00   # tanbeta(in)         
        26     2.00000000E+03   # MA_pole             
        31     5.00000000E+03   # M_eL                
        32     5.00000000E+03   # M_muL               
        33     5.00000000E+03   # M_tauL              
        34     5.00000000E+03   # M_eR                
        35     5.00000000E+03   # M_muR               
        36     5.00000000E+03   # M_tauR              
        41     5.00000000E+03   # M_q1L               
        42     5.00000000E+03   # M_q2L               
        43     5.00000000E+03   # M_q3L               
        44     5.00000000E+03   # M_uR                
        45     5.00000000E+03   # M_cR                
        46     5.00000000E+03   # M_tR                
        47     5.00000000E+03   # M_dR                
        48     5.00000000E+03   # M_sR                
        49     5.00000000E+03   # M_bR                
#
BLOCK MASS  # Mass Spectrum
# PDG code           mass       particle
        24     8.05413769E+01   # W+
        25     1.26000000E+02   # h
        35     2.00401370E+03   # H
        36     2.00000000E+03   # A
        37     2.00151178E+03   # H+
         5     4.87877839E+00   # b-quark pole mass calculated from mb(mb)_Msbar
   1000001     4.95285062E+03   # ~d_L
   2000001     4.95274063E+03   # ~d_R
   1000002     4.95260468E+03   # ~u_L
   2000002     4.95266278E+03   # ~u_R
   1000003     4.95285062E+03   # ~s_L
   2000003     4.95274063E+03   # ~s_R
   1000004     4.95260468E+03   # ~c_L
   2000004     4.95266278E+03   # ~c_R
   1000005     4.95219606E+03   # ~b_1
   2000005     4.95339659E+03   # ~b_2
   1000006     5.07135202E+03   # ~t_1
   2000006     5.36590208E+03   # ~t_2
   1000011     5.00008218E+03   # ~e_L
   2000011     5.00007611E+03   # ~e_R
   1000012     4.99984171E+03   # ~nu_eL
   1000013     5.00008218E+03   # ~mu_L
   2000013     5.00007611E+03   # ~mu_R
   1000014     4.99984171E+03   # ~nu_muL
   1000015     4.99969262E+03   # ~tau_1
   2000015     5.00046627E+03   # ~tau_2
   1000016     4.99984171E+03   # ~nu_tauL
   1000021     1.97443677E+03   # ~g
   1000022     1.49248666E+03   # ~chi_10
   1000023    -1.54196251E+03   # ~chi_20
   1000025     1.57971069E+03   # ~chi_30
   1000035     3.12742763E+03   # ~chi_40
   1000024     1.53814600E+03   # ~chi_1+
   1000037     3.12742487E+03   # ~chi_2+
   1000039     1.00000000E-09   # ~gravitino
#
BLOCK NMIX  # Neutralino Mixing Matrix
  1  1     7.23103100E-01   # N_11
  1  2    -3.27762920E-02   # N_12
  1  3     4.89462769E-01   # N_13
  1  4    -4.86285738E-01   # N_14
  2  1     2.83788618E-03   # N_21
  2  2    -3.32576170E-03   # N_22
  2  3    -7.07012507E-01   # N_23
  2  4    -7.07187529E-01   # N_24
  3  1     6.90732954E-01   # N_31
  3  2     3.62872505E-02   # N_32
  3  3    -5.09432664E-01   # N_33
  3  4     5.11907788E-01   # N_34
  4  1     1.35635331E-03   # N_41
  4  2    -9.98798223E-01   # N_42
  4  3    -3.22160467E-02   # N_43
  4  4     3.69106651E-02   # N_44
#
BLOCK UMIX  # Chargino Mixing Matrix U
  1  1    -4.55246847E-02   # U_11
  1  2     9.98963214E-01   # U_12
  2  1     9.98963214E-01   # U_21
  2  2     4.55246847E-02   # U_22
#
BLOCK VMIX  # Chargino Mixing Matrix V
  1  1    -5.21642224E-02   # V_11
  1  2     9.98638520E-01   # V_12
  2  1     9.98638520E-01   # V_21
  2  2     5.21642224E-02   # V_22
#
BLOCK STOPMIX  # Stop Mixing Matrix
  1  1     9.99972398E-01   # cos(theta_t)
  1  2     7.42988816E-03   # sin(theta_t)
  2  1    -7.42988816E-03   # -sin(theta_t)
  2  2     9.99972398E-01   # cos(theta_t)
#
BLOCK SBOTMIX  # Sbottom Mixing Matrix
  1  1     6.73935497E-01   # cos(theta_b)
  1  2     7.38790191E-01   # sin(theta_b)
  2  1    -7.38790191E-01   # -sin(theta_b)
  2  2     6.73935497E-01   # cos(theta_b)
#
BLOCK STAUMIX  # Stau Mixing Matrix
  1  1     7.04328292E-01   # cos(theta_tau)
  1  2     7.09874395E-01   # sin(theta_tau)
  2  1    -7.09874395E-01   # -sin(theta_tau)
  2  2     7.04328292E-01   # cos(theta_tau)
#
BLOCK ALPHA  # Higgs mixing
          -5.90204454E-01   # Mixing angle in the neutral Higgs boson sector
#
BLOCK HMIX Q=  9.11876000E+01  # DRbar Higgs Parameters
         1     1.45000000E+03   # mu(Q)               
         2     1.49999979E+00   # tanbeta(Q)          
         3     2.52209636E+02   # vev(Q)              
         4     3.31342106E+06   # MA^2(Q)             
#
BLOCK GAUGE Q=  9.11876000E+01  # The gauge couplings
     1     3.52758962E-01   # gprime(Q) DRbar
     2     6.27023844E-01   # g(Q) DRbar
     3     1.08126703E+00   # g3(Q) DRbar
#
BLOCK AU Q=  9.11876000E+01  # The trilinear couplings
  1  1     0.00000000E+00   # A_u(Q) DRbar
  2  2     0.00000000E+00   # A_c(Q) DRbar
  3  3     0.00000000E+00   # A_t(Q) DRbar
#
BLOCK AD Q=  9.11876000E+01  # The trilinear couplings
  1  1     0.00000000E+00   # A_d(Q) DRbar
  2  2     0.00000000E+00   # A_s(Q) DRbar
  3  3     0.00000000E+00   # A_b(Q) DRbar
#
BLOCK AE Q=  9.11876000E+01  # The trilinear couplings
  1  1     0.00000000E+00   # A_e(Q) DRbar
  2  2     0.00000000E+00   # A_mu(Q) DRbar
  3  3     0.00000000E+00   # A_tau(Q) DRbar
#
BLOCK Yu Q=  9.11876000E+01  # The Yukawa couplings
  1  1     0.00000000E+00   # y_u(Q) DRbar
  2  2     0.00000000E+00   # y_c(Q) DRbar
  3  3     1.02534487E+00   # y_t(Q) DRbar
#
BLOCK Yd Q=  9.11876000E+01  # The Yukawa couplings
  1  1     0.00000000E+00   # y_d(Q) DRbar
  2  2     0.00000000E+00   # y_s(Q) DRbar
  3  3     2.71633054E-02   # y_b(Q) DRbar
#
BLOCK Ye Q=  9.11876000E+01  # The Yukawa couplings
  1  1     0.00000000E+00   # y_e(Q) DRbar
  2  2     0.00000000E+00   # y_mu(Q) DRbar
  3  3     1.79780868E-02   # y_tau(Q) DRbar
#
BLOCK MSOFT Q=  9.11876000E+01  # The soft SUSY breaking masses at the scale Q
         1     1.44600000E+03   # M_1                 
         2     3.00000000E+03   # M_2                 
         3     1.90000000E+03   # M_3                 
        14     0.00000000E+00   # A_u                 
        15     0.00000000E+00   # A_d                 
        16     0.00000000E+00   # A_e                 
        21     6.91301386E+05   # M^2_Hd              
        22    -7.36943614E+06   # M^2_Hu              
        31     5.00000000E+03   # M_eL                
        32     5.00000000E+03   # M_muL               
        33     5.00000000E+03   # M_tauL              
        34     5.00000000E+03   # M_eR                
        35     5.00000000E+03   # M_muR               
        36     5.00000000E+03   # M_tauR              
        41     5.00000000E+03   # M_q1L               
        42     5.00000000E+03   # M_q2L               
        43     5.00000000E+03   # M_q3L               
        44     5.00000000E+03   # M_uR                
        45     5.00000000E+03   # M_cR                
        46     5.00000000E+03   # M_tR                
        47     5.00000000E+03   # M_dR                
        48     5.00000000E+03   # M_sR                
        49     5.00000000E+03   # M_bR                
#
#
#
#                             =================
#                             |The decay table|
#                             =================
#
# - The QCD corrections to the decays gluino -> squark  + quark
#                                     squark -> gaugino + quark_prime
#                                     squark -> squark_prime + Higgs
#                                     squark -> gluino  + quark
#   are included.
#
# - The multi-body decays for the inos, stops and sbottoms are included.
#
# - The loop induced decays for the gluino, neutralinos and stops
#   are included.
#
# - The SUSY decays of the top quark are included.
#
# - Possible decays of the NLSP in GMSB models are included.
#
#
#         PDG            Width
DECAY         6     1.36981130E+00   # top decays
#          BR         NDA      ID1       ID2
     1.00000000E+00    2           5        24   # BR(t ->  b    W+)
#
#         PDG            Width
DECAY   1000021     4.58922756E-05   # gluino decays
#          BR         NDA      ID1       ID2
     2.36927677E-02    2     1000022        21   # BR(~g -> ~chi_10 g)
     3.77610602E-02    2     1000023        21   # BR(~g -> ~chi_20 g)
     1.53615983E-02    2     1000025        21   # BR(~g -> ~chi_30 g)
#          BR         NDA      ID1       ID2
0.0E+00    2     1000039    21 # BR(~g -> ~G      g)
#           BR         NDA      ID1       ID2       ID3
     3.86011887E-03    3     1000022         1        -1   # BR(~g -> ~chi_10 d  db)
     1.26721031E-07    3     1000023         1        -1   # BR(~g -> ~chi_20 d  db)
     1.16175359E-03    3     1000025         1        -1   # BR(~g -> ~chi_30 d  db)
     1.15463644E-02    3     1000022         2        -2   # BR(~g -> ~chi_10 u  ub)
     9.76170318E-08    3     1000023         2        -2   # BR(~g -> ~chi_20 u  ub)
     4.53580987E-03    3     1000025         2        -2   # BR(~g -> ~chi_30 u  ub)
     3.86011887E-03    3     1000022         3        -3   # BR(~g -> ~chi_10 s  sb)
     1.26721031E-07    3     1000023         3        -3   # BR(~g -> ~chi_20 s  sb)
     1.16175359E-03    3     1000025         3        -3   # BR(~g -> ~chi_30 s  sb)
     1.15463644E-02    3     1000022         4        -4   # BR(~g -> ~chi_10 c  cb)
     9.76170318E-08    3     1000023         4        -4   # BR(~g -> ~chi_20 c  cb)
     4.53580987E-03    3     1000025         4        -4   # BR(~g -> ~chi_30 c  cb)
     3.88647185E-03    3     1000022         5        -5   # BR(~g -> ~chi_10 b  bb)
     8.78181723E-05    3     1000023         5        -5   # BR(~g -> ~chi_20 b  bb)
     1.20579152E-03    3     1000025         5        -5   # BR(~g -> ~chi_30 b  bb)
     1.52485433E-02    3     1000022         6        -6   # BR(~g -> ~chi_10 t  tb)
     5.88659052E-03    3     1000023         6        -6   # BR(~g -> ~chi_20 t  tb)
     2.71455610E-03    3     1000025         6        -6   # BR(~g -> ~chi_30 t  tb)
     1.15607114E-04    3     1000024         1        -2   # BR(~g -> ~chi_1+ d  ub)
     1.15607114E-04    3    -1000024         2        -1   # BR(~g -> ~chi_1- u  db)
     1.15607114E-04    3     1000024         3        -4   # BR(~g -> ~chi_1+ s  cb)
     1.15607114E-04    3    -1000024         4        -3   # BR(~g -> ~chi_1- c  sb)
     4.93563418E-02    3     1000024         5        -6   # BR(~g -> ~chi_1+ b  tb)
     4.93563418E-02    3    -1000024         6        -5   # BR(~g -> ~chi_1- t  bb)
#
#         PDG            Width
DECAY   1000006     2.77227442E+02   # stop1 decays
#          BR         NDA      ID1       ID2
     5.15131814E-02    2     1000022         6   # BR(~t_1 -> ~chi_10 t )
     1.07961872E-01    2     1000023         6   # BR(~t_1 -> ~chi_20 t )
     5.82856547E-02    2     1000025         6   # BR(~t_1 -> ~chi_30 t )
     2.69062429E-02    2     1000035         6   # BR(~t_1 -> ~chi_40 t )
    -3.09404916E-05    2     1000024         5   # BR(~t_1 -> ~chi_1+ b )
     5.33153978E-02    2     1000037         5   # BR(~t_1 -> ~chi_2+ b )
     6.89757835E-01    2     1000021         6   # BR(~t_1 -> ~g      t )
     5.75329490E-03    2     1000005        24   # BR(~t_1 -> ~b_1    W+)
     6.53746204E-03    2     2000005        24   # BR(~t_1 -> ~b_2    W+)
#
#         PDG            Width
DECAY   2000006     3.47241886E+02   # stop2 decays
#          BR         NDA      ID1       ID2
     5.95532034E-02    2     1000022         6   # BR(~t_2 -> ~chi_10 t )
     9.38217085E-02    2     1000023         6   # BR(~t_2 -> ~chi_20 t )
     6.16477168E-02    2     1000025         6   # BR(~t_2 -> ~chi_30 t )
     3.26119671E-05    2     1000035         6   # BR(~t_2 -> ~chi_40 t )
     1.87966832E-01    2     1000024         5   # BR(~t_2 -> ~chi_1+ b )
     6.64021206E-05    2     1000037         5   # BR(~t_2 -> ~chi_2+ b )
     5.96913768E-01    2     1000021         6   # BR(~t_2 -> ~g      t )
    -7.10220099E-05    2     1000006        25   # BR(~t_2 -> ~t_1    h )
     9.39099586E-06    2     1000006        23   # BR(~t_2 -> ~t_1    Z )
     2.71234924E-05    2     1000005        24   # BR(~t_2 -> ~b_1    W+)
     3.22649991E-05    2     2000005        24   # BR(~t_2 -> ~b_2    W+)
#
#         PDG            Width
DECAY   1000005     2.20071233E+02   # sbottom1 decays
#          BR         NDA      ID1       ID2
     4.63026582E-03    2     1000022         5   # BR(~b_1 -> ~chi_10 b )
     8.11501564E-05    2     1000023         5   # BR(~b_1 -> ~chi_20 b )
     2.28508088E-03    2     1000025         5   # BR(~b_1 -> ~chi_30 b )
     1.31940726E-02    2     1000035         5   # BR(~b_1 -> ~chi_40 b )
     1.10675721E-01    2    -1000024         6   # BR(~b_1 -> ~chi_1- t )
     2.66354409E-02    2    -1000037         6   # BR(~b_1 -> ~chi_2- t )
     8.42498268E-01    2     1000021         5   # BR(~b_1 -> ~g      b )
#
#         PDG            Width
DECAY   2000005     2.31818048E+02   # sbottom2 decays
#          BR         NDA      ID1       ID2
     2.48290328E-03    2     1000022         5   # BR(~b_2 -> ~chi_10 b )
     1.00834453E-04    2     1000023         5   # BR(~b_2 -> ~chi_20 b )
     2.85572861E-03    2     1000025         5   # BR(~b_2 -> ~chi_30 b )
     1.67247766E-02    2     1000035         5   # BR(~b_2 -> ~chi_40 b )
     1.44687591E-01    2    -1000024         6   # BR(~b_2 -> ~chi_1- t )
     3.37708892E-02    2    -1000037         6   # BR(~b_2 -> ~chi_2- t )
     7.99377277E-01    2     1000021         5   # BR(~b_2 -> ~g      b )
#
#         PDG            Width
DECAY   1000002     2.06329156E+02   # sup_L decays
#          BR         NDA      ID1       ID2
     7.91911111E-04    2     1000022         2   # BR(~u_L -> ~chi_10 u)
     5.76674179E-07    2     1000023         2   # BR(~u_L -> ~chi_20 u)
     2.01036767E-03    2     1000025         2   # BR(~u_L -> ~chi_30 u)
     3.28232726E-02    2     1000035         2   # BR(~u_L -> ~chi_40 u)
     4.02573996E-04    2     1000024         1   # BR(~u_L -> ~chi_1+ d)
     6.56591437E-02    2     1000037         1   # BR(~u_L -> ~chi_2+ d)
     8.98312154E-01    2     1000021         2   # BR(~u_L -> ~g      u)
#
#         PDG            Width
DECAY   2000002     1.93948458E+02   # sup_R decays
#          BR         NDA      ID1       ID2
     2.34424093E-02    2     1000022         2   # BR(~u_R -> ~chi_10 u)
     3.56244567E-07    2     1000023         2   # BR(~u_R -> ~chi_20 u)
     2.08816103E-02    2     1000025         2   # BR(~u_R -> ~chi_30 u)
     3.62536285E-08    2     1000035         2   # BR(~u_R -> ~chi_40 u)
     9.55675588E-01    2     1000021         2   # BR(~u_R -> ~g      u)
#
#         PDG            Width
DECAY   1000001     2.06336149E+02   # sdown_L decays
#          BR         NDA      ID1       ID2
     2.12350733E-03    2     1000022         1   # BR(~d_L -> ~chi_10 d)
     1.09986995E-06    2     1000023         1   # BR(~d_L -> ~chi_20 d)
     6.35738085E-04    2     1000025         1   # BR(~d_L -> ~chi_30 d)
     3.28615329E-02    2     1000035         1   # BR(~d_L -> ~chi_40 d)
     3.06626952E-04    2    -1000024         2   # BR(~d_L -> ~chi_1- u)
     6.57114607E-02    2    -1000037         2   # BR(~d_L -> ~chi_2- u)
     8.98360034E-01    2     1000021         1   # BR(~d_L -> ~g      d)
#
#         PDG            Width
DECAY   2000001     1.87506134E+02   # sdown_R decays
#          BR         NDA      ID1       ID2
     6.06209453E-03    2     1000022         1   # BR(~d_R -> ~chi_10 d)
     9.21231778E-08    2     1000023         1   # BR(~d_R -> ~chi_20 d)
     5.39988869E-03    2     1000025         1   # BR(~d_R -> ~chi_30 d)
     9.37534191E-09    2     1000035         1   # BR(~d_R -> ~chi_40 d)
     9.88537915E-01    2     1000021         1   # BR(~d_R -> ~g      d)
#
#         PDG            Width
DECAY   1000004     2.06329156E+02   # scharm_L decays
#          BR         NDA      ID1       ID2
     7.91911111E-04    2     1000022         4   # BR(~c_L -> ~chi_10 c)
     5.76674179E-07    2     1000023         4   # BR(~c_L -> ~chi_20 c)
     2.01036767E-03    2     1000025         4   # BR(~c_L -> ~chi_30 c)
     3.28232726E-02    2     1000035         4   # BR(~c_L -> ~chi_40 c)
     4.02573996E-04    2     1000024         3   # BR(~c_L -> ~chi_1+ s)
     6.56591437E-02    2     1000037         3   # BR(~c_L -> ~chi_2+ s)
     8.98312154E-01    2     1000021         4   # BR(~c_L -> ~g      c)
#
#         PDG            Width
DECAY   2000004     1.93948458E+02   # scharm_R decays
#          BR         NDA      ID1       ID2
     2.34424093E-02    2     1000022         4   # BR(~c_R -> ~chi_10 c)
     3.56244567E-07    2     1000023         4   # BR(~c_R -> ~chi_20 c)
     2.08816103E-02    2     1000025         4   # BR(~c_R -> ~chi_30 c)
     3.62536285E-08    2     1000035         4   # BR(~c_R -> ~chi_40 c)
     9.55675588E-01    2     1000021         4   # BR(~c_R -> ~g      c)
#
#         PDG            Width
DECAY   1000003     2.06336149E+02   # sstrange_L decays
#          BR         NDA      ID1       ID2
     2.12350733E-03    2     1000022         3   # BR(~s_L -> ~chi_10 s)
     1.09986995E-06    2     1000023         3   # BR(~s_L -> ~chi_20 s)
     6.35738085E-04    2     1000025         3   # BR(~s_L -> ~chi_30 s)
     3.28615329E-02    2     1000035         3   # BR(~s_L -> ~chi_40 s)
     3.06626952E-04    2    -1000024         4   # BR(~s_L -> ~chi_1- c)
     6.57114607E-02    2    -1000037         4   # BR(~s_L -> ~chi_2- c)
     8.98360034E-01    2     1000021         3   # BR(~s_L -> ~g      s)
#
#         PDG            Width
DECAY   2000003     1.87506134E+02   # sstrange_R decays
#          BR         NDA      ID1       ID2
     6.06209453E-03    2     1000022         3   # BR(~s_R -> ~chi_10 s)
     9.21231778E-08    2     1000023         3   # BR(~s_R -> ~chi_20 s)
     5.39988869E-03    2     1000025         3   # BR(~s_R -> ~chi_30 s)
     9.37534191E-09    2     1000035         3   # BR(~s_R -> ~chi_40 s)
     9.88537915E-01    2     1000021         3   # BR(~s_R -> ~g      s)
#
#         PDG            Width
DECAY   1000011     2.68800282E+01   # selectron_L decays
#          BR         NDA      ID1       ID2
     8.44474232E-02    2     1000022        11   # BR(~e_L -> ~chi_10 e-)
     1.78114217E-06    2     1000023        11   # BR(~e_L -> ~chi_20 e-)
     1.06421172E-01    2     1000025        11   # BR(~e_L -> ~chi_30 e-)
     2.68552459E-01    2     1000035        11   # BR(~e_L -> ~chi_40 e-)
     2.47166305E-03    2    -1000024        12   # BR(~e_L -> ~chi_1- nu_e)
     5.38105502E-01    2    -1000037        12   # BR(~e_L -> ~chi_2- nu_e)
#
#         PDG            Width
DECAY   2000011     2.03123802E+01   # selectron_R decays
#          BR         NDA      ID1       ID2
     5.28781023E-01    2     1000022        11   # BR(~e_R -> ~chi_10 e-)
     8.03748646E-06    2     1000023        11   # BR(~e_R -> ~chi_20 e-)
     4.71210109E-01    2     1000025        11   # BR(~e_R -> ~chi_30 e-)
     8.30994469E-07    2     1000035        11   # BR(~e_R -> ~chi_40 e-)
#
#         PDG            Width
DECAY   1000013     2.68800282E+01   # smuon_L decays
#          BR         NDA      ID1       ID2
     8.44474232E-02    2     1000022        13   # BR(~mu_L -> ~chi_10 mu-)
     1.78114217E-06    2     1000023        13   # BR(~mu_L -> ~chi_20 mu-)
     1.06421172E-01    2     1000025        13   # BR(~mu_L -> ~chi_30 mu-)
     2.68552459E-01    2     1000035        13   # BR(~mu_L -> ~chi_40 mu-)
     2.47166305E-03    2    -1000024        14   # BR(~mu_L -> ~chi_1- nu_mu)
     5.38105502E-01    2    -1000037        14   # BR(~mu_L -> ~chi_2- nu_mu)
#
#         PDG            Width
DECAY   2000013     2.03123802E+01   # smuon_R decays
#          BR         NDA      ID1       ID2
     5.28781023E-01    2     1000022        13   # BR(~mu_R -> ~chi_10 mu-)
     8.03748646E-06    2     1000023        13   # BR(~mu_R -> ~chi_20 mu-)
     4.71210109E-01    2     1000025        13   # BR(~mu_R -> ~chi_30 mu-)
     8.30994469E-07    2     1000035        13   # BR(~mu_R -> ~chi_40 mu-)
#
#         PDG            Width
DECAY   1000015     2.36491007E+01   # stau_1 decays
#          BR         NDA      ID1       ID2
     2.82756436E-01    2     1000022        15   # BR(~tau_1 -> ~chi_10  tau-)
     4.65461076E-04    2     1000023        15   # BR(~tau_1 -> ~chi_20  tau-)
     2.59393172E-01    2     1000025        15   # BR(~tau_1 -> ~chi_30  tau-)
     1.50982514E-01    2     1000035        15   # BR(~tau_1 -> ~chi_40  tau-)
     3.72110663E-03    2    -1000024        16   # BR(~tau_1 -> ~chi_1-  nu_tau)
     3.02529225E-01    2    -1000037        16   # BR(~tau_1 -> ~chi_2-  nu_tau)
     1.52085672E-04    2     1000039        15   # BR(~tau_1 -> ~G       tau-)
#
#         PDG            Width
DECAY   2000015     2.36258783E+01   # stau_2 decays
#          BR         NDA      ID1       ID2
     2.68201584E-01    2     1000022        15   # BR(~tau_2 -> ~chi_10  tau-)
     6.57001228E-04    2     1000023        15   # BR(~tau_2 -> ~chi_20  tau-)
     2.67130429E-01    2     1000025        15   # BR(~tau_2 -> ~chi_30  tau-)
     1.54413489E-01    2     1000035        15   # BR(~tau_2 -> ~chi_40  tau-)
     2.00100961E-04    2    -1000024        16   # BR(~tau_2 -> ~chi_1-  nu_tau)
     3.09397395E-01    2    -1000037        16   # BR(~tau_2 -> ~chi_2-  nu_tau)
#
#         PDG            Width
DECAY   1000012     2.68813775E+01   # snu_eL decays
#          BR         NDA      ID1       ID2
     1.16627642E-01    2     1000022        12   # BR(~nu_eL -> ~chi_10 nu_e)
     1.44312883E-05    2     1000023        12   # BR(~nu_eL -> ~chi_20 nu_e)
     7.31620602E-02    2     1000025        12   # BR(~nu_eL -> ~chi_30 nu_e)
     2.69314627E-01    2     1000035        12   # BR(~nu_eL -> ~chi_40 nu_e)
     3.24481116E-03    2     1000024        11   # BR(~nu_eL -> ~chi_1+ e-)
     5.37636428E-01    2     1000037        11   # BR(~nu_eL -> ~chi_2+ e-)
#
#         PDG            Width
DECAY   1000014     2.68813775E+01   # snu_muL decays
#          BR         NDA      ID1       ID2
     1.16627642E-01    2     1000022        14   # BR(~nu_muL -> ~chi_10 nu_mu)
     1.44312883E-05    2     1000023        14   # BR(~nu_muL -> ~chi_20 nu_mu)
     7.31620602E-02    2     1000025        14   # BR(~nu_muL -> ~chi_30 nu_mu)
     2.69314627E-01    2     1000035        14   # BR(~nu_muL -> ~chi_40 nu_mu)
     3.24481116E-03    2     1000024        13   # BR(~nu_muL -> ~chi_1+ mu-)
     5.37636428E-01    2     1000037        13   # BR(~nu_muL -> ~chi_2+ mu-)
#
#         PDG            Width
DECAY   1000016     2.69076942E+01   # snu_tauL decays
#          BR         NDA      ID1       ID2
     1.16513576E-01    2     1000022        16   # BR(~nu_tauL -> ~chi_10 nu_tau)
     1.44171740E-05    2     1000023        16   # BR(~nu_tauL -> ~chi_20 nu_tau)
     7.30905051E-02    2     1000025        16   # BR(~nu_tauL -> ~chi_30 nu_tau)
     2.69051228E-01    2     1000035        16   # BR(~nu_tauL -> ~chi_40 nu_tau)
     4.21809655E-03    2     1000024        15   # BR(~nu_tauL -> ~chi_1+ tau-)
     5.37112177E-01    2     1000037        15   # BR(~nu_tauL -> ~chi_2+ tau-)
#
#         PDG            Width
DECAY   1000024     1.29607102E-04   # chargino1+ decays
#          BR         NDA      ID1       ID2
     3.79231361E-02    2     1000039        24   # BR(~chi_1+ -> ~G       W+)
#           BR         NDA      ID1       ID2       ID3
     3.20958258E-01    3     1000022         2        -1   # BR(~chi_1+ -> ~chi_10 u    db)
     3.20958258E-01    3     1000022         4        -3   # BR(~chi_1+ -> ~chi_10 c    sb)
     1.06986206E-01    3     1000022       -11        12   # BR(~chi_1+ -> ~chi_10 e+   nu_e)
     1.06986206E-01    3     1000022       -13        14   # BR(~chi_1+ -> ~chi_10 mu+  nu_mu)
     1.06187936E-01    3     1000022       -15        16   # BR(~chi_1+ -> ~chi_10 tau+ nu_tau)
#
#         PDG            Width
DECAY   1000037     3.87878637E+01   # chargino2+ decays
#          BR         NDA      ID1       ID2
     2.53244390E-01    2     1000024        23   # BR(~chi_2+ -> ~chi_1+  Z )
     1.10754794E-01    2     1000022        24   # BR(~chi_2+ -> ~chi_10  W+)
     2.46240351E-01    2     1000023        24   # BR(~chi_2+ -> ~chi_20  W+)
     1.36114067E-01    2     1000025        24   # BR(~chi_2+ -> ~chi_30  W+)
     2.53637549E-01    2     1000024        25   # BR(~chi_2+ -> ~chi_1+  h )
     8.84742039E-06    2     1000039        24   # BR(~chi_2+ -> ~G       W+)
     1.22587555E-09    2     1000039        37   # BR(~chi_2+ -> ~G       H+)
#
#         PDG            Width
DECAY   1000022    1.0E-05    # neutralino1 decays
#          BR         NDA      ID1       ID2
     4.99323716E-01    2     1000039        22   # BR(~chi_10 -> ~G        gam)
     4.89532855E-01    2     1000039        23   # BR(~chi_10 -> ~G        Z)
     1.11434293E-02    2     1000039        25   # BR(~chi_10 -> ~G        h)
#
#         PDG            Width
DECAY   1000023     1.56204222E-04   # neutralino2 decays
#          BR         NDA      ID1       ID2
     5.91886002E-04    2     1000022        22   # BR(~chi_20 -> ~chi_10 gam)
#          BR         NDA      ID1       ID2
     4.56189444E-08    2     1000039        22   # BR(~chi_20 -> ~G        gam)
     1.22100418E-03    2     1000039        23   # BR(~chi_20 -> ~G        Z)
     3.00991531E-02    2     1000039        25   # BR(~chi_20 -> ~G        h)
#           BR         NDA      ID1       ID2       ID3
     1.14824873E-01    3     1000022        -2         2   # BR(~chi_20 -> ~chi_10 ub      u)
     1.48682506E-01    3     1000022        -1         1   # BR(~chi_20 -> ~chi_10 db      d)
     1.14824873E-01    3     1000022        -4         4   # BR(~chi_20 -> ~chi_10 cb      c)
     1.48682506E-01    3     1000022        -3         3   # BR(~chi_20 -> ~chi_10 sb      s)
     1.36072735E-01    3     1000022        -5         5   # BR(~chi_20 -> ~chi_10 bb      b)
     3.39573646E-02    3     1000022       -11        11   # BR(~chi_20 -> ~chi_10 e+      e-)
     3.39573646E-02    3     1000022       -13        13   # BR(~chi_20 -> ~chi_10 mu+     mu-)
     3.36292596E-02    3     1000022       -15        15   # BR(~chi_20 -> ~chi_10 tau+    tau-)
     6.78152664E-02    3     1000022       -12        12   # BR(~chi_20 -> ~chi_10 nu_eb   nu_e)
     6.78152664E-02    3     1000022       -14        14   # BR(~chi_20 -> ~chi_10 nu_mub  nu_mu)
     6.78152664E-02    3     1000022       -16        16   # BR(~chi_20 -> ~chi_10 nu_taub nu_tau)
     1.90991090E-06    3     1000024        -2         1   # BR(~chi_20 -> ~chi_1+ ub      d)
     1.90991090E-06    3    -1000024        -1         2   # BR(~chi_20 -> ~chi_1- db      u)
     1.90991090E-06    3     1000024        -4         3   # BR(~chi_20 -> ~chi_1+ cb      s)
     1.90991090E-06    3    -1000024        -3         4   # BR(~chi_20 -> ~chi_1- sb      c)
     6.36637005E-07    3     1000024       -12        11   # BR(~chi_20 -> ~chi_1+ nu_eb   e-)
     6.36637005E-07    3    -1000024        12       -11   # BR(~chi_20 -> ~chi_1- nu_e    e+)
     6.36637005E-07    3     1000024       -14        13   # BR(~chi_20 -> ~chi_1+ nu_mub  mu-)
     6.36637005E-07    3    -1000024        14       -13   # BR(~chi_20 -> ~chi_1- nu_mu   mu+)
     2.21603937E-07    3     1000024       -16        15   # BR(~chi_20 -> ~chi_1+ nu_taub tau-)
     2.21603937E-07    3    -1000024        16       -15   # BR(~chi_20 -> ~chi_1- nu_tau  tau+)
#
#         PDG            Width
DECAY   1000025     2.12758236E-04   # neutralino3 decays
#          BR         NDA      ID1       ID2
     3.93987779E-04    2     1000022        22   # BR(~chi_30 -> ~chi_10 gam)
     8.36076447E-06    2     1000023        22   # BR(~chi_30 -> ~chi_20 gam)
#          BR         NDA      ID1       ID2
     2.04495317E-02    2     1000039        22   # BR(~chi_30 -> ~G        gam)
     1.81368498E-02    2     1000039        23   # BR(~chi_30 -> ~G        Z)
     5.21642165E-04    2     1000039        25   # BR(~chi_30 -> ~G        h)
#           BR         NDA      ID1       ID2       ID3
     1.06306584E-05    3     1000022        -2         2   # BR(~chi_30 -> ~chi_10 ub      u)
     1.25645310E-05    3     1000022        -1         1   # BR(~chi_30 -> ~chi_10 db      d)
     1.06306584E-05    3     1000022        -4         4   # BR(~chi_30 -> ~chi_10 cb      c)
     1.25645310E-05    3     1000022        -3         3   # BR(~chi_30 -> ~chi_10 sb      s)
     2.88460058E-05    3     1000022        -5         5   # BR(~chi_30 -> ~chi_10 bb      b)
     2.15975860E-06    3     1000022       -11        11   # BR(~chi_30 -> ~chi_10 e+      e-)
     2.15975860E-06    3     1000022       -13        13   # BR(~chi_30 -> ~chi_10 mu+     mu-)
     4.64636480E-06    3     1000022       -15        15   # BR(~chi_30 -> ~chi_10 tau+    tau-)
     6.17093983E-06    3     1000022       -12        12   # BR(~chi_30 -> ~chi_10 nu_eb   nu_e)
     6.17093983E-06    3     1000022       -14        14   # BR(~chi_30 -> ~chi_10 nu_mub  nu_mu)
     6.17093983E-06    3     1000022       -16        16   # BR(~chi_30 -> ~chi_10 nu_taub nu_tau)
     2.21860776E-02    3     1000023        -2         2   # BR(~chi_30 -> ~chi_20 ub      u)
     2.87279718E-02    3     1000023        -1         1   # BR(~chi_30 -> ~chi_20 db      d)
     2.21860776E-02    3     1000023        -4         4   # BR(~chi_30 -> ~chi_20 cb      c)
     2.87279718E-02    3     1000023        -3         3   # BR(~chi_30 -> ~chi_20 sb      s)
     2.47632951E-02    3     1000023        -5         5   # BR(~chi_30 -> ~chi_20 bb      b)
     6.56114673E-03    3     1000023       -11        11   # BR(~chi_30 -> ~chi_20 e+      e-)
     6.56114673E-03    3     1000023       -13        13   # BR(~chi_30 -> ~chi_20 mu+     mu-)
     6.46624065E-03    3     1000023       -15        15   # BR(~chi_30 -> ~chi_20 tau+    tau-)
     1.31030050E-02    3     1000023       -12        12   # BR(~chi_30 -> ~chi_20 nu_eb   nu_e)
     1.31030050E-02    3     1000023       -14        14   # BR(~chi_30 -> ~chi_20 nu_mub  nu_mu)
     1.31030050E-02    3     1000023       -16        16   # BR(~chi_30 -> ~chi_20 nu_taub nu_tau)
     1.29279377E-01    3     1000024        -2         1   # BR(~chi_30 -> ~chi_1+ ub      d)
     1.29279377E-01    3    -1000024        -1         2   # BR(~chi_30 -> ~chi_1- db      u)
     1.29279377E-01    3     1000024        -4         3   # BR(~chi_30 -> ~chi_1+ cb      s)
     1.29279377E-01    3    -1000024        -3         4   # BR(~chi_30 -> ~chi_1- sb      c)
     4.30930637E-02    3     1000024       -12        11   # BR(~chi_30 -> ~chi_1+ nu_eb   e-)
     4.30930637E-02    3    -1000024        12       -11   # BR(~chi_30 -> ~chi_1- nu_e    e+)
     4.30930637E-02    3     1000024       -14        13   # BR(~chi_30 -> ~chi_1+ nu_mub  mu-)
     4.30930637E-02    3    -1000024        14       -13   # BR(~chi_30 -> ~chi_1- nu_mu   mu+)
     4.27041037E-02    3     1000024       -16        15   # BR(~chi_30 -> ~chi_1+ nu_taub tau-)
     4.27041037E-02    3    -1000024        16       -15   # BR(~chi_30 -> ~chi_1- nu_tau  tau+)
#
#         PDG            Width
DECAY   1000035     3.87879560E+01   # neutralino4 decays
#          BR         NDA      ID1       ID2
     5.36842933E-04    2     1000022        23   # BR(~chi_40 -> ~chi_10   Z )
     2.51846165E-01    2     1000023        23   # BR(~chi_40 -> ~chi_20   Z )
     6.24914795E-04    2     1000025        23   # BR(~chi_40 -> ~chi_30   Z )
     2.46469792E-01    2     1000024       -24   # BR(~chi_40 -> ~chi_1+   W-)
     2.46469792E-01    2    -1000024        24   # BR(~chi_40 -> ~chi_1-   W+)
     1.13440380E-01    2     1000022        25   # BR(~chi_40 -> ~chi_10   h )
     1.14001814E-03    2     1000023        25   # BR(~chi_40 -> ~chi_20   h )
     1.39463248E-01    2     1000025        25   # BR(~chi_40 -> ~chi_30   h )
     2.11954237E-06    2     1000039        22   # BR(~chi_40 -> ~G        gam)
     6.72688331E-06    2     1000039        23   # BR(~chi_40 -> ~G        Z)
     7.15672604E-10    2     1000039        25   # BR(~chi_40 -> ~G        h)
     1.19916131E-09    2     1000039        35   # BR(~chi_40 -> ~G        H)
     2.17166775E-11    2     1000039        36   # BR(~chi_40 -> ~G        A)
#
#         PDG            Width
DECAY        25     4.22042523E-03   # h decays
#          BR         NDA      ID1       ID2
     6.02081710E-01    2           5        -5   # BR(h -> b       bb     )
     6.22087488E-02    2         -15        15   # BR(h -> tau+    tau-   )
     2.20191850E-04    2         -13        13   # BR(h -> mu+     mu-    )
     4.65883323E-04    2           3        -3   # BR(h -> s       sb     )
     2.00989294E-02    2           4        -4   # BR(h -> c       cb     )
     6.63766403E-02    2          21        21   # BR(h -> g       g      )
     2.30578540E-03    2          22        22   # BR(h -> gam     gam    )
     1.62585698E-03    2          22        23   # BR(h -> Z       gam    )
     2.16549053E-01    2          24       -24   # BR(h -> W+      W-     )
     2.80672013E-02    2          23        23   # BR(h -> Z       Z      )
#
#         PDG            Width
DECAY        35     3.78104272E+01   # H decays
#          BR         NDA      ID1       ID2
     1.46872543E-03    2           5        -5   # BR(H -> b       bb     )
     2.46425259E-04    2         -15        15   # BR(H -> tau+    tau-   )
     8.71205036E-07    2         -13        13   # BR(H -> mu+     mu-    )
     1.11546041E-06    2           3        -3   # BR(H -> s       sb     )
     1.00668233E-05    2           4        -4   # BR(H -> c       cb     )
     9.96065702E-01    2           6        -6   # BR(H -> t       tb     )
     7.97755599E-04    2          21        21   # BR(H -> g       g      )
     2.71478133E-06    2          22        22   # BR(H -> gam     gam    )
     1.16010445E-06    2          23        22   # BR(H -> Z       gam    )
     3.35366705E-04    2          24       -24   # BR(H -> W+      W-     )
     1.67226003E-04    2          23        23   # BR(H -> Z       Z      )
     9.02870263E-04    2          25        25   # BR(H -> h       h      )
     7.43818829E-24    2          36        36   # BR(H -> A       A      )
     2.97272370E-11    2          23        36   # BR(H -> Z       A      )
     6.81661232E-12    2          24       -37   # BR(H -> W+      H-     )
     6.81661232E-12    2         -24        37   # BR(H -> W-      H+     )
#
#         PDG            Width
DECAY        36     3.82381699E+01   # A decays
#          BR         NDA      ID1       ID2
     1.47165914E-03    2           5        -5   # BR(A -> b       bb     )
     2.43898085E-04    2         -15        15   # BR(A -> tau+    tau-   )
     8.62267836E-07    2         -13        13   # BR(A -> mu+     mu-    )
     1.13677566E-06    2           3        -3   # BR(A -> s       sb     )
     9.96177971E-06    2           4        -4   # BR(A -> c       cb     )
     9.96997482E-01    2           6        -6   # BR(A -> t       tb     )
     9.43677057E-04    2          21        21   # BR(A -> g       g      )
     3.15260668E-06    2          22        22   # BR(A -> gam     gam    )
     1.35269747E-06    2          23        22   # BR(A -> Z       gam    )
     3.26818057E-04    2          23        25   # BR(A -> Z       h      )
#
#         PDG            Width
DECAY        37     3.74472260E+01   # H+ decays
#          BR         NDA      ID1       ID2
     2.35911914E-06    2           4        -5   # BR(H+ -> c       bb     )
     2.49237848E-04    2         -15        16   # BR(H+ -> tau+    nu_tau )
     8.81145825E-07    2         -13        14   # BR(H+ -> mu+     nu_mu  )
     1.49984762E-08    2           2        -5   # BR(H+ -> u       bb     )
     5.45694780E-08    2           2        -3   # BR(H+ -> u       sb     )
     1.08731754E-05    2           4        -3   # BR(H+ -> c       sb     )
     9.99401627E-01    2           6        -5   # BR(H+ -> t       bb     )
     3.34952190E-04    2          24        25   # BR(H+ -> W+      h      )
     2.77318178E-13    2          24        36   # BR(H+ -> W+      A      )
