#
#                              ======================
#                              | THE SUSYHIT OUTPUT |
#                              ======================
#
#
#              ------------------------------------------------------
#              |     This is the output of the SUSY-HIT package     |
#              |  created by A.Djouadi, M.Muehlleitner and M.Spira. |
#              |  In case of problems with SUSY-HIT email to        |
#              |           margarete.muehlleitner@cern.ch           |
#              |           michael.spira@psi.ch                     |
#              |           abdelhak.djouadi@cern.ch                 |
#              ------------------------------------------------------
#
#              ------------------------------------------------------
#              |  SUSY Les Houches Accord - MSSM Spectrum + Decays  |
#              |              based on the decay programs           |
#              |                                                    |
#              |                     SDECAY 1.3b                    |
#              |                                                    |
#              |  Authors: M.Muhlleitner, A.Djouadi and Y.Mambrini  |
#              |  Ref.:    Comput.Phys.Commun.168(2005)46           |
#              |           [hep-ph/0311167]                         |
#              |                                                    |
#              |                     HDECAY 3.4                     |
#              |                                                    |
#              |  By: A.Djouadi,J.Kalinowski,M.Muhlleitner,M.Spira  |
#              |  Ref.:    Comput.Phys.Commun.108(1998)56           |
#              |           [hep-ph/9704448]                         |
#              |                                                    |
#              |                                                    |
#              |  If not stated otherwise all DRbar couplings and   |
#              |  soft SUSY breaking masses are given at the scale  |
#              |  Q=  0.50007677E+04
#              |                                                    |
#              ------------------------------------------------------
#
#
BLOCK DCINFO  # Decay Program information
     1   SDECAY/HDECAY # decay calculator
     2   1.3b  /3.4    # version number
#
BLOCK SPINFO  # Spectrum calculator information
     1    SOFTSUSY    # spectrum calculator                
     2    3.4.0       # version number                     
#
BLOCK MODSEL  # Model selection
     1     0   #  nonUniversal                                     
#
BLOCK SMINPUTS  # Standard Model inputs
         1     1.25778332E+02   # alpha_em^-1(M_Z)^MSbar
         2     1.16570000E-05   # G_F [GeV^-2]
         3     1.17200002E-01   # alpha_S(M_Z)^MSbar
         4     9.11876000E+01   # M_Z pole mass
         5     4.25000000E+00   # mb(mb)^MSbar
         6     1.72500000E+02   # mt pole mass
         7     1.77682000E+00   # mtau pole mass
#
BLOCK MINPAR  # Input parameters - minimal models
         3     1.00000000E+01   # tanb                
#
BLOCK EXTPAR  # Input parameters - non-minimal models
         0    -1.00000000E+00   # Set                 
         1     6.00000000E+01   # M_1(MX)             
         2     3.00000000E+03   # M_2(MX)             
         3     2.42817700E+03   # M_3(MX)             
        11     5.00000000E+03   # At(MX)              
        12     5.00000000E+03   # Ab(MX)              
        13     0.00000000E+00   # Atau(MX)            
        23    -3.78669000E+02   # mu(MX)              
        26     3.00000000E+03   # mA(pole)            
        31     5.00000000E+03   # meL(MX)             
        32     5.00000000E+03   # mmuL(MX)            
        33     5.00000000E+03   # mtauL(MX)           
        34     5.00000000E+03   # meR(MX)             
        35     5.00000000E+03   # mmuR(MX)            
        36     5.00000000E+03   # mtauR(MX)           
        41     5.00000000E+03   # mqL1(MX)            
        42     5.00000000E+03   # mqL2(MX)            
        43     5.00000000E+03   # mqL3(MX)            
        44     5.00000000E+03   # muR(MX)             
        45     5.00000000E+03   # mcR(MX)             
        46     5.00000000E+03   # mtR(MX)             
        47     5.00000000E+03   # mdR(MX)             
        48     5.00000000E+03   # msR(MX)             
        49     5.00000000E+03   # mbR(MX)             
#
BLOCK MASS  # Mass Spectrum
# PDG code           mass       particle
        24     8.00926933E+01   # W+
        25     1.24800548E+02   # h
        35     3.00008741E+03   # H
        36     2.99999961E+03   # A
        37     3.00145199E+03   # H+
         5     4.87878001E+00   # b-quark pole mass calculated from mb(mb)_Msbar
   1000001     5.08633979E+03   # ~d_L
   2000001     5.06853799E+03   # ~d_R
   1000002     5.08586953E+03   # ~u_L
   2000002     5.06823631E+03   # ~u_R
   1000003     5.08633979E+03   # ~s_L
   2000003     5.06853799E+03   # ~s_R
   1000004     5.08586953E+03   # ~c_L
   2000004     5.06823631E+03   # ~c_R
   1000005     5.03222425E+03   # ~b_1
   2000005     5.06669763E+03   # ~b_2
   1000006     4.92470227E+03   # ~t_1
   2000006     5.07466311E+03   # ~t_2
   1000011     5.01911882E+03   # ~e_L
   2000011     5.00594828E+03   # ~e_R
   1000012     5.01816818E+03   # ~nu_eL
   1000013     5.01911882E+03   # ~mu_L
   2000013     5.00594828E+03   # ~mu_R
   1000014     5.01816818E+03   # ~nu_muL
   1000015     5.00479675E+03   # ~tau_1
   2000015     5.01861996E+03   # ~tau_2
   1000016     5.01761553E+03   # ~nu_tauL
   1000021     2.80000099E+03   # ~g
   1000022     6.00913913E+01   # ~chi_10
   1000023     4.01022432E+02   # ~chi_20
   1000025    -4.03141871E+02   # ~chi_30
   1000035     3.07418231E+03   # ~chi_40
   1000024     4.00000648E+02   # ~chi_1+
   1000037     3.07435009E+03   # ~chi_2+
#
BLOCK NMIX  # Neutralino Mixing Matrix
  1  1     9.93745711E-01   # N_11
  1  2     1.92589805E-04   # N_12
  1  3    -1.11540153E-01   # N_13
  1  4    -5.31224146E-03   # N_14
  2  1     8.26709777E-02   # N_21
  2  2     1.83214360E-02   # N_22
  2  3     7.02939697E-01   # N_23
  2  4     7.06190921E-01   # N_24
  3  1    -7.50654277E-02   # N_31
  3  2     1.75058706E-02   # N_32
  3  3    -7.02448762E-01   # N_33
  3  4     7.07548206E-01   # N_34
  4  1    -3.92076565E-04   # N_41
  4  2     9.99678865E-01   # N_42
  4  3    -5.60586088E-04   # N_43
  4  4    -2.53317909E-02   # N_44
#
BLOCK UMIX  # Chargino Mixing Matrix U
  1  1     7.96362112E-04   # U_11
  1  2     9.99999683E-01   # U_12
  2  1    -9.99999683E-01   # U_21
  2  2     7.96362112E-04   # U_22
#
BLOCK VMIX  # Chargino Mixing Matrix V
  1  1     3.58397935E-02   # V_11
  1  2    -9.99357548E-01   # V_12
  2  1    -9.99357548E-01   # V_21
  2  2    -3.58397935E-02   # V_22
#
BLOCK STOPMIX  # Stop Mixing Matrix
  1  1    -5.00077359E-01   # cos(theta_t)
  1  2     8.65980736E-01   # sin(theta_t)
  2  1    -8.65980736E-01   # -sin(theta_t)
  2  2    -5.00077359E-01   # cos(theta_t)
#
BLOCK SBOTMIX  # Sbottom Mixing Matrix
  1  1     9.99022302E-01   # cos(theta_b)
  1  2    -4.42090501E-02   # sin(theta_b)
  2  1     4.42090501E-02   # -sin(theta_b)
  2  2     9.99022302E-01   # cos(theta_b)
#
BLOCK STAUMIX  # Stau Mixing Matrix
  1  1    -4.53487062E-02   # cos(theta_tau)
  1  2     9.98971218E-01   # sin(theta_tau)
  2  1    -9.98971218E-01   # -sin(theta_tau)
  2  2    -4.53487062E-02   # cos(theta_tau)
#
BLOCK ALPHA  # Higgs mixing
          -1.05496216E-01   # Mixing angle in the neutral Higgs boson sector
#
BLOCK HMIX Q=  5.00076771E+03  # DRbar Higgs Parameters
         1    -3.85617344E+02   # mu(Q)MSSM           
         2     9.46839462E+00   # tan                 
         3     2.41728303E+02   # higgs               
         4     8.71486003E+06   # mA^2(Q)MSSM         
#
BLOCK GAUGE Q=  5.00076771E+03  # The gauge couplings
     1     3.70989828E-01   # gprime(Q) DRbar
     2     6.33526742E-01   # g(Q) DRbar
     3     9.93523590E-01   # g3(Q) DRbar
#
BLOCK AU Q=  5.00076771E+03  # The trilinear couplings
  1  1     5.00000002E+03   # A_u(Q) DRbar
  2  2     5.00000002E+03   # A_c(Q) DRbar
  3  3     5.00000003E+03   # A_t(Q) DRbar
#
BLOCK AD Q=  5.00076771E+03  # The trilinear couplings
  1  1     5.00000001E+03   # A_d(Q) DRbar
  2  2     5.00000001E+03   # A_s(Q) DRbar
  3  3     5.00000001E+03   # A_b(Q) DRbar
#
BLOCK AE Q=  5.00076771E+03  # The trilinear couplings
  1  1     0.00000000E+00   # A_e(Q) DRbar
  2  2     2.90099817E-07   # A_mu(Q) DRbar
  3  3     2.90197798E-07   # A_tau(Q) DRbar
#
BLOCK Yu Q=  5.00076771E+03  # The Yukawa couplings
  1  1     0.00000000E+00   # y_u(Q) DRbar
  2  2     0.00000000E+00   # y_c(Q) DRbar
  3  3     8.21817546E-01   # y_t(Q) DRbar
#
BLOCK Yd Q=  5.00076771E+03  # The Yukawa couplings
  1  1     0.00000000E+00   # y_d(Q) DRbar
  2  2     0.00000000E+00   # y_s(Q) DRbar
  3  3     1.30292847E-01   # y_b(Q) DRbar
#
BLOCK Ye Q=  5.00076771E+03  # The Yukawa couplings
  1  1     0.00000000E+00   # y_e(Q) DRbar
  2  2     0.00000000E+00   # y_mu(Q) DRbar
  3  3     9.71983196E-02   # y_tau(Q) DRbar
#
BLOCK MSOFT Q=  5.00076771E+03  # The soft SUSY breaking masses at the scale Q
         1     6.00000000E+01   # M_1(Q)              
         2     3.00000000E+03   # M_2(Q)              
         3     2.42817700E+03   # M_3(Q)              
        21     8.57937317E+06   # mH1^2(Q)            
        22     4.31573647E+05   # mH2^2(Q)            
        31     5.00000000E+03   # meL(Q)              
        32     5.00000000E+03   # mmuL(Q)             
        33     5.00000000E+03   # mtauL(Q)            
        34     5.00000000E+03   # meR(Q)              
        35     5.00000000E+03   # mmuR(Q)             
        36     5.00000000E+03   # mtauR(Q)            
        41     4.99999999E+03   # mqL1(Q)             
        42     4.99999999E+03   # mqL2(Q)             
        43     4.99999999E+03   # mqL3(Q)             
        44     4.99999999E+03   # muR(Q)              
        45     4.99999999E+03   # mcR(Q)              
        46     4.99999999E+03   # mtR(Q)              
        47     4.99999999E+03   # mdR(Q)              
        48     4.99999999E+03   # msR(Q)              
        49     4.99999999E+03   # mbR(Q)              
#
#
#
#                             =================
#                             |The decay table|
#                             =================
#
# - The QCD corrections to the decays gluino -> squark  + quark
#                                     squark -> gaugino + quark_prime
#                                     squark -> squark_prime + Higgs
#                                     squark -> gluino  + quark
#   are included.
#
# - The multi-body decays for the inos, stops and sbottoms are included.
#
# - The loop induced decays for the gluino, neutralinos and stops
#   are included.
#
# - The SUSY decays of the top quark are included.
#
#
#         PDG            Width
DECAY         6     1.40658921E+00   # top decays
#          BR         NDA      ID1       ID2
     1.00000000E+00    2           5        24   # BR(t ->  b    W+)
#
#         PDG            Width
DECAY   1000021     1.50023869E-02   # gluino decays
#          BR         NDA      ID1       ID2
     5.84035163E-08    2     1000022        21   # BR(~g -> ~chi_10 g)
     3.15175979E-03    2     1000023        21   # BR(~g -> ~chi_20 g)
     3.05784899E-03    2     1000025        21   # BR(~g -> ~chi_30 g)
#           BR         NDA      ID1       ID2       ID3
     9.23626368E-03    3     1000022         1        -1   # BR(~g -> ~chi_10 d  db)
     5.24346259E-05    3     1000023         1        -1   # BR(~g -> ~chi_20 d  db)
     6.08608255E-05    3     1000025         1        -1   # BR(~g -> ~chi_30 d  db)
     3.14995804E-02    3     1000022         2        -2   # BR(~g -> ~chi_10 u  ub)
     2.67428235E-04    3     1000023         2        -2   # BR(~g -> ~chi_20 u  ub)
     1.11733895E-04    3     1000025         2        -2   # BR(~g -> ~chi_30 u  ub)
     9.23626368E-03    3     1000022         3        -3   # BR(~g -> ~chi_10 s  sb)
     5.24346259E-05    3     1000023         3        -3   # BR(~g -> ~chi_20 s  sb)
     6.08608255E-05    3     1000025         3        -3   # BR(~g -> ~chi_30 s  sb)
     3.14995804E-02    3     1000022         4        -4   # BR(~g -> ~chi_10 c  cb)
     2.67428235E-04    3     1000023         4        -4   # BR(~g -> ~chi_20 c  cb)
     1.11733895E-04    3     1000025         4        -4   # BR(~g -> ~chi_30 c  cb)
     9.51623507E-03    3     1000022         5        -5   # BR(~g -> ~chi_10 b  bb)
     5.30388357E-03    3     1000023         5        -5   # BR(~g -> ~chi_20 b  bb)
     5.29404882E-03    3     1000025         5        -5   # BR(~g -> ~chi_30 b  bb)
     3.24159559E-02    3     1000022         6        -6   # BR(~g -> ~chi_10 t  tb)
     2.13555923E-01    3     1000023         6        -6   # BR(~g -> ~chi_20 t  tb)
     2.05560610E-01    3     1000025         6        -6   # BR(~g -> ~chi_30 t  tb)
     5.27931615E-05    3     1000024         1        -2   # BR(~g -> ~chi_1+ d  ub)
     5.27931615E-05    3    -1000024         2        -1   # BR(~g -> ~chi_1- u  db)
     5.27931615E-05    3     1000024         3        -4   # BR(~g -> ~chi_1+ s  cb)
     5.27931615E-05    3    -1000024         4        -3   # BR(~g -> ~chi_1- c  sb)
     2.19737950E-01    3     1000024         5        -6   # BR(~g -> ~chi_1+ b  tb)
     2.19737950E-01    3    -1000024         6        -5   # BR(~g -> ~chi_1- t  bb)
#
#         PDG            Width
DECAY   1000006     2.72691847E+02   # stop1 decays
#          BR         NDA      ID1       ID2
     3.20525986E-02    2     1000022         6   # BR(~t_1 -> ~chi_10 t )
     1.21766719E-01    2     1000023         6   # BR(~t_1 -> ~chi_20 t )
     1.14096163E-01    2     1000025         6   # BR(~t_1 -> ~chi_30 t )
     7.29861450E-03    2     1000035         6   # BR(~t_1 -> ~chi_40 t )
     1.77505954E-01    2     1000024         5   # BR(~t_1 -> ~chi_1+ b )
     1.45499710E-02    2     1000037         5   # BR(~t_1 -> ~chi_2+ b )
     5.32729980E-01    2     1000021         6   # BR(~t_1 -> ~g      t )
#
#         PDG            Width
DECAY   2000006     2.79548329E+02   # stop2 decays
#          BR         NDA      ID1       ID2
     1.23391106E-02    2     1000022         6   # BR(~t_2 -> ~chi_10 t )
     1.17179225E-01    2     1000023         6   # BR(~t_2 -> ~chi_20 t )
     1.25638303E-01    2     1000025         6   # BR(~t_2 -> ~chi_30 t )
     2.04898289E-02    2     1000035         6   # BR(~t_2 -> ~chi_40 t )
     6.75641519E-02    2     1000024         5   # BR(~t_2 -> ~chi_1+ b )
     4.08021955E-02    2     1000037         5   # BR(~t_2 -> ~chi_2+ b )
     6.11873248E-01    2     1000021         6   # BR(~t_2 -> ~g      t )
     9.54950360E-04    2     1000006        25   # BR(~t_2 -> ~t_1    h )
     3.15898699E-03    2     1000006        23   # BR(~t_2 -> ~t_1    Z )
#
#         PDG            Width
DECAY   1000005     2.53747080E+02   # sbottom1 decays
#          BR         NDA      ID1       ID2
     3.07897866E-03    2     1000022         5   # BR(~b_1 -> ~chi_10 b )
     3.22055676E-03    2     1000023         5   # BR(~b_1 -> ~chi_20 b )
     3.25294975E-03    2     1000025         5   # BR(~b_1 -> ~chi_30 b )
     3.01947267E-02    2     1000035         5   # BR(~b_1 -> ~chi_40 b )
     2.61387655E-01    2    -1000024         6   # BR(~b_1 -> ~chi_1- t )
     6.06198426E-02    2    -1000037         6   # BR(~b_1 -> ~chi_2- t )
     6.36166858E-01    2     1000021         5   # BR(~b_1 -> ~g      b )
     2.07843193E-03    2     1000006       -24   # BR(~b_1 -> ~t_1    W-)
#
#         PDG            Width
DECAY   2000005     1.70800704E+02   # sbottom2 decays
#          BR         NDA      ID1       ID2
     1.70888953E-02    2     1000022         5   # BR(~b_2 -> ~chi_10 b )
     5.05145493E-03    2     1000023         5   # BR(~b_2 -> ~chi_20 b )
     5.08331326E-03    2     1000025         5   # BR(~b_2 -> ~chi_30 b )
     7.63443251E-05    2     1000035         5   # BR(~b_2 -> ~chi_40 b )
     1.05066531E-02    2    -1000024         6   # BR(~b_2 -> ~chi_1- t )
     1.53303287E-04    2    -1000037         6   # BR(~b_2 -> ~chi_2- t )
     9.62013957E-01    2     1000021         5   # BR(~b_2 -> ~g      b )
     2.60790819E-05    2     1000006       -24   # BR(~b_2 -> ~t_1    W-)
#
#         PDG            Width
DECAY   1000002     1.90585368E+02   # sup_L decays
#          BR         NDA      ID1       ID2
     3.86814063E-03    2     1000022         2   # BR(~u_L -> ~chi_10 u)
     1.20487316E-04    2     1000023         2   # BR(~u_L -> ~chi_20 u)
     8.25970908E-07    2     1000025         2   # BR(~u_L -> ~chi_30 u)
     4.17023523E-02    2     1000035         2   # BR(~u_L -> ~chi_40 u)
     2.60694460E-04    2     1000024         1   # BR(~u_L -> ~chi_1+ d)
     8.33534806E-02    2     1000037         1   # BR(~u_L -> ~chi_2+ d)
     8.70694019E-01    2     1000021         2   # BR(~u_L -> ~g      u)
#
#         PDG            Width
DECAY   2000002     1.76241752E+02   # sup_R decays
#          BR         NDA      ID1       ID2
     6.65575202E-02    2     1000022         2   # BR(~u_R -> ~chi_10 u)
     4.55539241E-04    2     1000023         2   # BR(~u_R -> ~chi_20 u)
     3.75529825E-04    2     1000025         2   # BR(~u_R -> ~chi_30 u)
     4.18137204E-09    2     1000035         2   # BR(~u_R -> ~chi_40 u)
     9.32611407E-01    2     1000021         2   # BR(~u_R -> ~g      u)
#
#         PDG            Width
DECAY   1000001     1.90601977E+02   # sdown_L decays
#          BR         NDA      ID1       ID2
     3.85283806E-03    2     1000022         1   # BR(~d_L -> ~chi_10 d)
     4.84102823E-07    2     1000023         1   # BR(~d_L -> ~chi_20 d)
     1.04926613E-04    2     1000025         1   # BR(~d_L -> ~chi_30 d)
     4.17241786E-02    2     1000035         1   # BR(~d_L -> ~chi_40 d)
     1.28714097E-07    2    -1000024         2   # BR(~d_L -> ~chi_1- u)
     8.34787495E-02    2    -1000037         2   # BR(~d_L -> ~chi_2- u)
     8.70838694E-01    2     1000021         1   # BR(~d_L -> ~g      d)
#
#         PDG            Width
DECAY   2000001     1.67361395E+02   # sdown_R decays
#          BR         NDA      ID1       ID2
     1.75233492E-02    2     1000022         1   # BR(~d_R -> ~chi_10 d)
     1.19935113E-04    2     1000023         1   # BR(~d_R -> ~chi_20 d)
     9.88701057E-05    2     1000025         1   # BR(~d_R -> ~chi_30 d)
     1.10102713E-09    2     1000035         1   # BR(~d_R -> ~chi_40 d)
     9.82257844E-01    2     1000021         1   # BR(~d_R -> ~g      d)
#
#         PDG            Width
DECAY   1000004     1.90585368E+02   # scharm_L decays
#          BR         NDA      ID1       ID2
     3.86814063E-03    2     1000022         4   # BR(~c_L -> ~chi_10 c)
     1.20487316E-04    2     1000023         4   # BR(~c_L -> ~chi_20 c)
     8.25970908E-07    2     1000025         4   # BR(~c_L -> ~chi_30 c)
     4.17023523E-02    2     1000035         4   # BR(~c_L -> ~chi_40 c)
     2.60694460E-04    2     1000024         3   # BR(~c_L -> ~chi_1+ s)
     8.33534806E-02    2     1000037         3   # BR(~c_L -> ~chi_2+ s)
     8.70694019E-01    2     1000021         4   # BR(~c_L -> ~g      c)
#
#         PDG            Width
DECAY   2000004     1.76241752E+02   # scharm_R decays
#          BR         NDA      ID1       ID2
     6.65575202E-02    2     1000022         4   # BR(~c_R -> ~chi_10 c)
     4.55539241E-04    2     1000023         4   # BR(~c_R -> ~chi_20 c)
     3.75529825E-04    2     1000025         4   # BR(~c_R -> ~chi_30 c)
     4.18137204E-09    2     1000035         4   # BR(~c_R -> ~chi_40 c)
     9.32611407E-01    2     1000021         4   # BR(~c_R -> ~g      c)
#
#         PDG            Width
DECAY   1000003     1.90601977E+02   # sstrange_L decays
#          BR         NDA      ID1       ID2
     3.85283806E-03    2     1000022         3   # BR(~s_L -> ~chi_10 s)
     4.84102823E-07    2     1000023         3   # BR(~s_L -> ~chi_20 s)
     1.04926613E-04    2     1000025         3   # BR(~s_L -> ~chi_30 s)
     4.17241786E-02    2     1000035         3   # BR(~s_L -> ~chi_40 s)
     1.28714097E-07    2    -1000024         4   # BR(~s_L -> ~chi_1- c)
     8.34787495E-02    2    -1000037         4   # BR(~s_L -> ~chi_2- c)
     8.70838694E-01    2     1000021         3   # BR(~s_L -> ~g      s)
#
#         PDG            Width
DECAY   2000003     1.67361395E+02   # sstrange_R decays
#          BR         NDA      ID1       ID2
     1.75233492E-02    2     1000022         3   # BR(~s_R -> ~chi_10 s)
     1.19935113E-04    2     1000023         3   # BR(~s_R -> ~chi_20 s)
     9.88701057E-05    2     1000025         3   # BR(~s_R -> ~chi_30 s)
     1.10102713E-09    2     1000035         3   # BR(~s_R -> ~chi_40 s)
     9.82257844E-01    2     1000021         3   # BR(~s_R -> ~g      s)
#
#         PDG            Width
DECAY   1000011     3.03506283E+01   # selectron_L decays
#          BR         NDA      ID1       ID2
     2.23664664E-01    2     1000022        11   # BR(~e_L -> ~chi_10 e-)
     2.90275175E-03    2     1000023        11   # BR(~e_L -> ~chi_20 e-)
     4.56022462E-04    2     1000025        11   # BR(~e_L -> ~chi_30 e-)
     2.57491976E-01    2     1000035        11   # BR(~e_L -> ~chi_40 e-)
     8.26811878E-07    2    -1000024        12   # BR(~e_L -> ~chi_1- nu_e)
     5.15483759E-01    2    -1000037        12   # BR(~e_L -> ~chi_2- nu_e)
#
#         PDG            Width
DECAY   2000011     2.74016816E+01   # selectron_R decays
#          BR         NDA      ID1       ID2
     9.87685443E-01    2     1000022        11   # BR(~e_R -> ~chi_10 e-)
     6.75005511E-03    2     1000023        11   # BR(~e_R -> ~chi_20 e-)
     5.56444224E-03    2     1000025        11   # BR(~e_R -> ~chi_30 e-)
     5.96671653E-08    2     1000035        11   # BR(~e_R -> ~chi_40 e-)
#
#         PDG            Width
DECAY   1000013     3.03506283E+01   # smuon_L decays
#          BR         NDA      ID1       ID2
     2.23664664E-01    2     1000022        13   # BR(~mu_L -> ~chi_10 mu-)
     2.90275175E-03    2     1000023        13   # BR(~mu_L -> ~chi_20 mu-)
     4.56022462E-04    2     1000025        13   # BR(~mu_L -> ~chi_30 mu-)
     2.57491976E-01    2     1000035        13   # BR(~mu_L -> ~chi_40 mu-)
     8.26811878E-07    2    -1000024        14   # BR(~mu_L -> ~chi_1- nu_mu)
     5.15483759E-01    2    -1000037        14   # BR(~mu_L -> ~chi_2- nu_mu)
#
#         PDG            Width
DECAY   2000013     2.74016816E+01   # smuon_R decays
#          BR         NDA      ID1       ID2
     9.87685443E-01    2     1000022        13   # BR(~mu_R -> ~chi_10 mu-)
     6.75005511E-03    2     1000023        13   # BR(~mu_R -> ~chi_20 mu-)
     5.56444224E-03    2     1000025        13   # BR(~mu_R -> ~chi_30 mu-)
     5.96671653E-08    2     1000035        13   # BR(~mu_R -> ~chi_40 mu-)
#
#         PDG            Width
DECAY   1000015     2.92571290E+01   # stau_1 decays
#          BR         NDA      ID1       ID2
     9.24679269E-01    2     1000022        15   # BR(~tau_1 -> ~chi_10  tau-)
     2.17157645E-02    2     1000023        15   # BR(~tau_1 -> ~chi_20  tau-)
     2.02888578E-02    2     1000025        15   # BR(~tau_1 -> ~chi_30  tau-)
     5.41143122E-04    2     1000035        15   # BR(~tau_1 -> ~chi_40  tau-)
     3.16917762E-02    2    -1000024        16   # BR(~tau_1 -> ~chi_1-  nu_tau)
     1.08318890E-03    2    -1000037        16   # BR(~tau_1 -> ~chi_2-  nu_tau)
#
#         PDG            Width
DECAY   2000015     3.12686535E+01   # stau_2 decays
#          BR         NDA      ID1       ID2
     2.17972698E-01    2     1000022        15   # BR(~tau_2 -> ~chi_10  tau-)
     1.78035474E-02    2     1000023        15   # BR(~tau_2 -> ~chi_20  tau-)
     1.56820129E-02    2     1000025        15   # BR(~tau_2 -> ~chi_30  tau-)
     2.49336436E-01    2     1000035        15   # BR(~tau_2 -> ~chi_40  tau-)
     4.80451112E-05    2    -1000024        16   # BR(~tau_2 -> ~chi_1-  nu_tau)
     4.99157260E-01    2    -1000037        16   # BR(~tau_2 -> ~chi_2-  nu_tau)
#
#         PDG            Width
DECAY   1000012     3.03538228E+01   # snu_eL decays
#          BR         NDA      ID1       ID2
     2.23302939E-01    2     1000022        12   # BR(~nu_eL -> ~chi_10 nu_e)
     5.89995048E-04    2     1000023        12   # BR(~nu_eL -> ~chi_20 nu_e)
     2.46136706E-03    2     1000025        12   # BR(~nu_eL -> ~chi_30 nu_e)
     2.57535490E-01    2     1000035        12   # BR(~nu_eL -> ~chi_40 nu_e)
     1.67411948E-03    2     1000024        11   # BR(~nu_eL -> ~chi_1+ e-)
     5.14436089E-01    2     1000037        11   # BR(~nu_eL -> ~chi_2+ e-)
#
#         PDG            Width
DECAY   1000014     3.03538228E+01   # snu_muL decays
#          BR         NDA      ID1       ID2
     2.23302939E-01    2     1000022        14   # BR(~nu_muL -> ~chi_10 nu_mu)
     5.89995048E-04    2     1000023        14   # BR(~nu_muL -> ~chi_20 nu_mu)
     2.46136706E-03    2     1000025        14   # BR(~nu_muL -> ~chi_30 nu_mu)
     2.57535490E-01    2     1000035        14   # BR(~nu_muL -> ~chi_40 nu_mu)
     1.67411948E-03    2     1000024        13   # BR(~nu_muL -> ~chi_1+ mu-)
     5.14436089E-01    2     1000037        13   # BR(~nu_muL -> ~chi_2+ mu-)
#
#         PDG            Width
DECAY   1000016     3.12754124E+01   # snu_tauL decays
#          BR         NDA      ID1       ID2
     2.16699011E-01    2     1000022        16   # BR(~nu_tauL -> ~chi_10 nu_tau)
     5.72545036E-04    2     1000023        16   # BR(~nu_tauL -> ~chi_20 nu_tau)
     2.38856827E-03    2     1000025        16   # BR(~nu_tauL -> ~chi_30 nu_tau)
     2.49853044E-01    2     1000035        16   # BR(~nu_tauL -> ~chi_40 nu_tau)
     3.13971177E-02    2     1000024        15   # BR(~nu_tauL -> ~chi_1+ tau-)
     4.99089714E-01    2     1000037        15   # BR(~nu_tauL -> ~chi_2+ tau-)
#
#         PDG            Width
DECAY   1000024     2.29907150E-01   # chargino1+ decays
#          BR         NDA      ID1       ID2
     1.00000000E+00    2     1000022        24   # BR(~chi_1+ -> ~chi_10  W+)
#
#         PDG            Width
DECAY   1000037     2.25203908E+01   # chargino2+ decays
#          BR         NDA      ID1       ID2
     2.53606958E-01    2     1000024        23   # BR(~chi_2+ -> ~chi_1+  Z )
     1.38125795E-04    2     1000022        24   # BR(~chi_2+ -> ~chi_10  W+)
     2.45208233E-01    2     1000023        24   # BR(~chi_2+ -> ~chi_20  W+)
     2.44427952E-01    2     1000025        24   # BR(~chi_2+ -> ~chi_30  W+)
     2.56610500E-01    2     1000024        25   # BR(~chi_2+ -> ~chi_1+  h )
     8.23151483E-06    2     1000022        37   # BR(~chi_2+ -> ~chi_10  H+)
#
#         PDG            Width
DECAY   1000022     0.00000000E+00   # neutralino1 decays
#
#         PDG            Width
DECAY   1000023     2.27158655E-01   # neutralino2 decays
#          BR         NDA      ID1       ID2
     4.94367649E-01    2     1000022        23   # BR(~chi_20 -> ~chi_10   Z )
     5.05632351E-01    2     1000022        25   # BR(~chi_20 -> ~chi_10   h )
#
#         PDG            Width
DECAY   1000025     2.16581961E-01   # neutralino3 decays
#          BR         NDA      ID1       ID2
     5.81764058E-01    2     1000022        23   # BR(~chi_30 -> ~chi_10   Z )
     4.18235942E-01    2     1000022        25   # BR(~chi_30 -> ~chi_10   h )
#
#         PDG            Width
DECAY   1000035     2.25272624E+01   # neutralino4 decays
#          BR         NDA      ID1       ID2
     2.15556694E-06    2     1000022        23   # BR(~chi_40 -> ~chi_10   Z )
     1.20958038E-01    2     1000023        23   # BR(~chi_40 -> ~chi_20   Z )
     1.32332586E-01    2     1000025        23   # BR(~chi_40 -> ~chi_30   Z )
     2.45201053E-01    2     1000024       -24   # BR(~chi_40 -> ~chi_1+   W-)
     2.45201053E-01    2    -1000024        24   # BR(~chi_40 -> ~chi_1-   W+)
     1.25399229E-04    2     1000022        25   # BR(~chi_40 -> ~chi_10   h )
     7.93948665E-06    2     1000022        35   # BR(~chi_40 -> ~chi_10   H )
     8.50206779E-07    2     1000022        36   # BR(~chi_40 -> ~chi_10   A )
     1.34951499E-01    2     1000023        25   # BR(~chi_40 -> ~chi_20   h )
     1.21219426E-01    2     1000025        25   # BR(~chi_40 -> ~chi_30   h )
#
#         PDG            Width
DECAY        25     4.07253985E-03   # h decays
#          BR         NDA      ID1       ID2
     6.08744532E-01    2           5        -5   # BR(h -> b       bb     )
     6.37094346E-02    2         -15        15   # BR(h -> tau+    tau-   )
     2.25554444E-04    2         -13        13   # BR(h -> mu+     mu-    )
     4.78141078E-04    2           3        -3   # BR(h -> s       sb     )
     2.07162900E-02    2           4        -4   # BR(h -> c       cb     )
     6.70443308E-02    2          21        21   # BR(h -> g       g      )
     2.30455726E-03    2          22        22   # BR(h -> gam     gam    )
     1.48886037E-03    2          22        23   # BR(h -> Z       gam    )
     2.10178550E-01    2          24       -24   # BR(h -> W+      W-     )
     2.50481142E-02    2          23        23   # BR(h -> Z       Z      )
     6.16346838E-05    2     1000022   1000022   # BR(h -> ~chi_10 ~chi_10)
#
#         PDG            Width
DECAY        35     8.72684596E+00   # H decays
#          BR         NDA      ID1       ID2
     3.64451481E-01    2           5        -5   # BR(H -> b       bb     )
     6.38193274E-02    2         -15        15   # BR(H -> tau+    tau-   )
     2.25670211E-04    2         -13        13   # BR(H -> mu+     mu-    )
     2.76636994E-04    2           3        -3   # BR(H -> s       sb     )
     1.54855228E-06    2           4        -4   # BR(H -> c       cb     )
     1.54712644E-01    2           6        -6   # BR(H -> t       tb     )
     5.14702509E-05    2          21        21   # BR(H -> g       g      )
     1.40013558E-07    2          22        22   # BR(H -> gam     gam    )
     9.12985095E-08    2          23        22   # BR(H -> Z       gam    )
     7.46334381E-05    2          24       -24   # BR(H -> W+      W-     )
     3.72694757E-05    2          23        23   # BR(H -> Z       Z      )
     2.68567004E-04    2          25        25   # BR(H -> h       h      )
    -1.16993628E-23    2          36        36   # BR(H -> A       A      )
     6.90318873E-19    2          23        36   # BR(H -> Z       A      )
     3.30545277E-03    2     1000024  -1000024   # BR(H -> ~chi_1+ ~chi_1-)
     1.04853739E-02    2     1000022   1000022   # BR(H -> ~chi_10 ~chi_10)
     1.10166587E-03    2     1000023   1000023   # BR(H -> ~chi_20 ~chi_20)
     3.42930492E-03    2     1000025   1000025   # BR(H -> ~chi_30 ~chi_30)
     2.39010398E-01    2     1000022   1000023   # BR(H -> ~chi_10 ~chi_20)
     1.53428772E-01    2     1000022   1000025   # BR(H -> ~chi_10 ~chi_30)
     5.31955280E-03    2     1000023   1000025   # BR(H -> ~chi_20 ~chi_30)
#
#         PDG            Width
DECAY        36     8.73285581E+00   # A decays
#          BR         NDA      ID1       ID2
     3.64325137E-01    2           5        -5   # BR(A -> b       bb     )
     6.37772967E-02    2         -15        15   # BR(A -> tau+    tau-   )
     2.25521272E-04    2         -13        13   # BR(A -> mu+     mu-    )
     2.76656588E-04    2           3        -3   # BR(A -> s       sb     )
     1.55363894E-06    2           4        -4   # BR(A -> c       cb     )
     1.55135193E-01    2           6        -6   # BR(A -> t       tb     )
     1.53501150E-04    2          21        21   # BR(A -> g       g      )
     5.82790192E-07    2          22        22   # BR(A -> gam     gam    )
     1.85801463E-07    2          23        22   # BR(A -> Z       gam    )
     7.42995602E-05    2          23        25   # BR(A -> Z       h      )
     3.52288318E-03    2     1000024  -1000024   # BR(A -> ~chi_1+ ~chi_1-)
     1.02859700E-02    2     1000022   1000022   # BR(A -> ~chi_10 ~chi_10)
     7.73987092E-04    2     1000023   1000023   # BR(A -> ~chi_20 ~chi_20)
     5.66567233E-03    2     1000025   1000025   # BR(A -> ~chi_30 ~chi_30)
     1.57119931E-01    2     1000022   1000023   # BR(A -> ~chi_10 ~chi_20)
     2.34449565E-01    2     1000022   1000025   # BR(A -> ~chi_10 ~chi_30)
     4.21206452E-03    2     1000023   1000025   # BR(A -> ~chi_20 ~chi_30)
#
#         PDG            Width
DECAY        37     8.68224054E+00   # H+ decays
#          BR         NDA      ID1       ID2
     5.85000040E-04    2           4        -5   # BR(H+ -> c       bb     )
     6.41801585E-02    2         -15        16   # BR(H+ -> tau+    nu_tau )
     2.26945821E-04    2         -13        14   # BR(H+ -> mu+     nu_mu  )
     3.74398059E-06    2           2        -5   # BR(H+ -> u       bb     )
     1.33163753E-05    2           2        -3   # BR(H+ -> u       sb     )
     2.75384378E-04    2           4        -3   # BR(H+ -> c       sb     )
     5.18440697E-01    2           6        -5   # BR(H+ -> t       bb     )
     7.48895438E-05    2          24        25   # BR(H+ -> W+      h      )
     9.78095153E-13    2          24        36   # BR(H+ -> W+      A      )
     4.10233035E-01    2     1000024   1000022   # BR(H+ -> ~chi_1+ ~chi_10)
     5.22040220E-03    2     1000024   1000023   # BR(H+ -> ~chi_1+ ~chi_20)
     7.46426736E-04    2     1000024   1000025   # BR(H+ -> ~chi_1+ ~chi_30)
