#  ISAJET SUSY parameters in SUSY Les Houches Accord 2 format
#  Created by ISALHA 2.0 Last revision: H Baer 27 May 2014
Block SPINFO   # Program information
     1   ISASUGRA/ISASUSY from ISAJET   # Spectrum Calculator
     2   7.87   18-JUL-2017 13:55:55    # Version number
Block MODSEL   # Model selection
     1    13   # Non-universal supergravity model                  
Block SMINPUTS   # Standard Model inputs
     1     1.28000000E+02   # alpha_em^(-1)
     2     1.16570000E-05   # G_Fermi
     3     1.19999997E-01   # alpha_s(M_Z)
     4     9.11699982E+01   # m_{Z}(pole)
     5     4.19999981E+00   # m_{b}(m_{b})
     6     1.72500000E+02   # m_{top}(pole)
     7     1.77699995E+00   # m_{tau}(pole)
Block MINPAR   # SUSY breaking input parameters
     1     5.00000000E+03   # m_0
     2     3.00000000E+03   # m_{1/2}
     3     1.50000000E+01   # tan(beta)
     4     1.00000000E+00   # sign(mu)
     5    -8.00000000E+03   # A_0
Block EXTPAR   # Non-universal SUSY breaking parameters
     0     1.27241112E+16   # Input scale
    21     9.21830000E+04   # Down type Higgs mass squared
    22     5.77454000E+07   #  Up  type Higgs mass squared
Block MASS   # Scalar and gaugino mass spectrum
#  PDG code   mass                 particle
         6     1.72500000E+02   #  top            
        24     8.04229965E+01   #  W^+
        25     1.25396873E+02   #  h^0            
        35     1.00666864E+03   #  H^0            
        36     1.00000000E+03   #  A^0            
        37     1.00322870E+03   #  H^+            
   1000001     7.39628174E+03   #  dnl            
   1000002     7.39584277E+03   #  upl            
   1000003     7.39628174E+03   #  stl            
   1000004     7.39584277E+03   #  chl            
   1000005     5.80994629E+03   #  b1             
   1000006     3.61679736E+03   #  t1             
   1000011     5.48898291E+03   #  el-            
   1000012     5.49064697E+03   #  nuel           
   1000013     5.48898291E+03   #  mul-           
   1000014     5.49064697E+03   #  numl           
   1000015     4.65629053E+03   #  tau1           
   1000016     5.41697656E+03   #  nutl           
   1000021     6.31254932E+03   #  glss           
   1000022     9.15866547E+01   #  z1ss           
   1000023    -9.51758041E+01   #  z2ss           
   1000024     9.74166336E+01   #  w1ss           
   1000025     1.34754443E+03   #  z3ss           
   1000035     2.51205688E+03   #  z4ss           
   1000037     2.48344922E+03   #  w2ss           
   1000039     1.00000002E+20   #  gvss
   2000001     7.17524756E+03   #  dnr            
   2000002     7.38849414E+03   #  upr            
   2000003     7.17524756E+03   #  str            
   2000004     7.38849414E+03   #  chr            
   2000005     6.96638135E+03   #  b2             
   2000006     5.80593311E+03   #  t2             
   2000011     4.83045361E+03   #  er-            
   2000013     4.83045361E+03   #  mur-           
   2000015     5.41310596E+03   #  tau2           
Block ALPHA   # Effective Higgs mixing parameter
         -6.81526884E-02   # alpha
Block STOPMIX   # stop mixing matrix
  1  1     5.33739068E-02   # O_{11}
  1  2     9.98574615E-01   # O_{12}
  2  1    -9.98574615E-01   # O_{21}
  2  2     5.33739068E-02   # O_{22}
Block SBOTMIX   # sbottom mixing matrix
  1  1     9.99990642E-01   # O_{11}
  1  2     4.33082832E-03   # O_{12}
  2  1    -4.33082832E-03   # O_{21}
  2  2     9.99990642E-01   # O_{22}
Block STAUMIX   # stau mixing matrix
  1  1     4.68307594E-03   # O_{11}
  1  2     9.99989033E-01   # O_{12}
  2  1    -9.99989033E-01   # O_{21}
  2  2     4.68307594E-03   # O_{22}
Block NMIX   # neutralino mixing matrix
  1  1    -2.49158274E-02   #
  1  2     2.42256839E-02   #
  1  3    -7.13589668E-01   #
  1  4     6.99701369E-01   #
  2  1     1.92253888E-02   #
  2  2    -1.87007133E-02   #
  2  3    -7.00538099E-01   #
  2  4    -7.13110745E-01   #
  3  1     9.99496400E-01   #
  3  2     5.04699349E-03   #
  3  3    -4.29653144E-03   #
  3  4     3.10347416E-02   #
  4  1    -4.08329070E-03   #
  4  2     9.99518931E-01   #
  4  3     4.21047723E-03   #
  4  4    -3.04575656E-02   #
Block UMIX   # chargino U mixing matrix
  1  1    -5.05865645E-03   # U_{11}
  1  2     9.99987185E-01   # U_{12}
  2  1    -9.99987185E-01   # U_{21}
  2  2    -5.05865645E-03   # U_{22}
Block VMIX   # chargino V mixing matrix
  1  1    -4.41199653E-02   # V_{11}
  1  2     9.99026239E-01   # V_{12}
  2  1    -9.99026239E-01   # V_{21}
  2  2    -4.41199653E-02   # V_{22}
Block GAUGE Q=  4.50305029E+03   #
     1     3.57520401E-01   # g`
     2     6.52390420E-01   # g_2
     3     1.21946168E+00   # g_3
Block YU Q=  4.50305029E+03   #
  3  3     8.03299546E-01   # y_t
Block YD Q=  4.50305029E+03   #
  3  3     1.81874499E-01   # y_b
Block YE Q=  4.50305029E+03   #
  3  3     1.48884833E-01   # y_tau
Block HMIX Q=  4.50305029E+03   # Higgs mixing parameters
     1     9.00000000E+01   # mu(Q)
     2     1.42623577E+01   # tan(beta)(Q)
     3     2.52605408E+02   # Higgs vev at Q
     4     1.00000000E+06   # m_A^2(Q)
Block MSOFT Q=  4.50305029E+03   # DRbar SUSY breaking parameters
     1     1.35097900E+03   # M_1(Q)          
     2     2.42405615E+03   # M_2(Q)          
     3     5.91942090E+03   # M_3(Q)          
    21     9.86927500E+05   # MHd^2(Q)        
    22     1.03612938E+05   # MHu^2(Q)        
    31     5.46618555E+03   # MeL(Q)          
    32     5.46618555E+03   # MmuL(Q)         
    33     5.39453516E+03   # MtauL(Q)        
    34     4.82626270E+03   # MeR(Q)          
    35     4.82626270E+03   # MmuR(Q)         
    36     4.65626221E+03   # MtauR(Q)        
    41     7.09565576E+03   # MqL1(Q)         
    42     7.09565576E+03   # MqL2(Q)         
    43     5.61837598E+03   # MqL3(Q)         
    44     7.08808398E+03   # MuR(Q)          
    45     7.08808398E+03   # McR(Q)          
    46     3.60913232E+03   # MtR(Q)          
    47     6.87155518E+03   # MdR(Q)          
    48     6.87155518E+03   # MsR(Q)          
    49     6.78899658E+03   # MbR(Q)          
Block AU Q=  4.50305029E+03   #
  1  1    -7.75986816E+03   # A_u
  2  2    -7.75986816E+03   # A_c
  3  3    -7.75986816E+03   # A_t
Block AD Q=  4.50305029E+03   #
  1  1    -1.32883584E+04   # A_d
  2  2    -1.32883584E+04   # A_s
  3  3    -1.32883584E+04   # A_b
Block AE Q=  4.50305029E+03   #
  1  1    -9.30383691E+03   # A_e
  2  2    -9.30383691E+03   # A_mu
  3  3    -9.30383691E+03   # A_tau
#  ISAJET decay tables in SUSY Les Houches accord format
#  Created by ISALHD. Last revision: C. Balazs, 2005 May 25
Block DCINFO                           # Program information
     1   ISASUGRA from ISAJET          # Spectrum Calculator
     2   7.87   18-JUL-2017 13:55:55   # Version number
#         PDG         Width
DECAY         6  1.46776152E+00   # TP    decays
#          BR          NDA       ID1       ID2       ID3       ID4
      3.33333313E-01    3            2        -1         5             # TP     -->  UP     DB     BT          
      3.33333313E-01    3            4        -3         5             # TP     -->  CH     SB     BT          
      1.11111097E-01    3          -11        12         5             # TP     -->  E+     NUE    BT          
      1.11111097E-01    3          -13        14         5             # TP     -->  MU+    NUM    BT          
      1.11111097E-01    3          -15        16         5             # TP     -->  TAU+   NUT    BT          
#         PDG         Width
DECAY   1000021  6.04738617E+01   # GLSS  decays
#          BR          NDA       ID1       ID2       ID3       ID4
      5.51952553E-07    3      1000024         1        -2             # GLSS   -->  W1SS+  DN     UB          
      5.51952553E-07    3     -1000024         2        -1             # GLSS   -->  W1SS-  UP     DB          
      5.51952553E-07    3      1000024         3        -4             # GLSS   -->  W1SS+  ST     CB          
      5.51952553E-07    3     -1000024         4        -3             # GLSS   -->  W1SS-  CH     SB          
      3.52027455E-05    3      1000024         5        -6             # GLSS   -->  W1SS+  BT     TB          
      3.52027455E-05    3     -1000024         6        -5             # GLSS   -->  W1SS-  TP     BB          
      3.14201694E-04    3      1000037         1        -2             # GLSS   -->  W2SS+  DN     UB          
      3.14201694E-04    3     -1000037         2        -1             # GLSS   -->  W2SS-  UP     DB          
      3.14201694E-04    3      1000037         3        -4             # GLSS   -->  W2SS+  ST     CB          
      3.14201694E-04    3     -1000037         4        -3             # GLSS   -->  W2SS-  CH     SB          
      6.38928110E-09    3      1000037         5        -6             # GLSS   -->  W2SS+  BT     TB          
      6.38928110E-09    3     -1000037         6        -5             # GLSS   -->  W2SS-  TP     BB          
      2.44513298E-10    2      1000022        21                       # GLSS   -->  Z1SS   GL                 
      2.05158074E-07    3      1000022         2        -2             # GLSS   -->  Z1SS   UP     UB          
      2.64571668E-07    3      1000022         1        -1             # GLSS   -->  Z1SS   DN     DB          
      2.64571668E-07    3      1000022         3        -3             # GLSS   -->  Z1SS   ST     SB          
      2.05158074E-07    3      1000022         4        -4             # GLSS   -->  Z1SS   CH     CB          
      3.59831829E-05    3      1000022         5        -5             # GLSS   -->  Z1SS   BT     BB          
      1.51756593E-10    2      1000023        21                       # GLSS   -->  Z2SS   GL                 
      1.17393220E-07    3      1000023         2        -2             # GLSS   -->  Z2SS   UP     UB          
      1.51429063E-07    3      1000023         1        -1             # GLSS   -->  Z2SS   DN     DB          
      1.51429063E-07    3      1000023         3        -3             # GLSS   -->  Z2SS   ST     SB          
      1.17393220E-07    3      1000023         4        -4             # GLSS   -->  Z2SS   CH     CB          
      3.47444256E-05    3      1000023         5        -5             # GLSS   -->  Z2SS   BT     BB          
      2.59006043E-07    2      1000025        21                       # GLSS   -->  Z3SS   GL                 
      1.52904322E-04    3      1000025         2        -2             # GLSS   -->  Z3SS   UP     UB          
      5.23874041E-05    3      1000025         1        -1             # GLSS   -->  Z3SS   DN     DB          
      5.23874041E-05    3      1000025         3        -3             # GLSS   -->  Z3SS   ST     SB          
      1.52904322E-04    3      1000025         4        -4             # GLSS   -->  Z3SS   CH     CB          
      5.48775861E-05    3      1000025         5        -5             # GLSS   -->  Z3SS   BT     BB          
      1.42116039E-12    2      1000035        21                       # GLSS   -->  Z4SS   GL                 
      1.53945599E-04    3      1000035         2        -2             # GLSS   -->  Z4SS   UP     UB          
      1.54340101E-04    3      1000035         1        -1             # GLSS   -->  Z4SS   DN     DB          
      1.54340101E-04    3      1000035         3        -3             # GLSS   -->  Z4SS   ST     SB          
      1.53945599E-04    3      1000035         4        -4             # GLSS   -->  Z4SS   CH     CB          
      7.41839346E-09    3      1000035         5        -5             # GLSS   -->  Z4SS   BT     BB          
      2.36261804E-02    2     -1000005         5                       # GLSS   -->  BB1    BT                 
      2.36261804E-02    2      1000005        -5                       # GLSS   -->  BT1    BB                 
      4.51613188E-01    2     -1000006         6                       # GLSS   -->  TB1    TP                 
      4.51613188E-01    2      1000006        -6                       # GLSS   -->  TP1    TB                 
      2.35186834E-02    2     -2000006         6                       # GLSS   -->  TB2    TP                 
      2.35186834E-02    2      2000006        -6                       # GLSS   -->  TP2    TB                 
#         PDG         Width
DECAY   1000002  1.02163589E+02   # UPL   decays
#          BR          NDA       ID1       ID2       ID3       ID4
      1.17754767E-04    2      1000022         2                       # UPL    -->  Z1SS   UP                 
      7.01805548E-05    2      1000023         2                       # UPL    -->  Z2SS   UP                 
      1.00841988E-02    2      1000025         2                       # UPL    -->  Z3SS   UP                 
      2.37881735E-01    2      1000035         2                       # UPL    -->  Z4SS   UP                 
      2.71837473E-01    2      1000021         2                       # UPL    -->  GLSS   UP                 
      1.18591415E-03    2      1000024         1                       # UPL    -->  W1SS+  DN                 
      4.78822678E-01    2      1000037         1                       # UPL    -->  W2SS+  DN                 
#         PDG         Width
DECAY   1000001  1.02151283E+02   # DNL   decays
#          BR          NDA       ID1       ID2       ID3       ID4
      2.52548663E-04    2      1000022         1                       # DNL    -->  Z1SS   DN                 
      1.50466862E-04    2      1000023         1                       # DNL    -->  Z2SS   DN                 
      9.03297868E-03    2      1000025         1                       # DNL    -->  Z3SS   DN                 
      2.38645270E-01    2      1000035         1                       # DNL    -->  Z4SS   DN                 
      2.72058129E-01    2      1000021         1                       # DNL    -->  GLSS   DN                 
      1.55930629E-05    2     -1000024         2                       # DNL    -->  W1SS-  UP                 
      4.79844987E-01    2     -1000037         2                       # DNL    -->  W2SS-  UP                 
#         PDG         Width
DECAY   1000003  1.02151276E+02   # STL   decays
#          BR          NDA       ID1       ID2       ID3       ID4
      2.52548693E-04    2      1000022         3                       # STL    -->  Z1SS   ST                 
      1.50466876E-04    2      1000023         3                       # STL    -->  Z2SS   ST                 
      9.03297961E-03    2      1000025         3                       # STL    -->  Z3SS   ST                 
      2.38645285E-01    2      1000035         3                       # STL    -->  Z4SS   ST                 
      2.72058159E-01    2      1000021         3                       # STL    -->  GLSS   ST                 
      1.55930611E-05    2     -1000024         4                       # STL    -->  W1SS-  CH                 
      4.79844958E-01    2     -1000037         4                       # STL    -->  W2SS-  CH                 
#         PDG         Width
DECAY   1000004  1.02163559E+02   # CHL   decays
#          BR          NDA       ID1       ID2       ID3       ID4
      1.17754782E-04    2      1000022         4                       # CHL    -->  Z1SS   CH                 
      7.01805693E-05    2      1000023         4                       # CHL    -->  Z2SS   CH                 
      1.00841988E-02    2      1000025         4                       # CHL    -->  Z3SS   CH                 
      2.37881780E-01    2      1000035         4                       # CHL    -->  Z4SS   CH                 
      2.71837324E-01    2      1000021         4                       # CHL    -->  GLSS   CH                 
      1.18591450E-03    2      1000024         3                       # CHL    -->  W1SS+  ST                 
      4.78822827E-01    2      1000037         3                       # CHL    -->  W2SS+  ST                 
#         PDG         Width
DECAY   1000005  2.08128555E+02   # BT1   decays
#          BR          NDA       ID1       ID2       ID3       ID4
      9.95760784E-03    2      1000022         5                       # BT1    -->  Z1SS   BT                 
      9.54127591E-03    2      1000023         5                       # BT1    -->  Z2SS   BT                 
      3.33540491E-03    2      1000025         5                       # BT1    -->  Z3SS   BT                 
      7.77161047E-02    2      1000035         5                       # BT1    -->  Z4SS   BT                 
      3.39838326E-01    2     -1000024         6                       # BT1    -->  W1SS-  TP                 
      1.57512993E-01    2     -1000037         6                       # BT1    -->  W2SS-  TP                 
      4.00515050E-01    2          -24   1000006                       # BT1    -->  W-     TP1                
      1.58319774E-03    2          -37   1000006                       # BT1    -->  H-     TP1                
#         PDG         Width
DECAY   1000006  9.41819000E+01   # TP1   decays
#          BR          NDA       ID1       ID2       ID3       ID4
      2.29277417E-01    2      1000022         6                       # TP1    -->  Z1SS   TP                 
      2.38062486E-01    2      1000023         6                       # TP1    -->  Z2SS   TP                 
      6.41723871E-02    2      1000025         6                       # TP1    -->  Z3SS   TP                 
      9.10373359E-08    2      1000035         6                       # TP1    -->  Z4SS   TP                 
      4.68487650E-01    2      1000024         5                       # TP1    -->  W1SS+  BT                 
      5.27558131E-09    2      1000037         5                       # TP1    -->  W2SS+  BT                 
#         PDG         Width
DECAY   2000002  4.30615654E+01   # UPR   decays
#          BR          NDA       ID1       ID2       ID3       ID4
      2.40712965E-04    2      1000022         2                       # UPR    -->  Z1SS   UP                 
      1.43313940E-04    2      1000023         2                       # UPR    -->  Z2SS   UP                 
      3.62126768E-01    2      1000025         2                       # UPR    -->  Z3SS   UP                 
      5.05828530E-06    2      1000035         2                       # UPR    -->  Z4SS   UP                 
      6.37484193E-01    2      1000021         2                       # UPR    -->  GLSS   UP                 
#         PDG         Width
DECAY   2000001  2.24946060E+01   # DNR   decays
#          BR          NDA       ID1       ID2       ID3       ID4
      1.11872629E-04    2      1000022         1                       # DNR    -->  Z1SS   DN                 
      6.66058186E-05    2      1000023         1                       # DNR    -->  Z2SS   DN                 
      1.67605504E-01    2      1000025         1                       # DNR    -->  Z3SS   DN                 
      2.31398258E-06    2      1000035         1                       # DNR    -->  Z4SS   DN                 
      8.32213700E-01    2      1000021         1                       # DNR    -->  GLSS   DN                 
#         PDG         Width
DECAY   2000003  2.24946060E+01   # STR   decays
#          BR          NDA       ID1       ID2       ID3       ID4
      1.11872629E-04    2      1000022         3                       # STR    -->  Z1SS   ST                 
      6.66058186E-05    2      1000023         3                       # STR    -->  Z2SS   ST                 
      1.67605504E-01    2      1000025         3                       # STR    -->  Z3SS   ST                 
      2.31398258E-06    2      1000035         3                       # STR    -->  Z4SS   ST                 
      8.32213700E-01    2      1000021         3                       # STR    -->  GLSS   ST                 
#         PDG         Width
DECAY   2000004  4.30615387E+01   # CHR   decays
#          BR          NDA       ID1       ID2       ID3       ID4
      2.40713081E-04    2      1000022         4                       # CHR    -->  Z1SS   CH                 
      1.43314042E-04    2      1000023         4                       # CHR    -->  Z2SS   CH                 
      3.62126917E-01    2      1000025         4                       # CHR    -->  Z3SS   CH                 
      5.05828757E-06    2      1000035         4                       # CHR    -->  Z4SS   CH                 
      6.37484074E-01    2      1000021         4                       # CHR    -->  GLSS   CH                 
#         PDG         Width
DECAY   2000005  5.32317047E+01   # BT2   decays
#          BR          NDA       ID1       ID2       ID3       ID4
      4.61742207E-02    2      1000022         5                       # BT2    -->  Z1SS   BT                 
      4.45726402E-02    2      1000023         5                       # BT2    -->  Z2SS   BT                 
      6.84641674E-02    2      1000025         5                       # BT2    -->  Z3SS   BT                 
      1.61604239E-05    2      1000035         5                       # BT2    -->  Z4SS   BT                 
      2.14459628E-01    2      1000021         5                       # BT2    -->  GLSS   BT                 
      9.05899927E-02    2     -1000024         6                       # BT2    -->  W1SS-  TP                 
      2.81140037E-05    2     -1000037         6                       # BT2    -->  W2SS-  TP                 
      8.59937936E-05    2          -24   1000006                       # BT2    -->  W-     TP1                
      2.18618172E-03    2          -24   2000006                       # BT2    -->  W-     TP2                
      1.09785702E-03    2           23   1000005                       # BT2    -->  Z0     BT1                
      1.48552808E-03    2           25   1000005                       # BT2    -->  HL0    BT1                
      1.32742211E-01    2           36   1000005                       # BT2    -->  HA0    BT1                
      1.30036041E-01    2           35   1000005                       # BT2    -->  HH0    BT1                
      1.93592778E-03    2          -37   1000006                       # BT2    -->  H-     TP1                
      2.66125292E-01    2          -37   2000006                       # BT2    -->  H-     TP2                
#         PDG         Width
DECAY   2000006  2.27276886E+02   # TP2   decays
#          BR          NDA       ID1       ID2       ID3       ID4
      1.77359246E-02    2      1000024         5                       # TP2    -->  W1SS+  BT                 
      1.43689245E-01    2      1000037         5                       # TP2    -->  W2SS+  BT                 
      1.84298217E-01    2           23   1000006                       # TP2    -->  Z0     TP1                
      2.67286271E-01    2           25   1000006                       # TP2    -->  HL0    TP1                
      7.58005015E-04    2           35   1000006                       # TP2    -->  HH0    TP1                
      7.25293357E-04    2           36   1000006                       # TP2    -->  HA0    TP1                
      1.52097493E-01    2      1000022         6                       # TP2    -->  Z1SS   TP                 
      1.58065230E-01    2      1000023         6                       # TP2    -->  Z2SS   TP                 
      4.05424181E-03    2      1000025         6                       # TP2    -->  Z3SS   TP                 
      7.12899938E-02    2      1000035         6                       # TP2    -->  Z4SS   TP                 
#         PDG         Width
DECAY   1000011  4.98644257E+01   # EL-   decays
#          BR          NDA       ID1       ID2       ID3       ID4
      5.13624000E-05    2      1000022        11                       # EL-    -->  Z1SS   E-                 
      3.06382572E-05    2      1000023        11                       # EL-    -->  Z2SS   E-                 
      1.25762731E-01    2      1000025        11                       # EL-    -->  Z3SS   E-                 
      2.88007766E-01    2      1000035        11                       # EL-    -->  Z4SS   E-                 
      2.36995384E-05    2     -1000024        12                       # EL-    -->  W1SS-  NUE                
      5.86123765E-01    2     -1000037        12                       # EL-    -->  W2SS-  NUE                
#         PDG         Width
DECAY   1000013  4.98644257E+01   # MUL-  decays
#          BR          NDA       ID1       ID2       ID3       ID4
      5.13624000E-05    2      1000022        13                       # MUL-   -->  Z1SS   MU-                
      3.06382572E-05    2      1000023        13                       # MUL-   -->  Z2SS   MU-                
      1.25762731E-01    2      1000025        13                       # MUL-   -->  Z3SS   MU-                
      2.88007766E-01    2      1000035        13                       # MUL-   -->  Z4SS   MU-                
      2.36995384E-05    2     -1000024        14                       # MUL-   -->  W1SS-  NUM                
      5.86123765E-01    2     -1000037        14                       # MUL-   -->  W2SS-  NUM                
#         PDG         Width
DECAY   1000015  2.42089119E+01   # TAU1- decays
#          BR          NDA       ID1       ID2       ID3       ID4
      4.61380221E-02    2      1000022        15                       # TAU1-  -->  Z1SS   TAU-               
      4.41222526E-02    2      1000023        15                       # TAU1-  -->  Z2SS   TAU-               
      8.20430458E-01    2      1000025        15                       # TAU1-  -->  Z3SS   TAU-               
      1.25221704E-05    2      1000035        15                       # TAU1-  -->  Z4SS   TAU-               
      8.92865807E-02    2     -1000024        16                       # TAU1-  -->  W1SS-  NUT                
      1.01248997E-05    2     -1000037        16                       # TAU1-  -->  W2SS-  NUT                
#         PDG         Width
DECAY   1000012  4.98785172E+01   # NUEL  decays
#          BR          NDA       ID1       ID2       ID3       ID4
      6.65910426E-04    2      1000022        12                       # NUEL   -->  Z1SS   NUE                
      3.96669813E-04    2      1000023        12                       # NUEL   -->  Z2SS   NUE                
      1.21236697E-01    2      1000025        12                       # NUEL   -->  Z3SS   NUE                
      2.90705413E-01    2      1000035        12                       # NUEL   -->  Z4SS   NUE                
      1.80280581E-03    2      1000024        11                       # NUEL   -->  W1SS+  E-                 
      5.85192502E-01    2      1000037        11                       # NUEL   -->  W2SS+  E-                 
#         PDG         Width
DECAY   1000014  4.98785172E+01   # NUML  decays
#          BR          NDA       ID1       ID2       ID3       ID4
      6.65910426E-04    2      1000022        14                       # NUML   -->  Z1SS   NUM                
      3.96669813E-04    2      1000023        14                       # NUML   -->  Z2SS   NUM                
      1.21236697E-01    2      1000025        14                       # NUML   -->  Z3SS   NUM                
      2.90705413E-01    2      1000035        14                       # NUML   -->  Z4SS   NUM                
      1.80280581E-03    2      1000024        13                       # NUML   -->  W1SS+  MU-                
      5.85192502E-01    2      1000037        13                       # NUML   -->  W2SS+  MU-                
#         PDG         Width
DECAY   1000016  5.11319962E+01   # NUTL  decays
#          BR          NDA       ID1       ID2       ID3       ID4
      6.40860351E-04    2      1000022        16                       # NUTL   -->  Z1SS   NUT                
      3.81747523E-04    2      1000023        16                       # NUTL   -->  Z2SS   NUT                
      1.16268598E-01    2      1000025        16                       # NUTL   -->  Z3SS   NUT                
      2.75732130E-01    2      1000035        16                       # NUTL   -->  Z4SS   NUT                
      5.09168282E-02    2      1000024        15                       # NUTL   -->  W1SS+  TAU-               
      5.55283070E-01    2      1000037        15                       # NUTL   -->  W2SS+  TAU-               
      7.76808127E-04    2           24   1000015                       # NUTL   -->  W+     TAU1-              
#         PDG         Width
DECAY   2000011  2.08971691E+01   # ER-   decays
#          BR          NDA       ID1       ID2       ID3       ID4
      7.29352643E-04    2      1000022        11                       # ER-    -->  Z1SS   E-                 
      4.34222457E-04    2      1000023        11                       # ER-    -->  Z2SS   E-                 
      9.98826027E-01    2      1000025        11                       # ER-    -->  Z3SS   E-                 
      1.04335668E-05    2      1000035        11                       # ER-    -->  Z4SS   E-                 
#         PDG         Width
DECAY   2000013  2.08971691E+01   # MUR-  decays
#          BR          NDA       ID1       ID2       ID3       ID4
      7.29352643E-04    2      1000022        13                       # MUR-   -->  Z1SS   MU-                
      4.34222457E-04    2      1000023        13                       # MUR-   -->  Z2SS   MU-                
      9.98826027E-01    2      1000025        13                       # MUR-   -->  Z3SS   MU-                
      1.04335668E-05    2      1000035        13                       # MUR-   -->  Z4SS   MU-                
#         PDG         Width
DECAY   2000015  5.10621414E+01   # TAU2- decays
#          BR          NDA       ID1       ID2       ID3       ID4
      2.50747576E-02    2      1000022        15                       # TAU2-  -->  Z1SS   TAU-               
      2.42112745E-02    2      1000023        15                       # TAU2-  -->  Z2SS   TAU-               
      1.20687842E-01    2      1000025        15                       # TAU2-  -->  Z3SS   TAU-               
      2.73229152E-01    2      1000035        15                       # TAU2-  -->  Z4SS   TAU-               
      1.39757576E-05    2     -1000024        16                       # TAU2-  -->  W1SS-  NUT                
      5.56283832E-01    2     -1000037        16                       # TAU2-  -->  W2SS-  NUT                
      3.86487169E-04    2           23   1000015                       # TAU2-  -->  Z0     TAU1-              
      1.12707072E-04    2           25   1000015                       # TAU2-  -->  HL0    TAU1-              
#         PDG         Width
DECAY   1000023  5.20758880E-10   # Z2SS  decays
#          BR          NDA       ID1       ID2       ID3       ID4
      1.91961154E-01    2      1000022        22                       # Z2SS   -->  Z1SS   GM                 
      1.36720479E-01    3      1000022         2        -2             # Z2SS   -->  Z1SS   UP     UB          
      1.76301956E-01    3      1000022         1        -1             # Z2SS   -->  Z1SS   DN     DB          
      1.76301956E-01    3      1000022         3        -3             # Z2SS   -->  Z1SS   ST     SB          
      3.99940126E-02    3      1000022        11       -11             # Z2SS   -->  Z1SS   E-     E+          
      3.99940126E-02    3      1000022        13       -13             # Z2SS   -->  Z1SS   MU-    MU+         
      7.95755014E-02    3      1000022        12       -12             # Z2SS   -->  Z1SS   NUE    ANUE        
      7.95755014E-02    3      1000022        14       -14             # Z2SS   -->  Z1SS   NUM    ANUM        
      7.95755088E-02    3      1000022        16       -16             # Z2SS   -->  Z1SS   NUT    ANUT        
#         PDG         Width
DECAY   1000025  3.80823040E+00   # Z3SS  decays
#          BR          NDA       ID1       ID2       ID3       ID4
      7.46402193E-08    2      1000022        22                       # Z3SS   -->  Z1SS   GM                 
      7.50446603E-08    2      1000023        22                       # Z3SS   -->  Z2SS   GM                 
      2.05665141E-01    2      1000024       -24                       # Z3SS   -->  W1SS+  W-                 
      2.05665141E-01    2     -1000024        24                       # Z3SS   -->  W1SS-  W+                 
      4.22171652E-02    2      1000024       -37                       # Z3SS   -->  W1SS+  H-                 
      4.22171652E-02    2     -1000024        37                       # Z3SS   -->  W1SS-  H+                 
      7.27933794E-02    2      1000022        23                       # Z3SS   -->  Z1SS   Z0                 
      1.31643653E-01    2      1000023        23                       # Z3SS   -->  Z2SS   Z0                 
      1.18436705E-10    3      1000022         2        -2             # Z3SS   -->  Z1SS   UP     UB          
      2.38474553E-11    3      1000022         1        -1             # Z3SS   -->  Z1SS   DN     DB          
      2.38474553E-11    3      1000022         3        -3             # Z3SS   -->  Z1SS   ST     SB          
      1.18436705E-10    3      1000022         4        -4             # Z3SS   -->  Z1SS   CH     CB          
      6.22361274E-09    3      1000022         5        -5             # Z3SS   -->  Z1SS   BT     BB          
      1.07739473E-09    3      1000022        11       -11             # Z3SS   -->  Z1SS   E-     E+          
      1.07739473E-09    3      1000022        13       -13             # Z3SS   -->  Z1SS   MU-    MU+         
      1.24615298E-07    3      1000022        15       -15             # Z3SS   -->  Z1SS   TAU-   TAU+        
      2.92773528E-10    3      1000022        12       -12             # Z3SS   -->  Z1SS   NUE    ANUE        
      2.92773528E-10    3      1000022        14       -14             # Z3SS   -->  Z1SS   NUM    ANUM        
      3.09443887E-10    3      1000022        16       -16             # Z3SS   -->  Z1SS   NUT    ANUT        
      5.44767668E-11    3      1000023         2        -2             # Z3SS   -->  Z2SS   UP     UB          
      1.09739206E-11    3      1000023         1        -1             # Z3SS   -->  Z2SS   DN     DB          
      1.09739206E-11    3      1000023         3        -3             # Z3SS   -->  Z2SS   ST     SB          
      5.44767668E-11    3      1000023         4        -4             # Z3SS   -->  Z2SS   CH     CB          
      5.97592109E-09    3      1000023         5        -5             # Z3SS   -->  Z2SS   BT     BB          
      4.97182462E-10    3      1000023        11       -11             # Z3SS   -->  Z2SS   E-     E+          
      4.97182462E-10    3      1000023        13       -13             # Z3SS   -->  Z2SS   MU-    MU+         
      1.19061539E-07    3      1000023        15       -15             # Z3SS   -->  Z2SS   TAU-   TAU+        
      1.34997041E-10    3      1000023        12       -12             # Z3SS   -->  Z2SS   NUE    ANUE        
      1.34997041E-10    3      1000023        14       -14             # Z3SS   -->  Z2SS   NUM    ANUM        
      1.42701267E-10    3      1000023        16       -16             # Z3SS   -->  Z2SS   NUT    ANUT        
      1.36571854E-01    2      1000022        25                       # Z3SS   -->  Z1SS   HL0                
      2.41114162E-02    2      1000022        35                       # Z3SS   -->  Z1SS   HH0                
      1.74634568E-02    2      1000022        36                       # Z3SS   -->  Z1SS   HA0                
      8.15595910E-02    2      1000023        25                       # Z3SS   -->  Z2SS   HL0                
      1.59816258E-02    2      1000023        35                       # Z3SS   -->  Z2SS   HH0                
      2.41099335E-02    2      1000023        36                       # Z3SS   -->  Z2SS   HA0                
#         PDG         Width
DECAY   1000035  3.55244446E+01   # Z4SS  decays
#          BR          NDA       ID1       ID2       ID3       ID4
      4.27006000E-07    2      1000022        22                       # Z4SS   -->  Z1SS   GM                 
      6.45931436E-07    2      1000023        22                       # Z4SS   -->  Z2SS   GM                 
      5.09443765E-10    2      1000025        22                       # Z4SS   -->  Z3SS   GM                 
      1.48682103E-01    2      1000024       -24                       # Z4SS   -->  W1SS+  W-                 
      1.48682103E-01    2     -1000024        24                       # Z4SS   -->  W1SS-  W+                 
      1.03221484E-01    2      1000024       -37                       # Z4SS   -->  W1SS+  H-                 
      1.03221484E-01    2     -1000024        37                       # Z4SS   -->  W1SS-  H+                 
      9.82030429E-07    3     -1000037         2        -1             # Z4SS   -->  W2SS-  UP     DB          
      3.27343486E-07    3     -1000037        12       -11             # Z4SS   -->  W2SS-  NUE    E+          
      3.27343486E-07    3     -1000037        14       -13             # Z4SS   -->  W2SS-  NUM    MU+         
      9.82030429E-07    3      1000037         1        -2             # Z4SS   -->  W2SS+  DN     UB          
      3.27343486E-07    3      1000037        11       -12             # Z4SS   -->  W2SS+  E-     ANUE        
      3.27343486E-07    3      1000037        13       -14             # Z4SS   -->  W2SS+  MU-    ANUM        
      9.82030429E-07    3     -1000037         4        -3             # Z4SS   -->  W2SS-  CH     SB          
      3.27343486E-07    3     -1000037        16       -15             # Z4SS   -->  W2SS-  NUT    TAU+        
      9.82030429E-07    3      1000037         3        -4             # Z4SS   -->  W2SS+  ST     CB          
      3.27343486E-07    3      1000037        15       -16             # Z4SS   -->  W2SS+  TAU-   ANUT        
      4.91231121E-02    2      1000022        23                       # Z4SS   -->  Z1SS   Z0                 
      8.91219676E-02    2      1000023        23                       # Z4SS   -->  Z2SS   Z0                 
      4.60740157E-05    2      1000025        23                       # Z4SS   -->  Z3SS   Z0                 
      5.95762328E-10    3      1000022         2        -2             # Z4SS   -->  Z1SS   UP     UB          
      1.28100319E-09    3      1000022         1        -1             # Z4SS   -->  Z1SS   DN     DB          
      1.28100319E-09    3      1000022         3        -3             # Z4SS   -->  Z1SS   ST     SB          
      5.95762328E-10    3      1000022         4        -4             # Z4SS   -->  Z1SS   CH     CB          
      3.43147917E-07    3      1000022         5        -5             # Z4SS   -->  Z1SS   BT     BB          
      2.03574824E-10    3      1000022        11       -11             # Z4SS   -->  Z1SS   E-     E+          
      2.03574824E-10    3      1000022        13       -13             # Z4SS   -->  Z1SS   MU-    MU+         
      1.02428686E-07    3      1000022        15       -15             # Z4SS   -->  Z1SS   TAU-   TAU+        
      2.65890931E-09    3      1000022        12       -12             # Z4SS   -->  Z1SS   NUE    ANUE        
      2.65890931E-09    3      1000022        14       -14             # Z4SS   -->  Z1SS   NUM    ANUM        
      2.82143131E-09    3      1000022        16       -16             # Z4SS   -->  Z1SS   NUT    ANUT        
      3.08630177E-10    3      1000023         2        -2             # Z4SS   -->  Z2SS   UP     UB          
      6.63395894E-10    3      1000023         1        -1             # Z4SS   -->  Z2SS   DN     DB          
      6.63395894E-10    3      1000023         3        -3             # Z4SS   -->  Z2SS   ST     SB          
      3.08630177E-10    3      1000023         4        -4             # Z4SS   -->  Z2SS   CH     CB          
      3.28725434E-07    3      1000023         5        -5             # Z4SS   -->  Z2SS   BT     BB          
      1.06032384E-10    3      1000023        11       -11             # Z4SS   -->  Z2SS   E-     E+          
      1.06032384E-10    3      1000023        13       -13             # Z4SS   -->  Z2SS   MU-    MU+         
      9.85373987E-08    3      1000023        15       -15             # Z4SS   -->  Z2SS   TAU-   TAU+        
      1.38296041E-09    3      1000023        12       -12             # Z4SS   -->  Z2SS   NUE    ANUE        
      1.38296041E-09    3      1000023        14       -14             # Z4SS   -->  Z2SS   NUM    ANUM        
      1.46791368E-09    3      1000023        16       -16             # Z4SS   -->  Z2SS   NUT    ANUT        
      9.45228340E-09    3      1000025         2        -2             # Z4SS   -->  Z3SS   UP     UB          
      8.48749071E-09    3      1000025         1        -1             # Z4SS   -->  Z3SS   DN     DB          
      8.48749071E-09    3      1000025         3        -3             # Z4SS   -->  Z3SS   ST     SB          
      9.45228340E-09    3      1000025         4        -4             # Z4SS   -->  Z3SS   CH     CB          
      2.45462797E-08    3      1000025         5        -5             # Z4SS   -->  Z3SS   BT     BB          
      1.02152640E-07    3      1000025        11       -11             # Z4SS   -->  Z3SS   E-     E+          
      1.02152640E-07    3      1000025        13       -13             # Z4SS   -->  Z3SS   MU-    MU+         
      1.08910946E-07    3      1000025        15       -15             # Z4SS   -->  Z3SS   TAU-   TAU+        
      9.92024454E-08    3      1000025        12       -12             # Z4SS   -->  Z3SS   NUE    ANUE        
      9.92024454E-08    3      1000025        14       -14             # Z4SS   -->  Z3SS   NUM    ANUM        
      1.05562854E-07    3      1000025        16       -16             # Z4SS   -->  Z3SS   NUT    ANUT        
      8.86243358E-02    2      1000022        25                       # Z4SS   -->  Z1SS   HL0                
      5.04222848E-02    2      1000022        35                       # Z4SS   -->  Z1SS   HH0                
      5.55264391E-02    2      1000022        36                       # Z4SS   -->  Z1SS   HA0                
      6.03416562E-02    2      1000023        25                       # Z4SS   -->  Z2SS   HL0                
      5.34722060E-02    2      1000023        35                       # Z4SS   -->  Z2SS   HH0                
      4.89324480E-02    2      1000023        36                       # Z4SS   -->  Z2SS   HA0                
      5.72410063E-04    2      1000025        25                       # Z4SS   -->  Z3SS   HL0                
      1.25832958E-06    2      1000025        35                       # Z4SS   -->  Z3SS   HH0                
      2.81545994E-07    2      1000025        36                       # Z4SS   -->  Z3SS   HA0                
#         PDG         Width
DECAY   1000024  8.03519562E-09   # W1SS+ decays
#          BR          NDA       ID1       ID2       ID3       ID4
      3.31378996E-01    3      1000022         2        -1             # W1SS+  -->  Z1SS   UP     DB          
      3.31378996E-01    3      1000022         4        -3             # W1SS+  -->  Z1SS   CH     SB          
      1.10459670E-01    3      1000022       -11        12             # W1SS+  -->  Z1SS   E+     NUE         
      1.10459670E-01    3      1000022       -13        14             # W1SS+  -->  Z1SS   MU+    NUM         
      1.10460386E-01    3      1000022       -15        16             # W1SS+  -->  Z1SS   TAU+   NUT         
      2.93119554E-03    3      1000023         2        -1             # W1SS+  -->  Z2SS   UP     DB          
      9.77065065E-04    3      1000023       -11        12             # W1SS+  -->  Z2SS   E+     NUE         
      9.77065065E-04    3      1000023       -13        14             # W1SS+  -->  Z2SS   MU+    NUM         
      9.77049931E-04    3      1000023       -15        16             # W1SS+  -->  Z2SS   TAU+   NUT         
#         PDG         Width
DECAY   1000037  3.40809517E+01   # W2SS+ decays
#          BR          NDA       ID1       ID2       ID3       ID4
      1.61379043E-09    3      1000022         2        -1             # W2SS+  -->  Z1SS   UP     DB          
      1.61379043E-09    3      1000022         4        -3             # W2SS+  -->  Z1SS   CH     SB          
      2.52792764E-09    3      1000022       -11        12             # W2SS+  -->  Z1SS   E+     NUE         
      2.52792764E-09    3      1000022       -13        14             # W2SS+  -->  Z1SS   MU+    NUM         
      1.03969853E-07    3      1000022       -15        16             # W2SS+  -->  Z1SS   TAU+   NUT         
      1.38457909E-01    2      1000022        24                       # W2SS+  -->  Z1SS   W+                 
      1.08040847E-01    2      1000022        37                       # W2SS+  -->  Z1SS   H+                 
      1.09527376E-09    3      1000023         2        -1             # W2SS+  -->  Z2SS   UP     DB          
      1.09527376E-09    3      1000023         4        -3             # W2SS+  -->  Z2SS   CH     SB          
      1.61454206E-09    3      1000023       -11        12             # W2SS+  -->  Z2SS   E+     NUE         
      1.61454206E-09    3      1000023       -13        14             # W2SS+  -->  Z2SS   MU+    NUM         
      9.92719791E-08    3      1000023       -15        16             # W2SS+  -->  Z2SS   TAU+   NUT         
      1.34644002E-01    2      1000023        24                       # W2SS+  -->  Z2SS   W+                 
      1.04039788E-01    2      1000023        37                       # W2SS+  -->  Z2SS   H+                 
      1.67027192E-08    3      1000025         2        -1             # W2SS+  -->  Z3SS   UP     DB          
      1.67027192E-08    3      1000025         4        -3             # W2SS+  -->  Z3SS   CH     SB          
      1.87126147E-07    3      1000025       -11        12             # W2SS+  -->  Z3SS   E+     NUE         
      1.87126147E-07    3      1000025       -13        14             # W2SS+  -->  Z3SS   MU+    NUM         
      1.99287101E-07    3      1000025       -15        16             # W2SS+  -->  Z3SS   TAU+   NUT         
      4.27722232E-03    2      1000025        24                       # W2SS+  -->  Z3SS   W+                 
      1.21420851E-06    2      1000025        37                       # W2SS+  -->  Z3SS   H+                 
      1.45147070E-01    2      1000024        23                       # W2SS+  -->  W1SS+  Z0                 
      5.51032908E-09    3      1000024         1        -1             # W2SS+  -->  W1SS+  DN     DB          
      5.51032908E-09    3      1000024         3        -3             # W2SS+  -->  W1SS+  ST     SB          
      7.25611932E-11    3      1000024         2        -2             # W2SS+  -->  W1SS+  UP     UB          
      7.25611932E-11    3      1000024         4        -4             # W2SS+  -->  W1SS+  CH     CB          
      8.66683184E-11    3      1000024        12       -12             # W2SS+  -->  W1SS+  NUE    ANUE        
      8.66683184E-11    3      1000024        14       -14             # W2SS+  -->  W1SS+  NUM    ANUM        
      1.80900739E-10    3      1000024        16       -16             # W2SS+  -->  W1SS+  NUT    ANUT        
      6.57125021E-09    3      1000024        11       -11             # W2SS+  -->  W1SS+  E-     E+          
      6.57125021E-09    3      1000024        13       -13             # W2SS+  -->  W1SS+  MU-    MU+         
      6.97283298E-09    3      1000024        15       -15             # W2SS+  -->  W1SS+  TAU-   TAU+        
      1.53891727E-01    2      1000024        25                       # W2SS+  -->  W1SS+  HL0                
      1.05459318E-01    2      1000024        35                       # W2SS+  -->  W1SS+  HH0                
      1.06040187E-01    2      1000024        36                       # W2SS+  -->  W1SS+  HA0                
#         PDG         Width
DECAY        25  3.97049589E-03   # HL0   decays
#          BR          NDA       ID1       ID2       ID3       ID4
      5.62518165E-09    2           11       -11                       # HL0    -->  E-     E+                 
      2.37504326E-04    2           13       -13                       # HL0    -->  MU-    MU+                
      6.79432154E-02    2           15       -15                       # HL0    -->  TAU-   TAU+               
      7.05110460E-06    2            1        -1                       # HL0    -->  DN     DB                 
      2.84900004E-03    2            3        -3                       # HL0    -->  ST     SB                 
      6.10441387E-01    2            5        -5                       # HL0    -->  BT     BB                 
      2.15213117E-06    2            2        -2                       # HL0    -->  UP     UB                 
      3.99818979E-02    2            4        -4                       # HL0    -->  CH     CB                 
      2.66192714E-03    2           22        22                       # HL0    -->  GM     GM                 
      5.29531837E-02    2           21        21                       # HL0    -->  GL     GL                 
      1.11332508E-02    3           24        11       -12             # HL0    -->  W+     E-     ANUE        
      1.11332508E-02    3           24        13       -14             # HL0    -->  W+     MU-    ANUM        
      1.11332508E-02    3           24        15       -16             # HL0    -->  W+     TAU-   ANUT        
      3.33997533E-02    3           24        -2         1             # HL0    -->  W+     UB     DN          
      3.33997533E-02    3           24        -4         3             # HL0    -->  W+     CB     ST          
      1.11332508E-02    3          -24       -11        12             # HL0    -->  W-     E+     NUE         
      1.11332508E-02    3          -24       -13        14             # HL0    -->  W-     MU+    NUM         
      1.11332508E-02    3          -24       -15        16             # HL0    -->  W-     TAU+   NUT         
      3.33997533E-02    3          -24         2        -1             # HL0    -->  W-     UP     DB          
      3.33997533E-02    3          -24         4        -3             # HL0    -->  W-     CH     SB          
      1.54041743E-03    3           23        12       -12             # HL0    -->  Z0     NUE    ANUE        
      1.54041743E-03    3           23        14       -14             # HL0    -->  Z0     NUM    ANUM        
      1.54041743E-03    3           23        16       -16             # HL0    -->  Z0     NUT    ANUT        
      7.75276625E-04    3           23        11       -11             # HL0    -->  Z0     E-     E+          
      7.75276625E-04    3           23        13       -13             # HL0    -->  Z0     MU-    MU+         
      7.75276625E-04    3           23        15       -15             # HL0    -->  Z0     TAU-   TAU+        
      2.65603187E-03    3           23         2        -2             # HL0    -->  Z0     UP     UB          
      2.65603187E-03    3           23         4        -4             # HL0    -->  Z0     CH     CB          
      3.42162373E-03    3           23         1        -1             # HL0    -->  Z0     DN     DB          
      3.42162373E-03    3           23         3        -3             # HL0    -->  Z0     ST     SB          
      3.42162373E-03    3           23         5        -5             # HL0    -->  Z0     BT     BB          
#         PDG         Width
DECAY        35  3.55456257E+00   # HH0   decays
#          BR          NDA       ID1       ID2       ID3       ID4
      1.08263674E-08    2           11       -11                       # HH0    -->  E-     E+                 
      4.57108748E-04    2           13       -13                       # HH0    -->  MU-    MU+                
      1.30920514E-01    2           15       -15                       # HH0    -->  TAU-   TAU+               
      1.32623500E-05    2            1        -1                       # HH0    -->  DN     DB                 
      5.35866059E-03    2            3        -3                       # HH0    -->  ST     SB                 
      7.98676550E-01    2            5        -5                       # HH0    -->  BT     BB                 
      8.78732018E-11    2            2        -2                       # HH0    -->  UP     UB                 
      1.23751738E-06    2            4        -4                       # HH0    -->  CH     CB                 
      5.64526170E-02    2            6        -6                       # HH0    -->  TP     TB                 
      1.76241770E-07    2           22        22                       # HH0    -->  GM     GM                 
      2.47978769E-05    2           21        21                       # HH0    -->  GL     GL                 
      2.25650889E-04    2           24       -24                       # HH0    -->  W+     W-                 
      1.14566596E-04    2           23        23                       # HH0    -->  Z0     Z0                 
      1.43830432E-03    2      1000022   1000022                       # HH0    -->  Z1SS   Z1SS               
      9.28342124E-05    2      1000022   1000023                       # HH0    -->  Z1SS   Z2SS               
      1.08039926E-03    2      1000023   1000023                       # HH0    -->  Z2SS   Z2SS               
      4.29431535E-03    2      1000024  -1000024                       # HH0    -->  W1SS+  W1SS-              
      8.48912401E-04    2           25        25                       # HH0    -->  HL0    HL0                
#         PDG         Width
DECAY        36  3.54259968E+00   # HA0   decays
#          BR          NDA       ID1       ID2       ID3       ID4
      1.07932729E-08    2           11       -11                       # HA0    -->  E-     E+                 
      4.55711444E-04    2           13       -13                       # HA0    -->  MU-    MU+                
      1.30521923E-01    2           15       -15                       # HA0    -->  TAU-   TAU+               
      1.32225359E-05    2            1        -1                       # HA0    -->  DN     DB                 
      5.34257432E-03    2            3        -3                       # HA0    -->  ST     SB                 
      7.96314657E-01    2            5        -5                       # HA0    -->  BT     BB                 
      8.35712055E-11    2            2        -2                       # HA0    -->  UP     UB                 
      1.17785873E-06    2            4        -4                       # HA0    -->  CH     CB                 
      5.96812330E-02    2            6        -6                       # HA0    -->  TP     TB                 
      3.17986149E-07    2           22        22                       # HA0    -->  GM     GM                 
      7.75174340E-05    2           21        21                       # HA0    -->  GL     GL                 
      1.93292962E-03    2      1000022   1000022                       # HA0    -->  Z1SS   Z1SS               
      7.07448544E-06    2      1000022   1000023                       # HA0    -->  Z1SS   Z2SS               
      8.48341733E-04    2      1000023   1000023                       # HA0    -->  Z2SS   Z2SS               
      4.58624866E-03    2      1000024  -1000024                       # HA0    -->  W1SS+  W1SS-              
      2.17024877E-04    2           25        23                       # HA0    -->  HL0    Z0                 
#         PDG         Width
DECAY        37  3.11947465E+00   # H+    decays
#          BR          NDA       ID1       ID2       ID3       ID4
      1.22968453E-08    2           12       -11                       # H+     -->  NUE    E+                 
      5.19195048E-04    2           14       -13                       # H+     -->  NUM    MU+                
      1.48704484E-01    2           16       -15                       # H+     -->  NUT    TAU+               
      1.38467021E-05    2            2        -1                       # H+     -->  UP     DB                 
      5.59594482E-03    2            4        -3                       # H+     -->  CH     SB                 
      8.44641685E-01    2            6        -5                       # H+     -->  TP     BB                 
      4.40614713E-05    2      1000024   1000022                       # H+     -->  W1SS+  Z1SS               
      2.33538391E-04    2      1000024   1000023                       # H+     -->  W1SS+  Z2SS               
      2.47165706E-04    2           25        24                       # H+     -->  HL0    W+                 
