#  ISAJET SUSY parameters in SUSY Les Houches Accord 2 format
#  Created by ISALHA 2.0 Last revision: C. Balazs 21 Apr 2009
Block SPINFO   # Program information
     1   ISASUGRA from ISAJET          # Spectrum Calculator
     2   7.80   29-OCT-2009 12:50:36   # Version number
Block MODSEL   # Model selection
     1     3   # Minimal anomaly mediated (AMSB) model             
Block SMINPUTS   # Standard Model inputs
     1     1.27836258E+02   # alpha_em^(-1)
     2     1.16570000E-05   # G_Fermi
     3     1.17200002E-01   # alpha_s(M_Z)
     4     9.11699982E+01   # m_{Z}(pole)
     5     4.19999981E+00   # m_{b}(m_{b})
     6     1.72500000E+02   # m_{top}(pole)
     7     1.77699995E+00   # m_{tau}(pole)
Block MINPAR   # SUSY breaking input parameters
     1     5.00000000E+03   # m_0
     2     1.54800000E+05   # m_{3/2}
     3     5.00000000E+00   # tan(beta)
     4     1.00000000E+00   # sign(mu)
Block EXTPAR   # Non-universal SUSY breaking parameters
     0     8.56621349E+15   # Input scale
Block MASS   # Scalar and gaugino mass spectrum
#  PDG code   mass                 particle
         5     4.80000000E+00   # b-quark pole mass calculated from mb(mb)_Msbar
         6     1.72500000E+02   # t-quark pole mass (not read by ME)
        15     1.77682000E+00   # tau pole mass (not read by ME)
        23     9.11876000E+01   # Z pole mass (not read by ME)
        24     8.04229965E+01   #  W^+
        25     1.15939636E+02   #  h^0            
        35     5.68709229E+03   #  H^0            
        36     5.64979053E+03   #  A^0            
        37     5.68751660E+03   #  H^+            
   1000001     5.70081250E+03   #  dnl            
   1000002     5.70028418E+03   #  upl            
   1000003     5.70081250E+03   #  stl            
   1000004     5.70028467E+03   #  chl            
   1000005     4.78056006E+03   #  b1             
   1000006     3.62991626E+03   #  t1             
   1000011     4.95481445E+03   #  el-            
   1000012     4.95549170E+03   #  nuel           
   1000013     4.95481445E+03   #  mul-           
   1000014     4.95549170E+03   #  numl           
   1000015     4.93555908E+03   #  tau1           
   1000016     4.94945459E+03   #  nutl           
   1000021     3.27396069E+03   #  glss           
   1000022     4.49639740E+02   #  z1ss           
   1000023     1.44067200E+03   #  z2ss           
   1000024     4.49812439E+02   #  w1ss           
   1000025    -2.53815283E+03   #  z3ss           
   1000035     2.54037744E+03   #  z4ss           
   1000037     2.54293335E+03   #  w2ss           
   2000001     5.74172119E+03   #  dnr            
   2000002     5.72494141E+03   #  upr            
   2000003     5.74172119E+03   #  str            
   2000004     5.72494141E+03   #  chr            
   2000005     5.71273438E+03   #  b2             
   2000006     4.80487256E+03   #  t2             
   2000011     4.94870703E+03   #  er-            
   2000013     4.94870703E+03   #  mur-           
   2000015     4.94893018E+03   #  tau2           
Block ALPHA   # Effective Higgs mixing parameter
         -1.97529674E-01   # alpha
Block STOPMIX   # stop mixing matrix
  1  1     2.14988869E-02   # O_{11}
  1  2    -9.99768853E-01   # O_{12}
  2  1     9.99768853E-01   # O_{21}
  2  2     2.14988869E-02   # O_{22}
Block SBOTMIX   # sbottom mixing matrix
  1  1     9.99996006E-01   # O_{11}
  1  2     2.83469888E-03   # O_{12}
  2  1    -2.83469888E-03   # O_{21}
  2  2     9.99996006E-01   # O_{22}
Block STAUMIX   # stau mixing matrix
  1  1     2.08633497E-01   # O_{11}
  1  2     9.77993906E-01   # O_{12}
  2  1    -9.77993906E-01   # O_{21}
  2  2     2.08633497E-01   # O_{22}
Block NMIX   # neutralino mixing matrix
  1  1     3.64325708E-04   #
  1  2    -9.99451399E-01   #
  1  3     3.14803347E-02   #
  1  4    -1.02996500E-02   #
  2  1    -9.99523222E-01   #
  2  2    -1.34988641E-03   #
  2  3    -2.57167518E-02   #
  2  4     1.70315206E-02   #
  3  1     6.15566969E-03   #
  3  2    -1.49731170E-02   #
  3  3    -7.06826866E-01   #
  3  4    -7.07201362E-01   #
  4  1     3.02525703E-02   #
  4  2    -2.95163896E-02   #
  4  3    -7.06217647E-01   #
  4  4     7.06732333E-01   #
Block UMIX   # chargino U mixing matrix
  1  1    -9.98994052E-01   # U_{11}
  1  2     4.48427424E-02   # U_{12}
  2  1    -4.48427424E-02   # U_{21}
  2  2    -9.98994052E-01   # U_{22}
Block VMIX   # chargino V mixing matrix
  1  1    -9.99853671E-01   # V_{11}
  1  2     1.71074104E-02   # V_{12}
  2  1    -1.71074104E-02   # V_{21}
  2  2    -9.99853671E-01   # V_{22}
Block GAUGE Q=  4.06386377E+03   #
     1     3.57524991E-01   # g`
     2     6.52378619E-01   # g_2
     3     1.21928012E+00   # g_3
Block YU Q=  4.06386377E+03   #
  3  3     8.35335374E-01   # y_t
Block YD Q=  4.06386377E+03   #
  3  3     6.42141476E-02   # y_b
Block YE Q=  4.06386377E+03   #
  3  3     5.14767766E-02   # y_tau
Block HMIX Q=  4.06386377E+03   # Higgs mixing parameters
     1     2.51511304E+03   # mu(Q)
     2     5.00000000E+00   # tan(beta)(M_GUT)
     3     2.52245209E+02   # Higgs vev at Q
     4     3.19201340E+07   # m_A^2(Q)
Block MSOFT Q=  4.06386377E+03   # DRbar SUSY breaking parameters
     1     1.44508557E+03   # M_1(Q)          
     2     4.17575226E+02   # M_2(Q)          
     3    -2.92905176E+03   # M_3(Q)          
    21     3.23374943E+04   # mH1^2(Q)            
    22    -1.28800134E+05   # mH2^2(Q)            
    31     4.93775928E+03   # MeL(Q)          
    32     4.93775928E+03   # MmuL(Q)         
    33     4.93190527E+03   # MtauL(Q)        
    34     4.94295068E+03   # MeR(Q)          
    35     4.94295068E+03   # MmuR(Q)         
    36     4.93147803E+03   # MtauR(Q)        
    41     5.56324023E+03   # MqL1(Q)         
    42     5.56324023E+03   # MqL2(Q)         
    43     4.66098389E+03   # MqL3(Q)         
    44     5.58782764E+03   # MuR(Q)          
    45     5.58782764E+03   # McR(Q)          
    46     3.54324097E+03   # MtR(Q)          
    47     5.60448877E+03   # MdR(Q)          
    48     5.60448877E+03   # MsR(Q)          
    49     5.60604053E+03   # MbR(Q)          
Block AU Q=  4.06386377E+03   #
  1  1     2.43303833E+03   # A_u
  2  2     2.43303833E+03   # A_c
  3  3     2.43303833E+03   # A_t
Block AD Q=  4.06386377E+03   #
  1  1     5.79269434E+03   # A_d
  2  2     5.79269434E+03   # A_s
  3  3     5.79269434E+03   # A_b
Block AE Q=  4.06386377E+03   #
  1  1     1.61629736E+03   # A_e
  2  2     1.61629736E+03   # A_mu
  3  3     1.61629736E+03   # A_tau
#
#  ISAJET decay tables in SUSY Les Houches accord format
#  Created by ISALHD. Last revision: C. Balazs, 2005 May 25
Block DCINFO                           # Program information
     1   ISASUGRA from ISAJET          # Spectrum Calculator
     2   7.80   29-OCT-2009 12:50:36   # Version number
#         PDG         Width
DECAY        23     2.49520000E+00   # Z width (SM calculation)
DECAY        24     2.08500000E+00   # W width (SM calculation)
#
#         PDG            Width  
DECAY         6  1.14680779E+00   # TP    decays
#          BR          NDA       ID1       ID2       ID3       ID4
      3.33333343E-01    3            2        -1         5             # TP     -->  UP     DB     BT          
      3.33333343E-01    3            4        -3         5             # TP     -->  CH     SB     BT          
      1.11111112E-01    3          -11        12         5             # TP     -->  E+     NUE    BT          
      1.11111112E-01    3          -13        14         5             # TP     -->  MU+    NUM    BT          
      1.11111112E-01    3          -15        16         5             # TP     -->  TAU+   NUT    BT          
#         PDG         Width
DECAY   1000021  2.30342597E-02   # GLSS  decays
#          BR          NDA       ID1       ID2       ID3       ID4
      6.68894947E-02    3      1000024         1        -2             # GLSS   -->  W1SS+  DN     UB          
      6.68894947E-02    3     -1000024         2        -1             # GLSS   -->  W1SS-  UP     DB          
      6.68894723E-02    3      1000024         3        -4             # GLSS   -->  W1SS+  ST     CB          
      6.68894723E-02    3     -1000024         4        -3             # GLSS   -->  W1SS-  CH     SB          
      1.56139299E-01    3      1000024         5        -6             # GLSS   -->  W1SS+  BT     TB          
      1.56139299E-01    3     -1000024         6        -5             # GLSS   -->  W1SS-  TP     BB          
      5.01757199E-07    3      1000037         1        -2             # GLSS   -->  W2SS+  DN     UB          
      5.01757199E-07    3     -1000037         2        -1             # GLSS   -->  W2SS-  UP     DB          
      5.01757256E-07    3      1000037         3        -4             # GLSS   -->  W2SS+  ST     CB          
      5.01757256E-07    3     -1000037         4        -3             # GLSS   -->  W2SS-  CH     SB          
      1.39403613E-02    3      1000037         5        -6             # GLSS   -->  W2SS+  BT     TB          
      1.39403613E-02    3     -1000037         6        -5             # GLSS   -->  W2SS-  TP     BB          
      9.20637289E-10    2      1000022        21                       # GLSS   -->  Z1SS   GL                 
      3.34553532E-02    3      1000022         2        -2             # GLSS   -->  Z1SS   UP     UB          
      3.34494375E-02    3      1000022         1        -1             # GLSS   -->  Z1SS   DN     DB          
      3.34494375E-02    3      1000022         3        -3             # GLSS   -->  Z1SS   ST     SB          
      3.34553383E-02    3      1000022         4        -4             # GLSS   -->  Z1SS   CH     CB          
      8.09301138E-02    3      1000022         5        -5             # GLSS   -->  Z1SS   BT     BB          
      7.49164745E-02    3      1000022         6        -6             # GLSS   -->  Z1SS   TP     TB          
      7.15710106E-04    2      1000023        21                       # GLSS   -->  Z2SS   GL                 
      4.33028257E-03    3      1000023         2        -2             # GLSS   -->  Z2SS   UP     UB          
      1.25764031E-03    3      1000023         1        -1             # GLSS   -->  Z2SS   DN     DB          
      1.25764031E-03    3      1000023         3        -3             # GLSS   -->  Z2SS   ST     SB          
      4.33028257E-03    3      1000023         4        -4             # GLSS   -->  Z2SS   CH     CB          
      1.68599689E-03    3      1000023         5        -5             # GLSS   -->  Z2SS   BT     BB          
      6.54456839E-02    3      1000023         6        -6             # GLSS   -->  Z2SS   TP     TB          
      1.03562884E-03    2      1000025        21                       # GLSS   -->  Z3SS   GL                 
      1.04796236E-07    3      1000025         2        -2             # GLSS   -->  Z3SS   UP     UB          
      1.30764235E-07    3      1000025         1        -1             # GLSS   -->  Z3SS   DN     DB          
      1.30764235E-07    3      1000025         3        -3             # GLSS   -->  Z3SS   ST     SB          
      1.04796186E-07    3      1000025         4        -4             # GLSS   -->  Z3SS   CH     CB          
      1.89151397E-05    3      1000025         5        -5             # GLSS   -->  Z3SS   BT     BB          
      1.28308544E-02    3      1000025         6        -6             # GLSS   -->  Z3SS   TP     TB          
      9.62296908E-04    2      1000035        21                       # GLSS   -->  Z4SS   GL                 
      1.76966552E-07    3      1000035         2        -2             # GLSS   -->  Z4SS   UP     UB          
      2.25923799E-07    3      1000035         1        -1             # GLSS   -->  Z4SS   DN     DB          
      2.25923799E-07    3      1000035         3        -3             # GLSS   -->  Z4SS   ST     SB          
      1.76966509E-07    3      1000035         4        -4             # GLSS   -->  Z4SS   CH     CB          
      1.89804196E-05    3      1000035         5        -5             # GLSS   -->  Z4SS   BT     BB          
      8.73329863E-03    3      1000035         6        -6             # GLSS   -->  Z4SS   TP     TB          
#         PDG         Width
DECAY   1000002  2.05148315E+02   # UPL   decays
#          BR          NDA       ID1       ID2       ID3       ID4
      1.15367837E-01    2      1000022         2                       # UPL    -->  Z1SS   UP                 
      3.48784192E-03    2      1000023         2                       # UPL    -->  Z2SS   UP                 
      1.44116020E-05    2      1000025         2                       # UPL    -->  Z3SS   UP                 
      4.31722729E-05    2      1000035         2                       # UPL    -->  Z4SS   UP                 
      6.50092781E-01    2      1000021         2                       # UPL    -->  GLSS   UP                 
      2.30950028E-01    2      1000024         1                       # UPL    -->  W1SS+  DN                 
      4.39230353E-05    2      1000037         1                       # UPL    -->  W2SS+  DN                 
#         PDG         Width
DECAY   1000001  2.05158905E+02   # DNL   decays
#          BR          NDA       ID1       ID2       ID3       ID4
      1.15403652E-01    2      1000022         1                       # DNL    -->  Z1SS   DN                 
      3.38672195E-03    2      1000023         1                       # DNL    -->  Z2SS   DN                 
      1.94922031E-05    2      1000025         1                       # DNL    -->  Z3SS   DN                 
      9.23381085E-05    2      1000035         1                       # DNL    -->  Z4SS   DN                 
      6.50232852E-01    2      1000021         1                       # DNL    -->  GLSS   DN                 
      2.30563104E-01    2     -1000024         2                       # DNL    -->  W1SS-  UP                 
      3.01832566E-04    2     -1000037         2                       # DNL    -->  W2SS-  UP                 
#         PDG         Width
DECAY   1000003  2.05158905E+02   # STL   decays
#          BR          NDA       ID1       ID2       ID3       ID4
      1.15403652E-01    2      1000022         3                       # STL    -->  Z1SS   ST                 
      3.38672195E-03    2      1000023         3                       # STL    -->  Z2SS   ST                 
      1.94922031E-05    2      1000025         3                       # STL    -->  Z3SS   ST                 
      9.23381085E-05    2      1000035         3                       # STL    -->  Z4SS   ST                 
      6.50232852E-01    2      1000021         3                       # STL    -->  GLSS   ST                 
      2.30563089E-01    2     -1000024         4                       # STL    -->  W1SS-  CH                 
      3.01832450E-04    2     -1000037         4                       # STL    -->  W2SS-  CH                 
#         PDG         Width
DECAY   1000004  2.05148331E+02   # CHL   decays
#          BR          NDA       ID1       ID2       ID3       ID4
      1.15367815E-01    2      1000022         4                       # CHL    -->  Z1SS   CH                 
      3.48784169E-03    2      1000023         4                       # CHL    -->  Z2SS   CH                 
      1.44116011E-05    2      1000025         4                       # CHL    -->  Z3SS   CH                 
      4.31722729E-05    2      1000035         4                       # CHL    -->  Z4SS   CH                 
      6.50092781E-01    2      1000021         4                       # CHL    -->  GLSS   CH                 
      2.30950028E-01    2      1000024         3                       # CHL    -->  W1SS+  ST                 
      4.39230425E-05    2      1000037         3                       # CHL    -->  W2SS+  ST                 
#         PDG         Width
DECAY   1000005  1.66015839E+02   # BT1   decays
#          BR          NDA       ID1       ID2       ID3       ID4
      1.18965037E-01    2      1000022         5                       # BT1    -->  Z1SS   BT                 
      3.31291044E-03    2      1000023         5                       # BT1    -->  Z2SS   BT                 
      6.58550474E-04    2      1000025         5                       # BT1    -->  Z3SS   BT                 
      7.17072107E-04    2      1000035         5                       # BT1    -->  Z4SS   BT                 
      4.29559737E-01    2      1000021         5                       # BT1    -->  GLSS   BT                 
      2.37082928E-01    2     -1000024         6                       # BT1    -->  W1SS-  TP                 
      1.94785118E-01    2     -1000037         6                       # BT1    -->  W2SS-  TP                 
      1.49186263E-02    2          -24   1000006                       # BT1    -->  W-     TP1                
#         PDG         Width
DECAY   1000006  3.64540405E+01   # TP1   decays
#          BR          NDA       ID1       ID2       ID3       ID4
      1.65515527E-01    2      1000021         6                       # TP1    -->  GLSS   TP                 
      4.34967160E-06    2      1000022         6                       # TP1    -->  Z1SS   TP                 
      1.57927632E-01    2      1000023         6                       # TP1    -->  Z2SS   TP                 
      1.67331606E-01    2      1000025         6                       # TP1    -->  Z3SS   TP                 
      1.69464365E-01    2      1000035         6                       # TP1    -->  Z4SS   TP                 
      1.78960136E-08    2      1000024         5                       # TP1    -->  W1SS+  BT                 
      3.39756489E-01    2      1000037         5                       # TP1    -->  W2SS+  BT                 
#         PDG         Width
DECAY   2000002  1.46378967E+02   # UPR   decays
#          BR          NDA       ID1       ID2       ID3       ID4
      1.15908065E-08    2      1000022         2                       # UPR    -->  Z1SS   UP                 
      7.74944499E-02    2      1000023         2                       # UPR    -->  Z2SS   UP                 
      2.16255421E-06    2      1000025         2                       # UPR    -->  Z3SS   UP                 
      5.21877046E-05    2      1000035         2                       # UPR    -->  Z4SS   UP                 
      9.22451198E-01    2      1000021         2                       # UPR    -->  GLSS   UP                 
#         PDG         Width
DECAY   2000001  1.39006287E+02   # DNR   decays
#          BR          NDA       ID1       ID2       ID3       ID4
      3.06055692E-09    2      1000022         1                       # DNR    -->  Z1SS   DN                 
      2.04771031E-02    2      1000023         1                       # DNR    -->  Z2SS   DN                 
      5.72613601E-07    2      1000025         1                       # DNR    -->  Z3SS   DN                 
      1.38186469E-05    2      1000035         1                       # DNR    -->  Z4SS   DN                 
      9.79508460E-01    2      1000021         1                       # DNR    -->  GLSS   DN                 
#         PDG         Width
DECAY   2000003  1.39006287E+02   # STR   decays
#          BR          NDA       ID1       ID2       ID3       ID4
      3.06055692E-09    2      1000022         3                       # STR    -->  Z1SS   ST                 
      2.04771031E-02    2      1000023         3                       # STR    -->  Z2SS   ST                 
      5.72613601E-07    2      1000025         3                       # STR    -->  Z3SS   ST                 
      1.38186469E-05    2      1000035         3                       # STR    -->  Z4SS   ST                 
      9.79508460E-01    2      1000021         3                       # STR    -->  GLSS   ST                 
#         PDG         Width
DECAY   2000004  1.46378937E+02   # CHR   decays
#          BR          NDA       ID1       ID2       ID3       ID4
      1.15908074E-08    2      1000022         4                       # CHR    -->  Z1SS   CH                 
      7.74944574E-02    2      1000023         4                       # CHR    -->  Z2SS   CH                 
      2.16255398E-06    2      1000025         4                       # CHR    -->  Z3SS   CH                 
      5.21877118E-05    2      1000035         4                       # CHR    -->  Z4SS   CH                 
      9.22451138E-01    2      1000021         4                       # CHR    -->  GLSS   CH                 
#         PDG         Width
DECAY   2000005  1.37730560E+02   # BT2   decays
#          BR          NDA       ID1       ID2       ID3       ID4
      4.92069944E-07    2      1000022         5                       # BT2    -->  Z1SS   BT                 
      2.05343366E-02    2      1000023         5                       # BT2    -->  Z2SS   BT                 
      1.15921453E-03    2      1000025         5                       # BT2    -->  Z3SS   BT                 
      1.17155968E-03    2      1000035         5                       # BT2    -->  Z4SS   BT                 
      9.74405706E-01    2      1000021         5                       # BT2    -->  GLSS   BT                 
      1.01906528E-06    2     -1000024         6                       # BT2    -->  W1SS-  TP                 
      2.31534638E-03    2     -1000037         6                       # BT2    -->  W2SS-  TP                 
      6.91956984E-07    2          -24   1000006                       # BT2    -->  W-     TP1                
      1.75122521E-04    2          -24   2000006                       # BT2    -->  W-     TP2                
      9.51659167E-05    2           23   1000005                       # BT2    -->  Z0     BT1                
      1.41403041E-04    2           25   1000005                       # BT2    -->  HL0    BT1                
#         PDG         Width
DECAY   2000006  1.69606506E+02   # TP2   decays
#          BR          NDA       ID1       ID2       ID3       ID4
      4.24450427E-01    2      1000021         6                       # TP2    -->  GLSS   TP                 
      2.34376758E-01    2      1000024         5                       # TP2    -->  W1SS+  BT                 
      1.28141919E-03    2      1000037         5                       # TP2    -->  W2SS+  BT                 
      7.80795654E-03    2           23   1000006                       # TP2    -->  Z0     TP1                
      1.88688505E-02    2           25   1000006                       # TP2    -->  HL0    TP1                
      1.16765112E-01    2      1000022         6                       # TP2    -->  Z1SS   TP                 
      3.57194687E-03    2      1000023         6                       # TP2    -->  Z2SS   TP                 
      9.68406722E-02    2      1000025         6                       # TP2    -->  Z3SS   TP                 
      9.60369408E-02    2      1000035         6                       # TP2    -->  Z4SS   TP                 
#         PDG         Width
DECAY   1000011  6.67791214E+01   # EL-   decays
#          BR          NDA       ID1       ID2       ID3       ID4
      3.06736529E-01    2      1000022        11                       # EL-    -->  Z1SS   E-                 
      7.93814883E-02    2      1000023        11                       # EL-    -->  Z2SS   E-                 
      2.28235313E-05    2      1000025        11                       # EL-    -->  Z3SS   E-                 
      2.81916673E-05    2      1000035        11                       # EL-    -->  Z4SS   E-                 
      6.13149524E-01    2     -1000024        12                       # EL-    -->  W1SS-  NUE                
      6.81517471E-04    2     -1000037        12                       # EL-    -->  W2SS-  NUE                
#         PDG         Width
DECAY   1000013  6.67791214E+01   # MUL-  decays
#          BR          NDA       ID1       ID2       ID3       ID4
      3.06736529E-01    2      1000022        13                       # MUL-   -->  Z1SS   MU-                
      7.93814883E-02    2      1000023        13                       # MUL-   -->  Z2SS   MU-                
      2.28235313E-05    2      1000025        13                       # MUL-   -->  Z3SS   MU-                
      2.81916673E-05    2      1000035        13                       # MUL-   -->  Z4SS   MU-                
      6.13149524E-01    2     -1000024        14                       # MUL-   -->  W1SS-  NUM                
      6.81517471E-04    2     -1000037        14                       # MUL-   -->  W2SS-  NUM                
#         PDG         Width
DECAY   1000015  2.33186550E+01   # TAU1- decays
#          BR          NDA       ID1       ID2       ID3       ID4
      3.93885896E-02    2      1000022        15                       # TAU1-  -->  Z1SS   TAU-               
      8.71255636E-01    2      1000023        15                       # TAU1-  -->  Z2SS   TAU-               
      2.91867042E-03    2      1000025        15                       # TAU1-  -->  Z3SS   TAU-               
      2.95516709E-03    2      1000035        15                       # TAU1-  -->  Z4SS   TAU-               
      7.87531435E-02    2     -1000024        16                       # TAU1-  -->  W1SS-  NUT                
      4.72874520E-03    2     -1000037        16                       # TAU1-  -->  W2SS-  NUT                
#         PDG         Width
DECAY   1000012  6.68095322E+01   # NUEL  decays
#          BR          NDA       ID1       ID2       ID3       ID4
      3.06886077E-01    2      1000022        12                       # NUEL   -->  Z1SS   NUE                
      7.85840154E-02    2      1000023        12                       # NUEL   -->  Z2SS   NUE                
      5.72466051E-05    2      1000025        12                       # NUEL   -->  Z3SS   NUE                
      3.61293583E-04    2      1000035        12                       # NUEL   -->  Z4SS   NUE                
      6.14012301E-01    2      1000024        11                       # NUEL   -->  W1SS+  E-                 
      9.91762572E-05    2      1000037        11                       # NUEL   -->  W2SS+  E-                 
#         PDG         Width
DECAY   1000014  6.68095322E+01   # NUML  decays
#          BR          NDA       ID1       ID2       ID3       ID4
      3.06886077E-01    2      1000022        14                       # NUML   -->  Z1SS   NUM                
      7.85840154E-02    2      1000023        14                       # NUML   -->  Z2SS   NUM                
      5.72466051E-05    2      1000025        14                       # NUML   -->  Z3SS   NUM                
      3.61293583E-04    2      1000035        14                       # NUML   -->  Z4SS   NUM                
      6.14012301E-01    2      1000024        13                       # NUML   -->  W1SS+  MU-                
      9.91762572E-05    2      1000037        13                       # NUML   -->  W2SS+  MU-                
#         PDG         Width
DECAY   1000016  6.68728867E+01   # NUTL  decays
#          BR          NDA       ID1       ID2       ID3       ID4
      3.06209385E-01    2      1000022        16                       # NUTL   -->  Z1SS   NUT                
      7.83785731E-02    2      1000023        16                       # NUTL   -->  Z2SS   NUT                
      5.70235607E-05    2      1000025        16                       # NUTL   -->  Z3SS   NUT                
      3.59884347E-04    2      1000035        16                       # NUTL   -->  Z4SS   NUT                
      6.12666070E-01    2      1000024        15                       # NUTL   -->  W1SS+  TAU-               
      2.32909434E-03    2      1000037        15                       # NUTL   -->  W2SS+  TAU-               
      9.78257544E-11    3      1000015        16       -15             # NUTL   -->  TAU1-  NUT    TAU+        
      9.78257544E-11    3      1000015        12       -11             # NUTL   -->  TAU1-  NUE    E+          
      9.78257544E-11    3      1000015        14       -13             # NUTL   -->  TAU1-  NUM    MU+         
      2.93477270E-10    3      1000015         2        -1             # NUTL   -->  TAU1-  UP     DB          
      2.93477270E-10    3      1000015         4        -3             # NUTL   -->  TAU1-  CH     SB          
#         PDG         Width
DECAY   2000011  2.10776787E+01   # ER-   decays
#          BR          NDA       ID1       ID2       ID3       ID4
      1.55900295E-07    2      1000022        11                       # ER-    -->  Z1SS   E-                 
      9.99382377E-01    2      1000023        11                       # ER-    -->  Z2SS   E-                 
      2.45744923E-05    2      1000025        11                       # ER-    -->  Z3SS   E-                 
      5.92808821E-04    2      1000035        11                       # ER-    -->  Z4SS   E-                 
#         PDG         Width
DECAY   2000013  2.10776787E+01   # MUR-  decays
#          BR          NDA       ID1       ID2       ID3       ID4
      1.55900295E-07    2      1000022        13                       # MUR-   -->  Z1SS   MU-                
      9.99382377E-01    2      1000023        13                       # MUR-   -->  Z2SS   MU-                
      2.45744923E-05    2      1000025        13                       # MUR-   -->  Z3SS   MU-                
      5.92808821E-04    2      1000035        13                       # MUR-   -->  Z4SS   MU-                
#         PDG         Width
DECAY   2000015  6.48197861E+01   # TAU2- decays
#          BR          NDA       ID1       ID2       ID3       ID4
      3.01419169E-01    2      1000022        15                       # TAU2-  -->  Z1SS   TAU-               
      9.20494646E-02    2      1000023        15                       # TAU2-  -->  Z2SS   TAU-               
      1.28315389E-03    2      1000025        15                       # TAU2-  -->  Z3SS   TAU-               
      1.45428965E-03    2      1000035        15                       # TAU2-  -->  Z4SS   TAU-               
      6.02506340E-01    2     -1000024        16                       # TAU2-  -->  W1SS-  NUT                
      1.28754671E-03    2     -1000037        16                       # TAU2-  -->  W2SS-  NUT                
#         PDG         Width
DECAY   1000023  9.20595787E-03   # Z2SS  decays
#          BR          NDA       ID1       ID2       ID3       ID4
      5.34536355E-07    2      1000022        22                       # Z2SS   -->  Z1SS   GM                 
      2.46051401E-01    2      1000024       -24                       # Z2SS   -->  W1SS+  W-                 
      2.46051401E-01    2     -1000024        24                       # Z2SS   -->  W1SS-  W+                 
      3.19544561E-02    2      1000022        23                       # Z2SS   -->  Z1SS   Z0                 
      2.20604052E-05    3      1000022         2        -2             # Z2SS   -->  Z1SS   UP     UB          
      2.14169158E-05    3      1000022         1        -1             # Z2SS   -->  Z1SS   DN     DB          
      2.14169158E-05    3      1000022         3        -3             # Z2SS   -->  Z1SS   ST     SB          
      2.20603979E-05    3      1000022         4        -4             # Z2SS   -->  Z1SS   CH     CB          
      4.45252990E-05    3      1000022         5        -5             # Z2SS   -->  Z1SS   BT     BB          
      1.17123382E-04    3      1000022        11       -11             # Z2SS   -->  Z1SS   E-     E+          
      1.17123382E-04    3      1000022        13       -13             # Z2SS   -->  Z1SS   MU-    MU+         
      1.17787116E-04    3      1000022        15       -15             # Z2SS   -->  Z1SS   TAU-   TAU+        
      1.16004652E-04    3      1000022        12       -12             # Z2SS   -->  Z1SS   NUE    ANUE        
      1.16004652E-04    3      1000022        14       -14             # Z2SS   -->  Z1SS   NUM    ANUM        
      1.16595416E-04    3      1000022        16       -16             # Z2SS   -->  Z1SS   NUT    ANUT        
      4.75110233E-01    2      1000022        25                       # Z2SS   -->  Z1SS   HL0                
#         PDG         Width
DECAY   1000025  1.86915741E+01   # Z3SS  decays
#          BR          NDA       ID1       ID2       ID3       ID4
      1.84376731E-07    2      1000022        22                       # Z3SS   -->  Z1SS   GM                 
      5.87508471E-12    2      1000023        22                       # Z3SS   -->  Z2SS   GM                 
      3.14873666E-01    2      1000024       -24                       # Z3SS   -->  W1SS+  W-                 
      3.14873666E-01    2     -1000024        24                       # Z3SS   -->  W1SS-  W+                 
      2.28307396E-01    2      1000022        23                       # Z3SS   -->  Z1SS   Z0                 
      8.12550113E-02    2      1000023        23                       # Z3SS   -->  Z2SS   Z0                 
      1.01666420E-09    3      1000022         2        -2             # Z3SS   -->  Z1SS   UP     UB          
      1.37469369E-09    3      1000022         1        -1             # Z3SS   -->  Z1SS   DN     DB          
      1.37469369E-09    3      1000022         3        -3             # Z3SS   -->  Z1SS   ST     SB          
      1.01666375E-09    3      1000022         4        -4             # Z3SS   -->  Z1SS   CH     CB          
      3.12626213E-07    3      1000022         5        -5             # Z3SS   -->  Z1SS   BT     BB          
      4.47128584E-10    3      1000022        11       -11             # Z3SS   -->  Z1SS   E-     E+          
      4.47128584E-10    3      1000022        13       -13             # Z3SS   -->  Z1SS   MU-    MU+         
      6.01306027E-08    3      1000022        15       -15             # Z3SS   -->  Z1SS   TAU-   TAU+        
      1.12183107E-09    3      1000022        12       -12             # Z3SS   -->  Z1SS   NUE    ANUE        
      1.12183107E-09    3      1000022        14       -14             # Z3SS   -->  Z1SS   NUM    ANUM        
      1.12815468E-09    3      1000022        16       -16             # Z3SS   -->  Z1SS   NUT    ANUT        
      8.27419990E-12    3      1000023         2        -2             # Z3SS   -->  Z2SS   UP     UB          
      4.42946157E-12    3      1000023         1        -1             # Z3SS   -->  Z2SS   DN     DB          
      4.42946157E-12    3      1000023         3        -3             # Z3SS   -->  Z2SS   ST     SB          
      8.27419817E-12    3      1000023         4        -4             # Z3SS   -->  Z2SS   CH     CB          
      4.66160088E-09    3      1000023         5        -5             # Z3SS   -->  Z2SS   BT     BB          
      2.99598020E-11    3      1000023        11       -11             # Z3SS   -->  Z2SS   E-     E+          
      2.99598020E-11    3      1000023        13       -13             # Z3SS   -->  Z2SS   MU-    MU+         
      9.04355879E-09    3      1000023        15       -15             # Z3SS   -->  Z2SS   TAU-   TAU+        
      3.14468625E-11    3      1000023        12       -12             # Z3SS   -->  Z2SS   NUE    ANUE        
      3.14468625E-11    3      1000023        14       -14             # Z3SS   -->  Z2SS   NUM    ANUM        
      3.16341987E-11    3      1000023        16       -16             # Z3SS   -->  Z2SS   NUT    ANUT        
      5.73912188E-02    2      1000022        25                       # Z3SS   -->  Z1SS   HL0                
      3.29853920E-03    2      1000023        25                       # Z3SS   -->  Z2SS   HL0                
#         PDG         Width
DECAY   1000035  1.74155331E+01   # Z4SS  decays
#          BR          NDA       ID1       ID2       ID3       ID4
      8.36177971E-09    2      1000022        22                       # Z4SS   -->  Z1SS   GM                 
      8.41921999E-09    2      1000023        22                       # Z4SS   -->  Z2SS   GM                 
      1.13765456E-13    2      1000025        22                       # Z4SS   -->  Z3SS   GM                 
      2.72515416E-01    2      1000024       -24                       # Z4SS   -->  W1SS+  W-                 
      2.72515416E-01    2     -1000024        24                       # Z4SS   -->  W1SS-  W+                 
      6.31660372E-02    2      1000022        23                       # Z4SS   -->  Z1SS   Z0                 
      3.66939860E-03    2      1000023        23                       # Z4SS   -->  Z2SS   Z0                 
      5.56457369E-09    3      1000022         2        -2             # Z4SS   -->  Z1SS   UP     UB          
      1.18984396E-08    3      1000022         1        -1             # Z4SS   -->  Z1SS   DN     DB          
      1.18984396E-08    3      1000022         3        -3             # Z4SS   -->  Z1SS   ST     SB          
      5.56457236E-09    3      1000022         4        -4             # Z4SS   -->  Z1SS   CH     CB          
      3.57831198E-07    3      1000022         5        -5             # Z4SS   -->  Z1SS   BT     BB          
      9.99396677E-10    3      1000022        11       -11             # Z4SS   -->  Z1SS   E-     E+          
      9.99396677E-10    3      1000022        13       -13             # Z4SS   -->  Z1SS   MU-    MU+         
      6.48788472E-08    3      1000022        15       -15             # Z4SS   -->  Z1SS   TAU-   TAU+        
      1.28117952E-08    3      1000022        12       -12             # Z4SS   -->  Z1SS   NUE    ANUE        
      1.28117952E-08    3      1000022        14       -14             # Z4SS   -->  Z1SS   NUM    ANUM        
      1.28826665E-08    3      1000022        16       -16             # Z4SS   -->  Z1SS   NUT    ANUT        
      3.91710692E-10    3      1000023         2        -2             # Z4SS   -->  Z2SS   UP     UB          
      7.96330502E-11    3      1000023         1        -1             # Z4SS   -->  Z2SS   DN     DB          
      7.96330502E-11    3      1000023         3        -3             # Z4SS   -->  Z2SS   ST     SB          
      3.91710692E-10    3      1000023         4        -4             # Z4SS   -->  Z2SS   CH     CB          
      5.08507680E-09    3      1000023         5        -5             # Z4SS   -->  Z2SS   BT     BB          
      1.26139765E-09    3      1000023        11       -11             # Z4SS   -->  Z2SS   E-     E+          
      1.26139765E-09    3      1000023        13       -13             # Z4SS   -->  Z2SS   MU-    MU+         
      1.09936238E-08    3      1000023        15       -15             # Z4SS   -->  Z2SS   TAU-   TAU+        
      5.78515902E-10    3      1000023        12       -12             # Z4SS   -->  Z2SS   NUE    ANUE        
      5.78515902E-10    3      1000023        14       -14             # Z4SS   -->  Z2SS   NUM    ANUM        
      5.81916737E-10    3      1000023        16       -16             # Z4SS   -->  Z2SS   NUT    ANUT        
      3.76087806E-13    3      1000025         2        -2             # Z4SS   -->  Z3SS   UP     UB          
      4.84967914E-13    3      1000025         1        -1             # Z4SS   -->  Z3SS   DN     DB          
      4.84967914E-13    3      1000025         3        -3             # Z4SS   -->  Z3SS   ST     SB          
      1.10014720E-13    3      1000025        11       -11             # Z4SS   -->  Z3SS   E-     E+          
      1.10014720E-13    3      1000025        13       -13             # Z4SS   -->  Z3SS   MU-    MU+         
      2.18894510E-13    3      1000025        12       -12             # Z4SS   -->  Z3SS   NUE    ANUE        
      2.18894510E-13    3      1000025        14       -14             # Z4SS   -->  Z3SS   NUM    ANUM        
      2.18894510E-13    3      1000025        16       -16             # Z4SS   -->  Z3SS   NUT    ANUT        
      2.83103794E-01    2      1000022        25                       # Z4SS   -->  Z1SS   HL0                
      1.05029583E-01    2      1000023        25                       # Z4SS   -->  Z2SS   HL0                
#         PDG         Width
DECAY   1000024  4.79290332E-15   # W1SS+ decays
#          BR          NDA       ID1       ID2       ID3       ID4
      9.25192237E-01    2      1000022         0                       # W1SS+  -->  Z1SS   PI+                
      3.74038555E-02    3      1000022       -11        12             # W1SS+  -->  Z1SS   E+     NUE         
      3.74038555E-02    3      1000022       -13        14             # W1SS+  -->  Z1SS   MU+    NUM         
#         PDG         Width
DECAY   1000037  1.91521454E+01   # W2SS+ decays
#          BR          NDA       ID1       ID2       ID3       ID4
      1.34509168E-08    3      1000022         2        -1             # W2SS+  -->  Z1SS   UP     DB          
      1.34509168E-08    3      1000022         4        -3             # W2SS+  -->  Z1SS   CH     SB          
      8.42438297E-09    3      1000022       -11        12             # W2SS+  -->  Z1SS   E+     NUE         
      8.42438297E-09    3      1000022       -13        14             # W2SS+  -->  Z1SS   MU+    NUM         
      6.69273845E-08    3      1000022       -15        16             # W2SS+  -->  Z1SS   TAU+   NUT         
      3.07706952E-01    2      1000022        24                       # W2SS+  -->  Z1SS   W+                 
      8.86948570E-11    3      1000023         2        -1             # W2SS+  -->  Z2SS   UP     DB          
      8.86948570E-11    3      1000023         4        -3             # W2SS+  -->  Z2SS   CH     SB          
      5.19327192E-10    3      1000023       -11        12             # W2SS+  -->  Z2SS   E+     NUE         
      5.19327192E-10    3      1000023       -13        14             # W2SS+  -->  Z2SS   MU+    NUM         
      9.44263512E-09    3      1000023       -15        16             # W2SS+  -->  Z2SS   TAU+   NUT         
      8.30174312E-02    2      1000023        24                       # W2SS+  -->  Z2SS   W+                 
      6.79597836E-11    3      1000025         2        -1             # W2SS+  -->  Z3SS   UP     DB          
      6.79597836E-11    3      1000025         4        -3             # W2SS+  -->  Z3SS   CH     SB          
      2.26532595E-11    3      1000025       -11        12             # W2SS+  -->  Z3SS   E+     NUE         
      2.26532595E-11    3      1000025       -13        14             # W2SS+  -->  Z3SS   MU+    NUM         
      2.26533063E-11    3      1000025       -15        16             # W2SS+  -->  Z3SS   TAU+   NUT         
      3.67943133E-12    3      1000035         2        -1             # W2SS+  -->  Z4SS   UP     DB          
      3.67943133E-12    3      1000035         4        -3             # W2SS+  -->  Z4SS   CH     SB          
      1.22647714E-12    3      1000035       -11        12             # W2SS+  -->  Z4SS   E+     NUE         
      1.22647714E-12    3      1000035       -13        14             # W2SS+  -->  Z4SS   MU+    NUM         
      1.22647910E-12    3      1000035       -15        16             # W2SS+  -->  Z4SS   TAU+   NUT         
      2.95562863E-01    2      1000024        23                       # W2SS+  -->  W1SS+  Z0                 
      4.12683043E-09    3      1000024         1        -1             # W2SS+  -->  W1SS+  DN     DB          
      4.12682910E-09    3      1000024         3        -3             # W2SS+  -->  W1SS+  ST     SB          
      2.82949060E-08    3      1000024         2        -2             # W2SS+  -->  W1SS+  UP     UB          
      2.82949060E-08    3      1000024         4        -4             # W2SS+  -->  W1SS+  CH     CB          
      1.76630426E-08    3      1000024        12       -12             # W2SS+  -->  W1SS+  NUE    ANUE        
      1.76630426E-08    3      1000024        14       -14             # W2SS+  -->  W1SS+  NUM    ANUM        
      1.79795396E-08    3      1000024        16       -16             # W2SS+  -->  W1SS+  NUT    ANUT        
      2.57351229E-09    3      1000024        11       -11             # W2SS+  -->  W1SS+  E-     E+          
      2.57351229E-09    3      1000024        13       -13             # W2SS+  -->  W1SS+  MU-    MU+         
      2.58785460E-09    3      1000024        15       -15             # W2SS+  -->  W1SS+  TAU-   TAU+        
      3.13712537E-01    2      1000024        25                       # W2SS+  -->  W1SS+  HL0                
#         PDG         Width
DECAY        25  4.11507953E-03   # HL0   decays
#          BR          NDA       ID1       ID2       ID3       ID4
      4.79434714E-09    2           11       -11                       # HL0    -->  E-     E+                 
      2.02424984E-04    2           13       -13                       # HL0    -->  MU-    MU+                
      5.78962043E-02    2           15       -15                       # HL0    -->  TAU-   TAU+               
      6.01667261E-06    2            1        -1                       # HL0    -->  DN     DB                 
      2.43103690E-03    2            3        -3                       # HL0    -->  ST     SB                 
      7.96025693E-01    2            5        -5                       # HL0    -->  BT     BB                 
      1.92245534E-06    2            2        -2                       # HL0    -->  UP     UB                 
      3.61449383E-02    2            4        -4                       # HL0    -->  CH     CB                 
      1.87176804E-03    2           22        22                       # HL0    -->  GM     GM                 
      4.01279032E-02    2           21        21                       # HL0    -->  GL     GL                 
      3.36458161E-03    3           24        11       -12             # HL0    -->  W+     E-     ANUE        
      3.36458161E-03    3           24        13       -14             # HL0    -->  W+     MU-    ANUM        
      3.36458161E-03    3           24        15       -16             # HL0    -->  W+     TAU-   ANUT        
      1.00937448E-02    3           24        -2         1             # HL0    -->  W+     UB     DN          
      1.00937448E-02    3           24        -4         3             # HL0    -->  W+     CB     ST          
      3.36458161E-03    3          -24       -11        12             # HL0    -->  W-     E+     NUE         
      3.36458161E-03    3          -24       -13        14             # HL0    -->  W-     MU+    NUM         
      3.36458161E-03    3          -24       -15        16             # HL0    -->  W-     TAU+   NUT         
      1.00937448E-02    3          -24         2        -1             # HL0    -->  W-     UP     DB          
      1.00937448E-02    3          -24         4        -3             # HL0    -->  W-     CH     SB          
      3.23456334E-04    3           23        12       -12             # HL0    -->  Z0     NUE    ANUE        
      3.23456334E-04    3           23        14       -14             # HL0    -->  Z0     NUM    ANUM        
      3.23456334E-04    3           23        16       -16             # HL0    -->  Z0     NUT    ANUT        
      1.62792334E-04    3           23        11       -11             # HL0    -->  Z0     E-     E+          
      1.62792334E-04    3           23        13       -13             # HL0    -->  Z0     MU-    MU+         
      1.62792334E-04    3           23        15       -15             # HL0    -->  Z0     TAU-   TAU+        
      5.57712687E-04    3           23         2        -2             # HL0    -->  Z0     UP     UB          
      5.57712687E-04    3           23         4        -4             # HL0    -->  Z0     CH     CB          
      7.18471420E-04    3           23         1        -1             # HL0    -->  Z0     DN     DB          
      7.18471420E-04    3           23         3        -3             # HL0    -->  Z0     ST     SB          
      7.18471420E-04    3           23         5        -5             # HL0    -->  Z0     BT     BB          
#         PDG         Width
DECAY        35  6.17944527E+01   # HH0   decays
#          BR          NDA       ID1       ID2       ID3       ID4
      3.90976806E-10    2           11       -11                       # HH0    -->  E-     E+                 
      1.65077472E-05    2           13       -13                       # HH0    -->  MU-    MU+                
      4.72806906E-03    2           15       -15                       # HH0    -->  TAU-   TAU+               
      4.73113431E-07    2            1        -1                       # HH0    -->  DN     DB                 
      1.91161700E-04    2            3        -3                       # HH0    -->  ST     SB                 
      2.36578174E-02    2            5        -5                       # HH0    -->  BT     BB                 
      2.42547205E-10    2            2        -2                       # HH0    -->  UP     UB                 
      2.83045802E-06    2            4        -4                       # HH0    -->  CH     CB                 
      1.48557439E-01    2            6        -6                       # HH0    -->  TP     TB                 
      2.27632356E-07    2           22        22                       # HH0    -->  GM     GM                 
      1.57230752E-05    2           21        21                       # HH0    -->  GL     GL                 
      1.74112556E-05    2           24       -24                       # HH0    -->  W+     W-                 
      8.93392462E-06    2           23        23                       # HH0    -->  Z0     Z0                 
      6.20272767E-04    2      1000022   1000022                       # HH0    -->  Z1SS   Z1SS               
      4.54251887E-04    2      1000022   1000023                       # HH0    -->  Z1SS   Z2SS               
      1.83189601E-01    2      1000022   1000025                       # HH0    -->  Z1SS   Z3SS               
      6.76318631E-02    2      1000022   1000035                       # HH0    -->  Z1SS   Z4SS               
      7.13477857E-05    2      1000023   1000023                       # HH0    -->  Z2SS   Z2SS               
      5.42448796E-02    2      1000023   1000025                       # HH0    -->  Z2SS   Z3SS               
      1.26642305E-02    2      1000023   1000035                       # HH0    -->  Z2SS   Z4SS               
      1.65559923E-05    2      1000025   1000025                       # HH0    -->  Z3SS   Z3SS               
      4.10993263E-04    2      1000025   1000035                       # HH0    -->  Z3SS   Z4SS               
      4.58875584E-05    2      1000035   1000035                       # HH0    -->  Z4SS   Z4SS               
      1.23012380E-03    2      1000024  -1000024                       # HH0    -->  W1SS+  W1SS-              
      4.39819451E-06    2      1000037  -1000037                       # HH0    -->  W2SS+  W2SS-              
      2.51074165E-01    2      1000024  -1000037                       # HH0    -->  W1SS+  W2SS-              
      2.51074165E-01    2     -1000024   1000037                       # HH0    -->  W1SS-  W2SS+              
      7.06712526E-05    2           25        25                       # HH0    -->  HL0    HL0                
#         PDG         Width
DECAY        36  6.10603752E+01   # HA0   decays
#          BR          NDA       ID1       ID2       ID3       ID4
      3.93103050E-10    2           11       -11                       # HA0    -->  E-     E+                 
      1.65975198E-05    2           13       -13                       # HA0    -->  MU-    MU+                
      4.75378335E-03    2           15       -15                       # HA0    -->  TAU-   TAU+               
      4.75705235E-07    2            1        -1                       # HA0    -->  DN     DB                 
      1.92208958E-04    2            3        -3                       # HA0    -->  ST     SB                 
      2.37874500E-02    2            5        -5                       # HA0    -->  BT     BB                 
      2.43536413E-10    2            2        -2                       # HA0    -->  UP     UB                 
      2.84387079E-06    2            4        -4                       # HA0    -->  CH     CB                 
      1.49645120E-01    2            6        -6                       # HA0    -->  TP     TB                 
      9.19686798E-08    2           22        22                       # HA0    -->  GM     GM                 
      1.80515090E-05    2           21        21                       # HA0    -->  GL     GL                 
      8.31265177E-04    2      1000022   1000022                       # HA0    -->  Z1SS   Z1SS               
      7.59586284E-04    2      1000022   1000023                       # HA0    -->  Z1SS   Z2SS               
      6.78093657E-02    2      1000022   1000025                       # HA0    -->  Z1SS   Z3SS               
      1.82225242E-01    2      1000022   1000035                       # HA0    -->  Z1SS   Z4SS               
      1.64104393E-04    2      1000023   1000023                       # HA0    -->  Z2SS   Z2SS               
      1.25766788E-02    2      1000023   1000025                       # HA0    -->  Z2SS   Z3SS               
      5.37884533E-02    2      1000023   1000035                       # HA0    -->  Z2SS   Z4SS               
      3.54158219E-05    2      1000025   1000025                       # HA0    -->  Z3SS   Z3SS               
      5.46484298E-05    2      1000025   1000035                       # HA0    -->  Z3SS   Z4SS               
      5.01074654E-04    2      1000035   1000035                       # HA0    -->  Z4SS   Z4SS               
      1.72177155E-03    2      1000024  -1000024                       # HA0    -->  W1SS+  W1SS-              
      2.21481358E-04    2      1000037  -1000037                       # HA0    -->  W2SS+  W2SS-              
      2.50438392E-01    2      1000024  -1000037                       # HA0    -->  W1SS+  W2SS-              
      2.50438392E-01    2     -1000024   1000037                       # HA0    -->  W1SS-  W2SS+              
      1.74893739E-05    2           25        23                       # HA0    -->  HL0    Z0                 
#         PDG         Width
DECAY        37  6.10510750E+01   # H+    decays
#          BR          NDA       ID1       ID2       ID3       ID4
      3.95788263E-10    2           12       -11                       # H+     -->  NUE    E+                 
      1.67108938E-05    2           14       -13                       # H+     -->  NUM    MU+                
      4.78625577E-03    2           16       -15                       # H+     -->  NUT    TAU+               
      4.45897513E-07    2            2        -1                       # H+     -->  UP     DB                 
      1.82735486E-04    2            4        -3                       # H+     -->  CH     SB                 
      1.62207454E-01    2            6        -5                       # H+     -->  TP     BB                 
      1.36791158E-07    2      1000024   1000022                       # H+     -->  W1SS+  Z1SS               
      1.23845704E-03    2      1000024   1000023                       # H+     -->  W1SS+  Z2SS               
      2.54603267E-01    2      1000024   1000025                       # H+     -->  W1SS+  Z3SS               
      2.53994733E-01    2      1000024   1000035                       # H+     -->  W1SS+  Z4SS               
      2.54670382E-01    2      1000037   1000022                       # H+     -->  W2SS+  Z1SS               
      6.80329427E-02    2      1000037   1000023                       # H+     -->  W2SS+  Z2SS               
      1.41690558E-04    2      1000037   1000025                       # H+     -->  W2SS+  Z3SS               
      1.07132713E-04    2      1000037   1000035                       # H+     -->  W2SS+  Z4SS               
      1.76157919E-05    2           25        24                       # H+     -->  HL0    W+                 
