#
#                              ======================
#                              | THE SUSYHIT OUTPUT |
#                              ======================
#
#
#              ------------------------------------------------------
#              |     This is the output of the SUSY-HIT package     |
#              |  created by A.Djouadi, M.Muehlleitner and M.Spira. |
#              |  In case of problems with SUSY-HIT email to        |
#              |           margarete.muehlleitner@cern.ch           |
#              |           michael.spira@psi.ch                     |
#              |           abdelhak.djouadi@cern.ch                 |
#              ------------------------------------------------------
#
#              ------------------------------------------------------
#              |  SUSY Les Houches Accord - MSSM Spectrum + Decays  |
#              |              based on the decay programs           |
#              |                                                    |
#              |                     SDECAY 1.3b                    |
#              |                                                    |
#              |  Authors: M.Muhlleitner, A.Djouadi and Y.Mambrini  |
#              |  Ref.:    Comput.Phys.Commun.168(2005)46           |
#              |           [hep-ph/0311167]                         |
#              |                                                    |
#              |                     HDECAY 3.4                     |
#              |                                                    |
#              |  By: A.Djouadi,J.Kalinowski,M.Muhlleitner,M.Spira  |
#              |  Ref.:    Comput.Phys.Commun.108(1998)56           |
#              |           [hep-ph/9704448]                         |
#              |                                                    |
#              |                                                    |
#              |  If not stated otherwise all DRbar couplings and   |
#              |  soft SUSY breaking masses are given at the scale  |
#              |  Q=  0.50007027E+04
#              |                                                    |
#              ------------------------------------------------------
#
#
BLOCK DCINFO  # Decay Program information
     1   SDECAY/HDECAY # decay calculator
     2   1.3b  /3.4    # version number
#
BLOCK SPINFO  # Spectrum calculator information
     1    SOFTSUSY    # spectrum calculator                
     2    3.4.0       # version number                     
#
BLOCK MODSEL  # Model selection
     1     0   #  nonUniversal                                     
#
BLOCK SMINPUTS  # Standard Model inputs
         1     1.25778332E+02   # alpha_em^-1(M_Z)^MSbar
         2     1.16570000E-05   # G_F [GeV^-2]
         3     1.17200002E-01   # alpha_S(M_Z)^MSbar
         4     9.11876000E+01   # M_Z pole mass
         5     4.25000000E+00   # mb(mb)^MSbar
         6     1.72500000E+02   # mt pole mass
         7     1.77682000E+00   # mtau pole mass
#
BLOCK MINPAR  # Input parameters - minimal models
         3     1.00000000E+01   # tanb                
#
BLOCK EXTPAR  # Input parameters - non-minimal models
         0    -1.00000000E+00   # Set                 
         1     6.00000000E+01   # M_1(MX)             
         2     3.00000000E+03   # M_2(MX)             
         3     7.73146000E+02   # M_3(MX)             
        11     5.00000000E+03   # At(MX)              
        12     5.00000000E+03   # Ab(MX)              
        13     0.00000000E+00   # Atau(MX)            
        23    -1.54523600E+03   # mu(MX)              
        26     3.00000000E+03   # mA(pole)            
        31     5.00000000E+03   # meL(MX)             
        32     5.00000000E+03   # mmuL(MX)            
        33     5.00000000E+03   # mtauL(MX)           
        34     5.00000000E+03   # meR(MX)             
        35     5.00000000E+03   # mmuR(MX)            
        36     5.00000000E+03   # mtauR(MX)           
        41     5.00000000E+03   # mqL1(MX)            
        42     5.00000000E+03   # mqL2(MX)            
        43     5.00000000E+03   # mqL3(MX)            
        44     5.00000000E+03   # muR(MX)             
        45     5.00000000E+03   # mcR(MX)             
        46     5.00000000E+03   # mtR(MX)             
        47     5.00000000E+03   # mdR(MX)             
        48     5.00000000E+03   # msR(MX)             
        49     5.00000000E+03   # mbR(MX)             
#
BLOCK MASS  # Mass Spectrum
# PDG code           mass       particle
        24     8.00938576E+01   # W+
        25     1.24313749E+02   # h
        35     3.00008224E+03   # H
        36     2.99999996E+03   # A
        37     3.00087532E+03   # H+
         5     4.87878001E+00   # b-quark pole mass calculated from mb(mb)_Msbar
   1000001     5.06375831E+03   # ~d_L
   2000001     5.04595244E+03   # ~d_R
   1000002     5.06328129E+03   # ~u_L
   2000002     5.04567840E+03   # ~u_R
   1000003     5.06375831E+03   # ~s_L
   2000003     5.04595244E+03   # ~s_R
   1000004     5.06328129E+03   # ~c_L
   2000004     5.04567840E+03   # ~c_R
   1000005     5.01051394E+03   # ~b_1
   2000005     5.04496333E+03   # ~b_2
   1000006     4.90148297E+03   # ~t_1
   2000006     5.05782876E+03   # ~t_2
   1000011     5.01904861E+03   # ~e_L
   2000011     5.00590851E+03   # ~e_R
   1000012     5.01810000E+03   # ~nu_eL
   1000013     5.01904861E+03   # ~mu_L
   2000013     5.00590851E+03   # ~mu_R
   1000014     5.01810000E+03   # ~nu_muL
   1000015     5.00431286E+03   # ~tau_1
   2000015     5.01906546E+03   # ~tau_2
   1000016     5.01756277E+03   # ~nu_tauL
   1000021     1.00000093E+03   # ~g
   1000022     6.03021802E+01   # ~chi_10
   1000023     1.59942660E+03   # ~chi_20
   1000025    -1.60195178E+03   # ~chi_30
   1000035     3.07434694E+03   # ~chi_40
   1000024     1.60000005E+03   # ~chi_1+
   1000037     3.07451454E+03   # ~chi_2+
#
BLOCK NMIX  # Neutralino Mixing Matrix
  1  1     9.99609463E-01   # N_11
  1  2     1.33176257E-04   # N_12
  1  3    -2.78819796E-02   # N_13
  1  4     1.87044092E-03   # N_14
  2  1     1.83911274E-02   # N_21
  2  2     3.29976460E-02   # N_22
  2  3     7.06888841E-01   # N_23
  2  4     7.06315147E-01   # N_24
  3  1    -2.10349518E-02   # N_31
  3  2     1.29807800E-02   # N_32
  3  3    -7.06633077E-01   # N_33
  3  4     7.07148304E-01   # N_34
  4  1    -4.67231909E-04   # N_41
  4  2     9.99371121E-01   # N_42
  4  3    -1.41582098E-02   # N_43
  4  4    -3.25067657E-02   # N_44
#
BLOCK UMIX  # Chargino Mixing Matrix U
  1  1     2.00266694E-02   # U_11
  1  2     9.99799446E-01   # U_12
  2  1    -9.99799446E-01   # U_21
  2  2     2.00266694E-02   # U_22
#
BLOCK VMIX  # Chargino Mixing Matrix V
  1  1     4.59833562E-02   # V_11
  1  2    -9.98942206E-01   # V_12
  2  1    -9.98942206E-01   # V_21
  2  2    -4.59833562E-02   # V_22
#
BLOCK STOPMIX  # Stop Mixing Matrix
  1  1    -5.15267392E-01   # cos(theta_t)
  1  2     8.57029471E-01   # sin(theta_t)
  2  1    -8.57029471E-01   # -sin(theta_t)
  2  2    -5.15267392E-01   # cos(theta_t)
#
BLOCK SBOTMIX  # Sbottom Mixing Matrix
  1  1     9.93752223E-01   # cos(theta_b)
  1  2    -1.11608778E-01   # sin(theta_b)
  2  1     1.11608778E-01   # -sin(theta_b)
  2  2     9.93752223E-01   # cos(theta_b)
#
BLOCK STAUMIX  # Stau Mixing Matrix
  1  1    -1.78647546E-01   # cos(theta_tau)
  1  2     9.83913134E-01   # sin(theta_tau)
  2  1    -9.83913134E-01   # -sin(theta_tau)
  2  2    -1.78647546E-01   # cos(theta_tau)
#
BLOCK ALPHA  # Higgs mixing
          -1.05412456E-01   # Mixing angle in the neutral Higgs boson sector
#
BLOCK HMIX Q=  5.00070270E+03  # DRbar Higgs Parameters
         1    -1.57273366E+03   # mu(Q)MSSM           
         2     9.47482852E+00   # tan                 
         3     2.42048752E+02   # higgs               
         4     8.37385744E+06   # mA^2(Q)MSSM         
#
BLOCK GAUGE Q=  5.00070270E+03  # The gauge couplings
     1     3.70706613E-01   # gprime(Q) DRbar
     2     6.32065888E-01   # g(Q) DRbar
     3     1.00863688E+00   # g3(Q) DRbar
#
BLOCK AU Q=  5.00070270E+03  # The trilinear couplings
  1  1     5.00000001E+03   # A_u(Q) DRbar
  2  2     5.00000001E+03   # A_c(Q) DRbar
  3  3     5.00000001E+03   # A_t(Q) DRbar
#
BLOCK AD Q=  5.00070270E+03  # The trilinear couplings
  1  1     5.00000000E+03   # A_d(Q) DRbar
  2  2     5.00000000E+03   # A_s(Q) DRbar
  3  3     5.00000001E+03   # A_b(Q) DRbar
#
BLOCK AE Q=  5.00070270E+03  # The trilinear couplings
  1  1     0.00000000E+00   # A_e(Q) DRbar
  2  2     1.71400570E-08   # A_mu(Q) DRbar
  3  3     1.61678302E-08   # A_tau(Q) DRbar
#
BLOCK Yu Q=  5.00070270E+03  # The Yukawa couplings
  1  1     0.00000000E+00   # y_u(Q) DRbar
  2  2     0.00000000E+00   # y_c(Q) DRbar
  3  3     8.13778525E-01   # y_t(Q) DRbar
#
BLOCK Yd Q=  5.00070270E+03  # The Yukawa couplings
  1  1     0.00000000E+00   # y_d(Q) DRbar
  2  2     0.00000000E+00   # y_s(Q) DRbar
  3  3     1.29786624E-01   # y_b(Q) DRbar
#
BLOCK Ye Q=  5.00070270E+03  # The Yukawa couplings
  1  1     0.00000000E+00   # y_e(Q) DRbar
  2  2     0.00000000E+00   # y_mu(Q) DRbar
  3  3     9.66077218E-02   # y_tau(Q) DRbar
#
BLOCK MSOFT Q=  5.00070270E+03  # The soft SUSY breaking masses at the scale Q
         1     6.00000000E+01   # M_1(Q)              
         2     3.00000000E+03   # M_2(Q)              
         3     7.73146000E+02   # M_3(Q)              
        21     6.19048924E+06   # mH1^2(Q)            
        22    -1.93363951E+06   # mH2^2(Q)            
        31     5.00000000E+03   # meL(Q)              
        32     5.00000000E+03   # mmuL(Q)             
        33     5.00000000E+03   # mtauL(Q)            
        34     5.00000000E+03   # meR(Q)              
        35     5.00000000E+03   # mmuR(Q)             
        36     5.00000000E+03   # mtauR(Q)            
        41     5.00000000E+03   # mqL1(Q)             
        42     5.00000000E+03   # mqL2(Q)             
        43     5.00000000E+03   # mqL3(Q)             
        44     5.00000000E+03   # muR(Q)              
        45     5.00000000E+03   # mcR(Q)              
        46     5.00000000E+03   # mtR(Q)              
        47     5.00000000E+03   # mdR(Q)              
        48     5.00000000E+03   # msR(Q)              
        49     5.00000000E+03   # mbR(Q)              
#
#
#
#                             =================
#                             |The decay table|
#                             =================
#
# - The QCD corrections to the decays gluino -> squark  + quark
#                                     squark -> gaugino + quark_prime
#                                     squark -> squark_prime + Higgs
#                                     squark -> gluino  + quark
#   are included.
#
# - The multi-body decays for the inos, stops and sbottoms are included.
#
# - The loop induced decays for the gluino, neutralinos and stops
#   are included.
#
# - The SUSY decays of the top quark are included.
#
#
#         PDG            Width
DECAY         6     1.40005894E+00   # top decays
#          BR         NDA      ID1       ID2
     1.00000000E+00    2           5        24   # BR(t ->  b    W+)
#
#         PDG            Width
DECAY   1000021     8.40760534E-06   # gluino decays
#          BR         NDA      ID1       ID2
     2.07948199E-05    2     1000022        21   # BR(~g -> ~chi_10 g)
#           BR         NDA      ID1       ID2       ID3
     8.31242218E-02    3     1000022         1        -1   # BR(~g -> ~chi_10 d  db)
     2.83354832E-01    3     1000022         2        -2   # BR(~g -> ~chi_10 u  ub)
     8.31242218E-02    3     1000022         3        -3   # BR(~g -> ~chi_10 s  sb)
     2.83354832E-01    3     1000022         4        -4   # BR(~g -> ~chi_10 c  cb)
     8.41107181E-02    3     1000022         5        -5   # BR(~g -> ~chi_10 b  bb)
     1.82910380E-01    3     1000022         6        -6   # BR(~g -> ~chi_10 t  tb)
#
#         PDG            Width
DECAY   1000006     4.01777133E+02   # stop1 decays
#          BR         NDA      ID1       ID2
     2.17446409E-02    2     1000022         6   # BR(~t_1 -> ~chi_10 t )
     6.49487166E-02    2     1000023         6   # BR(~t_1 -> ~chi_20 t )
     6.23577531E-02    2     1000025         6   # BR(~t_1 -> ~chi_30 t )
     5.53735390E-03    2     1000035         6   # BR(~t_1 -> ~chi_40 t )
     9.24572049E-02    2     1000024         5   # BR(~t_1 -> ~chi_1+ b )
     1.10086458E-02    2     1000037         5   # BR(~t_1 -> ~chi_2+ b )
     7.41945685E-01    2     1000021         6   # BR(~t_1 -> ~g      t )
#
#         PDG            Width
DECAY   2000006     4.07322839E+02   # stop2 decays
#          BR         NDA      ID1       ID2
     8.93797011E-03    2     1000022         6   # BR(~t_2 -> ~chi_10 t )
     6.65000634E-02    2     1000023         6   # BR(~t_2 -> ~chi_20 t )
     6.92663322E-02    2     1000025         6   # BR(~t_2 -> ~chi_30 t )
     1.31571759E-02    2     1000035         6   # BR(~t_2 -> ~chi_40 t )
     4.18303062E-02    2     1000024         5   # BR(~t_2 -> ~chi_1+ b )
     2.61108931E-02    2     1000037         5   # BR(~t_2 -> ~chi_2+ b )
     7.70921190E-01    2     1000021         6   # BR(~t_2 -> ~g      t )
     7.07391862E-04    2     1000006        25   # BR(~t_2 -> ~t_1    h )
     2.56867693E-03    2     1000006        23   # BR(~t_2 -> ~t_1    Z )
#
#         PDG            Width
DECAY   1000005     3.86671649E+02   # sbottom1 decays
#          BR         NDA      ID1       ID2
     2.03472523E-03    2     1000022         5   # BR(~b_1 -> ~chi_10 b )
     1.84564693E-03    2     1000023         5   # BR(~b_1 -> ~chi_20 b )
     1.73159554E-03    2     1000025         5   # BR(~b_1 -> ~chi_30 b )
     1.91975617E-02    2     1000035         5   # BR(~b_1 -> ~chi_40 b )
     1.36977514E-01    2    -1000024         6   # BR(~b_1 -> ~chi_1- t )
     3.86648795E-02    2    -1000037         6   # BR(~b_1 -> ~chi_2- t )
     7.98101429E-01    2     1000021         5   # BR(~b_1 -> ~g      b )
     1.44664810E-03    2     1000006       -24   # BR(~b_1 -> ~t_1    W-)
#
#         PDG            Width
DECAY   2000005     3.17512683E+02   # sbottom2 decays
#          BR         NDA      ID1       ID2
     9.22375361E-03    2     1000022         5   # BR(~b_2 -> ~chi_10 b )
     2.12868552E-03    2     1000023         5   # BR(~b_2 -> ~chi_20 b )
     2.23502721E-03    2     1000025         5   # BR(~b_2 -> ~chi_30 b )
     3.19081472E-04    2     1000035         5   # BR(~b_2 -> ~chi_40 b )
     6.41240633E-03    2    -1000024         6   # BR(~b_2 -> ~chi_1- t )
     6.42294062E-04    2    -1000037         6   # BR(~b_2 -> ~chi_2- t )
     9.78947072E-01    2     1000021         5   # BR(~b_2 -> ~g      b )
     9.16798198E-05    2     1000006       -24   # BR(~b_2 -> ~t_1    W-)
#
#         PDG            Width
DECAY   1000002     3.36236939E+02   # sup_L decays
#          BR         NDA      ID1       ID2
     2.22333206E-03    2     1000022         2   # BR(~u_L -> ~chi_10 u)
     6.30887678E-05    2     1000023         2   # BR(~u_L -> ~chi_20 u)
     3.70291290E-06    2     1000025         2   # BR(~u_L -> ~chi_30 u)
     2.31643454E-02    2     1000035         2   # BR(~u_L -> ~chi_40 u)
     1.99211993E-04    2     1000024         1   # BR(~u_L -> ~chi_1+ d)
     4.62915297E-02    2     1000037         1   # BR(~u_L -> ~chi_2+ d)
     9.28054789E-01    2     1000021         2   # BR(~u_L -> ~g      u)
#
#         PDG            Width
DECAY   2000002     3.22695680E+02   # sup_R decays
#          BR         NDA      ID1       ID2
     3.68865375E-02    2     1000022         2   # BR(~u_R -> ~chi_10 u)
     1.01029415E-05    2     1000023         2   # BR(~u_R -> ~chi_20 u)
     1.32070785E-05    2     1000025         2   # BR(~u_R -> ~chi_30 u)
     3.18956967E-09    2     1000035         2   # BR(~u_R -> ~chi_40 u)
     9.63090149E-01    2     1000021         2   # BR(~u_R -> ~g      u)
#
#         PDG            Width
DECAY   1000001     3.36247628E+02   # sdown_L decays
#          BR         NDA      ID1       ID2
     2.21741875E-03    2     1000022         1   # BR(~d_L -> ~chi_10 d)
     4.07340670E-05    2     1000023         1   # BR(~d_L -> ~chi_20 d)
     1.37573886E-05    2     1000025         1   # BR(~d_L -> ~chi_30 d)
     2.31793325E-02    2     1000035         1   # BR(~d_L -> ~chi_40 d)
     3.77900029E-05    2    -1000024         2   # BR(~d_L -> ~chi_1- u)
     4.63840555E-02    2    -1000037         2   # BR(~d_L -> ~chi_2- u)
     9.28126912E-01    2     1000021         1   # BR(~d_L -> ~g      d)
#
#         PDG            Width
DECAY   2000001     3.13782495E+02   # sdown_R decays
#          BR         NDA      ID1       ID2
     9.48409718E-03    2     1000022         1   # BR(~d_R -> ~chi_10 d)
     2.59768477E-06    2     1000023         1   # BR(~d_R -> ~chi_20 d)
     3.39582582E-06    2     1000025         1   # BR(~d_R -> ~chi_30 d)
     8.20191957E-10    2     1000035         1   # BR(~d_R -> ~chi_40 d)
     9.90509908E-01    2     1000021         1   # BR(~d_R -> ~g      d)
#
#         PDG            Width
DECAY   1000004     3.36236939E+02   # scharm_L decays
#          BR         NDA      ID1       ID2
     2.22333206E-03    2     1000022         4   # BR(~c_L -> ~chi_10 c)
     6.30887678E-05    2     1000023         4   # BR(~c_L -> ~chi_20 c)
     3.70291290E-06    2     1000025         4   # BR(~c_L -> ~chi_30 c)
     2.31643454E-02    2     1000035         4   # BR(~c_L -> ~chi_40 c)
     1.99211993E-04    2     1000024         3   # BR(~c_L -> ~chi_1+ s)
     4.62915297E-02    2     1000037         3   # BR(~c_L -> ~chi_2+ s)
     9.28054789E-01    2     1000021         4   # BR(~c_L -> ~g      c)
#
#         PDG            Width
DECAY   2000004     3.22695680E+02   # scharm_R decays
#          BR         NDA      ID1       ID2
     3.68865375E-02    2     1000022         4   # BR(~c_R -> ~chi_10 c)
     1.01029415E-05    2     1000023         4   # BR(~c_R -> ~chi_20 c)
     1.32070785E-05    2     1000025         4   # BR(~c_R -> ~chi_30 c)
     3.18956967E-09    2     1000035         4   # BR(~c_R -> ~chi_40 c)
     9.63090149E-01    2     1000021         4   # BR(~c_R -> ~g      c)
#
#         PDG            Width
DECAY   1000003     3.36247628E+02   # sstrange_L decays
#          BR         NDA      ID1       ID2
     2.21741875E-03    2     1000022         3   # BR(~s_L -> ~chi_10 s)
     4.07340670E-05    2     1000023         3   # BR(~s_L -> ~chi_20 s)
     1.37573886E-05    2     1000025         3   # BR(~s_L -> ~chi_30 s)
     2.31793325E-02    2     1000035         3   # BR(~s_L -> ~chi_40 s)
     3.77900029E-05    2    -1000024         4   # BR(~s_L -> ~chi_1- c)
     4.63840555E-02    2    -1000037         4   # BR(~s_L -> ~chi_2- c)
     9.28126912E-01    2     1000021         3   # BR(~s_L -> ~g      s)
#
#         PDG            Width
DECAY   2000003     3.13782495E+02   # sstrange_R decays
#          BR         NDA      ID1       ID2
     9.48409718E-03    2     1000022         3   # BR(~s_R -> ~chi_10 s)
     2.59768477E-06    2     1000023         3   # BR(~s_R -> ~chi_20 s)
     3.39582582E-06    2     1000025         3   # BR(~s_R -> ~chi_30 s)
     8.20191957E-10    2     1000035         3   # BR(~s_R -> ~chi_40 s)
     9.90509908E-01    2     1000021         3   # BR(~s_R -> ~g      s)
#
#         PDG            Width
DECAY   1000011     3.02368806E+01   # selectron_L decays
#          BR         NDA      ID1       ID2
     2.26765950E-01    2     1000022        11   # BR(~e_L -> ~chi_10 e-)
     1.02076896E-03    2     1000023        11   # BR(~e_L -> ~chi_20 e-)
     2.20527534E-07    2     1000025        11   # BR(~e_L -> ~chi_30 e-)
     2.57043460E-01    2     1000035        11   # BR(~e_L -> ~chi_40 e-)
     4.27044175E-04    2    -1000024        12   # BR(~e_L -> ~chi_1- nu_e)
     5.14742557E-01    2    -1000037        12   # BR(~e_L -> ~chi_2- nu_e)
#
#         PDG            Width
DECAY   2000011     2.73597344E+01   # selectron_R decays
#          BR         NDA      ID1       ID2
     9.99370451E-01    2     1000022        11   # BR(~e_R -> ~chi_10 e-)
     2.72821628E-04    2     1000023        11   # BR(~e_R -> ~chi_20 e-)
     3.56642433E-04    2     1000025        11   # BR(~e_R -> ~chi_30 e-)
     8.47212762E-08    2     1000035        11   # BR(~e_R -> ~chi_40 e-)
#
#         PDG            Width
DECAY   1000013     3.02368806E+01   # smuon_L decays
#          BR         NDA      ID1       ID2
     2.26765950E-01    2     1000022        13   # BR(~mu_L -> ~chi_10 mu-)
     1.02076896E-03    2     1000023        13   # BR(~mu_L -> ~chi_20 mu-)
     2.20527534E-07    2     1000025        13   # BR(~mu_L -> ~chi_30 mu-)
     2.57043460E-01    2     1000035        13   # BR(~mu_L -> ~chi_40 mu-)
     4.27044175E-04    2    -1000024        14   # BR(~mu_L -> ~chi_1- nu_mu)
     5.14742557E-01    2    -1000037        14   # BR(~mu_L -> ~chi_2- nu_mu)
#
#         PDG            Width
DECAY   2000013     2.73597344E+01   # smuon_R decays
#          BR         NDA      ID1       ID2
     9.99370451E-01    2     1000022        13   # BR(~mu_R -> ~chi_10 mu-)
     2.72821628E-04    2     1000023        13   # BR(~mu_R -> ~chi_20 mu-)
     3.56642433E-04    2     1000025        13   # BR(~mu_R -> ~chi_30 mu-)
     8.47212762E-08    2     1000035        13   # BR(~mu_R -> ~chi_40 mu-)
#
#         PDG            Width
DECAY   1000015     2.89403327E+01   # stau_1 decays
#          BR         NDA      ID1       ID2
     9.22760211E-01    2     1000022        15   # BR(~tau_1 -> ~chi_10  tau-)
     1.38777943E-02    2     1000023        15   # BR(~tau_1 -> ~chi_20  tau-)
     1.24880909E-02    2     1000025        15   # BR(~tau_1 -> ~chi_30  tau-)
     8.20156341E-03    2     1000035        15   # BR(~tau_1 -> ~chi_40  tau-)
     2.62480170E-02    2    -1000024        16   # BR(~tau_1 -> ~chi_1-  nu_tau)
     1.64243229E-02    2    -1000037        16   # BR(~tau_1 -> ~chi_2-  nu_tau)
#
#         PDG            Width
DECAY   2000015     3.08921228E+01   # stau_2 decays
#          BR         NDA      ID1       ID2
     2.42418291E-01    2     1000022        15   # BR(~tau_2 -> ~chi_10  tau-)
     1.25217729E-02    2     1000023        15   # BR(~tau_2 -> ~chi_20  tau-)
     1.28699625E-02    2     1000025        15   # BR(~tau_2 -> ~chi_30  tau-)
     2.43836865E-01    2     1000035        15   # BR(~tau_2 -> ~chi_40  tau-)
     6.01223561E-05    2    -1000024        16   # BR(~tau_2 -> ~chi_1-  nu_tau)
     4.88292986E-01    2    -1000037        16   # BR(~tau_2 -> ~chi_2-  nu_tau)
#
#         PDG            Width
DECAY   1000012     3.02387379E+01   # snu_eL decays
#          BR         NDA      ID1       ID2
     2.26503238E-01    2     1000022        12   # BR(~nu_eL -> ~chi_10 nu_e)
     2.62600713E-04    2     1000023        12   # BR(~nu_eL -> ~chi_20 nu_e)
     3.40949945E-04    2     1000025        12   # BR(~nu_eL -> ~chi_30 nu_e)
     2.57144292E-01    2     1000035        12   # BR(~nu_eL -> ~chi_40 nu_e)
     2.25066449E-03    2     1000024        11   # BR(~nu_eL -> ~chi_1+ e-)
     5.13498255E-01    2     1000037        11   # BR(~nu_eL -> ~chi_2+ e-)
#
#         PDG            Width
DECAY   1000014     3.02387379E+01   # snu_muL decays
#          BR         NDA      ID1       ID2
     2.26503238E-01    2     1000022        14   # BR(~nu_muL -> ~chi_10 nu_mu)
     2.62600713E-04    2     1000023        14   # BR(~nu_muL -> ~chi_20 nu_mu)
     3.40949945E-04    2     1000025        14   # BR(~nu_muL -> ~chi_30 nu_mu)
     2.57144292E-01    2     1000035        14   # BR(~nu_muL -> ~chi_40 nu_mu)
     2.25066449E-03    2     1000024        13   # BR(~nu_muL -> ~chi_1+ mu-)
     5.13498255E-01    2     1000037        13   # BR(~nu_muL -> ~chi_2+ mu-)
#
#         PDG            Width
DECAY   1000016     3.09811845E+01   # snu_tauL decays
#          BR         NDA      ID1       ID2
     2.21051535E-01    2     1000022        16   # BR(~nu_tauL -> ~chi_10 nu_tau)
     2.56267784E-04    2     1000023        16   # BR(~nu_tauL -> ~chi_20 nu_tau)
     3.32727474E-04    2     1000025        16   # BR(~nu_tauL -> ~chi_30 nu_tau)
     2.50890524E-01    2     1000035        16   # BR(~nu_tauL -> ~chi_40 nu_tau)
     2.64567804E-02    2     1000024        15   # BR(~nu_tauL -> ~chi_1+ tau-)
     5.01012166E-01    2     1000037        15   # BR(~nu_tauL -> ~chi_2+ tau-)
#
#         PDG            Width
DECAY   1000024     9.85938880E-01   # chargino1+ decays
#          BR         NDA      ID1       ID2
     1.00000000E+00    2     1000022        24   # BR(~chi_1+ -> ~chi_10  W+)
#
#         PDG            Width
DECAY   1000037     1.79168829E+01   # chargino2+ decays
#          BR         NDA      ID1       ID2
     2.52600692E-01    2     1000024        23   # BR(~chi_2+ -> ~chi_1+  Z )
     2.85021332E-04    2     1000022        24   # BR(~chi_2+ -> ~chi_10  W+)
     2.44155439E-01    2     1000023        24   # BR(~chi_2+ -> ~chi_20  W+)
     2.43591417E-01    2     1000025        24   # BR(~chi_2+ -> ~chi_30  W+)
     2.59367154E-01    2     1000024        25   # BR(~chi_2+ -> ~chi_1+  h )
     2.76957550E-07    2     1000022        37   # BR(~chi_2+ -> ~chi_10  H+)
#
#         PDG            Width
DECAY   1000022     0.00000000E+00   # neutralino1 decays
#
#         PDG            Width
DECAY   1000023     1.03651049E+00   # neutralino2 decays
#          BR         NDA      ID1       ID2
     5.58715268E-01    2     1000022        23   # BR(~chi_20 -> ~chi_10   Z )
     4.41284732E-01    2     1000022        25   # BR(~chi_20 -> ~chi_10   h )
#
#         PDG            Width
DECAY   1000025     1.04728184E+00   # neutralino3 decays
#          BR         NDA      ID1       ID2
     4.23737584E-01    2     1000022        23   # BR(~chi_30 -> ~chi_10   Z )
     5.76262416E-01    2     1000022        25   # BR(~chi_30 -> ~chi_10   h )
#
#         PDG            Width
DECAY   1000035     1.79112129E+01   # neutralino4 decays
#          BR         NDA      ID1       ID2
     1.08015458E-04    2     1000022        23   # BR(~chi_40 -> ~chi_10   Z )
     3.40820693E-02    2     1000023        23   # BR(~chi_40 -> ~chi_20   Z )
     2.18106333E-01    2     1000025        23   # BR(~chi_40 -> ~chi_30   Z )
     2.44246999E-01    2     1000024       -24   # BR(~chi_40 -> ~chi_1+   W-)
     2.44246999E-01    2    -1000024        24   # BR(~chi_40 -> ~chi_1-   W+)
     1.84728409E-04    2     1000022        25   # BR(~chi_40 -> ~chi_10   h )
     2.47301797E-07    2     1000022        35   # BR(~chi_40 -> ~chi_10   H )
     3.99672800E-08    2     1000022        36   # BR(~chi_40 -> ~chi_10   A )
     2.25040594E-01    2     1000023        25   # BR(~chi_40 -> ~chi_20   h )
     3.39839746E-02    2     1000025        25   # BR(~chi_40 -> ~chi_30   h )
#
#         PDG            Width
DECAY        25     4.00706721E-03   # h decays
#          BR         NDA      ID1       ID2
     6.16236932E-01    2           5        -5   # BR(h -> b       bb     )
     6.44818014E-02    2         -15        15   # BR(h -> tau+    tau-   )
     2.28291074E-04    2         -13        13   # BR(h -> mu+     mu-    )
     4.84312589E-04    2           3        -3   # BR(h -> s       sb     )
     2.09887296E-02    2           4        -4   # BR(h -> c       cb     )
     6.73596761E-02    2          21        21   # BR(h -> g       g      )
     2.30564095E-03    2          22        22   # BR(h -> gam     gam    )
     1.44791272E-03    2          22        23   # BR(h -> Z       gam    )
     2.02501102E-01    2          24       -24   # BR(h -> W+      W-     )
     2.39403033E-02    2          23        23   # BR(h -> Z       Z      )
     2.52985020E-05    2     1000022   1000022   # BR(h -> ~chi_10 ~chi_10)
#
#         PDG            Width
DECAY        35     7.07508314E+00   # H decays
#          BR         NDA      ID1       ID2
     4.60918571E-01    2           5        -5   # BR(H -> b       bb     )
     7.88258116E-02    2         -15        15   # BR(H -> tau+    tau-   )
     2.78734331E-04    2         -13        13   # BR(H -> mu+     mu-    )
     3.41685671E-04    2           3        -3   # BR(H -> s       sb     )
     1.90702831E-06    2           4        -4   # BR(H -> c       cb     )
     1.90527233E-01    2           6        -6   # BR(H -> t       tb     )
     6.32036148E-05    2          21        21   # BR(H -> g       g      )
     3.82656920E-07    2          22        22   # BR(H -> gam     gam    )
     1.12401304E-07    2          23        22   # BR(H -> Z       gam    )
     8.35685914E-05    2          24       -24   # BR(H -> W+      W-     )
     4.17314014E-05    2          23        23   # BR(H -> Z       Z      )
     3.20852447E-04    2          25        25   # BR(H -> h       h      )
     1.99528854E-23    2          36        36   # BR(H -> A       A      )
     1.24139042E-18    2          23        36   # BR(H -> Z       A      )
     7.98181755E-04    2     1000022   1000022   # BR(H -> ~chi_10 ~chi_10)
     1.58713496E-01    2     1000022   1000023   # BR(H -> ~chi_10 ~chi_20)
     1.09084529E-01    2     1000022   1000025   # BR(H -> ~chi_10 ~chi_30)
#
#         PDG            Width
DECAY        36     7.07788598E+00   # A decays
#          BR         NDA      ID1       ID2
     4.60890805E-01    2           5        -5   # BR(A -> b       bb     )
     7.87968582E-02    2         -15        15   # BR(A -> tau+    tau-   )
     2.78631560E-04    2         -13        13   # BR(A -> mu+     mu-    )
     3.41809041E-04    2           3        -3   # BR(A -> s       sb     )
     1.91431257E-06    2           4        -4   # BR(A -> c       cb     )
     1.91149463E-01    2           6        -6   # BR(A -> t       tb     )
     1.89242951E-04    2          21        21   # BR(A -> g       g      )
     3.23576603E-07    2          22        22   # BR(A -> gam     gam    )
     2.29087346E-07    2          23        22   # BR(A -> Z       gam    )
     8.32229171E-05    2          23        25   # BR(A -> Z       h      )
     8.22165546E-04    2     1000022   1000022   # BR(A -> ~chi_10 ~chi_10)
     1.10333642E-01    2     1000022   1000023   # BR(A -> ~chi_10 ~chi_20)
     1.57111692E-01    2     1000022   1000025   # BR(A -> ~chi_10 ~chi_30)
#
#         PDG            Width
DECAY        37     7.05302527E+00   # H+ decays
#          BR         NDA      ID1       ID2
     7.38429844E-04    2           4        -5   # BR(H+ -> c       bb     )
     7.90976767E-02    2         -15        16   # BR(H+ -> tau+    nu_tau )
     2.79695276E-04    2         -13        14   # BR(H+ -> mu+     nu_mu  )
     4.72592668E-06    2           2        -5   # BR(H+ -> u       bb     )
     1.64119347E-05    2           2        -3   # BR(H+ -> u       sb     )
     3.39395936E-04    2           4        -3   # BR(H+ -> c       sb     )
     6.49328674E-01    2           6        -5   # BR(H+ -> t       bb     )
     8.36430279E-05    2          24        25   # BR(H+ -> W+      h      )
     9.57723563E-14    2          24        36   # BR(H+ -> W+      A      )
     2.70111347E-01    2     1000024   1000022   # BR(H+ -> ~chi_1+ ~chi_10)
