#
#                              ======================
#                              | THE SUSYHIT OUTPUT |
#                              ======================
#
#
#              ------------------------------------------------------
#              |     This is the output of the SUSY-HIT package     |
#              |  created by A.Djouadi, M.Muehlleitner and M.Spira. |
#              |  In case of problems with SUSY-HIT email to        |
#              |           margarete.muehlleitner@cern.ch           |
#              |           michael.spira@psi.ch                     |
#              |           abdelhak.djouadi@cern.ch                 |
#              ------------------------------------------------------
#
#              ------------------------------------------------------
#              |  SUSY Les Houches Accord - MSSM Spectrum + Decays  |
#              |              based on the decay programs           |
#              |                                                    |
#              |                     SDECAY 1.3b                    |
#              |                                                    |
#              |  Authors: M.Muhlleitner, A.Djouadi and Y.Mambrini  |
#              |  Ref.:    Comput.Phys.Commun.168(2005)46           |
#              |           [hep-ph/0311167]                         |
#              |                                                    |
#              |                     HDECAY 3.4                     |
#              |                                                    |
#              |  By: A.Djouadi,J.Kalinowski,M.Muhlleitner,M.Spira  |
#              |  Ref.:    Comput.Phys.Commun.108(1998)56           |
#              |           [hep-ph/9704448]                         |
#              |                                                    |
#              |                                                    |
#              |  If not stated otherwise all DRbar couplings and   |
#              |  soft SUSY breaking masses are given at the scale  |
#              |  Q=  0.50007719E+04
#              |                                                    |
#              ------------------------------------------------------
#
#
BLOCK DCINFO  # Decay Program information
     1   SDECAY/HDECAY # decay calculator
     2   1.3b  /3.4    # version number
#
BLOCK SPINFO  # Spectrum calculator information
     1    SOFTSUSY    # spectrum calculator                
     2    3.4.0       # version number                     
#
BLOCK MODSEL  # Model selection
     1     0   #  nonUniversal                                     
#
BLOCK SMINPUTS  # Standard Model inputs
         1     1.25778332E+02   # alpha_em^-1(M_Z)^MSbar
         2     1.16570000E-05   # G_F [GeV^-2]
         3     1.17200002E-01   # alpha_S(M_Z)^MSbar
         4     9.11876000E+01   # M_Z pole mass
         5     4.25000000E+00   # mb(mb)^MSbar
         6     1.72500000E+02   # mt pole mass
         7     1.77682000E+00   # mtau pole mass
#
BLOCK MINPAR  # Input parameters - minimal models
         3     1.00000000E+01   # tanb                
#
BLOCK EXTPAR  # Input parameters - non-minimal models
         0    -1.00000000E+00   # Set                 
         1     6.00000000E+01   # M_1(MX)             
         2     3.00000000E+03   # M_2(MX)             
         3     2.52553200E+03   # M_3(MX)             
        11     5.00000000E+03   # At(MX)              
        12     5.00000000E+03   # Ab(MX)              
        13     0.00000000E+00   # Atau(MX)            
        23    -2.82771000E+02   # mu(MX)              
        26     3.00000000E+03   # mA(pole)            
        31     5.00000000E+03   # meL(MX)             
        32     5.00000000E+03   # mmuL(MX)            
        33     5.00000000E+03   # mtauL(MX)           
        34     5.00000000E+03   # meR(MX)             
        35     5.00000000E+03   # mmuR(MX)            
        36     5.00000000E+03   # mtauR(MX)           
        41     5.00000000E+03   # mqL1(MX)            
        42     5.00000000E+03   # mqL2(MX)            
        43     5.00000000E+03   # mqL3(MX)            
        44     5.00000000E+03   # muR(MX)             
        45     5.00000000E+03   # mcR(MX)             
        46     5.00000000E+03   # mtR(MX)             
        47     5.00000000E+03   # mdR(MX)             
        48     5.00000000E+03   # msR(MX)             
        49     5.00000000E+03   # mbR(MX)             
#
BLOCK MASS  # Mass Spectrum
# PDG code           mass       particle
        24     8.00919151E+01   # W+
        25     1.24794819E+02   # h
        35     3.00008914E+03   # H
        36     2.99999971E+03   # A
        37     3.00146927E+03   # H+
         5     4.87878001E+00   # b-quark pole mass calculated from mb(mb)_Msbar
   1000001     5.08874566E+03   # ~d_L
   2000001     5.07093536E+03   # ~d_R
   1000002     5.08827570E+03   # ~u_L
   2000002     5.07063063E+03   # ~u_R
   1000003     5.08874566E+03   # ~s_L
   2000003     5.07093536E+03   # ~s_R
   1000004     5.08827570E+03   # ~c_L
   2000004     5.07063063E+03   # ~c_R
   1000005     5.03471249E+03   # ~b_1
   2000005     5.06904536E+03   # ~b_2
   1000006     4.92745705E+03   # ~t_1
   2000006     5.07678204E+03   # ~t_2
   1000011     5.01913554E+03   # ~e_L
   2000011     5.00595358E+03   # ~e_R
   1000012     5.01818412E+03   # ~nu_eL
   1000013     5.01913554E+03   # ~mu_L
   2000013     5.00595358E+03   # ~mu_R
   1000014     5.01818412E+03   # ~nu_muL
   1000015     5.00481606E+03   # ~tau_1
   2000015     5.01861707E+03   # ~tau_2
   1000016     5.01763039E+03   # ~nu_tauL
   1000021     2.90000029E+03   # ~g
   1000022     5.97919774E+01   # ~chi_10
   1000023     3.01967700E+02   # ~chi_20
   1000025    -3.03836536E+02   # ~chi_30
   1000035     3.07421763E+03   # ~chi_40
   1000024     3.00000889E+02   # ~chi_1+
   1000037     3.07438554E+03   # ~chi_2+
#
BLOCK NMIX  # Neutralino Mixing Matrix
  1  1     9.88607071E-01   # N_11
  1  2     6.02083542E-05   # N_12
  1  3    -1.49797680E-01   # N_13
  1  4    -1.47210743E-02   # N_14
  2  1     1.16362378E-01   # N_21
  2  2     1.76943737E-02   # N_22
  2  3     6.98595947E-01   # N_23
  2  4     7.05769374E-01   # N_24
  3  1    -9.54761618E-02   # N_31
  3  2     1.80268122E-02   # N_32
  3  3    -6.99660125E-01   # N_33
  3  4     7.07838291E-01   # N_34
  4  1    -3.97477799E-04   # N_41
  4  2     9.99680919E-01   # N_42
  4  3     2.60526137E-04   # N_43
  4  4    -2.52553872E-02   # N_44
#
BLOCK UMIX  # Chargino Mixing Matrix U
  1  1    -3.65894684E-04   # U_11
  1  2     9.99999933E-01   # U_12
  2  1    -9.99999933E-01   # U_21
  2  2    -3.65894684E-04   # U_22
#
BLOCK VMIX  # Chargino Mixing Matrix V
  1  1     3.57255556E-02   # V_11
  1  2    -9.99361639E-01   # V_12
  2  1    -9.99361639E-01   # V_21
  2  2    -3.57255556E-02   # V_22
#
BLOCK STOPMIX  # Stop Mixing Matrix
  1  1    -4.99141155E-01   # cos(theta_t)
  1  2     8.66520691E-01   # sin(theta_t)
  2  1    -8.66520691E-01   # -sin(theta_t)
  2  2    -4.99141155E-01   # cos(theta_t)
#
BLOCK SBOTMIX  # Sbottom Mixing Matrix
  1  1     9.99236018E-01   # cos(theta_b)
  1  2    -3.90817135E-02   # sin(theta_b)
  2  1     3.90817135E-02   # -sin(theta_b)
  2  2     9.99236018E-01   # cos(theta_b)
#
BLOCK STAUMIX  # Stau Mixing Matrix
  1  1    -3.37614151E-02   # cos(theta_tau)
  1  2     9.99429921E-01   # sin(theta_tau)
  2  1    -9.99429921E-01   # -sin(theta_tau)
  2  2    -3.37614151E-02   # cos(theta_tau)
#
BLOCK ALPHA  # Higgs mixing
          -1.05498943E-01   # Mixing angle in the neutral Higgs boson sector
#
BLOCK HMIX Q=  5.00077185E+03  # DRbar Higgs Parameters
         1    -2.87953753E+02   # mu(Q)MSSM           
         2     9.46825693E+00   # tan                 
         3     2.41703471E+02   # higgs               
         4     8.75209820E+06   # mA^2(Q)MSSM         
#
BLOCK GAUGE Q=  5.00077185E+03  # The gauge couplings
     1     3.71051747E-01   # gprime(Q) DRbar
     2     6.33840426E-01   # g(Q) DRbar
     3     9.92996112E-01   # g3(Q) DRbar
#
BLOCK AU Q=  5.00077185E+03  # The trilinear couplings
  1  1     5.00000002E+03   # A_u(Q) DRbar
  2  2     5.00000002E+03   # A_c(Q) DRbar
  3  3     5.00000003E+03   # A_t(Q) DRbar
#
BLOCK AD Q=  5.00077185E+03  # The trilinear couplings
  1  1     5.00000001E+03   # A_d(Q) DRbar
  2  2     5.00000001E+03   # A_s(Q) DRbar
  3  3     5.00000001E+03   # A_b(Q) DRbar
#
BLOCK AE Q=  5.00077185E+03  # The trilinear couplings
  1  1     0.00000000E+00   # A_e(Q) DRbar
  2  2     3.03831970E-07   # A_mu(Q) DRbar
  3  3     3.03984750E-07   # A_tau(Q) DRbar
#
BLOCK Yu Q=  5.00077185E+03  # The Yukawa couplings
  1  1     0.00000000E+00   # y_u(Q) DRbar
  2  2     0.00000000E+00   # y_c(Q) DRbar
  3  3     8.21988848E-01   # y_t(Q) DRbar
#
BLOCK Yd Q=  5.00077185E+03  # The Yukawa couplings
  1  1     0.00000000E+00   # y_d(Q) DRbar
  2  2     0.00000000E+00   # y_s(Q) DRbar
  3  3     1.30192590E-01   # y_b(Q) DRbar
#
BLOCK Ye Q=  5.00077185E+03  # The Yukawa couplings
  1  1     0.00000000E+00   # y_e(Q) DRbar
  2  2     0.00000000E+00   # y_mu(Q) DRbar
  3  3     9.72675218E-02   # y_tau(Q) DRbar
#
BLOCK MSOFT Q=  5.00077185E+03  # The soft SUSY breaking masses at the scale Q
         1     6.00000000E+01   # M_1(Q)              
         2     3.00000000E+03   # M_2(Q)              
         3     2.52553200E+03   # M_3(Q)              
        21     8.64860366E+06   # mH1^2(Q)            
        22     4.98967761E+05   # mH2^2(Q)            
        31     5.00000000E+03   # meL(Q)              
        32     5.00000000E+03   # mmuL(Q)             
        33     5.00000000E+03   # mtauL(Q)            
        34     5.00000000E+03   # meR(Q)              
        35     5.00000000E+03   # mmuR(Q)             
        36     5.00000000E+03   # mtauR(Q)            
        41     4.99999999E+03   # mqL1(Q)             
        42     4.99999999E+03   # mqL2(Q)             
        43     4.99999999E+03   # mqL3(Q)             
        44     4.99999999E+03   # muR(Q)              
        45     4.99999999E+03   # mcR(Q)              
        46     4.99999999E+03   # mtR(Q)              
        47     4.99999999E+03   # mdR(Q)              
        48     4.99999999E+03   # msR(Q)              
        49     4.99999999E+03   # mbR(Q)              
#
#
#
#                             =================
#                             |The decay table|
#                             =================
#
# - The QCD corrections to the decays gluino -> squark  + quark
#                                     squark -> gaugino + quark_prime
#                                     squark -> squark_prime + Higgs
#                                     squark -> gluino  + quark
#   are included.
#
# - The multi-body decays for the inos, stops and sbottoms are included.
#
# - The loop induced decays for the gluino, neutralinos and stops
#   are included.
#
# - The SUSY decays of the top quark are included.
#
#
#         PDG            Width
DECAY         6     1.40801662E+00   # top decays
#          BR         NDA      ID1       ID2
     1.00000000E+00    2           5        24   # BR(t ->  b    W+)
#
#         PDG            Width
DECAY   1000021     1.94147495E-02   # gluino decays
#          BR         NDA      ID1       ID2
     2.48013260E-07    2     1000022        21   # BR(~g -> ~chi_10 g)
     2.84118017E-03    2     1000023        21   # BR(~g -> ~chi_20 g)
     2.75165318E-03    2     1000025        21   # BR(~g -> ~chi_30 g)
#           BR         NDA      ID1       ID2       ID3
     8.57839928E-03    3     1000022         1        -1   # BR(~g -> ~chi_10 d  db)
     1.00810872E-04    3     1000023         1        -1   # BR(~g -> ~chi_20 d  db)
     9.39382461E-05    3     1000025         1        -1   # BR(~g -> ~chi_30 d  db)
     2.92468313E-02    3     1000022         2        -2   # BR(~g -> ~chi_10 u  ub)
     4.76177131E-04    3     1000023         2        -2   # BR(~g -> ~chi_20 u  ub)
     1.92577518E-04    3     1000025         2        -2   # BR(~g -> ~chi_30 u  ub)
     8.57839928E-03    3     1000022         3        -3   # BR(~g -> ~chi_10 s  sb)
     1.00810872E-04    3     1000023         3        -3   # BR(~g -> ~chi_20 s  sb)
     9.39382461E-05    3     1000025         3        -3   # BR(~g -> ~chi_30 s  sb)
     2.92468313E-02    3     1000022         4        -4   # BR(~g -> ~chi_10 c  cb)
     4.76177131E-04    3     1000023         4        -4   # BR(~g -> ~chi_20 c  cb)
     1.92577518E-04    3     1000025         4        -4   # BR(~g -> ~chi_30 c  cb)
     8.96224546E-03    3     1000022         5        -5   # BR(~g -> ~chi_10 b  bb)
     5.29335729E-03    3     1000023         5        -5   # BR(~g -> ~chi_20 b  bb)
     5.29689242E-03    3     1000025         5        -5   # BR(~g -> ~chi_30 b  bb)
     2.99570938E-02    3     1000022         6        -6   # BR(~g -> ~chi_10 t  tb)
     2.16082834E-01    3     1000023         6        -6   # BR(~g -> ~chi_20 t  tb)
     2.08248890E-01    3     1000025         6        -6   # BR(~g -> ~chi_30 t  tb)
     5.20276231E-05    3     1000024         1        -2   # BR(~g -> ~chi_1+ d  ub)
     5.20276231E-05    3    -1000024         2        -1   # BR(~g -> ~chi_1- u  db)
     5.20276231E-05    3     1000024         3        -4   # BR(~g -> ~chi_1+ s  cb)
     5.20276231E-05    3    -1000024         4        -3   # BR(~g -> ~chi_1- c  sb)
     2.21490014E-01    3     1000024         5        -6   # BR(~g -> ~chi_1+ b  tb)
     2.21490014E-01    3    -1000024         6        -5   # BR(~g -> ~chi_1- t  bb)
#
#         PDG            Width
DECAY   1000006     2.63414528E+02   # stop1 decays
#          BR         NDA      ID1       ID2
     3.23281181E-02    2     1000022         6   # BR(~t_1 -> ~chi_10 t )
     1.28292506E-01    2     1000023         6   # BR(~t_1 -> ~chi_20 t )
     1.18107348E-01    2     1000025         6   # BR(~t_1 -> ~chi_30 t )
     7.52600403E-03    2     1000035         6   # BR(~t_1 -> ~chi_40 t )
     1.85139632E-01    2     1000024         5   # BR(~t_1 -> ~chi_1+ b )
     1.50033882E-02    2     1000037         5   # BR(~t_1 -> ~chi_2+ b )
     5.13603002E-01    2     1000021         6   # BR(~t_1 -> ~g      t )
#
#         PDG            Width
DECAY   2000006     2.70023215E+02   # stop2 decays
#          BR         NDA      ID1       ID2
     1.32498530E-02    2     1000022         6   # BR(~t_2 -> ~chi_10 t )
     1.20372333E-01    2     1000023         6   # BR(~t_2 -> ~chi_20 t )
     1.31737291E-01    2     1000025         6   # BR(~t_2 -> ~chi_30 t )
     2.13080639E-02    2     1000035         6   # BR(~t_2 -> ~chi_40 t )
     6.98932546E-02    2     1000024         5   # BR(~t_2 -> ~chi_1+ b )
     4.24339721E-02    2     1000037         5   # BR(~t_2 -> ~chi_2+ b )
     5.96804652E-01    2     1000021         6   # BR(~t_2 -> ~g      t )
     9.75370465E-04    2     1000006        25   # BR(~t_2 -> ~t_1    h )
     3.22520974E-03    2     1000006        23   # BR(~t_2 -> ~t_1    Z )
#
#         PDG            Width
DECAY   1000005     2.44251260E+02   # sbottom1 decays
#          BR         NDA      ID1       ID2
     3.25738106E-03    2     1000022         5   # BR(~b_1 -> ~chi_10 b )
     3.29805409E-03    2     1000023         5   # BR(~b_1 -> ~chi_20 b )
     3.38437945E-03    2     1000025         5   # BR(~b_1 -> ~chi_30 b )
     3.14553796E-02    2     1000035         5   # BR(~b_1 -> ~chi_40 b )
     2.73066573E-01    2    -1000024         6   # BR(~b_1 -> ~chi_1- t )
     6.31480334E-02    2    -1000037         6   # BR(~b_1 -> ~chi_2- t )
     6.20250259E-01    2     1000021         5   # BR(~b_1 -> ~g      b )
     2.13994031E-03    2     1000006       -24   # BR(~b_1 -> ~t_1    W-)
#
#         PDG            Width
DECAY   2000005     1.60849126E+02   # sbottom2 decays
#          BR         NDA      ID1       ID2
     1.80388671E-02    2     1000022         5   # BR(~b_2 -> ~chi_10 b )
     5.46729737E-03    2     1000023         5   # BR(~b_2 -> ~chi_20 b )
     5.44299486E-03    2     1000025         5   # BR(~b_2 -> ~chi_30 b )
     6.05644366E-05    2     1000035         5   # BR(~b_2 -> ~chi_40 b )
     1.10234385E-02    2    -1000024         6   # BR(~b_2 -> ~chi_1- t )
     1.21623971E-04    2    -1000037         6   # BR(~b_2 -> ~chi_2- t )
     9.59823695E-01    2     1000021         5   # BR(~b_2 -> ~g      b )
     2.15185107E-05    2     1000006       -24   # BR(~b_2 -> ~t_1    W-)
#
#         PDG            Width
DECAY   1000002     1.80727876E+02   # sup_L decays
#          BR         NDA      ID1       ID2
     4.03164898E-03    2     1000022         2   # BR(~u_L -> ~chi_10 u)
     1.75675486E-04    2     1000023         2   # BR(~u_L -> ~chi_20 u)
     3.92422849E-08    2     1000025         2   # BR(~u_L -> ~chi_30 u)
     4.40752709E-02    2     1000035         2   # BR(~u_L -> ~chi_40 u)
     2.74763750E-04    2     1000024         1   # BR(~u_L -> ~chi_1+ d)
     8.80969544E-02    2     1000037         1   # BR(~u_L -> ~chi_2+ d)
     8.63345647E-01    2     1000021         2   # BR(~u_L -> ~g      u)
#
#         PDG            Width
DECAY   2000002     1.66325145E+02   # sup_R decays
#          BR         NDA      ID1       ID2
     6.97995383E-02    2     1000022         2   # BR(~u_R -> ~chi_10 u)
     9.61278761E-04    2     1000023         2   # BR(~u_R -> ~chi_20 u)
     6.47110533E-04    2     1000025         2   # BR(~u_R -> ~chi_30 u)
     4.56079902E-09    2     1000035         2   # BR(~u_R -> ~chi_40 u)
     9.28592068E-01    2     1000021         2   # BR(~u_R -> ~g      u)
#
#         PDG            Width
DECAY   1000001     1.80744477E+02   # sdown_L decays
#          BR         NDA      ID1       ID2
     4.02663024E-03    2     1000022         1   # BR(~d_L -> ~chi_10 d)
     2.70359157E-06    2     1000023         1   # BR(~d_L -> ~chi_20 d)
     1.44619172E-04    2     1000025         1   # BR(~d_L -> ~chi_30 d)
     4.40982872E-02    2     1000035         1   # BR(~d_L -> ~chi_40 d)
     2.88214174E-08    2    -1000024         2   # BR(~d_L -> ~chi_1- u)
     8.82282068E-02    2    -1000037         2   # BR(~d_L -> ~chi_2- u)
     8.63499524E-01    2     1000021         1   # BR(~d_L -> ~g      d)
#
#         PDG            Width
DECAY   2000001     1.57444956E+02   # sdown_R decays
#          BR         NDA      ID1       ID2
     1.84352262E-02    2     1000022         1   # BR(~d_R -> ~chi_10 d)
     2.53889988E-04    2     1000023         1   # BR(~d_R -> ~chi_20 d)
     1.70912844E-04    2     1000025         1   # BR(~d_R -> ~chi_30 d)
     1.20474891E-09    2     1000035         1   # BR(~d_R -> ~chi_40 d)
     9.81139970E-01    2     1000021         1   # BR(~d_R -> ~g      d)
#
#         PDG            Width
DECAY   1000004     1.80727876E+02   # scharm_L decays
#          BR         NDA      ID1       ID2
     4.03164898E-03    2     1000022         4   # BR(~c_L -> ~chi_10 c)
     1.75675486E-04    2     1000023         4   # BR(~c_L -> ~chi_20 c)
     3.92422849E-08    2     1000025         4   # BR(~c_L -> ~chi_30 c)
     4.40752709E-02    2     1000035         4   # BR(~c_L -> ~chi_40 c)
     2.74763750E-04    2     1000024         3   # BR(~c_L -> ~chi_1+ s)
     8.80969544E-02    2     1000037         3   # BR(~c_L -> ~chi_2+ s)
     8.63345647E-01    2     1000021         4   # BR(~c_L -> ~g      c)
#
#         PDG            Width
DECAY   2000004     1.66325145E+02   # scharm_R decays
#          BR         NDA      ID1       ID2
     6.97995383E-02    2     1000022         4   # BR(~c_R -> ~chi_10 c)
     9.61278761E-04    2     1000023         4   # BR(~c_R -> ~chi_20 c)
     6.47110533E-04    2     1000025         4   # BR(~c_R -> ~chi_30 c)
     4.56079902E-09    2     1000035         4   # BR(~c_R -> ~chi_40 c)
     9.28592068E-01    2     1000021         4   # BR(~c_R -> ~g      c)
#
#         PDG            Width
DECAY   1000003     1.80744477E+02   # sstrange_L decays
#          BR         NDA      ID1       ID2
     4.02663024E-03    2     1000022         3   # BR(~s_L -> ~chi_10 s)
     2.70359157E-06    2     1000023         3   # BR(~s_L -> ~chi_20 s)
     1.44619172E-04    2     1000025         3   # BR(~s_L -> ~chi_30 s)
     4.40982872E-02    2     1000035         3   # BR(~s_L -> ~chi_40 s)
     2.88214174E-08    2    -1000024         4   # BR(~s_L -> ~chi_1- c)
     8.82282068E-02    2    -1000037         4   # BR(~s_L -> ~chi_2- c)
     8.63499524E-01    2     1000021         3   # BR(~s_L -> ~g      s)
#
#         PDG            Width
DECAY   2000003     1.57444956E+02   # sstrange_R decays
#          BR         NDA      ID1       ID2
     1.84352262E-02    2     1000022         3   # BR(~s_R -> ~chi_10 s)
     2.53889988E-04    2     1000023         3   # BR(~s_R -> ~chi_20 s)
     1.70912844E-04    2     1000025         3   # BR(~s_R -> ~chi_30 s)
     1.20474891E-09    2     1000035         3   # BR(~s_R -> ~chi_40 s)
     9.81139970E-01    2     1000021         3   # BR(~s_R -> ~g      s)
#
#         PDG            Width
DECAY   1000011     3.03759126E+01   # selectron_L decays
#          BR         NDA      ID1       ID2
     2.21148098E-01    2     1000022        11   # BR(~e_L -> ~chi_10 e-)
     4.82745350E-03    2     1000023        11   # BR(~e_L -> ~chi_20 e-)
     9.39832679E-04    2     1000025        11   # BR(~e_L -> ~chi_30 e-)
     2.57527765E-01    2     1000035        11   # BR(~e_L -> ~chi_40 e-)
     1.75546876E-07    2    -1000024        12   # BR(~e_L -> ~chi_1- nu_e)
     5.15556676E-01    2    -1000037        12   # BR(~e_L -> ~chi_2- nu_e)
#
#         PDG            Width
DECAY   2000011     2.74108753E+01   # selectron_R decays
#          BR         NDA      ID1       ID2
     9.77499438E-01    2     1000022        11   # BR(~e_R -> ~chi_10 e-)
     1.34478199E-02    2     1000023        11   # BR(~e_R -> ~chi_20 e-)
     9.05268121E-03    2     1000025        11   # BR(~e_R -> ~chi_30 e-)
     6.13208472E-08    2     1000035        11   # BR(~e_R -> ~chi_40 e-)
#
#         PDG            Width
DECAY   1000013     3.03759126E+01   # smuon_L decays
#          BR         NDA      ID1       ID2
     2.21148098E-01    2     1000022        13   # BR(~mu_L -> ~chi_10 mu-)
     4.82745350E-03    2     1000023        13   # BR(~mu_L -> ~chi_20 mu-)
     9.39832679E-04    2     1000025        13   # BR(~mu_L -> ~chi_30 mu-)
     2.57527765E-01    2     1000035        13   # BR(~mu_L -> ~chi_40 mu-)
     1.75546876E-07    2    -1000024        14   # BR(~mu_L -> ~chi_1- nu_mu)
     5.15556676E-01    2    -1000037        14   # BR(~mu_L -> ~chi_2- nu_mu)
#
#         PDG            Width
DECAY   2000013     2.74108753E+01   # smuon_R decays
#          BR         NDA      ID1       ID2
     9.77499438E-01    2     1000022        13   # BR(~mu_R -> ~chi_10 mu-)
     1.34478199E-02    2     1000023        13   # BR(~mu_R -> ~chi_20 mu-)
     9.05268121E-03    2     1000025        13   # BR(~mu_R -> ~chi_30 mu-)
     6.13208472E-08    2     1000035        13   # BR(~mu_R -> ~chi_40 mu-)
#
#         PDG            Width
DECAY   1000015     2.92772279E+01   # stau_1 decays
#          BR         NDA      ID1       ID2
     9.15784760E-01    2     1000022        15   # BR(~tau_1 -> ~chi_10  tau-)
     2.78165706E-02    2     1000023        15   # BR(~tau_1 -> ~chi_20  tau-)
     2.35871570E-02    2     1000025        15   # BR(~tau_1 -> ~chi_30  tau-)
     3.02673731E-04    2     1000035        15   # BR(~tau_1 -> ~chi_40  tau-)
     3.19030454E-02    2    -1000024        16   # BR(~tau_1 -> ~chi_1-  nu_tau)
     6.05793639E-04    2    -1000037        16   # BR(~tau_1 -> ~chi_2-  nu_tau)
#
#         PDG            Width
DECAY   2000015     3.13025762E+01   # stau_2 decays
#          BR         NDA      ID1       ID2
     2.15176486E-01    2     1000022        15   # BR(~tau_2 -> ~chi_10  tau-)
     1.96418288E-02    2     1000023        15   # BR(~tau_2 -> ~chi_20  tau-)
     1.60654738E-02    2     1000025        15   # BR(~tau_2 -> ~chi_30  tau-)
     2.49530401E-01    2     1000035        15   # BR(~tau_2 -> ~chi_40  tau-)
     3.91419419E-05    2    -1000024        16   # BR(~tau_2 -> ~chi_1-  nu_tau)
     4.99546669E-01    2    -1000037        16   # BR(~tau_2 -> ~chi_2-  nu_tau)
#
#         PDG            Width
DECAY   1000012     3.03790404E+01   # snu_eL decays
#          BR         NDA      ID1       ID2
     2.20991407E-01    2     1000022        12   # BR(~nu_eL -> ~chi_10 nu_e)
     1.66634153E-03    2     1000023        12   # BR(~nu_eL -> ~chi_20 nu_e)
     3.58057051E-03    2     1000025        12   # BR(~nu_eL -> ~chi_30 nu_e)
     2.57574915E-01    2     1000035        12   # BR(~nu_eL -> ~chi_40 nu_e)
     1.67305670E-03    2     1000024        11   # BR(~nu_eL -> ~chi_1+ e-)
     5.14513710E-01    2     1000037        11   # BR(~nu_eL -> ~chi_2+ e-)
#
#         PDG            Width
DECAY   1000014     3.03790404E+01   # snu_muL decays
#          BR         NDA      ID1       ID2
     2.20991407E-01    2     1000022        14   # BR(~nu_muL -> ~chi_10 nu_mu)
     1.66634153E-03    2     1000023        14   # BR(~nu_muL -> ~chi_20 nu_mu)
     3.58057051E-03    2     1000025        14   # BR(~nu_muL -> ~chi_30 nu_mu)
     2.57574915E-01    2     1000035        14   # BR(~nu_muL -> ~chi_40 nu_mu)
     1.67305670E-03    2     1000024        13   # BR(~nu_muL -> ~chi_1+ mu-)
     5.14513710E-01    2     1000037        13   # BR(~nu_muL -> ~chi_2+ mu-)
#
#         PDG            Width
DECAY   1000016     3.13071552E+01   # snu_tauL decays
#          BR         NDA      ID1       ID2
     2.14416341E-01    2     1000022        16   # BR(~nu_tauL -> ~chi_10 nu_tau)
     1.61676107E-03    2     1000023        16   # BR(~nu_tauL -> ~chi_20 nu_tau)
     3.47403385E-03    2     1000025        16   # BR(~nu_tauL -> ~chi_30 nu_tau)
     2.49845136E-01    2     1000035        16   # BR(~nu_tauL -> ~chi_40 nu_tau)
     3.15747891E-02    2     1000024        15   # BR(~nu_tauL -> ~chi_1+ tau-)
     4.99072939E-01    2     1000037        15   # BR(~nu_tauL -> ~chi_2+ tau-)
#
#         PDG            Width
DECAY   1000024     1.63047580E-01   # chargino1+ decays
#          BR         NDA      ID1       ID2
     1.00000000E+00    2     1000022        24   # BR(~chi_1+ -> ~chi_10  W+)
#
#         PDG            Width
DECAY   1000037     2.28947165E+01   # chargino2+ decays
#          BR         NDA      ID1       ID2
     2.53648876E-01    2     1000024        23   # BR(~chi_2+ -> ~chi_1+  Z )
     1.47796383E-04    2     1000022        24   # BR(~chi_2+ -> ~chi_10  W+)
     2.45426313E-01    2     1000023        24   # BR(~chi_2+ -> ~chi_20  W+)
     2.44530270E-01    2     1000025        24   # BR(~chi_2+ -> ~chi_30  W+)
     2.56231617E-01    2     1000024        25   # BR(~chi_2+ -> ~chi_1+  h )
     1.51269458E-05    2     1000022        37   # BR(~chi_2+ -> ~chi_10  H+)
#
#         PDG            Width
DECAY   1000022     0.00000000E+00   # neutralino1 decays
#
#         PDG            Width
DECAY   1000023     1.53403660E-01   # neutralino2 decays
#          BR         NDA      ID1       ID2
     4.91769302E-01    2     1000022        23   # BR(~chi_20 -> ~chi_10   Z )
     5.08230698E-01    2     1000022        25   # BR(~chi_20 -> ~chi_10   h )
#
#         PDG            Width
DECAY   1000025     1.38256334E-01   # neutralino3 decays
#          BR         NDA      ID1       ID2
     6.71446029E-01    2     1000022        23   # BR(~chi_30 -> ~chi_10   Z )
     3.28553971E-01    2     1000022        25   # BR(~chi_30 -> ~chi_10   h )
#
#         PDG            Width
DECAY   1000035     2.28962067E+01   # neutralino4 decays
#          BR         NDA      ID1       ID2
     6.90263124E-05    2     1000022        23   # BR(~chi_40 -> ~chi_10   Z )
     1.29012199E-01    2     1000023        23   # BR(~chi_40 -> ~chi_20   Z )
     1.24402566E-01    2     1000025        23   # BR(~chi_40 -> ~chi_30   Z )
     2.45257197E-01    2     1000024       -24   # BR(~chi_40 -> ~chi_1+   W-)
     2.45257197E-01    2    -1000024        24   # BR(~chi_40 -> ~chi_1-   W+)
     6.83409638E-05    2     1000022        25   # BR(~chi_40 -> ~chi_10   h )
     1.46019902E-05    2     1000022        35   # BR(~chi_40 -> ~chi_10   H )
     1.54716901E-06    2     1000022        36   # BR(~chi_40 -> ~chi_10   A )
     1.26597900E-01    2     1000023        25   # BR(~chi_40 -> ~chi_20   h )
     1.29319426E-01    2     1000025        25   # BR(~chi_40 -> ~chi_30   h )
#
#         PDG            Width
DECAY        25     4.07439793E-03   # h decays
#          BR         NDA      ID1       ID2
     6.09120592E-01    2           5        -5   # BR(h -> b       bb     )
     6.36788984E-02    2         -15        15   # BR(h -> tau+    tau-   )
     2.25446360E-04    2         -13        13   # BR(h -> mu+     mu-    )
     4.77916087E-04    2           3        -3   # BR(h -> s       sb     )
     2.07060723E-02    2           4        -4   # BR(h -> c       cb     )
     6.70048228E-02    2          21        21   # BR(h -> g       g      )
     2.30241542E-03    2          22        22   # BR(h -> gam     gam    )
     1.48737184E-03    2          22        23   # BR(h -> Z       gam    )
     2.09975541E-01    2          24       -24   # BR(h -> W+      W-     )
     2.50186772E-02    2          23        23   # BR(h -> Z       Z      )
     2.24736730E-06    2     1000022   1000022   # BR(h -> ~chi_10 ~chi_10)
#
#         PDG            Width
DECAY        35     8.77756564E+00   # H decays
#          BR         NDA      ID1       ID2
     3.61330454E-01    2           5        -5   # BR(H -> b       bb     )
     6.34487332E-02    2         -15        15   # BR(H -> tau+    tau-   )
     2.24359760E-04    2         -13        13   # BR(H -> mu+     mu-    )
     2.75030558E-04    2           3        -3   # BR(H -> s       sb     )
     1.53968480E-06    2           4        -4   # BR(H -> c       cb     )
     1.53826714E-01    2           6        -6   # BR(H -> t       tb     )
     5.11848276E-05    2          21        21   # BR(H -> g       g      )
     1.38389040E-07    2          22        22   # BR(H -> gam     gam    )
     9.07577797E-08    2          23        22   # BR(H -> Z       gam    )
     7.48634598E-05    2          24       -24   # BR(H -> W+      W-     )
     3.73843379E-05    2          23        23   # BR(H -> Z       Z      )
     2.67725294E-04    2          25        25   # BR(H -> h       h      )
     1.99278218E-23    2          36        36   # BR(H -> A       A      )
     6.08277467E-19    2          23        36   # BR(H -> Z       A      )
     3.40730465E-03    2     1000024  -1000024   # BR(H -> ~chi_1+ ~chi_1-)
     1.88185223E-02    2     1000022   1000022   # BR(H -> ~chi_10 ~chi_10)
     3.33042544E-03    2     1000023   1000023   # BR(H -> ~chi_20 ~chi_20)
     5.10715138E-03    2     1000025   1000025   # BR(H -> ~chi_30 ~chi_30)
     2.32175752E-01    2     1000022   1000023   # BR(H -> ~chi_10 ~chi_20)
     1.48109599E-01    2     1000022   1000025   # BR(H -> ~chi_10 ~chi_30)
     9.51302674E-03    2     1000023   1000025   # BR(H -> ~chi_20 ~chi_30)
#
#         PDG            Width
DECAY        36     8.78289302E+00   # A decays
#          BR         NDA      ID1       ID2
     3.61234874E-01    2           5        -5   # BR(A -> b       bb     )
     6.34121074E-02    2         -15        15   # BR(A -> tau+    tau-   )
     2.24229935E-04    2         -13        13   # BR(A -> mu+     mu-    )
     2.75072452E-04    2           3        -3   # BR(A -> s       sb     )
     1.54483264E-06    2           4        -4   # BR(A -> c       cb     )
     1.54255859E-01    2           6        -6   # BR(A -> t       tb     )
     1.52629228E-04    2          21        21   # BR(A -> g       g      )
     5.64069275E-07    2          22        22   # BR(A -> gam     gam    )
     1.84712854E-07    2          23        22   # BR(A -> Z       gam    )
     7.45345481E-05    2          23        25   # BR(A -> Z       h      )
     3.56260122E-03    2     1000024  -1000024   # BR(A -> ~chi_1+ ~chi_1-)
     1.80705006E-02    2     1000022   1000022   # BR(A -> ~chi_10 ~chi_10)
     2.25906489E-03    2     1000023   1000023   # BR(A -> ~chi_20 ~chi_20)
     8.17940819E-03    2     1000025   1000025   # BR(A -> ~chi_30 ~chi_30)
     1.51238483E-01    2     1000022   1000023   # BR(A -> ~chi_10 ~chi_20)
     2.28718990E-01    2     1000022   1000025   # BR(A -> ~chi_10 ~chi_30)
     8.33935081E-03    2     1000023   1000025   # BR(A -> ~chi_20 ~chi_30)
#
#         PDG            Width
DECAY        37     8.72893295E+00   # H+ decays
#          BR         NDA      ID1       ID2
     5.79629627E-04    2           4        -5   # BR(H+ -> c       bb     )
     6.38353598E-02    2         -15        16   # BR(H+ -> tau+    nu_tau )
     2.25726587E-04    2         -13        14   # BR(H+ -> mu+     nu_mu  )
     3.70961007E-06    2           2        -5   # BR(H+ -> u       bb     )
     1.32448251E-05    2           2        -3   # BR(H+ -> u       sb     )
     2.73904797E-04    2           4        -3   # BR(H+ -> c       sb     )
     5.14274036E-01    2           6        -5   # BR(H+ -> t       bb     )
     7.51539888E-05    2          24        25   # BR(H+ -> W+      h      )
     1.03177453E-12    2          24        36   # BR(H+ -> W+      A      )
     4.09905531E-01    2     1000024   1000022   # BR(H+ -> ~chi_1+ ~chi_10)
     9.10910880E-03    2     1000024   1000023   # BR(H+ -> ~chi_1+ ~chi_20)
     1.70459447E-03    2     1000024   1000025   # BR(H+ -> ~chi_1+ ~chi_30)
