#
#                              ======================
#                              | THE SUSYHIT OUTPUT |
#                              ======================
#
#
#              ------------------------------------------------------
#              |     This is the output of the SUSY-HIT package     |
#              |  created by A.Djouadi, M.Muehlleitner and M.Spira. |
#              |  In case of problems with SUSY-HIT email to        |
#              |           margarete.muehlleitner@cern.ch           |
#              |           michael.spira@psi.ch                     |
#              |           abdelhak.djouadi@cern.ch                 |
#              ------------------------------------------------------
#
#              ------------------------------------------------------
#              |  SUSY Les Houches Accord - MSSM Spectrum + Decays  |
#              |              based on the decay programs           |
#              |                                                    |
#              |                     SDECAY 1.3b                    |
#              |                                                    |
#              |  Authors: M.Muhlleitner, A.Djouadi and Y.Mambrini  |
#              |  Ref.:    Comput.Phys.Commun.168(2005)46           |
#              |           [hep-ph/0311167]                         |
#              |                                                    |
#              |                     HDECAY 3.4                     |
#              |                                                    |
#              |  By: A.Djouadi,J.Kalinowski,M.Muhlleitner,M.Spira  |
#              |  Ref.:    Comput.Phys.Commun.108(1998)56           |
#              |           [hep-ph/9704448]                         |
#              |                                                    |
#              |                                                    |
#              |  If not stated otherwise all DRbar couplings and   |
#              |  soft SUSY breaking masses are given at the scale  |
#              |  Q=  0.50007313E+04
#              |                                                    |
#              ------------------------------------------------------
#
#
BLOCK DCINFO  # Decay Program information
     1   SDECAY/HDECAY # decay calculator
     2   1.3b  /3.4    # version number
#
BLOCK SPINFO  # Spectrum calculator information
     1    SOFTSUSY    # spectrum calculator                
     2    3.4.0       # version number                     
#
BLOCK MODSEL  # Model selection
     1     0   #  nonUniversal                                     
#
BLOCK SMINPUTS  # Standard Model inputs
         1     1.25778332E+02   # alpha_em^-1(M_Z)^MSbar
         2     1.16570000E-05   # G_F [GeV^-2]
         3     1.17200002E-01   # alpha_S(M_Z)^MSbar
         4     9.11876000E+01   # M_Z pole mass
         5     4.25000000E+00   # mb(mb)^MSbar
         6     1.72500000E+02   # mt pole mass
         7     1.77682000E+00   # mtau pole mass
#
BLOCK MINPAR  # Input parameters - minimal models
         3     1.00000000E+01   # tanb                
#
BLOCK EXTPAR  # Input parameters - non-minimal models
         0    -1.00000000E+00   # Set                 
         1     6.00000000E+01   # M_1(MX)             
         2     3.00000000E+03   # M_2(MX)             
         3     2.52554000E+03   # M_3(MX)             
        11     5.00000000E+03   # At(MX)              
        12     5.00000000E+03   # Ab(MX)              
        13     0.00000000E+00   # Atau(MX)            
        23    -1.25111600E+03   # mu(MX)              
        26     3.00000000E+03   # mA(pole)            
        31     5.00000000E+03   # meL(MX)             
        32     5.00000000E+03   # mmuL(MX)            
        33     5.00000000E+03   # mtauL(MX)           
        34     5.00000000E+03   # meR(MX)             
        35     5.00000000E+03   # mmuR(MX)            
        36     5.00000000E+03   # mtauR(MX)           
        41     5.00000000E+03   # mqL1(MX)            
        42     5.00000000E+03   # mqL2(MX)            
        43     5.00000000E+03   # mqL3(MX)            
        44     5.00000000E+03   # muR(MX)             
        45     5.00000000E+03   # mcR(MX)             
        46     5.00000000E+03   # mtR(MX)             
        47     5.00000000E+03   # mdR(MX)             
        48     5.00000000E+03   # msR(MX)             
        49     5.00000000E+03   # mbR(MX)             
#
BLOCK MASS  # Mass Spectrum
# PDG code           mass       particle
        24     8.00963757E+01   # W+
        25     1.24822269E+02   # h
        35     3.00008179E+03   # H
        36     2.99999987E+03   # A
        37     3.00086812E+03   # H+
         5     4.87878001E+00   # b-quark pole mass calculated from mb(mb)_Msbar
   1000001     5.08864572E+03   # ~d_L
   2000001     5.07092324E+03   # ~d_R
   1000002     5.08817720E+03   # ~u_L
   2000002     5.07064631E+03   # ~u_R
   1000003     5.08864572E+03   # ~s_L
   2000003     5.07092324E+03   # ~s_R
   1000004     5.08817720E+03   # ~c_L
   2000004     5.07064631E+03   # ~c_R
   1000005     5.03448473E+03   # ~b_1
   2000005     5.06958187E+03   # ~b_2
   1000006     4.92729032E+03   # ~t_1
   2000006     5.07853791E+03   # ~t_2
   1000011     5.01905314E+03   # ~e_L
   2000011     5.00591518E+03   # ~e_R
   1000012     5.01810513E+03   # ~nu_eL
   1000013     5.01905314E+03   # ~mu_L
   2000013     5.00591518E+03   # ~mu_R
   1000014     5.01810513E+03   # ~nu_muL
   1000015     5.00447619E+03   # ~tau_1
   2000015     5.01889326E+03   # ~tau_2
   1000016     5.01756310E+03   # ~nu_tauL
   1000021     2.90000061E+03   # ~g
   1000022     6.03030638E+01   # ~chi_10
   1000023     1.29950365E+03   # ~chi_20
   1000025    -1.30184273E+03   # ~chi_30
   1000035     3.07429305E+03   # ~chi_40
   1000024     1.30000017E+03   # ~chi_1+
   1000037     3.07446046E+03   # ~chi_2+
#
BLOCK NMIX  # Neutralino Mixing Matrix
  1  1     9.99410399E-01   # N_11
  1  2     1.55351323E-04   # N_12
  1  3    -3.42760821E-02   # N_13
  1  4     1.99527440E-03   # N_14
  2  1     2.28285628E-02   # N_21
  2  2     2.74273647E-02   # N_22
  2  3     7.06874878E-01   # N_23
  2  4     7.06437898E-01   # N_24
  3  1    -2.56423585E-02   # N_31
  3  2     1.38783102E-02   # N_32
  3  3    -7.06442658E-01   # N_33
  3  4     7.07169451E-01   # N_34
  4  1    -4.25715616E-04   # N_41
  4  2     9.99527442E-01   # N_42
  4  3    -9.58268827E-03   # N_43
  4  4    -2.92041575E-02   # N_44
#
BLOCK UMIX  # Chargino Mixing Matrix U
  1  1     1.35662957E-02   # U_11
  1  2     9.99907974E-01   # U_12
  2  1    -9.99907974E-01   # U_21
  2  2     1.35662957E-02   # U_22
#
BLOCK VMIX  # Chargino Mixing Matrix V
  1  1     4.13278038E-02   # V_11
  1  2    -9.99145641E-01   # V_12
  2  1    -9.99145641E-01   # V_21
  2  2    -4.13278038E-02   # V_22
#
BLOCK STOPMIX  # Stop Mixing Matrix
  1  1    -5.05630456E-01   # cos(theta_t)
  1  2     8.62750162E-01   # sin(theta_t)
  2  1    -8.62750162E-01   # -sin(theta_t)
  2  2    -5.05630456E-01   # cos(theta_t)
#
BLOCK SBOTMIX  # Sbottom Mixing Matrix
  1  1     9.95709997E-01   # cos(theta_b)
  1  2    -9.25289245E-02   # sin(theta_b)
  2  1     9.25289245E-02   # -sin(theta_b)
  2  2     9.95709997E-01   # cos(theta_b)
#
BLOCK STAUMIX  # Stau Mixing Matrix
  1  1    -1.46917450E-01   # cos(theta_tau)
  1  2     9.89148757E-01   # sin(theta_tau)
  2  1    -9.89148757E-01   # -sin(theta_tau)
  2  2    -1.46917450E-01   # cos(theta_tau)
#
BLOCK ALPHA  # Higgs mixing
          -1.05476944E-01   # Mixing angle in the neutral Higgs boson sector
#
BLOCK HMIX Q=  5.00073126E+03  # DRbar Higgs Parameters
         1    -1.27417815E+03   # mu(Q)MSSM           
         2     9.46938897E+00   # tan                 
         3     2.41921550E+02   # higgs               
         4     8.44411592E+06   # mA^2(Q)MSSM         
#
BLOCK GAUGE Q=  5.00073126E+03  # The gauge couplings
     1     3.70718017E-01   # gprime(Q) DRbar
     2     6.32196474E-01   # g(Q) DRbar
     3     9.92988691E-01   # g3(Q) DRbar
#
BLOCK AU Q=  5.00073126E+03  # The trilinear couplings
  1  1     5.00000002E+03   # A_u(Q) DRbar
  2  2     5.00000002E+03   # A_c(Q) DRbar
  3  3     5.00000003E+03   # A_t(Q) DRbar
#
BLOCK AD Q=  5.00073126E+03  # The trilinear couplings
  1  1     5.00000001E+03   # A_d(Q) DRbar
  2  2     5.00000001E+03   # A_s(Q) DRbar
  3  3     5.00000001E+03   # A_b(Q) DRbar
#
BLOCK AE Q=  5.00073126E+03  # The trilinear couplings
  1  1     0.00000000E+00   # A_e(Q) DRbar
  2  2     3.11550927E-07   # A_mu(Q) DRbar
  3  3     3.11720925E-07   # A_tau(Q) DRbar
#
BLOCK Yu Q=  5.00073126E+03  # The Yukawa couplings
  1  1     0.00000000E+00   # y_u(Q) DRbar
  2  2     0.00000000E+00   # y_c(Q) DRbar
  3  3     8.21351282E-01   # y_t(Q) DRbar
#
BLOCK Yd Q=  5.00073126E+03  # The Yukawa couplings
  1  1     0.00000000E+00   # y_d(Q) DRbar
  2  2     0.00000000E+00   # y_s(Q) DRbar
  3  3     1.31635864E-01   # y_b(Q) DRbar
#
BLOCK Ye Q=  5.00073126E+03  # The Yukawa couplings
  1  1     0.00000000E+00   # y_e(Q) DRbar
  2  2     0.00000000E+00   # y_mu(Q) DRbar
  3  3     9.67043412E-02   # y_tau(Q) DRbar
#
BLOCK MSOFT Q=  5.00073126E+03  # The soft SUSY breaking masses at the scale Q
         1     6.00000000E+01   # M_1(Q)              
         2     3.00000000E+03   # M_2(Q)              
         3     2.52554000E+03   # M_3(Q)              
        21     7.05703121E+06   # mH1^2(Q)            
        22    -1.06508734E+06   # mH2^2(Q)            
        31     5.00000000E+03   # meL(Q)              
        32     5.00000000E+03   # mmuL(Q)             
        33     5.00000000E+03   # mtauL(Q)            
        34     5.00000000E+03   # meR(Q)              
        35     5.00000000E+03   # mmuR(Q)             
        36     5.00000000E+03   # mtauR(Q)            
        41     4.99999999E+03   # mqL1(Q)             
        42     4.99999999E+03   # mqL2(Q)             
        43     4.99999999E+03   # mqL3(Q)             
        44     4.99999999E+03   # muR(Q)              
        45     4.99999999E+03   # mcR(Q)              
        46     4.99999999E+03   # mtR(Q)              
        47     4.99999999E+03   # mdR(Q)              
        48     4.99999999E+03   # msR(Q)              
        49     4.99999999E+03   # mbR(Q)              
#
#
#
#                             =================
#                             |The decay table|
#                             =================
#
# - The QCD corrections to the decays gluino -> squark  + quark
#                                     squark -> gaugino + quark_prime
#                                     squark -> squark_prime + Higgs
#                                     squark -> gluino  + quark
#   are included.
#
# - The multi-body decays for the inos, stops and sbottoms are included.
#
# - The loop induced decays for the gluino, neutralinos and stops
#   are included.
#
# - The SUSY decays of the top quark are included.
#
#
#         PDG            Width
DECAY         6     1.40052757E+00   # top decays
#          BR         NDA      ID1       ID2
     1.00000000E+00    2           5        24   # BR(t ->  b    W+)
#
#         PDG            Width
DECAY   1000021     6.94002864E-03   # gluino decays
#          BR         NDA      ID1       ID2
     2.08498195E-06    2     1000022        21   # BR(~g -> ~chi_10 g)
     4.35140930E-03    2     1000023        21   # BR(~g -> ~chi_20 g)
     4.31950646E-03    2     1000025        21   # BR(~g -> ~chi_30 g)
#           BR         NDA      ID1       ID2       ID3
     2.44829039E-02    3     1000022         1        -1   # BR(~g -> ~chi_10 d  db)
     2.77236178E-05    3     1000023         1        -1   # BR(~g -> ~chi_20 d  db)
     8.54261667E-06    3     1000025         1        -1   # BR(~g -> ~chi_30 d  db)
     8.34886073E-02    3     1000022         2        -2   # BR(~g -> ~chi_10 u  ub)
     6.11310087E-05    3     1000023         2        -2   # BR(~g -> ~chi_20 u  ub)
     9.07688132E-06    3     1000025         2        -2   # BR(~g -> ~chi_30 u  ub)
     2.44829039E-02    3     1000022         3        -3   # BR(~g -> ~chi_10 s  sb)
     2.77236178E-05    3     1000023         3        -3   # BR(~g -> ~chi_20 s  sb)
     8.54261667E-06    3     1000025         3        -3   # BR(~g -> ~chi_30 s  sb)
     8.34886073E-02    3     1000022         4        -4   # BR(~g -> ~chi_10 c  cb)
     6.11310087E-05    3     1000023         4        -4   # BR(~g -> ~chi_20 c  cb)
     9.07688132E-06    3     1000025         4        -4   # BR(~g -> ~chi_30 c  cb)
     2.48183645E-02    3     1000022         5        -5   # BR(~g -> ~chi_10 b  bb)
     4.35266058E-03    3     1000023         5        -5   # BR(~g -> ~chi_20 b  bb)
     4.29538359E-03    3     1000025         5        -5   # BR(~g -> ~chi_30 b  bb)
     8.71575883E-02    3     1000022         6        -6   # BR(~g -> ~chi_10 t  tb)
     1.63784653E-01    3     1000023         6        -6   # BR(~g -> ~chi_20 t  tb)
     1.51348678E-01    3     1000025         6        -6   # BR(~g -> ~chi_30 t  tb)
     7.58139679E-05    3     1000024         1        -2   # BR(~g -> ~chi_1+ d  ub)
     7.58139679E-05    3    -1000024         2        -1   # BR(~g -> ~chi_1- u  db)
     7.58139679E-05    3     1000024         3        -4   # BR(~g -> ~chi_1+ s  cb)
     7.58139679E-05    3    -1000024         4        -3   # BR(~g -> ~chi_1- c  sb)
     1.69555223E-01    3     1000024         5        -6   # BR(~g -> ~chi_1+ b  tb)
     1.69555223E-01    3    -1000024         6        -5   # BR(~g -> ~chi_1- t  bb)
#
#         PDG            Width
DECAY   1000006     2.48100706E+02   # stop1 decays
#          BR         NDA      ID1       ID2
     3.58491801E-02    2     1000022         6   # BR(~t_1 -> ~chi_10 t )
     1.14927901E-01    2     1000023         6   # BR(~t_1 -> ~chi_20 t )
     1.10589798E-01    2     1000025         6   # BR(~t_1 -> ~chi_30 t )
     8.36581431E-03    2     1000035         6   # BR(~t_1 -> ~chi_40 t )
     1.68635485E-01    2     1000024         5   # BR(~t_1 -> ~chi_1+ b )
     1.66538043E-02    2     1000037         5   # BR(~t_1 -> ~chi_2+ b )
     5.44978017E-01    2     1000021         6   # BR(~t_1 -> ~g      t )
#
#         PDG            Width
DECAY   2000006     2.60098870E+02   # stop2 decays
#          BR         NDA      ID1       ID2
     1.31044449E-02    2     1000022         6   # BR(~t_2 -> ~chi_10 t )
     1.13212071E-01    2     1000023         6   # BR(~t_2 -> ~chi_20 t )
     1.17735518E-01    2     1000025         6   # BR(~t_2 -> ~chi_30 t )
     2.16503520E-02    2     1000035         6   # BR(~t_2 -> ~chi_40 t )
     6.62504204E-02    2     1000024         5   # BR(~t_2 -> ~chi_1+ b )
     4.30342922E-02    2     1000037         5   # BR(~t_2 -> ~chi_2+ b )
     6.20369508E-01    2     1000021         6   # BR(~t_2 -> ~g      t )
     1.04189319E-03    2     1000006        25   # BR(~t_2 -> ~t_1    h )
     3.60149963E-03    2     1000006        23   # BR(~t_2 -> ~t_1    Z )
#
#         PDG            Width
DECAY   1000005     2.35063962E+02   # sbottom1 decays
#          BR         NDA      ID1       ID2
     3.29118751E-03    2     1000022         5   # BR(~b_1 -> ~chi_10 b )
     3.27538248E-03    2     1000023         5   # BR(~b_1 -> ~chi_20 b )
     3.14208793E-03    2     1000025         5   # BR(~b_1 -> ~chi_30 b )
     3.22653392E-02    2     1000035         5   # BR(~b_1 -> ~chi_40 b )
     2.46577104E-01    2    -1000024         6   # BR(~b_1 -> ~chi_1- t )
     6.48882662E-02    2    -1000037         6   # BR(~b_1 -> ~chi_2- t )
     6.44316202E-01    2     1000021         5   # BR(~b_1 -> ~g      b )
     2.24443111E-03    2     1000006       -24   # BR(~b_1 -> ~t_1    W-)
#
#         PDG            Width
DECAY   2000005     1.61102659E+02   # sbottom2 decays
#          BR         NDA      ID1       ID2
     1.81496281E-02    2     1000022         5   # BR(~b_2 -> ~chi_10 b )
     4.66541754E-03    2     1000023         5   # BR(~b_2 -> ~chi_20 b )
     4.82927154E-03    2     1000025         5   # BR(~b_2 -> ~chi_30 b )
     4.09556833E-04    2     1000035         5   # BR(~b_2 -> ~chi_40 b )
     1.23012401E-02    2    -1000024         6   # BR(~b_2 -> ~chi_1- t )
     8.23434264E-04    2    -1000037         6   # BR(~b_2 -> ~chi_2- t )
     9.58695730E-01    2     1000021         5   # BR(~b_2 -> ~g      b )
     1.25721440E-04    2     1000006       -24   # BR(~b_2 -> ~t_1    W-)
#
#         PDG            Width
DECAY   1000002     1.80591648E+02   # sup_L decays
#          BR         NDA      ID1       ID2
     4.11982506E-03    2     1000022         2   # BR(~u_L -> ~chi_10 u)
     9.61526627E-05    2     1000023         2   # BR(~u_L -> ~chi_20 u)
     7.42872806E-06    2     1000025         2   # BR(~u_L -> ~chi_30 u)
     4.38608190E-02    2     1000035         2   # BR(~u_L -> ~chi_40 u)
     3.22948293E-04    2     1000024         1   # BR(~u_L -> ~chi_1+ d)
     8.76583569E-02    2     1000037         1   # BR(~u_L -> ~chi_2+ d)
     8.63934469E-01    2     1000021         2   # BR(~u_L -> ~g      u)
#
#         PDG            Width
DECAY   2000002     1.66302660E+02   # sup_R decays
#          BR         NDA      ID1       ID2
     7.12148254E-02    2     1000022         2   # BR(~u_R -> ~chi_10 u)
     3.25639782E-05    2     1000023         2   # BR(~u_R -> ~chi_20 u)
     4.10656444E-05    2     1000025         2   # BR(~u_R -> ~chi_30 u)
     5.22289850E-09    2     1000035         2   # BR(~u_R -> ~chi_40 u)
     9.28711540E-01    2     1000021         2   # BR(~u_R -> ~g      u)
#
#         PDG            Width
DECAY   1000001     1.80609728E+02   # sdown_L decays
#          BR         NDA      ID1       ID2
     4.10671724E-03    2     1000022         1   # BR(~d_L -> ~chi_10 d)
     4.98668160E-05    2     1000023         1   # BR(~d_L -> ~chi_20 d)
     3.37243706E-05    2     1000025         1   # BR(~d_L -> ~chi_30 d)
     4.38843162E-02    2     1000035         1   # BR(~d_L -> ~chi_40 d)
     3.47999983E-05    2    -1000024         2   # BR(~d_L -> ~chi_1- u)
     8.78099609E-02    2    -1000037         2   # BR(~d_L -> ~chi_2- u)
     8.64080614E-01    2     1000021         1   # BR(~d_L -> ~g      d)
#
#         PDG            Width
DECAY   2000001     1.57436066E+02   # sdown_R decays
#          BR         NDA      ID1       ID2
     1.88074407E-02    2     1000022         1   # BR(~d_R -> ~chi_10 d)
     8.60009406E-06    2     1000023         1   # BR(~d_R -> ~chi_20 d)
     1.08453710E-05    2     1000025         1   # BR(~d_R -> ~chi_30 d)
     1.37951085E-09    2     1000035         1   # BR(~d_R -> ~chi_40 d)
     9.81173112E-01    2     1000021         1   # BR(~d_R -> ~g      d)
#
#         PDG            Width
DECAY   1000004     1.80591648E+02   # scharm_L decays
#          BR         NDA      ID1       ID2
     4.11982506E-03    2     1000022         4   # BR(~c_L -> ~chi_10 c)
     9.61526627E-05    2     1000023         4   # BR(~c_L -> ~chi_20 c)
     7.42872806E-06    2     1000025         4   # BR(~c_L -> ~chi_30 c)
     4.38608190E-02    2     1000035         4   # BR(~c_L -> ~chi_40 c)
     3.22948293E-04    2     1000024         3   # BR(~c_L -> ~chi_1+ s)
     8.76583569E-02    2     1000037         3   # BR(~c_L -> ~chi_2+ s)
     8.63934469E-01    2     1000021         4   # BR(~c_L -> ~g      c)
#
#         PDG            Width
DECAY   2000004     1.66302660E+02   # scharm_R decays
#          BR         NDA      ID1       ID2
     7.12148254E-02    2     1000022         4   # BR(~c_R -> ~chi_10 c)
     3.25639782E-05    2     1000023         4   # BR(~c_R -> ~chi_20 c)
     4.10656444E-05    2     1000025         4   # BR(~c_R -> ~chi_30 c)
     5.22289850E-09    2     1000035         4   # BR(~c_R -> ~chi_40 c)
     9.28711540E-01    2     1000021         4   # BR(~c_R -> ~g      c)
#
#         PDG            Width
DECAY   1000003     1.80609728E+02   # sstrange_L decays
#          BR         NDA      ID1       ID2
     4.10671724E-03    2     1000022         3   # BR(~s_L -> ~chi_10 s)
     4.98668160E-05    2     1000023         3   # BR(~s_L -> ~chi_20 s)
     3.37243706E-05    2     1000025         3   # BR(~s_L -> ~chi_30 s)
     4.38843162E-02    2     1000035         3   # BR(~s_L -> ~chi_40 s)
     3.47999983E-05    2    -1000024         4   # BR(~s_L -> ~chi_1- c)
     8.78099609E-02    2    -1000037         4   # BR(~s_L -> ~chi_2- c)
     8.64080614E-01    2     1000021         3   # BR(~s_L -> ~g      s)
#
#         PDG            Width
DECAY   2000003     1.57436066E+02   # sstrange_R decays
#          BR         NDA      ID1       ID2
     1.88074407E-02    2     1000022         3   # BR(~s_R -> ~chi_10 s)
     8.60009406E-06    2     1000023         3   # BR(~s_R -> ~chi_20 s)
     1.08453710E-05    2     1000025         3   # BR(~s_R -> ~chi_30 s)
     1.37951085E-09    2     1000035         3   # BR(~s_R -> ~chi_40 s)
     9.81173112E-01    2     1000021         3   # BR(~s_R -> ~g      s)
#
#         PDG            Width
DECAY   1000011     3.02435555E+01   # selectron_L decays
#          BR         NDA      ID1       ID2
     2.26656946E-01    2     1000022        11   # BR(~e_L -> ~chi_10 e-)
     9.56621282E-04    2     1000023        11   # BR(~e_L -> ~chi_20 e-)
     7.70070796E-07    2     1000025        11   # BR(~e_L -> ~chi_30 e-)
     2.57197560E-01    2     1000035        11   # BR(~e_L -> ~chi_40 e-)
     2.11362229E-04    2    -1000024        12   # BR(~e_L -> ~chi_1- nu_e)
     5.14976741E-01    2    -1000037        12   # BR(~e_L -> ~chi_2- nu_e)
#
#         PDG            Width
DECAY   2000011     2.73613952E+01   # selectron_R decays
#          BR         NDA      ID1       ID2
     9.98974605E-01    2     1000022        11   # BR(~e_R -> ~chi_10 e-)
     4.53472677E-04    2     1000023        11   # BR(~e_R -> ~chi_20 e-)
     5.71852129E-04    2     1000025        11   # BR(~e_R -> ~chi_30 e-)
     7.03375829E-08    2     1000035        11   # BR(~e_R -> ~chi_40 e-)
#
#         PDG            Width
DECAY   1000013     3.02435555E+01   # smuon_L decays
#          BR         NDA      ID1       ID2
     2.26656946E-01    2     1000022        13   # BR(~mu_L -> ~chi_10 mu-)
     9.56621282E-04    2     1000023        13   # BR(~mu_L -> ~chi_20 mu-)
     7.70070796E-07    2     1000025        13   # BR(~mu_L -> ~chi_30 mu-)
     2.57197560E-01    2     1000035        13   # BR(~mu_L -> ~chi_40 mu-)
     2.11362229E-04    2    -1000024        14   # BR(~mu_L -> ~chi_1- nu_mu)
     5.14976741E-01    2    -1000037        14   # BR(~mu_L -> ~chi_2- nu_mu)
#
#         PDG            Width
DECAY   2000013     2.73613952E+01   # smuon_R decays
#          BR         NDA      ID1       ID2
     9.98974605E-01    2     1000022        13   # BR(~mu_R -> ~chi_10 mu-)
     4.53472677E-04    2     1000023        13   # BR(~mu_R -> ~chi_20 mu-)
     5.71852129E-04    2     1000025        13   # BR(~mu_R -> ~chi_30 mu-)
     7.03375829E-08    2     1000035        13   # BR(~mu_R -> ~chi_40 mu-)
#
#         PDG            Width
DECAY   1000015     2.90328028E+01   # stau_1 decays
#          BR         NDA      ID1       ID2
     9.26860755E-01    2     1000022        15   # BR(~tau_1 -> ~chi_10  tau-)
     1.47473025E-02    2     1000023        15   # BR(~tau_1 -> ~chi_20  tau-)
     1.36741679E-02    2     1000025        15   # BR(~tau_1 -> ~chi_30  tau-)
     5.56711796E-03    2     1000035        15   # BR(~tau_1 -> ~chi_40  tau-)
     2.80040117E-02    2    -1000024        16   # BR(~tau_1 -> ~chi_1-  nu_tau)
     1.11466447E-02    2    -1000037        16   # BR(~tau_1 -> ~chi_2-  nu_tau)
#
#         PDG            Width
DECAY   2000015     3.09898159E+01   # stau_2 decays
#          BR         NDA      ID1       ID2
     2.34728426E-01    2     1000022        15   # BR(~tau_2 -> ~chi_10  tau-)
     1.36774814E-02    2     1000023        15   # BR(~tau_2 -> ~chi_20  tau-)
     1.38135230E-02    2     1000025        15   # BR(~tau_2 -> ~chi_30  tau-)
     2.45711151E-01    2     1000035        15   # BR(~tau_2 -> ~chi_40  tau-)
     9.18345795E-05    2    -1000024        16   # BR(~tau_2 -> ~chi_1-  nu_tau)
     4.91977584E-01    2    -1000037        16   # BR(~tau_2 -> ~chi_2-  nu_tau)
#
#         PDG            Width
DECAY   1000012     3.02459300E+01   # snu_eL decays
#          BR         NDA      ID1       ID2
     2.26356181E-01    2     1000022        12   # BR(~nu_eL -> ~chi_10 nu_e)
     1.13178650E-04    2     1000023        12   # BR(~nu_eL -> ~chi_20 nu_e)
     4.79735051E-04    2     1000025        12   # BR(~nu_eL -> ~chi_30 nu_e)
     2.57269008E-01    2     1000035        12   # BR(~nu_eL -> ~chi_40 nu_e)
     1.96087423E-03    2     1000024        11   # BR(~nu_eL -> ~chi_1+ e-)
     5.13821023E-01    2     1000037        11   # BR(~nu_eL -> ~chi_2+ e-)
#
#         PDG            Width
DECAY   1000014     3.02459300E+01   # snu_muL decays
#          BR         NDA      ID1       ID2
     2.26356181E-01    2     1000022        14   # BR(~nu_muL -> ~chi_10 nu_mu)
     1.13178650E-04    2     1000023        14   # BR(~nu_muL -> ~chi_20 nu_mu)
     4.79735051E-04    2     1000025        14   # BR(~nu_muL -> ~chi_30 nu_mu)
     2.57269008E-01    2     1000035        14   # BR(~nu_muL -> ~chi_40 nu_mu)
     1.96087423E-03    2     1000024        13   # BR(~nu_muL -> ~chi_1+ mu-)
     5.13821023E-01    2     1000037        13   # BR(~nu_muL -> ~chi_2+ mu-)
#
#         PDG            Width
DECAY   1000016     3.10489342E+01   # snu_tauL decays
#          BR         NDA      ID1       ID2
     2.20478204E-01    2     1000022        16   # BR(~nu_tauL -> ~chi_10 nu_tau)
     1.10236230E-04    2     1000023        16   # BR(~nu_tauL -> ~chi_20 nu_tau)
     4.67262836E-04    2     1000025        16   # BR(~nu_tauL -> ~chi_30 nu_tau)
     2.50523250E-01    2     1000035        16   # BR(~nu_tauL -> ~chi_40 nu_tau)
     2.80723694E-02    2     1000024        15   # BR(~nu_tauL -> ~chi_1+ tau-)
     5.00348677E-01    2     1000037        15   # BR(~nu_tauL -> ~chi_2+ tau-)
#
#         PDG            Width
DECAY   1000024     7.97102744E-01   # chargino1+ decays
#          BR         NDA      ID1       ID2
     1.00000000E+00    2     1000022        24   # BR(~chi_1+ -> ~chi_10  W+)
#
#         PDG            Width
DECAY   1000037     1.92711918E+01   # chargino2+ decays
#          BR         NDA      ID1       ID2
     2.52918496E-01    2     1000024        23   # BR(~chi_2+ -> ~chi_1+  Z )
     2.27545037E-04    2     1000022        24   # BR(~chi_2+ -> ~chi_10  W+)
     2.43956220E-01    2     1000023        24   # BR(~chi_2+ -> ~chi_20  W+)
     2.43868608E-01    2     1000025        24   # BR(~chi_2+ -> ~chi_30  W+)
     2.59028540E-01    2     1000024        25   # BR(~chi_2+ -> ~chi_1+  h )
     5.91705328E-07    2     1000022        37   # BR(~chi_2+ -> ~chi_10  H+)
#
#         PDG            Width
DECAY   1000022     0.00000000E+00   # neutralino1 decays
#
#         PDG            Width
DECAY   1000023     8.36336377E-01   # neutralino2 decays
#          BR         NDA      ID1       ID2
     5.51246793E-01    2     1000022        23   # BR(~chi_20 -> ~chi_10   Z )
     4.48753207E-01    2     1000022        25   # BR(~chi_20 -> ~chi_10   h )
#
#         PDG            Width
DECAY   1000025     8.43443870E-01   # neutralino3 decays
#          BR         NDA      ID1       ID2
     4.33552374E-01    2     1000022        23   # BR(~chi_30 -> ~chi_10   Z )
     5.66447626E-01    2     1000022        25   # BR(~chi_30 -> ~chi_10   h )
#
#         PDG            Width
DECAY   1000035     1.92800092E+01   # neutralino4 decays
#          BR         NDA      ID1       ID2
     7.23332487E-05    2     1000022        23   # BR(~chi_40 -> ~chi_10   Z )
     5.16783536E-02    2     1000023        23   # BR(~chi_40 -> ~chi_20   Z )
     2.00567325E-01    2     1000025        23   # BR(~chi_40 -> ~chi_30   Z )
     2.44512412E-01    2     1000024       -24   # BR(~chi_40 -> ~chi_1+   W-)
     2.44512412E-01    2    -1000024        24   # BR(~chi_40 -> ~chi_1-   W+)
     1.59142862E-04    2     1000022        25   # BR(~chi_40 -> ~chi_10   h )
     5.39554566E-07    2     1000022        35   # BR(~chi_40 -> ~chi_10   H )
     7.32103765E-08    2     1000022        36   # BR(~chi_40 -> ~chi_10   A )
     2.06753668E-01    2     1000023        25   # BR(~chi_40 -> ~chi_20   h )
     5.17437417E-02    2     1000025        25   # BR(~chi_40 -> ~chi_30   h )
#
#         PDG            Width
DECAY        25     4.04462050E-03   # h decays
#          BR         NDA      ID1       ID2
     6.05564441E-01    2           5        -5   # BR(h -> b       bb     )
     6.41503730E-02    2         -15        15   # BR(h -> tau+    tau-   )
     2.27115429E-04    2         -13        13   # BR(h -> mu+     mu-    )
     4.81434796E-04    2           3        -3   # BR(h -> s       sb     )
     2.08622494E-02    2           4        -4   # BR(h -> c       cb     )
     6.75410942E-02    2          21        21   # BR(h -> g       g      )
     2.32343514E-03    2          22        22   # BR(h -> gam     gam    )
     1.50227176E-03    2          22        23   # BR(h -> Z       gam    )
     2.12016562E-01    2          24       -24   # BR(h -> W+      W-     )
     2.52899195E-02    2          23        23   # BR(h -> Z       Z      )
     4.11043491E-05    2     1000022   1000022   # BR(h -> ~chi_10 ~chi_10)
#
#         PDG            Width
DECAY        35     7.63099211E+00   # H decays
#          BR         NDA      ID1       ID2
     4.26897741E-01    2           5        -5   # BR(H -> b       bb     )
     7.29994679E-02    2         -15        15   # BR(H -> tau+    tau-   )
     2.58131917E-04    2         -13        13   # BR(H -> mu+     mu-    )
     3.16430160E-04    2           3        -3   # BR(H -> s       sb     )
     1.77028165E-06    2           4        -4   # BR(H -> c       cb     )
     1.76865158E-01    2           6        -6   # BR(H -> t       tb     )
     5.87442830E-05    2          21        21   # BR(H -> g       g      )
     3.62311311E-07    2          22        22   # BR(H -> gam     gam    )
     1.04461844E-07    2          23        22   # BR(H -> Z       gam    )
     8.02145831E-05    2          24       -24   # BR(H -> W+      W-     )
     4.00565309E-05    2          23        23   # BR(H -> Z       Z      )
     2.99860371E-04    2          25        25   # BR(H -> h       h      )
    -1.97598266E-23    2          36        36   # BR(H -> A       A      )
     4.70307600E-19    2          23        36   # BR(H -> Z       A      )
     7.43018794E-04    2     1000024  -1000024   # BR(H -> ~chi_1+ ~chi_1-)
     1.11969119E-03    2     1000022   1000022   # BR(H -> ~chi_10 ~chi_10)
     5.60972197E-05    2     1000023   1000023   # BR(H -> ~chi_20 ~chi_20)
     1.23961507E-04    2     1000025   1000025   # BR(H -> ~chi_30 ~chi_30)
     1.91056503E-01    2     1000022   1000023   # BR(H -> ~chi_10 ~chi_20)
     1.28959810E-01    2     1000022   1000025   # BR(H -> ~chi_10 ~chi_30)
     1.22876767E-04    2     1000023   1000025   # BR(H -> ~chi_20 ~chi_30)
#
#         PDG            Width
DECAY        36     7.65201479E+00   # A decays
#          BR         NDA      ID1       ID2
     4.25867635E-01    2           5        -5   # BR(A -> b       bb     )
     7.28010839E-02    2         -15        15   # BR(A -> tau+    tau-   )
     2.57430056E-04    2         -13        13   # BR(A -> mu+     mu-    )
     3.15800425E-04    2           3        -3   # BR(A -> s       sb     )
     1.77271699E-06    2           4        -4   # BR(A -> c       cb     )
     1.77010748E-01    2           6        -6   # BR(A -> t       tb     )
     1.75161565E-04    2          21        21   # BR(A -> g       g      )
     4.87011110E-07    2          22        22   # BR(A -> gam     gam    )
     2.12198219E-07    2          23        22   # BR(A -> Z       gam    )
     7.96915459E-05    2          23        25   # BR(A -> Z       h      )
     2.59079665E-03    2     1000024  -1000024   # BR(A -> ~chi_1+ ~chi_1-)
     1.14633352E-03    2     1000022   1000022   # BR(A -> ~chi_10 ~chi_10)
     1.46694553E-04    2     1000023   1000023   # BR(A -> ~chi_20 ~chi_20)
     7.66148777E-04    2     1000025   1000025   # BR(A -> ~chi_30 ~chi_30)
     1.30205341E-01    2     1000022   1000023   # BR(A -> ~chi_10 ~chi_20)
     1.88627698E-01    2     1000022   1000025   # BR(A -> ~chi_10 ~chi_30)
     6.96452942E-06    2     1000023   1000025   # BR(A -> ~chi_20 ~chi_30)
#
#         PDG            Width
DECAY        37     7.64330550E+00   # H+ decays
#          BR         NDA      ID1       ID2
     6.88487867E-04    2           4        -5   # BR(H+ -> c       bb     )
     7.29051322E-02    2         -15        16   # BR(H+ -> tau+    nu_tau )
     2.57797978E-04    2         -13        14   # BR(H+ -> mu+     nu_mu  )
     4.40629984E-06    2           2        -5   # BR(H+ -> u       bb     )
     1.51270517E-05    2           2        -3   # BR(H+ -> u       sb     )
     3.12828685E-04    2           4        -3   # BR(H+ -> c       sb     )
     6.03803697E-01    2           6        -5   # BR(H+ -> t       bb     )
     7.99028711E-05    2          24        25   # BR(H+ -> W+      h      )
     8.48461042E-14    2          24        36   # BR(H+ -> W+      A      )
     3.21511773E-01    2     1000024   1000022   # BR(H+ -> ~chi_1+ ~chi_10)
     3.54896522E-04    2     1000024   1000023   # BR(H+ -> ~chi_1+ ~chi_20)
     6.59498180E-05    2     1000024   1000025   # BR(H+ -> ~chi_1+ ~chi_30)
