#
#                              ======================
#                              | THE SUSYHIT OUTPUT |
#                              ======================
#
#
#              ------------------------------------------------------
#              |     This is the output of the SUSY-HIT package     |
#              |  created by A.Djouadi, M.Muehlleitner and M.Spira. |
#              |  In case of problems with SUSY-HIT email to        |
#              |           margarete.muehlleitner@cern.ch           |
#              |           michael.spira@psi.ch                     |
#              |           abdelhak.djouadi@cern.ch                 |
#              ------------------------------------------------------
#
#              ------------------------------------------------------
#              |  SUSY Les Houches Accord - MSSM Spectrum + Decays  |
#              |              based on the decay programs           |
#              |                                                    |
#              |                     SDECAY 1.3b                    |
#              |                                                    |
#              |  Authors: M.Muhlleitner, A.Djouadi and Y.Mambrini  |
#              |  Ref.:    Comput.Phys.Commun.168(2005)46           |
#              |           [hep-ph/0311167]                         |
#              |                                                    |
#              |                     HDECAY 3.4                     |
#              |                                                    |
#              |  By: A.Djouadi,J.Kalinowski,M.Muhlleitner,M.Spira  |
#              |  Ref.:    Comput.Phys.Commun.108(1998)56           |
#              |           [hep-ph/9704448]                         |
#              |                                                    |
#              |                                                    |
#              |  If not stated otherwise all DRbar couplings and   |
#              |  soft SUSY breaking masses are given at the scale  |
#              |  Q=  0.50006920E+04
#              |                                                    |
#              ------------------------------------------------------
#
#
BLOCK DCINFO  # Decay Program information
     1   SDECAY/HDECAY # decay calculator
     2   1.3b  /3.4    # version number
#
BLOCK SPINFO  # Spectrum calculator information
     1    SOFTSUSY    # spectrum calculator                
     2    3.4.0       # version number                     
#
BLOCK MODSEL  # Model selection
     1     0   #  nonUniversal                                     
#
BLOCK SMINPUTS  # Standard Model inputs
         1     1.25778332E+02   # alpha_em^-1(M_Z)^MSbar
         2     1.16570000E-05   # G_F [GeV^-2]
         3     1.17200002E-01   # alpha_S(M_Z)^MSbar
         4     9.11876000E+01   # M_Z pole mass
         5     4.25000000E+00   # mb(mb)^MSbar
         6     1.72500000E+02   # mt pole mass
         7     1.77682000E+00   # mtau pole mass
#
BLOCK MINPAR  # Input parameters - minimal models
         3     1.00000000E+01   # tanb                
#
BLOCK EXTPAR  # Input parameters - non-minimal models
         0    -1.00000000E+00   # Set                 
         1     6.00000000E+01   # M_1(MX)             
         2     3.00000000E+03   # M_2(MX)             
         3     8.59149000E+02   # M_3(MX)             
        11     5.00000000E+03   # At(MX)              
        12     5.00000000E+03   # Ab(MX)              
        13     0.00000000E+00   # Atau(MX)            
        23    -1.83950800E+03   # mu(MX)              
        26     3.00000000E+03   # mA(pole)            
        31     5.00000000E+03   # meL(MX)             
        32     5.00000000E+03   # mmuL(MX)            
        33     5.00000000E+03   # mtauL(MX)           
        34     5.00000000E+03   # meR(MX)             
        35     5.00000000E+03   # mmuR(MX)            
        36     5.00000000E+03   # mtauR(MX)           
        41     5.00000000E+03   # mqL1(MX)            
        42     5.00000000E+03   # mqL2(MX)            
        43     5.00000000E+03   # mqL3(MX)            
        44     5.00000000E+03   # muR(MX)             
        45     5.00000000E+03   # mcR(MX)             
        46     5.00000000E+03   # mtR(MX)             
        47     5.00000000E+03   # mdR(MX)             
        48     5.00000000E+03   # msR(MX)             
        49     5.00000000E+03   # mbR(MX)             
#
BLOCK MASS  # Mass Spectrum
# PDG code           mass       particle
        24     8.00948513E+01   # W+
        25     1.24391594E+02   # h
        35     3.00007689E+03   # H
        36     2.99999995E+03   # A
        37     3.00087424E+03   # H+
         5     4.87878001E+00   # b-quark pole mass calculated from mb(mb)_Msbar
   1000001     5.06415563E+03   # ~d_L
   2000001     5.04636190E+03   # ~d_R
   1000002     5.06367877E+03   # ~u_L
   2000002     5.04609205E+03   # ~u_R
   1000003     5.06415563E+03   # ~s_L
   2000003     5.04636190E+03   # ~s_R
   1000004     5.06367877E+03   # ~c_L
   2000004     5.04609205E+03   # ~c_R
   1000005     5.01125436E+03   # ~b_1
   2000005     5.04561583E+03   # ~b_2
   1000006     4.90270819E+03   # ~t_1
   2000006     5.05923991E+03   # ~t_2
   1000011     5.01903891E+03   # ~e_L
   2000011     5.00590307E+03   # ~e_R
   1000012     5.01809054E+03   # ~nu_eL
   1000013     5.01903891E+03   # ~mu_L
   2000013     5.00590307E+03   # ~mu_R
   1000014     5.01809054E+03   # ~nu_muL
   1000015     5.00412482E+03   # ~tau_1
   2000015     5.01926280E+03   # ~tau_2
   1000016     5.01755972E+03   # ~nu_tauL
   1000021     1.10000089E+03   # ~g
   1000022     6.02998448E+01   # ~chi_10
   1000023     1.89938835E+03   # ~chi_20
   1000025    -1.90224419E+03   # ~chi_30
   1000035     3.07443386E+03   # ~chi_40
   1000024     1.90000005E+03   # ~chi_1+
   1000037     3.07460169E+03   # ~chi_2+
#
BLOCK NMIX  # Neutralino Mixing Matrix
  1  1     9.99722442E-01   # N_11
  1  2     1.16329880E-04   # N_12
  1  3    -2.34959967E-02   # N_13
  1  4     1.72156789E-03   # N_14
  2  1     1.53902278E-02   # N_21
  2  2     4.14276971E-02   # N_22
  2  3     7.06771700E-01   # N_23
  2  4     7.06059949E-01   # N_24
  3  1    -1.78295153E-02   # N_31
  3  2     1.21873588E-02   # N_32
  3  3    -7.06748833E-01   # N_33
  3  4     7.07134827E-01   # N_34
  4  1    -5.37085598E-04   # N_41
  4  2     9.99067165E-01   # N_42
  4  3    -2.06830829E-02   # N_43
  4  4    -3.79041021E-02   # N_44
#
BLOCK UMIX  # Chargino Mixing Matrix U
  1  1     2.92116547E-02   # U_11
  1  2     9.99573249E-01   # U_12
  2  1    -9.99573249E-01   # U_21
  2  2     2.92116547E-02   # U_22
#
BLOCK VMIX  # Chargino Mixing Matrix V
  1  1     5.35686200E-02   # V_11
  1  2    -9.98564171E-01   # V_12
  2  1    -9.98564171E-01   # V_21
  2  2    -5.35686200E-02   # V_22
#
BLOCK STOPMIX  # Stop Mixing Matrix
  1  1    -5.18220684E-01   # cos(theta_t)
  1  2     8.55246937E-01   # sin(theta_t)
  2  1    -8.55246937E-01   # -sin(theta_t)
  2  2    -5.18220684E-01   # cos(theta_t)
#
BLOCK SBOTMIX  # Sbottom Mixing Matrix
  1  1     9.91474389E-01   # cos(theta_b)
  1  2    -1.30301711E-01   # sin(theta_b)
  2  1     1.30301711E-01   # -sin(theta_b)
  2  2     9.91474389E-01   # cos(theta_b)
#
BLOCK STAUMIX  # Stau Mixing Matrix
  1  1    -2.08927111E-01   # cos(theta_tau)
  1  2     9.77931216E-01   # sin(theta_tau)
  2  1    -9.77931216E-01   # -sin(theta_tau)
  2  2    -2.08927111E-01   # cos(theta_tau)
#
BLOCK ALPHA  # Higgs mixing
          -1.05415169E-01   # Mixing angle in the neutral Higgs boson sector
#
BLOCK HMIX Q=  5.00069202E+03  # DRbar Higgs Parameters
         1    -1.87239969E+03   # mu(Q)MSSM           
         2     9.47439439E+00   # tan                 
         3     2.42097001E+02   # higgs               
         4     8.32950692E+06   # mA^2(Q)MSSM         
#
BLOCK GAUGE Q=  5.00069202E+03  # The gauge couplings
     1     3.70663705E-01   # gprime(Q) DRbar
     2     6.31865072E-01   # g(Q) DRbar
     3     1.00723378E+00   # g3(Q) DRbar
#
BLOCK AU Q=  5.00069202E+03  # The trilinear couplings
  1  1     5.00000001E+03   # A_u(Q) DRbar
  2  2     5.00000001E+03   # A_c(Q) DRbar
  3  3     5.00000001E+03   # A_t(Q) DRbar
#
BLOCK AD Q=  5.00069202E+03  # The trilinear couplings
  1  1     5.00000000E+03   # A_d(Q) DRbar
  2  2     5.00000000E+03   # A_s(Q) DRbar
  3  3     5.00000001E+03   # A_b(Q) DRbar
#
BLOCK AE Q=  5.00069202E+03  # The trilinear couplings
  1  1     0.00000000E+00   # A_e(Q) DRbar
  2  2     3.40784391E-08   # A_mu(Q) DRbar
  3  3     3.31711030E-08   # A_tau(Q) DRbar
#
BLOCK Yu Q=  5.00069202E+03  # The Yukawa couplings
  1  1     0.00000000E+00   # y_u(Q) DRbar
  2  2     0.00000000E+00   # y_c(Q) DRbar
  3  3     8.14477021E-01   # y_t(Q) DRbar
#
BLOCK Yd Q=  5.00069202E+03  # The Yukawa couplings
  1  1     0.00000000E+00   # y_d(Q) DRbar
  2  2     0.00000000E+00   # y_s(Q) DRbar
  3  3     1.30250207E-01   # y_b(Q) DRbar
#
BLOCK Ye Q=  5.00069202E+03  # The Yukawa couplings
  1  1     0.00000000E+00   # y_e(Q) DRbar
  2  2     0.00000000E+00   # y_mu(Q) DRbar
  3  3     9.65009509E-02   # y_tau(Q) DRbar
#
BLOCK MSOFT Q=  5.00069202E+03  # The soft SUSY breaking masses at the scale Q
         1     6.00000000E+01   # M_1(Q)              
         2     3.00000000E+03   # M_2(Q)              
         3     8.59149000E+02   # M_3(Q)              
        21     5.14182419E+06   # mH1^2(Q)            
        22    -2.97595391E+06   # mH2^2(Q)            
        31     5.00000000E+03   # meL(Q)              
        32     5.00000000E+03   # mmuL(Q)             
        33     5.00000000E+03   # mtauL(Q)            
        34     5.00000000E+03   # meR(Q)              
        35     5.00000000E+03   # mmuR(Q)             
        36     5.00000000E+03   # mtauR(Q)            
        41     5.00000000E+03   # mqL1(Q)             
        42     5.00000000E+03   # mqL2(Q)             
        43     5.00000000E+03   # mqL3(Q)             
        44     5.00000000E+03   # muR(Q)              
        45     5.00000000E+03   # mcR(Q)              
        46     5.00000000E+03   # mtR(Q)              
        47     5.00000000E+03   # mdR(Q)              
        48     5.00000000E+03   # msR(Q)              
        49     5.00000000E+03   # mbR(Q)              
#
#
#
#                             =================
#                             |The decay table|
#                             =================
#
# - The QCD corrections to the decays gluino -> squark  + quark
#                                     squark -> gaugino + quark_prime
#                                     squark -> squark_prime + Higgs
#                                     squark -> gluino  + quark
#   are included.
#
# - The multi-body decays for the inos, stops and sbottoms are included.
#
# - The loop induced decays for the gluino, neutralinos and stops
#   are included.
#
# - The SUSY decays of the top quark are included.
#
#
#         PDG            Width
DECAY         6     1.39912611E+00   # top decays
#          BR         NDA      ID1       ID2
     1.00000000E+00    2           5        24   # BR(t ->  b    W+)
#
#         PDG            Width
DECAY   1000021     1.37891046E-05   # gluino decays
#          BR         NDA      ID1       ID2
     1.73142317E-05    2     1000022        21   # BR(~g -> ~chi_10 g)
#           BR         NDA      ID1       ID2       ID3
     8.16260511E-02    3     1000022         1        -1   # BR(~g -> ~chi_10 d  db)
     2.78236321E-01    3     1000022         2        -2   # BR(~g -> ~chi_10 u  ub)
     8.16260511E-02    3     1000022         3        -3   # BR(~g -> ~chi_10 s  sb)
     2.78236321E-01    3     1000022         4        -4   # BR(~g -> ~chi_10 c  cb)
     8.25433996E-02    3     1000022         5        -5   # BR(~g -> ~chi_10 b  bb)
     1.97714542E-01    3     1000022         6        -6   # BR(~g -> ~chi_10 t  tb)
#
#         PDG            Width
DECAY   1000006     3.86980603E+02   # stop1 decays
#          BR         NDA      ID1       ID2
     2.24940727E-02    2     1000022         6   # BR(~t_1 -> ~chi_10 t )
     6.09353192E-02    2     1000023         6   # BR(~t_1 -> ~chi_20 t )
     5.84333772E-02    2     1000025         6   # BR(~t_1 -> ~chi_30 t )
     5.99105122E-03    2     1000035         6   # BR(~t_1 -> ~chi_40 t )
     8.59868105E-02    2     1000024         5   # BR(~t_1 -> ~chi_1+ b )
     1.18827982E-02    2     1000037         5   # BR(~t_1 -> ~chi_2+ b )
     7.54276571E-01    2     1000021         6   # BR(~t_1 -> ~g      t )
#
#         PDG            Width
DECAY   2000006     3.95838867E+02   # stop2 decays
#          BR         NDA      ID1       ID2
     9.28137121E-03    2     1000022         6   # BR(~t_2 -> ~chi_10 t )
     6.25247591E-02    2     1000023         6   # BR(~t_2 -> ~chi_20 t )
     6.52024896E-02    2     1000025         6   # BR(~t_2 -> ~chi_30 t )
     1.33471482E-02    2     1000035         6   # BR(~t_2 -> ~chi_40 t )
     4.02924367E-02    2     1000024         5   # BR(~t_2 -> ~chi_1+ b )
     2.64142006E-02    2     1000037         5   # BR(~t_2 -> ~chi_2+ b )
     7.79540923E-01    2     1000021         6   # BR(~t_2 -> ~g      t )
     7.19471542E-04    2     1000006        25   # BR(~t_2 -> ~t_1    h )
     2.67720019E-03    2     1000006        23   # BR(~t_2 -> ~t_1    Z )
#
#         PDG            Width
DECAY   1000005     3.75632910E+02   # sbottom1 decays
#          BR         NDA      ID1       ID2
     2.11928178E-03    2     1000022         5   # BR(~b_1 -> ~chi_10 b )
     1.78836413E-03    2     1000023         5   # BR(~b_1 -> ~chi_20 b )
     1.62840376E-03    2     1000025         5   # BR(~b_1 -> ~chi_30 b )
     1.96488545E-02    2     1000035         5   # BR(~b_1 -> ~chi_40 b )
     1.27669045E-01    2    -1000024         6   # BR(~b_1 -> ~chi_1- t )
     3.96782751E-02    2    -1000037         6   # BR(~b_1 -> ~chi_2- t )
     8.06010655E-01    2     1000021         5   # BR(~b_1 -> ~g      b )
     1.45712134E-03    2     1000006       -24   # BR(~b_1 -> ~t_1    W-)
#
#         PDG            Width
DECAY   2000005     3.11734638E+02   # sbottom2 decays
#          BR         NDA      ID1       ID2
     9.36201799E-03    2     1000022         5   # BR(~b_2 -> ~chi_10 b )
     1.95419200E-03    2     1000023         5   # BR(~b_2 -> ~chi_20 b )
     2.08856383E-03    2     1000025         5   # BR(~b_2 -> ~chi_30 b )
     4.51387935E-04    2     1000035         5   # BR(~b_2 -> ~chi_40 b )
     6.65354920E-03    2    -1000024         6   # BR(~b_2 -> ~chi_1- t )
     9.10581960E-04    2    -1000037         6   # BR(~b_2 -> ~chi_2- t )
     9.78453114E-01    2     1000021         5   # BR(~b_2 -> ~g      b )
     1.26593341E-04    2     1000006       -24   # BR(~b_2 -> ~t_1    W-)
#
#         PDG            Width
DECAY   1000002     3.30420398E+02   # sup_L decays
#          BR         NDA      ID1       ID2
     2.26184160E-03    2     1000022         2   # BR(~u_L -> ~chi_10 u)
     8.62048567E-05    2     1000023         2   # BR(~u_L -> ~chi_20 u)
     3.30178447E-06    2     1000025         2   # BR(~u_L -> ~chi_30 u)
     2.35521246E-02    2     1000035         2   # BR(~u_L -> ~chi_40 u)
     2.50495327E-04    2     1000024         1   # BR(~u_L -> ~chi_1+ d)
     4.70607562E-02    2     1000037         1   # BR(~u_L -> ~chi_2+ d)
     9.26785276E-01    2     1000021         2   # BR(~u_L -> ~g      u)
#
#         PDG            Width
DECAY   2000002     3.16860916E+02   # sup_R decays
#          BR         NDA      ID1       ID2
     3.75618773E-02    2     1000022         2   # BR(~u_R -> ~chi_10 u)
     6.55860856E-06    2     1000023         2   # BR(~u_R -> ~chi_20 u)
     8.79364055E-06    2     1000025         2   # BR(~u_R -> ~chi_30 u)
     4.29306907E-09    2     1000035         2   # BR(~u_R -> ~chi_40 u)
     9.62422766E-01    2     1000021         2   # BR(~u_R -> ~g      u)
#
#         PDG            Width
DECAY   1000001     3.30432376E+02   # sdown_L decays
#          BR         NDA      ID1       ID2
     2.25659552E-03    2     1000022         1   # BR(~d_L -> ~chi_10 d)
     6.44419517E-05    2     1000023         1   # BR(~d_L -> ~chi_20 d)
     1.07154119E-05    2     1000025         1   # BR(~d_L -> ~chi_30 d)
     2.35685459E-02    2     1000035         1   # BR(~d_L -> ~chi_40 d)
     7.44977266E-05    2    -1000024         2   # BR(~d_L -> ~chi_1- u)
     4.71689595E-02    2    -1000037         2   # BR(~d_L -> ~chi_2- u)
     9.26856244E-01    2     1000021         1   # BR(~d_L -> ~g      d)
#
#         PDG            Width
DECAY   2000001     3.07950570E+02   # sdown_R decays
#          BR         NDA      ID1       ID2
     9.66269485E-03    2     1000022         1   # BR(~d_R -> ~chi_10 d)
     1.68724425E-06    2     1000023         1   # BR(~d_R -> ~chi_20 d)
     2.26222089E-06    2     1000025         1   # BR(~d_R -> ~chi_30 d)
     1.10451922E-09    2     1000035         1   # BR(~d_R -> ~chi_40 d)
     9.90333355E-01    2     1000021         1   # BR(~d_R -> ~g      d)
#
#         PDG            Width
DECAY   1000004     3.30420398E+02   # scharm_L decays
#          BR         NDA      ID1       ID2
     2.26184160E-03    2     1000022         4   # BR(~c_L -> ~chi_10 c)
     8.62048567E-05    2     1000023         4   # BR(~c_L -> ~chi_20 c)
     3.30178447E-06    2     1000025         4   # BR(~c_L -> ~chi_30 c)
     2.35521246E-02    2     1000035         4   # BR(~c_L -> ~chi_40 c)
     2.50495327E-04    2     1000024         3   # BR(~c_L -> ~chi_1+ s)
     4.70607562E-02    2     1000037         3   # BR(~c_L -> ~chi_2+ s)
     9.26785276E-01    2     1000021         4   # BR(~c_L -> ~g      c)
#
#         PDG            Width
DECAY   2000004     3.16860916E+02   # scharm_R decays
#          BR         NDA      ID1       ID2
     3.75618773E-02    2     1000022         4   # BR(~c_R -> ~chi_10 c)
     6.55860856E-06    2     1000023         4   # BR(~c_R -> ~chi_20 c)
     8.79364055E-06    2     1000025         4   # BR(~c_R -> ~chi_30 c)
     4.29306907E-09    2     1000035         4   # BR(~c_R -> ~chi_40 c)
     9.62422766E-01    2     1000021         4   # BR(~c_R -> ~g      c)
#
#         PDG            Width
DECAY   1000003     3.30432376E+02   # sstrange_L decays
#          BR         NDA      ID1       ID2
     2.25659552E-03    2     1000022         3   # BR(~s_L -> ~chi_10 s)
     6.44419517E-05    2     1000023         3   # BR(~s_L -> ~chi_20 s)
     1.07154119E-05    2     1000025         3   # BR(~s_L -> ~chi_30 s)
     2.35685459E-02    2     1000035         3   # BR(~s_L -> ~chi_40 s)
     7.44977266E-05    2    -1000024         4   # BR(~s_L -> ~chi_1- c)
     4.71689595E-02    2    -1000037         4   # BR(~s_L -> ~chi_2- c)
     9.26856244E-01    2     1000021         3   # BR(~s_L -> ~g      s)
#
#         PDG            Width
DECAY   2000003     3.07950570E+02   # sstrange_R decays
#          BR         NDA      ID1       ID2
     9.66269485E-03    2     1000022         3   # BR(~s_R -> ~chi_10 s)
     1.68724425E-06    2     1000023         3   # BR(~s_R -> ~chi_20 s)
     2.26222089E-06    2     1000025         3   # BR(~s_R -> ~chi_30 s)
     1.10451922E-09    2     1000035         3   # BR(~s_R -> ~chi_40 s)
     9.90333355E-01    2     1000021         3   # BR(~s_R -> ~g      s)
#
#         PDG            Width
DECAY   1000011     3.02259467E+01   # selectron_L decays
#          BR         NDA      ID1       ID2
     2.26833243E-01    2     1000022        11   # BR(~e_L -> ~chi_10 e-)
     1.23241684E-03    2     1000023        11   # BR(~e_L -> ~chi_20 e-)
     1.44445199E-06    2     1000025        11   # BR(~e_L -> ~chi_30 e-)
     2.56776513E-01    2     1000035        11   # BR(~e_L -> ~chi_40 e-)
     8.26005014E-04    2    -1000024        12   # BR(~e_L -> ~chi_1- nu_e)
     5.14330377E-01    2    -1000037        12   # BR(~e_L -> ~chi_2- nu_e)
#
#         PDG            Width
DECAY   2000011     2.73534525E+01   # selectron_R decays
#          BR         NDA      ID1       ID2
     9.99593428E-01    2     1000022        11   # BR(~e_R -> ~chi_10 e-)
     1.73644790E-04    2     1000023        11   # BR(~e_R -> ~chi_20 e-)
     2.32815033E-04    2     1000025        11   # BR(~e_R -> ~chi_30 e-)
     1.11939236E-07    2     1000035        11   # BR(~e_R -> ~chi_40 e-)
#
#         PDG            Width
DECAY   1000013     3.02259467E+01   # smuon_L decays
#          BR         NDA      ID1       ID2
     2.26833243E-01    2     1000022        13   # BR(~mu_L -> ~chi_10 mu-)
     1.23241684E-03    2     1000023        13   # BR(~mu_L -> ~chi_20 mu-)
     1.44445199E-06    2     1000025        13   # BR(~mu_L -> ~chi_30 mu-)
     2.56776513E-01    2     1000035        13   # BR(~mu_L -> ~chi_40 mu-)
     8.26005014E-04    2    -1000024        14   # BR(~mu_L -> ~chi_1- nu_mu)
     5.14330377E-01    2    -1000037        14   # BR(~mu_L -> ~chi_2- nu_mu)
#
#         PDG            Width
DECAY   2000013     2.73534525E+01   # smuon_R decays
#          BR         NDA      ID1       ID2
     9.99593428E-01    2     1000022        13   # BR(~mu_R -> ~chi_10 mu-)
     1.73644790E-04    2     1000023        13   # BR(~mu_R -> ~chi_20 mu-)
     2.32815033E-04    2     1000025        13   # BR(~mu_R -> ~chi_30 mu-)
     1.11939236E-07    2     1000035        13   # BR(~mu_R -> ~chi_40 mu-)
#
#         PDG            Width
DECAY   1000015     2.88302828E+01   # stau_1 decays
#          BR         NDA      ID1       ID2
     9.17872898E-01    2     1000022        15   # BR(~tau_1 -> ~chi_10  tau-)
     1.30031056E-02    2     1000023        15   # BR(~tau_1 -> ~chi_20  tau-)
     1.12534431E-02    2     1000025        15   # BR(~tau_1 -> ~chi_30  tau-)
     1.11502818E-02    2     1000035        15   # BR(~tau_1 -> ~chi_40  tau-)
     2.43839249E-02    2    -1000024        16   # BR(~tau_1 -> ~chi_1-  nu_tau)
     2.23363462E-02    2    -1000037        16   # BR(~tau_1 -> ~chi_2-  nu_tau)
#
#         PDG            Width
DECAY   2000015     3.07756479E+01   # stau_2 decays
#          BR         NDA      ID1       ID2
     2.51181888E-01    2     1000022        15   # BR(~tau_2 -> ~chi_10  tau-)
     1.12842883E-02    2     1000023        15   # BR(~tau_2 -> ~chi_20  tau-)
     1.17511532E-02    2     1000025        15   # BR(~tau_2 -> ~chi_30  tau-)
     2.41683103E-01    2     1000035        15   # BR(~tau_2 -> ~chi_40  tau-)
     1.05276412E-05    2    -1000024        16   # BR(~tau_2 -> ~chi_1-  nu_tau)
     4.84089040E-01    2    -1000037        16   # BR(~tau_2 -> ~chi_2-  nu_tau)
#
#         PDG            Width
DECAY   1000012     3.02271886E+01   # snu_eL decays
#          BR         NDA      ID1       ID2
     2.26601173E-01    2     1000022        12   # BR(~nu_eL -> ~chi_10 nu_e)
     5.07990833E-04    2     1000023        12   # BR(~nu_eL -> ~chi_20 nu_e)
     2.47938146E-04    2     1000025        12   # BR(~nu_eL -> ~chi_30 nu_e)
     2.56924786E-01    2     1000035        12   # BR(~nu_eL -> ~chi_40 nu_e)
     2.77674785E-03    2     1000024        11   # BR(~nu_eL -> ~chi_1+ e-)
     5.12941364E-01    2     1000037        11   # BR(~nu_eL -> ~chi_2+ e-)
#
#         PDG            Width
DECAY   1000014     3.02271886E+01   # snu_muL decays
#          BR         NDA      ID1       ID2
     2.26601173E-01    2     1000022        14   # BR(~nu_muL -> ~chi_10 nu_mu)
     5.07990833E-04    2     1000023        14   # BR(~nu_muL -> ~chi_20 nu_mu)
     2.47938146E-04    2     1000025        14   # BR(~nu_muL -> ~chi_30 nu_mu)
     2.56924786E-01    2     1000035        14   # BR(~nu_muL -> ~chi_40 nu_mu)
     2.77674785E-03    2     1000024        13   # BR(~nu_muL -> ~chi_1+ mu-)
     5.12941364E-01    2     1000037        13   # BR(~nu_muL -> ~chi_2+ mu-)
#
#         PDG            Width
DECAY   1000016     3.08999408E+01   # snu_tauL decays
#          BR         NDA      ID1       ID2
     2.21644160E-01    2     1000022        16   # BR(~nu_tauL -> ~chi_10 nu_tau)
     4.96843150E-04    2     1000023        16   # BR(~nu_tauL -> ~chi_20 nu_tau)
     2.42497169E-04    2     1000025        16   # BR(~nu_tauL -> ~chi_30 nu_tau)
     2.51240540E-01    2     1000035        16   # BR(~nu_tauL -> ~chi_40 nu_tau)
     2.47764434E-02    2     1000024        15   # BR(~nu_tauL -> ~chi_1+ tau-)
     5.01599517E-01    2     1000037        15   # BR(~nu_tauL -> ~chi_2+ tau-)
#
#         PDG            Width
DECAY   1000024     1.17343639E+00   # chargino1+ decays
#          BR         NDA      ID1       ID2
     1.00000000E+00    2     1000022        24   # BR(~chi_1+ -> ~chi_10  W+)
#
#         PDG            Width
DECAY   1000037     1.61116405E+01   # chargino2+ decays
#          BR         NDA      ID1       ID2
     2.52118879E-01    2     1000024        23   # BR(~chi_2+ -> ~chi_1+  Z )
     4.06621069E-04    2     1000022        24   # BR(~chi_2+ -> ~chi_10  W+)
     2.44920603E-01    2     1000023        24   # BR(~chi_2+ -> ~chi_20  W+)
     2.43062419E-01    2     1000025        24   # BR(~chi_2+ -> ~chi_30  W+)
     2.59491391E-01    2     1000024        25   # BR(~chi_2+ -> ~chi_1+  h )
     8.63683863E-08    2     1000022        37   # BR(~chi_2+ -> ~chi_10  H+)
#
#         PDG            Width
DECAY   1000022     0.00000000E+00   # neutralino1 decays
#
#         PDG            Width
DECAY   1000023     1.23530757E+00   # neutralino2 decays
#          BR         NDA      ID1       ID2
     5.64061713E-01    2     1000022        23   # BR(~chi_20 -> ~chi_10   Z )
     4.35938287E-01    2     1000022        25   # BR(~chi_20 -> ~chi_10   h )
#
#         PDG            Width
DECAY   1000025     1.25003942E+00   # neutralino3 decays
#          BR         NDA      ID1       ID2
     4.17100282E-01    2     1000022        23   # BR(~chi_30 -> ~chi_10   Z )
     5.82899718E-01    2     1000022        25   # BR(~chi_30 -> ~chi_10   h )
#
#         PDG            Width
DECAY   1000035     1.60784335E+01   # neutralino4 decays
#          BR         NDA      ID1       ID2
     1.76090748E-04    2     1000022        23   # BR(~chi_40 -> ~chi_10   Z )
     2.03985324E-02    2     1000023        23   # BR(~chi_40 -> ~chi_20   Z )
     2.31987962E-01    2     1000025        23   # BR(~chi_40 -> ~chi_30   Z )
     2.43807008E-01    2     1000024       -24   # BR(~chi_40 -> ~chi_1+   W-)
     2.43807008E-01    2    -1000024        24   # BR(~chi_40 -> ~chi_1-   W+)
     2.45962200E-04    2     1000022        25   # BR(~chi_40 -> ~chi_10   h )
     7.13876207E-08    2     1000022        35   # BR(~chi_40 -> ~chi_10   H )
     1.82490167E-08    2     1000022        36   # BR(~chi_40 -> ~chi_10   A )
     2.39400826E-01    2     1000023        25   # BR(~chi_40 -> ~chi_20   h )
     2.01765214E-02    2     1000025        25   # BR(~chi_40 -> ~chi_30   h )
#
#         PDG            Width
DECAY        25     4.00919291E-03   # h decays
#          BR         NDA      ID1       ID2
     6.14309195E-01    2           5        -5   # BR(h -> b       bb     )
     6.44855312E-02    2         -15        15   # BR(h -> tau+    tau-   )
     2.28303930E-04    2         -13        13   # BR(h -> mu+     mu-    )
     4.84281008E-04    2           3        -3   # BR(h -> s       sb     )
     2.09881788E-02    2           4        -4   # BR(h -> c       cb     )
     6.74476447E-02    2          21        21   # BR(h -> g       g      )
     2.31050828E-03    2          22        22   # BR(h -> gam     gam    )
     1.45750061E-03    2          22        23   # BR(h -> Z       gam    )
     2.04104163E-01    2          24       -24   # BR(h -> W+      W-     )
     2.41647942E-02    2          23        23   # BR(h -> Z       Z      )
     1.98988367E-05    2     1000022   1000022   # BR(h -> ~chi_10 ~chi_10)
#
#         PDG            Width
DECAY        35     6.51982122E+00   # H decays
#          BR         NDA      ID1       ID2
     5.02860123E-01    2           5        -5   # BR(H -> b       bb     )
     8.55310743E-02    2         -15        15   # BR(H -> tau+    tau-   )
     3.02444673E-04    2         -13        13   # BR(H -> mu+     mu-    )
     3.70751005E-04    2           3        -3   # BR(H -> s       sb     )
     2.06954578E-06    2           4        -4   # BR(H -> c       cb     )
     2.06764007E-01    2           6        -6   # BR(H -> t       tb     )
     6.85559154E-05    2          21        21   # BR(H -> g       g      )
     3.92321636E-07    2          22        22   # BR(H -> gam     gam    )
     1.22014663E-07    2          23        22   # BR(H -> Z       gam    )
     8.92412432E-05    2          24       -24   # BR(H -> W+      W-     )
     4.45641413E-05    2          23        23   # BR(H -> Z       Z      )
     3.45544568E-04    2          25        25   # BR(H -> h       h      )
     4.79729586E-23    2          36        36   # BR(H -> A       A      )
     3.55864304E-19    2          23        36   # BR(H -> Z       A      )
     6.14402495E-04    2     1000022   1000022   # BR(H -> ~chi_10 ~chi_10)
     1.19099580E-01    2     1000022   1000023   # BR(H -> ~chi_10 ~chi_20)
     8.39071276E-02    2     1000022   1000025   # BR(H -> ~chi_10 ~chi_30)
#
#         PDG            Width
DECAY        36     6.52309215E+00   # A decays
#          BR         NDA      ID1       ID2
     5.02776614E-01    2           5        -5   # BR(A -> b       bb     )
     8.54907545E-02    2         -15        15   # BR(A -> tau+    tau-   )
     3.02301676E-04    2         -13        13   # BR(A -> mu+     mu-    )
     3.70846182E-04    2           3        -3   # BR(A -> s       sb     )
     2.07731663E-06    2           4        -4   # BR(A -> c       cb     )
     2.07425874E-01    2           6        -6   # BR(A -> t       tb     )
     2.05349193E-04    2          21        21   # BR(A -> g       g      )
     3.93267779E-07    2          22        22   # BR(A -> gam     gam    )
     2.48645848E-07    2          23        22   # BR(A -> Z       gam    )
     8.88626394E-05    2          23        25   # BR(A -> Z       h      )
     6.34455854E-04    2     1000022   1000022   # BR(A -> ~chi_10 ~chi_10)
     8.49105400E-02    2     1000022   1000023   # BR(A -> ~chi_10 ~chi_20)
     1.17791683E-01    2     1000022   1000025   # BR(A -> ~chi_10 ~chi_30)
#
#         PDG            Width
DECAY        37     6.50613015E+00   # H+ decays
#          BR         NDA      ID1       ID2
     8.07197730E-04    2           4        -5   # BR(H+ -> c       bb     )
     8.57386152E-02    2         -15        16   # BR(H+ -> tau+    nu_tau )
     3.03178130E-04    2         -13        14   # BR(H+ -> mu+     nu_mu  )
     5.16603906E-06    2           2        -5   # BR(H+ -> u       bb     )
     1.77898603E-05    2           2        -3   # BR(H+ -> u       sb     )
     3.67891563E-04    2           4        -3   # BR(H+ -> c       sb     )
     7.08108110E-01    2           6        -5   # BR(H+ -> t       bb     )
     8.92294422E-05    2          24        25   # BR(H+ -> W+      h      )
     1.03192892E-13    2          24        36   # BR(H+ -> W+      A      )
     2.04562822E-01    2     1000024   1000022   # BR(H+ -> ~chi_1+ ~chi_10)
