#
#                              ======================
#                              | THE SUSYHIT OUTPUT |
#                              ======================
#
#
#              ------------------------------------------------------
#              |     This is the output of the SUSY-HIT package     |
#              |  created by A.Djouadi, M.Muehlleitner and M.Spira. |
#              |  In case of problems with SUSY-HIT email to        |
#              |           margarete.muehlleitner@kit.edu           |
#              |           michael.spira@psi.ch                     |
#              |           abdelhak.djouadi@cern.ch                 |
#              ------------------------------------------------------
#
#              ------------------------------------------------------
#              |  SUSY Les Houches Accord - MSSM Spectrum + Decays  |
#              |              based on the decay programs           |
#              |                                                    |
#              |                     SDECAY 1.5                     |
#              |                                                    |
#              |  Authors: M.Muhlleitner, A.Djouadi and Y.Mambrini  |
#              |  Ref.:    Comput.Phys.Commun.168(2005)46           |
#              |           [hep-ph/0311167]                         |
#              |                                                    |
#              |                     HDECAY 3.4                     |
#              |                                                    |
#              |  By: A.Djouadi,J.Kalinowski,M.Muhlleitner,M.Spira  |
#              |  Ref.:    Comput.Phys.Commun.108(1998)56           |
#              |           [hep-ph/9704448]                         |
#              |                                                    |
#              |                                                    |
#              |  If not stated otherwise all DRbar couplings and   |
#              |  soft SUSY breaking masses are given at the scale  |
#              |  Q=  0.91187600E+02
#              |                                                    |
#              ------------------------------------------------------
#
#
BLOCK DCINFO  # Decay Program information
     1   SDECAY/HDECAY # decay calculator
     2   1.5  /3.4    # version number
#
BLOCK SPINFO  # Spectrum calculator information
     1   SuSpect     # RGE +Spectrum calculator            
     2   2.43         # version number                     
#
BLOCK MODSEL  # Model selection
     1     2   # GMSB                                              
#
BLOCK SMINPUTS  # Standard Model inputs
         1     1.27932904E+02   # alpha_em^-1(M_Z)^MSbar
         2     1.16639000E-05   # G_F [GeV^-2]
         3     1.17200000E-01   # alpha_S(M_Z)^MSbar
         4     9.11870000E+01   # M_Z pole mass
         5     4.25000000E+00   # mb(mb)^MSbar
         6     1.72900000E+02   # mt pole mass
         7     1.77700000E+00   # mtau pole mass
#
BLOCK MINPAR  # Input parameters - minimal models
#
BLOCK EXTPAR  # Input parameters - non-minimal models
         0     9.11876000E+01   # EWSB                
         1     6.57000000E+02   # M_1                 
         2     3.00000000E+03   # M_2                 
         3     1.70000000E+03   # M_3                 
        11     0.00000000E+00   # A_t                 
        12     0.00000000E+00   # A_b                 
        13     0.00000000E+00   # A_tau               
        14     0.00000000E+00   # A_u                 
        15     0.00000000E+00   # A_d                 
        16     0.00000000E+00   # A_e                 
        23     6.50000000E+02   # mu(EWSB)            
        25     1.50000000E+00   # tanbeta(in)         
        26     2.00000000E+03   # MA_pole             
        31     5.00000000E+03   # M_eL                
        32     5.00000000E+03   # M_muL               
        33     5.00000000E+03   # M_tauL              
        34     5.00000000E+03   # M_eR                
        35     5.00000000E+03   # M_muR               
        36     5.00000000E+03   # M_tauR              
        41     5.00000000E+03   # M_q1L               
        42     5.00000000E+03   # M_q2L               
        43     5.00000000E+03   # M_q3L               
        44     5.00000000E+03   # M_uR                
        45     5.00000000E+03   # M_cR                
        46     5.00000000E+03   # M_tR                
        47     5.00000000E+03   # M_dR                
        48     5.00000000E+03   # M_sR                
        49     5.00000000E+03   # M_bR                
#
BLOCK MASS  # Mass Spectrum
# PDG code           mass       particle
        24     8.05394392E+01   # W+
        25     1.26000000E+02   # h
        35     2.00420491E+03   # H
        36     2.00000000E+03   # A
        37     2.00178614E+03   # H+
         5     4.87877839E+00   # b-quark pole mass calculated from mb(mb)_Msbar
   1000001     4.97172766E+03   # ~d_L
   2000001     4.97161780E+03   # ~d_R
   1000002     4.97148208E+03   # ~u_L
   2000002     4.97154023E+03   # ~u_R
   1000003     4.97172766E+03   # ~s_L
   2000003     4.97161780E+03   # ~s_R
   1000004     4.97148208E+03   # ~c_L
   2000004     4.97154023E+03   # ~c_R
   1000005     4.97140039E+03   # ~b_1
   2000005     4.97194653E+03   # ~b_2
   1000006     5.09997031E+03   # ~t_1
   2000006     5.39906247E+03   # ~t_2
   1000011     5.00008233E+03   # ~e_L
   2000011     5.00007602E+03   # ~e_R
   1000012     4.99984164E+03   # ~nu_eL
   1000013     5.00008233E+03   # ~mu_L
   2000013     5.00007602E+03   # ~mu_R
   1000014     4.99984164E+03   # ~nu_muL
   1000015     4.99990613E+03   # ~tau_1
   2000015     5.00025285E+03   # ~tau_2
   1000016     4.99984164E+03   # ~nu_tauL
   1000021     1.79544333E+03   # ~g
   1000022     6.51774823E+02   # ~chi_10
   1000023    -6.96958032E+02   # ~chi_20
   1000025     7.38937666E+02   # ~chi_30
   1000035     3.12900881E+03   # ~chi_40
   1000024     6.94429214E+02   # ~chi_1+
   1000037     3.12900808E+03   # ~chi_2+
   1000039     1.00000000E-09   # ~gravitino
#
BLOCK NMIX  # Neutralino Mixing Matrix
  1  1     6.99016589E-01   # N_11
  1  2    -2.23736209E-02   # N_12
  1  3     5.08774755E-01   # N_13
  1  4    -5.02019399E-01   # N_14
  2  1     6.27125703E-03   # N_21
  2  2    -4.06604677E-03   # N_22
  2  3    -7.06788253E-01   # N_23
  2  4    -7.07385683E-01   # N_24
  3  1     7.15077713E-01   # N_31
  3  2     2.27257880E-02   # N_32
  3  3    -4.91132648E-01   # N_33
  3  4     4.96926680E-01   # N_34
  4  1     5.85975975E-04   # N_41
  4  2    -9.99483080E-01   # N_42
  4  3    -1.96808493E-02   # N_43
  4  4     2.54144426E-02   # N_44
#
BLOCK UMIX  # Chargino Mixing Matrix U
  1  1    -2.78219802E-02   # U_11
  1  2     9.99612894E-01   # U_12
  2  1     9.99612894E-01   # U_21
  2  2     2.78219802E-02   # U_22
#
BLOCK VMIX  # Chargino Mixing Matrix V
  1  1    -3.59330851E-02   # V_11
  1  2     9.99354198E-01   # V_12
  2  1     9.99354198E-01   # V_21
  2  2     3.59330851E-02   # V_22
#
BLOCK STOPMIX  # Stop Mixing Matrix
  1  1     9.99940131E-01   # cos(theta_t)
  1  2    -1.09423222E-02   # sin(theta_t)
  2  1     1.09423222E-02   # -sin(theta_t)
  2  2     9.99940131E-01   # cos(theta_t)
#
BLOCK SBOTMIX  # Sbottom Mixing Matrix
  1  1     6.31999647E-01   # cos(theta_b)
  1  2     7.74968674E-01   # sin(theta_b)
  2  1    -7.74968674E-01   # -sin(theta_b)
  2  2     6.31999647E-01   # cos(theta_b)
#
BLOCK STAUMIX  # Stau Mixing Matrix
  1  1     7.00650638E-01   # cos(theta_tau)
  1  2     7.13504508E-01   # sin(theta_tau)
  2  1    -7.13504508E-01   # -sin(theta_tau)
  2  2     7.00650638E-01   # cos(theta_tau)
#
BLOCK ALPHA  # Higgs mixing
          -5.90208352E-01   # Mixing angle in the neutral Higgs boson sector
#
BLOCK HMIX Q=  9.11876000E+01  # DRbar Higgs Parameters
         1     6.50000000E+02   # mu(Q)               
         2     1.49999979E+00   # tanbeta(Q)          
         3     2.51969853E+02   # vev(Q)              
         4     3.67747330E+06   # MA^2(Q)             
#
BLOCK GAUGE Q=  9.11876000E+01  # The gauge couplings
     1     3.52896794E-01   # gprime(Q) DRbar
     2     6.27898469E-01   # g(Q) DRbar
     3     1.08305254E+00   # g3(Q) DRbar
#
BLOCK AU Q=  9.11876000E+01  # The trilinear couplings
  1  1     0.00000000E+00   # A_u(Q) DRbar
  2  2     0.00000000E+00   # A_c(Q) DRbar
  3  3     0.00000000E+00   # A_t(Q) DRbar
#
BLOCK AD Q=  9.11876000E+01  # The trilinear couplings
  1  1     0.00000000E+00   # A_d(Q) DRbar
  2  2     0.00000000E+00   # A_s(Q) DRbar
  3  3     0.00000000E+00   # A_b(Q) DRbar
#
BLOCK AE Q=  9.11876000E+01  # The trilinear couplings
  1  1     0.00000000E+00   # A_e(Q) DRbar
  2  2     0.00000000E+00   # A_mu(Q) DRbar
  3  3     0.00000000E+00   # A_tau(Q) DRbar
#
BLOCK Yu Q=  9.11876000E+01  # The Yukawa couplings
  1  1     0.00000000E+00   # y_u(Q) DRbar
  2  2     0.00000000E+00   # y_c(Q) DRbar
  3  3     1.02624924E+00   # y_t(Q) DRbar
#
BLOCK Yd Q=  9.11876000E+01  # The Yukawa couplings
  1  1     0.00000000E+00   # y_d(Q) DRbar
  2  2     0.00000000E+00   # y_s(Q) DRbar
  3  3     2.72064621E-02   # y_b(Q) DRbar
#
BLOCK Ye Q=  9.11876000E+01  # The Yukawa couplings
  1  1     0.00000000E+00   # y_e(Q) DRbar
  2  2     0.00000000E+00   # y_mu(Q) DRbar
  3  3     1.79880232E-02   # y_tau(Q) DRbar
#
BLOCK MSOFT Q=  9.11876000E+01  # The soft SUSY breaking masses at the scale Q
         1     6.57000000E+02   # M_1                 
         2     3.00000000E+03   # M_2                 
         3     1.70000000E+03   # M_3                 
        14     0.00000000E+00   # A_u                 
        15     0.00000000E+00   # A_d                 
        16     0.00000000E+00   # A_e                 
        21     2.58285298E+06   # M^2_Hd              
        22    -5.84046384E+06   # M^2_Hu              
        31     5.00000000E+03   # M_eL                
        32     5.00000000E+03   # M_muL               
        33     5.00000000E+03   # M_tauL              
        34     5.00000000E+03   # M_eR                
        35     5.00000000E+03   # M_muR               
        36     5.00000000E+03   # M_tauR              
        41     5.00000000E+03   # M_q1L               
        42     5.00000000E+03   # M_q2L               
        43     5.00000000E+03   # M_q3L               
        44     5.00000000E+03   # M_uR                
        45     5.00000000E+03   # M_cR                
        46     5.00000000E+03   # M_tR                
        47     5.00000000E+03   # M_dR                
        48     5.00000000E+03   # M_sR                
        49     5.00000000E+03   # M_bR                
#
#
#
#                             =================
#                             |The decay table|
#                             =================
#
# - The QCD corrections to the decays gluino -> squark  + quark
#                                     squark -> gaugino + quark_prime
#                                     squark -> squark_prime + Higgs
#                                     squark -> gluino  + quark
#   are included.
#
# - The multi-body decays for the inos, stops and sbottoms are included.
#
# - The loop induced decays for the gluino, neutralinos and stops
#   are included.
#
# - The SUSY decays of the top quark are included.
#
# - Possible decays of the NLSP in GMSB models are included.
#
#
#         PDG            Width
DECAY         6     1.37371815E+00   # top decays
#          BR         NDA      ID1       ID2
     1.00000000E+00    2           5        24   # BR(t ->  b    W+)
#
#         PDG            Width
DECAY   1000021     7.48681321E-04   # gluino decays
#          BR         NDA      ID1       ID2
     8.98794139E-03    2     1000022        21   # BR(~g -> ~chi_10 g)
     1.65003435E-02    2     1000023        21   # BR(~g -> ~chi_20 g)
     7.40397668E-03    2     1000025        21   # BR(~g -> ~chi_30 g)
#          BR         NDA      ID1       ID2
0.0E+00    2     1000039    21 # BR(~g -> ~G      g)
#           BR         NDA      ID1       ID2       ID3
     5.64901678E-03    3     1000022         1        -1   # BR(~g -> ~chi_10 d  db)
     7.53823256E-07    3     1000023         1        -1   # BR(~g -> ~chi_20 d  db)
     4.02367677E-03    3     1000025         1        -1   # BR(~g -> ~chi_30 d  db)
     1.75532820E-02    3     1000022         2        -2   # BR(~g -> ~chi_10 u  ub)
     6.95792801E-07    3     1000023         2        -2   # BR(~g -> ~chi_20 u  ub)
     1.49033860E-02    3     1000025         2        -2   # BR(~g -> ~chi_30 u  ub)
     5.64901678E-03    3     1000022         3        -3   # BR(~g -> ~chi_10 s  sb)
     7.53823256E-07    3     1000023         3        -3   # BR(~g -> ~chi_20 s  sb)
     4.02367677E-03    3     1000025         3        -3   # BR(~g -> ~chi_30 s  sb)
     1.75532820E-02    3     1000022         4        -4   # BR(~g -> ~chi_10 c  cb)
     6.95792801E-07    3     1000023         4        -4   # BR(~g -> ~chi_20 c  cb)
     1.49033860E-02    3     1000025         4        -4   # BR(~g -> ~chi_30 c  cb)
     5.74734283E-03    3     1000022         5        -5   # BR(~g -> ~chi_10 b  bb)
     2.17746045E-04    3     1000023         5        -5   # BR(~g -> ~chi_20 b  bb)
     4.13550869E-03    3     1000025         5        -5   # BR(~g -> ~chi_30 b  bb)
     1.05750104E-01    3     1000022         6        -6   # BR(~g -> ~chi_10 t  tb)
     1.75259050E-01    3     1000023         6        -6   # BR(~g -> ~chi_20 t  tb)
     1.05904563E-01    3     1000025         6        -6   # BR(~g -> ~chi_30 t  tb)
     1.11680320E-04    3     1000024         1        -2   # BR(~g -> ~chi_1+ d  ub)
     1.11680320E-04    3    -1000024         2        -1   # BR(~g -> ~chi_1- u  db)
     1.11680320E-04    3     1000024         3        -4   # BR(~g -> ~chi_1+ s  cb)
     1.11680320E-04    3    -1000024         4        -3   # BR(~g -> ~chi_1- c  sb)
     2.28346966E-01    3     1000024         5        -6   # BR(~g -> ~chi_1+ b  tb)
     2.28346966E-01    3    -1000024         6        -5   # BR(~g -> ~chi_1- t  bb)
#
#         PDG            Width
DECAY   1000006     3.02704268E+02   # stop1 decays
#          BR         NDA      ID1       ID2
     5.81765420E-02    2     1000022         6   # BR(~t_1 -> ~chi_10 t )
     1.16692454E-01    2     1000023         6   # BR(~t_1 -> ~chi_20 t )
     6.03905571E-02    2     1000025         6   # BR(~t_1 -> ~chi_30 t )
     2.50455931E-02    2     1000035         6   # BR(~t_1 -> ~chi_40 t )
     6.52455330E-05    2     1000024         5   # BR(~t_1 -> ~chi_1+ b )
     4.98778333E-02    2     1000037         5   # BR(~t_1 -> ~chi_2+ b )
     6.72820898E-01    2     1000021         6   # BR(~t_1 -> ~g      t )
     6.84739849E-03    2     1000005        24   # BR(~t_1 -> ~b_1    W+)
     1.00834793E-02    2     2000005        24   # BR(~t_1 -> ~b_2    W+)
#
#         PDG            Width
DECAY   2000006     3.81453994E+02   # stop2 decays
#          BR         NDA      ID1       ID2
     6.54430550E-02    2     1000022         6   # BR(~t_2 -> ~chi_10 t )
     9.89625044E-02    2     1000023         6   # BR(~t_2 -> ~chi_20 t )
     6.23275156E-02    2     1000025         6   # BR(~t_2 -> ~chi_30 t )
    -1.40481897E-05    2     1000035         6   # BR(~t_2 -> ~chi_40 t )
     1.98117691E-01    2     1000024         5   # BR(~t_2 -> ~chi_1+ b )
    -2.78843164E-05    2     1000037         5   # BR(~t_2 -> ~chi_2+ b )
     5.75150781E-01    2     1000021         6   # BR(~t_2 -> ~g      t )
    -7.56966451E-05    2     1000006        25   # BR(~t_2 -> ~t_1    h )
     1.73191362E-05    2     1000006        23   # BR(~t_2 -> ~t_1    Z )
     3.95053288E-05    2     1000005        24   # BR(~t_2 -> ~b_1    W+)
     5.92574287E-05    2     2000005        24   # BR(~t_2 -> ~b_2    W+)
#
#         PDG            Width
DECAY   1000005     2.25059728E+02   # sbottom1 decays
#          BR         NDA      ID1       ID2
     5.30591755E-03    2     1000022         5   # BR(~b_1 -> ~chi_10 b )
     8.79072334E-05    2     1000023         5   # BR(~b_1 -> ~chi_20 b )
     3.58285108E-03    2     1000025         5   # BR(~b_1 -> ~chi_30 b )
     9.48600241E-03    2     1000035         5   # BR(~b_1 -> ~chi_40 b )
     8.41248489E-02    2    -1000024         6   # BR(~b_1 -> ~chi_1- t )
     1.90471288E-02    2    -1000037         6   # BR(~b_1 -> ~chi_2- t )
     8.78365344E-01    2     1000021         5   # BR(~b_1 -> ~g      b )
#
#         PDG            Width
DECAY   2000005     2.62993843E+02   # sbottom2 decays
#          BR         NDA      ID1       ID2
     1.92055988E-03    2     1000022         5   # BR(~b_2 -> ~chi_10 b )
     1.12066026E-04    2     1000023         5   # BR(~b_2 -> ~chi_20 b )
     2.78166796E-03    2     1000025         5   # BR(~b_2 -> ~chi_30 b )
     1.80865309E-02    2     1000035         5   # BR(~b_2 -> ~chi_40 b )
     1.89489739E-01    2    -1000024         6   # BR(~b_2 -> ~chi_1- t )
     3.63311274E-02    2    -1000037         6   # BR(~b_2 -> ~chi_2- t )
     7.51278309E-01    2     1000021         5   # BR(~b_2 -> ~g      b )
#
#         PDG            Width
DECAY   1000002     2.18985188E+02   # sup_L decays
#          BR         NDA      ID1       ID2
     9.78454873E-04    2     1000022         2   # BR(~u_L -> ~chi_10 u)
     6.90265208E-07    2     1000023         2   # BR(~u_L -> ~chi_20 u)
     2.01749471E-03    2     1000025         2   # BR(~u_L -> ~chi_30 u)
     3.14497809E-02    2     1000035         2   # BR(~u_L -> ~chi_40 u)
     2.13310336E-04    2     1000024         1   # BR(~u_L -> ~chi_1+ d)
     6.28971953E-02    2     1000037         1   # BR(~u_L -> ~chi_2+ d)
     9.02443074E-01    2     1000021         2   # BR(~u_L -> ~g      u)
#
#         PDG            Width
DECAY   2000002     2.07779584E+02   # sup_R decays
#          BR         NDA      ID1       ID2
     2.39999640E-02    2     1000022         2   # BR(~u_R -> ~chi_10 u)
     1.92215685E-06    2     1000023         2   # BR(~u_R -> ~chi_20 u)
     2.48682539E-02    2     1000025         2   # BR(~u_R -> ~chi_30 u)
     6.39949894E-09    2     1000035         2   # BR(~u_R -> ~chi_40 u)
     9.51129853E-01    2     1000021         2   # BR(~u_R -> ~g      u)
#
#         PDG            Width
DECAY   1000001     2.18990172E+02   # sdown_L decays
#          BR         NDA      ID1       ID2
     1.95113846E-03    2     1000022         1   # BR(~d_L -> ~chi_10 d)
     2.26828164E-06    2     1000023         1   # BR(~d_L -> ~chi_20 d)
     1.01684373E-03    2     1000025         1   # BR(~d_L -> ~chi_30 d)
     3.14684817E-02    2     1000035         1   # BR(~d_L -> ~chi_40 d)
     1.27882881E-04    2    -1000024         2   # BR(~d_L -> ~chi_1- u)
     6.29395246E-02    2    -1000037         2   # BR(~d_L -> ~chi_2- u)
     9.02493860E-01    2     1000021         1   # BR(~d_L -> ~g      d)
#
#         PDG            Width
DECAY   2000001     2.00168896E+02   # sdown_R decays
#          BR         NDA      ID1       ID2
     6.22822342E-03    2     1000022         1   # BR(~d_R -> ~chi_10 d)
     4.98818421E-07    2     1000023         1   # BR(~d_R -> ~chi_20 d)
     6.45355509E-03    2     1000025         1   # BR(~d_R -> ~chi_30 d)
     1.66079740E-09    2     1000035         1   # BR(~d_R -> ~chi_40 d)
     9.87317721E-01    2     1000021         1   # BR(~d_R -> ~g      d)
#
#         PDG            Width
DECAY   1000004     2.18985188E+02   # scharm_L decays
#          BR         NDA      ID1       ID2
     9.78454873E-04    2     1000022         4   # BR(~c_L -> ~chi_10 c)
     6.90265208E-07    2     1000023         4   # BR(~c_L -> ~chi_20 c)
     2.01749471E-03    2     1000025         4   # BR(~c_L -> ~chi_30 c)
     3.14497809E-02    2     1000035         4   # BR(~c_L -> ~chi_40 c)
     2.13310336E-04    2     1000024         3   # BR(~c_L -> ~chi_1+ s)
     6.28971953E-02    2     1000037         3   # BR(~c_L -> ~chi_2+ s)
     9.02443074E-01    2     1000021         4   # BR(~c_L -> ~g      c)
#
#         PDG            Width
DECAY   2000004     2.07779584E+02   # scharm_R decays
#          BR         NDA      ID1       ID2
     2.39999640E-02    2     1000022         4   # BR(~c_R -> ~chi_10 c)
     1.92215685E-06    2     1000023         4   # BR(~c_R -> ~chi_20 c)
     2.48682539E-02    2     1000025         4   # BR(~c_R -> ~chi_30 c)
     6.39949894E-09    2     1000035         4   # BR(~c_R -> ~chi_40 c)
     9.51129853E-01    2     1000021         4   # BR(~c_R -> ~g      c)
#
#         PDG            Width
DECAY   1000003     2.18990172E+02   # sstrange_L decays
#          BR         NDA      ID1       ID2
     1.95113846E-03    2     1000022         3   # BR(~s_L -> ~chi_10 s)
     2.26828164E-06    2     1000023         3   # BR(~s_L -> ~chi_20 s)
     1.01684373E-03    2     1000025         3   # BR(~s_L -> ~chi_30 s)
     3.14684817E-02    2     1000035         3   # BR(~s_L -> ~chi_40 s)
     1.27882881E-04    2    -1000024         4   # BR(~s_L -> ~chi_1- c)
     6.29395246E-02    2    -1000037         4   # BR(~s_L -> ~chi_2- c)
     9.02493860E-01    2     1000021         3   # BR(~s_L -> ~g      s)
#
#         PDG            Width
DECAY   2000003     2.00168896E+02   # sstrange_R decays
#          BR         NDA      ID1       ID2
     6.22822342E-03    2     1000022         3   # BR(~s_R -> ~chi_10 s)
     4.98818421E-07    2     1000023         3   # BR(~s_R -> ~chi_20 s)
     6.45355509E-03    2     1000025         3   # BR(~s_R -> ~chi_30 s)
     1.66079740E-09    2     1000035         3   # BR(~s_R -> ~chi_40 s)
     9.87317721E-01    2     1000021         3   # BR(~s_R -> ~g      s)
#
#         PDG            Width
DECAY   1000011     2.77632552E+01   # selectron_L decays
#          BR         NDA      ID1       ID2
     9.36831249E-02    2     1000022        11   # BR(~e_L -> ~chi_10 e-)
     1.99074351E-07    2     1000023        11   # BR(~e_L -> ~chi_20 e-)
     1.21844422E-01    2     1000025        11   # BR(~e_L -> ~chi_30 e-)
     2.60980150E-01    2     1000035        11   # BR(~e_L -> ~chi_40 e-)
     1.05165732E-03    2    -1000024        12   # BR(~e_L -> ~chi_1- nu_e)
     5.22440446E-01    2    -1000037        12   # BR(~e_L -> ~chi_2- nu_e)
#
#         PDG            Width
DECAY   2000011     2.38207479E+01   # selectron_R decays
#          BR         NDA      ID1       ID2
     4.91095481E-01    2     1000022        11   # BR(~e_R -> ~chi_10 e-)
     3.93317882E-05    2     1000023        11   # BR(~e_R -> ~chi_20 e-)
     5.08865055E-01    2     1000025        11   # BR(~e_R -> ~chi_30 e-)
     1.32188008E-07    2     1000035        11   # BR(~e_R -> ~chi_40 e-)
#
#         PDG            Width
DECAY   1000013     2.77632552E+01   # smuon_L decays
#          BR         NDA      ID1       ID2
     9.36831249E-02    2     1000022        13   # BR(~mu_L -> ~chi_10 mu-)
     1.99074351E-07    2     1000023        13   # BR(~mu_L -> ~chi_20 mu-)
     1.21844422E-01    2     1000025        13   # BR(~mu_L -> ~chi_30 mu-)
     2.60980150E-01    2     1000035        13   # BR(~mu_L -> ~chi_40 mu-)
     1.05165732E-03    2    -1000024        14   # BR(~mu_L -> ~chi_1- nu_mu)
     5.22440446E-01    2    -1000037        14   # BR(~mu_L -> ~chi_2- nu_mu)
#
#         PDG            Width
DECAY   2000013     2.38207479E+01   # smuon_R decays
#          BR         NDA      ID1       ID2
     4.91095481E-01    2     1000022        13   # BR(~mu_R -> ~chi_10 mu-)
     3.93317882E-05    2     1000023        13   # BR(~mu_R -> ~chi_20 mu-)
     5.08865055E-01    2     1000025        13   # BR(~mu_R -> ~chi_30 mu-)
     1.32188008E-07    2     1000035        13   # BR(~mu_R -> ~chi_40 mu-)
#
#         PDG            Width
DECAY   1000015     2.58349900E+01   # stau_1 decays
#          BR         NDA      ID1       ID2
     2.86538713E-01    2     1000022        15   # BR(~tau_1 -> ~chi_10  tau-)
     4.58405561E-04    2     1000023        15   # BR(~tau_1 -> ~chi_20  tau-)
     2.97964485E-01    2     1000025        15   # BR(~tau_1 -> ~chi_30  tau-)
     1.37439485E-01    2     1000035        15   # BR(~tau_1 -> ~chi_40  tau-)
     2.32732054E-03    2    -1000024        16   # BR(~tau_1 -> ~chi_1-  nu_tau)
     2.75132343E-01    2    -1000037        16   # BR(~tau_1 -> ~chi_2-  nu_tau)
     1.39247486E-04    2     1000039        15   # BR(~tau_1 -> ~G       tau-)
#
#         PDG            Width
DECAY   2000015     2.58454428E+01   # stau_2 decays
#          BR         NDA      ID1       ID2
     2.67456885E-01    2     1000022        15   # BR(~tau_2 -> ~chi_10  tau-)
     7.74568474E-04    2     1000023        15   # BR(~tau_2 -> ~chi_20  tau-)
     3.02619278E-01    2     1000025        15   # BR(~tau_2 -> ~chi_30  tau-)
     1.42962524E-01    2     1000035        15   # BR(~tau_2 -> ~chi_40  tau-)
     6.64317763E-08    2    -1000024        16   # BR(~tau_2 -> ~chi_1-  nu_tau)
     2.86186678E-01    2    -1000037        16   # BR(~tau_2 -> ~chi_2-  nu_tau)
#
#         PDG            Width
DECAY   1000012     2.77626136E+01   # snu_eL decays
#          BR         NDA      ID1       ID2
     1.17675964E-01    2     1000022        12   # BR(~nu_eL -> ~chi_10 nu_e)
     3.91283373E-05    2     1000023        12   # BR(~nu_eL -> ~chi_20 nu_e)
     9.71530193E-02    2     1000025        12   # BR(~nu_eL -> ~chi_30 nu_e)
     2.61285425E-01    2     1000035        12   # BR(~nu_eL -> ~chi_40 nu_e)
     1.75418208E-03    2     1000024        11   # BR(~nu_eL -> ~chi_1+ e-)
     5.22092281E-01    2     1000037        11   # BR(~nu_eL -> ~chi_2+ e-)
#
#         PDG            Width
DECAY   1000014     2.77626136E+01   # snu_muL decays
#          BR         NDA      ID1       ID2
     1.17675964E-01    2     1000022        14   # BR(~nu_muL -> ~chi_10 nu_mu)
     3.91283373E-05    2     1000023        14   # BR(~nu_muL -> ~chi_20 nu_mu)
     9.71530193E-02    2     1000025        14   # BR(~nu_muL -> ~chi_30 nu_mu)
     2.61285425E-01    2     1000035        14   # BR(~nu_muL -> ~chi_40 nu_mu)
     1.75418208E-03    2     1000024        13   # BR(~nu_muL -> ~chi_1+ mu-)
     5.22092281E-01    2     1000037        13   # BR(~nu_muL -> ~chi_2+ mu-)
#
#         PDG            Width
DECAY   1000016     2.77935532E+01   # snu_tauL decays
#          BR         NDA      ID1       ID2
     1.17544968E-01    2     1000022        16   # BR(~nu_tauL -> ~chi_10 nu_tau)
     3.90847798E-05    2     1000023        16   # BR(~nu_tauL -> ~chi_20 nu_tau)
     9.70448690E-02    2     1000025        16   # BR(~nu_tauL -> ~chi_30 nu_tau)
     2.60994563E-01    2     1000035        16   # BR(~nu_tauL -> ~chi_40 nu_tau)
     2.86484108E-03    2     1000024        15   # BR(~nu_tauL -> ~chi_1+ tau-)
     5.21511675E-01    2     1000037        15   # BR(~nu_tauL -> ~chi_2+ tau-)
#
#         PDG            Width
DECAY   1000024     8.82214983E-05   # chargino1+ decays
#          BR         NDA      ID1       ID2
     1.00100633E-03    2     1000039        24   # BR(~chi_1+ -> ~G       W+)
#           BR         NDA      ID1       ID2       ID3
     3.33316953E-01    3     1000022         2        -1   # BR(~chi_1+ -> ~chi_10 u    db)
     3.33316953E-01    3     1000022         4        -3   # BR(~chi_1+ -> ~chi_10 c    sb)
     1.11105784E-01    3     1000022       -11        12   # BR(~chi_1+ -> ~chi_10 e+   nu_e)
     1.11105784E-01    3     1000022       -13        14   # BR(~chi_1+ -> ~chi_10 mu+  nu_mu)
     1.10153521E-01    3     1000022       -15        16   # BR(~chi_1+ -> ~chi_10 tau+ nu_tau)
#
#         PDG            Width
DECAY   1000037     3.58745769E+01   # chargino2+ decays
#          BR         NDA      ID1       ID2
     2.34616818E-01    2     1000024        23   # BR(~chi_2+ -> ~chi_1+  Z )
     1.10584454E-01    2     1000022        24   # BR(~chi_2+ -> ~chi_10  W+)
     2.28640582E-01    2     1000023        24   # BR(~chi_2+ -> ~chi_20  W+)
     1.18159000E-01    2     1000025        24   # BR(~chi_2+ -> ~chi_30  W+)
     2.35699811E-01    2     1000024        25   # BR(~chi_2+ -> ~chi_1+  h )
     1.79501447E-02    2     1000024        35   # BR(~chi_2+ -> ~chi_1+  H )
     1.81915774E-02    2     1000024        36   # BR(~chi_2+ -> ~chi_1+  A )
     1.02528076E-02    2     1000022        37   # BR(~chi_2+ -> ~chi_10  H+)
     1.79925088E-02    2     1000023        37   # BR(~chi_2+ -> ~chi_20  H+)
     7.90269884E-03    2     1000025        37   # BR(~chi_2+ -> ~chi_30  H+)
     9.59655856E-06    2     1000039        24   # BR(~chi_2+ -> ~G       W+)
     5.46872232E-10    2     1000039        37   # BR(~chi_2+ -> ~G       H+)
#
#         PDG            Width
DECAY   1000022    1.0E-05    # neutralino1 decays
#          BR         NDA      ID1       ID2
     5.02097514E-01    2     1000039        22   # BR(~chi_10 -> ~G        gam)
     4.87102641E-01    2     1000039        23   # BR(~chi_10 -> ~G        Z)
     1.07998443E-02    2     1000039        25   # BR(~chi_10 -> ~G        h)
#
#         PDG            Width
DECAY   1000023     9.50194499E-05   # neutralino2 decays
#          BR         NDA      ID1       ID2
     4.64130173E-04    2     1000022        22   # BR(~chi_20 -> ~chi_10 gam)
#          BR         NDA      ID1       ID2
     2.40586750E-08    2     1000039        22   # BR(~chi_20 -> ~G        gam)
     3.59915904E-05    2     1000039        23   # BR(~chi_20 -> ~G        Z)
     8.39551543E-04    2     1000039        25   # BR(~chi_20 -> ~G        h)
#           BR         NDA      ID1       ID2       ID3
     1.18764299E-01    3     1000022        -2         2   # BR(~chi_20 -> ~chi_10 ub      u)
     1.53757662E-01    3     1000022        -1         1   # BR(~chi_20 -> ~chi_10 db      d)
     1.18764299E-01    3     1000022        -4         4   # BR(~chi_20 -> ~chi_10 cb      c)
     1.53757662E-01    3     1000022        -3         3   # BR(~chi_20 -> ~chi_10 sb      s)
     1.38393068E-01    3     1000022        -5         5   # BR(~chi_20 -> ~chi_10 bb      b)
     3.51044741E-02    3     1000022       -11        11   # BR(~chi_20 -> ~chi_10 e+      e-)
     3.51044741E-02    3     1000022       -13        13   # BR(~chi_20 -> ~chi_10 mu+     mu-)
     3.47173145E-02    3     1000022       -15        15   # BR(~chi_20 -> ~chi_10 tau+    tau-)
     7.00982942E-02    3     1000022       -12        12   # BR(~chi_20 -> ~chi_10 nu_eb   nu_e)
     7.00982942E-02    3     1000022       -14        14   # BR(~chi_20 -> ~chi_10 nu_mub  nu_mu)
     7.00982942E-02    3     1000022       -16        16   # BR(~chi_20 -> ~chi_10 nu_taub nu_tau)
     4.02841842E-07    3     1000024        -2         1   # BR(~chi_20 -> ~chi_1+ ub      d)
     4.02841842E-07    3    -1000024        -1         2   # BR(~chi_20 -> ~chi_1- db      u)
     4.02841842E-07    3     1000024        -4         3   # BR(~chi_20 -> ~chi_1+ cb      s)
     4.02841842E-07    3    -1000024        -3         4   # BR(~chi_20 -> ~chi_1- sb      c)
     1.34280625E-07    3     1000024       -12        11   # BR(~chi_20 -> ~chi_1+ nu_eb   e-)
     1.34280625E-07    3    -1000024        12       -11   # BR(~chi_20 -> ~chi_1- nu_e    e+)
     1.34280625E-07    3     1000024       -14        13   # BR(~chi_20 -> ~chi_1+ nu_mub  mu-)
     1.34280625E-07    3    -1000024        14       -13   # BR(~chi_20 -> ~chi_1- nu_mu   mu+)
     8.65893785E-09    3     1000024       -16        15   # BR(~chi_20 -> ~chi_1+ nu_taub tau-)
     8.65893785E-09    3    -1000024        16       -15   # BR(~chi_20 -> ~chi_1- nu_tau  tau+)
#
#         PDG            Width
DECAY   1000025     2.75034631E-04   # neutralino3 decays
#          BR         NDA      ID1       ID2
     3.03064238E-04    2     1000022        22   # BR(~chi_30 -> ~chi_10 gam)
     4.79253401E-04    2     1000023        22   # BR(~chi_30 -> ~chi_20 gam)
#          BR         NDA      ID1       ID2
     3.71284797E-04    2     1000039        22   # BR(~chi_30 -> ~G        gam)
     2.98780183E-04    2     1000039        23   # BR(~chi_30 -> ~G        Z)
     7.97748430E-06    2     1000039        25   # BR(~chi_30 -> ~G        h)
#           BR         NDA      ID1       ID2       ID3
     7.11420869E-06    3     1000022        -2         2   # BR(~chi_30 -> ~chi_10 ub      u)
     8.45579403E-06    3     1000022        -1         1   # BR(~chi_30 -> ~chi_10 db      d)
     7.11420869E-06    3     1000022        -4         4   # BR(~chi_30 -> ~chi_10 cb      c)
     8.45579403E-06    3     1000022        -3         3   # BR(~chi_30 -> ~chi_10 sb      s)
     9.10481850E-06    3     1000022        -5         5   # BR(~chi_30 -> ~chi_10 bb      b)
     1.47714678E-06    3     1000022       -11        11   # BR(~chi_30 -> ~chi_10 e+      e-)
     1.47714678E-06    3     1000022       -13        13   # BR(~chi_30 -> ~chi_10 mu+     mu-)
     1.59455030E-06    3     1000022       -15        15   # BR(~chi_30 -> ~chi_10 tau+    tau-)
     4.14016293E-06    3     1000022       -12        12   # BR(~chi_30 -> ~chi_10 nu_eb   nu_e)
     4.14016293E-06    3     1000022       -14        14   # BR(~chi_30 -> ~chi_10 nu_mub  nu_mu)
     4.14016293E-06    3     1000022       -16        16   # BR(~chi_30 -> ~chi_10 nu_taub nu_tau)
     2.68447030E-02    3     1000023        -2         2   # BR(~chi_30 -> ~chi_20 ub      u)
     3.47544628E-02    3     1000023        -1         1   # BR(~chi_30 -> ~chi_20 db      d)
     2.68447030E-02    3     1000023        -4         4   # BR(~chi_30 -> ~chi_20 cb      c)
     3.47544628E-02    3     1000023        -3         3   # BR(~chi_30 -> ~chi_20 sb      s)
     3.07909926E-02    3     1000023        -5         5   # BR(~chi_30 -> ~chi_20 bb      b)
     7.93485073E-03    3     1000023       -11        11   # BR(~chi_30 -> ~chi_20 e+      e-)
     7.93485073E-03    3     1000023       -13        13   # BR(~chi_30 -> ~chi_20 mu+     mu-)
     7.83727565E-03    3     1000023       -15        15   # BR(~chi_30 -> ~chi_20 tau+    tau-)
     1.58445144E-02    3     1000023       -12        12   # BR(~chi_30 -> ~chi_20 nu_eb   nu_e)
     1.58445144E-02    3     1000023       -14        14   # BR(~chi_30 -> ~chi_20 nu_mub  nu_mu)
     1.58445144E-02    3     1000023       -16        16   # BR(~chi_30 -> ~chi_20 nu_taub nu_tau)
     1.28988194E-01    3     1000024        -2         1   # BR(~chi_30 -> ~chi_1+ ub      d)
     1.28988194E-01    3    -1000024        -1         2   # BR(~chi_30 -> ~chi_1- db      u)
     1.28988194E-01    3     1000024        -4         3   # BR(~chi_30 -> ~chi_1+ cb      s)
     1.28988194E-01    3    -1000024        -3         4   # BR(~chi_30 -> ~chi_1- sb      c)
     4.29959907E-02    3     1000024       -12        11   # BR(~chi_30 -> ~chi_1+ nu_eb   e-)
     4.29959907E-02    3    -1000024        12       -11   # BR(~chi_30 -> ~chi_1- nu_e    e+)
     4.29959907E-02    3     1000024       -14        13   # BR(~chi_30 -> ~chi_1+ nu_mub  mu-)
     4.29959907E-02    3    -1000024        14       -13   # BR(~chi_30 -> ~chi_1- nu_mu   mu+)
     4.26579213E-02    3     1000024       -16        15   # BR(~chi_30 -> ~chi_1+ nu_taub tau-)
     4.26579213E-02    3    -1000024        16       -15   # BR(~chi_30 -> ~chi_1- nu_tau  tau+)
#
#         PDG            Width
DECAY   1000035     3.58749810E+01   # neutralino4 decays
#          BR         NDA      ID1       ID2
     1.75044763E-03    2     1000022        23   # BR(~chi_40 -> ~chi_10   Z )
     2.31010349E-01    2     1000023        23   # BR(~chi_40 -> ~chi_20   Z )
     1.96138898E-03    2     1000025        23   # BR(~chi_40 -> ~chi_30   Z )
     2.28510107E-01    2     1000024       -24   # BR(~chi_40 -> ~chi_1+   W-)
     2.28510107E-01    2    -1000024        24   # BR(~chi_40 -> ~chi_1-   W+)
     1.12333953E-01    2     1000022        25   # BR(~chi_40 -> ~chi_10   h )
     1.73477146E-03    2     1000022        35   # BR(~chi_40 -> ~chi_10   H )
     8.48781825E-03    2     1000022        36   # BR(~chi_40 -> ~chi_10   A )
     3.68192794E-03    2     1000023        25   # BR(~chi_40 -> ~chi_20   h )
     1.46243911E-02    2     1000023        35   # BR(~chi_40 -> ~chi_20   H )
     3.28717306E-03    2     1000023        36   # BR(~chi_40 -> ~chi_20   A )
     1.19943154E-01    2     1000025        25   # BR(~chi_40 -> ~chi_30   h )
     1.47229234E-03    2     1000025        35   # BR(~chi_40 -> ~chi_30   H )
     6.40690232E-03    2     1000025        36   # BR(~chi_40 -> ~chi_30   A )
     1.81378101E-02    2     1000024       -37   # BR(~chi_40 -> ~chi_1+   H-)
     1.81378101E-02    2    -1000024        37   # BR(~chi_40 -> ~chi_1-   H+)
     2.30340585E-06    2     1000039        22   # BR(~chi_40 -> ~G        gam)
     7.29229728E-06    2     1000039        23   # BR(~chi_40 -> ~G        Z)
     4.93768865E-10    2     1000039        25   # BR(~chi_40 -> ~G        h)
     5.41342153E-10    2     1000039        35   # BR(~chi_40 -> ~G        H)
     3.05627828E-12    2     1000039        36   # BR(~chi_40 -> ~G        A)
#
#         PDG            Width
DECAY        25     4.21797625E-03   # h decays
#          BR         NDA      ID1       ID2
     6.01787605E-01    2           5        -5   # BR(h -> b       bb     )
     6.22455919E-02    2         -15        15   # BR(h -> tau+    tau-   )
     2.20322258E-04    2         -13        13   # BR(h -> mu+     mu-    )
     4.66159141E-04    2           3        -3   # BR(h -> s       sb     )
     2.01104939E-02    2           4        -4   # BR(h -> c       cb     )
     6.64141755E-02    2          21        21   # BR(h -> g       g      )
     2.30997399E-03    2          22        22   # BR(h -> gam     gam    )
     1.62669028E-03    2          22        23   # BR(h -> Z       gam    )
     2.16735491E-01    2          24       -24   # BR(h -> W+      W-     )
     2.80834968E-02    2          23        23   # BR(h -> Z       Z      )
#
#         PDG            Width
DECAY        35     3.95191661E+01   # H decays
#          BR         NDA      ID1       ID2
     1.40929175E-03    2           5        -5   # BR(H -> b       bb     )
     2.35791531E-04    2         -15        15   # BR(H -> tau+    tau-   )
     8.33610846E-07    2         -13        13   # BR(H -> mu+     mu-    )
     1.06731186E-06    2           3        -3   # BR(H -> s       sb     )
     9.63245548E-06    2           4        -4   # BR(H -> c       cb     )
     9.53092056E-01    2           6        -6   # BR(H -> t       tb     )
     7.63288000E-04    2          21        21   # BR(H -> g       g      )
     2.62695340E-06    2          22        22   # BR(H -> gam     gam    )
     1.10943368E-06    2          23        22   # BR(H -> Z       gam    )
     3.22096080E-04    2          24       -24   # BR(H -> W+      W-     )
     1.60608797E-04    2          23        23   # BR(H -> Z       Z      )
     8.65485919E-04    2          25        25   # BR(H -> h       h      )
     8.93578470E-24    2          36        36   # BR(H -> A       A      )
     3.58908671E-11    2          23        36   # BR(H -> Z       A      )
     5.50794446E-12    2          24       -37   # BR(H -> W+      H-     )
     5.50794446E-12    2         -24        37   # BR(H -> W-      H+     )
     3.34098102E-05    2     1000024  -1000024   # BR(H -> ~chi_1+ ~chi_1-)
     6.01845236E-04    2     1000022   1000022   # BR(H -> ~chi_10 ~chi_10)
     8.43017147E-06    2     1000023   1000023   # BR(H -> ~chi_20 ~chi_20)
     2.93127689E-04    2     1000025   1000025   # BR(H -> ~chi_30 ~chi_30)
     2.36450494E-02    2     1000022   1000023   # BR(H -> ~chi_10 ~chi_20)
     2.79175186E-08    2     1000022   1000025   # BR(H -> ~chi_10 ~chi_30)
     1.85542218E-02    2     1000023   1000025   # BR(H -> ~chi_20 ~chi_30)
#
#         PDG            Width
DECAY        36     3.99689062E+01   # A decays
#          BR         NDA      ID1       ID2
     1.41186309E-03    2           5        -5   # BR(A -> b       bb     )
     2.33336793E-04    2         -15        15   # BR(A -> tau+    tau-   )
     8.24929855E-07    2         -13        13   # BR(A -> mu+     mu-    )
     1.08755092E-06    2           3        -3   # BR(A -> s       sb     )
     9.53041404E-06    2           4        -4   # BR(A -> c       cb     )
     9.53825427E-01    2           6        -6   # BR(A -> t       tb     )
     9.02813888E-04    2          21        21   # BR(A -> g       g      )
     2.76237022E-06    2          22        22   # BR(A -> gam     gam    )
     1.29349827E-06    2          23        22   # BR(A -> Z       gam    )
     3.13774214E-04    2          23        25   # BR(A -> Z       h      )
     6.29388934E-04    2     1000024  -1000024   # BR(A -> ~chi_1+ ~chi_1-)
     2.46429388E-02    2     1000022   1000022   # BR(A -> ~chi_10 ~chi_10)
     6.39994612E-07    2     1000023   1000023   # BR(A -> ~chi_20 ~chi_20)
     1.71251275E-02    2     1000025   1000025   # BR(A -> ~chi_30 ~chi_30)
     4.42231607E-04    2     1000022   1000023   # BR(A -> ~chi_10 ~chi_20)
     5.38326657E-05    2     1000022   1000025   # BR(A -> ~chi_10 ~chi_30)
     4.03126280E-04    2     1000023   1000025   # BR(A -> ~chi_20 ~chi_30)
#
#         PDG            Width
DECAY        37     3.91529531E+01   # H+ decays
#          BR         NDA      ID1       ID2
     2.26533157E-06    2           4        -5   # BR(H+ -> c       bb     )
     2.38412294E-04    2         -15        16   # BR(H+ -> tau+    nu_tau )
     8.42873584E-07    2         -13        14   # BR(H+ -> mu+     nu_mu  )
     1.44025760E-08    2           2        -5   # BR(H+ -> u       bb     )
     5.21983045E-08    2           2        -3   # BR(H+ -> u       sb     )
     1.04007095E-05    2           4        -3   # BR(H+ -> c       sb     )
     9.55982969E-01    2           6        -5   # BR(H+ -> t       bb     )
     3.21628866E-04    2          24        25   # BR(H+ -> W+      h      )
     6.10538080E-13    2          24        36   # BR(H+ -> W+      A      )
     2.17169282E-02    2     1000024   1000022   # BR(H+ -> ~chi_1+ ~chi_10)
     1.47304289E-04    2     1000024   1000023   # BR(H+ -> ~chi_1+ ~chi_20)
     2.15791815E-02    2     1000024   1000025   # BR(H+ -> ~chi_1+ ~chi_30)
