#
#                              ======================
#                              | THE SUSYHIT OUTPUT |
#                              ======================
#
#
#              ------------------------------------------------------
#              |     This is the output of the SUSY-HIT package     |
#              |  created by A.Djouadi, M.Muehlleitner and M.Spira. |
#              |  In case of problems with SUSY-HIT email to        |
#              |           margarete.muehlleitner@cern.ch           |
#              |           michael.spira@psi.ch                     |
#              |           abdelhak.djouadi@cern.ch                 |
#              ------------------------------------------------------
#
#              ------------------------------------------------------
#              |  SUSY Les Houches Accord - MSSM Spectrum + Decays  |
#              |              based on the decay programs           |
#              |                                                    |
#              |                     SDECAY 1.3b                    |
#              |                                                    |
#              |  Authors: M.Muhlleitner, A.Djouadi and Y.Mambrini  |
#              |  Ref.:    Comput.Phys.Commun.168(2005)46           |
#              |           [hep-ph/0311167]                         |
#              |                                                    |
#              |                     HDECAY 3.4                     |
#              |                                                    |
#              |  By: A.Djouadi,J.Kalinowski,M.Muhlleitner,M.Spira  |
#              |  Ref.:    Comput.Phys.Commun.108(1998)56           |
#              |           [hep-ph/9704448]                         |
#              |                                                    |
#              |                                                    |
#              |  If not stated otherwise all DRbar couplings and   |
#              |  soft SUSY breaking masses are given at the scale  |
#              |  Q=  0.91187600E+02
#              |                                                    |
#              ------------------------------------------------------
#
#
BLOCK DCINFO  # Decay Program information
     1   SDECAY/HDECAY # decay calculator
     2   1.3b  /3.4    # version number
#
BLOCK SPINFO  # Spectrum calculator information
     1   SuSpect     # RGE +Spectrum calculator            
     2   2.41         # version number                     
#
BLOCK MODSEL  # Model selection
     1     0   # #general MSSM low scale                           
#
BLOCK SMINPUTS  # Standard Model inputs
         1     1.27934000E+02   # alpha_em^-1(M_Z)^MSbar
         2     1.16639000E-05   # G_F [GeV^-2]
         3     1.17200000E-01   # alpha_S(M_Z)^MSbar
         4     9.11870000E+01   # M_Z pole mass
         5     4.25000000E+00   # mb(mb)^MSbar
         6     1.72500000E+02   # mt pole mass
         7     1.77700000E+00   # mtau pole mass
#
BLOCK MINPAR  # Input parameters - minimal models
#
BLOCK EXTPAR  # Input parameters - non-minimal models
         0     9.11876000E+01   # EWSB                
         1     9.90000000E+02   # M_1                 
         2     1.00000000E+05   # M_2                 
         3     1.00000000E+05   # M_3                 
        11     0.00000000E+00   # A_t                 
        12     0.00000000E+00   # A_b                 
        13     0.00000000E+00   # A_tau               
        14     0.00000000E+00   # A_u                 
        15     0.00000000E+00   # A_d                 
        16     0.00000000E+00   # A_e                 
        23     3.50000000E+03   # mu(EWSB)            
        25     1.50000000E+00   # tanbeta(in)         
        26     2.00000000E+03   # MA_pole             
        31     1.00000000E+05   # M_eL                
        32     1.00000000E+05   # M_muL               
        33     1.00000000E+05   # M_tauL              
        34     1.00000000E+05   # M_eR                
        35     1.00000000E+05   # M_muR               
        36     1.00000000E+05   # M_tauR              
        41     1.00000000E+03   # M_q1L               
        42     1.00000000E+03   # M_q2L               
        43     1.00000000E+03   # M_q3L               
        44     1.00000000E+05   # M_uR                
        45     1.00000000E+05   # M_cR                
        46     1.00000000E+05   # M_tR                
        47     1.00000000E+03   # M_dR                
        48     1.00000000E+03   # M_sR                
        49     1.00000000E+03   # M_bR                
#
BLOCK MASS  # Mass Spectrum
# PDG code           mass       particle
        24     8.05807231E+01   # W+
        25     1.25000000E+02   # h
        35     2.00386685E+03   # H
        36     2.00000000E+03   # A
        37     2.02367768E+03   # H+
         5     4.87877839E+00   # b-quark pole mass calculated from mb(mb)_Msbar
   1000001     1.00066606E+03   # ~d_L
   2000001     1.00012797E+03   # ~d_R
   1000002     9.99461552E+02   # ~u_L
   2000002     9.99999974E+04   # ~u_R
   1000003     1.00066606E+03   # ~s_L
   2000003     1.00012797E+03   # ~s_R
   1000004     9.99461552E+02   # ~c_L
   2000004     9.99999974E+04   # ~c_R
   1000005     9.93601662E+02   # ~b_1
   2000005     1.00715321E+03   # ~b_2
   1000006     1.01027217E+03   # ~t_1
   2000006     1.00000106E+05   # ~t_2
   1000011     1.00000004E+05   # ~e_L
   2000011     1.00000004E+05   # ~e_R
   1000012     9.99999921E+04   # ~nu_eL
   1000013     1.00000004E+05   # ~mu_L
   2000013     1.00000004E+05   # ~mu_R
   1000014     9.99999921E+04   # ~nu_muL
   1000015     9.99999574E+04   # ~tau_1
   2000015     1.00000051E+05   # ~tau_2
   1000016     9.99999921E+04   # ~nu_tauL
   1000021     1.00000000E+05   # ~g
   1000022     9.89252489E+02   # ~chi_10
   1000023    -3.50001943E+03   # ~chi_20
   1000025     3.50070220E+03   # ~chi_30
   1000035     1.00000065E+05   # ~chi_40
   1000024     3.49993991E+03   # ~chi_1+
   1000037     1.00000065E+05   # ~chi_2+
   1000039     1.00000000E-09   # ~gravitino
#
BLOCK NMIX  # Neutralino Mixing Matrix
  1  1     9.99845858E-01   # N_11
  1  2    -1.33707045E-05   # N_12
  1  3     1.37180341E-02   # N_13
  1  4    -1.09578866E-02   # N_14
  2  1     1.95177168E-03   # N_21
  2  2    -1.49976428E-04   # N_22
  2  3    -7.07095612E-01   # N_23
  2  4    -7.07115240E-01   # N_24
  3  1     1.74485095E-02   # N_31
  3  2     8.04110235E-04   # N_32
  3  3    -7.06984722E-01   # N_33
  3  4     7.07013088E-01   # N_34
  4  1     3.69162399E-07   # N_41
  4  2    -9.99999665E-01   # N_42
  4  3    -4.62629551E-04   # N_43
  4  4     6.74713819E-04   # N_44
#
BLOCK UMIX  # Chargino Mixing Matrix U
  1  1    -6.54256779E-04   # U_11
  1  2     9.99999786E-01   # U_12
  2  1     9.99999786E-01   # U_21
  2  2     6.54256779E-04   # U_22
#
BLOCK VMIX  # Chargino Mixing Matrix V
  1  1    -9.54189344E-04   # V_11
  1  2     9.99999545E-01   # V_12
  2  1     9.99999545E-01   # V_21
  2  2     9.54189344E-04   # V_22
#
BLOCK STOPMIX  # Stop Mixing Matrix
  1  1     9.99999999E-01   # cos(theta_t)
  1  2     4.47213589E-05   # sin(theta_t)
  2  1    -4.47213589E-05   # -sin(theta_t)
  2  2     9.99999999E-01   # cos(theta_t)
#
BLOCK SBOTMIX  # Sbottom Mixing Matrix
  1  1     6.92925799E-01   # cos(theta_b)
  1  2     7.21008902E-01   # sin(theta_b)
  2  1    -7.21008902E-01   # -sin(theta_b)
  2  2     6.92925799E-01   # cos(theta_b)
#
BLOCK STAUMIX  # Stau Mixing Matrix
  1  1     7.06104250E-01   # cos(theta_tau)
  1  2     7.08107893E-01   # sin(theta_tau)
  2  1    -7.08107893E-01   # -sin(theta_tau)
  2  2     7.06104250E-01   # cos(theta_tau)
#
BLOCK ALPHA  # Higgs mixing
          -5.90224225E-01   # Mixing angle in the neutral Higgs boson sector
#
BLOCK HMIX Q=  9.11876000E+01  # DRbar Higgs Parameters
         1     3.50000000E+03   # mu(Q)               
         2     1.49999982E+00   # tanbeta(Q)          
         3     2.54865772E+02   # vev(Q)              
         4    -6.84859199E+07   # MA^2(Q)             
#
BLOCK GAUGE Q=  9.11876000E+01  # The gauge couplings
     1     3.50633323E-01   # gprime(Q) DRbar
     2     6.21068343E-01   # g(Q) DRbar
     3     1.02926435E+00   # g3(Q) DRbar
#
BLOCK AU Q=  9.11876000E+01  # The trilinear couplings
  1  1     0.00000000E+00   # A_u(Q) DRbar
  2  2     0.00000000E+00   # A_c(Q) DRbar
  3  3     0.00000000E+00   # A_t(Q) DRbar
#
BLOCK AD Q=  9.11876000E+01  # The trilinear couplings
  1  1     0.00000000E+00   # A_d(Q) DRbar
  2  2     0.00000000E+00   # A_s(Q) DRbar
  3  3     0.00000000E+00   # A_b(Q) DRbar
#
BLOCK AE Q=  9.11876000E+01  # The trilinear couplings
  1  1     0.00000000E+00   # A_e(Q) DRbar
  2  2     0.00000000E+00   # A_mu(Q) DRbar
  3  3     0.00000000E+00   # A_tau(Q) DRbar
#
BLOCK Yu Q=  9.11876000E+01  # The Yukawa couplings
  1  1     0.00000000E+00   # y_u(Q) DRbar
  2  2     0.00000000E+00   # y_c(Q) DRbar
  3  3     9.83256409E-01   # y_t(Q) DRbar
#
BLOCK Yd Q=  9.11876000E+01  # The Yukawa couplings
  1  1     0.00000000E+00   # y_d(Q) DRbar
  2  2     0.00000000E+00   # y_s(Q) DRbar
  3  3     2.58104690E-02   # y_b(Q) DRbar
#
BLOCK Ye Q=  9.11876000E+01  # The Yukawa couplings
  1  1     0.00000000E+00   # y_e(Q) DRbar
  2  2     0.00000000E+00   # y_mu(Q) DRbar
  3  3     1.77390168E-02   # y_tau(Q) DRbar
#
BLOCK MSOFT Q=  9.11876000E+01  # The soft SUSY breaking masses at the scale Q
         1     9.90000000E+02   # M_1                 
         2     1.00000000E+05   # M_2                 
         3     1.00000000E+05   # M_3                 
        14     0.00000000E+00   # A_u                 
        15     0.00000000E+00   # A_d                 
        16     0.00000000E+00   # A_e                 
        21     6.34936137E+08   # M^2_Hd              
        22    -1.14352718E+09   # M^2_Hu              
        31     1.00000000E+05   # M_eL                
        32     1.00000000E+05   # M_muL               
        33     1.00000000E+05   # M_tauL              
        34     1.00000000E+05   # M_eR                
        35     1.00000000E+05   # M_muR               
        36     1.00000000E+05   # M_tauR              
        41     1.00000000E+03   # M_q1L               
        42     1.00000000E+03   # M_q2L               
        43     1.00000000E+03   # M_q3L               
        44     1.00000000E+05   # M_uR                
        45     1.00000000E+05   # M_cR                
        46     1.00000000E+05   # M_tR                
        47     1.00000000E+03   # M_dR                
        48     1.00000000E+03   # M_sR                
        49     1.00000000E+03   # M_bR                
#
#
#
#                             =================
#                             |The decay table|
#                             =================
#
# - The QCD corrections to the decays gluino -> squark  + quark
#                                     squark -> gaugino + quark_prime
#                                     squark -> squark_prime + Higgs
#                                     squark -> gluino  + quark
#   are included.
#
# - The multi-body decays for the inos, stops and sbottoms are included.
#
# - The loop induced decays for the gluino, neutralinos and stops
#   are included.
#
# - The SUSY decays of the top quark are included.
#
# - Possible decays of the NLSP in GMSB models are included.
#
#
#         PDG            Width
DECAY         6     1.33141416E+00   # top decays
#          BR         NDA      ID1       ID2
     1.00000000E+00    2           5        24   # BR(t ->  b    W+)
#
#         PDG            Width
DECAY   1000021     1.E-04   # gluino decays (OJ Mods)
#          BR         NDA      ID1       ID2
     7.72367306E-04    2     1000001        -1   # BR(~g -> ~d_L  db)
     7.72367306E-04    2    -1000001         1   # BR(~g -> ~d_L* d )
     7.72367472E-04    2     2000001        -1   # BR(~g -> ~d_R  db)
     7.72367472E-04    2    -2000001         1   # BR(~g -> ~d_R* d )
     7.72367678E-04    2     1000002        -2   # BR(~g -> ~u_L  ub)
     7.72367678E-04    2    -1000002         2   # BR(~g -> ~u_L* u )
     2.08889946E-18    2     2000002        -2   # BR(~g -> ~u_R  ub)
     2.08889946E-18    2    -2000002         2   # BR(~g -> ~u_R* u )
     7.72367306E-04    2     1000003        -3   # BR(~g -> ~s_L  sb)
     7.72367306E-04    2    -1000003         3   # BR(~g -> ~s_L* s )
     7.72367472E-04    2     2000003        -3   # BR(~g -> ~s_R  sb)
     7.72367472E-04    2    -2000003         3   # BR(~g -> ~s_R* s )
     7.72367678E-04    2     1000004        -4   # BR(~g -> ~c_L  cb)
     7.72367678E-04    2    -1000004         4   # BR(~g -> ~c_L* c )
     2.08889946E-18    2     2000004        -4   # BR(~g -> ~c_R  cb)
     2.08889946E-18    2    -2000004         4   # BR(~g -> ~c_R* c )
     2.42619665E-01    2     1000005        -5   # BR(~g -> ~b_1  bb)
     2.42619665E-01    2    -1000005         5   # BR(~g -> ~b_1* b )
     2.41202043E-01    2     2000005        -5   # BR(~g -> ~b_2  bb)
     2.41202043E-01    2    -2000005         5   # BR(~g -> ~b_2* b )
     7.60024776E-04    2     1000006        -6   # BR(~g -> ~t_1  tb)
     7.60024776E-04    2    -1000006         6   # BR(~g -> ~t_1* t )
     2.15681248E-02    2     1000039        21   # BR(~g -> ~G g)
#
#         PDG            Width
DECAY   1000006     2.77589446E-05   # stop1 decays
#          BR         NDA      ID1       ID2
     9.45465116E-01    2     1000022         4   # BR(~t_1 -> ~chi_10 c )
     7.28924920E-03    2     1000022         2   # BR(~t_1 -> ~chi_10 u )
#           BR         NDA      ID1       ID2       ID3
     1.58405316E-02    3     1000005        -1         2   # BR(~t_1 -> ~b_1     db u)
     3.91696333E-06    3     2000005        -1         2   # BR(~t_1 -> ~b_2     db u)
     1.58405316E-02    3     1000005        -3         4   # BR(~t_1 -> ~b_1     sb c)
     3.91696333E-06    3     2000005        -3         4   # BR(~t_1 -> ~b_2     sb c)
     4.99351914E-03    3     1000005       -15        16   # BR(~t_1 -> ~b_1     tau+ nu_tau)
     2.52722957E-07    3     2000005       -15        16   # BR(~t_1 -> ~b_2     tau+ nu_tau)
     5.28017718E-03    3     1000005       -11        12   # BR(~t_1 -> ~b_1     e+   nu_e)
     1.30565444E-06    3     2000005       -11        12   # BR(~t_1 -> ~b_2     e+   nu_e)
     5.28017718E-03    3     1000005       -13        14   # BR(~t_1 -> ~b_1     mu+  nu_mu)
     1.30565444E-06    3     2000005       -13        14   # BR(~t_1 -> ~b_2     mu+  nu_mu)
#
#         PDG            Width
DECAY   2000006     2.18679989E+05   # stop2 decays
#          BR         NDA      ID1       ID2
     9.52668824E-04    2     1000022         6   # BR(~t_2 -> ~chi_10 t )
     2.26463813E-03    2     1000023         6   # BR(~t_2 -> ~chi_20 t )
     2.26422670E-03    2     1000025         6   # BR(~t_2 -> ~chi_30 t )
     9.94599518E-01    2     1000024         5   # BR(~t_2 -> ~chi_1+ b )
    -6.27466269E-05    2     1000006        25   # BR(~t_2 -> ~t_1    h )
     6.56562198E-05    2     1000006        35   # BR(~t_2 -> ~t_1    H )
     6.55449031E-05    2     1000006        36   # BR(~t_2 -> ~t_1    A )
     6.17205069E-05    2     1000005        37   # BR(~t_2 -> ~b_1    H+)
     6.93673937E-05    2     2000005        37   # BR(~t_2 -> ~b_2    H+)
    -4.51405375E-05    2     1000006        23   # BR(~t_2 -> ~t_1    Z )
    -1.13054439E-04    2     1000005        24   # BR(~t_2 -> ~b_1    W+)
    -1.22398731E-04    2     2000005        24   # BR(~t_2 -> ~b_2    W+)
#
#         PDG            Width
DECAY   1000005     0.00000000E+00   # sbottom1 decays
#
#         PDG            Width
DECAY   2000005     6.17373275E-02   # sbottom2 decays
#          BR         NDA      ID1       ID2
     1.00000000E+00    2     1000022         5   # BR(~b_2 -> ~chi_10 b )
#
#         PDG            Width
DECAY   1000002     2.70970722E-04   # sup_L decays
#          BR         NDA      ID1       ID2
     1.00000000E+00    2     1000022         2   # BR(~u_L -> ~chi_10 u)
#
#         PDG            Width
DECAY   2000002     2.08373136E+02   # sup_R decays
#          BR         NDA      ID1       ID2
     9.99692090E-01    2     1000022         2   # BR(~u_R -> ~chi_10 u)
     3.80508931E-06    2     1000023         2   # BR(~u_R -> ~chi_20 u)
     3.04104774E-04    2     1000025         2   # BR(~u_R -> ~chi_30 u)
#
#         PDG            Width
DECAY   1000001     3.11984942E-04   # sdown_L decays
#          BR         NDA      ID1       ID2
     1.00000000E+00    2     1000022         1   # BR(~d_L -> ~chi_10 d)
#
#         PDG            Width
DECAY   2000001     1.17372574E-03   # sdown_R decays
#          BR         NDA      ID1       ID2
     1.00000000E+00    2     1000022         1   # BR(~d_R -> ~chi_10 d)
#
#         PDG            Width
DECAY   1000004     2.70970722E-04   # scharm_L decays
#          BR         NDA      ID1       ID2
     1.00000000E+00    2     1000022         4   # BR(~c_L -> ~chi_10 c)
#
#         PDG            Width
DECAY   2000004     2.08373136E+02   # scharm_R decays
#          BR         NDA      ID1       ID2
     9.99692090E-01    2     1000022         4   # BR(~c_R -> ~chi_10 c)
     3.80508931E-06    2     1000023         4   # BR(~c_R -> ~chi_20 c)
     3.04104774E-04    2     1000025         4   # BR(~c_R -> ~chi_30 c)
#
#         PDG            Width
DECAY   1000003     3.11984942E-04   # sstrange_L decays
#          BR         NDA      ID1       ID2
     1.00000000E+00    2     1000022         3   # BR(~s_L -> ~chi_10 s)
#
#         PDG            Width
DECAY   2000003     1.17372574E-03   # sstrange_R decays
#          BR         NDA      ID1       ID2
     1.00000000E+00    2     1000022         3   # BR(~s_R -> ~chi_10 s)
#
#         PDG            Width
DECAY   1000011     1.22271102E+02   # selectron_L decays
#          BR         NDA      ID1       ID2
     9.99639105E-01    2     1000022        11   # BR(~e_L -> ~chi_10 e-)
     2.83658659E-06    2     1000023        11   # BR(~e_L -> ~chi_20 e-)
     3.55378192E-04    2     1000025        11   # BR(~e_L -> ~chi_30 e-)
     2.67988986E-06    2    -1000024        12   # BR(~e_L -> ~chi_1- nu_e)
#
#         PDG            Width
DECAY   2000011     4.89081488E+02   # selectron_R decays
#          BR         NDA      ID1       ID2
     9.99692435E-01    2     1000022        11   # BR(~e_R -> ~chi_10 e-)
     3.80083176E-06    2     1000023        11   # BR(~e_R -> ~chi_20 e-)
     3.03764400E-04    2     1000025        11   # BR(~e_R -> ~chi_30 e-)
#
#         PDG            Width
DECAY   1000013     1.22271102E+02   # smuon_L decays
#          BR         NDA      ID1       ID2
     9.99639105E-01    2     1000022        13   # BR(~mu_L -> ~chi_10 mu-)
     2.83658659E-06    2     1000023        13   # BR(~mu_L -> ~chi_20 mu-)
     3.55378192E-04    2     1000025        13   # BR(~mu_L -> ~chi_30 mu-)
     2.67988986E-06    2    -1000024        14   # BR(~mu_L -> ~chi_1- nu_mu)
#
#         PDG            Width
DECAY   2000013     4.89081488E+02   # smuon_R decays
#          BR         NDA      ID1       ID2
     9.99692435E-01    2     1000022        13   # BR(~mu_R -> ~chi_10 mu-)
     3.80083176E-06    2     1000023        13   # BR(~mu_R -> ~chi_20 mu-)
     3.03764400E-04    2     1000025        13   # BR(~mu_R -> ~chi_30 mu-)
#
#         PDG            Width
DECAY   1000015     1.18200751E+04   # stau_1 decays
#          BR         NDA      ID1       ID2
     2.59066553E-02    2     1000022        15   # BR(~tau_1 -> ~chi_10  tau-)
     2.53513033E-05    2     1000023        15   # BR(~tau_1 -> ~chi_20  tau-)
     2.61768032E-05    2     1000025        15   # BR(~tau_1 -> ~chi_30  tau-)
     2.77153056E-05    2    -1000024        16   # BR(~tau_1 -> ~chi_1-  nu_tau)
     9.74014101E-01    2     1000039        15   # BR(~tau_1 -> ~G       tau-)
#
#         PDG            Width
DECAY   2000015     3.06070781E+02   # stau_2 decays
#          BR         NDA      ID1       ID2
     9.96304389E-01    2     1000022        15   # BR(~tau_2 -> ~chi_10  tau-)
     1.06844686E-03    2     1000023        15   # BR(~tau_2 -> ~chi_20  tau-)
     1.65608454E-03    2     1000025        15   # BR(~tau_2 -> ~chi_30  tau-)
     9.71079767E-04    2    -1000024        16   # BR(~tau_2 -> ~chi_1-  nu_tau)
#
#         PDG            Width
DECAY   1000012     1.22271164E+02   # snu_eL decays
#          BR         NDA      ID1       ID2
     9.99733199E-01    2     1000022        12   # BR(~nu_eL -> ~chi_10 nu_e)
     4.90584915E-06    2     1000023        12   # BR(~nu_eL -> ~chi_20 nu_e)
     2.56194919E-04    2     1000025        12   # BR(~nu_eL -> ~chi_30 nu_e)
     5.70019006E-06    2     1000024        11   # BR(~nu_eL -> ~chi_1+ e-)
#
#         PDG            Width
DECAY   1000014     1.22271164E+02   # snu_muL decays
#          BR         NDA      ID1       ID2
     9.99733199E-01    2     1000022        14   # BR(~nu_muL -> ~chi_10 nu_mu)
     4.90584915E-06    2     1000023        14   # BR(~nu_muL -> ~chi_20 nu_mu)
     2.56194919E-04    2     1000025        14   # BR(~nu_muL -> ~chi_30 nu_mu)
     5.70019006E-06    2     1000024        13   # BR(~nu_muL -> ~chi_1+ mu-)
#
#         PDG            Width
DECAY   1000016     1.22895652E+02   # snu_tauL decays
#          BR         NDA      ID1       ID2
     9.94653103E-01    2     1000022        16   # BR(~nu_tauL -> ~chi_10 nu_tau)
     4.88092031E-06    2     1000023        16   # BR(~nu_tauL -> ~chi_20 nu_tau)
     2.54893077E-04    2     1000025        16   # BR(~nu_tauL -> ~chi_30 nu_tau)
     5.08712315E-03    2     1000024        15   # BR(~nu_tauL -> ~chi_1+ tau-)
#
#         PDG            Width
DECAY   1000024     8.01938058E+01   # chargino1+ decays
#          BR         NDA      ID1       ID2
     4.50904985E-07    2     1000002        -1   # BR(~chi_1+ -> ~u_L     db)
     2.11903358E-07    2    -1000001         2   # BR(~chi_1+ -> ~d_L*    u )
     4.50904985E-07    2     1000004        -3   # BR(~chi_1+ -> ~c_L     sb)
     2.11903358E-07    2    -1000003         4   # BR(~chi_1+ -> ~s_L*    c )
     9.65551429E-02    2     1000006        -5   # BR(~chi_1+ -> ~t_1     bb)
     6.30374898E-02    2    -1000005         6   # BR(~chi_1+ -> ~b_1*    t )
     7.99610726E-01    2    -2000005         6   # BR(~chi_1+ -> ~b_2*    t )
     3.78889044E-02    2     1000022        24   # BR(~chi_1+ -> ~chi_10  W+)
     2.90190922E-03    2     1000022        37   # BR(~chi_1+ -> ~chi_10  H+)
     3.76208223E-06    2     1000039        24   # BR(~chi_1+ -> ~G       W+)
     7.40252813E-07    2     1000039        37   # BR(~chi_1+ -> ~G       H+)
#
#         PDG            Width
DECAY   1000037     1.38376282E+05   # chargino2+ decays
#          BR         NDA      ID1       ID2
     7.36015644E-03    2     1000002        -1   # BR(~chi_2+ -> ~u_L     db)
     7.36015961E-03    2    -1000001         2   # BR(~chi_2+ -> ~d_L*    u )
     7.36015644E-03    2     1000004        -3   # BR(~chi_2+ -> ~c_L     sb)
     7.36015961E-03    2    -1000003         4   # BR(~chi_2+ -> ~s_L*    c )
     8.75008289E-01    2     1000006        -5   # BR(~chi_2+ -> ~t_1     bb)
     1.57188820E-03    2    -1000005         6   # BR(~chi_2+ -> ~b_1*    t )
     7.03946871E-03    2    -2000005         6   # BR(~chi_2+ -> ~b_2*    t )
     5.44154901E-15    2     1000012       -11   # BR(~chi_2+ -> ~nu_eL   e+  )
     5.44154901E-15    2     1000014       -13   # BR(~chi_2+ -> ~nu_muL  mu+ )
     3.81002144E-15    2    -1000011        12   # BR(~chi_2+ -> ~e_L+    nu_e)
     3.81002144E-15    2    -1000013        14   # BR(~chi_2+ -> ~mu_L+   nu_mu)
     5.91035358E-15    2    -1000015        16   # BR(~chi_2+ -> ~tau_1+  nu_tau)
     1.00632690E-16    2    -2000015        16   # BR(~chi_2+ -> ~tau_2+  nu_tau)
     1.35353973E-03    2     1000024        23   # BR(~chi_2+ -> ~chi_1+  Z )
     3.35266804E-07    2     1000022        24   # BR(~chi_2+ -> ~chi_10  W+)
     1.31437782E-03    2     1000023        24   # BR(~chi_2+ -> ~chi_20  W+)
     1.31402835E-03    2     1000025        24   # BR(~chi_2+ -> ~chi_30  W+)
     1.36264968E-03    2     1000024        25   # BR(~chi_2+ -> ~chi_1+  h )
     1.19615924E-03    2     1000024        35   # BR(~chi_2+ -> ~chi_1+  H )
     1.19631239E-03    2     1000024        36   # BR(~chi_2+ -> ~chi_1+  A )
     4.02050413E-07    2     1000022        37   # BR(~chi_2+ -> ~chi_10  H+)
     1.19627136E-03    2     1000023        37   # BR(~chi_2+ -> ~chi_20  H+)
     1.19590733E-03    2     1000025        37   # BR(~chi_2+ -> ~chi_30  H+)
     7.68097162E-02    2     1000039        24   # BR(~chi_2+ -> ~G       W+)
     2.21038534E-08    2     1000039        37   # BR(~chi_2+ -> ~G       H+)
#
#         PDG            Width
DECAY   1000022     1.E-08   # neutralino1 decays (OJ Mods)
#          BR         NDA      ID1       ID2
     7.64387572E-01    2     1000039        22   # BR(~chi_10 -> ~G        gam)
     2.35611408E-01    2     1000039        23   # BR(~chi_10 -> ~G        Z)
     1.02050009E-06    2     1000039        25   # BR(~chi_10 -> ~G        h)
#
#         PDG            Width
DECAY   1000023     1.E-08   # neutralino2 decays (OJ Mods)
#          BR         NDA      ID1       ID2
     3.55608409E-02    2     1000022        23   # BR(~chi_20 -> ~chi_10   Z )
     4.37001969E-04    2     1000022        25   # BR(~chi_20 -> ~chi_10   h )
     2.19636690E-03    2     1000022        35   # BR(~chi_20 -> ~chi_10   H )
     6.21666375E-04    2     1000022        36   # BR(~chi_20 -> ~chi_10   A )
     1.23530732E-08    2     1000002        -2   # BR(~chi_20 -> ~u_L      ub)
     1.23530732E-08    2    -1000002         2   # BR(~chi_20 -> ~u_L*     u )
     6.99583495E-08    2     1000001        -1   # BR(~chi_20 -> ~d_L      db)
     6.99583495E-08    2    -1000001         1   # BR(~chi_20 -> ~d_L*     d )
     1.41114146E-07    2     2000001        -1   # BR(~chi_20 -> ~d_R      db)
     1.41114146E-07    2    -2000001         1   # BR(~chi_20 -> ~d_R*     d )
     1.23530732E-08    2     1000004        -4   # BR(~chi_20 -> ~c_L      cb)
     1.23530732E-08    2    -1000004         4   # BR(~chi_20 -> ~c_L*     c )
     6.99583495E-08    2     1000003        -3   # BR(~chi_20 -> ~s_L      sb)
     6.99583495E-08    2    -1000003         3   # BR(~chi_20 -> ~s_L*     s )
     1.41114146E-07    2     2000003        -3   # BR(~chi_20 -> ~s_R      sb)
     1.41114146E-07    2    -2000003         3   # BR(~chi_20 -> ~s_R*     s )
     3.97493366E-01    2     1000006        -6   # BR(~chi_20 -> ~t_1      tb)
     3.97493366E-01    2    -1000006         6   # BR(~chi_20 -> ~t_1*     t )
     4.01287133E-02    2     1000005        -5   # BR(~chi_20 -> ~b_1      bb)
     4.01287133E-02    2    -1000005         5   # BR(~chi_20 -> ~b_1*     b )
     4.29675021E-02    2     2000005        -5   # BR(~chi_20 -> ~b_2      bb)
     4.29675021E-02    2    -2000005         5   # BR(~chi_20 -> ~b_2*     b )
     1.83988557E-11    2     1000039        22   # BR(~chi_20 -> ~G        gam)
     1.33510324E-07    2     1000039        23   # BR(~chi_20 -> ~G        Z)
     3.33208793E-06    2     1000039        25   # BR(~chi_20 -> ~G        h)
     2.67214322E-08    2     1000039        35   # BR(~chi_20 -> ~G        H)
     6.88376333E-07    2     1000039        36   # BR(~chi_20 -> ~G        A)
#
#         PDG            Width
DECAY   1000025     8.71219266E+01   # neutralino3 decays
#          BR         NDA      ID1       ID2
     4.44917277E-04    2     1000022        23   # BR(~chi_30 -> ~chi_10   Z )
     3.56663599E-02    2     1000022        25   # BR(~chi_30 -> ~chi_10   h )
     6.03270635E-04    2     1000022        35   # BR(~chi_30 -> ~chi_10   H )
     2.21383796E-03    2     1000022        36   # BR(~chi_30 -> ~chi_10   A )
     4.35935451E-06    2     1000002        -2   # BR(~chi_30 -> ~u_L      ub)
     4.35935451E-06    2    -1000002         2   # BR(~chi_30 -> ~u_L*     u )
     1.60332441E-06    2     1000001        -1   # BR(~chi_30 -> ~d_L      db)
     1.60332441E-06    2    -1000001         1   # BR(~chi_30 -> ~d_L*     d )
     1.12494418E-05    2     2000001        -1   # BR(~chi_30 -> ~d_R      db)
     1.12494418E-05    2    -2000001         1   # BR(~chi_30 -> ~d_R*     d )
     4.35935451E-06    2     1000004        -4   # BR(~chi_30 -> ~c_L      cb)
     4.35935451E-06    2    -1000004         4   # BR(~chi_30 -> ~c_L*     c )
     1.60332441E-06    2     1000003        -3   # BR(~chi_30 -> ~s_L      sb)
     1.60332441E-06    2    -1000003         3   # BR(~chi_30 -> ~s_L*     s )
     1.12494418E-05    2     2000003        -3   # BR(~chi_30 -> ~s_R      sb)
     1.12494418E-05    2    -2000003         3   # BR(~chi_30 -> ~s_R*     s )
     3.96507688E-01    2     1000006        -6   # BR(~chi_30 -> ~t_1      tb)
     3.96507688E-01    2    -1000006         6   # BR(~chi_30 -> ~t_1*     t )
     3.27865539E-02    2     1000005        -5   # BR(~chi_30 -> ~b_1      bb)
     3.27865539E-02    2    -1000005         5   # BR(~chi_30 -> ~b_1*     b )
     5.12093964E-02    2     2000005        -5   # BR(~chi_30 -> ~b_2      bb)
     5.12093964E-02    2    -2000005         5   # BR(~chi_30 -> ~b_2*     b )
     1.68850533E-09    2     1000039        22   # BR(~chi_30 -> ~G        gam)
     3.33056247E-06    2     1000039        23   # BR(~chi_30 -> ~G        Z)
     1.29976367E-07    2     1000039        25   # BR(~chi_30 -> ~G        h)
     6.82913104E-07    2     1000039        35   # BR(~chi_30 -> ~G        H)
     2.74928016E-08    2     1000039        36   # BR(~chi_30 -> ~G        A)
#
#         PDG            Width
DECAY   1000035     1.38376851E+05   # neutralino4 decays
#          BR         NDA      ID1       ID2
     2.22480744E-09    2     1000022        23   # BR(~chi_40 -> ~chi_10   Z )
     1.30805358E-03    2     1000023        23   # BR(~chi_40 -> ~chi_20   Z )
     4.54798584E-05    2     1000025        23   # BR(~chi_40 -> ~chi_30   Z )
     1.31436454E-03    2     1000024       -24   # BR(~chi_40 -> ~chi_1+   W-)
     1.31436454E-03    2    -1000024        24   # BR(~chi_40 -> ~chi_1-   W+)
     3.45803469E-07    2     1000022        25   # BR(~chi_40 -> ~chi_10   h )
     3.65459076E-08    2     1000022        35   # BR(~chi_40 -> ~chi_10   H )
     3.65009021E-07    2     1000022        36   # BR(~chi_40 -> ~chi_10   A )
     4.47790209E-05    2     1000023        25   # BR(~chi_40 -> ~chi_20   h )
     1.14467738E-03    2     1000023        35   # BR(~chi_40 -> ~chi_20   H )
     5.26208198E-05    2     1000023        36   # BR(~chi_40 -> ~chi_20   A )
     1.31752108E-03    2     1000025        25   # BR(~chi_40 -> ~chi_30   h )
     5.14392905E-05    2     1000025        35   # BR(~chi_40 -> ~chi_30   H )
     1.14332201E-03    2     1000025        36   # BR(~chi_40 -> ~chi_30   A )
     1.19628658E-03    2     1000024       -37   # BR(~chi_40 -> ~chi_1+   H-)
     1.19628658E-03    2    -1000024        37   # BR(~chi_40 -> ~chi_1-   H+)
     3.52118980E-03    2     1000002        -2   # BR(~chi_40 -> ~u_L      ub)
     3.52118980E-03    2    -1000002         2   # BR(~chi_40 -> ~u_L*     u )
     5.73741791E-23    2     2000002        -2   # BR(~chi_40 -> ~u_R      ub)
     5.73741791E-23    2    -2000002         2   # BR(~chi_40 -> ~u_R*     u )
     3.52119225E-03    2     1000001        -1   # BR(~chi_40 -> ~d_L      db)
     3.52119225E-03    2    -1000001         1   # BR(~chi_40 -> ~d_L*     d )
     6.79782339E-17    2     2000001        -1   # BR(~chi_40 -> ~d_R      db)
     6.79782339E-17    2    -2000001         1   # BR(~chi_40 -> ~d_R*     d )
     3.52118980E-03    2     1000004        -4   # BR(~chi_40 -> ~c_L      cb)
     3.52118980E-03    2    -1000004         4   # BR(~chi_40 -> ~c_L*     c )
     5.73741791E-23    2     2000004        -4   # BR(~chi_40 -> ~c_R      cb)
     5.73741791E-23    2    -2000004         4   # BR(~chi_40 -> ~c_R*     c )
     3.52119225E-03    2     1000003        -3   # BR(~chi_40 -> ~s_L      sb)
     3.52119225E-03    2    -1000003         3   # BR(~chi_40 -> ~s_L*     s )
     6.79782339E-17    2     2000003        -3   # BR(~chi_40 -> ~s_R      sb)
     6.79782339E-17    2    -2000003         3   # BR(~chi_40 -> ~s_R*     s )
     4.30565949E-03    2     1000006        -6   # BR(~chi_40 -> ~t_1      tb)
     4.30565949E-03    2    -1000006         6   # BR(~chi_40 -> ~t_1*     t )
     2.08773453E-01    2     1000005        -5   # BR(~chi_40 -> ~b_1      bb)
     2.08773453E-01    2    -1000005         5   # BR(~chi_40 -> ~b_1*     b )
     2.28730932E-01    2     2000005        -5   # BR(~chi_40 -> ~b_2      bb)
     2.28730932E-01    2    -2000005         5   # BR(~chi_40 -> ~b_2*     b )
     1.90500224E-15    2     1000011       -11   # BR(~chi_40 -> ~e_L-     e+)
     1.90500224E-15    2    -1000011        11   # BR(~chi_40 -> ~e_L+     e-)
     3.30992735E-28    2     2000011       -11   # BR(~chi_40 -> ~e_R-     e+)
     3.30992735E-28    2    -2000011        11   # BR(~chi_40 -> ~e_R+     e-)
     1.90500224E-15    2     1000013       -13   # BR(~chi_40 -> ~mu_L-    mu+)
     1.90500224E-15    2    -1000013        13   # BR(~chi_40 -> ~mu_L+    mu-)
     3.30992735E-28    2     2000013       -13   # BR(~chi_40 -> ~mu_R-    mu+)
     3.30992735E-28    2    -2000013        13   # BR(~chi_40 -> ~mu_R+    mu-)
     2.72076597E-15    2     1000012       -12   # BR(~chi_40 -> ~nu_eL    nu_eb)
     2.72076597E-15    2    -1000012        12   # BR(~chi_40 -> ~nu_eL*   nu_e )
     2.72076597E-15    2     1000014       -14   # BR(~chi_40 -> ~nu_muL   nu_mub)
     2.72076597E-15    2    -1000014        14   # BR(~chi_40 -> ~nu_muL*  nu_mu )
     2.72076597E-15    2     1000016       -16   # BR(~chi_40 -> ~nu_tau1  nu_taub)
     2.72076597E-15    2    -1000016        16   # BR(~chi_40 -> ~nu_tau1* nu_tau )
     1.85645937E-02    2     1000039        22   # BR(~chi_40 -> ~G        gam)
     5.82448263E-02    2     1000039        23   # BR(~chi_40 -> ~G        Z)
     3.52792821E-09    2     1000039        25   # BR(~chi_40 -> ~G        h)
     2.21394493E-08    2     1000039        35   # BR(~chi_40 -> ~G        H)
     4.36299950E-12    2     1000039        36   # BR(~chi_40 -> ~G        A)
#
#
#
#
