#
#                              ======================
#                              | THE SUSYHIT OUTPUT |
#                              ======================
#
#
#              ------------------------------------------------------
#              |     This is the output of the SUSY-HIT package     |
#              |  created by A.Djouadi, M.Muehlleitner and M.Spira. |
#              |  In case of problems with SUSY-HIT email to        |
#              |           margarete.muehlleitner@kit.edu           |
#              |           michael.spira@psi.ch                     |
#              |           abdelhak.djouadi@cern.ch                 |
#              ------------------------------------------------------
#
#              ------------------------------------------------------
#              |  SUSY Les Houches Accord - MSSM Spectrum + Decays  |
#              |              based on the decay programs           |
#              |                                                    |
#              |                     SDECAY 1.5                     |
#              |                                                    |
#              |  Authors: M.Muhlleitner, A.Djouadi and Y.Mambrini  |
#              |  Ref.:    Comput.Phys.Commun.168(2005)46           |
#              |           [hep-ph/0311167]                         |
#              |                                                    |
#              |                     HDECAY 3.4                     |
#              |                                                    |
#              |  By: A.Djouadi,J.Kalinowski,M.Muhlleitner,M.Spira  |
#              |  Ref.:    Comput.Phys.Commun.108(1998)56           |
#              |           [hep-ph/9704448]                         |
#              |                                                    |
#              |                                                    |
#              |  If not stated otherwise all DRbar couplings and   |
#              |  soft SUSY breaking masses are given at the scale  |
#              |  Q=  0.11040911E+04
#              |                                                    |
#              ------------------------------------------------------
#
#
BLOCK DCINFO  # Decay Program information
     1   SDECAY/HDECAY # decay calculator
     2   1.5  /3.4    # version number
#
BLOCK SPINFO  # Spectrum calculator information
     1    SOFTSUSY    # spectrum calculator                
     2    3.7.3       # version number                     
#
BLOCK MODSEL  # Model selection
     1     0   #  nonUniversal                                     
#
BLOCK SMINPUTS  # Standard Model inputs
         1     1.27934000E+02   # alpha_em^-1(M_Z)^MSbar
         2     1.16639000E-05   # G_F [GeV^-2]
         3     1.17200000E-01   # alpha_S(M_Z)^MSbar
         4     9.11870000E+01   # M_Z pole mass
         5     4.19000000E+00   # mb(mb)^MSbar
         6     1.72500000E+02   # mt pole mass
         7     1.77690000E+00   # mtau pole mass
#
BLOCK MINPAR  # Input parameters - minimal models
         3     2.00000000E+01   # tanb                
#
BLOCK EXTPAR  # Input parameters - non-minimal models
         0    -1.00000000E+00   # Set                 
         1     1.09990000E+02   # M_1(MX)             
         2     2.00000000E+03   # M_2(MX)             
         3     1.80000000E+03   # M_3(MX)             
        11     2.42959179E+03   # At(MX)              
        12     0.00000000E+00   # Ab(MX)              
        13     0.00000000E+00   # Atau(MX)            
        23    -1.24900000E+02   # mu(MX)              
        25     2.00000000E+01   # tan                 
        26     4.00000000E+03   # mA(pole)            
        31     4.00000000E+03   # meL(MX)             
        32     4.00000000E+03   # mmuL(MX)            
        33     4.00000000E+03   # mtauL(MX)           
        34     4.00000000E+03   # meR(MX)             
        35     4.00000000E+03   # mmuR(MX)            
        36     4.00000000E+03   # mtauR(MX)           
        41     4.00000000E+03   # mqL1(MX)            
        42     4.00000000E+03   # mqL2(MX)            
        43     2.19485961E+03   # mqL3(MX)            
        44     4.00000000E+03   # muR(MX)             
        45     4.00000000E+03   # mcR(MX)             
        46     5.59990000E+02   # mtR(MX)             
        47     4.00000000E+03   # mdR(MX)             
        48     4.00000000E+03   # msR(MX)             
        49     4.00000000E+03   # mbR(MX)             
#
BLOCK MASS  # Mass Spectrum
# PDG code           mass       particle
        24     8.04186802E+01   # W+
        25     1.25199990E+02   # h
        35     4.00000020E+03   # H
        36     3.99999585E+03   # A
        37     4.00103519E+03   # H+
         5     4.81337004E+00   # b-quark pole mass calculated from mb(mb)_Msbar
   1000001     4.02008187E+03   # ~d_L
   2000001     4.01803113E+03   # ~d_R
   1000002     4.01942945E+03   # ~u_L
   2000002     4.01853347E+03   # ~u_R
   1000003     4.02008187E+03   # ~s_L
   2000003     4.01803113E+03   # ~s_R
   1000004     4.01942945E+03   # ~c_L
   2000004     4.01853347E+03   # ~c_R
   1000005     2.22000646E+03   # ~b_1
   2000005     4.02257492E+03   # ~b_2
   1000006     6.02000452E+02   # ~t_1
   2000006     2.23012471E+03   # ~t_2
   1000011     4.00316733E+03   # ~e_L
   2000011     4.00374906E+03   # ~e_R
   1000012     4.00205372E+03   # ~nu_eL
   1000013     4.00316733E+03   # ~mu_L
   2000013     4.00374906E+03   # ~mu_R
   1000014     4.00205372E+03   # ~nu_muL
   1000015     4.00500637E+03   # ~tau_1
   2000015     4.00780886E+03   # ~tau_2
   1000016     4.00402362E+03   # ~nu_tauL
   1000021     1.98346095E+03   # ~g
   1000022     9.12227290E+01   # ~chi_10
   1000023    -1.35342507E+02   # ~chi_20
   1000025     1.53411249E+02   # ~chi_30
   1000035     2.06788103E+03   # ~chi_40
   1000024     1.29849778E+02   # ~chi_1+
   1000037     2.06804905E+03   # ~chi_2+
#
BLOCK NMIX  # Neutralino Mixing Matrix
  1  1    -7.50919664E-01   # N_11
  1  2     1.41421205E-02   # N_12
  1  3     5.43003633E-01   # N_13
  1  4     3.75588488E-01   # N_14
  2  1    -1.37037335E-01   # N_21
  2  2     2.72674668E-02   # N_22
  2  3    -6.84872710E-01   # N_23
  2  4     7.15140983E-01   # N_24
  3  1     6.46018277E-01   # N_31
  3  2     2.36166183E-02   # N_32
  3  3     4.85897309E-01   # N_33
  3  4     5.88223126E-01   # N_34
  4  1    -9.01186456E-04   # N_41
  4  2     9.99249089E-01   # N_42
  4  3    -4.80090695E-04   # N_43
  4  4    -3.87326264E-02   # N_44
#
BLOCK UMIX  # Chargino Mixing Matrix U
  1  1     6.83238344E-04   # U_11
  1  2     9.99999767E-01   # U_12
  2  1    -9.99999767E-01   # U_21
  2  2     6.83238344E-04   # U_22
#
BLOCK VMIX  # Chargino Mixing Matrix V
  1  1     5.47895086E-02   # V_11
  1  2    -9.98497927E-01   # V_12
  2  1    -9.98497927E-01   # V_21
  2  2    -5.47895086E-02   # V_22
#
BLOCK STOPMIX  # Stop Mixing Matrix
  1  1    -8.03382456E-02   # cos(theta_t)
  1  2     9.96767659E-01   # sin(theta_t)
  2  1    -9.96767659E-01   # -sin(theta_t)
  2  2    -8.03382456E-02   # cos(theta_t)
#
BLOCK SBOTMIX  # Sbottom Mixing Matrix
  1  1     9.99999853E-01   # cos(theta_b)
  1  2    -5.42217648E-04   # sin(theta_b)
  2  1     5.42217648E-04   # -sin(theta_b)
  2  2     9.99999853E-01   # cos(theta_b)
#
BLOCK STAUMIX  # Stau Mixing Matrix
  1  1    -7.03372693E-01   # cos(theta_tau)
  1  2     7.10821254E-01   # sin(theta_tau)
  2  1    -7.10821254E-01   # -sin(theta_tau)
  2  2    -7.03372693E-01   # cos(theta_tau)
#
BLOCK ALPHA  # Higgs mixing
          -5.00313722E-02   # Mixing angle in the neutral Higgs boson sector
#
BLOCK HMIX Q=  1.10409114E+03  # DRbar Higgs Parameters
         1    -1.24900000E+02   # mu(Q)MSSM           
         2     2.00000000E+01   # tan                 
         3     2.43991086E+02   # higgs               
         4     1.61276342E+07   # mA^2(Q)MSSM         
#
BLOCK GAUGE Q=  1.10409114E+03  # The gauge couplings
     1     3.61708685E-01   # gprime(Q) DRbar
     2     6.36392146E-01   # g(Q) DRbar
     3     1.03305296E+00   # g3(Q) DRbar
#
BLOCK AU Q=  1.10409114E+03  # The trilinear couplings
  1  1     0.00000000E+00   # A_u(Q) DRbar
  2  2     9.35817553E-07   # A_c(Q) DRbar
  3  3     2.42959179E+03   # A_t(Q) DRbar
#
BLOCK AD Q=  1.10409114E+03  # The trilinear couplings
  1  1     3.43106758E-07   # A_d(Q) DRbar
  2  2     3.43139463E-07   # A_s(Q) DRbar
  3  3     6.13756418E-07   # A_b(Q) DRbar
#
BLOCK AE Q=  1.10409114E+03  # The trilinear couplings
  1  1     0.00000000E+00   # A_e(Q) DRbar
  2  2     7.43013748E-08   # A_mu(Q) DRbar
  3  3     7.50618871E-08   # A_tau(Q) DRbar
#
BLOCK Yu Q=  1.10409114E+03  # The Yukawa couplings
  1  1     0.00000000E+00   # y_u(Q) DRbar
  2  2     0.00000000E+00   # y_c(Q) DRbar
  3  3     8.70244770E-01   # y_t(Q) DRbar
#
BLOCK Yd Q=  1.10409114E+03  # The Yukawa couplings
  1  1     0.00000000E+00   # y_d(Q) DRbar
  2  2     0.00000000E+00   # y_s(Q) DRbar
  3  3     2.81416471E-01   # y_b(Q) DRbar
#
BLOCK Ye Q=  1.10409114E+03  # The Yukawa couplings
  1  1     0.00000000E+00   # y_e(Q) DRbar
  2  2     0.00000000E+00   # y_mu(Q) DRbar
  3  3     2.04043757E-01   # y_tau(Q) DRbar
#
BLOCK MSOFT Q=  1.10409114E+03  # The soft SUSY breaking masses at the scale Q
         1     1.09990000E+02   # M_1(Q)              
         2     2.00000000E+03   # M_2(Q)              
         3     1.80000000E+03   # M_3(Q)              
        21     1.58616725E+07   # M^2_Hd              
        22    -4.15011155E+04   # M^2_Hu              
        31     4.00000000E+03   # M_eL                
        32     4.00000000E+03   # M_muL               
        33     4.00000000E+03   # M_tauL              
        34     4.00000000E+03   # M_eR                
        35     4.00000000E+03   # M_muR               
        36     4.00000000E+03   # M_tauR              
        41     4.00000000E+03   # M_q1L               
        42     4.00000000E+03   # M_q2L               
        43     2.19485961E+03   # M_q3L               
        44     4.00000000E+03   # M_uR                
        45     4.00000000E+03   # M_cR                
        46     5.59989995E+02   # M_tR                
        47     4.00000000E+03   # M_dR                
        48     4.00000000E+03   # M_sR                
        49     4.00000000E+03   # M_bR                
#
#
#
#                             =================
#                             |The decay table|
#                             =================
#
# - The QCD corrections to the decays gluino -> squark  + quark
#                                     squark -> gaugino + quark_prime
#                                     squark -> squark_prime + Higgs
#                                     squark -> gluino  + quark
#   are included.
#
# - The multi-body decays for the inos, stops and sbottoms are included.
#
# - The loop induced decays for the gluino, neutralinos and stops
#   are included.
#
# - The SUSY decays of the top quark are included.
#
#
#         PDG            Width
DECAY         6     1.40499739E+00   # top decays
#          BR         NDA      ID1       ID2
     1.00000000E+00    2           5        24   # BR(t ->  b    W+)
#
#         PDG            Width
DECAY   1000021     3.44774211E+01   # gluino decays
#          BR         NDA      ID1       ID2
     5.00000000E-01    2     1000006        -6   # BR(~g -> ~t_1  tb)
     5.00000000E-01    2    -1000006         6   # BR(~g -> ~t_1* t )
#
#         PDG            Width
DECAY   1000006     1.63182869E+01   # stop1 decays
#          BR         NDA      ID1       ID2
     8.91556658E-02    2     1000022         6   # BR(~t_1 -> ~chi_10 t )
     2.14079593E-01    2     1000023         6   # BR(~t_1 -> ~chi_20 t )
     1.97708720E-01    2     1000025         6   # BR(~t_1 -> ~chi_30 t )
     4.99056021E-01    2     1000024         5   # BR(~t_1 -> ~chi_1+ b )
#
#         PDG            Width
DECAY   2000006     6.84402972E+01   # stop2 decays
#          BR         NDA      ID1       ID2
     7.41680005E-02    2     1000022         6   # BR(~t_2 -> ~chi_10 t )
     2.40587783E-01    2     1000023         6   # BR(~t_2 -> ~chi_20 t )
     1.55148217E-01    2     1000025         6   # BR(~t_2 -> ~chi_30 t )
     5.15390255E-02    2     1000024         5   # BR(~t_2 -> ~chi_1+ b )
     5.14404293E-03    2     1000037         5   # BR(~t_2 -> ~chi_2+ b )
     9.52151278E-02    2     1000021         6   # BR(~t_2 -> ~g      t )
     2.53787677E-01    2     1000006        25   # BR(~t_2 -> ~t_1    h )
     1.24410126E-01    2     1000006        23   # BR(~t_2 -> ~t_1    Z )
#
#         PDG            Width
DECAY   1000005     6.40733255E+01   # sbottom1 decays
#          BR         NDA      ID1       ID2
     1.75581582E-02    2     1000022         5   # BR(~b_1 -> ~chi_10 b )
     2.30362083E-02    2     1000023         5   # BR(~b_1 -> ~chi_20 b )
     1.26526998E-02    2     1000025         5   # BR(~b_1 -> ~chi_30 b )
     2.49472483E-03    2     1000035         5   # BR(~b_1 -> ~chi_40 b )
     4.91476512E-01    2    -1000024         6   # BR(~b_1 -> ~chi_1- t )
     1.09533819E-01    2     1000021         5   # BR(~b_1 -> ~g      b )
     3.43247878E-01    2     1000006       -24   # BR(~b_1 -> ~t_1    W-)
#
#         PDG            Width
DECAY   2000005     1.64165017E+02   # sbottom2 decays
#          BR         NDA      ID1       ID2
     1.82617667E-02    2     1000022         5   # BR(~b_2 -> ~chi_10 b )
     1.70828830E-02    2     1000023         5   # BR(~b_2 -> ~chi_20 b )
     1.41518688E-02    2     1000025         5   # BR(~b_2 -> ~chi_30 b )
     3.98653517E-08    2     1000035         5   # BR(~b_2 -> ~chi_40 b )
     3.57751728E-02    2    -1000024         6   # BR(~b_2 -> ~chi_1- t )
     6.80825171E-08    2    -1000037         6   # BR(~b_2 -> ~chi_2- t )
     9.14680202E-01    2     1000021         5   # BR(~b_2 -> ~g      b )
     1.12796535E-05    2     1000005        25   # BR(~b_2 -> ~b_1    h )
     1.34076745E-05    2     1000005        23   # BR(~b_2 -> ~b_1    Z )
     4.29180911E-07    2     1000006       -24   # BR(~b_2 -> ~t_1    W-)
     2.28824103E-05    2     2000006       -24   # BR(~b_2 -> ~t_2    W-)
#
#         PDG            Width
DECAY   1000002     1.75980199E+02   # sup_L decays
#          BR         NDA      ID1       ID2
     1.45293135E-03    2     1000022         2   # BR(~u_L -> ~chi_10 u)
     1.50489486E-07    2     1000023         2   # BR(~u_L -> ~chi_20 u)
     1.88379290E-03    2     1000025         2   # BR(~u_L -> ~chi_30 u)
     4.81121222E-02    2     1000035         2   # BR(~u_L -> ~chi_40 u)
     5.30896683E-04    2     1000024         1   # BR(~u_L -> ~chi_1+ d)
     9.61013109E-02    2     1000037         1   # BR(~u_L -> ~chi_2+ d)
     8.51918795E-01    2     1000021         2   # BR(~u_L -> ~g      u)
#
#         PDG            Width
DECAY   2000002     1.58781167E+02   # sup_R decays
#          BR         NDA      ID1       ID2
     3.17593709E-02    2     1000022         2   # BR(~u_R -> ~chi_10 u)
     1.05658878E-03    2     1000023         2   # BR(~u_R -> ~chi_20 u)
     2.34676337E-02    2     1000025         2   # BR(~u_R -> ~chi_30 u)
     2.49034344E-08    2     1000035         2   # BR(~u_R -> ~chi_40 u)
     9.43716382E-01    2     1000021         2   # BR(~u_R -> ~g      u)
#
#         PDG            Width
DECAY   1000001     1.75998930E+02   # sdown_L decays
#          BR         NDA      ID1       ID2
     2.16534562E-03    2     1000022         1   # BR(~d_L -> ~chi_10 d)
     2.50530292E-04    2     1000023         1   # BR(~d_L -> ~chi_20 d)
     8.62190738E-04    2     1000025         1   # BR(~d_L -> ~chi_30 d)
     4.81589370E-02    2     1000035         1   # BR(~d_L -> ~chi_40 d)
     8.25630228E-08    2    -1000024         2   # BR(~d_L -> ~chi_1- u)
     9.64184958E-02    2    -1000037         2   # BR(~d_L -> ~chi_2- u)
     8.52144418E-01    2     1000021         1   # BR(~d_L -> ~g      d)
#
#         PDG            Width
DECAY   2000001     1.52035433E+02   # sdown_R decays
#          BR         NDA      ID1       ID2
     8.29107033E-03    2     1000022         1   # BR(~d_R -> ~chi_10 d)
     2.75831964E-04    2     1000023         1   # BR(~d_R -> ~chi_20 d)
     6.12643509E-03    2     1000025         1   # BR(~d_R -> ~chi_30 d)
     6.50011497E-09    2     1000035         1   # BR(~d_R -> ~chi_40 d)
     9.85306656E-01    2     1000021         1   # BR(~d_R -> ~g      d)
#
#         PDG            Width
DECAY   1000004     1.75980199E+02   # scharm_L decays
#          BR         NDA      ID1       ID2
     1.45293135E-03    2     1000022         4   # BR(~c_L -> ~chi_10 c)
     1.50489486E-07    2     1000023         4   # BR(~c_L -> ~chi_20 c)
     1.88379290E-03    2     1000025         4   # BR(~c_L -> ~chi_30 c)
     4.81121222E-02    2     1000035         4   # BR(~c_L -> ~chi_40 c)
     5.30896683E-04    2     1000024         3   # BR(~c_L -> ~chi_1+ s)
     9.61013109E-02    2     1000037         3   # BR(~c_L -> ~chi_2+ s)
     8.51918795E-01    2     1000021         4   # BR(~c_L -> ~g      c)
#
#         PDG            Width
DECAY   2000004     1.58781167E+02   # scharm_R decays
#          BR         NDA      ID1       ID2
     3.17593709E-02    2     1000022         4   # BR(~c_R -> ~chi_10 c)
     1.05658878E-03    2     1000023         4   # BR(~c_R -> ~chi_20 c)
     2.34676337E-02    2     1000025         4   # BR(~c_R -> ~chi_30 c)
     2.49034344E-08    2     1000035         4   # BR(~c_R -> ~chi_40 c)
     9.43716382E-01    2     1000021         4   # BR(~c_R -> ~g      c)
#
#         PDG            Width
DECAY   1000003     1.75998930E+02   # sstrange_L decays
#          BR         NDA      ID1       ID2
     2.16534562E-03    2     1000022         3   # BR(~s_L -> ~chi_10 s)
     2.50530292E-04    2     1000023         3   # BR(~s_L -> ~chi_20 s)
     8.62190738E-04    2     1000025         3   # BR(~s_L -> ~chi_30 s)
     4.81589370E-02    2     1000035         3   # BR(~s_L -> ~chi_40 s)
     8.25630228E-08    2    -1000024         4   # BR(~s_L -> ~chi_1- c)
     9.64184958E-02    2    -1000037         4   # BR(~s_L -> ~chi_2- c)
     8.52144418E-01    2     1000021         3   # BR(~s_L -> ~g      s)
#
#         PDG            Width
DECAY   2000003     1.52035433E+02   # sstrange_R decays
#          BR         NDA      ID1       ID2
     8.29107033E-03    2     1000022         3   # BR(~s_R -> ~chi_10 s)
     2.75831964E-04    2     1000023         3   # BR(~s_R -> ~chi_20 s)
     6.12643509E-03    2     1000025         3   # BR(~s_R -> ~chi_30 s)
     6.50011497E-09    2     1000035         3   # BR(~s_R -> ~chi_40 s)
     9.85306656E-01    2     1000021         3   # BR(~s_R -> ~g      s)
#
#         PDG            Width
DECAY   1000011     3.12226629E+01   # selectron_L decays
#          BR         NDA      ID1       ID2
     8.78656866E-02    2     1000022        11   # BR(~e_L -> ~chi_10 e-)
     1.32053900E-03    2     1000023        11   # BR(~e_L -> ~chi_20 e-)
     7.86517605E-02    2     1000025        11   # BR(~e_L -> ~chi_30 e-)
     2.76941858E-01    2     1000035        11   # BR(~e_L -> ~chi_40 e-)
     4.81220004E-07    2    -1000024        12   # BR(~e_L -> ~chi_1- nu_e)
     5.55219675E-01    2    -1000037        12   # BR(~e_L -> ~chi_2- nu_e)
#
#         PDG            Width
DECAY   2000011     2.08036392E+01   # selectron_R decays
#          BR         NDA      ID1       ID2
     5.64340842E-01    2     1000022        11   # BR(~e_R -> ~chi_10 e-)
     1.87711228E-02    2     1000023        11   # BR(~e_R -> ~chi_20 e-)
     4.16887598E-01    2     1000025        11   # BR(~e_R -> ~chi_30 e-)
     4.37451157E-07    2     1000035        11   # BR(~e_R -> ~chi_40 e-)
#
#         PDG            Width
DECAY   1000013     3.12226629E+01   # smuon_L decays
#          BR         NDA      ID1       ID2
     8.78656866E-02    2     1000022        13   # BR(~mu_L -> ~chi_10 mu-)
     1.32053900E-03    2     1000023        13   # BR(~mu_L -> ~chi_20 mu-)
     7.86517605E-02    2     1000025        13   # BR(~mu_L -> ~chi_30 mu-)
     2.76941858E-01    2     1000035        13   # BR(~mu_L -> ~chi_40 mu-)
     4.81220004E-07    2    -1000024        14   # BR(~mu_L -> ~chi_1- nu_mu)
     5.55219675E-01    2    -1000037        14   # BR(~mu_L -> ~chi_2- nu_mu)
#
#         PDG            Width
DECAY   2000013     2.08036392E+01   # smuon_R decays
#          BR         NDA      ID1       ID2
     5.64340842E-01    2     1000022        13   # BR(~mu_R -> ~chi_10 mu-)
     1.87711228E-02    2     1000023        13   # BR(~mu_R -> ~chi_20 mu-)
     4.16887598E-01    2     1000025        13   # BR(~mu_R -> ~chi_30 mu-)
     4.37451157E-07    2     1000035        13   # BR(~mu_R -> ~chi_40 mu-)
#
#         PDG            Width
DECAY   1000015     3.09678458E+01   # stau_1 decays
#          BR         NDA      ID1       ID2
     3.23514242E-01    2     1000022        15   # BR(~tau_1 -> ~chi_10  tau-)
     4.01874894E-02    2     1000023        15   # BR(~tau_1 -> ~chi_20  tau-)
     1.66689710E-01    2     1000025        15   # BR(~tau_1 -> ~chi_30  tau-)
     1.38234770E-01    2     1000035        15   # BR(~tau_1 -> ~chi_40  tau-)
     5.42382498E-02    2    -1000024        16   # BR(~tau_1 -> ~chi_1-  nu_tau)
     2.77135538E-01    2    -1000037        16   # BR(~tau_1 -> ~chi_2-  nu_tau)
#
#         PDG            Width
DECAY   2000015     3.10629772E+01   # stau_2 decays
#          BR         NDA      ID1       ID2
     2.06963798E-01    2     1000022        15   # BR(~tau_2 -> ~chi_10  tau-)
     7.38444235E-02    2     1000023        15   # BR(~tau_2 -> ~chi_20  tau-)
     2.42647588E-01    2     1000025        15   # BR(~tau_2 -> ~chi_30  tau-)
     1.41110071E-01    2     1000035        15   # BR(~tau_2 -> ~chi_40  tau-)
     5.25323358E-02    2    -1000024        16   # BR(~tau_2 -> ~chi_1-  nu_tau)
     2.82901784E-01    2    -1000037        16   # BR(~tau_2 -> ~chi_2-  nu_tau)
#
#         PDG            Width
DECAY   1000012     3.12336818E+01   # snu_eL decays
#          BR         NDA      ID1       ID2
     1.00259942E-01    2     1000022        12   # BR(~nu_eL -> ~chi_10 nu_e)
     5.69485844E-03    2     1000023        12   # BR(~nu_eL -> ~chi_20 nu_e)
     6.07499307E-02    2     1000025        12   # BR(~nu_eL -> ~chi_30 nu_e)
     2.77222854E-01    2     1000035        12   # BR(~nu_eL -> ~chi_40 nu_e)
     3.09256929E-03    2     1000024        11   # BR(~nu_eL -> ~chi_1+ e-)
     5.52979846E-01    2     1000037        11   # BR(~nu_eL -> ~chi_2+ e-)
#
#         PDG            Width
DECAY   1000014     3.12336818E+01   # snu_muL decays
#          BR         NDA      ID1       ID2
     1.00259942E-01    2     1000022        14   # BR(~nu_muL -> ~chi_10 nu_mu)
     5.69485844E-03    2     1000023        14   # BR(~nu_muL -> ~chi_20 nu_mu)
     6.07499307E-02    2     1000025        14   # BR(~nu_muL -> ~chi_30 nu_mu)
     2.77222854E-01    2     1000035        14   # BR(~nu_muL -> ~chi_40 nu_mu)
     3.09256929E-03    2     1000024        13   # BR(~nu_muL -> ~chi_1+ mu-)
     5.52979846E-01    2     1000037        13   # BR(~nu_muL -> ~chi_2+ mu-)
#
#         PDG            Width
DECAY   1000016     3.45771523E+01   # snu_tauL decays
#          BR         NDA      ID1       ID2
     9.06098828E-02    2     1000022        16   # BR(~nu_tauL -> ~chi_10 nu_tau)
     5.14673239E-03    2     1000023        16   # BR(~nu_tauL -> ~chi_20 nu_tau)
     5.49028286E-02    2     1000025        16   # BR(~nu_tauL -> ~chi_30 nu_tau)
     2.50719355E-01    2     1000035        16   # BR(~nu_tauL -> ~chi_40 nu_tau)
     9.85086108E-02    2     1000024        15   # BR(~nu_tauL -> ~chi_1+ tau-)
     5.00112590E-01    2     1000037        15   # BR(~nu_tauL -> ~chi_2+ tau-)
#
#         PDG            Width
DECAY   1000024     3.43967102E-05   # chargino1+ decays
#           BR         NDA      ID1       ID2       ID3
     3.33720527E-01    3     1000022         2        -1   # BR(~chi_1+ -> ~chi_10 u    db)
     3.33720527E-01    3     1000022         4        -3   # BR(~chi_1+ -> ~chi_10 c    sb)
     1.11240950E-01    3     1000022       -11        12   # BR(~chi_1+ -> ~chi_10 e+   nu_e)
     1.11240950E-01    3     1000022       -13        14   # BR(~chi_1+ -> ~chi_10 mu+  nu_mu)
     1.10077046E-01    3     1000022       -15        16   # BR(~chi_1+ -> ~chi_10 tau+ nu_tau)
#
#         PDG            Width
DECAY   1000037     1.69866382E+01   # chargino2+ decays
#          BR         NDA      ID1       ID2
     3.27974138E-02    2     1000006        -5   # BR(~chi_2+ -> ~t_1     bb)
     2.46815333E-01    2     1000024        23   # BR(~chi_2+ -> ~chi_1+  Z )
     6.21818088E-02    2     1000022        24   # BR(~chi_2+ -> ~chi_10  W+)
     2.43951574E-01    2     1000023        24   # BR(~chi_2+ -> ~chi_20  W+)
     1.74604330E-01    2     1000025        24   # BR(~chi_2+ -> ~chi_30  W+)
     2.39649541E-01    2     1000024        25   # BR(~chi_2+ -> ~chi_1+  h )
#
#         PDG            Width
DECAY   1000022     0.00000000E+00   # neutralino1 decays
#
#         PDG            Width
DECAY   1000023     4.69549376E-05   # neutralino2 decays
#          BR         NDA      ID1       ID2
     1.05477588E-03    2     1000022        22   # BR(~chi_20 -> ~chi_10 gam)
#           BR         NDA      ID1       ID2       ID3
     1.18528715E-01    3     1000022        -2         2   # BR(~chi_20 -> ~chi_10 ub      u)
     1.53723818E-01    3     1000022        -1         1   # BR(~chi_20 -> ~chi_10 db      d)
     1.18528715E-01    3     1000022        -4         4   # BR(~chi_20 -> ~chi_10 cb      c)
     1.53723818E-01    3     1000022        -3         3   # BR(~chi_20 -> ~chi_10 sb      s)
     1.37606946E-01    3     1000022        -5         5   # BR(~chi_20 -> ~chi_10 bb      b)
     3.52341504E-02    3     1000022       -11        11   # BR(~chi_20 -> ~chi_10 e+      e-)
     3.52341504E-02    3     1000022       -13        13   # BR(~chi_20 -> ~chi_10 mu+     mu-)
     3.48036775E-02    3     1000022       -15        15   # BR(~chi_20 -> ~chi_10 tau+    tau-)
     7.04458042E-02    3     1000022       -12        12   # BR(~chi_20 -> ~chi_10 nu_eb   nu_e)
     7.04458042E-02    3     1000022       -14        14   # BR(~chi_20 -> ~chi_10 nu_mub  nu_mu)
     7.04458005E-02    3     1000022       -16        16   # BR(~chi_20 -> ~chi_10 nu_taub nu_tau)
     3.90099624E-05    3     1000024        -2         1   # BR(~chi_20 -> ~chi_1+ ub      d)
     3.90099624E-05    3    -1000024        -1         2   # BR(~chi_20 -> ~chi_1- db      u)
     3.90099624E-05    3     1000024        -4         3   # BR(~chi_20 -> ~chi_1+ cb      s)
     3.90099624E-05    3    -1000024        -3         4   # BR(~chi_20 -> ~chi_1- sb      c)
     1.30033533E-05    3     1000024       -12        11   # BR(~chi_20 -> ~chi_1+ nu_eb   e-)
     1.30033533E-05    3    -1000024        12       -11   # BR(~chi_20 -> ~chi_1- nu_e    e+)
     1.30033533E-05    3     1000024       -14        13   # BR(~chi_20 -> ~chi_1+ nu_mub  mu-)
     1.30033533E-05    3    -1000024        14       -13   # BR(~chi_20 -> ~chi_1- nu_mu   mu+)
     7.88526229E-06    3     1000024       -16        15   # BR(~chi_20 -> ~chi_1+ nu_taub tau-)
     7.88526229E-06    3    -1000024        16       -15   # BR(~chi_20 -> ~chi_1- nu_tau  tau+)
#
#         PDG            Width
DECAY   1000025     1.49106144E-05   # neutralino3 decays
#          BR         NDA      ID1       ID2
     1.38273765E-02    2     1000022        22   # BR(~chi_30 -> ~chi_10 gam)
     6.60538976E-02    2     1000023        22   # BR(~chi_30 -> ~chi_20 gam)
#           BR         NDA      ID1       ID2       ID3
     3.46998856E-02    3     1000022        -2         2   # BR(~chi_30 -> ~chi_10 ub      u)
     4.48739800E-02    3     1000022        -1         1   # BR(~chi_30 -> ~chi_10 db      d)
     3.46998856E-02    3     1000022        -4         4   # BR(~chi_30 -> ~chi_10 cb      c)
     4.48739800E-02    3     1000022        -3         3   # BR(~chi_30 -> ~chi_10 sb      s)
     4.23490553E-02    3     1000022        -5         5   # BR(~chi_30 -> ~chi_10 bb      b)
     1.01834607E-02    3     1000022       -11        11   # BR(~chi_30 -> ~chi_10 e+      e-)
     1.01834607E-02    3     1000022       -13        13   # BR(~chi_30 -> ~chi_10 mu+     mu-)
     1.00958238E-02    3     1000022       -15        15   # BR(~chi_30 -> ~chi_10 tau+    tau-)
     2.06142458E-02    3     1000022       -12        12   # BR(~chi_30 -> ~chi_10 nu_eb   nu_e)
     2.06142458E-02    3     1000022       -14        14   # BR(~chi_30 -> ~chi_10 nu_mub  nu_mu)
     2.06142041E-02    3     1000022       -16        16   # BR(~chi_30 -> ~chi_10 nu_taub nu_tau)
     7.35059692E-03    3     1000023        -2         2   # BR(~chi_30 -> ~chi_20 ub      u)
     9.53410987E-03    3     1000023        -1         1   # BR(~chi_30 -> ~chi_20 db      d)
     7.35059692E-03    3     1000023        -4         4   # BR(~chi_30 -> ~chi_20 cb      c)
     9.53410987E-03    3     1000023        -3         3   # BR(~chi_30 -> ~chi_20 sb      s)
     4.83904948E-03    3     1000023        -5         5   # BR(~chi_30 -> ~chi_20 bb      b)
     2.18587897E-03    3     1000023       -11        11   # BR(~chi_30 -> ~chi_20 e+      e-)
     2.18587897E-03    3     1000023       -13        13   # BR(~chi_30 -> ~chi_20 mu+     mu-)
     2.06769144E-03    3     1000023       -15        15   # BR(~chi_30 -> ~chi_20 tau+    tau-)
     4.36862532E-03    3     1000023       -12        12   # BR(~chi_30 -> ~chi_20 nu_eb   nu_e)
     4.36862532E-03    3     1000023       -14        14   # BR(~chi_30 -> ~chi_20 nu_mub  nu_mu)
     4.36862548E-03    3     1000023       -16        16   # BR(~chi_30 -> ~chi_20 nu_taub nu_tau)
     9.49878323E-02    3     1000024        -2         1   # BR(~chi_30 -> ~chi_1+ ub      d)
     9.49878323E-02    3    -1000024        -1         2   # BR(~chi_30 -> ~chi_1- db      u)
     9.49878323E-02    3     1000024        -4         3   # BR(~chi_30 -> ~chi_1+ cb      s)
     9.49878323E-02    3    -1000024        -3         4   # BR(~chi_30 -> ~chi_1- sb      c)
     3.16620634E-02    3     1000024       -12        11   # BR(~chi_30 -> ~chi_1+ nu_eb   e-)
     3.16620634E-02    3    -1000024        12       -11   # BR(~chi_30 -> ~chi_1- nu_e    e+)
     3.16620634E-02    3     1000024       -14        13   # BR(~chi_30 -> ~chi_1+ nu_mub  mu-)
     3.16620634E-02    3    -1000024        14       -13   # BR(~chi_30 -> ~chi_1- nu_mu   mu+)
     3.07815637E-02    3     1000024       -16        15   # BR(~chi_30 -> ~chi_1+ nu_taub tau-)
     3.07815637E-02    3    -1000024        16       -15   # BR(~chi_30 -> ~chi_1- nu_tau  tau+)
#
#         PDG            Width
DECAY   1000035     1.69761897E+01   # neutralino4 decays
#          BR         NDA      ID1       ID2
     3.38937365E-02    2     1000022        23   # BR(~chi_40 -> ~chi_10   Z )
     1.29366292E-01    2     1000023        23   # BR(~chi_40 -> ~chi_20   Z )
     8.35696706E-02    2     1000025        23   # BR(~chi_40 -> ~chi_30   Z )
     2.40784934E-01    2     1000024       -24   # BR(~chi_40 -> ~chi_1+   W-)
     2.40784934E-01    2    -1000024        24   # BR(~chi_40 -> ~chi_1-   W+)
     2.90137897E-02    2     1000022        25   # BR(~chi_40 -> ~chi_10   h )
     1.17258623E-01    2     1000023        25   # BR(~chi_40 -> ~chi_20   h )
     9.28784291E-02    2     1000025        25   # BR(~chi_40 -> ~chi_30   h )
     1.62247958E-02    2     1000006        -6   # BR(~chi_40 -> ~t_1      tb)
     1.62247958E-02    2    -1000006         6   # BR(~chi_40 -> ~t_1*     t )
#
#         PDG            Width
DECAY        25     4.01813846E-03   # h decays
#          BR         NDA      ID1       ID2
     6.01886929E-01    2           5        -5   # BR(h -> b       bb     )
     6.46794053E-02    2         -15        15   # BR(h -> tau+    tau-   )
     2.28966128E-04    2         -13        13   # BR(h -> mu+     mu-    )
     4.85827762E-04    2           3        -3   # BR(h -> s       sb     )
     2.10962996E-02    2           4        -4   # BR(h -> c       cb     )
     6.86448615E-02    2          21        21   # BR(h -> g       g      )
     2.35468144E-03    2          22        22   # BR(h -> gam     gam    )
     1.58418867E-03    2          22        23   # BR(h -> Z       gam    )
     2.12332215E-01    2          24       -24   # BR(h -> W+      W-     )
     2.67066254E-02    2          23        23   # BR(h -> Z       Z      )
#
#         PDG            Width
DECAY        35     5.40141934E+01   # H decays
#          BR         NDA      ID1       ID2
     3.38473447E-01    2           5        -5   # BR(H -> b       bb     )
     6.13837369E-02    2         -15        15   # BR(H -> tau+    tau-   )
     2.17038026E-04    2         -13        13   # BR(H -> mu+     mu-    )
     2.56718617E-04    2           3        -3   # BR(H -> s       sb     )
     7.20179189E-08    2           4        -4   # BR(H -> c       cb     )
     7.21769476E-03    2           6        -6   # BR(H -> t       tb     )
     1.05161711E-06    2          21        21   # BR(H -> g       g      )
     2.73054134E-10    2          22        22   # BR(H -> gam     gam    )
     1.85279007E-09    2          23        22   # BR(H -> Z       gam    )
     2.06573034E-06    2          24       -24   # BR(H -> W+      W-     )
     1.03214968E-06    2          23        23   # BR(H -> Z       Z      )
     7.37642551E-06    2          25        25   # BR(H -> h       h      )
     3.31215950E-24    2          36        36   # BR(H -> A       A      )
     6.71199137E-20    2          23        36   # BR(H -> Z       A      )
     1.87288700E-03    2     1000024  -1000024   # BR(H -> ~chi_1+ ~chi_1-)
     1.66811130E-01    2     1000024  -1000037   # BR(H -> ~chi_1+ ~chi_2-)
     1.66811130E-01    2     1000037  -1000024   # BR(H -> ~chi_2+ ~chi_1-)
     3.40705050E-02    2     1000022   1000022   # BR(H -> ~chi_10 ~chi_10)
     2.65103305E-03    2     1000023   1000023   # BR(H -> ~chi_20 ~chi_20)
     1.70849694E-02    2     1000025   1000025   # BR(H -> ~chi_30 ~chi_30)
     1.42316532E-02    2     1000022   1000023   # BR(H -> ~chi_10 ~chi_20)
     3.47997807E-04    2     1000022   1000025   # BR(H -> ~chi_10 ~chi_30)
     5.11129773E-02    2     1000022   1000035   # BR(H -> ~chi_10 ~chi_40)
     2.12392079E-02    2     1000023   1000025   # BR(H -> ~chi_20 ~chi_30)
     7.40109511E-02    2     1000023   1000035   # BR(H -> ~chi_20 ~chi_40)
     4.21585745E-02    2     1000025   1000035   # BR(H -> ~chi_30 ~chi_40)
     3.47951510E-05    2     1000006  -1000006   # BR(H -> ~t_1    ~t_1*  )
     9.76737656E-07    2     1000006  -2000006   # BR(H -> ~t_1    ~t_2*  )
     9.76737656E-07    2     2000006  -1000006   # BR(H -> ~t_2    ~t_1*  )
#
#         PDG            Width
DECAY        36     5.40127089E+01   # A decays
#          BR         NDA      ID1       ID2
     3.38508883E-01    2           5        -5   # BR(A -> b       bb     )
     6.13858540E-02    2         -15        15   # BR(A -> tau+    tau-   )
     2.17045341E-04    2         -13        13   # BR(A -> mu+     mu-    )
     2.56769098E-04    2           3        -3   # BR(A -> s       sb     )
     7.24720526E-08    2           4        -4   # BR(A -> c       cb     )
     7.23038777E-03    2           6        -6   # BR(A -> t       tb     )
     1.48566218E-05    2          21        21   # BR(A -> g       g      )
     4.07435204E-08    2          22        22   # BR(A -> gam     gam    )
     1.63356365E-08    2          23        22   # BR(A -> Z       gam    )
     2.06148924E-06    2          23        25   # BR(A -> Z       h      )
     1.87619691E-03    2     1000024  -1000024   # BR(A -> ~chi_1+ ~chi_1-)
     1.66817736E-01    2     1000024  -1000037   # BR(A -> ~chi_1+ ~chi_2-)
     1.66817736E-01    2     1000037  -1000024   # BR(A -> ~chi_2+ ~chi_1-)
     2.97270654E-02    2     1000022   1000022   # BR(A -> ~chi_10 ~chi_10)
     3.28301882E-03    2     1000023   1000023   # BR(A -> ~chi_20 ~chi_20)
     1.34846536E-02    2     1000025   1000025   # BR(A -> ~chi_30 ~chi_30)
     1.89989268E-02    2     1000022   1000023   # BR(A -> ~chi_10 ~chi_20)
     1.38515681E-04    2     1000022   1000025   # BR(A -> ~chi_10 ~chi_30)
     4.77462384E-02    2     1000022   1000035   # BR(A -> ~chi_10 ~chi_40)
     2.39945757E-02    2     1000023   1000025   # BR(A -> ~chi_20 ~chi_30)
     8.28116693E-02    2     1000023   1000035   # BR(A -> ~chi_20 ~chi_40)
     3.66852569E-02    2     1000025   1000035   # BR(A -> ~chi_30 ~chi_40)
     1.21184392E-06    2     1000006  -2000006   # BR(A -> ~t_1    ~t_2*  )
     1.21184392E-06    2    -1000006   2000006   # BR(A -> ~t_1*   ~t_2   )
#
#         PDG            Width
DECAY        37     5.38345388E+01   # H+ decays
#          BR         NDA      ID1       ID2
     5.38169282E-04    2           4        -5   # BR(H+ -> c       bb     )
     6.16050188E-02    2         -15        16   # BR(H+ -> tau+    nu_tau )
     2.17820254E-04    2         -13        14   # BR(H+ -> mu+     nu_mu  )
     3.44428041E-06    2           2        -5   # BR(H+ -> u       bb     )
     1.23399220E-05    2           2        -3   # BR(H+ -> u       sb     )
     2.53871878E-04    2           4        -3   # BR(H+ -> c       sb     )
     3.43249662E-01    2           6        -5   # BR(H+ -> t       bb     )
     2.07064884E-06    2          24        25   # BR(H+ -> W+      h      )
     2.96456163E-14    2          24        36   # BR(H+ -> W+      A      )
     4.72980918E-02    2     1000024   1000022   # BR(H+ -> ~chi_1+ ~chi_10)
     6.51916888E-04    2     1000024   1000023   # BR(H+ -> ~chi_1+ ~chi_20)
     4.25804262E-02    2     1000024   1000025   # BR(H+ -> ~chi_1+ ~chi_30)
     1.67587939E-01    2     1000024   1000035   # BR(H+ -> ~chi_1+ ~chi_40)
     9.92930813E-02    2     1000037   1000022   # BR(H+ -> ~chi_2+ ~chi_10)
     1.57511630E-01    2     1000037   1000023   # BR(H+ -> ~chi_2+ ~chi_20)
     7.91911648E-02    2     1000037   1000025   # BR(H+ -> ~chi_2+ ~chi_30)
     3.35304004E-06    2     1000006  -1000005   # BR(H+ -> ~t_1    ~b_1*  )
