#
#                              ======================
#                              | THE SUSYHIT OUTPUT |
#                              ======================
#
#
#              ------------------------------------------------------
#              |     This is the output of the SUSY-HIT package     |
#              |  created by A.Djouadi, M.Muehlleitner and M.Spira. |
#              |  In case of problems with SUSY-HIT email to        |
#              |           margarete.muehlleitner@cern.ch           |
#              |           michael.spira@psi.ch                     |
#              |           abdelhak.djouadi@cern.ch                 |
#              ------------------------------------------------------
#
#              ------------------------------------------------------
#              |  SUSY Les Houches Accord - MSSM Spectrum + Decays  |
#              |              based on the decay programs           |
#              |                                                    |
#              |                     SDECAY 1.3b                    |
#              |                                                    |
#              |  Authors: M.Muhlleitner, A.Djouadi and Y.Mambrini  |
#              |  Ref.:    Comput.Phys.Commun.168(2005)46           |
#              |           [hep-ph/0311167]                         |
#              |                                                    |
#              |                     HDECAY 3.4                     |
#              |                                                    |
#              |  By: A.Djouadi,J.Kalinowski,M.Muhlleitner,M.Spira  |
#              |  Ref.:    Comput.Phys.Commun.108(1998)56           |
#              |           [hep-ph/9704448]                         |
#              |                                                    |
#              |                                                    |
#              |  If not stated otherwise all DRbar couplings and   |
#              |  soft SUSY breaking masses are given at the scale  |
#              |  Q=  0.50007473E+04
#              |                                                    |
#              ------------------------------------------------------
#
#
BLOCK DCINFO  # Decay Program information
     1   SDECAY/HDECAY # decay calculator
     2   1.3b  /3.4    # version number
#
BLOCK SPINFO  # Spectrum calculator information
     1    SOFTSUSY    # spectrum calculator                
     2    3.4.0       # version number                     
#
BLOCK MODSEL  # Model selection
     1     0   #  nonUniversal                                     
#
BLOCK SMINPUTS  # Standard Model inputs
         1     1.25778332E+02   # alpha_em^-1(M_Z)^MSbar
         2     1.16570000E-05   # G_F [GeV^-2]
         3     1.17200002E-01   # alpha_S(M_Z)^MSbar
         4     9.11876000E+01   # M_Z pole mass
         5     4.25000000E+00   # mb(mb)^MSbar
         6     1.72500000E+02   # mt pole mass
         7     1.77682000E+00   # mtau pole mass
#
BLOCK MINPAR  # Input parameters - minimal models
         3     1.00000000E+01   # tanb                
#
BLOCK EXTPAR  # Input parameters - non-minimal models
         0    -1.00000000E+00   # Set                 
         1     6.00000000E+01   # M_1(MX)             
         2     3.00000000E+03   # M_2(MX)             
         3     1.21156200E+03   # M_3(MX)             
        11     5.00000000E+03   # At(MX)              
        12     5.00000000E+03   # Ab(MX)              
        13     0.00000000E+00   # Atau(MX)            
        23    -6.68126000E+02   # mu(MX)              
        26     3.00000000E+03   # mA(pole)            
        31     5.00000000E+03   # meL(MX)             
        32     5.00000000E+03   # mmuL(MX)            
        33     5.00000000E+03   # mtauL(MX)           
        34     5.00000000E+03   # meR(MX)             
        35     5.00000000E+03   # mmuR(MX)            
        36     5.00000000E+03   # mtauR(MX)           
        41     5.00000000E+03   # mqL1(MX)            
        42     5.00000000E+03   # mqL2(MX)            
        43     5.00000000E+03   # mqL3(MX)            
        44     5.00000000E+03   # muR(MX)             
        45     5.00000000E+03   # mcR(MX)             
        46     5.00000000E+03   # mtR(MX)             
        47     5.00000000E+03   # mdR(MX)             
        48     5.00000000E+03   # msR(MX)             
        49     5.00000000E+03   # mbR(MX)             
#
BLOCK MASS  # Mass Spectrum
# PDG code           mass       particle
        24     8.00930229E+01   # W+
        25     1.24610021E+02   # h
        35     3.00008345E+03   # H
        36     2.99999868E+03   # A
        37     3.00137658E+03   # H+
         5     4.87878001E+00   # b-quark pole mass calculated from mb(mb)_Msbar
   1000001     5.06670775E+03   # ~d_L
   2000001     5.04886429E+03   # ~d_R
   1000002     5.06623178E+03   # ~u_L
   2000002     5.04856956E+03   # ~u_R
   1000003     5.06670775E+03   # ~s_L
   2000003     5.04886429E+03   # ~s_R
   1000004     5.06623178E+03   # ~c_L
   2000004     5.04856956E+03   # ~c_R
   1000005     5.01269607E+03   # ~b_1
   2000005     5.04723077E+03   # ~b_2
   1000006     4.90322982E+03   # ~t_1
   2000006     5.05762193E+03   # ~t_2
   1000011     5.01909158E+03   # ~e_L
   2000011     5.00593546E+03   # ~e_R
   1000012     5.01814195E+03   # ~nu_eL
   1000013     5.01909158E+03   # ~mu_L
   2000013     5.00593546E+03   # ~mu_R
   1000014     5.01814195E+03   # ~nu_muL
   1000015     5.00471959E+03   # ~tau_1
   2000015     5.01867310E+03   # ~tau_2
   1000016     5.01759234E+03   # ~nu_tauL
   1000021     1.50000025E+03   # ~g
   1000022     6.02747496E+01   # ~chi_10
   1000023     6.99988820E+02   # ~chi_20
   1000025    -7.02215864E+02   # ~chi_30
   1000035     3.07420033E+03   # ~chi_40
   1000024     7.00000192E+02   # ~chi_1+
   1000037     3.07436792E+03   # ~chi_2+
#
BLOCK NMIX  # Neutralino Mixing Matrix
  1  1     9.97979204E-01   # N_11
  1  2     2.19010918E-04   # N_12
  1  3    -6.35309500E-02   # N_13
  1  4     1.13113244E-03   # N_14
  2  1     4.41439684E-02   # N_21
  2  2     2.05681967E-02   # N_22
  2  3     7.06086629E-01   # N_23
  2  4     7.06448818E-01   # N_24
  3  1    -4.57019323E-02   # N_31
  3  2     1.61085809E-02   # N_32
  3  3    -7.05262769E-01   # N_33
  3  4     7.07287971E-01   # N_34
  4  1    -3.90470183E-04   # N_41
  4  2     9.99658649E-01   # N_42
  4  3    -3.14930739E-03   # N_43
  4  4    -2.59328837E-02   # N_44
#
BLOCK UMIX  # Chargino Mixing Matrix U
  1  1     4.46279958E-03   # U_11
  1  2     9.99990042E-01   # U_12
  2  1    -9.99990042E-01   # U_21
  2  2     4.46279958E-03   # U_22
#
BLOCK VMIX  # Chargino Mixing Matrix V
  1  1     3.67011164E-02   # V_11
  1  2    -9.99326287E-01   # V_12
  2  1    -9.99326287E-01   # V_21
  2  2    -3.67011164E-02   # V_22
#
BLOCK STOPMIX  # Stop Mixing Matrix
  1  1    -5.06762544E-01   # cos(theta_t)
  1  2     8.62085683E-01   # sin(theta_t)
  2  1    -8.62085683E-01   # -sin(theta_t)
  2  2    -5.06762544E-01   # cos(theta_t)
#
BLOCK SBOTMIX  # Sbottom Mixing Matrix
  1  1     9.98159685E-01   # cos(theta_b)
  1  2    -6.06402774E-02   # sin(theta_b)
  2  1     6.06402774E-02   # -sin(theta_b)
  2  2     9.98159685E-01   # cos(theta_b)
#
BLOCK STAUMIX  # Stau Mixing Matrix
  1  1    -7.99444097E-02   # cos(theta_tau)
  1  2     9.96799324E-01   # sin(theta_tau)
  2  1    -9.96799324E-01   # -sin(theta_tau)
  2  2    -7.99444097E-02   # cos(theta_tau)
#
BLOCK ALPHA  # Higgs mixing
          -1.05462530E-01   # Mixing angle in the neutral Higgs boson sector
#
BLOCK HMIX Q=  5.00074735E+03  # DRbar Higgs Parameters
         1    -6.80221524E+02   # mu(Q)MSSM           
         2     9.47108614E+00   # tan                 
         3     2.41814642E+02   # higgs               
         4     8.60733188E+06   # mA^2(Q)MSSM         
#
BLOCK GAUGE Q=  5.00074735E+03  # The gauge couplings
     1     3.70888899E-01   # gprime(Q) DRbar
     2     6.32979966E-01   # g(Q) DRbar
     3     1.00271082E+00   # g3(Q) DRbar
#
BLOCK AU Q=  5.00074735E+03  # The trilinear couplings
  1  1     5.00000001E+03   # A_u(Q) DRbar
  2  2     5.00000001E+03   # A_c(Q) DRbar
  3  3     5.00000001E+03   # A_t(Q) DRbar
#
BLOCK AD Q=  5.00074735E+03  # The trilinear couplings
  1  1     5.00000000E+03   # A_d(Q) DRbar
  2  2     5.00000000E+03   # A_s(Q) DRbar
  3  3     5.00000001E+03   # A_b(Q) DRbar
#
BLOCK AE Q=  5.00074735E+03  # The trilinear couplings
  1  1     0.00000000E+00   # A_e(Q) DRbar
  2  2     9.64697456E-08   # A_mu(Q) DRbar
  3  3     9.58030704E-08   # A_tau(Q) DRbar
#
BLOCK Yu Q=  5.00074735E+03  # The Yukawa couplings
  1  1     0.00000000E+00   # y_u(Q) DRbar
  2  2     0.00000000E+00   # y_c(Q) DRbar
  3  3     8.17951299E-01   # y_t(Q) DRbar
#
BLOCK Yd Q=  5.00074735E+03  # The Yukawa couplings
  1  1     0.00000000E+00   # y_d(Q) DRbar
  2  2     0.00000000E+00   # y_s(Q) DRbar
  3  3     1.29831567E-01   # y_b(Q) DRbar
#
BLOCK Ye Q=  5.00074735E+03  # The Yukawa couplings
  1  1     0.00000000E+00   # y_e(Q) DRbar
  2  2     0.00000000E+00   # y_mu(Q) DRbar
  3  3     9.70252649E-02   # y_tau(Q) DRbar
#
BLOCK MSOFT Q=  5.00074735E+03  # The soft SUSY breaking masses at the scale Q
         1     6.00000000E+01   # M_1(Q)              
         2     3.00000000E+03   # M_2(Q)              
         3     1.21156200E+03   # M_3(Q)              
        21     8.25168617E+06   # mH1^2(Q)            
        22     1.07199908E+05   # mH2^2(Q)            
        31     5.00000000E+03   # meL(Q)              
        32     5.00000000E+03   # mmuL(Q)             
        33     5.00000000E+03   # mtauL(Q)            
        34     5.00000000E+03   # meR(Q)              
        35     5.00000000E+03   # mmuR(Q)             
        36     5.00000000E+03   # mtauR(Q)            
        41     5.00000000E+03   # mqL1(Q)             
        42     5.00000000E+03   # mqL2(Q)             
        43     5.00000000E+03   # mqL3(Q)             
        44     5.00000000E+03   # muR(Q)              
        45     5.00000000E+03   # mcR(Q)              
        46     5.00000000E+03   # mtR(Q)              
        47     5.00000000E+03   # mdR(Q)              
        48     5.00000000E+03   # msR(Q)              
        49     5.00000000E+03   # mbR(Q)              
#
#
#
#                             =================
#                             |The decay table|
#                             =================
#
# - The QCD corrections to the decays gluino -> squark  + quark
#                                     squark -> gaugino + quark_prime
#                                     squark -> squark_prime + Higgs
#                                     squark -> gluino  + quark
#   are included.
#
# - The multi-body decays for the inos, stops and sbottoms are included.
#
# - The loop induced decays for the gluino, neutralinos and stops
#   are included.
#
# - The SUSY decays of the top quark are included.
#
#
#         PDG            Width
DECAY         6     1.40414787E+00   # top decays
#          BR         NDA      ID1       ID2
     1.00000000E+00    2           5        24   # BR(t ->  b    W+)
#
#         PDG            Width
DECAY   1000021     1.61056498E-04   # gluino decays
#          BR         NDA      ID1       ID2
     3.65705483E-06    2     1000022        21   # BR(~g -> ~chi_10 g)
     1.93637465E-02    2     1000023        21   # BR(~g -> ~chi_20 g)
     1.88853332E-02    2     1000025        21   # BR(~g -> ~chi_30 g)
#           BR         NDA      ID1       ID2       ID3
     3.31901242E-02    3     1000022         1        -1   # BR(~g -> ~chi_10 d  db)
     2.20513602E-05    3     1000023         1        -1   # BR(~g -> ~chi_20 d  db)
     1.82076545E-05    3     1000025         1        -1   # BR(~g -> ~chi_30 d  db)
     1.13171820E-01    3     1000022         2        -2   # BR(~g -> ~chi_10 u  ub)
     1.02187116E-04    3     1000023         2        -2   # BR(~g -> ~chi_20 u  ub)
     2.57893191E-05    3     1000025         2        -2   # BR(~g -> ~chi_30 u  ub)
     3.31901242E-02    3     1000022         3        -3   # BR(~g -> ~chi_10 s  sb)
     2.20513602E-05    3     1000023         3        -3   # BR(~g -> ~chi_20 s  sb)
     1.82076545E-05    3     1000025         3        -3   # BR(~g -> ~chi_30 s  sb)
     1.13171820E-01    3     1000022         4        -4   # BR(~g -> ~chi_10 c  cb)
     1.02187116E-04    3     1000023         4        -4   # BR(~g -> ~chi_20 c  cb)
     2.57893191E-05    3     1000025         4        -4   # BR(~g -> ~chi_30 c  cb)
     3.37726886E-02    3     1000022         5        -5   # BR(~g -> ~chi_10 b  bb)
     4.49422564E-03    3     1000023         5        -5   # BR(~g -> ~chi_20 b  bb)
     4.42326333E-03    3     1000025         5        -5   # BR(~g -> ~chi_30 b  bb)
     9.90211326E-02    3     1000022         6        -6   # BR(~g -> ~chi_10 t  tb)
     1.29723002E-01    3     1000023         6        -6   # BR(~g -> ~chi_20 t  tb)
     9.72319678E-02    3     1000025         6        -6   # BR(~g -> ~chi_30 t  tb)
     5.21150017E-05    3     1000024         1        -2   # BR(~g -> ~chi_1+ d  ub)
     5.21150017E-05    3    -1000024         2        -1   # BR(~g -> ~chi_1- u  db)
     5.21150017E-05    3     1000024         3        -4   # BR(~g -> ~chi_1+ s  cb)
     5.21150017E-05    3    -1000024         4        -3   # BR(~g -> ~chi_1- c  sb)
     1.49906082E-01    3     1000024         5        -6   # BR(~g -> ~chi_1+ b  tb)
     1.49906082E-01    3    -1000024         6        -5   # BR(~g -> ~chi_1- t  bb)
#
#         PDG            Width
DECAY   1000006     3.87391444E+02   # stop1 decays
#          BR         NDA      ID1       ID2
     2.27443978E-02    2     1000022         6   # BR(~t_1 -> ~chi_10 t )
     8.22686891E-02    2     1000023         6   # BR(~t_1 -> ~chi_20 t )
     7.85875140E-02    2     1000025         6   # BR(~t_1 -> ~chi_30 t )
     5.34086172E-03    2     1000035         6   # BR(~t_1 -> ~chi_40 t )
     1.19135807E-01    2     1000024         5   # BR(~t_1 -> ~chi_1+ b )
     1.06453259E-02    2     1000037         5   # BR(~t_1 -> ~chi_2+ b )
     6.81277405E-01    2     1000021         6   # BR(~t_1 -> ~g      t )
#
#         PDG            Width
DECAY   2000006     3.90034997E+02   # stop2 decays
#          BR         NDA      ID1       ID2
     9.02745257E-03    2     1000022         6   # BR(~t_2 -> ~chi_10 t )
     8.27162153E-02    2     1000023         6   # BR(~t_2 -> ~chi_20 t )
     8.67772052E-02    2     1000025         6   # BR(~t_2 -> ~chi_30 t )
     1.41999798E-02    2     1000035         6   # BR(~t_2 -> ~chi_40 t )
     4.94224857E-02    2     1000024         5   # BR(~t_2 -> ~chi_1+ b )
     2.82680669E-02    2     1000037         5   # BR(~t_2 -> ~chi_2+ b )
     7.26351190E-01    2     1000021         6   # BR(~t_2 -> ~g      t )
     7.37853049E-04    2     1000006        25   # BR(~t_2 -> ~t_1    h )
     2.49955187E-03    2     1000006        23   # BR(~t_2 -> ~t_1    Z )
#
#         PDG            Width
DECAY   1000005     3.66420086E+02   # sbottom1 decays
#          BR         NDA      ID1       ID2
     2.11337944E-03    2     1000022         5   # BR(~b_1 -> ~chi_10 b )
     2.21988702E-03    2     1000023         5   # BR(~b_1 -> ~chi_20 b )
     2.19164225E-03    2     1000025         5   # BR(~b_1 -> ~chi_30 b )
     2.05769855E-02    2     1000035         5   # BR(~b_1 -> ~chi_40 b )
     1.75646217E-01    2    -1000024         6   # BR(~b_1 -> ~chi_1- t )
     4.13217529E-02    2    -1000037         6   # BR(~b_1 -> ~chi_2- t )
     7.54384069E-01    2     1000021         5   # BR(~b_1 -> ~g      b )
     1.54606627E-03    2     1000006       -24   # BR(~b_1 -> ~t_1    W-)
#
#         PDG            Width
DECAY   2000005     2.85376116E+02   # sbottom2 decays
#          BR         NDA      ID1       ID2
     1.03022292E-02    2     1000022         5   # BR(~b_2 -> ~chi_10 b )
     2.89898829E-03    2     1000023         5   # BR(~b_2 -> ~chi_20 b )
     2.95403567E-03    2     1000025         5   # BR(~b_2 -> ~chi_30 b )
     9.72848002E-05    2     1000035         5   # BR(~b_2 -> ~chi_40 b )
     6.54380743E-03    2    -1000024         6   # BR(~b_2 -> ~chi_1- t )
     1.95356641E-04    2    -1000037         6   # BR(~b_2 -> ~chi_2- t )
     9.76978387E-01    2     1000021         5   # BR(~b_2 -> ~g      b )
     2.99109396E-05    2     1000006       -24   # BR(~b_2 -> ~t_1    W-)
#
#         PDG            Width
DECAY   1000002     3.04481851E+02   # sup_L decays
#          BR         NDA      ID1       ID2
     2.45009671E-03    2     1000022         2   # BR(~u_L -> ~chi_10 u)
     5.28016798E-05    2     1000023         2   # BR(~u_L -> ~chi_20 u)
     3.19598202E-06    2     1000025         2   # BR(~u_L -> ~chi_30 u)
     2.57459094E-02    2     1000035         2   # BR(~u_L -> ~chi_40 u)
     1.66941410E-04    2     1000024         1   # BR(~u_L -> ~chi_1+ d)
     5.14589360E-02    2     1000037         1   # BR(~u_L -> ~chi_2+ d)
     9.20122119E-01    2     1000021         2   # BR(~u_L -> ~g      u)
#
#         PDG            Width
DECAY   2000002     2.90721756E+02   # sup_R decays
#          BR         NDA      ID1       ID2
     4.08211243E-02    2     1000022         2   # BR(~u_R -> ~chi_10 u)
     7.69035285E-05    2     1000023         2   # BR(~u_R -> ~chi_20 u)
     8.24071075E-05    2     1000025         2   # BR(~u_R -> ~chi_30 u)
     2.48237206E-09    2     1000035         2   # BR(~u_R -> ~chi_40 u)
     9.59019563E-01    2     1000021         2   # BR(~u_R -> ~g      u)
#
#         PDG            Width
DECAY   1000001     3.04492945E+02   # sdown_L decays
#          BR         NDA      ID1       ID2
     2.43925148E-03    2     1000022         1   # BR(~d_L -> ~chi_10 d)
     8.84442377E-06    2     1000023         1   # BR(~d_L -> ~chi_20 d)
     3.88315925E-05    2     1000025         1   # BR(~d_L -> ~chi_30 d)
     2.57608523E-02    2     1000035         1   # BR(~d_L -> ~chi_40 d)
     2.46858803E-06    2    -1000024         2   # BR(~d_L -> ~chi_1- u)
     5.15414944E-02    2    -1000037         2   # BR(~d_L -> ~chi_2- u)
     9.20208257E-01    2     1000021         1   # BR(~d_L -> ~g      d)
#
#         PDG            Width
DECAY   2000001     2.81809083E+02   # sdown_R decays
#          BR         NDA      ID1       ID2
     1.05286585E-02    2     1000022         1   # BR(~d_R -> ~chi_10 d)
     1.98351857E-05    2     1000023         1   # BR(~d_R -> ~chi_20 d)
     2.12546857E-05    2     1000025         1   # BR(~d_R -> ~chi_30 d)
     6.40345185E-10    2     1000035         1   # BR(~d_R -> ~chi_40 d)
     9.89430251E-01    2     1000021         1   # BR(~d_R -> ~g      d)
#
#         PDG            Width
DECAY   1000004     3.04481851E+02   # scharm_L decays
#          BR         NDA      ID1       ID2
     2.45009671E-03    2     1000022         4   # BR(~c_L -> ~chi_10 c)
     5.28016798E-05    2     1000023         4   # BR(~c_L -> ~chi_20 c)
     3.19598202E-06    2     1000025         4   # BR(~c_L -> ~chi_30 c)
     2.57459094E-02    2     1000035         4   # BR(~c_L -> ~chi_40 c)
     1.66941410E-04    2     1000024         3   # BR(~c_L -> ~chi_1+ s)
     5.14589360E-02    2     1000037         3   # BR(~c_L -> ~chi_2+ s)
     9.20122119E-01    2     1000021         4   # BR(~c_L -> ~g      c)
#
#         PDG            Width
DECAY   2000004     2.90721756E+02   # scharm_R decays
#          BR         NDA      ID1       ID2
     4.08211243E-02    2     1000022         4   # BR(~c_R -> ~chi_10 c)
     7.69035285E-05    2     1000023         4   # BR(~c_R -> ~chi_20 c)
     8.24071075E-05    2     1000025         4   # BR(~c_R -> ~chi_30 c)
     2.48237206E-09    2     1000035         4   # BR(~c_R -> ~chi_40 c)
     9.59019563E-01    2     1000021         4   # BR(~c_R -> ~g      c)
#
#         PDG            Width
DECAY   1000003     3.04492945E+02   # sstrange_L decays
#          BR         NDA      ID1       ID2
     2.43925148E-03    2     1000022         3   # BR(~s_L -> ~chi_10 s)
     8.84442377E-06    2     1000023         3   # BR(~s_L -> ~chi_20 s)
     3.88315925E-05    2     1000025         3   # BR(~s_L -> ~chi_30 s)
     2.57608523E-02    2     1000035         3   # BR(~s_L -> ~chi_40 s)
     2.46858803E-06    2    -1000024         4   # BR(~s_L -> ~chi_1- c)
     5.15414944E-02    2    -1000037         4   # BR(~s_L -> ~chi_2- c)
     9.20208257E-01    2     1000021         3   # BR(~s_L -> ~g      s)
#
#         PDG            Width
DECAY   2000003     2.81809083E+02   # sstrange_R decays
#          BR         NDA      ID1       ID2
     1.05286585E-02    2     1000022         3   # BR(~s_R -> ~chi_10 s)
     1.98351857E-05    2     1000023         3   # BR(~s_R -> ~chi_20 s)
     2.12546857E-05    2     1000025         3   # BR(~s_R -> ~chi_30 s)
     6.40345185E-10    2     1000035         3   # BR(~s_R -> ~chi_40 s)
     9.89430251E-01    2     1000021         3   # BR(~s_R -> ~g      s)
#
#         PDG            Width
DECAY   1000011     3.03060281E+01   # selectron_L decays
#          BR         NDA      ID1       ID2
     2.25801529E-01    2     1000022        11   # BR(~e_L -> ~chi_10 e-)
     1.36831648E-03    2     1000023        11   # BR(~e_L -> ~chi_20 e-)
     7.22334881E-05    2     1000025        11   # BR(~e_L -> ~chi_30 e-)
     2.57407615E-01    2     1000035        11   # BR(~e_L -> ~chi_40 e-)
     2.52789702E-05    2    -1000024        12   # BR(~e_L -> ~chi_1- nu_e)
     5.15325027E-01    2    -1000037        12   # BR(~e_L -> ~chi_2- nu_e)
#
#         PDG            Width
DECAY   2000011     2.73866836E+01   # selectron_R decays
#          BR         NDA      ID1       ID2
     9.96117705E-01    2     1000022        11   # BR(~e_R -> ~chi_10 e-)
     1.87406507E-03    2     1000023        11   # BR(~e_R -> ~chi_20 e-)
     2.00817078E-03    2     1000025        11   # BR(~e_R -> ~chi_30 e-)
     5.91780776E-08    2     1000035        11   # BR(~e_R -> ~chi_40 e-)
#
#         PDG            Width
DECAY   1000013     3.03060281E+01   # smuon_L decays
#          BR         NDA      ID1       ID2
     2.25801529E-01    2     1000022        13   # BR(~mu_L -> ~chi_10 mu-)
     1.36831648E-03    2     1000023        13   # BR(~mu_L -> ~chi_20 mu-)
     7.22334881E-05    2     1000025        13   # BR(~mu_L -> ~chi_30 mu-)
     2.57407615E-01    2     1000035        13   # BR(~mu_L -> ~chi_40 mu-)
     2.52789702E-05    2    -1000024        14   # BR(~mu_L -> ~chi_1- nu_mu)
     5.15325027E-01    2    -1000037        14   # BR(~mu_L -> ~chi_2- nu_mu)
#
#         PDG            Width
DECAY   2000013     2.73866836E+01   # smuon_R decays
#          BR         NDA      ID1       ID2
     9.96117705E-01    2     1000022        13   # BR(~mu_R -> ~chi_10 mu-)
     1.87406507E-03    2     1000023        13   # BR(~mu_R -> ~chi_20 mu-)
     2.00817078E-03    2     1000025        13   # BR(~mu_R -> ~chi_30 mu-)
     5.91780776E-08    2     1000035        13   # BR(~mu_R -> ~chi_40 mu-)
#
#         PDG            Width
DECAY   1000015     2.91980854E+01   # stau_1 decays
#          BR         NDA      ID1       ID2
     9.30621881E-01    2     1000022        15   # BR(~tau_1 -> ~chi_10  tau-)
     1.70538907E-02    2     1000023        15   # BR(~tau_1 -> ~chi_20  tau-)
     1.65309674E-02    2     1000025        15   # BR(~tau_1 -> ~chi_30  tau-)
     1.66228921E-03    2     1000035        15   # BR(~tau_1 -> ~chi_40  tau-)
     3.08032956E-02    2    -1000024        16   # BR(~tau_1 -> ~chi_1-  nu_tau)
     3.32767609E-03    2    -1000037        16   # BR(~tau_1 -> ~chi_2-  nu_tau)
#
#         PDG            Width
DECAY   2000015     3.11854501E+01   # stau_2 decays
#          BR         NDA      ID1       ID2
     2.22917801E-01    2     1000022        15   # BR(~tau_2 -> ~chi_10  tau-)
     1.58593829E-02    2     1000023        15   # BR(~tau_2 -> ~chi_20  tau-)
     1.51353567E-02    2     1000025        15   # BR(~tau_2 -> ~chi_30  tau-)
     2.48506509E-01    2     1000035        15   # BR(~tau_2 -> ~chi_40  tau-)
     7.51423327E-05    2    -1000024        16   # BR(~tau_2 -> ~chi_1-  nu_tau)
     4.97505808E-01    2    -1000037        16   # BR(~tau_2 -> ~chi_2-  nu_tau)
#
#         PDG            Width
DECAY   1000012     3.03091221E+01   # snu_eL decays
#          BR         NDA      ID1       ID2
     2.25397807E-01    2     1000022        12   # BR(~nu_eL -> ~chi_10 nu_e)
     1.78046908E-05    2     1000023        12   # BR(~nu_eL -> ~chi_20 nu_e)
     1.16661615E-03    2     1000025        12   # BR(~nu_eL -> ~chi_30 nu_e)
     2.57451274E-01    2     1000035        12   # BR(~nu_eL -> ~chi_40 nu_e)
     1.70911043E-03    2     1000024        11   # BR(~nu_eL -> ~chi_1+ e-)
     5.14257387E-01    2     1000037        11   # BR(~nu_eL -> ~chi_2+ e-)
#
#         PDG            Width
DECAY   1000014     3.03091221E+01   # snu_muL decays
#          BR         NDA      ID1       ID2
     2.25397807E-01    2     1000022        14   # BR(~nu_muL -> ~chi_10 nu_mu)
     1.78046908E-05    2     1000023        14   # BR(~nu_muL -> ~chi_20 nu_mu)
     1.16661615E-03    2     1000025        14   # BR(~nu_muL -> ~chi_30 nu_mu)
     2.57451274E-01    2     1000035        14   # BR(~nu_muL -> ~chi_40 nu_mu)
     1.70911043E-03    2     1000024        13   # BR(~nu_muL -> ~chi_1+ mu-)
     5.14257387E-01    2     1000037        13   # BR(~nu_muL -> ~chi_2+ mu-)
#
#         PDG            Width
DECAY   1000016     3.12031424E+01   # snu_tauL decays
#          BR         NDA      ID1       ID2
     2.18915804E-01    2     1000022        16   # BR(~nu_tauL -> ~chi_10 nu_tau)
     1.72925132E-05    2     1000023        16   # BR(~nu_tauL -> ~chi_20 nu_tau)
     1.13305670E-03    2     1000025        16   # BR(~nu_tauL -> ~chi_30 nu_tau)
     2.49981673E-01    2     1000035        16   # BR(~nu_tauL -> ~chi_40 nu_tau)
     3.06158533E-02    2     1000024        15   # BR(~nu_tauL -> ~chi_1+ tau-)
     4.99336320E-01    2     1000037        15   # BR(~nu_tauL -> ~chi_2+ tau-)
#
#         PDG            Width
DECAY   1000024     4.20552429E-01   # chargino1+ decays
#          BR         NDA      ID1       ID2
     1.00000000E+00    2     1000022        24   # BR(~chi_1+ -> ~chi_10  W+)
#
#         PDG            Width
DECAY   1000037     2.14673715E+01   # chargino2+ decays
#          BR         NDA      ID1       ID2
     2.53440657E-01    2     1000024        23   # BR(~chi_2+ -> ~chi_1+  Z )
     1.77973764E-04    2     1000022        24   # BR(~chi_2+ -> ~chi_10  W+)
     2.44583816E-01    2     1000023        24   # BR(~chi_2+ -> ~chi_20  W+)
     2.44292044E-01    2     1000025        24   # BR(~chi_2+ -> ~chi_30  W+)
     2.57502943E-01    2     1000024        25   # BR(~chi_2+ -> ~chi_1+  h )
     2.56613050E-06    2     1000022        37   # BR(~chi_2+ -> ~chi_10  H+)
#
#         PDG            Width
DECAY   1000022     0.00000000E+00   # neutralino1 decays
#
#         PDG            Width
DECAY   1000023     4.34272151E-01   # neutralino2 decays
#          BR         NDA      ID1       ID2
     5.22396764E-01    2     1000022        23   # BR(~chi_20 -> ~chi_10   Z )
     4.77603236E-01    2     1000022        25   # BR(~chi_20 -> ~chi_10   h )
#
#         PDG            Width
DECAY   1000025     4.32148881E-01   # neutralino3 decays
#          BR         NDA      ID1       ID2
     4.83914093E-01    2     1000022        23   # BR(~chi_30 -> ~chi_10   Z )
     5.16085907E-01    2     1000022        25   # BR(~chi_30 -> ~chi_10   h )
#
#         PDG            Width
DECAY   1000035     2.14824643E+01   # neutralino4 decays
#          BR         NDA      ID1       ID2
     2.28901112E-05    2     1000022        23   # BR(~chi_40 -> ~chi_10   Z )
     9.62839758E-02    2     1000023        23   # BR(~chi_40 -> ~chi_20   Z )
     1.56548215E-01    2     1000025        23   # BR(~chi_40 -> ~chi_30   Z )
     2.45035085E-01    2     1000024       -24   # BR(~chi_40 -> ~chi_1+   W-)
     2.45035085E-01    2    -1000024        24   # BR(~chi_40 -> ~chi_1-   W+)
     1.52109670E-04    2     1000022        25   # BR(~chi_40 -> ~chi_10   h )
     2.45159781E-06    2     1000022        35   # BR(~chi_40 -> ~chi_10   H )
     2.79449084E-07    2     1000022        36   # BR(~chi_40 -> ~chi_10   A )
     1.60372346E-01    2     1000023        25   # BR(~chi_40 -> ~chi_20   h )
     9.65475624E-02    2     1000025        25   # BR(~chi_40 -> ~chi_30   h )
#
#         PDG            Width
DECAY        25     4.05194333E-03   # h decays
#          BR         NDA      ID1       ID2
     6.12160526E-01    2           5        -5   # BR(h -> b       bb     )
     6.39305404E-02    2         -15        15   # BR(h -> tau+    tau-   )
     2.26338078E-04    2         -13        13   # BR(h -> mu+     mu-    )
     4.79945586E-04    2           3        -3   # BR(h -> s       sb     )
     2.07960287E-02    2           4        -4   # BR(h -> c       cb     )
     6.70822330E-02    2          21        21   # BR(h -> g       g      )
     2.30232193E-03    2          22        22   # BR(h -> gam     gam    )
     1.47091261E-03    2          22        23   # BR(h -> Z       gam    )
     2.06896637E-01    2          24       -24   # BR(h -> W+      W-     )
     2.45789264E-02    2          23        23   # BR(h -> Z       Z      )
     7.55906328E-05    2     1000022   1000022   # BR(h -> ~chi_10 ~chi_10)
#
#         PDG            Width
DECAY        35     8.48062988E+00   # H decays
#          BR         NDA      ID1       ID2
     3.78154113E-01    2           5        -5   # BR(H -> b       bb     )
     6.57094904E-02    2         -15        15   # BR(H -> tau+    tau-   )
     2.32353977E-04    2         -13        13   # BR(H -> mu+     mu-    )
     2.84830363E-04    2           3        -3   # BR(H -> s       sb     )
     1.59248551E-06    2           4        -4   # BR(H -> c       cb     )
     1.59101917E-01    2           6        -6   # BR(H -> t       tb     )
     5.28865032E-05    2          21        21   # BR(H -> g       g      )
     1.84717304E-07    2          22        22   # BR(H -> gam     gam    )
     9.38753987E-08    2          23        22   # BR(H -> Z       gam    )
     7.45541139E-05    2          24       -24   # BR(H -> W+      W-     )
     3.72298650E-05    2          23        23   # BR(H -> Z       Z      )
     2.73914139E-04    2          25        25   # BR(H -> h       h      )
    -1.64118126E-23    2          36        36   # BR(H -> A       A      )
     9.41557210E-19    2          23        36   # BR(H -> Z       A      )
     2.81451751E-03    2     1000024  -1000024   # BR(H -> ~chi_1+ ~chi_1-)
     3.48136007E-03    2     1000022   1000022   # BR(H -> ~chi_10 ~chi_10)
     1.48518130E-05    2     1000023   1000023   # BR(H -> ~chi_20 ~chi_20)
     1.35589751E-03    2     1000025   1000025   # BR(H -> ~chi_30 ~chi_30)
     2.33777187E-01    2     1000022   1000023   # BR(H -> ~chi_10 ~chi_20)
     1.53112507E-01    2     1000022   1000025   # BR(H -> ~chi_10 ~chi_30)
     1.52051897E-03    2     1000023   1000025   # BR(H -> ~chi_20 ~chi_30)
#
#         PDG            Width
DECAY        36     8.49066174E+00   # A decays
#          BR         NDA      ID1       ID2
     3.77835945E-01    2           5        -5   # BR(A -> b       bb     )
     6.56338070E-02    2         -15        15   # BR(A -> tau+    tau-   )
     2.32086030E-04    2         -13        13   # BR(A -> mu+     mu-    )
     2.84709799E-04    2           3        -3   # BR(A -> s       sb     )
     1.59704759E-06    2           4        -4   # BR(A -> c       cb     )
     1.59469668E-01    2           6        -6   # BR(A -> t       tb     )
     1.57827317E-04    2          21        21   # BR(A -> g       g      )
     5.99717948E-07    2          22        22   # BR(A -> gam     gam    )
     1.91038927E-07    2          23        22   # BR(A -> Z       gam    )
     7.41853588E-05    2          23        25   # BR(A -> Z       h      )
     3.41385052E-03    2     1000024  -1000024   # BR(A -> ~chi_1+ ~chi_1-)
     3.50929162E-03    2     1000022   1000022   # BR(A -> ~chi_10 ~chi_10)
     1.24028359E-05    2     1000023   1000023   # BR(A -> ~chi_20 ~chi_20)
     2.65493879E-03    2     1000025   1000025   # BR(A -> ~chi_30 ~chi_30)
     1.55737417E-01    2     1000022   1000023   # BR(A -> ~chi_10 ~chi_20)
     2.30151842E-01    2     1000022   1000025   # BR(A -> ~chi_10 ~chi_30)
     8.29640683E-04    2     1000023   1000025   # BR(A -> ~chi_20 ~chi_30)
#
#         PDG            Width
DECAY        37     8.43371721E+00   # H+ decays
#          BR         NDA      ID1       ID2
     6.06044160E-04    2           4        -5   # BR(H+ -> c       bb     )
     6.61073162E-02    2         -15        16   # BR(H+ -> tau+    nu_tau )
     2.33760394E-04    2         -13        14   # BR(H+ -> mu+     nu_mu  )
     3.87866236E-06    2           2        -5   # BR(H+ -> u       bb     )
     1.37162749E-05    2           2        -3   # BR(H+ -> u       sb     )
     2.83652600E-04    2           4        -3   # BR(H+ -> c       sb     )
     5.35999658E-01    2           6        -5   # BR(H+ -> t       bb     )
     7.48373954E-05    2          24        25   # BR(H+ -> W+      h      )
     7.73907725E-13    2          24        36   # BR(H+ -> W+      A      )
     3.94750535E-01    2     1000024   1000022   # BR(H+ -> ~chi_1+ ~chi_10)
     1.87208184E-03    2     1000024   1000023   # BR(H+ -> ~chi_1+ ~chi_20)
     5.45190964E-05    2     1000024   1000025   # BR(H+ -> ~chi_1+ ~chi_30)
