#
#                              ======================
#                              | THE SUSYHIT OUTPUT |
#                              ======================
#
#
#              ------------------------------------------------------
#              |     This is the output of the SUSY-HIT package     |
#              |  created by A.Djouadi, M.Muehlleitner and M.Spira. |
#              |  In case of problems with SUSY-HIT email to        |
#              |           margarete.muehlleitner@cern.ch           |
#              |           michael.spira@psi.ch                     |
#              |           abdelhak.djouadi@cern.ch                 |
#              ------------------------------------------------------
#
#              ------------------------------------------------------
#              |  SUSY Les Houches Accord - MSSM Spectrum + Decays  |
#              |              based on the decay programs           |
#              |                                                    |
#              |                     SDECAY 1.3b                    |
#              |                                                    |
#              |  Authors: M.Muhlleitner, A.Djouadi and Y.Mambrini  |
#              |  Ref.:    Comput.Phys.Commun.168(2005)46           |
#              |           [hep-ph/0311167]                         |
#              |                                                    |
#              |                     HDECAY 3.4                     |
#              |                                                    |
#              |  By: A.Djouadi,J.Kalinowski,M.Muhlleitner,M.Spira  |
#              |  Ref.:    Comput.Phys.Commun.108(1998)56           |
#              |           [hep-ph/9704448]                         |
#              |                                                    |
#              |                                                    |
#              |  If not stated otherwise all DRbar couplings and   |
#              |  soft SUSY breaking masses are given at the scale  |
#              |  Q=  0.91187600E+02
#              |                                                    |
#              ------------------------------------------------------
#
#
BLOCK DCINFO  # Decay Program information
     1   SDECAY/HDECAY # decay calculator
     2   1.3b  /3.4    # version number
#
BLOCK SPINFO  # Spectrum calculator information
     1   SuSpect     # RGE +Spectrum calculator            
     2   2.41         # version number                     
#
BLOCK MODSEL  # Model selection
     1     0   # #general MSSM low scale                           
#
BLOCK SMINPUTS  # Standard Model inputs
         1     1.27934000E+02   # alpha_em^-1(M_Z)^MSbar
         2     1.16639000E-05   # G_F [GeV^-2]
         3     1.17200000E-01   # alpha_S(M_Z)^MSbar
         4     9.11870000E+01   # M_Z pole mass
         5     4.25000000E+00   # mb(mb)^MSbar
         6     1.72500000E+02   # mt pole mass
         7     1.77700000E+00   # mtau pole mass
#
BLOCK MINPAR  # Input parameters - minimal models
#
BLOCK EXTPAR  # Input parameters - non-minimal models
         0     9.11876000E+01   # EWSB                
         1     1.00000000E+01   # M_1                 
         2     1.00000000E+05   # M_2                 
         3     1.00000000E+05   # M_3                 
        11     0.00000000E+00   # A_t                 
        12     0.00000000E+00   # A_b                 
        13     0.00000000E+00   # A_tau               
        14     0.00000000E+00   # A_u                 
        15     0.00000000E+00   # A_d                 
        16     0.00000000E+00   # A_e                 
        23     3.50000000E+03   # mu(EWSB)            
        25     1.50000000E+00   # tanbeta(in)         
        26     2.00000000E+03   # MA_pole             
        31     1.00000000E+05   # M_eL                
        32     1.00000000E+05   # M_muL               
        33     1.00000000E+05   # M_tauL              
        34     1.00000000E+05   # M_eR                
        35     1.00000000E+05   # M_muR               
        36     1.00000000E+05   # M_tauR              
        41     1.70000000E+03   # M_q1L               
        42     1.70000000E+03   # M_q2L               
        43     1.70000000E+03   # M_q3L               
        44     1.00000000E+05   # M_uR                
        45     1.00000000E+05   # M_cR                
        46     1.00000000E+05   # M_tR                
        47     1.70000000E+03   # M_dR                
        48     1.70000000E+03   # M_sR                
        49     1.70000000E+03   # M_bR                
#
BLOCK MASS  # Mass Spectrum
# PDG code           mass       particle
        24     8.05833808E+01   # W+
        25     1.25000000E+02   # h
        35     2.00403195E+03   # H
        36     2.00000000E+03   # A
        37     2.02369558E+03   # H+
         5     4.87877839E+00   # b-quark pole mass calculated from mb(mb)_Msbar
   1000001     1.70039038E+03   # ~d_L
   2000001     1.70007525E+03   # ~d_R
   1000002     1.69968480E+03   # ~u_L
   2000002     9.99999974E+04   # ~u_R
   1000003     1.70039038E+03   # ~s_L
   2000003     1.70007525E+03   # ~s_R
   1000004     1.69968480E+03   # ~c_L
   2000004     9.99999974E+04   # ~c_R
   1000005     1.69623535E+03   # ~b_1
   2000005     1.70422485E+03   # ~b_2
   1000006     1.70607012E+03   # ~t_1
   2000006     1.00000106E+05   # ~t_2
   1000011     1.00000004E+05   # ~e_L
   2000011     1.00000004E+05   # ~e_R
   1000012     9.99999921E+04   # ~nu_eL
   1000013     1.00000004E+05   # ~mu_L
   2000013     1.00000004E+05   # ~mu_R
   1000014     9.99999921E+04   # ~nu_muL
   1000015     9.99999574E+04   # ~tau_1
   2000015     1.00000051E+05   # ~tau_2
   1000016     9.99999921E+04   # ~nu_tauL
   1000021     1.00000000E+05   # ~g
   1000022     9.47209766E+00   # ~chi_10
   1000023    -3.50002419E+03   # ~chi_20
   1000025     3.50048762E+03   # ~chi_30
   1000035     1.00000064E+05   # ~chi_40
   1000024     3.49994017E+03   # ~chi_1+
   1000037     1.00000064E+05   # ~chi_2+
   1000039     1.00000000E-09   # ~gravitino
#
BLOCK NMIX  # Neutralino Mixing Matrix
  1  1     9.99918140E-01   # N_11
  1  2    -9.33284502E-06   # N_12
  1  3     1.06387406E-02   # N_13
  1  4    -7.10845946E-03   # N_14
  2  1     2.49626221E-03   # N_21
  2  2    -1.49663102E-04   # N_22
  2  3    -7.07092353E-01   # N_23
  2  4    -7.07116787E-01   # N_24
  3  1     1.25491714E-02   # N_31
  3  2     8.02473904E-04   # N_32
  3  3    -7.07041023E-01   # N_33
  3  4     7.07060723E-01   # N_34
  4  1     3.64704471E-07   # N_41
  4  2    -9.99999667E-01   # N_42
  4  3    -4.61655778E-04   # N_43
  4  4     6.73293636E-04   # N_44
#
BLOCK UMIX  # Chargino Mixing Matrix U
  1  1    -6.52879658E-04   # U_11
  1  2     9.99999787E-01   # U_12
  2  1     9.99999787E-01   # U_21
  2  2     6.52879658E-04   # U_22
#
BLOCK VMIX  # Chargino Mixing Matrix V
  1  1    -9.52180906E-04   # V_11
  1  2     9.99999547E-01   # V_12
  2  1     9.99999547E-01   # V_21
  2  2     9.52180906E-04   # V_22
#
BLOCK STOPMIX  # Stop Mixing Matrix
  1  1     9.99999999E-01   # cos(theta_t)
  1  2     4.47213589E-05   # sin(theta_t)
  2  1    -4.47213589E-05   # -sin(theta_t)
  2  2     9.99999999E-01   # cos(theta_t)
#
BLOCK SBOTMIX  # Sbottom Mixing Matrix
  1  1     6.93021236E-01   # cos(theta_b)
  1  2     7.20917170E-01   # sin(theta_b)
  2  1    -7.20917170E-01   # -sin(theta_b)
  2  2     6.93021236E-01   # cos(theta_b)
#
BLOCK STAUMIX  # Stau Mixing Matrix
  1  1     7.06192186E-01   # cos(theta_tau)
  1  2     7.08020195E-01   # sin(theta_tau)
  2  1    -7.08020195E-01   # -sin(theta_tau)
  2  2     7.06192186E-01   # cos(theta_tau)
#
BLOCK ALPHA  # Higgs mixing
          -5.90315585E-01   # Mixing angle in the neutral Higgs boson sector
#
BLOCK HMIX Q=  9.11876000E+01  # DRbar Higgs Parameters
         1     3.50000000E+03   # mu(Q)               
         2     1.49999982E+00   # tanbeta(Q)          
         3     2.54857112E+02   # vev(Q)              
         4    -6.81488713E+07   # MA^2(Q)             
#
BLOCK GAUGE Q=  9.11876000E+01  # The gauge couplings
     1     3.50577702E-01   # gprime(Q) DRbar
     2     6.19782305E-01   # g(Q) DRbar
     3     1.02383645E+00   # g3(Q) DRbar
#
BLOCK AU Q=  9.11876000E+01  # The trilinear couplings
  1  1     0.00000000E+00   # A_u(Q) DRbar
  2  2     0.00000000E+00   # A_c(Q) DRbar
  3  3     0.00000000E+00   # A_t(Q) DRbar
#
BLOCK AD Q=  9.11876000E+01  # The trilinear couplings
  1  1     0.00000000E+00   # A_d(Q) DRbar
  2  2     0.00000000E+00   # A_s(Q) DRbar
  3  3     0.00000000E+00   # A_b(Q) DRbar
#
BLOCK AE Q=  9.11876000E+01  # The trilinear couplings
  1  1     0.00000000E+00   # A_e(Q) DRbar
  2  2     0.00000000E+00   # A_mu(Q) DRbar
  3  3     0.00000000E+00   # A_tau(Q) DRbar
#
BLOCK Yu Q=  9.11876000E+01  # The Yukawa couplings
  1  1     0.00000000E+00   # y_u(Q) DRbar
  2  2     0.00000000E+00   # y_c(Q) DRbar
  3  3     9.83751067E-01   # y_t(Q) DRbar
#
BLOCK Yd Q=  9.11876000E+01  # The Yukawa couplings
  1  1     0.00000000E+00   # y_d(Q) DRbar
  2  2     0.00000000E+00   # y_s(Q) DRbar
  3  3     2.58636687E-02   # y_b(Q) DRbar
#
BLOCK Ye Q=  9.11876000E+01  # The Yukawa couplings
  1  1     0.00000000E+00   # y_e(Q) DRbar
  2  2     0.00000000E+00   # y_mu(Q) DRbar
  3  3     1.77409177E-02   # y_tau(Q) DRbar
#
BLOCK MSOFT Q=  9.11876000E+01  # The soft SUSY breaking masses at the scale Q
         1     1.00000000E+01   # M_1                 
         2     1.00000000E+05   # M_2                 
         3     1.00000000E+05   # M_3                 
        14     0.00000000E+00   # A_u                 
        15     0.00000000E+00   # A_d                 
        16     0.00000000E+00   # A_e                 
        21     6.31180175E+08   # M^2_Hd              
        22    -1.15011384E+09   # M^2_Hu              
        31     1.00000000E+05   # M_eL                
        32     1.00000000E+05   # M_muL               
        33     1.00000000E+05   # M_tauL              
        34     1.00000000E+05   # M_eR                
        35     1.00000000E+05   # M_muR               
        36     1.00000000E+05   # M_tauR              
        41     1.70000000E+03   # M_q1L               
        42     1.70000000E+03   # M_q2L               
        43     1.70000000E+03   # M_q3L               
        44     1.00000000E+05   # M_uR                
        45     1.00000000E+05   # M_cR                
        46     1.00000000E+05   # M_tR                
        47     1.70000000E+03   # M_dR                
        48     1.70000000E+03   # M_sR                
        49     1.70000000E+03   # M_bR                
#
#
#
#                             =================
#                             |The decay table|
#                             =================
#
# - The QCD corrections to the decays gluino -> squark  + quark
#                                     squark -> gaugino + quark_prime
#                                     squark -> squark_prime + Higgs
#                                     squark -> gluino  + quark
#   are included.
#
# - The multi-body decays for the inos, stops and sbottoms are included.
#
# - The loop induced decays for the gluino, neutralinos and stops
#   are included.
#
# - The SUSY decays of the top quark are included.
#
# - Possible decays of the NLSP in GMSB models are included.
#
#
#         PDG            Width
DECAY         6     1.32579628E+00   # top decays
#          BR         NDA      ID1       ID2
     1.00000000E+00    2           5        24   # BR(t ->  b    W+)
#
#         PDG            Width
DECAY   1000021     1.E-04   # gluino decays (OJ Mods)
#          BR         NDA      ID1       ID2
     3.36843763E-04    2     1000001        -1   # BR(~g -> ~d_L  db)
     3.36843763E-04    2    -1000001         1   # BR(~g -> ~d_L* d )
     3.36843835E-04    2     2000001        -1   # BR(~g -> ~d_R  db)
     3.36843835E-04    2    -2000001         1   # BR(~g -> ~d_R* d )
     3.36843925E-04    2     1000002        -2   # BR(~g -> ~u_L  ub)
     3.36843925E-04    2    -1000002         2   # BR(~g -> ~u_L* u )
     9.11352442E-19    2     2000002        -2   # BR(~g -> ~u_R  ub)
     9.11352442E-19    2    -2000002         2   # BR(~g -> ~u_R* u )
     3.36843763E-04    2     1000003        -3   # BR(~g -> ~s_L  sb)
     3.36843763E-04    2    -1000003         3   # BR(~g -> ~s_L* s )
     3.36843835E-04    2     2000003        -3   # BR(~g -> ~s_R  sb)
     3.36843835E-04    2    -2000003         3   # BR(~g -> ~s_R* s )
     3.36843925E-04    2     1000004        -4   # BR(~g -> ~c_L  cb)
     3.36843925E-04    2    -1000004         4   # BR(~g -> ~c_L* c )
     9.11352442E-19    2     2000004        -4   # BR(~g -> ~c_R  cb)
     9.11352442E-19    2    -2000004         4   # BR(~g -> ~c_R* c )
     2.46147024E-01    2     1000005        -5   # BR(~g -> ~b_1  bb)
     2.46147024E-01    2    -1000005         5   # BR(~g -> ~b_1* b )
     2.46776249E-01    2     2000005        -5   # BR(~g -> ~b_2  bb)
     2.46776249E-01    2    -2000005         5   # BR(~g -> ~b_2* b )
     3.31511800E-04    2     1000006        -6   # BR(~g -> ~t_1  tb)
     3.31511800E-04    2    -1000006         6   # BR(~g -> ~t_1* t )
     9.44830394E-03    2     1000039        21   # BR(~g -> ~G g)
#
#         PDG            Width
DECAY   1000006     2.71662812E-01   # stop1 decays
#          BR         NDA      ID1       ID2
     1.00000000E+00    2     1000022         6   # BR(~t_1 -> ~chi_10 t )
#
#         PDG            Width
DECAY   2000006     5.71520824E+05   # stop2 decays
#          BR         NDA      ID1       ID2
     3.64704261E-04    2     1000022         6   # BR(~t_2 -> ~chi_10 t )
     8.75755690E-04    2     1000023         6   # BR(~t_2 -> ~chi_20 t )
     8.75659254E-04    2     1000025         6   # BR(~t_2 -> ~chi_30 t )
     9.97913842E-01    2     1000024         5   # BR(~t_2 -> ~chi_1+ b )
    -2.37703750E-05    2     1000006        25   # BR(~t_2 -> ~t_1    h )
     2.48946017E-05    2     1000006        35   # BR(~t_2 -> ~t_1    H )
     2.48507559E-05    2     1000006        36   # BR(~t_2 -> ~t_1    A )
     2.34103781E-05    2     1000005        37   # BR(~t_2 -> ~b_1    H+)
     2.62901338E-05    2     2000005        37   # BR(~t_2 -> ~b_2    H+)
    -1.69335964E-05    2     1000006        23   # BR(~t_2 -> ~t_1    Z )
    -4.26030907E-05    2     1000005        24   # BR(~t_2 -> ~b_1    W+)
    -4.61000015E-05    2     2000005        24   # BR(~t_2 -> ~b_2    W+)
#
#         PDG            Width
DECAY   1000005     1.68069360E+02   # sbottom1 decays
#          BR         NDA      ID1       ID2
     1.00000000E+00    2     1000022         5   # BR(~b_1 -> ~chi_10 b )
#
#         PDG            Width
DECAY   2000005     1.59573456E+02   # sbottom2 decays
#          BR         NDA      ID1       ID2
     1.00000000E+00    2     1000022         5   # BR(~b_2 -> ~chi_10 b )
#
#         PDG            Width
DECAY   1000002     2.74315635E-01   # sup_L decays
#          BR         NDA      ID1       ID2
     1.00000000E+00    2     1000022         2   # BR(~u_L -> ~chi_10 u)
#
#         PDG            Width
DECAY   2000002     2.08380506E+02   # sup_R decays
#          BR         NDA      ID1       ID2
     9.99836458E-01    2     1000022         2   # BR(~u_R -> ~chi_10 u)
     6.22480777E-06    2     1000023         2   # BR(~u_R -> ~chi_20 u)
     1.57316930E-04    2     1000025         2   # BR(~u_R -> ~chi_30 u)
#
#         PDG            Width
DECAY   1000001     2.74478780E-01   # sdown_L decays
#          BR         NDA      ID1       ID2
     1.00000000E+00    2     1000022         1   # BR(~d_L -> ~chi_10 d)
#
#         PDG            Width
DECAY   2000001     1.09761204E+00   # sdown_R decays
#          BR         NDA      ID1       ID2
     1.00000000E+00    2     1000022         1   # BR(~d_R -> ~chi_10 d)
#
#         PDG            Width
DECAY   1000004     2.74315635E-01   # scharm_L decays
#          BR         NDA      ID1       ID2
     1.00000000E+00    2     1000022         4   # BR(~c_L -> ~chi_10 c)
#
#         PDG            Width
DECAY   2000004     2.08380506E+02   # scharm_R decays
#          BR         NDA      ID1       ID2
     9.99836458E-01    2     1000022         4   # BR(~c_R -> ~chi_10 c)
     6.22480777E-06    2     1000023         4   # BR(~c_R -> ~chi_20 c)
     1.57316930E-04    2     1000025         4   # BR(~c_R -> ~chi_30 c)
#
#         PDG            Width
DECAY   1000003     2.74478780E-01   # sstrange_L decays
#          BR         NDA      ID1       ID2
     1.00000000E+00    2     1000022         3   # BR(~s_L -> ~chi_10 s)
#
#         PDG            Width
DECAY   2000003     1.09761204E+00   # sstrange_R decays
#          BR         NDA      ID1       ID2
     1.00000000E+00    2     1000022         3   # BR(~s_R -> ~chi_10 s)
#
#         PDG            Width
DECAY   1000011     1.22256271E+02   # selectron_L decays
#          BR         NDA      ID1       ID2
     9.99797752E-01    2     1000022        11   # BR(~e_L -> ~chi_10 e-)
     4.96814915E-06    2     1000023        11   # BR(~e_L -> ~chi_20 e-)
     1.94622084E-04    2     1000025        11   # BR(~e_L -> ~chi_30 e-)
     2.65790222E-06    2    -1000024        12   # BR(~e_L -> ~chi_1- nu_e)
#
#         PDG            Width
DECAY   2000011     4.89022178E+02   # selectron_R decays
#          BR         NDA      ID1       ID2
     9.99836688E-01    2     1000022        11   # BR(~e_R -> ~chi_10 e-)
     6.21607002E-06    2     1000023        11   # BR(~e_R -> ~chi_20 e-)
     1.57096067E-04    2     1000025        11   # BR(~e_R -> ~chi_30 e-)
#
#         PDG            Width
DECAY   1000013     1.22256271E+02   # smuon_L decays
#          BR         NDA      ID1       ID2
     9.99797752E-01    2     1000022        13   # BR(~mu_L -> ~chi_10 mu-)
     4.96814915E-06    2     1000023        13   # BR(~mu_L -> ~chi_20 mu-)
     1.94622084E-04    2     1000025        13   # BR(~mu_L -> ~chi_30 mu-)
     2.65790222E-06    2    -1000024        14   # BR(~mu_L -> ~chi_1- nu_mu)
#
#         PDG            Width
DECAY   2000013     4.89022178E+02   # smuon_R decays
#          BR         NDA      ID1       ID2
     9.99836688E-01    2     1000022        13   # BR(~mu_R -> ~chi_10 mu-)
     6.21607002E-06    2     1000023        13   # BR(~mu_R -> ~chi_20 mu-)
     1.57096067E-04    2     1000025        13   # BR(~mu_R -> ~chi_30 mu-)
#
#         PDG            Width
DECAY   1000015     1.18199924E+04   # stau_1 decays
#          BR         NDA      ID1       ID2
     2.59013656E-02    2     1000022        15   # BR(~tau_1 -> ~chi_10  tau-)
     2.51342882E-05    2     1000023        15   # BR(~tau_1 -> ~chi_20  tau-)
     2.48683577E-05    2     1000025        15   # BR(~tau_1 -> ~chi_30  tau-)
     2.77095850E-05    2    -1000024        16   # BR(~tau_1 -> ~chi_1-  nu_tau)
     9.74020922E-01    2     1000039        15   # BR(~tau_1 -> ~G       tau-)
#
#         PDG            Width
DECAY   2000015     3.06079815E+02   # stau_2 decays
#          BR         NDA      ID1       ID2
     9.96537645E-01    2     1000022        15   # BR(~tau_2 -> ~chi_10  tau-)
     1.08193051E-03    2     1000023        15   # BR(~tau_2 -> ~chi_20  tau-)
     1.40871626E-03    2     1000025        15   # BR(~tau_2 -> ~chi_30  tau-)
     9.71707896E-04    2    -1000024        16   # BR(~tau_2 -> ~chi_1-  nu_tau)
#
#         PDG            Width
DECAY   1000012     1.22256328E+02   # snu_eL decays
#          BR         NDA      ID1       ID2
     9.99863159E-01    2     1000022        12   # BR(~nu_eL -> ~chi_10 nu_e)
     7.60358227E-06    2     1000023        12   # BR(~nu_eL -> ~chi_20 nu_e)
     1.23583562E-04    2     1000025        12   # BR(~nu_eL -> ~chi_30 nu_e)
     5.65342205E-06    2     1000024        11   # BR(~nu_eL -> ~chi_1+ e-)
#
#         PDG            Width
DECAY   1000014     1.22256328E+02   # snu_muL decays
#          BR         NDA      ID1       ID2
     9.99863159E-01    2     1000022        14   # BR(~nu_muL -> ~chi_10 nu_mu)
     7.60358227E-06    2     1000023        14   # BR(~nu_muL -> ~chi_20 nu_mu)
     1.23583562E-04    2     1000025        14   # BR(~nu_muL -> ~chi_30 nu_mu)
     5.65342205E-06    2     1000024        13   # BR(~nu_muL -> ~chi_1+ mu-)
#
#         PDG            Width
DECAY   1000016     1.22880950E+02   # snu_tauL decays
#          BR         NDA      ID1       ID2
     9.94780706E-01    2     1000022        16   # BR(~nu_tauL -> ~chi_10 nu_tau)
     7.56493213E-06    2     1000023        16   # BR(~nu_tauL -> ~chi_20 nu_tau)
     1.22955368E-04    2     1000025        16   # BR(~nu_tauL -> ~chi_30 nu_tau)
     5.08877385E-03    2     1000024        15   # BR(~nu_tauL -> ~chi_1+ tau-)
#
#         PDG            Width
DECAY   1000024     6.43645239E+01   # chargino1+ decays
#          BR         NDA      ID1       ID2
     3.92882819E-07    2     1000002        -1   # BR(~chi_1+ -> ~u_L     db)
     1.84620323E-07    2    -1000001         2   # BR(~chi_1+ -> ~d_L*    u )
     3.92882819E-07    2     1000004        -3   # BR(~chi_1+ -> ~c_L     sb)
     1.84620323E-07    2    -1000003         4   # BR(~chi_1+ -> ~s_L*    c )
     1.76818381E-01    2     1000006        -5   # BR(~chi_1+ -> ~t_1     bb)
     7.64356626E-02    2    -1000005         6   # BR(~chi_1+ -> ~b_1*    t )
     7.00041278E-01    2    -2000005         6   # BR(~chi_1+ -> ~b_2*    t )
     3.20819609E-02    2     1000022        24   # BR(~chi_1+ -> ~chi_10  W+)
     1.46159522E-02    2     1000022        37   # BR(~chi_1+ -> ~chi_10  H+)
     4.68733468E-06    2     1000039        24   # BR(~chi_1+ -> ~G       W+)
     9.22271326E-07    2     1000039        37   # BR(~chi_1+ -> ~G       H+)
#
#         PDG            Width
DECAY   1000037     3.48077265E+05   # chargino2+ decays
#          BR         NDA      ID1       ID2
     3.05631647E-03    2     1000002        -1   # BR(~chi_2+ -> ~u_L     db)
     3.05631735E-03    2    -1000001         2   # BR(~chi_2+ -> ~d_L*    u )
     3.05631647E-03    2     1000004        -3   # BR(~chi_2+ -> ~c_L     sb)
     3.05631735E-03    2    -1000003         4   # BR(~chi_2+ -> ~s_L*    c )
     9.47989547E-01    2     1000006        -5   # BR(~chi_2+ -> ~t_1     bb)
     6.70141719E-04    2    -1000005         6   # BR(~chi_2+ -> ~b_1*    t )
     2.89963304E-03    2    -2000005         6   # BR(~chi_2+ -> ~b_2*    t )
     2.19729018E-15    2     1000012       -11   # BR(~chi_2+ -> ~nu_eL   e+  )
     2.19729018E-15    2     1000014       -13   # BR(~chi_2+ -> ~nu_muL  mu+ )
     1.53014432E-15    2    -1000011        12   # BR(~chi_2+ -> ~e_L+    nu_e)
     1.53014432E-15    2    -1000013        14   # BR(~chi_2+ -> ~mu_L+   nu_mu)
     2.40864969E-15    2    -1000015        16   # BR(~chi_2+ -> ~tau_1+  nu_tau)
     3.60100963E-17    2    -2000015        16   # BR(~chi_2+ -> ~tau_2+  nu_tau)
     5.60022381E-04    2     1000024        23   # BR(~chi_2+ -> ~chi_1+  Z )
     6.58177318E-08    2     1000022        24   # BR(~chi_2+ -> ~chi_10  W+)
     5.43279654E-04    2     1000023        24   # BR(~chi_2+ -> ~chi_20  W+)
     5.43208137E-04    2     1000025        24   # BR(~chi_2+ -> ~chi_30  W+)
     5.65650713E-04    2     1000024        25   # BR(~chi_2+ -> ~chi_1+  h )
     4.96533795E-04    2     1000024        35   # BR(~chi_2+ -> ~chi_1+  H )
     4.96600022E-04    2     1000024        36   # BR(~chi_2+ -> ~chi_1+  A )
     9.39341706E-08    2     1000022        37   # BR(~chi_2+ -> ~chi_10  H+)
     4.96580398E-04    2     1000023        37   # BR(~chi_2+ -> ~chi_20  H+)
     4.96507408E-04    2     1000025        37   # BR(~chi_2+ -> ~chi_30  H+)
     3.20168587E-02    2     1000039        24   # BR(~chi_2+ -> ~G       W+)
     9.17487900E-09    2     1000039        37   # BR(~chi_2+ -> ~G       H+)
#
#         PDG            Width
DECAY   1000022     1.E-08   # neutralino1 decays (OJ Mods)
#          BR         NDA      ID1       ID2
     1.00000000E+00    2     1000039        22   # BR(~chi_10 -> ~G        gam)
#
#         PDG            Width
DECAY   1000023     1.E-08   # neutralino2 decays (OJ Mods)
#          BR         NDA      ID1       ID2
     2.67612884E-02    2     1000022        23   # BR(~chi_20 -> ~chi_10   Z )
     1.04271888E-03    2     1000022        25   # BR(~chi_20 -> ~chi_10   h )
     1.20578103E-02    2     1000022        35   # BR(~chi_20 -> ~chi_10   H )
     4.91361600E-04    2     1000022        36   # BR(~chi_20 -> ~chi_10   A )
     2.17872687E-08    2     1000002        -2   # BR(~chi_20 -> ~u_L      ub)
     2.17872687E-08    2    -1000002         2   # BR(~chi_20 -> ~u_L*     u )
     8.13251942E-08    2     1000001        -1   # BR(~chi_20 -> ~d_L      db)
     8.13251942E-08    2    -1000001         1   # BR(~chi_20 -> ~d_L*     d )
     1.87308473E-07    2     2000001        -1   # BR(~chi_20 -> ~d_R      db)
     1.87308473E-07    2    -2000001         1   # BR(~chi_20 -> ~d_R*     d )
     2.17872687E-08    2     1000004        -4   # BR(~chi_20 -> ~c_L      cb)
     2.17872687E-08    2    -1000004         4   # BR(~chi_20 -> ~c_L*     c )
     8.13251942E-08    2     1000003        -3   # BR(~chi_20 -> ~s_L      sb)
     8.13251942E-08    2    -1000003         3   # BR(~chi_20 -> ~s_L*     s )
     1.87308473E-07    2     2000003        -3   # BR(~chi_20 -> ~s_R      sb)
     1.87308473E-07    2    -2000003         3   # BR(~chi_20 -> ~s_R*     s )
     3.25907870E-01    2     1000006        -6   # BR(~chi_20 -> ~t_1      tb)
     3.25907870E-01    2    -1000006         6   # BR(~chi_20 -> ~t_1*     t )
     7.41297768E-02    2     1000005        -5   # BR(~chi_20 -> ~b_1      bb)
     7.41297768E-02    2    -1000005         5   # BR(~chi_20 -> ~b_1*     b )
     7.97828898E-02    2     2000005        -5   # BR(~chi_20 -> ~b_2      bb)
     7.97828898E-02    2    -2000005         5   # BR(~chi_20 -> ~b_2*     b )
     3.48207041E-11    2     1000039        22   # BR(~chi_20 -> ~G        gam)
     1.51605606E-07    2     1000039        23   # BR(~chi_20 -> ~G        Z)
     3.78358497E-06    2     1000039        25   # BR(~chi_20 -> ~G        h)
     3.03023795E-08    2     1000039        35   # BR(~chi_20 -> ~G        H)
     7.81624921E-07    2     1000039        36   # BR(~chi_20 -> ~G        A)
#
#         PDG            Width
DECAY   1000025     7.66904877E+01   # neutralino3 decays
#          BR         NDA      ID1       ID2
     1.05666639E-03    2     1000022        23   # BR(~chi_30 -> ~chi_10   Z )
     2.69146546E-02    2     1000022        25   # BR(~chi_30 -> ~chi_10   h )
     4.77138105E-04    2     1000022        35   # BR(~chi_30 -> ~chi_10   H )
     1.20664997E-02    2     1000022        36   # BR(~chi_30 -> ~chi_10   A )
     2.11860045E-06    2     1000002        -2   # BR(~chi_30 -> ~u_L      ub)
     2.11860045E-06    2    -1000002         2   # BR(~chi_30 -> ~u_L*     u )
     5.15696105E-07    2     1000001        -1   # BR(~chi_30 -> ~d_L      db)
     5.15696105E-07    2    -1000001         1   # BR(~chi_30 -> ~d_L*     d )
     4.72431226E-06    2     2000001        -1   # BR(~chi_30 -> ~d_R      db)
     4.72431226E-06    2    -2000001         1   # BR(~chi_30 -> ~d_R*     d )
     2.11860045E-06    2     1000004        -4   # BR(~chi_30 -> ~c_L      cb)
     2.11860045E-06    2    -1000004         4   # BR(~chi_30 -> ~c_L*     c )
     5.15696105E-07    2     1000003        -3   # BR(~chi_30 -> ~s_L      sb)
     5.15696105E-07    2    -1000003         3   # BR(~chi_30 -> ~s_L*     s )
     4.72431226E-06    2     2000003        -3   # BR(~chi_30 -> ~s_R      sb)
     4.72431226E-06    2    -2000003         3   # BR(~chi_30 -> ~s_R*     s )
     3.25278977E-01    2     1000006        -6   # BR(~chi_30 -> ~t_1      tb)
     3.25278977E-01    2    -1000006         6   # BR(~chi_30 -> ~t_1*     t )
     6.64289364E-02    2     1000005        -5   # BR(~chi_30 -> ~b_1      bb)
     6.64289364E-02    2    -1000005         5   # BR(~chi_30 -> ~b_1*     b )
     8.80195514E-02    2     2000005        -5   # BR(~chi_30 -> ~b_2      bb)
     8.80195514E-02    2    -2000005         5   # BR(~chi_30 -> ~b_2*     b )
     1.01069271E-09    2     1000039        22   # BR(~chi_30 -> ~G        gam)
     3.78271735E-06    2     1000039        23   # BR(~chi_30 -> ~G        Z)
     1.47486469E-07    2     1000039        25   # BR(~chi_30 -> ~G        h)
     7.75274147E-07    2     1000039        35   # BR(~chi_30 -> ~G        H)
     3.12218675E-08    2     1000039        36   # BR(~chi_30 -> ~G        A)
#
#         PDG            Width
DECAY   1000035     3.48078754E+05   # neutralino4 decays
#          BR         NDA      ID1       ID2
     1.32531892E-11    2     1000022        23   # BR(~chi_40 -> ~chi_10   Z )
     5.41201821E-04    2     1000023        23   # BR(~chi_40 -> ~chi_20   Z )
     1.88186649E-05    2     1000025        23   # BR(~chi_40 -> ~chi_30   Z )
     5.43274069E-04    2     1000024       -24   # BR(~chi_40 -> ~chi_1+   W-)
     5.43274069E-04    2    -1000024        24   # BR(~chi_40 -> ~chi_1-   W+)
     6.86432753E-08    2     1000022        25   # BR(~chi_40 -> ~chi_10   h )
     1.26272272E-08    2     1000022        35   # BR(~chi_40 -> ~chi_10   H )
     8.11717072E-08    2     1000022        36   # BR(~chi_40 -> ~chi_10   A )
     1.85715356E-05    2     1000023        25   # BR(~chi_40 -> ~chi_20   h )
     4.75180960E-04    2     1000023        35   # BR(~chi_40 -> ~chi_20   H )
     2.18426259E-05    2     1000023        36   # BR(~chi_40 -> ~chi_20   A )
     5.47008769E-04    2     1000025        25   # BR(~chi_40 -> ~chi_30   h )
     2.13375372E-05    2     1000025        35   # BR(~chi_40 -> ~chi_30   H )
     4.74674158E-04    2     1000025        36   # BR(~chi_40 -> ~chi_30   A )
     4.96589126E-04    2     1000024       -37   # BR(~chi_40 -> ~chi_1+   H-)
     4.96589126E-04    2    -1000024        37   # BR(~chi_40 -> ~chi_1-   H+)
     1.46332879E-03    2     1000002        -2   # BR(~chi_40 -> ~u_L      ub)
     1.46332879E-03    2    -1000002         2   # BR(~chi_40 -> ~u_L*     u )
     2.27469480E-23    2     2000002        -2   # BR(~chi_40 -> ~u_R      ub)
     2.27469480E-23    2    -2000002         2   # BR(~chi_40 -> ~u_R*     u )
     1.46332937E-03    2     1000001        -1   # BR(~chi_40 -> ~d_L      db)
     1.46332937E-03    2    -1000001         1   # BR(~chi_40 -> ~d_L*     d )
     2.76778395E-17    2     2000001        -1   # BR(~chi_40 -> ~d_R      db)
     2.76778395E-17    2    -2000001         1   # BR(~chi_40 -> ~d_R*     d )
     1.46332879E-03    2     1000004        -4   # BR(~chi_40 -> ~c_L      cb)
     1.46332879E-03    2    -1000004         4   # BR(~chi_40 -> ~c_L*     c )
     2.27469480E-23    2     2000004        -4   # BR(~chi_40 -> ~c_R      cb)
     2.27469480E-23    2    -2000004         4   # BR(~chi_40 -> ~c_R*     c )
     1.46332937E-03    2     1000003        -3   # BR(~chi_40 -> ~s_L      sb)
     1.46332937E-03    2    -1000003         3   # BR(~chi_40 -> ~s_L*     s )
     2.76778395E-17    2     2000003        -3   # BR(~chi_40 -> ~s_R      sb)
     2.76778395E-17    2    -2000003         3   # BR(~chi_40 -> ~s_R*     s )
     1.78488169E-03    2     1000006        -6   # BR(~chi_40 -> ~t_1      tb)
     1.78488169E-03    2    -1000006         6   # BR(~chi_40 -> ~t_1*     t )
     2.27115130E-01    2     1000005        -5   # BR(~chi_40 -> ~b_1      bb)
     2.27115130E-01    2    -1000005         5   # BR(~chi_40 -> ~b_1*     b )
     2.46879750E-01    2     2000005        -5   # BR(~chi_40 -> ~b_2      bb)
     2.46879750E-01    2    -2000005         5   # BR(~chi_40 -> ~b_2*     b )
     7.65068494E-16    2     1000011       -11   # BR(~chi_40 -> ~e_L-     e+)
     7.65068494E-16    2    -1000011        11   # BR(~chi_40 -> ~e_L+     e-)
     1.30236641E-28    2     2000011       -11   # BR(~chi_40 -> ~e_R-     e+)
     1.30236641E-28    2    -2000011        11   # BR(~chi_40 -> ~e_R+     e-)
     7.65068494E-16    2     1000013       -13   # BR(~chi_40 -> ~mu_L-    mu+)
     7.65068494E-16    2    -1000013        13   # BR(~chi_40 -> ~mu_L+    mu-)
     1.30236641E-28    2     2000013       -13   # BR(~chi_40 -> ~mu_R-    mu+)
     1.30236641E-28    2    -2000013        13   # BR(~chi_40 -> ~mu_R+    mu-)
     1.09864126E-15    2     1000012       -12   # BR(~chi_40 -> ~nu_eL    nu_eb)
     1.09864126E-15    2    -1000012        12   # BR(~chi_40 -> ~nu_eL*   nu_e )
     1.09864126E-15    2     1000014       -14   # BR(~chi_40 -> ~nu_muL   nu_mub)
     1.09864126E-15    2    -1000014        14   # BR(~chi_40 -> ~nu_muL*  nu_mu )
     1.09864126E-15    2     1000016       -16   # BR(~chi_40 -> ~nu_tau1  nu_taub)
     1.09864126E-15    2    -1000016        16   # BR(~chi_40 -> ~nu_tau1* nu_tau )
     7.76082814E-03    2     1000039        22   # BR(~chi_40 -> ~G        gam)
     2.42558958E-02    2     1000039        23   # BR(~chi_40 -> ~G        Z)
     1.46370304E-09    2     1000039        25   # BR(~chi_40 -> ~G        h)
     9.19031844E-09    2     1000039        35   # BR(~chi_40 -> ~G        H)
     1.81099573E-12    2     1000039        36   # BR(~chi_40 -> ~G        A)
#
#
#
#
