#
#                              ======================
#                              | THE SUSYHIT OUTPUT |
#                              ======================
#
#
#              ------------------------------------------------------
#              |     This is the output of the SUSY-HIT package     |
#              |  created by A.Djouadi, M.Muehlleitner and M.Spira. |
#              |  In case of problems with SUSY-HIT email to        |
#              |           margarete.muehlleitner@cern.ch           |
#              |           michael.spira@psi.ch                     |
#              |           abdelhak.djouadi@cern.ch                 |
#              ------------------------------------------------------
#
#              ------------------------------------------------------
#              |  SUSY Les Houches Accord - MSSM Spectrum + Decays  |
#              |              based on the decay programs           |
#              |                                                    |
#              |                     SDECAY 1.3b                    |
#              |                                                    |
#              |  Authors: M.Muhlleitner, A.Djouadi and Y.Mambrini  |
#              |  Ref.:    Comput.Phys.Commun.168(2005)46           |
#              |           [hep-ph/0311167]                         |
#              |                                                    |
#              |                     HDECAY 3.4                     |
#              |                                                    |
#              |  By: A.Djouadi,J.Kalinowski,M.Muhlleitner,M.Spira  |
#              |  Ref.:    Comput.Phys.Commun.108(1998)56           |
#              |           [hep-ph/9704448]                         |
#              |                                                    |
#              |                                                    |
#              |  If not stated otherwise all DRbar couplings and   |
#              |  soft SUSY breaking masses are given at the scale  |
#              |  Q=  0.50007605E+04
#              |                                                    |
#              ------------------------------------------------------
#
#
BLOCK DCINFO  # Decay Program information
     1   SDECAY/HDECAY # decay calculator
     2   1.3b  /3.4    # version number
#
BLOCK SPINFO  # Spectrum calculator information
     1    SOFTSUSY    # spectrum calculator                
     2    3.4.0       # version number                     
#
BLOCK MODSEL  # Model selection
     1     0   #  nonUniversal                                     
#
BLOCK SMINPUTS  # Standard Model inputs
         1     1.25778332E+02   # alpha_em^-1(M_Z)^MSbar
         2     1.16570000E-05   # G_F [GeV^-2]
         3     1.17200002E-01   # alpha_S(M_Z)^MSbar
         4     9.11876000E+01   # M_Z pole mass
         5     4.25000000E+00   # mb(mb)^MSbar
         6     1.72500000E+02   # mt pole mass
         7     1.77682000E+00   # mtau pole mass
#
BLOCK MINPAR  # Input parameters - minimal models
         3     1.00000000E+01   # tanb                
#
BLOCK EXTPAR  # Input parameters - non-minimal models
         0    -1.00000000E+00   # Set                 
         1     6.00000000E+01   # M_1(MX)             
         2     3.00000000E+03   # M_2(MX)             
         3     1.03377100E+03   # M_3(MX)             
        11     5.00000000E+03   # At(MX)              
        12     5.00000000E+03   # Ab(MX)              
        13     0.00000000E+00   # Atau(MX)            
        23    -2.82865000E+02   # mu(MX)              
        26     3.00000000E+03   # mA(pole)            
        31     5.00000000E+03   # meL(MX)             
        32     5.00000000E+03   # mmuL(MX)            
        33     5.00000000E+03   # mtauL(MX)           
        34     5.00000000E+03   # meR(MX)             
        35     5.00000000E+03   # mmuR(MX)            
        36     5.00000000E+03   # mtauR(MX)           
        41     5.00000000E+03   # mqL1(MX)            
        42     5.00000000E+03   # mqL2(MX)            
        43     5.00000000E+03   # mqL3(MX)            
        44     5.00000000E+03   # muR(MX)             
        45     5.00000000E+03   # mcR(MX)             
        46     5.00000000E+03   # mtR(MX)             
        47     5.00000000E+03   # mdR(MX)             
        48     5.00000000E+03   # msR(MX)             
        49     5.00000000E+03   # mbR(MX)             
#
BLOCK MASS  # Mass Spectrum
# PDG code           mass       particle
        24     8.00899902E+01   # W+
        25     1.24501710E+02   # h
        35     3.00008860E+03   # H
        36     2.99999970E+03   # A
        37     3.00146929E+03   # H+
         5     4.87878001E+00   # b-quark pole mass calculated from mb(mb)_Msbar
   1000001     5.06535020E+03   # ~d_L
   2000001     5.04744967E+03   # ~d_R
   1000002     5.06487254E+03   # ~u_L
   2000002     5.04714176E+03   # ~u_R
   1000003     5.06535020E+03   # ~s_L
   2000003     5.04744967E+03   # ~s_R
   1000004     5.06487254E+03   # ~c_L
   2000004     5.04714176E+03   # ~c_R
   1000005     5.01168779E+03   # ~b_1
   2000005     5.04561023E+03   # ~b_2
   1000006     4.90226901E+03   # ~t_1
   2000006     5.05605530E+03   # ~t_2
   1000011     5.01914121E+03   # ~e_L
   2000011     5.00595450E+03   # ~e_R
   1000012     5.01818923E+03   # ~nu_eL
   1000013     5.01914121E+03   # ~mu_L
   2000013     5.00595450E+03   # ~mu_R
   1000014     5.01818923E+03   # ~nu_muL
   1000015     5.00481652E+03   # ~tau_1
   2000015     5.01862253E+03   # ~tau_2
   1000016     5.01763528E+03   # ~nu_tauL
   1000021     1.30000102E+03   # ~g
   1000022     5.97915579E+01   # ~chi_10
   1000023     3.01966120E+02   # ~chi_20
   1000025    -3.03837578E+02   # ~chi_30
   1000035     3.07423797E+03   # ~chi_40
   1000024     3.00000026E+02   # ~chi_1+
   1000037     3.07440597E+03   # ~chi_2+
#
BLOCK NMIX  # Neutralino Mixing Matrix
  1  1     9.88604413E-01   # N_11
  1  2     5.99925993E-05   # N_12
  1  3    -1.49814662E-01   # N_13
  1  4    -1.47267691E-02   # N_14
  2  1     1.16378627E-01   # N_21
  2  2     1.76983319E-02   # N_22
  2  3     6.98595275E-01   # N_23
  2  4     7.05767260E-01   # N_24
  3  1    -9.54838796E-02   # N_31
  3  2     1.80299283E-02   # N_32
  3  3    -6.99657160E-01   # N_33
  3  4     7.07840101E-01   # N_34
  4  1    -3.97575938E-04   # N_41
  4  2     9.99680793E-01   # N_42
  4  3     2.59868037E-04   # N_43
  4  4    -2.52603893E-02   # N_44
#
BLOCK UMIX  # Chargino Mixing Matrix U
  1  1    -3.64960784E-04   # U_11
  1  2     9.99999933E-01   # U_12
  2  1    -9.99999933E-01   # U_21
  2  2    -3.64960784E-04   # U_22
#
BLOCK VMIX  # Chargino Mixing Matrix V
  1  1     3.57326549E-02   # V_11
  1  2    -9.99361385E-01   # V_12
  2  1    -9.99361385E-01   # V_21
  2  2    -3.57326549E-02   # V_22
#
BLOCK STOPMIX  # Stop Mixing Matrix
  1  1    -5.05395210E-01   # cos(theta_t)
  1  2     8.62887989E-01   # sin(theta_t)
  2  1    -8.62887989E-01   # -sin(theta_t)
  2  2    -5.05395210E-01   # cos(theta_t)
#
BLOCK SBOTMIX  # Sbottom Mixing Matrix
  1  1     9.99190413E-01   # cos(theta_b)
  1  2    -4.02308162E-02   # sin(theta_b)
  2  1     4.02308162E-02   # -sin(theta_b)
  2  2     9.99190413E-01   # cos(theta_b)
#
BLOCK STAUMIX  # Stau Mixing Matrix
  1  1    -3.37592863E-02   # cos(theta_tau)
  1  2     9.99429993E-01   # sin(theta_tau)
  2  1    -9.99429993E-01   # -sin(theta_tau)
  2  2    -3.37592863E-02   # cos(theta_tau)
#
BLOCK ALPHA  # Higgs mixing
          -1.05461362E-01   # Mixing angle in the neutral Higgs boson sector
#
BLOCK HMIX Q=  5.00076046E+03  # DRbar Higgs Parameters
         1    -2.87938980E+02   # mu(Q)MSSM           
         2     9.47157460E+00   # tan                 
         3     2.41735743E+02   # higgs               
         4     8.75017333E+06   # mA^2(Q)MSSM         
#
BLOCK GAUGE Q=  5.00076046E+03  # The gauge couplings
     1     3.71083640E-01   # gprime(Q) DRbar
     2     6.33936811E-01   # g(Q) DRbar
     3     1.00480343E+00   # g3(Q) DRbar
#
BLOCK AU Q=  5.00076046E+03  # The trilinear couplings
  1  1     5.00000001E+03   # A_u(Q) DRbar
  2  2     5.00000001E+03   # A_c(Q) DRbar
  3  3     5.00000001E+03   # A_t(Q) DRbar
#
BLOCK AD Q=  5.00076046E+03  # The trilinear couplings
  1  1     5.00000000E+03   # A_d(Q) DRbar
  2  2     5.00000000E+03   # A_s(Q) DRbar
  3  3     5.00000001E+03   # A_b(Q) DRbar
#
BLOCK AE Q=  5.00076046E+03  # The trilinear couplings
  1  1     0.00000000E+00   # A_e(Q) DRbar
  2  2     6.42373657E-08   # A_mu(Q) DRbar
  3  3     6.34388872E-08   # A_tau(Q) DRbar
#
BLOCK Yu Q=  5.00076046E+03  # The Yukawa couplings
  1  1     0.00000000E+00   # y_u(Q) DRbar
  2  2     0.00000000E+00   # y_c(Q) DRbar
  3  3     8.17057250E-01   # y_t(Q) DRbar
#
BLOCK Yd Q=  5.00076046E+03  # The Yukawa couplings
  1  1     0.00000000E+00   # y_d(Q) DRbar
  2  2     0.00000000E+00   # y_s(Q) DRbar
  3  3     1.29309775E-01   # y_b(Q) DRbar
#
BLOCK Ye Q=  5.00076046E+03  # The Yukawa couplings
  1  1     0.00000000E+00   # y_e(Q) DRbar
  2  2     0.00000000E+00   # y_mu(Q) DRbar
  3  3     9.72883941E-02   # y_tau(Q) DRbar
#
BLOCK MSOFT Q=  5.00076046E+03  # The soft SUSY breaking masses at the scale Q
         1     6.00000000E+01   # M_1(Q)              
         2     3.00000000E+03   # M_2(Q)              
         3     1.03377100E+03   # M_3(Q)              
        21     8.64819291E+06   # mH1^2(Q)            
        22     4.92702966E+05   # mH2^2(Q)            
        31     5.00000000E+03   # meL(Q)              
        32     5.00000000E+03   # mmuL(Q)             
        33     5.00000000E+03   # mtauL(Q)            
        34     5.00000000E+03   # meR(Q)              
        35     5.00000000E+03   # mmuR(Q)             
        36     5.00000000E+03   # mtauR(Q)            
        41     5.00000000E+03   # mqL1(Q)             
        42     5.00000000E+03   # mqL2(Q)             
        43     5.00000000E+03   # mqL3(Q)             
        44     5.00000000E+03   # muR(Q)              
        45     5.00000000E+03   # mcR(Q)              
        46     5.00000000E+03   # mtR(Q)              
        47     5.00000000E+03   # mdR(Q)              
        48     5.00000000E+03   # msR(Q)              
        49     5.00000000E+03   # mbR(Q)              
#
#
#
#                             =================
#                             |The decay table|
#                             =================
#
# - The QCD corrections to the decays gluino -> squark  + quark
#                                     squark -> gaugino + quark_prime
#                                     squark -> squark_prime + Higgs
#                                     squark -> gluino  + quark
#   are included.
#
# - The multi-body decays for the inos, stops and sbottoms are included.
#
# - The loop induced decays for the gluino, neutralinos and stops
#   are included.
#
# - The SUSY decays of the top quark are included.
#
#
#         PDG            Width
DECAY         6     1.40852940E+00   # top decays
#          BR         NDA      ID1       ID2
     1.00000000E+00    2           5        24   # BR(t ->  b    W+)
#
#         PDG            Width
DECAY   1000021     1.86767133E-04   # gluino decays
#          BR         NDA      ID1       ID2
     4.65970501E-06    2     1000022        21   # BR(~g -> ~chi_10 g)
     1.88141849E-02    2     1000023        21   # BR(~g -> ~chi_20 g)
     1.82466836E-02    2     1000025        21   # BR(~g -> ~chi_30 g)
#           BR         NDA      ID1       ID2       ID3
     1.36523814E-02    3     1000022         1        -1   # BR(~g -> ~chi_10 d  db)
     1.27991232E-04    3     1000023         1        -1   # BR(~g -> ~chi_20 d  db)
     8.58358892E-05    3     1000025         1        -1   # BR(~g -> ~chi_30 d  db)
     4.65324233E-02    3     1000022         2        -2   # BR(~g -> ~chi_10 u  ub)
     6.04726817E-04    3     1000023         2        -2   # BR(~g -> ~chi_20 u  ub)
     1.75775347E-04    3     1000025         2        -2   # BR(~g -> ~chi_30 u  ub)
     1.36523814E-02    3     1000022         3        -3   # BR(~g -> ~chi_10 s  sb)
     1.27991232E-04    3     1000023         3        -3   # BR(~g -> ~chi_20 s  sb)
     8.58358892E-05    3     1000025         3        -3   # BR(~g -> ~chi_30 s  sb)
     4.65324233E-02    3     1000022         4        -4   # BR(~g -> ~chi_10 c  cb)
     6.04726817E-04    3     1000023         4        -4   # BR(~g -> ~chi_20 c  cb)
     1.75775347E-04    3     1000025         4        -4   # BR(~g -> ~chi_30 c  cb)
     1.42602384E-02    3     1000022         5        -5   # BR(~g -> ~chi_10 b  bb)
     5.86047690E-03    3     1000023         5        -5   # BR(~g -> ~chi_20 b  bb)
     5.80931634E-03    3     1000025         5        -5   # BR(~g -> ~chi_30 b  bb)
     3.63102324E-02    3     1000022         6        -6   # BR(~g -> ~chi_10 t  tb)
     1.91735509E-01    3     1000023         6        -6   # BR(~g -> ~chi_20 t  tb)
     1.59999572E-01    3     1000025         6        -6   # BR(~g -> ~chi_30 t  tb)
     5.85523588E-05    3     1000024         1        -2   # BR(~g -> ~chi_1+ d  ub)
     5.85523588E-05    3    -1000024         2        -1   # BR(~g -> ~chi_1- u  db)
     5.85523588E-05    3     1000024         3        -4   # BR(~g -> ~chi_1+ s  cb)
     5.85523588E-05    3    -1000024         4        -3   # BR(~g -> ~chi_1- c  sb)
     2.13183325E-01    3     1000024         5        -6   # BR(~g -> ~chi_1+ b  tb)
     2.13183325E-01    3    -1000024         6        -5   # BR(~g -> ~chi_1- t  bb)
#
#         PDG            Width
DECAY   1000006     4.05678083E+02   # stop1 decays
#          BR         NDA      ID1       ID2
     2.07018402E-02    2     1000022         6   # BR(~t_1 -> ~chi_10 t )
     8.32983983E-02    2     1000023         6   # BR(~t_1 -> ~chi_20 t )
     7.65253601E-02    2     1000025         6   # BR(~t_1 -> ~chi_30 t )
     5.07793800E-03    2     1000035         6   # BR(~t_1 -> ~chi_40 t )
     1.17727348E-01    2     1000024         5   # BR(~t_1 -> ~chi_1+ b )
     1.01233512E-02    2     1000037         5   # BR(~t_1 -> ~chi_2+ b )
     6.86545764E-01    2     1000021         6   # BR(~t_1 -> ~g      t )
#
#         PDG            Width
DECAY   2000006     4.05668148E+02   # stop2 decays
#          BR         NDA      ID1       ID2
     9.26093553E-03    2     1000022         6   # BR(~t_2 -> ~chi_10 t )
     7.98098327E-02    2     1000023         6   # BR(~t_2 -> ~chi_20 t )
     8.75237326E-02    2     1000025         6   # BR(~t_2 -> ~chi_30 t )
     1.37043039E-02    2     1000035         6   # BR(~t_2 -> ~chi_40 t )
     4.87527706E-02    2     1000024         5   # BR(~t_2 -> ~chi_1+ b )
     2.72912539E-02    2     1000037         5   # BR(~t_2 -> ~chi_2+ b )
     7.30605696E-01    2     1000021         6   # BR(~t_2 -> ~g      t )
     7.00088058E-04    2     1000006        25   # BR(~t_2 -> ~t_1    h )
     2.35138694E-03    2     1000006        23   # BR(~t_2 -> ~t_1    Z )
#
#         PDG            Width
DECAY   1000005     3.82491355E+02   # sbottom1 decays
#          BR         NDA      ID1       ID2
     2.09892493E-03    2     1000022         5   # BR(~b_1 -> ~chi_10 b )
     2.09457305E-03    2     1000023         5   # BR(~b_1 -> ~chi_20 b )
     2.14833209E-03    2     1000025         5   # BR(~b_1 -> ~chi_30 b )
     1.97942350E-02    2     1000035         5   # BR(~b_1 -> ~chi_40 b )
     1.73933824E-01    2    -1000024         6   # BR(~b_1 -> ~chi_1- t )
     3.97369695E-02    2    -1000037         6   # BR(~b_1 -> ~chi_2- t )
     7.58722458E-01    2     1000021         5   # BR(~b_1 -> ~g      b )
     1.47068379E-03    2     1000006       -24   # BR(~b_1 -> ~t_1    W-)
#
#         PDG            Width
DECAY   2000005     2.98948387E+02   # sbottom2 decays
#          BR         NDA      ID1       ID2
     9.73627793E-03    2     1000022         5   # BR(~b_2 -> ~chi_10 b )
     2.93537095E-03    2     1000023         5   # BR(~b_2 -> ~chi_20 b )
     2.92438592E-03    2     1000025         5   # BR(~b_2 -> ~chi_30 b )
     3.88108173E-05    2     1000035         5   # BR(~b_2 -> ~chi_40 b )
     5.96410309E-03    2    -1000024         6   # BR(~b_2 -> ~chi_1- t )
     7.79247330E-05    2    -1000037         6   # BR(~b_2 -> ~chi_2- t )
     9.78310885E-01    2     1000021         5   # BR(~b_2 -> ~g      b )
     1.22418351E-05    2     1000006       -24   # BR(~b_2 -> ~t_1    W-)
#
#         PDG            Width
DECAY   1000002     3.18166222E+02   # sup_L decays
#          BR         NDA      ID1       ID2
     2.30036994E-03    2     1000022         2   # BR(~u_L -> ~chi_10 u)
     1.00211350E-04    2     1000023         2   # BR(~u_L -> ~chi_20 u)
     2.21686557E-08    2     1000025         2   # BR(~u_L -> ~chi_30 u)
     2.46840489E-02    2     1000035         2   # BR(~u_L -> ~chi_40 u)
     1.56754237E-04    2     1000024         1   # BR(~u_L -> ~chi_1+ d)
     4.93379571E-02    2     1000037         1   # BR(~u_L -> ~chi_2+ d)
     9.23420636E-01    2     1000021         2   # BR(~u_L -> ~g      u)
#
#         PDG            Width
DECAY   2000002     3.04412707E+02   # sup_R decays
#          BR         NDA      ID1       ID2
     3.83096662E-02    2     1000022         2   # BR(~u_R -> ~chi_10 u)
     5.27394636E-04    2     1000023         2   # BR(~u_R -> ~chi_20 u)
     3.54986053E-04    2     1000025         2   # BR(~u_R -> ~chi_30 u)
     2.45724024E-09    2     1000035         2   # BR(~u_R -> ~chi_40 u)
     9.60807951E-01    2     1000021         2   # BR(~u_R -> ~g      u)
#
#         PDG            Width
DECAY   1000001     3.18175767E+02   # sdown_L decays
#          BR         NDA      ID1       ID2
     2.29765880E-03    2     1000022         1   # BR(~d_L -> ~chi_10 d)
     1.54048013E-06    2     1000023         1   # BR(~d_L -> ~chi_20 d)
     8.24926949E-05    2     1000025         1   # BR(~d_L -> ~chi_30 d)
     2.46986994E-02    2     1000035         1   # BR(~d_L -> ~chi_40 d)
     1.63534646E-08    2    -1000024         2   # BR(~d_L -> ~chi_1- u)
     4.94150083E-02    2    -1000037         2   # BR(~d_L -> ~chi_2- u)
     9.23504584E-01    2     1000021         1   # BR(~d_L -> ~g      d)
#
#         PDG            Width
DECAY   2000001     2.95487886E+02   # sdown_R decays
#          BR         NDA      ID1       ID2
     9.86729465E-03    2     1000022         1   # BR(~d_R -> ~chi_10 d)
     1.35839410E-04    2     1000023         1   # BR(~d_R -> ~chi_20 d)
     9.14326638E-05    2     1000025         1   # BR(~d_R -> ~chi_30 d)
     6.32993613E-10    2     1000035         1   # BR(~d_R -> ~chi_40 d)
     9.89905433E-01    2     1000021         1   # BR(~d_R -> ~g      d)
#
#         PDG            Width
DECAY   1000004     3.18166222E+02   # scharm_L decays
#          BR         NDA      ID1       ID2
     2.30036994E-03    2     1000022         4   # BR(~c_L -> ~chi_10 c)
     1.00211350E-04    2     1000023         4   # BR(~c_L -> ~chi_20 c)
     2.21686557E-08    2     1000025         4   # BR(~c_L -> ~chi_30 c)
     2.46840489E-02    2     1000035         4   # BR(~c_L -> ~chi_40 c)
     1.56754237E-04    2     1000024         3   # BR(~c_L -> ~chi_1+ s)
     4.93379571E-02    2     1000037         3   # BR(~c_L -> ~chi_2+ s)
     9.23420636E-01    2     1000021         4   # BR(~c_L -> ~g      c)
#
#         PDG            Width
DECAY   2000004     3.04412707E+02   # scharm_R decays
#          BR         NDA      ID1       ID2
     3.83096662E-02    2     1000022         4   # BR(~c_R -> ~chi_10 c)
     5.27394636E-04    2     1000023         4   # BR(~c_R -> ~chi_20 c)
     3.54986053E-04    2     1000025         4   # BR(~c_R -> ~chi_30 c)
     2.45724024E-09    2     1000035         4   # BR(~c_R -> ~chi_40 c)
     9.60807951E-01    2     1000021         4   # BR(~c_R -> ~g      c)
#
#         PDG            Width
DECAY   1000003     3.18175767E+02   # sstrange_L decays
#          BR         NDA      ID1       ID2
     2.29765880E-03    2     1000022         3   # BR(~s_L -> ~chi_10 s)
     1.54048013E-06    2     1000023         3   # BR(~s_L -> ~chi_20 s)
     8.24926949E-05    2     1000025         3   # BR(~s_L -> ~chi_30 s)
     2.46986994E-02    2     1000035         3   # BR(~s_L -> ~chi_40 s)
     1.63534646E-08    2    -1000024         4   # BR(~s_L -> ~chi_1- c)
     4.94150083E-02    2    -1000037         4   # BR(~s_L -> ~chi_2- c)
     9.23504584E-01    2     1000021         3   # BR(~s_L -> ~g      s)
#
#         PDG            Width
DECAY   2000003     2.95487886E+02   # sstrange_R decays
#          BR         NDA      ID1       ID2
     9.86729465E-03    2     1000022         3   # BR(~s_R -> ~chi_10 s)
     1.35839410E-04    2     1000023         3   # BR(~s_R -> ~chi_20 s)
     9.14326638E-05    2     1000025         3   # BR(~s_R -> ~chi_30 s)
     6.32993613E-10    2     1000035         3   # BR(~s_R -> ~chi_40 s)
     9.89905433E-01    2     1000021         3   # BR(~s_R -> ~g      s)
#
#         PDG            Width
DECAY   1000011     3.03839704E+01   # selectron_L decays
#          BR         NDA      ID1       ID2
     2.21126358E-01    2     1000022        11   # BR(~e_L -> ~chi_10 e-)
     4.82865604E-03    2     1000023        11   # BR(~e_L -> ~chi_20 e-)
     9.39756418E-04    2     1000025        11   # BR(~e_L -> ~chi_30 e-)
     2.57534586E-01    2     1000035        11   # BR(~e_L -> ~chi_40 e-)
     1.74658894E-07    2    -1000024        12   # BR(~e_L -> ~chi_1- nu_e)
     5.15570469E-01    2    -1000037        12   # BR(~e_L -> ~chi_2- nu_e)
#
#         PDG            Width
DECAY   2000011     2.74155918E+01   # selectron_R decays
#          BR         NDA      ID1       ID2
     9.77494217E-01    2     1000022        11   # BR(~e_R -> ~chi_10 e-)
     1.34515774E-02    2     1000023        11   # BR(~e_R -> ~chi_20 e-)
     9.05414467E-03    2     1000025        11   # BR(~e_R -> ~chi_30 e-)
     6.13501779E-08    2     1000035        11   # BR(~e_R -> ~chi_40 e-)
#
#         PDG            Width
DECAY   1000013     3.03839704E+01   # smuon_L decays
#          BR         NDA      ID1       ID2
     2.21126358E-01    2     1000022        13   # BR(~mu_L -> ~chi_10 mu-)
     4.82865604E-03    2     1000023        13   # BR(~mu_L -> ~chi_20 mu-)
     9.39756418E-04    2     1000025        13   # BR(~mu_L -> ~chi_30 mu-)
     2.57534586E-01    2     1000035        13   # BR(~mu_L -> ~chi_40 mu-)
     1.74658894E-07    2    -1000024        14   # BR(~mu_L -> ~chi_1- nu_mu)
     5.15570469E-01    2    -1000037        14   # BR(~mu_L -> ~chi_2- nu_mu)
#
#         PDG            Width
DECAY   2000013     2.74155918E+01   # smuon_R decays
#          BR         NDA      ID1       ID2
     9.77494217E-01    2     1000022        13   # BR(~mu_R -> ~chi_10 mu-)
     1.34515774E-02    2     1000023        13   # BR(~mu_R -> ~chi_20 mu-)
     9.05414467E-03    2     1000025        13   # BR(~mu_R -> ~chi_30 mu-)
     6.13501779E-08    2     1000035        13   # BR(~mu_R -> ~chi_40 mu-)
#
#         PDG            Width
DECAY   1000015     2.92827472E+01   # stau_1 decays
#          BR         NDA      ID1       ID2
     9.15765330E-01    2     1000022        15   # BR(~tau_1 -> ~chi_10  tau-)
     2.78235553E-02    2     1000023        15   # BR(~tau_1 -> ~chi_20  tau-)
     2.35919329E-02    2     1000025        15   # BR(~tau_1 -> ~chi_30  tau-)
     3.02663291E-04    2     1000035        15   # BR(~tau_1 -> ~chi_40  tau-)
     3.19107458E-02    2    -1000024        16   # BR(~tau_1 -> ~chi_1-  nu_tau)
     6.05772828E-04    2    -1000037        16   # BR(~tau_1 -> ~chi_2-  nu_tau)
#
#         PDG            Width
DECAY   2000015     3.13110281E+01   # stau_2 decays
#          BR         NDA      ID1       ID2
     2.15154397E-01    2     1000022        15   # BR(~tau_2 -> ~chi_10  tau-)
     1.96453078E-02    2     1000023        15   # BR(~tau_2 -> ~chi_20  tau-)
     1.60676607E-02    2     1000025        15   # BR(~tau_2 -> ~chi_30  tau-)
     2.49535831E-01    2     1000035        15   # BR(~tau_2 -> ~chi_40  tau-)
     3.91301108E-05    2    -1000024        16   # BR(~tau_2 -> ~chi_1-  nu_tau)
     4.99557673E-01    2    -1000037        16   # BR(~tau_2 -> ~chi_2-  nu_tau)
#
#         PDG            Width
DECAY   1000012     3.03871002E+01   # snu_eL decays
#          BR         NDA      ID1       ID2
     2.20969972E-01    2     1000022        12   # BR(~nu_eL -> ~chi_10 nu_e)
     1.66647754E-03    2     1000023        12   # BR(~nu_eL -> ~chi_20 nu_e)
     3.58109474E-03    2     1000025        12   # BR(~nu_eL -> ~chi_30 nu_e)
     2.57581672E-01    2     1000035        12   # BR(~nu_eL -> ~chi_40 nu_e)
     1.67378850E-03    2     1000024        11   # BR(~nu_eL -> ~chi_1+ e-)
     5.14526995E-01    2     1000037        11   # BR(~nu_eL -> ~chi_2+ e-)
#
#         PDG            Width
DECAY   1000014     3.03871002E+01   # snu_muL decays
#          BR         NDA      ID1       ID2
     2.20969972E-01    2     1000022        14   # BR(~nu_muL -> ~chi_10 nu_mu)
     1.66647754E-03    2     1000023        14   # BR(~nu_muL -> ~chi_20 nu_mu)
     3.58109474E-03    2     1000025        14   # BR(~nu_muL -> ~chi_30 nu_mu)
     2.57581672E-01    2     1000035        14   # BR(~nu_muL -> ~chi_40 nu_mu)
     1.67378850E-03    2     1000024        13   # BR(~nu_muL -> ~chi_1+ mu-)
     5.14526995E-01    2     1000037        13   # BR(~nu_muL -> ~chi_2+ mu-)
#
#         PDG            Width
DECAY   1000016     3.13156118E+01   # snu_tauL decays
#          BR         NDA      ID1       ID2
     2.14394504E-01    2     1000022        16   # BR(~nu_tauL -> ~chi_10 nu_tau)
     1.61688518E-03    2     1000023        16   # BR(~nu_tauL -> ~chi_20 nu_tau)
     3.47452562E-03    2     1000025        16   # BR(~nu_tauL -> ~chi_30 nu_tau)
     2.49850451E-01    2     1000035        16   # BR(~nu_tauL -> ~chi_40 nu_tau)
     3.15802862E-02    2     1000024        15   # BR(~nu_tauL -> ~chi_1+ tau-)
     4.99083349E-01    2     1000037        15   # BR(~nu_tauL -> ~chi_2+ tau-)
#
#         PDG            Width
DECAY   1000024     1.63141222E-01   # chargino1+ decays
#          BR         NDA      ID1       ID2
     1.00000000E+00    2     1000022        24   # BR(~chi_1+ -> ~chi_10  W+)
#
#         PDG            Width
DECAY   1000037     2.29093341E+01   # chargino2+ decays
#          BR         NDA      ID1       ID2
     2.53661270E-01    2     1000024        23   # BR(~chi_2+ -> ~chi_1+  Z )
     1.47754438E-04    2     1000022        24   # BR(~chi_2+ -> ~chi_10  W+)
     2.45457058E-01    2     1000023        24   # BR(~chi_2+ -> ~chi_20  W+)
     2.44563192E-01    2     1000025        24   # BR(~chi_2+ -> ~chi_30  W+)
     2.56155584E-01    2     1000024        25   # BR(~chi_2+ -> ~chi_1+  h )
     1.51425596E-05    2     1000022        37   # BR(~chi_2+ -> ~chi_10  H+)
#
#         PDG            Width
DECAY   1000022     0.00000000E+00   # neutralino1 decays
#
#         PDG            Width
DECAY   1000023     1.53594451E-01   # neutralino2 decays
#          BR         NDA      ID1       ID2
     4.91364900E-01    2     1000022        23   # BR(~chi_20 -> ~chi_10   Z )
     5.08635100E-01    2     1000022        25   # BR(~chi_20 -> ~chi_10   h )
#
#         PDG            Width
DECAY   1000025     1.38441275E-01   # neutralino3 decays
#          BR         NDA      ID1       ID2
     6.70921150E-01    2     1000022        23   # BR(~chi_30 -> ~chi_10   Z )
     3.29078850E-01    2     1000022        25   # BR(~chi_30 -> ~chi_10   h )
#
#         PDG            Width
DECAY   1000035     2.29108374E+01   # neutralino4 decays
#          BR         NDA      ID1       ID2
     6.90436906E-05    2     1000022        23   # BR(~chi_40 -> ~chi_10   Z )
     1.29010544E-01    2     1000023        23   # BR(~chi_40 -> ~chi_20   Z )
     1.24416135E-01    2     1000025        23   # BR(~chi_40 -> ~chi_30   Z )
     2.45289547E-01    2     1000024       -24   # BR(~chi_40 -> ~chi_1+   W-)
     2.45289547E-01    2    -1000024        24   # BR(~chi_40 -> ~chi_1-   W+)
     6.82530415E-05    2     1000022        25   # BR(~chi_40 -> ~chi_10   h )
     1.46145195E-05    2     1000022        35   # BR(~chi_40 -> ~chi_10   H )
     1.55043422E-06    2     1000022        36   # BR(~chi_40 -> ~chi_10   A )
     1.26568855E-01    2     1000023        25   # BR(~chi_40 -> ~chi_20   h )
     1.29271912E-01    2     1000025        25   # BR(~chi_40 -> ~chi_30   h )
#
#         PDG            Width
DECAY        25     4.04886721E-03   # h decays
#          BR         NDA      ID1       ID2
     6.14882518E-01    2           5        -5   # BR(h -> b       bb     )
     6.39284753E-02    2         -15        15   # BR(h -> tau+    tau-   )
     2.26331246E-04    2         -13        13   # BR(h -> mu+     mu-    )
     4.80011937E-04    2           3        -3   # BR(h -> s       sb     )
     2.07972530E-02    2           4        -4   # BR(h -> c       cb     )
     6.69619724E-02    2          21        21   # BR(h -> g       g      )
     2.29426532E-03    2          22        22   # BR(h -> gam     gam    )
     1.45748602E-03    2          22        23   # BR(h -> Z       gam    )
     2.04706030E-01    2          24       -24   # BR(h -> W+      W-     )
     2.42636114E-02    2          23        23   # BR(h -> Z       Z      )
     2.04551226E-06    2     1000022   1000022   # BR(h -> ~chi_10 ~chi_10)
#
#         PDG            Width
DECAY        35     8.78603106E+00   # H decays
#          BR         NDA      ID1       ID2
     3.61943757E-01    2           5        -5   # BR(H -> b       bb     )
     6.34320327E-02    2         -15        15   # BR(H -> tau+    tau-   )
     2.24300706E-04    2         -13        13   # BR(H -> mu+     mu-    )
     2.74958229E-04    2           3        -3   # BR(H -> s       sb     )
     1.53709756E-06    2           4        -4   # BR(H -> c       cb     )
     1.53568228E-01    2           6        -6   # BR(H -> t       tb     )
     5.10799731E-05    2          21        21   # BR(H -> g       g      )
     1.38074180E-07    2          22        22   # BR(H -> gam     gam    )
     9.05340030E-08    2          23        22   # BR(H -> Z       gam    )
     7.42475418E-05    2          24       -24   # BR(H -> W+      W-     )
     3.70767612E-05    2          23        23   # BR(H -> Z       Z      )
     2.66897346E-04    2          25        25   # BR(H -> h       h      )
     4.36913858E-23    2          36        36   # BR(H -> A       A      )
     2.96775184E-19    2          23        36   # BR(H -> Z       A      )
     3.40526162E-03    2     1000024  -1000024   # BR(H -> ~chi_1+ ~chi_1-)
     1.88077325E-02    2     1000022   1000022   # BR(H -> ~chi_10 ~chi_10)
     3.32852970E-03    2     1000023   1000023   # BR(H -> ~chi_20 ~chi_20)
     5.10427420E-03    2     1000025   1000025   # BR(H -> ~chi_30 ~chi_30)
     2.31971524E-01    2     1000022   1000023   # BR(H -> ~chi_10 ~chi_20)
     1.48001119E-01    2     1000022   1000025   # BR(H -> ~chi_10 ~chi_30)
     9.50721407E-03    2     1000023   1000025   # BR(H -> ~chi_20 ~chi_30)
#
#         PDG            Width
DECAY        36     8.79139000E+00   # A decays
#          BR         NDA      ID1       ID2
     3.61847033E-01    2           5        -5   # BR(A -> b       bb     )
     6.33952226E-02    2         -15        15   # BR(A -> tau+    tau-   )
     2.24170229E-04    2         -13        13   # BR(A -> mu+     mu-    )
     2.74999124E-04    2           3        -3   # BR(A -> s       sb     )
     1.54225854E-06    2           4        -4   # BR(A -> c       cb     )
     1.53998828E-01    2           6        -6   # BR(A -> t       tb     )
     1.52419303E-04    2          21        21   # BR(A -> g       g      )
     5.63287584E-07    2          22        22   # BR(A -> gam     gam    )
     1.84358590E-07    2          23        22   # BR(A -> Z       gam    )
     7.39229468E-05    2          23        25   # BR(A -> Z       h      )
     3.56040554E-03    2     1000024  -1000024   # BR(A -> ~chi_1+ ~chi_1-)
     1.80601449E-02    2     1000022   1000022   # BR(A -> ~chi_10 ~chi_10)
     2.25811868E-03    2     1000023   1000023   # BR(A -> ~chi_20 ~chi_20)
     8.17354508E-03    2     1000025   1000025   # BR(A -> ~chi_30 ~chi_30)
     1.51128370E-01    2     1000022   1000023   # BR(A -> ~chi_10 ~chi_20)
     2.28515909E-01    2     1000022   1000025   # BR(A -> ~chi_10 ~chi_30)
     8.33462315E-03    2     1000023   1000025   # BR(A -> ~chi_20 ~chi_30)
#
#         PDG            Width
DECAY        37     8.72104086E+00   # H+ decays
#          BR         NDA      ID1       ID2
     5.78696297E-04    2           4        -5   # BR(H+ -> c       bb     )
     6.39379120E-02    2         -15        16   # BR(H+ -> tau+    nu_tau )
     2.26089219E-04    2         -13        14   # BR(H+ -> mu+     nu_mu  )
     3.70363676E-06    2           2        -5   # BR(H+ -> u       bb     )
     1.32661031E-05    2           2        -3   # BR(H+ -> u       sb     )
     2.74342737E-04    2           4        -3   # BR(H+ -> c       sb     )
     5.13722642E-01    2           6        -5   # BR(H+ -> t       bb     )
     7.46769401E-05    2          24        25   # BR(H+ -> W+      h      )
     1.03281157E-12    2          24        36   # BR(H+ -> W+      A      )
     4.10340966E-01    2     1000024   1000022   # BR(H+ -> ~chi_1+ ~chi_10)
     9.12112920E-03    2     1000024   1000023   # BR(H+ -> ~chi_1+ ~chi_20)
     1.70657590E-03    2     1000024   1000025   # BR(H+ -> ~chi_1+ ~chi_30)
