#  ISAJET SUSY parameters in SUSY Les Houches Accord 2 format
#  Created by ISALHA 2.0 Last revision: H Baer 27 May 2014
Block SPINFO   # Program information
     1   ISASUGRA/ISASUSY from ISAJET   # Spectrum Calculator
     2   7.87   18-JUL-2017 13:55:55    # Version number
Block MODSEL   # Model selection
     1    13   # Non-universal supergravity model                  
Block SMINPUTS   # Standard Model inputs
     1     1.28000000E+02   # alpha_em^(-1)
     2     1.16570000E-05   # G_Fermi
     3     1.19999997E-01   # alpha_s(M_Z)
     4     9.11699982E+01   # m_{Z}(pole)
     5     4.19999981E+00   # m_{b}(m_{b})
     6     1.72500000E+02   # m_{top}(pole)
     7     1.77699995E+00   # m_{tau}(pole)
Block MINPAR   # SUSY breaking input parameters
     1     5.00000000E+03   # m_0
     2     8.00000000E+02   # m_{1/2}
     3     1.50000000E+01   # tan(beta)
     4     1.00000000E+00   # sign(mu)
     5    -8.00000000E+03   # A_0
Block EXTPAR   # Non-universal SUSY breaking parameters
     0     1.72995280E+16   # Input scale
    21     2.89455200E+06   # Down type Higgs mass squared
    22     3.90788520E+07   #  Up  type Higgs mass squared
Block MASS   # Scalar and gaugino mass spectrum
#  PDG code   mass                 particle
         6     1.72500000E+02   #  top            
        24     8.04229965E+01   #  W^+
        25     1.24606003E+02   #  h^0            
        35     1.00666608E+03   #  H^0            
        36     1.00000000E+03   #  A^0            
        37     1.00322870E+03   #  H^+            
   1000001     5.17187988E+03   #  dnl            
   1000002     5.17125244E+03   #  upl            
   1000003     5.17187988E+03   #  stl            
   1000004     5.17125244E+03   #  chl            
   1000005     3.65700732E+03   #  b1             
   1000006     1.59251709E+03   #  t1             
   1000011     5.10872510E+03   #  el-            
   1000012     5.11341455E+03   #  nuel           
   1000013     5.10872510E+03   #  mul-           
   1000014     5.11341455E+03   #  numl           
   1000015     4.65855859E+03   #  tau1           
   1000016     5.03826025E+03   #  nutl           
   1000021     2.00901904E+03   #  glss           
   1000022     1.92344376E+02   #  z1ss           
   1000023    -2.09560150E+02   #  z2ss           
   1000024     2.07702164E+02   #  w1ss           
   1000025     3.64307800E+02   #  z3ss           
   1000035     7.03109436E+02   #  z4ss           
   1000037     6.91753540E+02   #  w2ss           
   1000039     1.00000002E+20   #  gvss
   2000001     5.14089648E+03   #  dnr            
   2000002     5.31472949E+03   #  upr            
   2000003     5.14089648E+03   #  str            
   2000004     5.31472998E+03   #  chr            
   2000005     4.97275146E+03   #  b2             
   2000006     3.63215967E+03   #  t2             
   2000011     4.82090283E+03   #  er-            
   2000013     4.82090283E+03   #  mur-           
   2000015     5.03212842E+03   #  tau2           
Block ALPHA   # Effective Higgs mixing parameter
         -6.81137070E-02   # alpha
Block STOPMIX   # stop mixing matrix
  1  1     5.42152561E-02   # O_{11}
  1  2     9.98529255E-01   # O_{12}
  2  1    -9.98529255E-01   # O_{21}
  2  2     5.42152561E-02   # O_{22}
Block SBOTMIX   # sbottom mixing matrix
  1  1     9.99993742E-01   # O_{11}
  1  2     3.53834452E-03   # O_{12}
  2  1    -3.53834452E-03   # O_{21}
  2  2     9.99993742E-01   # O_{22}
Block STAUMIX   # stau mixing matrix
  1  1     8.14984739E-03   # O_{11}
  1  2     9.99966800E-01   # O_{12}
  2  1    -9.99966800E-01   # O_{21}
  2  2     8.14984739E-03   # O_{22}
Block NMIX   # neutralino mixing matrix
  1  1     1.83480904E-01   #
  1  2    -1.16071701E-01   #
  1  3     7.09011376E-01   #
  1  4    -6.70943260E-01   #
  2  1    -4.96862605E-02   #
  2  2     5.51388524E-02   #
  2  3     6.96901441E-01   #
  2  4     7.13315964E-01   #
  3  1    -9.81599867E-01   #
  3  2    -4.27590907E-02   #
  3  3     9.63597894E-02   #
  3  4    -1.59210995E-01   #
  4  1     1.81024987E-02   #
  4  2    -9.90787089E-01   #
  4  3    -4.84363250E-02   #
  4  4     1.25169978E-01   #
Block UMIX   # chargino U mixing matrix
  1  1    -6.65881187E-02   # U_{11}
  1  2     9.97780561E-01   # U_{12}
  2  1    -9.97780561E-01   # U_{21}
  2  2    -6.65881187E-02   # U_{22}
Block VMIX   # chargino V mixing matrix
  1  1    -1.74162701E-01   # V_{11}
  1  2     9.84716892E-01   # V_{12}
  2  1    -9.84716892E-01   # V_{21}
  2  2    -1.74162701E-01   # V_{22}
Block GAUGE Q=  2.40166138E+03   #
     1     3.57524991E-01   # g`
     2     6.52378023E-01   # g_2
     3     1.21928668E+00   # g_3
Block YU Q=  2.40166138E+03   #
  3  3     8.27126443E-01   # y_t
Block YD Q=  2.40166138E+03   #
  3  3     1.93127692E-01   # y_b
Block YE Q=  2.40166138E+03   #
  3  3     1.50969371E-01   # y_tau
Block HMIX Q=  2.40166138E+03   # Higgs mixing parameters
     1     2.00000000E+02   # mu(Q)
     2     1.43597851E+01   # tan(beta)(Q)
     3     2.52247894E+02   # Higgs vev at Q
     4     1.00000000E+06   # m_A^2(Q)
Block MSOFT Q=  2.40166138E+03   # DRbar SUSY breaking parameters
     1     3.56001709E+02   # M_1(Q)          
     2     6.51294983E+02   # M_2(Q)          
     3     1.74640430E+03   # M_3(Q)          
    21     9.28511125E+05   # MHd^2(Q)        
    22    -7.56922500E+04   # MHu^2(Q)        
    31     5.09230273E+03   # MeL(Q)          
    32     5.09230273E+03   # MmuL(Q)         
    33     5.01918018E+03   # MtauL(Q)        
    34     4.81730469E+03   # MeR(Q)          
    35     4.81730469E+03   # MmuR(Q)         
    36     4.65587256E+03   # MtauR(Q)        
    41     5.08175977E+03   # MqL1(Q)         
    42     5.08175977E+03   # MqL2(Q)         
    43     3.60320166E+03   # MqL3(Q)         
    44     5.22402441E+03   # MuR(Q)          
    45     5.22402441E+03   # McR(Q)          
    46     1.60079236E+03   # MtR(Q)          
    47     5.05127637E+03   # MdR(Q)          
    48     5.05127637E+03   # MsR(Q)          
    49     4.91973584E+03   # MbR(Q)          
Block AU Q=  2.40166138E+03   #
  1  1    -4.27717676E+03   # A_u
  2  2    -4.27717676E+03   # A_c
  3  3    -4.27717676E+03   # A_t
Block AD Q=  2.40166138E+03   #
  1  1    -8.70767676E+03   # A_d
  2  2    -8.70767676E+03   # A_s
  3  3    -8.70767676E+03   # A_b
Block AE Q=  2.40166138E+03   #
  1  1    -8.10439746E+03   # A_e
  2  2    -8.10439746E+03   # A_mu
  3  3    -8.10439746E+03   # A_tau
#  ISAJET decay tables in SUSY Les Houches accord format
#  Created by ISALHD. Last revision: C. Balazs, 2005 May 25
Block DCINFO                           # Program information
     1   ISASUGRA from ISAJET          # Spectrum Calculator
     2   7.87   18-JUL-2017 13:55:55   # Version number
#         PDG         Width
DECAY         6  1.46776152E+00   # TP    decays
#          BR          NDA       ID1       ID2       ID3       ID4
      3.33333313E-01    3            2        -1         5             # TP     -->  UP     DB     BT          
      3.33333313E-01    3            4        -3         5             # TP     -->  CH     SB     BT          
      1.11111097E-01    3          -11        12         5             # TP     -->  E+     NUE    BT          
      1.11111097E-01    3          -13        14         5             # TP     -->  MU+    NUM    BT          
      1.11111097E-01    3          -15        16         5             # TP     -->  TAU+   NUT    BT          
#         PDG         Width
DECAY   1000021  5.26434755E+00   # GLSS  decays
#          BR          NDA       ID1       ID2       ID3       ID4
      8.49017283E-07    3      1000024         1        -2             # GLSS   -->  W1SS+  DN     UB          
      8.49017283E-07    3     -1000024         2        -1             # GLSS   -->  W1SS-  UP     DB          
      8.49017283E-07    3      1000024         3        -4             # GLSS   -->  W1SS+  ST     CB          
      8.49017283E-07    3     -1000024         4        -3             # GLSS   -->  W1SS-  CH     SB          
      1.57241302E-04    3      1000024         5        -6             # GLSS   -->  W1SS+  BT     TB          
      1.57241302E-04    3     -1000024         6        -5             # GLSS   -->  W1SS-  TP     BB          
      2.82449819E-05    3      1000037         1        -2             # GLSS   -->  W2SS+  DN     UB          
      2.82449819E-05    3     -1000037         2        -1             # GLSS   -->  W2SS-  UP     DB          
      2.82449819E-05    3      1000037         3        -4             # GLSS   -->  W2SS+  ST     CB          
      2.82449819E-05    3     -1000037         4        -3             # GLSS   -->  W2SS-  CH     SB          
      1.37442184E-04    3      1000037         5        -6             # GLSS   -->  W2SS+  BT     TB          
      1.37442184E-04    3     -1000037         6        -5             # GLSS   -->  W2SS-  TP     BB          
      2.84290650E-06    2      1000022        21                       # GLSS   -->  Z1SS   GL                 
      5.88952446E-07    3      1000022         2        -2             # GLSS   -->  Z1SS   UP     UB          
      6.95435801E-07    3      1000022         1        -1             # GLSS   -->  Z1SS   DN     DB          
      6.95435801E-07    3      1000022         3        -3             # GLSS   -->  Z1SS   ST     SB          
      5.88952162E-07    3      1000022         4        -4             # GLSS   -->  Z1SS   CH     CB          
      1.94553031E-05    3      1000022         5        -5             # GLSS   -->  Z1SS   BT     BB          
      1.33014415E-04    3      1000022         6        -6             # GLSS   -->  Z1SS   TP     TB          
      3.10695350E-06    2      1000023        21                       # GLSS   -->  Z2SS   GL                 
      5.95921357E-08    3      1000023         2        -2             # GLSS   -->  Z2SS   UP     UB          
      8.06679239E-08    3      1000023         1        -1             # GLSS   -->  Z2SS   DN     DB          
      8.06679239E-08    3      1000023         3        -3             # GLSS   -->  Z2SS   ST     SB          
      5.95921357E-08    3      1000023         4        -4             # GLSS   -->  Z2SS   CH     CB          
      1.63822733E-05    3      1000023         5        -5             # GLSS   -->  Z2SS   BT     BB          
      1.48150968E-04    3      1000023         6        -6             # GLSS   -->  Z2SS   TP     TB          
      3.39233153E-09    2      1000025        21                       # GLSS   -->  Z3SS   GL                 
      1.20697723E-05    3      1000025         2        -2             # GLSS   -->  Z3SS   UP     UB          
      3.58436046E-06    3      1000025         1        -1             # GLSS   -->  Z3SS   DN     DB          
      3.58436046E-06    3      1000025         3        -3             # GLSS   -->  Z3SS   ST     SB          
      1.20697696E-05    3      1000025         4        -4             # GLSS   -->  Z3SS   CH     CB          
      5.96692507E-06    3      1000025         5        -5             # GLSS   -->  Z3SS   BT     BB          
      9.73299302E-06    3      1000025         6        -6             # GLSS   -->  Z3SS   TP     TB          
      9.10153588E-08    2      1000035        21                       # GLSS   -->  Z4SS   GL                 
      1.36749668E-05    3      1000035         2        -2             # GLSS   -->  Z4SS   UP     UB          
      1.38504356E-05    3      1000035         1        -1             # GLSS   -->  Z4SS   DN     DB          
      1.38504356E-05    3      1000035         3        -3             # GLSS   -->  Z4SS   ST     SB          
      1.36749668E-05    3      1000035         4        -4             # GLSS   -->  Z4SS   CH     CB          
      6.59038269E-05    3      1000035         5        -5             # GLSS   -->  Z4SS   BT     BB          
      6.80279409E-05    3      1000035         6        -6             # GLSS   -->  Z4SS   TP     TB          
      4.99366164E-01    2     -1000006         6                       # GLSS   -->  TB1    TP                 
      4.99366164E-01    2      1000006        -6                       # GLSS   -->  TP1    TB                 
#         PDG         Width
DECAY   1000002  2.59636505E+02   # UPL   decays
#          BR          NDA       ID1       ID2       ID3       ID4
      5.68449206E-04    2      1000022         2                       # UPL    -->  Z1SS   UP                 
      1.77096255E-04    2      1000023         2                       # UPL    -->  Z2SS   UP                 
      4.11293190E-03    2      1000025         2                       # UPL    -->  Z3SS   UP                 
      7.87558854E-02    2      1000035         2                       # UPL    -->  Z4SS   UP                 
      7.54492402E-01    2      1000021         2                       # UPL    -->  GLSS   UP                 
      5.06967446E-03    2      1000024         1                       # UPL    -->  W1SS+  DN                 
      1.56823620E-01    2      1000037         1                       # UPL    -->  W2SS+  DN                 
#         PDG         Width
DECAY   1000001  2.59642090E+02   # DNL   decays
#          BR          NDA       ID1       ID2       ID3       ID4
      1.87348237E-03    2      1000022         1                       # DNL    -->  Z1SS   DN                 
      3.44899483E-04    2      1000023         1                       # DNL    -->  Z2SS   DN                 
      1.55988825E-03    2      1000025         1                       # DNL    -->  Z3SS   DN                 
      7.98261613E-02    2      1000035         1                       # DNL    -->  Z4SS   DN                 
      7.54624724E-01    2      1000021         1                       # DNL    -->  GLSS   DN                 
      7.41151336E-04    2     -1000024         2                       # DNL    -->  W1SS-  UP                 
      1.61029682E-01    2     -1000037         2                       # DNL    -->  W2SS-  UP                 
#         PDG         Width
DECAY   1000003  2.59642090E+02   # STL   decays
#          BR          NDA       ID1       ID2       ID3       ID4
      1.87348237E-03    2      1000022         3                       # STL    -->  Z1SS   ST                 
      3.44899483E-04    2      1000023         3                       # STL    -->  Z2SS   ST                 
      1.55988825E-03    2      1000025         3                       # STL    -->  Z3SS   ST                 
      7.98261613E-02    2      1000035         3                       # STL    -->  Z4SS   ST                 
      7.54624724E-01    2      1000021         3                       # STL    -->  GLSS   ST                 
      7.41151161E-04    2     -1000024         4                       # STL    -->  W1SS-  CH                 
      1.61029682E-01    2     -1000037         4                       # STL    -->  W2SS-  CH                 
#         PDG         Width
DECAY   1000004  2.59636505E+02   # CHL   decays
#          BR          NDA       ID1       ID2       ID3       ID4
      5.68449148E-04    2      1000022         4                       # CHL    -->  Z1SS   CH                 
      1.77096226E-04    2      1000023         4                       # CHL    -->  Z2SS   CH                 
      4.11293143E-03    2      1000025         4                       # CHL    -->  Z3SS   CH                 
      7.87558779E-02    2      1000035         4                       # CHL    -->  Z4SS   CH                 
      7.54492342E-01    2      1000021         4                       # CHL    -->  GLSS   CH                 
      5.06967446E-03    2      1000024         3                       # CHL    -->  W1SS+  ST                 
      1.56823620E-01    2      1000037         3                       # CHL    -->  W2SS+  ST                 
#         PDG         Width
DECAY   1000005  2.39842422E+02   # BT1   decays
#          BR          NDA       ID1       ID2       ID3       ID4
      7.39051774E-03    2      1000022         5                       # BT1    -->  Z1SS   BT                 
      5.97617775E-03    2      1000023         5                       # BT1    -->  Z2SS   BT                 
      1.28126389E-03    2      1000025         5                       # BT1    -->  Z3SS   BT                 
      5.88420220E-02    2      1000035         5                       # BT1    -->  Z4SS   BT                 
      4.02829766E-01    2      1000021         5                       # BT1    -->  GLSS   BT                 
      1.91756949E-01    2     -1000024         6                       # BT1    -->  W1SS-  TP                 
      1.24778345E-01    2     -1000037         6                       # BT1    -->  W2SS-  TP                 
      2.07034037E-01    2          -24   1000006                       # BT1    -->  W-     TP1                
      1.10916000E-04    2          -37   1000006                       # BT1    -->  H-     TP1                
#         PDG         Width
DECAY   1000006  4.28576775E+01   # TP1   decays
#          BR          NDA       ID1       ID2       ID3       ID4
      2.12280944E-01    2      1000022         6                       # TP1    -->  Z1SS   TP                 
      2.36040950E-01    2      1000023         6                       # TP1    -->  Z2SS   TP                 
      8.22999254E-02    2      1000025         6                       # TP1    -->  Z3SS   TP                 
      2.72384495E-03    2      1000035         6                       # TP1    -->  Z4SS   TP                 
      4.61157590E-01    2      1000024         5                       # TP1    -->  W1SS+  BT                 
      5.49673801E-03    2      1000037         5                       # TP1    -->  W2SS+  BT                 
#         PDG         Width
DECAY   2000002  2.16571930E+02   # UPR   decays
#          BR          NDA       ID1       ID2       ID3       ID4
      1.86268182E-03    2      1000022         2                       # UPR    -->  Z1SS   UP                 
      1.36526360E-04    2      1000023         2                       # UPR    -->  Z2SS   UP                 
      5.29509075E-02    2      1000025         2                       # UPR    -->  Z3SS   UP                 
      1.75483310E-05    2      1000035         2                       # UPR    -->  Z4SS   UP                 
      9.45032358E-01    2      1000021         2                       # UPR    -->  GLSS   UP                 
#         PDG         Width
DECAY   2000001  1.96901917E+02   # DNR   decays
#          BR          NDA       ID1       ID2       ID3       ID4
      4.95347718E-04    2      1000022         1                       # DNR    -->  Z1SS   DN                 
      3.63055806E-05    2      1000023         1                       # DNR    -->  Z2SS   DN                 
      1.40747717E-02    2      1000025         1                       # DNR    -->  Z3SS   DN                 
      4.65608673E-06    2      1000035         1                       # DNR    -->  Z4SS   DN                 
      9.85388875E-01    2      1000021         1                       # DNR    -->  GLSS   DN                 
#         PDG         Width
DECAY   2000003  1.96901917E+02   # STR   decays
#          BR          NDA       ID1       ID2       ID3       ID4
      4.95347718E-04    2      1000022         3                       # STR    -->  Z1SS   ST                 
      3.63055806E-05    2      1000023         3                       # STR    -->  Z2SS   ST                 
      1.40747717E-02    2      1000025         3                       # STR    -->  Z3SS   ST                 
      4.65608673E-06    2      1000035         3                       # STR    -->  Z4SS   ST                 
      9.85388875E-01    2      1000021         3                       # STR    -->  GLSS   ST                 
#         PDG         Width
DECAY   2000004  2.16571899E+02   # CHR   decays
#          BR          NDA       ID1       ID2       ID3       ID4
      1.86268205E-03    2      1000022         4                       # CHR    -->  Z1SS   CH                 
      1.36526374E-04    2      1000023         4                       # CHR    -->  Z2SS   CH                 
      5.29509187E-02    2      1000025         4                       # CHR    -->  Z3SS   CH                 
      1.75483328E-05    2      1000035         4                       # CHR    -->  Z4SS   CH                 
      9.45032358E-01    2      1000021         4                       # CHR    -->  GLSS   CH                 
#         PDG         Width
DECAY   2000005  2.27891235E+02   # BT2   decays
#          BR          NDA       ID1       ID2       ID3       ID4
      8.88085272E-03    2      1000022         5                       # BT2    -->  Z1SS   BT                 
      8.26348271E-03    2      1000023         5                       # BT2    -->  Z2SS   BT                 
      1.19243925E-02    2      1000025         5                       # BT2    -->  Z3SS   BT                 
      5.62495843E-05    2      1000035         5                       # BT2    -->  Z4SS   BT                 
      8.05601954E-01    2      1000021         5                       # BT2    -->  GLSS   BT                 
      1.67832691E-02    2     -1000024         6                       # BT2    -->  W1SS-  TP                 
      9.97728639E-05    2     -1000037         6                       # BT2    -->  W2SS-  TP                 
      9.33057436E-06    2          -24   1000006                       # BT2    -->  W-     TP1                
      4.42566816E-04    2          -24   2000006                       # BT2    -->  W-     TP2                
      2.14040614E-04    2           23   1000005                       # BT2    -->  Z0     BT1                
      4.65644291E-04    2           25   1000005                       # BT2    -->  HL0    BT1                
      3.61889377E-02    2           36   1000005                       # BT2    -->  HA0    BT1                
      3.58409360E-02    2           35   1000005                       # BT2    -->  HH0    BT1                
      2.42412571E-04    2          -37   1000006                       # BT2    -->  H-     TP1                
      7.49862418E-02    2          -37   2000006                       # BT2    -->  H-     TP2                
#         PDG         Width
DECAY   2000006  2.49543030E+02   # TP2   decays
#          BR          NDA       ID1       ID2       ID3       ID4
      3.73565942E-01    2      1000021         6                       # TP2    -->  GLSS   TP                 
      1.25711113E-02    2      1000024         5                       # TP2    -->  W1SS+  BT                 
      1.12729385E-01    2      1000037         5                       # TP2    -->  W2SS+  BT                 
      9.74496976E-02    2           23   1000006                       # TP2    -->  Z0     TP1                
      1.56714797E-01    2           25   1000006                       # TP2    -->  HL0    TP1                
      6.14841119E-05    2           35   1000006                       # TP2    -->  HH0    TP1                
      5.35165054E-05    2           36   1000006                       # TP2    -->  HA0    TP1                
      8.35577473E-02    2      1000022         6                       # TP2    -->  Z1SS   TP                 
      9.52239633E-02    2      1000023         6                       # TP2    -->  Z2SS   TP                 
      8.57710745E-03    2      1000025         6                       # TP2    -->  Z3SS   TP                 
      5.94952516E-02    2      1000035         6                       # TP2    -->  Z4SS   TP                 
#         PDG         Width
DECAY   1000011  6.86021881E+01   # EL-   decays
#          BR          NDA       ID1       ID2       ID3       ID4
      7.24716447E-05    2      1000022        11                       # EL-    -->  Z1SS   E-                 
      2.41967922E-04    2      1000023        11                       # EL-    -->  Z2SS   E-                 
      1.05196893E-01    2      1000025        11                       # EL-    -->  Z3SS   E-                 
      2.90248811E-01    2      1000035        11                       # EL-    -->  Z4SS   E-                 
      2.77059595E-03    2     -1000024        12                       # EL-    -->  W1SS-  NUE                
      6.01469278E-01    2     -1000037        12                       # EL-    -->  W2SS-  NUE                
#         PDG         Width
DECAY   1000013  6.86021881E+01   # MUL-  decays
#          BR          NDA       ID1       ID2       ID3       ID4
      7.24716447E-05    2      1000022        13                       # MUL-   -->  Z1SS   MU-                
      2.41967922E-04    2      1000023        13                       # MUL-   -->  Z2SS   MU-                
      1.05196893E-01    2      1000025        13                       # MUL-   -->  Z3SS   MU-                
      2.90248811E-01    2      1000035        13                       # MUL-   -->  Z4SS   MU-                
      2.77059595E-03    2     -1000024        14                       # MUL-   -->  W1SS-  NUM                
      6.01469278E-01    2     -1000037        14                       # MUL-   -->  W2SS-  NUM                
#         PDG         Width
DECAY   1000015  2.78284950E+01   # TAU1- decays
#          BR          NDA       ID1       ID2       ID3       ID4
      6.90323263E-02    2      1000022        15                       # TAU1-  -->  Z1SS   TAU-               
      4.03746963E-02    2      1000023        15                       # TAU1-  -->  Z2SS   TAU-               
      8.10916126E-01    2      1000025        15                       # TAU1-  -->  Z3SS   TAU-               
      3.09113209E-04    2      1000035        15                       # TAU1-  -->  Z4SS   TAU-               
      7.92879984E-02    2     -1000024        16                       # TAU1-  -->  W1SS-  NUT                
      7.97663670E-05    2     -1000037        16                       # TAU1-  -->  W2SS-  NUT                
#         PDG         Width
DECAY   1000012  6.86913223E+01   # NUEL  decays
#          BR          NDA       ID1       ID2       ID3       ID4
      1.47020286E-02    2      1000022        12                       # NUEL   -->  Z1SS   NUE                
      2.12283293E-03    2      1000023        12                       # NUEL   -->  Z2SS   NUE                
      7.65376016E-02    2      1000025        12                       # NUEL   -->  Z3SS   NUE                
      3.02051544E-01    2      1000035        12                       # NUEL   -->  Z4SS   NUE                
      1.89464241E-02    2      1000024        11                       # NUEL   -->  W1SS+  E-                 
      5.85639596E-01    2      1000037        11                       # NUEL   -->  W2SS+  E-                 
#         PDG         Width
DECAY   1000014  6.86913223E+01   # NUML  decays
#          BR          NDA       ID1       ID2       ID3       ID4
      1.47020286E-02    2      1000022        14                       # NUML   -->  Z1SS   NUM                
      2.12283293E-03    2      1000023        14                       # NUML   -->  Z2SS   NUM                
      7.65376016E-02    2      1000025        14                       # NUML   -->  Z3SS   NUM                
      3.02051544E-01    2      1000035        14                       # NUML   -->  Z4SS   NUM                
      1.89464241E-02    2      1000024        13                       # NUML   -->  W1SS+  MU-                
      5.85639596E-01    2      1000037        13                       # NUML   -->  W2SS+  MU-                
#         PDG         Width
DECAY   1000016  7.00147781E+01   # NUTL  decays
#          BR          NDA       ID1       ID2       ID3       ID4
      1.42109161E-02    2      1000022        16                       # NUTL   -->  Z1SS   NUT                
      2.05188803E-03    2      1000023        16                       # NUTL   -->  Z2SS   NUT                
      7.39645287E-02    2      1000025        16                       # NUTL   -->  Z3SS   NUT                
      2.91648418E-01    2      1000035        16                       # NUTL   -->  Z4SS   NUT                
      5.22610843E-02    2      1000024        15                       # NUTL   -->  W1SS+  TAU-               
      5.65638304E-01    2      1000037        15                       # NUTL   -->  W2SS+  TAU-               
      2.24899733E-04    2           24   1000015                       # NUTL   -->  W+     TAU1-              
#         PDG         Width
DECAY   2000011  2.42481174E+01   # ER-   decays
#          BR          NDA       ID1       ID2       ID3       ID4
      3.39349471E-02    2      1000022        11                       # ER-    -->  Z1SS   E-                 
      2.48701777E-03    2      1000023        11                       # ER-    -->  Z2SS   E-                 
      9.63260591E-01    2      1000025        11                       # ER-    -->  Z3SS   E-                 
      3.17432336E-04    2      1000035        11                       # ER-    -->  Z4SS   E-                 
#         PDG         Width
DECAY   2000013  2.42481174E+01   # MUR-  decays
#          BR          NDA       ID1       ID2       ID3       ID4
      3.39349471E-02    2      1000022        13                       # MUR-   -->  Z1SS   MU-                
      2.48701777E-03    2      1000023        13                       # MUR-   -->  Z2SS   MU-                
      9.63260591E-01    2      1000025        13                       # MUR-   -->  Z3SS   MU-                
      3.17432336E-04    2      1000035        13                       # MUR-   -->  Z4SS   MU-                
#         PDG         Width
DECAY   2000015  6.98940277E+01   # TAU2- decays
#          BR          NDA       ID1       ID2       ID3       ID4
      1.69753619E-02    2      1000022        15                       # TAU2-  -->  Z1SS   TAU-               
      1.68977939E-02    2      1000023        15                       # TAU2-  -->  Z2SS   TAU-               
      1.02081403E-01    2      1000025        15                       # TAU2-  -->  Z3SS   TAU-               
      2.80417383E-01    2      1000035        15                       # TAU2-  -->  Z4SS   TAU-               
      2.52496009E-03    2     -1000024        16                       # TAU2-  -->  W1SS-  NUT                
      5.80946505E-01    2     -1000037        16                       # TAU2-  -->  W2SS-  NUT                
      1.06367574E-04    2           23   1000015                       # TAU2-  -->  Z0     TAU1-              
      5.01637405E-05    2           25   1000015                       # TAU2-  -->  HL0    TAU1-              
#         PDG         Width
DECAY   1000023  1.25789393E-06   # Z2SS  decays
#          BR          NDA       ID1       ID2       ID3       ID4
      6.92758569E-03    2      1000022        22                       # Z2SS   -->  Z1SS   GM                 
      7.37760456E-06    3     -1000024         2        -1             # Z2SS   -->  W1SS-  UP     DB          
      2.45920160E-06    3     -1000024        12       -11             # Z2SS   -->  W1SS-  NUE    E+          
      2.45920160E-06    3     -1000024        14       -13             # Z2SS   -->  W1SS-  NUM    MU+         
      7.37760456E-06    3      1000024         1        -2             # Z2SS   -->  W1SS+  DN     UB          
      2.45920160E-06    3      1000024        11       -12             # Z2SS   -->  W1SS+  E-     ANUE        
      2.45920160E-06    3      1000024        13       -14             # Z2SS   -->  W1SS+  MU-    ANUM        
      1.29862145E-01    3      1000022         2        -2             # Z2SS   -->  Z1SS   UP     UB          
      1.67456582E-01    3      1000022         1        -1             # Z2SS   -->  Z1SS   DN     DB          
      1.67456582E-01    3      1000022         3        -3             # Z2SS   -->  Z1SS   ST     SB          
      1.29862145E-01    3      1000022         4        -4             # Z2SS   -->  Z1SS   CH     CB          
      6.27063736E-02    3      1000022         5        -5             # Z2SS   -->  Z1SS   BT     BB          
      3.79874222E-02    3      1000022        11       -11             # Z2SS   -->  Z1SS   E-     E+          
      3.79874222E-02    3      1000022        13       -13             # Z2SS   -->  Z1SS   MU-    MU+         
      3.29765454E-02    3      1000022        15       -15             # Z2SS   -->  Z1SS   TAU-   TAU+        
      7.55841434E-02    3      1000022        12       -12             # Z2SS   -->  Z1SS   NUE    ANUE        
      7.55841434E-02    3      1000022        14       -14             # Z2SS   -->  Z1SS   NUM    ANUM        
      7.55841658E-02    3      1000022        16       -16             # Z2SS   -->  Z1SS   NUT    ANUT        
#         PDG         Width
DECAY   1000025  4.35971588E-01   # Z3SS  decays
#          BR          NDA       ID1       ID2       ID3       ID4
      5.17048662E-08    2      1000022        22                       # Z3SS   -->  Z1SS   GM                 
      1.26394619E-08    2      1000023        22                       # Z3SS   -->  Z2SS   GM                 
      2.89927214E-01    2      1000024       -24                       # Z3SS   -->  W1SS+  W-                 
      2.89927214E-01    2     -1000024        24                       # Z3SS   -->  W1SS-  W+                 
      2.58593820E-02    2      1000022        23                       # Z3SS   -->  Z1SS   Z0                 
      1.95742041E-01    2      1000023        23                       # Z3SS   -->  Z2SS   Z0                 
      4.76431360E-11    3      1000022         2        -2             # Z3SS   -->  Z1SS   UP     UB          
      5.57047247E-12    3      1000022         1        -1             # Z3SS   -->  Z1SS   DN     DB          
      5.57047247E-12    3      1000022         3        -3             # Z3SS   -->  Z1SS   ST     SB          
      4.76431186E-11    3      1000022         4        -4             # Z3SS   -->  Z1SS   CH     CB          
      5.01831359E-08    3      1000022         5        -5             # Z3SS   -->  Z1SS   BT     BB          
      1.14456812E-10    3      1000022        11       -11             # Z3SS   -->  Z1SS   E-     E+          
      1.14456812E-10    3      1000022        13       -13             # Z3SS   -->  Z1SS   MU-    MU+         
      1.06866427E-08    3      1000022        15       -15             # Z3SS   -->  Z1SS   TAU-   TAU+        
      2.21230499E-11    3      1000022        12       -12             # Z3SS   -->  Z1SS   NUE    ANUE        
      2.21230499E-11    3      1000022        14       -14             # Z3SS   -->  Z1SS   NUM    ANUM        
      2.34771907E-11    3      1000022        16       -16             # Z3SS   -->  Z1SS   NUT    ANUT        
      9.36771602E-13    3      1000023         2        -2             # Z3SS   -->  Z2SS   UP     UB          
      1.58031506E-13    3      1000023         1        -1             # Z3SS   -->  Z2SS   DN     DB          
      1.58031506E-13    3      1000023         3        -3             # Z3SS   -->  Z2SS   ST     SB          
      9.36771277E-13    3      1000023         4        -4             # Z3SS   -->  Z2SS   CH     CB          
      3.78132796E-08    3      1000023         5        -5             # Z3SS   -->  Z2SS   BT     BB          
      2.11663586E-12    3      1000023        11       -11             # Z3SS   -->  Z2SS   E-     E+          
      2.11663586E-12    3      1000023        13       -13             # Z3SS   -->  Z2SS   MU-    MU+         
      7.92878918E-09    3      1000023        15       -15             # Z3SS   -->  Z2SS   TAU-   TAU+        
      7.61368616E-13    3      1000023        12       -12             # Z3SS   -->  Z2SS   NUE    ANUE        
      7.61368616E-13    3      1000023        14       -14             # Z3SS   -->  Z2SS   NUM    ANUM        
      8.07987845E-13    3      1000023        16       -16             # Z3SS   -->  Z2SS   NUT    ANUT        
      1.94220111E-01    2      1000022        25                       # Z3SS   -->  Z1SS   HL0                
      4.32388904E-03    2      1000023        25                       # Z3SS   -->  Z2SS   HL0                
#         PDG         Width
DECAY   1000035  5.68127108E+00   # Z4SS  decays
#          BR          NDA       ID1       ID2       ID3       ID4
      1.55424107E-06    2      1000022        22                       # Z4SS   -->  Z1SS   GM                 
      2.94747360E-06    2      1000023        22                       # Z4SS   -->  Z2SS   GM                 
      9.29125648E-08    2      1000025        22                       # Z4SS   -->  Z3SS   GM                 
      2.46759236E-01    2      1000024       -24                       # Z4SS   -->  W1SS+  W-                 
      2.46759236E-01    2     -1000024        24                       # Z4SS   -->  W1SS-  W+                 
      5.56504745E-08    3     -1000037         2        -1             # Z4SS   -->  W2SS-  UP     DB          
      1.85501570E-08    3     -1000037        12       -11             # Z4SS   -->  W2SS-  NUE    E+          
      1.85501570E-08    3     -1000037        14       -13             # Z4SS   -->  W2SS-  NUM    MU+         
      5.56504745E-08    3      1000037         1        -2             # Z4SS   -->  W2SS+  DN     UB          
      1.85501570E-08    3      1000037        11       -12             # Z4SS   -->  W2SS+  E-     ANUE        
      1.85501570E-08    3      1000037        13       -14             # Z4SS   -->  W2SS+  MU-    ANUM        
      5.56504745E-08    3     -1000037         4        -3             # Z4SS   -->  W2SS-  CH     SB          
      1.85501570E-08    3     -1000037        16       -15             # Z4SS   -->  W2SS-  NUT    TAU+        
      5.56504745E-08    3      1000037         3        -4             # Z4SS   -->  W2SS+  ST     CB          
      1.85501570E-08    3      1000037        15       -16             # Z4SS   -->  W2SS+  TAU-   ANUT        
      4.05573025E-02    2      1000022        23                       # Z4SS   -->  Z1SS   Z0                 
      2.22547412E-01    2      1000023        23                       # Z4SS   -->  Z2SS   Z0                 
      2.00567930E-03    2      1000025        23                       # Z4SS   -->  Z3SS   Z0                 
      3.14559045E-10    3      1000022         2        -2             # Z4SS   -->  Z1SS   UP     UB          
      1.04963027E-09    3      1000022         1        -1             # Z4SS   -->  Z1SS   DN     DB          
      1.04963027E-09    3      1000022         3        -3             # Z4SS   -->  Z1SS   ST     SB          
      3.14559045E-10    3      1000022         4        -4             # Z4SS   -->  Z1SS   CH     CB          
      2.87714852E-06    3      1000022         5        -5             # Z4SS   -->  Z1SS   BT     BB          
      4.04149283E-12    3      1000022        11       -11             # Z4SS   -->  Z1SS   E-     E+          
      4.04149283E-12    3      1000022        13       -13             # Z4SS   -->  Z1SS   MU-    MU+         
      5.65817913E-07    3      1000022        15       -15             # Z4SS   -->  Z1SS   TAU-   TAU+        
      7.79514009E-10    3      1000022        12       -12             # Z4SS   -->  Z1SS   NUE    ANUE        
      7.79514009E-10    3      1000022        14       -14             # Z4SS   -->  Z1SS   NUM    ANUM        
      8.27502566E-10    3      1000022        16       -16             # Z4SS   -->  Z1SS   NUT    ANUT        
      4.16897489E-11    3      1000023         2        -2             # Z4SS   -->  Z2SS   UP     UB          
      8.22296536E-11    3      1000023         1        -1             # Z4SS   -->  Z2SS   DN     DB          
      8.22296536E-11    3      1000023         3        -3             # Z4SS   -->  Z2SS   ST     SB          
      4.16897489E-11    3      1000023         4        -4             # Z4SS   -->  Z2SS   CH     CB          
      2.59867193E-06    3      1000023         5        -5             # Z4SS   -->  Z2SS   BT     BB          
      5.27303288E-12    3      1000023        11       -11             # Z4SS   -->  Z2SS   E-     E+          
      5.27303288E-12    3      1000023        13       -13             # Z4SS   -->  Z2SS   MU-    MU+         
      5.11894086E-07    3      1000023        15       -15             # Z4SS   -->  Z2SS   TAU-   TAU+        
      4.79013079E-11    3      1000023        12       -12             # Z4SS   -->  Z2SS   NUE    ANUE        
      4.79013079E-11    3      1000023        14       -14             # Z4SS   -->  Z2SS   NUM    ANUM        
      5.08546018E-11    3      1000023        16       -16             # Z4SS   -->  Z2SS   NUT    ANUT        
      5.98032901E-10    3      1000025         2        -2             # Z4SS   -->  Z3SS   UP     UB          
      2.29418526E-10    3      1000025         1        -1             # Z4SS   -->  Z3SS   DN     DB          
      2.29418526E-10    3      1000025         3        -3             # Z4SS   -->  Z3SS   ST     SB          
      5.98032901E-10    3      1000025         4        -4             # Z4SS   -->  Z3SS   CH     CB          
      1.58449556E-08    3      1000025         5        -5             # Z4SS   -->  Z3SS   BT     BB          
      1.41376144E-09    3      1000025        11       -11             # Z4SS   -->  Z3SS   E-     E+          
      1.41376144E-09    3      1000025        13       -13             # Z4SS   -->  Z3SS   MU-    MU+         
      4.45126558E-09    3      1000025        15       -15             # Z4SS   -->  Z3SS   TAU-   TAU+        
      1.06527864E-09    3      1000025        12       -12             # Z4SS   -->  Z3SS   NUE    ANUE        
      1.06527864E-09    3      1000025        14       -14             # Z4SS   -->  Z3SS   NUM    ANUM        
      1.13104692E-09    3      1000025        16       -16             # Z4SS   -->  Z3SS   NUT    ANUT        
      1.75435707E-01    2      1000022        25                       # Z4SS   -->  Z1SS   HL0                
      4.49094623E-02    2      1000023        25                       # Z4SS   -->  Z2SS   HL0                
      2.10146997E-02    2      1000025        25                       # Z4SS   -->  Z3SS   HL0                
#         PDG         Width
DECAY   1000024  1.00126715E-06   # W1SS+ decays
#          BR          NDA       ID1       ID2       ID3       ID4
      3.33332330E-01    3      1000022         2        -1             # W1SS+  -->  Z1SS   UP     DB          
      3.33332330E-01    3      1000022         4        -3             # W1SS+  -->  Z1SS   CH     SB          
      1.11111127E-01    3      1000022       -11        12             # W1SS+  -->  Z1SS   E+     NUE         
      1.11111127E-01    3      1000022       -13        14             # W1SS+  -->  Z1SS   MU+    NUM         
      1.11113146E-01    3      1000022       -15        16             # W1SS+  -->  Z1SS   TAU+   NUT         
#         PDG         Width
DECAY   1000037  5.56802368E+00   # W2SS+ decays
#          BR          NDA       ID1       ID2       ID3       ID4
      6.59461874E-10    3      1000022         2        -1             # W2SS+  -->  Z1SS   UP     DB          
      6.59461874E-10    3      1000022         4        -3             # W2SS+  -->  Z1SS   CH     SB          
      4.93014185E-10    3      1000022       -11        12             # W2SS+  -->  Z1SS   E+     NUE         
      4.93014185E-10    3      1000022       -13        14             # W2SS+  -->  Z1SS   MU+    NUM         
      5.35563970E-07    3      1000022       -15        16             # W2SS+  -->  Z1SS   TAU+   NUT         
      2.32683718E-01    2      1000022        24                       # W2SS+  -->  Z1SS   W+                 
      2.43336212E-10    3      1000023         2        -1             # W2SS+  -->  Z2SS   UP     DB          
      2.43336212E-10    3      1000023         4        -3             # W2SS+  -->  Z2SS   CH     SB          
      9.23006740E-11    3      1000023       -11        12             # W2SS+  -->  Z2SS   E+     NUE         
      9.23006740E-11    3      1000023       -13        14             # W2SS+  -->  Z2SS   MU+    NUM         
      4.49805128E-07    3      1000023       -15        16             # W2SS+  -->  Z2SS   TAU+   NUT         
      2.51024514E-01    2      1000023        24                       # W2SS+  -->  Z2SS   W+                 
      7.00605018E-10    3      1000025         2        -1             # W2SS+  -->  Z3SS   UP     DB          
      7.00605018E-10    3      1000025         4        -3             # W2SS+  -->  Z3SS   CH     SB          
      2.17642304E-09    3      1000025       -11        12             # W2SS+  -->  Z3SS   E+     NUE         
      2.17642304E-09    3      1000025       -13        14             # W2SS+  -->  Z3SS   MU+    NUM         
      5.05025621E-09    3      1000025       -15        16             # W2SS+  -->  Z3SS   TAU+   NUT         
      2.65736934E-02    2      1000025        24                       # W2SS+  -->  Z3SS   W+                 
      2.43151590E-01    2      1000024        23                       # W2SS+  -->  W1SS+  Z0                 
      1.74318004E-09    3      1000024         1        -1             # W2SS+  -->  W1SS+  DN     DB          
      1.74318004E-09    3      1000024         3        -3             # W2SS+  -->  W1SS+  ST     SB          
      2.61492994E-10    3      1000024         2        -2             # W2SS+  -->  W1SS+  UP     UB          
      2.61492994E-10    3      1000024         4        -4             # W2SS+  -->  W1SS+  CH     CB          
      9.15946971E-11    3      1000024        12       -12             # W2SS+  -->  W1SS+  NUE    ANUE        
      9.15946971E-11    3      1000024        14       -14             # W2SS+  -->  W1SS+  NUM    ANUM        
      1.32949096E-10    3      1000024        16       -16             # W2SS+  -->  W1SS+  NUT    ANUT        
      6.08039508E-10    3      1000024        11       -11             # W2SS+  -->  W1SS+  E-     E+          
      6.08039508E-10    3      1000024        13       -13             # W2SS+  -->  W1SS+  MU-    MU+         
      6.45484610E-10    3      1000024        15       -15             # W2SS+  -->  W1SS+  TAU-   TAU+        
      2.46565446E-01    2      1000024        25                       # W2SS+  -->  W1SS+  HL0                
#         PDG         Width
DECAY        25  3.86503083E-03   # HL0   decays
#          BR          NDA       ID1       ID2       ID3       ID4
      5.73567460E-09    2           11       -11                       # HL0    -->  E-     E+                 
      2.42169510E-04    2           13       -13                       # HL0    -->  MU-    MU+                
      6.92767277E-02    2           15       -15                       # HL0    -->  TAU-   TAU+               
      7.19027639E-06    2            1        -1                       # HL0    -->  DN     DB                 
      2.90523237E-03    2            3        -3                       # HL0    -->  ST     SB                 
      6.22448564E-01    2            5        -5                       # HL0    -->  BT     BB                 
      2.19712865E-06    2            2        -2                       # HL0    -->  UP     UB                 
      4.08570841E-02    2            4        -4                       # HL0    -->  CH     CB                 
      2.67296587E-03    2           22        22                       # HL0    -->  GM     GM                 
      5.26494347E-02    2           21        21                       # HL0    -->  GL     GL                 
      1.04569662E-02    3           24        11       -12             # HL0    -->  W+     E-     ANUE        
      1.04569662E-02    3           24        13       -14             # HL0    -->  W+     MU-    ANUM        
      1.04569662E-02    3           24        15       -16             # HL0    -->  W+     TAU-   ANUT        
      3.13708968E-02    3           24        -2         1             # HL0    -->  W+     UB     DN          
      3.13708968E-02    3           24        -4         3             # HL0    -->  W+     CB     ST          
      1.04569662E-02    3          -24       -11        12             # HL0    -->  W-     E+     NUE         
      1.04569662E-02    3          -24       -13        14             # HL0    -->  W-     MU+    NUM         
      1.04569662E-02    3          -24       -15        16             # HL0    -->  W-     TAU+   NUT         
      3.13708968E-02    3          -24         2        -1             # HL0    -->  W-     UP     DB          
      3.13708968E-02    3          -24         4        -3             # HL0    -->  W-     CH     SB          
      1.41654024E-03    3           23        12       -12             # HL0    -->  Z0     NUE    ANUE        
      1.41654024E-03    3           23        14       -14             # HL0    -->  Z0     NUM    ANUM        
      1.41654024E-03    3           23        16       -16             # HL0    -->  Z0     NUT    ANUT        
      7.12930458E-04    3           23        11       -11             # HL0    -->  Z0     E-     E+          
      7.12930458E-04    3           23        13       -13             # HL0    -->  Z0     MU-    MU+         
      7.12930458E-04    3           23        15       -15             # HL0    -->  Z0     TAU-   TAU+        
      2.44243932E-03    3           23         2        -2             # HL0    -->  Z0     UP     UB          
      2.44243932E-03    3           23         4        -4             # HL0    -->  Z0     CH     CB          
      3.14646354E-03    3           23         1        -1             # HL0    -->  Z0     DN     DB          
      3.14646354E-03    3           23         3        -3             # HL0    -->  Z0     ST     SB          
      3.14646354E-03    3           23         5        -5             # HL0    -->  Z0     BT     BB          
#         PDG         Width
DECAY        35  7.16856670E+00   # HH0   decays
#          BR          NDA       ID1       ID2       ID3       ID4
      5.36831291E-09    2           11       -11                       # HH0    -->  E-     E+                 
      2.26659831E-04    2           13       -13                       # HH0    -->  MU-    MU+                
      6.49176389E-02    2           15       -15                       # HH0    -->  TAU-   TAU+               
      6.57620740E-06    2            1        -1                       # HH0    -->  DN     DB                 
      2.65712058E-03    2            3        -3                       # HH0    -->  ST     SB                 
      3.97766620E-01    2            5        -5                       # HH0    -->  BT     BB                 
      4.35224252E-11    2            2        -2                       # HH0    -->  UP     UB                 
      6.12926044E-07    2            4        -4                       # HH0    -->  CH     CB                 
      2.79602129E-02    2            6        -6                       # HH0    -->  TP     TB                 
      2.82727228E-07    2           22        22                       # HH0    -->  GM     GM                 
      1.34689672E-05    2           21        21                       # HH0    -->  GL     GL                 
      1.06451342E-04    2           24       -24                       # HH0    -->  W+     W-                 
      5.40470573E-05    2           23        23                       # HH0    -->  Z0     Z0                 
      1.92206707E-02    2      1000022   1000022                       # HH0    -->  Z1SS   Z1SS               
      6.17828220E-03    2      1000022   1000023                       # HH0    -->  Z1SS   Z2SS               
      3.24162319E-02    2      1000022   1000025                       # HH0    -->  Z1SS   Z3SS               
      2.07503736E-02    2      1000022   1000035                       # HH0    -->  Z1SS   Z4SS               
      3.34187620E-03    2      1000023   1000023                       # HH0    -->  Z2SS   Z2SS               
      6.64276183E-02    2      1000023   1000025                       # HH0    -->  Z2SS   Z3SS               
      9.23044458E-02    2      1000023   1000035                       # HH0    -->  Z2SS   Z4SS               
      6.97355135E-04    2      1000025   1000025                       # HH0    -->  Z3SS   Z3SS               
      2.54919510E-02    2      1000024  -1000024                       # HH0    -->  W1SS+  W1SS-              
      1.19543530E-01    2      1000024  -1000037                       # HH0    -->  W1SS+  W2SS-              
      1.19543530E-01    2     -1000024   1000037                       # HH0    -->  W1SS-  W2SS+              
      3.74368712E-04    2           25        25                       # HH0    -->  HL0    HL0                
#         PDG         Width
DECAY        36  7.03462982E+00   # HA0   decays
#          BR          NDA       ID1       ID2       ID3       ID4
      5.43543077E-09    2           11       -11                       # HA0    -->  E-     E+                 
      2.29493700E-04    2           13       -13                       # HA0    -->  MU-    MU+                
      6.57301024E-02    2           15       -15                       # HA0    -->  TAU-   TAU+               
      6.65879452E-06    2            1        -1                       # HA0    -->  DN     DB                 
      2.69049010E-03    2            3        -3                       # HA0    -->  ST     SB                 
      4.02780026E-01    2            5        -5                       # HA0    -->  BT     BB                 
      4.20859840E-11    2            2        -2                       # HA0    -->  UP     UB                 
      5.93163008E-07    2            4        -4                       # HA0    -->  CH     CB                 
      3.00551318E-02    2            6        -6                       # HA0    -->  TP     TB                 
      3.14333910E-08    2           22        22                       # HA0    -->  GM     GM                 
      4.31393346E-05    2           21        21                       # HA0    -->  GL     GL                 
      2.93987244E-02    2      1000022   1000022                       # HA0    -->  Z1SS   Z1SS               
      2.83318898E-03    2      1000022   1000023                       # HA0    -->  Z1SS   Z2SS               
      5.83587326E-02    2      1000022   1000025                       # HA0    -->  Z1SS   Z3SS               
      9.27707180E-02    2      1000022   1000035                       # HA0    -->  Z1SS   Z4SS               
      3.10053001E-03    2      1000023   1000023                       # HA0    -->  Z2SS   Z2SS               
      3.54983769E-02    2      1000023   1000025                       # HA0    -->  Z2SS   Z3SS               
      1.51516441E-02    2      1000023   1000035                       # HA0    -->  Z2SS   Z4SS               
      2.30433536E-03    2      1000025   1000025                       # HA0    -->  Z3SS   Z3SS               
      3.43955755E-02    2      1000024  -1000024                       # HA0    -->  W1SS+  W1SS-              
      1.12274237E-01    2      1000024  -1000037                       # HA0    -->  W1SS+  W2SS-              
      1.12274237E-01    2     -1000024   1000037                       # HA0    -->  W1SS-  W2SS+              
      1.04045328E-04    2           25        23                       # HA0    -->  HL0    Z0                 
#         PDG         Width
DECAY        37  6.58576155E+00   # H+    decays
#          BR          NDA       ID1       ID2       ID3       ID4
      5.82464121E-09    2           12       -11                       # H+     -->  NUE    E+                 
      2.45926873E-04    2           14       -13                       # H+     -->  NUM    MU+                
      7.04367831E-02    2           16       -15                       # H+     -->  NUT    TAU+               
      6.55876102E-06    2            2        -1                       # H+     -->  UP     DB                 
      2.65062880E-03    2            4        -3                       # H+     -->  CH     SB                 
      4.01713967E-01    2            6        -5                       # H+     -->  TP     BB                 
      1.53513311E-03    2      1000024   1000022                       # H+     -->  W1SS+  Z1SS               
      4.77046706E-03    2      1000024   1000023                       # H+     -->  W1SS+  Z2SS               
      1.43538833E-01    2      1000024   1000025                       # H+     -->  W1SS+  Z3SS               
      1.14131309E-01    2      1000024   1000035                       # H+     -->  W1SS+  Z4SS               
      1.37182429E-01    2      1000037   1000022                       # H+     -->  W2SS+  Z1SS               
      1.23676449E-01    2      1000037   1000023                       # H+     -->  W2SS+  Z2SS               
      1.11453199E-04    2           25        24                       # H+     -->  HL0    W+                 
