#
#                              ======================
#                              | THE SUSYHIT OUTPUT |
#                              ======================
#
#
#              ------------------------------------------------------
#              |     This is the output of the SUSY-HIT package     |
#              |  created by A.Djouadi, M.Muehlleitner and M.Spira. |
#              |  In case of problems with SUSY-HIT email to        |
#              |           margarete.muehlleitner@kit.edu           |
#              |           michael.spira@psi.ch                     |
#              |           abdelhak.djouadi@cern.ch                 |
#              ------------------------------------------------------
#
#              ------------------------------------------------------
#              |  SUSY Les Houches Accord - MSSM Spectrum + Decays  |
#              |              based on the decay programs           |
#              |                                                    |
#              |                     SDECAY 1.5                     |
#              |                                                    |
#              |  Authors: M.Muhlleitner, A.Djouadi and Y.Mambrini  |
#              |  Ref.:    Comput.Phys.Commun.168(2005)46           |
#              |           [hep-ph/0311167]                         |
#              |                                                    |
#              |                     HDECAY 3.4                     |
#              |                                                    |
#              |  By: A.Djouadi,J.Kalinowski,M.Muhlleitner,M.Spira  |
#              |  Ref.:    Comput.Phys.Commun.108(1998)56           |
#              |           [hep-ph/9704448]                         |
#              |                                                    |
#              |                                                    |
#              |  If not stated otherwise all DRbar couplings and   |
#              |  soft SUSY breaking masses are given at the scale  |
#              |  Q=  0.38491434E+04
#              |                                                    |
#              ------------------------------------------------------
#
#
BLOCK DCINFO  # Decay Program information
     1   SDECAY/HDECAY # decay calculator
     2   1.5  /3.4    # version number
#
BLOCK SPINFO  # Spectrum calculator information
     1   SuSpect     # RGE +Spectrum calculator            
     2   2.41        # version number                      
#
BLOCK MODSEL  # Model selection
     1     3   # #AMSB                                             
#
BLOCK SMINPUTS  # Standard Model inputs
         1     1.27934000E+02   # alpha_em^-1(M_Z)^MSbar
         2     1.16639000E-05   # G_F [GeV^-2]
         3     1.17200000E-01   # alpha_S(M_Z)^MSbar
         4     9.11870000E+01   # M_Z pole mass
         5     4.25000000E+00   # mb(mb)^MSbar
         6     1.73100000E+02   # mt pole mass
         7     1.77710000E+00   # mtau pole mass
#
BLOCK MINPAR  # Input parameters - minimal models
         1     5.00000000E+03   # m0                  
         2     1.25000000E+05   # M_3                 
         3     5.00000000E+00   # tanbeta(mZ)         
         4     1.00000000E+00   # sign(mu)            
         5     1.00000000E+00   # cQ                  
         6     1.00000000E+00   # cuR                 
#
BLOCK EXTPAR  # Input parameters - non-minimal models
         0     3.84914339E+03   # EWSB                
#
BLOCK MASS  # Mass Spectrum
# PDG code           mass       particle
        24     8.04889501E+01   # W+
        25     1.18257016E+02   # h
        35     5.48922780E+03   # H
        36     5.48903750E+03   # A
        37     5.48994171E+03   # H+
         5     4.87877839E+00   # b-quark pole mass calculated from mb(mb)_Msbar
   1000001     1.00000000E+10   # ~d_L
   2000001     1.00000000E+10   # ~d_R 
   1000002     1.00000000E+10   # ~u_L 
   2000002     1.00000000E+10   # ~u_R 
   1000003     1.00000000E+10   # ~s_L 
   2000003     1.00000000E+10   # ~s_R 
   1000004     1.00000000E+10   # ~c_L 
   2000004     1.00000000E+10   # ~c_R 
   1000005     1.00000000E+10   # ~b_1 
   2000005     1.00000000E+10   # ~b_2 
   1000006     1.00000000E+10   # ~t_1 
   2000006     1.00000000E+10   # ~t_2 
   1000011     1.00000000E+10   # ~e_L 
   2000011     1.00000000E+10   # ~e_R 
   1000012     1.00000000E+10   # ~nu_eL 
   1000013     1.00000000E+10   # ~mu_L 
   2000013     1.00000000E+10   # ~mu_R 
   1000014     1.00000000E+10   # ~nu_muL 
   1000015     1.00000000E+10   # ~tau_1 
   2000015     1.00000000E+10   # ~tau_2 
   1000016     1.00000000E+10   # ~nu_tauL 
   1000021     1.00000000E+10   # ~g 
   1000022     4.11075160E+02   # ~chi_10
   1000023     1.00000000E+10   # ~chi_20 
   1000025     1.00000000E+10   # ~chi_30 
   1000035     1.00000000E+10   # ~chi_40 
   1000024     4.11076769E+02   # ~chi_1+
   1000037     1.00000000E+10   # ~chi_2+ 
#
BLOCK NMIX  # Neutralino Mixing Matrix
  1  1     1.29850553E-03   # N_11
  1  2    -9.99156625E-01   # N_12
  1  3     3.82676232E-02   # N_13
  1  4    -1.48304083E-02   # N_14
  2  1     9.99234771E-01   # N_21
  2  2     2.85927080E-03   # N_22
  2  3     3.22345911E-02   # N_23
  2  4    -2.19688034E-02   # N_24
  3  1     7.29870294E-03   # N_31
  3  2    -1.65625771E-02   # N_32
  3  3    -7.06768461E-01   # N_33
  3  4    -7.07213371E-01   # N_34
  4  1     3.84046281E-02   # N_41
  4  2    -3.74638987E-02   # N_42
  4  3    -7.05673340E-01   # N_43
  4  4     7.06503134E-01   # N_44
#
BLOCK UMIX  # Chargino Mixing Matrix U
  1  1    -9.98538364E-01   # U_11
  1  2     5.40475327E-02   # U_12
  2  1     5.40475327E-02   # U_21
  2  2     9.98538364E-01   # U_22
#
BLOCK VMIX  # Chargino Mixing Matrix V
  1  1    -9.99780347E-01   # V_11
  1  2     2.09584960E-02   # V_12
  2  1     2.09584960E-02   # V_21
  2  2     9.99780347E-01   # V_22
#
BLOCK STOPMIX  # Stop Mixing Matrix
  1  1    -2.68466366E-02   # cos(theta_t)
  1  2     9.99639564E-01   # sin(theta_t)
  2  1    -9.99639564E-01   # -sin(theta_t)
  2  2    -2.68466366E-02   # cos(theta_t)
#
BLOCK SBOTMIX  # Sbottom Mixing Matrix
  1  1     9.99999023E-01   # cos(theta_b)
  1  2     1.39785516E-03   # sin(theta_b)
  2  1    -1.39785516E-03   # -sin(theta_b)
  2  2     9.99999023E-01   # cos(theta_b)
#
BLOCK STAUMIX  # Stau Mixing Matrix
  1  1     9.29097217E-01   # cos(theta_tau)
  1  2     3.69835587E-01   # sin(theta_tau)
  2  1    -3.69835587E-01   # -sin(theta_tau)
  2  2     9.29097217E-01   # cos(theta_tau)
#
BLOCK ALPHA  # Higgs mixing
          -2.08386324E-01   # Mixing angle in the neutral Higgs boson sector
#
BLOCK HMIX Q=  3.84914339E+03  # DRbar Higgs Parameters
         1     2.12239967E+03   # mu(Q)               
         2     4.73276682E+00   # tanbeta(Q)          
         3     2.43246851E+02   # vev(Q)              
         4     3.01753932E+07   # MA^2(Q)             
#
BLOCK GAUGE Q=  3.84914339E+03  # The gauge couplings
     1     3.64992783E-01   # gprime(Q) DRbar
     2     6.37457807E-01   # g(Q) DRbar
     3     9.99156172E-01   # g3(Q) DRbar
#
BLOCK AU Q=  3.84914339E+03  # The trilinear couplings
  1  1     4.16114954E+03   # A_u(Q) DRbar
  2  2     4.16114954E+03   # A_c(Q) DRbar
  3  3     1.97419659E+03   # A_t(Q) DRbar
#
BLOCK AD Q=  3.84914339E+03  # The trilinear couplings
  1  1     4.69794700E+03   # A_d(Q) DRbar
  2  2     4.69794700E+03   # A_s(Q) DRbar
  3  3     4.69002780E+03   # A_b(Q) DRbar
#
BLOCK AE Q=  3.84914339E+03  # The trilinear couplings
  1  1     1.25814026E+03   # A_e(Q) DRbar
  2  2     1.25814026E+03   # A_mu(Q) DRbar
  3  3     1.25237009E+03   # A_tau(Q) DRbar
#
BLOCK Yu Q=  3.84914339E+03  # The Yukawa couplings
  1  1     0.00000000E+00   # y_u(Q) DRbar
  2  2     0.00000000E+00   # y_c(Q) DRbar
  3  3     8.36560508E-01   # y_t(Q) DRbar
#
BLOCK Yd Q=  3.84914339E+03  # The Yukawa couplings
  1  1     0.00000000E+00   # y_d(Q) DRbar
  2  2     0.00000000E+00   # y_s(Q) DRbar
  3  3     6.67945998E-02   # y_b(Q) DRbar
#
BLOCK Ye Q=  3.84914339E+03  # The Yukawa couplings
  1  1     0.00000000E+00   # y_e(Q) DRbar
  2  2     0.00000000E+00   # y_mu(Q) DRbar
  3  3     4.91699873E-02   # y_tau(Q) DRbar
#
BLOCK MSOFT Q=  3.84914339E+03  # The soft SUSY breaking masses at the scale Q
         1     1.17987324E+03   # M_1                 
         2     3.83349953E+02   # M_2                 
         3    -2.29412018E+03   # M_3                 
        21     2.42659611E+07   # M^2_Hd              
        22    -2.91149218E+06   # M^2_Hu              
        31     4.95238201E+03   # M_eL                
        32     4.95238201E+03   # M_muL               
        33     4.94718783E+03   # M_tauL              
        34     4.96089966E+03   # M_eR                
        35     4.96089966E+03   # M_muR               
        36     4.95047596E+03   # M_tauR              
        41     5.35145092E+03   # M_q1L               
        42     5.35145092E+03   # M_q2L               
        43     4.44673984E+03   # M_q3L               
        44     5.37437664E+03   # M_uR                
        45     5.37437664E+03   # M_cR                
        46     3.32794911E+03   # M_tR                
        47     5.38608759E+03   # M_dR                
        48     5.38608759E+03   # M_sR                
        49     5.37343809E+03   # M_bR                
#
#
#
#                             =================
#                             |The decay table|
#                             =================
#
# - The QCD corrections to the decays gluino -> squark  + quark
#                                     squark -> gaugino + quark_prime
#                                     squark -> squark_prime + Higgs
#                                     squark -> gluino  + quark
#   are included.
#
# - The multi-body decays for the inos, stops and sbottoms are included.
#
# - The loop induced decays for the gluino, neutralinos and stops
#   are included.
#
# - The SUSY decays of the top quark are included.
#
#
#         PDG            Width
DECAY         6     1.42383899E+00   # top decays
#          BR         NDA      ID1       ID2
     1.00000000E+00    2           5        24   # BR(t ->  b    W+)
#
#         PDG            Width
DECAY   1000021     2.04764460E-03   # gluino decays
#          BR         NDA      ID1       ID2
     5.68953056E-06    2     1000022        21   # BR(~g -> ~chi_10 g)
     4.37135266E-06    2     1000023        21   # BR(~g -> ~chi_20 g)
#           BR         NDA      ID1       ID2       ID3
     4.06358718E-02    3     1000022         1        -1   # BR(~g -> ~chi_10 d  db)
     8.59533918E-04    3     1000023         1        -1   # BR(~g -> ~chi_20 d  db)
     4.06119850E-02    3     1000022         2        -2   # BR(~g -> ~chi_10 u  ub)
     2.96055571E-03    3     1000023         2        -2   # BR(~g -> ~chi_20 u  ub)
     4.06358718E-02    3     1000022         3        -3   # BR(~g -> ~chi_10 s  sb)
     8.59533918E-04    3     1000023         3        -3   # BR(~g -> ~chi_20 s  sb)
     4.06119850E-02    3     1000022         4        -4   # BR(~g -> ~chi_10 c  cb)
     2.96055571E-03    3     1000023         4        -4   # BR(~g -> ~chi_20 c  cb)
     8.91456784E-02    3     1000022         5        -5   # BR(~g -> ~chi_10 b  bb)
     1.08232019E-03    3     1000023         5        -5   # BR(~g -> ~chi_20 b  bb)
     7.38077688E-02    3     1000022         6        -6   # BR(~g -> ~chi_10 t  tb)
     1.40877387E-02    3     1000023         6        -6   # BR(~g -> ~chi_20 t  tb)
     8.12481457E-02    3     1000024         1        -2   # BR(~g -> ~chi_1+ d  ub)
     8.12481457E-02    3    -1000024         2        -1   # BR(~g -> ~chi_1- u  db)
     8.12481457E-02    3     1000024         3        -4   # BR(~g -> ~chi_1+ s  cb)
     8.12481457E-02    3    -1000024         4        -3   # BR(~g -> ~chi_1- c  sb)
     1.63368979E-01    3     1000024         5        -6   # BR(~g -> ~chi_1+ b  tb)
     1.63368979E-01    3    -1000024         6        -5   # BR(~g -> ~chi_1- t  bb)
#
#         PDG            Width
DECAY   1000006     1.38732328E+02   # stop1 decays
#          BR         NDA      ID1       ID2
     6.07352439E-07    2     1000022         6   # BR(~t_1 -> ~chi_10 t )
     4.22675690E-02    2     1000023         6   # BR(~t_1 -> ~chi_20 t )
     5.89325698E-02    2     1000025         6   # BR(~t_1 -> ~chi_30 t )
     5.95132886E-02    2     1000035         6   # BR(~t_1 -> ~chi_40 t )
     1.13200928E-06    2     1000024         5   # BR(~t_1 -> ~chi_1+ b )
     1.19391947E-01    2     1000037         5   # BR(~t_1 -> ~chi_2+ b )
     7.19892886E-01    2     1000021         6   # BR(~t_1 -> ~g      t )
#
#         PDG            Width
DECAY   2000006     2.88602267E+02   # stop2 decays
#          BR         NDA      ID1       ID2
     5.99507383E-02    2     1000022         6   # BR(~t_2 -> ~chi_10 t )
     2.17984308E-03    2     1000023         6   # BR(~t_2 -> ~chi_20 t )
     6.57349677E-02    2     1000025         6   # BR(~t_2 -> ~chi_30 t )
     6.51334916E-02    2     1000035         6   # BR(~t_2 -> ~chi_40 t )
     1.20321539E-01    2     1000024         5   # BR(~t_2 -> ~chi_1+ b )
     8.24205437E-04    2     1000037         5   # BR(~t_2 -> ~chi_2+ b )
     6.74752031E-01    2     1000021         6   # BR(~t_2 -> ~g      t )
     4.05091590E-03    2     1000006        25   # BR(~t_2 -> ~t_1    h )
     7.05226760E-03    2     1000006        23   # BR(~t_2 -> ~t_1    Z )
#
#         PDG            Width
DECAY   1000005     2.89245628E+02   # sbottom1 decays
#          BR         NDA      ID1       ID2
     5.98615046E-02    2     1000022         5   # BR(~b_1 -> ~chi_10 b )
     1.87153683E-03    2     1000023         5   # BR(~b_1 -> ~chi_20 b )
     4.18703362E-04    2     1000025         5   # BR(~b_1 -> ~chi_30 b )
     4.78507168E-04    2     1000035         5   # BR(~b_1 -> ~chi_40 b )
     1.19305117E-01    2    -1000024         6   # BR(~b_1 -> ~chi_1- t )
     1.30727400E-01    2    -1000037         6   # BR(~b_1 -> ~chi_2- t )
     6.72618083E-01    2     1000021         5   # BR(~b_1 -> ~g      b )
     1.47191474E-02    2     1000006       -24   # BR(~b_1 -> ~t_1    W-)
#
#         PDG            Width
DECAY   2000005     2.65823400E+02   # sbottom2 decays
#          BR         NDA      ID1       ID2
     1.47532872E-06    2     1000022         5   # BR(~b_2 -> ~chi_10 b )
     1.05873605E-02    2     1000023         5   # BR(~b_2 -> ~chi_20 b )
     6.41039848E-04    2     1000025         5   # BR(~b_2 -> ~chi_30 b )
     6.51027621E-04    2     1000035         5   # BR(~b_2 -> ~chi_40 b )
     2.90075331E-06    2    -1000024         6   # BR(~b_2 -> ~chi_1- t )
     1.27786726E-03    2    -1000037         6   # BR(~b_2 -> ~chi_2- t )
     9.86787538E-01    2     1000021         5   # BR(~b_2 -> ~g      b )
     1.22073623E-05    2     1000005        25   # BR(~b_2 -> ~b_1    h )
     1.35377592E-05    2     1000005        23   # BR(~b_2 -> ~b_1    Z )
     1.21667512E-07    2     1000006       -24   # BR(~b_2 -> ~t_1    W-)
     2.49243529E-05    2     2000006       -24   # BR(~b_2 -> ~t_2    W-)
#
#         PDG            Width
DECAY   1000002     3.24156923E+02   # sup_L decays
#          BR         NDA      ID1       ID2
     6.44778618E-02    2     1000022         2   # BR(~u_L -> ~chi_10 u)
     2.22485271E-03    2     1000023         2   # BR(~u_L -> ~chi_20 u)
     1.07059995E-05    2     1000025         2   # BR(~u_L -> ~chi_30 u)
     4.22032101E-05    2     1000035         2   # BR(~u_L -> ~chi_40 u)
     1.29180839E-01    2     1000024         1   # BR(~u_L -> ~chi_1+ d)
     4.08404736E-05    2     1000037         1   # BR(~u_L -> ~chi_2+ d)
     8.04022696E-01    2     1000021         2   # BR(~u_L -> ~g      u)
#
#         PDG            Width
DECAY   2000002     2.73707826E+02   # sup_R decays
#          BR         NDA      ID1       ID2
     7.55373225E-08    2     1000022         2   # BR(~u_R -> ~chi_10 u)
     4.11325303E-02    2     1000023         2   # BR(~u_R -> ~chi_20 u)
     1.72345926E-06    2     1000025         2   # BR(~u_R -> ~chi_30 u)
     4.76683815E-05    2     1000035         2   # BR(~u_R -> ~chi_40 u)
     9.58818002E-01    2     1000021         2   # BR(~u_R -> ~g      u)
#
#         PDG            Width
DECAY   1000001     3.24170978E+02   # sdown_L decays
#          BR         NDA      ID1       ID2
     6.45453877E-02    2     1000022         1   # BR(~d_L -> ~chi_10 d)
     2.09548896E-03    2     1000023         1   # BR(~d_L -> ~chi_20 d)
     1.50014854E-05    2     1000025         1   # BR(~d_L -> ~chi_30 d)
     9.32649905E-05    2     1000035         1   # BR(~d_L -> ~chi_40 d)
     1.28867119E-01    2    -1000024         2   # BR(~d_L -> ~chi_1- u)
     2.71628625E-04    2    -1000037         2   # BR(~d_L -> ~chi_2- u)
     8.04112109E-01    2     1000021         1   # BR(~d_L -> ~g      d)
#
#         PDG            Width
DECAY   2000001     2.66191886E+02   # sdown_R decays
#          BR         NDA      ID1       ID2
     1.94613131E-08    2     1000022         1   # BR(~d_R -> ~chi_10 d)
     1.06012801E-02    2     1000023         1   # BR(~d_R -> ~chi_20 d)
     4.44714509E-07    2     1000025         1   # BR(~d_R -> ~chi_30 d)
     1.23002227E-05    2     1000035         1   # BR(~d_R -> ~chi_40 d)
     9.89385956E-01    2     1000021         1   # BR(~d_R -> ~g      d)
#
#         PDG            Width
DECAY   1000004     3.24156923E+02   # scharm_L decays
#          BR         NDA      ID1       ID2
     6.44778618E-02    2     1000022         4   # BR(~c_L -> ~chi_10 c)
     2.22485271E-03    2     1000023         4   # BR(~c_L -> ~chi_20 c)
     1.07059995E-05    2     1000025         4   # BR(~c_L -> ~chi_30 c)
     4.22032101E-05    2     1000035         4   # BR(~c_L -> ~chi_40 c)
     1.29180839E-01    2     1000024         3   # BR(~c_L -> ~chi_1+ s)
     4.08404736E-05    2     1000037         3   # BR(~c_L -> ~chi_2+ s)
     8.04022696E-01    2     1000021         4   # BR(~c_L -> ~g      c)
#
#         PDG            Width
DECAY   2000004     2.73707826E+02   # scharm_R decays
#          BR         NDA      ID1       ID2
     7.55373225E-08    2     1000022         4   # BR(~c_R -> ~chi_10 c)
     4.11325303E-02    2     1000023         4   # BR(~c_R -> ~chi_20 c)
     1.72345926E-06    2     1000025         4   # BR(~c_R -> ~chi_30 c)
     4.76683815E-05    2     1000035         4   # BR(~c_R -> ~chi_40 c)
     9.58818002E-01    2     1000021         4   # BR(~c_R -> ~g      c)
#
#         PDG            Width
DECAY   1000003     3.24170978E+02   # sstrange_L decays
#          BR         NDA      ID1       ID2
     6.45453877E-02    2     1000022         3   # BR(~s_L -> ~chi_10 s)
     2.09548896E-03    2     1000023         3   # BR(~s_L -> ~chi_20 s)
     1.50014854E-05    2     1000025         3   # BR(~s_L -> ~chi_30 s)
     9.32649905E-05    2     1000035         3   # BR(~s_L -> ~chi_40 s)
     1.28867119E-01    2    -1000024         4   # BR(~s_L -> ~chi_1- c)
     2.71628625E-04    2    -1000037         4   # BR(~s_L -> ~chi_2- c)
     8.04112109E-01    2     1000021         3   # BR(~s_L -> ~g      s)
#
#         PDG            Width
DECAY   2000003     2.66191886E+02   # sstrange_R decays
#          BR         NDA      ID1       ID2
     1.94613131E-08    2     1000022         3   # BR(~s_R -> ~chi_10 s)
     1.06012801E-02    2     1000023         3   # BR(~s_R -> ~chi_20 s)
     4.44714509E-07    2     1000025         3   # BR(~s_R -> ~chi_30 s)
     1.23002227E-05    2     1000035         3   # BR(~s_R -> ~chi_40 s)
     9.89385956E-01    2     1000021         3   # BR(~s_R -> ~g      s)
#
#         PDG            Width
DECAY   1000011     6.50284295E+01   # selectron_L decays
#          BR         NDA      ID1       ID2
     3.02653757E-01    2     1000022        11   # BR(~e_L -> ~chi_10 e-)
     9.06197725E-02    2     1000023        11   # BR(~e_L -> ~chi_20 e-)
     3.11958419E-05    2     1000025        11   # BR(~e_L -> ~chi_30 e-)
     4.86490631E-05    2     1000035        11   # BR(~e_L -> ~chi_40 e-)
     6.05459305E-01    2    -1000024        12   # BR(~e_L -> ~chi_1- nu_e)
     1.18732047E-03    2    -1000037        12   # BR(~e_L -> ~chi_2- nu_e)
#
#         PDG            Width
DECAY   2000011     2.34139114E+01   # selectron_R decays
#          BR         NDA      ID1       ID2
     1.86781806E-06    2     1000022        11   # BR(~e_R -> ~chi_10 e-)
     9.98863555E-01    2     1000023        11   # BR(~e_R -> ~chi_20 e-)
     3.95991643E-05    2     1000025        11   # BR(~e_R -> ~chi_30 e-)
     1.09497794E-03    2     1000035        11   # BR(~e_R -> ~chi_40 e-)
#
#         PDG            Width
DECAY   1000013     6.50284295E+01   # smuon_L decays
#          BR         NDA      ID1       ID2
     3.02653757E-01    2     1000022        13   # BR(~mu_L -> ~chi_10 mu-)
     9.06197725E-02    2     1000023        13   # BR(~mu_L -> ~chi_20 mu-)
     3.11958419E-05    2     1000025        13   # BR(~mu_L -> ~chi_30 mu-)
     4.86490631E-05    2     1000035        13   # BR(~mu_L -> ~chi_40 mu-)
     6.05459305E-01    2    -1000024        14   # BR(~mu_L -> ~chi_1- nu_mu)
     1.18732047E-03    2    -1000037        14   # BR(~mu_L -> ~chi_2- nu_mu)
#
#         PDG            Width
DECAY   2000013     2.34139114E+01   # smuon_R decays
#          BR         NDA      ID1       ID2
     1.86781806E-06    2     1000022        13   # BR(~mu_R -> ~chi_10 mu-)
     9.98863555E-01    2     1000023        13   # BR(~mu_R -> ~chi_20 mu-)
     3.95991643E-05    2     1000025        13   # BR(~mu_R -> ~chi_30 mu-)
     1.09497794E-03    2     1000035        13   # BR(~mu_R -> ~chi_40 mu-)
#
#         PDG            Width
DECAY   1000015     5.94985034E+01   # stau_1 decays
#          BR         NDA      ID1       ID2
     2.86151066E-01    2     1000022        15   # BR(~tau_1 -> ~chi_10  tau-)
     1.39382501E-01    2     1000023        15   # BR(~tau_1 -> ~chi_20  tau-)
     1.10647892E-03    2     1000025        15   # BR(~tau_1 -> ~chi_30  tau-)
     7.20274350E-04    2     1000035        15   # BR(~tau_1 -> ~chi_40  tau-)
     5.72430387E-01    2    -1000024        16   # BR(~tau_1 -> ~chi_1-  nu_tau)
     2.09291976E-04    2    -1000037        16   # BR(~tau_1 -> ~chi_2-  nu_tau)
#
#         PDG            Width
DECAY   2000015     2.92833378E+01   # stau_2 decays
#          BR         NDA      ID1       ID2
     8.99825047E-02    2     1000022        15   # BR(~tau_2 -> ~chi_10  tau-)
     7.14364991E-01    2     1000023        15   # BR(~tau_2 -> ~chi_20  tau-)
     3.21577525E-03    2     1000025        15   # BR(~tau_2 -> ~chi_30  tau-)
     4.85985131E-03    2     1000035        15   # BR(~tau_2 -> ~chi_40  tau-)
     1.80015657E-01    2    -1000024        16   # BR(~tau_2 -> ~chi_1-  nu_tau)
     7.56122066E-03    2    -1000037        16   # BR(~tau_2 -> ~chi_2-  nu_tau)
#
#         PDG            Width
DECAY   1000012     6.50424329E+01   # snu_eL decays
#          BR         NDA      ID1       ID2
     3.03455632E-01    2     1000022        12   # BR(~nu_eL -> ~chi_10 nu_e)
     8.87947891E-02    2     1000023        12   # BR(~nu_eL -> ~chi_20 nu_e)
     8.74797765E-05    2     1000025        12   # BR(~nu_eL -> ~chi_30 nu_e)
     7.17822171E-04    2     1000035        12   # BR(~nu_eL -> ~chi_40 nu_e)
     6.06765813E-01    2     1000024        11   # BR(~nu_eL -> ~chi_1+ e-)
     1.78463465E-04    2     1000037        11   # BR(~nu_eL -> ~chi_2+ e-)
#
#         PDG            Width
DECAY   1000014     6.50424329E+01   # snu_muL decays
#          BR         NDA      ID1       ID2
     3.03455632E-01    2     1000022        14   # BR(~nu_muL -> ~chi_10 nu_mu)
     8.87947891E-02    2     1000023        14   # BR(~nu_muL -> ~chi_20 nu_mu)
     8.74797765E-05    2     1000025        14   # BR(~nu_muL -> ~chi_30 nu_mu)
     7.17822171E-04    2     1000035        14   # BR(~nu_muL -> ~chi_40 nu_mu)
     6.06765813E-01    2     1000024        13   # BR(~nu_muL -> ~chi_1+ mu-)
     1.78463465E-04    2     1000037        13   # BR(~nu_muL -> ~chi_2+ mu-)
#
#         PDG            Width
DECAY   1000016     6.51281062E+01   # snu_tauL decays
#          BR         NDA      ID1       ID2
     3.02729721E-01    2     1000022        16   # BR(~nu_tauL -> ~chi_10 nu_tau)
     8.85627000E-02    2     1000023        16   # BR(~nu_tauL -> ~chi_20 nu_tau)
     8.71886395E-05    2     1000025        16   # BR(~nu_tauL -> ~chi_30 nu_tau)
     7.15430841E-04    2     1000035        16   # BR(~nu_tauL -> ~chi_40 nu_tau)
     6.05324401E-01    2     1000024        15   # BR(~nu_tauL -> ~chi_1+ tau-)
     2.58055781E-03    2     1000037        15   # BR(~nu_tauL -> ~chi_2+ tau-)
#
#         PDG            Width
DECAY   1000024     0.00000000E+00   # stable chargino_1
#           BR         NDA      ID1       ID2       ID3
     3.74995965E-01    3     1000022         2        -1   # BR(~chi_1+ -> ~chi_10 u    db)
     3.74995965E-01    3     1000022         4        -3   # BR(~chi_1+ -> ~chi_10 c    sb)
     1.25004035E-01    3     1000022       -11        12   # BR(~chi_1+ -> ~chi_10 e+   nu_e)
     1.25004035E-01    3     1000022       -13        14   # BR(~chi_1+ -> ~chi_10 mu+  nu_mu)
#
#         PDG            Width
DECAY   1000037     1.58828304E+01   # chargino2+ decays
#          BR         NDA      ID1       ID2
     2.99697215E-01    2     1000024        23   # BR(~chi_2+ -> ~chi_1+  Z )
     2.89598913E-01    2     1000022        24   # BR(~chi_2+ -> ~chi_10  W+)
     1.00784344E-01    2     1000023        24   # BR(~chi_2+ -> ~chi_20  W+)
     3.09919528E-01    2     1000024        25   # BR(~chi_2+ -> ~chi_1+  h )
#
#         PDG            Width
DECAY   1000022     0.00000000E+00   # stable neutralino 
#
#         PDG            Width
DECAY   1000023     1.88283613E-02   # neutralino2 decays
#          BR         NDA      ID1       ID2
     1.58034564E-02    2     1000022        23   # BR(~chi_20 -> ~chi_10   Z )
     3.26466633E-01    2     1000024       -24   # BR(~chi_20 -> ~chi_1+   W-)
     3.26466633E-01    2    -1000024        24   # BR(~chi_20 -> ~chi_1-   W+)
     3.31263277E-01    2     1000022        25   # BR(~chi_20 -> ~chi_10   h )
#
#         PDG            Width
DECAY   1000025     1.56227216E+01   # neutralino3 decays
#          BR         NDA      ID1       ID2
     2.55086596E-01    2     1000022        23   # BR(~chi_30 -> ~chi_10   Z )
     1.00373084E-01    2     1000023        23   # BR(~chi_30 -> ~chi_20   Z )
     2.94624980E-01    2     1000024       -24   # BR(~chi_30 -> ~chi_1+   W-)
     2.94624980E-01    2    -1000024        24   # BR(~chi_30 -> ~chi_1-   W+)
     5.15662561E-02    2     1000022        25   # BR(~chi_30 -> ~chi_10   h )
     3.72410382E-03    2     1000023        25   # BR(~chi_30 -> ~chi_20   h )
#
#         PDG            Width
DECAY   1000035     1.57885263E+01   # neutralino4 decays
#          BR         NDA      ID1       ID2
     4.93757003E-02    2     1000022        23   # BR(~chi_40 -> ~chi_10   Z )
     3.64699405E-03    2     1000023        23   # BR(~chi_40 -> ~chi_20   Z )
     2.91590082E-01    2     1000024       -24   # BR(~chi_40 -> ~chi_1+   W-)
     2.91590082E-01    2    -1000024        24   # BR(~chi_40 -> ~chi_1-   W+)
     2.60928196E-01    2     1000022        25   # BR(~chi_40 -> ~chi_10   h )
     1.02868946E-01    2     1000023        25   # BR(~chi_40 -> ~chi_20   h )
#
#         PDG            Width
DECAY        25     3.40717344E-03   # h decays
#          BR         NDA      ID1       ID2
     7.07419378E-01    2           5        -5   # BR(h -> b       bb     )
     7.19495943E-02    2         -15        15   # BR(h -> tau+    tau-   )
     2.54682565E-04    2         -13        13   # BR(h -> mu+     mu-    )
     5.45644020E-04    2           3        -3   # BR(h -> s       sb     )
     2.37270667E-02    2           4        -4   # BR(h -> c       cb     )
     6.85431079E-02    2          21        21   # BR(h -> g       g      )
     2.20828685E-03    2          22        22   # BR(h -> gam     gam    )
     9.47750153E-04    2          22        23   # BR(h -> Z       gam    )
     1.11936839E-01    2          24       -24   # BR(h -> W+      W-     )
     1.24676513E-02    2          23        23   # BR(h -> Z       Z      )
#
#         PDG            Width
DECAY        35     6.62660125E+01   # H decays
#          BR         NDA      ID1       ID2
     1.97347405E-02    2           5        -5   # BR(H -> b       bb     )
     3.84560209E-03    2         -15        15   # BR(H -> tau+    tau-   )
     1.35940497E-05    2         -13        13   # BR(H -> mu+     mu-    )
     1.54116600E-05    2           3        -3   # BR(H -> s       sb     )
     1.37864525E-06    2           4        -4   # BR(H -> c       cb     )
     1.39776948E-01    2           6        -6   # BR(H -> t       tb     )
     3.68426888E-05    2          21        21   # BR(H -> g       g      )
     2.08676957E-07    2          22        22   # BR(H -> gam     gam    )
     7.07705550E-08    2          23        22   # BR(H -> Z       gam    )
     1.99501606E-05    2          24       -24   # BR(H -> W+      W-     )
     9.97143291E-06    2          23        23   # BR(H -> Z       Z      )
     6.79096449E-05    2          25        25   # BR(H -> h       h      )
    -2.06822262E-24    2          36        36   # BR(H -> A       A      )
     4.15648237E-18    2          23        36   # BR(H -> Z       A      )
     1.60401676E-03    2     1000024  -1000024   # BR(H -> ~chi_1+ ~chi_1-)
     1.47986409E-05    2     1000037  -1000037   # BR(H -> ~chi_2+ ~chi_2-)
     2.55382670E-01    2     1000024  -1000037   # BR(H -> ~chi_1+ ~chi_2-)
     2.55382670E-01    2     1000037  -1000024   # BR(H -> ~chi_2+ ~chi_1-)
     8.04136086E-04    2     1000022   1000022   # BR(H -> ~chi_10 ~chi_10)
     1.05997915E-04    2     1000023   1000023   # BR(H -> ~chi_20 ~chi_20)
     5.05085519E-05    2     1000025   1000025   # BR(H -> ~chi_30 ~chi_30)
     1.69843202E-04    2     1000035   1000035   # BR(H -> ~chi_40 ~chi_40)
     6.24435182E-04    2     1000022   1000023   # BR(H -> ~chi_10 ~chi_20)
     1.86651898E-01    2     1000022   1000025   # BR(H -> ~chi_10 ~chi_30)
     6.80779730E-02    2     1000022   1000035   # BR(H -> ~chi_10 ~chi_40)
     5.24716872E-02    2     1000023   1000025   # BR(H -> ~chi_20 ~chi_30)
     1.43542249E-02    2     1000023   1000035   # BR(H -> ~chi_20 ~chi_40)
     7.82513175E-04    2     1000025   1000035   # BR(H -> ~chi_30 ~chi_40)
#
#         PDG            Width
DECAY        36     6.62675034E+01   # A decays
#          BR         NDA      ID1       ID2
     1.97610439E-02    2           5        -5   # BR(A -> b       bb     )
     3.84563775E-03    2         -15        15   # BR(A -> tau+    tau-   )
     1.35941701E-05    2         -13        13   # BR(A -> mu+     mu-    )
     1.54566949E-05    2           3        -3   # BR(A -> s       sb     )
     1.38930305E-06    2           4        -4   # BR(A -> c       cb     )
     1.39897350E-01    2           6        -6   # BR(A -> t       tb     )
     5.16055221E-05    2          21        21   # BR(A -> g       g      )
     9.44269004E-08    2          22        22   # BR(A -> gam     gam    )
     8.86631984E-08    2          23        22   # BR(A -> Z       gam    )
     1.99290554E-05    2          23        25   # BR(A -> Z       h      )
     2.27825804E-03    2     1000024  -1000024   # BR(A -> ~chi_1+ ~chi_1-)
     4.40253908E-04    2     1000037  -1000037   # BR(A -> ~chi_2+ ~chi_2-)
     2.54822985E-01    2     1000024  -1000037   # BR(A -> ~chi_1+ ~chi_2-)
     2.54822985E-01    2     1000037  -1000024   # BR(A -> ~chi_2+ ~chi_1-)
     1.14239136E-03    2     1000022   1000022   # BR(A -> ~chi_10 ~chi_10)
     2.31988132E-04    2     1000023   1000023   # BR(A -> ~chi_20 ~chi_20)
     5.47482579E-05    2     1000025   1000025   # BR(A -> ~chi_30 ~chi_30)
     1.03103524E-03    2     1000035   1000035   # BR(A -> ~chi_40 ~chi_40)
     1.08271610E-03    2     1000022   1000023   # BR(A -> ~chi_10 ~chi_20)
     6.87096198E-02    2     1000022   1000025   # BR(A -> ~chi_10 ~chi_30)
     1.85159469E-01    2     1000022   1000035   # BR(A -> ~chi_10 ~chi_40)
     1.45155932E-02    2     1000023   1000025   # BR(A -> ~chi_20 ~chi_30)
     5.18985315E-02    2     1000023   1000035   # BR(A -> ~chi_20 ~chi_40)
     2.03236124E-04    2     1000025   1000035   # BR(A -> ~chi_30 ~chi_40)
#
#         PDG            Width
DECAY        37     6.61028786E+01   # H+ decays
#          BR         NDA      ID1       ID2
     3.11021861E-05    2           4        -5   # BR(H+ -> c       bb     )
     3.85585012E-03    2         -15        16   # BR(H+ -> tau+    nu_tau )
     1.36302704E-05    2         -13        14   # BR(H+ -> mu+     nu_mu  )
     1.99040229E-07    2           2        -5   # BR(H+ -> u       bb     )
     7.41547876E-07    2           2        -3   # BR(H+ -> u       sb     )
     1.65888544E-05    2           4        -3   # BR(H+ -> c       sb     )
     1.57634298E-01    2           6        -5   # BR(H+ -> t       bb     )
     1.99922374E-05    2          24        25   # BR(H+ -> W+      h      )
     1.20335506E-14    2          24        36   # BR(H+ -> W+      A      )
     1.88593886E-09    2     1000024   1000022   # BR(H+ -> ~chi_1+ ~chi_10)
     1.72164066E-03    2     1000024   1000023   # BR(H+ -> ~chi_1+ ~chi_20)
     2.56228583E-01    2     1000024   1000025   # BR(H+ -> ~chi_1+ ~chi_30)
     2.55335003E-01    2     1000024   1000035   # BR(H+ -> ~chi_1+ ~chi_40)
     2.56587750E-01    2     1000037   1000022   # BR(H+ -> ~chi_2+ ~chi_10)
     6.80540466E-02    2     1000037   1000023   # BR(H+ -> ~chi_2+ ~chi_20)
     2.96453516E-04    2     1000037   1000025   # BR(H+ -> ~chi_2+ ~chi_30)
     2.04119397E-04    2     1000037   1000035   # BR(H+ -> ~chi_2+ ~chi_40)
