#
#                              ======================
#                              | THE SUSYHIT OUTPUT |
#                              ======================
#
#
#              ------------------------------------------------------
#              |     This is the output of the SUSY-HIT package     |
#              |  created by A.Djouadi, M.Muehlleitner and M.Spira. |
#              |  In case of problems with SUSY-HIT email to        |
#              |           margarete.muehlleitner@cern.ch           |
#              |           michael.spira@psi.ch                     |
#              |           abdelhak.djouadi@cern.ch                 |
#              ------------------------------------------------------
#
#              ------------------------------------------------------
#              |  SUSY Les Houches Accord - MSSM Spectrum + Decays  |
#              |              based on the decay programs           |
#              |                                                    |
#              |                     SDECAY 1.3b                    |
#              |                                                    |
#              |  Authors: M.Muhlleitner, A.Djouadi and Y.Mambrini  |
#              |  Ref.:    Comput.Phys.Commun.168(2005)46           |
#              |           [hep-ph/0311167]                         |
#              |                                                    |
#              |                     HDECAY 3.4                     |
#              |                                                    |
#              |  By: A.Djouadi,J.Kalinowski,M.Muhlleitner,M.Spira  |
#              |  Ref.:    Comput.Phys.Commun.108(1998)56           |
#              |           [hep-ph/9704448]                         |
#              |                                                    |
#              |                                                    |
#              |  If not stated otherwise all DRbar couplings and   |
#              |  soft SUSY breaking masses are given at the scale  |
#              |  Q=  0.50007589E+04
#              |                                                    |
#              ------------------------------------------------------
#
#
BLOCK DCINFO  # Decay Program information
     1   SDECAY/HDECAY # decay calculator
     2   1.3b  /3.4    # version number
#
BLOCK SPINFO  # Spectrum calculator information
     1    SOFTSUSY    # spectrum calculator                
     2    3.4.0       # version number                     
#
BLOCK MODSEL  # Model selection
     1     0   #  nonUniversal                                     
#
BLOCK SMINPUTS  # Standard Model inputs
         1     1.25778332E+02   # alpha_em^-1(M_Z)^MSbar
         2     1.16570000E-05   # G_F [GeV^-2]
         3     1.17200002E-01   # alpha_S(M_Z)^MSbar
         4     9.11876000E+01   # M_Z pole mass
         5     4.25000000E+00   # mb(mb)^MSbar
         6     1.72500000E+02   # mt pole mass
         7     1.77682000E+00   # mtau pole mass
#
BLOCK MINPAR  # Input parameters - minimal models
         3     1.00000000E+01   # tanb                
#
BLOCK EXTPAR  # Input parameters - non-minimal models
         0    -1.00000000E+00   # Set                 
         1     6.00000000E+01   # M_1(MX)             
         2     3.00000000E+03   # M_2(MX)             
         3     9.46037000E+02   # M_3(MX)             
        11     5.00000000E+03   # At(MX)              
        12     5.00000000E+03   # Ab(MX)              
        13     0.00000000E+00   # Atau(MX)            
        23    -2.82882000E+02   # mu(MX)              
        26     3.00000000E+03   # mA(pole)            
        31     5.00000000E+03   # meL(MX)             
        32     5.00000000E+03   # mmuL(MX)            
        33     5.00000000E+03   # mtauL(MX)           
        34     5.00000000E+03   # meR(MX)             
        35     5.00000000E+03   # mmuR(MX)            
        36     5.00000000E+03   # mtauR(MX)           
        41     5.00000000E+03   # mqL1(MX)            
        42     5.00000000E+03   # mqL2(MX)            
        43     5.00000000E+03   # mqL3(MX)            
        44     5.00000000E+03   # muR(MX)             
        45     5.00000000E+03   # mcR(MX)             
        46     5.00000000E+03   # mtR(MX)             
        47     5.00000000E+03   # mdR(MX)             
        48     5.00000000E+03   # msR(MX)             
        49     5.00000000E+03   # mbR(MX)             
#
BLOCK MASS  # Mass Spectrum
# PDG code           mass       particle
        24     8.00896344E+01   # W+
        25     1.24442120E+02   # h
        35     3.00008851E+03   # H
        36     2.99999970E+03   # A
        37     3.00146932E+03   # H+
         5     4.87878001E+00   # b-quark pole mass calculated from mb(mb)_Msbar
   1000001     5.06477458E+03   # ~d_L
   2000001     5.04687171E+03   # ~d_R
   1000002     5.06429664E+03   # ~u_L
   2000002     5.04656370E+03   # ~u_R
   1000003     5.06477458E+03   # ~s_L
   2000003     5.04687171E+03   # ~s_R
   1000004     5.06429664E+03   # ~c_L
   2000004     5.04656370E+03   # ~c_R
   1000005     5.01119723E+03   # ~b_1
   2000005     5.04503732E+03   # ~b_2
   1000006     4.90176359E+03   # ~t_1
   2000006     5.05564958E+03   # ~t_2
   1000011     5.01914146E+03   # ~e_L
   2000011     5.00595456E+03   # ~e_R
   1000012     5.01818939E+03   # ~nu_eL
   1000013     5.01914146E+03   # ~mu_L
   2000013     5.00595456E+03   # ~mu_R
   1000014     5.01818939E+03   # ~nu_muL
   1000015     5.00481653E+03   # ~tau_1
   2000015     5.01862276E+03   # ~tau_2
   1000016     5.01763542E+03   # ~nu_tauL
   1000021     1.20000065E+03   # ~g
   1000022     5.97914888E+01   # ~chi_10
   1000023     3.01966499E+02   # ~chi_20
   1000025    -3.03838340E+02   # ~chi_30
   1000035     3.07423876E+03   # ~chi_40
   1000024     3.00000416E+02   # ~chi_1+
   1000037     3.07440677E+03   # ~chi_2+
#
BLOCK NMIX  # Neutralino Mixing Matrix
  1  1     9.88603737E-01   # N_11
  1  2     5.99552313E-05   # N_12
  1  3    -1.49819013E-01   # N_13
  1  4    -1.47278754E-02   # N_14
  2  1     1.16382516E-01   # N_21
  2  2     1.76990463E-02   # N_22
  2  3     6.98594938E-01   # N_23
  2  4     7.05766935E-01   # N_24
  3  1    -9.54861375E-02   # N_31
  3  2     1.80304723E-02   # N_32
  3  3    -6.99656564E-01   # N_33
  3  4     7.07840371E-01   # N_34
  4  1    -3.97598282E-04   # N_41
  4  2     9.99680770E-01   # N_42
  4  3     2.59739486E-04   # N_43
  4  4    -2.52612790E-02   # N_44
#
BLOCK UMIX  # Chargino Mixing Matrix U
  1  1    -3.64777757E-04   # U_11
  1  2     9.99999933E-01   # U_12
  2  1    -9.99999933E-01   # U_21
  2  2    -3.64777757E-04   # U_22
#
BLOCK VMIX  # Chargino Mixing Matrix V
  1  1     3.57339164E-02   # V_11
  1  2    -9.99361340E-01   # V_12
  2  1    -9.99361340E-01   # V_21
  2  2    -3.57339164E-02   # V_22
#
BLOCK STOPMIX  # Stop Mixing Matrix
  1  1    -5.05736951E-01   # cos(theta_t)
  1  2     8.62687740E-01   # sin(theta_t)
  2  1    -8.62687740E-01   # -sin(theta_t)
  2  2    -5.05736951E-01   # cos(theta_t)
#
BLOCK SBOTMIX  # Sbottom Mixing Matrix
  1  1     9.99186518E-01   # cos(theta_b)
  1  2    -4.03274379E-02   # sin(theta_b)
  2  1     4.03274379E-02   # -sin(theta_b)
  2  2     9.99186518E-01   # cos(theta_b)
#
BLOCK STAUMIX  # Stau Mixing Matrix
  1  1    -3.37607035E-02   # cos(theta_tau)
  1  2     9.99429945E-01   # sin(theta_tau)
  2  1    -9.99429945E-01   # -sin(theta_tau)
  2  2    -3.37607035E-02   # cos(theta_tau)
#
BLOCK ALPHA  # Higgs mixing
          -1.05454824E-01   # Mixing angle in the neutral Higgs boson sector
#
BLOCK HMIX Q=  5.00075887E+03  # DRbar Higgs Parameters
         1    -2.87937744E+02   # mu(Q)MSSM           
         2     9.47215115E+00   # tan                 
         3     2.41745527E+02   # higgs               
         4     8.74995136E+06   # mA^2(Q)MSSM         
#
BLOCK GAUGE Q=  5.00075887E+03  # The gauge couplings
     1     3.71085595E-01   # gprime(Q) DRbar
     2     6.33941066E-01   # g(Q) DRbar
     3     1.00597398E+00   # g3(Q) DRbar
#
BLOCK AU Q=  5.00075887E+03  # The trilinear couplings
  1  1     5.00000001E+03   # A_u(Q) DRbar
  2  2     5.00000001E+03   # A_c(Q) DRbar
  3  3     5.00000001E+03   # A_t(Q) DRbar
#
BLOCK AD Q=  5.00075887E+03  # The trilinear couplings
  1  1     5.00000000E+03   # A_d(Q) DRbar
  2  2     5.00000000E+03   # A_s(Q) DRbar
  3  3     5.00000001E+03   # A_b(Q) DRbar
#
BLOCK AE Q=  5.00075887E+03  # The trilinear couplings
  1  1     0.00000000E+00   # A_e(Q) DRbar
  2  2     4.83462478E-08   # A_mu(Q) DRbar
  3  3     4.74850123E-08   # A_tau(Q) DRbar
#
BLOCK Yu Q=  5.00075887E+03  # The Yukawa couplings
  1  1     0.00000000E+00   # y_u(Q) DRbar
  2  2     0.00000000E+00   # y_c(Q) DRbar
  3  3     8.16349617E-01   # y_t(Q) DRbar
#
BLOCK Yd Q=  5.00075887E+03  # The Yukawa couplings
  1  1     0.00000000E+00   # y_d(Q) DRbar
  2  2     0.00000000E+00   # y_s(Q) DRbar
  3  3     1.29203579E-01   # y_b(Q) DRbar
#
BLOCK Ye Q=  5.00075887E+03  # The Yukawa couplings
  1  1     0.00000000E+00   # y_e(Q) DRbar
  2  2     0.00000000E+00   # y_mu(Q) DRbar
  3  3     9.72903114E-02   # y_tau(Q) DRbar
#
BLOCK MSOFT Q=  5.00075887E+03  # The soft SUSY breaking masses at the scale Q
         1     6.00000000E+01   # M_1(Q)              
         2     3.00000000E+03   # M_2(Q)              
         3     9.46037000E+02   # M_3(Q)              
        21     8.64815947E+06   # mH1^2(Q)            
        22     4.92104228E+05   # mH2^2(Q)            
        31     5.00000000E+03   # meL(Q)              
        32     5.00000000E+03   # mmuL(Q)             
        33     5.00000000E+03   # mtauL(Q)            
        34     5.00000000E+03   # meR(Q)              
        35     5.00000000E+03   # mmuR(Q)             
        36     5.00000000E+03   # mtauR(Q)            
        41     5.00000000E+03   # mqL1(Q)             
        42     5.00000000E+03   # mqL2(Q)             
        43     5.00000000E+03   # mqL3(Q)             
        44     5.00000000E+03   # muR(Q)              
        45     5.00000000E+03   # mcR(Q)              
        46     5.00000000E+03   # mtR(Q)              
        47     5.00000000E+03   # mdR(Q)              
        48     5.00000000E+03   # msR(Q)              
        49     5.00000000E+03   # mbR(Q)              
#
#
#
#                             =================
#                             |The decay table|
#                             =================
#
# - The QCD corrections to the decays gluino -> squark  + quark
#                                     squark -> gaugino + quark_prime
#                                     squark -> squark_prime + Higgs
#                                     squark -> gluino  + quark
#   are included.
#
# - The multi-body decays for the inos, stops and sbottoms are included.
#
# - The loop induced decays for the gluino, neutralinos and stops
#   are included.
#
# - The SUSY decays of the top quark are included.
#
#
#         PDG            Width
DECAY         6     1.40856393E+00   # top decays
#          BR         NDA      ID1       ID2
     1.00000000E+00    2           5        24   # BR(t ->  b    W+)
#
#         PDG            Width
DECAY   1000021     1.13524982E-04   # gluino decays
#          BR         NDA      ID1       ID2
     6.21494015E-06    2     1000022        21   # BR(~g -> ~chi_10 g)
     2.34843903E-02    2     1000023        21   # BR(~g -> ~chi_20 g)
     2.27700599E-02    2     1000025        21   # BR(~g -> ~chi_30 g)
#           BR         NDA      ID1       ID2       ID3
     1.50239257E-02    3     1000022         1        -1   # BR(~g -> ~chi_10 d  db)
     1.32851508E-04    3     1000023         1        -1   # BR(~g -> ~chi_20 d  db)
     8.59386541E-05    3     1000025         1        -1   # BR(~g -> ~chi_30 d  db)
     5.12067077E-02    3     1000022         2        -2   # BR(~g -> ~chi_10 u  ub)
     6.27696165E-04    3     1000023         2        -2   # BR(~g -> ~chi_20 u  ub)
     1.75979409E-04    3     1000025         2        -2   # BR(~g -> ~chi_30 u  ub)
     1.50239257E-02    3     1000022         3        -3   # BR(~g -> ~chi_10 s  sb)
     1.32851508E-04    3     1000023         3        -3   # BR(~g -> ~chi_20 s  sb)
     8.59386541E-05    3     1000025         3        -3   # BR(~g -> ~chi_30 s  sb)
     5.12067077E-02    3     1000022         4        -4   # BR(~g -> ~chi_10 c  cb)
     6.27696165E-04    3     1000023         4        -4   # BR(~g -> ~chi_20 c  cb)
     1.75979409E-04    3     1000025         4        -4   # BR(~g -> ~chi_30 c  cb)
     1.56951448E-02    3     1000022         5        -5   # BR(~g -> ~chi_10 b  bb)
     5.99859816E-03    3     1000023         5        -5   # BR(~g -> ~chi_20 b  bb)
     5.93827132E-03    3     1000025         5        -5   # BR(~g -> ~chi_30 b  bb)
     3.76995754E-02    3     1000022         6        -6   # BR(~g -> ~chi_10 t  tb)
     1.84431111E-01    3     1000023         6        -6   # BR(~g -> ~chi_20 t  tb)
     1.47949121E-01    3     1000025         6        -6   # BR(~g -> ~chi_30 t  tb)
     6.00920996E-05    3     1000024         1        -2   # BR(~g -> ~chi_1+ d  ub)
     6.00920996E-05    3    -1000024         2        -1   # BR(~g -> ~chi_1- u  db)
     6.00920996E-05    3     1000024         3        -4   # BR(~g -> ~chi_1+ s  cb)
     6.00920996E-05    3    -1000024         4        -3   # BR(~g -> ~chi_1- c  sb)
     2.10640473E-01    3     1000024         5        -6   # BR(~g -> ~chi_1+ b  tb)
     2.10640473E-01    3    -1000024         6        -5   # BR(~g -> ~chi_1- t  bb)
#
#         PDG            Width
DECAY   1000006     4.12303897E+02   # stop1 decays
#          BR         NDA      ID1       ID2
     2.03531404E-02    2     1000022         6   # BR(~t_1 -> ~chi_10 t )
     8.18569491E-02    2     1000023         6   # BR(~t_1 -> ~chi_20 t )
     7.51892541E-02    2     1000025         6   # BR(~t_1 -> ~chi_30 t )
     5.00752593E-03    2     1000035         6   # BR(~t_1 -> ~chi_40 t )
     1.15556072E-01    2     1000024         5   # BR(~t_1 -> ~chi_1+ b )
     9.98300429E-03    2     1000037         5   # BR(~t_1 -> ~chi_2+ b )
     6.92054054E-01    2     1000021         6   # BR(~t_1 -> ~g      t )
#
#         PDG            Width
DECAY   2000006     4.11677248E+02   # stop2 decays
#          BR         NDA      ID1       ID2
     9.14776037E-03    2     1000022         6   # BR(~t_2 -> ~chi_10 t )
     7.85259510E-02    2     1000023         6   # BR(~t_2 -> ~chi_20 t )
     8.61289380E-02    2     1000025         6   # BR(~t_2 -> ~chi_30 t )
     1.34827781E-02    2     1000035         6   # BR(~t_2 -> ~chi_40 t )
     4.80983429E-02    2     1000024         5   # BR(~t_2 -> ~chi_1+ b )
     2.68501633E-02    2     1000037         5   # BR(~t_2 -> ~chi_2+ b )
     7.34752712E-01    2     1000021         6   # BR(~t_2 -> ~g      t )
     6.89814674E-04    2     1000006        25   # BR(~t_2 -> ~t_1    h )
     2.32353954E-03    2     1000006        23   # BR(~t_2 -> ~t_1    Z )
#
#         PDG            Width
DECAY   1000005     3.88804918E+02   # sbottom1 decays
#          BR         NDA      ID1       ID2
     2.06563569E-03    2     1000022         5   # BR(~b_1 -> ~chi_10 b )
     2.05760454E-03    2     1000023         5   # BR(~b_1 -> ~chi_20 b )
     2.11040123E-03    2     1000025         5   # BR(~b_1 -> ~chi_30 b )
     1.94625637E-02    2     1000035         5   # BR(~b_1 -> ~chi_40 b )
     1.70866209E-01    2    -1000024         6   # BR(~b_1 -> ~chi_1- t )
     3.90710074E-02    2    -1000037         6   # BR(~b_1 -> ~chi_2- t )
     7.62918928E-01    2     1000021         5   # BR(~b_1 -> ~g      b )
     1.44764987E-03    2     1000006       -24   # BR(~b_1 -> ~t_1    W-)
#
#         PDG            Width
DECAY   2000005     3.05328790E+02   # sbottom2 decays
#          BR         NDA      ID1       ID2
     9.53332043E-03    2     1000022         5   # BR(~b_2 -> ~chi_10 b )
     2.87070183E-03    2     1000023         5   # BR(~b_2 -> ~chi_20 b )
     2.86005587E-03    2     1000025         5   # BR(~b_2 -> ~chi_30 b )
     3.84148271E-05    2     1000035         5   # BR(~b_2 -> ~chi_40 b )
     5.83531235E-03    2    -1000024         6   # BR(~b_2 -> ~chi_1- t )
     7.71287855E-05    2    -1000037         6   # BR(~b_2 -> ~chi_2- t )
     9.78773049E-01    2     1000021         5   # BR(~b_2 -> ~g      b )
     1.20166399E-05    2     1000006       -24   # BR(~b_2 -> ~t_1    W-)
#
#         PDG            Width
DECAY   1000002     3.24519410E+02   # sup_L decays
#          BR         NDA      ID1       ID2
     2.25567105E-03    2     1000022         2   # BR(~u_L -> ~chi_10 u)
     9.82680399E-05    2     1000023         2   # BR(~u_L -> ~chi_20 u)
     2.17277754E-08    2     1000025         2   # BR(~u_L -> ~chi_30 u)
     2.41875308E-02    2     1000035         2   # BR(~u_L -> ~chi_40 u)
     1.53714381E-04    2     1000024         1   # BR(~u_L -> ~chi_1+ d)
     4.83455217E-02    2     1000037         1   # BR(~u_L -> ~chi_2+ d)
     9.24959272E-01    2     1000021         2   # BR(~u_L -> ~g      u)
#
#         PDG            Width
DECAY   2000002     3.10798068E+02   # sup_R decays
#          BR         NDA      ID1       ID2
     3.75282606E-02    2     1000022         2   # BR(~u_R -> ~chi_10 u)
     5.16653740E-04    2     1000023         2   # BR(~u_R -> ~chi_20 u)
     3.47749521E-04    2     1000025         2   # BR(~u_R -> ~chi_30 u)
     2.40568309E-09    2     1000035         2   # BR(~u_R -> ~chi_40 u)
     9.61607334E-01    2     1000021         2   # BR(~u_R -> ~g      u)
#
#         PDG            Width
DECAY   1000001     3.24528482E+02   # sdown_L decays
#          BR         NDA      ID1       ID2
     2.25301893E-03    2     1000022         1   # BR(~d_L -> ~chi_10 d)
     1.51050939E-06    2     1000023         1   # BR(~d_L -> ~chi_20 d)
     8.08915873E-05    2     1000025         1   # BR(~d_L -> ~chi_30 d)
     2.42019444E-02    2     1000035         1   # BR(~d_L -> ~chi_40 d)
     1.60191516E-08    2    -1000024         2   # BR(~d_L -> ~chi_1- u)
     4.84211423E-02    2    -1000037         2   # BR(~d_L -> ~chi_2- u)
     9.25041476E-01    2     1000021         1   # BR(~d_L -> ~g      d)
#
#         PDG            Width
DECAY   2000001     3.01871590E+02   # sdown_R decays
#          BR         NDA      ID1       ID2
     9.66008906E-03    2     1000022         1   # BR(~d_R -> ~chi_10 d)
     1.32991114E-04    2     1000023         1   # BR(~d_R -> ~chi_20 d)
     8.95137168E-05    2     1000025         1   # BR(~d_R -> ~chi_30 d)
     6.19331499E-10    2     1000035         1   # BR(~d_R -> ~chi_40 d)
     9.90117405E-01    2     1000021         1   # BR(~d_R -> ~g      d)
#
#         PDG            Width
DECAY   1000004     3.24519410E+02   # scharm_L decays
#          BR         NDA      ID1       ID2
     2.25567105E-03    2     1000022         4   # BR(~c_L -> ~chi_10 c)
     9.82680399E-05    2     1000023         4   # BR(~c_L -> ~chi_20 c)
     2.17277754E-08    2     1000025         4   # BR(~c_L -> ~chi_30 c)
     2.41875308E-02    2     1000035         4   # BR(~c_L -> ~chi_40 c)
     1.53714381E-04    2     1000024         3   # BR(~c_L -> ~chi_1+ s)
     4.83455217E-02    2     1000037         3   # BR(~c_L -> ~chi_2+ s)
     9.24959272E-01    2     1000021         4   # BR(~c_L -> ~g      c)
#
#         PDG            Width
DECAY   2000004     3.10798068E+02   # scharm_R decays
#          BR         NDA      ID1       ID2
     3.75282606E-02    2     1000022         4   # BR(~c_R -> ~chi_10 c)
     5.16653740E-04    2     1000023         4   # BR(~c_R -> ~chi_20 c)
     3.47749521E-04    2     1000025         4   # BR(~c_R -> ~chi_30 c)
     2.40568309E-09    2     1000035         4   # BR(~c_R -> ~chi_40 c)
     9.61607334E-01    2     1000021         4   # BR(~c_R -> ~g      c)
#
#         PDG            Width
DECAY   1000003     3.24528482E+02   # sstrange_L decays
#          BR         NDA      ID1       ID2
     2.25301893E-03    2     1000022         3   # BR(~s_L -> ~chi_10 s)
     1.51050939E-06    2     1000023         3   # BR(~s_L -> ~chi_20 s)
     8.08915873E-05    2     1000025         3   # BR(~s_L -> ~chi_30 s)
     2.42019444E-02    2     1000035         3   # BR(~s_L -> ~chi_40 s)
     1.60191516E-08    2    -1000024         4   # BR(~s_L -> ~chi_1- c)
     4.84211423E-02    2    -1000037         4   # BR(~s_L -> ~chi_2- c)
     9.25041476E-01    2     1000021         3   # BR(~s_L -> ~g      s)
#
#         PDG            Width
DECAY   2000003     3.01871590E+02   # sstrange_R decays
#          BR         NDA      ID1       ID2
     9.66008906E-03    2     1000022         3   # BR(~s_R -> ~chi_10 s)
     1.32991114E-04    2     1000023         3   # BR(~s_R -> ~chi_20 s)
     8.95137168E-05    2     1000025         3   # BR(~s_R -> ~chi_30 s)
     6.19331499E-10    2     1000035         3   # BR(~s_R -> ~chi_40 s)
     9.90117405E-01    2     1000021         3   # BR(~s_R -> ~g      s)
#
#         PDG            Width
DECAY   1000011     3.03843489E+01   # selectron_L decays
#          BR         NDA      ID1       ID2
     2.21125613E-01    2     1000022        11   # BR(~e_L -> ~chi_10 e-)
     4.82898635E-03    2     1000023        11   # BR(~e_L -> ~chi_20 e-)
     9.39791938E-04    2     1000025        11   # BR(~e_L -> ~chi_30 e-)
     2.57534702E-01    2     1000035        11   # BR(~e_L -> ~chi_40 e-)
     1.74483930E-07    2    -1000024        12   # BR(~e_L -> ~chi_1- nu_e)
     5.15570732E-01    2    -1000037        12   # BR(~e_L -> ~chi_2- nu_e)
#
#         PDG            Width
DECAY   2000011     2.74158807E+01   # selectron_R decays
#          BR         NDA      ID1       ID2
     9.77492890E-01    2     1000022        11   # BR(~e_R -> ~chi_10 e-)
     1.34524763E-02    2     1000023        11   # BR(~e_R -> ~chi_20 e-)
     9.05457263E-03    2     1000025        11   # BR(~e_R -> ~chi_30 e-)
     6.13570381E-08    2     1000035        11   # BR(~e_R -> ~chi_40 e-)
#
#         PDG            Width
DECAY   1000013     3.03843489E+01   # smuon_L decays
#          BR         NDA      ID1       ID2
     2.21125613E-01    2     1000022        13   # BR(~mu_L -> ~chi_10 mu-)
     4.82898635E-03    2     1000023        13   # BR(~mu_L -> ~chi_20 mu-)
     9.39791938E-04    2     1000025        13   # BR(~mu_L -> ~chi_30 mu-)
     2.57534702E-01    2     1000035        13   # BR(~mu_L -> ~chi_40 mu-)
     1.74483930E-07    2    -1000024        14   # BR(~mu_L -> ~chi_1- nu_mu)
     5.15570732E-01    2    -1000037        14   # BR(~mu_L -> ~chi_2- nu_mu)
#
#         PDG            Width
DECAY   2000013     2.74158807E+01   # smuon_R decays
#          BR         NDA      ID1       ID2
     9.77492890E-01    2     1000022        13   # BR(~mu_R -> ~chi_10 mu-)
     1.34524763E-02    2     1000023        13   # BR(~mu_R -> ~chi_20 mu-)
     9.05457263E-03    2     1000025        13   # BR(~mu_R -> ~chi_30 mu-)
     6.13570381E-08    2     1000035        13   # BR(~mu_R -> ~chi_40 mu-)
#
#         PDG            Width
DECAY   1000015     2.92831098E+01   # stau_1 decays
#          BR         NDA      ID1       ID2
     9.15762462E-01    2     1000022        15   # BR(~tau_1 -> ~chi_10  tau-)
     2.78247486E-02    2     1000023        15   # BR(~tau_1 -> ~chi_20  tau-)
     2.35926715E-02    2     1000025        15   # BR(~tau_1 -> ~chi_30  tau-)
     3.02688283E-04    2     1000035        15   # BR(~tau_1 -> ~chi_40  tau-)
     3.19116072E-02    2    -1000024        16   # BR(~tau_1 -> ~chi_1-  nu_tau)
     6.05822878E-04    2    -1000037        16   # BR(~tau_1 -> ~chi_2-  nu_tau)
#
#         PDG            Width
DECAY   2000015     3.13114428E+01   # stau_2 decays
#          BR         NDA      ID1       ID2
     2.15153554E-01    2     1000022        15   # BR(~tau_2 -> ~chi_10  tau-)
     1.96460222E-02    2     1000023        15   # BR(~tau_2 -> ~chi_20  tau-)
     1.60680922E-02    2     1000025        15   # BR(~tau_2 -> ~chi_30  tau-)
     2.49535719E-01    2     1000035        15   # BR(~tau_2 -> ~chi_40  tau-)
     3.91315566E-05    2    -1000024        16   # BR(~tau_2 -> ~chi_1-  nu_tau)
     4.99557481E-01    2    -1000037        16   # BR(~tau_2 -> ~chi_2-  nu_tau)
#
#         PDG            Width
DECAY   1000012     3.03874787E+01   # snu_eL decays
#          BR         NDA      ID1       ID2
     2.20969281E-01    2     1000022        12   # BR(~nu_eL -> ~chi_10 nu_e)
     1.66657592E-03    2     1000023        12   # BR(~nu_eL -> ~chi_20 nu_e)
     3.58127113E-03    2     1000025        12   # BR(~nu_eL -> ~chi_30 nu_e)
     2.57581784E-01    2     1000035        12   # BR(~nu_eL -> ~chi_40 nu_e)
     1.67390832E-03    2     1000024        11   # BR(~nu_eL -> ~chi_1+ e-)
     5.14527179E-01    2     1000037        11   # BR(~nu_eL -> ~chi_2+ e-)
#
#         PDG            Width
DECAY   1000014     3.03874787E+01   # snu_muL decays
#          BR         NDA      ID1       ID2
     2.20969281E-01    2     1000022        14   # BR(~nu_muL -> ~chi_10 nu_mu)
     1.66657592E-03    2     1000023        14   # BR(~nu_muL -> ~chi_20 nu_mu)
     3.58127113E-03    2     1000025        14   # BR(~nu_muL -> ~chi_30 nu_mu)
     2.57581784E-01    2     1000035        14   # BR(~nu_muL -> ~chi_40 nu_mu)
     1.67390832E-03    2     1000024        13   # BR(~nu_muL -> ~chi_1+ mu-)
     5.14527179E-01    2     1000037        13   # BR(~nu_muL -> ~chi_2+ mu-)
#
#         PDG            Width
DECAY   1000016     3.13160269E+01   # snu_tauL decays
#          BR         NDA      ID1       ID2
     2.14393661E-01    2     1000022        16   # BR(~nu_tauL -> ~chi_10 nu_tau)
     1.61697934E-03    2     1000023        16   # BR(~nu_tauL -> ~chi_20 nu_tau)
     3.47469397E-03    2     1000025        16   # BR(~nu_tauL -> ~chi_30 nu_tau)
     2.49850357E-01    2     1000035        16   # BR(~nu_tauL -> ~chi_40 nu_tau)
     3.15811851E-02    2     1000024        15   # BR(~nu_tauL -> ~chi_1+ tau-)
     4.99083123E-01    2     1000037        15   # BR(~nu_tauL -> ~chi_2+ tau-)
#
#         PDG            Width
DECAY   1000024     1.63155196E-01   # chargino1+ decays
#          BR         NDA      ID1       ID2
     1.00000000E+00    2     1000022        24   # BR(~chi_1+ -> ~chi_10  W+)
#
#         PDG            Width
DECAY   1000037     2.29109831E+01   # chargino2+ decays
#          BR         NDA      ID1       ID2
     2.53664271E-01    2     1000024        23   # BR(~chi_2+ -> ~chi_1+  Z )
     1.47749128E-04    2     1000022        24   # BR(~chi_2+ -> ~chi_10  W+)
     2.45462153E-01    2     1000023        24   # BR(~chi_2+ -> ~chi_20  W+)
     2.44568574E-01    2     1000025        24   # BR(~chi_2+ -> ~chi_30  W+)
     2.56142110E-01    2     1000024        25   # BR(~chi_2+ -> ~chi_1+  h )
     1.51432414E-05    2     1000022        37   # BR(~chi_2+ -> ~chi_10  H+)
#
#         PDG            Width
DECAY   1000022     0.00000000E+00   # neutralino1 decays
#
#         PDG            Width
DECAY   1000023     1.53629757E-01   # neutralino2 decays
#          BR         NDA      ID1       ID2
     4.91283253E-01    2     1000022        23   # BR(~chi_20 -> ~chi_10   Z )
     5.08716747E-01    2     1000022        25   # BR(~chi_20 -> ~chi_10   h )
#
#         PDG            Width
DECAY   1000025     1.38475682E-01   # neutralino3 decays
#          BR         NDA      ID1       ID2
     6.70813075E-01    2     1000022        23   # BR(~chi_30 -> ~chi_10   Z )
     3.29186925E-01    2     1000022        25   # BR(~chi_30 -> ~chi_10   h )
#
#         PDG            Width
DECAY   1000035     2.29124880E+01   # neutralino4 decays
#          BR         NDA      ID1       ID2
     6.90473477E-05    2     1000022        23   # BR(~chi_40 -> ~chi_10   Z )
     1.29010569E-01    2     1000023        23   # BR(~chi_40 -> ~chi_20   Z )
     1.24419046E-01    2     1000025        23   # BR(~chi_40 -> ~chi_30   Z )
     2.45294853E-01    2     1000024       -24   # BR(~chi_40 -> ~chi_1+   W-)
     2.45294853E-01    2    -1000024        24   # BR(~chi_40 -> ~chi_1-   W+)
     6.82393131E-05    2     1000022        25   # BR(~chi_40 -> ~chi_10   h )
     1.46151365E-05    2     1000022        35   # BR(~chi_40 -> ~chi_10   H )
     1.55057417E-06    2     1000022        36   # BR(~chi_40 -> ~chi_10   A )
     1.26563794E-01    2     1000023        25   # BR(~chi_40 -> ~chi_20   h )
     1.29263434E-01    2     1000025        25   # BR(~chi_40 -> ~chi_30   h )
#
#         PDG            Width
DECAY        25     4.04227766E-03   # h decays
#          BR         NDA      ID1       ID2
     6.15907763E-01    2           5        -5   # BR(h -> b       bb     )
     6.40017654E-02    2         -15        15   # BR(h -> tau+    tau-   )
     2.26590986E-04    2         -13        13   # BR(h -> mu+     mu-    )
     4.80607668E-04    2           3        -3   # BR(h -> s       sb     )
     2.08231340E-02    2           4        -4   # BR(h -> c       cb     )
     6.69767959E-02    2          21        21   # BR(h -> g       g      )
     2.29341474E-03    2          22        22   # BR(h -> gam     gam    )
     1.45196019E-03    2          22        23   # BR(h -> Z       gam    )
     2.03715200E-01    2          24       -24   # BR(h -> W+      W-     )
     2.41207604E-02    2          23        23   # BR(h -> Z       Z      )
     2.00724428E-06    2     1000022   1000022   # BR(h -> ~chi_10 ~chi_10)
#
#         PDG            Width
DECAY        35     8.78696336E+00   # H decays
#          BR         NDA      ID1       ID2
     3.62010378E-01    2           5        -5   # BR(H -> b       bb     )
     6.34330251E-02    2         -15        15   # BR(H -> tau+    tau-   )
     2.24304215E-04    2         -13        13   # BR(H -> mu+     mu-    )
     2.74962542E-04    2           3        -3   # BR(H -> s       sb     )
     1.53674252E-06    2           4        -4   # BR(H -> c       cb     )
     1.53532757E-01    2           6        -6   # BR(H -> t       tb     )
     5.10649074E-05    2          21        21   # BR(H -> g       g      )
     1.38027349E-07    2          22        22   # BR(H -> gam     gam    )
     9.05001345E-08    2          23        22   # BR(H -> Z       gam    )
     7.41400857E-05    2          24       -24   # BR(H -> W+      W-     )
     3.70230997E-05    2          23        23   # BR(H -> Z       Z      )
     2.66805058E-04    2          25        25   # BR(H -> h       h      )
     2.83344170E-23    2          36        36   # BR(H -> A       A      )
     6.42244886E-19    2          23        36   # BR(H -> Z       A      )
     3.40511893E-03    2     1000024  -1000024   # BR(H -> ~chi_1+ ~chi_1-)
     1.88073894E-02    2     1000022   1000022   # BR(H -> ~chi_10 ~chi_10)
     3.32849160E-03    2     1000023   1000023   # BR(H -> ~chi_20 ~chi_20)
     5.10416461E-03    2     1000025   1000025   # BR(H -> ~chi_30 ~chi_30)
     2.31950280E-01    2     1000022   1000023   # BR(H -> ~chi_10 ~chi_20)
     1.47991362E-01    2     1000022   1000025   # BR(H -> ~chi_10 ~chi_30)
     9.50696799E-03    2     1000023   1000025   # BR(H -> ~chi_20 ~chi_30)
#
#         PDG            Width
DECAY        36     8.79232739E+00   # A decays
#          BR         NDA      ID1       ID2
     3.61913448E-01    2           5        -5   # BR(A -> b       bb     )
     6.33961811E-02    2         -15        15   # BR(A -> tau+    tau-   )
     2.24173619E-04    2         -13        13   # BR(A -> mu+     mu-    )
     2.75003267E-04    2           3        -3   # BR(A -> s       sb     )
     1.54190639E-06    2           4        -4   # BR(A -> c       cb     )
     1.53963665E-01    2           6        -6   # BR(A -> t       tb     )
     1.52392216E-04    2          21        21   # BR(A -> g       g      )
     5.63186683E-07    2          22        22   # BR(A -> gam     gam    )
     1.84307496E-07    2          23        22   # BR(A -> Z       gam    )
     7.38162930E-05    2          23        25   # BR(A -> Z       h      )
     3.56024569E-03    2     1000024  -1000024   # BR(A -> ~chi_1+ ~chi_1-)
     1.80598176E-02    2     1000022   1000022   # BR(A -> ~chi_10 ~chi_10)
     2.25815194E-03    2     1000023   1000023   # BR(A -> ~chi_20 ~chi_20)
     8.17315299E-03    2     1000025   1000025   # BR(A -> ~chi_30 ~chi_30)
     1.51118467E-01    2     1000022   1000023   # BR(A -> ~chi_10 ~chi_20)
     2.28494717E-01    2     1000022   1000025   # BR(A -> ~chi_10 ~chi_30)
     8.33447929E-03    2     1000023   1000025   # BR(A -> ~chi_20 ~chi_30)
#
#         PDG            Width
DECAY        37     8.72058392E+00   # H+ decays
#          BR         NDA      ID1       ID2
     5.78639847E-04    2           4        -5   # BR(H+ -> c       bb     )
     6.39490475E-02    2         -15        16   # BR(H+ -> tau+    nu_tau )
     2.26128595E-04    2         -13        14   # BR(H+ -> mu+     nu_mu  )
     3.70327548E-06    2           2        -5   # BR(H+ -> u       bb     )
     1.32684135E-05    2           2        -3   # BR(H+ -> u       sb     )
     2.74390153E-04    2           4        -3   # BR(H+ -> c       sb     )
     5.13676831E-01    2           6        -5   # BR(H+ -> t       bb     )
     7.45810603E-05    2          24        25   # BR(H+ -> W+      h      )
     1.03297385E-12    2          24        36   # BR(H+ -> W+      A      )
     4.10374212E-01    2     1000024   1000022   # BR(H+ -> ~chi_1+ ~chi_10)
     9.12240534E-03    2     1000024   1000023   # BR(H+ -> ~chi_1+ ~chi_20)
     1.70679268E-03    2     1000024   1000025   # BR(H+ -> ~chi_1+ ~chi_30)
