#
#                              ======================
#                              | THE SUSYHIT OUTPUT |
#                              ======================
#
#
#              ------------------------------------------------------
#              |     This is the output of the SUSY-HIT package     |
#              |  created by A.Djouadi, M.Muehlleitner and M.Spira. |
#              |  In case of problems with SUSY-HIT email to        |
#              |           margarete.muehlleitner@cern.ch           |
#              |           michael.spira@psi.ch                     |
#              |           abdelhak.djouadi@cern.ch                 |
#              ------------------------------------------------------
#
#              ------------------------------------------------------
#              |  SUSY Les Houches Accord - MSSM Spectrum + Decays  |
#              |              based on the decay programs           |
#              |                                                    |
#              |                     SDECAY 1.3b                    |
#              |                                                    |
#              |  Authors: M.Muhlleitner, A.Djouadi and Y.Mambrini  |
#              |  Ref.:    Comput.Phys.Commun.168(2005)46           |
#              |           [hep-ph/0311167]                         |
#              |                                                    |
#              |                     HDECAY 3.4                     |
#              |                                                    |
#              |  By: A.Djouadi,J.Kalinowski,M.Muhlleitner,M.Spira  |
#              |  Ref.:    Comput.Phys.Commun.108(1998)56           |
#              |           [hep-ph/9704448]                         |
#              |                                                    |
#              |                                                    |
#              |  If not stated otherwise all DRbar couplings and   |
#              |  soft SUSY breaking masses are given at the scale  |
#              |  Q=  0.91187600E+02
#              |                                                    |
#              ------------------------------------------------------
#
#
BLOCK DCINFO  # Decay Program information
     1   SDECAY/HDECAY # decay calculator
     2   1.3b  /3.4    # version number
#
BLOCK SPINFO  # Spectrum calculator information
     1   SuSpect     # RGE +Spectrum calculator            
     2   2.41         # version number                     
#
BLOCK MODSEL  # Model selection
     1     0   # #general MSSM low scale                           
#
BLOCK SMINPUTS  # Standard Model inputs
         1     1.27934000E+02   # alpha_em^-1(M_Z)^MSbar
         2     1.16639000E-05   # G_F [GeV^-2]
         3     1.17200000E-01   # alpha_S(M_Z)^MSbar
         4     9.11870000E+01   # M_Z pole mass
         5     4.25000000E+00   # mb(mb)^MSbar
         6     1.72500000E+02   # mt pole mass
         7     1.77700000E+00   # mtau pole mass
#
BLOCK MINPAR  # Input parameters - minimal models
#
BLOCK EXTPAR  # Input parameters - non-minimal models
         0     9.11876000E+01   # EWSB                
         1     9.00000000E+02   # M_1                 
         2     1.00000000E+05   # M_2                 
         3     1.00000000E+05   # M_3                 
        11     0.00000000E+00   # A_t                 
        12     0.00000000E+00   # A_b                 
        13     0.00000000E+00   # A_tau               
        14     0.00000000E+00   # A_u                 
        15     0.00000000E+00   # A_d                 
        16     0.00000000E+00   # A_e                 
        23     3.50000000E+03   # mu(EWSB)            
        25     1.50000000E+00   # tanbeta(in)         
        26     2.00000000E+03   # MA_pole             
        31     1.00000000E+05   # M_eL                
        32     1.00000000E+05   # M_muL               
        33     1.00000000E+05   # M_tauL              
        34     1.00000000E+05   # M_eR                
        35     1.00000000E+05   # M_muR               
        36     1.00000000E+05   # M_tauR              
        41     1.90000000E+03   # M_q1L               
        42     1.90000000E+03   # M_q2L               
        43     1.90000000E+03   # M_q3L               
        44     1.00000000E+05   # M_uR                
        45     1.00000000E+05   # M_cR                
        46     1.00000000E+05   # M_tR                
        47     1.90000000E+03   # M_dR                
        48     1.90000000E+03   # M_sR                
        49     1.90000000E+03   # M_bR                
#
BLOCK MASS  # Mass Spectrum
# PDG code           mass       particle
        24     8.05842353E+01   # W+
        25     1.25000000E+02   # h
        35     2.00404642E+03   # H
        36     2.00000000E+03   # A
        37     2.02368945E+03   # H+
         5     4.87877839E+00   # b-quark pole mass calculated from mb(mb)_Msbar
   1000001     1.90034907E+03   # ~d_L
   2000001     1.90006733E+03   # ~d_R
   1000002     1.89971822E+03   # ~u_L
   2000002     9.99999974E+04   # ~u_R
   1000003     1.90034907E+03   # ~s_L
   2000003     1.90006733E+03   # ~s_R
   1000004     1.89971822E+03   # ~c_L
   2000004     9.99999974E+04   # ~c_R
   1000005     1.89663080E+03   # ~b_1
   2000005     1.90378240E+03   # ~b_2
   1000006     1.90543265E+03   # ~t_1
   2000006     1.00000106E+05   # ~t_2
   1000011     1.00000004E+05   # ~e_L
   2000011     1.00000004E+05   # ~e_R
   1000012     9.99999921E+04   # ~nu_eL
   1000013     1.00000004E+05   # ~mu_L
   2000013     1.00000004E+05   # ~mu_R
   1000014     9.99999921E+04   # ~nu_muL
   1000015     9.99999574E+04   # ~tau_1
   2000015     1.00000051E+05   # ~tau_2
   1000016     9.99999921E+04   # ~nu_tauL
   1000021     1.00000000E+05   # ~g
   1000022     8.99279534E+02   # ~chi_10
   1000023    -3.50001976E+03   # ~chi_20
   1000025     3.50067581E+03   # ~chi_30
   1000035     1.00000064E+05   # ~chi_40
   1000024     3.49994021E+03   # ~chi_1+
   1000037     1.00000064E+05   # ~chi_2+
   1000039     1.00000000E-09   # ~gravitino
#
BLOCK NMIX  # Neutralino Mixing Matrix
  1  1     9.99856177E-01   # N_11
  1  2    -1.28457071E-05   # N_12
  1  3     1.33173118E-02   # N_13
  1  4    -1.05011606E-02   # N_14
  2  1     1.99136194E-03   # N_21
  2  2    -1.49605713E-04   # N_22
  2  3    -7.07095389E-01   # N_23
  2  4    -7.07115353E-01   # N_24
  3  1     1.68422026E-02   # N_31
  3  2     8.02129733E-04   # N_32
  3  3    -7.06992607E-01   # N_33
  3  4     7.07019908E-01   # N_34
  4  1     3.67853317E-07   # N_41
  4  2    -9.99999667E-01   # N_42
  4  3    -4.61485506E-04   # N_43
  4  4     6.73045305E-04   # N_44
#
BLOCK UMIX  # Chargino Mixing Matrix U
  1  1    -6.52638855E-04   # U_11
  1  2     9.99999787E-01   # U_12
  2  1     9.99999787E-01   # U_21
  2  2     6.52638855E-04   # U_22
#
BLOCK VMIX  # Chargino Mixing Matrix V
  1  1    -9.51829710E-04   # V_11
  1  2     9.99999547E-01   # V_12
  2  1     9.99999547E-01   # V_21
  2  2     9.51829710E-04   # V_22
#
BLOCK STOPMIX  # Stop Mixing Matrix
  1  1     9.99999999E-01   # cos(theta_t)
  1  2     4.47213589E-05   # sin(theta_t)
  2  1    -4.47213589E-05   # -sin(theta_t)
  2  2     9.99999999E-01   # cos(theta_t)
#
BLOCK SBOTMIX  # Sbottom Mixing Matrix
  1  1     6.93038841E-01   # cos(theta_b)
  1  2     7.20900246E-01   # sin(theta_b)
  2  1    -7.20900246E-01   # -sin(theta_b)
  2  2     6.93038841E-01   # cos(theta_b)
#
BLOCK STAUMIX  # Stau Mixing Matrix
  1  1     7.06210110E-01   # cos(theta_tau)
  1  2     7.08002317E-01   # sin(theta_tau)
  2  1    -7.08002317E-01   # -sin(theta_tau)
  2  2     7.06210110E-01   # cos(theta_tau)
#
BLOCK ALPHA  # Higgs mixing
          -5.90332069E-01   # Mixing angle in the neutral Higgs boson sector
#
BLOCK HMIX Q=  9.11876000E+01  # DRbar Higgs Parameters
         1     3.50000000E+03   # mu(Q)               
         2     1.49999982E+00   # tanbeta(Q)          
         3     2.54872388E+02   # vev(Q)              
         4    -6.81212875E+07   # MA^2(Q)             
#
BLOCK GAUGE Q=  9.11876000E+01  # The gauge couplings
     1     3.50565379E-01   # gprime(Q) DRbar
     2     6.19516399E-01   # g(Q) DRbar
     3     1.02270751E+00   # g3(Q) DRbar
#
BLOCK AU Q=  9.11876000E+01  # The trilinear couplings
  1  1     0.00000000E+00   # A_u(Q) DRbar
  2  2     0.00000000E+00   # A_c(Q) DRbar
  3  3     0.00000000E+00   # A_t(Q) DRbar
#
BLOCK AD Q=  9.11876000E+01  # The trilinear couplings
  1  1     0.00000000E+00   # A_d(Q) DRbar
  2  2     0.00000000E+00   # A_s(Q) DRbar
  3  3     0.00000000E+00   # A_b(Q) DRbar
#
BLOCK AE Q=  9.11876000E+01  # The trilinear couplings
  1  1     0.00000000E+00   # A_e(Q) DRbar
  2  2     0.00000000E+00   # A_mu(Q) DRbar
  3  3     0.00000000E+00   # A_tau(Q) DRbar
#
BLOCK Yu Q=  9.11876000E+01  # The Yukawa couplings
  1  1     0.00000000E+00   # y_u(Q) DRbar
  2  2     0.00000000E+00   # y_c(Q) DRbar
  3  3     9.83633445E-01   # y_t(Q) DRbar
#
BLOCK Yd Q=  9.11876000E+01  # The Yukawa couplings
  1  1     0.00000000E+00   # y_d(Q) DRbar
  2  2     0.00000000E+00   # y_s(Q) DRbar
  3  3     2.58726665E-02   # y_b(Q) DRbar
#
BLOCK Ye Q=  9.11876000E+01  # The Yukawa couplings
  1  1     0.00000000E+00   # y_e(Q) DRbar
  2  2     0.00000000E+00   # y_mu(Q) DRbar
  3  3     1.77399988E-02   # y_tau(Q) DRbar
#
BLOCK MSOFT Q=  9.11876000E+01  # The soft SUSY breaking masses at the scale Q
         1     9.00000000E+02   # M_1                 
         2     1.00000000E+05   # M_2                 
         3     1.00000000E+05   # M_3                 
        14     0.00000000E+00   # A_u                 
        15     0.00000000E+00   # A_d                 
        16     0.00000000E+00   # A_e                 
        21     6.30415952E+08   # M^2_Hd              
        22    -1.15044915E+09   # M^2_Hu              
        31     1.00000000E+05   # M_eL                
        32     1.00000000E+05   # M_muL               
        33     1.00000000E+05   # M_tauL              
        34     1.00000000E+05   # M_eR                
        35     1.00000000E+05   # M_muR               
        36     1.00000000E+05   # M_tauR              
        41     1.90000000E+03   # M_q1L               
        42     1.90000000E+03   # M_q2L               
        43     1.90000000E+03   # M_q3L               
        44     1.00000000E+05   # M_uR                
        45     1.00000000E+05   # M_cR                
        46     1.00000000E+05   # M_tR                
        47     1.90000000E+03   # M_dR                
        48     1.90000000E+03   # M_sR                
        49     1.90000000E+03   # M_bR                
#
#
#
#                             =================
#                             |The decay table|
#                             =================
#
# - The QCD corrections to the decays gluino -> squark  + quark
#                                     squark -> gaugino + quark_prime
#                                     squark -> squark_prime + Higgs
#                                     squark -> gluino  + quark
#   are included.
#
# - The multi-body decays for the inos, stops and sbottoms are included.
#
# - The loop induced decays for the gluino, neutralinos and stops
#   are included.
#
# - The SUSY decays of the top quark are included.
#
# - Possible decays of the NLSP in GMSB models are included.
#
#
#         PDG            Width
DECAY         6     1.32462367E+00   # top decays
#          BR         NDA      ID1       ID2
     1.00000000E+00    2           5        24   # BR(t ->  b    W+)
#
#         PDG            Width
DECAY   1000021     1.E-04   # gluino decays (OJ Mods)
#          BR         NDA      ID1       ID2
     6.39865489E-04    2     1000001        -1   # BR(~g -> ~d_L  db)
     6.39865489E-04    2    -1000001         1   # BR(~g -> ~d_L* d )
     6.39865626E-04    2     2000001        -1   # BR(~g -> ~d_R  db)
     6.39865626E-04    2    -2000001         1   # BR(~g -> ~d_R* d )
     6.39865796E-04    2     1000002        -2   # BR(~g -> ~u_L  ub)
     6.39865796E-04    2    -1000002         2   # BR(~g -> ~u_L* u )
     1.73144658E-18    2     2000002        -2   # BR(~g -> ~u_R  ub)
     1.73144658E-18    2    -2000002         2   # BR(~g -> ~u_R* u )
     6.39865489E-04    2     1000003        -3   # BR(~g -> ~s_L  sb)
     6.39865489E-04    2    -1000003         3   # BR(~g -> ~s_L* s )
     6.39865626E-04    2     2000003        -3   # BR(~g -> ~s_R  sb)
     6.39865626E-04    2    -2000003         3   # BR(~g -> ~s_R* s )
     6.39865796E-04    2     1000004        -4   # BR(~g -> ~c_L  cb)
     6.39865796E-04    2    -1000004         4   # BR(~g -> ~c_L* c )
     1.73144658E-18    2     2000004        -4   # BR(~g -> ~c_R  cb)
     1.73144658E-18    2    -2000004         4   # BR(~g -> ~c_R* c )
     2.42792645E-01    2     1000005        -5   # BR(~g -> ~b_1  bb)
     2.42792645E-01    2    -1000005         5   # BR(~g -> ~b_1* b )
     2.43754781E-01    2     2000005        -5   # BR(~g -> ~b_2  bb)
     2.43754781E-01    2    -2000005         5   # BR(~g -> ~b_2* b )
     6.29758308E-04    2     1000006        -6   # BR(~g -> ~t_1  tb)
     6.29758308E-04    2    -1000006         6   # BR(~g -> ~t_1* t )
     1.79672435E-02    2     1000039        21   # BR(~g -> ~G g)
#
#         PDG            Width
DECAY   1000006     1.85344913E-01   # stop1 decays
#          BR         NDA      ID1       ID2
     1.00000000E+00    2     1000022         6   # BR(~t_1 -> ~chi_10 t )
#
#         PDG            Width
DECAY   2000006     3.03113509E+05   # stop2 decays
#          BR         NDA      ID1       ID2
     6.87739210E-04    2     1000022         6   # BR(~t_2 -> ~chi_10 t )
     1.65402968E-03    2     1000023         6   # BR(~t_2 -> ~chi_20 t )
     1.65374564E-03    2     1000025         6   # BR(~t_2 -> ~chi_30 t )
     9.96060622E-01    2     1000024         5   # BR(~t_2 -> ~chi_1+ b )
    -4.47042152E-05    2     1000006        25   # BR(~t_2 -> ~t_1    h )
     4.68272175E-05    2     1000006        35   # BR(~t_2 -> ~t_1    H )
     4.67441918E-05    2     1000006        36   # BR(~t_2 -> ~t_1    A )
     4.40379093E-05    2     1000005        37   # BR(~t_2 -> ~b_1    H+)
     4.94491516E-05    2     2000005        37   # BR(~t_2 -> ~b_2    H+)
    -3.17947469E-05    2     1000006        23   # BR(~t_2 -> ~t_1    Z )
    -8.00663450E-05    2     1000005        24   # BR(~t_2 -> ~b_1    W+)
    -8.66298373E-05    2     2000005        24   # BR(~t_2 -> ~b_2    W+)
#
#         PDG            Width
DECAY   1000005     5.82153370E+01   # sbottom1 decays
#          BR         NDA      ID1       ID2
     1.00000000E+00    2     1000022         5   # BR(~b_1 -> ~chi_10 b )
#
#         PDG            Width
DECAY   2000005     5.55407716E+01   # sbottom2 decays
#          BR         NDA      ID1       ID2
     1.00000000E+00    2     1000022         5   # BR(~b_2 -> ~chi_10 b )
#
#         PDG            Width
DECAY   1000002     1.89415081E-01   # sup_L decays
#          BR         NDA      ID1       ID2
     1.00000000E+00    2     1000022         2   # BR(~u_L -> ~chi_10 u)
#
#         PDG            Width
DECAY   2000002     2.08407160E+02   # sup_R decays
#          BR         NDA      ID1       ID2
     9.99712706E-01    2     1000022         2   # BR(~u_R -> ~chi_10 u)
     3.96095251E-06    2     1000023         2   # BR(~u_R -> ~chi_20 u)
     2.83332734E-04    2     1000025         2   # BR(~u_R -> ~chi_30 u)
#
#         PDG            Width
DECAY   1000001     1.89595917E-01   # sdown_L decays
#          BR         NDA      ID1       ID2
     1.00000000E+00    2     1000022         1   # BR(~d_L -> ~chi_10 d)
#
#         PDG            Width
DECAY   2000001     7.58049561E-01   # sdown_R decays
#          BR         NDA      ID1       ID2
     1.00000000E+00    2     1000022         1   # BR(~d_R -> ~chi_10 d)
#
#         PDG            Width
DECAY   1000004     1.89415081E-01   # scharm_L decays
#          BR         NDA      ID1       ID2
     1.00000000E+00    2     1000022         4   # BR(~c_L -> ~chi_10 c)
#
#         PDG            Width
DECAY   2000004     2.08407160E+02   # scharm_R decays
#          BR         NDA      ID1       ID2
     9.99712706E-01    2     1000022         4   # BR(~c_R -> ~chi_10 c)
     3.96095251E-06    2     1000023         4   # BR(~c_R -> ~chi_20 c)
     2.83332734E-04    2     1000025         4   # BR(~c_R -> ~chi_30 c)
#
#         PDG            Width
DECAY   1000003     1.89595917E-01   # sstrange_L decays
#          BR         NDA      ID1       ID2
     1.00000000E+00    2     1000022         3   # BR(~s_L -> ~chi_10 s)
#
#         PDG            Width
DECAY   2000003     7.58049561E-01   # sstrange_R decays
#          BR         NDA      ID1       ID2
     1.00000000E+00    2     1000022         3   # BR(~s_R -> ~chi_10 s)
#
#         PDG            Width
DECAY   1000011     1.22227873E+02   # selectron_L decays
#          BR         NDA      ID1       ID2
     9.99661717E-01    2     1000022        11   # BR(~e_L -> ~chi_10 e-)
     2.97562252E-06    2     1000023        11   # BR(~e_L -> ~chi_20 e-)
     3.32652737E-04    2     1000025        11   # BR(~e_L -> ~chi_30 e-)
     2.65428001E-06    2    -1000024        12   # BR(~e_L -> ~chi_1- nu_e)
#
#         PDG            Width
DECAY   2000011     4.88908597E+02   # selectron_R decays
#          BR         NDA      ID1       ID2
     9.99713033E-01    2     1000022        11   # BR(~e_R -> ~chi_10 e-)
     3.95645519E-06    2     1000023        11   # BR(~e_R -> ~chi_20 e-)
     2.83010938E-04    2     1000025        11   # BR(~e_R -> ~chi_30 e-)
#
#         PDG            Width
DECAY   1000013     1.22227873E+02   # smuon_L decays
#          BR         NDA      ID1       ID2
     9.99661717E-01    2     1000022        13   # BR(~mu_L -> ~chi_10 mu-)
     2.97562252E-06    2     1000023        13   # BR(~mu_L -> ~chi_20 mu-)
     3.32652737E-04    2     1000025        13   # BR(~mu_L -> ~chi_30 mu-)
     2.65428001E-06    2    -1000024        14   # BR(~mu_L -> ~chi_1- nu_mu)
#
#         PDG            Width
DECAY   2000013     4.88908597E+02   # smuon_R decays
#          BR         NDA      ID1       ID2
     9.99713033E-01    2     1000022        13   # BR(~mu_R -> ~chi_10 mu-)
     3.95645519E-06    2     1000023        13   # BR(~mu_R -> ~chi_20 mu-)
     2.83010938E-04    2     1000025        13   # BR(~mu_R -> ~chi_30 mu-)
#
#         PDG            Width
DECAY   1000015     1.18199120E+04   # stau_1 decays
#          BR         NDA      ID1       ID2
     2.58934664E-02    2     1000022        15   # BR(~tau_1 -> ~chi_10  tau-)
     2.53386052E-05    2     1000023        15   # BR(~tau_1 -> ~chi_20  tau-)
     2.59429782E-05    2     1000025        15   # BR(~tau_1 -> ~chi_30  tau-)
     2.77046468E-05    2    -1000024        16   # BR(~tau_1 -> ~chi_1-  nu_tau)
     9.74027547E-01    2     1000039        15   # BR(~tau_1 -> ~G       tau-)
#
#         PDG            Width
DECAY   2000015     3.06018040E+02   # stau_2 decays
#          BR         NDA      ID1       ID2
     9.96335218E-01    2     1000022        15   # BR(~tau_2 -> ~chi_10  tau-)
     1.06966125E-03    2     1000023        15   # BR(~tau_2 -> ~chi_20  tau-)
     1.62323141E-03    2     1000025        15   # BR(~tau_2 -> ~chi_30  tau-)
     9.71888940E-04    2    -1000024        16   # BR(~tau_2 -> ~chi_1-  nu_tau)
#
#         PDG            Width
DECAY   1000012     1.22227933E+02   # snu_eL decays
#          BR         NDA      ID1       ID2
     9.99751902E-01    2     1000022        12   # BR(~nu_eL -> ~chi_10 nu_e)
     5.07671318E-06    2     1000023        12   # BR(~nu_eL -> ~chi_20 nu_e)
     2.37375138E-04    2     1000025        12   # BR(~nu_eL -> ~chi_30 nu_e)
     5.64571738E-06    2     1000024        11   # BR(~nu_eL -> ~chi_1+ e-)
#
#         PDG            Width
DECAY   1000014     1.22227933E+02   # snu_muL decays
#          BR         NDA      ID1       ID2
     9.99751902E-01    2     1000022        14   # BR(~nu_muL -> ~chi_10 nu_mu)
     5.07671318E-06    2     1000023        14   # BR(~nu_muL -> ~chi_20 nu_mu)
     2.37375138E-04    2     1000025        14   # BR(~nu_muL -> ~chi_30 nu_mu)
     5.64571738E-06    2     1000024        13   # BR(~nu_muL -> ~chi_1+ mu-)
#
#         PDG            Width
DECAY   1000016     1.22852490E+02   # snu_tauL decays
#          BR         NDA      ID1       ID2
     9.94669364E-01    2     1000022        16   # BR(~nu_tauL -> ~chi_10 nu_tau)
     5.05090419E-06    2     1000023        16   # BR(~nu_tauL -> ~chi_20 nu_tau)
     2.36168370E-04    2     1000025        16   # BR(~nu_tauL -> ~chi_30 nu_tau)
     5.08941706E-03    2     1000024        15   # BR(~nu_tauL -> ~chi_1+ tau-)
#
#         PDG            Width
DECAY   1000024     5.13586810E+01   # chargino1+ decays
#          BR         NDA      ID1       ID2
     4.22318191E-07    2     1000002        -1   # BR(~chi_1+ -> ~u_L     db)
     1.98444548E-07    2    -1000001         2   # BR(~chi_1+ -> ~d_L*    u )
     4.22318191E-07    2     1000004        -3   # BR(~chi_1+ -> ~c_L     sb)
     1.98444548E-07    2    -1000003         4   # BR(~chi_1+ -> ~s_L*    c )
     9.66323968E-02    2     1000006        -5   # BR(~chi_1+ -> ~t_1     bb)
     8.89076692E-02    2    -1000005         6   # BR(~chi_1+ -> ~b_1*    t )
     7.51420468E-01    2    -2000005         6   # BR(~chi_1+ -> ~b_2*    t )
     5.74495206E-02    2     1000022        24   # BR(~chi_1+ -> ~chi_10  W+)
     5.58167328E-03    2     1000022        37   # BR(~chi_1+ -> ~chi_10  H+)
     5.87433519E-06    2     1000039        24   # BR(~chi_1+ -> ~G       W+)
     1.15583574E-06    2     1000039        37   # BR(~chi_1+ -> ~G       H+)
#
#         PDG            Width
DECAY   1000037     1.87824813E+05   # chargino2+ decays
#          BR         NDA      ID1       ID2
     5.50881146E-03    2     1000002        -1   # BR(~chi_2+ -> ~u_L     db)
     5.50881293E-03    2    -1000001         2   # BR(~chi_2+ -> ~d_L*    u )
     5.50881146E-03    2     1000004        -3   # BR(~chi_2+ -> ~c_L     sb)
     5.50881293E-03    2    -1000003         4   # BR(~chi_2+ -> ~s_L*    c )
     9.06211445E-01    2     1000006        -5   # BR(~chi_2+ -> ~t_1     bb)
     1.21405786E-03    2    -1000005         6   # BR(~chi_2+ -> ~b_1*    t )
     5.21792864E-03    2    -2000005         6   # BR(~chi_2+ -> ~b_2*    t )
     3.96034450E-15    2     1000012       -11   # BR(~chi_2+ -> ~nu_eL   e+  )
     3.96034450E-15    2     1000014       -13   # BR(~chi_2+ -> ~nu_muL  mu+ )
     2.75789638E-15    2    -1000011        12   # BR(~chi_2+ -> ~e_L+    nu_e)
     2.75789638E-15    2    -1000013        14   # BR(~chi_2+ -> ~mu_L+   nu_mu)
     4.34151433E-15    2    -1000015        16   # BR(~chi_2+ -> ~tau_1+  nu_tau)
     6.49004790E-17    2    -2000015        16   # BR(~chi_2+ -> ~tau_2+  nu_tau)
     1.00881954E-03    2     1000024        23   # BR(~chi_2+ -> ~chi_1+  Z )
     2.30796704E-07    2     1000022        24   # BR(~chi_2+ -> ~chi_10  W+)
     9.78451777E-04    2     1000023        24   # BR(~chi_2+ -> ~chi_20  W+)
     9.78210406E-04    2     1000025        24   # BR(~chi_2+ -> ~chi_30  W+)
     1.01951647E-03    2     1000024        25   # BR(~chi_2+ -> ~chi_1+  h )
     8.94940063E-04    2     1000024        35   # BR(~chi_2+ -> ~chi_1+  H )
     8.95060281E-04    2     1000024        36   # BR(~chi_2+ -> ~chi_1+  A )
     2.81944443E-07    2     1000022        37   # BR(~chi_2+ -> ~chi_10  H+)
     8.95029255E-04    2     1000023        37   # BR(~chi_2+ -> ~chi_20  H+)
     8.94776379E-04    2     1000025        37   # BR(~chi_2+ -> ~chi_30  H+)
     5.77559861E-02    2     1000039        24   # BR(~chi_2+ -> ~G       W+)
     1.65385797E-08    2     1000039        37   # BR(~chi_2+ -> ~G       H+)
#
#         PDG            Width
DECAY   1000022     1.E-08   # neutralino1 decays (OJ Mods)
#          BR         NDA      ID1       ID2
     7.64862450E-01    2     1000039        22   # BR(~chi_10 -> ~G        gam)
     2.35136747E-01    2     1000039        23   # BR(~chi_10 -> ~G        Z)
     8.02852036E-07    2     1000039        25   # BR(~chi_10 -> ~G        h)
#
#         PDG            Width
DECAY   1000023     1.E-08   # neutralino2 decays (OJ Mods)
#          BR         NDA      ID1       ID2
     5.27481790E-02    2     1000022        23   # BR(~chi_20 -> ~chi_10   Z )
     7.26286054E-04    2     1000022        25   # BR(~chi_20 -> ~chi_10   h )
     4.30247846E-03    2     1000022        35   # BR(~chi_20 -> ~chi_10   H )
     9.63652799E-04    2     1000022        36   # BR(~chi_20 -> ~chi_10   A )
     1.25480455E-08    2     1000002        -2   # BR(~chi_20 -> ~u_L      ub)
     1.25480455E-08    2    -1000002         2   # BR(~chi_20 -> ~u_L*     u )
     6.77305107E-08    2     1000001        -1   # BR(~chi_20 -> ~d_L      db)
     6.77305107E-08    2    -1000001         1   # BR(~chi_20 -> ~d_L*     d )
     1.38594320E-07    2     2000001        -1   # BR(~chi_20 -> ~d_R      db)
     1.38594320E-07    2    -2000001         1   # BR(~chi_20 -> ~d_R*     d )
     1.25480455E-08    2     1000004        -4   # BR(~chi_20 -> ~c_L      cb)
     1.25480455E-08    2    -1000004         4   # BR(~chi_20 -> ~c_L*     c )
     6.77305107E-08    2     1000003        -3   # BR(~chi_20 -> ~s_L      sb)
     6.77305107E-08    2    -1000003         3   # BR(~chi_20 -> ~s_L*     s )
     1.38594320E-07    2     2000003        -3   # BR(~chi_20 -> ~s_R      sb)
     1.38594320E-07    2    -2000003         3   # BR(~chi_20 -> ~s_R*     s )
     3.78613664E-01    2     1000006        -6   # BR(~chi_20 -> ~t_1      tb)
     3.78613664E-01    2    -1000006         6   # BR(~chi_20 -> ~t_1*     t )
     4.46613728E-02    2     1000005        -5   # BR(~chi_20 -> ~b_1      bb)
     4.46613728E-02    2    -1000005         5   # BR(~chi_20 -> ~b_1*     b )
     4.73510959E-02    2     2000005        -5   # BR(~chi_20 -> ~b_2      bb)
     4.73510959E-02    2    -2000005         5   # BR(~chi_20 -> ~b_2*     b )
     2.92829949E-11    2     1000039        22   # BR(~chi_20 -> ~G        gam)
     2.03983656E-07    2     1000039        23   # BR(~chi_20 -> ~G        Z)
     5.09112152E-06    2     1000039        25   # BR(~chi_20 -> ~G        h)
     4.07672550E-08    2     1000039        35   # BR(~chi_20 -> ~G        H)
     1.05173059E-06    2     1000039        36   # BR(~chi_20 -> ~G        A)
#
#         PDG            Width
DECAY   1000025     5.70430868E+01   # neutralino3 decays
#          BR         NDA      ID1       ID2
     7.36870084E-04    2     1000022        23   # BR(~chi_30 -> ~chi_10   Z )
     5.30876068E-02    2     1000022        25   # BR(~chi_30 -> ~chi_10   h )
     9.34013433E-04    2     1000022        35   # BR(~chi_30 -> ~chi_10   H )
     4.32828534E-03    2     1000022        36   # BR(~chi_30 -> ~chi_10   A )
     3.87878558E-06    2     1000002        -2   # BR(~chi_30 -> ~u_L      ub)
     3.87878558E-06    2    -1000002         2   # BR(~chi_30 -> ~u_L*     u )
     1.38087907E-06    2     1000001        -1   # BR(~chi_30 -> ~d_L      db)
     1.38087907E-06    2    -1000001         1   # BR(~chi_30 -> ~d_L*     d )
     9.88743571E-06    2     2000001        -1   # BR(~chi_30 -> ~d_R      db)
     9.88743571E-06    2    -2000001         1   # BR(~chi_30 -> ~d_R*     d )
     3.87878558E-06    2     1000004        -4   # BR(~chi_30 -> ~c_L      cb)
     3.87878558E-06    2    -1000004         4   # BR(~chi_30 -> ~c_L*     c )
     1.38087907E-06    2     1000003        -3   # BR(~chi_30 -> ~s_L      sb)
     1.38087907E-06    2    -1000003         3   # BR(~chi_30 -> ~s_L*     s )
     9.88743571E-06    2     2000003        -3   # BR(~chi_30 -> ~s_R      sb)
     9.88743571E-06    2    -2000003         3   # BR(~chi_30 -> ~s_R*     s )
     3.77670238E-01    2     1000006        -6   # BR(~chi_30 -> ~t_1      tb)
     3.77670238E-01    2    -1000006         6   # BR(~chi_30 -> ~t_1*     t )
     3.74270229E-02    2     1000005        -5   # BR(~chi_30 -> ~b_1      bb)
     3.74270229E-02    2    -1000005         5   # BR(~chi_30 -> ~b_1*     b )
     5.53302038E-02    2     2000005        -5   # BR(~chi_30 -> ~b_2      bb)
     5.53302038E-02    2    -2000005         5   # BR(~chi_30 -> ~b_2*     b )
     2.40433072E-09    2     1000039        22   # BR(~chi_30 -> ~G        gam)
     5.08662427E-06    2     1000039        23   # BR(~chi_30 -> ~G        Z)
     1.98291132E-07    2     1000039        25   # BR(~chi_30 -> ~G        h)
     1.04264325E-06    2     1000039        35   # BR(~chi_30 -> ~G        H)
     4.19880533E-08    2     1000039        36   # BR(~chi_30 -> ~G        A)
#
#         PDG            Width
DECAY   1000035     1.87825600E+05   # neutralino4 decays
#          BR         NDA      ID1       ID2
     1.29219548E-09    2     1000022        23   # BR(~chi_40 -> ~chi_10   Z )
     9.74917606E-04    2     1000023        23   # BR(~chi_40 -> ~chi_20   Z )
     3.38974520E-05    2     1000025        23   # BR(~chi_40 -> ~chi_30   Z )
     9.78441748E-04    2     1000024       -24   # BR(~chi_40 -> ~chi_1+   W-)
     9.78441748E-04    2    -1000024        24   # BR(~chi_40 -> ~chi_1-   W+)
     2.39521911E-07    2     1000022        25   # BR(~chi_40 -> ~chi_10   h )
     2.64716665E-08    2     1000022        35   # BR(~chi_40 -> ~chi_10   H )
     2.55104490E-07    2     1000022        36   # BR(~chi_40 -> ~chi_10   A )
     3.34664134E-05    2     1000023        25   # BR(~chi_40 -> ~chi_20   h )
     8.56463890E-04    2     1000023        35   # BR(~chi_40 -> ~chi_20   H )
     3.93698901E-05    2     1000023        36   # BR(~chi_40 -> ~chi_20   A )
     9.85807561E-04    2     1000025        25   # BR(~chi_40 -> ~chi_30   h )
     3.84450672E-05    2     1000025        35   # BR(~chi_40 -> ~chi_30   H )
     8.55431739E-04    2     1000025        36   # BR(~chi_40 -> ~chi_30   A )
     8.95040816E-04    2     1000024       -37   # BR(~chi_40 -> ~chi_1+   H-)
     8.95040816E-04    2    -1000024        37   # BR(~chi_40 -> ~chi_1-   H+)
     2.63806175E-03    2     1000002        -2   # BR(~chi_40 -> ~u_L      ub)
     2.63806175E-03    2    -1000002         2   # BR(~chi_40 -> ~u_L*     u )
     4.16504668E-23    2     2000002        -2   # BR(~chi_40 -> ~u_R      ub)
     4.16504668E-23    2    -2000002         2   # BR(~chi_40 -> ~u_R*     u )
     2.63806268E-03    2     1000001        -1   # BR(~chi_40 -> ~d_L      db)
     2.63806268E-03    2    -1000001         1   # BR(~chi_40 -> ~d_L*     d )
     5.08024425E-17    2     2000001        -1   # BR(~chi_40 -> ~d_R      db)
     5.08024425E-17    2    -2000001         1   # BR(~chi_40 -> ~d_R*     d )
     2.63806175E-03    2     1000004        -4   # BR(~chi_40 -> ~c_L      cb)
     2.63806175E-03    2    -1000004         4   # BR(~chi_40 -> ~c_L*     c )
     4.16504668E-23    2     2000004        -4   # BR(~chi_40 -> ~c_R      cb)
     4.16504668E-23    2    -2000004         4   # BR(~chi_40 -> ~c_R*     c )
     2.63806268E-03    2     1000003        -3   # BR(~chi_40 -> ~s_L      sb)
     2.63806268E-03    2    -1000003         3   # BR(~chi_40 -> ~s_L*     s )
     5.08024425E-17    2     2000003        -3   # BR(~chi_40 -> ~s_R      sb)
     5.08024425E-17    2    -2000003         3   # BR(~chi_40 -> ~s_R*     s )
     3.21598243E-03    2     1000006        -6   # BR(~chi_40 -> ~t_1      tb)
     3.21598243E-03    2    -1000006         6   # BR(~chi_40 -> ~t_1*     t )
     2.16678784E-01    2     1000005        -5   # BR(~chi_40 -> ~b_1      bb)
     2.16678784E-01    2    -1000005         5   # BR(~chi_40 -> ~b_1*     b )
     2.36427123E-01    2     2000005        -5   # BR(~chi_40 -> ~b_2      bb)
     2.36427123E-01    2    -2000005         5   # BR(~chi_40 -> ~b_2*     b )
     1.37894185E-15    2     1000011       -11   # BR(~chi_40 -> ~e_L-     e+)
     1.37894185E-15    2    -1000011        11   # BR(~chi_40 -> ~e_L+     e-)
     2.38994662E-28    2     2000011       -11   # BR(~chi_40 -> ~e_R-     e+)
     2.38994662E-28    2    -2000011        11   # BR(~chi_40 -> ~e_R+     e-)
     1.37894185E-15    2     1000013       -13   # BR(~chi_40 -> ~mu_L-    mu+)
     1.37894185E-15    2    -1000013        13   # BR(~chi_40 -> ~mu_L+    mu-)
     2.38994662E-28    2     2000013       -13   # BR(~chi_40 -> ~mu_R-    mu+)
     2.38994662E-28    2    -2000013        13   # BR(~chi_40 -> ~mu_R+    mu-)
     1.98016574E-15    2     1000012       -12   # BR(~chi_40 -> ~nu_eL    nu_eb)
     1.98016574E-15    2    -1000012        12   # BR(~chi_40 -> ~nu_eL*   nu_e )
     1.98016574E-15    2     1000014       -14   # BR(~chi_40 -> ~nu_muL   nu_mub)
     1.98016574E-15    2    -1000014        14   # BR(~chi_40 -> ~nu_muL*  nu_mu )
     1.98016574E-15    2     1000016       -16   # BR(~chi_40 -> ~nu_tau1  nu_taub)
     1.98016574E-15    2    -1000016        16   # BR(~chi_40 -> ~nu_tau1* nu_tau )
     1.40083071E-02    2     1000039        22   # BR(~chi_40 -> ~G        gam)
     4.37474469E-02    2     1000039        23   # BR(~chi_40 -> ~G        Z)
     2.63824433E-09    2     1000039        25   # BR(~chi_40 -> ~G        h)
     1.65666313E-08    2     1000039        35   # BR(~chi_40 -> ~G        H)
     3.26449053E-12    2     1000039        36   # BR(~chi_40 -> ~G        A)
#
#
#
#
