#
#                              ======================
#                              | THE SUSYHIT OUTPUT |
#                              ======================
#
#
#              ------------------------------------------------------
#              |     This is the output of the SUSY-HIT package     |
#              |  created by A.Djouadi, M.Muehlleitner and M.Spira. |
#              |  In case of problems with SUSY-HIT email to        |
#              |           margarete.muehlleitner@cern.ch           |
#              |           michael.spira@psi.ch                     |
#              |           abdelhak.djouadi@cern.ch                 |
#              ------------------------------------------------------
#
#              ------------------------------------------------------
#              |  SUSY Les Houches Accord - MSSM Spectrum + Decays  |
#              |              based on the decay programs           |
#              |                                                    |
#              |                     SDECAY 1.3b                    |
#              |                                                    |
#              |  Authors: M.Muhlleitner, A.Djouadi and Y.Mambrini  |
#              |  Ref.:    Comput.Phys.Commun.168(2005)46           |
#              |           [hep-ph/0311167]                         |
#              |                                                    |
#              |                     HDECAY 3.4                     |
#              |                                                    |
#              |  By: A.Djouadi,J.Kalinowski,M.Muhlleitner,M.Spira  |
#              |  Ref.:    Comput.Phys.Commun.108(1998)56           |
#              |           [hep-ph/9704448]                         |
#              |                                                    |
#              |                                                    |
#              |  If not stated otherwise all DRbar couplings and   |
#              |  soft SUSY breaking masses are given at the scale  |
#              |  Q=  0.50007063E+04
#              |                                                    |
#              ------------------------------------------------------
#
#
BLOCK DCINFO  # Decay Program information
     1   SDECAY/HDECAY # decay calculator
     2   1.3b  /3.4    # version number
#
BLOCK SPINFO  # Spectrum calculator information
     1    SOFTSUSY    # spectrum calculator                
     2    3.4.0       # version number                     
#
BLOCK MODSEL  # Model selection
     1     0   #  nonUniversal                                     
#
BLOCK SMINPUTS  # Standard Model inputs
         1     1.25778332E+02   # alpha_em^-1(M_Z)^MSbar
         2     1.16570000E-05   # G_F [GeV^-2]
         3     1.17200002E-01   # alpha_S(M_Z)^MSbar
         4     9.11876000E+01   # M_Z pole mass
         5     4.25000000E+00   # mb(mb)^MSbar
         6     1.72500000E+02   # mt pole mass
         7     1.77682000E+00   # mtau pole mass
#
BLOCK MINPAR  # Input parameters - minimal models
         3     1.00000000E+01   # tanb                
#
BLOCK EXTPAR  # Input parameters - non-minimal models
         0    -1.00000000E+00   # Set                 
         1     6.00000000E+01   # M_1(MX)             
         2     3.00000000E+03   # M_2(MX)             
         3     9.46043000E+02   # M_3(MX)             
        11     5.00000000E+03   # At(MX)              
        12     5.00000000E+03   # Ab(MX)              
        13     0.00000000E+00   # Atau(MX)            
        23    -1.54501300E+03   # mu(MX)              
        26     3.00000000E+03   # mA(pole)            
        31     5.00000000E+03   # meL(MX)             
        32     5.00000000E+03   # mmuL(MX)            
        33     5.00000000E+03   # mtauL(MX)           
        34     5.00000000E+03   # meR(MX)             
        35     5.00000000E+03   # mmuR(MX)            
        36     5.00000000E+03   # mtauR(MX)           
        41     5.00000000E+03   # mqL1(MX)            
        42     5.00000000E+03   # mqL2(MX)            
        43     5.00000000E+03   # mqL3(MX)            
        44     5.00000000E+03   # muR(MX)             
        45     5.00000000E+03   # mcR(MX)             
        46     5.00000000E+03   # mtR(MX)             
        47     5.00000000E+03   # mdR(MX)             
        48     5.00000000E+03   # msR(MX)             
        49     5.00000000E+03   # mbR(MX)             
#
BLOCK MASS  # Mass Spectrum
# PDG code           mass       particle
        24     8.00947112E+01   # W+
        25     1.24462822E+02   # h
        35     3.00008235E+03   # H
        36     2.99999996E+03   # A
        37     3.00087489E+03   # H+
         5     4.87878001E+00   # b-quark pole mass calculated from mb(mb)_Msbar
   1000001     5.06465954E+03   # ~d_L
   2000001     5.04685742E+03   # ~d_R
   1000002     5.06418305E+03   # ~u_L
   2000002     5.04658340E+03   # ~u_R
   1000003     5.06465954E+03   # ~s_L
   2000003     5.04685742E+03   # ~s_R
   1000004     5.06418305E+03   # ~c_L
   2000004     5.04658340E+03   # ~c_R
   1000005     5.01121054E+03   # ~b_1
   2000005     5.04584854E+03   # ~b_2
   1000006     4.90215470E+03   # ~t_1
   2000006     5.05837620E+03   # ~t_2
   1000011     5.01904807E+03   # ~e_L
   2000011     5.00590856E+03   # ~e_R
   1000012     5.01809967E+03   # ~nu_eL
   1000013     5.01904807E+03   # ~mu_L
   2000013     5.00590856E+03   # ~mu_R
   1000014     5.01809967E+03   # ~nu_muL
   1000015     5.00431307E+03   # ~tau_1
   2000015     5.01906485E+03   # ~tau_2
   1000016     5.01756246E+03   # ~nu_tauL
   1000021     1.20000008E+03   # ~g
   1000022     6.03022869E+01   # ~chi_10
   1000023     1.59942752E+03   # ~chi_20
   1000025    -1.60195147E+03   # ~chi_30
   1000035     3.07434660E+03   # ~chi_40
   1000024     1.60000046E+03   # ~chi_1+
   1000037     3.07451418E+03   # ~chi_2+
#
BLOCK NMIX  # Neutralino Mixing Matrix
  1  1     9.99609522E-01   # N_11
  1  2     1.33185806E-04   # N_12
  1  3    -2.78798499E-02   # N_13
  1  4     1.87072620E-03   # N_14
  2  1     1.83894173E-02   # N_21
  2  2     3.29943273E-02   # N_22
  2  3     7.06888803E-01   # N_23
  2  4     7.06315385E-01   # N_24
  3  1    -2.10336511E-02   # N_31
  3  2     1.29798584E-02   # N_32
  3  3    -7.06633234E-01   # N_33
  3  4     7.07148204E-01   # N_34
  4  1    -4.67160171E-04   # N_41
  4  2     9.99371242E-01   # N_42
  4  3    -1.41565090E-02   # N_43
  4  4    -3.25037707E-02   # N_44
#
BLOCK UMIX  # Chargino Mixing Matrix U
  1  1     2.00242504E-02   # U_11
  1  2     9.99799495E-01   # U_12
  2  1    -9.99799495E-01   # U_21
  2  2     2.00242504E-02   # U_22
#
BLOCK VMIX  # Chargino Mixing Matrix V
  1  1     4.59791410E-02   # V_11
  1  2    -9.98942400E-01   # V_12
  2  1    -9.98942400E-01   # V_21
  2  2    -4.59791410E-02   # V_22
#
BLOCK STOPMIX  # Stop Mixing Matrix
  1  1    -5.14641798E-01   # cos(theta_t)
  1  2     8.57405283E-01   # sin(theta_t)
  2  1    -8.57405283E-01   # -sin(theta_t)
  2  2    -5.14641798E-01   # cos(theta_t)
#
BLOCK SBOTMIX  # Sbottom Mixing Matrix
  1  1     9.93786058E-01   # cos(theta_b)
  1  2    -1.11307102E-01   # sin(theta_b)
  2  1     1.11307102E-01   # -sin(theta_b)
  2  2     9.93786058E-01   # cos(theta_b)
#
BLOCK STAUMIX  # Stau Mixing Matrix
  1  1    -1.78634144E-01   # cos(theta_tau)
  1  2     9.83915567E-01   # sin(theta_tau)
  2  1    -9.83915567E-01   # -sin(theta_tau)
  2  2    -1.78634144E-01   # cos(theta_tau)
#
BLOCK ALPHA  # Higgs mixing
          -1.05427824E-01   # Mixing angle in the neutral Higgs boson sector
#
BLOCK HMIX Q=  5.00070626E+03  # DRbar Higgs Parameters
         1    -1.57275653E+03   # mu(Q)MSSM           
         2     9.47347714E+00   # tan                 
         3     2.42024281E+02   # higgs               
         4     8.37616579E+06   # mA^2(Q)MSSM         
#
BLOCK GAUGE Q=  5.00070626E+03  # The gauge couplings
     1     3.70702565E-01   # gprime(Q) DRbar
     2     6.32057904E-01   # g(Q) DRbar
     3     1.00596296E+00   # g3(Q) DRbar
#
BLOCK AU Q=  5.00070626E+03  # The trilinear couplings
  1  1     5.00000001E+03   # A_u(Q) DRbar
  2  2     5.00000001E+03   # A_c(Q) DRbar
  3  3     5.00000001E+03   # A_t(Q) DRbar
#
BLOCK AD Q=  5.00070626E+03  # The trilinear couplings
  1  1     5.00000000E+03   # A_d(Q) DRbar
  2  2     5.00000000E+03   # A_s(Q) DRbar
  3  3     5.00000001E+03   # A_b(Q) DRbar
#
BLOCK AE Q=  5.00070626E+03  # The trilinear couplings
  1  1     0.00000000E+00   # A_e(Q) DRbar
  2  2     5.01746426E-08   # A_mu(Q) DRbar
  3  3     4.93293047E-08   # A_tau(Q) DRbar
#
BLOCK Yu Q=  5.00070626E+03  # The Yukawa couplings
  1  1     0.00000000E+00   # y_u(Q) DRbar
  2  2     0.00000000E+00   # y_c(Q) DRbar
  3  3     8.15460760E-01   # y_t(Q) DRbar
#
BLOCK Yd Q=  5.00070626E+03  # The Yukawa couplings
  1  1     0.00000000E+00   # y_d(Q) DRbar
  2  2     0.00000000E+00   # y_s(Q) DRbar
  3  3     1.30203870E-01   # y_b(Q) DRbar
#
BLOCK Ye Q=  5.00070626E+03  # The Yukawa couplings
  1  1     0.00000000E+00   # y_e(Q) DRbar
  2  2     0.00000000E+00   # y_mu(Q) DRbar
  3  3     9.66039712E-02   # y_tau(Q) DRbar
#
BLOCK MSOFT Q=  5.00070626E+03  # The soft SUSY breaking masses at the scale Q
         1     6.00000000E+01   # M_1(Q)              
         2     3.00000000E+03   # M_2(Q)              
         3     9.46043000E+02   # M_3(Q)              
        21     6.19057371E+06   # mH1^2(Q)            
        22    -1.93225379E+06   # mH2^2(Q)            
        31     5.00000000E+03   # meL(Q)              
        32     5.00000000E+03   # mmuL(Q)             
        33     5.00000000E+03   # mtauL(Q)            
        34     5.00000000E+03   # meR(Q)              
        35     5.00000000E+03   # mmuR(Q)             
        36     5.00000000E+03   # mtauR(Q)            
        41     5.00000000E+03   # mqL1(Q)             
        42     5.00000000E+03   # mqL2(Q)             
        43     5.00000000E+03   # mqL3(Q)             
        44     5.00000000E+03   # muR(Q)              
        45     5.00000000E+03   # mcR(Q)              
        46     5.00000000E+03   # mtR(Q)              
        47     5.00000000E+03   # mdR(Q)              
        48     5.00000000E+03   # msR(Q)              
        49     5.00000000E+03   # mbR(Q)              
#
#
#
#                             =================
#                             |The decay table|
#                             =================
#
# - The QCD corrections to the decays gluino -> squark  + quark
#                                     squark -> gaugino + quark_prime
#                                     squark -> squark_prime + Higgs
#                                     squark -> gluino  + quark
#   are included.
#
# - The multi-body decays for the inos, stops and sbottoms are included.
#
# - The loop induced decays for the gluino, neutralinos and stops
#   are included.
#
# - The SUSY decays of the top quark are included.
#
#
#         PDG            Width
DECAY         6     1.39998632E+00   # top decays
#          BR         NDA      ID1       ID2
     1.00000000E+00    2           5        24   # BR(t ->  b    W+)
#
#         PDG            Width
DECAY   1000021     2.16494986E-05   # gluino decays
#          BR         NDA      ID1       ID2
     1.57023956E-05    2     1000022        21   # BR(~g -> ~chi_10 g)
#           BR         NDA      ID1       ID2       ID3
     8.03960515E-02    3     1000022         1        -1   # BR(~g -> ~chi_10 d  db)
     2.74059114E-01    3     1000022         2        -2   # BR(~g -> ~chi_10 u  ub)
     8.03960515E-02    3     1000022         3        -3   # BR(~g -> ~chi_10 s  sb)
     2.74059114E-01    3     1000022         4        -4   # BR(~g -> ~chi_10 c  cb)
     8.13507362E-02    3     1000022         5        -5   # BR(~g -> ~chi_10 b  bb)
     2.09723231E-01    3     1000022         6        -6   # BR(~g -> ~chi_10 t  tb)
#
#         PDG            Width
DECAY   1000006     3.89370589E+02   # stop1 decays
#          BR         NDA      ID1       ID2
     2.24692625E-02    2     1000022         6   # BR(~t_1 -> ~chi_10 t )
     6.72519746E-02    2     1000023         6   # BR(~t_1 -> ~chi_20 t )
     6.45735318E-02    2     1000025         6   # BR(~t_1 -> ~chi_30 t )
     5.69220434E-03    2     1000035         6   # BR(~t_1 -> ~chi_40 t )
     9.59385798E-02    2     1000024         5   # BR(~t_1 -> ~chi_1+ b )
     1.13163269E-02    2     1000037         5   # BR(~t_1 -> ~chi_2+ b )
     7.32758120E-01    2     1000021         6   # BR(~t_1 -> ~g      t )
#
#         PDG            Width
DECAY   2000006     3.96211992E+02   # stop2 decays
#          BR         NDA      ID1       ID2
     9.14606279E-03    2     1000022         6   # BR(~t_2 -> ~chi_10 t )
     6.86163509E-02    2     1000023         6   # BR(~t_2 -> ~chi_20 t )
     7.14670137E-02    2     1000025         6   # BR(~t_2 -> ~chi_30 t )
     1.35662560E-02    2     1000035         6   # BR(~t_2 -> ~chi_40 t )
     4.29657853E-02    2     1000024         5   # BR(~t_2 -> ~chi_1+ b )
     2.69221628E-02    2     1000037         5   # BR(~t_2 -> ~chi_2+ b )
     7.63956100E-01    2     1000021         6   # BR(~t_2 -> ~g      t )
     7.29022237E-04    2     1000006        25   # BR(~t_2 -> ~t_1    h )
     2.63124658E-03    2     1000006        23   # BR(~t_2 -> ~t_1    Z )
#
#         PDG            Width
DECAY   1000005     3.74906407E+02   # sbottom1 decays
#          BR         NDA      ID1       ID2
     2.09719777E-03    2     1000022         5   # BR(~b_1 -> ~chi_10 b )
     1.91430426E-03    2     1000023         5   # BR(~b_1 -> ~chi_20 b )
     1.79682389E-03    2     1000025         5   # BR(~b_1 -> ~chi_30 b )
     1.98199397E-02    2     1000035         5   # BR(~b_1 -> ~chi_40 b )
     1.41805555E-01    2    -1000024         6   # BR(~b_1 -> ~chi_1- t )
     3.99192613E-02    2    -1000037         6   # BR(~b_1 -> ~chi_2- t )
     7.91152463E-01    2     1000021         5   # BR(~b_1 -> ~g      b )
     1.49445486E-03    2     1000006       -24   # BR(~b_1 -> ~t_1    W-)
#
#         PDG            Width
DECAY   2000005     3.05600790E+02   # sbottom2 decays
#          BR         NDA      ID1       ID2
     9.58191124E-03    2     1000022         5   # BR(~b_2 -> ~chi_10 b )
     2.22529467E-03    2     1000023         5   # BR(~b_2 -> ~chi_20 b )
     2.33555657E-03    2     1000025         5   # BR(~b_2 -> ~chi_30 b )
     3.28873998E-04    2     1000035         5   # BR(~b_2 -> ~chi_40 b )
     6.67746198E-03    2    -1000024         6   # BR(~b_2 -> ~chi_1- t )
     6.62019818E-04    2    -1000037         6   # BR(~b_2 -> ~chi_2- t )
     9.78093532E-01    2     1000021         5   # BR(~b_2 -> ~g      b )
     9.53499487E-05    2     1000006       -24   # BR(~b_2 -> ~t_1    W-)
#
#         PDG            Width
DECAY   1000002     3.24365899E+02   # sup_L decays
#          BR         NDA      ID1       ID2
     2.30415156E-03    2     1000022         2   # BR(~u_L -> ~chi_10 u)
     6.54017982E-05    2     1000023         2   # BR(~u_L -> ~chi_20 u)
     3.83885966E-06    2     1000025         2   # BR(~u_L -> ~chi_30 u)
     2.40361322E-02    2     1000035         2   # BR(~u_L -> ~chi_40 u)
     2.06519101E-04    2     1000024         1   # BR(~u_L -> ~chi_1+ d)
     4.80337165E-02    2     1000037         1   # BR(~u_L -> ~chi_2+ d)
     9.25350240E-01    2     1000021         2   # BR(~u_L -> ~g      u)
#
#         PDG            Width
DECAY   2000002     3.10768114E+02   # sup_R decays
#          BR         NDA      ID1       ID2
     3.82930291E-02    2     1000022         2   # BR(~u_R -> ~chi_10 u)
     1.04915584E-05    2     1000023         2   # BR(~u_R -> ~chi_20 u)
     1.37159713E-05    2     1000025         2   # BR(~u_R -> ~chi_30 u)
     3.31433237E-09    2     1000035         2   # BR(~u_R -> ~chi_40 u)
     9.61682760E-01    2     1000021         2   # BR(~u_R -> ~g      u)
#
#         PDG            Width
DECAY   1000001     3.24377391E+02   # sdown_L decays
#          BR         NDA      ID1       ID2
     2.29801448E-03    2     1000022         1   # BR(~d_L -> ~chi_10 d)
     4.22271703E-05    2     1000023         1   # BR(~d_L -> ~chi_20 d)
     1.42626341E-05    2     1000025         1   # BR(~d_L -> ~chi_30 d)
     2.40515800E-02    2     1000035         1   # BR(~d_L -> ~chi_40 d)
     3.91737113E-05    2    -1000024         2   # BR(~d_L -> ~chi_1- u)
     4.81295067E-02    2    -1000037         2   # BR(~d_L -> ~chi_2- u)
     9.25425235E-01    2     1000021         1   # BR(~d_L -> ~g      d)
#
#         PDG            Width
DECAY   2000001     3.01857561E+02   # sdown_R decays
#          BR         NDA      ID1       ID2
     9.85638826E-03    2     1000022         1   # BR(~d_R -> ~chi_10 d)
     2.70052721E-06    2     1000023         1   # BR(~d_R -> ~chi_20 d)
     3.53049139E-06    2     1000025         1   # BR(~d_R -> ~chi_30 d)
     8.53197071E-10    2     1000035         1   # BR(~d_R -> ~chi_40 d)
     9.90137380E-01    2     1000021         1   # BR(~d_R -> ~g      d)
#
#         PDG            Width
DECAY   1000004     3.24365899E+02   # scharm_L decays
#          BR         NDA      ID1       ID2
     2.30415156E-03    2     1000022         4   # BR(~c_L -> ~chi_10 c)
     6.54017982E-05    2     1000023         4   # BR(~c_L -> ~chi_20 c)
     3.83885966E-06    2     1000025         4   # BR(~c_L -> ~chi_30 c)
     2.40361322E-02    2     1000035         4   # BR(~c_L -> ~chi_40 c)
     2.06519101E-04    2     1000024         3   # BR(~c_L -> ~chi_1+ s)
     4.80337165E-02    2     1000037         3   # BR(~c_L -> ~chi_2+ s)
     9.25350240E-01    2     1000021         4   # BR(~c_L -> ~g      c)
#
#         PDG            Width
DECAY   2000004     3.10768114E+02   # scharm_R decays
#          BR         NDA      ID1       ID2
     3.82930291E-02    2     1000022         4   # BR(~c_R -> ~chi_10 c)
     1.04915584E-05    2     1000023         4   # BR(~c_R -> ~chi_20 c)
     1.37159713E-05    2     1000025         4   # BR(~c_R -> ~chi_30 c)
     3.31433237E-09    2     1000035         4   # BR(~c_R -> ~chi_40 c)
     9.61682760E-01    2     1000021         4   # BR(~c_R -> ~g      c)
#
#         PDG            Width
DECAY   1000003     3.24377391E+02   # sstrange_L decays
#          BR         NDA      ID1       ID2
     2.29801448E-03    2     1000022         3   # BR(~s_L -> ~chi_10 s)
     4.22271703E-05    2     1000023         3   # BR(~s_L -> ~chi_20 s)
     1.42626341E-05    2     1000025         3   # BR(~s_L -> ~chi_30 s)
     2.40515800E-02    2     1000035         3   # BR(~s_L -> ~chi_40 s)
     3.91737113E-05    2    -1000024         4   # BR(~s_L -> ~chi_1- c)
     4.81295067E-02    2    -1000037         4   # BR(~s_L -> ~chi_2- c)
     9.25425235E-01    2     1000021         3   # BR(~s_L -> ~g      s)
#
#         PDG            Width
DECAY   2000003     3.01857561E+02   # sstrange_R decays
#          BR         NDA      ID1       ID2
     9.85638826E-03    2     1000022         3   # BR(~s_R -> ~chi_10 s)
     2.70052721E-06    2     1000023         3   # BR(~s_R -> ~chi_20 s)
     3.53049139E-06    2     1000025         3   # BR(~s_R -> ~chi_30 s)
     8.53197071E-10    2     1000035         3   # BR(~s_R -> ~chi_40 s)
     9.90137380E-01    2     1000021         3   # BR(~s_R -> ~g      s)
#
#         PDG            Width
DECAY   1000011     3.02361332E+01   # selectron_L decays
#          BR         NDA      ID1       ID2
     2.26766612E-01    2     1000022        11   # BR(~e_L -> ~chi_10 e-)
     1.02056734E-03    2     1000023        11   # BR(~e_L -> ~chi_20 e-)
     2.20404195E-07    2     1000025        11   # BR(~e_L -> ~chi_30 e-)
     2.57043377E-01    2     1000035        11   # BR(~e_L -> ~chi_40 e-)
     4.26940667E-04    2    -1000024        12   # BR(~e_L -> ~chi_1- nu_e)
     5.14742283E-01    2    -1000037        12   # BR(~e_L -> ~chi_2- nu_e)
#
#         PDG            Width
DECAY   2000011     2.73591378E+01   # selectron_R decays
#          BR         NDA      ID1       ID2
     9.99370546E-01    2     1000022        11   # BR(~e_R -> ~chi_10 e-)
     2.72770818E-04    2     1000023        11   # BR(~e_R -> ~chi_20 e-)
     3.56598354E-04    2     1000025        11   # BR(~e_R -> ~chi_30 e-)
     8.46952851E-08    2     1000035        11   # BR(~e_R -> ~chi_40 e-)
#
#         PDG            Width
DECAY   1000013     3.02361332E+01   # smuon_L decays
#          BR         NDA      ID1       ID2
     2.26766612E-01    2     1000022        13   # BR(~mu_L -> ~chi_10 mu-)
     1.02056734E-03    2     1000023        13   # BR(~mu_L -> ~chi_20 mu-)
     2.20404195E-07    2     1000025        13   # BR(~mu_L -> ~chi_30 mu-)
     2.57043377E-01    2     1000035        13   # BR(~mu_L -> ~chi_40 mu-)
     4.26940667E-04    2    -1000024        14   # BR(~mu_L -> ~chi_1- nu_mu)
     5.14742283E-01    2    -1000037        14   # BR(~mu_L -> ~chi_2- nu_mu)
#
#         PDG            Width
DECAY   2000013     2.73591378E+01   # smuon_R decays
#          BR         NDA      ID1       ID2
     9.99370546E-01    2     1000022        13   # BR(~mu_R -> ~chi_10 mu-)
     2.72770818E-04    2     1000023        13   # BR(~mu_R -> ~chi_20 mu-)
     3.56598354E-04    2     1000025        13   # BR(~mu_R -> ~chi_30 mu-)
     8.46952851E-08    2     1000035        13   # BR(~mu_R -> ~chi_40 mu-)
#
#         PDG            Width
DECAY   1000015     2.89396019E+01   # stau_1 decays
#          BR         NDA      ID1       ID2
     9.22766743E-01    2     1000022        15   # BR(~tau_1 -> ~chi_10  tau-)
     1.38769217E-02    2     1000023        15   # BR(~tau_1 -> ~chi_20  tau-)
     1.24875079E-02    2     1000025        15   # BR(~tau_1 -> ~chi_30  tau-)
     8.20035829E-03    2     1000035        15   # BR(~tau_1 -> ~chi_40  tau-)
     2.62465627E-02    2    -1000024        16   # BR(~tau_1 -> ~chi_1-  nu_tau)
     1.64219064E-02    2    -1000037        16   # BR(~tau_1 -> ~chi_2-  nu_tau)
#
#         PDG            Width
DECAY   2000015     3.08913358E+01   # stau_2 decays
#          BR         NDA      ID1       ID2
     2.42416129E-01    2     1000022        15   # BR(~tau_2 -> ~chi_10  tau-)
     1.25210702E-02    2     1000023        15   # BR(~tau_2 -> ~chi_20  tau-)
     1.28692138E-02    2     1000025        15   # BR(~tau_2 -> ~chi_30  tau-)
     2.43838105E-01    2     1000035        15   # BR(~tau_2 -> ~chi_40  tau-)
     6.01155395E-05    2    -1000024        16   # BR(~tau_2 -> ~chi_1-  nu_tau)
     4.88295366E-01    2    -1000037        16   # BR(~tau_2 -> ~chi_2-  nu_tau)
#
#         PDG            Width
DECAY   1000012     3.02379906E+01   # snu_eL decays
#          BR         NDA      ID1       ID2
     2.26503894E-01    2     1000022        12   # BR(~nu_eL -> ~chi_10 nu_e)
     2.62545286E-04    2     1000023        12   # BR(~nu_eL -> ~chi_20 nu_e)
     3.40904957E-04    2     1000025        12   # BR(~nu_eL -> ~chi_30 nu_e)
     2.57144203E-01    2     1000035        12   # BR(~nu_eL -> ~chi_40 nu_e)
     2.25025017E-03    2     1000024        11   # BR(~nu_eL -> ~chi_1+ e-)
     5.13498203E-01    2     1000037        11   # BR(~nu_eL -> ~chi_2+ e-)
#
#         PDG            Width
DECAY   1000014     3.02379906E+01   # snu_muL decays
#          BR         NDA      ID1       ID2
     2.26503894E-01    2     1000022        14   # BR(~nu_muL -> ~chi_10 nu_mu)
     2.62545286E-04    2     1000023        14   # BR(~nu_muL -> ~chi_20 nu_mu)
     3.40904957E-04    2     1000025        14   # BR(~nu_muL -> ~chi_30 nu_mu)
     2.57144203E-01    2     1000035        14   # BR(~nu_muL -> ~chi_40 nu_mu)
     2.25025017E-03    2     1000024        13   # BR(~nu_muL -> ~chi_1+ mu-)
     5.13498203E-01    2     1000037        13   # BR(~nu_muL -> ~chi_2+ mu-)
#
#         PDG            Width
DECAY   1000016     3.09803792E+01   # snu_tauL decays
#          BR         NDA      ID1       ID2
     2.21052458E-01    2     1000022        16   # BR(~nu_tauL -> ~chi_10 nu_tau)
     2.56214022E-04    2     1000023        16   # BR(~nu_tauL -> ~chi_20 nu_tau)
     3.32683998E-04    2     1000025        16   # BR(~nu_tauL -> ~chi_30 nu_tau)
     2.50890761E-01    2     1000035        16   # BR(~nu_tauL -> ~chi_40 nu_tau)
     2.64551229E-02    2     1000024        15   # BR(~nu_tauL -> ~chi_1+ tau-)
     5.01012761E-01    2     1000037        15   # BR(~nu_tauL -> ~chi_2+ tau-)
#
#         PDG            Width
DECAY   1000024     9.85745238E-01   # chargino1+ decays
#          BR         NDA      ID1       ID2
     1.00000000E+00    2     1000022        24   # BR(~chi_1+ -> ~chi_10  W+)
#
#         PDG            Width
DECAY   1000037     1.79134774E+01   # chargino2+ decays
#          BR         NDA      ID1       ID2
     2.52593692E-01    2     1000024        23   # BR(~chi_2+ -> ~chi_1+  Z )
     2.84990601E-04    2     1000022        24   # BR(~chi_2+ -> ~chi_10  W+)
     2.44142954E-01    2     1000023        24   # BR(~chi_2+ -> ~chi_20  W+)
     2.43579180E-01    2     1000025        24   # BR(~chi_2+ -> ~chi_30  W+)
     2.59398906E-01    2     1000024        25   # BR(~chi_2+ -> ~chi_1+  h )
     2.76963007E-07    2     1000022        37   # BR(~chi_2+ -> ~chi_10  H+)
#
#         PDG            Width
DECAY   1000022     0.00000000E+00   # neutralino1 decays
#
#         PDG            Width
DECAY   1000023     1.03638593E+00   # neutralino2 decays
#          BR         NDA      ID1       ID2
     5.58700428E-01    2     1000022        23   # BR(~chi_20 -> ~chi_10   Z )
     4.41299572E-01    2     1000022        25   # BR(~chi_20 -> ~chi_10   h )
#
#         PDG            Width
DECAY   1000025     1.04717178E+00   # neutralino3 decays
#          BR         NDA      ID1       ID2
     4.23693046E-01    2     1000022        23   # BR(~chi_30 -> ~chi_10   Z )
     5.76306954E-01    2     1000022        25   # BR(~chi_30 -> ~chi_10   h )
#
#         PDG            Width
DECAY   1000035     1.79078203E+01   # neutralino4 decays
#          BR         NDA      ID1       ID2
     1.07998203E-04    2     1000022        23   # BR(~chi_40 -> ~chi_10   Z )
     3.40828690E-02    2     1000023        23   # BR(~chi_40 -> ~chi_20   Z )
     2.18098390E-01    2     1000025        23   # BR(~chi_40 -> ~chi_30   Z )
     2.44234737E-01    2     1000024       -24   # BR(~chi_40 -> ~chi_1+   W-)
     2.44234737E-01    2    -1000024        24   # BR(~chi_40 -> ~chi_1-   W+)
     1.84736559E-04    2     1000022        25   # BR(~chi_40 -> ~chi_10   h )
     2.47298244E-07    2     1000022        35   # BR(~chi_40 -> ~chi_10   H )
     3.99681821E-08    2     1000022        36   # BR(~chi_40 -> ~chi_10   A )
     2.25066739E-01    2     1000023        25   # BR(~chi_40 -> ~chi_20   h )
     3.39895058E-02    2     1000025        25   # BR(~chi_40 -> ~chi_30   h )
#
#         PDG            Width
DECAY        25     4.02062253E-03   # h decays
#          BR         NDA      ID1       ID2
     6.13400247E-01    2           5        -5   # BR(h -> b       bb     )
     6.43421939E-02    2         -15        15   # BR(h -> tau+    tau-   )
     2.27796142E-04    2         -13        13   # BR(h -> mu+     mu-    )
     4.83149663E-04    2           3        -3   # BR(h -> s       sb     )
     2.09381450E-02    2           4        -4   # BR(h -> c       cb     )
     6.73694780E-02    2          21        21   # BR(h -> g       g      )
     2.30938930E-03    2          22        22   # BR(h -> gam     gam    )
     1.46279721E-03    2          22        23   # BR(h -> Z       gam    )
     2.05125841E-01    2          24       -24   # BR(h -> W+      W-     )
     2.43142525E-02    2          23        23   # BR(h -> Z       Z      )
     2.67098898E-05    2     1000022   1000022   # BR(h -> ~chi_10 ~chi_10)
#
#         PDG            Width
DECAY        35     7.07751111E+00   # H decays
#          BR         NDA      ID1       ID2
     4.61089411E-01    2           5        -5   # BR(H -> b       bb     )
     7.87762880E-02    2         -15        15   # BR(H -> tau+    tau-   )
     2.78559212E-04    2         -13        13   # BR(H -> mu+     mu-    )
     3.41470973E-04    2           3        -3   # BR(H -> s       sb     )
     1.90693399E-06    2           4        -4   # BR(H -> c       cb     )
     1.90517809E-01    2           6        -6   # BR(H -> t       tb     )
     6.32102337E-05    2          21        21   # BR(H -> g       g      )
     3.82652253E-07    2          22        22   # BR(H -> gam     gam    )
     1.12434179E-07    2          23        22   # BR(H -> Z       gam    )
     8.38488494E-05    2          24       -24   # BR(H -> W+      W-     )
     4.18713568E-05    2          23        23   # BR(H -> Z       Z      )
     3.20769873E-04    2          25        25   # BR(H -> h       h      )
     2.61213607E-23    2          36        36   # BR(H -> A       A      )
     1.03704318E-18    2          23        36   # BR(H -> Z       A      )
     7.97721826E-04    2     1000022   1000022   # BR(H -> ~chi_10 ~chi_10)
     1.58651369E-01    2     1000022   1000023   # BR(H -> ~chi_10 ~chi_20)
     1.09035269E-01    2     1000022   1000025   # BR(H -> ~chi_10 ~chi_30)
#
#         PDG            Width
DECAY        36     7.08030252E+00   # A decays
#          BR         NDA      ID1       ID2
     4.61062255E-01    2           5        -5   # BR(A -> b       bb     )
     7.87474965E-02    2         -15        15   # BR(A -> tau+    tau-   )
     2.78457013E-04    2         -13        13   # BR(A -> mu+     mu-    )
     3.41594960E-04    2           3        -3   # BR(A -> s       sb     )
     1.91420521E-06    2           4        -4   # BR(A -> c       cb     )
     1.91138743E-01    2           6        -6   # BR(A -> t       tb     )
     1.89209878E-04    2          21        21   # BR(A -> g       g      )
     3.23568169E-07    2          22        22   # BR(A -> gam     gam    )
     2.29101758E-07    2          23        22   # BR(A -> Z       gam    )
     8.35011236E-05    2          23        25   # BR(A -> Z       h      )
     8.21702010E-04    2     1000022   1000022   # BR(A -> ~chi_10 ~chi_10)
     1.10283845E-01    2     1000022   1000023   # BR(A -> ~chi_10 ~chi_20)
     1.57050728E-01    2     1000022   1000025   # BR(A -> ~chi_10 ~chi_30)
#
#         PDG            Width
DECAY        37     7.06254865E+00   # H+ decays
#          BR         NDA      ID1       ID2
     7.39573133E-04    2           4        -5   # BR(H+ -> c       bb     )
     7.89684763E-02    2         -15        16   # BR(H+ -> tau+    nu_tau )
     2.79238414E-04    2         -13        14   # BR(H+ -> mu+     nu_mu  )
     4.73324374E-06    2           2        -5   # BR(H+ -> u       bb     )
     1.63851273E-05    2           2        -3   # BR(H+ -> u       sb     )
     3.38842613E-04    2           4        -3   # BR(H+ -> c       sb     )
     6.49841703E-01    2           6        -5   # BR(H+ -> t       bb     )
     8.38380502E-05    2          24        25   # BR(H+ -> W+      h      )
     9.54119414E-14    2          24        36   # BR(H+ -> W+      A      )
     2.69727210E-01    2     1000024   1000022   # BR(H+ -> ~chi_1+ ~chi_10)
