#
#                              ======================
#                              | THE SUSYHIT OUTPUT |
#                              ======================
#
#
#              ------------------------------------------------------
#              |     This is the output of the SUSY-HIT package     |
#              |  created by A.Djouadi, M.Muehlleitner and M.Spira. |
#              |  In case of problems with SUSY-HIT email to        |
#              |           margarete.muehlleitner@cern.ch           |
#              |           michael.spira@psi.ch                     |
#              |           abdelhak.djouadi@cern.ch                 |
#              ------------------------------------------------------
#
#              ------------------------------------------------------
#              |  SUSY Les Houches Accord - MSSM Spectrum + Decays  |
#              |              based on the decay programs           |
#              |                                                    |
#              |                     SDECAY 1.3b                    |
#              |                                                    |
#              |  Authors: M.Muhlleitner, A.Djouadi and Y.Mambrini  |
#              |  Ref.:    Comput.Phys.Commun.168(2005)46           |
#              |           [hep-ph/0311167]                         |
#              |                                                    |
#              |                     HDECAY 3.4                     |
#              |                                                    |
#              |  By: A.Djouadi,J.Kalinowski,M.Muhlleitner,M.Spira  |
#              |  Ref.:    Comput.Phys.Commun.108(1998)56           |
#              |           [hep-ph/9704448]                         |
#              |                                                    |
#              |                                                    |
#              |  If not stated otherwise all DRbar couplings and   |
#              |  soft SUSY breaking masses are given at the scale  |
#              |  Q=  0.50007720E+04
#              |                                                    |
#              ------------------------------------------------------
#
#
BLOCK DCINFO  # Decay Program information
     1   SDECAY/HDECAY # decay calculator
     2   1.3b  /3.4    # version number
#
BLOCK SPINFO  # Spectrum calculator information
     1    SOFTSUSY    # spectrum calculator                
     2    3.4.0       # version number                     
#
BLOCK MODSEL  # Model selection
     1     0   #  nonUniversal                                     
#
BLOCK SMINPUTS  # Standard Model inputs
         1     1.25778332E+02   # alpha_em^-1(M_Z)^MSbar
         2     1.16570000E-05   # G_F [GeV^-2]
         3     1.17200002E-01   # alpha_S(M_Z)^MSbar
         4     9.11876000E+01   # M_Z pole mass
         5     4.25000000E+00   # mb(mb)^MSbar
         6     1.72500000E+02   # mt pole mass
         7     1.77682000E+00   # mtau pole mass
#
BLOCK MINPAR  # Input parameters - minimal models
         3     1.00000000E+01   # tanb                
#
BLOCK EXTPAR  # Input parameters - non-minimal models
         0    -1.00000000E+00   # Set                 
         1     6.00000000E+01   # M_1(MX)             
         2     3.00000000E+03   # M_2(MX)             
         3     2.62338400E+03   # M_3(MX)             
        11     5.00000000E+03   # At(MX)              
        12     5.00000000E+03   # Ab(MX)              
        13     0.00000000E+00   # Atau(MX)            
        23    -2.82772000E+02   # mu(MX)              
        26     3.00000000E+03   # mA(pole)            
        31     5.00000000E+03   # meL(MX)             
        32     5.00000000E+03   # mmuL(MX)            
        33     5.00000000E+03   # mtauL(MX)           
        34     5.00000000E+03   # meR(MX)             
        35     5.00000000E+03   # mmuR(MX)            
        36     5.00000000E+03   # mtauR(MX)           
        41     5.00000000E+03   # mqL1(MX)            
        42     5.00000000E+03   # mqL2(MX)            
        43     5.00000000E+03   # mqL3(MX)            
        44     5.00000000E+03   # muR(MX)             
        45     5.00000000E+03   # mcR(MX)             
        46     5.00000000E+03   # mtR(MX)             
        47     5.00000000E+03   # mdR(MX)             
        48     5.00000000E+03   # msR(MX)             
        49     5.00000000E+03   # mbR(MX)             
#
BLOCK MASS  # Mass Spectrum
# PDG code           mass       particle
        24     8.00918785E+01   # W+
        25     1.24789472E+02   # h
        35     3.00008914E+03   # H
        36     2.99999971E+03   # A
        37     3.00146926E+03   # H+
         5     4.87878001E+00   # b-quark pole mass calculated from mb(mb)_Msbar
   1000001     5.09127284E+03   # ~d_L
   2000001     5.07347208E+03   # ~d_R
   1000002     5.09080359E+03   # ~u_L
   2000002     5.07316767E+03   # ~u_R
   1000003     5.09127284E+03   # ~s_L
   2000003     5.07347208E+03   # ~s_R
   1000004     5.09080359E+03   # ~c_L
   2000004     5.07316767E+03   # ~c_R
   1000005     5.03726065E+03   # ~b_1
   2000005     5.07158007E+03   # ~b_2
   1000006     4.93023587E+03   # ~t_1
   2000006     5.07913575E+03   # ~t_2
   1000011     5.01913506E+03   # ~e_L
   2000011     5.00595351E+03   # ~e_R
   1000012     5.01818365E+03   # ~nu_eL
   1000013     5.01913506E+03   # ~mu_L
   2000013     5.00595351E+03   # ~mu_R
   1000014     5.01818365E+03   # ~nu_muL
   1000015     5.00481601E+03   # ~tau_1
   2000015     5.01861660E+03   # ~tau_2
   1000016     5.01762993E+03   # ~nu_tauL
   1000021     3.00000053E+03   # ~g
   1000022     5.97919743E+01   # ~chi_10
   1000023     3.01967816E+02   # ~chi_20
   1000025    -3.03836618E+02   # ~chi_30
   1000035     3.07421578E+03   # ~chi_40
   1000024     3.00000936E+02   # ~chi_1+
   1000037     3.07438369E+03   # ~chi_2+
#
BLOCK NMIX  # Neutralino Mixing Matrix
  1  1     9.88606915E-01   # N_11
  1  2     6.02054841E-05   # N_12
  1  3    -1.49798699E-01   # N_13
  1  4    -1.47212254E-02   # N_14
  2  1     1.16363202E-01   # N_21
  2  2     1.76943866E-02   # N_22
  2  3     6.98595796E-01   # N_23
  2  4     7.05769387E-01   # N_24
  3  1    -9.54767798E-02   # N_31
  3  2     1.80268045E-02   # N_32
  3  3    -6.99660057E-01   # N_33
  3  4     7.07838275E-01   # N_34
  4  1    -3.97480626E-04   # N_41
  4  2     9.99680919E-01   # N_42
  4  3     2.60512794E-04   # N_43
  4  4    -2.52553908E-02   # N_44
#
BLOCK UMIX  # Chargino Mixing Matrix U
  1  1    -3.65875127E-04   # U_11
  1  2     9.99999933E-01   # U_12
  2  1    -9.99999933E-01   # U_21
  2  2    -3.65875127E-04   # U_22
#
BLOCK VMIX  # Chargino Mixing Matrix V
  1  1     3.57255601E-02   # V_11
  1  2    -9.99361638E-01   # V_12
  2  1    -9.99361638E-01   # V_21
  2  2    -3.57255601E-02   # V_22
#
BLOCK STOPMIX  # Stop Mixing Matrix
  1  1    -4.98706650E-01   # cos(theta_t)
  1  2     8.66770833E-01   # sin(theta_t)
  2  1    -8.66770833E-01   # -sin(theta_t)
  2  2    -4.98706650E-01   # cos(theta_t)
#
BLOCK SBOTMIX  # Sbottom Mixing Matrix
  1  1     9.99238301E-01   # cos(theta_b)
  1  2    -3.90232984E-02   # sin(theta_b)
  2  1     3.90232984E-02   # -sin(theta_b)
  2  2     9.99238301E-01   # cos(theta_b)
#
BLOCK STAUMIX  # Stau Mixing Matrix
  1  1    -3.37626122E-02   # cos(theta_tau)
  1  2     9.99429880E-01   # sin(theta_tau)
  2  1    -9.99429880E-01   # -sin(theta_tau)
  2  2    -3.37626122E-02   # cos(theta_tau)
#
BLOCK ALPHA  # Higgs mixing
          -1.05498624E-01   # Mixing angle in the neutral Higgs boson sector
#
BLOCK HMIX Q=  5.00077201E+03  # DRbar Higgs Parameters
         1    -2.87954249E+02   # mu(Q)MSSM           
         2     9.46828508E+00   # tan                 
         3     2.41706241E+02   # higgs               
         4     8.75209941E+06   # mA^2(Q)MSSM         
#
BLOCK GAUGE Q=  5.00077201E+03  # The gauge couplings
     1     3.71049493E-01   # gprime(Q) DRbar
     2     6.33832309E-01   # g(Q) DRbar
     3     9.92483669E-01   # g3(Q) DRbar
#
BLOCK AU Q=  5.00077201E+03  # The trilinear couplings
  1  1     5.00000002E+03   # A_u(Q) DRbar
  2  2     5.00000002E+03   # A_c(Q) DRbar
  3  3     5.00000003E+03   # A_t(Q) DRbar
#
BLOCK AD Q=  5.00077201E+03  # The trilinear couplings
  1  1     5.00000001E+03   # A_d(Q) DRbar
  2  2     5.00000001E+03   # A_s(Q) DRbar
  3  3     5.00000001E+03   # A_b(Q) DRbar
#
BLOCK AE Q=  5.00077201E+03  # The trilinear couplings
  1  1     0.00000000E+00   # A_e(Q) DRbar
  2  2     3.18221991E-07   # A_mu(Q) DRbar
  3  3     3.18432295E-07   # A_tau(Q) DRbar
#
BLOCK Yu Q=  5.00077201E+03  # The Yukawa couplings
  1  1     0.00000000E+00   # y_u(Q) DRbar
  2  2     0.00000000E+00   # y_c(Q) DRbar
  3  3     8.22050302E-01   # y_t(Q) DRbar
#
BLOCK Yd Q=  5.00077201E+03  # The Yukawa couplings
  1  1     0.00000000E+00   # y_d(Q) DRbar
  2  2     0.00000000E+00   # y_s(Q) DRbar
  3  3     1.30214562E-01   # y_b(Q) DRbar
#
BLOCK Ye Q=  5.00077201E+03  # The Yukawa couplings
  1  1     0.00000000E+00   # y_e(Q) DRbar
  2  2     0.00000000E+00   # y_mu(Q) DRbar
  3  3     9.72666763E-02   # y_tau(Q) DRbar
#
BLOCK MSOFT Q=  5.00077201E+03  # The soft SUSY breaking masses at the scale Q
         1     6.00000000E+01   # M_1(Q)              
         2     3.00000000E+03   # M_2(Q)              
         3     2.62338400E+03   # M_3(Q)              
        21     8.64862585E+06   # mH1^2(Q)            
        22     4.99342019E+05   # mH2^2(Q)            
        31     5.00000000E+03   # meL(Q)              
        32     5.00000000E+03   # mmuL(Q)             
        33     5.00000000E+03   # mtauL(Q)            
        34     5.00000000E+03   # meR(Q)              
        35     5.00000000E+03   # mmuR(Q)             
        36     5.00000000E+03   # mtauR(Q)            
        41     4.99999999E+03   # mqL1(Q)             
        42     4.99999999E+03   # mqL2(Q)             
        43     4.99999999E+03   # mqL3(Q)             
        44     4.99999999E+03   # muR(Q)              
        45     4.99999999E+03   # mcR(Q)              
        46     4.99999999E+03   # mtR(Q)              
        47     4.99999999E+03   # mdR(Q)              
        48     4.99999999E+03   # msR(Q)              
        49     4.99999999E+03   # mbR(Q)              
#
#
#
#                             =================
#                             |The decay table|
#                             =================
#
# - The QCD corrections to the decays gluino -> squark  + quark
#                                     squark -> gaugino + quark_prime
#                                     squark -> squark_prime + Higgs
#                                     squark -> gluino  + quark
#   are included.
#
# - The multi-body decays for the inos, stops and sbottoms are included.
#
# - The loop induced decays for the gluino, neutralinos and stops
#   are included.
#
# - The SUSY decays of the top quark are included.
#
#
#         PDG            Width
DECAY         6     1.40798217E+00   # top decays
#          BR         NDA      ID1       ID2
     1.00000000E+00    2           5        24   # BR(t ->  b    W+)
#
#         PDG            Width
DECAY   1000021     2.36571973E-02   # gluino decays
#          BR         NDA      ID1       ID2
     2.09373210E-07    2     1000022        21   # BR(~g -> ~chi_10 g)
     2.64401787E-03    2     1000023        21   # BR(~g -> ~chi_20 g)
     2.56006056E-03    2     1000025        21   # BR(~g -> ~chi_30 g)
#           BR         NDA      ID1       ID2       ID3
     8.50574762E-03    3     1000022         1        -1   # BR(~g -> ~chi_10 d  db)
     1.00115706E-04    3     1000023         1        -1   # BR(~g -> ~chi_20 d  db)
     9.44482295E-05    3     1000025         1        -1   # BR(~g -> ~chi_30 d  db)
     2.90000633E-02    3     1000022         2        -2   # BR(~g -> ~chi_10 u  ub)
     4.72879653E-04    3     1000023         2        -2   # BR(~g -> ~chi_20 u  ub)
     1.93645695E-04    3     1000025         2        -2   # BR(~g -> ~chi_30 u  ub)
     8.50574762E-03    3     1000022         3        -3   # BR(~g -> ~chi_10 s  sb)
     1.00115706E-04    3     1000023         3        -3   # BR(~g -> ~chi_20 s  sb)
     9.44482295E-05    3     1000025         3        -3   # BR(~g -> ~chi_30 s  sb)
     2.90000633E-02    3     1000022         4        -4   # BR(~g -> ~chi_10 c  cb)
     4.72879653E-04    3     1000023         4        -4   # BR(~g -> ~chi_20 c  cb)
     1.93645695E-04    3     1000025         4        -4   # BR(~g -> ~chi_30 c  cb)
     8.88739119E-03    3     1000022         5        -5   # BR(~g -> ~chi_10 b  bb)
     5.28389878E-03    3     1000023         5        -5   # BR(~g -> ~chi_20 b  bb)
     5.28900074E-03    3     1000025         5        -5   # BR(~g -> ~chi_30 b  bb)
     2.98677823E-02    3     1000022         6        -6   # BR(~g -> ~chi_10 t  tb)
     2.16385084E-01    3     1000023         6        -6   # BR(~g -> ~chi_20 t  tb)
     2.08925576E-01    3     1000025         6        -6   # BR(~g -> ~chi_30 t  tb)
     5.19283790E-05    3     1000024         1        -2   # BR(~g -> ~chi_1+ d  ub)
     5.19283790E-05    3    -1000024         2        -1   # BR(~g -> ~chi_1- u  db)
     5.19283790E-05    3     1000024         3        -4   # BR(~g -> ~chi_1+ s  cb)
     5.19283790E-05    3    -1000024         4        -3   # BR(~g -> ~chi_1- c  sb)
     2.21607732E-01    3     1000024         5        -6   # BR(~g -> ~chi_1+ b  tb)
     2.21607732E-01    3    -1000024         6        -5   # BR(~g -> ~chi_1- t  bb)
#
#         PDG            Width
DECAY   1000006     2.53421031E+02   # stop1 decays
#          BR         NDA      ID1       ID2
     3.36367293E-02    2     1000022         6   # BR(~t_1 -> ~chi_10 t )
     1.33235775E-01    2     1000023         6   # BR(~t_1 -> ~chi_20 t )
     1.22672075E-01    2     1000025         6   # BR(~t_1 -> ~chi_30 t )
     7.80432066E-03    2     1000035         6   # BR(~t_1 -> ~chi_40 t )
     1.92543824E-01    2     1000024         5   # BR(~t_1 -> ~chi_1+ b )
     1.55582280E-02    2     1000037         5   # BR(~t_1 -> ~chi_2+ b )
     4.94549048E-01    2     1000021         6   # BR(~t_1 -> ~g      t )
#
#         PDG            Width
DECAY   2000006     2.59991503E+02   # stop2 decays
#          BR         NDA      ID1       ID2
     1.37126432E-02    2     1000022         6   # BR(~t_2 -> ~chi_10 t )
     1.24933375E-01    2     1000023         6   # BR(~t_2 -> ~chi_20 t )
     1.36713621E-01    2     1000025         6   # BR(~t_2 -> ~chi_30 t )
     2.21897403E-02    2     1000035         6   # BR(~t_2 -> ~chi_40 t )
     7.22827336E-02    2     1000024         5   # BR(~t_2 -> ~chi_1+ b )
     4.41899512E-02    2     1000037         5   # BR(~t_2 -> ~chi_2+ b )
     5.81644817E-01    2     1000021         6   # BR(~t_2 -> ~g      t )
     1.00368051E-03    2     1000006        25   # BR(~t_2 -> ~t_1    h )
     3.32943782E-03    2     1000006        23   # BR(~t_2 -> ~t_1    Z )
#
#         PDG            Width
DECAY   1000005     2.34279459E+02   # sbottom1 decays
#          BR         NDA      ID1       ID2
     3.39386633E-03    2     1000022         5   # BR(~b_1 -> ~chi_10 b )
     3.43680281E-03    2     1000023         5   # BR(~b_1 -> ~chi_20 b )
     3.52694016E-03    2     1000025         5   # BR(~b_1 -> ~chi_30 b )
     3.28390218E-02    2     1000035         5   # BR(~b_1 -> ~chi_40 b )
     2.84478568E-01    2    -1000024         6   # BR(~b_1 -> ~chi_1- t )
     6.59256604E-02    2    -1000037         6   # BR(~b_1 -> ~chi_2- t )
     6.04179970E-01    2     1000021         5   # BR(~b_1 -> ~g      b )
     2.21916998E-03    2     1000006       -24   # BR(~b_1 -> ~t_1    W-)
#
#         PDG            Width
DECAY   2000005     1.50905396E+02   # sbottom2 decays
#          BR         NDA      ID1       ID2
     1.92228891E-02    2     1000022         5   # BR(~b_2 -> ~chi_10 b )
     5.82387634E-03    2     1000023         5   # BR(~b_2 -> ~chi_20 b )
     5.79768929E-03    2     1000025         5   # BR(~b_2 -> ~chi_30 b )
     6.38448269E-05    2     1000035         5   # BR(~b_2 -> ~chi_40 b )
     1.17364525E-02    2    -1000024         6   # BR(~b_2 -> ~chi_1- t )
     1.28212856E-04    2    -1000037         6   # BR(~b_2 -> ~chi_2- t )
     9.57204135E-01    2     1000021         5   # BR(~b_2 -> ~g      b )
     2.29001474E-05    2     1000006       -24   # BR(~b_2 -> ~t_1    W-)
#
#         PDG            Width
DECAY   1000002     1.70822849E+02   # sup_L decays
#          BR         NDA      ID1       ID2
     4.26406272E-03    2     1000022         2   # BR(~u_L -> ~chi_10 u)
     1.85810663E-04    2     1000023         2   # BR(~u_L -> ~chi_20 u)
     4.15405026E-08    2     1000025         2   # BR(~u_L -> ~chi_30 u)
     4.66909889E-02    2     1000035         2   # BR(~u_L -> ~chi_40 u)
     2.90610859E-04    2     1000024         1   # BR(~u_L -> ~chi_1+ d)
     9.33252315E-02    2     1000037         1   # BR(~u_L -> ~chi_2+ d)
     8.55243254E-01    2     1000021         2   # BR(~u_L -> ~g      u)
#
#         PDG            Width
DECAY   2000002     1.56385186E+02   # sup_R decays
#          BR         NDA      ID1       ID2
     7.42123394E-02    2     1000022         2   # BR(~u_R -> ~chi_10 u)
     1.02210745E-03    2     1000023         2   # BR(~u_R -> ~chi_20 u)
     6.88058392E-04    2     1000025         2   # BR(~u_R -> ~chi_30 u)
     4.85717402E-09    2     1000035         2   # BR(~u_R -> ~chi_40 u)
     9.24077490E-01    2     1000021         2   # BR(~u_R -> ~g      u)
#
#         PDG            Width
DECAY   1000001     1.70839464E+02   # sdown_L decays
#          BR         NDA      ID1       ID2
     4.25873162E-03    2     1000022         1   # BR(~d_L -> ~chi_10 d)
     2.85985010E-06    2     1000023         1   # BR(~d_L -> ~chi_20 d)
     1.52961360E-04    2     1000025         1   # BR(~d_L -> ~chi_30 d)
     4.67150776E-02    2     1000035         1   # BR(~d_L -> ~chi_40 d)
     3.04802708E-08    2    -1000024         2   # BR(~d_L -> ~chi_1- u)
     9.34636858E-02    2    -1000037         2   # BR(~d_L -> ~chi_2- u)
     8.55406653E-01    2     1000021         1   # BR(~d_L -> ~g      d)
#
#         PDG            Width
DECAY   2000001     1.47507824E+02   # sdown_R decays
#          BR         NDA      ID1       ID2
     1.96708637E-02    2     1000022         1   # BR(~d_R -> ~chi_10 d)
     2.70921934E-04    2     1000023         1   # BR(~d_R -> ~chi_20 d)
     1.82378196E-04    2     1000025         1   # BR(~d_R -> ~chi_30 d)
     1.28762813E-09    2     1000035         1   # BR(~d_R -> ~chi_40 d)
     9.79875835E-01    2     1000021         1   # BR(~d_R -> ~g      d)
#
#         PDG            Width
DECAY   1000004     1.70822849E+02   # scharm_L decays
#          BR         NDA      ID1       ID2
     4.26406272E-03    2     1000022         4   # BR(~c_L -> ~chi_10 c)
     1.85810663E-04    2     1000023         4   # BR(~c_L -> ~chi_20 c)
     4.15405026E-08    2     1000025         4   # BR(~c_L -> ~chi_30 c)
     4.66909889E-02    2     1000035         4   # BR(~c_L -> ~chi_40 c)
     2.90610859E-04    2     1000024         3   # BR(~c_L -> ~chi_1+ s)
     9.33252315E-02    2     1000037         3   # BR(~c_L -> ~chi_2+ s)
     8.55243254E-01    2     1000021         4   # BR(~c_L -> ~g      c)
#
#         PDG            Width
DECAY   2000004     1.56385186E+02   # scharm_R decays
#          BR         NDA      ID1       ID2
     7.42123394E-02    2     1000022         4   # BR(~c_R -> ~chi_10 c)
     1.02210745E-03    2     1000023         4   # BR(~c_R -> ~chi_20 c)
     6.88058392E-04    2     1000025         4   # BR(~c_R -> ~chi_30 c)
     4.85717402E-09    2     1000035         4   # BR(~c_R -> ~chi_40 c)
     9.24077490E-01    2     1000021         4   # BR(~c_R -> ~g      c)
#
#         PDG            Width
DECAY   1000003     1.70839464E+02   # sstrange_L decays
#          BR         NDA      ID1       ID2
     4.25873162E-03    2     1000022         3   # BR(~s_L -> ~chi_10 s)
     2.85985010E-06    2     1000023         3   # BR(~s_L -> ~chi_20 s)
     1.52961360E-04    2     1000025         3   # BR(~s_L -> ~chi_30 s)
     4.67150776E-02    2     1000035         3   # BR(~s_L -> ~chi_40 s)
     3.04802708E-08    2    -1000024         4   # BR(~s_L -> ~chi_1- c)
     9.34636858E-02    2    -1000037         4   # BR(~s_L -> ~chi_2- c)
     8.55406653E-01    2     1000021         3   # BR(~s_L -> ~g      s)
#
#         PDG            Width
DECAY   2000003     1.47507824E+02   # sstrange_R decays
#          BR         NDA      ID1       ID2
     1.96708637E-02    2     1000022         3   # BR(~s_R -> ~chi_10 s)
     2.70921934E-04    2     1000023         3   # BR(~s_R -> ~chi_20 s)
     1.82378196E-04    2     1000025         3   # BR(~s_R -> ~chi_30 s)
     1.28762813E-09    2     1000035         3   # BR(~s_R -> ~chi_40 s)
     9.79875835E-01    2     1000021         3   # BR(~s_R -> ~g      s)
#
#         PDG            Width
DECAY   1000011     3.03752528E+01   # selectron_L decays
#          BR         NDA      ID1       ID2
     2.21150121E-01    2     1000022        11   # BR(~e_L -> ~chi_10 e-)
     4.82754154E-03    2     1000023        11   # BR(~e_L -> ~chi_20 e-)
     9.39865945E-04    2     1000025        11   # BR(~e_L -> ~chi_30 e-)
     2.57527049E-01    2     1000035        11   # BR(~e_L -> ~chi_40 e-)
     1.75527410E-07    2    -1000024        12   # BR(~e_L -> ~chi_1- nu_e)
     5.15555247E-01    2    -1000037        12   # BR(~e_L -> ~chi_2- nu_e)
#
#         PDG            Width
DECAY   2000011     2.74105419E+01   # selectron_R decays
#          BR         NDA      ID1       ID2
     9.77499130E-01    2     1000022        11   # BR(~e_R -> ~chi_10 e-)
     1.34480103E-02    2     1000023        11   # BR(~e_R -> ~chi_20 e-)
     9.05279838E-03    2     1000025        11   # BR(~e_R -> ~chi_30 e-)
     6.13218069E-08    2     1000035        11   # BR(~e_R -> ~chi_40 e-)
#
#         PDG            Width
DECAY   1000013     3.03752528E+01   # smuon_L decays
#          BR         NDA      ID1       ID2
     2.21150121E-01    2     1000022        13   # BR(~mu_L -> ~chi_10 mu-)
     4.82754154E-03    2     1000023        13   # BR(~mu_L -> ~chi_20 mu-)
     9.39865945E-04    2     1000025        13   # BR(~mu_L -> ~chi_30 mu-)
     2.57527049E-01    2     1000035        13   # BR(~mu_L -> ~chi_40 mu-)
     1.75527410E-07    2    -1000024        14   # BR(~mu_L -> ~chi_1- nu_mu)
     5.15555247E-01    2    -1000037        14   # BR(~mu_L -> ~chi_2- nu_mu)
#
#         PDG            Width
DECAY   2000013     2.74105419E+01   # smuon_R decays
#          BR         NDA      ID1       ID2
     9.77499130E-01    2     1000022        13   # BR(~mu_R -> ~chi_10 mu-)
     1.34480103E-02    2     1000023        13   # BR(~mu_R -> ~chi_20 mu-)
     9.05279838E-03    2     1000025        13   # BR(~mu_R -> ~chi_30 mu-)
     6.13218069E-08    2     1000035        13   # BR(~mu_R -> ~chi_40 mu-)
#
#         PDG            Width
DECAY   1000015     2.92768620E+01   # stau_1 decays
#          BR         NDA      ID1       ID2
     9.15784768E-01    2     1000022        15   # BR(~tau_1 -> ~chi_10  tau-)
     2.78166536E-02    2     1000023        15   # BR(~tau_1 -> ~chi_20  tau-)
     2.35871706E-02    2     1000025        15   # BR(~tau_1 -> ~chi_30  tau-)
     3.02691570E-04    2     1000035        15   # BR(~tau_1 -> ~chi_40  tau-)
     3.19028867E-02    2    -1000024        16   # BR(~tau_1 -> ~chi_1-  nu_tau)
     6.05829349E-04    2    -1000037        16   # BR(~tau_1 -> ~chi_2-  nu_tau)
#
#         PDG            Width
DECAY   2000015     3.13019006E+01   # stau_2 decays
#          BR         NDA      ID1       ID2
     2.15178451E-01    2     1000022        15   # BR(~tau_2 -> ~chi_10  tau-)
     1.96419855E-02    2     1000023        15   # BR(~tau_2 -> ~chi_20  tau-)
     1.60655857E-02    2     1000025        15   # BR(~tau_2 -> ~chi_30  tau-)
     2.49529655E-01    2     1000035        15   # BR(~tau_2 -> ~chi_40  tau-)
     3.91443979E-05    2    -1000024        16   # BR(~tau_2 -> ~chi_1-  nu_tau)
     4.99545179E-01    2    -1000037        16   # BR(~tau_2 -> ~chi_2-  nu_tau)
#
#         PDG            Width
DECAY   1000012     3.03783805E+01   # snu_eL decays
#          BR         NDA      ID1       ID2
     2.20993434E-01    2     1000022        12   # BR(~nu_eL -> ~chi_10 nu_e)
     1.66639622E-03    2     1000023        12   # BR(~nu_eL -> ~chi_20 nu_e)
     3.58062698E-03    2     1000025        12   # BR(~nu_eL -> ~chi_30 nu_e)
     2.57574205E-01    2     1000035        12   # BR(~nu_eL -> ~chi_40 nu_e)
     1.67305045E-03    2     1000024        11   # BR(~nu_eL -> ~chi_1+ e-)
     5.14512287E-01    2     1000037        11   # BR(~nu_eL -> ~chi_2+ e-)
#
#         PDG            Width
DECAY   1000014     3.03783805E+01   # snu_muL decays
#          BR         NDA      ID1       ID2
     2.20993434E-01    2     1000022        14   # BR(~nu_muL -> ~chi_10 nu_mu)
     1.66639622E-03    2     1000023        14   # BR(~nu_muL -> ~chi_20 nu_mu)
     3.58062698E-03    2     1000025        14   # BR(~nu_muL -> ~chi_30 nu_mu)
     2.57574205E-01    2     1000035        14   # BR(~nu_muL -> ~chi_40 nu_mu)
     1.67305045E-03    2     1000024        13   # BR(~nu_muL -> ~chi_1+ mu-)
     5.14512287E-01    2     1000037        13   # BR(~nu_muL -> ~chi_2+ mu-)
#
#         PDG            Width
DECAY   1000016     3.13064793E+01   # snu_tauL decays
#          BR         NDA      ID1       ID2
     2.14418280E-01    2     1000022        16   # BR(~nu_tauL -> ~chi_10 nu_tau)
     1.61681392E-03    2     1000023        16   # BR(~nu_tauL -> ~chi_20 nu_tau)
     3.47408818E-03    2     1000025        16   # BR(~nu_tauL -> ~chi_30 nu_tau)
     2.49844416E-01    2     1000035        16   # BR(~nu_tauL -> ~chi_40 nu_tau)
     3.15749059E-02    2     1000024        15   # BR(~nu_tauL -> ~chi_1+ tau-)
     4.99071496E-01    2     1000037        15   # BR(~nu_tauL -> ~chi_2+ tau-)
#
#         PDG            Width
DECAY   1000024     1.63045869E-01   # chargino1+ decays
#          BR         NDA      ID1       ID2
     1.00000000E+00    2     1000022        24   # BR(~chi_1+ -> ~chi_10  W+)
#
#         PDG            Width
DECAY   1000037     2.28941319E+01   # chargino2+ decays
#          BR         NDA      ID1       ID2
     2.53649319E-01    2     1000024        23   # BR(~chi_2+ -> ~chi_1+  Z )
     1.47796883E-04    2     1000022        24   # BR(~chi_2+ -> ~chi_10  W+)
     2.45426146E-01    2     1000023        24   # BR(~chi_2+ -> ~chi_20  W+)
     2.44530072E-01    2     1000025        24   # BR(~chi_2+ -> ~chi_30  W+)
     2.56231540E-01    2     1000024        25   # BR(~chi_2+ -> ~chi_1+  h )
     1.51256264E-05    2     1000022        37   # BR(~chi_2+ -> ~chi_10  H+)
#
#         PDG            Width
DECAY   1000022     0.00000000E+00   # neutralino1 decays
#
#         PDG            Width
DECAY   1000023     1.53404711E-01   # neutralino2 decays
#          BR         NDA      ID1       ID2
     4.91761689E-01    2     1000022        23   # BR(~chi_20 -> ~chi_10   Z )
     5.08238311E-01    2     1000022        25   # BR(~chi_20 -> ~chi_10   h )
#
#         PDG            Width
DECAY   1000025     1.38257451E-01   # neutralino3 decays
#          BR         NDA      ID1       ID2
     6.71435839E-01    2     1000022        23   # BR(~chi_30 -> ~chi_10   Z )
     3.28564161E-01    2     1000022        25   # BR(~chi_30 -> ~chi_10   h )
#
#         PDG            Width
DECAY   1000035     2.28956218E+01   # neutralino4 decays
#          BR         NDA      ID1       ID2
     6.90271381E-05    2     1000022        23   # BR(~chi_40 -> ~chi_10   Z )
     1.29012300E-01    2     1000023        23   # BR(~chi_40 -> ~chi_20   Z )
     1.24402916E-01    2     1000025        23   # BR(~chi_40 -> ~chi_30   Z )
     2.45257003E-01    2     1000024       -24   # BR(~chi_40 -> ~chi_1+   W-)
     2.45257003E-01    2    -1000024        24   # BR(~chi_40 -> ~chi_1-   W+)
     6.83409947E-05    2     1000022        25   # BR(~chi_40 -> ~chi_10   h )
     1.46009624E-05    2     1000022        35   # BR(~chi_40 -> ~chi_10   H )
     1.54688383E-06    2     1000022        36   # BR(~chi_40 -> ~chi_10   A )
     1.26597988E-01    2     1000023        25   # BR(~chi_40 -> ~chi_20   h )
     1.29319274E-01    2     1000025        25   # BR(~chi_40 -> ~chi_30   h )
#
#         PDG            Width
DECAY        25     4.07315731E-03   # h decays
#          BR         NDA      ID1       ID2
     6.09152356E-01    2           5        -5   # BR(h -> b       bb     )
     6.36955490E-02    2         -15        15   # BR(h -> tau+    tau-   )
     2.25505332E-04    2         -13        13   # BR(h -> mu+     mu-    )
     4.78045093E-04    2           3        -3   # BR(h -> s       sb     )
     2.07116650E-02    2           4        -4   # BR(h -> c       cb     )
     6.70168599E-02    2          21        21   # BR(h -> g       g      )
     2.30270264E-03    2          22        22   # BR(h -> gam     gam    )
     1.48710606E-03    2          22        23   # BR(h -> Z       gam    )
     2.09918477E-01    2          24       -24   # BR(h -> W+      W-     )
     2.50094894E-02    2          23        23   # BR(h -> Z       Z      )
     2.24436155E-06    2     1000022   1000022   # BR(h -> ~chi_10 ~chi_10)
#
#         PDG            Width
DECAY        35     8.77734024E+00   # H decays
#          BR         NDA      ID1       ID2
     3.61313327E-01    2           5        -5   # BR(H -> b       bb     )
     6.34507399E-02    2         -15        15   # BR(H -> tau+    tau-   )
     2.24366856E-04    2         -13        13   # BR(H -> mu+     mu-    )
     2.75039257E-04    2           3        -3   # BR(H -> s       sb     )
     1.53971496E-06    2           4        -4   # BR(H -> c       cb     )
     1.53829728E-01    2           6        -6   # BR(H -> t       tb     )
     5.11856885E-05    2          21        21   # BR(H -> g       g      )
     1.38391016E-07    2          22        22   # BR(H -> gam     gam    )
     9.07584152E-08    2          23        22   # BR(H -> Z       gam    )
     7.48607430E-05    2          24       -24   # BR(H -> W+      W-     )
     3.73829811E-05    2          23        23   # BR(H -> Z       Z      )
     2.67748144E-04    2          25        25   # BR(H -> h       h      )
     1.99282686E-23    2          36        36   # BR(H -> A       A      )
     6.08292630E-19    2          23        36   # BR(H -> Z       A      )
     3.40739048E-03    2     1000024  -1000024   # BR(H -> ~chi_1+ ~chi_1-)
     1.88193154E-02    2     1000022   1000022   # BR(H -> ~chi_10 ~chi_10)
     3.33058679E-03    2     1000023   1000023   # BR(H -> ~chi_20 ~chi_20)
     5.10734381E-03    2     1000025   1000025   # BR(H -> ~chi_30 ~chi_30)
     2.32182005E-01    2     1000022   1000023   # BR(H -> ~chi_10 ~chi_20)
     1.48113795E-01    2     1000022   1000025   # BR(H -> ~chi_10 ~chi_30)
     9.51341635E-03    2     1000023   1000025   # BR(H -> ~chi_20 ~chi_30)
#
#         PDG            Width
DECAY        36     8.78266749E+00   # A decays
#          BR         NDA      ID1       ID2
     3.61217740E-01    2           5        -5   # BR(A -> b       bb     )
     6.34141129E-02    2         -15        15   # BR(A -> tau+    tau-   )
     2.24237027E-04    2         -13        13   # BR(A -> mu+     mu-    )
     2.75081151E-04    2           3        -3   # BR(A -> s       sb     )
     1.54486313E-06    2           4        -4   # BR(A -> c       cb     )
     1.54258903E-01    2           6        -6   # BR(A -> t       tb     )
     1.52632617E-04    2          21        21   # BR(A -> g       g      )
     5.64081376E-07    2          22        22   # BR(A -> gam     gam    )
     1.84715221E-07    2          23        22   # BR(A -> Z       gam    )
     7.45318763E-05    2          23        25   # BR(A -> Z       h      )
     3.56269012E-03    2     1000024  -1000024   # BR(A -> ~chi_1+ ~chi_1-)
     1.80712617E-02    2     1000022   1000022   # BR(A -> ~chi_10 ~chi_10)
     2.25917711E-03    2     1000023   1000023   # BR(A -> ~chi_20 ~chi_20)
     8.17970614E-03    2     1000025   1000025   # BR(A -> ~chi_30 ~chi_30)
     1.51242722E-01    2     1000022   1000023   # BR(A -> ~chi_10 ~chi_20)
     2.28725205E-01    2     1000022   1000025   # BR(A -> ~chi_10 ~chi_30)
     8.33970463E-03    2     1000023   1000025   # BR(A -> ~chi_20 ~chi_30)
#
#         PDG            Width
DECAY        37     8.72940975E+00   # H+ decays
#          BR         NDA      ID1       ID2
     5.79684129E-04    2           4        -5   # BR(H+ -> c       bb     )
     6.38322525E-02    2         -15        16   # BR(H+ -> tau+    nu_tau )
     2.25715599E-04    2         -13        14   # BR(H+ -> mu+     nu_mu  )
     3.70995888E-06    2           2        -5   # BR(H+ -> u       bb     )
     1.32441804E-05    2           2        -3   # BR(H+ -> u       sb     )
     2.73891447E-04    2           4        -3   # BR(H+ -> c       sb     )
     5.14298810E-01    2           6        -5   # BR(H+ -> t       bb     )
     7.51452596E-05    2          24        25   # BR(H+ -> W+      h      )
     1.03168707E-12    2          24        36   # BR(H+ -> W+      A      )
     4.09884275E-01    2     1000024   1000022   # BR(H+ -> ~chi_1+ ~chi_10)
     9.10873068E-03    2     1000024   1000023   # BR(H+ -> ~chi_1+ ~chi_20)
     1.70454101E-03    2     1000024   1000025   # BR(H+ -> ~chi_1+ ~chi_30)
