# SUSY Les Houches Accord 2 - MSSM spectrum + Decays
# SPheno v3.3.6  
# W. Porod, Comput. Phys. Commun. 153 (2003) 275-315, hep-ph/0301101
# in case of problems send email to porod@physik.uni-wuerzburg.de
# Created: 06.12.2016,  13:43
Block SPINFO         # Program information
     1   SPheno      # spectrum calculator
     2   v3.3.6      # version number
#
Block SPhenoINFO     # SPheno specific information
    1      2         # using 2-loop RGEs
    2      1         # using running masses for boundary conditions at mZ
Block MODSEL  # Model selection
    1    2    # mGMSB model
Block MINPAR  # Input parameters
    1    1.40000000E+05  # Lambda, scale of SUSY breaking
    2    5.00000000E+05  # M_M, messenger mass scale
    3    1.00000000E+01  # tanb at m_Z   
    4    1.00000000E+00  # Sign(mu)
    5    3.00000000E+00  # N_5 number of effective five-plets
    6    1.00000000E+05  # c_grav, Gravitino mass factor
Block gauge Q=  5.00000000E+05  # (GMSB scale)
   1    4.96604369E-01  # g'(Q)^DRbar
   2    6.49407837E-01  # g(Q)^DRbar
   3    9.27435577E-01  # g3(Q)^DRbar
Block SMINPUTS  # SM parameters
         1     1.27931288E+02  # alpha_em^-1(MZ)^MSbar
         2     1.16637900E-05  # G_mu [GeV^-2]
         3     1.18400000E-01  # alpha_s(MZ)^MSbar
         4     9.11876000E+01  # m_Z(pole)
         5     4.18000000E+00  # m_b(m_b), MSbar
         6     1.73100000E+02  # m_t(pole)
         7     1.77682000E+00  # m_tau(pole)
         8     0.00000000E+00  # m_nu_3
        11     5.10998930E-04  # m_e(pole)
        12     0.00000000E+00  # m_nu_1
        13     1.05658372E-01  # m_muon(pole)
        14     0.00000000E+00  # m_nu_2
        21     5.00000000E-03  # m_d(2 GeV), MSbar
        22     2.50000000E-03  # m_u(2 GeV), MSbar
        23     9.50000000E-02  # m_s(2 GeV), MSbar
        24     1.27000000E+00  # m_c(m_c), MSbar
Block gauge Q=  2.54091733E+03  # (SUSY scale)
   1    3.64997925E-01  # g'(Q)^DRbar
   2    6.38807822E-01  # g(Q)^DRbar
   3    1.01630637E+00  # g3(Q)^DRbar
Block Yu Q=  2.54091733E+03  # (SUSY scale)
#   1  1     6.86503114E-06   # Y_u(Q)^DRbar
  1  1     0.0   # Y_u(Q)^DRbar
#   2  2     3.48743616E-03   # Y_c(Q)^DRbar
  2  2     0.0   # Y_c(Q)^DRbar
#   3  3     8.41191133E-01   # Y_t(Q)^DRbar
  3  3     0.0   # Y_t(Q)^DRbar
Block Yd Q=  2.54091733E+03  # (SUSY scale)
#   1  1     1.29344294E-04   # Y_d(Q)^DRbar
  1  1     0.0   # Y_d(Q)^DRbar
#   2  2     2.45754065E-03   # Y_s(Q)^DRbar
  2  2     0.0   # Y_s(Q)^DRbar
#   3  3     1.27024114E-01   # Y_b(Q)^DRbar
  3  3     0.0   # Y_b(Q)^DRbar
Block Ye Q=  2.54091733E+03  # (SUSY scale)
#   1  1     2.84784013E-05   # Y_e(Q)^DRbar
  1  1     0.0   # Y_e(Q)^DRbar
#   2  2     5.88843349E-03   # Y_mu(Q)^DRbar
  2  2     0.0   # Y_mu(Q)^DRbar
#   3  3     9.90397824E-02   # Y_tau(Q)^DRbar
  3  3     0.0   # Y_tau(Q)^DRbar
Block Au Q=  2.54091733E+03  # (SUSY scale)
#   1  1    -8.83405282E+02   # A_u(Q)^DRbar
  1  1    0.0   # A_u(Q)^DRbar
#   2  2    -8.83404186E+02   # A_c(Q)^DRbar
  2  2    0.0   # A_c(Q)^DRbar
#   3  3    -8.28954393E+02   # A_t(Q)^DRbar
  3  3    0.0   # A_t(Q)^DRbar
Block Ad Q=  2.54091733E+03  # (SUSY scale)
#   1  1    -9.44646680E+02   # A_d(Q)^DRbar
  1  1    0.0   # A_d(Q)^DRbar
#   2  2    -9.44645892E+02   # A_s(Q)^DRbar
  2  2    0.0   # A_s(Q)^DRbar
#   3  3    -9.25763392E+02   # A_b(Q)^DRbar
  3  3    0.0   # A_b(Q)^DRbar
Block Ae Q=  2.54091733E+03  # (SUSY scale)
#   1  1    -1.07070129E+02   # A_e(Q)^DRbar
  1  1    0.0   # A_e(Q)^DRbar
#   2  2    -1.07069722E+02   # A_mu(Q)^DRbar
  2  2    0.0   # A_mu(Q)^DRbar
#   3  3    -1.06955015E+02   # A_tau(Q)^DRbar
  3  3    0.0   # A_tau(Q)^DRbar
Block MSOFT Q=  2.54091733E+03  # soft SUSY breaking masses at Q
   1    5.94360295E+02  # M_1
   2    1.08833888E+03  # M_2
   3    2.76810113E+03  # M_3
  21    7.34984041E+05  # M^2_(H,d)
  22   -8.13214181E+05  # M^2_(H,u)
  31    8.79026734E+02  # M_(L,11)
  32    8.79024710E+02  # M_(L,22)
  33    8.78454117E+02  # M_(L,33)
  34    4.28816607E+02  # M_(E,11)
  35    4.28808172E+02  # M_(E,22)
  36    4.26424162E+02  # M_(E,33)
  41    2.74060316E+03  # M_(Q,11)
  42    2.74060084E+03  # M_(Q,22)
  43    2.64888428E+03  # M_(Q,33)
  44    2.62448525E+03  # M_(U,11)
  45    2.62448200E+03  # M_(U,22)
  46    2.43009698E+03  # M_(U,33)
  47    2.61295550E+03  # M_(D,11)
  48    2.61295384E+03  # M_(D,22)
  49    2.60853996E+03  # M_(D,33)
Block MASS  # Mass spectrum
#   PDG code      mass          particle
         6     1.73100000E+02  # m_t(pole)
        23     9.11876000E+01  # m_Z(pole)
        24     8.04001329E+01  # W+
        15     1.77682000E+00  # m_tau(pole)
        25     1.19770536E+02  # h0
        35     1.32784299E+03  # H0
        36     1.32762372E+03  # A0
        37     1.33044694E+03  # H+
   1000001     2.84756168E+03  # ~d_L
   2000001     2.71421930E+03  # ~d_R
   1000002     2.84646305E+03  # ~u_L
   2000002     2.72485351E+03  # ~u_R
   1000003     2.84755899E+03  # ~s_L
   2000003     2.71421727E+03  # ~s_R
   1000004     2.84646051E+03  # ~c_L
   2000004     2.72484967E+03  # ~c_R
   1000005     2.70828682E+03  # ~b_1
   2000005     2.74046053E+03  # ~b_2
   1000006     2.49974821E+03  # ~t_1
   2000006     2.74659516E+03  # ~t_2
   1000011     8.96983391E+02  # ~e_L-
   2000011     4.45597097E+02  # ~e_R-
   1000012     8.93112641E+02  # ~nu_eL
   1000013     8.96981633E+02  # ~mu_L-
   2000013     4.45584885E+02  # ~mu_R-
   1000014     8.93109891E+02  # ~nu_muL
   1000015     4.42132176E+02  # ~tau_1-
   2000015     8.96485461E+02  # ~tau_2-
   1000016     8.92335139E+02  # ~nu_tauL
   1000021     2.91845976E+03  # ~g
   1000022     5.79343187E+02  # ~chi_10
   1000023     9.71817070E+02  # ~chi_20
   1000025    -9.95835790E+02  # ~chi_30
   1000035     1.13902520E+03  # ~chi_40
   1000024     9.69977197E+02  # ~chi_1+
   1000037     1.13906740E+03  # ~chi_2+
   1000039     1.68000000E-03  # ~G
# Higgs mixing
Block alpha # Effective Higgs mixing angle
          -1.05912403E-01   # alpha
Block Hmix Q=  2.54091733E+03  # Higgs mixing parameters
   1    9.82346412E+02  # mu
   2    9.52766599E+00  # tan[beta](Q)
   3    2.43224121E+02  # v(Q)
   4    1.57468277E+06  # m^2_A(Q)
Block stopmix # stop mixing matrix
   1  1     1.23884380E-01   # Re[R_st(1,1)]
   1  2     9.92296659E-01   # Re[R_st(1,2)]
   2  1    -9.92296659E-01   # Re[R_st(2,1)]
   2  2     1.23884380E-01   # Re[R_st(2,2)]
Block sbotmix # sbottom mixing matrix
   1  1     1.47245729E-01   # Re[R_sb(1,1)]
   1  2     9.89099942E-01   # Re[R_sb(1,2)]
   2  1    -9.89099942E-01   # Re[R_sb(2,1)]
   2  2     1.47245729E-01   # Re[R_sb(2,2)]
Block staumix # stau mixing matrix
   1  1     2.83346347E-02   # Re[R_sta(1,1)]
   1  2     9.99598494E-01   # Re[R_sta(1,2)]
   2  1    -9.99598494E-01   # Re[R_sta(2,1)]
   2  2     2.83346347E-02   # Re[R_sta(2,2)]
Block Nmix # neutralino mixing matrix
   1  1    -9.96229015E-01   # Re[N(1,1)]
   1  2     7.92071034E-03   # Re[N(1,2)]
   1  3    -7.24219910E-02   # Re[N(1,3)]
   1  4     4.71175803E-02   # Re[N(1,4)]
   2  1     8.10887764E-02   # Re[N(2,1)]
   2  2     3.89643871E-01   # Re[N(2,2)]
   2  3    -6.54823015E-01   # Re[N(2,3)]
   2  4     6.42502205E-01   # Re[N(2,4)]
   3  1     1.76780460E-02   # Re[N(3,1)]
   3  2    -2.36133886E-02   # Re[N(3,2)]
   3  3    -7.06073366E-01   # Re[N(3,3)]
   3  4    -7.07524061E-01   # Re[N(3,4)]
   4  1    -2.52951739E-02   # Re[N(4,1)]
   4  2     9.20628766E-01   # Re[N(4,2)]
   4  3     2.59657999E-01   # Re[N(4,3)]
   4  4    -2.90483310E-01   # Re[N(4,4)]
Block Umix # chargino mixing matrix
   1  1    -3.65953863E-01   # Re[U(1,1)]
   1  2     9.30632994E-01   # Re[U(1,2)]
   2  1     9.30632994E-01   # Re[U(2,1)]
   2  2     3.65953863E-01   # Re[U(2,2)]
Block Vmix # chargino mixing matrix
   1  1    -4.09410955E-01   # Re[V(1,1)]
   1  2     9.12350081E-01   # Re[V(1,2)]
   2  1     9.12350081E-01   # Re[V(2,1)]
   2  2     4.09410955E-01   # Re[V(2,2)]
DECAY        23     2.49520000E+00   # Z
DECAY        24     2.08500000E+00   # W
DECAY   2000011     8.98987202E-14   # ~e^-_R
#    BR                NDA      ID1      ID2
     7.93400227E-08    2     1000039        11   # BR(~e^-_R -> ~G e^-)
#    BR                NDA      ID1      ID2       ID3
     3.69584938E-01    3     1000015        11       -15   # BR(~e^-_R -> ~tau^-_1 e^- tau^+)
     6.30414983E-01    3    -1000015        15        11   # BR(~e^-_R -> ~tau^+_1 tau^- e^-)
     5.52657806E-12    3     1000015        12       -16   # BR(~e^-_R -> ~tau^-_1 nu_e nu_bar_tau)
DECAY   1000011     3.89682224E-01   # ~e^-_L
#    BR                NDA      ID1      ID2
     9.99999965E-01    2     1000022        11   # BR(~e^-_L -> chi^0_1 e^-)
     1.59765189E-08    2     2000011        23   # BR(~e^-_L -> ~e^-_R Z)
     1.62943336E-08    2     2000011        25   # BR(~e^-_L -> ~e^-_R h^0)
#    BR                NDA      ID1      ID2       ID3
     1.78199168E-09    3     1000012         1        -2   # BR(~e^-_L -> ~nu_e d u_bar)
     1.06148552E-09    3     1000012         3        -4   # BR(~e^-_L -> ~nu_e s c_bar)
DECAY   2000013     8.64878076E-14   # ~mu^-_R
#    BR                NDA      ID1      ID2
     8.24577214E-08    2     1000039        13   # BR(~mu^-_R -> ~G mu^-)
#    BR                NDA      ID1      ID2       ID3
     3.69563870E-01    3     1000015        13       -15   # BR(~mu^-_R -> ~tau^-_1 mu^- tau^+)
     6.30435807E-01    3    -1000015        15        13   # BR(~mu^-_R -> ~tau^+_1 tau^- mu^-)
     2.41304844E-07    3     1000015        14       -16   # BR(~mu^-_R -> ~tau^-_1 nu_mu nu_bar_tau)
DECAY   1000013     3.90218809E-01   # ~mu^-_L
#    BR                NDA      ID1      ID2
     9.98622193E-01    2     1000022        13   # BR(~mu^-_L -> chi^0_1 mu^-)
     6.82121238E-04    2     2000013        23   # BR(~mu^-_L -> ~mu^-_R Z)
     6.95682623E-04    2     2000013        25   # BR(~mu^-_L -> ~mu^-_R h^0)
#    BR                NDA      ID1      ID2       ID3
     1.78181391E-09    3     1000014         1        -2   # BR(~mu^-_L -> ~nu_mu d u_bar)
     1.06166319E-09    3     1000014         3        -4   # BR(~mu^-_L -> ~nu_mu s c_bar)
DECAY   1000015     6.85909182E-21   # ~tau^-_1
#    BR                NDA      ID1      ID2
     1.00000000E+00    2     1000039        15   # BR(~tau^-_1 -> ~G tau^-)
DECAY   2000015     5.42090768E-01   # ~tau^-_2
#    BR                NDA      ID1      ID2
     7.18293488E-01    2     1000022        15   # BR(~tau^-_2 -> chi^0_1 tau^-)
     1.39687706E-01    2     1000015        23   # BR(~tau^-_2 -> ~tau^-_1 Z)
     1.42018803E-01    2     1000015        25   # BR(~tau^-_2 -> ~tau^-_1 h^0)
#    BR                NDA      ID1      ID2       ID3
     1.81346956E-09    3     1000016         1        -2   # BR(~tau^-_2 -> ~nu_tau d u_bar)
     1.15592440E-09    3     1000016         3        -4   # BR(~tau^-_2 -> ~nu_tau s c_bar)
DECAY   1000012     4.05125547E-01   # ~nu_e
#    BR                NDA      ID1      ID2
     9.99999970E-01    2     1000022        12   # BR(~nu_e -> chi^0_1 nu_e)
     2.96056480E-08    2     2000011        24   # BR(~nu_e -> ~e^-_R W^+)
DECAY   1000014     4.05633454E-01   # ~nu_mu
#    BR                NDA      ID1      ID2
     9.98735828E-01    2     1000022        14   # BR(~nu_mu -> chi^0_1 nu_mu)
     1.26417201E-03    2     2000013        24   # BR(~nu_mu -> ~mu^-_R W^+)
DECAY   1000016     5.49509810E-01   # ~nu_tau
#    BR                NDA      ID1      ID2
     7.34742473E-01    2     1000022        16   # BR(~nu_tau -> chi^0_1 nu_tau)
     2.65257527E-01    2     1000015        24   # BR(~nu_tau -> ~tau^-_1 W^+)
DECAY   2000001     1.45436288E+00   # ~d_R
#    BR                NDA      ID1      ID2
     9.93771152E-01    2     1000022         1   # BR(~d_R -> chi^0_1 d)
     5.49346683E-03    2     1000023         1   # BR(~d_R -> chi^0_2 d)
     2.57482122E-04    2     1000025         1   # BR(~d_R -> chi^0_3 d)
     4.77414590E-04    2     1000035         1   # BR(~d_R -> chi^0_4 d)
     4.65886770E-07    2    -1000024         2   # BR(~d_R -> chi^-_1 u)
     1.81960602E-08    2    -1000037         2   # BR(~d_R -> chi^-_2 u)
DECAY   1000001     2.52161485E+01   # ~d_L
#    BR                NDA      ID1      ID2
     1.64571820E-02    2     1000022         1   # BR(~d_L -> chi^0_1 d)
     5.01051845E-02    2     1000023         1   # BR(~d_L -> chi^0_2 d)
     2.57066213E-04    2     1000025         1   # BR(~d_L -> chi^0_3 d)
     2.77010338E-01    2     1000035         1   # BR(~d_L -> chi^0_4 d)
     9.59380725E-02    2    -1000024         2   # BR(~d_L -> chi^-_1 u)
     5.60232156E-01    2    -1000037         2   # BR(~d_L -> chi^-_2 u)
     6.70981260E-13    2     2000002       -24   # BR(~d_L -> ~u_R W^-)
     1.04341169E-10    2     2000001        23   # BR(~d_L -> ~d_R Z)
     1.06286963E-10    2     2000001        25   # BR(~d_L -> ~d_R h^0)
DECAY   2000003     1.45486370E+00   # ~s_R
#    BR                NDA      ID1      ID2
     9.93430934E-01    2     1000022         3   # BR(~s_R -> chi^0_1 s)
     5.57398285E-03    2     1000023         3   # BR(~s_R -> chi^0_2 s)
     3.39886441E-04    2     1000025         3   # BR(~s_R -> chi^0_3 s)
     4.80502980E-04    2     1000035         3   # BR(~s_R -> chi^0_4 s)
     1.68126872E-04    2    -1000024         4   # BR(~s_R -> chi^-_1 c)
     6.56644478E-06    2    -1000037         4   # BR(~s_R -> chi^-_2 c)
DECAY   1000003     2.52168885E+01   # ~s_L
#    BR                NDA      ID1      ID2
     1.64566396E-02    2     1000022         3   # BR(~s_L -> chi^0_1 s)
     5.01075540E-02    2     1000023         3   # BR(~s_L -> chi^0_2 s)
     2.62312255E-04    2     1000025         3   # BR(~s_L -> chi^0_3 s)
     2.77002857E-01    2     1000035         3   # BR(~s_L -> chi^0_4 s)
     9.59506787E-02    2    -1000024         4   # BR(~s_L -> chi^-_1 c)
     5.60219709E-01    2    -1000037         4   # BR(~s_L -> chi^-_2 c)
     1.73155106E-07    2     2000004       -24   # BR(~s_L -> ~c_R W^-)
     3.76654159E-08    2     2000003        23   # BR(~s_L -> ~s_R Z)
     3.83674560E-08    2     2000003        25   # BR(~s_L -> ~s_R h^0)
DECAY   1000005     3.81344719E+00   # ~b_1
#    BR                NDA      ID1      ID2
     3.82049322E-01    2     1000022         5   # BR(~b_1 -> chi^0_1 b)
     1.23184348E-01    2     1000023         5   # BR(~b_1 -> chi^0_2 b)
     8.09476029E-02    2     1000025         5   # BR(~b_1 -> chi^0_3 b)
     8.01497899E-03    2     1000035         5   # BR(~b_1 -> chi^0_4 b)
     3.59759111E-01    2    -1000024         6   # BR(~b_1 -> chi^-_1 t)
     4.32697942E-02    2    -1000037         6   # BR(~b_1 -> chi^-_2 t)
     2.77484232E-03    2     1000006       -24   # BR(~b_1 -> ~t_1 W^-)
DECAY   2000005     5.26453957E+01   # ~b_2
#    BR                NDA      ID1      ID2
     7.39432863E-03    2     1000022         5   # BR(~b_2 -> chi^0_1 b)
     2.46036535E-02    2     1000023         5   # BR(~b_2 -> chi^0_2 b)
     6.69501229E-03    2     1000025         5   # BR(~b_2 -> chi^0_3 b)
     1.24836631E-01    2     1000035         5   # BR(~b_2 -> chi^0_4 b)
     4.74615062E-01    2    -1000024         6   # BR(~b_2 -> chi^-_1 t)
     3.47235648E-01    2    -1000037         6   # BR(~b_2 -> chi^-_2 t)
     1.46196642E-02    2     1000006       -24   # BR(~b_2 -> ~t_1 W^-)
DECAY   2000002     5.84464218E+00   # ~u_R
#    BR                NDA      ID1      ID2
     9.93761993E-01    2     1000022         2   # BR(~u_R -> chi^0_1 u)
     5.50168733E-03    2     1000023         2   # BR(~u_R -> chi^0_2 u)
     2.57682846E-04    2     1000025         2   # BR(~u_R -> chi^0_3 u)
     4.78636325E-04    2     1000035         2   # BR(~u_R -> chi^0_4 u)
     3.28905355E-10    2     1000024         1   # BR(~u_R -> chi^+_1 d)
     1.56139394E-11    2     1000037         1   # BR(~u_R -> chi^+_2 d)
DECAY   1000002     2.52643249E+01   # ~u_L
#    BR                NDA      ID1      ID2
     1.38921371E-02    2     1000022         2   # BR(~u_L -> chi^0_1 u)
     5.85718338E-02    2     1000023         2   # BR(~u_L -> chi^0_2 u)
     1.44389297E-04    2     1000025         2   # BR(~u_L -> chi^0_3 u)
     2.70570804E-01    2     1000035         2   # BR(~u_L -> chi^0_4 u)
     1.19776820E-01    2     1000024         1   # BR(~u_L -> chi^+_1 d)
     5.37044016E-01    2     1000037         1   # BR(~u_L -> chi^+_2 d)
     2.54063902E-10    2     2000001        24   # BR(~u_L -> ~d_R W^+)
     2.25891726E-13    2     2000002        23   # BR(~u_L -> ~u_R Z)
DECAY   2000004     5.84565308E+00   # ~c_R
#    BR                NDA      ID1      ID2
     9.93587828E-01    2     1000022         4   # BR(~c_R -> chi^0_1 c)
     5.54212245E-03    2     1000023         4   # BR(~c_R -> chi^0_2 c)
     3.00669534E-04    2     1000025         4   # BR(~c_R -> chi^0_3 c)
     4.80487572E-04    2     1000035         4   # BR(~c_R -> chi^0_4 c)
     8.48635580E-05    2     1000024         3   # BR(~c_R -> chi^+_1 s)
     4.02876480E-06    2     1000037         3   # BR(~c_R -> chi^+_2 s)
DECAY   1000004     2.52650462E+01   # ~c_L
#    BR                NDA      ID1      ID2
     1.38918378E-02    2     1000022         4   # BR(~c_L -> chi^0_1 c)
     5.85769546E-02    2     1000023         4   # BR(~c_L -> chi^0_2 c)
     1.54782481E-04    2     1000025         4   # BR(~c_L -> chi^0_3 c)
     2.70565838E-01    2     1000035         4   # BR(~c_L -> chi^0_4 c)
     1.19779032E-01    2     1000024         3   # BR(~c_L -> chi^+_1 s)
     5.37031381E-01    2     1000037         3   # BR(~c_L -> chi^+_2 s)
     9.17137030E-08    2     2000003        24   # BR(~c_L -> ~s_R W^+)
     5.82955951E-08    2     2000004        23   # BR(~c_L -> ~c_R Z)
     2.37623522E-08    2     2000004        25   # BR(~c_L -> ~c_R h^0)
DECAY   1000006     5.48645273E+01   # ~t_1
#    BR                NDA      ID1      ID2
     1.34495135E-07    2     1000022         4   # BR(~t_1 -> chi^0_1 c)
     9.57613218E-02    2     1000022         6   # BR(~t_1 -> chi^0_1 t)
     5.37205909E-07    2     1000023         4   # BR(~t_1 -> chi^0_2 c)
     2.00553332E-01    2     1000023         6   # BR(~t_1 -> chi^0_2 t)
     2.29553428E-01    2     1000025         6   # BR(~t_1 -> chi^0_3 t)
     2.03835961E-02    2     1000035         6   # BR(~t_1 -> chi^0_4 t)
     4.12380149E-01    2     1000024         5   # BR(~t_1 -> chi^+_1 b)
     4.13600567E-02    2     1000037         5   # BR(~t_1 -> chi^+_2 b)
#    BR                NDA      ID1      ID2       ID3
     7.44459468E-06    3     1000022        24         5   # BR(~t_1 -> chi^0_1 W^+ b)
DECAY   2000006     5.37569750E+01   # ~t_2
#    BR                NDA      ID1      ID2
     6.86358225E-03    2     1000022         6   # BR(~t_2 -> chi^0_1 t)
     2.29516637E-01    2     1000023         6   # BR(~t_2 -> chi^0_2 t)
     2.64067152E-01    2     1000025         6   # BR(~t_2 -> chi^0_3 t)
     1.84062117E-01    2     1000035         6   # BR(~t_2 -> chi^0_4 t)
     3.17361597E-02    2     1000024         5   # BR(~t_2 -> chi^+_1 b)
     2.70280348E-01    2     1000037         5   # BR(~t_2 -> chi^+_2 b)
     7.65263316E-03    2     1000006        23   # BR(~t_2 -> ~t_1 Z)
     5.82137078E-03    2     1000006        25   # BR(~t_2 -> ~t_1 h^0)
DECAY   1000024     6.74595811E-01   # chi^+_1
#    BR                NDA      ID1      ID2
     7.18782342E-09    2    -2000011        12   # BR(chi^+_1 -> ~e^+_R nu_e)
     1.63986226E-02    2    -1000011        12   # BR(chi^+_1 -> ~e^+_L nu_e)
     3.07309941E-04    2    -2000013        14   # BR(chi^+_1 -> ~mu^+_R nu_mu)
     1.63980354E-02    2    -1000013        14   # BR(chi^+_1 -> ~mu^+_L nu_mu)
     8.75494910E-02    2    -1000015        16   # BR(chi^+_1 -> ~tau^+_1 nu_tau)
     1.62319212E-02    2    -2000015        16   # BR(chi^+_1 -> ~tau^+_2 nu_tau)
     2.26647614E-02    2     1000012       -11   # BR(chi^+_1 -> ~nu_e e^+)
     2.26776069E-02    2     1000014       -13   # BR(chi^+_1 -> ~nu_mu mu^+)
     2.63579662E-02    2     1000016       -15   # BR(chi^+_1 -> ~nu_tau tau^+)
     7.88318816E-01    2     1000022        24   # BR(chi^+_1 -> chi^0_1 W^+)
#    BR                NDA      ID1      ID2       ID3
     3.16794533E-08    3     1000022        -1         2   # BR(chi^+_1 -> chi^0_1 d_bar u)
     3.18407412E-08    3     1000022        -3         4   # BR(chi^+_1 -> chi^0_1 s_bar c)
     3.08759609E-03    3     1000022        -5         6   # BR(chi^+_1 -> chi^0_1 b_bar t)
     6.56989304E-13    3     1000022       -11        12   # BR(chi^+_1 -> chi^0_1 e^+ nu_e)
     2.80862242E-08    3     1000022       -13        14   # BR(chi^+_1 -> chi^0_1 mu^+ nu_mu)
     7.77468403E-06    3     1000022       -15        16   # BR(chi^+_1 -> chi^0_1 tau^+ nu_tau)
DECAY   1000037     6.09964152E+00   # chi^+_2
#    BR                NDA      ID1      ID2
     4.12177459E-11    2    -2000011        12   # BR(chi^+_2 -> ~e^+_R nu_e)
     9.47445716E-02    2    -1000011        12   # BR(chi^+_2 -> ~e^+_L nu_e)
     1.76225195E-06    2    -2000013        14   # BR(chi^+_2 -> ~mu^+_R nu_mu)
     9.47466747E-02    2    -1000013        14   # BR(chi^+_2 -> ~mu^+_L nu_mu)
     5.03524326E-04    2    -1000015        16   # BR(chi^+_2 -> ~tau^+_1 nu_tau)
     9.53405267E-02    2    -2000015        16   # BR(chi^+_2 -> ~tau^+_2 nu_tau)
     9.36366524E-02    2     1000012       -11   # BR(chi^+_2 -> ~nu_e e^+)
     9.36394326E-02    2     1000014       -13   # BR(chi^+_2 -> ~nu_mu mu^+)
     9.44251674E-02    2     1000016       -15   # BR(chi^+_2 -> ~nu_tau tau^+)
     1.03119285E-02    2     1000022        24   # BR(chi^+_2 -> chi^0_1 W^+)
     1.37302720E-01    2     1000023        24   # BR(chi^+_2 -> chi^0_2 W^+)
     8.57588510E-02    2     1000025        24   # BR(chi^+_2 -> chi^0_3 W^+)
     1.24950257E-01    2     1000024        23   # BR(chi^+_2 -> chi^+_1 Z)
     7.45439317E-02    2     1000024        25   # BR(chi^+_2 -> chi^+_1 h^0)
#    BR                NDA      ID1      ID2       ID3
     1.42777617E-09    3     1000024         2        -2   # BR(chi^+_2 -> chi^+_1 u u_bar)
     1.42630036E-09    3     1000024         4        -4   # BR(chi^+_2 -> chi^+_1 c c_bar)
     1.72056736E-09    3     1000024         1        -1   # BR(chi^+_2 -> chi^+_1 d d_bar)
     1.72277699E-09    3     1000024         3        -3   # BR(chi^+_2 -> chi^+_1 s s_bar)
     9.05532089E-09    3     1000024         5        -5   # BR(chi^+_2 -> chi^+_1 b b_bar)
     3.23016638E-07    3     1000024        11       -11   # BR(chi^+_2 -> chi^+_1 e^- e^+)
     3.23133205E-07    3     1000024        13       -13   # BR(chi^+_2 -> chi^+_1 mu^- mu^+)
     3.49291686E-07    3     1000024        15       -15   # BR(chi^+_2 -> chi^+_1 tau^- tau^+)
     8.38416647E-07    3     1000024        12       -12   # BR(chi^+_2 -> chi^+_1 nu_e nu_bar_e)
     1.02361915E-07    3     1000022        -1         2   # BR(chi^+_2 -> chi^0_1 d_bar u)
     1.02361476E-07    3     1000022        -3         4   # BR(chi^+_2 -> chi^0_1 s_bar c)
     9.13397837E-05    3     1000022        -5         6   # BR(chi^+_2 -> chi^0_1 b_bar t)
     3.47543863E-10    3     1000022       -13        14   # BR(chi^+_2 -> chi^0_1 mu^+ nu_mu)
     9.70893161E-08    3     1000022       -15        16   # BR(chi^+_2 -> chi^0_1 tau^+ nu_tau)
     7.60877098E-10    3     1000023        -1         2   # BR(chi^+_2 -> chi^0_2 d_bar u)
     7.62169784E-10    3     1000023        -3         4   # BR(chi^+_2 -> chi^0_2 s_bar c)
     1.63140006E-07    3     1000023       -11        12   # BR(chi^+_2 -> chi^0_2 e^+ nu_e)
     1.63182110E-07    3     1000023       -13        14   # BR(chi^+_2 -> chi^0_2 mu^+ nu_mu)
     1.70674995E-07    3     1000023       -15        16   # BR(chi^+_2 -> chi^0_2 tau^+ nu_tau)
     4.02843339E-12    3     1000025        -1         2   # BR(chi^+_2 -> chi^0_3 d_bar u)
     4.52290695E-12    3     1000025        -3         4   # BR(chi^+_2 -> chi^0_3 s_bar c)
     6.25221533E-10    3     1000025       -11        12   # BR(chi^+_2 -> chi^0_3 e^+ nu_e)
     6.54351645E-10    3     1000025       -13        14   # BR(chi^+_2 -> chi^0_3 mu^+ nu_mu)
     8.74841001E-09    3     1000025       -15        16   # BR(chi^+_2 -> chi^0_3 tau^+ nu_tau)
DECAY   1000022     1.54833064E+00   # chi^0_1
#    BR                NDA      ID1      ID2
     1.64178846E-01    2     2000011       -11   # BR(chi^0_1 -> ~e^-_R e^+)
     1.64178846E-01    2    -2000011        11   # BR(chi^0_1 -> ~e^+_R e^-)
     1.64204868E-01    2     2000013       -13   # BR(chi^0_1 -> ~mu^-_R mu^+)
     1.64204868E-01    2    -2000013        13   # BR(chi^0_1 -> ~mu^+_R mu^-)
     1.71616285E-01    2     1000015       -15   # BR(chi^0_1 -> ~tau^-_1 tau^+)
     1.71616285E-01    2    -1000015        15   # BR(chi^0_1 -> ~tau^+_1 tau^-)
DECAY   1000023     7.90727447E-01   # chi^0_2
#    BR                NDA      ID1      ID2
     1.33591965E-02    2     2000011       -11   # BR(chi^0_2 -> ~e^-_R e^+)
     1.33591965E-02    2    -2000011        11   # BR(chi^0_2 -> ~e^+_R e^-)
     1.03962128E-02    2     1000011       -11   # BR(chi^0_2 -> ~e^-_L e^+)
     1.03962128E-02    2    -1000011        11   # BR(chi^0_2 -> ~e^+_L e^-)
     1.34884414E-02    2     2000013       -13   # BR(chi^0_2 -> ~mu^-_R mu^+)
     1.34884414E-02    2    -2000013        13   # BR(chi^0_2 -> ~mu^+_R mu^-)
     1.04006964E-02    2     1000013       -13   # BR(chi^0_2 -> ~mu^-_L mu^+)
     1.04006964E-02    2    -1000013        13   # BR(chi^0_2 -> ~mu^+_L mu^-)
     5.02146256E-02    2     1000015       -15   # BR(chi^0_2 -> ~tau^-_1 tau^+)
     5.02146256E-02    2    -1000015        15   # BR(chi^0_2 -> ~tau^+_1 tau^-)
     1.16771142E-02    2     2000015       -15   # BR(chi^0_2 -> ~tau^-_2 tau^+)
     1.16771142E-02    2    -2000015        15   # BR(chi^0_2 -> ~tau^+_2 tau^-)
     7.10119076E-03    2     1000012       -12   # BR(chi^0_2 -> ~nu_e nu_bar_e)
     7.10119076E-03    2    -1000012        12   # BR(chi^0_2 -> ~nu^*_e nu_e)
     7.10166601E-03    2     1000014       -14   # BR(chi^0_2 -> ~nu_mu nu_bar_mu)
     7.10166601E-03    2    -1000014        14   # BR(chi^0_2 -> ~nu^*_mu nu_mu)
     7.23614827E-03    2     1000016       -16   # BR(chi^0_2 -> ~nu_tau nu_bar_tau)
     7.23614827E-03    2    -1000016        16   # BR(chi^0_2 -> ~nu^*_tau nu_tau)
     3.17415601E-02    2     1000022        23   # BR(chi^0_2 -> chi^0_1 Z)
     7.06253782E-01    2     1000022        25   # BR(chi^0_2 -> chi^0_1 h^0)
     8.41825994E-07    2     1000022        22   # BR(chi^0_2 -> chi^0_1 photon)
#    BR                NDA      ID1      ID2       ID3
     2.07345055E-08    3     1000022         2        -2   # BR(chi^0_2 -> chi^0_1 u u_bar)
     2.07697993E-08    3     1000022         4        -4   # BR(chi^0_2 -> chi^0_1 c c_bar)
     3.47085920E-05    3     1000022         6        -6   # BR(chi^0_2 -> chi^0_1 t t_bar)
     1.44454556E-08    3     1000022         1        -1   # BR(chi^0_2 -> chi^0_1 d d_bar)
     1.46186090E-08    3     1000022         3        -3   # BR(chi^0_2 -> chi^0_1 s s_bar)
     4.83803203E-07    3     1000022         5        -5   # BR(chi^0_2 -> chi^0_1 b b_bar)
     3.87769599E-06    3     1000022        11       -11   # BR(chi^0_2 -> chi^0_1 e^- e^+)
     3.90091591E-06    3     1000022        13       -13   # BR(chi^0_2 -> chi^0_1 mu^- mu^+)
     1.01909038E-05    3     1000022        15       -15   # BR(chi^0_2 -> chi^0_1 tau^- tau^+)
     1.40692114E-11    3     1000024         1        -2   # BR(chi^0_2 -> chi^+_1 d u_bar)
     1.40692114E-11    3    -1000024        -1         2   # BR(chi^0_2 -> chi^-_1 d_bar u)
     9.61343422E-13    3     1000024         3        -4   # BR(chi^0_2 -> chi^+_1 s c_bar)
     9.61343422E-13    3    -1000024        -3         4   # BR(chi^0_2 -> chi^-_1 s_bar c)
     4.63289459E-12    3     1000024        11       -12   # BR(chi^0_2 -> chi^+_1 e^- nu_bar_e)
     4.63289459E-12    3    -1000024       -11        12   # BR(chi^0_2 -> chi^-_1 e^+ nu_e)
     4.55774378E-12    3     1000024        13       -14   # BR(chi^0_2 -> chi^+_1 mu^- nu_bar_mu)
     4.55774378E-12    3    -1000024       -13        14   # BR(chi^0_2 -> chi^-_1 mu^+ nu_mu)
DECAY   1000025     7.13700554E-01   # chi^0_3
#    BR                NDA      ID1      ID2
     7.39253557E-04    2     2000011       -11   # BR(chi^0_3 -> ~e^-_R e^+)
     7.39253557E-04    2    -2000011        11   # BR(chi^0_3 -> ~e^+_R e^-)
     1.84080572E-05    2     1000011       -11   # BR(chi^0_3 -> ~e^-_L e^+)
     1.84080572E-05    2    -1000011        11   # BR(chi^0_3 -> ~e^+_L e^-)
     8.91016740E-04    2     2000013       -13   # BR(chi^0_3 -> ~mu^-_R mu^+)
     8.91016740E-04    2    -2000013        13   # BR(chi^0_3 -> ~mu^+_R mu^-)
     2.70840042E-05    2     1000013       -13   # BR(chi^0_3 -> ~mu^-_L mu^+)
     2.70840042E-05    2    -1000013        13   # BR(chi^0_3 -> ~mu^+_L mu^-)
     4.39959603E-02    2     1000015       -15   # BR(chi^0_3 -> ~tau^-_1 tau^+)
     4.39959603E-02    2    -1000015        15   # BR(chi^0_3 -> ~tau^+_1 tau^-)
     2.49830189E-03    2     2000015       -15   # BR(chi^0_3 -> ~tau^-_2 tau^+)
     2.49830189E-03    2    -2000015        15   # BR(chi^0_3 -> ~tau^+_2 tau^-)
     1.23234654E-04    2     1000012       -12   # BR(chi^0_3 -> ~nu_e nu_bar_e)
     1.23234654E-04    2    -1000012        12   # BR(chi^0_3 -> ~nu^*_e nu_e)
     1.23240893E-04    2     1000014       -14   # BR(chi^0_3 -> ~nu_mu nu_bar_mu)
     1.23240893E-04    2    -1000014        14   # BR(chi^0_3 -> ~nu^*_mu nu_mu)
     1.25004248E-04    2     1000016       -16   # BR(chi^0_3 -> ~nu_tau nu_bar_tau)
     1.25004248E-04    2    -1000016        16   # BR(chi^0_3 -> ~nu^*_tau nu_tau)
     8.64104179E-01    2     1000022        23   # BR(chi^0_3 -> chi^0_1 Z)
     3.82058081E-02    2     1000022        25   # BR(chi^0_3 -> chi^0_1 h^0)
     8.23605261E-07    2     1000022        22   # BR(chi^0_3 -> chi^0_1 photon)
     3.04807463E-09    2     1000023        22   # BR(chi^0_3 -> chi^0_2 photon)
#    BR                NDA      ID1      ID2       ID3
     1.90017858E-10    3     1000022         2        -2   # BR(chi^0_3 -> chi^0_1 u u_bar)
     2.49452626E-10    3     1000022         4        -4   # BR(chi^0_3 -> chi^0_1 c c_bar)
     5.53212490E-04    3     1000022         6        -6   # BR(chi^0_3 -> chi^0_1 t t_bar)
     5.01430727E-11    3     1000022         1        -1   # BR(chi^0_3 -> chi^0_1 d d_bar)
     3.04190212E-10    3     1000022         3        -3   # BR(chi^0_3 -> chi^0_1 s s_bar)
     6.84717020E-07    3     1000022         5        -5   # BR(chi^0_3 -> chi^0_1 b b_bar)
     9.58655957E-08    3     1000022        11       -11   # BR(chi^0_3 -> chi^0_1 e^- e^+)
     1.27919495E-07    3     1000022        13       -13   # BR(chi^0_3 -> chi^0_1 mu^- mu^+)
     8.99056677E-06    3     1000022        15       -15   # BR(chi^0_3 -> chi^0_1 tau^- tau^+)
     1.12925802E-06    3     1000023         2        -2   # BR(chi^0_3 -> chi^0_2 u u_bar)
     1.11039600E-06    3     1000023         4        -4   # BR(chi^0_3 -> chi^0_2 c c_bar)
     1.46577337E-06    3     1000023         1        -1   # BR(chi^0_3 -> chi^0_2 d d_bar)
     1.46559267E-06    3     1000023         3        -3   # BR(chi^0_3 -> chi^0_2 s s_bar)
     1.13518752E-06    3     1000023         5        -5   # BR(chi^0_3 -> chi^0_2 b b_bar)
     3.36884036E-07    3     1000023        11       -11   # BR(chi^0_3 -> chi^0_2 e^- e^+)
     3.36846354E-07    3     1000023        13       -13   # BR(chi^0_3 -> chi^0_2 mu^- mu^+)
     3.26016398E-07    3     1000023        15       -15   # BR(chi^0_3 -> chi^0_2 tau^- tau^+)
     2.01805116E-06    3     1000023        12       -12   # BR(chi^0_3 -> chi^0_2 nu_e nu_bar_e)
     5.66031071E-06    3     1000024         1        -2   # BR(chi^0_3 -> chi^+_1 d u_bar)
     5.66031071E-06    3    -1000024        -1         2   # BR(chi^0_3 -> chi^-_1 d_bar u)
     5.59575178E-06    3     1000024         3        -4   # BR(chi^0_3 -> chi^+_1 s c_bar)
     5.59575178E-06    3    -1000024        -3         4   # BR(chi^0_3 -> chi^-_1 s_bar c)
     1.88606501E-06    3     1000024        11       -12   # BR(chi^0_3 -> chi^+_1 e^- nu_bar_e)
     1.88606501E-06    3    -1000024       -11        12   # BR(chi^0_3 -> chi^-_1 e^+ nu_e)
     1.88605169E-06    3     1000024        13       -14   # BR(chi^0_3 -> chi^+_1 mu^- nu_bar_mu)
     1.88605169E-06    3    -1000024       -13        14   # BR(chi^0_3 -> chi^-_1 mu^+ nu_mu)
     1.84247886E-06    3     1000024        15       -16   # BR(chi^0_3 -> chi^+_1 tau^- nu_bar_tau)
     1.84247886E-06    3    -1000024       -15        16   # BR(chi^0_3 -> chi^-_1 tau^+ nu_tau)
DECAY   1000035     6.10621380E+00   # chi^0_4
#    BR                NDA      ID1      ID2
     2.26917876E-04    2     2000011       -11   # BR(chi^0_4 -> ~e^-_R e^+)
     2.26917876E-04    2    -2000011        11   # BR(chi^0_4 -> ~e^+_R e^-)
     4.48542383E-02    2     1000011       -11   # BR(chi^0_4 -> ~e^-_L e^+)
     4.48542383E-02    2    -1000011        11   # BR(chi^0_4 -> ~e^+_L e^-)
     2.27758149E-04    2     2000013       -13   # BR(chi^0_4 -> ~mu^-_R mu^+)
     2.27758149E-04    2    -2000013        13   # BR(chi^0_4 -> ~mu^+_R mu^-)
     4.48557255E-02    2     1000013       -13   # BR(chi^0_4 -> ~mu^-_L mu^+)
     4.48557255E-02    2    -1000013        13   # BR(chi^0_4 -> ~mu^+_L mu^-)
     4.67956408E-04    2     1000015       -15   # BR(chi^0_4 -> ~tau^-_1 tau^+)
     4.67956408E-04    2    -1000015        15   # BR(chi^0_4 -> ~tau^+_1 tau^-)
     4.52758243E-02    2     2000015       -15   # BR(chi^0_4 -> ~tau^-_2 tau^+)
     4.52758243E-02    2    -2000015        15   # BR(chi^0_4 -> ~tau^+_2 tau^-)
     4.91140240E-02    2     1000012       -12   # BR(chi^0_4 -> ~nu_e nu_bar_e)
     4.91140240E-02    2    -1000012        12   # BR(chi^0_4 -> ~nu^*_e nu_e)
     4.91149895E-02    2     1000014       -14   # BR(chi^0_4 -> ~nu_mu nu_bar_mu)
     4.91149895E-02    2    -1000014        14   # BR(chi^0_4 -> ~nu^*_mu nu_mu)
     4.93872696E-02    2     1000016       -16   # BR(chi^0_4 -> ~nu_tau nu_bar_tau)
     4.93872696E-02    2    -1000016        16   # BR(chi^0_4 -> ~nu^*_tau nu_tau)
     1.37091382E-01    2     1000024       -24   # BR(chi^0_4 -> chi^+_1 W^-)
     1.37091382E-01    2    -1000024        24   # BR(chi^0_4 -> chi^-_1 W^+)
     8.65041789E-04    2     1000022        23   # BR(chi^0_4 -> chi^0_1 Z)
     5.79944342E-04    2     1000023        23   # BR(chi^0_4 -> chi^0_2 Z)
     7.12275492E-02    2     1000025        23   # BR(chi^0_4 -> chi^0_3 Z)
     1.07242210E-02    2     1000022        25   # BR(chi^0_4 -> chi^0_1 h^0)
     7.52710552E-02    2     1000023        25   # BR(chi^0_4 -> chi^0_2 h^0)
     7.72499914E-05    2     1000025        25   # BR(chi^0_4 -> chi^0_3 h^0)
     2.64754281E-07    2     1000022        22   # BR(chi^0_4 -> chi^0_1 photon)
     5.58957748E-07    2     1000023        22   # BR(chi^0_4 -> chi^0_2 photon)
     5.78326840E-07    2     1000025        22   # BR(chi^0_4 -> chi^0_3 photon)
#    BR                NDA      ID1      ID2       ID3
     4.67441088E-08    3     1000022         2        -2   # BR(chi^0_4 -> chi^0_1 u u_bar)
     4.67393648E-08    3     1000022         4        -4   # BR(chi^0_4 -> chi^0_1 c c_bar)
     1.82806551E-05    3     1000022         6        -6   # BR(chi^0_4 -> chi^0_1 t t_bar)
     5.58218050E-08    3     1000022         1        -1   # BR(chi^0_4 -> chi^0_1 d d_bar)
     5.58262230E-08    3     1000022         3        -3   # BR(chi^0_4 -> chi^0_1 s s_bar)
     7.69711554E-08    3     1000022         5        -5   # BR(chi^0_4 -> chi^0_1 b b_bar)
     1.40862482E-07    3     1000022        11       -11   # BR(chi^0_4 -> chi^0_1 e^- e^+)
     1.41165363E-07    3     1000022        13       -13   # BR(chi^0_4 -> chi^0_1 mu^- mu^+)
     2.24055588E-07    3     1000022        15       -15   # BR(chi^0_4 -> chi^0_1 tau^- tau^+)
     1.20357258E-09    3     1000023         2        -2   # BR(chi^0_4 -> chi^0_2 u u_bar)
     1.20228000E-09    3     1000023         4        -4   # BR(chi^0_4 -> chi^0_2 c c_bar)
     1.04686382E-09    3     1000023         1        -1   # BR(chi^0_4 -> chi^0_2 d d_bar)
     1.04767570E-09    3     1000023         3        -3   # BR(chi^0_4 -> chi^0_2 s s_bar)
     3.38599481E-09    3     1000023         5        -5   # BR(chi^0_4 -> chi^0_2 b b_bar)
     2.58699816E-07    3     1000023        11       -11   # BR(chi^0_4 -> chi^0_2 e^- e^+)
     2.58750403E-07    3     1000023        13       -13   # BR(chi^0_4 -> chi^0_2 mu^- mu^+)
     2.66449648E-07    3     1000023        15       -15   # BR(chi^0_4 -> chi^0_2 tau^- tau^+)
     4.85922887E-07    3     1000023        12       -12   # BR(chi^0_4 -> chi^0_2 nu_e nu_bar_e)
     4.84733572E-13    3     1000025         2        -2   # BR(chi^0_4 -> chi^0_3 u u_bar)
     5.35963270E-13    3     1000025         4        -4   # BR(chi^0_4 -> chi^0_3 c c_bar)
     8.78963430E-13    3     1000025         1        -1   # BR(chi^0_4 -> chi^0_3 d d_bar)
     1.50730020E-12    3     1000025         3        -3   # BR(chi^0_4 -> chi^0_3 s s_bar)
     1.71005516E-09    3     1000025         5        -5   # BR(chi^0_4 -> chi^0_3 b b_bar)
     3.44527694E-11    3     1000025        11       -11   # BR(chi^0_4 -> chi^0_3 e^- e^+)
     6.05634641E-11    3     1000025        13       -13   # BR(chi^0_4 -> chi^0_3 mu^- mu^+)
     7.33834885E-09    3     1000025        15       -15   # BR(chi^0_4 -> chi^0_3 tau^- tau^+)
     6.51543022E-10    3     1000025        12       -12   # BR(chi^0_4 -> chi^0_3 nu_e nu_bar_e)
     7.94064289E-10    3     1000024         1        -2   # BR(chi^0_4 -> chi^+_1 d u_bar)
     7.94064289E-10    3    -1000024        -1         2   # BR(chi^0_4 -> chi^-_1 d_bar u)
     7.95296696E-10    3     1000024         3        -4   # BR(chi^0_4 -> chi^+_1 s c_bar)
     7.95296696E-10    3    -1000024        -3         4   # BR(chi^0_4 -> chi^-_1 s_bar c)
     1.64591536E-07    3     1000024        11       -12   # BR(chi^0_4 -> chi^+_1 e^- nu_bar_e)
     1.64591536E-07    3    -1000024       -11        12   # BR(chi^0_4 -> chi^-_1 e^+ nu_e)
     1.64633623E-07    3     1000024        13       -14   # BR(chi^0_4 -> chi^+_1 mu^- nu_bar_mu)
     1.64633623E-07    3    -1000024       -13        14   # BR(chi^0_4 -> chi^-_1 mu^+ nu_mu)
     1.73991204E-07    3     1000024        15       -16   # BR(chi^0_4 -> chi^+_1 tau^- nu_bar_tau)
     1.73991204E-07    3    -1000024       -15        16   # BR(chi^0_4 -> chi^-_1 tau^+ nu_tau)
DECAY   1000021     1.16620215E+01   # ~g
#    BR                NDA      ID1      ID2
     4.23079074E-02    2     2000002        -2   # BR(~g -> ~u_R u_bar)
     4.23079074E-02    2    -2000002         2   # BR(~g -> ~u^*_R u)
     6.10557798E-03    2     1000002        -2   # BR(~g -> ~u_L u_bar)
     6.10557798E-03    2    -1000002         2   # BR(~g -> ~u^*_L u)
     4.23080596E-02    2     2000004        -4   # BR(~g -> ~c_R c_bar)
     4.23080596E-02    2    -2000004         4   # BR(~g -> ~c^*_R c)
     6.10531192E-03    2     1000004        -4   # BR(~g -> ~c_L c_bar)
     6.10531192E-03    2    -1000004         4   # BR(~g -> ~c^*_L c)
     4.48115238E-06    2     1000006        -4   # BR(~g -> ~t_1 c_bar)
     4.48115238E-06    2    -1000006         4   # BR(~g -> ~t^*_1 c)
     1.50025465E-01    2     1000006        -6   # BR(~g -> ~t_1 t_bar)
     1.50025465E-01    2    -1000006         6   # BR(~g -> ~t^*_1 t)
     4.69059625E-02    2     2000001        -1   # BR(~g -> ~d_R d_bar)
     4.69059625E-02    2    -2000001         1   # BR(~g -> ~d^*_R d)
     5.92292131E-03    2     1000001        -1   # BR(~g -> ~d_L d_bar)
     5.92292131E-03    2    -1000001         1   # BR(~g -> ~d^*_L d)
     4.69068275E-02    2     2000003        -3   # BR(~g -> ~s_R s_bar)
     4.69068275E-02    2    -2000003         3   # BR(~g -> ~s^*_R s)
     5.92337075E-03    2     1000003        -3   # BR(~g -> ~s_L s_bar)
     5.92337075E-03    2    -1000003         3   # BR(~g -> ~s^*_L s)
     4.92589838E-02    2     1000005        -5   # BR(~g -> ~b_1 b_bar)
     4.92589838E-02    2    -1000005         5   # BR(~g -> ~b^*_1 b)
     3.62041892E-02    2     2000005        -5   # BR(~g -> ~b_2 b_bar)
     3.62041892E-02    2    -2000005         5   # BR(~g -> ~b^*_2 b)
     7.37104010E-08    2     1000039        21   # BR(~g -> ~G g)
     6.33853410E-06    2     1000022        21   # BR(~g -> chi^0_1 g)
     1.38108845E-04    2     1000023        21   # BR(~g -> chi^0_2 g)
     1.65853824E-04    2     1000025        21   # BR(~g -> chi^0_3 g)
     3.46797175E-05    2     1000035        21   # BR(~g -> chi^0_4 g)
#    BR                NDA      ID1      ID2       ID3
     8.96990740E-04    3     1000022         6        -6   # BR(~g -> chi^0_1 t t_bar)
     2.85228498E-02    3     1000023         6        -6   # BR(~g -> chi^0_2 t t_bar)
     3.29652045E-02    3     1000025         6        -6   # BR(~g -> chi^0_3 t t_bar)
     2.38809440E-02    3     1000035         6        -6   # BR(~g -> chi^0_4 t t_bar)
     1.98913292E-03    3     1000024         5        -6   # BR(~g -> chi^+_1 b t_bar)
     1.98913292E-03    3    -1000024        -5         6   # BR(~g -> chi^-_1 b_bar t)
     1.67262871E-02    3     1000037         5        -6   # BR(~g -> chi^+_2 b t_bar)
     1.67262871E-02    3    -1000037        -5         6   # BR(~g -> chi^-_2 b_bar t)
DECAY        25     2.90082216E-03   # h^0
#    BR                NDA      ID1      ID2
     7.89644129E-09    2          11       -11   # BR(h^0 -> e^- e^+)
     3.37594926E-04    2          13       -13   # BR(h^0 -> mu^- mu^+)
     9.52652238E-02    2          15       -15   # BR(h^0 -> tau^- tau^+)
     6.75370680E-07    2           1        -1   # BR(h^0 -> d d_bar)
     2.43808359E-04    2           3        -3   # BR(h^0 -> s s_bar)
     6.29776231E-01    2           5        -5   # BR(h^0 -> b b_bar)
     1.54962127E-07    2           2        -2   # BR(h^0 -> u u_bar)
     3.99820671E-02    2           4        -4   # BR(h^0 -> c c_bar)
     9.22491081E-02    2          21        21   # BR(h^0 -> g g)
     3.17383860E-03    2          22        22   # BR(h^0 -> photon photon)
# writing decays into V V* as 3-body decays
#    BR                NDA      ID1      ID2       ID3
     6.35218884E-03    3          24        11        12   # BR(h^0 -> W^+ e^- nu_e)
     6.35218884E-03    3          24        13        14   # BR(h^0 -> W^+ mu^- nu_mu)
     6.35218884E-03    3          24        15        16   # BR(h^0 -> W^+ tau^- nu_tau)
     2.22326609E-02    3          24         1        -2   # BR(h^0 -> W^+ d u_bar)
     2.22326609E-02    3          24         3        -4   # BR(h^0 -> W^+ s c_bar)
     6.35218884E-03    3         -24       -11       -12   # BR(h^0 -> W^- e^+ nu_bar_e)
     6.35218884E-03    3         -24       -13       -14   # BR(h^0 -> W^- mu^+ nu_bar_mu)
     6.35218884E-03    3         -24       -15       -16   # BR(h^0 -> W^- tau^+ nu_bar_tau)
     2.22326609E-02    3         -24        -1         2   # BR(h^0 -> W^- d_bar u)
     2.22326609E-02    3         -24        -3         4   # BR(h^0 -> W^- s_bar c)
     4.00764434E-04    3          23        11       -11   # BR(h^0 -> Z e^- e^+)
     4.00764434E-04    3          23        13       -13   # BR(h^0 -> Z mu^- mu^+)
     4.03149937E-04    3          23        15       -15   # BR(h^0 -> Z tau^- tau^+)
     2.38550258E-03    3          23        12       -12   # BR(h^0 -> Z nu_e nu_bar_e)
     1.86069202E-03    3          23         1        -1   # BR(h^0 -> Z d d_bar)
     1.86069202E-03    3          23         3        -3   # BR(h^0 -> Z s s_bar)
     1.80105445E-03    3          23         5        -5   # BR(h^0 -> Z b b_bar)
     1.38359150E-03    3          23         2        -2   # BR(h^0 -> Z u u_bar)
     1.43130155E-03    3          23         4        -4   # BR(h^0 -> Z c c_bar)
DECAY        35     2.41741970E+00   # H^0
#    BR                NDA      ID1      ID2
     8.76345215E-09    2          11       -11   # BR(H^0 -> e^- e^+)
     3.74665358E-04    2          13       -13   # BR(H^0 -> mu^- mu^+)
     1.05988488E-01    2          15       -15   # BR(H^0 -> tau^- tau^+)
     6.17319533E-07    2           1        -1   # BR(H^0 -> d d_bar)
     2.22852165E-04    2           3        -3   # BR(H^0 -> s s_bar)
     5.95372116E-01    2           5        -5   # BR(H^0 -> b b_bar)
     1.96539831E-11    2           2        -2   # BR(H^0 -> u u_bar)
     5.07199055E-06    2           4        -4   # BR(H^0 -> c c_bar)
     2.77515295E-01    2           6        -6   # BR(H^0 -> t t_bar)
     5.49431172E-05    2     2000011  -2000011   # BR(H^0 -> ~e^-_R ~e^+_R)
     5.49178123E-05    2     2000013  -2000013   # BR(H^0 -> ~mu^-_R ~mu^+_R)
     4.79781735E-05    2     1000015  -1000015   # BR(H^0 -> ~tau^-_1 ~tau^+_1)
     7.77707321E-04    2     1000022   1000022   # BR(H^0 -> chi^0_1 chi^0_1)
     6.25368627E-03    2          23        23   # BR(H^0 -> Z Z)
     1.18365169E-02    2          24       -24   # BR(H^0 -> W^+ W^-)
     1.34861526E-03    2          25        25   # BR(H^0 -> h^0 h^0)
     1.45019528E-04    2          21        21   # BR(H^0 -> g g)
     1.50077966E-06    2          22        22   # BR(H^0 -> photon photon)
DECAY        36     2.39524298E+00   # A^0
#    BR                NDA      ID1      ID2
     8.84562898E-09    2          11       -11   # BR(A^0 -> e^- e^+)
     3.78178688E-04    2          13       -13   # BR(A^0 -> mu^- mu^+)
     1.06983132E-01    2          15       -15   # BR(A^0 -> tau^- tau^+)
     6.23107124E-07    2           1        -1   # BR(A^0 -> d d_bar)
     2.24941508E-04    2           3        -3   # BR(A^0 -> s s_bar)
     6.00955608E-01    2           5        -5   # BR(A^0 -> b b_bar)
     1.93366073E-11    2           2        -2   # BR(A^0 -> u u_bar)
     4.99008551E-06    2           4        -4   # BR(A^0 -> c c_bar)
     2.86484645E-01    2           6        -6   # BR(A^0 -> t t_bar)
     4.33192126E-03    2     1000022   1000022   # BR(A^0 -> chi^0_1 chi^0_1)
     5.44402813E-04    2          25        23   # BR(A^0 -> h^0 Z)
     9.08939539E-05    2          21        21   # BR(A^0 -> g g)
     6.53964411E-07    2          22        22   # BR(A^0 -> photon photon)
DECAY        37     2.07439398E+00   # H^+
#    BR                NDA      ID1      ID2
     1.02355129E-08    2         -11        12   # BR(H^+ -> e^+ nu_e)
     4.37600632E-04    2         -13        12   # BR(H^+ -> mu^+ nu_e)
     1.23793033E-01    2         -15        12   # BR(H^+ -> tau^+ nu_e)
     6.33443205E-07    2          -1         2   # BR(H^+ -> d_bar u)
     2.33737987E-04    2          -3         4   # BR(H^+ -> s_bar c)
     8.74919407E-01    2          -5         6   # BR(H^+ -> b_bar t)
     6.15577461E-04    2          25        24   # BR(H^+ -> h^0 W^+)
DECAY         6     2.43000000E+00   # top
#    BR                NDA      ID1      ID2
     1.00000000E+00    2           5        24   # BR(t -> b W)
Block HiggsBoundsInputHiggsCouplingsFermions
# ScalarNormEffCoupSq PseudoSNormEffCoupSq NP IP1 IP2 IP2
    1.02565252E+00    0.00000000E+00        3  25   5   5  # h0-b-b eff. coupling^2, normalised to SM
    9.07507666E+01    0.00000000E+00        3  35   5   5  # H0-b-b eff. coupling^2, normalised to SM
    0.00000000E+00    9.07764192E+01        3  36   5   5  # A0-b-b eff. coupling^2, normalised to SM
#
    9.99717410E-01    0.00000000E+00        3  25   6   6  # h0-t-t eff. coupling^2, normalised to SM
    1.12986669E-02    0.00000000E+00        3  35   6   6  # H0-t-t eff. coupling^2, normalised to SM
    0.00000000E+00    1.10160767E-02        3  36   6   6  # A0-t-t eff. coupling^2, normalised to SM
#
    1.02565252E+00    0.00000000E+00        3  25  15  15  # h0-tau-tau eff. coupling^2, normalised to SM
    9.07507666E+01    0.00000000E+00        3  35  15  15  # H0-tau-tau eff. coupling^2, normalised to SM
    0.00000000E+00    9.07764192E+01        3  36  15  15  # A0-tau-tau eff. coupling^2, normalised to SM
#
Block HiggsBoundsInputHiggsCouplingsBosons
    9.99998210E-01        3  25  24  24  # h0-W-W eff. coupling^2, normalised to SM
    1.78966034E-06        3  35  24  24  # H0-W-W eff. coupling^2, normalised to SM
    0.00000000E+00        3  36  24  24  # A0-W-W eff. coupling^2, normalised to SM
#
    9.99998210E-01        3  25  23  23  # h0-Z-Z eff. coupling^2, normalised to SM
    1.78966034E-06        3  35  23  23  # H0-Z-Z eff. coupling^2, normalised to SM
    0.00000000E+00        3  36  23  23  # A0-Z-Z eff. coupling^2, normalised to SM
#
    1.15834782E+00        3  25  21  21  # h0-g-g eff. coupling^2, normalised to SM
    8.15146456E-03        3  35  21  21  # H0-g-g eff. coupling^2, normalised to SM
    1.28973858E-01        3  36  21  21  # A0-g-g eff. coupling^2, normalised to SM
#
    0.00000000E+00        3  25  25  23  # h0-h0-Z eff. coupling^2, normalised to SM
    0.00000000E+00        3  35  25  23  # H0-h0-Z eff. coupling^2, normalised to SM
    1.78966034E-06        3  36  25  23  # A0-h0-Z eff. coupling^2, normalised to SM
    0.00000000E+00        3  35  35  23  # H0-H0-Z eff. coupling^2, normalised to SM
    9.99998210E-01        3  36  35  23  # A0-H0-Z eff. coupling^2, normalised to SM
    0.00000000E+00        3  36  36  23  # A0-A0-Z eff. coupling^2, normalised to SM
#
    0.00000000E+00        4  25  21  21  23  # h0-g-g-Z eff. coupling^2, normalised to SM
    0.00000000E+00        4  35  21  21  23  # H0-g-g-Z eff. coupling^2, normalised to SM
    0.00000000E+00        4  36  21  21  23  # A0-g-g-Z eff. coupling^2, normalised to SM
Block SPhenoLowEnergy  # low energy observables
    1    3.34383598E-04   # BR(b -> s gamma)
    2    1.58915636E-06   # BR(b -> s mu+ mu-)
    3    3.52880292E-05   # BR(b -> s nu nu)
    4    2.08803156E-15   # BR(Bd -> e+ e-)
    5    8.91983416E-11   # BR(Bd -> mu+ mu-)
    6    1.86708424E-08   # BR(Bd -> tau+ tau-)
    7    7.03686242E-14   # BR(Bs -> e+ e-)
    8    3.00614551E-09   # BR(Bs -> mu+ mu-)
    9    6.37560164E-07   # BR(Bs -> tau+ tau-)
   10    9.65874510E-05   # BR(B_u -> tau nu)
   11    9.97861375E-01   # BR(B_u -> tau nu)/BR(B_u -> tau nu)_SM
   12    5.41852710E-01   # |Delta(M_Bd)| [ps^-1] 
   13    1.93605269E+01   # |Delta(M_Bs)| [ps^-1] 
   16    2.15634598E-03   # epsilon_K
   17    2.28164839E-15   # Delta(M_K)
   18    2.48228086E-11   # BR(K^0 -> pi^0 nu nu)
   19    8.29604981E-11   # BR(K^+ -> pi^+ nu nu)
   20    3.11585465E-15   # Delta(g-2)_electron/2
   21    1.33213925E-10   # Delta(g-2)_muon/2
   22    3.77867127E-08   # Delta(g-2)_tau/2
   23    0.00000000E+00   # electric dipole moment of the electron
   24    0.00000000E+00   # electric dipole moment of the muon
   25    0.00000000E+00   # electric dipole moment of the tau
   26    0.00000000E+00   # Br(mu -> e gamma)
   27    0.00000000E+00   # Br(tau -> e gamma)
   28    0.00000000E+00   # Br(tau -> mu gamma)
   29    0.00000000E+00   # Br(mu -> 3 e)
   30    0.00000000E+00   # Br(tau -> 3 e)
   31    0.00000000E+00   # Br(tau -> 3 mu)
   39   -1.01558525E-05   # Delta(rho_parameter)
   40    0.00000000E+00   # BR(Z -> e mu)
   41    0.00000000E+00   # BR(Z -> e tau)
   42    0.00000000E+00   # BR(Z -> mu tau)
Block FWCOEF Q=  1.60000000E+02  # Wilson coefficients at scale Q
#    id        order  M        value         comment
     0305 4422   00   0    -1.88862840E-01   # C7
     0305 4422   00   2    -2.02858820E-01   # C7
     0305 4322   00   2    -2.79284738E-04   # C7'
     0305 6421   00   0    -9.52417342E-02   # C8
     0305 6421   00   2    -1.13869574E-01   # C8
     0305 6321   00   2    -3.67841628E-04   # C8'
 03051111 4133   00   0     1.18820738E+00   # C9 e+e-
 03051111 4133   00   2     1.18893463E+00   # C9 e+e-
 03051111 4233   00   2    -9.30643239E-07   # C9' e+e-
 03051111 4137   00   0    -4.01310837E+00   # C10 e+e-
 03051111 4137   00   2    -4.01210146E+00   # C10 e+e-
 03051111 4237   00   2     2.31723902E-05   # C10' e+e-
 03051313 4133   00   0     1.18820738E+00   # C9 mu+mu-
 03051313 4133   00   2     1.18893451E+00   # C9 mu+mu-
 03051313 4233   00   2    -9.30661859E-07   # C9' mu+mu-
 03051313 4137   00   0    -4.01310837E+00   # C10 mu+mu-
 03051313 4137   00   2    -4.01210158E+00   # C10 mu+mu-
 03051313 4237   00   2     2.31724034E-05   # C10' mu+mu-
 03051212 4137   00   0     1.50598099E+00   # C11 nu_1 nu_1
 03051212 4137   00   2     1.50574435E+00   # C11 nu_1 nu_1
 03051212 4237   00   2    -5.55867146E-06   # C11' nu_1 nu_1
 03051414 4137   00   0     1.50598099E+00   # C11 nu_2 nu_2
 03051414 4137   00   2     1.50574435E+00   # C11 nu_2 nu_2
 03051414 4237   00   2    -5.55866736E-06   # C11' nu_2 nu_2
 03051616 4137   00   0     1.50598099E+00   # C11 nu_3 nu_3
 03051616 4137   00   2     1.50574437E+00   # C11 nu_3 nu_3
 03051616 4237   00   2    -5.55751236E-06   # C11' nu_3 nu_3
Block IMFWCOEF Q=  1.60000000E+02  # Im(Wilson coefficients) at scale Q
#    id        order  M        value         comment
     0305 4422   00   0     3.86113158E-07   # C7
     0305 4422   00   2     2.67208323E-06   # C7
     0305 4322   00   2     6.06930387E-07   # C7'
     0305 6421   00   0     3.30731313E-07   # C8
     0305 6421   00   2     4.03501080E-07   # C8
     0305 6321   00   2     2.33245873E-07   # C8'
 03051111 4133   00   2     3.03250724E-08   # C9 e+e-
 03051111 4233   00   2     2.46912548E-08   # C9' e+e-
 03051111 4137   00   2    -1.51605938E-06   # C10 e+e-
 03051111 4237   00   2    -6.06892523E-07   # C10' e+e-
 03051313 4133   00   2     3.03236744E-08   # C9 mu+mu-
 03051313 4233   00   2     2.46912287E-08   # C9' mu+mu-
 03051313 4137   00   2    -1.51606026E-06   # C10 mu+mu-
 03051313 4237   00   2    -6.06892594E-07   # C10' mu+mu-
 03051212 4137   00   2     4.49922072E-07   # C11 nu_1 nu_1
 03051212 4237   00   2     1.45583633E-07   # C11' nu_1 nu_1
 03051414 4137   00   2     4.49922045E-07   # C11 nu_2 nu_2
 03051414 4237   00   2     1.45583633E-07   # C11' nu_2 nu_2
 03051616 4137   00   2     4.49914362E-07   # C11 nu_3 nu_3
 03051616 4237   00   2     1.45583633E-07   # C11' nu_3 nu_3
