#
#                              ======================
#                              | THE SUSYHIT OUTPUT |
#                              ======================
#
#
#              ------------------------------------------------------
#              |     This is the output of the SUSY-HIT package     |
#              |  created by A.Djouadi, M.Muehlleitner and M.Spira. |
#              |  In case of problems with SUSY-HIT email to        |
#              |           margarete.muehlleitner@cern.ch           |
#              |           michael.spira@psi.ch                     |
#              |           abdelhak.djouadi@cern.ch                 |
#              ------------------------------------------------------
#
#              ------------------------------------------------------
#              |  SUSY Les Houches Accord - MSSM Spectrum + Decays  |
#              |              based on the decay programs           |
#              |                                                    |
#              |                     SDECAY 1.3b                    |
#              |                                                    |
#              |  Authors: M.Muhlleitner, A.Djouadi and Y.Mambrini  |
#              |  Ref.:    Comput.Phys.Commun.168(2005)46           |
#              |           [hep-ph/0311167]                         |
#              |                                                    |
#              |                     HDECAY 3.4                     |
#              |                                                    |
#              |  By: A.Djouadi,J.Kalinowski,M.Muhlleitner,M.Spira  |
#              |  Ref.:    Comput.Phys.Commun.108(1998)56           |
#              |           [hep-ph/9704448]                         |
#              |                                                    |
#              |                                                    |
#              |  If not stated otherwise all DRbar couplings and   |
#              |  soft SUSY breaking masses are given at the scale  |
#              |  Q=  0.50007062E+04
#              |                                                    |
#              ------------------------------------------------------
#
#
BLOCK DCINFO  # Decay Program information
     1   SDECAY/HDECAY # decay calculator
     2   1.3b  /3.4    # version number
#
BLOCK SPINFO  # Spectrum calculator information
     1    SOFTSUSY    # spectrum calculator                
     2    3.4.0       # version number                     
#
BLOCK MODSEL  # Model selection
     1     0   #  nonUniversal                                     
#
BLOCK SMINPUTS  # Standard Model inputs
         1     1.25778332E+02   # alpha_em^-1(M_Z)^MSbar
         2     1.16570000E-05   # G_F [GeV^-2]
         3     1.17200002E-01   # alpha_S(M_Z)^MSbar
         4     9.11876000E+01   # M_Z pole mass
         5     4.25000000E+00   # mb(mb)^MSbar
         6     1.72500000E+02   # mt pole mass
         7     1.77682000E+00   # mtau pole mass
#
BLOCK MINPAR  # Input parameters - minimal models
         3     1.00000000E+01   # tanb                
#
BLOCK EXTPAR  # Input parameters - non-minimal models
         0    -1.00000000E+00   # Set                 
         1     6.00000000E+01   # M_1(MX)             
         2     3.00000000E+03   # M_2(MX)             
         3     2.62339800E+03   # M_3(MX)             
        11     5.00000000E+03   # At(MX)              
        12     5.00000000E+03   # Ab(MX)              
        13     0.00000000E+00   # Atau(MX)            
        23    -1.83858800E+03   # mu(MX)              
        26     3.00000000E+03   # mA(pole)            
        31     5.00000000E+03   # meL(MX)             
        32     5.00000000E+03   # mmuL(MX)            
        33     5.00000000E+03   # mtauL(MX)           
        34     5.00000000E+03   # meR(MX)             
        35     5.00000000E+03   # mmuR(MX)            
        36     5.00000000E+03   # mtauR(MX)           
        41     5.00000000E+03   # mqL1(MX)            
        42     5.00000000E+03   # mqL2(MX)            
        43     5.00000000E+03   # mqL3(MX)            
        44     5.00000000E+03   # muR(MX)             
        45     5.00000000E+03   # mcR(MX)             
        46     5.00000000E+03   # mtR(MX)             
        47     5.00000000E+03   # mdR(MX)             
        48     5.00000000E+03   # msR(MX)             
        49     5.00000000E+03   # mbR(MX)             
#
BLOCK MASS  # Mass Spectrum
# PDG code           mass       particle
        24     8.00975938E+01   # W+
        25     1.24821389E+02   # h
        35     3.00007745E+03   # H
        36     2.99999995E+03   # A
        37     3.00087231E+03   # H+
         5     4.87878001E+00   # b-quark pole mass calculated from mb(mb)_Msbar
   1000001     5.09114566E+03   # ~d_L
   2000001     5.07345541E+03   # ~d_R
   1000002     5.09067773E+03   # ~u_L
   2000002     5.07318798E+03   # ~u_R
   1000003     5.09114566E+03   # ~s_L
   2000003     5.07345541E+03   # ~s_R
   1000004     5.09067773E+03   # ~c_L
   2000004     5.07318798E+03   # ~c_R
   1000005     5.03773362E+03   # ~b_1
   2000005     5.07255647E+03   # ~b_2
   1000006     4.93162244E+03   # ~t_1
   2000006     5.08297957E+03   # ~t_2
   1000011     5.01903198E+03   # ~e_L
   2000011     5.00590307E+03   # ~e_R
   1000012     5.01808434E+03   # ~nu_eL
   1000013     5.01903198E+03   # ~mu_L
   2000013     5.00590307E+03   # ~mu_R
   1000014     5.01808434E+03   # ~nu_muL
   1000015     5.00412536E+03   # ~tau_1
   2000015     5.01925580E+03   # ~tau_2
   1000016     5.01755369E+03   # ~nu_tauL
   1000021     3.00000055E+03   # ~g
   1000022     6.03003877E+01   # ~chi_10
   1000023     1.89939115E+03   # ~chi_20
   1000025    -1.90224213E+03   # ~chi_30
   1000035     3.07441734E+03   # ~chi_40
   1000024     1.90000061E+03   # ~chi_1+
   1000037     3.07458507E+03   # ~chi_2+
#
BLOCK NMIX  # Neutralino Mixing Matrix
  1  1     9.99722531E-01   # N_11
  1  2     1.16379161E-04   # N_12
  1  3    -2.34921375E-02   # N_13
  1  4     1.72254152E-03   # N_14
  2  1     1.53868061E-02   # N_21
  2  2     4.14153109E-02   # N_22
  2  3     7.06771606E-01   # N_23
  2  4     7.06060844E-01   # N_24
  3  1    -1.78274839E-02   # N_31
  3  2     1.21847401E-02   # N_32
  3  3    -7.06749258E-01   # N_33
  3  4     7.07134499E-01   # N_34
  4  1    -5.36873492E-04   # N_41
  4  2     9.99067711E-01   # N_42
  4  3    -2.06761519E-02   # N_43
  4  4    -3.78935077E-02   # N_44
#
BLOCK UMIX  # Chargino Mixing Matrix U
  1  1     2.92016673E-02   # U_11
  1  2     9.99573540E-01   # U_12
  2  1    -9.99573540E-01   # U_21
  2  2     2.92016673E-02   # U_22
#
BLOCK VMIX  # Chargino Mixing Matrix V
  1  1     5.35536568E-02   # V_11
  1  2    -9.98564973E-01   # V_12
  2  1    -9.98564973E-01   # V_21
  2  2    -5.35536568E-02   # V_22
#
BLOCK STOPMIX  # Stop Mixing Matrix
  1  1    -5.11484167E-01   # cos(theta_t)
  1  2     8.59292702E-01   # sin(theta_t)
  2  1    -8.59292702E-01   # -sin(theta_t)
  2  2    -5.11484167E-01   # cos(theta_t)
#
BLOCK SBOTMIX  # Sbottom Mixing Matrix
  1  1     9.91609714E-01   # cos(theta_b)
  1  2    -1.29267842E-01   # sin(theta_b)
  2  1     1.29267842E-01   # -sin(theta_b)
  2  2     9.91609714E-01   # cos(theta_b)
#
BLOCK STAUMIX  # Stau Mixing Matrix
  1  1    -2.08951031E-01   # cos(theta_tau)
  1  2     9.77926105E-01   # sin(theta_tau)
  2  1    -9.77926105E-01   # -sin(theta_tau)
  2  2    -2.08951031E-01   # cos(theta_tau)
#
BLOCK ALPHA  # Higgs mixing
          -1.05465227E-01   # Mixing angle in the neutral Higgs boson sector
#
BLOCK HMIX Q=  5.00070617E+03  # DRbar Higgs Parameters
         1    -1.87251814E+03   # mu(Q)MSSM           
         2     9.47004352E+00   # tan                 
         3     2.42047309E+02   # higgs               
         4     8.34328446E+06   # mA^2(Q)MSSM         
#
BLOCK GAUGE Q=  5.00070617E+03  # The gauge couplings
     1     3.70626195E-01   # gprime(Q) DRbar
     2     6.31756110E-01   # g(Q) DRbar
     3     9.92469882E-01   # g3(Q) DRbar
#
BLOCK AU Q=  5.00070617E+03  # The trilinear couplings
  1  1     5.00000002E+03   # A_u(Q) DRbar
  2  2     5.00000002E+03   # A_c(Q) DRbar
  3  3     5.00000003E+03   # A_t(Q) DRbar
#
BLOCK AD Q=  5.00070617E+03  # The trilinear couplings
  1  1     5.00000001E+03   # A_d(Q) DRbar
  2  2     5.00000001E+03   # A_s(Q) DRbar
  3  3     5.00000001E+03   # A_b(Q) DRbar
#
BLOCK AE Q=  5.00070617E+03  # The trilinear couplings
  1  1     0.00000000E+00   # A_e(Q) DRbar
  2  2     3.31639759E-07   # A_mu(Q) DRbar
  3  3     3.31875500E-07   # A_tau(Q) DRbar
#
BLOCK Yu Q=  5.00070617E+03  # The Yukawa couplings
  1  1     0.00000000E+00   # y_u(Q) DRbar
  2  2     0.00000000E+00   # y_c(Q) DRbar
  3  3     8.21087681E-01   # y_t(Q) DRbar
#
BLOCK Yd Q=  5.00070617E+03  # The Yukawa couplings
  1  1     0.00000000E+00   # y_d(Q) DRbar
  2  2     0.00000000E+00   # y_s(Q) DRbar
  3  3     1.32674468E-01   # y_b(Q) DRbar
#
BLOCK Ye Q=  5.00070617E+03  # The Yukawa couplings
  1  1     0.00000000E+00   # y_e(Q) DRbar
  2  2     0.00000000E+00   # y_mu(Q) DRbar
  3  3     9.64777621E-02   # y_tau(Q) DRbar
#
BLOCK MSOFT Q=  5.00070617E+03  # The soft SUSY breaking masses at the scale Q
         1     6.00000000E+01   # M_1(Q)              
         2     3.00000000E+03   # M_2(Q)              
         3     2.62339800E+03   # M_3(Q)              
        21     5.14263806E+06   # mH1^2(Q)            
        22    -2.96825436E+06   # mH2^2(Q)            
        31     5.00000000E+03   # meL(Q)              
        32     5.00000000E+03   # mmuL(Q)             
        33     5.00000000E+03   # mtauL(Q)            
        34     5.00000000E+03   # meR(Q)              
        35     5.00000000E+03   # mmuR(Q)             
        36     5.00000000E+03   # mtauR(Q)            
        41     4.99999999E+03   # mqL1(Q)             
        42     4.99999999E+03   # mqL2(Q)             
        43     4.99999999E+03   # mqL3(Q)             
        44     4.99999999E+03   # muR(Q)              
        45     4.99999999E+03   # mcR(Q)              
        46     4.99999999E+03   # mtR(Q)              
        47     4.99999999E+03   # mdR(Q)              
        48     4.99999999E+03   # msR(Q)              
        49     4.99999999E+03   # mbR(Q)              
#
#
#
#                             =================
#                             |The decay table|
#                             =================
#
# - The QCD corrections to the decays gluino -> squark  + quark
#                                     squark -> gaugino + quark_prime
#                                     squark -> squark_prime + Higgs
#                                     squark -> gluino  + quark
#   are included.
#
# - The multi-body decays for the inos, stops and sbottoms are included.
#
# - The loop induced decays for the gluino, neutralinos and stops
#   are included.
#
# - The SUSY decays of the top quark are included.
#
#
#         PDG            Width
DECAY         6     1.39852403E+00   # top decays
#          BR         NDA      ID1       ID2
     1.00000000E+00    2           5        24   # BR(t ->  b    W+)
#
#         PDG            Width
DECAY   1000021     3.88451944E-03   # gluino decays
#          BR         NDA      ID1       ID2
     4.22542533E-06    2     1000022        21   # BR(~g -> ~chi_10 g)
     3.91341856E-03    2     1000023        21   # BR(~g -> ~chi_20 g)
     3.94894304E-03    2     1000025        21   # BR(~g -> ~chi_30 g)
#           BR         NDA      ID1       ID2       ID3
     5.28584661E-02    3     1000022         1        -1   # BR(~g -> ~chi_10 d  db)
     3.34226816E-05    3     1000023         1        -1   # BR(~g -> ~chi_20 d  db)
     2.34284308E-06    3     1000025         1        -1   # BR(~g -> ~chi_30 d  db)
     1.80236775E-01    3     1000022         2        -2   # BR(~g -> ~chi_10 u  ub)
     4.69098253E-05    3     1000023         2        -2   # BR(~g -> ~chi_20 u  ub)
     2.17428400E-06    3     1000025         2        -2   # BR(~g -> ~chi_30 u  ub)
     5.28584661E-02    3     1000022         3        -3   # BR(~g -> ~chi_10 s  sb)
     3.34226816E-05    3     1000023         3        -3   # BR(~g -> ~chi_20 s  sb)
     2.34284308E-06    3     1000025         3        -3   # BR(~g -> ~chi_30 s  sb)
     1.80236775E-01    3     1000022         4        -4   # BR(~g -> ~chi_10 c  cb)
     4.69098253E-05    3     1000023         4        -4   # BR(~g -> ~chi_20 c  cb)
     2.17428400E-06    3     1000025         4        -4   # BR(~g -> ~chi_30 c  cb)
     5.35195089E-02    3     1000022         5        -5   # BR(~g -> ~chi_10 b  bb)
     2.10651224E-03    3     1000023         5        -5   # BR(~g -> ~chi_20 b  bb)
     2.04207525E-03    3     1000025         5        -5   # BR(~g -> ~chi_30 b  bb)
     1.88599372E-01    3     1000022         6        -6   # BR(~g -> ~chi_10 t  tb)
     7.03565656E-02    3     1000023         6        -6   # BR(~g -> ~chi_20 t  tb)
     5.99535887E-02    3     1000025         6        -6   # BR(~g -> ~chi_30 t  tb)
     7.79287514E-05    3     1000024         1        -2   # BR(~g -> ~chi_1+ d  ub)
     7.79287514E-05    3    -1000024         2        -1   # BR(~g -> ~chi_1- u  db)
     7.79287514E-05    3     1000024         3        -4   # BR(~g -> ~chi_1+ s  cb)
     7.79287514E-05    3    -1000024         4        -3   # BR(~g -> ~chi_1- c  sb)
     7.44419464E-02    3     1000024         5        -6   # BR(~g -> ~chi_1+ b  tb)
     7.44419464E-02    3    -1000024         6        -5   # BR(~g -> ~chi_1- t  bb)
#
#         PDG            Width
DECAY   1000006     2.21716546E+02   # stop1 decays
#          BR         NDA      ID1       ID2
     3.98238555E-02    2     1000022         6   # BR(~t_1 -> ~chi_10 t )
     1.07139507E-01    2     1000023         6   # BR(~t_1 -> ~chi_20 t )
     1.02897627E-01    2     1000025         6   # BR(~t_1 -> ~chi_30 t )
     1.00892718E-02    2     1000035         6   # BR(~t_1 -> ~chi_40 t )
     1.54824626E-01    2     1000024         5   # BR(~t_1 -> ~chi_1+ b )
     2.00122621E-02    2     1000037         5   # BR(~t_1 -> ~chi_2+ b )
     5.65212851E-01    2     1000021         6   # BR(~t_1 -> ~g      t )
#
#         PDG            Width
DECAY   2000006     2.39071306E+02   # stop2 decays
#          BR         NDA      ID1       ID2
     1.45438456E-02    2     1000022         6   # BR(~t_2 -> ~chi_10 t )
     1.04504848E-01    2     1000023         6   # BR(~t_2 -> ~chi_20 t )
     1.08859978E-01    2     1000025         6   # BR(~t_2 -> ~chi_30 t )
     2.30066347E-02    2     1000035         6   # BR(~t_2 -> ~chi_40 t )
     6.40414412E-02    2     1000024         5   # BR(~t_2 -> ~chi_1+ b )
     4.55319515E-02    2     1000037         5   # BR(~t_2 -> ~chi_2+ b )
     6.34385878E-01    2     1000021         6   # BR(~t_2 -> ~g      t )
     1.10486841E-03    2     1000006        25   # BR(~t_2 -> ~t_1    h )
     4.02055521E-03    2     1000006        23   # BR(~t_2 -> ~t_1    Z )
#
#         PDG            Width
DECAY   1000005     2.15269898E+02   # sbottom1 decays
#          BR         NDA      ID1       ID2
     3.66788366E-03    2     1000022         5   # BR(~b_1 -> ~chi_10 b )
     3.20626484E-03    2     1000023         5   # BR(~b_1 -> ~chi_20 b )
     2.92915895E-03    2     1000025         5   # BR(~b_1 -> ~chi_30 b )
     3.48980198E-02    2     1000035         5   # BR(~b_1 -> ~chi_40 b )
     2.24940737E-01    2    -1000024         6   # BR(~b_1 -> ~chi_1- t )
     7.04722661E-02    2    -1000037         6   # BR(~b_1 -> ~chi_2- t )
     6.57543702E-01    2     1000021         5   # BR(~b_1 -> ~g      b )
     2.34196765E-03    2     1000006       -24   # BR(~b_1 -> ~t_1    W-)
#
#         PDG            Width
DECAY   2000005     1.51286840E+02   # sbottom2 decays
#          BR         NDA      ID1       ID2
     1.92069321E-02    2     1000022         5   # BR(~b_2 -> ~chi_10 b )
     4.15465195E-03    2     1000023         5   # BR(~b_2 -> ~chi_20 b )
     4.42796092E-03    2     1000025         5   # BR(~b_2 -> ~chi_30 b )
     8.98125891E-04    2     1000035         5   # BR(~b_2 -> ~chi_40 b )
     1.37204855E-02    2    -1000024         6   # BR(~b_2 -> ~chi_1- t )
     1.81179321E-03    2    -1000037         6   # BR(~b_2 -> ~chi_2- t )
     9.55521203E-01    2     1000021         5   # BR(~b_2 -> ~g      b )
     2.58847330E-04    2     1000006       -24   # BR(~b_2 -> ~t_1    W-)
#
#         PDG            Width
DECAY   1000002     1.70657010E+02   # sup_L decays
#          BR         NDA      ID1       ID2
     4.35712275E-03    2     1000022         2   # BR(~u_L -> ~chi_10 u)
     1.67445351E-04    2     1000023         2   # BR(~u_L -> ~chi_20 u)
     6.41363783E-06    2     1000025         2   # BR(~u_L -> ~chi_30 u)
     4.63605467E-02    2     1000035         2   # BR(~u_L -> ~chi_40 u)
     4.86577097E-04    2     1000024         1   # BR(~u_L -> ~chi_1+ d)
     9.26357777E-02    2     1000037         1   # BR(~u_L -> ~chi_2+ d)
     8.55986117E-01    2     1000021         2   # BR(~u_L -> ~g      u)
#
#         PDG            Width
DECAY   2000002     1.56356145E+02   # sup_R decays
#          BR         NDA      ID1       ID2
     7.57317655E-02    2     1000022         2   # BR(~u_R -> ~chi_10 u)
     1.33384659E-05    2     1000023         2   # BR(~u_R -> ~chi_20 u)
     1.78882184E-05    2     1000025         2   # BR(~u_R -> ~chi_30 u)
     8.84149092E-09    2     1000035         2   # BR(~u_R -> ~chi_40 u)
     9.24236999E-01    2     1000021         2   # BR(~u_R -> ~g      u)
#
#         PDG            Width
DECAY   1000001     1.70676667E+02   # sdown_L decays
#          BR         NDA      ID1       ID2
     4.34666940E-03    2     1000022         1   # BR(~d_L -> ~chi_10 d)
     1.25157106E-04    2     1000023         1   # BR(~d_L -> ~chi_20 d)
     2.08171863E-05    2     1000025         1   # BR(~d_L -> ~chi_30 d)
     4.63886994E-02    2     1000035         1   # BR(~d_L -> ~chi_40 d)
     1.44678809E-04    2    -1000024         2   # BR(~d_L -> ~chi_1- u)
     9.28403373E-02    2    -1000037         2   # BR(~d_L -> ~chi_2- u)
     8.56133641E-01    2     1000021         1   # BR(~d_L -> ~g      d)
#
#         PDG            Width
DECAY   2000001     1.47495800E+02   # sdown_R decays
#          BR         NDA      ID1       ID2
     2.00713640E-02    2     1000022         1   # BR(~d_R -> ~chi_10 d)
     3.53524321E-06    2     1000023         1   # BR(~d_R -> ~chi_20 d)
     4.74111568E-06    2     1000025         1   # BR(~d_R -> ~chi_30 d)
     2.34356271E-09    2     1000035         1   # BR(~d_R -> ~chi_40 d)
     9.79920357E-01    2     1000021         1   # BR(~d_R -> ~g      d)
#
#         PDG            Width
DECAY   1000004     1.70657010E+02   # scharm_L decays
#          BR         NDA      ID1       ID2
     4.35712275E-03    2     1000022         4   # BR(~c_L -> ~chi_10 c)
     1.67445351E-04    2     1000023         4   # BR(~c_L -> ~chi_20 c)
     6.41363783E-06    2     1000025         4   # BR(~c_L -> ~chi_30 c)
     4.63605467E-02    2     1000035         4   # BR(~c_L -> ~chi_40 c)
     4.86577097E-04    2     1000024         3   # BR(~c_L -> ~chi_1+ s)
     9.26357777E-02    2     1000037         3   # BR(~c_L -> ~chi_2+ s)
     8.55986117E-01    2     1000021         4   # BR(~c_L -> ~g      c)
#
#         PDG            Width
DECAY   2000004     1.56356145E+02   # scharm_R decays
#          BR         NDA      ID1       ID2
     7.57317655E-02    2     1000022         4   # BR(~c_R -> ~chi_10 c)
     1.33384659E-05    2     1000023         4   # BR(~c_R -> ~chi_20 c)
     1.78882184E-05    2     1000025         4   # BR(~c_R -> ~chi_30 c)
     8.84149092E-09    2     1000035         4   # BR(~c_R -> ~chi_40 c)
     9.24236999E-01    2     1000021         4   # BR(~c_R -> ~g      c)
#
#         PDG            Width
DECAY   1000003     1.70676667E+02   # sstrange_L decays
#          BR         NDA      ID1       ID2
     4.34666940E-03    2     1000022         3   # BR(~s_L -> ~chi_10 s)
     1.25157106E-04    2     1000023         3   # BR(~s_L -> ~chi_20 s)
     2.08171863E-05    2     1000025         3   # BR(~s_L -> ~chi_30 s)
     4.63886994E-02    2     1000035         3   # BR(~s_L -> ~chi_40 s)
     1.44678809E-04    2    -1000024         4   # BR(~s_L -> ~chi_1- c)
     9.28403373E-02    2    -1000037         4   # BR(~s_L -> ~chi_2- c)
     8.56133641E-01    2     1000021         3   # BR(~s_L -> ~g      s)
#
#         PDG            Width
DECAY   2000003     1.47495800E+02   # sstrange_R decays
#          BR         NDA      ID1       ID2
     2.00713640E-02    2     1000022         3   # BR(~s_R -> ~chi_10 s)
     3.53524321E-06    2     1000023         3   # BR(~s_R -> ~chi_20 s)
     4.74111568E-06    2     1000025         3   # BR(~s_R -> ~chi_30 s)
     2.34356271E-09    2     1000035         3   # BR(~s_R -> ~chi_40 s)
     9.79920357E-01    2     1000021         3   # BR(~s_R -> ~g      s)
#
#         PDG            Width
DECAY   1000011     3.02166665E+01   # selectron_L decays
#          BR         NDA      ID1       ID2
     2.26856744E-01    2     1000022        11   # BR(~e_L -> ~chi_10 e-)
     1.23169455E-03    2     1000023        11   # BR(~e_L -> ~chi_20 e-)
     1.44076631E-06    2     1000025        11   # BR(~e_L -> ~chi_30 e-)
     2.56769237E-01    2     1000035        11   # BR(~e_L -> ~chi_40 e-)
     8.25406989E-04    2    -1000024        12   # BR(~e_L -> ~chi_1- nu_e)
     5.14315476E-01    2    -1000037        12   # BR(~e_L -> ~chi_2- nu_e)
#
#         PDG            Width
DECAY   2000011     2.73479178E+01   # selectron_R decays
#          BR         NDA      ID1       ID2
     9.99593559E-01    2     1000022        11   # BR(~e_R -> ~chi_10 e-)
     1.73567407E-04    2     1000023        11   # BR(~e_R -> ~chi_20 e-)
     2.32762145E-04    2     1000025        11   # BR(~e_R -> ~chi_30 e-)
     1.11852291E-07    2     1000035        11   # BR(~e_R -> ~chi_40 e-)
#
#         PDG            Width
DECAY   1000013     3.02166665E+01   # smuon_L decays
#          BR         NDA      ID1       ID2
     2.26856744E-01    2     1000022        13   # BR(~mu_L -> ~chi_10 mu-)
     1.23169455E-03    2     1000023        13   # BR(~mu_L -> ~chi_20 mu-)
     1.44076631E-06    2     1000025        13   # BR(~mu_L -> ~chi_30 mu-)
     2.56769237E-01    2     1000035        13   # BR(~mu_L -> ~chi_40 mu-)
     8.25406989E-04    2    -1000024        14   # BR(~mu_L -> ~chi_1- nu_mu)
     5.14315476E-01    2    -1000037        14   # BR(~mu_L -> ~chi_2- nu_mu)
#
#         PDG            Width
DECAY   2000013     2.73479178E+01   # smuon_R decays
#          BR         NDA      ID1       ID2
     9.99593559E-01    2     1000022        13   # BR(~mu_R -> ~chi_10 mu-)
     1.73567407E-04    2     1000023        13   # BR(~mu_R -> ~chi_20 mu-)
     2.32762145E-04    2     1000025        13   # BR(~mu_R -> ~chi_30 mu-)
     1.11852291E-07    2     1000035        13   # BR(~mu_R -> ~chi_40 mu-)
#
#         PDG            Width
DECAY   1000015     2.88239529E+01   # stau_1 decays
#          BR         NDA      ID1       ID2
     9.17881645E-01    2     1000022        15   # BR(~tau_1 -> ~chi_10  tau-)
     1.29994934E-02    2     1000023        15   # BR(~tau_1 -> ~chi_20  tau-)
     1.12505079E-02    2     1000025        15   # BR(~tau_1 -> ~chi_30  tau-)
     1.11518508E-02    2     1000035        15   # BR(~tau_1 -> ~chi_40  tau-)
     2.43770227E-02    2    -1000024        16   # BR(~tau_1 -> ~chi_1-  nu_tau)
     2.23394801E-02    2    -1000037        16   # BR(~tau_1 -> ~chi_2-  nu_tau)
#
#         PDG            Width
DECAY   2000015     3.07661886E+01   # stau_2 decays
#          BR         NDA      ID1       ID2
     2.51214808E-01    2     1000022        15   # BR(~tau_2 -> ~chi_10  tau-)
     1.12819640E-02    2     1000023        15   # BR(~tau_2 -> ~chi_20  tau-)
     1.17491399E-02    2     1000025        15   # BR(~tau_2 -> ~chi_30  tau-)
     2.41673663E-01    2     1000035        15   # BR(~tau_2 -> ~chi_40  tau-)
     1.05995528E-05    2    -1000024        16   # BR(~tau_2 -> ~chi_1-  nu_tau)
     4.84069825E-01    2    -1000037        16   # BR(~tau_2 -> ~chi_2-  nu_tau)
#
#         PDG            Width
DECAY   1000012     3.02179082E+01   # snu_eL decays
#          BR         NDA      ID1       ID2
     2.26624618E-01    2     1000022        12   # BR(~nu_eL -> ~chi_10 nu_e)
     5.07624498E-04    2     1000023        12   # BR(~nu_eL -> ~chi_20 nu_e)
     2.47861322E-04    2     1000025        12   # BR(~nu_eL -> ~chi_30 nu_e)
     2.56917528E-01    2     1000035        12   # BR(~nu_eL -> ~chi_40 nu_e)
     2.77508551E-03    2     1000024        11   # BR(~nu_eL -> ~chi_1+ e-)
     5.12927282E-01    2     1000037        11   # BR(~nu_eL -> ~chi_2+ e-)
#
#         PDG            Width
DECAY   1000014     3.02179082E+01   # snu_muL decays
#          BR         NDA      ID1       ID2
     2.26624618E-01    2     1000022        14   # BR(~nu_muL -> ~chi_10 nu_mu)
     5.07624498E-04    2     1000023        14   # BR(~nu_muL -> ~chi_20 nu_mu)
     2.47861322E-04    2     1000025        14   # BR(~nu_muL -> ~chi_30 nu_mu)
     2.56917528E-01    2     1000035        14   # BR(~nu_muL -> ~chi_40 nu_mu)
     2.77508551E-03    2     1000024        13   # BR(~nu_muL -> ~chi_1+ mu-)
     5.12927282E-01    2     1000037        13   # BR(~nu_muL -> ~chi_2+ mu-)
#
#         PDG            Width
DECAY   1000016     3.08903373E+01   # snu_tauL decays
#          BR         NDA      ID1       ID2
     2.21667936E-01    2     1000022        16   # BR(~nu_tauL -> ~chi_10 nu_tau)
     4.96486753E-04    2     1000023        16   # BR(~nu_tauL -> ~chi_20 nu_tau)
     2.42422958E-04    2     1000025        16   # BR(~nu_tauL -> ~chi_30 nu_tau)
     2.51234419E-01    2     1000035        16   # BR(~nu_tauL -> ~chi_40 nu_tau)
     2.47710454E-02    2     1000024        15   # BR(~nu_tauL -> ~chi_1+ tau-)
     5.01587690E-01    2     1000037        15   # BR(~nu_tauL -> ~chi_2+ tau-)
#
#         PDG            Width
DECAY   1000024     1.17257690E+00   # chargino1+ decays
#          BR         NDA      ID1       ID2
     1.00000000E+00    2     1000022        24   # BR(~chi_1+ -> ~chi_10  W+)
#
#         PDG            Width
DECAY   1000037     1.60975830E+01   # chargino2+ decays
#          BR         NDA      ID1       ID2
     2.52104014E-01    2     1000024        23   # BR(~chi_2+ -> ~chi_1+  Z )
     4.06541247E-04    2     1000022        24   # BR(~chi_2+ -> ~chi_10  W+)
     2.44881338E-01    2     1000023        24   # BR(~chi_2+ -> ~chi_20  W+)
     2.43022578E-01    2     1000025        24   # BR(~chi_2+ -> ~chi_30  W+)
     2.59585442E-01    2     1000024        25   # BR(~chi_2+ -> ~chi_1+  h )
     8.63132445E-08    2     1000022        37   # BR(~chi_2+ -> ~chi_10  H+)
#
#         PDG            Width
DECAY   1000022     0.00000000E+00   # neutralino1 decays
#
#         PDG            Width
DECAY   1000023     1.23473192E+00   # neutralino2 decays
#          BR         NDA      ID1       ID2
     5.64023934E-01    2     1000022        23   # BR(~chi_20 -> ~chi_10   Z )
     4.35976066E-01    2     1000022        25   # BR(~chi_20 -> ~chi_10   h )
#
#         PDG            Width
DECAY   1000025     1.24951103E+00   # neutralino3 decays
#          BR         NDA      ID1       ID2
     4.16961992E-01    2     1000022        23   # BR(~chi_30 -> ~chi_10   Z )
     5.83038008E-01    2     1000022        25   # BR(~chi_30 -> ~chi_10   h )
#
#         PDG            Width
DECAY   1000035     1.60643987E+01   # neutralino4 decays
#          BR         NDA      ID1       ID2
     1.76044236E-04    2     1000022        23   # BR(~chi_40 -> ~chi_10   Z )
     2.04006612E-02    2     1000023        23   # BR(~chi_40 -> ~chi_20   Z )
     2.31972655E-01    2     1000025        23   # BR(~chi_40 -> ~chi_30   Z )
     2.43766300E-01    2     1000024       -24   # BR(~chi_40 -> ~chi_1+   W-)
     2.43766300E-01    2    -1000024        24   # BR(~chi_40 -> ~chi_1-   W+)
     2.46021291E-04    2     1000022        25   # BR(~chi_40 -> ~chi_10   h )
     7.13436261E-08    2     1000022        35   # BR(~chi_40 -> ~chi_10   H )
     1.82248730E-08    2     1000022        36   # BR(~chi_40 -> ~chi_10   A )
     2.39486025E-01    2     1000023        25   # BR(~chi_40 -> ~chi_20   h )
     2.01859048E-02    2     1000025        25   # BR(~chi_40 -> ~chi_30   h )
#
#         PDG            Width
DECAY        25     4.02399242E-03   # h decays
#          BR         NDA      ID1       ID2
     6.03629383E-01    2           5        -5   # BR(h -> b       bb     )
     6.44733121E-02    2         -15        15   # BR(h -> tau+    tau-   )
     2.28258754E-04    2         -13        13   # BR(h -> mu+     mu-    )
     4.83859595E-04    2           3        -3   # BR(h -> s       sb     )
     2.09690961E-02    2           4        -4   # BR(h -> c       cb     )
     6.78854242E-02    2          21        21   # BR(h -> g       g      )
     2.33543550E-03    2          22        22   # BR(h -> gam     gam    )
     1.50991876E-03    2          22        23   # BR(h -> Z       gam    )
     2.13045362E-01    2          24       -24   # BR(h -> W+      W-     )
     2.54167537E-02    2          23        23   # BR(h -> Z       Z      )
     2.31958670E-05    2     1000022   1000022   # BR(h -> ~chi_10 ~chi_10)
#
#         PDG            Width
DECAY        35     6.55045027E+00   # H decays
#          BR         NDA      ID1       ID2
     5.05112670E-01    2           5        -5   # BR(H -> b       bb     )
     8.50529475E-02    2         -15        15   # BR(H -> tau+    tau-   )
     3.00753978E-04    2         -13        13   # BR(H -> mu+     mu-    )
     3.68678363E-04    2           3        -3   # BR(H -> s       sb     )
     2.06183959E-06    2           4        -4   # BR(H -> c       cb     )
     2.05994099E-01    2           6        -6   # BR(H -> t       tb     )
     6.83444355E-05    2          21        21   # BR(H -> g       g      )
     3.91078742E-07    2          22        22   # BR(H -> gam     gam    )
     1.21695185E-07    2          23        22   # BR(H -> Z       gam    )
     9.02824064E-05    2          24       -24   # BR(H -> W+      W-     )
     4.50840772E-05    2          23        23   # BR(H -> Z       Z      )
     3.43528049E-04    2          25        25   # BR(H -> h       h      )
     4.51274470E-24    2          36        36   # BR(H -> A       A      )
     1.26473457E-18    2          23        36   # BR(H -> Z       A      )
     6.11169432E-04    2     1000022   1000022   # BR(H -> ~chi_10 ~chi_10)
     1.18524248E-01    2     1000022   1000023   # BR(H -> ~chi_10 ~chi_20)
     8.34856194E-02    2     1000022   1000025   # BR(H -> ~chi_10 ~chi_30)
#
#         PDG            Width
DECAY        36     6.55367024E+00   # A decays
#          BR         NDA      ID1       ID2
     5.05031843E-01    2           5        -5   # BR(A -> b       bb     )
     8.50137375E-02    2         -15        15   # BR(A -> tau+    tau-   )
     3.00614908E-04    2         -13        13   # BR(A -> mu+     mu-    )
     3.68777102E-04    2           3        -3   # BR(A -> s       sb     )
     2.06952460E-06    2           4        -4   # BR(A -> c       cb     )
     2.06647819E-01    2           6        -6   # BR(A -> t       tb     )
     2.04500773E-04    2          21        21   # BR(A -> g       g      )
     3.91803140E-07    2          22        22   # BR(A -> gam     gam    )
     2.47807756E-07    2          23        22   # BR(A -> Z       gam    )
     8.98970470E-05    2          23        25   # BR(A -> Z       h      )
     6.31147295E-04    2     1000022   1000022   # BR(A -> ~chi_10 ~chi_10)
     8.44843769E-02    2     1000022   1000023   # BR(A -> ~chi_10 ~chi_20)
     1.17224577E-01    2     1000022   1000025   # BR(A -> ~chi_10 ~chi_30)
#
#         PDG            Width
DECAY        37     6.59047118E+00   # H+ decays
#          BR         NDA      ID1       ID2
     8.17244563E-04    2           4        -5   # BR(H+ -> c       bb     )
     8.45636069E-02    2         -15        16   # BR(H+ -> tau+    nu_tau )
     2.99023213E-04    2         -13        14   # BR(H+ -> mu+     nu_mu  )
     5.23033896E-06    2           2        -5   # BR(H+ -> u       bb     )
     1.75460599E-05    2           2        -3   # BR(H+ -> u       sb     )
     3.62853432E-04    2           4        -3   # BR(H+ -> c       sb     )
     7.11948255E-01    2           6        -5   # BR(H+ -> t       bb     )
     8.95304694E-05    2          24        25   # BR(H+ -> W+      h      )
     1.00753042E-13    2          24        36   # BR(H+ -> W+      A      )
     2.01896710E-01    2     1000024   1000022   # BR(H+ -> ~chi_1+ ~chi_10)
