#
#                              ======================
#                              | THE SUSYHIT OUTPUT |
#                              ======================
#
#
#              ------------------------------------------------------
#              |     This is the output of the SUSY-HIT package     |
#              |  created by A.Djouadi, M.Muehlleitner and M.Spira. |
#              |  In case of problems with SUSY-HIT email to        |
#              |           margarete.muehlleitner@cern.ch           |
#              |           michael.spira@psi.ch                     |
#              |           abdelhak.djouadi@cern.ch                 |
#              ------------------------------------------------------
#
#              ------------------------------------------------------
#              |  SUSY Les Houches Accord - MSSM Spectrum + Decays  |
#              |              based on the decay programs           |
#              |                                                    |
#              |                     SDECAY 1.3b                    |
#              |                                                    |
#              |  Authors: M.Muhlleitner, A.Djouadi and Y.Mambrini  |
#              |  Ref.:    Comput.Phys.Commun.168(2005)46           |
#              |           [hep-ph/0311167]                         |
#              |                                                    |
#              |                     HDECAY 3.4                     |
#              |                                                    |
#              |  By: A.Djouadi,J.Kalinowski,M.Muhlleitner,M.Spira  |
#              |  Ref.:    Comput.Phys.Commun.108(1998)56           |
#              |           [hep-ph/9704448]                         |
#              |                                                    |
#              |                                                    |
#              |  If not stated otherwise all DRbar couplings and   |
#              |  soft SUSY breaking masses are given at the scale  |
#              |  Q=  0.91187600E+02
#              |                                                    |
#              ------------------------------------------------------
#
#
BLOCK DCINFO  # Decay Program information
     1   SDECAY/HDECAY # decay calculator
     2   1.3b  /3.4    # version number
#
BLOCK SPINFO  # Spectrum calculator information
     1   SuSpect     # RGE +Spectrum calculator            
     2   2.41         # version number                     
#
BLOCK MODSEL  # Model selection
     1     0   # #general MSSM low scale                           
#
BLOCK SMINPUTS  # Standard Model inputs
         1     1.27934000E+02   # alpha_em^-1(M_Z)^MSbar
         2     1.16639000E-05   # G_F [GeV^-2]
         3     1.17200000E-01   # alpha_S(M_Z)^MSbar
         4     9.11870000E+01   # M_Z pole mass
         5     4.25000000E+00   # mb(mb)^MSbar
         6     1.72500000E+02   # mt pole mass
         7     1.77700000E+00   # mtau pole mass
#
BLOCK MINPAR  # Input parameters - minimal models
#
BLOCK EXTPAR  # Input parameters - non-minimal models
         0     9.11876000E+01   # EWSB                
         1     4.00000000E+02   # M_1                 
         2     1.00000000E+05   # M_2                 
         3     1.00000000E+05   # M_3                 
        11     0.00000000E+00   # A_t                 
        12     0.00000000E+00   # A_b                 
        13     0.00000000E+00   # A_tau               
        14     0.00000000E+00   # A_u                 
        15     0.00000000E+00   # A_d                 
        16     0.00000000E+00   # A_e                 
        23     3.50000000E+03   # mu(EWSB)            
        25     1.50000000E+00   # tanbeta(in)         
        26     2.00000000E+03   # MA_pole             
        31     1.00000000E+05   # M_eL                
        32     1.00000000E+05   # M_muL               
        33     1.00000000E+05   # M_tauL              
        34     1.00000000E+05   # M_eR                
        35     1.00000000E+05   # M_muR               
        36     1.00000000E+05   # M_tauR              
        41     1.40000000E+03   # M_q1L               
        42     1.40000000E+03   # M_q2L               
        43     1.40000000E+03   # M_q3L               
        44     1.00000000E+05   # M_uR                
        45     1.00000000E+05   # M_cR                
        46     1.00000000E+05   # M_tR                
        47     1.40000000E+03   # M_dR                
        48     1.40000000E+03   # M_sR                
        49     1.40000000E+03   # M_bR                
#
BLOCK MASS  # Mass Spectrum
# PDG code           mass       particle
        24     8.05822198E+01   # W+
        25     1.25000000E+02   # h
        35     2.00399498E+03   # H
        36     2.00000000E+03   # A
        37     2.02369827E+03   # H+
         5     4.87877839E+00   # b-quark pole mass calculated from mb(mb)_Msbar
   1000001     1.40047468E+03   # ~d_L
   2000001     1.40009139E+03   # ~d_R
   1000002     1.39961658E+03   # ~u_L
   2000002     9.99999974E+04   # ~u_R
   1000003     1.40047468E+03   # ~s_L
   2000003     1.40009139E+03   # ~s_R
   1000004     1.39961658E+03   # ~c_L
   2000004     9.99999974E+04   # ~c_R
   1000005     1.39543012E+03   # ~b_1
   2000005     1.40512396E+03   # ~b_2
   1000006     1.40736267E+03   # ~t_1
   2000006     1.00000106E+05   # ~t_2
   1000011     1.00000004E+05   # ~e_L
   2000011     1.00000004E+05   # ~e_R
   1000012     9.99999921E+04   # ~nu_eL
   1000013     1.00000004E+05   # ~mu_L
   2000013     1.00000004E+05   # ~mu_R
   1000014     9.99999921E+04   # ~nu_muL
   1000015     9.99999574E+04   # ~tau_1
   2000015     1.00000051E+05   # ~tau_2
   1000016     9.99999921E+04   # ~nu_tauL
   1000021     1.00000000E+05   # ~g
   1000022     3.99400682E+02   # ~chi_10
   1000023    -3.50002201E+03   # ~chi_20
   1000025     3.50055676E+03   # ~chi_30
   1000035     1.00000065E+05   # ~chi_40
   1000024     3.49994007E+03   # ~chi_1+
   1000037     1.00000065E+05   # ~chi_2+
   1000039     1.00000000E-09   # ~gravitino
#
BLOCK NMIX  # Neutralino Mixing Matrix
  1  1     9.99897669E-01   # N_11
  1  2    -1.06441153E-05   # N_12
  1  3     1.15788035E-02   # N_13
  1  4    -8.40136627E-03   # N_14
  2  1     2.24678696E-03   # N_21
  2  2    -1.49777775E-04   # N_22
  2  3    -7.07093873E-01   # N_23
  2  4    -7.07116104E-01   # N_24
  3  1     1.41281162E-02   # N_31
  3  2     8.03078500E-04   # N_32
  3  3    -7.07024733E-01   # N_33
  3  4     7.07047225E-01   # N_34
  4  1     3.66442493E-07   # N_41
  4  2    -9.99999666E-01   # N_42
  4  3    -4.62012816E-04   # N_43
  4  4     6.73814351E-04   # N_44
#
BLOCK UMIX  # Chargino Mixing Matrix U
  1  1    -6.53384584E-04   # U_11
  1  2     9.99999787E-01   # U_12
  2  1     9.99999787E-01   # U_21
  2  2     6.53384584E-04   # U_22
#
BLOCK VMIX  # Chargino Mixing Matrix V
  1  1    -9.52917307E-04   # V_11
  1  2     9.99999546E-01   # V_12
  2  1     9.99999546E-01   # V_21
  2  2     9.52917307E-04   # V_22
#
BLOCK STOPMIX  # Stop Mixing Matrix
  1  1     9.99999999E-01   # cos(theta_t)
  1  2     4.47213589E-05   # sin(theta_t)
  2  1    -4.47213589E-05   # -sin(theta_t)
  2  2     9.99999999E-01   # cos(theta_t)
#
BLOCK SBOTMIX  # Sbottom Mixing Matrix
  1  1     6.92986408E-01   # cos(theta_b)
  1  2     7.20950649E-01   # sin(theta_b)
  2  1    -7.20950649E-01   # -sin(theta_b)
  2  2     6.92986408E-01   # cos(theta_b)
#
BLOCK STAUMIX  # Stau Mixing Matrix
  1  1     7.06160074E-01   # cos(theta_tau)
  1  2     7.08052223E-01   # sin(theta_tau)
  2  1    -7.08052223E-01   # -sin(theta_tau)
  2  2     7.06160074E-01   # cos(theta_tau)
#
BLOCK ALPHA  # Higgs mixing
          -5.90282565E-01   # Mixing angle in the neutral Higgs boson sector
#
BLOCK HMIX Q=  9.11876000E+01  # DRbar Higgs Parameters
         1     3.50000000E+03   # mu(Q)               
         2     1.49999982E+00   # tanbeta(Q)          
         3     2.54860849E+02   # vev(Q)              
         4    -6.82728561E+07   # MA^2(Q)             
#
BLOCK GAUGE Q=  9.11876000E+01  # The gauge couplings
     1     3.50598155E-01   # gprime(Q) DRbar
     2     6.20252452E-01   # g(Q) DRbar
     3     1.02581515E+00   # g3(Q) DRbar
#
BLOCK AU Q=  9.11876000E+01  # The trilinear couplings
  1  1     0.00000000E+00   # A_u(Q) DRbar
  2  2     0.00000000E+00   # A_c(Q) DRbar
  3  3     0.00000000E+00   # A_t(Q) DRbar
#
BLOCK AD Q=  9.11876000E+01  # The trilinear couplings
  1  1     0.00000000E+00   # A_d(Q) DRbar
  2  2     0.00000000E+00   # A_s(Q) DRbar
  3  3     0.00000000E+00   # A_b(Q) DRbar
#
BLOCK AE Q=  9.11876000E+01  # The trilinear couplings
  1  1     0.00000000E+00   # A_e(Q) DRbar
  2  2     0.00000000E+00   # A_mu(Q) DRbar
  3  3     0.00000000E+00   # A_tau(Q) DRbar
#
BLOCK Yu Q=  9.11876000E+01  # The Yukawa couplings
  1  1     0.00000000E+00   # y_u(Q) DRbar
  2  2     0.00000000E+00   # y_c(Q) DRbar
  3  3     9.83651744E-01   # y_t(Q) DRbar
#
BLOCK Yd Q=  9.11876000E+01  # The Yukawa couplings
  1  1     0.00000000E+00   # y_d(Q) DRbar
  2  2     0.00000000E+00   # y_s(Q) DRbar
  3  3     2.58442733E-02   # y_b(Q) DRbar
#
BLOCK Ye Q=  9.11876000E+01  # The Yukawa couplings
  1  1     0.00000000E+00   # y_e(Q) DRbar
  2  2     0.00000000E+00   # y_mu(Q) DRbar
  3  3     1.77401394E-02   # y_tau(Q) DRbar
#
BLOCK MSOFT Q=  9.11876000E+01  # The soft SUSY breaking masses at the scale Q
         1     4.00000000E+02   # M_1                 
         2     1.00000000E+05   # M_2                 
         3     1.00000000E+05   # M_3                 
        14     0.00000000E+00   # A_u                 
        15     0.00000000E+00   # A_d                 
        16     0.00000000E+00   # A_e                 
        21     6.32545925E+08   # M^2_Hd              
        22    -1.14807295E+09   # M^2_Hu              
        31     1.00000000E+05   # M_eL                
        32     1.00000000E+05   # M_muL               
        33     1.00000000E+05   # M_tauL              
        34     1.00000000E+05   # M_eR                
        35     1.00000000E+05   # M_muR               
        36     1.00000000E+05   # M_tauR              
        41     1.40000000E+03   # M_q1L               
        42     1.40000000E+03   # M_q2L               
        43     1.40000000E+03   # M_q3L               
        44     1.00000000E+05   # M_uR                
        45     1.00000000E+05   # M_cR                
        46     1.00000000E+05   # M_tR                
        47     1.40000000E+03   # M_dR                
        48     1.40000000E+03   # M_sR                
        49     1.40000000E+03   # M_bR                
#
#
#
#                             =================
#                             |The decay table|
#                             =================
#
# - The QCD corrections to the decays gluino -> squark  + quark
#                                     squark -> gaugino + quark_prime
#                                     squark -> squark_prime + Higgs
#                                     squark -> gluino  + quark
#   are included.
#
# - The multi-body decays for the inos, stops and sbottoms are included.
#
# - The loop induced decays for the gluino, neutralinos and stops
#   are included.
#
# - The SUSY decays of the top quark are included.
#
# - Possible decays of the NLSP in GMSB models are included.
#
#
#         PDG            Width
DECAY         6     1.32785645E+00   # top decays
#          BR         NDA      ID1       ID2
     1.00000000E+00    2           5        24   # BR(t ->  b    W+)
#
#         PDG            Width
DECAY   1000021     1.E-04   # gluino decays (OJ Mods)
#          BR         NDA      ID1       ID2
     3.71895124E-04    2     1000001        -1   # BR(~g -> ~d_L  db)
     3.71895124E-04    2    -1000001         1   # BR(~g -> ~d_L* d )
     3.71895204E-04    2     2000001        -1   # BR(~g -> ~d_R  db)
     3.71895204E-04    2    -2000001         1   # BR(~g -> ~d_R* d )
     3.71895302E-04    2     1000002        -2   # BR(~g -> ~u_L  ub)
     3.71895302E-04    2    -1000002         2   # BR(~g -> ~u_L* u )
     1.00599897E-18    2     2000002        -2   # BR(~g -> ~u_R  ub)
     1.00599897E-18    2    -2000002         2   # BR(~g -> ~u_R* u )
     3.71895124E-04    2     1000003        -3   # BR(~g -> ~s_L  sb)
     3.71895124E-04    2    -1000003         3   # BR(~g -> ~s_L* s )
     3.71895204E-04    2     2000003        -3   # BR(~g -> ~s_R  sb)
     3.71895204E-04    2    -2000003         3   # BR(~g -> ~s_R* s )
     3.71895302E-04    2     1000004        -4   # BR(~g -> ~c_L  cb)
     3.71895302E-04    2    -1000004         4   # BR(~g -> ~c_L* c )
     1.00599897E-18    2     2000004        -4   # BR(~g -> ~c_R  cb)
     1.00599897E-18    2    -2000004         4   # BR(~g -> ~c_R* c )
     2.46193123E-01    2     1000005        -5   # BR(~g -> ~b_1  bb)
     2.46193123E-01    2    -1000005         5   # BR(~g -> ~b_1* b )
     2.46002868E-01    2     2000005        -5   # BR(~g -> ~b_2  bb)
     2.46002868E-01    2    -2000005         5   # BR(~g -> ~b_2* b )
     3.65987903E-04    2     1000006        -6   # BR(~g -> ~t_1  tb)
     3.65987903E-04    2    -1000006         6   # BR(~g -> ~t_1* t )
     1.04132997E-02    2     1000039        21   # BR(~g -> ~G g)
#
#         PDG            Width
DECAY   1000006     1.90792102E-01   # stop1 decays
#          BR         NDA      ID1       ID2
     1.00000000E+00    2     1000022         6   # BR(~t_1 -> ~chi_10 t )
#
#         PDG            Width
DECAY   2000006     4.94695290E+05   # stop2 decays
#          BR         NDA      ID1       ID2
     4.21393670E-04    2     1000022         6   # BR(~t_2 -> ~chi_10 t )
     1.00806780E-03    2     1000023         6   # BR(~t_2 -> ~chi_20 t )
     1.00793731E-03    2     1000025         6   # BR(~t_2 -> ~chi_30 t )
     9.97597648E-01    2     1000024         5   # BR(~t_2 -> ~chi_1+ b )
    -2.75673299E-05    2     1000006        25   # BR(~t_2 -> ~t_1    h )
     2.88617848E-05    2     1000006        35   # BR(~t_2 -> ~t_1    H )
     2.88116375E-05    2     1000006        36   # BR(~t_2 -> ~t_1    A )
     2.71373482E-05    2     1000005        37   # BR(~t_2 -> ~b_1    H+)
     3.04838871E-05    2     2000005        37   # BR(~t_2 -> ~b_2    H+)
    -1.97065343E-05    2     1000006        23   # BR(~t_2 -> ~t_1    Z )
    -4.94971997E-05    2     1000005        24   # BR(~t_2 -> ~b_1    W+)
    -5.35705179E-05    2     2000005        24   # BR(~t_2 -> ~b_2    W+)
#
#         PDG            Width
DECAY   1000005     1.07889732E+02   # sbottom1 decays
#          BR         NDA      ID1       ID2
     1.00000000E+00    2     1000022         5   # BR(~b_1 -> ~chi_10 b )
#
#         PDG            Width
DECAY   2000005     1.02943715E+02   # sbottom2 decays
#          BR         NDA      ID1       ID2
     1.00000000E+00    2     1000022         5   # BR(~b_2 -> ~chi_10 b )
#
#         PDG            Width
DECAY   1000002     1.94979788E-01   # sup_L decays
#          BR         NDA      ID1       ID2
     1.00000000E+00    2     1000022         2   # BR(~u_L -> ~chi_10 u)
#
#         PDG            Width
DECAY   2000002     2.08385539E+02   # sup_R decays
#          BR         NDA      ID1       ID2
     9.99795576E-01    2     1000022         2   # BR(~u_R -> ~chi_10 u)
     5.04242791E-06    2     1000023         2   # BR(~u_R -> ~chi_20 u)
     1.99381207E-04    2     1000025         2   # BR(~u_R -> ~chi_30 u)
#
#         PDG            Width
DECAY   1000001     1.95178178E-01   # sdown_L decays
#          BR         NDA      ID1       ID2
     1.00000000E+00    2     1000022         1   # BR(~d_L -> ~chi_10 d)
#
#         PDG            Width
DECAY   2000001     7.80348822E-01   # sdown_R decays
#          BR         NDA      ID1       ID2
     1.00000000E+00    2     1000022         1   # BR(~d_R -> ~chi_10 d)
#
#         PDG            Width
DECAY   1000004     1.94979788E-01   # scharm_L decays
#          BR         NDA      ID1       ID2
     1.00000000E+00    2     1000022         4   # BR(~c_L -> ~chi_10 c)
#
#         PDG            Width
DECAY   2000004     2.08385539E+02   # scharm_R decays
#          BR         NDA      ID1       ID2
     9.99795576E-01    2     1000022         4   # BR(~c_R -> ~chi_10 c)
     5.04242791E-06    2     1000023         4   # BR(~c_R -> ~chi_20 c)
     1.99381207E-04    2     1000025         4   # BR(~c_R -> ~chi_30 c)
#
#         PDG            Width
DECAY   1000003     1.95178178E-01   # sstrange_L decays
#          BR         NDA      ID1       ID2
     1.00000000E+00    2     1000022         3   # BR(~s_L -> ~chi_10 s)
#
#         PDG            Width
DECAY   2000003     7.80348822E-01   # sstrange_R decays
#          BR         NDA      ID1       ID2
     1.00000000E+00    2     1000022         3   # BR(~s_R -> ~chi_10 s)
#
#         PDG            Width
DECAY   1000011     1.22266628E+02   # selectron_L decays
#          BR         NDA      ID1       ID2
     9.99752235E-01    2     1000022        11   # BR(~e_L -> ~chi_10 e-)
     3.91806224E-06    2     1000023        11   # BR(~e_L -> ~chi_20 e-)
     2.41181382E-04    2     1000025        11   # BR(~e_L -> ~chi_30 e-)
     2.66582931E-06    2    -1000024        12   # BR(~e_L -> ~chi_1- nu_e)
#
#         PDG            Width
DECAY   2000011     4.89063599E+02   # selectron_R decays
#          BR         NDA      ID1       ID2
     9.99795843E-01    2     1000022        11   # BR(~e_R -> ~chi_10 e-)
     5.03585449E-06    2     1000023        11   # BR(~e_R -> ~chi_20 e-)
     1.99121234E-04    2     1000025        11   # BR(~e_R -> ~chi_30 e-)
#
#         PDG            Width
DECAY   1000013     1.22266628E+02   # smuon_L decays
#          BR         NDA      ID1       ID2
     9.99752235E-01    2     1000022        13   # BR(~mu_L -> ~chi_10 mu-)
     3.91806224E-06    2     1000023        13   # BR(~mu_L -> ~chi_20 mu-)
     2.41181382E-04    2     1000025        13   # BR(~mu_L -> ~chi_30 mu-)
     2.66582931E-06    2    -1000024        14   # BR(~mu_L -> ~chi_1- nu_mu)
#
#         PDG            Width
DECAY   2000013     4.89063599E+02   # smuon_R decays
#          BR         NDA      ID1       ID2
     9.99795843E-01    2     1000022        13   # BR(~mu_R -> ~chi_10 mu-)
     5.03585449E-06    2     1000023        13   # BR(~mu_R -> ~chi_20 mu-)
     1.99121234E-04    2     1000025        13   # BR(~mu_R -> ~chi_30 mu-)
#
#         PDG            Width
DECAY   1000015     1.18200350E+04   # stau_1 decays
#          BR         NDA      ID1       ID2
     2.59044901E-02    2     1000022        15   # BR(~tau_1 -> ~chi_10  tau-)
     2.52321485E-05    2     1000023        15   # BR(~tau_1 -> ~chi_20  tau-)
     2.51540016E-05    2     1000025        15   # BR(~tau_1 -> ~chi_30  tau-)
     2.77113921E-05    2    -1000024        16   # BR(~tau_1 -> ~chi_1-  nu_tau)
     9.74017412E-01    2     1000039        15   # BR(~tau_1 -> ~G       tau-)
#
#         PDG            Width
DECAY   2000015     3.06088835E+02   # stau_2 decays
#          BR         NDA      ID1       ID2
     9.96469788E-01    2     1000022        15   # BR(~tau_2 -> ~chi_10  tau-)
     1.07564170E-03    2     1000023        15   # BR(~tau_2 -> ~chi_20  tau-)
     1.48314063E-03    2     1000025        15   # BR(~tau_2 -> ~chi_30  tau-)
     9.71429833E-04    2    -1000024        16   # BR(~tau_2 -> ~chi_1-  nu_tau)
#
#         PDG            Width
DECAY   1000012     1.22266686E+02   # snu_eL decays
#          BR         NDA      ID1       ID2
     9.99826950E-01    2     1000022        12   # BR(~nu_eL -> ~chi_10 nu_e)
     6.29366725E-06    2     1000023        12   # BR(~nu_eL -> ~chi_20 nu_e)
     1.61085883E-04    2     1000025        12   # BR(~nu_eL -> ~chi_30 nu_e)
     5.67028307E-06    2     1000024        11   # BR(~nu_eL -> ~chi_1+ e-)
#
#         PDG            Width
DECAY   1000014     1.22266686E+02   # snu_muL decays
#          BR         NDA      ID1       ID2
     9.99826950E-01    2     1000022        14   # BR(~nu_muL -> ~chi_10 nu_mu)
     6.29366725E-06    2     1000023        14   # BR(~nu_muL -> ~chi_20 nu_mu)
     1.61085883E-04    2     1000025        14   # BR(~nu_muL -> ~chi_30 nu_mu)
     5.67028307E-06    2     1000024        13   # BR(~nu_muL -> ~chi_1+ mu-)
#
#         PDG            Width
DECAY   1000016     1.22891254E+02   # snu_tauL decays
#          BR         NDA      ID1       ID2
     9.94745553E-01    2     1000022        16   # BR(~nu_tauL -> ~chi_10 nu_tau)
     6.26168109E-06    2     1000023        16   # BR(~nu_tauL -> ~chi_20 nu_tau)
     1.60267200E-04    2     1000025        16   # BR(~nu_tauL -> ~chi_30 nu_tau)
     5.08791848E-03    2     1000024        15   # BR(~nu_tauL -> ~chi_1+ tau-)
#
#         PDG            Width
DECAY   1000024     7.53251523E+01   # chargino1+ decays
#          BR         NDA      ID1       ID2
     4.03158382E-07    2     1000002        -1   # BR(~chi_1+ -> ~u_L     db)
     1.89457195E-07    2    -1000001         2   # BR(~chi_1+ -> ~d_L*    u )
     4.03158382E-07    2     1000004        -3   # BR(~chi_1+ -> ~c_L     sb)
     1.89457195E-07    2    -1000003         4   # BR(~chi_1+ -> ~s_L*    c )
     1.71736046E-01    2     1000006        -5   # BR(~chi_1+ -> ~t_1     bb)
     6.89770210E-02    2    -1000005         6   # BR(~chi_1+ -> ~b_1*    t )
     7.17797549E-01    2    -2000005         6   # BR(~chi_1+ -> ~b_2*    t )
     3.29876893E-02    2     1000022        24   # BR(~chi_1+ -> ~chi_10  W+)
     8.49571636E-03    2     1000022        37   # BR(~chi_1+ -> ~chi_10  H+)
     4.00526661E-06    2     1000039        24   # BR(~chi_1+ -> ~G       W+)
     7.88067055E-07    2     1000039        37   # BR(~chi_1+ -> ~G       H+)
#
#         PDG            Width
DECAY   1000037     3.02829981E+05   # chargino2+ decays
#          BR         NDA      ID1       ID2
     3.50121385E-03    2     1000002        -1   # BR(~chi_2+ -> ~u_L     db)
     3.50121502E-03    2    -1000001         2   # BR(~chi_2+ -> ~d_L*    u )
     3.50121385E-03    2     1000004        -3   # BR(~chi_2+ -> ~c_L     sb)
     3.50121502E-03    2    -1000003         4   # BR(~chi_2+ -> ~s_L*    c )
     9.40464797E-01    2     1000006        -5   # BR(~chi_2+ -> ~t_1     bb)
     7.60431058E-04    2    -1000005         6   # BR(~chi_2+ -> ~b_1*    t )
     3.33154214E-03    2    -2000005         6   # BR(~chi_2+ -> ~b_2*    t )
     2.58789994E-15    2     1000012       -11   # BR(~chi_2+ -> ~nu_eL   e+  )
     2.58789994E-15    2     1000014       -13   # BR(~chi_2+ -> ~nu_muL  mu+ )
     1.81197564E-15    2    -1000011        12   # BR(~chi_2+ -> ~e_L+    nu_e)
     1.81197564E-15    2    -1000013        14   # BR(~chi_2+ -> ~mu_L+   nu_mu)
     2.81129919E-15    2    -1000015        16   # BR(~chi_2+ -> ~tau_1+  nu_tau)
     4.78515191E-17    2    -2000015        16   # BR(~chi_2+ -> ~tau_2+  nu_tau)
     6.42380572E-04    2     1000024        23   # BR(~chi_2+ -> ~chi_1+  Z )
     9.91051416E-08    2     1000022        24   # BR(~chi_2+ -> ~chi_10  W+)
     6.23405061E-04    2     1000023        24   # BR(~chi_2+ -> ~chi_20  W+)
     6.23299233E-04    2     1000025        24   # BR(~chi_2+ -> ~chi_30  W+)
     6.48052849E-04    2     1000024        25   # BR(~chi_2+ -> ~chi_1+  h )
     5.68869234E-04    2     1000024        35   # BR(~chi_2+ -> ~chi_1+  H )
     5.68944021E-04    2     1000024        36   # BR(~chi_2+ -> ~chi_1+  A )
     1.31130250E-07    2     1000022        37   # BR(~chi_2+ -> ~chi_10  H+)
     5.68922935E-04    2     1000023        37   # BR(~chi_2+ -> ~chi_20  H+)
     5.68813007E-04    2     1000025        37   # BR(~chi_2+ -> ~chi_30  H+)
     3.66254446E-02    2     1000039        24   # BR(~chi_2+ -> ~G       W+)
     1.05117742E-08    2     1000039        37   # BR(~chi_2+ -> ~G       H+)
#
#         PDG            Width
DECAY   1000022     1.E-08   # neutralino1 decays (OJ Mods)
#          BR         NDA      ID1       ID2
     7.94893979E-01    2     1000039        22   # BR(~chi_10 -> ~G        gam)
     2.05105921E-01    2     1000039        23   # BR(~chi_10 -> ~G        Z)
     9.94078318E-08    2     1000039        25   # BR(~chi_10 -> ~G        h)
#
#         PDG            Width
DECAY   1000023     1.E-08   # neutralino2 decays (OJ Mods)
#          BR         NDA      ID1       ID2
     2.83697075E-02    2     1000022        23   # BR(~chi_20 -> ~chi_10   Z )
     7.05930977E-04    2     1000022        25   # BR(~chi_20 -> ~chi_10   h )
     6.90553681E-03    2     1000022        35   # BR(~chi_20 -> ~chi_10   H )
     5.53336100E-04    2     1000022        36   # BR(~chi_20 -> ~chi_10   A )
     1.63785535E-08    2     1000002        -2   # BR(~chi_20 -> ~u_L      ub)
     1.63785535E-08    2    -1000002         2   # BR(~chi_20 -> ~u_L*     u )
     7.18586959E-08    2     1000001        -1   # BR(~chi_20 -> ~d_L      db)
     7.18586959E-08    2    -1000001         1   # BR(~chi_20 -> ~d_L*     d )
     1.56858624E-07    2     2000001        -1   # BR(~chi_20 -> ~d_R      db)
     1.56858624E-07    2    -2000001         1   # BR(~chi_20 -> ~d_R*     d )
     1.63785535E-08    2     1000004        -4   # BR(~chi_20 -> ~c_L      cb)
     1.63785535E-08    2    -1000004         4   # BR(~chi_20 -> ~c_L*     c )
     7.18586959E-08    2     1000003        -3   # BR(~chi_20 -> ~s_L      sb)
     7.18586959E-08    2    -1000003         3   # BR(~chi_20 -> ~s_L*     s )
     1.56858624E-07    2     2000003        -3   # BR(~chi_20 -> ~s_R      sb)
     1.56858624E-07    2    -2000003         3   # BR(~chi_20 -> ~s_R*     s )
     3.36027947E-01    2     1000006        -6   # BR(~chi_20 -> ~t_1      tb)
     3.36027947E-01    2    -1000006         6   # BR(~chi_20 -> ~t_1*     t )
     7.02801139E-02    2     1000005        -5   # BR(~chi_20 -> ~b_1      bb)
     7.02801139E-02    2    -1000005         5   # BR(~chi_20 -> ~b_1*     b )
     7.54221947E-02    2     2000005        -5   # BR(~chi_20 -> ~b_2      bb)
     7.54221947E-02    2    -2000005         5   # BR(~chi_20 -> ~b_2*     b )
     2.43388513E-11    2     1000039        22   # BR(~chi_20 -> ~G        gam)
     1.31785636E-07    2     1000039        23   # BR(~chi_20 -> ~G        Z)
     3.28900370E-06    2     1000039        25   # BR(~chi_20 -> ~G        h)
     2.63527379E-08    2     1000039        35   # BR(~chi_20 -> ~G        H)
     6.79460832E-07    2     1000039        36   # BR(~chi_20 -> ~G        A)
#
#         PDG            Width
DECAY   1000025     8.82679580E+01   # neutralino3 decays
#          BR         NDA      ID1       ID2
     7.16216059E-04    2     1000022        23   # BR(~chi_30 -> ~chi_10   Z )
     2.84974673E-02    2     1000022        25   # BR(~chi_30 -> ~chi_10   h )
     5.37311757E-04    2     1000022        35   # BR(~chi_30 -> ~chi_10   H )
     6.91495309E-03    2     1000022        36   # BR(~chi_30 -> ~chi_10   A )
     2.62119043E-06    2     1000002        -2   # BR(~chi_30 -> ~u_L      ub)
     2.62119043E-06    2    -1000002         2   # BR(~chi_30 -> ~u_L*     u )
     7.54059301E-07    2     1000001        -1   # BR(~chi_30 -> ~d_L      db)
     7.54059301E-07    2    -1000001         1   # BR(~chi_30 -> ~d_L*     d )
     6.18649980E-06    2     2000001        -1   # BR(~chi_30 -> ~d_R      db)
     6.18649980E-06    2    -2000001         1   # BR(~chi_30 -> ~d_R*     d )
     2.62119043E-06    2     1000004        -4   # BR(~chi_30 -> ~c_L      cb)
     2.62119043E-06    2    -1000004         4   # BR(~chi_30 -> ~c_L*     c )
     7.54059301E-07    2     1000003        -3   # BR(~chi_30 -> ~s_L      sb)
     7.54059301E-07    2    -1000003         3   # BR(~chi_30 -> ~s_L*     s )
     6.18649980E-06    2     2000003        -3   # BR(~chi_30 -> ~s_R      sb)
     6.18649980E-06    2    -2000003         3   # BR(~chi_30 -> ~s_R*     s )
     3.35192302E-01    2     1000006        -6   # BR(~chi_30 -> ~t_1      tb)
     3.35192302E-01    2    -1000006         6   # BR(~chi_30 -> ~t_1*     t )
     6.10544046E-02    2     1000005        -5   # BR(~chi_30 -> ~b_1      bb)
     6.10544046E-02    2    -1000005         5   # BR(~chi_30 -> ~b_1*     b )
     8.54016620E-02    2     2000005        -5   # BR(~chi_30 -> ~b_2      bb)
     8.54016620E-02    2    -2000005         5   # BR(~chi_30 -> ~b_2*     b )
     1.10482268E-09    2     1000039        22   # BR(~chi_30 -> ~G        gam)
     3.28681877E-06    2     1000039        23   # BR(~chi_30 -> ~G        Z)
     1.28194488E-07    2     1000039        25   # BR(~chi_30 -> ~G        h)
     6.73716651E-07    2     1000039        35   # BR(~chi_30 -> ~G        H)
     2.71298154E-08    2     1000039        36   # BR(~chi_30 -> ~G        A)
#
#         PDG            Width
DECAY   1000035     3.02831272E+05   # neutralino4 decays
#          BR         NDA      ID1       ID2
     9.36657290E-11    2     1000022        23   # BR(~chi_40 -> ~chi_10   Z )
     6.20792618E-04    2     1000023        23   # BR(~chi_40 -> ~chi_20   Z )
     2.15857268E-05    2     1000025        23   # BR(~chi_40 -> ~chi_30   Z )
     6.23398580E-04    2     1000024       -24   # BR(~chi_40 -> ~chi_1+   W-)
     6.23398580E-04    2    -1000024        24   # BR(~chi_40 -> ~chi_1-   W+)
     1.03096961E-07    2     1000022        25   # BR(~chi_40 -> ~chi_10   h )
     1.49510748E-08    2     1000022        35   # BR(~chi_40 -> ~chi_10   H )
     1.16001453E-07    2     1000022        36   # BR(~chi_40 -> ~chi_10   A )
     2.12838389E-05    2     1000023        25   # BR(~chi_40 -> ~chi_20   h )
     5.44398596E-04    2     1000023        35   # BR(~chi_40 -> ~chi_20   H )
     2.50250214E-05    2     1000023        36   # BR(~chi_40 -> ~chi_20   A )
     6.26663914E-04    2     1000025        25   # BR(~chi_40 -> ~chi_30   h )
     2.44526476E-05    2     1000025        35   # BR(~chi_40 -> ~chi_30   H )
     5.43800652E-04    2     1000025        36   # BR(~chi_40 -> ~chi_30   A )
     5.68931558E-04    2     1000024       -37   # BR(~chi_40 -> ~chi_1+   H-)
     5.68931558E-04    2    -1000024        37   # BR(~chi_40 -> ~chi_1-   H+)
     1.67582244E-03    2     1000002        -2   # BR(~chi_40 -> ~u_L      ub)
     1.67582244E-03    2    -1000002         2   # BR(~chi_40 -> ~u_L*     u )
     2.67705375E-23    2     2000002        -2   # BR(~chi_40 -> ~u_R      ub)
     2.67705375E-23    2    -2000002         2   # BR(~chi_40 -> ~u_R*     u )
     1.67582327E-03    2     1000001        -1   # BR(~chi_40 -> ~d_L      db)
     1.67582327E-03    2    -1000001         1   # BR(~chi_40 -> ~d_L*     d )
     3.19550732E-17    2     2000001        -1   # BR(~chi_40 -> ~d_R      db)
     3.19550732E-17    2    -2000001         1   # BR(~chi_40 -> ~d_R*     d )
     1.67582244E-03    2     1000004        -4   # BR(~chi_40 -> ~c_L      cb)
     1.67582244E-03    2    -1000004         4   # BR(~chi_40 -> ~c_L*     c )
     2.67705375E-23    2     2000004        -4   # BR(~chi_40 -> ~c_R      cb)
     2.67705375E-23    2    -2000004         4   # BR(~chi_40 -> ~c_R*     c )
     1.67582327E-03    2     1000003        -3   # BR(~chi_40 -> ~s_L      sb)
     1.67582327E-03    2    -1000003         3   # BR(~chi_40 -> ~s_L*     s )
     3.19550732E-17    2     2000003        -3   # BR(~chi_40 -> ~s_R      sb)
     3.19550732E-17    2    -2000003         3   # BR(~chi_40 -> ~s_R*     s )
     2.04597978E-03    2     1000006        -6   # BR(~chi_40 -> ~t_1      tb)
     2.04597978E-03    2    -1000006         6   # BR(~chi_40 -> ~t_1*     t )
     2.25205406E-01    2     1000005        -5   # BR(~chi_40 -> ~b_1      bb)
     2.25205406E-01    2    -1000005         5   # BR(~chi_40 -> ~b_1*     b )
     2.45027114E-01    2     2000005        -5   # BR(~chi_40 -> ~b_2      bb)
     2.45027114E-01    2    -2000005         5   # BR(~chi_40 -> ~b_2*     b )
     9.05983508E-16    2     1000011       -11   # BR(~chi_40 -> ~e_L-     e+)
     9.05983508E-16    2    -1000011        11   # BR(~chi_40 -> ~e_L+     e-)
     1.55480055E-28    2     2000011       -11   # BR(~chi_40 -> ~e_R-     e+)
     1.55480055E-28    2    -2000011        11   # BR(~chi_40 -> ~e_R+     e-)
     9.05983508E-16    2     1000013       -13   # BR(~chi_40 -> ~mu_L-    mu+)
     9.05983508E-16    2    -1000013        13   # BR(~chi_40 -> ~mu_L+    mu-)
     1.55480055E-28    2     2000013       -13   # BR(~chi_40 -> ~mu_R-    mu+)
     1.55480055E-28    2    -2000013        13   # BR(~chi_40 -> ~mu_R+    mu-)
     1.29394551E-15    2     1000012       -12   # BR(~chi_40 -> ~nu_eL    nu_eb)
     1.29394551E-15    2    -1000012        12   # BR(~chi_40 -> ~nu_eL*   nu_e )
     1.29394551E-15    2     1000014       -14   # BR(~chi_40 -> ~nu_muL   nu_mub)
     1.29394551E-15    2    -1000014        14   # BR(~chi_40 -> ~nu_muL*  nu_mu )
     1.29394551E-15    2     1000016       -16   # BR(~chi_40 -> ~nu_tau1  nu_taub)
     1.29394551E-15    2    -1000016        16   # BR(~chi_40 -> ~nu_tau1* nu_tau )
     8.86852910E-03    2     1000039        22   # BR(~chi_40 -> ~G        gam)
     2.77567627E-02    2     1000039        23   # BR(~chi_40 -> ~G        Z)
     1.67726078E-09    2     1000039        25   # BR(~chi_40 -> ~G        h)
     1.05291872E-08    2     1000039        35   # BR(~chi_40 -> ~G        H)
     2.07488082E-12    2     1000039        36   # BR(~chi_40 -> ~G        A)
#
#
#
#
