#
#                              ======================
#                              | THE SUSYHIT OUTPUT |
#                              ======================
#
#
#              ------------------------------------------------------
#              |     This is the output of the SUSY-HIT package     |
#              |  created by A.Djouadi, M.Muehlleitner and M.Spira. |
#              |  In case of problems with SUSY-HIT email to        |
#              |           margarete.muehlleitner@cern.ch           |
#              |           michael.spira@psi.ch                     |
#              |           abdelhak.djouadi@cern.ch                 |
#              ------------------------------------------------------
#
#              ------------------------------------------------------
#              |  SUSY Les Houches Accord - MSSM Spectrum + Decays  |
#              |              based on the decay programs           |
#              |                                                    |
#              |                     SDECAY 1.3b                    |
#              |                                                    |
#              |  Authors: M.Muhlleitner, A.Djouadi and Y.Mambrini  |
#              |  Ref.:    Comput.Phys.Commun.168(2005)46           |
#              |           [hep-ph/0311167]                         |
#              |                                                    |
#              |                     HDECAY 3.4                     |
#              |                                                    |
#              |  By: A.Djouadi,J.Kalinowski,M.Muhlleitner,M.Spira  |
#              |  Ref.:    Comput.Phys.Commun.108(1998)56           |
#              |           [hep-ph/9704448]                         |
#              |                                                    |
#              |                                                    |
#              |  If not stated otherwise all DRbar couplings and   |
#              |  soft SUSY breaking masses are given at the scale  |
#              |  Q=  0.91187600E+02
#              |                                                    |
#              ------------------------------------------------------
#
#
BLOCK DCINFO  # Decay Program information
     1   SDECAY/HDECAY # decay calculator
     2   1.3b  /3.4    # version number
#
BLOCK SPINFO  # Spectrum calculator information
     1   SuSpect     # RGE +Spectrum calculator            
     2   2.41         # version number                     
#
BLOCK MODSEL  # Model selection
     1     0   # #general MSSM low scale                           
#
BLOCK SMINPUTS  # Standard Model inputs
         1     1.27934000E+02   # alpha_em^-1(M_Z)^MSbar
         2     1.16639000E-05   # G_F [GeV^-2]
         3     1.17200000E-01   # alpha_S(M_Z)^MSbar
         4     9.11870000E+01   # M_Z pole mass
         5     4.25000000E+00   # mb(mb)^MSbar
         6     1.72500000E+02   # mt pole mass
         7     1.77700000E+00   # mtau pole mass
#
BLOCK MINPAR  # Input parameters - minimal models
#
BLOCK EXTPAR  # Input parameters - non-minimal models
         0     9.11876000E+01   # EWSB                
         1     1.40000000E+03   # M_1                 
         2     1.00000000E+05   # M_2                 
         3     1.00000000E+05   # M_3                 
        11     0.00000000E+00   # A_t                 
        12     0.00000000E+00   # A_b                 
        13     0.00000000E+00   # A_tau               
        14     0.00000000E+00   # A_u                 
        15     0.00000000E+00   # A_d                 
        16     0.00000000E+00   # A_e                 
        23     3.50000000E+03   # mu(EWSB)            
        25     1.50000000E+00   # tanbeta(in)         
        26     2.00000000E+03   # MA_pole             
        31     1.00000000E+05   # M_eL                
        32     1.00000000E+05   # M_muL               
        33     1.00000000E+05   # M_tauL              
        34     1.00000000E+05   # M_eR                
        35     1.00000000E+05   # M_muR               
        36     1.00000000E+05   # M_tauR              
        41     2.10000000E+03   # M_q1L               
        42     2.10000000E+03   # M_q2L               
        43     2.10000000E+03   # M_q3L               
        44     1.00000000E+05   # M_uR                
        45     1.00000000E+05   # M_cR                
        46     1.00000000E+05   # M_tR                
        47     2.10000000E+03   # M_dR                
        48     2.10000000E+03   # M_sR                
        49     2.10000000E+03   # M_bR                
#
BLOCK MASS  # Mass Spectrum
# PDG code           mass       particle
        24     8.05849123E+01   # W+
        25     1.25000000E+02   # h
        35     2.00405969E+03   # H
        36     2.00000000E+03   # A
        37     2.02368523E+03   # H+
         5     4.87877839E+00   # b-quark pole mass calculated from mb(mb)_Msbar
   1000001     2.10031563E+03   # ~d_L
   2000001     2.10006092E+03   # ~d_R
   1000002     2.09974526E+03   # ~u_L
   2000002     9.99999974E+04   # ~u_R
   1000003     2.10031563E+03   # ~s_L
   2000003     2.10006092E+03   # ~s_R
   1000004     2.09974526E+03   # ~c_L
   2000004     9.99999974E+04   # ~c_R
   1000005     2.09695088E+03   # ~b_1
   2000005     2.10342388E+03   # ~b_2
   1000006     2.10491610E+03   # ~t_1
   2000006     1.00000106E+05   # ~t_2
   1000011     1.00000004E+05   # ~e_L
   2000011     1.00000004E+05   # ~e_R
   1000012     9.99999921E+04   # ~nu_eL
   1000013     1.00000004E+05   # ~mu_L
   2000013     1.00000004E+05   # ~mu_R
   1000014     9.99999921E+04   # ~nu_muL
   1000015     9.99999574E+04   # ~tau_1
   2000015     1.00000051E+05   # ~tau_2
   1000016     9.99999921E+04   # ~nu_tauL
   1000021     1.00000000E+05   # ~g
   1000022     1.39910217E+03   # ~chi_10
   1000023    -3.50001798E+03   # ~chi_20
   1000025     3.50085143E+03   # ~chi_30
   1000035     1.00000064E+05   # ~chi_40
   1000024     3.49994025E+03   # ~chi_1+
   1000037     1.00000064E+05   # ~chi_2+
   1000039     1.00000000E-09   # ~gravitino
#
BLOCK NMIX  # Neutralino Mixing Matrix
  1  1     9.99781061E-01   # N_11
  1  2    -1.60821004E-05   # N_12
  1  3     1.60060121E-02   # N_13
  1  4    -1.34773257E-02   # N_14
  2  1     1.78816965E-03   # N_21
  2  2    -1.49552215E-04   # N_22
  2  3    -7.07096561E-01   # N_23
  2  4    -7.07114725E-01   # N_24
  3  1     2.08478639E-02   # N_31
  3  2     8.01789391E-04   # N_32
  3  3    -7.06935675E-01   # N_33
  3  4     7.06970066E-01   # N_34
  4  1     3.69592232E-07   # N_41
  4  2    -9.99999667E-01   # N_42
  4  3    -4.61323232E-04   # N_43
  4  4     6.72808640E-04   # N_44
#
BLOCK UMIX  # Chargino Mixing Matrix U
  1  1    -6.52409364E-04   # U_11
  1  2     9.99999787E-01   # U_12
  2  1     9.99999787E-01   # U_21
  2  2     6.52409364E-04   # U_22
#
BLOCK VMIX  # Chargino Mixing Matrix V
  1  1    -9.51495013E-04   # V_11
  1  2     9.99999547E-01   # V_12
  2  1     9.99999547E-01   # V_21
  2  2     9.51495013E-04   # V_22
#
BLOCK STOPMIX  # Stop Mixing Matrix
  1  1     9.99999999E-01   # cos(theta_t)
  1  2     4.47213589E-05   # sin(theta_t)
  2  1    -4.47213589E-05   # -sin(theta_t)
  2  2     9.99999999E-01   # cos(theta_t)
#
BLOCK SBOTMIX  # Sbottom Mixing Matrix
  1  1     6.93055291E-01   # cos(theta_b)
  1  2     7.20884432E-01   # sin(theta_b)
  2  1    -7.20884432E-01   # -sin(theta_b)
  2  2     6.93055291E-01   # cos(theta_b)
#
BLOCK STAUMIX  # Stau Mixing Matrix
  1  1     7.06226564E-01   # cos(theta_tau)
  1  2     7.07985904E-01   # sin(theta_tau)
  2  1    -7.07985904E-01   # -sin(theta_tau)
  2  2     7.06226564E-01   # cos(theta_tau)
#
BLOCK ALPHA  # Higgs mixing
          -5.90348490E-01   # Mixing angle in the neutral Higgs boson sector
#
BLOCK HMIX Q=  9.11876000E+01  # DRbar Higgs Parameters
         1     3.50000000E+03   # mu(Q)               
         2     1.49999982E+00   # tanbeta(Q)          
         3     2.54882497E+02   # vev(Q)              
         4    -6.80854051E+07   # MA^2(Q)             
#
BLOCK GAUGE Q=  9.11876000E+01  # The gauge couplings
     1     3.50554872E-01   # gprime(Q) DRbar
     2     6.19274061E-01   # g(Q) DRbar
     3     1.02169444E+00   # g3(Q) DRbar
#
BLOCK AU Q=  9.11876000E+01  # The trilinear couplings
  1  1     0.00000000E+00   # A_u(Q) DRbar
  2  2     0.00000000E+00   # A_c(Q) DRbar
  3  3     0.00000000E+00   # A_t(Q) DRbar
#
BLOCK AD Q=  9.11876000E+01  # The trilinear couplings
  1  1     0.00000000E+00   # A_d(Q) DRbar
  2  2     0.00000000E+00   # A_s(Q) DRbar
  3  3     0.00000000E+00   # A_b(Q) DRbar
#
BLOCK AE Q=  9.11876000E+01  # The trilinear couplings
  1  1     0.00000000E+00   # A_e(Q) DRbar
  2  2     0.00000000E+00   # A_mu(Q) DRbar
  3  3     0.00000000E+00   # A_tau(Q) DRbar
#
BLOCK Yu Q=  9.11876000E+01  # The Yukawa couplings
  1  1     0.00000000E+00   # y_u(Q) DRbar
  2  2     0.00000000E+00   # y_c(Q) DRbar
  3  3     9.83535720E-01   # y_t(Q) DRbar
#
BLOCK Yd Q=  9.11876000E+01  # The Yukawa couplings
  1  1     0.00000000E+00   # y_d(Q) DRbar
  2  2     0.00000000E+00   # y_s(Q) DRbar
  3  3     2.58812262E-02   # y_b(Q) DRbar
#
BLOCK Ye Q=  9.11876000E+01  # The Yukawa couplings
  1  1     0.00000000E+00   # y_e(Q) DRbar
  2  2     0.00000000E+00   # y_mu(Q) DRbar
  3  3     1.77395481E-02   # y_tau(Q) DRbar
#
BLOCK MSOFT Q=  9.11876000E+01  # The soft SUSY breaking masses at the scale Q
         1     1.40000000E+03   # M_1                 
         2     1.00000000E+05   # M_2                 
         3     1.00000000E+05   # M_3                 
        14     0.00000000E+00   # A_u                 
        15     0.00000000E+00   # A_d                 
        16     0.00000000E+00   # A_e                 
        21     6.29723712E+08   # M^2_Hd              
        22    -1.15081765E+09   # M^2_Hu              
        31     1.00000000E+05   # M_eL                
        32     1.00000000E+05   # M_muL               
        33     1.00000000E+05   # M_tauL              
        34     1.00000000E+05   # M_eR                
        35     1.00000000E+05   # M_muR               
        36     1.00000000E+05   # M_tauR              
        41     2.10000000E+03   # M_q1L               
        42     2.10000000E+03   # M_q2L               
        43     2.10000000E+03   # M_q3L               
        44     1.00000000E+05   # M_uR                
        45     1.00000000E+05   # M_cR                
        46     1.00000000E+05   # M_tR                
        47     2.10000000E+03   # M_dR                
        48     2.10000000E+03   # M_sR                
        49     2.10000000E+03   # M_bR                
#
#
#
#                             =================
#                             |The decay table|
#                             =================
#
# - The QCD corrections to the decays gluino -> squark  + quark
#                                     squark -> gaugino + quark_prime
#                                     squark -> squark_prime + Higgs
#                                     squark -> gluino  + quark
#   are included.
#
# - The multi-body decays for the inos, stops and sbottoms are included.
#
# - The loop induced decays for the gluino, neutralinos and stops
#   are included.
#
# - The SUSY decays of the top quark are included.
#
# - Possible decays of the NLSP in GMSB models are included.
#
#
#         PDG            Width
DECAY         6     1.32355966E+00   # top decays
#          BR         NDA      ID1       ID2
     1.00000000E+00    2           5        24   # BR(t ->  b    W+)
#
#         PDG            Width
DECAY   1000021     1.E-04   # gluino decays (OJ Mods)
#          BR         NDA      ID1       ID2
    -6.98472036E-04    2     1000001        -1   # BR(~g -> ~d_L  db)
    -6.98472036E-04    2    -1000001         1   # BR(~g -> ~d_L* d )
    -6.98472186E-04    2     2000001        -1   # BR(~g -> ~d_R  db)
    -6.98472186E-04    2    -2000001         1   # BR(~g -> ~d_R* d )
    -6.98472371E-04    2     1000002        -2   # BR(~g -> ~u_L  ub)
    -6.98472371E-04    2    -1000002         2   # BR(~g -> ~u_L* u )
    -1.89033575E-18    2     2000002        -2   # BR(~g -> ~u_R  ub)
    -1.89033575E-18    2    -2000002         2   # BR(~g -> ~u_R* u )
    -6.98472036E-04    2     1000003        -3   # BR(~g -> ~s_L  sb)
    -6.98472036E-04    2    -1000003         3   # BR(~g -> ~s_L* s )
    -6.98472186E-04    2     2000003        -3   # BR(~g -> ~s_R  sb)
    -6.98472186E-04    2    -2000003         3   # BR(~g -> ~s_R* s )
    -6.98472371E-04    2     1000004        -4   # BR(~g -> ~c_L  cb)
    -6.98472371E-04    2    -1000004         4   # BR(~g -> ~c_L* c )
    -1.89033575E-18    2     2000004        -4   # BR(~g -> ~c_R  cb)
    -1.89033575E-18    2    -2000004         4   # BR(~g -> ~c_R* c )
     2.57285233E-01    2     1000005        -5   # BR(~g -> ~b_1  bb)
     2.57285233E-01    2    -1000005         5   # BR(~g -> ~b_1* b )
     2.57409580E-01    2     2000005        -5   # BR(~g -> ~b_2  bb)
     2.57409580E-01    2    -2000005         5   # BR(~g -> ~b_2* b )
    -6.87461364E-04    2     1000006        -6   # BR(~g -> ~t_1  tb)
    -6.87461364E-04    2    -1000006         6   # BR(~g -> ~t_1* t )
    -1.96330365E-02    2     1000039        21   # BR(~g -> ~G g)
#
#         PDG            Width
DECAY   1000006     1.06957288E-01   # stop1 decays
#          BR         NDA      ID1       ID2
     1.00000000E+00    2     1000022         6   # BR(~t_1 -> ~chi_10 t )
#
#         PDG            Width
DECAY   2000006    -2.78843373E+05   # stop2 decays
#          BR         NDA      ID1       ID2
    -7.47617206E-04    2     1000022         6   # BR(~t_2 -> ~chi_10 t )
    -1.80070237E-03    2     1000023         6   # BR(~t_2 -> ~chi_20 t )
    -1.80024918E-03    2     1000025         6   # BR(~t_2 -> ~chi_30 t )
     1.00428790E+00    2     1000024         5   # BR(~t_2 -> ~chi_1+ b )
     4.84834060E-05    2     1000006        25   # BR(~t_2 -> ~t_1    h )
    -5.07943837E-05    2     1000006        35   # BR(~t_2 -> ~t_1    H )
    -5.07037261E-05    2     1000006        36   # BR(~t_2 -> ~t_1    A )
    -4.77717803E-05    2     1000005        37   # BR(~t_2 -> ~b_1    H+)
    -5.36339175E-05    2     2000005        37   # BR(~t_2 -> ~b_2    H+)
     3.44300051E-05    2     1000006        23   # BR(~t_2 -> ~t_1    Z )
     8.67765589E-05    2     1000005        24   # BR(~t_2 -> ~b_1    W+)
     9.38816377E-05    2     2000005        24   # BR(~t_2 -> ~b_2    W+)
#
#         PDG            Width
DECAY   1000005    -3.23326865E+01   # sbottom1 decays
#          BR         NDA      ID1       ID2
     1.00000000E+00    2     1000022         5   # BR(~b_1 -> ~chi_10 b )
#
#         PDG            Width
DECAY   2000005    -3.13198950E+01   # sbottom2 decays
#          BR         NDA      ID1       ID2
     1.00000000E+00    2     1000022         5   # BR(~b_2 -> ~chi_10 b )
#
#         PDG            Width
DECAY   1000002     1.10988580E-01   # sup_L decays
#          BR         NDA      ID1       ID2
     1.00000000E+00    2     1000022         2   # BR(~u_L -> ~chi_10 u)
#
#         PDG            Width
DECAY   2000002     2.08402313E+02   # sup_R decays
#          BR         NDA      ID1       ID2
     9.99562654E-01    2     1000022         2   # BR(~u_R -> ~chi_10 u)
     3.19401082E-06    2     1000023         2   # BR(~u_R -> ~chi_20 u)
     4.34151943E-04    2     1000025         2   # BR(~u_R -> ~chi_30 u)
#
#         PDG            Width
DECAY   1000001     1.11145802E-01   # sdown_L decays
#          BR         NDA      ID1       ID2
     1.00000000E+00    2     1000022         1   # BR(~d_L -> ~chi_10 d)
#
#         PDG            Width
DECAY   2000001     4.44294224E-01   # sdown_R decays
#          BR         NDA      ID1       ID2
     1.00000000E+00    2     1000022         1   # BR(~d_R -> ~chi_10 d)
#
#         PDG            Width
DECAY   1000004     1.10988580E-01   # scharm_L decays
#          BR         NDA      ID1       ID2
     1.00000000E+00    2     1000022         4   # BR(~c_L -> ~chi_10 c)
#
#         PDG            Width
DECAY   2000004     2.08402313E+02   # scharm_R decays
#          BR         NDA      ID1       ID2
     9.99562654E-01    2     1000022         4   # BR(~c_R -> ~chi_10 c)
     3.19401082E-06    2     1000023         4   # BR(~c_R -> ~chi_20 c)
     4.34151943E-04    2     1000025         4   # BR(~c_R -> ~chi_30 c)
#
#         PDG            Width
DECAY   1000003     1.11145802E-01   # sstrange_L decays
#          BR         NDA      ID1       ID2
     1.00000000E+00    2     1000022         3   # BR(~s_L -> ~chi_10 s)
#
#         PDG            Width
DECAY   2000003     4.44294224E-01   # sstrange_R decays
#          BR         NDA      ID1       ID2
     1.00000000E+00    2     1000022         3   # BR(~s_R -> ~chi_10 s)
#
#         PDG            Width
DECAY   1000011     1.22192434E+02   # selectron_L decays
#          BR         NDA      ID1       ID2
     9.99500357E-01    2     1000022        11   # BR(~e_L -> ~chi_10 e-)
     2.31771672E-06    2     1000023        11   # BR(~e_L -> ~chi_20 e-)
     4.94674494E-04    2     1000025        11   # BR(~e_L -> ~chi_30 e-)
     2.65110764E-06    2    -1000024        12   # BR(~e_L -> ~chi_1- nu_e)
#
#         PDG            Width
DECAY   2000011     4.88766846E+02   # selectron_R decays
#          BR         NDA      ID1       ID2
     9.99563070E-01    2     1000022        11   # BR(~e_R -> ~chi_10 e-)
     3.19097342E-06    2     1000023        11   # BR(~e_R -> ~chi_20 e-)
     4.33738894E-04    2     1000025        11   # BR(~e_R -> ~chi_30 e-)
#
#         PDG            Width
DECAY   1000013     1.22192434E+02   # smuon_L decays
#          BR         NDA      ID1       ID2
     9.99500357E-01    2     1000022        13   # BR(~mu_L -> ~chi_10 mu-)
     2.31771672E-06    2     1000023        13   # BR(~mu_L -> ~chi_20 mu-)
     4.94674494E-04    2     1000025        13   # BR(~mu_L -> ~chi_30 mu-)
     2.65110764E-06    2    -1000024        14   # BR(~mu_L -> ~chi_1- nu_mu)
#
#         PDG            Width
DECAY   2000013     4.88766846E+02   # smuon_R decays
#          BR         NDA      ID1       ID2
     9.99563070E-01    2     1000022        13   # BR(~mu_R -> ~chi_10 mu-)
     3.19097342E-06    2     1000023        13   # BR(~mu_R -> ~chi_20 mu-)
     4.33738894E-04    2     1000025        13   # BR(~mu_R -> ~chi_30 mu-)
#
#         PDG            Width
DECAY   1000015     1.18198147E+04   # stau_1 decays
#          BR         NDA      ID1       ID2
     2.58835071E-02    2     1000022        15   # BR(~tau_1 -> ~chi_10  tau-)
     2.54245090E-05    2     1000023        15   # BR(~tau_1 -> ~chi_20  tau-)
     2.78045914E-05    2     1000025        15   # BR(~tau_1 -> ~chi_30  tau-)
     2.77013565E-05    2    -1000024        16   # BR(~tau_1 -> ~chi_1-  nu_tau)
     9.74035562E-01    2     1000039        15   # BR(~tau_1 -> ~G       tau-)
#
#         PDG            Width
DECAY   2000015     3.05938017E+02   # stau_2 decays
#          BR         NDA      ID1       ID2
     9.96106127E-01    2     1000022        15   # BR(~tau_2 -> ~chi_10  tau-)
     1.06504540E-03    2     1000023        15   # BR(~tau_2 -> ~chi_20  tau-)
     1.85665422E-03    2     1000025        15   # BR(~tau_2 -> ~chi_30  tau-)
     9.72173778E-04    2    -1000024        16   # BR(~tau_2 -> ~chi_1-  nu_tau)
#
#         PDG            Width
DECAY   1000012     1.22192494E+02   # snu_eL decays
#          BR         NDA      ID1       ID2
     9.99613355E-01    2     1000022        12   # BR(~nu_eL -> ~chi_10 nu_e)
     4.20349673E-06    2     1000023        12   # BR(~nu_eL -> ~chi_20 nu_e)
     3.76802054E-04    2     1000025        12   # BR(~nu_eL -> ~chi_30 nu_e)
     5.63896961E-06    2     1000024        11   # BR(~nu_eL -> ~chi_1+ e-)
#
#         PDG            Width
DECAY   1000014     1.22192494E+02   # snu_muL decays
#          BR         NDA      ID1       ID2
     9.99613355E-01    2     1000022        14   # BR(~nu_muL -> ~chi_10 nu_mu)
     4.20349673E-06    2     1000023        14   # BR(~nu_muL -> ~chi_20 nu_mu)
     3.76802054E-04    2     1000025        14   # BR(~nu_muL -> ~chi_30 nu_mu)
     5.63896961E-06    2     1000024        13   # BR(~nu_muL -> ~chi_1+ mu-)
#
#         PDG            Width
DECAY   1000016     1.22817020E+02   # snu_tauL decays
#          BR         NDA      ID1       ID2
     9.94530312E-01    2     1000022        16   # BR(~nu_tauL -> ~chi_10 nu_tau)
     4.18212191E-06    2     1000023        16   # BR(~nu_tauL -> ~chi_20 nu_tau)
     3.74886012E-04    2     1000025        16   # BR(~nu_tauL -> ~chi_30 nu_tau)
     5.09062017E-03    2     1000024        15   # BR(~nu_tauL -> ~chi_1+ tau-)
#
#         PDG            Width
DECAY   1000024     3.52365938E+01   # chargino1+ decays
#          BR         NDA      ID1       ID2
     5.11402138E-07    2     1000002        -1   # BR(~chi_1+ -> ~u_L     db)
     2.40292156E-07    2    -1000001         2   # BR(~chi_1+ -> ~d_L*    u )
     5.11402138E-07    2     1000004        -3   # BR(~chi_1+ -> ~c_L     sb)
     2.40292156E-07    2    -1000003         4   # BR(~chi_1+ -> ~s_L*    c )
    -1.16916371E-01    2     1000006        -5   # BR(~chi_1+ -> ~t_1     bb)
     1.16241920E-01    2    -1000005         6   # BR(~chi_1+ -> ~b_1*    t )
     9.06932853E-01    2    -2000005         6   # BR(~chi_1+ -> ~b_2*    t )
     9.26392362E-02    2     1000022        24   # BR(~chi_1+ -> ~chi_10  W+)
     1.09061179E-03    2     1000022        37   # BR(~chi_1+ -> ~chi_10  H+)
     8.56205306E-06    2     1000039        24   # BR(~chi_1+ -> ~G       W+)
     1.68468360E-06    2     1000039        37   # BR(~chi_1+ -> ~G       H+)
#
#         PDG            Width
DECAY   1000037    -1.58932928E+05   # chargino2+ decays
#          BR         NDA      ID1       ID2
    -7.44312337E-03    2     1000002        -1   # BR(~chi_2+ -> ~u_L     db)
    -7.44312522E-03    2    -1000001         2   # BR(~chi_2+ -> ~d_L*    u )
    -7.44312337E-03    2     1000004        -3   # BR(~chi_2+ -> ~c_L     sb)
    -7.44312522E-03    2    -1000003         4   # BR(~chi_2+ -> ~s_L*    c )
     1.12677546E+00    2     1000006        -5   # BR(~chi_2+ -> ~t_1     bb)
    -1.64796505E-03    2    -1000005         6   # BR(~chi_2+ -> ~b_1*    t )
    -7.03970096E-03    2    -2000005         6   # BR(~chi_2+ -> ~b_2*    t )
    -5.35089441E-15    2     1000012       -11   # BR(~chi_2+ -> ~nu_eL   e+  )
    -5.35089441E-15    2     1000014       -13   # BR(~chi_2+ -> ~nu_muL  mu+ )
    -3.72624462E-15    2    -1000011        12   # BR(~chi_2+ -> ~e_L+    nu_e)
    -3.72624462E-15    2    -1000013        14   # BR(~chi_2+ -> ~mu_L+   nu_mu)
    -5.86617335E-15    2    -1000015        16   # BR(~chi_2+ -> ~tau_1+  nu_tau)
    -8.76841676E-17    2    -2000015        16   # BR(~chi_2+ -> ~tau_2+  nu_tau)
    -1.36231504E-03    2     1000024        23   # BR(~chi_2+ -> ~chi_1+  Z )
    -4.97246490E-07    2     1000022        24   # BR(~chi_2+ -> ~chi_10  W+)
    -1.32105236E-03    2     1000023        24   # BR(~chi_2+ -> ~chi_20  W+)
    -1.32054105E-03    2     1000025        24   # BR(~chi_2+ -> ~chi_30  W+)
    -1.37748862E-03    2     1000024        25   # BR(~chi_2+ -> ~chi_1+  h )
    -1.20916886E-03    2     1000024        35   # BR(~chi_2+ -> ~chi_1+  H )
    -1.20933244E-03    2     1000024        36   # BR(~chi_2+ -> ~chi_1+  A )
    -5.66425654E-07    2     1000022        37   # BR(~chi_2+ -> ~chi_10  H+)
    -1.20929271E-03    2     1000023        37   # BR(~chi_2+ -> ~chi_20  H+)
    -1.20876118E-03    2     1000025        37   # BR(~chi_2+ -> ~chi_30  H+)
    -7.80962633E-02    2     1000039        24   # BR(~chi_2+ -> ~G       W+)
    -2.23473475E-08    2     1000039        37   # BR(~chi_2+ -> ~G       H+)
#
#         PDG            Width
DECAY   1000022     1.E-08   # neutralino1 decays (OJ Mods)
#          BR         NDA      ID1       ID2
     7.60272027E-01    2     1000039        22   # BR(~chi_10 -> ~G        gam)
     2.39725431E-01    2     1000039        23   # BR(~chi_10 -> ~G        Z)
     2.54256296E-06    2     1000039        25   # BR(~chi_10 -> ~G        h)
#
#         PDG            Width
DECAY   1000023     1.E-08   # neutralino2 decays (OJ Mods)
#          BR         NDA      ID1       ID2
     1.07521391E-01    2     1000022        23   # BR(~chi_20 -> ~chi_10   Z )
     7.78812579E-04    2     1000022        25   # BR(~chi_20 -> ~chi_10   h )
     4.94757043E-04    2     1000022        35   # BR(~chi_20 -> ~chi_10   H )
     1.01464617E-03    2     1000022        36   # BR(~chi_20 -> ~chi_10   A )
     1.32915590E-08    2     1000002        -2   # BR(~chi_20 -> ~u_L      ub)
     1.32915590E-08    2    -1000002         2   # BR(~chi_20 -> ~u_L*     u )
     8.92611746E-08    2     1000001        -1   # BR(~chi_20 -> ~d_L      db)
     8.92611746E-08    2    -1000001         1   # BR(~chi_20 -> ~d_L*     d )
     1.71457550E-07    2     2000001        -1   # BR(~chi_20 -> ~d_R      db)
     1.71457550E-07    2    -2000001         1   # BR(~chi_20 -> ~d_R*     d )
     1.32915590E-08    2     1000004        -4   # BR(~chi_20 -> ~c_L      cb)
     1.32915590E-08    2    -1000004         4   # BR(~chi_20 -> ~c_L*     c )
     8.92611746E-08    2     1000003        -3   # BR(~chi_20 -> ~s_L      sb)
     8.92611746E-08    2    -1000003         3   # BR(~chi_20 -> ~s_L*     s )
     1.71457550E-07    2     2000003        -3   # BR(~chi_20 -> ~s_R      sb)
     1.71457550E-07    2    -2000003         3   # BR(~chi_20 -> ~s_R*     s )
     5.78803654E-01    2     1000006        -6   # BR(~chi_20 -> ~t_1      tb)
     5.78803654E-01    2    -1000006         6   # BR(~chi_20 -> ~t_1*     t )
    -6.49546327E-02    2     1000005        -5   # BR(~chi_20 -> ~b_1      bb)
    -6.49546327E-02    2    -1000005         5   # BR(~chi_20 -> ~b_1*     b )
    -6.87601374E-02    2     2000005        -5   # BR(~chi_20 -> ~b_2      bb)
    -6.87601374E-02    2    -2000005         5   # BR(~chi_20 -> ~b_2*     b )
     4.27787772E-11    2     1000039        22   # BR(~chi_20 -> ~G        gam)
     3.73379807E-07    2     1000039        23   # BR(~chi_20 -> ~G        Z)
     9.31926862E-06    2     1000039        25   # BR(~chi_20 -> ~G        h)
     7.46102602E-08    2     1000039        35   # BR(~chi_20 -> ~G        H)
     1.92517246E-06    2     1000039        36   # BR(~chi_20 -> ~G        A)
#
#         PDG            Width
DECAY   1000025     3.09863131E+01   # neutralino3 decays
#          BR         NDA      ID1       ID2
     7.96586334E-04    2     1000022        23   # BR(~chi_30 -> ~chi_10   Z )
     1.08924246E-01    2     1000022        25   # BR(~chi_30 -> ~chi_10   h )
     9.75540685E-04    2     1000022        35   # BR(~chi_30 -> ~chi_10   H )
     5.32236946E-04    2     1000022        36   # BR(~chi_30 -> ~chi_10   A )
     8.47364547E-06    2     1000002        -2   # BR(~chi_30 -> ~u_L      ub)
     8.47364547E-06    2    -1000002         2   # BR(~chi_30 -> ~u_L*     u )
     3.70450482E-06    2     1000001        -1   # BR(~chi_30 -> ~d_L      db)
     3.70450482E-06    2    -1000001         1   # BR(~chi_30 -> ~d_L*     d )
     2.33816216E-05    2     2000001        -1   # BR(~chi_30 -> ~d_R      db)
     2.33816216E-05    2    -2000001         1   # BR(~chi_30 -> ~d_R*     d )
     8.47364547E-06    2     1000004        -4   # BR(~chi_30 -> ~c_L      cb)
     8.47364547E-06    2    -1000004         4   # BR(~chi_30 -> ~c_L*     c )
     3.70450482E-06    2     1000003        -3   # BR(~chi_30 -> ~s_L      sb)
     3.70450482E-06    2    -1000003         3   # BR(~chi_30 -> ~s_L*     s )
     2.33816216E-05    2     2000003        -3   # BR(~chi_30 -> ~s_R      sb)
     2.33816216E-05    2    -2000003         3   # BR(~chi_30 -> ~s_R*     s )
     5.80851890E-01    2     1000006        -6   # BR(~chi_30 -> ~t_1      tb)
     5.80851890E-01    2    -1000006         6   # BR(~chi_30 -> ~t_1*     t )
    -5.12626308E-02    2     1000005        -5   # BR(~chi_30 -> ~b_1      bb)
    -5.12626308E-02    2    -1000005         5   # BR(~chi_30 -> ~b_1*     b )
    -8.52699311E-02    2     2000005        -5   # BR(~chi_30 -> ~b_2      bb)
    -8.52699311E-02    2    -2000005         5   # BR(~chi_30 -> ~b_2*     b )
     6.71415322E-09    2     1000039        22   # BR(~chi_30 -> ~G        gam)
     9.36559639E-06    2     1000039        23   # BR(~chi_30 -> ~G        Z)
     3.65029117E-07    2     1000039        25   # BR(~chi_30 -> ~G        h)
     1.91993078E-06    2     1000039        35   # BR(~chi_30 -> ~G        H)
     7.73147817E-08    2     1000039        36   # BR(~chi_30 -> ~G        A)
#
#         PDG            Width
DECAY   1000035    -1.58933662E+05   # neutralino4 decays
#          BR         NDA      ID1       ID2
    -5.82121421E-09    2     1000022        23   # BR(~chi_40 -> ~chi_10   Z )
    -1.31653273E-03    2     1000023        23   # BR(~chi_40 -> ~chi_20   Z )
    -4.57707770E-05    2     1000025        23   # BR(~chi_40 -> ~chi_30   Z )
    -1.32103755E-03    2     1000024       -24   # BR(~chi_40 -> ~chi_1+   W-)
    -1.32103755E-03    2    -1000024        24   # BR(~chi_40 -> ~chi_1-   W+)
    -5.13255570E-07    2     1000022        25   # BR(~chi_40 -> ~chi_10   h )
    -4.45502683E-08    2     1000022        35   # BR(~chi_40 -> ~chi_10   H )
    -5.21170522E-07    2     1000022        36   # BR(~chi_40 -> ~chi_10   A )
    -4.52090234E-05    2     1000023        25   # BR(~chi_40 -> ~chi_20   h )
    -1.15719195E-03    2     1000023        35   # BR(~chi_40 -> ~chi_20   H )
    -5.31939978E-05    2     1000023        36   # BR(~chi_40 -> ~chi_20   A )
    -1.33176089E-03    2     1000025        25   # BR(~chi_40 -> ~chi_30   h )
    -5.19248499E-05    2     1000025        35   # BR(~chi_40 -> ~chi_30   H )
    -1.15561122E-03    2     1000025        36   # BR(~chi_40 -> ~chi_30   A )
    -1.20930488E-03    2     1000024       -37   # BR(~chi_40 -> ~chi_1+   H-)
    -1.20930488E-03    2    -1000024        37   # BR(~chi_40 -> ~chi_1-   H+)
    -3.56501762E-03    2     1000002        -2   # BR(~chi_40 -> ~u_L      ub)
    -3.56501762E-03    2    -1000002         2   # BR(~chi_40 -> ~u_L*     u )
    -5.67364468E-23    2     2000002        -2   # BR(~chi_40 -> ~u_R      ub)
    -5.67364468E-23    2    -2000002         2   # BR(~chi_40 -> ~u_R*     u )
    -3.56501875E-03    2     1000001        -1   # BR(~chi_40 -> ~d_L      db)
    -3.56501875E-03    2    -1000001         1   # BR(~chi_40 -> ~d_L*     d )
    -6.93539861E-17    2     2000001        -1   # BR(~chi_40 -> ~d_R      db)
    -6.93539861E-17    2    -2000001         1   # BR(~chi_40 -> ~d_R*     d )
    -3.56501762E-03    2     1000004        -4   # BR(~chi_40 -> ~c_L      cb)
    -3.56501762E-03    2    -1000004         4   # BR(~chi_40 -> ~c_L*     c )
    -5.67364468E-23    2     2000004        -4   # BR(~chi_40 -> ~c_R      cb)
    -5.67364468E-23    2    -2000004         4   # BR(~chi_40 -> ~c_R*     c )
    -3.56501875E-03    2     1000003        -3   # BR(~chi_40 -> ~s_L      sb)
    -3.56501875E-03    2    -1000003         3   # BR(~chi_40 -> ~s_L*     s )
    -6.93539861E-17    2     2000003        -3   # BR(~chi_40 -> ~s_R      sb)
    -6.93539861E-17    2    -2000003         3   # BR(~chi_40 -> ~s_R*     s )
    -4.34380955E-03    2     1000006        -6   # BR(~chi_40 -> ~t_1      tb)
    -4.34380955E-03    2    -1000006         6   # BR(~chi_40 -> ~t_1*     t )
     2.71857197E-01    2     1000005        -5   # BR(~chi_40 -> ~b_1      bb)
     2.71857197E-01    2    -1000005         5   # BR(~chi_40 -> ~b_1*     b )
     2.91530217E-01    2     2000005        -5   # BR(~chi_40 -> ~b_2      bb)
     2.91530217E-01    2    -2000005         5   # BR(~chi_40 -> ~b_2*     b )
    -1.86311180E-15    2     1000011       -11   # BR(~chi_40 -> ~e_L-     e+)
    -1.86311180E-15    2    -1000011        11   # BR(~chi_40 -> ~e_L+     e-)
    -3.26205503E-28    2     2000011       -11   # BR(~chi_40 -> ~e_R-     e+)
    -3.26205503E-28    2    -2000011        11   # BR(~chi_40 -> ~e_R+     e-)
    -1.86311180E-15    2     1000013       -13   # BR(~chi_40 -> ~mu_L-    mu+)
    -1.86311180E-15    2    -1000013        13   # BR(~chi_40 -> ~mu_L+    mu-)
    -3.26205503E-28    2     2000013       -13   # BR(~chi_40 -> ~mu_R-    mu+)
    -3.26205503E-28    2    -2000013        13   # BR(~chi_40 -> ~mu_R+    mu-)
    -2.67543564E-15    2     1000012       -12   # BR(~chi_40 -> ~nu_eL    nu_eb)
    -2.67543564E-15    2    -1000012        12   # BR(~chi_40 -> ~nu_eL*   nu_e )
    -2.67543564E-15    2     1000014       -14   # BR(~chi_40 -> ~nu_muL   nu_mub)
    -2.67543564E-15    2    -1000014        14   # BR(~chi_40 -> ~nu_muL*  nu_mu )
    -2.67543564E-15    2     1000016       -16   # BR(~chi_40 -> ~nu_tau1  nu_taub)
    -2.67543564E-15    2    -1000016        16   # BR(~chi_40 -> ~nu_tau1* nu_tau )
    -1.89520469E-02    2     1000039        22   # BR(~chi_40 -> ~G        gam)
    -5.91438215E-02    2     1000039        23   # BR(~chi_40 -> ~G        Z)
    -3.56456522E-09    2     1000039        25   # BR(~chi_40 -> ~G        h)
    -2.23855209E-08    2     1000039        35   # BR(~chi_40 -> ~G        H)
    -4.41105737E-12    2     1000039        36   # BR(~chi_40 -> ~G        A)
#
#
#
#
