#
#                              ======================
#                              | THE SUSYHIT OUTPUT |
#                              ======================
#
#
#              ------------------------------------------------------
#              |     This is the output of the SUSY-HIT package     |
#              |  created by A.Djouadi, M.Muehlleitner and M.Spira. |
#              |  In case of problems with SUSY-HIT email to        |
#              |           margarete.muehlleitner@kit.edu           |
#              |           michael.spira@psi.ch                     |
#              |           abdelhak.djouadi@cern.ch                 |
#              ------------------------------------------------------
#
#              ------------------------------------------------------
#              |  SUSY Les Houches Accord - MSSM Spectrum + Decays  |
#              |              based on the decay programs           |
#              |                                                    |
#              |                     SDECAY 1.5                     |
#              |                                                    |
#              |  Authors: M.Muhlleitner, A.Djouadi and Y.Mambrini  |
#              |  Ref.:    Comput.Phys.Commun.168(2005)46           |
#              |           [hep-ph/0311167]                         |
#              |                                                    |
#              |                     HDECAY 3.4                     |
#              |                                                    |
#              |  By: A.Djouadi,J.Kalinowski,M.Muhlleitner,M.Spira  |
#              |  Ref.:    Comput.Phys.Commun.108(1998)56           |
#              |           [hep-ph/9704448]                         |
#              |                                                    |
#              |                                                    |
#              |  If not stated otherwise all DRbar couplings and   |
#              |  soft SUSY breaking masses are given at the scale  |
#              |  Q=  0.48442571E+04
#              |                                                    |
#              ------------------------------------------------------
#
#
BLOCK DCINFO  # Decay Program information
     1   SDECAY/HDECAY # decay calculator
     2   1.5  /3.4    # version number
#
BLOCK SPINFO  # Spectrum calculator information
     1   SuSpect     # RGE +Spectrum calculator            
     2   2.41        # version number                      
#
BLOCK MODSEL  # Model selection
     1     3   # #AMSB                                             
#
BLOCK SMINPUTS  # Standard Model inputs
         1     1.27934000E+02   # alpha_em^-1(M_Z)^MSbar
         2     1.16639000E-05   # G_F [GeV^-2]
         3     1.17200000E-01   # alpha_S(M_Z)^MSbar
         4     9.11870000E+01   # M_Z pole mass
         5     4.25000000E+00   # mb(mb)^MSbar
         6     1.73100000E+02   # mt pole mass
         7     1.77710000E+00   # mtau pole mass
#
BLOCK MINPAR  # Input parameters - minimal models
         1     5.00000000E+03   # m0                  
         2     2.50000000E+05   # M_3                 
         3     5.00000000E+00   # tanbeta(mZ)         
         4     1.00000000E+00   # sign(mu)            
         5     1.00000000E+00   # cQ                  
         6     1.00000000E+00   # cuR                 
#
BLOCK EXTPAR  # Input parameters - non-minimal models
         0     4.84425711E+03   # EWSB                
#
BLOCK MASS  # Mass Spectrum
# PDG code           mass       particle
        24     8.04953821E+01   # W+
        25     1.19799411E+02   # h
        35     6.34424105E+03   # H
        36     6.34400560E+03   # A
        37     6.34477789E+03   # H+
         5     4.87877839E+00   # b-quark pole mass calculated from mb(mb)_Msbar
   1000001     1.00000000E+10   # ~d_L
   2000001     1.00000000E+10   # ~d_R 
   1000002     1.00000000E+10   # ~u_L 
   2000002     1.00000000E+10   # ~u_R 
   1000003     1.00000000E+10   # ~s_L 
   2000003     1.00000000E+10   # ~s_R 
   1000004     1.00000000E+10   # ~c_L 
   2000004     1.00000000E+10   # ~c_R 
   1000005     1.00000000E+10   # ~b_1 
   2000005     1.00000000E+10   # ~b_2 
   1000006     1.00000000E+10   # ~t_1 
   2000006     1.00000000E+10   # ~t_2 
   1000011     1.00000000E+10   # ~e_L 
   2000011     1.00000000E+10   # ~e_R 
   1000012     1.00000000E+10   # ~nu_eL 
   1000013     1.00000000E+10   # ~mu_L 
   2000013     1.00000000E+10   # ~mu_R 
   1000014     1.00000000E+10   # ~nu_muL 
   1000015     1.00000000E+10   # ~tau_1 
   2000015     1.00000000E+10   # ~tau_2 
   1000016     1.00000000E+10   # ~nu_tauL 
   1000021     1.00000000E+10   # ~g 
   1000022     8.08233982E+02   # ~chi_10
   1000023     1.00000000E+10   # ~chi_20 
   1000025     1.00000000E+10   # ~chi_30 
   1000035     1.00000000E+10   # ~chi_40 
   1000024     8.08234249E+02   # ~chi_1+
   1000037     1.00000000E+10   # ~chi_2+ 
#
BLOCK NMIX  # Neutralino Mixing Matrix
  1  1     3.67629621E-04   # N_11
  1  2    -9.99736785E-01   # N_12
  1  3     2.12826844E-02   # N_13
  1  4    -8.56000410E-03   # N_14
  2  1     9.99693636E-01   # N_21
  2  2     9.18183659E-04   # N_22
  2  3     2.00207744E-02   # N_23
  2  4    -1.45244308E-02   # N_24
  3  1     3.89347421E-03   # N_31
  3  2    -8.99481661E-03   # N_32
  3  3    -7.07006441E-01   # N_33
  3  4    -7.07139184E-01   # N_34
  4  1     2.44405258E-02   # N_41
  4  2    -2.10858168E-02   # N_42
  4  3    -7.06603218E-01   # N_43
  4  4     7.06873356E-01   # N_44
#
BLOCK UMIX  # Chargino Mixing Matrix U
  1  1    -9.99547294E-01   # U_11
  1  2     3.00866703E-02   # U_12
  2  1     3.00866703E-02   # U_21
  2  2     9.99547294E-01   # U_22
#
BLOCK VMIX  # Chargino Mixing Matrix V
  1  1    -9.99926754E-01   # V_11
  1  2     1.21031359E-02   # V_12
  2  1     1.21031359E-02   # V_21
  2  2     9.99926754E-01   # V_22
#
BLOCK STOPMIX  # Stop Mixing Matrix
  1  1    -3.96754103E-02   # cos(theta_t)
  1  2     9.99212621E-01   # sin(theta_t)
  2  1    -9.99212621E-01   # -sin(theta_t)
  2  2    -3.96754103E-02   # cos(theta_t)
#
BLOCK SBOTMIX  # Sbottom Mixing Matrix
  1  1     9.99998479E-01   # cos(theta_b)
  1  2     1.74413236E-03   # sin(theta_b)
  2  1    -1.74413236E-03   # -sin(theta_b)
  2  2     9.99998479E-01   # cos(theta_b)
#
BLOCK STAUMIX  # Stau Mixing Matrix
  1  1     1.46298681E-01   # cos(theta_tau)
  1  2     9.89240464E-01   # sin(theta_tau)
  2  1    -9.89240464E-01   # -sin(theta_tau)
  2  2     1.46298681E-01   # cos(theta_tau)
#
BLOCK ALPHA  # Higgs mixing
          -2.08735956E-01   # Mixing angle in the neutral Higgs boson sector
#
BLOCK HMIX Q=  4.84425711E+03  # DRbar Higgs Parameters
         1     3.86441121E+03   # mu(Q)               
         2     4.72379202E+00   # tanbeta(Q)          
         3     2.43671107E+02   # vev(Q)              
         4     4.03738715E+07   # MA^2(Q)             
#
BLOCK GAUGE Q=  4.84425711E+03  # The gauge couplings
     1     3.65540711E-01   # gprime(Q) DRbar
     2     6.35002867E-01   # g(Q) DRbar
     3     9.83724661E-01   # g3(Q) DRbar
#
BLOCK AU Q=  4.84425711E+03  # The trilinear couplings
  1  1     8.14680533E+03   # A_u(Q) DRbar
  2  2     8.14680533E+03   # A_c(Q) DRbar
  3  3     3.85253943E+03   # A_t(Q) DRbar
#
BLOCK AD Q=  4.84425711E+03  # The trilinear couplings
  1  1     9.11787221E+03   # A_d(Q) DRbar
  2  2     9.11787221E+03   # A_s(Q) DRbar
  3  3     9.13528187E+03   # A_b(Q) DRbar
#
BLOCK AE Q=  4.84425711E+03  # The trilinear couplings
  1  1     2.50395790E+03   # A_e(Q) DRbar
  2  2     2.50395790E+03   # A_mu(Q) DRbar
  3  3     2.49248888E+03   # A_tau(Q) DRbar
#
BLOCK Yu Q=  4.84425711E+03  # The Yukawa couplings
  1  1     0.00000000E+00   # y_u(Q) DRbar
  2  2     0.00000000E+00   # y_c(Q) DRbar
  3  3     8.25510254E-01   # y_t(Q) DRbar
#
BLOCK Yd Q=  4.84425711E+03  # The Yukawa couplings
  1  1     0.00000000E+00   # y_d(Q) DRbar
  2  2     0.00000000E+00   # y_s(Q) DRbar
  3  3     6.61628222E-02   # y_b(Q) DRbar
#
BLOCK Ye Q=  4.84425711E+03  # The Yukawa couplings
  1  1     0.00000000E+00   # y_e(Q) DRbar
  2  2     0.00000000E+00   # y_mu(Q) DRbar
  3  3     4.90187376E-02   # y_tau(Q) DRbar
#
BLOCK MSOFT Q=  4.84425711E+03  # The soft SUSY breaking masses at the scale Q
         1     2.36582258E+03   # M_1                 
         2     7.57974021E+02   # M_2                 
         3    -4.45130695E+03   # M_3                 
        21     2.34574744E+07   # M^2_Hd              
        22    -1.27808644E+07   # M^2_Hu              
        31     4.88555299E+03   # M_eL                
        32     4.88555299E+03   # M_muL               
        33     4.87964099E+03   # M_tauL              
        34     4.87282857E+03   # M_eR                
        35     4.87282857E+03   # M_muR               
        36     4.86092147E+03   # M_tauR              
        41     6.45057897E+03   # M_q1L               
        42     6.45057897E+03   # M_q2L               
        43     5.46278334E+03   # M_q3L               
        44     6.48085383E+03   # M_uR                
        45     6.48085383E+03   # M_cR                
        46     4.29312731E+03   # M_tR                
        47     6.51295672E+03   # M_dR                
        48     6.51295672E+03   # M_sR                
        49     6.49535295E+03   # M_bR                
#
#
#
#                             =================
#                             |The decay table|
#                             =================
#
# - The QCD corrections to the decays gluino -> squark  + quark
#                                     squark -> gaugino + quark_prime
#                                     squark -> squark_prime + Higgs
#                                     squark -> gluino  + quark
#   are included.
#
# - The multi-body decays for the inos, stops and sbottoms are included.
#
# - The loop induced decays for the gluino, neutralinos and stops
#   are included.
#
# - The SUSY decays of the top quark are included.
#
#
#         PDG            Width
DECAY         6     1.41261110E+00   # top decays
#          BR         NDA      ID1       ID2
     1.00000000E+00    2           5        24   # BR(t ->  b    W+)
#
#         PDG            Width
DECAY   1000021     4.69934496E-02   # gluino decays
#          BR         NDA      ID1       ID2
     3.14059770E-07    2     1000022        21   # BR(~g -> ~chi_10 g)
     4.08506290E-05    2     1000023        21   # BR(~g -> ~chi_20 g)
     1.28027800E-05    2     1000025        21   # BR(~g -> ~chi_30 g)
     1.11620583E-05    2     1000035        21   # BR(~g -> ~chi_40 g)
#           BR         NDA      ID1       ID2       ID3
     3.75008524E-02    3     1000022         1        -1   # BR(~g -> ~chi_10 d  db)
     1.01061209E-03    3     1000023         1        -1   # BR(~g -> ~chi_20 d  db)
     1.03716553E-11    3     1000025         1        -1   # BR(~g -> ~chi_30 d  db)
     2.28857617E-10    3     1000035         1        -1   # BR(~g -> ~chi_40 d  db)
     3.75019259E-02    3     1000022         2        -2   # BR(~g -> ~chi_10 u  ub)
     3.50385682E-03    3     1000023         2        -2   # BR(~g -> ~chi_20 u  ub)
     8.20373291E-12    3     1000025         2        -2   # BR(~g -> ~chi_30 u  ub)
     1.87102455E-10    3     1000035         2        -2   # BR(~g -> ~chi_40 u  ub)
     3.75008524E-02    3     1000022         3        -3   # BR(~g -> ~chi_10 s  sb)
     1.01061209E-03    3     1000023         3        -3   # BR(~g -> ~chi_20 s  sb)
     1.03716553E-11    3     1000025         3        -3   # BR(~g -> ~chi_30 s  sb)
     2.28857617E-10    3     1000035         3        -3   # BR(~g -> ~chi_40 s  sb)
     3.75019259E-02    3     1000022         4        -4   # BR(~g -> ~chi_10 c  cb)
     3.50385682E-03    3     1000023         4        -4   # BR(~g -> ~chi_20 c  cb)
     8.20373291E-12    3     1000025         4        -4   # BR(~g -> ~chi_30 c  cb)
     1.87102455E-10    3     1000035         4        -4   # BR(~g -> ~chi_40 c  cb)
     8.49481275E-02    3     1000022         5        -5   # BR(~g -> ~chi_10 b  bb)
     1.33407758E-03    3     1000023         5        -5   # BR(~g -> ~chi_20 b  bb)
     1.34081665E-08    3     1000025         5        -5   # BR(~g -> ~chi_30 b  bb)
     1.38684396E-08    3     1000035         5        -5   # BR(~g -> ~chi_40 b  bb)
     8.09038900E-02    3     1000022         6        -6   # BR(~g -> ~chi_10 t  tb)
     4.16130931E-02    3     1000023         6        -6   # BR(~g -> ~chi_20 t  tb)
     7.50028077E-02    3     1000024         1        -2   # BR(~g -> ~chi_1+ d  ub)
     7.50028077E-02    3    -1000024         2        -1   # BR(~g -> ~chi_1- u  db)
     2.92952265E-10    3     1000037         1        -2   # BR(~g -> ~chi_2+ d  ub)
     2.92952265E-10    3    -1000037         2        -1   # BR(~g -> ~chi_2- u  db)
     7.50028077E-02    3     1000024         3        -4   # BR(~g -> ~chi_1+ s  cb)
     7.50028077E-02    3    -1000024         4        -3   # BR(~g -> ~chi_1- c  sb)
     2.92952265E-10    3     1000037         3        -4   # BR(~g -> ~chi_2+ s  cb)
     2.92952265E-10    3    -1000037         4        -3   # BR(~g -> ~chi_2- c  sb)
     1.66044909E-01    3     1000024         5        -6   # BR(~g -> ~chi_1+ b  tb)
     1.66044909E-01    3    -1000024         6        -5   # BR(~g -> ~chi_1- t  bb)
     5.50269238E-08    3     1000037         5        -6   # BR(~g -> ~chi_2+ b  tb)
     5.50269238E-08    3    -1000037         6        -5   # BR(~g -> ~chi_2- t  bb)
#
#         PDG            Width
DECAY   1000006     1.85244085E+01   # stop1 decays
#          BR         NDA      ID1       ID2
     2.57422692E-04    2     1000022         6   # BR(~t_1 -> ~chi_10 t )
     2.78543937E-01    2     1000023         6   # BR(~t_1 -> ~chi_20 t )
     8.37947033E-02    2     1000025         6   # BR(~t_1 -> ~chi_30 t )
     8.70264620E-02    2     1000035         6   # BR(~t_1 -> ~chi_40 t )
     5.16383384E-04    2     1000024         5   # BR(~t_1 -> ~chi_1+ b )
     1.78319724E-01    2     1000037         5   # BR(~t_1 -> ~chi_2+ b )
     3.71541367E-01    2     1000021         6   # BR(~t_1 -> ~g      t )
#
#         PDG            Width
DECAY   2000006     1.74469910E+02   # stop2 decays
#          BR         NDA      ID1       ID2
     1.18020279E-01    2     1000022         6   # BR(~t_2 -> ~chi_10 t )
     3.36771174E-03    2     1000023         6   # BR(~t_2 -> ~chi_20 t )
     5.83792891E-02    2     1000025         6   # BR(~t_2 -> ~chi_30 t )
     5.75511057E-02    2     1000035         6   # BR(~t_2 -> ~chi_40 t )
     2.36496835E-01    2     1000024         5   # BR(~t_2 -> ~chi_1+ b )
     8.04606687E-04    2     1000037         5   # BR(~t_2 -> ~chi_2+ b )
     4.71977679E-01    2     1000021         6   # BR(~t_2 -> ~g      t )
     1.69974161E-02    2     1000006        25   # BR(~t_2 -> ~t_1    h )
     3.64050789E-02    2     1000006        23   # BR(~t_2 -> ~t_1    Z )
#
#         PDG            Width
DECAY   1000005     1.77859427E+02   # sbottom1 decays
#          BR         NDA      ID1       ID2
     1.15727689E-01    2     1000022         5   # BR(~b_1 -> ~chi_10 b )
     2.99012120E-03    2     1000023         5   # BR(~b_1 -> ~chi_20 b )
     3.58129707E-04    2     1000025         5   # BR(~b_1 -> ~chi_30 b )
     3.75933385E-04    2     1000035         5   # BR(~b_1 -> ~chi_40 b )
     2.31007320E-01    2    -1000024         6   # BR(~b_1 -> ~chi_1- t )
     1.12984266E-01    2    -1000037         6   # BR(~b_1 -> ~chi_2- t )
     4.58022658E-01    2     1000021         5   # BR(~b_1 -> ~g      b )
     7.85338817E-02    2     1000006       -24   # BR(~b_1 -> ~t_1    W-)
#
#         PDG            Width
DECAY   2000005     1.65274110E+02   # sbottom2 decays
#          BR         NDA      ID1       ID2
     2.64142601E-07    2     1000022         5   # BR(~b_2 -> ~chi_10 b )
     1.73169801E-02    2     1000023         5   # BR(~b_2 -> ~chi_20 b )
     7.30639010E-04    2     1000025         5   # BR(~b_2 -> ~chi_30 b )
     7.35536210E-04    2     1000035         5   # BR(~b_2 -> ~chi_40 b )
     5.22044718E-07    2    -1000024         6   # BR(~b_2 -> ~chi_1- t )
     1.46013478E-03    2    -1000037         6   # BR(~b_2 -> ~chi_2- t )
     9.79565472E-01    2     1000021         5   # BR(~b_2 -> ~g      b )
     4.18076503E-05    2     1000005        25   # BR(~b_2 -> ~b_1    h )
     5.30511847E-05    2     1000005        23   # BR(~b_2 -> ~b_1    Z )
     1.18482375E-06    2     1000006       -24   # BR(~b_2 -> ~t_1    W-)
     9.44077107E-05    2     2000006       -24   # BR(~b_2 -> ~t_2    W-)
#
#         PDG            Width
DECAY   1000002     2.32517446E+02   # sup_L decays
#          BR         NDA      ID1       ID2
     1.05423106E-01    2     1000022         2   # BR(~u_L -> ~chi_10 u)
     3.07335112E-03    2     1000023         2   # BR(~u_L -> ~chi_20 u)
     3.14066019E-06    2     1000025         2   # BR(~u_L -> ~chi_30 u)
     1.23993424E-05    2     1000035         2   # BR(~u_L -> ~chi_40 u)
     2.10956115E-01    2     1000024         1   # BR(~u_L -> ~chi_1+ d)
     1.35167722E-05    2     1000037         1   # BR(~u_L -> ~chi_2+ d)
     6.80518371E-01    2     1000021         2   # BR(~u_L -> ~g      u)
#
#         PDG            Width
DECAY   2000002     1.72196318E+02   # sup_R decays
#          BR         NDA      ID1       ID2
     1.13977362E-08    2     1000022         2   # BR(~u_R -> ~chi_10 u)
     6.62504167E-02    2     1000023         2   # BR(~u_R -> ~chi_20 u)
     5.64763276E-07    2     1000025         2   # BR(~u_R -> ~chi_30 u)
     2.22323319E-05    2     1000035         2   # BR(~u_R -> ~chi_40 u)
     9.33726775E-01    2     1000021         2   # BR(~u_R -> ~g      u)
#
#         PDG            Width
DECAY   1000001     2.32535174E+02   # sdown_L decays
#          BR         NDA      ID1       ID2
     1.05452108E-01    2     1000022         1   # BR(~d_L -> ~chi_10 d)
     3.01514619E-03    2     1000023         1   # BR(~d_L -> ~chi_20 d)
     4.38223456E-06    2     1000025         1   # BR(~d_L -> ~chi_30 d)
     3.06471227E-05    2     1000035         1   # BR(~d_L -> ~chi_40 d)
     2.10794521E-01    2    -1000024         2   # BR(~d_L -> ~chi_1- u)
     8.35371553E-05    2    -1000037         2   # BR(~d_L -> ~chi_2- u)
     6.80619658E-01    2     1000021         1   # BR(~d_L -> ~g      d)
#
#         PDG            Width
DECAY   2000001     1.66371686E+02   # sdown_R decays
#          BR         NDA      ID1       ID2
     2.96460113E-09    2     1000022         1   # BR(~d_R -> ~chi_10 d)
     1.72748003E-02    2     1000023         1   # BR(~d_R -> ~chi_20 d)
     1.48337618E-07    2     1000025         1   # BR(~d_R -> ~chi_30 d)
     5.83950568E-06    2     1000035         1   # BR(~d_R -> ~chi_40 d)
     9.82719209E-01    2     1000021         1   # BR(~d_R -> ~g      d)
#
#         PDG            Width
DECAY   1000004     2.32517446E+02   # scharm_L decays
#          BR         NDA      ID1       ID2
     1.05423106E-01    2     1000022         4   # BR(~c_L -> ~chi_10 c)
     3.07335112E-03    2     1000023         4   # BR(~c_L -> ~chi_20 c)
     3.14066019E-06    2     1000025         4   # BR(~c_L -> ~chi_30 c)
     1.23993424E-05    2     1000035         4   # BR(~c_L -> ~chi_40 c)
     2.10956115E-01    2     1000024         3   # BR(~c_L -> ~chi_1+ s)
     1.35167722E-05    2     1000037         3   # BR(~c_L -> ~chi_2+ s)
     6.80518371E-01    2     1000021         4   # BR(~c_L -> ~g      c)
#
#         PDG            Width
DECAY   2000004     1.72196318E+02   # scharm_R decays
#          BR         NDA      ID1       ID2
     1.13977362E-08    2     1000022         4   # BR(~c_R -> ~chi_10 c)
     6.62504167E-02    2     1000023         4   # BR(~c_R -> ~chi_20 c)
     5.64763276E-07    2     1000025         4   # BR(~c_R -> ~chi_30 c)
     2.22323319E-05    2     1000035         4   # BR(~c_R -> ~chi_40 c)
     9.33726775E-01    2     1000021         4   # BR(~c_R -> ~g      c)
#
#         PDG            Width
DECAY   1000003     2.32535174E+02   # sstrange_L decays
#          BR         NDA      ID1       ID2
     1.05452108E-01    2     1000022         3   # BR(~s_L -> ~chi_10 s)
     3.01514619E-03    2     1000023         3   # BR(~s_L -> ~chi_20 s)
     4.38223456E-06    2     1000025         3   # BR(~s_L -> ~chi_30 s)
     3.06471227E-05    2     1000035         3   # BR(~s_L -> ~chi_40 s)
     2.10794521E-01    2    -1000024         4   # BR(~s_L -> ~chi_1- c)
     8.35371553E-05    2    -1000037         4   # BR(~s_L -> ~chi_2- c)
     6.80619658E-01    2     1000021         3   # BR(~s_L -> ~g      s)
#
#         PDG            Width
DECAY   2000003     1.66371686E+02   # sstrange_R decays
#          BR         NDA      ID1       ID2
     2.96460113E-09    2     1000022         3   # BR(~s_R -> ~chi_10 s)
     1.72748003E-02    2     1000023         3   # BR(~s_R -> ~chi_20 s)
     1.48337618E-07    2     1000025         3   # BR(~s_R -> ~chi_30 s)
     5.83950568E-06    2     1000035         3   # BR(~s_R -> ~chi_40 s)
     9.82719209E-01    2     1000021         3   # BR(~s_R -> ~g      s)
#
#         PDG            Width
DECAY   1000011     5.94051468E+01   # selectron_L decays
#          BR         NDA      ID1       ID2
     3.11776982E-01    2     1000022        11   # BR(~e_L -> ~chi_10 e-)
     6.45561738E-02    2     1000023        11   # BR(~e_L -> ~chi_20 e-)
     2.04615258E-06    2     1000025        11   # BR(~e_L -> ~chi_30 e-)
     2.20161526E-06    2     1000035        11   # BR(~e_L -> ~chi_40 e-)
     6.23581560E-01    2    -1000024        12   # BR(~e_L -> ~chi_1- nu_e)
     8.10360264E-05    2    -1000037        12   # BR(~e_L -> ~chi_2- nu_e)
#
#         PDG            Width
DECAY   2000011     1.52050426E+01   # selectron_R decays
#          BR         NDA      ID1       ID2
     2.17787860E-07    2     1000022        11   # BR(~e_R -> ~chi_10 e-)
     9.99860824E-01    2     1000023        11   # BR(~e_R -> ~chi_20 e-)
     3.45004316E-06    2     1000025        11   # BR(~e_R -> ~chi_30 e-)
     1.35508205E-04    2     1000035        11   # BR(~e_R -> ~chi_40 e-)
#
#         PDG            Width
DECAY   1000013     5.94051468E+01   # smuon_L decays
#          BR         NDA      ID1       ID2
     3.11776982E-01    2     1000022        13   # BR(~mu_L -> ~chi_10 mu-)
     6.45561738E-02    2     1000023        13   # BR(~mu_L -> ~chi_20 mu-)
     2.04615258E-06    2     1000025        13   # BR(~mu_L -> ~chi_30 mu-)
     2.20161526E-06    2     1000035        13   # BR(~mu_L -> ~chi_40 mu-)
     6.23581560E-01    2    -1000024        14   # BR(~mu_L -> ~chi_1- nu_mu)
     8.10360264E-05    2    -1000037        14   # BR(~mu_L -> ~chi_2- nu_mu)
#
#         PDG            Width
DECAY   2000013     1.52050426E+01   # smuon_R decays
#          BR         NDA      ID1       ID2
     2.17787860E-07    2     1000022        13   # BR(~mu_R -> ~chi_10 mu-)
     9.99860824E-01    2     1000023        13   # BR(~mu_R -> ~chi_20 mu-)
     3.45004316E-06    2     1000025        13   # BR(~mu_R -> ~chi_30 mu-)
     1.35508205E-04    2     1000035        13   # BR(~mu_R -> ~chi_40 mu-)
#
#         PDG            Width
DECAY   1000015     1.61564848E+01   # stau_1 decays
#          BR         NDA      ID1       ID2
     2.51694558E-02    2     1000022        15   # BR(~tau_1 -> ~chi_10  tau-)
     9.21011075E-01    2     1000023        15   # BR(~tau_1 -> ~chi_20  tau-)
     9.07121275E-04    2     1000025        15   # BR(~tau_1 -> ~chi_30  tau-)
     9.38381252E-04    2     1000035        15   # BR(~tau_1 -> ~chi_40  tau-)
     5.03392701E-02    2    -1000024        16   # BR(~tau_1 -> ~chi_1-  nu_tau)
     1.63469679E-03    2    -1000037        16   # BR(~tau_1 -> ~chi_2-  nu_tau)
#
#         PDG            Width
DECAY   2000015     5.83787558E+01   # stau_2 decays
#          BR         NDA      ID1       ID2
     3.09867892E-01    2     1000022        15   # BR(~tau_2 -> ~chi_10  tau-)
     6.96295213E-02    2     1000023        15   # BR(~tau_2 -> ~chi_20  tau-)
     2.82756519E-04    2     1000025        15   # BR(~tau_2 -> ~chi_30  tau-)
     3.06935956E-04    2     1000035        15   # BR(~tau_2 -> ~chi_40  tau-)
     6.19760733E-01    2    -1000024        16   # BR(~tau_2 -> ~chi_1-  nu_tau)
     1.52160736E-04    2    -1000037        16   # BR(~tau_2 -> ~chi_2-  nu_tau)
#
#         PDG            Width
DECAY   1000012     5.94158414E+01   # snu_eL decays
#          BR         NDA      ID1       ID2
     3.11945135E-01    2     1000022        12   # BR(~nu_eL -> ~chi_10 nu_e)
     6.41176775E-02    2     1000023        12   # BR(~nu_eL -> ~chi_20 nu_e)
     5.65768625E-06    2     1000025        12   # BR(~nu_eL -> ~chi_30 nu_e)
     5.52073086E-05    2     1000035        12   # BR(~nu_eL -> ~chi_40 nu_e)
     6.23863222E-01    2     1000024        11   # BR(~nu_eL -> ~chi_1+ e-)
     1.30995445E-05    2     1000037        11   # BR(~nu_eL -> ~chi_2+ e-)
#
#         PDG            Width
DECAY   1000014     5.94158414E+01   # snu_muL decays
#          BR         NDA      ID1       ID2
     3.11945135E-01    2     1000022        14   # BR(~nu_muL -> ~chi_10 nu_mu)
     6.41176775E-02    2     1000023        14   # BR(~nu_muL -> ~chi_20 nu_mu)
     5.65768625E-06    2     1000025        14   # BR(~nu_muL -> ~chi_30 nu_mu)
     5.52073086E-05    2     1000035        14   # BR(~nu_muL -> ~chi_40 nu_mu)
     6.23863222E-01    2     1000024        13   # BR(~nu_muL -> ~chi_1+ mu-)
     1.30995445E-05    2     1000037        13   # BR(~nu_muL -> ~chi_2+ mu-)
#
#         PDG            Width
DECAY   1000016     5.93622410E+01   # snu_tauL decays
#          BR         NDA      ID1       ID2
     3.11806357E-01    2     1000022        16   # BR(~nu_tauL -> ~chi_10 nu_tau)
     6.40037282E-02    2     1000023        16   # BR(~nu_tauL -> ~chi_20 nu_tau)
     5.60905627E-06    2     1000025        16   # BR(~nu_tauL -> ~chi_30 nu_tau)
     5.47316254E-05    2     1000035        16   # BR(~nu_tauL -> ~chi_40 nu_tau)
     6.23588508E-01    2     1000024        15   # BR(~nu_tauL -> ~chi_1+ tau-)
     5.41065740E-04    2     1000037        15   # BR(~nu_tauL -> ~chi_2+ tau-)
#
#         PDG            Width
DECAY   1000024     0.00000000E+00   # stable chargino_1
#           BR         NDA      ID1       ID2       ID3
     3.74988221E-01    3     1000022         2        -1   # BR(~chi_1+ -> ~chi_10 u    db)
     3.74988221E-01    3     1000022         4        -3   # BR(~chi_1+ -> ~chi_10 c    sb)
     1.25011779E-01    3     1000022       -11        12   # BR(~chi_1+ -> ~chi_10 e+   nu_e)
     1.25011779E-01    3     1000022       -13        14   # BR(~chi_1+ -> ~chi_10 mu+  nu_mu)
#
#         PDG            Width
DECAY   1000037     2.87692206E+01   # chargino2+ decays
#          BR         NDA      ID1       ID2
     3.00471024E-01    2     1000024        23   # BR(~chi_2+ -> ~chi_1+  Z )
     2.89601192E-01    2     1000022        24   # BR(~chi_2+ -> ~chi_10  W+)
     9.71201028E-02    2     1000023        24   # BR(~chi_2+ -> ~chi_20  W+)
     3.12807682E-01    2     1000024        25   # BR(~chi_2+ -> ~chi_1+  h )
#
#         PDG            Width
DECAY   1000022     0.00000000E+00   # stable neutralino 
#
#         PDG            Width
DECAY   1000023     1.48748255E-02   # neutralino2 decays
#          BR         NDA      ID1       ID2
     1.77244469E-02    2     1000022        23   # BR(~chi_20 -> ~chi_10   Z )
     3.25019650E-01    2     1000024       -24   # BR(~chi_20 -> ~chi_1+   W-)
     3.25019650E-01    2    -1000024        24   # BR(~chi_20 -> ~chi_1-   W+)
     3.32236254E-01    2     1000022        25   # BR(~chi_20 -> ~chi_10   h )
#
#         PDG            Width
DECAY   1000025     2.82496722E+01   # neutralino3 decays
#          BR         NDA      ID1       ID2
     2.58945208E-01    2     1000022        23   # BR(~chi_30 -> ~chi_10   Z )
     9.94572667E-02    2     1000023        23   # BR(~chi_30 -> ~chi_20   Z )
     2.94973009E-01    2     1000024       -24   # BR(~chi_30 -> ~chi_1+   W-)
     2.94973009E-01    2    -1000024        24   # BR(~chi_30 -> ~chi_1-   W+)
     4.90330859E-02    2     1000022        25   # BR(~chi_30 -> ~chi_10   h )
     2.61842184E-03    2     1000023        25   # BR(~chi_30 -> ~chi_20   h )
#
#         PDG            Width
DECAY   1000035     2.86079594E+01   # neutralino4 decays
#          BR         NDA      ID1       ID2
     4.65333921E-02    2     1000022        23   # BR(~chi_40 -> ~chi_10   Z )
     2.51054221E-03    2     1000023        23   # BR(~chi_40 -> ~chi_20   Z )
     2.91254416E-01    2     1000024       -24   # BR(~chi_40 -> ~chi_1+   W-)
     2.91254416E-01    2    -1000024        24   # BR(~chi_40 -> ~chi_1-   W+)
     2.66148693E-01    2     1000022        25   # BR(~chi_40 -> ~chi_10   h )
     1.02298541E-01    2     1000023        25   # BR(~chi_40 -> ~chi_20   h )
#
#         PDG            Width
DECAY        25     3.54381310E-03   # h decays
#          BR         NDA      ID1       ID2
     6.90263174E-01    2           5        -5   # BR(h -> b       bb     )
     7.00569869E-02    2         -15        15   # BR(h -> tau+    tau-   )
     2.47974661E-04    2         -13        13   # BR(h -> mu+     mu-    )
     5.29923521E-04    2           3        -3   # BR(h -> s       sb     )
     2.30511208E-02    2           4        -4   # BR(h -> c       cb     )
     6.83836872E-02    2          21        21   # BR(h -> g       g      )
     2.23178605E-03    2          22        22   # BR(h -> gam     gam    )
     1.07376316E-03    2          22        23   # BR(h -> Z       gam    )
     1.29270741E-01    2          24       -24   # BR(h -> W+      W-     )
     1.48908423E-02    2          23        23   # BR(h -> Z       Z      )
#
#         PDG            Width
DECAY        35     4.53027377E+01   # H decays
#          BR         NDA      ID1       ID2
     3.18334575E-02    2           5        -5   # BR(H -> b       bb     )
     6.47674596E-03    2         -15        15   # BR(H -> tau+    tau-   )
     2.28950345E-05    2         -13        13   # BR(H -> mu+     mu-    )
     2.54988838E-05    2           3        -3   # BR(H -> s       sb     )
     2.29779271E-06    2           4        -4   # BR(H -> c       cb     )
     2.33120744E-01    2           6        -6   # BR(H -> t       tb     )
     5.32196680E-05    2          21        21   # BR(H -> g       g      )
     2.60296550E-07    2          22        22   # BR(H -> gam     gam    )
     1.03914114E-07    2          23        22   # BR(H -> Z       gam    )
     2.73007618E-05    2          24       -24   # BR(H -> W+      W-     )
     1.36466463E-05    2          23        23   # BR(H -> Z       Z      )
     8.80724402E-05    2          25        25   # BR(H -> h       h      )
    -3.17663756E-24    2          36        36   # BR(H -> A       A      )
     1.74712435E-17    2          23        36   # BR(H -> Z       A      )
     7.80756575E-04    2     1000024  -1000024   # BR(H -> ~chi_1+ ~chi_1-)
     2.35662676E-01    2     1000024  -1000037   # BR(H -> ~chi_1+ ~chi_2-)
     2.35662676E-01    2     1000037  -1000024   # BR(H -> ~chi_2+ ~chi_1-)
     3.90668759E-04    2     1000022   1000022   # BR(H -> ~chi_10 ~chi_10)
     2.77275721E-05    2     1000023   1000023   # BR(H -> ~chi_20 ~chi_20)
     2.67948280E-04    2     1000022   1000023   # BR(H -> ~chi_10 ~chi_20)
     1.88529982E-01    2     1000022   1000025   # BR(H -> ~chi_10 ~chi_30)
     4.70323742E-02    2     1000022   1000035   # BR(H -> ~chi_10 ~chi_40)
     1.96948626E-02    2     1000023   1000025   # BR(H -> ~chi_20 ~chi_30)
     2.86084116E-04    2     1000023   1000035   # BR(H -> ~chi_20 ~chi_40)
#
#         PDG            Width
DECAY        36     4.52950501E+01   # A decays
#          BR         NDA      ID1       ID2
     3.18827172E-02    2           5        -5   # BR(A -> b       bb     )
     6.47794030E-03    2         -15        15   # BR(A -> tau+    tau-   )
     2.28992493E-05    2         -13        13   # BR(A -> mu+     mu-    )
     2.55781533E-05    2           3        -3   # BR(A -> s       sb     )
     2.31681739E-06    2           4        -4   # BR(A -> c       cb     )
     2.33295435E-01    2           6        -6   # BR(A -> t       tb     )
     7.27841226E-05    2          21        21   # BR(A -> g       g      )
     1.38568573E-07    2          22        22   # BR(A -> gam     gam    )
     1.29322114E-07    2          23        22   # BR(A -> Z       gam    )
     2.72825784E-05    2          23        25   # BR(A -> Z       h      )
     1.17498890E-03    2     1000024  -1000024   # BR(A -> ~chi_1+ ~chi_1-)
     2.35454327E-01    2     1000024  -1000037   # BR(A -> ~chi_1+ ~chi_2-)
     2.35454327E-01    2     1000037  -1000024   # BR(A -> ~chi_2+ ~chi_1-)
     5.87972738E-04    2     1000022   1000022   # BR(A -> ~chi_10 ~chi_10)
     1.14895342E-04    2     1000023   1000023   # BR(A -> ~chi_20 ~chi_20)
     5.63513802E-04    2     1000022   1000023   # BR(A -> ~chi_10 ~chi_20)
     4.72515134E-02    2     1000022   1000025   # BR(A -> ~chi_10 ~chi_30)
     1.87867459E-01    2     1000022   1000035   # BR(A -> ~chi_10 ~chi_40)
     2.93675729E-04    2     1000023   1000025   # BR(A -> ~chi_20 ~chi_30)
     1.94301058E-02    2     1000023   1000035   # BR(A -> ~chi_20 ~chi_40)
#
#         PDG            Width
DECAY        37     4.51065354E+01   # H+ decays
#          BR         NDA      ID1       ID2
     5.00898708E-05    2           4        -5   # BR(H+ -> c       bb     )
     6.50580558E-03    2         -15        16   # BR(H+ -> tau+    nu_tau )
     2.29977519E-05    2         -13        14   # BR(H+ -> mu+     nu_mu  )
     3.20552213E-07    2           2        -5   # BR(H+ -> u       bb     )
     1.22958690E-06    2           2        -3   # BR(H+ -> u       sb     )
     2.75233037E-05    2           4        -3   # BR(H+ -> c       sb     )
     2.62259261E-01    2           6        -5   # BR(H+ -> t       bb     )
     2.74103729E-05    2          24        25   # BR(H+ -> W+      h      )
     8.01637491E-15    2          24        36   # BR(H+ -> W+      A      )
     7.61155167E-11    2     1000024   1000022   # BR(H+ -> ~chi_1+ ~chi_10)
     8.36631946E-04    2     1000024   1000023   # BR(H+ -> ~chi_1+ ~chi_20)
     2.36906178E-01    2     1000024   1000025   # BR(H+ -> ~chi_1+ ~chi_30)
     2.36401673E-01    2     1000024   1000035   # BR(H+ -> ~chi_1+ ~chi_40)
     2.36872952E-01    2     1000037   1000022   # BR(H+ -> ~chi_2+ ~chi_10)
     2.00879273E-02    2     1000037   1000023   # BR(H+ -> ~chi_2+ ~chi_20)
