#
#                              ======================
#                              | THE SUSYHIT OUTPUT |
#                              ======================
#
#
#              ------------------------------------------------------
#              |     This is the output of the SUSY-HIT package     |
#              |  created by A.Djouadi, M.Muehlleitner and M.Spira. |
#              |  In case of problems with SUSY-HIT email to        |
#              |           margarete.muehlleitner@cern.ch           |
#              |           michael.spira@psi.ch                     |
#              |           abdelhak.djouadi@cern.ch                 |
#              ------------------------------------------------------
#
#              ------------------------------------------------------
#              |  SUSY Les Houches Accord - MSSM Spectrum + Decays  |
#              |              based on the decay programs           |
#              |                                                    |
#              |                     SDECAY 1.3b                    |
#              |                                                    |
#              |  Authors: M.Muhlleitner, A.Djouadi and Y.Mambrini  |
#              |  Ref.:    Comput.Phys.Commun.168(2005)46           |
#              |           [hep-ph/0311167]                         |
#              |                                                    |
#              |                     HDECAY 3.4                     |
#              |                                                    |
#              |  By: A.Djouadi,J.Kalinowski,M.Muhlleitner,M.Spira  |
#              |  Ref.:    Comput.Phys.Commun.108(1998)56           |
#              |           [hep-ph/9704448]                         |
#              |                                                    |
#              |                                                    |
#              |  If not stated otherwise all DRbar couplings and   |
#              |  soft SUSY breaking masses are given at the scale  |
#              |  Q=  0.50007632E+04
#              |                                                    |
#              ------------------------------------------------------
#
#
BLOCK DCINFO  # Decay Program information
     1   SDECAY/HDECAY # decay calculator
     2   1.3b  /3.4    # version number
#
BLOCK SPINFO  # Spectrum calculator information
     1    SOFTSUSY    # spectrum calculator                
     2    3.4.0       # version number                     
#
BLOCK MODSEL  # Model selection
     1     0   #  nonUniversal                                     
#
BLOCK SMINPUTS  # Standard Model inputs
         1     1.25778332E+02   # alpha_em^-1(M_Z)^MSbar
         2     1.16570000E-05   # G_F [GeV^-2]
         3     1.17200002E-01   # alpha_S(M_Z)^MSbar
         4     9.11876000E+01   # M_Z pole mass
         5     4.25000000E+00   # mb(mb)^MSbar
         6     1.72500000E+02   # mt pole mass
         7     1.77682000E+00   # mtau pole mass
#
BLOCK MINPAR  # Input parameters - minimal models
         3     1.00000000E+01   # tanb                
#
BLOCK EXTPAR  # Input parameters - non-minimal models
         0    -1.00000000E+00   # Set                 
         1     6.00000000E+01   # M_1(MX)             
         2     3.00000000E+03   # M_2(MX)             
         3     1.21156000E+03   # M_3(MX)             
        11     5.00000000E+03   # At(MX)              
        12     5.00000000E+03   # Ab(MX)              
        13     0.00000000E+00   # Atau(MX)            
        23    -2.82838000E+02   # mu(MX)              
        26     3.00000000E+03   # mA(pole)            
        31     5.00000000E+03   # meL(MX)             
        32     5.00000000E+03   # mmuL(MX)            
        33     5.00000000E+03   # mtauL(MX)           
        34     5.00000000E+03   # meR(MX)             
        35     5.00000000E+03   # mmuR(MX)            
        36     5.00000000E+03   # mtauR(MX)           
        41     5.00000000E+03   # mqL1(MX)            
        42     5.00000000E+03   # mqL2(MX)            
        43     5.00000000E+03   # mqL3(MX)            
        44     5.00000000E+03   # muR(MX)             
        45     5.00000000E+03   # mcR(MX)             
        46     5.00000000E+03   # mtR(MX)             
        47     5.00000000E+03   # mdR(MX)             
        48     5.00000000E+03   # msR(MX)             
        49     5.00000000E+03   # mbR(MX)             
#
BLOCK MASS  # Mass Spectrum
# PDG code           mass       particle
        24     8.00905775E+01   # W+
        25     1.24598882E+02   # h
        35     3.00008874E+03   # H
        36     2.99999970E+03   # A
        37     3.00146925E+03   # H+
         5     4.87878001E+00   # b-quark pole mass calculated from mb(mb)_Msbar
   1000001     5.06676470E+03   # ~d_L
   2000001     5.04886985E+03   # ~d_R
   1000002     5.06628767E+03   # ~u_L
   2000002     5.04856217E+03   # ~u_R
   1000003     5.06676470E+03   # ~s_L
   2000003     5.04886985E+03   # ~s_R
   1000004     5.06628767E+03   # ~c_L
   2000004     5.04856217E+03   # ~c_R
   1000005     5.01296171E+03   # ~b_1
   2000005     5.04702132E+03   # ~b_2
   1000006     4.90362375E+03   # ~t_1
   2000006     5.05713739E+03   # ~t_2
   1000011     5.01914069E+03   # ~e_L
   2000011     5.00595438E+03   # ~e_R
   1000012     5.01818885E+03   # ~nu_eL
   1000013     5.01914069E+03   # ~mu_L
   2000013     5.00595438E+03   # ~mu_R
   1000014     5.01818885E+03   # ~nu_muL
   1000015     5.00481649E+03   # ~tau_1
   2000015     5.01862204E+03   # ~tau_2
   1000016     5.01763494E+03   # ~nu_tauL
   1000021     1.50000022E+03   # ~g
   1000022     5.97916825E+01   # ~chi_10
   1000023     3.01967101E+02   # ~chi_20
   1000025    -3.03837912E+02   # ~chi_30
   1000035     3.07423625E+03   # ~chi_40
   1000024     3.00000989E+02   # ~chi_1+
   1000037     3.07440423E+03   # ~chi_2+
#
BLOCK NMIX  # Neutralino Mixing Matrix
  1  1     9.88605623E-01   # N_11
  1  2     6.00594004E-05   # N_12
  1  3    -1.49806881E-01   # N_13
  1  4    -1.47247068E-02   # N_14
  2  1     1.16371617E-01   # N_21
  2  2     1.76971577E-02   # N_22
  2  3     6.98595904E-01   # N_23
  2  4     7.05767824E-01   # N_24
  3  1    -9.54798981E-02   # N_31
  3  2     1.80290209E-02   # N_32
  3  3    -6.99658198E-01   # N_33
  3  4     7.07839635E-01   # N_34
  4  1    -3.97539719E-04   # N_41
  4  2     9.99680830E-01   # N_42
  4  3     2.60070735E-04   # N_43
  4  4    -2.52589176E-02   # N_44
#
BLOCK UMIX  # Chargino Mixing Matrix U
  1  1    -3.65247654E-04   # U_11
  1  2     9.99999933E-01   # U_12
  2  1    -9.99999933E-01   # U_21
  2  2    -3.65247654E-04   # U_22
#
BLOCK VMIX  # Chargino Mixing Matrix V
  1  1     3.57305681E-02   # V_11
  1  2    -9.99361459E-01   # V_12
  2  1    -9.99361459E-01   # V_21
  2  2    -3.57305681E-02   # V_22
#
BLOCK STOPMIX  # Stop Mixing Matrix
  1  1    -5.04697304E-01   # cos(theta_t)
  1  2     8.63296375E-01   # sin(theta_t)
  2  1    -8.63296375E-01   # -sin(theta_t)
  2  2    -5.04697304E-01   # cos(theta_t)
#
BLOCK SBOTMIX  # Sbottom Mixing Matrix
  1  1     9.99197595E-01   # cos(theta_b)
  1  2    -4.00520430E-02   # sin(theta_b)
  2  1     4.00520430E-02   # -sin(theta_b)
  2  2     9.99197595E-01   # cos(theta_b)
#
BLOCK STAUMIX  # Stau Mixing Matrix
  1  1    -3.37573620E-02   # cos(theta_tau)
  1  2     9.99430058E-01   # sin(theta_tau)
  2  1    -9.99430058E-01   # -sin(theta_tau)
  2  2    -3.37573620E-02   # cos(theta_tau)
#
BLOCK ALPHA  # Higgs mixing
          -1.05472337E-01   # Mixing angle in the neutral Higgs boson sector
#
BLOCK HMIX Q=  5.00076319E+03  # DRbar Higgs Parameters
         1    -2.87942751E+02   # mu(Q)MSSM           
         2     9.47060655E+00   # tan                 
         3     2.41720119E+02   # higgs               
         4     8.75058546E+06   # mA^2(Q)MSSM         
#
BLOCK GAUGE Q=  5.00076319E+03  # The gauge couplings
     1     3.71079831E-01   # gprime(Q) DRbar
     2     6.33927794E-01   # g(Q) DRbar
     3     1.00271357E+00   # g3(Q) DRbar
#
BLOCK AU Q=  5.00076319E+03  # The trilinear couplings
  1  1     5.00000001E+03   # A_u(Q) DRbar
  2  2     5.00000001E+03   # A_c(Q) DRbar
  3  3     5.00000001E+03   # A_t(Q) DRbar
#
BLOCK AD Q=  5.00076319E+03  # The trilinear couplings
  1  1     5.00000000E+03   # A_d(Q) DRbar
  2  2     5.00000000E+03   # A_s(Q) DRbar
  3  3     5.00000001E+03   # A_b(Q) DRbar
#
BLOCK AE Q=  5.00076319E+03  # The trilinear couplings
  1  1     0.00000000E+00   # A_e(Q) DRbar
  2  2     9.55306451E-08   # A_mu(Q) DRbar
  3  3     9.48561088E-08   # A_tau(Q) DRbar
#
BLOCK Yu Q=  5.00076319E+03  # The Yukawa couplings
  1  1     0.00000000E+00   # y_u(Q) DRbar
  2  2     0.00000000E+00   # y_c(Q) DRbar
  3  3     8.18266756E-01   # y_t(Q) DRbar
#
BLOCK Yd Q=  5.00076319E+03  # The Yukawa couplings
  1  1     0.00000000E+00   # y_d(Q) DRbar
  2  2     0.00000000E+00   # y_s(Q) DRbar
  3  3     1.29496770E-01   # y_b(Q) DRbar
#
BLOCK Ye Q=  5.00076319E+03  # The Yukawa couplings
  1  1     0.00000000E+00   # y_e(Q) DRbar
  2  2     0.00000000E+00   # y_mu(Q) DRbar
  3  3     9.72848453E-02   # y_tau(Q) DRbar
#
BLOCK MSOFT Q=  5.00076319E+03  # The soft SUSY breaking masses at the scale Q
         1     6.00000000E+01   # M_1(Q)              
         2     3.00000000E+03   # M_2(Q)              
         3     1.21156000E+03   # M_3(Q)              
        21     8.64825415E+06   # mH1^2(Q)            
        22     4.93737057E+05   # mH2^2(Q)            
        31     5.00000000E+03   # meL(Q)              
        32     5.00000000E+03   # mmuL(Q)             
        33     5.00000000E+03   # mtauL(Q)            
        34     5.00000000E+03   # meR(Q)              
        35     5.00000000E+03   # mmuR(Q)             
        36     5.00000000E+03   # mtauR(Q)            
        41     5.00000000E+03   # mqL1(Q)             
        42     5.00000000E+03   # mqL2(Q)             
        43     5.00000000E+03   # mqL3(Q)             
        44     5.00000000E+03   # muR(Q)              
        45     5.00000000E+03   # mcR(Q)              
        46     5.00000000E+03   # mtR(Q)              
        47     5.00000000E+03   # mdR(Q)              
        48     5.00000000E+03   # msR(Q)              
        49     5.00000000E+03   # mbR(Q)              
#
#
#
#                             =================
#                             |The decay table|
#                             =================
#
# - The QCD corrections to the decays gluino -> squark  + quark
#                                     squark -> gaugino + quark_prime
#                                     squark -> squark_prime + Higgs
#                                     squark -> gluino  + quark
#   are included.
#
# - The multi-body decays for the inos, stops and sbottoms are included.
#
# - The loop induced decays for the gluino, neutralinos and stops
#   are included.
#
# - The SUSY decays of the top quark are included.
#
#
#         PDG            Width
DECAY         6     1.40846354E+00   # top decays
#          BR         NDA      ID1       ID2
     1.00000000E+00    2           5        24   # BR(t ->  b    W+)
#
#         PDG            Width
DECAY   1000021     4.42050378E-04   # gluino decays
#          BR         NDA      ID1       ID2
     2.83980951E-06    2     1000022        21   # BR(~g -> ~chi_10 g)
     1.29270309E-02    2     1000023        21   # BR(~g -> ~chi_20 g)
     1.25404641E-02    2     1000025        21   # BR(~g -> ~chi_30 g)
#           BR         NDA      ID1       ID2       ID3
     1.18783818E-02    3     1000022         1        -1   # BR(~g -> ~chi_10 d  db)
     1.20764281E-04    3     1000023         1        -1   # BR(~g -> ~chi_20 d  db)
     8.63059448E-05    3     1000025         1        -1   # BR(~g -> ~chi_30 d  db)
     4.04867828E-02    3     1000022         2        -2   # BR(~g -> ~chi_10 u  ub)
     5.70570553E-04    3     1000023         2        -2   # BR(~g -> ~chi_20 u  ub)
     1.76751920E-04    3     1000025         2        -2   # BR(~g -> ~chi_30 u  ub)
     1.18783818E-02    3     1000022         3        -3   # BR(~g -> ~chi_10 s  sb)
     1.20764281E-04    3     1000023         3        -3   # BR(~g -> ~chi_20 s  sb)
     8.63059448E-05    3     1000025         3        -3   # BR(~g -> ~chi_30 s  sb)
     4.04867828E-02    3     1000022         4        -4   # BR(~g -> ~chi_10 c  cb)
     5.70570553E-04    3     1000023         4        -4   # BR(~g -> ~chi_20 c  cb)
     1.76751920E-04    3     1000025         4        -4   # BR(~g -> ~chi_30 c  cb)
     1.24047695E-02    3     1000022         5        -5   # BR(~g -> ~chi_10 b  bb)
     5.67090359E-03    3     1000023         5        -5   # BR(~g -> ~chi_20 b  bb)
     5.63350326E-03    3     1000025         5        -5   # BR(~g -> ~chi_30 b  bb)
     3.43177080E-02    3     1000022         6        -6   # BR(~g -> ~chi_10 t  tb)
     2.00790300E-01    3     1000023         6        -6   # BR(~g -> ~chi_20 t  tb)
     1.76385000E-01    3     1000025         6        -6   # BR(~g -> ~chi_30 t  tb)
     5.64178439E-05    3     1000024         1        -2   # BR(~g -> ~chi_1+ d  ub)
     5.64178439E-05    3    -1000024         2        -1   # BR(~g -> ~chi_1- u  db)
     5.64178439E-05    3     1000024         3        -4   # BR(~g -> ~chi_1+ s  cb)
     5.64178439E-05    3    -1000024         4        -3   # BR(~g -> ~chi_1- c  sb)
     2.16231347E-01    3     1000024         5        -6   # BR(~g -> ~chi_1+ b  tb)
     2.16231347E-01    3    -1000024         6        -5   # BR(~g -> ~chi_1- t  bb)
#
#         PDG            Width
DECAY   1000006     3.91449410E+02   # stop1 decays
#          BR         NDA      ID1       ID2
     2.14884764E-02    2     1000022         6   # BR(~t_1 -> ~chi_10 t )
     8.64926960E-02    2     1000023         6   # BR(~t_1 -> ~chi_20 t )
     7.94837580E-02    2     1000025         6   # BR(~t_1 -> ~chi_30 t )
     5.23865326E-03    2     1000035         6   # BR(~t_1 -> ~chi_40 t )
     1.22530988E-01    2     1000024         5   # BR(~t_1 -> ~chi_1+ b )
     1.04436599E-02    2     1000037         5   # BR(~t_1 -> ~chi_2+ b )
     6.74321768E-01    2     1000021         6   # BR(~t_1 -> ~g      t )
#
#         PDG            Width
DECAY   2000006     3.92668155E+02   # stop2 decays
#          BR         NDA      ID1       ID2
     9.51930902E-03    2     1000022         6   # BR(~t_2 -> ~chi_10 t )
     8.26531619E-02    2     1000023         6   # BR(~t_2 -> ~chi_20 t )
     9.06154684E-02    2     1000025         6   # BR(~t_2 -> ~chi_30 t )
     1.42058852E-02    2     1000035         6   # BR(~t_2 -> ~chi_40 t )
     5.02098767E-02    2     1000024         5   # BR(~t_2 -> ~chi_1+ b )
     2.82899125E-02    2     1000037         5   # BR(~t_2 -> ~chi_2+ b )
     7.21372453E-01    2     1000021         6   # BR(~t_2 -> ~g      t )
     7.22054420E-04    2     1000006        25   # BR(~t_2 -> ~t_1    h )
     2.41187888E-03    2     1000006        23   # BR(~t_2 -> ~t_1    Z )
#
#         PDG            Width
DECAY   1000005     3.68910666E+02   # sbottom1 decays
#          BR         NDA      ID1       ID2
     2.17434422E-03    2     1000022         5   # BR(~b_1 -> ~chi_10 b )
     2.17684484E-03    2     1000023         5   # BR(~b_1 -> ~chi_20 b )
     2.23276612E-03    2     1000025         5   # BR(~b_1 -> ~chi_30 b )
     2.05470419E-02    2     1000035         5   # BR(~b_1 -> ~chi_40 b )
     1.80744022E-01    2    -1000024         6   # BR(~b_1 -> ~chi_1- t )
     4.12486298E-02    2    -1000037         6   # BR(~b_1 -> ~chi_2- t )
     7.49356702E-01    2     1000021         5   # BR(~b_1 -> ~g      b )
     1.51964880E-03    2     1000006       -24   # BR(~b_1 -> ~t_1    W-)
#
#         PDG            Width
DECAY   2000005     2.85276443E+02   # sbottom2 decays
#          BR         NDA      ID1       ID2
     1.02010534E-02    2     1000022         5   # BR(~b_2 -> ~chi_10 b )
     3.08177347E-03    2     1000023         5   # BR(~b_2 -> ~chi_20 b )
     3.07002124E-03    2     1000025         5   # BR(~b_2 -> ~chi_30 b )
     3.98050511E-05    2     1000035         5   # BR(~b_2 -> ~chi_40 b )
     6.25595396E-03    2    -1000024         6   # BR(~b_2 -> ~chi_1- t )
     7.99231034E-05    2    -1000037         6   # BR(~b_2 -> ~chi_2- t )
     9.77258718E-01    2     1000021         5   # BR(~b_2 -> ~g      b )
     1.27515162E-05    2     1000006       -24   # BR(~b_2 -> ~t_1    W-)
#
#         PDG            Width
DECAY   1000002     3.04559439E+02   # sup_L decays
#          BR         NDA      ID1       ID2
     2.40228282E-03    2     1000022         2   # BR(~u_L -> ~chi_10 u)
     1.04645073E-04    2     1000023         2   # BR(~u_L -> ~chi_20 u)
     2.31680464E-08    2     1000025         2   # BR(~u_L -> ~chi_30 u)
     2.58178127E-02    2     1000035         2   # BR(~u_L -> ~chi_40 u)
     1.63690272E-04    2     1000024         1   # BR(~u_L -> ~chi_1+ d)
     5.16041125E-02    2     1000037         1   # BR(~u_L -> ~chi_2+ d)
     9.19907433E-01    2     1000021         2   # BR(~u_L -> ~g      u)
#
#         PDG            Width
DECAY   2000002     2.90735227E+02   # sup_R decays
#          BR         NDA      ID1       ID2
     4.00973760E-02    2     1000022         2   # BR(~u_R -> ~chi_10 u)
     5.51979736E-04    2     1000023         2   # BR(~u_R -> ~chi_20 u)
     3.71548146E-04    2     1000025         2   # BR(~u_R -> ~chi_30 u)
     2.57552046E-09    2     1000035         2   # BR(~u_R -> ~chi_40 u)
     9.58979094E-01    2     1000021         2   # BR(~u_R -> ~g      u)
#
#         PDG            Width
DECAY   1000001     3.04570017E+02   # sdown_L decays
#          BR         NDA      ID1       ID2
     2.39943692E-03    2     1000022         1   # BR(~d_L -> ~chi_10 d)
     1.60875773E-06    2     1000023         1   # BR(~d_L -> ~chi_20 d)
     8.61450123E-05    2     1000025         1   # BR(~d_L -> ~chi_30 d)
     2.58329939E-02    2     1000035         1   # BR(~d_L -> ~chi_40 d)
     1.71058434E-08    2    -1000024         2   # BR(~d_L -> ~chi_1- u)
     5.16844120E-02    2    -1000037         2   # BR(~d_L -> ~chi_2- u)
     9.19995386E-01    2     1000021         1   # BR(~d_L -> ~g      d)
#
#         PDG            Width
DECAY   2000001     2.81814316E+02   # sdown_R decays
#          BR         NDA      ID1       ID2
     1.03423019E-02    2     1000022         1   # BR(~d_R -> ~chi_10 d)
     1.42372049E-04    2     1000023         1   # BR(~d_R -> ~chi_20 d)
     9.58333572E-05    2     1000025         1   # BR(~d_R -> ~chi_30 d)
     6.64397610E-10    2     1000035         1   # BR(~d_R -> ~chi_40 d)
     9.89419492E-01    2     1000021         1   # BR(~d_R -> ~g      d)
#
#         PDG            Width
DECAY   1000004     3.04559439E+02   # scharm_L decays
#          BR         NDA      ID1       ID2
     2.40228282E-03    2     1000022         4   # BR(~c_L -> ~chi_10 c)
     1.04645073E-04    2     1000023         4   # BR(~c_L -> ~chi_20 c)
     2.31680464E-08    2     1000025         4   # BR(~c_L -> ~chi_30 c)
     2.58178127E-02    2     1000035         4   # BR(~c_L -> ~chi_40 c)
     1.63690272E-04    2     1000024         3   # BR(~c_L -> ~chi_1+ s)
     5.16041125E-02    2     1000037         3   # BR(~c_L -> ~chi_2+ s)
     9.19907433E-01    2     1000021         4   # BR(~c_L -> ~g      c)
#
#         PDG            Width
DECAY   2000004     2.90735227E+02   # scharm_R decays
#          BR         NDA      ID1       ID2
     4.00973760E-02    2     1000022         4   # BR(~c_R -> ~chi_10 c)
     5.51979736E-04    2     1000023         4   # BR(~c_R -> ~chi_20 c)
     3.71548146E-04    2     1000025         4   # BR(~c_R -> ~chi_30 c)
     2.57552046E-09    2     1000035         4   # BR(~c_R -> ~chi_40 c)
     9.58979094E-01    2     1000021         4   # BR(~c_R -> ~g      c)
#
#         PDG            Width
DECAY   1000003     3.04570017E+02   # sstrange_L decays
#          BR         NDA      ID1       ID2
     2.39943692E-03    2     1000022         3   # BR(~s_L -> ~chi_10 s)
     1.60875773E-06    2     1000023         3   # BR(~s_L -> ~chi_20 s)
     8.61450123E-05    2     1000025         3   # BR(~s_L -> ~chi_30 s)
     2.58329939E-02    2     1000035         3   # BR(~s_L -> ~chi_40 s)
     1.71058434E-08    2    -1000024         4   # BR(~s_L -> ~chi_1- c)
     5.16844120E-02    2    -1000037         4   # BR(~s_L -> ~chi_2- c)
     9.19995386E-01    2     1000021         3   # BR(~s_L -> ~g      s)
#
#         PDG            Width
DECAY   2000003     2.81814316E+02   # sstrange_R decays
#          BR         NDA      ID1       ID2
     1.03423019E-02    2     1000022         3   # BR(~s_R -> ~chi_10 s)
     1.42372049E-04    2     1000023         3   # BR(~s_R -> ~chi_20 s)
     9.58333572E-05    2     1000025         3   # BR(~s_R -> ~chi_30 s)
     6.64397610E-10    2     1000035         3   # BR(~s_R -> ~chi_40 s)
     9.89419492E-01    2     1000021         3   # BR(~s_R -> ~g      s)
#
#         PDG            Width
DECAY   1000011     3.03831821E+01   # selectron_L decays
#          BR         NDA      ID1       ID2
     2.21128125E-01    2     1000022        11   # BR(~e_L -> ~chi_10 e-)
     4.82807972E-03    2     1000023        11   # BR(~e_L -> ~chi_20 e-)
     9.39694291E-04    2     1000025        11   # BR(~e_L -> ~chi_30 e-)
     2.57534227E-01    2     1000035        11   # BR(~e_L -> ~chi_40 e-)
     1.74933112E-07    2    -1000024        12   # BR(~e_L -> ~chi_1- nu_e)
     5.15569699E-01    2    -1000037        12   # BR(~e_L -> ~chi_2- nu_e)
#
#         PDG            Width
DECAY   2000011     2.74150287E+01   # selectron_R decays
#          BR         NDA      ID1       ID2
     9.77496593E-01    2     1000022        11   # BR(~e_R -> ~chi_10 e-)
     1.34499561E-02    2     1000023        11   # BR(~e_R -> ~chi_20 e-)
     9.05338932E-03    2     1000025        11   # BR(~e_R -> ~chi_30 e-)
     6.13390791E-08    2     1000035        11   # BR(~e_R -> ~chi_40 e-)
#
#         PDG            Width
DECAY   1000013     3.03831821E+01   # smuon_L decays
#          BR         NDA      ID1       ID2
     2.21128125E-01    2     1000022        13   # BR(~mu_L -> ~chi_10 mu-)
     4.82807972E-03    2     1000023        13   # BR(~mu_L -> ~chi_20 mu-)
     9.39694291E-04    2     1000025        13   # BR(~mu_L -> ~chi_30 mu-)
     2.57534227E-01    2     1000035        13   # BR(~mu_L -> ~chi_40 mu-)
     1.74933112E-07    2    -1000024        14   # BR(~mu_L -> ~chi_1- nu_mu)
     5.15569699E-01    2    -1000037        14   # BR(~mu_L -> ~chi_2- nu_mu)
#
#         PDG            Width
DECAY   2000013     2.74150287E+01   # smuon_R decays
#          BR         NDA      ID1       ID2
     9.77496593E-01    2     1000022        13   # BR(~mu_R -> ~chi_10 mu-)
     1.34499561E-02    2     1000023        13   # BR(~mu_R -> ~chi_20 mu-)
     9.05338932E-03    2     1000025        13   # BR(~mu_R -> ~chi_30 mu-)
     6.13390791E-08    2     1000035        13   # BR(~mu_R -> ~chi_40 mu-)
#
#         PDG            Width
DECAY   1000015     2.92820476E+01   # stau_1 decays
#          BR         NDA      ID1       ID2
     9.15770499E-01    2     1000022        15   # BR(~tau_1 -> ~chi_10  tau-)
     2.78213919E-02    2     1000023        15   # BR(~tau_1 -> ~chi_20  tau-)
     2.35905980E-02    2     1000025        15   # BR(~tau_1 -> ~chi_30  tau-)
     3.02628667E-04    2     1000035        15   # BR(~tau_1 -> ~chi_40  tau-)
     3.19091787E-02    2    -1000024        16   # BR(~tau_1 -> ~chi_1-  nu_tau)
     6.05703475E-04    2    -1000037        16   # BR(~tau_1 -> ~chi_2-  nu_tau)
#
#         PDG            Width
DECAY   2000015     3.13101724E+01   # stau_2 decays
#          BR         NDA      ID1       ID2
     2.15156334E-01    2     1000022        15   # BR(~tau_2 -> ~chi_10  tau-)
     1.96440668E-02    2     1000023        15   # BR(~tau_2 -> ~chi_20  tau-)
     1.60669151E-02    2     1000025        15   # BR(~tau_2 -> ~chi_30  tau-)
     2.49535865E-01    2     1000035        15   # BR(~tau_2 -> ~chi_40  tau-)
     3.91283132E-05    2    -1000024        16   # BR(~tau_2 -> ~chi_1-  nu_tau)
     4.99557691E-01    2    -1000037        16   # BR(~tau_2 -> ~chi_2-  nu_tau)
#
#         PDG            Width
DECAY   1000012     3.03863114E+01   # snu_eL decays
#          BR         NDA      ID1       ID2
     2.20971645E-01    2     1000022        12   # BR(~nu_eL -> ~chi_10 nu_e)
     1.66629740E-03    2     1000023        12   # BR(~nu_eL -> ~chi_20 nu_e)
     3.58079321E-03    2     1000025        12   # BR(~nu_eL -> ~chi_30 nu_e)
     2.57581319E-01    2     1000035        12   # BR(~nu_eL -> ~chi_40 nu_e)
     1.67358863E-03    2     1000024        11   # BR(~nu_eL -> ~chi_1+ e-)
     5.14526357E-01    2     1000037        11   # BR(~nu_eL -> ~chi_2+ e-)
#
#         PDG            Width
DECAY   1000014     3.03863114E+01   # snu_muL decays
#          BR         NDA      ID1       ID2
     2.20971645E-01    2     1000022        14   # BR(~nu_muL -> ~chi_10 nu_mu)
     1.66629740E-03    2     1000023        14   # BR(~nu_muL -> ~chi_20 nu_mu)
     3.58079321E-03    2     1000025        14   # BR(~nu_muL -> ~chi_30 nu_mu)
     2.57581319E-01    2     1000035        14   # BR(~nu_muL -> ~chi_40 nu_mu)
     1.67358863E-03    2     1000024        13   # BR(~nu_muL -> ~chi_1+ mu-)
     5.14526357E-01    2     1000037        13   # BR(~nu_muL -> ~chi_2+ mu-)
#
#         PDG            Width
DECAY   1000016     3.13147554E+01   # snu_tauL decays
#          BR         NDA      ID1       ID2
     2.14396426E-01    2     1000022        16   # BR(~nu_tauL -> ~chi_10 nu_tau)
     1.61671266E-03    2     1000023        16   # BR(~nu_tauL -> ~chi_20 nu_tau)
     3.47423791E-03    2     1000025        16   # BR(~nu_tauL -> ~chi_30 nu_tau)
     2.49850462E-01    2     1000035        16   # BR(~nu_tauL -> ~chi_40 nu_tau)
     3.15787249E-02    2     1000024        15   # BR(~nu_tauL -> ~chi_1+ tau-)
     4.99083437E-01    2     1000037        15   # BR(~nu_tauL -> ~chi_2+ tau-)
#
#         PDG            Width
DECAY   1000024     1.63118764E-01   # chargino1+ decays
#          BR         NDA      ID1       ID2
     1.00000000E+00    2     1000022        24   # BR(~chi_1+ -> ~chi_10  W+)
#
#         PDG            Width
DECAY   1000037     2.29064541E+01   # chargino2+ decays
#          BR         NDA      ID1       ID2
     2.53656427E-01    2     1000024        23   # BR(~chi_2+ -> ~chi_1+  Z )
     1.47762860E-04    2     1000022        24   # BR(~chi_2+ -> ~chi_10  W+)
     2.45448553E-01    2     1000023        24   # BR(~chi_2+ -> ~chi_20  W+)
     2.44554227E-01    2     1000025        24   # BR(~chi_2+ -> ~chi_30  W+)
     2.56177889E-01    2     1000024        25   # BR(~chi_2+ -> ~chi_1+  h )
     1.51409552E-05    2     1000022        37   # BR(~chi_2+ -> ~chi_10  H+)
#
#         PDG            Width
DECAY   1000022     0.00000000E+00   # neutralino1 decays
#
#         PDG            Width
DECAY   1000023     1.53537540E-01   # neutralino2 decays
#          BR         NDA      ID1       ID2
     4.91498185E-01    2     1000022        23   # BR(~chi_20 -> ~chi_10   Z )
     5.08501815E-01    2     1000022        25   # BR(~chi_20 -> ~chi_10   h )
#
#         PDG            Width
DECAY   1000025     1.38385932E-01   # neutralino3 decays
#          BR         NDA      ID1       ID2
     6.71095249E-01    2     1000022        23   # BR(~chi_30 -> ~chi_10   Z )
     3.28904751E-01    2     1000022        25   # BR(~chi_30 -> ~chi_10   h )
#
#         PDG            Width
DECAY   1000035     2.29079547E+01   # neutralino4 decays
#          BR         NDA      ID1       ID2
     6.90351741E-05    2     1000022        23   # BR(~chi_40 -> ~chi_10   Z )
     1.29010477E-01    2     1000023        23   # BR(~chi_40 -> ~chi_20   Z )
     1.24411471E-01    2     1000025        23   # BR(~chi_40 -> ~chi_30   Z )
     2.45280697E-01    2     1000024       -24   # BR(~chi_40 -> ~chi_1+   W-)
     2.45280697E-01    2    -1000024        24   # BR(~chi_40 -> ~chi_1-   W+)
     6.82776678E-05    2     1000022        25   # BR(~chi_40 -> ~chi_10   h )
     1.46131127E-05    2     1000022        35   # BR(~chi_40 -> ~chi_10   H )
     1.55012160E-06    2     1000022        36   # BR(~chi_40 -> ~chi_10   A )
     1.26577335E-01    2     1000023        25   # BR(~chi_40 -> ~chi_20   h )
     1.29285848E-01    2     1000025        25   # BR(~chi_40 -> ~chi_30   h )
#
#         PDG            Width
DECAY        25     4.05937669E-03   # h decays
#          BR         NDA      ID1       ID2
     6.13179242E-01    2           5        -5   # BR(h -> b       bb     )
     6.38131869E-02    2         -15        15   # BR(h -> tau+    tau-   )
     2.25922652E-04    2         -13        13   # BR(h -> mu+     mu-    )
     4.79072493E-04    2           3        -3   # BR(h -> s       sb     )
     2.07564348E-02    2           4        -4   # BR(h -> c       cb     )
     6.69420155E-02    2          21        21   # BR(h -> g       g      )
     2.29579983E-03    2          22        22   # BR(h -> gam     gam    )
     1.46661017E-03    2          22        23   # BR(h -> Z       gam    )
     2.06340125E-01    2          24       -24   # BR(h -> W+      W-     )
     2.44994809E-02    2          23        23   # BR(h -> Z       Z      )
     2.10946771E-06    2     1000022   1000022   # BR(h -> ~chi_10 ~chi_10)
#
#         PDG            Width
DECAY        35     8.78433142E+00   # H decays
#          BR         NDA      ID1       ID2
     3.61821853E-01    2           5        -5   # BR(H -> b       bb     )
     6.34313363E-02    2         -15        15   # BR(H -> tau+    tau-   )
     2.24298243E-04    2         -13        13   # BR(H -> mu+     mu-    )
     2.74955192E-04    2           3        -3   # BR(H -> s       sb     )
     1.53771731E-06    2           4        -4   # BR(H -> c       cb     )
     1.53630146E-01    2           6        -6   # BR(H -> t       tb     )
     5.11060543E-05    2          21        21   # BR(H -> g       g      )
     1.38154669E-07    2          22        22   # BR(H -> gam     gam    )
     9.05920036E-08    2          23        22   # BR(H -> Z       gam    )
     7.44269642E-05    2          24       -24   # BR(H -> W+      W-     )
     3.71663611E-05    2          23        23   # BR(H -> Z       Z      )
     2.67063600E-04    2          25        25   # BR(H -> h       h      )
     8.78104496E-24    2          36        36   # BR(H -> A       A      )
     8.32585432E-19    2          23        36   # BR(H -> Z       A      )
     3.40555653E-03    2     1000024  -1000024   # BR(H -> ~chi_1+ ~chi_1-)
     1.88084913E-02    2     1000022   1000022   # BR(H -> ~chi_10 ~chi_10)
     3.32860533E-03    2     1000023   1000023   # BR(H -> ~chi_20 ~chi_20)
     5.10452213E-03    2     1000025   1000025   # BR(H -> ~chi_30 ~chi_30)
     2.32011033E-01    2     1000022   1000023   # BR(H -> ~chi_10 ~chi_20)
     1.48019953E-01    2     1000022   1000025   # BR(H -> ~chi_10 ~chi_30)
     9.50772117E-03    2     1000023   1000025   # BR(H -> ~chi_20 ~chi_30)
#
#         PDG            Width
DECAY        36     8.78968184E+00   # A decays
#          BR         NDA      ID1       ID2
     3.61725469E-01    2           5        -5   # BR(A -> b       bb     )
     6.33945820E-02    2         -15        15   # BR(A -> tau+    tau-   )
     2.24167964E-04    2         -13        13   # BR(A -> mu+     mu-    )
     2.74996370E-04    2           3        -3   # BR(A -> s       sb     )
     1.54287362E-06    2           4        -4   # BR(A -> c       cb     )
     1.54060246E-01    2           6        -6   # BR(A -> t       tb     )
     1.52467129E-04    2          21        21   # BR(A -> g       g      )
     5.63466164E-07    2          22        22   # BR(A -> gam     gam    )
     1.84446798E-07    2          23        22   # BR(A -> Z       gam    )
     7.41010415E-05    2          23        25   # BR(A -> Z       h      )
     3.56073251E-03    2     1000024  -1000024   # BR(A -> ~chi_1+ ~chi_1-)
     1.80608779E-02    2     1000022   1000022   # BR(A -> ~chi_10 ~chi_10)
     2.25807180E-03    2     1000023   1000023   # BR(A -> ~chi_20 ~chi_20)
     8.17430924E-03    2     1000025   1000025   # BR(A -> ~chi_30 ~chi_30)
     1.51147516E-01    2     1000022   1000023   # BR(A -> ~chi_10 ~chi_20)
     2.28555238E-01    2     1000022   1000025   # BR(A -> ~chi_10 ~chi_30)
     8.33493544E-03    2     1000023   1000025   # BR(A -> ~chi_20 ~chi_30)
#
#         PDG            Width
DECAY        37     8.72199719E+00   # H+ decays
#          BR         NDA      ID1       ID2
     5.78812762E-04    2           4        -5   # BR(H+ -> c       bb     )
     6.39178331E-02    2         -15        16   # BR(H+ -> tau+    nu_tau )
     2.26018219E-04    2         -13        14   # BR(H+ -> mu+     nu_mu  )
     3.70438213E-06    2           2        -5   # BR(H+ -> u       bb     )
     1.32619370E-05    2           2        -3   # BR(H+ -> u       sb     )
     2.74257193E-04    2           4        -3   # BR(H+ -> c       sb     )
     5.13809791E-01    2           6        -5   # BR(H+ -> t       bb     )
     7.48340963E-05    2          24        25   # BR(H+ -> W+      h      )
     1.03256043E-12    2          24        36   # BR(H+ -> W+      A      )
     4.10276590E-01    2     1000024   1000022   # BR(H+ -> ~chi_1+ ~chi_10)
     9.11873294E-03    2     1000024   1000023   # BR(H+ -> ~chi_1+ ~chi_20)
     1.70616426E-03    2     1000024   1000025   # BR(H+ -> ~chi_1+ ~chi_30)
